##TITLE=Analysis number 311344
Compound Code pd 00828
Project Code adrs
Chemist Name fudan
##JCAMPDX= 6.0         $$ Bruker NMR JCAMP-DX V2.0
##DATA TYPE= NMR SPECTRUM
##DATA CLASS= NTUPLES
##ORIGIN= Bruker BioSpin GmbH
##OWNER= NMR
$$ XWIN-NMR		Version 3.5
$$ Wed Jul  6 13:10:30 2005 GMT Daylight Time (UT+1h)  MAYBRIDGE\NMR@NMR_250MHZ
##.OBSERVE FREQUENCY= 250.131544655141
##.OBSERVE NUCLEUS= ^1H
##.ACQUISITION MODE= SIMULTANEOUS (DQD)
##.ACQUISITION SCHEME= undefined
##.AVERAGES= 16
##.DIGITISER RES= 18
##SPECTROMETER/DATA SYSTEM= dpx250
##.PULSE SEQUENCE= zg30
##.SOLVENT NAME= CDCl3
##.SHIFT REFERENCE= (INTERNAL, CDCl3, 0, 16.522)
##AUDIT TRAIL= $$ (NUMBER, WHEN, WHO, WHERE, WHAT)
$$ ##TITLE= Audit trail, XWIN-NMR		Version 3.5
$$ ##JCAMPDX= 5.01
$$ ##ORIGIN= Bruker BioSpin GmbH
$$ ##OWNER= NMR
$$ C:\u/data/dgb/nmr/ADRS/5370/pdata/1/auditp.txt
$$ ##AUDIT TRAIL=  $$ (NUMBER, WHEN, WHO, WHERE, WHAT)
(   1,<2005-07-06 13:10:10.46 +100>,<MAYBRIDGE\NMR>,<NMR_250MHZ>,
      <created by zg, POWCHK disabled, PULCHK disabled
       configuration hash MD5:
       62 19 C7 07 E1 42 D1 B7 37 6C 3D D0 77 39 F9 E6
       data hash MD5: 64K
       9D E4 FE 73 EB F0 1C FE CB B5 7B 18 C5 8F 85 98>)
(   2,<2005-07-06 13:10:21.54 +100>,<MAYBRIDGE\NMR>,<NMR_250MHZ>,
      <Start of raw data processing
       ef LB = 0.3 FT_mod = 6 PKNL = 1 SI = 32K 
       data hash MD5: 32K
       F1 6D F7 A0 30 41 AC 25 CF 36 EA CA B4 A5 F2 28>)
(   3,<2005-07-06 13:10:23.22 +100>,<MAYBRIDGE\NMR>,<NMR_250MHZ>,
      <apk 
       data hash MD5: 32K
       A8 41 B7 B4 C2 00 9B 5D E8 F7 59 98 4F C2 B8 55>)
(   4,<2005-07-06 13:10:24.00 +100>,<MAYBRIDGE\NMR>,<NMR_250MHZ>,
      <abs ABSG = 5 
       data hash MD5: 32K
       9C 27 B3 FD 7C 8F 88 4E 5F 20 EE DC D9 CA A6 0F>)
$$ ##END=
$$ 
$$ hash MD5
$$ 7B D4 FA AF 1F 88 8C B0 11 2A 06 4A B8 DB 84 BB
##$RELAX= 
##$RELAX= 
##$RELAX= 
##$RELAX= 
##$RELAX= 
##$RELAX= 
##$RELAX= 
$$ Bruker specific parameters
$$ --------------------------
##$DU= <C:\u>
##$EXPNO= 5370
##$NAME= <ADRS>
##$PROCNO= 1
##$TYPE= <nmr>
##$USER= <dgb>
##$AMP= (0..31)
100 100 100 100 100 100 100 100 100 100 100 100 100 100 100 100 100 100 
100 100 100 100 100 100 100 100 100 100 100 100 100 100 
##$AQSEQ= 0
##$AQ_mod= 3
##$AUNM= <au_zg>
##$AUTOPOS= <36 >
##$BF1= 250.13
##$BF2= 250.13
##$BF3= 250.13
##$BF4= 250.13
##$BF5= 500.13
##$BF6= 500.13
##$BF7= 500.13
##$BF8= 500.13
##$BYTORDA= 1
##$CFDGTYP= 0
##$CFRGTYP= 5
##$CHEMSTR= <none>
##$CNST= (0..31)
1 1 145 1 1 1 1 1 1 1 1 1 1 1 1 1 1 1 1 1 1 1 1 1 1 1 1 1 1 1 1 1 
##$CPDPRG= <>
##$CPDPRG1= <>
##$CPDPRG2= <>
##$CPDPRG3= <>
##$CPDPRG4= <mlev>
##$CPDPRG5= <mlev>
##$CPDPRG6= <mlev>
##$CPDPRG7= <mlev>
##$CPDPRG8= <mlev>
##$CPDPRGB= <>
##$CPDPRGT= <>
##$D= (0..31)
0 1 0 0 0 0 0 0 0 0.06 0 0 0 0 0 0 0.0002 0 0 0 0 0 0 0 0 0 0 0 0 0 0 
0 
##$DATE= 1120651809
##$DBL= (0..7)
120 120 120 120 120 120 120 120 
##$DBP= (0..7)
150 150 150 150 150 150 150 150 
##$DBP07= 0
##$DBPNAM0= <>
##$DBPNAM1= <>
##$DBPNAM2= <>
$$ [...]
##$SUBNAM7= <"">
##$SUBNAM8= <"">
##$SUBNAM9= <"">
##$SW= 20.6930455092707
##$SWIBOX= (0..15)
0 0 3 0 0 0 0 0 0 0 0 0 0 0 0 0 
##$SW_h= 5175.983436853
##$TD= 65536
##$TD0= 1
##$TE= 295.16
##$TE2= 300
##$TE3= 300
##$TEG= 300
##$TL= (0..7)
0 120 120 120 120 120 120 120 
##$TP= (0..7)
150 150 150 150 150 150 150 150 
##$TP07= 0
##$TPNAME0= <>
##$TPNAME1= <>
##$TPNAME2= <>
##$TPNAME3= <>
##$TPNAME4= <>
##$TPNAME5= <>
##$TPNAME6= <>
##$TPNAME7= <>
##$TPOAL= (0..7)
0.5 0.5 0.5 0.5 0.5 0.5 0.5 0.5 
##$TPOFFS= (0..7)
0 0 0 0 0 0 0 0 
##$TUNHIN= 0
##$TUNHOUT= 0
##$TUNXOUT= 0
##$USERA1= <user>
##$USERA2= <user>
##$USERA3= <user>
##$USERA4= <user>
##$USERA5= <user>
##$V9= 5
##$VALIST= <valist>
##$VCLIST= <CCCCCCCCCCCCCCC>
##$VD= 0
##$VDLIST= <DDDDDDDDDDDDDDD>
##$VPLIST= <PPPPPPPPPPPPPPP>
##$VTLIST= <TTTTTTTTTTTTTTT>
##$WBST= 1024
##$WBSW= 4
##$XGAIN= (0..3)
0 0 0 0 
##$XL= 0
##$YL= 0
##$YMAX_a= 357317
##$YMIN_a= -334715
##$ZGOPTNS= <>
##$ZL1= 120
##$ZL2= 120
##$ZL3= 120
##$ZL4= 120
##$ABSF1= 16.522
##$ABSF2= -4.171173
##$ABSG= 5
##$ABSL= 3
##$ALPHA= 0
##$AQORDER= 0
##$ASSFAC= 0
##$ASSFACI= 0
##$ASSFACX= 0
##$ASSWID= 0
##$AUNMP= <proc_1d>
##$AZFE= 0.1
##$AZFW= 0.1
##$BCFW= 0
##$BC_mod= 0
##$BYTORDP= 0
##$COROFFS= 0
##$CY= 12.5
##$DATMOD= 1
##$DC= 0
##$DFILT= <>
##$DTYPP= 0
##$F1P= 14.0000005364418
##$F2P= -0.99999901652339
##$FCOR= 0.5
##$FTSIZE= 32768
##$FT_mod= 6
##$GAMMA= 0
##$GB= 0
##$INTBC= 1
##$INTSCL= 1
##$ISEN= 128
##$LB= 0.3
##$LEV0= 0
##$LPBIN= 0
##$MAXI= 10000
##$MC2= 0
##$MEAN= 0
##$ME_mod= 0
##$MI= 0
##$NCOEF= 0
##$NC_proc= -5
##$NLEV= 6
##$NOISF1= 0
##$NOISF2= 0
##$NSP= 0
##$NTH_PI= 0
##$NZP= 0
##$OFFSET= 16.522
##$PC= 1
##$PHC0= -76.3736
##$PHC1= 8.077158
##$PH_mod= 1
##$PKNL= yes
##$PPARMOD= 0
##$PSCAL= 4
##$PSIGN= 0
##$REVERSE= no
##$SF= 250.13
##$SI= 32768
##$SIGF1= 0
##$SIGF2= 0
##$SINO= 400
##$SIOLD= 32768
##$SREGLST= <1H.CDCl3>
##$SSB= 0
##$STSI= 32768
##$STSR= 0
##$SW_p= 5175.98343685301
##$SYMM= 0
##$S_DEV= 0
##$TDeff= 65536
##$TDoff= 0
##$TI= <Analysis number 999999
Compound Code 99
Book Reference 9
Project Code 9>
##$TILT= no
##$TM1= 0
##$TM2= 0
##$TOPLEV= 0
##$USERP1= <user>
##$USERP2= <user>
##$USERP3= <user>
##$USERP4= <user>
##$USERP5= <user>
##$WDW= 1
##$XDIM= 32768
##$YMAX_p= 421647412
##$YMIN_p= -611613
$$ End of Bruker specific parameters
$$ ---------------------------------
##NTUPLES= NMR SPECTRUM
##VAR_NAME=  FREQUENCY,     SPECTRUM/REAL,   SPECTRUM/IMAG
##SYMBOL=    X,             R,               I
##VAR_TYPE=  INDEPENDENT,   DEPENDENT,       DEPENDENT
##VAR_FORM=  AFFN,          ASDF,            ASDF
##VAR_DIM=   32768,         32768,           32768
##UNITS=     HZ,            ARBITRARY UNITS, ARBITRARY UNITS
##FACTOR=    0.157963299565203, 1,           1
##FIRST=     4132.6476996994, 0,             0
##LAST=      -1043.33573715361, 0,           0
##MIN=       -1043.33573715361, -611613,     0
##MAX=       4132.6476996994, 421647412,     0
$$ Real data points
##PAGE= N=1
##DATA TABLE= (X++(R..R)), XYDATA
$$ [...]
22522 37030 53360 102325 105644 92918 44556 32737 23964 58274 245717 153445 -30328 -76555
22510 -76555 -61746 -109731 -90954 -8219 33763 45182 52558 -2973 28928 33508 -7068 29755
22498 29755 97292 -1118 -66799 -9018 -34896 -60272 3055 -64602 -100317 -21085 -19363 -55113
22486 -55113 -64149 -46820 -126431 -156818 -128872 -93798 30049 18044 -116044 -263764 -392671
22475 -392671 -276412 -92999 -175435 -181868 -154190 -7042 122707 187865 214797 55226 -96061
22464 -96061 -168672 -70212 174903 222384 99427 -9238 90583 126987 65 -44570 49574
22453 49574 84183 141154 178530 176986 40373 -57271 -227122 -102245 -31113 47873 110052
22442 110052 88357 84137 37985 5064 -90468 -111351 -143618 -22436 4395 56500 174257
22431 174257 222559 126612 -17334 -116478 -42837 -53812 -30297 24057 170352 150356 11877
22420 11877 -92984 -50535 -159789 -178483 -92733 -65063 -7988 100042 26974 -30785 -119488
22409 -119488 -253188 -127537 38406 116911 85679 129019 -12181 -133540 23434 -17452
22399 -17452 -1336 -33320 -169703 -206125 -138840 -188972 -255960 -76888 -52257 -117187 -89449
22388 -89449 43266 92502 52326 -108482 -73907 -37667 -196152 -200049 -81791 75199 79823
22377 79823 204251 187091 151225 96254 109395 134623 174489 186149 162721 101493 98146 91087
22365 91087 4706 -121524 -31180 110674 224634 166663 112431 84386 85421 58548 89545
22354 89545 216556 219236 51821 -28784 -66571 101235 155305 100936 30334 -9591 119861
22343 119861 112540 8744 53631 -110047 -138087 -46422 -68830 -22212 68120 1039 116099
22332 116099 94010 148687 39891 -155398 -185022 -170827 -119312 -30387 -42566 74672 186610
22321 186610 147160 244425 247378 185060 119991 179393 208367 155654 167992 39388 -8561
22310 -8561 33923 5146 -301381 -262734 -82917 2216 33532 -49687 -224605 -192606 -163090
22299 -163090 -8589 52231 50606 47809 -24275 -88460 -80925 -220764 -246494 -297293 -208428 -174574
22287 -174574 -224659 -209025 -166633 18144 146094 119843 98002 -71078 -113514 -181398 -76539
22276 -76539 91117 76820 135079 174037 281181 272899 156903 29341 -178320 -193329 -75100
22265 -75100 6690 131473 52233 -141434 -306194 -202075 -61150 -58193 -119841 -145999 -171390
22254 -171390 -206198 -153517 -187934 -111324 -63037 -92189 -41596 12945 -49615 -98769 -143608
22243 -143608 -73644 -1634 91633 213100 183231 107343 83851 117217 116874 207226 211433 71994
22231 71994 -68492 -43572 -69105 -103237 -84951 74409 78239 82286 68529 -30331 -39438 101711
22219 101711 37521 -11225 -90860 -63312 33594 -20364 -1228 15366 -134476 -170358 -119723
22208 -119723 -15506 -1446 -3088 35357 12313 -18312 113376 83368 -25604 47080 9899
22197 9899 -92498 -41945 57595 51535 -43000 -29104 -76470 -183019 -112954 20410 43490
22186 43490 65669 11051 -27027 -45573 -29204 -11298 1642 96960 145343 75379 32253 15992
22174 15992 59680 16657 -39424 -76838 -49110 -168656 -170518 -60617 -104492 -115572 -134362
22163 -134362 -130523 -102847 -82386 -133129 -237667 -193549 -172405 -86660 -958 47540 56605 22597
22151 22597 -77049 -95044 -191079 -131483 -129971 -237069 -217490 -123449 -31553 -20937 -10650 -10592
22139 -10592 -7296 -135183 -216576 -167493 -98025 -82438 34753 109255 -5444 114246 80648
22128 80648 -83515 -106506 -206603 -166869 -72747 19838 30186 36734 123374 109707 35912
22117 35912 6807 -56136 29893 203016 225230 250295 278534 306702 132707 43448 102112
22106 102112 272750 219285 58033 -12593 35357 30248 16647 -16896 24577 -157374 -204661
22095 -204661 -231666 -151805 -68855 -54674 -70527 -23236 -84357 -129811 -122553 -130714 -51366 48489
22083 48489 -11781 2929 61938 15308 -79287 5817 -61951 -73176 -182340 -254482 -167226
22072 -167226 -121522 -164022 -152789 -204290 -150163 -177735 -242477 -265517 -130216 -10921 72439
22061 72439 14503 11405 113222 114991 38424 24473 25938 -21845 -27484 -75243 -39544 -46588
22049 -46588 -58665 -31635 -58363 52016 -18983 -102667 -114326 -17054 4749 80012 105316
22038 105316 66048 -6324 96608 212255 250665 124433 -4329 18857 -39937 -52452 -163105
22027 -163105 -88069 -10319 80821 -52518 -62544 -57997 -27582 -7449 -44466 -97555 -142074
22016 -142074 -198724 -122247 -88841 13178 115767 91572 -2789 -10721 -5583 51358 88905
22005 88905 34650 -28989 -114938 -97408 -25046 53574 -25040 -183466 -278377 -262184 -186099
21994 -186099 -293924 -249459 -222102 -148120 -51758 -209285 -199370 -95846 -49742 41389 160797
21983 160797 68598 -109710 -184866 -203796 -205433 -123795 -102195 -125481 -250967 -284942 -175270
21972 -175270 -101948 -101941 -212081 -314079 -277354 -173406 -73246 -108757 -90647 1344 -9314
21961 -9314 -29243 2135 75524 110908 -15103 -30735 92499 98567 42373 1574 32508 -5674
21949 -5674 66511 184968 262432 271453 172463 117301 153983 140528 86446 10404 -18769 51553
21937 51553 66511 37142 -50933 -59654 8734 102408 129934 168784 165647 47558 47012 76294
21925 76294 3259 -133995 -77320 -6590 10508 46742 67381 19727 22127 -49600 -210896
21914 -210896 -150503 -187071 -104582 -116690 -239918 -299582 -324630 -226306 -232337 -128578 -35751
21903 -35751 105067 103025 -28138 -93553 43232 75782 -58127 -135054 -167812 -254720 -178136
21892 -178136 -125878 -225194 -173163 -106674 -135096 -168536 -124082 -142771 -113090 -100147 -180621
21881 -180621 -94528 -66214 6722 -85620 -39674 530 -29703 -45177 -104919 -188172 -238050
21870 -238050 -190523 -164779 -168768 -174875 -110010 654 -126344 -145830 -12143 113051 131279
21859 131279 69349 88254 53872 -8617 -16500 -39742 81123 163302 276899 307389 257135
21848 257135 225908 91076 11237 -17838 -86768 -66208 -105152 -82957 -10471 45821 -82983
21837 -82983 -125800 -89227 -38905 -133358 -226440 -177334 -253352 -398810 -357741 -215144 -155207
21826 -155207 -167218 -157280 -132579 -106064 -154881 -265724 -117764 110665 173731 -807 -89546
21815 -89546 -11904 170761 266928 261472 281834 133157 59159 68270 86931 -59577 -51667 -89232
21803 -89232 -30892 -12746 699 -46579 -32923 -56851 -18570 -8370 -52472 -40658 -32278 -76307
21791 -76307 -73852 -61114 -236998 -353742 -293889 -256470 -147360 -127197 -98970 -46935 -18504
21780 -18504 169145 228734 149004 190780 71618 35926 34235 132244 196675 265303 121146
21769 121146 29941 -118891 -78681 -42622 -26493 -8059 -57500 -127725 -82636 -93540 -137666
21758 -137666 -120060 -76699 -81198 85377 76169 8211 -104753 -183830 -107283 -77236 -108403
21747 -108403 -84269 30827 63160 20995 29911 -46787 -138921 -80839 -146692 -228291 -264062
21736 -264062 -228994 -246105 -204173 -72342 4201 80135 94036 23243 -76467 -22448 93869
21725 93869 92669 -15734 -129847 -174668 1193 -23016 -109901 -137273 -28941 34590 46306
21714 46306 11582 -103329 -187984 -83667 -532 -16971 8336 -95027 -197608 -214942 -197706
21703 -197706 -74035 49000 190269 76875 -22837 -61854 -127459 -213903 -254414 -194118 -137453
21692 -137453 -59724 -108071 -115883 -83456 42584 46633 136853 103283 -95992 -135295 -76709
21681 -76709 -49502 -105421 -38151 143409 248857 225033 200944 118730 64796 1757 -43856
21670 -43856 -91275 -151917 -121013 -89411 -58808 -74648 -133299 -52255 -49466 23770 78261 97589
21658 97589 267703 411192 322297 178890 82964 -12594 -68282 -103942 -208662 -129930 -44087
21647 -44087 64274 78445 72929 20858 8867 11238 -184881 -282595 -300619 -194060 -96134
21636 -96134 -65102 -24735 33829 48380 -55931 -77138 -49021 14596 -120382 -216047 -166829
21625 -166829 -68047 -9454 -74654 -215209 -112414 -9562 -51591 -15114 -38761 -94500 -61328
21614 -61328 49359 -7110 -116860 -182567 -217424 -200734 -123130 -143977 -66382 29608 -12867
21603 -12867 -122722 -82546 -37330 211665 165025 -17217 -16948 21356 137028 357370 226712
21592 226712 22601 -29806 -74075 -75586 25511 -35799 91723 220075 208940 143870 89706
21581 89706 73254 50897 110413 73884 12758 -8916 -90481 -262324 -196868 -21245 51046
21570 51046 -79444 -221455 -176910 -122738 -130037 -208289 -139584 -52948 21296 -119333 -93113
21559 -93113 -121669 88512 232412 266215 261663 132927 156028 58914 -5808 -150624 -139113
21548 -139113 -66943 -4562 -34393 49624 136286 232259 183214 36663 -94221 -88563 -25599
21537 -25599 -21502 -83700 -191630 -92010 19459 -21410 -36487 2086 53114 51779 -100293
21526 -100293 -112117 -18525 132382 86237 -40883 -39792 -51079 66393 72036 102031 53984
21515 53984 -95224 -143707 -59875 -74230 -200326 -283576 -364669 -386162 -276095 -127464 -44723
21504 -44723 -49083 -137927 -252609 -245955 -203206 -241696 -195005 -136765 -96592 -161243 -158635 -216924
21492 -216924 -194041 -219836 -225632 -229784 -234733 -283318 -372168 -311950 -85802 101199 148689 88883
21480 88883 56732 -41772 -50755 -77568 -164941 -80855 -66204 -90659 -111663 -2548 58049 -13290
21468 -13290 -54258 160926 251065 174119 164860 107530 32578 -4375 154297 102339 79920
21457 79920 35859 80742 66056 -72548 -110407 -4998 251 5407 101780 127667 -16299
21446 -16299 -168049 -36954 143454 77564 66580 53940 -78805 -85691 -42910 48625 46691
21435 46691 66439 -10990 -24795 -46501 -75067 8676 42195 -58283 -87863 -20531 10822
21424 10822 -4996 -14808 -89095 -42206 -132325 -203116 -168619 -234573 -137544 6325 -4847 -48325
21412 -48325 -10233 38638 39847 -98567 -55789 28880 -9088 -12412 16609 -32738 -7003 -16416
21400 -16416 5765 49006 180798 197051 34726 -67952 -47560 43233 -11856 -161892 -246783
21389 -246783 -280540 -277034 -199996 -167736 -82111 -98226 -89190 -115500 -166896 -437941 -361262 -184544
21377 -184544 -175872 -208007 -325918 -414103 -258323 -197207 -88676 -118608 -154280 42615 151634
21366 151634 153975 96957 56012 -57383 -113059 -50338 60822 38939 -16731 75585 122759
21355 122759 209054 126505 -52495 -137652 -141177 19379 50167 24002 -87348 250 40298
21344 40298 9886 -34538 -115054 -187277 -178979 -23570 63607 54564 125020 69033 -122865 -110212
21332 -110212 -100577 -82059 -52301 -51277 -32799 51080 117977 33998 9704 5966 121883 52897
21320 52897 29686 -10178 -184448 -165912 -4841 124503 65670 61633 -11025 -133336 -111055
21309 -111055 -26088 -87278 -108872 -209289 -200164 -116471 -75696 -57106 56922 62571 64471 -29520
21297 -29520 90396 94876 57321 50585 -17764 425 63507 48447 7901 -11921 -72270 -60454
21285 -60454 -2773 30464 495 23626 24120 -60960 -22676 -25871 8430 14441 60015 66865 83125
21272 83125 -866 -76330 -35313 -35458 -94661 -71438 -28812 -109054 -104340 -39705 110498 49162
21260 49162 -66776 -105648 -103851 62361 138594 108725 139198 44758 -42126 -84439 -20884
21249 -20884 65753 129178 84017 19060 108235 52952 45780 -98028 -65511 6661 30426 28019
21237 28019 -81401 -100954 -2660 -102855 -95130 68364 -20513 -218001 -175332 -81700 78246
21226 78246 116021 20040 66181 132693 44479 -33171 19688 -1097 -29464 -9764 -103207 -265614
21214 -265614 -284670 -303561 -241269 -53409 -26625 -99820 -139371 -82948 -242348 -246384 -171285
21203 -171285 -40996 18441 3449 21887 -131842 -92947 -186288 -189419 -226627 -348373 -336458
21192 -336458 -71408 -9220 -132094 -130173 -72524 57187 84975 3441 -97302 -150420 -216462
21181 -216462 -19152 -13930 38697 47869 -31576 106489 176399 175906 242006 320005 256121 228949
21169 228949 214743 201221 157350 82696 118277 129185 149932 143884 60680 54275 -133119 -106435
21157 -106435 -78354 -144309 -212267 -198685 -207457 -145158 -129339 -87615 7632 177643 258389
21146 258389 208976 71522 6003 74510 31599 5158 3855 43405 53938 -45423 -12126
21135 -12126 78014 91235 69743 -44787 -168254 -240804 -219711 -146371 -151612 -120613 -28837
21124 -28837 -103086 -35279 -5037 51791 -71112 -138475 -144665 -64057 -87644 -16341 59213 100270
21112 100270 59576 38227 96143 220004 147567 -20804 -40738 -28550 -80531 -157002 -103355
21101 -103355 -107197 -163957 -180092 -93614 -85128 -96337 -99737 -170441 -92376 -25710 -22504 4619
21089 4619 -94175 -132511 -48218 -12188 -54196 -91154 -36404 39851 12505 91867 94689 159619
21077 159619 147052 31599 -130572 -233662 -173140 -114602 7690 -48941 -185755 -250279
21067 -250279 -221981 -197193 -157221 -15314 58418 -39212 -108679 -28036 69127 -34303 -34461
21056 -34461 102835 1181 2761 53870 90393 70455 258275 339707 265869 89761 86668
21045 86668 96996 151335 190309 143831 102252 -19994 20870 87190 42039 73815 80569 84051
21033 84051 79898 83749 125818 48852 84831 91030 -32363 11131 -13210 58234 128841 82948
21021 82948 209819 299039 198215 76491 -153035 -245694 -284793 -340995 -265703 -127351 -20828
21010 -20828 106182 31074 52532 41057 -18149 139893 260040 196370 26268 10141 126844
20999 126844 60659 11867 76869 -16337 -133866 -10961 -30041 -96158 -129698 -182371 -152223
20988 -152223 -131088 -106658 -52222 34933 156888 166107 130324 50571 -17984 -28254 -81165
20977 -81165 -133812 -105182 3519 43259 -117713 -189817 -101001 -77645 -55518 -197619 -353215
20966 -353215 -249363 -163455 -194497 -161117 103711 65991 -105335 -64369 -51019 -106723 -45985
20955 -45985 17073 31288 -43482 -100683 -111561 -33096 96245 111296 -43173 -100938 -62465
20944 -62465 43249 -23770 -85174 62600 229828 127197 -78310 -34008 40193 62538 -21181
20933 -21181 66195 129253 111381 174833 241498 118235 92876 64598 -66697 -34352 43268
20922 43268 87531 165911 205923 154517 -24904 -40370 -78478 -28136 -137722 -136538 28032
20911 28032 85470 50264 -32474 -88790 -94376 -66636 -33897 12267 54638 -37009 -125201 -120706
20899 -120706 -99192 -172955 -73250 -38736 -54500 -67860 32933 56643 25438 -35640 -50464
20888 -50464 -82336 -115648 -221347 -259716 -349244 -247865 -48398 20680 -8234 -120586 -167893
20877 -167893 -69931 13496 -11845 29995 -59728 -106553 -177507 -112138 -123996 -128443 -124279 -73684
20865 -73684 -37569 -168594 -88997 47686 -7243 -15791 70672 101829 -25210 -83608 -181837
20854 -181837 -173176 -129874 -45323 -64421 -13984 -20141 92265 300878 229196 100644 159801
20843 159801 171046 154183 10931 -149199 -144092 -108522 22545 112198 243378 143916 -18868
20832 -18868 -21517 -4455 124754 94919 75257 164484 97611 127404 189339 199963 11504
20821 11504 -178429 -63865 56322 -171864 -289728 -354679 -259644 -255829 -130471 -99458 -102188
20810 -102188 -81041 -120784 -128101 -116029 -94358 -57340 -90895 -130639 -206963 -131924 -54493 -10257
20798 -10257 -76654 -77465 -138008 9033 69895 64359 -55013 -53894 -6802 16754 12510 -48564
20786 -48564 -100241 -44964 -24587 8960 48514 -75710 -66421 36789 16128 -40729 -129481
20775 -129481 -145937 -114557 -54626 -37278 -108707 -45965 -41158 -165599 -192219 -18111 29642
20764 29642 54806 123116 199277 180925 86815 65998 -208 -101122 -179165 -123163 53576
20753 53576 149493 107350 22369 -45271 -24732 108882 111722 89631 47447 -39336 -78054 89800
20741 89800 186967 188816 -24288 -147285 -145030 47272 13641 -66430 31127 51053 132548
20730 132548 190349 99773 -63941 -70736 -118950 -128706 -8377 -22067 -9705 94773 119014
20719 119014 44535 -10649 77847 4680 -178356 -165562 -101394 -87528 -106277 -123416 -67816
20708 -67816 -23878 88856 339557 313829 227339 285326 343158 416731 462892 237013 102209
20697 102209 -26281 139634 228942 158979 36777 -21979 121929 229119 135091 25349
20687 25349 8037 47688 4131 -95640 -162070 9460 45955 20271 142261 148650 211821
20676 211821 345180 179006 -20137 -76271 18889 68428 26262 7168 -145207 -174174 -112664
20665 -112664 -14747 18603 -23918 -39937 -45225 -18843 -46405 -24876 64396 84166 17781 42972
20653 42972 61223 152418 175585 256754 353016 437519 372877 325964 186515 49050 109100
20642 109100 248669 216649 -5286 -31050 121743 220623 209222 105398 -124559 -186501
20632 -186501 -130359 -55778 27642 130494 189452 44386 -3960 18217 -38151 52649 37788
20621 37788 -61908 -95981 -101618 -56911 -30430 -58600 -73213 -36421 100901 190186 186962 229853
20609 229853 289833 221165 276339 244652 109906 113021 -89626 -78829 55241 41610 -4542
20598 -4542 -146766 -104358 64058 33558 163193 -27412 -70163 3719 49678 -80966 -30803
20587 -30803 -42754 5552 53130 53584 70427 190527 227677 154903 64764 -61919 8708 -54833
20575 -54833 -86367 -49452 41300 152024 262711 217390 94427 -4764 -124517 -57119 -61520
20564 -61520 -67945 -31417 -107844 6833 154833 197497 181388 186673 112553 33481 14907 69867
20552 69867 95766 54135 26168 148309 219082 127402 -76569 -111238 -74016 -161847 -141861
20541 -141861 -106330 -11768 -17388 -35704 45140 71319 -792 -59567 -36138 35713 34278 33936
20529 33936 3985 12140 -76346 23302 14445 115849 67437 43847 129549 254801 226787 203591
20517 203591 161635 105011 127199 223106 208284 196665 64378 6669 99182 236002 203303
20506 203303 79232 110985 204380 189535 254058 71632 -31988 -33164 -16177 38510 145300
20495 145300 152816 153150 170382 215347 325290 258728 243383 257767 190748 123239 168975 283265
20483 283265 252587 140269 -15835 67832 136857 36294 -97345 -24181 -7124 -26683 -8797
20472 -8797 -53890 -13886 128980 114206 -83085 -90103 37545 26484 53728 194489 170396
20461 170396 51195 -100299 -204679 -38592 113189 119939 167039 175904 169727 154023 71056
20450 71056 109012 85591 -64509 27061 64530 83996 100199 104549 125726 101351 6515 -17018
20438 -17018 15484 -90363 -165040 -130786 -40717 23976 18240 73429 12406 35264 71157 19735
20426 19735 13517 26222 -6811 -122264 -54559 -37386 -141932 -161236 -141198 -80865 -127853
20415 -127853 -70966 10463 99186 -82089 -127420 -141799 -180304 -15029 129009 114043 -60083
20404 -60083 -256513 -193464 -124617 -95198 -41316 33039 97193 182053 248834 203471 116400
20393 116400 -1913 47997 43010 110208 164679 46256 82952 51288 -91500 -203476 -201280
20382 -201280 -123200 -32440 -69016 -93961 -48130 -32507 72029 225306 244587 155317 230521
20371 230521 210215 34905 -24823 -56057 13050 58273 63865 73897 172945 139116 -79765
20360 -79765 -131768 -98812 121106 229227 192243 113143 17845 -6308 36922 -6102 -12463
20349 -12463 17657 96342 154582 83036 -15510 68107 40144 -28051 6913 77662 65294 -22211
20337 -22211 -124852 -110178 -121268 -68173 42776 52457 118539 67425 151158 291726 175173
20326 175173 109178 110299 139245 8218 -24579 96099 152423 111822 179894 73315 90670
20315 90670 262342 264890 250337 199453 93638 105434 12547 8220 50722 107811 121445 141878
20303 141878 -29274 88585 276131 217704 -122949 -113293 135782 273805 244725 232306
20293 232306 136546 18728 -7811 92042 146983 131426 191480 252162 178249 28712 -40386
20282 -40386 -146338 -161123 -117809 -150865 -89103 -89761 -154033 -313305 -286010 -228166 -98200
20271 -98200 -142778 -151941 -136945 -84847 108228 220838 41892 -13070 23965 31413 121937
20260 121937 -12773 -81858 -3122 103355 129800 273216 251563 289565 352329 324787 254821
20249 254821 299869 311172 175801 184270 151017 34021 36598 148666 175681 251459 227423
20238 227423 85331 -17835 -80240 -66588 30439 -22964 -86231 83533 176510 210788 167320
20227 167320 118312 10664 642 -38791 -14764 88558 159141 117167 36264 101104 141977
20216 141977 74188 -16090 -96918 -186349 -266134 -138008 55587 -13289 90638 236343 120307
20205 120307 136454 149521 233489 230113 169852 175403 249275 198768 121369 39258 29172 81069
20193 81069 197958 329448 314359 160717 122842 219243 261898 242729 160178 -10306 -28394
20182 -28394 -73395 -45074 17675 -6538 -51680 -31175 177342 207538 58263 -6341 20719
20171 20719 16675 94780 166083 161599 172122 229823 133814 43976 72926 160584 164211 65176
20159 65176 186987 226652 183981 131938 70849 46255 154422 187282 110736 15530 154989
20148 154989 158147 173581 208831 249274 190438 48541 21327 80091 79494 68377 134033 -31458
20136 -31458 27603 125924 206787 170264 180298 201929 88802 -8259 -27557 -121165 -73011
20125 -73011 14478 4273 98632 167094 96107 164662 87441 47440 52503 206089 208077 116300
20113 116300 134997 150085 67224 8029 26907 98305 116621 90180 118059 176336 178318 100516
20101 100516 31810 35086 56985 45988 -46265 -82620 -67260 -78869 -19367 20113 2843 31737
20089 31737 48199 64641 62782 52550 -45743 -83329 -86585 56292 194485 284660 192337 21544
20077 21544 -20334 76753 213931 214861 60598 -98848 -79611 20557 259025 276920 111914
20066 111914 186246 201145 176622 157010 114975 72007 124615 133360 117734 177403 257290 268702
20054 268702 323640 405705 352862 221813 177588 222348 203691 180545 234919 137257 230880
20043 230880 73122 -86025 87817 112622 167505 203029 190022 128794 162496 174805 161697
20032 161697 164691 278176 309642 241159 127096 29075 39836 167621 266584 232172 237108
20021 237108 147346 104088 38111 66100 125923 259824 274490 341260 241331 97814 139020
20010 139020 283848 228440 187723 142690 68228 50831 22532 34838 5104 133476 215525
19999 215525 298538 327443 189300 149599 46312 -110053 -84700 41714 -18556 -127054
19989 -127054 -211260 -120678 -93453 -154688 13246 126970 97869 49175 182722 188407 151967
19978 151967 205493 319162 131498 119670 205659 198748 108532 5704 -3817 -53625 -190999
19967 -190999 -198013 -133250 10246 76967 2180 84239 109990 63467 90314 245157 222857
19956 222857 156324 191980 20097 9356 -30159 17902 78856 176731 105143 190792 215749
19945 215749 230860 270271 149894 113791 123050 177950 195840 151548 182913 101410 83788
19934 83788 134559 8517 57435 190558 188513 25170 7789 -19392 -135291 -151764 -16137
19923 -16137 104555 236521 147633 166069 128691 5560 -38628 -151294 -218407 -173721 -96577
19912 -96577 -43378 -31844 -118802 -88537 112451 288388 202305 38511 20511 -35851 35666
19901 35666 78914 53381 51635 -21488 -82842 -54124 17639 97571 134072 40609 57577 142932
19889 142932 28061 -42841 -75767 -134317 -67954 19589 -7968 -23596 -57613 -79829 11595
19878 11595 169142 270779 -13236 -156069 32650 146672 126205 169543 264032 265714 287073
19867 287073 312049 287316 247054 291976 260979 289037 231643 160309 174727 77334 -93682
19856 -93682 -33564 66340 10839 -6752 189673 306848 219710 94939 161249 217258 222729
19845 222729 167906 121793 49117 46533 65168 200030 229101 165019 151139 43641 -8166
19834 -8166 -23104 -29835 179801 261106 254721 200134 168475 182728 213452 228985 207092 131131
19822 131131 82131 9617 123303 204103 229359 293515 239133 333492 341344 240630 166110
19811 166110 173194 116430 188800 380826 302182 263158 110553 -48467 78855 150498 223039
19800 223039 225078 250790 288819 190198 304505 296905 214019 150350 67386 -988 70169 -5999
19788 -5999 51215 275002 360234 382766 351861 282727 209078 199675 292053 327388 342771 403536
19776 403536 448658 419407 318286 315602 363660 415612 325884 296225 287304 348091 463315
19765 463315 387191 223145 234027 165193 148804 217611 335478 361930 165294 114248 217963
19754 217963 184117 276956 326072 277808 250542 277205 210217 103793 81481 151629 87599
19743 87599 147025 158023 160788 275777 386494 436943 399113 456281 591234 581508 474548
19732 474548 360777 295200 167414 216666 233500 122451 267584 304252 363611 390584 353379
19721 353379 241960 177293 271161 381423 270963 96572 58374 179515 394264 445134
19711 445134 315260 237758 268641 141242 135033 343045 464717 333369 229276 331323
19701 331323 364700 342815 335127 403220 338392 176830 100590 86641 281942 326308 373386
19690 373386 386886 338435 322715 358871 329281 231015 282509 408743 326550 194596 184556
19679 184556 255539 363925 307545 228229 78423 68759 133171 256898 218389 275439 434793
19668 434793 425356 347589 430742 392031 402538 392134 362387 284865 355338 275109 257723 215699
19656 215699 285610 424847 441820 438827 486292 427287 358105 303526 279791 336961 311591
19645 311591 291872 228529 161852 216817 252844 258977 317488 324915 465749 538364 555512 565592
19633 565592 440453 382052 306198 220404 264454 319965 283936 308222 378728 408487 413832
19622 413832 166980 93244 265136 427262 442071 442013 488526 427222 499824 596013 396070
19611 396070 376414 411309 391291 282213 337681 362153 459040 584952 466502 436649 622194
19600 622194 738845 773965 808777 941740 986743 969940 1037145 1034708 981141 949865 940458
19589 940458 973001 865462 855227 928631 925803 742722 609438 488244 584357 646802 786793
19578 786793 821499 815900 861441 749374 715797 691491 563066 458134 493016 601305 616154
19567 616154 535797 618406 620348 546437 614820 615587 469436 359492 396072 516256 673761
19556 673761 721455 754403 709825 767371 763359 765782 875410 1013217 1056821 986261 1079463
19545 1079463 1140257 1257841 1350880 1450501 1495786 1495564 1456595 1373150 1336402 1116926 1036551
19534 1036551 1117377 1185394 1150655 1015075 1019248 1016571 913906 795015 763879 791908 934417
19523 934417 865968 805242 814692 773388 740112 812016 721943 781977 838803 822019 868205 821339
19511 821339 802612 942689 963193 778509 750618 710014 639550 536463 493038 600099 714745
19500 714745 674197 542786 575422 710493 853105 752632 846825 896613 842493 848611 873532
19489 873532 982381 1033437 952847 1086077 1120567 1113252 1098244 993910 955662 927121 766512
19478 766512 666467 687203 654457 622766 531621 522768 439951 502514 555431 690957 661846
19467 661846 619061 505052 473227 599804 664683 568254 480704 541402 631103 780549 668365
19456 668365 611890 570617 625008 510424 367007 397892 403566 499393 598092 635460 723755
19445 723755 512172 414191 472958 515974 561790 521447 396555 519183 520185 591653 598213
19434 598213 638088 670043 584957 437953 546864 718009 710144 796593 830857 749618 644460
19423 644460 690188 760467 664466 552190 476792 522945 479646 494112 464528 361610 270503
19412 270503 360984 514225 730888 747074 632940 577220 565722 586138 688568 698347 691530
19401 691530 634561 603923 581951 748188 788839 682822 656894 719144 762952 768262 768410 940564
19389 940564 1111088 918538 893446 880626 938597 1043495 1088572 1088628 1139001 1150892 1288766
19378 1288766 1408291 1460795 1512486 1458884 1409185 1381291 1328363 1175289 1079647 1101062 1234667
19367 1234667 1180970 1064445 912038 858155 879781 852805 666404 511382 550255 578225
19357 578225 585948 687176 815449 853428 868375 894730 989525 929992 912936 985543 977888
19346 977888 984904 1000175 955261 916814 867813 806013 875479 1002123 1032506 1030844 1019908 944774
19334 944774 946727 892171 923532 903175 747097 718662 718981 631643 584164 572200 571916 660766
19322 660766 745428 764231 856499 935860 1023075 1072432 1157468 939799 871216 968524 984656
19311 984656 1105538 1145346 1087641 917872 784989 885661 925101 865379 1002986 981476
19301 981476 944376 1044552 1169185 1127639 1070308 1172486 1210147 1169971 1271444 1250175 1183711
19290 1183711 1359557 1320018 1168437 1005147 1032092 1007781 916461 909636 946465 912610 958297
19279 958297 1158774 1151455 1168760 1148356 1097775 1164397 1117332 1023365 1242340 1397412 1409309
19268 1409309 1356059 1165929 983351 1084900 1018301 998902 1161225 1179546 1114740 1108893 1227009
19257 1227009 1241504 1070500 964795 1037796 1057310 1098042 1125522 1209039 1271578 1186201 1168803
19246 1168803 1133123 1029303 1047122 1179755 1265092 1126035 1028881 1013486 925911 1001264 1026956
19235 1026956 1142663 1297610 1360229 1369184 1397674 1509233 1357798 1169873 1232015 1404774
19225 1404774 1502913 1452039 1376136 1361004 1394258 1481298 1616233 1801130 1886967 1756191 1666446
19214 1666446 1758332 1765669 1758320 1704701 1782388 1807258 1789117 1739335 1640756 1582516 1545654 1576666
19202 1576666 1706192 1785727 1732918 1591855 1745458 1840442 1693688 1511869 1579563 1599719
19192 1599719 1636163 1772793 1704245 1655579 1634196 1637286 1682189 1795809 1758881 1795883 1857383
19181 1857383 1938452 1997755 2115172 2092082 2046209 2079286 2045153 2217444 2194636 2238503 2199561
19170 2199561 2305116 2441431 2646409 2790031 2943241 2836143 2734341 2837013 2858471 2924625
19160 2924625 2960190 2802526 2578509 2633136 2692434 2770298 2838879 2892343 2890151 2913887 2968992
19149 2968992 2968095 2989538 3069438 3114225 3075093 3164428 3425386 3509516 3515365 3554391 3574018 3652102
19137 3652102 3685957 3754584 3760680 3794245 3862251 3947787 4066058 4205544 4375869 4526090 4656276
19126 4656276 4852294 5214804 5469478 5640907 5688256 5931812 6302055 6674556 6975759 7253230
19116 7253230 7470464 7877450 8360852 9055965 9753643 10432539 11254435 12212417 13264656
19107 13264656 14474597 15968753 17708881 20048497 22938654 26565121 30937305 36409418
19099 36409418 42813085 50297038 58401487 66816307 75255829 83046354 89713189 94673734
19091 94673734 97773822 98700283 97524074 94364092 90009218 84801007 79418970 74345373
19083 74345373 70095488 66993044 65222514 64386682 64342128 64692556 64919773 64536053 63749970
19074 63749970 62540212 60998893 59180221 57286977 55166579 53082781 51359043 50052001
19066 50052001 49296227 49188842 49438793 49942216 50891934 52180500 53751679 55814931 58489258
19057 58489258 61711941 65829029 70478174 75710013 81301000 86769944 91853233 97170662
19049 97170662 102673961 108337850 114643653 121965944 130525209 140295917 150739560 161303802
19041 161303802 171262711 179756381 185712385 189001309 189661210 187630084 183403613 177462191
19033 177462191 169995594 161652139 153070911 144709146 137077807 130574535 125317538 120882515
19025 120882515 117567803 115253326 113673677 112797942 112595370 112734150 113306037 114383409
19017 114383409 115683519 116490665 116069011 114545267 111968781 108334662 103763785 98808443
19009 98808443 94065711 89782191 86049735 82981690 80677969 79257704 78241949 77548150
19001 77548150 76922971 76240245 75708974 75264293 75149324 75487259 76285139 77699183 79590112
18992 79590112 81628460 83727497 85710282 87179884 88118774 88638597 88614799 87871842 86367983
18983 86367983 84219929 81872106 79120171 76334808 73708335 71556983 69564399 67412516
18975 67412516 64981688 62250910 59141998 55628908 51836698 48169916 44669386 41546818
18967 41546818 38782523 36230413 34107845 32288058 30819501 29709776 28764149 27799691
18959 27799691 27126076 26598019 26027385 25575446 25186198 24761230 24273777 23989091 23671579
18950 23671579 23345288 22946855 22736265 22713521 22748718 22845394 22695170 22496606 22245770 21734591
18940 21734591 20973782 20219477 19512684 18651505 17636475 16621495 15494108 14542720 13659481
18931 13659481 12846571 12145480 11641642 11222867 10781545 10358964 10146638 9883295 9658099
18922 9658099 9456120 9295013 9356683 9474513 9447810 9396448 9389917 9430609 9602041 9878819
18912 9878819 10144790 10384431 10675182 11380721 12115576 12928604 13944179 14975496 16284298
18903 16284298 18057291 20264944 22848926 25989239 30133598 35186442 40971701 47569616
18895 47569616 55028924 63089593 71616149 80086788 88447115 96397081 103846374 110608994
18887 110608994 116590972 121692959 125717365 129002045 131563057 133503361 134859642 135614453
18879 135614453 135481189 134562215 132775900 130039120 126342469 121460796 115489025 108482251
18871 108482251 100751687 92595827 84232843 75887697 68007689 60679004 54131686 48394505
18863 48394505 43534648 39475257 36219594 33616535 31474032 29645806 28259968 27043524
18855 27043524 26025094 25095330 24332049 23768545 23312885 22853003 22573083 22289920 21840372
18846 21840372 21320843 20890711 20380733 19839694 19257715 18601692 17741682 16745887 15635060
18837 15635060 14429847 13268615 12313687 11364416 10602605 10036013 9662196 9377443 9159752
18828 9159752 8794842 8579564 8467634 8231589 8048141 7982938 7801775 7652957 7674254 7610385
18818 7610385 7635607 7546426 7363942 7102792 6892927 6531946 6108115 5928566 5879231 5654094
18808 5654094 5300327 5079694 4975014 5084637 5155813 5269995 5494298 5811918 6154314 6616692
18798 6616692 7134206 7813609 8412486 9098038 9807905 10336812 10725214 10742307 10349118 9851184
18788 9851184 9144555 8252814 7532581 6907651 6190712 5551867 4850579 4352157 4036467
18779 4036467 3750898 3392057 3246686 3205842 3255066 3291493 3308319 3338597 3248050 3282267 3355934
18768 3355934 3537130 3616646 3575818 3508356 3375284 3250741 3132253 2854477 2557472 2333114
18758 2333114 2111749 2052776 2043386 2013069 2059899 2080168 2032713 1941381 1913212 1762141 1683310
18747 1683310 1674149 1746311 1554447 1333592 1410571 1449682 1512033 1527510 1586351 1599253 1656287
18736 1656287 1771253 1766450 1808673 1691262 1674889 1674564 1617856 1570938 1488624 1498573 1556761 1683629
18724 1683629 1658489 1540207 1597739 1655466 1674097 1616239 1638131 1690423 1621351 1641156 1661810
18713 1661810 1708137 1801154 1802480 1792092 1888816 1915053 1911998 2092417 2394949 2589246 2749544
18702 2749544 2894055 3195321 3576025 3835160 4277631 4790869 5265867 5684843 6018272
18693 6018272 6401320 6729792 6896247 7168241 7396664 7588674 7797561 7834495 7838563 7825612
18683 7825612 7897979 7889283 7586679 7431843 7422001 7244238 6946813 6683513 6299285 5712022
18673 5712022 5248085 4920361 4553213 4178160 3920120 3708255 3499555 3214664 2909608
18664 2909608 2740563 2594883 2521104 2564232 2488074 2399584 2382361 2314131 2214226 2368578 2372045
18653 2372045 2254486 2186434 2231950 2338754 2316660 2185781 2094226 1889012 1904532 1988597
18643 1988597 1975411 1783025 1834410 1840764 1901216 1925725 1912722 1796416 1848398 1920476 1969790
18632 1969790 1937396 1943609 2139463 2229026 2172210 2124091 2122409 2167204 2125639 1986814 2029182
18621 2029182 2105158 2074962 2019758 1992524 2041520 1910191 1946536 2067337 2154696 2358007 2460077
18610 2460077 2375095 2352149 2317483 2480823 2664093 2769028 2743153 2743493 2909470 2937513 2938251
18599 2938251 2914137 2880640 2917521 3174237 3221430 3210895 3180427 3186307 3294016 3389396 3577047
18588 3577047 3852206 4050286 4192094 4519414 4696817 4941786 5035845 5008514 5023007 5021090
18578 5021090 5141584 5502382 5700509 6043804 6458508 6976074 7576252 8278181 9294540
18569 9294540 10818646 12772575 14824436 17181133 19649333 21729069 23363026 24194781
18561 24194781 24528689 24519530 24177060 23781983 23324089 22644744 21690310 20660795 20064574
18552 20064574 20248442 21015025 22299769 24280848 26996504 30644528 35667143 42212705
18544 42212705 50968773 62957897 78674054 97861616 118588180 137062858 148774093
18537 148774093 150618888 142228263 124685677 101110357 79270346 63859290 54137207
18530 54137207 48430587 45689489 45151758 46355843 49385422 54402437 61199022 69618883
18522 69618883 79067882 88142550 95635779 101306591 104835236 106040963 105482184 103724978
18514 103724978 100361524 95070076 87239764 77669012 68600238 62295684 59043699 58524459
18506 58524459 60700081 65269525 71867690 79850902 88189212 95464004 101137876 104436049
18498 104436049 104665927 102269290 97973847 92122085 85255232 77472662 69387831 62453328
18490 62453328 57958863 55722005 55407407 56624089 59335128 63295739 68876821 76628745
18482 76628745 87031009 100512725 116348393 131950357 143111443 147318722 143702824
18475 143702824 131070187 112070541 92626509 76780582 65296605 56884012 50455396
18468 50455396 45643431 42203719 39885822 38569832 37946247 38085992 38734479 39581979 40331519
18459 40331519 40683663 40779670 40475283 40119713 39843962 39590367 39554322 39883952 40180555 40195892
18449 40195892 39387700 37874367 36002907 34107546 32070084 30308064 29213872 28695621
18441 28695621 28310844 27784034 26957105 25557091 23802393 22029259 20660284 19730096 19323297
18432 19323297 19451558 19730140 20360187 21229193 22037799 22671344 22975102 22802749 22118437
18423 22118437 21302647 20473425 19971780 19856165 20145176 20882050 21885124 23085028 24386823
18414 24386823 25101461 24655930 23076441 20927052 18330906 15741577 13600716 12041709
18406 12041709 10925551 10058458 9619694 9456102 9263713 9290114 9420928 9684807 10069162
18397 10069162 10743571 11557867 12535552 13442030 14500095 15767651 16987372 17796686 18139246
18388 18139246 18097361 17786613 17320735 16822164 16474081 16254458 16250779 16412321 16501199 16538941
18378 16538941 16493186 15997922 15031838 13700782 12338715 10947496 9814987 8812023 8138580
18369 8138580 7509179 7017121 6603539 6253693 5954586 5699477 5597609 5503217 5514036 5492015
18359 5492015 5497945 5351946 5281739 5414247 5362060 5463986 5504676 5483457 5671183 5917674
18349 5917674 6152529 6492270 6719982 7007745 7514790 8270531 9038660 9975239 11149680
18340 11149680 12517778 13885162 15340002 16811229 17859095 18613287 19162200 19613556
18332 19613556 20459227 21861066 23945754 26930490 31117645 36602108 43267972 50767337
18324 50767337 58700617 66181061 72310361 76183209 77455180 75904435 72112792 67182554
18316 67182554 62442403 59153158 58068406 59404064 62619274 66524889 69849429 71357879
18308 71357879 70126822 65616118 58700785 50500082 42198845 34773504 28843627 24434196
18300 24434196 21257787 19123998 17696471 16672615 15892338 15397552 14934130 14511188 14186152
18291 14186152 13944138 13581237 13291091 13209171 13222754 13200631 13200633 13289288 13618887 13940827 14387000
18280 14387000 15017166 15633279 16573013 17923958 19990396 22672997 26030759 30326652
18272 30326652 35896790 42429050 49490890 56203815 61575687 64869173 65368627 63178756
18264 63178756 59217674 54723491 50957604 49030481 49309206 51620376 55080522 58685266
18256 58685266 61091967 61386981 59054320 54085302 47173786 39677310 32468847 26341419
18248 26341419 21616399 18181024 15922933 14301740 12956506 12010308 11394463 10915789
18240 10915789 10526375 10135288 9861527 9492769 9025700 8674650 8288964 8080550 7920103
18231 7920103 7677319 7507172 7075092 6813278 6585850 6285087 5968357 5531855 5037085
18222 5037085 4665270 4482983 4292334 4152456 3969077 3814564 3461593 3275241 3193163 3079843
18212 3079843 2888148 2770784 2588272 2438582 2340689 2068201 1945054 1997878 1861440 1732671
18202 1732671 1937699 2018832 1860907 1804227 1645792 1705001 1723452 1752132 1784091 1662716
18192 1662716 1582194 1758619 1778561 1867509 1840864 1752602 1588868 1503218 1438601 1431356 1515350
18181 1515350 1438186 1372730 1272187 1238508 1336281 1321079 1426982 1515399 1675050 1735440 1865603
18170 1865603 1962693 1950382 2014514 2128920 2281319 2302591 2260151 2293172 2295253 2257633 2178330
18159 2178330 2106353 2095315 2082261 2174831 2395517 2564442 2612138 2831732 3149519 3358089
18149 3358089 3662699 4164655 4738088 5160462 5608320 6000698 6081163 5977985 5970666 5868157
18139 5868157 5774585 5800919 5993625 6169487 6451062 6783457 7019169 7277720 7579580 7663809
18129 7663809 7779530 7783400 7795230 7972003 8316023 8869859 9610083 10621293 11905430 13468997
18119 13468997 15610900 18305970 21776993 26126639 31438186 38297158 47711294 61499768
18111 61499768 80736296 104949158 132104211 155613525 164562838 161756393 149171767
18104 149171767 116631657 80322475 55305732 40350602 31346474 25701046 22048691
18097 22048691 19561264 17813495 16561066 15918390 15559703 15258878 15099549 14827147 14651065
18088 14651065 14408874 14003745 13568187 13250767 13086224 12980719 12988380 13248241 13527087 13857923
18078 13857923 14024290 13819632 13482738 13133103 12622017 11957583 11239210 10439555 9734006
18069 9734006 9121700 8699715 8268397 7722936 7134471 6565065 6025900 5572170 5254876
18060 5254876 4949793 4608429 4325303 4004119 3766820 3545230 3374359 3266551 3197018 3032422
18050 3032422 2878350 2747477 2622594 2558580 2472001 2279104 2120470 1985102 1779147 1679396
18040 1679396 1651364 1775709 1749831 1633962 1596022 1577433 1507683 1455768 1420468 1346622 1249492
18029 1249492 1262739 1328819 1317198 1310000 1393774 1489608 1611975 1718929 1780696 1854632 2090354
18018 2090354 2435428 2785698 2924579 3134818 3632235 4012697 4281262 4794929 5231332
18009 5231332 5693748 6084586 6272137 6446452 6719730 6890617 6792085 6712401 6602272 6410548
17999 6410548 6152938 5723302 5264282 4790798 4231163 3894411 3606473 3289734 3017440
17990 3017440 2826745 2718226 2433955 2441868 2534734 2360853 2198065 2112358 1975571 1845931
17980 1845931 1728965 1636946 1644817 1705914 1775656 2022545 2088431 2120675 2173805 2377761 2579653
17969 2579653 2743118 2735549 2740684 2960048 3032326 3231313 3563992 3685655 3757798 3877805
17959 3877805 3718131 3614284 3661319 3651301 3696283 3789360 3785965 3657265 3491596 3412486 3265751
17948 3265751 3089471 2738291 2348059 1945330 1821945 1756720 1561552 1536290 1391374 1342263
17938 1342263 1298467 1265282 1210923 1091882 1178758 1152257 1120292 1150246 1088042 958932 883791
17927 883791 796423 765867 809238 827503 908862 928775 932291 1035245 985602 840736 852097
17916 852097 835603 838679 917382 834300 769105 709310 671912 721703 701663 776980 730215 858710
17904 858710 888345 754422 641598 494655 652610 652230 579315 645149 707736 727231 647427
17893 647427 457428 355189 305893 303740 311434 327075 346713 133858 37349 164342 223443
17882 223443 136609 38230 11708 61354 125507 171580 176955 166167 179541 194798 136633 90489
17870 90489 -41189 -117621 40683 224543 196122 171571 198257 206249 209570 139991 139766 79321
17858 79321 35255 89464 154999 90670 218322 164438 -17325 -94453 -145773 -265960 -264253
17847 -264253 -220923 -178526 -149967 -198021 -209721 -195655 -335295 -286011 -28820 28302 15728
17836 15728 825 204700 233413 86405 12652 158304 291077 252849 170082 216125 294403
17825 294403 215626 248107 260365 170753 235031 247579 39248 2762 113534 195973 256484
17814 256484 294099 407722 421183 269912 214600 267241 382556 500431 560961 643246 593613
17803 593613 345984 327405 380785 214808 163245 95511 94414 135533 148456 79067 3159
17792 3159 -12134 60018 -5008 -11659 -7970 13469 -1768 -32004 39206 -27044 -151028 -87681
17780 -87681 -32280 -52906 5342 -81678 -179442 -255869 -330123 -202971 -101287 75830 106842
17769 106842 101013 76487 14865 1774 27107 31086 45150 222288 363405 370662 399624 406922
17757 406922 298580 199216 124799 193846 155971 190972 235576 265772 229178 231349 448172
17746 448172 468416 328066 197574 38339 -12386 -147628 -258393 -245935 -157457 -148875 -209836
17735 -209836 -221001 -123663 -119762 -144501 8758 59910 100653 133200 176469 235768 74405
17724 74405 -75550 -278350 -438472 -326996 -272100 -247021 -254071 -258669 -174164 -151630 -273663
17713 -273663 -305475 -269471 -181594 -247548 -353300 -381376 -399476 -397045 -324436 -273676 -213568
17702 -213568 -189193 -117945 -154931 -233821 -253719 -252348 -247612 -164262 -267623 -303914 -255951 -252806
17690 -252806 -241506 -276734 -115353 -211293 -224877 -310006 -348988 -288660 -117146 -83319 -280955
17679 -280955 -293080 -323760 -399783 -382884 -312662 -194501 -156503 -158564 -141355 -107279 -85992
17668 -85992 -33189 -8885 -2570 -56968 -93725 -8494 120421 61250 -13277 -23606 -114929 -81557
17656 -81557 -76163 -126792 -121388 7409 205983 237457 38049 -92258 -132225 -148798 -166319
17645 -166319 -155989 -208169 -168582 -155481 -123565 -178513 -200762 -225361 -124632 -140002 -214354
17634 -214354 -230444 -197642 -147124 -9555 60294 190630 191268 177730 91405 172277 116113
17623 116113 109353 28667 -78419 -188051 -255323 -136569 7321 5581 -71276 -145306 -247728
17612 -247728 -314774 -228107 -118423 -27520 -64527 -107874 -144392 -200199 -166629 -71859 66176
17601 66176 203477 213978 184738 14183 -69688 -168326 -87261 -19353 117173 119460 88496
17590 88496 105918 79684 -6802 145839 150061 68798 89160 65859 43999 24584 -49752 100932
17578 100932 129286 48872 -92104 -140973 -66578 -14439 -39814 -12494 -88287 -76306 -47683
17567 -47683 -77251 -136286 -145202 -37615 -54343 -200749 -313721 -373669 -281432 -291862 -308760
17556 -308760 -274267 -184894 -129598 -70647 -240301 -299682 -267423 -287705 -349356 -384601 -273627
17545 -273627 -142171 -33035 -28674 44875 148390 88050 12890 125478 96252 -74319 -108630
17534 -108630 -88465 -204056 -203148 -132754 -158690 -125810 -172026 -260740 -240006 -177500 -105389 -30176
17522 -30176 -130176 -216605 -237335 -104637 -33448 6864 -17836 26630 7319 -44601 -15333
17511 -15333 7941 41542 3121 -45056 -85404 -96966 47557 135362 109594 111471 157566 41888
17499 41888 -41569 -85046 -113801 -58688 -59874 -203400 -165963 -156457 -266459 -308590 -250302 -219901
17487 -219901 -258804 -280153 -189814 -62780 -36137 -138382 -231211 -172805 -83058 -66652 58765
17476 58765 -12980 -123463 -218565 -174597 -139325 -94377 15909 45164 56744 94402 59191
17465 59191 82625 72630 -1642 -129778 -142485 20395 136631 127675 56878 -55898 -115252
17454 -115252 -76183 -40199 -121412 -272856 -263288 -79950 20751 32768 162354 172966 211661
17443 211661 461443 597365 587137 533092 378231 269931 239018 236558 160248 1026 -18056
17432 -18056 28405 -118563 -119630 -67230 -108613 -160817 -14377 60841 -14763 -88084 -54403
17421 -54403 89633 63544 63254 47294 197592 241441 125311 -17661 -145308 -294876 -319555
17410 -319555 -137856 -133984 -258036 -279469 -312229 -386727 -504871 -391781 -255350 -252325 -69874
17399 -69874 120998 173208 29678 -104951 -178511 -95486 45656 99266 45382 -93284 -27748
17388 -27748 -92003 -143402 -225903 -172158 -19386 13589 -145602 -43869 -38083 -68771 -169351
17377 -169351 -247857 -223711 -187246 -300889 -380756 -326752 -343707 -457545 -611613 -557090 -491804
17366 -491804 -454468 -342906 -90160 -11827 -106907 -410464 -424314 -320224 -349106 -318812 -125976
17355 -125976 -178510 -214603 -31447 42156 -9720 -86948 -156963 -148264 -88305 -147089 -141097 -106940
17343 -106940 -68508 -110855 -80900 -110300 -81768 34004 111118 103882 140642 147225 -43076
17332 -43076 -179128 -166685 -247452 -237392 -127241 -144976 -147209 -23204 -2465 -45652 -46572 -34593
17320 -34593 -10773 -30312 -84858 -14720 27499 -202445 -355544 -320607 -162352 -242373 -278072
17309 -278072 -229487 -349875 -299186 -183426 -86751 -200535 -249184 -248682 -200954 -155131 -139477
17298 -139477 -251794 -378515 -312419 -127879 -138213 -288841 -164994 -66638 7539 -95385
17288 -95385 -109935 -128331 -263649 -236454 -257703 -318092 -320278 -198757 -125798 -107024 -11194
17277 -11194 4981 86902 75442 51174 72741 93546 54631 26531 56006 -120529 -172794
17266 -172794 -127436 -72677 62760 77572 -37360 17515 107260 116100 96730 68821 47280
17255 47280 116478 184993 132188 54183 -57882 -150432 -231528 -258128 -173316 -69081 -145849
17244 -145849 -147905 -200373 -184890 -189611 -250395 -293650 -365295 -297562 -197095 -198486 -265245 -303300
17232 -303300 -260259 -185811 -93580 -41765 75075 50084 5684 -42219 -75107 -166881 -249845
17221 -249845 -135988 -91827 -206071 -237567 -231692 -251762 -298846 -272868 -208516 -158843 -188604
17210 -188604 -167138 -80164 -37004 -95161 -156132 -148251 -200808 -213108 -178153 -151947 -239540 -196192
17198 -196192 -163737 -191966 -266763 -201530 -267678 -145953 -8456 111252 151811 140716 177113
17187 177113 89875 8940 -122346 -126234 -162193 -133306 -134836 -119546 -50602 -31628 -66182 -147181
17175 -147181 -40372 -35917 -106313 -1773 68225 42542 68036 -395 -126404 -116367 -154266
17164 -154266 -361368 -426043 -362629 -233565 -176876 -125652 13082 30834 -10767 -131850 -111554
17153 -111554 28505 41403 73395 -22848 -20172 10241 -91139 -90078 -106972 -169040 -158149
17142 -158149 -169536 -260667 -255795 -62504 65980 -133784 -156141 -43912 -9874 40741 31586
17131 31586 60508 187027 190495 74880 -73195 -214922 -320627 -260663 -254491 -224802 -246683
17120 -246683 -191178 -34127 155205 53344 -37742 -121505 -96762 -70480 -34066 -30698 -169331
17109 -169331 -160873 -54877 -67721 -131846 -278455 -251678 -164991 -36189 -45980 -41377 19157
17098 19157 -1946 -165281 -156238 -61357 -73398 -157285 -221810 -258641 -205922 -56915 22312
17087 22312 -84764 -162688 -202050 -164959 -56661 53525 46636 48802 -25793 -47270 -56967 -73809
17075 -73809 -60048 -189148 -143284 -55597 20095 24849 -44241 -59082 -34649 -42833 -32600 10044
17063 10044 90257 53602 70087 31507 26449 79078 20911 17880 -25933 -141567 -73743 -157151
17051 -157151 -178621 -179989 -182356 -255262 -146421 -14687 54339 -3686 -24752 -33477 -165119
17040 -165119 -101265 63157 129719 40327 -32121 -63822 -106796 -123742 -14452 66928 88805
17029 88805 30701 -90204 -97727 -82109 -122972 -236823 -84329 71844 70754 30717 48158
17018 48158 -63972 -96187 -38188 -179152 -361983 -316524 -164697 27912 8905 -68611 -37904
17007 -37904 -79234 -161628 -100300 -145079 -172174 6340 14636 2820 -51479 -104551 -134336 -94051
16995 -94051 44253 184500 175043 17918 -35111 -151276 -238082 -256298 -262584 -206316 -123282
16984 -123282 -70715 -59816 -44786 -34257 -186110 -319380 -381514 -220470 -75341 105801
16974 105801 48930 49994 8904 -34419 -84028 -26922 -41956 -80026 -14482 -45818 -208113
16963 -208113 -312979 -228816 -234432 -276966 -164148 -193148 -101546 -67968 -121580 -160338 -20721
16952 -20721 38659 -16639 -40313 -55232 -67983 -95334 -159081 -236577 -284150 -280196 -250280 -268962
16940 -268962 -167604 -48869 16004 20361 -48202 -151104 -84768 -163599 -264636 -218143 -203147
16929 -203147 -202070 -293601 -378036 -383371 -245191 -186734 -178631 -155788 -84984 -125978 -170759 -212548
16917 -212548 -124212 -66842 65717 86490 32331 -7608 52565 85203 31526 -61159 -104452
16906 -104452 -173650 -207691 -232278 -164890 -53858 -30580 -86642 -94858 -87782 -174273 -226370 -226261
16894 -226261 -151160 -84819 -97719 23099 161776 130959 125214 77380 -16046 -169943 -183199
16883 -183199 -61189 -40739 -64611 -38455 -9125 74869 -18038 -117644 -130643 -60006 99355
16872 99355 15304 33976 -21898 80784 119476 243844 293681 144915 20013 -51672 -123357
16861 -123357 -51461 70915 73506 8008 77577 242354 179358 125928 83608 69814 -53551
16850 -53551 -159198 -218432 -242729 -256780 -60699 47628 111828 87233 -111125 -118228 -61067
16839 -61067 -121405 -26427 57007 -46948 -64610 -32523 4699 -46641 -108495 -182160 -96059
16828 -96059 130350 108161 -8785 -113233 -6753 3204 -80731 -124933 -49865 103697 131896
16817 131896 135357 135899 201882 135225 76940 94166 -42118 -42963 -89358 -166876 -109310 -96677
16805 -96677 -47299 -13379 -66664 -93700 -47250 -790 60519 92773 47217 -78950 25992
16794 25992 118912 78881 -28944 46577 41095 -140027 -188367 -181683 -245088 -296019 -323832 -179140
16782 -179140 -9671 65507 76479 3288 -55638 -222522 -224789 -235304 -112714 -64798 -38774
16771 -38774 -30388 -87491 -65710 71570 178395 157923 170848 110600 98159 186533 184305 155473
16759 155473 134357 72868 101431 81258 51684 46611 71736 20019 -70698 -121751 -45229 84903
16747 84903 49213 -82453 2291 152775 180132 123287 136758 218928 109414 113811 113538 118766
16735 118766 105819 65233 9823 -85607 -180 98836 96429 -61316 -190324 -155822 -77785
16724 -77785 -108270 -164163 -111222 -134142 -108167 -71199 -87461 -55620 67979 17116 -109053
16713 -109053 -44135 -30407 -34841 -125955 -147097 -77723 -3173 99519 59753 -13774 -52769
16702 -52769 -57002 -65311 9053 74422 54625 49626 26144 -21721 -78020 -113105 10501 89297
16690 89297 145293 112506 25927 76497 153871 135247 -16363 -48747 -48629 -124383 -129622 -25545
16678 -25545 -77880 -97297 -99167 -38755 77059 174227 55346 -21068 -148340 -251726 -248684
16667 -248684 -277663 -178113 -47887 81405 69640 19060 -23148 -140823 -193323 -225814 -280753
16656 -280753 -195275 -159955 -178340 -172038 -88254 -111400 -64343 48980 30482 5493 -73665
16645 -73665 -10157 -35804 -133573 -222207 -281037 -250954 -176436 -81853 -35158 -100506 -162789 -113901
16633 -113901 84417 139618 74496 90684 59657 -14383 -152974 -225035 -143237 -63472 -165479
16622 -165479 -195376 -121269 -20148 14710 40639 156648 126367 14798 88273 78745 160836
16611 160836 171654 110165 62941 48817 5746 65250 217749 215655 152320 67850 183470
16600 183470 257512 148881 157438 166474 187790 135622 47975 56088 -3610 -169408 -38200
16589 -38200 -40771 -69748 -47165 -34681 5952 75695 22737 -93168 -159528 -184217 -168635 -214490
16577 -214490 -215871 -11438 96820 212778 193933 194553 126046 76775 12105 34297 21946
16566 21946 7933 -18308 53472 204498 145493 125913 91567 109173 -10146 -116207 -301029
16555 -301029 -419473 -317184 -155727 56145 94054 -63731 -151350 -236256 -126823 -87237
16545 -87237 -100095 -154009 -58094 -174319 -176583 -130794 -262279 -284793 -135049 -93537 -147732
16534 -147732 -160820 -72359 -69701 -194413 -213999 -92572 -120575 -312412 -166632 -36265 -26205
16523 -26205 -106730 -95066 -68605 -85402 -149088 -128739 -69476 33767 10472 -255152 -213083
16512 -213083 11859 6580 -129455 -1594 235208 290725 160694 21408 86245 145950
16502 145950 28230 -42704 -106243 -58708 4738 47741 29957 -164096 -324117 -212076 -137574
16491 -137574 -168500 -349701 -292311 -54832 -94599 -247235 -219378 -304437 -339034 -132609 58258
16480 58258 145545 86853 122521 133362 8317 -22596 -19586 -63474 -39272 23313 -40160 -51949
16468 -51949 117757 86087 49338 178826 179956 108175 -20439 -172863 -121152 -64320 -84986
16457 -84986 -14984 144858 287292 241129 244277 313456 226452 171604 60951 24926 20614
16446 20614 122035 128335 -7920 79566 74803 58943 121750 34824 -24400 79293 84327 86322
16434 86322 75469 72791 87389 197345 283979 175169 95702 -30847 -31934 23148 90746
16423 90746 224082 160252 208784 85405 -15697 -76054 -63176 149570 131505 99617 91464
16412 91464 118601 240893 233756 148556 20935 -94625 -128505 -17263 -38478 -58013 -70576
16401 -70576 -45491 -42653 -14594 55074 82511 112043 209238 237646 201255 171559 47459 -26530
16389 -26530 -35290 -6272 18862 41598 817 35156 -50363 -145920 -112063 -11847 83017 177625
16377 177625 128748 160699 145775 80848 -14696 -22802 -36970 -5220 27045 -116639 -152777
16366 -152777 -62203 16688 52814 86857 154304 163014 93454 102512 21856 -56135 -49406 -31250
16354 -31250 22955 93195 137617 47003 83623 126781 179899 71425 -3026 -150287 -58590
16343 -58590 -127688 -241696 -167964 -81959 -30991 21621 112202 188823 107503 23964 47260
16332 47260 172377 197129 183034 162538 91511 -22328 -12770 20174 110765 150573 219126
16321 219126 200390 107277 32904 -89781 -32561 149 100583 116010 62253 -33852 -28928
16310 -28928 -18374 -68265 -96888 -87108 -5714 -67453 -199954 -66455 41802 97280 86272
16299 86272 64838 107614 131231 39089 -6151 -3897 -11638 29814 94095 117007 45633 18056
16287 18056 10987 127843 193408 198232 209866 85358 109267 79358 88430 273858 243393 149712
16275 149712 95493 155859 146735 19462 -32295 22870 144201 155643 215333 281209 212155
16264 212155 130053 251808 192792 36244 95179 164711 167347 203269 212650 127541 10533
16253 10533 76502 75290 -37151 -77412 -124273 -84092 35990 14648 -84458 -12396 42229
16242 42229 135201 120639 60404 61103 73051 42957 -18135 -142282 -84206 67132 75939 -23741
16230 -23741 -87749 4707 58275 118758 237731 153681 89557 187004 227270 269275 243568
16219 243568 299161 265180 363886 399299 221511 113472 103825 -1570 49283 137562 204468
16208 204468 249886 238377 247515 218298 318690 381346 379254 249720 141842 77159 102464
16197 102464 82657 28839 34052 40389 187182 239272 247809 134155 7399 -53935 2341
16186 2341 82601 29978 28180 11387 17090 25929 -50440 -72792 -44347 -6898 7137 -23923
16174 -23923 50145 110595 44456 60701 88218 232480 288137 183350 143060 273402 367406
16163 367406 349229 365766 461225 303581 165482 50093 37626 103433 132258 97691 92705
16152 92705 180802 233932 278058 413731 426495 418375 264413 156989 29556 59655 138419
16141 138419 353457 450876 333633 254235 314790 284225 205221 110844 15352 123708 226719
16130 226719 317994 322319 373302 298996 130746 144643 306364 332494 323139 325680 332469 152300
16118 152300 18606 -13201 22105 148141 221072 291676 227752 221866 255878 244103 -74427
16107 -74427 -113223 153331 372283 335856 115654 64564 -19603 33731 22915 18968 198168
16096 198168 178372 85512 110598 151289 -1674 25432 160337 112093 165056 191742 204959
16085 204959 292943 223923 286694 317931 273638 253160 363881 360808 332628 362705 447623
16074 447623 454457 443940 276183 219145 273750 325898 345981 312864 295654 175048 175656 147656
16062 147656 118660 195338 326307 353079 392296 422183 369248 260387 309872 365127 241271
16051 241271 244290 217863 223671 191180 317733 344786 346312 358334 281869 101706 84257 295456
16039 295456 471096 281363 291430 307532 268324 167463 163204 126591 166680 205270 128574
16028 128574 154954 341607 422674 336571 308100 317672 399338 374059 276343 272666 225865 205280
16016 205280 240930 226319 316764 332032 325196 387753 244805 232843 475603 458155 378974
16005 378974 233538 262582 234018 227782 209753 319606 402891 400675 446385 368477 277216
15994 277216 443515 480855 397944 361794 287082 291372 381633 318240 364317 356411 293132 287317
15982 287317 236374 195544 237917 247910 208025 321949 469687 456131 280252 243174 351818
15971 351818 353143 269354 312804 342122 309460 249626 90104 133345 219262 304889 220263
15960 220263 200287 300320 340587 387843 373739 362267 425294 432744 463434 494476 417397
15949 417397 545452 566284 453704 313370 145748 164910 202764 230299 283777 148500
15939 148500 67803 229777 400093 348843 273561 233210 293641 319717 314511 299893 241146
15928 241146 236719 225216 283733 295696 337551 441775 426659 368506 265873 122597 161049
15917 161049 224872 334208 297973 244120 334728 329422 369650 468633 311121 398061 408367
15906 408367 337074 276487 323948 293652 258152 282556 291223 278683 292942 258054 321921 446727
15894 446727 491166 506906 576432 656349 692420 595633 423459 390118 401736 529710 487203
15883 487203 406714 285742 206001 234688 257833 219512 227902 311083 360992 370726 438953 475156
15871 475156 546783 453506 297431 293588 398593 498087 418503 230090 172475 319603 439378
15860 439378 395108 415058 484356 460318 457172 456756 436340 341812 266485 299782 328307 389369
15848 389369 453667 433602 486849 472115 381293 439561 449455 407558 316594 226978 244812 325284
15836 325284 359492 451792 416517 429485 443106 311131 436152 441116 421528 503630 425708
15825 425708 361811 471985 479388 608059 677636 781590 724390 684297 607654 495395 441369
15814 441369 414101 511012 576646 655460 620825 626216 689849 694184 702189 684803 682706 682352 705535
15801 705535 637335 494794 443545 467801 438137 383570 385111 466966 416268 542153 517413
15790 517413 565960 498868 439613 446618 467314 492926 646149 692372 680178 591820 622614
15779 622614 639492 646927 477986 382451 450915 592423 508494 299127 180831 263404 460004
15768 460004 547337 644024 758606 687584 489823 348383 319221 339693 350746 440167 386602
15757 386602 457353 576854 601699 465466 410960 598100 600259 654056 748050 836577 816308
15746 816308 775983 758669 738322 687094 697676 785026 782530 708706 680226 611567 543375 452842
15734 452842 494395 634006 544647 503099 615390 517778 419455 366661 496749 515353 538995
15723 538995 561507 432271 329311 280785 400356 439227 526240 506160 496729 483147 410696
15712 410696 351328 420900 458080 412932 466701 356983 303483 540941 612733 552481 634040
15701 634040 609583 513641 446672 342328 446628 574389 600019 552938 637328 696046 619171
15690 619171 469944 414173 474740 698737 681189 674883 680316 465609 433160 503659 541027
15679 541027 576396 635568 566642 622407 600770 659903 628703 591630 616882 778513 758151
15668 758151 709414 571809 510129 699112 722024 641817 666785 720394 678585 799927 878082
15657 878082 808719 845567 868074 893062 790391 671873 724684 725908 758767 840249 749347
15646 749347 550823 402725 434644 491699 669938 614781 505816 472380 503423 531487 652468
15635 652468 736582 867834 865375 865610 876467 781296 739293 747364 920810 921585 873627 850459
15623 850459 862868 899965 827444 796491 899244 908508 955980 886918 669573 622476 696469
15612 696469 650432 663001 629428 667266 763833 741311 746552 705073 664103 765638 860599
15601 860599 894244 830266 719907 784862 781990 628271 562844 593647 646974 768880 883311
15590 883311 931517 829738 719109 790609 859021 821152 808010 771854 744250 735317 780670
15579 780670 862888 896339 834373 839004 912038 917990 888776 816892 825724 824324 803069 772382
15567 772382 836017 940679 927508 729116 696786 769937 750087 779316 741640 760904 740118
15556 740118 594416 507899 497481 499762 570148 699126 737093 664511 820529 759092 615710
15545 615710 659650 768027 775004 869841 867739 812480 770559 758642 801070 788438 716005 621166
15533 621166 553322 488022 617681 818529 864973 825449 851104 811694 819464 954629 886859
15522 886859 872112 1065937 900397 730815 919594 1090136 894634 812866 905352 847105
15512 847105 709406 774917 797694 861518 840333 926868 945168 1016335 967906 875502 829643
15501 829643 877321 699030 657418 855253 912367 1004154 1100924 1100332 1038406 953033 853236
15490 853236 885955 1009971 1045612 988978 1031673 964181 724370 559704 513986 565666 564310
15479 564310 658524 756887 889963 937898 814768 785982 781430 823651 895060 817051 794117
15468 794117 791806 957189 996891 965171 1024344 995629 886760 919601 1012302 924055 831708
15457 831708 989067 993971 975833 960961 925347 898465 929597 901544 908484 884039 926966 930091
15445 930091 860366 659446 698517 727419 789062 732476 824267 719860 725836 748222 692188
15434 692188 677400 606708 674029 729748 756354 917839 991840 895254 879227 793998 767248
15423 767248 858975 907541 942752 962010 910168 900138 1079814 1111049 1052741 1018560 1064284
15412 1064284 1025648 1097214 1161979 1040710 1021236 938243 705665 666255 679393 905159 1019547
15401 1019547 965841 952876 1007197 1110677 1206157 1144176 1087371 1074567 1052803 1084993 978932
15390 978932 901363 990974 1048533 1056049 947272 854637 989663 904605 935524 1026747 1093681
15379 1093681 1086449 979462 795291 866307 1026687 1050977 1104810 1115614 1027154 990122 926624
15368 926624 872848 849138 741826 553870 573567 769966 812074 864666 867611 863204 853046
15357 853046 822220 768047 821212 803989 663929 749383 854467 923963 901686 914256 815275
15346 815275 727259 649385 680671 782557 809825 790061 900138 868754 843902 861687 827053
15335 827053 795921 664624 643612 533681 618851 705064 787063 910739 839557 772295 747873
15324 747873 670643 672528 828301 895672 825812 866260 974343 1009362 876344 933220 886601
15313 886601 842442 799753 814234 828982 780902 733318 789373 883954 730762 668646 781495
15302 781495 798141 766527 892962 845127 920056 1022521 1054562 1044358 892117 938858 934210
15291 934210 859980 852376 886406 955236 1013303 935482 728484 650532 710991 692921 629947
15280 629947 604001 593484 732711 618420 573985 593358 637258 535082 417404 594529
15270 594529 698463 797480 744278 717089 781128 671089 590267 635091 705817 750267 707426
15259 707426 805593 904135 962297 871636 816275 884300 857628 860208 858630 866298 899903 771284
15247 771284 768599 747762 864083 981104 891647 805693 711941 789325 949008 845602 611997
15236 611997 583960 698058 914518 834887 744258 632267 555471 617237 595894 534832 567960
15225 567960 646661 596429 512819 343497 433448 534067 509806 583517 659334 714167 703640
15214 703640 640180 524714 596502 584930 742293 835903 715908 642814 661747 666950 616746
15203 616746 603695 606312 560722 605359 611568 640692 729154 663618 606454 649791 593598 585103
15191 585103 582603 626345 622531 693756 742305 638754 632545 563109 527451 499125 514810 599797
15179 599797 633089 552101 383482 378105 488854 540212 592253 659829 666753 644612 774938
15168 774938 811009 839036 766333 750116 691013 646559 685445 702976 693262 670777 694916 681202
15156 681202 750042 750114 752805 876182 875707 731747 590144 478313 453533 416748 366628 431500
15144 431500 719426 899015 838609 764640 790320 755409 708106 606118 667003 791955 805981
15133 805981 761037 663169 521156 352609 277831 473659 491414 412904 355722 399838 567969
15122 567969 591938 476509 576832 508782 381597 582634 573322 396524 369010 425951 414717
15111 414717 382329 476668 542506 546413 564957 580771 563926 632062 649741 601739 579462 542230
15099 542230 463698 412015 366088 420927 452634 449870 486452 606695 586231 521125 629617
15088 629617 495751 516140 548710 529269 689236 804874 792727 717301 632239 526235 531706
15077 531706 361052 379272 397676 551414 681359 670618 635198 474661 385214 389352 405456
15066 405456 563014 597618 653566 648819 616976 470278 375006 420315 584921 609747 498136
15055 498136 458169 390876 424438 430918 358282 404125 393689 337448 301602 333416 393059 459359
15043 459359 488026 468134 327742 317785 410712 378898 329518 360540 343440 498699 493208
15032 493208 414306 414939 593791 536239 451476 423290 481004 401825 447891 494395 548657 478213
15020 478213 448156 377613 457342 530651 566522 471142 510398 584396 501902 425328 392661
15009 392661 371690 395980 498552 525459 305834 282094 257167 115812 251641 527793
14999 527793 546723 391803 340536 409700 471935 502633 540573 505576 435725 342452 345938
14988 345938 511832 727363 688602 597676 535988 515776 503662 470732 565627 508485 310259
14977 310259 268777 334880 342964 300417 278784 324565 265211 173894 202392 214702 192561 324771
14965 324771 374158 390563 296261 230174 254476 361618 446612 697352 625535 496705 431834
14954 431834 416286 318604 204234 280128 414018 469878 515628 493702 430403 365877 253123
14943 253123 268223 176544 164803 377351 500711 482572 358604 368997 422766 435969 505023
14932 505023 508556 450918 367613 246046 290896 262671 264725 227669 90830 43472 79407
14921 79407 274322 275246 184690 183689 312586 250140 266068 247420 287181 262130 179285 171857
14909 171857 135833 265257 337846 368912 382154 309243 246119 349101 370900 401432 382430
14898 382430 460737 264767 249414 254865 120558 107170 157691 78046 105569 196405 136852
14887 136852 230132 244927 252557 201933 171957 336681 418975 355225 129288 127969 162378
14876 162378 178249 174323 344616 424224 307189 261927 327568 227219 61460 56685 216110
14865 216110 398047 452494 469666 447411 427013 318949 312934 298380 212712 287170 408186
14854 408186 392217 386722 439072 460490 409519 177084 28284 903 -658 13272 70182
14843 70182 -8339 -100437 -66461 11517 -42449 87301 238221 271863 243398 222950 210465
14832 210465 160011 196951 122556 57090 47639 132787 123183 256675 176294 78501 1984 65902
14820 65902 214542 268808 200075 133170 129339 214117 255511 320955 251436 -21426 -78835
14809 -78835 11486 94796 171608 166772 196397 260089 250671 275117 301326 396879 322056 352753
14797 352753 400217 379875 391852 301418 230823 145659 202857 326412 413789 513468 472135
14786 472135 337051 280427 234480 123416 128250 216477 171170 194264 187801 107359 26633
14775 26633 2485 41310 252654 245632 267745 196922 261699 177015 187472 161711 65446 145599
14763 145599 238028 201660 252867 287995 333665 211543 160480 216359 351856 169426 147299
14752 147299 252771 270222 256790 158847 116805 236871 217387 254427 307262 268195 237206
14741 237206 211200 177157 257269 251321 146400 232251 350015 307467 122735 127953 207019
14730 207019 213868 217967 415402 458632 438417 436946 256277 222690 192916 206090 189829 104732
14718 104732 226165 236663 280129 308126 227266 146464 139996 151594 184117 162135 130108
14707 130108 183648 172646 218958 254845 197902 131525 183269 240054 227229 206416 348602
14696 348602 371141 337420 332504 224839 109319 110307 205392 322617 245193 182789 165883
14685 165883 149161 169236 326610 268088 152487 118715 128281 174385 184658 193024 198608 217548
14673 217548 200913 159053 46226 75315 148757 154470 181035 305416 289464 370522 334719
14662 334719 370902 353098 359846 331426 469423 483776 323886 293192 314358 374311 290616
14651 290616 285346 349904 406763 373016 245127 276715 358061 356135 313173 332317 304804 291672
14639 291672 233758 187449 203367 284365 328417 218366 122754 56453 -64707 99013 133875
14628 133875 26897 70667 102353 186648 210883 175248 184789 274229 302705 265141 154904
14617 154904 81364 248680 323754 311693 278769 195077 184360 206928 265552 306824 342608
14606 342608 404552 369082 286831 225529 46683 -17358 -29950 9708 128393 193274 212084
14595 212084 75580 60227 243088 367752 289855 239172 202013 186674 129061 185292 161348
14584 161348 92765 185174 203615 199956 263207 319492 128479 170284 110308 117889 8079
14573 8079 109818 237242 210119 270341 156136 29986 91094 211958 115619 81096 79293
14562 79293 52863 148829 37385 -37181 23168 29878 114207 37175 44687 -27076 -48875 131367
14550 131367 131924 157785 156202 195593 187001 10350 -72939 12650 113483 165264 158064 171975
14538 171975 255829 376338 401512 354658 237520 130262 105305 208367 199133 145943 213421
14527 213421 281945 344379 331823 344956 258798 155857 113106 94978 -33536 -94331 108512
14516 108512 67356 20116 -36449 24419 34389 63957 140573 177806 167235 86325 172754 35845
14504 35845 -94256 79986 152279 185009 223628 271051 219117 114404 11055 -9096 -52721
14493 -52721 -40088 -94125 -93214 -36453 98249 231704 255785 110056 120566 250099 356980
14482 356980 376959 394538 235380 90325 97644 20149 51818 216155 109789 -56101 -50024
14471 -50024 -34627 18397 7802 70653 50573 20730 39674 201103 190273 152664 74434
14460 74434 100915 18229 25433 74103 115904 199225 233818 198554 148330 113756 106574 101447
14448 101447 121969 161282 242466 204756 224779 101414 -39712 -44761 19014 85096 82548
14437 82548 -85087 -62676 18721 36629 112614 121546 -58503 -61373 48132 -83734 -15920
14426 -15920 85736 63708 -54716 -125028 -112582 -103143 -157897 -4692 57609 92376 13340
14415 13340 -61882 121180 207600 237315 276967 188499 88176 135301 71570 -52127 16512
14404 16512 203534 352048 339516 167826 -87981 -143167 -29665 154560 169773 33992
14394 33992 -121921 -166077 -145799 -63314 -52284 -9246 103545 156907 9664 5500 -10400
14383 -10400 -4441 2244 25405 12071 25087 63584 60037 -49663 -6326 -43480 -71260 20159
14371 20159 131786 85811 55574 46423 52431 134397 228555 213801 110156 7167 25639
14360 25639 113828 134369 142149 123966 20674 32671 93980 196106 138705 -8300 -41804
14349 -41804 135191 269554 172772 59956 163785 256185 159477 242519 145402 93293 179377
14338 179377 177898 159829 239325 244248 252719 354401 148020 13618 -12137 40953 138725
14327 138725 138001 211768 173399 132299 146183 129602 203866 243949 239604 183502 -49570 -104617
14315 -104617 83338 128423 73145 -25071 -134811 -10718 85433 25474 4932 94071 132633
14304 132633 149030 244417 188667 32005 -122544 -61701 13453 85348 38447 596 2911
14293 2911 53640 102595 43814 57922 160625 98757 104909 224177 159800 56126 22328
14282 22328 146102 303636 295435 316180 155926 119179 223481 206329 110018 35764 66371
14271 66371 -21557 39818 90293 67546 98012 -25202 32002 146959 248504 236905 260649
14260 260649 134870 124844 122409 86601 8425 176510 354643 340451 216289 42796 11495
14249 11495 -43743 -112081 -119040 -127978 -133573 -60959 -18322 -718 110151 147701 104709 122227
14237 122227 132214 9530 5643 -52242 -206550 -212496 -123149 -87132 -15909 114757 151109
14226 151109 176859 130926 165016 206566 158447 119631 120355 135829 66089 13658 -57029 58806
14214 58806 213385 237888 233318 91656 -61578 -62008 -5027 -23463 55107 -24420 -9729 109418
14202 109418 303294 352575 453674 449398 532593 583945 415812 274925 186005 -49483 -70721
14191 -70721 -23628 30784 2633 84210 3569 51523 64729 93352 95339 10531 -106069 -11181
14179 -11181 181462 152208 116832 47423 26098 51730 93415 50494 64750 93018 52760
14168 52760 23750 21757 -43008 -25760 96026 121166 1062 -30905 -47107 -138332 -139039 -50057
14156 -50057 -195777 -223813 -203730 -169126 -113914 -11796 -48068 -115889 -74467 53039 75477
14145 75477 40347 84987 97926 144669 258906 283418 121676 44433 88901 12951 -38959
14134 -38959 -36596 -64057 -26206 -175235 -260364 -140303 15209 48771 7410 -89599 -164610
14123 -164610 -149815 -77974 -50930 24541 60342 90637 149825 267224 227868 215954 84191
14112 84191 82118 31711 1389 80440 112043 214788 205469 223944 122258 25037 -68995 38123
14100 38123 21153 41347 26348 2493 -112223 -132234 -24623 17242 -393 89614 118726
14089 118726 46528 78316 136510 19674 -19136 68353 128577 69610 -15469 184169 148697
14078 148697 88852 80475 -625 -106310 -101923 -106222 -135426 8046 158137 72850 -90354
14067 -90354 -99258 -107136 -92600 -99924 136666 277759 138134 13786 -38998 13127 76831
14056 76831 65138 99496 188625 276576 215434 326370 355194 299904 196984 129828 133317
14045 133317 162818 170952 124014 131473 77197 -20266 -150655 -288507 -234005 -244911 -159692
14034 -159692 -21599 29057 -204222 -313362 -275450 -241717 -188000 -170898 -151326 -76100 44041
14023 44041 90997 95127 -13475 -55447 75899 140850 124784 68318 117813 223368 187521
14012 187521 136838 208546 291314 149124 152293 108644 42332 23902 8491 -91109 -20604
14001 -20604 81809 75621 20639 36024 90570 88264 34736 150556 205931 238637 83353
13990 83353 -66993 -86282 -10989 -53682 19975 156914 258616 153868 118137 31331 123570
13979 123570 195991 122110 125886 121884 142052 177220 33864 -38363 31758 461 -23354 -41963
13967 -41963 -65827 -30070 -92247 -126387 -17707 9024 10532 2764 -2216 62503 53706 -37149
13955 -37149 -115292 -53597 -19506 -81208 -125410 -53726 18559 78311 36771 150061 270478
13944 270478 175407 84590 156701 69817 -45 24129 3768 -134337 -212959 -63284 160546
13933 160546 183531 215702 198572 298503 380541 309428 115330 -992 -44729 -17717 31065
13922 31065 46386 -36341 -49688 -121901 -85870 20601 131555 172070 85032 -6457 -7734
13911 -7734 -67882 -130950 -168642 -121454 -80598 -72848 -135163 -167622 -53729 75399 161483 123476
13899 123476 303426 359655 339081 323963 313291 373189 317643 268354 373153 273319 190146
13888 190146 318184 274590 164659 88431 125320 99079 105684 145547 223245 121645 16058
13877 16058 94524 70668 171610 244851 242431 314825 488401 517023 455328 517789 597117
13866 597117 553540 539815 567509 719759 909445 1044794 1149538 1292021 1543546 1849149
13856 1849149 2137449 2309424 2223472 2107021 2006124 1976961 1842988 1593546 1157715 943853
13846 943853 789554 537148 448031 506803 405290 348491 314177 268423 257269 200796 202714
13835 202714 247181 318640 378657 333958 401703 562275 623837 484115 424388 310595 374668
13824 374668 470579 421884 441047 352974 199641 275612 449671 395323 298678 233802 71831
13813 71831 233810 393388 485268 399470 324193 303243 376993 410067 386714 358512 472345
13802 472345 435057 239736 161027 152317 153125 231234 193456 147890 178631 145743 84194 32678
13790 32678 454 -38901 -18719 -54968 14384 192516 248198 226353 169119 81269 52385
13779 52385 87596 46124 41876 89345 90116 -28453 -20584 -106434 -177640 -79571 21751 128292
13767 128292 128254 71639 3233 -73361 52505 100182 122124 42845 24258 91385 87305 184632
13755 184632 270094 144269 50155 25880 75247 82784 149867 154453 121607 97211 91307 65727
13743 65727 -1551 12818 111262 22230 41787 115350 122149 230997 260310 349386 230679
13732 230679 2860 -104207 -54999 54787 5087 -85874 -33842 112640 157965 78268 105623
13721 105623 171006 326290 412628 335579 283310 301986 430425 442878 436785 454426 403943
13710 403943 268862 263384 260484 176716 110816 190913 339241 246317 338007 451370 453112
13699 453112 453715 586092 730544 728718 679555 666196 617431 715780 765757 748258 623548
13688 623548 424891 381720 462228 496906 418728 319566 340988 200607 220139 293989 141995
13677 141995 175788 249584 321987 292301 194426 270431 316083 136847 174221 285171 233924
13666 233924 223353 204483 279409 78681 -7012 25506 6289 138359 257039 259478 297159
13655 297159 413702 382249 293400 265881 166220 195875 162452 102160 229975 177888 170264
13644 170264 208215 181388 46642 37597 129719 210766 274056 317567 308904 323801 450937
13633 450937 566138 669297 522510 237603 168204 293337 250891 150113 87459 60839
13623 60839 112937 264860 430743 525158 546538 472358 308258 464208 466962 402420 274660
13612 274660 278552 503287 570228 488645 263131 242173 363036 594779 544390 411983 396083
13601 396083 468638 499640 487710 449652 429713 442408 368907 330163 348646 388718 370073
13590 370073 342266 275876 205641 259070 267267 339127 351330 320899 350538 405378 446106 417341
13578 417341 454584 430129 540532 614441 690737 835273 909361 928697 1012362 991259 1041906
13567 1041906 1070057 987739 992543 1037377 1132823 1059745 1135985 1193908 1250892 1137555 1094890
13556 1094890 1057898 893761 668415 611165 557291 577588 650656 641664 726120 663301 622389
13545 622389 772640 801213 682259 606303 595145 629891 731034 928317 1041471 1026770
13535 1026770 1052422 969073 1025073 1156535 1129035 1167104 1324513 1308724 1353098 1476266 1533983
13524 1533983 1544332 1547086 1549560 1641384 1587758 1610057 1565663 1635696 1807723 1785295 1830843
13513 1830843 1900383 1928309 1914240 1847908 1937964 2106416 2147282 2110378 2104225 2166701 2094484
13502 2094484 2278055 2357397 2405753 2504187 2523556 2509567 2640658 2700217 2799235 2924049 3042897
13491 3042897 3136736 3077257 3083550 3182480 3200623 3224373 3439247 3562643 3670712 3813300 4016227
13480 4016227 4206261 4403172 4421221 4516640 4681937 4820506 5121404 5333499 5648813 6094086
13470 6094086 6587148 7052886 7751853 8653219 9509271 10413111 11250547 12191727 13292541
13461 13292541 14388648 15701035 17171523 18936811 20880777 22884125 25247834 28026961
13453 28026961 31261233 35093531 39752169 45453340 52659567 62074933 74477945 90786443
13445 90786443 112858975 142017292 179161871 223604356 272413320 321531889 365746437
13438 365746437 399652203 419114234 421647412 407965723 380162844 340647813 292902091
13431 292902091 241516534 192763600 150591344 117686940 94540236 79015594 68737623
13424 68737623 61813789 56868933 53302605 50495827 48065864 46088064 44275440 42640159
13416 42640159 41080203 39724603 38634910 37698036 37055912 36404069 35738139 35073217 34120349
13407 34120349 32932381 31535424 30071451 28322411 26488650 24760069 23068490 21608368
13399 21608368 20121483 18852946 17740685 16676187 15663257 14698294 13942519 13199716
13391 13199716 12459576 11753979 11175860 10700977 10154394 9496981 8916738 8374935 7938604
13382 7938604 7493601 7120380 6732134 6332896 6078538 5899640 5651274 5300518 5002323
13373 5002323 4821329 4685257 4598356 4402429 4050115 3713819 3471220 3252787 3134668 2967161
13363 2967161 2634835 2400352 2317688 2210667 2139865 2075914 2095461 2113334 2001436 1878571
13353 1878571 1821479 1725415 1557500 1360600 1350799 1358429 1386447 1472452 1537293 1292510 1060858
13342 1060858 936004 939702 1053549 1083113 918210 814688 812028 884609 893109 889976 924139
13331 924139 957837 891586 845777 788395 716617 593819 461214 525158 557802 576674 539043
13320 539043 459587 419118 465987 595738 674953 626588 573173 645787 715354 685007 703910
13309 703910 690007 588677 429369 434706 473616 513429 500241 464913 404519 402343 453242
13298 453242 361344 315812 340410 405333 573587 652163 840587 766706 667448 680878 603121
13287 603121 587137 650652 567579 518287 568645 527133 538192 502236 591350 744518 773760
13276 773760 659166 704252 661692 560972 568234 623912 688327 692671 655190 594660 442579
13265 442579 428782 348718 411790 627204 608993 508862 444368 454802 494170 474428 426833
13254 426833 559765 713505 646489 571860 528204 452411 585353 590525 615338 679171 875022
13243 875022 965449 928886 829631 656419 538558 549562 636057 695666 661446 600559 618113
13232 618113 567315 454239 343148 221774 186717 267452 244392 288499 319835 471703 409811
13221 409811 327757 262165 241218 253874 320236 242356 355101 451360 399312 376894 385646
13210 385646 410514 384156 333290 291412 298348 277837 340519 429338 570774 637915 640985 834687
13198 834687 957439 1095902 1060295 937216 762738 561421 418837 492192 512634 391024
13188 391024 266295 258055 290517 353167 395102 466626 512719 514887 453197 380609 454977 309735
13176 309735 219666 239081 303347 230111 160811 271453 292590 395192 558188 553508 431027
13165 431027 314906 296415 452451 539812 543705 387910 278972 323577 338547 308605 275698
13154 275698 353075 383538 392882 249626 231464 317198 354966 245914 85721 -4816 68699
13143 68699 91314 42497 69641 -57733 -111919 62214 267833 225442 138829 127101 199258
13132 199258 257237 284930 332866 366059 438360 552050 644916 599221 471825 479041 461739
13121 461739 390335 278604 322884 444530 394853 332883 339930 204100 132759 38595 27761
13110 27761 104768 175205 302217 334699 206791 215533 269681 292156 315464 193894 212966
13099 212966 282257 263710 240093 303178 291610 159445 202820 194749 234685 291343 272379
13088 272379 372445 496625 601360 521379 491150 486055 496983 393188 432087 547434 467944
13077 467944 341373 388083 344984 299373 230485 318928 372934 307824 177191 140813 172805
13066 172805 280432 196122 168417 203154 217275 328596 388181 295318 161343 182392 184905
13055 184905 173296 72444 -4070 97494 72704 -89936 -90828 38120 75097 106962 182774
13044 182774 130639 96561 217022 60749 -141595 -169404 -106013 32948 175317 320048
13034 320048 356798 289860 297841 271716 120357 109693 9766 21448 75434 124837 289506
13023 289506 340591 319222 618524 849417 998903 1347221 1769404 2036449 2104114 2133598
13013 2133598 2227009 2180698 1954699 1724648 1555912 1398687 1068560 778361 617208 573873
13003 573873 370259 210954 318787 411834 285107 232341 264212 264980 254090 276875 246062
12992 246062 207477 127341 84712 173531 187117 125452 32838 92743 117755 114303 218035
12981 218035 272617 231044 224107 330209 419930 470349 352550 333726 421947 474721 510378
12970 510378 583520 718128 704583 596475 630322 546396 468693 412483 221690 255995 264718
12959 264718 124190 209736 257988 254567 167799 191886 213107 107476 67962 120456 91634
12948 91634 152832 219384 202791 231730 206256 175410 119274 72966 213787 276000 114151
12937 114151 -58934 -81790 128480 304597 314355 254812 185174 -24395 -20066 170941 334165
12926 334165 252602 126823 142716 154152 73144 22097 65004 220788 311568 194576 215042
12915 215042 258516 181050 135807 78181 -4682 -52593 -72699 -110023 -47779 152749 242909
12904 242909 295248 194533 8237 -17867 120201 121008 100249 -49551 -63903 -32955 -38285
12893 -38285 -23115 43556 -36035 4337 14328 4309 28664 -18182 -121469 -122177 67529 101617
12881 101617 133803 159630 184921 135315 118028 63658 75882 145247 172691 64233 19758
12870 19758 63120 66446 170833 225132 202021 208294 252456 236505 140264 91213 175432 257415
12858 257415 221274 238297 106922 125060 81026 17185 88485 64640 61021 120583 105002
12847 105002 52592 68896 -18226 57577 208013 98289 216449 225562 232233 243947 251868
12836 251868 244061 128662 81197 39575 53329 25767 2378 25994 81267 134458 250641
12825 250641 259292 388460 356935 248987 192590 315041 370047 267013 185459 213608 252068
12814 252068 509540 387006 367956 484071 398113 423267 444469 320953 306530 347060 318291
12803 318291 196899 148811 187004 177817 197292 252907 344645 310802 73375 50208 288383
12792 288383 388943 495013 400616 288478 321329 342177 414100 536698 630194 641528 663162
12781 663162 822518 888365 870469 873162 847967 1057192 1279514 1365730 1431253 1581025 1615226
12770 1615226 1767952 2027095 2429154 2849433 3236010 3704972 4175559 4775275 5722380
12761 5722380 7091238 8906224 11120647 13600865 16049344 18364747 20427847 21949961
12753 21949961 22626749 22491615 21711890 20201585 18157124 15819863 13297397 10738095
12745 10738095 8613476 6866796 5686673 4744519 4242553 3941501 3690005 3572250 3342540
12736 3342540 3154304 2974888 2896222 2782417 2680474 2639153 2649890 2496241 2443327 2467599
12726 2467599 2526853 2572591 2503764 2374019 2300466 2268353 2103539 2034087 2017178 1949568 1969452
12715 1969452 1953547 1801604 1817954 1847347 1809841 1825791 1909559 2101201 2246924 2302843 2275520
12704 2275520 2365576 2543899 2666794 2784990 2918398 3101363 3361709 3675542 3941140 4351959
12694 4351959 4727673 5109194 5575297 6395422 7118146 7992814 9289679 10736313 12712092
12685 12712092 15527326 19099470 23462563 29238393 36087954 43602641 51041402 57971552
12677 57971552 63599809 67119277 68256303 66987614 63539240 58147497 51417307 44008711
12669 44008711 36338809 29167304 23176190 18556684 15202565 12900519 11481640 10577796
12661 10577796 9861522 9121865 8657047 8358849 8018348 7547130 7324595 7155432 6979570
12652 6979570 6813416 6555965 6378525 6313696 6081631 5744109 5475367 5285636 5054085 4810529
12642 4810529 4473500 4273094 4182334 3985318 3747596 3408607 3255515 3207427 2983517 2617446
12632 2617446 2447331 2391562 2327318 2176530 2072478 2014216 1853961 1784847 1761713 1725564
12622 1725564 1736178 1720515 1591129 1539150 1454970 1282287 1162953 1013328 1182074 1099069
12612 1099069 1070426 994067 1127688 1261762 1357278 1412587 1446246 1547512 1495312 1399621 1482738
12601 1482738 1638237 1594036 1350665 1222800 1152068 1026193 792909 635960 586754 552407
12591 552407 443111 308615 276116 425879 363025 520696 709417 585353 426835 442087
12581 442087 443923 504245 502182 361357 317623 255081 234837 255778 266552 304227 337713 322330
12569 322330 323362 367331 276936 134364 191610 245339 223448 178961 199727 203333 218046 182337
12557 182337 137282 144366 480 6789 -4556 20551 132753 194255 213635 310341 269717
12546 269717 162127 95003 32532 -59825 -83200 65796 136678 294445 265295 116221 63329
12535 63329 64966 220618 340107 320476 247790 20991 -85532 -120562 -61712 -29277 96889
12524 96889 45831 -11316 30873 65604 27994 83446 70684 165260 181208 125988 141249 118799
12512 118799 8696 80059 121665 22071 -61282 -85223 83047 209734 177802 198420 138658
12501 138658 53478 -30711 -141684 -163842 -177388 -153323 -15736 189762 214644 103292 126637
12490 126637 146243 112939 163830 95508 20259 -29506 -29742 -129580 -215129 -146212 45455 177317
12478 177317 78307 22364 42202 118640 123397 168201 115924 55495 86277 -77002 -216206
12467 -216206 -91306 85107 101766 3583 -100956 -152113 -137741 -145783 -144797 -158901 -111962
12456 -111962 -25304 6437 60498 132912 239050 315778 253912 151422 29088 -60893 -32070
12445 -32070 44152 -28557 -13570 63322 69386 4891 -72501 -16048 101352 148887 138805 201598
12433 201598 95451 98978 75337 15415 65475 144953 127841 11657 -75430 -4244 92640
12422 92640 95813 189969 153245 146427 154495 27551 -91334 -174962 -186562 -174901 -240473 -174820
12410 -174820 -210109 -237483 -248024 -177669 -201397 -240915 -162725 -128866 -61840 -43390 -68303
12399 -68303 -123851 -280915 -252886 -87080 -24601 -143006 -235030 -112601 -14807 26267 -62620
12388 -62620 -90168 -42175 70832 89544 16534 73484 76734 12288 -91241 -197742 -181958
12377 -181958 -187935 -90190 24983 41019 47424 2510 37060 7520 55617 -53833 -122209
12366 -122209 -120276 -86443 -137989 -130662 22324 103532 108453 31926 -80907 -9445 -51165 -129079
12354 -129079 -32913 88801 174877 225116 282165 297195 213896 67795 26119 -122867 -255987
12343 -255987 -101609 64837 68002 97915 144754 134658 230269 221138 135164 153585 233945
12332 233945 141391 67996 37109 -2076 -59823 -15783 130656 87914 39688 1247 -70009
12321 -70009 -151246 -150045 -108377 -17125 -52457 -89296 13342 -45349 -104676 -16455 -51167 -71744
12309 -71744 -137129 -223414 -348520 -259461 -136790 45482 36269 51529 -83963 -197193 -145060
12298 -145060 -116129 -1896 73403 70408 84506 105034 7029 -43367 -109886 -27924 -54379
12287 -54379 -185495 -85453 -15003 36777 84903 26737 -11492 -99962 -67506 -61560 -174572
12276 -174572 -236065 -235197 -155939 5695 -87196 -136197 -24134 22689 49916 142355 202697
12265 202697 247039 227287 374391 405650 457809 531108 414800 264583 172596 87768 -22833
12254 -22833 -33411 -38797 -85205 -134594 -102466 -52841 -105491 -147333 -196398 -99911 -59289 -102754
12242 -102754 -150136 -194214 -323200 -361167 -290652 -173255 -163661 -207458 -189186 -136674 -171690
12231 -171690 -156788 -156837 -125591 -228085 -294492 -325327 -275023 -150557 -186703 -127952 -164060 -50364
12219 -50364 -42384 -103157 -157498 -31344 -25372 -89932 -96507 -26424 -25200 13032 127496 147853
12207 147853 189384 149937 164548 166552 87095 88919 79538 73744 38799 19375 5106 -41788
12195 -41788 -25040 -94333 -15439 72570 96941 58662 96711 41578 64663 63694 -99509 -142384
12183 -142384 -24120 -30822 -59516 -74555 -17156 37058 -46528 -148832 -107094 -47700 -23253
12172 -23253 -204195 -224464 -167490 -173451 -141889 -103894 54582 54802 16049 -11859 60782 109939
12160 109939 215502 128199 5096 -19392 108327 138547 149165 89838 -7699 -51418 -194985
12149 -194985 -238945 -187141 -202088 -153830 -112638 -140208 -273320 -370898 -405712 -288151 -236238
12138 -236238 -229682 -162094 -109432 -11075 -12390 28138 -23670 38712 138190 183903 14709 -48994
12126 -48994 -27339 -81339 -96213 70432 31622 -51100 -32457 -89402 110228 159530 66724
12115 66724 49626 75349 69385 38410 128268 141353 46066 67108 114426 -39445 -65586 -10359
12103 -10359 -56326 -107097 35741 86603 96363 11494 -67385 -111237 -138139 -252007 -243723 -183050
12091 -183050 -127817 -69246 -105188 -65102 -126386 -166580 -238444 -216671 -38570 -31080 21535
12080 21535 29148 117273 190916 295687 220422 58122 153799 193958 54724 -39793 -167439
12069 -167439 -218447 -173195 -90832 -89782 -214147 -205232 -226028 -196697 -107360 -189279 -153360 -187655
12057 -187655 -112205 -64157 -80080 23888 249384 250047 102392 -20963 -28767 -7480 -68415
12046 -68415 -48407 -38858 -114007 -155456 -166966 -177885 -199653 -211077 -146346 -160600 -51939 124032
12034 124032 155196 170365 22412 -71378 -145047 -126305 -125242 -111603 -19469 44707 -83093
12023 -83093 -131182 -106870 -77474 -53208 -134179 -106097 -185902 -346535 -379797 -241963 -109863
12012 -109863 -29710 26267 18273 11488 16530 50676 90641 28430 -44089 -127629 -168416 -237249
12000 -237249 -203682 -214803 -129446 -48596 -171570 -241886 -305692 -359548 -295752 -233330 -246776
11989 -246776 -379792 -271463 -165015 -274659 -318351 -292159 -246396 -270117 -246583 -82643
11979 -82643 -109730 3750 40602 -43273 -132559 -173615 -207527 -215824 -171904 -13607 11213
11968 11213 -72591 -41923 -22959 -77921 -201509 -222484 -125223 -74953 -98625 -14438 -23299 5389
11956 5389 -83252 -206553 -194523 -172883 -62641 49433 21813 -116270 -138699 -101108 -80900
11945 -80900 -148693 -233178 -194244 -205358 -170734 -145349 -116145 -84980 -194279 -149896 -228122
11934 -228122 -307576 -269981 -297640 -141070 -352417 -525972 -456083 -362691 -323051 -334249 -305555
11923 -305555 -214626 -322234 -246140 -107266 -78597 63571 49659 90443 101170 50892 -54867
11912 -54867 -52613 -112614 -205372 -158641 -68344 16456 -42744 3700 37443 -148268 -312225
11901 -312225 -380688 -245910 -107349 -13262 68467 87635 53730 -37418 -90355 -116182 -261515
11890 -261515 -208116 -241268 -294491 -292243 -275299 -222306 -113465 -85863 -28952 1595 -25470
11879 -25470 -12813 -4512 -121166 -152614 -60801 11767 -207588 -142206 -44404 -69256 -138006
11868 -138006 -124497 -124022 -182074 -193481 -159105 -30900 52398 103949 -81351 -115280 -97077
11857 -97077 -52462 -147985 -175880 -146664 -70816 -22638 81068 44920 -51757 7813 34679
11846 34679 -94074 -208252 -234217 -247004 -131155 -85660 -141820 -69513 -1297 -16615 -83195
11835 -83195 -46636 56991 131665 41802 58884 -112948 -125191 -163305 -206390 -126473 67848
11824 67848 126699 31578 -4799 -101562 -156420 -141271 -144888 -109820 -119610 -174126 -177845 -162684
11812 -162684 -25784 -5287 13892 -125675 -228269 -207938 -242752 -301640 -264550 -192033 -129370
11801 -129370 -114425 -196312 -183501 -216863 -165696 -74601 -43545 -58572 -181587 -229201 -126945
11790 -126945 87290 179051 81434 -49867 8713 106044 68170 -80068 -154860 -305275 -119294
11779 -119294 -70326 -42986 2370 74308 -144116 -225738 -168003 -99698 -93030 -127736 -55447
11768 -55447 -140092 -225298 -187874 -143832 -212509 -213419 -144704 -243671 -160077 -67634 28152 -44350
11756 -44350 -122651 -132208 -92468 -60557 -5983 34152 144233 114571 21756 -41331 -34233 35499
11744 35499 28131 4196 -965 8592 1723 -84704 -190121 -212581 -223069 -233969 -322840 -226206
11732 -226206 -216246 -342992 -180755 11673 -6005 -100218 38030 229863 257019 178939 77160
11721 77160 127797 225431 235116 122082 52823 19028 57561 148449 82578 66063 58312 32324
11709 32324 80985 -42215 -206076 -172739 -145000 -146040 -96781 -112493 -81087 -418 27275
11698 27275 5003 -27252 -111653 -273619 -258883 -214304 -140498 -123684 -108482 -87970 41951
11687 41951 21666 51579 30563 -69583 -119945 -66174 -124885 -248874 -143442 -7510 -7347
11676 -7347 -162590 -288742 -307026 -209720 -170263 -160348 -157705 -218265 -100744 -41657 24188 -78684
11664 -78684 -72826 22359 -63584 -33394 -58461 -89362 -108040 -43006 62741 15570 17826 -10737
11652 -10737 -113874 -164775 -126392 -153154 -2060 -27146 -117510 7548 123322 101917 70352
11641 70352 -58373 -157252 -87832 -199729 -260928 -255669 -206800 -308270 -344074 -291842 -99755
11630 -99755 20888 -67292 -142665 -112837 -6661 12664 -32931 -105101 -188038 -101467 8024
11619 8024 -51764 -88475 -33268 -116770 -232383 -98853 14796 -16794 -138772 -286711 -178275
11608 -178275 -157539 -49758 -73389 -228534 -218990 -196181 -140976 -220094 -201414 -226664 -111301
11597 -111301 -145463 -198347 -144754 -110427 -212957 -244673 -131861 -54355 461 3036 -94994
11586 -94994 -196038 -204288 -304020 -260137 -166016 -85003 -26705 94272 -8405 -109303 -233220
11575 -233220 -149942 -114402 -116946 -258748 -385573 -397253 -348506 -231772 -186576 -166259 -88685
11564 -88685 -80292 -170247 -288620 -277568 -187567 -47904 -56858 -37130 27176 -44188 17680 -58684
11552 -58684 -125231 -112484 -81068 -78422 -14122 17780 -41578 -242184 -166377 -186984 -237626 -246360
11540 -246360 -272509 -364148 -286700 -191994 -325082 -270641 -223447 -152592 -79476 -70913 -145029
11529 -145029 -48592 83469 146516 54278 -69481 -32294 -29729 -91080 -161174 -147405 -110473
11518 -110473 -14367 -77008 -66151 -65326 -86579 -116141 -67365 -79740 -30226 -53984 -97845 -115484
11506 -115484 -43813 -68521 -209725 -261951 -202272 -219947 -150267 5066 79863 116098 20484
11495 20484 15010 43752 -94396 -72909 -164297 -114124 -85998 -243797 -239030 -203099 -19188
11484 -19188 7051 -43991 -37734 9086 -55232 -132820 -259526 -288318 -110651 33354 68308
11473 68308 -37520 -150114 -173587 -281184 -199182 -60720 -44593 -186686 -186207 -92056 -20681
11462 -20681 -121441 -92825 -82207 -90752 15384 52118 125259 72392 -22224 55485 -3116
11451 -3116 -59474 -124361 -93892 -137066 -83861 -118604 -39889 54844 45611 87237 64964 8535
11439 8535 -149928 -271050 -236455 -118050 -131063 -300331 -319689 -278008 -208378 -177193 -89906
11428 -89906 -119756 -35180 51962 193506 206356 40513 -99295 -232973 -191395 39092 80289
11417 80289 38942 30114 -3793 -90497 -143936 -269985 -295982 -267330 -240857 -178395 -114437 -129249
11405 -129249 -187460 -245944 -252681 -182110 -33046 -52109 -134838 -183863 -132534 -112043 -80594
11394 -80594 -22871 -119921 -194086 -154012 -93907 -109546 -226407 -202918 -257378 -251786 -109475
11383 -109475 -25096 2734 5772 -25828 -71330 -211432 -429646 -407368 -240082 -277488 -277659
11372 -277659 -219482 -220390 -162463 -35795 -20611 -18400 -38811 -30716 -127452 -143856 26549 84031
11360 84031 4217 -41030 -77472 11619 -51819 -117761 -214512 -146962 -121526 -58176 33991 126063
11348 126063 86365 42701 6531 -127180 -97991 22819 67512 18858 -102094 -151648 -100079
11337 -100079 -20479 -16028 52440 57456 61112 74794 65206 -102331 -195550 -127056 -54449 -125205
11325 -125205 -165661 -211079 -246343 -251556 -223627 -52771 57347 -8705 -56531 -66328 -66632 38108
11313 38108 168637 237123 228228 253013 200194 94247 45150 23358 94694 27547 44054
11302 44054 37193 -28580 592 116251 41117 33897 -115686 -128658 -98292 -143 179093
11291 179093 146775 144720 233104 109587 40050 -131363 -298470 -264631 -253769 -167659 -224178
11280 -224178 -169260 -29501 -61133 -96146 -61533 22559 -4234 -53420 -72930 -187685 -296873
11269 -296873 -258460 -151002 -68861 -226781 -283099 -294177 -244683 -245713 -179219 -112084 -63665
11258 -63665 -75848 -81482 -98602 -106774 -167273 -206953 -304472 -272086 -49196 95923 104923 90345
11246 90345 10436 6632 -51418 -122794 -180754 -128833 -99426 24007 48732 89061 80973 -108065
11234 -108065 -180479 -159380 -128496 -131099 -176033 -183846 -137093 -90890 3409 20794 -1216 -126035
11222 -126035 -142779 -92993 63151 211440 159825 217562 73408 -137854 -114664 -75235 -87107
11211 -87107 -79429 -45819 -39289 -181664 -280448 -220167 -187896 -198674 -223970 -207217 -264022 -229217
11199 -229217 -85109 -124094 -54725 -60932 -155657 -158239 -83417 14923 29434 118329 103360 -75369
11187 -75369 -118218 -137658 -216374 -40346 14719 36783 61584 141230 140922 139650 179608 142933
11175 142933 71120 46564 -113245 -227759 -160936 -221168 -214685 -233171 -138897 -152999 -262711
11164 -262711 -196277 -52770 -132276 -84822 -4183 74538 37290 45360 195297 237923 183730
11153 183730 35221 32371 -3934 42468 51455 -19374 -85753 -67139 -165654 -226506 -225893 -302729
11141 -302729 -259267 -89799 94314 105145 -97758 -200260 -161932 -111621 -85465 -95301 -35343
11130 -35343 -46709 -11383 2618 -70928 -101016 -64501 -91865 -61951 -44232 34693 -105306
11119 -105306 -270353 -302380 -202967 -68846 -33490 -79073 -136895 -198402 -178653 -32186 90316
11108 90316 -33942 -206230 -181058 -74795 -104532 -218415 -245942 -145737 -42584 -17232
11098 -17232 -49856 -51040 51593 31094 48236 9780 -140088 -111729 -96954 -163418 -274379
11087 -274379 -352295 -461813 -487555 -382592 -270127 -304459 -327431 -393042 -424685 -263612 -161179
11076 -161179 -132521 -119874 -103433 -106813 -56934 56618 53656 -37268 -106143 -167768 -118213 -154086
11064 -154086 -346 78620 39433 -102038 -209663 -240092 -140761 -112131 -68757 -42884 -17640
11053 -17640 1979 11819 -137133 -170460 -125378 -205596 -163785 -105511 -85989 -169335 -229515 -219150
11041 -219150 -178500 -38407 55296 -116527 -99208 -117597 -140082 -148902 -130856 -9774 60686
11030 60686 80873 51595 63667 64225 -28693 11110 -44491 -234083 -197927 -65416 -109799 -180688
11018 -180688 -264029 -237413 -221237 -159842 -156992 -49356 24264 84207 51738 -50080 -70450
11007 -70450 -107650 -121964 -13848 -19810 -208464 -304799 -285634 -272683 -246184 -194723 -83113
10996 -83113 23143 108820 67948 13545 -85329 -33989 -41404 -60309 42051 88571 45499
10985 45499 81627 59326 118691 40895 -71858 -48689 50488 19487 -206526 -274027 -239949
10974 -239949 -214406 -219631 -170602 -69773 9507 3707 24802 -21752 -56538 -79746 -132209 -26186
10962 -26186 -130792 -117946 -154709 -122245 -158591 -148305 -299171 -258910 -329151 -224553 -169020
10951 -169020 -241009 -317797 -330524 -296968 -228806 -175490 -327117 -172696 36438 145942 101882
10940 101882 62591 121890 8161 -75871 -11981 -53001 -126304 -212859 -99685 7634 -19544
10929 -19544 -68375 -12609 1464 -83922 -74718 -73925 -166016 -148234 -172082 -73469 -52879 -176023
10917 -176023 -7238 -97102 -117428 -61004 -33062 -2558 -45263 56816 115815 102850 103381
10906 103381 -58320 -111861 -79777 -70798 -123838 -51872 -43951 -89117 -25522 -110138 -27438 14781
10894 14781 -4449 49204 92740 24954 -92810 34657 80142 55567 74427 -18804 -121991
10883 -121991 -87173 -80644 -147766 -182848 -200874 -107496 8498 70219 -1811 -4771 -25707 -54025
10871 -54025 -143426 -49718 -84380 -140056 -148682 -25497 163319 202066 120722 -19065 -140608
10860 -140608 -157934 -148000 -169113 -47356 107717 20758 -5019 -78788 -87175 -104085 -132719
10849 -132719 -66681 -72080 2875 34450 -112656 -217148 -84347 -22592 -189645 -297119 -169231
10838 -169231 -31275 76888 71215 61244 20021 81326 4096 -134288 -228793 -196314 45077
10827 45077 117795 97743 187225 277253 244812 228282 288918 267041 134150 25346 -47649
10816 -47649 -162841 -147809 -144457 -60851 -61488 -142507 -213617 -270650 -213171 -71322 -88177 -28162
10804 -28162 20793 63596 62618 -14829 -36314 -107893 -105946 -136881 -214837 -234753 -304388 -372954
10792 -372954 -332679 -331878 -372656 -233753 -130520 -26711 -77968 -82901 -148728 -95737 -98516 -162744
10780 -162744 -224216 -95382 -58908 -206001 -248254 -212795 -119752 -143942 -107165 -3951 25266
10769 25266 -50849 -116355 146654 216893 101870 -8348 -63084 -43687 -1679 40286 115943
10758 115943 17487 -109647 -192473 -210900 -66737 34807 102591 130981 81912 -40006 -51970
10747 -51970 -23454 169 -55178 -113520 -166192 -63030 11826 83137 177873 301561 328405
10736 328405 260114 188397 42977 -46214 22615 69054 21425 -132598 -104035 -2070 -80114
10725 -80114 -268727 -246644 -85549 -47390 -255752 -203874 -130472 -180285 -100041 -118311 -195898
10714 -195898 -97167 74766 123995 242451 249149 53865 -117317 -129536 -58018 -106937 -342834
10703 -342834 -345744 -393452 -315556 -93870 -166769 -326388 -309458 -212607 -288340 -268680 -197074
10692 -197074 -43677 108970 123081 149726 84539 -100759 -227339 -75422 109983 115613
10682 115613 -7887 -139415 -66805 26069 -152237 -192196 -234011 -298098 -359510 -210555 -196313
10671 -196313 -224100 -162563 -262580 -160266 -35513 -12621 12588 80447 205171 188734 -109715
10660 -109715 -320919 -326824 -209444 -34085 160307 180625 21289 -48759 -26869 -108533 -71498
10649 -71498 -18939 -37072 -81236 -147496 -10601 20898 -26337 -37144 84600 135851 6989
10638 6989 -108605 -147125 -114062 -96109 -167863 -152437 -142394 -77266 -22791 -118548 -154437 -39014
10626 -39014 -14388 71458 51491 115034 247609 187991 -91779 -178112 44219 198191 40066
10615 40066 -56219 -43704 14030 61620 42458 48484 -37287 -133706 -206874 -70586 -117426 -218407
10603 -218407 -197550 -224968 -263220 -228521 -184867 -195866 -81045 -85378 -37754 22781 -33131
10592 -33131 -136606 -199163 -267661 -282902 -231174 -283813 -272346 -246864 -237354 -75924 -15845
10581 -15845 72468 80160 -6874 -55448 -16452 29776 7795 -153100 -317436 -280347 -218655
10570 -218655 -281774 -234387 -215823 -167699 -269394 -361954 -394517 -337406 -232480 -155518 -151151
10559 -151151 -216485 -232234 -128732 -166105 -163898 -242010 -33748 144933 80794 -119281 -188297
10548 -188297 -212654 -168945 -178753 -149305 -119116 -83843 -102506 -101695 -75558 -44302 -33378 -2173
10536 -2173 -106273 -187070 -203960 -75285 -135312 -181193 -154620 -1731 -19532 -116449 -133481
10525 -133481 -229935 -210933 -85536 -48945 -107292 27720 104524 35700 -69050 -85696 13712
10514 13712 -31937 -65097 -92051 24593 -9371 -176365 -194717 -144588 -56292 -89372 -107162
10503 -107162 -74233 5471 47369 133516 88530 -54390 -133552 -62927 -124875 -259511 -235714
10492 -235714 -184213 -208101 -71890 11185 -22869 -133254 -109252 -82099 -61167 -72905 -100107
10481 -100107 -213402 -268137 -150237 -89300 -64379 -52036 -23934 75399 95820 79047 40819
10470 40819 45747 -2341 -62228 -242395 -198975 -56729 84399 131541 23883 -46077 -159502
10459 -159502 -181136 -71480 106411 66372 36043 107950 163239 93350 -40168 -158854 -180918
10448 -180918 -98495 -18336 -168318 -153480 4149 25391 -103758 -70105 -37594 27100 99350
10437 99350 73974 -76009 -57539 70865 -49238 -191526 -30596 91183 174137 152044
10427 152044 167705 115630 -16082 -116651 -171135 -74877 -29400 -34613 7879 109338 137622
10416 137622 131909 110465 77189 107655 148618 230674 220308 156421 277125 403650 148218
10405 148218 58354 98727 -46781 -176860 81297 167735 245221 239027 221502 53322 30932
10394 30932 -17360 175090 325606 391656 450872 361639 307079 264998 194503 131718 -37297
10383 -37297 -54504 29581 27070 128710 206970 313820 378174 409418 376821 376776 433416 637140
10371 637140 802416 804809 867163 1001437 1122671 1348150 1622766 1816914 2209197 2923900
10361 2923900 3745467 4705617 5814173 7104197 8755634 10437314 11833123 13156501
10353 13156501 14335329 15193816 15506068 15122145 14282800 13096453 11731490 10367304 8840374
10344 8840374 7206860 5883084 4780015 3938847 3324523 2791449 2429959 2193265 2011188
10335 2011188 1771174 1715436 1619089 1625046 1582225 1432723 1324986 1351640 1210188 1152371 1202020
10324 1202020 1241637 1230419 1157927 1047249 1006439 1077838 999912 923913 892901 831214 708110
10313 708110 637927 642183 582951 503043 592972 552971 535749 635426 774576 687611 600737
10302 600737 661101 694380 741653 704763 745324 853139 917968 973518 1036601 984970 953982
10291 953982 915603 929329 870639 935086 951896 741337 464841 239195 148531 92157 97594
10280 97594 88623 195064 117856 123421 227544 228765 210199 250932 262975 263428 312015 330425
10268 330425 267595 198341 157320 113226 247072 314069 391736 355694 299949 139962 228642
10257 228642 243680 80149 20847 242411 255691 89130 3461 41595 47170 -61747 -137198
10246 -137198 -111552 137212 189752 251881 409162 397325 345826 280523 202981 28246 9515
10235 9515 53033 72135 111726 136187 225283 246148 160540 142171 152415 59681 37649 9786
10223 9786 64237 154644 64385 -78174 -28055 3958 67759 60627 25121 65451 120025 4839
10211 4839 -27005 -90504 -22884 188934 237857 202740 225250 184228 199149 217321 159752 100366
10199 100366 10922 16713 -135191 -75631 22277 89518 86802 40277 133888 284445 219279
10188 219279 241414 144954 19357 35855 132162 33139 108533 125579 159058 88070 -57131
10177 -57131 -83548 -68881 -89702 -65074 44984 -81823 -66067 -42014 -192217 -227097 -290108
10166 -290108 -241678 -121000 -3851 133511 185575 75949 19734 -22723 -34568 26980 -61464
10155 -61464 -102777 -53559 -33861 -26726 87159 136095 144216 75394 138708 96180 -68571 -72705
10143 -72705 -85816 -166726 -257420 -151345 -97567 22864 88973 77464 104136 114491 -29315
10132 -29315 -70634 -67818 -109166 -101521 -153045 -112072 -167728 -40790 26346 -17468 -19802 -32255
10120 -32255 -32674 -74288 -36123 9636 134542 100 -108249 -60238 23551 9257 65725
10109 65725 61954 73673 93528 68584 5036 -48717 -64127 -75049 54183 152630 105705 43969
10097 43969 12443 -19934 100165 71004 151510 184038 100377 96298 120961 58550 17544 94621
10085 94621 122257 147123 78451 -37991 95148 39001 -167892 -130977 -94133 -185868 -138066
10074 -138066 -55618 -35648 -37237 -81707 -52916 -80475 -41352 24841 -100570 -140310 -34090
10063 -34090 51196 147687 294803 245095 155734 87433 -30699 -201174 -164267 42765 54211
10052 54211 97583 12990 -32299 14198 -27115 87672 138845 16576 -159750 -137353 -27764
10041 -27764 40856 -8164 -136759 -127505 -83146 -179225 -210617 -203821 -91203 -19168 29108 69219
10029 69219 136915 175503 151575 222130 263546 229784 138630 62695 51759 140687 261715
10018 261715 266685 287232 187762 -63545 -128470 -62442 48474 -3098 -122454 -143975 -154329
10007 -154329 -69705 -304 20964 -38227 -86388 -75288 -76341 72559 221875 255648 219280
9996 219280 184578 -28602 -181510 -162267 -153624 -167375 -192338 -128527 -67200 -186498 -258113
9985 -258113 -174048 -119168 -178000 -52919 144577 118554 78344 -22335 -100030 33062 90998
9974 90998 113592 133597 138120 83937 112059 119163 64322 -83615 -230697 -267238 -167524 -68165
9962 -68165 -42042 71636 110353 250568 264943 333897 307270 397508 324760 208174 64088
9951 64088 8193 -22978 -174692 -253290 -240323 -31458 29869 30526 39511 2432 68111 199037
9939 199037 228637 155185 150707 173287 188149 225912 326346 348689 415928 619336 600293
9928 600293 592725 678524 625648 362064 201863 132472 106422 128310 -36828 -10167 201423
9917 201423 134476 90427 147958 89203 -112109 -254404 -160154 903 130618 203851 246710
9906 246710 173531 65616 -1141 16907 -870 185915 353073 268606 185510 234663 195214
9895 195214 57982 15849 176642 221072 136402 119693 80564 96053 15406 -102329 27538
9884 27538 135261 181979 128642 22141 -49291 -60906 -77615 13653 17434 46271 97183 187276
9872 187276 293648 240344 193638 199665 238377 372447 619088 822130 1046452 1308803 1514190
9861 1514190 1714221 1725765 1639367 1362757 1056907 760869 549370 487795 247843 91748
9851 91748 138814 59794 -13645 33063 308 -29579 -82417 91807 261618 151787 17583
9840 17583 -32322 20802 -35526 65271 193545 234110 234554 139173 -32463 -82459 -86558 -44991
9828 -44991 -33097 -104447 22894 41806 39589 66683 67630 16958 -5001 -25291 -2414 123456
9816 123456 144574 92092 -41455 21681 2010 40021 113727 127027 176973 198873 90460
9805 90460 -59023 -197308 -161171 -26392 54927 56466 63382 174026 229825 232398 97680
9794 97680 -31820 3370 61692 124894 140021 136338 12719 -5808 -85385 944 -21622 15386
9782 15386 20610 76288 29526 94020 210618 287814 220966 194475 249593 300726 347384 402464
9770 402464 319712 161595 43100 6833 -40409 -70160 -36324 -14276 65316 233241 277507
9759 277507 262683 140680 36031 3740 6073 -29078 26633 58490 158645 94935 146750
9748 146750 157582 91630 165836 257811 215689 71936 -1964 -24135 33310 -18112 124978
9737 124978 259160 145728 38801 52125 113721 149785 173072 272482 373998 324748 306480
9726 306480 225630 205704 207311 197735 163259 98976 56703 11068 76020 231846 157145 23470
9714 23470 35073 -38550 32742 234615 277350 115963 -23941 -107515 -155463 -118583 -44745
9703 -44745 55922 191209 294085 310003 307340 286513 321516 208368 233410 341729 384561
9692 384561 336892 241610 236506 338669 284492 164314 263911 429110 491603 464806 262138
9681 262138 113337 -20933 52433 -19739 -103876 -38553 48915 -11551 -12323 101317 222836
9670 222836 208649 217682 214860 280130 395659 492702 558496 529686 613360 702892 668722 668877
9658 668877 585268 512172 578545 739307 742986 610334 644256 657194 662854 642825 677298 510307
9646 510307 445620 392638 322683 150773 248615 279289 228086 192142 310402 517085 575508
9635 575508 423742 456415 450008 337701 379103 390714 353311 316786 389089 390531 528407
9624 528407 551715 619509 568499 545921 665671 631375 736001 760120 847896 949785 938700
9613 938700 871418 814911 727574 710577 819438 961025 923901 939589 990009 893190 833117
9602 833117 772088 543043 546249 628853 615809 437574 425346 538230 470070 539268 558042
9591 558042 575131 573149 331980 221675 215619 197790 377452 427893 432118 522904 585926 534490
9579 534490 540245 476837 488697 606720 708958 892938 932696 895461 907190 991412 1057842
9568 1057842 1028872 1141903 1300022 1499067 1581111 1598152 1516359 1280889 1083915 1115668
9558 1115668 885800 693258 626197 695517 624802 533331 571197 536102 488376 622615 643638
9547 643638 552929 466424 424465 442410 353223 170429 182329 272204 362738 404692 303782
9536 303782 316686 375795 294745 316413 387141 424320 373427 507496 724510 783542 790575
9525 790575 770038 713212 687148 864101 994057 1013779 915358 892479 969458 935577 968829
9514 968829 1160745 1099282 997905 976226 1001566 1075790 993117 934954 818624 526863 404712
9503 404712 508679 602126 690911 611755 566975 560666 574060 412294 550849 627048 524852
9492 524852 566625 537712 462529 504771 549825 616950 617959 649085 689442 644773 505623 432836
9480 432836 460505 573542 616411 542909 597004 661221 640928 624466 582565 510684 437533
9469 437533 511209 610799 545151 566006 546402 482556 465595 285225 267958 392735 291873
9458 291873 389081 505301 552796 537758 437456 596278 703091 610776 682412 759644 798923
9447 798923 862429 798901 710076 681033 817526 961527 1032773 1034784 1172066 1191613 1197811
9436 1197811 1027732 966766 1080331 1129439 1144992 1091245 977566 885172 859443 873628 828813
9425 828813 778894 769154 878568 946194 916452 970682 1088975 1010121 1050648 1025970 996643
9414 996643 961185 1102564 1304479 1267722 1342267 1343454 1430228 1596017 1675592 1635532 1599173
9403 1599173 1554469 1516693 1503794 1530516 1420932 1551993 1600164 1549528 1535653 1630688 1809559
9392 1809559 1723363 1559053 1518444 1484312 1581864 1567318 1470932 1559674 1566030 1532907 1482235
9381 1482235 1447754 1572928 1665283 1732028 1646976 1668675 1680475 1721287 1717890 1964904 2177358
9370 2177358 2043361 1828136 1694813 1735003 1743073 1804509 1813784 1783544 1572480 1365703 1449126
9359 1449126 1599161 1523006 1461882 1389891 1438326 1454251 1414884 1282568 1207182 1311520 1278446
9348 1278446 1082603 1169584 1324997 1461327 1524257 1514713 1510762 1488999 1505204 1609889 1632161
9337 1632161 1673838 1594738 1563969 1682922 1715406 1854692 1933063 2010676 1987645 1926445 1923169
9326 1923169 1858531 1871854 1820970 1770093 1714134 1640107 1495042 1483708 1475431 1451166 1482418
9315 1482418 1442521 1439298 1376080 1295248 1373246 1422609 1535974 1603272 1437460 1167202 1253251
9304 1253251 1434520 1530385 1584866 1536479 1566119 1590952 1610698 1562887 1555248 1661560 1627002
9293 1627002 1577050 1606083 1646716 1649545 1322612 1116927 1114276 1150786 1291764 1581522 1628081
9282 1628081 1571473 1469963 1458311 1488708 1581573 1709941 1876480 2046690 1998040 1876163
9272 1876163 1838526 1808117 1692369 1511561 1394793 1391783 1376537 1491321 1607120 1640264 1629192
9261 1629192 1524924 1502548 1515348 1439992 1425024 1255080 1176228 1152028 1229883 1275550 1326948
9250 1326948 1226784 1072127 1031380 1013455 1064532 1104970 987240 892523 968161 1112311 1166378
9239 1166378 1089452 1041931 1010533 1161815 1155596 1125432 1126853 1204402 1277473 1085554 1041070
9228 1041070 1077071 1050341 1069724 1091613 1210769 1140904 1091585 1139549 1061117 928741 948737
9217 948737 978130 902409 844727 1151442 1196251 1265923 1345975 1404624 1340952 1351610 1400650
9206 1400650 1451132 1341426 1386999 1434829 1440591 1383046 1194623 1233779 1425778 1408126 1423195
9195 1423195 1300732 1267805 1317749 1313920 1289042 1334696 1524889 1676154 1631341 1610051 1772281
9184 1772281 1883490 1832049 1852824 2019879 2180017 2415204 2416075 2490878 2503217 2513316 2441712
9173 2441712 2258309 2028521 1803731 1677427 1664766 1652250 1726813 1814436 1846660 1910014 1916556
9162 1916556 1798701 1750877 1702558 1590053 1541239 1620369 1666748 1674619 1709086 1724307 1699947
9151 1699947 1741566 1951000 1992069 1876980 1822282 1749729 1609121 1578112 1600015 1708307 1811698
9140 1811698 1918866 2079848 2008568 1896462 1969430 2076879 2089732 2149907 2086117 1998995 1918779
9129 1918779 1897688 2026060 1915977 1781351 1726500 1815893 2051705 1962375 1867588 1845800 1930990
9118 1930990 2112283 2166553 2034079 2000948 1978734 1786235 1761734 1763943 1677948 1603374 1617379
9107 1617379 1888209 2066600 2092162 2118228 2168277 2200827 2103909 2152018 2120320 2147241 2222927
9096 2222927 2127741 1944360 1868607 1882815 1650442 1513977 1704284 1746504 1720688 1610351
9086 1610351 1651716 1550445 1482314 1549106 1678816 1641391 1704928 1759901 1606305 1513493 1425030
9075 1425030 1462242 1543424 1580489 1702027 1750884 1778708 1777954 1810998 2013474 2107230 2071808
9064 2071808 2163353 2313112 2195880 2119531 2171519 2264461 2268312 2330571 2510151 2587226 2491671
9053 2491671 2443502 2503394 2476844 2213974 2240203 2311877 2414372 2419942 2360346 2112212 1964856
9042 1964856 1828457 1704578 1593020 1643394 1685011 1628191 1640108 1884143 2056328 2126901
9032 2126901 2115660 2041656 2079644 2203121 2223829 2174891 2236639 2224601 2133307 1906326 1788000
9021 1788000 1825867 1734846 1623959 1581028 1624031 1661169 1767469 1772801 1897352 2068425 2087435
9010 2087435 2141963 2076428 2076313 2232355 2217421 2154988 2090535 2025443 2103434 2097010 2012285 1996357
8998 1996357 1957553 1857836 1683882 1488976 1351613 1422680 1376785 1358244 1446228 1475627 1607704
8987 1607704 1698954 1784211 1922364 2027608 1992200 1986846 1889567 1836510 1915719 1877920 1709993
8976 1709993 1690429 1614434 1543429 1540338 1479980 1449596 1413381 1273512 1268820 1353003 1236639
8965 1236639 1262849 1324163 1330701 1224508 1164004 1081990 995474 1021568 1058576 1110556 1165440
8954 1165440 1198520 1140201 1198682 1284723 1396095 1228328 1147113 1186046 1261214 1303521 1322559
8943 1322559 1284179 1242584 1144026 1012502 875169 821259 838364 985474 922689 976620 1028573
8932 1028573 1040507 1000242 989944 954367 883899 837800 789942 810091 741387 669318 644943
8921 644943 644466 687829 757484 798404 747230 781349 823441 824706 749981 895842 961898 857551
8909 857551 808900 950745 971263 855621 948019 1140991 1321236 1264702 1247947 1418177 1659188
8898 1659188 1649806 1687147 1881473 2033778 2252317 2535418 2851441 3197306 3782240 4545063
8888 4545063 5469631 6531574 8042464 9822828 12105103 14939276 18022002 20314658
8880 20314658 21333380 21005221 19494740 16309574 12517002 9555778 7411310 5854575
8872 5854575 4973339 4432019 4005537 3626491 3426028 3128803 2787525 2553932 2507905 2631760
8862 2631760 2552972 2290205 2167405 2091905 1967498 1981510 1855059 1904774 1993577 1910527 1858642
8851 1858642 1935292 1962243 1815074 1721076 1718780 1768858 1724162 1621351 1401251 1373317 1429707
8840 1429707 1264762 1213035 1235416 1159851 1166998 1211467 1167101 1143020 1053127 957765 984867
8829 984867 1080349 1169759 1192027 1182123 1108397 1175655 1160081 1099168 1172136 1296866 1382944 1350274
8817 1350274 1462320 1479592 1505006 1458274 1396349 1311371 1297602 1299433 1268058 1229916 1224437 1147385
8805 1147385 1092717 1041440 1262554 1596992 1706989 1637801 1664484 1534657 1527647 1575641 1658158
8794 1658158 1883912 1988471 1985899 2089480 2285772 2410859 2570595 2633004 2715329 2539058
8784 2539058 2450176 2513261 2578109 2680851 2723575 2789334 2855278 3009169 3140953 3206272 3246311
8773 3246311 3319612 3437745 3588848 3646676 3606886 3669082 3691589 3769984 4017000 4139552 4240072
8762 4240072 4335883 4485153 4660084 4788431 4895815 4832010 4965996 5254589 5726179 5929242
8752 5929242 6208039 6418486 6676367 6933244 7267342 7673988 8006293 8283251 8744890 9070865
8742 9070865 9351572 9555635 9825116 9999270 10121441 10134279 10004159 9958333 9803298 9680180
8732 9680180 9700618 9717460 9638302 9487197 9362411 9555385 9589946 9563808 9643929 9743489 9764948
8721 9764948 9986706 10217163 10395710 10734214 11198898 11626565 12114421 12484804 12818757 13404563
8711 13404563 14078685 14667753 15269255 15881505 16488336 17185843 17860486 18469752 18893109
8702 18893109 19475998 20150141 20701013 21320982 21919355 22450254 22999594 23560442 24133907
8693 24133907 24528322 24802053 25011814 25098709 24920988 24461351 24055321 23746286 23558051 23486364
8683 23486364 23325366 23286100 23615891 24035184 24577924 25084644 25429796 26011916 26708285 27571446
8673 27571446 28543448 29411505 30318060 31416019 32505590 33539893 34635868 35650014 36525619
8664 36525619 37107068 37714167 38487247 39142069 39886393 40698333 41522727 42415361 43334777
8655 43334777 44326087 45468370 46884374 48526851 50267751 52355545 54796067 57438012
8647 57438012 60470892 63963781 67986730 72419258 77174509 82168277 87345620 92810360
8639 92810360 98122543 103186161 108068037 112614519 116926200 120760813 123837540 126208474
8631 126208474 127542161 127842511 127200246 125811931 123650308 120913948 117947760 114725054
8623 114725054 111195407 107579924 104126308 100953079 98342653 96206861 94489535 93451337
8615 93451337 92947989 92534839 91959006 91108100 89660253 87399591 84355174 80725695 76497151
8606 76497151 71968687 67389096 63044555 58897816 55082980 51569043 48467897 45811995
8598 45811995 43358582 41154675 39208894 37457555 35836335 34287667 32932802 31597045
8590 31597045 30079000 28703707 27403292 26148222 25205446 24417152 23720280 23110415 22445179
8581 22445179 21736106 21105996 20513785 19969492 19413962 18929975 18371372 17678597 17112588
8572 17112588 16606320 16089440 15607758 15202240 14742760 14389772 13931520 13377113 12781184
8563 12781184 12135153 11422199 10882964 10450373 10051210 9753719 9547837 9278950 8857581
8554 8857581 8583671 8403676 8209408 7853153 7357831 6962771 6691935 6500694 6404119 6205625
8544 6205625 6010783 5786148 5545037 5370562 5187936 4924727 4795183 4856036 4847192 4775753
8534 4775753 4473657 4316800 4138368 4006579 3989105 3836824 3587135 3365441 3388416 3355162
8524 3355162 3293431 3139833 3066710 3057264 3015955 2923303 2891524 2835337 2857334 2792303 2635460
8513 2635460 2572588 2560905 2445939 2371923 2287063 2201766 2267925 2452656 2438760 2381146 2316132
8502 2316132 2255719 2182206 2123116 1993158 1992132 2078296 2073970 2088686 2106038 2104410 2116275 2200414
8490 2200414 2240740 2186395 2224850 2324812 2390594 2453453 2634663 2731384 2636053 2701276 2673154
8479 2673154 2578436 2441977 2317783 2326770 2301079 2173740 2194825 2303231 2406860 2434469 2363472
8468 2363472 2308541 2170749 2067829 2067372 2036705 1772790 1708204 1808708 1827858 1906791 1933582
8457 1933582 1858829 1902911 1943432 1960686 2138144 2154995 2182657 2169471 2136456 2090145 2131797
8446 2131797 2129668 2069761 2236396 2264705 2237105 2279842 2323959 2349420 2414558 2520422 2601754
8435 2601754 2520462 2288101 2323157 2387136 2430531 2299686 2165882 2133803 2087704 2021868 2005748
8424 2005748 2181137 2188538 2062339 2080680 2000493 1938878 1902143 1763213 1835751 1878728 2058398
8413 2058398 2158328 2144400 2132116 2184337 2262242 2227788 2225958 2247843 2238193 2248395 2352308 2584698
8401 2584698 2655795 2619690 2528953 2652118 2857287 2991759 2989846 2992838 2942092 3086870 3288166
8390 3288166 3318615 3371714 3325540 3220803 3113529 2952830 2880234 2752067 2578247 2503251
8380 2503251 2460707 2388568 2298013 2139516 2095732 2088444 2078306 2155690 2245630 2200098 2075451
8369 2075451 2037074 2250429 2428909 2434821 2404103 2336837 2240795 2429369 2467310 2406551 2403690
8358 2403690 2368253 2376190 2420623 2341186 2417483 2592901 2680520 2759315 2757038 2645195 2655203
8347 2655203 2771407 2675134 2579296 2533856 2593592 2649337 2679618 2574515 2626516 2557451 2445072
8336 2445072 2356526 2277600 2253993 2160212 2187946 2227636 2254222 2269978 2344847 2440114 2312220
8325 2312220 2277277 2315956 2387921 2480097 2392083 2268126 2381477 2566728 2622729 2574168 2672202
8314 2672202 2777936 2856071 2930831 3042749 3126287 3246053 3179194 3242511 3181687 3107412 2952650
8303 2952650 2862067 2924000 2831132 2826506 2874096 2702146 2549781 2546663 2678550 2917457 3015349
8292 3015349 3073936 3031759 3021847 3080199 3146064 3182427 3151785 2971687 2844476 2714235 2596252
8281 2596252 2586294 2563000 2484126 2558429 2631369 2622541 2620918 2634539 2565389 2629330 2765254 2764883
8269 2764883 2673828 2594616 2519715 2327932 2364136 2372773 2410888 2331804 2413423 2450159 2438991
8258 2438991 2461959 2511982 2413298 2371769 2327636 2373599 2332253 2336472 2288806 2386165 2414370 2436455
8246 2436455 2416754 2449598 2547350 2644630 2602426 2648542 2688786 2804936 2737361 2553877 2459306
8235 2459306 2358290 2381341 2313967 2136446 2071948 2145148 2173462 2208054 2235197 2317693 2376252
8224 2376252 2390086 2595211 2853955 3030974 3094322 3088833 3037704 2728491 2431571 2372513 2310185
8213 2310185 2124997 2154444 2248474 2322575 2299269 2336666 2305673 2225659 2261117 2214597 2156996
8202 2156996 2113967 2036396 2012128 1943791 1924941 1976745 2061840 2140686 1954874 1916295 1933442
8191 1933442 1892303 1932459 1954709 1999109 1966490 2153772 2529698 2738600 2968261 3423347
8181 3423347 3804954 4166846 4841534 5736836 6713976 8285508 10430671 12596379 13986990
8172 13986990 14443954 14027864 12605107 10183121 7807541 6126032 4927517 4203304 3868717
8163 3868717 3627222 3358927 3122078 3110141 3105104 2961214 2937135 2940966 2995281 2860682 2749906
8152 2749906 2689335 2743295 2740014 2920243 3246245 3238908 3292926 3429014 3567866 3785425 4138993
8141 4138993 4433637 4789533 5310324 6067207 7146608 8553903 10034483 11605236 13136702
8132 13136702 14110090 14489247 14030492 12722598 10898700 8832088 7118860 5922701 5199807
8123 5199807 4703699 4428557 4404664 4315093 4248562 4206937 4284115 4342056 4354200 4323280 4357979
8112 4357979 4355825 4453795 4546355 4557453 4528241 4549315 4888402 5048353 4856678 4757891 4836786
8101 4836786 4878937 4895454 5032524 5010092 5170176 5447200 5411150 5396570 5533817 5935857
8091 5935857 6157749 6466642 6717178 6977180 7460177 7875439 8216458 8761308 9423813 10274158
8081 10274158 11121052 11827096 12554533 13494938 14454822 15610660 16928513 18357563 19944313
8072 19944313 21690957 23776245 26085190 28654199 31417044 34386088 37502727 40287213
8064 40287213 42879155 44961795 46402139 46975885 46940936 46451818 45530818 44785196 44212836
8055 44212836 43569646 42956792 42590865 42311562 41952314 41614155 41437744 41302595 41111299
8046 41111299 40998950 41091329 41275329 41625697 42204321 42648795 42947738 43281636 43738357 44084094
8036 44084094 44275572 44795371 45926588 47556601 49691746 52587824 56546816 61607836
8028 61607836 67997874 75868050 85746798 97944426 111896975 126067152 137605765 143346407
8020 143346407 142807604 135544628 121140919 104095565 89132549 77601488 69024571 62687555
8012 62687555 58003508 54499391 51748009 49463964 47342275 45392073 43443573 41418054
8004 41418054 39309218 37612652 36243688 35179243 34432500 33906146 33641665 33490150 33622623
7995 33622623 34126980 34736212 35311759 35918729 36575131 37426364 38163523 39078160 40222256
7986 40222256 41476924 43371797 45848140 48768212 52053531 55711961 59513211 62667836
7978 62667836 64954033 65786854 64844672 62023247 57883712 53181566 48138110 43129858
7970 43129858 38821992 35318500 32529867 29948616 27576287 25606001 23695047 21898709
7962 21898709 20343849 19012450 17933933 17149977 16404747 15701575 14995339 14245471 13636330
7953 13636330 13045607 12549662 12118394 11716188 11458159 11288584 11073143 11019460 10906668 10822780
7943 10822780 10695305 10776908 11098516 11606824 12107954 12522988 12893074 13166234 13249491 13013713
7933 13013713 12419879 11588627 10490866 9463919 8800736 8217231 7607753 6973693 6391468
7924 6391468 5888672 5460563 4926494 4599674 4333918 4062693 3754177 3576804 3493879 3354511
7914 3354511 3240761 3016335 2877389 2869807 2687958 2698070 2612467 2585061 2617564 2628402 2487193
7903 2487193 2256133 2062487 1935870 1897604 2044360 2134020 1936421 1907105 2021338 1946014
7893 1946014 1764009 1831041 1948791 1982622 1840817 1647959 1602013 1537364 1449206 1354562 1274031
7882 1274031 1284572 1232704 1207036 1214192 1334268 1395935 1291365 1132523 1051194 1070927 1034577
7871 1034577 1046669 1087826 1069570 998129 974273 1002499 998614 888372 887673 842404 797232 645156
7859 645156 590046 775689 958157 977886 973086 977651 837259 722530 653083 654901 664532 657361
7847 657361 708171 651252 561917 448380 470486 487576 594584 674176 760373 711533 759644
7836 759644 574731 562008 768680 768942 565418 505880 605973 655339 702770 717759 707647
7825 707647 571538 447989 455787 357706 320631 374894 427289 414068 401297 482987 544858
7814 544858 598189 489469 341702 230860 193796 240200 275457 391943 476858 523646 429151
7803 429151 430005 432376 418928 432553 416976 290632 254271 319185 371576 434405 368492 326744
7791 326744 311745 195303 140775 218130 225014 160881 276859 342610 389364 411618 381976
7780 381976 252803 238603 315400 475621 397158 289625 266514 228971 170829 78034 21056
7769 21056 22721 177118 405269 402245 316938 122310 58728 130274 182717 126341 93372 192054
7757 192054 240151 317780 382486 374753 357362 302601 199305 207722 183920 227688 145152 96484
7745 96484 227130 205396 138350 144690 118670 210514 279139 302153 216336 194415 280756 237253
7733 237253 143468 52742 -162891 -165370 7993 77741 112549 116422 142315 196522 343645
7722 343645 250018 227944 171266 122437 62084 35000 169887 228362 210007 124536 116318 273630
7710 273630 177460 -86078 -201424 -235652 -223648 -269349 -192299 40454 94456 99621 150081
7699 150081 149282 75779 49147 126961 161463 244288 168840 289567 351308 350557 262813 203310
7687 203310 142362 115936 124564 171567 209909 181041 195628 179997 133481 186287 91968 -11685
7675 -11685 -11083 38862 109276 181169 248880 222022 165887 224905 176249 224597 284405 159489
7663 159489 222029 250032 265036 247691 283565 377320 375802 294729 312913 267437 174205 107086
7651 107086 106417 132133 98310 147898 118455 188367 183507 156826 51337 223320 307285 370486
7639 370486 266568 135191 63359 63092 61933 229278 244691 195932 216524 391002 480005
7628 480005 513795 529130 625847 783814 871053 845651 792306 751439 659396 627379 583598
7617 583598 451772 376599 376957 344452 313027 223128 171196 124180 77297 121808 79422 80697
7605 80697 113613 79375 208348 217517 182842 74059 -26456 43172 17498 165836 201136
7594 201136 219302 137533 227150 232307 224961 216615 177276 187118 323270 335782 391355 539186
7582 539186 553089 521938 368937 316541 276412 228432 271517 306102 239912 179776 155030
7571 155030 200835 144508 168644 279971 200800 102705 -90527 -142832 -109516 106651 343189
7560 343189 310519 171394 93758 74178 180126 267634 219846 77029 -16455 -3529 72404
7549 72404 74177 126674 208429 325640 352621 216781 72127 50925 80235 50391 53123 24781
7537 24781 121988 15983 49680 115293 130519 78430 106257 -76564 -85423 -123422 -146470 -25632
7525 -25632 63661 63634 109619 61784 102993 68536 72467 13867 22502 72093 -2227 -67359 -43147
7512 -43147 31764 10163 -45580 -88361 21799 24371 -7459 -143810 -292018 -318226 -286638
7501 -286638 -317438 -415593 -258393 -151928 -5025 138980 219129 46251 28241 86145 57552
7490 57552 18382 91358 84672 17003 -143620 -280208 -103619 -14960 -148389 -307003 -128372
7479 -128372 -31359 -45886 -15022 123940 146376 31443 65928 42113 73587 146151 177514
7468 177514 155904 14427 78556 177022 187958 244550 227702 84806 -23827 -150513 -102212
7457 -102212 21217 226405 341447 313032 59008 6753 -11487 -231717 -212985 -183110 3083
7446 3083 93208 171860 12992 -144789 -38967 134943 79811 -68836 -10517 -27083 -27362
7435 -27362 93237 82134 -92 -13309 148205 205606 236845 181315 99140 -101887 -224727
7424 -224727 -232236 -162224 -126043 -105544 -139647 -228110 -144279 -95332 -49797 -55151 -2000 -116663
7412 -116663 55031 160313 168906 166635 15430 -127482 -32729 84190 -27212 100477 174331
7401 174331 13717 17948 148573 133291 106266 47995 74732 20009 57774 -8625 -14956 -110216
7389 -110216 -104199 -105467 -56589 60493 21224 42179 -13744 34571 164480 122043 86443 8559
7377 8559 -170526 -286648 -154366 -153426 -204040 -161141 -162002 -64552 -12286 50726 59179 3823
7365 3823 -42431 13055 52479 5474 127356 149428 67475 35660 -94627 -115551 -136599 -30941
7353 -30941 18928 29526 4053 40541 54594 38123 117032 132893 108554 3812 6536 -17412
7341 -17412 -127925 -38307 -77612 -115842 -64488 35433 86894 -57820 -193355 -111188 2258
7330 2258 -51242 -157415 -159765 -20882 79173 107205 91526 101124 61818 -5820 -17602 8847
7318 8847 12165 -81511 -189838 -90234 -23145 -20710 -68452 -74132 -89537 -9085 -67495 -94540
7306 -94540 -167745 -251343 -259148 -88713 73438 145356 47458 27517 -27270 -92364 -3310 -19569
7294 -19569 -41326 1776 -84443 -105752 -124254 -21175 100682 298897 215294 173197 194298
7283 194298 162362 209608 194661 151316 128316 78236 -14403 -54473 -57436 -160172 -155030 -107360
7271 -107360 -184655 -118423 104242 248372 158994 106331 62982 123783 133960 -13071 -118974
7260 -118974 -61187 -11867 68412 38732 -26755 -32914 -6766 127059 166375 129757 124680 72856
7248 72856 76669 128516 157290 24698 -80323 -113813 -55313 -40194 -16120 10416 86994 108459
7236 108459 199078 133047 -18301 6996 210934 165110 43581 -43887 -14511 -50941 -31819
7225 -31819 16812 -99317 -112302 -79577 55177 74999 -22081 -34652 80375 102076 106902
7214 106902 23256 18054 -38567 -141930 -160885 -104937 -89893 -80251 -128430 -167621 -160471 -87912
7202 -87912 -89278 -143351 -169535 -79010 -141617 -230338 -121995 23547 12869 -91261 -144309
7191 -144309 -62048 31194 -8714 -5849 -16854 126223 161762 256189 287793 162602 -47994
7180 -47994 -90294 -88313 1607 -42307 -95202 -117036 -116194 35488 -105423 -220360 -36307 202198
7168 202198 242748 314825 269506 56862 -42378 -92135 -80498 -108000 -101847 -4477 65526 -39275
7156 -39275 -66801 -117340 -33436 -42670 -130677 -164173 -103533 -106930 -15888 30020 59488 135601
7144 135601 74855 26507 -59693 -86619 -233892 -302442 -206114 -153594 -38973 -27164 69649
7133 69649 19507 57617 17648 -13895 -28362 -139336 -116343 82577 49336 86566 50583
7122 50583 -74157 -150789 -186833 -104664 47467 72527 2902 -150352 -153452 -121611 -123941 14403
7110 14403 89698 162825 103484 91887 168031 141373 -43545 -46936 -95190 -130270 -64947 -33417
7098 -33417 33092 72186 138988 13660 -174183 -193309 -48961 86298 114420 -24099 92665
7087 92665 225806 192196 143006 -11816 31010 -3937 -38790 20888 -17899 -90268 -114895
7076 -114895 -163122 -62837 40345 68581 54618 24200 22829 34380 40742 40364 7850 16114
7064 16114 8776 32815 4678 -79351 -65826 -23709 -58486 -71006 -44364 -28654 8442 85486
7052 85486 16671 -74962 -214146 -130682 -59132 65757 49656 -51644 -183872 -118576 -81313
7041 -81313 -5389 129735 267737 215015 69628 -13573 -20981 86246 136765 -22787 -49578
7030 -49578 -49164 -83148 -128128 -188981 -106885 -179162 -229664 -152833 -37316 -42181 -3726 142687
7018 142687 186274 73427 90383 -24701 -35503 35943 134679 116377 9006 -36080 -47303
7007 -47303 -18104 -71608 -78984 24641 216981 229703 51732 -34744 -88494 -177694 -53798
6996 -53798 16628 -50293 -131666 -171318 -134009 -147334 -202407 -284859 -331501 -133044 15188
6985 15188 -17486 -25923 -93482 -77223 77154 192742 238349 101759 37116 23475 65961
6974 65961 55463 -15406 -139992 -41685 -35318 -76999 -185235 -133204 -59142 -88200 -170791 -224292
6962 -224292 -184813 -239158 -213836 -222741 -199724 -195085 -297187 -170882 -21524 -57846 -134256
6951 -134256 99059 243158 86710 41696 -74000 -165522 -101436 -2535 -22758 -24963 -12151
6940 -12151 -47070 -22361 -107219 -116719 -108843 -179989 -153857 -157657 -136070 -41358 -103065 -229248
6928 -229248 -211295 -138391 -135847 -130923 -101708 -143860 -132740 -130331 -213257 -312961 -234404 -64211
6916 -64211 45115 25900 133232 183452 94710 31693 -88205 -67628 -24484 -74798 -18826
6905 -18826 -2850 117613 166715 206119 265737 277995 207996 187415 119649 114176 177281 104395
6893 104395 75742 192039 135094 43338 -89555 -67999 -159905 -116979 2332 101709 86407
6882 86407 -26738 34550 46923 -1671 75365 151456 157447 40560 -74212 -139696 -185080
6871 -185080 -264407 -330180 -352693 -271511 -160793 40150 136562 89118 -18653 -66086 -72862
6860 -72862 -150883 -212896 -151273 -19362 24185 -1905 37996 109896 -32381 -161686 -151332
6849 -151332 -1843 13448 -105016 -168671 -153677 -237414 -199364 -78971 -49336 -21365 20319
6838 20319 32588 -53924 30752 52315 37823 114137 182640 100083 -88084 -97504 -62652 -131586
6826 -131586 -228965 -228122 -112063 -91875 -140568 -143096 -114270 -43328 -8080 -53750 -174360 -263867
6814 -263867 -309502 -189712 -69460 47141 41234 98676 116317 95778 -19684 -99755 -89339
6803 -89339 -86293 -79015 14951 36957 121334 230267 131035 70341 90783 185344 203028 91601
6791 91601 37047 -15968 12177 10560 20871 10111 84525 183171 105448 -123740 -312006 -258474
6779 -258474 -166186 -42901 -77880 -28886 48000 32697 78746 -19281 -3665 -124097 -226123
6768 -226123 -193283 -119126 -168350 -140998 -136912 -8668 44032 44932 136723 128134 92630 40314
6756 40314 -52774 -82300 -177079 -86714 -74110 162356 261413 215811 177561 253494 231390 70379
6744 70379 -114623 -31233 42826 9599 123344 141844 103699 108438 55999 36992 -111949
6733 -111949 -77062 58339 -40404 -48545 28674 52330 -35547 -138046 27037 176595 55624
6722 55624 51301 63468 53462 67837 25203 -20710 102938 185612 181399 204850 216190 159801
6710 159801 40649 -89525 -142629 -81249 3700 21105 -84718 -227570 -158045 -141395 -161333
6699 -161333 -227691 -41228 148285 135338 -8672 -78700 -29649 40754 122394 96320 9707
6688 9707 -108131 -167808 -79462 -22725 -61622 39727 76541 1980 -109838 -116023 15578
6677 15578 60359 -16681 -20147 14010 19966 -158419 -95302 -97525 -76052 41274 54457 -55754
6665 -55754 49154 145520 89189 40956 9345 184171 228425 110003 44037 40373 -169799
6654 -169799 -226526 -190093 -235992 -166914 -18196 75833 89101 58639 -106281 -12703 88684
6643 88684 42061 61152 145768 196601 101697 104977 223499 -13864 -193485 -129576 -21417
6632 -21417 101793 169543 120750 -34258 -22420 52486 12246 -30392 -148283 -197067 14571
6621 14571 115994 77279 -5362 97008 150028 64945 -18410 -6354 -1522 -107234 -155673
6610 -155673 -128685 -10046 145111 196457 240231 181165 158463 232423 352361 220474 120223
6599 120223 88039 162621 166333 126898 92189 166120 283292 400813 362203 382488 267395
6588 267395 82945 -37600 -2212 44586 -15892 -155591 -121351 -197740 -244828 -116031 -16670
6577 -16670 14918 19096 79247 82236 -103379 -373500 -540815 -444613 -146977 -83875 -63026
6566 -63026 -83315 -44807 135643 122688 241459 357224 239677 157712 114753 106728 81720
6555 81720 26125 -28584 -8863 232985 269398 58801 -39980 24559 100301 25482 -84415
6544 -84415 -70426 -50432 -23441 -60802 -77858 -179127 -172543 -82051 -81168 15534 169208 142937
6532 142937 151281 106476 -64490 -243492 -220361 -62860 -123180 -355623 -301794 -102842 -34447
6521 -34447 -214595 -330659 -274103 -133719 -210566 -154886 43345 -5612 -147278 -205947 -249872
6510 -249872 -300337 -318175 -184238 -137410 -60928 -17768 8822 -3675 9767 49908 71181
6499 71181 -14697 22764 26097 8757 -22306 249 126427 141492 192934 273892 333605 332406
6487 332406 218233 93307 15767 -4304 -19898 109622 17364 9308 63681 11481 -20468
6476 -20468 61188 39054 17594 30410 -11320 -57173 -178794 -233401 -247461 -15857 34502
6465 34502 -109228 -157132 17091 86416 65121 -10609 -53889 -41658 167146 175003 107083
6454 107083 126378 45605 60115 145773 219749 197539 180653 48525 -170908 -134101 -85384
6443 -85384 -23488 20916 44365 12917 -49922 -176015 -145848 -223428 -176144 -111425 -42557 20272
6431 20272 54648 138022 114393 47118 70172 111972 152964 101794 59634 -39871 -13604 -6449
6419 -6449 -65819 -73483 -74235 -147989 -126824 -159705 -107827 -116959 -100688 -94155 -137317 -207933 -193355
6406 -193355 -164709 -185316 -179246 -203862 -36831 49512 -23132 -635 -159989 -297789 -131917
6395 -131917 26097 15533 -33300 68047 -19222 -42451 -38124 -10367 -91575 -66240 139156
6384 139156 246847 198347 190450 167633 147811 58404 -48062 33617 1956 32697 -64849
6373 -64849 41319 120896 106585 -42057 -62946 -456 19872 102246 154902 95490 6169
6362 6169 10127 102476 156053 103527 55499 25799 -102454 -185395 -207419 -11073 7055 -550
6350 -550 137065 90430 22751 -4260 65462 184378 187013 42703 -116167 -79064 11342 60232
6338 60232 110655 215902 46443 24347 119825 -63491 -164576 -175113 -145518 -145365 -194473
6327 -194473 -160229 18984 -5277 3268 -8863 -29272 34439 81498 13187 3290 92038 80378
6315 80378 139515 230869 115099 47425 90495 138338 219561 140988 88534 12110 55459 3105
6303 3105 -50397 -155350 -92797 -116455 -37594 -86542 -155644 -177188 -152962 -92084 31046 25959
6291 25959 -166 11703 -80037 -190952 -110710 85372 111522 -148878 -305936 -187869 -146491
6280 -146491 -106761 -88156 -40622 -38399 -143723 -128603 85349 52971 -99229 20016 77477
6269 77477 -12570 63049 231159 196462 220353 193734 260210 212996 109228 55142 66399
6258 66399 62862 16461 -5757 2315 -1540 59992 161074 140946 161516 228846 104522 -107681
6246 -107681 -284019 -255245 -95434 -188606 -190888 -126359 -5144 38418 32448 -54693 -40059
6235 -40059 -35830 -34119 -85481 -9594 9386 76519 -38186 -98977 98038 99300 10296 -115191
6223 -115191 -159087 -90617 -98509 -321127 -280732 -61238 96222 190790 161193 85931 58376
6212 58376 57757 3239 -81386 -52693 -7912 -31109 -91203 -52299 -15811 -125503 -150592 -125865
6200 -125865 -111428 -183923 -212241 -236881 -268021 -83308 -97544 -140750 -135269 -170645 -195830 -256230
6188 -256230 -222876 -98639 -6767 -43540 -101533 -107985 61276 165962 -3998 -81084 -63979
6177 -63979 -16303 -110942 -166097 -51161 -23670 -182480 -148203 -58638 -33415 -145294 -264209
6166 -264209 -228627 -50072 9683 43580 48350 66753 189300 290871 201999 26643 12309
6155 12309 124594 91523 65169 75661 58844 -24372 -80592 -136037 -17192 -10775 53098 -24626
6143 -24626 -205644 -184937 -128299 -31242 35588 31848 4386 -50770 -13962 -20186 -179126 -179569
6131 -179569 -196678 -300256 -233960 -129155 -93362 -228216 -361025 -466650 -459320 -488238 -377253
6120 -377253 -290635 -230187 -123636 -170784 -125027 -102064 -164831 -39351 68616 11137 3502
6109 3502 57526 -35157 7413 135362 123716 1195 -102980 -175207 -260331 -315940 -171615
6098 -171615 -98596 -215308 -193877 -130951 -111784 -103798 -48626 -47866 -27136 23738 86258 118723
6086 118723 132628 62857 51191 -110808 -245158 -237789 -216855 -86573 3458 -93563 -115145
6075 -115145 -11331 98760 218449 173869 25656 -145932 -231776 -225591 -116805 -63674 -34477
6064 -34477 5993 -96327 -115849 -51014 50176 239897 151485 46239 19485 -82285 -1444
6053 -1444 11865 100971 89544 -23050 -117619 -182720 -186623 -160373 -209221 -120659 -12174 122793
6041 122793 152609 115425 191685 133357 85526 126114 134862 116353 106155 213861 284540 206182
6029 206182 237012 232460 200606 139166 104756 8423 29459 122354 184565 129459 59517 6966
6017 6966 -18578 15437 103504 264025 244534 71631 -40435 -248005 -314505 -149683 14086
6006 14086 49517 -65803 -71247 -57751 -14230 45092 -63431 -185509 -192275 -162735 -19540
5995 -19540 51868 -1003 -58615 -43812 14087 -10943 125966 211672 165225 155034 11440
5984 11440 -49309 -70874 -61060 -149968 -144249 -58144 13927 376 8108 -12750 -41494 -71888
5972 -71888 -24236 17229 139430 92470 73346 22192 -6917 110233 209789 246810 247333 32656
5960 32656 30367 118040 84265 -71291 -156833 -246988 -220754 -152486 127392 222346 168854 130042
5948 130042 127599 178191 124251 92317 153701 156103 189250 91148 97976 89375 -24028 -137510
5936 -137510 -93670 -24612 -31523 -60427 -97377 -180212 -145013 -57406 -40621 -85461 -73780 38824
5924 38824 -12965 -18327 237218 360028 237193 28799 20171 86208 158808 52820 72236
5913 72236 -51067 -39959 -43327 -34061 -137948 -91643 1242 -99039 -155710 -51180 -50858 -123810
5901 -123810 -74104 -24266 -32406 -11659 -9304 18242 22039 -90913 -92892 25464 54679 -31300
5889 -31300 -168070 -121533 -93055 -163558 -222679 -200868 -116256 25780 -128472 -269906 -107000
5878 -107000 -2571 -34270 -160683 -311514 -164846 -57220 -56687 -134740 -58169 47571 20133
5867 20133 19347 63728 56938 -55828 -7515 95099 10666 -36816 -56396 -130049 -120019 -14964
5855 -14964 112198 60144 -159755 -216637 -119817 -9534 -27289 -52407 -105012 -62153 53485
5844 53485 102601 188129 96402 69648 -11382 -60352 -87522 -42891 70226 53976 965 -4893
5832 -4893 65505 -27220 -274774 -184255 61529 140696 120668 168937 74647 7210 25172 38684
5820 38684 -42836 -47567 10267 -81862 -32336 50611 75484 -74290 -165519 -177157 -148014 -167193
5808 -167193 -183728 -120622 48872 -120023 -172820 -54837 206322 342752 325668 232817 176092
5797 176092 118422 59281 -57282 -136092 -269595 -22121 191080 146286 -104632 -204882
5787 -204882 -234585 -75602 17636 24746 118893 175048 146826 53080 -11768 115306 158739
5776 158739 140190 206622 135426 63718 -41905 -136547 -97559 -3427 -102825 -186478 -148336
5765 -148336 -129048 -152277 -162943 -100645 -73728 -142996 -239218 -208311 -51935 9173 7851 -19614
5753 -19614 -8803 41241 82773 -46023 26228 163548 58311 -152487 -198829 -272679 -171405
5742 -171405 -110234 -62754 -64222 -142393 -143284 -148682 -48864 -4156 1267 -29534 -26851 41422 5071
5729 5071 -108320 -224865 -122394 -13606 31012 61566 124276 96634 12138 -9347 23088
5718 23088 -113846 -234374 -299933 -189123 -154070 -65031 82438 131141 167027 130376 101885
5707 101885 119976 25188 -77880 -83676 -119727 -165277 -130133 -32457 15822 -3242 -151086
5696 -151086 -216522 -65918 129810 120108 41463 19695 79103 168837 167198 213833 184250 117205
5684 117205 3416 -122956 -263233 -224920 -89610 -29321 -38146 75168 73398 2695 -60112
5673 -60112 -104424 -234779 -266303 -223459 -67117 -34409 -84386 -33658 31573 1938 31320
5662 31320 -35662 -154103 -196452 -212182 -165813 13121 247979 198150 140658 80868 23570
5651 23570 129408 293193 255472 149627 21731 61955 81126 -11975 51517 55122 -43043
5640 -43043 -86832 -42539 -6738 -43580 -60803 -93542 -100455 -98158 -103652 -190375 -69069 26153
5628 26153 -31793 -114110 -175707 -144325 -151413 -293902 -121697 45169 184349 170033 131248
5617 131248 51079 72122 97334 59406 19924 75242 114087 152608 94578 104199 143314 -21020
5605 -21020 -90563 54586 -1033 -150107 -185968 -176911 -81816 905 108410 -47729 -146327
5594 -146327 -142750 -95185 -67007 -193741 -139848 -56705 6652 -7875 -129418 -120708 -115093 -142412
5582 -142412 -13638 -100266 -211634 -250476 -214759 -3101 133833 110185 29208 -126094 -191020
5571 -191020 -251234 -225847 -207469 -90673 24447 -24638 -70128 -101595 -68118 40280 137341
5560 137341 -5262 -134884 -70017 44140 65309 -14554 -47205 34042 129 -31668 59952
5549 59952 43024 -100511 -129323 -130748 -206873 -221268 -34682 108746 53926 131752 174636
5538 174636 145165 80644 129647 111241 70591 -21071 6013 16664 5702 119743 93149
5527 93149 -48228 -102338 -19583 63106 -60396 -4684 113725 -17523 -5178 139868 147635
5516 147635 105774 -140176 -178518 -192031 -133212 -195409 -109109 -97904 -162681 -200003 -76458
5505 -76458 1661 -115757 -128059 -147308 -168879 -209292 -222918 -249326 -83832 -31531 -89800
5494 -89800 -19253 166903 105038 124184 82463 24477 161032 144366 107227 -493 -121150
5483 -121150 -136092 -168917 -152879 -167715 -78714 -75301 -9323 -9879 -54093 -42047 60012 116933
5471 116933 118593 94486 38282 -6525 14516 33030 -119788 -134045 -264688 -251841 -243929 616
5459 616 52067 26406 17861 -41327 -114669 -177733 -200844 -72663 168433 245895 21954 -58274
5447 -58274 154273 308805 144376 44472 -5613 7837 48617 53233 143006 305214 256268
5436 256268 71900 84945 -10034 80738 182929 185322 229494 274199 242512 203876 90313
5425 90313 -21638 -31852 108554 105771 85488 71041 -30917 -88804 -153133 -131628 -73241
5414 -73241 -74633 33159 206217 162116 17840 -29123 -112639 -137637 -221052 -240996 -192903
5403 -192903 -197028 -206286 -180081 -39269 103263 143275 36100 -62281 -187218 -174310 -169392
5392 -169392 -90606 -127928 -136984 -221613 -263596 -256091 -209951 -145781 -126030 -188766 -199311 -96792
5380 -96792 -79688 -114809 -39946 20576 -4390 -45913 -77540 -52477 -6126 109969 117154 51574
5368 51574 8195 1543 47554 31171 70991 -6658 20707 77098 37154 60240 -14620 -4566
5356 -4566 28288 18376 97043 54370 157721 254856 163953 83588 41598 82706 239716 318204
5344 318204 185474 45985 -108898 -128143 -88680 -88374 -309618 -380198 -205682 -187702 -106030
5333 -106030 -76918 27869 53244 9198 25976 13470 -85365 -107663 -15158 -28252 6754
5322 6754 45491 -13467 40482 45047 65947 53113 -1793 -27325 36676 68155 60908 22476
5310 22476 -38766 -26666 14455 104657 20933 40230 186590 197471 140816 73581 -72204
5299 -72204 -34200 -74477 -132963 -156671 28159 59926 111725 253416 232236 246233 146138
5288 146138 145001 211256 147218 6894 94261 192851 130148 172395 112603 -4313 -9945 34749
5276 34749 73306 41685 5100 84698 34041 53763 -9113 18176 12781 14658 53118 240071
5264 240071 181431 55574 28075 -14797 -90788 9091 35163 -99597 -115357 -119620 -124021 -41986
5252 -41986 33575 95838 185861 56685 -10773 52696 4975 -80388 -114704 -211755 -82695
5241 -82695 -60605 -120433 -141586 -82219 -74903 -7417 152379 145520 29917 11818 -26302 -129019
5229 -129019 -170123 -186235 -163852 -118646 525 4631 -145086 -159988 -74979 -1769 50044
5218 50044 71756 -62677 -144310 6632 -5407 18783 63071 41515 142180 51191 -22880
5207 -22880 -46188 -58742 115399 179260 98107 63157 -49538 -56707 -3474 -73259 -102350 -69155
5195 -69155 -8073 140667 104036 56787 -42001 38447 83478 150278 119919 -47567 -150474
5184 -150474 -131554 -8693 57388 38788 156353 138994 53349 -61488 -107267 -138066 19936
5173 19936 123479 -10236 -171686 -161620 -31897 -18650 -62548 47325 87227 219301 266879
5162 266879 169484 -29004 -141677 -126545 -10095 -90140 -125083 -4159 107537 164323 165151
5151 165151 6170 -149767 -69631 -78547 -118329 -48242 -29223 -49621 -108275 -176036 -165733
5140 -165733 -61689 -21053 -176726 -232119 -85133 -32550 -47960 -97201 -171051 -113372 36783
5129 36783 23050 57935 87260 -65976 -189229 -226544 -280239 -179532 -180403 -212329 47237
5118 47237 102867 50446 -135245 -87006 -134549 -276529 -241659 -235563 -105203 42310 32281
5107 32281 61758 -2368 -68064 -185785 -213923 -110596 -60097 -23606 -132972 -123517 -106906
5096 -106906 -25687 46154 151438 275999 202142 73824 123315 311017 359354 164722 -80569
5085 -80569 -115108 -82615 -17758 16092 44449 22889 -129019 -226534 -225110 -130705 -59760 13771
5073 13771 110142 29337 -34293 -74294 -12702 -44408 95047 153520 -872 -69620 -99633
5062 -99633 -107267 -22336 68916 106380 170010 57244 -5883 -13308 -45891 51881 123519 197782
5050 197782 342363 357745 254230 55639 -241493 -293214 -282282 -259389 -151483 25195
5040 25195 126631 105494 -65684 -142009 -153394 -101947 -75876 129645 324540 318978 205011
5029 205011 -2807 -50551 21106 39191 66064 19141 -116530 -50932 28331 107749 157870
5018 157870 -16339 -154579 -136456 -56092 -53879 77931 91492 64498 69145 23154 -63384
5007 -63384 -44412 73424 126106 93269 28240 92865 1596 -90023 -91219 -75318 1377 87362
4995 87362 92050 154992 71497 62540 97061 130841 69524 -97355 -74069 -27287 -62197 60747
4983 60747 16074 42847 101549 66640 155329 289319 217466 188901 195854 114684 16974 -73681
4971 -73681 -59220 -125171 -188271 -133522 -90830 -127247 -223102 -118843 -79414 -117858 -126772 -26061
4959 -26061 120415 97342 103437 212325 296489 195886 74167 3484 -14158 -141475 -244477
4948 -244477 -202558 -138173 -128080 -230351 -243132 -177358 -80357 -154899 -111715 -100948 48949
4937 48949 7735 -6141 15472 80984 52935 -7235 -165801 -72021 29719 76022 201340
4926 201340 75169 127294 211989 186997 41018 -120833 -181494 -113754 -29821 -176529 -211535
4915 -211535 -131855 -109815 -37705 95016 181994 75964 -141560 -180921 -137343 13782 61339
4904 61339 169471 52379 14996 18893 -142963 -112668 46574 163098 153941 166701 111328
4893 111328 -41409 -36445 36071 109997 168352 195299 155087 121776 34218 136533 89438
4882 89438 15241 73090 107330 104026 56512 -92297 -76099 -1823 43982 -92133 -737 61100
4870 61100 125388 225518 98630 79349 36314 74079 136031 136471 103559 84365 87438 -19764
4858 -19764 -109666 -124350 -29780 15480 36210 52598 129944 234167 280461 242301 100067
4847 100067 33496 89448 67272 -33351 -94428 -54717 98282 232326 187531 54058 -127725
4836 -127725 -261344 -185373 -129092 -224370 -135913 -83680 -166766 -262075 -235843 -326657 -285157
4825 -285157 -219303 -62235 19648 128676 54160 -89301 -37648 -17387 -53115 -47225 93845
4814 93845 88391 57611 14475 -66447 -125287 -115613 -173784 -97263 -94399 -92545 -112581 -85893 -66373
4801 -66373 -92417 -116770 -49849 -87978 -119514 -32105 73119 42908 4335 134794 97085
4790 97085 -8012 -34246 -15900 81918 58530 68810 14027 17264 133820 138967 17883 27404
4778 27404 72822 28611 -36869 -26405 -125100 -136849 -140388 -87083 130493 59443 67081 -23952
4766 -23952 -44996 -25857 -62820 -208467 -117732 -69576 -99699 -175874 -20635 174231 220649
4755 220649 122686 140858 126585 112864 64895 136579 63338 9979 82701 197418 156473
4744 156473 92251 145350 24804 -34728 73553 132760 119953 121640 77743 26 -126211
4733 -126211 -187457 -210813 -229525 -154095 -86740 -24785 -156552 -159778 -51155 35261 49312
4722 49312 17184 -80610 -151564 -206271 -254966 -217670 -221400 -181649 -85201 -84958 12594 53417
4710 53417 69138 143878 28738 -80372 -150152 -85419 -12143 -60169 -55690 59732 41312
4699 41312 -40069 19475 167114 134039 88557 90781 72831 -45299 -133293 -142165 -134348 -83274
4687 -83274 -164560 -173622 -141489 2633 53828 -64000 -131123 -120614 -114590 -87464 -124151 -110676
4675 -110676 -12656 356 -61291 58859 220233 203112 105835 -58330 -188067 -64054 135493
4664 135493 174842 70414 140436 166453 102452 -17453 86735 179602 96726 69204 96715
4653 96715 116536 100540 125608 201779 280516 299329 388608 285474 175532 46284 12226
4642 12226 36979 114512 213159 230501 171092 164956 156692 109358 104096 119680 119560 110402 117912
4629 117912 65512 79525 69736 97043 90771 53786 56045 70952 187054 199271 85568 30289
4617 30289 123241 134173 158757 151505 224197 272000 311646 301309 177852 -40778 -31625 62647
4605 62647 -20763 -30302 -68147 -40161 -40563 -133141 -51761 -25613 -121719 -207708 -151490 -2683
4593 -2683 39901 -6383 -123830 -179274 -184713 -128354 -23651 -90417 -161024 -159608 -76567 -56812
4581 -56812 -151096 -87697 -17234 23924 11883 98046 196458 181676 131222 87246 -21090 26109
4569 26109 111473 155738 162931 158027 70575 11015 -88104 -49620 53686 -46938 -100765 -129378
4557 -129378 -161896 -160891 -79640 -56885 68926 127774 41004 -55424 -12507 103605 86371
4546 86371 73806 35250 7981 -157134 -314295 -238886 -88612 -213971 -204062 -176042 -215358
4535 -215358 -208992 -45666 8483 -66609 -10267 141320 266300 290515 244702 91407 571
4524 571 60352 96743 120200 169228 95072 54587 148936 251547 144836 186 114592
4513 114592 197701 110239 74749 13350 -13141 -3400 93305 88832 57381 -22928 -42663 -23353
4501 -23353 -65311 -98590 -109448 -118308 -24626 112463 123746 223393 245428 125122 -272
4490 -272 -124315 -80294 -25306 47189 -27167 -149295 -115037 -37824 43715 64472 47684 63824
4478 63824 22433 -74161 -46801 34425 16294 -41423 -75524 14165 60516 22046 -56100 -65106
4466 -65106 96158 189482 189440 118869 21288 -35724 45249 42477 196599 265260 255258 100380
4454 100380 -31968 -96693 -131657 -97488 -27474 82094 100334 50330 -3249 105911 227685
4443 227685 195568 157745 171230 106295 161032 258698 287216 163831 1047 -151312 -164601
4432 -164601 -145554 -71629 -16271 129219 193921 12984 -161489 -206072 -128246 -125769 -137892
4421 -137892 -115715 -17723 -24786 -84158 -105044 -66914 78569 116731 12369 -142266 -82308
4410 -82308 -31705 -521 -67333 -28032 -55560 -184420 -45299 -9364 -30647 -58607 -31830
4399 -31830 -57829 -102677 -10147 28731 -179249 -232387 -122502 -200567 -208326 -157091 12502
4388 12502 144623 187935 207239 125110 179227 158124 153508 170205 333015 370910 237365
4377 237365 95819 -66546 -111250 -116050 -212048 -100477 -59396 -108938 -27617 110449 153833
4366 153833 172558 112337 108182 65671 24865 62400 230861 247213 173570 90152 -28684
4355 -28684 -132294 -117827 -115179 -137753 -162567 -122282 -18114 -35535 -30295 89222 255961
4344 255961 182058 99258 -27596 -108671 -96525 -39340 -75330 -94061 -41561 -9946 -65907
4333 -65907 63892 191203 216370 246121 242386 259122 277726 92374 -56593 -56239 -115648 -117024
4321 -117024 23364 109466 132557 39905 -58628 -250425 -393706 -325199 -70139 -22891 -40940
4310 -40940 67870 -61739 8896 71999 35110 7910 -38092 -44607 -146109 -125363 -47547
4299 -47547 -84546 -76188 -10043 30133 60554 58439 76664 2560 -37640 -35605 -40907 -53926 -36989
4286 -36989 30842 89881 93897 16352 8310 -133699 -87934 1751 -69927 -116175 -128503 -154272
4274 -154272 -98145 -55582 -61805 28162 91238 116981 57377 135594 199812 161816 6702 24303
4262 24303 112356 31256 -83810 -87558 -72187 -27669 44073 57435 -46394 -112192 -187038 -195981
4250 -195981 -130688 -56573 -51081 -145717 -117224 50757 221097 334886 222539 89918 95000
4239 95000 183059 162768 -85696 -222891 -218558 -181246 -103138 -34103 7627 -55559 -104013 9026
4227 9026 135660 236935 196411 133018 -18950 -47076 40863 61723 31327 11629 -26657
4216 -26657 -57243 -164127 -188145 -71239 28433 114822 113903 -32415 -139152 -154482 -188333
4205 -188333 -79027 -41056 -60422 -22823 -29504 -23429 -77087 -888 -86348 -69905 100309 29096
4193 29096 -62098 -95498 -188358 -143868 -109627 -146872 8742 62635 167346 207673 190275
$$ [...]
##END NTUPLES=NMR SPECTRUM
##END=
