##TITLE=Analysis number 307339
Compound Code pd 00830
Project Code qc-cat
Chemist Name fudan
##JCAMPDX= 6.0         $$ Bruker NMR JCAMP-DX V2.0
##DATA TYPE= NMR SPECTRUM
##DATA CLASS= NTUPLES
##ORIGIN= Bruker BioSpin GmbH
##OWNER= NMR
$$ XWIN-NMR		Version 3.5
$$ Thu Apr 28 10:27:00 2005 GMT Daylight Time (UT+1h)  MAYBRIDGE\NMR@NMR_250MHZ
##.OBSERVE FREQUENCY= 250.131544655141
##.OBSERVE NUCLEUS= ^1H
##.ACQUISITION MODE= SIMULTANEOUS (DQD)
##.ACQUISITION SCHEME= undefined
##.AVERAGES= 16
##.DIGITISER RES= 18
##SPECTROMETER/DATA SYSTEM= dpx250
##.PULSE SEQUENCE= zg30
##.SOLVENT NAME= DMSO
##.SHIFT REFERENCE= (INTERNAL, DMSO, 0, 16.522)
##AUDIT TRAIL= $$ (NUMBER, WHEN, WHO, WHERE, WHAT)
$$ ##TITLE= Audit trail, XWIN-NMR		Version 3.5
$$ ##JCAMPDX= 5.01
$$ ##ORIGIN= Bruker BioSpin GmbH
$$ ##OWNER= NMR
$$ C:\u/data/dgb/nmr/ADRS/2410/pdata/1/auditp.txt
$$ ##AUDIT TRAIL=  $$ (NUMBER, WHEN, WHO, WHERE, WHAT)
(   1,<2005-04-28 10:26:38.85 +100>,<MAYBRIDGE\NMR>,<NMR_250MHZ>,
      <created by zg, POWCHK disabled, PULCHK disabled
       configuration hash MD5:
       62 19 C7 07 E1 42 D1 B7 37 6C 3D D0 77 39 F9 E6
       data hash MD5: 64K
       E7 DA D4 4C E1 AA 58 E0 1B B7 80 28 8D 09 61 98>)
(   2,<2005-04-28 10:26:52.04 +100>,<MAYBRIDGE\NMR>,<NMR_250MHZ>,
      <Start of raw data processing
       ef LB = 0.3 FT_mod = 6 PKNL = 1 SI = 32K 
       data hash MD5: 32K
       6D 0B 48 38 67 AF 23 94 08 76 B3 8E 74 12 39 AD>)
(   3,<2005-04-28 10:26:53.88 +100>,<MAYBRIDGE\NMR>,<NMR_250MHZ>,
      <apk 
       data hash MD5: 32K
       46 4C 9C F8 37 56 88 21 05 00 7D 4B 84 22 92 51>)
(   4,<2005-04-28 10:26:54.63 +100>,<MAYBRIDGE\NMR>,<NMR_250MHZ>,
      <abs ABSG = 5 
       data hash MD5: 32K
       D0 60 07 11 D8 CE C2 6F C0 F9 35 53 60 1E 23 E7>)
$$ ##END=
$$ 
$$ hash MD5
$$ BA 4C A3 5A 3E D5 0E 8E 26 BC 91 F5 DE 17 DB 62
##$RELAX= 
##$RELAX= 
##$RELAX= 
##$RELAX= 
##$RELAX= 
##$RELAX= 
##$RELAX= 
$$ Bruker specific parameters
$$ --------------------------
##$DU= <C:\u>
##$EXPNO= 2410
##$NAME= <ADRS>
##$PROCNO= 1
##$TYPE= <nmr>
##$USER= <dgb>
##$AMP= (0..31)
100 100 100 100 100 100 100 100 100 100 100 100 100 100 100 100 100 100 
100 100 100 100 100 100 100 100 100 100 100 100 100 100 
##$AQSEQ= 0
##$AQ_mod= 3
##$AUNM= <au_zg>
##$AUTOPOS= <8 >
##$BF1= 250.13
##$BF2= 250.13
##$BF3= 250.13
##$BF4= 250.13
##$BF5= 500.13
##$BF6= 500.13
##$BF7= 500.13
##$BF8= 500.13
##$BYTORDA= 1
##$CFDGTYP= 0
##$CFRGTYP= 5
##$CHEMSTR= <none>
##$CNST= (0..31)
1 1 145 1 1 1 1 1 1 1 1 1 1 1 1 1 1 1 1 1 1 1 1 1 1 1 1 1 1 1 1 1 
##$CPDPRG= <>
##$CPDPRG1= <>
##$CPDPRG2= <>
##$CPDPRG3= <>
##$CPDPRG4= <mlev>
##$CPDPRG5= <mlev>
##$CPDPRG6= <mlev>
##$CPDPRG7= <mlev>
##$CPDPRG8= <mlev>
##$CPDPRGB= <>
##$CPDPRGT= <>
##$D= (0..31)
0 1 0 0 0 0 0 0 0 0.06 0 0 0 0 0 0 0.0002 0 0 0 0 0 0 0 0 0 0 0 0 0 0 
0 
##$DATE= 1114680398
##$DBL= (0..7)
120 120 120 120 120 120 120 120 
##$DBP= (0..7)
150 150 150 150 150 150 150 150 
##$DBP07= 0
##$DBPNAM0= <>
##$DBPNAM1= <>
##$DBPNAM2= <>
##$DBPNAM3= <>
$$ [...]
##$SUBNAM7= <"">
##$SUBNAM8= <"">
##$SUBNAM9= <"">
##$SW= 20.6930455092707
##$SWIBOX= (0..15)
0 0 3 0 0 0 0 0 0 0 0 0 0 0 0 0 
##$SW_h= 5175.983436853
##$TD= 65536
##$TD0= 1
##$TE= 295.16
##$TE2= 300
##$TE3= 300
##$TEG= 300
##$TL= (0..7)
0 120 120 120 120 120 120 120 
##$TP= (0..7)
150 150 150 150 150 150 150 150 
##$TP07= 0
##$TPNAME0= <>
##$TPNAME1= <>
##$TPNAME2= <>
##$TPNAME3= <>
##$TPNAME4= <>
##$TPNAME5= <>
##$TPNAME6= <>
##$TPNAME7= <>
##$TPOAL= (0..7)
0.5 0.5 0.5 0.5 0.5 0.5 0.5 0.5 
##$TPOFFS= (0..7)
0 0 0 0 0 0 0 0 
##$TUNHIN= 0
##$TUNHOUT= 0
##$TUNXOUT= 0
##$USERA1= <user>
##$USERA2= <user>
##$USERA3= <user>
##$USERA4= <user>
##$USERA5= <user>
##$V9= 5
##$VALIST= <valist>
##$VCLIST= <CCCCCCCCCCCCCCC>
##$VD= 0
##$VDLIST= <DDDDDDDDDDDDDDD>
##$VPLIST= <PPPPPPPPPPPPPPP>
##$VTLIST= <TTTTTTTTTTTTTTT>
##$WBST= 1024
##$WBSW= 4
##$XGAIN= (0..3)
0 0 0 0 
##$XL= 0
##$YL= 0
##$YMAX_a= 297178
##$YMIN_a= -251259
##$ZGOPTNS= <>
##$ZL1= 120
##$ZL2= 120
##$ZL3= 120
##$ZL4= 120
##$ABSF1= 16.522
##$ABSF2= -4.171173
##$ABSG= 5
##$ABSL= 3
##$ALPHA= 0
##$AQORDER= 0
##$ASSFAC= 0
##$ASSFACI= 0
##$ASSFACX= 0
##$ASSWID= 0
##$AUNMP= <proc_1d>
##$AZFE= 0.1
##$AZFW= 0.1
##$BCFW= 0
##$BC_mod= 0
##$BYTORDP= 0
##$COROFFS= 0
##$CY= 12.5
##$DATMOD= 1
##$DC= 0
##$DFILT= <>
##$DTYPP= 0
##$F1P= 14.0000005364418
##$F2P= -0.99999901652339
##$FCOR= 0.5
##$FTSIZE= 32768
##$FT_mod= 6
##$GAMMA= 0
##$GB= 0
##$INTBC= 1
##$INTSCL= 1
##$ISEN= 128
##$LB= 0.3
##$LEV0= 0
##$LPBIN= 0
##$MAXI= 10000
##$MC2= 0
##$MEAN= 0
##$ME_mod= 0
##$MI= 0
##$NCOEF= 0
##$NC_proc= -6
##$NLEV= 6
##$NOISF1= 0
##$NOISF2= 0
##$NSP= 0
##$NTH_PI= 0
##$NZP= 0
##$OFFSET= 16.522
##$PC= 1
##$PHC0= -88.89767
##$PHC1= 23.05512
##$PH_mod= 1
##$PKNL= yes
##$PPARMOD= 0
##$PSCAL= 4
##$PSIGN= 0
##$REVERSE= no
##$SF= 250.13
##$SI= 32768
##$SIGF1= 0
##$SIGF2= 0
##$SINO= 400
##$SIOLD= 32768
##$SREGLST= <1H.DMSO>
##$SSB= 0
##$STSI= 32768
##$STSR= 0
##$SW_p= 5175.98343685301
##$SYMM= 0
##$S_DEV= 0
##$TDeff= 65536
##$TDoff= 0
##$TI= <Analysis number 999999
Compound Code 99
Book Reference 9
Project Code 9>
##$TILT= no
##$TM1= 0
##$TM2= 0
##$TOPLEV= 0
##$USERP1= <user>
##$USERP2= <user>
##$USERP3= <user>
##$USERP4= <user>
##$USERP5= <user>
##$WDW= 1
##$XDIM= 32768
##$YMAX_p= 474807384
##$YMIN_p= -1579156
$$ End of Bruker specific parameters
$$ ---------------------------------
##NTUPLES= NMR SPECTRUM
##VAR_NAME=  FREQUENCY,     SPECTRUM/REAL,   SPECTRUM/IMAG
##SYMBOL=    X,             R,               I
##VAR_TYPE=  INDEPENDENT,   DEPENDENT,       DEPENDENT
##VAR_FORM=  AFFN,          ASDF,            ASDF
##VAR_DIM=   32768,         32768,           32768
##UNITS=     HZ,            ARBITRARY UNITS, ARBITRARY UNITS
##FACTOR=    0.157963299565203, 1,           1
##FIRST=     4132.6476996994, 0,             0
##LAST=      -1043.33573715361, 0,           0
##MIN=       -1043.33573715361, -1579156,    0
##MAX=       4132.6476996994, 474807384,     0
$$ Real data points
##PAGE= N=1
##DATA TABLE= (X++(R..R)), XYDATA
$$ [...]
$$ plain form
23873 -666893 -558259 -455714 -613753 -480110 -420763 -143567 -148496 -136150 -396201 -539376
23863 -539376 -264713 -341676 -481138 -702401 -627984 -201017 -193532 -499691 -474325 -91454
23853 -91454 -33892 -128812 -65428 -270421 -55887 234257 621373 490273 301939 88713
23843 88713 188894 -73222 -277361 96457 -125198 -403234 -712108 -395879 -370495 -450476
23833 -450476 -543948 -581096 -425564 -356688 -175098 -132238 -68083 -134458 -503636 -753839 -493082
23822 -493082 -338109 -470801 -292412 -334561 -376865 -285682 -150226 -210556 -215660 -304525 -218535
23811 -218535 -295093 -417205 -574099 -746623 -626437 -411189 -297439 -42012 38998 -278981
23801 -278981 -301910 -379978 -477288 -407064 -198951 -409904 -82512 314143 399474 208713
$$ packed form
23873f66893J08634J02545j58039J33643N9347K77196m929J2346k60051j43175
23863e39376K74663p6963j39462k21263P4417M26967P485l06159K5366L82871
23853i1454N7562r4920O3384k04993K14534K90144L87116j31100j88334k13226
23843H8713J00181k62116k04139L73818k21655k78036l08874L16229K5384p9981
23833d50476r3472l7148J55532O8876J81590M2860O4155o6375l69178k50203K60757
23822d93082J54973j32692J78389m2149m2304R1183J35456o0330n104q8865Q5990
23811b18535p6558j22112j56894j72524J20186K15248J13750K55427Q1010l17979
23801b78981k2929p8068r7310P0224K08113k10953L27392L96655Q5331j90761
$$ plain form
23791 208713 -36879 -188417 -267023 -226637 -335430 -248018 -48685 -327656 -468794 -493179
23781 -493179 -360803 -485457 -397927 -161462 -8828 98394 95029 -382979 -586073 -429545
23771 -429545 -264087 -358902 -262320 -342632 -461378 -429181 -524039 -173267 -16702 -266453
23761 -266453 -307086 -305315 -186373 -283401 -159700 -473112 -318388 39141 -93613 -258604
23751 -258604 -569601 -521719 -314382 -104026 -98206 -28498 -191326 -197787 33386 105649 -135481
23740 -135481 -144219 -285272 -663023 -815853 -596408 -348439 -178636 -268824 -603850 -596921
23730 -596921 -301773 -265971 -445223 -692409 -510747 -123012 -357931 -330028 -343269 -451611
23720 -451611 -484354 -438096 -183222 242875 94821 19328 88005 -228781 -450954 -557133
$$ packed form
23791B08713k45592j51538p8606M0386j08793Q7412J99333k78971j41138k4385
23781d93179J32376j24654Q7530K36465J52634J07222l365m78008k03094J56528
23771d29545J65458r4815R6582q0312j18746L2197r4858L50772J56565k49751
23761b66453m0633J771J18942r7028J23701l13412J54724L57529j32754j64991
23751b58604l10997M7882K07337K10356N820O9708j62828o461K31173P2263k41130
23740a35481q738j41053l77751j52830K19445K47969J69803r0188l35026O929
23730e96921K95148L5802j79252k47186J81662L87735k34919K7903j3241j08342
23720d51611l2743M6258K54874M26097j48054p5493O8677l16786k22173j06179
$$ plain form
23710 -557133 -565207 -359908 -27761 -68768 -95795 15715 113574 -47694 -346634 -242975
23700 -242975 -73998 35719 -297761 -57448 129771 252410 87028 -92089 96330 238628
23690 238628 -18546 -366564 -331965 -233142 -211081 -337405 -129089 -22127 72119 108132
23680 108132 132521 38815 -133651 -223848 -158013 -467360 -258529 -211950 -137946 -80083 46466
23669 46466 -30861 11369 81522 -438285 -701268 -491547 -296595 -242555 -108403 -89580 -252525
23658 -252525 -409925 -439211 -437468 -383140 -418211 -505744 -579289 -422291 -116473 -158269 -262495
23647 -262495 -238751 -456988 -189888 -106063 -271685 -102021 227732 -95552 -38355 293440
23637 293440 172504 91156 -4072 -97346 -36191 46266 231660 46663 68030 -158146 -77879
$$ packed form
23710e57133q074K05299L32147m1007k7027J11510R7859j61268k98940J03659
23700b42975J68977J09717l33480K40313J87219J22639j65382j79117J88419J42298
23690B38628k57174l48018L4599R8823K2061j26324K08316J06962R4246L6013
23680A08132K4389r3706j72466r0197O5835l09347K08831M6579P4004N7863J26549
23669D6466p7327M2230P0153n19807k62983K09721J94952N4040J34152J8823j62945
23658b52525j57400k9286J743N4328l5071q7533p3545J56998L05818m1796j04226
23647b62495K3744k18237K67100Q3825j65622J69664L29753l23284N7197L31795
23637B93440j20936q1348r5228r3274O1155Q2457J85394j84997K1367k26176Q0267
$$ plain form
23626 -77879 45623 77306 23534 -297284 -394813 -366441 -564043 -590661 -361154 -370524 -211638
23615 -211638 -255917 -133393 -281965 -356562 -578207 -785381 -875699 -537522 -265719 -157307
23605 -157307 -462432 -789305 -601810 -599502 -532412 -413640 -404204 -290097 -254897 -372018 -366080
23594 -366080 -491012 -464114 -473413 -842438 -870797 -653627 -467635 -519392 -611304 -666156 -722036
23583 -722036 -892289 -759151 -553029 -477743 -131333 -5376 170987 203072 133931 151056
23573 151056 115586 -107531 -410345 -544484 -499537 -270319 -5591 -274189 -113432 96828
23563 96828 -25528 14358 210834 -66747 -416819 -370821 -322008 -628317 -470228 -590366
23553 -590366 -639252 -296723 -250696 -329197 -374616 -487182 -500680 -598406 -912440 -680274 -218427
$$ packed form
23626g7879J23502L1683n3772l20818r7529K8372j97602k6618K29507r370J58886
23615b11638m4279J22524j48572p4597k21645k07174r0318L38177K71803J08412
23605a57307l05125l26873J87495K308O7090J18772R436J14107L5200j17121N938
23594c66080j24932K6898r299l69025k8359K17170J85992n1757r1912n4852n5880
23583g22036j70253J33138K06122P5286L46410J25957J76363L2085o9141J7125
23573A51056l5470k23117l02814j34139M4947K29218K64728k68598J60757K10260
23563I6828j22356L9886J96476k77581l50072M5998M8813l06309J58089j20138
23553e90366m8886L42529M6027p8501m5419j12566j3498r7726l14034K32166M61847
$$ plain form
23542 -218427 -430762 -750415 -727453 -548572 -474596 -364706 -135634 -81140 -176785 -165314
23532 -165314 -231504 -176442 -114099 -149766 -117088 -36262 152672 -66848 -471202 -489838 -299699
23521 -299699 -12624 193473 131056 -181536 -136558 27849 -84434 -94948 -75641 -268570
23511 -268570 -320253 -27889 -51462 -119604 23915 -472271 -844646 -710244 -464515 -406528
23501 -406528 -221746 -343601 -555312 -461329 -181825 -281010 -250366 -182341 -70414 143956
23491 143956 76156 -132921 -353945 -300731 5501 162973 -109562 -352132 -495367 -408002
23481 -408002 -414233 -729492 -682368 -592745 -539787 -611199 -464947 148514 257775 -75159 -176514
23470 -176514 -297598 126211 124711 -91360 -197501 -296983 -327394 -129315 -196969 -176957 -5567
$$ packed form
23542b18427k12335l19653K2962J78881P3976J09890K29072N4494r5645J1471
23532a65314o6190N5062O2343l5667L2678Q0826J88934k19520m04354j8636J90139
23521b99699K87075K06097o2417l12592M4978J64407j12283j0514J9307j92929
23511b68570n1683K92364k3573o8142J43519m96186l72375J34402K45729N7987
23501d06528J84782j21855k11711R3983K79504r9185L0644O8025J11927K14370
23491A43956o7800k09077k21024N3214L06232J57472k72535k42570j43235Q7365
23481d08002o231l15259M7124Q9623N2958p1412J46252O13461J09261l32934j01355
23470a76514j21084M23809j500k16071j06141r9482l0411J98079o7654K0012J71390
$$ plain form
23459 -5567 -115182 -389834 -549051 -564234 -146036 -75962 162994 86228 83725 -71368 -94527
23448 -94527 -219113 -425306 -442986 -349282 -281746 -285292 -265923 -70203 255116 561248 489678
23437 489678 604021 345673 23687 -242674 -201579 93259 500162 205792 61145 -45215
23427 -45215 -264613 -446552 -263327 -31049 -88831 -353721 -328690 -208206 -212796 110804
23417 110804 348662 -53884 -322191 -52999 -67625 -302459 -231908 139574 46565 -214183
23407 -214183 -418504 -340287 -146030 -110441 -339610 -372155 -263082 -460170 -309330 -306241
23397 -306241 -553464 -499359 -66307 241845 339782 287700 441849 -137783 -426796 -467275
23387 -467275 -378708 -245065 -127134 -143188 -190507 -197507 -31562 49390 14249 10378 32577
$$ packed form
23459e567j09615k74652j59217j5183M18198P0074K38956p6766k503j55093k3159
23448i4527j24586k06193j7680R3704O7536l546J9369J95720L25319L06132p1570
23437D89678J14343k58348l21986k66361M1095K94838M06903k94370j44647j06360
23427d5215k19398j81939J83225K32278n7782k64890K5031J20484m590L23600
23417A10804K37858m02546k68307K69192j4626k34834P0551L71482r3009k60748
23407b14183k04321P8217J94257L5589k29169l2545J09073j97088J50840L089
23397c06241k47223N4105M33052L08152R7937n2082J54149n79632k89013m0479
23387d67275Q8567J33643J17931j6054m7319p000J65945Q0952l5141l871K2199
$$ plain form
23376 32577 -188233 -258992 13941 -27216 81746 273477 222237 56890 -91949 -183425
23366 -183425 -7618 52099 -48018 -251574 -321609 -292102 -66742 150012 110297 60519
23356 60519 -20783 -230966 -136477 -91582 -368956 -322397 -325015 -325860 -565396 -414432 -298239
23345 -298239 -416516 -347799 -411256 -705267 -689112 -565786 -388689 -365977 -530810 -469189
23335 -469189 -543184 -303169 -318675 -298896 -309639 -648654 -1030264 -901685 -906020 -960543 -408399
23324 -408399 1777 -187303 -274210 -308992 -312464 -211502 -117332 -230644 -307490 -305772 -145853
23313 -145853 -69303 -18302 132894 198730 20656 -71485 -162559 -229412 -74587 -35679 -183831
23302 -183831 -157130 -1906 -70566 -38076 558233 417707 21158 -23485 -259784 -266334 -525913
$$ packed form
23376C2577k20810p0759K72933m1157J08962J91731n1240j65347j48839r1476
23366a83425J75807N9717j00117k03556p0035K9507K25360K16754l9715m9778
23356F0519q1302k10183R4489M4895k77374M6559k618q45k39536J50964J16193
23345b98239j18277O8717o3457k94011J6155J23326J77097K2712j64833O1621
23335d69189p3995K40015j5506J9779j0743l39015l81610J28579m335n4523N52144
23324d08399M10176j89080q6907l4782l472J00962R4170j13312p6846J718J59919
23313a45853P6550N1001J51196O5836j78074r2141r1074o6853J54825L8908j48152
23302a83831K6701J55224o8660L2490N96309j40526l96549m4643k36299o550k59579
$$ plain form
23291 -525913 -676676 -415383 -257745 -111070 -212948 55393 231096 700870 902687 591193
23281 591193 307335 515236 476492 532790 525970 519821 120311 -423736 -704213 -427539 -389599
23270 -389599 -604096 -645993 -634749 -213853 168118 245972 186172 84720 29329 77243 94035
23259 94035 -349587 -60588 394487 248439 105421 270452 532312 334606 128023 260202
23249 260202 178522 102456 328562 176483 -210323 -321573 -376575 -229631 2867 -1586
23239 -1586 107511 -56923 -30439 145403 106867 140600 -1211 -154050 -498109 -604121
23229 -604121 -314320 -147126 95783 11863 -2305 -104355 -617522 -677457 -468661 -286276
23219 -286276 -88841 22757 -184514 -373466 -408225 -363058 -127329 -61636 -8619 -28390
$$ packed form
23291e25913j50763K61293J57638J46675j01878K68341J75703M69774K01817l11494
23281E91193k83858K07901l8744N6298o820o149l99510n44047k80477K76674L7940
23270c89599k14497m1897J1244M20896L81971P7854n9800j01452n5391M7914J6792
23259I4035m43622K88999M55075j46048j43018J65031K61860j97706k06583J32179
23249B60202q1680p6066K26106j52079l86806j11250n5002J46944K32498m453
23239a586J09097j64434K6484J75842l8536L3733j41811j52839l44059j06012
23229f04121K89801J67194K42909q3920j4168j02050n13167n9935K08796J82385
23219b86276J97435J11598k07271j88952l4759M5167K35729O5693N3017j9771
$$ plain form
23209 -28390 -466511 -797899 -705337 -656185 -771380 -357984 -107185 -304802 -356760 -229714
23199 -229714 -298948 -425164 -224945 -179453 -288278 -355846 -286245 -235993 -402390 -355004 -137858
23188 -137858 -273782 -296678 -439729 -342407 -226459 -410084 -461518 -556463 -679698 -464828
23178 -464828 -364836 -417432 -185121 105066 221436 60415 -212328 -532390 -610146 -547747
23168 -547747 -710581 -537044 -299092 100460 227999 99380 -192940 -216692 -286800 -528088
23158 -528088 -371803 -203592 -469035 -487858 -28729 -61622 -115904 68828 -160043 -339986
23148 -339986 -484129 -303464 115751 145755 156046 217644 184093 -156833 -162560 -84034 331090
23137 331090 505632 362095 328527 377698 241124 164148 49284 -54184 -173272 157722
$$ packed form
23209b8390m38121l31388R2562M9152j15195M13396K50799j97617n1958J27046
23199b29714o9234j26216K00219M5492j08825o7568O9601N0252j66397M7386K17146
23188a37858j35924k2896j43051R7322J15948j83625n1434r4945j23235K14870
23178d64828R9992n2596K32311K90187J16370j61021k72743l20062p7756O2399
23168e47747j62834J73537K37952L99552J27539j28619k92320k3752p0108k41288
23158e28088J56285J68211k65443j8823M59129l2893n4282J84732k28871j79943
23148c39986j44143J80665M19215L0004J0291O1598l3551l40926n727P8526M15124
23137C31090J74542j43537l3568M9171j36574p6976j14864j03468j19088L30994
$$ plain form
23127 157722 413502 245655 263797 -126467 -35186 94972 -63417 169199 -104934 -226950
23117 -226950 -25179 104409 44592 -262408 -517740 -319571 -184131 -407190 -452859 -394531
23107 -394531 -350034 -230646 62435 246860 384071 -33720 -202157 76608 -204418 -195869
23097 -195869 -105229 138794 257426 -43894 -257549 -67941 73065 175057 294006 362027
23087 362027 411902 116300 -481107 -805016 -672080 -757677 -568432 -287248 -129359 -123439
23077 -123439 -255416 -108089 -369087 -329745 -357231 -578686 -512391 -307281 -323349 -253799
23067 -253799 -400955 -616920 -441884 -317190 -102918 -278420 -456643 -355662 -256520 -401029
23057 -401029 -258024 -368485 -199172 63362 -232857 -292619 -303595 -408369 -326995 -119013
$$ packed form
23127A57722K55780j67847J8142l90264R1281J30158j58389K32616k74133j22016
23117b26950K01771J29588n9817l07000k55332J98169J35440k23059m5669N8328
23107c94531M4497J19388K93081J84425J37211m17791j68437K78765k81026Q549
23097a95869R0640K44023J18632l01320k13655J89608J41006J01992J18949O8021
23087C62027M9875k95602n97407l23909J32936q5597J89245K81184J57889N920
23077a23439j31977J47327k60998L9342k7486k21455O6295K05110j6068O9550
23067b53799j47156k15965J75036J24694K14272j75502j78223J00981R9142j44509
23057d01029J43005j10461J69313K62534k96219n9762j0976j04774Q1374K07982
$$ plain form
23047 -119013 38246 366950 150105 49666 -10341 -229044 -212475 -161886 -58966 40196
23037 40196 -81607 -506136 -629559 -189711 1879 26691 -330662 -657479 -862983 -675558
23027 -675558 -584162 -273971 -147218 179683 347965 230833 196590 369997 76676 -181604
23017 -181604 -222514 -486190 -298767 36901 69773 -278505 -686944 -242677 -10097 -138481
23007 -138481 -233361 216138 682612 423814 127700 -238797 -808156 -594853 -256283 -460595
22997 -460595 -859498 -751955 -489543 -165020 -50318 -190894 -148653 -126550 -47525 -116962
22987 -116962 -113232 -73237 229076 421880 351631 256098 167627 26971 -2282 138162 244811
22976 244811 307286 322981 189181 102155 -45729 -102066 -118161 -60375 1223 253428 203542
$$ packed form
23047a19013J57259L28704k16845j00439o0007k18703J6569N0589J02920R9162
23037D0196j21803m24529j23423M39848J91590K4812l57353l26817k05504J87425
23027f75558R1396L10191J26753L26901J68282j17132l4243J73407k93321k58280
23017a81604m0910k63676J87423L35668L2872l48278m08439M44267K32580j28384
23007a38481r4880M49499M66474k58798k96114l66497n69359K13303L38570k04312
22997d60595l98903J07543K62412L24523J14702j40576M2241K2103P9025o9437
22987a16962L730L9995L02313J92804p0249r5533q8471j40656k9253J40444J06649
22976B44811O2475J5695j33800q7026j47884n6337j6095N7786O1598K52205m9886
$$ plain form
22965 203542 -43983 -39252 2708 243243 383295 372651 -13200 -299553 -182596 -142361
22955 -142361 -43820 29730 16806 -138756 -45792 290041 262709 76635 -57569 -369476
22945 -369476 -553518 -607521 -551559 -392423 -140881 -60868 -135802 -109235 -47135 -76262 -27849
22934 -27849 77561 17513 -112141 -558813 -570508 -328996 59382 -241913 -127339 -44553
22924 -44553 -54279 -95520 20918 -38874 218414 168790 -3632 -81490 -291723 -175998 -4981
22913 -4981 -220355 -322382 -515839 -579021 -350105 10074 -340166 -251006 -163695 54917
22903 54917 124708 29239 -186274 -286335 -224312 -73049 -237651 -43671 -229182 -317723
22893 -317723 -243859 -709427 -1063308 -605838 -28463 128950 -71562 -97375 -243940 -87222
$$ packed form
22965B03542k47525M731M1960K40535J40052j0644l85851k86353J16957M0235
22955a42361R8541P3550j2924j55562R2964L35833k7332j86074j34204l11907
22945c69476j84042n4003N5962J59136K51542Q0013p4934K6567O2100k9127M8413
22934b7849J05410o0048j29654m46672j1695K41512L88378l01295J14574Q2786
22924d4553r726m1241J16438n9792K57288m9624j72422p7858k10233J15725J71017
22913d981k15374j02027j93457o3182K28916L60179l50240Q9160Q7311K18612
22903E4917O9791r5469k15513j00061O2023J51263j64602J93980j85511q8541
22893c17723P3864m65568l53881M57470N77375J57413k00512k5813j46565J56718
$$ plain form
22883 -87222 116050 -20840 -1262 76758 153719 125615 25111 -110092 -92258 87583 10650
22872 10650 56651 -101969 -254475 -207751 268490 790900 728818 359128 186330 236459
22862 236459 210998 164179 -172410 -582494 -445199 -177984 -145175 17694 -201234 -443342
22852 -443342 -290703 -275265 -467620 -665314 -624076 -345710 -492875 -527964 -261914 41465
22842 41465 143258 -72813 64688 -25699 -267953 -74389 20670 9800 -257285 -206962
22832 -206962 -324556 -482620 -407751 -147862 192942 212554 638292 453133 97585 41032
22822 41032 44668 -186123 -384380 -387724 -377229 -69533 329126 -54558 -470906 -650886 -745597
22811 -745597 -208856 -210082 -526851 -693041 -371803 -212918 -87689 -207784 -436044 -485478
$$ packed form
22883h7222K03272j36890J9578P8020P6961k8104j00504j35203J7834J79841p6933
22872A0650M6001j58620j52506M6724M76241N22410o2082l69690j72798N0129
22862B36459k5461m6819l36589m10084J37295K67215L2809J62869k18928k42108
22852d43342J52639J5438j92355j97694M1238K78366j47165l5089K66050L03379
22842D1465J01793k16071J37501r0387k42254J93564R5059j0870k67085N0323
22832b06962j17594j58064P4869K59889L40804J9612M25738j85159l55548n6553
22822D1032L636k30791j98257l344J0495L07696L98659l83684m16348j79980r4711
22811g45597N36741j226l16769j66190L21238J58885J25229j20095k28260m9434
$$ plain form
22801 -485478 -446891 -570244 -554705 -163937 84402 100030 197175 248282 286875 264229 26428
22790 26428 -286471 -420875 -249706 14678 -180117 88002 237978 236054 463819 401109
22780 401109 512457 739237 775190 581134 392540 75226 -236508 -385751 -169249 -135537
22770 -135537 -95528 -57659 16784 124849 -52811 -314900 -358660 166961 283350 375891
22760 375891 370704 92622 -162450 -157645 433592 681085 686485 364836 248807 157347 8500
22749 8500 -22276 -148136 -361824 -178006 -209554 -187883 22017 -61654 -42881 -355516 -112689
22738 -112689 227235 549321 460529 263630 -84875 -327988 -336945 -275050 -258868 -224201 -389361
22727 -389361 -351672 -440118 -191963 -60791 -318587 -477309 -512355 -472244 -102596 -51495
$$ packed form
22801d85478L8587j23353J5539L90768K48339J5628R7145N1107L8593k2646k37801
22790B6428l12899j34404J71169K64384j94795K68119J49976j924K27765o2710
22780D01109J11348K26780L5953j94056j88594l17314l11734j49243K16502L3712
22770a35537M0009L7869P4443J08065j77660k62089m3760N25621J16389R2541
22760C75891n187k78082k55072M805N91237K47493N400l21649j16029r1460j48847
22749H500l0776j25860k13688J83818l1548K1671K09900q3671J8773l12635K42827
22738a12689L39924L22086q8792j96899l48505k43113q957O1895J6182L4667j65160
22727c89361L7689q8446K48155J31172k57796j58722l5046M0111L69648N1101
$$ plain form
22717 -51495 -392066 -361027 -141713 -43786 205590 359950 358775 80745 -230384 -330260 -536543
22706 -536543 -544639 -623865 -755889 -645274 -486079 -243521 -321854 -305493 -247338 -59432 -122518
22695 -122518 -312067 -382224 -143158 -269030 -449014 -471882 -214299 -172689 -308872 -247614
22685 -247614 -63965 -321839 -754475 -650009 -634788 -381812 -103931 64409 -489286 -996535
22675 -996535 -946418 -776773 -467649 -433383 -363906 -158859 -139707 -79907 -188210 -31931
22665 -31931 -44616 -170340 -164491 -305123 -384821 -155947 178825 95628 -90374 -307164 -125131
22654 -125131 -176556 -275825 -107714 -220478 -259071 -188866 -259941 -628262 -495435 -186453
22644 -186453 -130237 -133192 -64488 11260 -303363 -403698 -849081 -1127908 -1072851 -1062864 -962297
$$ packed form
22717e1495l40571L1039K19314R7927K49376J54360j175k78030l11129r9876k06283
22706e36543q096p9226j32024J10615J59195K42558p8333J6361N8155J87906o3086
22695a22518j89549p0157K39066j25872j79984k2868K57583M1610j36183O1258
22685b47614J83649k57874m32636J04466J5221K52976K77881J68340n53695n07249
22675i96535N0117J69645L09124L4266O9477K05047J9152N9800j08303J56279
22665c1931j2685j25724N849j40632p9698K28874L34772q3197j86002k16790J82033
22654a25131n1425r9269J68111j12764l8593P0205p1075l68321J32827L08982
22644a86453N6216k955O8704P5748l14623j00335m45383k78827N5057R987J00567
$$ plain form
22633 -962297 -745936 -794286 -880057 -745407 -705622 -734526 -532978 -520888 -555685 -450825 -261402
22622 -261402 -265653 -142222 21183 -119631 -315679 -226063 -159270 -389341 -465855 -199608
22612 -199608 241822 309082 -6939 211941 472712 604570 492175 148048 -57894 -308032
22602 -308032 -544207 -453120 -499191 -609412 -441910 -209565 -110620 156470 310829 -233379
22592 -233379 -479359 -116878 165224 -69096 -261346 -58668 -88875 -230659 -291564 -120527
22582 -120527 -146173 -350724 -348691 -68563 189464 95373 -162918 -121151 -171205 -47268 7794
22571 7794 48195 -475105 -384017 -29676 28205 -135391 -185216 -184649 60902 438507 450587
22560 450587 235830 129050 -68445 -91513 158831 72570 -192074 62540 -99282 -158687
$$ packed form
22633i62297K16361m8350q5771J34650L9785k8904K01548J2090l4797J04860J89423
22622b61402m251J23431J63405j40814j96048Q9616O6793k30071p6514K66247
22612a99608M41430O7260l16021K18880K60771J31858j12395l44127k05942k50138
22602c08032k36175R1087m6071j10221J67502K32345R8945K67090J54359n44208
22592b33379k45980L62481K82102k34320j92250K02678l0207j41784o0905J71037
22582a20527k5646k04551K033K80128K58027r4091k58291M1767n0054J23937N5062
22571G794M0401n23300R1088L54341N7881j63596m9825N67K45551L77605J2080
22560D50587k14757j06780j97495k3068K50344q6261k64644K54614j61822n9405
$$ plain form
22550 -158687 -91997 67241 292964 216759 262152 3932 -219331 -507737 -428976 -57543
22540 -57543 131230 240217 8500 -444384 -595608 -515497 -254855 -43996 218926 8593
22530 8593 -37481 115307 1344 -107387 144520 208506 -281209 -507406 -394453 -538640
22520 -538640 -962521 -937675 -598058 -571566 -436774 -216363 -372092 -531766 -274465 -19348
22510 -19348 348203 238366 209267 58425 -115263 -332831 -345290 -49699 -38010 -315899
22500 -315899 -441513 -412017 20672 126136 -313501 -378823 -333667 -197596 -193100 -81714
22490 -81714 -95431 -68854 -114076 185437 299979 5778 -373120 -310620 -28313 180464
22480 180464 310992 238644 134131 8590 -354116 -390651 -299663 -525946 -594084 -467454
$$ packed form
22550a58687O6690J59238K25723p6205M5393k58220k23263k88406P8761L71433
22540e7543J88773J08987k31717m52884j51224Q0111K60642K10859K62922k10333
22530H593m6074J52788j13963j08731K51907O3986m89715k26197J12953j44187
22520e38640m23881K4846L39617K6492J34792K20411j55729j59674K57301K55117
22510a9348L67551j09837k9099j50842j73688k17568j2459K95591J1689k77889
22500c15899j25614K9496M32689J05464m39637o5322M5156J36071M496J11386
22490h1714j3717K6577m5222K99513J14542k94201l78898O2500K82307K08777
22480A80464J30528p2348j04513j25541l62706l6535R0988k26283o8138J26630
$$ plain form
22470 -467454 -460646 -729897 -774254 -531908 -371458 -425861 -851599 -1141453 -1222359 -824278
22460 -824278 -439593 -69971 277292 234703 257818 456237 529352 154386 -174457 -740980
22450 -740980 -938196 -810198 -653747 -525559 -508677 -566505 -419524 73244 265548 208231
22440 208231 165374 -136975 -149377 -41662 -166398 -479385 -375547 -286892 -4688 65605
22430 65605 -270253 -323384 -87218 378784 424073 -40763 148863 368760 385090 185194
22420 185194 109045 281981 -120025 -219519 -295246 -254352 -97792 -38977 -121395 -158346 -296962
22409 -296962 -147584 -18597 36319 -107882 -130688 -326772 66598 104049 162687 133128
22399 133128 -92485 -189306 117869 303501 394600 278657 159430 120049 -71129 -187064
$$ packed form
22470d67454O808k69251m4357K42346J60450n4403m25738k89854q0906L98081
22460h24278L84685L69622L47263m2589K3115J98419P3115l74966l28843n66523
22450g40980j97216J27998J56451J28188J6882n7828J46981M92768J92304n7317
22440B08231m2857l02349j2402J07715j24736l12987J03838Q8655K82204P0293
22430F5605l35858n3131K36166M66002M5289m64836J89626K19897J6330j99896
22420A85194p6149J72936m02006r9494p5727M0894J56560N8815q2418l6951j38616
22409b96962J49378J28987N4916j44201k2806j96084L93370L7451N8638k9559
22399A33128k25613r6821L07175J85632R1099j15943j19227l9381j91178j15935
$$ plain form
22389 -187064 -301052 -237587 -184992 -135121 -45192 -199569 -261531 -339961 -391976 -588193 -618983
22378 -618983 -633379 -369969 -160235 -195309 -510355 -563893 -297590 -387774 -202626 -126099
22368 -126099 -248655 -215233 -117580 -176388 -462641 -793044 -914650 -727057 -132347 -254622
22358 -254622 -93706 191766 7611 -220987 -218022 -187527 -7170 188848 124141 51767
22348 51767 -59804 -260162 -412280 -438336 -676609 -456201 -234284 -554376 -721212 -571482
22338 -571482 -307761 -472396 -856609 -540198 -151387 -226831 -448819 -315299 -70687 102003
22328 102003 -139903 -177430 -5768 240550 273476 -89373 -443845 -465467 -440798 -360173
22318 -360173 -338197 -257004 -236359 -226156 -15282 35416 -300939 -114688 141987 285101
$$ packed form
22389a87064j13988O3465N2595M9871Q9929j54377o1962p8430n2015j96217l0790
22378f18983j4396K63410K09734l5074l15046n3538K66303r0184J85148P6527
22368a26099j22556L3422R7653n8808k86253l30403j21606J87593N94710j22275
22358b54622J60916K85472j84155k28598K965L0495J80357J96018o4707p2374
22348E1767j11571k00358j52118k6056k38273K20408K21917l20092j66836J49730
22338e71482K63721j64635l84213L16411L88811p5444k21988J33520K44612J72690
22328A02003k41906l7527J71662K46318L2926l62849l54472k1622K4669Q0625
22318c60173K1976Q1193K0645J0203K10874N0698l36355J86251K56675J43114
$$ plain form
22308 285101 379326 179879 -89304 -264542 -272330 -470657 -952616 -1046301 -614398 -115432
22298 -115432 350673 325928 268584 444419 581086 209825 -196541 -446856 -193407 -289392
22288 -289392 -294118 -430844 -204754 -3283 283744 233715 -82611 -232474 -327652 -183573
22278 -183573 -177497 -280634 -143930 -154857 114392 165581 -160135 -398781 -427127 -199753
22268 -199753 -40445 42160 -141397 -104351 31431 68 87244 152913 136287 122876 -145067
22257 -145067 -299590 -49507 -117200 -349135 -598250 -575225 -370406 -518133 -684871 -505677
22247 -505677 -591525 -728557 -379260 -310010 -313820 -530162 -586320 -438773 -281570 -61976
22237 -61976 97445 -28714 -376346 -275855 150853 -51825 -327710 -354475 -545000 -727174
$$ packed form
22308B85101R4225j99447k69183j75238p788j98327m81959r3685M31903M98966
22298a15432M66105k4745n7344J75835J36667l71261m06366k50315K53449r5985
22288b89392m726j36726K26090K01471K87027n0029l16326j49863r5178J44079
22278a83573O076j03137J36704j0927K69249N1189l25716k38646k8346K27374
22268a99753J59308Q2605j83557L7046J35782l1363Q7176O5669j6626j3411k67943
22257a45067j54523K50083o7693k31935k49115K3025K04819j47727j66738J79194
22247e05677q5848j37032L49297O9250l810k16342n6158J47547J57203K19594
22237f1976J59421j26159l47632J00491M26708k02678k75885k6765j90525j82174
$$ plain form
22227 -727174 -377018 10152 46475 154891 -227749 -52226 112013 -172614 -142314 -241146
22217 -241146 -270490 -334331 -598987 -1010106 -982720 -1028102 -706323 -551015 -273671 14876
22207 14876 -235466 -311735 114650 520781 84140 -209921 -39191 -47887 113882 257984
22197 257984 799372 832462 798040 746811 360591 -26485 -44624 38114 -85983 93443
22187 93443 154252 72483 -148929 -311564 -460925 -100163 120468 -168364 -57572 -140089
22177 -140089 -437293 -565863 -599976 -733221 -634787 -466609 -531698 -713033 -242991 327652
22167 327652 152327 -251711 -310728 -66017 -232637 -206341 204100 185165 776 2434
22157 2434 160513 459741 499626 148941 -64647 142855 383666 351582 -81071 -316717
$$ packed form
22227g27174L50156L87170L6323J08416l82640J75523J64239k84627L0300r8832
22217b41146k9344o3841k64656m11119K7386m5382L21779J55308K77344K88547
22207A4876k50342p6269M26385M06131m36641k94061J70730q696J61769J44102
22197B57984N41388L3090l4422n1229l86220l87076j8139Q2738j24097J79426
22187I3443O0809q1769k21412j62635j49361L60762K20631k88832J10792q2517
22177a40089k97204j28570l4113j33245R8434J68178o5089j81335M70042N70643
22167C27652j75325m04038n9017K44711j66620K6296M10441j8935j84389J658
22157B434J58079K99228L9885l50685k13588K07502K40811l2084m32653k35646
$$ plain form
22147 -316717 42548 168479 274293 169751 232241 704920 1364036 1603467 1764929 1392302
22137 1392302 863521 1059377 1454952 1315032 1214493 849122 669513 680913 815215 828148
22127 828148 449332 271401 391043 251571 47631 16116 308635 316339 -84167 -53903
22117 -53903 124049 142970 -24622 -52061 -389694 -307913 -420696 -256098 -351868 -202031
22107 -202031 157934 365189 364150 91848 140224 156418 108200 -4179 -77746 95471 70044
22096 70044 115268 206813 402743 228606 39151 30326 -26961 -252183 -418065 -634027 -573650
22085 -573650 -264359 -214407 -67543 76054 191186 79005 -91495 -120546 -52078 163405
22075 163405 365118 393958 357191 110609 -345324 -492729 -309643 -589752 -302631 -173477
$$ packed form
22147c16717L59265J25931J05814j04542O2490M72679O59116K39431J61462l72627
22137A392302n28781J95856L95575j39920j00539l65371j79609J1400J34302J2933
22127H28148l78816j77931J19642j39472k03940l1515K92519P704m00506L0264
22117e3903J77952J8921j67592k7439l37633Q1781j12783J64598r5770J49837
22107b02031L59965K07255j039k72302M8376J6194m8218j12379p3567J73217k5427
22096G0044M5224R1545J95930j74137j89455q825n7287k25222j65882k15962O0377
22085e73650L09291M9952J46864J43597J15132j12181j70500k9051O8468K15483
22075A63405K01713K8840l6767k46582m55933j47405J83086k80109K87121J29154
$$ plain form
22065 -173477 -131901 -29987 -197427 -567651 -667878 -614404 -582013 -478498 -285183 161255
22055 161255 324727 339442 -46701 -62089 141472 -22104 -38520 288223 336325 388395
22045 388395 228195 172519 67103 -116882 -384454 -586360 -522370 -333136 -97293 -102911
22035 -102911 -259444 -153298 49554 306438 404595 114566 87104 69131 41842 -153667
22025 -153667 -411895 -305669 -104904 -188312 -197566 -363060 -253592 -90822 6029 -39948
22015 -39948 15577 27115 14442 22700 -86740 -68661 -67562 -357364 -403257 -366129 -334300 -461497
22003 -461497 -811825 -722644 -86613 336359 366247 469309 167827 147200 262329 290885
21993 290885 414162 580658 613156 755155 515072 -110048 -301416 -54910 -8694 3721
$$ packed form
22065a73477M1576J01914j67440l70224j00227N3474L2391J03515J93315M46438
22055A61255J63472J4715l86143j5388K03561j63576j6416L26743M8102N2070
22045C88395j60200n5676j05416j83985k67572k01906O3990J89234K35843n618
22035a02911j56533J06146K02852K56884R8157k90029k7462j7973k7289j95509
22025a53667k58228J06226K00765q3408r254j65494J09468J62770R6851m5977
22015c9948N5525J1538j2673Q258j09440J8079J099k89802m5893L7128L1829j27197
22003d61497l50328Q9181O36031M22972K9888J03062l01482k0627J15129K8556
21993B90885J23277J66496L2498J41999k40083o25120j91368K46506M6216J2415
$$ plain form
21983 3721 73379 16917 -7806 -123982 -122284 48182 -42049 -219888 -227580 -232306 -195097 -92107
21971 -92107 -235283 -271513 -345382 -374046 -324728 -56765 232360 -55467 -35289 -235695 -891638
21960 -891638 -1100501 -612443 -447390 -240825 -94658 -216362 -440907 -33039 410905 681407
21950 681407 569317 421356 47204 -55684 -154971 -255963 -268053 -222960 -256955 -15635
21940 -15635 180340 -164571 -592841 -634010 -749023 -723533 -529621 -443603 -211381 -252918
21930 -252918 -106543 39025 -43003 -292402 -401048 -215050 -227178 -417513 -443202 -295134
21920 -295134 -342854 -379798 -348446 -144944 -186321 -477788 -404525 -97044 -75297 -310693 -336205
21909 -336205 -224443 -18659 242810 400600 431543 505397 335056 79450 -78827 -21422
$$ packed form
21983C721O9658n6462k4723j16176J698J70466r0231j77839p692m726L7209J02990
21971i2107j43176l6230p3869k8664M9318K67963K89125k87827K0178k00406o55943
21960h91638k08863M88058J65053K06565J46167j21704k24545M07868M43944K70502
21950F81407j12090j47961l74152j02888r9287j00992j2090M5093l3995K41320
21940a5635J95975l44911m28270m1169j15013K5490J93912Q6018K32222m1537
21930b52918J46375J45568q2028k49399j08646J85998j2128j90335k5689J48068
21920b95134m7720l6944L1352K03502m1377k91467P3263L07481K1747k35396k5512
21909c36205J11762K05784K61469J57790L0943P3854j70341k55606j58277N7405
$$ plain form
21899 -21422 365595 636045 502459 294594 382998 236597 45068 -379534 -485636 -580621
21889 -580621 -646675 -698729 -460180 234777 411215 205229 188129 180173 255797 394114 98478
21878 98478 259964 63490 -183343 -237493 -432175 -235803 15733 185279 457310 516395
21868 516395 394781 487421 561950 240601 -13625 -97417 -2401 46832 -13489 6621 -73406
21857 -73406 -230396 -191054 133134 186018 401380 151389 -34713 -255774 -177545 102325
21847 102325 4067 91989 -124176 -139024 -187214 -207856 -61498 -81449 -213766 -232632 -170538
21836 -170538 -254942 -215949 -192214 -356338 -309141 -290361 -122870 -35623 -217831 -488578 -508820
21825 -508820 -84143 367704 137098 -30359 276881 440921 352626 381257 302798 315563
$$ packed form
21899b1422L87017K70450j33586k07865Q8404j46401j91529m24602j06102r4985
21889e80621o6054n2054K38549O94957J76438k05986j7100p956P5624J38317k95636
21878I8478J61486j96474k46833n4150j94682J96372K51536J69546K72031N9085
21868E16395j21614R2640P4529l21349k54226q3792R5016M9233o0321K0110q0027
21857g3406j56990L9342L24188N2884K15362k49991j86102k21061P8229K79870
21847A02325r8258Q7922k16165j4848m8190k0642J46358j9951j32317j8866O2094
21836a70538q4404L8993K3735j64124M7197J8780J67491Q7247j82208k70747k0242
21825e08820M24677M51847k30606j67457L07240J64040q8295K8631p8459J2765
$$ plain form
21815 315563 155409 -300526 -196896 -76616 61550 154059 55130 -116243 -201374 85316
21805 85316 459868 356357 144158 -121570 -284317 -258969 -133404 -77488 -459693 -398554
21795 -398554 79577 20326 139996 342863 195755 -79323 218358 711932 545934 147630
21785 147630 -182010 -188217 -61459 -152257 -289966 -311921 -279470 9234 335716 483226
21775 483226 384257 75982 -29621 68184 238075 329883 278864 455745 580326 288533
21765 288533 120178 373905 299238 402372 293940 -6130 228698 239953 329427 434224
21755 434224 -121575 -396724 -479389 -621337 -422835 -134689 -92592 -167693 -166311 -118428 -139014
21744 -139014 -294829 -85797 278912 592553 368911 171773 -40565 -388385 -792125 -759226
$$ packed form
21815C15563j60154m55935J03630J20280J38166R2509r8929j71373q5131K86690
21805H5316L74552j03511k12199k65728j62747K5348J25565N5916l82205O1139
21795c98554M78131n9251J19670K02867j47108k75078K97681M93574j65998l98304
21785A47630l29640o207J26758r0798j37709k1955L2451K88704L26482J47510
21775D83226r8969l08275j05603R7805J69891R1808n1019J76881J24581k91793
21765B88533j68355K53727p4667J03134j08432l00070K34828J1255Q9474J04797
21755D34224n55799k75149q2665j41948J98502K88146M2097p5101J382M7883k0586
21744a39014j55815K09032L64709L13641k23642j97138k12338l47820m03740L2899
$$ plain form
21734 -759226 -307645 -293434 -150472 2206 -107377 -203006 131068 332962 212078 -167957
21724 -167957 -338429 -95679 115990 205034 6899 -64859 -9959 234813 28471 -8634
21714 -8634 -401932 -251046 127068 -93425 -498973 -427369 -325695 -387356 -316943 -524644
21704 -524644 -629982 -511378 -622706 -700360 -726719 -641549 -467383 -241299 -392199 -770115
21694 -770115 -574958 -131140 333732 379564 180654 54734 -44346 -524788 -652543 -216669
21684 -216669 97974 276498 506128 39961 -208087 -381325 -125674 255732 498555 357231
21674 357231 -298718 -506120 -363181 -149248 -35881 -21257 207253 298587 457113 274303
21664 274303 126580 -124521 -685395 -844159 -426515 -68306 91425 45540 145977 286420
$$ packed form
21734g59226M51581J4211J42962J52678j09583r5629L34074K01894j20884l80035
21724a67957j70472K42750K11669Q9044j98135p1758N4900K44772k06342l7105
21714h634l93298J50886L78114k20493m05548P1604J01674o1661P0413k07701
21704e24644j05338J18604j11328p7654k6359Q5170J74166K26084j50900l77916
21694g70115J95157M43818M64872M5832j98910j25920r9080m80442j27755M35874
21684b16669L14643J78524K29630m66167k48048j73238K55651L81406K42823j41324
21674C57231o55949k07402J42939K13933J13367J4624K28510R1334J58526j82810
21664B74303j47723k51101n60874j58764M17644L58209J59731m5885J00437J40443
$$ plain form
21654 286420 90230 14565 -217504 -25800 238216 -161956 -122465 -131029 -90907 -1998 -59063
21643 -59063 -49863 72117 -80651 -282229 -364440 -513468 -323962 -325252 -209437 -307193 -42785
21632 -42785 -74655 194247 485725 320380 -132738 -584904 -646583 -510145 -246419 -267525
21622 -267525 -421154 -418615 -136085 -51208 -329680 -581001 -499128 -91913 -67390 -236705
21612 -236705 -151811 -51218 -93740 -185478 -193829 69867 215520 387478 -27883 -219587
21602 -219587 -360820 -362665 -58768 240916 216268 130539 115216 -7661 -127281 -189423 -327003
21591 -327003 -414650 -216852 -27090 33282 137765 -81958 -166742 -22718 231470 78313
21581 78313 97585 -55627 -250080 -40754 52524 -165122 -424385 -13406 501976 433031
$$ packed form
21654B86420j96190p5665k32069J91704K64016m00172L9491q564M0122Q8909n7065
21643e9063R200J21980j52768k01578q2211j49028J89506j290J15815r7756K64408
21632d2785l1870K68902K91478j65345m53118m52166o1679J36438K63726k1106
21622b67525j53629K539K82530Q4877k78472k51321Q1873M07215K4523j69315
21612b36705Q4894J00593m2522r1738q351K63696J45653J71958m15361j91704
21602b19587j41233j845L03897K99684k4648q5729j5323j22877j19620o2142j37580
21591c27003q7647J97798J89762O0372J04483k19723q4784J44024K54188j53157
21581G8313J9272j53212j94453K09326R3278k17646k59263M10979N15382o8945
$$ plain form
21571 433031 528655 606083 676006 469713 558899 598704 368848 113098 145820 305141 184530
21560 184530 156828 95103 195029 201351 -16135 -304334 -388359 -193479 -35488 194711 430910
21549 430910 247365 -33781 41664 84866 433589 654471 453595 387139 486801 280928
21539 280928 -96452 -72582 111538 20208 -84508 -8784 83434 74044 -52696 -66031 -79003
21528 -79003 -152442 -270114 -295105 -291264 -115443 -355659 -320333 39716 -108685 -262140 31481
21517 31481 390070 296866 109689 428118 403501 246702 359031 699746 666200 389220
21507 389220 49128 70937 106747 82923 -11325 -321215 -281261 -314905 -321946 -57154 -159207
21496 -159207 -172696 -351435 -306572 -7419 -11336 215623 240314 570378 145604 -277227
$$ packed form
21571D33031R5624P7428O9923k06293Q9186L9805k29856k55750L2722J59321j20611
21560A84530k7702o1725R9926O322k17486k88199q4025J94880J57991K30199K36199
21549D30910j83545k81146P5445M3202L48723K20882k00876o6456R9662k05873
21539B80928l77380K3870J84120r1330j04716P5724R2218r390j26740j3335j2972
21528g9003p3439j17672k4991L841J75821k40216L5326L60049j48401j53455K93621
21517C1481L58589r3204j87177L18429k4617j56799J12329L40715l3546k76980
21507C89220l40092K1809L5810k3824r4248l09890L9954l3644p041K64792j02053
21496a59207j3489j78739M4863K99153l917K26959K4691L30064m24774m22831
$$ plain form
21486 -277227 -553419 -496036 -42867 426682 587913 310304 173203 473632 617119 558617
21476 558617 160380 27039 -18832 -404623 -539774 -439277 -368876 -272636 97560 321869
21466 321869 341131 10555 100591 373968 153411 -4852 47466 -27649 206943 186311
21456 186311 -225710 -238559 24226 173913 37365 -371232 -344594 -64739 -1657 170294
21446 170294 75384 -97464 -6967 -175233 -603200 -373779 26646 298681 553040 695782
21436 695782 427403 235032 -16507 -124791 194893 185553 -248857 135424 -45922 -147895
21426 -147895 -229724 -200480 -214121 234504 483018 489459 271042 189771 172771 61587 -75390
21415 -75390 18522 -34040 276892 203884 85250 150604 -200724 -258958 -252346 -62037 359412
$$ packed form
21486b77227k76192N7383M53169M69549J61231k77609j37101L00429J43487n8502
21476E58617l98237j33341m5871l85791j35151J00497P0401R6240L70196K24309
21466C21869J9262l30576R0036K73377k20557j58263N2318p5115K34592k0632
21456A86311m12021j2849K62785J49687j36548m08597K6638K79855O3082J71951
21446A70294r4910j72848R0497j68266m27967K29421M00425K72035K54359J42742
21436F95782k68379j92371k51539j08284L19684r340m34410L84281j81346j01973
21426a47895q1829K9244j3641M48625K48514O441k18417q1271j7000j11184j36977
21415g5390R3912n2562L10932p3008j18634O5354l51328n8234O612J90309M21449
$$ plain form
21404 359412 293071 386540 258695 -97439 -162190 -443525 -662412 -790418 -436679 -224802
21394 -224802 -359675 -499500 -226938 -106037 -410339 -236118 -110033 -284008 69677 249368
21384 249368 -63373 -272563 -31087 -175119 -279587 -99360 165454 199204 29590 30392
21374 30392 165288 329506 -96443 -389366 -458799 -432928 128735 493087 415471 259357
21364 259357 290529 334515 509564 474525 516168 180136 -94989 -200097 -97902 -52700
21354 -52700 53143 -55902 32859 110641 114252 73597 -93574 -112352 -348697 -547444 -270781
21343 -270781 -12889 22963 1786 376101 272011 262982 119620 -134556 -106230 -102782 4507
21332 4507 328351 163519 -139421 -157218 32701 84314 -235890 -328107 -486156 -504442 -575023
$$ packed form
21404C59412o6341R3469j27845l56134o4751k81335k18887j28006L53739K11877
21394b24802j34873j39825K72562J20901l04302J74221J26085j73975L53685J79691
21384B49368l12741k09190K41476j44032j04468J80227K64814L3750j69614Q02
21374C0392J34896J64218m25949k92923o9433K5871N61663L64352p7616j56114
21364B59357L1172M3986J75049l5039M1643l36032k75125j05108J02195M5202
21354e2700J05843j09045Q8761P7782L611m0655j67171j8778k36345j98747K76663
21343b70781K57892L5852k1177L74315j04090r029j43362k54176K8326L448J07289
21332D507L23844j64832l02940j7797J89919N1613l20204r2217j58049j8286p0581
$$ plain form
21321 -575023 -459664 -240252 -83673 -97523 85294 -34205 -138888 -42575 -87677 93849
21311 93849 124199 -148774 -541309 -441491 -107154 -200565 -320626 -505466 -417343 -9776
21301 -9776 148727 -231573 -372061 -6391 166034 -14 -4022 -130681 -271657 -415408
21291 -415408 -235909 -261764 -6784 273877 71290 -265498 -221395 -317508 -136215 205530
21281 205530 -17632 -239590 -219564 109924 374928 641642 666200 854673 620495 345991
21271 345991 -41147 -45663 16534 69046 186306 259911 -41377 -432224 -531537 -626491 -127444
21260 -127444 -210017 -612844 -610028 -107649 -241000 -525958 -420386 -395902 -152419 -44079
21250 -44079 357965 88319 94202 386329 313895 27811 -122343 -344011 -175188 -368636
$$ packed form
21321e75023J15359K19412J56579j3850J82817j19499j04683R6313m5102J81526
21311I3849L0350k72973l92535R9818L34337r3411j20061j84840Q8123M07567
21301i776J58503l80300j40488L65670J72425j66048m008j26659j40976j43751
21291d15408J79499k5855K54980K80661k02587l36788M4103r6113J81293L41745
21281B05530k23162k21958K0026L29488K65004K66714K4558J88473k34178k74504
21271C45991l87138m516O2197N2512J17260P3605l01288l90847r9313r4954M99047
21260a27444q2573m02827K816N02379j33351k84958J05572K4484K43483J08340
21250d4079M02044k69646N883K92127p2434k86084j50154k21668J68823j93448
$$ plain form
21240 -368636 -343206 -189146 66620 10912 -134856 65043 26625 98340 257077 252979 -245135
21229 -245135 110388 484426 532919 688499 378497 -10539 -245780 -470202 -353414 -279966
21219 -279966 -169105 -126257 110835 271644 190170 -9518 -266272 -318294 22304 249479
21209 249479 360604 152045 190322 523614 477394 356108 -34724 -552186 -631004 -98678
21199 -98678 268219 179796 -128183 -211275 65560 412684 601438 773507 793150 478696
21189 478696 75528 -19450 46811 -4001 455467 610328 531101 506147 350036 255660 179953
21178 179953 -98018 186378 304194 27423 -99475 46420 529482 686553 298531 342286
21168 342286 357755 276567 193429 69881 230658 524007 356334 160584 124982 -55229
$$ packed form
21240c68636K5430J54060K55766n5708j45768J99899l8418P1715J58737m098m98114
21229b45135L55523L74038M8493J55580l10002l89036k35241k24422J16788P3448
21219b79966J10861M2848K37092J60809q1474j99688k56754n2022L40598K27175
21209B49479J11125k08559L8277L33292m6220j21286l90832n17462p8818N32326
21199i8678L66897q8423l07979q3092K76835L47124J88754J72069J9643l14454
21189D78696m03168r4978O6261n0812M59468J54861p9227k4954j56111r4376p5707
21178A79953k77971K84396J17816k76771j26898J45895M83062J57071l88022M3755
21168C42286J5469q1188q3138j23548J60777K93349j67673j95750l5602j80211
$$ plain form
21158 -55229 -217442 -47750 91049 106850 344453 430944 239023 -176981 -248705 -298794
21148 -298794 -428609 -441459 -69629 -44194 -92857 322626 937550 966834 913503 747290
21138 747290 676427 747808 403592 286536 137656 -53254 -112188 -205249 -283767 -201253 313310
21127 313310 389003 489015 265003 141993 155115 139549 138649 81529 -25946 -35078 65597
21116 65597 306134 59027 -47696 -30910 -82812 143178 71022 -329072 -514145 -399410
21106 -399410 -260027 -101849 -224209 37534 54980 -190341 -2193 33711 53805 150682
21096 150682 -118562 -174498 -3620 246396 188382 300178 91659 -202989 -265601 -248492
21086 -248492 -278026 -472038 -573319 -452318 -172140 -192282 -446977 -359773 -169401 108936
$$ packed form
21158e5229j62213J69692J38799J5801K37603Q6491j91921m16004p1724n0089
21148b98794j29815j2850L71830K5435m8663M15483O14924K9284n3331j66213
21138G47290p0863P1381l44216j17056j48880j90910n8934r3061p8518Q2514N14563
21127C13310P5693J00012k24012j23010J3122j5566r00n7120j07475r132J00675
21116F5597K40537k47107j06723J6786n1902K25990p2156m00094j85073J14735
21106c99410J39383J58178j22360K61743J7446k45321J88148L5904K0094R6877
21096A50682k69244n5936J70878K50016n8014J11796k08519k94648o2612J7109
21086b48492k9534j94012j01281J21001K80178k0142k54695Q7204J90372K78337
$$ plain form
21076 108936 116282 -139310 -26260 -137185 -144528 51871 142836 104392 134979 -25556 -187150
21065 -187150 -402069 -356425 -182375 -26669 166980 224531 111419 -110459 16534 175659
21055 175659 -91289 -161124 -2843 25683 310406 213762 35961 75791 103926 172755 169935
21044 169935 112186 149383 240463 20129 -163919 -97003 321753 547554 553005 468755 487731
21033 487731 455752 127554 73614 -170811 -352842 -268787 54855 45063 117081 258187 325803
21022 325803 371996 516140 397761 228069 294120 228243 179838 251934 182278 31503 -183482
21011 -183482 -192049 45050 -39617 -122921 -23839 327904 737742 948693 572958 442845
21001 442845 226284 196233 -110723 -229432 -97729 45632 117259 142100 182292 331177
$$ packed form
21076A08936P346k55592J13050j10925p343J96399R0965l8444L0587j60535j61594
21065a87150k14919M5644J74050J55706J93649N7551j13112k21878J26993J59125
21055A75659k66948o9835J58281K8526K84723r6644j77801L9830K8135O8829k820
21044A69935n7749L7197R1080k20334j84048O6916M18756K25801N451q4250J8976
21033D87731l1979l28198n3940k44425j82031Q4055L23642r792P2018J41106O7616
21022C25803M6193J44144j18379j69692O6051o5877m8405P2096o9656j50775k14985
21011a83482q567K37099q4667q3304R9082L51743M09838K10951l75735j30113
21001D42845k16561l0051l06956j18709J31703J43361P1627K4841M0192J48885
$$ plain form
20991 331177 601605 487220 647980 835497 692011 130370 -32777 -79340 -308884 -278580
20981 -278580 -216969 -292254 202412 392730 395694 235764 48011 126645 168553 246537 43134
20970 43134 -268040 18242 206028 205275 265770 147428 70574 -170524 -369173 -574794 -400529
20959 -400529 21216 13078 -224398 -191058 -177132 159812 -103664 -15724 104871 273679
20949 273679 120525 79132 214124 276147 199019 205493 112103 284922 139703 132100 446324
20938 446324 420237 382719 -13648 -339622 -435441 61497 133520 26674 -72903 -93883 247922
20927 247922 338337 57096 295805 431729 41316 34889 548886 590140 273976 409730
20917 409730 562311 701793 483999 131698 -287 287372 482395 174623 -270402 67998
$$ packed form
20991C31177K70428j14385J60760J87517j43486n61641j63147m6563k29544L0304
20981b78580O1611p5285M94666J90318K964j59930j87753P8634M1908P7984k03403
20970D3134l11174K86282J87786p53O0495j18342p6854k41098j98649k05621J74265
20959d00529M21745q138k37476L3340J3926L36944k63476Q7940J20595J68808
20949B73679j53154m1393J34992O2023p7128O474r3390J72819j45219p603L14224
20938D46324k6087l7518l96367l25974r5819M96938P2023j06846r9577k0980L41805
20927B47922R0415k81241K38709J35924l90413o427N13997M1254l16164J35754
20917D09730J52581J39482k17794l52301j31985K87659J95023l07772m45025L38400
$$ plain form
20907 67998 244511 198352 -84068 -201717 -294724 -200961 225449 172763 394144 740335
20897 740335 509762 101021 -21694 113978 147579 261898 772450 704328 496456 296589
20887 296589 -18150 161552 383291 709654 495636 293957 46977 -80897 -60636 -406516
20877 -406516 -342901 52003 -185859 -307672 -292919 -181972 7858 88386 178783 443421
20867 443421 376097 300832 268894 339598 25808 209134 387963 424236 251192 93686
20857 93686 288839 131685 30228 41029 120270 28693 64862 -159719 37593 101839 47676
20846 47676 65672 1271 -266641 -100425 -165478 -167787 -116806 -100718 -338100 -697183 -478230
20835 -478230 -103623 -155641 43231 281728 570510 448422 669 -208407 110947 159604
$$ packed form
20907F7998J76513m6159k82420j17649r3007R3763M26410n2686K21381L46191
20897G40335k30573m08741j22715J35672L3601J14319N10552o8122k07872j99867
20887B96589l14739J79702K21739L26363k14018k01679k46980j27874K0261l45880
20877d06516O3615L94904k37862j21813J4753J10947J89830Q0528R0397K64638
20867D43421o7324p5265l1938P0704l13790J83326J78829L6273j73044j57506
20857I3686J95153j57154j01457J0801P9241r1577L6169k24581J97312O4246n4163
20846D7676J7996o4401k67912J66216o5053k309N0981J6088k37382l59083K18953
20835d78230L74607n2018J98872K38497K88782j22088m47753k09076L19354M8657
$$ plain form
20825 159604 64682 -28553 -47879 233564 218866 -40999 53300 -44465 -270947 -76027 -56601
20814 -56601 -316220 -378640 -84740 151214 -318295 -535476 -527937 -122763 19408 203637
20804 203637 329786 319640 170224 151580 65239 100179 244498 212705 6582 52054 117163
20793 117163 303558 356175 -100537 -14953 -128129 -107235 -129104 -18522 -125755 -27516
20783 -27516 145626 415334 357887 405555 227693 155208 151680 -43391 -88803 -56828 -33198
20772 -33198 -25415 213380 352869 404378 323960 312777 34877 -175979 -70430 149649 358093
20761 358093 420882 386541 101555 -109984 -161411 -428061 -304116 -186444 -346212 -71363
20751 -71363 294682 420143 92144 -105197 100756 402374 657103 499799 42645 -120711
$$ packed form
20825A59604r4922r3235j9326K81443j4698k59865R4299r7765k26482J94920J9426
20814e6601k59619o2420K93900K35954m69509k17181P539M05174J42171J84229
20804B03637J26149j0146j49416j8644q6341L4940J44319l1793k06123M5472O5109
20793A17163J86395N2617m56712Q5584j13176K0894k1869J10582j07233R8239
20783b7516J73142K69708n7447M7668j77862p2485l528j95071m5412L1975K3630
20772c3198P783K38795J39489N1509q0418j1183k77900k10856J05549K20079K08444
20761C58093O2789l4341k84986k11539n1427k66650J23945J17672j59768K74849
20751g1363L66045J25461l27999j97341K05953L01618K54729j57304m57154j63356
$$ plain form
20741 -120711 -9927 148046 168541 259026 363492 107111 213080 440117 78672 -204846
20731 -204846 -88941 105863 204962 45768 -123356 -107556 -122061 -162988 -54878 174306
20721 174306 123688 111897 189290 -64128 15835 7736 -55582 344696 549379 292963 -22734
20710 -22734 38818 317997 408340 247345 90154 185702 218023 -15217 119773 441588
20700 441588 681811 396596 254428 127698 3267 -165778 104301 282688 328309 115173
20690 115173 -29161 425436 755215 863443 788317 589539 358241 86818 121728 104708
20680 104708 -134549 -203296 -37717 115670 228882 312427 435050 306479 215477 85549
20670 85549 60571 360784 164236 -258464 -513326 -149061 103105 260626 505775 563130
$$ packed form
20741a20711J10784J57973K0495R0485J04466k56381J05969K27037l61445k83518
20731b04846J15905J94804R9099j59194j69124J5800j4505m0927J08110K29184
20721A74306n0618j1791P7393k53418P9963q099o3318M00278K04683k56416l15697
20710b2734O1552K79179R0343j60995j57191R5548L2321k33240J34990L21815
20700D41588K40223k85215j42168j26730j24431j69045K70079J78387M5621k13136
20690A15173j44334M54597L29779J08228p5126j98778k31298k71423L4910j7020
20680A04708k39257o8747J65579J53387J13212Q3545J22623j28571r1002j29928
20670H5549k4978L00213j96548m22700k54862L64265K52166J57521K45149N7355
$$ plain form
20660 563130 349151 215795 437727 256012 34967 -157914 -13625 304160 141094 -115595
20650 -115595 56984 333995 179496 92962 228741 359807 490385 343188 -5905 351967
20640 351967 336513 4867 -87713 -99492 -19276 7680 -394597 -476930 -312954 -383635 -191710
20629 -191710 -271087 -192787 99506 -44353 -42924 240212 824377 880443 323094 137649
20619 137649 62734 -134844 -234691 -235536 -14971 150972 185519 276980 -49489 -418653 -474405
20608 -474405 -194812 -315493 -166509 138588 173087 -42140 -127998 -115898 -244312 -768
20598 -768 314876 775826 760866 518795 478724 146948 118758 429211 523332 520399 597645
20587 597645 493498 483911 322762 330785 482183 629522 687970 460442 374576 592263 671357
$$ packed form
20660E63130k13979j33356K21932j81715k21045j92881J44289L17785j63066k56689
20650a15595J72579K77011j54499q6534J35779J31066J30578j47197l49093L57872
20640C51967j5454l31646r2580j1779Q0216K6956m02277q2333J63976p0681J91925
20629a91710p9377P8300K92293j43859J429K83136N84165N6066n57349j85445
20619A37649p4915j97578r9847q45K20565J65943L4547R1461l26469l69164n5752
20608d74405K79593j20681J48984L05097L4499k15227q5858J2100j28414K43544
20598g68L15644M60950j4960k42071m0071l31776k8190L10453R4121k933P7246
20587E97645j04147r587j61149Q023J51398J47339N8448k27528q5866K17687P9094
$$ plain form
20576 671357 418173 554677 356000 112713 -177826 -240432 50248 -221145 -449184 -281542
20566 -281542 84106 420734 544704 208596 96311 86953 102433 -14844 -150057 -222552
20556 -222552 -446004 -362520 -53775 353797 258351 -44113 -51318 121040 183501 191431 180743
20545 180743 202295 246349 290796 196313 122969 181642 392927 577361 474432 542073 364394
20534 364394 518377 663385 725177 911379 893084 459436 468992 612437 643476 398652
20524 398652 498195 481026 226378 170802 141057 232493 402458 406058 343496 524449 422932
20513 422932 213074 26382 -17471 -98270 -394420 -455799 -183568 114415 146012 30143
20503 30143 -95103 49616 -268310 -356799 -213056 62319 426801 559943 265413 -133835
$$ packed form
20576F71357k53184J36504j98677k43287k90539o2606K90680k71393k28039J67642
20566b81542L65648L36628J23970l36108j12285r358J5480j17277j35213p2495
20556b22552k23452Q3484L08745M07572r5446l02464p205J72358O2461P930j0688
20545A80743K1552M4054M4447r4483p3344N8673K11285J84434j02929O7641j77679
20534C64394J53983J45008O1792J86202j8295m33648R556J43445L1039k44824
20524C98652R9543j7169k54648n5576k9745R1436J69965L600o2562J80953j01517
20513D22932k09858j86692m3853q0799k96150o1379K72231K97983L1597j15869
20503C0143j25246J44719l17926q8489J43743K75375L64482J33142k94530l99248
$$ plain form
20493 -133835 -314278 -61570 179978 273417 152417 143369 459817 691035 962401 884821
20483 884821 960148 823842 1064882 906561 427093 299840 311109 100805 -55068 -69954
20473 -69954 -164735 18989 413763 513486 127194 57047 -76461 244655 463056 397169
20463 397169 -71036 -202777 156100 581115 797656 472747 187303 161780 239768 253256
20453 253256 414986 269698 109305 127771 343694 264567 307814 287973 393124 151381
20443 151381 128352 384944 294466 451878 472490 96951 98689 352288 519695 320684
20433 320684 200303 128209 130979 10405 -76624 -47691 -193517 6721 259176 317594 123556
20422 123556 -137671 -12454 404960 569160 735021 537659 322629 503873 292566 230173
$$ packed form
20493a33835j80443K52708K41548R3439j21000r048L16448K31218K71366p7580
20483H84821P5327j36306K41040j58321m79468j27253J1269k10304j55873j4886
20473f9954r4781J83724L94774R9723l86292p0147j33508L21116K18401o5887
20463C97169m68205j31741L58877M25015K16541l24909k85444k5523P7988J3488
20453B53256J61730j45288j60393J8466K15923p9127M3247j9841J05151k41743
20443A51381k3029K56592r0478J57412K0612l75539J738K53599J67407j99011
20433C20684j20381p2094K770j20574q7029K8933j45826K00238K52455N8418j94038
20422A23556k61227J25217M17414J64200J65861j97362k15030J81244k11307o2393
$$ plain form
20412 230173 278692 435812 390704 113575 -114253 -75953 154929 237475 95821 -83793
20402 -83793 49883 -18741 40700 -60915 -107661 -6447 27754 69397 -65585 -179552 -37722
20391 -37722 32952 108356 291847 259126 306930 290172 144400 167653 270499 420558 447764
20380 447764 569664 547472 407202 70652 367460 418960 445587 679807 701464 615178
20370 615178 567552 665881 292711 189267 251728 482553 646510 677960 668745 610989 494128
20359 494128 610724 671559 543781 374982 221800 20868 46768 254481 338964 151662
20349 151662 63560 -63833 72145 127596 -12821 -121191 29642 108488 -32693 -296560
20339 -296560 -281596 -297347 -102658 151731 467343 684267 817850 729132 584762 494574
$$ packed form
20412B30173M8519J57120m5108k77129k27828L8300K30882Q2546j41654j79614
20402h3793J33676o8624N9441j01615m6746J01214L4201M1643j34982j13967J41830
20391c7722P0674P5404J83491l2721M7804j6758j45772K3253J02846J50059K7206
20380D47764J21900k2192j40270l36550K96808N1500K6627K34220K1657q6286
20370F15178m7626R8329l73170j03444O2461K30825J63957L1450r215n7756j16861
20359D94128J16596O0835j27778j68799j53182k00932K5900K07713Q4483j87302
20349A51662q8102j27393J35978N5451j40417j08370J50833P8846j41181k63867
20339b96560J4964j5751J94689K54389L15612K16924J33583q8718j44370r0188
$$ plain form
20329 494574 307100 -51524 -78484 -312987 -209782 119958 273445 94956 93455 292182
20319 292182 329810 408972 144586 -18145 54389 373615 335033 308653 76766 402585
20309 402585 414303 406272 416894 392116 -63250 -130923 -266893 1187 174747 185378 306767
20298 306767 166278 51789 46329 -109 147543 254198 133511 -35959 -102701 -24713
20288 -24713 427814 477128 524069 358960 496694 312195 578119 467153 56348 37700
20278 37700 -28885 173051 248744 87172 164618 428693 312272 -22117 -136028 -76481
20268 -76481 93457 359937 558189 653087 551203 365880 316927 450065 679364 593931
20258 593931 382814 236381 -182525 21784 206154 307675 411507 500838 625629 665838
$$ packed form
20329D94574j87474l58624k6960k34503J03205L29740J53487j78489j501J98727
20319B92182L7628P9162k64386j62731P2534L19226l8582k6380k31887L25819
20309D02585J1718q031J0622k4778m55366o7673j35970K68080J73560J0631J21389
20298C06767j40489j14489n460m6438J47652J06655j20687j69470o6742P7988
20288b4713M52527M9314M6941j65109J37734j84499K65924j10966m10805j8648
20278C7700o6585K01936P5693j61572P7446K64075j16421l34389j13911N9547
20268g6481J69938K66480J98252R4898j01884j85323m8953J33138K29299q5433
20258E93931k11117j46433m18906K04309J84370J01521J03832Q9331J24791M0209
$$ plain form
20248 665838 784215 810479 613109 612186 491786 644721 427821 254065 233819 398635
20238 398635 461281 410762 464581 375612 239246 279919 552441 719078 678299 484677 423855
20227 423855 188944 111820 -130016 -263643 -59988 76831 74405 218393 314790 159044
20217 159044 7098 -141094 -167250 115939 48011 123631 202677 113874 339151 247918 118801
20206 118801 -216399 -226872 12825 294606 22634 -210240 -106143 184028 528873 630362
20196 630362 322455 198297 86174 280763 597891 1075158 967928 474860 302757 423096
20186 423096 130412 86342 103273 64143 206483 367952 393683 632627 859273 966694
20176 966694 728557 781766 474299 564971 701168 577232 411476 610307 204675 142802
$$ packed form
20248F65838J18377K6264j97370r23j20400J52935k16900j73756k0246J64816
20238C98635O2646n0519N3819q8969j36366M0673K72522J66637m0779j93622o0822
20227D23855k34911p7124k41836j33627K03655J36819k426J43988R6397j55746
20217A59044j51946j48192k6156K83189o7928P5620P9046q8803K25277r1233j29117
20206A18801l35200j0473K39697K81781k71972k32874J04097K90171L44845J01489
20196F30362l07907j24158j12123J94589L17128M77267j07230m93068j72103J20339
20186D23096k92684m4070J6931l9130J42340J61469K5731K38944K26646J07421
20176I66694k38137N3209l07467R0672J36197j23936j65756J98831m05632o1873
$$ plain form
20166 142802 262541 226549 234613 -26757 -301681 -157094 446018 660065 642698 683028
20156 683028 482205 300006 380775 700450 760262 787207 727454 855747 995224 801535
20146 801535 447454 259794 88123 -162810 -241385 -86323 8891 147770 191256 59578
20136 59578 -101088 -108365 -46838 189670 129998 -216398 -163862 -9641 -321 -127931 -302554
20125 -302554 -347134 -210402 -106293 -303951 -361238 -73808 -113581 185425 568362 454862
20115 454862 -35354 226426 323819 239589 316168 190643 -83196 -145626 216718 464436
20105 464436 420889 425748 634758 918421 735088 478008 229716 202482 502840 677650
20095 677650 1021753 1072672 848820 425902 442537 693003 649515 615811 597491 699003
$$ packed form
20166A42802J19739l5992Q064k61370k74924J44587O03112K14047j7367M0330
20156F83028k00823j82199Q0769L19675N9812K6945n9753J28293J39477j93689
20146H01535l54081j87660j71671k50933p8575J55062R5214J38879M3486j31678
20136E9578j60666p277O1527K36508n9672l46396N2536J54221R320j27610j74623
20125c02554m4580J36732J04109j97658n7287K87430l9773K99006L82937j13500
20115D54862m90216K61780R7393q4230P6579j25525k73839o2430L62344K47718
20105D64436m3547M859K09010K83663j83333k57080k48292k7234L00358J74810
20095F77650L44103N0919k23852m22918J6635K50466m3488l3704j8320J01512
$$ plain form
20085 699003 679409 683728 523096 255625 383816 298067 464138 576892 351648 394578
20075 394578 253926 -89885 155902 391979 612987 670927 578168 325852 213561 444071
20065 444071 851737 842477 681583 643511 644887 441399 651524 472141 411412 609368 620029
20054 620029 426115 379107 394315 354613 511265 366371 653517 1092785 1170497 865711
20044 865711 554088 741311 597090 834523 1463898 1386734 1198988 942487 739772 629668
20034 629668 524711 207530 -1110 -82933 -79212 -79795 -76878 169995 601046 1103992 1141123
20023 1141123 987747 926778 813105 860216 984263 1078577 781975 590856 368155 156650
20013 156650 234864 540708 678386 585895 475225 777290 825230 997469 920609 524566
$$ packed form
20085F99003j9594M319j60632k67471J28191q5749J66071J12754k25244M2930
20075C94578j40652l43811K45787K36077K21008N7940r2759k52316j12291K30510
20065D44071M07666r260j60894l8072J376k03488K10125j79383o0729J97956J0661
20054F20029j93914m7008J5208l9702J56652j44894K87146M39268P7712l04786
20044H65711l11623J87223j44221K37433O29375p7164j87746k56501k02715j10104
20034F29668j04957l17181k08640q1823L721n83K917K46873M31051N02946L7131
20023A141123j53376o0969j13673M7111J24047R4314k96602j91119k22701k11505
20013A56650P8214L05844J37678r2491j10670L02065M7940J72239p6860l96043
$$ plain form
20003 524566 309810 552199 870003 787946 706547 899371 950860 705535 473116 282595
19993 282595 347203 559988 826888 1132538 942219 857780 834062 707133 934502 809905
19983 809905 724724 841422 529551 467333 528722 533581 915815 981203 1049527 902238 773734
19972 773734 821794 729148 649277 932338 927731 1062190 1183079 1046707 1131505 1075378 902887
19961 902887 700273 783805 819941 956802 1042080 940260 647097 564996 549752 407429
19951 407429 198652 214971 184880 392525 538479 543950 316668 225408 142417 215491 802975
19940 802975 794362 468877 741849 1044417 925052 892437 612116 615239 742271 584837
19930 584837 733270 1043545 1241728 1297659 991629 842054 861436 528485 239509 507610
$$ packed form
20003E24566k14756K42389L17804q2057q1399J92824N1489k45325k32419j90521
19993B82595O4608K12785K66900L05650j90319q4439k3718j26929K27369j24597
19983H09905q5181J16698l11871o2218O1389M859L82234O5388O8324j47289j28504
19972G73734M8060r2646p9871K83061m607J34459J20889j36372Q4798n6127j72491
19961I02887k02614Q3532L6136J36861Q5278j01820k93163q2101j5244j42323
19951D07429k08777J6319l0091K07645J45954N471k27282r1260q2991P3074N87484
19940H02975q613l25485K72972L02568j19365l2615k80321L123J27032j57434
19930E84837J48433L10275J98183N5931l06030j49575J9382l32951k88976K68101
$$ plain form
19920 507610 756711 832460 1078743 764266 601295 693641 910386 742549 799774 758347
19910 758347 485511 466449 696138 879617 734682 406231 638042 871873 762385 275688
19900 275688 613675 465136 3480 140225 316301 303650 599215 669286 692707 741811
19890 741811 971008 1103918 963307 608910 696112 883969 1289014 1025386 902813 797123
19880 797123 844636 921652 594477 580994 553240 697956 740410 790316 917248 689718 579986
19869 579986 542816 343851 371052 450005 663585 1082922 1137022 1421339 980426 846571
19859 846571 734590 633005 485076 295207 76143 363369 745879 534040 310386 197039
19849 197039 348047 371059 158725 230174 379216 495681 528009 742250 626354 579384
$$ packed form
19920E07610K49101P5749K46283l14477j62971R2346K16745j67837N7225m1427
19910G58347k72836j9062K29689J83479j44935l28451K31811K33831j09488m86697
19900B75688L37987j48539m61656J36745J76076j2651K95565P0071K3421M9104
19890G41811K29197J32910j40611l54397Q7202J87857M05045k63628j22573j05690
19880G97123M7513P7016l27175j3483k7754J44716M2454M9906J26932k27530j09732
19869E79986l7170j98965K7201P8953K13580M19337N4100K84317m40913j33855
19859H46571j11981j01585j47929j89869k19064K87226L82510k11839k23654j13347
19849A97039J51008K3012k12334P1449J49042J16465L2328K14241j15896m6970
$$ plain form
19839 579384 706766 686625 563254 181378 221828 387613 685157 924931 1138912 697137
19829 697137 484150 526327 422164 585369 307742 332210 573296 547393 676484 795331
19819 795331 947813 1083209 862620 613607 223764 221078 471729 767649 557474 858506
19809 858506 1183514 1149802 1017112 1078988 814932 344015 62653 368186 646933 1015775
19799 1015775 1048823 1020802 1110773 1031181 907783 972292 670412 453099 334127 483118
19789 483118 551737 847484 896249 766444 617247 837647 1116857 1231288 1131221 1247802
19779 1247802 999179 1105588 1341726 1147887 1025822 876462 755302 735425 853007 482070
19769 482070 378917 111283 -82217 -10291 388230 656525 818676 660220 646897 721083
$$ packed form
19839E79384J27382k0141j23371l81876M0450J65785K97544K39774K13981m41775
19829F97137k12987M2177j04163J63205k77627K4468K41086k5903J29091J18847
19819G95331J52482J35396k20589k49013l89843k686K50651K95920k10175L01032
19809H58506L25008l3712j32690O1876k64056m70917k81362L05533K78747L68842
19799A015775L3048k8021Q9971p9592j23398O4509l01880k17313j18972J48991
19789D83118O8619K95747M8765j29805j49197K20400K79210J14431j00067J16581
19779A247802k48623J06409K36138j93839j22065j49360j21160j9877J17582l70937
19769D82070j03153k67634j93500P1926L98521K68295J62151j58456j3323P4186
$$ plain form
19759 721083 409691 497291 505150 732593 1274131 1202527 904390 981886 1229484 1044480
19749 1044480 1046001 1020574 902810 1094445 1067342 891571 569468 352663 400800 318149
19739 318149 71072 344268 549647 553001 379144 412223 623464 725212 665914 684973
19729 684973 853790 769097 780047 758975 986552 1262448 1236996 1078468 730784 586425
19719 586425 516419 503774 686386 720043 779176 697001 771159 850112 1200159 1443832 1612752
19708 1612752 1664805 1770087 1674758 1628720 1564590 1359934 1215900 1047662 1017344 1052878
19698 1052878 1097914 1622191 1927776 1935073 1904336 2072235 2082506 2365769 2417073 2262545
19688 2262545 2258174 2450042 2606800 3265734 3655880 3229001 2808069 2793992 2626709 2489720
$$ packed form
19759G21083l11392Q7600P859K27443N41538p1604k98137P7496K47598j85004
19749A044480J521k5427j17764J91635k7103j75771l22103k16805M8137q2651
19739C18149k47077K73196K05379L354j73857L3079K11241J01748n9298J9059
19729F84973J68817q4693J0950k1072K27577K75896k5452j58528l47684j44359
19719E86425p0006j2645J82612L3657N9133q2175P4158P8953L50047K43673J68920
19708A612752N2053J05282r5329m6038o4130k04656j44034j68238l0318L5534
19698A052878M5036N24277L05585P297l0737J67899J0271K83263N1304j54528
19688B262545m371J91868J56758O58934L90146m26879m20932j4077j67283j36989
$$ plain form
19678 2489720 2515308 2533073 2612351 2142822 1585165 1387145 1548823 1802904 1793399 1766005
19668 1766005 1756776 1986375 1847346 1815816 1605875 1105506 943967 1264226 1632756 1468309
19658 1468309 1483318 1450130 1172325 1360116 1248288 1056262 1044575 1110993 1335811 1384199
19648 1384199 1273066 1243793 1313218 1373359 1433372 1573025 1665869 1372468 1629155 2218924
19638 2218924 2604610 2538836 2590165 2502757 2474179 2496656 2604728 2728281 2991468 3010094
19628 3010094 3081931 3091946 2902595 2967752 3277806 3152233 2757543 2371909 1887818 1910891
19618 1910891 2144194 1970726 1973171 2002347 1882219 1822474 1617511 1372815 969011 1057045
19608 1057045 1217871 1455543 1555094 1741647 1686389 1853400 1865517 1791145 1833920 1620673
$$ packed form
19678B489720K5588J7765P9278m69529n57657j98020J61678K54081r505k7394
19668A766005r229K29599j39029l1530k09941n00369j61539L20259L68530j64447
19658A468309J5009l3188k77805J87791j11828j92026j1687O6418K24818M8388
19648A384199j11133k9273O9425O0141O0013J39653R2844k93401K56687N89769
19638B218924L85686o5774N1329q7408k8578K2477J08072J23553K63187J8626
19628C010094P1837J0015j89351O5157L10054j25573l94690l85634m84091K3073
19618A910891K33303j73468K445K9176j20128n9745k04963k44696m03804Q8034
19608A057045J60826K37672R9551J86553n5258J67011J2117p4372M2775k13247
$$ plain form
19598 1620673 1782113 1972693 2153063 2317130 2299558 1767987 1414859 1505697 1343654 1428775
19588 1428775 1649913 1638495 1339909 1351994 1593123 1838078 1670591 1412038 1831237 2104692
19578 2104692 2109127 1841708 1945296 2178207 1970517 1999794 2092436 2465968 2822228 2583029
19568 2583029 2341880 2388689 2493392 2905930 3012912 2989198 3108890 2928776 2859073 2899346
19558 2899346 2698849 2467054 2118202 1853347 1893793 2116643 2333373 2582189 2741742 2314274
19548 2314274 1847309 1647641 1526024 1421842 1506491 1556012 1641251 1891846 2046490 1771010
19538 1771010 1700457 1441498 1105870 1061374 1206195 1431724 1715443 1943073 2147221 1939676
19528 1939676 1880120 1965012 1899038 1791721 1750025 1894979 2277281 2207870 1898392 2233784
$$ packed form
19598A620673J61440J90580J80370J64067j7572n31571l53128R0838j62043Q5121
19588A428775K21138j1418k98586J2085K41129K44955j67487k58553M19199K73455
19578B104692M435k67419J03588K32911k07690K9277R2642L73532L56260k39199
19568B583029k41149M6809J04703M12538J06982k3714J19692j80114o9703M0273
19558B899346k00497k31795l48852k64855M0446K22850K16730K48816J59553m27468
19548B314274m66965j99668j21617j04182Q4649M9521Q5239K50595J54644k75480
19538A771010p0553k58959l35628m4496J44821K25529K83719K27630K04148k07545
19528A939676n9556Q4892o5974j07317m1696J44954L82302o9411l09478L35392
$$ plain form
19518 2233784 2392265 2132759 2301443 2577971 2395699 2384182 2683975 2898119 2788207 2966969
19508 2966969 3280334 3667132 3832427 3476781 3235893 3117158 3425774 3443524 3100143 3055311
19498 3055311 3075209 3065991 3029190 2918147 2392463 2007667 1900461 2272973 2315235 2163913
19488 2163913 1826988 1658576 1644765 1778735 1883742 1966889 1904049 1777914 1526843 1515096
19478 1515096 1648208 1783361 1790677 1731088 1814150 2248496 2398414 1983491 1760473 1800729
19468 1800729 1911106 2024312 2089348 1666430 1499159 1819592 1998218 2011953 1970561 1922597
19458 1922597 2167507 2259467 2122348 2052497 2456939 2702732 2172445 1400880 1024600 1379643
19448 1379643 1617068 2046372 1947934 1800035 1679555 1418080 1566828 1705784 1683285 1845898
$$ packed form
19518B233784J58481k59506J68684K76528j82272j1517K99793K14144j09912J78762
19508B966969L13365L86798J65295l55646k40888j18735L08616J7750l43381m4832
19498C055311J9898r218l6801j11043n25684l84796j07206L72512M2262j51322
19488B163913l36925j68412j3811J33970J05007Q3147o2840j26135k51071j1747
19478A515096J33112J35153P316n9589Q3062M34346J49918m14923k23018M0256
19468A800729J10377J13206O5036m22918j67271L20433J78626J3735m1392m7964
19458A922597K44910R1960j37119o9851M04442K45793n30287p71565l76280L55043
19448A379643K37425M29304r8438j47899j20480k61475J48748J38956k2499J62613
$$ plain form
19438 1845898 1919045 2163922 2163243 1988054 2044550 1987539 2166998 2218457 2317484 2433725 2457492
19427 2457492 2256238 2360689 2473023 2555882 2402979 2566944 2649227 2762666 2835841 2767839
19417 2767839 2692670 2555892 2493435 2403907 2312356 2474092 2843595 2697656 2674810 2740182
19407 2740182 2799995 2687312 2449831 2038681 2336428 2597084 2441717 2430591 2476613 2678595
19397 2678595 2526270 2460232 2214250 1997617 1916722 2227037 2422527 2366893 2102485 1832665
19387 1832665 1680526 1254942 1233590 1499088 1562005 1593357 1878658 2154465 2348343 2094741
19377 2094741 1922816 1964821 1725443 1606836 1911294 1902354 1350154 1192750 1249294 1466302
19367 1466302 1794168 1783749 1703026 1850934 2251196 2378749 2458685 2484358 2583982 2537271
$$ packed form
19438A845898P3147K44877o79j75189N6496n7011J79459N1459R9027J16241K3767
19427B457492k01254J04451J12334Q2859j52903J63965Q2283J13439P3175o8002
19417B767839p5169j36778o2457q9528r1551J61736L69503j45939k2846O5372
19407B740182N9813j12683k37481m11150K97747K60656j55367j1126M6022K01982
19397B678595j52325o6038k45982k16633q0895L10315J95490n5634k64408k69820
19387A832665j52139m25584k1352K65498O2917L1352K85301K75807J93878k53602
19377B094741j71925M2005k39378j18607L04458q940n52200j57404N6544K17008
19367A466302L27866j0419q0723J47908M00262J27553P9936K5673R9624m6711
$$ plain form
19357 2537271 2333848 2096112 1998671 2567824 2878313 2743743 2645499 2720908 2959243 3466773
19347 3466773 3248370 2840486 2715173 2886569 3203784 3178046 3250643 3196303 2773675 2588974
19337 2588974 2710183 2716087 2474954 2589868 2381076 2145302 1977246 2157298 2312336 2396954
19327 2396954 2180734 1954707 1947774 1905475 2075732 2319709 2170522 1935633 2030361 2381229
19317 2381229 2590409 2305001 2100143 2042324 1938318 2374548 2584947 2526444 2382384 2549407
19307 2549407 2684035 2380484 2563273 2350020 2169191 2609499 2489551 2702389 3079981
19298 3079981 3542647 3509605 3098346 2814963 2841969 2935225 3276512 3509867 3849472 3789930
19288 3789930 3414421 3369036 3425195 3594492 3782741 3774146 4139735 4223340 4174973 4164690 4182639
$$ packed form
19357B537271k03423k37736r7441N69153L10489j34570r8244P5409K38335N07530
19347C466773k18403m07884j25313J71396L17215k5738P2597n4340m22628j84701
19337B588974J21209N904k41133J14914k08792k35774j68056J80052J55038Q4618
19327B396954k16220k26027o933m2299J70257K43977j49187k34889R4728L50868
19317B381229K09180k85408k04858n7819j04006M36230K10399n8503j44060J67023
19307B549407J34628l03551J82789k13253j80829M40308j19948K12838L77592
19298C079981M62666l3042m11259k83383K7006R3256L41287K33355L39605n9542
19288C789930l75509m5385N6159J69297J88249q595L65589Q3605m8367j0283J7949
$$ plain form
19277 4182639 4123942 4309338 3990109 3776780 3891462 4219448 4364510 4150910 4120914 3939149
19267 3939149 4064111 4247838 4240889 4192139 3891233 3843727 3894305 3472223 3342744 3727189
19257 3727189 3876516 3566478 3397827 3344703 3184398 3247808 3384617 3634337 3913419 4097876
19247 4097876 4025046 4231528 4219640 4265297 4376498 4282320 4235352 4449091 4657187 4618087
19237 4618087 4678112 4623010 4432612 4304507 4592149 4739449 4587217 4885378 4952262 5015497
19227 5015497 4908806 5235469 5513911 5647962 5576478 5546757 5585825 5670161 5959481 6367056
19217 6367056 6717296 6787641 6521374 6219763 6385021 6470249 6476050 6605190 6586815 6477392
19207 6477392 6438498 6529259 6208780 6280804 6513702 6348876 6562742 6641548 6582527 6691299
$$ packed form
19277D182639n8697J85396l19229k13329J14682L27986J45062k13600k9996j81765
19267C939149J24962J83727o949m8750l00906m7506N0578m22082j29479L84445
19257C727189J49327l10038j68651n3124j60305O3410J36809K49720K79082J84457
19247D097876p2830K06482j1888M5657J11201r4178m6968K13739K08096l9100
19237D618087O0025n5102j90398j28105K87642J47300j52232K98161O6884O3235
19227E015497j06691L26663K78442J34051p1484k9721L9068Q4336K89320M07575
19217F367056L50240P0345k66267l01611J65258Q5228N801J29140j8375j09423
19207F477392l8894R0761l20479P2024K32898j64826K13866P8806n9021J08772
$$ plain form
19197 6691299 6882706 6895781 6888666 6743459 6993043 7303113 7419546 7465854 7800911 8073430
19187 8073430 8408088 8498750 9132729 9651263 9892027 10541519 11207184 11779913 12174099 12525694
19177 12525694 13270823 13908527 14677561 15741408 17051105 17997332 18863225 19839989 21050577
19168 21050577 23013640 25531902 28609226 31840524 35609886 40551903 47162837 55004949
19160 55004949 64893225 77480285 94173023 117254734 149486943 189982850 225109991
19153 225109991 238099912 234154852 235997961 257606685 303494797 366050715 410522882
19146 410522882 400143943 348054925 298483704 271893392 269573947 284210663 294940525
19139 294940525 276147955 231857549 188721113 157365623 135302221 118772766 105867340
$$ packed form
19197F691299J91407J3075p115j45207K49584L10070J16433M6308L35057K72519
19187H073430L34658R0662O33979N18534K40764O49492O65665N72729L94186L51595
19177A2525694P45129O37704P69034J063847J309697R46227Q65893R76764J210588
19168B1050577J963063K518262L077324L231298L769362M942017O610934P842112
19160E5004949R888276J2587060J6692738K3081711L2232209M0495907L5127141
19153B25109991J2989921l945060J843109K1608724M5888112O2555918M4472167
19146D10522882j0378939n2089018m9571221k6590312k319445J4636716J0729862
19139B94940525j8792570m4290406m3136436l1355490k2063402j6529455j2905426
$$ plain form
19132 105867340 95393901 86290968 77836447 70611560 64463164 58752544 53343551 48697539
19124 48697539 44872189 41975299 39585780 37990258 36966166 35968527 35249672 34355607
19116 34355607 33376854 32758100 32781345 33637286 34886905 36712983 39316132 42290775 46325352
19107 46325352 51708539 58601019 67367492 78941201 93523396 113373223 141543271
19100 141543271 181172797 228339164 263663909 270750197 265689916 273595336 306010008
19093 306010008 365408379 436646927 474807384 446045482 380619346 329519941 307619633
19086 307619633 311261221 327335511 328775302 295736967 244661110 200573841 169211772
19079 169211772 146905414 129441335 115510131 103796121 93505727 84255547 75986365
$$ packed form
19132A05867340j0473439r102933q454521p224887o148396n710620n408993m646012
19124D8697539l825350k896890k389519j595522j024092r97639p18855q94065
19116C4355607r78753o18754K3245Q55941J249619J826078K603149K974643M034577
19107D6325352N383187O892480Q766473J1573709J4582195J9849827K8170048
19100A41543271L9629526M7166367L5324745P086288n060281P905420L2414672
19093C06010008N9398371P1238548L8160457k8761902o5426136n1099405k1900308
19086C07619633L641588J6074290J439791l3038335n1075857m4087269l1362069
19079A69211772k2306358j7464079j3931204j1714010j0290394r250180q269182
$$ plain form
19072 75986365 68555524 61440427 54880501 49279984 44780654 41176767 38322292 35763434
19064 35763434 33340175 31214532 29164625 27368114 25889096 24653124 23997927 23781857
19056 23781857 23515329 23600487 23891420 24038195 23956202 23943074 24502740 25476708 27077328 29349813
19046 29349813 31913944 35190731 39817394 45883726 53330326 62674790 74968604 91219712
19038 91219712 113689905 145344056 186703884 228819512 252617641 256614032 264190685
19031 264190685 292115550 335012453 367060772 370395163 350096607 314364034 280634827
19024 280634827 266308184 267515581 263609730 236759077 197292190 163940286 140062785
19017 140062785 122652862 109274347 98775818 89814495 81100430 72982726 65745055
$$ packed form
19072G5986365p430841p115097o559926n600517m499330l603887k854475k558858
19064C5763434k423259k125643k049907j796511j479018j235972o55197k16070
19056B3781857k66528Q5158K90933J46775q1993j3128N59666R73968J600620K272485
19046B9349813K564131L276787M626663O066332P446600R344464J2293814J6251108
19038I1219712K2470193L1654151M1359828M2115628K3798129L996391P576653
19031B64190685K7924865M2896903L2048319L334391k0298556l5732573l3729207
19024B80634827j4326643J207397l905851k6850653l9466887l3351904k3877501
19017A40062785j7409923j3378515j0498529q961323q714065q117704p237671
$$ plain form
19010 65745055 59332972 53918414 48584059 44058312 40576170 37678814 35130884 33443945
19002 33443945 31947860 30999277 29943653 28735396 27876975 27550201 27229333 27013775 27479845
18993 27479845 27958711 28640955 29960254 32021071 34713244 38663768 44011619 50937126
18985 50937126 59483890 70190049 84003828 101573842 125659820 160139787 208734802
18978 208734802 267283014 312073517 323033069 321123582 338999240 382991715 432653111
18971 432653111 459544985 457535720 427149480 377752838 342237111 333081284 333682655
18964 333682655 315363750 270921873 222616787 184434706 156145174 135460967 119797236
18957 119797236 106616595 94245724 82897497 73302944 65081116 57324816 50466957
$$ packed form
19010F5745055o412083n414558n334355m525747l482142k897356k547930j686939
19002C3443945j496085r48583j055624j208257q58421l26774l20868k15558M66070
18993B7479845M78866O82244J319299K060817K692173L950524N347851O925507
18985E0937126Q546764J0706159J3813779J7570014K4085978L4479967M8595015
18978B08734802N8548212M4790503J0959552j909487J7875658M3992475M9661396
18971D32653111K6891874k009265l0386240m9396642l5515727r155827O01371
18964C33682655j8318905m4441877m8305086l8182081k8289532k0684207j5663731
18957A19797236j3180641j2370871j1348227r594553q221828p756300o857859
$$ plain form
18950 50466957 44706220 39896374 35083880 31059974 28048534 25139082 22197941 19726082
18942 19726082 17551624 15579673 14597837 13559158 12377102 10812296 9496324 8261288
18934 8261288 7260943 6573491 6123560 5599997 5325788 4952879 4321685 3765217 3193786
18925 3193786 3055929 3329926 3194981 2832575 2273067 2110653 2235815 2250408 2270520 2378261
18915 2378261 2556935 2466649 2264149 2127911 1968438 1637193 1331031 1242674 1425684 1341666
18905 1341666 1099505 881032 564779 428501 568656 756393 638390 697771 572505 618353
18895 618353 658873 435941 380896 418936 423401 347766 185571 106820 99796 -186895 -204935
18884 -204935 -238485 -149777 -132831 17912 408987 538886 486225 323830 279944 168414
$$ packed form
18950E0466957n760737m809846m812494m023906l011440k909452k941141k471859
18942A9726082k174458j971951r81836j038679j182056j564806j315972j235036
18934H261288j000345o87452m49931n23563k74209l72909o31194n56468n71431
18925C193786j37857K73997j34945l62406n59508j62414J25162J4593K0112J07741
18915B378261J78674r0286k02500j36238j59473l31245l06162q8357J83010q4018
18905A341666k42161k18473l16253j36278J40155J87737j18003N9381j25266M5848
18895F18353M0520k22932n5045L8040M465p5635j62195p8751p024k86691j8040
18884b04935l3550Q8708J6946J50743L91075J29899n2661j62395m3886j11530
$$ plain form
18874 168414 619018 740843 662401 742806 976564 1117627 898368 745972 929807 1096418
18864 1096418 870602 784857 830043 860053 909649 970150 1149971 1391886 1463815 1350145
18854 1350145 1259123 1241362 1153747 1201918 1084128 982880 1018064 585154 251715 290169
18844 290169 526288 726772 362799 -2549 -20368 203441 103360 109031 207660 185858
18834 185858 -12724 343472 254205 68506 208450 317967 194760 97735 501301 749476
18824 749476 765326 521767 782961 1003128 780278 766239 912469 1251648 1443696 1565993
18814 1565993 1600757 1719221 1450695 1597150 1755415 1363857 1338011 1543428 1556348 1284804
18804 1284804 1241704 1188047 1274504 1585725 1403755 1089805 1112184 1160790 847262 1047765
$$ packed form
18874A68414M50604J21825p8442Q0405K33758J41063k19259j52396J83835J66611
18864A096418k25816q5745M5186L0010M9596O0501J79821K41915P1929j13670
18854A350145r1022j7761q7615M8171j17790j01248L5184m32910l33439L8454
18844B90169K36119K00484l63973l65348j7819K23809j00081N671R8629k1802
18834A85858j98582L56196q9267j85699J39944J09517j23207r7025M03566K48175
18824G49476J5850k43559K61194K20167k22850j4039J46230L39179J92048J22297
18814A565993L4764J18464k68526J46455J58265l91558k5846K05417J2920k71544
18804A284804m3100n3657Q6457L11221j81970l13950K2379M8606l13528K00503
$$ plain form
18794 1047765 1116911 852220 842171 779635 717386 952480 862352 672694 512963 399960
18784 399960 490409 630792 808867 822259 895990 790915 1378228 1977913 1984625 2015679 2191011
18773 2191011 2189041 2259319 2215873 2279292 2439981 2601420 2352310 2171677 2229903 2460492
18763 2460492 2331019 1927680 2042490 2174539 2314304 2285356 2506063 2070803 1610142 1424413
18753 1424413 1480268 1550606 1304927 1019383 851003 831072 655412 897798 1457736 1619871
18743 1619871 1322572 1132050 1099835 1338364 1640945 1758043 1589327 1570061 1499583 1419848
18733 1419848 1432745 1610636 1752959 1695279 1291224 1223662 1384428 1521500 1109969 1121993
18723 1121993 1350203 1009658 789225 976817 1426239 1946149 2351908 2425382 2444116 2600840
$$ packed form
18794A047765O9146k64691j0049o2536o2249K35094r0128j89658j59731j13003
18784C99960R0449J40383J78075J3392P3731j05075N87313N99685O712L1054J75332
18773B191011j970P0278m3446O3419J60689J61439k49110j80633N8226K30589
18763B460492j29473m03339J14810J32049J39765k8948K20707m35260m60661j85729
18753A424413N5855P0338k45679k85544j68380j9931j75660K42386N59938J62135
18743A619871k97299j90522l2215K38529L02581J17098j68716j9266p0478p9735
18733A419848J2897J77891J42323n7680m04055o7562J60766J37072m11531J2024
18723A121993K28210l40545k20433J87592M49422N19910M05759P3474J8734J56724
$$ plain form
18713 2600840 2613167 2364256 2210047 2484140 2827573 3097895 2839740 2552719 2607862 2537261
18703 2537261 2558272 2612823 2591533 2558619 2592850 2897409 2607489 2143180 1928795 1658403
18693 1658403 1404630 1472368 1732857 1607588 1359619 1142512 1412489 1608166 1714135 1887588
18683 1887588 1877924 1913337 2207621 2283748 2325564 2318613 2294596 2313962 2555843 2687639 2806249
18672 2806249 2417866 2023907 2223863 2262147 2358054 2359799 2040399 1869581 1894185 2096540
18662 2096540 2273628 2374945 2363256 2497840 2533829 2883738 3036529 2980181 2763224 2615175
18652 2615175 2689148 2937809 3122010 3096470 2999428 3030567 2754077 2579174 2580413 2795227
18642 2795227 3097873 3049644 2994542 3195027 3347941 3298211 3455877 3693779 3725577 3763903
$$ packed form
18713B600840J2327k48911j54209K74093L43433K70322k58155k87021N5143p0601
18703B537261K1011N4551k1290l2914L4231L04559k89920m64309k14385k70392
18693A658403k53773O7738K60489j25269k47969k17107K69977J95677J05969J73453
18683A887588r664L5413K94284P6127M1816o951k4017J9366K41881J31796J18610
18672B806249l88383l93959J99956L8284R5907J745l19400j70818K4604K02355
18662B096540J77088J01317j1689J34584L5989L49909J52791n6348k16957j48049
18652B615175P3973K48661J84201k5540r7042L1139k76490j74903J239K14814
18642B795227L02646m8229n5102K00485J52914m9730J57666K37902L1798L8326
$$ plain form
18632 3763903 3760645 3860155 4350855 5051361 5403275 5828060 6382708 6774828 7143867 7434225
18622 7434225 7730669 7926706 8532792 9237779 9596144 10117971 10392636 10241334 10132018
18613 10132018 10017153 10190635 10629706 11392146 12198487 12923789 13574434 14600844 15943201
18604 15943201 17198103 18050815 19743744 21784758 24304100 28170370 33208958 39276587
18596 39276587 46548458 56313773 69536648 87139144 112327151 147348451 188437867
18589 188437867 215652077 211656623 191525258 180789777 187827611 211441047 236142181
18582 236142181 233727482 198470989 157327121 127178010 107656757 94563281 85341722
18575 85341722 78196603 71553253 65392961 59700327 54589600 49743313 46042087 43488002
$$ packed form
18632C763903l258R9510M90700P00506L51914M24785N54648L92120L69039K90358
18622G434225K96444J96037O06086P04987L58365N21827K74665j51302j09316
18613A0132018j14865J73482M39071P62440Q06341P25302O50645J026410J342357
18604A5943201J254902Q52712J692929K041014K519342L866270N038588O067629
18596C9276587P271871R765315J3222875J7602496K5188007L5021300M1089416
18589A88437867K7214210l995454k0131365j0735481P037834K3613436K4701134
18582B36142181k414699l5256493m1143868l0149111j9521253j3093476r221559
18575H5341722p145119o643350o160292n692634n110727m846287l701226k554085
$$ plain form
18567 43488002 41486470 39845520 38405540 37634843 37663792 38164435 39918949 42692108 46446135
18558 46446135 51632163 58036151 65755265 76221074 89890736 108622760 134935646
18551 134935646 172602196 223654202 274772622 294593567 274048748 246173681 236559640
18544 236559640 249479016 276735165 294889061 279865209 240093853 202175466 176960635
18537 176960635 163734734 159456035 162972139 174700804 193798959 211451155 212117399
18530 212117399 194983267 177385932 170559422 177445710 194033195 203400372 187409572
18523 187409572 154177088 124507198 104269861 90296520 80539091 73011796 66667021
18516 66667021 60589241 54842810 49995053 45506602 41529414 38686158 36681148 34725559
$$ packed form
18567D3488002k001532j640950j439980p70697K8949N00643J754514K773159L754027
18558D6446135N186028O403988P719114J0465809J3669662J8732024K6312886
18551A34935646L7666550N1052006N1118420J9820945k0544819k7875067r614041
18544B36559640J2919376K7256149J8153896j5023852l9771356l7918387k5214831
18537A76960635j3225901m278699L516104J1728665J9098155J7652196O66244
18530B12117399j7134132j7597335o826510O886288J6587485R367177j5990800
18523A87409572l3232484k9669890k0237337j3973341r757429p527295o344775
18516F6667021o077780n746431m847757m488451l977188k843256k005010j955589
$$ plain form
18508 34725559 32700997 31137786 29720143 29461202 30091038 31277597 33476331 37193403
18500 37193403 41843438 47591355 54881255 64206900 76750093 94682367 120443670 157457820
18492 157457820 202409759 233378073 228071124 201428272 183992118 185261527 203694147
18485 203694147 227353772 230164132 200526295 159618676 127221747 105491324 90862781
18478 90862781 80286947 72332621 65518946 58916829 51973289 45899936 40313587 35451323
18470 35451323 31711399 28555615 25772405 22880235 20269704 18377699 16477462 14535150
18462 14535150 13062485 12081834 11452802 10299072 9351891 8743302 8006217 7013371 6088032
18453 6088032 5715954 5430996 4822676 4429344 4088059 3569927 3462602 3619746 3511299
$$ packed form
18508C4725559k024562j563211j417643k58941O29836J186559K198734L717072
18500C7193403M650035N747917P289900R325645J2543193J7932274K5761303L7014150
18492A57457820M4951939L0968314n306949k6642852j7436154J269409J8432620
18485B03694147K3659625K810360k9637837m0907619l2396929k1730423j4628543
18478I0862781j0575834p954326o813675o602117o943540o073353n586349m862264
18470C5451323l739924l155784k783210k892170k610531j892005j900237j942312
18462A4535150j472665r80651o29032j153730r47181o08589p37085r92846r25339
18453F088032l72078k84958o08320l93332l41285n18132j07325J57144j08447
$$ plain form
18444 3511299 3669637 3524625 3015331 2584385 2094191 1986871 1765126 1609062 1508483
18435 1508483 1610187 1365068 1403915 1852050 2053052 1776698 1890580 2275962 2462757 2645181
18425 2645181 2672649 2596270 2701648 2280075 2189392 2269249 2339148 2532686 2324782 1811233
18415 1811233 1615554 1566198 1861894 1740701 1671509 1711975 1704461 1858710 1788200 1392327
18405 1392327 1326305 1283457 1035477 843380 1054130 1177141 1452683 1491727 1480313 1548355
18395 1548355 1379120 1234786 1575300 1931803 2109524 1993127 2000178 2449971 2577526 2324482
18385 2324482 2277103 2420220 2727409 2586543 2642414 2531247 2440652 2438663 2595048 2890412
18375 2890412 2960778 3194752 3381689 3676738 3595414 3865994 4517201 4958807 5089370 4580936
$$ packed form
18444C511299J58338j45012n09294m30946m90194j07320k21745j56064j00579
18435A508483J01704k45119L8847M48135K01002k76354J13882L85382J86795J82424
18425B645181K7468p6379J05378m21573r0683P9857O9899J93538k07904n13549
18415A811233j95679m9356K95696j21193o9192M0466p514J54249p0510l95873
18405A392327o6022m2848k47980j92097K10750J23011K75542L9044j1414O8042
18395A548355j69235j44334L40514L56503J77721j16397P051M49793J27555k53044
18385B324482m7379J43117L07189j40866N5871j11167r0595j989J56385K95364
18375B890412P0366K33974J86937K95049q1324K70580O51207M41606J30563n08434
$$ plain form
18365 4580936 4401376 4655282 4899240 5529368 5452409 4626236 4231790 4080254 3952991 3917216
18355 3917216 4419718 4679427 4725486 4494572 4429831 4658879 5039479 5102621 4984354 4844162
18345 4844162 4318494 4315560 4359330 4097308 4305559 4504254 4558134 4768311 4969486 5387694
18335 5387694 5925021 6413672 6704866 7073757 7464730 7958651 8848244 9302769 9589998
18326 9589998 9707159 10019520 10409173 11165079 11506029 11882188 11958351 12208951 12704100 13517484
18316 13517484 14560044 15368287 16487189 17796677 19499271 21520101 23981807 27277329
18308 27277329 31724350 37617757 44568928 53098945 63647162 77777571 96076046 120811165
18300 120811165 155396076 202081046 251608153 279011345 273389292 260015218 264442105
$$ packed form
18365D580936j79560K53906K43958O30128p6959q26173l94446j51536j27263l5775
18355C917216N02502K59709M6059k30914o4741K29048L80600O3142j18267j40192
18345D844162n25668k934M3770k62022K08251J98695N3880K10177K01175M18208
18335E387694N37327M88651K91194L68891L90973M93921Q89593M54525K87229
18326I589998J17161L12361L89653P55906L40950L76159P6163K50600M95149Q13384
18316A3517484J042560Q08243J118902J309488J702594K020830K461706L295522
18308B7277329M447021N893407O951171Q530017J0548217J4130409J8298475K4735119
18300A20811165L4584911M6684970M9527107K7403192n622053j3374074M426887
$$ plain form
18293 264442105 284155134 292256824 265013312 217667702 176458851 147306968 127125176
18286 127125176 112528410 101248125 91578178 82356187 73851132 66448546 59668650 53841286
18278 53841286 49134491 45328390 42359511 40340505 38706330 37172803 36444378 36488551
18270 36488551 36593468 37616283 39577772 42507569 46450045 51300407 57725933 65869497
18262 65869497 76963411 92316742 113596926 144170000 183595718 219766675 230604328
18255 230604328 219146357 212114839 221647435 238048238 238092795 214993572 188414947 171754437
18247 171754437 165937683 170419785 184439031 209464965 245422705 279988791 289490169
18240 289490169 273599741 260737026 267747025 283179404 276557246 237347799 191136601
$$ packed form
18293B64442105J9713029Q101690k7243512m7345610m1208851k9151883k0181792
18286A27125176j4596766j1280285r669947r221991q505055p402586o779896n827364
18278E3841286m706795l806101k968879k019006j634175j533527p28425M4173
18270C6488551J04917J022815J961489K929797L942476M850362O425526Q143564
18262F5869497J1093914J5353331K1280184L0573074L9425718L6170957J0837653
18255B30604328j1457971p031518R532596J6400803M4557k3099223k6578625j6660510
18247A71754437n816754M482102J4019246K5025934L5957740L4566086R501378
18240B89490169j5890428j2862715P009999J5432379o622158l9209447m6211198
$$ plain form
18233 191136601 156178792 132086420 114770480 102109534 92252176 83354709 74624611
18226 74624611 67236450 60751494 54406169 48972812 44347266 40549220 37323916 34287496
18218 34287496 31918777 30249658 28948124 28408059 28379318 28858440 29980271 32524318 36205795
18209 36205795 40769482 46948675 54937468 65414182 80017486 100676530 129609018
18202 129609018 164856797 191814444 193657049 181097747 177534317 187834874 196226795
18195 196226795 182297812 150038085 119484855 97775820 82879896 72313199 64327087
18188 64327087 57640851 51169671 45237657 39750790 34915980 30893574 27072482 23597333
18180 23597333 20698963 18049679 15865956 14571559 13326321 12163565 10777478 9397108
$$ packed form
18233A91136601l4957809k4092372j7315940j2660946r857358q897467q730098
18226G4624611p388161o484956o345325n433357m625546l798046l225304l036420
18218C4287496k368719j669119j301534n40065k8741M79122J121831K544047L681477
18209C6205795M563687O179193P988793J0476714J4603304K0659044K8932488
18202A29609018L5247779K6957647J842605j2559302l563430J0300557Q391921
18195A96226795j3928983l2259727l0553230k1709035j4895924j0566697p986112
18188F4327087o686236o471180n932014n486867m834810m022406l821092l475149
18180B3597333k898370k649284k183723j294397j245238j162756j386087j380370
$$ plain form
18172 9397108 8478023 7578360 6694601 6280026 5857465 5436139 5048339 5105644 4895281 4653123
18162 4653123 4391471 3565316 3032921 3076579 2776812 2262174 1830423 1771537 1655682 1513431
18152 1513431 1514005 1444629 955965 865981 1004412 826235 922341 915959 523848 -78861 -85793
18141 -85793 -161723 -51459 -163449 22499 447379 401372 -13163 -149250 40228 149648
18131 149648 -390511 -871766 -693915 -624433 -555330 -810851 -953642 -596407 -785438 -808363
18121 -808363 -856692 -892856 -1029527 -919605 -781652 -636096 -627483 -541448 -539146 -684441 -703052
18110 -703052 -802468 -572837 -519792 -672808 -770543 -733442 -309661 40757 18292 -156275
18100 -156275 -214766 -233861 -534701 -152071 143047 -100594 -161866 -505537 -743972 -523097
$$ packed form
18172I397108r19085q99663q83759m14575m22561m21326l87800N7305k10363k42158
18162D653123k61652q26155n32395M3658k99767n14638m31751n8886j15855j42251
18152A513431N74o9376m88664q9984J38431j78177R6106o382l92111o02709o932
18141h5793p5930J10264j11990J85948M24880m6007m14535j36087J89478J09420
18131A49648n40159m81255J77851O9482O9103k55521j42791L57235j89031k2925
18121h08363m8329l6164j36671J09922J37953J45556Q613Q6035K302j45295j8611
18110g03052r9416K29631N3045j53016r7735L7101M23781L50418k2465j74567
18100a56275n8491j9095l00840L82630K95118k43641o1272l43671k38435K20875
$$ plain form
18090 -523097 -274879 -296673 -234650 -30955 -428452 -734451 -808957 -727062 -814653 -852230 -820536
18079 -820536 -748831 -546971 -713327 -620595 -577900 -734789 -354036 -381537 -430278 -477445 -635689
18068 -635689 -460228 -65409 31808 110095 102903 208297 296350 386499 318089 389265 216435
18057 216435 450086 727528 600044 334511 132690 -55302 -406284 -412312 -181221 -399680
18047 -399680 -339533 -345113 -369454 -166196 -475582 -263031 -326061 -39774 -225884 -435697
18037 -435697 -538615 -598804 -657249 -568418 -276269 -171719 -9948 -83099 -187791 7424
18027 7424 -260626 -488376 -278467 -294001 56345 532426 604130 231311 186063 16024
18017 16024 -16876 210295 177290 239579 458197 222203 107765 411044 474327 626024
$$ packed form
18090e23097K48218k1794O2023K03695l97497l05999p4506Q1895q7591l7577L1694
18079h20536P1705K01860j66356R2732M2695j56889L80753k7501m8741m7167j58244
18068f35689J75461L94819R7217P8287p192J05394Q8053R0149o8410P1176j72830
18057B16435K33651K77442j27484k65533k01821j87992l50982o028K31091k18459
18047c99680O0147n580k4341K03258l09386K12551o3030K86287j86110k09813
18037d35697j02918o0189n8445Q8831K92149J04550J61771p3151j04692J95215
18027G424k68050k27750K09909j5534L50346M76081P1704l72819m5248j70039
18017A6024l2900K27171l3005O2289K18618k35994j14438L03279O3283J51697
$$ plain form
18007 626024 360910 426799 648942 865155 818444 633900 492468 533963 316203 270746
17997 270746 236690 18929 -357100 -257230 -467971 -855443 -1015468 -844565 -580841 -484734
17987 -484734 -523686 -558975 -291399 -71315 -217147 -440941 -744921 -893447 -1144027 -1011458
17977 -1011458 -858312 -770711 -737845 -704204 -761667 -389751 67101 77727 248633 232578
17967 232578 183109 274127 214623 38793 103569 -32894 -168286 -344165 -612004 -327462
17957 -327462 -236077 -81863 206261 -138429 -537867 -596153 -587525 -413963 -399926 -345947 -241840
17946 -241840 -268541 -451925 -648578 -801922 -843054 -611240 -718650 -845647 -759132 -1176544
17936 -1176544 -1172353 -984567 -945042 -1098315 -1245894 -984589 -728550 -879050 -803283 -852761
$$ packed form
18007F26024k65114O5889K22143K16213m6711j84544j41432M1495k17760m5457
17997B70746l4056k17761l76029R9870k10741l87472j60025J70903K63724R6107
17987d84734l8952l5289K67576K20084j45832k23794l03980j48526k50580J32569
17977a011458J53146Q7601L2866L3641n7463L71916M56852J0626J70906j6055
17967B32578m9469R1018n9504j75830O4776j36463j35392j75879k67839K84542
17957c27462R1385J54214K88124l44690l99438n8286Q628J73562J4037N3979J04107
17946b41840k6701j83384j96653j53344m1132K31814j07410j26997Q6515m17412
17936a176544M191J87786L9525j53273j47579K61305K56039j50500P5767m9478
$$ plain form
17926 -852761 -843615 -725210 -612991 -573296 -704838 -778461 -595276 -244250 -606419 -905473
17916 -905473 -985054 -811465 -762400 -889913 -1322165 -1140158 -947428 -1058250 -876006 -593225
17906 -593225 -569567 -730281 -727175 -657357 -512772 -335039 -34770 -123220 -333478 -631410
17896 -631410 -836971 -705478 -697800 -654516 -972340 -1062600 -1012109 -1017161 -1188797 -1409109 -1461108
17885 -1461108 -971321 -393548 -322749 -290818 -146672 -70318 198004 88739 -386880 -420060
17875 -420060 -419317 -577775 -455097 -564548 -665742 -654576 -873721 -1076293 -759017 -491734
17865 -491734 -276779 -378609 -462733 -434198 -703351 -602350 -554613 -488756 -462369 -474863 -957584
17854 -957584 -951275 -910025 -698170 -315384 -414948 -513112 -435798 -328028 -316606 -154159 -28046
$$ packed form
17926h52761R146J18405J12219L9695j31542p3623J83185L51026l62169k99054
17916i05473p9581J73589M9065j27513m32252J82007J92730j10822J82244K82781
17906e93225K3658j60714L106O9818J44585J77733L00269q8450k10258k97932
17896f31410k05561J31493P678M3284l17824r0260N0491n052j71636k20312n1999
17885a461108M89787N77773P0799L1931J44146P6354K68322j09265m75619l3180
17875d20060P43j58458J22678j09451j01194J1166k19145k02572L17276K67283
17865d91734K14955j01830q4124K8535k69153J01001M7737O5857K6387j2494m82721
17854i57584O309M1250K11855L82786r9564r8164P7314J07770J1422J62447J26113
$$ plain form
17843 -28046 180908 646454 796371 1080080 1205215 1054127 1022388 606562 500553 659544
17833 659544 509707 723437 420200 326987 191282 -5532 -179464 -334985 -321457 -64946
17823 -64946 140635 -117876 -225389 -494535 -90329 -256853 -426172 -695072 -771404 -668312
17813 -668312 -824495 -1217389 -1418230 -924766 -422062 -354899 -356373 -561447 -563517 -711487
17803 -711487 -891215 -746501 -869300 -1062515 -1019983 -785779 -649550 -670332 -393723 -133953
17793 -133953 -228580 -491907 -565358 -246540 -249338 -354836 -248731 -339517 -184159 -244256 -34577
17782 -34577 64517 60021 279232 414042 655043 821194 1106085 1164697 1115892 1004736 1113198
17771 1113198 682378 212596 -103021 -196890 -43491 -98178 -307555 -394494 -530115 -506627
$$ packed form
17843b8046K08954M65546J49917K83709J25135j51088l1739m15826j06009J58991
17833F59544j49837K13730l03237r3213j35705j96814j73932j55521J3528K56511
17823f4946K05581k58511j07513k69146M04206j66524j69319k68900p6332J03092
17813f68312j56183l92894k00841M93464N02704O7163j474k05074k070j47970
17803g11487j79728J44714j22799j93215M2532K34204J36229k0782K76609K59770
17793a33953r4627k63327p3451L18818k798j05498J06105r0786J55358o0097K09679
17782c4577R9094m496K19211J34810K41001J66151K84891N8612m8805j11156J08462
17771A113198m30820m69782l15617r3869J53399n4687k09377q6939j35621K3488
$$ plain form
17761 -506627 -572223 -351043 -371169 -414241 -377998 -513171 -492775 -466880 -297818 -512900 -538533
17750 -538533 -509109 -140777 -85522 -388327 -169962 -73437 -291435 -578334 -572752 -337866
17740 -337866 -103031 -69505 99640 497957 690250 741333 764309 852201 652751 321862
17730 321862 350615 535311 475370 258422 -28608 -159355 101511 594667 862418 937610
17720 937610 945210 1126029 939355 783656 657122 250128 52977 338473 312014 303395
17710 303395 25774 -400099 -520085 -246617 221276 91078 -206698 -441083 -317042 -550137
17700 -550137 -689507 -782268 -897318 -771894 -715931 -735623 -998342 -1035737 -989493 -750615
17690 -750615 -791747 -919095 -598534 -453354 -327591 -210526 -239425 -4666 104427 123131
$$ packed form
17761e06627o5596K21180k0126m3072L6243j35173K0396K5895J69062k15082k5633
17750e38533K9424L68332N5255l02805K18365R6525k17998k86899N582K34886
17740c37866K34835L3526J69145L98317J92293N1083K2976Q7892j99450l30889
17730C21862K8753J84696n9941k16948k87030j30747K60866M93156K67751P5192
17720I37610P600J80819j86674j55699j26534m06994j97151K85496k6459q619
17710C03395k77621m25873j19986K73468M67893j30198k97776k34385J24041k33095
17700e50137j39370r2761j15050J25424N5963j9692k62719l7395M6244K38878
17690g50615m1132j27348L20561J45180J25763J17065k8899K34759J09093J8704
$$ plain form
17680 123131 2357 -52958 181820 678830 806088 592904 457916 215764 300473 261428
17670 261428 -203569 -90109 -111622 -219303 -424987 -251657 -143180 -362883 -609392 -741153
17660 -741153 -974372 -965372 -779596 -786001 -578131 -179926 -176031 12858 -98180 -284248 -595549
17649 -595549 -819523 -877227 -864763 -1008756 -1122137 -781876 -655343 -840520 -836916 -628601
17639 -628601 -739876 -976485 -1202233 -1285308 -1053194 -1057619 -1004100 -942247 -740296 -350694
17629 -350694 -2815 -170797 -254314 -418727 -781965 -872853 -1021768 -934150 -911505 -705735
17619 -705735 -748958 -329805 -2259 -191619 -294316 -286613 -378009 -412744 -461708 -429448 -743820
17608 -743820 -1098266 -1098847 -641778 -267879 -544398 -434565 -441916 -371271 -8669 -217293 -336753
$$ packed form
17680A23131j20774n5315K34778M97010J27258k13184j34988k42152Q4709l9045
17670B61428m64997J13460k1513j07681k05684J73330J08477k19703k46509j31761
17660g41153k33219R000J85776o405K07870L98205L895J88889j11038j86068l11301
17649e95549k23974n7704J2464j43993j13381L40261J26533j85177L604K08315
17639f28601j11275k36609k25748q3075K32114m425N3519O1853K01951L89602
17629c50694L47879j67982q3517j64413l63238r0888j48915Q7618K2645K05770
17619g05735m3223M19153L27546j89360j02697P703r1396l4735m8964L2260l14372
17608g43820l54446n81M57069L73899k76519J09833p351P0645L62602k08624j19460
$$ plain form
17597 -336753 -190377 -248647 -525740 -587328 -424363 -272699 -281189 -371461 -840728 -1036951
17587 -1036951 -920069 -691481 -839108 -797851 -695936 -399084 -330251 -371970 -71406 -344364
17577 -344364 -714773 -670350 -794466 -832103 -877258 -689861 -544254 -536387 -725203 -768723 -711285
17566 -711285 -362375 -332271 -663255 -543049 -471351 -379889 -365761 -458489 -642601 -644689 -631914
17555 -631914 -608832 -550472 -110270 -297678 -435357 -581938 -611575 -738170 -854240 -543145
17545 -543145 -465271 -878352 -831933 -631176 -619251 -453924 -903208 -1155927 -1331890 -1131204
17535 -1131204 -1056190 -951054 -792703 -350834 -111216 -208111 -191779 35850 -39759 -232245
17525 -232245 -207415 -158594 -506890 -405967 -120124 136255 210659 478205 369240 -32756
$$ packed form
17597c36753J46376n8270k77093o1588J62965J51664q490r0272m69267j96223
17587a036951J16882K28588j47627M1257J01915K96852O8833m1719L00564k72958
17577c44364l70409M4423j24116l7637m5155J87397J45607P867j88816m3520N7438
17566g11285L48910L0104l30984J20206P1698R1462J4128r2728j84112k088J2775
17555f31914K3082N8360M40202j87408j37679j46581k9637j26595j16070L11095
17545e43145P7874m13081M6419K00757J1925J65327m49284k52719j75963K00686
17535a131204P5014J05136J58351M41869K39618r6895J6332K27629p5609j92486
17525b32245K4830M8821l48296J00923K85843K56379P4404K67546j08965m01996
$$ plain form
17515 -32756 15868 423104 436403 302745 264569 168349 57789 43830 -3941 -187603 -22718
17504 -22718 -10063 -228545 -386544 -547597 -307889 -78629 -253715 -369282 -125175 57940
17494 57940 -232617 -471652 -344191 -336286 -101919 54182 -142809 -568437 -698823 -547901
17484 -547901 -348424 -346734 -692430 -1036206 -1034244 -641963 -198162 -195614 -213894 -703586 -939906
17473 -939906 -736764 -594114 -488443 -723071 -840132 -690690 -822312 -1008296 -721659 -389131
17463 -389131 -614023 -579384 -561755 -572662 -858057 -1029770 -837464 -741925 -524546 -596442
17453 -596442 -589434 -43944 176908 57052 -291343 -343695 -519172 -331506 -11299 89281
17443 89281 -183374 -282647 -72566 -130530 -355498 -552422 -403860 -181218 -350889 -619094
$$ packed form
17515c2756M8624M07236J3299j33658l8176r6220j10560j3959m7771j83662J64885
17504b2718J2655k18482j57999j61053K39708K29260j75086j15567K44107J83115
17494E7940k90557k39035J27461P905K34367J56101j96991m25628j30386J50922
17484e47901J99477J690l45696l43776J962L92281M43801K548j8280m89692k36320
17473i39906K03142J42650J05671k34628j17061J49442j31622j85984K86637L32528
17463c89131k24892L4639J7629j0907k85395j71713J92306R5539K17379p1896
17453e96442P008N45490K20852j19856l48395n2352j75477J87666L20207J00580
17443H9281k72655r9273K10081n7964k24968j96924J48562K22642j69671k68205
$$ plain form
17433 -619094 -506570 -422796 -544469 -573406 -622762 -470355 -701682 -837769 -704025 -875747
17423 -875747 -410093 85220 45019 81280 -75074 -74400 -29984 -193639 -227271 -99767 962
17412 962 -237913 -426086 -475266 -461944 -621269 -710197 -680677 -464391 22590 83641 -6085
17401 -6085 -119904 -173014 -134990 -497684 -708398 -826959 -1204666 -1307626 -1108599 -848172
17391 -848172 -440442 -226283 -124089 -490007 -697638 -430146 -235932 -41599 -3838 41074
17381 41074 215020 256090 151231 -384036 -617002 -403443 -191800 121339 405671 120881
17371 120881 86740 192094 -17856 -150908 -127533 -31503 -281555 -232034 -405413 -291207
17361 -291207 -77992 188895 452737 290693 -254380 -129191 141555 266928 413741 552857
$$ packed form
17433f19094J12524Q3774j21673k8937m9356J52407k31327j36087J33744j71722
17423h75747M65654M95313m0201L6261j56354O74M4416j63655l3632J27504J00729
17412I62k38875j88173m9180J3322j59325q8928K9520K16286M86981O1051q9726
17401f085j13819n3110L8024l62694k10714j18561l77707j02960J99027K60427
17391h48172M07730K14159J02194l65918k07631K67492J94214J94333L7761M4912
17381D1074J73946M1070j04859n35267k32966K13559K11643L13139K84332k84790
17371A20881l4141J05354k09950j33052K3375R6030k50052M9521j73379J14206
17361b91207K13215K66887K63842j62044n45073J25189K70746J25373J46813J39116
$$ plain form
17351 552857 547415 254799 204822 137105 154863 -20164 10975 181 106710 -149663 -355701
17340 -355701 -650531 -850481 -714987 -658576 -578911 -773439 -618327 -214631 -146566 -171922
17330 -171922 -364503 -535215 -577289 -120424 66313 -27121 151683 1302 154367 55950
17320 55950 -232823 -398386 -598789 -448847 -378275 -154633 -314247 -365525 -108214 308918
17310 308918 377209 214982 365089 97272 -254784 -321552 -261695 -186496 -150567 -77408 108746
17299 108746 -269923 -256902 -91246 58648 -65942 -110174 -405699 -497464 -538867 -479245
17289 -479245 -558387 -131391 -188023 -205454 -414190 -454718 -112285 100876 134613 43977 48885
17278 48885 42079 -104049 -300013 -315854 -211704 -353874 -379069 -437792 -693429 -674212 -463832
$$ packed form
17351E52857n442k92616m9977o7717J7758j75027L1139j0794J06529k56373k06038
17340c55701k94830j99950J35494N6411P9665j94528J55112M03696O8065k5356
17330a71922j92581j70712m2074M56865J86737r3434J78804j50381J53065r8417
17320E5950k88773j65563k00403J49942P0572K23642j59614n1278K57311M17132
17310C08918O8291j62227J50107k67817l52056o6768N9857P5199L5929P3159J86154
17299A08746l78669J3021J65656J49894j24590m4232k95525r1765m1403N9622
17289d79245p9142M26996n6632j7431k08736m0528L42433K13161L3737r0636M908
17278D8885o806j46128j95964j5841J04150j42170k5195n8723k55637J9217K10380
$$ plain form
17267 -463832 -314175 -70375 419185 417359 48559 -163214 -562110 -636712 -399572 -2291
17257 -2291 381917 148847 -158945 -245392 -418239 -510679 -466772 -98398 -26516 -27309 -123758
17246 -123758 -314083 -420985 -278514 -231021 -288152 -499860 -540878 -195174 -89387 -66572
17236 -66572 -258099 -565002 -495669 -141324 -300005 -441529 -444844 -528525 -578801 -323584 94213
17225 94213 106624 -232065 -316171 -174320 -218983 -152085 32293 12578 -72404 216908 118148
17214 118148 -195358 -338543 -419955 -505887 -553305 -567692 -468682 -714712 -842133 -703980
17204 -703980 -745149 -636384 -451752 -333976 -117614 -135159 -315749 -413451 -282671 -192136
17194 -192136 -209956 6161 23792 -157404 55828 -13632 -167798 -252358 -399254 -396875 -180760
$$ packed form
17267d63832J49657K43800M89560j826l68800k11773l98896p4602K37140L97281
17257b291L84208k33070l07792q6447j72847r2440M3907L68374P1882p93r6449
17246a23758j90325j06902J42471M7493n7131k11708m1018L45704J05787K2815
17236f6572j91527l06903O9333L54345j58681j41524l315q3681n0276K55217M17797
17225I4213J2411l38689q4106J41851m4663O6898J84378j9715q4982K89312r8760
17214A18148l13506j43185q1412q5932m7418j4387R9010k46030j27421J38153
17204g03980m1169J08765J84632J17776K16362j7545j80590r7702J30780R0535
17194a92136j7820K16117J7631j81196K13232o9460j54166q4560j46896K379K16115
$$ plain form
17183 -180760 -90662 118132 184350 -165116 -706626 -789876 -549900 -363421 -269044 -434000
17173 -434000 -399344 -149130 -336566 -462060 -587689 -456604 -341438 -134074 -20875 -100887
17163 -100887 -172714 -120400 -449618 -680742 -393476 -363218 -553660 -736441 -510073 -275677
17153 -275677 -173400 -205314 -398563 -384240 -86607 76528 131770 165414 -39708 -153598
17143 -153598 -420535 -507159 -336482 -308376 -282404 -209966 -13216 -82125 174611 375519
17133 375519 244134 -44490 -332153 -398488 -521908 -634339 -650854 -399589 -154237 -263888
17123 -263888 -316076 -315000 -371504 -304677 -394012 -603866 -576037 -658725 -538059 -403992 -148090
17112 -148090 -184708 -311014 -390687 -192857 -203843 -234037 -689299 -670698 -755868 -693658 -715193
$$ packed form
17183a80760R0098K08794O6218l49466n41510q3250K39976J86479R4377j64956
17173d34000L4656K50214j87436j25494j25629J31085J15166K07364J13199q0012
17163a00887p1827N2314l29218k31124K87266L0258j90442j82781K26368K34396
17153b75677J02277l1914j93249J4323K97633J63135N5242L3644k05122j13890
17143a53598k66937q6624J70677K8106K5972P2438J96750o8909K56736K00908
17133C75519j31385k88624k87663o6335j23420j12431j6515K51265K45352j09651
17123b63888n2188J076n6504O6827q9335k09854K7829q2688J20666J34067K55902
17112a48090l6618j26306p9673J97830j0986l0194m55262J8601q5170O2210k1535
$$ plain form
17101 -715193 -692519 -672340 -566182 -669582 -854281 -1034376 -1025359 -953586 -1057070 -1055993 -834127
17090 -834127 -851766 -774525 -718034 -487375 -403801 -530744 -503575 -283559 -333370 -524926 -258161
17079 -258161 170114 74819 -218353 -412323 -325453 -297615 -192529 -252590 -391761 -140460
17069 -140460 105233 32122 102710 218463 105249 -10615 -471960 -217569 -9830 173248
17059 173248 103839 -118235 110086 -16259 -414804 -641808 -444436 -145080 127291 -15144
17049 -15144 -72552 -53709 111893 -163353 -454167 -380003 -559723 -784446 -741289 -721579 -803404
17038 -803404 -553789 -481560 -390177 -883462 -905411 -698613 -704030 -750494 -304911 -7956 -76214
17027 -76214 -374005 -290331 -306743 -515000 -376056 -734165 -890240 -635384 -708675 -904097
$$ packed form
17101g15193K2674K0179J06158j03400j84699j80095R017P1773j03484J077K21866
17090h34127j7639P7241N6491K30659Q3574j26943K7169K20016m9811j91556K66765
17079b58161M28275r5295k93172j93970Q6870K7838J05086o0061j39171K51301
17069a40460K45693p3111P0588J15753j13214j15864m61345K54391K07739J83078
17059A73248o9409k22074K28321j26345l98545k27004J97372K99356K72371j42435
17049a5144n7408J8843J65602k75246k90814P4164j79720k24723M3157J9710q1825
17038h03404K49615P2229R1383m93285k1949K06798n417m6464M45583K96955o8258
17027g6214k97791Q3674j6412k08257J38944l58109j56075K54856p3291j95422
$$ plain form
17017 -904097 -970934 -551254 -267579 -31758 188038 94550 54369 -67733 -460231 -581802
17007 -581802 -537197 -472332 -339984 -362927 -101148 -113124 -106196 29833 -379216 -866113 -868440
16996 -868440 -391011 -448409 -876902 -979657 -699686 -199751 -401352 -714971 -590372 -456496
16986 -456496 -323146 -305458 -322220 -240832 -242021 -570854 -747203 -480471 -600420 -716273
16976 -716273 -370432 -274216 -171936 -122786 -146308 -139276 -310375 -106077 -374317 -353263 -211154
16965 -211154 -242247 -154152 -94889 -545167 -443433 -275922 -181026 29594 317638 -7321
16955 -7321 -284575 -268396 -90815 235054 -59366 -634294 -458132 -254243 -224608 -247622
16945 -247622 -417062 -261743 -86244 -2324 -203978 28486 150519 289564 -284400 -717012
$$ packed form
17017i04097o6837M19680K83675K35821K19796r3488m0181j22102l92498j21571
17007e81802M4605O4865J32348k2943K61779j1976O928J36029m09049m86897k327
16996h68440M77429n7398m28493j02755K79971M99935k01601l13619J24599J33876
16986d56496J33350J7688j6762Q1388j189l28833j76349K66732j19949j15853
16976g16273L45841R6216J02280M9150k3522P032j71099K04298k68240K1054J42109
16965b11154l1093Q8095N9263m50278J01734J67511R4896K10620K88044l24959
16955g321k77254J6179J77581L25869k94420n74928J76162K03889K9635k3014
16945b47622j69440J55319J75499Q3920k01654K32464J22033J39045n73964m32612
$$ plain form
16935 -717012 -767719 -791969 -589840 -578987 -361424 -329041 -455267 -392558 -386970 -366449 -235133
16924 -235133 110533 237750 31204 93911 132475 246434 110791 -61360 -92296 -423001
16914 -423001 -533032 -525353 -683464 -663574 -556668 -526127 -736421 -810173 -722436 -455749 -68819
16903 -68819 -154398 -525719 -546697 -256291 77972 -97457 11997 87391 169898 508804
16893 508804 761566 99460 -268605 -137419 -186430 88994 260317 555020 631002 364313
16883 364313 188863 252041 80887 -243719 -214445 -122460 -292935 -321011 -412125 -394650 -90676
16872 -90676 -26544 -351501 -544568 -382775 -107592 -263074 -344794 -37926 -93920 -538319
16862 -538319 -719425 -726940 -415319 -214195 -232470 -302873 -284633 -215051 1137 -192679 -299465
$$ packed form
16935g17012n0707k4250K02129J0853K17563L2383j26226O2709N588K0521J31316
16924b35133L45666J27217k06546O2707L8564J13959j35643j72151l0936l30705
16914d23001j10031P679j58111J9890J06906L0541k10294p3752Q7737K66687L86930
16903f8819q5579l71321k0978K90406L34263j75429J09454P5394Q2507L38906
16893E08804K52762o62106l68065J31186m9011K75424J71323K94703P5982k66689
16883C64313j75450O3178j71154l24606K9274R1985j70475k8076r1114J7475L03974
16872i0676O4132l24957j93067J61793K75183j55482q1720L06868n5994m44399
16862e38319j81106p515L11621K01124j8275p0403J8240O9582K16188j93816j06786
$$ plain form
16851 -299465 -209214 -23259 -481061 -898680 -676718 -265783 -230329 -233810 64085 -91417
16841 -91417 -690111 -712030 -254740 -197658 -479384 -542537 -488485 -401169 -438601 -476405 -527634
16830 -527634 -464519 -611037 -561656 -300815 -183376 -17568 65007 -74631 -194792 -418379
16820 -418379 -707467 -879550 -855928 -814895 -456741 -300700 -516076 -727640 -496400 -463122
16810 -463122 -429815 -529767 -685403 -552630 -529485 -501301 -669095 -869676 -880083 -673866
16800 -673866 -499462 -230284 -243551 -506680 -526375 -520420 -587408 -359614 -353368 -453314 -373508
16789 -373508 -288868 -337721 -386667 -139732 -340115 -604435 -502398 -346253 -134393 19519
16779 19519 10203 40891 245290 266271 297019 112826 -89312 -251135 -40286 -61010 -73832
$$ packed form
16851b99465R0251J85955m57802m17619K21962M10935L5454l481K97895j55502
16841i1417n98694k1919M57290N7082k81726o3153N4052Q7316l7432l7804n1229
16830e27634O3115j46518M9381K60841J17439J65808Q2575j39638j20161k23587
16820d18379k89088j72083K3622M1033L58154J56041k15376k11564K31240L3278
16810d63122L3307r9952j55636J32773K3145K8184j67794k00581j0407K06217
16800f73866J74404K69178j3267k63129j9695N955o6988K27794O246r9946P9806
16789c73508Q4640m8853m8946K46935k00383k64320J02037J56145K11860J53912
16779A9519r316L0688K04399K0981L0748j84193k02138j61823K10849k0724j2822
$$ plain form
16768 -73832 -60305 122968 -196997 -428240 -277573 -322920 -346638 -299138 -279773 -364117 -509927
16757 -509927 -522983 -513821 -485338 -540578 -677841 -681996 -387612 -337132 -441388 -483875 -280113
16746 -280113 -212744 133492 98700 220706 280414 26898 -108956 -162525 -399968 -473628
16736 -473628 -294725 93969 171408 158145 -107425 -218580 57491 22682 -265926 -603033
16726 -603033 -726194 -522437 -395742 -49975 -104203 -245907 218470 225875 -388865 -780416
16716 -780416 -675797 -549014 -399807 -424905 -529822 -400624 -334107 -221179 -354560 -536319
16706 -536319 -193963 -45943 -534132 -730268 -393289 -264561 -650452 -698036 -760034 -700211
16696 -700211 -525567 -219609 -384029 -537885 -832654 -653659 18453 558779 444947 40949
$$ packed form
16768g3832J3527J83273l19965k31243J50667m5347k3718M7500J9365q4344j45810
16757e09927j3056R162K8483n5240j37263m155K94384N0480j04256m2487K03762
16746b80113O7369L46236l4792J22006N9708k53516j35854n3569k37443p3660
16736d73628J78903L88694P7439j3263k65570j11155K76071l4809k88608l37107
16726f03033j23161K03757J26695L45767n4228j41704M64377P405o14740l91551
16716g80416J04619J26783J49207k5098j04917J29198O6517J12928j33381j81759
16706e36319L42356J48020m88189j96136L36979J28728l85891m7584o1998N9823
16696g00211J74644L05958j64420j53856k94769J78995O72112N40326j13832m03998
$$ plain form
16686 40949 -498729 -558782 -413194 -127508 -443243 -549437 -513285 -673038 -561675 -596840
16676 -596840 -871345 -650018 -388979 -305738 -381818 -411192 -348952 -408326 -359944 91007 159538
16665 159538 -205897 -506579 -316115 -365710 -251654 -463973 -349558 -378730 -499681 -561209
16655 -561209 -450792 -297208 -20517 -499743 -560148 -414472 -742323 -879991 -509115 -152165
16645 -152165 -333701 -489239 -391069 -433290 -466313 -591334 -375505 -270513 -273517 29007
16635 29007 -163644 54468 164473 19051 76059 -74259 -422654 -498227 -325513 -153454
16625 -153454 -120592 -195176 -406588 -568410 -701914 -426980 -9921 -72986 -510796 -526790
16615 -526790 -430276 -460361 -478273 -686942 -844391 -314462 -119590 -233889 -251575 -384069
$$ packed form
16686D0949n39678o0053J45588K85686l15735j06194L6152j59753J11363l5165
16676e96840k74505K21327K61039Q3241p6080k9374O2240n9374M8382M50951O8531
16665A59538l65435l00682J90464m9595J14056k12319J14415k9172j20951o1528
16655e61209J10417J53584K76691m79226o0405J45676l27851j37668L70876L56950
16645a52165j81536j55538R8170m2221l3023j25021K15829J04992l004L02524
16635B9007j92651K18112J10005j45422N7008j50318l48395p5573J72714J72059
16625a53454L2862p4584k11412j61822j33504K74934M17059o3065m37810j5994
16615e26790R6514l0085j7912k08669j57449N29929J94872j14299j7686j32494
$$ plain form
16605 -384069 -382277 -404629 -277064 -75383 -53406 146325 110280 -17856 -175950 -240004 -28355
16594 -28355 212918 -141518 -265015 -203919 -217336 -207331 -414932 -923849 -923203 -824156 -382752
16583 -382752 -200193 100983 274481 -7760 -378628 -482636 -316807 -223465 -346059 -367361
16573 -367361 -286963 -415677 -524290 -391204 -412120 -391125 -613918 -622071 -590479 -674199 -490705
16562 -490705 -646615 -669538 -765827 -876424 -892026 -427603 -16856 34493 -170167 9309
16552 9309 -291803 -531771 -493151 -637202 -651744 -521419 -396235 -375905 -95010 -223815
16542 -223815 -142304 -175752 -154626 -111527 -151519 -212756 -240161 78029 66149 43717 106926
16531 106926 325051 262454 -150895 -669601 -769265 -827175 -657969 -656158 -304388 -344623 -375089
$$ packed form
16605c84069J792k2352J27565K01681K1977J99731l6045j28136j58094o4054K11649
16594b8355K41273l54436j23497O1096j3417J0005k07601n08917O46R9047M41404
16583c82752J82559L01176J73498k82241l70868j04008J65829R3342j22594k1302
16573c67361Q0398j28714j08613J33086k0916K0995k22793q153L1592q3720J83494
16562d90705j55910k2923r6289j10597j5602M64423M10747N1349k04660J79476
16552I309l01112k39968L8620j44051j4542J30325J25184K0330K80895j28805
16542b23815Q1511l3448K1126M3099l9992o1237k7405L18190j1880k2432O3209
16531A06926K18125o2597m13349n18706r9664n7910J69206J811L51770m0235l0466
$$ plain form
16520 -375089 -250563 -241787 -146443 -57863 24553 -408591 -439430 -354678 -206044 -56539 -86169
16509 -86169 271136 312286 38279 -251463 -201420 -1765 -243050 -315372 -138206 -340280
16499 -340280 -536338 -473788 -548302 -385835 74685 -41975 -290304 -470890 -588708 -507371
16489 -507371 -537920 -652041 -571317 -433201 -98303 -310972 -432835 -350057 -437177 -394480
16479 -394480 -253488 92810 227861 36350 -257926 -460879 -676819 -514319 -427307 -615809
16469 -615809 -468856 -351431 -345777 -304606 -106986 -205053 -477027 -475468 -291957 -326054 -452516
16458 -452516 -227470 -66206 2817 -259592 -12318 178291 -72565 -243307 -17780 -43984
16448 -43984 -290200 -332596 -36889 36948 196842 251977 -37010 -569511 -531598 -254099
$$ packed form
16520c75089J24526Q776R5344Q8580Q2416m33144l0839Q4752J48634J49505k9630
16509h6169L57305M1150k74007k89742N0043J99655k41285p2322J77166k02074
16499c40280j96058O2550p4514J62467M60520j16660k48329j80586j17818Q1337
16489e07371l0549j14121Q0724J38116L34898k12669j21863Q2778q7120M2697
16479c94480J40992L46298J35051j91511k94276k02953k15940J62500Q7012j88502
16469f15809J46953J17425N654M1171J97620r8067k71974J559J83511l4097j26462
16458d52516K25046J61264O9023k62409K47274J90609k50856j70742K25527k6204
16448d3984k46216m2396K95707P3837J59894N5135k88987n32501L7913K77499
$$ plain form
16438 -254099 -288198 -73658 146821 -13179 -58253 -132369 -286293 -163477 -36 -206464
16428 -206464 -401621 -418747 -300774 -395457 -586752 -574006 -349631 -187969 -50762 -107862
16418 -107862 -77188 -306906 -487432 -434414 -319970 -182916 -268157 -605610 -699970 -547545
16408 -547545 -542292 -363995 -158788 -183178 -223060 37615 103643 -125642 -236209 -728530
16398 -728530 -1099855 -1213795 -1065435 -1004658 -690657 -589100 -510821 -560841 -680769 -478554
16388 -478554 -489854 -708991 -375693 95618 470976 323213 -407881 -719194 -714405 -626516
16378 -626516 -489514 -350748 -429809 -642195 -683212 -582209 -494643 -631803 -471714 -384272
16368 -384272 -426757 -384641 -513673 -783699 -786006 -550268 -394929 -221318 -32368 61155
$$ packed form
16438b54099l4099K14540K20479j60000m5074p4116j53924J22816J63441k06428
16428b06464j95157j7126J17973r4683j91295J2746K24375J61662J37207n7100
16418a07862L0674k29718j80526N3018J14444J37054q5241l37453r4360J52425
16408e47545N253J78297K05207k4390l9882K60675O6028k29285j10567m92321
16398g28530l71325j13940J48360O0777L14001J01557P8279n0020j19928K02215
16388d78554j1300k19137L33298M71311L75358j47763p31094l11313M789Q7889
16378f26516J37002J38766p9061k12386m1017J01003Q7566j37160J60089Q7442
16368c84272m2485M2116j29032k70026k307K35738J55339J73611J88950R3523
$$ plain form
16358 61155 86176 31184 50364 33014 -399386 -524150 -263323 -26741 334694 66083
16348 66083 -451651 -545873 -244695 -121481 180426 -114049 -491710 -615601 -218400 97232
16338 97232 103042 409286 696268 446186 399857 130985 -301700 -313300 43945 38333 -262579
16327 -262579 -308436 -213949 -244371 -9905 -232908 -535135 -587826 -479498 -206523 -236593
16317 -236593 -225859 -228077 -417405 -492203 -547364 -624640 -500213 -339488 -336922 -308381 -307257
16306 -307257 -412934 -427751 -419113 -684762 -827965 -581353 -307316 -335021 -462823 -232039
16296 -232039 -177831 -183930 -470598 -524384 -66829 158455 207344 194383 186314 282018 461372
16285 461372 587858 628676 416008 121059 -280372 -601951 -608588 -628560 -404561 -168018
$$ packed form
16358F1155K5021n4992J9180j7350m32400j24764K60827K36582L61435k68611
16348F6083n17734r4222L01178J23214L01907k94475l77661j23891L97201L15632
16338I7232N810L06244K86982k50082m6329k68872m32685j1600L57245n612l00912
16327b62579m5857R4487l0422K34466k23003l02227n2691J08328K72975l0070
16317b36593J0734k218j89328p4798n5161p7276J24427J60725K566K8541J124
16306c07257j05677j4817Q638k65649j43203K46612K74037k7705j27802K30784
16296b32039N4208o099k86668n3786M57555K25284M8889j2961q069R5704J79354
16285D61372J26486M0818k12668k94949m01431l21579o637j9972K23999K36543
$$ plain form
16275 -168018 -94306 -130396 -348916 -122636 -173599 -10097 205975 139089 -331463 -653215
16265 -653215 -628619 -422642 -235182 -244786 -469382 -573742 -511182 -223659 -290157 -349250 -207793
16254 -207793 -202257 -32041 -78770 -176560 -145494 -445208 -569590 -304158 -67004 -98804 55735
16243 55735 207228 -8428 -52608 99314 48393 -65431 165100 273524 -2840 -164363
16233 -164363 -74901 66131 -4595 -91086 -182931 149654 -151337 -442267 -149821 100149
16223 100149 -17923 -95416 -203359 90820 123578 255892 175740 186843 118567 -92697
16213 -92697 -15068 -79421 -144050 -18540 204903 143894 -17112 -17084 -31081 14138 -308529
16202 -308529 -128221 367032 467452 334482 -30756 -407494 -499438 -572782 -303517 -375478
$$ packed form
16275a68018P3712l6090k18520K26280n0963J63502K16072o6886m70552l21752
16265f53215K4596K05977J87460r604k24596j04360O2560K87523o6498n9093J41457
16254b07793N536J70216m6729r7790L1066k99714j24382K65432K37154l1800J54539
16243E5735J51493k15656m4180J51922n0921j13824K30531J08424k76364j61523
16233a64363Q9462J41032p0726q6491r1845L32585l00991k90930K92446K49970
16223A00149j18072p7493j07943K94179L2758J32314q0152J1103o8276k11264
16213i2697P7629o4353o4629J25510K23443o1009j61006K8j3997M5219l22667
16202c08529J80308M95253J00420j32970l65238l76738r1944p3344K69265p1961
$$ plain form
16192 -375478 -448321 -609514 -767189 -468978 -367006 -231876 -174078 82692 -143029 -473647
16182 -473647 -551118 -309539 -169430 -209841 -425924 -362442 21380 -4103 -174508 -108546
16172 -108546 -64664 16194 71751 42520 340521 -11637 160436 225925 115967 119793 -100808
16161 -100808 -270220 -366014 -150694 -195491 -270316 -160978 -170629 -390438 -302682 -142871 -185580
16150 -185580 -541211 -468028 -718780 -674712 -637648 -690125 -687896 -466651 -9415 162064 -65374
16139 -65374 -397177 -349923 118254 30628 -304522 -207618 -117274 -44615 42956 31088 -22171
16128 -22171 82183 34583 -233765 -681240 -617390 -312324 -175767 -25798 -192453 -241180
16118 -241180 -150088 -9699 -232173 -35378 212447 58426 -14992 57428 88156 258
$$ packed form
16192c75478p2843j61193j57675K98211J01972J35130N7798K56770k25721l30618
16182d73647p7471K41579J40109m0411k16083O3482L83822k5483j70405O5962
16172a08546M3882Q0858N5557k9231K98001l52158J72073O5489j09958L826k20601
16161a00808j69412r5794K15320m4797p4825J09338r651k19809Q7756J59811m2709
16150a85580l55631P3183k50752M4068L7064n2477K229K21245M57236J71479k27438
16139f5374l31803M7254M68177q7626l35150R6904R0344P2659Q7571j1868n3259
16128b2171J04354m7600k68348m47475O3850L05066J36557J49969j66655m8727
16118b41180R1092J40389k22474J96795K47825j54021p3418P2420L0728q7898
$$ plain form
16108 258 -294157 -156243 17586 -9837 -220468 27067 91097 355836 221179 145301 -50494
16097 -50494 -7949 -64808 113343 203509 45051 -155999 -259973 -140130 -162472 -417901
16087 -417901 -461870 -331741 36365 -177337 -241024 -401976 -251293 -64598 -144931 250074
16077 250074 325117 211287 29015 119188 91268 -112128 -101966 -410235 -458997 -422453 -313185
16066 -313185 -213933 -206124 -124302 232535 587818 544175 172641 59874 93963 66655 36726
16055 36726 171648 7805 -112409 -230916 -52641 -44519 -179034 -217899 -9885 116987
16045 116987 -474 -36309 49725 -10857 37276 60056 75544 228731 296098 132589 -144375
16034 -144375 -236054 -39662 -68105 72886 62271 209002 331624 440709 550361 81701
$$ packed form
16108B58k94415J37914J73829k7423k10631K47535O4030K64739j34657p5878j95795
16097e0494M2545n6859J78151R0166j58458k01050j03974J19843k2342k55429
16087d17901m3969J30129L68106k13702o3687j60952J50683J86695q0333L95005
16077B50074P5043j13830j82272R0173k7920k03396J0162l08269m8762L6544J09268
16066c13185R9252P809Q1822L56837L55283m3643l71534j12767L4089k7308k9929
16055C6726J34922j63843j20214j18507J78275Q122j34515l8865K08014J26872
16045A16987j17461l5835Q6034o0582M8133K2780J5488J53187O7367j63509k76964
16034a44375r1679J96392k8443J40991j0615J46731J22622J09085J09652m68660
$$ plain form
16024 81701 -200252 -103883 -207115 59375 7733 -156442 15236 236166 322319 226512
16014 226512 264070 194750 123976 -9214 -267987 -312558 -184866 -69371 -39561 129178
16004 129178 106342 -3228 -167630 -234897 -330565 -11907 172695 129597 -242160 -381878
15994 -381878 -435829 -445921 -305294 -251696 -109944 -228548 -195710 -170732 -128491 -282289 -509435
15983 -509435 -495718 -611622 -524151 -226360 -106857 -273080 -326399 99983 435486 197627
15973 197627 -64801 -89467 367888 469881 270888 340351 -6209 -244561 59251 -14836
15963 -14836 41992 -26674 48333 111626 329151 94204 100128 116176 323297 360380 359754 199124
15951 199124 -204195 -542724 -571374 -637156 -914866 -1001408 -737085 -670319 -439472 -291414
$$ packed form
16024H1701k81953R6369j03232K66490n1642j64175J71678K20930Q6153r5807
16014B26512L7558o9320p0774j33190k58773m4571J27692J15495K9810J68739
16004A29178k2836j09570j64402o7267r5668L18658J84602m3098l71757j39718
15994c81878n3951j0092J40627N3598J41752j18604L2838K4978M2241j53798k27146
15983e09435J3717j15904Q7471K97791J19503j66223n3319M26382L35503k37859
15973A97627k62428k4666M57355J01993j98993O9463l46560k38352L03812p4087
15963a4836N6828o8666P5007O3293K17525k34947N924J6048K07121L7083o26j60630
15951A99124m03319l38529k8650o5782k77710q6542K64323O6766K30847J48058
$$ plain form
15941 -291414 -114349 -284978 -316226 -181063 -13414 -302460 -588605 -617945 -674930 -377904
15931 -377904 -162263 -243197 -198282 -240646 -266882 -139258 8309 93206 151279 67162 -201646
15920 -201646 -507881 -352536 -97071 -51289 113331 -27136 -291880 -599755 -507077 -327287
15910 -327287 -201309 -309512 -80659 97540 -135948 -271094 -459931 -453567 -671581 -666023
15900 -666023 -517274 -116618 -176069 -577188 -622923 -460567 -423118 -354215 -393586 -385603 -129468
15889 -129468 133594 -54307 52269 24468 -114519 -132586 17131 85289 -214725 -266858
15879 -266858 -132388 -375907 -450363 -332225 -136852 78272 32903 -84339 -367868 -550967
15869 -550967 -361971 -83530 -29398 -177857 -68683 -142754 -158731 -235372 -229027 -277100 8012
$$ packed form
15941b91414J77065j70629l1248J35163J67649k89046k86145k9340n6985K97026
15931c77904K15641q0934M4915m2364k6236J27624J47567Q4897N8073q4117k68808
15920b01646l06235J55345K55465M5782J64620j40467k64744l07875R2678J79790
15910c27287J25978j08203K28853J78199k33488j35146j88837O364k18014N558
15900f66023J48749M00656n9451m01119m5735J62356L7449O8903l9371P983K56135
15889a29468K63062j87901J06576k7801j38987j8067J49717O8158l00014n2133
15879b66858J34470k43519p4456J18138J95373K15124m5369j17242k83529j83099
15869e50967J88996K78441N4132j48459J09174p4071j5977p6641O345m8073K85112
$$ plain form
15858 8012 220688 -18994 -89084 -380010 -539109 -280515 -388344 -569872 -540904 -473717
15848 -473717 -220796 -347543 -642544 -700421 -474851 -335352 -263625 -338009 -18587 343800
15838 343800 303123 213215 401749 202320 27634 -184635 -265003 -156840 -138561 -131421 -125510
15827 -125510 -14779 59986 32469 -34937 -56624 -209491 -106431 -106157 -174932 -25514 58960
15816 58960 275239 251396 258587 130251 -16734 -114556 -199744 -118536 -33190 -99668 -213552
15805 -213552 -133161 -27893 -186632 -168837 -128712 19985 -66706 -196971 -223446 -336976
15795 -336976 -273621 188808 310216 51941 89823 -4278 24596 220947 108219 -111131
15785 -111131 -195093 -291725 -426325 -628675 -550847 -372812 -383128 -377449 -353381 -159371 142461
$$ packed form
15858H012K12676k39682p0090k90926j59099K58594j07829j81528K8968O7187
15848d73717K52921j26747k95001n7877K25570J39499P1727p4384L19422L62387
15838C43800m0677q9908J88534j99429j74686k12269q0368J08163J8279P140N911
15827a25510J10731P4765k7517o7406k1687j52867J03060K74o8775J49418Q4474
15816E8960K16279k3843P191j28336j46985r7822q5188Q1208Q5346o6478j13884
15805b13552Q0391J05268j58739J7795M0125J48697q6691j30265k6475j13530
15795c36976O3355M62429J21408k58275L7882r4101K8874J96351j12728k19350
15785a11131q3962r6632j34600k02350P7828J78035j0316N679K4068J94010L01832
$$ plain form
15774 142461 133268 222862 342537 16755 -157295 -67670 140485 153127 -116188 68709
15764 68709 425598 337389 233508 139040 -204316 -418956 -370678 -40196 -8557 40499 -298784
15753 -298784 -220762 -359854 -540158 -858973 -905686 -584005 -509729 -45984 55743 -58301
15743 -58301 105520 -37966 -212230 -65360 72556 -159182 -189324 -331507 -253129 -138069
15733 -138069 66612 -105119 -289284 -170422 -190853 -217846 -198166 -54334 -222577 -402473
15723 -402473 -256136 -272083 -229243 95130 147645 -8016 -79668 158640 -8861 -252942
15713 -252942 -345741 -322817 -99867 -51969 175766 50974 56606 -41611 132681 150298 487934
15702 487934 653295 329179 5258 -42968 98806 29925 134554 154963 169971 238627
$$ packed form
15774A42461r193Q9594J19675l25782j74050Q9625K08155J2642k69315J84897
15764F8709L56889q8209j03881r4468l43356k14640M8278L30482L1639M9056l39283
15753b98784P8022j39092j80304l18815m6713L21681P4276M63745J01727j14044
15743e8301J63821j43486j74264J46870J37916k31738l0142j42183P8378J15060
15733a38069K04681j71731j84165J18862k0431k6993J9680J43832j68243j79896
15723d02473J46337j5947M2840L24373N2515j55661p1652K38308j67501k44081
15713b52942r2799K2924K22950M7898K27735j24792N632r8217J74292J7617L37636
15702D87934J65361l24116l23921m8226J41774o8881J04629K0409J5008O8656
$$ plain form
15692 238627 -45116 -123985 46327 306128 577177 517422 307618 281652 276013 314644 269844
15681 269844 -276352 -201060 -183025 -116783 193968 338820 15996 -471595 -319845 -20206
15671 -20206 35996 -192774 -153539 267383 298013 34286 -29484 -133085 -237116 -527612
15661 -527612 -446077 -301585 -341854 -353560 -408004 -370685 -294137 -212097 -259821 -208723 41517
15650 41517 169308 210182 280286 -124168 -478459 -480288 -252003 66920 144278 9661 119428
15639 119428 98134 105013 -59685 -289911 -368943 -275140 -159667 -463243 -371650 -370989 -426657
15628 -426657 -16851 280166 -27800 -424500 -347602 -298142 -50673 -122256 -238899 -178198
15618 -178198 -121903 -103641 14239 98333 224031 103458 78644 143611 -75082 -140480 -159253
$$ packed form
15692B38627k83743p8869J70312K59801K71049n9755k09804k5966n639L8631m4800
15681B69844n46196P5292J8035O6242L10751J44852l22824m87591J51750K99639
15671b0206N6202k28770L9235M20922L0630k63727o3770j03601j04031k90496
15661e27612Q1535J44492m0269j1706n4444L7319P6548Q2040m7724N1098K50240
15650D1517J27791M0874P0104m04454l54291j829K28285L18923P7358j34617J09767
15639A19428k1294O879j64698k30226p9032R3803J15473l03576R1593O61n5668
15628d26657M09806K97017l07966l96700P6898M9460K47469p1583j16643O0701
15618a78198N6295J8262J17880Q4094J25698j20573k4814O4967k18693o5398j8773
$$ plain form
15607 -159253 -307130 -197576 -137370 -125695 49405 66380 2742 -289601 -398159 -593710
15597 -593710 -656456 -281852 92328 472459 629435 472685 522515 334453 -39488 -117487
15587 -117487 -138284 -14875 202365 454559 381003 -8400 8322 171292 182254 321129
15577 321129 146048 13495 -48460 1910 -160253 169088 505968 189204 -169287 -609197
15567 -609197 -483658 -537714 -354014 -292727 -326055 -422363 -261348 -241831 -112277 281661
15557 281661 490836 275366 81969 -112491 -45642 -142419 -187513 -589225 -573726 -281085
15547 -281085 -315212 -220770 -155942 62117 -117003 -210166 10074 208923 -73706 -447464
15537 -447464 -365708 -57224 138563 424991 546174 480014 273550 -300288 -465063 -184571
$$ packed form
15607a59253j47877J09554O0206J1675J75100J6975o3638k92343j08558j95551
15597e93710o2746L74604L74180L80131J56976j56750M9830j88062l73941p7999
15587a17487k0797J23409K17240K52194p3556l89403J6722J62970J0962J38875
15577C21129j75081j32553o1955N0370j62163L29341L36880l16764l58491m39910
15567f09197J25539n4056J83700O1287l3328r6308J61015J9517J29554L93938
15557B81661K09175k15470j93397j94460O6849r6777m5094m01712J5499K92641
15547b81085l4127R4442O4828K18059j79120r3163K20240J98849k82629l73758
15537d47464Q1756L08484J95787K86428J21183o6160k06464n73838j64775K80492
$$ plain form
15527 -184571 77507 -111931 -52219 -88571 -96167 -323547 -265874 -223030 -51685 25784 306753
15516 306753 444092 387682 -14262 -71563 -41728 -17057 -160254 -150090 -63592 131144 106281
15505 106281 95377 220108 260627 274993 293670 163277 16375 -335857 -447474 -511476
15495 -511476 -348355 -340970 -346148 -206411 -226008 -456294 -386443 -262820 -141819 -529563 -194092
15484 -194092 217155 228294 326539 -30376 -454475 -368558 -108340 -76867 10580 80573 -205874
15473 -205874 -302601 -132968 -98788 -259712 -114139 104878 -26315 17019 68035 100030
15463 100030 183683 112756 145881 17615 -267002 -387992 -47504 246004 45323 104681
15453 104681 234393 285701 268281 -49719 -22365 157663 274861 -165814 15545 106085
$$ packed form
15527a84571K62078j89438N9712l6352p596k27380N7673M2844J71345P7469K80969
15516C06753J37339n6410m01944n7301K9835K4671j43197J0164Q6498J94736k4863
15505A06281j0904J24731M0519J4366J8677j30393j46902l52232j11617o4002
15495e11476J63121P385n178J39737j9597k30286O9851J23623J21001l87744L35471
15484a94092M11247J1139R8245l56915m24099Q5917K60218L1473Q7447O9993k86447
15473b05874r6727J69633L4180j60924J45573K19017j31193M3334N1016L1995
15463A00030Q3653p0927L3125j28266k84617j20990L40488K93508k00681N9358
15453A04681J29712N1308j7420l18000K7354J80028J17198m40675J81359R0540
$$ plain form
15443 106085 81001 -23968 -129473 -239312 -255666 -222146 -176106 -146180 -39492 52574 17045
15432 17045 130315 76723 403493 73143 13507 529994 498423 402092 -103887 -196221 -54198
15421 -54198 -96396 123047 68036 -111572 217646 462748 236829 219921 306013 403573 248547
15410 248547 350589 630021 479095 102370 279202 173454 297198 327826 372317 392452
15400 392452 267884 72524 -234326 -249049 -153860 -247609 -464166 -143809 54774 26603
15390 26603 -16064 -117852 -275881 -215447 14649 231506 203494 20621 -513031 -458841
15380 -458841 -90472 218696 181986 60561 10990 -83668 -150308 -154644 55074 -124767 -243035
15369 -243035 -53651 184055 -50692 -355299 -550949 -587836 -452293 -2215 100788 238166
$$ packed form
15443A06085k5084j04969j05505j09839j6354L3520M6040K9926J06688R2066l5529
15432A7045J13270n3592L26770l30350n9636N16487l1571r6331n05979r2334J42023
15421e4198m2198K19443n5011j79608L29218K45102k25919j6908Q6092R7560j55026
15410B48547J02042K79432j50926l76725J76832j05748J23744L0628M4491K0135
15400C92452j24568j95360l06850j4723R5189r3749k16557L20357J98583k8171
15390B6603m2667j01788j58029O0434K30096K16857k8012j82873n33652N4190
15380d58841L68369L09168l6710j21425m9571r4658o6640m336K09718j79841j18268
15369b43035J89384K37706k34747l04607j95650l6887J35543M50078J03003J37378
$$ plain form
15359 238166 146519 57240 -314623 -673137 -830973 -325955 -64922 314332 645710 524695
15349 524695 391683 -111567 -101712 192106 307947 341325 130204 6270 -369887 -731879
15339 -731879 -950500 -577815 -145084 -160151 -323220 -230738 79471 331376 616214 761911
15329 761911 678277 411540 105384 212 146267 30302 -104772 -154646 -82994 291859
15319 291859 192283 246598 138559 -129303 -248896 -373171 -288098 -152159 -322441 -506672
15309 -506672 -468900 -143154 -59932 83566 124807 71482 -138094 -229504 -106495 -50151 32381
15298 32381 24509 -318603 -328028 -24161 208486 177020 254982 33278 -166725 70327 -16986
15287 -16986 -143179 198522 104224 116089 395375 198882 7806 30277 74028 64268 -113857
$$ packed form
15359B38166r1647q9279l71863l58514j57836N05018K61033L79254L31378j21015
15349E24695j33012n03250R855K93818J15841L3378k11121j23934l76157l61992
15339g31879k18621L72685M32731j5067j63069R2482L10209K51905K84838J45697
15329G61911q3634k66737l06156j05172J46055j15965j35074m9874P1652L74853
15319B91859r9576N4315j08039k67862j19593j24275Q5073J35939j70282j84231
15309e06672L7772L25746Q3222J43498M1241n3325k09576r1410J23009N6344Q2532
15298C2381p872l43112r425L03867K32647l1466P7962k21704k00003K37052q7313
15287a6986j26193L41701r4298J1865K79286j96493j91076K2471M3751r760j78125
$$ plain form
15276 -113857 -316207 -302518 -94410 -39469 -103950 -212187 -180697 152677 156615 267471 255815
15265 255815 49912 -244901 -288213 -116837 350976 487281 407402 305372 216332 433652
15255 433652 443844 537089 435878 179984 137128 -184688 -19138 235855 49757 -181557
15245 -181557 -218391 -218934 -242573 -132471 142231 347846 189567 50969 -224190 -493112
15235 -493112 -348153 -166565 -139905 -98018 18876 160226 227975 100938 -275470 -253284
15225 -253284 -288382 -358271 -589847 -398323 -58452 -59649 -87744 -159865 -174845 -273105 -348634
15214 -348634 -542159 -393344 -104378 -380394 -446611 -307559 5600 460783 578551 593975
15204 593975 98479 -332860 -25974 489 -147192 -39460 -176173 -200245 68846 184572
$$ packed form
15276a13857k02350J3689K08108N4941o4481j08237L1490L33374L938J10856j1656
15265B55815k05903k94813m3312J71376M67813J36305p9879j02030q9040K17320
15255D33652J0192R3245j01211k55894m2856l21816J65550K54993j86098k31314
15245a81557l6834n43k3639J10102K74702K05615j58279j38598k75159k68922
15235d93112J44959J81588K6660M1887J16894J41350O7749j27037l76408K2186
15225b53284l5098o9889k31576J91524L39871j197k8095p2121j4980r8260p5529
15214c48634j93525J48815K88966k76016o6217J39052L13159M55183J17768J5424
15204E93975m95496m31339L06886K6463j47681J07732j36713k4072K69091J15726
$$ plain form
15194 184572 222530 371871 380575 378548 459244 239372 289543 -104584 -311811 -296082 -138060
15183 -138060 204997 184890 -136060 21816 -4983 108777 283461 265168 -40413 -460401
15173 -460401 -391923 -217548 -297318 109889 227923 239117 295503 450051 312134 40110
15163 40110 -287740 -261645 -221536 -135623 216006 303985 134957 106960 38440 306240 164255
15152 164255 51288 -15573 66794 408315 663174 676582 364889 1557 -21002 192672
15142 192672 18164 -140560 -445390 -331267 -193767 -106346 114162 276844 512208 521375
15132 521375 678903 544810 117117 15046 217180 392235 230593 316085 133219 140133
15122 140133 -83248 -148889 -499758 -415971 -289148 -260710 -77501 -146912 -127149 -186634 -269754
$$ packed form
15194A84572L7958J49341Q704k027Q0696k19872N0171l94127k07227J5729J58022
15183a38060L43057k0107l20950J57876k6799J13760J74684j8293l05581m19988
15173d60401O8478J74375p9770M07207J18034J1194N6386J54548j37917k72024
15163D0110l27850K6095M0109Q5913L51629Q7979j69028k7997o8520K67800j41985
15152A64255j12967o6861Q2367L41521K54859J3408l11693l63332k2559K13674
15142A92672j74508j58724l04830J14123J37500Q7421K20508J62682K35364R167
15132E21375J57528j34093m27693j02071K02134J75055j61642Q5492j82866O914
15122A40133k23381o5641l50869Q3787J26823K8438J83209o9411J9763n9485q3120
$$ plain form
15111 -269754 -357049 -281958 -66337 328129 596123 565825 558416 703148 339987 348858 665688
15100 665688 796435 1081457 1007251 500881 432575 349508 22760 -75062 -4891 129815
15090 129815 -135210 -470169 -417568 -155667 -324845 -293072 109192 245660 236520 51197
15080 51197 39192 281401 174147 216101 317093 346180 516019 672776 656230 557387 189039
15069 189039 163781 287152 390523 476958 179257 -170285 -404885 -98340 92169 254981
15059 254981 -20695 -400230 -279926 -419299 -387342 -216299 -236847 -210712 -194724 -143498
15049 -143498 124259 492124 296741 110463 85105 80319 181705 508555 374320 448522
15039 448522 729454 707933 476386 436637 333199 346389 277763 449963 393238 139234
$$ packed form
15111b69754q7295P5091K15621L94466K67994l0298p409J44732l63161Q871L16830
15100F65688J30747K85022p4206n06370o8306q3067l26748r7822P0171J34706
15090A29815k65025l34959N2601K61901j69178L1773M02264J36468r140j85323
15080E1197j2005K42209j07254M1954J00992K9087J69839J56757j6546r8843l68348
15069A89039k5258J23371J03371Q6435k97701l49542k34600L06545J90509J62812
15059B54981k75676l79535J20304j39373L1957J71043k0548K6135J5988N1226
15049a43498K67757L67865j95383j86278k5358m786J01386L26850j34235P4202
15039D48522K80932k1521k31547l9749j03438J3190o8626J72200n6725k54004
$$ plain form
15029 139234 -130942 -294414 -101393 -223397 -389115 -332920 237789 696064 574039 60624
15019 60624 -251759 -553964 -640559 -567908 -157747 119120 102558 178972 198580 290099 247400
15008 247400 -102346 -72152 293212 480923 419309 387778 125496 181705 183536 86310 -277196
14997 -277196 -264565 -188423 211384 399577 585252 838103 623609 890665 607650 212156
14987 212156 410648 334822 249319 15043 529 173678 412785 698936 423608 522227
14977 522227 333753 472055 754528 417015 92973 32351 33332 -46583 -157331 217513
14967 217513 339667 401964 444500 119870 -90235 -278931 -376337 86245 259617 325580
14957 325580 188318 161736 68074 127581 294478 432867 817617 772198 687786 753725 585499
$$ packed form
15029A39234k70176j63472J93021j22004j65718N6195N70709M58275j22025n13415
15019F0624l12383l02205q6595P2651M10161K76867j6562P6414J9608R1519m2699
15008B47400l49746L0194L65364J87711o1614l1531k62282N6209J831r7226l63506
14997b77196J2631P6142L99807J88193J85675K52851k14494K67056k83015l95494
14987B12156J98492p5826q5503k34276j4514J73149K39107K86151k75328R8619
14977E22227j88474J38302K82473l37513l24042o0622R81p9915j10748L74844
14967B17513J22154O2297M2536l24630k10105j88696r7406M62582J73372O5963
14957C25580j37262k6582r3662N9507J66897J38389L84750m5419q4412O5939j68226
$$ plain form
14946 585499 202342 -100314 -269809 -26611 261461 352930 289895 234403 74584 277299
14936 277299 -83134 -326542 22583 318058 -172971 -131292 310815 602841 681886 437003
14926 437003 241114 -236464 -474812 -179754 301949 83272 -270077 -154050 -22528 -59342
14916 -59342 -244427 -101096 171337 605026 711374 582831 519874 136406 -537318 -690252
14906 -690252 -357730 -151404 80971 362225 201776 -38022 -142638 -311903 -772329 -745156
14896 -745156 -649730 -782978 -516405 -435956 -113813 409385 563739 507487 350231 20988
14886 20988 -253459 -354729 -612336 -764916 -454945 -116190 151271 -7593 57137 176631
14876 176631 64414 73270 64681 164879 -160517 -96075 -187365 -68013 -3129 -96690 -111437
$$ packed form
14946E85499l83157l02656j69495K43198K88072R1469o3035n5492j59819K02715
14936B77299l60433k43408L49125K95475m91029M1679M42107K92026P9045k44883
14926D37003j95889m77578k38348K95058M81703k18677l53349J16027J31522l6814
14916e9342j85085J43331K72433M33689J06348j28543o2957l83468o73724j52934
14906f90252L32522K06326K32375K81254j60449k39798j04616j69265m60426K7173
14896g45156R5426j33248K66573Q0449L22143N23198J54354n6252j57256l29243
14886B0988k74447j01270k57607j52580L09971L38755K67461j58864O4730J19494
14876A76631j12217Q856q589J00198l25396O4442r1290J19352O4884r3561j4747
$$ plain form
14865 -111437 -83617 -66507 88174 562604 349885 -35198 50609 -39349 -41215 120847 298784
14854 298784 185306 -20317 -171332 -81987 -80110 -54697 485919 584263 488262 355166 560498
14843 560498 487155 539581 514725 599837 632100 225749 207381 103167 -164751 -80129 -33007
14832 -33007 -141565 -83182 73126 -199827 -161276 -71349 170021 73815 -134632 -66560 256969
14821 256969 429801 374598 125958 91103 6253 -49731 243651 195304 135111 7724 -2842
14810 -2842 172079 230375 417195 406453 230235 463117 370589 594399 542208 478983 361154
14799 361154 484805 242786 81997 -129546 46166 113768 246561 417209 662113 479739
14789 479739 409824 487235 444650 92991 -32144 202237 188580 328552 260109 -30711
$$ packed form
14865a11437K7820J7110J54681M74430k12719l85083Q5807q9958j866J62062J77937
14854B98784j13478k05623j51015Q9345J877K5413N40616R8344r6001j33096K05332
14843E60498p3343N2426k4856Q5112L2263m06351j8368j04214k67918Q4622M7122
14832c3007j08558N8383J56308k72953L8551Q9927K41370r6206k08447O8072L23529
14821B56969J72832n5203k48640l4855q4850n5984K93382m8347o0193j27387j0566
14810b842J74921N8296J86820j0742j76218K32882r2528K23810n2191o3225j17829
14799C61154J23651k42019j60789k11543J75712O7602J32793J70648K44904j82374
14789D79739o9915P7411m2585l51659j25135K34381j3657J39972o8443k90820
$$ plain form
14779 -30711 -253173 -79470 56269 354668 778313 713329 551288 232267 249478 428214
14769 428214 642580 328624 41445 225733 153786 -86440 60712 130541 -27352 66525
14759 66525 12315 127836 408317 598393 355108 -139294 -289254 -548623 -343749 153675
14749 153675 296021 361528 132046 -38691 -76852 42834 79787 24239 105529 48340 -83848
14738 -83848 -190963 -198164 99555 89056 -134554 72448 168852 154806 83539 65828 19890
14727 19890 174437 130166 211849 470709 231810 286163 84816 23571 151322 61282 187844
14716 187844 462537 596818 619725 660931 1028274 964159 672048 394261 496425 445054
14706 445054 454039 713222 918649 756909 953644 957943 699169 810139 477759 -100290
$$ packed form
14779c0711k22462J73703J35739K98399M23645o4984j62041l19021J7211J78736
14769D28214K14366l13956k87179J84288p1947k40226J47152O9829j57893R3877
14759F6525n4210J15521K80481J90076k43285m94402j49960k59369K04874M97424
14749A53675J42346O5507k29482j70737l8161J19686L6953n5548Q1290n7189j32188
14738h3848j07115p201K97719j0499k23610K07002R6404j4046p1267j7711m5938
14727A9890J54547m4271Q1683K58860k38899N4353k01347o1245J27751r0040J26562
14716A87844K74693J34281K2907M1206L67343o4115k92111k77787J02164n1371
14706D45054Q985K59183K05427j61740J96735M299k58774J10970l32380n78049
$$ plain form
14696 -100290 85811 167087 46906 326567 338228 268241 257523 -27938 -10246 482464
14686 482464 512746 476847 412415 396742 273676 270380 179902 210706 227038 216881 65700
14675 65700 318211 617995 524888 180062 106100 132216 132224 28938 106563 351939 340468
14664 340468 419266 575256 813629 478621 354263 397100 104160 45740 105449 37268
14654 37268 -52275 -75513 -7570 6328 194498 136507 53572 273059 337305 532907 494821
14643 494821 36940 -27161 93839 296166 295200 -55240 -182125 -65944 42683 244147
14633 244147 271324 555610 693141 355114 100299 297777 488525 532103 91174 -317980
14623 -317980 -166574 -36295 136533 130057 127172 330900 169320 114951 255369 150858
$$ packed form
14696a00290J86101Q1276j20181K79661J1661o9987j0718k85461J7692M92710
14686D82464L0282l5899o4432j5673j23066l296r0478L0804J6332j0157j51181
14675F5700K52511K99784r3107l44826p3962K6116Qj03286P7625K45376j1471
14664C40468P8798J55990K38373l35008j24358M2837k92940n8420N9709o8181
14654C7268q9543k3238O7943J3898J88170n7991q2935K19487O4246J95602l8086
14643D94821m57881o4101J21000K02327r66l50440j26885J16181J08627K01464
14633B44147K7177K84286J37531l38027k54815J97478J90748M3578m40929m09154
14623c17980J51406J30279J72828o476k885K03728j61580n4369J40418j04511
$$ plain form
14613 150858 216270 224628 -94652 -139097 -221338 -20347 311239 339007 345273 170983 -21258
14602 -21258 135721 142421 305694 221491 95434 57103 199131 341911 -23185 -31703 237829
14591 237829 708633 862586 775496 429874 400491 488207 506289 535109 345317 214353
14581 214353 498278 536707 384991 525693 491798 283072 245786 459947 947777 1100304
14571 1100304 914735 950097 512021 512654 771085 503994 347073 122002 -198488 51193
14561 51193 206910 150925 -60045 123406 127570 422440 329129 226653 49964 -72140
14551 -72140 -39842 206467 509515 718949 667443 694977 737769 559016 555343 440007 322110
14540 322110 576257 65884 49837 376758 649051 557611 219249 188875 -46528 -112119
$$ packed form
14613A50858O5412Q358l19280m4445q2241K00991L31586K7768O266j74290j92241
14602b1258J56979O700J63273q4203j26057l8331J42028J42780l65096q518K69532
14591B37829M70804J53953q7090l45622k9383Q7716J8082K8820j89792j30964
14581B14353K83925L8429j51716J40702l3895k08726l7286K14161M87830J52527
14571A100304j85569L5362m38076O33K58431k67091j56921k25071l20490K49681
14561E1193J55717n5985k10970J83451M164K94870r3311j02476j76689j22104
14551g2140L2298K46309L03048K09434n1506K7534M2792j78753l673j15336j17897
14540C22110K54147n10373j6047L26921K72293r1440l38362l0374k35403o5591
$$ plain form
14530 -112119 153689 472297 333120 284600 341200 388437 326541 290344 90262 106984 192132
14519 192132 486792 158871 4168 -42281 -160445 -154960 182683 300293 161680 1836
14509 1836 228685 424512 499475 349481 151196 121849 131275 259532 398251 174288 6787
14498 6787 -193105 -322029 -14762 370440 294680 286638 148178 331677 155484 71375 -44020
14487 -44020 -473142 -357412 184843 374187 570200 395430 180210 211809 275989 62542
14477 62542 -10956 -187811 -58693 235475 390457 186314 151975 113480 189460 103247 -33823
14466 -33823 303385 646231 744866 706444 689980 390682 376368 446167 436434 429284 522218
14455 522218 220909 282019 220121 99618 98182 213136 611699 406655 86931 -182250
$$ packed form
14530a12119K65808L18608j39177m8520N6600M7237o1896l6197k00082J6722Q5148
14519A92132K94660l27921j54703m6449j18164N485L37643J17610j38613j59844
14509A836K26849J95827P4963j49994j98285k9347R426J28257J38719k23963j67501
14498F787j99892j28924L07267L85202p5760q042j38460J83499j76193q4109j15395
14487d4020m29122J15730N42255J89344J96013j74770k15220L1599O4180k13447
14477F2542p3498j76855J29118K94168J54982k04143l4339l8495P5980q6213j37070
14466c3823L37208L42846R8635l8422j6464k99298j4314O9799r733p150R2934
14455E22218l01309O1110o1898j20503j436J14954L98563k05044l19724k69181
$$ plain form
14445 -182250 -368466 -340162 -56990 362981 638947 391180 51842 -47954 -38089 135913
14435 135913 92951 -184123 -199709 106203 182309 145840 231813 458907 337440 393365 361848
14424 361848 625212 431845 99225 198063 469256 664311 784824 687253 477954 403730
14414 403730 537143 629051 678102 386054 -136186 -39971 83351 276523 466711 220316
14404 220316 -118457 -73747 -23359 32721 302133 31920 459414 721546 484802 378238
14394 378238 248774 564828 804033 1143271 1428290 1024563 554480 305922 371570 205278
14384 205278 -190219 -242553 348120 294383 47670 -33445 40251 321865 347217 311211 151342
14373 151342 145248 238484 426815 435999 333039 212872 424127 256886 -123825 -75902 -9999
$$ packed form
14445a82250j86216K8304K83172M19971K75966k47767l39338r9796R865J74002
14435A35913m2962k77074j5586L05912P6106l6469Q5973K27094j21467N5925l1517
14424C61848K63364j93367l32620R8838K71193J95055J20513r7571k09299p4224
14414D03730J33413R1908M9051k92048n22240R6215J23322J93172J90188k46395
14404B20316l38773M4710N0388N6080K69412k70213M27494K62132k36744j06564
14394C78238j29464L16054K39205L39238K85019m03727m70083k48558O5648j66292
14384B05278l95497n2334N90673n3737k46713q1115P3696K81614K5352l6006j59869
14373A51342o094R3236J88331R184j02960j20167K11255j67241l80711M7923O5903
$$ plain form
14362 -9999 251700 313967 466908 417614 415856 247797 206631 289832 380147 376623 162150
14351 162150 104499 70345 -36421 -2297 163525 58177 -145083 20032 57280 33250
14341 33250 2027 -69831 -282684 -266125 9165 -70671 301020 649891 592640 669280 541524
14330 541524 532065 473174 325429 348347 328096 467197 720540 776120 361475 164627 196904
14319 196904 480843 246880 -136043 -168421 10031 198043 250189 266950 145367 -49294
14309 -49294 92834 511327 486485 559087 440208 -53551 -140292 176381 128658 -98756
14299 -98756 -148344 -289148 -82907 -251211 -366304 -295653 -337247 -356052 -152811 171651
14289 171651 235413 46153 47565 383935 466651 631975 821952 831899 542937 335039 150182
$$ packed form
14362i999K61699O2267J52941m9294j758j68059m1166Q3201R0315l524k14473
14351A62150n7651l4154j06766L4124J65822j05348k03260J65115L7248k4030
14341C3250l1223p1858k12853J6559K75290p9836L71691L48871n7251P6640j27756
14330E41524r459n8891j47745K2918k0251J39101K53343N5580m14645j96848L2277
14319A96904K83939k33963l82923l2378J78452J88012N2146J6761j21583j94661
14309d9294J42128M18493k4842P2602j18879m93759q6741L16673m7723k27414
14299i8756m9588j40804K06241j68304j15093P0651m1594j8805K03241L24462
14289A71651O3762j89260J412L36370Q2716J65324J89977R947k88962k07898j84857
$$ plain form
14278 150182 235271 457993 415423 289468 260950 428013 599744 666558 630386 421803
14268 421803 300556 339434 183721 197783 211223 423279 478874 519044 240480 -40555
14258 -40555 260279 361418 261722 556217 830743 509504 155775 142230 -45398 -117173
14248 -117173 34007 125840 166517 316507 372031 424107 331453 594808 638408 462124 658520
14237 658520 194423 -228413 -91671 171827 -8151 -304664 -134267 66715 -33125 -67521
14227 -67521 285629 587570 514213 327801 269439 348137 522834 222017 5760 -91254
14217 -91254 101286 167828 -37370 36191 407402 335188 131508 175053 490879 523806 346993
14206 346993 164579 302807 94677 42507 359060 565173 235596 287324 565147 303191
$$ packed form
14278A50182Q5089K22722m2570j25955k8518J67063J71731O6814l6172k08583
14268D21803j21247L8878j55713J4062J3440K12056N5595M0170k78564k81035
14258d0555L00834J01139r9696K94495K74526l21239l53729j3545j87628p1775
14248a17173J51180R1833M0677J49990N5524N2076r2654K63355M3600j76284J96396
14237F58520m64097m22836J36742K63498j79978k96513J70397K00982r9840l4396
14227f7521L53150L01941p3357j86412n8362P8698J74697l00817k16257r7014
14217i1254J92540O6542k05198P3561L71211p2214k03680M3545L15826L2927j76813
14206C46993j82414J38228k08130n2170L16553K06113l29577N1728K77823k61956
$$ plain form
14196 303191 142792 80803 -138355 59498 171287 198576 149778 336472 527792 292128
14186 292128 26570 430772 655895 375956 298181 439464 639171 609714 433164 615717
14176 615717 764152 1129866 948137 730460 754368 681471 557825 380849 308666 198646
14166 198646 426158 489550 245988 186780 -70583 -10920 -26301 -140731 24293 315023
14156 315023 319496 550008 564658 281591 27499 39735 -222029 -123594 -393407 -462445 -451075
14145 -451075 -112935 154992 39713 117146 253616 300494 476809 422618 410098 549791
14135 549791 471106 516490 585559 447196 481917 491866 723879 640919 553554 515832 398704
14124 398704 546514 843551 875962 639108 607143 772241 728872 663705 737859 452707
$$ packed form
14196C03191j60399o1989k19158J97853J11789K7289m8798J86694J91320k35664
14186B92128k65558M04202K25123k79939p7775J41283J99707k9457j76550J82553
14176F15717J48435L65714j81729k17677K3908p2897j23646j76976p2183j10020
14166A98646K27512O3392k43562n9208k57363N9663j5381j14430J65024K90730
14156C15023M473K30512J4650k83067k54092J2236k61764R8435k69813o9038J1370
14145d51075L38140K67927j15279P7433J36470M6878J76315n4191j2520J39693
14135E49791p8685M5384O9069j38363L4721R949K32013q2960q7365l7722j17128
14124C98704J47810K97037L2411k36854l1965J65098m3369o5167P4154k85152
$$ plain form
14114 452707 583103 686295 485147 154132 111833 9056 -99008 -152878 59784 198866
14104 198866 190125 324287 179841 340714 362269 370578 406687 364882 354116 357762 638896
14093 638896 592355 291065 -144907 -94277 26192 -61601 -82606 68738 238089 113024
$$ packed form
14114D52707J30396J03192k01148l31015m2299j02777j08064n3870K12662J39082
14104A98866q741J34162j44446J60873K1555Q309L6109m1805j0766L646K81134
14093F38896m6541l01290m35972N0630J20469q7793k1005J51344J69351j25065
$$ [...]
##END NTUPLES=NMR SPECTRUM
##END=
