##TITLE=Analysis number 312513
Compound Code rdp 00221
Book Reference 345/137
Project Code adrs
Chemist Name wendyb
##JCAMPDX= 6.0         $$ Bruker NMR JCAMP-DX V2.0
##DATA TYPE= NMR SPECTRUM
##DATA CLASS= NTUPLES
##ORIGIN= Bruker BioSpin GmbH
##OWNER= NMR
$$ XWIN-NMR		Version 3.5
$$ Fri Aug  5 10:42:30 2005 GMT Daylight Time (UT+1h)  MAYBRIDGE\NMR@NMR_250MHZ
##.OBSERVE FREQUENCY= 250.131544655141
##.OBSERVE NUCLEUS= ^1H
##.ACQUISITION MODE= SIMULTANEOUS (DQD)
##.ACQUISITION SCHEME= undefined
##.AVERAGES= 16
##.DIGITISER RES= 18
##SPECTROMETER/DATA SYSTEM= dpx250
##.PULSE SEQUENCE= zg30
##.SOLVENT NAME= CDCl3
##.SHIFT REFERENCE= (INTERNAL, CDCl3, 0, 16.4504)
##AUDIT TRAIL= $$ (NUMBER, WHEN, WHO, WHERE, WHAT)
$$ ##TITLE= Audit trail, XWIN-NMR		Version 3.5
$$ ##JCAMPDX= 5.01
$$ ##ORIGIN= Bruker BioSpin GmbH
$$ ##OWNER= NMR
$$ C:\u/data/dgb/nmr/ADRS/7190/pdata/1/auditp.txt
$$ ##AUDIT TRAIL=  $$ (NUMBER, WHEN, WHO, WHERE, WHAT)
(   1,<2005-08-05 10:41:54.87 +100>,<MAYBRIDGE\NMR>,<NMR_250MHZ>,
      <created by zg, POWCHK disabled, PULCHK disabled
       configuration hash MD5:
       62 19 C7 07 E1 42 D1 B7 37 6C 3D D0 77 39 F9 E6
       data hash MD5: 64K
       8B 57 69 74 4D F4 6C 6F 30 B3 25 75 6E 17 5D F7>)
(   2,<2005-08-05 10:42:09.89 +100>,<MAYBRIDGE\NMR>,<NMR_250MHZ>,
      <Start of raw data processing
       ef LB = 0.3 FT_mod = 6 PKNL = 1 SI = 32K 
       data hash MD5: 32K
       C2 0E 29 72 5F A3 8A FF E8 75 9D 18 D8 41 46 99>)
(   3,<2005-08-05 10:42:17.18 +100>,<MAYBRIDGE\NMR>,<NMR_250MHZ>,
      <apk 
       data hash MD5: 32K
       32 A6 E5 AA 77 EF BD 48 5F 57 22 82 20 E8 59 64>)
(   4,<2005-08-05 10:42:19.01 +100>,<MAYBRIDGE\NMR>,<NMR_250MHZ>,
      <abs ABSG = 5 
       data hash MD5: 32K
       8A B0 3D 5B 0B 9D D0 0E 9E 63 87 AD 58 78 E1 CA>)
$$ ##END=
$$ 
$$ hash MD5
$$ 86 D9 6F F5 B0 49 60 DD 1E C4 A0 08 92 3C A8 1D
##$RELAX= 
##$RELAX= 
##$RELAX= 
##$RELAX= 
##$RELAX= 
##$RELAX= 
##$RELAX= 
$$ Bruker specific parameters
$$ --------------------------
##$DU= <C:\u>
##$EXPNO= 7190
##$NAME= <ADRS>
##$PROCNO= 1
##$TYPE= <nmr>
##$USER= <dgb>
##$AMP= (0..31)
100 100 100 100 100 100 100 100 100 100 100 100 100 100 100 100 100 100 
100 100 100 100 100 100 100 100 100 100 100 100 100 100 
##$AQSEQ= 0
##$AQ_mod= 3
##$AUNM= <au_zg>
##$AUTOPOS= <11 >
##$BF1= 250.13
##$BF2= 250.13
##$BF3= 250.13
##$BF4= 250.13
##$BF5= 500.13
##$BF6= 500.13
##$BF7= 500.13
##$BF8= 500.13
##$BYTORDA= 1
##$CFDGTYP= 0
##$CFRGTYP= 5
##$CHEMSTR= <none>
##$CNST= (0..31)
1 1 145 1 1 1 1 1 1 1 1 1 1 1 1 1 1 1 1 1 1 1 1 1 1 1 1 1 1 1 1 1 
##$CPDPRG= <>
##$CPDPRG1= <>
##$CPDPRG2= <>
##$CPDPRG3= <>
##$CPDPRG4= <mlev>
##$CPDPRG5= <mlev>
##$CPDPRG6= <mlev>
##$CPDPRG7= <mlev>
##$CPDPRG8= <mlev>
##$CPDPRGB= <>
##$CPDPRGT= <>
##$D= (0..31)
0 1 0 0 0 0 0 0 0 0.06 0 0 0 0 0 0 0.0002 0 0 0 0 0 0 0 0 0 0 0 0 0 0 
0 
##$DATE= 1123234913
##$DBL= (0..7)
120 120 120 120 120 120 120 120 
##$DBP= (0..7)
150 150 150 150 150 150 150 150 
##$DBP07= 0
##$DBPNAM0= <>
##$DBPNAM1= <>
$$ [...]
##$SUBNAM7= <"">
##$SUBNAM8= <"">
##$SUBNAM9= <"">
##$SW= 20.6930455092707
##$SWIBOX= (0..15)
0 0 3 0 0 0 0 0 0 0 0 0 0 0 0 0 
##$SW_h= 5175.983436853
##$TD= 65536
##$TD0= 1
##$TE= 296.16
##$TE2= 300
##$TE3= 300
##$TEG= 300
##$TL= (0..7)
0 120 120 120 120 120 120 120 
##$TP= (0..7)
150 150 150 150 150 150 150 150 
##$TP07= 0
##$TPNAME0= <>
##$TPNAME1= <>
##$TPNAME2= <>
##$TPNAME3= <>
##$TPNAME4= <>
##$TPNAME5= <>
##$TPNAME6= <>
##$TPNAME7= <>
##$TPOAL= (0..7)
0.5 0.5 0.5 0.5 0.5 0.5 0.5 0.5 
##$TPOFFS= (0..7)
0 0 0 0 0 0 0 0 
##$TUNHIN= 0
##$TUNHOUT= 0
##$TUNXOUT= 0
##$USERA1= <user>
##$USERA2= <user>
##$USERA3= <user>
##$USERA4= <user>
##$USERA5= <user>
##$V9= 5
##$VALIST= <valist>
##$VCLIST= <CCCCCCCCCCCCCCC>
##$VD= 0
##$VDLIST= <DDDDDDDDDDDDDDD>
##$VPLIST= <PPPPPPPPPPPPPPP>
##$VTLIST= <TTTTTTTTTTTTTTT>
##$WBST= 1024
##$WBSW= 4
##$XGAIN= (0..3)
0 0 0 0 
##$XL= 0
##$YL= 0
##$YMAX_a= 350825
##$YMIN_a= -402935
##$ZGOPTNS= <>
##$ZL1= 120
##$ZL2= 120
##$ZL3= 120
##$ZL4= 120
##$ABSF1= 16.45037
##$ABSF2= -4.242802
##$ABSG= 5
##$ABSL= 3
##$ALPHA= 0
##$AQORDER= 0
##$ASSFAC= 0
##$ASSFACI= 0
##$ASSFACX= 0
##$ASSWID= 0
##$AUNMP= <proc_1d>
##$AZFE= 0.1
##$AZFW= 0.1
##$BCFW= 0
##$BC_mod= 0
##$BYTORDP= 0
##$COROFFS= 0
##$CY= 12.5
##$DATMOD= 1
##$DC= 0
##$DFILT= <>
##$DTYPP= 0
##$F1P= 14.0000005364418
##$F2P= -0.99999901652339
##$FCOR= 0.5
##$FTSIZE= 32768
##$FT_mod= 6
##$GAMMA= 0
##$GB= 0
##$INTBC= 1
##$INTSCL= 1
##$ISEN= 128
##$LB= 0.3
##$LEV0= 0
##$LPBIN= 0
##$MAXI= 10000
##$MC2= 0
##$MEAN= 0
##$ME_mod= 0
##$MI= 0
##$NCOEF= 0
##$NC_proc= -2
##$NLEV= 6
##$NOISF1= 0
##$NOISF2= 0
##$NSP= 0
##$NTH_PI= 0
##$NZP= 0
##$OFFSET= 16.45037
##$PC= 1
##$PHC0= -79.72742
##$PHC1= 13.49171
##$PH_mod= 1
##$PKNL= yes
##$PPARMOD= 0
##$PSCAL= 4
##$PSIGN= 0
##$REVERSE= no
##$SF= 250.130017914445
##$SI= 32768
##$SIGF1= 0
##$SIGF2= 0
##$SINO= 400
##$SIOLD= 32768
##$SREGLST= <1H.CDCl3>
##$SSB= 0
##$STSI= 32768
##$STSR= 0
##$SW_p= 5175.98343685301
##$SYMM= 0
##$S_DEV= 0
##$TDeff= 65536
##$TDoff= 0
##$TI= <Analysis number 999999
Compound Code 99
Book Reference 9
Project Code 9>
##$TILT= no
##$TM1= 0
##$TM2= 0
##$TOPLEV= 0
##$USERP1= <user>
##$USERP2= <user>
##$USERP3= <user>
##$USERP4= <user>
##$USERP5= <user>
##$WDW= 1
##$XDIM= 32768
##$YMAX_p= 274338409
##$YMIN_p= -260902
$$ End of Bruker specific parameters
$$ ---------------------------------
##NTUPLES= NMR SPECTRUM
##VAR_NAME=  FREQUENCY,     SPECTRUM/REAL,   SPECTRUM/IMAG
##SYMBOL=    X,             R,               I
##VAR_TYPE=  INDEPENDENT,   DEPENDENT,       DEPENDENT
##VAR_FORM=  AFFN,          ASDF,            ASDF
##VAR_DIM=   32768,         32768,           32768
##UNITS=     HZ,            ARBITRARY UNITS, ARBITRARY UNITS
##FACTOR=    0.157963299565203, 1,           1
##FIRST=     4114.73154004533, 0,            0
##LAST=      -1061.25189680768, 0,           0
##MIN=       -1061.25189680768, -260902,     0
##MAX=       4114.73154004533, 274338409,    0
$$ Real data points
##PAGE= N=1
##DATA TABLE= (X++(R..R)), XYDATA
$$ [...]
$$ plain form
16521 83140 81854 96593 93735 76506 50895 38069 27732 20547 23379 48411 47397 54163 59256
16508 59256 14982 12296 11795 27261 38345 44597 32358 -15257 -47089 -39073 -23197 -10617 4610
16495 4610 10852 -4746 6760 -5321 -15508 -18212 -14200 -7700 -4550 14814 -12120 -39648 -55456
16482 -55456 -30290 -18412 -12824 -23712 -18035 -14449 -1968 -6819 -15336 9135 -8031 -37796 -21379
16469 -21379 8646 5780 -8480 -20185 -12601 -9730 -38410 -49602 -59880 -43305 -6855 -17199
16457 -17199 -16104 -40394 -63410 -64969 -54317 -76363 -56098 -15734 -9933 -3623 116 -6002 -8028
16444 -8028 12161 11676 19714 18024 1105 -7113 -32446 -6471 -10870 -1440 29322 24225 16106 -20683
16430 -20683 -52082 -53865 -51370 -40035 -31820 -24491 -24261 -53368 -58381 -33684 -23517 -40848 -29935
$$ packed form
16521H3140j286J4739k858j7229k5611j2826j0337p185K832K5032j014O766N093
16508E9256m4274k686n01J5466J1084O252j2239m7615l1832Q016J5876J2580J5227
16495D610O242j5598J1506j2081j0187k704M012O500L150J9364k6934k7528j5808
16482e5456K5166J1878N588j0888N677L586J2481m851q517K4471j7166k9765J6417
16469b1379L0025k866j4260j1705P584K871k8680j1192j0278J6575L6450j0344
16457a7199J095k4290k3016j559J0652k2046K0265M0364N801O310L739o118k026
16444h028K0189m85Q038j690j6919q218k5333K5975m399R430L0762n097q119l6789
16430b0683l1399j783K495J1335Q215P329K30k9107n013K4697J0167j7331J0913
$$ plain form
16417 -29935 -10444 6316 -456 -15243 -29019 -39662 -13619 -7676 -26326 -27567 -42805 -56102
16405 -56102 -34271 -18041 -3529 24227 19482 -23536 -32251 -31464 -41900 -34513 -13791 1334 -14181
16392 -14181 -22111 -4995 -15817 -46681 -55419 -39862 -23250 -27906 -45214 -45674 -49745 -14423 13552
16379 13552 20361 25803 36500 -7872 -44308 -34526 -23194 -35675 -41993 -38904 -69016 -50985 -31471
16366 -31471 -20206 36791 22704 -5199 -28666 -63491 -56063 -63142 -59315 -44425 -50413 -51556 -37248
16353 -37248 -43198 -47688 -47987 -22644 18991 -718 -12771 -12370 33946 38284 33766 7492 23665
16340 23665 39136 37435 36939 24883 13568 9591 15417 14813 18187 12849 4075 4431 1457 -1689
16326 -1689 1917 4114 -5967 105 -1343 -22638 -23978 -20975 -15113 -8540 9569 13503 8360 -21539
$$ packed form
16417b9935J9491J6760o772j4787j3776j0643K6043N943j8650j241j5238j3297
16405e6102K1831J6230J4512K7756m745m3018q715P87j0436P387K0722J5125j5515
16392a4181p930J7116j0822l0864q738J5557J6612m656j7308m60m071L5322K7975
16379A3552O809N442J0697m4372l6436R782J1332j2481o318L089l0112J8031J9514
16366c1471J1265N6997j4087k7903k3467l4825P428p079L827J4890n988j143J4308
16353c7248n950m490k99K5343M1635j9709j2053M01M6316M338m518k6274J6173
16340B3665J5471j701m96j2056j1315l977N826o04L374n338q774L56k974l146
16326a689L606K197j0081O072j448k1295j340L003N862O573J8109L934n143k9899
$$ plain form
16312 -21539 -40303 -44383 -10632 10336 3063 5126 1479 37343 46044 25610 9160 -12114 -7326
16299 -7326 -1335 20263 15329 -2624 -15472 -14134 12815 4911 3791 17057 9403 -6734 15644
16286 15644 19865 8707 9001 8846 -9951 -834 -12653 -23616 4617 -15041 -29737 987 -15426
16273 -15426 6679 43245 47070 18260 8161 28124 48553 47611 80028 70380 30324 13591
16261 13591 -20162 -43634 -48816 -35671 -19332 -17075 -10747 -26191 -33452 -21048 10657 41955
16249 41955 23014 16955 46707 50802 13901 33097 56258 56679 43161 20916 20003 36223 46904
16236 46904 7333 -29886 -14892 40763 51745 49261 26711 6278 6052 18653 4895 5010 18709
16223 18709 27347 32931 24135 3606 -754 -22404 -6382 -6850 -34711 -12952 2989 7373 -11256
$$ packed form
16312b1539j8764m080L3751K0968p273K063l647L5864Q701k0434j6450k1274M788
16299g326N991K1598m934j7953j2848J338K6949p904j120J3266p654j6137K2378
16286A5644M221j1158K94j55j8797R117j1819j0963K8233j9658j4696L0724j6413
16273a5426K2105L6566L825k8810j0099J9963K0429r42L2417r648m0056j6733
16261A3591l3753k3472n182J3145J6339K257O328j5444p261J2404L1705L1298
16249D1955j8941o059K9752M095l6901J9196K3161M21j3518k2245r13J6220J0681
16236D6904l9571l7219J4994N5655J0982k484k2550k0433k26J2601j3758J15J3699
16223A8709Q638N584q796k0529m360k1650J6022m68k7861K1759J5941M384j8629
$$ plain form
16210 -11256 -1966 -16143 -12116 24585 30480 27219 12586 -4655 -4069 4734 -13909 -4882 20332
16197 20332 11386 15085 -192 -2608 -6974 -23305 -27237 -13905 2908 -1222 4303 31381 40632
16184 40632 33585 27225 30314 21905 18519 28996 18488 -11942 -40286 -22894 -3194 -9793 -23159
16171 -23159 -16239 6459 14324 17164 3007 3279 2500 11570 24630 28970 5017 -8760 -17159 -11896
16157 -11896 -1359 -4112 -13320 1987 10147 -6412 -16441 11494 36286 54675 14642 -1306
16145 -1306 9074 16572 21911 38730 50860 46727 -3908 -33798 405 22213 12027 17584 36292
16132 36292 64600 90243 56335 36543 33204 32218 24617 29822 11022 2025 20030 32467 49696
16119 49696 53430 65173 23469 -11729 -2 154 18633 12826 2329 9940 20004 23568 11983
$$ packed form
16210a1256R290j4177M027L6701N895l261j4633j7241N86Q803j8643R027K5214
16197B0332q946L699j5277k416m366j6331l932J3332J6813m130N525K7078R251
16184D0632p047o360L089q409l386J0477j0508l0430k8344J7392J9700o599j3366
16171b3159O920K2698P865K840j4157K72p79R070J3060M340k3953j3777q399N263
16157a1896J0537k753r208J5307Q160j6559j0029K7935K4792J8389m0033j5948
16145a306J0380P498N339J6819J2130m133n0635k9890L4203K1808j0186N557J8708
16132C6292K8308K5643l3908j9792l339r86p601N205j8800q997J8005J2437J7229
16119D9696L734J1743m1704l5198J1727J56J8479n807j0497P611J0064L564j1585
$$ plain form
16106 11983 23659 29130 15684 21111 73 -12664 -15837 337 17627 37145 37975 42569 32316
16093 32316 23006 27862 38005 29388 16946 8205 -5052 -71 -7051 -2436 -2125 16220 2662
16080 2662 -12674 14661 29915 16048 -1184 36460 38564 38286 40157 19820 18194 10859 -958
16067 -958 -17482 -2523 470 10087 2795 21812 40064 39819 14085 -6704 14411 -22298 -40782
16054 -40782 -25622 28894 38090 38825 -4008 -18640 -16422 -17242 -19872 -11893 17937 17294 11646 35568
16040 35568 51612 29289 -1880 6549 38557 33861 36899 42125 31712 36885 13114 10887 38552
16027 38552 57563 81725 77565 58538 39036 45716 40882 20441 13789 16512 13518 1167 23742
16014 23742 48478 70786 68906 50267 23089 18355 60780 85525 86437 38952 -5917 -1214 -1275
$$ packed form
16106A1983J1676N471j3446N427k1038j2737l173J6174J7290J9518Q30M594j0253
16093C2316r310M856J0143q617j2442q741j3257M981o980M615L11J8345j3558
16080B662j5336K7335J5254j3867j7232L7644K104k78J871k0337j626p335j1817
16067i58j6524J4959K993R617p292J9017J8252k45k5734k0789K1115l6709j8484
16054d0782J5160N4516R196P35m2833j4632K218q20k630P979K9830o43n648K3922
16040C5568J6044k2323l1169Q429L2008m696L038N226j0413N173k3771k227K7665
16027C8552J9011K4162m160j9027j9502O680m834k0441o652K723k994j2351K2575
16014B3742K4736K2308j880j8639k7178m734M2425K4745R12m7485m4869M703o1
$$ plain form
16001 -1275 -34842 -27199 18745 35538 36082 28520 24176 27299 52995 28736 7210 22508 11856
15988 11856 18638 47268 51148 28314 25250 42057 22819 12908 23164 32900 29036 37548 27446
15975 27446 10509 -1337 4943 -692 5443 1899 -648 28895 42997 23124 18374 48342 56809
15962 56809 60648 70556 93608 95167 101559 106448 103200 60738 29920 32133 31166 13148 21170 67595
15948 67595 63009 43621 -7098 8359 14528 15343 -1535 -41384 -48162 -10436 19982 26308 29345
15935 29345 24161 19490 12453 -7115 1263 7310 11076 16345 31759 27547 16252 10005 -2555
15922 -2555 20073 36992 36144 26877 58469 58665 37591 32145 40574 26849 35543 35652 61969 75375
15908 75375 48945 34240 34393 26763 47760 63326 46064 48028 28051 12497 25723 52961
$$ packed form
16001a275l3567P643M5944J6793N44p562m344L123K5696k4259k1526J5298j0652
15988A1856O782K8630L880k2834l064J6807j9238r911J0256R736l864Q512j0102
15975B7446j6937j1846O280n635O135l544k547K9543J4102j9873m750K9968Q467
15962E6809L839R908K3052J559O392M889l248m2462l0818K213r67j8018Q022M6425
15948F7595m586j9388n0719J5457O169Q15j6878l9849o778L7726L0418O326L037
15935B9345n184m671p037j9568Q378O047L766N269J5414m212j1295o247j2560
15922b555K2628J6919q48r267L1592J96k1074n446Q429j3725Q694J09K6317J3406
15908G5375k6430j4705J53p630K0997J5566j7262J964j9977j5554J3226K7238
$$ plain form
15896 52961 50402 41190 31071 20212 22806 38740 46316 35167 34992 47890 38230 40209 42718
15883 42718 23932 21411 14581 11028 -10080 -578 35069 25581 18299 -9170 15998 40102 27160
15870 27160 40812 81956 86703 67892 37230 9511 -155 29479 42113 38813 54822 41333
15858 41333 30760 38748 38657 28517 13350 10490 15519 45159 80004 96053 99116 74198 84259
15845 84259 107101 75159 37794 28296 18283 29633 26357 39186 26161 18411 40051 73901
15833 73901 86739 52414 45119 60553 61708 48341 48832 49281 42944 48338 53768 36192 59738
15820 59738 90595 81258 84261 70509 79645 65049 37311 62183 82576 102004 99587 80457
15808 80457 41432 59713 76737 36936 21723 49799 68441 89174 89516 76049 81397 92164
$$ packed form
15896E2961k559r212j0119j0859K594J5934P576j1149j75J2898r660J979K509
15883D2718j8786k521o830l553k1108R502L5647r488p282k7469K5168K4104j2942
15870B7160J3652M1144M747j8811l0662k7719r666K9634J2634l300J6009j3489
15858D1333j0573P988r1j0140j5167k860N029K9640L4845J6049L063k4918J0061
15845H4259K2842l1942l7365r498j0013J1350l276J2829j3025p750K1640L3850
15833G3901J2838l4325p295J5434J155j3367M91M49o337N394N430j7576K3546
15820E9738L0857r337L003j3752R136j4596k7738K4872K0393J9428k417j9130
15808H0457l9025J8281J7024l9801j5213K8076J8642K0733L42j3467N348J0767
$$ plain form
15796 92164 96597 89526 105355 71788 69212 95868 91386 78258 77252 50857 73155 94052 68777
15783 68777 41069 81279 93893 86584 90787 69271 31048 25268 53864 46128 43920 32438 26650
15770 26650 56013 51435 89535 78264 68284 70504 86685 93366 103701 106962 111065 72091 20541
15757 20541 33061 37231 45547 66334 72074 64160 58631 70856 62919 66100 75290 65308 45658
15744 45658 44006 52367 45638 38970 44798 48478 37717 44898 45907 31259 45337 56061 43244
15731 43244 43932 70091 96026 115113 108476 116569 108584 97486 97380 97489 105249 119179 105338 104607
15717 104607 77371 44151 72498 98169 107782 105809 106707 109664 127483 105668 88931 91466 90454
15704 90454 89877 84955 63471 37689 56720 98812 106345 135980 135471 105083 61919 76394 86211
$$ packed form
15796I2164M433p071J5829l3567k576K6656m482j3128j006k6395K2298K0897k5275
15783F8777k7708M0210J2614p309M203k1516l8223n780K8596p736k208j1482n788
15770B6650K9363m578L8100j1271r980K220J6181O681J0335L261M103l8974n1550
15757B0541J2520M170Q316K0787N740p914n529J2225p937L181R190r982j9650
15744D5658j652Q361o729o668N828L680j0761P181J009j4648J4078J0724j2817
15731D3244O88K6159K5935J9087o637Q093p985j1098j06J09P760J3930j3841p31
15717A04607k7236l3220K8347K5671R613j973Q98K957J7819k1815j6737K535j012
15704I0454n77m922k1484k5782J9031M2092P533K9635n09l0388m3164J4475R817
$$ plain form
15691 86211 109212 99237 98030 117578 135753 128582 96606 74250 77925 106782 109092 97147 90652
15678 90652 108265 131849 146197 155635 146951 152026 155297 138575 127770 112278 85399 89602 78987
15665 78987 72715 95314 138342 149678 135247 116019 107732 104201 115444 115946 124661 136091 147871
15652 147871 136662 126627 97137 100078 119147 139189 136736 116334 106951 145555 158624 159138
15640 159138 152876 136616 141436 154100 160662 157624 145077 145413 121035 129656 143896 148542 140721
15627 140721 113969 102018 89712 114172 131856 141966 138513 123644 138995 157915 137499 143932
15615 143932 173105 192226 203608 175041 145079 141901 141004 134755 117835 99367 126208 133229
15603 133229 115270 119057 132471 137890 139618 138525 130585 141646 173494 187246 176867 158694
$$ packed form
15691H6211K3001r975j207J9548J8175p171l1976k2356L675K8857K310j1945o495
15678I0652J7613K3584J4348R438q684N075L271j6722j0805j5492k6879M203j0615
15665G8987o272K2599M3028J1336j4431j9228q287l531J1243N02Q715J1430J1780
15652A47871j1209j0035k9490K941J9069K0042k453k0402r383L8604J3069N14
15640A59138o262j6260M820J2664O562l038j2547L36k4378Q621J4240M646p821
15627A40721k6752j1951j2306K4460J7684J0110l453j4869J5351J8920k0416O433
15615A43932K9173J9121J1382k8567k9962l178q97o249j6920j8468K6841P021
15603A33229j7959L787J3414N419J728j093p940J1061L1848J3752j0379j8173
$$ plain form
15591 158694 182619 156288 138779 150150 184091 203271 187890 190618 179798 172900 165144 125301
15579 125301 135198 135605 105766 79075 117078 142579 169865 183195 216132 227468 226361 198390
15567 198390 184512 213864 216919 201452 172298 191362 175506 151637 187306 198482 176459 175858
15555 175858 202774 230033 221361 192325 192378 191651 194594 230015 239552 230051 241541 245387 233002
15542 233002 231888 243507 233263 252105 257946 272769 260700 240809 217948 229914 234393 217536
15530 217536 241050 232729 226917 232775 251131 209898 195304 209296 239677 253247 261680 248761
15518 248761 242088 248844 261443 287697 278178 295764 292480 281322 302633 293995 259462 251244 256649
15505 256649 270469 300829 300164 307687 313997 318545 298838 304828 305929 310793 320917 336382 330382
$$ packed form
15591A58694K3925k6331j7509J1371L3941J9180j5381K728j0820o898p756l9843
15579A25301R897M07k9839k6691L8003K5501K7286J3330L2937J1336j107k7971
15567A98390j3878K9352L055j5467k9154J9064j5856k3869L5669J1176k2023o01
15555A75858K6916K7259q672k9036N3p27K943L5421R537r501J1490L846j2385
15542B33002j114J1619j0244J8842N841J4823j2069j9891k2861J1966M479j6857
15530B17536K3514q321n812N858J8356m1233j4594J3992L0381J3570Q433j2919
15518B48761o673O756J2599K6254r519J7586l284j1158K1311q638l4533q218N405
15505B56649J3820L0360o65P523O310M548j9707N990J101M864J0124J5465o000
$$ plain form
15492 330382 298950 297607 336035 340306 351855 370652 358953 314779 323669 334884 338149 308559
15480 308559 288438 301743 330838 331036 330697 321806 335055 344163 365498 346754 329722 333269 336043
15467 336043 332712 328375 335310 337141 316762 363454 375874 365842 357420 377850 389828 382511 365160
15454 365160 376708 393163 425069 418490 387539 361810 373030 377032 368301 364986 377592 394991
15442 394991 360618 353089 371135 413445 440358 441102 438837 444009 425023 441913 477758 479006 439006
15429 439006 418966 427229 456247 465909 469384 470119 514722 556896 555316 547160 544606 524431 531224
15416 531224 544405 523929 534180 555879 556784 542446 528604 532104 555681 582331 587586 588703
15404 588703 590120 595414 594229 594682 580511 563881 572638 602761 609538 607928 612084 595199 601907
$$ packed form
15492C30382l1432j343L8428M271J1549J8797j1699m4174Q890J1215L265k9590
15480C08559k0121J3305K9095J98l39q891J3249R108K1335j8744j7032L547K774
15467C36043l331m337O935J831k0379M6692J2420j0032q422K0430J1978p317j7351
15454C65160J1548J6455L1906o579l0951k5729J1220M002q731l315J2606J7399
15442C94991l4373p529J8046M2310K6913P44k265N172j8986J6890L5845J248m0000
15429D39006k0040Q263K9018R662L475P35M4603M2174j580q156k554k0175O793
15416E31224J3181k0476J0251K1699R05j4338j3842L500K3577K6650N255J117
15404E88703J417N294j185M53j4171j6630Q757L0123O777j610M156j6885O708
$$ plain form
15391 601907 601051 621202 628583 611727 642050 653702 642265 632974 608058 621353 637431 636654 634000
15378 634000 648880 669652 664424 668896 675108 699065 723573 751849 756408 759977 737531 725697
15366 725697 743418 763956 774415 749690 740867 759032 776619 794378 800040 800355 789289 803319
15354 803319 837865 850429 843811 849238 832889 830853 831453 828400 828216 845884 885457 898119 869279
15341 869279 861385 867418 861181 884135 910363 906265 900777 932514 928124 940297 948982 955005 951865
15328 951865 941792 961934 1017748 1023342 988581 966829 959779 977738 977161 966603 1003455 1037765
15316 1037765 1047773 1052484 1059676 1056597 1073405 1084147 1075413 1072471 1091809 1094357 1113334 1128185
15304 1128185 1148054 1161759 1141169 1133841 1146420 1167409 1199179 1207208 1211579 1188410 1203437 1251526
$$ packed form
15391F01907q56K0151P381j6856L0323J1652j1437r291k4916J3295J6078p77k654
15378F34000J4880K0772n228M472O212K3957K4508K8276M559L569k2446j1834
15366G25697J7721K0538J0459k4725q823J8165J7587J7759N662L15j1066J4030
15354H03319L4546J2564o618N427j6349k036O00l053j84J7668L9573J2662k8840
15341H69279p894O033o237K2954K6228m098n488L1737m390J2173Q685O023l140
15328I51865j0073K0142N5814N594l4761k1752p050J7959n77j0558L6852L4310
15316A037765J0008M711P192l079J6808J0742q734k942J9338K548J8977J4851
15304A128185J9869J3705k0590p328J2579K0989L1770Q029M371k3169J5027M8089
$$ plain form
15292 1251526 1265563 1257997 1243789 1241120 1245057 1259888 1247255 1238008 1240031 1200585 1194767 1230425
15280 1230425 1263269 1262193 1238218 1222764 1240441 1258985 1270957 1296697 1300243 1293837 1318505 1340095
15268 1340095 1358330 1375355 1404349 1396325 1350504 1372819 1393090 1401329 1398407 1386013 1415737 1415942
15256 1415942 1370668 1370778 1379745 1380727 1395953 1415666 1404533 1422209 1414832 1437414 1463434 1448358
15244 1448358 1429843 1419364 1420671 1428813 1438541 1447253 1452260 1439109 1446382 1449055 1446516 1448146 1457128
15231 1457128 1460037 1422109 1420840 1447736 1439427 1418987 1413687 1438933 1458527 1469127 1465577 1465276 1478514
15218 1478514 1481829 1470596 1469552 1487006 1462194 1446978 1434764 1444651 1451514 1437520 1408202 1413549
15206 1413549 1405104 1410611 1435441 1442671 1427013 1409668 1392870 1388281 1373924 1397188 1410998 1394310
$$ packed form
15292A251526J4037p566j4208k669L937J4831j2633r247K023l9446n818L5658
15280A230425L2844j076k3975j5454J7677J8544J1972K5740L546o406K4668K1590
15268A340095J8235J7025K8994q024m5821K2315K0271Q239k922j2394K9724K05
15256A415942m5274J10Q967R82J5226J9713j1133J7676p377K2582K6020j5076
15244A448358j8515j0479J307Q142R728Q712N007j3151P273K673k539J630Q982
15231A457128K909l7928j269K6896q309k0440n300K5246J9594J0600l550l01J3238
15218A478514L315j1233j044J7454k4812j5216j2214R887O863j3994k9318N347
15206A413549q445N507K4830P230j5658j7345j6798m589j4357K3264J3810j6688
$$ plain form
15194 1394310 1385842 1368878 1351294 1336311 1340217 1331560 1320310 1316987 1307635 1309977 1310738 1329213 1335588
15181 1335588 1324549 1317992 1314437 1312444 1309833 1289203 1278148 1252753 1248944 1256977 1260792 1239478 1253560
15168 1253560 1235995 1228384 1246856 1232212 1223223 1196054 1176443 1200663 1203389 1215857 1187518 1166587
15156 1166587 1167420 1174306 1175708 1181758 1163384 1125238 1123706 1127454 1126840 1096414 1096023 1094674 1078181 1067493
15142 1067493 1110307 1117924 1108823 1070489 1049330 1044768 1028722 1009224 986501 1032002 1040115 991516
15130 991516 979001 977745 981463 986323 1014952 994127 963542 924919 911395 907789 893523 875392
15118 875392 885245 881232 899247 920956 938733 928755 882492 881358 900650 901398 877144 874804 847716
15105 847716 832384 818779 826364 866908 890335 878359 863858 829198 812577 807188 786335 769603
$$ packed form
15194A394310q468j6964j7584j4983L906q657j1250l323r352K342P61J8475O375
15181A335588j1039o557l555j993k611k0630j1055k5395l809Q033L815k1314J4082
15168A253560j7565p611J8472j4644q989k7169j9611K4220K726J2468k8339k0931
15156A166587Q33O886J402O050j8374l8146j532L748o14l0426l91j349j6493j0688
15142A067493M2814P617r101l8334k1159m562j6046j9498k2723M5501Q113m8599
15130I91516j2515j256L718M860K8629k0825l0585l8623j3524l606j4266j8131
15118H75392R853m013J8015K1709J7777r978m6263j134J9292P48k4254k340k7088
15105H47716j5332j3605P585M0544K3427j1976j4501l4660j6621n389k0853j6732
$$ plain form
15093 769603 745851 759549 771792 775452 748479 733361 710087 698562 696128 707505 700765 712832
15081 712832 720008 724194 715535 686223 681325 682261 671435 655121 643656 622493 610330 619005 620535
15068 620535 623755 602148 588747 602434 585300 571162 586278 575166 576806 587582 598007 616299
15056 616299 618941 634513 654171 650500 620717 628651 628580 629744 581534 540249 561439 583328 584678
15043 584678 571414 534626 515740 522102 522358 523889 520845 511021 502458 485305 494810 513823 529275
15030 529275 555936 580424 550448 517201 495655 497690 494709 466277 482683 506745 493469 472423
15018 472423 461005 441834 475153 475375 470052 477237 491064 501772 475795 471808 498664 478982
15006 478982 467042 474080 458371 417676 425285 428392 414039 406661 400510 401431 390326 366156 380221
$$ packed form
15093G69603k3752J3698J2243L660k6973j5118k3274j1525k434J1377o740J2067
15081G12832P176M186q659k9312m898R36j0826j6314j1465k1163j2163Q675J530
15068F20535L220k1607j3401J3687j7134j4138J5116j1112J640J0776J0425J8292
15056F16299K642J5572J9658l671k9783P934p1J164m8210m1285K1190K1889J350
15043E84678j3264l6788j8886O362K56J531l044r824q563j7153R505J9013J5452
15030E29275K6661K4488k9976l3247k1546K035k981k8432J6406K4062j3276k1046
15018D72423j1418j9171L3319K22n323P185J3827J0708k5977l987K6856j9682
15006D78982j1940P038j5709m0695P609L107j4353p378o151R21j1105k4170J4065
$$ plain form
14993 380221 390175 392330 387071 344893 325849 319893 327756 345658 366022 390793 409170 389540
14981 389540 361779 361830 370473 368677 355695 359223 358966 344083 336871 362071 362619 333115 319364 312174
14967 312174 306672 308272 306748 331398 343248 378036 385446 361393 359467 342480 312284 281036
14955 281036 292711 313605 334339 363394 344639 302880 270409 287835 309885 314351 297409 317114
14943 317114 329351 297260 288831 290408 294727 279449 320035 319986 303149 315450 321876 326253 316186
14930 316186 302183 294356 280891 258079 276065 282938 268967 278828 279242 246859 240784 229419 244065
14917 244065 259183 253176 262623 279363 271068 263813 252630 254751 246587 232514 256023 294307 280793
14904 280793 250636 247216 258709 268182 243772 234138 245704 212302 192208 203788 222945 242637
$$ packed form
14993C80221R954K155n259m2178j9044n956P863J7902K0364K4771J8377j9630
14981C89540k7761N1Q643j796j2982L528k57j4883p212K5200N48k9504j3751p190
14967C12174n502J600j524K4650J1850L4788P410k4053j926j6987l0196l1248
14955B81036J1675K0894K0734K9055j8755m1759l2471J7426K2050M466j6942J9705
14943C17114J2237l2091q429J577M319j5278M0586m9j6837J2301O426M377j0067
14930C16186j4003p827j3465k2812J7986O873j3971R861M14l2383o075j1365J4646
14917B44065J5118o007R447J6740q295p255j1183K121q164j4073K3509L8284j3514
14904B80793l0157l420J1493R473k4410r634J1566l3402k0094J1580J9157J9692
$$ plain form
14892 242637 261476 223137 217080 220378 229134 221647 177439 155854 198863 228776 233826 262622
14880 262622 281075 298512 263923 244898 247588 243178 213899 187347 194484 223589 226422 214587
14868 214587 218034 212625 199039 207252 210174 202644 181461 187047 197292 205789 198156 220066 239903
14855 239903 216735 184951 175704 194582 185964 171051 165166 161185 189536 217804 211838 182494
14843 182494 169003 155616 158235 172442 183915 210027 193390 163614 181703 180106 197438 196450
14831 196450 183469 188075 207448 221335 203496 201018 211625 211034 197607 188837 178746 148045
14819 148045 164065 145398 144923 172539 164049 162353 163670 193501 205201 164012 147165 137089
14807 137089 139537 161051 148557 133630 121003 103250 114397 102243 109345 114831 126019 113393
$$ packed form
14892B42637J8839l8339o057L298Q756p487m4208k1585M3009K9913N050K8796
14880B62622J8453J7437l4589j9025K690m410k9279k6552P137K9105K833j1835
14868B14587L447n409j3586Q213K922p530k1183N586J0245Q497p633K1910J9837
14855B39903k3168l1784r247J8878q618j4913n885l981K8351K8268n966k9344
14843A82494j3491j3387K619J4207J1473K6112j6637k9776J8089j597J7332r88
14831A96450j2981M606J9373J3887j7839k478J0607n91j3427q770j0091l0701
14819A48045J6020j8667m75K7616q490j696J317K9831J1700m1189j6847j0076
14807A37089K448K1514j2494j4927j2627j7753J1147j2154P102N486J1188j2626
$$ plain form
14795 113393 98823 99960 123116 118430 127136 108711 94494 102733 115446 142868 146164 136601 124941
14782 124941 122829 111804 123485 136309 138476 129603 147583 170498 171589 181893 167160 150816
14770 150816 143466 140560 114682 126777 152523 140552 109500 96202 101023 131977 134840 156909
14758 156909 181043 177308 142191 111453 104275 121459 127478 124375 104530 80655 57883 81210
14746 81210 125175 125432 128395 142143 131109 109815 87563 92850 109283 123469 125734 116630 97581
14733 97581 75485 63911 82483 99061 135846 156255 135055 152412 147642 153391 147700 140685
14721 140685 127549 106676 131017 121788 103481 120026 124364 127971 129785 134174 124272 133635 138536
14708 138536 110967 111755 104215 60650 82997 98613 67812 59077 83220 117619 132363 130655
$$ packed form
14795A13393j4570J137K3156m686Q706j8425j4217Q239J2713K7422L296r563j1660
14782A24941k112j1025J1681J2824K167q873J7980K2915J091J0304j4733j6344
14770A50816p350k906k5878J2095K5746j1971l1052j3298M821L0954K863K2069
14758A56909K4134l735l5117l0738p178J7184O019l103j9845k3875k2772K3327
14746H1210M3965K57K963J3748j1034k1294k2252N287J6433J4186K265r104j9049
14733I7581k2096j1574J8572J6578L6785K0409k1200J7357m770N749n691p015
14721A40685j3136k0873K4341r229j8307J6545M338L607J814M389r902R363M901
14708A38536k7569P88p540m3565K2347J5616l0801q735K4143L4399J4744j708
$$ plain form
14696 130655 100835 96536 127375 126783 136674 159112 142112 114113 136870 133386 138587 157985 123920
14683 123920 109712 141234 139879 136444 134727 115030 87459 88781 101885 107284 95146 91504 78025
14670 78025 75275 93017 96701 90701 73568 61536 89223 95171 97428 96795 77083 82060 106678
14657 106678 129063 114658 80536 91166 103578 81678 51748 63025 60139 67934 71177 65181
14645 65181 89098 89760 106467 112589 95052 89945 91006 88398 83731 59859 64445 86016 107359
14632 107359 103805 108165 107429 100495 86576 74374 72717 63387 85868 94083 94979 81214 57881
14619 57881 72847 94743 100795 76142 39636 37703 58979 81040 87360 77655 93765 105654
14607 105654 94933 101199 129116 112291 73556 63327 61159 67354 79049 92283 85495 69093
$$ packed form
14696A30655k9820m299L0839n92R891K2438j7000k7999K2757l484N201J9398l4065
14683A23920j4208L1522j355l435j717j9697k7571J322J3104N399j2138l642j3479
14670G8025k750J7742L684o000j7133j2032K7687N948K257o33j9712M977K4618
14657A06678K2385j4405l4122J0630J2412k1900k9930J1277k886P795L243n996
14645F5181K3917O62J6707O122j7537n107J061k608m667k3872M586K1571K1343
14632A07359l554M360p36o934j3919j2202j657r330K2481Q215Q96j3765k3333
14619E7881J4966K1896O052k4653l6506j933K1276K2061O320r705J6110J1889
14607A05654j0721O266K7917j6825l8735j0229k168O195J1695J3234o788j6402
$$ plain form
14595 69093 47461 33758 19214 26953 432 -6884 -13382 8070 38245 44060 48529 33739 56209
14582 56209 48142 28173 60085 89629 108463 89722 68362 34949 24084 26239 25515 26773 21632
14569 21632 30938 40446 27133 21068 29640 37565 41618 51740 30312 21712 31596 60521 79631
14556 79631 115361 128420 88952 58938 35478 28774 -2227 18762 74825 120149 112606 71969
14544 71969 40213 49640 62791 110215 95438 76890 56014 52667 21743 -6182 19620 49425
14532 49425 78303 100194 52778 54165 56287 52601 59487 50339 45895 61552 78644 72286 69088
14519 69088 74648 43205 57479 96387 80637 79447 68638 71612 65092 46479 54152 57592 69742
14506 69742 93347 52158 24418 -14850 -21641 28980 73409 74445 28113 17169 51417 66881
$$ packed form
14595F9093k1632j3703j4544P739k6521p316o498K1452L0175N815M469j4790K2470
14582E6209q067j9969L1912K9544J8834j8741k1360l3413j0865K155p24J258n141
14569B1632R306R508j3313o065Q572P925M053J0122k1428q600R884K8925J9110
14556G9631L5730J3059l9468l0014k3460o704l1001K0989N6063M5324p543m0637
14544G1969l1756R427J3151M7424j4777j8548k0876l347l0924k7925K5802K9805
14532D9425K8878K1891m7416J387K122l686O886r148m444J5657J7092o358l198
14519F9088N560l1443J4274L8908j5750j190j0809K974o520j8613P673L440J2150
14506F9742K3605m1189k7740l9268o791N0621M4429J036m6332j0944L4248J5464
$$ plain form
14494 66881 61056 71825 93099 90467 58552 48817 28780 6333 15366 16595 -13949 134 14635
14481 14635 52554 66861 82939 97301 80773 57686 60216 63851 50560 46392 74087 81551
14469 81551 55908 52864 57807 33520 20241 20328 57758 46863 33935 14113 15174 19603 36776
14456 36776 44867 44589 61537 88253 116174 128858 115654 97473 97628 91259 60790 51057 39145
14443 39145 12190 13383 41994 37516 47789 50991 35536 25367 38520 47652 54033 34198 44535
14430 44535 70156 76490 70190 51985 47281 73186 74315 56918 45795 51787 63752 60394 59041
14417 59041 36935 37911 39386 17422 3820 -5433 15749 26676 12668 15335 19888 -2486 3125
14404 3125 9225 -3531 -9306 -4061 -12030 967 46066 50592 63648 71150 64319 8718 12790
$$ packed form
14494F6881n825J0769K1274k632l1915r735k0037k2447R033J229l0544J4083J4501
14481A4635L7919J4307J6078J4362j6528k3087K530L635j3291m168K7695P464
14469H1551k5643l044M943k4287j3279Q7L7430j0895j2928j9822J061M429J7173
14456C6776Q091k78J6948K6716K7921J2684j3204j8181J55o369l0469r733j1912
14443C9145k6955J193K8611m478J0273L202j5455j0169J3153R132O381j9835J0337
14430D4535K5621O334o300j8205m704K5905J129j7397j1123N992J1965l358j353
14417E9041k2106R76J475k1964j3602r253K1182J0927j4008K667M553k2374N611
14404C125O100j2756n775N245p969J2997M5099M526J3056P502o831n5601M072
$$ plain form
14391 12790 36385 20229 25631 57349 48448 51966 59484 36394 32325 50538 84130 87192 78173
14378 78173 46293 56790 69644 66296 42459 25804 33544 30084 35901 30362 47290 49702 33159
14365 33159 13918 25194 15509 41224 33531 25661 28684 38252 45008 43835 34308 32828 27836 16043
14351 16043 37353 54174 67303 63293 42557 19853 31487 28853 8379 7602 19408 8329
14339 8329 16509 15021 7281 38730 20170 7790 -6314 -13295 -4770 5797 5356 24910 35766
14326 35766 24820 28848 36191 50029 73969 34052 7147 -5011 -38825 -34992 -24185 -10612
14314 -10612 -7322 24777 12572 -28395 -16986 2029 606 975 -3235 14248 12871 3016 -6290
14301 -6290 -25047 -4499 12626 28534 18617 22538 31791 28000 38156 50880 33601 -28062 -7338
$$ packed form
14391A2790K3595j6156N402L1718q901L518P518k3090m069J8213L3592L062r019
14378G8173l1880J0497J2854l348k3837j6655P740l460N817n539J6928K412j6543
14365C3159j9241J1276r685K5715p693p870L023R568O756j173r527j480m992j1793
14351A6043K1310J6821J3129m010k0736k2704J1634k634k0474p77J1806j1079
14339H329Q180j488p740L1449j8560j2380j4104o981Q525J0567m41J9554J0856
14326C5766j0946M028P343J3838K3940l9917k6905j2158l3814L833J0807J3573
14314a0612L290L2099j2205m0967J1409J9015j423L69m210J7483j377r855r306
14301f290j8757K0548J7125J5908r917L921R253l791J0156J2724j7279o1663K0724
$$ plain form
14288 -7338 23669 37746 40887 27520 5304 8222 9400 36170 29440 20407 16392 20380 19725 4749
14274 4749 27911 17750 7806 28679 24209 12777 5790 23898 33836 32099 14758 33648 44715
14261 44715 35806 33619 49317 36630 45652 59860 77804 99256 100093 53971 25357 52736 70659
14248 70659 64401 30192 5215 13365 25884 15359 20486 32361 22124 16696 31175 42815
14236 42815 28591 991 -2804 37364 58675 52417 65200 76618 71768 47704 40840 25357
14224 25357 -17884 -25939 464 15350 31671 40192 29318 8066 12953 29135 30044 22378 -16105
14211 -16105 -31914 -4227 -10182 -19621 3160 2692 -12975 4975 22550 41742 33542 16378 -13275
14198 -13275 -14049 -25856 -11923 -16728 -31341 -8413 3028 9357 7408 17013 4294 -6090 25602
$$ packed form
14288g338L1007J4077L141j3367k2216K918J178K6770o730r033m015L988o55j4976
14274D749K3162j0161r944K0873m470j1432o987J8108R938j737j7341J8890J1067
14261D4715q909k187J5698j2687R022J4208J7944K1452Q37m6122k8614K7379J7923
14248G0659o258l4209k4977Q150J2519j0525N127J1875j0237n428J4479J1640
14236D2815j4224k7600l795M0168K1311o258J2783J1418m850k4064o864j5483
14224B5357m3241q055K6403J4886J6321Q521j0874k1252M887J6182R09p666l8483
14211a6105j5809K7687n955r439K2781m68j5667J7950J7575J9192q200j7164k9653
14198a3275p74j1807J3933m805j4613K2928J1441O329j949R605j2719j0384L1692
$$ plain form
14185 25602 26160 14825 8267 14810 38076 35489 27460 42528 62817 61557 73326 82826 73468
14172 73468 95771 73958 69963 67722 53864 47760 43212 38942 46546 26531 525 2416 16080
14159 16080 27873 27360 35661 35451 9517 -19409 -36236 -12253 3837 -23031 -16702 6823 -2416
14146 -2416 9133 29490 37938 30721 38928 30980 10129 14108 26050 31241 24830 6104 -1523
14133 -1523 -16833 -6963 10278 24051 14223 -2649 -33545 -15130 13688 7736 -1094 -4355 -9610
14120 -9610 -23133 -2549 14094 6919 -8885 1744 25171 39640 57059 58833 44026 27162
14108 27162 16116 26416 9116 2246 2058 19944 41634 39324 24321 7509 18409 20657 37403
14095 37403 43262 21640 -3535 8880 5811 -19989 -13903 11225 32397 32635 3129 6727 7156
$$ packed form
14185B5602N58j1335o558O543K3266k587q029J5068K0289j260J1769R500r358
14172G3468K2303k1813l995k241j3858o104m548m270P604k0015k6006J891J3664
14159A6080J1793n13Q301k10k5934k8926j6827K3983J6090k6868O329K3525r239
14146b416J1549K0357Q448p217Q207p948k0851L979J1942N191o411j8726p627
14133a523j5310R870J7241J3773r828j6872l0896J8415K8818n952q830l261n255
14120i610j3523K0584J6643p175j5804J0629K3427J4469J7419J774j4807j6864
14108B7162j1046J0300j7300o870j88J7886K1690k310j5003j6812J0900K248J6746
14095C7403N859k1622k5175J2415l069k5800O086K5128K1172K38k9506L598M29
$$ plain form
14082 7156 13350 8167 -5950 -4272 31908 34510 18572 -3976 -2284 21795 30270 25222 17440
14069 17440 19110 -5351 2727 36064 28930 1550 6566 22077 21452 18872 5929 -5529 15869
14056 15869 28477 17094 30677 24075 -6101 -5378 1029 -3566 6147 43936 26175 13479 -9209
14043 -9209 6816 20579 10326 6733 10382 8371 10654 17611 38703 38709 48755 41096 35193 34423
14029 34423 25897 7030 6892 5126 5110 4712 21053 49201 69733 42800 41325 34020 1808 -8704
14015 -8704 -4951 -18863 -1560 15368 23408 21942 27732 23548 -1230 -10889 3200 -103 -36431
14002 -36431 -10515 29720 43165 60509 27337 31312 42203 26847 -367 10800 18819 17656
13990 17656 16108 43344 13711 28821 30698 6563 2769 35885 49079 54086 44635 17937 -24107
$$ packed form
14082G156O194n183j4117J678L6180K602j5938k2548J692K4079Q475n048p782
14069A7440J670k4461Q078L3337p134k7380N016J5511o25k580j2943j1458K1398
14056A5869J2608j1383J3583o602l0176P23O407m595R713L7789j7761j2696k2688
14043i209J6025J3763j0253l593L649k011K283O957K1092OJ0046p659n903p70
14029C4423q526j8867j38j766j6l98J6341K8148K0532k6933j475p305l2212j0512
14015h704L753j3912J7303J6928Q040j466N790m184k4778r659J4089l303l6328
14002c6431K5916M0235J3445J7344l3172L975J0891j5356k7214J1167Q019j163
13990A7656j548K7236k9633J5110J877k4135l794L3116J3194N007r451k6698m2044
$$ plain form
13977 -24107 -46501 -31709 -29059 -3440 16242 8297 32460 22337 7921 27638 12939 3946
13965 3946 1552 495 21141 11751 -20259 -29220 -27576 -14592 1202 27292 34620 34845 46487
13952 46487 376 -19650 -26982 -19821 -23400 -22502 -27053 2433 13225 8940 -6035 -3582 -30660
13939 -30660 -28756 8192 23500 22665 19481 1387 -17334 -18552 -11728 7692 17471 5342 16515
13926 16515 926 -760 25121 65457 60384 43974 44740 53343 25315 15158 36782 48554 50411
13913 50411 50827 58385 45426 66128 46650 10091 -5591 20759 37081 27033 3329 -6129
13901 -6129 20821 17327 -8148 -63705 -46528 -21275 -4306 -7069 -6712 1088 -1873 -31908 -47803
13888 -47803 -17542 -10989 -20796 -15206 6159 -5465 -14291 -16546 -16315 -16900 -10100 -6793 36566 36300
$$ packed form
13977b4107k2394J4792K650K5619J9682p945K4163j0123j4416J9717j4699q993
13965C946k394j057K0646r390l2010q961J644J2984J5794K6090P328K25J1642
13952D6487m6111k0026p332P161l579Q98m551K9486J0792m285j4975K453k7078
13939c0660J904L6948J5308q35l184j8094j8721j218O824J9420R779j2129J1173
13926A6515j5589j686K5881M0336n073j6410P66Q603k8028j0157K1624J1772J857
13913E0411M16P558j2959K0702j9478l6559j5682K6350J6322j0048k3704r458
13901f129K6950l494k5475n5557J7177K5253J6969k763L57P800k961l0035j5895
13888d7803L0261O553r807N590K1365j1624q826k255K31n85O800L307M3359k66
$$ plain form
13874 36300 42851 46087 19410 33834 35168 11766 11048 31699 24543 -11444 10377 28534 5980
13861 5980 -21915 -15629 11495 5634 -16257 -18407 19991 43758 49939 26028 24406 30809 37679
13848 37679 50313 30445 411 -10482 -25898 -42266 -49803 -35587 -6347 4755 7844 -1851
13836 -1851 -25200 -26915 2708 18574 23530 20375 15182 -1202 -20676 -7423 -2703 27937 38583
13823 38583 59065 66370 56899 31845 35169 23967 22763 37815 17672 5653 -10489 -17383 -38887
13810 -38887 -38756 -16009 -17873 -35927 -45729 -44342 -67429 -51096 6651 21024 39575 42722 5881
13797 5881 10639 14221 1266 3663 24877 40122 42752 36632 20154 -6587 -31324 -55834 -51145
13784 -51145 -18805 -7775 -28303 -21290 -8523 -12785 -12919 -11613 -3275 -8832 -60554 -52930 -38827
$$ packed form
13874C6300O551L236k6677J4424J334k3402p18K0651p156l5987K1821J8157k2554
13861E980k7895O286K7124n861k1891k150L8398K3767O181k3911j622O403O870
13848C7679J2634j9868l0034j0893j5416j6368p537J4216K9240J1102L089r695
13836a851k3349j715K9623J5866M956l155n193j6384j9474J3253M720L0640J0646
13823C8583K0482P305r471k5054L324j1202j204J5052k0143j2019j6142o894k1504
13810c8887J31K2747j864j8054r802J387k3087J6333N7747J4373J8551L147l6841
13797E881M758L582j2955K397K1214J5245K630o120j6478k6741k4737k4510M689
13784e1145L2340J1030k0528P013J2767m262j34J306Q338n557n1722P624J4103
$$ plain form
13771 -38827 -32582 -24070 -10672 11236 -890 -33281 15632 30689 26831 13675 30817 15256
13759 15256 50806 42336 26641 16186 27115 26972 -2672 15970 40098 16506 -962 -263 10380
13746 10380 25590 28111 22654 6532 9940 -9170 -20111 -19493 -20580 -16975 -1043 21269 40316
13733 40316 31353 27130 35745 9685 -4752 32254 45533 29462 1245 -10963 15076 27533
13721 27533 20075 15546 21056 32709 16474 23815 17009 -2614 8850 9425 7703 -1738 15266
13708 15266 7238 22508 46674 23514 973 24882 10434 19552 42199 48250 51625 47249 20504
13695 20504 -4755 -36300 -17831 -21350 19567 28502 12831 10589 820 6527 31676 32710 32901
13682 32901 7868 -12192 -7206 -11846 -13725 -13003 -3893 -9915 -3685 -20223 -33072 -6702 2839
$$ packed form
13771c8827O245Q512J3398K1908j2126l2391M8913J5057l858j3156J7142j5561
13759A5256L5550q470j5695j0455J0929j43k9644J8642K4128k3592j7468O99J0643
13746A0380J5210K521n457j6122L408j9110j0941O18j087L605J5932K2312J9047
13733D0316q963m223Q615k6060j4437L7006J3279j6071k8217j2208K6039J2457
13721B7533p458m529N510J1653j6235P341o806j9623J1464N75j722r441J7004
13708A5266q028J5270K4166k3160k2541K3909j4448R118K2647O051L375m376k6745
13695B0504k5259l1545J8469l519M0917Q935j5671k242r769N707K5149J034J91
13682C2901k5033k0060M986m640j879P22R110o022O230j6538j2849K6370R541
$$ plain form
13669 2839 -39231 -38847 -21204 34327 31493 14071 11121 8788 5644 -396 -19271 -9835 3369
13656 3369 9663 11134 -16015 -15223 8931 -2638 -1375 11998 8605 -19264 -58077 -65164 -40945
13643 -40945 -16945 9092 36148 27396 14390 24239 -13699 -29063 -32976 -24639 -10507 -35262
13631 -35262 -21194 -14902 -35350 -26727 -2246 3607 56 2369 -23277 -13905 7489 12022 -15347
13618 -15347 -3989 14913 -1062 -671 -1289 4262 25528 15240 16495 2039 -18921 -8215 -6046
13605 -6046 -15595 -19373 4929 9518 -104 -27629 -4060 23118 34085 23858 14434 -4868 -1139
13592 -1139 -5116 -39117 -52747 -30586 -25985 -50215 -61252 -55872 -53890 -13287 16772 39909 48587
13579 48587 53784 36588 50348 24062 7988 12504 16987 2188 -30894 -64298 -76049 -79843
$$ packed form
13669B839m2070L84J7643N5531k834j7422k950k333l144o040j8875R436J3204
13656C369O294J471k7149P92K4154j1569J263J3373l393k7869l8813p087K4219
13643d0945K4000K6037K7056q752j3006R849l7938j5364l913Q337J4132k4755
13631c5262J4068O292k0448Q623K4481N853l551K313k5646R372K1394M533k7369
13618a5347J1358J8902j5975L91o18N551K1266j0288J255j4456k0960J0706K169
13605f046r549l778K4302M589r622k7525K3569K7178J0967j0227r424j9302L729
13592a139l977l4001j3630K2161M601k4230j1037N380J982M0603L0059K3137Q678
13579D8587N197j7196J3760k6286j6074M516M483j4799l3082l3404j1751l794
$$ plain form
13567 -79843 -72497 -66822 -34290 -17825 4963 8965 -5979 11382 14838 19762 20881 16629 22474
13554 22474 39356 28956 -11165 -14525 -1956 -3618 -585 7767 22778 13999 -9947 5252 4357
13541 4357 11275 17153 11228 22257 39246 43532 33067 19013 15669 12283 -293 -8409 19668
13528 19668 33961 9516 -8384 -30371 -30024 -48611 -72267 -48410 -33856 10114 44618 53041
13516 53041 38830 24922 -2336 -12960 23584 46735 48891 38957 40966 -2560 -19888 -20464 -23220
13503 -23220 -13278 -1036 10485 2634 -14851 -4483 21998 39642 14441 -18073 -29407 -31828
13491 -31828 -41205 -41743 -44243 -21726 -12271 -49433 -69211 -31348 -1034 24167 10854 6186 17771
13478 17771 30304 6413 2347 143 -359 -2568 -14525 -32129 -40178 -31398 -27141 -37960 -21116
$$ packed form
13567g9843P346N675L2532J6465K2788M002j4944J7361L456M924J119m252N845
13554B2474J6882j0400m0121l360J2569j662L033Q352J5011q779k3946J5199q95
13541D357O918N878n925J1029J6989M286j0465j4054l344l386j2576q116K8077
13528A9668J4293k4445j7900k1987L47j8587k3656K3857J4554M3970L4504Q423
13516E3041j4211j3908k7258j0624L6544K3151K156r934K009m3526j7328n76k756
13503b3220R942J2242J1521p851j7485J0368K6481J7644k5201l2514j1334k421
13491c1828r377n38k500K2517R455l7162j9778L7863L0314K5201j3313m668J1585
13478A7771J2533k3891m066k204n02k209j1957j7604q049Q780M257j0819J6844
$$ plain form
13465 -21116 -11643 -46609 -50964 -54497 -75248 -57961 -19047 14898 7328 20119 60470 43831
13453 43831 18713 22138 17136 21674 14431 -15788 -1293 22804 12480 -23626 -32159 -45111 -19405
13440 -19405 13519 31535 13269 5770 5337 -26688 -50862 -38711 7881 43547 28224 26790
13428 26790 9491 19666 12398 13965 28001 35355 24503 -7006 -23042 -18230 -1702 -19958
13416 -19958 -13415 -11536 -28549 -718 9035 -20625 -5983 11588 -27491 -50587 -29152 -14510
13404 -14510 -17027 -29780 -24347 3706 16731 8753 -21203 -13702 -19200 -33370 -38004 -29454 -21137
13391 -21137 -20896 -11973 4919 2561 -22431 -16570 -25661 -19430 -26566 -24736 -15146 -6812 -33963 -25398
13377 -25398 -9044 -3741 -4645 171 5216 -36026 -62790 -44267 5142 18144 17670 2717 -17596
$$ packed form
13465b1116R473l4966m355l533k0751J7287L8914L3945p570J2791M0351j6639
13453D3831k5118L425n002M538p243l0219J4495K4097j0324l6106q533j2952K5706
13440a9405L2924J8016j8266p499m33l2025k4174J2151M6592L5666j5323j434
13428B6790j7299J0175p268J567J4036P354j0852l1509j6036M812J6528j8256
13416a9958O543J879j7013K7831R753k9660J4642J7571l9079k3096K1435J4642
13404a4510k517j2753N433K8053J3025p978k9956P501n498j4170m634Q550Q317
13391b1137K41Q923J6892k358k4992N861r091O231p136J830R590Q334k7151Q565
13377b5398J6354N303r04M816N045m1242k6764J8523M9409J3002m74j4953k0313
$$ plain form
13364 -17596 35700 41227 19710 13970 -1647 -15551 -30381 -36011 -22669 -48030 -62804 -48261
13352 -48261 -39000 -18810 9330 25519 29832 29438 32728 26114 15996 -4754 -2822 8354 38929
13339 38929 38378 8102 -9962 -17378 -15135 6306 -7213 -12660 2920 19563 16243 33167 19917
13326 19917 -8184 -37554 -39599 -27535 -12531 13982 32254 41159 56830 61849 30675 18648
13314 18648 10427 1140 696 14783 15878 -2766 -19991 -15017 -10161 -15566 9845 6609 -45085
13301 -45085 -62714 -68421 -87166 -72380 -39046 -23542 -1915 -5561 -3258 20839 -269 -13799
13289 -13799 11780 43648 32255 5372 16919 14541 -5464 -7954 1015 24518 -5031 -9864
13277 -9864 290 -16059 1758 7718 -9990 -2823 -3837 6747 -6222 -23528 -17734 6248 12568
$$ packed form
13364a7596N3296N527k1517n740j5617j3904j4830n630J3342k5361j4774J4543
13352d8261R261K0190K8140J6189M313l94L290o614j0118k0750J932J1176L0575
13339C8929n51l0276j8064p416K243K1441j3519n447J5580J6643l320J6924j3250
13326A9917k8101k9370k045J2064J5004K6513J8272Q905J5671N019l1174j2027
13314A8648q221r287m44J4087J095j8644j7225M974M856n405K5411l236n1694
13301d5085j7629n707j8745J4786L3334J5504K1627l646K303K4097k1108j3530
13289a3799K5579L1868j1393k6883J1547k378k0005k490Q969K3503k9549m833
13277i864J0154j6349J7817N960j7708P167j014J0584j2969j7306N794K3982O320
$$ plain form
13264 12568 28091 14374 -5091 10130 19446 18473 19569 32446 27950 32059 7656 27650 39944
13251 39944 19598 32434 34704 13920 8124 17584 -5126 -5500 7192 6282 -10779 12049 43185
13238 43185 39095 36044 30966 27435 26221 24756 26427 33122 29649 -12236 -28221 -22181 -24819 9241
13224 9241 4962 38857 40965 18976 -1790 -15699 9655 32144 42141 31849 7909 -9139
13212 -9139 -4259 -2967 13461 27992 23804 -1683 13823 22961 25071 34320 16657 3498 26349
13199 26349 54940 68278 48955 23029 -4133 7779 48248 73649 75340 82696 49216 13031
13187 13031 -1653 -20178 -63871 -70508 -35882 -5691 1160 -13089 -24606 -58029 -41507 -7346
13175 -7346 2052 5360 10021 34898 7129 -18329 -15296 -10481 -15501 1633 23093 1750 -18204
$$ packed form
13264A2568J5523j3717j9465J5221R316r73J096J2877m496M109k4403J9994J2294
13251C9944k0346J2836K270k0784n796R460k2710l74J2692r10j7061K2828L1136
13238D3185m090l051n078l531j214j465J671O695l473m1885j5985O040k638L4060
13224I241m279L3895K108k1989k0766j3909K5354K2489R997j0292k3940j7048
13212i139M880J292J6428J4531m188k5487J5506R138K110R249j7663j3159K2851
13199B6349K8591J3338j9323k5926k7162J1912M0469K5401J691P356l3480l6185
13187A3031j4684j8525m3693o637L4626L0191O851j4249j1517l3423J6522L4161
13175g346R398L308M661K4877k7769k5458L033M815n020J7134K1460k1343j9954
$$ plain form
13162 -18204 -21022 -51136 -33612 -20885 -32705 -27144 -35402 -45993 -72143 -78190 -53429 -34659
13150 -34659 -30410 -39971 -44841 -27286 -17137 8955 -2051 12482 41903 32461 34896 47677 50773
13137 50773 51782 14049 -2060 -5174 -42669 -56155 -39030 -26406 -20259 -14683 -16275 -28098 -41334
13124 -41334 -53248 -29085 -35569 -41581 -32272 -5794 3701 11188 14368 20725 32772 32606 11013
13111 11013 196 19504 11514 22137 12243 9418 5512 7903 1792 20999 5315 -32346 -39508
13098 -39508 1088 8579 -18646 -20520 -1615 -6503 -19190 -35973 -29639 -11761 -23004 -6622
13086 -6622 13093 -4773 -36532 6621 29960 1895 -18720 -26416 -25075 -49580 -63708 -33363
13074 -33363 -35111 -53007 -48919 -29946 -37259 -36169 -22610 -22940 -37545 -53188 -60456 -40412 -28002
$$ packed form
13162a8204k818l0114J7524J2727j1820N561q258j0591k6150o047K4761J8770
13150c4659M249r561m870J7555J0149K6092j1006J4533K9421r442K435J2781L096
13137E0773J009l7733j6109l114l7495j3486J7125J2624O147N576j592j1823j3236
13124d1334j1914K4163o484o012R309K6478R495P487L180O357J2047j66k1593
13111A1013j0817J9308p990J0623r894k825l906K391o111J9207j5684l7661p162
13098c9508M0596P491k7225j874J8905m888j2687j6783O334J7878j1243J6382
13086f622J9715j7866l1759M3153K3339k8065k0615p696J341k4505j4128L0345
13074c3363j748j7896M088J8973p313J090J3559l30j4605j5643p268K0044J2410
$$ plain form
13061 -28002 -10481 37667 35195 5721 2117 9718 19120 37769 9122 -13689 -14861 213 -10127
13048 -10127 -10394 -16326 -12643 -2972 -32080 -24136 9969 18511 7668 7155 25338 6891 -12436
13035 -12436 8806 3793 -1224 33635 29527 36230 44829 10794 -39222 -46703 -20980 1639 24874
13022 24874 25313 389 -17427 -23940 1486 40859 11939 5453 16816 15070 32272 39121 24096
13009 24096 25301 33199 36284 25728 13900 10791 -6970 -49495 -36870 -27795 -12692 2722 7886
12996 7886 26480 38292 13048 -3291 -21856 -14414 -25718 -29577 -34707 -34570 -28067 3793 22623
12983 22623 26056 2127 -13130 -27732 -43235 -35122 -33088 -14827 8500 8846 -15686 1694 5408
12970 5408 24485 574 -11047 6598 7451 33044 29026 7416 19826 47423 48347 56937 43915
$$ packed form
13061b8002J7521M8148k472k9474l604P601R402J8649k8647k2811j172J5074j0340
13048a0127k67n932L683R671k9108P944L4105Q542j0843n13J8183j8447j9327
13035a2436K1242n013n017L4859m108O703Q599l4035n0016p481K5723K2619K3235
13022B4874M39k4924j7816o513K5426L9373k8920o486J1363j746J7202O849j5025
13009B4096J205P898L085j0556j1828l109j7761m2525J2625R075J5103J5414N164
12996G886J8594J1812k5244j6339j8565P442j1304l859n130J37O503L1860J8830
12983B2623L433k3929j5257j4602j5503Q113K034J8261K3327L46k4532J7380L714
12970E408J9077k3911j1621J7645Q53K5593m018k1610J2410K7597R24Q590j3022
$$ plain form
12957 43915 40692 43910 31922 18226 9134 14750 22698 23105 1255 -7501 -12261 -17737 -38676 -39927
12943 -39927 -36735 -12543 -4750 -44034 -66789 -88416 -79216 -55769 -23700 -2265 11717 -743
12931 -743 -31584 -26266 -20032 -545 726 -11205 -20308 -47136 -39620 -13712 4813 2321 4625
12918 4625 25686 59475 40318 33927 45078 45997 21848 14618 7352 4856 9261 4145 25373
12905 25373 5189 -2389 -6213 -12708 -13714 -7519 -12123 -46333 -35605 -35081 -13502 26232 4547
12892 4547 16631 5125 -6207 4396 20645 17213 -28469 -31982 -11737 -886 -44268 -46718
12880 -46718 -53865 -50486 -37604 -9530 -5649 -12985 -25005 -5616 -12246 23784 45432 34087 34757
12867 34757 51877 59444 42729 10244 4714 -6445 -15750 -5280 -2485 -13338 -625 -4125 -16545
$$ packed form
12957D3915l223L218j1988j3696r092N616P948M07k1850q756m760n476k0939j251
12943c9927L192K4192P793l9284k2755k1627R200K3447L2069K1435J3982j2460
12931g43l0841N318O234J9487J271j1931r103k6828P516K5908J8525k492K304
12918D625K1061L3789j9157o391J1151R19k4149p230p266k496M405n116K1228
12905B5373k0184p578l824o495j006O195m604l4210J0728N24K1579L9734k1685
12892D547J2084j1506j1332J0603J6249l432m5682l513K0245J0851m3382k450
12880d6718p147L379J2882K8074L881p336j2020J9389o630L6030K1648j1345O70
12867C4757J7120P567j6715l2485n530j1159r305J0470K795j0853J2713l500j2420
$$ plain form
12854 -16545 -117 -13821 1899 19168 -7946 -23749 -39999 -12877 7644 10768 18370 -2725
12842 -2725 1181 14670 12169 11815 4804 14856 6750 22054 17661 -9188 -48813 -37808 -22053
12829 -22053 -18725 -5855 963 -11293 -9051 -15934 -31445 -50381 -48519 -31623 -28878 -25594 -29997
12816 -29997 -15476 17030 16034 3874 -25013 -29446 -2190 -4313 -19896 16170 41451 61433
12804 61433 47202 40742 20100 17705 16091 14968 15377 14834 -15512 -17813 -10572 -4714 -29807 -13666
12790 -13666 -9967 -15416 -28250 -38006 -22139 -20233 -31405 -21883 -18955 -38545 -61936 -63581 -20395
12777 -20395 -8976 -19497 -35605 -21315 27375 26184 17527 42276 45118 38485 38612 30586 19726
12764 19726 20996 46340 26481 -34876 -63685 -31375 -34636 -30611 -22587 -14425 1911 -2667 -2949
$$ packed form
12854a6545J6428j3704J5720J7269k7114j5803j6250K7122K0521L124P602k1095
12842b725L906J3489k501l54p011J0052q106J5304m393k6849l9625J1005J5755
12829b2053L328J2870O818j2256K242o883j5511j8936J862J6896K745L284m403
12816b9997J4521L2506r96j2160k8887m433K7256k123j5583L6066K5281J9982
12804F1433j4231o460k0642k395j614j123M09n43l0346k301P241N858k5093J6141
12790a3666L699n449j2834r756J5867J906j1172R522K928j9590k3391j645M3186
12777b0395J1419j0521j6108J4290M8690j191q657K4749K842o633J27q026j0860
12764A9726J270K5344j9859o1357k8809L2310l261M025Q024Q162J6336m578k82
$$ plain form
12751 -2949 12973 2578 12630 36210 23634 5689 16429 21002 -1164 -11846 30995 44748
12739 44748 20957 9214 4223 9688 1635 13223 13551 1785 -22611 -30158 -9355 -2519 -14320
12726 -14320 2990 -17527 -9141 22522 20573 -7582 -15841 -23065 -28455 6726 25866 24107 36716
12713 36716 40382 9548 -32271 -18561 2700 13319 17349 -29603 -33785 21309 56270 31172
12701 31172 13772 25915 -10663 -24130 -34949 -49521 -47454 -33784 2573 14033 19546 -13575
12689 -13575 4855 14340 -283 -718 103 -6133 9174 8163 -3373 -28367 -55232 -74759 -93692
12676 -93692 -78590 -51402 -43188 -33939 -13928 1407 -977 -15304 -32148 -18638 -19359 -18741 20243
12663 20243 4241 -5905 -24261 -16645 -1245 7453 10831 16303 6692 -3873 15045 8770 10778
$$ packed form
12751b949J5922j0395J0052K3580j2576j7945J0740M573k2166j0682M2841J3753
12739D4748k3791j1743m991N465q053J1588L28j1766k4396p547K0803O836j1801
12726a4320J7310k0517Q386L1663j949k8155q259p224n390L5181J9140j759J2609
12713C6716L666l0834m1819J3710K1261J0619M030m6952m182N5094L4961k5098
12701C1172j7400J2143l6578j3467j0819j4572K067J3670L6357J1460N513l3121
12689a3575J8430R485j4623m35Q21o236J5307j011j1536k4994k6865j9527j8933
12676i3692J5102K7188Q214R249K0011J5335k384j4327j6844J3510p21O18L8984
12663B0243j6002j0146j8356P616J5400Q698L378N472r611j0565J8918o275K008
$$ plain form
12650 10778 -10737 -16148 -9377 -3583 -23281 -13549 14986 9267 12125 9619 -14149 -21237 -27849
12637 -27849 -16164 26357 38936 23912 -9820 -1896 -13581 8391 12382 621 -31278 -51390
12625 -51390 -24698 22489 7428 11529 25103 141 -34137 -25621 30226 60514 39495 870
12613 870 -3800 -913 17497 32578 24813 -10288 -14320 5279 -4054 8561 -39 13613 29516
12600 29516 14964 -10473 -18926 -27163 -15335 20707 23606 16575 14127 27369 -5061 -17024 -3968
12587 -3968 8103 15047 11930 12493 -11166 -7979 638 -18532 -18562 -44057 -58472 -49167 -38280 -42827
12573 -42827 -65202 -68620 -32882 -9209 -13471 -19529 -29332 -13093 -4544 -1238 -13641 227 16520
12560 16520 -2063 -11958 -31826 -18502 -10903 7701 -18150 -11387 15164 41590 31436 36478
$$ packed form
12650A0778k1515n411O771N794j9698R732K8535n719K858k506k3768p088o612
12637b7849J1685M2521J2579j5024l3732P924j1685K1972L991j1761l1899k0112
12625e1390K6692M7187j5061M101J3574k4962l4278Q516N5847L0288k1019l8625
12613H70m670K887J8410J5081p765l5101m032J9599r333J2615q600J3652J5903
12600B9516j4552k5437q453q237J1828L6042K899p031k448J3242l2430j1963J3056
12587c968J2071O944l117N63k3659L187Q617j9170l0k5495j4415R305J0887m547
12573d2827k2375l418L5738K3673m262o058r803J6239Q549L306j2403J3868J6293
12560A6520j8583r895j9868J3324P599J8604k5851O763K6551K6426j0154N042
$$ plain form
12548 36478 57493 28442 185 -19554 4692 11779 16274 47305 68996 76035 56262 27911
12536 27911 2610 -22197 -19693 -14302 -25967 -20311 -9139 -45490 -53829 -49977 -51091 -62442 -49379
12523 -49379 -52495 -62218 -57627 -24788 -20962 -28334 -35749 -30201 -26004 -20618 7204 -7518 -5223 6634
12509 6634 22779 15637 6211 -4705 -7240 8027 9317 -10805 -11875 -15354 -7461 -11366 -20554 -8685
12495 -8685 -16797 -28130 -34069 -30550 -33542 -34177 -606 1015 -16664 -27924 -9272 -203 823 -16412
12481 -16412 -39188 -28879 -19991 -10941 -15514 -4394 -6185 -20457 -38125 -26262 -2871 24467
12469 24467 43401 47783 24058 7651 -8665 -267 5156 3855 7164 24180 11032 16084 -17763
12456 -17763 -4599 39740 38934 35273 34755 41119 23147 17484 9793 12119 56698 55553 52147 66282
$$ packed form
12548C6478K1015k9051k8257j9739K4246P087M495L1031K1691P039j9773k8351
12536B7911k5301k4807K504N391j1665N656J1172l6351q339L852j114j1351J3063
12523d9379l116r723M591L2839L826p372p415N548M197N386K7822j4722K295J1857
12509F634J6145p142r426j0916k535J5267J290k0122j070l479P893l905r188J1869
12495h685q112j1333n939L519k992o35L3571J621j7679j1260J8652R069J026j7235
12481a6412k2776J0309Q888R050m573J1120j791j4272j7668J1863K3391K7338
12469B4467J8934M382k3725j6407j6316Q398N423j301L309J7016j3148N052l3847
12456a7763J3164M4339q06l661n18O364j7972n663p691K326M4579j145l406J4135
$$ plain form
12442 66282 32471 14693 15476 367 4841 -3978 12006 -1175 -20572 -16162 2041 16855 9090
12429 9090 14542 -3877 -10093 10810 23067 1317 -14763 -41768 -32544 -22949 21741 11840 -39758
12416 -39758 -75818 -76463 -56737 -38066 -32138 -70287 -52494 -12862 -29622 -28706 -929 -21931 -16718
12403 -16718 -19110 -24780 -18755 -5438 -11491 -12635 16698 46285 32158 10249 8907 12556 3705
12390 3705 3469 23014 41264 29022 21677 9846 27501 8228 -33302 -42357 -14794 -19619 -26317
12377 -26317 -22906 -30797 -25690 -31949 -36129 -13735 -309 -13349 -11458 -23997 -35323 -42581 -29865
12364 -29865 -26537 -2329 6025 -809 -972 -9522 -5496 18423 12471 17218 -4407 -12596 -21424 2743
12350 2743 -1627 6385 -19898 -37978 -30419 -8024 -2928 -17738 -26185 -17557 -10123 -20041 -18987 -23423
$$ packed form
12442F6282l3811j7778P83j5109M474q819J5984j3181j9397M410J8203J4814p765
12429I090N452j8419o216K0903J2257k1750j6080k7005R224R595M4690r901n1598
12416c9758l6060o45J9726J8671N928l8149J7793L9632j6760R16K7777k1002N213
12403a6718k392n670O025J3317o053j144K9333K9587j4127k1909j342L649q851
12390C705k36J9545J8250j2242p345j1831J7655j9273m1530r055K7563m825o698
12377b6317L411p891N107o259m180K2394J3426j3040J891j2539j1326p258J2716
12364b9865L328K4208Q354o834j63q550M026K3919n952M747k1625q189q828K4167
12350B743m370Q012k6283j8080P559K2395N096j4810q447Q628P434r918J054m436
$$ plain form
12336 -23423 -7315 -7115 -578 9013 3849 -18707 -22212 -9726 -3290 -5396 -21346 -30408 -44466
12323 -44466 -49611 -30245 -14346 -46832 -36983 -12229 -15084 -4951 19820 3589 -16180 -36840
12311 -36840 -51332 -55109 -52190 -40493 -13000 -10521 -18306 -10098 325 29450 51662 47717 33865
12298 33865 19140 33469 50959 49800 28577 14902 8977 11985 19326 9213 27003 38363
12286 38363 42300 59083 46734 16177 5697 26574 38137 30492 16176 6446 2071 -30242
12274 -30242 -47970 -45033 -3384 31411 22846 26801 17445 10763 16642 -29991 -48962 -40399 -20428
12261 -20428 -32544 -15381 -14402 -351 -1157 -17224 -26656 -5081 -24479 -21956 -862 39489 22120
12248 22120 -15046 -46410 -23881 10444 -6699 -11940 -4933 11043 23497 6989 -13656 -15175
$$ packed form
12336b3423J6108K00O537R591n164k2556l505J2486O436k106j5950r062j4058
12323d4466n145J9366J5899l2486R849K4754k855J0133K4771j6231j9769k0660
12311c6840j4492l777K919J1697K7493K479p785Q208J0423K9125K2212l945j3852
12298C3865j4725J4329J7490j159k1223j3675n925L008P341j0113J7790J1360
12286C8363L937J6783j2349l0557j0480K0877J1563p645j4316r730m375l2313
12274c0242j7728K937M1649L4795q565L955r356o682N879m6633j8971Q563J9971
12261b0428j2116J7163R79J4051q06j6067r432K1575j9398K523K1094M0351j7369
12248B2120l7166l1364K2529L4325j7143n241P007J5976J2454j6508k0645j519
$$ plain form
12236 -15175 4050 13806 8116 -17486 -15209 -605 15572 29640 17267 2294 -13292 -12557 -11399
12223 -11399 -38384 -613 5305 -13897 -13037 -25832 -48769 -17641 9667 10326 -19300 -14320 -9342
12210 -9342 11468 26943 26239 26105 4203 -6013 12829 7314 -17567 -12712 -2395 -5508 763
12197 763 6774 13881 18746 788 -21156 -40570 -21308 -4740 -25779 -43723 -23647 -47461 -79587
12184 -79587 -76436 -21701 -1087 -31503 -53220 -44754 -46678 -26885 -26704 -2439 33894 36755 18615
12171 18615 20705 5213 11794 -1439 -14798 -8882 -1242 29997 32256 6410 4993 748 10199
12158 10199 43323 41368 49581 46184 29542 12273 3413 18704 29101 14933 21171 -6032 -7519
12145 -7519 -2609 -14394 260 15831 -8524 -16900 -11701 -4189 18914 24346 28533 30056 3860
$$ packed form
12236a5175J9225R756n690k5602K277J4604J6177J4068j2373j4973j5586P35J158
12223a1399k6985L7771N918j9202Q60j2795k2937L1128K7308O59k9626M980M978
12210i342K0810J5475p04j34k1902j0216J8842n515k4881M855J0317l113O271
12197G63O011P107M865j7958k1944j9414J9262J6568k1039j7944K0076k3814l2126
12184g9587L151N4735K0614l0416k1717Q466j924J9793J81K4265L6333K861j8140
12171A8615K090j5492O581j3233j3359N916P640L1239K259k5846j417m245R451
12158A0199L3124j955Q213l397j6642j7269q860J5291J0397j4168O238k7203j487
12145g519M910j1785J4654J5571k4355q376N199P512K3103N432M187J523k6196
$$ plain form
12132 3860 -1357 -14204 -31179 -51431 -24822 -27369 -11314 9775 807 23068 13227 4262 3005
12119 3005 18285 1362 -2506 8157 -23485 -28703 -30938 -11172 19470 21866 -6125 -14431 -1479
12106 -1479 3770 8433 12244 15067 8543 -1829 -13193 -22704 -11339 27007 35854 13062 5123
12093 5123 19393 15539 15699 19880 33668 -3377 -10401 -26198 -21972 683 4794 24757 30330
12080 30330 12484 6397 4641 -18917 -46754 -39303 -22410 -16006 -19855 -21802 -2253 7026 3851
12067 3851 -31941 -12211 -7643 -23324 -48564 -22439 -26820 -32112 -28298 1993 -738 23733 12294
12054 12294 -8180 -4960 -22794 -28874 -43825 -52027 -31196 8889 8472 -34845 -48575 -16008 4918
12041 4918 2886 -35557 -39582 -16796 18873 -1313 -34881 -34073 -38880 -33140 -14629 -24862 -8972
$$ packed form
12132C860n217j2847j6975k0252K6609k547J6055K1089q968K2261r841q965j257
12119C005J5280j6923l868J0663l1642n218k235J9766L0642K396k7991q306J2952
12106a479N249M663L811K823o524j0372j1364r511J1365L8346Q847k2792p939
12093E123J4270l854J60M181J3788l7045p024j5797M226K2655M111J9963N573
12080C0330j7846o087j756k3558k7837P451J6893O404l849j947J9549R279l175
12067C851l5792J9730M568j5681k5240K6125m381n292L814L0291k731K4471j1439
12054A2294k0474L220j7834o080j4951q202K0831M0085m17m3317j3730L2567K0926
12041D918k032l8443m025K2786L5669k0186l3568Q08m807N740J8511j0233J5890
$$ plain form
12028 -8972 -25509 -19368 -1756 -1426 28636 45131 66998 39232 21200 35212 22794 -11897
12016 -11897 -28425 -19066 5297 10233 18053 -3292 -36496 -39268 -26276 -4181 13303 -3745
12004 -3745 -24386 -17219 -24489 -56299 -43706 -17619 18611 9774 -7469 -33937 -45204 -36432 1791
11991 1791 23047 4244 -17634 -17832 -25789 -38850 -43019 -52335 -56206 -54409 -29643 -37359 -22053
11978 -22053 1602 3169 -11882 -14643 -6579 -14981 -17621 -20012 -53981 -95435 -75086 -54550 -28376
11965 -28376 7314 1913 -20319 -19573 -595 -18281 -35996 1103 20219 11104 16884 6309 2233
11952 2233 13713 -6364 -31886 -16342 -6616 -4842 3518 -5777 -8333 -3551 -889 -1283 6046 23055
11938 23055 21101 11899 17018 16179 16571 -24080 -34747 -33465 -16353 -23388 -3690 14631 12599 6874
$$ packed form
12028h972j6537O141J7612L30L0062J6495K1867k7766j8032J4012j2418l4691
12016a1897j6528R359K4363M936P820k1345l3204k772J2992K2095J7484j7048
12004c745k0641P167p270l1810J2593K6087L6230q837j7243k6468j1267Q772L8223
11991A791K1256j8803k1878j98p957j3061m169r316l871J797K4766p716J5306
11978b2053K3655J567j5051k761Q064q402k640k391l3969m1454K0349K0536K6174
11965b8376L5690n401k2232P46J8978j7686j7715L7099J9116r115N780j0575m076
11952B233J1480k0077k5522J5544R726J774Q360r295k556M782K662l94P329J7009
11938B3055j954r202N119q39L92m0651j0667J282J7112p035J9698J8321k032n725
$$ plain form
11924 6874 6006 3733 14498 30793 12060 329 7969 8988 -13165 -29573 -23634 -13471 1943
11911 1943 6584 -13312 -19348 -1022 -12365 27395 29358 -13847 -13326 472 -6855 -6767 22725 24685
11897 24685 21164 18924 5279 -23785 -33679 -37894 -38194 -29888 -25508 -11315 8271 25071 19768
11884 19768 1823 -25705 -15582 -18514 -5426 2239 -13001 -2731 12213 19362 10186 -24047
11872 -24047 -19057 -22413 -26924 -39498 -19366 -1543 -4862 -10480 -11812 7800 -12543 -18556 -58063
11859 -58063 -72604 -72690 -30814 13974 23588 25311 17623 26596 39110 38531 25357 -9756 -31250
11846 -31250 -20039 -39194 -47083 -17189 9796 35695 39981 43038 31740 -13582 -38430 -31239
11834 -31239 -4557 -4286 9989 512 -14632 -25549 -19073 -16804 -29025 4554 33018 12176 -26067
$$ packed form
11924F874q68k273J0765J6295j8733j1731P640J019k2153j6408N939J0163J5414
11911A943M641j9896o036J8326j1343L9760J963m3205N21J3798p327Q8K9492J960
11897B4685l521k240j3645k9064r894m215l00Q306M380J4193J9586J6800n303
11884A9768j7945k7528J0123k932J3088P665j5240J0270J4944P149r176l4233
11872b4047M990l356m511j2574K0132J7823l319n618j332J9612k0343o013l9507
11859e8063j4541q6M1876M4788R614J723p688Q973J2514n79j3174l5113k1494
11846c1250J1211j9155p889K9894K6985K5899M286L057j1298m5322k4848P191
11834c1239K6682K71J4275r477j5144j0917O476K269j2221L3579K8464k0842l8243
$$ plain form
11821 -26067 -36426 -52500 -37711 -47402 -47556 -53750 -40974 16980 32243 39787 46675 4465 -30052
11808 -30052 -57576 -32530 -7139 -14743 -12319 5081 -2838 -32018 -30930 -22326 -15061 -3232 -4877
11795 -4877 -12489 9278 -12816 -13462 16484 31159 46067 38861 30055 2763 -22015 -12132 8460
11782 8460 42794 34074 10557 -2462 -29855 -16450 22558 28957 -3172 8724 15660 3121
11770 3121 38854 64146 38556 24454 -2184 -35066 -24442 -12103 3039 -11253 -17734 -1202
11758 -1202 25000 11416 26211 19439 -6164 -27359 -22147 -2661 -8954 -10240 -3944 5310 -21414
11745 -21414 -43714 -64964 -45307 -20206 -36244 -23722 11342 17473 20219 6206 34172 58244
11733 58244 51177 60039 45624 29725 3774 -18934 -15863 -5527 4654 33612 54005 47604
$$ packed form
11821b6067j0359j6074J4789r691j54o194J2776N7954J5263P544O888m2210l4517
11808c0052k7524K5046K5391p604K424J7400p919k9180J088Q604P265J1829j645
11795d877p612K1767k2094o46K9946J4675J4908p206q806k7292k4778R883K0592
11782H460L4334q720k3517j3019k7393J3405L9008O399l2129J1896O936j2539
11770C121L5733K5292k5590j4102k6638l2882J0624J2339J5142j4292o481J6532
11758a202K6202j3584J4795o772k5603k1195N212J9486o293j286O296R254k6724
11745b1414k2300k1250J9657K5101j6038J2522L5064O131K746j4013K7966K4072
11733E8244p067Q862j4415j5899k5951k2708L071J0336J0181K8958K0393o401
$$ plain form
11721 47604 25746 38084 34772 16572 9623 -15429 3940 21741 37241 69706 73555 109515
11709 109515 86119 45937 58147 26688 -833 -27987 -47387 -11434 -6930 -13981 -17864 12131
11697 12131 -3577 -16251 -23145 -27067 -36688 -28325 -14970 -31882 -21943 -3785 -23502 -33510 -14096
11684 -14096 -19070 -32482 -24989 -15327 3743 5411 9762 350 -28461 -40986 -37150 -9059 29411
11671 29411 25146 2516 -7638 11375 17749 8806 -8233 -13721 1404 20970 21781 25916 29690
11658 29690 28921 8247 8819 26671 54151 29402 31668 24834 6417 1337 -10485 -23376 -27577
11645 -27577 -47258 -33039 -34957 -33141 -17873 -6216 -9364 -9859 919 5979 21571 34133 27881
11632 27881 23184 60002 72542 53927 21593 27286 57661 72903 48176 -10426 -41047 -36705
$$ packed form
11721D7604k1858J2338l312j8200o949k5052J9369J7801J5500L2465L849L5960
11709A09515k3396m0182J2210l1459k7521k7154j9400L5953M504p051l883K9995
11697A2131j5708j2674o894l922r621Q363J3355j6912R939J8158j9717j0008J9414
11684a4096m974j3412P493R662J9070J668M351r412k8811j2525L836K8091L8470
11671B9411m265k2630j0154J9013O374q943j7039n488J5125J9566Q11M135L774
11658B9690p69k0674N72J7852K7480k4749K266o834j8417n080j1822j2891m201
11645b7577j9681J4219j918J816J5268J1657l148m95J0778N060J5592J2562o252
11632B7881m697L6818J2540j8615l2334N693L0375J5242k4727n8602l0621M342
$$ plain form
11620 -36705 -37397 -36542 -4616 16347 40704 23052 31838 28963 42398 28972 27590 39811 10065
11607 10065 -30573 -19968 -1353 16611 42970 44885 2211 -18796 -36650 -27330 -15481 12168
11595 12168 10685 30241 40918 56950 19708 -15658 -661 -2800 -8722 -26197 -29634 -14670
11583 -14670 1129 -10316 388 9386 -3857 -38417 -30318 3599 464 -15781 -2003 53405
11571 53405 57616 24619 -11486 -23459 -13670 -12834 -29233 -38999 -29485 -4906 27521 39898 24096
11558 24096 5083 -17028 -28626 7828 57423 32457 5945 -25167 -44114 -23688 -4648 -553
11546 -553 2163 -2315 15695 31415 1087 3884 31973 42066 28740 23399 51627 57348 36395
11533 36395 58827 62251 65116 70109 47722 21485 17527 22882 31202 87702 114530 123620 114058
$$ packed form
11620c6705o92Q55L1926K0963K4357j7652Q786k875J3435j3426j382J2221k9746
11607A0065m0638J0605J8615J7964K6359J915m2674k1007j7854R320J1849K7649
11595A2168j483J9556J0677J6032l7242l5366J4997k139n922j7475l437J4964
11583a4670J5799j1445J0704Q998j3243l4560Q099L3917l135j6245J3778N5408
11571E3405M211l2997l6105j1973R789Q36j6399r766R514K4579L2427J2377j5802
11558B4096j9013k2111j1598L6454M9595k4966k6512l1112j8947K0426J9040M095
11546e53K716m478J8010J5720l0328K797K8089J0093j3326n341K8228N721k0953
11533C6395K2432L424K865M993k2387k6237l958N355Q320N6500K6828R090r562
$$ plain form
11520 114058 125849 126199 127569 126890 96439 84576 62886 60360 91545 95561 98550 80978 52921
11507 52921 53971 33466 32428 6969 7579 26806 12406 22283 28330 28174 7319 3244 -8375
11494 -8375 -2606 -1876 -1840 16725 -499 11091 24840 54138 43066 41497 33440 38601 7108 1161
11480 1161 20002 37860 27361 29173 14958 14908 16855 7623 -9823 -26419 -31168 -52645 -36388
11467 -36388 -28314 -13858 -25562 8135 37966 11946 -13343 -23433 -18732 -30753 -40081 -42708
11455 -42708 -27965 -25929 -19765 -12367 -1535 6147 49289 49368 37168 63831 51444 19830 13541
11442 13541 -6829 -19886 17292 33170 23223 -6248 -3533 -14570 -18681 -26929 11886 43135
11430 43135 23987 3589 7058 -4018 -33698 -45639 -29263 -24113 -41121 -54752 -31741 -25948
$$ packed form
11520A14058J1791L50J370o79l0451j1863k1690k526L1185M016K989j7572k8057
11507E2921J050k0505j038k5459O10J9227j4400R877O047j56k0855m075j1619
11494h375N769P30L6J8565j7224J1590J3749K9298j1072j569q057N161l1493n947
11480A161J8841J7858j0499J812j4215n0J947r232j7446j6596m749k1477J6257
11467c6388Q074J4456j1704L3697K9831k6020k5289j0090M701j2021r328k627
11455d2708J4743K036O164P398J0832P682M3142P9j2200K6663j2387l1614o289
11442A3541k0370j3057L7178J5878r947k9471K715j1037m111q248L8815L1249
11430D3135j9148k0398L469j1076k9680j1941J6376N150j7008j3631K3011N793
$$ plain form
11418 -25948 -17939 -12577 5878 -8176 4017 13752 19330 24304 31982 8424 -699 8667 19586
11405 19586 35388 44551 62828 112400 147049 127716 91471 96537 103140 84501 64674 30216
11393 30216 -25329 -48799 -65748 -57770 -16708 24180 23979 30057 44445 40162 37273 32536 38401
11380 38401 35102 42718 47998 78698 78221 73946 81547 114295 126589 145658 131248 119998 84474
11367 84474 47050 52245 45601 25177 27233 26265 -7555 -7711 3357 -2897 5779 8921 15307 21207
11353 21207 17161 3518 -7690 5559 -19511 5463 18464 8279 -7570 -6314 -13411 -11664
11341 -11664 -9042 25003 48753 40961 23048 -7369 15383 25928 -6056 -22450 -11802 -6972
11329 -6972 10545 8378 18250 28985 27527 10038 1972 -13775 -23024 -21662 -22650 -17958 -29349 -56019
$$ packed form
11418b5948Q009N362J8455j4054J2193R735N578M974P678k3558r123R366J0919
11405A9586J5802R163J8277M9572L4649j9333l6245N066O603j8639j9827l4458
11393C0216n5545k3470j6949P978M1062M0888k01O078J4388m283k889m737N865
11380C8401l299P616N280L0700m77m275P601L2748J2294J9069j4410j1250l5524
11367H4474l7424N195o644k0424K056r68l3820j56J1068o254Q676L142O386N900
11353B1207m046j3643j1208J3249k5070K4974J3001j0185j5849J256p097J747
11341a1664K622L4045K3750p792j7913l0417K2752J0545l1984j6394J0648M830
11329f972J7517k167R872J0735j458j7489q066j5747r249J362r88M692j1391k6670
$$ plain form
11315 -56019 -63967 -50943 -25935 -6684 -11432 -4523 -9663 -7419 2306 -16162 -3003 17833 -5195
11302 -5195 -2316 5266 20255 176 -8943 1001 -20439 -20725 -11869 -3963 -4059 -8297 -15422 -16220 -24411
11287 -24411 -48916 -32820 -5243 -6273 15634 35469 12413 11850 44195 72707 24887 14667
11275 14667 37144 28845 25335 46062 49804 18837 1258 3873 -17839 -16579 -11327 405 9426
11262 9426 34499 29004 7196 15922 20193 22709 10741 45801 51489 35407 26131 58007 92762
11249 92762 112002 105141 125893 125058 123854 100341 73019 46980 51111 33081 30204 50399 25793
11236 25793 15908 14927 4957 5676 -2614 4467 7249 15267 -2710 -6792 214 -1339 14234 23474
11222 23474 25340 35196 28738 33165 37287 7258 -17227 -31606 -9494 21493 38719 34955 22752
$$ packed form
11315e6019p948J3024K5008J9251m748O909n140K244R725j8468J3159K0836k3028
11302e195K879P582J4989k0079r119R944k1440k86Q856P906r6m238p125p98q191
11287b4411k4505J6096K7577j030K1907J9835k3056n63L2345K8512m7820j0220
11275A4667K2477q299l510K0727L742l0967j7579K615k1712J260N252J1732R021
11262I426K5073n495k1808Q726M271K516j1968L5060N688j6082r276L1876L4755
11249I2762J9240o861K0752q35j204k3513k7322k6039M131j8030k877K0195k4606
11236B5793r885r81r970P19q290P081K782Q018j7977m082P006j553J5573R240
11222B3474J866R856o458M427M122l0029k4485j4379K2112L0987J7226l764j2203
$$ plain form
11209 22752 21766 36033 19723 -7934 2710 22362 12009 6256 10853 31468 34322 16961 -15492
11196 -15492 -31514 -39240 4488 29389 52705 50508 42813 36464 34149 24174 23183 9342 -7692
11183 -7692 5991 -12719 358 5832 5713 15436 21614 22546 19178 5805 -1402 9672 -5991 -9851
11169 -9851 -19673 -17119 -7685 -3508 1619 6911 -554 2018 15281 7149 -6358 -15271 -26569 -29512
11155 -29512 15053 36034 8056 -5878 -26733 -54782 -49537 -44451 -44932 -18918 -9595 -1940 -3502
11142 -3502 -5403 3574 -3733 -11531 5352 22478 20265 9394 41511 41307 41110 40432 23127 -2003
11128 -2003 -15045 6550 54786 53941 29611 -6363 2750 -5334 -11803 13896 36759 35488 55382
11115 55382 68328 46751 41679 14254 21760 79270 67515 31217 47947 36670 18976 22297
$$ packed form
11209B2752r86J4267j6310k7657J0644J9652j0353n753M597K0615K854j7361l2453
11196a5492j6022p726M3728K4901K3316k197p695o349k315r975r91j3841j7034
11183g692J3683j8710J3077N474j19R723O178R32l368j3373p207J1074j5663l860
11169i851r822K554R434M177N127N292p465K572J3263q132j3507q913j1298k943
11155b9512M4565K0981k7978j3934k0855k8049N245N086m81K6014R323P655j562
11142c502j901Q977p307p798J6883J7126k213j0871L2117k04j97o78j7305k5130
11128b003j3042K1595M8236q45k4330l5974R113q084o469K5699K2863j271J9894
11115E5382J2946k1577n072k7425P506N7510j1755l6298J6730j1277j7694L321
$$ plain form
11103 22297 46391 92567 107935 82765 47023 46164 12283 -18721 -1847 12040 7828 -1456
11091 -1456 10722 32345 65241 54408 43359 26755 9199 -7490 -15776 -40658 -48029 -33391
11079 -33391 990 18226 -12948 -32262 -28210 -31129 -22357 2938 12275 17019 8473 22231 15740
11066 15740 9734 -8696 -4658 10662 40254 27603 -7383 1611 49352 50861 25097 30807 41198
11053 41198 49680 39182 2753 -22062 -38798 1100 28959 27493 17052 38397 52619 53019
11041 53019 21190 2057 10447 25562 4205 -14593 -3927 6832 -39644 -63311 -45928 -22404
11029 -22404 19437 11299 8295 3376 18648 23779 7903 -15397 -5984 -28638 -33089 13282 33229
11016 33229 1333 15476 35242 9957 -16550 -1666 8423 26423 29401 56316 87186 80933
$$ packed form
11103B2297K4094M6176J5368k5170l5742q59l3881l1004J6874J3887m212r284
11091a456J2178K1623L2896j0833j1049j6604j7556j6689q286k4882p371J4638
11079c3391L4381J7236l1174j9314M052k919Q772K5295R337M744q546J3758o491
11066A5740o006j8430M038J5320K9592j2651l4986Q994M7741J509k5764N710J0391
11053D1198Q482j0498l6429k4815j6736L9898K7859j466j0441K1345J4222M00
11041E3019l1829j9133Q390J5115k1357j8798J0666J0759m6476k3667J7383K3524
11029b2404M1841q138l004m919J5272N131j5876k3300R413k2654m451M6371J9947
11016C3229l1896J4143J9766k5285k6507J4884J0089J8000K978K6915L0870o253
$$ plain form
11004 80933 55291 36224 47912 66345 59353 38780 56429 58740 57836 63388 48500 39733 36432
10991 36432 24722 20415 20485 18571 21070 17904 19147 8033 1810 -3936 -14301 -12317 -4118 -13327
10977 -13327 -17264 -13438 -3267 19856 29273 31310 47317 34096 24085 3652 -22290 10991
10965 10991 10700 581 -12100 -22571 -27809 -44652 -9927 15700 23669 38251 23829 15556 -4240
10952 -4240 21434 31783 9625 4349 36492 59973 60265 66470 46450 47104 59826 78918 76536
10939 76536 69137 65481 104252 178646 219066 269414 329176 401503 530171 719378 902149
10928 902149 1053584 1209103 1336313 1417491 1422936 1354270 1229680 1083973 903284 729891
10918 729891 575444 428139 337424 252944 182276 136383 111670 86181 60540 71541 95126
$$ packed form
11004H0933k5642j9067J1688J8433o992k0573J7649K311r04N552j4888q767l301
10991C6432j1710m307P0j914K499l166J243j1114o223n746j0365J984Q199r209
10977a3327l937L826J0171K3123R417K037J6007j3221j0011k0433k5942L3281
10965A0991k91j0119j2681j0471n238j6843L4725K5627P969J4582j4422q273j9796
10952d240K5674J0349k2158n276L2143K3481K92O205k0020O54J2722J9092k382
10939G6536p399l656L8771P4394M0420N0348N9762P2327J28668J89207J82771
10928I02149J51435J55519J27210Q1178N445o8666j24590j45707j80689j73393
10918G29891j54447j47305r0715q4480p0668m5893k4713k5489k5641J1001K3585
$$ plain form
10907 95126 105653 97223 64357 37259 34533 63643 55964 44435 66864 68928 70999 74559 65088
10894 65088 84132 93764 100328 67511 33182 29280 35992 37443 53065 60551 36937 18567 24586
10881 24586 51208 73658 74916 70163 32943 16857 34489 64005 47494 46183 52325 48807 55144
10868 55144 77078 68420 42853 41201 83895 98113 115361 124184 99683 65906 9974 15268
10856 15268 50005 47713 62237 77265 99063 82947 70355 63758 47315 83693 96176 95895
10844 95895 69441 60641 66262 84630 76629 54678 45852 71784 75963 57817 46805 47548 37379
10831 37379 42853 68417 71904 50900 75593 100523 84729 63569 46788 59176 57592 40753
10819 40753 29430 26806 7932 25485 33147 38556 55766 46639 19928 -13545 -15034 -17347 -13774
$$ packed form
10907I5126J0527q430l2866k7098k726K9110p679j1529K2429K064K071L560r471
10894F5088J9044R632O564l2817l4329l902O712J451J5622P486k3614j8370O019
10881B4586K6622K2450J258m753l7220j6086J7632K9516j6511j311O142l518O337
10868E5144K1934q658k5567j652M2694J4218J7248Q823k4501l3777n5932N294
10856A5268L4737k292J4524J5028K1798j6116j2592o597j6443L6378J2483k81
10844I5895k6454q800N621J8368q001k1951q826K5932M179j8146j1012P43j0169
10831C7379N474K5564L487k1004K4693K4930j5794k1160j6781J2388j584j6839
10819D0753j1323k624j8874J7553P662N409J7210r127k6711l3473j489k313L573
$$ plain form
10806 -13774 -37077 -46168 -53641 -29518 4538 20045 16254 -273 14101 26652 15773 17166
10794 17166 23400 44068 44548 32450 29571 48912 37274 37386 88475 118718 103104 99038 132412
10781 132412 158478 149263 144953 161721 197966 223203 233048 236983 224406 162902 143894 129086
10769 129086 95667 68653 76086 71343 49356 46658 28652 19053 26126 -961 -25382 -23262 -27307
10756 -27307 -22109 -29489 -47545 -59710 -71265 -77147 -67946 -45551 -42591 -41770 -35175 -50905 -83873
10743 -83873 -98700 -88799 -76361 -54564 -36999 -46915 -55108 -63828 -64497 -59073 -72666 -74337 -87223
10730 -87223 -79142 -81304 -81502 -94094 -122126 -164121 -201136 -250136 -256543 -260902 -243443 -198468 -151941
10717 -151941 -89284 -11394 85633 192758 299203 417601 486162 503594 494309 473280 439162
$$ packed form
10806a3774k3303r091p473K4123L4056J5507l791j6527J4374J2551j0879J393
10794A7166O234K0668M80j2098k879J9341j1638J12N1089L0243j5614m066L3374
10781A32412K6066r215m310J6768L6245K5237R845L935j2577o1504j9008j4808
10769A29086l3419k7014P433m743k1987k698j8006r599P073k7087k4421K120m045
10756b7307N198p380j8056j2165j1555n882R201K2395K960Q21O595j5730l2968
10743h3873j4827R901J2438K1797J7565r916q193q720o69N424j3593j671j2886
10730h7223Q081k162j98j2592k8032m1995l7015m9000o407m359J7459M4975M6527
10717a51941O2657P7890R7027J07125J06445J18398O8561J7432r285k1029l4118
$$ plain form
10706 439162 415279 420755 385472 350583 343131 330786 332987 357847 372443 372905 353303 349318 343937
10693 343937 318325 297725 279364 259011 260630 255074 228158 221407 218586 226541 205487 196946 187565
10680 187565 218204 199863 188363 206411 184039 187499 207649 215490 219230 207496 223869 195565
10668 195565 175116 187004 225688 258851 326957 355150 378480 417858 477336 569388 680711
10657 680711 796381 894220 999278 1083903 1148395 1204727 1201686 1181648 1150845 1067211 983564
10646 983564 885375 807136 741438 660150 620999 577776 529431 484415 437996 378884 333560
10635 333560 335203 307030 292863 294397 271103 270499 299061 322046 352770 378176 438493 522233
10623 522233 603203 685715 741241 754211 763128 783612 820226 830652 759585 699292 639266 589162
$$ packed form
10706D39162k3883N476l5283l4889p452j2345K201K4860J4596M62j9602l985n381
10693C43937k5612k0600j8361k0353J619n556k6916o751k821P955k1054q541r381
10680A87565L0639j8341j1500J8048k2372L460K0150P841L740j1734J6373k8304
10668A95565k0449J1888L8684L3163O8106K8193K3330L9378N9478R2052J11323
10657F80711J15670R7839J05058Q4625O4492N6332l041k0038l0803q3634q3647
10646I83564r8189p8239o5698q1288l9151m3223m8345m5016m6419n9112m5324
10635C33560J643k8173j4167J534k3294o04K8562K2985L0724K5406O0317Q3740
10623E22233Q0970Q2512N5526J2970Q917K0484L6614J0426p1067o0293o0026n0104
$$ plain form
10611 589162 529706 493340 474193 452645 454300 514824 551641 560234 529278 498832 504093 526035
10599 526035 541847 522458 472922 470633 476021 477695 459660 470722 490549 525274 561414 582617
10587 582617 600477 619720 654707 668151 663725 677410 699465 738686 766860 793309 808183 854541
10575 854541 933886 1004890 1075928 1156643 1226256 1275631 1279558 1324057 1348891 1369951 1427219 1486342
10563 1486342 1543337 1602255 1652431 1752351 1851183 1936679 2008647 2086305 2191173 2310763 2450480
10552 2450480 2615919 2826165 3100820 3465131 3970950 4619277 5414963 6372877 7480941
10543 7480941 8738293 10009216 11267463 12541493 13806351 15095344 16421109 18000725
10535 18000725 19921709 22478158 26173122 31654614 39954506 52922050 73151988 102312030
$$ packed form
10611E89162n9456l6366j9147k1548J655O0524L6817Q593l0956l0446N261K1942
10599E26035J5812j9389m9536k289N388J674j8035J1062J9827L4725L6140K1203
10587E82617J7860J9243L4987J3444m426J3685K2055L9221K8174K6449J4874M6358
10575H54541P9345P1004P1038Q0715O9613M9375L927M4499K4834K1060N7268N9123
10563A486342N6995N8918N0176R9920R8832Q5496P1968P7658J04868J19590J39717
10552B450480J65439K10246K74655L64311N05819O48327P95686R57914J108064
10543G480941J257352J270923J258247J274030J264858J288993J325765J579616
10535A8000725J920984K556449L694964N481492Q299892J2967544K0229938K9160042
$$ plain form
10527 102312030 136848020 169275274 199913907 233340784 262918851 274338409 267807512
10520 267807512 252894674 231827083 202313657 167544807 133175983 102407705 77319177
10513 77319177 58562184 45262593 35931686 29328098 24615837 21272037 18817533 16922661
10505 16922661 15368762 14061466 12876662 11755407 10681294 9688795 8807268 8020707
10497 8020707 7313755 6727527 6248919 5901673 5599666 5383064 5219763 5073064 4956526
10488 4956526 4807446 4573700 4317679 4036029 3731899 3415348 3125701 2832747 2568871
10479 2568871 2329501 2132348 1963544 1800755 1682734 1588030 1514343 1439318 1373074 1309682
10469 1309682 1260486 1232286 1185184 1151640 1122705 1101911 1066845 1008974 948858 904566 857941
$$ packed form
10527A02312030L4535990L2427254L0638633L3426877K9578067J1419558o530897
10520B67807512j4912838k1067591k9513426l4768850l4368824l0768278k5088528
10513G7319177j8756993j3299591r330907o603588m712261l343800k454504j894872
10505A6922661j553899j307296j184804j121255j074113r92499q81527p86561
10497H020707p06952n86228m78608l47246l02007k16602j63301j46699j16538
10488D956526j49080k33746k56021k81650l04130l16551k89647k92954k63876
10479B568871k39370j97153j68804j62789j18021r4704p3687p5025o6244o3392
10469A309682m9196k8200m7102l3544k8935k0794l5066n7871o0116m4292m6625
$$ plain form
10458 857941 818997 779662 769321 777579 778103 779517 763520 753859 711249 693655 688794 686280 675162
10445 675162 653813 676962 697774 678338 666531 654502 656954 650429 613813 584209 562608 564126
10433 564126 523487 517840 506302 481145 484718 469686 421222 415772 424612 415880 417349 395571 424877
10420 424877 425491 442315 433792 429443 413458 388290 392253 433062 438107 381372 385475 388887 384371
10407 384371 362868 340545 329003 350796 393874 421508 470113 503405 535845 539383 533576 496846
10395 496846 464614 462885 447008 396126 353231 317398 292041 275816 217960 160775 143423 156270
10383 156270 172034 172206 192536 209644 228946 233762 209019 202028 201989 194677 191958 189442 191838 192332
10369 192332 184092 178561 152631 134618 136696 120505 124788 128498 127006 89355 72154 85149 119841
$$ packed form
10458H57941l8944l9335j0341Q258N24J414j5997r661m2610j7594m861k514j1118
10445F75162k1349K3149K0812j9436j1807j2029K452o525l6616k9604k1601J518
10433E64126m0639n647j1538k5157L573j5032m8464n450Q840q732J469k1778K9306
10420D24877O14J6824q523m349j5985k5168L963M0809N045n6735M103L412m516
10407C84371k1503k2323j1542K1793M3078K7634M8605L3292L2440L538n807l6730
10395D96846l2232j729j5877n0882m2895l5833k5357j6225n7856n7185j7352J2847
10383A56270J5764J72K0330J7108J9302M816k4743o991l9p312k719k516K396M94
10369A92332q240n531k5930j8013K078j6191M283L710j492l7651j7201J2995L4692
$$ plain form
10356 119841 112556 102011 92093 63242 68686 50521 29919 31962 3160 -30176 -36095 -63757
10344 -63757 -65576 -52610 -56893 -29400 -33451 -62747 -105871 -138728 -189522 -198221 -193083 -194583 -203517
10331 -203517 -142919 -33598 63408 149283 259205 346507 384014 420575 435584 429751 390936
10320 390936 365936 348940 329034 319600 293202 311136 312699 324530 326275 335895 363182 344343
10308 344343 307976 263143 249050 274965 288698 333691 365880 378054 412022 409168 396211 381445
10296 381445 421533 481453 475931 497284 552458 643202 738661 859215 1080714 1466375 2024655
10285 2024655 2664945 3236682 3762891 4383201 4979492 5201633 5049947 4762630 4365755
10276 4365755 3840409 3186557 2560201 2012225 1574365 1236300 993079 854193 733165
$$ packed form
10356A19841p285j0545r918k8851N444j8165k0602K043k8802l3336n919k7662
10344f3757j819J2966m283K7493m051k9296m3124l2857n0794q699N138j500q934
10331b03517O0598J09321R7006Q5875J09922Q7302L7507L6561J5009n833l8815
10320C90936k5000j6996j9906r434k6398J7934J563J1831J745R620K7287j8839
10308C44343l6367m4833j4093K5915J3733M4993L2189J2174L3968k854j2957j4766
10296C81445M0088N9920n522K1353N5174R0744R5459J20554K21499L85661N58280
10285B024655O40290N71737N26209O20310N96291K22141j51686k87317l96875
10276D365755n25346o53852o26356n47976m37860l38065k43221j38886j21028
$$ plain form
10267 733165 624000 567082 522798 461698 416780 432033 422243 358858 338926 356392 329296
10256 329296 282459 267293 279689 280315 255806 237144 253206 245803 203973 169365 159629 183636
10244 183636 195525 245041 279656 271458 285605 285773 253318 247564 256386 223455 189927 185182 149338
10231 149338 146883 165938 147341 132841 140924 159287 182250 173409 143503 132171 121142 117718
10219 117718 104879 78663 90045 114709 127186 120820 94415 102760 95647 101996 128793 148819
10207 148819 131253 137749 148732 175065 185690 136307 116806 124035 128231 136656 139693 124997
10195 124997 126522 147412 153200 157473 156332 159946 183996 210402 199253 207957 233329 226980 224098
10182 224098 234741 263147 303718 332679 376189 466835 577515 682545 754709 750156 703746
$$ packed form
10267G33165j09165n6918m4284o1100m4918J5253r790o3385j9932J7466k7096
10256C29296m6837j5166J2396O26k4509j8662J6062p403m1830l4608r736K4007
10244A83636J1889M9516L4615q198J4147J68l2455n754Q822l2931l3528m745l5844
10231A49338k455J9055j8597j4500Q083J8363K2963q841k9906j1332j1029l424
10219A17718j2839k6216J1382K4664J2477o366k6405Q345p113O349K6797K0026
10207A48819j7566O496J0983K6333J0625m9383j9501P229M196Q425L037j4696
10195A24997J525K0890N788M273j141L614K4050K6406j1149Q704K5372o349k882
10182B24098J0643K8406M0571K8961M3510R0646J10680J05030P2164m553m6410
$$ plain form
10171 703746 604163 519167 448197 383111 348615 286461 263906 212252 171429 166501 173160 174857
10159 174857 176211 165470 126159 104845 108543 128455 169407 162724 148480 138542 127754 119889
10147 119889 120874 105033 109812 121241 152362 166580 161484 184211 161350 148452 139536 149355 172463
10134 172463 144332 141443 179090 211923 209255 198542 211376 221931 238161 271014 289819 326789
10122 326789 392319 496854 612333 759938 920769 1076324 1238496 1386581 1494299 1518964
10112 1518964 1470585 1368944 1244431 1092201 887675 714539 567238 442457 362698 298786
10102 298786 293027 293665 278872 254707 252291 244720 249238 276501 278916 263930 246605 242233 261968
10089 261968 240871 245383 260779 252845 257975 244790 232800 211731 204263 213453 227853 252414
$$ packed form
10171G03746r9583q4996p0970o5086l4496o2154k2555n1654m0823m928O659J697
10159A74857J354j0741l9311k1314L698J9912M0952o683j4244r938j0788p865
10147A19889R85j5841M779J1429L1121J4218n096K2727k2861j2898q916R819K3108
10134A72463k8131k889L7647L2833k668j0713J2834J0555J6230L2853J8805L6970
10122C26789O5530J04535J15479J47605J60831J55555J62172J48085J07718K4665
10112A518964m8379j01641j24513j52230k04526j73136j47301j24781p9759o3912
10102B98786n759O38j4793k4165k416p571M518K7263K415j4986j7325m372J9735
10089B61968k1097M512J5396p934N130j3185j1990k1069p468R190J4400K4561
$$ plain form
10077 252414 281544 285448 357662 467247 542937 578055 604954 643711 639132 589230 515597 414517
10065 414517 327354 289070 273341 239067 184272 179697 162549 196759 198014 163767 117760 114060
10053 114060 118219 114087 95833 57363 57613 95600 146576 140951 109079 91034 75427 71774 87139
10040 87139 106826 125377 165433 167115 142593 127878 147167 150575 119686 101013 99363 97920
10028 97920 97483 77684 84890 104846 98141 104764 109111 103432 105581 112744 119140 120966 124796 138344
10014 138344 139772 116080 116166 97396 80252 79072 104356 105042 75465 60948 54684 55049 86245
10001 86245 94165 103644 109171 92837 90793 111676 124097 110888 109580 120312 120118 113284 93947
9988 93947 86579 95880 107669 110172 90284 99317 120810 109869 112857 124063 115907 106786 118805
$$ packed form
10077B52414K9130L904P2214J09585P5690L5118K6899L8757m579m9902p3633j01080
10065D14517q7163l8284j5729l4274n4795m575j7148L4210J255l4247m6007l700
10053A14060M159m132j8254l8470K50L7987N0976n625l1872j8045j5607l653J5365
10040H7139J9687J8551M0056J682k4522j4715J9289L408l0889j8673j650j443
10028I7920m37j9799P206J9956o705O623M347n679K149P163O396J826L830J3548
10014A38344J428k3692Q6j8770j7144j180K5284O86k9577j4517o264L65L1196
10001H6245P920R479N527j6334k044K0883J2421j3209j308J0732j94o834j9337
9988I3947p368R301J1789K503j9888R033K1493j0941K988J1206q156r121J2019
$$ plain form
9975 118805 113032 129239 138550 130527 124854 131229 120964 132330 127995 129247 125866 139370 161527
9962 161527 212105 222123 187178 153228 153488 148334 125768 136828 154355 179357 192069 171434
9950 171434 163495 148743 160299 156853 126327 127757 119646 108145 133221 131953 111962 96446 112452
9937 112452 149821 135194 121126 114094 103225 125976 162628 157097 125926 113593 118425 131066
9925 131066 123527 102463 95562 100475 101769 108298 91130 92882 122353 131103 114348 75403 80049
9912 80049 93985 96464 110882 134931 161983 144740 114470 70935 80775 104238 97217 94868 109094
9899 109094 132425 166460 175731 185807 161557 131440 128753 124727 136252 156191 131608 94697
9887 94697 94135 78652 91985 93775 97448 111463 105639 81969 75300 91632 113856 129186 140209
$$ packed form
9975A18805n773J6207R311q023n673O375j0265J1366m335J252l381J3504K2157
9962A61527N0578J0018l4945l3950K60n154k2566J1060J7527K5002J2712k0635
9950A71434p939j4752J1556l446l0526J430q111j1501K5076j268j9991j5516J6006
9937A12452L7369j4627j4068p032j0869K2751L6652n531l1171j2333M832J2641
9925A31066p539k1064o901M913J294O529j7168J752K9471Q750j6755l8945M646
9912H0049J3936K479J4418K4049K7052j7243l0270m3535R840K3463p021k349J4226
9899A09094K3331L4035R271J0076k4250l0117k687m026J1525J9939k4583l6911
9887I4697n62j5483J3333J790L673J4015n824k3670o669J6332K2224J5330J1023
$$ plain form
9874 140209 148222 149029 139196 139511 162368 215387 223861 214084 231393 231548 235076 242228 239162 263272
9860 263272 232727 195777 178966 143153 136664 164622 180945 186557 216427 202484 210155 211411
9848 211411 202314 223509 223423 233329 259584 283750 326113 415085 530157 669837 830588 984156
9836 984156 1152428 1311207 1436169 1444673 1402413 1351504 1238430 1060248 907819 805509
9826 805509 674247 546052 441713 370316 314830 251477 218055 188903 214395 232294 235350
9815 235350 206325 173529 162879 144301 103736 112109 160509 162617 156763 141387 146246 117769
9803 117769 115737 120761 111880 111979 123035 151438 171890 151668 130963 161699 163331 160317 179721
9790 179721 186336 172989 160640 149910 124733 136589 140657 146039 136345 154563 180194 155983
$$ packed form
9874A40209Q013Q07r833L15K2857N3019Q474r777J7309J55L528P152l066K4110
9860B63272l0545l6950j6811l5813o489K7958J6323N612K9870j3943P671J256
9848B11411r097K1195q6R906K6255K4166M2363Q8972J15072J39680J60751J53568
9836I84156J68272J58779J24962Q504m2260n0909j13074j78182j52429j02310
9826H05509j31262j28195j04339p1397n5486o3353l3422k9152K5492J7899L056
9815B35350k9025l2796j0650j8578m0565Q373M8400K108n854j5376M859k8477
9803A17769k032N024q881R9J1056K8403K0452k0222k0705L0736J632l014J9404
9790A79721O615j3347j2349j0730k5177J1856M068N382r694J8218K5631k4211
$$ plain form
9778 155983 135700 129042 134573 131307 138004 133696 124024 116677 125827 145425 142448 142189 129430 129782
9764 129782 112264 93998 91293 114207 100892 94201 74834 49348 61954 81211 77819 64466
9752 64466 103547 98750 103362 108130 81293 77033 89001 96968 104977 126849 152200 138901 149377
9739 149377 176157 183411 177389 151617 147664 120565 121264 133903 172717 168760 141553 139663 127469
9726 127469 113729 136533 128798 123685 114823 146077 154008 135727 131524 146828 162497 156673 130826
9713 130826 127828 142117 143027 142427 144434 165541 188964 161346 163351 155933 119639 113267 96353
9700 96353 98967 128973 163577 144506 131530 173584 198777 207046 204305 177552 163124 143821
9688 143821 164850 168003 175493 181787 228138 242582 225232 197548 158005 152487 162548 173485
$$ packed form
9778A55983k0283o658N531l266O697m308r672p347R150J9598k977k59j2759L52
9764A29782j7518j8266k705K2914j3315o691j9367k5486J2606J9257l392j3353
9752F4466L9081m797M612M768k6837m260J1968P967Q009K1872K5351j3299J0476
9739A49377K6780P254o022k5772l953k7099O99J2639L8814l957k7207j890j2194
9726A27469j3740K2804p735n113q862L1254P931j8281m203J5304J5669n824k5847
9713A30826k998J4289R10o00K007K1107K3423k7618K005p418l6294o372j6914
9700I6353K614L0006L4604j9071j2976M2054K5193Q269k741k6753j4428j9303
9688A43821K1029L153P490O294M6351J4444j7350k7684l9543n518J0061J0937
$$ plain form
9676 173485 180636 189956 192001 167388 150742 157524 159819 158393 205053 214178 240603 254074 228084
9663 228084 221125 229638 224596 227174 191476 173338 164254 177710 166671 176759 174303 154910 141898
9650 141898 175373 174113 137607 131053 155376 167970 150617 166454 168399 153914 168846 166262
9638 166262 154249 177873 179650 171170 212525 241654 254746 271347 270246 273070 270532 249354 240153
9625 240153 242059 222155 207277 219048 219570 215532 196882 168689 161481 190371 206785 208399 217001
9612 217001 227924 225804 223741 229439 216023 229309 220032 217780 212867 188300 176175 165389 167256
9599 167256 179847 175811 197468 190989 188679 188459 176959 193767 187601 183307 187627 185097 189015 217430
9585 217430 232485 203631 204471 205904 208196 205081 221779 223003 206476 210492 203168 183612 168984
$$ packed form
9676A73485P151R320K045k4613j6646O782K295j426M6660R125K6425J3471k5990
9663B28084o959Q513n042K578l5698j8138r084J3456j1039J0088k456j9393j3012
9650A41898L3475j260l6506o554K4323J2594j7353J5837J945j4485J4932k584
9638A66262j2013K3624J777q480M1355K9129J3092J6601j101K824k538k1178r201
9625B40153J906j9904j4878J1771N22m038j8650k8193p208K8890J6414J614Q602
9612B17001J0923k120k063N698j3416J3286r277k252m913k4567j2125j0786J867
9599A67256J2591m036K1657o479k310k20j1500J6808o166m294M320k530L918K8415
9585B17430J5055k8854Q40J433K292l115J6698J224j6527M016p324j9556j4628
$$ plain form
9572 168984 161542 178035 182400 210597 210338 256076 250068 212070 194724 210478 235164 264859 277107
9559 277107 258959 226060 221447 225121 209568 176399 186413 204433 197239 172429 184151 202018
9547 202018 209806 195651 188011 211677 212674 201803 212602 234026 226163 192243 194776 214116 247032
9534 247032 246995 236103 245686 255891 234835 199775 187367 225612 235245 227690 242767 246956 256238
9521 256238 319402 311833 280618 272230 282103 281694 252844 234642 249007 239178 232638 232982 261081
9508 261081 249922 240260 261802 272957 263746 252956 255612 240586 250284 290118 290106 254432 240499
9495 240499 230606 244213 251304 233555 264065 280842 303529 276209 243187 266784 292981 298520
9483 298520 283374 289508 290522 299136 309369 308774 293224 278500 286656 274827 283876 273481 286154
$$ packed form
9572A68984p442J6493M365K8197k59M5738o008l7998j7346J5754K4686K9695J2248
9559B77107j8148l2899m613L674j5553l3169J0014J8020p194k4810J1722J7867
9547B02018P788j4155p640K3666R97j0871J0799K1424p863l3920K533J9340L2916
9534B47032l7j0892R583J0205k1056l5060j2408L8245R633p555J5077M189R282
9521B56238O3164p569l1215q388R873m09k8850j8202J4365r829o540L44K8099
9508B61081j1159r662K1542J1155r211j0790K656j5026R698L9834j2l5674j3933
9495B40499r893J3607P091j7749L0510J6777K2687k7320l3022K3597K6197N539
9483B98520j5146O134J014Q614J0233n95j5550j4724Q156j1829R049j0395J2673
$$ plain form
9470 286154 300875 308186 325169 365226 358833 315595 308405 308124 336941 337357 319129 300590 269956
9457 269956 250420 257484 283031 312974 310981 306425 297874 301145 307277 337770 360093 351669 350689
9444 350689 366310 376025 365085 337701 349132 337254 321223 306409 307006 276149 307658 342802
9432 342802 326814 343497 351911 351614 337361 337610 355506 344219 345696 366296 356704 352964 372757
9419 372757 353744 336553 328915 339565 357661 386848 385048 355768 343705 364072 374201 383235
9407 383235 409580 398826 409867 419499 403020 422049 414691 391698 378958 398308 427933 409084
9395 409084 402078 426284 406005 392564 364155 354237 380103 381799 370318 390394 406506 422347
9383 422347 420023 389649 366540 379589 385564 400735 397684 395363 404585 409682 406846 398521 405415
$$ packed form
9470B86154J4721P311J6983M0057o393m3238p190k81K8817M16j8228j8539l0634
9457B69956j9536P064K5547K9943j993m556q551L271O132L0493K2323q424r80
9444C50689J5621R715j0940k7384J1431j1878j6031j4814N97l0857L1509L5144
9432C42802j5988J6683Q414k97j4253K49J7896j1287J477K0600r592l740J9793
9419C72757j9013j7191p638J0650J8096K9187j800k9280j2063K0367J0129R034
9407C83235K6345j0754J1041R632j6479J9029p358k2993j2740J9350K9625j8849
9395D09084p006K4206k0279j3441k8409r918K5866J696j1481K0076J6112J5841
9383D22347k324l0374k3109J3049N975J5171l051k321R222N097k836q325O894
$$ plain form
9370 405415 393299 381885 398460 417470 436659 422240 409227 410345 407569 422280 430240 444831
9358 444831 442126 461447 501058 485824 454495 475760 488310 490995 467912 468972 465920 468186 461357
9345 461357 445649 460777 472134 477937 451264 453034 444950 433237 414199 418220 421445 441553 450653
9332 450653 480796 478219 461928 444939 431524 437027 442976 477748 500262 485564 492825 482569
9320 482569 483893 484905 498765 490934 469045 462496 468887 473070 476991 496100 486670 489503 473982
9307 473982 462596 476815 483629 516300 534220 517113 460596 467893 479954 488397 484122 472631
9295 472631 479814 515004 537579 540254 558595 548301 527860 488575 470704 493855 504272 528078
9283 528078 505634 507401 517799 504689 518477 534494 520064 524150 533172 522424 499993 492775
$$ packed form
9370D05415j2116j1414J6575J9010J9189j4419j3013J118k776J4711P960J4591
9358D44831k705J9321L9611j5234l1329K1265J2550K685k3083J060l052K266o829
9345D61357j5708J5128J1357N803k6673J770q084j1713j9038M021L225K0108R100
9332D50653L0143k577j6291j6989j3415N503N949L4772K2514j4698P261j0256
9320D82569J324J012J3860p831k1889o549O391M183L921J9109r430K833j5521
9307D73982j1386J4219O814L2671J7920j7107n6517P297J2061Q443m275j1491
9295D72631P183L5190K2575K675J8341j0294k0441l9285j7871K3151J0417K3806
9283E28078k2444J767J0398j3110J3788J6017j4430M086R022j0748k2431p218
$$ plain form
9271 492775 490093 464112 480264 536735 537768 516601 521817 539305 524864 520868 515378 511064 518472
9258 518472 540524 540629 533683 502350 487343 505611 521839 534550 532968 498953 483292 495698
9246 495698 495754 473260 461313 467251 436005 447966 495081 519177 524155 491027 482448 484503 494317
9233 494317 497196 500734 496953 511957 531437 530609 513330 503276 478816 475180 477979 468616 452526
9220 452526 493695 537828 545504 534825 507953 489993 464975 433433 412904 417683 424821 431784
9208 431784 447286 449904 474623 448471 410145 408066 445096 439732 391366 413231 446148 463037
9196 463037 467984 473613 477151 493227 498262 518946 512458 488243 438779 429450 439320 426891 402521
9183 402521 392989 415030 428361 408938 389019 400015 413931 413806 433238 439339 478095 489908
$$ packed form
9271D92775k682k5981J6152N6471J033k1167N216J7488j4441l996n490m314P408
9258E18472K2052J05o946l1333j5007J8268J6228J2711j582l4015j5661J2406
9246D95698N6k2494j1947N938l1246J1961M7115K4096M978l3128q579K055R814
9233D94317K879L538l781J5004J9480q28j7279j0054k4460l636K799r363j6090
9220D52526M1169M4133P676j0679k6872j7960k5018l1542k0529M779P138O963
9208D31784J5502K618K4719k6152l8326k079L7030n364m8366K1865L2917J6889
9196D63037M947N629L538J6076N035K0684o488k4215m9464r329R870j2429k4370
9183D02521r532K2041J3331j9423j9919J0996J3916j25J9432O101L8756J1813
$$ plain form
9171 489908 457282 442961 443843 433706 435557 458259 461556 456228 452893 450902 391710 363126 377710
9158 377710 393954 393881 402180 381332 380148 407381 428522 404319 425962 433376 436292 430526 420443
9145 420443 421416 435271 442518 428323 417863 405461 403533 405601 389089 381170 384496 397566 414855
9132 414855 398347 374386 370242 377674 362151 351255 332453 336737 388336 408735 415531 384531
9120 384531 352923 355240 390451 383466 381669 389767 380048 373097 360122 362859 391313 380461 376369
9107 376369 375309 349838 329334 331742 344721 333697 343103 313042 313550 324266 331359 359977 355406
9094 355406 346779 321810 345972 360795 356607 337513 358606 337551 328938 334985 352158 348933 323661
9081 323661 297876 300750 322744 328422 358929 375754 347656 311024 296349 307947 327418 367270
$$ packed form
9171D89908l2626j4321Q82j0137J851K2702L297n328l335j991n9192k8584J4584
9158C77710J6244p3Q299k0848j184K7233K1141k4203K1643P414K916n766j0083
9145D20443R73J3855P247j4195j0460j2402j928K068j6512p919L326J3070J7289
9132D14855j6508k3961m144P432j5523j0896j8802M284N1599K0399O796l1000
9120C84531l1608K317L5211o985j797Q098r719o951j2975K737K8454j0852m092
9107C76369j060k5471k0504K408J2979j1024R406l0061N08J0716P093K8618m571
9094C55406q627k4969K4162J4823m188j9094K1093k1055q613O047J7173l225k5272
9081C23661k5785K874K1994N678L0507J6825k8098l6632j4675J1598J9471L9852
$$ plain form
9069 367270 337352 302501 308693 318590 293414 278714 274947 301424 323896 305326 298920 288489
9057 288489 284245 305182 296273 292859 294930 315110 323825 310755 280754 242163 260133 282337 268135
9044 268135 251366 259717 252103 260101 285850 279356 281558 302366 312968 289518 251100 235742 234756
9031 234756 235885 232655 243111 229443 220405 228627 236519 241789 208904 211226 243893 255476 249178
9018 249178 279841 282896 248721 224012 211846 229911 217881 231786 227008 229259 227479 214695
9006 214695 207716 203765 202196 223806 240558 213130 229841 194702 154700 152881 143446 183280 197545
8993 197545 202370 209600 213058 190896 159119 164740 164086 157332 136071 140253 149289 171560 202589
8980 202589 218706 220756 202205 173221 164027 159462 172145 155649 131254 103881 85902 104573
$$ packed form
9069C67270k9918l4851O192R897k5176j4700l767K6477K2472j8570o406j0431
9057B88489m244K0937q909l414K071K0180Q715j3070l0001l8591J7970K2204j4202
9044B68135j6769Q351p614P998K5749o494K202K0808J0602k3450l8418j5358r86
9031B34756J129l230J0456j3668r038Q222P892N270l2885K322L2667J1583o298
9018B49178L0663L055l4175k4709j2166J8065j2030J3905m778K251j780j2784
9006B14695o979l951j569K1610J6752k7428J6711l5139m0002j819r435L9834J4265
8993A97545M825P230L458k2162l1777N621o54o754k1261M182R036K2271L1029
8980B02589J6117K050j8551k8984r194m565J2683j6496k4395k7373j7979J8671
$$ plain form
8968 104573 136540 155626 168977 221625 220007 196611 168234 183028 202190 214279 221552 231525
8956 231525 203212 170612 181740 178245 162782 179215 190705 184687 197728 184948 166725 154432
8944 154432 141424 153983 165162 171346 169146 162180 135758 120968 128169 130052 128504 150445 134446
8931 134446 134926 145105 146432 138391 130647 142142 142075 118706 103635 119603 134233 152949 165748
8918 165748 171632 169790 149761 139661 117302 107775 112433 129317 133321 144586 169832 178774 192654
8905 192654 182888 141638 141722 136001 130847 143145 158345 166293 148191 131157 139531 154560 140107
8892 140107 118008 104017 102895 119466 113556 135135 145403 162508 158732 154588 158449 137250 125295
8879 125295 93211 68504 48950 63237 98449 157897 173988 173080 187160 146325 104468 93896
$$ packed form
8968A04573L1967J9086J3351N2648j618k3396k8377J4794J9162J2089P273R973
8956B31525k8313l2600J1128l495j5463J6433J1490o018J3041j2780j8223j2293
8944A54432j3008J2559J1179O184k200o966k6422j4790P201J883j548K1941j5999
8931A34446M80J0179J327q041p744J1495o7k3369j5071J5968J4630J8716J2799
8918A65748N884j842k0029j0100k2359r527M658J6884M004J1265K5246Q942J3880
8905A92654r766m1250Q4n721n154J2298J5200P948j8102j7034Q374J5029j4453
8892A40107k2099j3991j122J6571n910K1579J0268J7105l776m144L861k1199j1955
8879A25295l2084k4707j9554J4287L5212N9448J6091r08J4080m0835m1857j0572
$$ plain form
8867 93896 96365 95080 98772 97364 75327 98860 114273 119922 126193 116043 113307 144032 163057
8854 163057 144745 121278 67538 85292 98069 108528 109065 122861 121432 104117 95368 79163
8842 79163 89063 108066 114643 120022 142674 142949 145306 137223 137642 154954 139441 109172 100292 71983
8828 71983 47523 48340 60782 69660 102278 109203 116022 108574 75240 70602 99546 98114 97212 92288
8814 92288 69936 47683 57746 86429 78845 55466 57761 67518 82228 116341 88852 79869 70985
8801 70985 70759 97510 85066 68876 56566 44485 60210 70254 67111 57279 45805 61066 94906
8788 94906 103538 77252 79748 89195 72054 74240 70404 65873 72535 104085 118567 101432 105316
8775 105316 99369 74813 75040 106632 120681 142570 132614 118382 114967 96622 87402 104913 110591
$$ packed form
8867I3896K469j285L692j408k2037K3533J5413N649O271j0150k736L0725J9025
8854A63057j8312k3467n3740J7754J2777J0459N37J3796j429j7315q749j6205
8842G9163R900J9003O577N379K2652K75K357q083M19J7312j5513l0269q880k8309
8828G1983k4460Q17J2442Q878L2618O925O819p448l3334m638K8944j432r02m924
8814I2288k2352k2253J0063K8683p584k3379K295R757J4710L4113k7489q983q884
8801G0985k26K6751j2444j6190j2310j2081J5725J0044l143r832j1474J5261L3840
8788I4906Q632k6286K496R447j7141K186l836m531O662L1550J4482j7135L884
8775A05316n947k4556K27L1592J4049K1889r956j4232l415j8345r220J7511N678
$$ plain form
8762 110591 113555 109789 76590 58142 68646 70164 68982 71512 93849 130574 137616 126921 120032
8749 120032 125852 134262 125301 119152 121217 97302 91394 94178 85745 92532 110261 97449 87925 93642
8735 93642 105378 109717 131036 161152 171810 140380 108991 122673 164074 163424 126409 116830 121964
8722 121964 113393 124570 144796 130829 108567 111151 115684 106071 82325 76498 63261 78357 96244
8709 96244 87005 96367 128109 144850 118290 116841 124442 104971 80037 69603 72292 49868 42163
8696 42163 55751 75145 85750 85618 112608 110573 83212 87987 94015 110286 110565 102255 66335
8683 66335 79672 88467 76142 65102 39045 54020 70105 70619 80294 60809 73515 89074 65397
8670 65397 84417 102082 112739 105329 94642 92856 84115 113730 137339 156901 178033 149052
$$ packed form
8762A10591K964l766l3199j8448J0504J518j182K530K2337L6725P042j0695o889
8749A20032N820Q410q961o149K065k3915n908K784q433O787J7729j2812r524N717
8735I3642J1736M339K1319L0116J0658l1430l1389J3682M1401o50l7015r579N134
8722A21964q571J1177K0226j3967k2262K584M533r613k3746n827j3237J5096J7887
8709I6244r239R362L1742J6741k6560j449P601j9471k4934j0434K689k2424p705
8696D2163J3588J9394J0605j32K6990k035k7361M775O028J6271K79q310l5920
8683F6335J3337Q795j2325j1040k6057J4975J6085N14R675j9485J2706J5559k3677
8670F5397J9020J7665J0657p410j0687j786q741K9615K3609J9562K1132k8981
$$ plain form
8658 149052 110716 100614 97278 88575 83919 82805 76762 95159 96805 98463 117699 122521 112668
8645 112668 130162 121568 122739 123123 127443 135099 88619 81683 104565 128304 132640 138798 162491
8632 162491 157446 153418 156811 152837 160950 185199 205925 205136 202477 181429 142134 110775 108908
8619 108908 93300 98124 138835 142288 137971 157046 195030 264775 291228 274815 283863 323361
8607 323361 340010 318653 363879 376392 355778 359824 359828 408027 457461 523756 557563 599550 646082
8594 646082 691233 724734 740933 772330 780497 798829 807916 783326 742436 706157 694681 688275
8582 688275 659348 612707 563328 493377 414645 372977 349455 329665 296955 255835 263536 234925
8570 234925 176029 163000 172099 143364 135363 135114 134901 145073 145041 128994 131855 129683 120612 113102
$$ packed form
8658A49052l8336j0102l336q703m656j114o043J8397J646J658J9236M822r853
8645A12668J7494q594J171L84M320P656m6480o936K2882K3739M336O158K3693
8632A62491n045m028L393l974Q113K4249K0726p89k659k1048l9295l1359j867
8619A08908j5608M824M0711L453m317J9075L7984O9745K6453j6413R048L9498
8607C23361J6649k1357M5226J2513k0614M046MM8199M9434O6295L3807M1987M6532
8594F46082M5151L3501J6199L1397Q167J8332R087k4590m0890l6279j1476o406
8582F88275k8927m6641m9379o9951p8732m1668k3522j9790l2710m1120P701k8611
8570B34925n8896j3029R099k8735q001k49k13J0172l2j6047K861k172r071p510
$$ plain form
8556 113102 97704 97585 100263 124541 149995 150725 161570 164209 163014 201008 231481 237496 262345
8543 262345 269930 244614 208786 163344 158214 163347 163716 140233 99136 82348 103729 114521 107844
8530 107844 108317 119002 88930 59800 84584 109886 87090 53951 22825 7119 33796 60563
8518 60563 78377 96981 92731 95093 94242 89827 64927 65423 70487 67061 79345 93638 105469 102088
8504 102088 73678 56987 45095 41311 40299 31063 24327 30685 65011 87394 115748 108234 91222
8491 91222 104223 90119 81772 85530 92960 89355 51809 31963 33140 49542 54694 47973 32074
8478 32074 36445 42561 44072 41751 24177 29156 50253 44186 44458 31914 28355 10223 21535 26571
8464 26571 26087 38357 13908 -24677 16385 29979 32531 40978 62815 51295 58883 57720 42347
$$ packed form
8556A13102j5398j19K678K4278K5454P30J0845K639j195L7994L0473O015K4849
8543B62345P585k5316l5828m5442n130N133L69k3483m1097j6788K1381J0792o677
8530A07844M73J0685l0072k9130K4784K5302k2796l3139l1126j5706K6677K6767
8518F0563J7814J8604m250K362q51m415k4900M96N064l426J2284J4293J1831l381
8504A02088k8410j6691j1892l784j012r236o736O358L4326K2383K8354p514j7012
8491I1222J3001j4104q347L758P430l605l7546j9846J177J6402N152o721j5899
8478C2074M371O116J511k321j7574M979K1097o067K72j2544l559j8132J1312N036
8464B6571m84J2270k4449l8585M1062J3594K552Q447K1837j1520P588j163j5373
$$ plain form
8451 42347 18521 20858 26419 33646 32202 26510 25205 36753 51024 81218 48981 26224 18188
8438 18188 22755 13700 15988 16173 23962 58279 33850 13913 -3015 -8182 24449 54150 60410
8425 60410 54237 55379 52424 21227 2127 10106 12793 37201 41846 29592 32841 41368 52222
8412 52222 51641 71175 58225 53317 33302 37761 65997 65543 51473 31751 47972 63617 47893
8399 47893 22708 18748 3651 7097 708 24977 37583 41950 15004 -11541 -41935 -47682 -42233
8386 -42233 -18916 -322 7689 31528 13278 -8231 3141 -7438 1795 36290 37266 7823 -7359
8373 -7359 -5204 12912 1967 202 37393 50565 58657 46639 39194 27439 27411 20125 7768 -604
8359 -604 -4577 26083 6264 -25921 -8785 18642 55290 67902 47734 46638 33727 39083 28287
$$ packed form
8451D2347k3826K337N561P227j444n692j305J1548J4271L0194l2237k2757q036
8438A8188M567r055K288J85P789L4317k4429j9937j6928n167L2631K9701O260
8425F0410o173J142k955l1197j9100P979K687K4408M645j2254L249Q527J0854
8412E2222n81J9534j2950m908k0015M459K8236m54j4070j9722J6221J5645j5724
8399D7893k5185l960j5097L446o389K4269J2606M367k6946k6545l0394n747N449
8386d2233K3317J8594Q011K3839j8250k1509J1372j0579R233L4495R76k9443j5182
8373g359K155J8116j0945j765L7191J3172Q092j2018p445j1755k8p286j2357q372
8359f04l973L0660j9819l2185J7136K7427L6648J2612k0168j096j2911N356j0796
$$ plain form
8346 28287 15034 7759 11687 29843 48951 68371 72298 51144 46076 27951 17251 -12206 -16724
8333 -16724 -28811 -39663 -24827 4839 13505 33775 22450 25368 6857 10098 31074 45640
8321 45640 7157 -20274 12236 51090 47201 30086 -27 -28623 -17824 -8313 -3616 5186 6259
8308 6259 -8267 -11871 -12711 -1714 18820 31877 39943 46545 48469 36344 38901 38907 39983 23001
8294 23001 4862 741 16724 34726 46422 41749 27520 14472 7576 17467 53471 42031 31680
8281 31680 32528 44309 64763 49134 52583 56515 68331 52004 19544 18712 43995 63361 79331
8268 79331 101969 72719 35292 26307 6511 -17554 -9261 6635 24892 52446 60629 33854
8256 33854 29269 36294 20505 51511 64099 48108 36633 28945 11732 2631 24538 43223 64049
$$ packed form
8346B8287j3253p275L928J8156J9108J9420L927k1154n068j8125j0700k9457m518
8333a6724j2087j0852J4836K9666Q666K0270j1325K918j8511L241K0976J4566
8321D5640l8483k7431L2510L8854l889j7115l0113k8596J0799R511M697Q802J073
8308F259j4526l604q40J0997K0534J3057Q066O602J924j2125K557OJ076j6982
8294B3001j8139m121J5983J8002J1696m673j4229j3048o896R891L6004j1440j0351
8281C1680Q48J1781K0454j5629L449L932J1816j6327l2460q32K5283J9366J5970
8268G9331K2638k9250l7427q985j9796k4065Q293J5896J8257K7554Q183k6775
8256C3854m585P025j5789L1006J2588j5991j1475p688j7213r101K1907J8685K0826
$$ plain form
8243 64049 54484 24767 17172 3326 -5250 253 12996 3643 3140 24535 14986 29606 -1663
8230 -1663 -18647 -23036 -28381 1966 23120 35169 24654 4533 11109 16891 26593 33451 57078
8217 57078 59419 4823 6291 -13064 -21365 1025 10699 22397 10577 10678 17921 42761 62281
8204 62281 53341 53652 61621 49249 47127 52887 70456 61181 26031 14698 -145 352 9085 -8202
8190 -8202 766 29922 56367 45473 24780 17534 13719 19801 16131 18709 5982 33944 38927
8177 38927 26875 -2902 -33575 -29703 -22708 -1050 16236 14141 12379 -1033 11264 32358 3906
8164 3906 6137 18197 37569 15293 -8440 3843 7457 3418 10682 26364 12750 15386 19485
8151 19485 -14852 -40897 -537 20811 35545 58983 78460 54800 32298 -1428 -33975 -1045
$$ packed form
8243F4049r565k9717p595j3846q576N503J2743r353n03K1395r549J4620l1269
8230a663j6984m389n345L0347K1154J2049j0515k0121O576N782R702O858K3627
8217E7078K341n4596J468j9355q301K2390R674J1698j1820J01P243K4840J9520
8204F2281q940L11P969j2372k122N760J7569r275l5150j1333j4843M97Q733j7287
8190h202Q968K9156K6445j0894k0693p246l815O082l670K578j2727K7962M983
8177C8927j2052k9777l0673L872O995K1658J7286k095j762j3412J2297K1094k8452
8164C906K231J2060J9372k2276k3733J2283L614m039P264J5682j3614K636M099
8151A9485l4337k6045M0360K1348J4734K3438J9477k3660k2502l3726l2547L2930
$$ plain form
8139 -1045 31445 35976 34333 30694 37786 24090 17810 27333 59150 53715 19550 9562 14971 18300
8125 18300 27222 30856 18340 -16712 -8080 1249 -13810 21896 47678 36602 5256 -2237 18885
8112 18885 27637 11374 13166 46931 62349 42046 41657 35208 15000 22172 29934 57250 70791
8099 70791 52936 37922 35163 36738 42999 45575 51258 32624 -196 525 17271 49194 58643
8086 58643 57477 41269 29165 33402 19603 15074 25575 14637 -12096 -5972 5863 -1882 -2988
8073 -2988 865 23780 23373 19097 -15593 12721 58365 33899 3548 33662 30996 60867 50047
8060 50047 37607 7242 -15490 -10628 -21964 -14900 -13912 1458 11759 17640 17354 23899 36545
8047 36545 62908 55895 52569 75453 102276 111676 101831 73732 56874 45519 56102 81906 103316
$$ packed form
8139a045L2490M531j643l639P092j3696o280R523L1817n435l4165r988N409L329
8125A8300Q922L634j2516l5052Q632R329j5059L5706K5782j1076l1346p493K1122
8112A8885Q752j6263J792L3765J5418k0303l89o449k0208P172P762K7316J3541
8099G0791j7855j5014k759J575O261K576N683j8634l2820P21J6746L1923R449
8086E8643j166j6208j2104M237j3799m529J0501j0938k6733O124J1835p745j106
8073b988L853K2915m07m276l4690K8314M5644k4466l0351L0114k666K9871j0820
8060E0047j2440l0365k2732M862j1336P064R88J5370J0301N881k86O545J2646
8047C6545K6363p013l326K2884K6823R400r845k8099j6858j1355J0583K5804K1410
$$ plain form
8034 103316 71778 27002 -2931 22726 45362 62342 71710 80808 66237 56014 54270 60301
8022 60301 68577 71047 62834 67220 82227 52278 26605 44888 48469 52262 72409 77609 59824
8009 59824 71286 88193 81336 73075 90938 123803 140016 117881 89442 86096 82055 89056 99856
7996 99856 108379 97540 66288 67543 98795 120575 90362 59076 70951 81377 69985 65699
7984 65699 65979 59715 34925 31838 44218 54814 83871 102067 89619 61107 71515 47684 26458
7971 26458 32837 33448 56731 88248 98608 122297 122707 94677 88898 75624 95023 84038 65582
7958 65582 73149 73803 108250 138228 136430 143881 140040 136696 108600 86590 98712 95390 101861 126533
7944 126533 135006 135820 130823 103615 88550 46956 69798 137009 133663 83882 70656 63386 76509
$$ packed form
8034A03316l1538m4776k9933K5657K2636J6980R368R098j4571j0223j744O031
8022F0301Q276K470q213M386J5007k9949k5673J8283L581L793K0147N200j7785
8009E9824J1462J6907o857q261J7863L2865J6213k2135k8439l346m041P001J0800
7996I9856Q523j0839l1252J255L1252K1780l0213l1286J1875J0426j1392m286
7984F5699K80o264k4790l087J2380J0596K9057J8196j2448k8512J0408k3831k1226
7971B6458O379O11K3283L1517J0360K3689M10k8030n779j3274J9399j0985j8456
7958F5582P567O54L4447K9978j798P451l841l344k8096k2010J2122l322O471K4672
7944A26533Q473Q14m997k7208j5065m1594K2842O7211l346m9781j3226p270J3123
$$ plain form
7931 76509 107539 115845 101914 102891 116624 127098 133035 173918 172062 143879 121709 98309 139524
7918 139524 150444 124295 148046 165005 159615 150417 138039 133000 98646 89572 81288 93485 120738
7905 120738 128039 89701 80238 91990 85278 55617 51283 93364 120150 130479 131294 127951 133260
7892 133260 124764 98784 89457 63065 67211 71422 100253 109887 92257 91803 85479 78868 41137
7879 41137 46330 43006 40050 67376 94390 123789 103129 55329 17544 5892 27946 84223
7867 84223 103974 101852 91420 61746 63486 59766 61174 66324 84349 72088 55127 57360 51740
7854 51740 60453 75977 81072 66392 52585 44088 44543 27184 34593 65366 59622 54891 43941
7841 43941 3792 10817 8789 -9843 -33067 -31140 1937 22688 20101 -17663 -6569 11214 40013
$$ packed form
7931G6509L1030Q306j3931R77J3733J0474N937M0883j856k8183k2170k3400M1215
7918A39524J0920k6149K3751J6959n390r198j2378n039l4354r074q284J2197K7253
7905A20738P301l8338r463J1752o712k9661m334M2081K6786J0329Q15l343N309
7892A33260q496k5980r327k6392M146M211K8831R634j7630m54o324o611l7731
7879D1137N193l324k956K7326K7014K9399k0660m7800l7785j1652K2054N6277
7867H4223J9751k122j0432k9674J740l720J408N150J8025j2261j6961K233n620
7854E1740Q713J5524N095j4680j3807q497M55j7359P409L0773n744m731j0950
7841D3941m0149P025k028j8632k3224J927L3077K0751k587l7764J1094J7783K8799
$$ plain form
7828 40013 51393 30628 34499 27782 33126 35764 38680 57890 43588 -7742 -43618 -25123 3754
7815 3754 8422 38823 79481 56719 16378 -27105 -42778 -56838 -39743 -36092 -14916 -12295 -15268
7802 -15268 -20777 -48163 -41493 -14782 950 5826 -1930 -23448 -26388 -15955 -7422 3043 15147
7789 15147 -2432 -8825 31317 36083 36070 28648 18859 47855 52941 62487 36353 25270 12707 -17713
7775 -17713 -4784 16914 21094 20190 -11240 -29950 -47657 -48334 -28393 14421 23999 20342 22888
7762 22888 50890 36708 12647 21501 13550 -18788 3744 14683 -2646 -15854 -18160 7256
7750 7256 22383 38496 21060 5542 22432 24959 12708 -3140 1873 3237 -17232 2616 41805
7737 41805 44840 47258 60544 44391 18576 20490 -2224 -4202 8849 19641 6206 13637 -7817
$$ packed form
7828D0013J1380k0765L871o717N344K638K916J9210j4302n1330l5876J8495K8877
7815C754M668L0401M0658k2762m0341m3483j5673j4060J7095L651K1176K621k973
7802a5268n509k7386O670K6711J5732M876p756k1518k940J0433Q533J0465J2104
7789A5147j7579o393M0142M766j3p422r789K8996N086R546k6134j1083j2563l0420
7775a7713J2929K1698M180r04l1430j8710j7707o77J9941M2814R578l657K546
7762B2888K8002j4182k4061Q854p951l2338K2532J0939j7329j3208k306K5416
7750G256J5127J6113j7436j5518J6890K527j2251j5848N013J364k0469J9848L9189
7737D1805L035K418J3286j6153k5815J914k2714j978J3051J0792j3435P431k1454
$$ plain form
7724 -7817 15863 36062 33912 19091 2857 -12082 3458 22785 -4461 -25585 -39421 -67481
7712 -67481 -47948 -27878 -16337 -40592 -26288 -11744 -23785 -27659 -22809 -50847 -70680 -52770
7700 -52770 -46762 -58581 -54502 -68112 -94766 -93506 -73804 -36815 -35104 -57828 -48417 -18680 -4549
7687 -4549 -11123 -5016 13553 24348 32480 13346 2373 -16016 -16023 -11915 8010 25658 59384 64654
7673 64654 39421 40591 37486 6504 -35042 -47999 -39334 -6304 38899 33163 29277 31812 -1459
7660 -1459 -51055 -89486 -68924 -40906 -31739 -35123 -49819 -42034 -5628 18923 46274 31241 21150
7647 21150 26506 31928 2780 -13350 799 -8616 -13664 -12877 -20069 -4648 30428 18818 16426
7634 16426 14456 -14950 -40434 -40948 -41962 -38830 -22541 -27242 -27937 -24299 -8126 6178 31500 38646
$$ packed form
7724g817K3680K0199k150j4821j6234j4939J5540J9327k7246k1124j3836k8060
7712f7481J9533K0070J1541k4255J4304J4544j2041l874M850k8038j9833J7910
7700e2770O008j1819M079j3610k6654J260J9702L6989J711k2724R411K9737J4131
7687d549o574O107J8569J0795Q132j9134j0973j8389pM108J9925J7648L3726N270
7673F4654k5233J170l105l0982m1546j2957Q665L3030M5203n736l886K535l3271
7660a459m9596l8431K0562K8018R167l384j4696P785L6406K4551K7351j5033j0091
7647B1150N356N422k9148j6130J4149r415n048P87p192J5421L5076j1610k392
7634A6426j970k9406k5484n14j014L132J6289m701o95L638J6173J4304K5322P146
$$ plain form
7620 38646 31693 42049 18271 13977 5790 -9327 -32958 -42218 -45838 -47178 -33588 -25903 -33844
7607 -33844 -21481 -7617 -37113 -60307 -67687 -40774 -6265 3251 18692 2876 14662 13358
7595 13358 9058 8611 52 -16832 -25133 -20902 -27690 -60568 -55437 -32472 -24223 -39291 -3121 20628
7581 20628 14636 28164 14020 14713 31078 22009 -4272 -38707 -38572 -28415 -14456 -5596 -3760
7568 -3760 3370 -26321 -30021 -52313 -43263 -3429 -1558 -132 12233 -900 -31481 -34187 -30749
7555 -30749 -15960 -11166 -25170 -37496 -32591 -10618 6109 23443 17967 -28109 -51999 -25142
7543 -25142 -4576 14355 24691 16315 -586 -4741 -2880 -15612 -17944 -39477 -41105 -49525 -34880
7530 -34880 -9962 29218 26832 23255 -13549 -33084 -4848 14125 10900 3226 -1297 -20088 -20801
$$ packed form
7620C8646o953J0356k3778m294q187j5117k3631r260l620j340J3590P685p941
7607c3844J2363J3864k9496k3194p380K6913L4509R516J5441j5816J1786j304
7595A3358m300m47q559j6884q301M231o788l2878N131K2965Q249j5068L6170K3749
7581B0628n992J3528j4144O93J6365r069k6281l4435J35J0157J3959Q860J836
7568c760P130k9691l700k2292R050L9834J871J426J2365j3133l0581k706L438
7555c0749J4789M794j4004j2326M905K1973J6727J7334n476m6076k3890K6857
7543b5142K0566J8931J0336q376j6901m155J861j2732k332k1533j628q420J4645
7530c4880K4918L9180k386l577l6804j9535K8236J8973l225p674m523j8791p13
$$ plain form
7517 -20801 -20543 -23733 -44253 -50837 -55438 -39122 -27625 -10890 -29401 -30682 -30095 -9875 19944
7504 19944 11768 -4269 -15133 4664 17458 -5151 -18981 -25739 -13652 -434 -49084 -35905
7492 -35905 -10187 -230 31570 35007 28941 18898 21908 47459 32992 10506 15932 28991 16193
7479 16193 -7284 -11769 -8517 8790 25443 23165 2086 379 -8566 -3296 12936 2516 18783
7466 18783 21975 19916 44755 18220 -4001 -25192 -58728 -54460 -46214 -32851 -31619 -25594 9158
7453 9158 16082 13213 -2038 -15655 -19586 -15211 -525 8033 13814 22644 28404 4907 1680 5623
7439 5623 6995 632 -11029 7738 7339 19152 222 -17834 -18052 -24354 -38094 -16410 13271
7426 13271 30071 34357 54238 53771 42713 9599 -3676 -3093 4726 -5663 -21098 -38985 -23900
$$ packed form
7517b0801K58l190k0520o584m601J6316J1497J6735j8511j281N87K0220K9819
7504A9944q176j6037j0864J9797J2794k2609j3830o758J2087J3218m8650J3179
7492c5905K5718R957L1800L437o066j0043L010K5551j4467k2486N426J3059j2798
7479A6193k3477m485L252J7307J6653k278k1079j707q945N270J6232j0420J6267
7466A8783L192k059K4839k6535k2221k1191l3536M268Q246J3363J232O025L4752
7453I158O924k869j5251j3617l931M375J4686Q558N781Q830N760k3497l227L943
7439E623J372o363j1661J8767l99J1813j8930j8056k18o302j3740K1684K9681
7426A3271J6800M286J9881m67j1058l3114j3275N83P819j0389j5435j7887J5085
$$ plain form
7413 -23900 10283 41947 38911 40248 28853 10946 19439 40014 24822 -4169 -7794 6204 21308
7400 21308 31810 28154 -17481 -38997 -26425 -26612 -8973 -4519 -26869 -46185 -43353 -9341 39885
7387 39885 25122 8519 -15014 3229 20656 21749 1378 -11336 -19937 2629 10675 16800 -3494
7374 -3494 -11944 -20591 -22648 -33709 -28769 -34346 -45219 -38792 -53163 -43936 -25702 -14345 -11291 -5032
7360 -5032 5587 37155 31200 -8921 -14027 16667 28020 26687 -5466 7307 8618 4518 -29140
7347 -29140 -49297 -28992 -5270 23989 12562 -31981 -30688 -20219 -33854 -42678 -56651 -55962 -31738
7334 -31738 -49801 -40806 -38258 -44857 -41863 -39418 -18996 -12839 -11308 -11390 -48185 -60708 -42445 -12867
7320 -12867 -18411 -50460 -21859 -17576 -12583 18578 18538 -8994 -27657 -22494 -32535 -31950 -12550 -4004
$$ packed form
7413b3900L4183L1664l036J337j1395j7907Q493K0575j5192k8991l625J3998J5104
7400B1308J0502l656m5635k1516J2572j87J7639M454k2350j9316K832L4012M9226
7387C9885j4763j6603k3533J8243J7427J093k0371j2714q601K2566Q046O125k0294
7374c494q450q647k057j1061M940n577j0873O427j4371R227J8234J1357L054O259
7360e032J0619L1568n955m0121n106L0694J1353j333l2153J2773J311m100l3658
7347b9140k0157K0305K3722K9259j1427m4543J293J0469j3635q824j3973O89K4224
7334c1738j8063Q995K548o599K994K445K0422O157J531q2l6795j2523J8263K9578
7320a2867n544l2049K8601M283M993L1161m0k7532j8663N163j0041N85J9400Q546
$$ plain form
7306 -4004 -7911 -7555 36430 41959 4124 -7673 -17867 -34175 -45762 -38595 -19622 -37084 -43794
7293 -43794 -33228 -32011 -33175 -33576 -36517 -45455 -28292 10661 12050 12720 18745 27780 16639 -16799
7279 -16799 -26759 -43641 -64929 -52612 -37252 -62076 -36241 -26100 -10723 -5165 -13046 -12324 -30802
7266 -30802 -14017 -19314 -11603 -6343 -2336 -9472 -14314 -20510 -41222 -41249 -26716 -20633 8199 8809
7252 8809 -15238 5371 15509 -9467 -47895 -20211 22357 55476 69366 52492 36072 28132
7240 28132 -24117 -40152 -50673 -21820 -6204 -30479 -45478 -23802 10949 27030 14142 -15021
7228 -15021 -25400 -4709 1815 -7043 -7518 -36099 -57887 -35049 -31708 -34324 -21262 5068 6182
7215 6182 -14286 -46769 -57099 -35277 -5685 12060 -19987 -16165 1145 6951 6509 10207 14202
$$ packed form
7306d004l907L56M3985N529l7835j1797j0194j6308j1587P167J8973j7462o710
7293d3794J0566J217j164m01k941q938J7163L8953J389O70O025R035j1141l3438
7279a6799r960j6882k1288J2317J5360k4824K5835J0141J5377N558p881P22j8478
7266c0802J6785n297P711N260M007p136m842o196k0712k7J4533O083K8832O10
7252H809k4047K0609J0138k4976l8428K7684M2568L3119J3890j6874j6420p940
7240B8132n2249j6035j0521K8853J5616k4275j4999K1676L4751J6081j2888k9163
7228a5021j0379K0691O524q858m75k8581k1788K2838L341k616J3062K6330J114
7215F182k0468l2483j0330K1822K9592J7745l2047L822J7310N806m42L698L995
$$ plain form
7202 14202 -1109 -9556 -26860 -30335 -8334 -15607 -5457 22918 1013 -21254 -29947 -46361 -33681
7189 -33681 -1356 20611 26291 38030 19538 11400 5059 -29014 -56630 -60360 -57720 -13552 -3077
7176 -3077 -2978 8169 8801 -23965 -18713 21815 13702 -9151 -24875 -38981 -30117 21999 41785 7836
7162 7836 -5924 -24212 5456 37465 -1662 -5464 -393 13448 19760 8131 -22302 -16685 -28270
7149 -28270 -42008 -14719 2059 30112 25558 -8219 -11284 115 -12096 -21281 -17077 24244 55932
7136 55932 39098 16909 2154 -3403 7468 27922 45685 28189 30908 60725 52975 48886 32787
7123 32787 4372 -8446 -5904 -20543 -27277 -21128 -9587 11137 20695 18345 25177 45419 38060
7110 38060 -3166 -19684 -13210 -3163 10469 2237 -3409 -26164 -37885 -27270 -53984 -43937
$$ packed form
7202A4202j5311q447j7304l475K2001p273J0150K8375k1905k2267q693j6414J2680
7189c3681L2325K1967N680J1739j8492q138o341l4073k7616l730K640M4168J0475
7176c077R9J1147O32l2766N252M0528q113k2853j5724j4106Q864N2116J9786l3949
7162G836j3760j8288K9668L2009l9127l802N071J3841O312j1629l0433N617j1585
7149b8270j3738K7289J6778K8053m554l3777l065J1399j2211r185M204M1321L1688
7136E5932j6834k2189j4755n557J0871K0454J7763j7496K719K9817p750m089j6099
7123C2787k8415j2818K542j4639o734O149J1541K0724R558k350O832K0242p359
7110C8060m1226j6518O474J0047J3632q232n646k2755j1721J0615k6714J0047
$$ plain form
7098 -43937 -896 35211 -10237 -51753 -50487 -25151 -21515 -9611 10739 1338 4877 13558 5327
7085 5327 -20856 -49182 -59466 -38656 -28049 -25455 -22141 -30487 -21420 -2488 -3152 -8990 11863
7072 11863 20724 7450 -28454 -30390 -23301 -22343 -40533 -47647 -59504 -66548 -74396 -72261 -23360 -1470
7058 -1470 -18819 -13487 -3871 -21819 -32386 -30297 -8926 3673 -15895 -23767 -22373 -19536 -2174
7045 -2174 -4497 4122 26298 18945 5508 -51932 -60336 -59500 -54505 -18618 -8535 13810 14027 -4193
7031 -4193 -40138 -33338 10254 21120 6142 -22980 -6173 10701 27686 50189 38005 37984 20524
7018 20524 -11353 -20635 -24895 -1321 33518 10127 4750 21394 6462 -14921 -20479 -17125 -18535
7005 -18535 -24417 -43337 -63065 -32702 -12953 -10611 -9228 -45062 -50103 -23856 -24576 -14667 -18852
$$ packed form
7098d3937M3041L6107m5448m1516J266K5336L636J1904K0350r401L539Q681q231
7085E327k6183k8326j0284K0810J0607K594L314q346R067J8932o64n838K0853
7072A1863Q861j3274l5904j936P089R58j8190p114j1857p044p848K135M8901K1890
7058a470j7349N332R616j7948j0567K089K1371J2599j9568p872J394K837J7362
7045b174k323Q619K2176p353j3437n7440q404Q36M995L5887J0083K2345K17j8220
7031d193l5945O800M3592J0866j4978k9122J6807J6874J6985K2503j2184k1j7460
7018B0524l1877r282m260K3574L4839k3391n377J6644j4932k1383n558L354j410
7005a8535n882j8920j9728L0363J9749K342J383l5834n041K6247p20R909m185
$$ plain form
6992 -18852 -18823 -24425 1100 24160 3619 1346 2341 23122 31505 34217 35252 40760 46606 31149
6978 31149 11530 -12669 -44610 -65361 -55938 -19432 23820 25309 12151 9837 481 17332 40997
6965 40997 28128 -1135 -13217 -5922 4471 -4905 -6054 15693 -3950 -19299 -7366 -12156 -2060
6952 -2060 -6731 -23626 -22036 -16554 -1130 -16322 -23013 -8560 -4956 -15111 -5645 28959 49973
6939 49973 46000 50827 32499 -18604 -46448 -43515 -62664 -44370 -45849 -43772 -11917 -14727 -13171
6926 -13171 -18228 -20332 -3843 2454 15993 46203 2996 -32547 -33636 -46570 -38419 -18687 -1445
6913 -1445 -12612 6959 39154 42132 27945 -18653 -39160 -34519 -26400 23358 41605 54070 33135
6900 33135 90 -1787 -25459 -32854 -21613 -8029 -17962 -36053 -17037 6160 15840 -3739 1287
$$ packed form
6992a8852K9n602K5525K3060k0541k273R95K0781Q383K712J035N508N846j5457
6978C1149j9619k4199l1941k0751R423L6506M3252J489j3158k314r356J6851K3665
6965D0997j2869k9263j2082P295J0393r376j149K1747j9643j5349J1933m790J0096
6952b060m671j6895J590N482J5424j5192o691J4453L604j0155R466L4604K1014
6939D9973l973M827j8328n1103k7844K933j9149J8294j479K077L1855k810J556
6926a3171n057k104J6489O297J3539L0210m3207l5543j089j2934Q151J9732J7242
6913a445j1167J9571L2195K978j4187m6598k0507M641Q119M9758J8247J2465k0935
6900C3135l3045j877k3672p395J1241J3584r933j8091J9016K3197R680j9579N026
$$ plain form
6887 1287 18293 14317 4909 132 -10190 -19308 -40182 -74157 -104714 -113287 -67659 -10651 -1459
6874 -1459 15077 -977 -21687 -10349 -915 -2974 -16778 -17306 3956 30124 36812 19571 -12058
6861 -12058 14358 35306 -6595 -13292 3675 22738 17730 6688 5169 12647 -11469 -38074 -42880
6848 -42880 -38015 -12092 -809 -13297 -46163 -49700 -9998 9770 -2665 5980 -17546 -29903
6836 -29903 -59892 -56395 -54648 -48613 -45689 -21562 -14589 7302 -9428 -24557 -16532 9243 -8860
6823 -8860 -44656 -54466 -69361 -62265 -42417 -36538 -49400 -31380 -27001 -24797 2218 15336 26199
6810 26199 7777 2317 -13379 -7932 4511 11985 -4194 -13157 8880 17613 14931 5269 67
6797 67 -1886 -9767 -17105 -13854 2888 21481 244 3068 7360 -32681 -29396 -31700 -17240 -44839
$$ packed form
6887A287J7006l976r408m777j0322r118k0874l3975l0557q573M5628N7008R192
6874a459J6536j6054k0710J1338R434k059j3804n28K1262K6168O688j7241l1629
6861a2058K6416K0948m1901o697J6967J9063n008j1042j519P478k4116k6605m806
6848d2880M865K5923J1283j2488l2866l537L9702J9768j2435Q645k3526j2357
6836b9903k9989L497J747O035K924K4127O973K1891j6730j5129Q025K5775j8103
6823h860l5796r810j4895P096J9848N879j2862J8020M379K204K7015J3118J0863
6810B6199j8422n460j5696N447J2443P474j6179q963K2037Q733k682r662n202
6797F7j953p881p338L251J6742J8593k1237K824M292m0041L285k304J4460k7599
$$ plain form
6783 -44839 -48679 -13808 -15768 -23910 -15203 4613 -734 -5330 -4177 9567 -2102 -19793 -24952
6770 -24952 43113 61425 42800 29736 24532 18560 -5266 -34709 -61610 -65729 -40770 -27158
6758 -27158 -8578 32104 27917 -8381 -35779 -12203 7421 -4622 -9652 17258 33586 20054
6746 20054 -4400 -10542 441 11000 344 -16205 -38835 -52501 -44546 -33773 -23576 18272
6734 18272 9842 -18809 -38711 -14044 -32143 -41840 5406 -1483 14231 21695 35217 47837 123805
6721 123805 169421 171938 193621 192597 136795 108790 101801 64683 34292 24367 -2598 -25073
6709 -25073 -52392 -32104 -18283 -12943 -9255 11722 15389 42239 22600 -18286 -4720 10233
6697 10233 14135 15202 -21523 -24655 -5390 -26729 -59579 -54222 -53294 -59301 -31323 8925 -3304
$$ packed form
6783d4839l840L4871j960q142Q707J9816n347m596J153J3744j1669j7691n159
6770b4952O8065J8312j8625j3064n204n972k3826k9443k6901m119K4959J3612
6758b7158J8580M0682m187l6298k7398K3576J9624j2043n030K6910J6328j3532
6746B0054k4454o142J0983J0559j0656j6549k2630j3666P955J0773J0197M1848
6734A8272q430k8651j9902K4667j8099r697M7246o889J5714P464J3522J2620P5968
6721A23805M5616K517K1683j024n5802k8005o989l7118l0391r925k6965k2475
6709b5073k7319K0288J3821N340L688K0977L667K6850j9639m0886J3566J4953
6697A0233L902J067l6725l132J9265k1339l2850N357R28o007K7978M0248j2229
$$ plain form
6684 -3304 -47866 -56423 -667 45694 34662 6822 -3568 44589 66957 53343 37061 30153
6672 30153 12387 -11839 -25056 -9658 1684 -37157 -65949 -57299 -32126 -5138 -448 -11755
6660 -11755 -2344 -13216 -27891 -21488 -4900 -15503 -46977 -57114 -34589 -23092 -2637 -3127 3223
6647 3223 -24332 -35122 -14361 11233 1484 -6196 -12700 -5620 -6949 16211 -10614 -29579 -39084
6634 -39084 -34648 -43025 -71503 -51859 -13987 2044 7805 -21260 -46870 -28091 -2315 14020
6622 14020 11565 12787 25505 20526 22009 22607 8179 7594 17665 3923 -13656 -9076 4001 19647
6608 19647 7212 -27655 -23672 -7259 10107 9368 -8306 -14599 739 3805 9619 24721 19569
6595 19569 11906 3867 -24121 -47076 -27118 -19097 -2316 -535 7236 57 1210 -17 -28775
$$ packed form
6684c304m4562q557N5756M6361j1032k7840j0390M8157K2368j3614j6282o908
6672C0153j7766k4226j3217J5398J1342l8841k8792Q650K5173K6988M690j1307
6660a1755R411j0872j4675O403J6588j0603l1474j0137K2525J1497K0455m90O350
6647C223k7555j0790K0761K5594r749p680o504P080j329K3160k6825j8965r505
6634c9084M436q377k8478J9644L7872J6031N761k9065k5610J8779K5776J6335
6622A4020k455J222J2718m979J483N98j4428n85J0071j3742j7579M580J3077J5646
6608A9647j2435l4867L983J6413J7366p39j7674o293J5338L066N814J5102n152
6595A9569p663q039k7988k2955J9958Q021J6781J781P771p179J153j227k8758
$$ plain form
6582 -28775 -33129 -42855 -31563 -20749 12505 524 -30548 -48329 -39853 -28763 -37171 -48119 -45238
6569 -45238 -15468 -888 -8054 -3670 -1571 -18568 -19636 1218 2376 5200 6826 12534 18167 17803
6555 17803 5386 -31481 -38993 -22151 2281 24189 33439 22079 -13830 -45569 -48295 -53638 -32308
6542 -32308 -14317 -30334 -14137 -12719 -32824 -34167 -12085 5145 -9872 -33204 -53250 -9503
6530 -9503 21052 1415 -11690 -19314 -18627 -20716 18834 19838 -17067 -13246 524 -26172 -24759
6517 -24759 -6272 22015 51557 33963 12627 12262 -2115 -23216 -12286 12224 25996 24198
6505 24198 12550 18951 -5786 -7840 -7402 -36741 -32278 -16213 11060 18591 15777 -4490 -19074
6492 -19074 -22171 -16467 -19765 -47878 -16443 8857 8805 26763 42161 45828 61255 29486 -2285
$$ packed form
6582b8775m354r726J1292J0814L3254j1981l1072j7781Q476J1090q408j0948K881
6569d5238K9770J4580p166M384K099j6997j068K0854J158K824J626N708N633l64
6555A7803j2417l6867p512J6842K4432K1908R250j1360l5909l1739k726n343K1330
6542c2308J7991j6017J6197J418k0105j343K2082J7230j5017k3332k0046M3747
6530i503L0555j9637j3105p624O87k089L9550J004l6905L821J3770k6696J413
6517b4759J8487K8287K9542j7594k1336l65j4377k1101J0930K4510J3772j798
6505B4198j1648O401k4737k054M38k9339M463J6065K7273P531k814k0267j4584
6492a9074l097N704l298k8113L1435K5300n2J7958J5398L667J5427l1769l1771
$$ plain form
6479 -2285 -26652 -28030 -27498 -43556 -25624 -23817 -51859 -74488 -76252 -47207 -31322 -31437 -44194
6466 -44194 -32226 -10931 2059 -8804 -12736 -14556 -17303 -13599 -35687 -38623 -32033 -31265 -42210
6453 -42210 -44238 -42935 -30283 -18569 -45299 -30428 -33738 -41386 -15007 1134 -18569 -18648 -34118
6440 -34118 -2746 5633 -21370 -29706 -25602 -27194 -19859 -3546 14772 12948 5123 -18771 -64296
6427 -64296 -84980 -86897 -85914 -60376 -34177 -16525 -1843 -3152 -1019 -7241 -29443 -23610 6287
6414 6287 6385 404 -20136 -21480 -22040 -21909 -45433 -53415 -47861 -53681 -62501 -24514 19843 37079 33913
6399 33913 21197 23898 26855 27130 42494 24415 4910 10054 -19968 -44811 -34643 -22604 -1083
6386 -1083 -4600 -11333 27469 32390 36236 33418 13804 -7624 -12078 2995 13734 -2365 -11186
$$ packed form
6479b285k4367j378N32j6058J7932J807k8042k2629j764K9045J5885j15j2757
6466d4194J1968K1295J2990j0863l932j820k747L704k2088k936O590P68j0945
6453d2210k028J303J2652J1714k6730J4871l310p648K6379J6141j9703p9j5470
6440c4118L1372Q379k7003q336M104j592P335J6313J8318j824p825k3894m5525
6427f4296k0684j917R83K5538K6199J7652J4682j309K133o222k2202N833K9897
6414F287R8n981k0540j344n60J31k3524p982N554n820q820L7987M4357J7236l166
6399C3913j2716K701K957K75J5364j8079j9505N144l0022k4843J0168J2039K1521
6386a083l517o733L8802M921L846k818j9614k1428m454J5073J0739j6099q821
$$ plain form
6373 -11186 -16155 -34607 -43472 -13045 1477 22437 41380 24951 -12235 -8130 -16844 -23481 -17346
6360 -17346 -9146 -2143 -9285 -10312 4002 6608 13018 -7806 -23755 -20647 -25989 -24223 -16537 -4922
6346 -4922 7443 -18715 -12526 -21912 -31412 -68326 -83640 -31720 1923 20409 15222 3160 -10949
6333 -10949 -24999 -28734 -42166 -25309 -6108 -15764 -28247 -29685 -14868 -22545 -13908 -9238 -354
6320 -354 -6980 -16593 -8635 -9517 -28658 -23280 -12932 -9209 18112 40197 28121 13763 -18794 -23011
6306 -23011 -2907 -836 -6459 -7453 -13535 -16066 10304 24001 58344 42013 341 -7774 -23680
6293 -23680 -30664 -36448 -29893 -10122 -5912 7292 -9625 -34282 -22382 -9828 1081 -2857 -6679
6280 -6679 -10224 10888 25142 39298 34458 26228 -1322 -31683 -34957 -18432 -36768 -60121 -46586
$$ packed form
6373a1186m969j8452q865L0427J4522K0960J8943j6429l7186M105q714o637O135
6360a7346Q200P003p142j027J4314K606O410k0824j5949L108n342J766P686J1615
6346d922J2365k6158O189r386r500l6914j5314N1920L3643J8486n187j2062j4109
6333a0949j4050l735j3432J6857J9201r656j2483j438J4817p677Q637M670Q884
6320c54o626r613P958q82j9141N378J0348L723K7321K2085j2076j4358l2557m217
6306b3011K0104K071n623r94o082k531K6370J3697L4343j6331m1672q115j5906
6293b3680o984n784O555J9771M210J3204j6917k4657J1900J2554J0909l938l822
6280f679l545K1112J4254J4156m840q230k7550l0361l274J6525j8336k3353J3535
$$ plain form
6267 -46586 -28932 -27407 -21775 -17883 -1051 6014 8221 18388 -3640 -19609 -23926 -4874 29102
6254 29102 25889 22121 -10187 -24877 6780 16759 28187 -3423 -23859 4888 21348 16000 6742
6241 6742 1995 -13028 -1045 6586 2567 11242 -7638 -7766 3655 -799 -21508 -32922 -8892
6228 -8892 3973 1458 2874 5647 -11437 -37733 -48641 -21656 -2505 -21793 -15768 -15167 16182
6215 16182 6654 -3893 -12226 -21812 -41714 -17314 -7571 -13535 -30060 -50996 -51686 -34512 -18171
6202 -18171 -7451 4059 2415 -11906 6225 17138 -1645 28136 15349 -4174 772 -2655
6190 -2655 -2371 16540 20037 2405 22710 33121 23320 15431 18204 17071 -15963 -40301 -33690 -46156
6176 -46156 -51171 -41543 -37661 -29965 -27680 6512 20520 -12671 -18631 -17292 -32130 -41994 -44244 -30871
$$ packed form
6267d6586J7654J525N632L892J6832P065K207J0167k2028j5969m317J9052L3976
6254B9102l213l768l2308j4690L1657R979J1428l1610k0436K8747J6460n348r258
6241F742m747j5023J1983P631m019Q675j8880j28J1421m454k0709j1414K4030
6228h892J2865k515J416K773j7084k6296j0908K6985J9151j9288O025O01L1349
6215A6182r528j0547q333r586j9902K4400R743n964j6525k0936o90J7174J6341
6202a8171J0720J1510j644j4321J8131J0913j8783K9781j2787j9523M946l427
6190b655K84J8911L497j7632K0305J0411r801p889K773j133l3034k4338O611j2466
6176d6156n015R628L882P696K285L4192J4008l3191n960J339j4838r864k250J3373
$$ plain form
6162 -30871 -21006 -20141 -19619 -24523 -26165 -1613 7670 83 -12264 -4288 6017 5046 -26196 -39244
6148 -39244 -12159 -5288 1156 -5749 -4378 6411 4923 -45 -13985 -3198 2488 -414 -9359 -17735
6134 -17735 -3066 -1012 -2897 -21088 -11872 15771 20399 11508 8116 -2484 -5559 -20216 -11304
6121 -11304 14466 26036 5659 4996 -30711 -28707 -16888 -28628 -33433 -26459 -17922 -1717 -8126
6108 -8126 -6836 7881 13406 18818 10714 19703 10779 21460 36235 15663 3386 21987 9034
6095 9034 -16546 -39889 -30895 -12654 -1413 -30926 -50430 -57013 -48030 -8262 -7428 5749 16251
6082 16251 -695 2818 18914 3918 -7817 -7222 7255 20717 5645 -31168 -33573 -27923 -9395
6069 -9395 -14041 -29468 -28416 -34725 -53469 -31797 -35942 -65138 -54254 -22725 -1064 37566 46550
$$ packed form
6162c0871R865Q65N22m904j642K4552R283p587j2347P976J0305r71l1242j3048
6148c9244K7085O871O444o905J371J0789j488m968j3940J0787N686k902q945q376
6134a7735J4669K054j885j8191R216K7643M628q891l392j0600l075j4657Q912
6121a1304K5770J1570k0377o63l5707K004J1819j1740m805O974Q537J6205o409
6108h126J290J4717N525N412q104Q989q924J0681J4775k0572j2277J8601j2953
6095I034k5580k3343Q994J8241J1241k9513j9504o583Q983L9768Q34J3177J0502
6082A6251j6946L513J6096j4996j1735N95J4477J3462j5072l6813k405N650J8528
6069i395m646j5427J052o309j8744K1672m145k9196J0884L1529K1661L8630Q984
$$ plain form
6056 46550 56513 49172 30769 -890 -17209 -9832 3960 -6098 3061 -9131 -24521 -16005 -11399
6043 -11399 -3345 -8929 -14319 -20485 -6746 1815 -2440 608 7404 10966 12161 11304 22294 21461 14128
6028 14128 15061 26524 30191 11878 17420 39637 31914 7811 16654 26276 13334 7677 6494 1450
6014 1450 -30445 -31105 -8159 1543 -15496 -15853 273 5577 19480 24708 11707 17498 19387 19147
6000 19147 26265 29222 48849 58012 30073 30569 22192 3344 18505 33405 27220 35100 28441 10418
5986 10418 5975 -2568 -4271 16121 40986 27896 6661 -3932 -11210 -4681 8703 41323 17394
5973 17394 -11426 -6974 -15484 1182 13239 46969 37176 13076 3309 5712 3668 -4474 -29555
5960 -29555 -49651 -68100 -58428 -47685 -36868 -9808 -14848 -18679 -26305 -3217 -2953 -6529 7562
$$ packed form
6056D6550R963p341j8403l1659j6319P377J3792j0058R159j2192j5390Q516M606
6043a1399Q054n584n390o166J3739Q561m255L048O796L562J195q57J0990q33p333
6028A4128R33J1463L667j8313N542K2217p723k4103Q843R622j2942n657j183n044
6014A450l1895o60K2946R702j7039l57J6126N304J3903N228j3001N791J889k40
6000A9147P118K957J9627R163k7939M96q377j8848J5161J4900o185P880o659j8023
5986A0418m443q543j703K0392K4865j3090k1235j0593p278O529J3384L2620k3929
5973A7394k8820M452q510J6666J2057L3730r793k4100r767K403k044q142k5081
5960b9555k0096j8449R672J0743J0817K7060n040l831p626K3088K64l576J4091
$$ plain form
5947 7562 932 -28326 -49167 -60985 -55831 -39320 -24857 2511 35167 47593 52334 40179 46462
5934 46462 60081 64718 51559 12731 -11801 -3818 -5902 -6812 -34514 -33977 -15324 10270 -422
5921 -422 17884 -4127 -31148 -24831 -21368 -36180 -13812 -17658 -10924 -25004 -42812 -30631 -16143
5908 -16143 -12688 18292 15294 19450 -8291 -29027 -40276 -52518 -24874 -25598 -33058 -29754 -36615
5895 -36615 -26997 -27922 -27311 -18138 7796 -750 -12690 -25932 -23596 -1744 -9894 -30431 -32587 -15271
5881 -15271 -995 7656 10194 20599 22167 12661 24080 12786 -3655 3681 1429 -3491 -10039
5868 -10039 -44287 -88042 -78932 -44609 -16885 -7451 -3370 -7715 18736 22644 -954 10016 -3027
5855 -3027 -11083 13685 -6436 -18383 -22956 11323 15887 21215 21010 -4561 -16721 -9892 -7631 7109
$$ packed form
5947G562o630k9258k0841j1818N154J6511J4463K7368L2656J2426M741j2155O283
5934D6462J3619M637j3159l8828k4532P983k084r10k7702N37J8653K5594j0692
5921d22J8306k2011k7021O317L463j4812K2368l846O734j4080j7808J2181J4488
5908a6143L455L0980k998M156k7741k0736j1249j2242K7644p24p460L304o861
5895c6615R618r25O11R173K5934q546j1940j3242K336K1852q150k0537k156J7316
5881a5271J4276Q651K538J0405J568r506J1419j1294j6441P336k252m920o548
5868a0039l4248m3755R110L4323K7724R434M081m345K6451L908k3598J0970j3043
5855c027q056K4768k0121j1947m573L4279M564N328k05k5571j2160O829K261J4740
$$ plain form
5841 7109 17201 18487 14347 -17322 -33680 -19620 4388 9219 40915 48059 40982 19496 29511
5828 29511 26280 18870 23249 15617 -9453 -1376 4612 11733 8581 3301 2968 -415 -26458 -21558
5814 -21558 -33718 -40179 -29765 -13480 -5010 -5472 12768 32820 20470 27542 26820 38269 47910
5801 47910 50784 12779 -19325 -11814 -5801 6580 24799 10488 -11028 -25396 -22245 -7976 2794
5788 2794 26518 44653 2021 -28866 -33746 -42218 -10639 -11127 -10832 -26280 -14063 -21821 -38953
5775 -38953 -13321 2437 21140 14201 6306 17347 12064 11402 12938 14991 4370 3058 5882 15452
5761 15452 13679 8688 11799 30332 14066 17747 27715 32097 22584 8244 24730 30204 3345
5748 3345 -3770 -15108 -41009 -38256 23496 62497 43415 32159 8553 631 -36725 -65978 -42419
$$ packed form
5841G109J0092J286m140l1669j6358J4060K4008M831L1696P144p077k1486J0015
5828B9511l231p410M379p632k5070Q077N988P121l152n280l33l383k6043M900
5814b1558j2160o461J0414J6285Q470m62J8240K0052j2350P072p22J1449R641
5801D7910K874l8005l2104P511O013J2381J8219j4311k1516j4368L151J4269J0770
5788B794K3724J8135m2632l0887m880q472L1579m88K95j5448J2217p758j7132
5775c8953K5632J5758J8703o939p895J1041n283o62J536K053j0621j312K824R570
5761A5452j773m991L111J8533j6266L681R968M382r513j4340J6486N474k6859
5748C345p115j1338k5901K753O1752L9001j9082j1256k3606p922l7356k9253K3559
$$ plain form
5735 -42419 -37808 -39546 -30055 -46773 -63572 -49913 -33795 -29881 -17254 5469 23893 11677 -21634
5722 -21634 -27230 -23127 -20661 -21958 -12706 -9005 -33692 -41914 -37701 -26851 -17942 -31861 -16043 -16381
5708 -16381 -16242 -23504 -33859 9482 36891 28800 16837 -19192 -23956 -18364 -12492 -19879 8608
5695 8608 38064 35979 12824 13124 1365 -3062 -2837 -18279 -23410 -33272 -3368 11239 -10505 -27599
5681 -27599 -8605 -3287 -1690 2424 5677 -1357 -16321 19956 26527 4547 -8398 -1999 -26904
5668 -26904 -64797 -71920 -52605 -29446 -34694 -25737 8865 25879 25502 37229 36335 50324 40722
5655 40722 25568 28685 47150 40740 -2886 -16911 -19217 -5210 22424 33630 36699 21391 6182
5642 6182 4485 -3498 -5285 -11148 -19881 -13369 -17753 -25188 -41092 -18093 -14575 -19487 -36523 -28501
$$ packed form
5735d2419M611j738R491j6718j6799J3659J6118L914J2627K2723J8424j2216l3311
5722b1634n596M103K466j297R252L701k4687q222M213J0850Q909j3919J5818l38
5708a6381J39p262j0355M3341K7409q091j1963l6029m764N592N872p387K8487
5695H608K9456k085k3155L00j1759m427K25j5442n131r862K9904J4607k1744j7094
5681b7599J8994N318J597M114L253p034j4964L6277O571k1980j2945O399k4905
5668b6904l7893p123J9315K3159n248Q957L4602J7014l77J1727q94J3989r602
5655D0722j5154L117J8465o410m3626j4025k306J4007K7634J1206L069j5308j5209
5642F182j697p983j787n863q733O512m384p435j5904K2999L518m912j7036Q022
$$ plain form
5628 -28501 -34409 -33320 -2367 7907 -9038 -22597 -35645 -26842 -6660 12636 -1297 -17132
5616 -17132 -1441 23732 23714 25333 5675 -21083 -9541 -1656 -2336 -11291 -27166 -9633 -2717 -20152
5602 -20152 -16666 -10417 -6497 12966 4059 9538 463 12406 8525 2296 7195 43685 23497 13341
5588 13341 3166 -5957 1248 -19888 4184 44647 26950 4165 -2514 -7006 1796 4965 17123
5575 17123 26396 16699 19090 29639 17192 9015 8630 -6142 -3816 23714 53485 33542 22141
5562 22141 59738 108156 90697 66914 46424 37655 12760 8359 27804 28137 10713 -4464 -4843
5549 -4843 -16012 -22383 -20560 -3531 5412 -19801 -22167 -10947 11379 21053 5587 -12857 -2084
5536 -2084 8895 1693 -27589 -25353 -25357 -30264 -7818 -7595 16528 32371 8950 7785 13903 15182
$$ packed form
5628b8501n908J089L0953J0274j6945j3559j3048Q803K0182J9296j3933j5835
5616a7132J5691K5173j8J619j9658k6758J1542P885o80q955j5875J7533O916j7435
5602b0152L486O249L920J9463q907N479r075J1943l881o229M899L6490k0188j0156
5588A3341j0175r123P205k1136K4072M0463j7697k2785o679m492Q802L169J2158
5575A7123R273r697K391J0549j2447q177l85j4772K326K7530K9771j9943j1401
5562B2141L7597M8418j7459k3783k0490q769k4895m401J9445L33j7424j5177l79
5549d843j1169o371J823J7029Q943k5213k366J1220K2326R674j5466j8444J0773
5536b084J0979p202k9282K236mm907K2446K23K4123J5843k3421j165O118J279
$$ plain form
5522 15182 18928 -1308 12650 8859 -6999 -3446 -13630 -14197 -15724 -25758 -22517 -1844 31988
5509 31988 44539 25050 -16289 -27138 -7405 -865 -11327 -20034 -32998 -14269 -1601 -34674
5497 -34674 -62396 -52820 -28602 -15999 -23138 1033 7119 2052 554 10410 27702 26425 15940
5484 15940 1281 -8628 -26054 -11444 -11501 -53103 -53033 -34873 -20698 -31824 -42878 -66061 -57126
5471 -57126 -47125 -64544 -61070 -52291 -50600 -80807 -64298 -28135 -7913 15642 52080 37425
5459 37425 -12541 -18572 -11645 312 318 -8705 37310 39196 -4333 -17525 -869 34383 33632 10007
5445 10007 1976 -22869 -30991 -20251 -14923 -21005 -50347 -48098 -2406 16755 16185 -11068 -26601
5432 -26601 -22369 -23045 -48149 -43085 -32033 -38044 -33541 -16285 -6346 -8632 2724 1117 -44296 -78580
$$ packed form
5522A5182L746k0236J3958l791j5858L553j0184n67j527j0034L241K0673L3832
5509C1988J2551j9489m1339j0849J9733O540j0462q707j2964J8729J2668l3073
5497c4674k7722R576K4218J2603p139K4171O086n067j498R856J7292j277j0485
5484A5940j4659r909j7426J4610n7m1602P0J8160J4175j1126j1054k3183Q935
5471e7126J0001j7419L474Q779J691l0207J6509L6163K0222K3555L6438j4655
5459C7425m9966o031O927J1957Or023M6015J886m3529j3192J6656L5252p51k3625
5445A0007q031k4845q122J0740N328o082k9342K249M5692J9161n70k7253j5533
5432b6601M232o76k5104N064J1052o011M503J7256R939k286J1356j607m5413l4284
$$ plain form
5418 -78580 -58885 -22814 -2358 -8024 -11088 -7251 -28092 -46330 -40322 -37457 -61183 -76333 -62541
5405 -62541 -29686 -16167 -24525 -26353 -16847 4220 -4030 -14439 -31429 -3455 22833 11627 -6316
5392 -6316 5174 43090 36869 21356 17463 9884 -7114 -912 5034 7184 13054 26445 19265 -3872
5378 -3872 -32133 -27080 -18107 -2536 -20638 -24652 -13235 -2748 1061 5430 32408 36562 41189
5365 41189 37379 19888 4171 4626 -5693 -4273 -2164 7576 -4037 -16561 -27171 -44658 -42262
5352 -42262 -15203 -7105 -158 -1300 41100 38387 28308 33625 26263 6841 9546 23960 12008
5339 12008 6818 20672 21667 922 -20573 -6603 -5112 -18766 -28551 -35718 -51041 -59775 -21271
5326 -21271 -22070 -41251 -33751 -11631 -17201 -18373 -22401 7888 23320 12515 -15711 -15645 18903 16443
$$ packed form
5418g8580J9695L6071K0456n666l064L837k0841j8238O008K865k3726j5150J3792
5405f2541L2855J3519q358j828R506K1067q250j0409j6990K7974K6288j1206j7943
5392f316J1490L7916o221j5513l893p579j6998O202N946K150N870J3391p180k3137
5378c872k8261N053Q973J5571j8102m014J1417J0487L809M369K6978M154M627
5365D1189l810j7491j5717M55j0319J420K109R740j1613j2524j0610j7487K396
5352d2262K7059Q098O947j142M2400k713j0079N317p362j9422K705J4414j1952
5339A2008n190J3854R95k0745k1495J3970J491j3654r785p167j5323q734L8504
5326b1271p99j9181P500K2120n570j172m028L0289J5432j0805k8226O6L4548k460
$$ plain form
5312 16443 36045 26732 29277 48028 37494 30032 16150 -11237 -27758 3418 15202 22727 31634
5299 31634 11453 5862 -3965 -36504 -36663 -18151 26796 36766 2834 -21706 -8150 9837 31377
5286 31377 27355 10137 664 -4959 -16074 -33779 -28513 -28507 -33953 -26883 -25271 -21504 -499 -3563
5272 -3563 -23872 -20907 -7693 -33529 -50240 -44650 -34095 -21554 -20685 16747 33306 20713 -15249
5259 -15249 -34994 -15802 -12386 -3053 17451 -6780 -20434 -9362 10529 -361 -19613 -45218
5247 -45218 -45955 -29976 -35161 -38588 -39952 -26325 -50014 -57033 -54405 -32448 -26274 -33621 1537 30656
5233 30656 38003 34789 5208 -23638 -36512 -28358 -14507 -4152 -4522 -4278 -20055 27254 30319
5220 30319 10391 -11449 -30918 -17466 21404 17572 -9154 -34815 -21686 -5131 -11818 -1015
$$ packed form
5312A6443J9602r313K545J8751j0534p462j3882k7387j6521L1176J1784P525Q907
5299C1634k0181n591r827l2539j59J8512M4947R970l3932k4540J3556J7987K1540
5286C1377m022j7218r473n623j1115j7705N266On446P070J612L767K1005l064
5272c563k0309K965J3214k5836j6711N590J0555J2541Q69L7432J6559j2593l5962
5259a5249j9745J9192L416R333K0504k4231j3654J1072J9891j0890j9252k5605
5247d5218p37J5979n185l427j364J3627k3689p019K628K1957O174p347L5158K9119
5233C0656P347l214k9581k8846j2874Q154J3851J0355l70K44j5777M7309L065
5220C0319j9928k1840j9469J3452L8870l832k6726k5661J3129J6555o687J0803
$$ plain form
5208 -1015 10156 14587 26749 16560 -22305 -52300 -57310 -36897 -51371 -63531 -66154 -16623 22765
5195 22765 39064 13143 -33334 -52112 -35539 1792 13806 28768 24098 15795 -6864 -9875
5183 -9875 11273 27090 32961 19338 19043 465 -11410 23322 55070 47364 25122 -9391 -2413
5170 -2413 33654 40351 2493 -12442 -35574 -25173 -18693 -10554 10039 -17431 -17194 -16803 -17961 -5340
5156 -5340 -5390 -19739 -34312 -19508 -8434 -11372 -22209 -34826 -15536 -7549 7971 -2170 7948
5143 7948 25835 35140 25707 30669 43505 21410 22328 27251 27501 9824 13673 -3046 -30063 -5117
5129 -5117 12932 4223 -8083 -1811 7142 19861 43721 26393 -16839 -15394 -9102 516 7594
5116 7594 -13928 -48991 -30006 -527 14634 36845 34153 26406 10255 -5996 -10970 -25867 1805
$$ packed form
5208a015J1171M431J2162j0189l8865k9995n010K0413j4474j2160k623M9531L9388
5195B2765J6299k5921m6477j8778J6573L7331J2014J4962m670q303k2659l011
5183i875K1148J5817N871j3623k95j8578j1875L4732L1748p706k2242l4513O978
5170b413L6067O697l7858j4935k3132J0401O480Q139K0593k7470K37L91j158J2621
5156e340n0j4349j4573J4804J1074k938j0837j2617J9290P987J5520j0141J0118
5143G948J7887R305r433M962J2836k2095R18M923K50j7677L849j6719k7017K4946
5129e117J8049q709j2306O272Q953J2719K3860j7328m3232J445O292R618P078
5116G594k1522l5063J8985K9479J5161K2211k692p747j6151j6251m974j4897K7672
$$ plain form
5103 1805 32504 31344 -18233 9723 -1758 -19112 -29561 -38050 -22308 -7973 -9438 -18382 -13828
5090 -13828 7333 4881 5592 11011 -6373 -32557 -37089 -26809 -28643 -19201 -28550 -80384 -72587 -18339
5076 -18339 9017 11314 23695 14005 31323 7223 -46558 -54434 -31087 9471 -18526 -40299
5064 -40299 -13343 -2709 3097 -15363 -30836 -41124 -43584 -18452 142 -17036 -38877 -57073
5052 -57073 -50891 -40376 -17974 -4219 -3182 -20897 -12616 -490 -23328 7644 -12713 -14135 -14038
5039 -14038 -5031 13402 -3514 -23466 -9097 -19347 -28151 -51202 -60022 -46063 -19020 2572
5027 2572 9196 19005 35017 20990 193 -12818 -21657 604 26824 46896 70477 57760 37890
5014 37890 24759 31078 31573 26427 28034 3405 -6246 -24571 -18395 -16693 7137 -10712 -47211
$$ packed form
5103A805L0699j160m9577K7956j1481j7354j0449q489J5742J4335j465q944M554
5090a3828K1161k452P11N419j7384k6184m532J0280j834R442r349n1834P797N4248
5076a8339K7356K297J2381r690J7318k4100n3781p876K3347M0558k7997k1773
5064d0299K6956J0634N806j8460j5473j0288k460K5132J8594j7178k1841j8196
5052e7073O182J0515K2402J3755J037j7715Q281J2126k2838L0972k0357j422R7
5039a4038R007J8433j6916j9952J4369j0250q804k3051q820J3959K7043K1592
5027B572O624R809J6012j4027k0797j3011q839K2261K6220K0072K3581j2717j9870
5014C7890j3131O319M95n146J607k4629r651j8325O176J702K3830j7849l6499
$$ plain form
5001 -47211 -26194 23787 26758 14735 -900 -4530 -4610 -6519 20606 31676 11597 -8098 -22491
4988 -22491 -20748 9895 1433 -4595 -4256 -29760 -33356 -41592 -37562 -26331 -2808 11716 -13204
4975 -13204 -778 33805 19673 -3367 -13105 1258 18305 -9598 10581 35035 14605 -1411
4963 -1411 29514 64206 94977 48033 -24036 -46118 -37324 13406 2191 -40416 -32189 -11117
4951 -11117 5441 -25544 -48980 -40299 -30918 -33219 -23909 -14058 -14127 -36611 -49877 -27653 -22027 -26316
4937 -26316 -37069 -14303 -7538 -5098 -11750 -30710 -20079 -36487 -69922 -58771 -40194 -39206 -32665
4924 -32665 -44061 -20812 -18947 -25663 -56548 -72743 -15646 9963 37359 32493 -859 -27024
4912 -27024 2552 18790 6671 13711 30005 20277 -5603 -11285 -14552 -23688 4396 24478 34851
$$ packed form
5001d7211K1017M9981K971j2023j5635l630q0j909K7125J1070k0079j9695j4393
4988b2491J743L0643q462o028L39k5504l596q236M030J1231K3523J4524k4920
4975a3204J2426L4583j4132k3040r738J4363J7047k7903K0179K4454k0430j6016
4963a411L0925L4692L0771m6944p2069k2082Q794N0730j1215m2607Q227K1072
4951a1117J6558l0985k3436Q681R381k301R310R851o9k2484j3266K2224N626m289
4937b6316j0753K2766O765K440o652j8960J0631j6408l3435J1151J8577R88O541
4924c2665j1396K3249J865o716l0885j6195N7097K5609K7396m866l3352k6165
4912b7024K9576J6238j2119P040J6294r728k5880n682l267r136K8084K0082J0373
$$ plain form
4899 34851 24860 -33095 -37407 -10210 5044 17022 -2174 -13437 10569 1717 -6182 -9462 -7322
4886 -7322 -30067 -32414 -46562 -33512 -6400 -14586 -18784 4881 30373 40478 31668 -9519 -16487
4873 -16487 4931 12176 13203 16551 21341 16834 3372 2367 42061 45897 23293 20986 15881 12966
4859 12966 27858 26750 14421 435 -4075 -3636 -29319 -35531 -25772 -31595 -10476 -35159 -60857
4846 -60857 -54110 -38311 -39951 -35202 -23753 -3579 19649 21813 -14267 -39563 -8887 -5521 -6855
4833 -6855 3917 20275 47943 71205 50158 48539 50193 17483 -2606 10525 12208 2819 6968
4820 6968 -8910 -18629 10209 2838 -31998 -56358 -31430 -3675 -1260 -9017 -10214 -21041 -18715
4807 -18715 -37192 -33772 -28959 -20896 -8926 -4798 26980 27195 36042 54329 37858 30857 27849 21511
$$ packed form
4899C4851r991n7955m312K7197J5254J1978j9196j1263K4006q852p899l280K140
4886g322k2745k347j4148J3050K7112q186m198K3665K5492J0105q810m1187o968
4873a6487K1418P245J027L348M790m507j3462j005L9694L836k2604k307n105k915
4859A2966J4892j108j2329j3986m510M39k5683o212R759n823K1119k4683k5698
4846f0857O747J5799j640M749J1449K0174K3228K164l6080k5296L0676L366j334
4833f855J0772J6358K7668K3262k1047j619J654l2710k0089J3131J683r389M149
4820F968j5878r719K8838p371l4836k4360K4928K7755K415p757j197j0827K326
4807a8715j8477L420M813Q063J1970M128L1778K15Q847J8287j6471p001l008o338
$$ plain form
4793 21511 523 -19437 -35895 -43800 -26161 -6038 -2512 5406 21576 16432 28456 31948 8908
4780 8908 880 3326 18909 51578 53045 45572 50657 41352 37941 17328 36519 25042 13324
4767 13324 22837 46647 65218 49998 33285 42463 34631 48147 21653 24577 37422 13033 -33332
4754 -33332 -59547 -31495 -20993 2160 13581 26265 -140 121 5758 -29274 -34040 -53374 -30039
4741 -30039 -12352 -7869 -29961 -31844 -21557 -22897 -14764 -11915 -18524 -20402 13368 18303 45065
4728 45065 23401 21031 54457 83016 61110 70993 65944 45737 56432 62805 39664 38852 70
4715 70 11722 24109 23658 2981 5042 -6962 -19638 -18577 -1516 25675 14207 -3610 6564
4702 6564 -3409 -18618 -19743 17213 1792 -9781 22782 24729 15089 -10405 7221 2882 -22017
$$ packed form
4793B1511k0988j9960j6458p905J7639K0123L526P918J6170n144J2024L492k3040
4780H908q028K446J5583L2669J467p473N085r305l411k0613J9191j1477j1718
4767A3324R513K3810J8571j5220j6713R178p832J3516k6494K924J2845k4389m6365
4754c3332k6215K8052J0502K3153J1421J2684k6405K61N637l5032m766j9334K3335
4741c0039J7687M483k2092j883J0287j340Q133K849o609j878L3770M935K6762
4728D5065k1664k370L3426K8559k1906R883n049k0207J0695O373k3141q12l8782
4715G0J1652J2387m51k0677K061j2004j2676J061J7061K7191j1468j7817J0174
4702F564r973j5209j125L6956j5421j1573L2563J947r640k5494J7626m339k4899
$$ plain form
4689 -22017 -14924 -22773 -48645 -46875 -25610 -20577 -30395 -19033 -20811 -33205 -38285 -25787 -19511
4676 -19511 -18131 10475 14933 -2847 -10425 -5505 975 3676 9487 -10315 -24411 8954 22844
4663 22844 43873 49086 60599 42504 3759 2517 -4284 -37552 -27637 -49813 -67797 -79492 -66608
4650 -66608 -51426 -35964 7231 6045 -4456 -16454 -36296 -26496 -23329 6705 31622 10480
4638 10480 -11297 -17699 17859 5016 4330 -1489 -14427 -25738 -2215 6801 1917 4628 14438
4625 14438 25800 35762 771 -36696 -50405 -44606 -25089 -22183 -19128 -6507 5192 11740 36048
4612 36048 28378 22558 2658 -21360 -45699 -39907 15570 -7343 -6684 6218 -5506 -9485 -4545
4599 -4545 -23896 -24892 -14453 -14509 -1533 28716 21738 14752 15188 26943 17460 -24396 -25044 -18938 -4659
$$ packed form
4689b2017P093p849k5872J770K1265N033r818J1362j778j2394n080J2498O276
4676a9511J380K8606M458j7780p578M920O480K701N811j9802j4096L3365J3890
4663B2844K1029N213J1513j8095l8745j242o801l3268R915k2176j7984j1695J2884
4650f6608J5182J5462M3195j186j0501j1998j9842R800L167L0034K4917k1142
4638A0480k1777o402L5558j2843o86n819j2938j1311K3523R016m884K711R810
4625A4438J1362R962l4991l7467j3709N799J9517K906L055J2621J1699O548K4308
4612C6048p670n820j9900k4018k4339N792N5477k2913O59J2902j1724l979M940
4599d545j9351r96J0439n6J2976L0249o978o986M36J1755r483m1856o48O106J4279
$$ plain form
4584 -4659 -32707 -45050 -35689 -14412 -10032 -21849 23428 24632 14287 -973 -15933 -32696 -30357
4571 -30357 -15825 5423 24785 10599 25494 46434 56183 16233 -11823 3495 8906 10855
4559 10855 20950 5027 -13986 -21898 -11840 10281 21708 19937 59421 76075 79886 64271
4547 64271 73520 62317 39808 28527 21439 25832 -11912 -39974 -13573 -7006 -30154 -39013 -55118
4534 -55118 -31096 -15229 -34544 -34015 -10907 7448 -2844 -17838 -15183 10192 32403 41047 25551
4521 25551 34690 38654 21835 20978 3983 -11971 -23194 -29300 -5918 -5793 -7780 5964 23738
4508 23738 31511 10371 29505 52123 36715 26910 25976 4107 -27944 -45203 -29852 -7685 -16482
4495 -16482 4943 39740 55606 50681 34203 7725 12176 -8318 -7996 -4334 -6955 -5434 -11807
$$ packed form
4584d659k8048j2343R361K1277M380j1817M5277J204j0345j5260j4960j6763K339
4571c0357J4532K1248J9362j4186J4895K0940R749l9950k8056J5318N411J949
4559A0855J0095j5923j9013p912J0058K2121J1427j771L9484J6654L811j5615
4547F4271R249j1203k2509j1281p088M393l7744k8062K6401O567k3148q859j6105
4534e5118K4022J5867j9315N29K3108J8355j0292j4994K655K5375K2211Q644j5496
4521B5551R139L964j6819q57j6995j5954j1223o106K3382J25j987J3744J7774
4508B3738P773k1140J9134K2618j5408r805r34k1869l2051j7259J5351K2167q797
4495a6482K1425L4797J5866m925j6478k6478M451k0494L22L662k621J521o373
$$ plain form
4482 -11807 3943 -5217 12604 21230 -4055 -20955 -24078 -41088 -34805 -27464 -4342 28826 34255
4469 34255 11603 -2405 -340 19506 26956 26590 -6332 -837 19711 23119 14463 45116 34743
4456 34743 47584 44517 20925 15060 17409 10483 9941 -6781 -13703 -32971 -24826 -5416 5025
$$ packed form
4482a1807J5750r160J7821Q626k5285j6900l123j7010O283P341K3122L3168N429
4469C4255k2652j4008K065J9846P450l66l2922N495K0548L408q656L0653j0373
4456C4743J2841l067k3592n865K349o926n42j6722o922j9268Q145J9410J0441
$$ [...]
##END NTUPLES=NMR SPECTRUM
##END=
