##TITLE=Analysis number 313293
Compound Code rf 00408
Book Reference 439/57/34
Project Code qc-cat
Chemist Name ronp
##JCAMPDX= 6.0         $$ Bruker NMR JCAMP-DX V2.0
##DATA TYPE= NMR SPECTRUM
##DATA CLASS= NTUPLES
##ORIGIN= Bruker BioSpin GmbH
##OWNER= NMR
$$ XWIN-NMR		Version 3.5
$$ Thu Sep  1 14:50:04 2005 GMT Daylight Time (UT+1h)  MAYBRIDGE\NMR@NMR_250MHZ
##.OBSERVE FREQUENCY= 250.131544655141
##.OBSERVE NUCLEUS= ^1H
##.ACQUISITION MODE= SIMULTANEOUS (DQD)
##.ACQUISITION SCHEME= undefined
##.AVERAGES= 16
##.DIGITISER RES= 18
##SPECTROMETER/DATA SYSTEM= dpx250
##.PULSE SEQUENCE= zg30
##.SOLVENT NAME= CDCl3
##.SHIFT REFERENCE= (INTERNAL, CDCl3, 0, 16.456)
##AUDIT TRAIL= $$ (NUMBER, WHEN, WHO, WHERE, WHAT)
$$ ##TITLE= Audit trail, XWIN-NMR		Version 3.5
$$ ##JCAMPDX= 5.01
$$ ##ORIGIN= Bruker BioSpin GmbH
$$ ##OWNER= NMR
$$ C:\u/data/dgb/nmr/ADRS/8860/pdata/1/auditp.txt
$$ ##AUDIT TRAIL=  $$ (NUMBER, WHEN, WHO, WHERE, WHAT)
(   1,<2005-09-01 14:49:19.53 +100>,<MAYBRIDGE\NMR>,<NMR_250MHZ>,
      <created by zg, POWCHK disabled, PULCHK disabled
       configuration hash MD5:
       62 19 C7 07 E1 42 D1 B7 37 6C 3D D0 77 39 F9 E6
       data hash MD5: 64K
       15 B6 4C 30 26 F9 1F AF 25 C8 76 E1 5A F2 81 57>)
(   2,<2005-09-01 14:49:34.42 +100>,<MAYBRIDGE\NMR>,<NMR_250MHZ>,
      <Start of raw data processing
       ef LB = 0.3 FT_mod = 6 PKNL = 1 SI = 32K 
       data hash MD5: 32K
       85 5F 9C DA FA D5 CE C5 8B 0D C4 40 D6 E0 6F 43>)
(   3,<2005-09-01 14:49:39.13 +100>,<MAYBRIDGE\NMR>,<NMR_250MHZ>,
      <apk 
       data hash MD5: 32K
       0C D9 EE 48 8D A9 B9 22 A7 50 94 1A E3 F6 8A A7>)
(   4,<2005-09-01 14:49:40.64 +100>,<MAYBRIDGE\NMR>,<NMR_250MHZ>,
      <abs ABSG = 5 
       data hash MD5: 32K
       81 F7 8E 7A A2 49 A8 5C FE 87 D2 ED C4 73 C9 F1>)
$$ ##END=
$$ 
$$ hash MD5
$$ 7C 23 9E 7F 73 32 44 0F 4D A2 A6 51 68 EF EF 55
##$RELAX= 
##$RELAX= 
##$RELAX= 
##$RELAX= 
##$RELAX= 
##$RELAX= 
##$RELAX= 
$$ Bruker specific parameters
$$ --------------------------
##$DU= <C:\u>
##$EXPNO= 8860
##$NAME= <ADRS>
##$PROCNO= 1
##$TYPE= <nmr>
##$USER= <dgb>
##$AMP= (0..31)
100 100 100 100 100 100 100 100 100 100 100 100 100 100 100 100 100 100 
100 100 100 100 100 100 100 100 100 100 100 100 100 100 
##$AQSEQ= 0
##$AQ_mod= 3
##$AUNM= <au_zg>
##$AUTOPOS= <11 >
##$BF1= 250.13
##$BF2= 250.13
##$BF3= 250.13
##$BF4= 250.13
##$BF5= 500.13
##$BF6= 500.13
##$BF7= 500.13
##$BF8= 500.13
##$BYTORDA= 1
##$CFDGTYP= 0
##$CFRGTYP= 5
##$CHEMSTR= <none>
##$CNST= (0..31)
1 1 145 1 1 1 1 1 1 1 1 1 1 1 1 1 1 1 1 1 1 1 1 1 1 1 1 1 1 1 1 1 
##$CPDPRG= <>
##$CPDPRG1= <>
##$CPDPRG2= <>
##$CPDPRG3= <>
##$CPDPRG4= <mlev>
##$CPDPRG5= <mlev>
##$CPDPRG6= <mlev>
##$CPDPRG7= <mlev>
##$CPDPRG8= <mlev>
##$CPDPRGB= <>
##$CPDPRGT= <>
##$D= (0..31)
0 1 0 0 0 0 0 0 0 0.06 0 0 0 0 0 0 0.0002 0 0 0 0 0 0 0 0 0 0 0 0 0 0 
0 
##$DATE= 1125582557
##$DBL= (0..7)
120 120 120 120 120 120 120 120 
##$DBP= (0..7)
150 150 150 150 150 150 150 150 
##$DBP07= 0
##$DBPNAM0= <>
##$DBPNAM1= <>
$$ [...]
##$SUBNAM8= <"">
##$SUBNAM9= <"">
##$SW= 20.6930455092707
##$SWIBOX= (0..15)
0 0 3 0 0 0 0 0 0 0 0 0 0 0 0 0 
##$SW_h= 5175.983436853
##$TD= 65536
##$TD0= 1
##$TE= 295.16
##$TE2= 300
##$TE3= 300
##$TEG= 300
##$TL= (0..7)
0 120 120 120 120 120 120 120 
##$TP= (0..7)
150 150 150 150 150 150 150 150 
##$TP07= 0
##$TPNAME0= <>
##$TPNAME1= <>
##$TPNAME2= <>
##$TPNAME3= <>
##$TPNAME4= <>
##$TPNAME5= <>
##$TPNAME6= <>
##$TPNAME7= <>
##$TPOAL= (0..7)
0.5 0.5 0.5 0.5 0.5 0.5 0.5 0.5 
##$TPOFFS= (0..7)
0 0 0 0 0 0 0 0 
##$TUNHIN= 0
##$TUNHOUT= 0
##$TUNXOUT= 0
##$USERA1= <user>
##$USERA2= <user>
##$USERA3= <user>
##$USERA4= <user>
##$USERA5= <user>
##$V9= 5
##$VALIST= <valist>
##$VCLIST= <CCCCCCCCCCCCCCC>
##$VD= 0
##$VDLIST= <DDDDDDDDDDDDDDD>
##$VPLIST= <PPPPPPPPPPPPPPP>
##$VTLIST= <TTTTTTTTTTTTTTT>
##$WBST= 1024
##$WBSW= 4
##$XGAIN= (0..3)
0 0 0 0 
##$XL= 0
##$YL= 0
##$YMAX_a= 451756
##$YMIN_a= -415839
##$ZGOPTNS= <>
##$ZL1= 120
##$ZL2= 120
##$ZL3= 120
##$ZL4= 120
##$ABSF1= 16.45597
##$ABSF2= -4.237202
##$ABSG= 5
##$ABSL= 3
##$ALPHA= 0
##$AQORDER= 0
##$ASSFAC= 0
##$ASSFACI= 0
##$ASSFACX= 0
##$ASSWID= 0
##$AUNMP= <proc_1d>
##$AZFE= 0.1
##$AZFW= 0.1
##$BCFW= 0
##$BC_mod= 0
##$BYTORDP= 0
##$COROFFS= 0
##$CY= 12.5
##$DATMOD= 1
##$DC= 0
##$DFILT= <>
##$DTYPP= 0
##$F1P= 14.0000005364418
##$F2P= -0.99999901652339
##$FCOR= 0.5
##$FTSIZE= 32768
##$FT_mod= 6
##$GAMMA= 0
##$GB= 0
##$INTBC= 1
##$INTSCL= 1
##$ISEN= 128
##$LB= 0.3
##$LEV0= 0
##$LPBIN= 0
##$MAXI= 10000
##$MC2= 0
##$MEAN= 0
##$ME_mod= 0
##$MI= 0
##$NCOEF= 0
##$NC_proc= -1
##$NLEV= 6
##$NOISF1= 0
##$NOISF2= 0
##$NSP= 0
##$NTH_PI= 0
##$NZP= 0
##$OFFSET= 16.45597
##$PC= 1
##$PHC0= -71.91085
##$PHC1= 0.0109261
##$PH_mod= 1
##$PKNL= yes
##$PPARMOD= 0
##$PSCAL= 4
##$PSIGN= 0
##$REVERSE= no
##$SF= 250.130016513489
##$SI= 32768
##$SIGF1= 0
##$SIGF2= 0
##$SINO= 400
##$SIOLD= 32768
##$SREGLST= <1H.CDCl3>
##$SSB= 0
##$STSI= 32768
##$STSR= 0
##$SW_p= 5175.98343685301
##$SYMM= 0
##$S_DEV= 0
##$TDeff= 65536
##$TDoff= 0
##$TI= <Analysis number 999999
Compound Code 99
Book Reference 9
Project Code 9>
##$TILT= no
##$TM1= 0
##$TM2= 0
##$TOPLEV= 0
##$USERP1= <user>
##$USERP2= <user>
##$USERP3= <user>
##$USERP4= <user>
##$USERP5= <user>
##$WDW= 1
##$XDIM= 32768
##$YMAX_p= 425813603
##$YMIN_p= -143316
$$ End of Bruker specific parameters
$$ ---------------------------------
##NTUPLES= NMR SPECTRUM
##VAR_NAME=  FREQUENCY,     SPECTRUM/REAL,   SPECTRUM/IMAG
##SYMBOL=    X,             R,               I
##VAR_TYPE=  INDEPENDENT,   DEPENDENT,       DEPENDENT
##VAR_FORM=  AFFN,          ASDF,            ASDF
##VAR_DIM=   32768,         32768,           32768
##UNITS=     HZ,            ARBITRARY UNITS, ARBITRARY UNITS
##FACTOR=    0.157963299565203, 1,           1
##FIRST=     4116.13223898487, 0,            0
##LAST=      -1059.85119786814, 0,           0
##MIN=       -1059.85119786814, -143316,     0
##MAX=       4116.13223898487, 425813603,    0
$$ Real data points
##PAGE= N=1
##DATA TABLE= (X++(R..R)), XYDATA
$$ [...]
24314A0957q178j8716k274M651R834J6036M303j5222o436P982N890j572P151M172
24300A8578m5q082n663m694L457J35j0586l098P971o237j1139L78P738Q01k344
24285a2830M310O233J0332R537m509p777j0751M079Q911r14M756J134k470k335
24271G706j899N965n784m407N579k174q654J6456K565m150o134k790j477L223
24257D025m430L22L758L203o930K663n420M679O418O420J212j3862r113k624K348
24242g331Q763m101k278L798j380J90m2k605j345j137q724m258Q510M124N451
24227b365m830O429P27r563O449r38k447o826r1r11j637L737Q614J4301K186j01
24211A2734P29p567j2527l987J767O88O92J1766P32P351N862K942j6853m958L466
$$ y = [10957, 2779, -15937, -18211, -13560, -3726, 12310, 16613, 1391, -5045, 2937, 8827, 7255, 14406, 18578, 18533, 10451, 4788, 94, 3551, 3686, -6900, -9998, -2027, -8264, -19403, -19025, -11287, -10486, -12830, -8520, -2287, 8045, 17582, 13073, 5296, -5455, -1376, 7535, 6621, 11377, 12511, 10041, 7706, 5807, 11772, 5988, 1581, 7160, 4986, -3668, 12788, 15353, 11203, 5069, 2279, 802, 4025, -405, -83, 3675, 6878, -52, 2611, -2809, 1870, 8288, 14708, 15920, 2058, -7055, -9679, -7331, 1432, -2669, -4947, -1149, -2529, -2339, -2381, -4986, -6331, -7468, -16192, -20450, -11940, -7816, -2365, -7195, -766, -39, -9602, -3153, -4091, -6538, -13364, -13455, -14366, -16003, -12266, -3652, 10649, 12835, 12734, 13463, 5896, -6631, -10618, -8851, -8163, -7471, 4295, 5027, 12378, 18240, 21182, 4329, -629, 2837]
24196B837N794j1190q883j236K062N394N793o7p935J756j186J57L71J389k836
24181g780m701n35l740J1616J881n094m852p766O951N057j458M97j241j2799m733
24166b8697J3145J2253n189o327n872J752N053m458L886M486O830J784n381k748
24152i483n732M333O350K064m403L652P245K068J610O333o500k556K409J76o971
24137E95M893j226o005J024L36J520p26p655r64N832O836J889k329N873j07m149
24121E637j789n914O379j0560j1215l232Q342J372j155P588m870O257J5495j0249
24107B086j2809J722J0225Q637O656l567m198n259Q9K947q209j003Q111N033K341
24092A2802r335q340J19K013J2556J506L299r48n108o131j966L077R49k947K353
$$ y = [2837, 8631, -2559, -11442, -12678, -10616, -5222, 571, 504, -7431, -5675, -6861, -6704, -6333, -4944, -7780, -12481, -13016, -16756, -5140, -3259, -8353, -13205, -20971, -14020, -8963, -10421, -9924, -11165, -23964, -28697, -15552, -3299, -8488, -14815, -20687, -18935, -13882, -18340, -14454, -9968, -3138, -1354, -6735, -9483, -15215, -10882, -4532, -2468, -6871, -3219, 4026, 6094, 7704, 14037, 7537, 4981, 7390, 7566, 595, 5488, 4262, -1743, -719, -383, 1137, 411, -7244, -8208, -2376, 4460, 6349, 4020, 9893, 9786, 5637, 3848, -2066, 4313, -6247, -17462, -20694, -12352, -10980, -12135, -4547, -9417, -3160, 12335, 2086, -10723, -9001, 1224, 9861, 16517, 12950, 8752, 3493, 3582, 6529, -1680, -2683, 5428, 10461, 12802, 3467, -4873, -4754, -2741, 9815, 11321, 14620, 13672, 8564, 2433, 467, 3544, 4493, 1546, 3899]
24077C899L666n769j440l827q257o143J2493N310q028j5354l532J2057m599O020
24063a3504M385K709K659N903J5109J205n215j292j4979K190J612J1029L594O714
24049B2119m299p350l250l135J03J959m669p311m204k629r81N314j835M0K626
24034g502N602N789N465r318j10J209n066n64j3857p127J3286P444k047p002k18
24019a4016L30R940m624P531M139J028P027p938Q982R643r965j3447n147k416
24005h933O751j425N406j0358j441J1807K950j0761N474R767K826q976p841O334
23991A580l104J291M312l010j945p533L569P238M784q276K768P928l739r293J183
23976b247j498j1306r850M4O442J4554P189q762l66m32M121N530l804Q256J155
$$ y = [3899, 7565, 1796, 356, -3471, -11728, -17871, -5378, -68, -8096, -23450, -26982, -14925, -19524, -13504, -9119, -6410, -3751, 2152, 17261, 18466, 13251, 11959, -3020, -830, 782, 11811, 15405, 22119, 17820, 10470, 7220, 4085, 4188, 6147, 1478, -5833, -10037, -12666, -13647, -8333, -10168, -10128, -7502, -1900, 3889, 9354, 36, -74, 1135, -3931, -4495, -18352, -25479, -12193, -4749, -6796, -13798, -14016, -13686, -3746, -8370, -839, 3300, 4328, 11355, 3417, 12399, 22042, 12077, -1370, -6517, -8933, -2182, -3607, 1799, -8559, -10000, 1807, 4757, -6004, -530, 9237, 12063, 3087, -4754, 1580, -1524, -233, 4079, 1069, -876, -8409, -4840, 2398, 7182, -1094, 1674, 9602, 5863, -3430, -2247, -3745, -15051, -24901, -24857, -18415, -3861, 3328, -5434, -5800, -6232, -2111, 3419, -385, 7871, 9026]
23961I026p345q029k12L326m194n892O17O228r892q970l69N827J3358l662j508
23946a1691j17L416O173J2308J2538L070M03j8100j4602l564J2696Q507L872r345
23932E564M815j746n641j464j066k97q515j79q991K792J9543J191q888j0128j952
23917a4962n09K377l003N537Q050j0887L829N766k913n32N982k163k026j211O197
23902d68l477j566J614k14q992j081L770K690L378l891M083R305P72q463K638
23887I8l602L432j1300q469J0735P210j185r68J571L473Q75R68j419N409o37N456
23871A1647m874O060j0846j0085L342n591N192O744m211j0474N672J5269n491
23858B354o205M5P600r29p77r426k204j207J028P580M748l433m398j207J0577
$$ y = [9026, 1681, -6348, -6560, -3234, -7428, -13320, -12703, -6475, -16367, -25337, -25706, -19879, -6521, -10183, -11691, -11808, -8392, -2219, 10089, 22627, 25697, 26100, 8000, -6602, -10166, 2530, 11037, 14909, 5564, 10379, 8633, 2992, 1528, 462, 165, -8350, -8529, -17520, -14728, 4815, 6006, -2882, -13010, -14962, -15471, -13094, -16097, -10560, -2510, -13397, -9568, -3802, -6715, -7247, -1265, -3428, -5454, -6665, -468, -3945, -5511, -3897, -4111, -13103, -14184, -10414, -7724, -4346, -8237, -4154, 5151, 5923, -2540, 98, -3504, -72, -11372, -19841, -9106, -1896, -3081, -4049, -2478, 995, 1870, 2838, 1419, 6828, 6191, 11647, 6773, 12833, 1987, -8098, -4756, -10347, -5155, 1589, -2622, -13096, -7424, 7845, 2354, -3851, -3806, 3794, 2865, 2088, -7338, -9542, -10749, -9721, -2141, 2607, -826, -5224, -6431, 4146]
23843D146N497l767r768k26m839K952o270k446J4234N870M751K876j0850j6760
23829a4600j387N789O679j93N906O969K980k754l333l222p897J470N347q23N384
23814F315J2960j101L79K827q367j6047M905K917K382n741l462Q030mL903k23
23799I673j2226n898J3516k91j4255k634Q625J3425M206j1955k726L828r44o12
23785A732R72k340J604O719l772m499K293l060o828k031O57J0521J0327k097M74
23770A0672N801r298j1573q735Q76K817O766Q485q816O252L389o298l246N013
23756B105J1899p746k067j489O79J481k342j0653K24M806N649m219p773N527J2926
23741I007l419l919m894j1294l664J1442J381L881L924m848O773L364m300O20
$$ y = [4146, 9643, 5876, -3892, -4118, -8957, -6005, -12275, -14721, -487, 5383, 10134, 13010, 2160, -14600, -15987, -10198, -3519, -3712, 2194, 9163, 12143, 9389, 6056, 2834, -5063, -3593, 1754, 931, 6315, 19275, 18174, 18553, 21380, 13013, -3034, 1871, 4788, 7170, 1429, -2033, 5997, 5993, 9896, 9673, -2553, -8451, 5065, 4774, -9481, -12115, -3490, 9935, 14141, 2186, -540, 3288, 2344, 1732, 2704, 364, 1968, 8687, 4915, 416, 2709, -351, -7179, -9210, -8553, 1968, 12295, 10198, 10672, 16473, 7175, -4398, -13133, -12257, -9440, -2674, 5811, -3005, 3247, 6636, 338, -2908, 2105, 14004, 6258, 4191, 2702, 3381, 4862, 2520, -8133, -7909, -3103, 2546, -1673, -9446, -3919, 9007, 5588, 1669, -3225, -14519, -18183, -6741, -5360, -1479, 2445, -2403, 4370, 7734, 3434, 4054]
23727D054o855N804K429R546Q606p733p002M331J1862r019j5165j1272l536o725
23713b0675J2717L167M165q58l41K271o469o788J216K051O209O342M089K860j349
23698H607M192q343j4975M656O428p938J839l259m785L950j2498o098J359J4753
23684a2112J2152L317m874k975j6229j7345Q177R910P710Q844p562L428N337P679
23670E457M653o359k035J600n829p104K306L635J2513q44m285o819L10L882o071
23655d990o063M917P703L925J1466P446j0275o087p408o928k211J369P055L205
23641C124R40L73k946j3208m458m778N223L631O578k528Q072N976m778l628Q20
23626a587M231P797l456J781N01M42j2554p890n697P614M579j124M685k266o136
$$ y = [4054, -2801, 3003, 5432, 14978, 23584, 15851, 8849, 13180, 25042, 16023, 858, -10414, -13950, -20675, -7958, -4791, -626, -1484, -1825, 446, -6023, -12811, -11595, -9544, -3335, 3007, 7096, 9956, 8607, 12799, 4456, -10519, -5863, 565, -7373, -5534, -8793, -13578, -9628, -22126, -28224, -26865, -12112, 40, 3357, -1517, -4492, -20721, -38066, -29889, -19979, -12269, -3425, -10987, -7559, -2222, 5457, 10110, 3751, 1716, 3316, -2513, -9617, -7311, -3676, 8837, 7993, 3708, -3111, -2801, 1081, -4990, -11053, -6136, 1567, 5492, 16958, 24404, 14129, 8042, 634, -6294, -8505, -7136, -81, 3124, 4064, 4437, 1491, -11717, -16175, -20953, -15730, -12099, -5521, -8049, 23, 5999, 1221, -2407, -1587, 2644, 10441, 6985, 8766, 9267, 9709, -2845, -10735, -16432, -8818, -4239, -5363, -678, -2944, -9080]
23611i080K798j60n228J0269k984j216R468R01k126q585r153Q351J0848o398o786
23596i081o132J0714O354L632J448O188J143l492O991k308j1954r018N191Q143
23582G819p014p680J3743M201r141j2396n968K999L554k842J505J92l851P988
23568f891N860m600m554j712K748Q430j025k446n609k574L473O371M847p917L586
23553b013N446j126j742j446O383O451n402J890j0306j1007j487k781J1146k630
23539h624J474M939M198L808n596L84r305n181L039O386n250m134O676P542p76
23524d20o283J362L564o636m11m484j492J310j796j423j626m496R981O619l761
23509i992j658K638O806p370r54j23Q637O686J3059M877n121j3701l693P404M92
$$ y = [-9080, -6282, -6442, -11670, -1401, -4385, -5601, 3867, 4768, 2642, -5943, -15096, -6745, 4103, -2295, -9081, -15213, -4499, 1855, 5487, 6935, 13123, 14266, 10774, 17765, 15457, 3503, -5515, -324, 7819, 805, -6875, 6868, 11069, 1928, -10468, -16436, -13437, -9883, -12725, -11220, -11028, -14879, -6891, -1031, -5631, -10185, -11897, -9149, -719, -1744, -4190, -9799, -12373, -8900, -2529, 2318, -5599, -2013, 3433, 2307, 565, -881, 5502, 11953, 6551, 8441, -1865, -12872, -14359, -17140, -5994, -8624, -7150, -2211, 1987, 5795, 199, 583, -8722, -13903, -10864, -4478, -9728, -13862, -7186, 356, -420, -6703, -5341, -1777, -8413, -8824, -13308, -14800, -13490, -15286, -16709, -18335, -22831, -12850, -6231, -9992, -11650, -9012, -2206, -9576, -10530, -10653, -2016, 4670, 17729, 22606, 17485, 3784, 91, 7495, 7987]
23494G987p519l324Q660M76j421J937L49l514L427q777J21P983L685P044j3350
23479C764n796L499M30O174m832r386O717P654L800m137J701k748K915K515j1537
23464G33K050p47l298r585M924N870r477q787j585J1267J503j927J815l439N336
23449e347P001J271j192k30m901L217M447l50k884O307K667n519M89l015J28K720
23433D809k327j990L407q12p160Q212M853r684n668M419o89K583k832p316J2241
23418B046M310n809j18n60n959j331r557l98N995j283J998j431P474Q595m332
23403c60O952k073l615K289R123r556l282K51l503m94k418N764P814n781m681
23388c570m968r838O595P885R550j533j3111r225J0879N385M147M006k460r163
$$ y = [7987, 468, -2856, 5804, 6280, 4859, 6796, 7145, 3631, 7058, -1719, -1598, 6385, 10070, 17114, 3764, -2032, 1467, 1897, 8071, 3239, -6147, 570, 8224, 12024, 7887, 9588, 6840, 9755, 12270, 733, 2783, 2036, -1262, -10847, -5923, -53, -9530, -18317, -19902, -8635, -7132, -9059, -7244, -10683, -5347, 1654, 2925, 1733, 1503, -3398, -181, 4266, 3916, 1032, 7339, 10006, 4487, 4976, 1961, 2089, 4809, 2482, 492, 3899, 3087, -4073, 4139, 8992, -692, -6360, -1941, -2630, -47, -2879, -10195, 2046, 6356, 547, 429, -131, -6090, -7421, -16978, -17376, -11381, -12664, -10666, -12097, -4623, 3972, -360, 6592, 4519, 904, 3193, 12316, 2760, -522, -271, -3774, -4268, -6686, -922, 6892, 1111, -3570, -8538, -18376, -11781, -3896, 5654, 4121, -8990, -18215, -7336, -1951, 2196, 6202, 3742, -5421]
23374e421p48m531j284M72j2446K429J2418N389j96J1165K44n354P48q709J492
23359d332L47Q228k468j545m838j2771M706P274j689L011J171k248o469M829k116
23344h910L03L953l551j837J1014J0249m565j2036n598l093M608O604j420J1215
23330F936K337m875N888O161L34m901j5897j082n614n34P913P414l752m299K632
23315a339K514M213k212n535Q176O685j4582r260J090J748M025L278o891l123
23301a1213R473L46o493L850M860q114J689J0517P586j1101r145k78N993N312
23287C282k081j343j453Q720j1434j337L102K043p36L367L802j1362q93N686j249
23272a886n00m519l383J859o210K056J2453J3407N90l381L857Q28k153M098n007
$$ y = [-5421, -6169, -10700, -11984, -11512, -23958, -21529, -9111, -3722, -3918, 7247, 7491, 2137, 2885, -5824, -4332, -3985, 4243, 1775, 230, -4608, -17379, -12673, -5399, -7088, -4077, -2906, -5154, -11623, -6794, -8910, -8607, -4654, -8205, -10042, 972, 11221, 6656, -5380, -10978, -14071, -9463, -2859, -4279, 6936, 9273, 4398, 10286, 16447, 16781, 11880, -4017, -5099, -10713, -11247, -3334, 4080, 328, -3971, -1339, 1175, 5388, 3176, -2359, 5817, 12502, -2080, -11340, -10250, -8502, -4477, -1199, -8090, -11213, -1740, -1394, -7887, -4037, 823, -7291, -5602, 4915, 12501, 1400, -7745, -8023, -2030, 3282, 1201, -142, -1595, 7125, -4309, -5646, -2544, -501, -1237, 2130, 5932, -5430, -6323, -637, -1886, -2386, -6905, -10288, -8429, -14639, -12583, -130, 13277, 13867, 10486, 14343, 15171, 13018, 17116, 12109]
23257A2109j6840N650Q297M672q012n763l226P843M6m279r287P310J2251K596
23243A3367p508o024L056J7178J125p866k756n873o285K618J093j4984O798m725
23229a0786r64r459P451M225P71M688J715l99L568p56k022m137N02L652l082L710
23213a323O015j751q817J946N789m153j262j015k991q297k360m264n349K265L528
23198b2039N28J2385O378q534O560O269O266J426L625l25n551k651O842j972J549
23183A0756M795j3253j889L956k333M303Q34j0372Nj153O057r188q70P165l44
23168a531k899n213J3892j759j7043p190L472k025L834k78J7468J4418J451l147
23154A3450j4957j354P671M282N16l366j644j731J452m27O20o016n134l308q294
$$ y = [12109, -4731, 919, 9216, 13888, 5876, 113, -3113, 4730, 4776, 497, -8790, -1480, 10771, 13367, 5859, -165, 2891, 20069, 21194, 13328, 10572, 4699, -1586, 1032, 2125, -12859, -6061, -10786, -11750, -21209, -13758, -9533, -8762, -4074, -2359, -2758, 810, 54, -1968, -6105, -5603, -1951, -5033, -1323, 4692, 2941, -5876, -3930, 1859, -2294, -3556, -4571, -7562, -15859, -18219, -22483, -27832, -25567, -22039, -21511, -9126, -2748, -11282, -4722, 1547, 7813, 9239, 12864, 12539, 6988, 4337, 11179, 9207, 10756, 15551, 2298, 409, 4365, 2032, 6335, 7169, -3203, -3198, -4351, 1706, -7482, -8352, -1187, -1531, -4430, -9643, 4249, 2490, -14553, -21743, -18271, -20296, -16462, -16740, 728, 15146, 16597, 13450, -1507, -2861, 4810, 9092, 9608, 6242, 4598, 2867, 4319, 3892, 4512, -1504, -6638, -9946, -18240]
23139a8240K768L350n418M42O416n5j836L98q941R035l01j313N156J213k821K294
23123g853J4818j667j2282O460M774q945P305L256r679L848l631m647p816m394
23109b0453K808M967Q262N300l475k861J00R889O255N579q75R44o370p691j41
23094B238j157j643j94M310L049P97l666o85J047P077p674N88K400q60p566j0263
23078a2202k506O329L633k370L302P462J375M66k227o146l107N535L697l848q222
23063h829k672Q277N355J387j1097j2091J0875Q407J0212j1874r61o575K014o23
23049h195p242N113n389q955R924J1935q169r295R626R629N256K60P91k182o183
23034c076l843k798K347R702J7464n192r901K207j352k004L255k510j796j259
$$ y = [-18240, -15472, -12122, -17540, -17098, -10682, -10737, -12573, -12175, -21116, -12081, -12382, -13695, -8539, -7326, -10147, -7853, 6965, 5298, -6984, -524, 4250, -4695, 2610, 5866, -3813, 35, -3596, -8243, -16059, -20453, -17645, -12678, -4416, 884, -2591, -5452, -5352, 4537, 10792, 16371, 15496, 16440, 10070, 2379, 2238, 1081, -562, -756, 3554, 6603, 7400, 3734, 3049, 4096, 11173, 3499, 4087, 6487, 5627, -1939, -12202, -14708, -8379, -4746, -7116, -3814, 3648, 5023, 5489, 3262, -2884, -5991, -456, 3241, -607, -8829, -11501, -3224, 2131, 3518, -7579, -19670, -8795, -388, 9824, -2050, -3011, -9586, -7572, -8195, -15437, -10324, -15713, -24668, -14744, -2809, -10978, -20273, -10647, -1018, 4238, 4498, 5289, 3107, -3076, -6919, -9717, -7370, 2332, 19796, 14604, 4703, 6910, 5558, 3554, 6809, 4299, 2503, 1244]
23020A244l435n663K603J991M198N264m15m694o831O255K717p896N235J3029o42
23005A2960q965r126q311J0844K601q35n560j163j818P645L415K6m77p99k282
22990a845k095l578N376P05J121J1999P020K200l055m625n759o588l329J342l933
22975e044J46K583Q405Q993q56j1931q882q609l283J0568J5894j669j3655k270
22961i610r757M032Q277K22l078r330J510P780P887k838k945l773k142N719J710
22946f336j0482n546L272J8114P380j3321q718O686O209M360m418l627K646j241
22932e022N130P083k453K818J031m448o251J0039J1803m663j3621k598L209p992
22918e935j0554L445J110M378r27M300J2483k27o794m272Q586N29N670J743O235
$$ y = [1244, -2191, -7854, -5251, -3260, 938, 6202, 5787, 1093, -5738, 517, 3234, -4662, 573, 13602, 12960, 3995, -5131, -13442, -2598, 3, -832, -6392, -7555, -9373, -1728, 1687, 1713, 1236, 437, -1845, -3940, -7518, -2142, -1437, -316, 11683, 18703, 20903, 17848, 13223, 7464, 876, -2453, -1111, -5044, -4898, -2315, 6090, 15083, 14227, 2296, -6586, -15195, -18478, -7910, 7984, 6315, -7340, -9610, -19367, -15335, -7058, -6836, -9914, -19244, -17734, -9954, -2067, -4905, -7850, -11623, -13765, -8046, -6336, -16818, -22364, -19092, -978, 6402, -6919, -15637, -8951, -2742, 1618, -2800, -6427, -3781, -5022, 108, 7191, 4738, 7556, 8587, 4139, -2112, 7927, 19730, 15067, 1446, -1152, 2057, -5935, -16489, -13044, -11934, -7556, -8483, -4183, 8300, 8073, 1279, -2993, 5593, 6122, 11792, 13535, 19770]
22903A9770l824m636j0847j3213M760L50l533R154J6798k877j9704p567M679N755
22889d935J816O437o406r019N778j94p67J6925K130q399m590K668j2634k583J3842
22874F9O564n918m707r823l671r94n28K572R392o413N092R164N472l017m995K809
22858A068J847K24q900m396k512L980J0732m516k510J1780J08p253m326M441k49
22843d82M03P813k335o96M205J146l530k400l79m783k972Q471M97k264J728n167
22827g45l867j826M546R419j225P90j0042m322K851j960m87j3575r597O540J2917
22812a0583J1304o0m945m382j5128N134Q8N190R622M963p99o506K437L321M212
22797C868K866j1106j3225l111J596K154O213K217K131J967N469l629p621j408
$$ y = [19770, 15946, 11310, 463, -12750, -7990, -7640, -11173, -2019, 14779, 11902, -7802, -15369, -10690, -4935, -3119, 3318, -3088, -12107, -6329, -6523, -7290, 9635, 11765, 3366, -1224, 1444, -11190, -13773, 69, 6633, 715, -3992, -13815, -17486, -18480, -19008, -16436, -7044, -13457, -8365, 799, 6271, 3254, -1741, 1068, 2915, 3139, -5761, -10157, -12669, -8689, 2043, -2473, -4983, 6797, 6905, -348, -4674, -233, -482, -79, 7734, 5399, 4703, 8908, 10054, 6524, 4124, 3745, -1038, -4010, 4461, 4958, 2694, 4422, -745, -4612, -6438, -1892, 7527, 6302, 7092, -2950, -7272, -4421, -6381, -6868, -20443, -30040, -23500, -10583, 721, 661, -4284, -8666, -23794, -18660, -18572, -13382, -3760, 1203, 404, -6102, -3665, -344, 3868, 6734, -4372, -17597, -20708, -19112, -16958, -10745, -8528, -6397, -4430, 1039, -2590, -10211, -11619]
22783a1619j479m37Q784J0982L63j4244j499K067Q35L171N926m459Q49J882l501
22768b379O488K947J0217J383o656k289p94l713l518J733m052j2953l210n703
22754b2499q646P150K508j602k317M621J3179p256k955K377j136Q1M894Q215J7062
22739A3676n503n636L870J720m010m411L120J2062k054l581l209j092o143n217
22725f408j4024J782N302k463N431K503L576k586k27J693j862n808N796L002o97
22710d990l923J784j39r9O281K609N092n079L69m557P688J0784n795o853r950
22695f778p040K321n429L647J4022K759p941N451K999l344k426N958j798j786
22681F15m686N409K82J3530K862o461j2703K953J495p381r642M145r52l921J252
$$ y = [-11619, -13098, -13535, -4751, 6231, 6594, -7650, -9149, -7082, -6247, -3076, 2850, -1609, -760, 1122, -2379, 4109, 7056, 17273, 18656, 12000, 9711, 8917, 5204, 1686, 3419, -633, -13586, -16796, -22499, -31145, -23995, -21487, -23089, -25406, -20785, -7606, -14862, -17817, -15440, -16576, -16495, -11601, -3386, 13676, 8173, 2537, 6407, 8127, 4117, -294, 2826, 14888, 12834, 9253, 6044, 4952, -1191, -6408, -20432, -18650, -13348, -15811, -10380, -7877, -4301, -6887, -7114, -5421, -7283, -13091, -7295, -4293, -4990, -8913, -7129, -7268, -7367, -1086, 1523, 6615, 1536, 1905, -2652, 5036, 15820, 10025, 3172, -6778, -13818, -11497, -16926, -13279, 743, 3502, -4439, 1012, 4011, 667, -1759, 4199, 2401, 615, -4071, 1338, 1620, 15150, 18012, 11551, -1152, 1801, 3296, -4085, -13727, -9582, -10534, -14455, -13203]
22666a3203M404j492J1093R792K656r004j796P259l586m863l349l282r25M331
22652a965j02j3616k531j869P162J6815L12j0352o794o899o268N751M668N732
22638i956j591k152L893R033k004j2655r025J0383P985J70j79q911L439N480J484
22623d606n115k679J203P8O518N974k230M973N22j737J2697n563o830p079J01
22608c773J301K363M53k548n006q612k235K463J599O759M436p170o254K063J1163
22593b998P464n204q41m755k171P883k610m286p004m604N092k865R75Q44l923
22578a9003R906O113o578m855m845L773N715Q820k192J2865p251p498O356m41
22564H85K789j292n229j1873p704J623M979K732j336Q653N958O999K488n877k633
$$ y = [-13203, -8799, -10291, 802, 10594, 13250, 4246, 2450, 9709, 6123, 1260, -2089, -5371, -6296, -1965, -2067, -15683, -18214, -20083, -12921, 3894, 4206, -6146, -12940, -19839, -26107, -20356, -15688, -9956, -11547, -13699, -9806, -773, -2777, -15432, -24457, -14074, -6089, -5919, -6098, -15009, -11570, -6090, -4606, -9721, -12400, -11197, -11119, -4601, 1373, -857, 4116, 4638, 2901, 15598, 10035, 3205, -3874, -3773, -2472, -109, 344, -2204, -7210, -15822, -18057, -15594, -13995, -7236, -2800, -9970, -16224, -14161, -2998, 4466, -738, -1579, -6334, -8505, -622, -3232, -7518, -14522, -19126, -14034, -16899, -15924, -15080, -19003, -9097, -2984, -9562, -14417, -19262, -15489, -9774, -954, -3146, 9719, 2468, -5030, 1326, 885, 3674, 2382, -2847, -14720, -22424, -20801, -15822, -13090, -14426, -5773, 185, 7184, 9672, 3795, 1162]
22549A162j855P907M778k513o921P04O346J932j597q325p969n534K675J018L128
22534e064M944L47N991l559r532k470j0906n483M156R762R582J382L843J665m395
22519B63q92N224L895p55n7q017q709j006K107Q650k223o015k743n601p009K792
22503b0096Q693R041l986r486j0646L475J4278N843J1176m93j0543L498L48l366
22489b264O762N195p834j5552J944J0022N885J2088K774m395m530q854o664L84
22475e039O258J7352P898j908j0851r523m732J3163J2038j59j1705n567o792j0577
22461a0144n662M921P440o446o448L218R450K687j2730k433l304J437j1360K903
22447b6471R2J393R068J0645O123j025r065k467P079L18r000L017j788k143m59
$$ y = [1162, -693, 7214, 11992, 9479, 2558, 3262, 9608, 11540, 9943, 1618, -6351, -11885, -9210, -8192, -5064, -120, 227, 6218, 2659, -6873, -9343, -20249, -25732, -21576, -11814, -2232, -850, 2993, 4658, 263, -629, 4595, 8490, 7735, 7678, -339, -9048, -10054, -7947, 703, -1520, -7535, -10278, -15879, -22888, -20096, -11403, -2362, -6348, -15834, -26480, -23005, -8727, -2884, 8292, 7799, -2744, 754, 1102, -2264, 4498, 9693, 1859, -13693, -11749, -1727, 4158, 16246, 19020, 14625, 10095, 1241, -5423, -5039, 1219, 18571, 26469, 24561, 13710, 4187, -545, 12618, 24656, 24497, 12792, 7225, 433, -10144, -15806, -10885, -3445, -9891, -16339, -13121, -3671, -984, -13714, -16147, -19451, -18014, -29374, -26471, -26379, -24986, -15918, -5273, 850, -175, -9240, -11707, -4628, -4310, -13310, -10293, -12081, -14224, -14683]
22432a4683K373J561L320m988n554J0832L915O588n89l616L009K880n645m016
22418d613K750J014l485j420k475O51P893j115n238M575R102K237l149q467J322
22403d18j452q93L273Q94j386J816l884m455R4R365K58k558L992K420k451m708
22387i3L73J02K235j503q723K680K584k348m558j797L947p149K062Q825J133o096
22371h326L242j779K557J180K315P737l830j1665o826L258k581R942N676K348
22357C248l906q054J313k597J0037L404j0680m489J321k079p83R6N940p938j615
22342a6782N178K888P010O201J119j220m576N554l383o329n026l14q51r53O97
22327a0787P586j4133k216J148M925J116J0469M219J563l965n413j0150R70m04
$$ y = [-14683, -12310, -10749, -7429, -12417, -17971, -7139, -3224, 3364, 2775, -841, 2168, 5048, -597, -4613, -1863, -849, -4334, -5754, -8229, -7578, 315, -800, -6038, -1463, 7639, 9876, 6727, -1740, -418, -1870, -2763, 510, 1404, 18, 1834, -2050, -6505, -6411, 2954, 3212, 654, 4646, 7066, 4615, -93, 280, 382, 2617, 1114, -7609, -4929, -2345, -4693, -9251, -11048, -7101, -14250, -12188, -3363, -2230, -8326, -5084, -6863, -4306, -3126, -811, 6926, 3096, -8569, -15395, -12137, -14718, -4776, 900, 3248, -658, -8712, -7399, -9996, 41, 3445, -7235, -11724, -10403, -12482, -13265, -13169, -7229, -15167, -16782, -11604, -8716, -1706, 4495, 5614, 4394, -182, 5372, 1989, -4340, -9366, -9680, -10531, -11484, -10787, -3201, -17334, -19550, -18402, -13477, -12361, -1892, 2327, 3890, -75, -5488, -15638, -14668, -15072]
22313a5072K871l348N666P669Q061j967j0198J110M190n580j0114m475J1994L613
22299e580j8259q256P519P993O732N342l530q71K0778Q346l898j3605q569M94
22285e364J987M238k954p93J441K660M826Q634k861J0374M856q905j1880o007
22271B52j718q224o439J0220J0808O690j4940j7340p152O352J1725O796K275j347
22257b042l297L243J8227L97p326m958o546j3119J0421J0959L419K917N041N85
22243A7921k192l363l224n281Q645o059q403M53N538K8n329M102J122O87k458
22228B187q244l962N671m681K731J4375r40K266Q738J54j5217p046r024o029L767
22213a5254O543J597l874J877P485K804n430k106K776K441k088o579J971N380
$$ y = [-15072, -12201, -15549, -9883, -2214, 5847, 3880, -6318, -5208, -1018, -6598, -16712, -21187, -9193, -5580, -23839, -32095, -24576, -16583, -9851, -4509, -8039, -8910, 11868, 20214, 16316, 2711, -5858, -5364, -3377, 861, -2093, -2886, -1445, 1215, 6041, 14675, 11814, 22188, 27044, 18139, 6259, 252, -1466, -9690, -16129, -5909, 4899, 11589, -3351, -20691, -27843, -21491, -9766, -2970, -695, -2042, -5339, -2096, 16131, 16528, 9202, 4244, -2302, -15421, -5000, 5959, 9378, 12295, 17336, 17921, 15729, 12366, 9142, 3861, 12506, 6447, -1956, -1503, 4035, 4063, -1266, 2836, 3958, 4645, 2187, -6057, -10019, -4348, -9029, -6298, 8077, 7137, 9403, 18141, 18295, 3078, -3968, -12992, -19021, -15254, -8711, -7114, -10988, -9111, -1626, 1178, -4252, -6358, -3582, -1141, -3229, -9808, -7837, -2457]
22199b457R406m435j729K68j815n982J0764O845L72K840N818O72m942j422q499
22184E704n47J50k536M7K516k506J028o897j15J400p195R308j517K633n129l008
22168f664j82R90K381J2601J6179l260k1239j0520P400J051P352N757j218j299
22154I329r472j3490m013k662k136J0821P752M15j133j84r663n319Q057J6271
22140D573N926j5852p961K879L707J927L227j683M538J35M120N422o188k712N125
22125G183m236j055m173m755l595j188p330k732l124j868J2405N919l76M233L194
22110a498m310m100O76L553l834J756L339L124p519q697l88k073P169J2099P767
22095G064n836o06P49l009J571j1514j0390O9O538J6466J104J432p670J022P40
$$ y = [-2457, 6949, 2514, 785, 1053, -762, -6744, 4020, 10865, 11237, 14077, 19895, 20567, 15625, 14203, 5704, 5157, 5307, 2771, 2818, 5334, 2828, 3856, -3041, -3156, -1756, -8951, 357, -1160, 1473, -3656, -6664, -6846, -5856, -3475, 9126, 25305, 22045, 806, -9714, -2314, -1263, 6089, 11846, 10628, 9329, -143, -13633, -17646, -20308, -22444, -11623, -3871, -3456, -4589, -4773, -14436, -19755, -11698, 4573, 10499, -5353, -13314, -10435, -6728, -4801, -1574, -3257, 1281, 1416, 5536, 10958, 4770, 2058, 7183, 2947, 1892, -2281, -7036, -10631, -11819, -19149, -21881, -25005, -26873, -14468, -8549, -8925, -4692, -1498, -5808, -9908, -9232, -5679, -9513, -7757, -4418, -1294, -8813, -17510, -17898, -19971, -12802, -703, 7064, 1228, 622, 1371, -1638, -67, -11581, -21971, -21902, -15364, 1102, 2206, 3638, -4032, -3010, -2270]
22080b270l984k875R77K829Q119k973L96N785Q901J360m027j0191j418Q750j3509
22065d130j2641j0386L018K842K208K354L634J1393L630k521K314R50j403M32
22051A694P28j289j30m575j1562N83k219q753N771J0377M95K349l883n890N654
22036a0650Q773O327O939l445j6134k372M8k279j509p476j96J2586J4517m967
22022A62J70M073j311K553n915j74Q290N055m058r168M0l80J469m174o402l210
22006a2980N705Q191R043L544o072m912L85O89K631o307r446O328K414L35o178
21991f630j316rk998O603Q073P446O978N527N95j2262P2q057j0370N114L208j491
21975D83k122j004M722p569j0428p079n174K723J9553J5953L771j4100j1103n910
$$ y = [-2270, -6254, -9129, -8152, -5323, 2796, -177, 219, 6004, 14905, 16265, 12238, 2047, 629, 9379, -4130, -16771, -27157, -24139, -21297, -19089, -16735, -13101, -1708, 1922, -599, 1715, 2665, 1262, 1694, 2422, 1133, 1003, -3572, -15134, -14551, -16770, -25523, -19752, -9375, -8880, -6531, -10414, -16304, -10650, -1877, 4450, 11389, 7944, -8190, -10562, -10514, -12793, -14302, -21778, -21974, -9388, 5129, 162, 332, 4405, 3094, 5647, -268, -442, 7848, 12903, 8845, -323, -283, -663, 806, -3368, -9770, -12980, -7275, 916, 9959, 13503, 7431, 2519, 2904, 3593, 6224, -83, -9529, -3201, -787, -452, -6630, -7946, -7955, -10953, -4350, 3723, 11169, 18147, 23674, 24269, 12007, 12079, 4022, -6348, -1234, 1974, 483, -1639, -2643, 2079, -5490, -15918, -22997, -28171, -25448, -5895, 10058, 13829, -271, -11374, -17284]
21961a7284R497k32N912L528r4k932O299r77p014j0765j788R349R597J051o399
21946b252J758r407o891k544q672n92N576N621Q689n375n020L44m523k871Q25
21931b5334J058J017O687R48J904l1M260m103o673j908L938K156l700J0062L390
21916f329Q548j1685p437N295P473j429O201r21n367j403L749P830m992j4885
21902a5352q208P904J6558O457P067n294r008M703R438k00n936n847m290n39j432
21887c979R779N325m633Q269P224k929j3805r7o479j848o165P318L944Q27Q412
21872A1163p21m762r058j0291k192l691Q020O454J707J609L492m47K834L137q686
21857a432j409P628l826R87r302j768l488J303k017Q695k977j1341o805L468N125
$$ y = [-17284, -7787, -8019, -2107, 1421, 1327, -1605, 4694, 3717, -3297, -14062, -15850, -6501, 3096, 4147, -2252, -494, -9901, -16792, -19336, -28008, -28600, -23024, -17403, -8714, -14089, -19109, -18765, -23288, -26159, -25334, -24276, -23259, -16572, -15624, -13720, -13751, -9491, -13594, -20267, -22175, -18237, -16081, -19781, -9719, -6329, 2219, -9466, -16903, -11608, -4135, -5564, 637, -284, -5651, -7054, -3305, 4525, -467, -15352, -23560, -15656, 902, 7359, 14426, 9132, 124, 4827, 14265, 14065, 8129, 2282, -2008, -2547, -3979, 5800, 11125, 6492, 14761, 21985, 19056, 5251, 5154, -1325, -3173, -9338, -2020, 1924, 2751, 11163, 10442, 5680, -3378, -13669, -15861, -19552, -11532, -5078, -3371, -1762, 1730, 1283, 4117, 7254, -1432, -2841, 4787, 961, 1948, -7354, -9122, -12610, -11307, -13324, -4629, -7606, -18947, -25752, -22284, -17159]
21842a7159L705L110M840K101P308m940o737P09j0408l146K389L259M045J642
21828i282K893N559o584p925J02N593o88m542K1M783Q723q529r25k0q031J183
21812a7669R072k07P92l57Q68O354J1534r003p153j437j882N199L739K186J6569
21797A8605O136j0135q16R575n191K604n958l833K385k296k6358j0136Q862J2959
21783c597J3193J4997J846l80q766q303j1876p343n99J397j087L501Q41j7915
21769b4091P716J5278J6654N504l24k524j3117k858j2470j392P424M10m553q010
21755a6353n666R00O360J6435P542Q88n122p477m416L743J535o373J0396O120
21741H512j0168j750k341n747n764J714K932p72j411O847p34L37j341l946j862
$$ y = [-17159, -13454, -10344, -5504, -3403, 3905, -1035, -7772, -7063, -17471, -20617, -18228, -14969, -10924, -9282, -6389, -830, -7414, -15339, -15237, -9644, -10332, -14874, -14853, -10070, -1347, -9876, -10801, -10821, -18852, -17669, -8597, -8804, -8012, -8369, -7501, -1147, 10387, 1384, -5769, -7206, -9088, -3889, -150, 2036, 18605, 24741, 14606, 13790, 23365, 18174, 20778, 14820, 10987, 13372, 11076, -15282, -25418, -16556, -3597, 9596, 24593, 26439, 26059, 17293, 8990, -2886, -10229, -10828, -9431, -10518, -7017, -6176, -24091, -16375, -1097, 15557, 21061, 20737, 18213, 5096, 2238, -10232, -11624, -4200, -3790, -8343, -16353, -22019, -21119, -14759, 1676, 9218, 10106, 4984, -2493, -6909, -3166, -1631, -8004, 2392, 8512, -1656, -3406, -5747, -11494, -17258, -15544, -12612, -13384, -14795, -7948, -8682, -8345, -9686, -13632, -15494]
21726a5494j94K149k133J0231R489o849j2294n15O016P422o04k3L10k432l547
21711h468n247N663M927q544k987K983M676O052P328K970m399r15M55p323j1299
21696a4128K429L184r086q133J1107P350l034p514L072j943o133M317N557j71
21682a3126O229K874L190n690m69r09P910k189j5598J239J4083P083M451n08K602
21667A1172M68K654l963n179j4405L184J1700J90o984m481L941R450Q634O92n720
21652A1353m334J863K562r312j0626k971Q106K12R269J840R30J346m836m358M419
21637E463m256j127m049P251P876n94L031j697p038m465M77r174K263K413L351
21622b75K747K158n807m707j096J0282N197J409n331m525J779J0271m72p106R07
$$ y = [-15494, -15688, -13539, -15672, -5441, 4048, -2801, -15095, -15610, -9594, -2172, -2776, -2799, -2489, -4921, -8468, -13715, -8052, -3125, -11669, -14656, -11673, -6997, -945, 6383, 9353, 4954, 4039, 4494, -2829, -14128, -11699, -8515, -17601, -25734, -14627, -7277, -10311, -17825, -14753, -16696, -22829, -18512, -12955, -13126, -6897, -4023, -833, -6523, -6992, -7901, 9, -2180, -17778, -16539, -2456, 4627, 9078, 8570, 11172, 11640, 14294, 10331, 5152, -9253, -6069, 5631, 5821, -1163, -5644, -1703, 7747, 16381, 17073, 11353, 7019, 8882, 11444, 2132, -8494, -11465, -3359, -3147, 6122, 7962, 8892, 10238, 5402, 1044, 5463, 1207, 80, -3969, 3282, 11158, 10564, 13595, 11898, 4860, 395, 872, -8302, -6039, -3626, -275, 2472, 4630, -1177, -5884, -6980, 3302, 8499, 9908, 4577, 52, 1831, 12102, 11630, 4524, 5431]
21607E431L063J5926K838p816p587k515j0736j2679J920J0463j472J0279J6235
21594B3350M492q349j1881n702l613n938J561M937l083O436n45Q81J668J1951
21580A6165M58j3581m804j066M59l742m229o176J768J6472M494j1978J0911J1703
21566A6854L683j5540p807O308N952j7199p351Q085L740o42J131k124n684P401
21552c193J1485J0024J717N863j3776n554M171M395O154k964l240o997J382Q961
21538A8428K513q400l342J069J4115j048q865j0293k253Q793M077j616j672J516
21524A3022k624N959J916m981l512L617P971r01l277L982j4698L56o318r264R795
21509A043J0051o459l643O004l26M298j868l728p134k358K631J602J235J952l505
$$ y = [5431, 8494, 24420, 27258, 19442, 11855, 9340, -1396, -14075, -12155, -1692, -3164, 7115, 23350, 27842, 19493, 7612, 1910, -1703, -7641, -6080, -1143, -4226, 2210, 1665, 2546, 4214, 16165, 16623, 3042, -1762, -2828, -2369, -6111, -10340, -16516, -14748, 1724, 6218, -5760, 5151, 16854, 20537, 4997, -2810, 3498, 9450, -7749, -15100, -7015, -3275, -3917, -2786, -4910, -10594, -3193, 8292, 18316, 20033, 25896, 12120, 6566, 10737, 15132, 21286, 18322, 15082, 8085, 9467, 18428, 20941, 12541, 9199, 10268, 24383, 23335, 14470, 4177, 1924, 10717, 14794, 13178, 11506, 13022, 10398, 16357, 18273, 13292, 9780, 13397, 21368, 20467, 17190, 21172, 6474, 6830, 512, -8752, 1043, 11094, 4635, 992, 6996, 6670, 10968, 9100, 5372, -1762, -4120, -1489, 113, 1348, 3300, -205]
21494b05o954n040m26m786l585O902L437L61R296J0083O02K320J5884M658j6024
21479A6523j0670l116N326N859K119R24n290o092j4626q715J1754P046J951m078
21465a085P599P518k5j1289n471N059M720p800p009K922m044O130M563P846J446
21450A1080J3q052J893K468K022q580j5430j57R568M962O004M222n620j0468L743
21435b332L433o66q332j72K349j918M749N603j579N85Q930O013o865n363n875
21420a440M668K450m724n849m864N745R335l993P398k290J92p443j576k854p374
21405a2619j561P289K006J149j2411o735J4639N270M176K776r509o553N943J3554
21391G414N034j4724j2035Q74N632O126q812m661P564P230Q939n706Q033O339
$$ y = [-205, -7159, -12199, -12625, -17411, -20996, -14094, -10657, -10296, -1000, 9083, 9685, 12005, 27889, 32547, 16523, 5853, 2737, 8063, 13922, 16041, 16965, 11675, 5583, -9043, -17758, -6004, 1042, 2993, -1085, 6514, 14032, 14007, 2718, -2753, 2306, 7026, -774, -7783, -4861, -8905, -2775, 1788, 9634, 11080, 11093, 3041, 4934, 7402, 9424, 844, -14586, -14743, -5175, -213, 5791, 10013, 4393, -6075, -2332, 1101, 435, -7897, -8069, -5720, -7638, -2889, 2714, 1135, 1720, 10650, 16663, 9798, 4435, -1440, 3228, 5678, 954, -4895, -9759, -4014, 5321, 1328, 8726, 6436, 6628, -815, -2391, -5245, -12619, -14180, -6891, -4885, -3736, -16147, -22882, -8243, -2973, 1203, 3979, -5530, -12083, -6140, 7414, 12448, -2276, -14311, -13437, -7805, -1679, -10491, -15152, -7588, -358, 8581, 2875, 10908, 17247]
21377A7247l239K22j2693l200l547j686P959o111R23M75J0447o23m229k508k798
21362c361k769l103j16L992r465o172L177K847j725M515M014R556J877n837J377
21347a193N349Q020l879p326j698m037N124l33q74o309k303k408K797J3045O122
21332A0097N333J781m122l055p88j792o13N147K603j856j759k914L578J3468o610
21317A8498L03J312r843p161K75M668n155J423Q284M738k398M46j1703K345L122
21302I154r757L129P683l2K799N594Q415p436j5691j588m00L347q700r83o65L050
21286b081N294k483J212l520O539k778q262n086l276Q543O489j050n591J385j062
21271e727L678n074n86M790Q537j0399M652n592j0578N013J1248Q405j6L995M653
$$ y = [17247, 14008, 14230, 1537, -1663, -5210, -6896, 1063, -5048, -4125, -3650, 6797, 6174, 1945, -563, -3361, -6130, -9233, -9349, -5357, -14822, -20994, -17817, -14970, -16695, -12180, -8166, 1390, 3267, -2570, -1193, 4156, 12176, 8297, 971, -727, -4764, 360, 27, -847, -7156, -9459, -11867, -9070, 3975, 10097, 15430, 17211, 13089, 10034, 9246, 7454, 6841, 11988, 14591, 12735, 10976, 8062, 11640, 25108, 18498, 18801, 20113, 10270, 3109, 3384, 8052, 2897, 4320, 12604, 17342, 14944, 15390, 3687, 6032, 9154, -603, 2526, 10209, 10177, 12976, 18570, 26985, 19549, 3858, 2270, 1870, 5217, -3483, -4466, -5131, -2081, 3213, 730, 1942, -1578, 4961, 2183, -6079, -11165, -14441, -5898, 591, -459, -6050, -4665, -5727, -2049, -7123, -7709, -2919, 5618, -4781, -129, -5721, -16299, -11286, -38, 8367, 8351, 12346, 16999]
21256A6999r514n992O173O210o944k306l083n03k680l145k186L958n599q340j0493
21241b7445J905M841n012K080J2113L343J1515J0792p929m107Q443J739j3605
21228a327o303O27q569N510P964J4830r809m01M71m086N695l899n808k627m136
21213a1868J159O846O623j040j457o886p708P241L695p60J3486M516j203o260
21199F384o150l021L455p43L526l02K168M082q701k583N319O431Q52K467j941
21184A1243o975l802l357P77q567r147J0382Q652O8K581k296Q867L613J938L059
21169A7036n813j2339l975L641K474K460J841m794j0920k302Q201L535m803l416
21155i174K786O122l324j2948K577Q011l269p669M004L543N1J669p747N467l064
$$ y = [16999, 7485, 1493, 7666, 13876, 6932, 4626, 1543, 1040, -1640, -4785, -6971, -3013, -8612, -16952, -27445, -25540, -20699, -25711, -23631, -11518, -8175, 3340, 14132, 6203, 2096, 10539, 12278, -1327, -7630, -7003, -15572, -10062, -2098, 12732, 2923, 2522, 2993, -1093, 4602, 703, -5105, -7732, -11868, -10709, -3863, 2760, 1720, 263, -6623, -14331, -7090, -3395, -4155, 9331, 13847, 12644, 6384, 234, -2787, 668, -75, 3451, 3149, 5317, 9399, 698, -1885, 3434, 9865, 10717, 13184, 11243, 4268, 466, -2891, -2114, -10681, -19828, -9446, -794, -726, 1855, -441, 8426, 12039, 13977, 17036, 11223, -1116, -5091, -1450, 1024, 3484, 5325, 531, -10389, -12691, -4490, -955, -5758, -9174, -6388, -266, -3590, -16538, -13961, -5950, -9219, -16888, -12884, -9341, -9290, -7621, -15368, -9901, -12965]
21140a2965L877J3903Q129L939j0943j4828n223K814p90O333J305L42j223k780
21126h110l242q822l733K318R103J482J3063R509j7261M543K094O442Q044n838
21112I592o766J3025J1328j1288j274p867j1665o827J045l920P894P096R389n063
21098D699l64J205L59K104j4503l332k479L494r77n310N947R740O695J189L023
21083A1490q176K723K460j355k534j2395q208O46j165L484N2j055L730R297L348
21068B342Q94k419q83p427J633Q644J077j795P939k572k602J0894m275m563l359
21053C528j465l80j590M717J136m016r910L05J1255n559k888J146N583k721r893
21038a0752j501J6617O469j0884j3279L064R384O24M929N028n574q138K533K489
$$ y = [-12965, -9088, 4815, 12944, 16883, 5940, -8888, -14111, -11297, -12087, -5754, -4449, -4107, -5330, -8110, -11352, -20174, -23907, -21589, -12486, -11004, 2059, 11568, -5693, -1150, 944, 7386, 15430, 9592, 2826, 15851, 27179, 15891, 14617, 6750, -4915, -11742, -10697, -14617, -6723, 373, 9762, 4699, 4335, 5540, 5899, 8003, -6500, -9832, -12311, -8817, -9794, -15104, -9157, 583, 7278, 8467, 11490, 3314, 6037, 8497, 7142, 4608, -7787, -15995, -15349, -16514, -13030, -12978, -14033, -10303, -1006, 2342, 3236, 817, -66, -7493, -5860, 2784, 3861, 2066, 10005, 7433, 4831, 15725, 11450, 6887, 3528, 2063, 1683, 93, 4810, 5946, 1930, -7980, -7675, 3580, -1979, -4867, -3721, 1862, -859, -10752, -12253, 4364, 10833, -51, -13330, -10266, -882, -258, 4671, 9699, 4125, -4013, -1480, 1009]
21024A009J68K107p15p098m693n971O220M602K908m324p345j749J0173L681L357
21009B330o156p935n347R821J1548j1311l095M334Q409p296q439l293o203n546
20995b8179k514K632L490J993N707P499L836P217O23j136O9l205k051m622j4766
20980b3407P192J5905J652o54J238J742k563l598k612O32l462Q95K742p909p430
20965a9637k300P000M568l068k242j051K083M339J0069R507q929p137k506j595
20951a0899N199M264R265j320l918L299O08j102j33O323J113p58N169l154J275
20936A5231L340K649k927j492Q102J42J502K049N841k475K430R956Q985m954Q260
20921E6639L67P433m5m575q563l729j697p575o713l333m113M443n893j2088m236
$$ y = [1009, 1177, 3284, 2569, -4529, -9222, -15193, -8973, -4371, -1463, -5787, -13132, -14881, -4708, -1027, 2330, -3826, -11761, -17108, -7287, 4261, -7050, -10145, -5811, 2598, -4698, -13137, -16430, -22633, -28179, -30693, -28061, -24571, -22578, -16871, -9372, -5536, 1681, 2304, 1168, 1237, -1968, -4019, -8641, -23407, -16215, -310, 1342, 688, 1926, 3668, 1105, -2493, -5105, -4473, -7935, -7040, -4298, -12207, -19637, -21937, -14937, -10369, -13437, -15679, -16730, -14647, -10308, -239, 9268, 339, -6798, -9304, -10899, -5700, -1436, 7829, 6509, 2591, 5890, 6498, 5396, 5263, 11586, 12699, 11941, 17110, 13956, 15231, 18571, 21220, 18293, 16801, 24903, 25045, 26547, 28596, 34437, 31962, 34392, 44348, 53333, 48379, 56639, 57006, 64439, 64394, 59819, 51256, 47527, 45830, 38255, 31542, 28209, 24096, 28539, 22646, 10558, 6322]
20906F322N928m237Q12j0046J301N279l911j928R669K091O041M872M92k28m077
20891A8380m513l119R6n333o620J572N480N704j1156o330P754k417q147k030N441
20876e238m803k215L659N35n130J871R039J1125l697m75j0631K766J3774k279
20862H301n592m737k381P879j420j3605M59J5911O362j2409p270J3994l640o311
20848d459M98l969m624K971Q505P155j883o315k23j548J3823k898o652Q40o188
20833d967P712j942o157n983o485j840R979J4141K12p36m66m61m150o547m078
20818a1768K629P773k327l253k609R488l248j1068O076k818K350L667n890Q563
20804b435J0446L062L512p436q130l147k00N706K879J0934o865r008j0097O066
$$ y = [6322, 12250, 8013, 8825, -1221, 80, 5359, 1448, -480, 9189, 11280, 17321, 22193, 22685, 22457, 18380, 13867, 10748, 10844, 5511, -1109, 463, 5943, 11647, 491, -5839, 1915, -502, -8649, -10679, -5238, -10041, -12256, -8597, -8062, -13192, -11321, -2282, 8843, 5146, 4671, -5960, -3194, 10580, 8301, 2709, -2028, -4409, 3470, 2050, -11555, -11096, 4815, 11177, -1232, -8502, 5492, 1852, -4459, -3961, -7930, -12554, -9583, -1078, 6077, 4194, -2121, -2344, -3892, 9931, 7033, 381, 1221, -4967, 2745, 803, -5354, -11337, -17822, -19662, -9683, 4458, 4670, 3934, 3468, 3007, -1143, -7690, -11768, -9139, -1366, -3693, -6946, -9555, -67, -3315, -14383, -8307, -11125, -8775, -5108, -10998, -2435, 8011, 11073, 14585, 7149, -981, -4128, -4328, 1378, 4257, 15191, 8326, -682, -10779, -4713]
20790d713j0462N662O615J444L595K300P783K618o675j0617j4478J545R701P664
20776A982N514o377j7997m571n919K63J3256P721m497l170l284L395M782p900
20762a6802l622L119Q638M020J0863j953q703m657O883J428r13J2641J847p57
20748A2032l842o446O89r668q00m372P83O874K3840Q75j3496r360L597j220K487
20733A973n330n508M398N971k202l470k552P410J0771P66m123r19m808j405K320
20718C292n207p084K26P772k617R218N639j5327j3397J333O857m023J616N572
20704f130l609j1578k281L803K674k442L332J1116J433m763l063J5021J560n005
20690F8n36j090m671p747m748m82P159Q204l009K395n808n088P159L184k898j739
$$ y = [-4713, -15175, -9513, -2898, -1454, 2141, 4441, 12224, 14842, 8167, -2450, -16928, -15383, -5682, 1982, 7496, 1119, -16878, -21449, -27368, -27105, -13849, -6128, -10625, -13795, -17079, -13684, -8902, -16802, -20424, -17305, -8667, -4647, 6216, 4263, -4440, -9097, -2214, -786, -1699, 10942, 12789, 12032, 8190, 1744, 2433, -7235, -8035, -12407, -11624, -4750, 19090, 19965, 6469, -2891, 706, -514, 1973, -3357, -8865, -4467, 1504, -698, -4168, -6720, 690, 11461, 12227, 8104, 7185, 2377, 972, 3292, -1915, -8999, -8773, -1001, -3618, 5600, 11239, -4088, -17485, -16152, -9295, -13318, -11702, -6130, -9739, -21317, -23598, -19795, -17121, -19563, -16231, -5115, -3682, -8445, -11508, 3513, 5073, 68, -468, -1558, -6229, -13976, -18724, -19206, -12047, -3843, -6852, -4457, -10265, -15353, -8194, -5010, -7908, -9647]
20674i647k367R774P991j2470o736K0940N290p608j002o285r203j1914M325Q963
20660i949Q461j583k476m147M703O312O995k186j0330o91L933n996J458J343J2504
20645H351K135o929J0366M647n282m3l704j0754j5016N261K0771R226p567j2264
20631h02j0233J851M024L16M970N227L251K851m727l364M416K82Q98J156j833
20616H283m320p677K175n136k633K66P871P017O950K250k488j930M76l823R50
20601H231N755j746j1646J056p780j755J4617N553N35o818j860o376m129l515
20587i878K660L492p957J335k514k052J3995L587j528J817k915q303q757J946
20573a5072lJ1336M195P324l943k140J682k078n308J801J0404r194p21P252N785
$$ y = [-9647, -12014, -2240, 5751, -6719, -13455, 7485, 12775, 5167, 4165, -2120, -11323, -23237, -18912, -9949, -1488, -3071, -5547, -9694, -4991, 1321, 8316, 6130, -4200, -4891, -958, -6954, -5496, -4153, 8351, 10486, 3557, 13923, 18570, 13288, 13245, 9541, -1213, -16229, -10968, 9803, 19029, 11462, -802, -11035, -9184, -5160, -4844, 126, 5353, 8604, 11455, 6728, 3364, 7780, 8062, 8960, 10116, 8283, 3963, -3714, -1539, -6675, -9308, -9042, -1171, 5846, 12796, 15046, 12558, 10628, 11104, 7281, 8231, 13986, 12240, 594, 1650, -6130, -7885, 6732, 12285, 12820, 6002, 4142, -2234, -6363, -9878, -7218, -3726, -11683, -10348, -12862, -14914, -919, 2668, 1140, 2957, 42, -8261, -17018, -15072, -15075, -3739, 456, 7780, 3837, 1697, 3379, 1301, -4007, -2206, 8198, -996, -1717, 5535, 11320]
20558A1320O11m911p736m489k104L564J282m095k206j886J0163N922N512j445
20544I502L49k62M575J4303l092p623r949j1333q675O410Q328p09M456o844P997
20529G433M723k974M78O558N969k490O540k486l418r227M940J7635M925l755R90
20514C5841N958L742P356L547q121p302p674P735M760n764m788K167m397N873
20500C8933J0410q3r002j2472R75K141n427m600Q66O400k911k431j007N233M262
20485C1287k426l783k581j999J839L138o242K088R590k6j326p687k1771j0510
20471a0409O76J523n163j487J2442R654l754k438J236n953l932o679K886L050
20457h348N970P993J1941n434r516M489L18j2333k652O329K511p188j2926k435
$$ y = [11320, 11931, 7020, -716, -5205, -7309, -3745, -2463, -6558, -8764, -10650, -487, 5435, 10947, 9502, 9851, 9589, 14164, 28467, 25375, 17752, 7803, -3530, -12205, -5795, 2533, 1824, 6280, -564, 7433, 12156, 9182, 9660, 16218, 22187, 19697, 26237, 23751, 20333, 11106, 16046, 33681, 38606, 34851, 35841, 41799, 45541, 52897, 56444, 48323, 41021, 33347, 41082, 45842, 40078, 35290, 37457, 33060, 38933, 49343, 49260, 40258, 27786, 28761, 30902, 25475, 20875, 21741, 28141, 25230, 22799, 21792, 27025, 31287, 28861, 25078, 22497, 20498, 22337, 25475, 19233, 21321, 30911, 30885, 29559, 21872, 101, -10409, -9733, -8210, -13373, -14860, -2418, 7236, 3482, 1044, 2280, -3673, -7605, -14284, -11398, -8348, -2378, 5615, 17556, 12122, 2606, 7095, 7413, -4920, -7572, -1243, 1268, -5920, -18846, -21281]
20443b1281J0307O873M734N817j895o91J2053o792j0680n811k217P991R94N591
20429D993J181k90j331J975N517n425o263j515J062j476j153L30l968R282j093
20414A826j9641R058K525L327q98j323k421k890j627N714L276n878K62L780R549
20399D639Q72m009j4386l175l641P798Q231J1256M94r056N599R0J470M152r763
20384E71K921m27r606K714N628k656o21m736J0358k690P686Q443j1429m807Q19
20369B168l287N954O023n107L66M999o017q21q49J213J913P30qL221K227m385
20353H340j0894m891N646l421K37L748M176J7239M515k989r966r173n236o433
20339i102k224K95J0582L28j0753j570N224P839k254o854o7L703O118k182q542
$$ y = [-21281, -10974, -4101, 633, 6450, 4555, 3864, 15917, 9125, -1555, -7366, -9583, -1592, -598, 4993, 6174, 5884, 4553, 6528, 12045, 6620, 357, -1158, -96, -1572, -2725, -2395, -6363, 2919, 1826, -17815, -8757, -6232, -2905, -3803, -5126, -7547, -10437, -12064, -6350, -3074, -8952, -8690, -4910, 4639, 5511, 1502, -12884, -16059, -19700, -11902, -3671, 7585, 8079, -977, 4622, 4712, 6182, 10334, 571, 3492, 3065, -6541, -3827, 1801, -855, -1476, -6212, 4146, 1456, 9142, 17585, 6156, 1349, 2168, -1119, 4835, 10858, 5751, 6117, 11116, 5099, 4278, 3429, 4642, 6555, 7285, 7277, 10498, 12725, 8340, -2554, -7445, -1799, -5220, -4983, -1235, 2941, 20180, 24695, 21706, 11740, 2567, -2669, -9102, -11326, -11031, -449, -121, -10874, -12444, -7220, 619, -1635, -8489, -8556, -4853, 1265, -917, -9459]
20324i459o571m609L347O393O248J062r98P632j250K009J964p745m779L098J269
20309b389j595O627L326p568O82J4015M002m211j2838n406K268n71Q009R765m302
20294I814k170o022Q59j138j449m734M43L83J509L974m22m820P562M84k256k778
20278g61q996M937K648j429N56k615k818j599L261p190n674m728O450J5394J2276
20263I712o560j1426j105l18K442r096L71K953j022J3522N182o06k444J119l534
20248h10j988l477K110M140K060L850J469m01m691j1063q473M779R203P154q41
20233C021j2298n176m743J634J2007N781K648n566K0p863j7001j529Q666N495
20219a4904J3552R820j029p896l461K480j529n151l287k899p055j832P716N821
$$ y = [-9459, -16030, -20639, -17292, -10899, -4651, -3589, -4587, 3045, 1795, 3804, 5768, -1977, -6756, -3658, -2389, -3984, 2643, 5969, -1599, -917, 13098, 17100, 12889, 51, -5355, -3087, -3658, 4351, 14116, 9814, 7644, 1622, 2481, 1343, -106, -4840, -4397, -4014, -2505, 1469, 1047, -3773, 3789, 4273, 2017, -761, -9757, -4820, -2172, -3601, -3045, -5660, -8478, -10077, -6816, -14006, -19680, -24408, -17958, -2564, 9712, 3152, -8274, -9379, -9697, -7255, -16351, -15980, -13027, -14049, -527, 4655, 4049, 1605, 2724, -810, -2798, -6275, -4165, -25, 2035, 5885, 7354, 6953, 2262, -8801, -17274, -12495, -3292, 3862, 3021, -9277, -14453, -19196, -17562, -5555, 226, 2874, -2692, -2672, -10535, -27536, -29065, -20399, -14904, -1352, 8468, 7439, -457, -3918, -1438, -2967, -8118, -11405, -14304, -21359, -23191, -15475, -9654]
20205i654L06q361m785J0263L211K456l156j591M061R383k047Q08j879J227o77
20190d35k294K381o138r268Q284p121m848R194J2292l529K2r425L525N054O717
20175D411J498L669m187m218J677J619L970k192p659j3940n331r936P846R835
20161a2938J1317O069m534o408p917M151N741n615Q70k009J894K552k976M100
20147e703J019j32m485N440K245l739j1483p500J1473J2038J0005J48p320j0597
20133h591L869Q873K557P899Q363p733k951j310n931o772Q52N677n040m560Q683
20118C885R304M091J377r439q601p497r85O740O808o143J725O446M69j407K265
20103I038k999K098j083j676j3635L500K900n19O041r878r393N558N288k8R03
$$ y = [-9654, -9348, -17709, -22494, -12231, -9020, -6564, -9720, -11311, -7250, 2133, 86, 894, -985, 242, -435, -2729, -348, -6486, -15754, -7470, -14591, -19439, -10245, 2047, -1482, -1460, -10885, -7360, -2306, 4411, 5909, 9578, 5391, 1173, 2850, 4469, 8439, 6247, -1412, -15352, -20683, -30619, -22773, -12938, -1621, 4448, -86, -6494, -14411, -10260, -4519, -10134, -9264, -11273, -9379, -6827, -9803, -5703, -4684, -4816, -9301, -3861, -1616, -5355, -16838, -24338, -12865, -827, 9178, 9326, 2006, -8591, -4722, 4151, 6708, 14607, 22970, 15237, 12286, 10976, 5045, -1727, -875, 4802, -238, -4798, 3885, 13189, 17280, 18657, 9218, 617, -6880, -7865, -1125, 5683, -460, 1265, 7711, 8180, 6773, 9038, 6039, 8137, 7054, 5378, -8257, -4757, -1857, -2376, 3665, -6213, -15606, -10048, -4760, -4788, -3885]
20088c885L659J971l485k050n709N07P595O484k678j317l151J980L01j706O432
20073D948m410r384K382O294Q250M005m596j148r980m263M231M201K008N238r566
20058a790j0406N718R675r82o796K203r91O651P163M89l334m253j770l24j3094
20043a1841N262J9066J1033j2039r870o046l045n377K353L206O299p466L40O124
20029b001L73K633J539L993j843m716n591J590O968N645M955o596k508M594l898
20014E137K145K143M670r391L504R397m617p263j933j159m016K625k307p126o82
19999h873J43j845j701P300J1693q233j676Q802K088l281K209k398J677N156J489
19984A2550L335J137k796K190k636n347k543k325N446J1492M241n318m245k813
$$ y = [-3885, -226, 1745, -1740, -3790, -9499, -8992, -1397, 5087, 2409, 1092, -2059, -79, 222, -1484, 4948, 538, -8846, -6464, -170, 8080, 12085, 7489, 6341, -3639, -7902, -3671, 530, 2538, 7776, -1790, -12196, -6478, 3197, 2215, -4581, -2378, -3369, 3282, 10445, 10934, 7600, 3347, 1577, 1253, -11841, -6579, 12487, 23520, 11481, 1611, -4435, -7480, -12857, -10504, -7298, -999, -8465, -8125, -2001, -1628, 1005, 2544, 6537, 4694, -22, -5613, -4023, 2945, 8590, 13545, 6949, 4441, 9035, 5137, 7282, 9425, 14095, 4704, 8208, 17605, 12988, 5725, 3792, 2633, -1383, 1242, -1065, -8191, -8873, -8730, -10575, -12276, -4976, 6717, -1516, -3192, 5610, 7698, 4417, 6626, 4228, 5905, 11061, 12550, 15885, 17022, 14226, 16416, 13780, 8433, 5890, 3565, 9011, 20503, 24744, 19426, 15181, 12368]
19970A2368N527m774R20L581o191l426M889k928N431J1946P476J0056M372K1967
19956G1214L5679L8323N4039L9824L449l5699n6831n4743l3712j7548p79L949
19944D7165J628j4259j7350K951K933j0094j3407J75P367r222q25l903k339J6385
19930G205Q599O64p068n026J558M009m520q680m755O645J2927p197q415k442k107
19915h603l778L50J1291M479N50N227J605K980p036k43L456l896l032l995o269
19900f914j882N886J27M310m779p035K81j647K088J5481P889N040l484n017p260
19885C084j147q949o727P39J1069J2364k193l799m259K866j901J763L063N378
19871A1351l156j689k582p245K230q54L576M264n207J543R61n891k021m494K895
$$ y = [12368, 17895, 13121, 14041, 17622, 11431, 8005, 12894, 9966, 15397, 27343, 34819, 44875, 49247, 71214, 106893, 145216, 199255, 239079, 242528, 206829, 149998, 95255, 61543, 43995, 43216, 47165, 48793, 34534, 17184, 20135, 23068, 12974, -433, -258, 7109, -2113, -2938, -6841, -9180, 7205, 15804, 16468, 9400, 4374, 5932, 9941, 5421, -3259, -8014, -1369, 11558, 4361, -4054, -6496, -8603, -12381, -12031, -740, 3739, 4289, 9516, 11121, 14101, 7065, 6822, 10278, 6382, 3350, -645, -6914, -8796, -2910, -2783, 1527, -3252, -10287, -10006, -11653, -9565, 5916, 13805, 18845, 15361, 10344, 3084, 1937, -7012, -13739, -13000, -1931, 10433, 8240, 4441, 182, 3048, 1147, 2910, 5973, 11351, 8195, 6506, 3924, -3321, -1091, -1945, 1631, 5895, 688, 2231, 3192, -2699, -4720, -9214, -6319]
19856f319M538k315q033R62Q430O780O37k061J306n999K009M591l38L763m382
19841C569M08M856q26p095n753n609K70k99O337m880J388k319k429l021N991J1123
19825A711M224n623o795J705l286K447J1322O082n165o912p95N895j0447j308
19811f945K012L10j1476k616M132P776Q098o9k947l496K420L87l905q627Q960
19796e986J1656M100P433n959n136q048j0256M462P138P779o99n277l551l19m590
19781g253r02M396J419o811l791j489l32Q088J719n707p357j6613M178J370m45
19766b9530J467k879J2518J4280O80p231L434N309p944l407N324O171J0235M223
19752A2650k939m457n330k910M16K551K495J632j938K730j600p009l112k442N598
$$ y = [-6319, -1781, -4096, -12129, -11167, -2737, 4043, 4680, 2619, 3925, -2074, -65, 4526, 4188, 7951, 3569, 3977, 8833, 8007, 912, -4841, -10450, -10180, -10479, -4142, -9022, -7634, -9953, -12382, -15403, -9412, 1711, 5935, 312, -6483, -4778, -8064, -5617, 5705, 11787, 6622, -290, -1085, 4810, -5637, -6945, -4933, -4623, -16099, -18715, -14583, -6807, 1291, 1222, -1725, -5221, -2801, -2414, -6319, -14946, -5986, 5670, 9770, 17203, 11244, 6108, -1940, -12196, -7734, -596, 7183, 6484, 1207, -2344, -2663, -7253, -8155, -3759, -2340, -9151, -12942, -14431, -14763, -6675, -4956, -10663, -18020, -34633, -30455, -29085, -29530, -28063, -30942, -18424, -4144, -3464, -10695, -7261, -1952, -9896, -13303, -7979, -1808, 8427, 12650, 9711, 5254, -76, -2986, -2570, -19, 2476, 4108, 2170, 4900, 3300, -3709, -6821, -9263, -3665]
19737c665P00J0170m171k500M026J1307O345l514j6050j070k933n550N42O073
19723b90N199l780o221J3l050J898L531K314M157J066j859J931J0520o161j4198
19708d930o811j2541N484J0957P220R664j366r080L023j182j2264m583P581J0199
19694A371Q232o430r774j0127J093K222L575Q292O644R306O376J999q647m693
19680I439j0606j308N557J4518k804j801O296p867j1365P562M594k160Q301K012
19666B0368l058m612p84J690k02k904j01o537q109r132R53Q961J6598K857q749
19651G239k101n534K663r253n188l26Q91j0128j882P304K437l077N91j352n148
19636b2864M996J1885K897k190O010k543N567m738o906l392R597O865N381p270
$$ y = [-3665, -2965, 7205, 3034, 534, 4560, 15867, 22212, 18698, 2648, 1578, -1355, -6905, -6363, -290, 4909, 1129, -5092, -5079, -8129, -6231, -2700, -386, 3771, 4837, 2978, 4909, 15429, 9268, -4930, -11741, -24282, -18798, -7841, -621, 9043, 7677, -1403, 1620, 438, -11826, -16409, -8828, 1371, 9603, 3173, -6601, -16728, -15635, -13413, -9838, -1546, 5098, 14404, 20780, 22779, 14132, 9439, -1167, -2475, 3082, 17600, 14796, 12995, 19291, 11424, 59, 7621, 12215, 10055, 18356, 20368, 17310, 12698, 11914, 13604, 13402, 10498, 10397, 3860, -4249, -13381, -12428, -3467, 13131, 15988, 7239, 5138, -396, 2267, -6986, -12174, -12500, -11609, -21737, -23619, -16315, -13878, -16955, -16364, -17716, -22864, -17868, -5983, -3086, -5276, 734, -1809, 3758, -980, -7886, -11278, -1681, 5184, 10565, 3295]
19622C295k065L99P77n606n889r10N184J4806N603L00N335J214j883p734j0287
19607B539O8J5580J3207m613J865j799j5860n894j062K35L38J0194M019l031p422
19592H364j3269P831n615n972J881P063J4001M093o956m908M556n258j0845l75
19578e409J967O314M516j1408j293M27j923J851k699J1074M927k283K983M261
19564A3305p231K281N965r48l734k044K639q234m628K109N110o080l072Q806R930
19549A4174L795J642p494J565L269O442J2653R128J861L090l096K681O417K789
19535E8916m749p103P328K985N236Q282m043R578J4844N256J3987O527l915J2655
19521A25784R885j531J544J2671R572k820n876o920j0821r229j5463j2610j19
$$ y = [3295, 1230, 1629, 2406, -3200, -9089, -9999, -4815, 9991, 15594, 15894, 21229, 22443, 20560, 12826, 2539, 2607, 18187, 31394, 26781, 28646, 26847, 10987, 5093, 4031, 4266, 4604, 14798, 18817, 15786, 8364, -4905, 2926, -2689, -8661, -6780, 283, 14284, 18377, 11421, 6513, 11069, 5811, -5034, -5409, -3442, 2872, 7388, -4020, -5313, -4886, -6809, -4958, -7657, 3417, 8344, 6061, 9044, 13305, 6074, 8355, 14320, 13372, 9638, 7594, 10233, 1999, -2629, -520, 4590, -1490, -4562, 4244, 14174, 17969, 19611, 12117, 13682, 16951, 23393, 36046, 45174, 47035, 50125, 47029, 49710, 56127, 58916, 54167, 47064, 54392, 57377, 62613, 70895, 66852, 76430, 91274, 96530, 110517, 117044, 113129, 125784, 135669, 134138, 135682, 148353, 157925, 155105, 149229, 142309, 131488, 122259, 106796, 94186, 94067]
19508I4067o135L386O562j302j4556j0338j820k233o132p809m595j695L98p955
19494C9843l48L156j0912j6158M854N542q136p049j924k086N793j0630n327L348
19480c4L068m160j39Q29N421l548m559R274K586k553K337l189O925J877j678l539
19464H918j1549K11N815N815O718q984n709j1383q39p181k129L384Q661N169J450
19449a633J917R188P951o079l090M344J01M39N264M970q481j2981j741l323o039
19434i193M050P136J7068r503J541L18l69k479j346R832j209l287p07n526p3m380
19418A873k931M909K12p398j0221Q915R993L372q562o763o41K98q663Q551J5008
19403G952M311o559j72O378P681O741j0056j0730k664J644J065M072m16n814k423
$$ y = [94067, 87932, 91318, 97880, 96578, 82022, 71684, 69864, 67631, 61499, 53690, 49095, 47400, 47798, 39843, 39495, 42651, 31739, 15581, 20435, 25977, 17841, 10792, 8868, 6782, 12575, 1945, -3382, -34, 3034, -1126, -1265, -436, 4985, 1437, -3122, 6152, 8738, 6185, 8522, 5333, 12258, 14135, 12457, 8918, -2631, -2420, 3395, 9210, 15928, 6944, 1235, -10148, -10987, -18168, -20297, -16913, -8252, -3083, -1633, 284, 9472, 17423, 11344, 8254, 12598, 12699, 13138, 18402, 23372, 14891, 1910, 169, -3154, -9193, -5143, 1993, 19061, 9558, 11099, 11417, 11048, 8569, 7223, 17055, 15846, 12559, 11852, 6326, 6253, 1873, -1058, 3851, 4063, -3335, -13556, -4641, 5352, 8724, 162, -6601, -7242, -6944, -15607, -7056, 7952, 12263, 5704, 5532, 11910, 19591, 26332, 16276, 5546, 2882, 4526, 5591, 9663, 9247, 3433, 1010]
19388A010n53l006L186Q276l431o133K428k074O188J1976L282L57r414p862m506
19373b76k852J657J963o587j2973N296J3572P013m942m906k289P500N664M717
19359A2557L917J150j702j0609m851l43L368M030j643j345L531m197j0318L060
19345c395Q779J715k96m723j2483n961J2040L974M405l436J629N071K895K022
19331A2236n890n944O213r042n962R731R480J454j60l826l987K513Q840n680q463
19316A513o293m882k546N082N031n051j1673P024j454l879k38K309Q034K0704
19302A3681l093q583r157j2517K390Q143P5J898k99P852O42Q119P925P95p057
19287A0814m150l457l657q936N150R922L554J625m441n912o472M988L365N127
$$ y = [1010, 457, -2549, 637, 8913, 5482, -651, 1777, -297, 5891, 17867, 21149, 21506, 12092, 4230, -276, -3128, -1471, 492, -6095, -19068, -13772, -200, 6813, 1871, -3035, -5324, 2176, 7840, 12557, 16474, 17624, 15922, 5313, 462, 119, 3487, 7517, 5874, 4529, 8060, 3863, -6455, -3395, 5384, 7099, 6803, 2080, -10403, -16364, -4324, -350, 4055, 619, 2248, 7319, 10214, 12236, 6346, 402, 6615, -2427, -8389, 1342, 10822, 12276, 12116, 8290, 4303, 6816, 15656, 9976, 1513, -4780, -9662, -12208, -7126, -2095, -7146, -18819, -11795, -13249, -17128, -17366, -15057, -7023, 13681, 10588, 2005, -7152, -19669, -17279, -9136, -9061, -7163, -7462, 390, 1032, 9151, 17076, 17871, 10814, 6664, 3207, -450, -9386, -4236, 5686, 9240, 10865, 6424, 512, -5960, -972, 2393, 7520]
19273G520K114j1816m380J4266J2363n530o567o04M656K938j2141q899K174N244
19259A338N99R06P632p917j7592j542P281J2283J7473J869j3235o358J2549q840
19245F446j1372l459N673J561O457P019q201L725n918Q19k409M110Q554P983L475
19230B4463l729J29n349L261M645K556o037r808j259L045j03m689M918j6J594
19215A3621p536P34J0405M628M354r078o691K500n288L538K085n840j0002R274
19201F704J4427J603m030J04j4281k591K510P099m638J2451J1294O498j502N10
19187C6158L282o19L811P563M394J4610R520o004k3154j9782k725k613L712k748
19173B5405l097m008q259m648M484j845J622O305r678o723k326L106O068n26K310
$$ y = [7520, 9634, -2182, -6562, 7704, 20067, 14537, 7970, 7366, 12022, 14960, 2819, -6080, -3906, 1338, 1937, 2843, 10475, 2558, -15034, -16576, -9295, 2988, 20461, 22330, 9095, 2737, 15286, 6446, -4926, -8385, -2712, -1151, 5306, 12325, 4124, 7849, 1931, 2750, 341, 4451, 13005, 20988, 24463, 20734, 20863, 15514, 18775, 23420, 25976, 19939, 10131, 8872, 11917, 11814, 7125, 12043, 12027, 13621, 6085, 6819, 17224, 21852, 26206, 17128, 10437, 12937, 7649, 11187, 13272, 7432, -2570, 6704, 21131, 22734, 18704, 18808, 4527, 1936, 4446, 11545, 6907, 19358, 30652, 37150, 35648, 36158, 39440, 38821, 42632, 50195, 54589, 69199, 78719, 72715, 49561, 29779, 27054, 24441, 28153, 25405, 22308, 18300, 10041, 5393, 9877, 8032, 9654, 15959, 6281, -442, -2768, 338, 6406, 5880, 8190]
19158H190P197k69N601Q874q602n589K717J5914J4327J5724k248j754j8165j2707
19144B9210p093m907K868Q77P065K511M587K610N540L233m155l616o307m978O09
19129B8054M530K035K339J9305O212j1624n702k646O700N283J1928J5205J0156
19116I1775k278r671r538r405M869o371L343m08M57j058j0286j0427M391J362
19102D6755M953o323m433J188J0882O263j80N424p513m102k748n730N062l368
19088D6130K791N549M196K3176J3230Q251J3628J1310J6856L4598L8953P8418
19076B97086J36996K18125M10441N65962K08101j35635m22824m67253k74153j67453
19066C69393j10238o6820m2263k4603q411j362J817p105n188n887L311P271O62
$$ y = [8190, 15387, 15118, 20719, 29593, 20991, 15402, 18119, 34033, 48360, 64084, 61836, 60082, 41917, 29210, 22117, 17210, 20078, 20955, 28020, 30531, 35118, 37728, 43268, 46501, 42346, 38730, 32423, 27445, 28054, 32584, 34619, 36958, 56263, 62475, 50851, 45149, 42503, 49203, 54486, 66414, 81619, 91775, 89497, 79826, 70288, 60883, 65752, 59381, 62724, 62316, 62773, 61715, 51429, 41002, 45393, 46755, 51708, 45385, 40952, 42140, 53022, 59285, 59105, 64529, 57016, 52914, 50166, 44436, 49498, 46130, 48921, 54470, 58666, 81842, 95072, 103323, 116951, 128261, 145117, 179715, 218668, 297086, 434082, 652207, 1062648, 1628610, 1836711, 1701076, 1278252, 810999, 536846, 369393, 259155, 192335, 150072, 125469, 117058, 115696, 117513, 110408, 105220, 99333, 102644, 109915, 110577]
19053A10577J5228K1994K6603L7005M9060Q7534J49695K40293M59199O69846L06596
19042B173630j22124m64925n92513l64435k04482j32722q4765m2267l1004j9565
19032A14828j7538r700k0436r358j609m610o325m745p637m053J025m892L929M459
19018C3338o796o497p726m263M453R79J131L910n205J054O642o68k853J375r77
19003A7897m950p816j690Q121R298o54n802Rq468M389L698J6487j796j6140m888
18988G695P825L094Q683R252n286r458m002n432O232N424Q25O255K982m05N078
18973C8762L807J0628J6494K1068L9339O5283J18267J86899J12102j7198j11917
18962D83534j66822j07717n9966n0443k7119j2859j8793j3329N38j131J470j4830
$$ y = [110577, 125805, 147799, 174402, 211407, 260467, 348001, 497696, 737989, 1197188, 1867034, 2173630, 2051506, 1586581, 994068, 629633, 425151, 292429, 207664, 165397, 134393, 114828, 97290, 87590, 67154, 57796, 56187, 51577, 45252, 40507, 32870, 28817, 29842, 24950, 28879, 33338, 26542, 20045, 12319, 8056, 12509, 13488, 14619, 18529, 13324, 14378, 21020, 20352, 17499, 18874, 17897, 12947, 5131, 3441, 11562, 20860, 20206, 14404, 14413, 5945, 10334, 14032, 30519, 28723, 12583, 7695, 15520, 18614, 27297, 36549, 31263, 21805, 17803, 12371, 18603, 24027, 24852, 31107, 34089, 33684, 38762, 42569, 53197, 69691, 90759, 130098, 195381, 313648, 500547, 612649, 595451, 483534, 316712, 208995, 149029, 98586, 71467, 58608, 39815, 26486, 27024, 25893, 27363, 12533]
18950A2533M87K763J0420p14J592J67K092L790m408L948l649j769k625j0012j65
18935A4450L196N503o707J816K749j1913m981O8P221J0412p010j1185M25M897
18921H941M695O593l326K985J97q092M781N881k725q17r559Q805J7433J2756K1600
18906G0148M241j0588j3983k019k740n442q035j2393n016J225p70J975j482O202
18892B1323M481l379j947j1813N151P137p15j991p102m284J1379J1988N386j1063
18878B4551j1544p765L844J491l019N724J785K526O6M81p993m38J0218o750n030
18863H147p499K776Q992R674p427m624l186k587O973K995o061p735k52Q225M785
18848A3196k682p248N971j505J2541N373j0322k076R489j077n903k121l185R154
$$ y = [12533, 13020, 15783, 26203, 25489, 27081, 27248, 29340, 33130, 28722, 32670, 29021, 27252, 24627, 14615, 14450, 17646, 23149, 16442, 18258, 21007, 9094, 4113, 4181, 11402, 21814, 14804, 3619, 4044, 8941, 13636, 20229, 16903, 19888, 20085, 11993, 16774, 22655, 19930, 19113, 9554, 18359, 35792, 48548, 70148, 74389, 63801, 49818, 47799, 45059, 39617, 31582, 19189, 14173, 15398, 14628, 16603, 15121, 21323, 25804, 22425, 20478, 8665, 13816, 20953, 20238, 18247, 11145, 6861, 18240, 30228, 35614, 24551, 13007, 5242, 9086, 10577, 7558, 13282, 15067, 17593, 17659, 18140, 10147, 9709, 19927, 13177, 8147, 648, 3424, 12416, 22090, 14663, 10039, 6853, 4266, 11239, 14234, 8173, 438, 186, 8411, 13196, 10514, 3266, 9237, 7732, 20273, 25646, 15324, 13248, 22737, 21660, 15757, 13636, 10451, 19605]
18834A9605k948r538J077Q018j0820N80l775l341J3196L373Q90L604p564j1593
18820G64K725j0458p072K459J804l336N199J4616N578j1157j978P628J427Q59
18806I058l273q246n362N658R430PJ181M991o28k116n922j716o266R824J0642
18791A7262l525j1342L467N622J1238j454J0890K3179J2644Q393m142n360p821
18778E9051O61r711l179l449j4302J0338Q456O155Q043L727J4587L1834L3396
18765A45607L228j4714j6307k4488j4621q944k786Q996O519L981O816N187j0579
18752H7895j1827j0914o182L512r313j2053n713J896K809n027J936n969r328r670
18738A2052M445J841M263m858P02R97l785n736N321j270r486J0163K1145P250
$$ y = [19605, 16657, 7119, 8196, 16214, 5394, 5974, 2199, -1142, 12054, 15427, 16317, 19921, 12357, 764, 3489, -6969, -14041, -11582, -9778, -13114, -7915, 6701, 12279, 1122, -856, 6772, 8199, 9058, 5785, -2461, -7823, -2165, 7265, 7272, 8453, 13444, 12816, 10700, 4778, 3062, -3204, 6620, 17262, 13737, 2395, 5862, 11484, 22722, 21268, 32158, 55337, 67981, 76374, 72232, 66872, 59051, 59712, 50001, 46822, 43373, 29071, 39409, 47865, 54020, 62063, 65790, 80377, 112211, 145607, 148835, 134121, 117814, 93326, 78705, 69761, 66975, 75971, 82490, 86471, 93287, 98474, 87895, 76068, 65154, 58972, 62484, 53171, 41118, 35405, 37301, 40110, 35083, 37019, 31050, 21722, 12052, 16497, 18338, 22601, 17743, 18445, 19442, 15657, 9921, 15242, 13972, 4486, 14649, 35794, 43044]
18724D3044q979p079J4515K0333J7866J6029Q461N808J4159R186j1783j9203k2789
18711G9568k5061k0219k2475p377K574L11p294J681O257J57K265Q02j715m963
18697D511K694q617J091J6991K956r924n770J0167Q370l692j788p130L827M851
18683A8537l08k829o379K764j435j992N091q787J072J006j158J0946j25k898M331
18668A7836K620k584o936n408l073N733R253p575P97K281l847K565o395n153L712
18653C826K821m087j0206N528j557p924M502L937N05Q623J4262k896p970k361
18639G003l40J841P29k77N611K271k901M448O460m885J820j201l249n349K588
18624A4569O627k775j914j032j245O98k487p835n36m442M182J1129J4166N11m191
$$ y = [43044, 34065, 26986, 41501, 61834, 79700, 95729, 104190, 109998, 124157, 133343, 121560, 102357, 79568, 54507, 34288, 11813, 4436, 7010, 7321, 27, 1708, 7965, 8122, 10387, 11189, 9474, 4511, 7205, -1412, -321, 16670, 19626, 9702, 3932, 14099, 22469, 18777, 16989, 9859, 13686, 18537, 18229, 15400, 9021, 11785, 10350, 8358, 13449, 4662, 5734, 6740, 5582, 16528, 16403, 13505, 17836, 20456, 17872, 10936, 5528, 2455, 8188, 17441, 9866, 10663, 12944, 9097, 11662, 5267, 114, 3826, 6647, 2560, -7646, -2118, -3675, -11599, -7097, -3160, -2655, 5968, 20230, 17334, 9364, 7003, 6663, 8504, 9233, 8956, 14567, 16838, 13937, 18385, 24845, 19960, 21780, 20579, 17330, 11981, 14569, 21196, 18421, 16507, 15475, 14230, 14928, 12441, 4606, 4070, -372, 3810, 14939, 29105, 29616, 25425]
18609B5425r096j1176M610L304L082J077n89L45j227j0977r42M33q190J8672K0099
18594C4850L646m629K405l137j1754m801L578Q186k493p190P532P475M342l619
18580C4391j751M448O193O964O203L826J3436K0508L5313N5228R7363R6679M4449
18567D23250j9727p1148q9916o9316m0671l3840k3673j4975M53P589N749j347
18555G2428R54J8603L1532J7412p907k5653l6321k2489j1590L834j7766k987k906
18542A7144j1260J955P275J90j0250M845J4816Q375m186q977j1869n99J1722M718
18528B3899j412M248k171O491O176o638j257q558n953j141P24O712M300J592N331
18513C2343J710o260p698m724K924L679n151k475M143P089l065n495j026R737
$$ y = [25425, 16329, 5153, 9763, 13067, 16149, 17226, 16637, 16982, 15755, 4778, 3836, 4269, -3921, 14751, 34850, 38496, 33867, 36272, 33135, 21381, 16580, 20158, 28344, 25851, 18661, 26193, 33668, 38010, 34391, 32640, 37088, 43281, 50245, 56448, 60274, 73710, 94218, 129531, 184759, 282122, 378801, 423250, 403523, 332375, 242459, 173143, 132472, 98632, 74959, 59984, 60437, 68026, 73775, 72428, 73382, 91985, 123517, 140929, 133022, 107369, 71048, 48559, 36969, 40803, 23037, 20050, 17144, 5884, 7839, 15114, 15304, 5054, 9899, 24715, 33090, 28904, 19927, 8058, 7459, 19181, 23899, 22487, 26735, 24564, 31055, 37231, 30593, 29336, 20778, 14825, 13684, 14408, 21120, 25420, 27012, 32343, 34053, 27793, 20095, 15371, 18295, 21974, 16823, 14348, 18491, 25580, 22515, 17020, 15994, 25731]
18499B5731O366n456o39l160p684j462J3953P569q643p097J3979J5411J6599Q775
18485G4242l579k570p664q105k368n249k320J852N281J4109k23j6093j0395J460
18471C8378m473K745L417m570j657J083K447J0600Q571j4263j8934q134P266o7
18457B2409n510k051N001q237K234k316O438J6779M897O78n535L962j620n875
18443C1254J075Q245m992k020l539m952r153o761K391L140J0157J3350L266p465
18429C3996J0037P697L914P377l753J3074J9530M404o227L748j610l676J641L5
18415I0187j0021k194O47p90q596j506L709N567j197N570J6460J5644M086J6348
18401A33914K6754L2847M3729N3137Q1427J30887J03971Q4764M6500j5066o8383
$$ y = [25731, 32097, 26641, 26002, 22842, 15158, 13696, 27649, 35218, 26575, 19478, 33457, 48868, 65467, 74242, 70663, 68093, 60429, 52324, 49956, 44707, 42387, 44239, 49520, 63629, 63406, 47313, 36918, 38378, 33905, 36650, 40067, 35497, 33840, 34923, 37370, 47970, 56541, 42278, 23344, 15210, 22476, 22409, 16899, 14848, 19849, 11612, 13846, 11530, 17968, 34747, 39644, 40322, 34787, 38749, 37129, 31254, 32329, 40574, 35582, 33562, 30023, 25071, 15918, 9157, 11548, 14688, 24845, 38195, 41461, 33996, 44033, 51730, 55644, 63021, 59268, 72342, 91872, 96276, 90049, 93797, 92187, 88511, 90152, 90187, 80166, 77972, 78619, 77829, 69233, 67727, 71436, 77003, 75806, 81376, 97836, 113480, 117566, 133914, 160668, 193515, 237244, 290381, 371808, 502695, 606666, 691430, 737930, 722864, 654481]
18390F54481q5558o5422l021K5962l951m9002r7566j01243o4324n0620k9497j5292
18378A14947j071M335n854R41J5872J5778K4835K5788M3582P1329J05123R7112
18366E12717L9088m4823j12365j10865p5286n7976m0543j9893j3672j0257M044
18355G0169o781j1053q639P7M025j168K131r796n207J370p190O96O27l509J0444
18340C6196R336M632r107r456P703O335J651k749Q176K1785J1142O682J042J0642
18326A04010K2338K6849M2297O1733P8608J10133J75921K57372L23500K49407
18316A452168M5726j43995k68581k55692j64365p7637k0537j0429n4734q9712
18306D12212r5544q0695n8300l0266k0751l480J251J611J2584K6859M1644R713
$$ y = [654481, 568923, 503501, 500480, 526442, 522491, 473489, 375923, 274680, 210356, 159736, 130239, 114947, 113876, 118211, 112357, 113298, 129170, 144948, 169783, 195571, 239153, 310482, 415605, 512717, 551805, 506982, 394617, 283752, 208466, 150490, 109947, 90054, 76382, 66125, 70169, 63388, 52335, 43696, 43773, 47798, 46630, 48761, 38965, 33758, 35128, 27938, 28634, 29261, 25752, 36196, 45532, 50164, 41057, 31601, 39304, 45639, 47290, 44541, 52717, 74502, 85644, 92326, 93368, 104010, 126348, 153197, 195494, 257227, 335835, 445968, 621889, 879261, 1202761, 1452168, 1497894, 1353899, 1085318, 829626, 665261, 587624, 567087, 556658, 501924, 412212, 316668, 235973, 177673, 147407, 126656, 123176, 124427, 126038, 138622, 165481, 207125, 216838]
18294B16838k4378l6943l7867j3397o519q015j8962j6646K368J808M685J687k488
18281F2171M762J1304J3783J4074N989o146j0770N15R494J2422J0166J6588J4668
18268A59020J6975J8412J3044J1080K8099L8125O6604J17976K06139L03892K48751
18257A228117M3341j33147k46377j92410j17484l1973O0731J71119K82367J98155
18247A262439l5193j98344l03009k30832j35726r0234o0233m5515k5442j9205
18237A18706j1303J92m15q748j7565m887p698m188R880m13q465N706O439K260
18223G9501O029L28j44L048l70L937J379o904m597j2520k894M019o398k390m621
18208E7403K346L819n4m091n069O762j4603r245J2229Q758M280l891q588o001
$$ y = [216838, 192460, 155517, 117650, 104253, 97734, 89719, 70757, 54111, 56479, 58287, 62972, 64659, 62171, 66933, 78237, 92020, 106094, 112083, 105937, 95167, 95682, 105176, 117598, 127764, 144352, 159020, 175995, 194407, 207451, 218531, 246630, 284755, 351359, 469335, 675474, 979366, 1228117, 1271458, 1138311, 891934, 699524, 582040, 550067, 610798, 781917, 1064284, 1262439, 1227246, 1028902, 725893, 495061, 359335, 269101, 208868, 163353, 137911, 118706, 107403, 107595, 107180, 98432, 80867, 75980, 68282, 64094, 73974, 73561, 65096, 70802, 77241, 79501, 85530, 85858, 85714, 88762, 88392, 92329, 93708, 86804, 82207, 69687, 66793, 70812, 64414, 62024, 57403, 59749, 63568, 63514, 59423, 54354, 61116, 46513, 37268, 49497, 58255, 62535, 58644, 50056, 44055]
18194D4055j147j0353k112p505m505J2663J1241O036N495l195Q74j0R688P806
18180F9031M424Q579N868J102k327j1835j0387m07K438j578O103Q795J667o633
18166G4840k2411q376Q552P822Q850N947R291J4406K978m629j388K53r542M829
18152I1422J7693n333n151k323J520J449O852K474K2Q0R669m743J7129J3794K1050
18137A65604L5060L2514L0892L4152K7077J1446J7277L1902M1966M7921N3373
18126E29184N5484L7527J160l208q641J3187N3624Q6227J26867J83993K40656
18115A316060L05552L93935N48804Q60915J466058K696107M943979N590175J405157
18106A9526742j885274m946103m832688k799947j639501j020784o37552m10113
$$ y = [44055, 42908, 32555, 30443, 22938, 18433, 31096, 42337, 48373, 53868, 50673, 51547, 51537, 61225, 69031, 73455, 82034, 87902, 89004, 86677, 74842, 64455, 64048, 66486, 64908, 71011, 79806, 81473, 74840, 52429, 44053, 52605, 60427, 69277, 75224, 84515, 98921, 101899, 97270, 95882, 96135, 86593, 91422, 109115, 103782, 98631, 96308, 97828, 99277, 106129, 108603, 108625, 108705, 118374, 113631, 130760, 144554, 165604, 200664, 233178, 264070, 298222, 325299, 336745, 354022, 385924, 427890, 475811, 529184, 584668, 622195, 623355, 620147, 611506, 624693, 678317, 764544, 891411, 1075404, 1316060, 1621612, 2015547, 2564351, 3425266, 4891324, 7587431, 12531410, 18121585, 19526742, 17641468, 12695365, 7862677, 5062730, 3423229, 2402445, 1764893, 1354780]
18098A354780k78201j80969j10903q4357o7550m8558k9923k0014q475n962J1253
18087E31121K5136K4663L2932M4015M4402N0388N3155K7811j6104n0754o4683
18076G02082m9165n189L2962L9731K8966O464k7216p3966r4820r0514p4044o4518
18064C30773n0142l9608k1446j5672j1547p559N218J1397J4273K6412M2116L4159
18052C18374R198j2399k4774k7665k8763j0340r318k138J3376K2417M3529P0474
18040C61971R7928J33272J63329J57572J15110L9489k5501n3623m2749m1755o7928
18029H37115q8846r1848q3184o0045n3859n4259n3531m3400k7565k7107k2961
18018B30510j8004j6318r188j0086n076n409j4707m667j2923j2810k1877j7548
$$ y = [1354780, 1076579, 895610, 784707, 700350, 632800, 584242, 554319, 534305, 525830, 519868, 531121, 556257, 580920, 613852, 657867, 702269, 752657, 805812, 833623, 817519, 766765, 702082, 652917, 647728, 680690, 720421, 749387, 755851, 728635, 654669, 559849, 469335, 395291, 330773, 280631, 241023, 219577, 203905, 192358, 184799, 190017, 201414, 215687, 242099, 284215, 318374, 327572, 315173, 290399, 262734, 233971, 223631, 214313, 212175, 225551, 247968, 291497, 361971, 459899, 593171, 756500, 914072, 1029182, 1068671, 1043170, 989547, 946798, 905043, 837115, 748269, 656421, 573237, 513192, 459333, 405074, 351543, 308143, 280578, 253471, 230510, 212506, 196188, 187000, 176914, 171838, 166429, 151722, 147055, 134132, 121322, 99445, 81897]
18006H1897K087N880J6639L68K219N950l760m106J3947K1056J1994N672k572j4967
17992A42304K258k645K773J5306J6970J9098K7445K6078K5060M3113O4233O7129
17980D49122N7794N8355P1475Q2669J08784J24331J03519R7554R5273J01880Q2502
17969A433258N9163K0030J5170J9821n418n3127o7677o2945p5433j23309j35135
17958A024398j49026j35644j17618q6596l6667l0739k6609k7393j5113k0268k6189
17947C52536l0807j9607k5900n599j2776m064M477J3552J6616J8612K2592J3869
17935C43501J3373L7402M2363M5882L5646K2998K4476K5041L9687M8907K1049
17924G00325J9929J3593P741J3518L522j0971L63J2281J3339j9988m0002m1356
$$ y = [81897, 83984, 89864, 106503, 106871, 109090, 115040, 111280, 107174, 121121, 142177, 154171, 159843, 157271, 142304, 144562, 141917, 144690, 159996, 176966, 196064, 223509, 249587, 274647, 317760, 381993, 449122, 506916, 565271, 636746, 719415, 828199, 952530, 1056049, 1153603, 1248876, 1350756, 1433258, 1492421, 1512451, 1527621, 1547442, 1542024, 1488897, 1421220, 1358275, 1282842, 1159533, 1024398, 875372, 739728, 622110, 535514, 498847, 468108, 441499, 414106, 398993, 378725, 352536, 321729, 302122, 276222, 270623, 257847, 253783, 258260, 271812, 288428, 307040, 329632, 343501, 356874, 394276, 436639, 482521, 518167, 541165, 565641, 590682, 630369, 679276, 700325, 720254, 733847, 741588, 755106, 758628, 747657, 748020, 760301, 773640, 753652, 713650, 672294]
17912F72294m5805o6102p8149q2825n3870m6300k9449l8373l4117l1490l3485
17901A32329k8525j7614k1230k4060j1179L8537N0691l534L354L2399J1829o106
17889A56891J394p55m816j6444N584J4537J1237L569q03N35j4222j3578P896J416
17875A52441J0387J0410N474l484k7081o04J4704L640k657o660j3164j0676o565
17862A26165k5029o6619j06458o1381m362n632N055M5013O1013O2346M9051M2511
17850A21673K3545J1956r132j4755J657n208k676j7425j5233k4548k8876l4026
17838F952m9283m5680R427J14727J83813J62912Q2487j15783j53731j01620q7364
17827F857m7556O9038J21619O3932P6986N9841K7104P8054O6294Q138m100m6403
$$ y = [672294, 626489, 560387, 482238, 399413, 345543, 299243, 269794, 231421, 197304, 165814, 132329, 103804, 86190, 64960, 40900, 29721, 68258, 118949, 115415, 118769, 151168, 162997, 156891, 158285, 157530, 152714, 136270, 141854, 156391, 167628, 171197, 170394, 170929, 156707, 143129, 151025, 152441, 162828, 173238, 178712, 175228, 148147, 147543, 162247, 165887, 163230, 156570, 143406, 132730, 126165, 101136, 34517, -71941, -133322, -137684, -143316, -138261, -93248, -32235, 30111, 79162, 121673, 145218, 157174, 148042, 133287, 134944, 129736, 127060, 109635, 94402, 69854, 40978, 6952, -42331, -88011, -78584, 36143, 219956, 382868, 465355, 349572, 195841, 94221, 6857, -40699, 28339, 149958, 213890, 290876, 350717, 377821, 455875, 522169, 530307, 526207, 479804]
17815D79804p8158p5491o8004m4006m3783k8467j9448j0626R723J5547J1773Q157
17803A57021l560L958K5219J9635M175R63k04J3484K0984K1940L1858L1648L751
17790C30872j5644k6651k1613j2580j342J777O994J6286Q490J0846J0403L361
17778C11199J6741K1729K6356L3008Q949J4160J8077K7553M0820K9901M348J3276
17766E66117J1495K8106M4505Q5696J96671L25892K25409J3795j43871k30106
17756A123709j31455n2324n319L7585L9220K6717J3173J5806L0155J0742J5380
17745A123389M1610Q3841J60668J94386P1570k907n4798l8445N0947J10149J47050
17734A887460J92644K03487K01699J86008J79613J75249K67626M02473N58313
$$ y = [479804, 401646, 326155, 258151, 214145, 170362, 141895, 122447, 111821, 121544, 137091, 148864, 157021, 153461, 157419, 182638, 202273, 206448, 207411, 207207, 220691, 241675, 263615, 295473, 327121, 330872, 315228, 288577, 266964, 254384, 253042, 254819, 261813, 278099, 286589, 297435, 307838, 311199, 327940, 349669, 376025, 409033, 417982, 432142, 450219, 477772, 518592, 548493, 552841, 566117, 577612, 605718, 650223, 735919, 932590, 1258482, 1483891, 1497686, 1353815, 1123709, 992254, 939930, 934611, 972196, 1011416, 1038133, 1051306, 1067112, 1097267, 1108009, 1123389, 1164999, 1248840, 1409508, 1603894, 1675464, 1672557, 1617759, 1579314, 1630261, 1740410, 1887460, 2080104, 2283591, 2485290, 2671298, 2850911, 3026160, 3293786, 3696259, 4254572]
17725D254572P20914P83425O50832N88113N07084N91709R26509J315056J800795
17716A2139009K364694L273826M482689N912473P444773R039792J1567943J7235496
17708G3460695K8078008M8369316Q8951072J26678503O0276009k0674099q0838436
17701C24301068j13770472p4766469m3082557k7230817j7116399j0853739p591673
17694B9888942n890616m854823l917134k870024k071991j460252j106441q47097
17686F870564o07311n21932n96134o49397n62152l98776l33817l12141k94218
17677B594686k90061k24719j47446r8220o7969m5494o0253p0774q1993r9091r7938
17666A310728r9551p4882m5923o4327p6292q5802q3422p2470o1803m8278l8613
$$ y = [4254572, 4975486, 5758911, 6409743, 6997856, 7504940, 8096649, 9023158, 10338214, 12139009, 14503703, 17777529, 22260218, 28172691, 35617464, 44657256, 56225199, 73460695, 101538703, 149908019, 238859091, 365537594, 425813603, 405139504, 324301068, 210530596, 135764127, 92681570, 65450753, 48334354, 37480615, 29888942, 23998326, 19143503, 15226369, 12356345, 10284354, 8824102, 7717661, 6870564, 6263253, 5741321, 5145187, 4495790, 3933638, 3534862, 3201045, 2888904, 2594686, 2304625, 2079906, 1932460, 1834240, 1766271, 1720777, 1660524, 1589750, 1507757, 1408666, 1310728, 1211177, 1136295, 1090372, 1026045, 949753, 863951, 780529, 708059, 646256, 597978, 559365]
17655E59365j7112m518J5222J5921J1634O006p769J342J5203L155j5465l4523
17643E48461k0113k7891m5756m2452l5651k3421O823j37k9144j9227n395P950
17631C14047K0584J4166N225l6j2411o637k140m682q287j4568r0L590j8484q178
17617B82099r949m586j5806j7138n700N282j447p349j4296j0646n616q50L067
17604A97065n084N159R534N975N080M743j1102j0274j4347m760J421K873j2890
17591A73393m1702n2531m3675o909J8323M1613K1561L3737O4713Q0984R1129J19553
17579E00189O9236J9297k1971m0683j33781r0150l2014L5580O7250O3418j807
17568D34564m6870o0270m1232m1231k0953j8801k4629k9765l3749j9355m45J4162
$$ y = [559365, 542253, 537735, 552957, 568878, 580512, 586518, 578749, 580091, 595294, 598449, 582984, 548461, 528348, 500457, 454701, 412249, 376598, 353177, 360000, 359863, 330719, 311492, 306097, 314047, 334631, 348797, 354022, 353986, 341575, 334938, 332798, 328116, 319829, 305261, 305171, 308761, 290277, 282099, 272150, 267564, 251758, 234620, 228920, 234202, 232755, 225406, 211110, 200464, 194848, 193998, 197065, 191981, 197140, 206674, 212649, 217729, 222472, 211370, 201096, 186749, 181989, 183410, 186283, 173393, 131691, 79160, 35485, 28576, 46899, 88512, 110073, 143810, 208523, 289507, 380636, 500189, 569425, 588722, 566751, 526068, 392287, 302137, 270123, 305703, 372953, 436371, 434564, 387694, 327424, 286192, 244961, 224008, 205207, 180578, 150813, 117064, 97709, 97264, 111426]
17556A11426J6180L6115M5978O7907O6716L7782n754j0643l2272p7838q8517m8936
17544A18144r184L121N356P030J095j279Q871q851k8647j6650l167o671j502R491
17530G7157Q873p057j3617L9O025R516J2559J0854K0139n313k6022p546J2371
17517I7978J3853N339K792J0917j8394J1525M9317J3521j3306l3316k4256j1019
17505A04951k8568k4299k2613p689J1000J5772L063p403p616p703n537q637N916
17492B0637J7354K963O601J2514m779j6524O672J3815L77N870J264J0628m023
17479G3369L760m066j3825j600K310L54n03L518N109J459n128M582m80r879k672
17464E6308Q14J2016J111Q22J0264n45j0001q165j709j1309R546Q992o118q716
$$ y = [111426, 127606, 163721, 209699, 277606, 344322, 382104, 376350, 365707, 333435, 255597, 167080, 118144, 108960, 112081, 117437, 124467, 125562, 124283, 133154, 124303, 95656, 79006, 75839, 69168, 67666, 77157, 86030, 78973, 65356, 65395, 71420, 80936, 93495, 104349, 124488, 119175, 93153, 85607, 97978, 111831, 117170, 119962, 130879, 112485, 124010, 173327, 186848, 173542, 140226, 115970, 104951, 76383, 52084, 29471, 21782, 32782, 48554, 51617, 44214, 36598, 28895, 23358, 14721, 20637, 37991, 40954, 47555, 60069, 55290, 38766, 45438, 59253, 59630, 65500, 66764, 77392, 73369, 77129, 73063, 59238, 57638, 59948, 60302, 59799, 63317, 68426, 69885, 64757, 69339, 68859, 58980, 56308, 57122, 69138, 70249, 71071, 81335, 80790, 70789, 62624, 60915, 49606, 59152, 68144, 62026, 53310]
17450E3310n743j0111l584P469J3840J1204J3939K7453K3058Q937o756k6048l5190
17437G1778k5134p549O004J3180l005p326j424j1236j433L15K196k119j4973j5666
17423C608N095O083j3182p254O917M885l74J1087n768j9267j9782o533l41N871
17409b8955K0530M438R825M153P060N24R380J0059L892N258p294j5129j1008o808
17395E925j862Q840J358M191l637j3057J261l477O581q332L715J5251R847k973
17381B3631k0647o602M018K890k657j1975n081P601k553P40L8N493J512N766j417
17366G57j0707m486P356J672m231j5015K618J6525J0617L91n471n7P791p348J084
17351A496k475N988Q336l398k144n664q57O977M349J2057r181p322J020J557l251
$$ y = [53310, 47567, 37456, 33872, 41341, 55181, 66385, 80324, 107777, 130835, 139772, 133016, 106968, 71778, 46644, 39095, 45099, 58279, 55274, 47948, 46524, 35288, 33855, 34170, 36366, 34247, 19274, 3608, 8703, 14786, 1604, -5650, 1267, 6152, 5778, 16865, 11097, -8170, -27952, -34485, -34826, -28955, -8425, -3987, 5838, 9991, 17051, 17575, 26955, 37014, 40906, 46164, 38870, 23741, 12733, 5925, 4063, 12903, 14261, 18452, 14815, 1758, 3019, -458, 6123, -2209, 1506, 16757, 26604, 23631, 2984, -3618, 400, 3290, 633, -11342, -16423, -8822, -11375, -10635, -10597, -5104, -3592, 2174, 757, -9950, -14436, -7080, -5408, -9639, -24654, -22036, -5511, 5106, 5497, 26, -31, 7760, 412, 1496, -979, 5009, 13345, 9947, 7803, 2139, 1282, 8259, 12608, 24665, 15484, 8162, 9182, 10739, 7488]
17336G488o148J539j389J430m766O950N840R486j064n350j0950k269K683N552
17322I032n479l123Q416m285o068M96M449m560m731n910P937J5546L952K33L714
17307A9619M284J917j0393n966J923j320n558q922k714R64P522K952K413O006
17293A2727K146J249o37p584O128N262j1260m561l146j5634k538o089k820L824
17279b2933J8041J3956Q802j3904J02k036O22O146J1667R89l317r143j5799M734
17265b073J0114l727k551J060k455J835q134k145K562r832O710O114n232j954
17251i708K339l40j998j1269k488J0503M812n841j0628N56K985J7105Q137m137
17237B8K850j796o091J1240P257L855j0338K157M769k411l824k347n526r4J44
$$ y = [7488, 1340, 2879, 1490, 2920, -1846, 5104, 10944, 20430, 19366, 14016, 3066, 797, 3480, 9032, 3553, 430, 8846, 4561, -1507, -1011, 3438, -1122, -5853, -11763, -3826, 11720, 15672, 15905, 19619, 23903, 25820, 15427, 9461, 11384, 10064, 4506, -4416, -7130, -6166, 1356, 4308, 6721, 12727, 14873, 16122, 15485, 7901, 14029, 19291, 8031, 3470, 324, -15310, -17848, -23937, -26757, -22933, -4892, 9064, 17866, 3962, 4064, 2028, 2650, 8796, 20463, 21452, 18135, 8992, -6807, -2073, 8041, 4314, 1763, 2823, 368, 2203, -5931, -8076, -5514, -15346, -8636, -2522, -7754, -9708, -7369, -7709, -9707, -20976, -23464, -12961, -8149, -13990, -24618, -24062, -21077, -3972, 4165, 28, 2878, 1082, -5009, 6231, 13488, 17343, 7005, 9162, 13931, 11520, 7696, 5349, -177, -271, -127]
17222a27Q483o534m335O242K197j248j2198j1353l616M968R62P954O750J4022
17208A2167R87j4951j5564R147J0456L002K773J929r51o46o107R62o140p107p520
17193a7563l235N295O342N952P833M972N520j0028j2938M330O008k678q165J96
17179h159k45M531m706K124M864R471N782m874Q77J542Q021P123J3907J0614J1234
17164F2106M440K4863K8457K8986L9578M9505P0487J43840K47071L14487J81874
17153A195694k1127j73823k46295j72162p6148n334Q6057K02019K65361J20169
17143A174411p0467k32371k90354j89983j12785o7284m1428l0122k3222j6529
17133I9866k1961j7263r265m052j3022k0354o895m959M28J078R387n4p64l954
$$ y = [-127, 8356, 1822, -2513, 3729, 5926, 4678, -7520, -18873, -22489, -17521, -16559, -8605, -1855, 12167, 13154, -1797, -17361, -8214, 2242, 5244, 8017, 9946, 8995, 8349, 2242, 3204, -2936, -10043, -17563, -20798, -15503, -9161, -3209, 4624, 9596, 15116, 5088, -7850, -3520, 2488, -190, -8355, -8159, -8404, -3873, -8579, -6455, -1591, 7880, 13662, 8788, 9665, 11207, 19228, 26351, 40258, 50872, 62106, 66546, 91409, 119866, 148852, 188430, 237935, 308422, 452262, 699333, 1013820, 1195694, 1174567, 1000744, 754449, 582287, 506139, 500805, 586862, 788881, 1054242, 1174411, 1103944, 871573, 581219, 391236, 278451, 211167, 169739, 139617, 116395, 99866, 77905, 60642, 51377, 47325, 34303, 13949, 7054, 2095, 2523, 3601, 12988, 12934, 12170, 8216]
17119H216k388p9j1952l3p953L942J6247J1209M892p850j1851K508P630m182L276
17104A1632o693K156n262k160M971K375q0l71L737N7k557K332R304m225j1395
17089C821j4638o615r57O783J71J1420l545n508K20M120P574L878l334j0582m614
17074a1806O633M782K141m797L023N027K399j8492m496M784K989N844r915K085
17060i799P827j309L665j542k125K507O622P82J408K334j1619j644L552P813J619
17045A0091j5051o794l29o484P101J694N960O619j635r218J3434O480K161j2910
17031A119j5418k759J3153N226O662L43p753K227J3006N650k354K391J946j0889
17017A2550o140j220p359j0005q9l56K663n211R510L246j3432r224l446M712Q570
$$ y = [8216, 5828, 5749, -6203, -6236, -14189, -10247, 6000, 17209, 22101, 14251, 2400, 4908, 12538, 8356, 11632, 4939, 7095, 1833, -327, 4644, 7019, 6939, 6568, 10305, 10362, 7805, 10137, 19441, 15216, 3821, -10817, -17432, -18389, -11606, -11435, -15, -3560, -9068, -8848, -4728, 2846, 6724, 3390, -7192, -11806, -5173, -391, 1750, -3047, -24, 5003, 7402, -11090, -15586, -10802, -7813, -1969, -11884, -9799, -1972, -3281, 384, -1158, -3283, -776, 5846, 6628, 8036, 10370, -1249, -2893, 659, 8472, 10091, -4960, -11754, -12083, -18567, -11466, -9772, -3812, 2807, 1172, -8046, 5388, 11868, 14029, 1119, -14299, -17058, -3905, 1321, 7983, 8326, 573, 2800, 15806, 21456, 19102, 21493, 23439, 12550, 6410, 5190, -2169, -12174, -12263, -12619, -9956, -15167, -5657, -2411, -15843, -25067, -28513, -23801, -15231]
17002a5231N236J3697Q697j249q750j297j196K758J3933p366q248p892J732L95
16988d781R989N595o301n608l656L890J0681o513j181O052N411n768n112M756
16974G454j606L631O417k115n516O788R943N959l83l740j3265m517l185L472K975
16959A2312o681n716o424Q477O640j1125j0447q256P064J3033O97j0475m989J0467
16945e423J1984p76j817k934k279R362k250j0487p141J839n211o525Q535Q417
16931d706p053q274J988L068O583J5247K480o752j4445n434O849O941J423L256
16917A171M118k924Q198l983o863n610m112l807L595M499J757L276J067n904m941
16902a0463J1754N663o966Q79J3215k986p152j794O724o25j176J4354J2590J0088
$$ y = [-15231, -9995, 3702, 12399, 11150, 2400, 1103, -93, 2665, 16598, 9232, 984, -6908, -5176, -4781, 5208, 10803, 4502, -1106, -4762, -872, 9809, 3296, 2115, 8167, 13578, 7810, 2698, 7454, 5848, 9479, 15896, 13781, 8265, 15053, 24996, 30955, 30572, 26832, 13567, 9050, 5865, 9337, 12312, 5631, -85, -6509, 1968, 8608, -2517, -12964, -21220, -14156, -1123, -426, -10901, -15890, -5423, 6561, 5785, 3968, 1034, -1245, 8117, 5867, -4620, -11761, -9922, -15133, -21658, -13123, -4706, -11759, -20033, -18045, -14977, -8394, 6853, 9333, 2581, -11864, -17298, -10449, -3508, -2085, 1171, 5289, 2365, 10563, 6580, -283, -5893, -10005, -13812, -10217, -5718, -3961, -685, 382, -5522, -10463, 1291, 6954, -12, 867, 14082, 11096, 3944, 2150, 8874, 8249, 7073, 21427, 34017, 44105]
16888D4105M438N661K3251J4479K0726K6784M2908O0145J14149K17683L16428
16877H90757J76331m8589k02435k72987j95266j13990p6523m4851l6053j4808
16867F1586r05r016j4445j1022j3888Q646Q099l729m958o399j670o660l013M606
16853G232J7309m205R08l494r922m688j127j330J176k049k479m653L27k503L232
16838f266Q194N062J1218j937q789k476K443k223o837m15Q642k611j430L924p38
16823E761m864O98o654k831Q541J031O852K453k755n86P179M223N850o775r812
16808H311q018K150N533j473Q09n036r774O044M550l548l422j948L083P990j838
16793C413K410O26j573j534l656q638j790L687p331N89l248M820J0675n997j3830
$$ y = [44105, 48543, 54204, 77455, 91934, 112660, 139444, 182352, 242497, 356646, 574329, 890757, 1067088, 1018499, 816064, 543077, 347811, 233821, 157298, 112447, 76394, 61586, 60681, 51665, 37220, 26198, 12310, 20956, 29055, 25326, 20368, 13969, 12299, 5639, 2626, 7232, 24541, 20336, 21244, 17750, 7828, 3140, 2013, 683, 1859, -190, -2669, -7322, -6995, -9498, -6266, 1928, 6990, 18208, 16271, 7482, 5006, 7449, 5226, -1611, -2026, 6616, 4005, 2575, 6499, 5761, 897, 1595, -5059, -7890, 651, 1682, 8534, 10987, 8232, 7646, 14825, 19048, 24898, 18123, 8311, 293, 2443, 7976, 6503, 7312, 2276, -7498, -1454, 3096, -452, -3874, -5822, -2739, 5251, 3413, 5823, 6449, 4876, 3342, -314, -8952, -10742, -7055, -14386, -13797, -17045, -12225, -1550, -7547, -21377]
16778b1377m147M09N857P820L998O062M913m124j3516M094M459J0103m015p857
16764g321J020l935o869N173Q735m685n095p64k851L222O246q705J537L792k655
16749a3155J8944N183r700o840m64K60m433Q471l637n187j31m403R033Q424Q20
16734C185n60k706L825Q540J2429m762o997p479j1996j959j0715J598J60j207
16720a8644l862k731k19j326q878m130J3200P795M444P265L729N26k567j747j111
16705h256J278N316J74J306O81K391l08L373K782j6158l948L534N293k9l611j0877
16689a7059m761J248R56M289J3484J0975l911k496m409l62n685J875Q099N503
16675G746j115m008k511Q203j525j6438j6362L261N893L557K838O65m056J0725
$$ y = [-21377, -25524, -25115, -19258, -11438, -7440, -1378, 3535, -589, -14105, -10011, -5552, 4551, 536, -7321, -6301, -10236, -17105, -11932, -3197, -7882, -12977, -13741, -16592, -13370, -7124, -15829, -14292, -10500, -13155, 5789, 10972, 1272, -5568, -6032, -5772, -10205, -1734, -5371, -10558, -10689, -15092, -6059, 2365, 3185, 2625, -81, 3744, 12284, 24713, 19951, 12954, 5475, -6521, -8480, -19195, -17597, -17437, -18644, -22506, -25237, -25456, -26782, -35660, -39790, -26590, -18795, -14351, -7086, -3357, -2831, -5398, -7145, -8256, -6978, -1662, -1488, -182, 499, 2890, 2582, 5955, 8737, -7421, -11369, -7835, -2542, -2571, -6182, -17059, -21820, -20572, -19616, -15327, -1843, 9132, 5221, 2725, -1684, -2046, -7731, -5856, 2243, 7746, 6631, 2623, 112, 8315, 6790, -9648, -26010, -22749, -16856, -13299, -10461, -9796, -13852, -3127]
16661c127J0892J923n069q74j552j327k028N872l049j2631j342N258K116l054
16647g992j0717O440J3076o683J919j500K734k453L798J724O01Q84J588K831J624
16632G874m070k629N253O788m29j4128p100p04R30r36k370k342o291q060l53n28
16616b9095K514k641J2104J1900m842k670J1367j303o537m549M792J1799l522
16603f83m253l656P001L347p40J427K171L821j0321p566q43P168k054j253j251
16588g685J309l415j075L595M072M414j146l209P910P731K200j135L521q565j137
16573G385q79j849J940P82Q49j327r539j057Q685O008L491l493M67k24N381O67
16557A7287l037j856k702n907J062N328l573L078j743l166K064O922n010m045
$$ y = [-3127, 7765, 9688, 4619, 3745, 2193, 866, -1162, 4710, 1661, -10970, -12312, -7054, -4938, -7992, -18709, -12269, 807, -5876, -3957, -5457, -2723, -5176, -1378, 346, 947, 1831, 3419, 6250, 7874, 3804, 1175, 6428, 13216, 12787, -1341, -8441, -9145, -8215, -9151, -11521, -13863, -20154, -28214, -28567, -29095, -26581, -29222, -17118, -5218, -10060, -12730, -1363, -2666, -9203, -13752, -8960, 2839, -683, -4936, -8592, -1591, 1756, 1016, 2443, 4614, 8435, -1886, -9452, -10295, -3127, -5181, -6434, -7685, -6376, -9791, -10866, -7271, -3199, 1215, 69, -3140, 4770, 12501, 14701, 13566, 17087, 8522, 7385, 6506, 4657, 6597, 7379, 8228, 6901, -2638, -3695, 4990, 10998, 14489, 10996, 11463, 11239, 16620, 17287, 14250, 12394, 9692, 3785, 4847, 10175, 6602, 9680, 7937, 4771, 6835, 13757, 8747, 4702]
16543D702j213K85j096n999K356N311K164p94J001O582m687J602L965Q956r276
16528A3859q687p868m888P217L124q072K072J581J603m02q771J609J207J509N479
16513E72L678j82q084r370M264J620r26m827P298P157Q892j771j076L825J820
16498A2890q440q798k517n456m11j865l299l94M948j31L98M198n692N585O761
16483b223J230J988J936N178l54n880j219m223l344J649N821J5j596l499J399
16468c122j439o21M410o58r568L872J513m15m823o145p065j630J8895K943k755
16453f608J1508k186m588k222l529k21K119L328q87M930Q247j675k744o276n08
16438a312r83L682L664m323N09J797M014l59k352l085L624O591Q422p460r875
$$ y = [4702, 3489, 3774, 2678, -3321, -965, 4346, 6510, 5716, 6717, 13299, 8612, 10214, 14179, 23135, 13859, 5172, -2696, -7584, -367, 2757, -5315, -3243, -1662, -59, -461, -9232, -7623, -6416, -4907, 572, 4250, 4068, -4016, -13386, -9122, -7502, -8428, -13255, -5957, 1200, 10092, 8321, 7245, 11070, 12890, 4450, -4348, -6865, -12321, -12732, -14597, -17896, -18290, -13342, -13473, -13075, -8877, -14569, -8984, -2223, -993, 995, 2931, 8109, 7755, 1875, 656, -3567, -6911, -5262, 559, 574, -1022, -4521, -3122, -4561, -5182, -772, -1430, -10998, -7126, -5613, -6028, -10851, -16996, -24061, -25691, -6796, -3853, -6608, 4900, 2714, -1874, -4096, -7625, -7846, -5727, -2399, -3286, 1644, 9891, 8216, 5472, -804, -1312, -2295, 1387, 5051, 728, 1237, 3034, 7048, 6689, 4337, 1252, 4876, 11467, 19889, 12429, 2554]
16423B554l887M050J968q433Q902l22k695j533p540L213J349n166J0129J0678
16409A3267j13k153p134P352J232r1m075r724m01N231Q484O102k097l268j0384
16394B228q448q08k032l611j783q65J4360K083M583M62q819M958L165p382k579
16379d488J913l397L471j0924r592J5192J7679K153l370M153J362n407P467j945
16365A4267k893o235k459J403j3273j783N939R243n726o366M02K303O046P406
16351H274L698k989r612K388N593k287j3965q787O784Q565J58J128Q330k264k674
16336B340j297p973O442m631k950k331M577J2467J2384J44p617o289K73K835k204
16321F170o044p036j081P464J3375q02l82m711M083r563o966j255o199J1024M053
$$ y = [2554, -1333, 2717, 4685, -3748, 5154, 4832, 2137, 604, -6936, -3723, -2374, -7540, 2589, 13267, 13154, 11001, 3867, 11219, 12451, 12360, 8285, -1439, -1840, 3391, 11875, 17977, 15880, 12612, 2228, -6220, -7028, -9060, -12671, -14454, -15319, -959, 1124, 5707, 6169, -2650, 2308, 5473, -1909, -4488, -2575, -5972, -2501, -13425, -23017, -7825, 9854, 12007, 8637, 12790, 14152, 8745, 16212, 14267, 11374, 5139, 2680, 4083, -9190, -10973, -5034, 4209, -1517, -7883, -7481, -5178, 868, 8274, 11972, 8983, -629, 1759, 7352, 5065, -8900, -17687, -10903, -2338, -2180, -1052, 7278, 5014, 2340, 1043, -6930, -488, -5119, -8069, -10400, -5823, 6644, 19028, 19172, 11555, 5266, 5539, 8374, 6170, 126, -6910, -7991, -527, 12848, 12046, 11664, 6953, 11036, 1473, -5493, -6748, -12947, -1923, 2130]
16306B130n180j208J0951L45p95J0351J788q172m396p696P996k688n180k245L497
16291e02N766L514r239k591P00o84k02m112R093K911r463P907P230j82m072k963
16275C111o884n717m288K416P289J567o89J756j864K918l26o666O196N623p231
16260b789O436j1015M006K684M793R58M330p53q730k012L62M408P320k549m377
16245C072j109l485r05n318j1278o092J6965L096l017K935K463O626R340l167
16231A0126m783l727m057L656l131j543N583M86q329L473q16m842J430J0795N412
16216I733q001j2474N097m236L141J1040m133o660l810R976M788n973Q10k313
16202c015J80k927j807p687o715K056R072L563j1638l053J0103P17n293J1365
$$ y = [2130, -3050, -4258, 6693, 7038, 6243, 16594, 18382, 10210, 5814, -1882, 6114, 3426, -1754, -3999, -502, 5264, 8778, -461, -3052, -2352, -3036, -3238, -7350, 1743, 4654, -4809, 3098, 10328, 10146, 6074, 3111, -3773, -9490, -13778, -11362, -4073, -2506, -3195, -1439, -3303, -385, -711, -7377, -1181, 4442, -2789, 3647, -7368, -3362, -678, 4115, 5073, 9403, 8650, -80, -2092, -1730, 2678, 9998, 7449, 3072, 1963, -1522, -2427, -7745, -19023, -25115, -8150, -5054, -8071, -5136, -2673, 3953, 13293, 10126, 5343, 1616, -2441, 1215, -1916, -3459, 2124, 2610, -5719, -2246, -3062, -7904, -6474, 4321, 9733, 1732, -10742, -5645, -9881, -6740, 4300, 167, -6493, -10303, -327, 4461, -1512, -702, -3015, -2835, -5762, -7569, -15256, -21971, -19915, -10843, -7280, -18918, -21971, -11868, -11151, -16444, -5079]
16188e079J0155k149q734J984m383P235M899k075j2613M81N638o768J928O56N085
16173c740J1248l715o569R289o314p437N834j4514p470R327Q682J185k238j198
16159g630n402m190k687O476P904J7684M147r728l120j783r199p875J466j730
16145a5667M689J0961k390L288n31k979M216M529m896j1046n344L995P793J444
16131a938O460L383p787Q10J7508k287j0554L554P182j4457j6589o118J661n97
16117a9769j983L914P031P397L693q22k118J0270L0j002M742Q24o110m255J250
16102C092j710l263q778J482k203M297l228m819P035L438L253K971K97j1277o935
16087a6348k972o52N821L954j176m297n375K633K072L077J2063J1648l021o267
$$ y = [-5079, 5076, 2927, -5807, -3823, -8206, -971, 3928, 1853, -10760, -10279, -4641, -11409, -9481, -8825, -3740, 7508, 3793, -2776, 6513, 199, -7238, -1404, -15918, -23388, -14061, -5379, -4194, -6432, -7630, -13032, -17222, -19909, -13433, -5529, 12155, 16302, 6574, 3454, 1671, -7528, -15403, -13937, -15667, -10978, -17, -2407, 881, 350, -2629, 1587, 6116, 1220, -9826, -15170, -11175, -3382, -1938, 4522, 7905, 118, 928, 18436, 16149, 5595, 9149, 16331, 1874, -14715, -20833, -19172, -19769, -21752, -17838, -10807, -3410, 283, -539, -2657, 7613, 7643, 6641, 11383, 12207, 6097, 1842, 3092, 1382, -1881, -10659, -9177, -11380, -7083, -10311, -15130, -8095, -4657, -1404, 1567, 1864, -9413, -16348, -19320, -19972, -14151, -10197, -11373, -15670, -21045, -18412, -16340, -13263, -1200, 10448, 7427, 1160]
16073A160R13O492O574L429o007j2426o020l429m710K305J6889O313L161p236
16059G408k631R607o172j3021N586P392l176k893L287N290J53o328J1564M085
16045B0151p755o046j617K196m87j352j3607j480J479N63N600r849M327J1716
16031C839k094L0r474k698q00r3J701l00R096p00l613l236K896m832L516O565
16015a97K363Q71R982j0663j0165Q189L997j2019j331J15n000N019L040n080M724
16000f155J484K900L673j909J72L230q622m671j959p901n298R765j478N556J2499
15985A286p02j312m561M646J803o232o098Q528O476l210j973K238M19l338R577
15970G547M200o488j2189J868P284P13P589n255j1713p855Q196Q426K526j0703
$$ y = [1160, 2073, 8565, 15139, 18568, 12561, 135, -5885, -9314, -14024, -11719, 5170, 11483, 14644, 7408, 4777, 14384, 8212, -4809, 777, 8169, 4993, 2100, 5387, 10677, 10830, 4502, 16066, 20151, 12396, 6350, 4733, 6929, 6442, 5090, -8517, -9997, -8518, -7955, -2355, -12204, -7877, 3839, 1745, 1775, -7699, -10397, -11197, -11290, -9589, -9889, -793, -1493, -5106, -8342, -5446, -10278, -6762, -197, 2166, 3037, 13019, 2356, -7809, 380, 4377, -7642, -8973, -8858, -13858, -8839, -5799, -10879, -6155, -4671, -1771, 1902, -7, 165, 3395, -5227, -9898, -11857, -19758, -25056, -15291, -16769, -11213, 1286, 584, -728, -5289, -643, 1160, -5072, -11170, -2642, 3834, 624, -1349, 889, 1308, -2030, 7547, 11747, 5259, -6930, -5062, 2222, 2935, 10524, 5269, -6444, -14299, -6103, 2323, 4849, -5854]
15956e854r108N136J0674O584j220j0825o957J783M975k712m61R10K174M486q287
15941h702J174M66J2109o691o507m736J213M862j771n750q415J755J1290p61L064
15926g400j382O067l248o539j262M323r12r77r115k774N154L975Q569J967J603
15911a951M486K248q143j2921k714M370m881j970m446n191Q563J4388k842J572
15897i432L557J0377L245j0581m755R149K369K76K582o274L356J465r349L462
15883e53m881o527R422L532n195k33k527K055Q514n975j0082J635R644J926J3806
15868A4561N774j3949j3103N319j311P084o301J516K472J2027K849j3175P9l881
15854c9p728p3J492m606M997R776O08j1239J2323J6544n47q065m491k909j36P07
$$ y = [-5854, -14962, -9826, 848, 7432, 6212, -4613, -11570, -9787, -4812, -7524, -7985, -7075, -4901, -415, -8702, -7528, -7062, 5047, -1644, -8151, -12887, -11674, -6812, -8583, -14333, -22748, -20993, -9703, -10464, -7400, -8782, -2715, -5963, -12502, -13764, -9441, -10353, -11330, -20445, -23219, -18065, -14090, -5521, -3554, -1951, 2535, 4783, -3360, -16281, -18995, -14625, -19506, -21476, -25922, -31113, -22550, -8162, -11004, -9432, -5875, 4502, 7747, -2834, -7589, 1560, 3929, 4205, 6787, 513, 3869, 5334, -4015, -553, -5434, -11961, -2539, 993, -4202, -4435, -6962, -4907, 3607, -2368, -12450, -10815, -1171, 755, 14561, 20335, 6386, -6717, -1398, -2709, 4375, -1926, -410, 2062, 14089, 16938, 3763, 3842, -39, -7767, -7840, -6348, -10954, -5957, 3819, 4427, -6812, 5511, 22055, 21508, 13443, 8952, 6043, 5907, 6614]
15838F614m43m179p530p249L464J1798j069j2326l434l23O166R926k576k067R584
15823F356P28o937o888k908K0067K815q665n629j0372p070J1546L875K101j989
15809b970m285N857m864r745R43P22R779O752o901J772l917r317K341l56M394
15794i795O156R787J0898l847j2857m333n501n356n126L950k69J3189k074p760
15780a2938n656j003P693J2494M280J47L38j821J378j998j796q77k447l992J0848
15765D650N448j2666j5246J2041Q006j1787n330p36l48K856R330M155L702K687
15751F762K696O308M944j0194q66P429j1732n471l62p404k491Q310M192p137K769
15736b247L392R844l742M444N551j473q079j9186p522J2665J4300J406q325q936
$$ y = [6614, 6171, 1992, -5538, -12787, -9323, 2475, 1406, -10920, -14354, -14677, -8511, 1415, -1161, -3228, 6356, 7084, 147, -6741, -9649, 10418, 13233, 4568, -1061, -11433, -18503, -6957, -3082, -981, -2970, -7255, -1398, -6262, -16007, -15064, -14342, -4563, 2189, -4712, -2940, -6857, -16174, -13833, -14189, -9795, -3639, 6148, 17046, 13199, 342, -3991, -9492, -14848, -19974, -16024, -16293, -3104, -5178, -12938, -18594, -19597, -11904, 590, 4870, 5017, 5355, 3534, 4912, 2914, 1118, 241, -2206, -6198, 4650, 10098, -2568, -17814, -5773, 2233, -9554, -14884, -15620, -15968, -13112, -3782, 373, 4075, 6762, 9458, 15766, 20710, 10516, 9650, 17079, 5347, -124, -486, -7890, -10381, -2071, 2121, -5016, -2247, 1145, 10989, 7247, 11691, 17242, 15769, 7690, -11496, -19018, -6353, 7947, 9353, 1028, -7908]
15722g908k802k929R574R307l180l755o10l036l197n056k765m14N338K405L762
15707e266k944j198l4m523N019M567L750P517L338J0234O496j2587l011P231j317
15692A7272j1814l845n791m014O631M020j350j1099k656M432M706J3557O183n741
15678A0491J360l109k23l549j1017p289L206J547L354N863J036K461K75k338M155
15663F223N283L735k478j3648K3J0748K297o173N594n181n228k221L933k881L707
15648C733P382R14j1122l726n508q018O586j08M478O731n046O736j441Q089R272
15633A8952j021j0639q234r657m834M857j251M794O695R32K086K782q03k160k370
15618A29P408q093n662k253k577L367N102k205K409m185J056m039k290J0834r36
$$ y = [-7908, -10710, -13639, -4065, 5242, 2062, -1693, -2303, -5339, -8536, -13592, -16357, -16771, -11433, -9028, -5266, -8210, -9408, -9442, -13965, -8946, -4379, -629, 6888, 10226, 20460, 26956, 14369, 11358, 18589, 17272, 5458, 1613, -4178, -8192, -1561, 2459, 1109, -9990, -12646, -8214, -3508, 10049, 16232, 10491, 11851, 8742, 8519, 4970, -6047, -13336, -10130, -8583, -5229, 634, 1670, 4131, 4406, 2068, 6223, 11506, 15241, 12763, -885, -862, 9886, 12183, 6010, 11604, 6423, 1195, -1026, 2907, 26, 3733, 11115, 12029, 907, -2819, -8327, -16345, -9759, -9867, -5389, 1342, -3704, 3032, 1591, 9680, 18952, 17931, 7292, -942, -10599, -15433, -10576, -11827, -7033, -338, 594, 2680, 5462, 4659, 2499, 129, 7537, -556, -6218, -8471, -11048, -7681, -2579, -4784, -2375, -6560, -5504, -9543, -11833, -999, -1935]
15603a935n207o492R149Q823m569q830j051M752Q861J4330j441j6839q708K611
15589f546O350N526j0685L121L107K437M518M533k742m009J944L282m921n181
15575G34L954L702N16O80p624q475Q031l682o636q386J40L680J3808L067m836
15560a327l394K551K85l529j8053m212J1305Q557M966J567N671L085o046M163
15546E589l377j000N452l312K758M216j334n514M9K320k500m312q614M438K217
15531b924k626J1336O289r809L261n556j2660M73P927O329N885L110L12o432q262
15516c347o824r04m365J849J4194k039k639N113n322m665n378N418j622K305J815
15501f411L543O527K31R48M467m476l693r158o417L455K184K077M660P35J868
$$ y = [-1935, -7142, -13634, -4485, 4338, -231, -9061, -10112, -5360, 3501, 17831, 16390, -449, -9157, -6546, -196, 5330, -5355, -2234, 873, 3310, 7828, 12361, 9619, 5610, 7554, 10836, 5915, 734, 4688, 8390, 8906, 9586, 1962, -6513, 1518, -2164, -8800, -17186, -17046, -13366, 442, 3509, -1327, -4721, -2170, -1885, -5414, -23467, -27679, -16374, -7817, -2851, -1284, 4387, 7472, 1426, 5589, 2212, 1212, 6664, 3352, 6110, 10326, 8992, 3478, 3527, 5847, 3347, -965, -9579, -5141, -2924, -5550, 5786, 12075, 2266, 5527, -29, -12689, -12216, -4289, 2040, 7925, 11035, 11347, 4915, -3347, -10171, -11075, -15440, -13591, 603, -1436, -4075, 1038, -4284, -8949, -14327, -8909, -10531, -8226, -6411, -2868, 3659, 3890, 4838, 9305, 4829, 1136, -8022, -14439, -10984, -8800, -6723, -2063, -1328, 540]
15486E40j702J903j057j356m439J499O271m465n78L386q71m693R139J537n454
15471c40k13j7203o523J0386J5307J3430m045J184K385m115j772K309k42j333
15457I215j1895k927r91J1961m223k879J90M71Q55L064L77r256n100k78j634Q747
15441d303L573j626L454K229k624m53R97k4N65k382p799q347l989K551J0256P803
15425a19K629O441o163o090n871J622J947q363M672P491J586J556o487k290K665
15410d774N343L709q194j0734O352r0j5028j568O54N839K595k789O130K067M225
15395f263o919J045P736L517p234l100K327P001P588l265l683J808O554l897M667
15380G882M06m536k028k405j678O338N999n611q027j5421n941P573P782N532o185
$$ y = [540, -1162, 741, -316, -1672, -6111, -4612, 1659, -2806, -3384, 2, -869, -5562, 3577, 5114, -340, -553, -17756, -24279, -13893, 1414, 14844, 10799, 11983, 14368, 10253, 8481, 10790, 10548, 9215, -2680, -5607, -6598, 5363, 1140, -1739, -1549, -1078, -223, 2841, 3218, -6038, -11138, -11416, -13050, -4303, -730, -2356, 1098, 3327, 703, 250, 1247, 1223, 1788, -594, -8393, -16740, -20729, -18178, -7922, -119, 2510, 8951, 2788, -3302, -9173, -7551, -5604, -13967, -9295, -1804, -218, 1338, -5149, -7439, -4774, 569, 4278, -3916, -14650, -8298, -8388, -23416, -24984, -24330, -18491, -15896, -18685, -12555, -10488, -6263, -13182, -12137, -4401, -884, -8118, -11218, -8891, -1890, 5698, 2433, -1250, 558, 7112, 3215, 7882, 8288, 3752, 1724, -681, -2359, 3979, 9978, 4367, -3660, -19081, -25022, -17449, -9667, -4135, -10320]
15365a0320K447M959N30j191R060p95o065R816O934q561q047o711J964K385j725
15350e320p531K498P200K895m06m282k1k100p061J070N402j498K795m662M537
15335f484j570j4245M75K1426O078K850j3763k752Q480N67l786j4335l631K518
15321a8172M18J0240M635K748L823N463m401m296M007J186k670p266j4558K162
15307a6681J7232R999K369p9m405j303j277L8r835q649m866P570K625N734K354
15292H26P942P230r784p623j350J130J991L869N783K439N573k725m334r185o49
15277A133l007j2914J52L393N53M794j331k772o969L547O730P75O782j363k620
15262c117K738L076j35p423P227N873q348K712L0J66r215l312l219J462J4941
$$ y = [-10320, -7873, -2914, -2384, -3575, 5485, 4690, -1375, 8441, 15375, 6814, -1233, -7944, -5980, -3595, -5320, -12851, -10353, -3153, -258, -664, -4946, -4967, -7067, -14128, -13058, -7656, -9154, -6359, -11021, -6484, -8054, -22299, -21824, -398, 5680, 8530, -5233, -7985, 495, 1062, -2724, -17059, -20690, -18172, -17754, -7514, -2879, -131, 3692, 9155, 4754, 458, 4465, 5651, 2981, -4285, -18843, -16681, 551, 10550, 12919, 12840, 8435, 7132, 5855, 5893, -3942, -12591, -17457, -9887, -7262, -1528, 826, 8768, 15998, 6214, -1409, -2759, -1629, 362, 4231, 10014, 12453, 18026, 15301, 10967, 1782, 1133, -1874, -14788, -14636, -11243, -10690, -5896, -7227, -9999, -16968, -13421, -6691, -5916, 866, -497, -3117, -379, 2697, 2562, -4861, 2366, 8239, -109, 2603, 2633, 2799, -6416, -9728, -12947, -11485, 3456]
15247C456J78K994L542q760j3950N651Q743K497l210l636p209o30L566j6q061
15232a4845l578l370M436J6466N283n378m412j199O090K748P065q501j962P086
15218E929N516l200p192J166n650o214O609M685R6K951j616L081J924k479N55
15203F161m487k098N209o683j2347l80r16O478L700J146J2033M069N71l050n359
15188D047p399r61O123K112o006L050M065J0468l890J604n58n573j5135K351M862
15173h40N530j879j111Q164q495j3076J854O278K988M218n126k752l726M035m126
15158h064Q7J3092N176m156j0923j3451J2144K422N204M139L22J2346O011j1929
15144A2420j6856j952L767L490j1752q774Q568M070p0K503J1356n985n072n128
$$ y = [3456, 3634, 6628, 10170, 1410, -12540, -6889, 1854, 4351, 1141, -2495, -9704, -10334, -6768, -6784, -14845, -18423, -21793, -17357, -891, 4392, -986, -5398, -6597, -507, 2241, 9306, 805, -1157, 5929, 11445, 8245, 1053, 2219, -3431, -9645, -3036, 1649, 1745, 4696, 3080, 6161, 8085, 5606, 6161, 1674, -424, 4785, -1898, -14245, -14625, -15541, -9063, -5363, -4217, 7816, 11885, 12456, 9406, 4047, -3352, -4313, 1810, 3922, -2084, 966, 5031, 15499, 11609, 13213, 12655, 7082, -8053, -5702, -840, 4690, 2811, 1700, 9864, 1369, -11707, -9853, -3575, -587, 3631, -1495, -4247, -7973, -3938, -8064, -7977, 5115, 10291, 6135, -4788, -18239, -6095, -3673, 1531, 5670, 5992, 18338, 24349, 12420, -4436, -6388, -2621, 869, -10883, -19657, -11089, -7019, -7089, -4586, 6770, 785, -4287, -9415]
15130i415J1547M669J844P862M593Q069r991J112m15O98n087o200r557J203R609
15115A0541j554j4559j384M47q53L278Q107j402j784n363q473P26K546o53P116
15100c264o366K233J502J9289N284j4947k341Q326Q187n417q166j367R017j297
15086A0673j0030j961M402Q393M952o315j5443q938J1293K239Q282M952l69l814
15072H316q027j5245n488j311N443J4017O682M812p788j4462R256R463k331k79
15058C058J617k649l180N33q982o053N506o70P79j884q480J0942Q845q010m031
15043a2659J646P120N620o580q721K792J2892N796m085L20J574p070R91K967m201
15028a598q685J3959P698q450n991N418j334q653K042L379j0174j3355j060K173
$$ y = [-9415, 2132, 6801, 8645, 16507, 21100, 29169, 19178, 20290, 19875, 20573, 15486, 9286, -271, 932, 10541, 8987, -5572, -6956, -6509, -7362, -4084, 4023, 2621, 837, -4526, -12999, -12273, -9727, -10380, -3264, -9630, -7397, -5895, 13394, 18678, 3731, 1390, 9716, 17903, 12486, 4320, 2953, 11970, 10673, 643, -1318, 3084, 11477, 16429, 10114, -5329, -14267, -2974, -735, 7547, 12499, 12130, 8316, 289, -14956, -20444, -21755, -16312, -2295, 4387, 9199, 1411, -13051, -3795, 5668, 3337, 3058, 4675, 2026, -1154, -621, -9603, -15656, -10150, -10820, -10041, -11925, -20405, -9463, -618, -8628, -12659, -11013, -3893, 1727, -4853, -13574, -10782, 2110, 7906, 3821, 4141, 5715, -1355, -364, 2603, -1598, -10283, 3676, 11374, 2924, -3067, 2351, 1017, -7636, -5594, -2215, -12389, -25744, -26804, -24631]
15014b4631l832L270N488J0767J1876P579K066o463p321K94o320n56J772K178
15000c833n030K732J535p7k484l789P543J2606L174m450m586P857Q568q142q880
14985B744l8k384K343J524J966L807o147r112o229j771M664m62J2102L160o775
14970f08r287L942J2688P472k735r475j852N27J389J455l010p06l178p39P411
14955C294K160K486r712j279K898m17J2100R636p818n203N286r395j0588j577
14941h129O583O082M136M816l727N791j0165m776O466r808K809L944j951m713
14927b642m497K373P797p702o886j037k679o55P10J0865j757l564K596K90j316
14912h104O202K237l132j85N967R72o003k143l013J0571l979l068k47l341L064
$$ y = [-24631, -28463, -25193, -19705, -8938, 2938, 10517, 12583, 6120, -1201, -907, -7227, -7783, -6011, -3833, -8863, -6131, -4596, -4673, -7157, -10946, -3403, 9203, 12377, 7927, 3341, 11198, 19766, 11624, 2744, 2706, 322, 2665, 4189, 6155, 9962, 3815, -5297, -11526, -13297, -8633, -9095, 3007, 6167, -608, -9895, -5953, 6735, 14207, 11472, 1997, 145, 672, 2061, 3516, 506, -200, -3378, -4117, 3294, 5454, 7940, -1772, -3051, -153, -570, 11530, 21166, 13348, 8145, 13431, 4036, -6552, -8129, -1546, 4536, 8672, 13488, 9761, 15552, 5387, 611, 7077, -2731, 78, 4022, 2071, -2642, -7139, -4766, 3031, -4671, -11557, -12594, -15273, -15928, -15218, -4353, -6110, -9674, -7078, -6788, -8104, -1902, 335, -2797, -2982, 2985, 3957, -2046, -4189, -7202, 3369, -610, -3678, -3925, -7266, -4202]
14897d202Q596O296n829m457p555k124K798N492M901K415L537j4354p122O623
14883d985L242k288q316L92K759p932N54M15J2982M827q672N555Q244m417l532
14868a172N83J436j659L839K58o344j622J0697L363l923K410O172l090j852Q933
14853A8029p794r724l897k220o017k53j390J4458O771j95M452J347j39j4050o503
14838g125n470m778q57R974P641l468q233P622j194j034Q014j1076m077M56n068
14823a8673M162O44Q67m081j063O362J141L910p812l128K56K355R307k823m89
14808i065K34J2072J8564o995j424M761l786j980k696j0645K805Q82j2441j162
14794a0876k833l223n837m625j1195k164L114P343L431R193M732O575M545L552
$$ y = [-4202, 4394, 10690, 4861, 404, -7151, -9275, -6477, -985, 3916, 6331, 9868, -4486, -11608, -4985, -1743, -4031, -12347, -11955, -9196, -17128, -16574, -16159, -3177, 1650, -7022, -1467, 6777, 2360, -1172, -589, 847, -812, 3027, 3285, -3059, -4681, 6016, 9379, 5456, 7866, 14038, 10948, 9096, 18029, 10235, 511, -3386, -5606, -11623, -11876, -13266, 1192, 7963, 7768, 12220, 13567, 13428, -622, -7125, -12595, -17373, -18230, -8256, -615, -4083, -12316, -4694, -5888, -6922, 1092, -9984, -14061, -13605, -18673, -14511, -13867, -13000, -17081, -18144, -11782, -10641, -6731, -14543, -17671, -17415, -15060, -5753, -8576, -9065, -8831, 3241, 21805, 14810, 13386, 18147, 14361, 12381, 9685, -960, 1845, 2727, -9714, -10876, -13709, -16932, -22769, -27394, -38589, -40753, -37639, -30296, -26865, -17672, -12940, -6365, -1820, 1732]
14780A732N047q248m138Q254M911n139p75m782L210O920O390j1998j4115J966
14766a0765N774N109j765L039k456O11k622m548M093q211J780j840m89Q384Q39
14751c067r651n007K075K853o247J106L983Q130J364o046m066j392K869k80Q756
14736d620m81N18j496J906P1K641N479K336l628J565r94j1013l627Q099K768J1535
14720A1059O705j954Q98k525J58l148R2j203m760j111n500k776O572K014o29l45
14704C547K470O924j2507k745O37K749J771j204L765M244o893p000Q751j09R516
14689A3916q61p47J089n23K038m990m028J989m571n156P167J0716p313j3954j913
14674g141M169P066R132R66q663N819P264q8O704k955j2929k409P425m182p616
$$ y = [1732, 6779, -1469, -5607, 2647, 7558, 2419, 1644, -3138, 72, 6992, 13382, 1384, -12731, -10765, -4991, 118, -1647, 1392, -1064, -453, -3075, -7623, -3530, -11741, -9961, -11801, -12290, -3906, -3067, -12718, -17725, -15650, -12797, -19044, -17938, -13955, -5825, -4461, -10507, -14573, -15965, -13096, -13376, -4620, -5101, -4583, -6079, -4173, -4102, -1461, 4018, 6354, 2726, 4291, 3297, -7716, -11343, -3244, -476, 11059, 17764, 15810, 16708, 14183, 14341, 11193, 11285, 10082, 5322, 4211, -1289, -4065, 2507, 4521, 3892, 3547, 6017, 12941, 434, -2311, -1674, 1075, 2846, 1642, 5407, 9651, 2758, -4242, 4509, 4400, 13916, 13055, 12308, 13397, 12874, 14912, 9922, 5894, 7883, 3312, -1844, 5323, 16039, 8726, -5228, -7141, -2972, 4094, 13226, 14192, 5529, 11348, 18612, 18524, 25228, 22273, 9344, 6935, 14360, 10178, 2562]
14659B562J276m781j802P509P742j148J081J482l683j5449J007O195M308P394
14645A3693J490K758M697j52j0936j8980L992J0537L667n194k110R527n214o122
14631A653n556K73L619M853O182q614Q751l537K018k875O614m306J728K669m682
14616H790k014J1709O918l866r982j484n476L139O490l287m470q610o200m777
14602a3120L555K540O270L832k191k737N281K922o136P544K46m745L099q170n475
14587g285J0235J2763m611j533K178K185p211j0741o508R909J154o0J1211O946
14573A8632r277n053k780Q502L027n409q544J779L912n481J035K302J482O147
14559A0274k769N77j195n509j819L045P144o742k447k618L854l096n970q854m115
$$ y = [2562, 3838, -943, -2745, 4764, 12506, 11358, 12439, 13921, 10238, -5211, -4204, 1991, 6299, 13693, 15183, 17941, 22638, 22486, 11550, -7430, -3438, 7099, 10766, 5572, 3462, 12989, 7775, 1653, -3903, -3630, -11, 4842, 11024, 2410, 11161, 7624, 9642, 6767, 13381, 9075, 10803, 13472, 8790, 6776, 18485, 25403, 21537, 11555, 10071, 4595, 7734, 14224, 10937, 6467, -2143, -8343, -13120, -9565, -7025, -755, 3077, 886, -1851, 3430, 6352, 216, 7760, 8006, 3261, 6360, -1810, -7285, 2950, 15713, 11102, 9569, 11747, 13932, 6721, -4020, -10528, -619, 535, 475, 11686, 18632, 9355, 4302, 1522, 10024, 13051, 7642, -902, 877, 4789, -692, 343, 2645, 4127, 10274, 7505, 8082, 6887, 1378, -441, 2604, 9748, 3006, 559, -2059, 1795, -1301, -7271, -16125, -20240]
14544b0240O306L733q499p38R355j792j096o526M759L516L50m369K177p6j156
14529a4296K237L760l806L850J838l812l657Q222N279m542L26K538L955j738j1316
14514a1162l349J7075R774k693k0236q027J683o760r94P489N617K946m756N028
14500h365O050l514l862m468n768N646L844R316O681R64q70J870o039l069J0537
14485H953j725o034k678J3R88o446m038M269n667P612L373M289R058j1480l559
14470c072J1499M021m410j500k590q929j0455k749n323P980J2902J344K945j3507
14456a1844n755L185R522P40j099N131L744K81l262K889m106J484L132M276M958
14441A3276m793m742n564K877j203L850l563n972M263K519r00N970N104q101k320
$$ y = [-20240, -13934, -10201, -18700, -19438, -10083, -11875, -12971, -19497, -14738, -11222, -10872, -15241, -13064, -13140, -14296, -12059, -8299, -12105, -8255, -6417, -10229, -13886, -5664, -385, -4927, -4601, -2063, 1892, 154, -11162, -14511, 2564, 12338, 9645, -10591, -18618, -16935, -23695, -24689, -17200, -11583, -8637, -13393, -8365, -2315, -5829, -9691, -14159, -19927, -14281, -10437, -1121, 5560, 6524, 5654, 7524, 1485, -1584, 8953, 7228, 1194, -1484, -1471, -483, -6929, -10967, -6698, -12365, -4753, -1380, 2909, 11967, 487, -3072, 8427, 12448, 8038, 6538, 3948, -4981, -15436, -18185, -23508, -15528, -2626, -1282, 1663, -11844, -17599, -14414, -4892, -4152, -5251, -120, 3624, 3905, 643, 3532, -574, 910, 4042, 8318, 13276, 8483, 3741, -1823, 1054, -149, 3701, 138, -5834, -1571, 948, 48, 6018, 11122, 3021, 701]
14426G01J178J151Q76m197k711O88Q127R484n248j0280M576K052K332j321j660
14411E748k647O190Q879k651q737j745j81j40M628L403p409p016N71m574l04K734
14395c251k243j384O273L009p76k882r683o986J324l556j0974O40J7016O524K869
14380d080k139N519J711r93J692J927o171j21l098l887J1504m067j370J266j0605
14365a2912J500Q522K368m144n146l292N013J3902K684N2K075L171K28m296l954
14350E771j0093n854P263J2031K370n785p03k157J081J2898k065q081k701L363
14336G338K416q30R012N55j2365l470K494J1523r595j5782P44J0500O807M874
14322A4221m660l346P373K045o457j1230m01L745l643M0J0227n387o214o766N44
$$ y = [701, 1879, 3030, 3906, -291, -3002, -2314, 5813, 15297, 10049, -231, 4345, 6397, 8729, 7408, 5748, 3101, 9291, 18170, 15519, 6782, 5037, 4856, 4716, 9344, 12747, 5338, -1678, -1107, -5681, -5985, -3251, -5494, -6878, -605, 2404, 1628, -1254, -10937, -17923, -16599, -20155, -31129, -30489, -13473, -6949, -4080, -6219, -700, 1011, 18, 1710, 3637, -2534, -2655, -5753, -9640, 1864, -2203, -3573, -2307, -12912, -11412, -2890, -522, -4666, -9812, -13104, -8091, 5811, 8495, 8547, 10622, 13793, 14021, 9725, 5771, -4322, -10176, -2913, 9118, 11488, 5703, 5000, 2843, 3924, 16822, 14757, 6676, 3975, 7338, 9754, 8924, 17936, 18491, 6126, 2656, 5150, 16673, 7078, -8704, -7960, 2540, 9347, 14221, 9561, 6215, 13588, 15633, 9176, -2054, -2455, 1290, -2353, -2313, 7914, 2527, -3687, -10453, -9909]
14307i909R240j547L671j634n283p89j257j320N386L215J8n689M355Q415m324
14292B548J645R951K038l423J798K655l032l267j4590q231P892P072L039k122
14278C973K683p33l049p187j793P774P019M53q891M670l088r08M48R919L31p355
14262D266L292l865J191j564j0832q889N506J0546m212k042j239J0058n170n023
14248g977m825J922N009L751o505j089k505N145O610r404M594K836j3157J964
14234a3631O825r68q088o327J3097N831N922o157M42J6309j230r435J205o123
14220b328n956o220j2247k020j405K635O901k306M32J1103J1014R53j4608o026
14206b0078O424R945M741L300O780K09n023o223o962K464J1461N705k904o620
$$ y = [-9909, -669, -2216, 1455, -179, -5462, -6251, -7508, -8828, -3442, -227, -209, -5898, -1543, 6872, 2548, 4193, 14144, 16182, 12759, 14557, 17212, 14180, 10913, -3677, -11908, -4016, 3056, 6095, 3973, 6656, 5923, 2874, -4313, -6106, 1668, 8687, 9140, 249, 4919, 1831, 923, 1371, 11290, 11621, 4266, 7558, 3693, 4884, 3320, -7512, -16401, -10895, -349, -4561, -6603, -7842, 2216, -2954, -7977, -12802, -10880, -5871, -2120, -8625, -9714, -12219, -7074, -464, -9868, -5274, -2438, -15595, -13631, -6806, -7774, -15862, -22189, -9092, -3261, 2661, -3496, -3054, 13255, 12025, 2590, 3795, -2328, -8284, -14504, -26751, -28771, -30176, -27541, -20640, -22946, -22514, -11411, -397, 556, -14052, -20078, -13654, -3709, 1032, 4332, 11112, 11321, 6298, 75, -6887, -4423, 7038, 12743, 9839, 3219]
14192C219J569L424k3M21l018r771j1448K441j520r03J4106j686m59R486P546
14177A3384j958j2205m181k960K433M661J32O511M123l730n041o823r534j323
14163a6511P808Q053j028M786J761l92N844m963j2580k321O749J1028m298o529
14149b593m822j7O034l943n342O883M711k159L051k780r183j1012J009N953Q290
14134e920j409K399k239n855M736n773p836J282P261J246K477K952o496K728N349
14119e098L971K378k050p65K862K599p56m118O25n996M660N24j353k076J091j2155
14103a5657n023n152L044J4447M866M621J798j1141k237K864N995j682j3084l311
14089a9652R291l009J742P472J905J0003q11n499j0023J612q654j696J684P876
$$ y = [3219, 4788, 8212, 8189, 8610, 5592, -4179, -15627, -13186, -14706, -15609, -1503, -3189, -3648, 5838, 13384, 11426, -779, -4960, -7920, -5487, -826, -694, 5817, 9940, 6210, 1169, -5654, -15188, -16511, -8703, -650, -1678, 3108, 4869, 4477, 10321, 5358, -7222, -9543, -2794, 8234, 3936, -2593, -7415, -7432, -1398, -5341, -10683, -3800, 911, -1248, 1803, -977, -10160, -21172, -20163, -14210, -5920, -7329, -4930, -7169, -13024, -8288, -14061, -21897, -20615, -13354, -12108, -9631, -6679, -13175, -10447, -5098, -1127, 1251, -799, -1564, 1298, 3897, 3141, -977, -352, -6348, -1688, -1164, -2517, -4593, -3502, -15657, -20680, -25832, -22788, -8341, -3475, 1146, 2944, -8197, -10434, -7570, -1575, -3257, -16341, -19652, -10361, -13370, -11628, -4156, -2251, 7752, 6941, 1442, -8581, -6969, -15623, -17319, -15635, -7759]
14075g759K389k799K117k740J705N854O004J724o328N581N568o477m697j975J224
14060f09o034o159l235J377J4452R541j128k929O65p464M884R579L400q962q436
14045a058J291J844l213n930N487J1159M141n262q592n01K148k561K411J0638
14031A2002n565m933o071p271j240o903N433Q782m980N967N773M702J285j1120
14017d139n528K69J1349R147L438M554o544o315n461p89M653R367n549j0921k311
14002d780m499l70r02k488n57O583l899M217J0490M80o687j853O875L695j2964
13987f659l035J5091J1210K201n638j217q756k982J696n7l836n112m580q143p13
13972b0530Q924J160J387O869l226J0237N168m213m088o311K8n256j513j329P948
$$ y = [-7759, -5370, -8169, -6052, -8792, -7087, -1233, 4771, 6495, 167, 5748, 11316, 4839, 142, -1833, -609, -6643, -12802, -16037, -14660, -208, 9333, 8205, 5276, 5941, -1523, 3361, 12940, 16340, 7378, -1058, 233, 2077, -1136, -7066, -1579, 9580, 13721, 8459, -133, -634, 1514, -1047, 1364, 12002, 6437, 1504, -4567, -11838, -13078, -19981, -14548, -5766, -10746, -4779, 994, 5696, 6981, -4139, -9667, -9398, 1951, 11098, 14536, 19090, 12546, 6231, 770, -19, 4634, 14001, 8452, -2469, -4780, -9279, -9649, -10551, -13039, -13596, -7013, -10912, -6695, 3795, 4275, -2412, -4265, 2610, 6305, -6659, -9694, 5397, 16607, 18808, 13170, 11953, 3197, 215, 1911, 1854, -1982, -7094, -11674, -19817, -20530, -11606, -10446, -9059, -2190, -5416, 4821, 9989, 5776, 1688, -4623, -4595, -9851, -11364, -12693, -4745]
13957d745O395L885J0280j987q880j896l563m579M020J1891K367j284j5801m600
13943h497J2293J785q158J829l384M04j876l629j954r98P215N741m721K873l8
13928a115O128K726m134R124J0018l009q145L224K577l474k057J480j1276q834
13914f767r162J7110R239k708K5j4931j300J245J2807L253l018j4005j1589Q88
13900a8913L919Q572J4240O696J018n32r231l63M254o889j632K995j352P058o238
13885C602M255L193k90l784M89j021k822j43n108N67M648K780j0041K375n573
13870f873J468O035p243o814J521N767L846N540M022Q276j732P040k096n178p650
13855E929M774K159m773l89k825p677m409l217l847R994J4795O208r404r111O478
$$ y = [-4745, 1650, 5535, 15815, 13828, 4948, 3052, -511, -5090, -1070, 10821, 13188, 11904, -3897, -8497, 3796, 5581, -2577, -748, -4132, -3728, -5604, -9233, -11187, -12185, -4970, 771, -3950, -1077, -1115, 5013, 7739, 3605, 12729, 22747, 19738, 11593, 14817, 17394, 13920, 11863, 13343, 2067, -6767, -15929, 1181, 10420, 7712, 7737, -7194, -8494, -7249, 5558, 8811, 5793, -8212, -19801, -18913, -14994, -6422, 7818, 14514, 15532, 15000, 5769, 5406, 9660, 2771, 1139, 4134, 2782, 9840, 3602, 7857, 11050, 10760, 6976, 7465, 6444, 3622, 3479, -1629, -1062, 3586, 6366, -3675, -1300, -6873, -5405, 630, -6613, -13427, -11906, -6139, -2293, 3247, 7269, 15545, 13813, 20853, 18757, 13579, 5929, 10703, 12862, 8089, 7700, 4875, -2802, -7211, -10428, -14275, -4281, 10514, 16722, 7318, -1793, 4685]
13840D685j649n779j0750Q692J2817P031j304n122M427k732m259J082m642J31
13826B628Q879k475k468k127Q407l639r866j872J1479M647r797M197n231L948
13812F710M965k53l769Q858J801Q081K441n638j442J460k342M255K751n801j837
13797B0240k238o795l626R928J1188J1465L653m980j425o611l834J320O998R92
13783C6275j195K567K310K96J0830O632L96k593o462j1940q988O910J4835J1981
13769F1854j327j481p992j444n145j2099n417J5624J4497J936j12m683J053l559
13755E1705M451K386J1423m233m646k701q59J87j471J0572N585R678q391o669
13741F7017p960N484O103N111M802L838l190o989M587L127r024o170q884L315
$$ y = [4685, 3036, -2743, -13493, -4801, 8016, 15047, 13743, 8621, 13048, 10316, 6057, 7139, 2497, 2628, 11507, 9032, 6564, 4437, 12844, 9205, -661, -2533, 8946, 13593, 3796, 7993, 2762, 6710, 11675, 11422, 7653, 16511, 18312, 26393, 28834, 23196, 21754, 23214, 20872, 25127, 27878, 22077, 20240, 18002, 11207, 7581, 17509, 28697, 40162, 43815, 38835, 37410, 30799, 26965, 28285, 35283, 36275, 35080, 37647, 39957, 40253, 51083, 57715, 58111, 55518, 49056, 37116, 28128, 35038, 49873, 61854, 60527, 59046, 51054, 49610, 44465, 32366, 26949, 42573, 57070, 59006, 58894, 54211, 55264, 51705, 56156, 58542, 69965, 65732, 61086, 58385, 57526, 57713, 56242, 66814, 72399, 82077, 73686, 67017, 59057, 64541, 70644, 75755, 80557, 84395, 81205, 74216, 78803, 81930, 72906, 66736, 57852, 61167]
13727F1167K546l956o083K125k280p695k175M94k783q52p783m591P789O895J0412
13712E3230m081j0169q585R69j322L344J5610j137p344m490o740N289Q985p266
13698C6293N221K759j096j269M63j909j1589j4510M242R999P553o943p360j706
13684B0148l316l075N8K873J0403J725m933o551L341Q606o718j0224L051Q853
13670B4241K049n11K480l994L434k282p563j1009J934m388j540N389Q449J697
13656A8386J3061O54j0994l912m21J715l73k058l536%K427M705p610p970j20M248
13640H202M252N946K013p239j15R801P129m497o826K714O713r13M61m676m672
13625A8293l220N360n243n061j17L51K645L691n533L73Q166R221q799l208j626
$$ y = [61167, 63713, 59757, 53674, 55799, 53519, 45824, 43649, 44143, 41360, 40508, 32725, 28134, 35923, 42818, 53230, 49149, 38980, 30395, 31364, 30042, 33386, 48996, 47859, 40515, 36025, 29285, 34574, 43559, 36293, 41514, 44273, 43177, 41908, 42371, 40462, 28873, 14363, 18605, 28604, 36157, 29214, 21854, 20148, 16832, 13757, 13815, 16688, 27091, 28816, 23883, 17332, 20673, 29279, 22561, 12337, 15388, 24241, 26290, 25779, 28259, 24265, 27699, 25417, 17854, 6845, 8779, 4391, 2851, 8240, 16689, 18386, 31447, 32101, 21107, 17195, 16774, 18489, 18116, 16058, 12522, 12522, 14949, 19654, 12044, 4074, 3954, 8202, 12454, 18400, 20413, 13174, 13059, 22860, 29989, 25492, 18666, 21380, 28093, 27180, 27641, 22965, 18293, 15073, 20433, 15190, 10129, 10012, 10363, 13008, 16699, 11166, 11539, 19705, 28926, 20127, 16919, 15293]
13610A5293r94j6810o236Q739K882Q972L06j0388L426q951M389O794m31m350j158
13595A483j658k173L573k697J6062R318j971q023q675j1650o116R987K597m823
13581d766M218J2012M458m254m516L834r915k576J2175k377M044O89p005k715
13567C306l121l538P21k200o484L741L697P925q496J288J4615j514j0672l89O546
13552E425j832q198N62P523L720J131j1142j1045j171K938J121O606J0210O188
13538A2036r99n179j6084k89K10l130j858m804m844N492R432J1346J485M709K079
13523I602j571O772j2730m398K71P473P05n900m881o664m758O221q6N87O676Q017
13507E336M490k974n654q728k517M702M417J0492q075m435p426j178N250M004
$$ y = [15293, 14299, -2511, -8747, -8, 2874, 11846, 12152, 1764, 5190, -3761, 628, 7422, 6991, 2641, 1483, -175, -2348, 1225, -1472, 14590, 23908, 21937, 13914, 5239, -6411, -12527, -2540, 57, -4766, -548, 11464, 15922, 11668, 7152, 10986, 1071, -1505, 10670, 8293, 12337, 13026, 6021, 3306, 185, -3353, -2632, -4832, -11316, -7575, -3878, 4047, -4449, -3161, 11454, 9940, -732, -1121, 5425, 3593, -4605, -4043, 3480, 7200, 8331, -2811, -13856, -15027, -12089, -10968, -4362, 5848, 12036, 11037, 5858, -10226, -10515, -10305, -13435, -15293, -20097, -24941, -19449, -10017, 1329, 2814, 7523, 9602, 8031, 14803, 2073, -2325, -2054, 5419, 6124, 224, -4657, -11321, -16079, -9858, -9944, -9357, -2681, 5336, 9826, 6852, 1198, -7530, -10047, -5345, -928, 9564, 1489, -2946, -10372, -11550, -6300, -2296]
13493b296o952q74J710N006M468m228P04P481L479J0285k515n825j5261o324R854
13478a288P803P226K365o117j420q122j343L454q771j131P32N467j0381j3387
13464b4913l947J917N139J7416Q472o528P611N034l496m560L415L809J500j84
13450A0685l919K586O15m270j328n536o285l725J2899L454q278p602N018N348
13436c38M134o562l060j5048k286L741N593L892M079J0506J2996j665l777R368
13422B1573l530j0938p245l254j4710J783J2412j551J209m682P09K106l451O670
13408b899Q380l160L92M048k229k950l874l507k378L740j780o80O977K235m030
13393a715j6391n250J8596J7568l320j3999j447R596J084p406o274Q31L268q088
$$ y = [-2296, -9248, -10122, -8412, -3406, 1062, -3166, -2462, 5019, 8498, 18783, 16268, 10443, -4818, -11142, -1288, 6515, 13741, 16106, 9989, 8569, 447, -896, 2558, -6213, -7344, -6612, -1145, -11526, -24913, -28860, -26943, -21804, -4388, 4084, -2444, 5167, 10201, 6705, 2145, 5560, 9369, 10869, 10685, 6766, 9352, 9967, 5697, 4369, -1167, -7452, -11177, 1722, 5176, -3102, -10704, -5686, -338, 3796, -2766, -5826, -20874, -23160, -19419, -13826, -9934, -5855, 4651, 17647, 15982, 12205, 21573, 18043, 7105, -140, -3394, -18104, -16321, -3909, -5460, -4251, -8933, -8224, -6118, -9569, -2899, 5481, 2321, 2713, 6761, 4532, 1582, -2292, -5799, -8177, -4437, -6217, -6897, 80, 2315, -1715, -18106, -23356, -4760, 12808, 9488, -4511, -5958, 3638, 4722, -2684, -8958, -8127, -4859, -12947]
13379a2947j684L463M978K840n330r296k766k52M006J300J357J0855N603j014
13365A113L892K955l851p043j640O548M321k471j50O161O849P199O035j2807j7767
13350f56l645q50l223J841j782J863P706N045j1250o315J570J5102O010R32K321
13335A4669q260n552Q204J663r906q850P447O56j470K975J2058p329q03K155L890
13320A1547Q642j2773j820K047O046j281p034l010M65r628N585k791L437P297
13306F729l671R25j541P509k211j0027L590N892m29m124J637k123Q578L797j0655
13291C876j221j2309J437M05L53j002M22O95L439k370J0217R798J644r465J625
13276G544m99N327L481n328L86q155r433K908k576k717J012J0361K868J1523L902
$$ y = [-12947, -14631, -11168, -6190, -3350, -8680, -17976, -20742, -20994, -16988, -15688, -14331, -3476, 2127, 1113, 5005, 7960, 4109, -2934, -4574, 1974, 6295, 3824, 3674, 9835, 16684, 23883, 29918, 17111, -656, -4301, -5151, -8374, -6533, -8315, -6452, 1254, 6299, -4951, -11266, -9696, 5406, 11416, 12348, 14669, 6409, 857, 9061, 10724, 818, -8032, -585, 71, -1399, 1576, 13634, 6305, 5502, 7657, 11547, 20189, 7416, 5596, 7643, 13689, 12408, 5374, 2364, 2829, -6799, -1214, -4005, -568, 6729, 3058, 3983, 2442, 9951, 7740, -2287, 1303, 7195, 6766, 2642, 4279, 2156, 10734, 14531, 3876, 2655, -9654, -8217, -7812, -7459, -8461, -8039, -7344, -3905, -6275, 3942, 13740, 15384, 5919, 7544, 7045, 12372, 15853, 10525, 10911, 2756, -6677, -3769, -6345, -9062, -8050, 2311, 5179, 16702, 20604]
13261B0604K682l199q250j76K917q380r041O467K031L748P179j863L047k697p026
13246H043o785k272n798j0365J269J1423N025M721M439K220j3872p454J542P541
13232c23J168O94m224L592j164O726l173l977P350R718m817l598n504j449L824
13217D843N88j67m024m003L857J2453l75J46k705q158j5138j748R19L941M535
13202e036K419l029L453j343n346m962J816j109M698m972j159Q882k175m767N874
13187f756N070j4861k625J4709J4360J632r186q439P181L257q243o186K691k292
13173i688p46J0359O233o427O520o374p065j901K741M444l98L605l416j5880K369
13158a5624Q163Q834j980Q323J2064j680r921M768N638K428l817k634q091l579
$$ y = [20604, 23286, 20087, 11837, 11661, 14578, 6198, -2843, 3624, 5655, 9403, 16582, 14719, 17766, 15069, 8043, 1258, -1014, -6812, -17177, -15908, -4485, 540, 5261, 9700, 11920, -1952, -9406, -7864, -323, 845, 1539, -2685, 907, -257, 6469, 3296, -681, 6669, 16387, 11570, 7972, 2468, 1019, 4843, 5431, 5264, 1240, -2763, 1094, 13547, 13172, 13318, 10613, 2455, -12683, -14431, -13512, -9571, -5036, -2617, -5646, -2193, -3536, -8882, -13844, -12028, -13137, -8439, -13411, -14570, -5688, -7863, -12630, -6756, -1686, -16547, -19172, -4463, 9897, 11529, 2343, -6096, 1085, 4342, -3901, -10087, -7396, -9688, -10434, -75, 6158, -269, 6251, -123, -7188, -9089, -6348, -1904, -2302, 1303, -2113, -17993, -15624, -7461, 1373, -607, 7716, 19780, 18100, 8179, 12947, 18585, 21013, 17196, 14562, 6471, 2892]
13144B892q069K325j89n536k381L979L588L685j388p930j907K922M353J8322j797
13129A2869n602p588j1419o007N901Q74m002M500N360n147j133L779J451k942
13115i106r932K851P559r0J0218J4448m526o827L567l38p374J861L251M463O108
13100A6133p540p225O462p394q232P141N920n443Q733O626J723p616q368l694
13086b774m026P835j194J363L377l168l645k958m555l752M094O900m17j0839O64
13071a3095R98N743j2058l921O901R405J081R04J265J0638P32m089q92q306j172
13056e866j844P660K032N929L020p236j438L563o397l011j802l641m157N573L617
13041c998N741l268m356M630r455P176M929q082j813R259J5869j909j6044o660
$$ y = [2892, -5177, -2852, -3041, -8577, -10958, -6979, -3391, 294, -1094, -9024, -10931, -8009, -3656, 14666, 12869, 7267, -321, -11740, -17747, -11846, -10972, -14974, -10474, -5114, -10261, -11394, -7615, -6164, -9106, -19038, -16187, -8628, -8718, 1500, 15948, 11422, 4595, 8162, 7824, 450, 2311, 5562, 10025, 16133, 8593, 1368, 7830, 436, -7796, -655, 5265, -178, 8555, 15181, 16904, 9288, 920, -2774, -6800, 1035, -159, 1204, 4581, 1413, -2232, -5190, -9745, -13497, -9403, -2503, -2920, -13759, -13095, -12097, -6354, -18412, -22333, -15432, -6027, -4946, -4042, -2777, 7861, 8593, 4504, 3612, -4694, -5866, -7710, -50, 1982, 7911, 10931, 3695, 2257, 5820, -577, -3588, -5390, -9031, -13188, -7615, -3998, 1743, -1525, -5881, -1251, -10706, -3530, 1399, -6683, -8496, 763, 16632, 14723, -1321, -7981]
13027g981p162J68L277k707P15P211J107L512Q842K333k167o75k696o217p539
13012i979m624L990L769Q235N290o085O321N40n07j1420k362J1197o768m583J293
12997e693m078j905L621J956l140J146J437Q424l186q102p869J2070N527j655
12983a447j721l630k513j248l864M174M332M160K587J502K244L990Q376o350p450
12968C142j3415M565P085p385j544m125K974M21J018o29k799p683j1496J2859
12954a7012K3246J779l708j2052j105M249J2601M927p231K392r316J920N921l862
12940B749r028k297O352P447K554j446K860M987r044k064l003p714P22L735m701
12925g891k116L065l158m163N590N983M746R834p19k187Q677P168N562N123J5418
$$ y = [-7981, -15143, -14975, -11698, -14405, -13690, -6479, -5372, -1860, 6982, 9315, 7148, 6473, 3777, -2440, -9979, -14603, -10613, -6844, 1391, 6681, 596, 6917, 7457, 6950, -4470, -6832, 4365, -2403, -6986, -5693, -9771, -11676, -8055, -6099, -9239, -8093, -6656, 1768, -1418, -9520, -17389, -5319, 208, -1447, -3168, -6798, -9311, -10559, -14423, -10249, -5917, -1757, 830, 2332, 4576, 8566, 16942, 10592, 3142, -10273, -5708, 1377, -6008, -7552, -11677, -8703, -8282, -7264, -7893, -10692, -18375, -29871, -17012, 6234, 8013, 4305, -7747, -8852, -4603, 7998, 12925, 5694, 8086, -1230, 690, 6611, 2749, -6279, -8576, -2224, 5223, 7777, 6331, 9191, 14178, 5134, 3070, 67, -7647, -6925, -3190, -7891, -10007, -6942, -10100, -14263, -8673, -2690, 2056, 11890, 11171, 8984, 17661, 24829, 30391, 35514, 50932]
12910E0932J911q071L851J1374J3639K0167L6416N2689Q2593J24705K08510K28110
12898H26826N9043r6917k23370j97967j24885q3909n8605l4141k2475j0585j1405
12887B1610j3299Q842O534j641m480n226j565J240m043o15J475N364O606n714
12873A5088j5191l33L108n930o046o713l152l228n195N470M948O793N122J2562
12859G303Q985q68o894o823p023M232q89p432n425n918K791M971l788j317j89
12844a8284O540J284L612K218n193j1828N459Q33L128J0246J0023o244Ol651m168
12829f019J4115k682j2710j2103l387J5925O132j998k57o91n964J25o81M745K544
12814b906m60j1545j1583Q74Q519L117O226J145j240k565p09j015q355k906M618
$$ y = [50932, 52843, 44772, 48623, 59997, 73636, 93803, 130219, 182908, 265501, 390206, 598716, 826826, 885869, 788952, 565582, 367615, 242730, 158821, 100216, 66075, 43600, 33015, 21610, 8311, 17153, 23687, 22046, 17566, 12340, 10775, 12015, 7972, 7357, 8832, 14196, 20802, 15088, -103, -436, 2672, -3258, -9304, -16017, -19169, -22397, -27592, -22122, -17174, -10381, -5259, 7303, 16288, 15420, 8526, 1703, -5320, -1088, -1977, -9409, -14834, -20752, -17961, -12990, -16778, -18095, -18284, -11744, -10460, -6848, -4630, -9823, -21651, -16192, -15359, -12231, -1985, 8038, 1794, 1800, -1851, -6019, 8096, 5414, -7296, -19399, -22786, -6861, -729, -2727, -2984, -3675, -9639, -9514, -10195, -5450, -2906, -3366, -14911, -26494, -25620, -17101, -13984, -7758, -6613, -7853, -10418, -11127, -12142, -20497, -23403, -18785]
12799a8785Q818j006l802l652Q225J3467l078o441q45M052j554m853P258N763
12785C567p143N62Q61O616N004J476l659m506R227O81r140o60L288j1323j319
12770f468J38P426K175o028k665L37J068J6076N578j122j1775q602j1616n295
12756b0773J1230O399j85K581k957K861L700q947k830K740M178j813o720j486
12742a2022o031O594p31m398M91J0445L758K028o316l039j707m113J3134L398
12728A491j1924J35n62k235J187Q940J553N747O153L311p319L625P955n422m373
12713H262j253R183j0697j0048l094p318n169l850N710J2152O176P286J0403N
12699A7748q427r196R06N135o079j677L89N62k629P005M488n41l947J265j740
$$ y = [-18785, -9967, -10973, -14775, -18427, -10202, 3265, 187, -6254, -7099, -3047, -4601, -9454, -2196, 3567, -3576, -3014, -2153, 4463, 9467, 10943, 7284, 2778, 12005, 12686, 3546, 2886, 6174, -5149, -6468, -6330, 1096, 3271, -2757, -5422, -5085, -4017, 12059, 17637, 16515, 4740, -3862, -15478, -20773, -9543, -3144, -3329, -748, -3705, -844, 2856, -6091, -8921, -6181, -2003, -3816, -10536, -12022, -18053, -11459, -12190, -16588, -16097, -5652, -1894, 134, -6182, -9221, -10928, -15041, -1907, 1491, -10433, -10298, -10860, -13095, -11908, -2968, -1415, 4332, 10485, 13796, 6477, 10102, 18057, 12635, 8262, 7009, 16192, 5495, -4553, -7647, -14965, -20134, -23984, -18274, -6122, 54, 7340, 17743, 17748, 9321, 125, 1031, 6166, 87, -1590, -1201, -639, -3268, 3737, 8225, 7684, 3737, 5002, 3262]
12684C262N558n719j0212n131l406N044O104K19L431K772J486J560l607j664k904
12669c207L147n095N52N853O898L949j946M21k470J292nk322j1624j133J821L722
12653a47K334q763l033O703K241L647N452p847m026O238K678L647N898J3201n889
12638B2334r792M975p728r757q11R823J3563m371k350k073m706K075M482R088
12624B4752q565j6066l950L362O976K345L601J908J1163n157j1418o552N997J296
12610I692j2549p49J498J28o435j2296O139J0126m729K243Q722k366K148P458
12596I030j558k823k932K608P37O453l903r651L379j402j2125Q234P509n437p132
12581i013R910J6575P701M65K834J1045r592j5085l934j2069O617P04m141o491
$$ y = [3262, 8820, 3101, -7111, -12242, -15648, -10604, -4500, -4281, -850, 1922, 3408, 4968, 1361, -303, -3207, -60, -5155, -4603, 1250, 8148, 12097, 10151, 10572, 8102, 9394, 9389, 7067, -4557, -5690, -3869, -147, 2187, -6576, -9609, -2906, -665, 2982, 8434, 587, -3439, 2799, 5477, 9124, 15022, 28223, 22334, 12542, 17517, 9789, 32, -779, 9044, 22607, 18236, 15886, 13813, 9107, 11182, 15664, 24752, 16187, 121, -3829, -467, 6509, 8854, 12455, 14363, 25526, 20369, 8951, 2399, 8396, 9692, -2857, -3606, -2108, -1980, -8415, -20711, -14572, -4446, -9175, -6932, 1790, -576, 1572, 9030, 7472, 4649, 1717, 4325, 5062, 11515, 7612, -2039, 1340, -62, -12187, -3953, 3556, -1881, -9013, 897, 17472, 25173, 25638, 28472, 39517, 29925, 14840, 10906, -1163, 5454, 6158, 2017, -4474]
12567d474M834K833Q293j457r25J910l064j0551n858O986J4225L071j386j4510
12553g3j0319l005J2284L454l778K523N991M71j6071j04J0976M242j1087j0078
12539a4574L679M171P759j709j0389k559J2149Q03j0797J113P789k597j833J3952
12525F957O063J325j0859j0204m177J512O707k649j0074p392n218J1593Q221J2261
12511D066J4593n717p283O18J8905N586K65p644j7778j530N36j6630j729N425
12497h317J1575P386o01L317L124R664J832j3159p710q86l443M549k805m483l081
12482c038K352L094o446J643J687o747n85O919O062L816r364k41j2111r769q160
12467c0888L12J5389J0258L367j17O988j708j0165m517O176J2964n86L20N009
$$ y = [-4474, 360, 3193, 11486, 10029, 9104, 11014, 7950, -2601, -8459, -1473, 12752, 15823, 14437, -73, -10392, -13397, -1113, 2341, -1437, 1086, 7077, 7548, -8523, -8627, 2349, 6591, -4496, -14574, -10895, -6724, 1035, -674, -11063, -13622, -1473, -670, -11467, -10354, -2565, -5162, -6995, 6957, 13020, 14345, 3486, -6718, -10895, -9383, -2676, -5325, -15399, -22791, -28009, -16416, -8195, 4066, 18659, 12942, 5659, 6277, 25182, 30768, 31033, 23389, 5611, 4081, 4617, -12013, -13742, -8317, 3258, 10644, 10043, 13360, 16484, 26148, 27980, 14821, 7111, 6225, 2782, 7331, 4526, 43, -3038, -686, 2408, -4038, -2395, -708, -7455, -8040, -1121, 4941, 8757, -607, -848, -12959, -22728, -30888, -30576, -15187, -4929, -1562, -1679, 5309, 3601, -6564, -11081, -4905, 8059, 7473, 7793, 12802]
12453A2802J487m785j475M690n807l944o419o046k672o87l70n430K35J677n097
12438b1841K018Q649P710J0707L540m896o586k620J2747L896M384o601m690M905
12424A1322q17j0379k205m036K291N472P40q049n372K475P322j160J339Q325P515
12409A4783l665m57p024k159l381O00K438r321j0496l006k809J8234J4730m512
12395C955o312Q903J660L282k425k318l96p71j899n783k3946N917M922N721L778
12380e712q030O22L202J5122J1811n547j0095L468JO357R407m956r704k220p524
12365c798j55r086o367J4068O695o58Q81n430n140L549o2J3024L894j3584K308
12350A39L2p599j16M284J837k022P564R540K075j1067o242l087j532M416l173
$$ y = [12802, 14289, 9504, 8029, 12719, 6912, 2968, -3451, -9497, -12169, -12856, -13226, -18656, -18421, -16744, -21841, -19823, -11174, -3464, 7243, 10783, 5887, -699, -3319, 9428, 13324, 17708, 11107, 6417, 11322, 10505, 126, -2079, -6115, -3824, 1648, 2388, -5661, -11033, -8558, -1236, -2396, -1057, 7268, 14783, 11118, 10661, 3637, 1478, -1903, -1303, 1135, -8186, -18682, -21688, -24497, -6263, 8467, 3955, -2357, 6546, 8206, 11488, 9063, 6745, 6349, 5578, 3679, -2104, -26050, -20133, -15211, -9490, -5712, -13742, -13120, -9918, 5204, 17015, 11468, 1373, 4841, 4842, 11199, 20606, 15650, 5946, 3726, -3798, -3953, -13039, -19406, -5338, 1357, 699, 1580, -3850, -8990, -5441, -5503, 7521, 11415, -2169, 139, 171, -7428, -7544, -3260, -1423, -3445, 4119, 13659, 15734, 4667, -1575, -4662, -6194, -1778, -4951]
12335d951k415m898k869K164Q758N191K960N066j779j0131q238L953m785N759
12321f215O406j239n297J743P740L774k091r744M885L76o615J610J052O73j53
12306c095o867p259R898R793k91j424P514o551j551J931k809k903m172k336K13
12291i909J3897N136Q31m828o421K072j093k083J202L579n876l818Q187N349J8931
12276B5156l242q744p602l984J489N218o908p103M196J3007m007j7531o189N22
12262a5722R792K658Q786p588m286n803O701P432n76K685N228p045J260j934l310
12247a722r451k439J5527q91L238L003m084J387N73p377m707J527L036N452j693
12232A379N817J633j1066q192m288O480O852K060o541j038N260O116M558p152
$$ y = [-4951, -7366, -12264, -15133, -12969, -4211, 980, 3940, 9006, 7227, -2904, -11142, -7189, -11974, -6215, 191, -1048, -6345, -4602, 3138, 6912, 4821, -4923, -38, 338, -6277, -4667, -3615, -2942, -3095, -9962, -17221, -7323, 2470, 2179, 755, 8269, 1718, 167, 2098, -711, -3614, -7786, -10122, -9909, 3988, 9124, 9955, 5127, -1294, 778, -315, -2398, -1196, 2383, -3493, -7311, 876, 6225, 25156, 21914, 13170, 5568, 1584, 3073, 8291, 1383, -5720, -1524, 11483, 7476, -10055, -16244, -15722, -5930, -3272, 5514, -2074, -6360, -12163, -5462, 1970, 1394, 4079, 9307, 2262, 3522, 1588, -1722, -11173, -13612, 1915, 1024, 4262, 7265, 3181, 4568, 5141, -2236, -6943, -5416, -2380, 3072, 1379, 7196, 8829, -2237, -10429, -14717, -8237, -1385, 675, -5866, -6904, -1644, 4472, 9030, 1878]
12218A878L844J860J282P031l726q738j2331k872O391M264M939k276j1254L349
12204f359k683J364J2626K637j2148n509P05m469m709O628j262O093Q791J780
12190C485m770j0492M63K851M548P104o66P96J0618L639K440m474n574o46l774
12175E548J239m001p23J006J683N799j0337P685J855r403n832l256N765j380M653
12160C01O704J787j5461m609J5385M729n998p89K405q38O42K35j104P751n120
12145F020l326L361j3305r597M879k169o328O060J7576N269M082Q786J887j2887
12131A0308m050L841q318j620M434J629j599n412m203j851L061l482m218Q49R336
12116a295N404l409l266J055o243k228M764J2733p5J891q267n861O154m659k527
$$ y = [1878, 5722, 7582, 8864, 15895, 12169, 3431, -8900, -11772, -5381, -1117, 3822, 1546, -9708, -6359, -9042, -7678, 4948, 7585, -4563, -10072, -9367, -13836, -18545, -11917, -13179, -7086, 1705, 3485, -1285, -11777, -11314, -8463, -3915, 3189, 2523, 3319, 13937, 17576, 20016, 15542, 9968, 9322, 5548, 6787, 2786, 2063, 3069, 4752, 10551, 214, 7899, 9754, 351, -5481, -8737, -2972, -4352, 301, 7005, 8792, -6669, -11278, 4107, 8836, 2838, 2049, 4454, 3616, 4258, 4493, 3389, 11140, 6020, 2694, 6055, -7250, -16847, -11968, -14137, -20465, -14405, 3171, 8440, 12522, 21308, 23195, 10308, 6258, 10099, 1781, 161, 4595, 6224, 4625, -787, -4990, -6841, -3780, -7262, -11480, -10631, -1295, 4109, 700, -2566, -1511, -7754, -9982, -5218, 7515, 7440, 9331, 1064, -4797, 1357, -3302, -5829]
12101e829K505Q747n494O790j01o610K186m092K720q992m201K726O715J0412J720
12086I202M032l47m570q397k653L668q9M166n859k650L862k955l535q250o169
12071b0544O024q500L887L456L90K037O716J3317J933l058j0433q898M405j620
12057a0888L53Q850K123o085K808l166J936J2946M340j1332m84K0001P379q050
12043B0731q569j1924j1733K132K0426L607j2954j214k554k883j734m461J924
12030i206O778j3587L440O432K644R513J4300J3177r910j6435l617O306K701N811
12016A8347O986O895P298N025j0326j0740j0347o970L305M989L430L064O23q944
12002A2635m136J774N705L902k607N269O647N197L67j2474j3752k738k97l133
$$ y = [-5829, -3324, 5423, -71, 6719, 6618, 8, 2194, -1898, 822, -8170, -12371, -9645, -2930, 7482, 9202, 13234, 12887, 8317, -80, -2733, 935, 846, 5012, -847, -3497, 365, -2590, -6125, -14375, -20544, -14520, -23020, -19133, -15677, -15287, -13250, -6534, 6783, 8716, 5658, -4775, -13673, -9268, -10888, -10535, -1685, 438, -5647, -2839, -6005, -4069, 8877, 13217, 1885, 1401, 21402, 28781, 20731, 12162, 238, -11495, -9363, 11063, 14670, 1716, 502, -2052, -4935, -6669, -11130, -9206, -2428, -16015, -12575, -6143, -3499, 6014, 20314, 33491, 23581, 7146, 3529, 9835, 12536, 18347, 25333, 32228, 39526, 44551, 34225, 23485, 13138, 6168, 9473, 14462, 17892, 20956, 21579, 12635, 8499, 10273, 15978, 19880, 17273, 22542, 29189, 34386, 34753, 22279, 8527, 5789, 5492, 2359]
11988B359L041n702R333M59r381Q35R92n611k774m814q27n266J221J629J77P876
11972f453j0650n7M2P444N925J2535K58K988Q65N984J875j2116M169p60l369L353
11956A2033O574n58R88n758j1095l791R323L60n763j436O325J2563M117R326R260
11941D2468K1039N8387N7971K6054j0756l2702n2644m7591j5229o31o091q125
11929C2150j5013j1356q052p828m937n889Q462J4508K426j459K470j0291q19N645
11915A7q864l025r55K403k071J892m210j451L611J1996Q280N59r80r421l301M519
11899a001P72N020n665j1735l452M079l039j361K678K31O843M926l446j0863l901
11884a9914o637J2626K211L791k215R05M294N318p10l488j985O411J2493N388
$$ y = [2359, 5400, -302, 9031, 9490, 109, 944, 1936, -3675, -6449, -11263, -12090, -17356, -16135, -14506, -14329, -6453, -17103, -17160, -17118, -9674, -3749, 8786, 9044, 12032, 12897, 18881, 20756, 8640, 12809, 12049, 8680, 12033, 18607, 18049, 19037, 13279, 2184, -1607, 7716, 8076, 2313, 877, 7202, 19765, 23882, 33208, 42468, 63507, 121894, 179865, 205919, 195163, 162461, 109817, 62226, 46997, 46366, 40275, 32150, 17137, 5781, -2271, -10099, -15036, -20925, -12463, 2045, 4471, 3012, 5482, -4809, -5628, 17, -8847, -11872, -12827, -10424, -12495, -10603, -14813, -16264, -12653, -657, 7623, 8182, 7202, -2219, -5520, -1001, -229, 4791, -874, -12609, -16061, -11982, -15021, -16382, -13704, -13473, -6630, -1704, -5150, -16013, -19914, -26551, -13925, -11714, -7923, -10138, -9233, -4939, 379, -331, -3819, -5804, 607, 13100, 18488]
11870A8488o413j3976m130J649l576J510k570J1343J1846R238o781j2888R44k766
11856A918m438m370j5802m512P860p81l35J0580O474J911N417L2m440k640n981
11841i107K608l002o684m98P140K774l612M0J3721K041n03J808m801n927J175
11826b827l40r95k065K506r973r59k70J0704Q842p006o544L909M3J0069k84Q91
11810E701j933P863k810j523j1490m767J2762L462K538r65O470K480j0390q677
11796a279j629N34q277m513j054o87R454M737q608o837J1538N532Q42O529k908
11781C374k006q431k703P459J0871n897k876O095M886n173k564m23j0057L185
11767d260J2250N976q120j3386j1411L532L447P292L77M954l282n232N72N000
$$ y = [18488, 12075, -1901, -6031, -4382, -7958, -6448, -9018, 2325, 14171, 23409, 16628, 3740, 4684, 1918, -2520, -6890, -22692, -27204, -19344, -20125, -20460, -9880, -3406, -1495, 3922, 3954, -486, -3126, -9107, -6499, -9501, -16185, -16683, -9543, -6769, -10381, -10341, 3380, 5421, 4918, 6726, 1925, -4002, -2827, -3167, -4162, -6227, -3721, -13694, -14653, -14923, -4219, 4623, -2383, -8927, -5018, -4975, 5094, 4810, 5701, 3768, 11631, 8821, 7298, -4192, -8959, 3803, 7265, 9803, 8838, 15308, 17788, 7398, -1279, -2908, -2374, -10651, -15164, -16218, -16905, -7451, -2714, -11322, -18159, -6621, -1089, -247, 6282, 3374, 1368, -7063, -9766, -2307, 8564, 2667, -209, 5886, 10772, 5599, 3035, 2612, -7445, -4260, 7990, 13966, 5846, -7540, -18951, -15419, -11972, -4680, -4303, 651, -2631, -7863, -7291, -2291]
11753b291M414m196o899m38Q188o104p241k784j882J1872J1321K172o931m552
11739e351N246J076J082J152j114m917p549K965j948K649L052J824M208J285L008
11724F668N97q172j0169O470n902m009Q306p96j3789N424J798J5605P594n842
11710C783N395o473k098K218q058l577N173N920o951o926j677M264L70J1235l35
11695B263n367j960m329k769Q268J3610m476o630N956n526r208L106L092N562
11681A592M352l676q98j632q12P937j937o055P336k732j2289J110N652M596n95
11666A949j0287O541J190j1007L802L120j007M091N713l289p033N088m408q471
11652a4008Q225M293J0490K830r514j2315m961J56R372K423j3488k668O288J539
$$ y = [-2291, 2123, -2073, -8972, -9410, -1222, -7326, -14567, -17351, -19233, -7361, 3960, 6132, -799, -5351, -105, 971, 2053, 3205, 2091, -2826, -10375, -7410, -9358, -6709, -3657, -1833, 2375, 3660, 6668, 7265, -907, -11076, -4606, -10508, -14517, -6211, -7007, -20796, -15372, -13574, 2031, 9625, 3783, 9178, 2705, 607, 2825, -5233, -8810, -3637, 2283, -4668, -11594, -13271, -9007, -8637, 2598, 2263, -3104, -5064, -9393, -12162, -3894, 9716, 5240, -1390, 4566, -960, -10168, -7062, -3970, 1592, 5944, 2268, 1370, -262, -1074, 6863, 4926, -1129, 6207, 3475, -8814, -7704, -2052, 2544, 1949, -8338, -1797, -607, -11614, -7812, -4692, -5699, -1608, 4105, 816, -6217, -1129, -5537, -14008, -5783, -1490, 9000, 11830, 2316, -9999, -14960, -14804, -5432, -3009, -16497, -19165, -12877, -11338]
11638a1338Q585O784K188j2151p646k983j1248J5680Q486L890n055m018M274k694
11624g246m381N600l374QL168o788N628p86L919m555m832j455P459Q060M88j1171
11608a0258j001M279l204m739M001J8845K767j8775K31J1878L694p370K907L702
11594F957L573n924K317Q546m891J481m989j0853o682j623k332O282J4827p526
11580h37o897j4K283N203k890N571l492k957Q728N401r454j627Q769r67q829j821
11564c830O639j1783l122J3089N566p168k203k85r22K443k422N375j689M741o493
11549b064j4199m636P21L280j762P087O796o636L440p13J014j519q082l888K304
11534a8857N123N500L391O662L190j508m534O606N42j0157l620p252R28r593K306
$$ y = [-11338, -2753, 4031, 6219, -5932, -13578, -16561, -27809, -12129, -3643, 247, -4808, -8826, -4552, -7246, -11627, -6027, -9401, -9393, -6225, -13013, -7385, -8171, -4252, -8807, -13639, -15094, -7635, 425, 913, -10258, -11259, -6980, -10184, -14923, -10922, 7923, 10690, -8085, -7854, 4024, 7718, 348, 3255, 6957, 10530, 4606, 6923, 15469, 10578, 12059, 7070, -3783, -10465, -12088, -14420, -8138, 6689, -837, -7734, -7748, -5465, -262, -3152, 2419, -1073, -4030, 4698, 10099, 645, -982, 7787, 6820, -2009, -3830, 2809, -8974, -12096, 993, 6559, -609, -2812, -3097, -4019, -1576, -3998, 1377, -312, 4429, -2064, -16263, -20899, -20178, -16898, -18660, -11573, -4777, -11413, -7973, -8686, -7672, -9191, -17273, -21161, -18857, -13734, -8234, -4843, 1819, 5009, 3501, -1033, 5573, 6115, -4042, -7662, -14914, -13986, -23579, -21273]
11519b1273L056O797j762J3797P300o696K537l55j9780j104Q346N213J3979M187
11505A4242l082L704o416j4058l452M48j620L197n701p412P257M175O978J1943
11491A0203q672j247L678k573k440j099l371P493N242m169k309p77k323l382k393
11476h139O050J769m23j63p71N641o052K901M903j704O445o183o971J519r691
11461a0869j449Q858O212K599j061m865L575Q013N76k761o232j2709j0075N927
11447a4261R116L507p13q028N621M712O107k273K04o652o350p03K955o303p004
11432b0065l165MM45P946o825k575J3902K197k378O016l71j1924L218K774P173
11417c628j311l919k593k438M455j165M954k627J249L709j22M589N565n916m678
$$ y = [-21273, -18217, -11420, -13182, 615, 7915, 1219, 3756, 3401, -16379, -17483, -9137, -3924, 10055, 14242, 11160, 14864, 8448, -5610, -9062, -8614, -10234, -7037, -12738, -20150, -12893, -8718, -1740, 10203, 1531, 284, 3962, 1389, -1051, -2150, -5521, 1972, 7214, 3045, 736, -41, -2364, -5746, -8139, -2089, -320, -743, -906, -1677, 3964, -2088, 813, 5716, 4012, 10457, 4274, -2697, -1178, -10869, -12318, -3460, 2752, 5351, 4290, -575, 3000, 11013, 11589, 8828, 2596, -10113, -20188, -14261, -5145, -1638, -2351, -10379, -4758, -46, 6061, 3788, 3992, -2660, -9010, -9713, -6758, -13061, -20065, -23230, -23226, -22781, -14835, -21660, -24235, -10333, -8136, -10514, -4498, -4869, -16793, -13575, -10801, -3628, -4939, -8858, -11451, -13889, -9434, -10599, -5645, -8272, -7023, -3314, -3436, 1153, 6718, 802, -3876]
11402c876o851P226L727l020M577l738N754l304l403O035Q97k775P996M287K201
11387A5733j919L332q547m213n465M514l92j0499j826M647l923p513O851N662
11373c558K668M209r246q855N47K61J090J0247r667o733M059M662q715Q314R125
11358a592l595j0098o35M175k769N035l607n811k138O994Q371J3469L549o815
11344D533P727n826j8200j0342L454P295L688J226K644q039R85Q270P040j743
11330B712q607O571J561j26p523p015O057J118k5J614j183K480O640l963p193
11315f882l501J3214L167l153J912l930k573K442O369j791q039m085J099l983
11301i734J127k842J888l952q583R440J7499R880M981r596k982q893r214L25j37
$$ y = [-3876, -10727, -3501, 226, -2794, 1783, -1955, 3799, 495, -2908, 3127, 4024, 1249, 9245, 13532, 15733, 13814, 17146, 8599, 4386, -1079, 3435, 3043, -7456, -9282, -4635, -8558, -16071, -9220, -3558, -890, 3319, -5927, -14782, -14235, -13974, -12884, -2637, -12304, -19037, -14978, -10316, -19031, -10717, -1592, -5187, -15285, -15920, -11745, -14514, -9479, -13086, -18897, -21035, -14041, -5670, 7799, 11348, 4533, 12260, 6434, -11766, -22108, -18654, -11359, -7671, -6445, -3801, -11840, -10855, -2585, 4455, 2712, -5895, 676, 2237, 2111, -5412, -12427, -6370, -5252, -5277, -3663, -4846, -2366, 4274, 311, -6882, -10383, 2831, 5998, 2845, 4757, 827, -1746, 696, 7065, 5274, -2765, -6850, -5751, -9734, -8607, -11449, -9561, -13513, -22096, -12656, 4843, 14723, 19704, 10108, 7126, -1767, -10981, -10656, -10793]
11286a0793K796Q044m93l101N861P09l757M63j980o830m845m400K890O505N958
11271b973O68m581K331l131K468k056q004r087M011J6337j563j030M915K219n15
11256IK446k862o667Q62J138p259m258j069m675N989J1013R022K537M3J385o613
11240A041j0183O061N695Q509N76m859P180m703k95r845q370O46o474k701M435
11225a3287j786N507R019K730j316l584k786l469N054j94p737L338J1787j073
11211B203o6M72m23l765q504L009J4311J332k801q829l891k182L663K967L935
11196A431O246l134j332q9J271k743J609N989M022o946J768M978m253K91K98l768
11180E638m178M217l899M037N304k963l043o312j195n765O26Q797O90m48j2728
$$ y = [-10793, -7997, 47, -446, -3547, 2314, 3023, -734, -271, -2251, -9081, -13926, -18326, -15436, -8931, -2973, -2305, -6886, -4555, -7686, -5218, -7274, -15278, -24365, -20354, -4017, -5580, -6610, -1695, 524, 9, 2455, -407, -7074, -6212, -5074, -12333, -16591, -17660, -22335, -16346, -5333, 3689, 6226, 6269, 7654, 1041, -9142, -3081, 2614, 11123, 11699, 6840, 14020, 9317, 9022, -823, -9193, -8547, -15021, -17722, -13287, -15073, -9566, -547, 2183, 867, -2717, -5503, -8972, -3918, -4112, -11849, -8511, 3276, 2203, 2137, 2609, 2186, -1579, -10083, -7074, 7237, 8569, 5768, -3061, -6952, -9134, -5471, -2504, 1431, 7677, 4543, 3211, 3122, 4393, 1650, 3259, 9248, 13270, 6324, 8092, 13070, 8817, 9108, 9406, 5638, 1460, 5677, 1778, 5815, 11119, 8156, 5113, -1199, -2394, -8159, -7533, 1264, 1954, 1506, -11222]
11165a1222l956J699O096M212N655l47j1144n161P111P207k06k313j928J2946
11151H649K031Q846N703o636k0978p992l645k672K448M328j274P196J2927o549
11137B382k703n717j611j29m169q338N543N749J1406Q237k60m125L962p345n452
11122b570O420J869p081j991o38o008j2001L642Q423P998J4564n802k372P865
11108A2318M600N945n873j0405j8195j462J3132R500q44j129J802L066n355j655
11094E445N313J603m313L117j502m964p306r259J573O99N111M516K551m515j2223
11079a4154o296O510K425q532P574J1302K586m03j014L969M197j859N25l807q721
11064e698j0823p80n240l94J4574k919O88Q233K012L776R78L345o416p191k910
$$ y = [-11222, -15178, -13479, -7383, -3171, 2484, 2137, -9007, -14168, -7057, 150, -56, -2369, -4297, 8649, 10680, 19526, 25229, 18593, -2385, -10377, -14022, -16694, -14246, -9918, -11192, -3996, 8931, 2382, -321, -6038, -7649, -7778, -11947, -20285, -14742, -8993, 2413, 10650, 10390, 6265, 10227, 2882, -2570, 3850, 5719, -1362, -3353, -3991, -9999, -22000, -18358, -9935, -1937, 12627, 6825, 4453, 12318, 16918, 22863, 16990, 6585, -11610, -13072, 60, 9560, 8716, 7587, 9389, 12455, 7100, 5445, 10758, 12361, 8048, 11165, 9663, 4699, -2607, -11866, -10293, -9594, -4483, 33, 2584, -1931, -14154, -20450, -13940, -11515, -20047, -12473, -1171, 1415, 1012, -2, 3967, 8164, 6305, 6830, 3023, -5698, -16521, -17301, -22541, -22935, -8361, -11280, -10592, -2359, -347, 3429, 4407, 7752, 1336, -5855, -8765]
11049h765J735k681m233k027N284J4478K677k003o876N139M725O84r541j0058
11035a1462k084P353k258l679k05l180J4124P926k595Q83K670K04n289l276R184
11020H316n691o075n032m617j2979J098J528J0640L257O163M142m404n368J004
11006h018k32nl035J415q69k397O713L939k899J772m69J0663k587j0429j0197
10991a6635J538J0441N047m117n63K219l887n498K13j654L772M974q604j707j416
10976a5877J7824L602m110p23r5J26J986j729p320k470o52L454j707L104l640
10961h227M68M480p92j368L29P772k626L006n087n124N069L45K449p642o380Q075
10945e253P983q984J927J2530N598n13j0937l516l665n499O572N946L352l194
$$ y = [-8765, -7030, -9711, -13944, -15971, -10687, 3791, 6468, 4465, -2411, 2728, 7453, 8137, -1404, -11462, -13546, -6193, -8451, -12130, -12335, -15515, -1391, 6535, 3940, 4823, 7493, 7697, 2408, -868, 8316, 2625, -3450, -8482, -13099, -26078, -24980, -23452, -12812, -9555, -3392, 750, -3654, -9022, -8018, -8250, -8255, -11290, -9875, -10744, -13141, -6428, -2489, -5388, -3616, -4085, 6578, 3991, -6438, -16635, -15097, -4656, 391, -3726, -4289, -2070, -5957, -11455, -11242, -12896, -9124, -4150, -12754, -14461, -15877, 1947, 5549, 1439, 716, 621, 747, 2733, 1004, -6316, -8786, -9438, -5984, -7691, -4587, -8227, -7759, -3279, -4071, -5439, -5110, 2662, 36, 3042, -2045, -7169, -2100, -1755, 694, -6948, -13328, -5253, 2730, -6254, -4327, 8203, 13801, 13288, 2351, -1165, -4830, -10329, -3757, 2189, 5541, 2347]
$$ [...]
##END NTUPLES=NMR SPECTRUM
##END=
