##TITLE=Analysis number 311102
Compound Code rf 01040
Project Code adrs
Chemist Name endeavour
##JCAMPDX= 6.0         $$ Bruker NMR JCAMP-DX V2.0
##DATA TYPE= NMR SPECTRUM
##DATA CLASS= NTUPLES
##ORIGIN= Bruker BioSpin GmbH
##OWNER= NMR
$$ XWIN-NMR		Version 3.5
$$ Thu Jun 30 14:52:41 2005 GMT Daylight Time (UT+1h)  MAYBRIDGE\NMR@NMR_250MHZ
##.OBSERVE FREQUENCY= 250.131544655141
##.OBSERVE NUCLEUS= ^1H
##.ACQUISITION MODE= SIMULTANEOUS (DQD)
##.ACQUISITION SCHEME= undefined
##.AVERAGES= 16
##.DIGITISER RES= 18
##SPECTROMETER/DATA SYSTEM= dpx250
##.PULSE SEQUENCE= zg30
##.SOLVENT NAME= DMSO
##.SHIFT REFERENCE= (INTERNAL, DMSO, 0, 16.522)
##AUDIT TRAIL= $$ (NUMBER, WHEN, WHO, WHERE, WHAT)
$$ ##TITLE= Audit trail, XWIN-NMR		Version 3.5
$$ ##JCAMPDX= 5.01
$$ ##ORIGIN= Bruker BioSpin GmbH
$$ ##OWNER= NMR
$$ C:\u/data/dgb/nmr/ADRS/5170/pdata/1/auditp.txt
$$ ##AUDIT TRAIL=  $$ (NUMBER, WHEN, WHO, WHERE, WHAT)
(   1,<2005-06-30 14:51:57.89 +100>,<MAYBRIDGE\NMR>,<NMR_250MHZ>,
      <created by zg, POWCHK disabled, PULCHK disabled
       configuration hash MD5:
       62 19 C7 07 E1 42 D1 B7 37 6C 3D D0 77 39 F9 E6
       data hash MD5: 64K
       8C 79 64 FB 65 C0 A7 BD DB D0 3A 59 8D E1 57 B6>)
(   2,<2005-06-30 14:52:17.05 +100>,<MAYBRIDGE\NMR>,<NMR_250MHZ>,
      <Start of raw data processing
       ef LB = 0.3 FT_mod = 6 PKNL = 1 SI = 32K 
       data hash MD5: 32K
       BB 53 26 14 6F 65 50 AB 5D B4 80 F5 64 C9 0A 61>)
(   3,<2005-06-30 14:52:23.32 +100>,<MAYBRIDGE\NMR>,<NMR_250MHZ>,
      <apk 
       data hash MD5: 32K
       1C 8E BB 27 D7 91 D2 5F 71 FF CA BB DB B2 74 34>)
(   4,<2005-06-30 14:52:25.05 +100>,<MAYBRIDGE\NMR>,<NMR_250MHZ>,
      <abs ABSG = 5 
       data hash MD5: 32K
       A0 90 4C 82 8B F0 E7 83 1B 37 4B BA 59 DA F8 DA>)
$$ ##END=
$$ 
$$ hash MD5
$$ A7 5B 49 C1 53 83 FE 15 41 1A 96 F3 BF D6 AD 38
##$RELAX= 
##$RELAX= 
##$RELAX= 
##$RELAX= 
##$RELAX= 
##$RELAX= 
##$RELAX= 
$$ Bruker specific parameters
$$ --------------------------
##$DU= <C:\u>
##$EXPNO= 5170
##$NAME= <ADRS>
##$PROCNO= 1
##$TYPE= <nmr>
##$USER= <dgb>
##$AMP= (0..31)
100 100 100 100 100 100 100 100 100 100 100 100 100 100 100 100 100 100 
100 100 100 100 100 100 100 100 100 100 100 100 100 100 
##$AQSEQ= 0
##$AQ_mod= 3
##$AUNM= <au_zg>
##$AUTOPOS= <53 >
##$BF1= 250.13
##$BF2= 250.13
##$BF3= 250.13
##$BF4= 250.13
##$BF5= 500.13
##$BF6= 500.13
##$BF7= 500.13
##$BF8= 500.13
##$BYTORDA= 1
##$CFDGTYP= 0
##$CFRGTYP= 5
##$CHEMSTR= <none>
##$CNST= (0..31)
1 1 145 1 1 1 1 1 1 1 1 1 1 1 1 1 1 1 1 1 1 1 1 1 1 1 1 1 1 1 1 1 
##$CPDPRG= <>
##$CPDPRG1= <>
##$CPDPRG2= <>
##$CPDPRG3= <>
##$CPDPRG4= <mlev>
##$CPDPRG5= <mlev>
##$CPDPRG6= <mlev>
##$CPDPRG7= <mlev>
##$CPDPRG8= <mlev>
##$CPDPRGB= <>
##$CPDPRGT= <>
##$D= (0..31)
0 1 0 0 0 0 0 0 0 0.06 0 0 0 0 0 0 0.0002 0 0 0 0 0 0 0 0 0 0 0 0 0 0 
0 
##$DATE= 1120139515
##$DBL= (0..7)
120 120 120 120 120 120 120 120 
##$DBP= (0..7)
150 150 150 150 150 150 150 150 
##$DBP07= 0
##$DBPNAM0= <>
##$DBPNAM1= <>
##$DBPNAM2= <>
$$ [...]
##$SUBNAM7= <"">
##$SUBNAM8= <"">
##$SUBNAM9= <"">
##$SW= 20.6930455092707
##$SWIBOX= (0..15)
0 0 3 0 0 0 0 0 0 0 0 0 0 0 0 0 
##$SW_h= 5175.983436853
##$TD= 65536
##$TD0= 1
##$TE= 295.16
##$TE2= 300
##$TE3= 300
##$TEG= 300
##$TL= (0..7)
0 120 120 120 120 120 120 120 
##$TP= (0..7)
150 150 150 150 150 150 150 150 
##$TP07= 0
##$TPNAME0= <>
##$TPNAME1= <>
##$TPNAME2= <>
##$TPNAME3= <>
##$TPNAME4= <>
##$TPNAME5= <>
##$TPNAME6= <>
##$TPNAME7= <>
##$TPOAL= (0..7)
0.5 0.5 0.5 0.5 0.5 0.5 0.5 0.5 
##$TPOFFS= (0..7)
0 0 0 0 0 0 0 0 
##$TUNHIN= 0
##$TUNHOUT= 0
##$TUNXOUT= 0
##$USERA1= <user>
##$USERA2= <user>
##$USERA3= <user>
##$USERA4= <user>
##$USERA5= <user>
##$V9= 5
##$VALIST= <valist>
##$VCLIST= <CCCCCCCCCCCCCCC>
##$VD= 0
##$VDLIST= <DDDDDDDDDDDDDDD>
##$VPLIST= <PPPPPPPPPPPPPPP>
##$VTLIST= <TTTTTTTTTTTTTTT>
##$WBST= 1024
##$WBSW= 4
##$XGAIN= (0..3)
0 0 0 0 
##$XL= 0
##$YL= 0
##$YMAX_a= 345832
##$YMIN_a= -261152
##$ZGOPTNS= <>
##$ZL1= 120
##$ZL2= 120
##$ZL3= 120
##$ZL4= 120
##$ABSF1= 16.522
##$ABSF2= -4.171173
##$ABSG= 5
##$ABSL= 3
##$ALPHA= 0
##$AQORDER= 0
##$ASSFAC= 0
##$ASSFACI= 0
##$ASSFACX= 0
##$ASSWID= 0
##$AUNMP= <proc_1d>
##$AZFE= 0.1
##$AZFW= 0.1
##$BCFW= 0
##$BC_mod= 0
##$BYTORDP= 0
##$COROFFS= 0
##$CY= 12.5
##$DATMOD= 1
##$DC= 0
##$DFILT= <>
##$DTYPP= 0
##$F1P= 14.0000005364418
##$F2P= -0.99999901652339
##$FCOR= 0.5
##$FTSIZE= 32768
##$FT_mod= 6
##$GAMMA= 0
##$GB= 0
##$INTBC= 1
##$INTSCL= 1
##$ISEN= 128
##$LB= 0.3
##$LEV0= 0
##$LPBIN= 0
##$MAXI= 10000
##$MC2= 0
##$MEAN= 0
##$ME_mod= 0
##$MI= 0
##$NCOEF= 0
##$NC_proc= -5
##$NLEV= 6
##$NOISF1= 0
##$NOISF2= 0
##$NSP= 0
##$NTH_PI= 0
##$NZP= 0
##$OFFSET= 16.522
##$PC= 1
##$PHC0= -87.73987
##$PHC1= 11.91674
##$PH_mod= 1
##$PKNL= yes
##$PPARMOD= 0
##$PSCAL= 4
##$PSIGN= 0
##$REVERSE= no
##$SF= 250.13
##$SI= 32768
##$SIGF1= 0
##$SIGF2= 0
##$SINO= 400
##$SIOLD= 32768
##$SREGLST= <1H.DMSO>
##$SSB= 0
##$STSI= 32768
##$STSR= 0
##$SW_p= 5175.98343685301
##$SYMM= 0
##$S_DEV= 0
##$TDeff= 65536
##$TDoff= 0
##$TI= <Analysis number 999999
Compound Code 99
Book Reference 9
Project Code 9>
##$TILT= no
##$TM1= 0
##$TM2= 0
##$TOPLEV= 0
##$USERP1= <user>
##$USERP2= <user>
##$USERP3= <user>
##$USERP4= <user>
##$USERP5= <user>
##$WDW= 1
##$XDIM= 32768
##$YMAX_p= 396655470
##$YMIN_p= -693893
$$ End of Bruker specific parameters
$$ ---------------------------------
##NTUPLES= NMR SPECTRUM
##VAR_NAME=  FREQUENCY,     SPECTRUM/REAL,   SPECTRUM/IMAG
##SYMBOL=    X,             R,               I
##VAR_TYPE=  INDEPENDENT,   DEPENDENT,       DEPENDENT
##VAR_FORM=  AFFN,          ASDF,            ASDF
##VAR_DIM=   32768,         32768,           32768
##UNITS=     HZ,            ARBITRARY UNITS, ARBITRARY UNITS
##FACTOR=    0.157963299565203, 1,           1
##FIRST=     4132.6476996994, 0,             0
##LAST=      -1043.33573715361, 0,           0
##MIN=       -1043.33573715361, -693893,     0
##MAX=       4132.6476996994, 396655470,     0
$$ Real data points
##PAGE= N=1
##DATA TABLE= (X++(R..R)), XYDATA
$$ [...]
24543A22676q2818O001n9726j03624Q2991J51060L0844N6818P5627J18388K447
$$ 122676 39858 45859 -13867 -117491 -34500 116560 147404 204222 279849 398237 400684
24532D00684j09538j29055m6727k41918j16274J64538J29783K201l7851J18390
$$ 400684 291146 162091 115364 -126554 -242828 -78290 51493 53694 15843 134233
24522A34233J64764K6636m0584j03343j63649j49197j66915K83090J62888M4560
$$ 134233 298997 325633 285049 181706 18057 -131140 -298055 -14965 147923 192483
24512A92483K3459r5655j01417L4926n7772m6670m6927N2221J21996J7555j27873
$$ 192483 215942 120287 18870 53796 -3976 -50646 -97573 -45352 76644 94199 -33674
24501c3674J08913M4947K31837L4145k14520O3543n5945j0896N3290j37870p4348
$$ -33674 75239 120186 352023 386168 171648 235191 179246 168350 221640 83770 9422
24490I422o5375M5351J9763k8147o0531M5455n6302J09349N0433k7430j1426q3983
$$ 9422 -55953 -10602 9161 -18986 -79517 -34062 -90364 18985 69418 41988 30562 -53421
24478e3421j6817P2644j13492j04894J49413J30612L962m021J34883q8890j26714
$$ -53421 -70238 2406 -111086 -215980 -66567 64045 68007 63986 198869 109979 -16735
24467a6735L942N8212m769n7233O0689k132k2009j5610j07407J36115J02504N3681
$$ -16735 -12793 45419 40650 -16583 44106 41974 19965 4355 -103052 33063 135567 189248
24455A89248p0298j59079j40096J61931J99496J31256o092p7631j33535o5566
$$ 189248 118950 -40129 -180225 -18294 181202 312458 306366 228735 95200 29634
24445B9634J8807R1821j2980j47167Q7669j0589j00371N4001J84443j07270p9542
$$ 29634 48441 140262 127282 -19885 67784 57195 -43176 10825 195268 87998 8456
24434H456l6369j15428M5189P2472j155n0176O6819J60930J41967j81529k58781
$$ 8456 -27913 -143341 -98152 -25680 -26835 -77011 -10192 150738 292705 111176 -147605
24423a47605q6037R2322J67200j51041p4922Q9585N3189J50245O0432m2566p2301
$$ -147605 -233642 -141320 25880 -125161 -200083 -110498 -57309 92936 153368 110802 38501
24412C8501J6062n065j75403m964J43381o2672J31976O5930j69609r9296L2647
$$ 38501 54563 49498 -125905 -130869 12512 -50160 81816 147746 -21863 -121159 -88512
24401h8512n1763k7583J79052k7376j71150P0066J0082J08708J04447J8325j3934
$$ -88512 -140275 -167858 11194 -16182 -187332 -117266 -107184 1524 105971 124296 110362
24390A10362N6720p8163j07698o357j42912q3560J64240J67887k5489J51892j8260
$$ 110362 167082 88919 -18779 -25136 -168048 -251608 -87368 80519 55030 206922 188662
24379A88662k00681j15934j35530p3334j5134K0561P7737O1175Q9122O1551l5241
$$ 188662 -12019 -127953 -263483 -336817 -351951 -331390 -253653 -192478 -103356 -41805 -77046
24368g7046j3001k3197R9673p4021q7772q6125J97744Q687M2901j2715R3984J72532
$$ -77046 -90047 -113244 -13571 -87592 -175364 -261489 -63745 -55058 -12157 -24872 69112 241644
24356B41644R4876r1580M4384J20025j06828j36407j43886j54892o4048N4518
$$ 241644 336520 244940 289324 409349 302521 166114 22228 -132664 -196712 -142194
24346a42194J24084j8975k5054j5229K716O0636P5967P2782k2173M8449j21445
$$ -142194 -18110 -37085 -62139 -77368 -74652 -14016 61951 134733 112560 161009 39564
24335C9564J6032k6664l9003N1322Q5417p7422j20521j23591L9579J45200J23617
$$ 39564 55596 28932 -10071 41251 126668 49246 -71275 -194866 -155287 -10087 113530
24324A13530J14139k16182L4764P4202m8065r3823O0910J6898n3225j17777J19680
$$ 113530 227669 11487 46251 120453 72388 -21435 39475 56373 3148 -114629 5051
24313E051n1777q8224j0140K2133K57760L705j43102q7228o6497J3167J39324
$$ 5051 -46726 -134950 -145090 -122957 134803 138508 -4594 -91822 -158319 -145152 -5828
24302e828M8525J2318J04378P7956O4525j65457j80930m7369j24609J39383J33859
$$ -5828 42697 55015 159393 237349 301874 136417 -44513 -91882 -216491 -77108 56751
24291E6751l1560r589J08223p296m5567o8882J26602J13514j55515P2444j17860
$$ 56751 25191 15602 123825 116529 70962 2080 128682 242196 86681 159125 41265
24280D1265p2544N3052o009j0546R6067J29758N7725J3862K261j49914k24994
$$ 41265 -31279 21773 15764 5218 101285 231043 288768 302630 304891 154977 -70017
24269g0017J72482K61991L316r8341j13108O0267J15859l7141j88999o2753M6945
$$ -70017 102465 364456 367772 269431 156323 216590 332449 295308 106309 43556 90501
24258I0501n0680J64844J55916P8875j79183j67709l3614J2549O1719N4991j43895
$$ 90501 39821 204665 360581 439456 260273 92564 58950 71499 133218 188209 44314
24247D4314q1035J30920J55582P1315j4772k4928J9633j7374o835j59042m5819
$$ 44314 -36721 94199 249781 321096 306324 281396 301029 283655 276820 117778 71959
24236G1959M5416p4767k50210j06442J74100K70054P9920K8834j20460K5498m3797
$$ 71959 117375 42608 -207602 -314044 -139944 130110 210030 238864 118404 143902 100105
24225A00105J15117K95184j10309k3233o549Q0452J82224q0435k05129o8988L9162
$$ 100105 215222 510406 400097 376864 370315 450767 632991 552556 347427 278439 317601
24214C17601N0308j03289m3291Q6206K5422r8160j74784r2047r4536J39930M645
$$ 317601 367909 264620 221329 307535 332957 234797 60013 -32034 -126570 13360 18005
24203A8005L0490j0174j1792M7315K98668J56277j34820j99474l3437r5130N2285
$$ 18005 48495 38321 26529 73844 372512 528789 393969 194495 161058 65928 118213
24192A18213m2955Q60J05717m9853j96319n3778Q3548N4125P8012J0517R4397
$$ 118213 75258 76118 181835 131982 -64337 -118115 -34567 19558 97570 108087 202484
24181B02484P747p5867j61470j01111q6254j8924K16214L80381M3167k55618L8808
$$ 202484 210231 134364 -27106 -128217 -214471 -233395 -17181 363200 406367 150749 189557
24170A89557K3267p8054j30344j5105K02289j2274K251j37586j81613o6542J07743
$$ 189557 212824 134770 4426 -10679 191610 179336 181587 44001 -137612 -204154 -96411
24159i6411J73354n3638J02225n5002j80495j48590J11548K81604n4916k13228
$$ -96411 76943 23305 125530 70528 -109967 -258557 -147009 134595 79679 -133549
24149a33549Q5889J1237m4044K6386k7393j0558Q1434n699P4556N1987l0640J9054
$$ -133549 -47660 -36423 -80467 -54081 -81474 -92032 -10598 -16297 58259 110246 79606 98660
24137I8660P7101r0077j43834j32394l3888j3436J79394P5689N521K8078J798
$$ 98660 175761 85684 -58150 -190544 -224432 -237868 -58474 17215 22736 50814 52612
24126E2612Q786J7000l5665O6738j07885P3314J67134j84759k17801J85537J57049
$$ 52612 61398 78398 42733 109471 1586 74900 242034 57275 -160526 25011 182060
24115A82060q0954K3142j41648j23976O6042J14095J59852j02775m218m5418l1206
$$ 182060 101106 124248 -17400 -141376 -75334 38761 198613 95838 91620 46202 14996
24104A4996P467Q1690J39602Q371j44059j18984Q4585N1040j94936o9673N9897
$$ 14996 22463 104153 243755 252126 108067 -10917 73668 124708 -70228 -139901 -80004
24093h0004J52657J45194L0636k20915j14638R751r58Q6K9736J505N5361L5550
$$ -80004 72653 217847 248483 27568 -87070 -77319 -78277 -78191 -48455 -46950 8411 43961
24081D3961k642L8585k0316j44214p3919L5117J34507n0919O5512J75597J48774
$$ 43961 41319 79904 59588 -84626 -158545 -123428 11079 -39840 25672 201269 350043
24070C50043j2024k49593q0047L4123J81621J31679O5312n8141j00224j9582p0246
$$ 350043 338019 88426 8379 42502 224123 355802 421114 362973 262749 243167 172921
24059A72921j41167J16442R7433m390j86962j44911J25628M7180l84j38941j5947
$$ 172921 31754 148196 245629 241239 54277 -90634 34994 82174 81790 -57151 -73098
24048g3098R9475J00698J27255j06337j89911M398J10449J37209m491k5091l5448
$$ -73098 26377 127075 254330 147993 -41918 -37520 72929 210138 205647 180556 145108
24037A45108J76933L6086j96304n7004j23715j1047L1660N4743P6466j8125n9276
$$ 145108 322041 358127 161823 104819 -18896 -29943 1717 56460 132926 114801 55525
24026E5525j28203j03382R2361J46440R7707q3589m1511P2504O1583j90922j47167
$$ 55525 -72678 -176060 -83699 62741 160448 76859 35348 107852 169435 -21487 -168654
24015a68654O9018Q9884J17007K01494N135j27279l6550j3244j16848j59955l8246
$$ -168654 -99636 -9752 107255 308749 313884 186605 150055 136811 19963 -139992 -178238
24004a78238K02169J63203l5092J63012j3649j70334j03716p6535q2718M2471
$$ -178238 23931 187134 152042 315054 301405 131071 27355 -49180 -131898 -89427
23994h9427J52738j3165j5475J7152j06457q934K20618N2876j42140j9085j10281
$$ -89427 63311 50146 34671 51823 -54634 -63568 157050 209926 67786 48701 -61580
23983f1580l7825N7160j6484N7280K0178J4329j1994J81863Q604R576K0436l7340
$$ -61580 -99405 -42245 -58729 -1449 18729 33058 21064 202927 211531 221107 241543 204203
23971B04203K541j2419o7224j05252P6716K21127J2034l6109j59056J25588J31791
$$ 204203 206744 194325 127101 21849 98565 319692 331726 295617 136561 262149 393940
23960C93940L5316q9259j38884j28608M4747J11185j61084p6361k555q7004r9577
$$ 393940 429256 339997 201113 72505 117252 228437 67353 -9008 -11563 -98567 -198144
23949a98144J34936N0523o2210q1021M2463M6958k0312R0468N5469J32384L7682
$$ -198144 -63208 -12685 -74895 -155916 -113453 -66495 -86807 3661 59130 191514 229196
23938B29196n665p8654q1670k9870j32040j8050K9213r6555M0020J59418J6161
$$ 229196 223531 144877 63207 33337 -98703 -116753 -87540 -184095 -144075 15343 31504
23927C1504q9140j32172o1937P8135K6087L6608j4556n65q5765J00402J89735
$$ 31504 -57636 -189808 -251745 -173610 -147523 -110915 -125471 -126036 -211801 -111399 78336
23916G8336O8958j72058q9340N322K7159L6299M2129J53497K07051K7889L6143
$$ 78336 147294 -24764 -114104 -108782 -81623 -45324 -3195 150302 357353 385242 421385
23905D21385j36190n1482L0588j95913j04665P0111L8870l3077J9312M0992j60062
$$ 421385 285195 233713 264301 68388 -36277 33834 72704 39627 58939 99931 -60131
23894f0131P3247Q1002k1372K50971K18902p0530n1411j00056j6663j62746J8579
$$ -60131 13116 94118 72746 323717 542619 472089 420678 320622 303959 141213 159792
23883A59792k1332P4660m0740r9964L7942m2923q4248j32906j33285N2697J71387
$$ 159792 138460 213120 172380 72416 110358 67435 -16813 -149719 -283004 -230307 -58920
23872e8920J81163J9602L4735P3920p4733r7659n9048K6452P7064P2446r7449
$$ -58920 122243 141845 176580 250500 175767 78108 19060 45512 122576 195022 97573
23861I7573l7414R6508m6001J7405J9110k6583j6664J12936O1933J7189j04999
$$ 97573 60159 156667 110666 128071 147181 120598 103934 216870 278803 295992 190993
23850A90993r0065K3496j29690J8228P6078J86798Q6186l0313o8198j35262j7347
$$ 190993 100928 124424 -5266 12962 89040 275838 362024 331711 263513 128251 110904
23839A10904l9043K4050r3955p3142P3411J3002R8573J26124K9271m3388j03038
$$ 110904 71861 95911 1956 -71186 2225 15227 113800 239924 269195 225807 122769
23828A22769L0263j7088o8122r7115k4840O1708J63189l806q9010m7762N0720
$$ 122769 153032 135944 67822 -29293 -54133 7575 170764 166958 77948 30186 80906
23817H0906q7685j83475N3244K3144N0437J144l4435J06832J17274l9631R6238
$$ 80906 -6779 -190254 -137010 -113866 -63429 -62285 -96720 10112 127386 87755 183993
23806A83993m3664l144L6435q0258o3143m0651m2119J26989J30285l7308p7282
$$ 183993 140329 137185 173620 93362 30219 -10432 -52551 74438 204723 167415 90133
23795I0133K3863N5830o3883j2439Q4479J254n0280m2431j06241j53154J11843
$$ 90133 113996 169826 105943 93504 177983 179237 128957 86526 -19715 -172869 -61026
23784f1026J31383j0667j7768p6138r9456J06566k0380l9769J08667J8856M021
$$ -61026 70357 59690 41922 -34216 -133672 -27106 -47486 -87255 21412 40268 44289
23773D4289K6659M8205o2467o842J29972J00745o3786j10579M614L5508L7733
$$ 44289 70948 119153 56686 49844 179816 280561 216775 106196 110810 146318 184051
23762A84051J83138l5439j23198J13054L6177M7192r3883j24145O5678j87763
$$ 184051 367189 331750 208552 321606 357783 404975 311092 186947 252625 64862
23752F4862r5137o8255P6683J58014J5342o4001o7241O0275O8251O1237l8191
$$ 64862 -30275 -98530 -21847 136167 151509 87508 20267 80542 148793 210030 171839
23741A71839l2715J29230J3382r9729n9178K4041n0130j9098R4216N5652M1957
$$ 171839 139124 268354 281736 182007 122829 146870 96740 77642 171858 227510 269467
23730B69467p7151q2925K6998Q2870j78380J478J57198M4707j81065j76117j15597
$$ 269467 192316 109391 136389 219259 40879 42357 199555 244262 63197 -112920 -228517
23719b28517m5380J90570J59564K6347J9422N5579k0619J19419p4671n2486L0861
$$ -228517 -273897 -83327 76237 102584 122006 177585 156966 276385 201714 149228 180089
23708A80089K69335k33034k00426N6059P5617L4477O8536L0334q5596j71563K2408
$$ 180089 449424 216390 15964 72023 147640 182117 250653 280987 195391 23828 46236
23697D6236J30244J9077K1168J7492O1363M4086q7409P4373M3177j39376m1037
$$ 46236 176480 195557 216725 234217 295580 339666 252257 326630 369807 230431 189394
23686A89394K17791J29969j11283l00856j61757M2223J13951M7952K5737m8389
$$ 189394 407185 537154 425871 125015 -36742 5481 119432 167384 193121 144732
23676A44732j4027l0465o8679M1090P4302Q4419j24092k4717q3772k00134k0730
$$ 144732 130705 100240 31561 72651 146953 231372 107280 82563 -1209 -201343 -222073
23665b22073K30852M9379o3975J9523P620k2995P2461N197l5929m2843k9835n8526
$$ -222073 8779 58158 -5817 13706 21326 -1669 70792 75989 40060 -2783 -32618 -91144
23653i1144j8742N1241j1894J5022J92319J12463k4648Q512n0405P4075J29940
$$ -91144 -109886 -58645 -70539 -55517 136802 249265 224617 233129 182724 256799 386739
23642C86739n4866l0139k5956j80488j44585L7744J10768R2810j49059k16046
$$ 386739 331873 301734 275778 95290 -49295 -11551 99217 192027 42968 -173078
23632a73078J29104K33160J56014o0530m4369r692Q8006n5526j20796m210K6172
$$ -173078 -43974 189186 345200 284670 240301 230609 318615 263089 142293 138083 164255
23621A64255O0250m3439p0167m5569J8275l4885j6496K078q2883O4919K84336
$$ 164255 224505 181066 110899 65330 83605 48720 32224 34302 -48581 16338 300674
23610C00674p5355m0972Q2200j15347n453J02154M8914j1725j31664k3863J30987
$$ 300674 225319 184347 266547 151200 145747 247901 296815 285090 153426 129563 260550
23599B60550J36480Q636j00554j24842J41189N7489q5405J20126j03490j14900
$$ 260550 397030 405666 305112 180270 321459 378948 293543 413669 310179 195279
23589A95279J37427J12487j58635q5212K7168M9712q9039N5315k7490k7007q611
$$ 195279 332706 445193 286558 201346 228514 278226 189187 244502 217012 190005 181394
23578A81394J10593j83510o4062k0541k15988J15559K00635J11597m1118P1220
$$ 181394 291987 108477 44415 23874 -192114 -76555 124080 235677 194559 265779
23568B65779l923M2072r9030M0235J9645k1700o4964J10794o8672J06099r8013
$$ 265779 261856 303928 204898 245133 264778 243078 178114 288908 220236 326335 228322
23557B28322k24136J5085J64039Q2174R87o1724r4547J62167J75266O2592j1234
$$ 228322 4186 19271 183310 265484 266471 204747 110200 272367 447633 510225 498991
23546D98991O2726j05197m7997j40999M486o0942p8975j43550Q5341r3209o0636
$$ 498991 561717 456520 408523 267524 272010 211068 132093 -11457 73884 -19325 -79961
23535g9961J0406J14426R1800l8051p4113O349n9389P516J25763P1725n3293r443
$$ -79961 -69555 44871 136671 98620 24507 30856 -28533 -21017 104746 176471 123178 113735
23523A13735r2953j06399J05485K0432J63535L744k02251p9380m0194J24246J26089
$$ 113735 20782 -85617 19868 40300 203835 207579 5328 -74052 -114246 10000 136089
23512A36089l8558j06780l9470p4975J7623J483J6800J63624N4636n7954j40804
$$ 136089 97531 -9249 -48719 -123694 -106071 -104588 -87788 75836 130472 72518 -68286
23501f8286k63049j087J40165K38086K47622J7470l4827j29054n5574J24941l6411
$$ -68286 -331335 -332422 -192257 45829 293451 310921 276094 147040 91466 216407 179996
23490A79996m4700j44627M1255N7215j75642n3727J72389J4032J1174P197L91460
$$ 179996 135296 -9331 31924 89139 -86503 -140230 32159 46191 57365 64562 456022
23479D56022N0028k5258k2323k04859j39852m7087J01991N182j37612j38509J27246
$$ 456022 506050 480792 458469 253610 113758 66671 168662 173844 36232 -102277 24969
23468B4969J94240J11595p1454j17695K4503J06878r6170O4399J3292j34950j01024
$$ 24969 219209 330804 259350 141655 166158 273036 176866 241265 254557 119607 18583
23457A8583K0023J62691J93454Q8682l2286l718j50752k9264J715k7465J43167
$$ 18583 38606 201297 394751 483433 451147 447429 296677 267413 269128 241663 384830
23446C84830P5614Q8214K7907n824p931r8269l8830K3046m1612P3980j96100q3057
$$ 384830 460444 548658 576565 570741 562810 464541 425711 448757 407145 481125 285025 201968
23434B01968j6203q1652O3410o4293k3860r1820l0599J12463l6285J53638J50860
$$ 201968 185765 104113 167523 103230 79370 -12450 -43049 69414 33129 186767 337627
23423C37627j77332m3391J26496J1801n3514l2997m2078J31592Q6261j50121j50309
$$ 337627 160295 116904 243400 255201 201687 168690 126612 258204 344465 194344 44035
23412D4035q296l2399m9019J215K18233N5044j16866n5319J26303r9906k0628
$$ 44035 35739 3340 -45679 -44464 173769 228813 111947 56628 182931 83025 62397
23401F2397m5229O5973J55096N3956k7033j70157j41551M8624J02283M3381J2441
$$ 62397 17168 83141 238237 292193 265160 95003 -46548 2076 104359 147740 160181
23390A60181j26821q8902J619J41378J67113Q8272n4394K7075q8798l7073j12816
$$ 160181 33360 -55542 -53923 87455 254568 342840 288446 315521 226723 189650 76834
23379G6834J3803P5331n4391j41988o9046K07951N0686j77117J02739K40532M67
$$ 76834 90637 165968 111577 -30411 -99457 108494 159180 -17937 84802 325334 325801
23368C25801K8128j16556J6409M8101q1206K7325R3262k19165j22114p4506M4501
$$ 325801 353929 237373 253782 301883 220677 248002 341264 122099 -15 -74521 -30020
23357c0020J52350r1118q0930j4704K105p4083J11454K41323n3160n6474m2658
$$ -30020 122330 31212 -49718 -64422 -62317 -136400 -24946 216377 163217 106743 64085
23346F4085M7574Q166m0526J5410l4572o829J18446M6608r3075p2247j24419L8806
$$ 64085 111659 119825 79299 94709 60137 53308 171754 218362 125287 53040 -71379 -32573
23334c2573J25677P0357o3815R1785P6071q0073J14465J830Q7860J9897J01318
$$ -32573 93104 163461 99646 191431 267502 187429 301894 303724 391584 411481 512799
23323E12799O4810j20480j76329R3895l7576j47423p9497N2475q7220n9748j12111
$$ 512799 577609 457129 280800 374695 337119 189696 110199 162674 75454 15706 -96405
23312i6405M7370J02191M526J76907M3106n9932p2347P9622N2765m7378o1236
$$ -96405 -49035 53156 57682 234589 277695 217763 145416 225038 277803 230425 169189
23301A69189L8267O4780p7941j39814r7189m4883K16862Q1081k8772J06969K17895
$$ 169189 207456 272236 194295 54481 -42708 -87591 129271 210352 181580 288549 506444
23290E06444j14744r5282M7352j11681j28727m6105M2028p4048l9239J10241N5840
$$ 506444 391700 296418 343770 232089 103362 57257 99285 25237 -14002 96239 152079
23279A52079J0520J05188l6393j29327L6493P9823j51363k3816K5924N9844J25765
$$ 152079 162599 267787 231394 102067 138560 218383 67020 43204 69128 128972 254737
23268B54737L1439j5592J16856l6749q5939q2850o1063K3555J18448O0463M1582
$$ 254737 286176 270584 387440 350691 264752 181902 120839 144394 262842 323305 364887
23257C64887M2924L2379j75334r9737l5072N1797J20886R9357n3662K109p3210
$$ 364887 407811 440190 264856 165119 130047 181844 302730 402087 348425 350534 277324
23246B77324n8349R51J03402O0913j06288m0754J50082J13695n7912m4973L6072
$$ 277324 218975 219926 323328 384241 277953 237199 387281 500976 443064 398091 434163
23235D34163p0015L5540j27445j36719R0637o877m1858N7731P7225o5103Q9006
$$ 434163 364148 399688 272243 135524 226161 219284 177426 235157 312382 247279 336285
23224C36285q2278M555J42353m2749o2013j04702o7491R0410L5340O5279j17000
$$ 336285 254007 258562 400915 358166 296153 191451 123960 214370 249710 314989 197989
23213A97989j40960J00404m1446o1563Q0519K2192J14500J95382j10912j23290
$$ 197989 57029 157433 115987 54424 134943 157135 271635 467017 356105 232815
23203B32815k6571j4409J7976m0640n5367l7475O6354J38651j27972k17066J0886
$$ 232815 206244 191835 209811 169171 113804 76329 142683 281334 153362 -63704 -52818
23192e2818j0963K99659J65207k9649O9400j607l1239N1721m9753R0468p0217
$$ -52818 -63781 235878 401085 371436 440836 439229 407990 459711 409958 500426 430209
23181D30209j6336j26696k6371M654n1657n7838q228J72536o7418j4406O3845
$$ 430209 413873 287177 260806 265460 213803 155965 147737 320273 252855 238449 302294
23170C02294k6493P952j6953o7046j26023m614L3328N8134J58819l7900l7606
$$ 302294 275801 283753 266800 199754 73731 69117 102445 160579 319398 281498 243892
23159B43892O0895L1795n0412q9026j05586J28367J31326J7862P5911J847J2057
$$ 243892 304787 336582 286170 197144 91558 219925 351251 369113 445024 446871 458928
23148D58928j02813j75914k2015R9138j10006J4649q2506p7611j13964j65826
$$ 458928 356115 180201 158186 257324 147318 161967 79461 1850 -112114 -277940
23138b77940J31496J72841K28432N3435m3947l6621P4695j0599o7898R9853J59825
$$ -277940 -146444 26397 254829 308264 264317 227696 302391 291792 223894 323747 483572
23127D83572P999p0694j8320j068p9025n4579M1746l1833l0370r4442n2261M4351
$$ 483572 491571 420877 402557 401489 322464 267885 309631 277798 247428 152986 100725 145076
23115A45076P0434M952m4038P5040r9343q6849J01767K26733P9574j07604j39791
$$ 145076 215510 220462 176424 251464 152121 65272 167039 393772 473346 365742 225951
23104B25951n4911J06179J57146n1588m2078O7928n22p7132O9113j45511n0239
$$ 225951 171040 277219 434365 382777 340699 408627 408105 330973 400086 254575 204336
23093B04336J63860J47869j05049l9315J44578N7612j9318Q3776k45084o4292
$$ 204336 368196 516065 411016 371701 516279 573891 554573 638349 393265 328973
23083C28973P089j05189j06262j05849J40327K62632J3902j52040Q0653n4580
$$ 328973 336062 230873 124611 18762 159089 421721 435623 283583 364236 309656
23073C09656r5111J068J58729J16653j56089n7092L8498j00571k4134P9235L1634
$$ 309656 214545 215613 374342 490995 334906 277814 316312 215741 191607 270842 302476
23062C02476p9034m4102J11032q953j28127J05232P6467J31836P1656k15334k63413
$$ 302476 223442 179340 290372 281419 153292 258524 334991 466827 538483 323149 59736
23051E9736M3970J21294J16327j7186q8088Q4569J8200m5458j46797j65442j41737
$$ 59736 103706 225000 341327 324141 236053 320622 338822 293364 146567 -18875 -160612
23040a60612K02957J03662O9637J55361J23022o4818j18657m466o5173J6572J99195
$$ -160612 42345 146007 215644 371005 494027 429209 310552 306086 240913 257485 456680
23029D56680m5355p6969J3019o6980j16306J08511J62915q3495k32855j09499
$$ 456680 411325 334356 347375 280395 164089 272600 435515 352020 119165 9666
23019I666J19902L3746Q0967k984k14880l8043J32957J29893J27540R4466J0425
$$ 9666 129568 163314 244281 241297 26417 -11626 121331 251224 378764 473230 483655
23008D83655j65565N7946O4906J30541k6905r8073Q984R9745M7573m02564j81744
$$ 483655 318090 376036 440942 571483 544578 446505 455489 555234 602807 200243 18499
22997A8499K10459N0054M7107j09370k6891J84136J96814K0424q1503M0173j33991
$$ 18499 228958 279012 326119 216749 189858 373994 570808 591232 509729 549902 415911
22986D15911j36790j1028J25655J71945J18028m2274J724K5187k47172j31124
$$ 415911 279121 268093 393748 565693 683721 641447 643171 668358 421186 290062
22976B90062K454l019K3537K52468m3273q0936M4912l362m9607r1130m4006j15619
$$ 290062 292516 289497 313034 565502 522229 441293 486205 482843 433236 342106 298100 182481
22964A82481M6546O7301j65497n6894J03112R7127K3864J02597N2270Q7294o7749
$$ 182481 229027 296328 130831 73937 177049 274176 298040 400637 452907 540201 472452
22953D72452j35611o6980j2505J48928J90991j5576r6297j30298R8863q2924m9581
$$ 472452 336841 269861 257356 406284 597275 581699 485402 355104 453967 371043 321462
22942C21462K37729P7982j45417j05021q0424j17386O7603N3949N4781j4511R3654
$$ 321462 559191 637173 491756 386735 306311 188925 256528 310477 365258 350747 444401
22931D44401P7319r6215l5469J02607J560o5967K1198j65100n3627J24528J51554
$$ 444401 521720 425505 390036 492643 494203 428236 449434 284334 230707 355235 506789
22920E06789r0752j19361l0675J41649L5423k8241o3289k7582R4307J36392J3473
$$ 506789 416037 296676 266001 407650 443073 414832 351543 323961 418268 554660 568133
22909E68133o9730j62404j8769J5991N9800M5246k00880j09978R0710M4990L8737
$$ 568133 498403 335999 317230 333221 393021 438267 237387 127409 218119 263109 301846
22898C01846n3378j31527J16517J00454Q3206K6588o3669K68251o5825j33843
$$ 301846 248468 116941 233458 333912 417118 443706 380037 648288 582463 448620
22888D48620r7327j02904O3734r4072j44143j49246K00834K10940K7762J06546
$$ 448620 351293 248389 312123 218051 73908 -75338 125496 336436 364198 470744
22878D70744R4679R5555L247K2544o6246m4991l835J64540l2061K0402R0044r5835
$$ 470744 565423 660978 664225 686769 620523 575532 571697 736237 704176 724578 814622 718787
22866G18787j72287j08646J290J3171L6681M4461n4004j47584J35516N4128j7480
$$ 718787 546500 437854 439144 452315 488996 533457 479453 331869 467385 521513 504033
22855E04033L5157k2524M1303j09789o3758J93519J01623j25517j25657o8606
$$ 504033 539190 516666 557969 448180 384422 577941 679564 554047 428390 359784
22845C59784K82053R5792j46960j00533R7285j24845l906l8448r391m1639k9752
$$ 359784 641837 737629 590669 490136 587421 462576 458670 420222 410831 369192 339440
22834C39440j21831J68867J63023j15634K9412J89523j57121k7673j19181k66426
$$ 339440 217609 386476 549499 433865 463277 652800 495679 468006 348825 82399
22824H2399m9501K8918R9610O20l9649J51857R4821o3449m7180k1954J32267L3062
$$ 82399 32898 61816 161426 162046 122397 274254 369075 305626 258446 236492 368759 401821
22812D01821M6931O3836k6623j08643L1241J4230n859O3476l6118k0570J56259
$$ 401821 448752 512588 485965 377322 408563 422793 416934 480410 444292 423722 579981
22801E79981n9391P864J7530j31088j28664J04311j9678p9504K15443J94391j19395
$$ 579981 520590 528454 545984 414896 286232 390543 370865 291361 506804 701195 581800
22790E81800o1402j6738l4735N1074K9130K6723Q486J1697M6413k5495j5460j3457
$$ 581800 520398 503660 468925 519999 549129 575852 584338 596035 642448 616953 601493 588036
22778E88036O0028n0555j5418r5558K9285o580l4799q5415l0188P6439J0822j1296
$$ 588036 648064 597509 582091 486533 515818 509238 474439 389024 358836 435275 446097 434801
22766D34801J34496L4913j22919M9669l7205j07317R836j34224K7084j3967J05045
$$ 434801 569297 604210 481291 530960 493755 386438 396274 262050 289134 275167 380212
22755C80212O061P4472J73659n9938j6112J736m8608j63090k5875j28808j16611
$$ 380212 386273 460745 634404 574466 558354 560090 511482 348392 322517 193709 77098
22744G7098O7276K29413M4454j18790j67789J26270J48632j6133k732l1721j38354
$$ 77098 144374 373787 418241 299451 131662 257932 406564 390431 387699 355978 217624
22733B17624R4086J48373o2493P3404J04515J57840l14p9537q4874J18982n5p6943
$$ 217624 311710 460083 397590 470994 575509 733349 733035 653498 568624 687606 687551 610608
22721F10608j42517j09152J05662K9492J50741R6815O0734M4357j29753k65947
$$ 610608 468091 358939 464601 494093 644834 741649 802383 846740 716987 451040
22711D51040P2983O9997r6716N5688j02551N7340J18104M9760r6874k03691j74945
$$ 451040 524023 594020 497304 552992 450441 507781 625885 675645 578771 375080 200135
22700B00135Q923R9529J04415j10474L5064R9777J2466K5247J47483J05517q498
$$ 200135 209058 308587 413002 302528 337592 437369 449835 475082 622565 728082 719584
22689G19584R734L115r1891o6604m6044m671J3258R7269L5891M4261j7005r4116
$$ 719584 729318 732433 640542 573938 527894 523223 536481 633750 669641 713902 696897 602781
22677F02781J3198o4645j3217J38981Q6412L3961M6013m7520q8016k26034q8257
$$ 602781 615979 551334 538117 677098 763510 797471 843484 795964 707948 481914 393657
22666C93657j17480R0057K26754O4776Q4651K719j08250q8837M0041l9620M024
$$ 393657 276177 366234 592988 657764 742415 745134 636884 548047 588088 548468 552492
22655E52492J887j44761N302J00369m2318r7814j0371K19975J27262Q1320P0604
$$ 552492 554379 409618 414920 515289 472971 375157 364786 584761 712023 793343 863947
22644H63947O9034j58485l26352L8113j0404j18420J07120K75344J61252p2903
$$ 863947 932981 774496 448144 486257 475853 357433 464553 739897 901149 828246
22634H28246j59548L9859N86j58405q3116J39606M4825n8282l5338o581j10940
$$ 828246 668698 708557 709143 550738 467622 607228 652053 593771 558433 551852 440912
22623D40912N9827R9097P5073J3281l9145j25238K6372O0262Q0473J53657r1013
$$ 440912 500739 599836 674909 688190 649045 523807 550179 610441 690914 844571 753558
22612G53558j56692Q7758L6480o4196N0787R1415n9331j53417J37383n1316o5227
$$ 753558 596866 684624 721104 656908 707695 799110 739779 586362 723745 672429 607202
22601F07202k1978P8134M4422q8045M6656q4820j96759N8793J49649Q6553P0381
$$ 607202 585224 663358 707780 619735 666391 581571 384812 443605 593254 679807 750188
22590G50188j27514M0582J54187m421K954l6843k9316q6158K7050M8505j40031
$$ 750188 622674 663256 817443 813022 815976 779133 749817 663659 690709 739214 599183
22579E99183j67314Q111J05440J43376N6832o5030J4820Q1573M5356K7702O685
$$ 599183 431869 439980 545420 688796 745628 680598 695418 776991 822347 850049 856734
22568H56734j40817k20789k0739J75716K3186m9380N082k6977j4893J99199K5975
$$ 856734 715917 495128 474389 650105 673291 623911 628993 602016 587123 786322 812297
22557H12297j0556o1884J12059L4357L7877J10580k3787j48354j84423K2898R0776
$$ 812297 801741 739857 851916 886273 924150 1034730 1010943 862589 678166 701064 791840
22546G91840l268J02578p0427j25036r1796k3217j1677j48441J80297K06546O2126
$$ 791840 788572 891150 820723 695687 603891 580674 568997 420556 600853 807399 869525
22535H69525O5142j46825l2340j5513n518K06307j0480N46M4857p0899k3099j27783
$$ 869525 934667 787842 755502 739989 734471 940778 930298 930844 975701 904802 881703 753920
22523G53920k5755J31202M2854O2415j87624j28291P6842J9959q8239K2515J13292
$$ 753920 728165 859367 902221 964636 777012 648721 725563 745522 657283 679798 793090
22512G93090j66202n4141K41898O8352J25890P7983j63803j00455j68646j8739
$$ 793090 626888 572747 814645 882997 1008887 1086870 923067 822612 653966 635227
22502F35227J18014J03136Q489n3167n238Q6089j34175p9265J26714o619P5712
$$ 635227 753241 856377 864866 811699 806461 892550 758375 679110 805824 799205 874917
22491H74917j11125k00979J2861R0873M0569k0616j3430J6008O8904J56332R248
$$ 874917 763792 562813 575674 666547 707116 686500 673070 689078 757982 914314 923562
22480I23562l7723o3968j51190L8577j0149N4021k6873n1130N229j14346m3973
$$ 923562 885839 821871 670681 709258 699109 753130 726257 675127 680356 566010 522037
22469E22037J5346k5305J39649J62811P062P2037n0212q9097J63190J3671J38196
$$ 522037 537383 512078 651727 814538 821600 893637 843425 754328 917518 931189 1069385
22458A069385k4414j2622j27662p3998n6901O2899J00404O4900l9722j61850k5608
$$ 1069385 1044971 1032349 904687 830689 773788 836687 937091 1001991 962269 800419 774811
22447G74811J90213N8793O3666M9914q2936j00266m1674R7497j61284r9246K19648
$$ 774811 965024 1023817 1087483 1137397 1054461 954195 912521 1010018 848734 749488 969136
22436I69136Q3014m673J3383O2145J1778j88167Q2898p6749J7922J79548N0981
$$ 969136 1052150 1047477 1060860 1123005 1134783 946616 1029514 952765 970687 1150235 1201216
22425A201216N4752j58511k95157j4326J04568O2463J41519R2840j05376l23737
$$ 1201216 1255968 1097457 802300 787974 892542 955005 1096524 1189364 1083988 760251
22415G60251j01705J65401N5714J95537J05262j81644n4617J2927Q705L5594J77393
$$ 760251 658546 823947 879661 1075198 1180460 998816 944199 957126 965831 1001425 1178818
22404A178818j17764j21014j29065J29605P8971m713m3141j22890n3834K43208
$$ 1178818 1061054 940040 810975 940580 1019551 1014838 971697 848807 794973 1038181
22394A038181R6488J27875j5883m4693Q7036p3918l8594P306o9839q3949r8665
$$ 1038181 1134669 1262544 1246661 1201968 1289004 1215086 1176492 1183798 1113959 1030010 931345
22383I31345j68821k8810J04310J63614J31427J95745j9965m3027j16434m9922
$$ 931345 762524 733714 838024 1001638 1133065 1328810 1308845 1265818 1149384 1099462
22373A099462J36762p5705k70713p0768J66609J1284j7554m8356P6305m814j47511
$$ 1099462 1236224 1160519 889806 819038 985647 996931 979377 931021 1007326 1002512 855001
22362H55001j31205J47780L6462j08270Q0398J34206J83994J98485Q4217o5757
$$ 855001 723796 871576 908038 799768 880166 1014372 1198366 1396851 1481068 1415311
22352A415311j05727j31810j68773l3974J93948L2416j45639p1p8778O1956R8448
$$ 1415311 1309584 1177774 1009001 975027 1168975 1201391 1055752 1055681 976903 1038859 1137307
22341A137307P4240j19979p4020J889L5597J36050J9230J0611J31931L0730j85271
$$ 1137307 1211547 1091568 1017548 1019437 1055034 1191084 1210314 1220925 1352856 1383586 1198315
22330A198315j08604p0016J07726j24379k1802l5990Q3190K9244P1442P3402k03332
$$ 1198315 1089711 1019695 1127421 1003042 981240 945250 1028440 1057684 1129126 1202528 999196
22319I99196l2854P6795k6156q2882J18203R2188J23275N2048l6705j99731l3969
$$ 999196 966342 1043137 1016981 934099 1052302 1144490 1267765 1319813 1283108 1083377 1049408
22308A049408J74936R3764N3269j01630q5035Q5265Q4808J21333m8190l772L7158
$$ 1049408 1224344 1318108 1371377 1269747 1184712 1269977 1354785 1476118 1427928 1424156 1461314
22297A461314k26785j28512Q8031J44862P1594P9152j31026j76962N3951J28648
$$ 1461314 1234529 1106017 1194048 1338910 1410504 1489656 1358630 1181668 1235619 1364267
22287A364267P5930P0018R4361j58137j44389J2812m4830L5334r3169J31586J02425
$$ 1364267 1440197 1510215 1604576 1446439 1302050 1314862 1270032 1305366 1212197 1343783 1446208
22276A446208M6018L1749o98j17534j89881o0972k8285N631L7350O5659L1390
$$ 1446208 1492226 1523975 1523277 1405743 1215862 1154890 1126605 1132236 1169586 1235245 1266635
22265A266635R516K9520J00933k7519q966n6665j05915N7355p5900N7069l9978
$$ 1266635 1276151 1305671 1406604 1379085 1370119 1313454 1207539 1264894 1188994 1246063 1206085
22254A206085P2888J05328j15462j12704N1339J67942n37P8216l4139l9829J78999
$$ 1206085 1278973 1384301 1268839 1156135 1207474 1375416 1374879 1453095 1418956 1379127 1558126
22243A558126J89669j23176j3173p3621k3257j58211k6536l7313J20445l5551
$$ 1558126 1747795 1624619 1611446 1537825 1514568 1356357 1329821 1292508 1412953 1377402
22233A377402l07M3949m9562j47403m3852r215R6470j5267j1050K23076o4332
$$ 1377402 1377095 1421044 1371482 1224079 1180227 1171012 1267482 1252215 1241165 1464241 1399909
22222A399909M7169O1716m9733N3489J46920j26324j68358M9811O356N8414O7647
$$ 1399909 1447078 1508794 1459061 1512550 1659470 1533146 1364788 1414599 1420955 1479369 1547016
22211A547016k2896O5762j52640l19493r4445N4036J75817M5109Q3593J32228
$$ 1547016 1524120 1589882 1437242 1117749 1023304 1077340 1253157 1298266 1381859 1514087
22201A514087L688P5621K1029j3476k7168j04577j75641P3436Q9452L0463o1446
$$ 1514087 1517775 1593396 1614425 1600949 1573781 1469204 1293563 1366999 1456451 1486914 1425468
22190A425468J6187j60186J16708J02642J48647J83008p3100j86251m1605q312
$$ 1425468 1441655 1281469 1398177 1500819 1649466 1832474 1759374 1573123 1531518 1523206
22180A523206P3J10180O7575o4642j13204j75649J00950P5339R0394M7169J7759
$$ 1523206 1523279 1633459 1701034 1636392 1523188 1347539 1448489 1523828 1614222 1661391 1679150
22169A679150J34626K07991j55072k00385J22390J13752J09243R3718l0787n8233
$$ 1679150 1813776 2021767 1866695 1666310 1788700 1902452 2011695 2105413 2074626 2016393
22159B016393o6026j29986j04724m7264K1860P1470J9077P988Q3958J06403l9801
$$ 2016393 1950367 1820381 1715657 1668393 1690253 1761723 1780800 1788788 1872746 1979149 1939348
22148A939348q0578N4617o2610j42420n4697R9169R0707M0701n7828O987J2019
$$ 1939348 1858770 1913387 1850777 1708357 1653660 1752829 1843536 1884237 1826409 1833396 1845415
22137A845415M2324r4290O1475m5913j18306J42050p7152J53723N8088N708M8394
$$ 1845415 1887739 1793449 1854924 1809011 1690705 1832755 1755603 1909326 1967414 1973122 2021516
22126B021516m3696j70671j01170Q4068K14164P4144k9439k61334o0221J27008
$$ 2021516 1977820 1807149 1705979 1790047 2004211 2078355 2048916 1787582 1727361 1854369
22116A854369J24059K2072K7065Q644o0321k5999r0067k1056J25358J16991Q6905
$$ 1854369 1978428 2000500 2027565 2036209 1975888 1949889 1859822 1838766 1964124 2081115 2168020
22105B168020j35635J81965J19675k6877r5645M1060j7404q1466m0115q7356j07419
$$ 2168020 2032385 2214350 2334025 2307148 2211503 2252563 2235159 2153693 2113578 2026222 1918803
22094A918803o1858L6013j9305J33748N64j07705L5825R1755o8566J87152L3391
$$ 1918803 1856945 1892958 1873653 2007401 2007965 1900260 1936085 2027840 1959274 2146426 2179817
22083B179817q5383Q3338K7499j09276j12382J33952J86221N8130J4059j48311
$$ 2179817 2094434 2177772 2205271 2095995 1983613 2117565 2303786 2361916 2375975 2227664
22073B227664j78702J75189J54092o1948l9591J9460N5119m1081N9820J07374
$$ 2227664 2048962 2224151 2378243 2316295 2276704 2296164 2351283 2310202 2370022 2477396
22063B477396J65882k4147j70041p2501k9073j54475R2508Q061q7416J9031R5415
$$ 2477396 2643278 2619131 2449090 2376589 2347516 2193041 2285549 2293610 2206194 2225225 2320640
22052B320640J10974l9359R6551N2788J4720j75487j38788L8802J15683K5512
$$ 2320640 2431614 2392255 2488806 2541594 2556314 2380827 2242039 2280841 2396524 2422036
22042B422036k0635J2072n9113n3806J98305K34031m206j20321P5023o5372l0189
$$ 2422036 2401401 2413473 2354360 2300554 2498859 2732890 2728684 2608363 2683386 2618014 2587825
22031B587825K15653Q7504j00357k20299J8602j1882l0259Q3889J01148R3233
$$ 2587825 2803478 2890982 2790625 2570326 2588928 2577046 2546787 2630676 2731824 2825057
22021B825057j2328K0663O3245M6823M1735J50286l5429j84919q6223O2192J31473
$$ 2825057 2812729 2833392 2896637 2943460 2985195 3135481 3100052 2915133 2828910 2891102 3022575
22010C022575R431K9067j6033r9880N6841m2718O438m8457M4255R0529L3633K2445
$$ 3022575 3032006 3061073 3045040 2945160 3002001 2959283 2965721 2917264 2961519 3052048 3085681 3108126
21998C108126L9104k5738j52627p7904P591J04818p6307l0373j66735j025K28082
$$ 3108126 3147230 3121492 2968865 2890961 2898552 3003370 2927063 2896690 2729955 2728930 2957012
21987B957012M7814m3272J4424K04462J04957r6973p4251p7044j13536l8434N4664
$$ 2957012 3004826 2961554 2975978 3180440 3285397 3188424 3114173 3037129 2923593 2885159 2939823
21976B939823O1884r2275j5014Q3697m4777J1432J58529o9885j15949M6206K59667
$$ 2939823 3001707 2909432 2894418 2978115 2933338 2944770 3103299 3033414 2917465 2963671 3223338
21965C223338R2678n0853o3530O3359j9909R1816R2831j58166r5554J28141R4964
$$ 3223338 3316016 3265163 3201633 3264992 3245083 3336899 3429730 3271564 3176010 3304151 3399115
21954C399115q4816j05118J20264Q479k17015J40296J37389R1657k4407p7680
$$ 3399115 3314299 3209181 3329445 3337924 3120909 3261205 3398594 3490251 3465844 3388164
21944C388164j63532J02977K80819J8119k58034J4411M342J25304l1241j19863
$$ 3388164 3224632 3327609 3608428 3626547 3368513 3382924 3387266 3512570 3481329 3361466
21934C361466l8177J98401R2442j0026k5501l6807r041R2140R344J6760n9930
$$ 3361466 3323289 3521690 3614132 3604106 3578605 3541798 3532757 3624897 3634241 3651001 3591071
21923C591071O0472L4405J78675P9012k11664r2796J42044J38926Q2646k0914
$$ 3591071 3651543 3685948 3864623 3943635 3731971 3639175 3781219 3920145 4002791 3981877
21913C981877O7194M4950l1698j48097j24772l2325J20847j5788N9559P6437j689
$$ 3981877 4049071 4094021 4062323 3914226 3789454 3757129 3877976 3862188 3921747 3998184 3996495
21902C996495N434M212m3916J71103J20057l3361j51859j35452R7553j7058q7348
$$ 3996495 4001929 4006141 3962225 4133328 4253385 4220024 4068165 3932713 4030266 4013208 3925860
21891C925860L9092J12190R8840l6231J3745J06242J7943O2240Q5792L8953k1414
$$ 3925860 3964952 4077142 4175982 4139751 4153496 4259738 4277681 4339921 4425713 4464666 4443252
21880D443252j0772p0881M1671J75486l5720J92144m8294j44105r1886k3243P4327
$$ 4443252 4432480 4361599 4403270 4578756 4543036 4735180 4686886 4542781 4450895 4427652 4501979
21869D501979N3418Q383M8800K4999j4067P3646j2780L8266K8359q279R0538j05444
$$ 4501979 4555397 4563780 4612580 4637579 4623512 4697158 4684378 4722644 4751003 4742724 4833262 4727818
21857D727818j47552K12644K56641p5463N1175q6468j56027J06446Q6219J61050
$$ 4727818 4580266 4792910 5049551 4974088 5025263 4938795 4782768 4889214 4975433 5136483
21847E136483K3751o6524j06013q5034j01779P6780J51953n4394j42538K1131
$$ 5136483 5160234 5093710 4987697 4902663 4800884 4877664 5029617 4975223 4832685 4853816
21837D853816k6303K7119R7205J34244K11745J03668o3998P6234R9421K2824l9271
$$ 4853816 4827513 4854632 4951837 5086081 5297826 5401494 5337496 5413730 5513151 5535975 5496704
21826E496704j24430P5438N6010J41071j7583k5439P825O108k1130m949Q730k291
$$ 5496704 5372274 5447712 5503722 5644793 5627210 5601771 5609596 5615704 5594574 5589625 5598355 5596064
21814E596064J32659J85917Q8513l2863j32003j01225p609J33751N8800J30276
$$ 5596064 5728723 5914640 6003153 5970290 5838287 5737062 5729453 5863204 5922004 6052280
21804F052280m4549m0950j9844J37416L5577q9547l0631J44190L4728M237J08292
$$ 6052280 6007731 5966781 5946937 6084353 6119930 6030383 5999752 6143942 6178670 6182907 6291199
21793F291199o1101n3023Q7444k8061j11919J12399J38151J31016Q8899J02267
$$ 6291199 6230098 6177075 6264519 6236458 6124539 6236938 6375089 6506105 6595004 6697271
21783F697271n5040j39026J27776J01598o0196K5397R9716J08492l8915j31518
$$ 6697271 6642231 6503205 6630981 6732579 6672383 6697780 6797496 6905988 6867073 6735555
21773F735555M8617K18819Q0890j5777l834p1910Q5610J03395J1903j38852r0556
$$ 6735555 6784172 7002991 7083881 7068104 7064270 6992360 7077970 7181365 7193268 7054416 6963860
21762F963860N687J34779O2095q9295l1789j33144O4694J38907R6541K36356K62563
$$ 6963860 6969547 7104326 7166421 7077126 7045337 6912193 6976887 7115794 7212335 7448691 7711254
21751G711254J76242k2037P192m2068q405P0700P3704l6565j91179k0879M502
$$ 7711254 7887496 7865459 7872651 7830583 7822178 7892878 7966582 7930017 7738838 7717959 7722461
21740G722461J52098J71062N4093J14441n1261p6197r6346r049K3361R1958q3267
$$ 7722461 7874559 8045621 8099714 8214155 8162894 8086697 7990351 7981302 8004663 8096621 8013354
21729H013354R4972L4857K09140L20739O0367l13671p4152K50112J00704p3281
$$ 8013354 8108326 8143183 8352323 8673062 8733429 8419758 8345606 8595718 8696422 8623141
21719H623141j15504J4546J94103O2326k13150k0648R6345K01913P0262k961l5747
$$ 8623141 8507637 8522183 8716286 8778612 8565462 8544814 8641159 8843072 8913334 8910373 8874626
21708H874626J19787J75278M0980j01194k1388R4345J13491j06731J34308J28272
$$ 8874626 8994413 9169691 9210671 9109477 9088089 9182434 9295925 9189194 9323502 9451774
21698I451774J1631j5574K04076J55515M822N9124o5719O8474K0168r907J23084
$$ 9451774 9463405 9447831 9651907 9807422 9812244 9871368 9805649 9874123 9894291 9884384 10007468
21687A0007468J53406J08165Q3822M0120N3072J0863q0241P5500J22640M9490
$$ 10007468 10160874 10269039 10352861 10392981 10446053 10456916 10376675 10452175 10574815 10624305
21677A0624305l5555l5069J07815m2743J06002O6198J5192J25989l2610o6917
$$ 10624305 10588750 10553681 10661496 10618753 10724755 10790953 10806145 10932134 10899524 10832607
21667A0832607k3390J76407L30648J66192m7656j27282J01473P3543o6247r6509
$$ 10832607 10809217 10985624 11316272 11482464 11434808 11307526 11408999 11482542 11416295 11319786
21657A1319786p4847J92748K15247J9068O926O0766J5980J72527J05126J94711
$$ 11319786 11244939 11437687 11652934 11672002 11678928 11739694 11755674 11928201 12033327 12228038
21647A2228038J06243j43461J07699J79204J73081O5672J4576p2384Q384M5320
$$ 12228038 12334281 12190820 12298519 12477723 12650804 12716476 12731052 12658668 12667052 12712372
21637A2712372J48595R5690J04429k0086P9895K18416P9015J1120M8629O6012
$$ 12712372 12860967 12956657 13061086 13041000 13120895 13339311 13418326 13429446 13478075 13544087
21627A3544087N7354J71043M141L747M612R2767Q1050P4178J35948M8518k9588
$$ 13544087 13601441 13772484 13776625 13780372 13784984 13877751 13958801 14032979 14168927 14217445 14187857
21616A4187857J44115O5956M6546J95448K2700J41451P3177J21426J68213K8900
$$ 14187857 14331972 14397928 14444474 14639922 14662622 14804073 14877250 14998676 15166889 15195789
21606A5195789j3258N7361J18343j01152q9162J5913J43482M0399L0133J23673
$$ 15195789 15182531 15239892 15358235 15257083 15167921 15183834 15327316 15367715 15397848 15521521
21596A5521521Q6006J10870L8994m31K47691K63087J74137L0815n6562O9779J43375
$$ 15521521 15607527 15718397 15757391 15756960 16004651 16267738 16441875 16472690 16416128 16485907 16629282
21585A6629282K10515J15887O6353K66971J25341R9155o90r0240J56397J37877
$$ 16629282 16839797 16955684 17022037 17289008 17414349 17513504 17512814 17422574 17578971 17716848
21575A7716848Q9800o1315m342k1400P2541J28952J86469Q2676J16876Q8554q351
$$ 17716848 17806648 17745333 17740991 17719591 17792132 17921084 18107553 18190229 18307105 18395659 18387308
21564A8387308J74299J84816J35659P8004J71885J53973P1598j31600J41677J79383
$$ 18387308 18561607 18746423 18882082 18960086 19131971 19285944 19357542 19225942 19367619 19547002
21554A9547002N7137J6004J16561J33003J03211J54120J38272J17227K61086P1956
$$ 19547002 19604139 19620143 19736704 19869707 19972918 20127038 20265310 20382537 20643623 20715579
21544B0715579r9142k8591Q1338K14712J58817J74097J76957J53812K01152J33674
$$ 20715579 20616437 20587846 20669184 20883896 21042713 21216810 21393767 21547579 21748731 21882405
21534B1882405O6908p069J04202K18842P5839R2200O9330o3556j1084K39518L25302
$$ 21882405 21949313 21942244 22046446 22265288 22341127 22433327 22502657 22439101 22428017 22667535 22992837
21523B2992837Q9735J64658J08624J2720j8939J31668K10141K95281L5564K03
$$ 22992837 23082572 23247230 23355854 23368574 23349635 23481303 23691444 23986725 24022289 24022492
21513B4022492K06007K11923j2609Q2042J75417J23143K00140K70136R4856k9450
$$ 24022492 24228499 24440422 24427813 24509855 24685272 24808415 25008555 25278691 25373547 25344097
21503B5344097l8206R2654J12164J4342K9501J81556K33120K20928K33573J15657
$$ 25344097 25305891 25398545 25510709 25525051 25554552 25736108 25969228 26190156 26423729 26539386
21493B6539386M6179J0626J2596J85838J17105J14271M6465J71304M95444R8819
$$ 26539386 26585565 26596191 26608787 26794625 26911730 27026001 27072466 27243770 27739214 27838033
21483B7838033R5696J9079J20102J93820K69127J63614J25206J37572N3966O8324
$$ 27838033 27933729 27952808 28072910 28266730 28535857 28699471 28824677 28962249 29016215 29084539
21473B9084539O1692J93446K16579J03126K31264P2451J72713J0364N9726J45568
$$ 29084539 29146231 29339677 29556256 29659382 29890646 29963097 30135810 30146174 30205900 30351468
21463C0351468J85445P7617K5532J42799J86222K10706L61754Q2724R66O0090
$$ 30351468 30536913 30614530 30640062 30782861 30969083 31179789 31541543 31624267 31625233 31685323
21453C1685323J21198R5147j32084Q1425K42691K23295K92281J81773J40916J71844
$$ 31685323 31806521 31901668 31769584 31851009 32093700 32316995 32609276 32791049 32931965 33103809
21443C3103809K12892N4632K02261O012M7247K10457J71293J35663L7197J68079
$$ 33103809 33316701 33371333 33573594 33579606 33626853 33837310 34008603 34144266 34181463 34349542
21433C4349542J72980L27476K10633K70690m8328l3354Q7614J86394K50681K56450
$$ 34349542 34522522 34849998 35060631 35331321 35282993 35249639 35337253 35523647 35774328 36030778
21423C6030778J98725M1839O1963N0951K78182K54848M5520j2482j05749J75042
$$ 36030778 36229503 36271342 36333305 36384256 36662438 36917286 36962806 36950324 36844575 37019617
21413C7019617L46055J72191K87424K00915K35208J60465n902N6545O7186K01709
$$ 37019617 37365672 37537863 37825287 38026202 38261410 38421875 38415973 38472518 38539704 38741413
21403C8741413K70988l867N0968K18468K13840J45619j23628J86897O0260j15667
$$ 38741413 39012401 39008534 39059502 39277970 39491810 39637429 39513801 39700698 39760958 39645291
21393C9645291m7511J07780K45043Q8183P7085P7665J80237J07124K67014K11689
$$ 39645291 39597780 39705560 39950603 40038786 40115871 40193536 40373773 40480897 40747911 40959600
21383D0959600K48870J60411J79034N2153k2058L9199J62065K23148K41804K00402
$$ 40959600 41208470 41368881 41547915 41600068 41578010 41617209 41779274 42002422 42244226 42444628
21373D2444628n0836N0112Q415Q2921J89431n2943o9097K1802J02749K59737R1962
$$ 42444628 42393792 42443904 42452319 42535240 42724671 42671728 42602631 42624433 42727182 42986919 43078881
21362D3078881j0015N1054Q3406K08154L53770J90058Q9352k9090Q829R1764J19457
$$ 43078881 43068866 43119920 43203326 43411480 43765250 43955308 44044660 44015570 44024399 44116163 44235620
21351D4235620P7808m2443j15625O9582J52018J26541L0047J66758J14496L7219
$$ 44235620 44313428 44270985 44155360 44224942 44376960 44503501 44533548 44700306 44814802 44852021
21341D4852021O8071M2362O7235K2285K1842J44933R0630r2102n4256K1077Q689
$$ 44852021 44920092 44962454 45029689 45051974 45073816 45218749 45309379 45217277 45163021 45184098 45192787
21330D5192787N1776M5625R6113p955o4854q315K61658J61492l1404Q4271R5115
$$ 45192787 45244563 45290188 45386301 45378346 45313492 45305177 45566835 45728327 45696923 45781194 45876309
21319D5876309p9159l4546J39283N2719m3555q3240q4431j35880P1252j23081
$$ 45876309 45797150 45762604 45901887 45954606 45911051 45827811 45743380 45607500 45678752 45555671
21309D5555671o7451j51832J640K53830n1203k48039Q838Q2224j31154J4070K0681
$$ 45555671 45488220 45336388 45338028 45591858 45540655 45292616 45301454 45383678 45252524 45266594 45287275
21298D5287275J85274k3730n2294K2081r7756j36263J38421L2305j3924r6734
$$ 45287275 45472549 45448819 45396525 45418606 45320850 45184587 45323008 45355313 45341389 45244655
21288D5244655j25971Q8291J32377p7323j53697J4570P7131j24112j55363q3045
$$ 45244655 45118684 45206975 45339352 45262029 45108332 45122902 45200033 45075921 44920558 44837513
21278D4837513J5155k61629j92511k24001p9554n156p8117J1315N5644j72571
$$ 44837513 44852668 44591039 44398528 44174527 44094973 44089817 44011700 44023015 44078659 43906088
21268D3906088m6708J7599p5568j6884j28144n5162k13619k33063j97454p2068
$$ 43906088 43859380 43876979 43801411 43784527 43656383 43601221 43387602 43154539 42957085 42885017
21258D2885017n2064L1412o7889l0892K1782o330j14026j21396j07467j86169
$$ 42885017 42832953 42864365 42796476 42765584 42787366 42781036 42667010 42545614 42438147 42251978
21248D2251978r4898j23022j99129j09526j88810q7562K6350M7188j50980j98278
$$ 42251978 42157080 42034058 41834929 41725403 41536593 41449031 41475381 41522569 41371589 41173311
21238D1173311q1524q726j52729k50040k01546J5465p3833k03833p8104k5418
$$ 41173311 41091787 41083061 40930332 40680292 40478746 40494211 40420378 40216545 40138441 40113023
21228D0113023Q2856o0883k45400l61706k68940j81184P1919J7309j24448j69184
$$ 40113023 40195879 40134996 39889596 39527890 39258950 39077766 39149685 39166994 39042546 38873362
21218C8873362j48781q0810j05944k86349j17774j25747j26050J247q8953k01302
$$ 38873362 38724581 38643771 38537827 38251478 38133704 38007957 37881907 37883154 37794201 37592899
21208C7592899k82479k10244m4144o7269j08689j32286q10k49867k33375k56581
$$ 37592899 37310420 37100176 37056032 36988763 36880074 36747788 36746978 36497111 36263736 36007155
21198C6007155j68947j17108j75301j42482j24521q3403o1498j9522j04436k0587
$$ 36007155 35838208 35721100 35545799 35403317 35278796 35195393 35133895 35114373 35009937 34989350
21188C4989350o2486k17455k28136j05811l7131k82521k74977r0050n1774k9013
$$ 34989350 34926864 34709409 34481273 34375462 34338331 34055810 33780833 33690783 33639009 33609996
21178C3609996k48591l09299j25002j92854m09756j16701J41160n4639j14860
$$ 33609996 33361405 33052106 32927104 32734250 32324494 32207793 32348953 32294314 32179454
21169C2179454O740k60425k03624j06378n2607j45263m00202j78463N3073J6716
$$ 32179454 32186194 31925769 31722145 31615767 31563160 31417897 31017695 30839232 30892305 30909021
21159C0909021k17069j15412k75110j62884j12739l1123k42512k12757r6233j57309
$$ 30909021 30691952 30576540 30301430 30138546 30025807 29994684 29752172 29539415 29443182 29285873
21149B9285873p1379l6830k38515k01359j23773k08436j06941m5994n1511o9081
$$ 29285873 29214494 29177664 28939149 28737790 28614017 28405581 28298640 28252646 28201135 28132054
21139B8132054k91880j11208k5816j72163j80355L8944k46066j15989j2623j51048
$$ 28132054 27840174 27728966 27703150 27530987 27350632 27389576 27143510 27027521 27014898 26863850
21129B6863850j65475k66500k49991m7579k53112j81956K1208j52226j77835q9565
$$ 26863850 26698375 26431875 26181884 26134305 25881193 25699237 25720445 25568219 25390384 25300819
21119B5300819j29016j46829P812O3728m5754j53213J2941j84483j44735j0448
$$ 25300819 25171803 25024974 25032786 25096514 25050760 24897547 24910488 24726005 24581270 24570822
21109B4570822r6541j35013j29523l51715k37686k27447j18149j8938j40710l57438
$$ 24570822 24474281 24339268 24209745 23858030 23620344 23392897 23274748 23255810 23115100 22757662
21099B2757662m2065j38980o680p3299n7822o278k05567j92214k19718k8062j3318
$$ 22757662 22715597 22576617 22569937 22496638 22438816 22432538 22226971 22034757 21815039 21786977 21773659
21088B1773659l12449k01575K4874o9124p1907j8669P3855m7070q6405j10662
$$ 21773659 21461210 21259635 21284509 21215385 21143478 21124809 21198664 21151594 21065189 20954527
21078B0954527k4695j85272j61786j35529k37497k37666j11259Q1582j6625j76019
$$ 20954527 20929832 20744560 20582774 20447245 20209748 19972082 19860823 19942405 19925780 19749761
21068A9749761k41653j55018L5150p510l1944j58833k24684q3082j3818p336o1961
$$ 19749761 19508108 19353090 19388240 19380730 19348786 19189953 18965269 18882187 18868369 18861033 18799072
21057A8799072k28472n3372j8951J7058J2928j49913j75774m011k3393j72801
$$ 18799072 18570600 18517228 18498277 18515335 18528263 18378350 18202576 18198565 18175172 18002371
21047A8002371k43199j37855r9507j48486j85694p6692o1157j80478j00394L3886
$$ 18002371 17759172 17621317 17521810 17373324 17187630 17110938 17049781 16869303 16768909 16802795
21037A6802795J34427m0259k33141j2862o8514j02185j57625j42633k15655o8529
$$ 16802795 16937222 16896963 16663822 16650960 16582446 16480261 16322636 16180003 15964348 15895819
21027A5895819J19955m8350m8755k17158K0342R956n8223o2287j21779J5656k16739
$$ 15895819 16015774 15967424 15918669 15701511 15721853 15731809 15673586 15611299 15489520 15505176 15288437
21016A5288437r4905j53678O8816p6511j32575q7573n935j06581k31110N651j6492
$$ 15288437 15193532 15039854 15108670 15032159 14899584 14812011 14806076 14699495 14468385 14474036 14457544
21005A4457544r2035o6729j50783j1612j25573j74324j13178P7427m6618k30965
$$ 14457544 14365509 14298780 14147997 14136385 14010812 13836488 13723310 13800737 13754119 13523154
20995A3523154L7428O312j17603p2028j06516L5012N2503j7404r6934P3756k21544
$$ 13523154 13560582 13566894 13449291 13377263 13270747 13305759 13358262 13340858 13243924 13317680 13096136
20984A3096136o7724k9257K2885k04826k9999p7497j99596r5035k0611J6171n7576
$$ 13096136 13028412 12999155 13022040 12817214 12787215 12709718 12510122 12415087 12394476 12410647 12353071
20973A2353071j64318k03073j047P4496N8865j39265m749k6637K1264m6932M0153
$$ 12353071 12188753 11985680 11984633 12059129 12117994 11978729 11973980 11947343 11968607 11921675 11961828
20962A1961828l8321l719o6540r1724j422j15472r3535j80388j01546N0031r2524
$$ 11961828 11923507 11919788 11853248 11761524 11760102 11644630 11551095 11370707 11269161 11319192 11226668
20951A1226668j49821j86084J1194P8048L3177Q5485J21895j41901j15871k7805
$$ 11226668 11076847 10890763 10901957 10980005 11013182 11098667 11220562 11078661 10962790 10934985
20941A0934985p0588k98050j02735m2526J02117P0584q6714M1731j49019k01894
$$ 10934985 10864397 10566347 10463612 10421086 10523203 10593787 10507073 10548804 10399785 10197891
20931A0197891j28410o6928Q3159l0561j8870J68505l3071j25809k28121j00359
$$ 10197891 10069481 10002553 10085712 10055151 10036281 10204786 10171715 10045906 9817785 9717426
20921I717426K2142L9986j9494k05429k13083Q8335J25330n9673q4843r6255j05218
$$ 9717426 9739568 9779554 9760060 9554631 9341548 9429883 9555213 9495540 9410697 9314442 9209224
20910I209224K1614M1655j91303j5592j22765r8349K4163J112J33458l6540j58589
$$ 9209224 9230838 9272493 9081190 9065598 8942833 8844484 8868647 8869759 9003217 8966677 8808088
20899H808088P9978l2781k10376n944j91864m7087Q0539j16041r7366n9067o0888
$$ 8808088 8888066 8855285 8644909 8638965 8447101 8400014 8480553 8364512 8267146 8208079 8147191
20888H147191J64748Q3442j33724m7849L5630k6150j6014n3524j50730j51030
$$ 8147191 8311939 8395381 8261657 8213808 8249438 8223288 8207274 8153750 8003020 7851990
20878G851990M7895p216j04896J10687Q2497r0326p5065p4295M8726r1238n9682
$$ 7851990 7899885 7892669 7787773 7898460 7980957 7890631 7815566 7741271 7789997 7698759 7639077
20867G639077q5516J28370N1941l3872o5269j14671j08596O0870L8659j58095
$$ 7639077 7553561 7681931 7733872 7700000 7634731 7520060 7411464 7472334 7510993 7352898
20857G352898K6926N1020J2576j04860L8323O13j02091j09519j32303P5627J54992
$$ 7352898 7379824 7430844 7443420 7338560 7376883 7377496 7275405 7165886 7033583 7109210 7264202
20846G264202J19971j39581p4362k3759K603j10677R2112N0934j22189j81116
$$ 7264202 7384173 7244592 7170230 7146471 7149074 7038397 7130509 7181443 7059254 6878138
20836F878138j66765J0987r2894k14265j16226Q8228R2404J44550L676j15765
$$ 6878138 6711373 6722360 6629466 6415201 6298975 6387203 6479607 6624157 6627833 6512068
20826F512068j02742n6919m3916j51362R6230O9544l8192K9884p8238j14876J09788
$$ 6512068 6409326 6352407 6308491 6157129 6253359 6322903 6284711 6314595 6236357 6121481 6231269
20815F231269l924j7465M2425r4925k01314M6746P5533k32892o4980J73383n0717
$$ 6231269 6227345 6209880 6252305 6157380 5956066 6002812 6078345 5845453 5780473 5953856 5903139
20804E903139j28632M3926K33354j8236j16520j13565J18981j5164k10666j39342
$$ 5903139 5774507 5818433 6051787 6033551 5917031 5803466 5922447 5907283 5696617 5557275
20794E557275J91951J68868Q1992n0718j18808p2458j49051k31440J49986K2180
$$ 5557275 5749226 5918094 6000086 5949368 5830560 5758102 5609051 5377611 5527597 5549777
20784E549777O778j9928J1812K0573K6391O562k47169o8266L7677J4323p4161
$$ 5549777 5556555 5536627 5548439 5569012 5595403 5601965 5354796 5286530 5324207 5338530 5264369
20773E264369k3249j11210l5546N7571P5946J6896J71697J20717j03883o9548
$$ 5264369 5241120 5129910 5094364 5151935 5227881 5244777 5416474 5537191 5433308 5363760
20763E363760n7071J18732K5078j52165p7003q365k6134j4942n4941N9718j82928
$$ 5363760 5306689 5425421 5450499 5298334 5221331 5212966 5186832 5171890 5116949 5176667 4993739
20752D993739k108o4076j39664J10224j7922J12365J08680j04301k5590l1671
$$ 4993739 4991631 4927555 4787891 4898115 4880193 4992558 5101238 4996937 4971347 4939676
20742D939676j45114P9079r3896P9515L5037k18578Q7774l706J7684o4711p298
$$ 4939676 4794562 4873641 4779745 4859260 4894297 4675719 4763493 4759787 4777471 4712760 4705462
20731D705462j350O1475J8794m878j67518l3449J48536R8989p5501j91641j07847
$$ 4705462 4704112 4765587 4784381 4779503 4611985 4578536 4727072 4826061 4750560 4558919 4451072
20720D451072k15869k8573P8502J30313J79135k2921p8722J46917J20919M9841
$$ 4451072 4235203 4206630 4285132 4415445 4594580 4571659 4492937 4639854 4760773 4810614
20710D810614k03071j46351K3704M2789N9928R0884j74907j40799p0619K0258
$$ 4810614 4607543 4461192 4484896 4527685 4587613 4678497 4503590 4362791 4292172 4312430
20700D312430K4521p4200q9786j95338K20905J44000J300j77595k9249j9656m8961
$$ 4312430 4336951 4262751 4172965 3977627 4198532 4342532 4343832 4166237 4136988 4117332 4068371
20689D068371M4848j18265K9747J76388r6410k11796o1379o4674j43046K556J22653
$$ 4068371 4113219 3994954 4024701 4201089 4104679 3892883 3831504 3766830 3623784 3626340 3748993
20678C748993J61379Q8216r5569Q5074l0443l9309N8208j29222r3365J9928N4230
$$ 3748993 3910372 3998588 3903019 3988093 3957650 3918341 3976549 3847327 3753962 3773890 3828120
20667C828120M890j35915K2980R9865K9599k2615K2401j60555M0574k2626p2085
$$ 3828120 3833010 3697095 3720075 3819940 3849539 3826924 3849325 3688770 3729344 3706718 3634633
20656C634633j8727Q728j35002P8137q9270J3361o5908J38901o2399j59661n7913
$$ 3634633 3615906 3624634 3489632 3567769 3478499 3491860 3425952 3564853 3502454 3342793 3284880
20645C284880o0675O9946j9828O6945k6595n3828J22402J36165l6584R0026j35116
$$ 3284880 3224205 3294151 3274323 3341268 3314673 3260845 3383247 3519412 3482828 3572854 3437738
20634C437738p3993l6133O1374n1079K2272n155r683q763j09193J14256J40051
$$ 3437738 3363745 3327612 3388986 3337907 3360179 3355024 3345341 3336578 3227385 3341641 3481692
20623C481692k3654P736J70843M4697p9961j17272j11537K0000o7323j08224J02450
$$ 3481692 3458038 3465774 3636617 3681314 3601353 3484081 3372544 3392544 3325221 3216997 3319447
20612C319447J77994J15617J0797q8706P1368p1238p947j2209O9141M2405k04598
$$ 3319447 3497441 3613058 3623855 3535149 3606517 3535279 3527332 3515123 3584264 3626669 3422071
20601C422071k50247k2967k8871k275L4781l4729j00510k3750q684k1315J31376
$$ 3422071 3171824 3148857 3119986 3117711 3152492 3117763 3017253 2993503 2984819 2963504 3094880
20590C094880J39936J9165n6976n4575j67477L8727N6140O356k14586J9891M2852
$$ 3094880 3234816 3253981 3197005 3142430 2974953 3013680 3069820 3076176 2861590 2881481 2924333
20579B924333O2048P5235q1245J3166n176l2654m5469N0788P6296L9529p9385
$$ 2924333 2986381 3061616 2980371 2993537 2988361 2955707 2910238 2961026 3037322 3076851 2997466
20568B997466j67663J79326J9625j85498j8342L1875n6067R4191M5986P4519N226
$$ 2997466 2829803 3009129 3028754 2843256 2824914 2856789 2800722 2894913 2940899 3015418 3020644
20557C020644j08717o3146r7474n1955j1504q6918O8896J23034r2990N4356L2471
$$ 3020644 2911927 2848781 2751307 2699352 2687848 2600930 2669826 2792860 2699870 2754226 2786697
20546B786697r899o3917J32599J52246j5095q5541m3385m5315L4171r3705o7089
$$ 2786697 2776798 2712881 2845480 2997726 2982631 2897090 2853705 2808390 2842561 2748856 2681767
20535B681767j1386j08430j85508j11252J3721K15760Q2295j3461o0267J07026
$$ 2681767 2670381 2561951 2376443 2265191 2278912 2494672 2576967 2563506 2503239 2610265
20525B610265J18666q7053j95388j06644m1716O9890K38291Q6275j96678j32194
$$ 2610265 2728931 2641878 2446490 2339846 2298130 2368020 2606311 2692586 2495908 2363714
20515B363714L7851p982K6377J8047j9590k15125j21958J59418P7292l8365L0893
$$ 2363714 2401565 2393583 2419960 2438007 2418417 2203292 2081334 2240752 2318044 2279679 2310572
20504B310572J11875k9918J3523J2217j64249n4034j03515O3056J84739j2154
$$ 2310572 2422447 2392529 2406052 2418269 2254020 2199986 2096471 2159527 2344266 2332112
20494B332112J8568K6889p4193j27282K62874J47317j37021n0225m7916j45577
$$ 2332112 2350680 2377569 2303376 2176094 2438968 2586285 2449264 2399039 2351123 2205546
20484B205546R4066Q4997K3731m2838o8207O2693k48066r4411R0611K11241M0862
$$ 2205546 2299612 2384609 2408340 2365502 2297295 2359988 2111922 2017511 2108122 2319363 2360225
20473B360225j39131p8804J99Q2129k288J0893L7711r0942j7787j9190j67409
$$ 2360225 2221094 2142290 2142489 2224618 2222330 2233223 2270934 2179992 2162205 2143015 1975606
20462A975606o0778J87490p514k8887j8469M5767J48876J52677J57748P5539o6571
$$ 1975606 1914828 2102318 2094804 2065917 2047448 2093215 2242091 2394768 2552516 2628055 2561484
20451B561484m1953M8843j32342l24405p3559K14127J47091r7292j82329j60091
$$ 2561484 2519531 2568374 2436032 2111627 2038068 2252195 2399286 2301994 2119665 1959574
20441A959574L3291J0917J03079J1369j24439L0096L6894L5970M4279K7411p1424
$$ 1959574 1992865 2003782 2106861 2118230 1993791 2023887 2060781 2096751 2141030 2168441 2097017
20430B097017n2416m2924K0922P5204K0985K8373l3624J7966J6296j6755m3670
$$ 2097017 2044601 2001677 2022599 2097803 2118788 2147161 2113537 2131503 2147799 2131044 2087374
20419B087374O3005j03033l7450M9473K637Q0033k2721j09382n3657j51617J17753
$$ 2087374 2150379 2047346 2009896 2059369 2062006 2142039 2119318 2009936 1956279 1804662 1922415
20408A922415J5548M7872O9025K9265o2507J53217m2737j02164j8004K2849n623
$$ 1922415 1937963 1985835 2054860 2084125 2021618 2174835 2132098 2029934 2011930 2034779 2029156
20397B029156m7305P5415n3575M8998N3555l7715k1576j45149R2457J13120O2546
$$ 2029156 1981851 2057266 2003691 2052689 2106244 2068529 2046953 1901804 1994261 2107381 2169927
20386B169927K6042J6033j97925n5523r4657P0737Q7992q612P6195o9665j33936
$$ 2169927 2195969 2212002 2014077 1958554 1863897 1934634 2022626 2014014 2090209 2020544 1886608
20375A886608j33022l0605J9962L6847K5459J34015P8773o3403k0768K8302M1387
$$ 1886608 1753586 1722981 1742943 1779790 1805249 1939264 2018037 1954634 1933866 1962168 2003555
20364B003555r8162j30534K48381L2561j39426L4348p4338j2729l1211j05486
$$ 2003555 1905393 1774859 2023240 2055801 1916375 1950723 1876385 1863656 1832445 1726959
20354A726959M2947R8055M2818P0089m9413q6867j25733q450j10422R303J55924
$$ 1726959 1769906 1867961 1910779 1980868 1931455 1844588 1718855 1710405 1599983 1609286 1765210
20343A765210J02366j5030q6969j02144N8029m4696O6108J73673m8307j34895
$$ 1765210 1867576 1852546 1765577 1663433 1721462 1676766 1742874 1916547 1868240 1733345
20333A733345P0788J01789k7899r9602J85021o7845j25576R3803J9343K0244P525
$$ 1733345 1804133 1905922 1878023 1778421 1963442 1895597 1770021 1863824 1883167 1903411 1910936
20322A910936j04647o5381Q9252j07930j05830j8891J81082O8725M3996j8707
$$ 1910936 1806289 1740908 1830160 1722230 1616400 1597509 1778591 1847316 1891312 1872605
20312A872605O3877j28182K751j35930j18062O607J61175J18720j30798o6541
$$ 1872605 1936482 1808300 1811051 1675121 1557059 1563666 1724841 1843561 1712763 1646222
20302A646222k593p6263j27829K38048J83167j13581m7227Q8069j30100m0321
$$ 1646222 1643629 1567366 1439537 1677585 1860752 1747171 1699944 1788013 1657913 1617592
20292A617592l7867j2398j0790p0554J14294Q570M8743m7878M8758j33755k5395
$$ 1617592 1579725 1567327 1556537 1485983 1600277 1608847 1657590 1609712 1658470 1524715 1499320
20281A499320O4993j08110M9153J07378J92685j10975j51260j1838P0774J00542
$$ 1499320 1564313 1456203 1505356 1612734 1805419 1694444 1543184 1531346 1602120 1702662
20271A702662q3402L8577K30191J120j26972j31273j33756J14149J51715r500
$$ 1702662 1619260 1657837 1888028 1889148 1762176 1630903 1497147 1611296 1763011 1753511
20261A753511j83169j42865p2814J68309J48546j12797m4982O8361l7450j34829
$$ 1753511 1570342 1427477 1354663 1522972 1671518 1558721 1513739 1582100 1544650 1409821
20251A409821r4184J43117R3067J32861K1535k34013j17457Q0131J2528j5769
$$ 1409821 1315637 1458754 1551821 1684682 1706217 1472204 1354747 1434878 1447406 1431637
20241A431637j5569Q4338Q9590N4762J08925p5106j79397j41893m3242R265N0982
$$ 1431637 1416068 1500406 1589996 1644758 1753683 1678577 1499180 1357287 1314045 1323310 1374292
20230A374292J02893j96162r3818J35419L3659P1749P5918k15778j89949Q798
$$ 1374292 1477185 1281023 1187205 1322624 1356283 1428032 1503950 1288172 1098223 1107021
20220A107021N0747J22305J01529r660L9491R6149J15191K8013j90714j30047
$$ 1107021 1157768 1280073 1381602 1371942 1411433 1507582 1622773 1650786 1460072 1330025
20210A330025m4197K2006J40383J2547k3887N0862J18453j32153r3018O3704l2216
$$ 1330025 1285828 1307834 1448217 1460764 1436877 1487739 1606192 1474039 1381021 1444725 1412509
20199A412509N2224K31953P8576r8146q6802l9977q1675k2635q6147j13177K751
$$ 1412509 1464733 1696686 1775262 1677116 1590314 1550337 1468662 1446027 1359880 1246703 1249454
20188A249454J84403J59663p2790j60430k7859J2154k4101j01375J04563J7677
$$ 1249454 1433857 1593520 1520730 1360300 1332441 1344595 1320494 1219119 1323682 1341359
20178A341359Q9755o5656K4163j42886o2700O9682P6304J12719J0215M0435L7312
$$ 1341359 1431114 1365458 1389621 1246735 1184035 1253717 1330021 1442740 1452955 1493390 1530702
20167A530702K487K457o3339m7634K0752J47515o4217O3431J191p4017p3711j59459
$$ 1530702 1533189 1535646 1472307 1424673 1445425 1592940 1528723 1592154 1593345 1519328 1445617 1286158
20155A286158K7626J40531L3010p8485j33175m6926K1050L3034P2318R3081L2540
$$ 1286158 1313784 1454315 1487325 1408840 1275665 1228739 1249789 1282823 1355141 1448222 1480762
20144A480762j0793M1118J1331n9936P6415j22791k02595j07969K5723P9835K2959
$$ 1480762 1469969 1511087 1522418 1462482 1538897 1416106 1213511 1105542 1131265 1211100 1234059
20133A234059j10906L5744J26114J91008O5799l2623L147J08475o2390J68402
$$ 1234059 1123153 1158897 1285011 1476019 1541818 1509195 1512342 1620817 1558427 1726829
20123A726829N5508M1602r637j5895P7949J74190j0208l7118m8007j7836k20681
$$ 1726829 1782337 1823939 1814302 1798407 1876356 2050546 2040338 2003220 1955213 1937377 1716696
20112A716696j58245K2485M1763K2441l4932R6660N2662r7549j50463l0235R4639
$$ 1716696 1558451 1580936 1622699 1645140 1610208 1706868 1759530 1661981 1511518 1481283 1575922
20101A575922J05933J83924n8242j52611K7673L3092J70389M2468j4319J72095
$$ 1575922 1681855 1865779 1807537 1654926 1682599 1715691 1886080 1928548 1914229 2086324
20091B086324J2652j67834k6054R0170R5645K6706p9261n2054k5897p7400j15992
$$ 2086324 2098976 1931142 1905088 1995258 2090903 2117609 2038348 1986294 1960397 1882997 1767005
20080A767005m8552n0921R2985m9848L46r4120k26503m8688J40947J10077Q6302
$$ 1767005 1718453 1667532 1760517 1710669 1711015 1616895 1390392 1341704 1482651 1592728 1679030
20069A679030K9884o575Q5872q1696j21557L6430N2307O4026q7768m956J76995
$$ 1679030 1708914 1702339 1788211 1706515 1584958 1621388 1673695 1737721 1649953 1644997 1821992
20058A821992Q7228j4405P6518o8182j37398o7326M7925p5992K4171Q5708L6364
$$ 1821992 1909220 1894815 1971333 1903151 1765753 1698427 1746352 1670360 1694531 1780239 1816603
20047A816603J7931M605P8301M482R408l6495n6577l0159M349j833L2320j12203
$$ 1816603 1834534 1839139 1917440 1921922 1931330 1894835 1838258 1808099 1812448 1810615 1842935 1730732
20035A730732l00140J02129K34522N3791j554Q3363k7968p3148M308j7423P348
$$ 1730732 1430592 1532721 1767243 1821034 1819480 1902843 1874875 1801727 1806035 1788612 1795960
20024A795960J1341j22302r2208o845O0409q751O357j13410r9547o2812J63495
$$ 1795960 1807301 1684999 1592791 1585946 1646355 1637604 1643961 1530551 1431004 1368192 1531687
20013A531687J2759p5407j07162M2822j25539M5514q4257l8942K5742Q5456J19524
$$ 1531687 1544446 1469039 1361877 1404699 1279160 1324674 1240417 1201475 1227217 1312673 1432197
20002A432197J56642r7502q5045Q9116Q7176p9997m9635j01412q1656J42168J33541
$$ 1432197 1588839 1491337 1406292 1495408 1582584 1502587 1452952 1351540 1269884 1412052 1545593
19991A545593L3367L2750n9182j10532j86357j22805j06250r7673K2381P5362
$$ 1545593 1578960 1611710 1552528 1441996 1255639 1132834 1026584 928911 951292 1026654
19981A026654J10606O4459N5496J6900n5524L2223o9025O4751J19706j26756O8088
$$ 1026654 1137260 1201719 1257215 1274115 1218591 1250814 1181789 1246540 1366246 1239490 1307578
19970A307578J32597l4112j94710M0905J34657n6551j97027Q4194j533j38749
$$ 1307578 1440175 1406063 1211353 1252258 1386915 1330364 1133337 1217531 1215998 1077249
19960A077249q056J64267j5396O2149P0639K8239p5548r597N1279o9990L7786
$$ 1077249 1069193 1233460 1218064 1280213 1350852 1379091 1303543 1293946 1345225 1275235 1313021
19949A313021j36271m3395J3565K460L7117o1151p307J5157M1572J2318k8854
$$ 1313021 1176750 1133355 1146920 1149380 1186497 1125346 1118039 1133196 1174768 1187086 1158232
19938A158232m4867O1736j9288k9626j36746j11967J10350M8365r4481J7572J68111
$$ 1158232 1113365 1175101 1155813 1126187 989441 877474 987824 1036189 941708 959280 1127391
19927A127391L1858q0400J4272r5040n387J07837m8011M3627K40611J2046n3121
$$ 1127391 1159249 1078849 1093121 998081 992694 1100531 1052520 1096147 1336758 1348804 1295683
19916A295683j62909j37396q0046O1790R2966J7171j22878K5557Q6640M2490l4220
$$ 1295683 1132774 995378 915332 977122 1070088 1087259 964381 989938 1076578 1119068 1084848
19905A084848q6550o886K3236J8696k2909r3772n8331R9973J6139n0400J71140
$$ 1084848 998298 991412 1014648 1033344 1010435 916663 858332 958305 974444 924044 1095184
19894A095184K27128k1737k27895n595j49M0403o5481q1806N3497P4565J9456
$$ 1095184 1322312 1300575 1072680 1067085 1066936 1107339 1041858 960052 1013549 1088114 1107570
19883A107570j26354n4947K04337k6135J6q5643P667P6318r0020j76263P9407
$$ 1107570 981216 926269 1130606 1104471 1104487 1018844 1026511 1102829 1012809 836546 915953
19872I15953J48708J86975Q1287j9204k2761j51294j75958K8004P4996n9878j8819
$$ 915953 1064661 1251636 1332923 1313719 1290958 1139664 963706 991710 1066706 1006828 988009
19861I88009L425N8321r506j7091M8063N7770M9561J3006Q4515m9325J46512j1019
$$ 988009 991434 1049755 1040249 1023158 1071221 1128991 1178552 1191558 1276073 1226748 1373260 1362241
19849A362241n3468j00310L6949P539j42843k220J24793J6576J21058J46492J05322
$$ 1362241 1308773 1208463 1245412 1252951 1110108 1107888 1232681 1249257 1370315 1516807 1622129
19838A622129j50189j36272L8777L3159p2042j95912j46505R2004J10847N3550
$$ 1622129 1471940 1335668 1374445 1407604 1335562 1139650 993145 1085149 1195996 1249546
19828A249546j08619P155J24096J80266q7037k07515j01819J33990L6607j2834
$$ 1249546 1140927 1148082 1272178 1452444 1365407 1157892 1056073 1190063 1226670 1213836
19818A213836P7211j75692K5996J45293p706j01432K8303L4316O8886J48480j47019
$$ 1213836 1291047 1115355 1141351 1286644 1278938 1177506 1205809 1240125 1309011 1457491 1310472
19807A310472j12213o5473J73780J71224K3491n8721j17541m8512o609j25401
$$ 1310472 1198259 1132786 1306566 1477790 1501281 1442560 1325019 1276507 1269898 1144497
19797A144497k2014n9391p8052L5409r2287J523L8485L5935P3587N2781r671R9830
$$ 1144497 1122483 1063092 985040 1020449 928162 929685 968170 1004105 1077692 1130473 1120802 1220632
19785A220632J00848J8572J33351j13745J12396K8068m952M9064N1730N7336M2820
$$ 1220632 1321480 1340052 1473403 1359658 1472054 1500122 1495170 1544234 1595964 1653300 1696120
19774A696120j26785j60233J11626K10645m6911q7482N1294m7387j7842J07022
$$ 1696120 1569335 1409102 1520728 1731373 1684462 1596980 1648274 1600887 1583045 1690067
19764A690067O4726j35510q2760p8612k00k2255N124j2852J02582M9048n4593
$$ 1690067 1754793 1619283 1536523 1457911 1457711 1435456 1440580 1427728 1530310 1579358 1524765
19753A524765j45226m0022k7632O0829K9041J8391K36618J40952J17549r165m1294
$$ 1524765 1379539 1339517 1311885 1372714 1401755 1420146 1656764 1797716 1915265 1906100 1864806
19742A864806p8219o3786k549j03177M041j10701k20950J1936L2068m040k9431
$$ 1864806 1786587 1722801 1720252 1617075 1621116 1510415 1289465 1301401 1333469 1329429 1299998
19731A299998j16253K5866J93996O1906N363O4068o79l1550m7574P65j05999j36425
$$ 1299998 1183745 1209611 1403607 1465513 1470876 1534944 1534265 1502715 1455141 1455906 1349907 1213482
19719A213482m3461m0641m8839j15683J9919L7828m5045M3863P4381P9994P4934
$$ 1213482 1170021 1129380 1080541 964858 984777 1022605 977560 1021423 1095804 1175798 1250732
19708A250732R5333P044J06723J11943Q9987K0784j11054j10080J085J16407k3502
$$ 1250732 1346065 1353109 1459832 1571775 1661762 1682546 1571492 1461412 1462497 1578904 1555402
19697A555402j85592k5435O605N833P3826q2263j12853R1588L8840J48774Q8618
$$ 1555402 1369810 1344375 1350980 1356813 1430639 1348376 1235523 1327111 1365951 1514725 1603343
19686A603343M1304K01n139m8270M0105J34237L6031j44409r2117P6897m9325
$$ 1603343 1644647 1644848 1639709 1591439 1631544 1765781 1801812 1657403 1565286 1642183 1592858
19675A592858n9109K187q6075q0751j9599K6224P8540K8350q2449k4366O3421
$$ 1592858 1533749 1535936 1449861 1369110 1349511 1375735 1454275 1482625 1400176 1375810 1439231
19664A439231j06926J33792q461j08079L9402N7736j62614R23J40497M9024j78575
$$ 1439231 1332305 1466097 1457636 1349557 1388959 1446695 1284081 1285004 1425501 1474525 1295950
19653A295950L0439R4371N974J9593O0461Q4631R6644J65556q7243p5515J16237
$$ 1295950 1326389 1420760 1426734 1446327 1506788 1591419 1688063 1853619 1766376 1690861 1807098
19642A807098k7634j90996R78J24821J3883l1449M0431n7425l5607o4138R2995
$$ 1807098 1779464 1588468 1589446 1714267 1728150 1696701 1737132 1679707 1644100 1579962 1672957
19631A672957J48139K3406m6579J30964R039r9665O4797q7906J14389N7501L2140
$$ 1672957 1821096 1844502 1797923 1928887 1937926 1838261 1903058 1815152 1929541 1987042 2019182
19620B019182L0375J5188Q1463P5452L7650R4233K34536P2997j47140n6776K4766
$$ 2019182 2049557 2064745 2146208 2221660 2259310 2353543 2588079 2661076 2513936 2457160 2481926
19609B481926K62638J86233K34j8518o808J60837j58359p3268J21342K25126O9756
$$ 2481926 2744564 2930797 2931031 2912513 2905705 3066542 2908183 2834915 2956257 3181383 3251139
19598C251139M2967J44090l7865Q5054K45341K1479j63563m7485P8203Q8166K60126
$$ 3251139 3294106 3438196 3400331 3485385 3730726 3752205 3588642 3541157 3619360 3707526 3967652
19587C967652K27868J77592L0709Q92N7569J47163K65239k0780k8217N9020P7952
$$ 3967652 4195520 4373112 4403821 4404713 4462282 4609445 4874684 4853904 4825687 4884707 4962659
19576D962659K30276K50835J50156J18573J34774n0281j01309J61867K31709J42560
$$ 4962659 5192935 5443770 5593926 5712499 5847273 5796992 5695683 5857550 6089259 6231819
19566F231819J94619K2744N3733L08557L35831J58674J35432J12884J46581K79377
$$ 6231819 6426438 6449182 6502915 6811472 7147303 7305977 7441409 7554293 7700874 7980251
19556G980251M12329M26678L25587K46517K53546Q8197L81259N12418M49263L83966
$$ 7980251 8392580 8819258 9144845 9391362 9644908 9733105 10114364 10626782 11076045 11460011
19546A1460011N08433L31637M03690O91911Q31599P77350R97722J023353J059588
$$ 11460011 11968444 12300081 12703771 13395682 14227281 15004631 16002353 17025706 18085294
19537A8085294J617152J945934K330829L181388L990294N627053P685406R613609
$$ 18085294 19702446 21648380 23979209 27160597 31150891 36777944 44463350 54076959
19529E4076959J0854616J0398697Q979604P375642Q757455J4990980K5434341
$$ 54076959 64931575 75330272 84309876 91685518 100442973 115433953 140868294
19522A40868294L6840613M1204369L3629511K0104258O54196k0476044k7597467
$$ 140868294 177708907 218913276 252542787 272647045 273301241 252825197 225227730
19515B25227730k2584325j4748326j0462183j1335956j4227407j3746581j0801352
$$ 225227730 202643405 187895079 177432896 166096940 151869533 138122952 127321600
19508A27321600q383574n955946l604905j902453k091423l214199k677955Q0730
$$ 127321600 118938026 112982080 109377175 107474722 105383299 102169100 99491145 99571875
19500I9571875L001354O248534R553616J3333295J8144371K5665231L8826930
$$ 99571875 102573229 108821763 118375379 131708674 149853045 175518276 214345206
19493B14345206N7034807O7566885M7636693J0071879j5099643k7765723m1258007
$$ 214345206 271380013 338946898 386583591 396655470 381555827 353790104 312532097
19486C12532097m8863875m5458399l4371213k3510617j6462208j1933919r023882
$$ 312532097 263668222 218209823 183838610 160327993 143865785 131931866 122907984
19479A22907984p493515o881929o823605o280724n358876m563008l711687l412070
$$ 122907984 115414469 108532540 101708935 95428211 90069335 85506327 81794640 78382570
19471G8382570l052819k740114k664492k616654k455553k132274j751398j644667
$$ 78382570 75329751 72589637 69925145 67308491 64852938 62720664 60969266 59324599
19463E9324599j423009j160889o42023m43031k55065n52447j281262j399931j462856
$$ 59324599 57901590 56740701 56098678 55655647 55400582 54848135 53566873 52166942 50704086
19454E0704086j476408j702562k170180k313897k475124k263873k193172j961764
$$ 50704086 49227678 47525116 45354936 43041039 40565915 38302042 36108870 34147106
19446C4147106j869013j850420j821702j672402j443212j359005j381746j298522
$$ 34147106 32278093 30427673 28605971 26933569 25490357 24131352 22749606 21451084
19438B1451084r91545r42667j122363j169867j071218q43674r67187o63050o99949
$$ 21451084 20459539 19516872 18394509 17224642 16153424 15309750 14342563 13679513 12979564
19429A2979564p36102n36065n29482m71912n99827n14358l63877m25330n65959
$$ 12979564 12243462 11707397 11177915 10706003 10106176 9591818 9227941 8802611 8236652
19420H236652n83429m40984k80765k16930j98431l12642k41178l98651l88666
$$ 8236652 7653223 7212239 6931474 6714544 6516113 6203471 5962293 5563642 5174976
19411E174976l67101k71854k86020q0983q6237k27790j87871j39891p7563j91639
$$ 5174976 4807875 4536021 4250001 4169018 4082781 3854991 3667120 3527229 3449666 3258027
19401C258027k19939l4663m4784l1062k69397J03322J88745q2293j07853l1465
$$ 3258027 3038088 3003425 2958641 2927579 2658182 2761504 2950249 2867956 2760103 2728638
19391B728638k17218j92031k45463j88904n2198j66614k05741j39780q4401O3041
$$ 2728638 2511420 2319389 2073926 1885022 1832824 1666210 1460469 1320689 1236288 1299329
19381A299329J08759j4442P158m0172k25564m2780J69623r9358r0646L71141J22709
$$ 1299329 1408088 1393646 1400804 1360632 1135068 1092288 1261911 1162553 1071907 1443048 1565757
19370A565757J02791n9366j13870K6813J35518j19140k3896k4623r2579j5399
$$ 1565757 1668548 1609182 1495312 1522125 1657643 1538503 1514607 1489984 1397405 1382006
19360A382006K1646m9134j73772j99482J70686J34966J32994j8309l5299k04788
$$ 1382006 1403652 1354518 1180746 981264 1151950 1286916 1419910 1401601 1366302 1161514
19350A161514J75150m1125Q0113j71825j59178J14926K51674J71137j6964P6079
$$ 1161514 1336664 1295539 1375652 1203827 1044649 1159575 1411249 1582386 1565422 1641501
19340A641501j8460k3410j03701m6921J13154J77238p7219j01985J7394o86l2289
$$ 1641501 1623041 1599631 1495930 1449009 1562163 1739401 1662182 1560197 1577591 1576905 1544616
19329A544616P0380j73745j49104J27210J65433J99142j21682L0643O0080O76
$$ 1544616 1614996 1441251 1292147 1419357 1584790 1783932 1662250 1692893 1752973 1753649
19319A753649n9134K7193J75374O4472k9087m7065o1660n4481r5354J62858J46015
$$ 1753649 1694515 1721708 1897082 1961554 1932467 1885402 1823742 1769261 1673907 1836765 1982780
19308A982780j52814O281m2873p8577o4448p4564j06085K16745J30450k61850
$$ 1982780 1829966 1836247 1793374 1714797 1650349 1575785 1469700 1686445 1816895 1555045
19298A555045j46562p6066J42591J24952K0647q172j18918n7259l9054J34222
$$ 1555045 1408483 1332417 1475008 1599960 1620607 1612435 1493517 1436258 1397204 1531426
19288A531426j11114o1099m6202l148O3903k4128M1009j07790j40375r4313M9781
$$ 1531426 1420312 1359213 1313011 1309863 1373766 1349638 1390647 1282857 1142482 1048169 1097950
19277A097950Q1952K4834Q1431R7114o2388l9576o9161J567L12o4153J666m7229
$$ 1097950 1179902 1204736 1286167 1383281 1320893 1281317 1212156 1213723 1214035 1149882 1151548 1104319
19265A104319N790j8163j04514j40077m6076P1946O4805j44503j23000N4559m6290
$$ 1104319 1110109 1091946 987432 847355 801279 873225 938030 793527 670527 725086 678796
19254F78796j09822m1406m9021N439k6233k0323K10537K38415L2819j4923J05070
$$ 678796 568974 527568 478547 483986 457753 437430 647967 886382 919201 904278 1009348
19243A009348j38125j44185R0250N0949j3444j47429Q020N3133j2214j72727j15889
$$ 1009348 871223 727038 817288 868237 854793 707364 715384 768517 756303 583576 467687
19232D67687J382P3744j59449o2086K12193J51989j13208o0607j08134L8519O7632
$$ 467687 469069 542813 383364 321278 533471 685460 572252 511645 403511 442030 509662
19221E09662j19492j69049r6943R3325J68467J0235l7667J22662J28935K9582
$$ 509662 390170 221121 124178 217503 385970 396205 358538 481200 610135 639717
19211F39717n2516o4281l7123k8809J36522n447k03668O7359J05634J55116o5786
$$ 639717 587201 522920 485797 456988 593510 588063 384395 451754 557388 712504 646718
19200F46718j70283r8842m6946J59340Q5784j61795j67188k3447J22004M0352
$$ 646718 476435 377593 330647 489987 575771 413976 246788 223341 345345 385697
19190C85697j031O6891R1488k0568k4114N4721J11762P3149p2006l897L0588j6355
$$ 385697 384666 451557 543045 522477 498363 553084 664846 737995 665989 662092 692680 676325
19178F76325m4487K2665J68421r3024l20528p0932n3089j10200l8405J19062J59394
$$ 676325 631838 654503 822924 729900 409372 338440 285351 175151 136746 255808 415202
19167D15202J35429L1624k9612j08740N383M0167M6474J25112j60313k52726p2046
$$ 415202 550631 582255 552643 443903 449286 489453 535927 661039 500726 248000 175954
19156A75954J58986L3552L7163J83639O2492j48972o7851n3094k30860J0752J64610
$$ 175954 334940 368492 405655 589294 651786 502814 434963 381869 151009 161761 326371
19145C26371j104j33287J48910J7118j0106O4192O748L7838j22210M3829j32636
$$ 326371 325267 191980 340890 358008 347902 412094 418842 456680 334470 378299 245663
19134B45663N087J1032J43474j21627o1601J30890J82805O1704j57041m3167o812
$$ 245663 250750 261782 405256 283629 222028 352918 535723 597427 440386 397219 390407
19123C90407o9283J37675M264j4933j02320n3432n516p3142P8061J13714j26980
$$ 390407 321124 458799 463063 448130 345810 292378 286862 213720 291781 405495 278515
19112B78515J8121J8544J54098M8180K9884r1453j54003j18786k1211O0768J74131
$$ 278515 296636 315180 469278 517458 547342 455889 301886 183100 161889 222657 396788
19101C96788J17567m1900K2455O0639m8262n700M4377j46228j35241r3630J88937
$$ 396788 514355 472455 494910 555549 507287 501587 545964 399736 264495 170865 359802
19090C59802J6386j01365n1553m7443K70522J45194j27202k46117q3894P241O4282
$$ 359802 376188 274823 223270 175827 446349 591543 464341 218224 134330 141571 205853
19079B05853N4345P4272J14056l0937k15268n3605J89530l1808p4940J24775q4030
$$ 205853 260198 334470 448526 417589 202321 148716 338246 306438 231498 356273 272243
19068B72243N275Q1909Q6238O5343j39186j13327J06998O3467n7269n9097p446
$$ 272243 277518 359427 445665 511008 371822 258495 365493 428960 371691 312594 305148
19057C05148Q2388O5403r3758l8320M3336O2486J3578J03293o0669q8183J0301
$$ 305148 387536 452939 359181 320861 364197 426683 440261 543554 482885 394702 405003
19046D05003M6966J77773j72103j33886N7924K03698L9901o0051j47506q3658
$$ 405003 451969 629742 457639 323753 381677 585375 625276 565225 417719 334061
19036C34061K08981Q9276m8004k789j61730p4952j4332m8439o3448Q3358J52039
$$ 334061 543042 632318 584314 581525 419795 344843 330511 282072 218624 301982 454021
19025D54021l2487o3563N5467J58063q5930L4852L3823k9577R3237L1177j36887
$$ 454021 421534 357971 413438 571501 485571 520423 554246 524669 617906 649083 512196
19014E12196k68715R1899L4712j6782r2627Q363J04441O0493P7421o9857J07813
$$ 512196 243481 335380 370092 353310 260683 269046 373487 433980 511401 441544 549357
19003E49357J06370K9308l7692j46599j50539j5002j53295P9330J21949P3481
$$ 549357 655727 685035 647343 500744 350205 335203 181908 261238 383187 456668
18993D56668Q9001J9823k8477j80328K9705J72055L11774j9243k74942o3610Q3897
$$ 456668 545669 565492 537015 356687 386392 558447 870221 850978 576036 512426 596323
18982E96323l6978r6399J9940N6468J86871J30779J58000M1296p1633j8801J11285
$$ 596323 559345 462946 482886 539354 726225 857004 1015004 1056300 984667 965866 1077151
18971A077151J07669j25588n2671M3702K3676j17299j51860j480j80197k2186
$$ 1077151 1184820 1059232 1006561 1050263 1073939 956640 804780 803300 623103 600917
18961F00917J57705O1618L5587o6217k7463o9958M6471O4978J80933J10845j35943
$$ 600917 758622 820240 855827 789610 762147 692189 738660 803638 984571 1095416 959473
18950I59473J13085J18425j27392j37596k59R461k6328R1994L31142K44601J682
$$ 959473 1072558 1190983 1063591 925995 925736 935197 908869 1000863 1332005 1576606 1578288
18939A578288j20651j21014r7316N3235j92659o2066j71823j787M397O0585p1510
$$ 1578288 1457637 1336623 1239307 1292542 1099883 1037817 865994 864207 868604 929189 857679
18928H57679j68441j15708j0539l8898l5458J12639M1196K97885O9401N9257M0115
$$ 857679 689238 573530 562991 524093 488635 601274 642470 940355 1009756 1069013 1109128
18917A109128K9620N8860o0572j30414j66791M596l4779K3280Q1635r644p6842
$$ 1109128 1138748 1197608 1137036 1006622 839831 844427 809648 832928 914563 904919 828077
18906H28077J00360J35751J7899j71281K0017J18682k5629k8971q8385k71687
$$ 828077 928437 1064188 1082087 910806 930823 1049505 1023876 994905 906520 634833
18896F34833k35581J62926J38880l3709j7172J55460K31336R5986o1855o1605
$$ 634833 399252 562178 701058 667349 650177 805637 1036973 1132959 1071104 1009499
18886A009499n6278K22573K02914j16236k21021J4967L588K7081j29820q3962
$$ 1009499 953221 1175794 1378708 1262472 1041451 1056418 1060006 1087087 957267 873305
18876H73305m2396o4055l5655o4905p6110J13690O8711j4596q3483m4209j7079
$$ 873305 830909 766854 731199 666294 590184 703874 772585 757989 674506 630297 613218
18865F13218N3477o3404J0120k9069J4190Q9707j20796j21561j05557j10609M7439
$$ 613218 666695 603291 613411 584342 598532 688239 567443 445882 340325 229716 277155
18854B77155L3331K4623N4197O0826n388N373o4635j19827r1500J20035J59611
$$ 277155 310486 335109 389306 450132 444744 450117 385482 265655 174155 294190 453801
18843D53801P9500l1432o3070N7304L5497M3181l4677j93232n3288o400L4117
$$ 453801 533301 501869 438799 496103 531600 574781 540104 346872 293584 287184 321301
18832C21301O5305N2874m9930Q1755m357j53139M1074J86464k6494j4640J04926
$$ 321301 386606 439480 389550 471305 466948 313809 354883 541347 514853 500213 605139
18821F05139J514K9752J04264o6402j32227Q2243J56182r9419j25199m2470k2603
$$ 605139 606653 636405 740669 674267 542040 624283 780465 681046 555847 513377 490774
18810D90774R4621k4707r2572k7438J9007O6449M9619N1033r1161Q3698K2709
$$ 490774 585395 560688 468116 440678 459685 526134 575753 626786 535625 619323 642032
18799F42032J7404K6029N4857R0353Q5758M3251j1898o3517M0123R6535Q7025
$$ 642032 659436 685465 740322 830675 916433 959684 947786 884269 924392 1020927 1107952
18788A107952J01803n6940j15164l4529r6096J0786j4831r8185k36981k6985J6829
$$ 1107952 1209755 1152815 1037651 1003122 907026 917812 902981 804796 567815 540830 557659
18777E57659L9720J33645o2286p4866M8569l9409M3636j22270L3946Q2738l4384
$$ 557659 597379 731024 668738 593872 642441 603032 646668 524398 558344 641082 606698
18766F06698q3018J82602N9662N8666R198n826l0351j48941j20088N4288q0045
$$ 606698 523680 706282 765944 824610 833808 827982 797631 648690 528602 582890 502845
18755E02845L1512O5114r6361l5026K08041j293p9885j41609K9786R0663J96624
$$ 502845 534357 599471 503110 468084 676125 674832 594947 453338 483124 573787 770411
18744G70411o1891q295K4176J8468J01063l28268j52864N496J06003J9031K235
$$ 770411 708520 700225 724401 742869 843932 515664 362800 368296 474299 493330 495565
18733D95565j7509j40016N7658J85266R7762j38946k44663l6374K1901Q3902J14816
$$ 495565 478056 338040 395698 580964 678726 539780 295117 258743 280644 364546 479362
18722D79362q6158P9002q2807j70740N9824j9485J29548Q5002J05613L74j26821
$$ 479362 393204 472206 389399 218659 278483 258998 388546 473548 579161 579535 452714
18711D52714P6274j28640j33546n1986M1559M510J5843q331J17638J37360l0022
$$ 452714 528988 400348 266802 214816 256375 260885 276728 268397 386035 523395 493373
18700D93373j81660j69537k4579K12437J250j09911l980j1549j11281L1038Q8864
$$ 493373 311713 142176 117597 330034 331284 221373 217393 205844 94563 125601 214465
18689B14465p573j20912L1156J65087m1067j08775K3014J80956M8526R9928o3471
$$ 214465 206892 85980 117136 282223 241156 132381 155395 336351 384877 484805 421334
18678D21334q1266J8555p960L6665q0034j10099J10464J62454j6856n2657p339
$$ 421334 340068 358623 350663 387328 307294 197195 307659 470113 453257 400600 393261
18667C93261J5233j142j92136k64255q5090J58217J51795J70802K2323j3886Q6837
$$ 393261 408494 407352 215216 -49039 -134129 24088 175883 346685 369008 355122 441959
18656D41959K2552j17481j80699j50702Q3892J33116J21860J29244o169n1595
$$ 441959 464511 347030 166331 15629 99521 232637 354497 483741 477572 425977
18646D25977k9262j41531M2096j30414j3950Q8896L600p5988J23456J53605L0660
$$ 425977 396715 255184 297280 166866 152916 241812 245412 169424 292880 446485 477145
18635D77145q622k4200o2875k2643L9602M3835J07994j10679j97300P6997m1932
$$ 477145 468523 444323 381448 358805 398407 442242 550236 439557 242257 319254 277322
18624B77322k5961l7504p3553q0987k8282J85546J1149k2024K9342p85M5533M4204
$$ 277322 251361 213857 140304 59317 31035 216581 227730 205706 235048 234263 279796 324000
18612C24000n0848J29981j24860j2203J23805J92J20416q0346K6351K9137J9934
$$ 324000 273152 403133 278273 266070 389875 390067 510483 430137 456488 485625 505559
18601E05559j70028q0872N2914J5883j33685M6149O1758n0366O4822K06472l0583
$$ 505559 335531 254659 307573 323456 189771 235920 297678 247312 312134 518606 488023
18590D88023j36333o2991J14820P9051J35872r6159l6513J1931l6354r6956j50714
$$ 488023 351690 288699 403519 482570 618442 522283 485770 497701 461347 364391 213677
18579B13677J56790J71635J05859k7102k39877j12065K10526J12066j1851L6141
$$ 213677 370467 542102 647961 620859 380982 268917 479443 591509 579658 615799
18569F15799k08960j22464M2640N2357p0748k3289k5250k2572o863N2809K5238
$$ 615799 406839 284375 327015 379372 308624 285335 260085 237513 230650 283459 308697
18558C08697m2945J6918J17996J3115j19910q2402M4519J6645J17936P777j72131
$$ 308697 265752 282670 400666 413781 293871 211469 255988 272633 390569 398346 226215
18547B26215k0522J37530Q2658l20054j37306J42103J03941L8824j47854J0337
$$ 226215 205693 343223 425881 105827 -31479 110624 214565 253389 105535 115872
18537A15872J36137L1845J37867k3626j01109q7403M8775J55556N1124j16216
$$ 115872 252009 283854 421721 398095 296986 209583 258358 413914 465038 348822
18527C48822J58554l8279j22570O3195J21305r6471j7811J568J2946J63925p8822
$$ 348822 507376 469097 346527 409722 531027 434556 416745 418313 431259 595184 516362
18516E16362L1102l4627P0878p2547q5747R9538J02809l8373r0622N3503J8957
$$ 516362 547464 512837 583715 511168 425421 524959 627768 589395 498773 552276 571233
18505E71233j0772m129j0122N8226J54360O7808k4160l4094k0084n4619j82491
$$ 571233 560461 556332 546210 604436 758796 826604 802444 768350 748266 693647 511156
18494E11156j40240m0246l3924M6914R3652J066j435k6986k7175o362N2366J42733
$$ 511156 370916 330670 296746 343660 437312 438378 436943 409957 382782 376420 428786 571519
18482E71519K8146k5059K8893j3329r0786n9586N2304N2793p988m8932j35815
$$ 571519 599665 574606 603499 590170 499384 439798 492102 544895 536907 487975 352160
18471C52160M4997k965Q9518p9834j27889n8749L7830l3159J92756P2489j58494
$$ 352160 397157 394192 483710 403876 275987 217238 255068 221909 414665 487154 328660
18460C28660J18476j14531k1327N1426j3728O1026J21797J69898O7068K5665j2353
$$ 328660 447136 332605 311278 362704 348976 410002 531799 701697 768765 794430 782077
18449G82077K1159p7159o5846j14596L4023r7956r1015j41543k9888K22431J84201
$$ 782077 803236 726077 660231 545635 579658 481702 390687 249144 219256 441687 625888
18438F25888Q4448j14843l9487r5879O3943p378j02342n0373K9285J01480J23253
$$ 625888 710336 595493 556006 460127 524070 516692 414350 363977 393262 494742 617995
18427F17995L0960j37904M1609r09J3510k62974q306M2775J24550p4670P4203
$$ 617995 648955 511051 552660 551751 565261 302287 293981 336756 461306 386636 460839
18416D60839Q1864O4401j5854j48666L0544l3770J16570o559j93190R098J53850
$$ 460839 542703 607104 591250 442584 473128 439358 555928 549369 356179 365277 519127
18405E19127q1641K5754N3711k9143J58533n4276r4120j57312M3828J01024p4679
$$ 519127 437486 463240 516951 487808 646341 592065 497945 340633 384461 485485 410806
18394D10806J63288k7819k4099j22504l4264J01383Q797N7679l6515o7026R262
$$ 410806 574094 546275 522176 399672 365408 466791 475588 533267 496752 429726 438988
18383D38988J15182l748n3837p3575q5283J29149K30757L3347J8116P0484l6480
$$ 438988 554170 550422 496585 423010 337727 466876 697633 730980 749096 819580 783100
18372G83100L6973J29685J00113j52229M736l1980o0758Q7440R6916M5462J21453
$$ 783100 820073 949758 1049871 897642 902378 870398 809640 897080 993996 1039458 1160911
18361A160911p1009Q8263O8337O8488n4914m3034j15202J06697J95541j24488
$$ 1160911 1089902 1178165 1246502 1314990 1260076 1217042 1101840 1208537 1404078 1279590
18351A279590r2747j20305M512J7922R8148J04584N2838j27218N640P2446O7527
$$ 1279590 1186843 1066538 1071050 1088972 1187120 1291704 1344542 1217324 1222964 1295410 1362937
18340A362937J21727J5023j06445J6429K01229J32454R8406L1204j02789r5129
$$ 1362937 1484664 1499687 1393242 1409671 1610900 1743354 1841760 1872964 1770175 1675046
18330A675046J5754J02743Q7386o11O3861M0964r1760J04035N4045Q2540M9321
$$ 1675046 1690800 1793543 1880929 1880318 1944179 1985143 1893383 1997418 2051463 2134003 2183324
18319B183324M2630K25732J25747P1441M0337J19932l4365r7792N199K16168K79321
$$ 2183324 2225954 2451686 2577433 2648874 2689211 2809143 2774778 2676986 2682185 2898353 3177674
18308C177674J78506J11726K79506J25385J42524L044n7147J05528J60343K14466
$$ 3177674 3356180 3467906 3747412 3872797 4015321 4018365 3961218 4066746 4227089 4441555
18298D441555L77155K78541L26242J94205K15540J78556O9549L07271M00170L24428
$$ 4441555 4818710 5097251 5423493 5617698 5833238 6011794 6081343 6388614 6788784 7113212
18288G113212L75067P90847R63267J046005J607023J874519K274962L073651M107292
$$ 7113212 7488279 8279126 9242393 10288398 11895421 13769940 16044902 19118553 23225845
18279B3225845N586546P973545J1828904J7201448K1665974J8814246O037304
$$ 23225845 28812391 36785936 48614840 65816288 87482262 106296508 112333812
18272A12333812j0508252j9165932j6853629j1773904p853074n277827l711977
$$ 112333812 101825560 82659628 65805999 54032095 46179021 40901194 37189217
18265C7189217k704973j812188j123131m88402K4939P59381J572978K598974K995306
$$ 37189217 34484244 32672056 31548925 31060523 31085462 31844843 33417821 36016795 39012101
18256C9012101K862456K683238L174138M586295P093357J0969524J6297515K2352419
$$ 39012101 41874557 44557795 47731933 52318228 59411585 70381109 86678624 109031043
18248A09031043K5066488J8978539P697940l00606m807442r973275j6286237j9553175
$$ 109031043 134097531 153076070 160774010 160473404 155665962 145692687 129406450 109853275
18240A09853275j6997502j2047128p974317n027368l800604l728106l728170l286803
$$ 109853275 92855773 80808645 72834328 67806960 64006356 60278250 56550080 53263277
18232E3263277k993086k561313k086378j197724o43146J22226Q64177J630854
$$ 53263277 50270191 47708878 45622500 44424776 43781630 43903856 44768033 46398887
18224D6398887K870828M467475O847451J0448932J5422661J9061379J5511119
$$ 46398887 49269715 53737190 60584641 71033573 86456234 105517613 121028732
18217A21028732K988048j1917678j8791044j6000323j1338096q012120n769049
$$ 121028732 124016780 112099102 93308058 77307735 65969639 57957519 52188470
18210E2188470m250755l622826l097464k446212k263475k093314k002676j663008
$$ 52188470 47937715 44314889 41217425 38771213 36507738 34414424 32411748 30748740
18202C0748740j318174j532048j412186j214342j028894q39559j027912j021644
$$ 30748740 29430566 27898518 26486332 25271990 24243096 23403537 22375625 21353981
18194B1353981p53496o80647n15437l97701n22130m52489l66680l80243k46888
$$ 21353981 20600485 19919838 19404401 19006700 18484570 18032081 17665401 17285158 17038270
18185A7038270l79235p10929o11702n99351n28103n16361o55371p63718o42300
$$ 17038270 16659035 15948106 15336404 14737053 14208950 13692589 13037218 12273500 11631200
18176A1631200o79856n61666m72827n73985n02144m43081m31223m93975m59160
$$ 11631200 10951344 10389678 9916851 9342866 8840722 8397641 7966418 7472443 7013283
18167G013283m16138l54443l41912k46814k29331m25298k48181k01786l36880
$$ 7013283 6597145 6242702 5900790 5653976 5424645 4999347 4751166 4549380 4212500
18158D212500j51731j64388k63868j9259k32707j59890j84032j07792j32332j03356
$$ 4212500 4060769 3896381 3632513 3613254 3380547 3220657 3036625 2928833 2796501 2693145
18148B693145o6515j67278j6198r2458j24872j85646k35295j59858j1295N945
$$ 2693145 2626630 2459352 2443154 2350696 2225824 2040178 1804883 1645025 1633730 1639675
18138A639675p5034q9322J921k21999k6097J84248q7356k59578j46098j30865
$$ 1639675 1564641 1475319 1477240 1255241 1229144 1413392 1326036 1066458 920360 789495
18128G89495J15682k8734j59075J68112J43675q1303j16493o6818Q3650J6743
$$ 789495 905177 876443 717368 885480 1029155 947852 831359 764541 848191 864934
18118H64934j338j8346K5705p6701P9848P5815m3714j18576n6131L1069j17956
$$ 864934 863596 845250 870955 794254 874102 949917 906203 787627 731496 762565 644609
18107F44609J09137L8221N3573k52007j95218L2415j22519J36263J49586O4002
$$ 644609 753746 791967 845540 593533 398315 430730 308211 444474 594060 658062
18097F58062N2653M2893j559o3913J48707J73807j19455k02519p3559q4298j8957
$$ 658062 710715 753608 752049 688136 836843 1010650 891195 688676 615117 530819 511862
18086E11862J25605Q1013k08742j29524m0104J79876K30225Q0779J1488p8188
$$ 511862 637467 718480 509738 380214 340110 519986 750211 830990 842478 764290
18076G64290J6556P2603j23962K4094J02301p0331p6133Q7581o2696L0997R55
$$ 764290 780846 853449 729487 753581 855882 785551 709418 796999 734303 765300 766255
18065G66255r0563O142k5974L02658O7150j92886o4090N6970j6365j03996o7041
$$ 766255 675692 681834 655860 958518 1025668 832782 768692 825662 809297 705301 638260
18054F38260R4067J38630o3339j86301L7426J68402K6103j4213m1765J72787N463
$$ 638260 732327 870957 807618 621317 658743 827145 853248 839035 797270 970057 975520
18043I75520k76416j84262O6816K626L7000J5994J07069P235q5882o9395L792
$$ 975520 699104 514842 581658 584284 621284 637278 744347 751582 665700 596305 600097
18032F00097j22404r3246K295L88027J04950j72434p8076l4287l4585l3026k8059
$$ 600097 477693 384447 386742 774769 879719 707285 629209 594922 560337 527311 499252
18021D99252N5779j8323m1997j6854m0731l1876m3550k9454p1559P9035n4190
$$ 499252 555031 536708 494711 477857 437126 405250 361700 332246 260687 339722 285532
18010B85532p8860k3237Q0644J33543J46183k12047r819M1971j08815l8376K9455
$$ 285532 206672 183435 264079 397622 543805 331758 321939 363910 255095 216719 246174
17999B46174M4589J63370J1681k6701L6858O1755k05361j45123K6780j9452r7708
$$ 246174 290763 454133 465814 439113 475971 537726 332365 187242 214022 194570 96862
17988I6862n1348l2990k0880R0070r1063L743J10826J74369Q517j52224r4785
$$ 96862 45514 12524 -8356 81714 -9349 -5606 105220 279589 288106 135882 41097
17977D1097k4015R0113N8449k9768j00594J53545O4278j8528P2696l7070m7280
$$ 41097 17082 107195 165644 135876 35282 188827 253105 234577 307273 270203 222923
17966B22923p8568l0962J20823q2254j00672j6194o2123j19364O6345J43479J62143
$$ 222923 144355 113393 234216 151962 51290 35096 -27027 -146391 -80046 63433 225576
17955B25576l5537O3552K1841k3102K9330j57341k48972L0424K64631R5316o1111
$$ 225576 190039 253591 275432 252330 281660 124319 -124653 -94229 170402 265718 204607
17944B04607O0389P8730M3723m015j40233j51145J28286k2150K102Q6092m4999
$$ 204607 264996 343726 387449 383434 243201 92056 220342 198192 200294 286386 241387
17933B41387o0114J56661N3281r7626j32730n1352M0615J3486m8410m5396o4949
$$ 241387 181273 337934 391215 293589 160859 109507 150122 163608 115198 69802 4853
17922D853M9827J29841j03468n9820n5409P3736M9766P087l5817n1534J67354
$$ 4853 54680 184521 81053 21233 -34176 39560 89326 96413 60596 9062 176416
17911A76416m2674K2105j20908J56401M3289j20296O6155K8236r3365p745J37210
$$ 176416 133742 155847 34939 191340 234629 114333 180488 208724 115359 107614 244824
17900B44824M8491J08436j60687r3293r9410j47226m4326Q7728J73939O1040j4619
$$ 244824 293315 401751 241064 147771 48361 -98865 -143191 -55463 118476 179516 164897
17889A64897J9982m1805l8635N3040L1639k01963k33632q9372L36980Q6566r5799
$$ 164897 184879 143074 104439 157479 189118 -12845 -246477 -335849 1131 87697 -8102
17878h102J0165q650O2814m4576N0590K1155l4366L8230N5569r9300O9970l1251
$$ -8102 2063 -6587 56227 11651 62241 83396 49030 87260 142829 43529 113499 82248
17866H2248j60976J8187J29990l4872p5994j30874j90566P7083P0064K2977K5736
$$ 82248 -78728 -60541 69449 34577 -41417 -172291 -362857 -285774 -215710 -192733 -166997
17855a66997P7615K3157J32465O9046m4370L6882M6808j96731j91649M0598p54
$$ -166997 -89382 -66225 66240 135286 90916 127798 174606 -22125 -213774 -173176 -173930
17844a73930Q4744K09659L6666O381j9456r2692O75k0493o8748M6951J40693M0130
$$ -173930 -89186 120473 157139 163520 144064 51372 52047 31554 -37194 9757 150450 190580
17832A90580L5927R020j4410k2918j82246n8876R9188p9856p8265N0370L1172
$$ 190580 226507 235527 221117 198199 15953 -42923 56265 -23591 -101856 -51486 -20314
17821b0314o7161J8167K7400L6983l3002N8430J52775L4687j6438j33156l3849
$$ -20314 -87475 -69308 -41908 -4925 -37927 20503 173278 207965 191527 58371 24522
17810B4522n5420m3428J50979l6894j39240J21875q0194J4136J08787m0989N7430
$$ 24522 -30898 -74326 76653 39759 -99481 22394 -57800 -43664 65123 24134 81564
17799H1564k6551j33322k7194N7355p2787R491M5566L0496k9917O0560K9420j27415
$$ 81564 55013 -78309 -105503 -48148 -120935 -111444 -65878 -35382 -65299 -4739 24681 -102734
17787a02734M0161n7424q340j3995K12197j0803J63883J05877K986m2036N084
$$ -102734 -62573 -119997 -128337 -142332 69865 59062 222945 328822 331808 289772 294856
17776B94856p0318k36853j26075J54607q7646j39931J48027K17223L9619q6298
$$ 294856 224538 -12315 -138390 16217 -71429 -211360 -63333 153890 193509 107211
17766A07211j06153M803l8302m5325J10772q1175J83590n8747N2657Q0228L8266
$$ 107211 1058 5861 -32441 -77766 33006 -48169 135421 76674 129331 209559 247825
17755B47825L1952r5160j02388K7942q4709N6250k63553K5185K43347J41803L1721
$$ 247825 279777 184617 82229 110171 25462 81712 -181841 -156656 86691 228494 260215
17744B60215o689j0142p7592j4903L0684o4521r6325J7574q6691n0158P6798J35534
$$ 260215 253526 243384 165792 150889 181573 117052 20727 38301 -48390 -98548 -21750 113784
17732A13784J5285K01162O2670Q2666j08549j20463P3874J27843R465N1486k1087
$$ 113784 129069 330231 392901 475567 367018 246555 320429 448272 457737 509223 488136
17721D88136L2802j37938l2585q0743j05163J2635n5650O1817n2715O7201N8863
$$ 488136 520938 383000 350415 269672 164509 177144 121494 183311 130596 197797 256660
17710B56660o4853j36082n2458M4873Q3209K57421N2179o1352J26152J90265N7881
$$ 256660 191807 55725 3267 48140 131349 388770 440949 379597 505749 696014 753895
17699G53895O9253J24719r0390p2250j68542q3908N8498j1500J8027M7732j25674
$$ 753895 823148 947867 857477 785227 616685 532777 591275 579775 597802 645534 519860
17688E19860k75335L5532J12050o6803k27668j19583Q4239O8508J45660J67663
$$ 519860 244525 280057 392107 325304 97636 -21947 62292 130800 276460 444123
17678D44123k3827o2787j8326J6633j16518l9676m8192K07978K27083q702j39777
$$ 444123 420296 357509 339183 355816 239298 199622 151430 359408 586491 577789 438012
17667D38012K57493M6423k10722k17517l3923J22310l4245l7538M1103j2607m0285
$$ 438012 695505 741928 531206 313689 279766 402076 367831 330293 371396 358789 318504
17656C18504l9951k42190R976k1167J4745M1678M890o0168q6817J8390L6833Q0060
$$ 318504 278553 36363 46339 25172 39917 81595 86485 26317 -60500 -42110 -5277 74783
17644G4783O9280J26096k4170p2962N0300m8233O6338J11691L4449l3785J0513
$$ 74783 144063 270159 245989 173027 223327 175094 241432 353123 387572 353787 364300
17633C64300R1769L8601j64331k42029j6314O1613J4950j35549j11410J20329
$$ 364300 456069 494670 330339 88310 71996 133609 148559 13010 -98400 21929
17623B1929j5503j612m4149J79532J59657l5772r174o1813n1265o1525j50559
$$ 21929 6426 4814 -39335 140197 299854 264082 254908 193095 141830 80305 -70254
17612g0254j34563L2956m274M2621m2485M7824j4214J11479J2545j29817r9431
$$ -70254 -204817 -171861 -176135 -133514 -175999 -128175 -142389 -30910 -18365 -148182 -247613
17601b47613N1606P7642o5263J04806J45587K1588j24897M7888p190K1731Q5519
$$ -247613 -196007 -118365 -183628 -78822 66765 88353 -36544 11344 4154 25885 111404
17590A11404j53946q2234j21692n0495Q3661J1j38300J82793J32394K4668J7410
$$ 111404 -42542 -124776 -246468 -296963 -213302 -213291 -351591 -168798 -36404 -11736 5674
17579E674O4344p5831j78201Q0402O8965K8174R2986O5342j40995l3854J27946
$$ 5674 70018 -5813 -184014 -103612 -34647 -6473 86513 151855 10860 -22994 104952
17568A04952R2290p1593m3109k9019p4597Q107J43323p2052p9847O4692J937R3555
$$ 104952 197242 125649 82540 53521 -21076 -12969 130354 58302 -21545 43147 45084 138639
17556A38639j5900m4287P7204l2412j23904o7143Q3891j21418n1511N8595K04331
$$ 138639 122739 78452 155656 123244 -660 -67803 16088 -105330 -156841 -98246 106085
17545A06085m7261J6470J30267M0477j40192o6190J9891M5049Q102j10170L2084
$$ 106085 58824 75294 205561 246038 105846 39656 59547 104596 112698 2528 34612
17534C4612l1949p9890j86437M9282J08812Q4597q220Q5848j7715j12067j9997
$$ 34612 2663 -77227 -263664 -214382 -105570 -20973 -29193 56655 38940 -73127 -93124
17523i3124o2012L0500k6250K6115J43033K03243m3902N339m4734j27000p8131
$$ -93124 -155136 -124636 -150886 -124771 18262 221505 177603 182942 138208 11208 -66923
17512f6923M5321J47451k1594k552o290p5958j21290k24067Q410O2204O8025l7867
$$ -66923 -21602 125849 104255 101703 95413 19455 -101835 -325902 -317492 -255288 -187263 -225130
17500b25130M272M2295K73825K22063l7055j94945j46342L9279l446P8739P1421
$$ -225130 -220858 -178563 95262 317325 280270 85325 -61017 -21738 -25184 53555 124976
17489A24976j20420P7019K2999n4377l3206Q8564l3258j41319Q9191R9197Q8368
$$ 124976 4556 81575 104574 50197 16991 105555 72297 -69022 20169 119366 207734
17478B07734o1062j07020j18416q0908K2862M4820Q6380Q2674o9182o7208m6994
$$ 207734 146672 39652 -78764 -159672 -136810 -91990 -5610 77064 7882 -59326 -106320
17467a06320o388L4575L5624L7087Q148l1507j23493n3902L9853m8170L6879J96953
$$ -106320 -112708 -78133 -42509 -5422 2726 -28781 -152274 -206176 -166323 -214493 -177614 19339
17455A9339J00650Q5160j32355j42608L3757J04775j137j28132o1042J6122K31640
$$ 19339 119989 205149 72794 -69814 -36057 68718 67581 -60551 -121593 -105471 126169
17444A26169M6403k44575j1423r331K7749R7606N4469k1166J9011Q7795o0879
$$ 126169 172572 -72003 -83426 -92757 -65008 32598 87067 65901 84912 172707 111828
17433A11828M0304m7627q9492p8291p8097p365L1027r872L0782K04216Q3791r4938
$$ 111828 152132 104505 15013 -63278 -141375 -148740 -117713 -127585 -96803 107413 191204 96266
17421I6266P272m7452L4911K9964m264K0212k9075J3604k6732L9761K3561p4269
$$ 96266 103538 56086 90997 120961 116697 136909 107834 121438 94706 134467 158028 83759
17409H3759n6095J33049P6390q7805l9530R2533p6411j34798J1701k7628o7574
$$ 83759 27664 160713 237103 149298 109768 202301 125890 -8908 2793 -24835 -92409
17398i2409L0183J0141r6992Q3875J64840K5649j51866P5597J8615o6615o5409
$$ -92409 -62226 -52085 -149077 -65202 99638 125287 -26579 49018 67633 1018 -64391
17387f4391O5407J6151p8738m5079l1664J10628O7106P5116p2637j79206j32805
$$ -64391 1016 17167 -61571 -106650 -138314 -27686 39420 114536 41899 -137307 -270112
17376b70112n8312j0554R0662J56603M4634M4861j8256J13729j00838j11926j24102
$$ -270112 -328424 -338978 -248316 -91713 -47079 -2218 -20474 93255 -7583 -119509 -243611
17365b43611J19194K3166J13220r3356j06454p0276K3971J10456j5037M1754M8362
$$ -243611 -124417 -101251 11969 -81387 -187841 -258117 -234146 -123690 -138727 -96973 -48611
17354d8611M2245l4585M4384j57979l8234O10J3926R0190N660m2295J03148L1899
$$ -48611 -6366 -40951 3433 -154546 -192780 -192170 -178244 -88054 -82394 -124689 -21541 10358
17342A0358K4456L0623r8935j72118j83332p5169k6089J15567J34958J13137K38644
$$ 10358 34814 65437 -33498 -205616 -388948 -464117 -490206 -374639 -239681 -126544 112100
17331A12100K10087r7446k52808R1958J89692o9270m1180j00080J5251P6850m3313
$$ 112100 322187 224741 -28067 63891 253583 184313 143133 43053 58304 135154 91841
17320I1841j18303j1107K3157j22316j10434P8103L118O6438J19712l418j34904
$$ 91841 -26462 -37569 -14412 -136728 -247162 -169059 -165941 -99503 20209 16791 -118113
17309a18113l1482J59987P4001j53277k14833j05992R441J63027p6484j745P9790
$$ -118113 -149595 10392 84393 -68884 -283717 -389709 -380268 -217241 -293725 -295470 -215680
17298b15680P5113N3259l2220K1111J81348j06894j60608q487Q351J73827L34266
$$ -215680 -140567 -87308 -119528 -98417 82931 -23963 -184571 -193058 -184707 -10880 323386
17287C23386p2220p9241r5833R4M3511j74666m4143N6659r8539o5487J20550n1364
$$ 323386 251166 171925 76092 76186 119697 -54969 -99112 -42453 -140992 -206479 -85929 -137293
17275a37293j64764k8692J42024J19329j43463o1351R4072J09693L8699O3345
$$ -137293 -302057 -330749 -188725 -69396 -212859 -274210 -180138 -70445 -31746 31599
17265C1599o5688o1766O9991J5021M5309J58595n2800M0191o8731r943o6082j37943
$$ 31599 -34089 -95855 -25864 -10843 34466 193061 140261 180452 111721 101778 35696 -102247
17253a02247J4206O3900j4994L5451P084N7441J4726p5752p3799r2286j9497j2906
$$ -102247 -88041 -24141 -39135 -3684 3400 60841 75567 -185 -73984 -166270 -185767 -198673
17241a98673Q849m470r5821R632Q7781j0583j33182j38232J15372K68868O2885
$$ -198673 -189824 -194294 -290115 -280483 -192702 -203285 -336467 -474699 -359327 -90459 -27574
17230b7574J04979j2063J1222p6J34316j51240j56535j1113L3771R7931L5672
$$ -27574 77405 65342 76564 76488 210804 59564 -96971 -108084 -74313 23618 59290
17219E9290j17140n7772N5213o4484J321R2645K218j6824m0717K326J03176L5616
$$ 59290 -57850 -115622 -60409 -124893 -123572 -30927 -28709 -45533 -86250 -83924 19252 54868
17207E4868j0646j91766O0697K55998O0911p225r3154K4468l157L5706k4377j2278
$$ 54868 44222 -147544 -86847 169151 230062 222837 129683 154151 150994 186700 162323 150045
17195A50045K1970M8942k2874p8253p4042l3847o8582J1174J55070j10798j39736
$$ 150045 172015 220957 198083 119830 45788 11941 -56641 -45467 109603 -1195 -140931
17184a40931R4581R7331j72307O1844m1682Q2934N7311k3720R3822p5167k35747
$$ -140931 -46350 50981 -121326 -59482 -101164 -18230 39081 15361 109183 34016 -201731
17173b01731r8324p79o772N5662O1111J33945o630K59500l3237r0951M9594r8595
$$ -201731 -300055 -300834 -307606 -251944 -190833 -56888 -63518 195982 162745 71794 121388 22793
17161B2793k2410j8054j60511k9666N1749J61636r77L6765P0264n4545l6132n1455
$$ 22793 383 -17671 -178182 -207848 -156099 5537 4560 41325 111589 57044 20912 -30543
17149c0543Q1960L4338O1137J1681l2278r6720r3319P414N5415J68065N4304j28105
$$ -30543 51417 85755 146892 158573 126295 29575 -63744 -56330 -915 167150 221454 93349
17137I3349n6251n4959L8734R5677J46920k01732j68528j08099M3624N3993j19850
$$ 93349 37098 -17861 20873 116550 263470 61738 -106790 -214889 -171265 -117272 -237122
17126b37122l5367L9184J2537p1344r9619p5571J52590K17006k041M319K7048
$$ -237122 -272489 -233305 -220768 -292112 -391731 -467302 -314712 -97706 -99747 -95428 -68380
17115f8380J13630M5831l0145q4086r7489p2349o5195L5169N6360p4211k7199
$$ -68380 45250 91081 60936 -23150 -120639 -192988 -258183 -223014 -166654 -240865 -268064
17104b68064J73732J28510P9067j42560j0972k6948j03385O7480J50873j19130
$$ -268064 -94332 34178 113245 -29315 -40287 -67235 -170620 -103140 47733 -71397
17094g1397j27550l6025J33050J28964R9188m4327j06369n3307p9908J15374l3476
$$ -71397 -198947 -234972 -101922 27042 126230 81903 -24466 -77773 -157681 -42307 -75783
17083g5783j12100j12047l5053M0568L0469m3200O7322J50609L4345J71704J25943
$$ -75783 -187883 -299930 -334983 -294415 -263946 -307146 -239824 -89215 -54870 116834 242777
17072B42777j6088j37232k23717J3872j3254k2277J60918P0925j55627j50771
$$ 242777 226689 89457 -134260 -120388 -133642 -155919 4999 75924 -79703 -230474
17062b30474m9175J14901J08903P8368M2382M2554j4019o3186j13735O8843J8549
$$ -230474 -279649 -164748 -55845 22523 64905 107459 93440 30254 -83481 -14638 3911
17051C911R8820l5783q2603j96520j9186J55008J18493j3470J2446j4196q2390
$$ 3911 102731 66948 -15655 -212175 -231361 -76353 42140 28670 41116 26920 -55470
17040e5470J02432k1310k7815L3286L6610N6652J19029m6052q8550R0684J71041
$$ -55470 46962 25652 -2163 31123 67733 124385 243414 197362 108812 199496 370537
17029C70537o9523j16393l3255L9358J13951j12138R202q6207o222j05650j80857
$$ 370537 301014 184621 151366 190724 304675 192537 201739 115532 109310 3660 -177197
17018a77197O4091J28036R9809N8149O9221n9685k28146m105K50916N1646n9638
$$ -177197 -113106 14930 114739 172888 242109 182424 -45722 -49827 201089 252735 193097
17007A93097j08539j46390J30854J0051J9522j61548k09909m2440J13039J08547
$$ 193097 84558 -61832 69022 79073 98595 -62953 -272862 -315302 -202263 -93716
16997i3716n1074q7093l119J79889N0648L9993l5280l7129N4525O9583o6395l0507
$$ -93716 -144790 -231883 -235002 -55113 -4465 35528 248 -36881 17644 87227 20832 -9675
16985i675O1589J3809k87314r614M3075M7355J26278l9970j15697J32596J10861
$$ -9675 51914 65723 -221591 -231205 -188130 -140775 -14497 -54467 -170164 -37568 73293
16974G3293m5392n4430M9850R8517K43922k3429q3968j02400o1990K3160J50807
$$ 73293 27901 -26529 23321 121838 365760 342331 258363 155963 93973 117133 267940
16963B67940Q8877n4421j11064p5824n0038o6957j12493Q0237J02522n1462j6546
$$ 267940 356817 302396 191332 115508 65470 -1487 -113980 -33743 68779 17317 771
16952G71K17512J07076k49470k02238j3651Q8110K38203l276m8840J05035P2553
$$ 771 218283 325359 75889 -126349 -140000 -51890 186313 183037 134197 239232 311785
16941C11785q9228j31206j6074O0554P7878o3305J45349K1087k50234j95658M6010
$$ 311785 222557 91351 75277 135831 213709 150404 295753 316840 66606 -129052 -83042
16930h3042M1629O0455p2766j97937P6685l4132R986P3610J12280O1536N3560
$$ -83042 -41413 19042 -53724 -251661 -174976 -209108 -199122 -125512 -13232 48304 101864
16919A01864O0032j5922n1136Q799k1337O2923J7785n7506o1672j16214Q2746
$$ 101864 161896 145974 94838 103637 82300 145223 163008 105502 43830 -72384 10362
16908A0362O003K9270m5990p3819j07643J4304J54410K7225l4657k9535j9437
$$ 10362 16365 45635 -355 -74174 -181817 -167513 -13103 14122 -20535 -50070 -69507
16897f9507J31528J8793Q0238J02530j41770Q7602M4925j2600q97j43374n0227
$$ -69507 62021 80814 161052 263582 121812 209414 254339 241739 240842 97468 47241
16886D7241O2022n3313j30357r7325J21713L3435r3326j55850O2054r3317j52964
$$ 47241 109263 55950 -74407 -171732 -50019 -16584 -109910 -265760 -203706 -297023 -449987
16875d49987J7042R9489O7723r0363q4028O0075Q2312j3573J1369Q6245J04709
$$ -449987 -432945 -333456 -265733 -356096 -440124 -380049 -297737 -311310 -299941 -213696 -108987
16864a08987r4458Q9256K08847p0718k8163J5018p5053m7224P4036J55594m5688
$$ -108987 -203445 -114189 94658 23940 -4223 10795 -64258 -111482 -37446 118148 72460
16853G2460O2304r8488k4437q574m2306o5646j11779R1625O3368l8347M4001n2985
$$ 72460 134764 36276 11839 3265 -39041 -104687 -216466 -124841 -61473 -99820 -55819 -108804
16841a08804N4849R8361j28915j74498P831q8413k871O0042N5893k6453K43833
$$ -108804 -53955 44406 -84509 -259007 -251176 -339589 -342460 -282418 -226525 -252978 -9145
16830i145L570j55090q9643k5664J24868J39703Q8106Q2541k15544j09517j118
$$ -9145 -5575 -160665 -250308 -275972 -151104 -11401 76705 159246 -56298 -165815 -166933
16819a66933L3232m2740k2005P2445Q9421M1086K7816j03867m3785k8417l422
$$ -166933 -133701 -176441 -198446 -126001 -36580 4506 32322 -71545 -115330 -143747 -147169
16808a47169o8781q255k0094J12040N1050K2432k4501j1166k8722J36105J27120
$$ -147169 -215950 -224205 -244299 -132259 -81209 -58777 -83278 -94444 -123166 12939 140059
16797A40059j15524j82227L3966J33683o4795l5268p9139l0925L0262J57916P0553
$$ 140059 24535 -157692 -123726 9957 -54838 -90106 -169245 -200170 -169908 -11992 58561
16786E8561N6419J27957k6247j9712O2899k37155k20758R3117L89j6683J8041
$$ 58561 114980 242937 216690 196978 259877 22722 -198036 -104919 -104530 -121213 -103172
16775a03172R7088K0296j67222l3630J47120n023R9520j76141q912l5745L7401
$$ -103172 -6084 14212 -153010 -186640 -39520 -44543 54977 -121164 -130076 -165821 -128420
16764a28420q7506J49542J38872q9285j78457O1963O7027K0018J57156J64362
$$ -128420 -215926 -66384 72488 -16797 -195254 -133291 -66264 -46246 110910 275272
16754B75272r1095m3962m0808p9292j42074M2969L0983J44373O4047k4420j15841
$$ 275272 184177 140215 99407 20115 -121959 -78990 -48007 96366 160413 135993 20152
16743B0152J3622q4000r1856J20374j1438j37432j44861R7074L21467K73028n5375
$$ 20152 33774 -50226 -142082 -21708 -33146 -170578 -315439 -218365 103102 376130 320755
16732C20755k89976k48732j34011m3122K16110J6896j11558J22811O5457j43572
$$ 320755 30779 -217953 -351964 -395086 -178976 -162080 -273638 -150827 -85370 -228942
16722b28942m7308N3343J36447M6452r3679L9035l3088l902L3334M5868M4570
$$ -228942 -276250 -222907 -86460 -40008 -133687 -94652 -127740 -131642 -98308 -52440 -7870
16711g870j49662r72J50471K12213N6059j48392l7669R151K0199j01574J04749
$$ -7870 -157532 -158504 -8033 204180 260239 111847 74178 83329 103528 1954 106703
16700A06703J15072j88868j66748P2065J04393k1330j31303r0959J12245l0246
$$ 106703 221775 32907 -133841 -61776 42617 21287 -110016 -200975 -88730 -118976
16690a18976m3946L9228o3229l9242O2179n0047j18117R8361J65981J17007P5352
$$ -118976 -162922 -123694 -186923 -226165 -163986 -214033 -332150 -233789 -67808 49199 124551
16679A24551n8079q7936m5813o2067M2072j00037k1452j4236J51834J0554K22740
$$ 124551 66472 -21464 -67277 -129344 -87272 -187309 -208761 -222997 -71163 -60609 162131
16668A62131R256p7150L5388n8429J924r2965J5588n2395l410R0137n8732j35470
$$ 162131 171387 94237 129625 71196 73120 -19845 -4257 -56652 -60062 30075 -28657 -164127
16656a64127n303L2222J02012K1360j9221k8963N6072j237L7207j15813q1524
$$ -164127 -169430 -137208 -35196 -13836 -33057 -62020 -5948 -7185 30022 -85791 -167315
16645a67315j25501r7059L5319J79155L7583J9253R1953l4680M0642m5951J1062
$$ -167315 -292816 -389875 -354556 -175401 -137818 -118565 -26612 -61292 -20650 -66601 -55539
16634e5539L4336j35808M0876K32123J88678N3250J3887k18038K288K0365J408
$$ -55539 -21203 -157011 -116135 115988 304666 357916 371803 153765 156053 176418 177826
16623A77826o665r6714j82763j35930k7009l5666J61870J58893n8368M4039k02919
$$ 177826 171161 74447 -108316 -244246 -271255 -306921 -145051 13842 -44526 -487 -203406
16612b03406n5043o6515l6201R3079J61775m7833k1438o8119J2502k2355n7684
$$ -203406 -258449 -324964 -361165 -268086 -106311 -154144 -175582 -243701 -231199 -253554 -311238
16601c11238N9525K3966K0649m2446j749o5550j12235j2974K10146J17463m687
$$ -311238 -251713 -227747 -207098 -249544 -251293 -316843 -429078 -442052 -231906 -114443 -119130
16590a19130L1982R3211p733m6385P0796M5087q1224o474K9908J48308r8438p4776
$$ -119130 -87148 6063 -1670 -48055 22741 67828 -13396 -19870 10038 158346 59908 -14868
16578a4868J77233r4748r1183l4578R1686l1834j29504l1827n961j01070q2361
$$ -14868 162365 67617 -23566 -58144 33542 1708 -127796 -159623 -165584 -266654 -349015
16567c49015Q5755J43789O8306j02215J27432l6143l4595k4779p490J13704o4059
$$ -349015 -263260 -119471 -51165 -153380 -25948 -62091 -96686 -121465 -128955 -15251 -79310
16556g9310J7444K9978Q198j1427k03n2721O5595J49150K6691j3128p3588j71336
$$ -79310 -61866 -31888 -23690 -35117 -35320 -88041 -22446 126704 153395 140267 66679 -104657
16544a04657j3189K0773L5529p2790M4652n9503L2923K0542Q2861L5541j4260
$$ -104657 -117846 -97073 -61544 -134334 -89682 -149185 -116262 -95720 -12859 22682 8422
16533H422r4492l5455J39643J09557K6184j23648j5357J48644J64317n3245J5267
$$ 8422 -86070 -121525 18118 127675 153859 30211 14854 163498 327815 274570 289837
16522B89837p2837k5861r736o6069q5807J27149m741j57069k09683R2350P4875
$$ 289837 217000 191139 181403 115334 29527 156676 151935 -5134 -214817 -122467 -47592
16511d7592P5912J3963k2186j50058J04643R8270l6203Q332L7637j29971n0951
$$ -47592 28320 42283 20097 -129961 -25318 72952 36749 45081 82718 -47253 -98204
16500i8204N3375J4026J39188N2771o1428n4709m041O4942j450j75937j22594
$$ -98204 -44829 -30803 108385 161156 99728 45019 40978 105920 104470 -71467 -194061
16489a94061L8010Q5558k6749M0246J00994j4680j18579N4709j7269j11254j45700
$$ -194061 -156051 -70493 -97242 -56996 43998 29318 -89261 -34552 -51821 -163075 -308775
16478c08775J1134J65702M8235M907k2111R5574O0435N8403n0607j04698j0749
$$ -308775 -297641 -131939 -83704 -78797 -100908 -5334 55101 113504 62897 -41801 -52550
16467e2550j22172l4767L4208P1435L0019R3025l6096l0160o017L4679l3051L2328
$$ -52550 -174722 -209489 -175281 -103846 -73827 19198 -16898 -47058 -53075 -18396 -51447 -19119
16455a9119R5437R3180O2433j61335j85041R0695K71167J8907k58156p8420m4349
$$ -19119 76318 169498 231931 70596 -114445 -23750 247417 266324 8168 -70252 -114601
16444a14601N8147j24655q4312K14091J67041q1379o7849m9362k6913M7377k7058
$$ -114601 -56454 -181109 -265421 -51330 115711 34332 -33517 -82879 -109792 -62415 -89473
16433h9473O6170j39162J09148J30838j09401K9336k2750l7414n087m526L4360
$$ -89473 -23303 -162465 -53317 77521 -31880 -2544 -25294 -62708 -67795 -72321 -37961
16422c7961j76134r5830L6726J98208J09652p2745n344o1703n8871J54490J45377
$$ -37961 -214095 -309925 -273199 -74991 34661 -38084 -43428 -105131 -164002 -9512 135865
16411A35865m3886j43643K9931p0188n5191M194Q2113Q3219L2451o7685k2763
$$ 135865 91979 -51664 -21733 -91921 -147112 -142918 -60805 22414 54865 -12820 -35583
16400c5583n14P1918R0113j32919l1308K1510j48678m1246Q1784N4230J25425
$$ -35583 -36097 35821 125934 -6985 -38293 -16783 -165461 -206707 -124923 -70693 54732
16389E4732k5060j35723j1937J79893P570l625O351o8439p4284l466r630N8902
$$ 54732 29672 -106051 -117988 61905 69475 65850 72201 3762 -70522 -73988 -83618 -24716
16377b4716j4796r0277q9560n6887K4317Q2999M3418j16734o2606P5392L8809
$$ -24716 -39512 -129789 -219349 -276236 -251919 -168920 -125502 -242236 -304842 -229450 -190641
16366a90641R7043K0081N403O0101J64107n3583j02710L1691M5859m9755n1539
$$ -190641 -93598 -73517 -68114 -8013 156094 102511 -199 31492 77351 27596 -23943
16355b3943M2894L4652n8566m2570j25606n9407r1420J10883k9372l2242O3160
$$ -23943 18951 53603 -4963 -47533 -173139 -232546 -323966 -213083 -242455 -274697 -211537
16344b11537J92803K7375k8488j12776r5157L8879j33684J64825p155k3554J91953
$$ -211537 -18734 8641 -19847 -132623 -227780 -188901 -322585 -157760 -164915 -188469 3484
16333C484K7695j5146j12467j57676j9589q3609J87293j6305O0030J33108N7908
$$ 3484 31179 16033 -96434 -254110 -273699 -357308 -170015 -186320 -126290 6818 64726
16322F4726L3324j513K2092N2403k5260p3012L9034R8986m3485L2985j09727J9484
$$ 64726 98050 96537 118629 171032 145772 72760 111794 210780 167295 200280 90553 110037
16310A10037l3465m1267l7477q2879m1024l3662j5382K2709m4591J9483N9699
$$ 110037 76572 35305 -2172 -85051 -126075 -159737 -175119 -152410 -197001 -177518 -117819
16299a17819J42162k7663j87642k2207J5698p6204o8822Q0762J6016Q0690n5864
$$ -117819 24343 -3320 -190962 -213169 -197471 -273675 -342497 -261735 -245719 -165029 -220893
16288b20893q2099l286M5322P8847P9O443k9655m2684J47388k2983n0718M0968
$$ -220893 -302992 -306278 -260956 -182109 -182030 -175587 -205242 -247926 -100538 -123521 -174239 -133271
16276a33271M2633q4195n2333R4488J97915J03219j17029n5594K288q456o7369
$$ -133271 -90638 -174833 -227166 -132678 65237 168456 51427 -4167 -1879 -10335 -77704
16265g7704Q9765p2435o7350M8869j38656j11709O0215o189J75884J5016j27665
$$ -77704 12061 -60374 -127724 -78855 -217511 -329220 -269005 -275194 -99310 -84294 -211959
16254b11959j47481J93192M1621k41566L4052P9175J6663Q1336J09819K260k6326
$$ -211959 -359440 -166248 -124627 -366193 -332141 -252966 -236303 -154967 -45148 -42888 -69214
16243f9214Q0023R0792M874j6120j08278J894J69938O2490J9719j51641j48818
$$ -69214 10809 101601 106475 90355 -17923 -16029 153909 216399 236118 84477 -64341
16232f4341n6199j13098o4356Q54K55813k4051n3804k3032Q3694J14753r0042
$$ -64341 -120540 -233638 -297994 -297140 -41327 -65378 -119182 -142214 -58520 56233 -33809
16221c3809j33740L1475j04980J38944J24167M1824m5423J4824k7402k36699m6496
$$ -33809 -167549 -136074 -241054 -102110 22057 63881 18458 33282 5880 -230819 -277315
16210b77315J83220O8674K4852M5353j310j8769l6277P9545Q7118p4529j59017
$$ -277315 -94095 -25421 -569 44784 43474 24705 -11572 67973 155091 80562 -78455
16199g8455j21933r2856o5887n1766m2881J70649K43694j1065P8840N8887n7589
$$ -78455 -200388 -293244 -359131 -410897 -453778 -283129 -39435 -50500 28340 87227 29638
16188B9638j74360M4786J73307J09038L6381j4675j74619j04692j0685m9968J2776
$$ 29638 -144722 -99936 73371 182409 218790 204115 29496 -75196 -85881 -135849 -123073
16177a23073P4090K20951o3380j36343k28229L0442N5192m2196m1456R1573L4235
$$ -123073 -48983 171968 108588 -27755 -255984 -225542 -170350 -212546 -254002 -162429 -128194
16166a28194K7184o4404j06849j18732O5722K1318P1824Q4676L8603j8339J33506
$$ -128194 -101010 -165414 -272263 -390995 -325273 -303955 -232131 -147455 -108852 -127191 6315
16155F315M6836M5985K332m4466j31031q2566N8534M627O541Q8513P4231k2655
$$ 6315 53151 99136 101468 57002 -74029 -156595 -98061 -93434 -86893 1620 75851 53196
16143E3196p1919n4958N2025o5332M2711O9054K1668P4352j5018J5950J06533
$$ 53196 -18723 -73681 -21656 -86988 -44277 24777 46445 120797 105779 121729 228262
16132B28262n4376k4159j14165m9188J7541r8933j04065N5503J58064L3498N4303
$$ 228262 173886 149727 35562 -13626 3915 -95018 -199083 -143580 14484 47982 102285
16121A02285K2454o9511k00227m9006O9518P44j20952j2Q1275N8496n7841j05302
$$ 102285 124739 55228 -144999 -194005 -124487 -123743 -244695 -244707 -163432 -104936 -162777 -268079
16109b68079j915J14643k5998L6105L7064Q2833P6904p7250j05163J13253n8654
$$ -268079 -269994 -155351 -181349 -145244 -108180 -25347 51557 -25693 -130856 -17603 -76257
16098g6257N5851M4087M5611k0709j11166j96993K3844K08625J13451j99007j68572
$$ -76257 -20406 23681 69292 48583 -62583 -259576 -235732 -27107 86344 -112663 -281235
16087b81235J81274Q4125J9134q5823N93k8901P6026l381n3352K0940L5783m2193
$$ -281235 -99961 -15836 3298 -82525 -81932 -110833 -34807 -38188 -91540 -70600 -34817 -77010
16075g7010j24711K0871Q9090R5234M7670k5834n5673K9927K4261J2680m7846
$$ -77010 -201721 -180850 -91760 3474 51144 25310 -30363 -436 23825 36505 -11341
16064a1341k9916N3376P8478J35393n3094q4075j10385n4298l1429r1483l644
$$ -11341 -41257 12119 90597 225990 172896 88821 -21564 -75862 -107291 -198774 -202418
16053b02418M2389L5857M5502K0375n1366p1085R3531P4815J69621J46535Q1657
$$ -202418 -160029 -124172 -78670 -58295 -109661 -180746 -87215 -12400 157221 303756 385413
16042C85413q7865j62559q0383J43670O3831j01622j39146j49056M3383Q5380
$$ 385413 297548 134989 54606 198276 262107 160485 21339 -127717 -84334 1046
16032A046o9905j95753J52738J24155q3535j31967L802q1804j62610L4348l6745
$$ 1046 -68859 -264612 -111874 12281 -71254 -203221 -199419 -281223 -443833 -409485 -446230
16021d46230K8677J18198P3177M6455O2050k9222p0350N8101j51767l5036K54428
$$ -446230 -417553 -299355 -226178 -179723 -117673 -146895 -217245 -159144 -310911 -345947 -91519
16010i1519P1919K1340n8920j08123M16O3833j3182j13646L3344J07291K23580
$$ -91519 -19600 1740 -57180 -165303 -164887 -101054 -114236 -227882 -194538 -87247 136333
15999A36333j6547l314Q8055j7331K6610O531p3450j28307L8610J85036p3799
$$ 136333 119786 116472 204527 187196 213806 220337 146887 18580 57190 242226 168427
15988A68427j22660j6047p1416q6366j01037j01155m2099J41625N807M7247J12946
$$ 168427 45767 29720 -41696 -128062 -229099 -330254 -372353 -230728 -224921 -177674 -64728
15977f4728N1714j23067j00213J27502j14094o3755J09097P1082J5354P5950J31686
$$ -64728 -13014 -136081 -236294 -108792 -222886 -286641 -177544 -106462 -91108 -15158 116528
15966A16528M8917P3454N9650p7353p0358n1409j18040q0332K3461R6616P2775
$$ 116528 165445 238899 298549 221196 150838 99429 -18611 -98943 -75482 21134 93909
15955I3909j00567q0365r3569L6617R9362R6478J0502J9380J69614o978m8079
$$ 93909 -6658 -87023 -180592 -143975 -44613 51865 62367 81747 251361 244383 196304
15944A96304o0497j26603Q5213M714N0176Q4539m6094j14252k9865J01032j8472
$$ 196304 135807 9204 94417 99131 149307 233846 187752 73500 43635 144667 126195
15933A26195j61965k2555j79040j42821O8018M2376J71038J13093q8923j1568
$$ 126195 -35770 -58325 -237365 -380186 -312168 -269792 -98754 14339 -74584 -86152
15923h6152M8753N7542M4393o0178j01642M528q1930J03216Q5429k5735j07668
$$ -86152 -37399 20143 64536 4358 -97284 -92756 -174686 -71470 13959 -11776 -119444
15912a19444n3493n8256J8069j1521K4592J01911Q377j34096j85737j0254q7851
$$ -119444 -172937 -231193 -213124 -224645 -200053 -98142 -89765 -223861 -409598 -419852 -507703
15901e07703O0291K25665J57169M3482r8409P2288R7872K5063j29373j35765j69660
$$ -507703 -447412 -221747 -64578 -21096 -119505 -47217 50655 75718 -53655 -189420 -359080
15890c59080j29261J71487J44453R1459n5484M930K3603M5181Q5611O4806J09595
$$ -359080 -488341 -316854 -172401 -80942 -136426 -131496 -107893 -62712 22899 87705 197300
15879A97300Q670M7591M9556q5416q7019J4569Q3677j8250j16015l8814J85103
$$ 197300 205970 253561 303117 217701 130682 145251 228928 210678 94663 55849 240952
15868B40952Q3138n9516q2116j52971o8132L0830j09869M3684m1812k09808J21963
$$ 240952 324090 264574 182458 29487 -38645 -7815 -117684 -74000 -115812 -325620 -203657
15857b03657N0980J0549O4570K3810J02617j00854m2335o8155k11437Q9950M9574
$$ -203657 -152677 -142128 -77558 -53748 48869 -51985 -94320 -162475 -373912 -283962 -234388
15846b34388Q9606O396k2738j6085k0611J28282J44023J92767j10191n3569p1693
$$ -234388 -144782 -138386 -161124 -177209 -197820 -69538 74485 267252 157061 103492 31799
15835C1799l7641R929n5639k16634j36061Q3350J3894n0574l3430Q1383Q4969
$$ 31799 -5842 4087 -51552 -268186 -404247 -320897 -307003 -357577 -391007 -309624 -224655
15824b24655J91851J49492L3544j69217j70486Q028Q5283M534m2163p6344K2869
$$ -224655 -32804 116688 150232 -18985 -189471 -181443 -96160 -91626 -133789 -210133 -187264
15813a87264Q9962J57042q8551j40843n0728j35936J96227K04660j2939L3731
$$ -187264 -97302 59740 -28811 -169654 -220382 -356318 -160091 44569 31630 65361
15803F5361j5164n6676r7926K2386M3749J25629l1274M0692l2435q6924q9015
$$ 65361 50197 -6479 -104405 -82019 -38270 87359 56085 96777 64342 -22582 -111597
15792a11597J02670N1259j31413N9618J46144J5732m7204n6443R9815N8049k16774
$$ -111597 -8927 42332 -89081 -29463 116681 132413 85209 28766 128581 186630 -30144
15781c0144j88362J04512M0139J66998l9585j13308j04502j4166M4527O7592P6910
$$ -30144 -218506 -113994 -73855 93143 53558 -59750 -164252 -178418 -133891 -66299 10611
15770A0611q214r8093l3513j59553m061O6875k44677Q0377J67182K32564k7390
$$ 10611 2397 -95696 -129209 -288762 -292823 -225948 -470625 -390248 -223066 9498 -17892
15759a7892n0344J6535o8411N4293r8604J588k61371R3307J56636P3227Q9715
$$ -17892 -68236 -51701 -120112 -65819 -164423 -162835 -424206 -330899 -174263 -101036 -11321
15748a1321l2612J72168j06876k6912R6537L7418r4516j79864N4337J20569r1833
$$ -11321 -43933 128235 21359 -5553 90984 128402 33886 -145978 -91641 28928 -62905
15737f2905j01406J10824m51p064l6972O4492K4080j6933l4690j20191o1147M1446
$$ -62905 -164311 -53487 -53938 -61002 -97974 -33482 -9402 -26335 -61025 -181216 -242363 -200917
15725b00917r6860m2544O6721K6958J00789J43256J45286o4303j25245n2790j3223
$$ -200917 -297777 -340321 -273600 -246642 -145853 -2597 142689 78386 -46859 -99649 -112872
15714a12872N7044j23424n1519K84980K28259K2245k34650j66707m3842Q8049
$$ -112872 -55828 -179252 -230771 54209 282468 304713 70063 -96644 -140486 -52437
15704e2437J6893J88942M8193j45977j63058l4576l73M0453K63088Q1527k03020
$$ -52437 -35544 153398 201591 55614 -107444 -142020 -142393 -101940 161148 242675 39655
15693C9655j73318j49797K9730J29364J65760J50891p5374o5255l6862k1399l3632
$$ 39655 -133663 -283460 -253730 -124366 41394 192285 116911 51656 14794 -6605 -40237
15682d0237P223j99516j8100N9735O1628P9810J03419K8044j57672Q8206j34710
$$ -40237 -33014 -232530 -250630 -190895 -129267 -49457 53962 82006 -75666 12540 -122170
15671a22170o0019r3698p8354R0448L3506L5088M8941J06917r9115j3919l426
$$ -122170 -182189 -275887 -354241 -263793 -230287 -195199 -146258 -39341 -138456 -152375 -155801
15660a55801N3614l6644m7424M9095O1610J24423k8254M9847m6800k3775m4946
$$ -155801 -102187 -138831 -186255 -137160 -75550 48873 20619 70466 23666 -109 -45055
15649d5055r1550L2615o0574m5380R7367o0015J0482J8409k5136O8505k1267p3313
$$ -45055 -136605 -103990 -164564 -209944 -112577 -172592 -162110 -143701 -168837 -100332 -121599 -194912
15637a94912p9101j44862j00656J95029J53364k2479o6770M2094J34332K7480
$$ -194912 -274013 -418875 -519531 -324502 -171138 -193617 -260387 -218293 -83961 -56481
15627e6481O4367J08609O6556j13650j23327j2396M6574J06332N9855j25730j48161
$$ -56481 7886 116495 183051 69401 -53926 -66322 -19748 86584 146439 20709 -127452
15616a27452n858j3698k5335Q3343P01m8520j6870j15946L6792J56644N4345j09920
$$ -127452 -133310 -147008 -172343 -89000 -88299 -136819 -153689 -269635 -232843 -76199 -21854 -131774
15604a31774p548j41437p112j9370p3598J41143J19261LN7423J24748J45226J7691
$$ -131774 -139322 -280759 -287871 -307241 -380839 -239696 -120435 -120432 -63009 61739 206965 224656
15592B24656J17840j23537o2037J9607j61095j51728q5381M7295Q7360J5318j44240
$$ 224656 342496 218959 156922 176529 15434 -136294 -221675 -174380 -87020 -71702 -215942
15581b15942j31907J21308J52672j2523k5266j11551Q3121J42777P1383J07607
$$ -215942 -347849 -226541 -73869 -86392 -111658 -223209 -140088 2689 74072 181679
15571A81679J4068l02675K0815L7960m7950q4019p5913r7987j02459j99650l7762
$$ 181679 195747 -106928 -86113 -48153 -96103 -180122 -256035 -354022 -456481 -656131 -693893
15560f93893K88751J14641J2007J69887M9871k8405K4288K39203m5778M5940P4926
$$ -693893 -405142 -290501 -278494 -108607 -58736 -87141 -62853 176350 130572 176512 251438
15549B51438j76911j9382n329P8872o7794k17767n5972J00041Q3855j7381j76623
$$ 251438 74527 55145 49816 128688 60894 -156873 -212845 -112804 -28949 -46330 -222953
15538b22953k3996J46022o7700J02971Q2456j09086o0430M2421J1382O1643R9766
$$ -222953 -246949 -100927 -168627 -65656 16800 -92286 -152716 -110295 -98913 -37270 62496
15527F2496L368J04579N9810m3453j04765m9532j22583n1469l2393P2209J29698
$$ 62496 65864 170443 230253 186800 82035 32503 -90080 -141549 -173942 -101733 27965
15516B7965L7329k25185L4686Q4883j85633p3340P280m144O437K20505K49505
$$ 27965 65294 -159891 -125205 -40322 -225955 -299295 -292015 -296159 -289722 -69217 180288
15505A80288n302j0298j52401q0735p0405K9688K08021J20658j49506q2115o6780
$$ 180288 174986 164688 12287 -68448 -138853 -109165 98856 219514 70008 -12107 -78887
15494g8887q4059L2720J13790J80687l5625M9058k834k9207j06387l0944K410
$$ -78887 -162946 -130226 -16436 164251 128626 177684 174850 145643 39256 8312 10722
15483A0722m1292P8834j6193j54042L594m8423r478j58716J49440J99592J40311
$$ 10722 -30570 48264 32071 -121971 -118377 -166800 -176278 -334994 -185554 14038 154349
15472A54349K1522K245o0716J9879J16761o0807q6348K0518l0519j68130j03363
$$ 154349 175871 178116 117400 137279 254040 193233 106885 127403 96884 -71246 -174609
15461a74609M1909r1452K7521J76362O1884j6556K1108O8201J8819j16980j2079
$$ -174609 -132700 -224152 -196631 -20269 41615 25059 46167 114368 133187 16207 4128
15450D128p6675J03550j74107j17291J99732J85863l9142k39065k74833j24109
$$ 4128 -72547 31003 -143104 -260395 -60663 125200 86058 -153007 -427840 -551949
15440e51949J77862K18709J05281R9031q1666o7709j1609J2023m4383o175R9423
$$ -551949 -374087 -155378 -50097 48934 -32732 -100441 -112050 -100027 -144410 -150585 -51162
15429e1162J03174k4384J61079l8780j00102n6447R1614J17926o436n3122q0170
$$ -51162 52012 27628 188707 149927 49825 -6622 84992 202918 196482 143360 63190
15418F3190k0855J47037N7231n3731j94896j61305o5685P2842k2819m2054p612
$$ 63190 42335 189372 246603 192872 -2024 -163329 -229014 -156172 -178991 -221045 -228657
15407b28657l9566p3660j6765M1430P8506k70J6316J65647N3851n5890j95506
$$ -228657 -268223 -341883 -358648 -317218 -238712 -238982 -222666 -57019 -3168 -59058 -254564
15396b54564j06413K26J52020K2478p7026J47866q7893j39817J50208J19414M1036
$$ -254564 -360977 -360751 -208731 -186253 -263279 -115413 -203306 -343123 -192915 -73501 -32465
15385c2465n0473M414L7096K1217m5131l0188j50619j24573P405K40666J54668
$$ -32465 -82938 -78524 -41428 -20211 -65342 -95530 -246149 -370722 -363317 -122651 32017
15374C2017k0310L3704K1316k62824m7760K5544n8159L3047J37757J29044k1076
$$ 32017 11707 45411 66727 -196097 -243857 -218313 -276472 -243425 -105668 23376 2300
15363B300r1395L9154J1036q7310J0385q6391j01529P6072J82000L373K0848j44326
$$ 2300 -89095 -49941 -38905 -126215 -115830 -202221 -303750 -227678 -45678 -42305 -21457 -165783
15351a65783j00649M4646o7939l9835m7321J0229J98487J66814J7470k36550N4042
$$ -165783 -266432 -221786 -289725 -329560 -376881 -366652 -168165 -1351 16119 -220431 -166389
15340a66389j5525Q5162J03508K2227J22247k1213n2761l2957n0844j2371j21387
$$ -166389 -181914 -96752 6756 28983 151230 130017 77256 44299 -6545 -18916 -140303
15329a40303j1741P8918J39851M4158p8255K01340J82148j22084o5717o8053j20483
$$ -140303 -152044 -73126 66725 110883 32628 233968 416116 294032 228315 160262 39779
15318C9779k2924j28290p1493L4756P9300O5421J02355m7274k4547R0623m4199
$$ 39779 16855 -111435 -182928 -148172 -68872 -3451 98904 51630 27083 117706 73507
15307G3507k6764K9442j49797M3116J9284R5100p6847q5638J15530K07773j9196
$$ 73507 46743 76185 -73612 -30496 -11212 83888 7041 -78597 36933 244706 225510
15296B25510l5857J3746j10198l3568p058Q7059j1539j04413k8727K8359k69651
$$ 225510 189653 203399 93201 59633 52575 139634 128095 23682 -5045 23314 -246337
15285b46337r1760J09780J41118j21793J26519l8535j50844L9363L5908O1851
$$ -246337 -338097 -228317 -87199 -208992 -82473 -121008 -271852 -232489 -196581 -134730
15275a34730K7091J3387p0365O1031L3997k4037o4240P9720O2999m1963N3564
$$ -134730 -107639 -94252 -164617 -103586 -69589 -93626 -157866 -78146 -15147 -57110 -3546
15264c546K2537m0464m6463M4847K5921Q706K1172L4434O8350r8343j78678p827
$$ -3546 18991 -21473 -67936 -23089 2832 11538 32710 67144 135494 37151 -141527 -149354
15252a49354J62169O7062j26101r7319j18335K736K41416L0438k34722K3282J2956
$$ -149354 12815 79877 -46224 -143543 -261878 -259142 -17726 12712 -222010 -198728 -185772
15241a85772p3580K03011Q7983q8197q166K7597L5499j52303Q7378O2502P1102
$$ -185772 -259352 -56341 31642 -56555 -64721 -37124 -1625 -153928 -66550 -4048 67054
15230F7054J1446l4929J1959J12935Q470m2619p163j89900M0115K25928k0767
$$ 67054 78500 43571 55530 168465 176935 134316 127153 -62747 -22632 203296 182529
15219A82529k09194j27993j00726O7753O1599L5274J08191O4703R864o1828o1875
$$ 182529 -26665 -154658 -255384 -187631 -126032 -90758 17433 82136 92000 30172 -31703
15208c1703J2545r2132q2975L5456J03283K20928J10792j82172j41249n3946k7725
$$ -31703 -19158 -111290 -194265 -158809 -55526 165402 276194 94022 -47227 -101173 -128898
15197a28898k11477M8802J26429o8550q9292J65534K62818J62993n3728k7659
$$ -128898 -340375 -291573 -165144 -233694 -322986 -157452 105366 268359 214631 186972
15187A86972p822j46076j58523k8283m7939N843J72870o9440P6517l3233R0797
$$ 186972 179150 33074 -125449 -153732 -201671 -195828 -22958 -92398 -15881 -49114 41683
15176D1683J94942k02468j59807Q5032J64083q9858q4794Q2010Q2859n7791o1549
$$ 41683 236625 34157 -125650 -40618 123465 33607 -51187 30823 113682 55891 -5658
15165e658L194J55648L8997p5668k9811O1389l7673j03382L6712o5712q3177j0813
$$ -5658 -2464 153184 192181 116513 86702 148091 110418 7036 43748 -21964 -105141 -115954
15153a15954j62491R1978J53434M1362r8676Q9824K4657j13259j1742l3685J47232
$$ -115954 -278445 -186467 -33033 8329 -90347 -523 24134 -89125 -100867 -134552 12680
15142A2680J39924L1027p0513j9202k3354J09820j737k31028j52690O0479P5932
$$ 12680 152604 183631 113118 93916 70562 180382 178645 -52383 -205073 -144594 -68662
15131f8662P5632p2885r3923L8576R5408J8675l4919m0489j2235j57305J64153
$$ -68662 6970 -65915 -159838 -121262 -25854 -7179 -42098 -82587 -94822 -252127 -87974
15120h7974J02963R6361J42675J00844j89647j70823o5573J91215J8396K319l8823
$$ -87974 14989 111350 254025 354869 165222 -5601 -71174 120041 138437 140756 101933
15109A01933K8514j35790j49651O6044L9467k084J72796J71362l4997q9772r4263
$$ 101933 130447 -5343 -154994 -88950 -49483 -51567 121229 292591 257594 167822 73559
15098G3559r2129n3648q785L8474O997n8984M7681R888Q2460R415Q992j7322m3158
$$ 73559 -18570 -72218 -81003 -42529 -35532 -94516 -46835 -36947 45513 54928 63920 46598 3440
15085C440j67473j27607L6964J80168J57575M7251O8985j32245j54024N3546M2736
$$ 3440 -164033 -291640 -254676 -74508 83067 130318 199303 67058 -86966 -33420 9316
15074I316o9970J32066m8880j76333k7905o6752M8330L6211o8613P3853J30131
$$ 9316 -60654 71412 22532 -153801 -181706 -248458 -200128 -163917 -232530 -158677 -28546
15063b8546L1659L4694r8770M8009L790M28p2919L2475N546j1233J47086K9817
$$ -28546 3113 37807 -60963 -12954 -9164 -8736 -81655 -49180 -43634 -54867 92219 122036
15051A22036r6525j19167J4708O9962n3960o3400r5687l4118R7488O5319n8980
$$ 122036 25511 -93656 -78948 -8986 -62946 -126346 -222033 -256151 -158663 -93344 -152324
15040a52324o6292q723N9961p8854J2905Q9879K4336q3164j10001l8751R0303
$$ -152324 -218616 -227339 -167378 -246232 -233327 -143448 -119112 -202276 -312277 -351028 -260725
15029b60725m702K03468P4019j21739L3757K5m7005J00258o3757J2275M4426k3844
$$ -260725 -265427 -61959 12060 -109679 -75922 -75897 -122902 -22644 -86401 -74126 -29700 -53544
15017e3544m7546N0839j4572j15186j72463O2159K09945J59376j76357r3778n3877
$$ -53544 -101090 -50251 -64823 -180009 -352472 -290313 -80368 79008 -97349 -191127 -245004
15006b45004j73656m9032q922J94378J9366p7380J35785J32180Q6749k8773m1937
$$ -245004 -418660 -467692 -476614 -282236 -262870 -340250 -204465 -72285 14464 -14309 -56246
14995e6246r0248Q3572k2185r2535J37993J9880Q1665j51916P8583J50598m3570
$$ -56246 -146494 -62922 -85107 -177642 -39649 -19769 61896 -90020 -11437 139161 95591
14984I5591m7849j09241k1364J3353L8075J60363r3761p1335J02013R5032J20247
$$ 95591 47742 -61499 -82863 -69510 -31435 128928 35167 -36168 65845 160877 281124
14973B81124j22515n1596j8265n388P1016p5174k80208r2466L4495J32094o699
$$ 281124 158609 107013 88748 83360 154376 79202 -201006 -293472 -258977 -126883 -133582
14962a33582J2359Q5454M530J2293K0246n2715q837L3238p5651q1000M9776O5141
$$ -133582 -121223 -35769 -31239 -18946 1300 -51415 -60252 -27014 -102665 -183665 -133889 -68748
14950f8748q4n4433O2943K8316l158k2984q6273n8668O6983p6830O8502J10588
$$ -68748 -68832 -123265 -60322 -32006 -35164 -58148 -144421 -203089 -136106 -212936 -144434 -33846
14938c3846M955l3460L508P1721Q9117p1803q3952K1734k2055K5137j569J59961
$$ -33846 -28891 -62351 -58843 12878 101995 30192 -53760 -32026 -54081 -28944 -30513 129448
14926A29448k02525q1751N0261M1520j8251r9652j41663J68459K70783j90267
$$ 129448 -73077 -154828 -104567 -63047 -81298 -180950 -322613 -154154 116629 -73638
14916g3638J08223K873q7238j22216q7607J97929R2863j584k7814j19278j04129
$$ -73638 34585 37458 -49780 -171996 -259603 -61674 31189 29605 1791 -117487 -221616
14905b21616o456J67119J61902K26154j95449k7056n0191k12448J2878K0374q059
$$ -221616 -228072 -60953 100949 327103 131654 104598 54407 -158041 -145163 -124789 -132848
14894a32848Q7712P1108J33893p6116M755j15854r1579p4493J8236K53433J25997
$$ -132848 -45136 25972 159865 83749 88504 -27350 -118929 -193422 -175186 78247 204244
14883B04244L0678j09478l9363r279J32885k3964k06422K828M5101j03323r6526
$$ 204244 234922 125444 86081 76802 209687 185723 -20699 -17871 27230 -76093 -172619
14872a72619R5808R5345j46501j10817N0080J174J00145J27808N1329N4826n1939
$$ -172619 -76811 18534 -127967 -238784 -188704 -187530 -87385 40423 91752 146578 94639
14861I4639M1804m8180j07382j37515J53943J52207j75141j93231o6299J7280
$$ 94639 136443 88263 -19119 -156634 -2691 149516 -25625 -218856 -285155 -267875
14851b67875Q5705P9767Q1266J0153L7100q9927j44941m7539r6645o2573p7170
$$ -267875 -182170 -102403 -21137 -10984 26116 -63811 -208752 -256291 -352936 -415509 -492679
14840d92679p8802M0402O5986J34033J11270K6930J9682k4165n9103r0309J18496
$$ -492679 -571481 -531079 -465093 -331060 -219790 -192860 -173178 -197343 -256446 -346755 -228259
14829b28259J14502n0221n5454J85508P261n7784m9940J3326L9802M973Q8680
$$ -228259 -113757 -163978 -219432 -33924 -26663 -84447 -134387 -121061 -81259 -76286 12394
14818A2394j0663M0622k3434Q6298o0886L2771j3506j42861j07684k353K01447
$$ 12394 1731 42353 18919 105217 44331 77102 63596 -79265 -186949 -189302 12145
14807A2145J12101N5889k41975j65456r4396j26037o7170P0340K81037J48308
$$ 12145 124246 180135 -61840 -227296 -321692 -447729 -514899 -444559 -163522 -15214
14797a5214o1098k66184j00163J09530l2084o7581N667L42235J42024j60739j22444
$$ -15214 -76312 -342496 -442659 -333129 -365213 -432794 -427127 -84892 57132 -103607 -226051
14786b26051O2977k3156O0822J10457j8863q1758j09380r8924J13456J85257J5627
$$ -226051 -163074 -186230 -125408 -14951 -33814 -115572 -224952 -323876 -210420 -25163 -9536
14775i536l5899R5696j61161k77811Q6695J48089k9994R4625J94538p8322k00394
$$ -9536 -45435 50261 -110900 -388711 -302016 -153927 -183921 -89296 105242 26920 -173474
14764a73474M7529P9526M3266K4317K8503k2932n891O7352N485R7205j15835r8735
$$ -173474 -125945 -46419 -3153 21164 49667 26735 20844 88196 93681 190886 75051 -23684
14752b3684K6828j1677N3027M5778R0969k6796k1980L4013o5001o5210q9148p4339
$$ -23684 3144 -8533 44494 90272 181241 154445 132465 166478 101477 36267 -52881 -127220
14740a27220j1769P9000m0303q0299j6932r8290K0288M5079J08455K1381k0797
$$ -127220 -138989 -59989 -100292 -180591 -197523 -295813 -275525 -230446 -121991 -100610 -121407
14729a21407j35997R0257K3259P2086J64846Q6171o1389M3312Q1652o614R9454
$$ -121407 -257404 -167147 -143888 -71802 93044 179215 117826 161138 242790 236176 335630
14718C35630o5191q9286K0367o2481L4545O2832p4836m5280K3164j12696M5233
$$ 335630 270439 181153 201520 139039 173584 236416 161580 116300 139464 26768 72001
14707G2001o3914n6069p2242K0798j00350k3721K1705K7010N6590K0271q6491
$$ 72001 8087 -47982 -120224 -99426 -199776 -223497 -201792 -174782 -118192 -97921 -184412
14696a84412K35J40769O3526k51026j2987m8639Q9585J92227O1233J8564L7197
$$ -184412 -184177 -43408 20118 -230908 -243895 -292534 -202949 -10722 50511 69075 106272
14685A06272n0631j5314R0855N7285o2715J1317J0447k74294n4859J42782R6382
$$ 106272 55641 40327 131182 188467 125752 137069 147516 -126778 -181637 -38855 57527
14674E7527Q1578J07j27558j45516R5462J08667j23779q3332o0737K0791M1022
$$ 57527 139105 139212 11654 -133862 -38400 70267 -53512 -136844 -197581 -176790 -135768
14663a35768l8456K05640K6962o94r7662j1895Q3319m7437j3491M6627k8133N3914
$$ -135768 -174224 31416 58378 57684 -39978 -51873 31446 -15991 -29482 17145 -10988 42926
14651D2926n1362j57004N101J71356J7606j56216O1549J60050M4564m7058N3098
$$ 42926 -8436 -165440 -160339 11017 28623 -127593 -66044 94006 138570 91512 144610
14640A44610q1570j37235L8470L7754k7154L5478O1835N2799P6160J57529P3068
$$ 144610 63040 -74195 -35725 2029 -25125 10353 72188 124987 201147 358676 431744
14629D31744j75662k47626n5200J47333m1389J9430p2877k7579k2373j9521m9518
$$ 431744 256082 8456 -46744 100589 59200 78630 5753 -21826 -44199 -63720 -113238
14618a13238m0943p3011J19652O3279l4822J49812J60109P6688J9259j7543p6420
$$ -113238 -154181 -227192 -107540 -44261 -79083 70729 230838 307526 326785 309242 232822
14607B32822j95911K9693J17595j08680j09901J25625Q5171o5830r4156l8155
$$ 232822 36911 66604 184199 75519 -34382 91243 176414 110584 16428 -21727
14597b1727J22748j22850m4220k8372j9966Q6419P4765r6073P3184J42168M4704
$$ -21727 101021 -21829 -66049 -94421 -114387 -27968 46797 -49276 23908 166076 210780
14586B10780q4829k81945m2664J98563J63971P4056K6925r2422j80229j12368
$$ 210780 125951 -155994 -198658 -95 163876 237932 264857 172435 -7794 -120162
14576a20162j58371n2408K42591J08265J26760n4297j09992L8332n1059K1681
$$ -120162 -278533 -330941 -88350 19915 146675 92378 -17614 20718 -30341 -8660
14566h660O2978Q3644k0954r3818j22476j59563J49662J63466L0566k9466K2478
$$ -8660 54318 137962 117008 23190 -99286 -258849 -109187 54279 84845 55379 77857
14555G7857j44177l7398J77879L2629K5731k21627p2751m4213j4673J9845J45970
$$ 77857 -66320 -103718 74161 106790 132521 -89106 -161857 -206070 -220743 -200898 -54928
14544e4928J34259K6827m8710n6881m9500J19946r3636K7398J18581k8957r2337
$$ -54928 79331 106158 57448 567 -48933 71013 -22623 4775 123356 94399 2062
14533B062n0029J53028R518j22516q3439m5273p9514J0713J73860R0088j45472
$$ 2062 -47967 105061 114579 -7937 -91376 -136649 -216163 -205450 -31590 58498 -86974
14522h6974k35372P4271J19730k1323k31511q7516L6156J55501J66810J92266
$$ -86974 -322346 -248075 -128345 -149668 -381179 -468695 -432539 -277038 -110228 82038
14512H2038K07362r3960j52390P9840m6085K7399j0927j08314R172J12106J745
$$ 82038 289400 195440 43050 122890 76805 104204 93277 -15037 -5865 106241 107986
14501A07986j8508q7189r7919r1626J0993Q7457K39575J66337o7154k46474k35764
$$ 107986 89478 2289 -95630 -187256 -176263 -88806 150769 317106 249952 3478 -232286
14490b32286J4687K77177K6099K1969P7781j01872p0310N0562o8664k58636o2450
$$ -232286 -217599 59578 85677 107646 185427 83555 13245 63807 -4857 -263493 -325943
14479c25943K5524J17231J65265l3495J08O2514P6387J9325K6661N8955j14680
$$ -325943 -300419 -183188 -17923 -51418 -51310 11204 87591 106916 133577 192532 77852
14468G7852j43797m0833o1489n93L0163J07447m8899j11347j0908j35620M6970
$$ 77852 -65945 -106778 -168267 -168860 -138697 -31250 -80149 -191496 -202404 -338024 -291054
14457b91054K17034J7896J13672K14302j19284j94654L4778p494n8319k3498J1140
$$ -291054 -74020 -56124 57548 271850 152566 -42088 -7310 -14804 -73123 -96621 -85481
14446h5481J26570J04923k2064k1928n2243n8941l26453m3131K07685K26440p2420
$$ -85481 41089 146012 123948 102020 49777 -9164 -335617 -378748 -171063 55377 -17043
14435a7043j82411J06180N7344k635P4441P4862k30223q9661M172n7220N7354
$$ -17043 -199454 -93274 -35930 -38565 35876 110738 -119485 -209146 -204974 -262194 -204840
14424b04840K39085J19771j64563l1654R3073m1229o4047P9960J14935j02811
$$ -204840 34245 154016 -10547 -42201 50872 9643 -54404 25556 140491 37680
14414C7680p1731j46216j54409M6899M8194j28426K0349Q2892J32468L1366J13019
$$ 37680 -34051 -180267 -334676 -287777 -239583 -368009 -347660 -264768 -132300 -100934 12085
14403A2085j4684j06533r8224J9252J20537R4565k0803q3991j38581j8290N5556
$$ 12085 -2599 -109132 -207356 -188104 -67567 26998 6195 -77796 -216377 -234667 -179111
14392a79111P034q1686r3476K12430J93282n0329j21551j32980o3711J74043J30573
$$ -179111 -172077 -253763 -347239 -134809 58473 8144 -113407 -246387 -310098 -136055 -5482
14381e482J42129K7662j09202L8357N3957o6509L061N4558Q2394K5154j24874
$$ -5482 136647 164309 55107 93464 147421 80912 83973 138531 220925 246079 121205
14370A21205j51008o0740j25028k7212L1515J60280J18638j09550o0079j4011
$$ 121205 -29803 -90543 -215571 -242783 -211268 -50988 67650 -41900 -101979 -115990
14360a15990k5693L5812q5640R3189K17055j3427l4574J9435j25295n0717M4918
$$ -115990 -141683 -105871 -191511 -98322 118733 105306 70732 90167 -35128 -85845 -40927
$$ [...]
##END NTUPLES=NMR SPECTRUM
##END=
