##TITLE=Analysis number 312091
Compound Code rf 01575
Project Code adrs
Chemist Name prosynth
##JCAMPDX= 6.0         $$ Bruker NMR JCAMP-DX V2.0
##DATA TYPE= NMR SPECTRUM
##DATA CLASS= NTUPLES
##ORIGIN= Bruker BioSpin GmbH
##OWNER= NMR
$$ XWIN-NMR		Version 3.5
$$ Mon Jul 25 12:47:44 2005 GMT Daylight Time (UT+1h)  MAYBRIDGE\NMR@NMR_250MHZ
##.OBSERVE FREQUENCY= 250.131544655141
##.OBSERVE NUCLEUS= ^1H
##.ACQUISITION MODE= SIMULTANEOUS (DQD)
##.ACQUISITION SCHEME= undefined
##.AVERAGES= 16
##.DIGITISER RES= 18
##SPECTROMETER/DATA SYSTEM= dpx250
##.PULSE SEQUENCE= zg30
##.SOLVENT NAME= CDCl3
##.SHIFT REFERENCE= (INTERNAL, CDCl3, 0, 16.522)
##AUDIT TRAIL= $$ (NUMBER, WHEN, WHO, WHERE, WHAT)
$$ ##TITLE= Audit trail, XWIN-NMR		Version 3.5
$$ ##JCAMPDX= 5.01
$$ ##ORIGIN= Bruker BioSpin GmbH
$$ ##OWNER= NMR
$$ C:\u/data/dgb/nmr/ADRS/6490/pdata/1/auditp.txt
$$ ##AUDIT TRAIL=  $$ (NUMBER, WHEN, WHO, WHERE, WHAT)
(   1,<2005-07-25 12:46:52.25 +100>,<MAYBRIDGE\NMR>,<NMR_250MHZ>,
      <created by zg, POWCHK disabled, PULCHK disabled
       configuration hash MD5:
       62 19 C7 07 E1 42 D1 B7 37 6C 3D D0 77 39 F9 E6
       data hash MD5: 64K
       72 9C AE 44 5D A0 0E AD 56 7E 12 62 38 07 76 71>)
(   2,<2005-07-25 12:47:12.33 +100>,<MAYBRIDGE\NMR>,<NMR_250MHZ>,
      <Start of raw data processing
       ef LB = 0.3 FT_mod = 6 PKNL = 1 SI = 32K 
       data hash MD5: 32K
       9E 64 12 36 83 C7 4D 44 72 66 2E 04 5A 75 9C 6B>)
(   3,<2005-07-25 12:47:15.99 +100>,<MAYBRIDGE\NMR>,<NMR_250MHZ>,
      <apk 
       data hash MD5: 32K
       74 EE B3 56 22 0B AF FE C1 EA 92 E4 E7 DB 3E B2>)
(   4,<2005-07-25 12:47:18.68 +100>,<MAYBRIDGE\NMR>,<NMR_250MHZ>,
      <abs ABSG = 5 
       data hash MD5: 32K
       1F 98 8B E3 76 6E 93 B8 67 81 28 F4 27 42 10 58>)
$$ ##END=
$$ 
$$ hash MD5
$$ C1 EB AF AE BA A6 91 D1 03 3E 09 BD D0 9C 7A 66
##$RELAX= 
##$RELAX= 
##$RELAX= 
##$RELAX= 
##$RELAX= 
##$RELAX= 
##$RELAX= 
$$ Bruker specific parameters
$$ --------------------------
##$DU= <C:\u>
##$EXPNO= 6490
##$NAME= <ADRS>
##$PROCNO= 1
##$TYPE= <nmr>
##$USER= <dgb>
##$AMP= (0..31)
100 100 100 100 100 100 100 100 100 100 100 100 100 100 100 100 100 100 
100 100 100 100 100 100 100 100 100 100 100 100 100 100 
##$AQSEQ= 0
##$AQ_mod= 3
##$AUNM= <au_zg>
##$AUTOPOS= <18 >
##$BF1= 250.13
##$BF2= 250.13
##$BF3= 250.13
##$BF4= 250.13
##$BF5= 500.13
##$BF6= 500.13
##$BF7= 500.13
##$BF8= 500.13
##$BYTORDA= 1
##$CFDGTYP= 0
##$CFRGTYP= 5
##$CHEMSTR= <none>
##$CNST= (0..31)
1 1 145 1 1 1 1 1 1 1 1 1 1 1 1 1 1 1 1 1 1 1 1 1 1 1 1 1 1 1 1 1 
##$CPDPRG= <>
##$CPDPRG1= <>
##$CPDPRG2= <>
##$CPDPRG3= <>
##$CPDPRG4= <mlev>
##$CPDPRG5= <mlev>
##$CPDPRG6= <mlev>
##$CPDPRG7= <mlev>
##$CPDPRG8= <mlev>
##$CPDPRGB= <>
##$CPDPRGT= <>
##$D= (0..31)
0 1 0 0 0 0 0 0 0 0.06 0 0 0 0 0 0 0.0002 0 0 0 0 0 0 0 0 0 0 0 0 0 0 
0 
##$DATE= 1122292009
##$DBL= (0..7)
120 120 120 120 120 120 120 120 
##$DBP= (0..7)
150 150 150 150 150 150 150 150 
##$DBP07= 0
##$DBPNAM0= <>
##$DBPNAM1= <>
##$DBPNAM2= <>
$$ [...]
##$SUBNAM7= <"">
##$SUBNAM8= <"">
##$SUBNAM9= <"">
##$SW= 20.6930455092707
##$SWIBOX= (0..15)
0 0 3 0 0 0 0 0 0 0 0 0 0 0 0 0 
##$SW_h= 5175.983436853
##$TD= 65536
##$TD0= 1
##$TE= 296.16
##$TE2= 300
##$TE3= 300
##$TEG= 300
##$TL= (0..7)
0 120 120 120 120 120 120 120 
##$TP= (0..7)
150 150 150 150 150 150 150 150 
##$TP07= 0
##$TPNAME0= <>
##$TPNAME1= <>
##$TPNAME2= <>
##$TPNAME3= <>
##$TPNAME4= <>
##$TPNAME5= <>
##$TPNAME6= <>
##$TPNAME7= <>
##$TPOAL= (0..7)
0.5 0.5 0.5 0.5 0.5 0.5 0.5 0.5 
##$TPOFFS= (0..7)
0 0 0 0 0 0 0 0 
##$TUNHIN= 0
##$TUNHOUT= 0
##$TUNXOUT= 0
##$USERA1= <user>
##$USERA2= <user>
##$USERA3= <user>
##$USERA4= <user>
##$USERA5= <user>
##$V9= 5
##$VALIST= <valist>
##$VCLIST= <CCCCCCCCCCCCCCC>
##$VD= 0
##$VDLIST= <DDDDDDDDDDDDDDD>
##$VPLIST= <PPPPPPPPPPPPPPP>
##$VTLIST= <TTTTTTTTTTTTTTT>
##$WBST= 1024
##$WBSW= 4
##$XGAIN= (0..3)
0 0 0 0 
##$XL= 0
##$YL= 0
##$YMAX_a= 536152
##$YMIN_a= -497202
##$ZGOPTNS= <>
##$ZL1= 120
##$ZL2= 120
##$ZL3= 120
##$ZL4= 120
##$ABSF1= 16.522
##$ABSF2= -4.171173
##$ABSG= 5
##$ABSL= 3
##$ALPHA= 0
##$AQORDER= 0
##$ASSFAC= 0
##$ASSFACI= 0
##$ASSFACX= 0
##$ASSWID= 0
##$AUNMP= <proc_1d>
##$AZFE= 0.1
##$AZFW= 0.1
##$BCFW= 0
##$BC_mod= 0
##$BYTORDP= 0
##$COROFFS= 0
##$CY= 12.5
##$DATMOD= 1
##$DC= 0
##$DFILT= <>
##$DTYPP= 0
##$F1P= 14.0000005364418
##$F2P= -0.99999901652339
##$FCOR= 0.5
##$FTSIZE= 32768
##$FT_mod= 6
##$GAMMA= 0
##$GB= 0
##$INTBC= 1
##$INTSCL= 1
##$ISEN= 128
##$LB= 0.3
##$LEV0= 0
##$LPBIN= 0
##$MAXI= 10000
##$MC2= 0
##$MEAN= 0
##$ME_mod= 0
##$MI= 0
##$NCOEF= 0
##$NC_proc= -2
##$NLEV= 6
##$NOISF1= 0
##$NOISF2= 0
##$NSP= 0
##$NTH_PI= 0
##$NZP= 0
##$OFFSET= 16.522
##$PC= 1
##$PHC0= 16.89243
##$PHC1= 5.261609
##$PH_mod= 1
##$PKNL= yes
##$PPARMOD= 0
##$PSCAL= 4
##$PSIGN= 0
##$REVERSE= no
##$SF= 250.13
##$SI= 32768
##$SIGF1= 0
##$SIGF2= 0
##$SINO= 400
##$SIOLD= 32768
##$SREGLST= <1H.CDCl3>
##$SSB= 0
##$STSI= 32768
##$STSR= 0
##$SW_p= 5175.98343685301
##$SYMM= 0
##$S_DEV= 0
##$TDeff= 65536
##$TDoff= 0
##$TI= <Analysis number 999999
Compound Code 99
Book Reference 9
Project Code 9>
##$TILT= no
##$TM1= 0
##$TM2= 0
##$TOPLEV= 0
##$USERP1= <user>
##$USERP2= <user>
##$USERP3= <user>
##$USERP4= <user>
##$USERP5= <user>
##$WDW= 1
##$XDIM= 32768
##$YMAX_p= 424691469
##$YMIN_p= -122745
$$ End of Bruker specific parameters
$$ ---------------------------------
##NTUPLES= NMR SPECTRUM
##VAR_NAME=  FREQUENCY,     SPECTRUM/REAL,   SPECTRUM/IMAG
##SYMBOL=    X,             R,               I
##VAR_TYPE=  INDEPENDENT,   DEPENDENT,       DEPENDENT
##VAR_FORM=  AFFN,          ASDF,            ASDF
##VAR_DIM=   32768,         32768,           32768
##UNITS=     HZ,            ARBITRARY UNITS, ARBITRARY UNITS
##FACTOR=    0.157963299565203, 1,           1
##FIRST=     4132.6476996994, 0,             0
##LAST=      -1043.33573715361, 0,           0
##MIN=       -1043.33573715361, -122745,     0
##MAX=       4132.6476996994, 424691469,     0
$$ Real data points
##PAGE= N=1
##DATA TABLE= (X++(R..R)), XYDATA
$$ [...]
16256H31J71M41R59P88k17q00k88j185J073J906P56r61j483l46l42q6l78L67J658
16237B864m6l33m54j212L6N53o01q09O77Q58J025j38p96L41L14J296l3j477p05
16218A360j152k18J020k91J009J283k07l46j132l65l5N23J685K60l59p29L96j085
16200A617o07N59M45j072k12N01J543N77m24K85o37J048k04l06r7k83j073p36
16182I24KM59L46n73j17M36J582N16j439p33O66M43m82k63M82j52m67p99j179
16163c48J135K77r96p19J05j21j015L39Q18P9M38Q60p63K49J542J74j026K40J015
16144B283j34j85r72pp03l56M18l57l28k42j252J118N44J120M52p26J020j57n51
16125I85j21j104Q80j50q50m06R58L84m33l56Q81K137l17n87q73l71K84j14m87
$$ plain form
16256 831 1002 1443 2402 3190 2973 2173 1885 700 1773 3679 4435 3474 1991 1645 1303 1217 839 1206 2864
16237 2864 2818 2485 2031 819 855 1408 807 -2 675 1533 2558 2420 1624 1965 2279 3575 3542 2065 1360
16218 1360 208 -10 1010 719 1728 3011 2804 2458 1326 961 926 1449 3134 3394 3035 2306 2702 1617
16200 1617 1010 1569 2014 942 730 1231 2774 3351 2927 3212 2575 3623 3419 3113 3016 2733 1660 924
16182 924 926 1385 1731 1158 1041 1477 3059 3575 2136 1403 2069 2512 2030 1767 2249 2097 1630 831 -348
16163 -348 787 1064 68 -651 -546 -667 -1682 -1343 -525 -446 -8 852 89 338 1880 2054 1028 1268 2283
16144 2283 2149 1964 992 985 282 -74 344 -13 -341 -583 -1835 -717 -173 947 1399 673 1693 1536 985
16125 985 864 -240 640 490 -360 -766 192 576 143 -213 668 2805 2488 1901 1028 657 941 827 340
16106C40K69J341R20nq70o14m7m13j42K67j21O07J76J291K77j63p33j986j531
16087a137m2j27O31O94l72L76k45K09M9j52K51o68L44L12n36M59K80l45m25J556
16067A112P3N88n66n79L20J402Q97n52j035r05P11M17p89o61L44J417m31n28O68
16048A903J56L02O85L91m01j79K00k90k62r24J54Q54O27n56j00R71j176M9o41
16029A763j8n8m07N25q40j606p92M32J354J532r7j77R66j21J65j494j311N58N27
16010I01J92M2p23L69J102l31j015l0P1j088O2M26m84K99M00M50p36k9O56R06
15990A440K74k01m75o27l21r81M49O40j040p10k21Q94J019k25K3L28p9N34O68
15971A389j76k34J303J588n67l23K85J136J38J312R49J074R7N62J408p04j617
$$ plain form
16106 340 609 1950 2870 2865 1995 1381 1334 921 779 1046 925 1532 1708 2999 3276 3113 2380 394 -1137
16087 -1137 -1179 -1306 -675 19 -353 23 -222 -13 36 -116 135 -533 -189 123 -413 46 326 -19 -444 1112
16067 1112 1185 1773 1207 628 948 2350 3247 2695 1660 755 1466 1883 1094 433 777 2194 1763 1235 1903
16048 1903 2059 2361 3046 3437 3036 2857 3057 2767 2505 1581 1735 2589 3216 2660 2560 3531 2355 2404 1763
16029 1763 1745 1687 1280 1805 965 -641 -1433 -1001 353 1885 1788 1611 2577 2456 2621 1127 -184 374 901
16010 901 1093 1135 412 781 1883 1552 537 507 578 -510 -448 -22 -506 -207 193 643 -93 -122 534 1440
15990 1440 1714 1513 1038 411 90 -891 -442 198 -842 -1552 -1773 -879 140 -85 -62 266 187 721 1389
15971 1389 1213 979 2282 3870 3303 2980 3265 4401 4539 5851 6800 7874 7971 8533 9941 9237 7620
15954G620j264j41j591j635j714j098L02m13j00J243J37p03j091p46p41J091l60
15937a204L36J240l87p48M81k52n69M69n86o7k08m9K80J220J95l94O1J11p27K37
15917e61K42K39R65J32l52M49M39O4n40r19OP42P96k78KQ76P44j514r46m45K34
15896C75O64J242O58J271J801J067n50L40n10k93J173J92J626L669N711Q281J0052
15879C6769L434l360o689p512o786m385k321j098j719j385j502j166j440l9J541
15864B342l15K70M84L0J552m2k06K11n5m22M21L87j067j322j425L99N83M25p10
15845A540n26j7j79r91j10M45N44Q80k99j077j503R93J907l68k10P83q44N0k12
15826H06K91J83n15j53L17m04L03K89R31m0j65n84j676j592M16L21J291P47q58
$$ plain form
15954 7620 6356 6215 4624 2989 1275 177 479 66 -34 1209 1346 643 -448 -1194 -1935 -844 -1204
15937 -1204 -868 372 -15 -763 -282 -534 -1103 -634 -1220 -1287 -1495 -1544 -1264 -44 151 -243 -182 -71 -798 -561
15917 -561 -319 -80 885 1017 665 1114 1553 1617 1077 158 164 906 1702 1424 1426 2302 3046 1532 586 141 375
15896 375 1039 2281 2939 4210 6011 7078 6528 6868 6358 6065 7238 7430 9056 12725 18436 26717 36769
15879 36769 40203 36843 30154 22642 15856 11471 9150 8052 6333 4948 3446 2280 840 801 2342
15864 2342 2027 2297 2781 2811 4363 4321 4115 4326 4271 3849 4270 4657 3590 2268 843 1242 1825 2250 1540
15845 1540 1014 997 818 -173 -283 162 706 1586 1287 210 -1293 -300 1607 1239 1029 1812 968 1018 806
15826 806 1097 1280 765 612 929 525 828 1117 2048 2008 1843 1259 -417 -2009 -1593 -1272 19 766 -92
15807i2Q86k98j280J14N02K035K74j62J37k96N99R85N32K72J296J568L946M213
15789A5231K483Q22j187j711m444m116j248j253j518j868j888P88J92N76l84K81
15773G56K02j088J89J161p35j126o41L03O88N4k27j68n58m26L57p93l69N3K109
15754b59J957K75p10q47L43l92k14J72K9Q83k51k12P8j327L31J69K33L44j852
15735a250K8L66o07o78p7J402R98O49j30j377k070l34N91J955J714J167j295L4
15717A086O29p34O04K66m6j593k307j00j72L87N19K68N78Q7j97k0J162L54Q40
15698A611L24l59P12N1J250O19J390K579L129M625L138O17j615k347m389l139
15682H196l016j934j260l83J011J25j97m30R9n70j512q48Q4N86m57k31P22o31
$$ plain form
15807 -92 794 496 -784 -670 -168 1867 2141 1979 2116 1820 2419 3404 3936 4208 5504 7072 11018 15231
15789 15231 17714 18536 17349 15638 11194 7078 5830 4577 3059 1191 -697 91 283 859 475 756
15773 756 958 -130 59 1220 485 -641 -1282 -979 -291 -237 -464 -632 -1190 -1616 -1259 -2052 -2421 -2368 -259
15754 -259 1698 1973 1263 416 759 367 153 325 354 1237 986 774 852 -475 -144 25 258 602 -1250
15735 -1250 -1222 -856 -1463 -2141 -2218 -816 182 831 701 -676 -2746 -3080 -2489 -534 1180 2347 1052 1086
15717 1086 1715 981 1585 1851 1805 212 -2095 -2195 -2367 -1980 -1461 -1193 -615 -528 -725 -745 417 771 1611
15698 1611 1935 1576 2288 2339 3589 4208 5598 8177 11306 15931 19069 19686 18071 15724 11335 8196
15682 8196 5180 3246 1986 1603 2614 2739 2542 2112 2211 1641 129 -719 -635 -49 -506 -737 -15 -646
15664f46o27M7k3J55p20q23O4K363J549k68p40o62l37j356J22O64K63q96L7P58
15644a076j071j62K028J231K85j068j358n49J106o59p66O07P59rj0J75N55j28
15626a10j097l21j86J99R82r65K59M44N18j55r04J062R98p36q95k6N0J91O22j573
15606a643k07M80J153J25l03r86P20k46K64j81j96P00L16j0M47J00Q91J624K008
15587E056N11P4n24j815j076l18j343j660m49R03rq48q67L04k4k3J027K075q39
15568A55r60J38n3m66j237j517P66J401j224m35p81J003L099P86j034q35R0J150
15550D6k50K45L2n48l86m71l02p06q9J088L59n58l80N12m38J86p29n93N30M59
15530a993q15Q37J062j4R2P01o21L2N57k06p3P3l5o5M49M5o17q33q34R4R95k17
$$ plain form
15664 -646 -1273 -1226 -1249 -1094 -1814 -2637 -2573 -210 1339 1071 331 -331 -668 -2024 -1902 -1238 -975 -1871 -1834 -1076
15644 -1076 -2147 -2309 -281 950 1235 167 -1191 -1740 -634 -1293 -2059 -1452 -693 -702 -712 -537 18 -110
15626 -110 -1207 -1528 -1714 -1515 -533 -1498 -1239 -795 -277 -432 -1336 -274 724 -12 -907 -933 -883 -692 -70 -1643
15606 -1643 -1850 -1370 -217 -92 -395 -1381 -661 -907 -643 -824 -1020 -320 -4 -14 433 533 1424 3048 5056
15587 5056 5567 5641 5117 3302 2226 1908 565 -1095 -1544 -641 -650 -1498 -2365 -2061 -2085 -2108 -1081 994 155
15568 155 -805 -667 -720 -1186 -2423 -3940 -3174 -1773 -2997 -3432 -4213 -3210 -111 675 -359 -1194 -1104 46
15550 46 -204 41 73 -475 -861 -1332 -1634 -2340 -2429 -1341 -982 -1540 -1920 -1408 -1846 -1660 -2389 -2982 -2452 -1993
15530 -1993 -2808 -1971 -909 -923 -831 -130 -751 -719 -162 -368 -441 -368 -403 -468 -19 26 -591 -1424 -2258 -2164 -1169 -1386
15508a386L70R7l93p27Q38O35r4l85M22P24O4N83J95r23K01K45r81K35N04l45
15488a21q22L56Q85j23j055j041o66Q18q83j276N46Q09n92O89J260PM2n79M76
15469a270J237N12j178q56l83O94Q21j93r74m08L2N11Q91p51l53K55K02N31N67
15450a13o57j342P2j8j172m69N17P33l9m07O73J378P44j559k70O32r27p10O92
15431b242J183o58q51J76m41j120K13L44M56n10P20J23r71o52k62M5J284R66n93
15412b790N70J367K82p98m01q72q28N9J112J939Q11j457M02K62j084m47N44k46
15394a575l06o73R59K82l71M72R83K01j84N4m26l01o38L10J006n80p70p55j12
15375b424j169J26o78m64J107M84M61Q6L93J080l2j91P4j01j327j13K576L63j477
$$ plain form
15508 -1386 -1016 -919 -1312 -2039 -1201 -566 -660 -1045 -623 101 165 748 943 20 221 466 -515 -280 224 -121
15488 -121 -943 -587 298 175 -880 -1921 -2587 -1769 -2652 -3928 -3382 -2573 -3165 -2476 -1216 -1209 -1167 -1746 -1270
15469 -1270 -33 479 -699 -1555 -1938 -1244 -423 -616 -1590 -1998 -1966 -1455 -564 -1315 -1668 -1413 -1211 -680 -113
15450 -113 -770 -2112 -2040 -2058 -3230 -3699 -3182 -2449 -2488 -2895 -2222 -844 -100 -1659 -1929 -1297 -2224 -2934 -2242
15431 -2242 -1059 -1717 -2568 -2392 -2833 -3953 -3740 -3396 -2940 -3450 -2730 -2607 -3578 -4230 -4492 -4447 -3163 -2197 -2790
15412 -2790 -2220 -853 -571 -1369 -1770 -2642 -3470 -3411 -2299 -360 451 -1006 -604 -342 -1426 -1873 -1329 -1575
15394 -1575 -1881 -2554 -1595 -1313 -1684 -1212 -229 -28 -212 -158 -584 -885 -1523 -1213 -207 -787 -1557 -2312 -2424
15375 -2424 -3593 -3467 -4145 -4609 -3502 -3018 -2557 -2471 -2078 -998 -1030 -1221 -1147 -1248 -2575 -2688 -112 251 -1226
15356a226j011p23r6J114J157R64J10j63O50J32j036j165N9p23K56J304R46p63
15338b14j503K09K25J05n69o3K40l27k87J089L86N46r55o68K44J202J217j87q17
15319a27o01J089k04q94m14L70R65k35j743j88J69j44k37J614j60q44k03j57l66
15300b310k21K95J029P43n50L90j49M89n89p35M44N43j54n64r31Q83Q29K6L37
15281a95m68r43n27P13J558k46r34q43O50J910K61j361L12m79l03K36m17Q9k86
15262a273l09O90P84j502n28m49k07m16M3m67Q33Q76o65O2J042m1Q35o95L67K39
15242g81j088K49R40L99o61k18P31M10L61n86k92r49j7J524O3j191j129k25J83
15223b277O01j15m54l02L96j242j02J67J351J560J108N90l78j433j400l57L95
$$ plain form
15356 -1226 -2237 -2960 -3056 -1942 -785 179 289 126 776 908 -128 -1293 -1234 -1957 -1701 -397 549 -214
15338 -214 -1717 -1508 -1283 -1178 -1747 -1810 -1570 -1897 -2184 -1095 -709 -163 -1118 -1786 -1542 -340 877 690 -127
15319 -127 -728 361 157 -737 -1151 -781 184 -51 -1794 -1982 -1813 -1957 -2194 -580 -740 -1584 -1787 -1944 -2310
15300 -2310 -2531 -2236 -1207 -464 -1014 -624 -773 -284 -873 -1608 -1164 -621 -775 -1339 -2270 -1387 -558 -532 -195
15281 -195 -663 -1606 -2133 -1420 138 -108 -1042 -1885 -1235 675 936 -425 -113 -592 -895 -659 -1076 -987 -1273
15262 -1273 -1582 -892 -108 -1610 -2138 -2587 -2794 -3210 -3167 -3634 -2801 -1925 -2590 -2528 -1486 -1527 -692 -1387 -1020 -781
15242 -781 -1869 -1620 -680 -281 -942 -1160 -429 -19 342 -244 -536 -1485 -1502 22 85 -1106 -2235 -2460 -2277
15223 -2277 -1676 -1791 -2245 -2547 -2151 -3393 -3495 -3328 -1977 -417 691 1281 903 -530 -1930 -2287 -1892
15206a892J314J031L62l90p35M46J063Q24M84Q71l39n22m84j67r63Q52J389j179
15188A965o05p84K76J065K58R68o75q17m33M67j078j138o19np82j265M65J407
15170a330N64k94L04K9k43m76p44m77k22k39k62N10J31P86J134k92j210j026K73
15151c084K31P02r28o84O63J013p57j287J466K184l96r10n45o04M2J077J788j446
15133a475j610R38M82K6q57M51M63M52Q34P11K08m72j069j42N71n36q21P35M73
15114f38N13K65J77k53m99j038o12j62J331j59R30L72p65m86j171R27o03j273
15096c144p24O44J501lj319j55j3J349K090k92j47J04J86j100r49l5K84j38K73
15077a588P23p91k26J373J208J189l66n23K6l72l09j049L46P38j35p85r09o18
$$ plain form
15206 -1892 -578 453 815 425 -310 136 1199 2023 2507 3378 3039 2517 2033 1866 903 1755 3144 1965
15188 1965 1360 576 852 1917 2175 3143 2468 1651 1218 1685 607 -531 -1150 -1155 -1937 -3202 -2737 -1330
15170 -1330 -766 -1060 -756 -727 -970 -1446 -2190 -2667 -2889 -3128 -3390 -2880 -2749 -1963 -829 -1121 -2331 -3357 -3084
15151 -3084 -2853 -2151 -3079 -3763 -3100 -2087 -2844 -4131 -2665 -481 -877 -1787 -2332 -2936 -2894 -1817 -29 -1475
15133 -1475 -3085 -2147 -1665 -1639 -2496 -2045 -1582 -1130 -296 415 623 151 -918 -1060 -489 -1025 -1846 -1111 -638
15114 -638 -125 140 317 64 -435 -1473 -2085 -2247 -916 -1075 -145 227 -538 -1024 -2195 -1268 -1871 -3144
15096 -3144 -3868 -3224 -1723 -1726 -3045 -3200 -3213 -1864 226 -66 -213 -109 77 -1023 -1972 -2007 -1723 -1861 -1588
15077 -1588 -865 -1656 -1882 -509 699 1888 1522 999 1025 653 344 -705 -359 379 244 -541 -1450 -2068
15059b068j044j262J028J288l53r6L75L41Q56N23J53J87j76l0p66N58J122K138
15041B774o20j217r21m68O67K4L56m31M05J62n23K21j68J37Q69O6o17n36Km65
15021b83k21j309j13J561N88J92o61M53q13O10J7J429l51j898j400L16R95Q2N38
15002b68J91N75O2j07l19l59l01j466j081O38O09o57j214L36Q19J38j32R96J07
14983a433n2J270j71j605p49q3L81K72j8J36p4k96N41M45O34j80q50o87k97J088
14963a728N66K09k83lj3n94p35m4l57p02R94R50j233o73J221J64j65j43J076p83
14943b276r51M33O31N62j87N6o59j912k80J10M20J435R10j015J78K85o2m04j98
14924b924P6l2J75O54L64M34L35n18j26o1k73L0J043L92o13P2M28r71o03m84q03
$$ plain form
15059 -2068 -3112 -4374 -3346 -2058 -2411 -2507 -2132 -1791 -935 -412 -259 -72 -248 -278 -1044 -486 636 2774
15041 2774 2154 937 16 -452 215 239 595 164 569 731 208 429 261 398 1267 1333 716 180 182 -283
15021 -283 -504 -1813 -1926 -365 223 415 -246 207 -606 4 21 1450 1099 -799 -2199 -1883 -888 -806 -268
15002 -268 -77 498 560 453 134 -225 -526 -1992 -3073 -2435 -1826 -2483 -3697 -3361 -2542 -2404 -2536 -1540 -1433
14983 -1433 -1485 -215 -386 -1991 -2740 -2823 -2442 -2170 -2188 -2052 -2126 -2422 -1881 -1436 -802 -982 -1832 -2519 -2816 -1728
14963 -1728 -1162 -953 -1236 -1239 -1252 -1846 -2581 -2625 -2982 -3684 -2690 -1740 -2973 -3646 -2425 -2261 -2426 -2569 -1493 -2276
14943 -2276 -3227 -2794 -2163 -1601 -1788 -1732 -2391 -4303 -4583 -4473 -4053 -2618 -1708 -2723 -2545 -2260 -2322 -2726 -2924
14924 -2924 -2848 -2880 -2705 -2051 -1687 -1253 -918 -1436 -1562 -1623 -1896 -1866 -823 -431 -1044 -972 -544 -1515 -2118 -2602 -3405
14903c405n52m29L39K93K42K72R04L53K51M71Q72J39p47j585j501P49P0K24J118
14884a922J28q30P5J115J8p53j296q9j84J476J33L58L0o33p35P31n83M09L88N88
14864a576J83j364P04Q87l34nO18P15O85n61n92p06k65q07p20j090M12J258m42
14845c000O86j27o64l56M19O11K5q20j83L29o06R38J045j80n93l68N4J28L90l96
14825b668j91R17R83l91m58L45L97r01q59P18R33N35j025m70R68p65j146N4J92
14806b832J243K91k52N62J444p17j397p38K52M37J02J31j90r20o33j70m22k43
14788d052M43R68K64o04L32M37M89j46m04m79r45L44J669J190p1j515m42J045
14770a477J86j522r77j58m67P35J115J30k4Q17R37J79N1O72o22N3nL57Q37N14
$$ plain form
14903 -3405 -3957 -4386 -4047 -3754 -3512 -3240 -2336 -1983 -1732 -1261 -389 -250 -997 -2582 -4083 -3334 -3264 -3040 -1922
14884 -1922 -1794 -2624 -2549 -1434 -1416 -2169 -3465 -3554 -3738 -2262 -2129 -1771 -1741 -2374 -3109 -2378 -2961 -2552 -2164 -1576
14864 -1576 -1393 -2757 -2053 -1166 -1500 -1505 -887 -172 513 -48 -640 -1346 -1611 -2418 -3138 -4228 -3816 -2558 -3000
14845 -3000 -2314 -2441 -3105 -3461 -3042 -2431 -2406 -3226 -3409 -3080 -3686 -2748 -1703 -1883 -2476 -2844 -2790 -2662 -2272 -2668
14825 -2668 -2859 -1942 -959 -1350 -1808 -1463 -1066 -1967 -2826 -2108 -1175 -640 -1665 -2135 -1167 -1932 -3078 -3024 -2832
14806 -2832 -1589 -1298 -1550 -988 456 -261 -1658 -2396 -2144 -1707 -1605 -1474 -1664 -2584 -3217 -3387 -3809 -4052
14788 -4052 -3609 -2641 -2377 -2981 -2649 -2212 -1723 -1869 -2273 -2752 -3697 -3353 -1684 -494 -565 -2080 -2522 -1477
14770 -1477 -1291 -2813 -3790 -3948 -4415 -3680 -2565 -2435 -2459 -1642 -705 -526 -475 197 -425 -372 -377 -20 817 1331
14750A331L75n93j06J99Q33L00J33J383n4q73k105j596p0Q85J145L16j016j518
14732a031o57N7J31m09J93K37N69K74m64m05J10nO22q47j298k60J210m13L70K45
14712a771o17q3Q4J8P72J004k88J94K95r66K32j35L17L24N50M47K12j075m55q0
14692a021L08r03n84k70l57J23L57RN20L95k71rR78j47P7p1q3q12n14K54M79o88
14670b230M40J097j4p7n51K95j163O40J849j92q61K04P37R35J571M26q21Q04J027
14651D116J921K269P93L70q7J29O69M17l98N47O66j083o26k8k000k077j528j185
14633B885o12n93o20R54N39q89p63N95k55p88k50k38O93r25n30k38l79n86N95
14614a405J117l29n76o11r87K85J387J212n46q94j477o25j82J811R26j003o92
$$ plain form
14750 1331 1706 1113 1007 1206 2039 2339 2472 3855 3801 2928 823 -773 -843 42 1187 1503 487 -1031
14732 -1031 -1688 -1631 -1500 -1909 -1716 -1479 -910 -636 -1100 -1505 -1395 -1400 -778 -1625 -2923 -3183 -1973 -2386 -2016 -1771
14712 -1771 -2388 -2471 -2387 -2369 -1597 -593 -881 -687 -392 -1358 -1126 -1261 -944 -620 -70 377 589 -486 -941 -1021
14692 -1021 -713 -1616 -2200 -2470 -2827 -2704 -2347 -2338 -1818 -1423 -1694 -1703 -725 -872 -795 -866 -949 -1761 -2275 -2021 -1542 -2230
14670 -2230 -1790 -693 -707 -784 -1335 -1040 -2203 -1563 286 94 -767 -563 174 1109 2680 3106 2285 3089 4116
14651 4116 6037 8306 9099 9469 9382 9511 10180 10597 10199 10746 11412 10329 9703 9675 7675 5598 4070 2885
14633 2885 2273 1680 1060 2014 2553 1664 901 1496 1241 453 203 -35 658 -267 -797 -1035 -1414 -2000 -1405
14614 -1405 -288 -617 -1193 -1804 -2791 -2506 -1119 93 -453 -1347 -2824 -3449 -3631 -1820 -894 -1897 -2589
14597b589M29R35N88l46J04N93L17N76l22l73J81k45k243o25J30J70L14p0K85
14578b191q91M98l55K71R66m25j149P01j92L06J346k12p44j01n31L93O37k81k42
14559b196j048j342J30N50L06k93L28r2R51J594n58j37j76J290k67k57N60J065
14541D08p72j498k39j184m87JJ376J298k47N96R69j759j473o38N38L39r38P39
14523b971O28m7J15O36j013j31o06M33n82j43M49N13K96M32P19M73M55o59j329
14504b332k74l90L27P71l0o54o52J144R09J013p51j949k023o79K034R21n81J34
14486c062m13j634OJ511j41M50K07J87K5l40M03r02l16k94J612J009k30J165k28
14467i85j293m85M82J73J34K03L37k58n89o89j345J13M51o42M95L94P27K38n43
$$ plain form
14597 -2589 -2160 -1225 -637 -983 -879 -286 31 607 285 -88 93 -152 -2395 -3020 -2890 -2720 -2406 -2476 -2191
14578 -2191 -3082 -2584 -2939 -2668 -1702 -2127 -3276 -2575 -2767 -2461 -1115 -1327 -2071 -2172 -2703 -2310 -1673 -1954 -2196
14559 -2196 -3244 -4586 -4456 -3906 -3600 -3893 -3565 -3657 -2706 -1112 -1670 -1807 -1983 -693 -960 -1217 -657 408
14541 408 -364 -1862 -2101 -3285 -3772 -3771 -2395 -1097 -1344 -748 221 -1538 -3011 -3649 -3111 -2772 -3710 -2971
14523 -2971 -2343 -2390 -2275 -1639 -2652 -2783 -3389 -2956 -3538 -3681 -3232 -2719 -2423 -1991 -1272 -799 -344 -1003 -2332
14504 -2332 -2606 -2996 -2669 -1898 -1928 -2582 -3234 -2090 -1181 -168 -919 -2868 -4891 -5570 -3536 -2615 -3196 -3062
14486 -3062 -3475 -5109 -5103 -3592 -3733 -3283 -3076 -2889 -2864 -3204 -2801 -3703 -4019 -4313 -2701 -1692 -1922 -757 -985
14467 -985 -2278 -2763 -2281 -2108 -1974 -1771 -1434 -1692 -2281 -2970 -4315 -4202 -3751 -4393 -3898 -3504 -2777 -2539 -3082
14448c082%J218K48K10j062K09J251m77p4q46p86l23K12k86J457J129p87l86m72
14429b647OL58m11j0l00n66p7N56O83M75J149j176m66K60J047M93K87K07L7l05
14409d00j454j101o16q6nq2M50Q62k72q64j113M01r16L18J660Q51N18N88L43q03
14389a721j090j207r10J61J102p2o07J176n01k48n57J87N31k34j379O15J79n56
14371e131K88J639J360j169L40M14J399r38j11j42p91m93J023ql37K40j155RJ21
14352c442j4L29K40m97m42M17K18q40N0n59L09J252P34O34R10n44j301n02N84
14333b464m80K95P50p20j73l8q14o90O13L11P47K57o60k98L39J054k00M6K66M70
14313a389j135q85%M74P58Q78m83r57R81J159p58j79k05m0O05J93j74p74k65L8
$$ plain form
14448 -3082 -3082 -1864 -1616 -1406 -2468 -2259 -1008 -1485 -1559 -2405 -3191 -3514 -3302 -3588 -2131 -1002 -1789 -2175 -2647
14429 -2647 -2641 -2283 -2694 -2704 -3004 -3570 -3647 -3091 -2408 -1933 -784 -1960 -2426 -2166 -1119 -626 -339 -132 -95 -400
14409 -400 -1854 -2955 -3571 -3657 -3662 -3744 -3294 -2432 -2704 -3568 -4681 -4280 -5196 -4878 -3218 -2367 -1849 -1261 -918 -1721
14389 -1721 -2811 -4018 -4928 -4767 -3665 -3737 -4344 -3168 -3669 -3917 -4474 -4287 -3756 -3990 -5369 -4754 -4575 -5131
14371 -5131 -4843 -3204 -1844 -3013 -2673 -2259 -860 -1798 -1909 -2051 -2842 -3335 -2312 -2320 -2657 -2417 -3572 -3563 -3442
14352 -3442 -3456 -3127 -2887 -3384 -3826 -3409 -3191 -4031 -3981 -4540 -4231 -2979 -2245 -1611 -701 -1245 -2546 -3048 -2464
14333 -2464 -2944 -2649 -1899 -2619 -2792 -2830 -3644 -4334 -3721 -3410 -2663 -2406 -3066 -3364 -3025 -1971 -2171 -2125 -1859 -1389
14313 -1389 -2524 -3409 -3409 -2935 -2177 -1299 -1782 -2739 -1758 -599 -1357 -1536 -1741 -1781 -1176 -983 -1157 -1931 -2196 -2158
14293b158n71m56L09J282L66m98k136n87Q27O8%j087j249J07J693P52J90j071
14275d219j13N1P52Q34P06N7m03q38Q37q56N8O57j43M83J2j027Q88J600N64r49
14255a049j977P9n3l37l88kJ282P02m21J63q96k04m72J97r06m09J443M28j50p8
14235c048j143j098J055m72N37L92j149q55P77J279Q77k11o97L69L07k06K94L32
14217b660p05m11j84j13J137J121J88j188j563k66oJ465P71j460M47P39L92k59
14199b555j48L98L34j106K0L91L43P3N35M57o63o28O30j04o9M44N18K0o96L9P38
14178a029p26r90q97Q96J580J54o81j866p77P02K16J50P82R52j41K06j0O59p8
14159h98q01p69J06K81J406j3j803n99P36J069L11j87l78j065j021Q20J927o84
$$ plain form
14293 -2158 -2729 -3185 -2876 -1594 -1228 -1726 -3862 -4449 -3622 -3554 -3554 -4641 -5890 -5783 -4090 -3338 -3148 -4219
14275 -4219 -4332 -4281 -3529 -2695 -1989 -1932 -2335 -3173 -2336 -3192 -3134 -2477 -2620 -2137 -2125 -3152 -2264 -664 -100 -1049
14255 -1049 -3026 -2947 -3000 -3337 -3725 -3727 -2445 -1743 -2164 -2001 -2897 -3101 -3573 -3376 -4282 -4691 -3248 -2820 -2970 -3048
14235 -3048 -4191 -5289 -4234 -4706 -4169 -3777 -4926 -5781 -5004 -3725 -2848 -3059 -3756 -3387 -3080 -3286 -2992 -2660
14217 -2660 -3365 -3776 -3960 -4073 -2936 -1815 -1627 -2815 -4378 -4644 -4650 -3185 -2414 -3874 -3427 -2688 -2296 -2555
14199 -2555 -2703 -2305 -1971 -3077 -3057 -2666 -2323 -2250 -1715 -1258 -1921 -2549 -1919 -2023 -2092 -1648 -1130 -1110 -1806 -1767 -1029
14178 -1029 -1755 -2745 -3642 -2746 -1166 -1012 -1693 -3559 -4336 -3634 -3418 -3268 -2486 -1534 -1675 -1469 -1479 -820 -898
14159 -898 -1699 -2468 -2362 -2081 -675 -688 -2491 -3090 -2354 -1285 -974 -1161 -1539 -2604 -3625 -2805 -878 -1562
14141a562j66L30Q9J32j202q04R86L21Jr98j22J307l31O00l24m4J88o37j002J04
14121c134j73K35l81m44M28K32L54m28J470J0K1j28j475K12K46n61o81J31k79
14102d345O69N07J029n96m21k33N18N02p2j07r59J79JN21J149K29j398P6N17r9
14082b333j05m46j81M21n49Q08R35m17n51n3J126k85j064r19j184k82J247K721
14064a111N84p43o6j40O26J30O35J208n35j264q08q02q03j75L62J111m2k55j89
14045b277k43M22L65L9L22r8m14J86n71L43N56q05m74q12P96M26p4m24j531j61
14025d429O6J89M95R49J639n33j921J41L24J48P08O71n9j339j58N57p33r57J78
14006d064J321O70P45L61q6n09k97q9k52k03q6K41O93J26n11J15j087j413J125
$$ plain form
14141 -1562 -1728 -1398 -1309 -1177 -2379 -3183 -2197 -1876 -1875 -2873 -2995 -1688 -2019 -1419 -1743 -1787 -1599 -2236 -3238 -3134
14121 -3134 -3307 -3072 -3453 -3897 -3469 -3237 -2883 -3311 -1841 -1831 -1810 -1938 -3413 -3201 -2955 -3516 -4197 -4066 -4345
14102 -4345 -3676 -3169 -2140 -2736 -3157 -3390 -2872 -2370 -2442 -2549 -3508 -3329 -3328 -2807 -1658 -1429 -2827 -2751 -2234 -2333
14082 -2333 -2438 -2884 -3065 -2644 -3193 -2385 -1450 -1867 -2418 -2471 -1345 -1630 -2694 -3613 -4797 -5079 -3832 -1111
14064 -1111 -527 -1270 -1336 -1476 -850 -720 -85 1123 588 -676 -1484 -2286 -3089 -3264 -2902 -1791 -1833 -2088 -2277
14045 -2277 -2520 -2098 -1733 -1694 -1372 -1470 -1884 -1698 -2269 -1926 -1370 -2175 -2649 -3461 -2665 -2239 -2313 -2737 -4268 -4429
14025 -4429 -4363 -4174 -3679 -2730 -1091 -1624 -3545 -3404 -3080 -2932 -2224 -1553 -1612 -2951 -3109 -2552 -3285 -4242 -4064
14006 -4064 -2743 -2073 -1328 -967 -1053 -1562 -1859 -1948 -2200 -2403 -2489 -2248 -1555 -1429 -1940 -1825 -2912 -4325 -3200
13987c200Q30o28l18J114j58N90N73j42k42O4m14J43j74n09r24j450J300O79P56
13968b110j50j277J149J696r38q41l74k90O46M36j325M61L82o6o22J463p56N26
13950a990P59m64K77J760P8m60p96N86J06Q67j414k282j346R87J331m75N69J660
13932b47m71m22L79L86n65j104j015N38P21Q1o81O5o0n82J067j54J32K13j017
13913b736K61K04M01K41j075K10N99Q65N47o18r75J48j18N39l13r68j661M39J316
13894b694R39P6O94L95J11p58j706m52R24O91K24N89K70O25j092r25J323R37O3
13875B34p12o21j91n55J11Q93j102o81L3J052P98n41l6K56P67p93Q15r55m61O98
13855i91j286r08J53k73J17J404J585P33j819j628L63P01P06J531l26N1O18j120
$$ plain form
13987 -3200 -2370 -2998 -3316 -2202 -2360 -1770 -1197 -1339 -1581 -1517 -1931 -1788 -1962 -2471 -3395 -4845 -3545 -2866 -2110
13968 -2110 -2260 -3537 -2388 -692 -1630 -2471 -2845 -3135 -2489 -2053 -3378 -2917 -2535 -2601 -3223 -1760 -2516 -1990
13950 -1990 -1231 -1695 -1418 342 420 -40 -836 -250 -144 723 -691 -2973 -4319 -3332 -2001 -2476 -1907 -247
13932 -247 -718 -1140 -761 -375 -940 -2044 -3059 -2521 -1800 -1719 -2400 -2335 -2395 -2977 -1910 -2064 -1932 -1719 -2736
13913 -2736 -2475 -2271 -1870 -1629 -2704 -2494 -1895 -1030 -483 -1101 -2076 -1928 -2046 -1507 -1820 -2788 -4449 -4010 -2694
13894 -2694 -1755 -1679 -985 -590 -479 -1237 -2943 -3395 -2471 -1780 -1556 -967 -697 -72 -1164 -2089 -766 171 234
13875 234 -478 -1099 -1290 -1845 -1734 -841 -1943 -2624 -2591 -1539 -741 -1282 -1318 -1062 -295 -1088 -273 -1228 -1689 -991
13855 -991 -2277 -3185 -3032 -3305 -3188 -1784 -199 534 -1285 -2913 -2550 -1849 -1143 388 62 113 731 -389
13837c89k50M26Q22l61j32o24l13O41o81K82k86j615R38J207N7n40q31o55P96
13818a508J641o92M0J85k36O8J44K95N86j047K96O68l92j717J04j54j344K88R05
13799a870M68J03N07J285m5j656j10P8j59J052J00o46j350M29K02K85p20O85O45
13780g17Q96m23k26N99j11N4K45P3n75o86K83M8J186M69r41p68l70J029L59K0
13760D44j33j29k20n23q23n61j63K68L23n4j40K55K66M31n3l38j79k5O44R27K88
13739E05j431l01J186L10J081K62L88L27n84j089k72K43L37k93j10Q3J58j65j000
13720c65K94o69r63J305O28j01M28l37Q0N2R90Q30m98r94M00m01r60o75R08P5
13700B7P42j397q68K5J265J933J643j743j550K14O32P46j069q68J23n71o20nJ74
$$ plain form
13837 -389 -639 -213 609 248 116 -508 -821 -180 -861 -579 -865 -2480 -1542 -335 -278 -818 -1649 -2304 -1508
13818 -1508 133 -559 -519 -334 -570 -502 -358 -63 523 -524 -228 440 48 -1669 -1565 -1719 -3063 -2775 -1870
13799 -1870 -1402 -1299 -792 493 448 -1208 -1318 -1240 -1399 -347 -247 -893 -2243 -1814 -1612 -1327 -2047 -1362 -717
13780 -717 179 -244 -470 129 18 72 317 390 -185 -871 -588 -540 646 1115 174 -594 -964 65 424 444
13760 444 311 182 -38 -561 -1384 -1945 -2108 -1840 -1517 -1571 -1711 -1456 -1190 -759 -812 -1150 -1329 -1354 -710 217 505
13739 505 -926 -1227 -41 269 1350 1612 2000 2327 1743 654 382 625 962 669 559 642 800 635 -365
13720 -365 -71 -740 -1703 -398 230 129 557 220 300 352 1342 2172 1674 680 1080 679 -281 -956 -48 27
13700 27 769 -628 -1496 -1471 -206 1727 3370 1627 77 291 923 1669 600 -268 -145 -716 -1336 -1341 -1167
13681a167J191P58j22K97J163p86q70j825o23K488J223k39q10j025j110J1J112
13664c34J075M69m08J248P12n03j25l78j456l00J2j45j170l13K18O54J219N32
13646A007N4k7l03n73l15K11j191o50NJ345j88L46K95J57l33N74k90k57M24L12
13626F03p04r42m97O03N20j06l5Q1J629O68j065n14J538R68l28j810j066L27J500
13607A370o64o66K372J798j36j088j368j245j349j84J619N06q33J214J89J41Q56
13590B532n14j006p03J085J552M52j018j058o01O24P50Q81j051r15J207J915n22
13573C610j450J62k51j345k27N90J095l76l33J000M34p80J67p0j34Q21J28j222
13555A819r22K59j47o8o46j170K0J205J429P92o56J34k36L2J186K46k05N14n98
$$ plain form
13681 -1167 24 782 660 957 2120 1334 464 -1361 -1984 504 1727 1488 678 -347 -1457 -1446 -334
13664 -334 741 1210 802 2050 2762 2259 2134 1756 300 0 12 -133 -1303 -1616 -1398 -744 475 1007
13646 1007 1061 1034 731 158 -157 54 -1137 -1787 -1782 -437 -625 -279 16 173 -160 414 124 -133 291 603
13626 603 -101 -1043 -1540 -937 -417 -523 -558 -477 1152 1820 755 241 1779 2747 2419 609 -457 -130 1370
13607 1370 706 40 2412 4210 4074 2986 1618 373 -976 -1160 459 965 132 1346 1535 1676 2532
13590 2532 2018 1012 309 1394 2946 3398 2380 1322 721 1345 2095 2976 1925 1010 2217 4132 3610
13573 3610 2160 2322 2071 726 499 1089 2184 1808 1475 2475 2909 2129 2296 2226 2092 2913 3041 1819
13555 1819 897 1156 1009 941 295 -875 -855 350 1779 2571 1915 2049 1813 1845 3031 3277 3072 3586 2988
13536B988k007J50J620Q80k89J12k8J87L9n02r11k74Q55o99L40O85p73J64J008
13517C545l19K73k95j054k29l96j19K18Q4J53l5m21m78L75M94R69J219K10n41
13498C653j200j24O74RK12m70N5N12m94M07o0n81K3Q75M43J053J668R9j059J87
13478E882Q58J437K72m38o75q10q36J001m37M49J02o00J89j948M25m10j428L20
13460C353N50l44n34J064m5m09R30N75L63K34j96j654p84J875N25k70j27o5l05
13441D736L96K28j27R53K38O4K43L53K09R82J092P42o17k055j493l78l2o48Q65
13422E751O50M08m0r13l26K10m11r52r04P71J496P04r22J23q13j434N71J06R45
13403E020p88k170l6L24J181K59O05R83K86p27j58Q0N23J553J028p07j439M53
$$ plain form
13536 2988 981 1131 2751 3631 3342 3454 3426 3613 3652 3150 2239 1965 2820 2121 2461 3146 2373 2537 3545
13517 3545 3226 3499 3204 2150 1921 1525 1406 1624 1708 1861 1826 1405 927 1302 1796 2765 3984 4194 3653
13498 3653 2453 2329 3003 3012 3224 2754 2809 3321 2827 3234 3174 2593 2616 3491 3934 4987 6655 6754 5695 5882
13478 5882 6740 8177 8449 8011 7336 6526 5690 6691 6254 6703 6805 6205 6394 4446 4871 4461 3033 3353
13460 3353 3903 3559 3025 4089 4044 3635 4565 5140 5503 5737 5541 3887 3103 4978 5503 5233 5106 5041 4736
13441 4736 5132 5360 5233 6186 6424 6488 6731 7084 7293 8275 9367 10109 9492 7437 5944 5566 5534 4886 5751
13422 5751 6401 6809 6769 5856 5530 5740 5329 4377 3473 4244 5740 6444 5522 5645 4832 3398 3969 4075 5020
13403 5020 4232 2062 2026 2350 3531 3790 4395 5378 5664 4937 4779 4859 5382 6935 7963 7256 5817 6270
13385F270J704L30L63l89k156j705L71J343R77O6m99M03m47J72Q56R53m85j016
13367G111l08n49K09J088J4o12k54M24p48k95r84K23J87L3Q03O81l57k01l83M01
13347F483J96J77k21j474o72J87N58J483L60q04j171J948J041O2j041M15j88j56
13329G183j09p16R96N37L91q19j145KK82K27n20j053j23R60P23r79J98P03N0J46
13309F934O44R85M39n2M16j11L18q12k60J111J410J44m34p00j4k21j642k64M42
13290H333J116M78m17o97l60j61n22J526L5j117r62J585N00k59K92l18q75L89
13272H566M57j215L56J73O60R48j02kp80K81K28k93M16O62k57n25P60n62J45N75
13252A0491R62M03n57M70R11N63J247o27p33l54M40k40L37p1j235l15N03m91j452
$$ plain form
13385 6270 7974 8304 8667 8278 6122 4417 4788 6131 7108 7174 6675 7078 6631 6803 7659 8612 8127 7111
13367 7111 6803 6254 6463 7551 7565 6953 6699 7123 6375 6080 5096 5319 5506 5539 6342 7023 6666 6465 6082 6483
13347 6483 6679 6856 6635 5161 4489 4676 5234 6717 7077 6273 5102 7050 8091 8153 7112 7527 7339 7183
13329 7183 7074 6358 7354 7891 8282 7463 6318 6320 6602 6829 6309 5256 5133 6093 6816 5837 6035 6738 6788 6934
13309 6934 7578 8563 9002 8950 9366 9255 9573 8761 8501 9612 11022 11166 10732 10032 10018 9797 8155 7891 8333
13290 8333 9449 9927 9510 8813 8453 8292 7770 9296 9331 8214 7252 8837 9337 9078 9370 9052 8177 8566
13272 8566 9023 7808 8164 8337 8997 9945 9843 9841 9061 9342 9570 9277 9693 10355 10098 9573 10333 9771 9916 10491
13252 10491 11453 11856 11299 11769 12680 13243 14490 13863 13130 12776 13216 12976 13313 13242 12007 11692 12195 11704 10252
13233A0252l63n29P21K14J477j595n16K318L63l28P55m53K8L5l42M48r64n81N38
13214A1478J02k81P8l21j65n67o14J149J712j236r73J606J564P0O0l56Q1l73L97
13195A3411N42m07K96J028l26q71j924k42l70m39N71J699J391k00k18N09N79R68
13177A5997j611o11K57J048R57M20o8J61n53q39n77q18j79J024O94M06J19M2r7
13158A5772l57M54K47J62j3m95k84P09k1k33p42j040P95P68J904M66N04o41k97
13139A7658l14j260n25J013k76K42Rp18N60J696J136n7K31P42r96n22N11J130
13121B0260o76j843k92j80P95Q35J083J654p5j425j285J154kM3J35q10j91M34
13103A9614J319j86j36j69O50N58M72j036j244R9L22K23j16p72j033k13R84J852
$$ plain form
13233 10252 9889 9360 10081 10295 11772 10177 9661 11979 12342 12014 12769 12316 12344 12379 12037 12485 11521 10940 11478
13214 11478 11580 11299 11377 11056 10891 10324 9710 10859 12571 11335 10362 11968 13532 13602 13662 13306 13387 13014 13411
13195 13411 13953 13546 13842 14870 14544 13673 11749 11507 11137 10698 11269 12968 14359 14159 13941 14450 15029 15997
13177 15997 14386 13775 14032 15080 16037 16457 16389 16550 15997 15158 14581 13763 13584 14608 15302 15708 15827 15869 15772
13158 15772 15415 15869 16116 16278 16265 15770 15486 16195 16174 15941 15199 14159 14954 15722 17626 18092 18596 17955 17658
13139 17658 17344 16084 15559 16572 16296 16538 16547 15829 16389 18085 19221 19164 19395 20137 19141 18619 19130 20260
13121 20260 19584 17741 17449 17269 18064 18899 19982 21636 21561 20136 18851 20005 20003 20046 20181 19371 19180 19614
13103 19614 20933 20747 20611 20442 21092 21650 22122 21086 19842 19941 20263 20486 20370 19598 18565 18352 19336 21188
13085B1188N05p85J8R4j86q21o79L54J57n80J038n49o36n62k79J375J846KK30
13066B1730N72q49O23J059O52q76k48J602P38o78j211M89J213J338N04P46L46
13049B7750j365k56J062Q5O51j706j034J5j08m3L35J059J116N21L92m87j607k65
13031B6115r86k67J664K042J467m70j135M97J169k70j393j685R48J030O20l76
13015B8970n52r3O35Q96J483P59j666m33L75O54R24r96k99M16O94j09j312j256
12997B9090R24J553J770J669J203k130j178j10L1Q1q3O62K20m26m29L82Q26J050
12979C5105p9k17j161m58KJ242J398l43k76Q24r5R11J023M34o49j529n31N15k96
12960C5820P94J581Q20M52j58m60o74l20P03P63R14j70L36K20m27p4K17N54M62
$$ plain form
13085 21188 21693 20908 20926 21020 20834 20013 19334 19688 19845 19265 20303 19754 19118 18556 18277 19652 21498 21500 21730
13066 21730 22302 21453 22076 23135 23787 22911 22663 24265 25003 24325 23114 23603 24816 26154 26658 27404 27750
13049 27750 26385 26129 27191 27276 27927 26221 25187 25202 25094 25051 25386 26445 27561 28082 28474 27987 26380 26115
13031 26115 25129 24862 26526 28568 30035 29565 28430 28927 30096 29826 28433 26748 27696 28726 29346 28970
13015 28970 28418 28325 28960 29856 31339 32098 30432 29999 30374 31028 31952 30956 30657 31073 31767 31658 30346 29090
12997 29090 30014 31567 33337 35006 36209 34079 32901 32791 32822 32903 32820 33482 33702 33276 32847 33229 34055 35105
12979 35105 35026 34809 33648 33190 33192 34434 35832 35489 35213 36037 35942 36853 37876 38310 37661 36132 35601 36116 35820
12960 35820 36614 38195 39015 39467 39309 38849 38175 37855 38558 39321 40235 40065 40401 40621 40194 40120 40337 40891 41353
12941D1353n78M76R35K04r8r33J520J871n98o53r59m12J400r1j281J390J391P52
12923D5689M88J087J05Q20j39m32j733o29P95O21J252J75m65J041N12n93p06o71
12905D7217J713J170j468j446J441l0J577J338O61j6k89o50o1m87n56Q44J927
12888E2885m98o06O86q10R62Q84l45J009J286j61l73K95N54j59k9J007P5J23J312
12869E8097Q57J019p8m94L01J339J192r49o47P51k85R10J603L51l11q68P55O28
12851F4171J547j7j89m36p47J06P52M11J201L04J191O49j9P62J01K19Q4o14L78
12832F9854k10n05J119O51M38J241P44j02R08O8M6J203J984P79m85k35q9N63R31
12813G8903N62R59m5M58m70J607Q29m1j34J994J309m64L66M54J50j8J41N57l49
$$ plain form
12941 41353 40775 41251 42186 42390 42292 41359 42879 44750 44152 43499 42540 42128 43528 43437 42156 43546 44937 45689
12923 45689 46177 47264 47369 48189 48050 47618 45885 45256 46051 46672 47924 48099 47634 48675 49187 48594 47888 47217
12905 47217 48930 50100 48632 47186 48627 48597 50174 51512 52173 52157 51868 51218 51157 50670 50114 50958 52885
12888 52885 52387 51781 52467 51657 52619 53503 53158 54167 55453 55292 54919 55214 55768 55609 55580 56587 56662 56785 58097
12869 58097 58954 59973 59895 59401 59702 61041 62233 61284 60637 61388 61103 62013 63616 63967 63656 62788 63543 64171
12851 64171 65718 65701 65512 65076 64329 64435 65187 65598 66799 67103 68294 68943 68924 69686 69787 70006 70090 69476 69854
12832 69854 69644 69139 70258 70909 71347 72588 73332 73230 74138 74206 74252 75455 77439 78218 77733 77498 77409 77972 78903
12813 78903 79465 80424 80379 80837 80367 81974 82803 82762 82628 84622 85931 85467 85833 86287 86437 86419 86560 87117 86768
12794H6768O36O83m30P98J797N39J32o6R42J846J758J254N06j97P29l79l59Q13
12776I7770j39K80Q18J173Q0k03R88Q88l19K86O50J925P32M48K29J01j35R0O22
12757A06284Q44J056N37P8J454J416M56J98m84M80K321N57N04m9J456J020J51
12740A18279Q90n79K40J683J080k90J005K083N87K326J315M40J467J397M17P63
12724A33103J777J150K529J883J279J315O02J554J132J17J664J443K37P17Q52
12709A51354J371K641J516J527j15R89J396K049J323Q11K087J581J928J753J468
12694A73679K638N34J177K600Q88J347J797J669J567Q98K044J203O28J569K040
12679A96278K156J897J518K840L088J196J454K413K288J952J428L100J598P64
$$ plain form
12794 86768 87404 88087 87657 88455 90252 90791 90923 90857 91799 93645 95403 96657 97163 96966 97695 97316 96957 97770
12776 97770 97631 97911 98729 99902 99982 99779 100767 101655 101336 101622 102272 104197 104929 105377 105606 105707 105572 105662 106284
12757 106284 107128 108184 108721 108799 110253 111669 112125 112323 111839 112319 114640 115197 115701 115652 117108 118128 118279
12740 118279 119169 118590 118830 120513 121593 121303 122308 124391 124978 127304 128619 129059 130526 131923 132340 133103
12724 133103 134880 136030 138559 140442 141721 143036 143638 145192 146324 146441 148105 149548 149785 150502 151354
12709 151354 152725 155366 156882 158409 158294 159283 160679 162728 164051 164862 166949 168530 170458 172211 173679
12694 173679 176317 176851 178028 180628 181516 182863 184660 186329 187896 188794 190838 192041 192669 194238 196278
12679 196278 198434 200331 201849 204689 207777 208973 210427 212840 215128 217080 218508 221608 223206 223970
12665B23970J837J945J640J100J583K329J031J107J339K480K513P43Q1K006L731
12650B49435J889J611K448J822K022K617K955K256K354K093J143J903K880J992
12636B79420K351M086L952J940K176J539K856L490K666K430K483L318L633K156
12622C18496K496L382K842L904L138L573L948L980M364M294L366K205M105M627
12608C68720L459M346M890N155M112L977M054L311M387O079N787M529M373N467
12594D32646N870N574M864M543O949O063N811O506O507N707O248O569N878O545
12580E16280O156O570P050O711Q041P945P396P003O091P579Q501P995Q061P895
12566F19274Q285R889J0436R664Q681Q711P879Q172J0357J0236J0779R547R893
$$ plain form
12665 223970 225807 227752 229392 230492 232075 234404 235435 236542 237881 240361 242874 243617 243698 245704 249435
12650 249435 251324 252935 255383 257205 259227 261844 264799 267055 269409 271502 272645 274548 277428 279420
12636 279420 281771 285857 289809 291749 293925 295464 298320 301810 304476 306906 309389 312707 316340 318496
12622 318496 320992 324374 327216 331120 334258 337831 341779 345759 350123 354417 357783 359988 364093 368720
12608 368720 372179 376525 381415 386570 390682 394659 398713 402024 406411 412490 418277 422806 427179 432646
12594 432646 438516 444090 448954 453497 460446 466509 472320 478826 485333 491040 497288 503857 509735 516280
12580 516280 522436 529006 536056 542767 550808 558753 566149 573152 579243 586822 595323 603318 611379 619274
12566 619274 627559 637448 647884 657548 666229 674940 682819 690991 701348 711584 722363 731910 741803
12553G41803J0724J1453J1479J2001J0740J0538J1166J1461J2957J3054J3414
12542H70790J4823J3744J2691J3213J3630J3474J4350J6217J5693J5658J6486
12531A030769J7569J7637J6996J7126J7927J9004J9980K0784K0297K0927K1730
12520A240746K0649K1603K3770K3734K4311K5545K7664K7633K8127K8002K8626
12509A520410K9954L1417L3919L3930L4158L5104L5389L6155L8197M0021L8661
12498A907315M0785M3706M3981M5327M7132M8536N0416N2413N4561N6802N7458
12487B448432N9094O0014O3680O5916O7016O8995P2248P5229P7819Q0734Q4047
12476C223224Q6618Q8699R2451R5858R9101J02887J07043J11202J14127J17529
$$ plain form
12553 741803 752527 763980 775459 787460 798200 808738 819904 831365 844322 857376 870790
12542 870790 885613 899357 912048 925261 938891 952365 966715 982932 998625 1014283 1030769
12531 1030769 1048338 1065975 1082971 1100097 1118024 1137028 1157008 1177792 1198089 1219016 1240746
12520 1240746 1261395 1282998 1306768 1330502 1354813 1380358 1408022 1435655 1463782 1491784 1520410
12509 1520410 1550364 1581781 1615700 1649630 1683788 1718892 1754281 1790436 1828633 1868654 1907315
12498 1907315 1948100 1991806 2035787 2081114 2128246 2176782 2227198 2279611 2334172 2390974 2448432
12487 2448432 2507526 2567540 2631220 2697136 2764152 2833147 2905395 2980624 3058443 3139177 3223224
12476 3223224 3309842 3398541 3490992 3586850 3685951 3788838 3895881 4007083 4121210 4238739
12466D238739J23444J27033J31605J37139J41971J45923J50949J56866J62506
12457E516175J67984J71579J78617J84728J89525J96083K02530K08349K13813
12448G229383K19374K24075K28153K33344K37068K40168K44129K46663K49654
12439I352011K51361K49569K47957K47220K44440K38478K33113K25288K17064
12430A1506501K06374J94073J80622J64921J46904J29390J10642Q9834O7732M5948
12420A2842941K4900K985j9378m1802o3129q4888j05884j26441j44729j59699
12410A2124876j74435j88055k00438k10676k21136k30211k36279k39848k42962
12401A0180836k46225k46932k46040k45319k43699k41233k39173k35902k32323
$$ plain form
12466 4238739 4362183 4489216 4620821 4757960 4899931 5045854 5196803 5353669 5516175
12457 5516175 5684159 5855738 6034355 6219083 6408608 6604691 6807221 7015570 7229383
12448 7229383 7448757 7672832 7900985 8134329 8371397 8611565 8855694 9102357 9352011
12439 9352011 9603372 9852941 10100898 10348118 10592558 10831036 11064149 11289437 11506501
12430 11506501 11712875 11906948 12087570 12252491 12399395 12528785 12639427 12729261 12796993 12842941
12420 12842941 12867841 12870826 12851448 12809646 12746517 12661629 12555745 12429304 12284575 12124876
12410 12124876 11950441 11762386 11561948 11351272 11130136 10899925 10663646 10423798 10180836
12401 10180836 9934611 9687679 9441639 9196320 8952621 8711388 8472215 8236313 8003990
12392H003990k26223k21786k18026k13982k07037j99790j94803j89601j83885
12383F148857j78688j73918j67269j61068j56602j52650j46692j41407j37782
12374D732781j31889j28023j24447j19644j14824j10423j07587j03101r9252r5823
12364C597768r3319r0729q7635q4267q0761p8908p5440p3505p0013o7994o7022
12353B728175o4549o2078o0167n8715n6485n5284n2562n1549m9993m7288m6025
12342B123480m6671m4930m2158m0053l9364l9762l9238l6998l5711l3441l2812
12331A692342l3040l1129l0613l0355k8837k7921k8767k6675k5118k5258k5095
12320A379534k4673k3501k2821k2505k2109k0420k0515k0468k0190j8495j7912
$$ plain form
12392 8003990 7777767 7555981 7337955 7123973 6916936 6717146 6522343 6332742 6148857
12383 6148857 5970169 5796251 5628982 5467914 5311312 5158662 5011970 4870563 4732781
12374 4732781 4600892 4472869 4348422 4228778 4113954 4003531 3895944 3792843 3693591 3597768
12364 3597768 3504449 3413720 3326085 3241818 3161057 3082149 3006709 2933204 2863191 2795197 2728175
12353 2728175 2663626 2601548 2541381 2482666 2426181 2370897 2318335 2266786 2216793 2169505 2123480
12342 2123480 2076809 2031879 1989721 1949668 1910304 1870542 1831304 1794306 1758595 1725154 1692342
12331 1692342 1659302 1628173 1597560 1567205 1538368 1510447 1481680 1455005 1429887 1404629 1379534
12320 1379534 1354861 1331360 1308539 1286034 1263925 1243505 1222990 1202522 1182332 1163837 1145925
12309A145925j8960j8373j7793j6501j5485j6888j5979j5553j5127j6194j6015
12298I63057j3908j3506j2848j3877j3229j3141j3093j2916j2442j2486j1806
12287H19805j1550j1237j0384j1312j0346j0425j0371j0906j0080q220r429r553
12275F95992r072q876r396j0140r885q129p413p664q046o900p578p654p216o512
12261E81511o471o885o973o483o797m728n417n425o104p408n193m946n476n733
12247D97472o098o150m274n235m829m240m879n068n668m360l653m752m832m247
12233D29187n048l589m319n104n142k982l603l835m181m171l046m106m395m049
12219C71617k793l193j433k706l914l037m027l829m132m000m077l625l271l254
$$ plain form
12309 1145925 1126965 1108592 1090799 1074298 1058813 1041925 1025946 1010393 995266 979072 963057
12298 963057 949149 935643 922795 908918 895689 882548 869455 856539 844097 831611 819805
12287 819805 808255 797018 786634 775322 764976 754551 744180 733274 723194 714974 705545 695992
12275 695992 686920 678044 668648 658508 648623 640494 633081 625417 617371 610471 602893 595239 588023 581511
12261 581511 575040 568155 561182 554699 547902 543174 537757 532332 526228 518820 513627 508681 503205 497472
12247 497472 491374 485224 480950 475715 470886 466646 461767 456699 451031 446671 443018 438266 433434 429187
12233 429187 424139 420550 416231 411127 405985 403003 399400 395565 391384 387213 384167 380061 375666 371617
12219 371617 368824 365631 364198 361492 357578 354541 350514 346685 342553 338553 334476 330851 327580 324326
12205C24326k403k022k661k911l396l456j680k572k752l454k619k482j691k130
12191B88097l044l761k279k137k649k907j528p62j481k557m208l129j700n8o99
12176B55198k546l383k106n74j545k248k397k325k497m57k414j610p11j248j827
12161B27310k321k512k187q67m75k584k256j818q97q07j468p78n52m57R72K681
12145B10984N162L017O76j957m753o290n254m468m467k917j600k119j063j194
12131A83757k237k398j433j053j357p57j25j578j660m63j636j051r06l99j131
12116A65573j324j368j622r28k90p79j15K15j715j734k969q40J71q85k207o03
12100A48580n44q53r04j433j038m55l05o26j154r38k124p70j75l9R7j111j553
$$ plain form
12205 324326 321923 319901 317240 314329 310933 307477 305797 303225 300473 297019 294400 291918 290227 288097
12191 288097 285053 281292 279013 276876 274227 271320 269792 269030 267549 264992 260784 257655 255955 255897 255198
12176 255198 252652 249269 247163 246589 245044 242796 240399 238074 235577 235120 232706 231096 230385 229137 227310
12161 227310 224989 222477 220290 219423 218948 216364 214108 212290 211393 210586 209118 208340 207788 207331 208303 210984
12145 210984 216146 219163 219839 217882 213129 206839 201585 197117 192650 189733 188133 186014 184951 183757
12131 183757 181520 179122 177689 176636 175279 174522 174397 172819 171159 170696 169060 168009 167103 166704 165573
12116 165573 164249 162881 161259 160331 160041 159262 159147 159362 157647 155913 152944 152104 152275 151390 149183 148580
12100 148580 148036 147183 146279 144846 143808 143353 143048 142422 141268 140330 138206 137436 137261 137222 137319 136208 134655
12083A34655o40j927k050p93L58j35n52j304j362j190J46q61j976j245J16K52
12067A21492R8j457j044j181j479J03j045n15m11j160q50Q71k13r90j620j456
12051A09143o77r60j56k005k89m58j239p39k78J65j46q32K63k99j793o93J511
12034A00518n85p31O72K44n1r58j521j080J461N37J480K831M759Q285Q726L825
12018A28412K68j268k342m699m468k727n309n129m257l449k399j846j106q87j358
12003H7436j156j068k36m6r82p49q15r78m56l5Q81k43p83l31m04o7O17J5j348
11984G9252J120J733R60K323K229J836J765j65j301k187j226j579k880k271j838
11969G7771k313j000p89j139k009j032p25o33j190n77K15O04j00r16J50r10p05
$$ plain form
12083 134655 134015 132088 130038 129245 129603 129468 128916 127612 126250 125060 125206 124345 122369 121124 121240 121492
12067 121492 121590 120133 119089 117908 116429 116532 115487 114972 114561 113401 112551 113422 113209 112219 110599 109143
12051 109143 108466 107506 107350 105345 105056 104598 103359 102620 102342 102507 102361 101529 101792 101493 99700 99007 100518
12034 100518 99933 99202 99874 100118 100067 99109 97588 96508 97969 98506 99986 102817 107576 115861 124587 128412
12018 128412 128680 127412 125070 120371 115903 113176 107867 102738 98481 95032 92633 90787 89681 88794 87436
12003 87436 86280 85212 84976 84930 83948 83199 82384 81406 80950 80915 81796 81553 80770 80439 80035 79968 80585 80600 79252
11984 79252 80372 82105 83065 85388 87617 89453 91218 91053 89752 87565 86339 84760 81880 79609 77771
11969 77771 75458 74458 73669 72530 70521 69489 68764 68131 66941 66364 66579 67183 67083 66167 66317 65407 64702
11952F4702j329k10L49J4J725o66j114j519j150o64p1r5Q99L30l8j72o01o84k01
11933E9505P19j647j059k53N5n75o68O35L47J13j401j189J813N90l50L79M47j36
11915E7325n17q70k67l21l20n34j300q81M24P96J777P31K18O55L28J087L977M402
11897F6710M109K04k915k455k701k280j882j675j800j145P71J16J04Q88Q94r13
11881E6030r69j375k58o81p25r43j798M39j248j556N92R25O83N09M40p39k498
11864D6828j89J27O30P81O98J37Q73P19n78O78k42k578k476n41m07J044Q20J17
11846D6441J418J721K21j043j227L88J227K541J247j568j532j186j290j847o10
11831D4901R02K29L19o72k45R22M81m04j058R11K463L375M124O217Q409R367N819
$$ plain form
11952 64702 63373 63163 63512 63526 65251 64585 63471 61952 60802 60138 60067 59972 60871 61201 61163 60991 60390 59706 59505
11933 59505 60224 58577 57518 57265 57320 56745 56077 56712 57059 57172 55771 54582 56395 56985 56635 57014 57461 57325
11915 57325 56808 55938 55671 55350 55030 54496 53196 52315 52739 53535 55312 56043 56261 56916 57244 58331 62308 66710
11897 66710 70819 71023 68108 65653 62952 60672 58790 57115 55315 54170 54941 55057 55161 56049 56943 56030
11881 56030 55061 53686 53428 52747 52022 51079 49281 49720 48472 46916 47508 48433 49116 49625 50065 49326 46828
11864 46828 46639 46766 47396 48177 48875 49012 49885 50604 50026 50704 50462 47884 45408 44867 44460 45504 46324 46441
11846 46441 47859 49580 49801 48758 47531 47919 49146 51687 52934 51366 49834 48648 47358 45511 44901
11831 44901 45803 46032 46351 45679 45434 46356 46837 46433 45375 46286 48749 52124 56248 62465 70874 80241 86060
11814H6060K824j444l615l546k833l440l659k230j698l563j182M21K624L893L345
11799G1957M225J279o55J16O26j028k29k054l207l681l824m085l226j753j518
11784E2943k379k418j698k47j399K66K24k82r33j79j528J05n7L92J122o61p73
11767D2498o86q89n95n16p4m48j78J785J060P34J22j72P23K43r05j22j599j38
11749D0843J496J426J502N643J1335J8173K3591J5506k461j0963j5822j6036j3802
11736F0431q303n627l874k381k760k059r95j048j636l86m57r68n37k14p6K1o52
11719B8479k63j073l76r71O12j211j024%n80J005R63p97J91K59n05o76l62J549
11701B5220J627n09r30j340j200m23j501j53P73N58K54M12n10m29N85l2j61n07
$$ plain form
11814 86060 88884 87440 83825 80279 77446 74006 70347 68117 66419 62856 61674 62095 64719 68612 71957
11799 71957 76182 77461 76806 76922 77548 76520 76291 74237 71030 67349 63525 59440 56214 54461 52943
11784 52943 50564 48146 46448 46201 44802 45068 45292 45010 44077 43898 42370 42475 42418 42810 43932 43271 42498
11767 42498 41812 40923 40328 39812 39738 39290 39112 40897 41957 42691 42813 42641 43364 43607 42702 42580 40981 40843
11749 40843 42339 43765 45267 50910 62245 80418 104009 119515 117054 106091 90269 74233 60431
11736 60431 52128 46501 42627 40246 37486 35427 34432 33384 31748 31362 30905 29937 29400 29186 29110 29131 28479
11719 28479 28216 27143 26767 25796 26408 25197 24173 24173 23593 24598 25561 24764 24955 25214 24709 24033 23671 25220
11701 25220 26847 26338 25408 24068 22868 22445 20944 20791 21564 22122 22376 22788 22278 21849 22434 22402 22241 21734
11683B1734j479K78J245P84oj464J61L59k53q02j857O74J433k35J87j181K6M02
11665B0006n86j365O93J133n61O30L93n25j274P45j131J002J184k47m51l10J97
11648A9533j11j311o63M20R4r07q98J013J290o3k1P17o79m70K06o04N41Q98J086
11629B0071P34N2j94j285j52J272k58k512n17M12J147O4O36k10q67j01Q92r0j321
11610A7773o87o42J42M35r78n64j54j016O6J285L44J210K72p42j049K35K24K00
11592A6354J91j142m30m54o92o34J520O33j49N43L74m06j144k14L54P00N46m76
11574A5474j019m89K68N74l50q36r6L35L99j871K16P18K11J07P55J19J86l19r11
11555A3471J21N99O38K93n47l01K19O79p0n18P7n60P3n06m49O0N79M74j542j055
$$ plain form
11683 21734 20255 20533 21778 22562 22556 21092 21253 21612 21359 20557 18700 19374 20807 20572 20759 19578 19604 20006
11665 20006 19420 18055 18748 19881 19320 19950 20343 19818 18544 19289 18158 19160 20344 20097 19646 19336 19533
11648 19533 19422 18111 17448 17868 17962 17055 16157 17170 18460 18397 18376 19093 18414 17944 18150 17546 18087 18985 20071
11629 20071 20805 20857 20663 19378 19226 20498 20240 17728 17211 17623 18770 18834 19470 19260 18393 18292 19184 19094 17773
11610 17773 17086 16444 16586 17021 16043 15479 15325 14309 14375 15660 16004 17214 17486 16744 15695 15930 16154 16354
11592 16354 16545 15403 14973 14519 13827 13193 14713 15346 15197 15740 16114 15708 14564 14350 14704 15404 15950 15474
11574 15474 14455 13966 14234 14808 14458 13622 13526 13861 14260 12389 12605 13323 13534 13641 14396 14515 14701 14382 13471
11555 13471 13592 14191 14829 15122 14575 14274 14493 15172 15102 14584 14661 14101 14174 13668 13219 13279 13858 14332 12790 11735
11535A1735k50P06r93l93J230M37j095L84J936R56J150N88n96j872j416p81o47
11518A1079N52P1PL16j62j4K49r8J74K08q1R38L49J67R5K3p88j236n47r4P80p4
11496A1914r07k82j09N20N77n33L30R2N52n3n42Q25k93n50j226m78J098O84o92
11477A0927K34m91k15p96l93Oj116M31J805J104O27n26j331n45P15J4M15Q9j631
11458I323J585R32j442j371j432M18N96P23O57J338R88P04r4j401j99o84k31m06
11440A0004M45O22j804q11M60J700J405n24j047m29l91j77r24J0J801q66n18N66
11422I522J736p41L46m6N26J240K218R94q65q74j234j256M56n99j464J88r27m43
11404H777m3j0l01m79J227J689q0q64q66k46P06P36r1r53M46K67j523o58P03O75
$$ plain form
11535 11735 11485 12191 11198 10805 12035 12472 11377 11761 13697 14653 15803 16391 15795 13923 12507 11726 11079
11518 11079 11631 11702 11709 12025 11863 11849 12098 12000 12174 12382 12301 13239 13588 13755 13850 13873 13085 11849 11302 11208 11988 11914
11496 11914 11007 10725 10616 11136 11713 11180 11510 11602 12154 12101 11559 12384 12091 11541 10315 9837 10935 11619 10927
11477 10927 11161 10670 10455 9659 9266 9272 8156 8587 10392 11496 12123 11597 10266 9721 10436 10450 10865 10954 9323
11458 9323 10908 11840 10398 9027 7595 8013 8609 9332 9989 11327 12315 13019 12925 11524 11325 10641 10410 10004
11440 10004 10449 11071 9267 8456 8916 10616 12021 11497 10450 10021 9630 9453 8529 8539 10340 9474 8956 9522
11422 9522 11258 10517 10863 10817 11343 12583 14801 15795 14930 14056 12822 11566 12022 11423 9959 10147 9220 8777
11404 8777 8734 8724 8423 7944 9171 10860 10780 9916 9050 8804 9510 10246 10155 9202 9648 9915 8392 7734 8437 9112
11384I112p19r33M77J267J511n49l28j394r35j239K8J141J668m08L38m09m27l93
11366G808j200J95P48j96k26r81q13M33L21j111m75L19M40j48o9K68k82Q92L81
11347F304K69j096M69Q51J230p4j934o71l69O02r42j065J39M27R82J360N01k79
11329F704q60K8J20j02m61l71o7J117J05L98L86r91j843o83L99L34J190L17K05
11310E925j38j618q75m82P82J212P91r8j90J1l34m1J27k91J131L90k86P03J469
11291H188j46j436j953j96J610N25j507l88P74J449J311P49N19m19l06Q19j49
11274I444n20r79N24K55n34j069j133k13Q48p6m23M89n66n56K63J50l48j485J5
11255D086K20M22l12k60K050L80lk35p19j85Q71J235Q82J683K643J481P39J009
$$ plain form
11384 9112 8393 7460 7937 9204 10715 10166 9838 8444 7509 6270 6298 7439 9107 8699 9037 8628 8201 7808
11366 7808 6608 6803 7551 7355 7129 6148 5335 5768 6089 4978 4503 4822 5262 5114 5045 5313 5031 5923 6304
11347 6304 6573 5477 5946 6797 8027 7953 6019 5348 4979 5581 4639 3574 3713 4140 5122 6482 6983 6704
11329 6704 5844 5872 5992 5890 5429 5058 4991 6108 6213 6611 6997 6006 4163 3480 3879 4213 5403 5720 5925
11310 5925 5787 4169 3294 2812 3594 4806 5597 5499 5309 5320 4986 4945 5072 4781 5912 6302 6016 6719 8188
11291 8188 8042 6606 4653 4457 6067 6592 5085 4697 5471 6920 8231 8980 9499 9080 8774 9593 9444
11274 9444 8924 7945 8469 8724 8190 7121 5988 5775 6623 6547 6124 6613 6047 5491 5754 5904 5556 4071 4086
11255 4086 4306 4728 4416 4156 6206 6586 6583 6348 5629 5444 6315 7550 8432 10115 12758 14239 14978 15987
11237A5987p54j206r82j352L32p97O95P53O60J144N33K41P26Q78J813M36O61K324
11219B2092K606M125M426L172O177Q454R256J2805J9732L1663N0322P7069J01301
11206C53200R8852N8794j448n3571q0689q4519p2008n3135l7231k5836j9660j3955
11194F8794r946q444p533n485n844m966m003k403j294j419j580j650j670r25r02
11179A0730p79n7J339o54r59n09n55j046L51p13m24M02O39m06l39j211J8K20o99
11160E348K74J354J192J603O74J156k08J347J85p44M0r63r1l52q83q84j546j215
11142F287p20k34n34j201q47o6k90J051J198m40nK94J89Q00N61j627j583j068
11124A765J080L80N23r51r63J4P67J803L61J72k12J154M0k88K67J143k84k79j85
$$ plain form
11237 15987 15233 14027 13045 11693 12025 11228 11923 12676 13336 14480 15013 15254 15980 16858 18671 19107 19768 22092
11219 22092 24698 28823 33249 36421 42598 51052 60308 73113 92845 124508 174830 251899 353200
11206 353200 452052 510846 509398 455827 375138 290619 218611 165476 128245 102409 82749 68794
11194 68794 58848 50404 42871 37386 31542 26576 22573 20170 18876 17457 15877 14227 12557 11632 10730
11179 10730 9951 9894 11233 10579 9620 9111 8556 7510 7861 7148 6724 7126 7765 7359 7020 5809 5827 6047 5348
11160 5348 5622 6976 8168 9771 10445 11601 11393 12740 12925 12181 12221 11258 11167 10815 9932 9048 7502 6287
11142 6287 5567 5333 4799 3598 2751 2685 2395 3446 4644 4204 4199 4493 4682 5482 6043 4416 2833 1765
11124 1765 2845 3225 3748 2797 1834 1848 2615 4418 4779 4951 4739 5893 5933 5645 5912 7055 6771 6492 6307
11105F307P84r14o63J214M5j451p46j033j743o11R24K101k80m79O97J506N71r26
11087E303q74j751k017PQ91n04J161J50o4Q1q88K59p66j329Q55O74J11K1K32P45
11067B297J31Q8q12r50l64K92L8N72Q23j5k24n00O74J57p53m07o25L84N86Q94
11047B286J126M04o08m06K49o80q05n10L31j49N75o00l21o68L67L28l11M80N57
11028A645Q3q75j39k4j010M30K26o5J887P98j63n12k55J366n4j712j229j36J19
11009C80J023O7k46K68K74q04n30R37O4p40M09M60j51j283l63M90J78m2Q63p78
10989D76r38O07J129Q47l04O87L06o69k85m85r26K71O55J030o91q89j400j26J242
10970E37O40l25Q84n11r3J654M58r83o05k25l74O10Q36p94m38o64n17N57J128
$$ plain form
11105 6307 7091 6177 5514 6728 6773 5322 4576 3543 1800 1189 2113 4214 3934 3455 4152 5658 6229 5303
11087 5303 4429 2678 661 668 1559 1055 2216 2366 2302 2383 1495 1754 988 -341 514 1188 1299 1320 1552 2297
11067 2297 2428 2516 1704 754 390 682 720 1292 2115 2100 1876 1376 2050 2207 1454 1047 422 806 1392 2286
11047 2286 3412 3816 3208 2802 3051 2371 1566 1056 1387 1238 1813 1213 892 224 591 919 608 1088 1645
11028 1645 1728 853 714 690 -320 110 336 271 2158 2956 2793 2281 2026 3392 3338 1626 397 261 380
11009 380 1403 1470 1224 1492 1766 962 432 1369 1433 693 1102 1562 1411 128 -235 255 433 391 1254 476
10989 476 -462 145 1274 2121 1817 2504 2810 2141 1856 1371 445 716 1371 2401 1710 821 -579 -705 537
10970 537 1177 852 1736 1225 1132 2786 3244 2261 1656 1431 1057 1667 2503 1709 1271 607 90 647 1775
10951A775P63p1l73j109n05Q09J51p54L29L64j043K20J29M30j5k79M6M61J200
10932B528J325N7k56l59M61j302r63Q43j23r80q29P9N40L26K06j623o25n47O12
10913f30J351J014J96o4o22p68m68O46J03M51O99N18j08O42J33j210l89L8K89
10894A821m39M77j159o80j4m20K07N16j420l05J705J222M51j36o65L48M78m79
10876A508j44n59M3J17j43r53N26P69L20l50P85j33n29N13R51J45m6j383o61j41
10856F35J91m66o11L05J182M87Q86j266M87j056l57N45k69P63O97l73o79L24l90
10837A035R02J507p99K82M89j20j298j296m22J177j344j112J06l61j13J545J98
10820C76J12m62l98R09n7N63qn00R4l32n73j31Q74O20q97l7l44k15Q4O75j56P77
$$ plain form
10951 1775 2538 2467 2094 985 480 1289 1440 686 1015 1379 336 556 685 1115 1100 821 867 1328 2528
10932 2528 3853 3910 3654 3295 3756 2454 1491 2334 2211 1231 402 481 1021 1347 1553 -70 -695 -1242 -630
10913 -630 721 1735 1931 1867 1245 477 9 655 758 1209 1908 2426 2318 2960 3093 1883 1494 1532 1821
10894 1821 1382 1859 700 20 6 -414 -207 309 -1111 -1416 289 1511 1962 1826 1161 1509 1987 1508
10876 1508 1364 805 848 965 822 -131 395 1164 1484 1134 1919 1786 1257 1770 2721 2866 2820 1437 776 635
10856 635 826 360 -251 54 1236 1723 2609 1343 1830 774 417 962 693 1456 2153 1780 1101 1425 1035
10837 1035 1937 3444 2645 2927 3416 3296 1998 702 280 1457 113 -999 -893 -1254 -1367 178 376
10820 376 488 26 -372 537 480 1043 1035 535 629 297 -276 -407 467 1087 190 153 -191 -406 -322 353 197 974
10798I74P83K15J045L49M65p72m7N60j139k020j332J05N80l3O84P05J441J147
10780C710K6o71j61P51P25J05K3n67k28m96m49j99o33m43j049L06O73q17j175
10761e69q72M71m5J66j76L79R76k44j80p36O93J063K36p21n94J264J781M41r02
10742B431o83q3Q0j192j38M32N63m58J177R23L01j369k23j442P68J683N55m16
10724B909l88K83k45j377R9L82Q10j17j410j101L66N29N2j25M63M88M92N00Q54
10705C464q61j029M03M63M18Q96P62p98r88k41O81k80J63N38L4j179j968l53J179
10686A304N49K0O4j70P76J34j053j042j43M34J59R7j57L14m38M63k93p53p74k4
10666e33N47N75J92Q56J020j628o56J37J542j40l29M80m29M93j72N75k83r05j86
$$ plain form
10798 974 1757 1972 3017 3366 3831 3059 3012 3572 2433 413 -919 -814 -234 -267 417 1122 2563 3710
10780 3710 3736 3065 2904 3655 4380 4485 4508 3941 3713 3217 2768 2569 1936 1493 444 750 1423 606 -569
10761 -569 -1441 -970 -1015 -849 -1025 -646 330 86 -94 -830 -137 926 1162 441 -153 1111 2892 3333 2431
10742 2431 1748 1665 1745 553 415 847 1410 952 2129 3052 3353 1984 1761 319 1087 2770 3325 2909
10724 2909 2521 2804 2559 1182 1281 1663 2473 2356 946 -155 211 740 792 667 1130 1618 2110 2610 3464
10705 3464 2603 1574 1977 2440 2858 3754 4516 3718 2730 2489 3170 2890 3053 3591 3625 2446 478 125 1304
10686 1304 1853 1873 1937 1767 2543 2677 1624 582 439 873 1032 1129 972 1286 848 1311 1018 265 -509 -533
10666 -533 14 589 781 1637 2657 1029 373 510 2052 1912 1583 2063 1634 2127 1955 2530 2247 1342 1156
10647A156L34r94Q81K61O61n49j95P27o21M14J047J149P03J61j86o0J59K31o03
10628D676k385q14J141M5J59p60J39K69P0M54L96J47J77l75j498M23o2Q76J957
10609E035R02n93j719j1J224N41j577j092o1O46K165K17n76j26J884M74j138K7
10591F222k10j950r29j14M10j68M27Q29J190L30j91n15j055j063J616M68O14L39
10573F250O90O38M04j79o30p24N3m64M17l24j98q75J303P27r91j354n31R17J091
10554F220P90J301J223N47P36l29M65K131J729k18j008j281k000o98Q03r30n10
10537H971p06K05l04M5j527Ql70j89n8k88L55q40K16r8K79l46J06O99n02j513
10517D143j02k34K9j23J214J01j355R93J239N51k87J333K252J056Q33J166J341
$$ plain form
10647 1156 1490 496 1377 1638 2299 1750 1555 2282 1661 2075 3122 4271 4974 5135 4949 4889 5048 5279 4676
10628 4676 2291 1477 2618 2663 2822 2062 2201 2470 2540 2994 3390 3537 3714 3339 1841 2264 2202 3078 5035
10609 5035 5937 5344 3625 3614 4838 5379 3802 2710 2649 3295 5460 5677 5101 4975 6859 7333 6195 6222
10591 6222 6012 4062 3133 3019 3429 3261 3688 4517 5707 6037 5846 5331 4276 3213 4829 5297 5911 6250
10573 6250 6940 7578 7982 7803 7173 6449 6502 6038 6455 6131 5933 5058 6361 7088 6097 4743 4212 5129 6220
10554 6220 7010 8311 9534 10081 10817 10488 10953 13084 14813 14595 13587 12306 10306 9608 10411 9481 8971
10537 8971 8265 8470 8166 8211 6684 6692 6322 6133 6075 5787 6142 5302 5518 5420 5699 5353 5459 6158 5656 4143
10517 4143 4041 3807 3836 3713 4927 5028 3673 4666 5905 6456 6169 7502 9754 10810 11643 12809 14150
10500A4150R15n45j227q71k041k237o7j091j721j933k27N61m91K6pr74J116L24
10482C660P12J003r55m06q14m27L88l19j282J80M30K83Q19O69j111j661P77J225
10464C171Q93n02M65p70L81J02q75o41M82K30J589K06o97j36K57O38j46j365r26
10445B356q05j74R90J703N15J83j045k29k76l37N30m33j06p35M23N24J371J102
10427E557J38m01J88q17K90M60n41Q50M72m95J81m05n58n46n54k144k96J583M55
10408C417P49J152K03J13k24N87P35J02J168j46KP21j4P92R67r6P68k24q45p96
10388I131p51j14l72j191P13j99q40q73k44l95p60j45J178j3j98O93j41l83M18
10369E514k81p43Q51K9j52j57P6k98J3k77M55J79j072j416N95K86p48p07k066
$$ plain form
10500 14150 15065 14520 13293 12422 10381 8144 8077 6986 5265 3332 3105 3666 3175 3201 3194 2220 3336 3660
10482 3660 4372 5375 4420 4014 3200 2773 3161 2842 1560 1740 2170 2453 3272 3941 2830 1169 1946 3171
10464 3171 4064 3562 4027 3257 3638 3740 2865 2224 2706 2936 4525 4731 4034 3898 4155 4793 4647 3282 2356
10445 2356 1551 1377 2367 4070 4585 4768 3723 3494 3218 2881 3411 2978 2872 2137 2560 3084 4455 5557
10427 5557 5695 5294 5482 4665 4955 5415 4874 5724 6196 5701 5882 5477 4919 4373 3819 1675 1379 2962 3417
10408 3417 4166 5318 5521 5634 5410 5997 6732 6834 8002 7856 7858 8579 8565 9357 10324 10228 10996 10772 9927 9131
10388 9131 8380 8266 7894 6703 7416 7217 6377 5504 5260 4865 4105 3960 5138 5125 4927 5620 5479 5096 5514
10369 5514 5233 4490 5341 5370 5218 5061 5137 4839 4852 4575 5030 5209 4137 2721 3316 3602 2854 2147 81
10350H1l83K57N10L14J086M29n70k21j05Q67n82J399J232o8J34P36j72k39n53
10331D152l70O55N57O04n53r54R52R70n47m0R5P10p55o79j60J62m07K87O16J276
10311F571M12r9r68n26J360K53o93l33K20P01n75j464j318k75J156N47J43m18
10293D694n61M25M02j34M29P62m90p56l27N44R10J321L03o99l47j58p9l50j93
10274E696M66K54N05O82R32K45r03n32q3K26j015j056j57K00j80M05J224N58m04
10255G063J35n94o5K48J10q88R09P70j105j151j672k74L12Q89J326l52j1N75k96
10236E929J34K84j019J222L56M73M9m34J98j77K56M51k07R72Q96J604j31l74K88
10217A0770J813K19j469R72M71J167J895J868L720K499P94k551m019k861j158
$$ plain form
10350 81 -302 -45 465 779 1865 2294 1724 1503 1398 2265 1683 3082 4314 4246 4380 5116 4944 4705 4152
10331 4152 3782 4437 4994 5598 5045 4091 5043 6013 5466 5426 5521 6231 5476 4797 4637 4799 4392 4679 5295 6571
10311 6571 6983 6884 5916 5390 6750 7003 6310 5977 6197 6898 6323 4859 3541 3266 4422 4969 5112 4694
10293 4694 4133 4558 4960 4826 5255 6017 5527 4771 4444 4988 5898 7219 7522 6823 6476 6318 6239 5889 5696
10274 5696 6162 6416 6921 7603 8535 8780 7877 7345 7262 7488 6473 5417 5260 5460 5280 5685 6909 7467 7063
10255 7063 7198 6604 6539 6787 6897 6009 6918 7688 6583 5432 3760 3486 3798 4687 6013 5661 5650 6225 5929
10236 5929 6063 6347 5328 6550 6906 7379 7428 6994 7192 7015 7271 7722 7515 8487 9383 10987 10856 10482 10770
10217 10770 12583 12802 11333 12305 12776 13943 15838 17706 21426 23925 24719 22168 18149 15288 14130
10202A4130k224q78m21j088l01m35m57J317M58q60j47j81q74J19J665K87j562
10185H548q77M78P90j67J17M14J643J884l50P45J485Q39J34m17j198q15J34P9
10167A3466k87n5k98o24n09j919j773M20M11p57M94J645J863R99l41k90j873q9
10149A0483k87L5k31kO81M33l19N91K510J608K090J783j59r93j657k179k707q64
10131A0816n10M42n71L4L07l29J38l05O0J510J178J545K009K184M095L712L137
10114B9452K685J100J269O82l35j673q08j809j471J470L447J964J51l90l59N89
10098C5964k478k675j146r10j382q45k264l271k730j528p94K61j06q30p07J038
10082A5597m03j039p54p50r21j267q91k2p58L97N20O69Q45N16O01m06m56O75N23
$$ plain form
10202 14130 11906 11028 10607 9519 9218 8783 8326 9643 10101 9241 9094 8913 8039 8158 9823 10110 8548
10185 8548 7671 8149 8939 8772 8889 9303 10946 12830 12480 13225 14710 15549 15683 15266 14068 13253 13387 13466
10167 13466 13179 13124 12826 12202 11693 9774 8001 8421 8832 8075 8569 10214 12077 13076 12735 12445 10572 10483
10149 10483 10196 10231 10000 9998 10679 11112 10793 11384 13894 15502 17592 19375 19216 18223 16566 14387 11680 10816
10131 10816 10306 10748 10177 10211 10518 10189 10327 10022 10082 11592 12770 14315 16324 18508 22603 26315 29452
10114 29452 32137 33237 34506 35188 34853 33180 32372 30563 29092 30562 34009 35973 36124 35734 35375 35964
10098 35964 33486 30811 29665 28755 27373 26528 24264 20993 18263 16735 15941 16202 16096 15266 14559 15597
10082 15597 15194 14155 13401 12651 11730 10463 9572 9550 8792 9189 9709 10378 11223 11739 12340 11934 11478 12153 12676
10063A2676J97p84o59j102o04m25r99K44o56n89O69j54r12m10K55L00J829J041
10045I917q54J638O02J97j92j032r50o92q63Kn19K44M82k21J682J625L66n26j134
10026I772J28K85l1O87P77o17k90M78k36o14j63J179P0k74J32J16j81k07l37p96
10006I878Q44J372j33Q8P64K61j028j097O66N90R15M82l06p23l56K09Pn03R97
9987A2927m63J88J771n3j482j052o67L33M53l22j418l4J662J024o46m75K74L56
9969A2376k36L7n7O32J155J97Q00P45J66l3p98n9q3m64n9q55n18P42q2J449J334
9948A6389j36p89l24k54l87O29P3k05Q69q9k77j732q08J215l30M46J526J34o61
9929A5289J099p7K15m34LK08j7J66k44j361q70j19J350Kn33J32j62K55R20k27
$$ plain form
10063 12676 12873 12089 11430 10328 9724 9299 8300 8544 7888 7299 7968 7814 6902 6492 6747 7047 8876 9917
10045 9917 9063 10701 11303 11500 11308 10276 9326 8634 7771 7773 7254 7498 7980 7759 9441 11066 11432 10906 9772
10026 9772 9900 10185 10154 10841 11618 11001 10711 11189 10953 10339 10176 11355 11425 11151 11283 11399 11218 11011 10674 9878
10006 9878 10722 12094 11961 12049 12813 13074 12046 10949 11615 12205 13120 13602 13296 12573 12217 12426 12433 11930 12927
9987 12927 12464 12652 14423 14370 12888 11836 11169 11502 11955 11633 10215 10181 11843 12867 12221 11746 12020 12376
9969 12376 12140 12177 12120 12752 13907 14104 14904 15649 15815 15782 14984 14925 14842 14378 14319 13464 12946 13688 13606 15055 16389
9948 16389 16253 15464 15140 14886 14499 15128 15201 14996 15865 15776 15499 13767 12959 14174 13844 14290 15816 15950 15289
9929 15289 16388 16311 16526 16092 16095 16303 16286 16452 16208 14847 13977 13858 15208 15210 14677 14809 14647 14902 15822 15595
9909A5595j70J413R55q48r12p7j327q30N8r07k32m30j73oJ534P40m02p4J060P19
9889A5686j097J174O59K62o14O51P19j71q33RO06Q55J19r27n41P64j48K20J66
9870A7559j550j230N85J879J33R69J457O47P0K56l2l93Q6O26M89j120L91J44q40
9851B0126M69n41pn78J79J00K08k67p78k2M91J427O20L09l49o68J0o27L44m83
9831A9963l21m36m13j149j409M22R15N85j81n81J30O67N58J33j46l5J059j45K48
9812A9864K78O63j68q73n95J592N36o08j251J521K75R77L2P29n52j091o89O38
9794B1278o92j077N89o30p82p72R8R92j98J059J612J022O59M90Q89R83M70J162
9776B7152l14j127P0J071M88j53L50J662J214P11O29j089O30J774P70q7o17j588
$$ plain form
9909 15595 15425 16838 17793 16945 16033 15956 14629 13799 13857 12950 12718 12288 12115 12109 13643 14383 13981 13907 14967 15686
9889 15686 14589 15763 16422 16684 16070 16721 17440 17269 16436 16445 17051 17906 18025 17098 16557 17321 17173 17393 17559
9870 17559 16009 14779 15364 17243 17376 18345 19802 20449 20519 20775 20743 20350 20436 21062 21551 20431 20822 20966 20126
9851 20126 20595 20054 20047 19469 19648 19748 19956 19689 18911 18889 19380 20807 21427 21736 21387 20719 20729 20102 20446 19963
9831 19963 19642 19206 18793 17644 16235 16657 17572 18157 17976 17395 17525 18192 18750 18883 18737 18702 19761 19616 19864
9812 19864 20142 20805 20637 19764 19169 20761 21297 20689 19438 20959 21234 22211 22243 22972 22420 21329 20640 21278
9794 21278 20586 19509 20098 19468 18686 17914 18012 19004 18806 19865 21477 22499 23158 23648 24537 25520 25990 27152
9776 27152 26838 25711 25781 26852 27340 27187 27537 29199 30413 31124 31753 30664 31294 33068 33838 33751 33134 31546
9758C1546K93M24j058l48r13j622q86j941q59M08R27r85j177o4P3o16P97l66q2
9739B3551j52J70L21J838J542l65N81J186k84n54p01n44n34j44k68J58L21J261
9721B7383J603J047J33J131Q72M07R75Q20Q87L88k191k004p15L78r82j727j142
9704B7263M0P80l3M58K72J41J072K017K012l62J110K086K100M5j891n50j263j03
9686C5194N83K29O32J797L566L769K543K339N01p45J518K212J342J268o75k191
9670E3882j947j880j089n67k389k350j871n58q90j708p91j56O62j911j094p12
9654C4631j533j459j131k38l91p52o00m73N29l6N57J715J801O47M07r03q99l14
9636C1558l09m41L27Q13J09n60r26j544K91l1K06O15M56R51j495j122o88k002
$$ plain form
9758 31546 31839 32263 31205 30857 29944 28322 27436 25495 24636 25044 25971 24986 23809 23745 23818 23202 23999 23633 23551
9739 23551 23399 23569 23890 25728 27270 26905 27486 28672 28388 27834 27133 26589 26055 25911 25643 25801 26122 27383
9721 27383 28986 30033 30166 31297 32169 32576 33551 34371 35258 35646 33455 31451 30736 31114 30132 28405 27263
9704 27263 27303 28083 28050 28508 28780 28921 29993 32010 34022 33660 34770 36856 38956 39001 37110 36560 35297 35194
9686 35194 35777 36006 36638 38435 42001 45770 48313 50652 51153 50408 51926 54138 55480 56748 56073 53882
9670 53882 51935 50055 48966 48399 46010 43660 41789 41231 40341 38633 37842 37686 38348 36437 35343 34631
9654 34631 33098 31639 30508 30270 29879 29127 28527 28054 28583 28547 29104 30819 32620 33267 33674 32771 31872 31558
9636 31558 31249 30808 31135 31948 32057 31497 30571 29027 29318 29287 29493 30108 30564 31515 30020 28898 28210 26208
9618B6208j567M59N63n7R37j43P9K852L629M447L776K102J125P58j314j843k660
9601C9351j579k28K02j45O59P17j098N11M70j300j240k80r38j451r0P8R00J668
9583C6207m18P1J439J388J164J009K229L506L877j189l107l343l332k152k082
9568C5267q32L16o67o42K99J0m2M85Q74J406Q53L70q67p21N88p9l5j670k276M08
9548C3045J45j71J8O82j228j55j21k36m3k84k80L12O82j523q57p11n64K01O24
9529B9536R76L05q4n94q56N59J759J58J63Q41Q63J34J229J663Q56L00J572p0l98
9510C8912l30J350P99r76N39P73J83r07j245m28q62q55q93j617l024j721j212
9493B8486q95j432P94R01J643m13J71l2p40Q12J566L81m21R3J256O29j404j310
$$ plain form
9618 26208 24641 25100 25663 25606 26543 26400 26479 29331 32960 37407 41183 43285 44410 45168 43854 42011 39351
9601 39351 37772 37544 37746 37601 38260 38977 37879 38390 38860 37560 36320 36040 35102 33651 33561 33639 34539 36207
9583 36207 35789 35860 37299 38687 39851 40860 43089 46595 50472 49283 46176 42833 39501 37349 35267
9568 35267 34435 34751 34084 33442 33741 33751 33709 34194 35068 36474 37327 37697 36830 36109 36697 36618 36583 34913 32637 33045
9548 33045 33190 33019 33037 33719 32491 32336 32215 31979 31936 31652 31372 31684 32366 30843 29986 29275 28711 28912 29536
9529 29536 30512 30817 30733 30139 29283 29842 31601 31759 31922 32763 33626 33760 34989 36652 37508 37808 39380 39310 38912
9510 38912 38582 39932 40731 39755 40294 41067 41250 40343 39098 38670 37808 36953 36060 34443 31419 29698 28486
9493 28486 27591 26159 26953 27854 29497 29084 29255 29223 28483 29295 30861 31242 30821 30914 32170 32799 31395 30085
9475C0085M6j278P26J911J503J042J934J039m5j068j311Q43P38j078j957m96J07
9458C2741p64O16K20N62l99j264q21J13K26L35l36j089q31J62r64O53J657R48
9440C1765J521J958Q5J321J275l27k55l23j348j032M19J543J230o30r44J211J744
9423C9213J964K281J597R31J470o68j454k49J716O94R05O19Q71q64l448k605k247
9406D0726j913j266k48p08j077l76k03p05O05N7n91q38l95N26J60j388j025o41
9388C0700j22q1J288J800J837K769J346K186J318J084J713J218q4o55o30k361
9372D3326k886j122j820k101j731K38m88j280r76M43Ql75k94R19p22n2K091O60
9354C3838O2L42J466P10M31K196K647K740J675P61P4j651N91R65m61j946p43k351
$$ plain form
9475 30085 30131 28853 29579 31490 32993 34035 35969 37008 36963 35895 34584 35427 36165 35087 33130 32634 32741
9458 32741 31977 32593 32813 33375 32976 31712 30891 31004 31230 31565 31229 30140 29309 29471 28507 29160 30817 31765
9440 31765 33286 35244 35329 36650 37925 37598 37343 37020 35672 34640 35059 36602 37832 37202 36258 37469 39213
9423 39213 41177 43458 45055 45986 47456 46788 45334 45085 46801 47495 48400 49019 49890 49026 45578 42973 40726
9406 40726 38813 37547 37299 36591 35514 35138 34935 34230 34835 34892 34301 33463 33068 33594 33754 32366 31341 30700
9388 30700 30578 30497 31785 33585 35422 38191 39537 41723 43041 44125 45838 47056 46972 46317 45687 43326
9372 43326 40440 39318 37498 35397 33666 33904 33416 32136 31160 31603 31611 31236 30942 31861 31139 31087 33178 33838
9354 33838 33900 34242 35708 36418 36849 39045 41692 44432 46107 46868 46942 45291 45882 46847 46386 44440 43697 41346
9336D1346k516j209j174n07K77o66p40M56J20J950K795L160L171K529K052L67
9320E1411J137O42j583k550j623k130k072k59K704M146M878J704j26k16p30%j607
9303E3726k677k656l152k324r3J387q45J87L76k988k625k327k44J694K250K032
9287D1721J520K98l27R65K35j486j102L11L171L374L309L702M656K981K109m59
9271F4978l81N47j723n404n508m698o025l853j288Q30K073q50j683l36q02j407
9255C4470j528j146j122K51L00L83P57n80k488j731j092k913j105K269K860L078
9239C0663M008J927O55J351K603J010K023K879L649L826M273M991M225L916L182
9224G5181L102L604M089L673N135O096O709N865Q927J0014J0424J2171J5159J7224
$$ plain form
9336 41346 38830 37621 36447 35940 36217 35551 34811 35267 35387 37337 40132 43292 46463 48992 51044 51411
9320 51411 52548 53190 51607 49057 47434 45304 43232 42973 45677 49823 54701 56405 56279 56063 55333 55333 53726
9303 53726 51049 48393 45241 42917 42824 44211 43366 43553 43929 40941 38316 35989 35745 37439 39689 41721
9287 41721 43241 43539 43212 44177 44412 42926 41824 42135 45306 48680 51989 55691 60347 63328 65437 64978
9271 64978 64597 65144 63421 58017 52509 47811 41786 37933 36645 37475 39548 38698 37015 36679 35877 34470
9255 34470 32942 31796 30674 30925 31225 31608 32365 31785 29297 27566 26474 23561 22456 24725 27585 30663
9239 30663 34671 36598 37253 38604 41207 42217 44240 47119 50768 54594 58867 63858 68083 71999 75181
9224 75181 78283 81887 85976 89649 94784 100880 107589 113454 122381 132395 142819 154990 170149 187373
9210A87373J7939J9901K2529L3402M5557O4532R2426J31078J75743K22962K66957
9199A280399K95371K88524K48351J77625P2044l2867j31701k16382k65653k82568
9189A433143k69239k34437j91285j47464j09232p8127n8413m3172l3528k7877
9179B40369k2303j9038j7023j5588j1873q605n730o283n646k076k373l434j404
9166A18993k380l218l388k648k457n080n488m696m763m936m135k168l003l699
9152F6934l917l539m068l040j999n9J853J413L254M157K752n80n382j1839j6623
9137B9317j6489j2574p996l954j695Q55J370J511L400K846K012K654L268J725
9123F250J374J966J75n15Q06O84p93l979l914k681j596N68J928K776J475J345
$$ plain form
9210 187373 205312 225213 247742 281144 326701 391233 483659 614737 790480 1013442 1280399
9199 1280399 1575770 1864294 2112645 2290270 2362314 2329447 2197746 1981364 1715711 1433143
9189 1433143 1163904 929467 738182 590718 481486 403359 344946 301774 268246 240369
9179 240369 218066 199028 182005 166417 154544 145939 140209 133926 128280 126204 123831 120397 118993
9166 118993 116613 113395 110007 107359 104902 99822 94334 89638 84875 79939 75804 73636 70633 66934
9152 66934 63017 59478 55410 52370 50371 50312 52165 53578 56832 60989 63741 63161 57779 45940 29317
9137 29317 12828 254 -7742 -11696 -13391 -12536 -11166 -9655 -6255 -3409 -1397 1257 4525 6250
9123 6250 7624 9590 9765 9250 10056 10740 9947 5968 2054 -627 -2223 -1655 273 3049 4524 5869
9107E869J011l36l664m275Q0M022O796Q052R418R923R968Q001M295K717L119J889
9091F6885k46j405j614k647k366r91J453J819O84j389k504k06J12J97J185Q67
9075E9834j626k110K87J469L769M887O015N244L495L684K415K907K839M284R209
9060A06602J6236J8931N2626R9727J04711P3371L0081j1810m5312n2399n6272
9049C36492o0286m2541k9294k3428j8291j1492p427n623m679k888j886k19K193
9036A30631M983O154P958O313K473j443l059n433p025p501o813o738o908q065
9022A05527q793p147n872l341m206l720m854n017m367k280j008J019K632M891
9008F3464M450M799M700K763l626p888j2554j3705j2230l886P538J7105J7030
$$ plain form
9107 5869 6880 6544 2880 -1395 -1315 2707 9503 17555 26973 36896 46864 54865 59160 61877 64996 66885
9091 66885 66639 65234 63620 60973 58607 57616 59069 60888 61572 60183 57679 57473 57585 57782 58967 59834
9075 59834 58208 56098 56385 57854 61623 66510 72525 77769 81264 84948 87363 90270 93109 97393 106602
9060 106602 122838 141769 194395 294122 398833 472204 502285 490475 445163 392764 336492
9049 336492 276206 233665 204371 180943 162652 151160 143733 138110 133431 130543 128657 128438 130631
9036 130631 135614 141768 149726 156039 158512 157069 154010 148577 141552 134051 127238 120500 113592 105527
9022 105527 96734 89587 83715 80374 76168 72448 67594 62577 58210 55930 54922 55941 58573 63464
9008 63464 67914 72713 77413 80176 76550 68662 56108 42403 30173 26287 33825 50930 67960
8995F7960J2223J0763J1218J1586J1040J2921J6410J5083O851j898j2358j9177
8983A42622k1621k0889j8246j2918p162j122N635J1708J3418J4374J4500J3823
8971A34122J0047K699j326l619l201J633M533Q443J2958J7399K5743L5591M4995
8958B90017M5372L3570J5675N019N6r818j7168j7483j0217o4M618N087M361J094
8944C50119J097K930L277M976P871J2311J4408J3503J6252K2539L0528N0619P0691
8931F01121J26093K76178K81320J64007O1038j44292k20187k11590k03639j53788
8921E76261r6533o4324l6252j3464k084M17M650Q887Q787J0566R890R814Q360
8908D24975J1249J5412J5789J3823J4943J5038J2676J1911J2584R423N497P291
$$ plain form
8995 67960 80183 90946 102164 113750 124790 137711 154121 169204 176055 174157 161799 142622
8983 142622 121001 100112 81866 68948 61786 60664 66299 78007 91425 105799 120299 134122
8971 134122 144169 146868 145542 141923 138722 140355 144888 153331 166289 183688 209431 245022 290017
8958 290017 335389 368959 384634 389653 389709 379891 362723 345240 335023 334959 339577 344664 349025 350119
8944 350119 351216 354146 357423 362399 370270 382581 396989 410492 426744 449283 479811 530430 601121
8931 601121 727214 1003392 1284712 1448719 1509757 1365465 1145278 933688 730049 576261
8921 576261 479728 415404 379152 365688 363604 364021 368671 377558 386345 396911 406801 416615 424975
8908 424975 436224 451636 467425 481248 496191 511229 523905 535816 548400 557823 563320 570611
8896E70611P659P028P576J4579K3538K6603K7195K6462K3502K2365K2443K4070
8884H03631K8931L0146K9600L4022L9087L8801L2130K5170K5534K6605K5353K5863
8872A164873L6010N1069O5830Q2732J05612J20292R7161M3570J2940n014r292
8861A765783K466J7059K7229L3695L6138L6762M5137N5387O4051P2093P9533Q7002
8849B322335R3731J06038J27045J53465J76037J89381J90236J88869K02643K28362
8839C978142K49359K71276L14480L61617L90631M18968M78491N89025P87052J015881
8829H854922J059100Q20677O19153N96136P04900R52571J290467J669967K088808
8820A8656701K536109K981919L395089L761241M221680M913908N704578O141675
$$ plain form
8896 570611 578270 585298 592874 607453 630991 657594 684789 711251 734753 757118 779561 803631
8884 803631 832562 862708 892308 926330 965417 1004218 1036348 1061518 1087052 1113657 1139010 1164873
8872 1164873 1200883 1251952 1317782 1400514 1506126 1626418 1723579 1767149 1780089 1775075 1765783
8861 1765783 1768249 1785308 1812537 1846232 1882370 1919132 1964269 2019656 2083707 2155800 2235333 2322335
8849 2322335 2416066 2522104 2649149 2802614 2978651 3168032 3358268 3547137 3749780 3978142
8839 3978142 4227501 4498777 4813257 5174874 5565505 5984473 6462964 7051989 7839041 8854922
8829 8854922 9914022 10734699 11353852 11949988 12654888 13607459 14897926 16567893 18656701
8820 18656701 21192810 24174729 27569818 31331059 35552739 40466647 46171225 52312900
8812E2312900O082566O805645Q886174J2256156J7474557K5321611L7143718N3900700
8804B20184027P1778437P5414829M9613444P700732k2793535l4189728m3621373
8797C24086833n2291552n2123462m3693403l3741289k6118656k0532235j5776104
8790G9810132j1618456q555415o893775o024115n388905m861874m334084l815097
8782B8318411l344331k949827k574422k194326j841633j524678j245273j028110
8774A1615811q89261p99463p17225o29495n46445m87037m40271l88238l34187
8765F384189k94396k81947k98522l11102k95988k58057k19392j92370j78317j70050
8755C884048j62503j56349j51398j42444j33707j31041j28501j28061j25346j18428
$$ plain form
8812 52312900 58395466 65201111 74087285 86343441 103817998 129139609 166283327 220184027
8804 220184027 291962464 367377293 416990737 424691469 401897934 367708206 324086833
8797 324086833 271795281 219671819 175978416 142237127 116118471 95586236 79810132
8790 79810132 68191676 59636261 52742486 46718371 41329466 36467592 32133508 28318411
8782 28318411 24974080 22024253 19449831 17255505 15413872 13889194 12643921 11615811
8774 11615811 10726550 9927087 9209862 8580367 8033922 7546885 7106614 6718376 6384189
8765 6384189 6089793 5807846 5509324 5198222 4902234 4644177 4424785 4232415 4054098 3884048
8755 3884048 3721545 3565196 3413798 3271354 3137647 3006606 2878105 2750044 2624698 2506270
8745B506270j09389j04249j01075r3555q1962p1971o6338o1456n5566n0981m9235
8734A660493m2985l6548l2533l4282l8839m0109m1082m2142l9789k6169j3569
8723A272446j019J6377K5470J5962J5221J0421j0254k9350l8577m9309m9916m4516
8711A132956l9798l3696k9382k5781k4974k4891k5298k4201k2419k2367k1734
8700H38415j9378j5241j0578l341j464l745n358n663l215j99J541l66P52L501
8686G75661Q474J4082J4841J5110J1327K224M06J2092N4115J01943P2105J3808
8674A096188j8758n2018p8412q9109r1535p7168n5500l2531j9328j6654j3511
8663E51664r442j0199j4468k2359k6858k5188j9452j0671n413k83O143J3277K2123
$$ plain form
8745 2506270 2396881 2292632 2191557 2098002 2016040 1944069 1877731 1816275 1760709 1709728 1660493
8734 1660493 1617508 1580960 1548427 1514145 1475306 1435197 1394115 1351973 1312184 1286015 1272446
8723 1272446 1271427 1287804 1313274 1329236 1344457 1354878 1344624 1315274 1276697 1227388 1177472 1132956
8711 1132956 1093158 1059462 1030080 1004299 979325 954434 929136 904935 882516 860149 838415
8700 838415 819037 803796 793218 789877 788413 784668 779310 773647 770432 770233 771774 771408 772160 775661
8686 775661 784135 798217 813058 828168 839495 841719 842125 854217 908332 1010275 1082380 1096188
8674 1096188 1077430 1025412 947000 857891 766356 689188 633688 601157 581829 565175 551664
8663 551664 542222 532023 517555 495196 468338 443150 423698 413027 407614 407331 413474 426751 448874
8650D48874K5603R014k2554l8398k9464j5329p540j113P068J3033J6868J7285
8638D23347J2702N302k880n567n166n311p578p622n381k890m26L780M959L291
8624D10560K380l501r486j9329k8984l1194k5379k1986j5722o480J404M723P787
8611B64793P913L906L015R476J9641K1838J0834L20m082q354j3383j4712j0113
8598B91092m656k184J85N374P883O555M371j53k257m224n235o226p688o515n384
8583B70938p702j2949j0625p822j0056j0230q512r049j1539j3384j2779r124o411
8570A40756j988J449M022N645N729N025L354J584J23k274l372l331k201Q25L675
8555A59021M471M358J518L664O539k316J108J0768O551o88j406J930O32k430o584
$$ plain form
8650 448874 474477 483491 460937 422539 393075 377746 370206 369093 376161 389194 406062 423347
8638 423347 436049 441351 438471 432904 427738 422427 414849 407227 401846 398956 398530 402310 407269 410560
8624 410560 412940 409439 399953 380624 351640 320446 295067 273081 257359 250879 252283 257006 264793
8611 264793 272706 276612 279627 289103 308744 330582 341416 341736 337654 329300 315917 301205 291092
8598 291092 286436 284252 284437 289811 297694 304249 308620 308467 306210 301986 296751 290525 282837 276322 270938
8583 270938 263236 250287 239662 231840 221784 211554 203042 193993 182454 169070 156291 147167 140756
8570 140756 138768 140217 144239 149884 155613 160638 163992 165576 165699 163425 160053 156722 154521 155346 159021
8555 159021 163492 167850 169368 173032 179571 177255 178363 189131 195682 194994 193588 195518 196150 193720 187136
8540A87136n543j837m560o523m417k364M12J915K516J170o96k907k368j469j850
8525A58615l056m098m070m090j687j609k195k585k523k106j798l027l049l096
8511A19626l917m020k365R51L707M938N103O575Q033O809O367O210L996M49k145
8496A60317l779k408L09J297K837K681l41l293l559k928k669r79k69j268j583
8481A44365j22J678J476J018J805Q31M8L13J107J288K475M186N981M556k223j0880
8465A57902j5550j4877j2989j0714r777n978n26N59J635J496P34J149j310l598
8451H8156k091q01j913k181l333k533j593k924l330l709l050l476l705k813l233
8436D7471j182L59R42K538K930N336O293N545O250M400L364M231N769N301P533
$$ plain form
8540 187136 181593 179756 175196 168673 164256 161892 162304 164219 166735 167905 167209 164302 161934 160465 158615
8525 158615 155559 151461 147391 143301 141614 140005 137810 135225 132702 130596 128798 125771 122722 119626
8511 119626 115709 111689 109324 110275 113982 118920 124023 130598 138631 145440 151807 158017 162013 162462 160317
8496 160317 156538 154130 154439 155736 158573 161254 160913 157620 154061 151133 148464 147485 147216 145948 144365
8481 144365 144243 145921 147397 148415 150220 151051 151099 151412 152519 153807 156282 160468 166449 171005 168782 157902
8465 157902 142352 127475 114486 103772 93995 88017 87491 88050 89685 91181 91915 93064 91754 88156
8451 88156 86065 85264 83351 81170 77837 75304 73711 70787 67457 63748 60698 57222 53517 50704 47471
8436 47471 46289 46648 47590 50128 53058 58394 64687 70232 76482 80882 84246 88477 94246 99547 107080
8421A07080R006J1369J1274J1071J4507J8430K0697K2829K7916L5079M4423N9979
8409C93660Q5447J19818J64852K14183K58510K88372K88270K53349J88057Q4032
8399B338550k5350j26824k15804k61682k76604k64844k32660j92783j50679j14746
8389D76574q5684o2413m7468l5487k7295k2761j9968j6948j4275j1021q943o850
8377A17461n842m863m481l774k071j970j138n84j774r79k3P84Q62j52j391m70
8361H9595J804K530n77k792l933m378l272k409m8k52m59j667j150j114k482j228
8345F8168k589j600n90j110j46j43j291j907k536k516n008o426n814n110l055
8330B8327l08K331M071M379M010K465K422M684N086M208K062J358K137N120M660
$$ plain form
8421 107080 116086 127455 138729 149800 164307 182737 203434 226263 254179 289258 333681 393660
8409 393660 479107 598925 763777 977960 1236470 1524842 1813112 2066461 2254518 2338550
8399 2338550 2313200 2186376 1970572 1708890 1432286 1167442 934782 741999 591320 476574
8389 476574 390890 328477 281009 245522 218227 195466 175498 158550 144275 133254 124311 117461
8377 117461 111619 106756 102275 98501 96430 94460 93322 92738 90964 89985 89962 90746 91608 91456 90065 89595
8361 89595 91399 93929 93352 90560 86627 82249 78977 76568 76520 76268 75809 74142 72992 71878 69396 68168
8345 68168 65579 63979 63389 62279 62133 61990 60699 58792 56256 53740 48732 42306 36492 31382 28327
8330 28327 28019 30350 34421 38800 42810 45275 47697 52381 57467 61675 63737 65095 67232 72352 77012
8315G7012K394J788l1l205l640m693m258k885l131l549j794q63M7J639K647K316
8299E9794K666K795J396J105o66j979k708k492k394j7j042k137o08q79l18o35
8283E1881R71q73J254L077M957N487M757M724M765M345K731O95n97n034n132n945
8267G2063n792l863l611n205l413k153j166r42J58l07j20K54K57J397K678K201
8251E2436J544K21R61L47J058J424J285J162k31j458J77J222J105J213j515k323
8235E8628j959r36r38j409j394j919k031J91J397K267J382P4O12J315K683J958
8219E9921K231K917K755J030J702K814L505O795R992Q684M266j478n975o572n407
8204H7180l259n61K630K570O91j667j014j486O50K886K939j90p6p44k453m036
$$ plain form
8315 77012 79406 81194 81163 77958 74318 69625 65367 62482 59351 55802 54008 53145 53192 54831 57478 59794
8299 59794 62460 65255 66651 67756 67090 65111 62403 59911 57517 57500 56458 54321 53713 52834 52516 51881
8283 51881 52852 51979 53233 56310 61267 66754 71511 76235 81000 85345 88076 88771 88174 83140 78008 72063
8267 72063 66271 62408 58797 53592 50179 48026 46860 45918 46076 45769 45649 45903 46160 47557 50235 52436
8251 52436 53980 54201 55162 55509 56567 57991 59276 60438 60207 58749 58926 60148 61253 62466 60951 58628
8235 58628 56669 55733 54795 53386 51992 50073 48042 48233 49630 51897 53279 53353 53965 55280 57963 59921
8219 59921 62152 65069 67824 68854 70556 73370 76875 83670 93662 102346 106612 105134 99159 92587 87180
8204 87180 83921 83360 85990 88560 89251 87584 86570 85084 85734 88620 91559 91369 91293 90549 88096 84060
8188H4060m004j617K37J822L130L308J537K01j123j145j007l310R2K977K447K581
8172I0186L528N524O700O620M365j501o364p784p688m416j94L290L249L941J333
8157A00789j802k845j928k389j836o30j692m008m186l153m667l250l912k707j876
8142E9908j313J42L212L546K074k01j597l671l744k203l63J297J982J116q74j170
8126E8141k274l028l007j609j548j880j228j319j226j290r69q25M80O16L39n49
8110C8824j050j119j681j043n96O73p94p57L25J1J810J505J823N31n6j350n96
8093C6460j040j056o25J138L36j141o39R77R82M35r05j344q58j090j001n73Q5
8076C0141p50j464j326J091Q2l49l60k66o37K61J920O41N89r44r26j811n60N07
$$ plain form
8188 84060 80056 78439 78676 80498 83628 86936 88473 88674 87551 86406 85399 82089 82181 85158 87605 90186
8172 90186 93714 99238 105938 112558 116923 115422 109058 101274 93586 89170 88976 92266 95515 99456 100789
8157 100789 98987 96142 94214 91825 89989 89359 87667 83659 79473 76320 71653 68403 64491 61784 59908
8142 59908 58595 58737 61949 65495 67569 67368 65771 62100 58356 56153 55790 57087 59069 60185 59311 58141
8126 58141 55867 52839 49832 48223 46675 44795 43567 42248 41022 39732 38763 37938 38418 39034 39373 38824
8110 38824 37774 36655 34974 33931 33335 34008 33214 32457 32782 32793 34603 36108 37931 38462 38406 37056 36460
8093 36460 35420 34364 33739 34877 35213 34072 33433 34410 35392 35827 34922 33578 32720 31630 30629 30056 30141
8076 30141 29391 27927 26601 27692 27774 27425 27065 26799 26162 26423 28343 28984 29573 28629 27703 25892 25332 25839
8058B5839j07p17p86k18j018j195J64k26j053j476q90n93K67J468N0L95J283J014
8040B2201J666J495J020m92o94j515r87o25M65L8M76L28p23l61j533l092k228
8023A5439j358q07P27O91R58O61J55J194m10r94n63o62K79j409j67K62r18l0L44
8004A3392J517L90J028O36L34Q98K02L63L91J84J270K67O37o31N42J536J295O27
7986B4878J180M45l34j864j679j300l85M80k60j128r53N93L51N77l55M23j039
7969A9630l57J31m50m83k22o46j009p87J52O69K25N53J174n6k55N8K62N30k86
7950A8833J98j44o52j660j063j180p06j582m37q79r0O13J59M45P97K10J9n15J166
7931A3532J077M3K44P16l11J36j70J545J551O87j036J043j248k095K12N16j349
$$ plain form
8058 25839 25732 25015 24229 24011 22993 21798 21962 21736 20683 19207 18317 17724 17991 19459 19509 19904 21187 22201
8040 22201 23867 25362 26382 25890 25196 23681 22694 22069 22534 22572 23048 23376 22653 22292 20759 17667 15439
8023 15439 14081 13274 14001 14692 15650 16311 16466 17660 17250 16256 15693 15031 15310 13901 13734 13996 13078 13048 13392
8004 13392 14909 15299 16327 16963 17297 18195 18397 18760 19151 19335 20605 20872 21509 20878 21420 22956 24251 24878
7986 24878 26058 26503 26169 24305 22626 21326 20941 21421 21161 20033 19080 19673 20024 20601 20246 20669 19630
7969 19630 19273 19404 18954 18471 18249 17603 16594 15807 15959 16628 16853 17406 18580 18524 18269 18327 18589 19119 18833
7950 18833 19031 18887 18235 16575 15512 14332 13626 12044 11607 10728 10638 11251 11410 11855 12652 12862 12881 12366 13532
7931 13532 14609 14652 14896 15612 15301 15437 15267 16812 18363 19050 18014 19057 17809 15714 15926 16442 15093
7914A5093j024k47K04j485J54L64j363n92R86P4P50o46O09J924k22k443j335J62
7896A0963J967R28N57M94p36l03o63o67j11l26m41J141J146m85o52o13L61O72
7878A3232J619M28j624j207N5N7p47p48l64j780j240R57L79K552J841r41k42q30
7860A1397K94K49l76K24p84K86N40Q30p30m39J011J077n6K04o14j223k343r36
7842H611j196O48J575Q34p29o12J23O59j123j367j526P21J267PJ65r44J81L60
7824G654L41m93O01K645R40n40o83J24J151P00O95J435p56p97N01k26L65l21p02
7805A2634n10j995j255o24M27R55P81J057k02j306N23O74j224j444l89R75O34
7788I711J136l25k50M83P45K67r12m63J086o53n94m60l40n84L87L5o7l01j255
$$ plain form
7914 15093 14069 13822 14026 12541 12695 13059 11696 11104 12090 12164 12914 12268 12877 14801 14579 12136 10801 10963
7896 10963 12930 13858 14415 14909 14173 13870 13207 12540 12429 12103 11662 12803 13949 13464 12812 12199 12560 13232
7878 13232 14851 15279 13655 12448 12503 12560 11813 11065 10701 8921 7681 8638 9017 11569 13410 12469 12227 11397
7860 11397 11691 11940 11564 11788 11004 11290 11830 12660 11930 11491 12502 13579 13523 13727 13113 11890 9547 8611
7842 8611 7415 8063 9638 10472 9743 9131 9254 9913 8790 7423 5897 6618 7885 7892 8057 7113 7294 7654
7824 7654 7995 7502 8103 10748 11688 11148 10465 10589 11740 12440 13135 14570 13814 13017 13518 13292 13657 13336 12634
7805 12634 12124 10129 8874 8250 8677 9632 10413 11470 11268 9962 10485 11159 9935 8491 8102 9077 9711
7788 9711 10847 10522 10272 10755 11500 11767 10855 10392 11478 10825 10231 9771 9431 8847 9234 9269 9202 8901 7646
7769G646o06K94O82n1o34k55m69O78O33j85q3OJ070o36m73J46l88q27J04j343
7749E309o0n60j276k71o83M67K31J181J274O0p79l90P93R30K46j303q85J3N95
7730D892J235p96J90J086k30J64J164L17j14Q86n12N4j47k30k02o20j097J154
7712G194J119R12O64j338R12J789m33n86l69K24L73K94l44o00m91k72j41l48j10
7693H449Q50J86q16p47K15P1N07k8k26j156j112j297k24J798P02n26m9p17r84
7674D896O94K680p23j189LJ18r60q08K91J367Q60L31j88O87L11q63j90l67O27
7655G577m63r89o92j65J740o27j277L39L89K26j979j133K10R86K0O16M09J27O69
7636E983Ll85l40L69R53O54M12l55r6M13P90J54k18m64m07l35j042q1Q87N23j677
$$ plain form
7769 7646 7040 7334 8016 7965 7331 7076 6607 7285 7918 7733 7650 7656 8726 8090 7617 7763 7375 6548 6652 5309
7749 5309 5249 4689 3413 3142 2459 2926 3157 4338 5612 5672 4893 4503 5296 6226 6472 5169 4284 4297 4892
7730 4892 6127 5331 5521 6607 6377 6541 7705 8022 7908 8794 8282 8336 8189 7959 7757 7137 6040 7194
7712 7194 8313 9225 9889 8551 9463 11252 10819 10233 9864 10088 10461 10755 10411 9811 9320 9048 8907 8559 8449
7693 8449 9299 9485 8669 7922 8137 8208 8715 8687 8461 7305 6193 4896 4672 6470 7172 6646 6597 5880 4896
7674 4896 5590 8270 7547 6358 6361 6479 5519 4711 5002 6369 7229 7560 7372 8059 8370 7507 7317 6950 7577
7655 7577 7114 6125 5433 5268 7008 6381 5104 5443 5832 6058 4079 2946 3156 4142 4162 4778 5187 5314 5983
7636 5983 5986 5601 5261 5630 6583 7237 7649 7294 7198 7611 8401 8555 8337 7873 7466 7131 6089 6008 6895 7418 5741
7615E741n35N07O97J57J85m3n2k38q3J015j132j366P29O04L7j93r79k13k60j011
7595C567P72O77Q95K39r32K58j4m28j69k94M5l70k58n0j205J77J163j19K90j9
7575D225M13Q84M62j99K74l34j48j295j23J098J2K47j328n0J457M39r04k34j3
7556D883n05o12L55J089K80K38O96P87K52Q36j601j274j32N65m69l42j093j077
7538B876p78j523k64J422l68J053Q11q4k09J38M04N2O09r5j312n67RJ07J150J120
7518D551J018j89J15j331j220L24N12M9q05O09O26j47N49j119J87L35P04P15m68
7499E015j255j0k57j9J122P92m13m88N28M55p18K90l82n33n87k93N93P54R90p00
7479D884r81q31j00Q8N27M98O09R91Q17o61p54P40p15j571n44K70M44J36J043
$$ plain form
7615 5741 5206 5713 6410 6567 6752 6709 6657 6419 6336 7351 6219 4853 5582 6186 6223 6030 5051 4838 4578 3567
7595 3567 4339 5016 5911 6150 5218 5476 5462 5034 4865 4571 4616 4246 3988 3938 2733 2910 4073 3954 4244 4225
7575 4225 4638 5522 5984 5785 6059 5725 5577 4282 4159 5257 5269 5516 4188 4138 5595 6034 5130 4896 4883
7556 4883 4378 3766 4121 5210 5490 5728 6424 7211 7463 8299 6698 5424 5292 5857 5388 5046 3953 2876
7538 2876 2098 575 311 1733 1365 2418 3229 3145 2936 3074 3478 3530 4139 4044 2732 2165 2174 2281 3431 4551
7518 4551 5569 5380 5495 4164 2944 3268 3780 3829 3024 3633 4259 4112 4661 3542 3729 4064 4768 5483 5015
7499 5015 3760 3750 3493 3474 4596 5388 4975 4487 5015 5470 4752 5042 4660 4127 3540 3247 3840 4594 5584 4884
7479 4884 3903 3072 2972 3060 3587 4085 4694 5685 6502 5841 5087 5827 5112 3541 2997 3267 3711 3847 4890
7460D890K49k24M83p88P06m10p8j076r02n77Q06J123O69j286j926R8R34l24P06
7441C073L96r22n47J141p5L18L09P49p68J0j199j676J143R66J008M07l98j491
7423B444qJ557Q7k35j171M75N86L94j197j257j010J80J121J024l74L08P70J40
7405C834N7J292p24o14O41j00L67j279j063M94O16j228p92J162J216p47N55p02
7387B985N06R90j2j529k01L00J71O4RQQ25m20j224k20K004n6o0j59k68Q76L03
7366D892j24k13j206k98N81J161k83M08o05k81Q41r53k27R0N73N54j99r0J83n36
7346D268p3J22L22Q63j15j046j225l05J12n02r80Q05J781J106q47j655j286O40
7328A985K039M72j138j31O63l38r50L83r47n94L15N66O48k27k89o77j115M90J803
$$ plain form
7460 4890 5139 4915 5398 4610 5316 4906 4828 3752 2850 2273 3079 4202 4871 3585 1659 1757 2691 2367 3073
7441 3073 3469 2547 2000 3141 3066 3384 3693 4442 3674 3684 2485 809 1952 2918 3926 4333 3935 2444
7423 2444 2436 3993 4080 3845 2674 3149 3735 4129 2932 1675 665 845 1966 2990 2616 2924 3694 3834
7405 3834 3891 5183 4459 3845 4486 4386 4753 3474 2411 2905 3521 2293 1501 2663 3879 3132 3687 2985
7387 2985 3491 4481 4469 2940 2739 3039 3210 3274 3283 3291 4116 3696 2472 2252 4256 4200 4140 3981 3713 4589 4892
7366 4892 4768 4555 3349 3051 3632 4793 4510 4918 4313 4032 4873 3920 3693 3783 4356 4910 4711 4621 4804 4268
7346 4268 4195 4317 4639 5502 5387 4341 3116 2811 2923 2421 1441 2246 4027 5133 4286 2631 1345 1985
7328 1985 4024 4496 3358 3227 3890 3552 2602 2985 2038 1444 1759 2325 2973 2746 2457 1780 665 1155 2958
7309B958J421j27j186j037QJ785Q45J22k13M78r44Om08m38r9p66q44J143J75R02
7289C781L81J182R77l09Q82M77n64r21p01L36l36j056p16R89J063p8q24j67J121
7270E517p45q78M28N26q50j425j036n96J03O92K13P18N01M63O88l07J29K04j05
7251D240M04j65n69l36j62p2k27M06K75m13n33m57L0l22L75R01n38R0L29l84l45
7230B527J027k5L05l32j64n3j42l2N69j39k221j539j695r57N94J352J164J33M4
7211D16j146o77J767K055O29m66j097j41Q29l93P61j071L15n09O55n30m33Q71
7193A835K16R01n14k8J024L01L6j300j283R83L63j219j48R70N17p00o4K03k47
7174A846j21J27J67N40o2j94p60m15J86k92o16O0P07J89r05M38J072r7n29l23
$$ plain form
7309 2958 4379 4252 3066 2029 2037 3822 4667 4789 4576 5054 4110 4116 3708 3270 3171 2405 1561 2704 2879 3781
7289 3781 4162 5344 6321 6012 6894 7371 6807 5886 5185 5521 5185 4129 3413 4402 5465 5387 4563 4396 5517
7270 5517 4772 3894 4322 4848 3998 2573 1537 941 1044 1736 1949 2667 3168 3631 4319 4012 4141 4345 4240
7251 4240 4644 4479 3910 3574 3412 3340 3113 3519 3794 3381 2848 2391 2421 2099 2474 3375 2837 2927 3256 2872 2527
7230 2527 3554 3529 3834 3502 3338 3285 3143 3111 3680 3541 1320 -219 -1914 -2871 -2277 -925 239 372 416
7211 416 -730 -1407 360 2415 3044 2578 1481 1340 2169 1776 2537 1466 1781 1272 1927 1397 964 1835
7193 1835 2051 2952 2438 2410 3434 3735 3771 2471 1188 2171 2534 1315 1167 2137 2654 1954 1890 2093 1846
7174 1846 1725 1852 2019 2559 2497 2303 1543 1128 1314 1022 406 466 1173 1362 457 895 1967 1870 1341 1018
7154A018K69m16j30J99J19J80J431j37j003l86n7K018q1j573J51J333l52l59j627
7135E97o30J43L69p3j34l32n06R38J401m10J13L82O31o9o93r63K89J257Q4q76
7115A518R83m01M35j207j143J512j01j819M8J34P75l86m84J452J112Q68N53l75
7097C474m82K22j417Q7O86o1o58k50j87J429J717j33j099j81q86l51M87O19L91
7078C407K38Q74o91j31P73M53l20r02p7m12p98n05j203p6J031M23j90O57P23R31
7058D205J940O29J5r50j268j405k47J172j93j81k13r22n89K58L16K70j017j090
7040G30m5J520J116R01k83k5j112p59L26R13J004m01o90n35k91q43m75N97j078
7021E70j34O96m18k65L51J58K76l97P59L96M2o0O84l89q44j14K83m58k11J066
$$ plain form
7154 1018 1287 871 741 940 1059 1239 2670 2533 1530 1144 1087 3105 3024 1451 1602 2935 2583 2224 597
7135 597 -33 110 479 406 272 -60 -566 372 1773 1363 1476 1858 2489 2420 1727 764 1053 2310 2394 1518
7115 1518 2501 2100 2535 1328 185 1697 1596 -223 -175 -41 734 348 -136 1316 2428 3296 3849 3474
7097 3474 2992 3214 1797 1884 2570 2509 1851 1601 1414 2843 4560 4427 3328 3147 2261 1910 2397 3016 3407
7078 3407 3645 4519 3828 3697 4470 4923 4603 3701 3624 3212 2414 1909 706 630 1661 2084 1894 2551 3274 4205
7058 4205 6145 6774 6789 5839 4571 3166 2919 4091 3898 3717 3504 2582 1993 2251 2567 2837 1820 730
7040 730 685 2205 3321 4222 3939 3914 2802 2043 2369 3282 4286 3885 3195 2660 2369 1526 1051 1648 570
7021 570 436 1132 714 449 800 958 1234 837 1596 1992 2034 1974 2658 2269 1425 1311 1594 1136 925 1991
7001A991J297k26M97j292j434J105O02l84R53J188m84j216K98J520n8j384R1O55
6983C719j41j617j086M10P70J66N89l95m02R0K94L28L82l92R69K99j032p89P5
6964B237o75r51j115P56Q76J51N32L88L22q79j457K15Q71J811N53o63j128j88
6946A656J001J959p27k87r85q4M96J74j115o28R66k37k06J5o55l24m62K03K486
6927C246P37N90R00j264l60L200J935P83J91J94q69r36j085l2r48j238j212k96
6909C536j257L04K06l49o43r55j227r49j64P07j856j48Q46j81P32J84L28LL92
6890d91K00K70J005N00q91J36o85j045r22K24N99M58J205k80N8M48M4n19K68K59
6870H41o1M26J01Q31J60q20L41Q15j255j427j242K07J745J570k25j84J355q39
$$ plain form
7001 1991 3288 3062 3559 2267 833 1938 2540 2156 3109 4297 3813 2597 2895 4415 4357 2973 3064 3719
6983 3719 3578 1961 875 1285 2055 2221 2810 2415 2013 2103 2397 2725 3107 2715 3684 3983 2951 2162 2237
6964 2237 1562 611 -504 252 1128 1279 1811 2199 2521 1642 185 400 1271 3082 3635 2972 1844 1656
6946 1656 2657 4616 3889 3602 2617 2533 3029 3203 2088 1460 2426 2189 1983 1998 1343 1019 557 760 3246
6927 3246 3983 4573 5473 4209 3849 7049 8984 9767 9958 10152 9283 8347 7262 7230 6282 5044 3832 3536
6909 3536 2279 2583 2789 2440 1797 842 -385 -1334 -1498 -791 -2647 -2795 -1949 -2130 -1398 -1214 -886 -883 -491
6890 -491 -291 -21 984 1484 593 729 44 -1001 -1923 -1699 -1100 -642 563 283 341 789 833 314 582 841
6870 841 780 1206 1307 2138 2298 1478 1819 2634 1379 -48 -1290 -1083 662 2232 2007 1823 3178 2339
6852B339q01nP39K40N6k83k139J63j217q52Q66R05r26m84Q74J163P24j99j226
6833f3J091P7j561K36N5J496m2r63M07Q42O98o16r50j134k50J523L95l09Jj095
6813a62L41J033M17n53M82L75m57P46K16J88K81l16o12p40l81O5K45K29q56j78
6793C63J242J770j68r8o7p35q42P00O63J60m51j87J87l83l58O00P9r61N96k61
6773A849l11q34r73p59L97J354R00m96p81J457l03j080J28R32K14L43q13j270
6755d6q71J001K22P72J02L03o65k9k45K92K99m37p29k87R46j76q56O70Q94K3J6
6734A199q3j219n7n13j52n10o23K78l76q01M84K076J439k122j038N60M30Q03J148
6715I23O31j461j18j740j206n13J303J387J940k7L06K45p2q24q5J432o02k019
$$ plain form
6852 2339 1538 1533 2272 2512 2568 2285 146 309 -908 -1760 -894 11 -915 -1399 -525 638 1362 1163 -63
6833 -63 1028 1105 -456 -220 -165 1331 1289 326 733 1575 2273 1657 707 -427 -677 846 1241 932 933 -162
6813 -162 179 1212 1629 1076 1558 1933 1476 2222 2438 2626 2907 2591 1979 1239 858 923 1168 1397 541 363
6793 363 1605 3375 3207 3109 3042 2307 1465 2165 2828 2988 2537 2350 2537 2154 1796 2396 2475 1514 2110 1849
6773 1849 1538 704 -269 -1028 -631 723 1623 1127 346 1803 1500 420 548 1480 1694 2037 1224 -46
6755 -46 -917 84 306 1078 1180 1483 818 789 544 836 1135 698 -31 -318 628 452 -404 266 1160 1183 1199
6734 1199 1116 -103 -160 -673 -825 -1335 -1958 -1680 -2056 -2857 -2373 -297 1142 -980 -2018 -1458 -1028 -225 923
6715 923 1554 93 -25 -1765 -2971 -3484 -2181 -794 1146 1119 1425 1670 1598 774 689 2121 1519 -500
6697e00j33K50k88N14N75o99kl51L53N2K73N71M3m73L05M76J463L75j127q26O39
6676A490m72L10o76j413l11K06P53K59k47L13N10J184j047p33p1K93k38J70K39
6657E19K57j7M82r00j029Q1L89N74Q01J328P81K91k39P09O33l68j075l42M09p95
6637B489l94P27k57L47p78j217n36M18M15k95o02L96Q04j92r01k99k23k04J198
6618H96J062j2n44p38o15L53J194L28N51O78m68n45p7r37M1k96k01n96J95Q4l46
6597Gj194P09K53P18K72L80O24J081L31o64j95l65m6k41j92J97j02o60l53o35
6577g5L66J211P18M20j98n42o66j404n68J624o84p97M21J61p10l77n23P09R47
6558C3J137P62k08n00k81O31o96j3K10K4m3J30J7j5p52o77n61N91k10r80j10J669
$$ plain form
6697 -500 -633 -383 -671 -157 418 -281 -283 -634 -281 -229 44 615 658 185 490 966 2429 2804 1677 851 1490
6676 1490 1018 1328 652 -761 -1072 -866 -113 146 -101 212 722 1906 859 126 55 348 110 280 519
6657 519 776 759 1241 341 -688 -607 -218 356 1157 2485 3266 3557 3318 4027 4660 4292 3217 2875 3284 2489
6637 2489 2095 2822 2565 2912 2134 917 381 799 1214 919 317 713 1517 1325 424 125 -98 -302 896
6618 896 1958 1946 1402 664 49 402 1596 1924 2475 3153 2685 2140 2063 1126 1167 871 670 74 269 353 7
6597 7 -1187 -478 -225 493 765 1145 1769 2850 3181 2517 2322 1957 1911 1670 1478 1675 1573 913 560 -75
6577 -75 291 1502 2220 2640 2442 1900 1234 -170 -738 886 202 -595 -174 -13 -723 -1100 -1623 -914 33
6558 33 1170 1932 1724 1224 943 1574 878 865 1075 1099 1056 1186 1203 1188 436 -241 -802 -211 -421 -1401 -1511 158
6536A58P17K53k50l26N75O70j147p91O98Q24q44J105J526p08q76k44L78J95M54
6517B367M4r51q01R87K13j603k28R23l26J016J71k81j19j128k32Q59k0l92J80
6498F79K77N0j052q81j23J93Q2K94Q67o10n35L84M63J342m13k76n83M83Q52M04
6478A897O09o79n27j031m82M60N49o2p46q52n8K28j146M90J383m89j8M69N25P
6458E27K64L01l87r53N66Q51J32j44N41O43Q00n38l95o25M74r13k31M6k2L92J255
6437B584k81n52k06L71j270j419O22k5j1K92o83J51J259J57j65P17j359k17J5
6418b0j185N01j5R0j19p02q02J89J005k01K10J811J74j080j06M74m29m03j578
6399b186n1M10K10K87P32P67m23J66J927M45q17j681O39N44p96m01j036Q1N53
$$ plain form
6536 158 875 1128 878 552 1127 1797 650 -141 557 1381 537 1642 3168 2460 1584 1340 1718 1913 2367
6517 2367 2411 1460 659 1646 1859 256 28 951 625 1641 1812 1531 1412 284 52 911 891 499 679
6498 679 956 1006 -46 -927 -1050 -857 -775 -481 386 -224 -759 -375 88 1430 1017 741 158 641 1493 1897
6478 1897 2506 1827 1300 269 -213 247 796 734 -12 -864 -922 -694 -1840 -1350 33 -456 -474 -5 520 527
6458 527 791 1092 705 -248 318 1169 1301 1157 1698 2341 3141 2603 2208 1583 2057 1144 913 959 937 1329 2584
6437 2584 2303 1751 1545 1916 646 -773 -151 -176 -187 105 -578 -427 832 989 824 1541 182 -35 -20
6418 -20 -1205 -704 -719 -629 -748 -1450 -2252 -2063 -1058 -1259 -1049 762 936 -144 -250 224 -205 -608 -2186
6399 -2186 -2237 -1827 -1617 -1330 -598 169 -254 -88 1839 2284 1467 -214 425 969 173 -228 -1264 -1183 -630
6380f30J87j16r59j37K96K46l48J201J079l00L68J77J91K00n03k54J8l83p78o32
6360a077R40j7P82N22k26n5J01Q8J85R27M76K29j84N88l81j580r20p93N65N16
6340F86K61QM28k71m71p26m15J5k09N2J124L79q24J73j481N87J404k18j811j39
6320a448J132q78k81j7l11p69J094J308K67P90M11r01n6m72r63R09l44k257L06
6301b480J960N86j031j251J743m6m05j13K10j293n90Q75J661Q8j41P49l24O37
6283H35J238o97j68n24K71l87j533k40q69l73O96J84L21M97Q9m63J072Q95R02
6264A746M03q28q74r32n83p8J642K78j200q3j59N49J166k09j056Q8k4J46m85l25
6244h18K06J71m19j201m68J165Q94K01K8J624k21p98M64M52K40L6j196J9R31K37
$$ plain form
6380 -630 -443 -559 -1518 -1655 -1359 -1113 -1461 -260 819 519 887 1064 1255 1455 952 698 716 333 -445 -1077
6360 -1077 -137 -154 628 1150 924 869 970 1058 1243 2170 2646 2875 2691 3279 2898 1318 398 -395 170 686
6340 686 947 955 1383 1112 641 -85 -500 -485 -694 -642 482 861 37 210 -1271 -684 720 502 -1309 -1448
6320 -1448 -316 -1194 -1475 -1492 -1803 -2572 -1478 -170 97 887 1298 397 341 -131 -1094 -185 -529 -2786 -2480
6301 -2480 -520 66 -965 -2216 -473 -519 -924 -1037 -827 -2120 -2710 -1835 -174 -86 -227 522 198 835
6283 835 2073 1376 1208 684 955 568 -965 -1205 -2074 -2447 -1751 -1567 -1246 -749 -660 -1123 -51 844 1746
6264 1746 2149 1321 447 -485 -1068 -1146 496 774 -426 -509 -668 -119 1047 838 -218 -130 -154 -8 -493 -818
6244 -818 -612 -441 -860 -2061 -2529 -1364 -470 -269 -241 1383 1162 364 828 1280 1520 1556 360 379 1310 1547
6224A547j247l88L40p1r26l44O7p83o38j33p8R56P54k16j033L40N54M53P78K26
6204A58p69m70Q56R60M76j075p29O76j40q08O77J80m53l48j115L1J00r20k03r75
6184c891j451P03Q11J012J82M89K55m22K65O06J415R56q36O2L99M98N2q23p73
6165d91k24M17K039m82j333n42J10N13N56l26j46J34l35J099k94j067j389K23
6147a538L95L68P02J10j67k73o89P85k41L26K91l83P86K01R04k55K73q36m27L43
6127F75J33j312n72M37R13k48J43Q07l21Q83K96o54j202l28Q59R1k44m17l92M4
6107d09P03L67p08j042O32N62k68m7k48j258j95N65P83R54r5k90L20P96LK85k30
6086A180j174j263M74M44j90M15J44k33j030L24n60n52n09o67Q03J565J4o13k76
$$ plain form
6224 1547 300 -88 252 181 -745 -1089 -1022 -1805 -2443 -2576 -2654 -1698 -944 -1160 -2193 -1853 -1299 -846 -68 158
6204 158 -611 -1081 -225 735 1211 136 -593 83 -57 -865 -188 -8 -461 -809 -1924 -1893 -1793 -2713 -2916 -3891
6184 -3891 -5342 -4639 -3828 -2816 -2634 -2145 -1890 -2312 -2047 -1441 -26 930 94 156 555 1053 1105 282 -491
6165 -491 -715 -298 1741 1259 -74 -616 -506 7 563 237 91 225 -110 989 695 -372 -1761 -1538
6147 -1538 -1143 -775 -73 37 -130 -403 -1092 -307 -548 -222 69 -314 472 673 1577 1322 1595 759 332 675
6127 675 808 -504 -1076 -639 274 26 169 976 655 1538 1834 1180 -22 -350 509 600 356 -61 -453 -409
6107 -409 294 661 -47 -1089 -457 105 -163 -210 -458 -1716 -1911 -1346 -563 391 296 6 326 1122 1125 1410 1180
6086 1180 6 -1257 -783 -339 -529 -114 30 -203 -1233 -909 -1469 -2021 -2530 -3197 -2394 -829 -815 -1428 -1704
6067a704Q42j41k40L68L95K1M33M4m94p99K25m16j240o00J305P12J56k57j35j15
6047a640N10P97P88m4m11o48j389N39K81M45k7p89N56J342O48l25K95N53O7k49
6027A299p8j397M38Q60Q65l2j119r86n3M90M53O17J79l95k44r04Kn76q9J62m18
6006i26J66m72M75k42J601J523n25o31o64N51K67n62q66ql66O53K47M14k44M0
5986D31Q26j678j696K54J598M96P1r41O60j5K00m99p83P64N5K24r4j87o70j381
5966b365O42R9j94P03Q15j27K59j016M2J8l28n67O83R47q9N43J08r94K62L29o38
5945h68j506L05J247K20l4n25j00J12l0J028n77j280m80j9o82O09J548p93p40
5926b565j56P43J252L07o2P46q95j845k36R10J133R59J028J139j14r68m49j631
$$ plain form
6067 -1704 -862 -1003 -1243 -875 -480 -459 -26 18 -476 -1275 -1050 -1466 -2706 -3306 -2001 -1289 -1133 -1390 -1525 -1640
6047 -1640 -1130 -333 455 411 0 -648 -2037 -1498 -1217 -772 -799 -1588 -1032 310 958 633 928 1481 1548 1299
6027 1299 1221 -176 262 1122 1987 1955 836 -150 -203 287 740 1357 1536 1141 897 -7 -5 -581 -670 -508 -926
6006 -926 -760 -1232 -757 -999 602 2125 1600 969 305 856 1123 561 -305 -313 -679 -26 221 635 391 431
5986 431 1257 -421 -2117 -1863 -265 231 302 -639 21 6 206 -293 -1076 -312 -257 -33 -127 -314 -984 -2365
5966 -2365 -1723 -1624 -1818 -1115 -300 -427 -168 -1184 -1142 -1124 -1452 -2019 -1336 -389 -478 65 173 -821 -559 -230 -868
5945 -868 -2374 -2069 -822 -602 -636 -1161 -1261 -1149 -1179 -151 -728 -2008 -2488 -2507 -3189 -2580 -1032 -1825 -2565
5926 -2565 -2721 -1978 -726 -419 -481 265 -630 -2475 -2711 -1801 -668 291 1319 2458 2344 1376 927 -704
5908g04l93J27j132J510Q98o71j520l39J656Q55p11p30k8q48M83J815N67l15j069
5889e49o98r58q75M08M55Q78o5Q89N19K35n67K04j08p89r60O14J131R53j321j086
5869a690J31Q90Q67k34j039lj03m19O68J645O05L28k274j073Q1P39O08M41n40
5850c72j447k78j77p81L3k33J174P60R27J153J233r06p30j2m74q65m78r28K99
5831b102M75p12k87J486L42J29L07r00j37L43l25j00l17Q44K72k6L18L47j81J11
5811a13O06O05m91o63M1m9N2j200k05Q42j71k88N72J255M63m47j391j98K85k60
5791g55J061j100j649P98P44l62L5L48n22J185r02j138l78J004K02J23N84L00
5773d22R94q54j394L34P85n56j873K9N83R22l8J280J508r68j350j128M63k45N69
$$ plain form
5908 -704 -1097 -970 -2102 -592 306 -365 -1885 -2224 -568 287 -424 -1154 -1182 -2030 -1547 268 835 520 -549
5889 -549 -1247 -2205 -3080 -2672 -2217 -1339 -1404 -515 4 239 -328 -124 -232 -1021 -1981 -1367 -236 717 -604 -1690
5869 -1690 -1559 -669 198 -36 -1075 -1078 -1181 -1600 -932 713 1318 1646 -628 -1701 -1620 -881 -273 168 -372
5850 -372 -1819 -2097 -2274 -3055 -3022 -3255 -2081 -1321 -394 759 1992 1086 356 344 -130 -995 -1473 -2401 -2102
5831 -2102 -1627 -2339 -2626 -1140 -798 -669 -362 -1262 -1399 -1056 -1381 -1481 -1798 -954 -682 -708 -390 -43 -224 -113
5811 -113 493 1098 607 -56 -15 -64 -12 -1212 -1417 -575 -746 -1034 -462 793 1256 809 -582 -780 -495 -755
5791 -755 306 -794 -2443 -1645 -901 -1263 -1228 -880 -1402 -217 -1119 -2257 -2635 -1631 -1429 -1306 -722 -422
5773 -422 572 -282 -1676 -1342 -557 -1113 -2986 -2957 -2374 -1452 -1490 -210 1298 330 -1020 -2148 -1685 -1930 -1361
5754a361J253p15p11M29N17P36n60o03K43m6M1N0k12k78p14p08Q19J568L01r61
5734i12N31K68l09j91j25K60l58j287o06l03R01P18N01L12M97M62R62q09k60p72
5714e20K47P07J294j90Q8j143o25l77j625l89K8k45O92J415Q70p21j50R63O9k59
5694A29o63n26Q3K38N92l21O43o29j021M23R42k20j88m56l79N06O40r5O11j330
5674a021j557K19O22n59q80J006l74M70N08P64N20m94m80l68P61O88K90K7L1j664
5654a491Q82p69m70lP78R09l57j281n75L72J294p23J97j38J578J519K30L1N4l32
5634A705j439n52j01q04J164O74j110o83J331J24n26n77n38P64P29K13j008J57
5616d77R7r87K62k29q11j173k50J101J75L37J59P81J327R65n06l21j92n40l60
$$ plain form
5754 -1361 -108 -823 -1534 -1105 -588 148 -412 -1015 -772 -818 -777 -727 -939 -1217 -1931 -2639 -1820 -252 49 -912
5734 -912 -381 -113 -422 -613 -738 -478 -836 -2123 -2729 -3032 -2131 -1413 -912 -600 -103 359 1321 512 252 -520
5714 -520 -273 434 1728 1538 1626 483 -142 -519 -2144 -2533 -2505 -2750 -2058 -643 227 -494 -644 319 388 129
5694 129 -534 -1060 -977 -739 -147 -468 175 -454 -1475 -1052 -110 -330 -518 -974 -1353 -847 -207 -302 309 -1021
5674 -1021 -2578 -2359 -1737 -2296 -3176 -2170 -2544 -2074 -1566 -802 -282 -776 -1256 -1624 -863 -175 115 142 173 -1491
5654 -1491 -609 -1378 -1848 -1851 -1073 -164 -521 -1802 -2377 -2005 -711 -1434 -1237 -1375 203 1722 1952 1983 2037 1705
5634 1705 266 -286 -387 -1191 -27 647 -463 -1146 185 309 -217 -794 -1332 -568 161 374 -634 -477
5616 -477 -380 -1367 -1105 -1334 -2145 -3318 -3568 -2467 -2292 -1955 -1796 -1015 312 1277 771 450 258 -282 -642
5597f42J59K87k07L6j50o86n79M03R59q82P60J073j130o25P33J049q01j147O41
5578g49J080P35k98k134P06l31n39L63M06J462N3n40r10N86l25r86j42K87Q56
5559d20n8j01Q9r17R9O64m31J41Q81M45M40k25R8n61m61P43M22N25k703r3N90
5538h33j18J4j32r19L13J561J022j59l81J5M76J88O80j240j839ln01R48K18n19
5518a209q03N70m6n97J176o88j840L9j34O60l12P39J13j67n12J831J52j497M03
5499b122J74L23r00l73R8Q17N65l09J48m0j548p58J209Q78P17k05J276m3K67l90
5479b16O14j55m28j056p16J48k27J053N04N38L15n40j65n58L38J168M96j105p30
5460g22K58m41j724L03J888Q82j54j065q10l72l55L38J520N56o21j8o96j819P73
$$ plain form
5597 -642 -483 -196 -403 -367 -517 -1203 -1782 -1379 -420 -1302 -542 531 -599 -1224 -491 558 -243 -1390 -749
5578 -749 331 1066 768 -1366 -660 -991 -1530 -1167 -761 701 754 214 -696 -110 -435 -1421 -1563 -1276 -420
5559 -420 -478 -579 -490 -1407 -1308 -644 -1075 -934 -53 392 832 607 705 144 -317 426 848 1373 -1330 -1423 -833
5538 -833 -951 -937 -1069 -1988 -1675 -114 908 749 368 383 859 1047 1727 487 -1352 -1355 -1856 -908 -690 -1209
5518 -1209 -2012 -1442 -1488 -2085 -909 -1597 -3437 -3398 -3532 -2872 -3184 -2445 -2332 -2499 -3011 -1180 -1028 -2525 -2122
5499 -2122 -1948 -1625 -2525 -2898 -2800 -1983 -1418 -1727 -1579 -1619 -3167 -3925 -2716 -1838 -1121 -1326 -50 -93 174 -216
5479 -216 398 243 -185 -1241 -1957 -1809 -2036 -983 -479 59 374 -166 -331 -889 -551 617 1113 8 -722
5460 -722 -464 -905 -2629 -2326 -438 444 290 -775 -1585 -1957 -2312 -1974 -454 102 -519 -537 -1233 -3052 -2279
5441b279J715k11j353J359J496j51p48K29O48o23j771M53R14J94l6n91J83j087
5423a659j241J109O00l03l15l53k4q69j52P85J247M22l08n26j9J366n62n5M22
5404d35N35p81p16L25m51J04J603N55l14m43L30k43j587j45P48N30k55m82P88
5385c34Q16o85q1l51l18j459J20J991J454N29j365r07o29N62m9r8m70l41k86J67
5365a734k170l16m26K6J58M33J333N75p11R5j51K4J079l67Q98J587o93p4M75q76
5345h35M0p0l63m85l31j32KL66Q73p98p62N49N90R60Q1o47k21p39L40O98K68m83
5323a099j4J313J361l40j135r08J78k94q32m59l16M93J384M06L13q8k85m37M65
5304b94k88j49O48k17M13J94L30N04m91o96q60P07m23m33P13R70j75Q2L38N5J44
$$ plain form
5441 -2279 -564 -775 -2128 -769 727 576 -172 57 705 82 -1689 -1236 -322 -128 -164 -755 -572 -1659
5423 -1659 -2900 -1791 -1191 -1494 -1809 -2162 -2186 -3055 -3207 -2422 -1175 -753 -1061 -1587 -1606 -240 -802 -857 -435
5404 -435 100 -681 -1397 -1072 -1523 -1419 184 739 425 -18 312 69 -1518 -1663 -915 -385 -640 -1122 -334
5385 -334 482 -203 -284 -635 -953 -2412 -2292 -301 1153 1682 317 -590 -1219 -657 -706 -804 -1274 -1615 -1901 -1734
5365 -1734 -3904 -4220 -4646 -4620 -4462 -4029 -2696 -2121 -2832 -2737 -2888 -2864 -1785 -2152 -1254 333 -360 -434 41 -835
5345 -835 -795 -865 -1228 -1713 -2044 -2176 -2174 -1808 -935 -1733 -2495 -1946 -1356 -396 -315 -962 -1183 -1922 -1582 -884 -616 -1099
5323 -1099 -1113 200 1561 1221 86 -822 -644 -938 -1770 -2229 -2545 -2052 -668 -262 51 -37 -322 -759 -294
5304 -294 -582 -731 -83 -300 113 307 637 1141 650 -46 -906 -199 -622 -1055 -342 628 453 535 873 928 1072
5283A072n85p00M38R08o72k96j141k79N60L6j45n14j221O25K99q6K87Q05R99J04
5263D94O55K38j563l40L49n51L95j0n84l40q31k01O42M00P4N96K37j257k26P84
5243a039m15k47N58J191n93O80K98n21p70M59J388j60l98LL08l27j108R60l08
5224d1l15l3Q50p92q50j859J58K131O60k9k64qk54k46J527J4k133k83Q60J80n67
5203a294k75N70p3M24k22J339O76j165L71K49m96K67n3r91j396M65M25M2N78N11
5183d8q4j207O1N46k79j79P45k22j372J49L46J246J943Lj575p33M85m82R8J37
5163d22O90j43n43L03J150R05l08n39j098r35L71k17l12k60K41k71Q93K81M64
5144B50o30O4J061k75J75j021j187Q88k00o44j5K85j04j8j019o71P38J144R97
$$ plain form
5283 1072 487 -213 225 1133 461 165 -976 -1255 -695 -659 -804 -1318 -2539 -1914 -1615 -1701 -1414 -609 390 494
5263 494 1149 1387 -176 -516 -167 -718 -323 -333 -917 -1257 -2088 -2289 -1647 -1247 -1173 -577 -340 -1597 -1823 -1039
5243 -1039 -1454 -1701 -1143 48 -545 135 433 -88 -858 -399 989 829 431 434 742 415 -693 267 -41
5224 -41 -356 -389 461 -331 -1181 -3040 -2882 -751 -91 -120 -384 -392 -646 -892 635 649 -1484 -1767 -907 -727 -1294
5203 -1294 -1569 -999 -1072 -648 -870 469 1145 -20 351 600 104 371 318 -673 -2069 -1604 -1179 -1137 -559 -48
5183 -48 -132 -1339 -1278 -732 -1011 -1190 -445 -667 -2039 -1890 -1544 -298 1645 1648 73 -660 -175 -657 -559 -422
5163 -422 268 125 -418 -115 1035 1940 1632 1093 -5 -940 -569 -786 -1098 -1358 -1117 -1388 -495 -214 250
5144 250 -380 -316 745 470 645 -376 -1563 -675 -875 -1519 -1534 -1249 -1353 -1371 -2390 -3061 -2323 -1179 -182
5125a82K25k01o31m90r72N4R6M64N16L38Q12L43p78K69j80p93R30L61j031r32
5105a782n4o79Q11kK04l71K05O4L43k74O37m5M47P73Q02j18j022j308r95R42J807
5084C85N43p57q98M14q7l34o07O14k84J55L26j410j3k36R0K13p5J30o98L9J048
5063a442J684l1l96Q75o71o25l87l56n48Q7J075J743j47j100p28n80R8O78K78
5044d93q83L62L58K06O96p19j129p33m52Q64J210M89j81l42o4p16n24J06K17j07
5024a835K14M60M27j40k49q2J059M93k44j50r63M83N82M41k62p64l2K39L85r73
5004i11n65K77K45K68k59j202J92J45m23m10j65J339J635j61j000J98L42O34n43
4985c64m63L38N6q8M0j86n5r7k11J76J34m04m42K64J08o27p83O8Q30R27N9l17
$$ plain form
5125 -182 43 -158 -789 -1279 -2251 -2197 -2101 -1637 -1121 -783 29 372 -406 -137 -317 -1110 -180 181 -850 -1782
5105 -1782 -1836 -2515 -1704 -1706 -1502 -1873 -1668 -1604 -1261 -1535 -898 -943 -496 277 1079 961 -61 -1369 -2364 -1422 385
5084 385 928 171 -727 -313 -400 -734 -1341 -727 -1011 -856 -530 -1940 -1953 -2189 -2099 -1886 -1961 -1831 -2529 -2490 -1442
5063 -1442 242 211 -185 690 19 -606 -993 -1349 -1897 -1810 -735 1008 861 -239 -967 -1547 -1449 -771 -493
5044 -493 -1376 -1014 -656 -450 246 -473 -1602 -2335 -2787 -1923 -713 -224 -405 -747 -811 -1527 -2051 -1945 -1728 -1835
5024 -1835 -1621 -1161 -734 -874 -1123 -1205 -146 347 103 -47 -1010 -527 55 496 234 -530 -562 -323 62 -911
5004 -911 -1476 -1199 -954 -686 -945 -2147 -1955 -1810 -2233 -2643 -2808 -1469 166 5 -995 -797 -455 179 -364
4985 -364 -827 -489 -433 -521 -481 -667 -722 -819 -1030 -854 -720 -1124 -1566 -1302 -1194 -1821 -2604 -2536 -1706 -779 -720 -1037
4963a037P76J94l25L85K09K71k45j672L4O84K65K83J66r29j10P04l07q17K70L9
4943a162L47o13M23j11o83J053J32n15K11L13K19k77R31J362j031o80q75j09J5
4924a050j1l25P41N89N63q91Q94K9j91q04j33p30q74J04n43O5P4l67o00oR65J64
4902b337n79J86J347M25j21k45k8m85p99l46K14O22L53l71j55L84M10r53k8o5
4882b571p42N25J339J099P0Q21K0J13p52j260k19M92j92n64J1N25M27J346N29
4863A017j095K56r00r17l1j97n14l44P52jk83p94k0K16O37J442O04K50J178l35
4843I21j315j425k94l93R14M24P34R39J043l59m97j837q05R32k90O99j38j011
4825a758k32L62Q48M60n37r1J96j24p29J288M81J35p00j07p86r41R92j03j258
$$ plain form
4963 -1037 -261 -67 -392 -7 202 473 228 -1444 -1410 -726 -461 -178 -12 -941 -1051 -347 -654 -1471 -1201 -1162
4943 -1162 -815 -1428 -1005 -1116 -1799 -746 -614 -1129 -918 -605 -386 -663 268 1630 599 -81 -956 -1065 -1050
4924 -1050 -1061 -1386 -645 -56 507 -384 510 539 348 -456 -589 -1319 -2193 -2089 -2632 -2567 -2493 -2860 -3460 -3466 -2501 -2337
4902 -2337 -2916 -2730 -1383 -958 -1079 -1324 -1352 -1837 -2636 -2982 -2768 -2146 -1793 -2164 -2319 -1935 -1525 -2478 -2506 -2571
4882 -2571 -3313 -2788 -1449 -350 -280 541 561 674 -78 -1338 -1557 -1065 -1257 -1821 -1810 -1285 -858 488 1017
4863 1017 -78 178 -722 -1639 -1670 -1867 -2381 -2725 -1973 -1974 -2257 -3051 -3071 -2855 -2218 -776 -172 78 1256 921
4843 921 -394 -1819 -2113 -2506 -1592 -1168 -434 505 1548 1189 692 -1145 -1950 -1018 -1308 -609 -747 -1758
4825 -1758 -1990 -1628 -780 -320 -857 -948 -752 -876 -1605 -317 164 299 -401 -508 -1294 -2235 -1243 -1346 -2604
4806b604K1J51N60j162j221P62J240O45o15Q67k77P33J20q27n05K28N32J60o12
4787a804m38N46N91n51j814Q42l8k41R43K98m80J028M76n30J31L65J7N87R58j36
4767G50q48R7m6j349j41J216P6l6q7q33k89j94L84J19M21j13k72j463J519Q11
4747b78P03Q61m68K66n85n31j115q41j242n62O2J381N41Q90J26o78M33j314J91
4728b160P71O89J84j8l72m15Q92o2n39j84J083L12n02N57m56l37j71J45j094L10
4708a367O22K09K5j10P35P21j158q83Q19n32j79L79n56q82M16k25L50P34j72m02
4688a456j54Q22J86j053j453k0P42J136J277j08r61MN57n36N78J17j015M33n09
4669a413r50Q7Q65L56p87n94j49n67L12m61L11O45o7K95k7j318q41P8J051O53
$$ plain form
4806 -2604 -2583 -2432 -1872 -3034 -4255 -3493 -2253 -1608 -2223 -1356 -1633 -900 -780 -1607 -2112 -1884 -1352 -1192 -1804
4787 -1804 -2242 -1696 -1105 -1656 -3470 -2628 -2666 -2907 -1964 -1666 -2146 -1118 -642 -1172 -1041 -676 -659 -72 886 750
4767 750 -98 -1 -47 -1396 -1537 -321 -245 -281 -368 -1201 -1490 -1684 -1300 -1181 -760 -873 -1145 -2608 -1089 -278
4747 -278 425 1286 818 1084 499 -32 -1147 -1988 -3230 -3792 -3730 -2349 -1808 -918 -792 -1470 -1037 -2351 -2160
4728 -2160 -1389 -700 -516 -534 -906 -1321 -429 -491 -1030 -1214 -131 181 -321 236 -220 -557 -728 -583 -1677 -1367
4708 -1367 -745 -536 -511 -621 114 835 -323 -1206 -387 -919 -1098 -719 -1275 -2157 -1741 -1966 -1616 -882 -1054 -1456
4688 -1456 -1610 -788 -602 -1655 -3108 -3128 -2386 -1250 27 -81 -1042 -1038 -481 -1017 -439 -322 -1337 -904 -1413
4669 -1413 -2363 -2276 -1411 -1055 -1842 -2436 -2585 -3152 -2840 -3301 -2990 -2345 -2412 -2117 -2144 -3462 -4303 -4225 -3174 -2521
4649b521j361j7K66L10O13P50P13J39N84Q0j3j84M45q2j28r35q7J83j430n42J
4628c216K061O29l9r79L82oj414n60N23j69n7L72J337k16K07o18r38N14L92jj69
4607a965L54j68l82l3L95q93L47m69j597J521J048K83o38n60L86m82l40J501P45
4588i47K72l70n98k96L67J634O00k5l52j281r89k4Q13P73K81j702m46m40n15k56
4568c501m69L0M39J778J485pN50l57j669j54K04J671k11j599k68K74Q46K3r58
4549a893q01N02L53N22M30O17j94M60J094R43p83m20j62j45r59q09O40O00K05
4530B00J313M35r36r32M63J34n22k5r22j143n9R74J06k12l17RO84M33n60M7j358
4509b188m67P54R84N56j85P1N24n32K54K45o49p84j167o96P17J316Q30k0l36p50
$$ plain form
4649 -2521 -3882 -3899 -3633 -3323 -2710 -1960 -1247 -1108 -524 -444 -457 -641 -196 -278 -406 -1341 -1428 -1245 -2675 -3217 -3216
4628 -3216 -1155 -526 -565 -1544 -1162 -1168 -2582 -3142 -2619 -2788 -2845 -2473 -1136 -1352 -1145 -1763 -2701 -2187 -1795 -1796 -1965
4607 -1965 -1611 -1779 -2161 -2194 -1799 -2692 -2345 -2814 -4411 -2890 -1842 -1559 -2197 -2757 -2371 -2853 -3193 -1692 -947
4588 -947 -675 -1045 -1643 -1939 -1572 62 662 637 285 -996 -1985 -2009 -1196 -423 -142 -1844 -2290 -2730 -3245 -3501
4568 -3501 -3970 -3940 -3501 -1723 -238 -245 305 -52 -1721 -1875 -1671 0 -211 -1810 -2078 -1804 -958 -935 -1893
4549 -1893 -2694 -2192 -1839 -1317 -887 -270 -464 -4 1090 2033 1250 830 668 523 -436 -1245 -605 -5 200
4530 200 1513 1948 1012 80 543 677 155 130 -792 -1935 -1994 -1020 -914 -1126 -1443 -1434 -750 -317 -877 -830 -2188
4509 -2188 -2655 -1901 -917 -361 -546 -475 49 -483 -229 16 -633 -1417 -2584 -3280 -2563 -1247 -417 -437 -773 -1523
4489a523o18M51j3j200j97M40P60P34M74p96p7J01l86m30P56O37J205j693P7l38
4469a636m07J085L02n25M56Mj334L0J14O31q20r18j46P19P35R64O38j036n17M94
4449a167q8J099l44j562m73L84O20K26m17j16j000j07J150J092M08K96j58l30
4431d87p19j27P32o9J460P26l29j018n67P00L73r07n88l99L09M83J7Q07k31o21
4411d55J15k33j24J35j43J62q98j098j03O79J811J142J31p98q01n99K51k35j017
4392b078j307K7J008L92M65M87J24j76p88J64J457j25n21r19j138k40J052N55
4374a561K36J489l83o06r94K06K04m28j10Q33k37P19o29N54M46k6p78r99J320
4355g44q72j799q5J147J071J192l68j86p08k86J536K68p88k74Q0J575J084j483
$$ plain form
4489 -1523 -2141 -1690 -1703 -2903 -3100 -2660 -1900 -1166 -692 -1488 -1565 -1464 -1850 -2280 -1524 -887 318 -1375 -1298 -1636
4469 -1636 -2043 -958 -656 -1181 -725 -721 -2055 -2025 -1911 -1280 -2100 -3018 -3164 -2445 -1710 -746 -108 -1144 -1661 -1167
4449 -1167 -1255 -156 -500 -2062 -2535 -2151 -1531 -1305 -1722 -1838 -2838 -2945 -1795 -703 -295 1 -157 -487
4431 -487 -1206 -1333 -601 -670 790 1516 1187 169 -398 302 675 -232 -820 -1219 -910 -427 -410 397 166 -455
4411 -455 -340 -573 -697 -562 -705 -543 -1441 -2539 -2642 -1963 -152 990 1121 323 -478 -1077 -826 -1061 -2078
4392 -2078 -3385 -3358 -2350 -1958 -1493 -1006 -882 -1058 -1846 -1682 -225 -350 -871 -1790 -2928 -3168 -2116 -1561
4374 -1561 -1325 164 -219 -825 -1819 -1613 -1409 -1837 -1947 -1114 -1351 -632 -1261 -707 -261 -287 -1065 -2064 -744
4355 -744 -1616 -3415 -3500 -2353 -1282 -90 -458 -644 -1352 -1638 -102 166 -622 -896 -816 759 1843 360
4337C60j272J46L81J697P17q46j393j245q84q65Q86P55q64J54l01P54p81j87M41
4318b347J70k72l99O19J324J37L78P81k00j026J4J511NJ5p66N1o21j193l7N91
4298a265N51l6L4n07K82r4M92L0p5J08J267J6n22L31j151k57n34l11k46l10j319
4277c516J211M21n67l48M93K95j320R05K36J04J299J124l68j085j237q38K60J162
4259a769J42l0L12l38N5N04J386k64j125k01J056l06J061m47q71j050M83o80M08
4240a674N99P52J73j176j72N96R03o20o2J205P23j105o77L01J32j280K52Q80l15
4221e65p43N22J86k75r02o9O50R97R89J50N86L37j651j454K30n9R4M11J43L04
4201a19L29n77m49n95r63M58R29k3J758P43k83j046n75j047k47J212K37q80M31
$$ plain form
4337 360 -912 -766 -385 1312 2029 1183 -210 -1455 -2339 -3204 -2318 -1563 -2427 -2273 -2574 -1820 -2601 -2788 -2347
4318 -2347 -2177 -2449 -2848 -2229 -905 -768 -390 391 191 -835 -821 690 695 710 -56 -5 -626 -1819 -1856 -1265
4298 -1265 -714 -750 -716 -1223 -941 -1035 -543 -513 -588 -480 787 803 281 612 -539 -796 -1330 -1641 -1887 -2197 -3516
4277 -3516 -2305 -1884 -2451 -2799 -2306 -2011 -3331 -2426 -2190 -2086 -787 337 -31 -1116 -2353 -3191 -2931 -1769
4259 -1769 -1627 -1657 -1345 -1683 -1628 -1124 262 -2 -1127 -1328 -272 -578 483 36 -835 -1885 -1402 -2082 -1674
4240 -1674 -1075 -323 -150 -1326 -1498 -902 1 -619 -681 524 1247 142 -535 -234 -102 -1382 -1130 -250 -565
4221 -565 -1308 -786 -600 -875 -1777 -1846 -1196 -199 790 940 1526 1863 212 -1242 -1012 -1071 -977 -566 -423 -119
4201 -119 210 -367 -816 -1411 -2374 -1916 -987 -1010 748 1491 1208 162 -413 -1460 -1707 -495 -258 -1138 -707
4182g07Q46Q53p06n37K77K13k05j38J57m33n83k53J558q91j264j4R35L07o6n73
4162a224l50M81Q82m73o97J33J50M06o87K41J565J595o41j388n23L5k2o80q16
4143b013J288R15j75l46J367j55j500j160K60J455q97p69N88J22K10p3M66R9J27
4124a91m16o56j9L06j49J70P31j185K8J223O30k31n46l51n03n96K39P49k18m04
4104a389m76j46Q8M89J174M8p4J34L10M10m01m96O40J74m86O1q32j7P55M22L41
4083G29l79j82m63J97J440k53k25j354j070Q36p60j462M20Q69J28J86j47O39Q88
4064C7K388J895j477j454k64j3J71r2N4n43j47L51q37n50J0q10K5N11P23l73M
4043c91r9l4L37n80j407j48M35P17P06M05J297j45j320k92Q35j13o67l71L5O09
$$ plain form
4182 -707 139 992 286 -251 26 239 34 -104 53 -380 -963 -1216 342 -549 -1813 -1827 -892 -585 -651 -1224
4162 -1224 -1574 -1093 -211 -684 -1381 -1248 -1098 -692 -1379 -1138 427 2022 1381 -7 -530 -495 -517 -1197 -2013
4143 -2013 -725 190 15 -331 1036 881 -619 -1779 -1519 -64 -961 -1730 -1142 -1020 -810 -883 -417 -318 -191
4124 -191 -607 -1263 -1282 -976 -1125 -955 -224 -1409 -1381 -158 472 241 -305 -656 -1159 -1755 -1516 -767 -985 -1389
4104 -1389 -1865 -2011 -1923 -1434 -260 -212 -286 -152 158 568 167 -329 311 485 -1 60 -772 -789 -34 388 729
4083 729 350 168 -295 -98 1342 1089 864 -490 -1560 -724 -1484 -2946 -2526 -1657 -1529 -1343 -1490 -851 37
4064 37 2425 4320 2843 1389 1125 1112 1283 1191 1245 702 555 906 69 -481 -471 -1281 -1256 -745 -22 -395 -391
4043 -391 -490 -524 -187 -767 -2174 -2322 -1887 -1170 -464 -59 1238 1093 -227 -519 316 203 -464 -835 -800 -191
4023a91O61j77n02k26l14p86K77m45j27J660O58o01j022l23K75K99O02K72n44
4004e54p35j84j29r03m91R24P41K57N02l49j593p7j6l47J173m62r28M11N18jL77
3983a866J03r76J311M08N4P99L65n13o25j591n26J65J038M15k09R05r92j0k31
3964a976l11M58K4P91P52M3j14p73n67P7k37J028P18k07K6l46n95k02J33R89K90
3943AL42K47j989K48K99M18j56o46l55n72L49J673L22R58n62k02l28r0k2p32q79
3922a676j19J27r0P30m45o38K77L45J271J89N50Q64l02j523r12M74k8N71J32q86
3902a089o77N90P04P95r64j477k37J609j40n77l11N92J557J2j076o63M24p19N7
3883a590P61L97o3p87J65M00J141J59n14K48o32q82p21J060Q79k73m5j280M57
$$ plain form
4023 -191 470 293 -209 -435 -749 -1535 -1258 -1703 -1830 -170 488 -113 -1135 -1458 -1183 -884 -282 -10 -554
4004 -554 -1289 -1473 -1602 -2505 -2996 -2072 -1331 -1074 -572 -921 -2514 -2591 -2607 -2954 -1781 -2243 -3171 -2760 -2242 -2243 -1866
3983 -1866 -1763 -2739 -1428 -1020 -966 -167 198 -315 -940 -2531 -3057 -2892 -1854 -1439 -1648 -743 -1735 -1745 -1976
3964 -1976 -2287 -1829 -1805 -1014 -262 -219 -333 -1106 -1673 -1596 -1833 -805 -87 -294 -268 -614 -1209 -1411 -1278 -289 1
3943 1 343 590 -1399 -1151 -852 -434 -590 -1236 -1591 -2163 -1814 -141 181 1139 577 375 47 -43 -65 -797 -1676
3922 -1676 -1795 -1668 -1758 -1028 -1473 -2111 -1834 -1489 -218 -29 521 1385 1083 -440 -1352 -878 -906 -335 -203 -1089
3902 -1089 -1766 -1176 -472 323 -641 -2118 -2355 -746 -886 -1463 -1774 -1182 375 387 -689 -1352 -928 -1647 -1590
3883 -1590 -829 -432 -495 -1282 -1117 -717 424 583 69 317 -315 -1197 -1918 -858 21 -252 -297 -1577 -1120
3864a120K87q76J158J441q88k56j58o07m21q44J626K86K86J62J83L91N02k61o56
3845B35o93m81k90L4K61K97n34j85R52N17n41R0K85J74k85K5o40O05j189P8m0
3824a325K63J067K31J60r18K4L05J152N7j659K52K1J37M12N13p27p49J16J13J76
3804c79J22k8p96j352L80p4p95N30Q42R68l44k86j00L37q79l10R39R78K31r3N16
3783D07j83k42J24k1m15m94K24r26O94J61P76K45m01o17m62Q27N44J440n0j241
3763C90m17J72O95K17J58Q39J505q08j236K27r13q98r59lJ162L35q92K2p0R53
3743D79K85J04o96O03q30q46M52Q38J570j500j052M69m10o02R55N15K14J36r33
3724b49o37j95o1n29k82q31j57O08J477L42m51j559R59J030N63o36o69l87P66
$$ plain form
3864 -1120 -833 -1709 -551 890 2 -254 -412 -1019 -1440 -2284 -658 -372 -86 76 259 650 1152 891 235
3845 235 -458 -939 -1229 -1195 -934 -637 -1171 -1356 -404 113 -428 -338 -53 121 -164 -139 -779 -174 -1363 -1285 -1325
3824 -1325 -1062 5 236 396 -522 -498 -193 959 1016 -643 -391 -370 -233 179 692 -35 -784 -668 -555 -379
3804 -379 -257 -285 -1081 -2433 -2053 -2127 -2922 -2392 -1550 -582 -926 -1212 -1312 -975 -1854 -2164 -1225 -247 -16 -109 407
3783 407 224 -18 106 85 -330 -824 -600 -1526 -832 -671 105 350 -51 -668 -1130 -303 241 1681 1631 390
3763 390 -27 145 840 1057 1215 2054 3559 2751 1515 1742 829 -69 -1028 -1031 131 466 -426 -404 -474 479
3743 479 764 868 172 775 -55 -901 -449 389 1959 459 -593 -124 -534 -1136 -181 334 548 684 -249
3724 -249 -886 -1081 -1142 -1671 -1953 -2784 -2941 -2333 -856 -514 -965 -2524 -1565 -535 28 -608 -1277 -1664 -898
3705h98n84M22J064J99q21K89K4j264j00J958Q11N57M13m11l96j64j321j685p1
3686a978J20j61L04l76l88P31Q46K7N56k02j58m00J71J296Q6q72p70R16Q35j70
3666D13P33O95N5n88o94p92j195j677l63R18J621M9m75L24J150K06k05m47n91
3647h63r10K06J323J332k60l69q90m07N4Q8J21p8n45j374m32P28P23M36p42J19
3627a740J473J286k39N53n73j551m58O21k48n9j34r42O01O89L4k29l82p26Q67
3608a157J98N46n30j079L93L16M3j30p95K27K85L57J99l16j010Q36M04J227l09
3589b95n85K94N44K32p81m93N10L88r23r15R42O93k6P72q0j014r81M50j17n1Q07
3568f29qK80j16p38p25J51k77O52J147O63p95o97j99N51r91n02M29N42J118k97
$$ plain form
3705 -898 -1482 -1060 4 203 -618 -329 -305 -1569 -1669 289 1100 1657 2070 1659 1263 1099 -222 -1907 -1978
3686 -1978 -1858 -2019 -1715 -2091 -2479 -1748 -902 -875 -319 -521 -679 -1079 -908 388 474 -398 -1168 -252 583 413
3666 413 1146 1841 1896 1308 614 -178 -1373 -3050 -3413 -2495 -874 -825 -1300 -976 174 380 175 -272 -863
3647 -863 -1773 -1567 -244 1088 828 459 -431 -838 -784 -696 -575 -653 -1198 -2572 -3004 -2276 -1553 -1117 -1859 -1740
3627 -1740 -267 1019 780 1333 760 -791 -1249 -628 -876 -935 -1069 -2011 -1410 -721 -687 -916 -1298 -2024 -1157
3608 -1157 -959 -413 -943 -2022 -1629 -1313 -1270 -1400 -2195 -1968 -1683 -1326 -1127 -1443 -2453 -1617 -1213 14 -295
3589 -295 -880 -586 -42 190 -591 -1084 -574 -186 -1109 -2024 -1082 -389 -415 357 277 -737 -1718 -1268 -1385 -1436 -629
3568 -629 -637 -357 -473 -1211 -1936 -1785 -2062 -1410 -263 400 -395 -1092 -1291 -740 -1731 -2233 -1804 -1262 -144 -441
3548d41o5r62l64M88P36Q49q23j321q14j110M30R58R48o47n12K50P83l54q21P13
3528b079J612O56m48Q5j345j370j340j226N84K404J425R28k31j5o90K29l19o12
3510a752L02M85m77Q0L94k97N89L56n6O84K8p25Q97J355l64l80m33k49J105l34
3490A208j654m85j045K61j80K92J362O13q89k42m41m6R46j67m36j69L69L46N08
3471A51n71m75J9l51m32K07l95M81k56P63L60o22K69K7J94L89On26M82J71j160
3450a269p38K37n20m67J88j25L91O93M72R01p47l8J118r23k50L09Q31P11k69l37
3430A68K20j100m87P66J26R78K85j54K71j337r12l13K53j095o8R80P91k46l48
3411a222M62N5m40j305K99J811J264l80k46J83j246J21N08J408j04N03p48j130
$$ plain form
3548 -441 -506 -1468 -1832 -1344 -608 241 -582 -1903 -2717 -3827 -3397 -2439 -1491 -2138 -2650 -2400 -1617 -1971 -2792 -2079
3528 -2079 -467 189 -259 -174 -1519 -2889 -4229 -5455 -4871 -2467 -1042 -114 -345 -360 -1050 -821 -1140 -1752
3510 -1752 -1450 -965 -1442 -1362 -968 -1265 -676 -320 -376 308 336 -389 508 1863 1499 1119 686 437 1542 1208
3490 1208 -446 -931 -1976 -1715 -1895 -1603 -241 372 -517 -759 -1200 -1246 -300 -467 -903 -1072 -703 -357 151
3471 151 -420 -895 -876 -1227 -1659 -1452 -1847 -1366 -1622 -859 -499 -1121 -852 -825 -631 -242 -236 -762 -280 -109 -1269
3450 -1269 -2007 -1770 -2290 -2757 -2569 -2694 -2303 -1610 -1138 -237 -984 -1022 96 -827 -1077 -768 63 774 505 168
3430 168 388 -712 -1199 -433 -307 671 956 802 1073 -264 -1176 -1489 -1236 -2331 -2399 -1419 -628 -874 -1222
3411 -1222 -760 -705 -1145 -2450 -2151 -340 924 544 298 481 -765 -644 -136 1272 1168 1671 923 -207
3393b07K27j012r84J98m78Q53J069R15R28p85k75o24Q10K18n38m55Q0M48o98r32
3373a242N16M76j092j298J416L52K74L94n59k28J634L74k52J64M22r86j124j186
3355a945M78m53R63M71J05N55Q16l48j643n89n12k40O00J201k49j8Q53o82O37
3336@N85j349n79J285P65J51o38j482p21N49k21l52O88J285J059r8O78J17K14
3317A936K93l84p87n52q9R9M62k93p53O59n59j297q43L18Q5J157J294N67j483
3298a70l91K49P22p74o37J55L0R6J118k7r74J46L40m97n34j083n3J67K42K02J676
3277Cj04Q52L68q48j486Q89P84l50j380r95J086J210j73p34K98J149J92k62j052
3258e53k64J052r9N17K13j067p37o13k1J263q9n12k49K33k17j416R92J059o94
$$ plain form
3393 -207 20 -992 -1976 -1778 -2256 -1403 -334 581 1509 724 449 -175 635 853 315 -140 -60 388 -310 -1242
3373 -1242 -726 -250 -1342 -2640 -1224 -872 -598 -204 -763 -991 643 1017 765 929 1351 365 -759 -1945
3355 -1945 -1467 -1920 -957 -486 -381 174 990 642 -1001 -1590 -2102 -2342 -1742 -541 -790 -808 45 -637 0
3336 0 585 -764 -1343 -58 707 858 220 -1262 -1983 -1434 -1655 -2007 -1319 -34 1025 927 1605 1722 1936
3317 1936 2229 1845 1058 506 417 516 978 685 -68 591 32 -1265 -2108 -1790 -1705 -548 746 1313 -170
3298 -170 -561 -312 410 -364 -1001 -846 -816 -720 398 371 -603 -457 -117 -614 -1148 -2231 -2284 -2117 -1875 -1673 3
3277 3 -101 751 1119 271 -1215 -326 458 108 -1272 -2267 -1181 29 -144 -878 -580 569 761 499 -553
3258 -553 -817 235 136 653 866 -201 -938 -1551 -1572 -309 -398 -910 -1159 -926 -1143 -2559 -1567 -508 -1202
3239a202Q43M55K82J8p61n95j173P58J539M83n91l38k98k16J027R55m74o48L62
3220D26K05p05k49N93P52l81j358N13m03r32J21O67n52k80p43NJ568J134p57k40
3200f16Q53j8J27O17j96k60l24j38N63P91p83q73k40k84nk03Q2N13n40j59J57
3179i36J09O78n4J13N12N33k29r87j77J454J220n96j765o49J54j091k12J278r0
3160g35l1O8q2O23J067J01l58j26k5n48j143l92Q68J98r9j77l41J47Q07K51r45
3139h72j7QO70J303j143j179J82O77J11k23M22k0l47P01K76m66J50p95r67L18
3119a211J689J20o77k28J88O51o2m91k60k01M13m89q46J067J72o56P93N22N8j140
3099e88m22j153M5O66P05J037K3K42O94J66N26p07j519k91n52M78J215P27p54
$$ plain form
3239 -1202 -359 96 378 396 -365 -960 -2133 -1375 164 647 56 -282 -580 -796 231 1186 712 64 426
3220 426 631 -74 -323 270 1022 641 -717 -204 -607 -1539 -1418 -751 -1303 -1583 -2326 -2321 -753 381 -376 -616
3200 -616 237 219 346 963 767 507 183 45 608 1399 616 -257 -497 -781 -786 -989 -907 -394 -934 -1093 -936
3179 -936 -827 -149 -203 -90 422 955 726 -261 -438 1016 2236 1640 -125 -774 -620 -1711 -1923 -645 -735
3160 -735 -766 -698 -780 -157 910 1011 653 527 502 -46 -1189 -1581 -713 -515 -614 -791 -1132 -985 -178 73 -872
3139 -872 -889 -881 -211 1092 -51 -1230 -1048 -371 -260 -483 -61 -81 -428 273 549 83 233 -562 -1529 -1211
3119 -1211 478 598 -79 -307 -119 532 470 -21 -281 -482 -69 -558 -1404 -337 -165 -821 -28 494 552 -588
3099 -588 -1010 -2163 -2118 -1452 -747 290 313 555 1249 1415 1941 1234 -285 -576 -1128 -650 565 1292 538
3080E38j265J24l99L91J092p61p38m01j8R13j25L56N74P23o75j51J98m59J47K34
3060B98K7q70n45P0p90k21j93Q07L39K11N7O6L63j89J53N55M6o35p91P0R08k28
3038d92o63m93q45L13K005P75r11j39q6m14n15P66j235l26J96Q32J45O70P68m91
3018a40K69O35N74j744n78r3j23Q94R8p24P13m32K54j25KJ195p20l72m77N52n56
2997h98m64p44J556m2j039O95J679q68k53q51k210l03P06L77N90J346Q65k79J47
2978A0p14n33k17K91R03J265o9j702Q56M91Oj345K34M0m58M98J105J52N8M91j31
2957A231q46j4O09K14p69j610l22k72n29K19l09Q29J274l61m6J667K96o75j196
2938f10J67P20j196r55N80j04j473n99L67N49J849q23J33j91j07J83L22J25P92
$$ plain form
3080 538 -727 -603 -1002 -611 481 -280 -1018 -1419 -1437 -524 -649 -293 281 1004 329 178 376 -83 64 298
3060 298 325 -545 -1090 -1020 -1810 -2031 -2224 -1417 -1078 -867 -810 -744 -381 -570 -417 138 184 -451 -1242 -1172 -264 -492
3038 -492 -1155 -1648 -2493 -2180 -175 600 -311 -450 -536 -950 -1465 -699 -1934 -2260 -2064 -1232 -1087 -417 351 -140
3018 -140 129 764 1338 -406 -984 -1077 -1200 -306 -208 -932 -219 -651 -397 -522 -520 675 -45 -417 -894 -342 -898
2997 -898 -1362 -2106 -550 -592 -1631 -936 743 -125 -378 -1229 -3439 -3742 -3036 -2659 -2069 -723 142 -137 10
2978 10 -704 -1237 -1454 -1163 -260 1005 936 -766 90 581 587 -758 -524 -484 -942 -444 661 813 871 1362 1231
2957 1231 385 371 980 1194 425 -1185 -1507 -1779 -2308 -2089 -2398 -1569 -295 -656 -702 965 1261 586 -610
2938 -610 -443 277 -919 -1874 -1294 -1398 -2871 -3470 -3103 -2554 -705 -1528 -1395 -1586 -1693 -1510 -1188 -1063 -271
2919b71j70k98N40K4j078R22J047J81k72q98p2Q8j128l53M69l64Q57N64j681L78
2899a515J17J930o76j161L0J022K04L66J048j397k88p4l16L91P15K87l39R18M55
2880A717m45j52P26N27r30q15L06k09r29r93j119J96N31k34r17k51L58P82J14
2861a737l35K71J131J375J022n09N0j90K88j150j319q10M22J388Q56j508l27O84
2843c98J87j28n91K48l72L45J560p84n49n20O80P17P21k66m71j85p65o78j58P05
2823g02m38R07J68l88J07k27k76J20P15l36p0k98o85N76n39j078p22J90J736P19
2803e21N77j78r81N47O8J14J051o05O45K73n57k02o85P75K29k59o01J24m34j109
2783a729q19J076J233O24q55j87o7J47o12l36k36L9P18M87L42M06J85J50K9l28
$$ plain form
2919 -271 -441 -739 -199 -175 -1253 -331 716 897 625 -273 -345 -257 -1385 -1738 -1269 -1633 -776 -212 -1893 -1515
2899 -1515 -1398 532 -144 -1305 -1275 -253 -49 317 1365 -32 -320 -394 -710 -319 396 683 344 1262 1717
2880 1717 1272 1120 1846 2373 1443 628 934 725 -204 -1197 -2316 -2120 -1589 -1823 -2740 -2991 -2633 -1851 -1737
2861 -1737 -2072 -1801 -670 705 1727 1218 1268 1078 1366 216 -1103 -1913 -1491 -103 753 -755 -1082 -398
2843 -398 -211 -339 -930 -682 -1054 -709 851 67 -482 -1002 -322 395 1116 850 379 194 -571 -1249 -1407 -702
2823 -702 -1140 -233 -65 -453 -346 -573 -849 -729 -14 -350 -420 -718 -1403 -827 -1366 -2444 -3166 -2976 -1240 -521
2803 -521 56 -122 -1103 -556 -488 -374 677 72 717 990 433 231 -454 321 550 291 -310 -186 -620 -1729
2783 -1729 -2548 -1472 -239 385 -470 -657 -724 -577 -1189 -1525 -1761 -1722 -1004 -517 -175 231 416 566 595 267
2763B67p44k1L9O25O37k44Nj227j283Q2P68o23M55N05J4j52J45L58L2n01Q23J18
2741G8m14j011J9O83k46j54o58N96M89K98Q38o08r68p67p53QJ643N93L93m42K47
2720a36L3q39L98L87J408m54p70q23J08L36r71L55J377n6j586J74J410k80m80
2701d09q46M90J581j18k71o65l71O31O87j08p32r44l26K58J578J143p37j622p7
2682h58K63Q61k06O20O29m12N84P60M06M4n93r15L86l1P7n71n8K19N20R1O14j209
2660A221j341J019J17n97P76J30J15r81k66K89l18m55M55J33k047j043J373L69
2642a051j513k99K27K15P98j21l35O02o86J419K98J46M63J752j040J29R5j614
2624e15k63M95K045P09j582o52k44J29kL22o55j122k8K88k71l81J646M05N01r37
$$ plain form
2763 267 -477 -498 -459 166 803 559 564 -663 -1946 -1864 -1096 -1719 -1264 -759 -745 -897 -752 -394 -362 -863 -40 78
2741 78 -336 -1347 -1328 -645 -891 -1045 -1703 -1107 -618 -320 518 -90 -1058 -1825 -2578 -2570 -927 -334 59 -383 -136
2720 -136 -103 -942 -544 -157 1251 797 27 -796 -688 -352 -1323 -968 409 353 -1233 -1059 351 71 -409
2701 -409 -1255 -765 816 698 427 -238 -609 22 709 601 -131 -1075 -1401 -1143 435 1578 841 -781 -858
2682 -858 -595 266 60 680 1309 897 1481 2241 2647 2691 2098 1183 1569 1538 1615 1044 986 1205 1725 1816 2430 1221
2660 1221 -120 899 1016 419 1195 1325 1440 459 193 482 164 -291 164 297 -1750 -2793 -1420 -1051
2642 -1051 -2564 -2863 -2636 -2421 -1623 -1744 -2079 -1477 -2163 -744 -446 -300 163 1915 875 1004 1099 -515
2624 -515 -778 -283 1762 2471 889 237 -7 122 120 442 -213 -1335 -1363 -1075 -1346 -1727 -81 324 825 -112
2604a12q0L48M48o9j037M05r98m71O38L33O04J166L81N97j589r83L5l5l89m3j66
2583a017J342L34M18M76R71o47j046l90r44L64Q3L0j74M49O16J116jj025k46J170
2563A879k07q16J04m11j35L6K47O63l18n16p67l4M09N21J282q10j480l55n90l05
2543a603J065J260Q04j70n07k09L35m2j78J71j277k8J80O3j12j313p44j09R08
2524a506J320J405N46q58J92q29K93L25J93j3O8M08o37j234P4R40m65k62L0l67
2504c77J79j43q08n81R52P26J28m64M05j20K49K29M11l54R8j183m16J168K5q85
2484g61kJ88k34J42N76r93q06p13M66P50M68k63m16J051N80K29J236R89q58l29
2464A300M59P16j90r23k20k14P68o3j345n28P8L78Q56l81k62O97K11r54M46O58
$$ plain form
2604 -112 -192 156 604 535 -502 -97 -1095 -1566 -928 -595 9 1175 1556 2153 564 -419 -384 -419 -808 -851 -1017
2583 -1017 325 659 1077 1553 2524 1877 831 441 -503 -139 -56 -26 -200 249 865 1981 1980 955 709 1879
2563 1879 1672 856 960 549 414 450 697 1360 1042 526 -241 -275 134 655 1937 1127 -353 -708 -1298 -1603
2543 -1603 -538 722 1526 1356 849 640 975 933 755 926 -351 -379 -199 -136 -248 -1561 -2305 -2414 -1506
2524 -1506 -186 1219 1765 907 1099 270 563 888 1081 1068 1136 1544 907 -327 -253 687 222 -40 -10 -377
2504 -377 -198 -341 -1149 -1730 -778 -52 76 -388 17 -103 146 375 786 432 530 -653 -1069 99 124 -761
2484 -761 -763 -575 -809 -667 -91 -1084 -1890 -2603 -2137 -1387 -919 -1182 -1598 -547 33 262 1498 2487 1629 1300
2464 1300 1759 2475 2285 1362 1142 928 1696 1633 288 -240 -162 216 1072 691 429 1126 1337 383 829 1487
2444A487j03r12l85K11m33k35k54o48n9q6N5O81J26j28p90m46k84N30J082k11
2424h02j783L30J69J64J81n99Q09Q27J332m6j33M3m92j074j223j49O07O29K71
2405i39P00M78K58k90l0J6K17J59R55j1p04m68Q77o94n48r59l40M02J199o62M45
2384F1R7k33j00l01j43N83J318m95j341M61L4N78J37r84j324m52p6J392M56K66
2364f6m21l66p37O36M49O0M02M54O34l94q74k15Q64J099O97j965j008m32n28N03
2344a208N1Q42o40p93O58P40Q46N04l69o44l42j9J8L77J072P71o55J8J105l90
2324A942j987P3P15k02Kn7r4j114k07L08O42N59N00m27p59P40K36r95j275P12
2304f88P73N18M95j278p10J127N78P74n34r05k73Q33k56M29Q46j6j566Q42J89
$$ plain form
2444 1487 1384 472 87 298 -135 -370 -624 -1272 -1331 -1417 -1362 -681 -555 -683 -1473 -1919 -2203 -1673 -591 -802
2424 -802 -2585 -2255 -2086 -1922 -1741 -2340 -1531 -704 628 582 449 492 0 -1074 -2297 -2446 -1839 -1210 -939
2405 -939 -239 239 497 207 177 193 410 569 1524 1513 809 341 1218 524 -24 -983 -1323 -921 278 -384 61
2384 61 158 -75 -175 -476 -619 -36 1282 787 -554 -93 -59 519 656 -328 -1652 -2104 -2180 -788 -332 -66
2364 -66 -487 -853 -1590 -954 -505 -445 -43 411 1045 651 -223 -438 426 1525 2222 257 -751 -1183 -1711 -1208
2344 -1208 -1157 -315 -955 -1748 -1090 -350 496 1000 631 -13 -355 -374 -356 21 1093 1864 1209 1227 2332 1942
2324 1942 -45 28 743 541 543 486 392 -722 -929 -621 21 580 1080 653 -106 634 870 -125 -1400 -688
2304 -688 85 603 1098 -180 -890 237 815 1589 1055 150 -123 710 454 883 1729 1713 147 989 1178
2285A178j171l86k2j37j31O86j35O19J083J434j147l43m1o67r02k96j198J661
2267H5J218O07n79m85p45J035M14N71j96j395r97P52M52q80o26L40l34M94o03
2248h72j590m38K91M21P66O77L31K10K32J78j80K77P19j7j202L70m49p44P0J952
2228A002J45J004j092p66K42P34N65n34j467j124J04M01K82P86J91K3M74J048
2210B018J072o96k070j400L82M05o58o8J505K79J54K09m97R39j06j526n33k73
2192h64k34N57jj41O78m62P46M50o59J028M01o52j23j55k23k03R82j75o59j267
2172i76k96J08k30J223J86K2n99M00J9j797n22J40L47j90k94N0Q18J676J226p
2152A304J32Q28R1K82j083j12R37M19j531j683j055o20M33N56O19L81r0n12j32
$$ plain form
2285 1178 7 -379 -401 -538 -669 17 -118 501 1584 3018 1871 1528 1487 820 -82 -378 -1576 85
2267 85 1303 1910 1331 846 101 1136 1550 2121 1925 530 -467 285 737 -143 -769 -429 -763 -269 -872
2248 -872 -2462 -2900 -2609 -2188 -1422 -745 -414 -204 28 206 26 303 1022 1005 -197 173 -276 -1020 -950 1002
2228 1002 1147 2151 1059 293 535 1269 1834 1300 -167 -1291 -1187 -786 -504 282 473 496 970 2018
2210 2018 3090 2394 324 -1076 -694 -289 -947 -1015 490 769 923 1132 635 1574 1468 -58 -591 -864
2192 -864 -1098 -541 -542 -683 -5 -467 279 729 70 1098 1499 847 724 569 346 143 1125 950 291 -976
2172 -976 -1272 -1164 -1394 -171 15 37 -562 -162 -143 -1940 -2462 -2322 -1975 -2165 -2459 -2409 -1591 85 1311 1304
2152 1304 1436 2264 2355 2637 1554 1442 2379 2798 1267 -416 -1471 -2091 -1658 -1102 -483 -102 -192 -704 -836
2133h36q98l78J259J251k39R14J068p73j199j085l4L84J097N6k6p2m76O99K45
2114I57NL76j3j53n22l38L13k92k96K49l34J19j080q96P21N65N13k18n93m60P3
2093a304J039J055o63O32Q87o47m98L40J69m60j048k14N23R45M20o31j75m37l25
2074c92M9m66j15k36L65P25L33j266j19P85J038j129j475j67k44K42Q61R01N65
2055B55Q74M80J57J508l30m28k065J69L19n56k81o14j19pJ057l66j009r3R36P30
2035F17M36j251j067M89J209K34o26q90j155o80L22J624O54j11L35q82O90J037
2017I85j057o64N34J2k47K00r64P13K800Q40j621r61j298k43J49m26N35j89l74
1998a276J38P27r1L90p43m3Q45O18l75K09m08r71L60J107M04j025k30Q81O02j303
$$ plain form
2133 -836 -1734 -2112 -853 398 159 1073 2141 1368 169 -916 -950 -566 531 587 561 489 13 712 957
2114 957 962 1338 1325 1172 650 312 625 333 37 286 -48 71 -1009 -1905 -1184 -619 -106 -324 -917 -1377 -1304
2093 -1304 -265 790 127 759 1646 999 501 841 1010 550 -498 -712 -189 756 1176 545 370 -67 -392
2074 -392 -343 -809 -924 -1160 -795 -70 263 -1003 -1122 -337 701 -428 -1903 -2070 -2314 -2072 -1211 -310 255
2055 255 1129 1609 1766 3274 2944 2516 451 620 939 383 102 -512 -631 -638 419 53 -956 -1049 -113 617
2035 617 1053 -198 -1265 -776 433 667 41 -849 -2004 -2684 -2362 -738 -84 -195 140 -742 -52 985
2017 985 -72 -736 -202 -190 -437 -237 -1201 -488 2312 3152 1531 570 -728 -971 -822 -1248 -713 -902 -1276
1998 -1276 -1138 -411 -502 -112 -855 -898 -53 565 190 399 -9 -980 -620 487 891 -134 -364 517 1119 -184
1978a84j475j34J13J061N09m89r68j197P26J470m21j37O65q0j601O99P05L20J277
1959H59L19n32k06j83O44J105k6r89J39M79n64j194m66L04J7O7j26P63q90p74
1939a254O2P3M60N57O45K29p22J33J284J29r47n14J77m60o09J043n6j757p53M39
1919a841m46J149J277R80J620j363j683O12Q74l88J340N78q24p29q04p37q72J580
1901C23N40l64o07p3N28k1N85k12j751j037J17L71N83J213J79o17J3j925j277
1882c432K88J259M51J138P35M19P98n56p87j68j16N16O77l51o47L05o28r3J61
1863c1j021o97J048o34Q23Q44J4n68k24j07J314Q46j165j582j171m4K01J804K674
1844B324P94j605mL92J050o04j698j272k2N03N37O00p38J99J036l64l26J331Q24
$$ plain form
1978 -184 -1659 -1793 -1680 -619 -110 -599 -1567 -2764 -2038 -568 -989 -1126 -461 -541 -2142 -1443 -738 -418 859
1959 859 1178 646 440 257 901 2006 1980 991 1130 1609 1045 -149 -615 -311 -294 -227 -353 410 -480 -1254
1939 -1254 -1192 -1119 -659 -102 543 772 50 183 1467 1596 649 135 312 -148 -757 286 230 -1527 -2280 -1841
1919 -1841 -2287 -1138 139 1119 2739 1376 -307 305 1179 791 2131 2709 1885 1156 352 -385 -1257 323
1901 323 863 499 -108 -181 347 326 911 699 -1052 -2089 -1972 -1601 -1018 195 374 -243 -230 -2155 -3432
1882 -3432 -3144 -1885 -1434 -296 439 858 1656 1100 313 145 29 545 1222 871 224 529 -99 -192 -31
1863 -31 -1052 -1749 -701 -1335 -512 332 346 -222 -446 -553 761 1607 442 -1140 -2311 -2355 -2154 -350 2324
1844 2324 3118 1513 1509 1901 2951 2347 649 -623 -645 -142 395 995 257 456 1492 1128 802 2133 2957
1825B957o26j602p42J716O13p69o86m26L75L00j202O3j79M90J606j2j11L56l33
1806A788P9J542q06q97j037M11K56o79K74l44Q40L88J36m91K53J070L44Q9j516
1787A700o99k45j484R75Q61j360j844l67L42J610J093j18J33p90k55O76K79J085
1769A592J300p61o20j264Q37m66O08P2n84L67M08r32n18J90K272J42j192L0k92
1750A189O6J66M82n83p27J00M59L93k95R40o91j849K10J74M65J91q98q18P56k66
1730e36j60P52P02M15m38p12N2P50J058J88L47Q26M50j274p84r25p51Q3l13J95
1710g5J46l11O87R89J141Q3M75M55j176n56n40J45J92j7M25l22M21l70p85K65
1690A272k4r41M26n3j801r38Q85N22k32j20P98J082L5l31J63k56K17N48O0m69
$$ plain form
1825 2957 2331 729 -13 1703 2316 1547 861 435 810 1110 -92 -29 -208 282 1888 1876 1765 2121 1788
1806 1788 1867 3409 2603 1706 669 1080 1336 657 931 587 1427 1815 1951 1460 1713 2783 3127 3216 1700
1787 1700 1001 756 -728 247 1108 -252 -2096 -2463 -2121 -511 582 464 597 -193 -448 228 507 1592
1769 1592 2892 2131 1511 247 1084 618 1226 1298 714 1081 1489 557 39 229 2501 2643 1451 1481 1189
1750 1189 1255 1421 1903 1320 593 693 1152 1545 1250 2190 1499 -350 -140 34 499 690 -208 -1026 -270 -536
1730 -536 -696 56 758 1173 735 23 75 825 1883 2071 2418 3244 3694 2420 1636 711 -40 43 -270 -75
1710 -75 71 -240 447 1436 2577 2660 3135 3590 2414 1858 1318 1463 1655 1638 2063 1741 2162 1792 1007 1272
1690 1272 1248 307 733 680 -1121 -2059 -1174 -652 -884 -1004 -206 876 911 580 743 487 704 1252 1312 843
1670H43j007o58J847K071n69m26N26K7k21L18o90K07r60j086m85o97o48K15j18
1651a511R12J271r8M62J95k84J11n4l59O02J94K92j084j566P01K84M12O98j452
1632b74o79o5J096J312M55n68l60l75jL3n64j00N8N1p51m13M11J230J286l07K12
1611A687n92L06Q97N9l65n16N1k0J29J93o95J39l95m42p76r51q4M89J09P96M68
1590D87N52P20K79l61k82m29O09L75r01q98p24L08J117J4l20K94L35O78n23q82
1570D48j73k21M79J145l34n95l05J622k19o7J75Q5n39L14o16L48j21q27L16R38
1550A853m30r14n53P23K82J096P92p85j284j409n16J44J1J610N29o97N2n81N0
1531b7K94K13R15J42n92o26o41k46k15Pl45m21j54l42J249J536n2M4j79m3Q44
$$ plain form
1670 843 -164 -822 1025 3096 2527 2101 2627 2654 2433 2751 2061 2268 1308 222 -263 -960 -1608 -1393 -1511
1651 -1511 -599 672 574 1036 1231 947 1058 1004 645 1247 1441 1733 649 -917 -216 68 480 1178 -274
1632 -274 -953 -1018 78 1390 1845 1277 917 542 541 574 10 -90 -32 19 -732 -1145 -734 496 1782 1475 1687
1611 1687 1095 1401 2298 2357 1992 1476 1527 1507 1636 1829 1134 1273 878 436 -340 -1291 -1375 -886 -777 19 487
1590 487 1039 1759 2038 1677 1395 966 1575 1950 1049 151 -573 -265 852 866 546 840 1175 1853 1330 448
1570 448 275 54 533 1678 1344 749 444 2066 1847 1780 1955 2040 1501 1815 1199 1547 1426 599 915 1853
1550 1853 1423 509 -44 679 961 2057 2849 2064 780 -629 -1145 -1001 -990 620 1149 452 504 -77 -27
1531 -27 267 480 1395 1537 945 319 -322 -568 -783 -776 -1121 -1542 -1696 -2038 -789 747 695 739 560 517 1361
1510A361L51q60J185l73m62J07l51k26N4j59N66m74l47m40p27j00j223L96O08
1491a114O29L24O89K34K04N7J006N10j039q0N87k26O68N04r09j035Q37Q63o34
1472B075L3j199o02l35p47p6P23P7m35P03j05O69N03M81p43p73P00Q0Q71j54n
1451A741k5j248p0j87n83j341p83J156J872J746l77r87j056j02M49J01j009M25
1433b78J518J621N6k098n70J9p68q04k96M79O92o80Q44J401P52p20o98K01L55
1414A026J10n28o63k3l91o86J057K03n22k1k85K89J049j199r37O52J219L15M45
1395A110j122n34P15M51K40m34j055k85O45J579j41q70J715R23j154M6k98j45
1377A386K50j82q1k52K07l05L99P84M66r08j152n37K23L59Q66j326p03K35J300
$$ plain form
1510 1361 1712 852 2037 1664 1202 1309 958 732 786 627 1193 719 372 -68 -795 -895 -2118 -1722 -1114
1491 -1114 -485 -161 528 762 966 1023 2029 2539 1500 1420 2007 1781 2449 2953 2044 1009 1846 2709 2075
1472 2075 2108 909 307 -28 -775 -851 -128 -51 -486 217 112 781 1284 1765 1022 249 949 1029 1900 1746 1741
1451 1741 1716 468 398 211 -372 -1713 -2496 -1340 532 2278 1901 914 -142 -244 205 306 -703 -278
1433 -278 1240 2861 2917 819 249 268 -500 -1304 -1600 -1121 -429 -1109 -265 1136 1888 1168 470 671 1026
1414 1026 1136 608 -55 -78 -469 -1155 -98 105 -417 -438 -723 -434 615 -584 -1521 -869 350 665 1110
1395 1110 -12 -546 169 620 860 426 -629 -914 -269 1310 1169 299 2014 2937 1783 1829 1531 1386
1377 1386 1636 1454 1373 1121 1328 1023 1422 2206 2672 1764 612 75 298 657 1523 197 -506 -271 1029
1358A029P52q70j043J75Q08K67k73r49q53r0J89J40J536J346q00j559J25J163
1340A093O69j075K5p17m10J184j13l69j694M74J081M0O87J24p86J70R82m87M96
1321A374J86n25O73J23J111m8j51j252j457J127O18n84j17N76K09L3K68k63n73
1302A328o17l59O38J131N47M51j659m82j83n34k01K24O02K6J153J602J038j83
1284D522j826k561k086O07J315n97m69Q54j195k63K201J488k05J73M33j82O82
1267B891l88O10k03q97j578j226P25O18M68Pl6K73N29P4N7L46m00j521k22o69
1247e42r63m5J101J362R35J115m37j04k97p88j030p76j069R56l62P95O66O08K68
1228A393oK20m4l09j096o68o39l35j34R90J024l49l93P75J37K46o01Q93l15j022
$$ plain form
1358 1029 1781 911 -132 43 851 1118 845 -104 -957 -1047 -858 -718 818 2164 1364 -195 -70 1093
1340 1093 1762 687 712 -5 -415 769 656 287 -1407 -933 148 188 875 999 213 383 1365 878 1374
1321 1374 1560 1035 1708 1831 2942 2894 2743 1491 34 1161 1779 1195 1078 1654 1863 1896 2164 1901 1328
1302 1328 711 352 990 2121 2668 3119 1460 978 795 261 60 284 886 912 2065 3667 4705 4522
1284 4522 2696 135 -1951 -1344 -29 -626 -1095 -241 -1436 -1699 502 1990 1785 1958 2391 2209 2891
1267 2891 2503 3113 2910 2013 435 -791 -66 552 1020 1027 991 1264 1793 1867 1924 2270 1870 349 127 -542
1247 -542 -1505 -1550 -449 913 1848 2963 2526 2422 2125 1337 307 -469 -1538 -582 -944 -149 517 1125 1393
1228 1393 1387 1607 1563 1254 158 -510 -1149 -1484 -1618 -628 396 47 -346 429 566 812 211 1104 789 -233
1208b33J41l97l17j644Q78J878O96%k23L04J174m30k086r61O01j58l61M43J014
1189C19J337J468n02j225q48r26p13N32J154N52m93R20J354j110j004l92k06M60
1171F77j72P16N85R03L51O02j53r34o00r79k5J55r13k92O59P2J648J616j215q64
1151A837J613q39n78O82P6k44q28o43l97j116o32M46R24P72K66r60p81K03J328
1132A129p92r94J240R86q96j49M96l96L91k19j31M52j287q07O78J579k39j84Q42
1113A699J203l49m82o66K54j739R39J53j570p20l16j058K0O85J576R09L80l12
1095F06J80q10p64k01L42n15l02L46k43M32k43L82N31M4k92K03L97l28P6Q1M85
1074D07j98n77J46Q19J002p36j711j6L31j116M5Q89J646J277o4p87n92k15j89
$$ plain form
1208 -233 -92 -489 -806 -2450 -1572 306 1002 1002 779 1083 2257 1827 -259 -1220 -619 -777 -1138 -695 319
1189 319 1656 3124 2622 1397 549 -377 -1090 -558 596 1148 655 1575 2929 1819 815 423 217 677
1171 677 505 1221 1806 2709 3060 3662 3509 2575 1975 996 971 1126 213 -79 580 652 2300 3916 2701 1837
1151 1837 3450 2611 2033 2715 2791 2547 1719 1076 679 -437 -1069 -623 301 1073 1339 379 -402 -199 1129
1132 1129 337 -657 583 1569 673 524 1020 624 1015 796 665 1117 -170 -977 -299 1280 1041 857 1699
1113 1699 2902 2553 2071 1405 1659 -80 859 1012 -558 -1278 -1594 -2652 -2632 -1947 -371 538 918 606
1095 606 786 -24 -788 -989 -647 -1162 -1464 -1118 -1361 -929 -1172 -790 -259 -215 -507 -304 93 -235 -159 -78 407
1074 407 209 -368 -222 597 1599 863 -848 -864 -533 -1649 -1604 -715 931 2208 2144 1357 765 550 361
1055C61J944K44k089o39M30q3q42N9N41p1O01K40o26p7M87p06m99J40Q4J028J917
1034B444K35r81r6lQ58q3L59j386m05M46N99L17r01j7n47l61j94OL96q0Q00N35
1012A941j14q33M13j74Q20R3l78j16P54M74J94q71o6K49M67n23n6j135m72P02
992A369L04j88P27J68j168N10Q12M74j005j095m95Q6J97K66R23J45j79L78r79
973A250o54k64P36j41J74J97k57L74J441K72p60p17r42L81o23o13Ml38M26L65
953C11l11k55M2j58O77J239m14j520L88l5N76r2j498q96J058J272p0J20J26J147
933A707J246k58j342l56K73J31q6L93p55j292j706M10M36O44J228q2J23O38P39
914B091K34p82j316K9J65l09m39Lj030R00J453j99k2p6O06M45j29l24N22n57O4
$$ plain form
1055 361 2305 2549 460 -179 251 168 -674 -615 -74 -145 456 696 70 -7 480 -226 -725 -585 -501 527 2444
1034 2444 2679 1698 1602 1599 2457 2374 2733 1347 942 1388 1987 2304 1403 1386 839 478 284 290 686 606 1406 1941
1012 1941 1827 994 1407 1233 2053 2146 1768 1652 2406 2880 3074 2203 2137 2386 2853 2330 2274 1139 667 1369
992 1369 1673 1485 2212 2380 1212 1722 2534 3008 2003 908 413 499 696 962 1885 2030 1851 2229 1250
973 1250 596 332 1068 927 1101 1298 1041 1415 2856 3128 2368 1651 709 1090 467 -146 -142 -480 -54 311
953 311 0 -255 -213 -371 306 1545 1131 -389 -1 -36 540 448 -1050 -1946 -888 384 314 434 560 1707
933 1707 2953 2695 1353 997 1270 1401 1315 1708 953 -339 -2045 -1635 -1199 -555 673 591 714 1352 2091
914 2091 2325 1543 227 256 421 112 -327 -324 -1354 -454 999 800 778 702 1308 1753 1624 1300 1822 1265 1329
893A329R25k30J25jr5p82r95J01N68Q69m50k5o4j451P86O66O35Q03n04Qk11o02
871A405q01N3p8k80L36Q32L68n61n45r16k05m86N67J01k27J920J02l01m16P64
851A632Q27m24m87Q6k4K98k53j261o44j13N40P34J50k66k95L29k26m45l79P48
831E27k50M72o61J12M89q71n11O89k40n44o72N12J084Q59k03L6j87j094n96J716
811F67L2jJ568J189j420n43l70o49j03k08O64n64p59R51L38Q97m88R92j56j071
791I66j475J7N67N44K0j853M82N76J776J491L71o64j240q28K82N67J548j01J26
772C172j059n08J410L13o34p70l86O37j89l17n18k150M52O85J4M24J249R18l28
753B415j013l0J0M74j83P16j12k97L19k92Kl76N51M86p76m98J443M27l51r51m85
$$ plain form
893 1329 2254 2024 2149 2148 2053 1271 276 377 945 1814 1364 1339 1275 -176 610 1276 1911 2714 2210 2218 2007 1405
871 1405 604 657 579 299 635 1467 1835 1274 729 -187 -392 -878 -311 -210 -437 1483 1585 1284 868 1632
851 1632 2459 2035 1548 1634 1610 1908 1655 394 -250 -363 177 911 1061 795 500 829 603 158 -221 527
831 527 277 749 88 200 689 -182 -693 -4 -244 -788 -1460 -948 136 995 792 828 641 -453 -1049 667
811 667 699 698 2266 3455 2035 1492 1122 473 370 162 826 262 -497 454 792 1689 1201 2193 2037 966
791 966 -509 -492 75 619 639 -1214 -732 -156 1620 3111 3482 2818 1578 750 1032 1599 3147 3046 3172
772 3172 2113 1605 3015 3328 2694 1924 1538 2175 1986 1669 1151 -999 -547 138 152 576 1825 2743 2415
753 2415 1402 1372 1382 1856 1673 2389 2277 1980 2299 2007 2009 1633 2184 2670 1894 1396 2839 3266 2915 1964 1479
732A479k52O74L69K11n53M98k96k76k60l74J417lj746N6J084K04N91J93q52n64
712A600k509M84J257K37l9k55R5Q30L77p42l15O93Q15M10J66j700r26N33k4n82
692D05j097j232J960J371Q7K87l96k52j884j491M92K386J364J043j21p38j044
675A140j470J227l66p7P3N6j400K58K53J61J070O90j144K3J43L22n6j82J09n05
655C25K04n50q38J088J43o15J012J26Q19J87k27n33n5l55M01J667K22o78n00l96
635A447j39o94P30J838q92j11P64q76q85j462l18J100J181O15n13K45r06L58m25
$$ plain form
732 1479 1227 1901 2270 2481 1928 2426 2130 1854 1594 1220 2637 2634 888 944 2028 2232 2823 3016 2164 1600
712 1600 -909 -425 832 1069 1030 775 870 1700 2077 1335 1020 1713 2528 2938 3104 1404 478 1011 987 405
692 405 -692 -1924 36 1407 1494 1781 1385 1133 -751 -2242 -1750 636 2000 3043 2922 2184 1140
675 1140 -330 897 531 454 527 583 -817 -559 -306 -145 925 1615 471 494 637 959 903 721 830 325
655 325 529 -21 -859 229 372 -243 769 895 1714 1901 1674 1141 1086 731 1132 2799 3021 2343 1843 1447
635 1447 1308 614 1344 3182 2290 2179 2943 2067 1182 -280 -598 502 1683 2298 1785 2030 1124 1482 1057
$$ [...]
##END NTUPLES=NMR SPECTRUM
##END=
