##TITLE=Analysis number 310621
Compound Code rf 02291
Project Code adrs
Chemist Name ugmt
##JCAMPDX= 6.0         $$ Bruker NMR JCAMP-DX V2.0
##DATA TYPE= NMR SPECTRUM
##DATA CLASS= NTUPLES
##ORIGIN= Bruker BioSpin GmbH
##OWNER= NMR
$$ XWIN-NMR		Version 3.5
$$ Tue Jun 21 11:42:34 2005 GMT Daylight Time (UT+1h)  MAYBRIDGE\NMR@NMR_250MHZ
##.OBSERVE FREQUENCY= 250.131544655141
##.OBSERVE NUCLEUS= ^1H
##.ACQUISITION MODE= SIMULTANEOUS (DQD)
##.ACQUISITION SCHEME= undefined
##.AVERAGES= 16
##.DIGITISER RES= 18
##SPECTROMETER/DATA SYSTEM= dpx250
##.PULSE SEQUENCE= zg30
##.SOLVENT NAME= DMSO
##.SHIFT REFERENCE= (INTERNAL, DMSO, 0, 16.522)
##AUDIT TRAIL= $$ (NUMBER, WHEN, WHO, WHERE, WHAT)
$$ ##TITLE= Audit trail, XWIN-NMR		Version 3.5
$$ ##JCAMPDX= 5.01
$$ ##ORIGIN= Bruker BioSpin GmbH
$$ ##OWNER= NMR
$$ C:\u/data/dgb/nmr/ADRS/4390/pdata/1/auditp.txt
$$ ##AUDIT TRAIL=  $$ (NUMBER, WHEN, WHO, WHERE, WHAT)
(   1,<2005-06-21 11:41:58.77 +100>,<MAYBRIDGE\NMR>,<NMR_250MHZ>,
      <created by zg, POWCHK disabled, PULCHK disabled
       configuration hash MD5:
       62 19 C7 07 E1 42 D1 B7 37 6C 3D D0 77 39 F9 E6
       data hash MD5: 64K
       27 BB 0D 26 2F CA 5B B5 4C E8 4A B4 B0 78 0C 4D>)
(   2,<2005-06-21 11:42:15.08 +100>,<MAYBRIDGE\NMR>,<NMR_250MHZ>,
      <Start of raw data processing
       ef LB = 0.3 FT_mod = 6 PKNL = 1 SI = 32K 
       data hash MD5: 32K
       5F 6C 4D 1D AF 3E 0C C0 2F AA F6 37 FE 9A DE 61>)
(   3,<2005-06-21 11:42:20.72 +100>,<MAYBRIDGE\NMR>,<NMR_250MHZ>,
      <apk 
       data hash MD5: 32K
       95 89 0E 13 99 36 DC 35 8B E9 89 80 3B 47 D4 63>)
(   4,<2005-06-21 11:42:22.27 +100>,<MAYBRIDGE\NMR>,<NMR_250MHZ>,
      <abs ABSG = 5 
       data hash MD5: 32K
       EF CD 80 5A 65 79 94 B4 07 6B 08 2F 3B 08 74 A3>)
$$ ##END=
$$ 
$$ hash MD5
$$ 38 E4 C5 E3 BD 3D 53 B8 29 FD A1 66 91 06 33 9A
##$RELAX= 
##$RELAX= 
##$RELAX= 
##$RELAX= 
##$RELAX= 
##$RELAX= 
##$RELAX= 
$$ Bruker specific parameters
$$ --------------------------
##$DU= <C:\u>
##$EXPNO= 4390
##$NAME= <ADRS>
##$PROCNO= 1
##$TYPE= <nmr>
##$USER= <dgb>
##$AMP= (0..31)
100 100 100 100 100 100 100 100 100 100 100 100 100 100 100 100 100 100 
100 100 100 100 100 100 100 100 100 100 100 100 100 100 
##$AQSEQ= 0
##$AQ_mod= 3
##$AUNM= <au_zg>
##$AUTOPOS= <17 >
##$BF1= 250.13
##$BF2= 250.13
##$BF3= 250.13
##$BF4= 250.13
##$BF5= 500.13
##$BF6= 500.13
##$BF7= 500.13
##$BF8= 500.13
##$BYTORDA= 1
##$CFDGTYP= 0
##$CFRGTYP= 5
##$CHEMSTR= <none>
##$CNST= (0..31)
1 1 145 1 1 1 1 1 1 1 1 1 1 1 1 1 1 1 1 1 1 1 1 1 1 1 1 1 1 1 1 1 
##$CPDPRG= <>
##$CPDPRG1= <>
##$CPDPRG2= <>
##$CPDPRG3= <>
##$CPDPRG4= <mlev>
##$CPDPRG5= <mlev>
##$CPDPRG6= <mlev>
##$CPDPRG7= <mlev>
##$CPDPRG8= <mlev>
##$CPDPRGB= <>
##$CPDPRGT= <>
##$D= (0..31)
0 1 0 0 0 0 0 0 0 0.06 0 0 0 0 0 0 0.0002 0 0 0 0 0 0 0 0 0 0 0 0 0 0 
0 
##$DATE= 1119350517
##$DBL= (0..7)
120 120 120 120 120 120 120 120 
##$DBP= (0..7)
150 150 150 150 150 150 150 150 
##$DBP07= 0
##$DBPNAM0= <>
##$DBPNAM1= <>
##$DBPNAM2= <>
##$DBPNAM3= <>
$$ [...]
##$SUBNAM7= <"">
##$SUBNAM8= <"">
##$SUBNAM9= <"">
##$SW= 20.6930455092707
##$SWIBOX= (0..15)
0 0 3 0 0 0 0 0 0 0 0 0 0 0 0 0 
##$SW_h= 5175.983436853
##$TD= 65536
##$TD0= 1
##$TE= 295.16
##$TE2= 300
##$TE3= 300
##$TEG= 300
##$TL= (0..7)
0 120 120 120 120 120 120 120 
##$TP= (0..7)
150 150 150 150 150 150 150 150 
##$TP07= 0
##$TPNAME0= <>
##$TPNAME1= <>
##$TPNAME2= <>
##$TPNAME3= <>
##$TPNAME4= <>
##$TPNAME5= <>
##$TPNAME6= <>
##$TPNAME7= <>
##$TPOAL= (0..7)
0.5 0.5 0.5 0.5 0.5 0.5 0.5 0.5 
##$TPOFFS= (0..7)
0 0 0 0 0 0 0 0 
##$TUNHIN= 0
##$TUNHOUT= 0
##$TUNXOUT= 0
##$USERA1= <user>
##$USERA2= <user>
##$USERA3= <user>
##$USERA4= <user>
##$USERA5= <user>
##$V9= 5
##$VALIST= <valist>
##$VCLIST= <CCCCCCCCCCCCCCC>
##$VD= 0
##$VDLIST= <DDDDDDDDDDDDDDD>
##$VPLIST= <PPPPPPPPPPPPPPP>
##$VTLIST= <TTTTTTTTTTTTTTT>
##$WBST= 1024
##$WBSW= 4
##$XGAIN= (0..3)
0 0 0 0 
##$XL= 0
##$YL= 0
##$YMAX_a= 475774
##$YMIN_a= -426110
##$ZGOPTNS= <>
##$ZL1= 120
##$ZL2= 120
##$ZL3= 120
##$ZL4= 120
##$ABSF1= 16.522
##$ABSF2= -4.171173
##$ABSG= 5
##$ABSL= 3
##$ALPHA= 0
##$AQORDER= 0
##$ASSFAC= 0
##$ASSFACI= 0
##$ASSFACX= 0
##$ASSWID= 0
##$AUNMP= <proc_1d>
##$AZFE= 0.1
##$AZFW= 0.1
##$BCFW= 0
##$BC_mod= 0
##$BYTORDP= 0
##$COROFFS= 0
##$CY= 12.5
##$DATMOD= 1
##$DC= 0
##$DFILT= <>
##$DTYPP= 0
##$F1P= 14.0000005364418
##$F2P= -0.99999901652339
##$FCOR= 0.5
##$FTSIZE= 32768
##$FT_mod= 6
##$GAMMA= 0
##$GB= 0
##$INTBC= 1
##$INTSCL= 1
##$ISEN= 128
##$LB= 0.3
##$LEV0= 0
##$LPBIN= 0
##$MAXI= 10000
##$MC2= 0
##$MEAN= 0
##$ME_mod= 0
##$MI= 0
##$NCOEF= 0
##$NC_proc= -3
##$NLEV= 6
##$NOISF1= 0
##$NOISF2= 0
##$NSP= 0
##$NTH_PI= 0
##$NZP= 0
##$OFFSET= 16.522
##$PC= 1
##$PHC0= -89.68193
##$PHC1= 5.474447
##$PH_mod= 1
##$PKNL= yes
##$PPARMOD= 0
##$PSCAL= 4
##$PSIGN= 0
##$REVERSE= no
##$SF= 250.13
##$SI= 32768
##$SIGF1= 0
##$SIGF2= 0
##$SINO= 400
##$SIOLD= 32768
##$SREGLST= <1H.DMSO>
##$SSB= 0
##$STSI= 32768
##$STSR= 0
##$SW_p= 5175.98343685301
##$SYMM= 0
##$S_DEV= 0
##$TDeff= 65536
##$TDoff= 0
##$TI= <Analysis number 999999
Compound Code 99
Book Reference 9
Project Code 9>
##$TILT= no
##$TM1= 0
##$TM2= 0
##$TOPLEV= 0
##$USERP1= <user>
##$USERP2= <user>
##$USERP3= <user>
##$USERP4= <user>
##$USERP5= <user>
##$WDW= 1
##$XDIM= 32768
##$YMAX_p= 308848080
##$YMIN_p= -64573
$$ End of Bruker specific parameters
$$ ---------------------------------
##NTUPLES= NMR SPECTRUM
##VAR_NAME=  FREQUENCY,     SPECTRUM/REAL,   SPECTRUM/IMAG
##SYMBOL=    X,             R,               I
##VAR_TYPE=  INDEPENDENT,   DEPENDENT,       DEPENDENT
##VAR_FORM=  AFFN,          ASDF,            ASDF
##VAR_DIM=   32768,         32768,           32768
##UNITS=     HZ,            ARBITRARY UNITS, ARBITRARY UNITS
##FACTOR=    0.157963299565203, 1,           1
##FIRST=     4132.6476996994, 0,             0
##LAST=      -1043.33573715361, 0,           0
##MIN=       -1043.33573715361, -64573,      0
##MAX=       4132.6476996994, 308848080,     0
$$ Real data points
##PAGE= N=1
##DATA TABLE= (X++(R..R)), XYDATA
$$ [...]
14594b11p223k5513m256L876P906J618k028j263R23K1794K3661J2781m314j0837
$$ -211 -7434 -32947 -37203 -33327 -25421 -23803 -25831 -27094 -26171 -4377 19284 32065 27751 16914
14580A6914k2868k380J5278M797J0326j8874k252K561k421p564M657l390P546
$$ 16914 -5954 -8334 6944 11741 22067 3193 941 3502 1081 -6483 -1826 -5216 2330
14567B330J1754o871j6419K639K95p466P863j4523m984j2873l254O936K820m00
$$ 2330 14084 7213 -9206 -6567 -6272 -13738 -5875 -20398 -25382 -38255 -41509 -34573 -31753 -32153
14553c2153J073L074K5348J512j7087j0852m033M234J4866j924Q216K325j858
$$ -32153 -31080 -28006 -2658 -1146 -18233 -29085 -33118 -28884 -14018 -15942 -7726 -5401 -7259
14540g259N760J358j7443j3831J5699N546n316O889o686M65J1944O376j5094L947
$$ -7259 -1499 -141 -17584 -31415 -15716 -10170 -15486 -8597 -15283 -14818 -2874 3502 -11592 -7645
14526g645o627l735K926J983m102M648o645P915J1371J6823M450j1185J201k678
$$ -7645 -14272 -18007 -15081 -13098 -17200 -12552 -19197 -11282 89 16912 21362 10177 11378 8700
14512H700j7988l431J2227j3017K52J712J0794l941j2970L73R818k710Jl400j351
$$ 8700 -9288 -12719 -492 -13509 -13257 -11545 -751 -4692 -17662 -17289 -7471 -10181 -10180 -13580 -14931
14497a4931J8455P66j17j9052k161Q193r39M832j377p449K3027q78k2400N710
$$ -14931 3524 4290 4173 -14879 -17040 -8847 -9786 -4954 -6331 -13780 9247 8369 -14031 -8321
14483h321n004o717j2343j167R936O866k032L506R85n1p14R452N790l104N759
$$ -8321 -13325 -20042 -32385 -33552 -23616 -16750 -18782 -15276 -14291 -14342 -15056 -5604 186 -2918 2841
14468B841Q945K799j3624j3130j1109M994K2522J0147n714j2368j4269L951K1297
$$ 2841 11786 14585 961 -12169 -23278 -18284 4238 14385 8671 -3697 -17966 -14015 7282
14455G282o131j7340N162j6285o169j0595J0283J8467K9917P855r085L6M436p32
$$ 7282 1151 -16189 -11027 -27312 -33481 -44076 -33793 -15326 14591 22446 13361 13397 17833 17101
14441A7101j4102k1722m67q002l0040j521J5641o270J4190J7969L932q019K272
$$ 17101 2999 -18723 -19190 -27192 -57232 -58753 -43112 -49382 -35192 -17223 -13291 -21310 -19038
14428a9038O184o52M076l015J710n486M306N002O475P797Q498j6214j9221P906
$$ -19038 -12854 -13506 -9430 -12445 -10735 -16221 -11915 -6913 -438 7359 15857 -357 -19578 -11672
14414a1672M2J225k923J688N582O751Q165j1640q130j1819j153J1672R670m232
$$ -11672 -11630 -10405 -13328 -11640 -6058 693 8858 -2782 -10912 -22731 -23884 -12212 -2542 -6774
14400f774m021m12J034r560l150j0539l38q023q391J5283L1004J2428m173k76
$$ -6774 -10795 -11207 -10173 -19733 -22883 -33422 -33760 -41783 -50174 -34891 -3887 8541 4368 4092
14386D092J3170K601k857o472n269m478j2203N948L198P966M153k5362j3692L939
$$ 4092 17262 19863 17006 10534 5265 787 -11416 -5468 -2270 5696 9849 -15513 -29205 -25266
14372b5266J167O224o740N293O682P80j5503J58K7487O921M493o477J197r797
$$ -25266 -24099 -17875 -24615 -19322 -12640 -11860 -27363 -27205 282 7203 11696 5219 6416 -3381
14358c381m391L093j438R940J9572q019j4067j2494N00K524J10j5320p740J4893
$$ -3381 -7772 -4679 -6117 3823 23395 15376 1309 -11185 -10685 -8161 -8051 -23371 -31111 -16218
14344a6218J8033R186J34R310j925N865q673j0011j6591O5p509m230K5030K2466
$$ -16218 1815 11001 11135 20445 18520 24385 15712 5701 -10890 -10825 -18334 -22564 2466 24932
14330B4932J503p113j6228k0684n380q419J2459M93M632J6762L996K242k1446
$$ 24932 26435 19322 3094 -17590 -22970 -31389 -18930 -18437 -13805 2957 6953 9195 -12251
14317a2251l099J9636M842M121n859r155j63P042l970n196K3901Q551q460j6463
$$ -12251 -15350 4286 9128 13249 7390 -1765 -1928 5114 1144 -4052 19849 28400 19940 3477
14303C477l121j113k368l08L516J244R199N530L868j954q928k8028j6344J631
$$ 3477 356 -757 -3125 -3433 83 1327 10526 16056 19924 17970 9042 -18986 -35330 -33699
14289c3699J3825L587J67K890J7757J6823L956K30j3838j4222J673N263J4280
$$ -33699 -19874 -16287 -16120 -13230 4527 21350 25306 25536 11698 -2524 -851 4412 18692
14276A8692j1426J803L539Q071j0056r649j6926j1212N410j0111P353J3607M99
$$ 18692 7266 9069 12608 20679 10623 974 -15952 -27164 -21754 -31865 -24512 -10905 -10406
14263a0406j3598J314Q423k334L692J6230m393k91J629l841j378m302r913r398
$$ -10406 -24004 -22690 -14267 -16601 -12909 3321 -1072 -1363 266 -3575 -4953 -9255 -19168 -28566
14249b8566Q786P984K2637j894k881O088J5420P183k564j5400P119j5639j1411
$$ -28566 -19780 -11796 10841 8947 6066 12154 27574 34757 32193 16793 23912 8273 -3138
14236c138n178n77p468p341J590L927J7273P333r242p713R063j562k1116J421
$$ -3138 -8316 -8893 -16361 -23702 -22112 -18185 -912 6421 -2821 -10534 -1471 -3033 -24149 -22728
14222b2728p548L743K7605J8806O488q986j912m238j7101j9216o785J0504J1124
$$ -22728 -30276 -26533 1072 19878 26366 17380 15468 11230 -5871 -25087 -31872 -21368 -10244
14209a0244l144L367K600p071P001Q230j2312o886l699J3456p345O40J2528n359
$$ -10244 -13388 -10021 -7421 -14492 -7491 739 -11573 -18459 -22158 -8702 -16047 -15407 -2879 -8238
14195h238n452J4555K5074o056j6205o229p181N91j0578M930K692O887K44L455
$$ -8238 -13690 865 25939 19883 3678 -2551 -9732 -9141 -19719 -14789 -12097 -5210 -4966 -1511
14181a511K0392J0789k0639Q17P379j2477j9044q554J1322j122j3963K006J0675
$$ -1511 18881 29670 9031 9848 17227 4750 -14294 -22848 -11526 -12648 -26611 -24605 -13930
14168a3930J3762o539k6635J1811J7304p136P70J2048j3206o374j230k539k666
$$ -13930 -168 -6707 -33342 -21531 -4227 -11363 -10593 1455 -11751 -18125 -19355 -21894 -24560
14155b4560J394J18o377k787N724R610q718j1076m142J6703K6825o982P573R653
$$ -24560 -23166 -23048 -29425 -32212 -26488 -16878 -25596 -36672 -40814 -24111 2714 -4268 3305 12958
14141A2958m869K753K46j9289j6620J0477o602j3680P944R746M655l438K3958
$$ 12958 8089 10842 11088 -8201 -24821 -14344 -20946 -34626 -26682 -16936 -12281 -15719 8239
14128H239k537k2425J0748r2j5087j5011J0882k753J3182M026r122J1748O151
$$ 8239 5702 -16723 -5975 -6067 -21154 -36165 -25283 -28036 -14854 -10828 -19950 -8202 -2051
14115b051R050j110P548p255K754j6301k1559J5440O137j774N051k346p155M849
$$ -2051 6999 5889 13437 6182 8936 -7365 -28924 -13484 -7347 -9121 -4070 -6416 -13571 -8722
14101h722k306k1153j5360k272J9349N700J2411q085n693Q431N544J5384R517
$$ -8722 -11028 -32181 -47541 -49813 -30464 -24764 -12353 -20438 -26131 -17700 -12156 3228 12745
14088A2745P322j7207p850j880l302n850Q15o53M809N462m935k2276L86J5176
$$ 12745 20067 2860 -4990 -6870 -10172 -16022 -15207 -15860 -11051 -5589 -10524 -32800 -32414 -17238
14074a7238L905q710o908j1584l836J0743J979O65J1621J3139j0027j0395J651
$$ -17238 -13333 -22043 -28951 -40535 -44371 -33628 -31649 -30984 -19363 -6224 -16251 -26646 -24995
14061b4995Q104n109k220K1036J0064q266m69J5444J510k2954j8279J4115K8239
$$ -24995 -16891 -22000 -24220 -3184 6880 -1386 -1855 13589 15099 -7855 -26134 -12019 16220
14048A6220p705J643j912l3553p539k249m14J8365o354L392J5049J4145k2886
$$ 16220 8515 10158 8246 -25307 -32846 -35095 -35509 -17144 -23498 -20106 -5057 9088 -13798
14035a3798k531k1186J6301J1022k0531l292J4137l546j3176p25J3204p178j7732
$$ -13798 -16329 -37515 -21214 -10192 -30723 -34015 -19878 -23424 -36600 -37325 -24121 -31299 -49031
14022d9031j756M838p498J0766n686K431K4879Q955p974l106O712o45J479j290
$$ -49031 -50787 -45949 -53447 -42681 -48367 -45936 -21057 -12102 -20076 -23182 -16470 -17115 -15636 -16926
14008a6926k443J4775J4651J045j0449j1360O970q30j0187J3109J7653m189p725
$$ -16926 -19369 -4594 10057 11102 653 -10707 -3737 -4567 -14754 -1645 16008 11819 4094
13995D094j7644j566p87K376j0340j133O40L092M544R587J0361J6941j7494j4969
$$ 4094 -13550 -15116 -15903 -13527 -23867 -25000 -24360 -21268 -16724 -7137 3224 20165 2671 -12298
13981a2298j5307N893P028J6544l982j3237L781Q322j8860l3893K622J9264J8385
$$ -12298 -27605 -21712 -14684 1860 -2122 -15359 -11578 -3256 -22116 -56009 -53387 -34123 -15738
13968a5738K0897m91j3363N046j854j2089p321p298L316J802J3115J2266L821
$$ -15738 5159 4668 -8695 -3649 -5503 -17592 -24913 -32211 -28895 -27093 -13978 -1712 2109
13955B109J2248l351o336K278j0581k86j0220j3473j4337m262L1577J6878l393
$$ 2109 14357 11006 4670 6948 -3633 -3919 -14139 -27612 -41949 -46211 -14634 2244 -1149
13942a149q398k739J2340j0978j2770j6054M273K0558O206J0631J0396J031m973
$$ -1149 -9547 -12286 54 -10924 -23694 -39748 -35475 -14917 -8711 1920 12316 13347 8374
13929H374p957m120o284j5576O326J0816K0923J5549m823L97q691j6716R25j088
$$ 8374 417 -3703 -9987 -25563 -19237 -8421 12502 28051 23228 23625 14934 -1782 -857 -1945
13915a945J4530J2234k397j3776K94o226j0671O147k953j6083O776J7951J467
$$ -1945 12585 24819 22422 8646 8940 2714 -7957 -1810 -4763 -20846 -14070 3881 5348
13902E348j7134J317J446l99J7488r629j6985q33J1607O563l094J0369K835O781
$$ 5348 -11786 -10469 -9023 -9422 8066 -1563 -18548 -19381 -7774 -1211 -4305 6064 8899 15680
13888A5680J091k2272q590P048L793l83j1939P059J9857j4517k2398J0710K8240
$$ 15680 16771 -5501 -14091 -7043 -3250 -3633 -15572 -8513 11344 -3173 -25571 -14861 13379
13875A3379P571l939l852J2383M318j1275k1927q697Q269m175L408K864N055j3654
$$ 13379 20950 17011 13159 25542 29860 18585 -3342 -12039 -3770 -7945 -4537 -1673 3382 -10272
13861a0272J306l249j0381K49R030Q355M622J2059l198j6830j8126o54O703L539
$$ -10272 -8966 -12215 -22596 -22347 -13317 -4962 -340 11719 8521 -8309 -26435 -27089 -20386 -16847
13847a6847P587M386J0654j377K459j1243K898O079q580Q776j2921k576K641j4952
$$ -16847 -9260 -4874 5780 4403 6862 -4381 -1483 4596 -3984 4792 -8129 -10705 -8064 -23016
13833b3016l13J7313J6781n952l1022J3479J159n165K6709J8627r675j1051J4508
$$ -23016 -23329 -6016 10765 4813 -26209 -12730 -11571 -16736 9973 28600 18925 7874 22382
13820B2382k1134k8756J9217P846j3930r854J5880K1668Q882q286L27N137l3093
$$ 22382 1248 -27508 -8291 -445 -14375 -24229 -8349 13319 22201 13915 14242 19379 -13714
13807a3714n944r552k41j3361J354o14J4899J0481j2398O440J455N183j174j1184
$$ -13714 -19658 -29210 -29451 -42812 -41458 -42072 -27173 -16692 -29090 -22650 -21195 -16012 -17186 -28370
13793b8370Q621J9179Q419J0101l203j5618j266J9721O413N630j509J163j1774
$$ -28370 -19749 -570 7849 17950 14747 -871 -2137 17584 23997 29627 28118 29281 17507
13780A7507l313m501j1322J6394J0677P380l303j7004O660j4327P611Q277k7608
$$ 17507 14194 9693 -1629 14765 25442 32822 29519 12515 19175 4848 12459 20736 -6872
13767f872k8878L887J0028j0678j1119P375J1892J7293J1626M328N002k4278k3174
$$ -6872 -35750 -31863 -21835 -32513 -43632 -36257 -24365 -7072 4554 8882 13884 -10394 -33568
13754c3568K30K5207P514P342J6983m139k8110J4197O856j0968j1489j5376J518
$$ -33568 -33338 -8131 -617 6725 23708 19569 -8541 5656 12512 1544 -9945 -25321 -23803
13741b3803L946j1710P247J4908P109j0343l827Q644J1711K364j5979j3293J2145
$$ -23803 -19857 -31567 -24320 -9412 -2303 -12646 -16473 -7829 3882 6246 -9733 -23026 -10881
13728a0881J8323k661j8630l498Q048K574L067N83j5675k0475M880J1354K7297
$$ -10881 7442 4781 -13849 -17347 -9299 -6725 -3658 -3075 -18750 -39225 -34345 -22991 4306
13715D306l394K356k161p10j96j0841o874j4715J236j0556j443Q030K6159R690
$$ 4306 912 3268 1107 397 201 -10640 -17514 -32229 -30993 -41549 -42992 -34962 -8803 887
13701H87j0171P29j738q177P883M090J4228J7755r650q443r44p403j692p925M473
$$ 887 -9284 -8555 -10293 -18470 -10587 -6497 7731 25486 15836 7393 6449 -954 -2646 -10571 -6098
13686f098l755m585J988k658J836m958Q829J4886K312o746n108N955j5282l274
$$ -6098 -9853 -14438 -12450 -15108 -13272 -18230 -9401 5485 7797 1051 -4057 1898 -13384 -16658
13672a6658k406l80j0353P679J6734o225k057l194r590J4435J0463l026p963J0903
$$ -16658 -19064 -19444 -29797 -22118 -5384 -11609 -13666 -16860 -26450 -12015 -1552 -4578 -12541 -1638
13658a638R478r859K730j0244Q710J0566j1940k3477j3406n12O265J2000p367
$$ -1638 7840 -2019 711 -9533 -823 9743 -2197 -25674 -39080 -39592 -33327 -21327 -28694
13645b8694J380K0839O939n456q426l793o50k04k958N818j763j2082j167m80l725
$$ -28694 -27314 -6475 464 -4992 -13418 -17211 -17861 -18065 -21023 -15205 -16968 -29050 -30217 -30697 -34422
13630c4422O475k035R457K0551k725P25J850J2124O180j7387J755j51N028m96
$$ -34422 -27947 -29982 -20525 26 -2699 -1974 -124 12000 18180 793 2548 2397 7425 6929
13616F929k5363O957J8510Q836q500m44O992n682j9533r579J62J6068Q179J0715
$$ 6929 -18434 -11477 7033 15869 7369 6925 13917 8235 -11298 -20877 -20715 -4647 3532 14247
13602A4247N617k266j3325q252N868M172M169p773J5274J3297k1731j3418k056
$$ 14247 19864 17598 4273 -3979 1889 6061 10230 2457 17731 31028 9297 -4121 -6177
13589f177K545L278j3316J2615J726J313p85o03J3972K80M550j8228j1922l930
$$ -6177 -3632 -354 -13670 -1055 671 1984 1199 596 14568 14848 19398 1170 -10752 -14682
13575a4682Q16k990O790J4011J0040j3268j7487n742L142o535P524J5791N378
$$ -14682 -13866 -16856 -10066 3945 13985 717 -16770 -22512 -19370 -25905 -18381 -2590 2788
13562B788l535J2825R85q338K084k1189p375m893l785O683k167j4140J990J8013
$$ 2788 -747 12078 13063 4725 6809 -14380 -21755 -26648 -30433 -23750 -25917 -40057 -38067 -20054
13548b0054j627j9987k438N806J9117L858J204R34r74k065J875J688p12o127m544
$$ -20054 -21681 -41668 -44106 -38300 -19183 -15325 -14121 -13187 -14161 -16226 -14351 -12663 -13375 -19502 -24046
13533b4046J4327J1581p829j1106n286P144J1198J7742J648n851j3675p338j1615
$$ -24046 -9719 1862 -5967 -17073 -22359 -15215 -4017 13725 15373 9522 -4153 -11491 -23106
13520b3106l082J3286O018P923J0943P125n630j3065r726p745j458J9728o634
$$ -23106 -26188 -12902 -6884 1039 11982 19107 13477 412 -9314 -17059 -18517 1211 -5423
13507e423r881N629j2621K6183J2771o241m319j0729j311O53j207q80P668M095
$$ -5423 -15304 -9675 -22296 3887 16658 10417 6098 -4631 -5942 -5289 -6496 -7376 292 4387
13493D387l697j6919j8885p408k289N189J8860r473L766J6400o733m34M220q678
$$ 4387 690 -16229 -35114 -42522 -44811 -39622 -20762 -30235 -26469 -10069 -16802 -17236 -13016 -21694
13479b1694J2671k543K917O728p47J234P48P605J6863J552q251q268j2458J2016
$$ -21694 -9023 -11566 -8649 -1921 -2668 -1434 -686 6919 23782 25334 17083 8815 -3643 8373
13465H373r69j2631j3855r583K385j0711K637l570P519J1873K253O329Q66k382
$$ 8373 7404 -5227 -19082 -28665 -26280 -36991 -34354 -37924 -30405 -18532 -16279 -9950 -9084 -11466
13451a1466P116L209J1248L332j1091k252j6396O39J950J6700o076j1611m697
$$ -11466 -4350 -1141 10107 13439 2348 96 -16300 -15661 -13711 2989 -3087 -14698 -19395
13438a9395m992R182P252q925k771M611J4640M88p366N206J393m409j0086N506
$$ -19395 -24387 -15205 -7953 -16878 -19649 -15038 -398 90 -7276 -2070 -677 -5086 -15172 -9666
13424i666k609n981j6484k017O094J1496O586K3550j7702L97K747k12K760J0935
$$ -9666 -12275 -18256 -34740 -36757 -30663 -19167 -12581 10969 -6733 -6336 -3589 -3801 -1041 9894
13410I894j995j725j8533k6673j0157J704J0346L449j795J5985J1704j1399J2284
$$ 9894 7899 6174 -12359 -39032 -49189 -47485 -37139 -33690 -35485 -19500 -7796 -19195 -6911
13397f911R577j5489o945L824R282J3697l051j5587r394j2900M061J7184Q434
$$ -6911 2666 -12823 -19768 -15944 -6662 7035 3984 -11603 -20997 -33897 -29836 -12652 -4218
13384d218q192j5690N249O140j3011J4880J3372k043j1333L343j9103l0851J1371
$$ -4218 -12410 -28100 -22851 -16711 -29722 -14842 -1470 -3513 -14846 -11503 -30606 -61457 -50086
13371e0086K5623P709J3690J2152Qk1161j3045J874j2182R461J4761j1502Q846
$$ -50086 -24463 -16754 -3064 9088 9096 -12065 -25110 -23236 -35418 -25957 -11196 -22698 -13852
13358a3852J931q614j9945j5826N67J1955L621k529J8776J2917j633R056J0871
$$ -13852 -11921 -20535 -40480 -56306 -55739 -43784 -40163 -42692 -23916 -10999 -12632 -3576 7295
13345G295j9161k317L665J7879J4668K348j3633j7370n018n056k460j3361J3454
$$ 7295 -11866 -14183 -10518 7361 22029 24377 10744 -6626 -11644 -16700 -19160 -32521 -19067
13332a9067j3638J7581J0286j3115Q951K3991r164k2190K433o233K992N321l957
$$ -19067 -32705 -15124 -4838 -17953 -9002 14989 5825 -16365 -13932 -20165 -17173 -11852 -15809
13319a5809O909r926k432O249J0621p176K213p356N152R388n577n272J940J5316
$$ -15809 -8900 -18826 -21258 -15009 -4388 -11564 -9351 -16707 -11555 -2167 -7744 -13016 -11076 4240
13305D240j205r836J021N708n358J6723p487j4427j5321r921P169K3049J6067
$$ 4240 3035 -6801 -5780 -72 -5430 11293 3806 -10621 -25942 -35863 -28694 -5645 10422
13292A0422P153j7065r692j0985r092P272J2386L764q281j03J2994k877n815j1669
$$ 10422 17575 510 -9182 -20167 -29259 -21987 -9601 -5837 -14118 -14221 -1227 -4104 -9919 -21588
13278b1588P137J1746o693j1184M769J2285J841l650L119k386j404l51j2453j0351
$$ -21588 -14451 -2705 -9398 -20582 -15813 -3528 -1687 -5337 -2218 -4604 -6008 -6359 -18812 -29163
13264b9163K1077J4572O694k8605q856N450j6061p746N822J1337K863J402o528
$$ -29163 -8086 6486 13180 -15425 -24281 -18831 -34892 -42638 -36816 -25479 -22616 -21214 -27742
13251b7742o554M498J9291K1399j741o668J994J4701L642k6098j275J4208r101
$$ -27742 -34296 -29798 -10507 10892 9151 2483 4477 19178 22820 -3278 -4553 9655 554
13238E54K850p33j7113o789r539o39J2269k423L72j1191L490L567J1017K4770
$$ 554 3404 2671 -14442 -21231 -30770 -31409 -19140 -21563 -21191 -32382 -28892 -25325 -14308 10462
13224A0462R355M31m350q108l894k5738n805K1299n964M303r020j1523R249J8707
$$ 10462 19817 20248 15898 7790 3896 -21842 -27647 -6348 -12312 -8009 -17029 -28552 -19303 -596
13210e96j2079L88R523L908o918k1401j0032p1K1152Q108J789J7115j597P527
$$ -596 -12675 -12287 -2764 1144 -5774 -27175 -37207 -37278 -16126 -8018 -6229 10886 9289 16816
13196A6816K0140l125j6911r245M966K84K575J3049q450j2682l442j0263M580
$$ 16816 36956 33831 16920 7675 12641 12925 15500 28549 20099 7417 3975 -6288 -1708
13183a708J0548j6129J643J0970r90o554k6887R591J1565J0579j2081o887m370
$$ -1708 8840 -7289 -5646 5324 4334 -2220 -29107 -19516 -7951 2628 -9453 -16340 -20710
13170b0710j801P608K143J2048J6026p23j4117k743l18J0570P623k389l344J5390
$$ -20710 -22511 -14903 -12760 -712 15314 14591 474 -2269 -2587 7983 15606 13217 9873 25263
13156B5263j2684j0448n177p266K577n416k0507j2264O002l67K3827K3298O447
$$ 25263 12579 2131 -3046 -10312 -7735 -13151 -33658 -45922 -39920 -40287 -16460 6838 13285
13143A3285J4711k1906Q88P573q20p455j5038j302R534J4086r918K751R986K597
$$ 13285 27996 6090 6978 14551 13731 6276 -8762 -10064 -530 13556 3638 6389 16375 18972
13129A8972J1428q932M839l387j7339l468r577j0320M963J7805l898l784Q700
$$ 18972 30400 21468 26307 22920 5581 2113 -7464 -17784 -12821 4984 1086 -2698 6002
13116F002J8781l163j9001j5565O062P504J599j3649J3393j6186m720J0435P88
$$ 6002 24783 21620 2619 -12946 -6884 620 2219 -11430 1963 -14223 -18943 -8508 -7720
13103g720O948J1379J658l599n72K395l025j3110q262J6787Q911Q855J0114o322
$$ -7720 -772 10607 12265 8666 8094 10489 7464 -5646 -13908 2879 11790 20645 30759 24437
13089B4437l809M182k772k3017m499N339k505r249k1098q575K2404J3272j934
$$ 24437 20628 24810 22038 -979 -5478 -139 -2644 -11893 -32991 -41566 -19162 -5890 -7824
13076g824p046j3529J1806J6425j656j4707j6892K7278K2053J0933j0551m751
$$ -7824 -14870 -28399 -16593 -168 -1824 -16531 -33423 -6145 15908 26841 16290 11539
13064A1539j1734j8563j380Q670l636M321L013j4524j572j0012m583J5608L27
$$ 11539 -195 -18758 -20138 -11468 -15104 -10783 -7770 -22294 -23866 -33878 -38461 -22853 -22526
13051b2526J4753J2644r393j3906n791n58J0162R729J798J6092j8244j0456J1565
$$ -22526 -7773 4871 -4522 -18428 -24219 -24777 -14615 -4886 -3088 13004 -5240 -15696 -4131
13038d131P710n446J6421N129l807n788N18L10j2834R245R584m470O687N074k661
$$ -4131 3579 -1867 14554 19683 15876 10088 10606 10916 -1918 7327 16911 12441 19128 24202 21541
13023B1541j3714K130J7357M524j9503q062L972M009J4030L74j4062J1446M599
$$ 21541 7827 9957 27314 31838 12335 4273 8245 12254 26284 26658 12596 24042 28641
13010B8641L862j6546j4556o898J982L891k4150J309Q56L525J1530J1086j0644
$$ 28641 32503 15957 1401 -5497 -3515 376 -23774 -22465 -21609 -18084 -6554 4532 -6112
12997f112k2688R617K3509J9277o747q674N691r312q87O98L888p208j0941J2709
$$ -6112 -28800 -19183 4326 23603 16856 8182 13873 4561 3674 4372 8260 1052 -9889 2820
12983B820J3551n368j9762r291J8196J1872m116l385j4607L29K2247J3370j4115
$$ 2820 16371 11003 -8759 -18050 146 12018 7902 4517 -10090 -9761 12486 25856 11741
12970A1741j7237q530j8410o761J1613K1095J927j773P557m24j8064j397K0086
$$ 11741 -5496 -14026 -32436 -39197 -27584 -6489 -4562 -6335 1222 798 -17266 -18663 1423
12957A423K6073J2623O800j258o358j5763O10Q490o344j2759j2753q18q204n361
$$ 1423 27496 40119 46919 45661 39303 23540 24150 32640 26296 13537 784 -34 -8238 -13599
12943a3599r35L239q90k86L075J238j1559j3044k4090k469P363O005J4405J2582
$$ -13599 -14534 -11295 -12185 -12471 -9396 -8158 -19717 -32761 -56851 -59320 -51957 -45952 -31547 -18965
12929a8965m251r993P625O609K687j0320M708n266O123J9765M821k594j0746j4969
$$ -18965 -23216 -33209 -25584 -18975 -16288 -26608 -21900 -27166 -21043 -1278 3543 949 -9797 -24766
12915b4766J3165L031j2215o301j4430l389Q858J52j809J4350K1771n314q163
$$ -24766 -11601 -8570 -20785 -27086 -41516 -44905 -36047 -35895 -37704 -23354 -1583 -6897 -15060
12902a5060J4433M421J0097L979n872k8750k3419K8006J7295M275l449j5320j8745
$$ -15060 -627 3794 13891 17870 11998 -16752 -40171 -12165 5130 9405 5956 -9364 -28109
12889b8109L314K83p976J0478L199J7866O766r624k3938p359J304K689J4550J672
$$ -28109 -24795 -24512 -32488 -22010 -18811 -945 5821 -3803 -27741 -35100 -33796 -31107 -16557 -14885
12875a4885j1053j7603O884K5849q668J5950J9536O712l915k0131j0390m480j4089
$$ -14885 -25938 -43541 -36657 -10808 -19476 -3526 16010 22722 18807 -1324 -11714 -16194 -30283
12862c0283Q85Q338q643K403L4969J9870k0391n667Q461L840J569q410K629q740
$$ -30283 -29398 -21060 -29703 -27300 7669 27539 7148 1481 9942 13782 15351 6941 9570 830
12848H30q868P014k548j3353k1310M526O006m870j4838Q239J3127p587k842J2473
$$ 830 -8038 -1024 -3572 -16925 -38235 -33709 -27703 -32573 -47411 -39172 -26045 -33632 -36474 -24001
12834b4001n281P890J3111j84m004M925J3051k588q718j0903k3372o001j7089
$$ -24001 -29282 -21392 -8281 -8465 -12469 -7544 5507 2919 -5799 -16702 -40074 -46075 -63164
12821f3164O700J5264R169K2610K0755q2n693j296j3472j0871N516K5639o008
$$ -63164 -56464 -41200 -32031 -9421 11334 11252 5559 4263 -9209 -20080 -14564 11075 5067
12808E067j2687J779J2894J757j2555q217n018J6719K308j4781n814O613q59K5695
$$ 5067 -7620 -5841 7053 8810 -3745 -11962 -16980 -261 2047 -12734 -18548 -11935 -12794 12901
12794A2901p638m88J3996N039k3035l646q624j881P214j587l996J204O587R105
$$ 12901 5263 4775 18771 23810 775 -2871 -11495 -13376 -6162 -7749 -11745 -10541 -3954 5151
12780E151N13N798m850n971k693O873K538j9847j3568K0563K708k1286m058M688
$$ 5151 5664 11462 6612 641 -2052 4821 7359 -12488 -26056 -5493 -2785 -24071 -28129 -23441
12766b3441L119m866M160J4071J097J6894K949j1514j568R426j6395j3512l692
$$ -23441 -20322 -25188 -21028 -6957 -5860 11034 13983 2469 901 10327 -6068 -19580 -23272
12753b3272P63m47n978l838J4403k517J488L619K3865J1869j1055j8851O024J0173
$$ -23272 -22509 -22956 -28934 -32772 -18369 -20886 -19398 -15779 8086 19955 8900 -9951 -3927 6246
12739F246k1022R348K3539k1854L327R010j1152m312j916K4r78N434J6130l785
$$ 6246 -14776 -5428 18111 -3743 -416 8594 -2558 -6870 -8786 -8762 -9740 -4306 11824 8039
12725H039k0871q616J6295K8462M64k0773l901J1995j7724j0921p653J494J738
$$ 8039 -12832 -21448 -5153 23309 23773 3000 -901 11094 -6630 -17551 -25204 -23710 -21972
12712b1972Q074J5171r745n760P824o765n365p723K612J2127L283k30O448l853
$$ -21972 -13898 1273 -8472 -14232 -6408 -13173 -18538 -26261 -23649 -11522 -8239 -8469 -2021 -5874
12698e874L633M728p860M919J4010l894j2743j2298L863J0404N744J2551m779
$$ -5874 -2241 2487 -5373 -454 13556 9662 -3081 -15379 -11516 -1112 4632 17183 12404
12685A2404q541M82K794J853p001J158O849J0229J2629L840j5497j6534k555l593
$$ 12404 3863 4345 7139 8992 1991 3149 9998 20227 32856 36696 21199 4665 2110 -1483
12671a483K726L423l197O694o367L409Q543O087l75r042j9809j532j088k198K098
$$ -1483 1243 4666 1469 8163 1796 5205 13748 19835 19460 10418 -9391 -10923 -12011 -14209 -12111
12656a2111J6776j1690j3633K707J559O611K0523R311j8627k3564M476k958K620
$$ -12111 4665 -7025 -20658 -17951 -16392 -9781 10742 20053 1426 -22138 -17662 -20620 -18000
12643a8000J355Q436m765J663N775J5807J634M080M373n849M688l690J6935J5764
$$ -18000 -16645 -8209 -12974 -11311 -5536 10271 11905 15985 20358 14509 19197 15507 32442 48206
12629D8206q2J53O712Q537k1453k1261p459m335J1653j160o001m639p179j898
$$ 48206 48124 48277 54989 63526 42073 20812 13353 9018 20671 19511 13510 8871 1692 -206
12615b06L376k1339j0725j9675J2280J3859K1806k859l691J394K336O856J8102
$$ -206 3170 -18169 -28894 -48569 -36289 -22430 -624 -3483 -7174 -5780 -3444 3412 21514
12602B1514j302L132l698Q27j7521j4377l871R437J3232L2410P284j1367J8747
$$ 21514 20212 23344 19646 20473 2952 -11425 -15296 -5859 7373 39783 47067 35700 54447
12589E4447Q222j0886j1396p244j3015j2914l254J541P846p796j861m312j242
$$ 54447 62669 51783 40387 33143 20128 7214 3960 5501 13347 5551 3690 -622 -1864
12576a864m972j6922J2107P164J1835j0107k322p993k1350J228J2401n572n077
$$ -1864 -6836 -23758 -11651 -4487 7348 -2759 -5081 -13074 -34424 -33196 -20795 -26367 -31444
12563c1444N895J8715J480R343Q901R619q855o156P320J7965N057J9J799J2641
$$ -31444 -25549 -6834 -5354 3989 12890 22509 13654 7498 14818 32783 37840 37859 39658 52299
12549E2299K2582j177l1631k1079j2768j4783q653O954N284j319P677l525J0392
$$ 52299 74881 73704 42073 20994 8226 -6557 -15210 -8256 -2972 -4291 3386 -139 10253
12536A0253q302j001N808p509k166o119O118L471O770P138k1206M570m411p32
$$ 10253 1951 950 6758 -751 -2917 -9036 -2918 553 7323 14461 -6745 -2175 -6586 -7318
12522g318O112q72j715p250L463J9975J7830J4447L381q721j8090N564O721q58
$$ -7318 -1206 -2078 -3793 -11043 -7580 12395 30225 44672 48053 39332 21242 26806 33527 32669
12508C2669r778j9703j4621Q641J1039o904j7415N911J8016k491r409k396M807
$$ 32669 22891 3188 -11433 -2792 8247 1343 -16072 -10161 7855 5364 -4045 -6441 -1634
12495a634N594k678O358L199p480P323q96o489j2063K157j2590j5507J0744O771
$$ -1634 3960 1282 7640 10839 3359 10682 9786 3297 -8766 -6609 -19199 -34706 -23962 -17191
12481a7191J0675J585M637M864N843j5264M713k378j8444J55L403K334P315j3840
$$ -17191 -6516 -4931 -294 4570 10413 -4851 -138 -2516 -20960 -20805 -17402 -15068 -7753 -21593
12467b1593Q009k340j0273j3620J0918p76K620J3007O265o307R646j704o868L379
$$ -21593 -13584 -15924 -26197 -39817 -28899 -29675 -27055 -14048 -7783 -14090 -4444 -6148 -13016 -9637
12453i637J0594J1603j2462j556p201j721J4691J4731K107k4385k2486J471J0382
$$ -9637 957 12560 98 -1458 -8659 -10380 4311 19042 21149 -3236 -25722 -24251 -13869
12440a3869J5898J0102k83J925M21J5630N31m563j1982j2531M158n11M569J768
$$ -13869 2029 12131 11848 13773 14194 29824 30355 25792 13810 1279 5437 4926 9495 11263
12426A1263o016j0246q934n677j4023J6691Q046k0263N466p052l740o776L164
$$ 11263 5247 -4999 -13933 -19610 -33633 -16942 -8896 -29159 -23693 -30745 -34485 -41261 -38097
12413c8097J4470K135j95J0108J050K068j7199M14K3900O764q661l070r573j6472
$$ -38097 -23627 -21492 -21687 -11579 -10529 -8461 -25660 -25246 -1346 5418 -3243 -6313 -15886 -32358
12399c2358l344Q26m99R541L904j539K0865K8952q762k4722M213m433K539K332
$$ -32358 -35702 -34876 -35375 -25834 -21930 -23469 -2604 26348 17586 -7136 -2923 -7356 -4817 -2485
12385b485P44q449J66J176p900j344M370L887P957K1909Q014N665k2528r518Q836
$$ -2485 -1741 -10190 -10024 -8848 -16748 -18092 -13722 -9835 -1878 20031 28045 33710 11182 1664 10500
12370A0500k4345L91J2140M404j1566j6197m688L216N650J0027M231L412r992
$$ 10500 -13845 -13454 -1314 3090 -8476 -24673 -29361 -26145 -20495 -10468 -6237 -2825 -12817
12357a2817j0408j1009O726k207j5968n463K3590N149J3372r403J238o08J5850
$$ -12817 -23225 -34234 -27508 -29715 -45683 -51146 -27556 -22407 -9035 -18438 -17200 -17808 -1958
12344a958J1187j8715j6662j4332K557J1515O901R771K195J5959O358l026n616
$$ -1958 9229 -9486 -26148 -40480 -37923 -26408 -19507 -9736 -7541 8418 14776 11750 6134
12331F134l874p02J8640K3209P841r204k2385o087j256J274N180J2723q826k353
$$ 6134 2260 1558 20198 43407 51248 42044 19659 13572 12316 13590 18770 31493 22667 20314
12317B0314P765o544m964k163j2459m224m281J2759J6520J7401o932j4356j280
$$ 20314 28079 21535 16571 14408 1949 -2275 -6556 6203 22723 40124 33192 18836 17556
12304A7556j1714p242L720m180N25J8567J3477J2078k1861j6554Q134J5257J8711
$$ 17556 5842 -1400 2320 -1860 -1335 17232 30709 42787 20926 4372 12506 27763 46474
12291D6474p963j2955J6298k167j8863J0058J1189n150j2894M056j827J0624Q651
$$ 46474 38511 25556 41854 39687 20824 30882 42071 36921 24027 28083 26256 36880 45531
12278D5531j7527R761K1613N663m454J2695n509n7k465j6207j0548n35n200J3249
$$ 45531 28004 37765 59378 65041 60587 73282 67773 67716 65251 49044 38496 37961 32761 46010
12264D6010j611R401j5283k0274K3953o844j4711J7496O868m715o168K51o076
$$ 46010 44399 53800 38517 18243 42196 35352 20641 38137 45005 40290 34122 34373 28297
12251B8297j5758k67M471l078N174J568K251O235j697L543J3927J3458M469j1282
$$ 28297 12539 12272 16743 13665 18839 20407 22658 28893 27196 30739 44666 58124 62593 51311
12237E1311p220n618r114L679n065n965l151L52K674K2077Q090q542k1094j0969
$$ 51311 44091 38473 29359 33038 27973 22008 18857 19209 21883 43960 52050 43508 22414 11445
12223A1445J1460O971j121N08q647l603Q223R539J556q813p620M639P29R289M036
$$ 11445 22905 29876 28755 29263 20616 17013 25236 34775 36331 27518 19898 24537 25266 34555 38591
12208C8591m375J9023L591L299j7751j8324R568J1556q020j6361k679J9725P086
$$ 38591 34216 53239 56830 60129 42378 24054 33622 45178 37158 20797 18118 37843 44929
12195D4929O855j0949L704P148k0567j5082q845R142l748n342J3418L1655Q357
$$ 44929 51784 40835 44539 51687 31120 16038 7193 16335 12587 7245 20663 52318 60675
12182F0675N100n489O38R086P561L444j5437m266o767J4534J100k2238p488R095
$$ 60675 65775 60286 60924 70010 77571 81015 65578 61312 54545 69079 70179 47941 40453 49548
12168D9548N972K035Q048k444N595o865J4920J4112m649N564R273L637r021p721
$$ 49548 55520 57555 65603 63159 68754 61889 76809 90921 86272 91836 101109 104746 95725 88004
12154H8004L0021K6077j8189j1297K0237J4163K67o549l750o329O003J519O566
$$ 88004 118025 144102 125913 114616 134853 149016 149283 142734 138984 132655 138658 140177 146743
12141A46743r648j2124q50m806j1424J067L42J352J0053l832o242J9882J1895
$$ 146743 137095 124971 124121 119315 107891 108958 109300 110652 120705 116873 110631 130513 142408
12128A42408r454m643R213j363j5453o461O418J2275M796L83J804K8149J7837
$$ 142408 132954 128311 137524 136161 120708 114247 120665 132940 137736 138119 139923 168072 185909
12115A85909R288l798p9J1465m14J9203R454j2891K2107K0879j7920J2607J8728
$$ 185909 195197 191399 191320 202785 202371 221574 231028 218137 240244 261123 243203 255810 274538
12102B74538P680R144J0162j1407k0340O71K23J7600J8866J3480O620Q677K5257
$$ 274538 282218 291362 301524 290117 269777 270448 270671 288271 307137 320617 327237 335914 361171
12089C61171K9287j0544K78J3148K5339n412L391K4702M0974L4582O267m176p405
$$ 361171 390458 379914 380192 393340 418679 413267 416658 441360 482334 516916 523183 519007 511602
12076E11602J5010J6273J5780L1366J8444K3018K4180J1936J7748K2833L2718
$$ 511602 526612 542885 558665 590031 608475 631493 655673 667609 685357 708190 740908
12065G40908K6885K7311L2006M7504N0689K6326M9870N2172M0069M9814Q3132
$$ 740908 767793 795104 827110 874614 925303 951629 1001499 1053671 1093740 1143554 1226686
12054A226686O9069L1681N3871P3010R2434R6178J21208J45116J52029J50661
$$ 1226686 1295755 1327436 1381307 1454317 1546751 1642929 1764137 1909253 2061282 2211943
12044B211943J56886J80019J99688K22473K65564L43760L67344M22127M71618
$$ 2211943 2368829 2548848 2748536 2971009 3236573 3580333 3947677 4369804 4841422
12035D841422N42299O34144P79625R17611J097891J309692J593205J945655K337262
$$ 4841422 5383721 6017865 6797490 7715101 8812992 10122684 11715889 13661544 15998806
12026A5998806K848790L410279L943342M343954M399760L927844K911919J403975
$$ 15998806 18847596 22257875 26201217 30545171 34944931 38872775 41784694 43188669
12018D3188669l15684j832176k942228l571986l833140l751691l430913l026270
$$ 43188669 42872985 41040809 38098581 34526595 30693455 26941764 23510851 20484581
12010B0484581k590528k161131j816463j522364j276125j069226q98057p77437
$$ 20484581 17894053 15732922 13916459 12394095 11117970 10048744 9150687 8373250
12002H373250o49928n54953m69150m12255l42453l08295k66826k23974j91986
$$ 8373250 7723322 7168369 6699219 6286964 5944511 5636216 5369390 5145416 4953430
11993D953430j95642j88374j83934j62775j27266r8179o6816q8145r9130r1022
$$ 4953430 4757788 4569414 4385480 4222705 4095439 3997260 3930444 3842299 3743169 3652147
11983C652147j00111q2425r1602j10515j19904j32706j25146j11472j16537j13943
$$ 3652147 3552036 3469611 3378009 3267494 3147590 3014884 2889738 2778266 2661729 2547786
11973B547786j13685j05659j18104j02532r7180r3614r3972q6588o5812n1903
$$ 2547786 2434101 2328442 2210338 2107806 2010626 1917012 1823040 1736452 1670640 1618737
11963A618737p0970p5327p3303n3110m9819l7638l4997m2610o2199l2680m1055
$$ 1618737 1547767 1472440 1399137 1346027 1296208 1258570 1223573 1180963 1118764 1086084 1045029
11952A045029l7016P333j4009m1555l4318l9994m2156l8794l9962m3773m0005
$$ 1045029 1008013 1015346 1001337 959782 925464 885470 843314 804520 764558 720785 680780
11941F80780l4409q264j3130m6008l2287j1841k5508j7726l704k3468l2848r501
$$ 680780 646371 638107 624977 578969 546682 534841 509333 491607 487903 464435 431587 422086
11929D22086j5676l187J933j7205j8963l0271q509N671j4916j8406j0441k2497
$$ 422086 406410 403223 405156 387951 368988 338717 330208 335879 320963 302557 292116 269619
11917B69619K3522J0470k1972k031p565j4986M938K1782k982Q44O841p63M287
$$ 269619 293141 303611 281639 279608 272043 257057 261995 283777 280795 281639 288480 287717 292004
11904B92004n193N721J9101n969l2847N005m55j1722j0677j0145J3260k010j4635
$$ 292004 286811 292532 311633 305664 272817 277822 277367 265645 254968 244823 258083 256073 241438
11891B41438j5179j7196j6018k5900O28r220K546J5234j5457j4003R737j789k0004
$$ 241438 226259 209063 193045 167145 167773 158553 161099 176333 160876 146873 156610 154821 134817
11878A34817r224J002j115j1616o239j4641J499K0150J0942p145j6151j7963m435
$$ 134817 125593 126595 125480 113864 107625 92984 94483 114633 125575 118430 102279 84316 79881
11865G9881J7661J4887p821o187J2597m677n918K358L738P004m110l0188P928
$$ 79881 97542 112429 104608 98421 111018 106341 100423 102781 106519 113523 109413 79225 87153
11852H7153R340m658N540J2661N747k678r815k064J765J432n899k9481r043m276
$$ 87153 96493 91835 97375 110036 115783 113105 103290 101226 102991 104423 98524 69043 60000 55724
11838E5724Q182K6754K4761L551n225J3240J3254j5994k7788M315n801m74R939
$$ 55724 63906 90660 115421 118972 113747 126987 140241 124247 96459 100774 94973 94499 104438
11825A04438M900o662r005o713L728K673j014J0713O494j4241j6002K205J452
$$ 104438 109338 102676 93671 86958 90686 93359 92345 103058 109552 95311 79309 81514 82966
11812H2966r155l207J0528r373j1067L659J8534n240j4514q437J18J3170R483
$$ 82966 73811 70604 81132 71759 60692 64351 82885 77645 63131 54694 54812 67982 77465
11799G7465n2k305j4942O328J5678o153r62r378k9023p307K2919J2895q316r627
$$ 77465 77413 75108 60166 66494 82172 76019 75057 65679 36656 29349 52268 65163 56847 47220
11785D7220O662l733j0158K986R006j0593m988O720l720j7245j7145l157l774
$$ 47220 53882 50149 39991 42977 51983 41390 36402 43122 39402 22157 5012 1855 -1919
11772a919N611M554M989K333J2558k176m517P209j6318O160J5428Q065k2810o563
$$ -1919 3692 8246 13235 15568 28126 25950 21433 28642 12324 18484 33912 41977 19167 12604
11758A2604o747O834R483q700P222j9547p979M577O318Q056J6997O249p049j7137
$$ 12604 5857 12691 22174 13474 20696 1149 -6830 -2253 4065 12121 29118 35367 28318 11181
11744A1181p53J8919r062N737Q318j5060L238k423m162q943o899M08o247j2909
$$ 11181 10428 29347 20285 26022 34340 19280 22518 20095 15933 6990 91 499 -5748 -18657
11730a8657j560K8266N108j0452j683j28j7679J6585J5241l710L255j78l437Q56
$$ -18657 -20217 8049 13157 2705 1022 894 -16785 -200 15041 11331 14586 14408 10971 11827
11716A1827q357N390J0438J1017r907k2248j680N410N076L075k655R735J9285
$$ 11827 3470 8860 19298 30315 20408 -1840 -3520 1890 6966 10041 7386 17121 36406
11703C6406k1926q098P530k1594M123Q418j743Q619J149k01M579M50N195R71j629
$$ 36406 14480 6382 13912 -7682 -3559 4859 3116 11735 12884 12683 17262 17712 22907 23878 22249
11688B2249J812J9393p62p729j0004j484N82j0054j3950K049J1417K049N000j038
$$ 22249 24061 43454 42692 34963 24959 23475 24057 14003 53 2102 13519 15568 20568 19530
11674A9530J339j858J6405p446o604j575q409J3388j3264j5254j8582L454K0421
$$ 19530 20869 19011 35416 27970 21366 19791 11382 24770 11506 -3748 -22330 -18876 1545
11661A545M055j326j2634J4878O377p307p109J621r923J0306J5099L659P380J0572
$$ 1545 5600 4274 -8360 6518 12895 5588 -1521 100 -9823 483 15582 19241 26621 37193
11647C7193K482r070p482r229j802j6805k1025J2511J8022M361l67J748J0592
$$ 37193 39675 30605 23123 13894 12092 -4713 -25738 -13227 4795 9156 8789 10537 21129
11634B1129o021k2373j6421J8350P307J778N777J2849j1514o479J6413P944m475
$$ 21129 15108 -7265 -23686 -5336 1971 3749 9526 22375 10861 4382 20795 28739 24264
11621B4264k7102j3508J6905N053j170Q542J8880P147o277k1857j1485k478j886
$$ 24264 -2838 -16346 559 5612 4442 12984 31864 39011 32734 10877 -608 -3086 -4972
11608d972k349j0704p244K849n773J6664Q667p187O682K382k022o140j2174K413
$$ -4972 -7321 -18025 -25269 -22420 -28193 -11529 -2862 -10049 -3367 -985 -3007 -9147 -21321 -18908
11594a8908J9365m055K660Q304k4129j4376L154M401K8212J4596n610j5996p248
$$ -18908 457 -3598 -938 7366 -16763 -31139 -27985 -23584 4628 19224 13614 -2382 -9630
11581i630N880R198J1895k541q31J614j2932j7245J872J3645J4648J4820n342
$$ -9630 -3750 5448 17343 14802 13971 15585 2653 -14592 -12720 925 15573 30393 25051
11568B5051j5370N004N030j2463m915K4882J847J1388L262j4672j7482p997m368
$$ 25051 9681 14685 19715 7252 2337 27219 29066 40454 43716 29044 11562 3565 -803
11555h03k2682j5121O878O032P084M647P654Q022j5076j624O221j760J5625q163
$$ -803 -23485 -38606 -31728 -25696 -18612 -13965 -6311 1711 -13365 -14989 -8768 -10528 5097 -3066
11541c066o211P706K005J0016q669j3715o591J9082l299p354K250L0598m40k1226
$$ -3066 -9277 -1571 434 10450 1781 -11934 -18525 557 -2742 -10096 -7846 22752 22312 1086
11527A086k234Q667j2964N445k34N728J2744O976p566m086o598m528r627j0452
$$ 1086 -1148 7519 -5445 0 -234 5494 18238 25214 17648 13562 6964 2436 -7191 -17643
11513a7643j2586O52K031M741J6071J7785K840q014K566J0122k849l338p465k812
$$ -17643 -30229 -29577 -27546 -22805 -6734 11051 13891 5877 8443 18565 15716 12378 4913 2101
11499B101Q36l115N039j3184R247J449n178K428j724R690R99j2713J207K5498
$$ 2101 2937 -178 4861 -8323 924 2373 -2805 -377 -2101 7589 8588 -4125 -2918 22580
11485B2580K1457j4727j6195j811O609k157j1906j7226J5069j2166j6886R083
$$ 22580 44037 29310 13115 11304 17913 15756 3850 -13376 1693 -10473 -27359 -18276
11473a8276m81P309N119J6205J1319M063q313m219M325O493L274j054q697p118
$$ -18276 -18757 -11448 -6329 9876 21195 25258 16945 12726 17051 23544 26818 25764 17067 9949
11459I949j7348Q431J7609N385j215J2826j6359j9325o476R220K0806j2830j0903
$$ 9949 -7399 1032 18641 24026 22811 35637 19278 -47 -6523 2697 23503 10673 -230
11446b30K819n57k133k4o893j0400p757n166J2417L6369L1931l032k2001r135
$$ -230 2589 2032 -101 -125 -7018 -17418 -25175 -30341 -17924 18445 50376 47344 25343 16208
11432A6208K683P028o130m193O472R765L097l512J8896K666j1688K0786L319l4213
$$ 16208 18891 25919 19789 15596 22068 31833 34930 31418 50314 52980 41292 62078 65397 31184
11418C1184j7968K2630J5891K352N71q57R384J1184J3194j9923n118j5804q545
$$ 31184 13216 35846 51737 54089 54660 53803 63187 74371 87565 67642 62524 46720 38175
11405C8175P168r527o958Q309p66q255j6085R1m991L268l933J0514K59k0661q26
$$ 38175 45343 35816 28858 37167 36401 28146 12061 12152 7161 10429 6496 17010 17269 -3392 -4218
11390d218J3031J5511K662J0399N819J720n842j1666n190J0207K883M400P415
$$ -4218 8813 24324 26986 37385 43204 44924 39082 27416 22226 32433 35316 39716 47131
11377D7131O174j1235P56J6507J5226J3864J0556J9417p283j1387k303K729j0155
$$ 47131 53305 42070 42826 59333 74559 88423 98979 118396 111113 99726 97423 100152 89997
11364H9997R477L444r96j5727r888q748j5154j2473j7461K982K3821P786o249
$$ 89997 99474 102918 101922 86195 76307 67559 52405 39932 22471 25453 49274 57060 50811
11351E0811o138j3792j5343O828J688k0001o683J4449J7691O306P21J0884j088
$$ 50811 44673 30881 15538 22366 24054 4053 -2630 11819 29510 35816 36537 47421 46333
11338D6333m83O759O055N237k233K432K515L484p498L411N52m155R412l68k521
$$ 46333 45850 52609 58664 63901 61668 64100 66615 70099 62601 66012 66564 62409 71821 71453 68932
11323F8932Q341j798Q74p819q976O635K990j2775j2715K259l093j8356j5230Q172
$$ 68932 77273 75475 76349 68530 59554 66189 69179 56404 43689 45948 42855 24499 9269 17441
11309A7441J3775Q465R716p701m55J236j991r019j0938j4989M525J16r67Q132
$$ 17441 31216 39681 49397 41696 41241 42477 40486 31467 20529 5540 10065 10181 9214 17346
11295A7346K323J0221J1889j7137K004K1356j4414r343J773K54l169N040k025
$$ 17346 19669 29890 41779 24642 26646 48002 33588 24245 26018 26272 23103 28143 26118
11282B6118o390J2780J1779r385r055m431L107J4112J323k3894n553j2151p62
$$ 26118 19728 32508 44287 34902 25847 21416 24523 38635 39958 16064 10511 -1640 -2402
11269b402J8046J0575j225J2174l751J126l887J182R466J467k976J1834j6892
$$ -2402 15644 26219 24994 37168 33417 34543 30656 31838 41304 42771 39795 51629 34737
11256C4737j3598K028K084j5229m151J9405J3846l298j9914r382r504P726J1014
$$ 34737 21139 23167 25251 10022 5871 25276 39122 35824 15910 6528 -2976 4750 15764
11243A5764J7254N187J2367j1475n080k2376j853J2702m639K891k052j0144M308
$$ 15764 33018 38205 50572 39097 34017 11641 9788 22490 17851 20742 18690 8546 12854
11230A2854J5140k597r010l944M520J2085J3555o870m928j8655k175j895n177
$$ 12854 27994 25397 16387 12443 16963 29048 42603 35733 30805 12150 9975 8080 2903
11217B903K011J0764J5392J8636L854J7083o335k2451k3271Q822J7180R681J8678
$$ 2903 4914 15678 31070 49706 53560 70643 64308 41857 18586 27408 44588 54269 72947
11204G2947N439o129r314j0726p734O633m103j1380k005m085P485N357j5739k1503
$$ 72947 78386 72257 62943 52217 44483 51116 47013 35633 33628 29543 37028 42385 26646 5143
11190E143J0859J5084J4057j934j0843J3031J6581L959n287j1530j3854j7470
$$ 5143 16002 31086 45143 43209 32366 45397 61978 65937 60650 49120 35266 17796
11178A7796j0604J4767M288j4049J5324j759Q234Q490kn055J8899L150k2565L073
$$ 17796 7192 21959 26247 12198 27522 25763 33997 42487 42485 37430 56329 59479 36914 39987
11164C9987J3476K5768j112p937p80K962O880l107r648j0425k5584r515p25Q274
$$ 39987 53463 79231 78119 70182 69402 72364 79244 76137 66489 56064 30480 20965 20240 28514
11150B8514p056K401N355q554q191R84j1693N114J6415Q691j037k473O591J5250
$$ 28514 21458 23859 29214 20660 12469 13453 1760 6874 23289 31980 30943 28470 35061 50311
11136E0311N657J3316j473k0272N850K1328k178j3685O741K0448O833J690r459
$$ 50311 55968 69284 67811 47539 53389 74717 72539 58854 65595 86043 92876 94566 85107
11123H5107n603j8674K302J1870j0037j1770O068L418J2592J8490k392k375n43
$$ 85107 79504 60830 63132 75002 64965 53195 59263 62681 75273 93763 91371 88996 88453
11110H8453r111n578K6376K6296Q788J8324J2186J4510J3868O574J598K1696K9933
$$ 88453 79342 73764 100140 126436 135224 153548 165734 180244 194112 200686 202284 223980 253913
11097B53913M9143L3346M6991M0871O2872M9046K6920M8215O3799O2556N9031
$$ 253913 303056 336402 383393 424264 487136 536182 563102 611317 675116 737672 796703
11086G96703N9354K9850J8418J7212r869k6051k2442k2091m8900m7389m8294k1855
$$ 796703 856057 885907 904325 921537 911668 885617 863175 841084 792184 744795 696501 674646
11074F74646j6658k6149m0349k0360P80m767j9691o036n957J7452K3477L1490
$$ 674646 657988 631839 591490 571130 571910 567143 547452 541416 535459 552911 576388 607878
11062F07878N0707M9471M0442L8379O7055O2106R9306J25291J45460K03496K32319
$$ 607878 658585 708056 748498 786877 853932 916038 1015344 1140635 1286095 1489591 1721910
11051A721910K60306K87598L10507L22693L28437L45589L49538L23608K96593
$$ 1721910 1982216 2269814 2580321 2903014 3231451 3577040 3926578 4250186 4546779
11042D546779K63357K01094J28309L7456l3626j38657k06238k35125k53628k77125
$$ 4546779 4810136 5011230 5139539 5176995 5143369 5004712 4798474 4563349 4309721 4032596
11032D032596k71278k89655k73375k56302k23863j84649j45600j10166p6415n8825
$$ 4032596 3761318 3471663 3198288 2941986 2718123 2533474 2387874 2277708 2201293 2142468
11022B142468l4015k557L2402K3838L5923N0511Q2618J13888J30341J63722J96467
$$ 2142468 2108453 2105896 2138298 2162136 2198059 2248570 2331188 2445076 2575417 2739139 2935606
11011B935606K81254L40220M04607M83197O06672P01896P78481Q51471Q91412
$$ 2935606 3216860 3557080 3961687 4444884 5051556 5753452 6531933 7383404 8274816
11002H274816R17907R07562Q85177Q19328P15636N69860L45799J13671j45355
$$ 8274816 9192723 10100285 10985462 11804790 12520426 13090286 13436085 13549756 13404401
10993A3404401l83809n65429o67812p66018q18376q53618q35090p96916p35320
$$ 13404401 13020592 12455163 11787351 11021333 10202957 9349339 8514249 7717333 6982013
10984F982013o48994n65526m61037l65524l27281k46454j85634j17858p8116l7204
$$ 6982013 6333019 5767493 5306456 4940932 4613651 4367197 4181563 4063705 3985589 3948385
10974C948385k2155J3015N7101R9807J37790K13746K56895L15508L98783M92168
$$ 3948385 3926230 3939245 3996346 4096153 4233943 4447689 4704584 5020092 5418875 5911043
10964E911043O14740P42479Q62085J020299J136282J229784J266361J233451J187654
$$ 5911043 6525783 7268262 8130347 9150646 10286928 11516712 12783073 14016524 15204178
10955A5204178J111385J006646Q29264N84380K69306j14114m62403p51302r30877
$$ 15204178 16315563 17322209 18151473 18735853 19005159 18891045 18428642 17677340 16746463
10946A6746463j043654j147569j227480j243247j199441j118019j013785q92200
$$ 16746463 15702809 14555240 13327760 12084513 10885072 9767053 8753268 7861068
10938G861068p44887o14048m96697m22684l17333k61194j99679j66339j24708
$$ 7861068 7116181 6502133 6005436 5582752 5265419 5004225 4804546 4638207 4513499
10929D513499p5017k2489J8349N5957Q8611J51600K11926K57054L22612M03005
$$ 4513499 4438482 4415993 4434342 4490299 4578910 4730510 4942436 5199490 5522102 5925107
10919E925107M87723O18003P22762Q04182Q61150R35224R41550R11470Q35506
$$ 5925107 6412830 7030833 7753595 8557777 9418927 10354151 11295701 12207171 13042677
10910A3042677P55581O27851M53286K26095l3133l26938n55389o94709q17476
$$ 13042677 13798258 14426109 14879395 15105490 15072357 14745419 14190030 13495321 12677845
10901A2677845q97947r49568r57045r61456r28993q46478p57162o52572n31481
$$ 12677845 11779898 10830330 9873285 8911829 7982836 7136358 6379196 5726624 5195143
10892E195143m53794l76524l01352k47238k02740j58230j15432j09296r3107n9465
$$ 5195143 4741349 4364825 4063473 3816235 3613495 3455265 3339833 3230537 3137430 3077965
10882C077965k8077j3405P825L2950N9269J11639J18082J55550K02268K58367
$$ 3077965 3049888 3036483 3044308 3077258 3136527 3248166 3366248 3521798 3724066 3982433
10872C982433L04893L18539L17762L35105L42765L29805K78702K35317J48221
$$ 3982433 4287326 4605865 4923627 5258732 5601497 5931302 6210004 6445321 6593542
10863F593542P0461j1919j27607k30244k80260l26866l73156l82990l98841m12857
$$ 6593542 6664003 6652084 6524477 6294233 6013973 5687107 5313951 4930961 4532120 4119263
10853D119263l99628l75136l33288k91533k51197k02028j64508j60939j31780
$$ 4119263 3719635 3344499 3011211 2719678 2468481 2266453 2101945 1941006 1809226
10844A809226j21620r5287o5729o6406o0889m1404n2732o7137l4214j069J556
$$ 1809226 1687606 1592319 1526590 1460184 1399295 1357891 1305159 1238022 1203808 1202739 1204295
10833A204295o183j5662K3593K8841K9733K1276Q660L5366L9369L3524K7305L5806
$$ 1204295 1198112 1182450 1206043 1234884 1264617 1285893 1294553 1329919 1369288 1402812 1430117 1465923
10821A465923K5680J7313j8978p306k5519n2087m6978p3696r2935o3838p2304
$$ 1465923 1491603 1508916 1489938 1482632 1457113 1405026 1358048 1284352 1191417 1127579 1055275
10810A055275q1112o8462o0566p3371q1881o4860l4910k1923m2166l8472j7015
$$ 1055275 974163 905701 845135 771764 689883 625023 590113 568190 526024 487552 470537
10799D70537k1059j8747N963j3939j2974q415j8083k5037p875o508o266l0122
$$ 470537 449478 430731 436694 422755 409781 401366 383283 358246 350371 343863 337597 307475
10787C07475m705K105p135j7768q371J580o320j3973K085R731j7934j5470j2664
$$ 307475 302770 304875 297740 279972 271601 273181 266861 252888 254973 264704 246770 231300 218636
10774B18636j7666j3617p06j8329J047J836R380r443J058j5400P683M664j0499
$$ 218636 200970 187353 186647 168318 169365 171201 180581 171138 172196 156796 164479 169143 158644
10761A58644k2047r905J222L163J2276M666r110l935J2130Q662j7060k7201q783
$$ 158644 136597 126692 127914 131077 143353 148019 138909 134974 147104 155766 138706 111505 102722
10748A02722o18J7617K4827Q021O668k4071o415J4133j4037j7307k3M228R971
$$ 102722 102104 119721 144548 152569 159237 135166 128751 142884 128847 111540 111517 115745 125716
10735A25716R757j627J759M083j3045k534p040o287M188Q843j2000J034R100J638
$$ 125716 135473 133846 135605 139688 126643 124109 117069 110782 114970 123813 111813 112847 121947 123585
10721A23585j1237J3919J5563l726q100j3357k723P505Q435j7511j3094m259M742
$$ 123585 112348 126267 141830 138104 130004 116647 113924 121429 129864 112353 99259 95000 99742
10708I9742J7975J7399N558n666o765p831j4505M79L860m360j0642J7251J3221
$$ 99742 117717 135116 140674 135008 128243 120412 105907 106386 110246 105886 95244 112495 125716
10695A25716n083j8796r07j3215n945R813R137M944m226l629j0149J0885q31O404
$$ 125716 120633 101837 100930 87715 81770 91583 100720 105664 101438 97809 87660 98545 97714 104118
10681A04118l461k004l310k358J177J0340J5487K8838j6309j7580L5593K5378
$$ 104118 100657 98653 95343 92985 94162 104502 119989 148827 132518 114938 150531 175909
10669A75909j1392K815p859m794N156J5452J528J7032j2954k4578J3458K8477
$$ 175909 164517 167332 159473 154679 159835 175287 176815 193847 180893 156315 169773 198250
10657A98250J4536R167m801j2059O702l310m939J3005K1332K7582l923k64n785
$$ 198250 212786 221953 217152 205093 211795 208485 203546 216551 237883 265465 261542 261278 255493
10644B55493K0530K1107J1372L002O896J9434J5290J5406L3009M2589L1722L3433
$$ 255493 276023 297130 308502 311504 318400 337834 353124 368530 401539 444128 475850 509283
10632E09283O0936P0483N5460N6630O0601N8293P6345J02503J53967J99469K52370
$$ 509283 570219 640702 696162 752792 813393 871686 948031 1050534 1204501 1403970 1656340
10621A656340L34451M27925N37576P00994Q67624J050685J134600J019009O36279
$$ 1656340 1990791 2418716 2956292 3657286 4524910 5575595 6710195 7729204 8365483
10612H365483J95189q7517j43113J0505K78230O30930J081270J542095J984738
$$ 8365483 8560672 8473155 8330042 8340547 8618777 9249707 10330977 11873072 13857810
10603A3857810K165091J799742P97321l96872j038032j033023o71510j28013N27133
$$ 13857810 16022901 17822643 18619964 18223092 17185060 16152037 15480527 15352514 15879647
10594A5879647J217134J892903K435769K569978J814452J41842j554263k343214
$$ 15879647 17096781 18989684 21425453 23995431 25809883 25951725 24397462 22054248
10586B2054248k286116j813167j174366m69249J95187P70129J132650J167692
$$ 22054248 19768132 17954965 16780599 16311350 16506537 17276666 18409316 19577008
10578A9577008N74958o10455j660878k055538j889214j501227j066942o43513
$$ 19577008 20151966 19541511 17880633 15825095 13935881 12434654 11367712 10724199
10570A0724199k70208m492J73985J33973j39249o05970r70939j108852j061918
$$ 10724199 10453991 10449499 10623484 10757457 10618208 10012238 9041299 7932447 6870529
10561F870529q98659p25285n64780m28037l48858k94751k36100j93799j68577
$$ 6870529 5971870 5246585 4681805 4253768 3904910 3610159 3374059 3180260 3011683
10552C011683j40666j32921j24609j27736j26628p4254p7846q8195p4096p1238
$$ 3011683 2871017 2738096 2613487 2485751 2359123 2284869 2207023 2118828 2044732 1973494
10542A973494o0067n1212p3359p5974q2570o2535k7993l8798n4388o6478l5445
$$ 1973494 1913427 1862215 1788856 1712882 1630312 1567777 1539784 1500986 1446598 1380120 1344675
10531A344675m4620o2665l6720k9417n5093m9126m0338m5857n9166n2060n6968
$$ 1344675 1300055 1237390 1200670 1171253 1116160 1067034 1026696 980839 921673 869613 812645
10520H12645k5783l6961m3300m5750k9421l5243k1350j1218j1396k9005k5951
$$ 812645 786862 749901 706601 660851 631430 596187 574837 563619 552223 523218 497267
10509D97267l3415j8055j485l188j5673k2320k3703k9899j5768o453o365p622
$$ 497267 463852 445797 444312 441124 425451 403131 379428 349529 333761 327308 320943 313321
10497C13321k849M086j7772j235J4358P853j3300j1094m546Q543o052R42J3175
$$ 313321 310472 314558 296786 295551 309909 317762 304462 293368 288822 297365 291313 292255 305430
10484C05430R310l133K785j4643j3981k0853j1489j6415j7772j640j1994j0892
$$ 305430 314740 311607 314392 299749 285768 264915 253426 237011 219239 217599 205605 194713
10472A94713L56j9850j5410j1584q328q433o245j7760J311K5670J5280j4651l07
$$ 194713 195069 175219 159809 148225 139897 131464 125219 107459 108770 134440 149720 135069 134762
10459A34762J563R92L465K1856k155j5661o666p960P60J394r701J7400R642j5238
$$ 134762 136325 137317 140782 162638 160483 144822 138156 130196 130956 132350 122649 140049 149691 134453
10445A34453l711L030m898L686J4734L964j06R707p439j0256n434k238L060L815
$$ 134453 130742 133772 128874 132560 147294 151258 151152 160859 153420 143164 137730 135492 138552 142367
10431A42367l535q225l5419j1644J2915p58j0043o838N151L647j8319j2468J8430
$$ 142367 138832 130607 95188 83544 96459 95701 85658 78820 83971 87618 69299 56831 75261
10418G5261K7631m970k1003r532L1680K5536l832l999N10R069N725j0021j0028
$$ 75261 102892 97922 76919 67387 99067 124603 120771 116772 117282 126351 132076 122055 112027
10405A12027k2815m781Q706J5055P39J209R099Q151n348m950k35K681n955J137
$$ 112027 89212 84431 93137 108192 108931 110140 119239 127390 122042 117092 116857 119538 113583 114720
10391A14720P414J886j8050J0382K1566J480j205Q165J7688j2261k4705k0031
$$ 114720 122134 124020 105970 116352 137918 139398 138193 146358 164046 151785 127080 107049
10379A07049o97R214J7739k6055k0704j5496O124P212J1074j5987j3566Q79J6496
$$ 107049 106352 115566 133305 107250 86546 71050 77174 84386 95460 79473 65907 66786 83282
10366H3282J4009L676j1772j9040O930K639j9206M4L582K722m540k669J8165J6500
$$ 83282 97291 100967 89195 70155 77085 79724 60518 60562 64144 66866 62326 59657 77822 94322
10352I4322k75k4808l931J1672J211j6719R841J1690P874j4216N895J434j1009
$$ 94322 94047 69239 65308 76980 78191 61472 71313 83003 90877 76661 82556 83990 72981
10339G2981J9721j677p063O760k2957j5971k4477n391q644l013Q77J1023J2601
$$ 72981 92702 91025 83962 90722 67765 51794 27317 21926 13282 10269 11146 22169 34770
10326C4770p790n177o512J4465K216J3728j4955k0041l53j077L763L705N756M660
$$ 34770 26980 21803 15291 29756 31972 45700 30745 10704 10351 9274 13037 16742 22498 27158
10312B7158j057j652m612j2463j9909l977J6968J8767k28K71j2841J1306L6279
$$ 27158 26101 24449 19837 7374 -12535 -16512 456 19223 18995 19266 6425 17731 54010
10299E4010Q947M40M189k1846j0936k245J952J4555O171j0652j0482R774q470
$$ 54010 62957 63397 67586 45740 34804 32559 34511 49066 55237 44585 34103 43877 35407
10286C5407j0808N914p792K32J1980n963K793O915m980M758M162P104q243r865
$$ 35407 24599 30513 22721 22953 34933 28970 31763 38678 33698 38456 42618 49722 41479 31614
10272C1614r915L095n09P09K539J7386J266o24k754l177j8825l377J1359m538
$$ 31614 21699 24794 24285 24994 27533 44919 46185 45561 42807 39630 20805 17428 28787 24249
10258B4249N122K1478O348J1319n468j712m523k1608o272N614Q860L671j7260
$$ 24249 29371 50849 57197 68516 63048 61336 56813 35205 28933 34547 43407 47078 29818
10245B9818j8353P923J8235O035j6655k1779L39N561J0756q783j9707R5O627J556
$$ 29818 11465 19388 37623 43658 27003 5224 5563 11124 21880 13097 -6610 -6515 112 1668
10231A668p366j0822k1279K843N768K2804L0535m985p92J4258L723p290o603j3336
$$ 1668 -5698 -16520 -37799 -34956 -29188 -6384 24151 19166 18374 32632 36355 29065 22462 9126
10217I126j507R717K6738J0196k0358N995r125j1785O639J2289L243Q05m883j7466
$$ 9126 7619 17336 44074 54270 33912 39907 30782 18997 25636 37925 41168 41973 37090 19624
10203A9624j7401n478J8176N442J7221K32L212J487j1415j7141r054k538N577
$$ 19624 2223 -3255 14921 20363 37584 37816 41028 42515 31100 13959 4905 2367 7944
10190G944r529j4337L009J6152K748p973R791Q896Q014K2115J0090O965J2028
$$ 7944 -1585 -15922 -12913 3239 5987 -1986 7805 16701 24715 46830 56920 63885 75913
10177G5913n799L757L30M960j2816k369J4241O01J1094n362Q025L772J1327P587
$$ 75913 70114 73871 74201 79161 66345 63976 78217 78818 89912 84550 92575 96347 107674 115261
10163A15261p696j4254j7561o867J9522J4515J5665K1536M042q0M06Q199Q151
$$ 115261 107565 93311 75750 68883 88405 102920 118585 140121 144163 144083 144489 152688 160839
10150A60839k1832j0308j2308j1032l690n967J6212K875J72k0726q463p35n586
$$ 160839 139007 128699 116391 105359 101669 95702 111914 114789 114961 94235 85772 85037 79451
10137G9451J5749J5822o912j5355j3441o761m654Q217k203m538L177j0204m529
$$ 79451 95200 111022 104110 88755 75314 68553 63899 72116 69913 65375 68552 58348 53819
10124E3819j2379l8276j2536J8522J9646L630J2624P558o722q957j9592m6N285
$$ 53819 41440 3164 -9372 9150 28796 32426 45050 52608 45886 36929 17337 17291 22576
10111B2576N245p769M607K2460O736j2761N041j0023l5738J211P821K4029K024
$$ 22576 27821 20052 24659 47119 53855 41094 46135 36112 374 1585 9406 33435 35459
10098C5459l519j042K49k2699j3633K711j674J421k703Nj5017j1029J7776Q419
$$ 35459 31940 30898 31147 8448 -5185 -2474 -4148 -2727 -5430 -5425 -20442 -31471 -13695 -5276
10084e276L690L2617M633j6788r941j5872j966J8262O853j8586k1552J9268K3062
$$ -5276 -1586 31031 35664 18876 8935 -6937 -8903 9359 16212 -2374 -23926 -4658 18404
10071A8404j9113p989J742j3533P854k7938O554P150k615Q235K2752N251J243
$$ 18404 -709 -8698 -6956 -20489 -12635 -40573 -34019 -26869 -29484 -21249 1503 6754 7997
10058G997j3259k03N741K271N936k117j2155R483M762j0203j638l042N045K283
$$ 7997 -5262 -5465 276 2547 8483 6366 -5789 3694 8456 -1747 -3385 -6427 -1382 901
10044I01j236N420q385j0961l675J2814o568L835L345m238j1380n916L908Q595
$$ 901 -335 5085 -3300 -14261 -17936 -5122 -11690 -7855 -4510 -8748 -20128 -26044 -22136 -13541
10030a3541J4651m06l327R889K342l840n763m848J0648J3474q701j0765N421j4718
$$ -13541 1110 704 -2623 7266 9608 5768 5 -4843 5805 19279 10578 -187 5234 -9484
10016i484r586P065M447o417j726j0664Q13K59l653q325J1078J4107J8622J5896
$$ -9484 -19070 -12005 -7558 -13975 -15701 -26365 -25552 -25293 -28946 -37271 -26193 -12086 6536 22432
10002B2432q000N90J2058R982M91l788r472j35j5550m715p219P312J6032J4488
$$ 22432 14432 15022 27080 37062 37553 33765 24293 24158 8608 3893 -3326 3986 20018 34506
9988C4506j2316j2903l909q464J91R154J470J0292K80j8725k973j2900j853L422
$$ 34506 22190 9287 5378 -3086 -2895 6259 7729 18021 18301 -424 -3397 -16297 -18150 -14728
9974a4728K0875K2115j2251j3137J02k105L107j441N140J743k2402O695m672m916
$$ -14728 6147 28262 16011 2874 2976 871 3978 2537 7677 9420 -12982 -6287 -10959 -15875
9960a5875O320J1807J5229J1168L682k323r355n382j1146k590l416J3608J5411
$$ -15875 -9555 2252 17481 28649 32331 30008 20653 15271 4125 1535 -1881 11727 27138
9947B7138K621j2896j3073J1471N330q392o950m793K6632m115p609j3589j15J8072
$$ 27138 29759 16863 3790 15261 20591 12199 5249 456 27088 22973 15364 1775 1660 19732
9933A9732l637m856P335N596j420o229J10J3953K748j0180l2417l193Q715L563
$$ 19732 16095 11239 18574 24170 22750 16521 16631 30584 33332 23152 -9265 -12458 -3743 -180
9919a80K577J2057K3010p306k4349j8939J0568r428j1274J0801J2162r44k241
$$ -180 2397 14454 37464 30158 5809 -13130 -2562 -11990 -23264 -12463 -301 -1245 -3486
9906c486J2976L927j291M34k2052j0607n02R411n06J444M130J520j689J645Q902
$$ -3486 9490 13417 12126 12560 -9492 -20099 -20601 -11190 -11696 -10252 -6122 -4602 -6291 -4646 4256
9891D256J0556j7785j9016J740L1J80L714K0298R021K647O371j2528p952n318
$$ 4256 14812 -2973 -21989 -20249 -20218 -20038 -16324 3974 12995 15642 22013 9485 1533 -3785
9877c785r163j2475J0031K055N545k579m986m89K685n154J1670L213j015k255
$$ -3785 -12948 -25423 -15392 -13337 -7792 -10371 -15357 -15846 -13161 -18315 -6645 -3432 -4447 -6702
9863f702J913l977k125J0496m048q687j091K312j4735l909J0621j2663j1649J8951
$$ -6702 -4789 -8766 -10891 -395 -4443 -13130 -14221 -11909 -26644 -30553 -19932 -32595 -44244 -25293
9849b5293L585J3708J6637J4748j4804r431o943j855O161L613J2899J1137l299
$$ -25293 -21708 -8000 8637 23385 8581 -850 -7793 -9648 -3487 126 13025 24162 20863
9836B0863J1354k0457k7309J236J9742L986j2687j1707l430J6491M402R951R214
$$ 20863 32217 11760 -15549 -14313 5429 9415 -3272 -14979 -18409 -1918 2484 12435 21649
9823B1649K853J2729j2077m607q089M545J3578O387j1595k0639O673J832r428
$$ 21649 24502 37231 25154 20547 12458 17003 30581 36968 25373 4734 11407 13239 3811
9810C811K629J5424j0343j6544k004l998m4N325l953K6598J8991M516j7946j8564
$$ 3811 6440 21864 11521 -5023 -7027 -11025 -11069 -5744 -9697 16901 35892 40408 22462 3898
9796C898R240Q777p884r667J3288J0693j4993k1786K650p110J969o971O16K0383
$$ 3898 13138 21915 14031 4364 17652 28345 13352 -8434 -5784 -12894 -10925 -17896 -17280 3103
9782C103M004P82j7789P318O443L128k991K433M177O306L293o731L573J085n088
$$ 3103 7107 7889 -9900 -2582 3861 6989 3998 6431 10608 16914 20207 13476 17049 18134 13046
9767A3046J0716l85l1634j1246Q017J1932j5674j6831J4670M402J015M882P523
$$ 13046 23762 23377 -8257 -19503 -11486 446 -15228 -32059 -17389 -12987 -11972 -7090 433
9754D33K0917J0478j8711J2372o579J1460j571j1665j3124k042o488k4095j751
$$ 433 21350 31828 13117 25489 18910 30370 28799 17134 4010 1968 -4520 -28615 -30366
9741c0366j5985K2454K1696K224L386l627n149Q406l858R43Q350p924O476J2841
$$ -30366 -46351 -23897 -2201 23 3409 -218 -5367 3039 -819 124 8474 550 7026 19867
9727A9867l1589j6841J1776J285m169J2883l811J2070K2122j776k5442j2814Q406
$$ 19867 -11722 -28563 -16787 -15502 -19671 -6788 -10599 1471 23593 21817 -3625 -16439 -8033
9714h033p811l92K351J0107J719J0110Q366k462O859Q096j0452j1872M08r476
$$ -8033 -15844 -16236 -13885 -3778 -2059 8051 16417 13955 20814 28910 18458 6586 6994 -2482
9700b482k3396n522R552K826M411P804k2286m963K2569k313k868J0204J6422J7531
$$ -2482 -25878 -31400 -21848 -19022 -14611 -6807 -29093 -34056 -11487 -13800 -16668 -6464 9958 27489
9686B7489N359j0175N435P521j839j1217q342k0233j093O091j1665j5080M030
$$ 27489 32848 22673 28108 35629 33790 22573 14231 -6002 -7095 -1004 -12669 -27749 -23719
9673b3719r724J4938J9096k059K5004N024N787L40j652m449j037J301n72J1482
$$ -23719 -33443 -18505 591 -1468 23536 28560 34347 34687 33035 28586 27549 28850 28278 39760
9659C9760l120O08J454j6706k0727l045L040k1611j8869j279M647J4008K1308
$$ 39760 36640 37248 38702 21996 1269 -1776 1264 -20347 -39216 -40495 -35848 -21840 -532
9646e32J4904K2878l12j6246q071j1252o941J1109N244R235p943m229N116J3625
$$ -532 14372 37250 36938 20692 12621 1369 -5572 5537 10781 20016 12073 7844 12960 26585
9632B6585l051O443L737L409k704k1368k2867L082P185J3964P106j0390j9068
$$ 26585 23534 29977 33714 37123 34419 13051 -9816 -6734 451 14415 21521 11131 -7937
9619g937k728K4342J006p045j7486l636L431k63P527l316n060J2403P416l622
$$ -7937 -10665 13677 14683 7638 -9848 -13484 -10053 -10316 -2789 -6105 -11165 1238 8654 5032
9605E032k1753m1J1186r260M723j6207p957M806K2340J3951j6549p92j04m764
$$ 5032 -16721 -16762 -5576 -14836 -10113 -26320 -34277 -29471 -7131 6820 -9729 -10521 -10625 -15389
9591a5389m220K0467J1960k6400r812J4975K358n843J0872O362J024q51j6652
$$ -15389 -19609 858 12818 -13582 -23394 -8419 -6061 -11904 -1032 5330 6354 5503 -11149
9578a1149m688j0068P565J1427P116l317k474j2049J7345L223m591o74J0725l780
$$ -11149 -15837 -25905 -18340 -6913 203 -3114 -5588 -17637 -292 2931 -1660 -2334 8391 4611
9564D611j436q233j4348K148m974K1877O980l092o448K442j6313j3175J6829R574
$$ 4611 3175 -5058 -19406 -17258 -22232 -355 6625 3533 -2915 -473 -16786 -29961 -13132 -3558
9550c558K219K478p74l532j6796p261j96L10o13J7024P238L191L154m374J1360
$$ -3558 -1339 1139 365 -3167 -19963 -27224 -27420 -27110 -27723 -10699 -3461 -270 2884 -1490 9870
9535I870N05j2400j3828q55Q805J6966o584j0112j647j194l646n31K3450p73J3517
$$ 9870 10375 -2025 -15853 -16708 -7903 9063 2479 -7633 -9280 -10474 -14120 -14651 8799 8026 21543
9520B1543q063r449j6730k956m495K2469P332r714j0350l599M267O606O54N101
$$ 21543 13480 4031 -12699 -15655 -20150 2319 9651 -63 -10413 -14012 -9745 -3139 -2485 2616
9506B616l885o846N262k899J0271L195K674J836j2949m83J4296j543j7431o966
$$ 2616 -1269 -8115 -2853 -5752 4519 7714 10388 12224 -725 -1208 13088 11545 -5886 -12852
9492a2852P579N610m038N009r982J146K2346J2834m75m355K788j5336J6889K215
$$ -12852 -5273 337 -3701 1308 -8674 -7528 14818 27652 27177 22822 25610 10274 27163 29378
9478B9378p307j4512j0419l092j1180q89R864l095N772M817l414j26p829J729
$$ 29378 22071 7559 -2860 -5952 -17132 -18021 -8157 -11252 -5480 -663 -4077 -4203 -12032 -10303
9464a0303M357o94Q269K0423n800r262J2199K173j1825j9321p913O84K0113M898
$$ -10303 -5946 -6640 1629 22052 16252 6990 19189 21362 9537 -9784 -17697 -17013 3100 7998
9450G998j188j3848j1702J0278j9827m020K3617O112P387J1686J069n574j3570
$$ 7998 6810 -7038 -18740 -8462 -28289 -32309 -8692 -2580 4807 16493 17562 11988 -1582
9437a582j4894l77M504J1968N826j868j1378k087o839j1572Q236J9104N750N128
$$ -1582 -16476 -16853 -12349 -381 5445 3577 -7801 -9888 -16727 -28299 -20063 -959 4791 9919
9423I919k070n759J892j9308j036K1392K646p460K424Q221j567o225M652J3136
$$ 9919 7849 2090 3982 -15326 -16362 5030 7676 216 2640 10861 9294 3069 7721 20857
9409B0857p677n076O923L728j7834j919m089O13l518P806l171Lq225N044J6420
$$ 20857 13180 8104 15027 18755 921 -998 -5087 -4474 -7992 -186 -3357 -3354 -11579 -6535 9885
9394I885l557n837J536m194k2574q067J8395k164j973J3109J5529j1244m911j4541
$$ 9885 6328 491 2027 -2167 -24741 -32808 -14413 -16577 -18550 -5441 10088 -1156 -6067 -20608
9380b0608J396J2544O443k2934k6322K2515J1467P783j2846k653O370J7462l614
$$ -20608 -19212 -6668 -225 -23159 -49481 -26966 -15499 -7716 -20562 -23215 -16845 617 -2997
9367b997j6157O289R622k341J0086j4880j0561M114m728L119R253L0414J9106
$$ -2997 -19154 -12865 -3243 -5584 4502 -10378 -20939 -16825 -21553 -18434 -9181 21233 40339
9354D0339k131j3517j1682k1975m408N379J803M672j355K481p908J1P325M229
$$ 40339 38208 24691 13009 -8966 -13374 -7995 -6192 -1520 -2875 -394 -8302 -8291 -966 3263
9340C263L215o622M866M062r709k637P854N701O009L186j0879l328O892M78J4665
$$ 3263 6478 -144 4722 8784 -925 -3562 4292 9993 16002 19188 8309 4981 11873 12351 27016
9325B7016j9421k4739j071J128l187o026M104K4033J7110J905j6633r350r801
$$ 27016 7595 -17144 -18215 -17087 -20274 -26300 -22196 1837 18947 20852 4219 -5131 -14932
9312a4932j170m974J3281j091q557n159k0109J872N594P895J8828K1034J3188
$$ -14932 -16102 -21076 -7795 -8886 -17443 -22602 -42711 -40839 -35245 -27350 -8522 12512 25700
9299B5700j3978k8341P174J8727Q805N05M676o134l533R296r512o849M111j1316
$$ 25700 11722 -16619 -9445 9282 18087 18592 23268 17134 13601 22897 13385 6536 10647 -669
9285f69r116k086J7632J8368J1186r860j075j0304Q740M163j0408m384J557j8212
$$ -669 -9785 -11871 5761 24129 35315 25455 24380 14076 22816 26979 16571 12187 13744 -4468
9271d468j871J1896N753q7n502j1229p012K350J2166O00N520R965m904q83j1557
$$ -4468 -6339 5557 11310 11223 5721 -5508 -12520 -10170 1996 2596 8116 18081 13177 12294 737
9256G37j6913p075K592N291M131J8239J3010K834j4190L323m978J0067J3962l094
$$ 737 -16176 -23251 -20659 -15368 -11237 7002 20012 22846 8656 11979 7001 17068 31030 27936
9242B7936J853O38l132k391p243n073J0830o494p049K373J5963J0283j3228J395
$$ 27936 29789 30427 27295 24904 17661 12588 23418 16924 9875 12248 28211 38494 25266 26661
9228B6661k127l691J9310J5341k1268k1904n255N214M121j9822J766R100L014
$$ 26661 24534 20843 40153 55494 34226 12322 7067 12281 16402 -3420 -1654 7446 10460
9215A0460l580J0502Q712r792j7520n073J8952J1411O35k0580j0683m619J677
$$ 10460 6880 17382 26094 16302 -1218 -6291 12661 24072 24707 4127 -6556 -11175 -9498
9202i498j743r976k2419K3142L0510J1720N441M48L778j4381j0251m977p458m977
$$ -9498 -11241 -21217 -43636 -20494 10016 21736 27177 27625 31403 17022 6771 1794 -5664 -10641
9188a0641L983N919J1968K849m205j4613j1351J8201k88q648l527O029j269J3990
$$ -10641 -6658 -739 11229 14078 9873 -4740 -16091 2110 1822 -6826 -10353 -4324 -5593 8397
9174H397K315o756m915O050J3256m785J0818M20j962q13p271k783j4576n111K108
$$ 8397 10712 3956 -959 5091 18347 13562 24380 24800 22838 22025 14754 11971 -2605 -7716 -5608
9159e608m853m288j0437J7545K6646J2358n848r673J0536o827j0828P053J1101
$$ -5608 -10461 -14749 -25186 -7641 19005 31363 25515 15842 26378 19551 8723 15776 26877
9146B6877l574j402J922k149k4605L245J8382P467L357O140P413l434j5529J4541
$$ 26877 23303 21901 23823 21674 -2931 314 18696 26163 29520 35660 43073 39639 24110 38651
9132C8651N948j5098P994r719j0713j840K9368Q434Q567p366l656p489o532J245
$$ 38651 44599 29501 37495 27776 17063 15223 44591 53025 61592 54226 50570 43081 36549 37794
9118C7794R174j6650o704J8533R502j0279J036n288j7337Q431J1977k0816k603
$$ 37794 46968 30318 23614 42147 51649 41370 42406 37118 19781 28212 40189 19373 16770
9105A6770J273j1563K712P456R15J4258j770o242l513K2530n432j3763l725l60
$$ 16770 18043 6480 9192 16648 17563 31821 30051 23809 20296 42826 37394 23631 19906 19546
9091A9546P414M42r038Q174J2769M079n034P181j562q87j5008R952n302j2834
$$ 19546 26960 27402 18364 26538 39307 43386 38352 45533 43971 43084 28076 38028 32726 19892
9077A9892o870L667l664K865N521j3085n196q392L21J4013m718J2089K8398J5066
$$ 19892 13022 16689 13025 15890 21411 8326 3130 -5262 -4941 9072 4354 16443 44841 59907
9063E9907j1091j7960J42p660P768p377N844O943o710j7908J302j7237M019J0315
$$ 59907 48816 30856 30998 23338 31106 23729 29573 36516 29806 11898 13200 -4037 -18 10297
9049A0297m565J1686p89j4419l438k08R013m798N784J4796N839J2631o915j527
$$ 10297 5732 17418 16629 2210 -1228 -1436 7577 2779 8563 23359 29198 41829 34914 33387
9035C3387J2639o439o73l023m334O948n267q702j4111j0977P612J9432R223j8999
$$ 33387 46026 39587 38914 35891 31557 38505 33238 24536 10425 -552 7060 26492 35715 16716
9021A6716j806m15l285N235K269j6799r325R411M052j3627l598o432K2537J4345
$$ 16716 14910 14495 11210 16445 18714 1915 -7410 2001 6053 -7574 -11172 -17604 4933 19278
9007A9278o164M185K510O677L358k152R585O113m549n946J5000R817J1737J684
$$ 19278 13114 17299 19809 26486 29844 27692 37277 43390 38841 32895 47895 57712 69449 71133
8993G1133r787k0178Q641L521L097m544k098j569q114M327K4675p279R755K830
$$ 71133 61346 41168 49809 53330 56427 51883 49785 48216 40102 44429 69104 61825 71580 74410
8979G4410k9413j0693r745j1883M061J5746N279n211m790j1705P995l905m705
$$ 74410 44997 34304 24559 12676 16737 32483 37762 32551 27761 16056 24051 20146 15441
8966A5441j0809R018L671k1177k00M483Q3J280K963J4356N64L690l319J1734R257
$$ 15441 4632 13650 17321 -3856 -4056 427 510 1790 4753 19109 19673 23363 20044 31778 41035
8951D1035J942n221J876P074J1826J7987J8382K424O48M74J0932J2778n194L47
$$ 41035 42977 37756 39632 46706 58532 76519 94901 97325 97973 98447 109379 122157 116963 117310
8937A17310J7270K7267J2678n298R59J7795K3612K9742J3131J5067K0671L1823
$$ 117310 134580 161847 174525 169227 170186 187981 211593 241335 254466 269533 290204 322027
8925C22027O2891R2755R8028J35275J73431J72387J82695J61000O1386l3648j31509
$$ 322027 384918 477673 575701 710976 884407 1056794 1239489 1400489 1461875 1428227 1296718
8914A296718j73583j76583j33723j23125j07805o8510o3653m4070k1835l3074
$$ 1296718 1123135 946552 812829 689704 581899 513389 449736 405666 383831 350757
8904C50757l1282j8679j5958Q804r428j1696j8506j2846l309N99J0857J4914o77
$$ 350757 319475 300796 284838 293642 284214 272518 254012 241166 237857 238456 249313 264227 263550
8891B63550K51o426J6741L982K2574J7259J3772J8053L1224J6291M5847Q0699
$$ 263550 263801 257375 274116 278098 300672 317931 331703 349756 380980 397271 443118 523817
8879E23817R0380J11051J45232J69322J69143J41267J04588O285r1747j40870
$$ 523817 614197 725248 870480 1039802 1208945 1350212 1454800 1461085 1369338 1228468
8869A228468j65716j74435j43545j20542r4356p3971o8558m9335j5266k2507l3082
$$ 1228468 1062752 888317 744772 624230 529874 455903 387345 338010 322744 300237 267155
8858B67155l2624m149k0053P569j1567k1734k4918j2238p844j4376R773J3619
$$ 267155 234531 230382 210329 217898 206331 184597 159679 147441 139597 125221 134994 148613
8846A48613O327j795j2622o644r176m808O894j0799M520J7943n891k492L873k5067
$$ 148613 154940 153145 140523 133879 124703 119895 126789 115990 120510 138453 132562 130070 133943 108876
8832A08876p015j2836j2645M843M243L3561M0867O899Q006l2295r300l825N370
$$ 108876 101861 89025 76380 81223 85466 119027 159894 166793 174799 142504 133204 129379 134749
8819A34749P408j4884k511J4977p851l039n376Q633M556K559P373k1110j1256
$$ 134749 142157 127273 124762 139739 131888 128849 123473 132106 136662 139221 146594 125484 114228
8806A14228J2084L603p626Q80J822o618k2467m305k585m438j6632l99J1048K1150
$$ 114228 126312 129915 122289 123169 124991 118373 95906 91601 89016 84578 67946 67547 78595 99745
8792I9745O148L344P128J6024Q263J1225N885j6787Q672L6871L8383K9639J0303
$$ 99745 105893 109237 116365 132389 140652 151877 157762 140975 149647 186518 224901 254540 264843
8779B64843L2631l53J227J4247K9275L3996K6550M0744K9404J1038l950k8818
$$ 264843 297474 297121 298348 312595 341870 375866 402416 443160 472564 483602 479652 450834
8767D50834Q239n22m0072n6806k7281j2071o112j6719k3768j7357k2883j0948
$$ 450834 459073 458551 418479 361673 334392 322321 316209 299490 275722 258365 235482 224534
8755B24534o361M445m03m887K616p808o30r97K096N03r128J5688J979N183N669
$$ 224534 218173 222618 222215 217328 219944 212136 211506 210509 212605 213108 203980 219668 221647 226830 232499
8740B32499L522J3363K4110K0073J4637K0220P340P627K645J5878M140L3043J8363
$$ 232499 236021 249384 273494 293567 308204 328424 335764 343391 346036 361914 366054 399097 417460
8727D17460L450K7397J4653k158J416j2765k2330k7504k9172k1142k2684j4910
$$ 417460 420910 448307 462960 460802 462218 449453 427123 399619 370447 349305 326621 311711
8715C11711k0446j7711J2157Q270q045O340k7472k4764j3415j2222l347p086J0724
$$ 311711 291265 273554 285711 293981 285936 292276 264804 240040 226625 214403 211056 203970 214694
8702B14694q770q897J0600K352L640n198R793J72J2113p584Q317J561n4j9934
$$ 214694 205924 197027 207627 209979 213619 208421 218214 218386 230499 222915 231232 232793 232739 212805
8688B12805P309J912L542N519J6682p82J2452R803R938O41j2763P059K1662L164
$$ 212805 220114 222026 225568 231087 247769 246987 259439 269242 279180 279821 267058 274117 295779 298943
8674B98943M22J2403l702k809J511j6757J2898j7179j2579j0735L22J8063J375
$$ 298943 299365 311768 308066 305257 306768 290011 302909 285730 273151 262416 262738 280801 282176
8661B82176N979J2305J5659K852R222R866K3684K7319K8095L6682L2475L5568
$$ 282176 288155 300460 316119 318971 328193 338059 361743 389062 417157 453839 486314 521882
8649E21882j736J69K1176K8086N1962K9315R530Q460J2121k5701p1888n9432m4786
$$ 521882 520146 520315 541491 569577 621539 650854 660384 668844 680965 655264 583376 523944 479158
8636D79158l8339p750J0984n192j6284k138q973J8119K7474K4464M970j0508K611
$$ 479158 440819 433069 444053 438861 422577 420439 411466 429585 457059 481523 486493 475985 478596
8623D78596l11J3685K3272Q701l319r434J9947K4890L0686N8605J5106N240J8426
$$ 478596 478285 491970 515242 523943 520624 511190 531137 556027 586713 645318 660424 665664 684090
8610F84090M4820J9918K1236K7587L4562P4307R2423O4736N5729M7500M1870N5803
$$ 684090 728910 748828 770064 797651 832213 906520 998943 1063679 1119408 1166908 1208778 1264581
8598A264581O6147L4823K575k1750l9960l8331l5400J1103J0004R202Q085K3990
$$ 1264581 1330728 1365551 1368126 1346376 1306416 1268085 1232685 1243788 1253792 1262994 1271079 1295069
8586A295069K9636J7976K8743L3257K1685L7677N6691L7606K0109L8585M2967
$$ 1295069 1324705 1342681 1371424 1404681 1426366 1464043 1520734 1558340 1578449 1617034 1660001
8575A660001N8300M4819L0790N1266N7902O6055N7763O0046P2712M8292O1638
$$ 1660001 1718301 1763120 1793910 1845176 1903078 1969133 2026896 2086942 2159654 2207946 2269584
8564B269584J07066J08088J39638J40500J04044J17186J28890J42640J43482J24910
$$ 2269584 2376650 2484738 2624376 2764876 2868920 2986106 3114996 3257636 3401118 3526028
8554C526028J21612J33179J61852J81377J87373K04715K31091K55851K88167L19477
$$ 3526028 3647640 3780819 3942671 4124048 4311421 4516136 4747227 5003078 5291245 5610722
8544E610722L52550L86567M49810M90386N25369O09103O97449Q03823R29893J114135
$$ 5610722 5963272 6349839 6799649 7290035 7815404 8424507 9121956 9925779 10855672 11969807
8534A1969807J329719J596191J870710K118075K355258K564696K826722L222581
$$ 11969807 13299526 14895717 16766427 18884502 21239760 23804456 26631178 29853759
8526B9853759L872130M872883O265688Q183090J0887943J4607893J9678182K6329096
$$ 29853759 33725889 38598772 44864460 53047550 63935493 78543386 98221568 124550664
8518A24550664L4296690M2345028M7152063M1722630J8781005j4660350l7723495
$$ 124550664 158847354 201192382 248344445 290067075 308848080 294187730 256464235
8511B56464235m3293405l9270374l2189734k5089176j9140528j4561807j1139693
$$ 256464235 213170830 173900456 141710722 116621546 97481018 82919211 71779518
8504G1779518q502109o476599m939831l742001k869594k339831k098706j963189
$$ 71779518 63277409 56800810 51860979 48118978 45249384 42909553 40810847 38847658
8496C8847658j765883j494242j193321q67756n00462j10125K36386O08315J018104
$$ 38847658 37081775 35587533 34394212 33526456 33025994 32915869 33152255 33760570 34778674
8487C4778674J379859J719763J995790K269963K655890L308433M187558N351619
$$ 34778674 36158533 37878296 39874086 42144049 44799939 48108372 52295930 57647549
8479E7647549O915629R051890J2029218J6249270K1942856K8999251L6706215
$$ 57647549 64563178 73615068 85644286 101893556 123836412 152835663 189541878
8472A89541878M2911818M2433742K7528335k480648l0760918m2412763m1038645
$$ 189541878 232453696 274887438 302415773 299935125 269174207 226761444 185722799
8465A85722799l4693721k7456363k1075730j6052422j2259565r425962p302161
$$ 185722799 151029078 123572715 102496985 86444563 74184998 64759036 57456875
8458E7456875n695146m454610l538695k970875k702247k596372k477900k277447
$$ 57456875 51761729 47307119 43768424 40797549 38095302 35498930 33021030 30743583
8450C0743583k030968j757891j520194j332070j149758r80772q26063p14189o03706
$$ 30743583 28712615 26954724 25434530 24102460 22952702 21971930 21145867 20431678 19827972
8441A9827972n17815m38703l47640k61565k25580k11324k88043m40369n69408
$$ 19827972 19310157 18871454 18523814 18262249 18036669 17825345 17537302 17096933 16527525
8432A6527525o40785o71608o77000o43960o29417o24428n75443n35849n49958
$$ 16527525 15886740 15215132 14538132 13894172 13264755 12640327 12064884 11529035 10979077
8423A0979077n27180m71819m50639m35758l94883l55955l48667l33337l19424
$$ 10979077 10451897 9980078 9529439 9093681 8698798 8342843 7994176 7660839 7341415
8414G341415k88476k67235k86684k73886k41907k58040k43101k32095k16177j89777
$$ 7341415 7052939 6785704 6499020 6225134 5983227 5725187 5482086 5249991 5033814 4844037
8404D844037j74925j77074j54076j22930j11811j27121j10868j09746q1098p1138
$$ 4844037 4669112 4492038 4337962 4215032 4103221 3976100 3865232 3755486 3674388 3603250
8394C603250p9133r4083q9746j14008j21089j27008j06446j07573j17206j24304
$$ 3603250 3524117 3430034 3340288 3226280 3105191 2978183 2871737 2764164 2646958 2522654
8384B522654j31236j23678r9543r2981j05149q1178o0735o5623n3719l1490n3837
$$ 2522654 2391418 2267740 2168197 2075216 1970067 1888889 1828154 1762531 1708812 1677322 1623485
8373A623485n3398n4298m4458j8436k0742l6919l4810k3241l2547l5134k5205
$$ 1623485 1570087 1515789 1471331 1452895 1432153 1395234 1360424 1337183 1304636 1269502 1244297
8362A244297j5965K137j243o793J4405L838L910j0587q19L1557L9880M4477M1840
$$ 1244297 1228332 1230469 1229226 1222433 1236838 1240676 1244586 1233999 1233180 1264737 1304617 1349094 1390934
8349A390934J4411J0906l531j8321j147r633O741j4754l4714j01106j01486o1603
$$ 1390934 1405345 1416251 1412720 1394399 1393252 1383619 1390360 1375606 1340892 1239786 1138300 1076697
8337A076697n3084m8473l4478k6277n1432l5325j8855J0875l35p426P3j736j4810
$$ 1076697 1023613 975140 940662 914385 862953 827628 808773 819648 819313 811887 811960 810224 795414
8324G95414l0278j1612J3004q969j504J653m842j09M27J592r840j890J9046K8961
$$ 795414 765136 753524 766528 757559 756055 757708 752866 752757 753184 754776 744936 743046 762092 791053
8310G91053M3925K9493M4572L8904j4998n3476m5159k0088j739J0057K3076o795
$$ 791053 834978 864471 909043 947947 932949 879473 834314 814226 812487 822544 845620 838825
8298H38825r834j8680j8425j5617k0014k714m329l559j144l7114k565M1311J6084
$$ 838825 828991 810311 791886 776269 756255 753541 749212 745653 744509 707395 704830 746141 762225
8285G62225O35K3262L0176J3438L0841N2242O6134J23432K09258K38591M1941
$$ 762225 762860 786122 816298 829736 860577 912819 978953 1102385 1311643 1550234 1592175
8274A592175k24677k13893j50463j15698o9856n4677k7159o003L0417K9935L5994
$$ 1592175 1367498 1153605 1003142 887444 817588 762911 735752 729749 760166 790101 826095
8263H26095K6426l3493p7564n9015l4549j0037k9427m2632r717m603l057n212
$$ 826095 852521 819028 741464 682449 647900 637863 608436 565804 556087 551484 548427 543215
8251E43215j7350j9339k2366k3691R954J9426m57o320L3682L5629P2611J30328
$$ 543215 525865 506526 484160 460469 470423 489849 489392 483072 516754 552383 624994 755322
8239G55322J71557K24206K12261o8040k71072k10875j46985j03234n8883n0926
$$ 755322 926879 1151085 1363346 1295306 1024234 813359 666374 563140 504257 453331
8229D53331n2806k0125l0746j5323j0315j4316r315Q014L301j27J393J1315k0977
$$ 453331 400525 380400 349654 334331 324016 309700 300385 308399 311700 311573 312966 324281 303304
8216C03304j6331k1536k1952J3363J974r924j1847l258K4633J3761K193r007p190
$$ 303304 286973 265437 243485 256848 258822 248898 237051 233793 258426 272187 274380 265373 258183
8203B58183Q383J6927O593J0941J8863K2111K332M5769Q6814R7641J16747J49281
$$ 258183 266566 283493 290086 301027 319890 342001 344333 390102 476916 574557 691304 840585
8191H40585J32912J3003j31294j56769j09311r4280o6686m8791l2377j7106L273
$$ 840585 973497 986500 855206 698437 589126 494846 428160 379369 346992 329886 333159
8180C33159O752j2938o783r123P00k3435l0016r446l82m081m733R433Q95p173
$$ 333159 339911 326973 320190 311067 311767 288332 258316 248870 248488 244407 239674 249107 250002 242829
8166B42829L834R809p193m12o980Q942K377J4912j443L7730M3019L5681L2638
$$ 242829 246663 256472 249279 248867 241887 250829 253206 268118 266675 304405 347424 383105 415743
8153D15743K0575M7787P2819Q5748J32130J23169O9815n3552j29191j23662j00566
$$ 415743 436318 484105 556924 642672 774802 897971 967786 914234 785043 661381 560815
8142E60815p4288p0800l5503j8735q959l443m864o0j460l29J5679n612j6969j1548
$$ 560815 486527 415727 380224 361489 352530 349087 344223 344163 342703 342374 358053 352441 335472 323924
8128C23924n781J0871Q056o608n151J1793K0445L655O578J6077N894K7072K8786
$$ 323924 318143 329014 337070 330462 325311 337104 357549 361204 367782 383859 389753 416825 445611
8115D45611L0070M1281P2823N9710R8953J34427J47826J59962J62784J57824R7632
$$ 445611 475681 516962 589785 649495 748448 882875 1030701 1190663 1353447 1511271 1608903
8104A608903l071j39319j88375j73673j41731j15475j01208j08977o1696l3482
$$ 1608903 1605832 1466513 1278138 1104465 962734 847259 746051 637074 575378 541896
8094E41896l6819l8623l9700l5432j7035j3790j5117M891j0436j5188r17j5743
$$ 541896 505077 466454 426754 391322 374287 360497 345380 350271 339835 324647 323730 307987
8082C07987j9800k922P128Q757O537K1912K5874O265J3428K2554K6803K9777L3466
$$ 307987 288187 285265 292393 301150 307687 329599 355473 361738 375166 397720 424523 454300 487766
8069D87766L9997O6687J06313J18486J36981J63656J71120J56717J12363j0443
$$ 487766 527763 594450 700763 819249 956230 1119886 1291006 1447723 1560086 1549643
8059A549643j35272j70200j44680j42095j27113j18454r2450p2463p1561o4426
$$ 1549643 1414371 1244171 1099491 957396 830283 711829 619379 546916 475355 410929
8049D10929m4549l2731o127j2657o408O511p747q635l2564j9193q805l091J5989
$$ 410929 366380 333649 327522 314865 308457 314968 307221 298586 266022 246829 238024 234933 250922
8036B50922l064k1164j5829k0574j0575j403K3505J6712k278M902J5282r260m157
$$ 250922 247858 226694 210865 190291 179716 178313 201818 218530 216252 221154 236436 227176 223019
8023B23019j3594j6912J262k0345K099J4967j896k9556j1797N122K4670k239j2419
$$ 223019 209425 192513 193775 173430 175529 190496 188600 159044 147247 152369 177039 174800 162381
8010A62381j2007j712j6179n167K2518J6458j7264j2399L180k572o571M135r450
$$ 162381 150374 148662 132483 127316 149834 166292 149028 136629 139809 137237 130666 134801 125351
7997A25351p872j6368R625R579k706J8901K1840L786m020k6260j5300O143q693
$$ 125351 117479 101111 110736 120315 117609 136510 158350 162136 158116 131856 116556 122699 114006
7984A14006l238j5066N355R118r701j801O383K1835J4954j9784q966j1826N809
$$ 114006 110768 95702 101057 110175 100474 98673 105056 126891 141845 122061 113095 101269 107078
7971A07078j9928r999M938J399p931j0003J222J0108K0899n143k8445N981M910
$$ 107078 87150 77151 82089 83488 75557 65554 66776 76884 97783 92640 64195 70176 75086
7958G5086k0825J216R552Q069J0646J16q031j7797P027J4054r72l446j6641r688
$$ 75086 54261 55477 65029 73098 83744 83860 75829 58032 65059 79113 78141 74695 58054 48366
7944D8366N699n535P873J7344k51l663j9828M234n99n759L81J1543O057j4187
$$ 48366 54065 48530 56403 73747 73496 69833 50005 54239 53640 47881 48262 59805 65862 51675
7930E1675r199J0376J1299o931n247P593j1203o761j950N15m151j0576K214J8543
$$ 51675 42476 52852 64151 57220 51973 59566 48363 41602 39652 40167 36016 25440 27654 46197
7916D6197J8968j2376p730L389J2556J235j7946O34L574q035p635J8685J0920
$$ 46197 65165 52789 45059 48448 61004 62239 44293 44927 48501 40466 32831 51516 62436
7903F2436J827o143j7309j6642J0289N202N752K4212K5717l487m636j5213k054
$$ 62436 64263 58120 40811 24169 34458 39660 45412 69624 95341 91854 87218 72005 69951
7890F9951k1605o238P798N574p199j840N651m824m634n648k9689m408J8380j231
$$ 69951 48346 42108 49906 55480 48281 46441 52092 47268 42634 36986 7297 2889 21269 20038
7876B0038l468J3378N285l336O095p099l128M007J1032K020N177O440N869j0893
$$ 20038 16570 29948 35233 31897 37992 30893 27765 31772 42804 44824 50001 56441 62310 51417
7862E1417R031J2257L442n489k456j5878J068n859R890N225P8J2245N876l480
$$ 51417 60448 72705 76147 70658 68202 52324 53392 47533 57423 62648 62726 74971 80847 77367
7848G7367R832M473j1671J895k1406j6028l398r190K1013P141p69o258L623j646
$$ 77367 87199 91672 80001 81896 60490 44462 41064 31874 52887 60028 59259 53001 56624 54978
7834E4978P530K2043L815r958k6684k3428k956P328J0777m275L209P614j002n837
$$ 54978 62508 84551 88366 78408 51724 28296 25340 32668 43445 39170 42379 49993 48991 43154
7820D3154l081j6422j0042J9828R24j9508r10J9193l169J1298J3924Q65L37r42
$$ 43154 40073 23651 13609 33437 34361 14853 13943 33136 29967 41265 55189 56054 56391 55449
7806E5449j2647k5259N794J5690j1745p987J6418K3276r205k649j7412m518J654
$$ 55449 42802 17543 23337 39027 27282 19295 35713 58989 49784 47135 29723 25205 26859
7793B6859M431n430O884M038M991o258j3195n244J761Q372J5119m827k1266j5821
$$ 26859 31290 25860 32744 36782 41773 35515 22320 17076 18837 27209 42328 37501 16235 414
7779D14o55o507J6566P567N080j2610Q53J5055n244j207K4845R774J3674R305
$$ 414 -241 -6748 9818 17385 22465 9855 10708 25763 20519 19312 44157 53931 67605 76910
7765G6910m676J184j0013j7984k079k349j9156L25K4716J0235J380L157q386j1251
$$ 76910 72234 73418 63405 45421 43342 40993 21837 22162 46878 57113 58493 61650 53264 42013
7751D2013j6355m189j010R458M073M341m560o106p120k743o498j2182p775R951
$$ 42013 25658 21469 20459 29917 33990 38331 33771 27665 20545 17802 11304 -878 -8653 1298
7737A298L183N488J5761o48j1766p029J1104P871J5945n590j9290j107J455q561
$$ 1298 4481 9969 25730 25082 13316 6287 17391 25262 41207 35617 16327 15220 16675 8114
7723H114o694Q659M605l31R360J1640n60j512m622j2479P210Q827J2395j0217
$$ 8114 1420 10079 14684 14353 23713 35353 34793 33281 28659 16180 23390 32217 44612 34395
7709C4395o956K157k983L8j0975r281j2884J2905J8121j2935j1433l682N622M675
$$ 34395 27439 29596 26613 26651 15676 6395 -6489 6416 24537 11602 169 -3513 2109 6784
7695F784J914J2285j1196j5578Q311K0777M678j3086j3882j0703J7883J8844k2939
$$ 6784 8698 20983 9787 -5791 2520 23297 27975 14889 1007 -9696 8187 27031 4092
7682D092j4202L662J8216l549J1591R244j87k1543j1092L6858P922j3176j3045
$$ 4092 -10110 -6448 11768 8219 19810 29054 28867 7324 -3768 33090 41012 27836 14791
7669A4791j943m669K644J5038M22m46O425o213j2388j4168j1259O693O798n829
$$ 14791 12848 8179 10823 25861 26283 25837 32262 26049 13661 -507 -11766 -5073 1725 -4104
7655d104o668m118J3650L52Q952K0299M32o501k020j947j7912l883j3570k664
$$ -4104 -10772 -14890 -1240 -888 8064 28363 28795 22294 20274 18327 415 -3468 -17038 -19702
7641a9702K4907K107P795P375q872q450m435J0647Q293P675p891P236n029j7377
$$ -19702 5205 7312 15107 22482 13610 5160 725 11372 19665 27340 19449 26685 21656 4279
7627D279l761O85J4788m82P347K118l307P856l868j2130j3562J9799K4614L726
$$ 4279 518 1203 15991 15509 22856 24974 21667 29523 25655 13525 -37 19762 44376 48102
7613D8102m276j6066m928r4M019j6188n052j110o724n516P113K0761J0174j0456
$$ 48102 43826 27760 22832 22738 26757 10569 5517 4407 -2317 -7833 -720 20041 30215 19759
7599A9759R66j3732J674M08J0997l444L574o480q374L558K948P636N794o61j4434
$$ 19759 20725 6993 8667 9075 20072 16628 20202 13722 5348 8906 11854 19490 25284 24623 10189
7584A0189m784O930K3410J6553J0726k587l1121j3381p101j3507k044j346J5861
$$ 10189 5405 12335 35745 52298 63024 60437 29316 15935 8834 -4673 -6717 -8063 7798
7571G798J3821k1020J2097J8330m456L24r56j1834q964J9106N459n228k2776m22
$$ 7798 21619 599 12696 31026 26570 26894 25938 14104 5140 24246 29705 24477 1701 1279
7557A279j077M674J2321m945L672J37N59J255J3316Q193r020r637J8832q872j2091
$$ 1279 202 4876 17197 12252 15924 16061 16620 17875 31191 39384 30364 20727 39559 30687 18596
7542A8596r82o399j3844L491Q376L745N87N257r509j6117J3575K2610P80q989
$$ 18596 17614 11215 -2629 862 9238 12983 13570 18827 9318 -6799 6776 29386 30166 21177
7528B1177j0192J8192n528j4301K4651J3526j4089k4036r632L976n98k035o576
$$ 21177 10985 29177 23649 9348 33999 47525 33436 9400 -232 3744 3146 1111 -5465
7515e465Q835P328L105J0978j3841q099J3127j2171k0555q398J5671N109N299
$$ -5465 3370 10698 13803 24781 10940 2841 15968 3797 -16758 -25156 -9485 -4376 923
7502I23J3565q540j3394P29J0348K3444m211j6991n985P303m219j1940M788J2871
$$ 923 14488 5948 -7446 -6717 3631 27075 22864 5873 -112 7191 2972 -8968 -4180 8691
7488H691J1466J0623j4034j0453K19N234n452J1324o684r353j88J3468J0046l391
$$ 8691 20157 30780 16746 6293 6512 11746 6294 17618 10934 1581 1393 14861 24907 21516
7474B1516j9811k93L848J8524j374J2182j5390J574l315p990j0036J472j0663
$$ 21516 1705 1412 5260 23784 22410 34592 19202 20776 17461 9471 -565 907 -9756
7461i756N620O763O575j0872J474M208r816L408O355J1552P776O829j4135p861
$$ -9756 -4136 2627 9202 -1670 -196 4012 -5804 -2396 3959 15511 23287 30116 15981 8120
7447H120J7958R335k132o790j7706o503O263L380j097Q907P932j0927o227o991
$$ 8120 26078 35413 33281 26491 8785 2282 8545 11925 10828 19735 27667 16740 10513 3522
7433C522k491j9041J1888K0557p596j8439M43J0018J9552P940P295J0137O749
$$ 3522 1031 -18010 -6122 14435 6839 -11600 -11157 -1139 18413 26353 33648 43785 50534
7420E0534o918j0937J7792q737j8829K150j100N778j09r730j9474o171J7847J4545
$$ 50534 43616 32679 50471 41734 22905 25055 23955 29733 29624 19894 420 -5751 12096 26641
7406B6641J132r111K385m986o035J633j3172J9806Q514O157q414q18n824L530
$$ 26641 27773 18662 21047 16061 10026 11659 -1513 18293 26807 32964 24550 23732 17908 21438
7392B1438J8836R249N99r61j4394j537j0836o361L946J5796N660k473m851l952
$$ 21438 40274 49523 50122 49161 34767 33230 22394 16033 19979 35775 41435 38962 34111 30159
7378C0159j3492o782j575k582J238K049J655j8305J264o333m375j249K8428J2939
$$ 30159 16667 9885 8310 5728 6966 9015 10670 -7635 -6371 -12704 -17079 -18328 10100 23039
7364B3039j8875N023K1886q381j2667J908j809O269J092O059q76n116n717K34
$$ 23039 4164 9187 31073 22692 10025 11933 10124 16393 17485 23544 22668 17552 11835 12069
7350A2069j4030j0277P355R599J8896K902j8504j6436j3753K2145L0686r950p991
$$ 12069 -1961 -12238 -4883 4716 23612 26514 8010 -8426 -22179 -34 30652 20702 12711
7337A2711j0392M353q628K620M494k690J6630l25j1639p156j3703n415L71r103
$$ 12711 2319 6672 -1956 664 5158 2468 19098 18773 7134 -22 -13725 -19140 -18769 -27872
7323b7872O019K7055p804q021m696Q613l976J531K3733K6825k259j9528j392j5083
$$ -27872 -21853 5202 -2602 -10623 -15319 -6706 -10682 -9151 14582 41407 39148 19620 18228 3145
7309C145p827N920M282J3020P146o1j6568m785l18J7876n548r66k39k4022o526
$$ 3145 -4682 1238 5520 18540 25686 25625 9057 4272 3954 21830 16282 15316 15077 -8945 -15471
7294a5471l648K3945M654K786J3563J6056j859j4019k981J4063j601j8167l556
$$ -15471 -19119 4826 9480 12266 25829 41885 40026 26007 23026 37089 35488 17321 13765
7281A3765P84N625M543q02O577j9130m155J396N198O077r00r430j2152N517j654
$$ 13765 14549 20174 24717 23915 30492 11362 7207 8603 13801 19878 18978 9548 -2604 2913 1259
7266A259q344J2957R587J1689k015j7462k730J1808J1587K775j263j4501j9829
$$ 1259 -7085 5872 15459 27148 25133 7671 4941 16749 28336 31111 29848 15347 -4482
7253d482N48J4354J2722o251K15R079n852q66j4615j1479J5626M187k3720J0216
$$ -4482 -3934 10420 23142 16891 17106 26185 20333 19467 4852 -6627 8999 13186 -10534 -318
7239c18J5354j0316q733K4662J4228Q999P893j4957j6224p3p464m246K0456M735
$$ -318 15036 4720 -4013 20649 34877 43876 51769 36812 20588 20515 13051 8805 29261 33996
7225C3996j2580j2551l972r298o790J4806Q559J1130j446j2680j3367K3218L905
$$ 33996 21416 8865 4893 -4405 -11195 3611 12170 23300 21854 9174 -4193 19025 22930
7212B2930j7884j0889j2004N516m131j180l683j8461M951o25R98J6374R339R722
$$ 22930 5046 -5843 -17847 -12331 -16462 -17642 -21325 -39786 -34835 -35460 -34462 -18088 -8749 973
7198I73L161J779k0533J2378J4471l778k4738Q278M1626Q134l5761m691j0238
$$ 973 4134 5913 -14620 -2242 12229 8451 -16287 -8009 33617 41751 5990 1299 -8939
7185h939n140M538K560R315p52J2827J753n635N327j1578Q142K9640P52k3686
$$ -8939 -14079 -9541 -6981 2334 1582 14409 16162 10527 15854 4276 12418 42058 42810 19124
7171A9124l4052j4667J6657m672Q775N524n652J2724K404n850k695R789J3935
$$ 19124 -14928 -29595 -12938 -17610 -8835 -3311 -8963 3761 6165 315 -2380 7409 21344
7158B1344R179j9372J875M35m394k688J2990J2034j8652n875M089j2875J4086
$$ 21344 30523 11151 13026 13461 9067 6379 19369 31403 12751 6876 10965 -1910 12176
7145A2176j7251k875J9499J0988r330r857m4J3064j0744j9010L610o187r170J2482
$$ 12176 -5075 -7950 11549 22537 13207 3350 3306 16370 5626 -13384 -9774 -15961 -25131 -12649
7131a2649K0818K658p08J060J8967l070n92q22j3227m935o099q4J4609l3036J0355
$$ -12649 8169 10827 10119 11179 30146 27076 26484 25662 12435 7500 1401 1317 15926 -17110 -6755
7116f755K3793Q580k0776M903Q442j3403q046O739J3213J991k1054J3420j086
$$ -6755 17038 25618 4842 9745 18187 4784 -3262 3477 16690 18681 -2373 11047 9961
7103I961j2565j0919J1293K1941j1932L20p248l404O198Q930N291k1841P84n418
$$ 9961 -2604 -13523 -2230 19711 7779 8099 851 -2553 3645 12575 17866 -3975 -3191 -8609
7089h609n420J4793K4432M774o914r545j8792j1723K4067J6670n120j0756Q876
$$ -8609 -14029 764 25196 29970 23056 13511 -5281 -17004 7063 23733 18613 7857 16733
7076A6733k601j024n003j771M332q341j0033P430n910P256j0628P737J3952N652
$$ 16733 14132 13108 8105 6334 10666 2325 -7708 -278 -6188 1068 -9560 -1823 12129 17781
7062A7781N356J59r446K541K3837o977l491J961P111j337j4517p98L223k2052
$$ 17781 23137 23296 13850 16391 40228 33251 29760 31721 38832 37495 22978 22180 25403 3351
7048C351p272J6007J5255l742j0145r012q124P947M86R541j534j0518J751K1949
$$ 3351 -3921 12086 27341 23599 13454 4442 -3682 4265 4751 14292 12758 2240 3991 25940
7034B5940m173r323j0062Q222o778J426K743j1507O544j2007j241Q174M638J1659
$$ 25940 21767 12444 2382 10604 3826 5252 7995 -3512 3032 -8975 -10216 -2042 2596 14255
7020A4255j905J450o427j8459O483l012k809J4613j8234j054J2900O236P400o693
$$ 14255 12350 13800 7373 -11086 -4603 -7615 -10424 4189 -14045 -15099 -2199 4037 11437 4744
7006D744N736P697j3424j4315O362n233j3642l718J3430J8583J9138L228j2524
$$ 4744 10480 18177 4753 -9562 -3200 -8433 -22075 -25793 -12363 6220 25358 28586 16062
6993A6062j4123p673J6157j206m824l027j3125n750N579O661k632o929J786P794
$$ 16062 1939 -5734 10423 9217 4393 1366 -11759 -17509 -11930 -5269 -7901 -14830 -13044 -5250
6979e250J629J1886j127K661j171l774P181k254O807q840o927p146m636J2278
$$ -5250 -3621 8265 7138 9799 8628 4854 12035 9781 16588 7748 821 -6325 -10961 1317
6965A317o387j7627J3269J7846L53Q410P136R06j0518R227J3963k8538l3791r724
$$ 1317 -5070 -22697 -9428 8418 8771 17181 24317 25223 14705 23932 37895 9357 -24434 -34158
6951c4158K5241K3257J5270K4811R909r198k9807j5148l516P763J842R479j5209
$$ -34158 -8917 14340 29610 54421 64330 55132 25325 10177 6661 14424 16266 25745 10536
6938A0536q921j901Q634J5497j762K95l893r315j2701K2732L997m156r70J1462
$$ 10536 1615 -286 8348 23845 22083 22378 18485 9170 -3531 19201 23198 19042 18072 29534
6924B9534j214o474j6052n067O241J1775P315M616n543O794j2117r756j6090p755
$$ 29534 28320 21846 5794 727 6968 18743 26058 30674 25131 31925 19808 10052 -6038 -13793
6910a3793J4370J2233k277n707k335J6915K469o466m9q995J59J0187M495j4177
$$ -13793 577 12810 10533 4826 2491 19406 21875 15409 15360 6365 6524 16711 21206 7029
6896G029k3577l590R389j3927J0421K785k277j1952m105J1719K539q392p07J2246
$$ 7029 -16548 -20138 -10749 -24676 -14255 -11470 -13747 -25699 -29804 -18085 -15546 -23938 -24645 -12399
6882a2399J1105r742L556J955Q628Q360j3808l716j2267l21l68J4547J4048n816
$$ -12399 -1294 -11036 -7480 -5525 3103 11463 -2345 -6061 -18328 -18649 -19017 -4470 9578 3762
6868C762O527j372j4888j0701n447K3295J0552j3942p00p286n277P428P588J3126
$$ 3762 10289 8917 -5971 -16672 -22119 1176 11728 -2214 -2914 -10200 -15477 -8049 -461 12665
6854A2665R435k851J5889P624j5643j7272k1179m170k666j0101j1402j49N293
$$ 12665 22100 19249 35138 42762 27119 9847 -11332 -15502 -18168 -28269 -39671 -39820 -34527
6841c4527K8941M631Q915J641Q806r926j6408Q8K6914j0884p480r656N778j7978
$$ -34527 -5586 -955 7960 9601 18407 8481 -7927 -7839 19075 8191 711 -8945 -3167 -21145
6827b1145L154l710M918R088P710l967k188J2307Q663q699p257j1212M65O138
$$ -21145 -17991 -21701 -16783 -7695 15 -3952 -6140 6167 14830 6131 -1126 -12338 -11873 -5735
6813e735J3255O335j1838m390r122m196J956k030J7242j3516L549P930k2138p270
$$ -5735 7520 13855 2017 -2373 -11495 -15691 -13735 -15765 1477 -12039 -8490 -560 -22698 -29968
6799b9968L895J1473Q257j0518q719J1491j3250P809J1046J048J2170k318j446
$$ -29968 -26073 -14600 -6343 -16861 -25580 -14089 -27339 -19530 -8484 -7436 4734 2416 970
6786I70j158K0403K2865j0064l7641j0061K64J112m522K686o60J5924J4594p437
$$ 970 -188 20215 43080 33016 -4625 -14686 -14422 -13310 -17832 -15146 -15806 118 14712 7275
6772G275j7701N37n9J5825J3013l368j8170r281l128J3946J3420N801p37k8231
$$ 7275 -10426 -9889 -9948 5877 18890 15522 -2648 -11929 -15057 -1111 12309 18110 17373 -10858
6758a0858k7499J0758K3920J6799J0862J813o813q479r300n707R129j2697j3609
$$ -10858 -38357 -27599 -3679 13120 23982 25795 18982 10503 1203 -4504 4625 -8072 -21681
6745b1681r551R059M285j4527Q627K1864J9366J2786j5044j5560N045J4549J0580
$$ -21681 -31232 -22173 -17888 -32415 -23788 -1924 17442 30228 15184 -376 4669 19218 29798
6732B9798j3685r570K1237J0438J2608J2537j0722j0980r174L379l064l3622k4003
$$ 29798 16113 6543 27780 38218 50826 63363 52641 41661 32487 35866 32802 -820 -24823
6719b4823M139L404r511r419K89J322J1440L251K678Q849O007J3408r83j8514
$$ -24823 -20684 -17280 -26791 -36210 -35921 -34599 -23159 -19908 -17230 -8381 -2374 11034 10051 -8463
6705h463p72K804o018o627J7248n156l688K3609J0223n23k762k9765P225q920
$$ -8463 -9235 -6431 -12449 -19076 -1828 -6984 -10672 12937 23160 22637 19875 -9890 -2665 -11585
6691a1585j5430J5006J3569K281l449p668k175Q289Q135r01M319N837m188On234
$$ -11585 -27015 -12009 1560 3841 392 -7276 -9451 -1162 6973 6072 10391 16228 12040 12046 6812
6676F812o447n972l439P370J700j4147J699P187j3098j2877r556K1422K0467j1212
$$ 6812 365 -5607 -9046 -1676 24 -14123 -12424 -5237 -18335 -31212 -40768 -19346 1121 -10091
6662a0091J3665j9451m501K2761N199p847N745L222k0379r628n887P304J8105
$$ -10091 3574 -15877 -20378 2383 7582 -265 5480 8702 -11677 -21305 -27192 -19888 -1783
6649a783M352l879O87N884M052N011k325Q782l224j490j2836k948n161K636K0781
$$ -1783 2569 -1310 -623 5261 9313 14324 11999 20781 17557 16067 3231 283 -4878 -2242 18539
6634A8539Q911j9009r828J811J2762p275k5393j9638M905L942Q497K8963J5447
$$ 18539 27450 8441 -1387 424 13186 5911 -19482 -39120 -34215 -30273 -21776 7187 22634
6621B2634l655j0304O166L473P773k361l415J2853n769j6595j1755n604p584P970
$$ 22634 18979 8675 14841 18314 26087 23726 20311 33164 27395 10800 -955 -6559 -14143 -6173
6607f173j2100M654R712J3738K952n476n163jM012N916r530o353L98R721O476
$$ -6173 -18273 -13619 -3907 9831 12783 7307 2144 2143 6155 12071 2541 -3812 -3414 6307 12783
6592A2783j1302j091J0737P578l062o537j3201J490K0620p211j4658k953r663
$$ 12783 1481 390 11127 18705 15643 9106 -4095 -2605 18015 10804 -3854 -6807 -16470
6579a6470N362J5973j1956O369J9466q457j9856n783J1491R204P713P49j6525
$$ -16470 -11108 4865 -7091 -722 18744 10287 -9569 -15352 -3861 5343 13056 13805 -2720
6566b720N243O338j4354k813O919j528N133J2806j2005J316N837j363k6343M277
$$ -2720 2523 8861 -5493 -8306 -1387 -2915 2218 15024 3019 4335 10172 8809 -17534 -13257
6552a3257K5689O777l019j1299n154k584K403R987K3271M91k5761k888O912n22
$$ -13257 12432 19209 16190 4891 -263 -2847 -444 9543 32814 33305 7544 4656 11568 11046
6538A1046j2284M626J2601J762J0708j2054p740L358k603L355n764j2599k6595
$$ 11046 -1238 3388 15989 17751 28459 16405 8665 12023 9420 12775 7011 -5588 -32183
6525c2183O778L5310j0713N074R129N992j1037j4977j4483K3339Q268j0375L4
$$ -32183 -25405 9905 -808 4266 13395 19387 8350 -6627 -21110 2229 10497 122 156
6512A56O70j3235l77K534j4715M277J5175j5930N038P827J967k0004O68K2681
$$ 156 826 -12409 -12786 -10252 -24967 -20690 -5515 -21445 -16407 -8580 -6613 -26617 -25949 -3268
6498c268m910p008K336J8299J5700J2885J4748j4771j3465k6680q449L371N226
$$ -3268 -8178 -15186 -12850 5449 21149 34034 48782 34011 20546 -6134 -14583 -11212 -5986
6485e986J3229O7M702Q899N337n450Q86J2159J2115j4922j7554L860L019j1742
$$ -5986 7243 7310 12012 20911 26248 20798 21684 33843 45958 31036 13482 17342 20361 8619
6471H619j0847j0758j1379J500m31K0865L278Q73P308j82n122n287l262p353Q903
$$ 8619 -2228 -12986 -24365 -22865 -23296 -2431 847 1720 9028 8846 3724 -1563 -4825 -12178 -3275
6456c275j777j5387R607M401N543J5045l876j0079j0833N194j2426K681J7369
$$ -3275 -5052 -20439 -10832 -6431 -888 14157 10281 202 -10631 -5437 -17863 -15182 2187
6443B187K744j25P106J622o56n100J1006J543p867M695j133R351q184j6269k434
$$ 2187 4931 4806 11912 13534 12878 7778 18784 20327 12460 17155 16022 25373 17189 920 -1514
6428a514p60J781R659N800P00m056q341J0469R667j345j8027j4755L025m63r180
$$ -1514 -2274 -493 9166 14966 15666 11610 3269 13738 23405 22060 4033 -10722 -7697 -8160 -17340
6413a7340k882J2949R221J4829j4363k0402R1J5394N541m507M599k6400L6J4165
$$ -17340 -20222 -7273 1948 16777 2414 -17988 -17897 -2503 3038 -1469 3130 -23270 -23234 -9069
6399i069O807L735K5160r77l9094q529K8043J1474j3050k3356j4804J1078K8484
$$ -9069 -2262 1473 26633 25656 -13438 -21967 6076 17550 4500 -18856 -33660 -22582 5902
6386E902k495k4898k053J1926J9383P843o154K500P975p133K0664J840j7245m631
$$ 5902 3407 -21491 -23544 -11618 7765 15608 9454 11954 19929 12796 33460 35300 18055 13424
6372A3424q262n923j6633J648j0437r649K0320J8158j8063n820K555J4436l84
$$ 13424 5162 -761 -17394 -15746 -26183 -35832 -15512 2646 -15417 -21237 -18682 -4246 -4630
6359d630N174K1321M086L63j2305K00M706L151O14N018p765j5259n835N888l621
$$ -4630 544 21865 25951 26314 14009 14209 18915 22066 22680 27698 19933 4674 -1161 4727 1106
6344A106Q110N761J7562j9751j7808L249J2554P639j1473p897j2001L394J479
$$ 1106 9216 14977 32539 12788 -5020 -1771 10783 18422 6949 -948 -12949 -9555 -8076
6331h076L90J8938P579J197J0307p040j4639n046J0575J1333j1371j5059P52M574
$$ -8076 -7686 11252 18831 20028 30335 23295 8656 3610 14185 25518 14147 -912 -160 4414
6317D414R618R463l956j844p397r703j0429p295R691K2842k993k563J435Q23j0510
$$ 4414 14032 23495 19539 17695 10298 595 -9834 -17129 -7438 15404 12411 9848 11283 12106 1596
6302A596j4850K4017J5536k3203l033J6994Q455q908n420j1984j909L433L462
$$ 1596 -13254 10763 26299 3096 63 17057 25512 16604 11184 -800 -2709 724 4186
6289D186O566r917k9209j8807m464O936l612Q359J3419K0809J9784N562p870k7390
$$ 4186 10752 835 -28374 -47181 -51645 -44709 -48321 -39962 -26543 -5734 14050 19612 11742 -15648
6275a5648k1537J463j195P357Q336J664R937l750k736M010r261N254o930o052
$$ -15648 -37185 -35722 -36917 -29560 -21224 -19560 -9623 -13373 -16109 -12099 -21360 -16106 -23036 -29088
6261b9088J1988J1779l544J3856J708M239k444J0993j42k1807O362J2991j0102
$$ -29088 -17100 -5321 -8865 4991 6699 10938 8494 19487 19345 -2462 3900 16891 6789
6248F789j4824L629O648R100P499m377j2107P746o558q463j6281J2462J6988M588
$$ 6789 -8035 -4406 2242 11342 18841 14464 2357 10103 3545 -4918 -21199 -8737 8251 12839
6234A2839M710o766k513j0345L667l384l039K142J1860m152l022Q730R677p628
$$ 12839 17549 10783 8270 -2075 1592 -1792 -4831 -2689 9171 5019 1997 10727 20404 12776
6220A2776k693l969j9750j2720J0204Q332J2300J2359j74j6430o013J4281k503
$$ 12776 10083 6114 -13636 -26356 -16152 -7820 4480 16839 16665 235 -5778 8503 6000
6207F000r814o582m211k086P530qq90J1273J4075j442J303J781L947j665l604
$$ 6000 -3814 -10396 -14607 -16693 -9163 -9171 -10061 1212 15287 13845 15148 16929 20876 19211 15607
6192A5607o203j8260R34q68l325Q044J691j5710j2094O689J3237j0003o708j042
$$ 15607 9404 -8856 -7922 -8790 -12115 -4071 -2380 -18090 -30184 -23495 -10258 -20261 -26969 -28011
6178b8011N316O178n934l225K1814m357J5115J032j435Q911J7520j4723j7489
$$ -28011 -22695 -16517 -22451 -25676 -3862 -8219 6896 7928 6493 15404 32924 18201 712
6165G12K474r328P419k353k78k822q508l790J6425K7036n039j3900N8Q484J5020
$$ 712 3186 -6142 1277 -1076 -1354 -4176 -12684 -16474 -49 26987 21948 8048 8106 16590 31610
6150C1610j4651p030j2243j3335N42M011K218l427O693j236j1305j400J802J1828
$$ 31610 16959 9929 -2314 -15649 -15107 -11096 -8878 -12305 -5612 -6848 -18153 -19553 -17751 -5923
6136e923l328j495J1921q41l510j0578o305J3025Q849k778J922R512l983j6478
$$ -5923 -9251 -10746 1175 334 -3176 -13754 -20059 -7034 1815 -963 959 10471 6488 -9990
6122i990J026n997J8870m163q94j3049q847N446Q956J1744m188J594n88M393l506
$$ -9990 -8964 -14961 3909 -254 -1148 -14197 -23044 -17598 -8642 3102 -1086 508 -80 4313 807
6107H07O915Q332m749k6611L235J0641J0612M46n946q260M801J60o737J938N925
$$ 807 7722 16054 11305 -15306 -12071 -1430 9182 9628 3682 -4578 223 383 -6354 -4416 1509
6092A509n176j246j7627R803J3120J2350J3283q881j6253j4849L01k381Q776O688
$$ 1509 -3667 -4913 -22540 -12737 383 12733 26016 17135 882 -13967 -13666 -16047 -7271 -583
6078e83K302j2746q000Q131m834n427J336K3504J9414J1502l796m845k5071J183
$$ -583 1719 -11027 -19027 -10896 -15730 -21157 -19821 3683 23097 34599 30803 25958 887 2070
6064B070R048k63q944p831J575K0939L385n034j8484j5270J5760M11n787j972
$$ 2070 11118 10855 1911 -5920 -4345 16594 19979 14945 -3539 -18809 -3049 -2638 -8425 -10397
6050a0397j746m525K875J3751J1825Q12N758j3867l58O968O28n164j6480J3000
$$ -10397 -12143 -16668 -13793 -42 11783 12595 18353 4486 4128 11096 11724 6560 -9920 3080
6036C080J1508j5995j4282K265n236n794J6314J4563n469j1049k572J363K4529
$$ 3080 14588 -1407 -15689 -13424 -18660 -24454 -8140 6423 954 -10095 -12667 -11304 13225
6023A3225N045n522j6473l358J3027J1320q861j0864k3912L583O000n918P670
$$ 13225 18270 12748 -3725 -7083 5944 17264 8403 -2461 -26373 -22790 -16790 -22708 -15038
6010a5038J495o915k733J827R126K0093J7930N846j4858j3872J790Q54j5193k5500
$$ -15038 -13543 -20458 -23191 -21364 -12238 7855 25785 31631 16773 2901 4691 5545 -9648 -35148
5996c5148O043J8215L513r987m339J1888K068R760J4313j846k7261n544M429p653
$$ -35148 -29105 -10890 -7377 -17364 -21703 -9815 -7747 2013 16326 14480 -12781 -18325 -13896 -21549
5982b1549j75l277l91K0076n262j478k219P849J0753m845m223q480j4667J9019
$$ -21549 -21724 -25001 -25392 -5316 -10578 -12056 -14275 -6426 4327 -518 -4741 -13221 -27888 -8869
5968h869J2510j1925j3453j8937R73K8317J8789p331r506l018k819O391J1082
$$ -8869 3641 -8284 -21737 -40674 -39701 -11384 7405 74 -9432 -12450 -15269 -8878 2204
5955B204j471r693J1055K0066j1444p498r565l451l234j2193j2835M197J4742
$$ 2204 733 -8960 2095 22161 10717 3219 -6346 -9797 -13031 -25224 -38059 -33862 -19120
5942a9120K4881J169j1192M705m205k402R641J0210j406n034L234l216k386j344
$$ -19120 5761 6930 -4262 443 -3762 -6164 3477 13687 12281 7247 10481 7265 4879 3535
5928C535q803K2293J2863L28o655p978O80R938R487r344r105j4301j3190M00J629
$$ 3535 -5268 17025 29888 30216 23561 15583 16263 26201 35688 26344 17239 2938 -10252 -9852 -8223
5913h223J0315j779m400K9521J3482M692k3595k0856j7993j2552R053K04J80K3529
$$ -8223 2092 313 -4087 25434 38916 43608 20013 -843 -18836 -31388 -22335 -22131 -21951 1578
5899A578m391j1152J1377Q646K0334m359j5527j9246k73J311n990J4143M501O46
$$ 1578 -2813 -13965 -2588 6058 26392 22033 6506 -12740 -13013 -11702 -17692 -3549 952 1598
5885A598k027j4367j3081m338J6671K5085m388q025K442p063j1173j3639r110
$$ 1598 -429 -14796 -27877 -32215 -15544 9541 5153 -2872 -430 -7493 -18666 -32305 -41415
5872d1415j2832K6131J954k160n47K3054J1497j1206o652j282J6882o601j3994
$$ -41415 -54247 -28116 -26162 -28322 -28869 -5815 5682 -5524 -12176 -13458 3424 -3177 -17171
5859a7171L069K643J1263Q295M54J680j3087m338j5962j169P447K700J7394J877
$$ -17171 -14102 -11459 -196 8099 8553 10233 -2854 -7192 -23154 -24323 -16876 -14176 3218 5095
5845E095l042j0854K383J4610P199J4841P180k6071k0411p000N97Q018J189N486
$$ 5095 2053 -8801 -6418 8192 15391 30232 37412 11341 -9070 -16070 -15473 -7455 -6266 -780
5831g80l353j2212K492j216j7943o551P033l933K0845R838m964J8545r655p942
$$ -780 -4133 -16345 -13853 -15069 -33012 -39563 -32530 -36463 -15618 -5780 -10744 7801 -1854 -9796
5817i796k580P550N690P027r906M739J0117M973j1574n392k662j6716j1290K2009
$$ -9796 -12376 -4826 864 7891 -2015 2724 12841 17814 6240 848 -1814 -18530 -29820 -7811
5803g811J1332oO226o945n168m910J5618M252n791J6466q099j6966M558n013l879
$$ -7811 3521 3515 9741 2796 -2372 -7282 8336 12588 6797 23263 15164 -1802 2756 -2257 -6136
5788f136O40l113r090j2976r242J5266J2544K539J296M27P086J7721q508p655
$$ -6136 -5496 -8609 -17699 -30675 -39917 -24651 -12107 -9568 -8272 -7845 -759 16962 8454 799
5774G99q063N860l237P289L773j7184k2973J6921j868m778r58k451J375J3260
$$ 799 -7264 -1404 -4641 2648 6421 -10763 -33736 -16815 -18683 -23461 -24419 -26870 -25495 -12235
5760a2235Q411K0248N743o031o661j3852j3464J2710K6125M065j859k665m123
$$ -12235 -3824 16424 22167 16136 9475 -4377 -17841 -5131 20994 25059 23200 20535 16412
5747A6412j593Q78j9741q666K00O890J0279O800n556j5024r42J2261J6700J0370
$$ 16412 14819 15697 -4044 -12710 -12510 -5620 4659 11459 5903 -9121 -10063 2198 18898 29268
5733B9268Q0j2711p838r761o700j3183j4259N484K0269J427j1196J049p259R132
$$ 29268 29348 16637 8799 -962 -7662 -20845 -35104 -29620 -9351 -7924 -19120 -18071 -25330 -16198
5719a6198O465P7l378l14k792j3064J1866o639l191P188r242K4365K170L001q346
$$ -16198 -9733 -9656 -13034 -13348 -16140 -29204 -17338 -23977 -27168 -19980 -29222 -4857 -2687 314 -8032
5704h032K773J2837ok525l721M539L03K870j760m580Q885J1872k209p466j247
$$ -8032 -5259 7578 7572 5047 1326 5865 6168 9038 7278 2698 11583 23455 21246 13780 12533
5689A2533O290J0071k1182j6232J648J5990Q576k0680K637J6326M105r502m149
$$ 12533 18823 28894 7712 -8520 -6872 9118 17694 -2986 -349 15977 20082 10580 6431
5676F431j1485p192N096J426j0366K2812m534J614K754J0452j6390k1207q733
$$ 6431 -5054 -12246 -7150 -5724 -16090 6722 2188 3802 6556 17008 618 -20589 -29322
5663b9322N677K9587R842r112k0369q841m611Q641J0319m843J225K756P788n790
$$ -29322 -23645 5942 15784 6672 -13697 -22538 -27149 -18508 -8189 -13032 -11807 -9051 -1263 -7053
5649g053R452J3088j9814j0360j2593J4376J2092L850J8188j6107j5696J429J3821
$$ -7053 2399 15487 -4327 -14687 -27280 -12904 -812 3038 21226 5119 -10577 -9148 4673
5636D673k698j3710j964j0168j5262N137L1560K1291q624n141M041K3987J0007
$$ 4673 1975 -11735 -13699 -23867 -39129 -33992 -2432 18859 10235 5094 9135 33122 43129
5623D3129j1750l2807j1873M944k446l894M189q306l725J5792R951Q964J588j3076
$$ 43129 31379 -1428 -13301 -8357 -10803 -14697 -10508 -18814 -22539 -6747 3204 12168 13756 680
5609F80j398J626k582o345j4816j2969J926P537J6037N473L1O49J6353J1466q234
$$ 680 -718 908 -1674 -8019 -22835 -35804 -33878 -26341 -10304 -4831 -4800 -4151 12202 23668 15434
5594A5434k1610p291K013K834o295J9041R887J4890L660m812j2160k142p69r749
$$ 15434 -6176 -13467 -11454 -8620 -14915 4126 14013 28903 32563 27751 15591 13449 12680 2931
5580B931k02J1065j7593j6687R869K706n275m13K005L366J549n844J1289R755
$$ 2931 2729 13794 -3799 -20486 -10617 -7911 -13186 -13599 -11594 -8228 -6679 -12523 -1234 8521
5566H521j4246r852Q606K7587Q883j3732j2692j469K825j0394M406K1347O836
$$ 8521 -5725 -15577 -6971 20616 29499 15767 3075 1606 4431 -5963 -1557 19790 26626
5553B6626O82k1211K150J0117j459R3p144P179J2338l1281k1094o246J3579o803
$$ 26626 27308 6097 8247 18364 16905 16998 9854 17033 29371 -1910 -23004 -29250 -15671 -22474
5539b2474k3435o35P649L108R787l890Q651J5376N947P465M653k871j4221j6304
$$ -22474 -45909 -46544 -38895 -35787 -26000 -29890 -21239 -5863 84 7549 12202 9331 -4890 -21194
5525b1194R236m754p34N632r600j17m371o247p784O637J7243J3763J4483N924
$$ -21194 -11958 -16712 -17446 -11814 -21414 -21531 -25902 -32149 -39933 -33296 -16053 -2290 12193 18117
5511A8117q213M749Q664r835l549k415o253m799N912M071M126r600k609J1051
$$ 18117 9904 14653 23317 13482 9933 7518 1265 -3534 2378 6449 10575 975 -1634 9417
5497I417j1398r917K946J8021p031j5586j299q126l991J7436m34K7158J5668j6101
$$ 9417 -1981 -11898 -8952 9069 2038 -13548 -14847 -22973 -26964 -9528 -9962 17196 32864 16763
5483A6763l1368P818J3207n456j2610l377J724J5047o133p014Q374j515M895L610
$$ 16763 -14605 -6787 6420 964 -11646 -15023 -13299 1748 -4385 -11399 -3025 -4540 355 3965
5469C965k154k207L1549K737j3414R010k2287k9474p37M328J2659J5009m107K06
$$ 3965 1811 -396 31153 33890 20476 29486 7199 -22275 -23012 -18684 -6025 8984 4877 5083
5455E083r302m96L281Q312q882M121L561P076P008N613p311k1303q753j735M99
$$ 5083 -4219 -4715 -1434 6878 -2004 2117 5678 12754 19762 25375 18064 -3239 -11992 -13727 -13228
5440a3228K0769J401M549J677j142J4460K446j0665K239o971l292l067p879J2018
$$ -13228 7541 8942 13491 15168 14026 28486 30932 20267 22506 15535 12243 9176 1297 13315
5426A3315j3936j586j529K6125O703k641q478j3983k2606j733J8164J6142n892
$$ 13315 -621 -2207 -3736 22389 29092 26451 17973 3990 -18616 -20349 -2185 13957 8065
5413H065j5882q39p771r199j1682n430o634l047J4035J7690R114J4173L006q99
$$ 8065 -7817 -8656 -16427 -25626 -37308 -42738 -49372 -52419 -38384 -20694 -11580 2593 5599 4700
5399D700n692M261O07L726k91k286L847r572J1008N491J1768j0443j8650P505
$$ 4700 -992 3269 3876 7602 7311 5025 8872 -700 10308 15799 27567 17124 -1526 5979
5385E979J7296o01j3532j7714m896L65j942M727n587j5979M054R708l060M057
$$ 5979 23275 22674 9142 -8572 -13468 -13103 -15045 -10318 -15905 -31884 -27830 -18122 -21182 -17125
5371a7125n3m880J0242O836n281J891l692k6314m551j763L158Q127J2463N400
$$ -17125 -17178 -22058 -11816 -4980 -10261 -8370 -12062 -38376 -42927 -44690 -41532 -33405 -20942 -15542
5357a5542J128N779K23Q210J090N108J2129Q532r762r843K462n209k050R604O699
$$ -15542 -14414 -8635 -8412 -202 888 5996 18125 26657 16895 7052 9514 4305 2255 11859 18558
5342A8558J0661Q56j8009j6796N989L420M165m392K676Q753k1347r172J2983j008
$$ 18558 29219 30075 12066 -4730 1259 4679 8844 4452 7128 15881 -5466 -14638 -1655 -2663
5328b663o705j1989j986L521L59n188l406K991j0344q793K2198J8529p363j1096
$$ -2663 -9368 -21357 -23343 -19822 -19463 -24651 -28057 -25066 -35410 -44203 -22005 -3476 -10839 -21935
5314b1935J0042m66M51K131R25j917J0688O766m893P8j1344r547J3892Q997K140
$$ -21935 -11893 -12359 -11908 -9777 -8852 -10769 -81 6685 1792 1870 -9474 -19021 -5129 3868 6008
5299F008k0790j996Q008L456J1973P025J7283m496l265q684J4330N123r353n353
$$ 6008 -14782 -16778 -8770 -5314 6659 13684 30967 26471 23206 14522 28852 33975 24622 19269
5285A9269r661l775j9351k9984N705J8592Q061j5502Q432J6121r601j2764O82
$$ 19269 9608 5833 -13518 -43502 -37797 -19205 -11144 -26646 -18214 -2093 -11694 -24458 -23776
5272b3776R789m540j622Q950P527R881O750M733p059o923M26L635R920k923j3952
$$ -23776 -13987 -18527 -20149 -11199 -3672 6209 12959 17692 10633 3710 4136 7771 17691 14768 816
5257H16q781j1744O360O568p520J2988j0310r114P138J2413P180m655j3123j1606
$$ 816 -7965 -19709 -13349 -6781 -14301 -1313 -11623 -20737 -13599 -1186 5994 1339 -11784 -23390
5243b3390J3138m590R40K522k1091o170K1611R410j369O33q39Q116m650p653J8820
$$ -23390 -10252 -14842 -13902 -11380 -32471 -38641 -17030 -7620 -8989 -8356 -9195 -1079 -5729 -13382 5438
5228E438m159p063j775n716k93Q46n765k197j0357K621K1852N45p564K787J2498
$$ 5438 1279 -5784 -7559 -13275 -13568 -12722 -18487 -20684 -31041 -28420 -6568 -6023 -13587 -10800 1698
5213A698J82p19n65J1341K5719Q420r580j5919J587j1245j3551q31p615K874R196
$$ 1698 1880 1161 596 11937 37656 46076 36496 20577 22164 10919 -2632 -3463 -11078 -8204 992
5198I92P338j8043M404L775P938k158j2041j699L266n192K815J831K865R252Q418
$$ 992 8330 -9713 -5309 -1534 6404 4246 -7795 -9494 -6228 -11420 -8605 -6774 -3909 5343 13761
5183A3761j8738j885J5725k118p003M14M4j0710j51m558J7595K006k2570p005
$$ 13761 -4977 -6862 8863 6745 -258 156 200 -10510 -10661 -15219 2376 4382 -18188 -25193
5169b5193R99J4469O782K3028m649J640K680l992R87J7966L157q642P155j8905
$$ -25193 -24194 -9725 -2943 20085 15436 17076 19756 15764 16751 34717 37874 29232 36387 17482
5155A7482j3906J132Q912p611j6849j906K3017m290j4221Q888J9145j8159k8687
$$ 17482 3576 4708 13620 6009 -10840 -12746 10271 5981 -8240 648 19793 1634 -27053
5142b7053K562J5377O741j9641Q791L7255J9750j160k7979r656O405q283P083
$$ -27053 -24491 -9114 -2373 -22014 -13223 24032 43782 42622 14643 4987 11392 3109 10192
5129A0192o005k410r785P10o34j5383k569K5613L5270J2993j0387q395R20J2037
$$ 10192 4187 1777 -8008 -7298 -7932 -23315 -25884 -271 34999 47992 37605 29210 30130 42167
5115D2167l659q324K73J295j2415j7804j8158P202P776J3950J3840L872j519l208
$$ 42167 38508 30184 30457 31752 19337 1533 -16625 -9423 -1647 12303 26143 30015 28496 25288
5101B5288q555Q54j2694L7L293n751K2532P735K830o381j048k1953j3234l609
$$ 25288 16733 17587 4893 4930 8223 2472 25004 32739 35569 29188 28140 6187 -7047 -10656
5087a0656J1710Q391k382K466j2384m651K369J3310J7297O389j1924j3236k7154
$$ -10656 1054 9445 7063 9529 -2855 -7506 -5137 8173 25470 31859 19935 6699 -20455
5074b0455Qk784q61J2702L864J6698j250l035j0981k0001J2057j3187k2645k012
$$ -20455 -20447 -23231 -24092 -11390 -7526 9172 7922 4887 -6094 -26095 -14038 -27225 -49870 -51882
5060e1882K877P587R790J6209Q487O20m332r056J4451L046R747J4680r275j7975
$$ -51882 -49005 -41418 -31628 -15419 -6932 -6312 -10644 -19700 -5249 -2203 7544 22224 12949 -5026
5046e026o565L358J4973J2217j9737m073o235J1805K2285M890o324k5359j332
$$ -5026 -11591 -8233 6740 18957 -780 -4853 -11088 717 23002 27892 21568 -3791 -5123
5033e123P034j995j1763o310k839Q931L142j4581m443P123M425J073J348k341
$$ -5123 1911 -84 -11847 -18157 -20996 -12065 -8923 -23504 -27947 -20824 -16399 -15326 -13978 -16319
5019a6319J658K3920O922j2548Q530M253k4481L985J250P691o410J7339N476k5380
$$ -16319 -14661 9259 16181 3633 12163 16416 -8065 -4080 -2830 4861 -1549 15790 21266 -4114
5005d114j8255J0678P60K5121n171k0968j0787j644J7700J5461K2874N350m359
$$ -4114 -22369 -11691 -10931 14190 9019 -11949 -22736 -24380 -6680 8781 31655 37005 32646
4992C2646j140j9030j0642j441j4238L858J9708j9772j7911J3267R932k845j6048
$$ 32646 31506 12476 1834 393 -13845 -9987 9721 -10051 -27962 -14695 -4763 -7608 -23656
4979b3656K452J2969l324Q517j540P462j8405j2806J4380J0045m430Q46J948r586
$$ -23656 -21204 -8235 -11559 -3042 -4582 2880 -15525 -28331 -13951 -3906 -8336 -7490 -5542 -15128
4965a5128K645K5924j1468N845N915r789J3349Q075k1875k9636Q089l14K731O257
$$ -15128 -12483 13441 1973 7818 13733 3944 17293 25368 3493 -26143 -18054 -18368 -15637 -9380
4951i380J0993j134J1987j7646j2493J495J0522J8624j0599j6117p367j5533j128
$$ -9380 1613 479 12466 -5180 -17673 -16178 -5656 12968 2369 -13748 -21115 -36648 -37776
4938c7776J8151J9020N84l168O64P109R06r066j3708J904j4107o425K628J709
$$ -37776 -19625 -605 -21 -3189 -2525 4584 5490 -3576 -17284 -15380 -29487 -35912 -33284 -31575
4924c1575K9026P877k2739r55N734L760r141p577J2614J3905k307k2148j969R084
$$ -31575 -2549 5328 -17411 -18366 -12632 -8872 -18013 -25590 -12976 929 -1378 -23526 -25495 -16411
4910a6411L680j758l442Q05J9224R9j7615L92J3410j5333Q208n484j5678q610
$$ -16411 -12731 -14489 -17931 -17126 2098 2197 -15418 -15026 -1616 -16949 -8741 -14225 -29903 -38513
4896c8513R695J598K152M903L320K66q684J377K807r233L683k945J1987K5460
$$ -38513 -28818 -27220 -25068 -20165 -16845 -16579 -25263 -23886 -21079 -30312 -26629 -29574 -17587 7873
4882G873k815l2796r280M1702J2930l268j2946J1568o065j4110J0002O721K877
$$ 7873 5058 -27738 -37018 4684 17614 14346 1400 12968 6903 -7207 2795 9516 12393
4869A2393n385N209m433n17k529j8928O343O335K371n376m89k309j594j619P301
$$ 12393 7008 12217 7784 7267 4738 -14190 -7847 -1512 859 -4517 -5006 -7315 -8909 -10528 -3227
4854c227J0248l618o405J9575K0402j0450N607j1498n804k999L401r701J201k2084
$$ -3227 7021 3403 -3002 16573 36975 26525 32132 20634 14830 11831 15232 5531 6732 -15352
4840a5352j7344P517M263O828J4902K53k1758R36J9749L175J0921O016k4121k891
$$ -15352 -32696 -25179 -20916 -14088 814 1067 -20691 -19755 -6 3169 14090 20106 -4015 -6906
4826f906Q906N065J5609o34j5286r866l24P514l57m823K744J3803O680P483j0348
$$ -6906 2000 7065 22674 22040 6754 -3112 -3436 4078 3721 -1102 1642 15445 22125 29608 19260
4811A9260k0606r357J2822J0943l478M266M202j3113J365J6908k112j2617j2528
$$ 19260 -1346 -10703 2119 13062 9584 13850 18052 4939 6304 23212 21100 8483 -4045
4798d045R755K130j2190n349R858M349J365P310j0157k5131m224P434L910j0450
$$ -4045 5710 7840 -4350 -9699 159 4508 5873 13183 3026 -22105 -26329 -18895 -14985 -25435
4784b5435K0158K6496j3084n708J6862j0177j1825k2357R434K8042J5378q757
$$ -25435 -5277 21219 8135 2427 19289 9112 -2713 -25070 -15636 12406 27784 19027
4772A9027r005k0810o086K0773J825o844p905J4850K851r717k021J6852j5981
$$ 19027 10022 -10788 -16874 3899 5724 -1120 -9025 5825 8676 -1041 -3062 13790 -2191
4759b191j0324j273J0723K293j0295O708M142L039p163j1095k3522J4415P027
$$ -2191 -12515 -13788 -3065 -772 -11067 -4359 -217 2822 -4341 -15436 -38958 -24543 -17516
4746a7516R279J3136K6458K0934k8306k0753j043o482m053r771j5534j8323K5253
$$ -17516 -8237 4899 31357 52291 23985 3232 2189 -4293 -8346 -18117 -33651 -51974 -26721
4733b6721O869K441N527o141K6737l171j3666N844N219o38O59K0967L658j3629
$$ -26721 -19852 -17411 -11884 -18025 8712 5541 -8125 -2281 2938 2300 2959 23926 27584 13955
4719A3955j5852k341j5757k9113R661L9763M883q316p585L031Q808Q764K485j889
$$ 13955 -1897 -4238 -19995 -49108 -39447 316 5199 -3117 -10702 -7671 1137 9901 12386 10497
4705A0497l5073R504K0244N998r762p263J0794J1481L406R531r118j4112j076
$$ 10497 -24576 -15072 5172 11170 1408 -5855 4939 16420 19826 29357 20239 6127 5051
4692E051R136j736j5166j4630P033J9759j5862K709J1780J233j0245n278J011
$$ 5051 14187 12451 -2715 -17345 -10312 9447 -6415 -3706 8074 9307 -938 -6216 -5205
4679e205N701M03q895J441K3735j4492j4266N482J8559r464j6591k662K587n975
$$ -5205 496 899 -7996 -6555 17180 2688 -11578 -6096 12463 2999 -13592 -16254 -13667 -19642
4665a9642M732j0016Q091R970n02J0657J3377Q982M979k488j5608j0651r926j1547
$$ -19642 -14910 -24926 -16835 -6865 -7367 3290 16667 25649 30628 28140 12532 1881 -8045 -19592
4651a9592j9168j1Q433J2387L992R873N537n433K725K656n425j8787j6352J9506
$$ -19592 -38760 -38771 -30338 -17951 -13959 -4086 1451 -3982 -1257 1399 -4026 -22813 -39165 -19659
4637a9659L150M228j9450j721L0817J3365k433J2684K0315N03k9782q506k3218
$$ -19659 -16509 -12281 -31731 -33452 -2635 10730 8297 20981 41296 41799 12017 3511 -19707
4624a9707m47J4798M547R97K72o278n375M843L479J47r424k069L506r933l146
$$ -19707 -20154 -5356 -809 188 460 -5818 -11193 -6350 -2871 -2724 -12148 -14217 -10711 -20644 -23790
4609b3790o574J5633R152J4841J1679J015m974j0434R261J8072k709r850j4932
$$ -23790 -30364 -14731 -5579 9262 20941 21956 16982 6548 15809 33881 31172 21322 6390
4596F390p115o74j8468q531j4510p163R766K8774M900M650j8253j820Q879Q817
$$ 6390 -725 -1399 -19867 -28398 -42908 -50071 -40305 -11531 -6631 -1981 -20234 -22054 -13175 -4358
4582d358J2958N864N785J696j0572N340N920k188j004R068M911N921k6761j3535
$$ -4358 8600 14464 20249 21945 11373 16713 22633 20445 19441 28509 33420 39341 12580 -955
4568i55J8475r147K660R762r320k0462j473Q877p816k249J3232j804k2705k5953
$$ -955 17520 8373 11033 20795 11475 -8987 -10460 -1583 -9399 -11648 1584 -220 -22925 -48878
4554d8878N308N498J0045k2913R726J5711K056L452k426j946K3060r89L701J717
$$ -48878 -43570 -38072 -28027 -50940 -41214 -25503 -23447 -19995 -22421 -24367 -1307 -2296 1405 3122
4540C122j0123K723r050n301m888J570J4124r133L541J558n877m571J1465M951
$$ 3122 -7001 -4278 -13328 -18629 -23517 -21947 -7823 -16956 -13415 -11857 -17734 -22305 -10840 -5889
4526e889O798r859j277j266o008l141L434O165p140j1673p675J8948J6459P248
$$ -5889 909 -8950 -10227 -11493 -17501 -20642 -17208 -11043 -18183 -29856 -37531 -18583 -2124 5124
4512E124j44o894j2955K1463Q765J3911Q739j4885k316o059r720q444l734M110
$$ 5124 4980 -1914 -14869 6594 15359 29270 38009 23124 20808 14749 5029 -3415 -7149 -3039
4498c039j521J757l728j3466j4080J8082K8221K1630n348k6193q866K709j010
$$ -3039 -4560 -2803 -6531 -19997 -34077 -15995 12226 33856 28508 2315 -6551 -3842 -4852
4485d852j2119P834J4566J6471p987j4016q332P385K399J3242J1042R677m150
$$ -4852 -16971 -9137 5429 21900 13913 -103 -8435 -1050 1349 14591 25633 35310 31160
4472C1160j4509k060L388k2598j4086K601N707J7767P726n939r257r129k3457
$$ 31160 16651 14591 17979 -4619 -18705 -16104 -10397 7370 15096 9157 -100 -9229 -32686
4459c2686k251J0356Q548k998j385R265j0849O98o01m258R861l677L3222J5858
$$ -32686 -34937 -24581 -16033 -19031 -20416 -11151 -22000 -21302 -21903 -26161 -16300 -19977 13245 29103
4445B9103p832m541k690N853Q462j7121k7488r965J4598Q555M88n67Q559o371
$$ 29103 21271 16730 14040 19893 28355 11234 -16254 -26219 -11621 -3066 -2578 -3145 5414 -957
4431i57j8899r286m478J6964J0625k034j0090J0021R487m698n047r340Q688K4032
$$ -957 -19856 -29142 -33620 -16656 -6031 -8065 -18155 -8134 1353 -3345 -8392 -17732 -9044 14988
4417A4988J0355n848k5985k1011P778n051m074J9447P579J8534j3772q797j2438
$$ 14988 25343 19495 -6490 -27501 -19723 -24774 -28848 -9401 -1822 16712 2940 -5857 -18295
4404a8295J542N357J1507j3081p885P831J5132P073P6j5652j7090n133J7847M355
$$ -18295 -16753 -11396 111 -12970 -20855 -13024 2108 9181 9257 -6395 -23485 -28618 -10771 -6416
4390f416P733J1398j4805j7263j0294Q154p051q928J4450j3366J6766J2227J2080
$$ -6416 1317 12715 -2090 -19353 -29647 -21493 -28544 -37472 -23022 -36388 -19622 -7395 4685
4377D685J1756Q13O69q230j0451O668M165r79j2397o016O261J0456R325J4542
$$ 4685 16441 17254 17923 9693 -758 5910 10075 9096 -3301 -9317 -3056 7400 16725 31267
4363C1267o8l2243m543J9170O94j3801j5689j1061J4033M499k11J0732J2458j1170
$$ 31267 31199 -1044 -5587 13583 14277 476 -15213 -26274 -12241 -7742 -7953 2779 15237 4067
4349D067k261J4202J2450m926M033j0079l917o602k150P861l115k1739K22j6538
$$ 4067 1806 16008 28458 23532 27565 17486 13569 6967 4817 12678 9563 -12176 -11954 -28492
4335b8492l309J1474Q415J4836r778j8551j472N608J7313J321j6599J957n566
$$ -28492 -31801 -20327 -11912 2924 -6854 -25405 -26877 -21269 -3956 -2635 -19234 -17277 -22843
4322b2843n989Q554J14M60M987M484o062J2471J1822K236k477p513n617k0381
$$ -22843 -28832 -20278 -20164 -19704 -14717 -10233 -16295 -3824 7998 10234 7757 244 -5373 -25754
4308b5754L435K3982J8455K850l233n28o357j0792j5272K1898J3319K372j5164
$$ -25754 -22319 1663 20118 22968 19735 19207 12850 2058 -13214 8684 22003 24375 9211
4295I211k750k909j1383o638J3203J3430j1676K614Q961j0646j1981k123o8J0485
$$ 9211 6461 3552 -7831 -14469 -1266 12164 488 3102 12063 1417 -10564 -12687 -12755 -2270
4281b270j0259j3622RM766J0270R49J7806j9602k8479j3883R426J8185L876p750
$$ -2270 -12529 -26151 -26142 -21376 -11106 -10157 7649 -11953 -40432 -54315 -44889 -26704 -22828 -30578
4267c0578J466R136m564R700J1087r203L039J285j4859M49R548r473M479N513
$$ -30578 -29112 -19976 -24540 -14840 -3753 -12956 -9917 -8632 -23491 -23042 -13494 -22967 -18488 -12975
4253a2975q227N883M977j0964j6413J3475J4990L15m847j3782K0199J7155j670
$$ -12975 -21202 -15319 -10342 -21306 -37719 -24244 -9254 -8939 -13786 -27568 -7369 9786 8116
4240H116o855J196O929q724j8075p762p74K2258L172L081R568J3560J0285j6344
$$ 8116 1261 2457 9386 662 -17413 -25175 -25949 -3691 -519 2562 12130 25690 35975 19631
4226A9631m681j8670N796J34k2299q190J2747j1448Q362J8859J4669j290m961
$$ 19631 14950 -3720 2076 2210 -20089 -28279 -15532 -26980 -18618 241 14910 13620 8659
4213H659R632o851j3720J0034j2083q352m62j900n009l814P601N169J1097P675
$$ 8659 18291 11440 -2280 7754 -4329 -12681 -13143 -15043 -20052 -23866 -16265 -11096 1 7676
4199G676P490l08K010j738o620m171n954r813P292J4219q997k854Q853K497n66
$$ 7676 15166 14858 16868 15130 8510 4339 -1615 -11428 -4136 10083 1086 -1768 7085 9582 9016
4184I016n205m930k399k073O51O902K903K381j6123j2180K6882P153K236o872
$$ 9016 3811 -1119 -3518 -5591 -4940 1962 4865 7246 -8877 -21057 5825 12978 15214 8342
4170H342q87n39j7356J7642r165q33R893k71m944j0429Q918J5260q65o603j254
$$ 8342 7455 6916 -10440 7202 -1963 -2796 7097 6826 1882 -8547 371 15631 14766 8163 6909
4155F909q224P180k912q986L576j728j3276j1597O669J185J5007j835j4795O66
$$ 6909 -1315 5865 2953 -6033 -2457 -4185 -17461 -29058 -22389 -21204 -6197 -8032 -22827 -22161
4141b2161J2360J0930j76j7384j4481M061K4938L619j4725k0093O08P754r459
$$ -22161 -9801 1129 953 -16431 -30912 -26851 -1913 1706 -13019 -33112 -32504 -24750 -34209
4128c4209J0748J9137J2875j7897o605K1330K5561J885j5542k4652K115K660J776
$$ -34209 -23461 -4324 8551 -9346 -15951 5379 30940 32825 17283 -7369 -5254 -2594 -818
4115h18K9779j3110m4255o786J3353J1140K1625J6898q474j2627M304j958M510
$$ -818 28961 15851 -28404 -35190 -21837 -10697 10928 27826 19352 6725 11029 9071 13581
4102A3581o819q67N522R956M066M603k673l2818o716j9480j2458J9678L0377O548
$$ 13581 6762 5895 11417 21373 25439 30042 27369 -5449 -12165 -31645 -44103 -24425 5952 12500
4088A2500j4708j4233r036R441M922K968O56l793J3359N128j0019l254O061O0
$$ 12500 -2208 -16441 -25477 -16036 -11114 -8146 -7490 -11283 2076 7204 -2815 -6069 -8 52
4074E2K235k120J6185K921n468k2488j4735K1652Q564n347J106M444j2354R213
$$ 52 2287 167 16352 19273 13805 -8683 -23418 -1766 6798 1451 2557 7001 -5353 3860
4060C860J2464n711q292j4906J8155l988j1602l280Q451J7702M742m769o490J4615
$$ 3860 16324 10613 2321 -12585 5570 1582 -10020 -13300 -4849 12853 17595 12826 6336 20951
4046B0951J4645m174L916j5230q334J9712n13p261n692n977J3944K817k4247K546
$$ 20951 35596 31422 35338 20108 11774 31486 30973 23712 18020 12043 25987 28804 4557 7103
4032G103n651L238M882N741j117r2k84k8173k5851o274N872J7302N692O913j8783
$$ 7103 1452 4690 9572 15313 14196 14104 13820 -14353 -40204 -46478 -40606 -23304 -17612 -10699 -29482
4017b9482J1775M167l385j541J4299L153r031j3369P730J4854L611K624J4844
$$ -29482 -17707 -13540 -16925 -18466 -4167 -1014 -10045 -23414 -15684 -830 2781 5405 20249
4004B0249n181j0290O984j3644K603R746L283r850m131O286j772M628k7009j4592
$$ 20249 15068 4778 11762 -1882 721 10467 13750 3900 -231 6055 4283 8911 -18098 -32690
3990c2690L870J9056R805j408j9148m875J2198M126l874J4497Q27p893R705J4264
$$ -32690 -28820 -9764 41 -1367 -20515 -25390 -13192 -9066 -12940 1557 2384 -5509 4196 18460
3976A8460j4348k1456r624J5771P389M924q935q639m684o824L212J2634K64r003
$$ 18460 4112 -17344 -26968 -11197 -3808 1116 -7819 -16458 -21142 -27966 -24754 -12120 -11856 -20859
3962b0859o00J5093o151J5872N188J826L213R05K22j0304j0063j1202J3305M269
$$ -20859 -21459 -6366 -12517 3355 8543 10369 13582 14487 14709 4405 -5658 -16860 -3555 714
3948G14q705P825K4735J6423q640n654j1813p241k136J144r875m634m300o026
$$ 714 -7991 -166 24569 40992 32352 26698 14885 7644 5508 6652 -3223 -7857 -12157 -18183
3934a8183P777R352J1205j1220n591p092P224q85j3008J8445M767j0005L195k2682
$$ -18183 -10406 -1054 10151 -1069 -6660 -13752 -6528 -7413 -20421 -1976 2791 -7214 -4019 -26701
3920b6701J0908J9876J1124j2164j1863o511n441O416M782q557m606J5776J0961
$$ -26701 -15793 4083 15207 3043 -8820 -15331 -20772 -14356 -9574 -18131 -22737 -6961 4000
3907D000r471J6943O442m068p926n908O801m179j1468l742Q441n176q97K7397
$$ 4000 -5471 11472 17914 13846 5920 12 6813 2634 -8834 -12576 -4135 -9311 -10208 17189
3893A7189R64j0111o995K704m143J347j502J138J3994N027k413l313N600L89j6586
$$ 17189 18153 8042 1047 3751 -392 955 -547 591 14585 19612 17199 13886 19486 19875 3289
3878C289j7348j2808Q435J5723l808J401O93K4958j3185j3038j9111Q48O540O338
$$ 3289 -14059 -26867 -18432 -2709 -6517 -5116 -4423 20535 7350 -5688 -24799 -23951 -17411 -11073
3864a1073R996j5611j2122J1119Q182M826M820Q457r643l037Q393j2126J6313
$$ -11073 -1077 -16688 -28810 -17691 -9509 -4683 137 8594 -1049 -4086 4307 -7819 8494
3851H494j8411j5605J0622j9781O486K3575k813J913j3704j6651J236J1037N35
$$ 8494 -9917 -25522 -14900 -34681 -28195 -4620 -7433 -5520 -19224 -35875 -34639 -23602 -23067
3838b3067K135K594P605K1382J5576q248j800r294j1259M587m627m973l998j1331
$$ -23067 -20932 -18338 -10733 10649 26225 17977 16177 6883 -4376 211 -4416 -9389 -13387 -24718
3824b4718k100J1142M912R818M690K162N019J1344q127p599j0817K365O174J478
$$ -24718 -26818 -15676 -10764 -946 3744 5906 10925 22269 14142 6543 -4274 -1909 4265 5743
3810E743Q132k40p548L2j2206J893J345P624j705J6556N865k1127k6906q691Q522
$$ 5743 13875 13635 6087 6119 -6087 -4194 -2849 4775 3070 19626 25491 4364 -22542 -31233 -22711
3795b2711J2933J1204N24R034J6938O34q866j4548m864K445M211j3452m42k1724
$$ -22711 -9778 1426 1950 10984 27922 28556 19690 5142 278 2723 6934 -6518 -6960 -28684
3781b8684j2914J8812K7975R079r345k2585k0257J2994J5878Q554J0247o768j3859
$$ -28684 -41598 -22786 5189 14268 4923 -17662 -37919 -24925 -9047 -493 9754 2986 -10873
3768a0873q812O222J2349j6926N48R661m924Q656J3798j0415k840M751K0916m91
$$ -10873 -19685 -13463 -1114 -18040 -17492 -7831 -12755 -4099 9699 -716 -3556 1195 22111 21620
3754B1620l317r47j2908L093N316O455M944J354j4013j1805m163p727o767r831
$$ 21620 18303 17356 4448 7541 12857 19312 24256 25610 11597 -208 -4371 -12098 -18865 -28696
3740b8696j0678J2560J5207O726L069Q125k694P249m604L578j142N087K536R801
$$ -28696 -39374 -26814 -11607 -4881 -1812 6313 3619 10868 6264 9842 8700 13787 16323 26124
3726B6124p095j8182j3754l135R60Q941N701Q814J0214J1273N19L867K136j2610
$$ 26124 19029 847 -12907 -16042 -15082 -6141 -440 8374 18588 29861 30380 34247 36383 23773
3712B3773j6686j0386j3571n321K54N842J0495K726j8077P366J6267n236j0915
$$ 23773 7087 -3299 -16870 -22191 -21937 -16095 -5600 -2874 -20951 -13585 2682 -2554 -13469
3699a3469n824R973J0088O904j1665o506J4104M087j5308o465N636N891M815o449
$$ -13469 -19293 -9320 768 7672 -3993 -10499 3605 7692 -7616 -14081 -8445 -2554 2261 -4188
3685d188m649O06K4725M678j5490q139M88p039r869K491O962m250O931M918p18
$$ -4188 -8837 -8231 16494 21172 5682 -2457 -1969 -9008 -18877 -16386 -9424 -13674 -6743 -1825 -2543
3670b543r707j1579K278J1671N775j6669j654J9088Q433j1323k5272m514o675
$$ -2543 -12250 -23829 -21551 -9880 -4105 -20774 -22428 -3340 5093 -6230 -31502 -36016 -42691
3657d2691J1644o228n991J5476N005J2737n872o854J7092K262J0426P331O716
$$ -42691 -31047 -37275 -43266 -27790 -22785 -10048 -15920 -22774 -5682 -3420 7006 14337 21053
3644B1053n479K257q166q387R636q474M05q05k647N470l802j5940j0916l075Q755
$$ 21053 15574 17831 9665 1278 10914 2440 2845 2040 -607 4863 1061 -14879 -25795 -28870 -20115
3629b0115L008p879N466J552L26J0425P484O007q622J6421Q17l568j1698k326
$$ -20115 -17107 -24986 -19520 -17968 -17642 -7217 267 6274 -2348 14073 14890 11322 -376 -2702
3615b702o682k9636L078J2695n661j275N556N65R772L753J1214O655J3260m387
$$ -2702 -9384 -39020 -35942 -23247 -28908 -30183 -24627 -24062 -14290 -10537 677 7332 20592 16205
3601A6205O27q159j2014P655M456J0734q784j0544q307M688J3719k15J9472Q096
$$ 16205 16832 8673 -3341 4314 8770 19504 10720 176 -8131 -3443 10276 10061 29533 37629
3587C7629r648k3225j9687Q281J7856J4261n765k7518r188j468q862p86J1156
$$ 37629 27981 4756 -14931 -6650 11206 25467 19702 -7816 -17004 -18472 -27334 -28120 -16964
3574a6964L859n587O577J3229P456r013q605K0080p14p842J4159J2364M064l244
$$ -16964 -13105 -18692 -12115 1114 8570 -443 -9048 11032 10318 2476 16635 28999 33063 29819
3560B9819j5059j9934q013K464K7407K1480j0433j9965k2964k645K501J114J592
$$ 29819 14760 -5174 -13187 -10723 16684 38164 27731 7766 -15198 -17843 -15342 -14228 -12636
3547a2636J8718J4573J098k0284q099R707J2475J0262k335q671m356l768j1977
$$ -12636 6082 20655 21753 1469 -6630 3077 15552 25814 23479 14808 10452 6684 -5293
3534e293j3966j5037J1000N62J1769O796J5320J842M202J1152Q348j8646k3501
$$ -5293 -19259 -34296 -23296 -22734 -10965 -4169 11151 12993 17195 28347 36695 18049 -5452
3521e452k1364K4411J7652k3637j1694Q215N338J5409J6670j7498k2972j5644
$$ -5452 -26816 -2405 15247 -8390 -20084 -11869 -6531 8878 25548 8050 -14922 -30566
3509c0566P937J3789J7679J1259L407j2342l804o557O783n09N481r619j310k0968
$$ -30566 -22629 -8840 8839 20098 23505 11163 7359 802 7585 7076 12557 2938 1628 -19340
3495a9340j5055J5481J3797M888l528q173K707J5493k2009k143O384j2130K2532
$$ -19340 -34395 -18914 -5117 -229 -3757 -11930 -9223 6270 -15739 -17882 -11498 -23628 -1096
3482a096K1123j0550l087J4769j869k8303p629K903J6101l812J79N422n842J5152
$$ -1096 20027 9477 6390 21159 19290 -9013 -16642 -13739 2362 -1450 -1271 4151 -1691 13461
3468A3461l005k0165J0304k399K2409J5644j8224k9176j6144j4l038J4874K8727
$$ 13461 10456 -9709 595 -1804 20605 36249 18025 -11151 -27295 -27309 -30347 -15473 13254
3455A3254J0818l695p328R597O637k0515j8073J0695o530P631L459P186J0418
$$ 13254 24072 20377 13049 22646 29283 8768 -9305 1390 -5140 2491 5950 13136 23554
3442B3554J0694n197j0873k816K50m540l512j5782l644j0157J15Q787N07O733
$$ 23554 34248 29051 18178 15362 15612 11072 7560 -8222 -11866 -22023 -21908 -13121 -12614 -5881
3428e881Q367K962k38Q359j4640L883N855j123j7846j8350J0788N839M840o011
$$ -5881 2486 5448 5210 13569 -1071 2812 8667 7544 -10302 -28652 -17864 -12025 -7185 -13196
3414a3196N535J8410P326j2052r667j944P90N211L35n566J514N573l860o467N323
$$ -13196 -7661 10749 18075 6023 -3644 -5588 -4798 413 748 -4818 -3304 2269 -1591 -8058 -2735
3399b735Q14j292R568J8383j2154k7757p282k76L312J1070K1429N965o923o363
$$ -2735 -1921 -3213 6355 24738 12584 -15173 -22455 -22731 -19419 -8349 13080 19045 12122 5759
3385E759J3054J5384m235k2444k6005q707L036q58l933q983L339K142J0975J0479
$$ 5759 18813 34197 29962 7518 -18487 -27194 -24158 -25016 -28949 -37932 -34593 -32451 -21476 -10997
3371a0997j172j6484N282J3471O879p135P596P830j4031p834R121p456o196J3994
$$ -10997 -12169 -28653 -23371 -9900 -3021 -10156 -2560 5270 -8761 -16595 -7474 -14930 -21126 -7132
3357g132j733K7972J4939l793j7905J4657J1372j3373j9024m595O528r082j2386
$$ -7132 -8865 19107 34046 30253 12348 27005 38377 25004 5980 1385 7913 -1169 -13555
3344a3555k086p217L110j848o159J3101J074m716j9639m879L1198K3030n730j9498
$$ -13555 -15641 -22858 -19748 -21596 -27755 -14654 -13580 -18296 -37935 -42814 -11616 11414 5684 -13814
3330a3814j1784L415L124J6806O814j2613q70o615q558J2734K6302N164k924j1034
$$ -13814 -25598 -22183 -19059 -2253 4561 -8052 -8922 -15537 -24095 -11361 14941 20105 17181 6147
3316F147j9132J0945L055Q369J2386P946r801P85j1055j1375P469L11J86j182
$$ 6147 -12985 -2040 1015 9384 21770 29716 19915 20700 9645 -1730 5739 6050 6236 5054
3302E054R086P470j3691j1266r090J4572J1750P826q3p370K871m527p683J4333
$$ 5054 14140 21610 7919 -3347 -12437 2135 13885 21711 21628 14258 17129 12602 4919 19252
3288A9252m598j818o88j6904R411j630Q218M095j2105R709p994q103j2365j579
$$ 19252 14654 12836 12148 -4756 4655 3025 11243 15338 3233 12942 4948 -3155 -15520 -17099
3274a7099J0508J4768J5659j0549j0183o890J3510O419j129n709n511J3382Q070
$$ -17099 -6591 8177 23836 13287 3104 -3786 9724 16143 15014 9305 3794 17176 25246
3261B5246r451n230m620l397l376m002k026o287q334N119r200J7560J0642O719
$$ 25246 15795 10565 5945 2548 -828 -4830 -6856 -13143 -21477 -16358 -25558 -7998 2644 9363
3247I363j4110j0054K426R306q86m5l669J199j2055J4993o527m84J2693j392K941
$$ 9363 -4747 -14801 -12375 -3069 -3955 -4000 -7669 -6470 -18525 -3532 -10059 -10543 2150 758 3699
3232C699R187k9101k087p356J0941l493m460M895o428J6667L402J1508P289Q188
$$ 3699 12886 -16215 -18302 -25658 -14717 -18210 -22670 -17775 -24203 -7536 -4134 7374 14663 22851
3218B2851k036r917P927J3448q289o55N771O744j9474j5848P559J198J0504P790
$$ 22851 20815 10898 18825 32273 23984 23329 29100 35844 16370 522 8081 9279 19783 27573
3204B7573m988l012j5833o415J4219J990j0022j9935j0928J7547R028J1400J5017
$$ 27573 22585 19573 3740 -2675 11544 13534 3512 -16423 -27351 -9804 -776 10624 25641
3191B5641k6090l2639Q680l83J2595K6392M841j417o151J7406J62k1281r610J1130
$$ 25641 -449 -33088 -24408 -24791 -12196 14196 19037 17620 11469 28875 29037 7756 -1854 9276
3177I276J2232j2548j5610j4791J4733Q308N60p245r679r44J5663L965o922o28
$$ 9276 21508 8960 -6650 -21441 -6708 1600 2160 -5085 -14764 -15708 -45 3920 -3002 -3630
3163c630O796R015r60N31j7610K975J4413M270m163k4589n603R857J0567J6996
$$ -3630 3166 12181 11221 11752 -5858 -2883 11530 15800 11637 -12952 -18555 -8698 1869 18865
3149A8865J073j1056j2675J8807n555j6201q116r336m177K515P736L566M473m094
$$ 18865 19938 8882 -3793 15014 9459 -6742 -14858 -24194 -28371 -25856 -18120 -14554 -10081 -14175
3135a4175j323j57L169Q315J0117j1385l252p366j29j802M945l986k0223n740
$$ -14175 -15498 -15655 -12486 -4171 5946 -5439 -8691 -16057 -16186 -17988 -13043 -17029 -37252 -42992
3121d2992M131L1728J4175m93L253o085k1989k0868N548P779Q113L9q071J1881
$$ -42992 -38861 -7133 7042 6549 9802 3717 -18272 -39140 -33592 -25813 -17700 -17661 -25732 -13851
3107a3851J6369J1152o224j2750q981N587K1190K329k1129N390J2676j3584p043
$$ -13851 2518 13670 7446 -5304 -14285 -8698 12492 14821 -6308 -918 11758 -1826 -8869
3094h869M864L976M923J098l820k974o683J0638N293j3814O151m927o686J1366
$$ -8869 -4005 -29 4894 5992 2172 -802 -7485 3153 8446 -5368 783 -4144 -10830 536
3080E36N929k977M211O338k3111j3271N121N831M120l695o492j1580N85R709J3701
$$ 536 6465 3488 7699 14037 -9074 -22345 -17224 -11393 -7273 -10968 -17460 -29040 -28455 -18746 -5045
3065e045P244M566q225j6504n70j5334Q783J2205P753J8461J169K170m34j0796
$$ -5045 2199 6765 -1460 -17964 -18534 -33868 -25085 -12880 -5127 13334 14503 16673 16239 5443
3051E443m765R208j3750r373J7777K805J3570K5907Q202O96l1138m2042J447k696
$$ 5443 678 9886 -3864 -13237 4540 7345 20915 46822 55024 55720 24582 -17460 -16013 -18709
3037a8709j6352l626J1625L1350P687M751k345j7448Q359J2466j2725p367q141
$$ -18709 -35061 -38687 -27062 4288 11975 16726 14381 -3067 5292 17758 5033 -2334 -10475
3024a0475R032p058N927P972j0709j2277k177N17R663J0929j179o386J11K1825
$$ -10475 -1443 -8501 -2574 5398 -5311 -17588 -19765 -19248 -9585 1344 165 -6221 -6110 15715
3010A5715J0873m649k109o015l923j8282j1768J6341K3676r108o104l2402J5417
$$ 15715 26588 21939 19830 13815 9892 -8390 -20158 -3817 19859 10751 4647 -27755 -12338
2997a2338J8921M614k780K433N42j1654L608J3007l22j7578j914J174j3692r491
$$ -12338 6583 11197 8417 10850 11392 -262 3346 16353 16031 -1547 -3461 -2287 -15979 -25470
2983b5470J4051Q217Q095J0891J472o396j3423J528o166J406j6751r36J653J5112
$$ -25470 -11419 -3202 4893 15784 17256 10860 -2563 -1035 -7201 -5795 -22546 -23482 -21829 -6717
2969f717P100Q357m00j946j3934k1353O346M997K229L04n572Q28J0929o130j1521
$$ -6717 383 8740 8340 6394 -7540 -28893 -22547 -17550 -15321 -15017 -20589 -19761 -8832 -14962 -26483
2954b6483J6898r171j4821j1032J4185J4656K3920L025j4868k0021J183J9129
$$ -26483 -9585 -18756 -33577 -44609 -30424 -15768 8152 11177 -3691 -23712 -22529 -3400
2942c400M649j706j6576k0892R597K3600J5098p692p3o953M249j3625q802K9079
$$ -3400 1249 -457 -17033 -37925 -28328 -4728 10370 2678 2605 -4348 -99 -13724 -22526 6553
2928F553J9460k7533j9030K968J1315J3503M144K40o301p431k733o759J7593M8
$$ 6553 26013 -1520 -20550 -17582 -6267 7236 11380 11620 5319 -2112 -4845 -11604 5989 6037
2914F037j6029j5689K112p390n263P358J5700J6730J7966R940J625L484l658r530
$$ 6037 -9992 -25681 -23569 -30959 -36222 -28864 -13164 3566 21532 31472 33097 36581 32923 23393
2900B3393r725j0309J0979R788n061o288j2260j2984o316l900O829Q042J6798
$$ 23393 13668 3359 14338 24126 19065 12777 517 -12467 -18783 -22683 -15854 -7812 8986
2887H986J5533q449j3560n762P802N815j3522j2799n775J5885P051m061P674P224
$$ 8986 24519 16070 2510 -3252 4550 10365 -3157 -15956 -21731 -5846 1205 -2856 4818 12042
2873A2042j2603o503O696n269p216N470Q130l990j3700j3014K3234Q909L667Q392
$$ 12042 -561 -7064 -368 -5637 -12853 -7383 747 -3243 -16943 -29957 -6723 2186 5853 14245
2859A4245M126j7137j5078p123N463J3580J4539j0084j2898j0038r010Q38k490
$$ 14245 18371 1234 -13844 -20967 -15504 -1924 12615 2531 -10367 -20405 -29415 -28577 -31067
2846c1067O058K06K1946K098M028O729j26o213j9275j4161J4660J9809j0044j1614
$$ -31067 -25009 -24803 -2857 -759 3269 9998 9872 3659 -15616 -29777 -15117 4692 -5352 -16966
2832a6966k666R52n109J2179K1205O697q882O705J6308j3007o472j2047m007P920
$$ -16966 -19632 -18680 -23789 -11610 9595 16292 7410 14115 30423 17416 10944 -1103 -5110 2810
2818B810p385o132j0151n2M136K020J0996q1o517J685O533K3482j265l0265j6158
$$ 2810 -4575 -10707 -20858 -20910 -16774 -14754 -3758 -3839 -10356 -8671 -2138 21344 20079 -10186 -26344
2803b6344k183K1518K2981l889l0747j2940J178l262N053P663J2168O760N547
$$ -26344 -28527 -7009 15972 12083 -18664 -31604 -30426 -33688 -28635 -20972 -8804 -2044 3503
2790C503r9j1590k681m189J0049Q713k431J8000J9013k1608j0684P4N253o184
$$ 3503 3404 -8186 -10867 -15056 -5007 3706 1275 19275 38288 16680 5996 6070 11323 5139
2776E139N42P726N431j5438J2890J0660q991q763o39j2065P39p506r26J3136j133
$$ 5139 5681 13407 18838 3400 16290 26950 17959 9196 8557 -3508 -2769 -10275 -11201 1935 802
2761H02q068j4650n064J2009J844j153L286j6325k7242l84J8126P132J2926l340
$$ 802 -7266 -21916 -26980 -14971 -13127 -14280 -10994 -27319 -54561 -54945 -36819 -29687 -16761 -20101
2747b0101j4871k580M430Q226O401Q886p222j9839j5555K3506J2973K100n961
$$ -20101 -34972 -37552 -33122 -24896 -18495 -9609 -16831 -36670 -52225 -28719 -15746 -13646 -19607
2734a9607n673P131O885M225J2411n589r678N371K249j6040j6131P164J4322J526
$$ -19607 -25280 -18149 -11264 -7039 5372 -217 -9895 -4524 -2275 -18315 -34446 -27282 -12960 -11434
2720a1434J9376l355p591Q777l384M29j1914J0020K019o294J643n134J621P433
$$ -11434 7942 4587 -3004 5773 2389 2818 -9096 924 2943 -3351 -1708 -6842 -5221 2212
2706B212m165p668r234j3845p148M721J3739K5610M647j9297p251K059j2405o592
$$ 2212 -1953 -9621 -18855 -32700 -39848 -35127 -21388 4222 8869 -10428 -17679 -15620 -28025 -34617
2692c4617O284L463K6597N858j5674j804k521l130N474M137k699j0494L649J4544
$$ -34617 -28333 -24870 1727 7585 -8089 -9893 -12414 -15544 -10070 -5933 -8632 -19126 -15477 -933
2678i33J1081R821j0939j8056L739j3516K4516o567k799P612m422L080N092K474
$$ -933 10148 19969 9030 -9026 -5287 -18803 5713 -854 -3653 3959 -463 2617 7709 10183
2664A0183j4847r286L580J8035p052J5431J731j2089l091R79k5211j7519o449
$$ 10183 -4664 -13950 -10370 7665 613 16044 17775 5686 2595 3574 -21637 -39156 -45605
2651d5605J0514M222J6454q735j0648J4380J0010m089J3941J2284J3910N456j1279
$$ -45605 -35091 -30869 -14415 -23150 -33798 -19418 -9408 -13497 444 12728 26638 32094 20815
2638B0815k1819j7987j4146l678K89J694J5271J1950P33o214n905J4029k224j762
$$ 20815 -1004 -18991 -33137 -36815 -36526 -34832 -19561 -7611 -6878 -13092 -18997 -4968 -7192 -8954
2624h954R06l222j4569p795J1038K0696K004j3220q688J5514J841j0840l895k52
$$ -8954 -8048 -11270 -25839 -33634 -22596 -1900 104 -13116 -21804 -6290 -4449 -15289 -19184 -19436
2610a9436M740O740R358M405j2019j8630Q359Q308n616J4839N368j4046q340j188
$$ -19436 -14696 -7956 1402 5807 -6212 -24842 -16483 -8175 -13791 1048 6416 -7630 -15970 -17158
2596a7158l831Q957J7833J0j1492n909j5811l180J0800Q169K111j7915J0020K2426
$$ -17158 -20989 -12032 5801 5811 -5681 -11590 -27401 -30581 -19781 -11612 -9501 -27416 -17396 5030
2582E030R944m761m3j6499k928J2938J4034Q527M123r429M834q027q064o576N06
$$ 5030 14974 10213 10170 -6329 -9257 3681 17715 26242 30365 20936 25770 17743 9679 3103 3609
2567C609p991p828P019J7862j1759q506M574m236K199M737k0818J0124O948j4485
$$ 3609 -4382 -12210 -5191 12671 912 -7594 -3020 -7256 -5057 -320 -21138 -11014 -4066 -18551
2553a8551j3222Q281J7509R313Q333K679j6170n287J0958j0644R735L984o994
$$ -18551 -31773 -23492 -5983 3330 11663 14342 -1828 -7115 3843 -6801 2934 6918 -76
2540g6r518j9321r85P421J00J6775K3414J3640k5297j4472m792j70o388K0021
$$ -76 -9594 -28915 -29900 -22479 -22379 -5604 17810 31450 6153 -8319 -13111 -13281 -19669 352
2526C52J1215L050k1682l852P359J413n081k869R498M43P370Q678m958l412j7324
$$ 352 11567 14617 -7065 -10917 -3558 -2145 -7226 -10095 -597 -154 7216 15894 10936 7524 -9800
2511i800j9155N135R852J5938K073j3626m135J3786J934m194J8094j1945k7165
$$ -9800 -28955 -23820 -13968 1970 4043 -9583 -13718 68 2002 -2192 15902 3957 -23208
2498b3208l990J866J0780J4308O907J0663J5689j185j0337r495r99j4264j6336
$$ -23208 -27198 -25332 -14552 -244 6663 17326 33015 31830 21493 11998 10999 -3265 -19601
2485a9601J253J912l359J1617J5101k70j0472k488j9676j6655J6850J9728J0208
$$ -19601 -18348 -16436 -19795 -8178 6923 6653 -3819 -6307 -25983 -42638 -25788 -6060 4148
2472D148j2279p872K4559K620o861j2505j7719l61o492q19n044j154K237R95J1751
$$ 4148 -8131 -16003 8556 11176 4315 -8190 -25909 -26270 -32762 -33581 -38625 -39779 -37542 -36547 -24796
2457b4796J5159J9453k0892n969J5765J7836k50O103k369r55n825k2848K607J7140
$$ -24796 -9637 9816 -11076 -17045 -1280 16556 16306 22409 20040 19085 13260 -9588 -6981 10159
2443A0159N50j8590j1104J4027L780k737P593P691l360l042J3472K76j7345j3144
$$ 10159 10709 -7881 -18985 -4958 -1178 -3915 3678 11369 8009 4967 18439 18715 1370 -11774
2429a1774M193J1515k985j2519n11m845p12p734M261J9157J3948n781j0120K639
$$ -11774 -7581 3934 949 -11570 -12081 -16926 -17638 -25372 -21111 -1954 11994 6213 -3907 -1268
2415a268Q96k0206k791Q39J5353p00J3026J2186K286j415n699K624N068k013k642
$$ -1268 -372 -20578 -23369 -22530 -7177 -7877 5149 17335 19621 18206 12507 15131 20199 18186 15544
2400A5544j886J2895J475j6240j6029q98j8453J5330P949o881k536j331K829M67
$$ 15544 13658 26553 28028 11788 -4241 -5139 -23592 -8262 -313 -7194 -9730 -11061 -8232 -7765
2386g765j4863J9093J2589j0728r599j2349j2814M735k179J8186J0998k1198k781
$$ -7765 -22628 -3535 9054 -1674 -11273 -23622 -36436 -31701 -33880 -15694 -4696 -25894 -28675
2373b8675q350p050Q000L994K7738R636K854m774o271M576p424r880l838R219
$$ -28675 -37025 -44075 -36075 -32081 -4343 5293 8147 3373 -2898 1678 -5746 -15626 -19464 -10245
2359a0245J2917k5962l1811P355K7173J8345L06J1004m162j0941J3937K4473J7229
$$ -10245 2672 -23290 -55101 -47746 -20573 -2228 -1922 9082 4920 -6021 7916 32389 49618
2346D9618j7394l1478r257J2540J832J7663j613j2308J947q828r316P087O189
$$ 49618 32224 746 -8511 4029 5861 23524 21911 9603 11550 2722 -6594 493 6682
2333F682k6205j6389Q413J5911P252q388l507J4327N155l638K626J643q934j0512
$$ 6682 -19523 -35912 -27499 -11588 -4336 -12724 -16231 -1904 3251 -387 2239 3882 -5052 -15564
2319a5564k0960R974J7987L968K531Q853p24k4490j2505o697j718J7184R131M512
$$ -15564 -36524 -26550 -8563 -4595 -2064 6789 6065 -18425 -30930 -37627 -39345 -22161 -13030 -8518
2305h518R291K3951M61J1497k2077j8865j5013J9139J2102J1975K289l614p930
$$ -8518 773 24724 25185 36682 14605 -4260 -19273 -134 11968 23943 26232 22618 14688
2292A4688n3j2043j5204M838L535J7042o338p566R216K205j435N751j0681j0076
$$ 14688 14635 2592 -12612 -7774 -4239 12803 6465 -1101 8115 10320 8885 14636 3955 -6121
2278f121j145J1311L005N844N372R066j6693p225j423j1321j1823P865j5446K1675
$$ -6121 -7266 4045 7050 12894 18266 27332 10639 3414 1991 -9330 -21153 -13288 -28734 -7059
2264g059J2676j2186r982J0170P040P396l076j3747k564K373K2393J0121k4951
$$ -7059 5617 -6569 -16551 -6381 659 8055 4979 -8768 -11332 -8959 13434 23555 -1396
2251a396k1634L563J1223J2527o707j6775L173J270j0691k0000n251L0535J2922
$$ -1396 -23030 -19467 -8244 4283 -2424 -19199 -16026 -14756 -25447 -45447 -50698 -20163 -7241
2238g241j63O358M778n10r887J16J4922J2474K735j0135J0250l073j9525O576
$$ -7241 -7404 -1046 3732 3222 -6665 -6549 8373 20847 23582 13447 23697 20624 1099 7675
2224G675Q607O7J995j7348j5304j4870K0989P679r928p120K0334K3061p762o12
$$ 7675 16282 16349 18344 996 -14308 -29178 -8189 -510 -10438 -17558 2776 25837 18075 17463
2210A7463k811N18k061n748j9403N988L095L100n538Q786j821l157J086j907j0169
$$ 17463 14652 15170 13109 7361 -12042 -6054 -2959 141 -5397 3389 1568 -1589 -503 -2410 -12579
2195a2579J161j0369R257J9359j374K645j819J7546n641o139P229o45k094j124
$$ -12579 -11418 -21787 -12530 6829 5455 8100 6281 23827 18186 12047 19276 18631 16537 15413
2181A5413p355j605q574r638Q556R09J0547K359k289K035r779j2245J4770J4949
$$ 15413 8058 6453 -2121 -11759 -3203 -2294 8253 10612 8323 10358 579 -11666 3104 18053
2167A8053J479k380K2638J603m089j571j3312m671n137J226J5828l642j0910j1452
$$ 18053 19532 17152 39790 41393 37304 35733 22421 17750 12613 13839 29667 26025 15115 3663
2153C663N657q459j7247K814J4429n644j1593n790J8331r018j8550P154J0782
$$ 3663 9320 861 -16386 -13572 857 -4787 -16380 -22170 -3839 -12857 -31407 -24253 -13471
2140a3471N049J6406q546j8715J0952j285o577l663L55J0765K231J1299J3304
$$ -13471 -8422 7984 -562 -19277 -8325 -9610 -16187 -19850 -19495 -8730 -6499 4800 18104
$$ [...]
##END NTUPLES=NMR SPECTRUM
##END=
