##TITLE=Analysis number 320431
Compound Code ac 30926
Project Code adrs
Chemist Name cuschem
##JCAMPDX= 6.0         $$ Bruker NMR JCAMP-DX V2.0
##DATA TYPE= NMR SPECTRUM
##DATA CLASS= NTUPLES
##ORIGIN= Bruker BioSpin GmbH
##OWNER= nmr
$$ XWIN-NMR		Version 3.5
$$ Mon Jun 26 09:06:12 2006 GMT Daylight Time (UT+1h)  MAYBRIDGE\nmr@NMR_250MHZ
##.OBSERVE FREQUENCY= 250.131544655141
##.OBSERVE NUCLEUS= ^1H
##.ACQUISITION MODE= SIMULTANEOUS (DQD)
##.ACQUISITION SCHEME= undefined
##.AVERAGES= 16
##.DIGITISER RES= 18
##SPECTROMETER/DATA SYSTEM= dpx250
##.PULSE SEQUENCE= zg30
##.SOLVENT NAME= DMSO
##.SHIFT REFERENCE= (INTERNAL, DMSO, 0, 16.522)
##AUDIT TRAIL= $$ (NUMBER, WHEN, WHO, WHERE, WHAT)
$$ ##TITLE= Audit trail, XWIN-NMR		Version 3.5
$$ ##JCAMPDX= 5.01
$$ ##ORIGIN= Bruker BioSpin GmbH
$$ ##OWNER= nmr
$$ C:\u/data/dgb/nmr/ADRS/1380/pdata/1/auditp.txt
$$ ##AUDIT TRAIL=  $$ (NUMBER, WHEN, WHO, WHERE, WHAT)
(   1,<2006-06-26 09:05:47.89 +100>,<MAYBRIDGE\nmr>,<NMR_250MHZ>,
      <created by zg, POWCHK disabled, PULCHK disabled
       configuration hash MD5:
       E2 DF 36 D8 04 B2 41 60 5A D7 A3 38 5A 4B D0 FE
       data hash MD5: 64K
       3E 9E 59 E8 63 7E 3E D5 34 D6 61 33 38 3A 86 5B>)
(   2,<2006-06-26 09:06:03.85 +100>,<MAYBRIDGE\nmr>,<NMR_250MHZ>,
      <Start of raw data processing
       ef LB = 0.3 FT_mod = 6 PKNL = 1 SI = 32K 
       data hash MD5: 32K
       71 60 A2 0D E6 A1 6C DF 6F 12 13 EE 3F AE 29 86>)
(   3,<2006-06-26 09:06:05.54 +100>,<MAYBRIDGE\nmr>,<NMR_250MHZ>,
      <apk 
       data hash MD5: 32K
       8E B5 28 62 12 B0 24 99 E9 A2 93 9E 85 E0 7A 3E>)
(   4,<2006-06-26 09:06:06.32 +100>,<MAYBRIDGE\nmr>,<NMR_250MHZ>,
      <abs ABSG = 5 
       data hash MD5: 32K
       87 FB 63 FC 6B 5D 18 9D CE A2 E8 96 22 60 38 AC>)
$$ ##END=
$$ 
$$ hash MD5
$$ 0B 4A 60 CD B7 07 88 1B 34 47 26 F2 58 38 B2 4A
##$RELAX= 
##$RELAX= 
##$RELAX= 
##$RELAX= 
##$RELAX= 
##$RELAX= 
##$RELAX= 
$$ Bruker specific parameters
$$ --------------------------
##$DU= <C:\u>
##$EXPNO= 1380
##$NAME= <ADRS>
##$PROCNO= 1
##$TYPE= <nmr>
##$USER= <dgb>
##$AMP= (0..31)
100 100 100 100 100 100 100 100 100 100 100 100 100 100 100 100 100 100 
100 100 100 100 100 100 100 100 100 100 100 100 100 100 
##$AQSEQ= 0
##$AQ_mod= 3
##$AUNM= <au_zg>
##$AUTOPOS= <4 >
##$BF1= 250.13
##$BF2= 250.13
##$BF3= 250.13
##$BF4= 250.13
##$BF5= 500.13
##$BF6= 500.13
##$BF7= 500.13
##$BF8= 500.13
##$BYTORDA= 1
##$CFDGTYP= 0
##$CFRGTYP= 5
##$CHEMSTR= <none>
##$CNST= (0..31)
1 1 145 1 1 1 1 1 1 1 1 1 1 1 1 1 1 1 1 1 1 1 1 1 1 1 1 1 1 1 1 1 
##$CPDPRG= <>
##$CPDPRG1= <>
##$CPDPRG2= <>
##$CPDPRG3= <>
##$CPDPRG4= <mlev>
##$CPDPRG5= <mlev>
##$CPDPRG6= <mlev>
##$CPDPRG7= <mlev>
##$CPDPRG8= <mlev>
##$CPDPRGB= <>
##$CPDPRGT= <>
##$D= (0..31)
0 1 0 0 0 0 0 0 0 0.06 0 0 0 0 0 0 0.0002 0 0 0 0 0 0 0 0 0 0 0 0 0 0 
0 
##$DATE= 1151309146
##$DBL= (0..7)
120 120 120 120 120 120 120 120 
##$DBP= (0..7)
150 150 150 150 150 150 150 150 
##$DBP07= 0
##$DBPNAM0= <>
##$DBPNAM1= <>
##$DBPNAM2= <>
##$DBPNAM3= <>
$$ [...]
##$SUBNAM7= <"">
##$SUBNAM8= <"">
##$SUBNAM9= <"">
##$SW= 20.6930455092707
##$SWIBOX= (0..15)
0 0 3 0 0 0 0 0 0 0 0 0 0 0 0 0 
##$SW_h= 5175.983436853
##$TD= 65536
##$TD0= 1
##$TE= 296.16
##$TE2= 300
##$TE3= 300
##$TEG= 300
##$TL= (0..7)
0 120 120 120 120 120 120 120 
##$TP= (0..7)
150 150 150 150 150 150 150 150 
##$TP07= 0
##$TPNAME0= <>
##$TPNAME1= <>
##$TPNAME2= <>
##$TPNAME3= <>
##$TPNAME4= <>
##$TPNAME5= <>
##$TPNAME6= <>
##$TPNAME7= <>
##$TPOAL= (0..7)
0.5 0.5 0.5 0.5 0.5 0.5 0.5 0.5 
##$TPOFFS= (0..7)
0 0 0 0 0 0 0 0 
##$TUNHIN= 0
##$TUNHOUT= 0
##$TUNXOUT= 0
##$USERA1= <user>
##$USERA2= <user>
##$USERA3= <user>
##$USERA4= <user>
##$USERA5= <user>
##$V9= 5
##$VALIST= <valist>
##$VCLIST= <CCCCCCCCCCCCCCC>
##$VD= 0
##$VDLIST= <DDDDDDDDDDDDDDD>
##$VPLIST= <PPPPPPPPPPPPPPP>
##$VTLIST= <TTTTTTTTTTTTTTT>
##$WBST= 1024
##$WBSW= 4
##$XGAIN= (0..3)
0 0 0 0 
##$XL= 0
##$YL= 0
##$YMAX_a= 309495
##$YMIN_a= -490312
##$ZGOPTNS= <>
##$ZL1= 120
##$ZL2= 120
##$ZL3= 120
##$ZL4= 120
##$ABSF1= 16.522
##$ABSF2= -4.171173
##$ABSG= 5
##$ABSL= 3
##$ALPHA= 0
##$AQORDER= 0
##$ASSFAC= 0
##$ASSFACI= 0
##$ASSFACX= 0
##$ASSWID= 0
##$AUNMP= <proc_1d>
##$AZFE= 0.1
##$AZFW= 0.1
##$BCFW= 0
##$BC_mod= 0
##$BYTORDP= 0
##$COROFFS= 0
##$CY= 12.5
##$DATMOD= 1
##$DC= 0
##$DFILT= <>
##$DTYPP= 0
##$F1P= 14.0000005364418
##$F2P= -0.99999901652339
##$FCOR= 0.5
##$FTSIZE= 32768
##$FT_mod= 6
##$GAMMA= 0
##$GB= 0
##$INTBC= 1
##$INTSCL= 1
##$ISEN= 128
##$LB= 0.3
##$LEV0= 0
##$LPBIN= 0
##$MAXI= 10000
##$MC2= 0
##$MEAN= 0
##$ME_mod= 0
##$MI= 0
##$NCOEF= 0
##$NC_proc= -4
##$NLEV= 6
##$NOISF1= 0
##$NOISF2= 0
##$NSP= 0
##$NTH_PI= 0
##$NZP= 0
##$OFFSET= 16.522
##$PC= 1
##$PHC0= 160.5196
##$PHC1= 6.802505
##$PH_mod= 1
##$PKNL= yes
##$PPARMOD= 0
##$PSCAL= 4
##$PSIGN= 0
##$REVERSE= no
##$SF= 250.13
##$SI= 32768
##$SIGF1= 0
##$SIGF2= 0
##$SINO= 400
##$SIOLD= 32768
##$SREGLST= <1H.DMSO>
##$SSB= 0
##$STSI= 32768
##$STSR= 0
##$SW_p= 5175.98343685301
##$SYMM= 0
##$S_DEV= 0
##$TDeff= 65536
##$TDoff= 0
##$TI= <Analysis number 999999
Compound Code 99
Book Reference 9
Project Code 9>
##$TILT= no
##$TM1= 0
##$TM2= 0
##$TOPLEV= 0
##$USERP1= <user>
##$USERP2= <user>
##$USERP3= <user>
##$USERP4= <user>
##$USERP5= <user>
##$WDW= 1
##$XDIM= 32768
##$YMAX_p= 446284902
##$YMIN_p= -213111
$$ End of Bruker specific parameters
$$ ---------------------------------
##NTUPLES= NMR SPECTRUM
##VAR_NAME=  FREQUENCY,     SPECTRUM/REAL,   SPECTRUM/IMAG
##SYMBOL=    X,             R,               I
##VAR_TYPE=  INDEPENDENT,   DEPENDENT,       DEPENDENT
##VAR_FORM=  AFFN,          ASDF,            ASDF
##VAR_DIM=   32768,         32768,           32768
##UNITS=     HZ,            ARBITRARY UNITS, ARBITRARY UNITS
##FACTOR=    0.157963299565203, 1,           1
##FIRST=     4132.6476996994, 0,             0
##LAST=      -1043.33573715361, 0,           0
##MIN=       -1043.33573715361, -213111,     0
##MAX=       4132.6476996994, 446284902,     0
$$ Real data points
##PAGE= N=1
##DATA TABLE= (X++(R..R)), XYDATA
$$ [...]
16041e1636M7507o3165l6016Q5610l3145L3692K2551l5102k5583j1633L9238K5964
16029a718r893K3871l4309j6250K9724L5576M7593J0560m2657n6976J5559k4181
16017b3101m9944k0094N6624P4892K0840j7058k0228M294m0006l9679J1992N5484
16005A4016M7586l9957n8609n0804O34J3901L297l2816k0674j955P0006K8198
15993b7177n6099J5413m118M5023m227l4194k5992m163K4787O3304L8893n7657
15981b6207o4560m7871K9972J12486J14805O2381j8141j26212k6281R243n6686
15970c7071j1890N3444j087m9151m8364J8479O3940L5715o0714J0037J4734L322
15958h606k9481k2460M2664M5258m4672J90j0867o3888n9966o097N1450N63J9986
$$ y = [-51636, -4129, -67294, -103310, -17700, -50845, -17153, 5398, -29704, -55287, -66920, -27682, -1718, -11611, 12260, -22049, -38299, -8575, 27001, 74594, 85154, 42497, -14479, 1080, -23101, -73045, -93139, -36515, 38377, 59217, 42159, 21931, 26225, -13781, -53460, -41468, 14016, 61602, 21645, -36964, -87768, -87134, -73233, -69936, -102752, -123426, -125381, -55375, -27177, -83276, -67863, -71981, -26958, -31185, -65379, -91371, -95534, -70747, -7443, 31450, -26207, -90767, -138638, -108666, 3820, 118625, 181006, 162865, 36653, 10372, 19615, -37071, -48961, 4483, 3396, -45755, -94119, -75640, -11700, 24015, -36699, -26662, -11928, -8606, -38087, -60547, -17883, 27375, -17297, -17107, -27974, -91862, -151828, -157925, -106475, -105912, -85926]
15945h5926N6759J00322K6409p2702p2882P953J2912j7967j7273j3785N422j1519
15933h2277n507M9300K4680k2915p187M478L7076J844l6831M057L8782n7725j5867
15920f8092J3938M9029n264J570K238l5229r719K5362m4355R817n147j5907K8222
15907e3537K6664K8452j9224p8245k5087M6086J8349r08L9719K1454P8218L2133
15895A14074n2348l2153q281j1299O47L8605j4387J3356m2924n0696j075l1691
15883g8172l4014J7781K4171j4004j9446j1938L4071j7700j7195K1011M1506K5775
15871b8154P038N0335J2111j6524K1893k6751l9730R85k6147k8626L4795M1653
15859B878M9379M3024l3992o7225n1806R276k3080M684j8630Q7132q844n2161
$$ y = [-85926, -29167, 71155, 97564, 24862, -48020, -40067, -27155, -45122, -62395, -76180, -70758, -82277, -87784, -38484, -13804, -36719, -43906, -39428, -2352, -508, -37339, -33282, 5500, -52225, -68092, -54154, -5125, -10389, -8819, -6581, -41810, -51529, -26167, -70522, -60705, -65852, -81759, -53537, -26873, 1579, -17645, -95890, -120977, -74891, -56542, -57450, -17731, 3723, 81941, 114074, 61726, 29573, 21292, 9993, 10640, 49245, 34858, 48214, 5290, -45406, -46481, -78172, -112186, -94405, -70234, -84238, -103684, -115622, -81551, -99251, -116446, -95435, -53929, -28154, -21116, 29219, 41330, 24806, 46699, 19948, -19782, -18797, -44944, -73570, -38775, 2878, 52257, 95281, 61289, -5936, -57742, -48466, -71546, -66862, -85492, 1640, -7204, -59365]
15847e9365n914K6426o722M624N0672m4882K7922q574o719n211J2449L7857J6794
15834C9357k3223o08j5970l7805n4382k7688P0947J7708q1016j2808M849J0280
15822a10359M0408K0269n010j2175m2583k7434P7495N3968n354Q821k4122l0162
15810e6238m2210M5170J7204o0191n7328M8457O8967j0197K0192k198N9220J1444
15798D2292k2592j8037M6319m8234p2118J5852k7893k5056J1098O8650K2296L3100
15786B5677M1966j0824l3344l2231o7757L6546O8427j12654k1527L585m491O5895
15774d0732J7815n180J4089k7084P129N577N1425n0213m2005K7651l343j2973
15762e7844n3208M2352P2505n021J2252l432N493K4624J3674o203q67N833K5834
$$ y = [-59365, -65279, -38853, -45575, -40951, 9721, -35161, -7239, -15813, -22532, -27743, -15294, 22563, 39357, 16134, 15526, -444, -38249, -92631, -120319, -49372, -31664, -112680, -125488, -120639, -110359, -69951, -49682, -54692, -66867, -109450, -136884, -59389, -5421, -10775, -1954, -26076, -56238, -98448, -53278, -36074, -96265, -153593, -105136, -36169, -46366, -26174, -28372, 30848, 42292, 19700, 1663, 47982, -252, -72370, -56518, -84411, -109467, -98369, -29719, -7423, 25677, 67643, 56819, 23475, -8756, -76513, -39967, 28460, -84194, -105721, -102136, -106627, -40732, -22917, -28097, -14008, -41092, -33963, -28386, 23039, -27174, -69179, -41528, -44871, -57844, -111052, -68700, 3805, -1216, 11036, 7604, 13097, 37721, 51395, 45192, 44325, 50158, 75992]
15749G5992M2541L6317m9928p5960J560j6601o8805L6308k2928k8525L6461k525
15737c6093j4365N644J8352J7730j2806M8916Q358k9126o59j9508j7373N813j6100
15724d1217l2023M6156k365n1528Q105O367j9141J2418O1246O8695P2963p465
15712A22211r44L209j09033n2969j7672k0913J2466j1368L2762M836o3404M1987
15700e8832m2457K7027K0236R388l2994J7788M5355j846L5813r173m4876n544
15688d0115k3414L3138J7754m9100J2123K8249j07L1954N0865p60m4078n8113
15676d1604q768N2988K8099q014m0906o4690j853J0512K313O3138P1089j0397
15664E1907l6188k6244o7426j5182k6515K7972K3202j2503J6363J4111j1688r1948
$$ y = [75992, 118533, 154850, 104922, 28962, 30522, 13921, -54884, -18576, -41504, -70029, -33568, -36093, -50458, -44814, -26462, -8732, -21538, 27378, 35736, 6610, 5951, -13557, -30930, -25117, -41217, -73240, -27084, -29449, -80977, -72872, -66505, -85646, -73228, -11982, 56713, 129676, 122211, 121267, 124476, 15443, -37526, -55198, -76111, -63645, -75013, -42251, -37415, -100819, -58832, -101289, -74262, -54026, -44638, -77632, -59844, -14489, -16335, 19478, 10305, -34571, -40115, -63529, -30391, -12637, -61737, -49614, -21365, -21472, 10482, 61347, 60587, 16509, -41604, -50372, 2616, 30715, 22701, -18205, -82895, -84748, -74236, -71923, -8785, 62304, 51907, 15719, -10525, -77951, -93133, -119648, -91676, -68474, -80977, -64614, -50503, -62191, -154139]
15652a54139M5804O3757L2913p075l9980K8109L7578K1568L71L572M903L0047
15640F7428p3413p2065J7266L1006Q773o320K2584N6939O482j0944j4728m1287
15628h279P819M7757k4422m3758K5419P5274q126m8042P727J2899L0492L7342
15616A12102K871r7315m8216j8499R53k0589j6887K4716O8028N1699K9768k3983
15604F4648l412m2231q1851k0072J4898l041M3591N0405M0187j6608j6176m0127
15592i789P417l0824m2726O430m5681N4845o1370k349Q1723L7128k603M5787l6800
15579A188l8734L7118J834Q852M9896k4705k9341m2152O12j1260j9674l6735j7137
15566a20238O2835J6925P844L076K4064j1553j4879j3574J4990l6182j4605J5398
$$ y = [-154139, -108335, -44578, -11665, -18740, -58720, -30611, 6967, 28535, 28906, 32478, 37381, 67428, -5985, -78050, -60784, -29778, -21005, -27325, -4741, 52198, 58680, 47736, 33008, -8279, -460, 47297, 22875, -20883, 4536, 79810, 71684, 23642, 31369, 44268, 74760, 112102, 114973, 17658, -30558, -49057, -48104, -68693, -85580, -60864, 7164, 58863, 88631, 64648, 61236, 19005, -62846, -82918, -68020, -71061, -27470, 22935, 63122, 46514, 30338, -9789, -2372, -33196, -75922, -69492, -115173, -60328, -121698, -124047, -42324, -5196, -7799, 37988, 1188, -37546, -428, 1406, 10258, 60154, 35449, 6108, -36044, -35432, -46692, -66366, -103101, -120238, -57403, -40478, -32634, -29558, -5494, -17047, -31926, -45500, -30510, -66692, -81297, -65899]
15554f5899L5387q233j5440M0263j1753m9004N812K5178n5749m2067o678L8385
15542a09798O0215L0584j8724m5963k701J4556K5479j6560N2227j283l0656k7246
15530f9870K306M2570L5193p9665K6403k207m9052J9579M9348J6541K6871N3064
15518G1081n045l9231l2659J3643J674k3602m8160k0631M0037L0519n4516K3585
15506d3305r617L282p7529l9289R6907K5912K9667P5330K3087K921l8810O094
15494E4650n568R77J8971O935N5749l9154n4086m9217N384m2903l0349O6937O3334
15481E1660J6651J2447J1649n939l7663k7725q6056N14P910K3942k160L7992k5109
15468b1887J6647n64m9311K8261R172K7932N3359p9223l9808o2736L6657M1793
$$ y = [-65899, -30512, -38745, -54185, -13922, -25675, -74679, -68867, -43689, -99438, -141505, -148183, -109798, -49583, -18999, -37723, -83686, -86387, -71831, -46352, -62912, -10685, -11968, -42624, -69870, -67564, -24994, 10199, -69466, -43063, -45270, -94322, -74743, -25395, -8854, 18017, 71081, 66036, 26805, -5854, 7789, 9463, -14139, -62299, -82930, -42893, -12374, -66890, -43305, -52922, -49640, -127169, -166458, -69551, -43639, -13972, 61358, 84445, 87366, 48556, 54650, 49082, 50059, 69030, 75965, 131714, 92560, 38474, -10743, -5359, -48262, -78611, -11674, 51660, 68311, 80758, 92407, 86468, 48805, 21080, -64976, -64462, -56552, -32610, -34770, 3222, -21887, -5240, -5804, -55115, -26854, -17682, 10250, 63609, -15614, -55422, -118158, -81501, -39708]
15456c9708k452k6943j3990L2144L8724O3670j6363l2743l2616R342Q870j1643
15444b3708l1609L508q40j497J6620M4259j2696p4255k8606M747J852P3112K9338
15431B25K2006J520N921m6332k9882o862L3497J3396k1283p1951m0102J1930N7141
15418g0776O502r311m270J4331J9962j2141J0972L4340l1200K568Q3784L3143
15406G7904l9077n5986m1807j3163L5080R340j4508M4135P205L5541k7315q3236
15394f5887q778K2559p818M7938j5944o2584m1951N4638K8934J2169K1222m1746
15382e7248m454l3288N9019r916P047J7842j4386j8898L4591k6619k3781K272
15370f7819M7816K251m612r507j0472K3801O135R642q599k4835l7554m2696J272
$$ y = [-39708, -42160, -69103, -83093, -50949, -12225, 51445, 35082, 2339, -30277, -20935, -12065, -23708, -55317, -51809, -52649, -54146, -37526, 6733, -5963, -80218, -108824, -104077, -102225, -29113, 225, 22231, 23751, 29672, -16660, -46542, -53404, -19907, -6511, -27794, -99745, -139847, -127917, -70776, -64274, -73585, -77855, -63524, -43562, -55703, -44731, -10391, -41591, -39023, 44761, 77904, 38827, -17159, -58966, -72129, -37049, -27709, -42217, 1918, 9123, 44664, 17349, -65887, -74665, -52106, -59924, -11986, -27930, -90514, -132465, -77827, -48893, -36724, -15502, -57248, -61702, -94990, -35971, -45887, -38840, -20998, -35384, -54282, -19691, -46310, -70091, -67819, -20003, -17752, -22364, -31871, -42343, -18542, -12407, -2765, -11364, -36199, -73753, -116449, -115177]
15357a15177K6600K5656M8334K0690J305k8132n8139K8602J2510J5467O2084k336
15345C7464o4184j8437q14j7782K5532Q621J849J9927k626j0638K8029J0659n457
15332A2143j7521L0854K9265J5514k8541J0609p8740l9329K2287J5156M5359J3748
15320C0804R147j7262m1846J7349l1347l8429J9099J4443J3381o1355J009M7041
15308c7966L5404L7579R0757M4070k4342q472o8207j17662l376j0588J2867L3981
15296a5955M9046J8743J1157o348k2520k2450p463m858O461m2444n9748P259O270
15283h2850p214k2608K982L8978M2302J7407o0420p2172k2346N6353P1146m1925
15271h0367n0941l8968l687J0085L1250K9450N152L5630j2812J0307J7111K3789
$$ y = [-115177, -88577, -62921, -14587, 6103, 7408, -20724, -78863, -50261, -37751, -22284, 39800, 37464, -26720, -45157, -45971, -63753, -38221, -29600, -27751, -7824, -10450, -21088, 6941, 17600, 12143, -5378, 25476, 54741, 70255, 41714, 52323, -26417, -65746, -43459, -28303, 17056, 30804, 39951, 22689, -19157, -1808, -33155, -71584, -52485, -38042, -24661, -86016, -85007, -37966, -2562, 35017, 125774, 169844, 145502, 137030, 68823, -48839, -52215, -62803, -49936, -15955, 33091, 51834, 62991, 56643, 34123, 11673, 4210, -648, 5813, -36631, -96379, -89120, -82850, -90064, -112672, -109690, -70712, -28410, -11003, -71423, -143595, -165941, -109588, -38442, -80367, -131308, -170276, -173963, -163878, -132628, -103178, -98026, -62396, -75208, -64901, -47790, -24001]
15259b4001k6180n3708Q224P9770L0660o115j526Q41p039j5251k717k0326l7745
15246g5113M1392Q463k3165p695K09K9790j9180n1668J2380J7162p586n8924k7049
15233a60984L3899L1628K8562Q018J0860K6335k3948l2084M9061m7649m6751k0658
15221a43711M7333O8662M0939M1641J3854m1273j9744J1623k814K3332j4155l6138
15209a0451l0751j0298J0658Q5770P879J7764m2354n0446J4089Q095k8420l0898
15197e9363j3042P3378j2148q906R182L5353j0385k7227M868n8285p676N819L9514
15184b8918N1699j860Q641K0249m8985m4135j344L0405K0575R478k2002n4679
15172f0876m2604m627N5265K4225n6001M9505L2646P773l8566n2962k07K8189
$$ y = [-24001, -50181, -103889, -95665, -15895, 14765, 8650, 7124, 7965, 926, -14325, -17042, -37368, -75113, -33721, -25258, -48423, -56118, -55909, -26119, -45299, -96967, -84587, -67425, -75011, -133935, -160984, -127085, -95457, -66895, -58877, -48017, -21682, -45630, -77714, -28653, -76302, -123053, -143711, -96378, -27716, 13223, 54864, 68718, 27445, 7701, 19324, 16510, 39842, 25687, -10451, -41202, -51500, -40842, 44928, 52807, 70571, 28217, -22229, -8140, -45, -28465, -59363, -72405, 973, -11175, -20081, -10899, 24454, 14069, -13158, -8290, -66575, -74251, -68432, -28918, 22781, 20921, 29562, 49811, 826, -43309, -44653, -14248, 6327, 15805, -6197, -60876, -103480, -108107, -52842, -28617, -84618, -35113, -2467, 5306, -33260, -86222, -86429, -58240]
15160e8240l470K1645j6900l1702J9304L6776K6722M044m3889L242R89p1462m2169
15147a55110L6528K2324k4032k049L3374P7701N4473m6844o6142l7407k928L9411
15135g0701M7452l4876j001K1602k5026K5140M9188o0409j6278L2059M150k2347
15123e1047q817L0695k6015J3901J380K6444K7293k2094J5362P917k4681L8322
15111B8660Q0940q059o0686q8727J2031J2972k9213N1319J2552m87m2354k5211
15099e6263L39l8486m952N5670M5038K5842n1567r0900M4542L3937l737L2980
15087g557k4262l2720Q664j4953L4780o8676n817m2060K9268K4021m2825Q385
15075a33752k4638M2446J00629N5560L5427K526k1297j8205L5240L3257o1392
$$ y = [-58240, -61710, -40065, -56965, -88667, -69363, -32587, -5865, -1821, -45710, -42468, -41479, -112941, -155110, -118582, -96258, -120290, -122339, -88965, -11264, 43209, -3635, -69777, -107184, -110112, -70701, -23249, -58125, -59126, -37524, -62550, -37410, 11778, -48631, -64909, -32850, -28700, -51047, -59864, -29169, -55184, -41283, -39903, -13459, 13834, -8260, 7102, 15019, -9662, 28660, 109600, 101541, 40855, -47872, -35841, -22869, -52082, -763, 11789, 11302, -31052, -56263, -55924, -94410, -99362, -43692, 1346, 27188, -24379, -115279, -70737, -36800, -40537, -7557, -31819, -64539, -55875, -70828, -36048, -104724, -110541, -152601, -123333, -99312, -142137, -133752, -158390, -115944, -15315, 40245, 75672, 78198, 56901, 38696, 73936, 107193, 45801]
15064D5801o6767N570R265K4280j5207p900N1232J7669q887k8945J7471j658q569
15051C3355k5691O5974j8293L228O174k4026k2866j4548L3003l122l6583r5445
15039i8840k3278L5935J4446j15269j3598N7942M9526N8735Q0061L5078k4698
15028E6040r7366l8745L0649J2586J8937M3777j6031J5381L9082k0988Q613m4475
15016G460m4461J6732N6371L0743o1049o7732M5654p85P139J4805K3341l0107
15004a889o505J6799j3484j2277N728N2613l9569o3172l2702N0387Q387M1836
14992F152R214p7222o1579k3422K4173M119Q1527J19226K8996k6883n1853o21
14980C1827J3369K633O474j4926l6261k1287j4014K6905L1926M527l1147K0883
$$ y = [45801, -20966, -15396, -6131, 18149, 2942, -4958, 46274, 63943, 55056, 26111, 43582, 41924, 33355, 7664, 73638, 55345, 58573, 64747, 40721, 17855, 3307, 36310, 33188, -3395, -98840, -122118, -86183, -71737, -187006, -200604, -142662, -93136, -34401, 45660, 80738, 56040, -41326, -80071, -49422, -36836, -17899, 25878, 9847, 25228, 64310, 43322, 51935, 7460, -37001, -20269, 36102, 66845, 5796, -61936, -16282, -17067, -9928, 4877, 28218, -1889, -8394, 8405, -5079, -17356, -11628, 40985, 1416, -61756, -94458, -44071, -35684, 6152, 15366, -61856, -123435, -146857, -122684, -118565, -37038, 82188, 111184, 84301, 32448, 31827, 45196, 47829, 54303, 39377, 3116, -18171, -32185, -5280, 26646, 31173, 26, 20909]
14968B0909l122M0068k5814j9096K6774j0237n200k1436O830M0461j1885J6056
14956E4308j2472j4948l7034k5075K7012j1065r802Q2053N6920o1332o6240k8729
14944d6404K8157o505k4498L5616K7049O366O8335K3824k3842L919j6095p1381
14932D541m5612l0553M2869K4357j1865n713n3879m434j4625N590O4673o5427
14920i0078M2061k4008j01436L8560O1827K9774O339j9551L501J405l549K0293
14908c4862j3805K2334M4118K5221k3491q691M8865J5587p542L5954j5977n1613
14896C6098k0467j5918L2301J3561q0161j1365J0460K5778l095N997J4853K1282
14884B9324k6490J3186J6819l391j2606l3743l750K2784L9900J8208j9905L837
$$ y = [20909, 17787, 57855, 32041, 12945, 39719, 29482, 24282, 2846, 9676, 50137, 38252, 54308, 41836, 26888, -10146, -35221, -8209, -19274, -29076, 52977, 109897, 48565, -17675, -46404, -18247, -24752, -49250, -13634, 13415, 19781, 88116, 111940, 88098, 92017, 75922, 4541, -41071, -71624, -28755, -4398, -16263, -21976, -75855, -80289, -94914, -89324, -24651, -90078, -48017, -72025, -173461, -134901, -73074, -43300, -36961, -56512, -53011, -51606, -55155, -34862, -48667, -26333, 17785, 43006, 19515, 10824, 59689, 75276, 67734, 103688, 87711, 36098, 15631, -287, 32014, 45575, -34586, -45951, -35491, -9713, -12808, -6811, 8042, 29324, 2834, 16020, 32839, 29448, 16842, -16901, -20651, 2133, 42033, 60241, 40336, 44173]
14872D4173j9868o604K6600j2653J9129l9249o2724J2996L6914K3533Q580j3283
14860A7544J2857P3166p516m7324j4057l1023r896L2026J8666j8696k4236K6303
14848B7814K8951l7041j4036l4437N360J2051K4443o712K3741K7777j1060n2620
14836e769n8474L549j085k6896J9317K8718P1218K3191k7197n28R406p0750j11175
14823a46475K5184M5247j7614L7442N5474k2351l2890j1931M6488k4358M546j7903
14811e9141K2804N696M6140n135l9385N587j5339J4974L0107L5896K2906o2731
14799B379k5640l4137n4589k2068o961n5902L3424P7830M7349n7653Q488L9518
14787d7962K2034j5273m2289q9968j1104J03905O5165J6143N3584l9748j7502
$$ y = [44173, 24305, 17701, 44301, 31648, 50777, 11528, -51196, -38200, -1286, 22247, 30827, 17544, 30401, 103567, 96051, 48727, 34670, 3647, -6249, 25777, 44443, 25747, 1511, 27814, 56765, 19724, 5688, -28749, -23389, -11338, 13105, 6393, 30134, 57911, 46851, -5769, -64243, -60694, -61779, -88675, -69358, -40640, 30578, 53769, 26572, 26044, 35450, -35300, -146475, -121291, -76044, -93658, -56216, -742, -23093, -55983, -67914, -21426, -45784, -41238, -59141, -36337, -30641, 15499, 10364, -29021, -23434, -38773, -23799, 6308, 42204, 65110, 2379, -23261, -57398, -111987, -134055, -141016, -196918, -163494, -85664, -38315, -95968, -87480, -47962, -25928, -41201, -83490, -173458, -184562, -80657, -15492, 651, 54235, 14487, -3015]
14776c015k2460q0397n2912N3902Q9929K53M807k2783J4407J0042r37k4961K6788
14763g337j0781R455L1970n242j9381k3305k7805J3249j6581L8455M8125R1129
14751A21951k9581j258O452l5682m2090o3003K8830J6609j1937K7557j3394l9267
14739c4813n8370j909L2122K071J9741N6834K426n696q398K8653M9136m1480q5391
14726d5074M1267j5454n1663M7297j254K4941l5061l4054j5812j367L0733K1209
14714c4292P793n7208j4809M4778J4276L3812L948O4500K9259q361J8448k6271
14702G5873m6564J3840k3747l3507k8559J4127q979k0417K958R635R661j932j6752
14689e4363k4933j0271L4605O271K8078j2738l8986m3391K3069L1653r995j63
$$ y = [-3015, -25475, -105872, -158784, -104882, -14953, -14700, -9893, -32676, -18269, -8227, -9164, -34125, -7337, -18118, -8663, 23307, 18065, -1316, -24621, -52426, -39177, -55758, -17303, 30822, 121951, 92370, 91112, 97564, 61882, 19792, -43211, -14381, 2228, -9709, 17848, 4454, -34813, -93183, -95092, -62970, -60899, -41158, 15676, 18102, 12406, 4008, 32661, 81797, 40317, -45074, -3807, -19261, -70924, -23627, -24881, 60, -35001, -69055, -84867, -86234, -55501, -34292, -26499, -83707, -98516, -53738, -39462, -5650, -1702, 62798, 92057, 83696, 102144, 75873, 29309, 43149, 19402, -14105, -42664, -28537, -37516, -57933, -54975, -45340, -35679, -37611, -54363, -79296, -89567, -54962, -48691, -20613, -33351, -72337, -115728, -92659, -61006, -71001, -71164]
14677g1164k2809n114k3770k0800R347Q507N381P4484K7789l1544P181J570o73
14664d1615M2776M4390p7805l818L4470o088k9428k2783Q278L7588J2971o6867
14652f7931p9909l5796N4191P5516j9698j3002L158m3987N1011J0185L4578K8636
14640c048k6496J4841k1600m5610q6366K7081J06017P1245l8902q6265L5240L5265
14628a8598J8616N2786J7837m0960K0804N660l8691q7696l7135J3960M4256L4926
14616a4235M6449j3438j4444j2669k7423k9935j7124N6059M1959O4423j3385J5879
14604H2116l9818k594J3232k4571m6301J2590O7199k2336j1101l0225p4100K3807
14592e2102l558j8062j2806N989m036O2470K4807M4779j5179n1334j6609K2592
$$ y = [-71164, -93973, -99087, -122857, -143657, -134310, -125803, -120422, -45938, -18149, -49693, -42512, -40942, -41615, 1161, 45551, -32254, -36072, -1602, -7690, -37118, -59901, -51623, -14035, -1064, -67931, -147840, -183636, -129445, -53929, -73627, -86629, -83471, -127458, -76447, -66262, -31684, -3048, -29544, -14703, -36303, -81913, -168279, -141198, -35181, 36064, -2838, -89103, -53863, -18598, 18, 52804, 70641, 29681, 50485, 56145, 17454, -70242, -107377, -93417, -49161, -14235, 32214, 18776, 4332, -8337, -35760, -65695, -82819, -26760, 15199, 79622, 66237, 82116, 42298, 39704, 52936, 28365, -17936, -5346, 61853, 39517, 28416, -1809, -75909, -52102, -55660, -73722, -86528, -80539, -84575, -22105, 2702, 47481, 32302, -19032, -35641, -13049]
14580a3049K1250j7593o5162J0718L4514L6368l667k5317k3786O992N3401k0890
14568f221l1005J7813L8790K1682j3392m3645K5617j5400l6103J9989l4127K273
14556e3729L349J5437j3534K1076M7853k740J1434M4818k9042k5881p714l6594
14544b5267J5428O899O243O2694J539n0985N4513K2733k4697O552j9495K7473
14532H3630k8302l1918o7405M6335j7417l0640l2987N1788J06544k7316j2838
14521C9474k5224M4176O672o511P397j4333m0877m6882o358J2002m2253q1151
14509a53868O5330M1361L1191K5070K5683J1656l5642j1508k0870k6458K7691
14498b0364m573J2022n327o885m6138J3032K5958O8043M5919r2940l1518M3915
$$ y = [-13049, 8201, -9392, -74554, -63836, -29322, 7046, 3379, -21938, -45724, -38732, 14669, -6221, -37226, -19413, 19377, 41059, 27667, -15978, 9639, -5761, -41864, -21875, -56002, -53729, -50380, -34943, -48477, -27401, 20452, 17712, 29146, 73964, 44922, 19041, 11327, -25267, -9839, -2940, 3303, 65997, 67536, 16551, 71064, 93797, 69100, 75652, 56157, 83630, 55328, 23410, -43995, 2340, -15077, -45717, -78704, -26916, 79628, 52312, 39474, 14250, 58426, 65098, 58587, 65984, 51651, 10774, -36108, -42466, -30464, -72717, -153868, -88538, -47177, -15986, 9084, 34767, 46423, 10781, -727, -21597, -48055, -20364, -24937, -12915, -18242, -25127, -71265, -58233, -32275, 35768, 81687, -11253, -42771, 1144]
14486A144J07265K4725l0901n3387j8000K4166K2054j9943l748o558o6566k7598
14474d7347R281N6724p7k2250j9553M42P0521j3786L5906l8832M1494K2702n9987
14461C5238r6749j9869M2835M3997j4456j1685J8505r771M215L039l3816n8268
14449i6785N4904P3938p245m3181J1274L5723j8782n3011l4392M9531L8051M4072
14437E4097k3131K0206K7505L2923r0259m9231p7068m07l0535J0121o539J4965
14425a17353J7880L5231J8685p9104n6708N5958J11493K1653O1666N7775r6394
14414C0782J9666R044k6341p3329L5660K8140K0661p803o0941j8069K1064Q6042
14402F4576L6064p977m7335j431n3277r004j3816M585N742l1504K2031K5174Q079
$$ y = [1144, 108409, 133134, 102233, 48846, 30846, 55012, 77066, 57123, 53375, 46817, -19749, -47347, -38066, 18658, 18581, -3669, -23222, -22780, 47741, 33955, 69861, 31029, 72523, 95225, 35238, -61511, -81380, -38545, 5452, -9004, -20689, -2184, -11955, -7740, -4701, -38517, -96785, -41881, 32057, 24812, -18369, -7095, 28628, 9846, -43165, -77557, -28026, 10025, 54097, 30966, 51172, 78677, 111600, 21341, -27890, -104958, -105365, -135900, -125779, -132318, -117353, -99473, -64242, -45557, -124661, -181369, -125411, -13918, 7735, 69401, 127176, 30782, 50448, 59492, 33151, -40178, -4518, 23622, 44283, 36480, -24461, -42530, -21466, 64576, 100640, 92663, 45328, 43897, -9380, -18384, -32200, -27615, -21873, -53377, -31346, -6172, 1907]
14389A907l5238J9642l593K9890L7078m5339K1581K1012k111j800j207J1522M5419
14376I8763J570L211j4238l6873l2834L1177L3082l3834p2674j3782j0567p860
14364e4859J2918M0498J6970l2920j7887J8483P488l7337P4112j4530p39j494
14352A0703J2135j73K269n442L064J8669k705l2439j6124j6548m6066M0397P3652
14339D1392N1974n1524m6845K8484o427L4711K3746m4499r2464K0830K4541m5936
14327f2017j5948M0920M865m8653p915K8847M5610j673l0675Q0616k2626J1120
14315B2471J9865o2628n9360N2030N2233m0562o757L3804J6869m4128l5004j8074
14303f9241P3039K2366q2772l2357K0115J2689J4482R331L0148n402R757J0714
$$ y = [1907, -33331, -13689, -17282, 12608, 49686, 4347, 25928, 46940, 44829, 43029, 41822, 53344, 98763, 100333, 103544, 89306, 52433, 19599, 50776, 83858, 50024, -22650, -36432, -46999, -54859, -41941, -1443, 15527, -17393, -35280, -16797, -9309, -46646, 27466, 12936, 12197, 10703, 22838, 22665, 24934, 19492, 22556, 41225, 38520, 6081, -10043, -26591, -72657, -32260, 41392, 93366, 41842, -5003, 23481, 17054, 51765, 75511, 31012, -61452, -40622, -16081, -62017, -77965, -37045, -32180, -80833, -88748, -59901, -14291, -15964, -46639, 33977, 11351, 22471, 42336, -20292, -79652, -27622, 24611, -15951, -22708, 11096, 27965, -16163, -51167, -69241, 3798, 26164, -56608, -88965, -68850, -56161, -41679, -32348, -2200, -7602, 2155, 12869]
14291A2869j3739j5795j2599M2507q898j58494K5689R2471O4966L5142m156n1201
14279H762o0798o8633l9198M8652L7566J5218j2449k7120n9161J3770N1468O7121
14267b4802P2946P426k1182o9809j0030m992k3476l7103N362J9243K6890j2862
14255g2389L2543M746p293o987J8929O4324j8835n7193K241P331n448k8626M3497
14242b3160L4630k0471O418L830m4198o9186M3625K8469L1880M0428j2647k1279
14230a661j785l1499n6872l8255L0352K0395N2963M8595l55j9376L7205n7846
14218a8139l2904o0199J5749M7128j1658j079j1629l0412j3163J8829M3755K7901
14206b5821M1465j7270j4140k5337l838J8682K3849J6152l7726K50k1863K330
$$ y = [12869, -870, -16665, -29264, 13243, 4345, -154149, -128460, -35989, 28977, 64119, 59963, 8762, -52036, -120669, -159867, -111215, -73649, -58431, -70880, -98000, -157161, -143391, -91923, -24802, 48144, 55570, 34388, -35421, -45451, -50443, -73919, -111022, -105660, -86417, -59527, -72389, -39846, -35100, -42393, -49380, -30451, 33873, 15038, -42155, -39914, -32583, -38031, -66657, -23160, 11470, -9001, -2583, 1247, -42951, -112137, -68512, -40043, -8163, 32265, 19618, -1661, -3446, -34945, -91817, -130072, -99720, -79325, -26362, 22233, 21878, 2502, 39707, -18139, -51043, -111242, -95493, -48365, -60023, -61102, -72731, -103143, -116306, -97477, -53722, -25821, 15644, -1626, -15766, -41103, -44941, -26259, -2410, 13742, -23984, -23734, -45597, -43267]
14194d3267M7976j128Q81m3836n4478M9960j8015m7586L7362L3930l5086j5988
14182h9275P0379J8545J1380j2757r5n0924J430J9333L0211o128O325r169n6855
14169f7600m5917L2716Q6056P823k5423j7191K628K2418K3230L601m2761L8862
14157A8442Q31l0743K9570m5596m4592L9997j314k1054o644k1008M531l6735M1822
14144g2493j2196p1587K9328K5297K8556N5712o811k4927J1644J8221K4455l6074
14132c0875L0252l6313M2155J3689J8851j4103k9322l0270n1167m3171O4760r137
14120g4651m1908K8867P083L8318M0413K579m0156J294l043M7929M775j3284n5820
14107e7604J8378J7268J9917m1981L3531M4098p3649j5097P0252q053o4889J7380
$$ y = [-43267, 4709, 3581, 4462, -39374, -93852, -43892, -61907, -109493, -72131, -38201, -73287, -89275, -18896, -351, 11029, -1728, -1823, -52747, -51317, -31984, -1773, -7901, -1576, -10745, -67600, -113517, -80801, 5255, 13078, -12345, -29536, -26908, -4490, 18740, 22341, -20420, 18442, 19273, -11470, 18100, -27496, -72088, -32091, -33405, -54459, -61103, -82111, -77580, -114315, -72493, -84689, -156276, -126948, -101651, -73095, -17383, -24194, -49121, -37477, -19256, 5199, -30875, -623, -36936, 5219, 18908, 37759, 23656, -5666, -35936, -87103, -130274, -65514, -74651, -116559, -87692, -80609, -42291, -1878, 701, -39455, -38161, -41204, 6725, 11500, -1784, -57604, -39226, -21958, -2041, -44022, -10491, 33607, -40042, -55139, 15113, 7060, -57829, -40449]
14095d0449j058K7029k3443J4980j4657k9080L7801K2179k5340o033N9766L0750
14083E2445n6379o1942l4722Q644r609N2003o276r907K3778J7993P611m5379j3142
14070g4882J8277L7892L6751l6937m2107m327K1465j5589m080j1583J0172K0311
14058d4637Q515k9208J7601K441K9193N2733M7400k5585p4824o566j953J4421
14046a0469K1441K0467j583n20J5080P53j885K3687o8761p2860k8450O454N5260
14033d1386k6273n6082o713N5563M8563N4255n2571m2138m5103L7658k0690J1647
14021h3270K3860P1010Q1309k4243k2237k3059j2134P706M3320L7759n5900l3503
14009A0618M1474j0307K497L1977l0948o7866J6598J3475K347L6285J0696j4749
$$ y = [-40449, -41507, -14478, -37921, -22941, -37598, -66678, -28877, -6698, -32038, -38071, 21695, 52445, -3934, -65876, -100598, -91954, -101563, -49560, -55836, -65743, -41965, -23972, -16361, -61740, -74882, -56605, -18713, 18038, -18899, -61006, -65333, -43868, -59457, -63537, -75120, -64948, -44637, -36122, -65330, -47729, -45288, -16095, 36638, 84038, 58453, -16371, -22937, -24890, -10469, 10972, 31439, 29856, 29336, 44416, 45169, 43284, 66971, -1790, -74650, -103100, -96646, -41386, -67659, -123741, -130454, -74891, -26328, 27927, -24644, -66782, -111885, -74227, -94917, -83270, -59410, 11600, 92909, 68666, 46429, 23370, 11236, 18942, 62262, 100021, 44121, 10618, 52092, 41785, 44282, 76259, 45311, -22555, -5957, 7518, 9865, 46150, 56846, 42097]
13997D2097P769N951k5577j2197J9313P461K1704l7567l7800m075K0862K4204
13985C2145N850P7437o0354p9023j0377l6155M6188N5801j9989M9014K7950O145
13973I4632O963l6057k4907n5271n6457K3070j0680K9645L5655j7857J2077j9646
13961a8833J9276J8583j1750n8066m7984J3017O7003M019l5607j5474K6124o3786
13949a03478l924L9690l867o991j8084J9917N246j062m691M3544k4230o5115N3878
13936f9167R0343p564L1068o029j1785R402k717J378q9265n237K5663K4429J3843
13923D362j6024m1193j0220K5029q657L8577j2024L8090J3204o6510j2024j3232
13911f0622Q804k4640j0685n684O165N802Q5168N1494l9639L89M9100O817n3697
$$ y = [42097, 49866, 55817, 30240, 18043, 37356, 44817, 66521, 28954, -8846, -12921, 7941, 32145, 37995, 115432, 55078, -23945, -34322, -70477, -24289, 31512, 11523, 60537, 88487, 94632, 101595, 65538, 40631, -14640, -71097, -48027, -58707, -29062, 6593, -11264, 813, -18833, 443, 19026, 7276, -50790, -98774, -85757, -18754, -14735, -50342, -65816, -39692, -103478, -107402, -67712, -71579, -78570, -96654, -76737, -71491, -72553, -77244, -33700, -57930, -123045, -69167, 21176, 13612, 44680, 38651, 26866, 36268, 33551, 34929, -54336, -59573, -33910, -9481, 4362, -11662, -52855, -63075, -38046, -46703, -8126, -20150, 17940, 31144, -35366, -47390, -60622, -51818, -76458, -87143, -92827, -86662, -80860, 4308, 55802, 16163, 16552, 65652, 72469, 18772]
13898A8772l2374O318R03K778L6410j975l5152l0110n4705r023O1405K2533j8408
13885c2628p18M0709M728m9018J3826L2439M621r993J4491Q31M1753l7796m6812
13872b3567J9168M4416O1237N1235j0889j8713m563j1548l2368m178p1787m8108
13860d9665R925J5084L975j0935N140j9912Q611P051J8309j3798K6399k0852k0491
13847d1159J1366k0764j638N2410L8945j4202k6199Q332L8520l6704n3246O6731
13835B2392l0074n6409o407l1823l765K3581j086M7327L3614Q489l0128j0634
13823c4923L3488J1427j5444j7046K7632k678m3148M7006l6211o9741l5513J1996
13811a23155j7815O1988Q6778P6926l6556p3473O999J6464M7326M3112j4874K3735
$$ y = [18772, -13602, -7284, -6381, -3603, 32807, 30832, -4320, -34430, -89135, -98158, -36753, -14220, -32628, -33346, 7363, 12091, -36927, -23101, 9338, 13959, 3966, 18457, 19288, 61041, 23245, -23567, -4399, 40017, 101254, 152489, 141600, 122887, 118324, 106776, 74408, 70230, -1557, -49665, -39740, -24656, -20681, -31616, -26476, -46388, -37777, -30726, -12417, -26215, 184, -20668, -41159, -29793, -50557, -52195, 215, 39160, 24958, -1241, 7091, 45611, 8907, -44339, 22392, -7682, -64091, -70498, -102321, -106086, -82505, -83591, -36264, -2650, 5839, -24289, -34923, -1435, 9992, -5452, -22498, 5134, 2456, -40692, 6314, -29897, -99638, -135151, -123155, -140970, -78982, 7796, 84722, 48166, -25307, -18308, -1844, 45482, 88594, 73720, 97455]
13799I7455o3769J3713J0864Q18N413l7277j1620L422n7368l4420N7464J3477
13787a828n0942l1049J1809M3710M2100L0481l2516k4897K2105M0748n2447n370
13775h096m3121N4405M3740m9602o6365K313O7218L3128N4669o612k1767p4930
13763a5020l7508k3384m4199K8146P9613j9463P534o5190j18799m841O9784Q4273
13751e9054K6745l2351l6575M8393K1470N059r952n0402l7181O0096M039m6137
13739a05850l9057o298q74N9727R0145Q6966l6952k5830L6605m6576J6420J8635
13727D7061M392n5660J6268J2184K0822j1635p5024m330L6437L9238j7014k5529
13715a2790q5142n4115M9537Q7507L672j9008k2755J2440k1743l8355L3902j7722
$$ y = [97455, 33686, 47399, 58263, 59081, 64494, 27217, 15597, 19019, -38349, -72769, -15305, -1828, -52770, -83819, -72010, -28300, 13800, 44281, 11765, -13132, 8973, 49721, -2726, -8096, -51217, 3188, 46928, -2674, -69039, -66726, 492, 33620, 88289, 81677, 59910, -15020, -52528, -75912, -120111, -91965, -12352, -31815, -24281, -89471, -208270, -213111, -143327, -59054, -32309, -64660, -101235, -52842, -31372, -26313, -36265, -86667, -123848, -63752, -59713, -105850, -144907, -151205, -152079, -92352, -2207, 84759, 47807, 21977, 58582, 12006, 28426, 47061, 51453, -4207, 12061, 24245, 45067, 33432, -41592, -45922, -9485, 29753, 12739, -12790, -97932, -152047, -102510, -15003, -11331, -30339, -53094, -40654, -62397, -100752, -66850, -84572]
13703h4572J6280J3255j6366k764j5099r552p079j7612o460N3360k4858J2015
13691h9452N1567J3806R770m3189k2611n2064N4415L2434O877o521m4670K1053
13679f8585L2697L7375K1434j8454l5466m9282J0278M4550L827L0252K4178j7010
13667A5794m7923j6549K3743k9792N1419O5990j4326J5103j5591j1029n5420o991
13655b5572J1321R730j3850k6457M1643N8035K5552n5205k7738m9819K4609J0004
13643a7747n5953N066R665N3363K8189o5130K623M8638K5405o0968J827K0079
13631d943J2722o8167m4293l334j2044l111J2502L0176M6979M5603l8686j6283
13619d2879N9052j851o100Q6639M3451m5548o4623j7806Q99j8310n589K9176J7073
$$ y = [-84572, -68292, -55037, -71403, -74167, -89266, -98818, -105897, -123509, -129969, -76609, -101467, -89452, -37885, -24079, -14309, -57498, -80109, -132173, -77758, -45324, -38447, -44968, -89638, -68585, -35888, 1487, 22921, 4467, -30999, -80281, -70003, -25453, -21626, 8626, 32804, 15794, -32129, -48678, -24935, -54727, -3308, 62682, 48356, 63459, 47868, 36839, -18581, -25572, -14251, -4521, -18371, -44828, -3185, 54850, 80402, 25197, -2541, -52360, -27751, -17747, -73700, -68634, -58969, -5606, 22583, -42547, -39924, 8714, 34119, -26849, -25022, -4943, 7779, -60388, -104681, -108015, -120059, -123170, -110668, -80492, -33513, 12090, -26596, -42879, 16173, 14322, 8222, 94861, 138312, 92764, 28141, 10335, 11234, -7076, -12665, 16511, 33584]
13606C3584j000j5290l8777N9912Q2902k3686m626k4647M235k5036p0676j2457
13594c5562p6118o3757R4288K6987l1424J077j330L1367L5647P336J394J4982
13582D887n5364J2340M6306L4285j2632k1098l8017M8880J8802k2931l2211n870
13570b2623L5927M5684o8764l1663M9617k640Q684K1425L6563j08098l1535M6846
13558b0577N2531M0648m6118l3061L8080j4870l1782K9770M1065n2901P357M9149
13546E9291j8219K3936k7791O163J3154p9146m3673j4788J537R21R306J3986Q60
13533e4463l8780K4665J02356K4474n637k5228n309n6155k8575L3419O1569j6491
13521A5845j7638k5274K0436j9790K9261l412L954k4370j0840l0632J3727M671
$$ y = [33584, 32584, 17294, -21483, 38429, 121331, 97645, 93019, 68372, 72607, 47571, -23105, -35562, -111680, -175437, -81149, -54162, -85586, -84509, -85839, -54472, -18825, -11489, -10095, 4887, -50477, -38137, 8169, 42454, 29822, 8724, -29293, 19587, 38389, 15458, -16753, -22623, 13304, 58988, -9776, -41439, 8178, 5538, 14222, 35647, 72210, -35888, -67423, -20577, 31954, 72602, 26484, -6577, 31503, 16633, -15149, 14621, 55686, 2785, 10142, 59291, 41072, 65008, 37217, 43380, 56534, -22612, -66285, -81073, -79536, -78615, -69309, -55323, -54463, -93243, -68578, 33778, 58252, 52615, 27387, 22078, -34077, -62652, -29233, 32336, 15845, -1793, -27067, -6631, -26421, 2840, -572, 3382, -20988, -31828, -62460, -48733, -44062]
13509d4062M2205k6020R25J8064K3065j8127k6056M0720M2144n8485R356p969
13497d240M753L0928K2613k8500j9404k9345J324k803l7586j9292M950M3301P5115
13484D1814k0288p457l3081l0679J8633k6946m3924L4600j1823K6076L6165n624
13472b2534M8640m0056p19L3165j8200K1009K6209k521o7039L5035K0436l9025
13460e600O4801m597k5380j733J7528J9295L1745M2407l430k6376l2469n1377
13448B4814M1j4132L522J7279J5973Q614J6659L2287k0093j1503n730L2622j2399
13435H7954o8309m3951l5251P526l5J9418m4718l1091O4273L7939N0437J1219
13423E5411K3330J0130L096L1723r953j19075J5225M4216j8440k1517k0604l7056
$$ y = [-44062, -1857, -27877, -26952, -8888, 14177, -3950, -30006, 10714, 52858, -5627, 3729, -4240, 513, 31441, 54054, 25554, 6150, -23195, -21871, -24674, -62260, -81552, -76602, -33301, 41814, 21526, 14069, -19012, -49691, -31058, -58004, -101928, -67328, -79151, -53075, -16910, -22534, 26106, -13950, -14669, 18496, 296, 21305, 47514, 44993, -22046, 12989, 33425, -5600, 59201, 54604, 29224, 27491, 45019, 64314, 96059, 138466, 135036, 108660, 76191, 24814, 24855, 10723, 14245, 31524, 47497, 56111, 72770, 105057, 84964, 73461, 67731, 100353, 87954, 19645, -24306, -59557, -52031, -52066, -32648, -77366, -108457, -44184, -6245, 44192, 55411, 78741, 88871, 91967, 123690, 113737, -5338, 9887, 54103, 35663, 14146, -6458, -43514]
13411d3514j2762M1103J7029M640n649N9922O6670M7282r0145r1005n6251l278
13399f5958l1534L575Q5258K1960k1068k4416k394k3099m033N5941L1533K4408
13387E0173O716J5696k8833J1251p511l4418j606K2618L5205j2367j6676K9430
13375F9678J775n1441l9878M4911K9355l4773K1441k8896n6012K2468n810k0266
13363d7448k7216M3467K5841j6103N347j3463o0528M9806N6192j2061l6315K3813
13351h668M6426k713K3927K089m2688J2628J9494o5297J9607N6690R297l4671
13339C6121n7794o05K2404n9894Q08M5378L3338K7496M8047p958k9256k0953m1584
13326d452j5722K0620j1446j9273N2919J9926l1195L1500N0090k888j3435k2244
$$ y = [-43514, -56276, -15173, 1856, 6496, 847, 60769, 127439, 174721, 84576, -6429, -62680, -65958, -97492, -93917, -8659, 13301, -7767, -32183, -34577, -57676, -61709, -5768, 25765, 50173, 56889, 72585, 43752, 55003, 47492, 13074, 11468, 34086, 69291, 56924, 40248, 69678, 71453, 20012, -19866, 25045, 54400, 19627, 41068, 12172, -43840, -21372, -27182, -47448, -74664, -31197, -5356, -21459, -16112, -29575, -90103, -40297, 15895, 3834, -32481, -8668, 37758, 35045, 58972, 61061, 18373, 31001, 50495, -14802, 4805, 61495, 70792, 36121, -21673, -22278, 126, -59768, -58960, -13582, 19756, 47252, 95299, 87341, 58085, 37132, -4452, -20174, 446, -11000, -30273, 22646, 42572, 11377, 42877, 92967, 90079, 76644, 54400]
13314E4400l2081k0692m1715l6254r649r259J1933M2877L9131l0521P646O5973
13302D1789j6092K0366J3177J6315m9188k1163j2617J9421l105j7213o646n4677
13290f9633J8746M56m552M380R063K2449J5684K0145P5518k7828O150m1869l0102
13277a393N1152O4136m9795n3346J5664l486o9251l8387J4371L6765P3409K3427
13265F3266l7408j6779n4448k2438o7710R626M8163J9879J3966K4419K0767q582
13253g279m797K1294k7878k9806L7997J1444J3866M0903n762J485j1678k7854
13241A1935l5934k0931K1425R2084k7515m2102k9277m6568K6164P997j8555L629
13229e7648M4550j266j3819L1806L1621m7169n5196j2792P7030N6156K8518l0473
$$ y = [54400, 22319, 1627, -40088, -76342, -85991, -95250, -83317, -40440, -1309, -31830, -24184, 41789, 25697, 46063, 59240, 75555, 26367, 5204, -7413, 12008, 8903, -8310, -14956, -69633, -50887, -50431, -54983, -50603, -41540, -19091, -3407, 16738, 92256, 64428, 70578, 28709, -1393, 49759, 113895, 64100, 10754, 26418, 22932, -46319, -84706, -70335, -33570, 39839, 63266, 25858, 9079, -45369, -67807, -135517, -125891, -77728, -57849, -43883, -19464, 1303, -7279, -12076, 9218, -18660, -48466, -10469, 975, 14841, 55744, 49982, 51467, 39789, 11935, -23999, -44930, -23505, 68579, 41064, -1038, -30315, -76883, -50719, -42722, -61277, -57648, -13098, -14364, -28183, 3623, 35244, -11925, -67121, -79913, -2883, 53273, 81791, 51318]
13217E1318K5269m2140J4478m7787n3283p635M5454L71r944O592K0009j4319n6916
13204f8533L5713Q1514K2594J6512k3927n2498n320K6719j3191k6443m07p4960
13192h2227o0970N4896L1583L1960j7353m3093q819L0650N8266M9090j3728k7772
13180B483K328J9148J0745J0360o4156k2589L386J3504K6005R180l5614l766M5282
13167A6296P239J6595K3528p4440j5016k6396k6551j9610k9702P556L6227L4220
13155e0054J36330M4826m6042l530m5679r295L178j9976j201l3181K1628j1322
13143a4318k2537K2517j3799o420J6596o396l6540J8076J4997J2325K7473K2543
13131C4517l9784K4678o650j6550n2068K1115M8702k0549m3790k6060L6934K7849
$$ y = [51318, 76587, 34447, 48925, 1138, -52145, -59780, -14326, -13955, -23899, -17307, 2702, -11617, -68533, -32820, 48694, 71288, 87800, 63873, 11375, 6055, 32774, 19583, -6860, -7267, -82227, -143197, -88301, -56718, -24758, -42111, -85204, -94023, -63373, -5107, 43983, 30255, 2483, 4811, 23959, 34704, 45064, -19092, -41681, -38295, -24791, 1214, 10394, -25220, -28986, 16296, 23535, 40130, 63658, -10782, -25798, -52194, -78745, -98355, -128057, -120501, -84274, -50054, 86276, 131102, 85060, 81530, 35851, 26556, 29734, 9758, 8557, -24624, -2996, -14318, -36855, -14338, -28137, -34557, -17961, -24357, -60897, -42821, -27824, -15499, 11974, 34517, -5267, 19411, 12761, -3789, -55857, -34742, 13960, -6589, -50379, -76439, -39505, -11656]
13119a1656m3571N4468J4440k2486K1816o248l5166k0845K2306M2718q51K800
13107A7725J628K0692J975R490k8671l046J7794j2950k9100N6946J0413j7086
13095D5810k5556k5166J7903l7508k5292q0237M492L7004l0206k0477J5999j3214
13083a36448Q4048J2965L6574j6154m237J3945o3055m2713K5755l8284R202P0563
13071d7839M135K2410M9598m8295J0027J6705M0869L0766o8206o9422q9503l0432
13059a79187Q9945M3272M6604k2121K5446l738o5322R983L0084L2107n658k7292
13047b5877j2772n8143m4655j9696K3456L2837O4308M6709l8051q457L1292r96
13035a0045L6077m139m200J1819l1197k7194K186L2717O8981l6681n7270m0337
$$ y = [-11656, -55227, -759, 13681, -8805, 13011, 6763, -28403, -49248, -26942, 15776, 14925, 17725, 19353, 40045, 42020, 51510, 22839, 19793, 37587, 24637, -4463, 52483, 62896, 45810, 20254, -4912, 12991, -24517, -49809, -130046, -125554, -88550, -118756, -139233, -123234, -136448, -52400, -39435, -2861, -19015, -23252, -9307, -72362, -115075, -89320, -127604, -118402, -47839, -43704, -21294, 28304, -19991, -9964, 6741, 47610, 78376, 10170, -59252, -148755, -179187, -89242, -45970, 634, -21487, 3959, 221, -65101, -55118, -25034, 7073, 1415, -25877, -38649, -96792, -141447, -161143, -137687, -104850, -40542, 6167, -31884, -40341, -9049, -10045, 26032, 21893, 17693, 29512, -1685, -28879, -26693, 6024, 75005, 38324, -18946, -59283]
13023e9283M9966J6541K6100L395M5961k4329m8250N4845j5399l3206m706q923
13011B712q468M8665O8796J7499k2128N011J3000l3152q2011l0811k7460O223
12999d2124L6866m2706Q89q76j5043P238K2050M867Q768k5487j1770j8019O5655
12986i692K1210L6499K0889l7959n490J0686P873K2646N091j9950k5194l4615
12974h006p0758M0275J7443k5611k1285N4841M7467J0556l1379j6332n212l2964
12962d0965l5638K3441Q812L23M8918n456l3821m065n1228r294K9499N7996J4737
12949C259l6859l5706P2238M2557J1993m6408R523j2129j1223l4005L0725Q997
12937B962l0055m2626j0949K4178N544K7161M8771l721m814k2179k7758j7979
$$ y = [-59283, -9317, 7224, 33324, 36719, 82680, 58351, 10101, 64946, 49547, 16341, 11635, 2712, -5756, 42909, 111705, 129204, 107076, 112087, 125087, 91935, 9924, -20887, -48347, -42124, -5258, -47964, -47075, -47951, -62994, -55756, -33706, -28839, -20071, -45558, -57328, -75347, -9692, 11518, 48017, 68906, 30947, 25457, 36143, 44016, 66662, 71753, 51803, 26609, -8006, -78764, -38489, -21046, -46657, -67942, -13101, 34366, 44922, 13543, -2789, -8001, -40965, -76603, -53162, -44350, -44027, 4891, -565, -34386, -38451, -89679, -98973, -69474, -11478, 3259, -33600, -69306, 2932, 45489, 57482, 11074, 20597, 8468, -2755, -36760, -6035, 2962, -27093, -69719, -80668, -56490, -50946, -23785, 24986, 21265, 16451, -5728, -33486, -51465]
12925e1465k2940j3032o898N3334R786l3078K3533k5046m565j5361j156P4972
12913a1916J02356m0371o6075J0997j5935p309N4859L9261k8434O094q497J1199
12901D6229l2942k1585N2647m50n3863n5906J7094O195l885O7734k537p6445K8131
12888b9583L3368o069O400l7286K8714l57k7294m3846K3775l686K6755N799j5132
12875c8442O8535M7722L8531l1066j2843k4430m2919J4542L9053J5164j584l1131
12863D1132L924m3578K050O811m7950m7096P4176j6818l7567q5098N3007Q2799
12851a4208k7605k3726o109K466j6103O8385N3978L3306L3667L4316n3608j24556
12839c9797o326j7137J11377Q07K0377M5780M5439m1797n1071j5662j1989q732
$$ y = [-51465, -74405, -87437, -94335, -41001, -31215, -64293, -40760, -65806, -70371, -85732, -86888, -11916, 90440, 50069, -16006, -5009, -20944, -28253, 26606, 65867, 37433, 43527, 35030, 46229, 13287, -8298, 44349, 43899, -9964, -65870, -48776, -42581, -46466, 21268, 18731, -57714, -29583, 3785, -2284, 4116, -33170, -4456, -4813, -32107, -75953, -52178, -55864, -29109, -23310, -38442, 30093, 77815, 116346, 85280, 72437, 48007, 5088, 19630, 58683, 73847, 72263, 41132, 45056, 1478, 3528, 10339, -37611, -84707, -10531, -27349, -64916, -150014, -97007, -14208, -41813, -65539, -71648, -69182, -85285, -16900, 37078, 70384, 104051, 138367, 84759, -39797, -46123, -63260, 48117, 48924, 69301, 115081, 160520, 118723, 67652, 51990, 40001, 31269]
12827C1269N9045l8021r3069L6075O6684k4195p3109o5521L2098K2925l649L6477
12815a2991J8683k2257K768L8497p222l6691r337k3915l9494K570J007O6022L3364
12802A1004J5576l3308M9861J9220j5466J2624J7295l0518r4354k3030N1716J3689
12790e691L6989K7584k7695L004k5854l1484N6715L1803n1049n7302n7613L5659
12778f4934o76N790P8620M5239K209q134K5571L326l0741l3218k6664N836j9525
12765a7301l7093K188L3453J421K4600N749l3211N0983R385j5554l3351R364N5407
12752E6040L3679j8983n3013q4190j2756L9945n870L993P2786p358J1411L222
12740C8906J9929M1658o2156M18K1237j9397j8145M2634K9455k0952L0816J6401
$$ y = [31269, 90314, 52293, -40776, -4701, 61983, 37788, -35321, -100842, -68744, -45819, -49468, -12991, 5692, -16565, -13797, 24700, 17478, -19213, -28550, -52465, -91959, -89389, -88382, -22360, 11004, 26580, -6728, 43133, 62353, 46887, 59511, 76806, 46288, -48066, -71096, -19380, -5691, 31298, 58882, 31187, 34191, 8337, -23147, 33568, 65371, 14322, -42980, -100593, -64934, -65610, -59820, 18800, 64039, 66248, 58114, 83685, 87011, 56270, 23052, -3612, 2224, -17301, -54394, -52206, -18753, -17332, 7268, 13017, -20194, 30789, 40174, 24620, -8731, 633, 56040, 89719, 70736, 17723, -66467, -79223, -39278, -45148, -41155, 31631, 24273, 35684, 38906, 58835, 100493, 38337, 38755, 59992, 40595, 22450, 65084, 94539, 73587, 104403, 120804]
12728A20804k2153k7703J2554n4430Q336m3125l416j8565j434L3400o133l9593
12716d1458J2958m673K4383M0982P3356n8769k4431M026L7260n4808k675M17L443
12703A0011L1306o641j2764P345q351p060L949N3297K2668o0746k7487J6569R120
12690C1216N502j4651m2783l5758Q585K2558l3943M7164J8161M7152k6675o9511
12678d2983j8070N5510J8630K2790k6176l3117M8992o2783m5041n328j0759O5883
12666c2452J6530j6909m9257N2745K9025k4229n807J7536j3032L5422J653K8892
12654D0117M3534J4785n7956n9135o9560N7917K9587j5998L5421L4660O0251L2725
12642A46348l0082k583m0114M297j5977k9513m6821m9144O0259K1552K3991o313
$$ y = [120804, 98651, 70948, 83502, 29072, 37408, -5717, -9133, -27698, -29132, 4268, -1865, -41458, -28500, -33173, -8790, 32192, 105548, 46779, 22348, 26374, 63634, 8826, 6151, 6568, 10011, 41317, 34676, 21912, 29257, 20906, 13846, 17795, 71092, 93760, 33014, 5527, 22096, 31216, 36718, 22067, -20716, -56474, -47889, -25331, -59274, -12110, 6051, 53203, 26528, -42983, -61053, -5543, 13087, 35877, 9701, -23416, 25576, -37207, -82248, -87576, -98335, -32452, -15922, -32831, -82088, -29343, -318, -24547, -30354, -12818, -25850, 9572, 11225, 40117, 83651, 98436, 40480, -18655, -88215, -30298, -711, -16709, 18712, 53372, 113623, 146348, 116266, 113683, 73569, 77866, 61889, 32376, -14445, -63589, -3330, 18222, 42213, 35900]
12630C5900L6284K9037M6259P081j5853n1604q2995r900j1119N5061K3515m0519
12618B1147j1385L5591k7992j7377J6102n2577M815K9840l5918l0751M798L5764
12606b7943L7832j2792P0918K3523p8487m1030K6520n0214k8547K7307L6877K6611
12594A0575J2410L4895j5290j7151R924K7154j2931L0995m1284m1552O1587l3911
12582B5421n9037L8527M2567m2418L7963L9651j6660q0525K310L9975k6613r931
12570h770M7074K9449m2132J0763M3765K6674j7415k4589k1739j7806J3915J4522
12558E3711K0789O23M0405k8716n9656j1921j9640m5222J5189N1230J5118J6914
12546D8824j3980J1099M0661k4122l9806j564m1472M037N9278P4985R917n0786
$$ y = [35900, 72184, 101221, 147480, 154561, 138708, 87104, 4109, -5791, -16910, 38151, 61666, 21147, 9762, 45353, 17361, -16, 16086, -36491, -31676, -1836, -37754, -68505, -63707, -27943, 9889, -2903, 68015, 91538, 13051, -27979, -1459, -51673, -80220, -52913, -16036, 10575, 22985, 57880, 42590, 25439, 35363, 62517, 49586, 80581, 39297, -2255, 59332, 25421, -33616, 4911, 47478, 5060, 43023, 82674, 66014, -14511, -12201, 27774, 1161, -8770, 38304, 67753, 25621, 36384, 80149, 106823, 89408, 64819, 43080, 25274, 39189, 53711, 74500, 75123, 115528, 86812, 27156, 15235, -4405, -49627, -34438, 16792, 31910, 48824, 34844, 45943, 86604, 62482, 22676, 21112, -20360, -16323, 42955, 117940, 127857, 77071]
12534G7071N2297k6438q4642L7834K4326J4578k4499l3403j931L9286Q055L3287
12522A15821N0636N305o0716o3923J5678M9811m628p0782o056J2046L7628j0625
12510G0195k3904j3222r58L4714L3890r5041j02519j2513K8532K6346O1516m2010
12498c4974n6561K7194M7175J4006N8164L9583K628J3877o7320n0410j9292j9442
12486d5372J5104O3283J24877P8840l1166q2541k1312k3899O050P743M355O319
12474A02281r554n2555K242K6517k1916j8679n0572j0104N6961o986O9264M0816
12462A27715q510o374j2323o0460j4515j8084l7899k7081k8693K2581J0702K0138
12450c2803K6755J04971J01476L8187n941o3079l0547j5329l3709m3970J4395
$$ y = [77071, 129368, 102930, 18288, 56122, 80448, 95026, 70527, 37124, 35193, 74479, 82534, 115821, 166457, 171762, 111046, 47123, 62801, 112612, 107984, 37202, 31146, 43192, 80820, 70195, 46291, 33069, 32111, 66825, 100715, 5674, -96845, -109358, -80826, -54480, 7036, -34974, -91535, -64341, -17166, -3160, 55004, 94587, 97215, 111092, 43772, -6638, -25930, -45372, -30268, 33015, 157892, 236732, 205566, 123025, 101713, 77814, 83864, 91607, 95962, 102281, 92727, 40172, 42414, 68931, 47015, 28336, -22236, -32340, 24621, 17635, 86899, 127715, 119205, 112831, 100508, 40048, 25533, 7449, -30450, -57531, -86224, -63643, -52941, -32803, -6048, 98923, 200399, 238586, 232645, 169566, 139019, 123690, 89981, 46011, 60406]
12439F0406k1663j8950M0482J3004m806J925J5404K6277m8150k4503K7254j011
12427F5669l8991L5116k5967n7862J930O7203m233K1743r246m486L6453K1056
12415A08385J0061m1153q037K718r03k9570l2972l037j5734o1153M2206J15439
12403H6250N0548n196J7519j000p5017m5936K0384q992M8691J6884o008J225j2560
12390H6792K5044j3685L2514k4119p3198k807J7232O7246k5493l3183l821l1465
12378B1057l7986N376K5338Q0931k2966m4987k6706r3144k2810P3815J11027O757
12366G5702m4383j6496j0544J7651M5913j813J8734J6829j1746R370P6123j2140
12354A63200l6272k580J1994L1554J686K0677n1526r2406p318N4617K8386J6383
$$ y = [60406, 38743, 19793, 60275, 73279, 68473, 70398, 85802, 112079, 63929, 39426, 66680, 65669, 26678, 61794, 35827, -22035, -20105, 47098, 42865, 64608, 55362, 50876, 87329, 108385, 118446, 77293, 69256, 71974, 71071, 41501, 8529, 5492, -10242, -71395, -29189, 86250, 136798, 131602, 149121, 148121, 73104, 27168, 47552, 38560, 87251, 104135, 98127, 99352, 86792, 111836, 98151, 130665, 106546, 33348, 30541, 47773, 115019, 89526, 56343, 52522, 21057, -16929, -11553, 13785, 94716, 71750, 26763, 57, -93087, -115897, -42082, 68945, 75702, 31319, 14823, 4279, 21930, 67843, 66030, 84764, 101593, 89847, 99217, 175340, 163200, 126928, 124348, 136342, 167896, 169582, 190259, 138733, 46327, 39009, 93626, 122012, 138395]
12342A38395l2864k2334l2831k3168M2104N3916n0657l0771m2559J5248M6618
12331F1097L2398m0036K5341K275j0275l1301r806M1974n4914r9816J05311P9242
12319A01490k6198K0570K935k8074l1908q951J9242j3124q316K2566P2088N1522
12307A73842j1450J0729k9684J8716J0622k759n9507l4023M9971m941q294j4833
12295I8389L0943K3551k2728j588j5170k040k2015K1877J5180K6809o0371l7522
12283E5315O1845J01868n7815o7583k6129j1494n0195j4761k615p939L4381L4380
12271D9258m359K9847N8886L0897o098k3846J840L3919j4889K699L846n48J8258
12258A79710j767j1714q980n6695J2298O5998K6537l2662M256J1199o7286O20
$$ y = [138395, 105531, 83197, 50366, 27198, 69302, 123218, 72561, 41790, -769, 14479, 61097, 93495, 53459, 78800, 81075, 70800, 39499, 29693, 71667, 16753, -83063, 22248, 101490, 75292, 95862, 98797, 70723, 38815, 29864, 49106, 35982, 27666, 50232, 122320, 173842, 162392, 173121, 143437, 162153, 172775, 170016, 110509, 76486, 126457, 121516, 113222, 98389, 129332, 152883, 130155, 128567, 113397, 111357, 89342, 111219, 126399, 153208, 92837, 55315, 117160, 219028, 161213, 93630, 67501, 56007, 5812, -8949, -11564, -19503, 14878, 49258, 44899, 74746, 133632, 164529, 158431, 134585, 136425, 170344, 155455, 158154, 162000, 161452, 179710, 177943, 166229, 157249, 100554, 112852, 178850, 205387, 172725, 176981, 188180, 120894, 121514]
12246A21514L9243N0546p2447L700K3893K1676P886n020j5845J6997K9107M625
12234B25875j0888m8972n38O2452o4957p2031N6236L5333n3969k826K3403J9127
12222A68245K739j0595L9410O5939j4555M4993l0777l7671o5150m4586N2954M3898
12210B14844M6868N5075K4878l6308r636k0412q699M309k1254m1727J1050L877
12198B22865J2441Q2479k597m4501K8175l4560l0965P7067N8181M8702L1974k223
12186D47038n3503l6097l2017M2142p106l3323k1843J6059n9169j00175K342K9544
12174A93892O2918p627k5682M4672M6432J4959Q871J9775j8813j7770o3566n0644
12162B07417O931J1876J1723P2519l0042k771k9600j936R513L3071J6782M7597
$$ y = [121514, 160757, 211303, 138856, 142556, 166449, 188125, 196011, 190991, 175146, 192143, 221250, 225875, 214987, 166015, 165477, 227929, 162972, 90941, 147177, 182510, 128541, 125715, 149118, 168245, 170984, 160389, 199799, 265738, 251183, 296176, 265399, 227728, 162578, 117992, 170946, 214844, 261712, 316787, 341665, 305357, 295721, 275309, 266610, 270919, 249665, 207938, 218988, 222865, 235306, 317785, 315188, 270687, 298862, 264302, 233337, 310404, 368585, 417287, 449261, 447038, 393535, 357438, 325421, 367563, 360457, 327134, 305291, 321350, 262181, 162006, 164348, 193892, 256810, 249183, 223501, 268173, 314605, 329564, 338435, 358210, 339397, 321627, 258061, 207417, 214348, 226224, 237947, 310466, 280424, 277653, 248053, 246117, 255630, 288701, 305483, 353080]
12150C53080k374n5230N4871k1897k2029M374K0672j6127q679J2672N977K706
12138C28016k024J6414J7895K5004r983M6523j3667k5834j6623J9726j2371J9226
12126C92302m669N929k1667n552J7779L8591r168k6379k0610O4151K6690r026
12114D48371p313M6274L2331M470m2011m7307n0535K2585L6520K9120L8345k1342
12102D89508j8923k706L7765P9806p3411k7067M2933L8151l5899m243q659p551
12090E09704j1478m4753L1847N1130J2459P744k1483J6472J086K2223K6591K3465
12078F25007j7976j7877L7702j5176M2734M7807M9378N6592k3476n751l232J6838
12066G92570L5759k2719J3827L3903J3920L7879K2699o9752l1073J6613l381J1181
$$ y = [353080, 350706, 295476, 350347, 328450, 306421, 310795, 331467, 315340, 306661, 319333, 325310, 328016, 325992, 342406, 360301, 385305, 375322, 421845, 408178, 382344, 365721, 385447, 373076, 392302, 387633, 393562, 371895, 366343, 384122, 422713, 413545, 387166, 366556, 430707, 457397, 448371, 441058, 487332, 519663, 524133, 482122, 434815, 384280, 406865, 443385, 472505, 510850, 489508, 470585, 467879, 505644, 585450, 512039, 484972, 527905, 566056, 530157, 525914, 517255, 509704, 498226, 453473, 485320, 536450, 548909, 556653, 535170, 551642, 552728, 574951, 601542, 625007, 607031, 589154, 626856, 611680, 654414, 702221, 751599, 808191, 784715, 778964, 775732, 792570, 828329, 805610, 819437, 853340, 867260, 905139, 927838, 858086, 827013, 843626, 840245, 851426]
12054H51426n119K1472N4916J19459L6246o7867J5488O6316O4407n6900K1605
12043A121449N4035m7833p784K2832J62029m068q4444J8402J8658Q7586P813k3849
12031A324826n480Q4219Q4852N1508J8716l8029j7734K9941K2395P6031O4219
12020A695464L8897Q4748O0662J263J7748L5361L7165J00012M4466l326O1466
12009B173926J44365Q6179N3026k1229k6480N0252Q0277J47744J10025M9214P4713
11998B922012J09404R1142J28623J03295Q9060Q6264M9103J18404Q1693J01529
11988C880529J94972K19033J28285J24181J41544J66256J76824J84424J70563
11979E386611J81941J74804K89707L19008K66006K40950K59518L51947K87431
$$ y = [851426, 846307, 867779, 922695, 1042154, 1078400, 1010533, 1026021, 1092337, 1156744, 1099844, 1121449, 1175484, 1127651, 1119867, 1142699, 1304728, 1300660, 1216216, 1234618, 1253276, 1340862, 1348675, 1324826, 1319346, 1403565, 1488417, 1539925, 1558641, 1520612, 1502878, 1532819, 1555214, 1631245, 1695464, 1734361, 1819109, 1879771, 1881034, 1898782, 1934143, 1971308, 2071320, 2115786, 2112460, 2173926, 2318291, 2404470, 2457496, 2436267, 2409787, 2460039, 2540316, 2688060, 2798085, 2847299, 2922012, 3031416, 3122558, 3251181, 3354476, 3443536, 3529800, 3578903, 3697307, 3779000, 3880529, 4075501, 4294534, 4422819, 4547000, 4688544, 4854800, 5031624, 5216048, 5386611, 5568552, 5743356, 6033063, 6352071, 6618077, 6859027, 7118545, 7470492, 7757923]
11970G757923L02688M10589M92893N13946N38163N27730N43292N97398O66850
11961A2351472P22107Q19152Q10170Q70449R98017J094367J201431J323148J511274
11952B1701587J597088J764840J963917K090265K329880K548845K752746K980948
11944C9730116L248042L490821L661686L863111L985874M038844L959781L730495
11936F9708770L423423L090042K518519J788650R69985J52703o18639j388471
11928G9644982k063800k641830l111405l426365l601697l658449l502597l417103
11920E4221736l261201l125921k808409k581454k481411k349525k113369j942517
11912C3557929j789592j635145j521856j406242j298972j196681j148411j117863
$$ y = [7757923, 8060611, 8471200, 8964093, 9478039, 10016202, 10543932, 11087224, 11684622, 12351472, 13073579, 13892731, 14702901, 15573350, 16571367, 17665734, 18867165, 20190313, 21701587, 23298675, 25063515, 27027432, 29117697, 31447577, 33996422, 36749168, 39730116, 42978158, 46468979, 50130665, 53993776, 57979650, 62018494, 65978275, 69708770, 73132193, 76222235, 78740754, 80529404, 81499389, 81652092, 81033453, 79644982, 77581182, 74939352, 71827947, 68401582, 64799885, 61141436, 57638839, 54221736, 50960535, 47834614, 45026205, 42444751, 39963340, 37613815, 35500446, 33557929, 31768337, 30133192, 28611336, 27205094, 25906122, 24709441, 23561030, 22443167]
11904B2443167r91452r04369q74350p84916o96725o75662p09776o56407o14967
11895A5534543n68214n28108m65434n48646m48561m46108m19031l52677l74224
11886A1383540l71193l97416l42263l52138k98423l06463k96523k51860k85983
11877H481278k71092k85288j80401j88275j63329j60686j79346j83551j99915
11868F669395j77006j75543j48358j41360q2386j35585k26081k03850j26100j17876
11858E135250j57125r8155p7724r3434j04090j47198j02098j07341j05574j49191
11848C993320j34797o1407o027p3559j39571j13761o7371r0688n3312m8486L7524
11837C241865o3834j07977j8669n5039j25270q8012k0461o1558n0962p3751o0587
$$ y = [22443167, 21451715, 20547346, 19672996, 18888080, 18191355, 17515693, 16805917, 16149510, 15534543, 14966329, 14438221, 13972787, 13424141, 12975580, 12529472, 12110441, 11757764, 11383540, 11012347, 10614931, 10272668, 9920530, 9622107, 9315644, 9019121, 8767261, 8481278, 8210186, 7924898, 7744497, 7556222, 7392893, 7232207, 7052861, 6869310, 6669395, 6492389, 6316846, 6168488, 6027128, 5944742, 5809157, 5583076, 5379226, 5253126, 5135250, 4978125, 4879970, 4802246, 4708812, 4604722, 4457524, 4355426, 4248085, 4142511, 3993320, 3858523, 3797116, 3791089, 3717530, 3577959, 3464198, 3396827, 3306139, 3252827, 3204341, 3241865, 3178031, 3070054, 3051385, 2996346, 2871076, 2783064, 2762603, 2701045, 2650083, 2576332, 2515745]
11826B515745j30286q8630k0429M4101Q942l1784k3927j04507j15883q0772l9899
11815A932671Q697m4289j6737j927n8573R752k027N351p1935r1578o4931j8329
11803A586145k9614j16699j9451M9797p1856l5045m9817p5360J8964L6771L529
11792A297364l3941R127j9794J1590j3315o1388n2900j3624j7861M03p089o74
11780A097898R397m86k6195j6807m8930n1215m4410q5707m8781L9627O3306p203
11768H80494m8062k7779K3932j6666l6564k6451m429n8497L908K702j6338k5423
11756F50827K8019K2091l6270o712k0372K3969J5054l1388p744K5369J9745K8997
11744G11585n947k5123o9022m4472r059k2112L8353K1707l8575m0299l1903j4378
$$ y = [2515745, 2385459, 2296829, 2276400, 2320501, 2329443, 2297659, 2273732, 2169225, 2053342, 1972570, 1932671, 1941368, 1897079, 1880342, 1878415, 1819842, 1829594, 1827567, 1832918, 1760983, 1669405, 1604474, 1586145, 1556531, 1439832, 1420381, 1470178, 1398322, 1363277, 1313460, 1238100, 1257064, 1293835, 1297364, 1263423, 1272550, 1252756, 1264346, 1251031, 1189643, 1136743, 1123119, 1105258, 1105661, 1098572, 1097898, 1107295, 1106809, 1080614, 1063807, 1014877, 963662, 919252, 833545, 784764, 824391, 887697, 880494, 832432, 804653, 828585, 811919, 775355, 748904, 744475, 685978, 689886, 692588, 676250, 650827, 678846, 700937, 664667, 657955, 637583, 661552, 676606, 645218, 637474, 662843, 682588, 711585, 705638, 680515, 611493, 567021, 557962, 535850, 574203, 595910, 557335, 517036, 485133, 470755]
11732D70755K490r868L734M38L263M7340K3935j7069r175n0756k7047J067M1181
11719D80288M9488l0761j1719j9965m8661k2046m5723j9569K8222j5008o8990
11708B75556k039L8863j1882n6509J8667J5131m603K5328Q9113j0389l7596L0196
11696C69836O4591J1183q8348k8964N353L7318q668l4768j8692O180k3670l4934
11684B56417L3463Q4425l9242l5520K8562n0387k0767O755N02M3909P9233J9632
11672D06982k2627j6057j2978j440n1282n2249p7926J0283J3916j6065M692P0221
11660B55470Q1366O759p3235r7081J7749R14j7706L394P8199J2490l7690j6208
11648B14421J0056k6236m071N0780k5190l3205P3694J0644L0004j624n7474o1487
$$ y = [470755, 473245, 463377, 467111, 467549, 470812, 518152, 542087, 525018, 515843, 465087, 438040, 439107, 480288, 529776, 499015, 487296, 467331, 418670, 396624, 350901, 331332, 359554, 344546, 275556, 273517, 312380, 300498, 243989, 262656, 277787, 273184, 298512, 387625, 377236, 339640, 369836, 434427, 445610, 357262, 328298, 333651, 370969, 362301, 327533, 308841, 315021, 291351, 256417, 289880, 374305, 335063, 299543, 328105, 277718, 256951, 263706, 264208, 308117, 387350, 406982, 384355, 368298, 355320, 353880, 302598, 250349, 172423, 182706, 196622, 180557, 185249, 255470, 336836, 343595, 270360, 173279, 191028, 191942, 174236, 177630, 255829, 268319, 230629, 214421, 224477, 198241, 194170, 244950, 219760, 186555, 260249, 270893, 300897, 299273, 241799, 180312]
11636A80312m0674P254Q6012l5022l7064K843M901J4161N4285K2955j6571k3410
11624B19982j4355m7290j3877p739L5579L7638J8152K355n4155K0300L9516n848
11612B30258J1830k9268k8875m5529R085Q3050K8853n3808j3254j4279k1133L2225
11600A89155l3081n6689K4764K0545m0182k3136M112l2889M627N1541R619P822
11588A26208J6644j9543j0786k1147J4386M8943M6623o9065k0035n304M1146o2191
11576H5879p0813M9560L318r3400M6429M6806k7757M237k3518J3392Q7953O672
11564A28758L1146j5685m0598k6898j8244K522M4311K6373K4518O861J8684L031
11552A84779m2878n4691l0620J9992L0966j397L1971k3719o8248j4781M3571j8786
$$ y = [180312, 139638, 146892, 232904, 197882, 160818, 163661, 168562, 182723, 237008, 259963, 243392, 219982, 205627, 158337, 144460, 136721, 172300, 209938, 228090, 230445, 176290, 196590, 236106, 230258, 242088, 212820, 183945, 138416, 147501, 230551, 259404, 205596, 192342, 178063, 156930, 189155, 156074, 99385, 124149, 144694, 104512, 81376, 85488, 52599, 57226, 108767, 118386, 126208, 142852, 123309, 112523, 91376, 105762, 154705, 201328, 132263, 112228, 106924, 148070, 85879, 15066, 64626, 67944, -25456, 20973, 67779, 40022, 44259, 20741, 34133, 122086, 128758, 159904, 144219, 103621, 76723, 58479, 61001, 105312, 131685, 156203, 163064, 181748, 184779, 141901, 87210, 56590, 76582, 107548, 106151, 138122, 114403, 46155, 31374, 74945, 56159]
11540E6159p6311Q714O8239K7984l2758p1561O1752N9323j9214R484O1825M9042
11528B02678j8398j2649m4980q5741N519L5433r00l1413l8443j2642N7208N6568
11516A12240J0806k2193J3635l5095P532J5518j1268J326K1597L3767k2124j2928
11504A12813p100m5413N770Q8876J0509k4478j3441k2542j3100n375j1019J2121
11492H7621k7442j8371m5038L3109L6838k9576j4413j958K4554M5273j6125N331
11480G9803K0172J118l5607k7375j3773j4600Q276M1506M9098J1928o0839N623
11468F5330O8946m1990j5037j617N6221K4670n4427k2767j7890q567p0414K7986
11456A0444J6289M2381R9194l1149p8614J9036m4591j1954R166m4643P776J2672
$$ y = [56159, -20152, -11438, 56801, 84785, 52027, -19534, 42218, 101541, 82327, 91811, 153636, 202678, 184280, 171631, 126651, 40910, 46429, 81862, 80962, 49549, 11106, -1536, 55672, 112240, 123046, 100853, 114488, 79393, 86925, 102443, 91175, 92501, 114098, 147865, 125741, 112813, 105713, 60300, 66070, 154946, 165455, 140977, 127536, 104994, 91894, 86519, 75500, 87621, 60179, 41808, -3230, 29879, 66717, 37141, 22728, 20770, 45324, 90597, 74472, 79803, 99975, 101093, 65486, 38111, 24338, 9738, 18014, 59520, 108618, 120546, 59707, 65330, 134276, 92286, 77249, 75632, 131853, 156523, 102096, 79329, 61439, 52872, -17542, 10444, 26733, 69114, 168308, 137159, 58545, 77581, 32990, 21036, 30202, -14441, -6665, 6007]
11444F007P6876J8159k7078p479l8527n531O5833N2362j3769n4920K961J0737
11432H5631Q2306R120m0872k9785n3410p6932K5095P0785N9645K4865J6699n500
11420A67647o0888n4350L2505N386J320l4538m9567o0736k2200L1857O7384q927
11408A4893L66j5036l7431J7752R9218J1976j6013l1793J7229j1898k1649k469
11396B5145K27J878L9764P561N401K6520k6210L8559o1287n0014j4287K9620P7049
11383I9926M9952m3655n7621o9161m8903l9499m347K6210N4605K7890k052L3283
11371B6628k0473J1140K8519k8113J385j7110K660K1471N4538m6231l5274L9688
11359C8828K5368M2083o1255o0222L2689L0047L2691K0217L0980l6260j19758
$$ y = [6007, 82883, 101042, 73964, 66485, 27958, 22427, 88260, 140622, 126853, 71933, 74894, 85631, 167937, 177057, 136185, 106400, 52990, -23942, 1153, 71938, 131583, 156448, 173147, 167647, 106759, 52409, 84914, 90300, 91620, 57082, 7515, -53221, -75421, -43564, 23820, 14893, 15259, 223, -37208, -19456, 79762, 91738, 75725, 43932, 61161, 49263, 27614, 25145, 25372, 27250, 67014, 74575, 79976, 106496, 80286, 118845, 57558, 7544, -6743, 22877, 99926, 149878, 106223, 48602, -20559, -69462, -108961, -113308, -87098, -32493, -4603, -6655, 26628, 6155, 17295, 45814, 17701, 19086, 1976, 4636, 26107, 80645, 34414, -860, 38828, 64196, 106279, 45024, -15198, 17491, 47538, 80229, 100446, 131426, 95166, -24592]
11348b4592O902L2166P3146L7177l1039j3648j9549j4247m142O1478L9979m0318
11336A03313r2834m4364L4228N0534N7826L4827m2088n1036J1018J01330K9972
11325A92726j950q1735j4699l2694K7733J3471n6078j0301l2487L5896N0906P419
11313I8207k5315m064L631O7217j8730k7819n233n94m0817M0229k7153j9722j6581
11300B3256J2980L9713O245j592k027J0671m6299K1336j9948p3725K7528K8560
11288B6698n727N107k2406K2306L8180o0457q5035q465J9086Q5926J8479L2061
11276F5753J454l7633L747R157L607m035m2724N8039K1530n0928k188K4266l5321
11263A4724K2907k4594O117k035m1431l6788k6464l4272o725P7911J13241j5327
$$ y = [-24592, -17690, 14476, 87622, 124799, 93760, 80112, 60563, 46316, 42174, 103652, 143631, 103313, 10479, -33885, 343, 50877, 108703, 143530, 101442, 50406, 61424, 162754, 192726, 190776, 109041, 94342, 61648, 89381, 102852, 46774, 36473, 3986, 39882, 90788, 98207, 72892, 68828, 72459, 139676, 120946, 93127, 87894, 87300, 46483, 86712, 59559, 39837, 23256, 36236, 75949, 82194, 80602, 78575, 89246, 42947, 64283, 44335, -29390, -1862, 26698, 20971, 26078, 3672, 25978, 64158, 3701, -81334, -89799, -70713, 15213, 33692, 65753, 67207, 29574, 33321, 42478, 46085, 42050, -674, 57365, 78895, 27967, 25779, 50045, 14724, 37631, 13037, 19154, 17119, -24312, -61100, -87564, -121836, -128561, -50650, 62591, 47264]
11251D7264m4797P4577m503p6327r625J3646O0387J1727m3197N5068Q1403N5333
11239B20956l6990m2700m2548l4804K4186L9473J5278k7442l3010J5736N0999
11228A49134P2797k080j5835J907j6063J26328Q7874K7535n3719q6916m0123k7875
11216B22964r486k9914l2747J8167n418o7794k7512n1853K1944J5193K6048Q812
11204H8404m0555n659O1370j6542J8493o47m8612p549K5264Q3822N850l8159J4048
11191A39528n881r35q953K5545l31K147m0818q157L9180n7316j5700j4856O334
11178E9787J0759K1060n9005n2697M9772K7075R337J0671j3018o3381J7082L6710
11166E4152K2273J8548o271M465j3654m6265M29j7931n6825K6532L9552M1412
$$ y = [47264, 2467, 77044, 72541, -3786, -13411, 235, 60622, 72349, 29152, 84220, 165623, 220956, 183966, 141266, 98718, 63914, 88100, 127573, 142851, 115409, 82399, 98135, 149134, 221931, 219851, 204016, 205923, 189860, 316188, 404062, 431597, 377878, 290962, 250839, 222964, 213478, 183564, 150817, 168984, 163566, 95772, 68260, 16407, 38351, 53544, 79592, 88404, 47849, 42190, 103560, 87018, 105511, 104864, 56252, 48703, 73967, 157789, 163639, 125480, 139528, 133647, 132712, 123759, 149304, 148973, 151120, 110302, 102145, 141325, 84009, 68309, 53453, 59787, 70546, 91606, 32601, -20096, 29676, 56751, 66088, 76759, 63741, 360, 17442, 54152, 76425, 94973, 88702, 93167, 79513, 33248, 33677, 15746, -41079, -14547, 25005, 66417]
11154F6417L1437j546l5282l0015M332L2106k0365k2313k3306l348j4742m0505
11142e7130M2082N282K9290Q2931J000o2056M673O9793k8659q229q661j7629P221
11129E9908J3447k8938k0313k214K5142L5512J3292J0968j9502o7083L0779K2666
11117G3664P50N312K3028q7822l284K6548K4345K6353J8070N572l1348j05j297
11104G9786k0446L2726o6507l2436j0866O9247M5322K6834k5963O8621L3341m9937
11092A49722n3066j3236Q538r047k8284L8086R4094M508j2843m2758r4616j510
11080C9588O3152L115k7950l0093J4477J8062J3888m0308j2152L9685O1182l7498
11068A05148j8302J4451r1817L4362L9730M8797K3107J058J0812j3345o18K400
$$ y = [66417, 97854, 96308, 61026, 31011, 35343, 67449, 47084, 24771, 1465, -1883, -16625, -57130, -15048, -9766, 19524, 102455, 103455, 41399, 46072, 115865, 87206, 78977, 70316, 52687, 59908, 73355, 44417, 24104, 21890, 47032, 82544, 95836, 106804, 87302, 20219, 50998, 73664, 74414, 79726, 102754, 14932, 11648, 38196, 62541, 88894, 106964, 112536, 81188, 81083, 79786, 59340, 92066, 25559, -6877, -17743, 51504, 96826, 123660, 97697, 166318, 199659, 149722, 96656, 83420, 91958, 82911, 54627, 92713, 186807, 191315, 178472, 135714, 41098, 39588, 102740, 105855, 77905, 47812, 62289, 80351, 94239, 53931, 41779, 81464, 142646, 105148, 86846, 101297, 9480, 43842, 83572, 132369, 155476, 156534, 167346, 154001, 153383, 155783]
11056A55783n8441n5268N9558O1586K5281J1015r50O8315O4028j8314o226m7923
11044B58444K9065N5469j0731L86O5775O932l4519p7185k28M3808Q9409L4366
11032D60991K2957J3513l2069n7913O538K5906M0628K9997l1890K6059L9068j6126
11020E27659m3085o2873l6789J1775l7054R359J7584N5543J4451r507k6216o6753
11008C54094p664q306o1945j4184K2255l3667m6401j2437N4749n2561k9138J0179
10996A74974J5729L5185q536m2345M625K5192n5695r873N8909k3019p8919m1887
10984E4340M9700m3857M305M9769K2088n8912l8984k9612L8363P7038m6943o7775
10972I520m5251L18Q5150M5796M5561O1797O1925o099l9368n0019j4282k9143
$$ y = [155783, 97342, 42074, 101632, 163218, 188499, 199514, 198564, 266879, 330907, 312593, 306367, 258444, 287509, 342978, 332247, 332633, 398408, 405340, 370821, 293636, 293408, 337216, 426625, 460991, 483948, 497461, 465392, 407479, 414017, 439923, 480551, 510548, 478658, 504717, 543785, 527659, 484574, 421701, 384912, 396687, 359633, 368992, 386576, 442119, 456570, 447063, 420847, 354094, 346430, 338124, 276179, 261995, 284250, 250583, 204182, 191745, 246494, 193933, 164795, 174974, 190703, 225888, 217352, 175007, 179632, 204824, 149129, 139256, 198165, 175146, 96227, 54340, 104040, 60183, 64488, 114257, 136345, 77433, 38449, 8837, 47200, 124238, 77295, 9520, -35731, -35413, 49737, 95533, 141094, 202891, 264816, 258717, 219349, 169330, 155048, 125905]
10960A25905M91Q066l8302j2706N811N966L6426N4492j6913o3579k9444K7212
10948A03425K0751P0783k7461p2754k7255k5786J0416L5860o806K5076j1025k230
10936I2994m7237P773L376J9956K7510J4640M4751N9226O088K8368j2031j0217
10924B35197m7451m8661j9637k3106N6453Q1450j4082j01811q254L4336n3972
10913I0462R752Q2717R912j9646l6054J0039K3701m2O543l8681N4003K0528k8437
10900A84797o628n155J7115M4677m0706q352K3772n014J0977O150K5403J0093
10888B57129l1930K4963O8142l2934L8295q504l7508M5509L2163M6242j0364m0042
10876C51161M439r956P3518N2452J6494R6064o526k40J101j0240K9300P7516J11926
$$ y = [125905, 126396, 134462, 96160, 83454, 89265, 95231, 131657, 186149, 169236, 105657, 76213, 103425, 124176, 194959, 167498, 94744, 67489, 41703, 52119, 87979, 81173, 106249, 95224, 92994, 45757, 53530, 56906, 76862, 104372, 119012, 163763, 222989, 229077, 257445, 245414, 235197, 187746, 139085, 119448, 96342, 152795, 234245, 220163, 118352, 110098, 144434, 90462, 100214, 182931, 192843, 173197, 137143, 147182, 170883, 170841, 177384, 138703, 192706, 213234, 184797, 178169, 173014, 190129, 234806, 194100, 185748, 209520, 204506, 215483, 221633, 247036, 257129, 225199, 250162, 318304, 285370, 323665, 315161, 277653, 323162, 355325, 401567, 391203, 351161, 355600, 345644, 419162, 471614, 488108, 584172, 577646, 577406, 578507, 568267, 597567, 675083, 787009]
10863G87009J00645j3753j0008Q8980Q0831L0443N2889J20596J2015M7809J62770
10852A460226Q6593J16154J41508K07650J27546J21805K57874L26564L92468M23658
10842C662046M14617M28675O53655Q58683J049956J283259J715151K221853K666022
10833A4953917L095872L505638L767272L755875L468173L014911K323623J330731
10825C9216012K51889q34921j829985k615776l251488l536801l507237l165346
10817B0726347k792918k418072j939966j495737j113077q44445o16655m25491
10809I079986l03948j78498j65280q8960j66515k31229k59533k73723m19419n30774
10799F462107m34861l69104l99763m53763l61593l32868k74492k31026j76470
$$ y = [787009, 887654, 873901, 863893, 952873, 1033704, 1064147, 1117036, 1237632, 1249647, 1297456, 1460226, 1546819, 1662973, 1804481, 2012131, 2139677, 2261482, 2519356, 2845920, 3238388, 3662046, 4076663, 4505338, 5158993, 6017676, 7067632, 8350891, 10066042, 12287895, 14953917, 18049789, 21555427, 25322699, 29078574, 32546747, 35561658, 37885281, 39216012, 39467901, 38632980, 36802995, 34187219, 30935731, 27398930, 23891693, 20726347, 17933429, 15515357, 13575391, 12079654, 10966577, 10122132, 9505477, 9079986, 8776038, 8597540, 8432260, 8343300, 8176785, 7945556, 7686023, 7412300, 6992881, 6462107, 6027246, 5658142, 5258379, 4804616, 4443023, 4110155, 3835663, 3604637, 3428167]
10790C428167r4126q0661j74831j92249j02004k224m3962o2173p4472L878l9549
10779B565794J2725M0023O1132J68944J72965J44036J85760J20551Q8322P6647
10769C636899P7199p938j5426j47011k35741k48404k72585k65210k45615k63325
10759B012843j35881p8776j21552j39624o6202R633o4939p4616m7440k8304o5490
10748A199652p6049k6115m307P343K105j9206n967J8743p925m8731l7061j1189
10736I91293j08952n2665j264k0296m1233k2288Q358O1484o294n2108K721k6187
10724G32569J1095J2414n6596J8018R482p3987l952k4420p4349O293M933l0265
10712E31235J3672M0434j4045j8479o0550J2103M0245K5517L7073o6713n6949
$$ y = [3428167, 3334041, 3253380, 3078549, 2886300, 2784296, 2782072, 2738110, 2675937, 2601465, 2605343, 2565794, 2578519, 2618542, 2679674, 2848618, 3021583, 3165619, 3351379, 3471930, 3560252, 3636899, 3714098, 3706160, 3690734, 3543723, 3307982, 3059578, 2786993, 2521783, 2276168, 2012843, 1876962, 1798186, 1676634, 1537010, 1470808, 1480441, 1415502, 1340886, 1293446, 1265142, 1199652, 1123603, 1097488, 1093181, 1100524, 1102629, 1083423, 1077456, 1096199, 1088274, 1039543, 1002482, 991293, 882341, 829676, 828412, 808116, 766883, 744595, 752953, 814437, 808143, 756035, 758756, 732569, 743664, 756078, 699482, 717500, 726982, 652995, 649043, 624623, 550274, 556567, 561500, 531235, 544907, 585341, 571296, 552817, 492267, 504370, 544615, 570132, 607205, 540492, 483543]
10701D83543J8705N9108l6674m280Q476q76m917q317j7110n6954L088K1196J2331
10688D77319k6397j1317K3828k1223P498K4324j3572n3314J402L8852k1931j8834
10676D06635k7123R2359N2649M255j26L9385j5406K3983J19045Q6253L1088J1423
10664H24420K7036l1086k5056j128M5468K8524L0628J7564R7054K4956M4547P4395
10652A157322n001l6615M6057M5098j3805l6099l763K1157O0994L0113R8164J94874
10640A558496J73696J94831L01526L30260J74880K10256L07991K89793K03964
10631C745693K13153J44725J33731K46995L48204N72133P62357J013732J404207
10622H584930J891460K340867K616748K659650K367927K102922K061011J832746
$$ y = [483543, 502248, 561356, 524682, 520402, 528878, 528002, 523085, 514768, 497658, 440704, 443792, 464988, 477319, 450922, 439605, 463433, 442210, 449708, 474032, 460460, 407146, 408548, 447400, 425469, 406635, 379512, 471871, 524520, 528775, 528649, 568034, 552628, 576611, 695656, 781909, 812997, 824420, 851456, 820370, 795314, 794186, 839654, 868178, 898806, 916370, 1013424, 1038380, 1082927, 1157322, 1152321, 1115706, 1161763, 1206861, 1193056, 1156957, 1153194, 1174351, 1235345, 1265458, 1363622, 1558496, 1732192, 1927023, 2228549, 2558809, 2733689, 2943945, 3251936, 3541729, 3745693, 3958846, 4103571, 4237302, 4484297, 4832501, 5404634, 6166991, 7180723, 8584930, 10476390, 12817257, 15434005, 18093655, 20461582, 22564504, 24625515, 26458261]
10614B6458261J224316N06817L01580J110997K352706L654831M397128M164058
10606D4170694L717582L434204L289162K437211N67266j436030k138298q74341
10598E3167450J576016L866682M834337M459697L734504L345859K712495J091656
10590G8788696j941485n275113o547207n104418k433982j08356J073588J092030
10582E9543753P54815N98245K60267r88114l029797n170449n789600m658671k957595
10573C8562854j572342q23733o47993o35540p18133r94182j578852k431803l176301
10564B5983975l433803l034337k481737j879013j395856j207085r21175o60654
10556A0970315o13991n20009l95258l84442l75971l17239k74846k92328k89605
$$ y = [26458261, 27682577, 28189394, 28490974, 29601971, 31954677, 35609508, 40006636, 44170694, 47888276, 51322480, 54611642, 57048853, 57616119, 56180089, 54041791, 53167450, 54743466, 58610148, 63444485, 67904182, 71638686, 74984545, 77697040, 78788696, 76847211, 71572098, 65024891, 59920473, 57486491, 57378135, 58451723, 59543753, 60298568, 60896813, 61157080, 60168966, 57139169, 51968720, 46179120, 41520449, 38562854, 36990512, 36166779, 35518786, 34883246, 34165113, 33170931, 31592079, 29160276, 25983975, 22550172, 19515835, 17034098, 15155085, 13759229, 12552144, 11630969, 10970315, 10356324, 9836315, 9441057, 9056615, 8680644, 8363405, 8088559, 7796231, 7506626]
10547G506626k60894k61874k48336k07923j70601j62195q0659j51838j39917j46234
10537E676155j26890j34344k1263n904q3204q5585n0140l4177p5435j13248o8842
10526D877123m6987j59443k03361j28425j69033j33110j21722j47326j33333j38834
10516C495549r1158q767j8308m2715o4143j23103j13246n7186j9045p0137o5129
10505B822612q8287r8264j5392j03682j14398j20011k3309O4290J7405m2995k3445
10494B274524M786l688j3633k3048o3244l9933l8128J0065l4255k0355l0623k2214
10482B000254l8689q578J405N3261J7121l4698o6234n0733K9982J0462K5563m1385
10470A897731L0518L0591M6161M6149k461L179L3997M9755K2220L6263j5112k5682
$$ y = [7506626, 7245732, 6983858, 6735522, 6527599, 6356998, 6194803, 6114144, 5962306, 5822389, 5676155, 5549265, 5414921, 5393658, 5387754, 5304550, 5218965, 5168825, 5134648, 5059213, 4945965, 4877123, 4830136, 4670693, 4467332, 4338907, 4169874, 4036764, 3915042, 3767716, 3634383, 3495549, 3404391, 3395624, 3377316, 3334601, 3270458, 3147355, 3034109, 2976923, 2957878, 2887741, 2822612, 2734325, 2636061, 2620669, 2516987, 2402589, 2282578, 2259269, 2323559, 2340964, 2297969, 2274524, 2279310, 2275622, 2261989, 2238941, 2175697, 2135764, 2097636, 2107701, 2073446, 2053091, 2022468, 2000254, 1961565, 1952987, 1954392, 2007653, 2024774, 1990076, 1923842, 1873109, 1903091, 1913553, 1939116, 1897731, 1928249, 1958840, 2005001, 2051150, 2048689, 2051868, 2085865, 2135620, 2157840, 2194103, 2178991, 2153309]
10458B153309R65L3845L9720Q5790J0764M8705J46415Q0368J21122J23019J13924
10447B957946J09050J26225J71828K63998K73117L00023K27943K15687K68155
10438D913972L73389M43226M75955N17372O37460P54053R46763J168168J386142
10429A1616500J554901J738158J965498K148345K213930K516217K948537L599317
10421C0301403M732462O557109R472454J4049257J9987138K6621816L3268437
10414A44990076L9649190M5322080M9316847M9847045M5205105L6428800K4667888
10407D35427031J0857871m342531j9548161l3233897m2666919m6612577m6221807
10400B53659010m3232578l7967115l1689188k4836750j7472846j1826866q299871
$$ y = [2153309, 2154274, 2188119, 2227839, 2313629, 2324393, 2373098, 2519513, 2599881, 2721003, 2844022, 2957946, 3066996, 3193221, 3365049, 3629047, 3902164, 4202187, 4430130, 4645817, 4913972, 5287361, 5730587, 6206542, 6723914, 7361374, 8115427, 9062190, 10230358, 11616500, 13171401, 14909559, 16875057, 19023402, 21237332, 23753549, 26702086, 30301403, 35033865, 41590974, 51063428, 65112685, 85099823, 111721639, 144990076, 184639266, 229961346, 279278193, 329125238, 374330343, 410759143, 435427031, 446284902, 441942371, 422394210, 389160313, 346493394, 299880817, 253659010, 210426432, 172459317, 140770129, 115933379, 98460533, 86633667, 78333796]
10393G8333796o182401m838149m016782l539701l241674l062657k893756k804536
10385D7754140k782956k701596k481918k276754k097032j976061j784670j633714
10377C0019439j466586j261228j213313j158861j079121j018601r26325p88933
10369B1106471p19982p04395o43361o78434o75532n68858n81184n90905n06791
10360A5437029m79763m79052m59543m53051m47720l97265l35213l13052l00295
10351A1772075l43905k94991l14583k90831l26293k72314k34962j70569j86492
10342I337135k56917k52649k52240l13800k07878j35823j82641k20344k10506
10333G304337j54374j71572k18489k13213j90562j47140j32991k06437k54694
$$ y = [78333796, 72151395, 67313246, 63296464, 59756763, 56515089, 53452432, 50558676, 47754140, 44971184, 42269588, 39787670, 37510916, 35413884, 33437823, 31653153, 30019439, 28552853, 27291625, 26078312, 24919451, 23840330, 22821729, 21895404, 21106471, 20386489, 19682094, 19038733, 18360299, 17684767, 17115909, 16534725, 15943820, 15437029, 14957266, 14478214, 14018671, 13565620, 13117900, 12720635, 12385422, 12072370, 11772075, 11428170, 11133179, 10818596, 10527765, 10201472, 9929158, 9694196, 9523627, 9337135, 9080218, 8827569, 8575329, 8261529, 8053651, 7917828, 7735187, 7514843, 7304337, 7149963, 6978391, 6759902, 6546689, 6356127, 6208987, 6075996, 5869559, 5614865]
10324E614865j68257j10581j69532j50356j18318j26625j26849j69098j00369
10315D374880j5608n8583p5128j16739j01789j67907j30616q5235j9896l0044
10305C573335j03710m7160j30518r5128l9132j11329q7518O563j053m3915m888
10294B915547k2084n6903o702o003R746k9008L2122M1103l0099K2895k3965K9780
10282B876429R6761K9794k8913k5010p3711r6352p6006q6516p1802q6937j55749
10271B301988j34956j59755j42434j34089j24793r5880o9969n6948Q42j7618j6000
10260A350388N1503K8731K564k5805M7729k2589j08223j09187p0665J8K836o6985
10248A080315r3715j07308o1271k018J3816K2362k84j8944k0366J5159R191m0342
$$ y = [5614865, 5446608, 5336027, 5166495, 5016139, 4897821, 4771196, 4644347, 4475249, 4374880, 4359272, 4300689, 4225561, 4108822, 4007033, 3839126, 3708510, 3623275, 3603379, 3573335, 3469625, 3422465, 3291947, 3196819, 3157687, 3046358, 2958840, 2965403, 2964350, 2920435, 2915547, 2893463, 2836560, 2829858, 2823855, 2833601, 2804593, 2836715, 2877818, 2847719, 2870614, 2846649, 2876429, 2973190, 3002984, 2974071, 2949061, 2875350, 2778998, 2702992, 2616476, 2544674, 2457737, 2301988, 2167032, 2007277, 1864843, 1730754, 1605961, 1510081, 1440112, 1383164, 1384006, 1366388, 1350388, 1401891, 1430622, 1433186, 1407381, 1455110, 1432521, 1324298, 1215111, 1144446, 1144464, 1147300, 1080315, 986600, 879292, 818021, 816003, 829819, 852181, 851897, 832953, 812587, 827746, 836937, 796595]
10236G96595J6614L311o5182n7125l1854k7131M2379l7163n2688j087L1570K5083
10224F43322M6454O6790M4861L851L0920J6208l9141l7566j5830k9852k0198n4717
10212F55102r9159k2853M8832N7203J1057J6192m4672p8726m0355j180J9589m5224
10200D75806K9563j963K9369J7532q1067Q207q786n0153j2521K3771j8882K1744
10188D32620O7243p9122j9833J863N2891Q02j2396l6124L3587L8863M7779j3550
10176E14623j1332l5292k8215M1930J01635O1384m8329j890M2654N5363M342n6767
10164F40106P6644M4326k8034k8835K9045N1619O28K4304L4688N842m5351l4515
10152G70467n3647j00423l6799j4320l1709K2341p227N76l1646J6416L6708J609
$$ y = [796595, 813209, 816520, 751338, 694213, 662359, 635228, 677607, 640444, 587756, 586669, 618239, 643322, 689776, 756566, 801427, 805278, 836198, 852406, 813265, 775699, 759869, 730017, 709819, 655102, 555943, 533090, 581922, 639125, 650182, 666374, 621702, 542976, 502621, 501441, 521030, 475806, 505369, 503406, 532775, 550307, 469240, 477447, 468661, 418508, 405987, 429758, 410876, 432620, 499863, 420741, 400908, 402771, 455662, 456464, 444068, 407944, 441531, 480394, 528173, 514623, 503291, 467999, 439784, 481714, 583349, 644733, 596404, 594514, 637168, 692531, 696873, 640106, 716750, 761076, 733042, 704207, 733252, 784871, 785499, 809803, 844491, 850333, 804982, 770467, 716820, 616397, 579598, 565278, 533569, 555910, 548683, 549259, 517613, 534029, 570737, 572346]
10140E72346q5996n1907o174O609K064m4297j6071o840J4807K8962J268K4684
10128D39455J1417j27403o9893n6452J5565P0202o3612m5100o378N7448R246K4675
10116B59170K0488l9023j4272j3056q9481N283L0321k8391J9139m746j494l5239
10104A08699l0456j5752j1546K6968M3761m258K4837M7254M1153n8743J4253n1615
10092A34555l9133K9669j825n6309P587M0216K6271k52p49N5492M3256m6930j3582
10079A78266L6928K317L950l3393j3116m4284k291j0768p518O8819R230n0145
10067A37995N694j6651n5724M144J9550j4338n009P665L2799k0993k5457k8362
10055D1313J7117L1940l831N661L7865N4452k8980j18066p2393K7857j3780K1086
$$ y = [572346, 486350, 434443, 428269, 434878, 436942, 392645, 376574, 369734, 384541, 413503, 414771, 439455, 450872, 323469, 253576, 197124, 212689, 282891, 219279, 174179, 167801, 225249, 234495, 259170, 279658, 240635, 226363, 213307, 123826, 129109, 159430, 131039, 150178, 145432, 143938, 108699, 78243, 62491, 50945, 77913, 121674, 117416, 142253, 189507, 230660, 171917, 186170, 134555, 95422, 125091, 123266, 66957, 74544, 114760, 141031, 140779, 140030, 195522, 238778, 191848, 178266, 215194, 217511, 221461, 188068, 174952, 130668, 128377, 117609, 110091, 178910, 188140, 137995, 143689, 127038, 71314, 75458, 95008, 80670, 75661, 83326, 116125, 95132, 69675, 41313, 58430, 90370, 86539, 92200, 130065, 184517, 155537, 37471, -34922, -7065, -20845, 241]
10043B41O6136Q0103k2206n7118n801K0477m5850J0356M4675K8702P37J530K1578
10030A43560R573K8336J3624o5112M127K2040M0351N4427l3952l4082K4810M9206
10018B56908O6254Q2004J28890J58099J37464J86694J95178K26177K53197K48347
10008A939212K12810J17896J26158M3015r5997j74317k05751k62615k31640k65432
9998A203339k42880r3245p6031k01373j5712K7241p5477p8965n4029j2484l3436
9987C46948j0902r5721N3094N2107j5598m4522o3919k095M5269m6064n9465O600
9975A65732K3530m943k9516n7796Q333N705k6026l3733j8745O953L1533L092j2382
9962F1737J4707O508m580L917q658J6113n3208N158K6683k222j6859n3306l585
$$ y = [241, 66377, 146480, 124274, 67156, 61355, 81832, 35982, 46338, 91013, 119715, 120452, 121982, 143560, 153133, 181469, 195093, 129981, 134108, 156148, 196499, 250926, 216974, 182892, 207702, 256908, 323162, 405166, 534056, 692155, 829619, 1016313, 1211491, 1437668, 1690865, 1939212, 2152022, 2269918, 2396076, 2439091, 2343094, 2168777, 1963026, 1700411, 1468771, 1203339, 960459, 867214, 791183, 589810, 574098, 601339, 525862, 446897, 392868, 380384, 346948, 336046, 240325, 293419, 345526, 329928, 285406, 221487, 219392, 264661, 218597, 159132, 165732, 189262, 184319, 154803, 97007, 105340, 111045, 85019, 51286, 32541, 39494, 71027, 74119, 61737, 76444, 82952, 78372, 82289, 73631, 89744, 36536, 41694, 68377, 66155, 49296, -4010, -7595]
9949g595J8529k2802N079K5610P014j3603J1464L6372q210n6499K3886Q5952R7913
9936B03110O410n5333P006K4457l2338j9896J2814M1256k0608o3554m3207K2170
9924H2287M1094J3692k8580K0732K4040l0697k4544j0740l5349l2365l687K0218
9912C6101O0753P958n3567k0258K4268L1636O63k3828j2572o8756l4232k9009
9900h0843J3684j1204J2656m741K0057M807j3192J7145L4396j3041m6143k3256
9888h9675N4755K3075N0273q17L6499M0943N515r8371q3269L3786N9689N6089
9876H8492L4116L0653l2342n0331k8760J3355m382j6656M6524K9629l5064Q332
9864H3566J2084L2921Q818o8233m0660k517K9838N5581l5987m6881M3695L2861
$$ y = [-7595, 10934, -11868, -6789, 18821, 25835, 12232, 23696, 60068, 51858, -4641, 19245, 105197, 203110, 209520, 154187, 161193, 185650, 153312, 133416, 146230, 187486, 166878, 103324, 60117, 82287, 123381, 137073, 108493, 129225, 153265, 122568, 98024, 87284, 51935, 19570, 15883, 36101, 96854, 104812, 51245, 30987, 55255, 86891, 87554, 63726, 51154, -17602, -51834, -80843, -67159, -78363, -65707, -70448, -50391, -45584, -58776, -41631, -7235, -20276, -66419, -89675, -34920, -11845, 38428, 37611, 74110, 115053, 120568, 22197, -61072, -27286, 32403, 88492, 122608, 153261, 120919, 70588, 41828, 55183, 50801, 34145, 80669, 110298, 75234, 83566, 95650, 128571, 137389, 69156, 28496, 25979, 55817, 111398, 75411, 28530, 72225, 105086]
9852A05086l1423j7323K8553k5109l2622Q1741K7125n9976K940J4300J3821j9801
9840H7312l8267k068K873m077m948J6373j0865N2090J596j7603l717M5436l9869
9827H4266l6577j0548K2921k8084k1331j9185N227j0324Q670M8757P841k8529
9815B3104p932J6792J9449K9344l0459j153j7258l6317j7214J0083j6614j506
9803b9681o893M5217k8110J5980J7749P231K578N459L6100l0467r1245K2201K5866
9790h015Q5027k5123l7247n4523L3500O1742J9919j3153l3993j8295N1639L9936
9778A01414m8194k8576q221J654j8464l0996l1549J0045L844j5763L0327L8280
9766C801k4398O6778K4736j6772j6784j2205k8575K1790r961J1067L8694j5236
$$ y = [105086, 73663, 56340, 84893, 59784, 27162, 108903, 136028, 76052, 78992, 93292, 107113, 87312, 49045, 46977, 49850, 45773, 40825, 57198, 46333, 98423, 100019, 82416, 78699, 124135, 84266, 47689, 37141, 60062, 31978, 10647, -8538, -3311, -13635, -4965, 43792, 51633, 23104, 15172, 31964, 51413, 80757, 50298, 49145, 31887, -4430, -21644, -11561, -28175, -29681, -36574, 8643, -19467, -3487, 14262, 21493, 24071, 29530, 65630, 35163, -56082, -33881, -8015, 77012, 51889, 14642, -39881, -6381, 55361, 75280, 62127, 28134, 9839, 61478, 101414, 53220, 24644, 16423, 18077, -387, -31383, -62932, -52887, -49043, -64806, -34479, 3801, -20597, 46181, 70917, 54145, 37361, 25156, -3419, 18371, 8410, 19477, 58171, 42935]
9754D2935j8345L41k5007p34K6407O1752L9034L9843k3486m0416n0634j3610q6752
9741d8672N5993K6972K056N953j9057J7096Q043o2385P1961N060l4077m7746l8012
9728e6815q1615j7151P3515q706K4057O6629Q9245k875p9599l8171K4836k5777
9716c2427K3098N7608m7468k0702k8083M7510J8208O3892p802l0637J7154k8364
9704C1987L0580J0669l2857K2400M8791k5718o1328L6716L5543p1542J908K0664
9692D7813o1928l7699p2046O2258M3882j0766L6008K5047k7684K3203L9298R892
9680G7278J7969k7963n5099l3446o767J9051K7110L1486M2525j906n7590l8748
9668f100m81P3759K2202j7241j1884P2681M464M8298P9884L8969K3459r4033k1464
$$ y = [42935, 24590, 24931, -76, -810, 25597, 87349, 126383, 166226, 142740, 102324, 51690, 38080, -48672, 7321, 34293, 36349, 42302, 23245, 40341, 48384, -14001, 57960, 63020, 28943, -18803, -56815, -138430, -155581, -82066, -90772, -66715, -86, 89159, 86284, 6685, -31486, -6650, -32427, -9329, 48279, 811, -19891, -47974, -464, 17744, 81636, 73834, 43197, 60351, 31987, 62567, 73236, 40379, 62779, 111570, 85852, 24524, 61240, 96783, 25241, 27149, 47813, -14115, -51814, -123860, -61602, -17720, -28486, 7522, 32569, 4885, 28088, 67386, 77278, 95247, 67284, 12185, -21261, -28028, -8977, 18133, 49619, 92144, 90238, 32648, -6100, -6581, 67178, 89380, 72139, 60255, 132936, 137400, 185698, 265582, 304551, 328010, 233977, 212513]
9655B12513K5653m0846l7038k8253m8878o0697l7256m9218L7577O2846O0415m8091
9643D8727l9817K0000L0299P427n4710l0681o5153j7730P3757O7724l0027j6582
9631f766O322k0496j863P7807J1545j6713M3177P087r826k1215l7282l5482J1210
9618G505l900J0671N029O0146K6628n895l6624J1568K135m1712j3433M3254o0768
9605D604j7751N1532M2911k0268k6027o1875n541k081j1332J2393r837Q877M0519
9592F124j4053k0598n1803K092j2820r703R0468J4728K5279K2081j3798o390m258
9579B7349J8801j0865n2949m1798K4801K7485N2536j2497k798K8075P572j5620
9567E0092q5129o018J3638j235l9878m8632M5348j439j9376l763R9185r814n9914
$$ y = [212513, 238166, 197320, 160282, 132029, 83151, 22454, -14802, -64020, -26443, 36403, 96818, 48727, 8910, 28910, 59209, 66636, 11926, -18755, -83908, -101638, -27881, 39843, 9816, -6766, -444, -20940, -22803, 55004, 66549, 49836, 93013, 100100, 90274, 69059, 31777, -3705, 7505, 3605, 14276, 19305, 79451, 106079, 100184, 63560, 75128, 77263, 35551, 22118, 65372, 4604, -13147, 38385, 81296, 61028, 35001, -26874, -32415, -34496, -45828, -33435, -43272, -34395, 6124, -7929, -28527, -80330, -78238, -91058, -100761, -10293, 4435, 29714, 51795, 37997, 31607, 27349, 46150, 35285, -17664, -59462, -34661, -7176, 45360, 32863, 30065, 58140, 65712, 50092, -35037, -41055, -27417, -28652, -68530, -117162, -71814, -73253, -92629, -96392, 2793, -7021, -66935]
9554f6935J6781K5473M2195m28p249J844k1113j7682K9694n130j5922L184M9028
9541C3740K9242o483j9599J398J214j4635N1386K3645n6824q4774k5650K6315
9529d1025J8571K273L4426K4142O645J7803L4k9434o8689l9478l284r281M053
9516h3244m8383n6652J7943L8468K8468N2775m388k653K7118J7207m6797o6809
9504a26947m0651J2882L0939L1953n626k3509m516J6552K7744L0832J7248l1833
9492f4932l485K7390J00921J847p2473Q101L4330j0647J0020O171o3740o5588
9480i2085J1440O895j8503K0696L4912L8776k7734L7337M7647j7942J3413K988
9468E7840p2776J212L2828l532O250K0924l982p7523p0468K4252K5910M1220P4649
$$ y = [-66935, -50154, -24681, 17514, 17086, 9837, 11681, -9432, -27114, 2580, -2550, -18472, -15288, 33740, 62982, 56499, 36900, 38298, 39512, 24877, 76263, 99908, 43084, -41690, -67340, -41025, -22454, -20181, 14245, 38387, 45032, 62835, 62869, 33435, -35254, -74732, -78016, -87297, -83244, -131627, -188279, -170336, -131868, -103400, -50625, -55013, -57666, -30548, -13341, -60138, -126947, -167598, -154716, -123777, -91824, -97450, -120959, -125475, -108923, -81179, -50347, -33099, -64932, -68417, -41027, 59894, 61741, -10732, -2631, 31699, 21052, 31072, 37243, -26497, -92085, -80645, -73750, -92253, -71557, -36645, 2131, -25603, 11734, 59381, 41439, 54852, 57840, -14936, -13724, 19104, 15572, 21822, 42746, 38764, -38759, -109227, -84975, -59065, -17845, 56804]
9455E6804L4650j9339N122J3212k3888l6625Q991M1289m2381n4486l8363k916
9443e7930N2980Q1658k4130N922r7692n5087L1144N5794J7237j7668l1409j0549
9431d9730k3411J7662k3159L6022K5716n014q406m3271o2005K8735P1709N6415
9419B1263L7959k7171n7083N9818O0557L9618k5322j162n3566j7782o2986n0391
9407g6248O6254M3185q586n9269m7880L6872R5392P4301k7856o5678n0871N7084
9395C6700N3468k7731N888O0923l6827l3433j9111J8365P328k7306j6470J1875
9383C3669N1888l4735q5087N8175L3750o8089m4352J7623K7981k137j6230J4950
9371a2594k6698N5332K196L5477J5588K471J6976m2262m2583k1882L692J4598
$$ y = [56804, 91454, 72115, 77237, 90449, 66561, 29936, 38927, 80216, 37835, -16651, -55014, -57930, -4950, 76708, 52578, 58500, -39192, -94279, -63135, -7341, 9896, -7772, -39181, -49730, -73141, -55479, -78638, -42616, -16900, -21914, -30320, -73591, -135596, -106861, -35152, 21263, 59222, 32051, -25032, 34786, 95343, 134961, 109639, 108477, 54911, 37129, -25857, -76248, -9994, 33191, 24605, -34664, -82544, -45672, 49720, 124021, 96165, 30487, -20384, 36700, 90168, 62437, 68325, 129248, 92421, 58988, 39877, 58242, 65570, 38264, 21794, 33669, 85557, 50822, -34265, 23910, 57660, -10429, -54781, -37158, -9177, -11314, -27544, -12594, -39292, 16040, 18236, 53713, 69301, 71772, 88748, 46486, 3903, -17979, -14287, 311]
9359C11j6189o0858K8241J2683K6394N6284q803m543m0332j6422L3981L0341m8778
9346g690n3886L5144M2249l0303m9629N5249K8804O3898J2940r7712j16328K4563
9334i2701L7412O8342O6821o868n0631l2604O710l3345l0644K1040P0583n776
9322A8339l3974m4000J8355N2776j6619J534Q36n2699J4833P0755j2841l8476
9310b1181m055J5770j2308L3713j0861N361o7903m1256j4410K2100J04828J3814
9298B3612L6357J71l6960k1047J9486j9643J0579L1895k8246o6276j7685n452
9286g3209K5344Q090K8067j9348J9442P190Q5529N0652o6028n0401J5238L8191
9274F8757K6394p8502J5130o466K654j8234L278J1282M9629k3399l5482l5681
$$ y = [311, -15878, -76736, -48495, -35812, -9418, 46866, 38063, 33520, -6812, -23234, 10747, 41088, -7690, -61576, -26432, 15817, -14486, -64115, -8866, 19938, 83836, 96776, -936, -117264, -92701, -55289, 13053, 79874, 73006, 22375, -10229, -3519, -36864, -67508, -46468, 24115, 18339, -15635, -59635, -41280, 11496, -5123, -3589, -2753, -55452, -40619, 30136, 17295, -21181, -25236, -9466, -21774, 11939, 1078, 6439, -61464, -102720, -117130, -95030, 9798, 23612, 59969, 60140, 23180, 2133, 21619, 1976, 12555, 44450, 16204, -50072, -67757, -73209, -47865, -39775, -11708, -31056, -11614, -4424, 81105, 131757, 65729, 15328, 30566, 68757, 95151, 16649, 31779, 25313, 27967, 9733, 13011, 24293, 73922, 50523, 15041, -20640]
9262b0640J741L1184K7079M954n8553j767K0367j3834n7714J1873M815M1246R3176
9249H3927O4381o6815p5699L2343M2327J5114m2491k6946J1126J1455l4860m059
9237I803k8037j0600m6700O9647L8793K1225K6878l8960p5118K0290j0160o4710
9225h7649k657m6635J930M4175K2599j1064O9633O500J5050K6971n03m5696P610
9212B64L2696K4448k3915k1153n569J539P81O641l58k0126K1470J7050j5422K1509
9198C9855K7185j0802l2490n5727M7150L0520k5069l2617l2077M0077O5258J271
9186F2534m3404Q269J9522l2689P246J7011p0471l9280o80K2426p380M2210J9130
9173D444k7558L642R19j4959j2451J3538j9042K8525K5242J8167k5811k867L5181
$$ y = [-20640, -18899, 12285, 39364, 44318, -14235, -16002, 4365, -9469, -67183, -55310, -50495, -9249, 83927, 148308, 81493, 5794, 38137, 80464, 95578, 53087, 26141, 37267, 48722, 13862, 9803, -18234, -28834, -75534, -5887, 32906, 54131, 81009, 42049, -33069, -12779, -22939, -87649, -90306, -136941, -135011, -90836, -68237, -79301, -9668, -3168, 11882, 38853, 38350, -7346, 264, 32960, 57408, 33493, 12340, 6771, 8310, 9091, 15732, 15374, -4752, 16718, 33768, 18346, 39855, 67040, 56238, 23748, -31979, 15171, 45691, 20622, -11995, -44072, -3995, 61263, 62534, 19130, 27399, 46921, 14232, 21478, 38489, -31982, -71262, -71942, -49516, -56896, -14686, 4444, -23114, -19472, -18553, -33512, -45963, -32425, -51467, -22942, 2300, 20467, -5344, -8211, 26970]
9160B6970j6093m8264k5534K8853m5329P042o141l4258n6406j8299L2537J03003
9148e1919K5217L887j0316K8806J9508O6290j0177l0793J60m3820k338j3325J4653
9135d167J9355J4489M6756n1471K1104Q264L6705l6696M788n952l2929J2160k25
9122C2181m2413J7970K7468k3172l0100M7113j3207k9250K4450K0662j9830m2595
9110c0723J8315J1105M4613K6438o1943L8412N6234l5549k8784K4702j6940m3798
9098B082q5232j858r773J7568L1716m047n413r650k5010R790M1237l644M0273
9085a961j3223m0827k8733J7821J6416l0245Q102R117l8005N505P6169K1286R200
9072A0622j4068m888k9903l7705K4955j157k3888j1034M1957k00K0475K4107J3051
$$ y = [26970, 10877, -37387, -62921, -34068, -79397, -72355, -78496, -112754, -169160, -187459, -154922, -51919, -26702, -22815, -33131, -4325, 15183, 81473, 71296, 40503, 40663, -3157, -5495, -18820, -4167, 15188, 29677, 76433, 24962, 46066, 54330, 91035, 54339, 59127, 53175, 20246, 32406, 32181, -10232, 7738, 35206, 12034, -18066, 29047, 15840, -13410, 11040, 31702, 11872, -30723, -12408, -1303, 43310, 69748, 7805, 46217, 102451, 66902, 38118, 62820, 45880, 2082, -83150, -85008, -94781, -77213, -45497, -49544, -54957, -64607, -89617, -79827, -38590, -42234, -1961, -15184, -56011, -84744, -66923, -50507, -80752, -72650, -63533, -101538, -96033, -19864, 1422, 10622, -3446, -8334, -38237, -75942, -50987, -52144, -76032, -87066, -45109, -45309, -24834, -727, 12324]
9059A2324L4325J5582j4631m5757K0870l1007n1090K6221R3583j9073J6340L2840
9047I0527l7343q191O7145L7376J9057n1172J1318m5429k9143L9881L6214q9569
9035D0671m163N1627L7344j5769l1496L7712N2413j7189p7243j0904j6548r3719
9023d7264J117K94O3160k01k0337j391l0974o4510k5140J2312J5392r014L1779
9010g4777l490M6100N4076j6533m6924N809j9713J1167M7051O0989J2224m7914
8998B8065P476l916m1634k5460j0096j0297P498M7232K274p404N4789j9656k1053
8985G818J4134J6671L9111m2193l5466r624O09L4204K5563q032j8173l9270j4693
8972b9341N9627l5953J8381R2924L0621r8457n4839R171J0024l8643L1760Q6579
$$ y = [12324, 46649, 62231, 47600, 1843, 22713, -8294, -59384, -33163, 60420, 41347, 57687, 90527, 53184, 44993, 112138, 149514, 168571, 117399, 128717, 83288, 54145, 94026, 130240, 40671, 36508, 88135, 125479, 109710, 78214, 115926, 168339, 151150, 73907, 63003, 46455, -47264, -46147, -45853, 17307, 17106, -3231, -4622, -35596, -100106, -125246, -112934, -97542, -106556, -74777, -78267, -32167, 21909, 5376, -41548, -35739, -55452, -44285, 2766, 63755, 75979, 28065, 35541, 31625, -10009, -35469, -45565, -55862, -48364, -1132, 1142, -6262, 48527, 28871, 7818, 21952, 38623, 77734, 35541, 75, -9549, -8940, 25264, 50827, 42795, 24622, -14648, -29341, 30286, -5667, 12714, 105638, 136259, 37802, -17037, -7866, 2158, -36485, -4725, 81854]
8960H1854l6441n4584p394N15O9150L2717l7220m8231l1107L2031n745J5474M088
8947A5107J5545J135J0830n7458M6740N8896j2163J1725j601J1084j0860R027
8935I8007l8643o0973K6097M923m0159m4362p787k1360k0028P946Q65O417L9464
8922d9593K5333j578J2424O7224n595P10K5381k4202l7109K529o3467l6235J8486
8909f5692N1821L5163l0168j1466L5589l0784k6938K2023K1521n0275l1318o2913
8897a43437P9294j1421q473k1962K3218Q1797N4202j050r301J4643j8548o4034
8885b5072J3519L1764M790J3455N7617l3425l8252n5042M5082J5737n5960q553
8873c4340J5863N6366K8653k9157J5835O660p86j5029l5648o348j9015j3313K5937
$$ y = [81854, 45413, -9171, -16565, -16050, 53100, 85817, 48597, 366, -30741, 1290, -4455, 11019, 15107, 30652, 31787, 42617, -14841, 31899, 90795, 78632, 90357, 88756, 99840, 88980, 98007, 59364, -1609, 24488, 29411, -10748, -55110, -62897, -84257, -104285, -96339, -95474, -89057, -49593, -24260, -25838, -13414, 53810, 48215, 48925, 74306, 50104, 12995, 15524, -47943, -84178, -65692, -13871, 21292, -8876, -20342, 15247, -15537, -42475, -20452, 1069, -49206, -80524, -143437, -64143, -75564, -84037, -105999, -82781, -984, 53218, 52168, 42867, 57510, 38962, -25072, -11553, 20211, 25001, 38456, 96073, 62648, 24396, -30646, 14436, 30173, -25787, -34340, -18477, 37889, 66542, 37385, 53220, 59880, 59094, 44065, 8417, 2069, -16946, -30259, -4322]
8860d322K6136k1792K3243M1787k2819j27j1327J9102K5161r544q4566L0675J650
8847A3257J0096j8395l5751N9563N5033J3259K6355m8417j8649J0114m6238L2526
8835E2753K5191l1875M6773N4867r830J378m2428m1356J4226j4642o0178j997
8823g118j5392m6647Q968M0579Q7104m22m1464M3853k2339m8003l3777k0569L5894
8810a9333M193l9402M883K2633M4208P2780k92m2659l3345N4575L0689K6115n3966
8797G1079n6221L5156L7012M527M083m7111O355q839m0179L0936m738L3273K1672
8784H7005K814J3580Q628n2429p513j9637k5744J6932K9619K953N19j9399J5616
8771E2944j2859j3549J0535O1529L841p331l0333o5322n5675j1549K6664P5756
$$ y = [-4322, 21814, 22, 23265, 65052, 42233, 42106, 30779, 49881, 75042, 65498, -19068, 11607, 13257, 23353, 4958, -30793, 28770, 83803, 97062, 123417, 75000, 56351, 66465, 20227, 52753, 77944, 46069, 92842, 147709, 137879, 139257, 96829, 55473, 69699, 55057, -5121, -7118, -22510, -69157, -60189, -19610, 67494, 67072, 25608, 69461, 47122, -881, -34658, -55227, -19333, -15140, -54542, -49659, -27026, 17182, 89962, 89670, 47011, 13666, 68241, 98930, 125045, 71079, 14858, 50014, 87026, 91553, 95636, 48525, 54880, 46041, 5862, 36798, 32060, 65333, 87005, 89819, 103399, 112027, 59598, 52085, 32448, 6704, 23636, 53255, 56208, 56727, 37328, 52944, 40085, 26536, 37071, 98600, 102441, 95110, 64777, -545, -56220, -67769, -41105, 34651]
8759C4651K0354m7744k5157j8077L9987k8297k5355L6642L4986r136M422k7708
8747a0432K9011J9339K2828M5280N1336J5266o6411q7967j7492J5827M2506k0522
8735C8569n6872l0075K2652M4209J5687o302K6615n1487m7726j0174O1817P5834
8723H2747J8020L6213n8963l8485o762R536J578M455J347j7537K9719K8145p0109
8710A9904l1989k2910k3082J7216O1247L8281J8552n4858M770n878o6204l0017
8698g4968N9067J8722j0979m5346l5j7389r992K6962O4221O2392m771N2157L4823
8685A54864k6700l1416n4141J8975o4985l3030L0283J1964J3675M6136O0629o538
8673A19716r4798m888k0032l148m2362J0714K1071m716j3667L9404N4306J7623
$$ y = [34651, 55005, 7261, -17896, -35973, 4014, -24283, -49638, -12996, 21990, 12854, 17276, -10432, 18579, 37918, 60746, 106026, 157362, 172628, 106217, 18250, 758, 16585, 59091, 38569, -18303, -48378, -25726, 18483, 34170, 27868, 54483, 2996, -44730, -54904, 6913, 82747, 100767, 136980, 78017, 39532, 32770, 42306, 43884, 48339, 49686, 32149, 61868, 90013, 19904, -12085, -34995, -58077, -40861, 20386, 58667, 77219, 22361, 27131, 21253, -44951, -74968, -15901, 2821, -8158, -53504, -53539, -70928, -80920, -53958, 10263, 72655, 67884, 120041, 154864, 128164, 96748, 42607, 61582, -3403, -36433, -6150, 5814, 19489, 65625, 126254, 119716, 24918, 20030, -2, -3150, -45512, -34798, -13727, -18443, -32110, 7294, 61600, 79223]
8661G9223k7645M684k70k1689q787K6427j053j0890K0915M1622q1624p5979j2046
8648f7112O3533N8088J8054m8822L636J4323k2450n3062j39j277j1884K4392J00415
8635G7695M1242P913Q403l2298m6560o7739m9896L5818R6897K5963k7177j4460
8623E5801O2J6256N3916J2736n3805l5913j7196O107L6201L2828j1074m3591l0656
8610B1672j3261L0922l0963n6600m5481j9393R1022N0080K1053J561k781n7791
8598i960r964O7156P999m3851O7634k5122j17435j7735J03994L6948j4688q139
8586C6837K3888j2447m6951K8462k2698n2732P6929Q9392K1255p816m981j04444
8574B4694l3846L6153L7824M1540L899o423j5909j9081N922k677k0301p0433J1128
$$ y = [79223, 51578, 56262, 55992, 34303, 25516, 51943, 50890, 40000, 60915, 102537, 20913, -55066, -67112, -3579, 54509, 72563, 23741, 27377, 41700, 19250, -33812, -33951, -35228, -47112, -22720, 77695, 118937, 126850, 135253, 102955, 56395, -11344, -61240, -25422, 71475, 97438, 70261, 55801, 55863, 72119, 126035, 138771, 84966, 49053, 31857, 37964, 74165, 106993, 95919, 52328, 21672, 8411, 39333, 8370, -48230, -93711, -113104, -22082, 27998, 49051, 50612, 47831, -9960, -19924, 47232, 55231, 11380, 79014, 53892, -63543, -81278, 22716, 59664, 44976, 36837, 60725, 48278, 1327, 29789, 7091, -45641, 31288, 120680, 141935, 134119, 129138, 24694, -9152, 27001, 64825, 106365, 110264, 103841, 87932, 68851, 74773, 72096, 51795, -18638, -7510]
8561g510N2252M6358n2427q0327k5316O5752M1742k1963l3916j6007k3127O862
8549d7627J2299q290l368M8796P5154p6J0293L266l7274o7518k4781J7348J0349
8536a1429k9402j0670M6290R862k0666J425p557M3972J8102L2606K9613M8443
8524A50589p5794l2571p6295k8684P2366O5936N6155m9773l1778K6435M8677k543
8512A22720k4158j9867M2634j5732o3347m3006r836K8630L2348P575n1756j9236
8500a3031k1308O215j0725j8803K3040M0723q847O192N5560M8558L7203K1523
8488A66300J6856P942j07754m9106l3075k4128Q533P457L8679J8157J2771K6377
8476H9009k6811L1308L6324J6747n0891J063j8055l3139K2265j6159M7203j1932
$$ y = [-7510, 44742, 91100, 38673, -41654, -66970, -1218, 40524, 18561, -15355, -31362, -54489, -47627, -35328, -43618, -46986, 1810, 76964, 76888, 87181, 90447, 53173, -14345, -39126, -21778, -11429, -40831, -51501, -5211, 4651, -16015, -14590, -22147, 21825, 39927, 72533, 102146, 150589, 74795, 42224, -34071, -62755, 9611, 75547, 131702, 81929, 50151, 76586, 125263, 122720, 98562, 78695, 121329, 105597, 42250, -756, -10592, 18038, 50386, 57961, 6205, -13031, -34339, -28124, -38849, -57652, -34612, 6111, -2736, 3456, 59016, 107574, 144777, 166300, 183156, 191098, 83344, 34238, 1163, -22965, -14432, -6975, 31704, 49861, 62632, 89009, 62198, 93506, 129830, 146577, 95686, 96749, 78694, 45555, 67820, 51661, 98864, 86932]
8464H6932m1543l4461k8484j6561N3119M1374K4981L4320j8537o2697R824J7197
8452F5464J702n270l9686k3112N0853L0088l293N594M4647k2665n5028J7347K9841
8439I6482M592k7127J1486l379p7271o655J6071j1875j0286O3156k0665m410j3506
8426A6613k6940K8523P7338l3980m3833m583N2671J9255m8504O083l9886N863
8414H620k1604m840O1468J6155k801L8148p1125j9285N5981l9503q0908j4834
8402g4528q633M0127J8494M7449J6902m5495k7755j4183M4386P5276L1300n1346
8390E1994o0224j6487o687O702M8594j6329R379L214l1233J716k4378L0837L1530
8377B8628j9736j0382N3743J5293k9144L1561J5564m8494J9179k8697l9839k4425
$$ y = [86932, 45389, 10928, -17556, -34117, 19002, 60376, 85357, 119677, 101140, 38443, 48267, 65464, 67166, 61896, 22210, -902, 49951, 80039, 76746, 82340, 126987, 104322, 49294, 66641, 96482, 101074, 73947, 85433, 82054, 4783, -1872, 14199, 2324, -7962, 55194, 34529, 30119, 16613, -10327, 18196, 95534, 61554, 17721, 13138, 65809, 85064, 36560, 42643, 2757, 8620, -12984, -17824, 43644, 59799, 56998, 95146, 24021, 4736, 60717, 21214, -59694, -74528, -83161, -43034, -24540, 22909, 39811, -5684, -33439, -47622, -3236, 72040, 103340, 51994, -8230, -24717, -31404, -24702, 23892, 7563, 16942, 20156, -11077, -9361, -33739, -2902, 28628, 8892, -1490, 52253, 67546, 38402, 69963, 85527, 37033, 56212, 27515, -12324, -36749]
8365c6749L4769L7366o6568J0025J612l5207L6697r537l5671N8132J3186J2263
8353B0318j9293M88n2711m673M0204N0140M4299m9221j3922K4391K1964p5617
8341a3633l7693N7375r672k3659K0532n55N3675l4158k6137j1542j0272M9997
8329A4258O2048Q853n3639l8683Q971M851k2705m182j3188J9191l1396J9611J2709
8316a3301J8660N4820N267j8016p493l6579p0062j3803J2880l415Q073O0060P73
8303b136m045m8328M610K7838M6311L3835j694j9389k6199o6631M256O4053M280
8290A6761J560J4860l2315K3663p7520l3335N6797J9929P752o1061l059l9521
8278a05489k8355n0858M4659J20912L6432j7920j278N544L0252M6853o4912p3238
$$ y = [-36749, -1980, 35386, -31182, -21157, -19545, -54752, -18055, -27592, -63263, -5131, 8055, 20318, 1025, 1513, -51198, -55871, -15667, 34473, 78772, 29551, 15629, 40020, 61984, -13633, -51326, 6049, -3623, -27282, -6750, -7305, 46370, 12212, -13925, -25467, -35739, 14258, 76306, 85159, 31520, -7163, 1808, 6659, -16046, -20228, -33416, -14225, -45621, -26010, -13301, 5359, 60179, 65446, 47430, 39937, 3358, -66704, -80507, -67627, -71042, -62969, -2909, -2136, -6181, -54509, -49899, -22061, 24250, 58085, 56391, 37002, 10803, -55828, -51572, 12481, 16761, 18321, 33181, 866, 24529, -52991, -86326, -29529, -9600, -1848, -62909, -65968, -105489, -133844, -184702, -140043, -19131, 17301, -619, -1897, 3647, 33899, 80752, 15840, -57398]
8266e7398J2404M4362J1476n6244J365o9084L5538N118q6199l7866Q2915M3536
8254g0077j3688K1841j209J5046J7785l2575k9243J5912j1231M2458O7881R858
8242C2758j3755j3185J0368L9574j9125k9950k5098K756n0916r078k3226j9557
8230a18434M3363m940j991q401j9977L1382N8148N5829J9767q436n6622m0622
8218e0934M34J7684O662K3216j187j1975j0018j0031k1191M4589K5842k9805n6141
8205g2855j2785N3690N5393m3900R48L2411l712O5387M3435j4717K948j3524l9896
8192E2823M712K8692O518k8905n575M556n1931j7447M357K0829K8856R304o116
8179E0673j571l4076j7812P318P4737k1258j4630p054L9045k3639j436k3706K7523
$$ y = [-57398, -44994, -632, 10844, -45400, -44035, -113119, -77581, -72463, -158662, -196528, -113613, -70077, -83765, -61924, -63133, -48087, -30302, -62877, -92120, -76208, -87439, -44981, 22900, 32758, 19003, 5818, 16186, 55760, 36635, 6685, -18413, -15657, -66573, -75651, -98877, -118434, -75071, -80011, -82002, -90403, -110380, -78998, -20850, 34979, 54746, 46310, -10312, -50934, -50500, -32816, -26154, -2938, -4125, -16100, -26118, -36149, -57340, -12751, 13091, -16714, -72855, -85640, -31950, 23443, -20457, -19509, 12902, 9190, 74577, 118012, 103295, 106243, 92719, 52823, 57535, 86227, 92745, 63840, 58265, 62821, 10890, -6557, -2200, 18629, 47485, 56789, 50673, 49102, 15026, -2786, 4532, 79269, 58011, 43381, 36327, 75372, 51733, 50297, 26591, 54114]
8166E4114J1806J8197j8370Q808m2120m2165k4302O5699l0204o8024J0867J01386
8154D5692N0789l8476n2437l1701n6303L8174l4900O569L267K2771J8221n0991
8142g9325O916m3077l2901P6331R1604K0680j3688k0109m281L5133K4443l566
8130E8160K5559l5237k7640j2565K3807j3110j2296l1254P0135Q2259k2373J5393
8118A20838r387p3964o11K9328M660N8455q520o0455J1155P97l1115J1175J7243
8105F9599L353p0729Q501M7226L3267k159q6646j2912O405k0224N4388j538J2705
8092D1236O481l1839M3218r757r8805K0653n5139l9816P1554O4161l3754m367
8080b6174P1489J6481r645k734k6817M589J1042J1764K1448K1993l6980j4642
$$ y = [54114, 65920, 84117, 65747, 74555, 32435, -9730, -34032, 31667, 1463, -66561, -55694, 45692, 96481, 58005, 5568, -26133, -82436, -44262, -79162, -72593, -69326, -46555, -28334, -79325, -72409, -115486, -148387, -72056, 19548, 40228, 26540, 6431, 2150, 37283, 61726, 58160, 83719, 48482, 20842, 8277, 32084, 18974, 6678, -24576, 45559, 127818, 105445, 120838, 111451, 37487, 36876, 66204, 70864, 129319, 120799, 60344, 71499, 72296, 41181, 52356, 69599, 72952, 2223, 10724, 57950, 91217, 89058, 2412, -10500, -4095, -24319, 30069, 28531, 41236, 47717, 15878, 59096, 49339, -49466, -28813, -83952, -123768, -52214, 11947, -21807, -26174, 45315, 61796, 52151, 49417, 22600, 27189, 38231, 49995, 71443, 93436, 56456, 41814]
8068D1814O1514J2185p562l3139L6313M853J3658m6025q3277M017M8196O0681
8056A13228m2120n4816J2377M1847J7450K112O754O329n2097m388P2629J3008
8044A32313p488n4N53j0350K2283p699j07957r8225q5566J7085J18919P1430k1734
8031B3510j6348J0125J0015m6871K2985K6502K3485J24402k3964m8635K451r060
8019I8597p4541q032P0660p799J2257n9924l1077P061M5191M9324J5738j6214
8007A01241L8822J4118J1290K5223M5782N5282j2n5692k4512O142L552m1280n6481
7994A23475j2874m0239j8433k0022R656L8253K0611m4897k7311l0050k8294n510
7982c5635N3159J1801j5472K086j9244M7910N9663k571q3156m7505l925N7528
$$ y = [41814, 103328, 115513, 107951, 74812, 111125, 115978, 129636, 83611, 334, 4351, 52547, 113228, 71108, 16292, 28669, 70516, 87966, 90078, 96832, 103161, 51064, 46676, 119305, 132313, 124825, 124771, 125324, 114974, 137257, 129558, 21601, -76624, -162190, -145105, -26186, 45244, 23510, 7162, 17287, 27302, -19569, 3416, 29918, 53403, 177805, 153841, 105206, 107657, 98597, 24056, 16024, 86684, 78885, 91142, 31218, 141, 7202, 52393, 101717, 117455, 101241, 140063, 154181, 165471, 190694, 236476, 291758, 291746, 236054, 211542, 217684, 221236, 179956, 123475, 110601, 70362, 51929, 31907, 41563, 79816, 100427, 55530, 28219, -1831, -30125, -35635, 17524, 29325, 13853, 15939, -3305, 44605, 104268, 101697, 18541, -28964, -32889, 24639]
7970B4639R270j0066M0055M3328j2486j1094M5455j9549j3347m8533P834M3984
7958I9490J0892k0576n5755K9440Q2994J4245j9947p8168m7539L189L8806M1150
7946I8221n543P47o5732m2208J0806N5373O2q0012j5396K0926j9074K7693M5052
7933C0915Q2292j9523l518j4172j33730m7210N6286J7852l477O434N4163N1426
7921G7738m765p4631k5682n3310q184M0760K83o983L6220N9369J1275l8529j9185
7908e624l110j9954p15O7652J3538M0457j5764m7136o3613k0841J8280N3615n813
7895A0972j4270j685L0906L5501n8924l895L3593P511k3544K0032o6343o5187
7883i5333k1011K276L4656L6023N4545N663k6362Q45k7196l9580L7892M3762j6076
$$ y = [24639, 33909, 23843, 63898, 107226, 94740, 83646, 129101, 109552, 96205, 47672, 55506, 99490, 110382, 89806, 34051, 63491, 146485, 160730, 140783, 62615, 15076, 18265, 57071, 98221, 92678, 93425, 27693, -14515, -3709, 51664, 51726, -28286, -43682, -22756, -41830, -14137, 30915, 113207, 93684, 90166, 75994, -57736, -104946, -48660, -30808, -34285, -27851, 26312, 77738, 72973, -1658, -27340, -80650, -88834, -48074, -47791, -54774, -18554, 40815, 52090, 13561, -5624, -8734, -28688, -29403, 38249, 51787, 92244, 76480, 29344, -34269, -55110, -36830, 16785, 10972, -3298, -4983, 25923, 61424, 2500, -1395, 32198, 39709, 16165, 36197, -30146, -95333, -116344, -114068, -79412, -43389, 11156, 16819, -9543, -8698, -35894, -75474, -37582, 6180, -9896]
7870i896L9353K4048q6541J093J7096j746n215J4522m365n1607k923M0989p98
7857b5990j8028L2822O4992p099j6994j1896r978j2447j2097k5462l2792J5179
7845e9790L4730M7563j4227j5880m7866m3232R483O1663J4819Q856O1220M1189
7833I8528m0332j8001P340k4625r030q827m0941j7871O5298n922k5342m5332m9504
7820a14561k3167M4573J876N2132p959j3725M2395L4741l6024K0649j2742L9033
7808B7221N8260J2218j9336o5573Q148j4076o6478m3669J4972L3252L0914R4911
7796G0764K3885o5514k2686K9382l9960K3480M9253O4469j7499p3025K0584J347
7784F4480j6745j1061m6135o702Q841j7106K6953M4943M1389l4992m5307j6246
$$ y = [-9896, 29457, 53505, -33036, -31943, -14847, -16593, -21808, -7286, -11651, -63258, -66181, -25192, -25990, -44018, -11196, 53796, 46697, 29703, 17807, 7829, -4618, -16715, -42177, -74969, -59790, -25060, 22503, 8276, -7604, -55470, -98702, -89219, -27556, -12737, -3881, 57339, 98528, 58196, 40195, 47535, 22910, 13880, 5053, -35888, -53759, 11539, 5617, -19725, -65057, -114561, -137728, -93155, -91279, -39147, -47106, -60831, -18436, 16305, -19719, 930, -11812, 27221, 85481, 97699, 78363, 12790, 20938, 6862, -59616, -103285, -88313, -55061, -24147, 70764, 94649, 29135, 6449, 35831, -4129, 19351, 68604, 133073, 115574, 42549, 63133, 64480, 47735, 36674, -9461, -16163, -7322, -24428, 2525, 47468, 88857, 53865, 8558, -7688]
7772g688K9926L7484L2097m4882n2814O833J5579j5651k2423K7559K5288k9121
7760B187q0594j7464O2742Q0407N8376k2902o4638j550j3779M5044j1556L598
7748C9871K4193J1886l647l3926O6868J0556J5569K2635l7290o5645o1844m359
7736a5133J5969M3777N3828k1552o6293p0066n4131K9201l7172M9256M9499L4158
7724A1341l5327p5202j2071R785j2135k945Q5568J504l7653L1005l3105J8931
7712e0304L5692O7559J262k0549j1q322k4034N690Q0471K8294o1135l3838n4069
7699c3294l7436l2716M025k4460r636Q5423J00090J743k057m6334J3946j024k2222
7686c952l6655N3821P400m6466L7591J2198j2349j9578L8081N533l7553m0903
$$ y = [-7688, 22238, 59722, 91819, 46937, -5877, 956, 16535, 884, -21539, 6020, 31308, 2187, -78407, -95871, -33129, 47278, 105654, 82752, 18114, 16564, 2785, 47829, 36273, 39871, 64064, 75950, 72303, 38377, 105245, 115801, 131370, 154005, 116715, 51070, -10774, -15133, 836, 44613, 98441, 76889, 10596, -59470, -113601, -84400, -121572, -72316, -22817, 11341, -23986, -99188, -111259, -101474, -113609, -116554, -30986, -29482, -67135, -36130, -69235, -50304, -14612, 52947, 54209, 33660, 33649, 25327, 1293, 6983, 87454, 115748, 54613, 20775, -33294, -70730, -103446, -99421, -123881, -133517, -48094, 51996, 53739, 51682, 5348, 19294, 18270, -3952, -40607, 13214, 20614, -25852, 11739, 23937, 11588, -7990, 30091, 35624, -1929, -42832]
7674d2832J8474J5306L3477J5499O237j8981k4856j2942J4888O9579L8672j0185
7662A02336K1018k2061p8231j3516M1110k560J4402j5764J1144n318k6789j4231
7650A1540J6002K8360p6605J9652M303k4718K5013j0040j5557J6501n3968K7512
7638c2005P356l0191j1917j8688n6036m9588L0970N9440J0150K9602O4696j3782
7626i993N9498n082K48J0100L0622L7519K7561n0147m6559p3842m6788j3118l0087
7613a10068k0387L4936K8786l102q002Q5955L9252l4256k9579N5145M0737m4375
7601C5042m1195J2049j9402o1548j0416k1897K6149Q5364l2963o5476q1511R6599
7589g9205J01252J6948k8775J7334p6656j3259P1377j8893k9327j5793O678K4960
$$ y = [-42832, -24358, -9052, 24425, 39924, 46161, 27180, 2324, -10618, 4270, 73849, 112521, 102336, 123354, 101293, 23062, 9546, 50656, 48096, 62498, 46734, 57878, 52560, 25771, 11540, 27542, 55902, -20703, -1051, 3252, -21466, 3547, -6493, -22050, -5549, -59517, -32005, -24649, -54840, -66757, -85445, -141481, -191069, -160099, -100659, -90509, -60907, 3789, -9993, 49505, 44423, 44671, 54771, 85393, 122912, 150473, 100326, 53767, -20075, -66863, -79981, -110068, -130455, -95519, -66733, -69835, -77837, 8118, 47370, 13114, -16465, 38680, 79417, 35042, -6153, 5896, -13506, -75054, -85470, -107367, -81218, 4146, -28817, -94293, -175804, -79205, 22047, 38995, 10220, 27554, -49102, -62361, 9016, -9877, -39204, -54997, -48319, -23359]
7577b3359L0997N1893M898j1288l4908n05J7596m4452m0799L932r104l4381P3465
7564a6015N777l7708N0234J5308l5014N092L599J9458m177J876J0343R59p267
7551A2465m4724o846J4577K5776K0657l1060L6906L1256L262o8803j6661K7332
7539D137l4077k6451j0861K7402P840K5288N7727l361r3284l5790J8597o66J7629
7526d5870J4829J0204K1573K9874J5891r602j8770k6867j4179k0880k6055J6473
7514e3379M1562J8951K2180o620l1428M5793L5881m8988j2103k3011o5002q3578
7502a59742j102P400O5066J01597n389J6664j764l6653j3170k3632j4844j0350
7490g5919l6555J2488j0386n162J6390K6281M5747O3122r993j3961M4179j481
$$ y = [-23359, 7638, 59531, 64429, 53141, 18233, 17728, 35324, -9128, -49927, -45995, -55099, -89480, -16015, -10238, -47946, 2288, 17596, -17418, -12326, -8727, 10731, 6554, 8430, 18773, 19732, 12465, -32259, -39105, -24528, 1248, 21905, -9155, 27751, 59007, 62269, -6534, -23195, 4137, -29940, -56391, -67252, -39850, -32010, -6722, 51005, 47644, -45640, -81430, -62833, -63499, -45870, -31041, -20837, 736, 30610, 46501, 36899, 18129, -8738, -22917, -43797, -69852, -53379, -11817, 7134, 29314, 22694, -8734, 37059, 72940, 23952, 11849, -11162, -76164, -159742, -160844, -153444, -88378, 13219, 7830, 24494, 22730, -13923, -27093, -50725, -65569, -75919, -112474, -99986, -110372, -115534, -99144, -72863, -27116, 36006, 26013, 12052, 56231, 54750]
7478E4750P948l6941k9426k7134N2958J5614J3367m6934m7773l5232L1187L0677
7466a6939Q1044N1675l200m178j3290o7727r423k0766l124L1655k1366J9035k7888
7453d492J7817K1847J0822k8494k6281k3846l1247o2423O7856O2623J2780l4826
7441a7864L6142K5396o8657n9760J4473q204K8185J7687j459l1743J7261P5070
7429B6527j9567j3875r560j1891m589L2310L1120l2528j6407j0505L4795N0835
7417E6665J8749o910L3540k5003M740j420m1771l7385m6632K0992k5540m5279
7405i5254J9031L3340M1625k7922l7259k8481J7527J2144N3110L3160m8774j2429
7393d0182M0600o2140l2174K1441L4532P5472L2124m9314k6036K0659l6691K537
$$ y = [54750, 62698, 25757, -3669, -30803, 22155, 37769, 51136, 4202, -43571, -78803, -47616, -16939, 64105, 115780, 112580, 108402, 95112, 27385, 17962, -2804, -5928, 25727, 4361, 23396, -4492, 13325, 35172, 45994, 17500, -8781, -32627, -63874, -126297, -58441, 4182, 16962, -17864, 18278, 43674, -24983, -84743, -70270, -78474, -50289, -32602, -34061, -65804, -48543, 26527, 6960, -6915, -16475, -28366, -32955, -645, 30475, -2053, -18460, -28965, 5830, 56665, 75414, 68504, 102044, 77041, 81781, 80361, 38590, 1205, -45427, -24435, -49975, -95254, -76223, -42883, -1258, -29180, -66439, -94920, -77393, -65249, -12139, 21021, -27753, -40182, 418, -61722, -93896, -72455, -37923, 37549, 69673, 20359, -5677, 14982, -21709, -19172]
7381a9172N8928j4180J1980L217q5473n5391M3891m531M6710o7690J6968N4172
7369a0571l7910n1961N849M7932Q3828O2666p6784m3701M648K6487m6778l4779
7357g1074r294N3157R774p7754J1728K4472L2507M1567r442m404m857N7873M2138
7344I6391l6984o4934m4205m9236K5491K5595M2240J6684K7543m9445l1515J3098
7332b9277L327l7542K7026Q6076K1243N715j2229N100J2549K4669J98q1577n2578
7319b7300J1529K2192k0625k7259N08L1677K0318M514l202j9843K5996K0455p4387
7306c5427k5574j1043M7636J495j0707l2998p6322M0053O3517N4226N6735o084
7294F5507j3509J9903j1199m0452k6564l7834j2384J7703L7701L6314J8847M8902
$$ y = [-19172, 39756, 25576, 37556, 40773, -44700, -100091, -56200, -60731, -14021, -81711, -64743, -10571, -48481, -100442, -94593, -46661, 37167, 99833, 23049, -20652, -16004, 10483, -36295, -71074, -80368, -27211, -17437, -95191, -83463, -58991, -26484, 15083, 5641, 1237, -3620, 54253, 96391, 59407, -5527, -49732, -98968, -73477, -47882, -5642, 11042, 38585, -10860, -42375, -29277, -25950, -63492, -36466, 49610, 70853, 76568, 64339, 69439, 81988, 106657, 106855, 25278, -27300, -15771, 6421, -14204, -41463, -40955, -9278, 11040, 15554, 12352, -7491, 18505, 38960, -35427, -61001, -72044, -24408, -22913, -33620, -66618, -142940, -102887, -39370, 14856, 71591, 65507, 51998, 71901, 60702, 20250, -6314, -44148, -56532, -38829, -1128, 35186, 54033, 102935]
7282A02935L3033p0650m6763k397J2541k4780k6095k290O0611K905j7514J2229
7270C3765K7703J994o5112k8462n823N7324K6606O452J0230j13223m8028M5861
7258e0713N9289k7901o7434m1172K9440M5005J9430M4425K2951k8482l748J4754
7246A5844K3826M600m1681m1892J5212L8200K6317J4427k6415m0725l3053R282
7234c6058M7366l8961k4316R714P082K434l5486o95O6356O2808K7414N913o6492
7221B7079m356j6188o0872l6522L7038L8421O3247K6877l7038l114R0947j5125
7209A10394n2851o3177k5567N2424L6763J8141l6127k4664o760q4589R533O3005
7197c475n009L1634q755l1130l6783M5524R087j3333K9664L2371N899o8763k3394
$$ y = [102935, 135968, 65318, 18555, 16158, 28699, 3919, -22176, -24466, 36145, 39050, 21536, 33765, 61468, 63462, -1650, -30112, -35935, 21389, 47995, 54447, 64677, -48546, -96574, -50713, 8576, -19325, -86759, -127931, -98491, -53486, -34056, 10369, 33320, 4838, 1090, 15844, 39670, 44270, 2589, -39303, -24091, 14109, 40426, 54853, 28438, -12287, -45340, -36058, 11308, -27653, -51969, -42255, -35173, -32739, -68225, -68920, -2564, 60244, 87658, 93571, 27079, 22723, 6535, -54337, -90859, -53821, -15400, 47847, 74724, 37686, 34572, 125519, 110394, 57543, -5634, -31201, 21223, 57986, 76127, 40000, 15336, 8576, -76013, -66480, -3475, -8484, 23150, 14395, -16735, -53518, -7994, 1093, -12240, 17424, 49795, 55694, -13069, -36463]
7184c6463M4330j5813J2736l895J3640l6419m5249M3530P622K0301P2981K5803
7172A03104J0102k8699n1084l3800J7335m9325L5538J0146m64m4438j286J895
7160c0976K3601K9937m1527j2764L0818j9828p823J3186j7412K4399k8136j3713
7148e0238m1061K4741m547k8979K9005L4185Q668K7560P531N937j8006P120N6305
7135E8221k4280m8413k9721p62k1022m6372M8368L8940l286N5083J0408L503J0468
7122E1135o1251J1995J66L0404j8457k459j9511n893K0538k6693j0821Q614l647
7109b5880L8969K452o5390M6542j3321M102m445j8644J578k3784l0760j1162Q565
7096i1178L4419n676J0545K2454L20L001j3403K3744k4958J2327L7450q66j1425
$$ y = [-36463, 7867, -7946, 4790, 895, 14535, -21884, -67133, -23603, -15981, 4320, 77301, 103104, 113206, 84507, 33423, -377, 16958, -32367, 3171, 13317, 12853, -31585, -32871, -30976, -7375, 22562, -18965, -31729, -911, -20739, -28562, -15376, -32788, -8389, -36525, -50238, -91299, -66558, -71105, -100084, -71079, -36894, -28226, -666, 6865, 12802, -5204, 1916, 58221, 33941, -14472, -44193, -44955, -65977, -112349, -63981, -25041, -28327, 26756, 37164, 40667, 51135, -10116, 1879, 2045, 32449, 13992, 11533, -7978, -13871, 6667, -20026, -30847, -22233, -25880, 13089, 15541, -49849, -3307, -16628, -12526, -16971, -35615, -34037, -57821, -88581, -99743, -91178, -56759, -62435, -51890, -29436, -29116, -26115, -39518, -15774, -40732, -28405, 9045, 8179, -3246]
7083c246K5755K0418m256o123m1524n4876R691o7839J826J6165L110N9585K6908
7070a4406M312l4382K3634M0344N779k2721m4764o271R0863L4902m2111n1190
7058a6011J5899L7376o928J850J3355M0191l059J6776r0023r6390j9280J7381
7046h8863L2525M0247l3464j9542M8073M4469L0698L260l0244k1028l4641k5194
7034e3704j166l954j6055K7731N9623J2657L1328M3794o8032l7296k4379j2683
7022d2136K4951L2209M6215l7496l1690K9708l8095m3116O88L9860L8706R408
7010B9212J3306K3111o9285l4963K0203L8082M8292K3235K5901j2813o4628m8397
6998h744J2017J2053M673n2173J4197K0006k9595n4616R015L9311p264j5412J0
$$ y = [-3246, 22509, 42927, 38671, 32548, -8976, -63852, -54161, -122000, -120174, -104009, -100899, -41314, -14406, -10094, -44476, -20842, 19502, 25281, 2560, -42204, -48475, 42388, 77290, 35179, -16011, -112, 37264, 30336, 32186, 45541, 85732, 82673, 99449, 9426, -86964, -106244, -88863, -56338, -16091, -49555, -69097, -21024, 23445, 54143, 57403, 27159, 6131, -28510, -53704, -54870, -58824, -74879, -47148, 12475, 25132, 56460, 100254, 32222, -5074, -29453, -42136, -17185, 15024, 61239, 23743, -7947, 21761, -16334, -59450, -58762, -18902, 19804, 29212, 42518, 65629, -3656, -38619, -18416, 19666, 67958, 91193, 117094, 104281, 39653, -8744, 3273, 15326, 19999, -32174, -17977, 2029, -27566, -82182, -73167, -33856, -41120, -56532, -56522]
6985e6522m9538j9416M8294J4988L4874j8976m6435M103J3909K391N5531p075
6973b3872j3183K9426p145L0777n802l59l1372k5987M380j6913k4447l5067L125
6960a16439L3796N3989N7116J875K2045L381M4777L0617m8814o6295q6171k7198
6948i7321j9824J0425J7409J2346J5132P399J219l4832l7226l0957L0372K4981
6936a00877J7052J4174L9146O343L3097M2771L8152j3264r3421q0409K2649O9525
6924e062J2844L8532M708P431Q277k2138k9930l4520r6444j155N6159K6706K249
6911c2343l6058l7859r577O0159M5097R87n4180k1499Q0150L3848N107j0027O522
6898C0327P8819K4057m0375q1145p2886N0018N969p087L5545p133K3932M3377
$$ y = [-56522, -106060, -125476, -77182, -62194, -27320, -46296, -92731, -88628, -74719, -72328, -16797, -23872, -37055, -7629, -14774, 16003, 10201, 9842, -21530, -47517, -43137, -60050, -84497, -119564, -116439, -82643, -28654, 28462, 30337, 52382, 55763, 100540, 131157, 82343, 16048, -70123, -97321, -117145, -106720, -89311, -76965, -61833, -54434, -53215, -88047, -125273, -156230, -125858, -100877, -83825, -69651, -30505, -24162, 8935, 51706, 89858, 76594, -16827, -97236, -74587, -5062, 7782, 46314, 51022, 58453, 66730, 44592, 14662, -19858, -116302, -117457, -61298, -34592, -32343, -68401, -106260, -115837, -55678, -10581, -9594, -63774, -85273, -5123, 28725, 33832, 23805, 30327, 109146, 133203, 92828, 11683, -61203, -11185, -5216, -12303, 23242, 16109, 40041, 83418]
6886H3418j3319J5799m6594L6m224O9577N962q5496k5546O648l1183R171J3643
6873b108j1274K7527L9153l5238J1627J0394J5945m4920P020j9503n1480l0738
6861h3595N5693N9082P426m7029q2172j2988L5409K0082O1309N018l6943K069
6849a6639J6884p40L5887n6208j00248O477q196K0671N3469P257O0533N1034J6041
6836H6222p6579q0499o4944O582K0545L5896N3706K8109l0623l5294n6903j984
6824a15766L6957L3741k8687k2133r325J2214L6124L1365N4656O9176k8759q9668
6812b0105J5300N8665j2555J797J8961L8663j0872j6085n2057r574K6707p438
6800C1407Q004N4144m6579o9092M232L6519J443M0746l3152K0073M4610m8568
$$ y = [83418, 70099, 85898, 39304, 39340, 35116, 104693, 110655, 25159, -387, 6261, -24922, -15751, -2108, -13382, 14145, 53298, 18060, 29687, 40081, 56026, 11106, 18126, -1377, -52857, -83595, -27902, 31180, 38606, -8423, -90595, -103583, -68174, -48092, 13217, 18235, -18708, -16639, 245, -495, 35392, -20816, -121064, -114587, -122783, -102112, -48643, -41386, 19147, 70181, 86222, 9643, -70856, -135800, -129218, -108673, -72777, -19071, 9038, -21585, -56879, -113782, -115766, -78809, -45068, -73755, -95888, -105213, -92999, -56875, -25510, 29146, 98322, 69563, -20105, -4805, 53860, 41305, 43102, 62063, 100726, 89854, 73769, 21712, 12138, 38845, 31407, 39411, 93555, 46976, -22116, -17884, 18635, 20078, 60824, 27672, 47745, 92355, 43787]
6788D3787n3655J7907l4415l0740K2010m225L2841l2165m6815R053J8329L0576
6776b7512K852k3634O3678M6734P805n6797k9613M1949L2785j7400l4397j8473
6764a2023k5271m3213m6772M201L8656K4038n5766j9005K0826N1857N6377l1686
6752c7781Q76M1218j0317k5457k6008M4202k6744j2290K3953j4286m7758L2740
6740e7652N7796r505K7335K8475K7634J9855k4474l3232k1996K2344p1904n3521
6728h8845m5813M9628n711J7957M6490M6072j0880k9273N5235n2154o2527L3076
6716d6745J5742P275K8040r814k6574k9410K9600L5560R541j6422Q204L8639K58
6703D3894L407m3984m1896j0483L7452n179j1029o110J6559L8457l3687m3164
$$ y = [43787, -9868, 8039, -26376, -57116, -35106, -39331, -6490, -38655, -85470, -76417, -58088, -27512, -24660, -48294, 15384, 62118, 69923, 13126, -16487, 25462, 58247, 40847, 6450, -12023, -37294, -80507, -127279, -123078, -84422, -60384, -116150, -135155, -114329, -62472, -6095, -37781, -36905, 4313, -6004, -31461, -57469, -13267, -40011, -52301, -28348, -42634, -90392, -57652, 144, -9361, 17974, 46449, 74083, 93938, 69464, 36232, 14236, 36580, -35324, -88845, -134658, -85030, -90741, -72784, -26294, 19778, 8898, -20375, 34860, -17294, -79821, -46745, -31003, -23728, 4312, -5502, -32076, -61486, -31886, 3674, 13215, -3207, 4997, 43636, 43894, 47301, 3317, -38579, -49062, -11610, -16789, -27818, -33928, -17369, 21088, -12599, -55763]
6691e5763r08O5425K4007l5766k741j9472k0345K6469L9929q480l1033m9511J5754
6678e2435N4597O0729P2615k1212q9501j9031k6897p015J2964R58j2845M0385
6666A3312n0039m4080P850J9521L5310P3236k1785o4939n9722p5527P744M7753
6654a11366P8777J8328N3987J4455k3166q392l9252J7566K1491K1067k4989k3961
6642e455J4458l8794k3526L9739K8255M5238k6500j08608J445K2303J1455L6104
6630c886K2183J0532q528j6519n2737j89J9314l1256k2466Q9775M6812o3862q9592
6617a00419K9756L9885j4777O10J6897K3088K478P074m3990n845j5247K1043K1585
6604a7862l476J0493j7804M264L125n7546m011O3378l508J8054P224N7806k6324
$$ y = [-55763, -56671, 8754, 32761, -3005, -5746, -25218, -45563, -19094, 20835, 12355, -18678, -68189, -52435, 2162, 62891, 135506, 114294, 24793, 5762, -21135, -28150, -15186, -14228, -27073, 13312, -36727, -80807, -72957, -53436, -18126, 55110, 33325, -31614, -91336, -166863, -159119, -111366, -32589, -14261, 39726, 54181, 31015, 22623, -16629, 937, 22428, 43495, 18506, -5455, 9003, -29791, -53317, -13578, 14677, 59915, 33415, -75193, -73748, -51445, -39990, -3886, 18297, 28829, 20301, 3782, -48955, -49144, -29830, -61086, -83552, 6223, 53035, -10827, -100419, -70663, -30778, -45555, -44945, -28048, -4960, -2482, 4592, -39398, -45243, -60490, -39447, -17862, -21338, -10845, -28649, -24385, -21260, -78806, -82817, -19439, -22947, -4893, 2331, 60137, 33813]
6591C3813n3658K8464j9040p705J6282l7355L6081J3608K2201m7814l7236K9470
6579b2889K8320M1839n5265n9783M7643j8417j9909J7061L206P6574K7950K1757
6567H8087O665l3412j9541N1190K3807l0338n2666k7719j4027K209o4037j7507
6555h7289L7321Q6251M3585j4484m6249n8186k8546K8368K2566Q5768j6773l8618
6543A3714j3821M2962k1168j0496O722O5388J2287k6066o1537l7677k7601K8424
6531b8869K8077J0561k7510L3577O535o9015j2659Q376k6744L2697m5821m8998
6519a39793k763N0707N1511K0834m8950K6227l5480J4554k186K672K4639k8218
6507f6246n5381J0832J8610L3382j5342k9671M5604O885l2121j6040J2319O4277
$$ y = [33813, -19845, 8619, -10421, -18126, -1844, -39199, -3118, 10490, 32691, -15123, -52359, -22889, 5431, 47270, -7995, -67778, -20135, -38552, -58461, -41400, -38194, 38380, 66330, 88087, 94752, 61340, 41799, 92989, 116796, 86458, 33792, 6073, -7954, -5745, -69782, -87289, -49968, 36283, 79868, 65384, 19135, -39051, -67597, -39229, -16663, 69105, 52332, 13714, -107, 42855, 21687, 11191, 17913, 83301, 95588, 69522, 7985, -29692, -57293, -28869, -792, 9769, -17741, 15836, 22371, -46644, -59303, -50927, -77671, -44974, -90795, -139793, -142556, -91849, -40338, -19504, -68454, -42227, -77707, -63153, -65339, -62667, -38028, -66246, -121627, -110795, -92185, -58803, -74145, -103816, -58212, -51327, -83448, -99488, -87169, -22892]
6495b2892L4998K7336m9579n0248J3375o9852J448Q9909M3005l047m7621m89l8708
6482g2365P487r588J9888j275L3278r181k7903J4087N0053K4937k2644j01843
6470i5069l0512P5198ml6866k3914J5295M4124R1663K230j1411m093k8434j4825
6457a6618J7507k7533o9578p5057j2840Q9141L2054j8626M6381N1781l1350k3506
6445c8244P313n3360k2523k8437R6875J02726K9496k6463o4823n0786j4902P1712
6433H584J13634q188n7330j01494n9962J3664p472j5295K9069Q563R773M3336
6421b3118K8479l0500l1630K117J00675l3291l2955L3365J2931p153N3216n9261
6409A2875o5818N0224J1007L4147L7987j8893m7543j9245k8410P624J8662L5731
$$ y = [-22892, 12106, 39442, -10137, -60385, -47010, -116862, -115414, -25505, 17500, 14453, -33168, -33657, -72365, -64878, -74466, -54578, -55853, -22575, -31756, -59659, -45572, 4481, 29418, 6774, -95069, -125581, -50383, -50387, -87253, -111167, -95872, -51748, 39915, 42145, 30734, 26641, -1793, -16618, 889, -26644, -96222, -171279, -184119, -94978, -62924, -81550, -35169, 16612, -14738, -38244, -30931, -84291, -106814, -135251, -38376, 64350, 93846, 67383, 2560, -48226, -63128, 8584, 122218, 114030, 56700, -44794, -104756, -91092, -98564, -113859, -84790, -76227, -66454, -23118, 5361, -25139, -56769, -54652, 46023, 12732, -20223, 13142, 26073, 18920, 72136, 12875, -52943, -2719, 8288, 42435, 80422, 61529, 13986, -5259, -33669, -26045, -7383, 28348]
6397B8348j6954j5048j4531j4258l6470q0837j4230O4049K4514j1594L1877N2724
6385b410j0623L4536O9620q067P786n8950r25q6752p663N0014K8129Q558j1361
6372A1892K363j1996k2385l2316M65M5819M0514q597l9163l1472M5426L1484l3790
6359a756n899L1852m87j0402m2222P528K6258l9366M4963P8664J0712q7792o7087
6346e5034r135O6659O7484J2215k3499M404q1813k6427M1192m9010K1943L7008
6334E987j5147J5881m0382J7455j0689o7835K7502n038k3159J7291K1008M3895
6322a3231R817o0489n477j5242j5186L463J5457j3577p766M9767J7987K9020n5507
6309f0964j3948P1064N0825J8272l3498m9800l7864l9272J7806N4621k94o456
$$ y = [28348, 11394, -3654, -18185, -32443, -68913, -149750, -163980, -99931, -75417, -87011, -55134, -2410, -13033, 21503, 91123, 83056, 90842, 31892, 30967, -55785, -63448, -13434, 14695, 23253, 11892, 14255, 2259, -20126, -52442, -51977, -6158, 34356, 25759, -13404, -44876, 550, 32034, -1756, -7655, 24197, 23710, 13308, -28914, -21386, 4872, -34494, 10469, 89133, 99845, 12053, -55034, -64169, 2490, 69974, 82189, 58690, 63094, -18719, -45146, -3954, -52964, -31021, 5987, -9160, 6721, -33661, -16206, -26895, -94730, -67228, -72266, -95425, -78134, -57126, -13231, -3414, -63903, -69380, -84622, -99808, -96345, -80888, -94465, -102231, -52464, -34477, -5457, -60964, -74912, -3848, 46977, 65249, 31751, -18049, -55913, -95185, -77379, -22758, -23052, -29508]
6297b9508k0844k2621m408n2729J389K6078N2688R396j1058j044l393K6702p666
6284c7018j6492L9645R83K162j5617J0919M9886L4937J2873o0712q2170l2041
6272i2645N7708L0622J9272O2963l3276p5856m4927K3394L0602L8570l2996j8193
6260c4762j7838m7167K6230K2315j5121M521K3887k339n0116O273j0273R487l1479
6247a16382k3453N8177L508L2332L381L071R15m2859P0563Q5491k5942k2662m508
6234B1632J5458R580l8369n1404j9646j2515J6008J8818j4703M4833Q7625L1302
6222A08619l9803k1247n5492l2173K3616j2198P819k1934j0991O6841L4329P737
6210E5123N489n0327m1343J1600K4091J7558L1926r975l7871l6061M0996m78k7402
$$ y = [-29508, -50352, -72973, -77381, -130110, -128721, -102643, -49955, -40559, -51617, -52661, -56054, -29352, -37018, -53510, -13865, -12882, -10720, -26337, -15418, 34468, 69405, 82278, 21566, -60604, -92645, -34937, -4315, 14957, 77920, 44644, -31212, -76139, -52745, -22143, 16427, -16569, -34762, -52600, -99767, -73537, -51222, -66343, -61822, -37935, -40274, -90390, -84117, -94390, -84903, -116382, -139835, -81658, -78150, -45818, -42437, -39366, -38451, -81310, -10747, 74744, 48802, 26140, 21632, 37090, 46670, 8301, -43103, -62749, -75264, -59256, -40438, -55141, -10308, 77317, 108619, 68816, 47569, -7923, -40096, -16480, -28678, -20859, -42793, -53784, 13057, 47386, 55123, 60612, 10285, -31058, -19458, 4633, 22191, 54117, 44142, 6271, -29790, 11206, 10728, -16674]
6197a6674r076L8012j8237m4997j0041K0877j9572N4466o9120J960Q3719m2270
6185c0953l2803J1082N0580L648p5189L068p291L3946O0359k1083O0401K0351
6173G6116k2569o6747m7851j6441P3062m5735N172L6022J3123k1922j4474J2229
6161b0015n7836J7376R3861m0010j6806K3913L0147j7497p4919K7301P6516j5718
6149B6313n6175l5015K2946l2098K644K3285P9182k5419q337M0284L2472l7070
6137C3012l8668L6723j3616l4373K1577O664k7233k5468k8415J7078O960M2138
6125c621P2006l5659m5989k1216j6504n0475L0442O3732k8614j6852K0486J7962
6113a4302L3688j883O530m021j2742j0799k8273p5603j2775P5222l1013k3434
$$ y = [-16674, -25750, 12262, -5975, -50972, -61013, -40136, -59708, -5242, -74362, -72402, 11317, -30953, -63756, -52674, -2094, 1554, -73635, -70567, -77858, -43912, 16447, -4636, 55765, 76116, 53547, -13200, -61051, -77492, -4430, -50165, -44993, -8971, 4152, -17770, -32244, -20015, -77851, -60475, 33386, -6624, -23430, 483, 30630, 13133, -61786, -34485, 42031, 26313, -29862, -64877, -41931, -74029, -71385, -48100, 31082, 5663, -2674, 37610, 70082, 33012, -5656, 31067, 17451, -16922, 4655, 11319, -15914, -41382, -69797, -52719, -45759, -3621, 68385, 32726, -13263, -34479, -50983, -101458, -71016, -7284, -35898, -52750, -32264, -14302, 19386, 17503, 24033, 20012, 7270, -3529, -31802, -107405, -120180, -44958, -75971, -99405]
6101i9405O8838J11621K455R982k7653r8409k6230K9861J6198n5286Q008j0621
6089g0641N1074N3675K1014O0824j3964l73n7512Q8205j6652p2138m0760J5506
6077A8258K2201K4646o3588k7797j0619j0001O7497J1952O58P054P0062j1030
6065I9293o3893n1812L0382J3372m0773O1941M3211K212m2086o5569k8360L3516
6053h566k7509n3288m1356j5263j928N4318L2571M004J3656K7461N6553L7889
6041G8542j2808o2401n8446J4323N1950K6864m3242N241K0515p3389n6789K7770
6029h1870O7959M8430l3810n5866k5947K8240P3966L7086m5159r8634k8904j1313
6017a25822J7945P4940l2154k3912q330l1765n345M916M2112L7267P0667P5370
$$ y = [-99405, -30567, 81054, 83509, 93491, 65838, -32571, -58801, -28940, -12742, -68028, -60020, -70641, -19567, 34108, 55122, 115946, 101982, 101609, 44097, 132302, 115650, 43512, 2752, 18258, 40459, 65105, 1517, -26280, -36899, -46900, 20597, 32549, 33207, 40261, 110323, 99293, 35400, -16412, 13970, 27342, -13431, 48510, 91721, 93933, 51847, -13722, -42082, -8566, -36075, -89363, -130719, -145982, -147910, -93592, -61021, -57017, -43361, -15900, 40653, 78542, 65734, 3333, -55113, -40790, 11160, 38024, -5218, 23, 20538, -52851, -109640, -81870, -13911, 34519, 709, -55157, -81104, -52864, 21102, 58188, 13029, -85605, -114509, -125822, -107877, -32937, -65091, -89003, -97333, -129098, -134443, -129527, -87415, -50148, 20519, 95889]
6005I5889R222l6819j5343J0402l7854l6905l2973n4010J9142J8689j7888k3995
5993a02443o872Q4729L0922j1390R423K9621N8446l3704l3549O3876Q159o5918
5981C1300q2362o1135J9221L2715o224K7876L9814j0695m729K6028L5145l6647
5969A0307l9011K7041K5823M4449m4631m6753l3423J1209k0774k156J4650K2284
5957c0985L5577J5520k3595M846J7270k854o4682L3184M5123L316J5951P0043
5945A18714q0931k2226J3443P7941m1480n3942O228P625r29J4463J7777k2143
5933C4540J088l8192l3775j5017o8140O828N6480N1164l0135j651j4394n7129
5921a08333j6041P268N3209k097P03O0634K7707k4770j0689L3373J059p130m1062
$$ y = [95889, 105111, 68292, 52949, 63351, 25497, -11408, -44381, -98391, -79249, -60560, -78448, -102443, -109315, -24586, 6336, -5054, 4369, 33990, 92436, 58732, 25183, 89059, 97218, 31300, -51062, -112197, -92976, -60261, -66485, -38609, 1205, -9490, -14219, 11809, 46954, 10307, -28704, -1663, 24160, 68609, 23978, -22775, -56198, -44989, -65763, -67919, -53269, -30985, 4592, 20112, -3483, 1363, 18633, 15779, -48903, -15719, 29404, 32720, 48671, 118714, 37783, 15557, 29000, 106941, 65461, 11519, 17747, 25372, 24443, 38906, 56683, 34540, 35628, -2564, -36339, -51356, -119496, -112668, -56188, -5024, -35159, -36810, -51204, -108333, -124374, -117106, -63897, -65994, -65291, -4657, 23050, -1720, -12409, 20964, 22023, 14893, -26169]
5908b6169N653M392K762j4237M2540r332q596m6287M6631L4613N3717N1681n4660
5895H2708J5643k0280n5848o148Q447n930m8107l0453l0194n786L4031M5027J4980
5882a910J9266N69J4923K9789J1876p4042m3132K7194j8291o8909l838k674m700
5869a13879M4323L4416N4170K5988l8878L8683L4392m3417n8605m2022N9788P5161
5857G0120k7063R390K8148j8667m4445m6121P570K5489L0218o7503k0562J02246
5845D8820J9417o3842k8146j058o94P421m4336k1669K876l8803k3964K9075M1746
5832g3157O2480L2905k4432j8427m1977k9924j9293Q6263K1829o2548k6391J8073
5820g4599J8689m195M4726l471L434M7425K1018m5650k5909n0567p2471O7295
$$ y = [-26169, -20516, -16124, -13362, -27599, 14941, 5609, -2987, -49274, -2643, 31970, 85687, 137368, 82708, 98351, 78071, 22223, 16075, 24522, 18592, -29515, -59968, -90162, -95948, -61917, -16890, -1910, 17356, 17925, 32848, 62637, 74513, 471, -42661, -15467, -33758, -102667, -106505, -109179, -113879, -69556, -35140, 19030, 45018, 6140, 44823, 79215, 35798, -22807, -64829, -5041, 70120, 43057, 52447, 80595, 61928, 17483, -28638, -21068, 4421, 34639, -32864, -53426, 48820, 68237, 4395, -23751, -24809, -25503, -18082, -62418, -84087, -81211, -120014, -143978, -114903, -73157, -10677, 22228, -2204, -20631, -62608, -92532, -111825, -25562, -3733, -66281, -92672, -74599, -55910, -60105, -15379, -18850, -15416, 32009, 53027, 7377, -18532, -69099, -141570, -74275]
5808g4275L8059M6330K6433l0793m8298J7390J3453L27J2676j8116o451R785n7016
5795g0496m2938K2136N7766M2391p5073o6791J9060M6307K3243r700K2337L6020
5783D262J6488P788l3706k8266k2357n1990k2695L5236M8135j2652O7971J3404
5771B1618l4096k6847K3071L7553J5315Q68o2304M6816P192q477k2872k1262L2173
5758H748L2429k8877p0269j4909M3886J1654J4577P647p915R547K6004L4965n6697
5745A0790j5149M0219o3379m7648q13N820N245N5044j0414K258o7013j0845O3362
5732c2523R404P340R02K1699o578L0423j7441l01K9436k1067n2015l1218P0263
5719H324J3175k6958m2840M7519k03Q3O0804j7492n5817j9795k473L973J0322
$$ y = [-74275, -36216, 10114, 36547, 5754, -42544, -25154, -11701, -11374, 1302, -16814, -23265, -13480, -70496, -113434, -91298, -33532, 8859, -66214, -133005, -113945, -67638, -44395, -54095, -31758, 4262, 20750, 28538, -5168, -33434, -55791, -107781, -130476, -95240, -47105, -59757, 8214, 21618, -12478, -39325, -16254, 21299, 36614, 37482, -24822, 21994, 29186, 20709, -2163, -23425, 8748, 41177, 12300, -57969, -72878, -28992, -17338, -2761, 4886, -3029, 6518, 32522, 67487, 10790, -4359, 35860, -27519, -75167, -75980, -70160, -64915, -9871, -20285, -18027, -85040, -95885, -32523, -23119, -15779, -14877, 6822, 244, 30667, 13226, 12925, 42361, 21294, -30721, -61939, 8324, 21499, -5459, -48299, -780, -983, -900, 59904, 42412, -13405, -33200, -35673, -31700, -21378]
5706b1378r556R0769M541l8978j8434M2796j8256q2004q5627l483O7228M064J0510
5693e7808J0579M9662N7038K0492j8365o1384l5815J5102K6157N506j1408J6510
5681A6266m157l9452J3400L0059K5039k8506n9734l8436k0500J23282Q1079n8118
5669D0222m3649o2669j7608L5050J1515K672l1115l8800P8701Q6065j9210p891
5657C3283J678j5800M6074K2788o7352n8463k2179k505l276J808K1909j7536L3207
5644b6364O5583N2365k126p7947o7720K8929M1591J3759m090k908J00152l7062
5632H4162n3500J1663p93m9686L9947K5351K9111K6770p2151j18606J773L1446
5620d4513l5714n5273J3849Q4177M4257L2709l7433J371M9339J5841j1874j4580
$$ y = [-21378, -30934, 59835, 64376, 25398, 6964, 49760, 31504, -50500, -136127, -139610, -72382, -68318, -57808, -47229, 2433, 59471, 79963, 61598, 214, -35601, -20499, 5658, 11164, -244, 16266, 12109, -27343, -13943, 16116, 41155, 12649, -47085, -85521, -106021, 17261, 98340, 40222, -3427, -66096, -83704, -48654, -37139, -34467, -65582, -104382, -25681, 60384, 41174, 33283, 34961, 19161, 65235, 88023, 20671, -37792, -59971, -62476, -65752, -63944, -42035, -59571, -26364, 39219, 91584, 89458, 11511, -56209, -27280, 14311, 28070, 23980, 21072, 121224, 84162, 30662, 42325, 41532, -8154, 31793, 57144, 86255, 113025, 40874, -77732, -75959, -44513, -80227, -135500, -121651, -37474, 6783, 39492, 2059, 3430, 52769, 68610, 56736, 42156]
5608D2156L31K2391l4538j9428Q228n1030m3479L0232L5122K8485K2109n2779
5596a2200k7409k0548k1182K6047l756K0458K2059J9084l971j1679P3520L1521
5584I1944p4623p1729O702j4506J0580K5841J1952J2183J0280J5621l9314j7955
5572c3024j555l0785n9268J8212M2175q506O747L2766L6734j6595J1170n1046
5560e2975l1989R773K200j8766M2272M2322o5062K4487j2617n0660p958K7143
5548i1830L8003N2790R976o8825M448J4821M2882Q664l156p518N0248j6280n8162
5535b3939k136K8868L0710J8835J8491m634m9476j2154k195J0005m151k0388O111
5522f053p774j2556J5270K4512k7917K6922J9255l8794K464J6426k7924l284o1826
$$ y = [42156, 42487, 64878, 30340, 10912, 19140, -31890, -75369, -45137, -10015, 18470, 40579, -12200, -39609, -60157, -81339, -55292, -59048, -38590, -16531, 2553, -1418, -13097, 60423, 91944, 17321, -54408, -47706, -62212, -51632, -25791, -13839, -1656, 8624, 24245, -15069, -33024, -34579, -65364, -124632, -106420, -64245, -72751, -66004, -33238, 3496, -13099, -1929, -52975, -84964, -75191, -72991, -91757, -49485, -7163, -72225, -47738, -60355, -111015, -118973, -91830, -53827, -1037, 8939, -59886, -55438, -40617, 2265, 10929, 7773, 255, 50503, 34223, -23939, -26075, 2793, 33503, 52338, 70829, 66195, 16719, 4565, 2370, 12375, 8224, -12164, -6053, -13827, -26383, -11113, 13399, -14518, 12404, 31659, -7135, -4671, 11755, -16169, -19453, -81279]
5509h1279J9943K4911L418L7928k2975j8797m9563O462O6155m9551j7854K7007
5497e4195K296J6808j8839j9689M4192k0930j6040N8928M107j0339K3346J2481
5485B2126J0123m0088n4495l2451k1037M0042J09718j2465k5821m2116J0329k4001
5473f0136l6782Q5677J00875J6983L469j1951j1162p1859p2507j0421K8600o973
5461d6187J9045K6476k1716J9332l2197J8458P2675K8859P707l5291o8925o6155
5449g7919N741N2488L2585k3418L7046N7213k2599K1126k6306L2848j109n5705
5437C1991j3103N9529j0063p4819l2379P091j3601J2153M6446L4522L3523m2714
5425C8576j3260O1j7911L5853j7145N9029M1929j04546r5154M9254o17J0590K8054
$$ y = [-81279, -61336, -36425, -33007, 4921, -18054, -36851, -86414, -79952, -13797, -63348, -81202, -54195, -51899, -35091, -53930, -73619, -29427, -50357, -66397, -7469, -3362, -13701, 9645, 22126, 32249, -7839, -62334, -94785, -115822, -75780, 33938, 21473, -4348, -46464, -36135, -60136, -96918, -11241, 89634, 106617, 110086, 98135, 86973, 15114, -57393, -67814, -39214, -46187, -27142, -666, -22382, -3050, -35247, -16789, 55886, 84745, 92452, 57161, -11764, -77919, -72178, -19690, 12895, -10523, 26523, 83736, 61137, 82263, 55957, 88805, 87696, 31991, 18888, 78417, 68354, -6465, -38844, -31753, -45354, -33201, 13245, 47767, 81290, 38576, 25316, 25377, 7466, 43319, 26174, 85203, 127132, 22586, -72568, -23314, -23931, -13341, 14713]
5412A4713K5459j981m9627l7034O516K0269Q005l2543K1981l7744n425K8260M3983
5399D832K5391k4005n0102p4336l9243k0812K2069Q7691R2765L710l7489M4340
5387C4811n3644m1575n531M0678J7742l4465k0158J4035M0996j2291l0714L7240
5375a2876O1063k1849j7397J8928L9561k1210n7278K2434l3236l7049J379J9674
5363c7856R300M2990N0819J2899o121m3736n1556j7927n226J4078L4918Q2158
5351H4740K1233K80l985l9185k9999m4343K6725K9721l3266K7379L3959k4696
5339D8563J6553J3948m6609J178L5225k5535J995K3289J3610l3409P218q846j03495
5326e6315j4804N6794l2175k7173j987J2094q677j4444j9367K862P6747L5494
$$ y = [14713, 40172, 38191, -11436, -48470, -41954, -21685, -13680, -46223, -24242, -61986, -67411, -39151, 4832, 30223, 6218, -43884, -118220, -157463, -178275, -156206, -68515, 24250, 27960, -9529, 34811, -18833, -60408, -65939, -25261, -7519, -41984, -62142, -48107, -7111, -19402, -50116, -12876, 48187, 26338, 8941, 27869, 67430, 46220, -11058, 11376, -21860, -58909, -57530, -37856, -28556, 14434, 65253, 78152, 72031, 28295, -23261, -41188, -46414, -32336, 2582, 84740, 105973, 106253, 102268, 63083, 33084, -11259, 15466, 45187, 11921, 39300, 73259, 48563, 65116, 79064, 32455, 33633, 68858, 43323, 45318, 68607, 82217, 48808, 56026, 47180, -56315, -71119, -14325, -46500, -73673, -75660, -63566, -72243, -86687, -106054, -103192, -26445, 9049]
5314I049r710K4120k255N030Q9569N8363r047p4316q1274j6128J00383K592m657
5301I1719n783o1742n7893k467J08783l5994j36002o0933N4420N596P523N5986
5289c6787j5241l3865k5188J1760J8733j3888K3037O4677L509J1569l4557k084
5277b8325n853k1784M869m0686M6483l4034k155J0635J8197j5203k0510J3115
5265g5251Q3283j8938l5003n7419K1919j8521o093N7053L5612m8567m966k3396
5253i0287m443j7477K2570j183O782J4551K7853l4178l5053J5695J3066J4640
5241f7464M5145r039J8312R806L531K1304L4875p8493p5843O321P3961N0817j0677
5228B2556K6531M98L1689J2005j22874l9808M0950P871L7406n919j4058j6321
$$ y = [9049, -661, 23459, 21204, 26234, 115803, 174166, 165119, 90803, 9529, -6599, 93784, 96376, 91719, 85936, 24194, -33699, -36166, 72617, 36623, -99379, -160312, -105892, -100296, -92773, -36787, -52028, -85893, -111081, -99321, -80588, -94476, -71439, -6762, -3253, 8316, -26241, -28325, -34178, -55962, -51093, -91779, -45296, -79330, -81485, -70850, -52653, -67856, -88366, -75251, 8032, -10906, -45909, -103328, -81409, -99930, -106023, -48970, -13358, -61925, -66891, -90287, -94730, -112207, -89637, -90820, -84038, -69487, -41634, -75812, -110865, -95170, -82104, -67464, -22319, -31358, -13046, -3240, 291, 21595, 56470, -22023, -97866, -91545, -17584, 33233, 22556, 49087, 49585, 81274, 93279, -29595, -69403, -28453, -20582, 16824, 10905, -3153, -19474]
5216a9474l9447l8332J0210m8695n3741L6676N3671j3304M602l2379P3427O4103
5204b683k69q4658k168Q0629j882m9774k3877k9578M0273J2899L4528N4154N5887
5191H3481j2487k6503n2476j43053k5391O8777M3197M7484O6324l2199k6955m4702
5179e4503Q956M2192M2612K4743K2595j3531m1762o0616k3169O8471j5230l7431
5167c6673m668j9748p225L557K0179N3197k7813k8789k4562J1334M8257M2684
5155B9730o0837J1430m1697L8811K5819o183K815m4132l7730o484k953N0680M9574
5142H843K5392L1296N1548J9031K0539p5728q4481M0553L7602m0664k8476k7826
5130b2371n1235l0934p558L2621L3148M0547k7983O85n643K3881l8245m4135J8923
$$ y = [-19474, -58921, -97253, -87043, -135738, -189479, -152803, -99132, -112436, -107834, -140213, -66786, -2683, -2952, -87610, -89778, -9149, -11031, -60805, -84682, -114260, -73987, -61088, -26560, 27594, 83481, 70994, 44491, -7985, -151038, -176429, -107652, -64455, -16971, 49353, 17154, -9801, -54503, -45547, -3355, 39257, 64000, 86595, 73064, 31302, -29314, -52483, 15988, 758, -36673, -41341, -61089, -68314, -64757, -44578, 8619, -19194, -47983, -72545, -61211, -12954, 29730, -31107, -19677, -61374, -22563, 3256, -2927, -112, -44244, -81974, -88458, -91411, -40731, 8843, 34235, 65531, 117079, 136110, 156649, 80921, -3560, 36993, 74595, 33931, 5455, -22371, -73606, -104540, -112098, -79477, -46329, -5782, -33765, -33080, -38723, -14842, -53087, -97222, -78299]
5117g8299K6096L1515N0696K0588K406L8204o613r1364r9367J1128P2028M431
5105a8551J5637L4573J7677k5402j5319J0970m1316N4259l5460p1701o3227J4239
5093a23621L5876O4717j6684j9781L2241N220M7888M8240k7414M695K3425m4197
5081C0605q1678l0414L6032K3543m421l1059L692K6370Q4790r14j3924K7619N5711
5068A25952q706k6885K90p0723m0202P397j5427K896k3699M0102L594M6176R059
5055D9824o5768k5122j0575N4285M1693J040j3501q5452l3679K4319j4390k5140
5043a02466K3502p817K0802L3321O6902m907J2638K9556m8752j06406j0686Q3557
5031a0756K7012J7300N990o0029p742L5906M4124l1398J7173L636p6005M360j8345
$$ y = [-78299, -52203, -20688, 30008, 50596, 53002, 91206, 84593, -6771, -106138, -95010, -22982, -18551, -2914, 31659, 49336, 23934, 8615, 19585, -21731, 32528, -2932, -74633, -137860, -123621, -87745, -23028, -39712, -59493, -27252, -22032, 25856, 74096, 46682, 51377, 74802, 30605, -51073, -81487, -45455, -21912, -26333, -57392, -53700, -27330, 57460, 56546, 42622, 70241, 125952, 117246, 90361, 90651, 19928, -20274, -12877, -28304, -25408, -49107, -9005, -5411, 40765, 49824, -15944, -41066, -51641, 2644, 44337, 45377, 31876, -53576, -87255, -62936, -77326, -102466, -78964, -86781, -65979, -32658, 34244, 29337, 41975, 71531, 22779, -83627, -94313, -10756, 16256, 33556, 39546, -20483, -28225, 7681, 51805, 20407, 37580, 41216, -34789, -30429, -48774]
5018d8774m2326L9617J5519L8171n507l0692K3801N1458M4910R588l1604o9556
5006e395k9918K064j2366L1107L5042K5210k7359l9701k9181k3903K318J6904
4994e5178p040M326R197k0323K5861L4968k1490k4629m6260p434L6629r214M241
4981g6346M4686l0907J3907j6809L0443N2221L357K1589j9911q172n7986l9196
4969h3124M313M5367O0010K3550k9303j4993O756N74J888m0993K6597J5874O0965
4956G7481j3105o1830j7352O4200P501o8230m4914J0621L8612m857l8127j7120
4944f7120m2538J6628J146k0796k8859L8091O7439J6337J1665J8249m266N1694
4932E7670K1160j21J6380J869k1658o9933n5170J7543k816K3264L3278l1541N955
$$ y = [-48774, -91100, -51483, -35964, 2207, -3300, -33992, -10191, 41267, 86177, 95765, 64161, -5395, -35313, -33249, -45615, -14508, 20534, 45744, 18385, -21316, -50497, -74400, -72082, -55178, -62218, -57892, -48695, -69018, -43157, -8189, -29679, -54308, -100568, -108002, -71373, -80587, -76346, -31660, -62567, -48660, -65469, -35026, 17195, 20552, 42141, 22230, 14058, -43928, -83124, -78811, -33444, 26566, 50116, 20813, 5820, 12576, 13150, 15038, -25955, 642, 16516, 77481, 64376, 2546, -14806, 49394, 56895, -11335, -56249, -45628, -7016, -11873, -50000, -67120, -109658, -93030, -91884, -112680, -141539, -103448, -36009, -19672, -8007, 10242, 5976, 57670, 78830, 78709, 95089, 96958, 75300, 5367, -49803, -32260, -35076, -11812, 21466, -10075, -4120]
4919d120l757n0442N1041P8320m5240p7301k9447K0160K4318k1428M6889m824
4907a5831J244m6Q275O425r357j5727l4087o531N1123M1258N198q4126o788N5283
4893c687L5924J7856J8255j4133m9116p804J5148j3978j3901R820J7347k4994
4881a3263m7476K9677j7062l6094J02331R992L323J9187r726O952J6363L6114
4869A00318j3951o6344p2037K6843L4966M3212J0658l9468k5050m016l2903j7824
4857e5596N1893M1474l0218k6771n157L626J9513J414L0516L4142K3250J0640
4845I8726o5790M1717J9593k8425k8214m5151m5030J878J2147m6805o667p245
4833i9266K675k0327J0566L1850k77l3039O372O0939M3890l616j6682l2836k729
$$ y = [-4120, -7877, -58319, -7278, 71042, 25802, -51499, -80946, -60786, -36468, -57896, -11007, -15831, -14587, -14633, -6358, 67, -9290, -25017, -59104, -65635, -14512, 26746, 31944, -52182, -58970, -3687, 32237, 50093, 68348, 54215, 5099, -2705, 12443, -1535, -15436, -5616, 11731, -13263, -60739, -31062, -48124, -84218, 18113, 28105, 31428, 50615, 40889, 47841, 64204, 100318, 86367, 20023, -52014, -25171, 9795, 53007, 63665, 24197, -853, -4869, -37772, -55596, -3703, 37771, 7553, -19218, -24375, -20749, -1236, 178, 30694, 64836, 88086, 98726, 32936, 74653, 94246, 65821, 37607, -7544, -52574, -50696, -38549, -85354, -92021, -99266, -96591, -116918, -106352, -74502, -74779, -107818, -101446, -40507, 3383, -233, -16915, -49751, -52480]
4820e2480J7387O4491k6054o0481Q720O1924J1255k653n1797J2071K4154K9890
4808C6427n374J9874o5604m4433L0728K8394K6057k7625N7j6148q302R347k7205
4795d3807K6887K6666k0052j8346K6276l6441m6039K1066L2546M8471L5867K6665
4783G9759o0678m1117J7770K5835l011k2117j7250L2020Q211M1606j7618k2838
4771B0572J9473L4361o2905m9645P149M771o2616l2261m3562K9217R094L8469
4759h7883j9311J57O2596M5757K2703m1367q987p558L1502L9897k2618p2759l3698
4746i1569N6767J8148l1889M0013O0289K5084j1887p2654k6167K3865K2349M1142
4734E3491m1036k3780M2184K3611j1470p7679p1083Q771P3917K8156k290O0131
$$ y = [-52480, -35093, 29398, 3344, -57137, -48417, 13507, 24762, 22109, -29688, -17617, 6537, 36427, 31053, 50927, -14677, -59110, -28382, 12, 26069, -1556, -1499, -17647, -25949, -16602, -43807, -16920, 9746, -10306, -28652, -2376, -38817, -84856, -63790, -31244, 17227, 53094, 79759, 19081, -22036, -4266, 21569, 18558, -3559, -20809, 11211, 19422, 61028, 43410, 20572, 40045, 74406, 11501, -38144, -30995, -26224, -88840, -121101, -164663, -135446, -126352, -87883, -107194, -107037, -44441, 1316, 24019, -17348, -26335, -33893, -2391, 37506, 14888, -57871, -91569, -34802, -16654, -48543, -8530, 51759, 76843, 64956, -7698, -33865, -10000, 12349, 53491, 12455, -11325, 30859, 54470, 43000, -34679, -105762, -96991, -23074, 5082, 2792, 62923]
4722F2923j5648m9447j8029L3065l1568o379L5308Q1611M4339R0r581o8893n6252
4709A539k8463j7295Q5257K4756l110N0988M7850J393o5500k2720n7557p328N5784
4696F5594p435j6848k4896K646K5466K1720P9892k7954r8447k5111M1790j1959
4684B4458K2224l6386n4503o368Q544l3088l2642N3047j34O650J9893M2132l3643
4671a9816m0095J7245o460j3270j846N1883K8071M956j1155k6436J3037Q055L6301
4658D0470J2046l7205O964j0518M997k8488J8585n045p4799l8129L4066N1486
4646b5570K213N957J1957M4513M1310j6031j3593j722k7747n1905J92j0490l5404
4633g6320n6921M1480M5898L5893K184J2740j0933L7651J4789k6281m81J9645
$$ y = [62923, 47275, -2172, -20201, 12864, -18704, -25083, 10225, 91836, 136175, 136265, 126684, 57791, 1539, -26924, -44219, 41038, 65794, 62684, 113672, 161522, 162915, 97415, 74695, 17138, 9810, 65594, 58159, 41311, 16415, 19061, 44527, 66247, 146139, 118185, 19738, -5373, 36417, 24458, 46682, 10296, -44207, -50575, -42031, -75119, -107761, -54714, -54848, -48198, -28305, 13827, -19816, -59911, -42666, -49126, -62396, -64242, -12359, 15712, 20668, 9513, -16923, -3886, 4169, 40470, 52516, 15311, 22275, 11757, 16754, -11734, 6851, 1806, -72993, -111122, -77056, -25570, -23357, -17400, -5443, 39070, 80380, 64349, 50756, 49034, 21287, -30618, -30426, -40916, -76320, -133241, -91761, -45863, -9970, -7786, 4954, -5979, 31672, 46461, 20180, 19699, 39344]
4621C9344j5680p83J6448q0148j1955J01440N2040q514k9862o5915k1713m6940
4609g2238O254N468J9399j8431N3585N4260K243k0578l7288j2595n209J5915l0314
4596c9529j7626L2566N0101P240l3499m2664J4265j1195p117k884L6262L9269
4584B5189j3368l5864L8064K2518r466j6422j6023j4233M6529M135l7469p406
4572a3816k8334Q260L5371J3419j5550l1493J666J0580k1014j0915L3547N7898
$$ y = [39344, 23664, 22881, 39329, -40819, -52774, 48666, 100706, 92192, 62330, -3585, -25298, -72238, -65984, -60516, -41117, -59548, -5963, 48297, 50540, 29962, -7326, -19921, -25130, -9215, -39529, -57155, -24589, 25512, 32752, -747, -43411, -29146, -40341, -47458, -50342, -14080, 25189, 11821, -24043, 14021, 36539, 27073, 10651, -5372, -19605, 26924, 31059, -6410, -13816, -42150, -33890, 1481, 14900, -650, -32143, -30477, -19897, -40911, -51826, -18279, 39619]
$$ [...]
##END NTUPLES=NMR SPECTRUM
##END=
