##TITLE=Analysis number 313828
Compound Code cc 06304
Book Reference 440/66
Project Code adrs
Chemist Name craigr
##JCAMPDX= 6.0         $$ Bruker NMR JCAMP-DX V2.0
##DATA TYPE= NMR SPECTRUM
##DATA CLASS= NTUPLES
##ORIGIN= Bruker BioSpin GmbH
##OWNER= NMR
$$ XWIN-NMR		Version 3.5
$$ Fri Sep 23 09:23:12 2005 GMT Daylight Time (UT+1h)  MAYBRIDGE\NMR@NMR_250MHZ
##.OBSERVE FREQUENCY= 250.131544655141
##.OBSERVE NUCLEUS= ^1H
##.ACQUISITION MODE= SIMULTANEOUS (DQD)
##.ACQUISITION SCHEME= undefined
##.AVERAGES= 16
##.DIGITISER RES= 18
##SPECTROMETER/DATA SYSTEM= dpx250
##.PULSE SEQUENCE= zg30
##.SOLVENT NAME= CDCl3
##.SHIFT REFERENCE= (INTERNAL, CDCl3, 0, 16.4487)
##AUDIT TRAIL= $$ (NUMBER, WHEN, WHO, WHERE, WHAT)
$$ ##TITLE= Audit trail, XWIN-NMR		Version 3.5
$$ ##JCAMPDX= 5.01
$$ ##ORIGIN= Bruker BioSpin GmbH
$$ ##OWNER= NMR
$$ C:\u/data/dgb/nmr/ADRS/9850/pdata/1/auditp.txt
$$ ##AUDIT TRAIL=  $$ (NUMBER, WHEN, WHO, WHERE, WHAT)
(   1,<2005-09-23 09:22:40.46 +100>,<MAYBRIDGE\NMR>,<NMR_250MHZ>,
      <created by zg, POWCHK disabled, PULCHK disabled
       configuration hash MD5:
       62 19 C7 07 E1 42 D1 B7 37 6C 3D D0 77 39 F9 E6
       data hash MD5: 64K
       76 42 07 7B D3 8D 57 84 D4 6F 09 5C AE 7E 08 A0>)
(   2,<2005-09-23 09:22:52.74 +100>,<MAYBRIDGE\NMR>,<NMR_250MHZ>,
      <Start of raw data processing
       ef LB = 0.3 FT_mod = 6 PKNL = 1 SI = 32K 
       data hash MD5: 32K
       47 53 FC D6 49 44 C3 13 F6 13 25 A4 97 C1 9B 35>)
(   3,<2005-09-23 09:22:54.39 +100>,<MAYBRIDGE\NMR>,<NMR_250MHZ>,
      <apk 
       data hash MD5: 32K
       E0 63 74 85 D4 E5 29 9F 37 AB 43 7C 5A CB 79 3A>)
(   4,<2005-09-23 09:22:55.13 +100>,<MAYBRIDGE\NMR>,<NMR_250MHZ>,
      <abs ABSG = 5 
       data hash MD5: 32K
       B3 90 A3 58 90 D5 37 DE C3 24 19 89 2D 76 95 26>)
$$ ##END=
$$ 
$$ hash MD5
$$ 87 7F B8 2B D7 CA E9 74 94 F7 98 70 16 B4 3B D4
##$RELAX= 
##$RELAX= 
##$RELAX= 
##$RELAX= 
##$RELAX= 
##$RELAX= 
##$RELAX= 
$$ Bruker specific parameters
$$ --------------------------
##$DU= <C:\u>
##$EXPNO= 9850
##$NAME= <ADRS>
##$PROCNO= 1
##$TYPE= <nmr>
##$USER= <dgb>
##$AMP= (0..31)
100 100 100 100 100 100 100 100 100 100 100 100 100 100 100 100 100 100 
100 100 100 100 100 100 100 100 100 100 100 100 100 100 
##$AQSEQ= 0
##$AQ_mod= 3
##$AUNM= <au_zg>
##$AUTOPOS= <6 >
##$BF1= 250.13
##$BF2= 250.13
##$BF3= 250.13
##$BF4= 250.13
##$BF5= 500.13
##$BF6= 500.13
##$BF7= 500.13
##$BF8= 500.13
##$BYTORDA= 1
##$CFDGTYP= 0
##$CFRGTYP= 5
##$CHEMSTR= <none>
##$CNST= (0..31)
1 1 145 1 1 1 1 1 1 1 1 1 1 1 1 1 1 1 1 1 1 1 1 1 1 1 1 1 1 1 1 1 
##$CPDPRG= <>
##$CPDPRG1= <>
##$CPDPRG2= <>
##$CPDPRG3= <>
##$CPDPRG4= <mlev>
##$CPDPRG5= <mlev>
##$CPDPRG6= <mlev>
##$CPDPRG7= <mlev>
##$CPDPRG8= <mlev>
##$CPDPRGB= <>
##$CPDPRGT= <>
##$D= (0..31)
0 1 0 0 0 0 0 0 0 0.06 0 0 0 0 0 0 0.0002 0 0 0 0 0 0 0 0 0 0 0 0 0 0 
0 
##$DATE= 1127463759
##$DBL= (0..7)
120 120 120 120 120 120 120 120 
##$DBP= (0..7)
150 150 150 150 150 150 150 150 
##$DBP07= 0
##$DBPNAM0= <>
##$DBPNAM1= <>
$$ [...]
##$SUBNAM7= <"">
##$SUBNAM8= <"">
##$SUBNAM9= <"">
##$SW= 20.6930455092707
##$SWIBOX= (0..15)
0 0 3 0 0 0 0 0 0 0 0 0 0 0 0 0 
##$SW_h= 5175.983436853
##$TD= 65536
##$TD0= 1
##$TE= 294.16
##$TE2= 300
##$TE3= 300
##$TEG= 300
##$TL= (0..7)
0 120 120 120 120 120 120 120 
##$TP= (0..7)
150 150 150 150 150 150 150 150 
##$TP07= 0
##$TPNAME0= <>
##$TPNAME1= <>
##$TPNAME2= <>
##$TPNAME3= <>
##$TPNAME4= <>
##$TPNAME5= <>
##$TPNAME6= <>
##$TPNAME7= <>
##$TPOAL= (0..7)
0.5 0.5 0.5 0.5 0.5 0.5 0.5 0.5 
##$TPOFFS= (0..7)
0 0 0 0 0 0 0 0 
##$TUNHIN= 0
##$TUNHOUT= 0
##$TUNXOUT= 0
##$USERA1= <user>
##$USERA2= <user>
##$USERA3= <user>
##$USERA4= <user>
##$USERA5= <user>
##$V9= 5
##$VALIST= <valist>
##$VCLIST= <CCCCCCCCCCCCCCC>
##$VD= 0
##$VDLIST= <DDDDDDDDDDDDDDD>
##$VPLIST= <PPPPPPPPPPPPPPP>
##$VTLIST= <TTTTTTTTTTTTTTT>
##$WBST= 1024
##$WBSW= 4
##$XGAIN= (0..3)
0 0 0 0 
##$XL= 0
##$YL= 0
##$YMAX_a= 433970
##$YMIN_a= -410520
##$ZGOPTNS= <>
##$ZL1= 120
##$ZL2= 120
##$ZL3= 120
##$ZL4= 120
##$ABSF1= 16.4487
##$ABSF2= -4.244473
##$ABSG= 5
##$ABSL= 3
##$ALPHA= 0
##$AQORDER= 0
##$ASSFAC= 0
##$ASSFACI= 0
##$ASSFACX= 0
##$ASSWID= 0
##$AUNMP= <proc_1d>
##$AZFE= 0.1
##$AZFW= 0.1
##$BCFW= 0
##$BC_mod= 0
##$BYTORDP= 0
##$COROFFS= 0
##$CY= 12.5
##$DATMOD= 1
##$DC= 0
##$DFILT= <>
##$DTYPP= 0
##$F1P= 14.0000005364418
##$F2P= -0.99999901652339
##$FCOR= 0.5
##$FTSIZE= 32768
##$FT_mod= 6
##$GAMMA= 0
##$GB= 0
##$INTBC= 1
##$INTSCL= 1
##$ISEN= 128
##$LB= 0.3
##$LEV0= 0
##$LPBIN= 0
##$MAXI= 10000
##$MC2= 0
##$MEAN= 0
##$ME_mod= 0
##$MI= 0
##$NCOEF= 0
##$NC_proc= -2
##$NLEV= 6
##$NOISF1= 0
##$NOISF2= 0
##$NSP= 0
##$NTH_PI= 0
##$NZP= 0
##$OFFSET= 16.4487
##$PC= 1
##$PHC0= -78.39204
##$PHC1= 6.828271
##$PH_mod= 1
##$PKNL= yes
##$PPARMOD= 0
##$PSCAL= 4
##$PSIGN= 0
##$REVERSE= no
##$SF= 250.130018333405
##$SI= 32768
##$SIGF1= 0
##$SIGF2= 0
##$SINO= 400
##$SIOLD= 32768
##$SREGLST= <1H.CDCl3>
##$SSB= 0
##$STSI= 32768
##$STSR= 0
##$SW_p= 5175.98343685301
##$SYMM= 0
##$S_DEV= 0
##$TDeff= 65536
##$TDoff= 0
##$TI= <Analysis number 999999
Compound Code 99
Book Reference 9
Project Code 9>
##$TILT= no
##$TM1= 0
##$TM2= 0
##$TOPLEV= 0
##$USERP1= <user>
##$USERP2= <user>
##$USERP3= <user>
##$USERP4= <user>
##$USERP5= <user>
##$WDW= 1
##$XDIM= 32768
##$YMAX_p= 388872333
##$YMIN_p= -52660
$$ End of Bruker specific parameters
$$ ---------------------------------
##NTUPLES= NMR SPECTRUM
##VAR_NAME=  FREQUENCY,     SPECTRUM/REAL,   SPECTRUM/IMAG
##SYMBOL=    X,             R,               I
##VAR_TYPE=  INDEPENDENT,   DEPENDENT,       DEPENDENT
##VAR_FORM=  AFFN,          ASDF,            ASDF
##VAR_DIM=   32768,         32768,           32768
##UNITS=     HZ,            ARBITRARY UNITS, ARBITRARY UNITS
##FACTOR=    0.157963299565203, 1,           1
##FIRST=     4114.3136203473, 0,             0
##LAST=      -1061.66981650571, 0,           0
##MIN=       -1061.66981650571, -52660,      0
##MAX=       4114.3136203473, 388872333,     0
$$ Real data points
##PAGE= N=1
##DATA TABLE= (X++(R..R)), XYDATA
$$ [...]
$$ plain form
19562 18743 29681 31501 23729 17928 8201 -2537 -6446 6978 16829 26812 33797 35949 32775 24041
19548 24041 21716 24942 33599 36367 40574 48766 45656 30653 14260 11956 12599 23256 43997 35018
19534 35018 19102 12108 21349 26067 25560 20035 21558 17380 36949 43298 34832 30331 28618 36067
19520 36067 29604 22198 24101 21256 26827 27556 28941 28250 23457 23676 18354 8092 18591 12864 -663
19505 -663 5209 10835 12518 9520 4837 6292 2093 5134 -3823 -6547 4068 10815 11916 10193 8847
19490 8847 15375 16374 5768 12123 3476 347 7955 18137 15732 11666 14033 25744 25619 22366
19476 22366 8725 -8330 -14868 5618 12786 2222 -1369 10619 7269 10217 11556 7792 5525
19463 5525 14475 4837 -11342 -3719 12409 9042 3613 4443 -3871 -7782 -636 -4279 -13641 -19616
$$ packed form
19562A8743J0938J820p772n801r727j0738l909J3424R851R983O985K152l174q734
19548B4041k325L226Q657K768M207Q192l110j5003j6393k304O43J0657K0741q979
19534C5018j5916o994R241M718n07n525J523m178J9569O349q466m501j713P449
19520C6067o463p406J903k845N571P29J385o91m793K19n322j0262J0499n727j3527
19505f63N872N626J683k998m683J455m199L041q957k724J0615O747J101j723j346
19490H847O528R99j0606O355q647l129P608J0182k405m066K367J1711j25l253
19476B2366j3641j7055o538K0486P168j0564l591J1988l350K948J339l764k267
19463E525Q950r638j6179P623J6128l367n429Q30q314l911P146l643r362n975
$$ plain form
19449 -19616 -8134 10443 29155 27014 23980 12082 9963 12912 9908 4546 5100 15557 24439
19436 24439 11661 13156 10964 6460 13148 6922 -6491 -2604 5326 6017 903 2178 4175 1431
19422 1431 4062 15305 10509 -1900 -1082 -1116 -8174 -2993 8463 17844 14224 -442 -5816 -14617
19408 -14617 -14299 -17064 -18212 -4929 -9257 -10582 -16422 -16210 -11765 -9442 101 9711 13381 16013 22238
19393 22238 15605 15342 6937 1534 4041 -513 5611 -2707 -1771 -4391 -3940 5122 5337 3449 -4411
19378 -4411 -8727 -12619 -7709 -3243 -6255 -10739 -7019 -13058 -9370 -15894 -29596 -20118 -11091 5178
19364 5178 12069 -3110 -2264 17100 24500 30274 11029 2132 3100 2503 -9395 -6698 -728 -6304
19350 -6304 -6805 -15472 -18160 -8723 -6804 977 12546 15098 8037 -402 -4551 -728 2383 -3029 -9220
$$ packed form
19449a9616J1482J8577J8712k141l034j1898k119K949l004n362N54J0457Q882
19436B4439j2778J495k192m504O688o226j3413L887P930O91n114J275J997k744
19422A431K631J1243m796j2409Q18l4p058N181J1456R381l620j4666n374q801
19408a4617L18k765j148J3283m328j325n840K12M445K323R543R610L670K632O225
19393B2238o633k63q405n403K507m554O124q318R36k620M51R062K15j888p860
19378d411m316l892M910M466l012m484L720o039L688o524j3702R478R027J6269
19364E178O891j5179Q46J9364P400N774j9245q897R68n97j1898K697N970n576
19350f304n01q667k688R437J919P781J1569K552p061q439m149L823L111n412o191
$$ plain form
19335 -9220 -25212 -32964 -21713 -21448 -10280 -7235 -1891 11231 5771 7226 12176 17306 12884 9939
19321 9939 3927 6499 20346 29090 18046 22910 19089 17891 2732 -427 10673 4813 -8799
19308 -8799 -897 9363 191 -13815 -15208 -349 4815 -1640 4277 9722 9904 9182 10330 20528
19294 20528 25706 23823 17107 17147 26440 28782 21187 26738 30312 16075 6087 13280 10973 7268 10141
19279 10141 9593 20044 17907 28956 17783 11378 16208 17062 6842 4023 2609 16431 23191 25423
19265 25423 11379 11725 12373 30868 34343 44796 43402 42202 37400 19946 10529 12922 44535 82301
19251 82301 100081 108464 111802 119531 134975 141165 162493 186743 214641 231581 228794 213991 191908
19238 191908 175855 174626 173672 148916 123350 101427 70929 39158 27982 34111 30848 32082 33791
$$ packed form
19335i220j5992p752J1251K65J1168L045N344J3122n460J455M950N130m422k945
19321I939o012K572J3847Q744j1044M864l821j198j5159l159J1100n860j3612
19308h799P902J0260r172j4006j393J4859N164o455N917N445J82p22J148J0198
19294B0528N178j883o716M0R293K342p595N551L574j4237r988P193k307l705K873
19279A0141n48J0451k137J1049j1173o405M830Q54j0220k819j414J3822O760K232
19265B5423j4044L46O48J8495L475J0453j394j200m802j7454r417K393L1613L7766
19251H2301J7780Q383L338P729J5444O190K1328K4250K7898J6940k787j4803k2083
19238A91908j6053j229r54k4756k5566k1923l0498l1771j1176O129l263J234J709
$$ plain form
19225 33791 34219 25409 21081 21598 22435 20762 22375 23011 13950 10396 11432 20230 21943 1546 -2916
19210 -2916 6911 9959 1548 2207 8597 21116 33519 42754 59218 68545 86742 98690 121475
19197 121475 137888 146169 170243 185971 189340 199908 202644 208596 198491 160228 121721 115924
19185 115924 104120 106761 100914 88321 74026 37268 20119 25750 19290 10599 9332 4794 -5771
19172 -5771 4430 10963 22611 29034 27750 31354 25981 19731 35097 31150 15034 3043 -10806
19159 -10806 -12551 -327 -3222 2757 11800 9928 6739 6142 10043 10325 9885 13907 21177 17386 20217
19144 20217 17933 19734 11897 8688 16764 26175 18139 3543 -16709 -25827 -19149 -23501 -21418 -12899
19130 -12899 -10704 -1106 1810 8200 20626 5786 -7142 -14678 -17080 -5164 1125 6876 3841
$$ packed form
19225C3791M28q810m328N17Q37j673J613O36r061l554J036Q798J713k0397m462
19210b916R827L048q411O59O390J2519J2403R235J6464R327J8197J1948K2785
19197A21475J6413Q281K4074J5728L369J0568K736N952j0105l8263l8507n797
19185A15924j1804K641n847j2593j4295l6758j7149N631o460q691j267m538j0565
19172e771J0201O533J1648O423j284L604n373o250J5366l947j6116j1991j3849
19159a0806j745J2224k895N979R043j872l189n97L901K82m40M022P270l791K831
19144B0217k284J801p837l209Q076R411q036j4596k0252r118O678m352K083Q519
19130a2899K195R598K916O390J2426j4840j2928p536k402J1916O289N751l035
$$ plain form
19117 3841 203 4243 8695 -2131 -2233 9382 20152 18708 18285 21125 26422 19455 9289 7385
19103 7385 15717 12382 6263 7663 17596 16331 17162 35515 44433 31689 27462 31929 16985 1894
19089 1894 7201 6885 7788 12928 5075 6394 987 3287 6472 734 -2589 7292 12735 9496 5585
19074 5585 15673 19832 11778 1160 5073 14098 16024 8921 12031 8184 6813 5516 -8053 -17039
19060 -17039 -14286 -3255 4014 -2480 -8062 -6793 -2507 2125 14518 9662 -13964 -12120 -2750 4285
19046 4285 -625 -3177 17274 20619 24373 30691 17050 12439 6496 19855 30991 33799 29001 24323
19032 24323 24211 39037 43375 51013 46002 40369 55844 80886 92788 83975 77549 79015 75520 72565
19018 72565 84042 88890 69482 56699 48429 32096 32397 25176 9719 9003 5656 9489 21865
$$ packed form
19117C841l638M040M452j0826j02J1615J0770j444m23K840N297o967j0166j904
19103G385Q332l335o119J400R933j265Q31J8353Q918j2744m227M467j4944j5091
19089A894N307l16R03N140p853J319n407K300L185n738l323R881N443l239l911
19074E585J0088M159q054j0618L913R025J926p103L110l847j371j297j3569q986
19060a7039K753J1031P269o494n582J269M286M632J2393m856k3626J844R370P035
19046D285m910k552K0451L345L754O318j3641m611n943J3359J1136K808m798m678
19032B4323j12J4826M338P638n011n633J5475K5042J1902q813o426J466l495k955
19018G2565J1477M848j9408j2783q270j6333L01p221j5457p16l347L833J2376
$$ plain form
19005 21865 20889 14720 24528 36971 39238 36874 47411 45104 53199 52522 35733 44924 59636 57966
18991 57966 59500 88538 110515 115663 132269 157716 166564 194344 205899 240801 285008 290821
18979 290821 277030 260971 235945 237605 253359 267263 277049 275912 246913 222976 203610 171212
18967 171212 149245 144529 148492 152240 140343 118737 99620 67921 41693 34173 45182 50319
18955 50319 50153 50301 37818 37216 38077 47560 42439 37995 41962 49099 36429 33438 34587 35996 42082
18940 42082 41309 46780 50238 57010 74588 97251 121285 147652 161814 186775 208910 240992 285383
18927 285383 328609 355243 336113 313446 282112 268450 259293 267435 254704 214132 171175 143166
18915 143166 122083 111521 104613 92694 79344 62950 49438 39680 33038 31976 30535 36319 21415
$$ packed form
19005B1865r76o169R808J2443K267k364J0537k307Q095o77j6789R191J4712j670
18991E7966J534K9038K1977N148J6606K5447Q848K7780J1555L4902M4207N813
18979B90821j3791j6059k5026J660J5754J3904R786j137k8999k3937j9366l2398
18967A71212k1967m716L963L748j1897k1606j9117l1699k6228p520J1009N137
18955E0319j66J48j2483o02Q61R483n121m444L967P137j2670k991J149J409O086
18940D2082p73N471L458O772J7578K2663K4034K6367J4162K4961K2135L2082M4391
18927B85383M3226K6634j9130k2667l1334j3662r157Q142j2731m0572m2957k8009
18915A43166k1083j0562o908j1919j3350j6394j3512r758o642j062j441N784j4904
$$ plain form
18902 21415 11624 11359 20447 17224 17759 27988 30475 18059 25820 25118 19193 41049 46379 30427
18888 30427 21209 12786 10262 17528 23609 26924 24615 22339 24174 28731 17554 13033 31706 42795
18874 42795 34768 24842 27881 29938 45051 42424 48015 42241 20614 22490 18263 13889 18591 26285
18860 26285 14589 12433 24580 38761 46411 39970 41524 43677 38481 27498 29494 42298 53491
18847 53491 51137 51333 42149 25993 19010 30715 31896 31711 26953 28572 38865 42935 49454 67380
18833 67380 77314 60099 56081 62660 74514 80551 108234 135770 126957 110946 93542 89521 77698
18820 77698 68789 61415 69004 84706 73898 73307 72563 74152 82647 73463 80844 85368 103841 120021
18806 120021 104016 107948 124726 139186 128903 115022 106262 127062 135431 133593 113443 91558
$$ packed form
18902B1415r791k65R088l223N35J0229K487j2416P761p02n925K1856N330j5952
18888C0427r218q423k524P266O081L315k309k276J835M557j1177m521J8673J1089
18874D2795q027r926L039K057J5113k627N591n774k1627J876m227m374M702P694
18860B6285j1696k156J2147J4181P650o441J554K153n196j0983J996J2804J1193
18847E3491k354J96r184j6156o983J1705J181j85m758J619J0293M070O519J7926
18833F7380R934j7215m018O579J1854O037K7683K7536q813j6011j7404m021j1823
18820G7698q909p374P589J5702j0808n91p44J589Q495r184P381M524J8473J6180
18806A20021j6005L932J6778J4460j0283j3881q760K0800Q369j838k0150k1885
$$ plain form
18794 91558 70844 55586 49408 43847 47703 55658 54944 45867 45420 47631 38053 52563 76559 81363
18780 81363 111911 140208 166051 193157 190710 195262 199647 178985 152336 134572 115453 114666 129120
18767 129120 149022 168272 168992 146378 123157 115850 96523 84904 93788 84313 79757 75011 86010
18754 86010 114753 141632 150238 141824 139732 143508 141930 151992 148108 144033 135569 127801 115759
18741 115759 107305 105125 96155 89103 79697 76245 76581 68014 77435 85281 90151 98113 114573 118704
18727 118704 115947 141604 153869 141243 138141 136159 120323 95085 81458 85963 92065 88453 69659
18714 69659 64058 61643 62428 64462 64721 74900 71428 86033 87982 88734 87515 77546 67788 71972 74348
18699 74348 78465 90728 98297 121105 130136 123755 118634 129410 141126 141053 116769 109861 126640
$$ packed form
18794I1558k0714j5258o178n561L856P955p14r077m47K211r578J4510K3996M804
18780H1363L0548K8297K5843K7106k447M552M385k0662k6649j7764j9119p87J4454
18767A29120J9902J9250P20k2614k3221p307j9327j1619Q884r475m556m746J0999
18754H6010K8743K6879Q606q414k092L776j578J0062l884m075q464p768j2042
18741A15759q454k180q970p052r406l452L36q567R421P846M870P962J6460M131
18727A18704k757K5657J2265j2626l102j982j5836k5238j3627M505O102l612j8794
18714F9659n601k415P85K034K59J0179l472J4605J949P52j219r969r758M184K376
18699G4348M117J2263P569K2808R031o381n121J0776J1716p3k4284o908J6779
$$ plain form
18686 126640 121671 116039 123688 126758 123136 110752 109434 97742 84707 62454 41713 46771 47438
18673 47438 47399 50370 60371 62431 55442 58216 68416 64732 51549 40843 25912 16316 22134 28525
18659 28525 41607 49629 51164 46754 50999 35515 21038 23570 22052 22530 28445 49452 52219 43194
18645 43194 44076 43890 49431 34190 24344 41672 56185 55295 51054 44261 34487 36749 29653 31617
18631 31617 51428 56884 53921 61022 68860 69199 54862 54749 74191 82109 81447 85523 85165 74701
18617 74701 84554 91063 83127 74173 75930 79421 93366 100593 95702 98670 101840 97175 85682 88539
18603 88539 102898 103475 94490 86643 95891 101527 108120 102324 103550 111273 117522 113356 120363 128317
18589 128317 130204 130417 126828 134155 132508 127047 120731 134719 139237 130323 136765 151689 160501 157656
$$ packed form
18686A26640m969n632P649L070l622j2384j318j1692j3035k2253k0741N058O67
18673D7438l9K971J0001K060o989K774J0200l684j3183j0706j4931r596N818O391
18659B8525J3082Q022J535m410M245j5484j4477K532j518M78N915K1007K767r025
18645D3194Q82j86N541j5241r846J7328J4513q90m241o793r774K262p096J964
18631C1617J9811N456k963P101P838L39j4337j13J9442P918o62M076l58j0464
18617G4701R853O509p936q954J757L491J3945P227m891K968L170m665j1493K857
18603H8539J4359N77q985p847R248N636O593n796J226P723O249m166P007P954
18589A28317J887K13l589P327j647n461o316J3988M518q914O442J4924Q812k845
$$ plain form
18575 157656 152550 143377 142796 149326 155649 160004 161331 160885 158751 158511 172491 198038 186440 163885
18561 163885 155965 164776 187100 199710 205084 219905 235412 246736 256390 265718 264653 261812 272777
18548 272777 275551 285625 302181 307502 334575 368253 398548 438039 481547 544211 624326 743971
18536 743971 924267 1196747 1623705 2270490 3017530 3501464 3510222 3115346 2677966 2550390
18526 2550390 2823374 3343278 3703273 3586359 3011754 2285334 1707821 1344557 1106634
18517 1106634 981558 927223 898559 892825 864690 831385 811055 806639 831837 875678 902334
18506 902334 941120 961616 979870 1029383 1123866 1256404 1446353 1686126 1906326 2034043
18496 2034043 2044288 1974907 1953562 2037676 2216284 2437100 2615416 2751913 2889293 3114821
$$ packed form
18575A57656n106r173n81O530O323M355J327m46k134k40J3980K5547j1598k2555
18561A63885p920Q811K2324J2610N374J4821J5507J1324R654R328j065k841J0965
18548B72777K774J0074J6556N321K7073L3678L0295L9491M3508O2664Q0115J19645
18536G43971J80296K72480M26958O46785P47040M83934Q758l94876m37380j27576
18526B550390K72984N19904L59995j16914n74605p26420n77513l63264k37923
18517A106634j25076n4335k8664n734k8135l3305k0330m416K5198M3841K6656
18506I02334L8786K0496J8254M9513R4483J32538J89949K39773K20200J27717
18496B034043J0245o9381k1345Q4114J78608K20816J78316J36497J37380K25528
$$ plain form
18486 3114821 3475217 4015486 4786913 5903798 7597894 10314908 14471022 19733174 24237609
18477 24237609 25802573 24117968 20917141 18936491 19697822 22999730 26845963 28335805
18469 28335805 26210345 21459000 16628601 13374148 11720299 11256427 11807532 13463455
18461 13463455 16501593 21015406 26224564 30339537 31883817 31045885 29753065 30165094
18453 30165094 32731141 35726684 36935289 35584489 33047066 31858659 34266584 41388297
18445 41388297 52648980 65009244 74243787 77226091 73968228 68348095 65202325 67350503
18437 67350503 72617273 75187602 70503449 58705648 44110159 31143770 21864862 15907117
18429 15907117 12125226 9640137 7960612 6795843 5961866 5322916 4773610 4270712 3839192
$$ packed form
18486C114821L60396N40269P71427J116885J694096K717014M156114N262152M504435
18477B4237609J564964j684605l200827j980650P61331L301908L846233J489842
18469B8335805k125460m751345m830399l254453j653849m63872N51105J655923
18461A3463455L038138M513813N209158M114973J544280q37932j292820M12029
18453C0165094K566047K995543J208605j350800k537423j188407K407925P121713
18445D1388297J1260683J2360264R234543K982304l257863n620133l145770K148178
18437F7350503N266770K570329m684153j1797801j4595489j2966389r278908n957745
18429A5907117l781891k485089j679525j164769q33977o38950n49306n02898m31520
$$ plain form
18420 3839192 3518227 3299103 3137468 2995050 2845161 2698914 2584815 2542662 2566039 2667467
18410 2667467 2859645 3171397 3694033 4564730 5721686 6788275 7284489 7010884 6278542
18401 6278542 5727084 5752696 6167116 6422203 6084869 5118096 3901598 2843801 2130051
18392 2130051 1701373 1424777 1259996 1154357 1055149 964528 908129 870192 835049 805237
18382 805237 784090 750085 698459 665151 645863 635457 625049 608509 584668 545404 518370
18371 518370 520200 525442 525745 530307 543659 572903 615824 651330 684456 736087 812105 935631
18359 935631 1125919 1428312 1870610 2429754 2879280 2938077 2610534 2053895 1555167 1219820
18349 1219820 1016660 919795 850759 813693 803359 823231 838069 821117 814806 812061 791898
$$ packed form
18420C839192l20965k19124j61635j42418j49889j46247j14099m2153K3377J01428
18410B667467J92178L11752N22636Q70697J156956J066589M96214k73605p32342
18401F278542n51458K5612M14420K55087l37334r66773j216498j057797p13750
18392B130051m28678k76596j64781j05639r9208r0621n6399l7937l5143k9812
18382H05237k1147l4005n1626l3308j9288j0406j0408j6540k3841l9264k7034
18371E18370J830N242L03M562J3352K9244M2921L5506L3126N1631P6018J23526
18359I35631J90288L02393M42298N59144M49526N8797l27543n56639m98728l35347
18349A219820k03160r6865o9036l7066j0334J9872J4838j6952o311k745k0163
$$ plain form
18338 791898 787267 802472 811097 851463 888869 916091 942840 996615 1078061 1174064 1321936 1521190
18326 1521190 1751407 2023335 2385499 2858876 3448352 4278908 5542169 7543543 10737938
18317 10737938 15235643 19765685 21923886 20537898 16436171 11926785 8657274 6673416
18309 6673416 5561021 5014998 4881851 5123018 5761478 6797405 8188773 10047239 12533949
18300 12533949 15193864 16732605 16053209 13364064 10015652 7361394 5651780 4631502
18292 4631502 4020582 3670141 3507736 3500917 3651923 4018570 4736649 6019288 8160439
18283 8160439 11145487 13927630 14903897 13556382 10613491 7781532 5944472 4965365
18275 4965365 4550259 4475080 4654362 5072227 5794229 6978383 8924201 12156194 17155886
$$ packed form
18338G91898m631J5205Q625M0366L7406K7222K6749N3775Q1446R6003J47872J99254
18326A521190K30217K71928L62164M73377N89476Q30556J263261K001374L194395
18317A0737938M497705M530042K158201j385988m101727m509386l269511j983858
18309F673416j112395n46023j33147K41167O38460J035927J391368J858466K486710
18300A2533949K659915J538741o79396k689145l348412k654258j709614j020278
18292D631502o10920l50441j62405o819J51006L66647P18079J282639K141151
18283H160439K985048K782143R76267j347515k942891k831959j837060r79107
18275D965365m15106p5179J79282M17865P22002J184154J945818L231993M999692
$$ plain form
18266 17155886 23482031 28953352 30697837 27683382 21610450 15423426 10944281 8134010
18258 8134010 6432575 5408510 4810496 4550279 4589582 4928215 5720818 7190007 9557120
18249 9557120 12495812 14785598 15084254 13227540 10187800 7436078 5571062 4452000
18241 4452000 3795313 3406461 3245447 3253267 3410112 3779417 4480674 5740230 7872788
18232 7872788 10789926 13354393 14052600 12520673 9615905 6985054 5286058 4275596
18224 4275596 3638031 3231606 3037868 3031176 3219852 3681723 4593642 6195181 8587050
18215 8587050 11126859 12412632 11652423 9252889 6500790 4450738 3140987 2329251
18207 2329251 1776532 1400972 1149959 972107 845856 753999 697066 666285 629593 598915
$$ packed form
18266A7155886O326145N471321J744485l014455o072932o187024m479145k810271
18258H134010j701435j024065n98014k60217L9303L38633P92603J469189K367113
18249I557120K938692K289786K98656j856714l039740k751722j865016j119062
18241D452000o56687l88852j61014P820J56845L69305P01257J259556K132558
18232G872788K917138K564467O98207j531927k904768k630851j698996j010462
18224D275596o37565m06425j93738o692J88676M61871R11919J601539K391869
18215H587050K539809J285773p60209k399534k752099k050052j309751q11736
18207B329251n52719l75560k51013j77852j26251r1857n6933l0781l6692l0678
$$ plain form
18197 598915 568996 527902 486133 470939 453578 446369 449734 440219 458115 462682 477848 483713
18185 483713 463559 425979 401469 391802 395652 415868 472240 561835 675858 806085 870156
18174 870156 818415 674250 531028 416364 334598 290621 265317 247574 215296 193574 190352
18163 190352 201535 214706 211111 196446 205167 208325 195449 187097 167799 151625 159591 177223
18151 177223 184187 177687 173487 172049 171941 163753 168790 168707 160716 161360 168768 177616 187104 191288 197635
18136 197635 211929 233876 248804 255206 267413 273049 288942 309961 336216 374232 420427 470484
18124 470484 530865 592850 668889 751539 847965 979164 1160083 1381450 1635297 1954380
18114 1954380 2417718 3064045 4028921 5670383 8584492 13442344 19523164 23736345 23444680
$$ packed form
18197E98915k9919m1094m1769j5194j7361p209L365r515J7896M567J5166N865
18185D83713k0154l7580k4510r667L850K0216N6372Q9595J14023J30227O4071
18174H70156n1741j44165j43222j14664q1766m3977k5304j7743l2278k1722l222
18163A90352J1183J3171l595j4665Q721L158j2876q352j9298j6174P966J7632
18151A77223O964o500m200j438j08q188N037q3p991O44P408Q848R488M184O347
18136A97635J4294K1947J4928O402J2207N636J5893K1019K6255L8016M6195N0057
18124D70484O0381O1985P6039Q2650R6426J31199J80919K21367K53847L19083
18114A954380M63338O46327R64876J641462K914109M857852O080820M213181k91665
$$ plain form
18105 23444680 18895638 12685834 7962277 5120511 3489800 2489541 1844275 1422457
18097 1422457 1132504 907829 749865 653566 568626 508176 453681 399065 358202 325337 296561
18086 296561 259615 231945 215805 203188 199757 196719 186674 169620 143110 121383 114771 109014
18074 109014 109290 110918 111392 115562 101044 91954 102787 108228 120090 115492 104185 97909 83613
18061 83613 86373 72966 71979 83232 90216 96274 94324 92830 93457 92822 92010 95500 81784 82716 89100
18046 89100 91420 81344 85154 83885 82322 94420 110399 124406 126300 116290 127542 135822 130600
18033 130600 141605 150692 153702 144371 110408 86133 79292 88820 94927 82249 83644 90524 102448
18020 102448 95734 85285 87286 87833 84660 65657 62862 63613 56948 62484 64607 61636 67071 73466
$$ packed form
18105B3444680m549042o209804m723557k841766j630711j000259o45266m21818
18097A422457k89953k24675j57964r6299q4940o0450n4495n4616m0863l2865k8776
18086B96561l6946k7670j6140j2617l431l038j0045j7054k6510k1727o612n757
18074A09014K76J628M74M170j4518r090J0833N441J1862m598j1307o276j4296
18061H3613K760j3407r87J1253O984O058j950j494O27o35q12L490j3716R32O384
18046H9100K320j0076L810j269j563J2098J5979J4007J894j0010J1252Q280n222
18033A30600J1005R087L010r331l3963k4275o841R528O107j2678J395O880J1924
18020A02448o714j0449K001N47l173j9003k795P51o665N536K123k971N435O395
$$ plain form
18006 73466 82077 102562 129921 157988 163629 162813 151428 144471 147142 164024 193725 189193 179870
17993 179870 154197 138756 116918 85933 77808 79195 75719 78703 80455 73139 80580 87074 80822
17980 80822 66325 55319 64725 70147 65775 62664 59708 61896 61121 52316 55634 56150 53396 54969
17966 54969 72935 81026 65155 63320 85639 101540 115323 128906 129327 113791 99471 98823 111973
17953 111973 150168 190219 228783 258864 273839 272032 266867 261128 278362 307527 326241 340379
17941 340379 345738 337066 303478 259032 204833 175704 166455 151868 131204 93900 75828 70974
17929 70974 69812 53545 30156 36490 51525 55462 53947 43515 40132 47581 58839 65490 74125
17916 74125 83683 94302 90052 85755 85180 106077 109861 101912 114998 123472 111873 117491 126160 121113
$$ packed form
18006G3466Q611K0485K7359K8067N641q16j1385o957K671J6882K9701m532r323
17993A79870k5673j5441k1838l0985q125J387l476K984J752p316P441O494o252
17980H0822j4497j1006R406N422m372l111k956K188p75q805L318N16k754J573
17966E4969J7966Q091j5871j835K2319J5901J3783J3583M21j5536j4320o48J3150
17953A11973L8195M0051L8564L0081J4975j807n165n739J7234K9165J8714J4138
17941C40379N359q672l3588m4446n4199k9129r249j4587k0664l7304j8072m854
17929G0974j162j6267k3389O334J5035L937j515j0432l383P449J1258O651Q635
17916G4125R558J0619m250m297n75K0897L784p949J3086Q474j1599N618Q669n047
$$ plain form
17902 121113 121497 121571 126453 143639 142950 140538 145494 169255 163406 151718 138859 135329 140346 158247
17888 158247 169774 181847 192490 180521 155624 129387 110030 108206 107275 97294 82162 58499
17876 58499 45013 57877 66340 61016 53254 50331 39861 44323 48402 42555 45829 67576 66672 68352
17862 68352 51269 35986 28029 38706 46607 26948 16719 12261 17879 21142 13143 -6885 -10519
17849 -10519 -2541 -5156 -4024 6412 14043 14999 13557 9109 12003 -1085 -13608 -14698 1460 12001
17835 12001 14141 10566 9558 14568 10572 14172 10045 17739 33064 37675 20308 11804 22799 22952
17821 22952 29488 38986 31201 23155 22479 20940 22902 24386 23397 17765 19116 18271 18083 30100 41901
17806 41901 60185 83370 85213 65234 44041 41265 58882 65606 61159 48676 53011 65224 69870
$$ packed form
17902A21113L84P4M882J7186o89k412M956K3761n849j1688j2859l530N017J7901
17888A58247J1527J2073J0643j1969k4897k6237j9357j824r31r981j5132k3663
17876E8499j3486J2864Q463n324p762k923j0470M462M079n847L274K1747r04J680
17862F8352j7083j5283p957J0677P901j9659j0229m458N618L263p999k0028l634
17849a0519P978k615J132J0436P631R56j442m448K894j3088j2523j090J6158J0541
17835A2001K140l575j008N010l996L600m127P694J5325M611j7367q504J0995J53
17821B2952O536R498p785q046o76j539J962J484r89n632J351q45j88J2017J1801
17806D1901J8284K3185J843j9979k1193k776J7617O724m447j2483M335J2213M646
$$ plain form
17793 69870 80298 74944 76139 66824 36765 27987 20561 24118 26808 26655 16623 11831 9552 10964
17779 10964 15226 22674 26157 24581 19894 18029 10145 26285 43500 66300 76214 82039 83379 85582
17765 85582 82326 72239 49112 46441 36266 34695 63830 77270 84459 104219 130832 149793
17753 149793 142631 125874 94579 74250 68980 53084 48256 56681 65183 74920 78604 78186 91097
17740 91097 94062 94751 89422 61843 46570 32358 28092 28338 20000 20247 26693 26946 21684 22472 25763
17725 25763 21423 18053 22322 25777 27565 26272 37192 45361 49099 68478 73687 56593 48982 29743
17711 29743 25456 22439 26991 32936 44249 45327 49683 75189 85974 89834 79496 54356 33923
17698 33923 23756 30411 22862 21976 17285 12982 7654 8135 22301 24087 173 -16335 -20882 -30404
$$ packed form
17793F9870J0428n354J195r315l0059q778p426L557K690j53j0032m792k279J412
17779A0964M262P448L483j576m687j865p884J6140J7215K2800R914N825J340K203
17765H5582l256j0087k3127k671j0175j571K9135J3440P189J9760K6613J8961
17753A49793p162j6757l1295k0329n270j5896m828Q425Q502R737L684m18J2911
17740I1097K965O89n329k7579j5273j4212m266K46q338K47O446K53n262P88L291
17725B5763m340l370M269L455J788j293J0920Q169L738J9379N209j7094p611j9239
17711B9743m287l017M552N945J1313J078M356K5506J0785L860j0338k5140k0433
17698C3923j0167O655p549q86m691m303n328M81J4166J786k3914j6508m547r522
$$ plain form
17684 -30404 -34599 -22397 -8570 -83 -8036 -5766 -5094 -13272 3808 13308 14049 10374 -7487 -12475
17670 -12475 6963 10845 718 3163 3129 3849 11575 7819 -4667 -7163 331 -2982 -3639 2359 10887
17655 10887 2649 -6167 -1325 -6559 -776 6116 3067 2106 6479 7656 8054 10289 18152 11885 21889
17640 21889 26127 27682 25335 17130 12331 26702 28324 17095 7983 12747 13932 14515 7459 9372
17626 9372 -6801 -7463 -793 -779 -3167 8573 13619 12895 18149 12213 1896 -2509 -11755 -6070 -5915
17611 -5915 -1633 -7955 -12828 2070 4281 9963 3985 -5888 7755 11883 17571 18216 7711 -1280
17597 -1280 -6689 -2717 -3222 701 5645 -1397 -9648 -23221 -19867 -15089 -10377 -25211 -25410 -12725
17583 -12725 -2848 -9607 -11758 -12812 -18425 -19469 -5846 5905 13336 18682 6340 6851 18737 17024
$$ packed form
17684c0404m195J2202J3827Q487p953K270O72q178J7080R500P41l675j7861m988
17670a2475J9438L882j0127K445l4P20P726l756j2486k496P494l313o57N998Q528
17655A0887q238q816M842n234N783O892l049r61M373J177L98K235P863o267J0004
17640B1889M238J555k347q205m799J4371J622j1229r112M764J185N83p056J913
17626I372j6173o62O670J4k388J1740N046p24N254n936j0317m405r246N685J55
17611e915M282o322m873J4898K211N682n978r873J3643M128N688O45j0505q991
17597a280n409L972n05L923M944p042q251j3573L354M778M712j4834j99J2685
17583a2725R877o759k151j054n613j044J3623J1751P431N346j2342N11J1886j713
$$ plain form
17569 17024 3653 1076 -1375 -14098 -16685 -14133 -7715 -1142 -259 -6048 6264 7515 2252 6888
17555 6888 13651 15589 17377 11751 14128 19733 7738 3843 4432 6008 1121 -3206 -6324 -2759 -10691
17540 -10691 -14225 -11920 -10954 -2584 529 -1560 -5337 -6981 -18173 -7493 -5876 -12212 -8816 -1541
17526 -1541 -2200 -1660 10144 11691 8068 4212 3255 9985 12663 -525 -1465 -13399 -13862 -5909 -9181
17511 -9181 -15037 -8979 2383 2351 5799 11600 4915 1137 -4613 -710 7660 8116 1764 -16320 -21320
17496 -21320 -13019 -3701 -5043 1804 18664 19098 7610 2535 6446 3858 3553 -1946 -14451 -22715
17482 -22715 -22473 -7783 -4566 -15542 -14071 -2661 -1293 2517 7139 12279 18841 16700 11296 -1090
17468 -1090 2451 3091 2410 5504 2370 46 -1466 2384 6391 -956 -2309 -8016 -10154 3014 -4517
$$ packed form
17569A7024j3371k577k451j2723k587K552O418O573Q83n789J2312J251n263M636
17555F888O763J938J788n626K377N605j1995l895N89J576m887m327l118L565p932
17540a0691l534K305R66Q370L113k089l777j644j1192J0680J617o336L396P275
17526a541o59N40J1804J547l623l856r57O730K678j3188r40j1934m63P953l272
17511i181n856O058J1362l2L448N801o685l778n750L903Q370M56o352j8084n000
17496b1320Q301R318j342O847J6860M34j1488n075L911k588l05n499j2505q264
17482b2715K42J4690L217j0976J471J1410J368L810M622N140O562k141n404j2386
17468a090L541O40o81L094l134k324j512L850M007p347j353n707k138J3168p531
$$ plain form
17453 -4517 -6833 -4376 1425 9606 17842 25895 24606 23604 27986 33469 46356 71028 106457 123343
17439 123343 111786 86413 55183 38443 29025 18755 17899 16068 18911 14076 13830 8608 7079
17426 7079 9653 11282 -1938 -9442 -16412 -5661 -5129 -12977 -19191 -7229 -503 5527 16378 23084
17412 23084 19736 16611 16424 7315 900 6866 7639 2148 2689 4415 2300 5854 553 -2965 2920
17397 2920 11726 12859 3008 -1551 -134 6264 7871 3833 -7736 -6690 8773 4440 -349 7817
17383 7817 -1087 -15502 -14308 -10008 -2160 -2225 6174 3392 -724 4662 6572 19135 30914 22685
17369 22685 12955 2871 -9671 -10006 -6969 -7765 -11556 -16938 -16619 -10208 -22811 -16879 -16411 -7322 7601
17354 7601 6725 11679 7153 2792 1580 3478 1256 -5072 1042 457 -5095 -5408 -2642 -7593 -2895
$$ packed form
17453d517k316K457N801Q181Q236Q053j289j002M382N483J2887K4672L5429J6886
17439A23343j1557k5373l1230j6740r418j0270q56j831K843m835k46n222j529
17426G079K574J629j3220p504o970J0751N32p848o214J1962O726O030J0851O706
17412B3084l348l125j87r109o415N966P73n491N41J726k115L554n301l518N885
17397B920Q806J133r851m559J417O398J607m038j1569J046J5463m333m789Q166
17383G817q904j4415J194M300P848o5Q399k782m116N386J910J2563J1779q229
17369B2685r730j0084j2542l35L037p96l791n382L19O411j2603N932M68R089J4923
17354G601q76M954m526m361j212J898k222o328O114n85n552l13K766m951M698
$$ plain form
17339 -2895 8996 19091 28084 33626 34058 30867 24514 16535 12891 21031 37677 43738 46813 41798
17325 41798 29630 4867 -7173 -439 8032 1921 -7688 -12461 -2283 6562 -2112 -16557 -8603
17312 -8603 -9307 1296 -469 -2654 4324 -9899 -20108 -26181 -17031 47 12030 11262 1699 14314
17298 14314 20047 18956 12878 11967 21366 26899 29719 39995 49433 38660 20034 27608 33939 37028
17284 37028 33657 36411 53845 60174 53157 53207 43492 32988 17995 3929 -6006 -10887 -21886 -27609
17270 -27609 -9092 -2347 3797 19242 19927 19648 22813 15340 -868 -15863 -5763 -9609 -16110 -22312
17256 -22312 -24262 -12145 -14993 -32020 -31895 -18647 -12795 -8452 11038 -825 -9688 5301 7402
17243 7402 6568 16725 14173 12550 9835 7376 9422 9494 9909 30712 37863 38492 33056 25247 4727
$$ packed form
17339b895J1891J0095Q993N542M32l191o353p979l644Q140J6646O061L075n015
17325D1798j2168k4763j2040O734Q471o111r609m773J0178Q845q674j4445P954
17312h603p04J0603j765k185O978j4223j0209o073R150J7078J1983p68r563J2615
17298A4314N733j091o078r11R399N533K820J0276R438j0773j8626P574O331L089
17284C7028l371K754J7434O329p017N0r715j0504j4993j4066r935m881j0999n723
17270b7609J8517O745O144J5445O85k79L165p473j6208j4995J0100l846o501o202
17256b2312j950J2117k848j7027J25J3248N852M343J9490j1863q863J4989K101
17243G402q34J0157k552j623k715k459K046P2M15K0803P151O29n436p809k0520
$$ plain form
17228 4727 -5608 -11990 -26556 -36401 -19848 -10078 -6454 -10593 -18624 -16787 -9277 -4082 8661 14826
17214 14826 17834 13747 4168 5926 2625 3679 -1440 -8295 -5878 5830 16216 4743 -11264
17201 -11264 -6977 -10136 -8187 -5155 -8016 -7832 -23214 -11621 9154 8891 -9080 -14178 -12467 -5818
17187 -5818 -2007 3171 11755 1751 -14161 -21032 -5309 3773 3101 -1785 3867 22112 28707 20455
17173 20455 19221 22947 25305 22362 22281 27975 24066 17056 23361 32063 38267 28350 31349 34907 24266
17158 24266 26364 31268 44077 48257 42899 28424 32943 30524 30569 27901 29372 21892 25432 25518 1889
17143 1889 2191 -2839 -3255 -127 833 8005 42 -11274 -7220 4938 -3658 -9377 5268 19951
17129 19951 19344 12195 22175 32389 15112 8821 17631 23522 19529 2738 -23457 -27660 -27128 -20406
$$ packed form
17228D727j0335o382j4566r845J6553R770L624m139q031J837P510N195J2743O165
17214A4826L008m087r579J758l301J054n119o855K417J1708J0386j1473j6007
17201a1264M287l159J949L032k861J84j5382J1593K0775k63j7971n098J711O649
17187e818L811N178Q584j0004j5912o871J5723R082o72m886N652J8245O595q252
17173B0455j234L726K358k943q1N694l909p010O305Q702O204r917K999L558j0641
17158B4266K098M904J2809M180n358j4475M519k419M5k668J471p480L540Q6k3629
17143A889L02n030m16L128R60P172p963j1316M054J2158q596n719J4645J4683
17129A9951o07p149R980J0214j7277o291Q810N891l993j6791k6195m203N32O722
$$ plain form
17115 -20406 -17447 -15446 -8873 -12517 -13575 8437 35444 46054 56641 72809 66847 39700 30364
17102 30364 24940 20617 19319 11762 18302 27223 27494 20357 10594 -11267 -15721 -11621 -5362 5434
17088 5434 -7573 -9450 -9800 -14475 -5998 4640 -2265 10025 3715 902 5092 4140 -2433 -11404
17074 -11404 -1562 13037 19209 21854 11922 1516 -12121 6434 6590 -9115 -17908 -9718 -7511
17061 -7511 -5090 14 7011 1961 -11750 -16403 -6285 -4108 -11633 -17969 -24685 -23501 -14670 -15657
17047 -15657 -11460 -8778 -5766 -11972 -7918 -14590 -7563 -1572 -9208 -8146 -9509 -7279 -12283 -22619
17033 -22619 -25816 -26786 -17191 -19806 -20933 -13539 -8123 -2204 -6688 -3536 -5695 -2454 4968 11026 20744
17018 20744 8745 -1303 827 -2805 8719 15803 4493 3213 7698 19540 36190 33168 14094
$$ packed form
17115b0406K959K001O573l644j058K2012K7007J0610J0587J6168n962k7147r336
17102C0364n424m323j298p557O540Q921K71p137r763k1861m454M100O259J0796
17088E434j3007j877l50m675Q477J0638o905J2290o310k813M190r52o573q971
17074a1404R842J4599O172K645r932j0406j3637J8555J56j5705q793Q190K207
17061g511K421N104O997n050j3711m653J0118K177p525o336o716J184Q831r87
17047a5657M197K682L012o206M054o672P027N991p636J062j363K230n004j0336
17033b2619l197r70R595k615j127P394N416N919m484L152k159L241P422O058R718
17018B0744j1999j0048K130l632J1524P084j1310j280M485J1842J6650l022j9074
$$ plain form
17005 14094 4501 9352 20190 24023 34193 28155 26611 26416 33055 31329 36389 40143 31052 27400
16991 27400 39702 36591 35790 46702 44645 34056 27509 30548 20363 42428 50622 34063 14171
16978 14171 1985 -4389 -373 10533 6043 -415 8499 -1435 -5899 -4502 785 -11721 -27100
16965 -27100 -14289 -12473 -17125 -17823 -12541 -9923 -14802 -11207 -16502 -11960 -7714 -9690 -13874 -13658 -23705
16950 -23705 -25048 -26651 -19555 -12951 -17514 -27457 -27665 -17735 -5643 -400 2749 8427 11199 18087
16936 18087 2628 -3445 11193 7752 10006 1738 -338 4523 5930 10931 2503 -1033 -5151 6203
16922 6203 4761 10726 15772 11208 3619 6624 2430 -2375 -6684 710 15612 7336 327 -8204
16908 -8204 -8651 3562 12222 6857 -7562 -20463 -35072 -36784 -22472 -8275 -9925 -14088 -20309
$$ packed form
17005A4094r593M851J0838L833J0170o038j544j95O639j726N060L754r091l652
16991B7400J2302l111q01J0912k057j0589o547L039j0185K2065Q194j6559j9892
16978A4171j2186o374M016J0906m490o458Q914r934m464J397N287j2506j5379
16965b7100J2811J816m652o98N282K618m879L595n295M542M246j976m184K16j0047
16950b3705j343j603P096O604m563r943k08R930J2092N243L149N678K772O888
16936A8087j5459o073J4638l441K254q268k076M861J407N001q428l536m118J1354
16922F203j442N965N046m564p589L005m194m805m309P394J4902q276p009q531
16908h204m47J2213Q660n365j4419j2901j4609j712J4312J4197j650m163o221
$$ plain form
16895 -20309 -18628 -19084 -14108 -10045 11153 23297 29764 17617 10058 12112 3182 -414 10309 11253
16881 11253 4764 -816 9470 7546 8783 7615 -7272 -7713 -4892 -1460 -12676 -21597 -21194 -23831
16867 -23831 -19048 -15722 -3079 13752 13209 9994 12083 12018 13268 -1936 3692 3671 4673 14467 16691
16852 16691 11074 9813 17808 15453 14759 22591 29063 20370 5383 -6748 -23476 -18238 -9241 -10803
16838 -10803 -19643 -18185 -16353 -20479 -13709 -124 13757 15148 -9789 -16032 -12237 -9788 -17193 -24367
16824 -24367 -15507 -22815 -24365 -33940 -29214 -7265 -9057 -11790 -2105 -6256 -8612 698 -1026 -5165
16810 -5165 3388 2139 -7190 -10501 -3084 -3729 2813 -5982 -5631 -8704 -3641 -7311 -7737 -78 -8979
16795 -8979 -13226 -5833 -14066 -19042 -17793 -7402 -9295 -7702 -7030 1814 16925 32492 33653 23006
$$ packed form
16895b0309J681m56M976M063K1198J2144O467j2147p559K054q930l596J0723R44
16881A1253o489n580J0286j924J237j168j4887m41K821L432j1216q921M03k637
16867b3831M783L326J2643J6831n43l215K089o5J250j5204N628k1J002R794K224
16852A6691n617j261P995k355o94P832O472q693j4987j2131j6728N238Q997j562
16838a0803q840J458J832m126O770J3585J3881J391k4937o243L795K449p405p174
16824b4367Q860p308j550r575M726K1949j792k733R685m151k356R310j724m139
16810e165Q553j249r329l311P417o45O542q795L51l073N063l670m26P659q901
16795h979m247P393q233m976J249J0391j893J593O72Q844J5111J5567J161j0647
$$ plain form
16781 23006 22353 28198 16888 4253 7355 17175 15697 7610 12418 15407 6096 -181 -19605 -33262
16767 -33262 -21299 -10127 1050 -10867 -10318 -434 9067 8654 -1086 -12651 -12795 -18849 -17281 -14026
16753 -14026 135 -3081 -13961 -21628 -15517 -2926 -5460 -2150 -15402 -23234 -20766 -35864 -27247
16740 -27247 -10520 -10021 -11104 -11195 -25927 -31473 -12062 -8036 -1961 12479 3581 -7733 -6475 -8709
16726 -8709 -7961 1254 -406 1524 452 -801 -5555 -2993 2521 -2870 -5791 -5422 4901 -2672 -6529
16711 -6529 -6866 -11345 -14197 -6277 -4316 -11884 -18354 -19285 727 -2152 -15324 -16783 -15455 -14864 -1652
16696 -1652 5950 -10479 -29664 -22143 -21077 -26277 -14406 -11030 -7256 5175 4355 3260 10619 11176
16682 11176 -2479 7255 11437 6146 1564 712 10422 17024 9276 5769 543 13373 9546 2167
$$ packed form
16781B3006o53N845j1310j2635L102R820j478q087M808K989r311o277j9424j3657
16767c3262J1963J1172J1177j1917N49R884R501m13r740j1565j44o054J568L255
16753a4026J4161l216j0880p667O111J2591k534L310j3252p832K468j5098Q617
16740b7247J6727M99j083r1j4732n546J9411M026O075J4440q898j1314J258k234
16726h709P48R215j660J930j072j253m754K562N514n391k921L69J0323p573l857
16711f529l37m479k852P920J961p568o470r31K0012k879j3172j459J328N91J3212
16696a652P602j6429j9185P521J066n200J1871L376L774J2431q20j095P359N57
16682A1176j3655R734M182n291m582q52R710O602p748l507n226J2830l827p379
$$ plain form
16668 2167 -622 4459 -4125 -16066 -23414 -23252 -18104 -1987 3178 -7708 -13498 -3623 1927 -6975
16654 -6975 -7923 -14910 -27670 -38498 -32793 -23761 -10012 -1141 -3457 -7943 -3304 5938 14616 19273
16640 19273 12506 7087 10085 7454 11944 20347 19151 -682 -2466 12141 5148 8063 9106 12563
16626 12563 7483 4356 -1626 -17290 -9417 -6274 -16967 0 6670 18521 23030 15275 17208
16613 17208 31494 50827 55500 64559 58907 32438 7992 -737 -4584 -11269 -10747 -6965 1648 111
16599 111 -3853 -3492 7782 7135 -3355 732 9095 23600 26378 -1030 -17619 -10100 -5598 -8154
16585 -8154 636 12787 14773 5845 16227 16528 2656 -2908 -12846 -7337 -10500 -15037 -14263 -13133
16571 -13133 -1949 -4595 -12205 -8683 -8853 -12567 -9290 -6941 -20253 -28942 -30428 -15640 -15547 -16778
$$ packed form
16668B167k789N081q584j1941p348J62N148J6117N165j0886n790R875N550q902
16654f975r48o987j2760j0828N705R032J3749Q871k316m486M639R242Q678M657
16640A9273o767n419K998k631M490Q403j196j9833j784J4607o993K915J043L457
16626A2563n080l127n982j5664P873L143j0693J6967O670J1851M509p755J933
16613A7208J4286J9333M673R059n652k6469k4446q729l847o685N22L782Q613j537
16599A11l964L61J1274o47j0490M087Q363J4505K778k7408j6589P519M502k556
16585h154Q790J2151J986q928J0382L01j3872n564r938N509l163m537P74J130
16571a3133J1184k646p610L522j70l714L277K349j3312q689j486J4788R3j231
$$ plain form
16557 -16778 -13019 -19856 -32857 -27966 -17007 -4403 1042 7666 6200 2119 3293 15864 10223
16544 10223 4483 -151 1721 1802 -9468 -5224 1580 12014 20509 6696 -4446 -9888 -7381 -3969
16530 -3969 -3727 -11742 -13300 -18453 -16646 -23156 -29260 -30237 -34884 -35030 -36770 -33792 -26553 -11003 534
16515 534 4861 -5502 -11486 -4293 8473 -1935 -12008 -9377 -17154 -21160 -11408 -5337 4507 5200
16501 5200 -6086 -14553 -13011 -8081 186 -3923 -10303 -1247 -5720 -13090 1979 6247 5472 13851
16487 13851 19073 -1418 -19358 -13352 -7176 -9444 1592 -650 -4277 -5134 -9096 -2873 -10236 -12430
16473 -12430 -13053 -8051 -1026 6263 1520 -975 -860 1348 15252 24643 22057 -245 -4559 10252
16459 10252 10086 21239 14588 -4607 -5340 -1695 4301 -4711 7519 25809 19769 5749 1179 -603
$$ packed form
16557a6778L759o837j3001M891J0959J2604N445O624j466m081J174J2571n641
16544A0223n740m634J872Q1j1270M244O804J0434Q495j3813j1142n442K507L412
16530c969K42q015j558n153J807o510o104r77m647j46j740K978P239J5550J1537
16515E34M327j0363n984P193J2766j0408j0073K631p777m006R752O071R844O93
16501E200j1286q467J542M930Q267m109o380R056m473p370J5069M268p75Q379
16487A3851N222k0491j7940O006O176k268J1036k242l627q57l962O223p363k194
16473a2430o23N002P025P289m743k495J15K208J3904R391k586k2302m314J4811
16459A0252j66J1153o651j9195p33L645N996r012J2230J8290o040j4020m570j782
$$ plain form
16445 -603 10865 14978 15395 -8405 -3844 13437 4388 -5966 1589 -5040 -1303 -4138 -857 -7149
16431 -7149 -6136 5340 10690 19504 8627 4860 6782 -751 -1467 3056 5018 -228 -4483 353
16417 353 5131 7311 785 -2937 -5229 -826 5730 34 19374 27391 27935 27212 19144 10357 10285 16281
16401 16281 5748 -4791 -10571 -6865 -11546 -10752 -6711 2359 -18088 -20607 7981 21796 13928
16388 13928 5723 6887 10038 -5411 -17575 -15291 -7364 117 555 -3600 12977 8363 5257 4610
16374 4610 4478 6088 14551 17993 16139 9482 5618 -1440 -1802 2140 -2024 -4264 1395 7397 11590
16359 11590 15607 17685 8679 8229 16334 18337 13684 3127 -181 4832 7811 10084 9011 5063
16345 5063 8465 2613 7209 5105 -423 -664 -8293 -13247 -8453 -5820 1050 -7788 -6677 -121 4126
$$ packed form
16445f03J1468M113M17k3800M561J7281r049j0354P555o629L737k835L281o292
16431g149J013J1476N350Q814j0877l767J922p533p16M523J962n246m255M836
16417C53M778K180o526l722k292M403O556n696J9340Q017N44p23q068q787p2N996
16401A6281j0533j0539n780L706m681P94M041R070k0447k519K8588J3815p868
16388A3928q205J164L151j5449j2164K284P927P481M38m155J6577m614l106o47
16374D610j32J610Q463L442j854o657l864p058l62L942m164k240N659O002M193
16359A1590M017K078r006m50Q105K003m653j0557l308N013K979K273j073l948
16345E063L402n852M596k104n528k41p629m954M794K633O870q838J111O556M247
$$ plain form
16330 4126 4664 3145 16829 23652 20520 8595 3736 10161 3632 -6248 -337 924 5416 6487
16316 6487 15066 15009 12364 4589 2145 5260 8381 10238 5557 -3091 -8736 -5771 8055 25010 32856
16301 32856 28794 10706 5699 31514 31575 22084 14051 17666 12324 10932 10286 9270 -779 -3585
16287 -3585 11964 14127 18545 17817 24595 19231 18264 25198 15988 1700 2732 -3497 -10354 -8780 -238
16272 -238 2457 -855 788 13081 23524 15502 6786 13651 9458 5639 16080 24391 16878 15780
16258 15780 9905 -15550 -14602 -8228 -7344 -11779 -9644 -4291 2614 4853 3419 -6060 -9268 -411 10204
16243 10204 9959 -1488 -4633 -5088 -10505 4553 7335 13602 11507 -4591 -7454 930 11913 10777
16229 10777 5077 -4608 -14388 -17269 -9062 -8826 -13075 -19059 -22870 -16654 -8270 -10209 -14571 -16706 -8240
$$ packed form
16330D126N38j519J3684O823l132j1925m859O425o529r880N911J261M492J071
16316F487Q579n7k645p775k444L115L121J857m681q648n645K965J3826J6955P846
16301C2856m062j8088n007K5815O1r491q033L615n342j392o46j016j0049k806
16287c585J5549K163M418p28O778n364r67O934r210j4288J032o229o857J574Q542
16272b38K695l312J643J2293J0443q022q716O865m193l819J0441Q311p513j098
16258A5780n875k5455R48O374Q84m435K135N353O905K239j434r479l208Q857J0615
16243A0204k45j1447l145m55n417J5058K782O267k095j6098k863Q384J0983j136
16229A0777n700r685r780k881Q207K36m249n984l811O216Q384j939m362k135Q466
$$ plain form
16214 -8240 -403 2654 -6971 -15259 -4113 -2958 7108 10553 4415 -1786 7109 19004 17478 1782
16200 1782 -8064 -5616 -6097 306 2133 -11779 -9707 -8554 -10443 -11757 -10411 -11976 -9682 -8334 -18783
16185 -18783 -5006 -10750 -18236 1695 16892 16403 9046 -17446 -22182 -11304 -8526 -12579 -4190
16172 -4190 1018 -1371 -119 -3432 -5025 -14791 -27055 -17362 1471 8655 4362 11071 12226 5570
16158 5570 4671 14160 12115 8679 7689 -674 -6220 -5377 -9588 -4981 -4324 8330 17346 11696 582
16143 582 -11103 -15907 -15094 -7777 -7314 -4854 -15463 -16772 -27292 -21877 -15083 -15123 -5876 -1351 12555
16128 12555 2212 -7481 -7049 -10495 2550 7194 12259 3950 -3563 -12045 -12649 -5232 4050 -3739
16114 -3739 -4534 -10402 -16326 516 12568 18728 14253 3150 9455 3746 -11208 -11469 2353 11561
$$ packed form
16214h240P837L057r625q288J1146J155J0066L445o138o201Q895J1895j526j5696
16200A782r846K448m81O403J827j3912K072J153j889j314J346j565K294J348j0449
16185a8783J3777n744p486J9931J5197m89p357k6492m736J0878K778m053Q389
16172d190N208k389J252l313j593r766j2264R693J8833P184m293O709J155o656
16158E570q99R489k045l436r90q363n546Q43m211M607O57J2654R016n650j1114
16143E82j1685m804Q13P317M63K460j0609j309j0520N415O794m0R247M525J3906
16128A2555j0343r693M32l446J3045M644N065q309p513q482o04P417R282p789
16114c739p95n868n924J6842J2052O160m475j1103O305n709j4954k61J3822R208
$$ plain form
16100 11561 -1910 -4217 12476 20906 22873 26601 33315 39530 33227 27829 22355 5835 -4569
16087 -4569 -10663 -3162 10673 16008 10283 9107 7166 8342 -9215 -10242 -7790 -7413 -17675 -19482
16073 -19482 -16934 -18409 -17129 -11527 -2516 -3450 -12643 -9918 -9793 -28749 -25151 -7480 97 -6040
16059 -6040 -15433 -7884 517 4306 2913 4522 6286 588 -3117 1550 2439 29 -4086 -8684 -7458
16044 -7458 -2687 9541 13594 779 -8061 -15123 350 -1878 -26318 -34363 -27307 -12899 -15368
16031 -15368 -10593 -9239 -4417 -14793 -20962 -14695 -6549 -2091 -16703 -15995 -6103 5814 305 805
16017 805 2611 -640 -1129 6429 9252 5094 828 -4636 -4745 -5664 11682 7399 -492 -26427 -39197
16002 -39197 -24453 -7827 -4794 -12843 -4508 340 -4685 -11975 -12997 -18669 -14126 -5987 4103 6784
$$ packed form
16100A1561j3471k307J6693Q430J967L728O714O215o303n398n474j6520j0404
16087d569o094P501J3835N335n725j176j941J176j7557j027K452L77j0262j807
16073a9482K548j475J280N602R011r34r193K725J25j8956L598J7671P577o137
16059f040r393P549Q401L789j393J609J764n698l705M667Q89k410m115m598J226
16044g458M771J2228M053j2815q840p062J5473k228k4440q045P056J4408k469
16031a5368M775J354M822j0376o169O267Q146M458j4612P08R892J1917n509N00
16017H05J806l251m89P558K823m158m266n464j09r19J7346m283p891k5935j2770
16002c9197J4744J6626L033q049Q335M848n025p290j022n672M543Q139J0090K681
$$ plain form
15988 6784 -1480 -339 -7544 -13418 -11275 -12040 -17134 -13917 -9718 9310 12734 6665 -4722 -13439
15974 -13439 -23419 -26220 -20135 -8351 -2841 -6913 -4780 528 4893 4071 3561 5589 3367 6377 13373
15959 13373 8306 12871 19052 16357 14616 4035 11016 9583 -4478 -7305 -7896 -7777 -5407 -8886
15945 -8886 -729 9973 7355 -738 -8560 -12070 -15847 -19608 -26402 -26893 -17703 -16793 -14509 -17112 -13699
15930 -13699 -1718 8363 4880 -2961 -14824 -3689 -8890 -15238 -10079 -17316 -19380 -20741 -27925
15917 -27925 -23685 -18916 -27475 -28401 -21310 -20578 -20253 -20977 -27712 -19006 -9716 6568 12021 11636 11941 20251
15901 20251 21093 12945 -2145 2895 -2951 -14166 -3799 13490 22999 21764 21826 24749 19108 8184
15887 8184 451 6242 10259 3828 -7123 -8905 1018 -1378 -17232 -15492 -20562 -14301 -21423 -16542
$$ packed form
15988F784q264J141p205n874K143p65n094L217M199J9028L424o069j1387q717
15974a3439r980k801O085J1784N510m072K133N308M365q22n10K028k222L010O996
15959A3373n067M565O181k695j741j0581O981j433j4061k827n91J19K370l479
15945h886Q157J0702k618q093p822l510l777l761o794m91R190R10K284k603L413
15930a3699J1981J0081l483p841j1863J1135n201o348N159p237k064j361p184
15917b7925M240M769q559r26P091P32L25p24o735Q706R290J6284N453l85L05Q310
15901B0251Q42q148j5090N040n846j1215J0367J7289R509j235O2K923n641j0924
15887H184p733N791M017o431j0951j782R923k396j5854J740n070O261p122M881
$$ plain form
15873 -16542 -10785 -9568 -13392 -12742 2808 -2726 -17902 -1811 -1021 -4634 -3762 -2571 -8556 -7289
15859 -7289 -5808 -1688 -15149 -23697 -27448 -14256 2523 -1356 -1638 -4860 -9451 -13727 -13280 -4616
15845 -4616 -7723 -11973 -10490 -19205 -27685 -16022 -18728 -19896 -18403 -18503 -27895 -19491 -19194 -25007 -11639
15830 -11639 9672 19667 18740 -5516 -23671 -22970 -17602 -18874 -18126 -9643 -11346 -2962 15088 12168
15816 12168 2359 9433 20959 28859 22575 12170 12970 -8910 -28373 -15177 3440 9101 10959
15803 10959 10603 15683 4103 1622 -8773 -18192 -15467 -6258 -13315 -10315 -7138 -905 2752 8714
15789 8714 13372 19263 14679 1454 -13460 -11011 1401 332 5448 9759 12966 -184 -8095 2278
15775 2278 14886 6489 808 -5658 -16113 -19728 -11634 -5119 2333 -10639 -14467 -13103 -11191 -5499
$$ packed form
15873a6542N757J217l824O50J5550n534j5176J6091P90l613Q72J191n985J267
15859g289J481M120j3461q548l751J3192J6779l879k82l222m591m276M47Q664
15845d616l107m250J483q715q480J1663k706j168J493j00r392Q404K97n813J3368
15830a1639K1311R995r27k4256j8155P01N368j272P48Q483j703Q384J8050k920
15816A2168r809P074J1526P900o284j0405Q00k1880j9463J3196J8617N661J858
15803A0959l56N080j1580k481j0395r419K725R209p057L000L177O233L657N962
15789H714M658N891m584j3225j4914K449J2412j069N116M311L207j3150p911J0373
15775B278J2608q397n681o466j0455l615Q094O515P452j2972l828J364J912N692
$$ plain form
15761 -5499 -10908 -18736 -20696 -22753 -11472 -15260 -23487 -13483 -6314 -8469 -13123 -7745 -18 -1120
15747 -1120 -1461 -4394 -10275 -7620 -10819 -10149 -14935 -13437 5412 9572 -212 -664 -6856 2856 4210
15732 4210 4894 11241 6899 9878 -886 -13277 -16953 -17336 -12575 -7315 -5576 8266 6655 -2126
15718 -2126 -22634 -28237 -19903 -20856 -20230 -5726 -14598 -24966 -20981 -8682 -11101 -19395 -21655 -17184
15704 -17184 -12522 -9242 998 6696 11829 -482 -5396 3962 -3008 -28067 -29613 -19862 -15107 -10810
15690 -10810 -8428 -6630 -362 -7703 -9308 -18048 -21721 -19361 -30346 -23659 -10462 6766 19776
15677 19776 6174 -1492 2461 2335 -4071 -11111 -20050 -13841 -10509 9444 13617 13172 6046 -2545
15663 -2545 -13460 -14568 -5382 -8938 -9739 -5076 2760 -7526 -2504 -17712 -24019 -16636 -11523 -10473
$$ packed form
15761e499n409p828j960k057J1281l788q227J0004P169k155m654N378P727j102
15747a120l41k933n881K655l199O70m786J498J8849M160r784m52o192R712J354
15732D210O84O347m342K979j0764j2391l676l83M761N260J739J3842j611q781
15718b126k0508n603Q334r53O26J4504q872j0368L985J2299k419q294k260M471
15704a7184M662L280J0240N698N133j2311m914R358o970k5059j546R751M755M297
15690a0810K382J798O268p341j605q740l673K360j0985O687J3197J7228J3010
15677A9776j3602p666L953j26o406p040q939O209L332J9953M173m45p126q591
15663b545j0915j108R186l556q01M663P836j0286N022j5208o307P383N113J050
$$ plain form
15649 -10473 -8350 -21639 -20802 -11586 -3554 -1061 -2903 -5086 -17234 -10670 1151 -383 -8619 -2525
15635 -2525 6901 -67 -7930 -16969 -28782 -34315 -38901 -39631 -18676 -9870 -9796 -13460 -14835 -8204 -3361
15620 -3361 -10651 -14218 -7648 -5251 -14419 -12990 -1870 -7074 -1048 5331 5305 829 1263 -520 -1617
15605 -1617 -14042 -25613 -11420 2887 14674 2740 -15410 -13544 -2612 -6450 2353 3386 -8290
15592 -8290 -10156 -12776 -13448 -8228 -3228 958 2224 -335 1093 -1558 -2893 68 12087 21768 24523
15577 24523 13908 6296 297 -7055 -6898 -7048 -10537 -12006 -10436 -12526 -12493 -2867 257 -7028 -6596
15562 -6596 -6634 1684 3695 -2360 -8055 -7307 -13116 -19547 -17862 -14711 -4385 -14520 -29627 -32567 -17910
15547 -17910 -17530 -9782 -3740 -1235 -3791 -9745 -5409 -7712 -4583 3378 7298 4804 -1126 4883 6927
$$ packed form
15649a0473K123j3289Q37R216Q032K493j842k183j2148O564J1821j534q236O094
15635b525R426o968p863r039j1813n533m586p30K0955Q806P4l664j375O631M843
15620c361p290l567O570K397r168J429J1120n204O026O379k6m476M34j783j097
15605a617j2425j1571J4193J4307J1787j1934j8150J866J0932l838Q803J033j1676
15592h290j866k620o72N220N000M186J266k559J428k651j335K961J2019R681K755
15577B4523j0615p612n999p352J57j50l489j469J570k090L3R626L124p285M32
15562f596l8Q318K011o055n695P48n809o431J685L151J0326j0135j5107k940J4657
15547a7910L80P748O042K505k556n954M336k303L129P961L920k494n930O009K044
$$ plain form
15532 6927 -5475 -7788 -5835 -7950 -11955 -372 2649 3183 5395 5 -2493 3563 494 -8102
15518 -8102 -17268 -14279 4346 13178 15794 3166 6592 12947 5997 -2164 -10188 -15457 -11304 -8813
15504 -8813 -25608 -26087 -16709 -13417 -16846 -14044 -18031 -10248 -2190 -1833 -13538 -23708 -26837 -3520
15490 -3520 7337 3189 12549 -1363 -12354 -11673 -17753 -18017 -5439 2378 -5418 -9514 -24975 -39604
15476 -39604 -30241 -18490 -16347 -20991 -14182 -1203 10571 4740 -10281 -9704 -6226 590 -5312 -8401
15462 -8401 -5066 -13614 -9109 -1954 -5386 -4049 -6655 -4333 1932 -7759 -21937 -19584 -20542 -8335
15448 -8335 -7485 -20522 -22278 -18293 -3922 6 -1793 -5897 836 5928 9539 8627 8797 5239 2581
15433 2581 2698 4364 -11017 -9608 -1169 -3594 2243 6937 10196 10384 18062 13386 16008 6000 -4309
$$ packed form
15532F927j2402k313J953k115m005J1583L021N34K212n390k498O056l069q596
15518h102r166K989J8625Q832K616j2628L426O355o950q161q024n269M153K491
15504h813j6795m79R378L292l429K802l987P783Q058L57j1705j0170l129K3317
15490c520J0857m148R360j3912j0991O81o080k64J2578P817p796m096j5461j4629
15476c9604R363J1751K143m644O809J2979J1774n831j5021N77L478O816n902l089
15462h401L335q548M505P155l432J337k606K322O265r691j4178K353r58J2207
15448h335Q50j3037j756L985J4371L928j799m104O733N092L611r12J70l558k658
15433B581J17J666j5381J409Q439k425N837M694L259J88P678m676K622j0008j0309
$$ plain form
15418 -4309 -3169 -70 5506 1065 -16176 -22517 -20232 -19583 -23965 -14294 -9755 -1758 1850 -7525 4624
15403 4624 4379 -13281 -8562 -9229 -22022 -32272 -29712 -18982 -17452 -11351 294 6231 14401 18234
15389 18234 5149 -283 2976 2105 2734 261 10053 9297 4777 4905 -8374 -13787 -16966 -9621 1394
15374 1394 -139 -568 -7084 -16980 -23358 -26953 -15981 -11528 -10353 -25851 -39510 -36911 -24169 -27991
15360 -27991 -29800 -41155 -36571 -39485 -46713 -32460 -32904 -22580 -3048 15493 11721 8046 7374 12569
15346 12569 18547 17666 -1372 -1050 -5656 -13171 -17473 -13057 -3790 -5691 -10167 -4705 -5551 1922 4666
15331 4666 -4331 -1045 2387 -1775 -5276 -8110 -15985 -15522 -21933 -30074 -13395 -24255 -32195 -13793
15317 -13793 -8360 -6158 -4582 6039 3696 -12400 -26609 -14916 -3300 -4283 -4708 -7107 -15259 -15552
$$ packed form
15418d309J140L099N576m441j7241o341K285O49m382R671M539P997L608r375J2149
15403D624k45j7660M719o67j2793j0250K560J0730J530O101J1645N937Q170L833
15389A8234j3085n432L259q71O29k473R792p56m520J28j3279n413l179P345J1015
15374A394j533m29o516r896o378l595J0972M453J175j5498j3659K599J2742l822
15360b7991j809j1355M584k914p228J4253m44J0324J9532J8541l772l675o72N195
15346A2569N978q81j9038L22m606p515m302M416R267j901m476N462q46P473K744
15331D666q997L286L432m162l501k834p875M63o411q141J6679j0860p940J8402
15317a3793N433K202J576J0621k343j6096j4209J1693J1616r83m25k399q152k93
$$ plain form
15303 -15552 -14177 -19054 -18793 -7350 -548 -12077 -5501 -7877 -9345 -8259 6941 9580 -1155 3091
15289 3091 10476 3493 2918 -1574 -437 -6205 2545 -1518 -11209 9494 16220 18543 36654 26632
15275 26632 29887 45499 65049 76602 95055 118921 146614 159180 153343 135962 111130 72821
15263 72821 56938 46707 23626 21235 22588 24426 26180 20616 22173 15045 7414 10944 7559 -7819
15249 -7819 -5893 11588 21195 27520 27370 23486 14651 7851 7537 14426 12007 13756 9422 5536 8707
15234 8707 3292 1732 -3103 573 16857 19008 9442 2598 11849 20628 10482 8044 10661 8753
15220 8753 10619 12922 4320 -1481 3513 13030 10316 3797 3438 13402 11417 3481 -221 -4833 -15419
15205 -15419 -6837 839 10230 17882 9425 -5002 -10179 -5492 -6489 2334 -6462 -8549 -9888 -6541
$$ packed form
15303a5552J375m877K61J1443O802j1529O576k376j468J086J5200K639j0735M246
15289C091P385o983n75m492J137n768Q750m063r691K0703O726K323J8111j0022
15275B6632L255J5612J9550J1553J8453K3866K7693J2566n837j7381k4832l8309
15263G2821j5883j0231k3081k391J353J838J754n564J557p128p631L530l385j5378
15249g819J926J7481R607O325j50l884q835o800l14O889k419J749m334l886L171
15234H707n415j560m835L676J6284K151r566o844R251Q779j0146k438K617j908
15220H753J866K303q602n801M994R517k714o519l59R964j985p936l702m612j0586
15205a5419Q582P676R391P652q457j4427n177M687r97Q823q796k087j339L347
$$ plain form
15191 -6541 -3598 -1343 -3392 -15849 -28435 -22067 -21505 -22934 -18569 -10544 -25973 -32476 -31196 -33229
15177 -33229 -15664 1848 -792 -7647 -7248 -6333 -6958 -13767 -6057 -572 -5029 -842 1887 -3033 -12466
15162 -12466 -2089 7225 1829 -1526 1794 -5337 1418 -167 3361 10518 13198 13918 663 -7146
15148 -7146 -303 -1663 -5165 -6365 -19523 -16847 -89 1790 -507 1744 5896 -2248 5921 15496
15134 15496 7554 -10114 -983 652 2835 3741 -4909 -9353 -17419 -1359 19336 27559 27047 22789
15120 22789 23785 22632 9992 11747 25751 19399 10883 13375 4971 -2700 116 16652 16745 8394
15106 8394 -8450 -2420 -5493 7062 12113 1798 -12801 -3041 7938 7710 12692 21567 10342
15093 10342 -10183 -17225 -12205 1603 1010 -15640 -27377 -21196 -9048 -10091 -13386 -15795 -10663
$$ packed form
15191f541K943K255k049j2457j2586O368N62j429M365Q025j5429o503J280k033
15177c3229J7565J7512k640o855L99R15o25o809P710N485m457M187K729m920r433
15162a2466J0377R314n396l355L320p131O755j585L528P157K680P20j3255p809
15148g146O843j360l502j200j3158K676J6758J879k297K251M152q144Q169R575
15134A5496p942j7668R131J635K183R06q650m444q066J6060K0695Q223n12m258
15120B2789R96j153j2640J755J4004o352q516K492q404p671K816J6536R3q351
15106H394j6844O030l073J2555N051j0315j4599R760J0979k28M982Q875j1225
15093A0342k0525p042N020J3808n93j6650j1737O181J2148j043l295k409N132
$$ plain form
15080 -10663 -11721 -12110 2770 5347 -2800 -7552 -13775 -13431 -8182 10779 8088 1981 1945 3545 -10756
15065 -10756 -7714 -8775 -22979 -31359 -10581 4261 2807 9324 13818 12627 16046 11075 11692 3295
15051 3295 -931 -3475 7519 3696 -13383 -10482 8868 13663 11923 117 -4725 -1057 -4937 -1222
15037 -1222 -9928 -6691 3737 -4434 828 1724 3458 7111 20153 10672 -8491 -11022 1436 -3700
15023 -3700 -551 17521 32864 36791 38277 39514 11029 -5828 -3916 -48 3283 1943 -1369 6013
15009 6013 5974 -858 -10907 -24449 -18784 -5238 -7848 -8344 -8397 -2643 3651 -1396 6435 6021 5776 12125
14993 12125 22636 27473 26489 16794 7317 5373 -583 -13277 -12727 7249 13256 -1554 2060 7728
14979 7728 8532 24027 11080 -1622 -5664 -7796 -7767 -6706 -11238 -16639 1213 -1335 -1472 1884 -7802
$$ packed form
15080a0663j058l89J4880K577q147m752o223L44N249J8961k691o107l6J600j4301
15065a0756L042j061j4204q380K0778J4842j454O517M494j191L419m971O17q397
15051C295m226k544J0994l823j7079K901J9350M795j740j1806m842L668l880L715
15037a222q706L237J0428q171N262Q96J734L653J3042r481j9163k531J2458n136
15023c700L149J8072J5343L927J486J237k8485j6857J912L868L331j340l312P382
15009F013l9o832j0049j3542N665J3546k610m96n3N754O294n047P831m14k45O349
14993A2125J0511M837r84r695r477j944n956j2694N50J9976O007j4810L614N668
14979G728Q04J5495j2947j2702m042k132K9J061m532n401J7852k548j37L356r686
$$ plain form
14964 -7802 -6349 -8340 -5336 -5216 1051 -5408 -19419 -18193 -1937 5544 -9960 1983 1140 9421
14950 9421 16502 11174 1766 -1917 -15997 -16930 -18640 -29306 -27432 -16161 -10648 -10999 -21838 -30616
14936 -30616 -15361 9243 25630 19027 5146 -4802 -3116 3845 8761 8074 7495 -6943 -14763 -4923
14922 -4923 15294 19333 10128 3452 7308 2527 -3170 662 4979 13132 2161 -6855 -9418 -8864
14908 -8864 -21694 -36131 -28395 -24406 -15547 -9836 -5136 -16728 -11485 2359 2627 -5839 -17091 -16854
14894 -16854 -12861 -4720 4956 -841 -6677 -3051 -4562 -2458 13190 17438 6230 21286 18873 26979
14880 26979 29784 14585 -5523 -12087 -7912 -7327 -4780 6821 5218 10431 7170 -3817 -2366 -6230
14866 -6230 -21476 -22607 -13297 -4401 2682 -5764 -12353 -14112 -23220 -26555 -11505 3829 -6522 -5463
$$ packed form
14964g802J453j991L004J20O267o459j4011J226J6256P481j5504J1943q43Q281
14950I421P081n328r408l683j4080r33j710j0666J874J1271N513l51j0839q778
14936c0616J5255K4604J6387o603j3881r948J686O961M916o87n79j4438p820R840
14922d923K0217M039r205o676L856m781n697L832M317Q153j0971r016k563N54
14908h864j2830j4437P736L989Q859N711M700j1592N243J3844K68q466j1252K37
14894a6854L993Q141R676n797n836L626j511K104J5648M248j1208J5056k413Q106
14880B6979K805j5199k0108o564M175N85K547J1601j603N213l261j0987J451l864
14866f230j5246j131R310Q896P083q446o589j759r108l335J5050J5334j0351J059
$$ plain form
14852 -5463 -1295 2497 18979 22069 5149 6238 8749 2370 -7798 2965 8516 -8038 -7767 -12374
14838 -12374 -12651 -10857 -10314 -1912 -9830 -19182 -18535 -14047 -11110 -6056 -5589 -8696 -15810 -19153 -5338
14823 -5338 776 2574 15803 22022 14028 6973 5881 2087 1224 -2779 -582 1795 -8216 -5035
14809 -5035 1100 12378 23087 11004 982 5548 6461 2878 8729 7309 -972 1089 12715 15642
14795 15642 10163 2924 8999 15990 7410 -7089 -9596 -13413 -12934 -4170 -10883 -13891 -10378 -15204
14781 -15204 -17758 -19412 -15600 -5438 -7098 -10103 -8739 -21349 -20484 -4616 -6510 -832 2236 11758
14767 11758 16319 3179 -10877 -8702 -3033 6774 26340 30758 29836 12342 4824 -1965 -2541 -13446
14753 -13446 -17761 -3909 3281 11529 1227 3762 -5320 -15771 -23866 -12018 -3556 -9191 -16288
$$ packed form
14852e463M168L792J6482L090j6920J089K511o379j0168J0763N551j6554K71m607
14838a2374k77J794N43Q402p918r352O47M488K937N054M67l107p114l343J3815
14823e338O114J798J3229O219p994p055j092l794q63m003K197K377j0011L181
14809e035O135J1278J0709j2083j0022M566R13l583N851j420q281K061J1626K927
14795A5642n479p239O075O991q580j4499k507l817M79Q764o713l008L513m826
14781a5204k554j654L812J0162j660l005J364j2610Q65J5868j894N678L068R522
14767A1758M561j3140j4056K175N669R807J9566M418r22j7494p518o789n76j0905
14753a3446m315J3852P190Q248j0302K535r082j0451q095J1848Q462n635p097
$$ plain form
14740 -16288 -12062 -13862 -8909 9516 12062 3911 14731 21853 17653 4597 -1250 -4632 936 3666
14726 3666 2582 7069 3777 -6256 -6173 -1611 -7245 -10186 2505 13785 20052 19442 13911 13207 8401
14711 8401 2432 -4444 -10282 -14670 -9925 -15969 -20983 -22701 -24162 -22613 880 12261 12416 6199
14697 6199 -4497 2900 11284 2113 -128 -2238 4091 -779 540 -4485 -6146 -9742 4368 19824
14683 19824 21551 13993 -1537 -7719 -13385 -12980 -14208 -17657 -17407 -18146 -12050 -2537 15764 13456 15947
14668 15947 20022 14443 9008 17786 10347 13115 13536 599 2864 9193 8354 -6333 374 23203
14654 23203 27974 14828 -4717 -3544 -2740 706 4265 151 -5858 -8458 -4304 17583 16032 4029
14640 4029 -2219 -12725 -2073 -3798 -3126 7082 810 9136 15765 9507 9634 3863 -8426 -9291
$$ packed form
14740a6288M226j800M953J8425K546q151J0820P122m200j3056n847l382N568K730
14726C666j084M487l292j0033Q3M562n634k941J2691J1280O267o10n531p04m806
14711H401n969o876n838m388M745o044n014j718j461J549K3493J1381J55o217
14697F199j0696P397Q384r171k241k110O329m870J319n025j661l596J4110J5456
14683A9824J727p558j5530o182n666M05j228l449K50p39O096R513J8301k308K491
14668A5947M075n579n435Q778p439K768M21j2937K265O329q39j4687O707K2829
14654B3203M771j3146j9545J173Q04L446L559m114o009k600M154K1887j551j2003
14640D029o248j0506J0652j725O72J0208o272Q326O629o258J27n771j2289q65
$$ plain form
14626 -9291 -15144 -21215 -22194 -15950 646 8245 5509 -1602 -6986 -6160 -9308 -12624 -9080 -7233 -1830
14611 -1830 4281 4537 -9465 -6892 -9698 -4677 -423 5566 6650 9332 -7484 -15623 -16385 -13478 -8071
14596 -8071 -2291 6243 20978 9125 -155 -5803 -7568 -10648 -7586 975 9825 794 -3966 -4012 -1472
14581 -1472 13984 18109 9356 -1625 -1895 -8153 -7792 -17396 -19400 6299 6077 5855 -1621 -11318 -15188
14566 -15188 -18434 -25904 -15566 6104 2900 2994 13512 25651 18668 15339 22385 24437 27504 17059
14552 17059 13740 15011 13533 4023 -19283 -23560 -6300 5429 -4010 -11740 1945 12005 6920
14539 6920 -2790 -5039 -10941 -11045 -15607 -20359 -19661 -19075 -11205 -5775 334 -17384 -23556 -16231 -17989
14524 -17989 -15578 -17200 -9171 -2185 -5203 1472 22893 21891 -4474 -14369 -2090 2679 -8304
$$ packed form
14626i291n853o071r79O244J6596P599k736p111n384Q26l148l316L544J847N403
14611a830O111K56j4002K573k806N021M254N989J084K682j6816q139p62K907N407
14596h071N780Q534J4735j1853r280n648j765l080L062Q561Q850r031m760m6K540
14581a472J5456M125q753j0981k70o258L61r604k004K5699k22k22p476r697l870
14566a5188l246p470J0338K1670l204R4J0518J2139o983l329P046K052L067j0445
14552A7059l319J271j478r510k3306m277J7260J1729r439p730J3685J0060n085
14539F920r710k249n902j04m562m752O98N86P870N430O109j7718o172P325j758
14524a7989K411j622Q029O986l018O675K1421j002k6365r895J2279M769j0983
$$ plain form
14511 -8304 -9322 5158 -1119 1919 11233 6496 15244 15673 5536 -733 -6037 -8523 -10740 -15601
14497 -15601 -14712 -7423 -4882 -5142 480 1785 -12819 -6902 -1143 1891 -6073 -16960 -21268 -18808
14483 -18808 -9450 2350 10908 25993 14951 -1074 -2075 6699 13527 9109 411 -10333 -9632
14470 -9632 -6135 -7832 -3727 1787 2284 10338 13390 -1127 -5047 -3230 -4607 -7297 -11060 4102
14456 4102 7921 4655 5178 9740 13585 15393 16882 14582 9550 15936 9057 17300 19312 17177 18518
14441 18518 13306 11668 -2545 -7345 -5869 -11686 -2988 -5827 -8239 -13522 -16290 -10699 -8966 -6549
14427 -6549 -4391 7570 15034 17044 23181 14445 4366 -2268 1555 3366 9772 16572 -2449 1644
14413 1644 9611 1036 -12217 -14709 -27614 -25827 -21747 -17063 -21248 -19415 -22995 -20199 -17135 129
$$ packed form
14511h304j018J4480o277L038R314m737Q748M29j0137o269n304k486k217m861
14497a5601Q89P289K541k60N622J305j4604N917N759L034p964j0887m308K460
14483a8808R358J1800Q558J5085j1042j6025j001Q774O828m418q698j0744P01
14470i632L497j697M105N514M97Q054L052j4517l920J817j377k690l763J5162
14456D102L819l266N23M562L845J808J489k300n032O386o879Q243K012k135J341
14441A8518n212j638j4213m800J476n817Q698k839k412n283k768N591J733K417
14427f549K158J1961P464K010O137q736j0079o634L823J811O406O800j9021M093
14413A644P967q575j3253k492j2905J787M080M684m185J833l580K796L064J7264
$$ plain form
14399 129 1236 252 3922 1577 -7350 -1004 7556 21051 12763 11900 21602 17721 8795 -4129 -12050
14384 -12050 -1310 13586 17547 17903 11938 967 1969 4955 -4307 -2977 -2872 -2529 -397 -3580
14370 -3580 9664 15759 19124 19233 11852 11549 9532 -3530 -18998 -20131 -13893 2642 6461 13935
14356 13935 4293 4639 5082 1224 4989 -968 5167 9455 3852 -168 7363 22242 28734 20634 -90
14341 -90 -14621 -23102 -13570 -2403 -1111 8831 -747 5236 5771 -2509 -2986 5012 7126 1245 -1644
14326 -1644 5919 6423 -2343 2944 15471 17270 4391 1547 8776 8566 -1657 -13179 -14746 -19282
14312 -19282 -8142 -8951 -4802 3724 2115 -2319 -9965 -9251 4335 7158 7786 14227 19905 2442
14298 2442 -17530 -22110 -16525 -5304 -3352 -2282 2330 5376 7647 8545 3448 4341 2331 -7951
$$ packed form
14399A29J107r84L670k345q927O346Q560J3495q288q63R702l881q926j2924p921
14384a2050J0740J4896L961L56n965j0971J002K986r262J330J05L43K132l183
14370c580J3244O095L365J09p381l03k017j3062j5468j133O238J6535L819P474
14356A3935r642L46M43l858L765n957O135M288n603m020P531J4879O492q100k0724
14341i0j4531q481R532J1167J292R942r578N983N35q280m77P998K114n881k889
14326a644P563N04q766N287J2527J799j2879k844P229k10j0223j1522j567m536
14312a9282J1140q09M149Q526j609m434p646P14J3586K823O28O441N678j7463
14298B442j9972m580N585J1221J952J070M612L046K271Q98n097Q93k010j0282
$$ plain form
14284 -7951 3703 20171 21731 15400 13327 11006 11888 7548 15665 10750 6381 9455 16450 19548
14270 19548 5871 4789 15768 11488 1386 -1052 -9983 -1914 12610 33191 32312 21216 11226
14257 11226 3831 11298 12639 3930 10777 19973 38028 41548 38142 24809 9715 5237 2552 -2630
14243 -2630 -1957 -16273 -14159 366 5503 2124 14725 18986 19484 20607 10319 5022 10590 10313
14229 10313 -1820 -8014 -18737 -14636 -5709 -5254 -6897 -7210 -1136 11083 15744 27363 31634 19888
14215 19888 17335 17000 9493 7861 6188 8792 5788 7679 16585 15629 24446 25858 17705 2764 2056
14200 2056 20593 16999 -3018 -8152 -5814 -8616 -9209 -10795 -13256 -9640 -8754 -15625 -6169 6951
14186 6951 6520 8785 16328 23495 15956 6211 2566 347 -7576 -12623 -15131 -19081 -27431 -26903 -7988
$$ packed form
14284g951J1654J6468J560o331k073k321Q82m340Q117m915m369L074O995L098
14270A9548j3677j082J0979m280j0102k438q931Q069J4524K0581q79j1096r990
14257A1226p395P467J341q709O847R196J8055L520l406j3333j5094m478k685n182
14243b630O73j4316K114J4525N137l379J2601M261M98J123j0288n297N568k77
14229A0313j2133o194j0723M101Q927M55j643l13O074J2219M661J1619M271j1746
14215A9888k553l35p507j632j673K604l004J891Q906r56Q817J412q153j4941p08
14200B056J8537l594k0017n134K338k802n93j586k461L616Q86o871R456J3120
14186F951m31K265P543P167p539r745l645k219p923n047k508l950q350N28J8915
$$ plain form
14171 -7988 0 -1969 -5849 -173 5296 1048 -10790 -9688 3010 10600 -2526 -11403 -14300 -14252
14157 -14252 -9229 -11870 -444 11724 17070 13182 7509 546 1147 950 -8703 -19506 -11610 3960
14143 3960 4800 4107 1194 -9698 -18223 -96 2264 6240 563 -1970 -6311 -8534 -3514 -6259 -13204
14128 -13204 -11170 -19600 -35773 -25393 -5981 -10446 -18670 -24208 -19395 -19263 -9267 -4801 5809 -1432
14114 -1432 2882 5992 -6 -6243 -1465 9752 13039 21005 21814 11463 9749 14823 24602 15470
14100 15470 17356 11639 1050 5761 14227 9596 16789 8943 -2476 -3952 -3684 -8513 -13272 -13764
14086 -13764 -9385 11750 21043 7417 -10145 -10925 -16722 -15756 -3985 -3206 -15815 -10427 744 -12524
14072 -12524 -21476 -15917 -8620 27 3771 -7309 -1226 11438 11324 13131 3785 -8769 -12312 -9588
$$ packed form
14171g988P988j969l880N676N469m248j1838J102J2698P590j3126q877k897M8
14157a4252N023k641J1426J2168N346l888n673o963O01j97r653j0803P896J5570
14143C960Q40o93k913j0892q525J8127K360L976n677k533m341k223N020k745o945
14128a3204K034q430j6173J0380J9412m465q224n538M813J32R996M466J0610p241
14114a432M314L110n998o237M778J1217L287P966Q09j0351j714N074R779r132
14100A5470J886n717j0589M711Q466m631P193p846j1419j476K68m829m759m92
14086a3764M379K1135R293j3626j7562p80n797R66J1771P79j2609N388J1171j3268
14072a2524q952N559P297Q647L744j1080O083J2664j14J807r346j2554l543K724
$$ plain form
14058 -9588 1146 1503 -8695 298 8021 7651 11215 10564 3777 1158 11224 21876 23040 35918
14044 35918 34392 26208 19837 14628 9236 1869 10246 16054 12671 97 -2189 2862 -3623 -7806
14030 -7806 -13833 -20939 -13305 -6174 7832 11278 12878 18945 10878 -3516 -21580 -22555 -20897 -21457
14016 -21457 -7749 6910 -862 -2250 -7763 -8045 4453 13972 11978 2263 -10994 -11043 -5211 -7516
14002 -7516 -1355 87 6503 8855 -238 -3382 -611 -19534 -12283 -6946 -4835 -3185 -5144 35
13988 35 -2890 2963 2664 874 5811 10687 7164 -9344 -13973 -7615 5764 11165 1545 -13831 -8124
13973 -8124 -13804 -17734 -19345 -22946 -27895 -23101 -13407 -13041 -19007 -13613 1554 9601 3362 -8082
13959 -8082 -11977 -12961 -4328 4552 9915 13152 15587 18916 17902 6062 -4763 -3609 4051 10922
$$ packed form
14058i588J0734L57j0198Q993P723l70L564o51o787k619J0066J0652J164J2878
14044C5918j526q184o371n209n392p367Q377N808l383j2574k286N051o485m183
14030g806o027p106P634P131J4006L446J600O067q067j4394j8064r75J658n60
14016b1457J3708J4659p772j388n513k82J2498R519j994r715j3257m9N832k305
14002g516O161J442O416K352r093l144K771j8923P251N337K111J650j959N179
13988C5k925N853k99j790M937M876l523j6508m629O358J3379N401r620j5376N707
13973h124n680l930j611l601m949M794R694L66n966N394J5167Q047o239j1444
13959h082l895r84Q633Q880N363L237K435L329j014j1840j0825J154P660O871
$$ plain form
13945 10922 10478 5170 3256 -2312 -4210 -709 -3423 10232 6915 -7675 -12214 -4722 1953 12495
13931 12495 12696 9509 12546 6393 -7775 -9388 4033 17885 29194 17947 12592 27547 32670
13918 32670 18278 20009 19793 14339 4953 -18219 -20776 -18144 -14624 -21654 -19029 -16314 -10391 -7293
13904 -7293 -668 1179 -8783 -12927 -7416 -7357 -19817 -17381 -8261 825 16387 13877 15336 17206 13478
13889 13478 5546 5730 6917 8576 9966 12666 6815 -2144 -15922 -9465 -1872 -7899 -4728 -581
13875 -581 2267 1009 9491 13999 10338 4080 -806 1298 401 1075 8758 2513 2283 -605 6152 -6150
13859 -6150 -6670 5441 -3209 -6675 -8577 -4203 849 -4156 -14345 -16616 -3039 6793 7396 11663
13845 11663 2605 -25987 -15938 -8104 3113 16906 18342 23870 21122 7393 -3412 -6268 -464
$$ packed form
13945A0922m44n308j914n568j898L501k714J3655l317j4590m539P492O675J0542
13931A2495K01l187L037o153j4168j613J3421J3852J1309j1247n355J4955N123
13918C2670j4392J731k16n454r386k3172k557K632L520p030K625K715N923L098
13904g293O625J847r962m144N511N9j2460K436R120R086J5562k510J459J870l728
13889A3478p932J84J187J659J390K700n851q959j3778O457P593o027L171M147
13875e81K848j258Q482M508l661o258m886K104q97O74P683o245k30k888O757j2302
13859f150n20J2111q650l466j902M374N052n005j0189k271J3577R832O03M267
13845A1663r058k8592J0049P834J1217J3793J436N528k748j3729j0805k856N804
$$ plain form
13832 -464 -4000 -30704 -28733 -23770 -24344 -15101 -1451 4644 7564 922 15 9343 2227 -6275 -12903
13817 -12903 -22104 -19787 -9311 -10191 -9127 5439 7745 -2341 1238 9671 11038 20666 26049 27708
13803 27708 24686 21453 26473 27438 21699 12368 7639 -1417 14725 26222 28903 29258 20776 11477
13789 11477 9172 10347 14559 25271 29525 28475 22415 30007 26162 19748 10997 19879 13901 18622
13775 18622 23240 28996 27882 22205 25265 15145 31476 31839 15465 26123 35030 38064 42968 56338
13761 56338 62835 67760 96466 127642 173106 222730 257340 271326 257371 204118 142701 107653
13749 107653 85231 62235 42903 32735 24286 34050 44048 48545 41747 26216 10445 -2972
13737 -2972 279 5876 6516 8453 24065 27107 23485 20495 25313 18855 9264 -2361 -7142 1925
$$ packed form
13832d64l536k6704J971M963n74R243J3650O095K920o642r07R328p116q502o628
13817a2903r201K317J0476q80J064J4566K306j0086L579Q433J367R628N383J659
13803B7708l022l233N020R65n739r331m729r056J6142J1497K681L55q482r299
13789A1477k305J175M212J0712M254j050o060P592l845o414q751Q882n978M721
13775A8622M618N756j114n677L060j0120J6331L63j6374J0658Q907L034M904J3370
13761E6338O497M925K8706L1176M5464M9624L4610J3986j3955n3253o1417l5048
13749A07653k2422k2996j9332j0168q449R764R998M497o798j5531j5771j3417
13737b972L251N597O40J937J5612L042l622k990M818o458r591j1625m781R067
$$ plain form
13723 1925 6526 211 -10382 -8030 7206 10745 13419 34112 40146 35436 19323 29472 25306
13710 25306 28865 23108 24501 27807 34639 42886 46964 52049 51904 44989 49240 50000 62743 75618
13696 75618 70947 93404 125575 144615 167955 215755 262907 312572 395556 533749 776407
13685 776407 1162387 1625012 1965359 1976815 1671240 1198725 795701 526754 368375 278746
13675 278746 215406 158218 122617 106999 107914 93036 60066 35234 31353 37428 35619 38257 42717
13662 42717 37487 27840 20417 21446 25500 27337 25672 30713 14931 10777 14342 19197 -1936 -6587
13648 -6587 -2428 10770 8096 21297 38236 33372 26964 24994 27988 29597 33886 38292 42717 30409
13634 30409 16204 15278 18132 23891 37908 25688 18258 19990 26416 26928 20134 18665 23183 25580
$$ packed form
13723A925M601o315j0593K352J5236L539K674K0693O034m710j6113J0149m166
13710B5306L559n757J393L306O832Q247M078N085j45o915M251P60J2743J2875
13696G5618m671K2457L2171J9040K3340M7800M7152M9665Q2984J38193K42658
13685G76407L85980M62625L40347J1456l05575m72515m03024k68947j58379q9629
13675B78746o3340n7188l5601j5618R15j4878l2970k4832l881O075j809K638M460
13662D2717n230r647p423J029M054J837j665N041j5782m154L565M855k1133m651
13648f587M159J3198k674J3201J6939m864o408j970K994J609M289M406M425j2308
13634C0409j4205r26K854N759J4017j2220p430J732O426N12o794j469M518K397
$$ plain form
13620 25580 25016 13261 14654 16302 25895 17384 12377 19472 18011 17553 19448 20317 20405 19879 24197 19771
13604 19771 12221 22081 34863 43126 35618 19455 15148 15939 16177 11599 11981 9790 17166 10361 1129
13589 1129 2677 5083 -2073 16257 20418 19836 10954 14761 10707 7516 19873 32803 39529 46028
13575 46028 38251 32760 34493 34840 31912 31093 23790 22244 30372 34928 41194 63123 56841 50043 47254
13560 47254 35947 30428 42221 50362 49624 44068 35888 15917 15919 23054 36157 42669 45304 65235
13546 65235 86269 90172 77042 70936 55956 41575 26802 10013 -2299 -2797 -11057 -21679 -15987
13533 -15987 -656 8916 11774 -2313 -7242 -3697 5095 18231 25933 39719 33698 10664 -4992
13520 -4992 -9982 1841 18718 23785 26117 24989 22705 21408 8461 798 4939 21612 39882
$$ packed form
13620B5580n64j1755J393J648R593q511n007P095j461m58J895Q69Q8n26M318m426
13604A9771p550R860J2782Q263p508j6163m307P91K38m578L82k191P376o805r232
13589A129J548K406p156J8330M161n82q882L807m054l191J2357J2930O726O499
13575D6028p777n491J733L47k928q19p303j546Q128M556O266K1929o282o798k789
13560D7254j1307n519J1793Q141p38n556q180j9971KP135J3103O512K635J9931
13546F5235K1034L903j3130o106j4980j4381j4773j6789j2312m98q260j0622N692
13533a5987J5331R572K858j4087m929L545Q792J3136P702J3786o021k3034j5656
13520d992m990J1823J6877N067K332j128k284j297j2947p663M141J6673J8270
$$ plain form
13507 39882 45854 47602 46283 54030 69306 74754 72680 69170 59219 54460 119465 231929 285620
13494 285620 272658 228573 206447 191721 164403 126947 93092 82241 84004 78872 80913 79240
13482 79240 64542 68761 70038 57272 62232 50629 49021 60422 60769 43747 32031 25690 30374
13469 30374 37704 48862 46058 28510 15973 17186 15767 18907 30522 29993 29298 33162 34992 46423
13455 46423 51182 41963 19313 16883 26255 41307 53547 65846 57215 62353 54940 43764 38310
13442 38310 24043 22029 25674 34010 29387 30285 31441 32572 29983 43495 68006 74498 75053 73317
13428 73317 71397 68951 52811 45672 41462 24785 20579 31602 40977 47041 51973 43429 53461
13415 53461 73704 80588 68962 81434 90825 101016 82644 81677 89012 80079 73183 87129 97603
$$ packed form
13507C9882N972J748j319P747J5276N448k074l510r951m759O5005J12464N3691
13494B85620j2962m4085k2126j4726k7318l7456l3855j0851J763n132K041j673
13482G9240j4698M219J277j2766M960j1603j608J1401L47j7022j1716o341M684
13469C0374P330J1158k804j7548j2537J213j419L140J1615n29o95L864J830J1431
13455D6423M759r219k2650k430R372J5052J2240J2299q631N138p413j1176n454
13442C8310j4267k014L645Q336m623Q98J156J131k589J3512K4511O492N55j736
13428G3317j920k446j6140p139m210j6677m206J1023R375O064M932q544J0032
13415E3461K0243O884j1626J2472R391J0191j8372r67P335q933o896J3946J0474
$$ plain form
13402 97603 112554 110727 110098 106091 102876 123081 125273 125866 133317 159190 182830 188781 182990 195506
13388 195506 202702 209257 205467 187089 180086 170642 163685 166933 179208 171910 162020 164079 174650
13375 174650 183466 210497 215608 201247 194006 211427 292343 295023 223726 170695 136217 98437
13363 98437 77537 68881 80119 89000 94038 109638 147306 193344 203276 210601 204109 196890 189038
13350 189038 162591 160056 151084 149547 151230 136572 140050 142908 142924 138372 129326 126004 115461 111752
13336 111752 119500 124451 132366 138739 140279 154444 171362 170478 164206 179633 210300 250472 272615
13323 272615 282572 283657 290824 310048 330272 336136 343993 368508 397948 405256 418532 434635 439229
13310 439229 435288 437075 448060 464626 472154 485759 505936 507971 512012 523978 542773 575413
$$ packed form
13402I7603J4951j827o29m007l215K0205K192N93P451K5873K3640N951n791J2516
13388A95506P196O555l790j8378p003r444o957L248J2275p298r890K059J0571
13375A74650Q816K7031N111j4361p241J7421Q0916K680p1297n3031l4478l7780
13363I8437k0900q656J1238Q881N038J5600L7668M6038R932P325o492p219p852
13350A89038k6447k535q972j537J683j4658L478K858J6m552r046l322j0543l709
13336A11752P748M951P915O373J540J4165J6918q84o272J5427L0667M0172K2143
13323B72615R957J085P167J9224K0224N864P857K4515K9440P308J3276J6103M594
13310D39229l941J787J0985J6566P528J3605K0177K035M041J1966J8795L2640
$$ plain form
13298 575413 611760 656481 712249 783018 846610 877772 895170 919464 937900 960085 969146 967457
13286 967457 988189 1023834 1064546 1120721 1198590 1281615 1364624 1439733 1523960 1614242 1717060
13275 1717060 1841791 1988227 2157893 2345932 2521318 2702745 2854982 3036651 3282598
13266 3282598 3619013 4029075 4472934 4975228 5556214 6205905 6956757 7861739 8968647
13257 8968647 10299973 11918566 13932664 16464668 19652549 23617676 28579767 34928976
13249 34928976 43149585 53972204 69180635 92939070 133275073 199502555 288210496
13242 288210496 365818462 388872333 346012166 259245679 173888987 114690375 78909786
13235 78909786 57422755 43461631 33525937 26095649 20583424 16630957 13814090 11774727
$$ packed form
13298E75413L6347M4721N5768P0769O3592L1162J7398K4294J8436K2185R061j689
13286I67457K0732L5645M0712N6175P7869Q3025Q3009P5109Q4227R0282J02818
13275A717060J24731J46436J69666J88039J75386J81427J52237J81669K45947
13266C282598L36415M10062M43859N02294N80986O49691P50852R04982J106908
13257H968647J331326J618593K014098K532004L187881L965127M962091O349209
13249C4928976Q220609J0822619J5208431K3758435M0336003O6227482Q8707941
13242B88210496P7607966K3053871m2860167q6766487q5356692n9198612l5780589
13235G8909786k1487031j3961124r935694p430288n512225l952467k816867k039363
$$ plain form
13227 11774727 10213779 8995343 8013073 7145232 6357989 5670419 5105010 4624328 4229679
13218 4229679 3923425 3672334 3432295 3215127 2975224 2729316 2513648 2339689 2220386
13209 2220386 2116846 2044359 1973932 1885914 1792625 1701895 1620959 1540044 1479264 1420847 1374003
13198 1374003 1310381 1229077 1162052 1108346 1060912 1010643 979702 967111 939982 918954 906181
13187 906181 888387 880905 887283 869931 826411 782582 739192 712774 694069 666454 638822 616625
13175 616625 607814 615005 596315 564651 523095 487143 462673 448895 437008 423841 423397 426815
13163 426815 423533 412304 393886 388077 381221 379986 393376 417486 421557 414126 398023 379584 371000
13150 371000 380169 378253 386481 409315 397651 363080 338475 330809 318685 296219 289777 288151 272574
$$ packed form
13227A1774727j560948j218436r82270q67841p87243o87570n65409m80682l94649
13218D229679l06254k51091k40039k17168k39903k45908k15668j73959j19303
13209B220386j03540p2487p0427q8018r3289r0730q0936q0915o0780n8417m6844
13198A374003o3622q1304o7025n3706m7434n0269l0941j2591k7129k1028j2773
13187I06181j7794p482O378j7352m3520m3829m3390k6418j8705k7615k7632k2197
13175F16625q811P191j8690l1664m1556l5952k4470j3778j1887j3167m44L418
13163D26815l282j1229j8418n809o856j235J3390K4110M071p431j6103j8439q584
13150C71000R169j916Q228K2834j1664l4571k4605p666j2124k2466o442j626j5577
$$ plain form
13137 272574 258331 245110 233393 217381 205059 193847 197149 206822 208152 215772 225872 234496
13125 234496 242656 256036 249765 256765 256635 278988 339111 419628 427143 325267 244192 216658
13113 216658 198678 209695 207540 189130 163001 140431 127227 117358 117425 122814 132531 127135 125626
13100 125626 118887 114045 100522 105968 122360 140333 178836 214740 218090 206066 195219 173396
13088 173396 144416 131665 120350 104467 97048 92566 91325 103824 114986 118491 134732 141324
13076 141324 132374 124231 125952 118169 108203 118061 119422 118089 133305 164622 205085 261856 331054
13063 331054 392014 412472 400457 354833 293987 222460 183457 153138 143980 136165 139998 143806
13051 143806 162897 182099 202013 213087 234495 278960 345420 408979 440453 398874 331435
$$ packed form
13137B72574j4243j3221j1717j6012j2322j1212L302R673J330P620J0100Q624
13125B34496Q160J3380o271P000j30K2353O0123Q0517P515j01876q1075k7534
13113B16658j7980J1017k155j8410k6129k2570j3204r869O7N389R717n396j509
13100A25626o739m842j3523N446J6392J7973L8503L5904L350j2024j0847k1823
13088A73396k8980j2751j1315j5883p419m482j241J2499J1162L505J6241O592
13076A41324q950q143J721p783r966R858J361j333J5216L1317M0463N6771O9198
13063C31054O0960K0458j2015m5624o0846p1527l9003l0319r158p815L833L808
13051A43806J9091J9202J9914J1074K1408M4465O6460O3559L1474m1579o7439
$$ plain form
13040 331435 280928 232105 186442 174400 168820 149678 133689 110670 95502 87265 77027 68444
13028 68444 75487 76449 81355 67905 57864 54334 56679 60176 78711 78726 92718 87640 72300 74975
13014 74975 90716 101971 89573 70073 81075 87605 91574 101996 122773 138713 145150 162209
13002 162209 165348 140797 117769 92522 80037 81012 73570 62901 80587 116284 139993 130918
12990 130918 109443 116146 94084 93671 82737 67263 50314 40675 33625 28419 25805 22840 13034
12977 13034 15635 22336 23743 36787 43492 48659 57441 66142 67092 49778 21186 21949 30411 37695
12963 37695 52404 55069 38608 31592 40290 42419 32613 33068 30017 41475 40644 33800 37321 30908
12949 30908 31689 28339 37574 47706 34191 37741 41520 36004 18577 10231 13458 5773 10034 29166
$$ packed form
13040C31435n0507m8823m5663j2042n580j9142j5989k3019j5168q237j0238q583
13028F8444P043R62M906j3450j0041l530K345L497J8535J5J3992n078j5340K675
13014G4975J5741J1255j2398j9500J1002O530L969J0422K0777J5940O437J7059
13002A62209L139k4551k3028k5247j2485R75p442j0669J7686L5697K3709r075
12990A30918k1475O703k2062m13j0934j5474j6949r639p050n206k614k965r806
12977A3034K601O701J407J3044O705N167Q782Q701R50j7314k8592P63Q462P284
12963C7695J4709K665j6461p016Q698K129r806M55l051J1458q31o844L521o413
12949C0908P81l350R235J0132j3515L550L779n516j7427q346L227p685M261J9132
$$ plain form
12935 29166 40741 52056 53248 38611 25462 25787 34917 32404 20768 8878 13698 15868 27132
12922 27132 38856 38929 30401 35776 38295 33138 36353 40916 32788 26718 18124 20328 26063 39769
12908 39769 60097 70275 66972 74048 64218 41772 33754 41146 30343 29064 16836 12805 18656
12895 18656 15844 13878 17854 19231 14885 14038 6238 -3625 -2171 3155 7828 12760 19604 23656 25987
12880 25987 25168 12142 10859 17729 6644 10119 16620 15282 20160 20155 1859 4293 14766 21548
12866 21548 20855 5973 -4104 2002 7385 4266 7019 15210 15439 16003 10381 1944 5461 6325 880
12851 880 5474 7201 3815 -9131 -12964 -4981 -1259 9960 32792 33273 29884 18800 15897 10214
12837 10214 5118 7794 21987 26484 20228 13935 15972 23585 11445 11384 18628 20075 21041 26288 35016
$$ packed form
12935B9166J1575J1315J192j4637j3149L25R130k513j1636j1890M820K170J1264
12922B7132J1724P3q528N375K519n157L215M563q128o070q594K204N735J3706
12908C9769K0328J0178l303P076r830k2446q018P392j0803j279j2228m031N851
12895A8656k812j966L976J377m346q47p800r863J454N326M673M932O844M052K331
12880B5987q19j3026j283O870j1085L475O501j338M878nj8296K434J0473O782
12866B1548o93j4882j0077O106N383l119K753Q191K29N64n622q437L517Q64n445
12851H80M594J727l386j2946l833P983L722J1219K2832M81l389j1084k903n683
12837A0214n096K676J4193M497o256o293K037P613j2140o1P244J447R66N247Q728
$$ plain form
12822 35016 38947 35538 37121 38969 36596 27660 38015 37187 35327 30392 37874 65392 81259 91367
12808 91367 93942 94732 92765 107618 130048 163468 190803 243478 293279 370045 494161 680257
12796 680257 989661 1428013 1849837 2000901 1803955 1381154 959207 652364 446482 321047
12786 321047 235116 175213 150617 134333 120955 117726 119057 114771 117101 128705 126495 112290
12774 112290 92961 72867 55798 49408 40622 43075 40159 37098 41618 27443 25588 20013 22103
12761 22103 24632 28657 29451 18756 2377 -3839 -121 -580 -1061 15361 24618 18319 18478 18536 14971
12746 14971 10175 12300 5173 14256 21050 11786 21372 27839 5031 -8956 -4728 4251 10728 4388
12732 4388 -5500 1027 10495 20301 26639 17508 6318 17326 33680 33844 21188 11668 12022 6159
$$ packed form
12822C5016L931l409J583J848k373q936J0355q28j860m935P482K7518J5867J0108
12808I1367K575P90j967J4853K2430L3420K7335N2675M9801P6766J24116J86096
12796F80257L09404M38352M21824J51064j96946m22801m21947l06843k05882j25435
12786C21047q5931n9903k4596j6284j3378l229J331m286K330J1604k210j4205
12774A12290j9329k0094j7069o390q786K453k916l061M520j4175j855n575K090
12761B2103K529M025P94j0695j6379o216L718m59m81J6422R257o299J59N8l565
12746A4971m796K125p127R083O794r264R586O467k2808j3987M228Q979O477o340
12732D388r888O527R468R806O338r131j1190J1008J6354J64j2656r520L54n863
$$ plain form
12718 6159 4278 -8931 -10993 -632 9154 7043 5157 6894 1921 -5718 -2742 -2702 5524 9656 16848
12703 16848 8831 -151 -11220 -15157 408 7297 3817 739 -4298 5333 13111 10490 -4277 -15598
12689 -15598 -14827 841 9362 5026 4056 8703 -2376 -1182 -3860 -8883 -4092 1563 8834 835
12675 835 -14199 -9692 2555 8023 4354 3403 100 -297 6035 17141 16215 10477 8497 7672 9399
12660 9399 4807 2627 -7502 -14038 -16808 -16997 -12070 2281 7474 2592 11417 2044 1047 -10617
12646 -10617 -8061 -4155 4490 11884 7516 12984 5652 -430 15618 14237 13754 3398 96 2217
12632 2217 2353 8310 6664 16863 13195 -1260 -1449 -12485 -6253 1296 20950 29872 12455 -8606
12618 -8606 -3531 -8365 -7091 -1889 -12057 -9057 -10929 -11787 -11964 -14058 -6227 -8966 -2044 -150 -4867
$$ packed form
12718F159j881j3209k062J0361R786k111j886J737m973p639K976M0Q226M132P192
12703A6848q017q982j1069l937J5565O889l480l078n037R631P778k621j4767j1321
12689a5598P71J5668Q521m336r70M647j1079J194k678n023M791N655P271p999
12675H35j5034M507J2247N468l669r51l303l97O332J1106r26n738j980q25J727
12660I399m592k180j0129o536k770j89M927J4351N193m882Q825r373r97j1664
12646a0617K556L906Q645P394m368N468p332o082J6048j381m83j0356l302K121
12632B217J36N957j646J0199l668j4455j89j1036O232P549J9654Q922j7417k1061
12618h606N075m834J274N202j0168L000j872q58j77k094P831k739O922J894m717
$$ plain form
12603 -4867 721 11389 10547 19312 18144 14661 10041 1117 -14214 -5704 -1486 3152 7732 7399 5344
12588 5344 9532 1080 13740 26761 16957 5543 9126 4257 -6005 -10748 47 18963 16387
12575 16387 6351 3651 -5349 -3726 -2646 96 8538 701 -3907 16242 27045 26449 14792 7938
12561 7938 2431 7718 3154 2941 8405 5518 4586 -3983 -765 2962 1326 645 3460 7057 6081 7941
12545 7941 9818 -3025 -4821 4885 370 -1848 4069 -5543 -10185 -4791 -6382 1067 9049 2854
12531 2854 -2121 -1097 -3091 -154 13757 12094 -4678 -13012 -7430 -12696 -16285 -3984 217 -9010
12517 -9010 5549 9955 2653 -2034 -5068 -9601 -6434 -2029 -6001 -3114 1664 703 -4484 3939 15077
12502 15077 16572 14776 8007 -1261 -4685 -1830 9785 10368 5531 1017 15113 26149 18021 5325
$$ packed form
12603d867N588J0668q42Q765j168l483m620q924j5331Q510M218M638M580l33k055
12588E344M188q452J2660J3021r804j1414L583m869j0262m743J0795J8916k576
12575A6387j0036k700r000J623J080K742Q442p837m608K0149J0803n96j1657o854
12561G938n507N287m564k13N464k887r32q569L218L727j636o81K815L597r76J860
12545G941J877j2843j796R706m515k218N917r612m642N394j591P449P982o195
12531B854m975J024j994K937J3911j663j6772q334N582n266l589J2301M201r227
12517i010J4559M406p302m687l034m533L167M405l972K887M778r61n187Q423J1138
12502A5077J495j796o769r268l424K855J1615N83m837m514J4096J1036q128j2696
$$ plain form
12488 5325 4221 5443 8433 4368 11357 6981 2426 -10683 -10868 -10593 -14235 -7656 -2194 -7020 -6791
12473 -6791 638 -3808 -7153 -236 2446 2009 -8438 -6659 -701 -11664 -30200 -23763 -795 11446
12459 11446 12701 7745 4474 325 -1989 7914 21939 8800 8457 -1277 -12044 -13925 -12906 -15675
12445 -15675 -9634 -18406 -24909 -19273 -16940 -12743 -5072 9750 21844 22357 9511 7780 10705 10675
12431 10675 11976 11615 14512 7832 -4228 -10650 -1983 6656 1300 -661 -4298 8256 20058 14904
12417 14904 3666 -1363 4050 3916 5872 25696 26970 19377 13483 5857 1620 3488 3947 7765
12403 7765 11719 16878 12828 3790 -2095 -11116 -16350 -14375 -13592 -18434 -21827 -21873 -17680 -21574 -9909
12388 -9909 8579 10541 5957 7230 -10502 -39874 -36860 -12517 -6165 -4518 -2682 -9163 -13685 -4069
$$ packed form
12488E325j104J222K990m065O989m376m555j3109j85K75l642O579N462m826K29
12473f791P429m446l345O917K682m37j0447J779N958j0963j8536O437K2968J2241
12459A1446J255m956l271m149k314R903J4025j3139l43r734j0767j881J019k769
12445a5675O041q772o503N636K333M197P671J4822J2094N13j2846j731K925l0
12431A0675J301l61K897o680j2060o422Q667Q639n356j961l637J2554J1802n154
12417A4904j1238n029N413j34J956J9824J274p593n894p626m237J868M59L818
12403G765L954N159m050r038n885r021n234J975P83m842l393m6M193l894J1665
12388i909J8488J962m584J273j7732k9372L014K4343O352J647J836o481m522R616
$$ plain form
12374 -4069 -8645 -13376 -15234 9497 23048 21338 12564 9268 11220 1275 -14906 -14817 -13573 -7333
12360 -7333 2065 8697 7238 5637 7401 1886 14626 18361 11752 10021 5895 5566 7890 18340
12346 18340 15569 14863 6107 -3294 -9850 5004 14140 11488 9108 10112 17209 17490 9395 8264 13185
12331 13185 337 -2684 -2140 10565 23246 21330 19350 17386 -3144 20434 34543 24672 16877
12318 16877 19012 22298 21643 11325 2784 -7314 -9975 10075 8324 6073 -3537 -4831 3919 5939
12304 5939 4373 13173 22270 13840 9787 5955 3894 8737 18382 29499 32898 34851 11171 -6675
12290 -6675 -18696 -5534 10410 4644 17333 10595 -6097 -9910 -420 14248 11283 10045 6964
12277 6964 -4718 -22608 -12323 -1906 -5641 -10720 -8925 -2772 -4087 -3335 -2442 9082 15184 9371
$$ packed form
12374d069m576m731j858K4731J3551j710q774l296J952r945j6181Q9J244O240
12360g333R398O632j459j601J764n515J2740L735o609j731m126l29K324J0450
12346A8340k771p06q756r401o556J4854R136k652k380J004P097K81q095j131M921
12331A3185j2848l021N44J2705J2681j916j980j964k0530K3578J4109r871p795
12318A6877K135L286o55j0318q541j0098k661K0050j751k251r610j294Q750K020
12304E939j566Q800R097q430m053l832k061M843R645J1117L399J953k3680j7846
12290f675j2021J3162J5944n766J2689o738j6692l813R490J4668k965j238l081
12277F964j1682j7890J0285J0417l735n079J795O153j315P52Q93J1524O102n813
$$ plain form
12263 9371 5518 1078 -6951 3108 11128 5423 5855 5688 14936 11777 9146 6523 278 -3226 -9390
12248 -9390 -2589 -7125 -6690 -11378 -12305 -9194 -3548 -10897 -19236 -29956 -18516 -5392 -10019 -10099 -15272
12233 -15272 -2517 2200 2318 -990 -11357 -10425 -1534 11216 14057 5369 1597 6334 8033 21518
12219 21518 9704 -5953 -14306 -10284 -3566 1457 8489 19947 17808 -1132 -19608 -14558 -5053
12206 -5053 -7374 3399 -5076 -5814 3779 -1897 -8735 -14925 -30286 -25731 -19696 -16930 -29159 -20323
12192 -20323 -5455 2202 -228 -672 12487 9798 10640 1233 -3639 -3935 -184 10783 4922 11742
12178 11742 11806 12254 1947 -1476 5688 16093 20128 11343 -2058 -4002 -14996 -10647 5154 11308
12164 11308 16876 8548 -10968 -13946 -22567 -9162 -1769 2683 -4669 3212 8887 10850 8387 8436
$$ packed form
12263I371l853m440q029J0059Q020n705M32j67R248l159k631k623o245l504o164
12248i390O801m536M35m688r27L111N646p349q339j0720J1440J3124m627q0n173
12233a5272J2755M717J18l308j0367R32Q891J2750K841q688l772M737J699J3485
12219B1518j1814j5657q353M022O718N023P032J1458k139j8940j8476N050R505
12206e053k321J0773q475p38R593n676o838o190j5361M555O035K766j2229Q836
12192b0323J4868P657k430m44J3159k689Q42r407m872k96L751J0967n861O820
12178A1742O4M48j0307l423P164J0405M035q785j3401j944j0994M349J5801O154
12164A1308N568q328j9516k978q621J3405P393M452p352P881N675J963k463M9
$$ plain form
12150 8436 11234 11044 9260 1452 2297 3452 -3296 -12141 -12849 -10537 -19453 -15974 -1687 1353 4084
12135 4084 680 11171 11116 8446 9191 601 -2455 -10404 -20273 -20100 -3569 7651 -4168 -1387 1268
12120 1268 -1042 -2355 -234 2599 -8453 275 4823 -2794 -4008 8494 10181 3579 4837 403
12106 403 4165 13593 27106 23984 20562 22320 15132 -2888 -498 4100 -805 -12212 -14327 -12485
12092 -12485 1611 6059 180 526 1319 4560 7603 5136 987 9198 13241 3270 5590 17126
12078 17126 18996 6444 -1655 8447 15956 6276 3417 2049 4741 -4365 1948 5133 3851 971
12064 971 -9973 2008 7782 6662 2585 4828 146 -6836 -555 12661 13691 12942 12456 17990 18739
12049 18739 16457 -4756 -2159 4626 -7113 -19541 -17035 -12147 -18693 -12336 2099 4530 4404 10945
$$ packed form
12150H436K798j90j784p808Q45J155o748q845p08K312q916L479J4287L040K731
12135D084l404J0491n5k670P45q590l056p949r869J73J6531J1220j1819K781K655
12120A268k310j313K121K833j1052Q728M548p617j214J2502J687o602J258m434
12106D03L762R428J3513l122l422J758p188j8020K390M598m905j1407k115J842
12092a2485J4096M448n879L46P93L241L043k467m149Q211M043r971K320J1536
12078A7126J870j2552q099J0102P509r680k859j368K692r106O313L185j282k880
12064I71j0944J1981N774j120m077K243m682o982O281J3216J030p49m86N534P49
12049A8739k282k1213K597O785j1739j2428K506M888o546O357J4435K431j26O541
$$ plain form
12035 10945 6999 8168 10137 9744 21167 15102 -1197 -5160 3312 1005 -2149 -621 -1904 -5350
12021 -5350 -990 -8763 -13457 -15150 -17814 -15510 -4368 7182 6590 -3890 5778 12941 12338 12037 4945
12006 4945 15453 18345 3749 -14552 -14305 -7405 -7484 -10957 -12230 -4073 6372 916 -236 10467
11992 10467 25058 23123 19888 16958 13650 6550 6601 6868 -6744 -4537 -897 2932 -5231 -5106 2649
11977 2649 9975 5435 1369 6214 5595 -4032 -8798 3572 10895 20081 14569 -980 -384 -5675 -6797
11962 -6797 -2428 -7277 -7442 -4832 17164 10161 8891 3808 3947 7086 6011 -7 -4684 -7884 -12317
11947 -12317 -24321 -16043 -3022 -13251 -13508 -4695 -4208 4049 6119 5182 10267 4027 13885 14800 5145
11932 5145 762 -2304 -5993 -4539 -3590 -4840 -6835 -3765 5447 5797 4119 -7701 -2389 16033 30420
$$ packed form
12035A0945l946J169J969l93J1423o065j6299l963Q472k307l154J528j283l446
12021e350M360p773m694j693k664K304J1142J1550n92j0480R668P163o03l01p092
12006D945J0508K892j4596j8301K47O900p9l473j273Q157J0445n456j152J0703
11992A0467J4591j935l235k930l308p100N1K67j3612K207L640L829q163J25P755
11977B649P326m540m066M845o19r627m766J2370P323R186n512j5549N96n291j122
11962f797M369m849j65K610K1996p003j270n083J39L139j075o018m677l200m433
11947a2317j2004Q278J3021j0229k57Q813M87Q257K070r37N085o240R858R15r655
11932E145m383l066l689J454R49j250j995L070R212L50j678j1820N312J8422J4387
$$ plain form
11917 30420 15453 5978 18929 18242 12285 5750 -10467 -21079 -26663 -21611 -10552 -4533 4800
11904 4800 10618 -128 1544 -6086 -11002 -7694 -5381 -356 1348 13354 17793 18435 7344 -6694
11890 -6694 -4945 8450 9837 6983 3664 5011 -3978 -16293 -8185 11040 18390 3126 -3920 -11202
11876 -11202 -11979 -12986 -17836 -18986 -21620 -5632 6967 15804 11404 -6161 -14622 -1092 209 -10152
11862 -10152 -23307 -19324 -13942 -29864 -26591 -8497 9864 6631 -2344 -14223 -23884 -18478 -17000
11849 -17000 -17447 -5805 3735 -1629 -737 -3706 -1058 -1040 6213 25912 29200 17905 -412 -7993
11835 -7993 -6705 -11787 -7552 -7909 -5926 1517 -4954 -11872 -8169 -12256 -16835 -19533 -19748 -21222 -13151
11820 -13151 -7694 -2623 2981 846 -11251 -15473 -8374 -13757 -8814 -8820 -1966 1363 9000 142 651
$$ packed form
11917C0420j4967r475J2951o87n957o535j6217j0612n584N052J1059O019R333
11904D800N818j0746J672p630m916L308K313N025J704J2006M439O42j1091j4038
11890f694J749J3395J387k854l319J347q989j2315Q108J9225P350j5264p046p282
11876a1202p77j007m850j150k634J5988J2599Q837m400j7565q461J3530J301j0361
11862a0152j3155L983N382j5922L273J8094J8361l233q975j1879r661N406J478
11849a7000m47J1642R540n364Q92k969K648J8P253J9699L288j1295j8317p581
11835g993J288n082M235l57J983P443o471o918L703m087m579k698k15j474Q071
11820a3151N457N071N604k135j2097m222P099n383M943oO854L329P637q858N09
$$ plain form
11805 651 17088 21169 22806 16626 12063 4586 4300 9938 14637 14400 2921 2282 -6838 -9158 -3727
11790 -3727 -3739 -6252 1697 -1370 -14589 -12916 -1704 -2102 -4709 -14170 -8434 302 4190 -6169 -21792
11775 -21792 -30863 -27784 -23689 -7815 -2890 1790 1998 -2093 -6750 -10013 -6737 -7869 1450 11106
11761 11106 27117 21168 2673 -10128 -9689 -12204 -476 10848 -1044 -16219 -19309 -19073 -8523
11748 -8523 -16564 -15767 -15238 -14435 -10830 -2757 -6975 -15737 -18303 -26585 -20143 1323 2610 3857 -2996
11733 -2996 -8021 -5458 8047 -11251 -9955 2325 5089 3578 3230 11848 2813 -12448 -5329 3096
11719 3096 905 -1913 -4214 -13276 -19564 -15584 -5600 -5063 -16428 -4354 7622 4706 -5503 -25143
11705 -25143 -27568 -30244 -38017 -42629 -20917 -14907 -24278 -25102 -21825 -9178 -526 6392 5690 -2827
$$ packed form
11805F51J6437M081J637o180m563p477k86N638M699k37j1479o39r120k320N431
11790c727j2k513P949l067j3219J673J1212l98k607r461N736Q736L888j0359j5623
11775b1792r071L079M095J5874M925M680K08m091m657l263L276j132R319R656
11761A1106J6011n949j8495j2801M39k515J1728J1324j1892j5175l090K36J0550
11748h523q041P97N29Q03L605Q073m218q762k566q282O442K1466J287J247o853
11733b996n025K563J3505j9298J296J2280K764j511l48Q618r035j5261P119Q425
11719C096k191k818k301r062o288L980R984N37j1365J2074J1976k916j0209j9640
11705b5143k425k676p773m612K1712O010r371q24L277J2647Q652O918p02q517
$$ plain form
11691 -2827 -2686 1181 5760 12497 3696 -6853 -22759 -18022 -9824 -14382 -17146 -12566 -15850 -14103
11677 -14103 -6643 -8957 -6137 -3307 -1724 -12553 -19700 -6014 -15536 -22583 -17612 -15447 -7539 13553
11663 13553 19824 4309 5378 2883 11705 8266 -9137 -8647 6362 21809 16239 6251 4276 -1341
11649 -1341 -17942 -8752 -1389 7907 3969 -11340 -19044 -21132 -10134 -5687 -10604 -4184 2266 -529
11635 -529 -1648 2168 7432 -3186 7534 990 -11884 -18226 -18532 -12232 -8484 -4265 -4154 4730 -2162
11620 -2162 -1422 -3328 -5659 -7051 -6727 9095 3721 -8491 -17473 -29771 -21040 -11495 -7047 -992
11606 -992 7722 1182 -5087 -8161 -8478 -4908 1080 16236 10148 10387 13037 5530 4100 -6349 -12522
11591 -12522 -10109 -8663 -1825 6823 5157 4382 4180 -4295 -16791 -25451 -22009 -13962 -9778 -1278 -3675
$$ packed form
11691b827J41L867M579O737q801j0549j5906M737Q198m558k764M580l284J747
11677a4103P460k314K820K830J583j0829p147J3686r522p047M971K165P908K1092
11663A3553O271j5515J069k495Q822l439j7403M90J5009J5447n570r988j975n617
11649a341j6601R190P363R296l938j5309p704k088J0998M447m917O420O450k795
11635e29j119L816N264j0618J0720o544j2874o342l06O300L748M219J11Q884o892
11620b162P40j906k331j392L24J5822n374j2212q982j2298Q731R545M448O055
11606i92Q714o540o269l074l17L570N988J5156o088K39K650p507j430j0449o173
11591a2522K413J446O838Q648j666p75k02q475j2496q660L442Q047M184Q500k397
$$ plain form
11576 -3675 -5212 2711 12101 13129 26606 24197 12217 12928 -710 -17946 -21072 -7763 4143
11563 4143 -626 10502 335 -6381 6172 9233 3433 983 -1286 10204 16342 12290 -6593
11550 -6593 -11364 246 6865 -8430 -18926 -17313 -10207 -26160 -28220 -5174 8696 11076 -3246
11537 -3246 -9511 -1984 -1593 -2955 -15290 -23828 -21347 -9206 8484 4456 -12111 -17118 -22107 -29653
11523 -29653 -33432 -36026 -21963 -2252 -2741 -9180 4959 6540 -14983 -15530 -2972 -6220 -8509 -10783
11509 -10783 -5539 1208 -4035 826 -1153 3461 1873 -9392 -7474 -18123 -28864 -28105 -20907 -14504
11495 -14504 -21103 -17052 3545 8693 -79 -4182 -13233 1748 -1900 -9068 -17062 -13752 -5412 -4788
11481 -4788 -10327 -15770 -19273 -16153 -5530 5768 7275 15861 6873 8725 7751 -3198 -12563 -21398
$$ packed form
11576c675j537P923R390J028J3477k409j1980P11j3638j7236l126J3309J1906
11563D143m769J1128j0167o716J2553L061n800k450k269J1490O138m052j8883
11550f593m771J1610O619j5295j0496J613P106j5953k060K3046J3870K380j4322
11537c246o265P527L91j362j2335q538K481J2141J7690m028j6567n007m989p546
11523b9653l779k594J4063J9711m89o439J4139J581k1523n47J2558l248k289k274
11509a0783N244O747n243M861j979M614j588j1265J918j0649j0741P59P198O403
11495a4504o599M051K0597N148q772m103r051J4981l648p168p994L310Q340O24
11481d788n539n443l503L120J0623J1298J507Q586q988J852r74j0949r365q835
$$ plain form
11467 -21398 -21004 -3834 8095 3414 -6526 437 9923 -4247 -5135 -5542 -19609 -15432 603 473
11453 473 6629 2038 1413 -1617 -5842 -4576 -564 6841 2939 -1924 -110 -6087 7056 3071 -5665
11438 -5665 2126 7319 6761 6950 10179 6607 -7114 -11037 -16284 -24315 -37614 -38619 -38173 -36374 -31687
11423 -31687 -22799 -22063 -29533 -33152 -23559 -8106 -3978 -8949 -3758 2032 1629 4808 -8582 -21252
11409 -21252 -17480 8799 21396 20987 24461 18359 10928 10415 3565 -8390 -18469 -16087 -23253 -14075
11395 -14075 4756 10466 2828 1023 -8049 -12783 -3392 -9775 -4877 -11571 -15504 -14455 -11436 -4957
11381 -4957 -6682 -8266 7137 9277 6862 11184 8975 -9831 -1850 21648 23204 20000 3389 -9884
11367 -9884 -15076 -8592 -11413 -7351 -8992 -24714 -25424 -22791 -12129 -9385 2970 1022 -3542 1018
$$ packed form
11467b1398L94J7170J1929m681r940O963R486j4170q88m07j4067M177J6035j30
11453D73O156m591o25l030m225J266M012P405l902m863J814n977J3143l985q736
11438e665P791N193n58J89L229l572j3721l923n247q031j3299j005M46J799M687
11423c1687Q888P36p470l619R593J5453M128m971N191N790m03L179j3390j2670
11409b1252L772K6279J2597m09L474o102p431n13o850j1955j0079K382p166R178
11395a4075J8831N710p638j805r072m734R391o383M898o694l933J049L019O479
11381d957j725j584J5403K140k415M322k209j8806P981K3498J556l204j6611j3273
11367i884n192O484k821M062j641j5722p10K633J0662K744J2355j948m564M560
$$ plain form
11353 1018 8144 14243 3668 1718 -3429 3138 8171 8308 2979 -5887 -17294 -14685 -8050 -10741
11339 -10741 -19558 -17725 -11584 -7214 4867 685 -14437 -27114 -19194 -10223 -9254 -26404 -18684 -3592
11325 -3592 -6833 -16030 -10539 -591 7732 -1469 -8529 -17618 -26120 -6914 2954 1401 2573 -6823
11311 -6823 -19489 -7802 2998 3904 2113 8163 3156 -8945 -15958 -18936 -28190 -15339 -10005 -16010
11297 -16010 -20452 -20505 -11437 1062 10782 11359 5686 -1571 3012 9096 -3353 -3503 14246 25084
11283 25084 20020 14192 4959 -4846 -7531 -17858 -11236 3845 18840 19690 16566 8819 7734 3896
11269 3896 -5249 5921 16134 10182 -860 -5950 201 -2940 -509 -13656 -22716 -10360 -18154
11256 -18154 -16852 -11246 -16321 -16525 -22693 -36424 -37070 -22794 -7745 -2535 -10965 -10213 -7212 -9444
$$ packed form
11353A018P126O099j0575j950n147O567N033J37n329q866j1407K609O635k691
11339a0741q817J833O141M370J2081m182j5122j2677P920Q971R69j7150P720J5092
11325c592l241r197N491R948Q323r201p060r089q502J9206R868j553J172r396
11311f823j2666J1687J0800R06j791O050n007j2101p013k978r254J2851N334o005
11297a6010m442n3R068J2499R720N77n673p257M583O084j2449j50J7749J0838
11283B5084n064n828r233r805k685j0327O622J5081J4995Q50l124p747j085l838
11269C896r145J1170J0213n952j1042n090O151l141K431j3147r060J2356p794
11256a8154J302N606n075k04o168j3731o46J4276J5049N210q430P52L001k232
$$ plain form
11242 -9444 -5590 2737 -3123 -9704 -16847 -19837 -5588 570 -1016 -5514 -15540 -8179 -15118 -19443
11228 -19443 -12147 -11063 -2598 6843 4211 -9577 -8262 -9378 -13125 3645 -3917 -21181 -28367 -34606
11214 -34606 -27833 -23903 -28946 -25718 -14763 -15268 -10994 -6205 -3021 12454 16693 5709 -10061 -1655
11200 -1655 9532 -522 -17734 -26158 -23288 -35593 -29404 -11093 -876 -4156 -4159 -2210 -5983 -3639
11186 -3639 -6558 -17263 -11778 4209 13964 13479 14033 17614 13726 1588 -2417 -2660 -10806 -24156
11172 -24156 -9213 1767 1769 15360 27126 17542 1672 -3811 -15692 -316 -1191 3645 -1369 -1790
11158 -1790 -5489 -4784 5681 -2655 -14232 -5997 9761 9237 -4031 5062 22379 16616 4283 535
11144 535 -12733 -10523 3640 -4982 -172 17139 26289 15626 3074 2852 15198 9857 2848 -889
$$ packed form
11242i444L854Q327n860o581p143k990J4249O158j586m498j0026P361o939m325
11228a9443P296J084Q465R441k632j3788J315j116l747J6770p562j7264p186o239
11214c4606O773L930n043L228J0955n05M274M789L184J5475M239j0984j5770Q406
11200a655J1187j0054j7212q424K870j2305O189J8311J0217l280lJ949l773K344
11186c639k919j0705N485J5987R755m85N54L581l888j2138m005k43q146j3350
11172b4156J4943J0980KJ3591J1766r584j5870n483j1881J5376q75M836n014m21
11158a790l699P05J0465q336j1577Q235J5758n24j3268R093J7317n763j2333l748
11144E35j3268K210J4163q622M810J7311R150j0663j2552k22J2346n341p009l737
$$ plain form
11130 -889 -751 9557 9325 -8322 -12292 -9277 -5964 4948 10308 7610 1605 -13140 -22498 -13829
11116 -13829 -7062 7542 1301 -10632 -18495 -3626 1717 -4770 -9164 -16266 -9230 7158 6118
11103 6118 -7513 -6257 -5823 -15135 -4689 -6610 -6246 -3346 -7411 -11035 -20740 -22856 -36972 -36420 -24661
11088 -24661 -13624 -5803 -16504 -30452 -24020 -17403 -8403 -8234 63 996 7048 14601 -173 -8315
11074 -8315 1888 9416 5820 5345 7487 10628 1925 5674 8208 9771 -839 8451 -867 -11195
11060 -11195 -9890 -5106 -5426 1519 2068 -11273 -22596 -22605 -1293 6601 5019 -6645 3594 12566
11046 12566 340 -2464 -18762 -14662 -3953 1341 618 4249 9739 17724 11874 2308 4293 7625
11032 7625 21101 13766 -12867 -29694 -16953 -19585 -23148 -26104 -23484 -26666 -30915 -32214 -26511 -20928
$$ packed form
11130h89J38J0308k32j7647l970L015L313J0912N360k698o005j4745r358Q669
11116a3829O767J4604o241j1933p863J4869N343o487m394p102P036J6388j040
11103F118j3631J256M34r312J0446j921L64K900m065l624r705k116j4116N52J1759
11088b4661J1037P821j0701j3948O432O617R000J69Q297R33O052P553j4774q142
11074h315J0203P528l596m75K142L141q703L749K534J563j0610R290r318j0328
11060a1195J305M784l20O945N49j3341j1323rK1312P894j582j1664J0239Q972
11046A2566j2226k804j6298M100J0709N294p23L631N490P985n850r566J985L332
11032G625J3476p335k6633j6827J2741k632l563k956K620l182m249j299N703N583
$$ plain form
11018 -20928 -30637 -24232 -20830 -22688 -24661 -7200 -19812 -24343 -12419 -11925 -8870 -10565 -23756 -17484
11004 -17484 -15256 -12160 -17854 -16517 -18319 -25345 -18487 -9146 -4914 -2007 -248 5730 9388 11008
10990 11008 14418 10511 5990 3139 -4898 -2026 13315 3275 -2616 -4880 -1925 -1188 -861 -371 6422
10975 6422 1742 -1641 3288 7938 3784 3408 1941 555 13631 7498 3027 -4565 -3996 -25443 -29243
10960 -29243 -26284 -17215 191 -2407 -9737 -8822 10651 20634 12156 1214 -2186 -1115 -8162 -13200
10946 -13200 2517 -8123 -19638 -39107 -33989 -18443 490 11535 6950 678 208 1375 -5016
10933 -5016 -11240 -2121 5451 270 -11150 -13971 -8401 4734 -3806 -10419 -30585 -33970 -26977 -18028
10919 -18028 -23073 -28296 -12405 -7578 -5270 2576 6717 -2205 -7664 -2743 -5739 -9172 1359 2783
$$ packed form
11018b0928r709O405L402j858j973J7461j2612m531J1924M94L055j695j3191O272
11004a7484K228L096n694J337j802p026O858R341M232K907J759N978L658J620
10990A1008L410l907m521k851q037K872J5341j0040n891k264K955P37L27M90O793
10975F422m680l383M929M650m154l76j467j386J3076o133m471p592N69k1447l800
10960b9243K959R069J7406k598p330R15J9473R983q478j0942l400J071p047n038
10946a3200J5717j0640j1515j9469N118J5546J8933J1045m585o272m70J167o391
10933e016o224R119P572n181j1420k821N570J3135q540o613k0166l385O993Q949
10919a8028n045n223J5891M827K308P846M141q922n459M921k996l433J0531J424
$$ plain form
10905 2783 7476 4876 2248 -2700 -10158 -14203 -16116 -16544 -8323 -4194 4286 300 11646 12629 5790
10890 5790 15554 7318 -8826 -11706 1093 -7409 -3165 2244 6891 8750 4216 13930 11724 13675
10876 13675 -7892 -20033 -23889 -14761 -11110 -20102 -9075 4371 5442 13424 26695 23437 6494
10863 6494 -4214 -6497 976 12901 14272 -1046 -15499 -13121 -22690 -13186 -8579 -7758 -14633 -13642
10849 -13642 -23721 -24626 -17936 -9152 -486 -5860 1556 1340 2636 3869 11110 12722 10919 11639 2588
10834 2588 7313 20607 7109 -15446 -23845 -17155 -11015 -22138 -27377 -23911 -18398 -5420 4137
10821 4137 -14410 -23248 -16190 -18900 -16503 -9690 -9269 -4973 -11678 -10777 -24993 -23319 -24890 -29704 -16217
10806 -16217 -10197 -14215 -11050 -6333 -14921 -12612 -4677 -10747 -11089 -7058 -5069 -8303 -10226 -6802 -4772
$$ packed form
10905B783M693k600k628m948p458m045j913m28Q221M129Q480l986J1346R83o839
10890E790R764q236j6144k880J2799q502M244N409M647J859m534R714k206J951
10876A3675k1567j2141l856R128L651q992J1027J3446J071P982J3271l258j6943
10863F494j0708k283P473J1925J371j5318j4453K378r569R504M607Q21o875R91
10849a3642j0079r05O690Q784Q666n374P416k16J296J233P241J612j803P20r051
10834B588M725J3294j3498k2555q399O690O140j1123n239L466N513J2978R557
10821D137j8547q838P058k710K397O813M21M296o705R01j4216J674j571m814J3487
10806a6217O020m018L165M717q588K309P935o070l42M031J989l234j923L424K030
$$ plain form
10791 -4772 330 -1259 11299 15767 10339 17148 -2487 -16410 -19550 -21809 -19856 -5104 11776
10778 11776 9379 -1600 -4920 -12669 -4664 4351 4570 -2001 -11764 -4873 5171 12730 8795 242
10764 242 -333 -7381 -12375 -12562 -22596 -29584 -21979 -13250 -14489 -16442 -24653 -14350 -5170 -11040 -8783
10749 -8783 2838 -3519 -10768 -15194 -7725 -2862 -6607 -10707 -4452 1723 -11602 -16348 -8917 -2858
10735 -2858 3723 -3177 -9892 -29461 -29661 -21878 -6672 -16162 -19426 -21163 -14035 -8464 -11860 -2095
10721 -2095 11534 7654 395 -8391 -15255 -8826 -7198 24 -2653 4032 -3481 -9298 -13704 -21333
10707 -21333 -23368 -15208 -20408 -29302 -29147 -19665 -15877 -5942 -7358 -10129 -16694 -22124 -22836 -28294 -27938
10692 -27938 -16095 -12865 -9786 -18115 -17410 -12455 -13608 -10242 -12893 -10075 -2073 4902 12483 10561
$$ packed form
10791d772N102j589J2558M468n428O809j9635j3923l140k259J953J4752J6880
10778A1776k397j0979l320p749Q005R015K19o571r763O891J0044P559l935q553
10764B42n75p048m994j87j0034o988P605Q729j239j953q211J0303R180n870K257
10749h783J1621o357p249m426P469M863l745m100O255O175j3325m746P431O059
10735b858O581o900o715j9569k00P783J5206r490l264j737P128N571l396R765
10721b095J3629l880p259q786o864O429J628P222k677O685p513n817m406p629
10707b1333k035Q160n200q894J55R482L788R935j416k771o565n430p12n458L56
10692b7938J1843L230L079q329P05M955j153L366k651K818Q002O975P581j922
$$ plain form
10678 10561 13138 22613 28210 28847 33480 36955 45565 41153 29080 19008 17031 15126 18708 17546
10664 17546 18126 20936 10021 2125 7955 10232 9732 9992 4515 -18679 -25486 -12906 -10575 -6319
10650 -6319 -2299 -13876 -18106 -12456 -13086 -7118 -9537 -10317 -8645 -10585 -6503 -3549 -4357 -5176 -9751
10635 -9751 -5282 4342 10926 9218 11456 -1047 -16874 -10627 4620 10963 19420 14379 12956 19747
10621 19747 16587 5738 15084 15806 13948 15070 11148 7898 3520 10359 26274 23487 8912 4077
10607 4077 6440 607 5759 8737 -2062 -18384 -29752 -19965 -2251 -4159 -10290 3706 2051
10594 2051 -212 8028 11107 4750 1544 -1965 3123 13872 16302 652 -9596 -14138 -518 305
10580 305 -7362 -10315 -6638 -3062 8120 20175 10402 2683 -6886 -14567 -4250 1184 -7280 -8939
$$ packed form
10678A0561K577R475N597O37M633L475Q610m412j2073j0072j977j905L582j162
10664A7546N80K810j0915p896N830K277n00K60n477k3194o807J2580K331M256
10650f319M020j1577m230N650o30N968k419p80J672j940M082K954q08q19m575
10635i751M469R624O584j708K238j2503j5827O247J5247O343Q457n041j423O791
10621A9747l160j0849R346P22j858J122l922l250m378O839J5915k787j4575m835
10607D077K363n833N152K978j0799j6322j1368R787J7714j908o131J3996j655
10594B051k263Q240L079o357l206l509N088J0749K430j5650j0248m542J3620Q23
10580C05p667k953L677L576J1182J2055r773p719r569p681J0317N434q464j659
$$ plain form
10566 -8939 -12841 -19201 -21672 -12383 -14977 -4922 8762 17749 6254 -4837 2886 -3529 -2151 7039
10552 7039 15290 16570 14889 13130 8332 6785 8758 15238 24689 25269 9606 4497 4953 10049 7008
10537 7008 11284 18292 23835 8822 4647 2261 1790 2870 -12430 -5877 3666 19411 16426 2467
10523 2467 -4819 -6866 8123 4966 3833 3238 8537 10761 29658 27994 5036 -14058 -14125 -9585
10509 -9585 294 -14208 -10785 15999 27876 25583 18123 6400 2045 -834 6149 11957 11512 14335
10495 14335 14349 2175 -13111 -24260 -3217 -4387 2129 6510 1926 10125 1872 -10900 -12485 17
10481 17 441 8341 14994 8757 3603 -5380 -2011 9703 9658 7021 -1759 755 2189 14808 17805
10466 17805 15902 17490 12006 14733 16384 18704 15716 -1113 -23102 -27086 -16199 -12827 -766
$$ packed form
10566h939l902o360k471R289k594J0055J3684Q987j1495j1091P723o415J378R190
10552G039Q251J280j681j759m798j547J973O480R451N80j5663n109M56N096l041
10537G008M276P008N543j5013m175k386m71J080j5300O553R543J5745k985j3959
10523B467p286k047J4989l157j133n95N299K224J8897j664k2958j9094o7M540
10509i585R879j4502L423K6784J1877k293p460j1723m355k879O983N808m45K823
10495A4335J4j2174j5286j1149K1043j170O516M381m584Q199q253j2772j585J2502
10481A7M24P900O653o237n154q983L369J1714m5k637q780K514J434J2619K997
10466A7805j903J588n484K727J651K320k988j6829k1989l984J0887L372J2061
$$ plain form
10453 -766 495 -10196 -22549 -13715 -3296 -3487 -1955 7219 12211 11255 4865 4780 4275 -6177 -10075
10438 -10075 -9281 456 18404 7435 -12206 -444 11642 3316 -3865 -262 2539 -9260 -14262
10425 -14262 -11119 -1911 -5260 1355 -6498 -12177 -8092 5454 9118 6916 8802 9486 3820 3977 -1446
10410 -1446 8454 4746 -14622 -20420 -14101 -8289 -8070 -11127 -13497 -5685 -4534 -4420 -13885 -14451 -9617
10395 -9617 10110 19022 16669 10734 8537 14196 13252 6561 351 7722 9823 22138 14659 7591
10381 7591 -722 -9968 -13752 -19139 -14606 -12026 5168 5110 -16610 -16586 -10514 678 3318 947 -7465
10366 -7465 -8522 -8817 -14550 -24953 -31505 -21928 -17410 -13234 387 2746 6397 2896 -2071 -16506
10352 -16506 -29795 -26746 -12327 -8124 -13757 -22338 -12895 18390 28859 26152 17136 14788 12469
$$ packed form
10453g66J261j0691j2353Q834J0419j91J532R174M992r56o390q5n05j0452l898
10438a0075P94R737J7948j0969j9641J1762J2086q326p181L603K801j1799n002
10425a4262L143R208l349O615p853n679M085J3546L664k202J886O84n666J57n423
10410a446R900l708j9368n798O319N812K19l057k370P812J151J14r465n66M834
10395i617J9727Q912k353n935k197N659r44o691o210P371K101J2315p479p068
10381G591q313r246l784n387M533K580J7194n8k1720K4O072J1192K640k371q412
10366g465j057k95n733j0403o552R577M518M176J3621K359L651l501m967j4435
10352a6506j3289L049J4419M203n633q581R443L1285J0469k707r016k348k319
$$ plain form
10339 12469 7759 -260 1825 -1415 -5624 -10915 -1772 -4250 -3672 -5282 9938 2014 -9970 -11457
10325 -11457 -3916 8750 12426 19716 17622 16565 18903 10808 1488 1451 985 19533 28383 24095 3109
10310 3109 3374 9598 4038 3353 -7946 -15966 -16216 -15300 -17668 -4964 -11776 -13420 -16430 -10538 -1641
10295 -1641 13869 21953 16413 12264 3399 583 1786 -10096 -3405 7239 11821 5758 6307 6097
10281 6097 5284 9748 2567 -13158 -14049 -20502 -14161 -2920 18741 13416 -2152 -7979 -15824 -15985
10267 -15985 -14269 -6280 -4534 -3583 3548 -1004 1533 814 526 9011 7489 8270 295 3685 23466
10252 23466 20331 21570 33457 51398 76469 80222 66788 57354 43789 20580 24012 20558 14779
10239 14779 6407 3898 7209 1592 -3834 6387 12946 -648 6772 1348 -6574 -7900 2749 10378
$$ packed form
10339A2469m710q019K085l240m209n291R143k478N78j610J5220p924j1984j487
10325a1457P541J2666L676P290k094j057K338q095r320l7m66J8548Q850m288k0986
10310C109K65O224n560o85j1299q020k50R16k368J2704o812j644l010N892Q897
10295a641J5510Q084n540m149q865k816J203j1882O691J0644M582o063N49k10
10281F097q13M464p181j5725q91o453O341J1241K1661n325j5568n827p845j61
10267a5985J716P989J746R51P131m552K537p19k88Q485j522P81p975L390J9781
10252B3466l135J239J1887J7941K5071L753j3434r434j3565k3209L432l454n779
10239A4779q372k509L311n617n426J0221O559j3594P420n424p922j326J0649P629
$$ plain form
10225 10378 7518 3703 11544 1801 -1396 7829 13918 19038 17413 7475 8085 1554 -2464 -1177 -5801
10210 -5801 -9252 -6309 -12198 -8107 -236 11378 6202 -3882 -4061 -5924 2370 5077 -7967 -10257
10196 -10257 -8040 -11536 -17876 -16373 -16279 -18731 -19412 -15156 -13850 1471 6785 13655 15795 19918 13865
10181 13865 11015 9051 3411 -495 12933 7876 -8290 7040 15085 12435 20046 8064 -6572
10168 -6572 -13497 -2192 7383 2278 -14858 -30504 -28411 -19799 -7832 4761 -2880 639 16894
10155 16894 25721 15035 -449 -10745 3675 12063 1834 -18525 -26591 -26870 -30839 -20554 -2031
10142 -2031 540 1090 -10221 -18263 -22100 -20539 -11399 8837 14379 8047 7580 5501 3709 -2812 -16714
10127 -16714 -16317 -7654 3258 16008 18591 14199 16628 9534 1936 6624 5669 -3441 86 -5294
$$ packed form
10225A0378k860l815P841r743l197R225O089N120j625r938O10o531m018J287m624
10210e801l451K943n889M091P871J1614n176j0084j79j863Q294K707j3044k290
10196a0257K217l496o340J503R4k452o81M256J306J5321N314O870K140M123o053
10181A3865k850j964n640l906J3428n057j6166J5330Q045k650P611j1982j4636
10168f572o925J1305R575n105j7136j5646K093Q612J1967J2593p641L519J6255
10155A6894Q827j0686j5484j0296J4420Q388j0229k0359q066k79l969J0285J8523
10142b031K571N50j1311q042l837J561R140K0236N542o332m67k079j792o521j3902
10127a6714L97Q663J0912J2750K583m392K429p094p598M688r55r110L527n380
$$ plain form
10113 -5294 2886 12940 5416 10184 16672 14440 15066 -61 -1374 -7090 -8713 -8807 -7899 2411 13751
10098 13751 19569 24401 21966 14959 -65 6359 -4630 -14085 -20852 -12725 -10794 -6508 2369 19992
10084 19992 8034 -4049 -5563 -12664 -704 8051 7740 5165 10317 16108 7717 -7735 -14098 -21786
10070 -21786 -12334 12197 20263 16606 20864 22301 21672 14665 7580 -4674 -7948 -6090 3183 6218
10056 6218 2894 2446 2822 10083 11686 9742 15120 19908 19254 1653 -10694 -5988 -8414 -6385 -1260
10041 -1260 -6298 1344 2164 -14230 -24617 -22304 -13548 -3198 -12172 -16991 -21080 -11902 -7258 -2919
10027 -2919 -8188 -10728 -11522 -8200 -5641 -6552 -3321 1521 7347 4884 -8405 -7210 -692 -5547 -7748
10012 -7748 -9308 -8062 -3976 1657 13329 17885 15867 10166 1505 -1393 -8742 -1585 3636 399
$$ packed form
10113e294Q180J0054p524M768O488k232O26j5127j313n716j623r4R08J0310J1340
10098A3751N818M832k435p007j5024O424j0989r455o767Q127J931M286Q877J7623
10084A9992j1958j2083j514p101J1960Q755l11k575N152N791q391j5452o363p688
10070b1786R452K4531Q066l657M258J437o29p007p085j2254l274J858R273L035
10056F218l324m48L76P261J603j944N378M788o54j7601j2347M706k426K029N125
10041a260n038P642Q20j6394j0387K313Q756J0350q974m819m089R178M644M339
10027b919n269k540p94L322K559r11L231M842N826k463j3289J195O518m855k201
10012g748j560J246M086N633J1672M556k018n701q661k898p349P157N221l237
$$ plain form
9998 399 -2592 -3452 -8874 -5296 -2767 6797 9446 7361 1285 -7167 -6297 -5947 3332 22671 12525
9983 12525 11888 7096 5568 9207 6834 4198 2972 -4364 -14830 -7638 -1460 -10400 -22629 -35067
9969 -35067 -33127 -15619 -3008 2828 -545 2583 8776 6952 2978 -10909 -15942 -14740 -16923 -22280
9955 -22280 -25264 -20536 -7336 -6522 -1571 9211 4914 6934 11294 22821 21796 23895 25781 20149
9941 20149 20038 20142 18958 22050 37858 47526 59835 71053 98198 141979 203826 271113 305776
9928 305776 288920 226099 156181 102712 61873 39845 22021 13062 6722 18285 28081 15725
9916 15725 2195 11535 16531 8365 7203 18677 12392 -1151 -518 6819 7656 62 -4679 2864
9902 2864 13023 7944 4875 8566 4722 -2924 -2150 -4740 10346 19673 23819 36518 38148 26559
$$ packed form
9998C99k991q60n422L578K529R564K649k085o076q452Q70L50R279J9339j0146
9983A2525o37m792j528L639k373k636j226p336j0466P192O178q940j2229j2438
9969c5067J940J7508J2611N836l373L128O193j824l974j3887n033J202k183n357
9955b2280k984M728J3200Q14M951J0782m297K020M360J1527j025K099J886n632
9941B0149j11J04j184L092J5808R668J2309J1218K7145M3781O1847O7287L4663
9928C05776j6856o2821o9918n3469m0839k2028j7824q959o340J1563R796j2356
9916A5725j3530R340M996q166j162J1474o285j3543O33P337Q37p594m741P543
9902B864J0159n079l069L691l844p646P74k590J5086R327M146J2699J630j1589
$$ plain form
9888 26559 3827 1350 10642 20601 20007 23879 34890 33262 28042 17703 18718 14367 1073 -6642
9874 -6642 -8802 -8501 244 -5663 -16476 -10539 -4967 11090 17390 10863 -7493 -8820 4949 4433
9860 4433 -8470 -1268 10425 20695 29316 19977 10084 -5068 -8847 -10518 -11571 -22653 -23637 -17224
9846 -17224 -5736 -1470 4932 5995 15569 14400 8731 23290 18739 4280 5635 1479 483 1065
9832 1065 -3272 798 4468 6842 9649 7528 2114 8745 7778 15376 26820 15049 3963 -6769
9818 -6769 -13495 -24131 -16899 -6433 -17932 -28431 -19544 -9782 -2815 4965 5098 -5142 -15282 -14619
9804 -14619 -17665 -6556 5127 4262 -1155 -7482 -3802 -1186 -9816 -14679 -6313 5879 11247 9277
9790 9277 18266 23606 18054 17364 14075 6048 13344 4344 -5582 -9453 -865 -9362 -2097 -78 -5293
$$ packed form
9888B6559k2732k477R292R959n94L872J1011j628n220j0339J015m351j3294p715
9874f642k160L01Q745n907j0813N937N572J6057O300o527j8356j327J3769n16
9860D433j2903P202J1693J0270Q621r339r893j5152l779j671j053j1082r84O413
9846a7224J1488M266O402J063R574j169n669J4559m551j4459J355m156r96N82
9832A065m337M070L670K374K807k121n414O631r67P598J1444j1771j1086j0732
9818f769o726j0636P232J0466j1499j0499Q887R762O967P780J33j0240j0140O63
9804a4619l046J1109J1683q65n417o327L680K616q630m863Q366J2192N368j970
9790I277Q989N340n552o90l289q027P296r000r926l871Q588q497P265K019n215
$$ plain form
9775 -5293 -206 129 -10845 -13392 -3085 -6385 -4004 -2237 -3717 -12635 -14138 9045 21465 30049
9761 30049 15407 -3678 -9159 -22130 -16308 -13614 -7205 -6482 -22879 -10078 -3512 6274 7766 13283
9747 13283 8489 15823 6926 7675 10476 -317 7832 12436 6710 8245 1295 -17009 -20934 -14312
9733 -14312 -11882 2420 11242 6394 -9146 -15510 -5215 5535 11453 9606 14439 8721 -4911
9720 -4911 -12957 -5913 -4343 -9448 657 -2667 -8788 -21145 -18010 4623 8451 -14 -6129 -6779
9706 -6779 641 2654 5925 76 2976 -6880 -470 -2093 -11615 -16155 -10148 -6588 -7461 -8034 2621
9691 2621 13200 15218 19849 11698 9568 6618 14690 9597 7700 10356 8745 2101 5509 1418 -6439
9676 -6439 -3935 -11158 1218 19762 21052 14342 8627 1558 -6678 -17066 -20225 -14574 -13715 -6534
$$ packed form
9775e293N087L35j0974k547J0307l300K381J767j480q918j503K3183J2420Q584
9761C0049j4642j9085n481j2971N822K694O409P23j6397J2801O566R786J492N517
9747A3283m794P334q897P49K801j0793Q149M604n726J535o950j8304l925O622
9733a4312K430J4302Q822m848j5540o364J0295J0750N918j847M833n718j3632
9720d911q046P044J570n105J0105l324o121j2357L135K2633L828q465o115o50
9706f779P420K013L271n849K900r856O410j623r522m540O007L560q73n73J0655
9691B621J0579K018M631q151k130k950Q072n093j897K656j611o644L408m091p857
9676f439K504p223J2376J8544J290o710n715p069q236j0388l159N651Q59P181
$$ plain form
9662 -6534 4590 780 -2768 -10113 -11064 -21523 -17821 -1056 16886 9898 7929 4455 5253 1427
9648 1427 -3607 -1548 -1195 2973 5409 17007 15591 15135 16775 6533 1659 17252 17060 12089 3844
9633 3844 -6881 -5801 -3258 -7424 -8601 -2757 7365 9680 3454 1600 4417 8585 -4485 -2625
9619 -2625 11000 13789 -3120 -2103 219 8123 11599 5715 -1769 -2435 -7463 -6407 -5541 9923 -673
9604 -673 -4947 2831 -1963 -6859 5468 13629 12716 23123 18237 5905 8501 -3069 -8807 11
9590 11 2660 -8549 -10554 -13036 -16557 -7379 6022 4387 -3221 -8478 -11509 -2717 -3884 -9953 -8493
9575 -8493 -9768 -8129 -8891 -20833 -22128 -9503 -1712 -9509 -23371 -31407 -30559 -11516 -5783 -5974 -3242
9560 -3242 -3682 -3615 3370 63 -5557 1322 12072 10091 10493 2094 -10612 -22861 -14459 -7318 2212
$$ packed form
9662f534J1124l810l548p345r51j0459L702J6765J7942o988j969l474P98l826
9648A427n034K059L53M168K436J1598j416m56J640j0242m874J5593j92m971q245
9633C844j0725J080K543m166j177N844J0122K315o226j854K817M168j3070J860
9619b625J3625K789j6909J017K322P904L476n884p484o66n028J056Q66J5464j0596
9604f73m274P778m794m896J2327Q161r13J0407m886j2332K596j1570n738Q818
9590A1K649j1209k005k482l521R178J3401j635p608n257l031Q792j167o069J460
9575h493j275J639p62j1942j295J2625P791p797j3862q036Q48J9043N733j91K732
9560c242m40O7O985l307n620O879J0750j981M02q399j2706j2249Q402P141R530
$$ plain form
9545 2212 2327 6137 13049 9114 2504 1076 -7179 -6940 -10327 -9061 -9520 -25299 -6774 -4464 -9204
9530 -9204 -11471 -5424 -8584 -11886 -20329 -15632 -22814 -33748 -34077 -30816 -13163 -16293 -13575 -2624
9516 -2624 3004 -4768 -1813 11615 13365 6601 5573 4782 1910 3300 -5075 1673 7787 6642 14992
9501 14992 11627 5719 9458 11634 10039 21576 24243 11645 10617 24722 23060 14700 16855 18660
9487 18660 15975 9949 22233 27588 10678 12875 13485 8260 6574 6685 -1087 5882 9275 10354 2098
9472 2098 12416 15993 6194 5060 9421 26449 16128 -7997 -16883 -20434 -13413 -9164 -11890 -9857
9458 -9857 -12415 -103 8772 3010 1616 5982 8504 1024 -10386 -19471 -16857 -10434 -9817 -19518 -6927
9443 -6927 -5623 190 -2298 -1557 -4849 -13743 -4465 3923 -1893 -2673 -9123 4149 7642 7353 563
$$ packed form
9545B212J15L810O912l935o610j428q255K39l387J266m59j5779J8525K310m740
9530i204k267O047l160l302q443M697p182j0934l29L261J7653l130K718J0951
9516b624N628p772K955J3428J750o764j028p91k872J390q375O748O114j145Q350
9501A4992l365n908L739K176j595J1537K667j2598j028J4105j662q360K155J805
9487A8660k685o026J2284N355j6910K197O10n225j686J11p772O969L393J079q256
9472B098J0318L577r799j134M361J7028j0321k4125q886l551P021M249k726K033
9458i857k558J2312Q875n762j394M366K522p480j1410r085K614O423O17r701J2591
9443f927J304N813k488P41l292q894R278Q388n816p80o450J3272L493k89o790
$$ plain form
9428 563 10329 11770 -865 -16182 -10130 5757 24050 19249 11338 8517 11648 15387 16625 14470
9414 14470 5474 -8559 -8790 -6930 3421 -5876 -18738 -17558 -15189 -2244 3284 9892 21769 20226
9400 20226 20554 19514 3471 8924 18184 8870 5902 -531 5365 -2165 -477 10784 25612 13887
9386 13887 8047 2619 -14533 -13375 -3207 -10482 -12309 -15817 -30608 -36180 -22155 -10709 -8945
9373 -8945 -8702 -3959 5637 8382 2754 5995 -4753 -9960 -3182 505 3929 -4478 -7895 -4536 -6512
9358 -6512 -11498 -11532 -1002 2403 -2913 791 -6807 -11747 -7903 4580 6001 7252 -11622 -12465 983
9343 983 -114 -4935 5134 7720 1434 -11887 -8520 6518 4237 5599 5578 20467 27445 12237
9329 12237 -4279 518 16023 3077 -4676 -8827 -11214 -13048 -3479 14547 21289 13727 10363 9180
$$ packed form
9428E63R766J441j2635j5317O052J5887J8293m801p911k821L131L739J238k155
9414A4470q996j4033k31J860J0351r297j2862J180K369J2945N528O608J1877j543
9400B0226L28j040j6043N453R260r314k968o433N896p530J688J1261J4828j1725
9386A3887n840n428j7152J158J0168p275j827l508j4791n572J4025J1446J764
9373h945K43M743R596K745n628L241j0748n207O778L687L424q407l417L359j976
9358f512m986l4J0530L405n316L704p598m940L844J2483J421J251j8874q43J3448
9343I83j097m821J0069K586o286j3321L367J5038k281J362k1J4889O978j5208
9329A2237j6516M797J5505j2946p753m151k387j834R569J8026O742p562l364j183
$$ plain form
9315 9180 -2243 -8958 -7057 3356 14250 14486 6695 231 2951 -2383 1872 19953 25035 6659
9301 6659 10454 17109 15809 20131 23672 21071 18775 21956 26337 29788 19356 14118 22549 42327
9287 42327 52187 45349 30538 25498 26168 28247 28793 36590 33131 34201 39475 44105 46009 58107 64585
9272 64585 68578 83138 95802 90022 73368 71835 87252 88310 91926 113892 133111 155735 177529
9259 177529 193257 213305 252670 305443 361994 436542 516465 608212 738082 894590 1098627
9248 1098627 1372302 1767962 2410456 3523779 5449564 8286355 11071759 12048115 10666387
9239 10666387 7806643 5101578 3294279 2224299 1573734 1143902 861543 684459 560658
9230 560658 460852 384964 336351 300448 252558 217290 192933 175418 162520 141435 119447 112635
$$ packed form
9315I180j1423o715J901J0413J0894K36p791o464K720n334M255J8081N082j8376
9301F659L795O655j300M322L541k601k296L181M381L451j0432n238Q431J9778
9287D2327R860o838j4811n040O70K079N46P797l459J070N274M630J904J2098O478
9272F4585L993J4560J2664n780j6654j533J5417J058L616K1966J9219K2624K1794
9259A77529J5728K0048L9365N2773N6551P4548P9923R1747J29870J56508K04037
9248A098627K73675L95660O42494J113323J925785K836791K785404R76356j381728
9239A0666387k859744k705065j807299j069980o50565m29832k82359j77084j23801
9230E60658r9806p5888m8613l5903m7890l5268k4357j7515j2898k1085k1988o812
$$ plain form
9218 112635 110112 102162 101770 98855 92774 89174 73109 50693 50199 56163 65556 63111 55768 45569
9204 45569 47490 38447 28152 31616 35594 36546 50581 47290 28938 20351 16666 21227 25322 22605
9190 22605 13136 17107 12265 10571 21463 28241 32943 37901 38355 42387 34925 24322 23610 14902 17981
9175 17981 15471 23896 27064 18397 25670 28409 19973 11681 10451 20543 26129 40236 32403 15259
9161 15259 9708 16003 15843 18020 32846 23354 23838 27555 27022 18513 17611 16985 903 -15976 -29222
9146 -29222 -29410 -19270 -9365 -3104 1158 1451 -4780 6878 10445 14081 20667 26379 21013 21672 11070
9131 11070 2764 -7683 -22520 -25757 -7393 -8353 -12417 1417 8943 9655 11206 22802 30349 32131
9117 32131 35510 30272 25651 8765 -9826 -1258 -8129 5284 5344 7057 10483 10053 -7628 -21883
$$ packed form
9218A12635k523p950l92k915o081l600j6065k2416m94N964R393k445p343j0199
9204D5569J921r043j0295L464L978R52J4035l291j8352q587l685M561M095k717
9190B2605r469L971m842j694J0892O778M702M958M54M032p462j0603p12q708L079
9175A7981k510Q425L168q667P273K739q436q292j230J0092N586J4107p833j7144
9161A5259n551O295j60K177J4826r492M84L717n33q509r02o26j6082j6879j3246
9146b9222j88J0140R905O261M262K93o231J1658L567L636O586N712n366O59j0602
9131A1070q306j0447j4837l237J8364r60m064J3834P526P12J551J1596P547J782
9117C2131L379n238m621j6886j8591Q568o871J3413O0J713L426m30j7681j4255
$$ plain form
9103 -21883 -14349 -12338 -12200 -9489 -11716 -14830 -12679 -6974 4875 6830 -2274 -14446 -17237 -15172
9089 -15172 -10152 -5057 -13746 -18432 -19557 -20172 -15698 -22275 -21972 -17595 -13636 -16069 -7276 -10863 -8427
9074 -8427 -3973 4624 14429 18455 10319 9414 10175 10338 4286 14933 8333 -4018 -881 9491 20805
9059 20805 22407 15676 22756 20145 13125 6623 -7123 -2172 2083 3609 7534 9361 6561 -470
9045 -470 1117 -7036 -8955 -6288 6753 9664 4376 -9725 -13899 -5139 -3993 -461 20262 38573
9031 38573 30251 23036 18452 14901 5648 -4181 -2331 13966 19771 13412 9176 6084 6253 802 6271
9016 6271 5848 7394 7621 12467 4916 876 1155 1672 1717 3598 -3678 2820 -540 -10175 -11948 -18665
9000 -18665 -18613 -4363 -1790 -4000 -5644 214 479 2927 11372 -3876 6944 24395 22573 13645
$$ packed form
9103b1883P534K011J38K711k227l114K151N705J1849J955r104j2172k791K065
9089a5172N020N095q689m686j125o15M474o577L03M377L959k433Q793l587K436
9074h427M454Q597R805M026q136r05P61J63o052J0647o600j2351L137J0372J1314
9059B0805J602o731P080k611p020o502j3746M951M255J526L925J827k800p031
9045d70J587q153j919K667J3041K911n288j4101m174Q760J146L532K0723J8311
9031C8573q322p215m584l551r253r829J850J6297N805o359m236l092J69n451N469
9016F271m23J546K27M846p551m040K79N17M5J881p276O498l360r635j773o717
9000a8665N2J4250K573k210j644N858K65K448Q445j5248J0820J7451j822q928
$$ plain form
8986 13645 5325 -1824 1928 867 12055 16759 16271 23663 23800 17264 12345 13334 11874 14505 11346
8971 11346 16996 13904 9484 7370 5487 4237 -1346 88 11263 5460 -4106 10444 21465 18379
8957 18379 12719 7433 -4067 -6716 -5957 -12856 -17562 -16317 -11030 7218 21550 18123 4756 15964
8943 15964 23814 20895 16507 11685 11663 9486 6 93 2477 -248 4481 9688 10358 8274 -5269 -17356
8927 -17356 -7665 -11094 -14550 -11536 417 4436 1268 -4665 -3858 -14611 -13171 -2437 6712 7955
8913 7955 13519 6240 3461 2508 -7228 -4443 -2980 -8222 -8398 -8226 -2585 -3087 -10368 -500 9113 183
8897 183 2685 5011 -6210 802 24682 21726 8175 7182 2649 5555 19468 23794 12693 -1759
8883 -1759 743 1559 -2507 -2793 2937 6272 -4274 -22164 -19295 -14813 -1103 11402 18263 18314 17218
$$ packed form
8986A3645q320p149L752j061J1188M704m88P392J37o536m919R89j460K631l159
8971A1346N650l092m420k114j883j250n583J434J1175n803r566J4550J1021l086
8957A8379n660n286j1500k649P59o899m706J245N287J8248J4332l427j3367J1208
8943A5964P850k919m388m822k2k177r480Q7K384k725M729N207O70k084j3543j2087
8927a7356R691l429l456L014J1953M019l168n933Q07j0753J440J0734R149J243
8913G955N564p279k779r53r736K785J463n242j76J72N641n02p281R868R613q930
8897A83K502K326j1221P012K3880k956j3551r93m533K906J3913M326j1101j4452
8883a759K502Q16m066k86N730L335j0546j7890K869M482J3710J2505O861N1j096
$$ plain form
8868 17218 25094 29049 18256 -2159 -3767 -11672 -15721 -10099 -14677 -23273 -4398 10336 26514
8855 26514 39557 37881 25471 9781 1808 6224 15434 11361 3649 32307 34061 23627 14120
8842 14120 6993 6232 12155 13451 14003 9304 11394 10597 9350 5044 4142 -524 -1176 9962 6185 -5289
8826 -5289 -17216 -28569 -25046 -13732 -14025 -19171 -7195 8281 15072 4730 -5897 1718 7199
8813 7199 4982 4114 14534 9048 19675 13136 1877 8186 4773 -7441 -1043 16287 23666 29498
8799 29498 32666 16722 12772 13766 21273 20986 23309 14129 13695 26219 29157 32404 39644 42381 38083
8784 38083 27294 18100 6816 -9592 -10833 -14986 -10065 -11599 -12872 -15725 -25076 -34829 -23713 -8175
8770 -8175 -16 -2032 -2071 7580 11337 12681 10627 13395 19085 26404 21113 20970 16046 7154 1361 6228
$$ packed form
8868A7218P876L955j0793k0415j608p905m049N622m578q596J8875J4734J6178
8855B6514J3043j676j2410j5690p973M416R210m073p712K8658J754j0434r507
8842A4120p127p61N923J296N52m699K090p97j247m306r02m666o52J1138l777j1474
8826e289j1927j1353L523J1314k93n146J1976J5476O791j0342j0627P615N481
8813G199k217q68J0420n486J0627o539j1259O309l413j2214O398J7330P379N832
8799B9498L168j5944l950R94P507k87K323r180m34J2524K938L247P240K737m298
8784C8083j0789r194j1284j6408j241m153M921j534j273k853r351r753J1116J5538
8770h175Q159k016l9R651L757J344k054K768N690P319n291j43m924q892n793M867
$$ plain form
8754 6228 5086 2685 1285 1172 4414 3217 12870 12356 1067 -13210 -7613 11698 11379 23491 20442
8739 20442 34608 30952 16237 12896 10916 15166 19022 17819 25851 30273 28260 24107 17649 2685
8725 2685 13278 31655 28277 15778 12073 7658 -3990 4446 13141 12575 11316 21642 28316 31219
8711 31219 28523 26206 32610 33423 14862 20258 14836 12446 21673 25566 36384 38019 43111 44836
8697 44836 49606 62775 58252 47668 39229 43981 44438 42539 44032 51224 55432 41240 28862 32308
8683 32308 29145 26081 21589 35097 42857 33761 23925 21643 16154 22534 32919 35118 42651 33059
8669 33059 38199 34679 29203 25827 14344 11378 18610 23894 29008 28326 21468 23637 20880 7910
8655 7910 8839 18087 19961 27941 33046 29574 8912 9075 16352 14463 12636 16830 5935 1231 -5072
$$ packed form
8754F228j142k401j400j13L242j197R653n14j1289j4277N597J9311l19J2112l049
8739B0442J4166l656j4715l341j980M250L856j203Q032M422k013m153o458j4964
8725B685J0593J8377l378j2499l705m415j1648Q436Q695n66j259J0326O674K903
8711C1219k696k317O404Q13j8561N396n422k390R227L893J0818J635N092J725
8697D4836M770J3169m523j0584q439M752M57j899J493P192M208j4192j2378L446
8683C2308l163l064m492J3508P760r096r836k282n489O380J0385K199P533r592
8669C3059N140l520n476l376j1483k966P232N284N114o82o858K169k757j2970
8655G910R29R248J874P980N105l472k0662J63P277j889j827M194j0895m704o303
$$ plain form
8640 -5072 -1777 9764 23121 33381 15234 15282 9281 7692 -807 -1818 5968 5570 4542 8608 6236
8625 6236 13139 15413 11170 15710 9057 9245 6153 7543 17532 16561 15130 29437 38785 41240 51608
8610 51608 43859 31288 31745 42911 35138 23053 21657 24545 15148 7544 16491 27201 31027 47754
8596 47754 49913 42397 49430 64774 67665 77305 69602 61713 73475 88124 81950 73904 64596 52200
8582 52200 47329 51110 32857 21760 29822 28723 27159 36280 36918 34618 38450 37922 21763 18701
8568 18701 28388 21745 4747 -14458 -26274 -14471 -12167 -16707 -11990 -6608 -9349 -8420 -2104 6856
8554 6856 12756 14053 10347 14051 9862 12268 28889 37157 37558 21773 16082 19021 19279 9971 -4838
8539 -4838 4924 17228 11991 -6047 -7540 -6504 -1364 1178 1327 -5010 -4307 -7694 -8388 6378 22060
$$ packed form
8640e072L295J1541J3357J0260j8147M8o001j589q499j011P786l98j028M066k372
8625F236O903K274m243M540o653J88l092J390R989r71j431J4307R348K455J0368
8610E1608p749j2571M57J1166p773j2085j396K888r397p604Q947J0710L826J6727
8596D7754K159p516P033J5344K891R640p703p889J1762J4649o174q046r308j2396
8582E2200m871L781j8253j1097Q062j099j564R121O38k300L832n28j6159l062
8568A8701R687o643j6998j9205j1816J1803K304m540M717N382k741R29O316Q960
8554F856N900J297l706L704m189K406J6621Q268M01j5785n691K939K58r308j4809
8539d838R762J2304n237j8038j493J036N140K542J49o337P03l387o94J4766J5682
$$ plain form
8524 22060 23048 19977 11080 6102 -3341 -4638 -7332 850 18530 22906 5634 1770 17027 18004
8510 18004 17689 8223 -61 -18926 -23909 -13029 2143 8932 17020 12553 11466 -586 1033 -6292
8496 -6292 -1217 -550 -3916 1955 -173 -7597 -9865 2037 681 2123 6506 7424 3035 6199 13887
8481 13887 3293 3520 16096 10125 -13940 -7820 10089 7572 -4349 -3639 5596 8545 -12811 -14284
8467 -14284 3602 2264 -9586 -11040 -9382 -10541 -16573 -19607 -9915 -3520 -2389 3753 -1281 31
8453 31 8180 19510 7783 -10547 -20504 -15381 -8921 -11951 -19533 -14682 2614 11167 16315 12822
8439 12822 12175 10458 15094 17969 15704 23158 24907 9272 -1308 -3345 -7577 -7117 -13541 -18818 -22123
8424 -22123 -25311 -21181 -19077 -11598 -8007 1067 10499 15361 11843 5604 6482 7517 12062 10515 2549
$$ packed form
8524B2060R88l071q897m978r443j297k694Q182J7680M376j7272l864J5257R77
8510A8004l15r466q284j8865m983J0880J5172O789Q088m467j087j2052J619p325
8496f292N075O67l366N871k128p424k268J1902j356J442M383R18m389L164P688
8481A3887j0594K27J2576n971k4065O120J7909k517j1921P10R235K949k1356j473
8467a4284J7886j338j1850j454J658j159o032l034R692O395J131O142n034J312
8453C1Q149J1330j1727j8330r957N123O460l030p582M851J7296Q553N148l493
8439A2822o47j717M636K875k265P454J749j5635j0580k037m232M60o424n277l305
8424b2123l188M130K104P479L591R074R432M862l518o239Q78J035M545j547p966
$$ plain form
8409 2549 1322 -1311 -437 5720 1142 -1549 -4676 -2270 -11667 -19544 -13748 -6145 -2360 -17727 -23573
8394 -23573 -20400 -9260 -5303 -6263 -3740 -3641 -1958 1032 -14345 -22765 -12426 7823 16534 686
8380 686 6852 18286 10609 1509 1129 6915 6735 -244 -16278 -22359 -4257 1986 -1603 -1767 5334
8365 5334 -329 2035 -1727 -2484 8111 3847 -18240 -29354 -9330 -5883 -19121 -10030 -1059 7517
8351 7517 2223 -6481 -1476 -10851 -17511 -16650 -11890 521 7589 3440 7358 10233 -2190 -10442 -7396
8336 -7396 69 3134 400 -5427 -14402 -24980 -15034 1613 13830 18655 2776 -1777 15453 25033
8322 25033 22807 22286 17684 10403 7260 -3124 -8681 -4753 -10939 -8831 -5636 -8131 -4361 824 -180
8307 -180 -200 5581 -529 1748 3705 8645 14030 2930 -1474 12993 16115 2611 12489 24700 10349
$$ packed form
8409B549j227k633Q74O157m578k691l127K406r397p877N796P603L785j5367n846
8394b3573L173J1140L957r60K523R9J683K990j5377q420J0339K0249Q711j5848
8380F86O166J1434p677r100l80N786j80o979j6034o081J8102O243l589j64P101
8365E334n663K364l762p57J0595m264k2087j1114K0024L447j3238R091Q971Q576
8351G517n294q704N005r375o660Q61M760J2411P068m149L918K875j2423q252L046
8336g396P465L065k734n827q975j0578R946J6647J2217M825j5879m553J7230R580
8322B5033k226n21m602p281l143j0384n557L928o186K108L195k495L770N185j004
8307a80k0N781o110K277J957M940N385j1100m404J4467L122j3504R878J2211j4351
$$ plain form
8292 10349 -6084 -10560 -6045 -9365 -14128 -15102 -18766 -25065 -20967 -10996 -17820 -11624 -8465 -8041 -10269
8277 -10269 -1206 6690 -6097 -13099 -3259 -6199 -15431 -19588 -19100 -6196 1474 -3385 -12287 -12093 -13157
8262 -13157 -19751 -25298 -20740 -10235 1926 2623 -4713 -3430 4661 16482 26664 14864 7048 2092
8248 2092 -973 2759 -12952 -10539 87 6458 20706 19259 18784 30565 37449 29379 12470 -12994
8234 -12994 -16533 -3260 5242 5454 3618 2478 2161 1557 4466 9821 7766 105 -6540 -5047 2485
8219 2485 10918 25127 24861 22961 20015 12615 9837 6857 11261 8461 20101 19127 5959 10993 11163
8204 11163 11760 21604 17343 11598 10470 10016 4976 10057 5147 -10104 -15824 6914 13900 -7461
8190 -7461 -23049 -26959 -23663 -26206 -25168 -27289 -31849 -24420 -10322 -3559 2723 6735 7149 12739 3934
$$ packed form
8292A0349j6433m476M515l320m763r74l664o299M098R971o824O196L159M24k228
8277a0269R063P896j2787p002R840k940r232m157M88J2904P670m859q902J94j064
8262a3157o594n547M558J0505J2161O97p336J283Q091J1821J0182j1800p816m956
8248B092l065L732j5711K413J0626O371J4248j447m75J1781O884q070j6909k5464
8234a2994l539J3273Q502K12j836j140l17o04K909N355k055p661o645J493P532
8219B485Q433J4209k66j900k946p400k778k980M404k800J1640r74j3168N034J70
8204A1163N97R844m261n745j128m54n040N081m910j5251n720K2738O986k1361
8190g461j5588l910L296k543J038k121m560P429J4098O763O282M012M14N590q805
$$ plain form
8175 3934 -749 -3306 -6049 -16878 -24561 -11117 2735 6032 11029 10248 4774 14202 26730 20623
8161 20623 11618 6524 -7394 9429 19752 23943 20699 23460 23913 18608 -725 -6385 5148 18474
8147 18474 10462 -4176 -1749 -2081 -14184 -19422 -8903 -2035 12205 6745 2210 9635 9813 -1936
8133 -1936 -7746 -5352 1853 5715 1570 5995 6785 -6634 -1924 -708 3165 5990 12350 13903 13639
8118 13639 9031 8441 10367 6058 4593 5202 21 10715 26353 35018 45689 37460 24915 26605
8104 26605 23030 16649 15128 5569 -189 -5022 -17004 -14178 2901 11810 15074 9441 -7458 -15337
8090 -15337 795 -736 3679 7741 3861 7416 7587 2795 6632 -8605 -13682 -10315 -4119 3094
8076 3094 2895 1689 4377 -5254 -5813 18175 28608 18206 21384 20634 15383 16590 25310 26267 31376
$$ packed form
8175C934m683k557k743j0829p683J3444J3852L297M997p81n474R428J2528o107
8161B0623r005n094j3918J6823J0323M191l244K761M53n305j9333n660J1533J3326
8147A8474q012j4638K427l32j2103n238J0519O868J4240n460m535P425J78j1749
8133a936n810K394P205L862m145M425P90j3419M710J216L873K825O360J553k64
8118A3639m608n90J926m309j465O09n181J0694J5638Q665J0671q229j2545J690
8104B6605l575o381j521r559n758m833j1982K826J7079Q909L264n633j6899p879
8090a5337J6132j531M415M062l880L555J71m792L837j5237n077L367O196P213
8076C094j99j206K688r631n59K3988J0433j0402L178p50n251J207Q720R57N109
$$ plain form
8061 31376 49095 37577 43348 52797 53057 43846 34103 24040 15873 16785 2963 1298 24483 44788
8047 44788 57051 37477 26665 40450 29904 15114 9340 17702 14897 11675 24197 30068 19807
8034 19807 4956 14262 21827 19442 20629 26031 21751 18251 20118 41263 43340 37095 35568 39456
8020 39456 35957 26051 30875 37052 24169 10781 15004 14779 23973 32742 38955 28420 19922 25411
8006 25411 16145 23273 22144 17008 20895 18480 7996 5329 1366 13084 29807 22872 17785 31973
7992 31973 34132 23030 24949 37145 29411 5737 10713 16029 20624 19231 15602 22508 17513 10034
7978 10034 7115 4073 1195 9343 12838 12165 1867 10683 12679 10823 21469 32993 30014 19753
7964 19753 18218 21345 16136 16503 3744 11389 15125 12362 13016 21353 28780 34822 23925 15283 22075
$$ packed form
8061C1376J7719j1518N771R449K60r211r743j0063q167R12j3822j665K3185K0305
8047D4788J2263j9574j0812J3785j0546j4790n774Q362k805l222J2522N871j0261
8034A9807j4851R306P565k385J187N402m280l500J867K1145K077o245j527L888
8020C9456l499r906M824O177j2883j3388M223k25R194Q769O213j0535q498N489
8006B5411r266P128j129n136L887k415j0484k667l963J1718J6723o935n087J4188
7992C1973K159j1102J919J2196p734k3674M976N316M595j393l629O906m995p479
7978A0034k919l042k878Q148L495o73j0298Q816J996j856J0646J1524k979j0261
7964A9753j535L127n209L67j2759P645L736k763O54Q337P427O042j0897q642O792
$$ plain form
7949 22075 25527 24668 14360 7639 6258 9075 4145 -8150 -16438 -8271 9962 23893 19171 15984
7935 15984 13261 11745 18680 2076 -8207 989 -9684 -11704 -14032 -14141 -12978 -6930 -12310 -10039
7921 -10039 235 10290 12737 11747 10732 6955 21800 16365 4942 -7076 -6089 10039 15122 10589
7907 10589 8814 18265 30983 28725 21708 23546 11373 -4740 -16470 -10077 -101 -1665 -10792 -9003
7893 -9003 2194 1277 -3178 2140 10379 18402 22670 18985 8659 -8489 2225 -1673 -11593 -20300
7879 -20300 -17197 -5675 -14015 -30340 -29262 -26503 -16891 -11973 -2986 -11076 -13106 -8998 -24505 -29447
7865 -29447 -30945 -19859 -8386 -5160 -8119 -18007 -19898 -21822 -13006 2968 4376 -2497 -715 1384
7851 1384 630 -971 -11941 -1754 1172 -189 12715 781 -7419 -10019 -13906 -13581 -25611 -29826
$$ packed form
7949B2075L452q59j0308o721j381K817m930j2295q288Q167J8233J3931m722l187
7935A5984k723j516O935j6604j0283R196j0673k020k328j09J163O048n380K271
7921a0039J0274J0055K447r90j015l777J4845n435j1423j2018R87J6128N083m533
7907A0589j775R451J2718k258p017J838j2173j6113j1730O393R976j564r127J789
7893i003J1197r17m455N318Q239Q023M268l685j0326j7148J0714l898r920q707
7879b0300L103J1522q340j6325J078K759R612M918Q987q090k030M108j5507m942
7865b9447j498J1086J1473L226k959r888j891j924Q816J5974J408o873J782K099
7851A384p54j601j0970J0187K926j361J2904j1934q200k600l887L25j2030m215
$$ plain form
7837 -29826 -31050 -20443 -17211 -15046 6865 20287 9420 -6495 -22443 -17745 -13665 -16688 -17059
7824 -17059 -18760 -17328 -15574 -3506 18217 36297 32648 20288 13662 20230 18618 13338 -316
7811 -316 3984 505 9305 22383 7674 1813 10147 19762 20364 3487 -680 8603 2633 2406 13174
7796 13174 -1960 -2123 5352 8659 9789 8772 10601 753 -8838 -5819 -10240 -1987 8061 -1029
7782 -1029 3996 11600 -10433 -6586 9250 11254 1278 729 6655 2207 -4665 4095 13341 18934 27176
7767 27176 25199 8917 1804 8883 8714 12521 -1463 -3044 -4833 10673 17117 10537 11503 7501
7753 7501 -274 2140 -6661 -14643 -14076 -12898 -15207 -14802 -11613 -2867 1849 1879 5356 3293 2073 -15438
7737 -15438 -5073 1356 9480 13095 9825 -10392 -20182 -14273 -11506 -10925 -8242 -3729 -2024 9642
$$ packed form
7837b9826j224J0607L232K165K1911J3422j0867j5915j5948M698M080l023l71
7824a7059j701J432J754J2068K1723J8080l649j2360o626O568j612n280j3654
7811c16M300l479Q800J3078j4709n861Q334R615O02j6877m167R283n970k27J0768
7796A3174j5134j63P475L307J130j017J829r848r591L019m421Q253J0048r090
7782a029N025P604k2033L847J5836K004r976n49N926m448o872Q760R246N593Q242
7767B7176j977j6282p113P079j69L807j3984j581j789J5506O444o580R66m002
7753G501p775K414q801p982N67J178k309M05L189Q746M716L0L477k063j220j7511
7737a5438J0365O429Q124L615l270k0217r790N909K767N81K683M513J705J1666
$$ plain form
7723 9642 6785 -7446 -2783 -2389 13224 10636 -681 -10425 -8791 -6866 -4701 2753 -871 -2957
7709 -2957 -6183 -4944 1082 -9955 -19948 -11762 -17097 -32665 -32593 -24785 -6822 556 -9368 -23509
7695 -23509 -22723 -7656 -3166 -3637 -20559 -27373 -20087 -12808 -11244 -10387 -7504 -5242 4181 -454 -2436
7680 -2436 -4148 -8730 -14638 -19917 -11469 -18741 -19926 -20181 -20134 2188 19012 8316 -4444 -4694 543
7665 543 1482 -2013 -1147 -1597 -9883 -8383 -11691 -20727 -25652 -22208 -8694 -11675 -4671 -1070 1291 -1728
7649 -1728 -1963 -14532 -7593 -2636 -5873 -10003 -10575 -19567 -19715 -9588 -13765 -25895 -23377 -12663 -3174
7634 -3174 124 10787 11209 9378 4856 643 -7915 -3989 -11752 -11970 -21765 -28321 -17421 -12847 -8058
7619 -8058 -12176 -18683 -23808 -21605 -13381 -13688 -22844 -29845 -16376 -1268 -11233 -22709 -15945 -7265
$$ packed form
7723I642k857j4231M663L94J5613k588j1317r744J634J925K165P454l624k086
7709b957l226J239O026j1037r993Q186n335j5568P2P808J7963P378r924j4141
7695b3509P86J5067M490m71j6922o814P286P279J564Q57K883K262R423m635j982
7680b436j712m582n908n279Q448p272j185k55M7K2322J6824j0696j2760k50N237
7665E43R39l495Q66m50q286J500l308r036m925L444J3514k981P004L601K361l019
7649a728k35j2569O939M957l237m130n72q992j48J0127m177j2130K518J0714R489
7634c174L298J0663M22j831m522m213q558L926p763k18r795o556J0900M574M789
7619h058m118o507n125K203Q224l07r156p001J3469J5108r965j1476O764Q680
$$ plain form
7605 -7265 -20904 -14839 -12419 -21272 -9400 6627 5583 486 -581 593 -1500 -86 -7149 -17970
7591 -17970 -20355 -13554 4990 9112 345 -9404 -12036 508 11336 12055 11969 7455 -11224 -15886
7577 -15886 -15965 -8660 508 -4756 -6097 -212 9314 19323 18309 13880 23963 29489 37042 21256
7563 21256 6290 1259 7968 12905 20710 21558 12063 9018 3712 510 6580 313 -6110 -12710 -11446
7548 -11446 -6226 -2236 5997 6420 10413 16443 13206 -9521 -15648 -13870 -24045 -25730 -16942 -18330
7534 -18330 -10569 6781 14798 3470 -11705 -20071 -10687 5705 14745 3833 1943 5069 -1673
7521 -1673 -25019 -24926 -18427 -9809 -8159 -5827 5927 7775 -9868 -7235 4228 11125 -7536 -25645
7507 -25645 -15166 3818 13056 20727 16453 -5865 -8569 -2616 -9395 -9395 -3446 2549 3249 -11509 -22872
$$ packed form
7605g265j3639O065K420q853J1872J6027j044n097j067J174k093J414p063j0821
7591a7970k385O801J8544M122q767r749k632J2544J0828P19q6m514j8679m662
7577a5886p9P305R168n264j341N885R526J0009j014m429J0083N526P553j5786
7563B1256j4966n031O709M937P805Q48r495l045n306l202O070o267o423o600J264
7548a1446N220L990Q233M23L993O030l237k2727o127J778j0175j685Q788j388
7534a8330P761J7350Q017j1328j5175q366R384J6392R040j0912j890L126o742
7521a673k3346R3O499Q618J650K332J1754J848j7643K633J1463O897j8661j8109
7507b5645J0479J8984R238P671m274k2318k704N953o779%N949N995P00j4758j1363
$$ plain form
7492 -22872 -8708 -612 2107 6336 2785 -6450 -18899 -4625 7855 7867 1282 1956 -10747 -14637
7478 -14637 -12253 -9984 -14308 -8168 -18102 -22104 -29067 -34228 -14786 -7182 -1801 -8098 -19304 -19143
7464 -19143 -28054 -21950 -15241 -10397 -11110 -14932 -22768 -9259 3752 12507 3680 -8847 -2813 -903
7450 -903 5764 -781 -7525 3157 6471 7336 6762 18867 1706 -14677 -12739 6070 4408 2082
7436 2082 -16065 -30208 -20585 -195 11579 -342 -11206 -6388 -3646 -6842 -10884 -4840 -13893
7423 -13893 -13444 -3336 1047 862 -10149 -8120 -10713 -11047 3008 8195 5071 5518 398 -4783 2464
7408 2464 565 -10403 -12808 -11298 8196 912 -19283 -20341 -24728 -22408 -10116 12062 17111 1251
7394 1251 -9801 -17206 -14773 -9452 -2938 15952 20066 10139 -472 -6512 -4547 -5654 -9704 -7398
$$ packed form
7492b2872J4164Q096K719M229l551r235j2449J4274J2480J2o585O74j2703l890
7478a4637K384K269m324O140r934m002o963n161J9442P604N381o297j1206J61
7464a9143q911O104O709M844p13l822p836J3509J3011Q755q827j2527O034J910
7450i03O667o545o744J0682L314Q65n74J2105j7161j6383J938J8809j662k326
7436B082j8147j4143R623K0390J1774j1921j0864M818K742l196m042O044r053
7423a3893M49J0108M383j85j1011K029k593l34J4055N187l124M47n120n181P247
7408B464j899j0968k405J510J9494p284k0195j058m387K320J2292K2178N049j5860
7394A251j1052p405K433N321O514J8890M114r927j0611o040J965j107m050K306
$$ plain form
7380 -7398 -4881 -9227 -14919 -27711 -23744 -12325 -6450 -12265 -9225 -2361 5394 15860 12686 9054
7366 9054 -2961 -9596 -8997 -14602 -19043 -19063 -22916 -15646 -20186 -10551 -2211 3145 3058 -1253 3116 7749
7350 7749 8961 5049 -3845 -12970 -28454 -30678 -8698 -8930 -2790 -1684 7538 17336 18228 16064 19827
7335 19827 10399 -970 -6722 -18865 -14783 -6040 -8068 -2803 -4447 -12577 -15301 -11834 -22147 -27130
7321 -27130 -15957 -8591 -15135 -10186 1629 -2696 -19198 -39711 -38556 -28102 -27991 -21508 -14840 -26461
7307 -26461 -27462 -30784 -31888 -23538 -13647 4142 6421 5671 -6662 1157 3711 -2693 -4406 907
7293 907 -8331 -12328 -1889 14295 16556 17910 12667 -7644 -24021 -21529 -16757 -12387 -13244 -15047
7279 -15047 -24460 -17311 -15256 -20633 -15740 -14611 -6780 5187 10469 2316 -2010 -9702 -24839 -15870
$$ packed form
7380g398K517m346n692j2792L967J1419N875n815L040O864P755J0466l174l632
7366I054j2015o635N99n605m441k0l853P270m540R635Q340N356q7m311M369M633
7350G749J212l912q894r125j5484k224K1980k32O140J106R222R798Q92k164L763
7335A9827r428j1369n752j2143M082Q743k028N265j644q130k724L467j0313m983
7321b7130J1173P366o544M949J1815m325j6502k0513J155J0454J11O483O668j1621
7307b6461j001l322j104Q350R891J7789K279p50j2333P819K554o404j713N313
7293I07r238l997J0439J6184K261J354n243k0311j6377K492M772M370q57j803
7279a5047r413P149K055n377M893J129P831J1967N282q153m326p692j5137Q969
$$ plain form
7265 -15870 -7701 -6804 -4485 5790 9511 641 -7780 -21108 -30713 -22309 872 6755 2381 401
7251 401 -2724 162 -850 613 3020 16451 13549 7725 3055 7052 10752 5248 -3521 -13809 -13220
7236 -13220 -9680 -12859 -26461 -21081 -4855 2843 4544 9908 12604 -516 -4907 -15 1338 -2553
7222 -2553 -2697 1065 -1264 -5215 10358 6756 -5626 -9251 -14715 -10471 -11340 -10412 -6195 4200 8908
7207 8908 3863 -3166 5380 -433 1982 20837 8137 -5734 -4085 6478 14226 4894 2220 3778
7193 3778 400 -456 -1749 2534 3512 -1977 -3591 -11363 -13524 -443 9500 12008 11831 4529 1036
7178 1036 -3037 -20166 -22257 -14038 -12791 1550 15087 13984 -1852 -4116 6693 2724 -5930 -10310
7164 -10310 -4619 -15811 -15773 -957 7656 -4206 -11135 -7902 42 16409 26346 28436 28312 17305
$$ packed form
7265a5870Q169Q97K319J0275L721q870q421j3328r605Q404K3181N883m374j980
7251D01l125K886j012J463K407J3431k902n824m670L997L700n504q769j0288N89
7236a3220L540l179j3602N380J6226P698J701N364K696j3120m391M892J353l891
7222b553j44L762k329l951J5573l602j2382l625n464M244q69R28M217J0395M708
7207H908n045p029Q546n813K415J8855j2700j3871J649J0563P748r332k674J558
7193C778l378q56j293M283R78n489j614p772k161J3081R943K508j77p302l493
7178A036m073j7129k091Q219J247J4341J3537j103j5836k264J0809l969q654m380
7164a0310N691j1192L8J4816Q613j1862o929L233P944J6367R937K090j24j1007
$$ plain form
7150 17305 6104 -8948 2617 22788 19433 4247 -4317 -6618 400 2666 -4888 -1037 -960 -3625
7136 -3625 -3960 6607 12896 13027 2090 -5432 -10291 -8892 -8767 -16416 -26729 -24665 -20825 -18344 -13925
7121 -13925 -8316 14891 12097 -9209 -8517 -4839 -2686 14289 18495 614 4522 21189 22252 7785
7107 7785 799 3169 -3196 -92 -1368 -3472 9080 15127 7754 8526 8466 25316 36094 47388 46267
7092 46267 40475 31372 21532 21320 21435 20079 8014 -5814 -20017 -20920 -6579 -2888 -3147 1558 -9829
7077 -9829 -18014 -4777 2222 7200 12887 16240 7561 3686 9048 9714 6238 4740 1492 5252 6984
7062 6984 7581 4030 -6653 -15567 -10563 911 11616 16662 8455 3067 2530 -4243 1233 -2890 -4561
7047 -4561 -6011 -12257 -14246 -10138 -11944 -21352 -24434 -26968 -18007 -7842 2912 333 -10849 -6689
$$ packed form
7150A7305j1201j5052J1565K0171l355j5186q564k301P018K266p554L851P7k665
7136c625l35J0567O289J31j0937p522m859J399J25p649j0313K064L840K481M419
7121a3925N609K3207k794k1306O92L678K153J6975M206j7881L908J6667J063j4467
7107G785o986K370o365L104j276k104J2552O047p373P72o0J6850J0778J1294j121
7092D6267n792r103r840k12J15j356j2065j3828j4203r03J4341L691k59M705j1387
7077i829q185J3237O999M978N687L353q679l875N362O66l476j498l248L760J732
7062F984N97l551j0683q914N004J1474J0705N046q207n388n37o773N476m123j671
7047d561j450o246j989M108j806r408l082k534Q961J0165J0754k579j1182M160
$$ plain form
7033 -6689 2235 8029 2035 -5646 -1427 12901 18812 12774 6103 -6775 -14736 -17030 -18120 -7054
7019 -7054 5241 122 974 2174 -13087 -24325 -22152 -18495 -4645 2002 -1249 7214 18367 13469
7005 13469 18735 12967 -5 -12460 -17078 -23245 -23779 -19755 -4414 18792 29377 21036 16171 15197
6991 15197 -5156 -18174 -15391 -14399 -4880 -354 -856 3582 7468 5103 7494 14714 6406 -11758
6977 -11758 -29253 -35470 -35324 -36438 -35768 -24834 -12990 -7452 -9 -3775 -14029 -9929 -3096 -12974
6963 -12974 -13549 -3304 -108 -2900 -4030 -2745 -1195 -12971 -18823 -18200 -20094 -16577 -4499 5135
6949 5135 897 -2516 -1007 23041 25719 6588 -4868 -3277 2104 1549 5446 21380 23896 22902
6935 22902 18697 3931 1629 8241 -4292 597 5577 13778 5128 9248 -2123 -5454 -7422 -3337
$$ packed form
7033f689Q924N794n994p681M219J4328N911o038o671j2878p961k294j090J1066
7019g054J2295n119Q52J200j5261j1238K173L657J3850O647l251Q463J1153m898
7005A3469N266n768j2972j2455m618o167n34M024J5341K3206J0585q341m865r74
6991A5197k0353j3018K783R92R519M526n02M438L886k365K391P220q308j8164
6977a1758j7495o217J46j114O70J0934J1844N538P443l766j0254M100O833r878
6963a2974n75J0245L196k792j130J285J550j1776n852O23j894L517J2078R634
6949E135m238l413J509K4048K678j9131j1456J591N381n55L897J5934K516r94
6935B2902m205j4766k302O612j2533M889M980Q201q650M120j1371l331j968M085
$$ plain form
6921 -3337 -3087 11626 18780 15378 7420 4800 923 14071 16115 14559 13544 12796 11731 7605 -4520
6906 -4520 824 4154 -6578 -11248 -19503 -18842 -4309 4076 -3739 -8146 -7963 -856 -291 6038 -940
6891 -940 -11845 -5114 -2732 -1758 1928 6027 7618 -9533 -14072 -6905 -3052 -3607 15045 25006 18168
6876 18168 -1406 -4055 8245 13382 6492 66 -5537 -4840 3636 7358 15725 15561 -231 -10061
6862 -10061 -11147 -10811 -6785 -5608 11281 24529 17618 6051 -1179 186 8808 -2222 -1774 -3031
6848 -3031 -9061 -3786 704 1710 11257 9007 13535 480 -22708 -18615 1005 -1058 -11293 -6682
6834 -6682 9245 28998 37270 32880 39655 35924 32845 30016 15095 -5889 -8079 -8864 -6314 -5121
6820 -5121 -3529 -9447 -13850 -16719 -4410 -4951 6228 11700 8927 -6367 -381 12354 19768 23023
$$ packed form
6921c337K50J4713P154l402p958k620l877J3148K044j556j015p48j065m126j2125
6906d520N344L330j0732m670q255O61J4533Q385p815m407J83P107N65O329o978
6891i40j0905O731K382R74L686M099J591j7151m539P167L853n55J8652R961o838
6876A8168j9574k649J2300N137o890o426n603O97Q476L722Q367j64j5792r830
6862a0061j086L36M026J177J6889J3248o911j1567p230J365Q622j1030M48j257
6848c031o030N275M490J006R547k250M528j3055k3188M093J9620k063j0235M611
6834f682J5927J9753Q272m390O775l731l079k829j4921k0984k190p85K550J193
6820e121J592n918m403k869J2309n41J1179N472k773j5294N986J2735P414L255
$$ plain form
6806 23023 23598 17514 12238 12552 12611 5388 11293 20073 27493 27963 13714 7763 11555 10297 -2622
6791 -2622 -6154 -6549 -6827 3459 -1688 -14597 -10684 -3701 -551 7868 13679 19365 23840 16655 12754
6776 12754 10051 12361 8507 11024 9471 24471 44150 51719 48458 43448 44476 46417 49691 66947
6762 66947 80641 95255 98940 113837 125817 118725 115822 121808 131237 143946 164242 174468 186224
6749 186224 219292 255577 310949 386824 437000 443134 405069 351542 315798 290569 287030 286771
6737 286771 300209 332185 370607 431053 516747 609138 710414 848964 1034533 1292858 1673262
6726 1673262 2250362 3107448 4309849 5763425 6980082 7310731 6548032 5053818 3537533
6717 3537533 2432686 1703926 1240725 941600 725838 568650 472347 373337 306464 267972
$$ packed form
6806B3023N75o084n276L14N9p223N905Q780P420M70j4249n951L792j258j2919
6791b622l532l95k78J0286n147j2909L913O983L150Q419N811N686M475p185l901
6776A2754k703K310l854K517j553J5000J9679P569l261n010J028J941L274J7256
6762F6947J3694J4614L685J4897J1980p092k903N986R429J2709K0296J0226J1756
6749A86224L3068L6285N5372P5875N0176O134l8065n3527l5744k5229l539k59
6737B86771J3438L1976L8422O0446Q5694R2391J01276J38550J85569K58325L80404
6726A673262N77100Q57086J202401J453576J216657L30649p62699j494214j516285
6717C537533j104847p28760m63201k99125k15762j57188r6303r9010o6873l8492
$$ plain form
6707 267972 237819 221208 190939 177899 182820 182753 188846 209688 232811 246020 247295 227606 180915
6694 180915 137256 105820 83672 83217 78364 79184 79586 80813 69471 66767 77082 82642 93335 101891
6680 101891 94251 85819 69236 61856 60091 50238 26180 21972 28341 37282 29179 20878 14340 20989
6666 20989 13300 10065 7029 11674 9686 5189 11386 13058 15804 20057 27576 43563 36894 28267
6652 28267 25241 4453 953 5337 16162 10643 -469 -8330 -5189 5067 725 2922 3204 -9854
$$ packed form
6707B67972l0153j6611l0269j3040M921o7O093K0842K3123J3209J275j9689m6691
6694A80915m3659l1436k2148m55m853Q20M02J227j1342k704J0315N560J0693Q556
6680A01891p640q432j6583p380j765r853k4058m208O369Q941q103q301o538O649
6666B0989p689l235l036M645j988m497O197J672K746M253P519J5987o669q627
6652B8267l026k0788l500M384J0825n519j1112p861L141J0256m342K197K82j3058
$$ [...]
##END NTUPLES=NMR SPECTRUM
##END=
