##TITLE=107-19-7-
##JCAMPDX= 6.0         $$ Bruker NMR JCAMP-DX V2.0
##DATA TYPE= NMR SPECTRUM
##DATA CLASS= NTUPLES
##ORIGIN= BRUKER
##OWNER= aubrays
$$ XWIN-NMR		Version 3.5
$$ Mon Nov 24 10:27:29 2008 "MET (UT+1h)  aubrays@icmbsg013
##.OBSERVE FREQUENCY= 400.132220680898
##.OBSERVE NUCLEUS= ^1H
##.ACQUISITION MODE= SIMULTANEOUS
##.ACQUISITION SCHEME= undefined
##.AVERAGES= 64
##.DIGITISER RES= 18
##SPECTROMETER/DATA SYSTEM= dpx400
##.PULSE SEQUENCE= zg
##.SOLVENT NAME= CDCl3
##.SHIFT REFERENCE= (INTERNAL, CDCl3, 0, 12.0991)
##AUDIT TRAIL= $$ (NUMBER, WHEN, WHO, WHERE, WHAT)
$$ ##TITLE= Audit trail, XWIN-NMR		Version 3.5
$$ ##JCAMPDX= 5.01
$$ ##ORIGIN= Bruker BioSpin GmbH
$$ ##OWNER= aubrays
$$ /level_1/data/aubrays/nmr/107-19-7/1/pdata/1/auditp.txt
$$ ##AUDIT TRAIL=  $$ (NUMBER, WHEN, WHO, WHERE, WHAT)
(   1,<2008-11-24 10:26:11.29 +0100>,<aubrays>,<icmbsg013>,
      <created by zg, POWCHK disabled, PULCHK disabled
       configuration hash MD5:
       97 CB C6 7E 4E 38 97 FD D8 EA CD 83 2A B1 DF ED
       data hash MD5: 16K
       62 37 9E 54 2D BC 14 D2 A8 77 E7 91 9C 17 0F 7A>)
(   2,<2008-11-24 10:26:15.89 +0100>,<aubrays>,<icmbsg013>,
      <Start of raw data processing
       ef BC_mod = 2 LB = 1 FT_mod = 6 PKNL = 1 SI = 16K 
       data hash MD5: 16K
       9F 8F 4F C8 C9 88 16 79 11 E3 75 19 CB 8D B5 29>)
(   3,<2008-11-24 10:26:19.60 +0100>,<aubrays>,<icmbsg013>,
      <apks 
       data hash MD5: 16K
       13 22 37 56 8D F2 6E AB 6E 74 E1 B7 36 99 AC 3C>)
(   4,<2008-11-24 10:26:32.57 +0100>,<aubrays>,<icmbsg013>,
      <abs ABSG = 5 
       data hash MD5: 16K
       50 7B A8 C8 F0 47 E1 3E 0D A6 10 3D 3C EC 3D 6D>)
$$ ##END=
$$ 
$$ hash MD5
$$ D0 81 D2 8D F6 A8 2B 48 3C E9 E3 36 14 6D 16 B3
##$RELAX= 
##$RELAX= 
##$RELAX= 
##$RELAX= 
##$RELAX= 
##$RELAX= 
$$ Bruker specific parameters
$$ --------------------------
##$DU= </level_1>
##$EXPNO= 1
##$NAME= <107-19-7>
##$PROCNO= 1
##$TYPE= <nmr>
##$USER= <aubrays>
##$AMP= (0..31)
100 100 100 100 100 100 100 100 100 100 100 100 100 100 100 100 100 100 
100 100 100 100 100 100 100 100 100 100 100 100 100 100 
##$AQSEQ= 0
##$AQ_mod= 1
##$AUNM= <au_zg>
##$AUTOPOS= <>
##$BF1= 400.13
##$BF2= 400.13
##$BF3= 400.13
##$BF4= 500.13
##$BF5= 500.13
##$BF6= 500.13
##$BF7= 500.13
##$BF8= 500.13
##$BYTORDA= 1
##$CFDGTYP= 0
##$CFRGTYP= 5
##$CHEMSTR= <none>
##$CNST= (0..31)
1 1 145 1 1 1 1 1 1 1 1 1 1 1 1 1 1 1 1 1 1 1 1 1 1 1 1 1 1 1 1 1 
##$CPDPRG= <>
##$CPDPRG1= <>
##$CPDPRG2= <>
##$CPDPRG3= <>
##$CPDPRG4= <mlev>
##$CPDPRG5= <mlev>
##$CPDPRG6= <mlev>
##$CPDPRG7= <mlev>
##$CPDPRG8= <mlev>
##$CPDPRGB= <>
##$CPDPRGT= <>
##$D= (0..31)
0 2 0 0 0 0 0 0 0 0 0 0 0 0 0 0 0 0 0 0 0 0 0 0 0 0 0 0 0 0 0 0 
##$DATE= 1227518770
##$DBL= (0..7)
120 120 120 120 120 120 120 120 
##$DBP= (0..7)
150 150 150 150 150 150 150 150 
##$DBP07= 0
##$DBPNAM0= <>
##$DBPNAM1= <>
##$DBPNAM2= <>
##$DBPNAM3= <>
##$DBPNAM4= <>
##$DBPNAM5= <>
##$DBPNAM6= <>
##$DBPNAM7= <>
##$DBPOAL= (0..7)
0.5 0.5 0.5 0.5 0.5 0.5 0.5 0.5 
$$ [...]
##$SUBNAM1= <"">
##$SUBNAM2= <"">
##$SUBNAM3= <"">
##$SUBNAM4= <"">
##$SUBNAM5= <"">
##$SUBNAM6= <"">
##$SUBNAM7= <"">
##$SUBNAM8= <"">
##$SUBNAM9= <"">
##$SW= 13.0983956698909
##$SWIBOX= (0..15)
0 0 3 0 0 0 0 0 0 0 0 0 0 0 0 0 
##$SW_h= 5241.09014675052
##$TD= 16384
##$TD0= 1
##$TE= 683.16
##$TE2= 300
##$TE3= 300
##$TEG= 300
##$TL= (0..7)
120 120 120 120 120 120 120 120 
##$TP= (0..7)
150 150 150 150 150 150 150 150 
##$TP07= 0
##$TPNAME0= <>
##$TPNAME1= <>
##$TPNAME2= <>
##$TPNAME3= <>
##$TPNAME4= <>
##$TPNAME5= <>
##$TPNAME6= <>
##$TPNAME7= <>
##$TPOAL= (0..7)
0.5 0.5 0.5 0.5 0.5 0.5 0.5 0.5 
##$TPOFFS= (0..7)
0 0 0 0 0 0 0 0 
##$TUNHIN= 0
##$TUNHOUT= 0
##$TUNXOUT= 0
##$USERA1= <user>
##$USERA2= <user>
##$USERA3= <user>
##$USERA4= <user>
##$USERA5= <user>
##$V9= 5
##$VALIST= <valist>
##$VCLIST= <CCCCCCCCCCCCCCC>
##$VD= 0
##$VDLIST= <DDDDDDDDDDDDDDD>
##$VPLIST= <PPPPPPPPPPPPPPP>
##$VTLIST= <TTTTTTTTTTTTTTT>
##$WBST= 1024
##$WBSW= 4
##$XGAIN= (0..3)
0 0 0 0 
##$XL= 0
##$YL= 0
##$YMAX_a= 1140523
##$YMIN_a= -1278349
##$ZGOPTNS= <>
##$ZL1= 120
##$ZL2= 120
##$ZL3= 120
##$ZL4= 120
##$ABSF1= 12.09913
##$ABSF2= -0.9993391
##$ABSG= 5
##$ABSL= 3
##$ALPHA= 0
##$AQORDER= 0
##$ASSFAC= 0
##$ASSFACI= 0
##$ASSFACX= 0
##$ASSWID= 0
##$AUNMP= <proc_1d>
##$AZFE= 0.1
##$AZFW= 0.5
##$BCFW= 0
##$BC_mod= 2
##$BYTORDP= 1
##$COROFFS= 0
##$CY= -3
##$DATMOD= 1
##$DC= 0
##$DFILT= <>
##$DTYPP= 0
##$F1P= 0
##$F2P= 0
##$FCOR= 0.5
##$FTSIZE= 16384
##$FT_mod= 6
##$GAMMA= 0
##$GB= 0
##$INTBC= 1
##$INTSCL= 1
##$ISEN= 128
##$LB= 1
##$LEV0= 0
##$LPBIN= 0
##$MAXI= 10000
##$MC2= 0
##$MEAN= 0
##$ME_mod= 0
##$MI= 0
##$NCOEF= 0
##$NC_proc= -2
##$NLEV= 6
##$NOISF1= 6.6
##$NOISF2= 4.6
##$NSP= 0
##$NTH_PI= 0
##$NZP= 0
##$OFFSET= 12.09913
##$PC= 4
##$PHC0= 49.44577
##$PHC1= 4.055273
##$PH_mod= 1
##$PKNL= yes
##$PPARMOD= 0
##$PSCAL= 0
##$PSIGN= 0
##$REVERSE= no
##$SF= 400.13
##$SI= 16384
##$SIGF1= 3
##$SIGF2= 2
##$SINO= 16
##$SIOLD= 16384
##$SREGLST= <1H.CDCl3>
##$SSB= 0
##$STSI= 16384
##$STSR= 0
##$SW_p= 5241.0901467505
##$SYMM= 0
##$S_DEV= 0
##$TDeff= 16384
##$TDoff= 0
##$TI= <>
##$TILT= no
##$TM1= 0
##$TM2= 0
##$TOPLEV= 0
##$USERP1= <user>
##$USERP2= <user>
##$USERP3= <user>
##$USERP4= <user>
##$USERP5= <user>
##$WDW= 1
##$XDIM= 16384
##$YMAX_p= 310395603
##$YMIN_p= -454746
$$ End of Bruker specific parameters
$$ ---------------------------------
##NTUPLES= NMR SPECTRUM
##VAR_NAME=  FREQUENCY,     SPECTRUM/REAL,   SPECTRUM/IMAG
##SYMBOL=    X,             R,               I
##VAR_TYPE=  INDEPENDENT,   DEPENDENT,       DEPENDENT
##VAR_FORM=  AFFN,          ASDF,            ASDF
##VAR_DIM=   16384,         16384,           16384
##UNITS=     HZ,            ARBITRARY UNITS, ARBITRARY UNITS
##FACTOR=    0.319910281801288, 1,           1
##FIRST=     4841.22475758553, 0,            0
##LAST=      -399.865389164975, 0,           0
##MIN=       -399.865389164975, -454746,     0
##MAX=       4841.22475758553, 310395603,    0
$$ Real data points
##PAGE= N=1
##DATA TABLE= (X++(R..R)), XYDATA
$$ [...]
14668c546K90K60k21n49n68j44J20n7k77o3K65J75K14N99M22L74J60l40p51m28
$$ -3546 -3256 -2996 -3217 -3766 -4334 -4478 -4358 -4415 -4692 -4755 -4490 -4315 -4101 -3502 -3080 -2706 -2546 -2886 -3637 -4065
14648d065J61L81K19k4j78j40K21N51O83M11Lj90l46m98j24K9K2J57K83L2j05
$$ -4065 -3904 -3523 -3304 -3328 -3506 -3646 -3425 -2874 -2191 -1780 -1777 -1967 -2313 -2811 -2935 -2906 -2884 -2727 -2444 -2412 -2517
14627b517l2J53R2L0k3Nk76j63j98k35j54J92M25L23J11%l93k61n3J68K07o7k39
$$ -2517 -2549 -2396 -2304 -2274 -2297 -2292 -2568 -2731 -2929 -3164 -3318 -3126 -2701 -2378 -2267 -2267 -2660 -2921 -2974 -2806 -2599 -2666 -2905
14604b905N0j53M5J05k45m02l47j47K80N06M81j37j54l9K72J29ll12p1j02N0L23
$$ -2905 -2855 -3008 -2963 -2858 -3103 -3505 -3852 -3999 -3719 -3213 -2732 -2869 -3023 -3062 -2790 -2661 -2664 -2976 -3047 -3149 -3099 -2776
14582b776L89P3J53j63j97j72j98l1J47j53j30k19r8P8K63j54J41K46j29j98L54
$$ -2776 -2387 -2314 -2161 -2324 -2521 -2693 -2891 -2922 -2775 -2928 -3058 -3277 -3375 -3297 -3034 -3188 -3047 -2801 -2930 -3128 -2774
14561b774K09J00r3kM7J34M1k43k47k1k45o3j45rK43J60J2p5j70k45l74k50J4
$$ -2774 -2565 -2465 -2558 -2560 -2513 -2379 -2338 -2581 -2828 -2849 -3094 -3157 -3302 -3311 -3068 -2908 -2896 -2971 -3141 -3386 -3760 -4010 -3996
14538c996N41O12M15q3l28l21Q5L24N69N88k1m89j16J1q0k22k69k5L13n6j57J76
$$ -3996 -3455 -2843 -2428 -2511 -2839 -3160 -3075 -2751 -2182 -1594 -1615 -2104 -2220 -2209 -2289 -2511 -2780 -2805 -2492 -2548 -2705 -2529
14516b529J75k29k80J75L5l01k00J87M19L28K39J4j96p9L4k93m54Q9m0k45k63
$$ -2529 -2354 -2583 -2863 -2688 -2653 -2954 -3154 -2967 -2548 -2220 -1981 -1967 -2163 -2242 -2208 -2501 -2955 -2866 -2906 -3151 -3414
14495c414l39j20K38K52K75J31R2K27J19LJ8k38j88l27j78L28O81J58J64K74l9
$$ -3414 -3753 -3873 -3635 -3383 -3108 -2977 -2885 -2658 -2539 -2536 -2518 -2756 -2944 -3271 -3449 -3121 -2440 -2282 -2118 -1844 -1883
14474a883N2L88k9k12m37p10l77K28R6R8n8J28J26p7l17m8k14j35j41J21L50Q27
$$ -1883 -1831 -1443 -1472 -1684 -2121 -2831 -3208 -2980 -2884 -2786 -2844 -2716 -2590 -2667 -2984 -3032 -3246 -3381 -3522 -3401 -3051 -2224
14452b224N46J64j80m64o37J1K21L85m3k68k96L5N16Q29O92L56m48q03p85l10
$$ -2224 -1678 -1514 -1694 -2158 -2795 -2784 -2563 -2178 -2221 -2489 -2785 -2750 -2234 -1405 -713 -357 -805 -1608 -2393 -2703
14432b703l21r7j28J6l6K4R3K89K90J18k9J67l3kq5p8L6J91j05m0k7o9j52k1J58
$$ -2703 -3024 -3121 -3249 -3233 -3269 -3245 -3152 -2863 -2573 -2455 -2484 -2317 -2350 -2352 -2437 -2515 -2479 -2288 -2393 -2433 -2460 -2529 -2681 -2702 -2544
14407b544N77N63Q4l87j83j40l70k27N2k33k49P0L40K50K49k3k79k52l29m2P4
$$ -2544 -1967 -1404 -1320 -1707 -1890 -2030 -2400 -2627 -2575 -2808 -3057 -2987 -2647 -2397 -2148 -2171 -2450 -2702 -3031 -3073 -2999
14386b999j05j5J51k37k80R9L33J62l28m40J02J94j11k8J33K35k7%L41O9k52p8
$$ -2999 -3104 -3119 -2968 -3205 -3485 -3386 -3053 -2891 -3219 -3659 -3557 -3363 -3474 -3502 -3369 -3134 -3161 -3161 -2820 -2751 -3003 -3081
14364c081R3j01k45m27m97k83N44J048O25j51l99l88k73k16J28Q0L40L69K84K1
$$ -3081 -2988 -3089 -3334 -3761 -4258 -4541 -3997 -2949 -2324 -2475 -2874 -3262 -3535 -3751 -3623 -3543 -3203 -2834 -2550 -2529
14344b529j89k74J95P4j03j50n9k43l41j45L09L02r3l06J94L00O62K19j08M6J45
$$ -2529 -2718 -2992 -2797 -2723 -2826 -2976 -3035 -3278 -3619 -3764 -3455 -3153 -3246 -3552 -3358 -3058 -2396 -2177 -2285 -2239 -2094
14323b094l2K00K89J36k14K04M71L96K71K98N3P2M8K88J70L03q9j21j09J01M2
$$ -2094 -2126 -1926 -1637 -1501 -1715 -1511 -1040 -644 -373 -75 -22 50 98 386 556 859 770 649 540 641 683
14302F83N7j54j19O1k01o70m53j54k16m98q5K14K85j51J29M19K49J04J26Q5J66
$$ 683 740 586 467 528 327 -343 -796 -950 -1166 -1664 -1749 -1535 -1250 -1401 -1272 -853 -604 -500 -374 -289 -123
14281a23M0L28L10j89l77J24N26L20l66m74m68j98o0o2kJ90L2j33LK40K61L84
$$ -123 -83 245 555 366 -11 113 639 959 593 119 -349 -547 -607 -669 -671 -481 -449 -582 -579 -339 -78 306
14259C06K27j48l96l38k70qJ6k05l03K57M12J76J96J13J29J71M04K89j03m00m69
$$ 306 533 385 -11 -349 -619 -627 -611 -816 -1119 -862 -450 -274 -78 35 164 335 739 1028 925 525 56
14238E6q0J69j05m0J40P9K7M1K27J27JN23L62n0K04N83J45k01m02j73r2j03l77
$$ 56 -24 145 40 0 140 219 246 287 514 641 642 1165 1527 1477 1681 2264 2409 2208 1806 1633 1541 1438 1061
14215A061j95O0K35M35K01m40m41l68l92m69O3j47k4K52J94k63k39j95k05j14
$$ 1061 866 926 1161 1596 1797 1357 916 548 156 -313 -250 -397 -421 -169 25 -238 -477 -672 -877 -991
14195i91L72K61J86Q2N1O2K51J0j5j76k44l64n2m3O3j70J20K93K64j36k72m32
$$ -991 -619 -358 -172 -90 -39 23 274 284 269 93 -151 -515 -567 -610 -547 -717 -597 -304 -40 -176 -448 -880
14173h80n15o81j52M1J11L6K24K29M07K43l9r2K88K92J1l22j99k75J36L88j5n23
$$ -880 -1395 -2076 -2228 -2187 -2076 -2040 -1816 -1587 -1180 -937 -976 -1068 -780 -488 -477 -799 -998 -1273 -1137 -749 -764 -1287
14151a287m25l56o4J52J44p4L0J7O2K0J36l2K16M79J98k44k88n38m12p8j56j9
$$ -1287 -1712 -2068 -2132 -1980 -1836 -1910 -1880 -1863 -1801 -1781 -1645 -1677 -1461 -982 -784 -1028 -1316 -1854 -2266 -2344 -2500 -2519
14129b519J62j77l12j6K76j0r5L36M41K18kn23r74o27p6K6n6J07Q6L47N79M27
$$ -2519 -2357 -2534 -2846 -2862 -2586 -2596 -2691 -2355 -1914 -1696 -1698 -2221 -3195 -3822 -3898 -3872 -3928 -3821 -3735 -3388 -2809 -2382
14107b382K89L7k84L9K14q9j48KK2J09j57N0m8m63n42j99J39J26J8M5m4R3n5j91
$$ -2382 -2093 -2056 -2340 -2301 -2087 -2176 -2324 -2322 -2300 -2191 -2348 -2298 -2346 -2809 -3351 -3550 -3411 -3285 -3267 -3222 -3266 -3173 -3228 -3419
14083c419j82n3k0K78k7k62l96m69p42o51k70R5j77p0J7K44K15K3j76O0l8j26
$$ -3419 -3601 -3654 -3674 -3396 -3423 -3685 -4081 -4550 -5292 -5943 -6213 -6118 -6295 -6365 -6348 -6104 -5889 -5866 -6042 -5982 -6020 -6146
14061f146l67P4M32M16L41K10K06P42R77N56j49k40l58m42p77j71k1L4K48P99
$$ -6146 -6513 -6439 -6007 -5591 -5250 -5040 -4834 -4092 -3115 -2559 -2708 -2948 -3306 -3748 -4525 -4696 -4717 -4683 -4435 -3636
14041c636P75M64J38L54K80J11k87j55k11k65j50K39L64M75J46j48n66n41l83
$$ -3636 -2861 -2397 -2259 -1905 -1625 -1514 -1801 -1956 -2167 -2432 -2582 -2343 -1979 -1504 -1358 -1506 -2072 -2613 -2996
14022b996J24M39M01Q9r9M88N30Q3j38k1J74l31j52l41m53j47j11m64j69K14M17
$$ -2996 -2872 -2433 -2032 -1943 -2042 -1554 -1024 -941 -1079 -1100 -926 -1257 -1409 -1750 -2203 -2350 -2461 -2925 -3094 -2880 -2463
14001b463K85N6k63l7K06K03J09o0k18j67K6M4j44L45K41k37m60l15M7O8k53l69
$$ -2463 -2178 -2122 -2385 -2422 -2216 -2013 -1904 -1964 -2182 -2349 -2323 -2279 -2423 -2078 -1837 -2074 -2534 -2849 -2802 -2734 -2987 -3356
13979c356k1l5k3L58J52k26k9K82L91K23J47J42K13j71m18j39k5k43K6J82j96
$$ -3356 -3377 -3412 -3435 -3077 -2925 -3151 -3180 -2898 -2507 -2284 -2137 -1995 -1782 -1953 -2371 -2510 -2535 -2778 -2752 -2570 -2766
13958b766m97l93M1K44J56L49K38K91J57Pj75L71K90j00k46J96L00J19m49n52
$$ -2766 -3263 -3656 -3615 -3371 -3215 -2866 -2628 -2337 -2180 -2173 -2348 -1977 -1687 -1787 -2033 -1837 -1537 -1418 -1867 -2419
13938b419k43J69K04O8k96J3K05L11J6q6j77M8J79P28Q14Q77M22J43M44J062J220
$$ -2419 -2662 -2493 -2289 -2221 -2517 -2504 -2299 -1988 -1972 -2058 -2235 -2187 -2008 -1280 -466 411 833 976 1420 2482 3702
13917C702J403P61J06o04o99r64o11k43l22l72m13m73k38n63m86k17L87N68Q97
$$ 3702 5105 5866 5972 5368 4669 3705 3094 2851 2529 2157 1744 1271 1033 470 -16 -233 154 722 1619
13898A619Q53N50L13P81J219J084Qq53j223j169r95q53o85kn8k47m03j71J05j56
$$ 1619 2472 3022 3335 4116 5335 6419 6427 5574 4351 3182 2187 1334 649 647 589 342 -61 -232 -127 -283
13878b83k20P2j49k67j97l58o45k63N8j08m2Mr3P0N8L72K23J83k26m03p6L38O02
$$ -283 -503 -431 -580 -847 -1044 -1402 -2047 -2310 -2252 -2360 -2402 -2398 -2491 -2421 -2363 -1991 -1768 -1585 -1811 -2214 -2290 -1952 -1350
13855a350O42N58K02p6k43j33P6K19L05J72j59L2L73M86N67P07M27M52J147J596
$$ -1350 -708 -150 52 -24 -267 -400 -324 -105 200 372 213 245 618 1104 1671 2378 2805 3257 4404 6000
13835F000R78l09j705j849j399q48m95r4L2j15l20l98j00J58J61J5k04j82k84
$$ 6000 6978 6669 4964 3115 1716 868 373 279 311 196 -124 -522 -622 -464 -303 -288 -492 -674 -958
13816i58L21O54L25l77l94l36J5p8k79l6L38p0j49p3j43j68Jk20k00nJ62L9K77
$$ -958 -637 17 342 -35 -429 -765 -750 -828 -1107 -1143 -805 -875 -1024 -1097 -1240 -1408 -1407 -1627 -1827 -1832 -1670 -1631 -1354
13793a354N2P8J89K33k59n32l62K2k16J92J47M1P5L5l14j10k0L80K93k2m50m85
$$ -1354 -1302 -1224 -1035 -802 -1061 -1593 -1955 -1933 -2149 -1957 -1810 -1769 -1694 -1659 -1973 -2083 -2103 -1723 -1430 -1452 -1902 -2387
13771b387j47M46L17K01L22K46j86k55k98k7Q6K82K63J28J67M58K16j82n95n18
$$ -2387 -2534 -2088 -1771 -1570 -1248 -1002 -1188 -1443 -1741 -1768 -1682 -1400 -1137 -1009 -842 -384 -168 -350 -945 -1463
13751a463j90L18K31J66R4J61k09m15k78p6o9j26N5L78M73M50lj53l43k51k23
$$ -1463 -1653 -1335 -1104 -938 -844 -683 -892 -1307 -1585 -1661 -1730 -1856 -1801 -1423 -950 -500 -503 -656 -999 -1250 -1473
13730a473mJ91K11J09k3m7K2p6M9N2L13J62l26j72J34N7n37n15j56R1J32j1o4
$$ -1473 -1477 -1286 -1075 -966 -989 -1036 -1014 -1090 -1041 -989 -676 -514 -840 -1012 -878 -821 -1358 -1873 -2029 -1938 -1806 -1817 -1881
13707a881J44J19M10K82ll10k29p4o7P9m0k39J08L38K76k71l34k07o0j98l81l96
$$ -1881 -1737 -1618 -1208 -926 -929 -1239 -1468 -1542 -1609 -1530 -1570 -1809 -1701 -1363 -1087 -1358 -1692 -1899 -1959 -2157 -2538 -2934
13685b934j46R8K47K51Q29N87K2p6M28L42j31q33p03n5J80j23K91N92L00k39J29
$$ -2934 -3080 -2982 -2735 -2484 -1655 -1068 -1046 -1122 -694 -352 -483 -1316 -2019 -2074 -1894 -2017 -1726 -1134 -834 -1073 -944
13664i44k32q86q24L01Q96K58n97J51L74J46J35K13q4j74M80O55J5j15l49j43
$$ -944 -1176 -2062 -2886 -2585 -1689 -1431 -2028 -1877 -1503 -1357 -1222 -1009 -1093 -1267 -787 -132 -117 -232 -581 -724
13644g24QL15j81l96j46R1ok11k38n1J1K04K76om22J87K30N0K90M88q1m07m00
$$ -724 -716 -401 -582 -978 -1124 -1033 -1039 -1250 -1488 -1539 -1528 -1324 -1048 -1054 -1476 -1289 -1059 -1009 -719 -231 -312 -719 -1119
13621a119l0j62j12J26J3k09Q2O8j26n15j08J14M1J02p8QM34J97m59n35m7j33
$$ -1119 -1149 -1311 -1423 -1297 -1284 -1493 -1411 -1343 -1469 -1984 -2092 -1978 -1937 -1835 -1913 -1905 -1471 -1274 -1733 -2268 -2315 -2448
13599b448J01K69K25J14J94K48K18l34k51K60K28M5j46K03J22p2l61k51R9j03
$$ -2448 -2347 -2078 -1853 -1739 -1545 -1297 -1079 -1413 -1664 -1404 -1176 -1131 -1277 -1074 -952 -1024 -1385 -1636 -1537 -1640
13579a640m7J18q0j41j57j13k3K03J43K25N41O39L05J03R1n9l57l35j63K87N99
$$ -1640 -1687 -1569 -1649 -1790 -1947 -2060 -2083 -1880 -1737 -1512 -971 -332 -27 76 167 108 -249 -584 -747 -460 139
13558A39L62j90m59o67j33L47L45M27L24K73O36M43Q6l76o70p20l58n87n28l52
$$ 139 501 311 -148 -815 -948 -601 -256 171 495 768 1404 1847 1933 1557 887 167 -191 -778 -1306 -1658
13538a658k49k65j58j95K45N37O91K18J65q8l64n71k47j37j57k41rP8N23O35M34
$$ -1658 -1907 -2172 -2330 -2525 -2280 -1743 -1052 -834 -669 -757 -1121 -1692 -1939 -2076 -2233 -2474 -2483 -2405 -1882 -1247 -813
13517h13k26l98k87K07N64N16k82k84k07K35K03o1l59n6L44M24L43L88k21l75
$$ -813 -1039 -1437 -1724 -1517 -953 -437 -719 -1003 -1210 -975 -772 -833 -1192 -1248 -904 -480 -137 251 30 -345
13497c45j69J38O26P59J98l04l93j68n2J21M1o9l21k65j2L08k16O6M76L54q8j18
$$ -345 -514 -376 250 1009 1207 903 510 342 290 411 452 383 62 -203 -215 93 -123 -57 419 773 685 567
13475E67j86r3J09j83l64j81l26j93J20J35K99Q7l71k83rO4n7j12k35k61k79m5
$$ 567 381 288 397 214 -150 -331 -657 -850 -730 -595 -296 -209 -580 -863 -872 -808 -865 -977 -1212 -1473 -1752 -1797
13453a797K2m0J24k3K41N46N23K95J69Jj20k28j4J13k4k09pj03j83o2KK12M12
$$ -1797 -1775 -1815 -1691 -1714 -1473 -927 -404 -109 60 61 -59 -287 -301 -188 -212 -421 -428 -531 -714 -776 -774 -562 -150
13430a50M0k93k98j01JQ0o2r2k00j71K13M73M64K03r5M1m33m45j09K78L05j62
$$ -150 -110 -403 -701 -802 -801 -721 -783 -875 -1075 -1246 -1033 -560 -96 107 12 53 -380 -825 -934 -656 -351 -513
13408e13j80K32M21J14j18n9j38K20Q3Q3N6J28q0P1l5l32n17j60K86L56l2J56
$$ -513 -693 -461 -40 74 -44 -103 -241 -21 62 145 201 329 249 320 285 -47 -564 -724 -438 -82 -114 42
13386D2K01M89M81N31L38O1n34n05Q5M36j15l66j41J78j82j57k65j19j30L79K72
$$ 42 243 732 1213 1744 2082 2143 1609 1104 1189 1625 1510 1144 1003 1181 999 842 577 458 328 707 979
13365I79m1J0J21K00n6m33j95j38mj31P7o3l27k13m9Q1P37M24J01Q4R4J90M23
$$ 979 938 948 1069 1269 1213 780 585 447 443 312 389 326 -1 -214 -263 -182 555 979 1080 1164 1258 1448 1871
13342A871o2n55n07j77j48r2l57o99l19M5r9L0J30N05P00J25k85j70n08l75N71
$$ 1871 1809 1254 747 570 422 330 -27 -726 -1045 -1000 -1099 -1069 -939 -434 266 391 106 -64 -572 -947 -376
13321c76O23J73M55J05q32r11m83J04M32P38P99K01l35n40l75J78J64j71QK0k46
$$ -376 247 420 875 980 148 -763 -1246 -1142 -710 28 827 1028 693 153 -222 -44 120 -51 -43 -23 -269
13300b69m18k39J18L59r6k25M04K1k72R7J79j30K12K59j59k91l47R6M98J50J58
$$ -269 -687 -926 -808 -449 -545 -770 -366 -345 -617 -520 -341 -471 -259 0 -159 -450 -797 -701 -203 -53 105
13279A05K43J41n00k34K70L82j30j07k16l62n70j07L31N28L79M90J64j90l93k07
$$ 105 348 489 -11 -245 25 407 277 170 -46 -408 -978 -1085 -754 -226 153 643 807 617 224 17
13259A7k33l04n48k45k53j20K07M25K20L95J86M3l84k64M55J245O12n66q77l30
$$ 17 -216 -520 -1068 -1313 -1566 -1686 -1479 -1054 -834 -439 -253 -210 -594 -858 -403 842 1454 888 11 -319
13239c19l00k35j77j42l79j70L89O02L38O4m06k72J68N54L90L89J6l53q90q04
$$ -319 -619 -854 -1031 -1173 -1552 -1722 -1333 -731 -393 -329 -735 -1007 -839 -285 105 494 510 157 -733 -1537
13219a537q37r45q32l39O21J450O00K00P75J088R83J359J134k3j527j321o01p50
$$ -1537 -2374 -3319 -4151 -4490 -3869 -2419 -1819 -1619 -844 244 1227 2586 3720 3697 2170 849 248 -502
13201e02j444n48J115J288O07J008J461J090J51M25J205M5k110k265j512j728
$$ -502 -1946 -2494 -1379 -91 516 1524 2985 4075 4226 4651 5856 5901 3791 1526 14 -1714
13185a714j426M02J489O14J0Q75J437M21k80q9J88p53q08J49O31M74O18Q29P43
$$ -1714 -3140 -2738 -1249 -635 -625 250 1687 2108 1828 1739 1927 1174 366 515 1146 1620 2238 3067 3810
13166C810L41k41m77l15k04M82J671K232J418J114Q42P01O25J4j299k667l489
$$ 3810 4151 3910 3433 3118 2914 3396 5067 7299 8717 9831 10673 11374 11999 12013 10714 8047 4558
13149D558l520l067j547O45K130K241K101K874M145L672J702n43j715j691p02
$$ 4558 1038 -2029 -3576 -2931 -801 1440 3541 6415 10560 14232 15934 15391 13676 11985 11283
13134A1283j181k813l469j542R65K456J665J79j061r43k34j58j451j789K12L373
$$ 11283 10102 7289 3820 2278 3243 5699 7364 7543 6482 5539 5305 5147 3696 1907 2119 5492
13118E492M146K543K50r28j824k024k674l993n039m341j507L414P706P838L791
$$ 5492 9638 12181 12431 11503 9679 7655 4981 988 -4051 -8392 -9899 -6485 1221 9059 12850
13103A2850J705M102N501K59n692o204l978j939J905N224L512m555j0884j0255
$$ 12850 14555 18657 24158 24417 18725 12521 8543 6604 8509 13733 17245 12690 1806 -8449
13089h449o814m093j923o38j130l239m075m319n063l556L230R891R677M055n83
$$ -8449 -15263 -19356 -21279 -21917 -23047 -26286 -30361 -34680 -39743 -43299 -40069 -30178 -20501 -16446 -17029
13074a7029k849l310R7O631R298N817J432J982N044N687K448m276q837p167k927
$$ -17029 -19878 -23188 -23091 -16460 -7162 -1345 87 2069 7113 12800 15248 10972 2135 -5032 -7959
13059g959m29o26j180q80O68L472M702K513p48j745l7K548L446J911j29J51K313
$$ -7959 -8388 -9014 -10194 -11074 -10406 -6934 -2232 281 -467 -2212 -2249 299 3745 5656 5527 5678 7991
13042G991L133N13l747n807m242j673m00l64p65M73L147M511L514J161j81j08
$$ 7991 11124 11637 7890 2083 -2159 -3832 -4232 -4596 -5361 -4888 -1741 2770 6284 7445 7264 7156
13026G156k39j640l320m130l465j937Q7J075J293J663K265K788K931J912P92m36
$$ 7156 6917 5277 1957 -2173 -5638 -7575 -7488 -6413 -5120 -3457 -1192 1596 4527 6439 7231 6795
13010F795j175j480j601j655j378j406q27J00J267R81K69r3N35M94M18O76J505
$$ 6795 5620 4140 2539 884 -494 -1900 -2727 -2627 -1360 -379 -110 -203 332 826 1244 1920 3425
12993C425J517J003M54O57M5j050k288k836l050k424q31J417K792K963J421j71
$$ 3425 4942 5945 6399 7056 7101 6051 3763 927 -2123 -4547 -5378 -3961 -1169 1794 3215 3044
12977C044j055p24J59J011J082M75n30j708k855k562j017R62K110K848K330O18
$$ 3044 1989 1265 1424 2435 3517 3992 3462 1754 -1101 -3663 -4680 -3718 -1608 1240 3570 4188
12961D188j398j483n94l3l9n2p34j310j202o21K01O38L57M5p6K35J282J772J034
$$ 4188 2790 1307 713 680 641 589 -145 -1455 -2657 -3278 -3077 -2439 -2082 -2037 -2113 -1878 -596 1176 2210
12942B210K16l41l72j89l2m2r4j49l00LP0m28n07l11j3L71N98K50L5J78K23J97
$$ 2210 2426 2085 1713 1524 1492 1450 1356 1207 907 910 980 552 45 -266 -279 92 690 940 975 1153 1376 1573
12920A573J24j61n13r02r12k32K64L80M11L70K81L03O5l89o7L06K45j0l15n31
$$ 1573 1697 1536 1023 121 -791 -1023 -759 -379 32 402 683 986 1051 662 595 901 1146 1136 821 290
12900B90n44J19J27n2RR5k70m22l7L04R1K5K69M95L75m4l23L12J58m13j81J16
$$ 290 -254 -135 -8 -60 -51 44 -226 -648 -685 -381 -290 -265 4 499 874 830 507 819 977 564 383 499
12878D99j96r0J70M04M09O7n61p93m55M17N10N42K84l07r70q27m86L19J053J441
$$ 499 303 213 383 787 1196 1263 702 -91 -546 -129 381 923 1207 900 -70 -897 -1383 -1064 -11 1430
12858A430P24k81r56l30L05P50O94L61k01o35q34k57J51L56L03M40K10Q4K3p8
$$ 1430 2154 1873 917 587 892 1642 2336 2697 2496 1861 1027 770 921 1277 1580 2020 2230 2314 2337 2259
12838B259m14j95n58j168p69J19M15P48N42J7k96k57J53P96M54K79k2j82m45j87
$$ 2259 1845 1650 1092 -76 -845 -726 -311 437 979 996 700 443 596 1392 1846 2125 2103 1921 1476 1289
12818A289l60m03k11J99K38R3r0L3K25N50K97r6r1K11k5k51r4L2J69K54L85K42
$$ 1289 929 526 315 514 752 845 755 788 1013 1563 1860 1764 1673 1884 1859 1608 1514 1546 1715 1969 2354 2596
12796B596m08m23j48j23M06M42L1j07k02k55j88J64K35L31P4n6l7j91O3M47K52
$$ 2596 2188 1765 1617 1494 1900 2342 2373 2266 2064 1809 1621 1785 2020 2351 2425 2369 2332 2141 2204 2651 2903
12775B903P7K07J21k27O3L98J96M21J006R66q7l73m58m01J18O75Q02O96N35P95
$$ 2903 2980 3187 3308 3081 3144 3542 3738 4159 5165 6131 6044 5671 5213 4812 4930 5605 6407 7103 7638 8433
12755H433J207J552J879K757L508M403M937N962P805R702J0861J3415J9134K7195
$$ 8433 9640 11192 13071 15828 19336 23739 28676 34638 42443 52145 63006 76421 95555 122750
12741A22750L1838K4642L232k0603l2406l0271k2622j5280j0624p610n968m880
$$ 122750 154588 179230 182462 161859 129453 99182 76560 61280 50656 43046 37078 32198
12729C2198m330l109k455k369k408k092j764j305r36q11j087p87l22j20l87o01
$$ 32198 27868 24759 22304 19935 17527 15435 13671 12366 11430 10619 9532 8745 8423 8303 7916 7315
12713G315r14n59n56n12n47k36j77l09l23K3o2j35k36K9nK1kMn6K1k90l78l31
$$ 7315 6401 5842 5286 4774 4227 3991 3814 3505 3182 3205 3143 3008 2772 2801 2796 2817 2815 2819 2763 2784 2494 2116 1785
12690A785P0R1L76J19l55l82J32L38J6k57j91l70k53j39O1j8k78n16j72K96N66
$$ 1785 1855 1946 2322 2441 2086 1704 1836 2174 2190 1933 1742 1372 1119 980 1041 1023 745 229 57 353 919
12669I19O25Q12O79J69k81n00n09j85l37n43l47l2M9O9M04P36O64k5o10o55k28
$$ 919 1544 2356 3035 3204 2923 2423 1914 1729 1392 849 502 470 519 588 992 1728 2392 2367 1757 1102 874
12648H74J6k27l66k99j98k80j72K02O39O28K28nj2J49P3J91J24%q3j71o4l5k74
$$ 874 890 663 297 -2 -200 -480 -652 -450 189 817 1045 1040 1028 1177 1250 1441 1565 1565 1482 1311 1247 1212 938
12625I38k05j60K5K25N15P00L16l43l00o58o31K82Q35Jm08p4L06j46k96l34J02
$$ 938 733 573 598 823 1338 2038 2354 2011 1711 1053 422 704 1539 1540 1132 1058 1364 1218 922 588 690
12604F90L65K84q3j42J37J90k72o8j52j12N4L73K50K55n7J84K61j94k83N8j9J03
$$ 690 1055 1339 1256 1114 1251 1441 1169 1101 949 837 891 1264 1514 1769 1712 1896 2157 1963 1680 1738 1719 1822
12582A822N1r0k58kl5m4m33m29k29K26K98M68L2j38q2K31L31r2l23q2o34k73r
$$ 1822 1873 1783 1525 1523 1488 1444 1011 582 353 579 877 1345 1377 1239 1157 1388 1719 1627 1304 1222 588 315 306
12559C06O6L44R6m61j02M3j52l50k00K6K32K40M81L94K57N8k5Q4L63j4m76m66
$$ 306 372 716 812 351 249 292 140 -210 -410 -384 -152 88 569 963 1220 1278 1253 1337 1700 1686 1210 744
12537G44j53j05K3k4O8J58n2K70P23P33K35o59m77L9J1j26Q9J74N2n0O2k82k41
$$ 744 591 486 509 485 553 711 659 929 1652 2385 2620 1961 1484 1523 1534 1408 1497 1671 1723 1673 1735 1453 1212
12514A212O9k28n95n54J4M84M59j58j44l69o89k60K40N95M85L39K00j21P6J21
$$ 1212 1281 1053 458 -96 -82 402 861 703 559 190 -499 -759 -519 76 561 900 1100 979 1055 1176
12494A176o4k33m33n55J16K36nK9M10j50m76k80O0J87N08P29N63o0Qj81j78j11
$$ 1176 1112 879 446 -109 7 243 238 267 677 527 51 -229 -169 18 526 1255 1818 1758 1766 1585 1407 1296
12472A296k63j85m6P5L37L54K56l45m09l25q5k93j52J88M75K77J27k18j98l7l3
$$ 1296 1033 848 802 877 1214 1568 1824 1479 1070 745 660 367 215 403 878 1155 1282 1064 866 829 796
12451G96LN01J51j58l59n9o6Q1K58L62l91n44k01k89m06L00N13N35M01M94K98
$$ 796 799 1300 1451 1293 934 875 809 890 1148 1510 1119 575 374 85 -321 -21 492 1027 1428 1922 2220
12430B220J04P4M5l25k45k69n08l75l6Q1L80N43O10L00M1j56N1k46l73o89o26
$$ 2220 2324 2398 2443 2118 1873 1604 1096 721 685 766 1146 1689 2299 2599 2640 2484 2535 2289 1916 1227 601
12409F01m25k75P0K02k9J1K93M83J40L61O74Rn18n2n0o8j25O5K16J56j75j71n2
$$ 601 176 -99 -29 173 144 155 448 931 1071 1432 2106 2115 1597 1545 1495 1427 1302 1367 1583 1739 1564 1393 1341
12386A341K07R1j11J3M7MK20K7Q2P4j55j31j62K8j42k68j99lKK86J65J69M15M14
$$ 1341 1548 1639 1528 1541 1588 1592 1812 1839 1921 1995 1840 1709 1547 1575 1433 1165 966 963 965 1251 1416 1585 2000 2414
12362B414j24j52k49l15k39j60j7L51J59o7k10r4j34k91l20N4l5j71j67R5J93
$$ 2414 2290 2138 1889 1574 1335 1175 1158 1509 1668 1601 1391 1297 1163 872 552 606 571 400 233 328 521
12341E21rj03J70k6K5Ok0j53J86O39M44l72m06JK70J0J96J27K9j40l73j47K83
$$ 521 512 409 579 553 578 584 564 411 597 1236 1680 1308 902 903 1173 1183 1379 1506 1535 1395 1022 875 1158
12318A158K5K67J77J92j8N0j85j98m56q7j03j57j17q5k89l07j48P4R6L38N2L10
$$ 1158 1183 1450 1627 1819 1801 1851 1666 1468 1012 925 822 665 548 463 174 -133 -281 -207 -111 227 279 589
12296E89N94K54n79n95j94O7j9M84J08l35j55O82M64M0j03j21k67k92p4J13k03
$$ 589 1183 1437 858 263 69 136 117 601 709 374 219 901 1365 1405 1302 1181 914 622 548 661 458
12275D58m0J08O16N46J58j76l23n04j67o0j10k49l82j20K75N52L62L33K70j35
$$ 458 418 526 1142 1688 1846 1670 1347 843 676 616 506 257 -125 -245 30 582 944 1277 1547 1412
12255A412k53l13n58o00j34L52O11M61R0M49M09O2j39k9r8k47r8L35K22J13O8
$$ 1412 1159 846 288 -312 -446 -94 517 978 1068 1517 1926 1988 1849 1820 1722 1475 1377 1712 1934 2047 2115
12234B115K16R0k30k64l80j01K64R4k48j84J27r2l40l09n1J23m0j41L12J65r8
$$ 2115 2331 2421 2191 1927 1547 1446 1710 1804 1556 1372 1499 1407 1067 758 707 830 790 649 961 1126 1028
12213A028M1M58J66Lp5j69l27q2j57R6O3P2R7K71N1K59J81j09k86J48N9J26l37
$$ 1028 1069 1527 1693 1696 1621 1452 1125 1043 886 982 1045 1117 1214 1485 1536 1795 1976 1867 1581 1729 1788 1914 1577
12190A577m02p3L3k88J16K25j84n07l1M7J76k5j75k2M48J65j59j34K16J95j7l00
$$ 1577 1175 1102 1135 847 963 1188 1004 497 466 513 689 664 489 467 915 1080 921 787 1003 1198 1181 881
12168H81n5j49J52K38P5j84j13j00K80L18J49j73j81j78MK8J21k81m09k02J13
$$ 881 826 677 829 1067 1142 958 845 745 1025 1343 1492 1319 1138 960 964 992 1113 832 423 221 334
12147C34P6J7k48j7M1k3PN6m1j29J31K47k66k68m1M7R4J35K54N28L26J3k97j96
$$ 334 410 427 179 162 203 180 187 243 202 73 204 451 185 -83 -124 -77 17 152 406 934 1260 1273 976 780
12123G80J71J73m52p05k45P5K42K72J25M6r6L06O93O03N76j37j10M99K59k84k91
$$ 780 951 1124 672 -33 -278 -203 39 311 436 482 386 692 1385 1988 2564 2427 2317 2816 3075 2791 2500
12102B500O4K15k66l59r4J15L23L26K53J48k42j75J36K83k39k97k54k89P7N99
$$ 2500 2564 2779 2513 2154 2060 2175 2498 2824 3077 3225 2983 2808 2944 3227 2988 2691 2437 2148 2225 2824
12082B824M66K84J51J36j83m33p19k26j46M4J52J57J27J48m6j73j25J02L7K22
$$ 2824 3290 3574 3725 3861 3678 3245 2526 2300 2154 2198 2350 2507 2634 2782 2736 2563 2438 2540 2577 2799
12062B799K33O2l04Jp7k04k46J91o5l3K14K35K91J47l07L6Q9m37l78L38J43Q9
$$ 2799 3032 3094 2790 2791 2714 2510 2264 2455 2390 2357 2571 2806 3097 3244 2937 2973 3062 2625 2247 2585 2728 2817
12040B817l54k18n02o03O6J163R00J77m66N7J83J08K39L64%j56p3O9n2J58K3n7
$$ 2817 2463 2245 1743 1140 1206 2369 3269 3446 2980 3037 3220 3328 3567 3931 3931 3775 3702 3771 3719 3877 3900 3843
12018C843p43o44J7L77K71L79K11k34l99l30j90L1j13j92K9K60l1L5K22N66O92
$$ 3843 3100 2456 2473 2850 3121 3500 3711 3477 3078 2748 2558 2589 2476 2284 2313 2573 2542 2577 2799 3365 4057
11997D057M02L1r1l59m32k35L1L00K06K68K8m94k05J39J33q0N4Q4j52k1M03L47
$$ 4057 4459 4490 4399 4040 3608 3373 3404 3704 3910 4178 4206 3712 3507 3646 3779 3699 3753 3837 3685 3664 4067 4414
11975D414J95q1o62o04m00r2O8L22K62L14K36p4l06k23Q4O67O86K6m61l1l40n14
$$ 4414 4609 4528 3866 3262 2862 2770 2838 3160 3422 3736 3972 3898 3592 3369 3453 4120 4806 4832 4371 4340 4000 3486
11953C486j98Ll4J56o4o0l50l58o3J64L11N18J47j14k04n72m18q5k20J04K34L71
$$ 3486 3288 3291 3257 3413 3349 3289 2939 2581 2518 2682 2993 3511 3658 3544 3340 2768 2350 2265 2045 2149 2383 2754
11931B754L58L33k01j23K25N19J72J92P4J28j06K42l77p41l49M56N24L03k31m27
$$ 2754 3112 3445 3244 3121 3346 3865 4037 4229 4303 4431 4325 4567 4190 3449 3100 3556 4080 4383 4152 3725
11911C725l63l5n3M44N29o0l79j55j98N9J55L52J6n46l63O0j79JL1L58Q8j8O3
$$ 3725 3362 3327 3274 3718 4247 4187 3808 3653 3455 3514 3669 4021 4037 3491 3128 3188 3009 3010 3041 3399 3487 3469 3532
11888C532M00J13Q4R6p9m38n67p2K71J18L23J38o7m52o19l41J47L80L77K36J54
$$ 3532 3932 4045 4129 4225 4146 3708 3141 3069 3340 3458 3781 3919 3852 3400 2781 2440 2587 2967 3344 3580 3734
11867C734r8K68K33j24l44l99j20M53N54L38q3l95n44n68j76M03O05N94M25k36
$$ 3734 3636 3904 4137 4013 3669 3270 3150 3603 4157 4495 4412 4017 3473 2905 2729 3132 3737 4331 4756 4520
11847D520m59j88l16k85j21o5J56P3O1K55J25l44l20P1P2l38j42j5n4K27M45L30
$$ 4520 4061 3873 3557 3272 3151 3086 3242 3315 3376 3631 3756 3412 3092 3163 3235 2897 2755 2740 2686 2913 3358 3688
11825C688J75k73O1J1j39k96n68p69k79R1M34N61M03Q7L4P8Q5j77Lj4o6k57o1
$$ 3688 3863 3590 3651 3662 3523 3227 2659 1890 1611 1702 2136 2697 3100 3187 3221 3299 3384 3207 3210 3196 3130 2873 2812
11802B812K05L04p1M9J9R8l44l94l3L17K50J2k31MJ34L22L80L3n95k59J40M55
$$ 2812 3017 3321 3250 3299 3318 3416 3072 2678 2645 2962 3212 3224 2993 2997 3131 3453 3833 3866 3271 3012 3152 3607
11780C607O7K42J83L16K40j11n65m63l59O9k50m82l26j43j55j61n73j14K64M45
$$ 3607 3674 3916 4099 4415 4655 4544 3979 3516 3157 3226 2976 2494 2168 2025 1870 1709 1136 1022 1286 1731
11760A731L97K21J81N18r0l69k53l86j85J9J52O21P6K4j18k70R0M51J92N09J56
$$ 1731 2128 2349 2530 3048 2958 2589 2336 1950 1765 1784 1936 2557 2633 2657 2539 2269 2359 2810 3002 3511 3667
11739C667j71k06j02J15J92j12m30p05q4J03K55L19O8m1j4P5L80P74M17j76l49
$$ 3667 3496 3290 3188 3303 3495 3383 2953 2248 2164 2267 2522 2841 2909 2868 2854 2929 3309 4083 4500 4324 3975
11718C975n65m47k21J87K92K37M6n6j00p5q7j53K28j04o45l71J95K15o5l57j97
$$ 3975 3410 2963 2742 2929 3221 3458 3504 3448 3348 3273 3186 3033 3261 3157 2512 2141 2336 2551 2486 2129 1932
11697A932k38j32J59M38L61M21j4k12k37k22k46K58K23K74k4m44p65l30R0M27
$$ 1932 1694 1562 1721 2159 2520 2941 2927 2715 2478 2256 2010 2268 2491 2765 2741 2297 1532 1202 1292 1719
11677A719K81O9k45j81J03L51J7J60J63Q6n0K24K96J80o1J21Mk48l18j76j83K36
$$ 1719 2000 2069 1824 1643 1746 2097 2114 2274 2437 2523 2473 2697 2993 3173 3112 3233 3237 2989 2671 2495 2312 2548
11655B548n5m7l4K62Q9l36m80O9L06K81n0J9j35k8J35L91J45M5k25O0L4l82o80
$$ 2548 2493 2446 2412 2674 2763 2427 1947 2016 2322 2603 2553 2572 2437 2409 2544 2935 3080 3125 2900 2960 2994 2612 1932
11632A932P4L62k33n76j67l70k3N7j67K45P31L30J07L0M00q4O0Jl61l52k3J10
$$ 1932 2006 2368 2135 1559 1392 1022 999 1056 889 1134 1865 2195 2302 2332 2732 2648 2708 2709 2348 1996 1973 2083
11610B083J44j32j44o3J61R8m4k41m5m6M3O0p5j82l54l66PJ56M71P98K17m20k83
$$ 2083 2227 2095 1951 1888 2049 2147 2103 1862 1817 1771 1814 1874 1799 1617 1263 897 904 1060 1531 2329 2546 2126 1843
11587A843j84k37m8K94L0k26J50M39K78p9n7k90k33O7L51J91l16l51q7p1K61K50
$$ 1843 1659 1422 1374 1668 1698 1472 1622 2061 2339 2260 2203 1913 1680 1747 2098 2289 1973 1622 1535 1464 1725 1975
11565A975j44j84Q3L6L02J26j26j85K63P2k02j49P6O0Q8J00L02J55j62m44m20
$$ 1975 1831 1647 1730 1766 2068 2194 2068 1883 2146 2218 2016 1867 1943 2003 2091 2191 2493 2648 2486 2042 1622
11544A622l65K7K33L64l2k26n51l54m4K13L20J8R9M05K7l2k06j88m03P4J23L09
$$ 1622 1257 1284 1517 1881 1849 1623 1072 718 674 887 1207 1225 1324 1729 1756 1724 1518 1330 927 1001 1124 1433
11522A433L05J07m03k14N4J39k80n8m5J13L94P84M93M93J67j20o14m70l84l43
$$ 1433 1738 1845 1442 1228 1282 1421 1141 1083 1038 1151 1545 2329 2822 3315 3482 3362 2748 2278 1894 1551
11502A551l02m21m21O7M26M73Nj19M3M72L52J4o30m66j19J05l56k02O8J00N9L21
$$ 1551 1249 828 407 474 900 1373 1378 1259 1302 1774 2126 2140 1510 1044 925 1030 674 472 540 640 699 1020
11480A020R5m17l95L21M24R6k40N5l3N6K45J93o6P9m3j69l6M92R7k10L40O05K40
$$ 1020 1115 698 303 624 1048 1144 904 959 926 982 1227 1420 1354 1433 1390 1221 1185 1677 1774 1564 1904 2509 2749
11457B749n0l61p97j134n59L95P16O45O07J71j93n5L37L72m57m83q9M66N02k49
$$ 2749 2699 2338 1541 407 -152 243 959 1604 2211 2382 2189 2134 2471 2843 2386 1903 1814 2280 2782 2533
11437B533n69m73k4L71k20m20k4K18J42J91M79M03m08l87J00M16K7q6L9J6m11
$$ 2533 1964 1491 1467 1838 1618 1198 1174 1392 1534 1725 2204 2607 2199 1812 1912 2328 2355 2269 2308 2324 1913
11416A913l69k91j21K98O17L98L24J37j9J60O79J37n25n58J21j66p7M6K15o8R2
$$ 1913 1544 1253 1132 1430 2047 2445 2769 2906 2887 3047 3726 3863 3338 2780 2901 2735 2658 2704 2919 2851 2943
11395B943L09K94k27n07k30M14J10M2j83n13n30L32K70m5j19K82K45K76m36n11
$$ 2943 3252 3546 3319 2812 2582 2996 3106 3148 2965 2452 1922 2254 2524 2479 2360 2642 2887 3163 2727 2216
11375B216j29M38J73J88J08Ll40P2L41M23j45r3j0K31o8n2j7j09M16O40L17L51
$$ 2216 2087 2525 2698 2886 2994 2997 2657 2729 3070 3493 3348 3255 3245 3476 3408 3356 3339 3230 3646 4286 4603 4954
11353D954N91J291J380J237R90J498K552L419L776L699K671K660J563j231k447
$$ 4954 5545 6836 8216 9453 10443 11941 14493 17912 21688 25387 28058 30718 32281 31050 28603
11338B8603l074m403m401l657k356j638j393j270o85j45k30q35n70r5J77J09L1
$$ 28603 25529 21126 16725 13068 10712 9074 7681 6411 5726 5581 5351 4516 3946 3851 4028 4137 4168
11321D168j5l40m18l97j01l6L33P36N33J79k9k23n26n01N2N74M65J34Q8L71J020
$$ 4168 4153 3813 3395 2998 2897 2861 3194 3930 4463 4642 4613 4390 3864 3363 3415 3989 4454 4588 4676 5047 6067
11300F067J363J740J719J635K733M655N737M905J903j944n518n453m469l059j981
$$ 6067 7430 9170 10889 12524 15257 19912 25649 30554 32457 30513 24995 19542 15073 12014 10033
11285A0033j676j576p85n44n34o74k61j52J4L56J75m12k63l36o3j06k47o05j47
$$ 10033 8357 6781 5996 5452 4918 4244 3983 3831 3845 4201 4376 3964 3701 3365 3302 3196 2949 2344 2197
11266B197J00J72J1P6p0K47N23J25l60l42m21r1J21K90l02m30M6J61j64M24L14
$$ 2197 2297 2469 2480 2556 2486 2733 3256 3381 3021 2679 2258 2167 2288 2578 2276 1846 1892 2053 1889 2313 2627
11245B627K72q2n33l70P9p1l9J72O76L85P5j73m34m59N7j21R3J15r9n52J7M75
$$ 2627 2899 2817 2284 1914 1993 1922 1883 2055 2731 3116 3191 3018 2584 2125 2182 2061 2154 2269 2170 1618 1635 2110
11223B110N82L41N11Q6k6J31k47p56o95n98m6L26M04L86J62j2M98N20K64j59m89
$$ 2110 2692 3033 3544 3630 3604 3735 3488 2732 2037 1439 1393 1719 2123 2509 2671 2659 3157 3677 3941 3782 3293
11202C293n52l25o27m14K50P26L12p9r9L12J3l85m41k12J2N7L06K22J82J33K23
$$ 3293 2741 2416 1789 1375 1625 2351 2663 2584 2485 2797 2810 2425 1984 1772 1784 1841 2147 2369 2551 2684 2907
11181B907L96O4n86m38k03k26l51j71k3m27m19K12K58L51K49J85o3o4O9J04K18
$$ 2907 3303 3367 2781 2343 2140 1914 1563 1392 1369 942 523 735 993 1344 1593 1778 1715 1651 1720 1824 2042
11160B042J62K1L71l98k96L53M56L69R1l9N77J59k84k15J96K70K83j35j03k4J47
$$ 2042 2204 2225 2596 2198 1902 2255 2711 3080 3171 3132 3709 3868 3584 3369 3565 3835 4118 3983 3880 3856 4003
11139D003k83l50j43q2l56K2J55mm89j27K55P66K20j95m97l99m78l56k18J74j76
$$ 4003 3720 3370 3227 3145 2789 2811 2966 2962 2473 2346 2601 3367 3587 3392 2895 2496 2018 1662 1444 1618 1442
11118A442O4O03Q68L30j79n93p51q05j65O44J260P17m19j460j345r16m14N38J528
$$ 1442 1506 2109 2977 3307 3128 2535 1784 979 814 1458 2718 3435 3016 1556 211 -705 -1119 -581 947
11099I47J254L11m87p17o47J84O08J345J022k54j471j280o97j90m0M72P68M91
$$ 947 2201 2512 2025 1308 661 845 1453 2798 3820 3566 2095 815 118 -72 -112 360 1128 1619
11081A619J35r8j0L29K88K63j95m00k14M54L25O6k59l58m54m12L2K70J41Q0k54
$$ 1619 1754 1656 1646 1975 2263 2526 2331 1931 1717 2171 2496 2562 2303 1945 1491 1079 1111 1381 1522 1602 1348
11060A348k6J3l18k92p9K48P29K02o68q12l49M33O35K35l83k50L19L62K73j7m89
$$ 1348 1322 1335 1017 725 646 894 1623 1825 1157 345 -4 429 1064 1299 916 666 985 1347 1620 1603 1114
11039A114j03J09L7j40o5m41p82R7J183R45J23p38q14m94m8J08o1m98m36J80P50
$$ 1114 1011 1120 1157 1017 952 511 -271 -174 1009 1954 2077 1339 525 31 -17 91 30 -468 -904 -724 26
11018B6R15L37o31r4O61Q34K35k81n29j0K60O46R61K80o98j83M87L31p94j272
$$ 26 941 1278 647 553 1214 2048 2283 2002 1473 1463 1723 2369 3330 3610 2912 2729 3216 3547 2753 1481
10998A481j789n83J223J035k78Lr02k708l155M15K140p0p90J480N61l090l428
$$ 1481 -308 -891 332 1367 1089 1092 190 -2518 -5673 -5258 -3118 -3188 -3978 -2498 -1937 -5027 -8455
10981h455J071L133J490J664L672J729k051k043R14J044l21n97L23L47L0J19J14
$$ -8455 -7384 -4251 -2761 -1097 2575 4304 2253 210 1124 2168 1847 1250 1573 1920 1950 2069 2183
10964B183m54p96r90q9M19P13q6o42j90R63J221O82K4l91n60l00m3J23q58j479
$$ 2183 1729 933 -57 -146 273 986 900 258 68 1031 2252 2934 2958 2567 2007 1707 1664 1787 929 -550
10944e50n01P01J409J972Q96k68p46l81m37j090j634j410p42K66O06P81L88k94
$$ -550 -1051 -350 1059 3031 3927 3659 2913 2532 2095 1005 -629 -2039 -2781 -2515 -1909 -1128 -740 -1034
10926a034J31J044Q78l17q91q46k57J032J341J90m44q2L2n3k2m81j398j847j195
$$ -1034 -903 141 1019 702 -189 -1035 -1292 -260 1081 1271 827 745 777 724 702 221 -1177 -3024 -4219
10907d219KR01L21J66J360K318K014O19j067k618l314j806M77J056q93j888n12
$$ -4219 -4217 -3316 -2995 -2829 -1469 849 2863 3482 2415 -203 -3517 -5323 -4846 -3790 -4683 -6571 -7083
10890g083K273K803M91k756l134j359n4J844N164N522J772j406J015L819K474
$$ -7083 -4810 -2007 -1516 -4272 -7406 -8765 -8819 -6975 -1811 3711 5483 4077 5092 8911 11385
10875A1385k12j44N06M49O82K585K790O5k136k57K766K765k93l894n943l990m53
$$ 11385 11173 11029 11535 11984 12666 15251 18041 18106 15970 15713 18479 21244 20951 17057 11114 7124 6671
10858F671K182J973j20k820l889k178L96k59k571l217r7K274L609L274J298p93
$$ 6671 8853 10826 10706 7886 3997 1819 2215 1956 -615 -3832 -3929 -1655 1954 5228 6526 5733
10842E733j101j0J318M39j479k467j647k96P85O89m12j150j43P25J074L85n53
$$ 5733 4632 4622 5940 6379 4900 2433 786 490 1275 1964 1552 402 259 984 2058 2443 1890
10825A890o50O48J253J394M69n55p12K33J90m67j222j333j220q82K0R02O76Q82
$$ 1890 1240 1888 3141 4535 5004 4449 3737 3970 4160 3693 2471 1138 -82 -964 -944 -42 634 1516
10807A516J334R82M03L75l47r20p34l79m44q0k62j29M61M82L81N03J65J35Rj88
$$ 1516 2850 3832 4235 4610 4263 3343 2609 2230 1786 1706 1444 1315 1776 2258 2639 3142 3307 3442 3451 3263
10787C263j4l97n34k51j93o93j156o94j9N04J185R41J05n88o82n61M51J644K259
$$ 3263 3249 2852 2318 2067 1874 1181 25 -669 -688 -184 1001 1942 2047 1459 777 216 667 2311 4570
10768D570J632J37j406j942j820j197k79O75Q86O76N2n78j108p04N03K215K079
$$ 4570 6202 6339 4933 2991 1171 -26 -305 370 1256 1932 1984 1406 298 -406 97 2312 4391
10751D391J215J1j90k99nN86J621J745k5j877j921j282j28L50L74j84n49r63l82
$$ 4391 5606 5617 5427 5128 5123 5709 7330 9075 9050 7173 5252 3970 3842 4192 4566 4382 3833 2870 2488
10732B488P0R5j33q7n48n75k72K60n0m15p39k67J20Q56R65N94J73M23K24L47m4
$$ 2488 2558 2653 2520 2433 1885 1310 1038 1298 1248 833 94 -173 -53 803 1768 2362 2535 2958 3182 3529 3485
10711C485p9k22l15m67m76j008o35k31J89J24K95M00N60L96N78N00M32m26k17
$$ 3485 3406 3184 2869 2402 1926 918 283 52 241 365 660 1060 1620 2016 2594 3094 3526 3100 2883
10692B883L78R18J405K093L027L518K687P90j964l232k932k120j748j273n61r3
$$ 2883 3261 4179 5584 7677 10704 14222 16909 17699 15735 12503 9571 7451 5703 4430 3869 3776
10676C776k33o04q39k32m7P3l79o90m74m72q2M86N29P02M44mn09o29k7N10M59
$$ 3776 3543 2939 2100 1868 1821 1894 1515 825 351 -121 -203 283 812 1514 1958 1954 1445 816 789 1299 1758
10655A758K54J70k51l49l48k60J48L92O08L64m05p84p72j30K85O29R74O66j62
$$ 1758 2012 2182 1931 1582 1234 974 1122 1514 2122 2486 2081 1297 525 395 680 1309 2283 2949 2787
10636B787q70j066n23J0N09N49M32J4J95J68K91m8j00k46o5k48k81RJ71JM8q6
$$ 2787 1917 851 328 338 847 1396 1828 1842 2037 2205 2496 2448 2348 2102 2037 1789 1508 1517 1688 1689 1737 1651
10614A651r4l23k11m5J50l13Q2N5L08K60M08J25L4n6L50L25J37k08m80r13j81
$$ 1651 1557 1234 1023 978 1128 815 897 952 1260 1520 1928 2053 2087 2031 2381 2706 2843 2635 2155 1242 1061
10593A061M38K16l37j02j37R3Q5j33j82K17j07J56K02k9m48J6J07L69L05K71n7
$$ 1061 1499 1715 1378 1276 1139 1232 1317 1184 1002 1219 1112 1268 1470 1441 993 1009 1116 1485 1790 2061 2004
10572B004k33j63J8m18PK29K28k79p5J3N38J47j61k88l20m11l71m33M4J66P9L4
$$ 2004 1771 1608 1626 1208 1215 1444 1672 1393 1318 1331 1869 2016 1855 1567 1247 836 465 32 76 242 321 355
10550C55N33M70M20L19M62m9o60n22K06K99j5m16j63QJ46O34O94M92K12J77K11
$$ 355 888 1358 1778 2097 2559 2510 1850 1328 1534 1833 1818 1402 1239 1247 1393 2027 2721 3213 3425 3602 3813
10529C813M56J043J429J833K157J781M49o80j128o28j45J14N14O82N76j65j082
$$ 3813 4269 5312 6741 8574 10731 12512 12961 12281 11153 10525 10380 10494 11008 11690 12266 12101 11019
10512A1019j708j642r39n85o86m21k86q3l60o96r02m73J89M59Q7j02l35L9oJ19
$$ 11019 9311 7669 6730 6145 5459 5038 4752 4669 4309 3613 2711 2238 2427 2886 2973 2871 2536 2575 2569 2688
10492B688M30O34K12M5J14L51j39q0l31j13J47O52M21k8O8J229J603J835J651
$$ 2688 3118 3752 3964 4009 4123 4474 4335 4255 3924 3811 3958 4610 5031 5003 5071 6300 7903 9738 11389
10473A1389J076k06r46j633j756j726o69k94k09m13K0j9L24j12j61j37N46J61
$$ 11389 12465 12259 11313 9680 7924 6198 5529 5235 5026 4613 4633 4614 4938 4826 4665 4528 5074 5235
10455E235o3p03n54o08m91o27r5L31M71J27L12J22L73K77L39p4k60o99q3L12N81
$$ 5235 5172 4469 3915 3307 2816 2189 2094 2425 2896 3023 3335 3457 3830 4107 4446 4372 4112 3413 3330 3642 4223
10434D223L06L30k21k30k39L52J81L89J77P0J25Nl12M29O09K27m5L81j5LK90M36
$$ 4223 4529 4859 4638 4408 4169 4521 4702 5091 5268 5338 5463 5468 5156 5585 6194 6421 6376 6757 6742 6745 7035 7471
10412G471L9j39k83M03J013J207Q30J92k68P4L27P34Q23O51M15J60O42J045R57
$$ 7471 7510 7371 7088 7491 8504 9711 10541 10733 10465 10539 10866 11600 12423 13074 13489 13649 14291 15336 16293
10393A6293P30J122J190J067P99J221J378J481J852K565K705L552M456N499N741
$$ 16293 17023 18145 19335 20402 21201 22422 23800 25281 27133 29698 32403 35955 40411 45910 51651
10378E1651P126Q322R410J0725J3699J6581K1494K8260L9215N3316P5482J03832
$$ 51651 58777 67099 76509 87234 100933 117514 139008 167268 206483 259799 335281 439113
10366D39113J47166K23245L40952M44028M58884L13574j371l90286n27365m05636
$$ 439113 586279 809524 1150476 1594504 2053388 2366962 2365591 1975305 1447940 1042304
10356A042304k74845j82705j27017q8398o4551m7493l7054k8674k3958j9741j7488
$$ 1042304 767459 584754 457737 369339 304788 257295 220241 191567 167609 147868 130380
10345A30380j3961j1727r604q882p585o824n752n219m001l461k643k928k865k650
$$ 130380 116419 104692 95088 86206 78621 71797 66045 60826 56825 53364 50721 47793 44928 42278
10331D2278k473k919k862l181k802j914j223j105j393j471j620j774j019p69o86
$$ 42278 39805 36886 34024 30843 28041 26127 24904 23799 22406 20935 19315 17541 16522 15753 15067
10316A5067j067j183m46M4j42o93j089n93k11n07l68j9K15k82n13m42j73mM55
$$ 15067 14000 12817 12371 12415 12273 11580 10491 9898 9687 9180 8812 8793 9008 8726 8213 7771 7598 7594 8049
10297H049P48Q39R72J117P01J12l52n35j188j456j315j422j101n12l99k68k29
$$ 8049 8797 9636 10608 11725 12426 12538 12186 11651 10463 9007 7692 6270 5169 4657 4258 3990 3761
10280C761p6L7N94M07R3j61K19R68J554J702J842J093J27p26j302k192j644p47
$$ 3761 3685 3722 4316 4723 4816 4655 4874 5842 7396 9098 10940 12033 12160 11434 10132 7940 6296 5549
10262E549m67p70p14m22k38l1m5P2k8n94k10J62J65r6l09l37q7Nm11m22j06k3
$$ 5549 5082 4312 3598 3176 2938 2907 2862 2934 2906 2312 2102 2264 2429 2333 2024 1687 1600 1605 1194 772 666 643
10240F43K76R2J55L00J78j64k66K0J07M66L77m24o52j74M50M85J76l7l1N8r3j22
$$ 643 919 1011 1166 1466 1644 1480 1214 1234 1341 1807 2184 1760 1108 934 1384 1869 2045 2008 1977 2035 1942 1820
10218A820k2l30p10l16j43l05J31N65J92J74j49l62n11k71j33K27L12N4PM40K49
$$ 1820 1798 1468 758 442 299 -6 125 690 882 1056 907 545 34 -237 -370 -143 169 223 230 670 919
10197I19j76l04K19J63m6J01Oo35j71q4j31j29J92L36M4m75l81l32j5p1J23L64
$$ 919 743 439 658 821 775 876 882 247 76 -8 -139 -268 -76 260 304 -171 -552 -884 -899 -970 -847 -483
10175d83N37n1m04j86J88L00N05J05J6j06K39K88L45m8m44o06j69J10J09K8M58
$$ -483 54 3 -401 -587 -399 -99 406 511 527 421 660 948 1293 1245 801 195 26 136 245 273 731
10154G31L67q8l63l09m88p8J41K61M54L02j03K52P4k53m11l26k21K61K70j37l34
$$ 731 1098 1010 647 338 -150 -228 -87 174 628 930 827 1079 1153 900 489 163 -58 203 473 336 2
10133Bj42j43J59L43K77n2l98j90J54k93o08k0Q83N39O5K5k24l14j64j82j49J38
$$ 2 -140 -283 -124 219 496 444 46 -144 10 -283 -891 -911 -28 511 576 601 377 63 -101 -283 -432 -294
10111b94J27j7n1M46O62J18R2j31m60k87j12k15j34k07l15K42N08L24j13J95o8
$$ -294 -167 -184 -235 211 873 991 1083 952 492 205 93 -122 -256 -463 -778 -536 -28 296 183 378 310
10090C10m06p4j40m09l64l08J46L97M59L41j01m74j09j02L8J90L63K43R5l28j61
$$ 310 -96 -170 -310 -719 -1083 -1391 -1245 -848 -389 -48 -149 -623 -732 -834 -796 -606 -243 0 95 -233 -394
10069c94L4J07k74n01m94k7L68N41L54J87R9J27j01kk46k59r1L14L16M41L34r2
$$ -394 -360 -253 -527 -1028 -1522 -1549 -1181 -640 -286 -99 0 127 26 24 -222 -481 -572 -258 58 499 833 741
10047G41n18j37J23K17j40k5j92k98l64N14R64J085Q88J426J926K582K884K351
$$ 741 223 86 209 426 286 261 69 -229 -593 -79 885 1970 2858 4284 6210 8792 11676 14027
10029A4027L79j848l200k369j568j091j059n67l95j10k12j01j49m95q71n80j37
$$ 14027 14406 12558 9358 6989 5421 4330 3271 2704 2309 2199 1987 1886 1737 1242 371 -209 -346
10012c46J42q9J85j47r7l2k6m16k82R2N69N74K18J69L98rk96l92o53p06j44J16
$$ -346 -204 -293 -108 -255 -352 -384 -410 -826 -1108 -1016 -447 127 345 514 912 903 607 215 -438 -1144 -1288 -1172
9990a172P7q5P6K69J83Q6J91O0l11k99M8k23l29J12J39k01k60k6M94Q84N15Qr3
$$ -1172 -1095 -1180 -1104 -835 -652 -566 -375 -315 -626 -925 -877 -1100 -1429 -1317 -1178 -1379 -1639 -1665 -1171 -287 228 236 143
9967A43N2l7l52l97k38l6L46J06L5k81o06n27K12N09P24K06L7p1K36N0m06k42
$$ 143 195 158 -194 -591 -829 -865 -519 -413 -378 -659 -1265 -1792 -1580 -1071 -347 -141 -104 -175 61 111 -295 -537
9945e37L04L4j72J05L11q1r9K53O15L88L21J53J05n01m66m91l90k8M61J50R5o
$$ -537 -233 -199 -371 -266 45 -36 -135 118 733 1121 1442 1595 1700 1199 733 242 -148 -176 285 435 530 524
9923E24L30L02p4n89l14k76K73K15j2m23Q1j21M2K11R3N1J32m1K04N7l08o40n9
$$ 524 854 1156 1082 493 179 -97 176 391 379 -44 37 -84 -42 169 262 313 445 404 608 665 357 -283 -342
9900c42R6j88n05k04j96k64l81R2K02J96n2n52p32l76k14j08k49Q1j93j34R3J31
$$ -342 -246 -434 -939 -1143 -1339 -1603 -1984 -1892 -1690 -1494 -1546 -2098 -2830 -3206 -3420 -3528 -3777 -3696 -3889 -4023 -3930 -3799
9878c799m4m3ko7L01P10K17r9o15k44k1K80J81M3k09J14L63K88J88l76q34l13
$$ -3799 -3843 -3886 -3888 -3955 -3654 -2944 -2727 -2826 -3441 -3685 -3706 -3426 -3245 -3202 -3411 -3297 -2934 -2646 -2458 -2834 -3668 -3981
9856c981k5L6j58J39K22J07K86M71L49J40k8J75K80l19o79o76m18j35r1k30k20
$$ -3981 -4006 -3970 -4128 -3989 -3767 -3660 -3374 -2903 -2554 -2414 -2442 -2267 -1987 -2306 -2985 -3661 -4079 -4214 -4305 -4535 -4755
9835d755m11n00o01l39k70j2N27N04N6k9l6K35K72L39Q2L66P19O23L20K06J73
$$ -4755 -5166 -5666 -6267 -6606 -6876 -6888 -6361 -5857 -5801 -5830 -5866 -5631 -5359 -5020 -4938 -4572 -3853 -3230 -2910 -2704 -2531
9814b531L75M7P2J02K05j40k93k34j51l31n7k97j02j86m2L9K48L6Kk33l8M46P18
$$ -2531 -2156 -2109 -2037 -1935 -1730 -1870 -2163 -2397 -2548 -2879 -2936 -3233 -3335 -3521 -3563 -3524 -3276 -3240 -3238 -3471 -3509 -3063 -2345
9791b345K98r0o35l36k70q7j12r8o74n55p3K64m11n04J01M60J82J28k8L95M15
$$ -2345 -2047 -2137 -2772 -3108 -3378 -3465 -3577 -3675 -4349 -4904 -4977 -4713 -5124 -5628 -5527 -5067 -4885 -4757 -4785 -4390 -3975
9770c975M39j65m4j14k24j45L09k94m92n43m20qN03K81O07P72P25R6J11l05k52
$$ -3975 -3536 -3701 -3745 -3859 -4083 -4228 -3919 -4213 -4705 -5248 -5668 -5676 -5173 -4892 -4285 -3513 -2788 -2692 -2581 -2886 -3138
9749c138j16l5l2K34P8R3K63M00J51L5j97j89k45l4np1l85k02J51M38o3O0M61
$$ -3138 -3254 -3289 -3321 -3087 -3009 -2916 -2653 -2253 -2102 -2067 -2264 -2453 -2698 -2732 -2737 -2808 -3193 -3395 -3244 -2806 -2869 -2809 -2348
9726b348L98K6J87K73L68J90j84j16m1j97k71mN66L84l71o30k79R2J25o1l10l70
$$ -2348 -1950 -1924 -1737 -1464 -1096 -906 -1090 -1206 -1247 -1444 -1715 -1719 -1153 -769 -1140 -1770 -2049 -1957 -1832 -1893 -2203 -2573
9704b573m87R6N68P73N25K46k28l68o02j6K84r4j90k72m49Q0K81R13P22N2p19
$$ -2573 -3060 -2964 -2396 -1623 -1098 -852 -1080 -1448 -2050 -2066 -1782 -1876 -2066 -2338 -2787 -2707 -2426 -1513 -791 -739 -1458
9683a458q06n78j28k2k2k27K95L55J44mK46K04O22N65K42m19q02j083m62p2J51
$$ -1458 -2264 -2842 -2970 -2992 -3014 -3241 -2946 -2591 -2447 -2451 -2205 -2001 -1379 -814 -572 -991 -1793 -2876 -3338 -3410 -3259
9662c259R8L20K76L01j28j50O6K13k60p9j5J3J6M13K71k8l39l01o57j91j55K61
$$ -3259 -3161 -2841 -2565 -2264 -2392 -2542 -2476 -2263 -2523 -2602 -2617 -2604 -2588 -2175 -1904 -1932 -2271 -2572 -3229 -3420 -3575 -3314
9640c314L69L7r36r46j75O99M01J19J51L51j63K06L8K62M82J82k85m40k76K90
$$ -3314 -2945 -2908 -3844 -4790 -4965 -4266 -3865 -3746 -3595 -3244 -3407 -3201 -3163 -2901 -2419 -2237 -2522 -2962 -3238 -2948
9620b948L31N66j66k40JN49J61k20j98L63M5n19p85l98J96L08M04O46K87K41N31
$$ -2948 -2617 -2051 -2217 -2457 -2456 -1907 -1746 -1966 -2164 -1801 -1756 -2275 -3060 -3458 -3262 -2954 -2550 -1904 -1617 -1376 -845
9599h45N69o2q15p27M9M75O15K23j77n84j001o23l10l42m6k29j93K93N47L48j66
$$ -845 -276 -338 -1153 -1880 -1831 -1356 -741 -518 -695 -1279 -2280 -2903 -3213 -3555 -3601 -3830 -4023 -3730 -3183 -2835 -3001
9578c001j65L10J91R4K2lQ5j90m39l23j05J58N52K80K32N03M60j90l52l52J59
$$ -3001 -3166 -2856 -2665 -2571 -2549 -2552 -2467 -2657 -3096 -3419 -3524 -3366 -2814 -2534 -2302 -1799 -1339 -1529 -1881 -2233 -2074
9557b074p8m78m20L02O29P58L9l08j08j06l05N2q0R1r1J94M1J41M2L08J98j57
$$ -2074 -2152 -2630 -3050 -2748 -2119 -1361 -1322 -1630 -1738 -1844 -2149 -2097 -2177 -2086 -2177 -1983 -1942 -1801 -1759 -1451 -1253 -1410
9535a410n88j97l2K99K42K02m7k90n54l07k56k6r8L59M19P06N04j06p46m65k54
$$ -1410 -1998 -2195 -2227 -1928 -1686 -1484 -1531 -1821 -2375 -2682 -2938 -2964 -3062 -2703 -2284 -1578 -1074 -1180 -1926 -2391 -2645
9514b645K99L90L42J38J34l42op0J5j21Nj47j24k58n7j05K32J71L63L19L05L66
$$ -2645 -2346 -1956 -1614 -1476 -1342 -1684 -1690 -1760 -1745 -1866 -1861 -2008 -2132 -2390 -2447 -2552 -2320 -2149 -1786 -1467 -1162 -796
9492g96K34o56r78o40L3Q4J83k85j8P0N3j01L22k2k57r1M28L17K75Q3M5p9j46
$$ -796 -562 -1218 -2196 -2836 -2803 -2719 -2536 -2821 -2839 -2769 -2716 -2817 -2495 -2517 -2774 -2865 -2437 -2120 -1845 -1762 -1717 -1796 -1942
9469a942n56k20M08O50K26j85j0K13j98k43j19n50o20l39J7J06k99J23K25j15
$$ -1942 -2498 -2718 -2310 -1660 -1434 -1619 -1629 -1416 -1614 -1857 -1976 -2526 -3146 -3485 -3468 -3362 -3661 -3538 -3313 -3428
9449c428j83j63p8j21J12J63k1r8L25M49L02KJ66M58M48M01L47K22O33J245J179
$$ -3428 -3611 -3774 -3852 -3973 -3861 -3698 -3719 -3817 -3492 -3043 -2741 -2739 -2573 -2115 -1667 -1266 -919 -697 -64 1181 2360
9428B360j9q41j116r57j141n45j73R0J46r9m23k72J92N07r1M5K13P44N69K32J77
$$ 2360 2341 1500 384 -573 -1714 -2259 -2432 -2342 -2196 -2295 -2718 -2990 -2798 -2291 -2382 -2337 -2124 -1380 -811 -579 -402
9407d02M60N98Q66J64l51o28n52o12R2J30m2l07P5r5M7q7M80L55o3j80P03N93
$$ -402 58 656 1522 1686 1335 707 155 -457 -365 -235 -277 -584 -509 -604 -557 -644 -164 191 128 -52 651 1244
9385A244j28o71p24r19l81k29R4J75M42K97M27K36M90K25J82j58J11N37J423K003
$$ 1244 1116 445 -279 -1198 -1579 -1808 -1714 -1539 -1097 -800 -373 -137 353 578 760 602 713 1250 2673 4676
9365D676J839P02L15J09l01r56j361j819j468q65n04q28n04j56j0l27l94J0L45
$$ 4676 6515 7217 7532 7641 7340 6384 5023 3204 1736 871 367 -461 -965 -1121 -1131 -1458 -1852 -1842 -1497
9346a497k3j77l37k08j36K13K6K39r3l23m02j84K7L87L83L06J22K22L01N00P55
$$ -1497 -1520 -1697 -2034 -2242 -2378 -2165 -2139 -1900 -1993 -2316 -2718 -2902 -2875 -2488 -2105 -1799 -1677 -1455 -1154 -654 101
9325A01R54J046Q38M1m07n8K06m12p12o76k79k13m05p0o0m30o05m06n46j010r49
$$ 101 1055 2101 2939 2980 2573 2515 2721 2309 1597 921 642 429 24 -46 -106 -536 -1141 -1547 -2093 -3103 -4052
9304d052J06O43N94N9k66LM75N11M66j06n23n83o72k08L26J22N10P07K33q89o78
$$ -4052 -3946 -3303 -2709 -2650 -2916 -2913 -2438 -1927 -1461 -1567 -2090 -2673 -3345 -3553 -3227 -3105 -2595 -1888 -1655 -2544 -3222
9283c222n48l49P1O52Q2j7k04R4n7j7p1p1Q5M83O2K39j14k57J1L54J15J26k65
$$ -3222 -3770 -4119 -4048 -3396 -3314 -3331 -3535 -3441 -3498 -3515 -3586 -3657 -3572 -3089 -3027 -2788 -2902 -3159 -3148 -2794 -2679 -2553 -2818
9260b818j31m08l24m51j53k28m03m70M82N34Q44P50R20O96L22j72K9n48r38n05
$$ -2818 -2949 -3357 -3681 -4132 -4285 -4513 -4916 -5386 -4904 -4370 -3526 -2776 -1856 -1160 -838 -1010 -981 -1529 -2467 -2972
9240b972P07R16J62m36l11m71r9o9J55n1K32j20l08m75k84j99J64n4K29M16J40
$$ -2972 -2265 -1349 -1187 -1623 -1934 -2405 -2504 -2573 -2418 -2469 -2237 -2357 -2665 -3140 -3424 -3623 -3459 -3513 -3284 -2868 -2728
9219b728l41j67l8J43K42M1l2L41M44N35K98L08o04r19q13m26j27p2k81k48j65
$$ -2728 -3069 -3236 -3274 -3131 -2889 -2848 -2880 -2539 -2095 -1560 -1262 -954 -1558 -2477 -3290 -3716 -3843 -3915 -4196 -4444 -4609
9198d609L91L69L33J85K5j64l77k36k09k23j44O4O81J017P88N44L07Q7j04k75
$$ -4609 -4218 -3849 -3516 -3331 -3306 -3470 -3847 -4083 -4292 -4515 -4659 -4595 -3914 -2897 -2109 -1565 -1258 -1171 -1275 -1550
9178a550p7K10j8m34r4N65N16L82K97K35k5k05K5J075J121L96k17o6j03n34m84
$$ -1550 -1627 -1417 -1435 -1869 -1963 -1398 -882 -500 -203 32 7 -198 -173 902 2023 2419 2202 2136 2033 1499 1015
9157A015j03m54p76p10k55l12p9L49J211J181Q05K01j67n70l29m3N32O36L10j83
$$ 1015 912 458 -318 -1028 -1283 -1595 -1674 -1325 -114 1067 1872 2073 1906 1336 1007 964 1496 2132 2442 2259
9137B259J71K2Pj35l68o09n2n1N48K84P75J492J918R70l24j726k045j556o28o31
$$ 2259 2430 2452 2459 2324 1956 1347 1295 1244 1792 2076 2851 4343 6261 7231 6907 5181 3136 1580 952 321
9117C21kk78n67q67l65R3K67J92J85n32k61k19N33M70L92L34N94K99J78l94m27
$$ 321 319 41 -526 -1393 -1758 -1665 -1398 -1206 -1021 -1553 -1814 -2033 -1500 -1030 -638 -304 290 589 767 373 -54
9096e4o05m29n10l89k48j7m63o70n11N14N72L02p1P1J29j31o77l06k29R7K77N02
$$ -54 -659 -1088 -1598 -1987 -2235 -2252 -2715 -3385 -3896 -3382 -2810 -2508 -2579 -2508 -2379 -2510 -3187 -3493 -3722 -3625 -3348 -2846
9074b846J40j98j12m7k38m90m59K26K20K80j91l05k01q4j70j37r0J23K68L28L54
$$ -2846 -2706 -2904 -3016 -3063 -3301 -3791 -4250 -4024 -3804 -3524 -3715 -4020 -4221 -4305 -4475 -4612 -4702 -4579 -4311 -3983 -3629
9053c629N0j13j87j05K71K14%j35j59J86j05Q9K40K42r4j00j34Q3K77K57r1r7
$$ -3629 -3579 -3692 -3879 -3984 -3713 -3499 -3499 -3634 -3793 -3607 -3712 -3623 -3383 -3141 -3235 -3335 -3469 -3386 -3109 -2852 -2943 -3040
9031c040k26k02l8N31L03J17n5K89M17L90L4j60p90l98L40M03K72R0o81m43K8
$$ -3040 -3266 -3468 -3506 -2975 -2672 -2555 -2610 -2321 -1904 -1514 -1480 -1640 -2430 -2828 -2488 -2085 -1813 -1723 -2404 -2847 -2819
9010b819N43L18J94r0l8o82r23p35K03O68R25M17j15o35n62o29k45J94J206Q47
$$ -2819 -2276 -1958 -1764 -1854 -1892 -2574 -3497 -4232 -4029 -3361 -2436 -2019 -2134 -2769 -3331 -3960 -4205 -4011 -2805 -1958
8990a958m1l98j20k05k15n95K15N23J95j92K95J48K42j1k59r02r14o50L11K47
$$ -1958 -1999 -2397 -2517 -2722 -2937 -3532 -3317 -2794 -2599 -2791 -2496 -2348 -2106 -2117 -2376 -3278 -4192 -4842 -4531 -4284
8970d284K32l18j58Q0M34P19J151M02m29j022o59l65L54M79L21K87L55m99k61
$$ -4284 -4052 -4370 -4528 -4448 -4014 -3295 -2144 -1742 -2171 -3193 -3852 -4217 -3863 -3384 -3063 -2776 -2421 -2920 -3181
8951c181k17j6k07j51l92J54J23R9Q1j20l02K18N62O75q5k03j39l29n56n31m40
$$ -3181 -3398 -3414 -3621 -3772 -4164 -4010 -3887 -3788 -3707 -3827 -4129 -3911 -3349 -2674 -2759 -2962 -3101 -3430 -3986 -4517 -4957
8930d957q8l7J20L39M77L22K19L29L65k12o00l21Q5K98K39L2o36o69m85O0N96
$$ -4957 -5045 -5082 -4962 -4623 -4146 -3824 -3605 -3276 -2911 -3123 -3723 -4044 -3959 -3661 -3422 -3390 -4026 -4695 -5180 -5120 -4524
8909d524O91O8J6L5j77n82k25J67K30p3j49j05L89J101J670Q38n28j378o49M13
$$ -4524 -3833 -3765 -3749 -3714 -3891 -4473 -4698 -4531 -4301 -4374 -4523 -4628 -4239 -3138 -1468 -630 -1158 -2536 -3185 -2772
8889b772J337K162K106L22j007k015k192j692K00J197Q72k55j204j360m22L5N91
$$ -2772 -1435 727 2833 3155 2148 133 -2059 -3751 -3551 -2354 -1482 -1737 -2941 -4301 -4723 -4688 -4097
8872d097M63Q45N82o5p21p7l40r71j004m45l36L98Q88J400Q69N96k83p11q91j19
$$ -4097 -3634 -2789 -2207 -2272 -2993 -3070 -3410 -4381 -5385 -5830 -6166 -5768 -4880 -3480 -2611 -2015 -2298 -3009 -3900 -4019
8852d019N08N82j90l95m29M30Q11O69l65q07p39M10K90R7m18M37O78R86Q20K92
$$ -4019 -3511 -2929 -3119 -3514 -3943 -3513 -2702 -2033 -2398 -3205 -3944 -3534 -3244 -3147 -3565 -3128 -2450 -1464 -644 -352
8832c52j234j130j81K69m66j202k195j405L74J703J420Q15K78O09J037O34q55
$$ -352 -1586 -2716 -2897 -2628 -3094 -4296 -6491 -7896 -7522 -5819 -4399 -3584 -3306 -2697 -1660 -1026 -1881
8815a881j714j633l76P00Q18o29j083o58Q04K209J535j106k364o02K118J792k71
$$ -1881 -3595 -5228 -5604 -4904 -4086 -4715 -5798 -6456 -5652 -3443 -1908 -3014 -5378 -5980 -3862 -2070 -2341
8798b341j369j680n92J593J916o3k508l802l166m1K430M74k760j256M728Q352
$$ -2341 -3710 -5390 -5982 -4389 -2473 -2536 -5044 -8846 -12012 -12053 -9623 -9149 -11909 -13165 -8437 -85
8782h5O916M339Q29l373m316n57P112J1283Q675K864l381q154r384o217M47N247
$$ -85 6831 11170 11999 8626 4310 3753 10865 22148 30823 33687 30306 22152 12768 6551 6998 12245
8766A2245M225j04l397p249q387m239Q76L20j897m77K395K096J704J645O7j677
$$ 12245 16470 16366 12969 5720 -2667 -6906 -6030 -5710 -7607 -8084 -5689 -3593 -1889 -244 -177 -1854
8750a854o04R35J075J58p80k200p17J862J967p35k054j220M40N85L20o73q13k13
$$ -1854 -2458 -1523 -448 -290 -1070 -3270 -3987 -2125 -158 -893 -2947 -4167 -3727 -3142 -2822 -3495 -4308 -4521
8732d521J061J671R55r43j451n76O94O09q4j461j273m86Q27J035Q85P5Q52J437
$$ -4521 -3460 -1789 -834 -1777 -3228 -3804 -3110 -2501 -2585 -4046 -5319 -5805 -4978 -3943 -3058 -2983 -2131 -694
8714f94J297n0j237k343k321j512j33J84M1K87K006K401J891R77j33r29n03m13
$$ -694 603 553 -684 -3027 -5348 -6860 -6993 -6809 -6768 -6481 -4475 -2074 -183 794 661 -268 -771 -1184
8696a184N28J407J565N38l34p07j21k61o69p90o71j072k46P53J593R22Q22K168
$$ -1184 -656 751 2316 2854 2520 1813 1692 1431 762 -28 -699 -1771 -2017 -1264 329 1251 2073 4241
8678D241K815P80j048j919k670l358k277l38Q9r60j256n13Q43R02K80j113l242
$$ 4241 7056 7836 6788 4869 2199 -1159 -3436 -3774 -3685 -4645 -5901 -6414 -5571 -4669 -4389 -5502 -8744
8661h744m146o86K124K703J958J94j388j479J62J995K501M50j880j904k76J229
$$ -8744 -12890 -13576 -11452 -8749 -6791 -6597 -7985 -9464 -9302 -7307 -4806 -4356 -6236 -8140 -8416 -7187
8645g187K694K408O63o71j04J664K781J966j75k397k675j575k17n3K8k82n19l46
$$ -7187 -4493 -2085 -1422 -2093 -2197 -533 2248 4214 4039 1642 -1033 -2608 -2825 -2878 -2850 -3132 -3651 -3997
8627c997L69L34mo97j5J052J987J288K08j35O75N72M14j58j127j800j481o96M09
$$ -3997 -3628 -3294 -3298 -3995 -4010 -2958 -971 317 525 390 1065 1637 2051 1893 766 -1034 -2515 -3211 -2802
8608b802K15J52n70o76m49L16J04N13J28P7R8P00Q80J295K36m38o39m07o06p0
$$ -2802 -2587 -2435 -3005 -3681 -4130 -3814 -3710 -3197 -3069 -2992 -2894 -2194 -1314 -19 217 -221 -860 -1267 -1873 -1943
8588a943kJ07j84k62m57K82K76j78n88J87J59n9l48M38N73J44k10K99j73m90l43
$$ -1943 -1945 -1838 -2022 -2284 -2741 -2459 -2183 -2361 -2949 -2762 -2603 -2662 -3010 -2572 -1999 -1855 -2065 -1766 -1939 -2429 -2772
8567b772Q42J109O50n46l37o97j194j302n50j39N72N96N70J08o34j065k16M07
$$ -2772 -1930 -821 -171 -717 -1054 -1751 -2945 -4247 -4797 -4936 -4364 -3768 -3198 -3090 -3724 -4789 -5005 -4598
8549d598P63Q04L76j74k06O5O98K81r6J07L89k79q70j586j930r13O96J111R60
$$ -4598 -3835 -3031 -2655 -2829 -3035 -2970 -2272 -1991 -2087 -1980 -1591 -1870 -2740 -4326 -6256 -7169 -6473 -5362 -4402
8530d402L52j53j85M3N44R97K21o67q06l39L7N93Q98O20P8p19p97l52L1k46l58
$$ -4402 -4050 -4203 -4388 -4345 -3801 -2804 -2583 -3250 -4056 -4395 -4358 -3765 -2867 -2247 -2169 -2888 -3685 -4037 -4006 -4252 -4610
8509d610m16J2L17M37P2J08K52J43n80l03J50K93n9J26J60Q22O30K8n26k24m8
$$ -4610 -5026 -5014 -4697 -4260 -4188 -4080 -3828 -3685 -4265 -4568 -4418 -4125 -4184 -4058 -3898 -3076 -2446 -2418 -2944 -3168 -3216
8488c216N7N1L53j52k20l19k5p7K43k36J16k8N98R18O38j93k14l87n79p93n06
$$ -3216 -3159 -3108 -2755 -2907 -3127 -3446 -3471 -3548 -3305 -3541 -3425 -3453 -2855 -1937 -1299 -1492 -1706 -2093 -2672 -3465 -3971
8467c971n77j65j14K50j99j25l49o02m93O06M97L55M7L73J98Q74J683J695K28
$$ -3971 -4548 -4713 -4827 -4577 -4776 -4901 -5250 -5852 -6345 -5739 -5242 -4887 -4840 -4467 -4269 -3395 -1712 -17 211
8448B11m08r02n97l69J30o25p95n89m05p15l22NP09P61O59L98M93m3P4j41L41
$$ 211 -197 -1099 -1696 -2065 -1935 -2560 -3355 -3944 -4349 -5064 -5386 -5381 -4672 -3911 -3252 -2854 -2361 -2404 -2330 -2471 -2130
8427b130J10j80q49p52n58K17K99J45m87l26k48J33m41j41P78P95l72m08J62N76
$$ -2130 -2020 -2200 -3049 -3801 -4359 -4142 -3843 -3698 -4185 -4511 -4759 -4626 -5067 -5208 -4430 -3635 -4007 -4415 -4253 -3677
8407c677L41K22J40Q0M14M96N77N1o41o88q50l53N54O98J34l86m13m56j221o50
$$ -3677 -3336 -3114 -2974 -2894 -2480 -1984 -1407 -1356 -1997 -2685 -3535 -3888 -3334 -2636 -2502 -2888 -3301 -3757 -4978 -5628
8387e628L29K31K87J12K26K91L83N74R64N74j20m49l61p41m74o71n48k13j03l15
$$ -5628 -5299 -5068 -4781 -4669 -4443 -4152 -3769 -3195 -2231 -1657 -1777 -2226 -2587 -3328 -3802 -4473 -5021 -5234 -5337 -5652
8367e652j85J41L31K88J025M71k29p11j33J47N84O8K98J09P69L47l58j110m85
$$ -5652 -5837 -5696 -5365 -5077 -4052 -3581 -3810 -4521 -4654 -4507 -3923 -3855 -3557 -3448 -2679 -2332 -2690 -3800 -4285
8348d285j89J74j3L83M51O72o8J1k84L46K93O83j64o87m19k65q07l15j31O96K88
$$ -4285 -4474 -4300 -4313 -3930 -3479 -2807 -2875 -2864 -3148 -2802 -2509 -1826 -1990 -2677 -3096 -3361 -4168 -4483 -4614 -3918 -3630
8327c630L8r9m7p17k26L63J260P53K70l55L73J77M2l12m87m51J4k43N32O20L63
$$ -3630 -3592 -3691 -3738 -4455 -4681 -4318 -3058 -2305 -2035 -2390 -2017 -1840 -1798 -2110 -2597 -3048 -3034 -3277 -2745 -2125 -1762
8306a762j26l17o88k01N95Q79j45k5N01J578J147j51q75n76l49P94J107J46r13
$$ -1762 -1888 -2205 -2893 -3094 -2499 -1620 -1765 -1790 -1289 289 1436 1285 410 -166 -515 279 1386 1532 619
8287F19j337q74k30q88m90J74Q95P84l01q95o14on23o11M88Q33K93j52k3L63o34
$$ 619 -718 -1592 -1822 -2710 -3200 -3026 -2131 -1347 -1648 -2543 -3157 -3163 -3686 -4297 -3809 -2976 -2683 -2835 -2858 -2495 -3129
8266c129l33j19k73o72j1M14L17J14M90j22j40k98l75j09O39L37K84m10N05N4
$$ -3129 -3462 -3581 -3854 -4526 -4537 -4123 -3806 -3692 -3202 -3324 -3464 -3762 -4137 -4246 -3607 -3270 -2986 -3396 -2891 -2837
8246b837k99q83K46O55R57m81q59p19J81n58J78K90R19N70J040L62j26j865P1
$$ -2837 -3136 -4019 -3773 -3118 -2161 -2642 -3501 -4220 -4039 -4597 -4419 -4129 -3210 -2640 -1600 -1238 -1364 -3229 -3158
8227c158N53J109n30o30j511l67O24J440P31J313rj221j707K71J091J529p78k60
$$ -3158 -2605 -1496 -2026 -2656 -4167 -4534 -3910 -2470 -1739 -426 -435 -1656 -3363 -3092 -2001 -472 -1250 -1510
8209a510j232M03j223p09j474j142m974m836l731j385l570n673j0873j5392l6534
$$ -1510 -2742 -2339 -3562 -4271 -5745 -6887 -11861 -16697 -20428 -21813 -25383 -31056 -41929 -57321 -93855
8194i3855p5653j61718j23520J29700J55595P2363L5674J9454J4600Q007M962
$$ -93855 -169508 -331226 -454746 -325046 -169451 -97088 -61414 -41960 -27360 -19353 -14391
8183a4391K292L830K583J611j639k246k343L17L21K402K822K162L47N77Q2M23
$$ -14391 -12099 -8269 -5686 -4075 -5714 -7960 -10303 -9986 -9665 -7263 -4441 -2279 -1932 -1355 -1273 -850
8167h50r73k39Q1J238o76k39q7J397p5N4o26m57j809l96L25R06L0R05J19L3j028
$$ -850 -1823 -2062 -1981 -743 -1419 -1658 -1745 -348 -423 -369 -995 -1452 -3261 -3657 -3332 -2426 -2396 -1491 -1372 -1339 -2367
8146b367p66r78L53L94O12l57j00L28J398J112J353l10Q92J135J503M43O07J098
$$ -2367 -3133 -4111 -3758 -3364 -2752 -3109 -3209 -2881 -1483 -371 982 672 1564 2699 4202 4645 5252 6350
8128F350K755L042L895M849O811P810J0507J2082J1884O260r12l512n99K352J441
$$ 6350 9105 12147 16042 20891 27702 35512 46019 58101 69985 76245 75333 71821 71222 73574 75015
8113G5015o524j2836j2635q416o264m493l341k917k816k144k327k609j800j350
$$ 75015 68491 55655 43020 34604 28340 23847 20506 17589 14773 12629 10302 7693 5893 4543
8099D543j231n97q49j83K2m49q02n5M17K43L70j35m31j28m41o24j98q9k18p03
$$ 4543 3312 2715 1866 1683 1705 1256 454 399 816 1059 1429 1294 863 735 294 -330 -528 -617 -835 -1538
8079a538j48J32M29M48l2l67N66Q1p62j81N35L12K26k15J88l70j51p08n78n66
$$ -1538 -1686 -1554 -1125 -677 -709 -1076 -510 -429 -1191 -1372 -837 -525 -299 -514 -326 -696 -847 -1555 -2133 -2699
8059b699m35k90Q02K57k06r18L25J70L12J028J304O00J10j087n86m61J66n85K19
$$ -2699 -3134 -3424 -2622 -2365 -2571 -3489 -3164 -2994 -2682 -1654 -350 250 360 -727 -1313 -1774 -1608 -2193 -1974
8040a974L00j08n69K42k66P3K00L82l68L19K10r6q11j38N6K95j55Lm13Q87M70
$$ -1974 -1674 -1782 -2351 -2109 -2375 -2302 -2102 -1720 -2088 -1769 -1559 -1655 -2466 -2604 -2548 -2253 -2408 -2405 -2818 -1931 -1461
8019a461r7p54j09j78K38j94n6R6M06N8J18j82K40l97j55j31N35j14j80k54M18
$$ -1461 -1558 -2312 -2421 -2599 -2361 -2555 -2611 -2515 -2109 -2051 -1933 -2115 -1875 -2272 -2427 -2558 -2023 -2137 -2317 -2571 -2153
7998b153J9L81L72L91n16o05j82K85n06j064o37K04O77J052Q37M33J86J22n32
$$ -2153 -2134 -1753 -1381 -990 -1506 -2111 -2293 -2008 -2514 -3578 -4215 -4011 -3334 -2282 -1445 -1012 -826 -704 -1236
7979a236n14l83J26P62P23j47l07m61o82o17j75P6J84Q3j43k19M9O67O80Q7nj91
$$ -1236 -1750 -2133 -2007 -1245 -522 -669 -976 -1437 -2119 -2736 -2911 -2835 -2651 -2568 -2711 -2930 -2881 -2214 -1534 -1447 -1452 -1643
7957a643j73M14L31O25N90K10m09l28j88M06K13J08p0R3l09l63q85o38p03j18
$$ -1643 -1816 -1402 -1071 -446 144 354 -55 -383 -571 -165 48 156 86 179 -130 -493 -1378 -2016 -2719 -2837
7937b837J37M09K17N03K47N86K1J65l84k49k83J64J79Q60N22M24j94j53j79ko02
$$ -2837 -2700 -2291 -2074 -1571 -1324 -738 -717 -552 -936 -1185 -1468 -1304 -1125 -265 257 681 487 334 155 153 -449
7916d49j05L1M39l58J88L56L9p87JQ0O04O9M20k41k61o46N48N53P53o6k58j96
$$ -449 -554 -523 -84 -442 -254 102 141 -646 -645 -565 39 108 528 287 26 -620 -72 481 1234 1168 910 714
7894G14L72j51K45j74M34M61O07n12q70n90R58J384J937J601J175J10K01J73R92
$$ 714 1086 935 1180 1006 1440 1901 2508 1996 1126 536 1494 2878 4815 6416 7591 7701 7902 8075 9067
7875I067J23n21q66jJ00j01q06j35N35P81k77m37l88j93r77j357j661j464r28
$$ 9067 9190 8669 7803 7802 7902 7801 6995 6860 7395 8176 7899 7462 7074 6881 5904 4547 2886 1422 494
7856D94m84k03O64N04K82k00l24l20o6L02N30k30n58l22%j02QK10M21M05J22j62
$$ 494 10 -193 471 975 1257 1057 733 413 347 649 1179 949 391 69 69 -33 -25 185 606 1011 1133 971
7834I71j36j09k31J3J22jj65o7j68J68N0M87O3k00k83l0l84o44r19o63l81O12
$$ 971 835 726 495 508 630 629 464 397 229 397 447 934 997 797 514 484 100 -544 -1463 -2126 -2507 -1895
7812a895P11N48K7J14O3O20K13L33l81j000r16K61K26O72K18P02J97K55l67k15
$$ -1895 -1184 -636 -609 -495 -432 188 401 734 353 -647 -1563 -1302 -1076 -404 -186 516 713 968 601 386
7792C86M9L84k82J20m03J45J20N5q59n99o32m7K02R78J23P1n21K43J63L92J55
$$ 386 435 819 537 657 254 399 519 574 -285 -884 -1516 -1563 -1361 -383 -260 -189 -710 -467 -304 88 243
7771B43Q41P4J90k26L81J4K48n9J62m23j44o36m81l81K85L27Q02J68J68n96j13
$$ 243 1084 1158 1348 1122 1503 1517 1765 1706 1868 1445 1301 665 184 -197 88 415 1217 1385 1553 957 844
7750H44J1L50J20J90n14j35j25M97Q15J002M8K38m25l75k99k18j31N97K21J59
$$ 844 855 1205 1325 1515 1001 866 741 1238 2053 3055 3103 3341 2916 2541 2242 2024 1893 2490 2711 2870
7730B870k5K04J2nJ50R78K61k266k368j31N45N37O09J463J294P80k99n47n46n25
$$ 2870 2845 3049 3061 3056 3206 4184 4445 2179 -189 -320 225 762 1371 2834 4128 4908 4609 4062 3516 2991
7710B991m47N7O89J024M63M4L36M64K26M28Q59J096J500J915K433K448L030L849
$$ 2991 2544 2601 3290 4314 4777 4821 5157 5621 5847 6275 7134 8230 9730 11645 14078 16526 19556 23405
7692B3405M737N733Q877J2864J5005Q130o601j5077j2972q814n167l024j601j162
$$ 23405 28142 33875 42752 55616 70621 78751 72150 57073 44101 35287 30120 27096 25495 24333
7678B4333m22J37J895K907M288O110J0431J3105J2095K999r026j4568j1788q283
$$ 24333 23911 24048 25943 28850 33138 39248 49679 62784 74879 77878 68852 54284 42496 34213
7664C4213n387m427k970k464j403j444j062j863j527j544q49r00o48j169l15M4
$$ 34213 28826 24399 21429 18965 17562 16118 15056 13193 11666 10122 9273 8373 7725 6556 6241 6285
7648F285N88oJ03k16L35k12J16k55J76J04K35n85J32j10K32k62k46q61N0N4K80
$$ 6285 6873 6867 6970 6754 7089 6877 6993 6738 6914 7018 7253 6668 6800 6690 6922 6660 6414 5553 5603 5657 5937
7627E937j46N2m62O50M84P94J37J27o90o1k20M79M19J36m69K94K35P07N02M96
$$ 5937 5791 5843 5381 6031 6515 7309 7446 7573 6883 6822 6602 7081 7500 7636 7167 7461 7696 8403 8905 9401
7607I401m91l14l36K11K9M99K93P77N24J112J397K053J958J987K194L278M039
$$ 9401 8910 8596 8260 8471 8500 8999 9292 10069 10593 11705 13102 15155 17113 19100 21294 24572 28611
7590B8611N089N353N016M569M720N842J0660J8728K7307K8404J3697r918k6130
$$ 28611 33700 39053 44069 48638 53358 59200 69860 88588 115895 144299 157996 148078 121948
7577A21948k7758k0548j3839r599o774n329m601l221j861j884k142j874j842k241
$$ 121948 94190 73642 59803 50204 43430 38101 33500 30279 28418 26534 24392 22518 20676 18435
7563A8435k028j552n73l43l82k84J04J44M44n3k76n55j98j99j25k76N55L90O58
$$ 18435 16407 14855 14282 13939 13557 13273 13377 13521 13965 13912 13636 13081 12883 12684 12559 12283 12838 13228 13886
7544A3886j80q40j179m01n12j14l32n8o54k04q4L12k97p7m10r5p45J9J08M87k40
$$ 13886 13706 12866 11687 11286 10774 10660 10328 10270 9616 9412 9328 9640 9343 9266 8856 8761 8016 8035 8143 8630 8390
7523H390L99o3nj078o60l54J31q98r9l49P13O71O25o30j70m50O06L35L08p90O9
$$ 8390 8789 8726 8721 7643 6983 6629 6760 5862 5763 5414 6127 6798 7423 6793 6623 6173 6779 7114 7422 6632 6701
7502F701K67O77m19L69J72L04K39J291R3l62j027j74n4K13L4O65l34l23q54J2
$$ 6701 6968 7645 7226 7595 7767 8071 8310 9601 9694 9332 8305 8131 8077 8290 8324 8989 8655 8332 7478 7490
7482G490l5K9o05k04k96O04K55O51Q95J078J26q3m14J18k07j37k91K23l73m67
$$ 7490 7455 7484 6879 6675 6379 6983 7238 7889 8784 9862 9988 9905 9491 9609 9402 9265 8974 9197 8824 8357
7462H357m17L03k2J18L73Q23L82M07l19o68m86K48J75L3P5j88lJ44j11j51k2L68
$$ 8357 7940 8243 8221 8339 8712 9535 9917 10324 10005 9337 8851 9099 9274 9307 9382 9194 9191 9335 9224 9073 9051 9419
7440I419K65J43L24L39J89j90j0K07R4m29o35q12k1L24M91l1Nl65o2K19N82j29
$$ 9419 9684 9827 10151 10490 10679 10489 10479 10686 10780 10351 9716 8904 8883 9207 9698 9667 9672 9307 9245 9464 10046 9917
7418I917m93p39J39J34K69K04J327J170L7j080j07j73N23J29N46L55N11n78m1
$$ 9917 9424 8685 8824 8958 9227 9431 10758 11928 11965 10885 10778 10605 11128 11257 11803 12158 12669 12091 12050
7399A2050l97K49JP83L07O53j7M00o2L08j82M62J83O30n77J68Q3P29l8N99N70
$$ 12050 11653 11902 11903 12686 12993 13646 13629 14029 13967 14275 14093 14555 14738 15368 14791 14959 15042 15771 15733 16332 16902
7378A6902J234K66M84n18k48l79O72P3P89R02J920Q79J055M21J182Q89J656J217
$$ 16902 18136 18402 18886 18368 18120 17741 18413 18486 19275 20177 22097 22976 24031 24452 25634 26523 28179 29396
7360B9396J869J954L031K554L391L645M855M434N645O786R441J1662J5884K0364
$$ 29396 31265 33219 36250 38804 42195 45840 50695 55129 60774 67560 77001 88663 104547 124911
7346A24911K7270L2876L9014M8219O3406P7418Q7953J09549J66197K50743L18600
$$ 124911 152181 185057 224071 272290 335696 413114 501067 610616 776813 1027556 1346156
7335A346156K76195O0725j99390l17817k84046k03188j38496r4546o7895n2096
$$ 1346156 1622351 1683076 1483686 1165869 881823 678635 540139 445593 377698 325602
7325C25602m3275l5744k9659k4430k0927j6291j2611j0051j0047j0266q272m804
$$ 325602 282327 246583 216924 192494 171567 155276 142665 132614 122567 112301 104029 99225
7313I9225l250k947m118n804p583q578p669n833m204l156k454k262j996k103j644
$$ 99225 95975 93028 88910 83106 75523 66945 59276 53443 49239 46083 43629 41367 39371 37268 35624
7298C5624j108r32j438j456j203o23p25l49n60p25j081o00o57k97q59n34j49L10
$$ 35624 34516 33584 32146 30690 29487 28864 28139 27790 27230 26505 25424 24824 24167 23870 23011 22477 22328 22638
7280B2638p68n69n53K77j65k38p79k84r24r4k16k06l47P66m8O36J0J99l91L56
$$ 22638 21870 21301 20748 21025 20860 20622 19843 19559 18635 18541 18325 18119 17772 18538 18490 19126 19136 19335 18944 19300
7260A9300o7l9o19M64l7P67N2M18p19m41o06M53m75j14n61K86p08K22L42J130
$$ 19300 19233 19194 18575 19039 19002 19769 19821 20239 19520 19079 18473 18926 18451 18337 17776 18062 17354 17576 17918 19048
7240A9048K07J088L19N93n48K80K54O84j64Q75J036K421K154L280L298N276O631
$$ 19048 19255 20343 20662 21255 20707 20987 21241 21925 21761 22636 23672 26093 28247 31527 34825 40101 46732
7223D6732Q456N358j492q091p657n760l143k348j054j362q5L12J312R49J586J191
$$ 46732 55188 60546 59054 50963 43306 37546 34403 32055 31001 29639 29554 29866 31178 32127 33713 34904
7207C4904K543L135M081M033O377Q920J1450J0195M699j888m225o236n516k662
$$ 34904 37447 40582 44663 48696 55073 63993 75443 85638 90337 88449 84224 77988 72472 69810
7193F9810J652K576J61j955l405o917q201o783m519l570k939k912k371j846p27
$$ 69810 71462 74038 74199 72244 68839 61922 53721 46938 42419 38849 35910 32998 30627 28781 28054
7178B8054k71j38k64l23j8K9m9l36k85j46K53N13J005R91J118M45J77j29n31j726
$$ 28054 27783 27645 27381 27058 27040 27069 27020 26684 26399 26253 26506 27019 28024 29015 30133 30578 30755 30626 30095 28369
7158B8369j803j509n23l66J06k31M60M0K88q8K90n12m43p66K07j34O84L47P87
$$ 28369 26566 25057 24534 24168 24274 24043 24503 24543 24831 24743 25033 24521 24078 23312 23519 23385 24069 24416 25203
7139B5203J23N30l71Pp78L48j53N20J3K6j202nj38Q59j91N90J01J008K76Q17j99
$$ 25203 25326 25856 25485 25492 24714 25062 24909 25429 25442 25468 24266 24261 24123 24982 24791 25381 25482 26490 26766 27583 27384
7118B7384M92p51l56j527m78l07Q78J38R46o5N57m16L43n50Q00K46Q72q4J079
$$ 27384 27876 27125 26769 25242 24764 24457 25335 25473 26419 26354 26911 26495 26838 26288 27088 27334 28206 28122 29201
7099B9201R24K093J492K221N54R2j732j258k165j297j483k54o76J73o12j34o69
$$ 29201 30125 32218 33710 35931 36485 36577 34845 33587 31422 30125 28642 28388 27712 27885 27273 27139 26470
7082B6470O81M58J137N99J270O24J654J595J986l62j298j784n16j035o02j219
$$ 26470 27151 27609 28746 29345 30615 31239 32893 34488 36474 36112 34814 33030 32514 31479 30877 29658
7066B9658q85j068J73J33Q03O43L07r60o59m30J75j26q3j69K90K09O72M76P2m97
$$ 29658 28773 27705 27878 28011 28814 29457 29764 28804 28145 27715 27890 27764 27681 27512 27802 28011 28683 29159 29231 28734
7046B8734j00r0L8j27j22J53K45j66l64J89N47R16N42M58O7K2n02k60q8M69m6
$$ 28734 28634 28544 28582 28455 28333 28486 28731 28565 28201 28390 28937 29853 30395 30853 30920 30942 30440 30180 30092 30561 30515
7025C0515M4m84M41M22Q08J25M27j88k59r11k73n52O14r7O06J7N48k23N15l24
$$ 30515 30559 30075 30516 30938 31746 31871 32298 32110 31851 30940 30667 30115 30729 30632 31238 31255 31803 31580 32095 31771
7005C1771L70k17M28n57L50k53M90p29N41j32N73n51R08M53J165J29Q52p30J14
$$ 31771 32141 31924 32352 31795 32145 31892 32382 31653 32194 32062 32635 32084 32992 33445 34610 34739 35591 34861 34975
6986C4975l57Q32j013l29r64O58k79Q31k81Q71o71L77J8J280k27L55p43L35p42
$$ 34975 34618 35450 34437 34108 33144 33802 33523 34354 34073 34944 34273 34650 34668 35948 35721 36076 35333 35668 34926
6967C4926Q29k38R56K04R97k76J146j92K65o51N17o36L74j01J416o8M04l72P68
$$ 34926 35755 35517 36473 36677 37674 37398 38544 38352 38617 37966 38483 37847 38221 38120 39536 39468 39872 39500 40268
6948D0268k35Q95K0J111L28M26q55jq35M35L47J556Q79J115O99J851J412J883
$$ 40268 40033 40928 40948 42059 42387 42813 41958 41957 41122 41557 41904 43460 44339 45454 46153 48004 49416 51299
6930E1299J87k3p47n1J04J130L45K6n61j4q86m11j20Q45J354J937J966K633K975
$$ 51299 51486 51463 50716 50665 50769 51899 52244 52270 51709 51695 50809 50398 50278 51123 52477 54414 56380 59013 61988
6911F1988L309K089o02k176j465L10J826J896k68k942l442j920p58L85N59J226
$$ 61988 65297 67386 66784 64608 63143 63453 65279 67175 66907 63965 60523 58603 57845 58230 58789 60015
6895F0015N31L63K21K519L265L707J309q35k251l50M44K164J156m18l649k886
$$ 60015 60546 60909 61130 63649 66914 70621 71930 71095 68844 68494 68938 71102 72258 71840 68191 65305
6879F5305k448n59j119J36l74Q91M0J514N11J988J101J863k91M16l69J538L83
$$ 65305 62857 62298 61179 61315 60941 61832 61872 63386 63897 65885 66986 68849 68558 68974 68605 70143 70526
6862G0526J322r93j9o04J501L42J765k91O50o82Q75n15Q58n53Q55j107J46j155
$$ 70526 71848 70855 70836 70232 71733 72075 73840 73549 74199 73517 74392 73877 74735 74182 75037 73930 74076 72921
6844G2921P07j171K03j281J241j5J284q97L35q10J557Q5K038Q16K099j92Q31k87
$$ 72921 73628 72457 72660 71379 72620 72605 73889 72992 73327 72517 74074 74159 76197 77013 79112 78920 79751 79464
6826G9464J842M16K380J480L216J525K880J258K868J656L783L374N703M933O497
$$ 79464 81306 81722 84102 85582 88798 90323 93203 94461 97329 98985 102768 106142 111845 116778 123275
6811A23275N833Q878J0319J4920J7534K3584K8644L5023L9190N0946O6970Q4619
$$ 123275 129108 137986 148305 163225 180759 204343 232987 268010 307200 358146 425116 509735
6799E09735R3083J13490J68530K54095L27928L07796J10465j29494k18989j39133
$$ 509735 602818 716308 884838 1138933 1466861 1774657 1885122 1755628 1536639 1397506
6789A397506P838J47639K19925J25196j26122l13423l21436k36501j60606j11064
$$ 1397506 1405344 1552983 1772908 1898104 1771982 1458559 1137123 900622 740016 628952
6779F28952q2346o4890n4758m5871l6816k9269k5054k2960k0652j8219j4614j1699
$$ 628952 546606 481716 426958 381087 344271 315002 289948 266988 246336 228117 213503 201804
6767B01804r037p814p046p442o167n967m184m030k437k850k375l447k033l150
$$ 201804 192767 184953 177907 170465 164298 158331 154147 150117 147680 144830 142455 139008 136975 133825
6753A33825j274j713qj027M85j088q8j813L12l20K114k0J727K73K542J206L867
$$ 133825 132551 130838 130830 129803 130288 129200 129112 127299 127611 127291 129405 129385 131112 131385 133927 135133 139000
6736A39000K005M219J908M153J574L746O00J738j731M76j527K251L21K089k572
$$ 139000 141005 145224 147132 151285 152859 156605 157205 158943 157212 157688 156161 158412 158733 160822 158250
6721A58250j447m609j08r59L203K26K205k090M89k188J893k29L364o15J874j156
$$ 158250 156803 152194 152086 151127 154330 154556 156761 154671 155160 152972 154865 154636 158000 157385 159259 158103
6705A58103L238J151N037R20K820q75L473J984O801L240O347K820N430J938O327
$$ 158103 161341 162492 167529 168449 171269 170394 173867 175851 182652 185892 192239 195059 200489 202427 208754
6690B08754M516R545P326J1750J0037J5834J6246K2614J7452J2437R8R16L542
$$ 208754 213270 222815 230141 241891 251928 267762 284008 306622 324074 336511 336609 337525 341067
6677C41067J6271K1931K7360J5141r27j9541j9598j4608N06Q828J5408P957j92
$$ 341067 357338 379269 406629 421770 420843 401302 381704 367096 367602 376430 391838 399795 399603
6664C99603j0894q988o211J572L546O509L518M308K636O542Q200J2433J3003J5049
$$ 399603 388709 379721 373510 375082 378628 385137 388655 392963 395599 402141 410341 422774 435777 450826
6650D50826J3652J4833J3652J1987P767N996O489J1252J6867K0868K1947K0659
$$ 450826 464478 479311 492963 504950 512717 518713 525202 536454 553321 574189 596136 616795
6638F16795K1268K4204L0648L6056M4102N0421O0028O4398P4437R6249J38005
$$ 616795 638063 662267 692915 728971 773073 823494 883522 947920 1022357 1118606 1256611
6627A256611J72058J72644R4860q401o3419l6659K1213Q9036J24475J04041K825
$$ 1256611 1428669 1601313 1696173 1687772 1624353 1587694 1608907 1697943 1822418 1926459 1929284
6616A929284p9985j00041o0923k8466O684K1408M2778M5975O0603N8122P0930
$$ 1929284 1849299 1749258 1688335 1659869 1666553 1687961 1730739 1776714 1837317 1895439 1966369
6605A966369O9805Q8931R2861J18225J25786J53207J58320J83159J80459K02724
$$ 1966369 2036174 2125105 2217966 2336191 2461977 2615184 2773504 2956663 3137122 3339846
6595C339846K09181K52505K70375L12696L25291L82281M19976N01236N55746O57157
$$ 3339846 3549027 3801532 4071907 4384603 4709894 5092175 5512151 6013387 6569133 7226290
6585G226290P36266Q96368J057384J305965J554312J958059K463489L238942M175347
$$ 7226290 7962556 8858924 9916308 11222273 12776585 14734644 17198133 20437075 24612422
6576B4612422N264410O043939P154017R263054J2346367J4747014J6189665K0929507
$$ 24612422 29876832 35920771 43074788 52337842 64684209 79431223 95620888 116550395
6568A16550395L2708924M7831657N8372730M6062597N309849l1234068l6835290
$$ 116550395 149259319 197090976 255463706 301526303 306836152 275602084 238766794
6561B38766794j7674516Q585764L1068319L7857637J1791605l3069223n7513013
$$ 238766794 221092278 229678042 260746361 298603998 310395603 277326380 219813367
6554B19813367n2227785l6865701k5005870j7382802j2953941j0346715q808953
$$ 219813367 167585582 130719881 105714011 88331209 75377268 65030553 56221600
6547E6221600p317900n969753m985297m376117l818755l315044k801459k398426
$$ 56221600 48903700 42933947 37948650 33572533 29753778 26438734 23637275 21238849
6539B1238849k044118j792488j546749j375868j218543j094851r50963q44680
$$ 21238849 19194731 17402243 15855494 14479626 13261083 12166232 11215269 10370589
6531A0370589p40811o82758o17038n66806n04324m71668m31232m01168l60108
$$ 10370589 9629778 8947020 8329982 7763176 7258852 6787184 6355952 5954784 5594676
6522E594676l34458l02594k87396k71334k64345k41657k19830j94722j82150j69463
$$ 5594676 5260218 4957624 4670228 4398894 4134549 3892892 3673062 3478340 3296190 3126727
6512C126727j62103j50331j43167j36147j31475j22033j11203r9175r0576q5744
$$ 3126727 2964624 2814293 2671126 2534979 2403504 2281471 2170268 2071093 1980517 1894773
6502A894773q2416p8893p2061o5758o0124o0320n9780n9827n3731n0697m6389
$$ 1894773 1812357 1733464 1661403 1595645 1535521 1475201 1415421 1355594 1301863 1251166 1204777
6491A204777m6806m2370m0986l4055l3667l1909l7716l6463l6515k8255k5882
$$ 1204777 1157971 1115601 1074615 1040560 1006893 974984 937268 900805 864290 836035 810153
6480H10153j9033k1182j8726k4518k2724k5847j8835j8296j4688j9958j5541j7501
$$ 810153 791120 769938 751212 726694 703970 678123 659288 640992 626304 606346 590805 573304
6468E73304j2022j4123q320j1375o572q927l558q229o154j2348j0252j6041j2025
$$ 573304 561282 547159 538839 527464 520892 511965 508407 500178 494024 481676 471424 455383 443358
6455D43358j3969o454q716m841r765p053j2082o694q294l005p264m105r042n752
$$ 443358 429389 422935 414219 409378 399613 392560 380478 373784 365490 362485 355221 351116 342074 336322
6441C36322r690m524p127k761o377j802m545J98l373q30n374j812n221j461m201
$$ 336322 326632 322108 314981 312220 305843 304041 299496 299694 296321 295491 290117 288305 283084 281623 277422
6426B77422p91m753k051o122k900n056j917n206j713m116r29l883r54l483o01
$$ 277422 276631 271878 269827 263705 260805 255749 253832 248626 246913 242797 241868 237985 237031 233548 232947
6411B32947k975m4k845j894n196l117n049k402m083k587n688m028m829j193j131
$$ 232947 229972 229928 227083 225189 219993 216876 211827 209425 205342 202755 197067 193039 188210 187017 185886
6396A85886J102j268j196l836k053j968j70k439k511l512k213k063J64J66J23
$$ 185886 186988 185720 184524 180688 178635 176667 176497 174058 171547 168035 165822 163759 163923 164089 164212
6381A64212j983j661j144k31j256j946k210j357j169j109j014j285j224j009n77
$$ 164212 162229 160568 159424 159193 157937 155991 153781 152424 151255 150146 149132 147847 146623 145614 145037
6366A45037q82r52q74P73L80M01n36m27j033M73O81K317J895K620R59K205K102
$$ 145037 144155 143203 142329 143102 143482 143883 143347 142920 141887 142360 143041 145358 147253 149873 150832 153037 155139
6349A55139M825N543Q517R021J2401J4009J9567K4026L1502L5224M5402N8342
$$ 155139 159964 165507 174024 183045 195446 209455 229022 253048 284550 319774 365176 423518
6337D23518P7528Q7041J01862J43439K23577L04493L27488J81544o5647k11115
$$ 423518 501046 588087 689949 833388 1056965 1361458 1688946 1870490 1804843 1593728
6327A593728j73555m0172J06122K05160J74001m4565k70446l32110k61900j82122
$$ 1593728 1420173 1380001 1486123 1691283 1865284 1820719 1550273 1218163 956263 774141
6317G74141j23662q9686o7367n6992m6413l9628l1193k9059k4338k3106j8187
$$ 774141 650479 560793 493426 436434 390021 350393 319200 290141 265803 242697 224510
6306B24510j6684j2299j2600r464j0056p502q417n747o527m103m837k722m701
$$ 224510 207826 195527 182927 173463 163407 155905 147488 141741 135214 131111 126274 123552 118851
6293A18851l400n029k998l947j923l656k423l931k280l250j233k504j000k612
$$ 118851 115451 110422 107424 103477 101554 97898 95475 91544 89264 86014 84781 82277 81277 78665
6279G8665j488k621r62j925r80k674j490k144l42j002K12r09K20j086n71j377
$$ 78665 77177 74556 73594 71669 70689 68015 66525 64381 64039 63037 63249 62340 62560 61474 60903 59526
6263E9526k22r40J79n40J39o71lj01R91N8l52j608j139j118k89k65L15M14M65
$$ 59526 59304 58364 58543 58003 58142 57471 57468 57367 58358 58416 58064 56456 55317 54199 53910 53645 53960 54374 54839
6244E4839n42j96k18J58Om06p67q44m86j57O2o5N9k42o18j216o56n61L22l7j94
$$ 54839 54297 54101 53883 54041 54047 53641 52874 52030 51544 51387 51449 51384 51443 51201 50583 49367 48711 48150 48472 48435 48241
6223D8241q24L38J05M58m44K27m54q9m70K59j011o18j228J5n13L23l91J71j245
$$ 48241 47417 47755 47860 48318 47874 48101 47647 47558 47088 47347 46336 45718 44490 44505 43992 44315 43924 44095 42850
6204D2850J65m23N64m30O88o85L39j173k81j092J37j152j5j226L09m79O00q66
$$ 42850 43015 42592 43156 42726 43414 42729 43068 41895 41614 40522 40659 39507 39492 38266 38575 38096 38696 37830
6186C7830k47j179P47l75M16q88R25m20P20j47R21k25K196J674K140p46r74k732
$$ 37830 37583 36404 37151 36776 37192 36304 37229 36809 37529 37382 38303 38078 40274 41948 44088 43342 42368 39636
6168C9636j575k199j97j219k57j377K39k67J455l17K85p46L95m81M58o04N13q10
$$ 39636 38061 35862 35665 34446 34189 32812 33051 32784 34239 33922 34207 33461 33856 33375 33833 33229 33742 32932
6150C2932M10j43Q56n54K45o27K41n22P80M1Q63K7Q18p20j50n79L31k84K94q60
$$ 32932 33342 33199 34055 33501 33746 33119 33360 32838 33618 33659 34522 34549 35367 34647 34497 33918 34249 33965 34259 33399
6130C3399k98r71k23l18J34p83m55q14J48oN05j63j95m29N60L06l2l80J83j17
$$ 33399 33101 32130 31907 31589 31723 30940 30485 29671 29819 29813 30318 30155 29960 29531 30091 30397 30365 29985 30168 30051
6110C0051j35j90L5l07n27l44l74k47J10L75j34q52j207q65l88K81J12Q24L91
$$ 30051 29916 29726 29761 29454 28927 28583 28209 27962 28072 28447 28313 27461 26254 25389 25001 25282 25394 26218 26609
6091B6609k5l46K82k81k62m09P86L05R1m48N25K1Q2r82l48m86N03j8N84n14j17
$$ 26609 26584 26238 26520 26239 25977 25568 26354 26659 26750 26302 26827 26848 26930 25948 25600 25114 25617 25599 26183 25669 25552
6070B5552n94N17m4O41p3L07n24L23o71k1n45R00Q3N69n84n2r22M07n41p1q35
$$ 25552 24958 25475 25431 26072 25999 26306 25782 26105 25434 25413 24868 25768 25851 26420 25836 25784 24862 25269 24728 24657 23822
6049B3822P26Q5J107L40Q04o73O9q68M45k79N17q04O9k34J082o7O32m73L01k91
$$ 23822 24548 24633 25740 26080 26884 26211 26280 25412 25857 25578 26095 25291 25360 25126 26208 26141 26773 26300 26601 26310
6029B6310O46o02M34j29J227N07Q31j084m80j513o82o94M98j61O80L18J222L00
$$ 26310 26956 26354 26788 26659 27886 28393 29224 28140 27660 26147 25465 24771 25269 25108 25788 26106 27328 27628
6011B7628R41R7P23k19L06n65L04O9J211J124J903Q57J173N83J164J180J700N82
$$ 27628 28569 28666 29389 29170 29476 28911 29215 29284 30495 31619 33522 34379 35552 36135 37299 38479 40179 40761
5993D0761P41P25J152N60Q67N81R74O25J450O72J15k00J20o4M50Q70R44%q3n1
$$ 40761 41502 42227 43379 43939 44806 45387 46361 46986 48436 49108 49223 49023 49143 49079 49529 50399 51343 51343 51260 51209
5973E1209j27o46j146j417j835k001j283n68j07q8q78j147j678j729k015j795
$$ 51209 51082 50436 49290 47873 46038 44037 42754 42186 42079 41991 41113 39966 38288 36559 34544 32749
5957C2749j562q46q96n82p96n1j19r1o92l81o15j45k94R4o94m2M5P43K21Q47J57
$$ 32749 31187 30341 29445 28863 28067 28016 27897 27806 27114 26733 26118 25973 25679 25773 25079 25037 25082 25825 26046 26893 27050
5936B7050N69k24l1l40J78n47J17o77k90r20P0l66N17j00M84j010n35l93L00m19
$$ 27050 27619 27395 27364 27024 27202 26655 26772 26095 25805 24885 24955 24589 25106 25006 25490 24480 23945 23552 23852 23433
5916B3433N98j16M91n69K52q04j01m09Q38l4L71n20L39j59P19j76L11n18O85L03
$$ 23433 24031 23915 24406 23837 24089 23285 23184 22775 23613 23579 23950 23430 23769 23610 24329 24153 24464 23946 24631 24934
5896B4934Q38o23j50n44N97k61N82j76O76k7K74n89K11m19P2n64L30n71q2m58
$$ 24934 25772 25149 24999 24455 25052 24791 25373 25197 25873 25846 26120 25531 25742 25323 25395 24831 25161 24590 24508 24050
5876B4050N53k59L25Q9Q24K74O72jJ02m79K72l99J58k47K27j21O1k57M45K89L90
$$ 24050 24603 24344 24669 24758 25582 25856 26528 26527 26629 26150 26422 26023 26181 25934 26161 26040 26101 25844 26289 26578 26968
5855B6968O7L47kM34o2K4l29q6J19L54J67K68q5J9j12J93K6M58N35O41P93R83
$$ 26968 27035 27382 27380 27814 27752 27776 27447 27361 27480 27834 28001 28269 28184 28203 28091 28284 28310 28768 29303 29944 30737 31720
5833C1720J174P02O05L43L26k49n14q15n53o98l62K49R49O83O97L49N88N61J246
$$ 31720 32894 33596 34201 34544 34870 34621 34107 33292 32739 32041 31679 31928 32877 33560 34257 34606 35194 35755 37001
5814C7001R45J425J515J259l9q6l43O69O7j00q23m99r27J0j55N88O7M89k87Km14
$$ 37001 37946 39371 40886 42145 42106 42020 41677 42346 42413 42313 41490 40991 40064 40074 39919 40507 40574 41063 40776 40778 40364
5793D0364O45L99O72k56P3r56n8L30J285K2m67j260k82o10O16O9O26n74l04j016
$$ 40364 41009 41408 42080 41824 41897 40941 40883 41213 42498 42520 42053 40793 40511 39901 40517 40586 41212 40638 40334 39318
5773C9318O9N2P71p4K99j82R04N3M76j17P00J88J214P44J326O68J377R21J795
$$ 39318 39387 39439 40210 40136 40435 40253 41157 41210 41686 41569 42269 42457 43671 44415 45741 46409 47786 48707 50502
5754E0502J127J695J288J847J303K106J964L678M734O702Q576J3891J9794K4845
$$ 50502 51629 53324 54612 56459 57762 59868 61832 65510 70244 76946 85522 99413 119207 144052
5740A44052K0855J1199K809K694N866P617J788q942j9825k3322k1485j6614j2531
$$ 144052 164907 176106 178915 181609 187475 195092 196880 187938 168113 144791 123306 106692 94161
5727I4161q533o195m435l505j725j096n14o31l28m75J77K91O69N58O00L62K55
$$ 94161 85628 79433 74998 71493 69768 68672 68158 67527 67199 66724 66901 67192 67861 68419 69019 69381 69636
5710F9636m20m72o33p2R04J243P28L87N03Q96Q39Q18P00M16O92J207J499J082
$$ 69636 69216 68744 68111 68039 68943 70186 70914 71301 71804 72700 73539 74357 75057 75473 76165 77372 78871 79953
5692G9953R67R48J178P99Q09M52Q48J060J203J078J899J580J439R92J328J691
$$ 79953 80920 81868 83046 83845 84654 85106 85954 87014 88217 89295 91194 92774 94213 95205 96533 98224
5676I8224K551J823K031K053K537J954K149J731K307K122K575K157K875K747K933
$$ 98224 100775 102598 104629 106682 109219 111173 113322 115053 117360 119482 122057 124214 127089 129836 132769
5661A32769K470L096K556L066K701L868L960M359L321L678L489M463M378N200
$$ 132769 135239 138335 140891 143957 146658 150526 154486 158845 162166 165844 169333 173796 178174 183374
5647A83374M855N935N414O269O164P099P146Q378Q257R407R477J0738J1242J3923
$$ 183374 188229 194164 199578 205847 212011 219110 226256 234634 242891 252298 261775 272513 283755 297678
5633B97678J5531J8033J9916K3928K7590L3105L8347M4564M9986N6254O1436O8876
$$ 297678 313209 331242 351158 375086 402676 435781 474128 518692 568678 624932 686368 755244
5621G55244P5425Q2948Q9784R9519J10565J23558J34636J46122J55796J65804
$$ 755244 830669 913617 1003401 1102920 1213485 1337043 1471679 1617801 1773597 1939401
5611A939401J75175J86305J98409K13669K30162K50966K74307L00896L27157L55153
$$ 1939401 2114576 2300881 2499290 2712959 2943121 3194087 3468394 3769290 4096447 4451600
5601D451600L83831M13513M40456M66337M93239N22982N53754N89303O33686O88985
$$ 4451600 4835431 5248944 5689400 6155737 6648976 7171958 7725712 8315015 8948701 9637686
5591I637686P50249Q11774Q65370R09333R42520R67479R93904J028910J064244
$$ 9637686 10387935 11199709 12065079 12974412 13916932 14884411 15878315 16907225 17971469
5582A7971469J096904J123278J131396J106357J042898R37344P95132O29529M69074
$$ 17971469 19068373 20191651 21323047 22429404 23472302 24409646 25204778 25834307 26303381
5573B6303381L68607L09908J66011j33965m34687n84940o22547n93970n17157
$$ 26303381 26671988 26981896 27147907 27013942 26579255 25994315 25371768 24777798 24260641
5564B4260641m39638l95421l82003l86864l68767l04386k31268k00741k35533
$$ 24260641 23821003 23425582 23043579 22656715 22287948 21983562 21752294 21551553 21316020
5555B1316020k97244l16529k83727k40847k06545j72221j42911j24893j12354
$$ 21316020 21018776 20702247 20418520 20177673 19971128 19798907 19655996 19531103 19418749
5546A9418749j05738j01376r5592q4311o7425o2300q3724j07112j12252r7460
$$ 19418749 19313011 19211635 19116043 19031732 18964307 18902007 18818283 18711171 18598919 18501459
5536A8501459p7059n2641j8203J2067K4298K6630K2638J7123J4888J3845Q464
$$ 18501459 18424400 18371759 18353556 18365623 18389921 18416551 18439189 18456312 18471200 18485045 18493509
5525A8493509J4511K9653L0153O948k9018o6640p8879o4270n9920q3691j14078
$$ 18493509 18508020 18537673 18567826 18574774 18545756 18479116 18400237 18335967 18276047 18192356 18078278
5514A8078278j42944j66643j75438j60129j29498j03136j00827j19103j44464
$$ 18078278 17935334 17768691 17593253 17433124 17303626 17200490 17099663 16980560 16836096
5505A6836096j58473j59513j44069j20829j04172j02872j13851j29803j39799
$$ 16836096 16677623 16518110 16374041 16253212 16149040 16046168 15932317 15802514 15662715
5496A5662715j46616j45785j32598j06226q5934q0500q0382q1752r7185j17474
$$ 15662715 15516099 15370314 15237716 15131490 15045556 14965056 14884674 14802922 14705737 14588263
5486A4588263j34433j41277j37472j33467j41480j56762j75812j90976j98291
$$ 14588263 14453830 14312553 14175081 14041614 13900134 13743372 13567560 13376584 13178293
5477A3178293j96691j96441k02113k10170k14619k26389k50841k87662l29480
$$ 13178293 12981602 12785161 12583048 12372878 12158259 11931870 11681029 11393367 11063887
5468A1063887l66300l82012l75296l56300l37153l15313k89720k62670k43693
$$ 11063887 10697587 10315575 9940279 9583979 9246826 8931513 8641793 8379123 8135430
5459H135430k31945k21501k06858j91716j78554j68344j58935j51571j43909j35432
$$ 8135430 7903485 7681984 7475126 7283410 7104856 6936512 6777577 6626006 6482097 6346665
5449F346665j25007j14671j03714r3493q4805p9017p3165o6886n8817m8210l4387
$$ 6346665 6221658 6106987 6003273 5909780 5824975 5745958 5672793 5605907 5547090 5498880 5464493
5438E464493k0881k1141n5571j23022j95097k49947k87805l12210l20750l12142
$$ 5464493 5443612 5422471 5366900 5243878 5048781 4798834 4511029 4198819 3878069 3565927
5428C565927k93826k71284k46619k22218j99887j79983j62395j47360j34072j21570
$$ 3565927 3272101 3000817 2754198 2531980 2332093 2152110 1989715 1842355 1708283 1586713
5418A586713j09560r9239r0866q5420p9903p3502o6902o2435n8120n4200n0655
$$ 1586713 1477153 1377914 1287048 1201628 1121725 1048223 981321 918886 860766 806566 755911
5407G55911m7796m4910m2419l8832l5526l2471l0513k8257k6812k4159k2389k0305
$$ 755911 708115 663205 620786 581954 546428 513957 483444 455187 428375 404216 381827 361522
5395C61522j8751j7106j6357j4689j3800j1990j0791r043q551p463o911n795n886
$$ 361522 342771 325665 309308 294619 280819 268829 258038 248995 240444 232981 226070 220275 214389
5382B14389n182n794m988m749l997m328l445l462l028l784l372l532k871l437
$$ 214389 209207 203413 198425 193676 189679 185351 181906 178444 175416 171632 168260 164728 161857 158420
5368A58420k739l035k425k935k304k601j901k575k225k694j986k093j452j950
$$ 158420 155681 152646 150221 147286 144982 142381 140480 137905 135680 132986 131000 128907 127455 125505
5354A25505j986k351j626k179j540j610j284k297j715k079j263j363q33j291j007
$$ 125505 123519 121168 119542 117363 115823 114213 112929 110632 108917 106838 105575 104212 103379 102088 101081
5339A01081j332q42j296p24j395j360j713q24j107j100j794j233j193j094j327
$$ 101081 99749 98907 97611 96887 95492 94132 92419 91595 90488 89388 87594 86361 85168 84074 82747
5324H2747n70q11o30j250j064j244j138j126n17q73p91p35m35r22q00j154j030
$$ 82747 82177 81366 80736 79486 78422 77178 76040 74914 74397 73524 72733 71998 71563 70641 69841 68687 67657
5307F7657j154j144j229p38l66l79q37q11r74q29j072j030o73m20m01o53j031
$$ 67657 66503 65359 64130 63392 63026 62647 61810 60999 60025 59196 58124 57094 56421 56001 55600 54947 53916
5290E3916r36l87k06m38q21p33o37j85m1q6n59r26j437j099q26k2l95o29n08j7
$$ 53916 52980 52593 52387 51949 51128 50395 49758 49573 49532 49446 48887 47961 46524 45425 44599 44577 44182 43553 43045 43028
5270D3028l09j92n43k57q03j76m12k61o38o25q96m97o49j55k43J08j67N63J78
$$ 43028 42719 42527 41984 41727 40924 40748 40336 40075 39437 38812 37916 37419 36770 36615 36372 36480 36313 36876 37054
5251C7054j17r01j25n81m29l71R4m99J06o47p61j130l63o24k37l31O08j1K51m39
$$ 37054 36937 36036 35911 35330 34901 34530 34624 34125 34231 33584 32823 31693 31330 30706 30469 30138 30746 30735 30986 30547
5231C0547R2m16l70q88k85r76p9n05k34k85L73j67l9r66m30n96N56M02O77k47
$$ 30547 30639 30223 29853 28965 28680 27704 27625 27120 26886 26601 26974 26807 26768 25802 25372 24776 25332 25734 26411 26164
5211B6164m88p60M2p31l48o57j62m28M50K66L00l93N3m14K4k65J14m77l97r26
$$ 26164 25676 24916 24958 24227 23879 23222 23060 22632 23082 23348 23648 23255 23308 22894 22918 22653 22767 22290 21893 20967
5191B0967o88j029l08k23J35p2M20K37L63m18j94j75j0m04m70n33Mr7M12L43L0
$$ 20967 20279 19250 18942 18719 18854 18782 19202 19439 19802 19384 19190 19015 19005 18601 18131 17598 17602 17505 17917 18260 18290
5170A8290j46Q6J07K74k36o22o38k64l22j0L13J65j52l26l22l7j90j92K8j06o7
$$ 18290 18144 18230 18337 18611 18375 17753 17115 16851 16529 16519 16832 16997 16845 16519 16197 16160 15970 15778 15806 15700 15633
5149A5633J42M24j77n51l14J77L3K53O8O2k84k41n72J7j80k84q27k05j02K48J10
$$ 15633 15775 16199 16022 15471 15157 15334 15367 15620 15688 15750 15466 15225 14653 14670 14490 14206 13379 13174 13072 13320 13430
5128A3430J99m66j52l25K10l2k49o28r0o34j10j5K99o33o02o90R9JO86L77O30
$$ 13430 13629 13163 13011 12686 12896 12864 12615 11987 11897 11263 11153 11138 11437 10804 10202 9512 9611 9612 10298 10675 11305
5107A1305l02L6n41k21n38J12j40M31Q5K00m92K22l71j12p18j80k87M42J56P76
$$ 11305 11003 11039 10498 10277 9739 9851 9711 10142 10227 10427 9935 10157 9786 9674 8956 8776 8489 8931 9087 9863
5087I863K01J38o91Q9n03l85p20N93M4j46r65k39l77RQ9J065J56k35j062m49j95
$$ 9863 10064 10202 9511 9600 9097 8712 7992 8585 8629 8483 7518 7279 6902 6911 7000 8065 8221 7986 6924 6475 6280
5066F280O00K95Q14q9k34o71j80j97N36M16P67K70K06k58l08q16j15o0L63j78
$$ 6280 6880 7175 7989 7900 7666 6995 6815 6618 7154 7570 8337 8607 8813 8555 8247 7431 7316 7256 7619 7441
5046G441Kk74l8k59J86N7rk26J8k52L31J0k95q16l17O4l5l93m59m69Q2K33L61
$$ 7441 7443 7169 7131 6872 7058 7115 7106 6880 6898 6646 6977 6987 6692 5876 5559 5623 5588 5195 4736 4267 4349 4582 4943
5023D943K99K43j7j60Q1L73L98kk36p7M2l57k50k93mj20l4O4N21L80M74j31n30
$$ 4943 5242 5485 5468 5308 5389 5762 6160 6158 5922 5845 5887 5530 5280 4987 4983 4863 4829 4893 5414 5794 6268 6137 5607
5000E607r19n00j7O34m3k5j7O14J53L98M35P07J91O88M87R00L81J180J429K221
$$ 5607 4688 4188 4171 4805 4762 4737 4720 5334 5487 5885 6320 7027 7218 7906 8393 9293 9674 10854 12283 14504
4980A4504K530M359P318J2414J3818R889L448K673M069J447r018j4085j3040r321
$$ 14504 17034 21393 28711 41125 54943 64832 68280 70953 75022 76469 67451 53366 40326 31005
4966C1005p078m880l634k023j985r60j097n49j031m52q39q4m31q5m58N46J17L86
$$ 31005 23927 19047 15413 13390 11405 10445 9348 8799 7768 7316 6477 6393 5962 5877 5419 5965 6082 6468
4948F468R8M83n28j33l45K85l34r1n72O9m67J67k79L4l14Q3r02q83p65L79M14
$$ 6468 6566 7049 6521 6388 6043 6328 5994 5903 5331 5400 4933 5100 4821 4855 4541 4624 3722 2839 2074 2453 2867
4927B867Q53l5L8l32J45k91J20j4J80m41Q0j59J55m43J51M66M06m52K51J72J28
$$ 2867 3720 3685 3723 3391 3536 3245 3365 3351 3531 3090 3170 3011 3166 2723 2874 3340 3746 3294 3545 3717 3845
4906C845q4M33L31L12k00l4m16k11l84J5J81L31k13j32j9k7o1M5K6J9l8K50L53
$$ 3845 3761 4194 4525 4837 4637 4603 4187 3976 3592 3607 3788 4119 3906 3774 3755 3728 3667 3712 3738 3757 3719 3969 4322
4883D322k15p25k65J61k06q9L25j6o00j67j34K81J91j42j23L31P05O23j87l77
$$ 4322 4107 3382 3117 3278 3072 2983 3308 3292 2692 2525 2391 2672 2863 2721 2598 2929 3634 4257 4070 3693
4863C693q39k04J09L49L72P04k81k24k99P0k32N68oJ74q5K77K01Q40k82r2l44
$$ 3693 2854 2650 2759 3108 3480 4184 3903 3679 3380 3450 3218 3786 3780 3954 3869 4146 4347 5187 4905 4813 4469
4842D469M24J9L05L19Q64j24m46j120j27m36O6m06K05k61J80j98P77N65J310N39
$$ 4469 4893 4912 5217 5536 6400 6276 5830 4710 4583 4147 4213 3807 4012 3751 3931 3733 4510 5075 6385 6924
4822F924N34n63k83r17j1n4P26P23J741M80K13r40p23p66O44L94Q25P5J40p00
$$ 6924 7458 6895 6612 5695 5684 5630 6356 7079 8820 9300 9513 8573 7850 7084 7728 8122 8947 9022 9162 8462
4802H462j76q60l58o48J21o8O28k66L5n99J85L14P49l23M1r8L13k24O63J84L73
$$ 8462 8286 7426 7068 6420 6541 6473 7101 6835 6870 6271 6456 6770 7519 7196 7237 7139 7452 7228 7891 8075 8448
4781H448j28P7n30K88J27O48K54M63j48P36J063J330N65O32M65J230J428J736
$$ 8448 8320 8397 7867 8155 8282 8930 9184 9647 9499 10235 11298 12628 13193 13825 14290 15520 16948 18684
4763A8684J539J906J841K419K452L006L794N870P846J0375J2677J6032K1401L1405
$$ 18684 20223 22129 23970 26389 28841 31847 35641 41511 49357 59732 72409 88441 109842 141247
4749A41247M5642O0759P3735Q2571N9138j532k9839p72M5424Q4467J12726J07865
$$ 141247 186889 247648 321383 403954 463092 461560 431721 430949 476373 560840 673566 781431
4737G81431J2977j09156j30345q1112k9470O158K5449R966m8117q9727q1317n8192
$$ 781431 794408 685252 554907 473795 444325 450483 475932 485898 437781 348054 266737 208545
4725B08545l9350k7699k0565j6749j2929j0433q293p262n675n246m284m726m178
$$ 208545 169195 141496 120931 104182 91253 80820 72527 65265 59590 54344 50060 45334 41156
4712D1156l984k762k412j245j579j637k619k086k151q78p55k62j256j236j522
$$ 41156 37172 34410 31998 30753 29174 27537 24918 22832 20681 19803 19048 18786 17530 16294 14772
4697A4772o82j344k94l85P62L39N41r57p03r24K80L14J093k6Q5j185o04j117j57
$$ 14772 14090 12746 12452 12067 12829 13168 13709 12752 12049 11125 11405 11719 12812 12786 12871 11686 11082 9965 9808
4678I808n29L68k33K27l44N77m92K25k99L38l66O70K28O10l23N04P7O31l33O1
$$ 9808 9279 9647 9414 9641 9297 9874 9382 9607 9308 9646 9280 9950 10178 10788 10465 10969 11046 11677 11344 11405
4658A1405p10Q9k3R48N60R75n90p56j089Q17R82J173l70o95j288K8R1J21o43j15
$$ 11405 10695 10784 10761 11709 12269 13244 12654 11898 10809 11626 12608 13781 13411 12716 11428 11456 11547 11668 11025 10910
4638A0910q04l79l76N85j95Q9k78N23M67M62J09M09m90j54M0L03J36N42J7K1J34
$$ 10910 10106 9727 9351 9936 9741 9830 9552 10075 10542 11004 11113 11522 11032 10878 10918 11221 11357 11899 11916 11937 12071
4617A2071O80M26L17J58L33O53J001P16L47p64j223o87j17r0j1k2n82n51o42L92
$$ 12071 12751 13177 13494 13652 13985 14638 15639 16355 16702 15938 14715 14028 13911 13821 13810 13788 13206 12655 12013 12405
4597A2405L93k30p18o07r18J6L91O46q7L16K0N47M14O06N4M45J48Q82j76J1M4
$$ 12405 12798 12568 11850 11243 10325 10341 10732 11378 11291 11607 11627 12174 12588 13194 13248 13693 13841 14723 14547 14558 14602
4576A4602J519O65N20p02n14j150j12j02J196J16K63n31O93k0J171O88J719J050
$$ 14602 16121 16786 17306 16604 16090 14940 14828 14726 15922 16038 16301 15770 16463 16443 17614 18302 20021 21071
4558B1071K348K494M096L928O766Q678J1961J0961R368L821L72r91K168L61k443
$$ 21071 23419 25913 30009 33937 40703 49381 61342 72303 81671 85492 85864 84873 87041 87402 84959
4543H4959r112j1601j0796p029o299l732l316j445k356j378j942k51j115J25j260
$$ 84959 75847 64246 53450 46421 40122 36390 33074 31629 29273 27895 25953 25702 24587 24712 23452
4528B3452m81j143Q13K2P32o87Q30M55J668L29Q16q79K35k68Q17j098o46j735
$$ 23452 22971 21828 22641 22663 23395 22708 23538 23993 25661 25990 26806 25927 26162 25894 26711 25613 24967 23232
4510B3232LK20K011P06N64j499m97n5J807J074J110n66O06J40J194N11N47j162
$$ 23232 23235 23455 25466 26172 26736 25237 24740 24685 26492 27566 28676 28110 28716 28856 30050 30561 31108 29946
4492B9946o23p48R59J085J401J09R71J349K630K237J786K91M65N36J871K719K763
$$ 29946 29323 28575 29534 30619 32020 32129 33100 34449 37079 39316 41102 41393 41858 42394 44265 46984 49747
4475D9747J434R99J334K935L868L663J402j697l093j198L155N837O130L619O12
$$ 49747 51181 52180 53514 56449 60317 63980 65382 63685 60592 59394 62549 68386 74516 78135 78747
4460G8747l009l782j927K579N511O821L994K465J132K065K258M464M017M557L837
$$ 78747 75738 71956 70029 72608 78119 84940 88934 91399 92531 94596 96854 101318 105335 109892 113729
4445A13729O569Q276J1778J1691J3457J3090J6588J9628K8817L9089N3095O3238
$$ 113729 120298 128574 140352 152043 165500 178590 195178 214806 243623 282712 335807 399045
4433C99045P4433N6035P343k3143k875L0961O5698Q9054R3171K1538p5105r9704
$$ 399045 473478 529513 536856 513713 510838 541799 607497 696551 789722 811260 736155 636451
4421F36451o0710k1593J1321K5729J8429k9257n9946n6768l5851k3036r426o299
$$ 636451 575741 554148 565469 591198 609627 580370 520424 463656 427805 404769 395343 389044
4409C89044J45m09N534M785R880Q325J3319J1326J6393J6261K3607K0707K4381
$$ 389044 389189 388780 394314 399099 408979 417304 430623 441949 458342 474603 498210 518917 543298
4396E43298K1577K7974K7332L5464L4520L9654L6463M4399M4101N3031N4541O6832
$$ 543298 564875 592849 620181 655645 690165 729819 766282 810681 854782 907813 962354 1029186
4384A029186O9122Q0518Q2926R6592J00546J15966J26073J51539J67653J97386
$$ 1029186 1098308 1178826 1261752 1358344 1458890 1574856 1700929 1852468 2020121 2217507
4374B217507K22336K68595L14719L85207M55560N55632O82150Q77133J132287
$$ 2217507 2439843 2708438 3023157 3408364 3863924 4419556 5101706 5978839 7111126
4365G111126J501469J940698K475514L317401M770604O833274R025258J1008438
$$ 7111126 8612595 10553293 13028807 16346208 21116812 27950086 36975344 47983782
4357D7983782J2316494Q560885o63721m614172p225O868863J2575888J6743781
$$ 47983782 60300276 68861161 68197440 63583268 63576043 70444906 83020794 99764575
4349I9764575J6003431J478435j6736608j9356715j1770305m227535J063172L925937
$$ 99764575 115768006 117246441 100509833 81153118 69382813 65155278 66218450 70144387
4341G0144387J511771p473884j3496192j1970542q436421n694643l998483l046375
$$ 70144387 71656158 64182274 50686082 38715540 30279119 24584476 20585993 17539618
4333A7539618k461958j975428j591296j278473j051206q76758p54894o66707o15277
$$ 17539618 15077660 13102232 11510936 10232463 9181257 8304499 7549605 6882898 6267621
4324F267621n64310m92921m19668l63135l17970k83439k63397k56882k46542k22554
$$ 6267621 5703311 5210390 4790722 4427587 4109617 3826178 3562781 3305899 3059357 2836803
4314B836803j98914j76313j58002j40389j30779j21295j13986j03062r6101q7620
$$ 2836803 2637889 2461576 2303574 2163185 2032406 1911111 1797125 1694063 1597962 1510342
4304A510342q3897p7282p3292o5632o3066n7653n5583m8106m5270l9734l9265
$$ 1510342 1426445 1349163 1275871 1210239 1147173 1089520 1033937 985831 940561 900827 861562
4293H61562l5559l6183l1156k9230k2622k2229j7885j6621q211j928J1113K0809
$$ 861562 826003 789820 758664 729434 706812 684583 666698 650077 641866 639938 651051 671860
4281F71860L4538M2776M2496K129l5214l0997N738L7910O7053P9444M2028o1743
$$ 671860 706398 749174 791670 793799 758585 727588 733326 771236 838289 917733 959761 898018
4269H98018j14857r2465m7411j6515P116R531k2445p0110p5580n9849m1301l1613
$$ 898018 783161 690696 643285 626770 633886 643417 620972 550862 475282 415433 374132 342519
4257C42519k1878j9257j4838j4368r566r777q134j0204q199q909n735o471m038
$$ 342519 320641 301384 286546 272178 262612 252835 244701 234497 226298 217389 211654 205183 201145
4244B01145n490m687o843m654n199l183n014l659m620l017m047k449m150l284
$$ 201145 195655 190968 184125 179471 174272 171089 166075 162416 157796 154779 150732 148283 144133 140849
4230A40849m183k390l148j425k279j577k959j872k479q27j319J50p30n53j930
$$ 140849 136666 134276 131128 129703 127424 125847 122888 121016 118537 117710 116391 116541 115811 115258 113328
4215A13328j350j857p24j313j364k607j691j695r39j646j087j604j235r04K43
$$ 113328 111978 110121 109397 108084 106720 104113 102422 100727 99788 98142 97055 95451 94216 93312 93555
4200I3555k81r93j819j332j464q14q29j190k062j935j269q14n34n87q40j018j295
$$ 93555 93274 92281 90462 89130 87666 86852 86023 84833 82771 80836 79567 78753 78219 77632 76792 75774 74479
4183G4479j253r38j039o49q46r79j472j076r03n79p57j77n35n42q00K34j64l03
$$ 74479 73226 72288 71249 70600 69754 68775 67303 66227 65324 64745 63988 63811 63276 62734 61934 62168 62004 61701
4165F1701j109r31j191k48l68J83n90k38p82j21n84J85p61o27j232m36j163k27
$$ 61701 60592 59661 58470 58222 57854 58037 57447 57209 56427 56306 55722 55907 55146 54519 53287 52851 51688 51461
4147E1461k23O13o50m06j260q39j401j10p03r8q20r3p40j14j074j16q59J72j20
$$ 51461 51238 51851 51201 50795 49535 48696 47295 47185 46482 46384 45564 45471 44731 44617 43543 43427 42568 42740 42620
4128D2620K97j388r68j230j8o40N23J9O74l10L25k47P15L2N95m99j81j498n65
$$ 42620 42917 41529 40561 39331 39313 38673 39196 39215 39889 39579 39904 39657 40372 40404 40999 40500 40319 38821 38256
4109C8256j018m16n01P77l52j48j107l9n08j53n26L02k27K31n04m73j121j4k43
$$ 38256 37238 36822 36321 37098 36746 36598 35491 35452 34944 34791 34265 34567 34340 34571 34067 33594 32473 32459 32216
4090C2216M6l17O30J59j57j219o82j196l73k77K70j0P2p87n30q96l66q79n04n41
$$ 32216 32262 31945 32575 32734 32577 31358 30676 29480 29107 28830 29100 29090 29162 28375 27845 26949 26583 25704 25200 24659
4070B4659j73l23M38N85L39l73p0Nmn89m49o40o51n30l04l87K36M33q8n69k02
$$ 24659 24486 24163 24601 25186 25525 25152 25082 25087 25083 24494 24045 23405 22754 22224 21920 21533 21769 22202 22114 21545 21343
4049B1343L39O32O59N88N63L59K46J98L58N1J10L14P02j41q94r81m25j057r98
$$ 21343 21682 22314 22973 23561 24124 24483 24729 24927 25285 25336 25446 25760 26462 26321 25427 24446 24021 22964 21966
4030B1966j82L76n08n02l30J41m79O1l73K6j45o6n11Q0l10j56j23M26j98k21n35
$$ 21966 21784 22160 21652 21150 20820 20961 20482 20543 20170 20196 20051 19985 19474 19554 19244 19088 18965 19391 19193 18972 18437
4009A8437N6o5M09r4J87M4Q11M41M82n99k8m57K15L42P37J89L06l56K59j75M09
$$ 18437 18493 18428 18837 18743 18930 18974 19785 20226 20708 20109 20081 19624 19839 20181 20918 21107 21413 21057 21316 21141 21550
3988B1550L89R07p5K79K66J251R37J690J370J875J805K984L234M159M338N988
$$ 21550 21939 22846 22771 23050 23316 24567 25504 27194 28564 30439 32244 35228 38462 42621 46959 52947
3972E2947P529J0509J3342J7706K2778L2808M6671O2704P6373Q8266P3916J4750
$$ 52947 60476 70985 84327 102033 124811 157619 204290 266994 343367 431633 505549 520299
3960E20299l1654j5124L0144P3788J06061J15882M1351r1644j40857r7718m2649
$$ 520299 488645 473521 503665 577453 683514 799396 840747 749103 608246 510528 467879
3949D67879j182K3201J9008l4961q7780q8981o4778m4329l0178k2873j8346j4958
$$ 467879 466697 489898 508906 473945 386165 297184 232406 188077 157899 135026 116680 101722
3937A01722j1476r366p777o878n451n097m281l808l188l189k449k271j860j718
$$ 101722 90246 80880 73103 66225 60774 55677 51396 47588 44400 41211 38762 36491 34631 32913
3923C2913j519k167j753j217n80q47j097j101q92r50r98j093j147o33k43l39m49
$$ 32913 31394 29227 27474 26257 25677 24830 23733 22632 21740 20790 19792 18699 17552 16919 16676 16337 15888
3906A5888o53o05n19p74m34k70q8k05j64o5P8k19j45n00n02k71P4L8o0p52r2K54
$$ 15888 15235 14630 14111 13337 12903 12633 12545 12340 12176 12111 12189 11970 11825 11325 10823 10552 10626 10664 10604 9852 9760 10014
3884A0014M76n1K22N33L83j31M72K26K39l83k67j74Q57P29J02r66j069j334p51
$$ 10014 10490 10439 10661 11194 11577 11446 11918 12144 12383 12000 11733 11559 12416 13145 13247 12281 11212 9878 9127
3865I127p93j95n12l18k35q9o60n1l91n25m43L08k51L24K20L50j70K37J08L11
$$ 9127 8334 8139 7627 7309 7074 6985 6325 6274 5883 5358 4915 5223 4972 5296 5516 5866 5696 5933 6041 6352
3845F352k48Q2p9jo56n1P8L77m36k71l49K83K65K66n14L0L0J97j29J21j31M0k09
$$ 6352 6104 6186 6107 6106 5450 5399 5477 5854 5418 5147 4798 5081 5346 5612 5098 5128 5158 5355 5226 5347 5216 5256 5047
3822E047K38j78P7l18L56N88N97L12P53J029J734J657K090K081L199M631O444
$$ 5047 5285 5107 5184 4866 5222 5810 6407 6719 7472 8501 10235 11892 13982 16063 19262 23893 30337
3805C0337N679J112n188o802n668l747k578j278q35o88o75n13j325j361o45J23
$$ 30337 36016 37128 31940 25138 19470 15723 13145 11867 11032 10344 9669 9156 7831 6470 5825 5948
3789E948j6n0k30l31n61k13n7P0j17m63n84m29p4J99J4J20N48M75k44k05J32Q1
$$ 5948 5932 5882 5652 5321 4760 4547 4490 4560 4443 3980 3396 2967 2893 3092 3106 3226 3774 4249 4005 3800 3932 4013
3767D013j36q7Q6N14R61P00J80n53o13m02k19l85m05q53o59o26m24l41J79M90
$$ 4013 3877 3790 3876 4390 5351 6051 6231 5678 5065 4663 4444 4059 3654 2801 2142 1516 1092 751 930 1420
3747A420N18K11R3j95k7j82P4j33J0k97N6k08l78l03%q4K4K24O95K56M4l73j27
$$ 1420 1938 2149 2242 2047 2020 1838 1912 1779 1789 1492 1548 1340 962 659 659 575 599 823 1518 1774 1818 1445 1318
3724A318j53N1J8N24o9j56o91k72k03K1P3N95K25O16N54N00k6j4n27r0O6J88n31
$$ 1318 1165 1216 1234 1758 1689 1533 842 570 367 388 461 1056 1281 1897 2451 2951 2925 2911 2384 2294 2360 2548 2017
3701B017k24n41k45m92K10oL6j45L95K67K04l30M19J51J88m66j91l27J46L4K45
$$ 2017 1793 1252 1007 515 725 719 755 610 1005 1272 1476 1146 1565 1716 1904 1438 1247 920 1066 1100 1345
3680A345J01O3l87j66m93j21j81K03J06K05K1O1j38J17j42r3p23n91j33O40M75
$$ 1345 1446 1509 1122 956 463 342 161 364 470 675 696 757 619 736 594 501 -222 -813 -946 -306 169
3659A69J33k32j44J3K04j98j19j13L14j8l28m00P4M47J95rJ53Q2O4RK78K36Q9
$$ 169 302 70 -74 -61 143 -55 -174 -287 27 9 -319 -719 -645 -198 -3 -12 141 223 287 296 574 810 899
3636H99k06k31q0k81n08k56l6m72m96j24K95M01O51J01j98r9O6l1r6k08j7k36
$$ 899 693 462 382 101 -407 -663 -699 -1171 -1667 -1791 -1496 -1095 -444 -343 -541 -640 -574 -605 -701 -909 -926 -1162
3614a162j9J74M03Q2r4k25j27l38j23K2M18K18L2m95j67l41PK93L66k10j37k47
$$ -1162 -1181 -1007 -604 -522 -616 -841 -968 -1306 -1429 -1407 -989 -771 -739 -1234 -1401 -1742 -1735 -1442 -1076 -1286 -1423 -1670
3592a670L1k3K44j00O2J06K72o1K1m06K2m1K42J51L51NQ7lK82l34l61m38j97l65
$$ -1670 -1639 -1662 -1418 -1518 -1456 -1350 -1078 -1139 -1118 -1524 -1502 -1543 -1301 -1150 -799 -794 -707 -710 -428 -762 -1123 -1561 -1758 -2123
3568b123O5K05L85p9j7l61K00j1n3n55m48k98K85k7J77M55O43M90M89P3L9m90
$$ -2123 -2058 -1853 -1468 -1547 -1564 -1925 -1725 -1736 -1789 -2344 -2792 -3090 -2805 -2832 -2655 -2200 -1557 -1067 -578 -505 -466 -956
3546i56K15J68J24m09l30m92j20k58j91l19L01M86L89k88k91j45J45J00R8k30
$$ -956 -741 -573 -449 -858 -1188 -1680 -1800 -2058 -2249 -2568 -2267 -1781 -1392 -1680 -1971 -2116 -1971 -1871 -1773 -2003
3526b003k64l37Q7J41K96K40N94K79j02m12k15j24J62J93m1m16j17L3l04o97j89
$$ -2003 -2267 -2604 -2517 -2376 -2080 -1840 -1246 -967 -1069 -1481 -1696 -1820 -1658 -1465 -1506 -1922 -2039 -2006 -2310 -3007 -3196
3505c196Q4K05R3M3N8J16j69n08m05J16J65K63O50Q84O70K52L58M01K06L7L9l20
$$ -3196 -3112 -2907 -2814 -2771 -2713 -2597 -2766 -3274 -3679 -3563 -3398 -3135 -2485 -1601 -931 -679 -321 80 286 323 362 42
3483D2K5K57Q6j56J1j29J90K11l05n49j74l69m01o06j7L93P48J9l26k01J9n46
$$ 42 67 324 410 254 265 136 326 537 232 -317 -491 -860 -1261 -1867 -1884 -1491 -743 -724 -1050 -1251 -1232 -1778
3461a778n03l8O56M28N12K79j70o68J33J24O4j67j44n70k78N1M63j25K96K93L11
$$ -1778 -2281 -2319 -1663 -1235 -723 -444 -614 -1282 -1149 -1025 -961 -1128 -1272 -1842 -2120 -2069 -1606 -1731 -1435 -1142 -831
3440h31J9J62r0J65N8J73L4L52j57j25k53L14O08R59P40J115J347J759K448K504
$$ -831 -812 -650 -740 -575 -517 -344 -310 42 -115 -240 -493 -179 429 1388 2128 3243 4590 6349 8797 11301
3420A1301R18J00K2P26J027J456J174Q13M31N77O47J140Q30J336J156P90l49r34
$$ 11301 12219 12319 12341 13067 14094 15550 16724 17537 17968 18545 19192 20332 21162 22498 23654 24444 24095 23161
3402B3161r01o93j245o82l05k09q50j136j220j217j511q53k58n4o68j369k128
$$ 23161 22260 21567 20322 19640 19335 19126 18276 17140 15920 14703 13192 12339 12081 12027 11359 9990 7862
3385G862j910j544j203p43n31o51m78k41P2K41N04J12l04k69l6l7l82p85l20j71
$$ 7862 5952 4408 3205 2462 1931 1280 802 561 633 874 1378 1490 1186 917 881 844 462 -323 -643 -814
3365h14k90P2L29j40j40J94p3k55m18j92J70J73J38R0K83L16J67M8j12L2k4J64
$$ -814 -1104 -1032 -703 -843 -983 -789 -862 -1117 -1535 -1727 -1557 -1384 -1246 -1156 -873 -557 -390 -342 -454 -422 -446 -282
3343b82J20R3J67O32L57L1j07J83K06j57p68k99l41J67R40R02O17O45M32N23K83
$$ -282 -162 -69 98 730 1087 1118 1011 1194 1400 1243 475 176 -165 2 942 1844 2461 3106 3538 4061 4344
3322D344K31L35L36K42J17m61j9L81O57M69P01M59K35M06P96L37O03N58M31l56
$$ 4344 4575 4910 5246 5488 5605 5144 5125 5506 6163 6632 7333 7792 8027 8433 9229 9566 10169 10727 11158 10802
3302A0802o32p42m04o84l23m69j6lP4l58n43o74j29l26k67m72k07n26n34n99n5
$$ 10802 10170 9428 9024 8340 8017 7548 7532 7529 7603 7245 6702 6028 5899 5573 5306 4834 4627 4101 3567 2968 2913
3281B913l33l33k13P0n02o79o38K50J76N1m6K58J80K12k73j69k75j01p7M8m08
$$ 2913 2580 2247 2034 2104 1602 923 285 535 711 762 716 974 1154 1366 1093 924 649 548 471 519 111
3260A11l97l11p5J2N08M80N64M76L58j32Lj00o7j26NJ51M36L31K94l88p74n12
$$ 111 -286 -597 -672 -660 -152 328 892 1368 1726 1594 1597 1497 1430 1304 1309 1460 1896 2227 2521 2133 1359 847
3238H47j55l24j73J03J59k67m43p63p79j72j04k74k13r6L88M71L27R5l63n84o02
$$ 847 692 368 195 298 457 190 -253 -1016 -1795 -1967 -2071 -2345 -2558 -2654 -2266 -1795 -1468 -1373 -1736 -2320 -2922
3217b922j48J18j38k69l56l95N7K16J70RK7m7l1n8L02m4q6N1N52K45J63K41J63
$$ -2922 -3070 -2952 -3090 -3359 -3715 -4110 -4053 -3837 -3667 -3658 -3631 -3678 -3709 -3767 -3465 -3509 -3595 -3544 -2992 -2747 -2584 -2343 -2180
3194b180m55n51l83K76K79P8j87K68R3j56k37L3j16K5j09M36M16N7j92J82j28
$$ -2180 -2635 -3186 -3569 -3293 -3014 -2936 -3123 -2855 -2762 -2918 -3155 -3122 -3238 -3213 -3322 -2886 -2470 -2413 -2605 -2423 -2551
3173b551LK49L47k94Q5o5j09l05k07n69j61O4M97M70M35P6O8j44l20m94r5l36
$$ -2551 -2548 -2299 -1952 -2246 -2161 -2226 -2335 -2640 -2847 -3416 -3577 -3513 -3016 -2546 -2111 -2035 -1967 -2111 -2431 -2925 -3020 -3356
3151c356j80j38K04P3L71K62M38O16N85R4k32n30J28L24P8o38m48m53L4L80O39
$$ -3356 -3536 -3674 -3470 -3397 -3026 -2764 -2326 -1710 -1125 -1031 -1263 -1793 -1665 -1341 -1263 -1901 -2349 -2802 -2768 -2388 -1749
3130a749R0Jj04n9k64j56j52L28M80J85q5J75j50k07j88M7J79M58L78K67j81m89
$$ -1749 -1659 -1658 -1762 -1821 -2085 -2241 -2393 -2065 -1585 -1400 -1485 -1310 -1460 -1667 -1855 -1808 -1629 -1171 -793 -526 -707 -1196
3108a196m20o6r5J61N20L72l0K9PM7j50J59K41O3J43L16K32r9l32N6P77R35P83
$$ -1196 -1616 -1682 -1777 -1616 -1096 -724 -754 -725 -718 -671 -821 -662 -421 -358 -215 101 333 234 -98 -42 735 1670 2453
3085B453K13J18N59Q78J129J252J819K420K676L386L813M664O077P828R231J0944
$$ 2453 2666 2784 3343 4221 5350 6602 8421 10841 13517 16903 20716 25380 31457 39285 48516 59460
3069E9460J5198K4371L5313M0122K5282p308l3417l7648k8705j8765j2045p591
$$ 59460 74658 99029 134342 174464 199746 192438 159021 121373 92668 73903 61858 54267
3057E4267m658k613j432L17K094M348O753P700Q734J4325K4619L5367L6542J6315
$$ 54267 49609 46996 45564 45881 47975 52323 59076 66776 75510 89835 114454 149821 186363 202678
3043B02678j6864l7277l7014k6653j8054j2078q597o826o252m695l855l415l187
$$ 202678 185814 148537 111523 84870 66816 54738 46141 39315 33063 28368 24513 21098 17911
3030A7911k327j945j655j599p93r42r08j389j231p05k45k52j2j43j25n73n26q61
$$ 17911 15584 13639 11984 10385 9592 8650 7742 6353 5122 4417 4172 3920 3908 3765 3640 3067 2541 1680
3012A680p25o68k43p4M07N40M20j09r7l04k98m88R7K6K02N7l3m63o02q27o13m2
$$ 1680 955 287 44 -30 377 917 1337 1228 1131 827 529 41 138 164 366 423 390 -73 -675 -1502 -2115 -2157
2990b157N88L91N34L78K89n5k99k24m9l21k17l62j28K4J51j05J9k11l73o3J07
$$ -2157 -1569 -1178 -644 -266 23 -32 -331 -555 -604 -925 -1142 -1504 -1632 -1608 -1457 -1562 -1543 -1754 -2127 -2190 -2083
2969b083lk50J4J41j09k34o8K46R9L06qk81l33j89L5J96J72J30j3J75L71L02L15
$$ -2083 -2086 -2336 -2322 -2181 -2290 -2524 -2592 -2346 -2247 -1941 -1949 -2230 -2563 -2752 -2717 -2521 -2349 -2219 -2232 -2057 -1686 -1384 -1069
2946a069J60j98l21N5K95M9o15o02m33j62J45O61K27m30k73J38K42K92j12J43
$$ -1069 -909 -1107 -1428 -1373 -1078 -1029 -1644 -2246 -2679 -2841 -2696 -2035 -1808 -2238 -2511 -2373 -2131 -1839 -1951 -1808
2926a808j08m48l25L41K22K18M12J19Q1P53K91r1l33j7J33M5l40k76p04o83l77
$$ -1808 -1916 -2364 -2689 -2348 -2126 -1908 -1496 -1377 -1296 -543 -252 -343 -676 -693 -560 -515 -855 -1131 -1835 -2518 -2895
2905b895M2r6K32J47j5l56L28N44P05L84K9o18n32k76J99j52j7J11M09M59L14
$$ -2895 -2853 -2949 -2717 -2570 -2585 -2941 -2613 -2069 -1364 -980 -951 -1569 -2101 -2377 -2178 -2330 -2347 -2236 -1827 -1368 -1054
2884a054l48j6K64M58L15L97K02J71k22o0l92k01l69k52n26k02J0M30L30K69O12
$$ -1054 -1402 -1418 -1154 -696 -381 16 218 389 167 107 -285 -486 -855 -1107 -1633 -1835 -1825 -1395 -1065 -796 -184
2863a84Q90K63L8l56k57Ro3k40j47m37j00J52K25r8J96K98N4k72k06m02j21J79
$$ -184 706 969 1007 651 394 403 340 100 -47 -484 -584 -432 -207 -305 -109 189 243 -29 -235 -637 -758 -579
2841e79M32J91n07r05m16L4Q3J42J75Q9J41J37L16n6m44j48L35J20j15J10q8n06
$$ -579 -147 44 -463 -1368 -1784 -1750 -1667 -1525 -1350 -1261 -1120 -983 -667 -723 -1167 -1315 -980 -860 -975 -865 -953 -1459
2819a459n79k28L9K77N63O21K50k72m64j81Q0L20J71j82L3m0k32J66K34K15J01
$$ -1459 -2038 -2266 -2227 -1950 -1387 -766 -516 -788 -1252 -1433 -1353 -1033 -862 -1044 -1011 -1051 -1283 -1117 -883 -668 -567
2798e67p5k02j35n7jk85m9J33J34R2M91L70L13K63L79l5L2L34O24J22n0l5Q7J10
$$ -567 -642 -844 -979 -1036 -1037 -1322 -1371 -1238 -1104 -1012 -521 -151 162 425 804 769 801 1135 1759 1881 1831 1796 1883 1993
2774A993k63o81m33m77j93l9M00l44l14j0K1k48m4p0m0m30n11n49p2P8J83l23
$$ 1993 1730 1049 616 139 -54 -93 307 -37 -351 -361 -340 -588 -632 -702 -742 -1172 -1683 -2232 -2304 -2226 -2043 -2366
2752b366o3j19k6R5K41Q3R2J95N90K76M85L1l1K50L22l24j24o4J63j05j21m16
$$ -2366 -2429 -2548 -2574 -2479 -2238 -2155 -2063 -1868 -1278 -1002 -517 -486 -517 -267 55 -269 -393 -457 -294 -399 -520 -936
2730i36l31l08J41j89m23p07l05m55o20q3R78J337Q85j69k47l45j9M41K39m32
$$ -936 -1267 -1575 -1434 -1623 -2046 -2753 -3058 -3513 -4133 -4216 -3238 -1901 -1016 -1185 -1432 -1777 -1796 -1355 -1116 -1548
2710a548k18K89M29L02K86l83n67m36k89j08M6l30k72J3J98L47K72J83J18J91
$$ -1548 -1766 -1477 -1048 -746 -460 -843 -1410 -1846 -2135 -2243 -2197 -2527 -2799 -2786 -2588 -2241 -1969 -1786 -1668 -1477
2690a477m2l34k65j17j34O4L15L81M87L24J47J93K55J77j61l53j67j7l52m34k22
$$ -1477 -1519 -1853 -2118 -2235 -2369 -2305 -1990 -1609 -1122 -798 -651 -458 -203 -26 -187 -540 -707 -724 -1076 -1510 -1732
2669a732K64M05O3m19l23n6L6j10r6k46j37k36J40N43N87R4J76PR3l96m44KJ72
$$ -1732 -1468 -1063 -1000 -1419 -1742 -1798 -1762 -1872 -1968 -2214 -2351 -2587 -2447 -1904 -1317 -1223 -1047 -1040 -947 -1343 -1787 -1785 -1613
2646a613J62M44j40l53k48k03ON22J84o8k45k12p2N53L36J46P4P5l57l99l67m6
$$ -1613 -1451 -1007 -1147 -1500 -1748 -1951 -1945 -1423 -1239 -1307 -1552 -1764 -1836 -1283 -947 -801 -727 -652 -1009 -1408 -1775 -1821
2624a821M6M63K15J34j64j88j06K77K67N44k12m53n21k95m33Qj79J2J10K90J43
$$ -1821 -1775 -1312 -1097 -963 -1127 -1315 -1421 -1144 -877 -333 -545 -998 -1519 -1814 -2247 -2239 -2418 -2406 -2296 -2006 -1863
2603a863k8k96j75NO9k76K3J18M36M38L65Ok07o11l33j54R0l99k78O3M66M34K51
$$ -1863 -1891 -2187 -2362 -2357 -2288 -2564 -2541 -2423 -1987 -1549 -1184 -1178 -1385 -1996 -2329 -2483 -2393 -2792 -3070 -3007 -2541 -2107 -1856
2580a856J08O04M79J42R4R5m17o90n87j92jo5o3J83K14N8p6R8J88L57R2j3j45
$$ -1856 -1748 -1144 -665 -523 -429 -334 -751 -1441 -2028 -2220 -2221 -2286 -2349 -2166 -1952 -1894 -1970 -1872 -1684 -1327 -1235 -1248 -1393
2557a393j2Q9j88j44O9K96J93K18J34P2J65Q6k95m75k09j53m55p85m88K65O73
$$ -1393 -1405 -1316 -1504 -1648 -1579 -1283 -1090 -872 -738 -666 -501 -415 -710 -1185 -1394 -1547 -2002 -2787 -3275 -3010 -2337
2536b337O22J27k75l99J97J00m67n64K69O58O96K03k23m22K4L36N08J8L46P7l96
$$ -2337 -1715 -1588 -1863 -2262 -2065 -1965 -2432 -2996 -2727 -2069 -1373 -1170 -1393 -1815 -1791 -1455 -947 -929 -583 -506 -902
2515i02q19k78M40N72lk77l84R8j14j91K3K33rj72q7K35J6K51M30L38m19n35j62
$$ -902 -1721 -1999 -1559 -987 -990 -1267 -1651 -1553 -1667 -1858 -1835 -1602 -1611 -1783 -1870 -1635 -1619 -1368 -938 -600 -1019 -1554 -1716
2492a716O33P84O01L87K64l89n63j060q48q6K93J94N79K90J1n54o34l2O76P89
$$ -1716 -1083 -299 302 689 953 564 1 -1059 -1907 -1993 -1700 -1506 -927 -637 -626 -1180 -1814 -1846 -1170 -381
2472c81O05k15l42p27o65j99O14N82L38N6k09n29%N53K94k97N6J61l57n45K0K40
$$ -381 224 9 -333 -1060 -1725 -1924 -1310 -728 -390 -334 -543 -1072 -1072 -519 -225 -522 -466 -305 -662 -1207 -1187 -947
2450i47M70K00J30j33K6J80J77Kk13l37j13j78j88K51L90j78j58J69K67m43m65
$$ -947 -477 -277 -147 -280 -254 -74 103 105 -108 -445 -558 -736 -924 -673 -283 -461 -619 -450 -183 -626 -1091
2429a091l71n9q4j08r1J8j22kJ09k08n99n13l03J90P79L35k02R1L69L19P4j87
$$ -1091 -1462 -1521 -1605 -1713 -1804 -1786 -1908 -1910 -1801 -2009 -2608 -3121 -3424 -3234 -2455 -2120 -2322 -2231 -1862 -1543 -1469 -1656
2407a656L40M22M38N92L64l9n40p11k45J21L93J23k18k73j87nJ22L5l4j04o3l46
$$ -1656 -1316 -894 -456 136 500 461 -79 -790 -1035 -914 -521 -398 -616 -889 -1076 -1081 -959 -924 -958 -1062 -1125 -1471
2385a471j51L03N17n42j135j137k48J038J796J390P33j72m78l05QK93L16o64n55
$$ -1471 -1622 -1319 -802 -1344 -2479 -3616 -3864 -2826 -1030 360 1093 921 443 138 146 439 755 91 -464
2366d64m21K31J94l2p7m51j193n51J87R03O83p4o68j80N27J253P86np16m07j68
$$ -464 -885 -654 -460 -492 -569 -1020 -2213 -2764 -2577 -1674 -991 -1065 -1733 -1913 -1386 -133 653 648 -68 -475 -643
2345f43N6L77M05l67m83n0L92L92M85N39P67L28Ll99j92n73n34m85k39k32R3M90
$$ -643 -587 -210 195 -172 -655 -705 -313 79 564 1103 1870 2198 2201 1802 1610 1037 503 18 -221 -453 -360 130
2323A30M79k23j50q7m4j85P6J70Q0k34L32Q74R95J58o53j202q25l93q15j495j094
$$ 130 609 386 236 149 105 -80 -4 166 246 12 344 1218 2213 2371 1718 516 -309 -702 -1517 -3012 -4106
2302d106k17Q54J557J653Q09J65M34R94N90l05j302j852r75M86J262R19l92j091
$$ -4106 -4323 -3469 -1912 -259 550 715 1149 2143 2733 2428 1126 -726 -1701 -1215 47 966 574 -517
2284e17k89J023J138K34j180j473j41J269J859J453M18k42J31O79K7k033m091
$$ -517 -806 217 1355 1589 409 -1064 -1205 64 1923 3376 3794 3552 3683 4362 4389 2356 -1735
2267a735m547k283N84K175J573l11j670j368k81K21o71j914l061k221J339N428
$$ -1735 -6282 -8565 -7981 -5806 -4233 -4544 -6214 -7582 -7863 -7642 -8313 -10227 -13288 -15509 -14170 -8742
2251h742O613M297n11m305o546n653j054M284N711L658J065K0q58k69J382J737
$$ -8742 -2129 2168 1657 -2648 -9194 -14847 -15901 -11617 -5906 -2248 -1183 -1163 -2021 -2290 -908 829
2235H29m10j409K44L058L719K295j19k043l528k784j165j67p40q02L02J626J667
$$ 829 419 -990 -746 2312 6031 8326 8207 6164 2636 -148 -1313 -1480 -2220 -3022 -2720 -1094 573
2218E73Q64l59q27m86L14M42P25K20kM72R50P76P0j313j739j543q99n32l03k46
$$ 573 1437 1078 251 -235 79 521 1246 1466 1464 1936 2886 3662 3732 2419 680 -863 -1762 -2294 -2597 -2843
2198b843K04L82J096J664J519O12m21j630j443o95j98j60k2q7j99N11J505R15
$$ -2843 -2639 -2257 -1161 503 2022 2634 2213 583 -860 -1555 -1753 -1913 -1935 -2022 -2221 -1710 -205 710
2180G10l55j248j032m06N12Q98M73j25K9J66R4p5k07n01m71k05J49k10l73J20
$$ 710 355 -893 -1925 -2331 -1819 -921 -448 -573 -544 -378 -284 -359 -566 -1067 -1538 -1743 -1594 -1804 -2177 -2057
2160b057M66Q34J200M97k53n02j40m28j126n4P43j084j593Q55J514j332j664J907
$$ -2057 -1591 -757 443 940 687 185 45 -383 -1509 -1563 -820 -1904 -3497 -2642 -1128 -2460 -4124 -2217
2142b217K750L44n23Q10K25k311j824J772L164N36j750k25K21k028j884O90J133
$$ -2217 533 877 354 1164 1389 -922 -2746 -974 2190 2726 976 751 972 -1056 -2940 -2250 -1117
2125a117j275j504J347J623k73l79R44M72k82q4N1k46k03m19k09N61R93J09p05
$$ -1117 -2392 -3896 -2549 -926 -1199 -1578 -634 -162 -444 -528 -477 -723 -926 -1345 -1554 -993 0 109 -596
2106e96l37N12M12N6j78j71q2L83l9j51l59q63o45N77M19J07j62j28M3N38J46
$$ -596 -933 -421 -9 47 -131 -302 -384 -1 -40 -191 -550 -1413 -2058 -1481 -1062 -955 -1117 -1245 -1202 -664 -518
2085e18j19j22J61m8J76J84l04p18j15M5K83N8P0K47L01J10L16Pl80p19n60l32
$$ -518 -637 -759 -598 -646 -470 -286 -590 -1308 -1423 -1378 -1095 -1037 -967 -720 -419 -309 7 14 -366 -1085 -1645 -1977
2063a977O7K25O48L3k50K5Jk12K7k44k47l3O04N89L11J87N04J7n55n19r9J86N27
$$ -1977 -1910 -1685 -1037 -1004 -1254 -1229 -1228 -1440 -1413 -1657 -1904 -1937 -1333 -744 -433 -246 258 275 -280 -799 -898 -712 -185
2040a85J19l86o48q3P53R68j21o27n58m81l48N31J247M17k87l11n69k63Nj4l52
$$ -185 -66 -452 -1100 -1183 -430 538 417 -210 -768 -1249 -1597 -1066 181 598 311 0 -569 -832 -827 -841 -1193
2019a193j04K70P4J16L87O90K17M3N7k02J89P53Q98L15k87m98o77n77n40l30l5
$$ -1193 -1297 -1027 -953 -837 -450 240 457 500 557 355 544 1297 2195 2510 2223 1725 1048 471 -69 -399 -434
1998d34l4j03j9L76N37L82K20k71n70m80l6J71l9l27j65m2L57L50K65Q7K85k95
$$ -434 -468 -571 -590 -214 323 705 925 654 84 -396 -432 -261 -300 -627 -792 -834 -477 -127 138 225 510 215
1976B15n66l32q5%O13P25M23N8J56l60l55j21k2m3j9R9M01m7m90n15j15j12k40
$$ 215 -351 -683 -768 -768 -155 570 993 1051 1207 847 492 371 349 306 287 386 787 740 250 -265 -380 -492 -732
1953g32j89n5j47K82M75M96l3k43r9L46J38N3r3kn40k45J71L99L57L87J3q2m11
$$ -732 -921 -976 -1123 -841 -366 130 97 -146 -245 101 239 292 199 197 -343 -588 -417 -18 339 726 739 657 246
1930B46n8M42M41k52l26j92L9j27M73M03r1n64n42o9M55K52K41l78o52p00p0L95
$$ 246 188 630 1071 819 493 301 340 213 686 1089 998 434 -108 -177 278 530 771 393 -259 -959 -1029 -634
1908f34O27J14m11k87J7j64j01J97K13j35J16L24R1J63M20M94L98j90n92n91p2
$$ -634 -7 107 -304 -591 -574 -738 -839 -642 -429 -564 -448 -124 -33 130 550 1044 1442 1252 660 69 -3
1887cL14L19k63j20K00l8j90j98m07k97m5J00M94K13N1K08pj20j69L19N66K2l35
$$ -3 311 630 367 247 447 409 219 21 -386 -683 -728 -628 -134 79 130 338 331 211 42 361 927 949 614
1864F14n34l12lK03j93k60oL29n6j67K9J87J57k66n32m67k81L48L22K7j93J09
$$ 614 80 -232 -235 -32 -225 -485 -491 -162 -218 -385 -356 -169 -12 -278 -810 -1277 -1558 -1210 -888 -861 -1054 -945
1842i45J94N09M32L85q6m88p32j32J61M72L72L71K46J81J96j7p59m65K6o7k45
$$ -945 -751 -242 190 575 489 1 -731 -863 -702 -230 142 513 759 940 1136 1119 360 -105 -79 -146 -391
1821c91Q5l21n12k35J20K06L65L20J36L3M56L28J61q6Kj39j5j01k12l27K12L12
$$ -391 -306 -627 -1139 -1374 -1254 -1048 -683 -363 -227 -194 262 590 751 665 667 528 513 412 200 -127 85 397
1799C97J03o8K95Rj30k67k7j83k81o9M14J92p2j98r1J37O73M96J25m00l37k34
$$ 397 500 432 727 736 606 339 312 129 -152 -221 193 385 313 115 24 161 834 1330 1455 1055 718 484
1777D84j50l05q4K37K13j36k55LN51N04K93l30m77m01j62O5K56P9J5q3K36N6o2
$$ 484 334 29 -55 182 395 259 4 7 558 1062 1355 1025 548 147 -15 50 306 385 400 317 553 609 547
1754E47j50J66L99J97J97N08Q8m40j99L17K62k04j38j69j94j50l55k38j36Q0L88
$$ 547 397 563 962 1159 1356 1864 1952 1512 1313 1630 1892 1688 1550 1381 1187 1037 682 444 308 388 776
1733G76K92Rk71j89j77j16n13o84k80K28N16L16l10m91l75N7M1j30m3O0R3O4J43
$$ 776 1068 1077 806 617 440 324 -189 -873 -1153 -925 -409 -93 -403 -894 -1269 -1212 -1171 -1301 -1344 -1284 -1191 -1127 -984
1710i84J15m9K70J30M06L34J49j0J45l93m10j51j53k88N45P99O58l2k96j80K54
$$ -984 -869 -918 -648 -518 -112 222 371 361 506 113 -297 -448 -601 -889 -344 455 1113 1081 785 605 859
1689H59M51M36M3l70r44n15j42J27k82k02L0L33L56K76l76k98k56k8L45M73O0
$$ 859 1310 1746 1789 1419 475 -40 -182 -55 -337 -539 -509 -176 180 456 80 -218 -474 -502 -157 316 376
1668C76k42l33l03o70J26R16R38K55j1l45k78l58j14k74M23N59O5j37N4k62p3
$$ 376 134 -199 -502 -1172 -1046 -130 808 1063 1052 707 429 71 -43 -317 106 665 730 593 647 385 312
1647C12j03j17q8L22J22j11M9j62j67J27K64K60l14k84J09K90j2N3Q3L53O43O17
$$ 312 209 92 4 326 448 337 386 224 57 184 448 708 394 110 219 509 497 550 633 986 1629 2246
1625B246M49Q3n47o29l76k67k65k31j97Ok4j0M9N4j42k38l9K53L11Ro5j80k49
$$ 2246 2695 2778 2231 1602 1226 959 694 463 266 272 248 238 287 341 199 -39 -78 175 486 495 430 250 1
1602Aj20J09J64M25M88o5k86k80m38j92j42J41P1J10J26K22O46O34jo24p69m26
$$ 1 -119 -10 154 579 1067 1002 716 436 -2 -194 -336 -195 -124 -14 112 334 980 1614 1613 989 220 -206
1580b06m34J33N03J76j63M10N47K40l49k54j65j27l69k16K50N95K43M23R6j10
$$ -206 -640 -507 -4 172 9 419 966 1206 857 603 438 311 -58 -274 -24 571 814 1237 1333 1223
1560A223k2n3l21q3j01j00nL15J13M05L31%k46NJ09J34R0O9j65k34l59j27L00
$$ 1223 1201 1148 827 744 643 543 538 853 966 1371 1702 1702 1456 1461 1570 1704 1794 1863 1698 1464 1105 978 1278
1537A278M13k6J05r6p8m10l34k28m28o11R7J51J81O3M6J03K60j23k8j43j04j12
$$ 1278 1691 1665 1770 1674 1596 1186 852 624 196 -415 -318 -167 14 77 123 226 486 363 335 192 88 -24
1515b4K68L06M34J46k5J2R9j55O4L90L43R7k27k30mk65m36m02m4J74M42J5r8j13
$$ -24 244 550 984 1130 1105 1117 1216 1061 1125 1515 1858 1955 1728 1498 1494 1229 793 391 347 521 963 978 880 767
1491G67l6K15J10j50M9J82k99m76j83k58r0J09J91k30k90O5N97M18J1k47l50P8
$$ 767 731 946 1056 906 955 1137 838 362 179 -79 -169 -60 131 -99 -389 -324 273 691 702 455 105 183
1469A83L70L56J35j39k46J27J95j26k19l3K15L92K60K76J12j72l00J3j18L6N68
$$ 183 553 909 1044 905 659 786 981 855 636 603 818 1210 1470 1746 1858 1686 1386 1399 1281 1317 1885
1448A885P41M83J39m60o65o91l82k14Q8K12M56N9J49M88N14L77O59K20k10o65
$$ 1885 2626 3109 3248 2788 2123 1432 1050 836 924 1136 1592 1651 1800 2288 2802 3179 3838 4058 3848 3183
1428C183p14o71j18jJ55j24o2L2rk47j0k1J19N5K53k85l49j70J47Q0Lp3J85J76
$$ 3183 2469 1798 1680 1679 1834 1710 1648 1680 1671 1424 1414 1393 1512 1567 1820 1535 1186 1016 1163 1243 1246 1173 1358 1534
1404A534M62o6l01j08L49K25j89m74m03o46k88O2M64O85N21p0m46k53M23K23o0
$$ 1534 1996 1930 1629 1521 1870 2095 1906 1432 1029 383 95 157 621 1306 1827 1757 1311 1058 1481 1704 1644
1383A644j62l35o99jL00J22j88q8j52l50m19L67M99L39K32J00K6p5j82k52j49
$$ 1644 1482 1147 448 447 747 869 681 593 441 91 -328 39 538 877 1109 1209 1235 1160 978 726 577
1362E77J59K14K75K73J91q3n9J21N0k08n3K46L64L00L12p1m35o24m64oK61M14
$$ 577 736 950 1225 1498 1689 1606 1547 1668 1718 1510 1457 1703 2067 2367 2679 2608 2173 1549 1085 1079 1340 1754
1340A754N33K87K34K85M07R50J302J336J478R48k98j284j601j030o91n47k82J61
$$ 1754 2287 2574 2808 3093 3500 4450 5752 7088 8566 9514 9216 7932 6331 5301 4610 4063 3781 3942
1322C942O6j09l66m77k38L43P01P38O85R58R99P87m02j333j360o83k31j87l17
$$ 3942 4008 3899 3533 3056 2818 3161 3862 4600 5285 6243 7242 8029 7627 6294 4934 4251 4020 3833 3516
1303C516k99m31k7K85P0o22l99j37k27m82l73k61J42R7k35p35l70LO23J19m93
$$ 3516 3217 2786 2759 3044 3114 2492 2093 1956 1729 1247 874 613 755 852 617 -118 -488 -485 138 257 -236
1282b36o73k47K99P19K67J51m42p18k35R2r3R9k48P4J46k40j21O17L10J08j5k09
$$ -236 -909 -1156 -857 -138 129 280 -162 -880 -1115 -1023 -1116 -1017 -1265 -1191 -1045 -1285 -1406 -789 -479 -371 -386 -595
1260e95m70k00l34j37J02O14M51Q3m40k65k02J78M28N30L19J05J12L05J92p4l80
$$ -595 -1065 -1265 -1599 -1736 -1634 -1020 -569 -486 -926 -1191 -1393 -1215 -787 -257 62 167 279 584 776 702 322
1239C22o65n70R5K13J28o1K27M53N11J80o5k55l10j88L10Q7m15k21R6J2j62l50
$$ 322 -343 -913 -818 -605 -477 -538 -311 142 653 833 768 513 203 15 325 412 -3 -224 -128 -116 -278 -628
1217f28M21P05L00P3k54j76k07m89k44Q6O4j15J26K46j05M8J59m7L03N97n8n44
$$ -628 -207 498 798 871 617 441 234 -255 -499 -413 -349 -464 -338 -92 -197 -149 10 -37 266 863 805 261
1195B61m75j59L22N70J03k05k34j4m5k25k51n3k44j17rJ16k0r5j31n0N5O43O26
$$ 261 -214 -373 -51 519 622 417 183 169 124 -101 -352 -405 -649 -766 -775 -659 -679 -774 -905 -955 -900 -257 369
1172C69L10KL07K47M59N62Q12L51k99o54m93o32m74m49K27L58L11P9o6k78k15
$$ 369 679 681 988 1235 1694 2256 3068 3419 3120 2466 1973 1341 867 418 645 1003 1314 1393 1327 1049 834
1151H34n6N9J74Qn91m15j81K88L15M08O1m21p94l05J50M23o4j68p7M04N90L59
$$ 834 778 837 1011 1019 428 13 -168 120 435 843 904 483 -311 -616 -466 -43 -107 -275 -352 52 642 1001
1129A001J03L86L14L47j8j49n02l97Q5M55M6m62l97K98M05L46J92J02j77j43k0
$$ 1001 1104 1490 1804 2151 2133 1984 1482 1085 1170 1625 1671 1209 812 1110 1515 1861 2053 2155 1978 1835 1815
1108A815K6k22l46l77l5k4p1J6k05l33K76M23J23m62m81j32m4M6L93L88L18L05
$$ 1815 1841 1619 1273 896 861 837 766 782 577 244 520 943 1066 604 123 -9 -53 -7 386 774 1092 1397
1086A397J93k26m85j84K40j82k78o2k99k87J1mj44j86m4K21L17N0J25O23J86o32
$$ 1397 1590 1364 879 695 935 753 475 413 114 -173 -162 -166 -310 -496 -540 -319 -2 48 173 796 982 350
1064C50l67N5j35j32l27m9J09l1n0K6Q6K50K08j23j93J73J74M05N41J37m97m05
$$ 350 -17 38 -97 -229 -556 -605 -496 -527 -577 -551 -465 -215 -7 -130 -323 -150 24 429 970 1107 610 205
1042B05j96K4l58l18P1K87M4K70K49O4K3j12n20p4j61k43l35l19l57K9P04P76
$$ 205 9 33 -325 -643 -572 -285 -241 29 278 342 365 253 -267 -341 -502 -745 -1080 -1399 -1756 -1727 -1023 -247
1020b47L59J80k03n2l6o5k07J05m0r7k80K08L16K04q8Q1M12P48L88J32l23l36
$$ -247 112 292 89 37 1 -64 -271 -166 -206 -303 -583 -375 -59 145 57 138 550 1298 1686 1818 1495 1159
998A159m72j13J60J36j4K76j31q9OJ97K94jn14r7J16L13k60n21j55j05j06l8m10
$$ 1159 687 574 734 870 856 1132 1001 912 918 1115 1409 1408 894 797 913 1226 966 445 290 185 79 41 -369
975c69m06k83J36K19K98J82K74O4L16j06m80k21l72l34Kj19M6J30k59N6N06M59
$$ -369 -775 -1058 -922 -703 -405 -223 51 115 431 325 -155 -376 -748 -1082 -1080 -1199 -1153 -1023 -1282 -1226 -720 -261
953b61M12j5m5L77L67J21o4m19o67m14L22O80J35q0R6k1n15l72J35J41K7k61m68
$$ -261 151 136 91 468 835 956 892 473 -194 -608 -286 394 529 449 545 524 9 -363 -228 -87 -60 -321 -789
930g89k96k9K23J73M17K14R4j63j95k48j38P6L23K59L97M23M0n50k87L4N12O51
$$ -789 -1085 -1114 -891 -718 -301 -87 7 -156 -351 -599 -737 -661 -338 -79 318 741 781 231 -56 -22 490 1141
908A141M52J86l95j001o78J1L67O3K95J54M9n0M0J91K25k38k44jM28K6n01p94
$$ 1141 1593 1779 1384 383 -295 -284 83 146 441 595 644 594 634 825 1050 812 568 567 995 1021 520 -274
886b74l42L63N66J96J20m11l10k01j45k39j39Q7P20L72p1l3K94M3L18J46j32j28
$$ -274 -616 -253 313 509 629 218 -92 -293 -438 -677 -816 -729 -9 363 292 259 553 596 914 1060 928 800
864H00k08j03R1K20J13m12l0L72O1m34l83k21J75K28J37k2J0J06L70K15J04l08
$$ 800 592 489 580 800 913 501 471 843 904 470 87 -134 41 269 406 384 394 500 870 1085 1189 881
842H81l36n34k94J05L58K66L12O8M8q5j89m10m18q7K28J72j49l94l59k03l25k42
$$ 881 545 11 -283 -178 180 446 758 826 874 789 600 190 -228 -315 -87 85 -64 -458 -817 -1020 -1345 -1587
820a587L73M25J60p2J05L83L49O3J89J37j44k52K05K76O8q5J07L87J45k73l38
$$ -1587 -1214 -789 -629 -701 -596 -213 136 199 388 525 381 129 334 610 678 593 700 1087 1232 959 621
799F21N0M46N65L34J7l60l92n10n25n47R6L97m4l80R2M82K74j96m64o36o5L40
$$ 621 671 1117 1682 2016 2033 1673 1281 771 246 -301 -205 192 148 -232 -140 342 616 420 -44 -680 -745 -405
777d05Q6l77n03k63K28K00L53L31L32N12M05J70J56j01L8K06K96k3r6l92k23j53
$$ -405 -319 -696 -1199 -1462 -1234 -1034 -681 -350 -18 494 899 1069 1225 1124 1162 1368 1664 1641 1545 1153 930 777
755G77j32j64K8j89q8M4K32j08k14J30M52K15J52l47m72j98J55O4J22L2l7J27
$$ 777 645 481 509 320 232 276 508 400 186 316 768 983 1135 788 316 118 273 337 459 491 454 581
733E81M90P8l7k69l04r6K73j55l47l05l76k49K72p8j74M7L06M83O95J18k46m57
$$ 581 1071 1149 1112 843 539 443 716 561 214 -91 -467 -716 -444 -522 -696 -649 -343 140 835 953 707 250
711B50L9K92J43j30j32j46n3k43m86o56k4L32N42L65M23K57o2l43p0J02m5q3j32
$$ 250 289 581 724 594 462 316 263 20 -466 -1122 -1146 -814 -272 93 516 773 711 368 298 400 355 272 140
688A40m70k9K32J04M2J83J99j23m28n81J5O62M82m3k44K84L90p2l54o03l93L2
$$ 140 -330 -359 -127 -23 19 202 401 278 -150 -731 -716 -54 428 385 141 425 815 743 389 -214 -607 -575
666e75k7k59m82m3L94J18j03k9K3j91k77j01L19J87J00J54M5k21j7q5K0K07N35
$$ -575 -602 -861 -1343 -1386 -992 -874 -977 -1006 -983 -1174 -1451 -1552 -1233 -1046 -946 -792 -747 -968 -985 -1070 -1050 -843 -308
643c08N10N78M10L5l72m71n31k67j86r1j29L0k87l30m70K18N16J99q7K89L23N23
$$ -308 202 780 1190 1225 853 382 -149 -416 -602 -693 -822 -792 -1079 -1409 -1879 -1661 -1145 -946 -1033 -744 -421 102
621A02L65N3m39l16q6J72L6l61l53K60L80J77j83Jj5L20K24K97N9Jl42n53n18
$$ 102 467 520 81 -235 -321 -149 -113 -474 -827 -567 -187 -10 -193 -192 -207 113 337 634 693 694 352 -201 -719
598g19l82j49K38K54M01J58j58l21J32J96M77K70Q2q5j23k28k68k92j72j93j48
$$ -719 -1101 -1250 -1012 -758 -357 -199 -357 -678 -546 -350 127 397 479 394 271 43 -225 -517 -689 -882 -1030
577a030m7N25L94L55J99l0l50j34j56l07k89J01j32l76k57j01n7K07K45L0k2Q4
$$ -1030 -1077 -552 -158 197 396 366 16 -118 -274 -581 -870 -769 -901 -1277 -1534 -1635 -1692 -1485 -1240 -1210 -1232 -1148
555a148k79k83k89k64K2N8J53K16J17L75M70K32N9L9J37O6k39k8L57K84K75K92
$$ -1148 -1427 -1710 -1999 -2263 -2241 -2183 -2030 -1814 -1697 -1322 -852 -620 -561 -522 -385 -319 -558 -586 -229 55 330 622
533F22J27j49o26p52n29k67K63N20O45J13k71j35J31M65K33l43k33j07k3L4m6
$$ 622 749 600 -26 -778 -1307 -1574 -1311 -791 -146 -33 -304 -439 -308 157 390 47 -186 -293 -316 -282 -328
512c28l68l23nP8j54J00J09k64m80K78J22J26K43J85m10m00n03j59K02O02N73
$$ -328 -696 -1019 -1024 -946 -1100 -1000 -891 -1155 -1635 -1357 -1235 -1109 -866 -681 -1091 -1491 -1994 -2153 -1951 -1349 -776
491g76K56j89j11j90k0l38k08M32J023P46J16k97m97n88k19j90R1l6k13j85J24
$$ -776 -520 -709 -820 -1010 -1030 -1368 -1576 -1144 -121 625 741 444 -53 -641 -860 -1050 -959 -995 -1208 -1393 -1269
470a269M73O97m8rj10o03o13j47J73J23m32p0Q3K0l83l43k37pR6P15M54K87K18
$$ -1269 -796 -99 -147 -156 -266 -869 -1482 -1629 -1456 -1333 -1765 -1835 -1752 -1732 -2115 -2458 -2695 -2702 -2606 -1891 -1437 -1150 -932
447i32L51K1l80m48J56K09N7J11J19j16l44j06L55P0K1l9k15O2L15L5k37o17m29
$$ -932 -581 -560 -940 -1388 -1232 -1023 -966 -855 -736 -852 -1196 -1302 -947 -877 -856 -895 -1110 -1048 -733 -698 -935 -1552 -1981
424a981m9L9l01j39M30L72J02R0l1k93j90L8K23O85P26J50k44n02m61L1M16J64
$$ -1981 -2030 -1991 -2292 -2431 -2001 -1629 -1527 -1437 -1468 -1761 -1951 -1913 -1690 -1005 -279 -129 -373 -875 -1336 -1305 -889 -725
402g25L34M75M20J87N8k59k19N9j68l00k67l53m00Q3L45j51k91l41j85P0L3j34
$$ -725 -391 84 504 691 749 490 271 330 162 -138 -405 -758 -1158 -1075 -730 -881 -1172 -1513 -1698 -1628 -1595 -1729
380a729J20L83O34M73K89J57Q0l2l42q87n02L1M59M94M86K98q0o49o74o60R0O85
$$ -1729 -1609 -1226 -592 -119 170 327 407 375 33 -854 -1356 -1325 -866 -372 114 412 332 -317 -991 -1651 -1561 -876
358h76O10m2n16k79J92N3L67K58J33M1l28m61L19N73M44J24P6l38k47m38j38L6
$$ -876 -266 -308 -824 -1103 -911 -858 -491 -233 -100 -59 -387 -848 -529 44 488 612 688 350 103 -335 -473 -437
336d37L57K11P3k96l90n50k02K35M35k71m67j45J76M09K14j48N0L9K20L61O16
$$ -437 -80 131 204 -92 -482 -1032 -1234 -999 -564 -835 -1302 -1447 -1271 -862 -648 -796 -746 -707 -487 -126 490
315D90L54M2m34m57m53k34k85M7L30J73k51k0J57J77j25j56K7n6m86o1L67J31
$$ 490 844 886 452 -5 -458 -692 -977 -930 -600 -427 -678 -698 -541 -364 -489 -645 -618 -674 -1160 -1221 -854 -723
293g23j25j11n2j06n32o14l66J20M79N13Ol98m92n39p6J87J61N98L27q03q75l08
$$ -723 -848 -959 -1011 -1117 -1649 -2263 -2629 -2509 -2030 -1517 -1511 -1909 -2401 -2940 -3016 -2829 -2668 -2070 -1743 -2546 -3421 -3729
271c729M59Q97R90O77K02k20k23k06r6M99O50N17K35m68j182j205n56K83Q18R72
$$ -3729 -3270 -2373 -1383 -706 -504 -724 -947 -1153 -1249 -750 -100 417 652 184 -998 -2203 -2759 -2476 -1658 -686
251f86P12m5r61j028r6L09J38k1L54M24K36o6N8j74j11Q0J91k24j02q7O9m9k62
$$ -686 26 -19 -980 -2008 -2104 -1795 -1657 -1678 -1324 -900 -664 -730 -672 -846 -957 -877 -686 -910 -1012 -1099 -1030 -1079 -1341
228a341m88k90p9M06J81K68J71pl2M64M67K53k02k90l58m16j88K43k89k68k14
$$ -1341 -1829 -2119 -2198 -1792 -1611 -1343 -1172 -1179 -1211 -747 -280 -27 -229 -519 -877 -1293 -1481 -1238 -1527 -1795 -2009
207b009r4KK14L68N16J38J08RL78M28L92p6m24o53n19l64n5m82o14o91m40J72
$$ -2009 -2103 -2101 -1887 -1519 -1003 -865 -757 -748 -370 58 450 374 -50 -703 -1222 -1586 -1641 -2123 -2737 -3428 -3868 -3696
185c696J049J355J053M10j74q13l64J65M51J82r8j21K55K36Q8q7m10n90k3P19
$$ -3696 -2647 -1292 -239 171 -3 -816 -1180 -1015 -564 -382 -480 -601 -346 -110 -22 -109 -519 -1109 -1132 -413
165d13J125J089M21j132j569j174o41n47l20J53L41K84K80J11K17P63M38p3M8
$$ -413 712 1801 2222 1090 -479 -1653 -2294 -2841 -3161 -3008 -2667 -2383 -2103 -1992 -1775 -1012 -574 -647 -599
146e99M07L48J68k33m80m08j11M31L30r27k030k182j351L96J523J438M15j47K67
$$ -599 -192 156 324 91 -389 -797 -908 -477 -147 -1074 -3104 -5286 -6637 -6241 -4718 -3280 -2865 -3012 -2745
127b745O28O73K12n3k47j62m10n49o56p79p77o9O85J176J141J230J218R36O3p64
$$ -2745 -2117 -1444 -1232 -1285 -1532 -1694 -2104 -2653 -3309 -4088 -4865 -4934 -4249 -3073 -1932 -702 516 1452 1515 751
107G51j485j728j550o90q2J92J11K01O70J073M84j75n55k48N77J232J080O98J25
$$ 751 -734 -2462 -4012 -4702 -4784 -4592 -4481 -4280 -3610 -2537 -2053 -2228 -2783 -3031 -2454 -1222 -142 556 681
88F81M25L01k00j115j711k025j603r04q0j16J80Q49J599K424K496J031j37o78
$$ 681 1106 1407 1207 92 -1619 -3644 -5247 -6151 -6231 -6347 -6167 -5318 -3719 -1295 1201 2232 2095 1417
70A417m54o98j283k211k107p28P64J196P38n93p15k22r4l14j35J9L76J064K835
$$ 1417 963 265 -1018 -3229 -5336 -6064 -5300 -4104 -3366 -3959 -4674 -4896 -4990 -5304 -5439 -5420 -5044 -3980 -1145
51a145L704K315M6j111j320j180j030q97j055l85R31K032K448J762L5j872k712
$$ -1145 2559 4874 4920 3809 2489 1309 279 -618 -1673 -2058 -1127 905 3353 5115 5150 3278 566
34E66j928p09N56J286J177N5o96p98n53r70j890l037k767r97J093K120J812J205
$$ 566 -1362 -2071 -1515 -229 948 1003 307 -491 -1044 -2014 -3904 -6941 -9708 -10705 -9612 -7492 -5680 -4475
16d475R68O55L16L81K44p61j215j57J339J686Q89k27r38j045q25o56
$$ -4475 -3507 -2852 -2536 -2155 -1911 -2672 -3887 -4044 -2705 -1019 -130 -357 -1295 -2340 -3165 -3821
0c821
$$ -3821
$$ Imaginary data points
##PAGE= N=2
##DATA TABLE= (X++(I..I)), XYDATA
16383a12445L773M614M354L398K297K031J776J929J857J495J144J940K624L179
$$ -112445 -108672 -104058 -99704 -96306 -94009 -91978 -90202 -88273 -86416 -84921 -83777 -81837 -79213 -76034
16369g6034L554L545L143L185L101L176K682K397K234K406K436K693K676K611
$$ -76034 -72480 -68935 -65792 -62607 -59506 -56330 -53648 -51251 -49017 -46611 -44175 -41482 -38806 -36195
16355c6195K578K436J956J972K103K337K592L011L149L078L152L407L231L004
$$ -36195 -33617 -31181 -29225 -27253 -25150 -22813 -20221 -17210 -14061 -10983 -7831 -4424 -1193 1811
16341A811K548J954J674J920J758J786K122K402K717K775K743L012L055K807K522
$$ 1811 4359 6313 7987 9907 11665 13451 15573 17975 20692 23467 26210 29222 32277 35084 37606
16326C7606K457K428K220J964K386K630K528K271J884J849K494K978K577K092
$$ 37606 40063 42491 44711 46675 49061 51691 54219 56490 58374 60223 62717 65695 68272 70364
16312G0364K147K519K530K142K528K993K270J703J947K508K201K109K247J987
$$ 70364 72511 75030 77560 79702 82230 85223 87493 89196 91143 93651 95852 97961 100208 102195
16298A02195J989K333K480K475K143K188K129K307K327K338J988J618J595J950
$$ 102195 104184 106517 108997 111472 113615 115803 117932 120239 122566 124904 126892 128510 130105 132055
16284A32055K051K275K227K156K194K224K381K368K046K060J899J883J928K202
$$ 132055 134106 136381 138608 140764 142958 145182 147563 149931 151977 154037 155936 157819 159747 161949
16270A61949K165K089J678J519J635J763J737K121J767J463J510J929J745J585
$$ 161949 164114 166203 167881 169400 171035 172798 174535 176656 178423 179886 181396 183325 185070 186655
16256A86655J621J659J818K359K380K105J689J697J495J599J599J693J492J625
$$ 186655 188276 189935 191753 194112 196492 198597 200286 201983 203478 205077 206676 208369 209861 211486
16242B11486J946K005J461J302J121J092J445J944J688J268R02J193J614J798
$$ 211486 213432 215437 216898 218200 219321 220413 221858 223802 225490 226758 227660 228853 230467 232265
16228B32265J433J506J474J403J066J088J243J677J618J616J410J099R48R85R84
$$ 232265 233698 235204 236678 238081 239147 240235 241478 243155 244773 246389 247799 248898 249846 250831 251815
16213B51815J410J537J780J651J481J302J144R85J157J069R28Q31P39Q45J069
$$ 251815 253225 254762 256542 258193 259674 260976 262120 263105 264262 265331 266259 267090 267829 268674 269743
16198B69743J098J275J197J080R10P19J032J296J109J021P20O40Q82J209P80O22
$$ 269743 270841 272116 273313 274393 275303 276022 277054 278350 279459 280480 281200 281840 282722 283931 284711 285333
16182B85333J144Q08O24P20M54O17J068J087J013Q09M74N04Q47J006J179R08Q42
$$ 285333 286477 287285 287909 288629 289083 289700 290768 291855 292868 293677 294151 294655 295502 296508 297687 298595 299437
16165B99437J065J143O46M83P31P76K99K44L80M15P41J174J153N34o7L78R48J067
$$ 299437 300502 301645 302291 302774 303505 304281 304580 304824 305204 305619 306360 307534 308687 309221 309154 309532 310480 311547
16147C11547O37K35k3J59L89R58J007O72N49R39N69K54R3L59M67L00J91L04R4
$$ 311547 312184 312419 312396 312555 312944 313902 314909 315581 316130 317069 317638 317892 317985 318344 318811 319111 319302 319606 319700
16128C19700M46P78R84P91M05r5P8M48O52L27J17J1O43O22L06K73M87N47R76O72
$$ 319700 320146 320924 321908 322699 323104 323009 323087 323535 324187 324514 324631 324642 325285 325907 326213 326486 326973 327520 328496 329168
16108C29168N01P89Q86K86O7l84k17J14J39J01L39Q3J93L68N92M42P9m1L16M64
$$ 329168 329669 330458 331344 331630 331697 331313 331096 331210 331349 331450 331789 331872 332065 332433 333025 333467 333546 333505 333821 334285
16088C34285M26K89N35L59N41L58Nl24j72r8J42L75O03O20K84J38K35R7K11Q1
$$ 334285 334711 335000 335535 335894 336435 336793 336798 336474 336302 336204 336346 336721 337324 337944 338228 338366 338601 338698 338909 338990
16068C38990q0l20r1K9L50L87L63L09K34K80M28J97N5N8J5j64j75J27K38K86L44
$$ 338990 338910 338590 338499 338528 338878 339265 339628 339937 340171 340451 340879 341076 341131 341189 341204 341040 340865 340992 341230 341516 341860
16047C41860N72O21L09o4j14pk06k75R1K50P60O57q9PL50n1m45n66k1M37L64J87
$$ 341860 342432 343053 343362 343298 343184 343177 342971 342696 342787 343037 343797 344454 344365 344372 344722 344671 344226 343660 343639 344076 344440 344627
16025C44627L89L47j35k97J68M1K9lJ68K2k06l34j38k93kK5l8k29j62J57P68O95
$$ 344627 345016 345363 345228 344931 345099 345140 345169 345166 345334 345356 345150 344816 344678 344385 344383 344408 344370 344141 343979 344136 344904 345599
16003C45599M60l8l24j94J4l9L85P7J31K22L21J04K85L74K99j82r7O9o4J32N61
$$ 345599 346059 346021 345697 345503 345517 345478 345863 345940 346071 346293 346614 346718 347003 347377 347676 347494 347397 347466 347402 347534 348095
15982C48095M47L36Oj49k04l8k59l33k33RK99N99K5l41k97K22J59k08o43n65j31
$$ 348095 348542 348878 348884 348735 348531 348493 348234 347901 347668 347677 347976 348575 348600 348259 347962 348184 348343 348135 347492 346927 346796
15961C46796L7p8J29J77M72K57j02l82j55m6R6K27J16j38P3k6NJ07J24j77j13
$$ 346796 346833 346755 346884 347061 347533 347790 347688 347306 347151 347105 347201 347428 347544 347406 347479 347453 347458 347565 347689 347512 347399
15940C47399J86J84p4J26L29K79J55L07N3l90l02Q0k35l55q2K94M26J00r0M00
$$ 347399 347585 347769 347695 347821 348150 348429 348584 348891 348944 348554 348252 348332 348097 347742 347660 347954 348380 348480 348390 348790
15920C48790P66J120M53M7L16K09q7l35j49K63K11k28l18n00l60j60q7J93K00
$$ 348790 349556 350676 351129 351176 351492 351701 351614 351279 351130 351393 351604 351376 351058 350558 350198 350038 349951 350144 350344
15901C50344L3K01N2k9k20l52o37l72J77R7L3J29j16k63m03J85M81N22M86P14
$$ 350344 350377 350578 350630 350601 350381 350029 349392 349020 349197 349294 349327 349456 349340 349077 348674 348859 349340 349862 350348 351062
15881C51062L26k89%N94Q2k97k13L34k3n34n36l36j63O23J113N17k92j20M1K31
$$ 351062 351388 351099 351099 351693 351775 351478 351265 351599 351576 351042 350506 350170 350007 350630 351743 352260 351968 351848 351889 352120
15861C52120jk47p58n93q5M48k83o60P5N91M28O24K29Qm9L9p6k56l64k68j87O8
$$ 352120 352119 351872 351114 350521 350436 350884 350601 349941 350016 350607 351035 351659 351888 351896 351847 351886 351810 351554 351190 350922 350735 350803
15839C50803J33M77L43L79J23R1r4n1j63l13k58K53L07R7l56r0oM81L14o7m52
$$ 350803 350936 351413 351756 352135 352258 352349 352255 352204 352041 351728 351470 351723 352030 352127 351771 351681 351675 352156 352470 352403 351951
15818C51951n88l09K60L88M7k27j91o2K12K29K1j68M2J69m1p7K53J33n9J97M83
$$ 351951 351363 351054 351314 351702 351749 351522 351331 351269 351481 351710 351731 351563 351605 351774 351733 351656 351909 352042 351983 352180 352663
15797C52663O1j65K14M41K22L7m21m80j15K53J87J31P6K64l84q09k91K41N40O51
$$ 352663 352724 352559 352773 353214 353436 353473 353052 352572 352457 352710 352897 353028 353104 353368 352984 352175 351884 352125 352665 353316
15777C53316N60M09P5j1k8O5J53K0k19m84k6J13M04J93j32m9K03j2N1J02K11k97
$$ 353316 353876 354285 354360 354349 354321 354386 354539 354559 354340 353856 353830 353943 354347 354540 354408 354359 354562 354550 354601 354703 354914 354617
15755C54617m68m1P75L04j16j55j17oK14P8l52n77m7J74N25Q37M30o30q35k67
$$ 354617 354149 354108 354883 355187 355071 354916 354799 354793 355007 355085 354733 354156 354109 354283 354808 355645 356075 355445 354610 354343
15735C54343J51r7J8p7M16N54L33K5K29L40N21K32J69q7o0l74n30j79o8k38K25
$$ 354343 354494 354397 354415 354338 354754 355308 355641 355666 355895 356235 356756 356988 357157 357070 357010 356636 356106 355927 355859 355621 355846
15714C55846L07K44J6J10J70K96J09Q8k98k13l8p4jL30K59J32j61m77n28j48K0
$$ 355846 356153 356397 356413 356523 356693 356989 357098 357186 356888 356675 356637 356563 356562 356892 357151 357283 357122 356645 356117 355969 355989
15693C55989L00J27K83L05K34N3P8oL69L18l7o4J4l36o05l55L93M73J94L08J85
$$ 355989 356289 356416 356699 357004 357238 357291 357369 357363 357732 358050 358013 357949 357963 357627 357022 356667 357060 357533 357727 358035 358220
15672C58220k28k54l54k18K29J84j76m06j48K01K59L24L96J11l35l31K12O31N06
$$ 358220 357992 357738 357384 357166 357395 357579 357403 356997 356849 357050 357309 357633 358029 358140 357805 357474 357686 358317 358823
15653C58823L07k11o00k94L98N50L29O1j29m54n38K7M89L75J10n3m18m35r5L25
$$ 358823 359130 358919 358319 358025 358423 358973 359302 359363 359234 358780 358242 358269 358758 359133 359243 359190 358772 358337 358242 358567
15633C58567N09K66p7k16j00n3J5M34L00j98l44q6q7J00K28N61L77K4l0j64m76
$$ 358567 359076 359342 359265 359049 358949 358896 358911 359345 359645 359447 359103 359017 358930 359030 359258 359819 360196 360220 360190 360026 359550
15612C59550L0N57O79l0k04k00Q7L42L41J96J65M6Pk20j12m25n19J13N33J96J88
$$ 359550 359580 360137 360816 360786 360582 360382 360469 360811 361152 361348 361513 361559 361566 361346 361234 360809 360290 360403 360936 361132 361320
15591C61320K65L25k31k64l76j02K17N11L90o6o47k54K96P64K60j52k02K42L14
$$ 361320 361585 361910 361679 361415 361039 360937 361154 361665 362055 361989 361342 361088 361384 362148 362408 362256 362054 362296 362610
15572C62610J11j72k59o91l89K11P59P26P2l29j14l1j12k37J87L35K69L09L08
$$ 362610 362721 362549 362290 361599 361210 361421 362180 362906 362978 362649 362535 362504 362392 362155 362342 362677 362946 363255 363563
15553C63563o1J2j0m9l55k74q8J7k01J74N36K90k54l95o41m83J54N05K33J55J08
$$ 363563 363502 363514 363504 363455 363100 362826 362738 362755 362554 362728 363264 363554 363300 362905 362264 361781 361935 362440 362673 362828 362936
15532C62936P3j7m1M88O36k3j68k49n26n53p12o16k66J3L86L02K37L00p3j43P56
$$ 362936 363009 362992 362951 363439 364075 364052 363884 363635 363109 362556 361844 361228 360962 360975 361361 361663 361900 362200 362127 361984 362740
15511C62740J199N61m09l74J55L71J17m66l60J61O69M03J21l90q74p20n1L01M77
$$ 362740 363939 364500 364091 363717 363872 364243 364360 363894 363534 363695 364364 364767 364888 364498 363624 362904 362853 363154 363631
15492C63631K72N1J2K22K08M4J31J94N4M4j2K03J7k5l54l83k01J90M14N03L96
$$ 363631 363903 363954 363966 364188 364396 364440 364571 364765 364819 364863 364851 365054 365071 365046 364692 364309 364108 364298 364712 365215 365611
15471C65611J28m82k77R6Q53Q87R7k85qk10m22m25l30l11o3J16O03N93L82l80
$$ 365611 365739 365257 364980 365076 365929 366816 366913 366628 366620 366410 365988 365563 365233 364922 364859 364975 365578 366171 366553 366173
15451C66173o59k84M9k94j29N69Q92j00l85L43J040N07m0p40r91q21K40Q03P03
$$ 366173 365514 365230 365279 364985 364856 365425 366317 366217 365832 366175 367215 367722 367682 366942 365951 365130 365370 366173 366876
15432C66876K01n59q79o2N61O08Q0M00M11J86M0k33m48j39J23K84L00j13o97m00
$$ 366876 367077 366518 365639 365577 366138 366746 366826 367226 367637 367823 367863 367630 367182 367043 367166 367450 367750 367637 366940 366540
15412C66540j11q9j32K48M08N1mP60O77R4k2K26j59l75k88k19l41K2N39R28P57
$$ 366540 366429 366340 366208 366456 366864 366915 366911 367671 368348 368442 368420 368646 368487 368112 367824 367605 367264 367286 367825 368753 369510
15391C69510K72R4J95L57q5m94n60m00j83j53N6K58j58l52l94j78K10L12M00N77
$$ 369510 369782 369876 370071 370428 370343 369849 369289 368889 368706 368553 368609 368867 368709 368357 367963 367785 367995 368307 368707 369284
15371C69284L22j03l1K77M60K50l02l20l13m65p68j091r14k48M72J035N33M44
$$ 369284 369606 369503 369472 369749 370209 370459 370157 369837 369524 369059 368291 367200 366286 366038 366510 367545 368078 368522
15353C68522O86J106J218L86q74j580j449l71J44K19l30m74J66J212J426R61J13
$$ 368522 369208 370314 371532 371918 371044 369464 368015 367644 367788 368007 367677 367203 367369 368581 370007 370968 371081
$$ [...]
##END NTUPLES=NMR SPECTRUM
##END=
