##TITLE=Analysis number 315506
Compound Code cc 06313
Book Reference 440/108
Project Code adrs
Chemist Name craigr
##JCAMPDX= 6.0         $$ Bruker NMR JCAMP-DX V2.0
##DATA TYPE= NMR SPECTRUM
##DATA CLASS= NTUPLES
##ORIGIN= Bruker BioSpin GmbH
##OWNER= NMR
$$ XWIN-NMR		Version 3.5
$$ Tue Nov 22 11:34:06 2005 GMT Standard Time (UT+0h)  MAYBRIDGE\NMR@NMR_250MHZ
##.OBSERVE FREQUENCY= 250.131544655141
##.OBSERVE NUCLEUS= ^1H
##.ACQUISITION MODE= SIMULTANEOUS (DQD)
##.ACQUISITION SCHEME= undefined
##.AVERAGES= 16
##.DIGITISER RES= 18
##SPECTROMETER/DATA SYSTEM= dpx250
##.PULSE SEQUENCE= zg30
##.SOLVENT NAME= CDCl3
##.SHIFT REFERENCE= (INTERNAL, CDCl3, 0, 16.522)
##AUDIT TRAIL= $$ (NUMBER, WHEN, WHO, WHERE, WHAT)
$$ ##TITLE= Audit trail, XWIN-NMR		Version 3.5
$$ ##JCAMPDX= 5.01
$$ ##ORIGIN= Bruker BioSpin GmbH
$$ ##OWNER= NMR
$$ C:\u/data/dgb/nmr/ADRS/12820/pdata/1/auditp.txt
$$ ##AUDIT TRAIL=  $$ (NUMBER, WHEN, WHO, WHERE, WHAT)
(   1,<2005-11-22 11:33:35.75 +000>,<MAYBRIDGE\NMR>,<NMR_250MHZ>,
      <created by zg, POWCHK disabled, PULCHK disabled
       configuration hash MD5:
       62 19 C7 07 E1 42 D1 B7 37 6C 3D D0 77 39 F9 E6
       data hash MD5: 64K
       80 55 3E FA FC 3B A4 B2 93 CB 56 09 6A 5F 95 EB>)
(   2,<2005-11-22 11:33:48.78 +000>,<MAYBRIDGE\NMR>,<NMR_250MHZ>,
      <Start of raw data processing
       ef LB = 0.3 FT_mod = 6 PKNL = 1 SI = 32K 
       data hash MD5: 32K
       0D AD 2E 5E B8 06 9F 4D C8 55 A3 8E 66 A1 56 3F>)
(   3,<2005-11-22 11:33:50.90 +000>,<MAYBRIDGE\NMR>,<NMR_250MHZ>,
      <apk 
       data hash MD5: 32K
       7B E0 DB EA 07 FC 72 8A 06 AD B2 E6 52 1F 48 E9>)
(   4,<2005-11-22 11:33:51.59 +000>,<MAYBRIDGE\NMR>,<NMR_250MHZ>,
      <abs ABSG = 5 
       data hash MD5: 32K
       06 3E 9C 62 ED EB 53 27 BF F1 0F C6 DB 07 D3 7E>)
$$ ##END=
$$ 
$$ hash MD5
$$ A5 33 A6 6F 8C 9A 58 12 74 F1 5D 3C FD 4B 25 00
##$RELAX= 
##$RELAX= 
##$RELAX= 
##$RELAX= 
##$RELAX= 
##$RELAX= 
##$RELAX= 
$$ Bruker specific parameters
$$ --------------------------
##$DU= <C:\u>
##$EXPNO= 12820
##$NAME= <ADRS>
##$PROCNO= 1
##$TYPE= <nmr>
##$USER= <dgb>
##$AMP= (0..31)
100 100 100 100 100 100 100 100 100 100 100 100 100 100 100 100 100 100 
100 100 100 100 100 100 100 100 100 100 100 100 100 100 
##$AQSEQ= 0
##$AQ_mod= 3
##$AUNM= <au_zg>
##$AUTOPOS= <19 >
##$BF1= 250.13
##$BF2= 250.13
##$BF3= 250.13
##$BF4= 250.13
##$BF5= 500.13
##$BF6= 500.13
##$BF7= 500.13
##$BF8= 500.13
##$BYTORDA= 1
##$CFDGTYP= 0
##$CFRGTYP= 5
##$CHEMSTR= <none>
##$CNST= (0..31)
1 1 145 1 1 1 1 1 1 1 1 1 1 1 1 1 1 1 1 1 1 1 1 1 1 1 1 1 1 1 1 1 
##$CPDPRG= <>
##$CPDPRG1= <>
##$CPDPRG2= <>
##$CPDPRG3= <>
##$CPDPRG4= <mlev>
##$CPDPRG5= <mlev>
##$CPDPRG6= <mlev>
##$CPDPRG7= <mlev>
##$CPDPRG8= <mlev>
##$CPDPRGB= <>
##$CPDPRGT= <>
##$D= (0..31)
0 1 0 0 0 0 0 0 0 0.06 0 0 0 0 0 0 0.0002 0 0 0 0 0 0 0 0 0 0 0 0 0 0 
0 
##$DATE= 1132659214
##$DBL= (0..7)
120 120 120 120 120 120 120 120 
##$DBP= (0..7)
150 150 150 150 150 150 150 150 
##$DBP07= 0
##$DBPNAM0= <>
##$DBPNAM1= <>
$$ [...]
##$SUBNAM7= <"">
##$SUBNAM8= <"">
##$SUBNAM9= <"">
##$SW= 20.6930455092707
##$SWIBOX= (0..15)
0 0 3 0 0 0 0 0 0 0 0 0 0 0 0 0 
##$SW_h= 5175.983436853
##$TD= 65536
##$TD0= 1
##$TE= 294.16
##$TE2= 300
##$TE3= 300
##$TEG= 300
##$TL= (0..7)
0 120 120 120 120 120 120 120 
##$TP= (0..7)
150 150 150 150 150 150 150 150 
##$TP07= 0
##$TPNAME0= <>
##$TPNAME1= <>
##$TPNAME2= <>
##$TPNAME3= <>
##$TPNAME4= <>
##$TPNAME5= <>
##$TPNAME6= <>
##$TPNAME7= <>
##$TPOAL= (0..7)
0.5 0.5 0.5 0.5 0.5 0.5 0.5 0.5 
##$TPOFFS= (0..7)
0 0 0 0 0 0 0 0 
##$TUNHIN= 0
##$TUNHOUT= 0
##$TUNXOUT= 0
##$USERA1= <user>
##$USERA2= <user>
##$USERA3= <user>
##$USERA4= <user>
##$USERA5= <user>
##$V9= 5
##$VALIST= <valist>
##$VCLIST= <CCCCCCCCCCCCCCC>
##$VD= 0
##$VDLIST= <DDDDDDDDDDDDDDD>
##$VPLIST= <PPPPPPPPPPPPPPP>
##$VTLIST= <TTTTTTTTTTTTTTT>
##$WBST= 1024
##$WBSW= 4
##$XGAIN= (0..3)
0 0 0 0 
##$XL= 0
##$YL= 0
##$YMAX_a= 453796
##$YMIN_a= -378591
##$ZGOPTNS= <>
##$ZL1= 120
##$ZL2= 120
##$ZL3= 120
##$ZL4= 120
##$ABSF1= 16.522
##$ABSF2= -4.171173
##$ABSG= 5
##$ABSL= 3
##$ALPHA= 0
##$AQORDER= 0
##$ASSFAC= 0
##$ASSFACI= 0
##$ASSFACX= 0
##$ASSWID= 0
##$AUNMP= <proc_1d>
##$AZFE= 0.1
##$AZFW= 0.1
##$BCFW= 0
##$BC_mod= 0
##$BYTORDP= 0
##$COROFFS= 0
##$CY= 12.5
##$DATMOD= 1
##$DC= 0
##$DFILT= <>
##$DTYPP= 0
##$F1P= 14.0000005364418
##$F2P= -0.99999901652339
##$FCOR= 0.5
##$FTSIZE= 32768
##$FT_mod= 6
##$GAMMA= 0
##$GB= 0
##$INTBC= 1
##$INTSCL= 1
##$ISEN= 128
##$LB= 0.3
##$LEV0= 0
##$LPBIN= 0
##$MAXI= 10000
##$MC2= 0
##$MEAN= 0
##$ME_mod= 0
##$MI= 0
##$NCOEF= 0
##$NC_proc= -3
##$NLEV= 6
##$NOISF1= 0
##$NOISF2= 0
##$NSP= 0
##$NTH_PI= 0
##$NZP= 0
##$OFFSET= 16.522
##$PC= 1
##$PHC0= 80.39855
##$PHC1= 6.762607
##$PH_mod= 1
##$PKNL= yes
##$PPARMOD= 0
##$PSCAL= 4
##$PSIGN= 0
##$REVERSE= no
##$SF= 250.13
##$SI= 32768
##$SIGF1= 0
##$SIGF2= 0
##$SINO= 400
##$SIOLD= 32768
##$SREGLST= <1H.CDCl3>
##$SSB= 0
##$STSI= 32768
##$STSR= 0
##$SW_p= 5175.98343685301
##$SYMM= 0
##$S_DEV= 0
##$TDeff= 65536
##$TDoff= 0
##$TI= <Analysis number 999999
Compound Code 99
Book Reference 9
Project Code 9>
##$TILT= no
##$TM1= 0
##$TM2= 0
##$TOPLEV= 0
##$USERP1= <user>
##$USERP2= <user>
##$USERP3= <user>
##$USERP4= <user>
##$USERP5= <user>
##$WDW= 1
##$XDIM= 32768
##$YMAX_p= 320968968
##$YMIN_p= -51636
$$ End of Bruker specific parameters
$$ ---------------------------------
##NTUPLES= NMR SPECTRUM
##VAR_NAME=  FREQUENCY,     SPECTRUM/REAL,   SPECTRUM/IMAG
##SYMBOL=    X,             R,               I
##VAR_TYPE=  INDEPENDENT,   DEPENDENT,       DEPENDENT
##VAR_FORM=  AFFN,          ASDF,            ASDF
##VAR_DIM=   32768,         32768,           32768
##UNITS=     HZ,            ARBITRARY UNITS, ARBITRARY UNITS
##FACTOR=    0.157963299565203, 1,           1
##FIRST=     4132.6476996994, 0,             0
##LAST=      -1043.33573715361, 0,           0
##MIN=       -1043.33573715361, -51636,      0
##MAX=       4132.6476996994, 320968968,     0
$$ Real data points
##PAGE= N=1
##DATA TABLE= (X++(R..R)), XYDATA
$$ [...]
18983A36001Q938R296n826P270J0062j3601P57J6537q47p298J868J1287J4465
18970A88909J3215j30L796K1566J6290O560P307J1185J9019K3954J9442P627J2926
18957C51666J5621J9754J7149J3972K8164Q539n882j086K888J4068K2542K1962
18945E09357J2222K372m463j3817O964K0551J8580m52j1214O491K1852R614k572
18932E75485o453p25Q861K6444L8643K0004K2355M3474L4279M0898N3150N9930
18920I16345N3033M0739M6535P5620Q1944R6150J10281R6293J10891J46809J44425
18909A919065J50078J56345J65078J88713K23531K80854L42422M14236N04656
18900D344978O05730P49947R70962J301325J762782K373438K981420L183682K635729
$$ y = [136001, 144939, 154235, 148409, 155679, 165741, 152140, 152897, 169434, 168587, 161289, 163157, 174444, 188909, 202124, 201994, 205790, 227356, 243646, 250206, 257513, 268698, 287717, 311671, 331113, 338740, 351666, 367287, 387041, 404190, 418162, 446326, 454865, 448983, 447897, 450785, 464853, 487395, 509357, 521579, 523951, 519488, 505671, 512635, 533186, 551766, 551314, 540100, 546591, 568443, 578057, 575485, 569032, 568307, 577168, 603612, 642255, 662259, 684614, 728088, 762367, 803265, 856415, 916345, 969378, 1010117, 1056652, 1132272, 1214216, 1310366, 1420647, 1516940, 1627831, 1774640, 1919065, 2069143, 2225488, 2390566, 2579279, 2802810, 3083664, 3426086, 3840322, 4344978, 4950708, 5700655, 6671617, 7972942, 9735724, 12109162, 15090582, 18274264, 20909993]
18891B0909993J561687R21652J264415K343636L220088K645755M70770j972366
18883C1365630l195478k829537j597192p75331j169718k300398l122023l187025
18875A3188928k649142j930051j346438r60289p06379n38814m35377l26864k51534
18866D044040j89111j37936r5228o0758k4400m967J1164J7401O0181Q0904R4317
18855C795607J22580J46518K12158K90173L64154M32680N54577P30350R45574
18846G594371J239507J704708K322727L022336L473149L224056K179027J165674
18838B5925555J105300K072545L288865L367641J505547j389148l355979l527813
18830B8992513k369968j171037j097430k132763l236249l592578l213433k449522
$$ y = [20909993, 22471680, 23393332, 24657747, 27001383, 30221471, 32867226, 33337996, 31365630, 28170152, 25340615, 23743423, 22968092, 21798374, 19497976, 16375953, 13188928, 10539786, 8609735, 7263297, 6303008, 5596629, 5057815, 4622438, 4295574, 4044040, 3854929, 3716993, 3621765, 3561007, 3536607, 3531640, 3542804, 3560205, 3620386, 3701290, 3795607, 3918187, 4064705, 4276863, 4567036, 4931190, 5363870, 5918447, 6648797, 7594371, 8833878, 10538586, 12861313, 15883649, 19356798, 22580854, 24759881, 25925555, 27030855, 29103400, 32392265, 35759906, 37265453, 35876305, 32520326, 28992513, 26622545, 25451508, 24354078, 22221315, 18985066, 15392488, 12179055, 9729533]
18822I729533j741758j253683r43741p07681n64449m66064m02058l46658k92916
18813C010525k42691j71796j40948j57656j55382j43711j14645j21495j03550
18804A658651r0206q5937r9097r7959q7371q7933o0947m0409m1899m5510n3879
18793H67504n4286l3015k3767l6507m3653k4110k1752k8785l4682k6666j1790
18782E28491k0073k2112n726N327K000j4502j445M339j044o299K77j9044l3868
18769D16321k5771j7041q480j292M627o363o084r074j6222l5360l4801j3696j1805
18756B34959N078J9212K5930J5998O852Q73J5377R130P80o80Q236k011j2886p090
18742C19758l287k8685k1417j9533j4004l753r762j9278j2078o71p936R543J4101
$$ y = [9729533, 7987775, 6734092, 5790351, 5082670, 4518221, 4052157, 3650099, 3303441, 3010525, 2767834, 2596038, 2455090, 2297434, 2142052, 1998341, 1883696, 1762201, 1658651, 1568445, 1482508, 1383411, 1285452, 1198081, 1110148, 1049201, 1008792, 966893, 921383, 867504, 813218, 780203, 756436, 719929, 676276, 652166, 630414, 601629, 566947, 540281, 528491, 508418, 486306, 480580, 485907, 487907, 473405, 471960, 476299, 475255, 468956, 469233, 450189, 416321, 390550, 373509, 365029, 363737, 368364, 362001, 355917, 346843, 330621, 295261, 260460, 246764, 234959, 240037, 259249, 285179, 301177, 308029, 308902, 324279, 333409, 334189, 333509, 341745, 339734, 326848, 319758, 316471, 287786, 266369, 246836, 232832, 229079, 219317, 200039, 187961, 187290, 179354, 188897, 202998]
18729B02998j518J3678J8268K3273O98J233O196R661J3003p19o604r790o899j4561
18715B48917j8785k4404k3022k2018j5085j7713k4956j4012J674j1795k1900k753
18703E4148o292J9461K2353j901P27J1113M211J0628N275n284n384r562q058o154
18689H5281j0835M250K97O202J3026RN720Q772j1944M073j395n256Q934K307j3301
18674I6140N342J4162J4971L339j1674j5012j4185K185P483J288J740q217n259
18661I2303j2501N194J7620l059j2437j4326q407K2070j037p571j7373Q084K201
18648G0761j4762R19j802J086J346o844j6093j4528J7366M544Q912J5368M356
18635G0629j3992R298O481n371l152p57l858O748M364L092P62n532J1661j5933
$$ y = [202998, 201480, 215158, 233426, 256699, 257397, 258630, 264826, 274487, 287490, 286771, 280167, 270377, 263478, 248917, 230132, 205728, 182706, 160688, 145603, 127890, 102934, 88922, 90596, 78801, 56901, 54148, 47856, 67317, 89670, 87769, 88496, 99609, 103820, 114448, 119723, 114439, 109055, 99493, 91435, 85281, 74446, 78696, 78993, 85195, 98221, 98230, 103950, 112722, 100778, 104851, 103456, 98200, 107134, 109441, 96140, 101482, 115644, 130615, 133954, 122280, 107268, 93083, 95268, 102751, 104039, 105779, 97562, 92303, 79802, 84996, 102616, 99557, 87120, 72794, 64387, 86457, 85420, 77849, 60476, 68560, 70761, 55999, 56918, 55116, 56202, 57548, 50704, 34611, 20083, 37449, 41993, 50905, 66273, 70629, 56637, 65935, 72416, 67045, 63893, 63136, 59278, 66026, 70390, 73482, 74244, 68712, 80373, 64440]
18621F4440j728M852j3890L594R397K197O391M496N147j2383N82J6284J1899J579
18607A02857j7207j2166n71Q164J3467q452j3650p627m328O699N342l756o814
18594F1958j4812J181L907K140l050r347J274K82p581N855M090k106n349N035
18580D3477J0562N542Q141k784L612O221R87R44K5175J5888L756M5j1435q288
18566A01843R72k593Q48j586m194K951k924j2354j1713J9512J6073Q325N351k0287
18552A00224n788N255K284M901j963j7395n093N16n136j787j152M914J2839L688
18538I6307j4070j5480n112Q260J1084m776k3142p040M041J1510J1354r903k861
18525F0172J5392N389j5665O74J2350L153M934j603j0281o014R159j732J2588
$$ y = [64440, 62712, 67564, 53674, 57268, 66665, 68862, 75253, 79749, 84896, 72513, 73095, 89379, 101278, 102857, 85650, 73484, 72913, 81077, 94544, 86092, 72442, 64815, 60487, 67186, 72528, 68772, 61958, 47146, 48327, 52234, 54374, 51324, 41977, 43251, 43533, 35952, 41807, 45897, 43791, 38442, 43477, 54039, 59581, 67722, 64938, 68550, 74771, 75758, 76702, 101877, 117765, 121521, 121566, 110131, 101843, 102815, 100222, 101070, 99484, 95290, 98241, 95317, 82963, 71250, 90762, 106835, 115160, 120511, 100224, 94436, 99691, 101975, 106876, 104913, 87518, 82425, 82941, 77805, 76018, 74866, 79780, 92619, 96307, 82237, 66757, 61645, 69905, 80989, 76213, 53071, 46031, 50072, 61582, 72936, 63033, 60172, 75564, 80953, 65288, 65962, 78312, 81465, 86399, 84796, 74515, 68501, 77660, 75928, 88516]
18512H8516o00K074J6621K0277n20p590N596J408L431P700j2989Q459R793N166
18498A47342j7329m452l019J1758l394k502O281j6093m399l396R200l850j5451
18485A00696P13M580j439R401J4200l324r345j1250j7897p295N38J1295O696P055
18471A04624K488q067Q333N651J1793J0748j1974j0682N145Q139J4684M386J1879
18458A57147L015K003O552J1905M126p332O215K525q84O357Q86j37O244J6279
18444B14901j1151R950J163P508P043j4817j3422k039m136j784K233J086j6388
18431A80147p790J128J5055J2065Q785J7054J6228l083J2917K3865M0498L1454
18419C48323o100j1562j1751j2032j5427K764j3435j1097J639J8819J8000J768
$$ y = [88516, 87916, 89990, 106611, 126888, 126368, 118778, 124374, 125782, 129213, 136913, 123924, 132383, 142176, 147342, 130013, 125561, 122542, 134300, 130906, 128404, 134685, 118592, 114193, 110797, 119997, 116147, 100696, 101409, 105989, 104550, 113951, 128151, 124827, 115482, 104232, 86335, 79040, 79578, 90873, 97569, 104624, 107112, 99045, 107378, 113029, 124822, 135570, 123596, 112914, 118059, 126198, 140882, 145268, 157147, 160162, 162165, 168717, 180622, 184748, 177416, 183631, 186156, 185272, 191629, 192515, 192378, 198622, 214901, 203750, 213700, 214863, 222371, 229414, 214597, 201175, 199136, 195000, 193216, 195449, 196535, 180147, 172357, 173485, 188540, 200605, 209390, 226444, 242672, 239589, 252506, 276371, 316869, 348323, 342223, 330661, 318910, 306878, 291451, 294215, 280780, 269683, 271322, 290141, 308141, 309909]
18407C09909Q474L9719J6258l716j4506j6155j6936p072k125J3614J6756k544
18395C41676o671K2322J8497K2032L3955K8158L6471M6558J3365K8179M6739M6234
18383F77515M8422L9035K9059L2255L3508L7892N3891N5448L6499K9506K9850
18372A102880K2966K7847L4168L3188N6506O6919O6553Q1027J19179J55822K01818
18361A968873K58403L59252N13718P45937R92048J142458J007892N13036r1037
18352G410580l97199l12379P7944M19406L47876j74760p43747j042824j019082
18343D565815p98795n53894l80893k63396j88782j34156p8613m9046l5909j9267
18333B063064J9662K0185M9444P5122P2883R8913J17627J35399J88397K04587
$$ y = [309909, 318383, 358102, 374360, 370644, 356138, 339983, 323047, 315975, 313850, 327464, 344220, 341676, 335005, 357327, 375824, 397856, 431811, 459969, 496440, 542998, 556363, 584542, 631281, 677515, 725937, 764972, 794031, 826286, 859794, 897686, 951577, 1007025, 1043524, 1073030, 1102880, 1125846, 1153693, 1187861, 1221049, 1277555, 1344474, 1411027, 1492054, 1611233, 1767055, 1968873, 2227276, 2586528, 3100246, 3846183, 4838231, 5980689, 6988581, 7501617, 7410580, 7013381, 6701002, 6778946, 7198352, 7546228, 7371468, 6627721, 5584897, 4565815, 3767020, 3213126, 2832233, 2568837, 2380055, 2245899, 2167286, 2118240, 2082331, 2063064, 2082726, 2102911, 2152355, 2227477, 2300360, 2399273, 2516900, 2652299, 2840696, 3045283]
18323C045283K22511K45180L26798M73636O57360Q41047Q76192O80573L07017
18314G675597J4412k7225J91280N40010P50571O90307N18579N21199Q59425J570886
18304A3305041K509349L378777L682182K811212R19062p97382j292331n51626
18296B3964284P47662J416956N78822j454192l241351l902525l528632k629891
18288A1951133j760207j194736q28442n63349l71890k43680j39830n2009K1846
18279F818836R9074J80653K40979L41007M49803N79221P42621R03058J087713
18270A1442965J349865J735839K279908L078980M192047N521185O664641O784764
18262D3050194N376586L400803K500397K947771L779335L702554K162235k27644
$$ y = [3045283, 3267794, 3512974, 3839772, 4313408, 4970768, 5811815, 6688007, 7368580, 7675597, 7690009, 7662784, 7854064, 8394074, 9144645, 9834952, 10353531, 10874730, 11734155, 13305041, 15814390, 19193167, 22875349, 25686561, 26605623, 25808241, 24515910, 23964284, 24711946, 26128902, 26707724, 25253532, 22012181, 18109656, 14581024, 11951133, 10190926, 8996190, 8167748, 7604399, 7232509, 6988829, 6848999, 6796990, 6818836, 6917910, 7098563, 7339542, 7680549, 8130352, 8709573, 9452194, 10355252, 11442965, 12792830, 14528669, 16808577, 19887557, 24079604, 29600789, 36265430, 43050194, 48426780, 51827583, 54327980, 57275751, 61055086, 64757640, 66919875, 66692231]
18254F6692231k148501k773250k713507k532315k053479j206629n50657r15737
18246E1798156k138609k991349k631072j437696p10144j541732l549627n225826
18238C1572101n696000n031058l847585k780743k017650j530868j189421r45398
18230H533378p86763o65111n77304m98269m42586l83164l24170k75432k23989
18221D356590j62110j30726j18999j00669m7392k3755J9168N5707J04244J54641
18211D106699K32949L38986N16373P46817J014969J262332J295882R24481L12350
18202A0751838j43786j67709J13128L17915J09991l81225p57637q65789p57661
18193H219065o61940o52265o04764m29872k44447j77567l05309n32185o60872
$$ y = [66692231, 64543730, 61770480, 59056973, 56524658, 54471179, 53264550, 52713893, 51798156, 49659547, 46668198, 44037126, 42599430, 41889286, 40347554, 36797927, 31572101, 25876101, 20845043, 16997458, 14216715, 12199065, 10668197, 9478776, 8533378, 7746615, 7081504, 6504200, 6005931, 5563345, 5180181, 4856011, 4580579, 4356590, 4194480, 4063754, 3944755, 3844086, 3796694, 3772939, 3792107, 3847814, 3952058, 4106699, 4339648, 4678634, 5195007, 5941824, 6956793, 8219125, 9515007, 10439488, 10751838, 10608052, 10440343, 10553471, 10871386, 10981377, 10600152, 9842515, 8976726, 8219065, 7557125, 6904860, 6300096, 5870224, 5625777, 5448210, 5142901, 4610716, 3949844]
18184C949844o49703n45077m05519k89287k15895j81907j51164j20201j00672
18175A290419o2787o6301o7735p5054o8956m9576m3523k7397l1022l5091l0854
18164G32123l5917j6044j6191k0026k5589j3484l352j0323j1325k2654j9732k2784
18152E14702k4096m146J3264j4449j5616L08J0885j000n861l106k2425k5578N700
18139D28582o005j1593j7374j1493K197J2770j087M576K0877J4242J6501L6071
18127D88264L6487N0963M6541L7174M4064N7334Q2399J03650J05777J19187J40207
18116A312047J63758K04492K63133L07951L96005N27942O96148R81563J456982
18107F310021K174743L073068L670756K949094N25939k177419l586821l584275
$$ y = [3949844, 3300141, 2755064, 2349545, 2060258, 1844363, 1662456, 1511292, 1391091, 1290419, 1227632, 1161331, 1093596, 1018542, 949586, 900010, 856487, 829090, 798068, 762977, 732123, 696206, 680162, 663971, 643945, 618356, 604872, 601520, 591197, 579872, 557218, 537486, 514702, 490606, 486460, 499724, 485275, 469659, 469967, 480852, 479852, 473991, 470885, 448460, 422882, 428582, 422577, 410984, 393610, 382117, 384314, 397084, 395997, 400573, 421450, 435692, 452193, 488264, 524751, 575714, 622255, 659429, 703493, 760827, 843226, 946876, 1052653, 1171840, 1312047, 1475805, 1680297, 1943430, 2251381, 2647386, 3175328, 3871476, 4853039, 6310021, 8484764, 11557832, 15228588, 18177682, 18703621, 16526202, 12939381, 9355106]
18099I355106k663964j672944j063934p34649n32669l88405l14470k40620j73142
18090A570309j64734j39689j08882r2393p5959p3782m6654m3120n8106m1449n1944
18079F73597m6073m1320k1100j8152l4526m3355j6722o376j806j2885k9480l0603
18067C71199k1808j4287r463j2332j3436O788J4207r687j6418r942k93n239o498
18054B72791j562r066K380J989J8269N219o434o978j8481n94Q426M033J78m819
18040B65351M387J4116J978K791J1528j875O114J3006M770J063j2799m884J899
18027C07445N080O902R630J0890P407J1825j551M582K701m022j3003M943J918
18014C54747J7897K0580Q730K0537M0136L9703L5833O1171J00409J08982P7956
$$ y = [9355106, 6691142, 5018198, 3954264, 3219615, 2686946, 2298541, 1984071, 1743451, 1570309, 1405575, 1265886, 1157004, 1064611, 988652, 914870, 868216, 825096, 766990, 725541, 673597, 627524, 586204, 565104, 546952, 512426, 469071, 452349, 445973, 444167, 431282, 401802, 371199, 349391, 335104, 325641, 313309, 299873, 306661, 320868, 311181, 294763, 284821, 284528, 279289, 272791, 271229, 262163, 264543, 266532, 284801, 290020, 283586, 276608, 258127, 257533, 265959, 269992, 270170, 265351, 269738, 283854, 285832, 288623, 300151, 298276, 304390, 317396, 322166, 323229, 310430, 305546, 307445, 312525, 319427, 329057, 339947, 347354, 359179, 357628, 362210, 364911, 360889, 347886, 352829, 354747, 372644, 393224, 401954, 422491, 462627, 502330, 538163, 599334, 699743, 808725, 886681]
18003H86681J7678l9889p4713r3630q5861o7933m1728j9521o447l556J666j1991
17991D60756j773J373M576J0103J5619J4775J7074K0850K1867J6447K5415J0781
17979F17863m011J7961O0652N6742M8744O2283P4189O7958O3861O6817N4495M7267
17967A234821M0274O8516P5518Q7072R6608J03401J50502J76967J96602K06894
17957B437175K61105L41463M21934N19716O61819Q45076J063188J395673J913834
17948I860983K533139K941698K599002J197807o97137k016544k303642j745316
17940A2369990q17385J16223R88932J698125J923916J277081k22851j775247k607747
17931A2951037k592006k055152j428717r58576o66298m83687l23123j90872j05334
$$ y = [886681, 904359, 864470, 789757, 696127, 610266, 542333, 500605, 481084, 474637, 471081, 472747, 460756, 458983, 460356, 464932, 475035, 490654, 505429, 522503, 543353, 565220, 581667, 607082, 617863, 613852, 631813, 692465, 749207, 797951, 860234, 934423, 1002381, 1066242, 1133059, 1187554, 1234821, 1275095, 1343611, 1419129, 1506201, 1602809, 1706210, 1856712, 2033679, 2230281, 2437175, 2698280, 3039743, 3461677, 3981393, 4643212, 5488288, 6551476, 7947149, 9860983, 12394122, 15335820, 17934822, 19132629, 18435492, 16418948, 14115306, 12369990, 11552605, 11668828, 12657760, 14355885, 16279801, 17556882, 17334031, 15558784, 12951037, 10359031, 8303879, 6875162, 5916586, 5250288, 4766601, 4443478, 4252606, 4147272]
17922D147272n1002J1460M5984P4693J19882J75165K49136L42778M50968O34819
17912F201155R35460J360234J903505K410490K554103J878230L97894j042616
17904A6598455j671259j449003o43288L42655J301128K288071L215710L660535
17896B3643004L191182J729813l34173k356048l552013l612177k924019j861380
17888A3924189q07155J26070R35621J448770J303454K66851j201962k260203k521925
17879A1213710k168807j587036j113137p85174n71546m31969l09072k14976j42063
17870C889930p6506m9405k5085K8347N5819R8671J86010L04559M47058O72207
17860E531605R98411J440076J939038K221756J828379O24372q14681j689373j753351
$$ y = [4147272, 4096270, 4107730, 4153714, 4228407, 4348289, 4523454, 4772590, 5115368, 5566336, 6201155, 7136615, 8496849, 10400354, 12810844, 15364947, 17243177, 17641071, 16598455, 14927196, 13478193, 12834905, 13177560, 14478688, 16766759, 19982469, 23643004, 26834186, 28563999, 28229826, 25873778, 22321765, 18709588, 15785569, 13924189, 13117034, 13243104, 14178725, 15627495, 16930949, 17197800, 15995838, 13735635, 11213710, 9044903, 7457867, 6344730, 5559556, 4988010, 4556041, 4246969, 4031993, 3889930, 3813424, 3764019, 3738934, 3767281, 3823100, 3921771, 4107781, 4412340, 4859398, 5531605, 6530016, 7970092, 9909130, 12130886, 13959265, 14583637, 13768956, 12079583, 10326232]
17851A0326232j235247n14234J88281Q63091J416945J568665R64722l00164j524150
17842A1754141k135926k060915j623423j136226p80971n77154m66203l88262l04363
17833B280698k15104j76094j51300j44151j23280j00226p5948m5516m7698o2982
17823A138399n6447o1323o7304o0586n2208n9321n2419m6965m8986m2854k9333
17812E60653l5233k8967k5114k6453j4062j1250k3601j6987O688Q67j0167n106
17800C71268j2288j1304L378N417j0266j1441o480J1269J2334K0841M4663M1421
17788D58812L3135K6420k5172m6567m1840l2603j2649n983o885m807l295j8983
17776C19583j9486r890o165j2659j6177j7363l1016k4227o008m234q273k5216
$$ y = [10326232, 9090985, 8576751, 8765032, 9628123, 11045068, 12613733, 13578455, 13278291, 11754141, 9618215, 7557300, 5933877, 4797651, 4016680, 3439526, 2973323, 2585061, 2280698, 2065594, 1889500, 1738200, 1594049, 1470769, 1370543, 1294595, 1249079, 1201381, 1138399, 1081952, 1020629, 953325, 892739, 840531, 781210, 728791, 681826, 632840, 589986, 560653, 525420, 496453, 471339, 444886, 430824, 419574, 395973, 378986, 385674, 386541, 376374, 371268, 358980, 347676, 351054, 356471, 346205, 334764, 328284, 339553, 351887, 372728, 417391, 458812, 491947, 518367, 493195, 446628, 404788, 372185, 359536, 353553, 346668, 341861, 338566, 319583, 300097, 290207, 284042, 271383, 255206, 237843, 206827, 182600, 176592, 172358, 164085, 138869]
17764A38869j626R226m866r415j3608j1527J908O060J6021M470O321K1906K9161
17751A92900J2568J0557J3468J4743L4047J1495K5967J5504J2175r287k286Q306
17739C40157k0876j2137o341q837l2469k5360o694k1229k0116q489j604L578l51
17726A79232j2678j3146m682j3704j8552k808n813q041m109Q97m834L88J98n817
17712H6531r54k505L299o928q024k347J074N229N953N685J0034M067R182M318
17698A14614K137K745K1323L3260R747J0682K0542O031J5556J2502M809j4166
17686B39782k946j7496k9595j8114r196m323n505j1808j3773k680N890r247l962
17673A17027p419r281j0706k0992q040l728J005j095J565O523n120k0196k631
$$ y = [138869, 137243, 146469, 141603, 132188, 118580, 107053, 108961, 115021, 131042, 135512, 141833, 163739, 192900, 205468, 216025, 229493, 244236, 278283, 289778, 315745, 331249, 343424, 334137, 331851, 340157, 319281, 307144, 300803, 291966, 259497, 234137, 227443, 206214, 186098, 177609, 176005, 179583, 179232, 166554, 153408, 148726, 135022, 116470, 113662, 107849, 99808, 95699, 96596, 91762, 92150, 92348, 86531, 85577, 83072, 86371, 79443, 71419, 69072, 70146, 75375, 81328, 87013, 97047, 101114, 110296, 114614, 116751, 119496, 140819, 174079, 183826, 194508, 215050, 221081, 236637, 249139, 253948, 239782, 236836, 219340, 189745, 171631, 162435, 158112, 152607, 140799, 127026, 124346, 130236, 120989, 117027, 109608, 100327, 89621, 68629, 60589, 56861, 57866, 56771, 58336, 64859, 59739, 39543, 36912]
17660C6912M216J7964l77l759J850L75J036o47m581n592j2140j4458m979M835
17646B0655J0874J0864p743j1205O251O586K964J1573N302r625r274R59k638L812
17632C9355o86r165L393r011L475R563n624j8775j033K1876J3794j1011o776R63
17618C0338O022O375R22l052n706K546L037J009q679j359N830M133o835r30Q861
17603D2512j2681j1828Q814N801j0476r41k532N754J8376r324j3468M398r57p216
17589A6232M819P381r654j2440o350l389M323L066K56Q921Q024J4173K866O974
17575D5202L582m909m659j6567j7922n38J156O06J2775L81R466Q452K071L241
17561D2337k159o368r89l192J1o673n565J434l879L409p35n15k289R350M36j1838
$$ y = [36912, 41128, 59092, 58715, 54956, 56806, 57181, 58217, 57570, 52989, 47397, 35257, 20799, 15820, 20655, 31529, 42393, 34650, 23445, 29696, 36282, 39246, 50819, 56121, 46496, 37222, 38181, 35543, 39355, 38669, 29504, 32897, 23886, 27361, 36924, 31300, 12525, 11492, 33368, 47162, 36151, 29375, 30338, 36360, 42735, 43657, 40605, 34899, 37445, 40482, 41491, 32812, 31453, 37283, 41416, 34581, 33651, 42512, 29831, 18003, 26817, 32618, 22142, 21201, 18669, 24423, 42799, 33475, 20007, 24405, 23448, 16232, 21051, 28432, 18778, 6338, -12, -3401, 922, 3988, 4244, 13165, 21189, 35362, 38228, 45202, 48784, 43875, 39216, 22649, 4727, 4189, 5345, 5951, 18726, 19107, 28573, 37025, 39096, 42337, 40178, 33810, 32821, 29629, 29640, 22967, 17402, 18836, 14957, 18366, 17631, 17116, 14827, 24177, 24613, 12775]
17545A2775k489q293l002J415M63k184N719o867l034J1185K588j7523r417n156
17531b3820J457l943l350R604P697M867o437P476J1429o988j378N834R23j153
17517B218M920o566N91Q69N607J6358K698M228j6819n386O131M361J3367l649
17503B8928r990k038k10k347L83N755P529j664j3228q24m378J717O601P626m305
17488A9555m572k2962K975J1932N263P55L186L517k377J988L114j410L402Q7r842
17473A4611k729M164j6808l497R257K657J0988P11L75J529L550m163k87j7027
17459C331L874J4564J0435J103J0369n450r028k222q569j634J2826R683o035j1065
17445B2182L124J1105P899R535P220K8834L3792K7119K7490p51j8245m417k6475
$$ y = [12775, 10286, 1993, -1009, 406, 869, -1315, 4404, -2463, -5497, 5688, 8276, -9247, -18664, -23820, -22363, -26306, -29656, -20052, -12355, -7488, -13925, -6449, 4980, -2008, -3386, 2448, 3371, 2218, 7138, 572, 1163, 2032, 7639, 23997, 26695, 30923, 14104, 8718, 14849, 19210, 32577, 28928, 18938, 16900, 16690, 14343, 14726, 20481, 28010, 26346, 13118, 12294, 7916, 9633, 16234, 23860, 19555, 14983, -7979, -5004, 6928, 12191, 12946, 16132, 19649, 17272, 19260, 22374, 20964, 24366, 24453, 14611, 11882, 16046, -762, -4259, 4998, 7655, 18643, 19354, 19729, 21258, 24808, 20645, 20358, 3331, 7205, 21769, 32204, 33307, 43676, 38226, 29198, 26976, 18407, 16773, 29599, 39282, 33247, 22182, 25306, 36411, 44310, 53845, 61065, 89899, 123691, 150810, 178300, 177549, 159304, 154887, 128412]
17432A28412k3112j1503j7143j279J0257n630j92R255j0471r859k660j0418l634
17419E2023j676l768m081o539L363l485j2939K856o874J031l93q368n88q655M493
17404F400l310J555J2607R442K999J5600J2421J4514R735n889J0022o513q056
17391G1527m216N553R109K1425K4098J3710n326j0127j8992j919n727k681p581
17378H8853O076Q06l767p333o494p087j4512k2841j4424l227o717J197N360J1600
17364B7490o660m711J01j5594j1877O138J5184N08j113M410M180N354J5766R570
17350D8746R506p669o588J5920J9473n958k917R932Q14j0284r652k502j5367J699
17336D5153p35p49J3182O667K595j0771j7234j0925p264L215Q137M078P921r958
$$ y = [128412, 105300, 93797, 76654, 75375, 85632, 80002, 79810, 89065, 78594, 68735, 66075, 55657, 52023, 50347, 46579, 42498, 35959, 39322, 35837, 22898, 25754, 18880, 19911, 19518, 11150, 10562, 1907, 6400, 3090, 4645, 17252, 26694, 29693, 45293, 57714, 72228, 81963, 76074, 86096, 79583, 71527, 67311, 72864, 81973, 103398, 127496, 141206, 135880, 125753, 106761, 104842, 99115, 96434, 88853, 94929, 95735, 91968, 84635, 78141, 71054, 56542, 33701, 19277, 16050, 9333, 10530, 15890, 27490, 20830, 16119, 16220, 626, -11251, -5113, 10071, 10579, 9466, 13876, 18056, 23410, 39176, 48746, 58252, 50583, 43995, 59915, 79388, 73430, 70513, 80445, 81259, 70975, 61323, 58821, 43454, 45153, 44418, 43669, 56851, 63518, 66113, 55342, 38108, 27183, 19919, 23134, 31271, 35349, 43270, 33312]
17322C3312j1820M25j1013k57m906l045K15j1498P38J3975R123P301m551r535
17308H464L83p093o232j3391j0648O133J438M960R049J0347Q031j4480r421j5126
17294b7586m315Q086O897K894o546j040J0189J6087O884Q252o98j178n303j2778
17280a55q501Q5J0955q231j757N56K425j2602q680o404P004J0986J8319L938j2495
17265d557j2114O821J9616J1524o294k033J4555o822j7691n099m531k17j0480
17252a7322j6920O341P220N753n42l711J5774J3509o458m216J1229R957O001p316
17238A9299m922K0484J7536k547j6076r965j3093l231j9452o564O381J2894L109
17225C853p823J3550q445n731N359l658m847K757Q56q909L783n413j9320K193
$$ y = [33312, 21492, 21917, 10904, 10647, 5741, 2696, 2911, -8587, -7849, 6126, 15249, 22550, 17999, 8464, 8847, 1754, -4478, -17869, -28517, -22384, -20946, -15986, -6937, 3410, 11441, -3039, -12460, -27586, -31901, -23815, -16918, -14024, -20570, -21610, -11421, 4666, 11550, 19802, 19104, 17926, 12623, -155, -8656, -8571, 2384, -5847, -7604, -7048, -4623, -17225, -25905, -32309, -25305, -14319, 4000, 7938, -4557, -16671, -9850, 9766, 21290, 14996, 12963, 27518, 20696, 3005, -2094, -6625, -6842, -17322, -34242, -27901, -20681, -14928, -15470, -19181, -3407, 10102, 3644, -572, 10657, 20614, 26615, 19299, 14377, 34861, 52397, 49850, 33774, 23809, 10716, 7485, -11967, -18531, -12150, 744, 3853, -3970, 9580, 1135, -4596, 763, -2895, -7742, -4985, -4129, -13038, -9255, -14668, -33988, -31795]
17211c1795J5550r868q111P956L533O549J6253O371p040k266j7697m825J2283
17198a3107j002j2603P766J2574L881J2759Q58k659N542J2278n994j0144j0248
17185i9J008q536k087O491J1695j2791j9862O541K6428J0606q083j649j366j518
17171F778R06R520l236r470o758j8393M103J7289N982k623L581k139Q534o130
17157G944K807j493n602n870j1045k222R11J1578m458q740l16J1180M108L911
17143B693o049p293R383j558m342j893j147R675L502R047N117j3166l104J2902
17129A3767R774j1583j2979l009k636J0038n734p20j1427l559K463M227K1882
17116A0504J9921P197j5779j7795r243Q391J906Q17P475q29o510j4338P67K495
$$ y = [-31795, -16245, -26113, -34224, -26268, -22735, -16186, 67, 6438, -602, -2868, -20565, -25390, -13107, -14109, -26712, -18946, -6372, -2491, 10268, 11126, 8467, 14009, 26287, 20293, 10149, -99, 909, -7627, -9714, -3223, 8472, -4319, -24181, -17640, 8788, 19394, 11311, 9662, 8296, 6778, 7684, 17204, 13968, 4498, -2260, -20653, -16550, 739, 6721, 4098, 7679, 5540, 14074, 7944, 10751, 9258, 3656, -2214, -13259, -15481, -14570, -2992, -7450, -16190, -16506, -5326, -1218, 2693, -3356, -10649, -1266, -2824, -7166, -9059, -10206, -531, 2971, 12018, 17135, 3969, 865, 13767, 23541, 11958, -1021, -4030, -6666, 3372, -2362, -3082, -14509, -18068, -15605, -11378, 10504, 30425, 37622, 21843, 4048, -5195, 3196, 5102, 5919, 13394, 12565, 6055, -8283, -7516, -5021]
17102e021k927N314R271P703m497k3960o381P727j0576O33J2567K786P516j0907
17088a0752L72J1730K943q835J400m753p434J3597K384l930j672J5261J2137j2311
17074A0137j0496j0480o276o381M149N987r531l724Q048J6568O869l904o404m945
17060a0383L36K391K432j1737O412O6L623J631n320Q42J7955j91j5641J5927j845
17045F498j1133M176J0909k082o589j647K376k183M464n703j0894j91O285k33
17031e947L081J685N457p282K485J1893O18j153J246O899j6565j2412l666k705
17017a6366n166J3769J3268j7788r526J1857J3248L448k737j4788j059M572M138
17004c130o703l281Q136L654j2217l61K475l619M334p783q345J6081q784j070
$$ y = [-5021, -7948, -2634, 6637, 14340, 9843, -14117, -20498, -12771, -23347, -22714, -10147, -7361, 155, -10752, -10380, 1350, 4293, -4542, -3142, -7895, -15329, -1732, 652, -3278, -4950, 10311, 22448, 10137, -359, -10839, -17115, -23496, -19347, -13360, -22891, -26615, -18567, -1999, 4870, 966, -5438, -10383, -10047, -7656, -5224, -16961, -10549, -10483, -6860, -5229, -10549, -9707, 8248, 8057, -7584, 8343, 6498, -4635, -459, 10450, 8368, 1779, 132, 2508, 325, 4789, -914, -11808, -11999, -5714, -5947, -2866, -1181, 4276, -3006, -521, 11372, 11990, 10837, 12083, 18982, 2417, -9995, -13661, -16366, -21532, -7763, 5505, -12283, -21809, -9952, 3296, 6744, 4007, -10781, -11840, -7268, -3130, -9833, -13114, -4978, -1324, -13541, -13902, -11427, -15046, -10712, -18495, -26840, -10759, -19543, -20613]
16990b0613J1735l433o283R125L418P524k837j351L998k534p783k617J4840j127
16976B062l968J0348N683L152L178j2009k887L814J312k5850j0888K111K1150
16963b792L026m271P560J235L217L496q427j2705M369l530J356O519n19P028K529
16948H091q582m328j3255m687N174O347l891R744J978j1050j5280L005P355J1280
16934h099O482k687J567k550O030P06J920o27l194j6679L676O121N1M89J002n497
16918a1289Q004K533k914l57p632j098J2237o603N301m864r666p619M008l711
16904b3670m659N546o677J075L279j0126M029J3428O078j997j280P452J0347o789
16890c964k251J2197M085j0506n389J2157J630j0005k285L370p559L462M299q377
$$ y = [-20613, -8878, -12311, -18594, -9469, -6051, 1473, -1364, -2715, 1283, -1251, -9034, -11651, 3189, 2062, -1906, 8442, 14125, 17277, 20455, 8446, 5559, 9373, 10685, -15165, -26053, -23942, -2792, 234, -4037, 3523, 4758, 7975, 11471, 3044, -9661, -5292, -8822, -7466, -947, -1466, 5562, 8091, -491, -4819, -18074, -22761, -17587, -11240, -15131, -5387, -3409, -14459, -29739, -26734, -19379, -8099, -1617, -4304, -2737, -5287, 743, 1449, 3369, 2742, -452, -17131, -13455, -7334, -7283, -6794, -5792, -11289, -3285, -752, -3666, -4023, -11655, -12753, -516, -7119, -1818, -6682, -16348, -23967, -19959, -23670, -28329, -22783, -29460, -28385, -25106, -35232, -31203, -17775, -11697, -13694, -14974, -7522, 2825, -3964, -6215, 5982, 10067, -439, -5828, 6329, 7959, -2046, -4331, -961, -8520, -5058, -759, -9136]
16876i136J740q809P05J5797P712K944K550J568m848K118N259j2259o074O444
16862E711l479J278M90q577n170p773J2187k92o862J8787k173n979p29J372r973
16847a1182O004j0084k637n436O638L3141J1816j3020j0965R621P008R805P759
16834C8468j8809Q88J3073j2902k8132l38J5233N245r468o800n60O27k020R751
16820D256n275p853N22J4377K3690j0529P24J705j8438o655r722K665K324o869
16806a5078q767J5118J0564j3020q892J8646Q891r946o361p688Q497L853J3006
16793H823P004l012nm225j477n093j3407m220Q886r578l454N021N695p004l231
16778a9277N868n873O4n23M770N627R314R017P68j2855q792J997k444k736m125
$$ y = [-9136, -7396, -16205, -15500, 297, 8009, 10953, 13503, 15071, 10223, 12341, 17600, 5341, -733, 5711, 2232, 3510, 4000, -4577, -9747, -17520, -5333, -5625, -12487, 6300, 4127, -1852, -2581, -1209, -11182, -5178, -15262, -17899, -23335, -16697, 16444, 28260, 15240, 4275, 13896, 20904, 30709, 38468, 19659, 20547, 33620, 20718, -7414, -7752, 7481, 12726, 3258, -3542, -4102, -3475, -5495, 4256, -1019, -8872, -8350, 6027, 29717, 19188, 19912, 21617, 3179, -3476, -13198, -10533, -8209, -15078, -23845, -8727, 1837, -11183, -20075, -1429, 7462, -2484, -8845, -16533, -8036, -4183, 8823, 15827, 12815, 12810, 8585, 7108, 2015, -11392, -15612, -6726, -16304, -19758, -14737, -9042, -16046, -19277, -13409, -19282, -19218, -19741, -14971, -9344, -30, 8987, 9755, -3100, -11892, -9895, -12339, -15075, -19200]
16763a9200J4877J7036m68j2765n091P90J291J1347J2736m920j0158J007Q990
16750A5472l507n737m822j9649O50R416K619M707P45R501J185R96L088j2699j0191
16735h226R890r488p86J4936n643k146q414K416j760r005J563J1617L200N359
16721C513J4086J3574j3835j6198k51N051N526P292P66j8338O141J0350l92p627
16707I658n171K397j998L973M874M891r1j5151p886R11l180K280J3604N79N849
16692A5539Q331n697k5199j3061K1L117M859l569r09l131N189N57J8572L494n516
16677B597J226J04m182r318J02k763K584j0662m584N703P754p84J5355m464q277
16662i609O159n751m888P254K262L166N211q480p931j483q362J5942K19P969J3074
$$ y = [-19200, -4323, 12713, 12245, -520, -5611, -4821, -3530, 7817, 20553, 15633, 5475, 6482, 15472, 11965, 6228, 1406, -18243, -17593, -8177, -5558, -851, -106, 9395, 10580, 11576, 14664, 1965, -8226, 1664, -7824, -8610, 6326, 683, -1463, -9877, -7461, -9221, -18226, -16663, -5046, -1846, 3513, 17599, 31173, 17338, 1140, 889, 5940, 11466, 18758, 19524, 1186, 7327, 17677, 17285, 9658, 4487, 6884, 4886, 8859, 13733, 18624, 18533, 3382, -4504, -3593, -6773, -4493, 9111, 9690, 15539, 23870, 18173, -7026, -20087, -20066, -16949, -12090, -15659, -16568, -19699, -14510, -13953, 4619, 8113, 2597, 3823, 3927, -255, -9573, -9471, -12234, -9650, -20312, -24896, -19193, -11439, -12223, 3132, -1332, -9609, -3450, -9201, -14089, -6835, -4573, -1407, 3804, -4676, -12607, -14090, -22452, -6510, -6291, 1678, 14752]
16647A4752l326j8053l722n881J861K333J769J6588P374j0898j4771j5104K519
16634b4559O421J1038L831J82r841O443J2691m25K584j4083K357J0343n196l598
16620a812n121L064L413K584L66L498l731O640N284r304k6837L353J845P258N193
16605d307O784Q39k270K718P626O52o973Q806q28M784j9861j8413q090L730J1188
16590a3615N889j4399j105M202O773R059K109k196N207m588j90N840J3853l636
16576A3203m801k0875j423p575m8N29M808L735J478K199p477P344L210j2070l981
16561b1744Q208n129n093J7633R973n498l901o76M668P097K161p124P489J295
16547I359j3853j7323J106Q186P420N033O560K208k588r162j1820j9039K0970
$$ y = [14752, 11426, -6627, -10349, -16230, -14369, -12036, -10267, 6321, 13695, 2797, -11974, -27078, -24559, -18138, -7100, -3269, -3087, -12928, -6485, 6206, 5781, 8365, -5718, -3361, 6982, 1786, -1812, -6933, -3869, -456, 2128, 2494, 5992, 2261, 8901, 14185, 4881, -21956, -18603, -16758, -9500, -4307, 2477, 3316, 1046, 3764, 11390, 12042, 5069, 13875, 13047, 17831, -2030, -20443, -28533, -24803, -13615, -7726, -22125, -23230, -19028, -12255, -3196, -1087, -3283, 1924, -2664, -2854, 2986, 16839, 13203, 8402, -12473, -13896, -21471, -21519, -20990, -16182, -12447, -10969, -8770, -16247, -8903, -5693, -17763, -21744, -13536, -18665, -23758, -6125, 3848, -1650, -5551, -6227, -1559, 5538, 7699, 575, 8064, 9359, -4494, -21817, -20711, -12525, -5105, -72, 6488, 8696, 6108, -3054, -14874, -33913, -12943]
16534a2943R687k686j219l542R495J1559k62j0161j3304K57n858j1509j1584N166
16520c6904M029L554K0084J7367J528O402o709k389p759l401j7580l93Q797n628
16506a9002Q105K13L787m946r380o178l201O359O969P365J1081m788N383r286
16492g519j3656o756O742j856j272Q570P110m5N24J6277q427k440l126K213r515
16477a3176k145N411M135j589j0587q226n68P909P535JO738P49o29R644r028N624
16461A798R74n959j2992r051j2754R399J346K948Q329J1002q965j858O437N69
16447h777m316n669K360L242L545M565m445o542o417o52n168O399K433k156N132
16432a6466O201m155r907n459N824R13L46R900J3381n727p144q44q406M412M679
$$ y = [-12943, -3256, -5942, -7161, -10703, -1208, 10351, 10089, -72, -13376, -13119, -18977, -30486, -42070, -36904, -32875, -29321, -9237, 8130, 9658, 16060, 9351, 6962, -797, -4198, -21778, -22171, -13374, -19002, -10897, -10684, -6897, -11843, -21223, -27401, -30602, -24243, -17274, -9909, 1172, -3616, 1767, -7519, -21175, -27931, -21189, -23045, -24317, -15747, -8637, -8682, -8158, 8119, -308, -2748, -5874, -3661, -13176, -15321, -9910, -5775, -7364, -17951, -26177, -26745, -18836, -11301, -11300, -4562, -3813, -4442, 5202, -3826, 1798, 2772, -3187, -16179, -25230, -37984, -28585, -27239, -24291, -15962, -4960, -13925, -15783, -9346, -8777, -13093, -18762, -16402, -13160, -9615, -5050, -9495, -16037, -22454, -23106, -28274, -21875, -19442, -21598, -16466, -10265, -14420, -24327, -29786, -23962, -23049, -22703, -12803, 578, -5149, -12293, -13137, -21543, -17131, -12452]
16417a2452Q033J678j176R06L611l459K025j0288j0805Q337O940p208o536Q512
16403a1882j033R413N938J5461L031o174p54k78j4279o785r432J1692N71l615
16389h126N697q87K191N167p649j1447L387J1517l656m427K392J608P777j407
16375B137l238M939M003O906l977j6506j789k219K526q792M3P187M24j1635J17
16360a9874l183o46M554k220J9753j466j9101n388r917J3322Q119P266O64r336
16346a7453l634J0976K4859J4352r476j8252j9191j3081j2773J4714P758L105
16334a8096J3524r842m98q129q614K490K559j953K142m821P421R825J686R106
16320c200j402M384m578j6228j2707J2673P746M792J5085q026r187N946L37l770
$$ y = [-12452, -4419, -2741, -3917, -3011, 600, -2859, -834, -11122, -21927, -13590, -6650, -13858, -20394, -11882, -12915, -3502, 2436, 17897, 20928, 14754, 14000, 13722, -557, -7342, -16774, -5082, -4511, -8126, -2429, -3316, -1125, 4042, -3607, -15054, -11667, -150, -3806, -8233, -5841, -4233, 3544, 2137, -1101, 3838, 7841, 14747, 10770, -5736, -7525, -9744, -7218, -16010, -15967, -8780, -8356, -19991, -19874, -23057, -23703, -19149, -21369, -1616, -3082, -22183, -27571, -37488, -24166, -16047, -8781, -8117, -17453, -21087, -10111, 14748, 29100, 19624, 1372, -17819, -30900, -43673, -28959, -21201, -18096, -4572, -14414, -14912, -23041, -31655, -29165, -26606, -28559, -26417, -31238, -23817, -13992, -12306, -3200, -4602, -218, -4796, -21024, -33731, -21058, -13312, -8520, 6565, -1461, -10648, -4702, -4365, -8135]
16306h135J0520p973j4695j741K047N350R120j487j0060n711J2110Q456J2484
16293A0285p04j5593j2584k850N724J5584Q66o131L064K113J684j3194J692Q0
16279i964q84N141Q884N846n303p061m406R401L784n667j1297J608p269K330R942
16264d915q138K986N518r37p248L747M254m047k753j321j5913Q525K4311O00J2690
16249A7359j7053j7038p066N016q345j1760N074L64J2417J0123J4334r588o430
16236a2593J2757N86j1913M798Q365n764o272j397l418n078l361l707L632J7822
16222e543Q250J0409k177j5878j2039o975P734p595p746J937N535m619k374L891
16208b7190q95P688J2541N413O35K593K094J148j105K184m243j1007L865J2323
$$ y = [-8135, 2385, -5588, -20283, -22024, -19977, -14627, -5507, -6994, -17054, -22765, -10655, -2199, 10285, 9581, -6012, -18596, -21446, -15722, -138, 728, -5403, -2339, -226, 1458, -11736, -10044, -9964, -10848, -5707, 3177, 9023, 3720, -3341, -7747, 1654, 5438, -229, -11526, -9918, -17187, -14857, -4915, -13053, -10067, -4549, -5486, -12734, -8987, -4733, -8780, -11533, -12854, -28767, -20242, 4069, 4669, 17359, 306, -16732, -23798, -18782, -27127, -38887, -33813, -33449, -21032, -10909, 3425, -6163, -12593, 164, 750, -11163, -6365, 2000, -3764, -10036, -11433, -14851, -19929, -23290, -26997, -23365, -5543, 2707, 13116, 10939, -4939, -16978, -23953, -16219, -23814, -31560, -29623, -24088, -28707, -31081, -27190, -28085, -20397, -7856, -2443, -1808, 785, 2879, 4027, 2922, 5106, 863, -10144, -6279, 6044]
16194F044R866j1759j5861j2661j3713m595J9919J3846J2531J7926n748j6988
16182a193M11j0o374j2133N395R167j105L27J0701Q279j0527N668Q084o046j0382
16167B62J1954N645j4601p327j457n67Q446o62N82Q076k780j0630M517n091p429
16152a1062M570R418r612J998K600r873M65L203R728q817k3998j042o27J6810
16138a6239J3731j0555j060j4332K479J4152J4640K0324m38j0272j0347O02R31
16125C616j5756m551K960P9j671P500J1044M996O616p531j0913n244j883N43O026
16110d169J841m264j0134M248J3027l992M221O242n921O238p922n734O681k288
16096a926o217m201J135r084o842Q269J887N823o689P335N174J026J8743j966
$$ y = [6044, 15910, 4151, -11710, -24371, -38084, -42679, -22760, -8914, 3617, 21543, 15795, -1193, -782, -792, -7166, -19299, -13904, -4737, -5842, -5515, 5186, 13465, 2938, 8606, 16690, 10644, 262, 12216, 17861, 3260, -4067, -5524, -6091, 2355, 1693, 2275, 10351, 7571, -3059, 1458, -3633, -11062, -6492, 2926, -6686, -4688, -2088, -11961, -11496, -8293, 1435, -7382, -31380, -32422, -33049, -16239, -2508, -13063, -14123, -28455, -25976, -11824, 2816, 23140, 22702, 12430, 2083, 2685, 3616, -12140, -16691, -13731, -13652, -15323, -7823, 3221, 8217, 14833, 7302, -3611, -8855, -10738, -10195, -4169, -2328, -6592, -16726, -12478, 549, -3443, 778, 7020, 1099, 7337, -585, -6319, 362, -1926, -8143, -12344, -11209, -20293, -27135, -18866, -16979, -11156, -17845, -10510, -5336, -4310, 14433, 12467]
16082A2467j9098l525j611p474r163l897M410K259L847M546p38M897j0955q465
16068c2500J8443R055m954j269J3942J7964o539l402N205K173j1467j0584o443
16055a0376p171J0915N970K1132j355j8947j3753j1374K339J3652n992J5621J3126
16042A3787L840l585j1277O137J928R32K139m831l12N731j626j1027j4937j5497
16028b8598N758N840J512p501m251N442J9833P577m295L346K757p060r737L50
16014i027J2308j3596j28R865J387m923r089o378M173p311l43J5065J0150K298
16000D451j2192q132j3O074J141N866P689j194m237q761m029R240O721j0178m322
15985a1876K090L957J890j069J2727J3674K027n098o56R03o345n413L430K040
$$ y = [12467, -6631, -10156, -11767, -19241, -28404, -32301, -27891, -25632, -21785, -17239, -17977, -13080, -24035, -32500, -14057, -5002, -9956, -11225, 2717, 20681, 14142, 10740, 15945, 18118, 6651, -3933, -10376, -17547, -6632, -662, 20470, 19115, 168, -13585, -24959, -22620, -8968, -14960, 661, 13787, 17627, 14042, 2765, 8902, 10830, 11762, 13901, 9070, 8758, 14489, 12863, 1836, -13101, -28598, -22840, -17000, -15488, -22989, -27240, -21798, -1965, 5612, 1317, 4663, 7420, 360, -9377, -9027, 3281, -10315, -10443, -578, 809, -4114, -13203, -19581, -15408, -22719, -23062, -7997, 2153, 4451, -7741, -15873, -15886, -9812, -8671, -2805, 4884, 3690, -547, -9308, -13337, -4097, 2624, -7554, -11876, -9786, -5829, -3939, -5008, 7719, 21393, 23420, 18322, 17666, 18569, 12224, 6811, 10241, 12281]
15971A2281l979Q99j709n541M461Q012O447j6854j9179q362J0068J7883O810J0419
15957B1656M504j2276j4142l178N242M10K509r235l178l814J962P389P824n513
15943A60m737k346M256J0145m724k197L26M964j536r456K467o309j0562K879J2044
15928d626q680Q304J2111o282m108O679P820M721o20J8246m092j2429n992j0777
15914B75q185l527Q680J4844K342j7889r429q55l284j1167J0802J2338l296p917
15900a6268k304j408m979o297L258K325M760J5568q130M107q51O48N557m512M788
15885c738J4286j3106j3488p034j83K5604m46l475j253N373J0253J3133j689m56
15871B3781r042k4469j0577Q055N028J1253N114l051l801J333O142J4148P833
$$ y = [12281, 8302, 9201, 7492, 1951, 6412, 14424, 20871, 4017, -15162, -23524, -13456, 4427, 11237, 21656, 26160, 13884, -258, -3436, 1806, 2216, 4725, -4510, -7688, -11502, -9540, -2151, 5673, 160, -4577, -6923, -2667, 7478, 2754, 557, 883, 5847, 4311, -5145, -2678, -8987, -19549, -16670, -4626, -13306, -5002, 7109, 827, -3281, 3398, 11218, 15939, 15319, 33565, 29473, 17044, 11052, 275, -7910, -11437, -2757, 12087, 14429, -3460, -12889, -13744, -17028, -28195, -17393, -5055, -8351, -16268, -18572, -19980, -24959, -31256, -27998, -25673, -20913, -5345, -13475, -9368, -10219, -9571, -4014, -8526, -3738, 10548, -2558, -16046, -23080, -23263, 2341, 1895, -1580, -2833, 2540, 12793, 25926, 24237, 23781, 14739, -9730, -20307, -12252, -7224, 4029, 9143, 6092, 2291, 3624, 9766, 23914, 31747]
15858C1747K2492q862l2643l772M498K296j1913j4652J382Q178J4440J0357j3430
15845A0118j7258j0433j0252j225R135K0461O725o207r822L075M395m462J4381
15832H631l907J3702p558Q12Q29Kj2367l698p670Q610K526l865n933Q025M067
15817B206j0128j4317l699Q933J0229L47k596j3121J6494J6361l51j501O420j3691
15803A586p307p892K1990K1005q516q378p767j7374j9409q2N199M482r435J1075
15789b0823J790j3272L985Q527J4425r64j580J898L023l839n858j1446K935k593
15775b3792M480J270L102J4718R566j537K1r821j3110J115j3539Q46K1171L435
15761b075l359O028k151n632r19M725J4575k847j1629p499J7120R75J0897p920
$$ y = [31747, 54239, 45377, 12734, 8962, 13460, 15756, 3843, -10809, -9427, -1249, 13191, 23548, 10118, -7140, -17573, -27825, -29050, -19915, 546, 7271, 1064, -8758, -5683, -1288, -5750, 8631, 4724, 18426, 10868, 11680, 12509, 12511, 144, -3554, -11224, -2614, -88, -3953, -9886, -1861, 2206, -7922, -22239, -25938, -17005, -6776, -6429, -9025, -22146, -5652, 10709, 10358, 8857, 15277, 1586, -5721, -13613, 8377, 29382, 20866, 12488, 4721, -12653, -32062, -32144, -26945, -22463, -31898, -20823, -19033, -32305, -28320, -19793, -5368, -6332, -7912, -6014, -2991, -6830, -12688, -24134, -21199, -23792, -19312, -18042, -14940, -222, 9344, 7807, 7828, -1993, -15103, -13988, -27527, -26681, -5510, -2075, -5434, 594, -1557, -7189, -8108, -3383, 11192, 8345, -3284, -10783, 6337, 7312, 18209, 10289]
15747A0289N567L83j184m386m02O95p969m333j2009q404O805q197q569L758K97
15732b7659R62R186o31j1027M452J6749P421m574J816o460O287o520M264J0889
15718E155N37J0117l788j3062r957L493L123m906M363Q592Q187p634j7621O476
15704f925k5J789J373j81M996j2270K214n454K938K334J3264J062Q28j0350o08
15689e015Q175n578O332L774m107l497j7614j6976J7414R782J8094J2948j5942
15676G790k5286k074l458K51L615P781o8J4232J8333N768m119n157p074m499k989
15661C046l344L700N446j58q053L882K946J1347j718j0794j1191p482K471j854
15647a1756J0336k892j2154n632j709M793M799Q819J798P272L030p111N166o068
$$ y = [10289, 15856, 16239, 15055, 10669, 10267, 10962, 2993, -1340, -13349, -21753, -14948, -23145, -31714, -27956, -27659, -26697, -17511, -18142, -29169, -24717, -7968, -547, -5121, -3305, -9765, -3478, -9998, -5734, 5155, 5692, 15809, 12021, -1041, -10998, -7505, -4382, -9288, -4925, 3667, 11854, 4220, -13401, -6925, -6950, -5161, -3788, -3969, 1027, -11243, -9029, -14483, -11545, -9211, 4053, 5115, 5943, -4407, -5015, 3160, -2418, 3914, 7688, 3581, 84, -17530, -34506, -17092, -7310, 10784, 23732, 7790, -17496, -19570, -23028, -22777, -19162, -11381, -11449, 2783, 21116, 26884, 22765, 17608, 10534, 6035, 3046, -298, 3402, 8848, 8690, 637, 4519, 7465, 18812, 17094, 6300, -4891, -12373, -9902, -11756, -1420, -4312, -16466, -22098, -23807, -19014, -14215, -5396, -3598, 3674, 6704, -407, 4759, -1309]
15633a309n717J094K175Q131j1129j9708j3634K2749L332Q76M149k413o16K392
15619i628j3077l829M740J5671J1006j476l512m114J1601n401r473j164o835j2835
15605b8326j0593J1576J0448j1216J067L020O17J1864J0161l183k400K141k896
15592g720n280K134J1431m2k5767n22J8726O412r106K014o781P108N611J6294
15578A4512p144N278j598j1767j8800K950P236J1208q82p785L545j1348P165N015
15564b415K892M703K178J2557P66j925o803l860l376K52o900r824o645J935Q08
15549a5657Q457P723N599r757o102k443j653j154L412N824N907P172N981j4166
15535h57j9042o582M864M895R398p809j10K012k348M60K45L686k103K245j4222
$$ y = [-1309, -7026, -5932, -3757, 4374, -6755, -26463, -40097, -17348, -14016, -13140, -8991, -11404, -12020, -9628, -22705, -26534, -21794, -6123, 4883, 3407, -105, -4219, 7382, 1981, -7492, -8656, -15491, -28326, -38919, -27343, -16895, -28111, -27044, -24024, -23407, -11543, -1382, -4565, -6965, -4824, -7720, -13000, -10866, 565, 523, -25244, -25766, -7040, -628, -9734, -7720, -14501, -7393, -1782, 14512, 7368, 12646, 11048, -719, -19519, -16569, -9333, 1875, 993, -6792, -3247, -14595, -7430, -2415, 477, 5180, 7358, 19915, 20681, 18756, 11953, 8093, 4717, 4969, -1931, -11755, -18400, -16465, -15657, -7200, 523, 6122, -3635, -9737, -12180, -13833, -14987, -11575, -5751, 156, 7328, 13309, -857, -19899, -26481, -21617, -16722, -7324, -15133, -15243, -13231, -15579, -15119, -14874, -11188, -13291, -11046, -25268]
15520b5268o408J1382K240p302K454R655J4852R020j2296j3153r483K0952P302
15507C947Q696k226J34m047j0357P348J0687J238p76l698j6683j2759j785J6276
15493d005K269p330j2852O390P610J990P327o066R55o112n299J81P072N882N722
15478C734L294m170L758k285o046k166J798j9120l867k725J8631J4695k665n731
15464b865k6457r034Q056J1907J4035l225j0639o150L030M825m730K064k981Q551
15450a3613Q917j1190K608K5297J160l029n617r805J95M984l51q669m038P30N383
15435g038J525p743n81N584n843P141N79L339q398k412j5774R262J2496j2510
15421b0373q057N227M102J2398j017k183J74j4588P903M001M648n677j664p051
$$ y = [-25268, -31676, -20294, -18054, -25356, -22902, -13247, 1605, 10625, -1671, -14824, -24307, -3355, 3947, 12643, 10417, 10551, 6504, -3853, 3495, 14182, 15420, 14644, 10946, -5737, -18496, -20281, -4005, -1736, -9066, -21918, -15528, -7918, -5928, 1399, -4667, -3712, -9824, -15123, -14942, -7870, -1988, 3734, 7028, 2858, 6616, 4331, -1715, -3881, -2083, -21203, -25070, -27795, -9164, 5531, 2866, -2865, -29322, -38356, -30300, -18393, -4358, -7583, -18222, -24372, -21342, -16517, -21247, -19183, -22164, -13613, -4696, -15886, -13278, 12019, 13179, 10150, 4533, -5272, -5077, -93, -444, -9113, -13151, -12421, -7038, -5513, -13256, -13837, -8253, -14096, -6955, -6376, -3037, -11435, -13847, -29621, -20359, -7863, -20373, -28430, -23203, -19101, -6703, -7720, -9903, -9729, -24317, -16414, -12413, -7765, -13442, -15106, -22157]
15407b2157M176J0199j24J179l382o815J0959O655O180j5230r370l982l483J0887
15393a4308J3260M74j1182r435K309K769M724N907j049K130q568K478m389j269
15379a6149R925m524O585N363N644M506K595O150m502j1231j6272J3439L011j3365
15365h825l574n118J066O637j1567j554M022j4062j391J329Q359J0719j103R158
15351e904J695N334j181j5350r723J753J7105P981n628l957o97n607J2037K956
15337H14o438k323K38J0530o495j2588O612k142j418j600R4K578P421L311r680
15322a1086l12p646p938P368M273m366J948p200O482J731j0865N574J5487k491
15308i041j7841J0803J497k263O096P386J2815r39r010j5448j529N116R79J650
$$ y = [-22157, -17981, -7782, -7906, -6727, -10109, -16924, -5965, 690, 6870, -8360, -17730, -21712, -25195, -14308, -1048, -574, -11756, -21191, -18882, -16113, -11389, -5482, -6531, -4401, -12969, -10491, -14880, -16149, -6224, -10748, -4163, 1200, 6844, 11350, 13945, 20095, 15593, 4362, -11910, 1529, 4540, -8825, -12399, -17517, -16451, -9814, -21381, -22935, -18913, -32975, -34366, -33037, -24678, -13959, -15062, -5904, -4209, 1125, -56, -15406, -25129, -23376, -6271, 1710, -3918, -7875, -8572, -14179, -2142, 814, -5624, -7947, -7709, 2821, -3674, -16262, -9650, -11792, -13210, -14810, -14716, -12138, -4717, -1406, -11086, -11398, -19044, -26982, -19614, -15341, -19707, -17759, -24959, -18477, -16746, -27611, -22037, -6550, -9041, -26882, -16079, -14582, -16845, -10749, -3363, 9452, 8513, -497, -15945, -17474, -12358, -11379, -9729]
15294i729m50L054N411P340k751j4355p48J1673N28j5196J304n03K591Q587N739
15279B495n673m574m198O451P64N12J0922J425N358Q555r303m058M05j2295p873
15264a1087L139Q264l264l456K068K685K172r639j0254o063P216P027n540J0541
15250f191N462j538Q306l21J3199J4381j2618m66l900j6071R713l386k2542L913
15236a2059O639p756q520J1831M411j4706q102R748P532l029o575J464j0177l310
15222c2609J3424J5986K52M0P133J0778j6243j0854K121R938O156o214k847p469
15208a0408q104n492J2717Q838K544l924m829p629j3171Q48J4185J2337O012n386
15194a462O844J632l541j2071n331J1366p019J409J3125j0366j2065R151O979
$$ y = [-9729, -10179, -7125, -1714, 5626, 2875, -11480, -12228, -555, -27, -15223, -13919, -14422, -11831, -3244, 2495, -3178, -7752, -11950, -5499, -4735, -4223, 6699, 8124, 13482, 22037, 12734, 8676, 9081, -3214, -11087, -7948, 316, -2948, -6404, -4336, -1651, 521, -9118, -19372, -25435, -18219, -11192, -16732, -6191, -729, -2267, 6039, 5718, 18917, 33298, 20680, 20214, 16314, 243, 9956, 6570, -15972, -12059, -5420, -13176, -21696, -9865, -5454, -20160, -28262, -18514, -10982, -14011, -20586, -19122, -29299, -32609, -19185, -3199, -2947, -2907, 4226, 15004, -1239, -12093, -9972, -34, 6122, -92, -2939, -10408, -18512, -24004, -11287, -2449, 95, -3829, -8658, -16287, -29458, -28610, -14425, -2088, 3924, -1462, 5382, 7014, 3473, -8598, -13929, -2563, -9582, -8173, 4952, -5414, -17479, -8328, -1349]
15181a349J238m408J0840M492o01J3545j3875r436J0136Q695k2095j4619M940
15168a2497Q32N810P469o492Q206J7121j4866k3123j9973J2918Q006J3301j219
15155d507m363k719k975O259l1n93L362L128N871K28J0752J42j9216P90K097K770
15139I95K272n806J849j2092n340J0443l658N187J4772M077O994K347j594J2799
15125C3245m716k2455j276J763o854o523m114N741n126k243j3225J3628R607j9005
15111b1553l279R831N54K0800R115j2307K915J576q170j3241M277P073J054n445
15097f800O047J297l65p079J158K037L579L972l556Q102m460n329l776J520O431
15082B778m147j6149J4326j831k0541J998N331M956Q436L315L090K08L09N863
$$ y = [-1349, -111, -4519, 6321, 10813, 10212, 23757, 9882, 446, 10582, 19277, -2818, -17437, -12497, -11665, -5855, 1614, -4878, 3328, 20449, 5583, -17540, -37513, -24595, -16589, -3288, -4507, -8870, -11589, -14564, -8305, -8336, -8929, -5567, -2439, 3432, 3660, 14412, 14554, -4662, -3872, -1775, 995, 3267, -2539, -690, -12782, -18122, -7679, -11337, -6150, 8622, 12699, 19693, 22040, 20446, 33245, 28529, 6074, 4798, 6561, -293, -6816, -10930, -5189, -10315, -12558, -25783, -12155, -2548, -21553, -24832, -15001, -14447, 6353, 15468, 3161, 6076, 7652, -518, -13759, -9482, -2409, -1355, -6800, -753, 544, 179, -6900, -5742, -3705, -126, 3846, 290, 8392, 3932, -1397, -5173, -3653, 2778, -1369, -17518, -3192, -5023, -25564, -23566, -18235, -13279, -4843, -1528, 1562, 1770, 2079, 7942]
15068G942j938M23L193k118R253j3651p1Q239k279N260J3576M018k3769k823N213
15053A0468o819m183J270k02L631o506p300j0222K618P645J14p01L828O846j6209
15038a5722k163J8951K507j386n598j6447O448j541q639m480K537K3311K644l343
15024b921N561j0079M700n040L741J720k3n461p997M49n8p807K983J1378M838
15009d016j1845k446j898l413J387K338O12L664O470J738L507N699J0365J422
14995A3584Q621k0883j412m823m09J5822J2532l864k4872q26m264K880L15R390
14981A791j690J608q655n840p669N171M770J3950J763j5K878p895p795J948K776
14966b904j80N386l268m437J1285p663r070L155K198J2873J613r038l727q323
$$ y = [7942, 6004, 6427, 9620, 7502, 16755, 3104, 3033, 11272, 8993, 14253, 27829, 31847, 8078, 5255, 10468, 3649, -534, 736, 534, 4165, -2341, -9641, -19863, -17245, -9600, -9486, -10187, -6359, 487, -15722, -17885, 1066, 3573, 2187, -3411, -19858, -13410, -14951, -23590, -28070, -25533, -2222, 422, -2921, 2640, -7439, -2739, -7779, -4038, -2318, -2341, -7802, -15799, -15350, -15408, -23215, -20232, -8854, -4016, -15861, -18307, -20205, -23618, -22231, -19893, -19281, -15617, -9147, -7409, -3902, 1797, 12162, 13584, 22205, 1322, -90, -4913, -5322, 10500, 23032, 19168, -5704, -6530, -10794, -7914, -7599, 1791, 101, 1709, -6946, -12786, -20455, -15284, -10514, 3436, 5199, 5184, 8062, 167, -7628, -5680, -2904, -3084, 2302, -966, -5403, 5882, -1781, -10851, -7696, -5498, 7375, 8988, -50, -3777, -12100]
14952a2100j483k886O544K705J0844R176m991m431j123Q999Q569j7162p018m044
14938h401l597J3595K1165O427k6590J325Q766m625M467J9469K7700N669J2638
14925G8008J9287R923J1141K0783L1962K6308p153r951j431j0408j0670L364J5269
14912A76432J2174K536K426j9133k6341j2646k3137j9126k2102m594r941m242
14900E2306l659j3130n552l706m065K387J1040k123J1291J174n673j5631q739
14887A5920n215m818L386j3818k1429M54R562Q267Q035n603J4000R053l573n648
14873H573j215n425M138J8638Q857n963q542k100J0017o705j616j2351j6055L719
14859f030m151l732K45R815Q50p111J712N155n080K571P426J0027l196p915Q215
$$ y = [-12100, -13583, -16469, -9925, -7220, 3624, 12800, 7809, 3378, 2255, 11254, 19823, 2661, -4357, -8401, -11998, 1597, 22762, 29189, 2599, 3924, 12690, 8065, 12532, 32001, 59701, 65370, 78008, 97295, 107218, 118359, 139142, 171104, 197412, 190259, 180308, 178877, 168469, 157799, 161163, 176432, 188606, 191142, 193568, 174435, 148094, 135448, 112311, 93185, 71083, 66489, 56548, 52306, 48647, 35517, 29965, 26259, 22194, 24581, 35621, 33498, 44789, 45963, 40290, 24659, 15920, 10705, 5887, 9273, -4545, -25974, -25520, -15958, -7691, 344, -5259, 8741, 17794, 14221, 8573, 7358, 1933, 6071, 24709, 33566, 27603, 19061, 16961, 26978, 20273, 18657, 6306, -9749, -6030, -10181, -13913, -13668, -3853, -3003, -10114, -8402, -3247, -8327, -5756, 1670, 11697, 8501, 586, 8801]
14844H801L330j8015p196P256k231O276O307p1n935N543Q016Q761n493k395r381
14829C573j2917L923J337n234N054J4687J813p457k670j080m785K764j2054l948
14815a6994j7989l719K0450M992Q309Q557q998o213r364J5408J2639L384q623
14802A839j7314m43J0819J1157n755J787m79O71M995j1846q380j4827l42N142
14788b2976L452J5319K014j653q511M976J9078n733j2744q248J4568p04p470K416
14774f216J8184J3940j072k584o057k791R004L691o044l026k755j932j2873m915
14760e446m396J999K2117O622j4424l240K941n719J5040J300N197p588M335j584
14746A7154k2433p491P481P539J3996O302j3255J1251J255j6340k0711J3000J5532
$$ y = [8801, 12131, -5884, -13080, -5824, -8055, -1779, 4528, 4457, -1478, 4065, 12081, 20842, 15349, 12954, 3573, -9344, -5421, -4084, -9318, -4264, 10423, 12236, 4779, 2109, 1029, -3756, -992, -13046, -16994, -34983, -38702, -18252, -13260, -4951, 3606, -5392, -11605, -20969, -5561, 7078, 10462, 1839, -15475, -15918, -5099, 6058, 303, 2090, 1611, 2282, 7277, -4569, -12949, -27776, -28118, -22976, -19524, -4205, -2191, -3844, -12355, -7379, 11699, 5966, -6778, -15026, -458, -1162, -8632, -6216, 11968, 25908, 24836, 22252, 16195, 13404, 22408, 26099, 20055, 17029, 14274, 12342, -531, -5446, -9842, -7843, 14274, 20896, 6472, 3232, 6173, 454, 15494, 16794, 21991, 14403, 18738, 17154, -5279, -12770, -5289, 2250, 16246, 22548, 9293, 20544, 21799, 5459, -15252, -2252, 13280]
14733A3280j1831j3484K426RK979R507p917J263o287m429J7417J8198N623k365
14719B4389j8348k9078M216L829l496n427J4668k294r87J3930L690o858P574J0987
14705A6795K575r170j8009j2682p00J7779J229j0015O481Q035J584O839K65j0034
14691I72J450j1862k497k527L783j5223j8469M68K1181J9842p062K0133J806q162
14677C833l352N375N252o275j1839q736q282J4606m297R218R486m339j1538m692
14663a5580O879l882l457P640J5357M478N181p911k614j59r25q335K489J7577
14649A6738o847j5871r081M237K0437J3808o113j4282L277j39p143K956p589J676
14635c936Q14p948K189R762J2468l854p105m904k114q271J252P525n29q298K0738
$$ y = [13280, 1449, -12035, -9609, -9600, -6621, 2886, -5031, -3768, -10055, -14484, 2933, 21131, 26754, 24389, 6041, -23037, -18821, -14992, -18488, -23915, -9247, -11541, -12528, 1402, 5092, -1766, 5808, 16795, 19370, 10200, -7809, -20491, -21191, -3412, -2183, -12198, -5717, 2318, 3902, 10741, 11006, 972, 2422, -9440, -11937, -14464, -10681, -25904, -44373, -43905, -22724, -2882, -9944, 10189, 11995, 3833, 481, 5856, 11108, 4833, -7006, -15742, -24024, -9418, -13715, -4497, 4989, 650, -10888, -15580, -8701, -12583, -16040, -8400, 6957, 11435, 16616, 8705, 6091, 5932, 5007, -3328, -839, 16738, 9891, -5980, -15061, -10824, 9613, 23421, 17308, 3026, 6303, 6164, -979, 1977, -5612, -3936, -3122, -11070, -8881, 881, 13349, 9495, 2390, -2514, -4628, -12899, -11647, -4122, -4651, -12949, 7789]
14620G789J0837K119j0541q016K145K526J1012q75j1474j88K32M504O254J92j3580
14605B936n72R691p681j1597J3772l101R675J578K654L585N214l004L072R887
14591C6109r960R038R087r334k129K601j3228j1010P024O468J131J539J4883J2172
14577E4391k41n482R777J9241J8493J2365J7527J3648K1936J8175J5366K7465
14565B22661N3892N9182R0184J17184J56972J59225J27337O2104n1652j30917
14555H66172j62220j64376j32930r0838o4325m3769l0978k0363l0160k1999j6379
14544H7835j5297j4273L08n862q714K671O660M321Q573j4531q431m259o476j6877
14530A5648j099K2184J1045j3801M103J401Q6j1301n648j4457k099Q372Q788M656
$$ y = [7789, 18626, 20745, 10204, 2188, 4333, 6859, 17871, 16996, 5522, 5334, 5566, 10070, 16324, 16516, 2936, 2364, 12055, 4374, -7223, 6549, 3448, 13123, 14701, 17355, 20940, 26154, 23150, 26222, 36109, 26149, 35187, 44274, 34940, 32811, 35412, 22184, 11174, 18198, 24666, 25797, 27336, 42219, 54391, 54150, 48668, 58445, 77686, 96179, 108544, 126071, 139719, 161655, 179830, 195196, 222661, 276553, 335735, 425919, 543103, 700075, 859300, 986637, 1048741, 997089, 866172, 703952, 539576, 406646, 315808, 251483, 207714, 176736, 156373, 126213, 104214, 87835, 72538, 58265, 58573, 52711, 43997, 46668, 53328, 57649, 66222, 51691, 43260, 39001, 32525, 15648, 14549, 36733, 47778, 33977, 38080, 39481, 39567, 28266, 22618, 8161, 6062, 14434, 23222, 27878]
14516B7878J1814j5086K3o058p177l094l405O855J0283N987j597O384k093p412
14502B3302N496L498K0585L862r035j5145j086j1610j2561j924J5194k044N502
14489B4034m951O529j0077j5338J002J683l114j0841l154k741J3405J4368O164
14476A6969M34p259n895R283Q542k113N843l667L088j613j0555l225l983O17M3
14461F509l08J0196l339q795m283k521J530J0376N44J2350p227L838K3162r119
14447C2913j4202J20l718q975J809P463Q404o611r836p094J2348j249P680m166
14433A4886K870j1947n082k780K619J2234k878n121P804m998j3442j731J15J1983
14419D532J573o32R115K383J082N387Q456n509k676r779j202k938j2462L687J0100
$$ y = [27878, 39692, 24606, 24629, 18571, 11394, 8300, 4895, 11750, 22033, 28020, 26423, 32807, 30714, 23302, 28798, 32296, 52881, 56743, 47708, 32563, 31477, 19867, 7306, 5382, 20576, 18532, 24034, 19083, 25612, 15535, 197, 1199, 2882, -232, -11073, -14227, -16968, -3563, 10805, 16969, 17403, 10144, 4249, 13532, 22074, 19961, 25804, 22137, 25225, 23612, 13057, 9832, 5849, 6466, 6509, 6201, 16397, 13058, 4263, -20, -2541, -1011, 9365, 9909, 22259, 15032, 18870, 42032, 32913, 18711, 18831, 15113, 6138, 7947, 15410, 23814, 17203, 7367, 273, 12621, 11372, 19052, 14886, 17756, 5809, 727, -2053, 566, 12800, 9922, 4801, 12605, 7607, -5835, -7566, -7451, 4532, 6105, 5473, 14588, 16971, 18053, 23440, 31896, 26387, 23711, 13932, 12730, 9792, -2670, 1017, 11117]
14404A1117P668j0354k911p044N87J5343O527j3653P371K5861p780j2783n743
14391A4206m343l724n410N221J2115k732q334M980j0977r134J1221O519J376p588
14377C396j4260j292J0428K4767J2976J503q677j0645j0883M39J943J4549L219
14364B7463n779o835J1502L035j044N554N015j72q04j100R47p891O473m003j2211
14349B0150r20k847j810p674l379l565K41J2990R385j992q760k808K16J3008J7056
14334C9291K181r220m900o471oJ0055k652n685o71j379m29m951N794M859o753
14319A9063K372n65M986p755q990j0419O198O375j50r118j0744k651K1705K1979
14305C2286o513J245K9j361P596M876p35J4321J7936O648m266R356K2124J7511
$$ y = [11117, 18785, 8431, 5520, -1524, -937, 14406, 20933, 7280, 14651, 40512, 32732, 19949, 14206, 9863, 6139, 729, 5950, 18065, 15333, 6999, 11979, 1002, -8132, 3089, 9608, 10984, 3396, -10864, -12156, -1728, 23039, 36015, 37518, 28841, 18196, 7313, 7752, 9695, 24244, 27463, 21684, 14849, 26351, 29386, 28342, 33896, 38911, 38739, 37935, 36835, 37782, 29891, 36364, 32361, 20150, 19230, 16383, 14573, 6899, 3520, -45, 196, 13186, 22571, 20579, 11819, 9011, 9227, 22235, 39291, 41472, 32252, 27352, 20881, 20875, 30930, 28278, 22593, 21922, 20543, 20114, 15163, 20957, 25816, 19063, 21435, 20870, 25856, 18101, 9111, -1308, 4890, 11265, 11115, 1997, -8747, -11398, 10307, 32286, 25773, 27018, 27047, 25686, 33282, 38158, 37423, 51744, 69680, 76328, 72062, 81418, 103542, 121053]
14291A21053L0439J6172J4647q741j5158k369j2432j5162j5139k4110j7304N517
14279G7413k5188j3805J6276q932l996Q124n958K18j2169p060q017k956J6952
14266C0902Q125J3400J052q41O191J5580L947J5418J6967K2298J0907L960M546
14253A52452l720p31J692j606j9147j7613j5834J312k4408j0530J994q889j4566
14240D0406j4568m823L880O487p698K190N358j3556k694Q224O641k7q112m118
14226A7590p236j2728J458M405J3884j8453l682J0444k430J1555R471L42l388
14213B1232J632q58O616J65M396k960r366l963l329o171O143R706o420j0517J2580
14198A8886R347p129k910R844r22J304r227m805Q80J0379J1528K220k657J061
$$ y = [121053, 151492, 167664, 182311, 173570, 158412, 156043, 143611, 128449, 113310, 89200, 71896, 77413, 52225, 38420, 54696, 45764, 41768, 49892, 43934, 44152, 31983, 24923, 16906, 13950, 30902, 39027, 52427, 53479, 52638, 58829, 74409, 78356, 93774, 110741, 133039, 143946, 147906, 152452, 148732, 148001, 149693, 148087, 128940, 111327, 95493, 96805, 72397, 61867, 63861, 54972, 40406, 25838, 21015, 24895, 31382, 23684, 25874, 31232, 17676, 14982, 23206, 29847, 29820, 21708, 17590, 10354, -2374, -916, 3489, 17373, -1080, -4762, 5682, 3252, 14807, 24278, 24620, 21232, 22864, 22006, 28622, 28787, 33183, 30223, 20857, 16894, 13565, 7394, 13537, 23243, 16823, 6306, 18886, 28233, 21104, 18194, 28038, 27116, 28420, 19193, 14388, 15268, 25647, 37175, 39395, 36738, 37799]
14184C7799q958m064k150R60J8443j00p327p387J5034J8680K57p668k1614p109
14170B4796O585o184k611J5518l249q980M638k923n312Q712q033J4569J3286j715
14156D9097o555O722n363L341j528k088m570o645L402q471j3175M995K167N110
14142B6439m350Q81m760k517o842L701N011N289O055j546K731O45J3654r026J075
14127C6440K172o437j4538j677m022n397j1342M086J9409J0085r968j3320R806
14114A5297J5850Q959K593q703j2811m363N451r043L775l382q39l373J0954J2606
14100C2971j2230q774P105J1571m045J559l33O373O31J3286J649r753j116j2017
14086B6877n146r896m240m924O978R930p023K302J429Q955l353j4338N41J7683
$$ y = [37799, 28841, 24777, 22627, 23587, 42030, 41930, 34603, 27216, 42250, 60930, 61187, 53519, 31905, 24796, 31381, 25197, 22586, 38104, 34855, 25875, 30513, 27590, 22278, 30990, 22957, 37526, 50812, 49097, 42542, 49264, 43901, 47242, 45714, 43626, 39056, 32411, 35813, 27342, 14167, 19162, 21329, 26439, 22089, 22970, 18210, 15693, 8851, 12552, 17563, 22852, 28907, 27361, 30092, 30737, 44391, 35365, 36440, 38612, 32175, 17637, 15960, 11938, 6541, -4801, -715, 18694, 28779, 18811, 5491, 15297, 31147, 40106, 42699, 33996, 21185, 16822, 22273, 13230, 17005, 13623, 12784, 9411, 20365, 32971, 20741, 11967, 19072, 30643, 26598, 28157, 27824, 34197, 34828, 48114, 49763, 40010, 38894, 26877, 21731, 11835, 7595, 2671, 9649, 19579, 12556, 14858, 16287, 25242, 21889, 7551, 8092, 25775]
14072B5775j720q222P134l871L250p99q777L3J478k322R224K1k569j681q080P129
14056A6003N52m820J6M26L324q833J0402K0496M514o130q012m576L856R658n130
14041C1746k401Q69p958N803J8710M77j1065l249j9285j881P466O049J1821n087
14027C2015j5123n793n778J0474m002L06M278L853l74K433K562J9552m370q927
14013C1106J0570K565M626L337j2101p576j782K957j228J460r276J044Q839L79
13999C4920n068m496L176j0727p699P750J5331J3622R96l369j5584r864k507M813
13985B1294Q628j006K3864k425k2963p376o040o407Q766J0699p21K414n13L389
13971C1603r141q060R395J955J8076J4550j0885j0936n936r396K036J145o468
$$ y = [25775, 24055, 15833, 22967, 19096, 22346, 21547, 12770, 12803, 14281, 11959, 21183, 21204, 18635, 16954, 8874, 16003, 16555, 11735, 11751, 12177, 15501, 6668, 17070, 37566, 42080, 35950, 27938, 23362, 27218, 36876, 31746, 29345, 30214, 22256, 28059, 46769, 47246, 36181, 32932, 13647, 11766, 19232, 25281, 37102, 32015, 16892, 11099, 5321, 15795, 11793, 12099, 16377, 20230, 19856, 22289, 24851, 44403, 40033, 31106, 41676, 44241, 48867, 52204, 40103, 32527, 30745, 33702, 32474, 33934, 24658, 25702, 34541, 34920, 29852, 25356, 28532, 17805, 10106, 17856, 33187, 46809, 47805, 44436, 28852, 18988, 16481, 21294, 29922, 28916, 52780, 50355, 27392, 20016, 13976, 7569, 16335, 27034, 26313, 28727, 28214, 31603, 22462, 14402, 23797, 25752, 43828, 58378, 47493, 36557, 30621, 21225, 23261, 24406, 17938]
13958A7938n417j042J1784p67j4055n527P946q808o318O966J7j0556J4072J1393
13944A7626J849p356j1037K9620K4925L857j5629k903l381p297L553J375K35m238
13930C1199j7228L413J1681L695r301J169q14j2805M329O320J4915J6141k5613
13917B7101k3658J6363k757J407p713o545k528L886m1O322j7973j3083p372P339
13903a9252L124R421J8267P381l714k742j187o708J922J3150m923p828R465J1559
13889B7935P428K835L497j4118k811k875k837l823J902n990m046K508o000k921
13875F84Q06J102J645Q487M92n854J1791l228M554r3R121R168o656p067R726O109
13859D0787j4782n819n739K845J4007N030p703j0087L54J8859N730j4637p123
$$ y = [17938, 12521, 11479, 23263, 22496, 8441, 2914, 10860, 2052, -4266, 2700, 2717, -7839, 6233, 17626, 19475, 12119, 1082, 30702, 55627, 59484, 43855, 40952, 37571, 30274, 33827, 35202, 35437, 31199, 13971, 17384, 29065, 32760, 23459, 24628, 23814, 11009, 15338, 21658, 36573, 52714, 27101, 3443, 19806, 17049, 18456, 10743, 4198, 1670, 5556, 5515, 11837, -6136, -19219, -26591, -19252, -16128, -6707, 11560, 18941, 15227, 12485, 11298, 4590, 6512, 19662, 14739, 6911, 16376, 27935, 35363, 38198, 41695, 27577, 24766, 21891, 19054, 15231, 17133, 11143, 7097, 9605, 3605, 684, 1490, 2592, 4237, 12724, 13216, 7362, 19153, 15925, 20479, 20386, 29507, 38675, 32019, 24952, 34678, 40787, 26005, 20186, 14447, 17292, 31299, 36329, 28626, 18539, 18893, 37752, 43482, 28845, 21722]
13846B1722J939O873J3505P76m100K498m236n388N762M483J6745J063p036o080
13832D8526m037M273Q029l015M622R969p493r003j500j3160j0777o840j024L235
13818B1805K953K568J523j969j781J3447P579L378m533j4605j7358J1821K757
13805B7585l220J2356L042N595J0928j301r004K303j5207m809J2821J8152p133
13792E2108j2808m750j3902J3497J2825n399R738j5526o734J0955n635j2667j7226
13779D476L637O563J0858L47N077N724O138J774l591m696l649m241P35j038N623
13764C3737N736J1381J2087k707Q194j565j804o614j6058L58N631P734N39n070
13750E1579j205j1207l061J5218M37j1679M010J5060R611k36k267O565m437n721
$$ y = [21722, 23661, 30534, 44039, 44815, 40715, 43213, 38977, 33589, 39351, 43834, 60579, 61642, 54606, 48526, 44489, 48762, 56791, 53776, 58398, 68367, 60874, 51871, 50371, 37211, 26434, 19594, 18570, 21805, 24758, 27326, 28849, 26880, 25099, 38546, 46125, 49503, 44970, 30365, 13007, 24828, 27585, 24365, 36721, 39763, 45358, 56286, 54985, 45981, 48284, 33077, 28268, 41089, 59241, 52108, 39300, 34550, 20648, 34145, 46970, 41571, 51309, 35783, 29049, 40004, 34369, 21702, 4476, 8113, 14676, 25534, 25881, 30958, 36682, 42820, 44594, 41003, 36307, 32658, 28417, 29152, 28114, 33737, 39473, 50854, 62941, 60234, 68428, 66863, 65059, 58445, 42387, 42745, 48376, 56110, 56649, 51579, 50374, 39167, 36106, 51324, 51761, 40082, 44092, 59152, 68763, 68527, 66260, 72825, 68388, 62667]
13736F2667P72k66Q072J3181O791K798n017j1508l945K919N824P205N196k880
13722I1809l837J4593J8808P248r170J9155J6510K036J6240J8234O695K5525L1447
13709B55293K3817L2372L4618K8764M1841M1170N8872N2886L5169J9469p399j8849
13697E98023l1833m0198m0816n2846l9113m3537l2313k7736k0494k4491k1253
13686B23393k5864j1927p111m725j4259k6238j3181j130m471o402m086L549P254
13673A14802j3730r078J815Q628q50j4575q074p17M52N299j5663j0399Q497P745
13659G4152J0393m936L899M505l548k079M686j5194n653K269m897J440j156N468
13645F9349N007K567l270M416Q372p071j4999M768k727J386Q602m389J648p157
$$ y = [62667, 63439, 63173, 71245, 84426, 91217, 94015, 88998, 77490, 73545, 76464, 82288, 89493, 94689, 91809, 87972, 102565, 121373, 128621, 119451, 138606, 155116, 157152, 173392, 191626, 198321, 223846, 255293, 279110, 311482, 346100, 374864, 416705, 457875, 516747, 569633, 604802, 624271, 616872, 598023, 566190, 525992, 485176, 432330, 393217, 349680, 317367, 289631, 269137, 244646, 223393, 197529, 185602, 178491, 173766, 159507, 133269, 120088, 118958, 114487, 108085, 103999, 107548, 114802, 101072, 91994, 93809, 102437, 101587, 87012, 78938, 78221, 78673, 83972, 68309, 57910, 66407, 74152, 84545, 79609, 83508, 88013, 84465, 82386, 87072, 71878, 66225, 68494, 63597, 65037, 63881, 69349, 74356, 76923, 73653, 78069, 86441, 79370, 64371, 69139, 66412, 67798, 76400, 72011, 73659, 66502]
13631F6502j1445J0594l817m401J6157K8094O141p002N220J9278R083K0J4390
13618A48814J1061K629L013J1529P351k210m929j066p678j8486p008r578K264
13605A35706J2716Q105j5768k0690P159j8762q674p73N744Q296p716j3859o967
13592H4517q454l914n683L202R833J7699J1080j963J8524J2113j5622p116p941
13579A06275k075J462j518j1659k3316l50P959L221K606O562r37j6596m493K729
13565F9870k760j65J3113J5823m732m86J2160k647k2276k808J631n695J1189O066
13551H8283k2601o32J2396R59O598J5347J7906R042N2j19p756j1448P752Q716
13537A24495j599j1216K655J0617l804P535R271P021L863J0236K2118K4047J0368
$$ y = [66502, 55057, 65651, 61834, 57433, 73590, 101684, 107825, 100823, 106043, 125321, 134404, 134424, 148814, 159875, 162504, 165517, 177046, 184397, 182187, 177258, 176192, 168514, 150028, 143020, 133442, 135706, 148422, 156527, 140759, 120069, 127228, 108466, 99792, 99019, 104763, 113059, 105343, 91484, 84517, 76063, 72149, 66466, 69668, 79501, 97200, 108280, 106317, 124841, 136954, 121332, 114216, 106275, 104200, 105662, 104144, 92485, 69169, 68819, 76778, 79999, 82605, 89167, 88230, 71634, 67141, 69870, 67110, 66945, 80058, 95881, 91149, 90663, 102823, 100176, 77900, 75092, 76723, 71028, 82217, 88283, 65682, 65050, 77446, 78405, 85003, 100350, 118256, 127298, 127350, 127231, 119475, 108027, 115779, 124495, 122896, 111680, 114335, 124952, 121148, 128683, 137954, 144975, 148838, 159074, 181192, 205239, 215607]
13524B15607J0374m039j6942j6311r717p807J9r295n789N084l907q836M220k941
13510A49720j8668k1007L765J5361j0291p865k0858j1881J2173J7927K885j47
13498A11114M463j02m631K628J551n646K3584O010j611j5806J541Q000r688j0114
13484A11293L687Q279l654o998n668o21M389J6991K0776O911Q660J3034R564M838
13470A91481k294R633K2698M234l320k643K892N083K941L686r649r540J0072K905
13456B28179k60j200M77R516K489l461n349J726k2121k1937j2199J5800J7234
13443B08894K2226Q99R39q611r970m161l160j0078J1949m749N257J1132J8395
13430B38962Q85R69N956J0699J6288P773J9603K0349J5096J0439N836M02K0092
$$ y = [215607, 225981, 221942, 205000, 188689, 178972, 171165, 171184, 161889, 156100, 161184, 157277, 148441, 152661, 149720, 131052, 110045, 113810, 129171, 118880, 111015, 90157, 78276, 90449, 108376, 111261, 111114, 115577, 115475, 110844, 113472, 115023, 109377, 132961, 138971, 137360, 121554, 123095, 131095, 121407, 111293, 114980, 123259, 119605, 112607, 106939, 106318, 110707, 127698, 148474, 155385, 164045, 177079, 186643, 191481, 189187, 198820, 221518, 225752, 222432, 219789, 222681, 227764, 230705, 234391, 224742, 215202, 225274, 228179, 227919, 226719, 227196, 236712, 239201, 235740, 230391, 232117, 209996, 188059, 175860, 191660, 208894, 231120, 232019, 232958, 224347, 214377, 210216, 207056, 196978, 208927, 204178, 209435, 220567, 238962, 239847, 240816, 246772, 257471, 273759, 281532, 301135, 321484, 336580, 347019, 352855, 353257, 373349]
13417C73349K8684L9589K6532L3630L1450K6593K0758M6748O1943O3983Q9722
13406H42981J19346J75490K24986K78571L03851K68151J41642m5388j96445k66545
13396A846640k51709k16511j64126j19510q7915o3270m4709l8903l4608k3041
13386H02338p102j8520k3655p757P179J847J136o707j7032l653J3283N903R216
13373G56476J4245P275Q548K0513K2475J6086l07J2585K0119R123J4098J6733
13361I17969K5965J1900L965J6545L2837J5425J7289J6645K6987J8266j93J4732
13349A118332K5181K9683L0243L3412M2235M6259N0737N5975N3358L8565M1883
13338A565863N6188N9366O2679O2506O9001P3439P9735O7220Q4386R1398R5752
$$ y = [373349, 402033, 441622, 468154, 501784, 533234, 559827, 580585, 627333, 689276, 753259, 842981, 962327, 1137817, 1362803, 1641374, 1945225, 2213376, 2355018, 2309630, 2113185, 1846640, 1594931, 1378420, 1214294, 1094784, 1006869, 943599, 898890, 859987, 825379, 802338, 795236, 776716, 753061, 745304, 752483, 754330, 755466, 748759, 731727, 728074, 741357, 747260, 756476, 770721, 777996, 786544, 807057, 829532, 845618, 845311, 857896, 878015, 887138, 901236, 917969, 943934, 955834, 959799, 976344, 1009181, 1024606, 1041895, 1058540, 1085527, 1103793, 1103600, 1118332, 1143513, 1173196, 1203439, 1236851, 1279086, 1325345, 1376082, 1432057, 1485415, 1523980, 1565863, 1622051, 1681417, 1744096, 1806602, 1875603, 1949042, 2028777, 2095997, 2180383, 2271781, 2367533]
13327B367533P8918R5229J05407Q5056R1197R2667J08975J17686J23703J28317
13317C394688J54211J72333J78469J85807J75740J97581K17280K11476K40960
13308E128545K75195L05274L27877L34230L80919M38261M76610N21667N75315
13299H763893O47696P28959Q09693R14158J037389J157939J295292J446669J626726
13290A8428414J828639K068964K350619K668290L056266L521744M079034M724076
13282D2726046N477832O315266P218804Q065358Q714750Q981130Q573858P304953
13274A03377997N055671K049710j297734m457483o954317q512488r122661q948236
13266G1190459q330613p456053o499295n579754m784859m122641l533573l037817
$$ y = [2367533, 2446451, 2541680, 2647087, 2732143, 2823340, 2916007, 3024982, 3142668, 3266371, 3394688, 3548899, 3721232, 3899701, 4085508, 4261248, 4458829, 4676109, 4887585, 5128545, 5403740, 5709014, 6036891, 6371121, 6752040, 7190301, 7666911, 8188578, 8763893, 9411589, 10140548, 10950241, 11864399, 12901788, 14059727, 15355019, 16801688, 18428414, 20257053, 22326017, 24676636, 27344926, 30401192, 33922936, 38001970, 42726046, 48203878, 54519144, 61737948, 69803306, 78518056, 87499186, 96073044, 103377997, 108433668, 110483378, 109185644, 104728161, 97773844, 89261356, 80138695, 71190459, 62859846, 55403793, 48904498, 43324744, 38539885, 34417244, 30883671, 27845854]
13258B7845854k638375k307844k032608j779370j577491j443349j279709j143816
13250A3643292j031056r17707q40962p64695o81312o01798n52597n09911m63297
13241G279957m14623l83656l50139l31281l09159k81068k68101k40226k18200
13232D483504k08954j92228j64175j75655j75696j49404j48970j57851j42480
13223B968091j31583j37331j12074q2966k5488K0971Q410P451j5493q6859j20499
13212B292630j30032j21629j25428r4767p0127o8135n3042m0539n9654o4055m6863
13201A418359m5819l5261l3067l6708l5124l2516l4112n0095k0097j8051k1261
13190A056248k3582l1502j6469j2051j6378k4945l1799k1293k4586k6445k9329
$$ y = [27845854, 25207479, 22899635, 20867027, 19087657, 17510166, 16066817, 14787108, 13643292, 12612236, 11694529, 10853567, 10088872, 9407560, 8805762, 8253165, 7743254, 7279957, 6865334, 6481678, 6131539, 5800258, 5491099, 5210031, 4941930, 4701704, 4483504, 4274550, 4082322, 3918147, 3742492, 3566796, 3417392, 3268422, 3110571, 2968091, 2836508, 2699177, 2587103, 2504137, 2478649, 2499620, 2508030, 2515481, 2499988, 2413129, 2292630, 2162598, 2040969, 1915541, 1820774, 1750647, 1682512, 1629470, 1588931, 1529277, 1465222, 1418359, 1372540, 1337279, 1304212, 1267504, 1232380, 1199864, 1165752, 1115657, 1095560, 1077509, 1056248, 1032666, 1001164, 984695, 972644, 956266, 931321, 899522, 878229, 853643, 827198, 797869]
13179G97869l1481j9081m333k5069l2872j3164r490j7938j1138j4611j5865p14
13167F02113m84Q862J1464P056K735Q923o648l7150j4819j4520l5393l6911k0142
13154D75086k3309j5911j2413k39j1861k6140k7319j1853q283P683J0276M391
13142C60108k825L303M832O201K21l928J186R267K477N486J317K482p121j8543
13128C64463j5844k6722O10j79j9027j5661k153R668K4921K0659K3547K6448M2306
13115D33036M6282K5065L01p935L200K413j046l487o604p733l88k2693k0508J337
13101D41240o782J2093L27J2535J0419J0651M3491J02150J52204J94503K04007
13090A176838J45177P1416k6551j09616j36257j27983r3108n5920m4006l1803
$$ y = [797869, 766388, 747307, 742974, 717905, 685033, 671869, 662379, 644441, 633303, 618692, 602827, 602113, 601629, 610491, 621955, 629011, 631746, 640669, 634021, 596871, 582052, 567532, 532139, 495228, 475086, 451777, 435866, 423453, 423214, 411353, 385213, 357894, 346041, 337758, 345441, 355717, 360108, 357283, 360586, 365418, 371619, 371840, 367912, 369098, 378365, 380842, 386328, 387645, 390127, 383006, 364463, 348619, 321897, 322507, 322328, 303301, 287640, 285487, 295155, 320076, 340735, 364282, 390730, 433036, 479318, 504383, 504684, 496749, 499949, 502362, 501316, 497829, 491225, 483492, 483104, 460411, 439903, 441240, 434458, 446551, 446878, 459413, 469832, 480483, 523974, 626124, 778328, 972831, 1176838, 1322015, 1393431, 1366880, 1257264, 1121007, 993024, 899916, 843996, 799990, 768187]
13080G68187k6526j3959Q40J325o726q220K003k49J4250K7158L0791K7026J9829
13067H35729J4170J1122J1566M1572O9523P7968Q7623R3729O3188n154m8831p9736
13055A172469q6802n8990k8705j3991j3354j1765j1191j7837k2199J1146J3991
13044I32772K4188K5779K0420J7812K1124K3140K3090J8227J9218L1862N2202
13033A209834M0162L3570L2874L8728M3579N3576M2278N2332N3920N4862P5054
13022A730769J06994J12900J37429J49920J13411M9612N028n881j018J3210J5722
13011B428096M0125O8756P8612Q3709J02145J33232J56409J58287J66284J78228
13001C593883J87734K02718K08177K04092J83757K10622K50490K85604L23344
$$ y = [768187, 741661, 727702, 728542, 729867, 723141, 714921, 716924, 716675, 730925, 758083, 788874, 815900, 835729, 849899, 861021, 872587, 914159, 983682, 1061650, 1149273, 1243002, 1306190, 1301036, 1252205, 1172469, 1085667, 1026677, 997972, 983981, 970627, 958862, 947671, 929834, 907635, 918781, 932772, 956960, 982739, 1003159, 1020971, 1042095, 1065235, 1088325, 1106552, 1125770, 1157632, 1209834, 1249996, 1283566, 1316440, 1355168, 1398747, 1452323, 1494601, 1546933, 1600853, 1655715, 1730769, 1837763, 1950663, 2088092, 2238012, 2351423, 2401035, 2406063, 2400182, 2399164, 2412374, 2428096, 2468221, 2536977, 2615589, 2699298, 2801443, 2934675, 3091084, 3249371, 3415655, 3593883, 3781617, 3984335, 4192512, 4396604, 4580361, 4790983, 5041473, 5327077, 5650421]
12992E650421L64276M21156M81609N42570O44055P51648Q77931R81508J100272
12983A1815446J253852J477982J693439J974797K322558K720322L224839L897646
12975C0380881M722367N804400P204449R064958J1698229J5533264K1251032K9461633
12967A35121213L9622299M8478736M9682830L7066322J0997568j9678450m2870872
12960B58419646n1861866m7880899l7380491k6635211j8605019j3358611r922960
12953E2774589p513600n782431m607536l842358l371083l009346k690405k318779
12945A9639051j987807j700016j464908j276365j102024r51325q24750p26290
12937I605566o42182n91593n66046n02583m56472m29928l87233l30932k86512
$$ y = [5650421, 6014697, 6435853, 6917462, 7460032, 8104087, 8855735, 9733666, 10715174, 11815446, 13069298, 14547280, 16240719, 18215516, 20538074, 23258396, 26483235, 30380881, 35103248, 40907648, 48112097, 57177055, 68875284, 84408548, 105659580, 135121213, 174743512, 223222248, 272905078, 309971400, 320968968, 301290518, 258419646, 206557780, 158676881, 121296390, 94661179, 76056160, 62697549, 52774589, 45260989, 39478558, 34871022, 31028664, 27657581, 24648235, 21957830, 19639051, 17651244, 15951228, 14486320, 13209955, 12107931, 11156606, 10331856, 9605566, 8963384, 8371791, 7805745, 7303162, 6846690, 6416762, 6029529, 5698597, 5412085]
12928E412085k46542k40124k10611k11466k04842j90757j77462j80166j87069
12919C563046j98024j77557j63946j40953j39903j39482j28729j11377j01999
12910B261076r5601q9336q1214q3352q9970o7849o3513q4104o7347n5774o0714
12899A422302m3448l7019k6845k7425l3817m2293l4118k1368j1778k4700l0948
12888A088543j3259L096M423q124J0688K6385J4039J4993J7534m261m0491n5037
12876A058529o5300o1957n9555m0658m3637m0650l4028j9597j4383j1540K518
12865F69742j2067n486l198o078m2262m0079j3974j0991j8706R35Q196J0317J4653
12852E51002O651J9530K6690J6611N495R624K1400J0155R219Q99l6166o0703p7994
$$ y = [5412085, 5165543, 4925419, 4714808, 4503342, 4298500, 4107743, 3930281, 3750115, 3563046, 3365022, 3187465, 3023519, 2882566, 2742663, 2603181, 2474452, 2363075, 2261076, 2165475, 2076139, 1994925, 1911573, 1821603, 1753754, 1690241, 1606137, 1538790, 1483016, 1422302, 1378854, 1341835, 1314990, 1287565, 1253748, 1211455, 1177337, 1155969, 1144191, 1119491, 1088543, 1075284, 1078380, 1082803, 1074679, 1085367, 1111752, 1125791, 1140784, 1158318, 1154057, 1113566, 1058529, 993229, 931272, 871717, 831059, 787422, 746772, 712744, 693147, 678764, 667224, 669742, 657675, 652189, 648991, 642913, 600651, 560572, 546598, 535607, 516901, 517836, 526032, 536349, 551002, 557653, 577183, 603873, 620484, 625979, 635603, 657003, 667158, 676377, 677276, 641110, 580407, 502413]
12839E02413j04106q8593m5249j617N0841P5676R1368N5958K6133r377k3765k0503
12827E09179k0342j4429j6219j4974k4828k3190q333k1255l810K713p359l66k1691
12814C35096j8752m305J5418K9134M2472M3064K5364L505p891j6097m511j2302
12802D30195j6971J450j2475j9968k1615k3553r912j5978j2388K938M238J266
12790C07227p174n573o672j6806m831r670j9598p222j1533k1162j4569j2135l303
12777A66979p025m546q574J3620K3392k907p920n177k790j5500j014j0708o26
12764A37204Q862N700J3199K6783K4547J9916N688L665J4194L691J207K867m744
12751B62779J8052l452p597k651J1065N985R541Q770r983O132o725n190r635L119
$$ y = [502413, 398307, 309714, 264465, 262848, 313689, 389365, 480733, 536691, 562824, 553447, 529682, 509179, 488837, 474408, 458189, 443215, 418387, 395197, 386864, 365609, 361799, 364512, 357153, 356787, 335096, 316344, 312039, 327457, 356591, 399063, 442127, 467491, 470996, 463105, 447008, 442497, 430195, 413224, 414674, 402199, 382231, 360616, 337063, 327151, 311173, 298785, 301723, 305961, 307227, 300053, 294480, 287808, 271002, 266171, 256501, 236903, 229681, 218148, 196986, 182417, 170282, 166979, 159954, 155408, 146834, 160454, 183846, 180939, 173019, 167842, 165052, 149552, 148538, 137830, 137204, 146066, 151766, 164965, 191748, 216295, 236211, 241899, 245564, 259758, 263449, 264656, 267523, 262779, 280831, 277379, 269782, 267131, 278196, 284181, 293722, 302492, 292509, 298641, 291916, 286726, 277091, 280210]
12737B80210l587n528K544J8669J776p218k0548j8837k3575k6395j1606j0765
12725A75140j2124k53j0193j2240n078p71j8443q000l911M038J252j6684j0873
12712H1860R82l96J1716K3997J1772M974m459j3671j0681l602k012M108j62J1475
12698A15901P614J723J2462L521O990r343j7424q499O675p64M550K0830J0854
12685A55090L990l4J2040J996o373j3456k1109p067Q390n869m142M477q350j6682
12671A02901L132J03p298r221j535J494m722r4J4712J3537J8518J9976K004j1966
12657A41541k7268l1507k4847k3284j3895n134P570J0048K039o879P098J2369
12645D7851R675N521j732N936K609j1312l476K1466J5049m909o873j675Q10j0231
$$ y = [280210, 276623, 271095, 273639, 292308, 294084, 286866, 266318, 247481, 223906, 197511, 185905, 175140, 163016, 162763, 152570, 140330, 135252, 134481, 116038, 108038, 104127, 108165, 109417, 92733, 81860, 82842, 82446, 94162, 118159, 129931, 134905, 130446, 116775, 106094, 102492, 100480, 104588, 104426, 115901, 123515, 125238, 137700, 141221, 148211, 138868, 121444, 112945, 119620, 118856, 123406, 144236, 155090, 159080, 159046, 171086, 173082, 166709, 153253, 132144, 125077, 133467, 127598, 123456, 127933, 119583, 102901, 106033, 106136, 98838, 89617, 88082, 89576, 84854, 84760, 99472, 113009, 131527, 151503, 153507, 141541, 114273, 82766, 57919, 34635, 20740, 15606, 23176, 33224, 35263, 28384, 35482, 47851, 57526, 63047, 61315, 67251, 69860, 58548, 55072, 76538, 91587, 86678, 79805, 78130, 78940, 68709]
12631F8709m099N121m495K087J5885k061m243J6506R158KJ1404q08j0673m13M096
12616A06176r120j2477n180j7109o193K753M517j73p607Q761j808P166j0454q449
12602E0803n156r640j0953L395J1093m097K000J1808K4561O710m32j856n129K065
12588G5172L259o445r237K450q551q291R468J696j840o110l046o325K197J2274
12574E6671J104J0569P412q378j1143p391L435Q181P159p167N860n488j1586l306
12560D5932q77J1690k134n234N09l761J216J0889J8203P921R933r10k973L147
12546I3551k857R334J046o283O775k612p824K4056J0194L584J2107N633J9421
12533A66125J5405K6943K1175L1299M7245O6748O0041R0021J30779J77654K32145
$$ y = [68709, 64610, 69731, 65236, 67323, 83208, 81147, 76904, 93410, 102568, 102570, 113974, 113166, 102493, 102080, 106176, 97056, 84579, 79399, 62290, 56097, 58850, 63367, 63194, 55587, 64348, 62540, 69706, 59252, 50803, 45647, 36007, 25054, 28449, 39542, 35445, 37445, 49253, 73814, 80524, 80092, 78236, 73107, 75172, 78431, 71986, 62749, 65199, 56648, 48357, 57825, 59521, 57681, 51571, 48525, 42200, 44397, 56671, 57775, 68344, 75756, 67378, 56235, 48844, 52279, 60460, 67619, 60452, 66312, 60824, 49238, 45932, 45055, 56745, 54611, 49377, 49886, 46125, 47341, 58230, 76433, 84354, 94287, 93377, 90404, 93551, 90694, 100028, 101074, 94791, 101566, 98954, 91130, 115186, 125380, 128964, 141071, 146704, 166125, 181530, 208473, 229648, 260947, 308192, 374940, 434981, 525002, 655781, 833435, 1065580]
12522A065580K56160K24602J30918l5259j88340k61596k58006k10170j56477j07347
12512D60065q5952n7855n0482j6268p688k0361j3268k0369j013j3092l5275l5223
12500A03219j4795J2087j226j4808o485o901o563J0100J356R99J2310j212j9031
12487F9050k9528j8478O852J971j1677J062R901J0814K40k1816n083K287J940
12474A7535L417J2356M216j005J2132L295k0023q657R138J4496K035M764K013
12461E5712L892j4998m954L150j4647p133J4434l99j967N00R706L663r655j1589
12447B5715R766J5352J644N360q551M360M319R817n172l329q686j3765m6M201
12433D0985r001k252M653k051K223L010K719l175o940j5470r302M358J5713R099
$$ y = [1065580, 1321740, 1546342, 1677260, 1642001, 1453661, 1192065, 934059, 723889, 567412, 460065, 374113, 316258, 265776, 249508, 241820, 221459, 208191, 187822, 186809, 173717, 138442, 103219, 88424, 100511, 99285, 84477, 77992, 71091, 64528, 74628, 75984, 76983, 89293, 88081, 69050, 39522, 21044, 27896, 29867, 18190, 19252, 29153, 39967, 40207, 18391, 13308, 15595, 17535, 20952, 33308, 37524, 36519, 48651, 51946, 31923, 23266, 32404, 46900, 48935, 53699, 55712, 59604, 44606, 39652, 42802, 28155, 21022, 35456, 35057, 33090, 33590, 43296, 46959, 37304, 25715, 35481, 50833, 52477, 57837, 49286, 53646, 57965, 67782, 62610, 59281, 50595, 36830, 36784, 40985, 31984, 29732, 34385, 32334, 34557, 37567, 40286, 37111, 30171, 14701, 5399, 9757, 25470, 34569]
12419C4569j2773m644J24M330r956j0500P918j008q321P103J4801q675r553L503
12405F918J941q433J261Q339L716K738m404j1939l150J2481J7974o120j0208k083
12391I031M269j447R075R207m132j1604Q759l682m816r55j0991L354J1387O214
12377B3669O512J070M721K823q430r010L907P035N178k827m391k533k340l741
12363B1643j0181n186K714J0415O381j1211j2319l709J1343R832j2538j1994L959
12350h51R433Q512K598P76j40j0225j5305r20R444L555L973n18R313J0522k906
12335B7261n04k375N121O307l263k1121o453l011K05J4854J2150P628j0513r374
12321A6912j3233j6937P757O735r429J0460R778L893J985M444o410j3394n391
$$ y = [34569, 21796, 17152, 17276, 21606, 11650, 1150, 9068, 8060, -261, 6842, 21643, 12968, 3415, 6918, 8859, 426, 1687, 10026, 13742, 16480, 12076, 137, -3013, 9468, 27442, 21322, 11114, 9031, 13300, 11853, 20928, 30135, 26003, 14399, 23158, 19476, 14660, 13705, 2714, 6068, 17455, 23669, 30181, 31251, 35972, 38795, 30365, 21355, 25262, 32297, 37475, 34648, 30257, 27724, 25384, 21643, 11462, 6276, 8990, 19405, 25786, 14575, 2256, -1453, 9890, 19722, 7184, -4810, -851, 8582, 17094, 19692, 20468, 20328, 10103, -5202, -6122, 3322, 6877, 10850, 10332, 19645, 30167, 27261, 26757, 24382, 29503, 35810, 32547, 11426, 4973, 1962, 2167, 17021, 29171, 36799, 26286, 16912, 3679, -13258, -5501, 1234, -8195, 2265, 12043, 15936, 17921, 22365, 15955, 2561, -2830]
12308b830n044O650J0567r267J185Q644J4886r135k2308k840K4509J7772m977
12295B7812p241j1669K613J4234J4062P808l685l804j0889m501O86m062j5880
12282E484o372N046p980J4276J2778o87q025J4573R791p215m80j6012m63k151
12268A2563N463J2560q913n904r602p036J1467J64j4189l808P721J3286J1650
12255B5422q3m286p383k503O501q818j935l513m86k543j5761j571N437J2946J0815
12240A2239O388K115j5831J3338J1082O544j5230j7330K637J675k33J7483R147
12227C4024j7573q124n55K732N606J774r359j2567K433k453m694l76m428l841
12213a7401m69J3502Q450Q901j2821Q24l964L827m91M612J3488J0919j0363J898
$$ y = [-2830, -7874, -1224, 9343, 76, 1261, 9905, 24791, 15656, -6652, -9492, 15017, 32789, 27812, 20571, 8902, 11515, 25749, 39811, 47619, 43934, 40130, 29241, 24740, 25426, 21364, 5484, -888, 4158, -3822, 10454, 23232, 22545, 14520, 29093, 38884, 31669, 31189, 15177, 14714, 12563, 18026, 30586, 21673, 15769, 6167, -869, 10598, 10762, -3427, -7235, 486, 13772, 25422, 25339, 21053, 13670, 11167, 17668, 8850, 6915, 3402, 2916, 373, -15388, -16959, -11522, 1424, 12239, 18627, 20742, 4911, 18249, 29331, 35875, 20645, 3315, 5952, 7627, 7394, 24877, 34024, 16451, 8327, 7772, 10504, 16110, 17884, 8525, -4042, -1609, -4062, -8756, -9132, -13560, -17401, -17870, -4368, 4082, 12983, 162, 986, -2978, 849, 358, 4970, 18458, 29377, 19014, 20912]
12199B0912j989m529j0389j2542L682J3363M101l815j0150L278O25L442J100j7141
12185a0052l605R119O063m62J026p842J2552N705K461P19j5502m65J5711P561
12171B2989n421K146o486o593m80Q946N314j3390j3511K740M50m133R651J117
12157C339J0394K0381J5199k3632j6256l600M20J3654L213L754J2204p738j6556
12144A4776q295k190q278o169J9688O260J0839P661j3759j2967o160M008P578
12131A2992o132m147O2J0011J229P312j4023j4295M402J8583Q05j5231K227J7833
12117B1628N166j2888k195K219O905L015M938m367j1454n715N953o209p264j752
12103b020J4711p732j9907j2050N444K0444J4836J030P03J2942l113r787p536
$$ y = [20912, 18923, 14394, 4005, -8537, -4855, 8508, 12609, 8794, -1356, 1922, 2547, 5989, 7089, -10052, -13657, -4538, 1525, 1063, 2089, -5753, 6799, 12504, 14965, 15684, 182, -283, 15428, 22989, 17568, 19714, 13228, 6635, 6155, 15101, 20415, 7025, -6486, -3746, -3296, -7429, 2222, 3339, 13733, 34114, 49313, 25681, 9425, 5825, 6245, 19899, 23112, 26866, 39070, 31332, 14776, 6481, 4291, -3987, -10156, 9532, 15792, 26631, 34292, 20533, 7566, 1406, 5414, 12992, 6860, 2713, 2775, 12786, 14015, 21327, 7304, -6991, -2589, 15994, 16799, 1568, 3795, 21628, 26794, 13906, 11711, 13930, 20835, 23850, 28788, 24421, 12967, 7252, 13205, 6996, -268, -2020, 12691, 4959, -14948, -26998, -21554, -1110, 13726, 14756, 15459, 28401, 25288, 15501, 7965]
12090G965N718J737k141J250r563m74K541O516P619O16r818j8855l756L563L442
12075c640R028j896j5087L230Q406P259m179j2907M83n544K056O223m766j0962
12061b2296N486J7740p647l691l656P19J7712L136j092j0668j1340Q713J3240
12048F356o081L890k83q850L50Q689m4j3893p726N81n234m792R564J8091Q885
12033I503R299P017K824k034k0605j491J3583M65q570q078R780j462l419P98j2236
12018d626j3991J059P190O207l309R704R900p754Q460L821j5853j6353k656J9572
12004A371J2628m691q518P266J3823j0108n654m567J343N985M758L259m714L130
11990A5311p280j1002j1359j3673m01J534J830q46Q501k024P902O212j2078k203
$$ y = [7965, 13683, 15420, 13279, 14529, 4966, 4492, 7033, 13549, 21168, 21784, 11966, -6889, -10645, -7082, -3640, 5388, 3492, -11595, -8365, 41, 7300, 3121, -9786, -9303, -14847, -12791, -6568, -11334, -22296, -16810, 930, -6717, -10408, -14064, -13345, 4367, 7503, 6411, -4257, -15597, -6884, 6356, 275, 4165, 3882, -4968, -4618, 4071, 4027, -9866, -17592, -17011, -22245, -27037, -17473, 618, 9503, 18802, 25819, 28643, 26609, 6004, 4513, 18096, 18561, 9991, 1913, 11693, 10231, 6812, 7610, -4626, -18617, -17558, -10368, -4161, -7470, 2234, 12134, 4380, 12840, 16661, 808, -15545, -18201, 1371, 13999, 9308, 790, 8056, 21879, 11771, 6117, 1550, 2893, 8878, 13636, 16895, 12181, 15311, 8031, -2971, -14330, -28003, -28404, -26870, -25040, -25886, -17385, -19409, -11507, -5295, -17373, -19576]
11976a9576J7156j1442L186K3977O748q480J716o222j041q33K645n874r21M043
11962E082j3240l518m896J9205k201k0383n104J6326J843l262J1877P155Q88q736
11948A036j0304j4722j0378l881J1220J3079J6173R872o446l115P022J193n304
11935E445p192k259q379K759L530l152N76Q893o298j2760l171J531M279J6016
11921a82R054p119j6821k0416O062K0455Q218J5125o880K051J313k115l07l115
11907E323J049q295q454j25N397j000j601O845M486O584J068J2174J791n903L446
11892B2785j8890r760j335J0965l273j3732l979J3968R026N22j9828L146P322
11879c063R00n635p335N197J5435O83l089K365j684j2891L34k982L302J0596k875
$$ y = [-19576, -2420, -13862, -10676, 13301, 20049, 11569, 13285, 7063, 6022, 5189, 7834, 1960, 1039, 5082, -8158, -11676, -16572, 2633, 432, -19951, -25055, -8729, -6886, -10148, 1729, 8884, 9772, 1036, -9268, -23990, -34368, -38249, -27029, -13950, 2223, 12095, 5649, 2534, 9556, 10749, 5445, -1747, -4006, -12385, -9626, -6096, -9248, -8672, 221, -6077, -18837, -22008, -20477, -16198, -182, 8872, 1753, -15068, -35484, -29422, -8967, -749, 14376, 7496, 9547, 10860, 8745, 8438, 5323, 6372, -1923, -10377, -10502, -5105, -6105, -7706, -861, 3625, 10209, 11277, 23451, 25242, 19339, 22785, 3895, -5865, -7200, 3765, 492, -13240, -17219, -3251, 5775, 6297, -13531, -10385, -3063, -2163, -7798, -15133, -9936, 5499, 6182, 3093, 5458, 3774, -9117, -8783, -11765, -8463, 2133, -742]
11864g42J1414j669q006m969J1766K705m243n13k330P408J3900K579j5843j3849
11850b392N781J0114o262p91J71J575q041J904j872P669j957o988K277n980n384
11835a0176J1534J5545q79J74N731j736k202L457K247n60j5531r998l255P397
11821A748N374M836j3567q299J2292N058J549j9581r914o508J1993J5737Q64k093
11807e11Q903N729l671K606j0443L83Q801J848J0275j4052k5296J1886K922o564
11793g184O078n517n496Q722J3869j488j843l593p451R638R198L236p911j9228
11779h970P344J3006K890K082p160j1752K122Q818N800n021J0049j8499j0776
11766a0067n62L278K478N929o148K020N013l387k367j848M881l085l379M381O876
$$ y = [-742, 10672, 9003, 997, -3972, 7794, 10499, 6256, 5743, 3413, 10821, 24721, 27300, 11457, -2392, 3389, 13503, 7241, 6450, 6621, 8196, 155, 2059, 187, 7856, 5899, -1089, 1188, -4792, -10176, 1358, 16903, 16024, 16198, 21929, 20193, 17991, 21448, 23695, 23135, 7604, -2394, -5649, 1748, 7122, 11958, -1609, -9908, 2384, 7442, 8991, -10590, -20504, -27012, -15019, 718, 1582, -511, 8392, 14121, 10450, 13056, 2613, 2996, 11797, 13645, 23920, 9868, -15428, -3542, -620, -7184, -1106, -6623, -12119, -3397, 10472, 8984, 7141, 3548, -3903, 5735, 14933, 18169, 10258, -8970, -1626, 11380, 14270, 16352, 9192, -2560, -438, 8380, 14180, 9159, 19208, 709, -10067, -10629, -7351, -4873, 1056, -5092, -3072, 1941, -1446, -3813, -5661, -780, -3865, -7244, -2863, 4013]
11751D013N448p399j4083Q972p647J698J1174J1938Q30j3093r107m239j2308j61
11737b3964J0426o527q525J549J5523O941j654N382l502J0993J3462k917j6635
11724E52n953J6884m438k1540p624J1477R232j769J4189j2967r051K2933J7065
11711B8990o537j6024r280L455K960R413K060k138l633K43K571j9903j8847J0087
11697a6583L0632M997p749j3198j7396m023J8314M479N038J5690r454k806m376
11684C565n609p66n224K433J954N325l806J0100N530J139j7577n911j0623J1443
11670h027O576p886q148M248K244n97m092j1479r321L177L661j508J0678J0397
11656a0077P895J0754n103P751M042j597J514j7353k4489L502J8712P563R682
$$ y = [4013, 9461, 2062, -12021, -3049, -10696, -8998, 2176, 14114, 14944, 1851, -7256, -11495, -23803, -23964, -13538, -20065, -28590, -27041, -11518, -4577, -6231, -849, -4351, 6642, 20104, 17187, 552, -5401, 11483, 7045, -14495, -22119, -10642, -1410, -3179, 11010, -1957, -11008, 11925, 28990, 22453, 6429, -2851, 604, 3564, 12977, 15037, 12899, 9266, 9509, 12080, -7823, -26670, -16583, 14049, 19046, 11297, -1901, -19297, -23320, -5006, -527, 4511, 20201, 10747, 7941, 3565, -2044, -2810, -8034, -5601, -3647, 1678, -2128, 7972, 13502, 14641, -2936, -8847, -19470, -8027, -1451, -9337, -17485, -13237, -10993, -11590, -15682, -27161, -36482, -33305, -29644, -31152, -20474, -10077, -2182, 8572, 3469, 11220, 15262, 13665, 15179, -2174, -26663, -23161, -4449, 3114, 12796]
11643A2796J38k622m181n881N085J1367o827J027m711n547n649j2695M684J5251
11629B235l471q798n269k842q990K445P053j849O432q96J956k710p83j1932J9814
11614g605K288p397k525R241j628N321L917k658J1944K459j9282M94J0038o246
11600a639j111j760J0254L909K060o469k480Q510J6346M190k2671j7903M836J042
11586b886n412K141q988j254J6295k93J1547J1107k4632k3739N48P362J0613N504
11572b087j2389k99J1018J1711l004r060j9042J855O103L850N239l560l741O306
11558g100Q374K795j1303l524p99j407J6096k419o526j154k273J18J0910Q380
11544A0168J4736R414j1781j6619R523J8819j275r950j1714j1102j314l385K822
$$ y = [12796, 12934, 10312, 6131, 250, 5335, 16702, 9875, 10902, 6191, 644, -5005, -17700, -13016, 2235, -1236, -10034, -15303, -18145, -27135, -24690, -17637, -19486, -13054, -13950, -11994, -14704, -15487, -27419, -7605, -5317, -12714, -15239, -5998, -7626, -2305, 1612, -1046, 10898, 13357, -5925, -5431, 4607, -1639, -2750, -4510, 5744, 9653, 11713, 5244, 2764, 11274, 27620, 31810, 9139, -8764, -3928, -2886, -8298, -6157, -15145, -16399, -104, -397, 11150, 22257, -2375, -26114, -25566, -18204, -7591, -2087, -14476, -14775, -3757, 7954, 4950, -4110, -23152, -21297, -15194, -11344, -6105, -9665, -13406, -7100, 1274, 4069, -7234, -10758, -11557, -12964, 3132, 713, -5813, -6967, -9240, -9122, 1788, 10168, 24904, 34318, 22537, 5918, 15441, 34260, 32985, 23035, 11321, 219, -1095, -4480, -1658]
11531a658J626r158n695L133Q0m049q648J4226J2724n188K012q499m418J0911
11517b601J8512O697O323j1304l256j3541P415K91q876m260K646J469P546j521
11503E540j0085n917p783o38J0360m126J028Q936M984j010J5973j2280j9073j322
11489a5413n589J4440J7871p496K154m404K84j1471j2267q69J3821J4278p942
11476b603p75J955p681R934q91n50O540N926Q860m573N267p862j806J219j502
11461A1458k641r002n743j5863m660J0241J4402j910j6509l974J798O889J1059
11448d455J2895J1014q894K151P757L786r118J093j074o889o053n951K492j5028
11434a6274p709l280J4691K3522l693n246j3979N100K564N510o13r131j2858j162
$$ y = [-1658, -32, -9190, -14885, -11752, -11672, -15721, -24369, -10143, 2581, -2607, -595, -9094, -13512, -2601, 15911, 22608, 28931, 17627, 14371, 830, 8245, 8536, -340, -4600, -1954, -485, 7061, 5540, -4545, -10462, -18245, -18883, -8523, -12649, -11621, -2685, 2299, 1289, 17262, 4982, -14091, -15413, -21002, -6562, 11309, 3813, 5967, 1563, 1847, -9624, -21891, -22760, -8939, 5339, -2603, -3378, -1423, -9104, 830, -61, -611, 5929, 11855, 20715, 16142, 21409, 13547, 11741, 12960, 11458, 8817, -185, -5928, -21791, -26451, -16210, -1808, -3718, -20227, -24201, -22403, -15514, -4455, 8440, 19454, 10560, 12711, 20468, 24254, 15136, 16229, 15155, 8266, 2213, -3738, -1246, -16274, -23983, -27263, -12572, 10950, 7257, 2011, -11968, -6868, -4304, 1206, 593, -8538, -21396, -22558]
11420b2558Q86J7088l989o345K027j589r58J6476l527r673k349N566J1105K626
11406D786J7626l175j0916K451M64l995k993O415j614j315p00m492j9408n17N542
11391a1841J961J6704N010j526j225L560L537k124p439J167k544j2850j6780N422
11377a8968Q918M227J162l3j3195m425O951M445J479O419J6808L184L749l751
11363A6970n077n690j1322J825l72k60J6173j5339k981O252l671K316R45O318
11349F087J1347k314l793J775j0869o191M157L0674n283j9795j249q854j0759
11336a5067J531O709m071L317O694o603k0126P920R406J3639P128k868j1572j497
11322e460n06n533m056Q587O735J5434J17K065J268r584P76j4892j6127n39j851
$$ y = [-22558, -21672, -4584, -8573, -14918, -12891, -14480, -15438, 1038, -2489, -12162, -14511, -8945, 2160, 4786, 22412, 19237, 8321, 10772, 11236, 7241, 4248, 10663, 9049, 7734, 7034, 2542, -16866, -17383, -11841, -9880, 6824, 11834, 10308, 9083, 12643, 16180, 14056, 6617, 7784, 5240, -7610, -24390, -18968, -10050, -5823, -4661, -4694, -17889, -22314, -15363, -10918, -9439, -3020, 13788, 16972, 20721, 16970, 11893, 6203, -5119, -3294, -3666, -3926, 12247, -3092, -6073, 179, -3492, -1176, -231, 6087, 17434, 15120, 11327, 13102, 2233, -3958, 199, 30873, 25590, 5795, 4546, -4308, -15067, -13536, -6827, -10898, -7581, -887, -7490, -27616, -19696, -10290, 3349, 10477, 7609, -3963, -5460, -5966, -11499, -15555, -6968, -233, 15201, 15318, 17383, 18651, 9067, 9843, -5049, -21176, -21715, -23566]
11307b3566J8174J8914J1456m778j3604j4009l539N706K765p113J4907J3324M930
11294B3567o054q826O167m823M289p883m574P76J773j0694M887J7554J1562q04
11280B6917R820j580q484j1464J2323J1093R827N19J2048K5641O752J4455P557
11267A15424P390L4625N5837N9624R9927R6336J09039P7896L7223j7965n7540
11256F17816q1552j07290r8284p8248o3643m9942k8666j8102p898q246j2529j2413
11244E1003j0109J504J0492j8856j8304Q863j221j4024n072o332R607l637N430
11231I344L818P060Q494n802j0683M648P32j4237Q370J497L752o446j2100n900
11217g453J2962j72n368J0094l013o486L987N897J870o349J4829k768r444l848
$$ y = [-23566, -5392, 13522, 24978, 20200, 6596, -7413, -10952, -5246, -2481, -9594, 5313, 18637, 23567, 17513, 8687, 14854, 10031, 14320, 6437, 1863, 2639, 4412, -6282, -1395, 16159, 27721, 26917, 36737, 35157, 26673, 15209, 27532, 38625, 48452, 48971, 61019, 86660, 93412, 107867, 115424, 122814, 157439, 213276, 272900, 372827, 469163, 578202, 656098, 693321, 675356, 617816, 536264, 428974, 330690, 252442, 188799, 138857, 110191, 92089, 84191, 75945, 63416, 51003, 40894, 42398, 52890, 34034, 15730, 24593, 23372, 9348, 4276, -2056, 7551, 3914, 9344, 13162, 20222, 28716, 22914, 12231, 16879, 17611, 3374, 11744, 13241, 16993, 10547, -1553, -7453, 5509, 5337, -31, 10063, 7050, 564, 4551, 10448, 12318, 5969, 20798, 18030, 8586, 4738]
11203D738r984P99k964n627K950R657M946K690K696j3970j2019K003J6778N883
11189H576P530K740k740O851Q84j104J982N992j5411M48L180M546J060m422Q743
11174B8855Q819J863j290o305j2329k937J4601N528J1838P355R397K2814J6760
11161A04969J5671J3701L2998N0964O0543R2504R8532Q3711M2624K2577q07j7847
11149F00140n6186j09814j09067p4991o3014n4125k6068j7793m18j6507q659n135
11137E8363o090M58j2432j9683j5307L540j1557J361N580L587O502L259J4131
11124C1712o043j3211p663n969O667O421q425j534m368p489J578Q751N718j825
11110D320k629r845Q777J7625K336j3127j215J2502n653j4097J305J0783j2434
$$ y = [4738, -5246, -4447, -7411, -13038, -10088, -431, 4515, 7205, 9901, -4069, -16088, -14085, 2693, 8576, 16106, 18846, 16106, 22957, 23841, 22737, 24719, 30711, 15300, 15748, 18928, 23474, 24534, 20112, 28855, 37674, 39537, 38247, 31942, 19613, 16676, 31277, 36805, 48643, 55998, 65395, 88209, 104969, 120640, 134341, 167339, 218303, 278846, 371350, 469882, 553593, 596217, 618794, 617987, 600140, 543954, 434140, 325073, 250082, 187068, 132943, 106875, 89082, 88664, 72157, 63498, 58363, 52273, 52731, 40299, 20616, 5309, 8849, -2708, -1347, 4233, 7820, 14322, 17581, 31712, 25669, 12458, 4795, -1174, 5493, 11914, 3489, 1955, -2413, -9902, -8324, 427, 6145, 4320, 1691, -8154, 623, 18248, 20584, 7457, 6242, 18744, 13091, -1006, 299, 11082, -1352]
11097a352j7110J0809N859N532l220N594q583r855l505K655J3922Q429N23n358
11083D340j4735Q516J2231J3644J948j6432o030M108k252j8473m744P111N626
11070e142k283Q451J374P112O97j263K230P175k476k525N586j6039k176m248K684
11055h43m454j1821k724L688J1108M080o27l426P68k014q092Q970L570J545p242
11040g514J0012J3510J630j0545q061R448l89r498r081J776J146l442l49M132
11026g225o888n271K115J894q857K899P999J9553r50m719k984o784r65N80L941
11011e662O514L686l745n893O903M32Q657k0264m24J2187r336p540k378J7670
10997H07R436q844p880k003J0915n242j715K4231M426K65n771r130o36M595J561
$$ y = [-1352, -18462, -7653, -1794, 3738, 518, 6112, -2471, -12326, -15831, -13176, 746, 9175, 9698, 4340, -10395, -1879, 10352, 23996, 25944, 9512, 3482, 7590, 5338, -13135, -17879, -10768, -5142, -7425, 1026, 2400, 9512, 10209, 8946, 11176, 18351, 15875, 13350, 18936, 2897, 721, -3527, -843, -5297, -17118, -19842, -16154, -5046, -966, -1593, -5019, -4251, -6265, -14357, -5387, -1817, -272, -7514, 2498, 16008, 17638, 7093, -968, 8480, 8091, -1407, -10488, -8712, -7566, -11008, -11357, -7225, -14113, -19384, -17269, -15375, -24232, -21333, -13334, 6219, 5269, 550, -2434, -9218, -10183, -9603, -5662, 852, 4538, 793, -5100, 1803, 2235, 10892, -9372, -9796, 2391, -6945, -14485, -16863, 807, 10243, 1399, -6481, -8484, 2431, -2811, -4526, 19705, 24131, 24396, 18625, 9495, 8859, 13454, 15015]
10982A5015k970n063Q139J2283j4683j2098j883o456J300K885j670n833l122j5005
10968b9161o072L885O635P492j0894P806J3151L748n210R456O857n683l476p380
10954h846J3175K71O366K0757R88r886j7876j0806L82P693P399M889l998r59J414
10939A0963n740n165O241K072L562o598j3532r585l968k092P722J1979N594j2212
10925a0759q131J276P896O490J935J416K633N756n453r710M37m85N992m504N986
10910G75J246L398j0115o614M463J4579Q822k556J120o301k864l8p719n774O381
10895a197J7621k522j4084l098n403R095J0405k175M360N628p551o284o372q614
10881a0191o654J1901J3174N721m387q700k175j4601j7267J0901O539k507J6524
$$ y = [15015, 12045, 6982, 15121, 27404, 12721, 623, -1260, -7716, -6416, -3531, -5201, -11034, -14156, -29161, -35233, -31348, -24713, -17221, -28115, -20309, -7158, -3410, -8620, 836, 7693, 2010, -1466, -8846, 4329, 4600, 10966, 31723, 32711, 22825, 4949, -5857, -5475, 2218, 9617, 14506, 10508, 9549, 10963, 5223, 58, 6299, 8371, 11933, 5335, -8197, -17782, -21750, -23842, -16120, -4141, 1453, -10759, -18890, -17614, -9718, -3228, -1293, 123, 2756, 8512, 3059, -6651, -6214, -6699, -707, -5211, 775, 2021, 5419, -4696, -11310, -6847, 7732, 16554, 13998, 15118, 8817, 5953, 5915, -1804, -7578, -1197, 16424, 13902, -182, -3280, -8683, 412, 10817, 8642, 13002, 18630, 11079, 4795, -1577, -10191, -16845, -4944, 8230, 13951, 9564, 864, -1311, -15912, -33179, -22278, -15739, -18246, -1722]
10868a722J266j7102L790N436J881P758M550K999o887r487l828Q561P311k397
10854B129j1083j0544J775R878O307k107k254M589O962o548j1693Q513n927J3232
10840C229k731j3109l350K205Q14R841P955o667p028O30J1626n347j6862j844
10826b0638Q499J0768K7360r20j2431J663L111p294q300p52L824J0008P174l358
10812A8714j3753m303J972j0139O557O740J0047j1078p128j779j0161J0806P951
10799D446m36J929r35M492R332N192j8373j2372J2506l29j0883N346j506l385
10785d976J3799J2377r531j2565o964J2553m657j1235Q133m716M660J0487j2330
10772d965l697J7360J1419k649J0180J290j8744o441J6049j4652k6322J0465P363
$$ y = [-1722, -456, -17558, -13768, -8332, -6451, 1307, 5857, 8856, 1969, -7518, -11346, -2785, 4526, 2129, -8954, -19498, -17723, -7845, -1538, -3645, -5899, -1310, 5652, -896, -12589, -4076, -10003, 3229, 498, -12611, -15961, -13756, -12942, -3101, 4854, -1813, -8841, -8211, 3415, -1932, -18794, -20638, -12139, -1371, 25989, 25069, 12638, 14301, 17412, 10118, 1818, 1066, 4890, 14898, 22072, 18714, 4961, 658, 2630, -7509, -952, 5788, 15835, 4757, -2371, -4150, -14311, -3505, 4446, 4010, 5939, 5004, 9496, 18828, 24020, 5647, -6725, 5781, 5452, -5431, -85, -1591, -4976, 8823, 21200, 11669, -896, -7860, 4693, 36, -11199, -3066, -7782, -3122, 7365, -4965, -8662, 8698, 20117, 17468, 27648, 28938, 10194, 3753, 19802, 5150, -21172, -10707, -3344]
10759c344P475M470q963j359L270J129l834R4O702j6410n381O27J0027J397o052
10744a0152K833k422o213M077m343q063J223L986J0921q828k922J2358O339q467
10730i673J538M892K873N83n718L976p76m509L30Q993m269l687J4340j459n167
10715B267J947n41j6577m642N36J4842Q371l040j459n199j4122l160o929m314
10701c2020M602J2423P466p12k600o404P941R76J457M120j732m858p230J5958
10687f13J0835l402j2928O355n480j343M583M004L90L261Q579Q949j538p389M17
10672A4680o425j3766O567O756K039J0218m797l093L07m973R57m659R881n488
10658H204l499J714Q479P160k269O953M982j6245j341k638j5315N926J4409j205
$$ y = [-3344, 4131, 8601, -362, -1721, 1549, 2678, -1156, -1062, 5640, -10770, -16151, -15524, -5497, -4100, -10152, -7319, -9741, -15954, -11877, -16220, -24283, -23060, -19074, -8153, -16981, -19903, -7545, -1206, -9673, -8135, -3243, -370, 213, -5505, -1529, -2305, -6814, -6484, 2509, -1760, -5447, 8893, 7434, 2267, 4214, 3673, -12904, -17546, -17010, -2168, 6203, 3163, 1704, -3495, -17617, -20777, -27706, -32020, -27418, -14995, -7529, -8241, -10841, -17245, -9304, -8328, -6871, -2751, -4483, -9341, -16571, -613, 10222, 6820, -6108, 247, -5233, -6576, -1993, 2011, 2401, 5662, 14241, 23190, 21652, 14263, 14680, 8255, -5511, 1056, 7812, 9851, 20069, 15272, 12179, 12486, 7513, 8470, 3811, 13692, 8204, 4705, 6419, 14898, 22058, 19789, 26742, 31724, 15479, 14138, 11500, -3815, 2111, 16520, 15315]
10644A5315j4086j3003L979R959J0505R491j816j4613J2055j903j1944q424j238
10631e723J3690J6639j3426j8651k86N820J599l157l90M858R836J2413p522j5363
10617C37j1042j3066N712J846J5163O268r187p331r060j413m2J3145K168J1557
10603E055J3381Q453j0805p65p705j1642M18o490N927J1085l716K786N134K188
10589A3304j5291n233k60k518mK586O942L134j043Q094Q661o19j4825m067l733
10574d872M225k13J0222n601j2442l079k877P764R090O845J1275K011l734j4585
10560D029p130K632j277J304N581J475J656j2437q757m316P06Q427R239j7192
10546a6060j7878O323J8769L997m961m707L480N606J865K759J0123J6644O858
$$ y = [15315, 1229, -11774, -7795, 2164, 12669, 22160, 20344, 5731, 17786, 15883, 3939, -4485, -5723, 7967, 24606, 11180, -7471, -7757, -1937, -338, -3495, -3885, 973, 10809, 23222, 15700, 337, -10705, -23771, -18059, -16213, -1050, 5218, -3969, -11300, -20360, -21773, -21815, -8670, -6502, 5055, 18436, 26889, 16084, 15319, 7614, -4028, -3610, -10100, -4173, 6912, 3196, 5982, 11116, 13304, -1987, -7220, -7480, -9998, -10002, -7416, -474, 2660, 1617, 9711, 18372, 17753, 2928, -1139, -4872, -647, -860, 9362, 3761, -8681, -11760, -14637, -6873, 2217, 9062, 20337, 22348, 18614, 4029, -3101, -469, -1746, -442, 5139, 6614, 8270, -4167, -12924, -17240, -16534, -8107, 1132, -16060, -33938, -27615, -8846, -4849, -9810, -14517, -11037, -5431, -3566, -807, 9316, 25960, 32818]
10533C2818k763j4638l978o219r028r56J0689M856j5365J578J8615K568n592r685
10519B900K990J5090J000j2862l222P534P041N565M78r018k310n436j3663K567
10505a346P580M233m570J8859N458n256k603O347N029o719k4546j1470m639J2401
10491a242J1330L021L704Q485l819J038J203q890j0655K481J770J6019r665j3742
10477A038L059Q03l012O922l896J2211k552M919J5972k2520n475o592o950p133
10463a3206o224j3629N086J0846J2092Q088J371j1893k078R32P523J9066p046
10450A0928j1708m273n624K54P281l693m206n744M942n550k400J309K1890N156
10436H562j1932N048j43r102R900J5745l116q478J0035O84j1077N602k962k311
$$ y = [32818, 30055, 15417, 11439, 5220, -3808, -4764, 5925, 10781, -4584, -3006, 15609, 18177, 12585, 2900, 5890, 20980, 21980, 9118, 5896, 13430, 20471, 26036, 26514, 17496, 15186, 9750, -3913, -1346, 6234, 10467, 5897, 24756, 30214, 24958, 22355, 28702, 33731, 27012, 2466, -9004, -13643, -1242, 10088, 13109, 16813, 25298, 21479, 22517, 23720, 14830, 4175, 6656, 8426, 24445, 14780, 1038, 4097, 4900, 1888, 8810, 4914, 17125, 14573, 19492, 35464, 12944, 7469, 877, -6073, -13206, -19430, -33059, -27973, -17127, -5035, 3053, 4424, -7469, -9547, -8615, -1092, 17974, 10928, -780, -5053, -10677, -10423, -3142, -6835, -11041, -16785, -11843, -17393, -19793, -18484, 3406, 8562, -3370, 1678, 1535, -7567, 2333, 18078, 14962, 6484, 16519, 17203, 6126, 11728, 8766, 6455]
10422F455k70J279M516L225j515p281J380J0925J6468K819l233j0957m636L823
10408B2998k032l88j3237j1829J385J0936j1190K243O964J3156j0202o436r054
10395f686N115J6741L15p799k042J6373O920j9687j6597J933N462p872n340N528
10381g636Q888P041m438l322l94J3661J245p08j0557o490j305j371p25K071M974
10366I34r203J214M907M22R09J6226k195j8654l970K2J091M396M617J6364P595
10351B4675j0490R447k929r920K12Q814N100J957j916m352j0070j0415j238r520
10337a0645q579J2074n857p385R630M663m392k59J3647Q654J029m047K082j0211
10323D04J1047Q590L64R586J878j9865j145P866P067N451J516o148j5163j5941
$$ y = [6455, 6185, 7464, 11980, 15205, 13690, 6409, 7789, 18714, 35182, 38001, 34768, 23811, 19175, 22998, 20966, 20578, 7341, -4488, -3103, 7833, -3357, -1114, 5850, 19006, 8804, 2368, -6686, -1571, 15170, 15485, 7686, 5644, 22017, 28937, 9250, -7347, -5414, 48, -7824, -13164, -7636, 1252, 8293, 3855, 533, 139, 13800, 15045, 14337, 3780, -2710, -4015, -5386, -6111, -4040, 934, -8269, -7055, -2148, -1726, -817, 15409, 13214, -5440, -9410, -9388, -8297, -3901, 716, 17080, 24675, 14185, 23632, 20703, 10783, 10995, 19809, 24909, 26866, 24950, 20598, 10528, 113, -1125, -10645, -19224, -7150, -13007, -20392, -10762, -6099, -10491, -10750, 2897, 11551, 12580, 8533, 10615, 404, 11451, 20041, 20405, 29991, 31869, 12004, 10859, 18725, 25792, 31243, 32759, 26611, 11448, -4493]
10309d493J347M138l203m52p845J4039P286o910J3185l758j2087m111K084J100
10295C20N950P295R48n439o391J4055Q342k8478o658J2476J2593R068O952j2234
10281A8799k626o537q580J0598L090J707j9857j1450J3885K165l281o62J621P895
10267F767M331k974l219k881o566O891P059P449O584k715R174K150m453P711J059
10252C6367q562j5428j6132r713n295J933R828K0728K324j5028p610o220m07Q764
10238d451O016N841J289J81K373N193n569j2707M610R812Q783r165j662O44j927
10223I261n202o766o042K841J4637P595n585K455j2910n774m193J2548k225K058
10209B698l941o875K612J4780J4791J456M089k938j0382j1113K868k629o916O481
$$ y = [-4493, -3146, 992, -2211, -2663, -10508, 3531, 10817, 3907, 17092, 13334, 1247, -2864, -780, 320, 6270, 13565, 14513, 9074, 2683, 16738, 25080, -3398, -10056, 2420, 15013, 24081, 31033, 18799, 16173, 9636, 1056, 11654, 14744, 16451, -3406, -14856, -971, 1194, -2087, -2749, -1128, 6767, 11098, 8124, 4905, 2024, -4542, 2349, 9408, 16857, 23441, 20726, 29900, 32050, 27597, 35308, 36367, 27805, 12377, -3755, -13468, -18763, -16830, -7002, 13726, 16050, 1022, -6588, -12808, -13215, -4451, 1565, 7406, 8695, 8876, 11249, 16442, 10873, -1834, 2776, 12588, 21371, 12206, 10544, 11188, 9261, 4059, -2707, -8749, -5908, 8729, 16324, 10739, 13194, 284, -5490, -9683, 2865, 640, 2698, -1243, -8118, -5506, 9274, 24065, 25521, 29610, 26672, 16290, 5177, 8045, 5416, -1500, 4981]
10195D981k27l825J0341M270j0500L972J2324Q462p480p199o653k780k56j1407
10181e977P789N333l966l639J2383Q457p199k124J446Q997Q891j904j4j0591j1702
10166F180L40j04K278J5165L148n044j9518p253Q969J7387J534n489l681l913
10152I999j1199o960m517n569N071L975J3573N838k112M195n621M089P93K383
10138A3938j0147q584j5221j1262K5941J3185o810m890K671K9868M655j3249P348
10125B7443q424j4037m178N864n670K252n872p28M246Q040J78M387R8p606J0612
10110A6605Q352p373j9899j0884O815J6893K422j0069J1040K894j7709j960J9766
10097A6893j875q092J1172j2611p002L233O29N127j3108o99J0220J688j824J3385
$$ y = [4981, 4754, 929, 11270, 15540, 5040, 9012, 21336, 29798, 22318, 15119, 8466, 5686, 5430, -5977, 1812, 7145, 3179, -460, 11923, 20380, 13181, 11057, 12503, 21500, 30391, 28487, 28473, 17882, 6180, 6520, 6416, 8694, 23859, 27007, 21963, 2445, -4808, 4161, 21548, 23082, 17593, 13912, 9999, -1200, -8160, -12677, -18246, -13175, -9200, 4373, 10211, 8099, 12294, 6673, 10762, 11555, 13938, 3791, -4793, -20014, -31276, -5335, 7850, 1040, -3850, -1179, 28689, 33344, 20095, 27443, 19019, 4982, 804, 6668, 998, 3250, -2622, -3350, 896, 8936, 9114, 13501, 13599, 5993, 16605, 24957, 17584, -2315, -13199, -6384, 10509, 12931, 2862, 13902, 16796, -913, -2873, 16893, 15018, 6926, 18098, 5487, -1515, 1718, 2347, 7474, -5634, -6333, 3887, 5575, 3751, 17136]
10083A7136K771q015j353K54J5084J2272k035p078j4879j864m509o42l598j2399
10069h855n804K316j32n914N110N933J6791q66J367M84r624J2488R219j181q203
10054A3129p959K786k079J6007l789j3338K037o005q583j0288Q931J2523K777
10041F149p716n770p34r824q597Q301J1048K0552J1084j1027J052k849J1553L542
10027B6764m895M338j482j4902o79q576J098Q702L110l509k701J8842J817N444
10013C3371m489L769q453o541Q692r23Q58p785j8365n214k83n404p435R662J5047
9998F507m860J6343P22m243L591Q083k090l685J720l679l895q59j711o352O467
9983A2059n292Q565r04j4426K766J1576O210j913p033P498J5238M469K84O528
$$ y = [17136, 19907, 11892, 10539, 10793, 25877, 38149, 36114, 29036, 14157, 12293, 7784, 7142, 3544, -8855, -14659, -12343, -12475, -18389, -13279, -7346, 9445, 8579, 9946, 10430, 806, 13294, 22513, 21332, 13129, 5170, 7956, 5877, 21884, 18095, 4757, 6794, 789, -7794, -18082, -9151, 3372, 6149, -1567, -7337, -8071, -17895, -26492, -18191, -7143, 13409, 24493, 13466, 14518, 11669, 23222, 26764, 21869, 26207, 24725, 9823, 9144, 568, 1666, 10368, 13478, 9969, 7268, 26110, 27927, 33371, 28882, 32651, 24198, 17657, 26349, 25426, 26284, 18499, 134, -5080, -5363, -10767, -18202, -8540, 6507, 1647, 17990, 18712, 14469, 18060, 26143, 24053, 20368, 22088, 18409, 14514, 13655, 11944, 5592, 12059, 6767, 15332, 14428, 2, 2768, 14344, 20554, 18641, 11608, 19106, 34344, 38813, 39097, 45625]
9969D5625J038m328p381j6793l221M771l521J4718Q812k324l650j1323o052L956
9955B0327j77k646K187k2N057Q768o803n197P674L712j0937L316J108Q72n809
9940B1430p288K819P667q705Q892J1061P293m682O187M779k1638n427k661j7017
9926B710R650J5380o529N831K600M394j1335M759J0698j1415j116q256M75J0161
9912B8007Q996J0423j6605o793J6241J0069o954O206p02j1045n295Q567J1071
9899E2186K340K498r447j042n749N389o968j0062K800n93M10j519R065L514l228
9884C9594Q226J0959k0494j4175L182r528K821J6467o070l606m433J2775J0310
9871D6028j6561m872J2091r001L623Q132J491M94n355k62q113m641n296R43Q046
$$ y = [45625, 46663, 42335, 34954, 18161, 14940, 19711, 16190, 30908, 39720, 37396, 33746, 22423, 16371, 20327, 20150, 17504, 19691, 19669, 24726, 33494, 26691, 21494, 29168, 32880, 21943, 25259, 26367, 27239, 21430, 14142, 16961, 24628, 15923, 24815, 35876, 43169, 38487, 44674, 49453, 27815, 22388, 19727, 2710, 12360, 27740, 21211, 27042, 29642, 34036, 22701, 27460, 38158, 26743, 25627, 17371, 17846, 28007, 37003, 47426, 30821, 24028, 40269, 50338, 43384, 49590, 48888, 37843, 32548, 41115, 52186, 54526, 57024, 47577, 46535, 40786, 46175, 39207, 29145, 31945, 31352, 31762, 30243, 39308, 42822, 39594, 47820, 58779, 38285, 24110, 27292, 17764, 20585, 37052, 30982, 27376, 22943, 35718, 46028, 29467, 24595, 36686, 27685, 31308, 39440, 40931, 41425, 36070, 35808, 27695, 23054, 17758, 18701, 26747]
9856B6747J8218J0251k1454j8110J4462l021J1048O960q35K627j1677P262J1797
9843E4275N158M61j717j2564j809L345M186q906N73J2613J471p159M782n55j778
9828E2376j7382J820J6893R056J6068J3483J262j3489j3830n764j0904P445l740
9815E3294M051J1618j643q914j6719p597N161O696J2856p953l750M919K481p819
9801D6681n891m935m772Q232J3689q187l154Q708O541l159k101j531m105j8413
9787B7603j8170m43N286O847L450P588n359L636O078O020L115J941L289R675K420
9772F2976q178q52K780R417j890R641j2856p465j0111M275L958j0105M132n514
9758D0208q128J0565P411q153l269j1189J034Q893l576L155P812O609J0000q356
$$ y = [26747, 44965, 55216, 33762, 15652, 30114, 27093, 38141, 45101, 44266, 46893, 35216, 42478, 54275, 59433, 59894, 58177, 45613, 43804, 47149, 51335, 42429, 43002, 55615, 57086, 49927, 54709, 54154, 52376, 34994, 36814, 53707, 62763, 78831, 92314, 93576, 80087, 66257, 60493, 49589, 57034, 53294, 57345, 68963, 67320, 58406, 41687, 34090, 39251, 45947, 58803, 50850, 47100, 52019, 54500, 46681, 40790, 35855, 31083, 39315, 53004, 44817, 41663, 50371, 56912, 53753, 51652, 50121, 46016, 27603, 9433, 8990, 14276, 21123, 24573, 32161, 26802, 30438, 36516, 42536, 45651, 47592, 50881, 60556, 62976, 54798, 53946, 56726, 66143, 64253, 73894, 61038, 53573, 43462, 47737, 51695, 41590, 45722, 40208, 32080, 42645, 50056, 41903, 38634, 27445, 28479, 37372, 33796, 36951, 44763, 51372, 61372, 53016]
9744E3016p619l593M708L042l510k344N148J1261P391j288n273n849l743r502
9730D1845j4533J7185J4813J1303j716o146N942j0647j0735K748L536q531l491
9717D1573j0606j9572J2074J3441p466j120l291J8042K2214l305j9493K415R035
9704E3941M148J584l090j815P278j1533j3536n415R905O338n077n716N676N030
9690D7718J3337M425j2778l800J4877P441J795q608j1267O216P291J734m572k476
9676F1333m399N57J0703m306r877N969M491L30j1411k481P836M383L985m761Q900
9661G1252j015j6738j6771j9315J505J2398J1681J5077J0306L189O515j4692m734
9648E8658j3534K262J7426N028K110K817m010J757q489l134K653O94N839j418
$$ y = [53016, 45397, 41804, 46512, 49554, 46044, 43700, 48848, 60109, 67500, 66212, 60939, 55090, 51347, 41845, 27312, 44497, 59310, 70613, 68897, 62751, 68693, 58046, 47311, 50059, 53595, 45064, 41573, 30967, 11395, 23469, 36910, 29444, 28324, 25033, 43075, 65289, 61984, 42491, 44906, 53941, 58089, 59673, 56583, 54768, 62046, 50513, 36977, 31562, 41467, 47805, 42728, 37012, 42688, 47718, 61055, 65480, 52702, 48902, 63779, 71220, 73015, 64407, 53140, 59356, 66647, 68381, 63809, 61333, 56934, 57491, 68194, 63888, 54011, 59980, 64471, 64801, 53390, 50909, 58745, 63128, 67113, 62352, 71252, 70237, 53499, 36728, 17413, 18918, 31316, 42997, 58074, 68380, 71569, 78084, 63392, 58658, 45124, 47386, 64812, 69840, 71950, 74767, 70757, 72514, 64025, 60891, 63544, 64238, 70077, 68659]
9634F8659J0281m63Q845J1305O661p747j6693j1731O268J4984Q033l795o454P965
9620I6118o888p258P880J5728J0489m36m538k200j2625p394K829m858k888J5546
9606I9505R694k0682N328J1628o076p742j825J3269N650K387K456O740R142p1
9592A29403K224l501n083J850o361J1631P894N099r174K992K374L24q785P877
9578A38764J1591n713j937o914m298j6307L94o99r472J8811J3023J182k223K010
9564A38212Q877m790j7964k90J3923M941m739k311J1423O14L865j5928j6181O626
9550A26278J2686N542N367M819q035Q42J2649q496j2043j647J809J4477J554J3201
9536A69003M104O245p001p123Q266K4496J4184K241N200O16p633L493N729j1833
$$ y = [68659, 78940, 78477, 87322, 98627, 105288, 97541, 80848, 69117, 75385, 90369, 98402, 94607, 88153, 96118, 89230, 81972, 89852, 105580, 116069, 115633, 111095, 108895, 96270, 88876, 91705, 86847, 83959, 99505, 109199, 88517, 93845, 105473, 99397, 91655, 89830, 103099, 108749, 111136, 113592, 120332, 129474, 129403, 131627, 128126, 123043, 124893, 118532, 130163, 138057, 143156, 133982, 136974, 139348, 139672, 130887, 138764, 150355, 144642, 142705, 135791, 131493, 115186, 115580, 114881, 105409, 124220, 137243, 138425, 136202, 138212, 147089, 142299, 124335, 124045, 137968, 142909, 138170, 135859, 147282, 147896, 151761, 135833, 119652, 126278, 138964, 144506, 149873, 154692, 146657, 147499, 160148, 151652, 139609, 137962, 139771, 154248, 155802, 169003, 173107, 179352, 172351, 165228, 173494, 197990, 212174, 214415, 219615, 220231, 212598, 216091, 221820, 209987]
9522B09987N382M481O60N974R294n505N085J1763j5641j2243j3550m874k09r198
9508A91406k694M835q019N967J3571P862k730K622m106j4636R273J6860k923m357
9494B12931j0840L373p202k336M171m560m42J9092O063j21o507M828k388O340
9480B22402L317Q577N39K88J65P37J5040J5391J1545J4347o997r077R257J2672
9466B98203P505k969j075P425J2250J8385K413M121n004l878J0930J4582j4457
9453C48431j4256q918l376Q122l390N122R909k7q804J104L395J0343N521N408
9439C58584R825Q027N518J2725N555O908J373k985R808P481q71J7977J866L277
9425D45068J7420J6193J5080J1094J601J5587J0342P723p62J3488J2580N149J3804
$$ y = [209987, 215369, 219850, 220510, 226484, 235778, 230273, 235358, 247121, 231480, 219237, 205687, 200813, 200604, 191406, 188712, 193547, 185528, 191495, 205066, 212928, 210198, 212820, 208714, 194078, 203351, 220211, 217288, 212931, 202091, 205464, 198262, 195926, 200097, 195537, 195095, 214187, 220250, 220129, 213622, 218450, 216062, 222402, 225719, 234296, 234835, 235123, 235288, 236025, 251065, 266456, 278001, 292348, 285351, 276274, 285531, 298203, 305708, 302739, 301664, 309089, 321339, 339724, 342137, 346258, 341254, 337376, 348306, 362888, 348431, 334175, 325257, 321881, 330003, 326613, 331735, 341644, 341617, 332813, 333917, 337312, 347655, 353176, 358584, 368409, 376436, 381954, 394679, 400234, 407142, 408515, 405530, 415338, 422819, 421948, 439925, 441791, 445068, 462488, 478681, 493761, 504855, 506456, 522043, 532385, 540108, 539346, 552834, 565414, 570563, 584367]
9412E84367R431J2380J7927K3008J4354K2936L0136L2414J3576K6215J6323L0488
9400H33555K6015J8143K8308K0056K0028M881J3214J7970J2922k086J5715J6684
9388A025405K0893j295j7070R80P162J9467J5611Q907J3771J4404K0532J8871
9376A147638J6094J4518J3901J4096J1336J7941L7164K5911K2835K5379L1743
9365A378556J8250K1645L2406K2802K7544M5467N1239L3671L0116L7669L9982
9354A739347J7910L4780O8234O0912M5438K6250M4776N3195M9915M6646N2091
9343B239494P3806Q7879P1220O1724P7657Q1562P8935Q2710Q4973Q8094J04627
9332C132681J19719J04416R3173J03168J17256J26667J30826J37706J55385J60636
$$ y = [584367, 593798, 606178, 624105, 647113, 661467, 684403, 714539, 746953, 760529, 786744, 803067, 833555, 859570, 877713, 906021, 926077, 946105, 950986, 964200, 982170, 995092, 993006, 1008721, 1025405, 1046298, 1045003, 1027933, 1028913, 1036075, 1055542, 1071153, 1080060, 1093831, 1108235, 1128767, 1147638, 1163732, 1178250, 1192151, 1206247, 1217583, 1235524, 1272688, 1298599, 1321434, 1346813, 1378556, 1396806, 1418451, 1450857, 1473659, 1501203, 1546670, 1597909, 1631580, 1661696, 1699365, 1739347, 1757257, 1792037, 1860271, 1921183, 1966621, 1992871, 2037647, 2090842, 2140757, 2187403, 2239494, 2313300, 2401179, 2472399, 2534123, 2611780, 2693342, 2772277, 2854987, 2939960, 3028054, 3132681, 3252400, 3356816, 3449989, 3553157, 3670413, 3797080, 3927906, 4065612, 4220997, 4381633]
9322D381633J58105J65399J87035K03524K03716J98715K24472K42063K59278K88650
9312F512590K98466L04833L27115L67452L78655L99237M55721M69690N15620N65477
9302A0594856N98596O32106O95388P70261Q30011Q90964R74201J055946J151438
9293A8193767J256770J381002J509118J627906J759636J934252K110611K270318
9285C2043380K469436K640528K825162L005692L173701L269685L330881L305004
9277E6063469L186702K925286K539831K003425J363010O40287j32486q98364j611396
9268F6079764k220008k681431k996646l212936l317351l315503l215323l076992
9260D2043574k922245k744277k562893k364711k163962j998858j850266j707005
$$ y = [4381633, 4539738, 4705137, 4892172, 5095696, 5299412, 5498127, 5722599, 5964662, 6223940, 6512590, 6811056, 7115889, 7443004, 7810456, 8189111, 8588348, 9044069, 9513759, 10029379, 10594856, 11193452, 11825558, 12520946, 13291207, 14121218, 15012182, 15986383, 17042329, 18193767, 19450537, 20831539, 22340657, 23968563, 25728199, 27662451, 29773062, 32043380, 34512816, 37153344, 39978506, 42984198, 46157899, 49427584, 52758465, 56063469, 59250171, 62175457, 64715288, 66718713, 68081723, 68722010, 68589524, 67691160, 66079764, 63859756, 61178325, 58181679, 54968743, 51651392, 48335889, 45120566, 42043574, 39121329, 36377052, 33814159, 31449448, 29285486, 27286628, 25436362, 23729357]
9252B3729357j568128j430654j306846j187902j100127j020154r42871q74059
9244A4298616q03543p33689o80620o41740n86354n60588n20834m68185m47908
9235H855155m22330l89375l67676l38579l30752k93106k68516k68428k56317k36547
9225E683529k16750k17231j98103j86709j83570j63332j62279j75009j52729j31894
9215C895923j21346j26617j32235j05707r2570j01905r3939j09371j07727q6693
9205B817813r1203q1926o4720o4293p1363p3375n7952n2094n2049o9973o8137
9194B070728p0371n8801m4681m2792l8151m2345n4086l9059j9647l2012m2054
9183A586729m9356m4196l7383l7492l8268l8040l8277k2845k1641l3014j5653
$$ y = [23729357, 22161229, 20730575, 19423729, 18235827, 17135700, 16115546, 15172675, 14298616, 13495073, 12761384, 12080764, 11439024, 10852670, 10292082, 9771248, 9303063, 8855155, 8432825, 8043450, 7675774, 7337195, 7006443, 6713337, 6444821, 6176393, 5920076, 5683529, 5466779, 5249548, 5051445, 4864736, 4681166, 4517834, 4355555, 4180546, 4027817, 3895923, 3774577, 3647960, 3515725, 3410018, 3317448, 3215543, 3121604, 3012233, 2904506, 2817813, 2726610, 2644684, 2579964, 2515671, 2444308, 2370933, 2312981, 2260887, 2208838, 2138865, 2070728, 2000357, 1941556, 1896875, 1854083, 1815932, 1773587, 1719501, 1680442, 1660795, 1628783, 1586729, 1537373, 1493177, 1455794, 1418302, 1380034, 1341994, 1303717, 1280872, 1259231, 1226217, 1210564]
9172A210564k7733l3580k0830j5030k6142k1074j8869l6705l7018j8342j6132
9161I39109j4947k2167k3325k5016k5132k7041l3850j8119n537k0231k5478j8048
9149F80218j118k1720j4927o628M198o980j7907j2189q075k439O322J1582j063
9136F09274j5917m60n74M708m882j2255q417Q987J2428j2937r567j1679j7399
9123E41310n615K678l982j3227j4683M755R311N873L867j7378K398L917M530n33
9109E23221r935n640j1023k2268k1890q440l364k723k390n225K715K98p708j4691
9095D10937M159q342j2390n418J225m466k6125l577K721n863n576J0797p281K060
9081C52861m626k5390j8495Q342N268L810M126K846P493r069r527K291r73r007
$$ y = [1210564, 1182831, 1149251, 1128421, 1113391, 1087249, 1066175, 1047306, 1010601, 973583, 955241, 939109, 924162, 901995, 878670, 853654, 828522, 801481, 767631, 749512, 743975, 723744, 698266, 680218, 679100, 657380, 642453, 635825, 640023, 633043, 615136, 602947, 594872, 592433, 598755, 610337, 609274, 593357, 592897, 592323, 597031, 592149, 579894, 571477, 580464, 592892, 579955, 570388, 558709, 541310, 535695, 538373, 534391, 521164, 506481, 511236, 520547, 526420, 530287, 512909, 515307, 519224, 523754, 523221, 513286, 507646, 496623, 474355, 452465, 444025, 440661, 437938, 435548, 430323, 433038, 433336, 425628, 410937, 415096, 406754, 394364, 388946, 390171, 385705, 359580, 356003, 358724, 352861, 347285, 358082, 350801, 352861, 348235, 322845, 304350, 312692, 317960, 321770, 325896, 328742, 336235, 327166, 317639, 319930, 318957, 309950]
9067C09950o22j0785p492j600m183J3512R79k332L583J1810k836P440L714j5292
9053C05846l327k380Q514j5725O65k546n491j641p278q23p790o61j0336j2692
9039B44335q185P354n544r162K246J1850n269j090q135o096j597M440j3r265l53
9024B15516L881J4387N051j7422l720l188j3873l912j752M082p765J1062m89j2738
9010A89120j5721O443J394m826J2884K6868L940j0567j3407j0079r769r997Q398
8997A74681L131M319L705R09j8523n207Q012j3262j5118L794J0004R698N111l506
8983A67748k818j5514j4316q90j363L830J1763J085n367k291L240m445n618R562
8969A44606Q976J210N5q650M228r481k6071r725j995R612J0368o59j1381M344
$$ y = [309950, 309328, 298543, 291051, 289451, 285268, 298780, 299759, 297427, 301010, 312820, 309984, 317424, 321138, 305846, 302519, 300139, 308653, 292928, 293593, 291047, 285556, 283915, 276637, 275814, 268024, 267363, 257027, 244335, 236150, 243504, 237960, 228798, 231044, 242894, 237625, 236535, 228400, 222304, 220707, 225147, 225134, 215869, 215516, 219397, 233784, 238835, 221413, 217693, 214505, 200632, 196720, 194968, 199050, 191285, 202347, 201858, 189120, 173399, 179842, 181236, 176410, 189294, 216162, 220102, 209535, 196128, 186049, 176280, 166283, 174681, 177812, 182131, 185836, 186745, 168222, 163015, 171027, 157765, 142647, 146441, 156445, 166143, 171254, 167748, 164930, 149416, 135100, 134210, 132847, 136677, 148440, 149525, 144158, 141867, 145107, 140662, 135044, 144606, 153582, 154792, 154847, 146197, 150425, 140944, 114873, 105148, 103153, 112765, 123133, 122474, 111093, 115437]
8955A15437P346o277j5585J1831R500n98m898o34M91n217q839J330Q038J4944
8941A26869M623L299J525q042o509m410K400q395K117R100l069O276N151j0020
8927A20915j0328J945o235m661J1662N280p146R758j3425M886M299j5653j7473
8914H3824J540O403J4118M962n886j0479j938R434j0824M204K926J04M698J3018
8900A16104j0374j9145m853l850k843J955L886O138p510L655J39j3413n113J1626
8886G6402J2818M985L262o633o694P392r416o326m206R489J1195J157o015R854
8872I7264N431r850o463K18J734o535J0734N912j5650j2103l961K909P260m839
8858G2061m849M658L150n928k573k955J2196J0614M398J2760j1638l387N048O03
$$ y = [115437, 122783, 116506, 100921, 112752, 122252, 121654, 116756, 116122, 116613, 111396, 102557, 103887, 111925, 126869, 131492, 134791, 136316, 128274, 121765, 117355, 119755, 111360, 113477, 122577, 119508, 125784, 130935, 120915, 110587, 112532, 106297, 101636, 113298, 118578, 111432, 121190, 107765, 112651, 116950, 101297, 83824, 85364, 91767, 105885, 110847, 104961, 94482, 92544, 101978, 91154, 95358, 98284, 98388, 103086, 116104, 105730, 86585, 81732, 77882, 75039, 76994, 80880, 87018, 79508, 83163, 83302, 69889, 64776, 76402, 89220, 94205, 97467, 90834, 84140, 91532, 82116, 75790, 71584, 81073, 92268, 93425, 87410, 97264, 102695, 92845, 86382, 86600, 88334, 81799, 92533, 98445, 82795, 70692, 66731, 69640, 76900, 72061, 67212, 71870, 75020, 69092, 66519, 63564, 75760, 86374, 90772, 103532, 91894, 88507, 93555, 94158]
8844I4158q588l345n768o4P798P130k125o054j0683Q274k807r138r937K971n722
8829E6100J22j1762J0559O582M38L4J5064J3432j4182k2205m545k928m082l895
8815C8732K0313J8381N809p200L766L43j7880j4573P126J155M065L890K634r33
8801F5628l353j3215j3555k607K989O362j6786j356J8679j1069j4797K741K079
8788B1740J0834m532n921p492n513J0845J4144J0918N603K261m892j5843r668
8775B2484r6j31R224R125M044o974P023J743M34M935o722q322o69K864J0349M130
8759E3441r523M27J333N016P945j1969j7798J3105O059o302j561k255j757l818
8745C2343j255N346p42O895Q603l521L959L064j956n512m334N2O109j837n841
$$ y = [94158, 85570, 82225, 76457, 76393, 84191, 91321, 89196, 83142, 72459, 80733, 77926, 68788, 58851, 61822, 56100, 56222, 44460, 55019, 61601, 62039, 62073, 77137, 90569, 76387, 54182, 49637, 46709, 42627, 38732, 59045, 77426, 83235, 76035, 79801, 80144, 62264, 47691, 54817, 55972, 60037, 63927, 66561, 65628, 62275, 49060, 35505, 32898, 35887, 42249, 25463, 24107, 42786, 31717, 16920, 19661, 21740, 32574, 28042, 22121, 14629, 9116, 19961, 34105, 45023, 50626, 52887, 47995, 32152, 22484, 22388, 22257, 31481, 40606, 44650, 37676, 44699, 46442, 46876, 51811, 45089, 36767, 36098, 38962, 49311, 53441, 43918, 44345, 45678, 50694, 58639, 46670, 28872, 41977, 48036, 41734, 40173, 37918, 36161, 32343, 31088, 36434, 35692, 42587, 51190, 47669, 51628, 54692, 52736, 47224, 42890, 42942, 49051, 47214, 41373]
8730D1373j3959K253L492j992J0132M32M720M323L310J1195J278q435n976K3J990
8715E4159p957p05m510j3691j4636o86K1533K1179j2727j1360j880j589q035l05
8701A8790J9209J2660n174q214K765L839L196p513l715O425n147j636k398K1633
8687E4720J0387k2098o970j2009j0721O339J2320m183o09P86J737j352O658n457
8673B9548O095J198j687j5923q105k343J3052k524m758J2080M787O01Q649k305
8659C8365q254p36J027N203q022n176k623J1610K089Q942M891j0644j4560O576
8645B8688m241K365J0760Q544Q677q420j1590N849k882n071R020L463j918j0603
8631C2641P62J3440P213o791j0074N704l406j3169m974O073n110L266P604n365
$$ y = [41373, 27414, 29667, 33159, 31167, 41299, 41731, 46451, 50774, 54084, 65279, 66557, 58122, 52146, 52169, 54159, 46202, 45497, 40987, 27296, 12660, 11974, 33507, 54686, 41959, 30599, 28719, 27130, 19095, 18790, 37999, 50659, 45485, 37271, 40036, 43875, 47071, 39558, 35843, 42268, 37121, 35485, 33087, 54720, 65107, 43009, 36039, 24030, 13309, 19648, 31968, 27785, 27176, 27962, 29699, 28347, 35005, 29548, 35643, 36841, 35154, 19231, 11126, 8783, 21835, 19311, 14553, 26633, 31420, 32021, 40670, 38365, 30111, 29375, 30402, 35605, 27583, 22407, 19784, 31394, 33483, 42425, 47316, 36672, 22112, 28688, 24447, 26812, 37572, 46116, 54793, 46373, 34783, 40632, 37750, 32679, 41699, 45162, 43244, 32641, 33403, 46843, 54056, 47265, 37191, 42895, 39489, 26320, 21346, 27419, 22309, 25575, 33179, 27814]
8617B7814j3885j973k310k176k198l037J0539O147o329J835m350n61N022J213
8603A5751M302J117o325R806K403K73K492J3984k900L429J204P379j099J802N967
8588E9585j2366r848l654M846o208o491m881Q07Q920l012r523j9286J871J0504
8574A1264J2664K623j2993J360R442K742r559p823J3094Q263P340K987j1437l178
8560B6789n332J340l113N29j478k896q93J0408P339P28O091K362o6q506l508N631
8544C5425j0993n045O556Q578j146l143p360j6827p896o608N833J2049J2742R360
8530C1525j75O96l409N724r793j152m131j844Q209M302k5813K785J1314k711M91
8515A6018m678j2459O09J3921J221O518M891q880n732K615j483l857P699n879
$$ y = [27814, 13929, 11956, 9646, 7470, 5272, 2235, 12774, 18921, 12592, 14427, 10077, 9516, 14538, 15751, 20053, 21170, 14845, 24651, 27054, 27327, 29819, 43803, 40903, 44332, 45536, 52915, 51816, 53618, 59585, 47219, 37371, 33717, 38563, 32355, 25864, 20983, 21790, 30710, 27698, 18175, -1111, 760, 11264, 23928, 26551, 13558, 14918, 24360, 27102, 17543, 9720, 22814, 31077, 38417, 41404, 29967, 26789, 21457, 22797, 19684, 20213, 18735, 15839, 14946, 25354, 32693, 33421, 39512, 41874, 41808, 33302, 29794, 35425, 24432, 19387, 25943, 34521, 33375, 30232, 22872, 6045, -1851, -8459, -2626, 9423, 22165, 31525, 31350, 32046, 28637, 34361, 24568, 23416, 19285, 17441, 25650, 29952, 4139, 6924, 18238, 15527, 16018, 11340, -1119, -510, 13411, 14632, 21150, 26041, 17161, 11429, 14044, 12561, 8704, 16403, 10524]
8501A0524p467N682J990J0873P524N583k914O893p836k442j77k890R307J6642
8487E1292K069k5079k0829j855L065Q986J0689k298j3533J8310J1284n076l632
8474C3393o254q003J120j2627l996K587M621m897M123l022n263K055M375j630
8460F582Q695L83J5648J267r473k082j1381l030O396p298m756J1451J0901L43
8446B3646J10m888P028J981p978l347M369J081M53K303m878R204K098j8381k690
8431A0111J670L929K322J0441Q779n090l103K24j1754l095O11k246M176M755l151
8416A8579j2052j1465J0794K569l314O32O833R252P824J8466n355o645n614j4190
8402A6314q057O063J1929l657N922n651o991J0719R592l693N773j633o536N096
$$ y = [10524, 3057, 8739, 10729, 21602, 29126, 34709, 31795, 38688, 30852, 28410, 28233, 25343, 34650, 51292, 53361, 28282, 7453, 5598, 8663, 17649, 28338, 26040, 12507, 30817, 42101, 37025, 33393, 27139, 19136, 20256, 7629, 3633, 6220, 10841, 5944, 10067, 7045, 1782, 3837, 8212, 6582, 15277, 15660, 31308, 32575, 23102, 21020, 9639, 6609, 13005, 5707, 951, 12402, 23303, 23646, 23756, 18868, 25896, 27877, 19899, 16552, 20921, 22002, 22455, 24758, 19880, 29084, 31182, 12801, 10111, 11781, 15710, 18032, 28473, 37252, 32162, 29059, 29283, 17529, 14434, 15045, 12799, 16975, 21730, 18579, 6527, -4938, 5856, 8425, 5111, 5743, 12576, 21828, 29652, 48118, 42763, 36118, 30504, 16314, 8257, 14320, 26249, 22592, 28514, 22863, 15872, 26591, 36183, 32490, 38263, 36630, 30094, 35190]
8388C5190O164p282j2088p437q923q68l368j3882r475j0208J2807O667J2163N037
8374D497m166N722j78J5411L030k311j5354J0954J3967j415J0083j8025r257J607
8360A4565K292n216q113J3078q31o872R973N877K014j3649j3942K077K1230J368
8346B3851J32j6056k995L046J0465j897k730m49k66q776p375J021M120K414j5662
8331a1157o166J975J8848J085J699R086L545N778P353R759r166L810j3757j1375
8317A1317m15Q895K0606k74m063n879j1350r276n68O474n790m850p956o677N666
8302d140J1714q08Q601N515o889o756q958l317l545M068P222k970M784O036M747
8287A5304J6466J6566r257j3115r49R150R801n768k581k849j6149j3075p824J0642
$$ y = [35190, 41354, 34072, 21984, 14547, 5624, 4756, 1388, -12494, -21969, -32177, -19370, -12703, -540, 4497, 331, 6053, 5875, 21286, 24316, 22005, 6651, 17605, 31572, 30157, 40240, 22215, 12958, 14565, 16857, 11641, 3528, 16606, 15775, 8903, 18876, 24753, 26767, 13118, -824, 1253, 22483, 23851, 23983, 7927, 4932, 7978, 18443, 16546, 13816, 13367, 13101, 4325, -3050, -2029, 2091, 4505, -11157, -17323, -15348, 3500, 4585, 6284, 15370, 18915, 24693, 32046, 41805, 32639, 36449, 22692, 11317, 10902, 19797, 40403, 40129, 36066, 30187, 18837, 9561, 8993, 15467, 9677, 4827, -3129, -9806, -4140, 7574, 6766, 15367, 20882, 13993, 7237, -1721, -5038, -8583, -4515, 2707, -263, 4521, 10557, 15304, 31770, 48336, 39079, 25964, 25015, 34165, 43966, 38198, 35617, 32768, 16619, 3544, -4280, 6362]
8273F362J1111l695L285K520O619L74O93q390n330n448O597r249m964J9571K935
8258B2991Q70J955q469n518p449P86l324J5251K23k726Q375m367q97L166r694
8243A1173j5806q552K547M437O637k614j0041J4578m518p786K233R28J1781N927
8229A0924q936j628j04Q207j642L520J3856N450r808p088n478M814N127J3681
8215C0895J0641j0386j3870m041j0981Q802J0183j5594o601J5871M152M584Q261
8202C1916j2488k3974k2946M229K410O798R544k024J1041N150j0873q811Q444
8189a584O088P289j2443J996O951m693O48K390r01n529q069j3874j024Q505M740
8174i510p768J255J3089J1998R617k48m639m887r878J529r83Q566O33l403L95
$$ y = [6362, 17473, 13778, 17063, 19583, 26202, 26576, 27269, 18879, 13549, 8101, 14698, 5449, 485, 20056, 22991, 23861, 25816, 17347, 11829, 4380, 5166, 1842, 17093, 17316, 14590, 22965, 18598, 17701, 20867, 11173, -4633, -13185, -10638, -6201, 436, -2178, -12219, 2359, -2159, -9945, -7712, -6784, 4997, 10924, 1988, 360, 256, 8463, 6821, 10341, 24197, 29647, 19839, 12751, 7273, 12087, 17214, 30895, 41536, 31150, 17280, 13239, 2258, 11060, 21243, 5649, -952, 14919, 19071, 23655, 31916, 19428, -4546, -27492, -23263, -20853, -14055, -4511, -6535, 4506, 9656, -1217, -10028, -1584, 4504, 11793, -650, 1346, 8297, 3604, 4252, 6642, 5741, 212, -7857, -21731, -22755, -14250, -9510, -17278, -16023, -2934, 9064, 18681, 18433, 13794, 8907, -971, 558, -425, 8141, 8774, 5371, 5766]
8159E766O159j969j2022k525n082O071M178m953n776L396L736o199j784O043M5
8144d916M398O092M630O175J1006P363q338j6392j8048J4450Q180K591L472m010
8130A6653j5045j2339l056k502Q237J3143J1352k593k5611N399P679N514O098
8117A2929j83K030l72k1450j1631J7444J0994O196N184K88j4811j8341j1732j391
8103b4846J5798J6243J4438m43m804j2384J858J1194k124l604j1910o298j836
8090h718o98n50j859O026o14o038J011m41J0071N723J155k729j1599R01m543r106
8074b2008J0129K0977J5977O55r379o028j2793q710J320J5395J7992J0563k534
8061C1556J1531k437j4991k9548k1851Q16J6021R694M694L442J2935L833j3839
$$ y = [5766, 11925, 9956, -2066, -4591, -9673, -3602, 576, -4377, -10153, -6757, -3021, -9220, -11004, -4961, -4916, -518, 5574, 10204, 16379, 27385, 34748, 26410, 10018, -8030, 6420, 14600, 17191, 20663, 16653, 1608, -10731, -13787, -16289, -8052, 5091, 16443, 13850, -11761, -6362, 1317, 6831, 12929, 12746, 14776, 14404, -7046, -18677, -1233, 9761, 15957, 21141, 21429, 6618, -11723, -23455, -24846, -9048, 7195, 21633, 21190, 16386, 4002, 5860, 17054, 14930, 11326, -584, -6882, -8718, -9416, -9966, -11825, -5799, -6413, -12451, -11440, -11881, -1810, 3913, 5068, 2339, -9260, -8359, -12902, -22008, -11879, 9098, 25075, 25730, 16351, 10323, -2470, -11180, -9860, 5535, 23527, 34090, 31556, 43087, 40650, 25659, -3889, -25740, -24924, -8903, 791, 5485, 8927, 21862, 25695, 11856]
8048A1856p396J611J825l366j3613N729J1082R761r93j7191r593K767J1540K765
8034F784J361O434Q629J0594m676M213j381j3061J3126M93p313k198J906j201
8020B3710k199M404M950k1895j2889r370l029J2174J47k775L597J2217J074L554
8006A3670n259O719M498K790j902j158j2428q596J0137R316L041p433n330j894
7992F171J5433J4100O566n27j0020k255n771N114m705j2620j2012p227K1617m757
7978I107m897K419l123j4364l424J1331J2780J0420q287j3572o216O909K2179
7965B1262j27j7335M262P898l338j1475O442J8402j995j993o573j5926r076J52
7951i420L915p455r50J980N528L239O551J3845O366R426j1062j1737j218O690
$$ y = [11856, 4460, 6071, 7896, 4530, -9083, -3354, 7728, 17489, 16496, -695, -10288, -7521, 4019, 6784, 8145, 14579, 23208, 33802, 29126, 33339, 31958, 18897, 32023, 32516, 25203, 23005, 24911, 23710, 21511, 25915, 30865, 8970, -3919, -13289, -16318, -4144, -3997, -6772, -3175, 9042, 10116, 13670, 8411, 15130, 19628, 22418, 20516, 19358, 6930, -1666, 8471, 17787, 20828, 13395, 8065, 6171, 21604, 35704, 42270, 41743, 31723, 29468, 23697, 28811, 24106, 11486, -526, -7753, 13864, 9107, 4210, 6629, 3506, -10858, -14282, -2951, 9829, 20249, 11962, -1610, -7826, -917, 21262, 21135, 3800, 8062, 15960, 12622, 1147, 7589, 25991, 23996, 22003, 15430, -496, -9572, -9420, -5505, -12960, -13910, -11930, -6402, -3163, 3388, 17233, 23599, 33025, 21963, 10226, 9008, 15698]
7937A5698j1303l918j539J641p707m710J808k828M147J1817K61l909L163Q740
7923A1361M364M190o498j2565r134l204J4614J4778m512N508L210j0097r593L056
7909E478R28o21P061J5607N072j1228l164j4603l201j0500m208J2175J2385M745
7895A5926m932j2652m756K111o85k625m035k30j236l080j743J557Q566J6483R878
7880A8547M331K188r215k615j537j3543r417j12R643M099J0185M168j5812K295
7866C205N804j0077m927r932r112N289j1885M559K2001P004j1672r548P625M173
7852g493L241J0724r680J1475J4730j1946o631k982m152J4643J2164n898j1253
7839F942q4k254P88m402J1364o050k930J1134J0744l012p557J961R505K476m365
$$ y = [15698, 4395, 477, -1062, 579, -7128, -11838, -10030, -12858, -8711, 3106, 3367, -542, 2621, 11361, 15725, 19915, 13417, 852, -8282, -11486, 3128, 17906, 13394, 18902, 22112, 12015, 2422, 5478, 6406, 5785, 12846, 28453, 33525, 22297, 19133, 4530, 1329, -9171, -13379, -1204, 11181, 15926, 10994, -1658, -6414, -4303, -4988, -7613, -11648, -11878, -13114, -16194, -17937, -16380, -7814, 8669, 18547, 22878, 25066, 15851, 13236, 11699, -1844, -11261, -11373, -1730, 2369, 12554, 16722, 910, 3205, 9009, -1068, -5995, -15927, -25039, -19750, -31635, -27076, -5075, 1929, -9743, -19291, -11666, -7493, -4252, 6472, -3208, 8267, 22997, 11051, 4420, 1438, -2714, 11929, 24093, 18195, 6942, 6858, 4604, 5392, 990, 12354, 6304, 3374, 14508, 25252, 22240, 14683, 16644, 26149, 28625, 24260]
7824B4260k463j270O3j3649m095p225k073j026Q001K878n230N247o912M423R671
7809A0600l576o816R541j5503n717l798k600j837n774j327K1497R224r763p975
7795a3824J7044L817J0603O338j9895K048Q322N564l062O486r54m916r972J1075
7781A8674r30o007j4560l41m11k924l39L107J8862N756j5493j1302j2906j4984
7767c3798J3070K1627k166J361j0843o596L083Q859R923P748n467r397M0l714
7753f270k908j3852o486J5450M36M141O568k623m603J0447q348J684J0441P021
7739A1098L936j6798j713L135Q21r280O276Q531r160K49p544o128J13n788L213
7724a9039J7922J0565m233l140n150q845m934M432P636l544N671K0193P84j2247
$$ y = [24260, 21797, 20527, 20590, 6941, 2846, -4379, -6452, -7478, 523, 3401, -1829, 3418, -3494, 929, 10600, 7024, 208, 9749, -5754, -11471, -15269, -17869, -19706, -25480, -26807, -5310, 3914, -5849, -13824, 3220, 7037, 17640, 23978, 4083, 6131, 14453, 20017, 16955, 23441, 22487, 17571, 7599, 18674, 17744, 11737, -2823, -3164, -3575, -6499, -6838, -3731, 15131, 20887, 5394, -5908, -18814, -33798, -20728, 899, -1267, 94, -10749, -17345, -14262, -5403, 4520, 12268, 6801, -2596, -2556, -6270, -9178, -23030, -29516, -14066, -13630, -9489, -2921, -5544, -10147, 300, -8048, -6364, 4077, 11098, 15034, -1764, -3477, -342, 479, -8801, -2525, 6006, -3154, -2905, -10449, -16577, -16464, -22252, -19039, -1117, 9448, 5215, 2075, -3075, -11920, -16854, -12422, -4786, -8330, -2659, 17534, 18318, 6071]
7710F071K069P053k168j5796k6004M280m042n103J4278M961j5104R31K2060N025
7696a489l660M441r332o861j522J0384M068o11K943P927n199j313l874k847j2851
7681a9796l076k999P686J1326J0725Q008q836R707Q4N102J0235M638L751j4749
7667B1806j6423N837J6707l420j3410k554n494j1149j1389L53J0963O909P966
7654F702R168J27J358K215j2226k213N073O615m740j62K648k0978j1207J9350
7640A730n804q959K170P737J4687r612n437l133l110Q998o406j2029L190R552
7626f426J3224O377j1458j1284O631K527r267j8002j1026P418J8202J0381J660
7613a043k1057q89J0107n201Q519p9J205M495o020O145J5858j648O167l444j9224
$$ y = [6071, 8140, 15193, 13025, -2771, -28775, -24495, -28537, -33640, -19362, -14401, -29505, -28574, -6514, -1489, -5149, -708, -10040, -16901, -18423, -8039, -3971, -4582, -1639, 6288, 1089, -224, -4098, -6945, -19796, -22872, -25871, -18185, -6859, 3866, 11874, 3038, 12745, 12829, 17931, 28166, 32804, 36555, 21806, 5383, 11220, 27927, 24507, 11097, 8543, 3049, -8100, -19489, -19136, -8173, -1264, 6702, 15870, 15997, 17355, 19570, 7344, 5131, 10204, 16819, 12079, 11917, 14565, -6413, -17620, 1730, -4074, -13033, -10863, -3126, 11561, 1949, -3488, -6621, -9731, -733, -7139, -19168, -15978, -6426, 6798, 13175, 1717, -9567, -2936, -409, -9676, -27678, -38704, -31286, -13084, -2703, -1043, -22100, -22989, -12882, -18083, -9564, -9643, -8438, -3943, -9963, -3818, 12040, 10392, 16559, 13115, -6109]
7598f109P785L007j581k543M956l729m69j611J0160k163N355j0303K963J1446
7584A7164l068k334M183q455m197M004R614M517p190l173o781j0390k225L590
7570d741N757R983J853r602o954j4005L484j900j8251J4539P690l867J5335P535
7556F856l094k73K210m373k0640j1018J4265J8939j97Q286J1632n715n409o010
7542E459p137k752o418P296L075M848n32j587p864n836P001O164j843r107j0494
7527a9727m001J4499P89q90O321k152n71J3167j954P918n159p287j2936K992J6948
7512G957L04k317j596q0r873J5391K022m546J093K463j2392P775J2870j0073J1066
7497B0064J462K255j4146J73J3610n92n047n675J7705J998k2422j9649q585K345
$$ y = [-6109, 1676, 4683, 3102, 559, 5515, 1786, 1317, -294, 9866, 7703, 13058, 2755, 5718, 17164, 14096, 11762, 15945, 7490, 3293, 7297, 16911, 21428, 14238, 11065, 4284, -6106, -8331, -4741, 1016, 10999, 12852, 3250, -3704, -17709, -14225, -16125, -34376, -19837, -12147, -16014, -679, 6856, 3762, 3489, 5699, 1326, -19314, -30332, -16067, 2872, 2675, 10961, 22593, 16878, 11469, 5459, -1678, -4430, -10848, -3552, -477, 4371, 3839, 2252, -5612, -11448, -4447, 1717, -126, -9233, -19727, -23728, -9229, -8440, -9330, -3009, -5161, -5732, 7435, 5481, 13399, 8240, 953, -11983, -8991, 7957, 8261, 5944, 4348, 4268, -5605, 9786, 11808, 7262, 8355, 10818, -1574, 6201, 19071, 8998, 20064, 21526, 23781, 9635, 9808, 23418, 22826, 17779, 12104, 29809, 31807, 9385, -10264, -18849, -16504]
7483a6504J7924L483q652Q491j0334l715N255k195j064j869l67n755L461j71l978
7468a5990Q941R987N438P647l09L242m027o043k927p688j336q584n546M604J0716
7453a875N168j720j489j0224j2554P110P573L13Q257K412p881j8850o317O464
7439b3613Q054n359J1236Q393j841Q65j7049l204J3310J1551p848M967L567q412
7425e383m512o361K980J3472K020K276j461J460r907Q711J0336q923P964M432
7411A7104j5046P627q943j7103j3556N917N652J7753P258p412j6306J2032L975
7398a048k182L775M549M258J341j5225j1962J1023R72n81N528P737O78q396j624
7383a157J281r924m137j6050N741K5671o450n658j409R549O420O390m020o742
$$ y = [-16504, 1420, 4903, -3749, 4742, -5592, -9307, -4052, -6247, -7311, -9180, -9547, -15302, -11841, -12012, -15990, -7049, 2938, 8376, 16023, 15714, 18956, 14929, 8886, 5959, -1729, -3065, -11649, -17195, -12591, -1875, 3293, 1573, 84, -10140, -22694, -15584, -8011, -7698, 559, 2971, -4910, -23760, -30077, -23613, -15559, -20918, -9682, -1289, -3130, -2265, -19314, -22518, -9208, 2343, -5505, -538, 3029, -5383, -9895, -16256, -13276, 196, 2216, 4492, 3031, 4491, -5416, 3295, 13631, 4708, 12672, 17104, 2058, 9685, 742, -16361, -29917, -24000, -18348, -595, 6663, -749, -17055, -5023, -1048, -3230, 545, 5094, 9352, 10693, -4532, -16494, -5471, -4499, -5080, 448, 8185, 8863, 467, -1157, 124, -9800, -13937, -29987, -24246, 1425, -5025, -10683, -12092, -2543, 3877, 10267, 6247, -495]
7369d95j708r234m115M24p200M521j918o168P321J7491P012N05J4672N794j2644
7354A4258p79K59L222J497j2010P925N291l748J438N583k632j6347l539J2O310
7339F740l268q852K599J7451p5q083n746j50L602m719q28N19J366L182j1496J097
7323f661N513L558J2622n299k181J1284j1973k4527m434K4654P106L39Q459j2641
7309E819o188p014l115L704L203O945n549l874l373P730J668q90n82J666r45M818
7293D023j65j3732K634J2074L635m035m916Q260P994O140j0843M894Q455m90o603
7278A7325j5642q835m445n547J3127J0624m909q975j23M977R401P956n305j0404
7264g75o122J2604J1923q343j2434l552J536L749l645L032J0003q958j9071j751
$$ y = [-495, -2203, -11437, -15552, -15128, -22328, -17807, -19725, -25893, -18572, -1081, 5931, 6436, 21108, 26902, 14258, 13479, 13738, 16960, 18457, 6447, 14372, 19663, 15915, 17353, 22936, 20304, 3957, 418, 430, 6740, 3472, -5380, -2781, 14670, 14595, 6512, 766, 616, 4218, -501, -1329, -810, 556, 3738, -7758, -6661, -1148, 2410, 15032, 9733, 7552, 18836, 6863, -17664, -22098, 2556, 9662, 10001, 18460, 5819, -369, -7383, -10498, -6794, -3591, 3354, -2195, -6069, -9442, -1712, -44, -934, -1516, 150, -795, 4023, 3858, -9874, -7240, 4834, 8469, 4434, -482, 7778, 15772, 21912, 11069, 15963, 24418, 23928, 17325, 1683, -7152, -11597, -17144, -4017, 6607, 1698, -7277, -7400, -2423, 6978, 14934, 9629, -775, -6897, 5707, 17630, 9287, -3147, -6699, -5163, -1414, -5059, -2027, 7976, -982, -20053, -21804]
7250b1804l356m17J5040j0711j0517J2628P603M306Q472L911N070R602L30L368
7236B3525j8397j5953J6720J4734O031r777k626q959J323j702j832p372q721r739
7222b2745J3861J0367l584j3733j741L93J5908n218j7583J976N664K649Q242O176
7208F32L145j333p48j5083k3627J53K2472J6830L046r943n774j1209K528J4962
7194c949p860O469Q581J1004o865r757o490K173K219p547q86K258j3865P98r63
7179b4680N608J869m131k082L228O062p33o308j0429p204L1394K9155j1236j4235
7165c722J1635o420j4260O14K234N103J671J532P607m635r192k3184k59J3121
7151a8155N598N3M315J2503R61k4241p067R764N210j804o812M145J795o62N747
$$ y = [-21804, -25160, -25577, -10537, -21248, -31765, -19137, -11534, -7228, 1244, 5155, 10225, 19827, 20157, 23525, 5128, -10825, 5895, 20629, 26660, 16883, 14257, 5298, 6621, 4919, 3087, -4285, -13006, -22745, -8884, 1483, -2101, -15834, -17575, -17182, -1274, -6492, -24075, -22099, -16435, -13786, -5544, 632, 3777, 2444, 1696, -13387, -37014, -36861, -14389, 2441, 5487, -4456, -10230, -21439, -18911, -3949, -11809, -5340, 3241, 14245, 7380, -2377, -8867, -6694, -4475, -12022, -12908, -10650, -24515, -23717, -24680, -19072, -17203, -21334, -23416, -20188, -14126, -14859, -21167, -31596, -38800, -7406, 21749, 10513, -3722, 7913, 1493, -12767, -12153, -9919, -4816, -3145, -1613, 5994, 1359, -7833, -31017, -31276, -18155, -12557, -12504, -8189, 4314, 5275, -18966, -26033, -16269, -11059, -12863, -19675, -15530, -13735, -14397, -8650]
7136h650R220M659l497p962l201o490P45O269N747p46N9j499K317J928M873j4520
7120a0748q104l06q17m715o259L345N043L490M244J6367m05O165j727n913o749
7105g089m223J306P578mk303p631j3506K682K2129J3682o075l233k113O333p28
7090F805j623j671k0465k1300Q511K0115J9036J1866j6401j4327l214K601K052
7077h015j849O431M380J2470n807j0199j107L202O403j487j2409M72p770m931
7063b0216N255j205P734L870l491M724j0885m77J156n067r71K1522J5416j514
7049A5851J0985j810j3706j3835n214j0157J425J1977K968j96p013l128p864m046
7035b3763J003k162P087R116k715p657J212J225q10M022O492J0345o324k088n376
$$ y = [-8650, 570, 5229, 1732, -6230, -9431, -15921, -15176, -8907, -3160, -3906, -3847, -5346, -3029, -1101, 3772, -10748, -18852, -19158, -19975, -24690, -30949, -27604, -22561, -19071, -14827, 1540, 1135, 7300, 5573, -340, -7089, -11312, -10006, -2428, -2432, -4735, -12366, -25872, -23190, -1061, 12621, 6546, 3313, 1200, 7533, 6805, 5182, 3511, -16954, -38254, -29743, -9628, 9408, 21274, 4873, -9454, -12668, -10067, -8015, -9864, -3433, 947, 13417, 7610, -2589, -3696, -494, 5909, 4422, -7987, -7515, -15285, -20216, -14961, -16166, -8432, -4562, -8053, -3329, -14214, -14691, -13535, -18602, -19573, 1949, 17365, 15851, 26836, 25026, 11320, -2515, -7729, -17886, -16461, -4484, -1516, -1712, -8725, -11853, -19717, -23763, -22760, -24922, -17835, -8719, -11434, -19091, -17879, -16654, -17464, -13442, -6950, 3395, -2929, -5017, -10393]
7020a0393P10j032L64N452m745J347j5329p849Q022Q661M929O976j358o361J6902
7005F296J2954o740r609J071k001r828O30Q016m07m206O52k118J060P892O84o330
6989a984m972J4145J0956p991l838o846R650j3240r593l434J1621P503n771O757
6975B963l297j2736M056K964L793p638P909J0362j0321n256j763k019R108j656
6961c531m755j2107l058N945J6062P584L770k527O887k658j0491L977N673k423
6947H348K664p351j0406m192j381l030J4986O902l56k94L731J2025m961m462r274
6932B949n416J075o168r075m717j1086l443L040J0616K0811K209M312k353j8809
6918a6055j6534J828K1343P323k165m664L44K200p612j349O554N888n669Q085
$$ y = [-10393, -9683, -10715, -10351, -4899, -9644, -8297, -23626, -31475, -23453, -14792, -9863, -2887, -4245, -10606, 6296, 19250, 12510, 2901, 3972, 1971, -7857, -7227, 789, 382, -3824, -3172, -5290, -4230, 3662, 4346, -1984, -6956, 7189, 18145, 10154, 6316, -530, 9120, -4120, -13713, -17147, -5526, 1977, -3794, 2963, -334, -13070, -9014, -6050, -2257, -9895, -1986, 8376, -1945, -7201, -8964, -10983, -1875, -3531, -8286, -20393, -23451, -17506, -1444, 6140, 9910, 7383, 14270, 11612, 1121, 5098, 10771, 8348, 11012, 3661, -6745, -10937, -12318, -15348, -362, 6540, 6184, 5890, 9621, 21646, 16685, 12223, 2949, -2467, -1392, -7560, -16635, -21352, -32438, -35881, -32841, -22225, -1414, 795, 5107, 2754, -16055, -32589, -30761, -9418, -2095, -4260, -8924, -8580, -6380, -13992, -15341, -8787, -2899, -8568, -483]
6904d83K0373o039k0342Q899P510l159j61l039r302k042L05O433r07j1519N766
6889g707P978N782J0568L605p842k0582j0194M584O821J853l563j725p306K306
6875a5422n483M485J9887N427R674k629P799K3j0924k714j6060j7485q110o332
6861c7864L125J2479J1600J0497O624P495l692j9651j412R133K765k754o426M660
6847c421m6j891j682q864J356Q107R510O552p190J395m497n492j3428j463K2326
6832A272o011o558P814M637k610J0480K635P205O73N003j2245r390k834p457j775
6817i161r25J715p42n868o895Q81J1103J0310J0560o02j1526j3126K115o063O879
6802a1345O614q82k411J2920Q455j396j4811J799J706o129P14K603j6350J264
$$ y = [-483, 19890, 13851, -6491, 2408, 9918, 6759, 6598, 3559, -5743, -7785, -7480, -1047, -1954, -13473, -7707, 271, 6053, 16621, 20226, 12384, -8198, -18392, -13808, -6987, -5134, -8697, -10422, -17728, -15422, -20905, -16420, 3467, 8894, 18568, 15939, 23738, 23761, 12837, 10123, -5937, -23422, -31532, -37864, -34739, -22260, -10660, -163, 6461, 13956, 10264, -9387, -10799, -1666, 1099, -1655, -8081, -3421, -3467, -5358, -7040, -15904, -14548, -6441, 3069, 9621, 2431, 3826, -671, -6163, -19591, -21054, 1272, -4739, -11297, -3483, 1154, -1456, 9024, 11659, 18864, 19537, 24540, 12295, 2905, 71, -7386, -9161, -10086, -8371, -9113, -14981, -21876, -20995, -9892, 418, 10978, 10376, -1150, -14276, -12161, -18224, -11345, -4731, -5613, -8024, 4896, 13351, 11955, -2856, -1057, 649, -5480, -4766, -2163, -18513, -17249]
6788a7249J1993o455j428N58j464J9178J2032j5514r372L920J2103J5805j812
6775B2295k3054p365J114J4527J4852l573j0881K095N79j0752l570o136K003J0027
6761B161n280k658J0617K4821N248j6223m254n14j3097j240M812%N157J3046q780
6746A3816j2025M270J377n773P792P640J741J134n801N05L181q247o594P383j214
6731I185j9142n176J5599J6633J625Q836m451j6286P816J4236P184j48J2882J599
6717E0392Q296J0352n119K018j0179j7668n137J5328r325j426j0262K939o515
6704B3694k785l934L606O019J462j47j4096j1020R535M629k601o155q58K416p272
6689B493P62j2607j4754J2606P374j091L574J6364j0912o336O176J5150R493K73
$$ y = [-17249, -5256, -11711, -13139, -12581, -14045, 5133, 17165, 1651, -7721, -3801, 8302, 24107, 22295, -759, -8124, -7010, 7517, 22369, 18796, 7915, 10010, 10589, -163, -3733, -9869, -7866, 2161, -3119, -5777, 4840, 29661, 34909, 18686, 14432, 13918, 821, -419, 4393, 4393, 9550, 22596, 13816, 1791, 6061, 7438, 1665, 9457, 17097, 18838, 19972, 14171, 14676, 17857, 9610, 3016, 10399, 9185, -9957, -15133, 466, 17099, 18724, 27560, 23109, 6823, 14639, 28875, 36059, 35911, 48793, 50392, 58688, 69040, 63921, 65939, 55760, 38092, 32955, 48283, 38958, 37532, 27270, 30209, 23694, 20909, 16975, 20581, 26600, 28062, 27915, 13819, 2799, 12334, 16963, 14362, 8207, 7349, 9765, 2493, 3255, -9352, -24106, -11500, -4126, -5217, -1643, 14721, 3809, -2527, 3649, 18799, 28292, 28565]
6675B8565l243j3218L878l692j9979k2270j731K1190K841m86p775J1946L732j5054
6661a5296K362P363M185L575J1704O758j7715p187o876J6810L319L349l330M67
6647I488n144j0368J2475K598j0554j3J4386r92k896j4948Q397K993o671j5308
6633a6557J2767J2156M27J205J827o221j1050p220J366R464M30M632K121o143
6619g96L02j083J110j287p895l939n809n295N689l131q720j461n06J4190l716
6604b2347J2819Q084l626m668n97N716Q765K209p012k0444J383J0981P712m498
6590e523r04M141J5633j40n646Q946j3064k316J1393q819N985j979j6808m502
6576a3603r172l047q465l33k362J3245J5068o229O318R33O489M622M457r93N028
$$ y = [28565, 25322, 12104, 15982, 12290, -7689, -29959, -31690, -10500, -7659, -8145, -15920, -3974, -242, -15296, -12934, -5571, -1386, 2189, 13893, 20651, 2936, -4251, -11127, 5683, 9002, 12351, 9021, 9488, 4344, -6024, 6451, 9049, -1505, -1518, 12868, 11876, 8980, -5968, 2429, 5422, -1249, -16557, -3790, 8366, 8793, 9998, 11825, 5604, -5446, -12666, -11300, -1836, -1406, 3226, 5347, -796, -494, -1577, -467, -1754, -9649, -13588, -19397, -24692, -19003, -22134, -30854, -32315, -32821, -18631, -22347, -9528, -1444, -5070, -9738, -10335, -4619, 4146, 6355, -657, -21101, -19718, -8737, -1025, -5523, -6427, -2286, 13347, 13207, 7561, 16507, 3443, 1127, 12520, 3701, 9686, 7707, -9101, -13603, -22775, -25822, -34287, -34620, -36982, -23737, -8669, -14898, -8580, -7647, -1158, 3464, 7921, 6928, 11956]
6561A1956j3134j2100j587n745O96o128J068K9217J1551J949k938n323N398r09
$$ y = [11956, -1178, -13278, -14865, -20610, -19914, -26042, -24974, 4243, 15794, 17743, 14805, 9482, 14880, 13971]
$$ [...]
##END NTUPLES=NMR SPECTRUM
##END=
