##TITLE=Analysis number 315113
Compound Code cc 06324
Book Reference 440/94
Project Code adrs
Chemist Name craigr
##JCAMPDX= 6.0         $$ Bruker NMR JCAMP-DX V2.0
##DATA TYPE= NMR SPECTRUM
##DATA CLASS= NTUPLES
##ORIGIN= Bruker BioSpin GmbH
##OWNER= NMR
$$ XWIN-NMR		Version 3.5
$$ Tue Nov  8 09:01:58 2005 GMT Standard Time (UT+0h)  MAYBRIDGE\NMR@NMR_250MHZ
##.OBSERVE FREQUENCY= 250.131544655141
##.OBSERVE NUCLEUS= ^1H
##.ACQUISITION MODE= SIMULTANEOUS (DQD)
##.ACQUISITION SCHEME= undefined
##.AVERAGES= 16
##.DIGITISER RES= 18
##SPECTROMETER/DATA SYSTEM= dpx250
##.PULSE SEQUENCE= zg30
##.SOLVENT NAME= CDCl3
##.SHIFT REFERENCE= (INTERNAL, CDCl3, 0, 16.436)
##AUDIT TRAIL= $$ (NUMBER, WHEN, WHO, WHERE, WHAT)
$$ ##TITLE= Audit trail, XWIN-NMR		Version 3.5
$$ ##JCAMPDX= 5.01
$$ ##ORIGIN= Bruker BioSpin GmbH
$$ ##OWNER= NMR
$$ C:\u/data/dgb/nmr/ADRS/11990/pdata/1/auditp.txt
$$ ##AUDIT TRAIL=  $$ (NUMBER, WHEN, WHO, WHERE, WHAT)
(   1,<2005-11-08 09:01:27.71 +000>,<MAYBRIDGE\NMR>,<NMR_250MHZ>,
      <created by zg, POWCHK disabled, PULCHK disabled
       configuration hash MD5:
       62 19 C7 07 E1 42 D1 B7 37 6C 3D D0 77 39 F9 E6
       data hash MD5: 64K
       4C 4E B4 51 1C F3 92 60 B6 1C 37 2B 8E 7D 6D 3D>)
(   2,<2005-11-08 09:01:44.74 +000>,<MAYBRIDGE\NMR>,<NMR_250MHZ>,
      <Start of raw data processing
       ef LB = 0.3 FT_mod = 6 PKNL = 1 SI = 32K 
       data hash MD5: 32K
       6F EA 61 69 22 64 27 FB 86 06 EB 9D 0F A9 C7 2B>)
(   3,<2005-11-08 09:01:46.75 +000>,<MAYBRIDGE\NMR>,<NMR_250MHZ>,
      <apk 
       data hash MD5: 32K
       67 26 D3 98 37 5E A5 91 55 D3 AC 7A BD 2E 6C 0B>)
(   4,<2005-11-08 09:01:47.85 +000>,<MAYBRIDGE\NMR>,<NMR_250MHZ>,
      <abs ABSG = 5 
       data hash MD5: 32K
       39 F1 10 F5 19 24 57 02 A2 61 FE DE 46 5E 22 FF>)
$$ ##END=
$$ 
$$ hash MD5
$$ 62 2B 61 D0 83 1F 0A 0F 71 9F F9 89 1C E8 64 21
##$RELAX= 
##$RELAX= 
##$RELAX= 
##$RELAX= 
##$RELAX= 
##$RELAX= 
##$RELAX= 
$$ Bruker specific parameters
$$ --------------------------
##$DU= <C:\u>
##$EXPNO= 11990
##$NAME= <ADRS>
##$PROCNO= 1
##$TYPE= <nmr>
##$USER= <dgb>
##$AMP= (0..31)
100 100 100 100 100 100 100 100 100 100 100 100 100 100 100 100 100 100 
100 100 100 100 100 100 100 100 100 100 100 100 100 100 
##$AQSEQ= 0
##$AQ_mod= 3
##$AUNM= <au_zg>
##$AUTOPOS= <2 >
##$BF1= 250.13
##$BF2= 250.13
##$BF3= 250.13
##$BF4= 250.13
##$BF5= 500.13
##$BF6= 500.13
##$BF7= 500.13
##$BF8= 500.13
##$BYTORDA= 1
##$CFDGTYP= 0
##$CFRGTYP= 5
##$CHEMSTR= <none>
##$CNST= (0..31)
1 1 145 1 1 1 1 1 1 1 1 1 1 1 1 1 1 1 1 1 1 1 1 1 1 1 1 1 1 1 1 1 
##$CPDPRG= <>
##$CPDPRG1= <>
##$CPDPRG2= <>
##$CPDPRG3= <>
##$CPDPRG4= <mlev>
##$CPDPRG5= <mlev>
##$CPDPRG6= <mlev>
##$CPDPRG7= <mlev>
##$CPDPRG8= <mlev>
##$CPDPRGB= <>
##$CPDPRGT= <>
##$D= (0..31)
0 1 0 0 0 0 0 0 0 0.06 0 0 0 0 0 0 0.0002 0 0 0 0 0 0 0 0 0 0 0 0 0 0 
0 
##$DATE= 1131440486
##$DBL= (0..7)
120 120 120 120 120 120 120 120 
##$DBP= (0..7)
150 150 150 150 150 150 150 150 
##$DBP07= 0
##$DBPNAM0= <>
##$DBPNAM1= <>
$$ [...]
##$SUBNAM7= <"">
##$SUBNAM8= <"">
##$SUBNAM9= <"">
##$SW= 20.6930455092707
##$SWIBOX= (0..15)
0 0 3 0 0 0 0 0 0 0 0 0 0 0 0 0 
##$SW_h= 5175.983436853
##$TD= 65536
##$TD0= 1
##$TE= 295.16
##$TE2= 300
##$TE3= 300
##$TEG= 300
##$TL= (0..7)
0 120 120 120 120 120 120 120 
##$TP= (0..7)
150 150 150 150 150 150 150 150 
##$TP07= 0
##$TPNAME0= <>
##$TPNAME1= <>
##$TPNAME2= <>
##$TPNAME3= <>
##$TPNAME4= <>
##$TPNAME5= <>
##$TPNAME6= <>
##$TPNAME7= <>
##$TPOAL= (0..7)
0.5 0.5 0.5 0.5 0.5 0.5 0.5 0.5 
##$TPOFFS= (0..7)
0 0 0 0 0 0 0 0 
##$TUNHIN= 0
##$TUNHOUT= 0
##$TUNXOUT= 0
##$USERA1= <user>
##$USERA2= <user>
##$USERA3= <user>
##$USERA4= <user>
##$USERA5= <user>
##$V9= 5
##$VALIST= <valist>
##$VCLIST= <CCCCCCCCCCCCCCC>
##$VD= 0
##$VDLIST= <DDDDDDDDDDDDDDD>
##$VPLIST= <PPPPPPPPPPPPPPP>
##$VTLIST= <TTTTTTTTTTTTTTT>
##$WBST= 1024
##$WBSW= 4
##$XGAIN= (0..3)
0 0 0 0 
##$XL= 0
##$YL= 0
##$YMAX_a= 643236
##$YMIN_a= -473687
##$ZGOPTNS= <>
##$ZL1= 120
##$ZL2= 120
##$ZL3= 120
##$ZL4= 120
##$ABSF1= 16.43597
##$ABSF2= -4.257202
##$ABSG= 5
##$ABSL= 3
##$ALPHA= 0
##$AQORDER= 0
##$ASSFAC= 0
##$ASSFACI= 0
##$ASSFACX= 0
##$ASSWID= 0
##$AUNMP= <proc_1d>
##$AZFE= 0.1
##$AZFW= 0.1
##$BCFW= 0
##$BC_mod= 0
##$BYTORDP= 0
##$COROFFS= 0
##$CY= 12.5
##$DATMOD= 1
##$DC= 0
##$DFILT= <>
##$DTYPP= 0
##$F1P= 14.0000005364418
##$F2P= -0.99999901652339
##$FCOR= 0.5
##$FTSIZE= 32768
##$FT_mod= 6
##$GAMMA= 0
##$GB= 0
##$INTBC= 1
##$INTSCL= 1
##$ISEN= 128
##$LB= 0.3
##$LEV0= 0
##$LPBIN= 0
##$MAXI= 10000
##$MC2= 0
##$MEAN= 0
##$ME_mod= 0
##$MI= 0
##$NCOEF= 0
##$NC_proc= -2
##$NLEV= 6
##$NOISF1= 0
##$NOISF2= 0
##$NSP= 0
##$NTH_PI= 0
##$NZP= 0
##$OFFSET= 16.43597
##$PC= 1
##$PHC0= 75.06945
##$PHC1= 6.525118
##$PH_mod= 1
##$PKNL= yes
##$PPARMOD= 0
##$PSCAL= 4
##$PSIGN= 0
##$REVERSE= no
##$SF= 250.130021518181
##$SI= 32768
##$SIGF1= 0
##$SIGF2= 0
##$SINO= 400
##$SIOLD= 32768
##$SREGLST= <1H.CDCl3>
##$SSB= 0
##$STSI= 32768
##$STSR= 0
##$SW_p= 5175.98343685301
##$SYMM= 0
##$S_DEV= 0
##$TDeff= 65536
##$TDoff= 0
##$TI= <Analysis number 999999
Compound Code 99
Book Reference 9
Project Code 9>
##$TILT= no
##$TM1= 0
##$TM2= 0
##$TOPLEV= 0
##$USERP1= <user>
##$USERP2= <user>
##$USERP3= <user>
##$USERP4= <user>
##$USERP5= <user>
##$WDW= 1
##$XDIM= 32768
##$YMAX_p= 380483381
##$YMIN_p= -86855
$$ End of Bruker specific parameters
$$ ---------------------------------
##NTUPLES= NMR SPECTRUM
##VAR_NAME=  FREQUENCY,     SPECTRUM/REAL,   SPECTRUM/IMAG
##SYMBOL=    X,             R,               I
##VAR_TYPE=  INDEPENDENT,   DEPENDENT,       DEPENDENT
##VAR_FORM=  AFFN,          ASDF,            ASDF
##VAR_DIM=   32768,         32768,           32768
##UNITS=     HZ,            ARBITRARY UNITS, ARBITRARY UNITS
##FACTOR=    0.157963299565203, 1,           1
##FIRST=     4111.12960641114, 0,            0
##LAST=      -1064.85383044187, 0,           0
##MIN=       -1064.85383044187, -86855,      0
##MAX=       4111.12960641114, 380483381,    0
$$ Real data points
##PAGE= N=1
##DATA TABLE= (X++(R..R)), XYDATA
$$ [...]
19242A0103j825m925O792J482p058j480j696L516p98K541k763k147J862J168m439
19227C33R665J2245L602J326k578r115P926J1603q373j8055K61Q453R89m819j404
19212A2059Q539N409o47p093j3773n930L66N494O073M702K790o234L707J331l514
19197A3279L71K70J1791K103m717p231q154m059L916M897n052K92k214j41K067
19182G418J124p509L417P627n268j484L64P89j2852j0633Q809O963m76K575O01
19167A465l484M610K229q945m464M465q09r553P984K804q49p034m669J3039J8292
19152A5081J0957o759r072L277J5709m817k123L612n926m731L383P257J0255N157
19138D1260r530j3032m75M258N369P499j071m08m24N576L044l330M753o887n488
$$ plain form
19242 10103 8278 3353 10145 11627 4569 3089 1393 4909 4111 6652 3889 1742 3604 4772 333
19227 333 9998 22243 25845 27171 24593 15478 23404 35007 26634 8579 8840 17293 18282 13463 12059
19212 12059 20598 26007 25360 18267 4494 -1436 -1070 4424 10497 15199 17989 11755 15462 16793 13279
19197 13279 13650 13920 25711 27814 23097 15866 7712 3653 7569 12466 7414 7706 5492 5351 7418
19182 7418 8542 1033 4450 12077 6809 5325 5689 6478 -6374 -17007 -8198 -1235 -1711 864 1465
19167 1465 -2019 2591 4820 -4125 -8589 -4124 -4933 -14486 -6502 -3698 -4547 -11581 -16250 -3211 15081
19152 15081 26038 19279 10207 13484 29193 24376 22253 25865 19939 15208 18591 25848 36103 41260
19138 41260 31730 18698 18223 22481 27850 35349 34278 33870 33446 39022 42066 38736 43489 36602 31114
19123C1114p68p670l26l204j08J3107R274j1037j1872j781J0921L864q389k42
19109B2883J344p472j698L072J21l608L446P107M873J0157J1706K037K086P288
19095F3342R598J018K728J1225N797M913l103j1140L949N449K377j511n150j402
19081H8090m799o531k345P880P838P946P906P049j94O76k362K095N682M371K557
19066A25859Q316J5943J7591J2334J2909J2172N756O312J4330J8809K8294M1158
19054C19783M6580M5700M1137L7449M4025M5100O3532P3238O2034M7271N4528
19043H80377N2854M7213O0988P8098J00819J38539J96308K34282L14055M19872
19033B523405N79045Q43741J394104K452114M179837N018843K485184n45688k5829
$$ plain form
19123 31114 30346 22676 22350 19146 19038 32145 41419 30382 18510 16729 27650 31514 23125 22883
19109 22883 24227 16755 15057 18129 18250 14642 18088 25195 30068 40225 51931 53968 56054 63342
19095 63342 72940 73958 76686 87911 93708 98621 95518 84378 88327 93776 96153 94642 89492 88090
19081 88090 83291 76760 74415 82295 90133 98079 105985 113034 112840 113516 111154 113249 118931 123302 125859
19066 125859 134175 150118 167709 180043 192952 205124 210880 217192 231522 250331 278625 319783
19054 319783 366363 412063 453200 490649 534674 579774 643306 716544 778578 825849 880377
19043 880377 933231 980444 1041432 1119530 1220349 1358888 1555196 1789478 2103533 2523405
19033 2523405 3102450 3946191 5340295 7792409 11972246 16991089 19476273 18930585 18904756
19024A8904756J680121L947640O688721M796099j794405m714451l295564k428720
19016B3784197p13138P04534j721303m094528l322495l006898l117306k332080
19008F180983j442368r29588o72759m79145l31436k27938j54777r4403o1602k2748
18998A764219j4158k0794J256J8166j0519l856P321j3234R76J9294L6062P0899
18986A855632J38494J87597K70343L80165N03160P25441J156544J957902L482553
18977A0657831N393015M823214R68289p77285Q49775K811450N893348P362289
18969C7981926K080517m433658m641257l072672k088062J49715j79217l566442
18961B2230850m334454l362752l481941l121468k086463j304923q91564o63365
$$ plain form
19024 18904756 20584877 24532517 31221238 36017337 34222932 29508481 26212917 23784197
19016 23784197 23071059 23775593 22054290 17959762 14637267 11630369 8513063 6180983
19008 6180983 4738615 3809027 3136268 2657123 2325687 2097749 1942972 1848569 1786967 1764219
18998 1764219 1750061 1729267 1730523 1748689 1738170 1734314 1741635 1728401 1729377 1748671 1784733 1855632
18986 1855632 1994126 2181723 2452066 2832231 3335391 4060832 5217376 7175278 10657831
18977 10657831 16050846 20874060 21842349 21065064 21914839 24726289 30619637 37981926
18969 37981926 40062443 35628785 30987528 27914856 25826794 25976509 25797292 22230850
18961 22230850 17896396 14533644 11051703 7930235 5843772 4538849 3647285 2983920
18953B983920m84030l54193k63542k01562j50671r5468o7050p3514q9143q1528
18943A123219r0743q6906o2840n3830o2763o3354o7482o5290o2511n6648m2787
18932D08065k6515k0792j5379j6426j8475q693n047j6008k1737n317P888R757
18920B71321P489J1704l649p085j385q751j5846l487M594j3001k6566k1672j9336
18907A74330j0979j0514j4343o432l809L508p802K298o792j0752Q259J4363Q996
18894A40331k806J229P16l597n079M69L4j979q498K752J154q271n076N827N335
18879A22541K785O291J5479K4321R630p204m181k936j963R627J5762P371r204
18866A88319R487J2172K659j7489k5130p719K086J1989P952r717j7283j5695k6770
$$ plain form
18953 2983920 2499890 2145697 1882155 1680593 1529922 1434454 1367404 1293890 1204747 1123219
18943 1123219 1032476 945570 882730 828900 766137 702783 635301 570011 507500 450852 408065
18932 408065 381550 360758 345379 328953 310478 301785 296738 280730 258993 253676 261564 271321
18920 271321 278810 290514 286865 279780 278395 269644 253798 250311 254905 241904 215338 193666 174330
18907 174330 163351 152837 138494 132062 128253 131761 123959 126257 119465 108713 116972 131335 140331
18894 140331 137525 138754 139470 135873 130794 131263 131297 129318 120820 123572 124726 116455 111379 117206 122541
18879 122541 125326 131617 147096 171417 181047 173843 169662 166726 164763 174390 190152 197523 188319
18866 188319 197806 209978 212637 195148 170018 162299 164385 176374 184326 174609 157326 141631 114861
18853A14861j6247N33o811Q815J3488K3042K2264L666m938J1679L7094K4039P946
18840B39431J853j0856j290j0549p869r648p206o801r485j6827j1485k696j8685
18827A27887P82j063p120J1237J4385J3351Q974j2022q802q18k664J6527J4513
18814A75167N124j1666k8772k1161j0367m050q644j0902K339p400m006M644J923
18801H2229O204n296j4667q237K235P907J8577K9567K1449N069K834J8763L7549
18788B04183N2467K4336k352l2624l1767r451p241j4348j5382k3675k2567j0953
18776A10626j4715o866o331m687m534l147k552J06k238J0519J1889J2496L2265
18763A32831J6998j1366j7185j5643r927j4839q218j570p147p897k200r653j641
$$ plain form
18853 114861 98614 99147 92336 101151 114639 137681 159945 163611 158673 170352 207446 231485 239431
18840 239431 241284 230428 229138 218589 210720 201072 193866 187065 177580 160753 149268 146572 127887
18827 127887 128669 127606 120486 131723 146108 159459 168433 156411 147609 146791 144127 160654 175167
18814 175167 180291 168625 139853 118692 108325 104275 95631 84729 87068 79668 75662 80306 82229
18801 82229 88433 83137 68470 60233 62468 70375 88952 118519 139968 145037 147871 166634 204183
18788 204183 256650 280986 278634 246010 214243 204792 197551 183203 167821 144146 121579 110626
18776 110626 95911 89045 82714 78027 73493 70346 67794 67900 65662 76181 88070 100566 132831
18763 132831 149829 138463 121278 105635 95708 80869 72651 71081 63934 56037 53837 44184 42543
18750D2543Q083Q203j057j217q342l279m719l602k012k94N269J780J0377L287
18736E5020j1848o994O14L585P122o334m246l268m892O205K65m714n48j681N427
18721C3713N670k16m774o481k064L63O486J1891J629j3584q598Q471K991k808
18707C2689j662M920l564o811P651k163J515o9M526M269J381O621j310j2107K858
18692C8744k672J62M083N251N170J771j5008n137L879R922k716p009k785J661
18678C5316q503j2604r90N793R62L33J1599l13n854l171J495M330J2399n024p791
18663B7977n087l856O60P185M985M757n032K275m690l871M71J747Q228k355n449
18648B7945o898l191l342j091O945Q154k173r46O377j392K31n629m439n330N106
$$ plain form
18750 42543 50626 58829 57772 56555 48213 44934 40215 36613 34601 34307 39576 41356 51733 55020
18736 55020 43172 36178 36792 40377 47499 41165 36919 33651 28759 34964 35229 30515 29967 28286 33713
18721 33713 39383 39167 34393 27912 25848 26211 32697 44588 46217 32633 24035 32506 35497 32689
18707 32689 31027 35947 32383 25572 33223 31060 32575 32506 37032 41301 42682 49303 47993 35886 38744
18692 38744 36072 36234 40317 45568 50738 52509 37501 32364 36243 46165 43449 36440 33655 35316
18678 35316 26813 14209 13219 19012 19974 20307 31906 31593 25739 22568 24063 28393 40792 35768 27977
18663 27977 22890 19034 19694 26879 31864 36621 31589 33864 29174 25303 25774 27521 35749 33394 27945
18648 27945 21047 17856 14514 13423 20368 28522 26349 25403 31780 30388 30619 24990 20551 15221 20327
18633B0327n49O173Q727L795o037p153K113P311J0695M121L58o961J464l19L531
18618D7596R53J913k25j1141l941M820m423M374J0812q250m783m276p089L12m33
18603B6219M01l088m523P853O938N054L5p752n428Q031J2110K218k609j023R867
18588E4303J8201K2304K5682N248j6357o369L253l522m943j0623j2925P684J0526
18575I2462J9311J3332J8644Q433j2869j7490j2752j1153j2414r974m458N319
18563G6391l507l605m005m152P907Q269k995r355l349O856J5072K1991J7183J9726
18549A42427J2411L741l038p955j8359k3874r504l280l159J653J4066K2221K3927
18536A51277L0663P698m442o259k0097k7949k4775k0503j5852P37j072P55J8171
$$ plain form
18633 20327 19778 25951 34678 38473 32436 25283 27396 34707 45402 49523 49881 42920 44384 44065 47596
18618 47596 48549 50462 50237 39096 35155 39975 35552 39926 50738 42488 37705 33429 26340 26652 26219
18603 26219 26620 23532 19009 26862 33800 38854 38889 31137 25709 33740 45850 48068 45459 44436 54303
18588 54303 72504 94808 120490 125738 109381 103012 106265 102743 97800 87177 74252 81936 92462
18575 92462 111773 125105 143749 152182 139313 121823 109071 97918 85504 75530 71072 76391
18563 76391 72884 69279 65274 61122 69029 77298 74303 64948 61599 68455 83527 105518 122701 142427
18549 142427 154838 158579 155541 147586 129227 105353 95849 92569 89410 91063 105129 127350 151277
18536 151277 181940 189638 185196 178937 158840 130891 106116 85613 69761 70498 69426 70181 88352
18523H8352k023O796J2641N772q891m705j3291q72N363K7897L6988O312r136n446
18509A45757R919J6372L2841L2933J4925j1225k0075j4587l248L5216K0406j9
18497B59215k1922j9903k9639l1162k2068j3434k476M007j95J4713J1508K4359
18485A73003K7804M745j6600j6137j8179k3406j7576j850Q43K211M014K222l702
18472A17392k469J56J513L660R360K522R481M280M634P210J7418J7814J5290J6584
18458B24845J8273K1583M1949O0690L7671K243k1007j2493J837K9416K9162n970
18446D28199k3556j7468j0482j3416p960J6211J1133J185P924J2122K5396M1286
18434D70574N0888O8794Q8626J13984J67443K47788L94691O55986J158720J831004
$$ plain form
18523 88352 86329 93125 105766 111538 102647 97942 84651 83779 89142 117039 154027 160339 151203 145757
18509 145757 155676 172048 204889 237822 252747 241522 221447 206860 203612 238828 259234 259215
18497 259215 237293 217390 187751 156589 134521 121087 118611 122618 122423 137136 148644 173003
18485 173003 200807 205552 188952 172815 154636 131230 113654 111804 112647 114858 118872 121094 117392
18472 117392 114923 115079 116592 120252 129612 132134 141615 145895 150529 157739 175157 192971 208261 224845
18458 224845 243118 264701 306650 367340 405011 407254 386247 373754 375591 405007 434169 428199
18446 428199 404643 387175 376693 363277 355317 371528 382661 383846 391770 403892 429288 470574
18434 470574 521462 590256 678882 792866 960309 1208097 1602788 2258774 3417494 5248498
18424E248498J697631K28214p31625m58963k12817K62905J106165Q84624o18405
18415G406227j288445j019427j066354j041578p27198m47434k89363k04594j37520
18406A184314q9015o8963n3980m2306k5465M291J4794o72R74J8373N4339R1420
18394A088104Q6547P8394P8356J18832K00725L19731N51421R87548J471261J216977
18384F197896M3025n21032k44176n0571L83052R78618P21612j56958k10900L29943
18374G470509Q56560J991942M102462O168718M612860l86169k408738j340333
18366B1067811n59852J442111L888216J984414k985003m313733l553093l866805
18358A3104066l540741k418933j503598r66235o55824m50722l04720k09561j50491
$$ plain form
18424 5248498 6946129 7174343 6442718 5983755 5770938 6033843 7140008 8024632 7406227
18415 7406227 6117782 5098355 4032001 2990423 2263225 1815791 1526428 1321834 1184314
18406 1184314 1095299 1026336 972356 930050 904585 908876 923670 922998 923972 942345 996684 1088104
18394 1088104 1174651 1253045 1331401 1450233 1650958 1970689 2522110 3509658 4980919 6197896
18384 6197896 6240921 5719889 5475713 5425142 5808194 6786812 7508424 7351466 7140566 7470509
18374 7470509 8327069 10319011 14421473 20590191 25203051 24816882 22408144 21067811
18366 21067811 20507959 21950070 25838286 27822700 24837697 20523964 16970871 13104066
18358 13104066 9563325 7144392 5640794 4674559 4018735 3568013 3263293 3053732 2903241
18349B903241r3529k9241K1759N3570P2357J31960K01709K68017L49725M71246
18339D350814N91519P67349J092468J646950K605525M400123P412558R806562
18331C2673868O623498j86521j801870N74184L314108Q458817J1378384M306163
18323F5340631n274786o125418l722128k195062n24224j263205j958837J069067
18315D5346038L589736P85514m220039m814270k241493J99564K106346K02725
18307D0954121m625205o230750n497041n517968m940723l491039k286779j610716
18299F753900j188635q90527o41831m63777l82132l14866k58176k35753j88688
18290B189515j51943j30351j03112p9686o3804m3896l9412n0617k6361K1303N6089
$$ plain form
18349 2903241 2809712 2780471 2802230 2855800 2928157 3060117 3261826 3529843 3879568 4350814
18339 4350814 4942333 5709682 6802150 8449100 11054625 15454748 22867306 32673868
18331 32673868 39297366 39110845 37308975 37883159 41197267 49656084 61034468 65340631
18323 65340631 60065845 53940427 50218299 48023237 47499013 46235808 44276971 45346038
18315 45346038 48935774 49721288 45501249 40686979 38445486 38645050 40751396 40954121
18307 40954121 36328916 30098166 24601125 19083157 14142434 10651395 8364616 6753900
18299 6753900 5565265 4674738 4032907 3569130 3186998 2872132 2613956 2378203 2189515
18290 2189515 2037572 1907221 1804109 1724423 1660619 1616723 1577311 1526694 1500333 1521636 1577725
18279A577725Q5958J31216K00538L35828N26572Q58274J471426K232783K091330
18270I511650N56143n80726l39044K23954Q67859R65737k47509j086796o43867
18261I227401m18137r11689j275872r59414m70133r5645J59369j42494p06632
18252D406754p55703o28673o37303n36152l68315k53029j82819j34867j01722
18243H08171p0882m0060m4388m0936l5157l8775l2884l1952k8978k6653k1739
18232C95767j3373k726j1099k2356j7178m02N979k180q714j9833k0004K505j2988
18219B73398j9362j2212n775n866m657l233j0272l590q541K163r323o736p821
18206A78173l767K365L157j0531p763M023J2140J1265O799k645j587n999l782
$$ plain form
18279 1577725 1663683 1794899 1995437 2331265 2857837 3716111 5187537 7420320 9511650
18270 9511650 10067793 9487067 9148023 9371977 10239836 11205573 10958064 9871268 9227401
18261 9227401 8809264 7897575 6621703 5662289 5192156 5096511 5255880 5113386 4406754
18252 4406754 3651051 3022378 2385075 1848923 1480608 1227579 1044760 909893 808171
18243 808171 737289 697229 652841 611905 576748 537973 505089 473137 444159 417506 395767
18232 395767 382394 379668 368569 346213 329035 328633 334612 332432 323718 303885 283881 286386 273398
18219 273398 254036 241824 236049 230183 225526 222293 212021 208431 199890 202053 192730 185994 178173
18206 178173 174406 176771 179928 169397 161634 165657 177797 189062 195861 193216 191629 185630 181848
18193A81848n4o656l226O639P412J3918N550K19p55m794q057m922j634J755O20
18178A87863l627N612j620M486M294m063m243n430L574L429j7277r659j867K13
18164A61685N142n926j359k861m013l055L350j710o665j457J4325Q681K400J0672
18150A79209q03K854J1717J3366R772J0265J0337R810K6723M0858N6889J01622
18138D72619J70333K00743Q7277p1087r7837r4888j12149q9241n0330l0425j9575
18127C65440j7426j28J5959J8224J738J3759K2236L9427M2926L1588N3883R1067
18115F78693J15773J19186J80010K59378L66094N47378Q80266J590932L177878
18106G915588N668871N018058p98203l633799k233936k679419l015948k002730
$$ plain form
18193 181848 181794 175138 171912 178551 185963 199881 205431 205650 204895 200101 192044 187122 185488 187243 187863
18178 187863 184236 189848 188228 192714 197008 192945 188702 183272 186846 190275 172998 163339 161472 161685
18164 161685 166827 160901 159542 156681 152668 149613 152963 151253 144588 143131 157456 166137 168537 179209
18150 179209 178406 181260 192977 206343 216115 226380 236717 246527 273250 314108 370997 472619
18138 472619 642952 843695 930972 859885 762048 667160 555011 465770 415440 385015 365440
18127 365440 348014 347886 363845 382069 383807 397566 419802 459229 502155 533743 587626 678693
18115 678693 794466 913652 1093662 1353040 1719134 2266512 3146778 4737710 7915588
18106 7915588 13584459 18602517 17804314 14170515 11936579 9257160 6241212 4238482
18098D238482j107810o64273m44388l18323k20763j15647o1688m1603j9555J5952
18088A260384Q4399J61184K55587L59725L81114L36763M36713P37883J193488
18079E207240K051697L717126N612974M403144m26294k852524k272027k500648
18071A2940688k436211j261760J42612J741878L647275L961048O62371k643182
18063A6754719k748255k631332k914714k356772j514337r38783o34082m38877
18055B577567k70087j56780r8828m3843l2776k3838m71K6942O7156J32653J88749
18044B366444K34687L51314N92611J017443J800493L233946M696291L211019q92861
18035A6611387k311655j637068j853781j578249m16658R06999K580375M733205
$$ plain form
18098 4238482 3130672 2466399 2022011 1703688 1482925 1367278 1305590 1263987 1244432 1260384
18088 1260384 1344783 1505967 1761554 2121279 2502393 2839156 3275869 4013752 5207240
18079 5207240 7258937 10976063 16589037 20992181 20565887 17713363 15441336 12940688
18071 12940688 10504477 9242717 9385329 11127207 14774482 18735530 19397901 16754719
18063 16754719 14006464 11375132 8460418 6103646 4589309 3650526 3016444 2577567
18055 2577567 2307480 2150700 2051872 2008029 1975253 1951415 1950944 1977886 2045042 2177695 2366444
18044 2366444 2601131 2952445 3545056 4562499 6362992 9596938 14293229 17504248 16611387
18035 16611387 14299732 12662664 10808883 9230634 8813976 9720975 12301350 17034555
18027A7034555N724281M275463K628231J9406l975249m753140l842816l519248
18019A3591483k562902j129389K94741K019802L565298K500945j110814k768762
18011A4400402k329939k547964k518795j793645j129128p62057n32829l71744
18003B414301k41663j41566r4805o7187o9480n3362j9633J8675M8250R2347J34071
17992B019948K13452L98983O76400J154413K118476L671732M091282J092256k027733
17983A3409209j922496j688049j957914j282573k10903Q50614K268997L436619
17975A2903504J962232j376788k323367j841187k149125k063477j390393q46007
17967B875392n55369m11372l50709k62434j82702j37053j11575p7325m6589m0516
$$ plain form
18027 17034555 22758836 27034299 29662530 29681936 25706687 20953547 17110731 13591483
18019 13591483 11028581 9899192 10193933 12213735 15779033 18279978 17169164 14400402
18011 14400402 12070463 9522499 7003704 5210059 4080931 3318874 2786045 2414301
18003 2414301 2172638 2031072 1936267 1869080 1799600 1746238 1726605 1745280 1793530 1885877 2019948
17992 2019948 2233400 2632383 3308783 4463196 6581672 10253404 14344686 15436942 13409209
17983 13409209 11486713 9798664 7840750 6558177 6347274 7197888 9466885 12903504
17975 12903504 14865736 13488948 11165581 9324394 7175269 5111792 3721399 2875392
17967 2875392 2320023 1908651 1557942 1295508 1112806 975753 864178 786853 740264 699748
17957F99748k7745k1589m0653m4981m8832k4392j3129P81O51j6879k6923l5880
17945D00177l5139k2118l4314l3475j5914M271L350p052o165p997q601j1136j2739
17932B13148j1078j1630l167L536O93j474Q301o54q878j3412L322J8511J7340
17919B14558K2054K2767M5525N3234J0761m6560l9869k1246j5718j7809j9932
17908B07765j2141j7815q711L793J1291K2693K9971K4891l276j5258n946j967
17896B35290q613J1879K3632L678k4240k6263j6232r140k1742j3537o660J793
17884A49845j1986k4015J823N863k053o797j1256L22r24K273J493j0053m731o3
17870H9741N96k62P247J36L279M109L252j0035n562R823J9451J3777J9605J2499
$$ plain form
17957 699748 672003 650414 609761 564780 515948 491556 478427 479208 479859 462980 436057 400177
17945 400177 365038 342920 308606 275131 259217 263488 266838 259786 253621 245624 237023 225887 213148
17932 213148 202070 190440 187273 190809 191502 190028 198329 197675 188797 175385 178707 197218 214558
17919 214558 236612 259379 304904 358138 368899 322339 282470 261224 245506 227697 207765
17908 207765 195624 177809 169098 172891 184182 206875 236846 261737 258461 243203 237257 235290
17896 235290 226677 238556 262188 265866 241626 215363 199131 189991 168249 154712 148052 149845
17884 149845 137859 113844 115667 121530 119477 112680 101424 101746 100822 103095 104588 94535 89804 89741
17870 89741 90337 90075 97322 97458 100737 104846 108098 98063 92501 102324 121775 135552 155157 167656
17856A67656o286k304l449k592O675K1751K4015K2227J1173r311j7200j3798r153
17843A89404q19L302O668l705j4407j0413r98j9831k2584j6902j446K786k307
17830A08748j5045p349P172J707L85r644k838J39Q535n284l214N095O163p16L437
17815I7291K5634K9907L3674J2646L127J4513J9484K1507L3329K4344l703j7078
17803B94675j6614r365j8301k4605j7849r559j5422k7576j6427j8188j7996n434
17791I7339m958o004o920r390J615j0N083m381n063m903Q067P218M449Q180l073
17776H7249j7042k929l067l145k902N904J1533O60m326p90l757M323P110J0414
17762H9235J2580J5075J2703J6302L583R16N832L0033J8924J2730M180j7622j1407
$$ plain form
17856 167656 161370 159066 155617 153025 159700 181451 205466 227693 238866 229555 212355 198557 189404
17843 189404 188585 191887 198555 194850 180443 170030 169032 149201 126617 109715 108269 111055 108748
17830 108748 93703 86354 93526 95233 95618 85974 83136 83275 91810 86526 83312 88407 94570 93854 97291
17815 97291 122925 152832 186506 199152 202279 216792 236276 257783 291112 315456 311753 294675
17803 294675 278061 268696 250395 225790 207941 198382 182960 155384 138957 120769 102773 97339
17791 97339 92381 86377 79457 70067 71682 71672 76755 72374 67311 62408 70475 77693 82142 90322 87249
17776 87249 70207 67278 64211 61066 58164 64068 75601 76261 71935 71145 67388 71711 78821 89235
17762 89235 101815 116890 129593 145895 149478 150394 156226 186259 205183 217913 222093 204471 193064
17749A93064l619m835j2506j6863j7133j7355k1028j0120j0098q560j5302o180
17737D9465P440q831r533J119n607J056O253n90J573M858J3968p029q552L099
17723D8689n087P52k041J040K562q118j077M602N8J863k023J447N03N806L871
17708E2847p447j1821k685J923Q59l111N341K55n814j0M328j1198n991M461J1420
17693C3357j638j762J0887n783q83J61j3571j1926j1514J0317J5153Q017l599
17680B7216n694k39l731M151L242q21K42P513L953l48r231J109o167K723L607
17665B7525r615m652P20L361M757j935O49K891K924n719L817R258l087K589l171
17650C0312m549n404j036J0607j010m157j562o974l633n9M174j665j447q08M292
$$ plain form
17749 193064 189445 184610 172104 155241 138108 120753 99725 89605 79507 70947 55645 49465
17737 49465 56905 48074 38541 39660 34053 35109 41362 40772 42345 47203 61171 54142 45590 48689
17723 48689 43602 44354 42313 43353 45915 37797 36720 41322 41380 43243 41220 42667 43170 48976 52847
17708 52847 45400 33579 30894 32817 33676 30565 35906 36161 30347 30337 34665 23467 17476 21937 33357
17693 33357 31719 29957 40844 35061 34178 34339 20768 8842 -2672 7645 22798 30815 27216
17680 27216 21522 21283 17552 21703 24945 24124 24366 31879 35832 35484 26253 27362 21195 23918 27525
17665 27525 17910 13258 13978 17339 22096 20161 20810 23701 26625 20906 24723 33981 30894 33483 30312
17650 30312 25763 20359 19323 29930 28920 24763 23201 16227 12594 12535 16709 15044 13597 12789 17081
17635A7081N678J270K274J963L523K477r638p872o057o580J270K407J5578J2441
17621C5815k54j0439n254j2648q529J4458M429p058j52Q697O78o616J0328O238
17607B9693k292p305n202N644L128j904r303p895R96Q932K092k28P01K874j651
17592A8280n263J055j17M272J500O190m786k221J008L878n063k686j901O800J029
17577B1975j004p859K516j48J86L299J3217P311L265k170J2569K8104J6380R93
17563I8634N411l845j4548l271j1157J0761K3263J0602j1690j3523m56j3916j8199
17550E8066j0361r773p041n332o316O275N324r336J74L771n354m852l058N224
17536A7411R090Q276k691n949k662K885J0726O521P857J9918K8956J4087J843
$$ plain form
17635 17081 22759 24029 26303 28266 31789 34266 24628 16756 10699 4119 5389 7796 23374 35815
17621 35815 35561 25122 19868 7220 -1309 13149 17578 10520 10368 19065 19743 13127 23455 29693
17607 29693 27401 20096 14894 20538 23666 21762 12459 4564 5560 14492 16584 16356 17057 19931 18280
17592 18280 13017 14072 13955 18227 19727 25917 21131 18910 19918 23796 18733 16047 14146 20946 21975
17577 21975 20971 13112 15628 15480 15666 18965 32182 39493 42758 40588 53157 81261 97641 98634
17563 98634 104045 100200 85652 82381 71224 81985 105248 115850 104160 90637 90181 76265 58066
17550 58066 47705 37932 30891 25559 19243 25518 30842 21506 21680 25451 20097 15245 12187 17411
17536 17411 26501 34777 32086 26137 23475 26360 37086 43607 51464 71382 100338 114425 116268
17523A16268j3891n944m127q777J170J2345K6252K3602J5766N152r390j6946k1570
17510A19910k1938j4230J026R446J0667L6K545q301j6664k6244j6633o817j690
17497C1113N08q678q032L004o309m769M349L62j957n968k090J791n359L402J2262
17482A3629K033k626o141P284J5041O284J0330K2182J2267N660j0560j3326m234
17469E7823r337L915J3263Q452J4851O113j907r694k7059k7576j0017J290Q835
17456B8952o329L670j1906n343l440k220m40N832k278n71p24J0336J3577N451
17442C4567J00J1185K0490L1847M080j8217j2177j5117r684j1217r611n253O08
17429B1601L198N20q654n580R36p962O538l420n44M609L690M040q638k430m263
$$ plain form
17523 116268 102377 96433 92306 83529 84699 97044 123296 146898 162664 167816 158426 141480 119910
17510 119910 97972 83742 84768 94214 104881 104917 107462 99161 82497 56253 39620 32803 31113
17497 31113 31621 22943 14911 17915 11606 6837 11186 11548 9591 3623 1533 3324 -2035 1367 13629
17482 13629 15662 13036 6895 14179 29220 35504 45834 68016 80283 85943 75383 62057 57823
17469 57823 48486 52401 65664 74116 88967 95080 93173 83479 56420 28844 18827 20117 28952
17456 28952 22623 26293 14387 9044 5604 3384 2944 8776 6498 5927 5203 15539 29116 34567
17442 34567 34667 45852 66342 98189 102269 84052 71875 56758 47074 35857 26246 20993 21601
17429 21601 24799 25319 16665 11085 12021 4059 10597 7177 6633 11242 14932 18972 10334 7904 3641
17414C641m286K094L522J602M907J0654k537m849p8J917L177m83m233p571l451
17399D026P466Q482O081k816k395n860l962m598j494M837Q052K25j0993k653Q43
17384E241k366J640N078P04o23P209J891J253o034o140K673K163K906O317l313
17369A8599M490m747j2518j5790o448N281J3456L199k674m303L330l056R57M237
17355D013q796l806L587P032j395k003M847q308p109Q463K712P577J0082P220
17341B4116k914o111j458M217l134l919j778j9l94m124N093J0721M568k670p200
17326A4994j1092M094N216O987j1965P61o161K310L111l328p939m797J0592R091
17312A1874k339l524l574o862J2052Q377K075l667o81q354P68q92o341k29O706
$$ plain form
17414 3641 -645 1449 4971 6573 11480 22134 19597 14748 14670 16587 19764 19281 15048 7477 4026
17399 4026 11492 19974 26055 23239 20844 14984 11022 6424 4930 9767 17819 18044 7051 4398 5241
17384 5241 2875 4515 9593 10297 9674 16883 18774 20027 13993 7853 10526 12689 15595 21912 18599
17369 18599 23089 18342 5824 -9966 -16414 -11133 2323 5522 2848 -1455 1875 -1181 -224 4013
17355 4013 -4783 -8589 -5002 2030 635 -1368 3479 -4829 -11938 -3475 -763 6814 16896 24116
17341 24116 21202 15091 13633 17850 14716 10797 9019 9000 8606 4482 9575 20296 24864 22194 14994
17326 14994 3902 7996 13212 20199 8234 8995 2834 5144 8255 4927 -3012 -7809 2783 11874
17312 11874 9535 6011 2437 -4425 7627 16004 18079 14412 13731 5377 6145 5253 -1088 -1317 5389
17297E389N344m693J790O747P378j973o270K769L574n600l114j982q426n517Q61
17282c723J895L975O838j151N861j800o03o181j0610p68J0916M894n32n011m259
17267b59K063q076K83P36M290N330K346p7M315l428J946p852o561J530k962l024
17251i400J440J3297Q171K426n745M72Q45q817r695M992K200J447M344k857p051
17236c931J255N823J534K4M202k625J918Q573Rr198r521N969P022K335M739k68
17220A7860j798M415o082n474l033r954M48J0625l077j0486M742J439l85M176
17206C416L349P11k803M806n438j363P896N854l585k060L48K502P10O99o952n267
17190B823m011m400L98o99L612M836r232L055J756o986j707K818L608J991L872
$$ plain form
17297 5389 10733 6040 7830 14577 21955 19982 13712 16481 20055 14455 11341 9359 933 -4584 -3723
17282 -3723 -1828 2147 8985 7834 13695 11895 11292 5111 -5499 -6267 4649 9543 9011 4000 -259
17267 -259 1804 -6272 -5989 -5253 -963 4367 6713 6636 10951 7523 9469 1617 -4944 -3414 -6376 -9400
17251 -9400 -7960 5337 13508 15934 10189 10661 11506 2689 -7006 -2014 186 1633 5977 3120 -3931
17236 -3931 -2676 3147 4681 4705 8907 6282 8200 16773 16782 7584 -1937 4032 11054 13389 18128 17860
17220 17860 16062 20477 14395 8921 5888 -4066 -3618 7007 3930 -6556 -1814 -375 -760 3416
17206 3416 6765 7476 4673 9479 4041 2678 10574 16428 12843 10783 11131 13633 14343 15042 8090 2823
17190 2823 -1188 -5588 -5190 -5889 -2277 2559 -6673 -3618 -1862 -8848 -10555 -7737 -4129 -2138 1734
17175A734K026N272L080M805j847k514j2522L466P247p164p820l470O370J654
17161C17m875J532n545l681L682k915J106J1297L442O805l656k921M185l656j1332
17146f215l732l00R165M117K434k027k9R71o694k190m598J025k955P638O472l83
17130B699O019Q080m191o809O074L103j545o849L972l920o64j967n859Q540k232
17115D451q865J257M24M642n168M03O364n28K535M130n767j0053o824L172R148
17100f79k480J115J0177o227n241j143Q123j105j347M624l141o673j28O580L99
17085B854K210k523P646P016j0888m449O04J025o152q505q53O557n826K018K542
17070f724K410J5759P41r071K989P214K384p61n810O335p03n705l081o443j548
$$ plain form
17175 1734 3760 9032 12112 16917 15070 12556 34 3500 10747 3583 -4237 -7707 -1337 317
17161 317 -4558 -3026 -8571 -12252 -8570 -11485 -10379 918 4360 11165 7509 4588 8773 5117 -6215
17146 -6215 -9947 -10247 -1082 3035 5469 3442 3413 4384 -2310 -4500 -9098 -8073 -11028 -3390 3082 2699
17130 2699 8718 16798 12607 5798 11872 14975 13430 6581 10553 6633 5969 4002 -1857 6683 4451
17115 4451 -4414 -3157 -2733 1909 -3259 -2856 3508 2980 5515 9645 3878 -6175 -12999 -9827 -679
17100 -679 -3159 -2044 8133 1906 -3335 -4478 3645 2540 1193 5817 2676 -3997 -4125 2455 2854
17085 2854 5064 2541 10187 17203 6315 1866 2470 3495 -2657 -11162 -12015 -5458 -11284 -9266 -6724
17070 -6724 -4314 11445 12186 3115 6104 13318 15702 14941 9131 15466 14763 9058 5977 -466 -2014
17055b014J2048O797o579r384j2003j128Q321j093m692l233j060l074q742j557
17041b7393N809j192r27P947J664P576Q967m440n549k84J738R347L928q451p107
17026h367L165Q76q562J055K625P984l173p267J0193R793m900j0694j1026O382
17012a1916L740Q343q231m829p386l917J3805R554q65m883M322M598J0604m177
16998H762o36l821J383j663j182P348p323n812L636J920j536L819J303J600m391
16983C407n966N760J1412J936p397o186j684N528j2372j2138P373N058J083m43
16969d629J135N438J962j684K900m460l501Q369q665M176L026o095P074J4953
16955A9999K849n211j0783K317p93M59m289n453n54l548J328J1922J0349o642
$$ plain form
17055 -2014 10034 16831 10252 868 -11135 -12263 -3942 -5035 -9727 -12960 -14020 -17094 -25836 -27393
17041 -27393 -21584 -22776 -23703 -15756 -14092 -6516 2451 -1989 -7538 -7822 -6084 3263 7191 -1260 -8367
17026 -8367 -5202 -4326 -12888 -11833 -9208 -1224 -4397 -11664 -1471 8322 3422 -7272 -18298 -11916
17012 -11916 -8176 167 -8064 -12893 -20279 -24196 -10391 -837 -1702 -6585 -2263 2335 12939 8762
16998 8762 8126 4305 5688 4025 2843 10191 2868 -2944 692 2612 1076 4895 6198 7798 3407
16983 3407 -2559 3201 14613 16549 9152 2966 1282 6810 -5562 -17700 -10327 -5269 -4186 -4629
16969 -4629 -3494 1944 3906 2222 5122 662 -2839 5530 -3135 1041 4067 -2028 5046 19999
16955 19999 22848 17637 6854 9171 8378 8837 4548 -905 -1459 -5007 -3679 8243 18592 11950
16941A1950n514o489q030l399n015k171J1852L835N057O261L748l34K772l252
16927A1271j705q628m23j010n194L871j09J837K96P426J3203N29r471k506Q40
16912A0227L961n134l386M024K959J339j049j399j237j1998j38O387l746k751
16898a941J0013k477mm165O703R41j579n223m392N341j452J142R88L220m105m838
16882a828J739q64O660P927L522p998K360l734o32r773l631l302N061k68M44J631
16866b686k530j37K328n766M223L4L321R428J0602r669j3787P227O765l205q390
16851b242M206L921J968M5J43J05l346n815l299o63m78r194Q063m531K482K484
16835f151k650O235l725J242K078Q377L318K566k729J234p268l609O008q95K358
$$ plain form
16941 11950 6436 -53 -8083 -11482 -16497 -18668 -6816 -2981 2076 8337 12085 11751 14523 11271
16927 11271 9566 938 515 -495 -5689 -1818 -1927 -90 206 7632 20835 21364 11893 9387 10227
16912 10227 14188 9054 5668 9692 12651 13990 12941 11542 10305 -1693 -1831 4556 810 -1941
16898 -1941 8072 5595 5591 1426 8129 9070 7491 2268 -2124 3217 1765 2907 3895 7115 3010 -1828
16882 -1828 -89 -953 5707 13634 17156 9158 11518 7784 7152 -2621 -6252 -9554 -4493 -4761 -4317 -2686
16866 -2686 -5216 -5353 -3025 -8791 -4568 -4534 -1213 8215 18817 9148 -4639 2588 9353 6148 -2242
16851 -2242 1964 5885 7853 7898 8041 8146 4800 -1015 -4314 -4977 -5455 -14649 -6586 -11117 -8635 -6151
16835 -6151 -8801 -2566 -6291 -5049 -2971 5406 8724 11290 8561 9795 2527 -1082 4926 4031 6389
16820F389j399O269l955R02q4r243l489M656N416p312n076n554p640l350N213
16805a8257L901L356N688r683J1334M039K560L142l248m286N378L785j028P079
16791A3760M250l82m076k088o931L771o731j0954L85Q444L935R81K744n52l827
16776B729m296j121l946p065J764J2195K220J674k259m264p913j584o035N105
16762a2796q73R4M986K221k932j758K182K105O168L25j0315j640N275L050k076
16747e984N806P222k331j1576K47j501l610k606L707P047L836M937O025L322p601
16732F940j1635M906P601M793j698n666M907J294p230j0054k90p584k712P48Q302
16717g378L249k062k232N72M402j2830m101N800L469J686J95p590J07K992O988
$$ plain form
16820 6389 4990 11259 7304 8206 8122 -1121 -4610 46 5462 -1850 -6926 -12480 -20120 -23470 -18257
16805 -18257 -14356 -11000 -5312 -14995 -3661 378 2938 6080 2832 -1454 3924 7709 6681 13760
16791 13760 18010 17628 13552 11464 4533 8304 1573 -9381 -8996 -552 3383 4364 7108 6556 2729
16776 2729 -1567 -2688 -6634 -13699 -11935 260 2480 4154 1895 -2369 -10282 -11866 -17901 -12796
16762 -12796 -13669 -13575 -8589 -6368 -9300 -11058 -8876 -6771 -603 -278 -10593 -12233 -6958 -3908 -5984
16747 -5984 -178 7044 4713 -6863 -6616 -8117 -11727 -14333 -10626 -3579 257 5194 11219 14541 6940
16732 6940 -4695 211 7812 12605 10907 5241 10148 11442 4212 -5842 -6132 -13716 -16428 -15680 -7378
16717 -7378 -4129 -6191 -8423 -7851 -3449 -16279 -20380 -14580 -11111 -9425 -9230 -16820 -16713 -13721 -6733
16702f733K835m446K884J4144m028j3348j41Q949j803M716K010r899l103P752
16688b11L669N90j698k090q669N174N191r190k573Q652J2154O93l758r734q347
16673a0147m288L731M821J002j3184j927R015M153r07k657K277j0286J0194N379
16659b824k603N511N334J204K747q512n903Q452J101J0186J694j2701j2856m654
16645a3824r11k56N915K65l152K591N61j302l798r07M953L953K070L009o188N762
16629a259j715J01m225j414j087o549O235J0314j045m238l733J522P840l4m582
16614c869L791k421N437P091p136m879O776l540m945P00p211J043J474J0369N437
16599H117p303j952j414R70l838q69j690K851m657l726N194O042j252O57O149
$$ plain form
16702 -6733 -3898 -8344 -5460 8684 4656 -8692 -8833 116 -1687 3029 5039 -4860 -7963 -211
16688 -211 3458 4048 2350 260 -8409 -3235 1956 -7234 -9807 -1155 10999 11692 7934 -1800 -10147
16673 -10147 -14435 -10704 -5883 -4881 -18065 -19992 -10977 -6824 -7731 -10388 -8111 -18397 -8203 -2824
16659 -2824 -5427 84 5418 6622 9369 857 -5046 3406 4507 14693 16387 3686 -9170 -13824
16645 -13824 -14735 -14991 -9076 -8811 -11963 -9372 -8811 -10113 -13911 -14818 -9865 -5912 -3842 -833 -7021 -1259
16629 -1259 -2974 -2873 -7098 -8512 -9599 -16148 -9913 401 -644 -4882 -8615 -7093 747 713 -3869
16614 -3869 -78 -2499 2938 10029 2893 -1986 4790 1250 -3695 -2995 -10206 -9163 -7689 2680 8117
16599 8117 814 -1138 -2552 -1582 -5420 -6289 -7979 -5128 -9785 -13511 -8317 -2275 -3527 -2870 3279
16584C279L920j2757J499l4n473o645L435P806M592j428k628P096N030R92l680
16569E004k629l63o731m889M482J544K664J791m110j836M542K888m05n157n57
16554c762l481P618M378L997j369m02R20r901j0799J983J358K342M530M79M31
16539a678o20l367j4270l677J5715j580L693J0008o400j4067k608N251M818m720
16525a3502k828K983L338O811O882l013L469k806K84p377M25R891P181N07J862
16510A4107p729j2445m592Q131L174j442J2307K678p12M13J199l08P43l872r237
16495B415Q80L582q233j948Q836L740P019J1054l297o890N388N516n633l587m832
16480A4010q465K105l150p126o748K334J541k155Q973Q013k021n133o704j086
$$ plain form
16584 3279 7199 -5558 -4059 -4093 -9566 -16211 -12776 -4970 -378 -1806 -4434 2662 7692 8684 5004
16569 5004 2375 2012 -4719 -9608 -5126 -3582 -918 873 -3237 -5073 -531 2357 1952 -3205 -3762
16554 -3762 -7243 375 4753 8750 7381 6979 7899 -2002 -12801 -10818 -9460 -7118 -2588 -2109 -1678
16539 -1678 -2298 -5665 -19935 -23612 -7897 -9477 -5784 4224 -2176 -16243 -18851 -13600 -8782 -13502
16525 -13502 -16330 -13347 -10009 -3198 3684 671 4140 1334 1618 -5759 -5334 4557 11738 12245 14107
16510 14107 6378 -6067 -10659 -2528 646 -796 11511 14189 13477 13890 15089 14781 15524 11652 2415
16495 2415 3295 6877 -1356 -3304 5532 9272 16291 27345 24048 17158 22546 28062 22429 18842 14010
16480 14010 5545 7650 4500 -2626 -9374 -7040 -5499 -7654 1319 9332 7311 2178 -4526 -5612
16466e612j429N807L243p11O784L155N715p295O297r811j3936k240L545m85j58
16451g131p333L770K928L4m494M036L514K467k383J307Q652P726l191j468l990
16436D444k752J089r497L871J850l803p21m289o269J3626k030q18O12N713m579
16421c553M743R20J014P419o58J857O623j520p391N198J307j2490l41K400o996
16406a468p420o518L036J5499P381r698j2961J576J0675K109l643k560J758m636
16392f870n187r62J846l777O307L603J032l36K37n6k90K236q333m374K226R28
16376a1770L321l33M989N686q938n207M796L075p02M02m182M145o240k115r35
16361a4008L920K921l035R764J1418l050q566l158p795K400M326J550j752P03
$$ plain form
16466 -5612 -7041 -1234 2009 1298 8082 11237 16952 9657 15954 6143 -7793 -10033 -6488 -6973 -7131
16451 -7131 -14464 -10694 -7766 -7732 -12226 -8190 -4676 -2209 -4592 -3285 5367 13093 9902 8434 4444
16436 4444 1692 2781 -6716 -2845 -995 -4798 -5519 -9808 -16077 -2451 -4481 -5299 -4687 1026 -3553
16421 -3553 1190 2110 3124 10543 9885 11742 18365 16845 9454 14652 15959 3469 3128 5528 -1468
16406 -1468 -8888 -15406 -12370 3129 10510 812 -12149 -10573 102 2211 -1432 -3992 -2234 -6870
16392 -6870 -12057 -13019 -11173 -14950 -8643 -5040 -4008 -4344 -4107 -4163 -4453 -2217 -10550 -14924 -12698 -11770
16376 -11770 -8449 -8782 -3793 1893 -7045 -12252 -7456 -4381 -5083 -4681 -8863 -4718 -10958 -13073 -14008
16361 -14008 -10088 -7167 -10202 -438 10980 7930 -636 -3794 -11589 -9189 -4863 -3313 -5065 -4362
16347d362m969j023N351O488j54J796J822m468n287j5130k686P211N534o179Q55
16332a5201K100N173J6624L713j2812j4492k556N187L140l956q887j564J4490
16319i041J4185L881q683j0533l122J384k410P018P058N512o457J009J08R585
16305I494n404j0913K23K768J218K916l687l574R479k487n072j329M058O009M643
16290H342j637n865P66m415R53o411L97J1072N451R290K538q539j0961n721l04
16275e044L288K138k723k316l256q390q229Q32k309Q817J416m474N710K00j887
16260a6227n012p013J712O748K808k799O971P294K839j0905k706M919Q278P46
16246b347R682j964j0605n677L70K235j8l744R455O546o456j695J537j119J310
$$ plain form
16347 -4362 -9331 -10354 -5003 1485 1331 3127 4949 481 -4806 -19936 -22622 -15411 -9877 -16056 -15201
16332 -15201 -13101 -7928 8696 12409 -403 -14895 -17451 -12264 -9124 -13080 -21967 -23531 -9041
16319 -9041 5144 9025 342 -10191 -13313 -11929 -14339 -7321 -263 5249 -1208 -199 -91 9494
16305 9494 4090 -6823 -6600 -3832 -2614 302 -3385 -6959 2520 33 -5039 -6368 -2310 3699 8342
16290 8342 6705 840 1606 -2809 -1856 -8267 -7870 3202 8653 17943 20481 11942 981 -4740 -5044
16275 -5044 -1756 382 -2341 -4657 -7913 -16303 -24532 -23700 -26009 -17192 -15776 -20250 -14540 -14340 -16227
16260 -16227 -21239 -28252 -26540 -19792 -16984 -19783 -12812 -5518 -2679 -13584 -16290 -11371 -3093 -2347
16246 -2347 7335 5371 -5234 -10911 -10541 -8306 -8324 -12068 -2613 3933 -2523 -4218 -2681 -3800 -2490
16231b490j849k218k271J414m335K681Q900N450k493R072m690j0696m010O559
16217i76J0296M005n21o856o657o318L823L555K761R43M188L98M998L664n974
16202A1329j1846j3031O122Q689O785k43k1610j171Q332L503j46J076J033m293
16188e471k498Q332R964Q097J88j5193m552n3L001M721j1490K748J0689Q125k893
16173A3715m243N250K827o303o446O810o293r35J087N023k370j001m651l808l812
16158e150l237K488J131M537L245K735n081J400j432r631Q431J650P20O038p220
16143F24q45J1706j160p093J440J028q892o588N797O683j99m633n901n937M465
16128i505K132L970K775j435P849L068l801L133p052j3810j1195J895J984J723
$$ plain form
16231 -2490 -4339 -6557 -8828 -7414 -11749 -9068 -168 5282 2789 11861 7171 -3525 -7535 -976
16217 -976 9320 13325 12804 5948 -709 -7027 -3204 351 3112 4055 8243 8641 13639 17303 11329
16202 11329 -517 -13548 -7426 1263 8048 7805 -13805 -14976 -6644 -3141 -3287 -2211 -1178 -5471
16188 -5471 -7969 363 10327 18424 18612 3419 -1133 -1186 1815 6536 -4954 -2206 8483 16608 13715
16173 13715 9472 14722 17549 11246 4800 11610 5317 4382 5469 10492 8122 7121 2470 -1338 -5150
16158 -5150 -8387 -5899 -4768 -231 3014 5749 668 2068 636 -8995 -564 1086 1806 7844 624
16143 624 -221 11485 10325 3232 4672 5700 -3192 -9780 -3983 2700 2501 -2132 -8033 -13970 -9505
16128 -9505 -7373 -3403 -628 -2063 5786 8854 5053 8186 1134 -12676 -23871 -21976 -19992 -18269
16114a8269K722L520k003R30n281K503k605J1204L616m57q15L226n565m822k275
16099a4371N77O822m105l234l006N988K911O091K939k592l199j871l035L864M859
16084a362J81n315l177P32o34m32M736J059J3705k413j4969Q49J929o658m958
16069a6727k76k52P779k240J1701K673K950O996l347k576J650K279O532j0255
16055F887p779O750K939r205K03j632J218o677K96K347L220k374l356P9n89R615
16039A942K013q043J230n679l3O294M750q788j535k614m251R138Q927m691m142
16024e482m569N125J0048j026M98N091k408p443N12J3693j616m448n593m316k348
16009d282J2069r718j4463m48J0211K63o049l415N95l333J935J2705N729l172
$$ plain form
16114 -18269 -15547 -12027 -14030 -13100 -18381 -15878 -18483 -7279 -3663 -4120 -4935 -1709 -7274 -12096 -14371
16099 -14371 -13794 -6972 -11077 -14311 -17317 -11329 -8418 -2327 612 -1980 -5179 -7050 -10085 -6221 -1362
16084 -1362 -1181 -6496 -9673 -8941 -9575 -10007 -5271 -4212 9493 7080 -7889 -7040 -5111 -11769 -16727
16069 -16727 -17003 -17255 -9476 -11716 -15 2658 5608 12604 9257 6681 8331 10610 17142 6887
16055 6887 -892 5858 8797 -408 -205 -1837 -619 -7296 -7000 -4653 -1433 -3807 -7163 -7084 -7673 1942
16039 1942 3955 -4088 -2858 -8537 -8570 -2276 2474 -6314 -7849 -10463 -14714 -5576 3351 -1340 -5482
16024 -5482 -10051 -4926 5122 4096 4594 9685 7277 -166 346 14039 12423 7975 2382 -1934 -4282
16009 -4282 7787 -1931 -16394 -16842 -6631 -6368 -12417 -15832 -15237 -18570 -16635 -3930 1799 -1373
15995a373Q236k33m483m905k617N506Q347p069o815L30M365q73n436L790J317
15980a913n751L332N364M368Q433N988j2005j1280p593K563N994r268M216p128
15966a4680j756O925R794M921k711M620j717j0283k51p16l095J443J0535M774
15952G803O271m538o221j0513p265l860O696L831P222k104j924J982K389p538
15938g769j07J156R723M011q396L158j56m987M793J840l797j968p277L284k02
15923f694n755L231J1380N108m494r407L916j78q503j029N155l64j174M575j142
15908e375P700l257q345m627L475R426j381n676K050K870J3418Q131o992p136
15894D281q446Q88R861k151k034m185k973j045L723r38j2767l442L675J356L265
$$ plain form
15995 -1373 6863 6630 2147 -2758 -5375 131 8478 1409 -5406 -5076 -711 -1584 -7020 -3230 -1913
15980 -1913 -7664 -4332 1032 5400 13833 19821 7816 -3464 -11057 -8494 -2500 -11768 -7552 -14680
15966 -14680 -16436 -9511 283 5204 2493 7113 5396 -4887 -5138 -5854 -8949 -7506 3029 7803
15952 7803 14074 9536 3315 -7198 -14463 -18323 -11627 -7796 -574 -2678 -4602 -2620 -231 -7769
15938 -7769 -7876 -6720 3003 7014 -1382 1776 1620 -3367 1426 3266 -531 -2499 -9776 -6492 -6694
15923 -6694 -12449 -9218 2162 7270 2776 -6631 -2715 -2893 -11396 -12425 -7270 -7634 -8808 -4233 -5375
15908 -5375 2325 -932 -9277 -13904 -10429 -1003 -2384 -8060 -6010 -3140 10278 18409 11417 4281
15894 4281 -4165 -3277 6584 4433 2399 -1786 -4759 -5804 -2081 -3019 -15786 -19228 -15553 -14197 -10932
15879a0932K600j0765J2952J7289l91k725j775m060p61P90k91L249n086o870l610
15864a0386M46J587M564P214J1400l95r392J600J161j0106m781p176L755k462
15850a2971n250Q680m226k64J4171O493l348j0777n228k040M846K728L866J033
15836b287j990N308K332j566J345Q810l365j1959p643M493M43j0506L22m064l217
15821b3544O814j863L954J0774Q918o335M702R683M130l699L46p224r848K672
15807e20k115k665q313M49O353L727P710j761K15r410j236O338P192j3451j854
15792i341m854l110m234K984Q560L542m307l831j606P42J824R731L6P570P104
15777A0810j0641k784K121N851R35l48n581p051o564l028l804k634O453N886M945
$$ plain form
15879 -10932 -8332 -19097 -6145 11144 10753 8028 6253 2193 1432 2222 1931 5180 94 -6776 -10386
15864 -10386 -9940 -8353 -3789 3425 14825 14430 5038 6638 7799 -2307 -7088 -14264 -10509 -12971
15850 -12971 -18221 -9541 -13767 -14031 140 6633 3285 -7492 -12720 -14760 -9914 -7186 -3320 -2287
15836 -2287 -4277 1031 3363 1797 3142 11952 8587 -3372 -11015 -6522 -6079 -16585 -16263 -20327 -23544
15821 -23544 -16730 -18593 -14639 -3865 5053 -1282 3420 13103 17233 13534 13880 6656 -3192 -520
15807 -520 -2635 -5300 -13613 -13164 -6811 -3084 4626 2865 3080 -6330 -7566 -1228 5964 -7487 -9341
15792 -9341 -14195 -17305 -21539 -18555 -9995 -6453 -10760 -14591 -16197 -15455 -13631 -3900 -3864 3706 10810
15777 10810 169 -2615 -494 5357 6292 5944 363 -6688 -13252 -16280 -20084 -22718 -16265 -10379 -5434
15762e434j340r269n906J3004R633p8r431p764m563M041N079j34P896K240L514
15747A488L84j38q79m125k472O231J055N04o878j051J4029q831j660j576j5953
15732a9872N802M539k189q040p696j437K0302R761l351m304Q577l235q744k607
15718a2494K539J1331O80j0298R214j34j0520m201p57Q042j746l269Q081L905
15704C73p113l392l191L396J0051k83L010p127k287P830M824J693l454K813k381
15689D762K004k004k800K18K882L863L242p585o300l688p615O497M730p030n822
15674a4646J1383L683m298o157j71P527J923Q085n455m69k466o563p576L108J956
15659a0136k306O313P500J602q90q774l67j865m259l165l929O617J3070Q173q733
$$ plain form
15762 -5434 -6774 -16043 -21949 -8945 688 610 -8821 -16585 -21148 -17107 -12028 -12162 -4266 -2026 1488
15747 1488 1872 1734 855 -3270 -5742 489 1544 2048 -4830 -5881 8148 -683 -2343 -3919 -19872
15732 -19872 -14070 -9531 -11720 -19760 -27456 -28893 -8591 1170 -2181 -6485 2092 -1143 -9887 -12494
15718 -12494 -9955 1376 2056 -8242 972 838 -9682 -13883 -14640 -6598 -8344 -11613 -3532 373
15704 373 -6740 -10132 -13323 -9927 124 -159 2851 -4276 -6563 1267 6091 7784 4330 7143 4762
15689 4762 6766 4762 1962 2180 5062 8925 12167 4582 -1718 -5406 -13021 -6524 -1794 -8824 -14646
15674 -14646 -3263 420 -3878 -10035 -10206 -2679 -756 7329 1874 1405 -1061 -7624 -15200 -12092 -10136
15659 -10136 -12442 -6129 1371 2973 2083 -6691 -7058 -8923 -13182 -16347 -20276 -13659 -589 7584 -1149
15644a149m005O42j870Q9k084k190J625N714r340p235j039L514O222k966P483
15629f589Q828r24j789m60j987l726m306p170j535K646M490Q469Q037J510o534
15614a040r869q661L294N643Q121j441k17K231O010j0117o677P137N377n139N856
15599E08r62l300M402K652j8580o640K126j069J0778J1272J302m839q010J317
15585i043J4121N776Q092J018R76n497l422L505m234p024O791M461o577j1870
15571b927p386k665K690L178L895j613n82K888N604j148p5M425p998l840L864
15556a690N285P227j4381j1617J782N42J1056J1779r739K192N475k679j0435o440
15542a1643p762m649Q270o450l167J184L647M833k339l186M959J967n872o02J620
$$ plain form
15644 -1149 -5154 -4512 -6382 -6293 -8377 -10567 -8942 -3228 -12568 -19803 -20842 -17328 -11106 -14072 -6589
15629 -6589 2239 1315 -474 -934 -2921 -6647 -10953 -18123 -19658 -17012 -12522 -4053 3984 5494 -1040
15614 -1040 -10909 -19570 -16276 -10633 -2512 -3953 -4170 -1939 4071 -6046 -12723 -5586 -209 -5348 508
15599 508 -454 -3754 648 3300 -15280 -21920 -19794 -20863 -10085 1187 2489 -2350 -10360 -9043
15585 -9043 5078 10854 18946 19964 20940 15443 12021 15526 11292 4268 11059 15520 8943 -2927
15571 -2927 -10313 -12978 -10288 -7110 -3215 -4828 -5410 -2522 3082 1934 1859 6284 -1714 -5554 -1690
15556 -1690 3595 10822 -3559 -15176 -13394 -12852 -1796 9983 244 2436 7911 5232 -5203 -11643
15542 -11643 -19405 -24054 -15784 -22234 -25401 -24217 -20570 -15737 -18076 -21262 -16303 -14336 -20208 -20810 -19190
15527a9190O407K654Q24p159J008O145J490n40L262l735N769p305o570p280K98
15512b3922O048j4K922J666O889j0328q336Q301L875O118O595n756m998J1907
15498I67j047k143M74o249l031j606J578O727P283P637n40o704M761j55j0l562
15482D380j0832Q42l656J841J2993m313j8594j0670j543N942Q951K763p428J0804
15468h520M586j656j001l057N730O112l44J235o3q020J923J0402m678k486m650
15453d487N611o024n575P220J566j5143k628O481N623P923Q520J375q000k339
15439A23m40l752Q369M586K340q20j466L996L659P16q47L26r02m570j0659m007
15423c348j170K279m88K658R79j0224M095O381n921r01L250M321o86j550N833
$$ plain form
15527 -19190 -12783 -10129 -9305 -16464 -15456 -9311 -7821 -8361 -5099 -8834 -3065 -10370 -16940 -24220 -23922
15512 -23922 -17874 -17888 -14966 -13300 -6411 -16739 -25075 -16774 -12899 -6781 -186 -5942 -10940 967
15498 967 -80 -2223 -1749 -7998 -11029 -12635 -11057 -4330 2953 10590 10050 3346 8107 7952 7942 4380
15482 4380 -6452 -5610 -9266 -7425 5568 1255 -17339 -28009 -29552 -23610 -14659 -11896 -19324 -8520
15468 -8520 -3934 -5590 -6591 -9648 -3918 2194 1850 3085 3022 -4998 -3075 7327 2649 163 -4487
15453 -4487 1124 -4900 -10475 -3255 -1689 -16832 -19460 -12979 -7356 567 9087 10462 2462 123
15439 123 -317 -4069 4300 8886 11226 10406 8940 12936 16595 17311 16464 16790 15888 11318 659 -3348
15423 -3348 -4518 -2239 -2727 -69 910 -9314 -5219 1162 -4759 -5660 -2410 1911 1225 -325 5508
15408E508K933K363M083r250o98L056O414m253o472L186o190k851l802O740J1535
15393A2302o257m896N575J1746j1052j9280o646L944q518j699M668N793K448P416
15379d456O761j0005n676M367q276Q751r6M409k88N65L262m878K577N991R24K187
15363F119p051m812O869Q706q960o424M305k058q57M817R97l432k250J226L279
15348D74r17P07m679Q472J0576j2013p713K511L601k711j2583k672p819k966R092
15333a8640O004R20J003J184R865L420q680M328O41p442J028l650Q08L805P803
15318B397l944N914l581K017O351M472r55m552o708r632K134N315P888K436j266
15303H286N150L721m247q454m622L334l037k207J0855K309j1546k269N720Q989
$$ plain form
15408 5508 8441 10804 14887 5637 4939 7995 14409 10156 3684 6870 680 -2171 -5973 767 12302
15393 12302 6045 1149 6724 18470 7418 -11862 -18508 -14564 -23082 -24781 -20113 -14320 -11872 -4456
15379 -4456 2305 -7700 -13376 -9009 -17285 -8534 -8630 -4221 -4509 -3944 -682 -5560 -2983 3008 3932 6119
15363 6119 -932 -5744 1125 9831 871 -5553 -1248 -3306 -4163 654 1651 -1781 -4031 -2805 474
15348 474 -443 264 -4415 4057 14633 2620 -5093 -2582 1019 -1692 -14275 -16947 -24766 -27732 -18640
15333 -18640 -12636 -11716 -10713 -9529 336 3756 -4924 -596 45 -7397 -6369 -10019 -9211 -5406 2397
15318 2397 -1547 4367 786 2803 9154 13626 12671 8119 1411 -8221 -6087 -772 7116 9552 8286
15303 8286 13436 17157 12910 4456 -166 3168 131 -2076 8779 11088 -458 -2727 2993 11982
15289A1982R978J5938J6602J7806J3144j2499j6158k1979j6144k50k973k494o257
15276F696J660n181o068o505l630l119m44Q405J371r518L128J0209K914p862K241
15261e703K555j873n371N802J33K071o588n754j293m4M098J020L646R046L582
15246E327o832r810K49R364K565N76J172K697n977o675P828m211o362L301Q43
15231e945N434J655l73K915L458M998m567j959l47m623j514l509J241o977r29
15216a1042l47o267J819J668L441Q789J2416k11n017r522n416p325K214J1742
15202c058J002J377J132r688M271J0255K6m479P452J42q407j899j354M324j79
15187I17q207o420R484R31j913Q812K611k058j212n082J952Q792O176l769r880
$$ plain form
15289 11982 21960 37898 54500 72306 85450 72951 56793 34814 18670 18420 15447 12953 6696
15276 6696 8356 3175 -2893 -9398 -13028 -16147 -16591 -8186 -6815 -16333 -13205 -2996 -82 -7944 -5703
15261 -5703 -3148 -5021 -10392 -4590 -4457 -2386 -8974 -14728 -16021 -16065 -11967 -10947 -7301 1745 5327
15246 5327 -1505 -11315 -11066 -1702 863 1439 2611 5308 -669 -7344 484 -3727 -10089 -6788 -5945
15231 -5945 -511 1144 771 3686 7144 12142 7575 5616 5269 646 -868 -4377 -3136 -10113 -11042
15216 -11042 -11389 -17656 -15837 -14169 -10728 -1939 10477 10266 5249 -4273 -9689 -17014 -14800 -3058
15202 -3058 -2056 -679 453 -9235 -4964 5291 5317 838 8290 8432 25 -1874 -3228 1096 917
15187 917 -7290 -13710 -4226 -3295 -5208 3604 6215 4157 2945 -2137 -185 8607 14783 11014 1134
15172A134K034N019K772o81k412p807n216l228K454O618N663K535r459m626l928
15157i128O118L475p681J5995L791m716m267M267k513Q33J166p277r480o657O162
15142i912J2598J57n308l72N926M267n600p643j724k166o39r06J2108R48l317
15127a583k532m865P448m422J246J752j021J023P261r11l069p027P91K916L8k540
15111e495q334N152N473l767Q495M977p466p08L238J855n17m02p00O11j751L970
15095D631m284l474J0106R935p754m399N433l78p200N808p022r511n691Q252L727
15080a821m622j3853J699J5439L505l033n735k555n03L952N125P2n540l339N056
15065f153j094j041J0758j936k857P052l192l751l940n694j059O001O331n673
$$ plain form
15172 1134 3168 8187 10959 10278 7866 59 -5157 -8385 -5931 687 6350 8885 -574 -5200 -9128
15157 -9128 -3010 465 -7216 8779 12570 7854 3587 7854 5341 6174 7340 63 -9417 -16074 -9912
15142 -9912 2686 2843 -2465 -2837 3089 7356 1756 -5887 -7611 -9777 -10416 -11322 786 1734 -1583
15127 -1583 -4115 -8980 -1532 -5954 -4708 -2956 -3977 -2954 4307 3396 327 -6700 -5909 -2993 -2955 -5495
15111 -5495 -13829 -8677 -3204 -6971 1524 6501 -965 -1673 1565 3420 2903 2501 1801 2412 661 4631
15095 4631 347 -3127 6979 16914 9160 4761 10194 9816 2616 8424 1402 -8109 -13800 -5548 -1821
15080 -1821 -6443 -20296 -18597 -3158 347 -2686 -8421 -10976 -11479 -7527 -2402 -2330 -7870 -11209 -6153
15065 -6153 -7247 -8288 2470 534 -2323 4729 1537 -2214 -6154 -11848 -12907 -6906 -575 -6248
15051f248k855r175k113k3n252Q504N873o352J2283J1791j061j4492o704M419
15037a1405O636J1212j680J666j925l576K166k978J260Q338J608k692j0774R711
15023G567J1657q086R28N981o944k776q041j945M766k233J741M685m31r037j649
15008c817n792M492p79m877L639J4547M210N323p79n087L669m508L140M521Q572
14993B6474M267j875l460l702m201q945K926P117K500M160j005m43Q504K310O559
14978D1186P515N133J1691L660K652K9153M0832N9706Q1982J32385K21612K75701
14966I13208K37234R0393r1010j75955k02310k01565j66841j19840r2678n4240
14956A36396k7313q724j1654j7390j2607j0038j4150j691j0744j3059j698l796
$$ plain form
15051 -6248 -9103 -18278 -20391 -20414 -25666 -17162 -11289 -17641 -5358 6433 5372 -9120 -15824 -11405
15037 -11405 -4769 6443 4763 6429 4504 928 3094 116 1376 9714 11322 8630 -2144 7567
15023 7567 19224 11138 12066 18047 11103 8327 286 -1659 3107 874 2615 7300 6869 -2168 -3817
15008 -3817 -9609 -5117 -5896 -10773 -7134 7413 11623 16946 16167 11080 14749 10241 13381 17902 26474
14993 26474 30741 28866 25406 21704 17503 8558 11484 18601 21101 25261 24256 23813 32317 34627 41186
14978 41186 48701 53834 65525 69185 71837 100990 141822 201528 283510 415895 637507 913208
14966 913208 1150442 1240835 1149825 973870 771560 569995 403154 283314 190636 136396
14956 136396 109083 100359 88705 71315 58708 48670 34520 32829 22085 9026 7328 3532
14944C532J3847N049l740N80Q169K816n358j4738l288R38k651k477k027q650o138
14929a4136N866P32N886J3519o69p931j0767k927m113l256O236p469L918K710
14915a2401n500J1687K151r053L590J8120l823o042k237n19N313L552k916k958
14901a036l231q669k542M91J964L808Q801K025j722m251k13k817l48J2605N519
14886A0384K8O55m996o189R5l199p838L187J626N533Q656R045L587L273q981m513
14870A0353J983N829J551l153n456p158k584j2881J716Q749l996J1191L760k433
14856G471n257N283M252N272K318M12m285q315l825j1173o277P43M142P01J2693
14841D155Q149m763K488N7o382q597J3826N244j0745o097q032k257K018Q722K736
$$ plain form
14944 3532 17379 22428 18688 19268 27437 30253 24895 10157 6869 7807 5156 2679 652 -7998 -14136
14929 -14136 -8270 -7538 -1652 11867 11198 3267 -7500 -10427 -14540 -17796 -11560 -19029 -15111 -12401
14915 -12401 -17901 -6214 -4063 -13116 -9526 8594 4771 -1271 -3508 -4027 1286 4838 1922 -1036
14901 -1036 -4267 -12936 -15478 -14987 -13023 -9215 -414 1611 -111 -4362 -4575 -7392 -7740 4865 10384
14886 10384 10412 11067 6071 -118 -23 -3222 -11060 -7873 -6247 -714 7942 16987 20574 23847 14866 10353
14870 10353 12336 18165 19716 16563 11107 3949 1365 -11516 -9800 -1051 -5047 6144 9904 7471
14856 7471 2214 7497 11749 17021 19339 19751 15466 7151 3326 -7847 -14124 -13381 -9239 -8538 4155
14841 4155 12304 7541 10029 10086 3704 -4893 8933 14177 3432 -2665 -10697 -12954 -10936 -2214 522
14826E22q524p032N835R89P462N682L354O66r172K08o714j4495M913J0992L423
14811a891q7J846K320k075o170o422q004p482l980n543j01m228R058J2765j762
14796b1756L431J531L725J891n304K886L455q6J0687M629N789N776m254j2257
14782A43p071J0566J2535J056j7767j0117N759R526J1341k270J815l646r885q059
14768f074l204J3877J3278J609m010k291P9O04o19k562L305r926o012J49m396
14753f193M890J133n87L899q915L222Q207J2851J2076J0217O740J4101K5236J9425
14739A06302J9784J8456P147r077j1310j3137k4945k1754j6813p883n72q380k1120
14726A6698j0997K445L606o100L201J5127L732j5827n022J1948j58m713l715q082
$$ plain form
14826 522 -8002 -15034 -9199 -8210 -748 4934 8288 8954 -218 -10 -6724 -21219 -16306 -5314 -1891
14811 -1891 -1978 -132 2188 113 -6057 -12479 -20483 -27965 -31945 -37488 -37589 -41817 -32759 -19994 -21756
14796 -21756 -18325 -16794 -13069 -11178 -16482 -13596 -10141 -10227 460 5089 10878 16654 12400 143
14782 143 -6928 3638 16173 17229 -538 -10655 -4896 4630 15971 13701 15516 11870 1985 -6074
14768 -6074 -9278 4599 17877 19486 15476 13185 13264 13868 13249 10687 13992 4066 -1946 -1797 -6193
14753 -6193 -1303 -170 -757 3142 -5773 -2551 5656 18507 30583 40800 47540 61641 86877 106302
14739 106302 126086 144542 151689 142612 131302 118165 93220 71466 54653 46770 46198 37818 16698
14726 16698 5701 8146 11752 5652 8853 23980 27712 11885 6863 18811 18653 13940 10225 2143
14712B143K173m383q802Q44M916J4828Q361n202n742r629p453L827L748M834J65
14697D628n917L862j720l070J3473J0868J388Q710J0427J3634P929l839l288m182
14683E2903o096j4880j3561j8619k3802o00K4175K2175Q927j9015j1480J2134
14671A2261P569Q901M210M639J0866O314K51l489j0219n961o38P629n131J177
14657C8379P199j7q495j4101j626L159J2145j145n399p20P626R58Q766O176N289
14642E8194Q018J823j0445p772m837r217l627k64j1384j1797L960J1643O030p522
14628B2803j0232l00M769p185n828l963J1938N411O931L6082M8373N9059J09629
14615B77487J48217J42952Q3563O155m8579p8506q8671p4484n3850n8875n4934
$$ plain form
14712 2143 4316 -67 -8869 -8025 -3109 11719 20080 14878 9136 -493 -7946 -4119 -371 4463 4628
14697 4628 -1289 2573 853 -2217 11256 22124 23512 32222 42649 56283 64212 60373 57085 52903
14683 52903 46807 31927 18366 -253 -24055 -24655 -480 21695 30622 11607 127 12261
14671 12261 19830 28731 32941 37580 48446 54760 55011 51522 41303 35342 34704 42333 37202 38379
14657 38379 45578 45561 37066 22965 21339 24498 36643 35498 30099 29379 37005 37963 46729 52905 58194
14642 58194 66212 68035 57590 49818 44981 35764 32137 31873 20489 8692 12652 24295 30325 22803
14628 22803 12571 12271 17040 9855 4027 64 12002 17413 24344 60426 108799 167858 277487
14615 277487 425704 568656 652219 658374 609795 531289 442618 368134 314284 255409 200475
14604B00475l8420k6467q609M025M191m87l951j257P23J554k036N250J958K397
14590A39346J988j369l480j3043m463j163O325n594P637J1695K979j0736M05o0
14576A30467J2930L960M892J0018J8498Q143j1009n494n703r197O13J4303K649
14563A75070K562m027J5653K2272J2502J3883J5835J5847K2139J6175J2393P479
14551C27783K709j5196j2089j570l611J424l097o992J79J2467K4698J2464R680
14538C48849J2851J5131J2304K3815K8278L7857M4729M2781L1752J5723J5889
14527F29959K1878K9553L0306M5049P2381Q4142Q5731O5934N5432N7859P5618
14516A253842Q7286R3863J07278J40740J33974J38512J66682K36765L14846L67205
$$ plain form
14604 200475 162055 135588 126979 131004 135195 134708 130757 129500 130223 131777 129741 134991 136949 139346
14590 139346 141334 139965 136485 123442 118979 117816 124141 118547 126184 137879 140858 130122 130527 130467
14576 130467 143397 147357 152249 162267 180765 188908 177899 172405 166702 157505 158118 172421 175070
14563 175070 177632 173605 189258 211530 224032 237915 253750 269597 291736 307911 320304 327783
14551 327783 330492 315296 303207 301637 298026 299450 296353 289361 289540 302007 326705 339169 348849
14538 348849 361700 376831 389135 412950 441228 479085 523814 566595 598347 614070 629959
14527 629959 651837 681390 711696 756745 829126 913268 998999 1064933 1120365 1178224 1253842
14516 1253842 1341128 1434991 1542269 1683009 1816983 1955495 2122177 2358942 2673788 3040993
14506C040993M27061N16256O82378Q78232R72478R38869J008729J331832J724678
14497A1521506K020823K404404L185608M614175P067338J1325710J9214287L3242945
14489I4596796N1486274N8995511L8614154j89400k8872951l7996252l9231243
14482A37402889l7404487l0014591k0379135j2985181q494924n860985m230544
14475A8033042l138045k308448j680023j284737j127904j087852j015324q76978
14467E513731p49289o17034m84969l94636l32586k83409k47085k06684j68455
14458B029584j46309j32684j21453j15132j17252r3474o5262n7053n3668m4577
14448A082720n0176m4652m3935m5913n1784m6862m0944k4027r262j1296j4511
$$ plain form
14506 3040993 3468054 3984310 4666688 5544920 6517398 7456267 8464996 9796828 11521506
14497 11521506 13542329 15946733 19132341 23746516 30813854 42139564 61353851 94596796
14489 94596796 146083070 205078581 243692735 243503335 214630384 176634132 137402889
14482 137402889 99998402 69983811 49604676 36619495 28124571 22263586 18033042
14475 18033042 14894997 12586549 10906526 9621789 8493885 7406033 6390709 5513731
14467 5513731 4764442 4147408 3662439 3267803 2935217 2651808 2404723 2198039 2029584
14458 2029584 1883275 1750591 1629138 1514006 1396754 1303280 1238018 1180965 1127297 1082720
14448 1082720 1032544 987892 943957 898044 846260 799398 758454 734427 725165 713869 699358
14437F99358j1059j1309l2435k4009l215J511L541q921j1156q020j0220j3773
14425E70293k1803m4809m6957m0862l0701k0224k4814k1841j9625m646p91P688
14413C00908M470k548m062l102k787k0728j4152P96j423j4831j2849j6623N47
14400B13616J680p596j359Q362N969j0079n513m516k456J697M344M222l480r676
14386A95215j5749j4686j4043j1385j2157j6162r678K929L627l988j328M314P518
14373A14427R763J5942K262j1761p300J576j536o62k0941l0434m695K8904L8699
14360A34244L4064J9464J8364K5395J2501k114o807r351j0328j9835k0990r283
14348A65324R362k639q016l095k97r174j6134q907k975o339o841k883L260m96
$$ plain form
14437 699358 688299 676990 644555 620546 617331 618842 622383 613462 602306 594286 584066 570293
14425 570293 548490 503681 456724 415862 385161 364937 340123 318282 298657 294011 293220 300908
14413 300908 305378 302830 298768 295666 292879 272151 257999 258795 257372 242541 229692 213069 213616
14400 213616 215296 207700 206341 214703 220672 210593 205080 200564 198108 199805 204149 208371 204891 195215
14386 195215 179466 164780 150737 139352 127195 111033 101355 104284 107911 103923 102595 106909 114427
14373 114427 124190 140132 142394 130633 123333 124909 123373 122711 101770 71336 66641 95545 134244
14360 134244 168308 187772 206136 231531 244032 241918 235111 225760 215432 195597 174607 165324
14348 165324 174686 172047 164031 160936 160639 151465 135331 126424 123449 117110 110269 107386 110646 110150
14334A10150j715r581j4789j0561p244m594N64J1243J2241L543m417Q218O651
14321I9709l304j2079p565J893Q160N061p650j835K333K088j126j0861j3264l510
14307E8050J789J965J87M94j502o740J47j919P181J1637J3969o456r448J0804
14293H0158K2897J3603J065j4982j9005o29J1713N636k403q913J459M720J7928
14280A13247O178j2430o562l472p063j465l237L811m329j2970n367M801o548j1448
14266E3146p125r202o3L399L583J315j0625m852L677q077m902M59N773J4699J5012
14251E6217n310l803K685J0425O57J0572j02r136l282j053j0787m603M54L531
14237D6465k388L953J373l35R461L738q677j2494R595J74n57k415r521o139j382
$$ plain form
14334 110150 108435 98854 84065 73504 66260 61666 62230 73473 85714 89257 84840 93058 99709
14321 99709 96405 84326 76761 78654 86814 91875 84225 82390 84723 86811 85685 74824 61560 58050
14307 58050 59839 61804 61991 62485 60983 54243 54390 52471 59652 71289 85258 78802 69354 80158
14293 80158 103055 116658 117723 102741 83736 83107 94820 100456 98053 89140 90599 95319 113247
14280 113247 119425 106995 100433 96961 89898 88433 85196 89007 84678 71708 66341 71142 64594 53146
14266 53146 46021 36819 36756 40155 43738 45053 34428 29576 33253 25176 20274 20733 26506 41205 56217
14251 56217 50907 47104 49789 60214 60871 71443 71341 62205 58923 57870 47083 42480 42934 46465
14237 46465 44077 48030 49403 49068 58529 62267 53590 41096 50691 50865 50308 47893 38372 32233 30851
14222C0851M125M167l99k353L697j990l350O645Q009Q342j035p106o000l949o960
14207C2694l617M478L275l932j0091N411m883J952l001l34R928l324r044R322
14193B8834j000j900M164K657j5370r55j29j322K445R858J0923J0865K381N734
14179E7185l115m50k175k280n77O404R165L434L500j0202M762m148j1737j0113
14165C9653j1563l920M87M935j0793j1937L350K464J1473j503o776K838M43Q528
14151B7679K671r427r667Q231Q2k347m151m275M989K764N014P374L967Q95N565
14136C9364M18p773m726k230Q92J814o465r44K571K384J53m296l335L792q276
14121A3343p426k71R458m21o690r63P455J3393L284q516n736N772m858l902l998
$$ plain form
14222 30851 34976 39143 38744 36391 40088 38098 34748 41393 49402 57744 56709 49603 43603 39654 32694
14207 32694 29077 33555 36830 32898 22807 28218 23335 25287 22286 21952 31880 28556 19512 28834
14193 28834 27834 25934 30098 32755 17385 16430 16301 14979 17424 27282 38205 49070 51451 57185
14179 57185 54070 53620 51445 49165 48588 54992 64157 67591 71091 60889 65651 61503 49766 39653
14165 39653 28090 24170 24657 29592 18799 6862 10212 12676 24149 22646 15870 18708 19151 27679
14151 27679 30350 20923 11256 19487 19569 17222 13071 8796 13785 16549 21563 28937 32904 33799 39364
14136 39364 39782 32009 27283 25053 25945 27759 21294 20350 22921 25305 25458 21162 17827 21619 13343
14121 13343 5917 5646 15104 14683 7993 7030 14485 27878 31162 22646 16910 22682 17824 13922 9924
14106I924q338L979J2547L686m631m278K129n686P122Q746q81N111p514q609J2610
14091B5917l57l182m91q572L763j530J652K986l945r366m776k618P308p505p341
14076h057P959Q57l230J094R633K408j672J327K718l090J313K197p334J591K63
14061G977j064N543l53O849P292L233l539k691K123K874m549l55l495P030N211
14046C2086O012P715j643p834l141J197j1531j5474J828K178P95J020l913J000
14032A0295K391Q934N601J543q072M09j82o842K72K759j255N423R064J0042P112
14017D7494j052P551J3639k578J4538J0812q4J1834J6414K1144M1457O6369J01821
14004C49359J72656K58828K88316J85822r80j41333j89780j83530j93752j59651
$$ plain form
14106 9924 1586 5565 18112 21798 17167 12889 15018 9332 16454 25200 24319 29430 21916 13307 25917
14091 25917 25560 22378 21887 13315 17078 15548 17200 20186 16241 6875 2099 -519 6789 -716 -8057
14076 -8057 -98 759 -2471 -1377 8256 10664 8992 10319 13037 9947 11260 13457 6123 7714 7977
14061 7977 6913 12456 12103 18952 26244 29477 25938 23247 25370 28244 23695 23340 19845 26875 32086
14046 32086 38098 45813 44170 36336 33195 34392 22861 7387 9215 11393 12188 13208 9295 10295
14032 10295 12686 21620 27221 28764 20692 21101 20919 14077 14349 17108 15853 21276 30340 40382 47494
14017 47494 46442 53993 67632 65054 79592 90404 90320 102154 118568 139712 181169 247538 349359
14004 349359 522015 780843 1069159 1254981 1254001 1112668 922888 739358 545606 385955
13994C85955j09164n8871m1689l1527k4210j7714j9552k1459k0295L295M23M22
13982D5614k177o189l831o260J589k017l28m969L461K413l779K367M779l343n480
13967B1850m91m625K364M54j603K55o783m37P622O02j851l04q26o429k092J744
13951I450m711J458K937N386K169j729R77q061j530K516J4077k806o279l642K53
13936A0465o290L694K371N340Q27n34j747J214p472M948P513N266o98q796j1937
13921D164K751N55j4279J813J2929N771J896n98q072K950J0319M855N748M981
13907C5783p177k855o33k789k733J168m478M798j0603n837r512o004k499P981
13893e390Q502K752K999N567o752m19L538p454n631q466R484J4439R03L088q99
$$ plain form
13994 385955 276791 217920 176231 144704 120494 102780 83228 61769 41474 44769 45192 45614
13982 45614 43437 37248 33417 27157 28746 26729 26401 21432 24893 27306 23527 25894 30673 27330 21850
13967 21850 21359 16734 19098 19552 17949 18204 11421 10984 18606 19208 17357 17053 16227 9798 7706 9450
13951 9450 4739 6197 9134 14520 16689 14960 15937 7876 6346 8862 22939 20133 13854 10212 10465
13936 10465 4175 7869 10240 15580 16407 15873 14126 15340 7868 12816 20329 25595 24897 16101 4164
13921 4164 6915 7470 -6809 -4996 7933 13704 15600 15002 6930 9880 20199 25054 30802 35783
13907 35783 28606 25751 25118 22329 19596 20764 16286 21084 10481 4644 -4868 -10872 -13371 -5390
13893 -5390 3112 5864 8863 14430 7678 7259 10797 3343 -2288 -10754 -1270 13169 14072 17160 16261
13878A6261P681L096n179n493j118k424m059Q59o699m806O37L783J1380N386Q617
13863B7922J1964m977o833j2383j3018j1775N174m622q455O984K1294P705p316
13850A1664J527K186j4979l829L983O376M026N600P461m605N234P269l770q212
13836A9931o936o25K878L637n783o772P869n598o633l766N582N301p24P516k79
13821A5598L020M520q494j0968R3K471j290j149n108R388k001l776m973P695K779
13806G805M263P121n732l656j340l482p989m037q93m027O795Q147K652K683l721
13791D589J0776j431N945Q12j2944o194J192p990K295O561L357l85k912J3546
13777A7217k20p367r169K131L609J264n27K793Q993J0697J608k688j2141j0832
$$ plain form
13878 16261 23942 27038 21859 16366 15248 12824 8765 9624 2925 -1881 -1244 2539 13919 19305 27922
13863 27922 39886 34909 28076 15693 2675 -9100 -3926 -8548 -17003 -10019 11275 18980 11664
13850 11664 13191 15377 398 -3431 552 6928 10954 16554 24015 19410 24644 31913 28143 19931
13836 19931 12995 12370 15248 18885 13102 6330 14199 8601 1968 -1798 3784 9085 8361 15877 15598
13821 15598 18618 23138 14644 3676 3769 6240 4950 3801 -1307 8081 6080 2304 -2669 5026 7805
13806 7805 12068 19189 13457 9801 8461 4979 -3010 -7047 -7940 -11967 -5172 2975 5627 8310 4589
13791 4589 15365 13934 19879 20691 7747 1553 2745 -5245 -2950 3611 6968 6583 3671 17217
13777 17217 16997 9630 461 2592 6201 7465 6938 9731 18724 29421 31029 28341 16200 5368
13763E368q707M039N094r3M768L518m901j5044l800N119K561M558K658M274j869
13748G543m491J1756N400o101j0386K148n048l063O962J136K06o60L425L412m443
13733G796j7310n798J0378J0179m241O605J202k113r007j287N754M52k730R623
13719I503N580n455j180J705j368j542N35k806O28N569j0735k785J1147O402m860
13704A0338R255o97n696m534j236j063r62M951Q183Q026j279N407n601q809n262
13689A1021O407K345k886J4885K0556J632L83O770J7497K3294J1483q054j1527
13676I3806j1936n913j1473k1394j0549l27l885p857j74K300q43m714l386N109
13662A8764J5196o698j2115p696q361K701J0927P274o477o172R621k866l100m006
$$ plain form
13763 5368 -3339 700 5794 5701 10469 13987 9086 -5958 -9758 -4639 -2078 2480 5138 9412 7543
13748 7543 3052 14808 20208 14107 3721 5869 821 -2242 4720 5856 6062 5402 8827 12239 7796
13733 7796 -9514 -15312 -4934 5245 1004 7609 8811 6698 -2309 -3596 2158 2610 -120 9503
13719 9503 15083 9628 8448 10153 8785 7243 7778 4972 5600 11169 434 -2351 8796 15198 10338
13704 10338 19593 18896 13200 8666 7430 6367 5405 10356 18539 26565 25286 30693 25092 16283 11021
13689 11021 17428 19773 16887 31772 52328 53960 54343 61113 78610 101904 113387 105333 93806
13676 93806 81870 75957 64484 43090 32541 32214 28329 20472 20298 22598 21755 17041 13655 18764
13662 18764 33960 27262 15147 7451 -910 1791 12718 19992 13515 7343 16964 14098 10998 6992
13648F992m871o54L61l123J577o941n017O240J2765R203j777j508o10n796n773
13633A068o308p168J2255J0119M52m843k67K241K527o18K298o751l220J0874M414
13618A7073m12j660m513l379j334j0811o127R727j67L220M303l916q23O44n547
13603c722k533N696N982J510o365j1445J218L126Q390n485M813J1977R583L767
13589B6512m649o787p026n985o220n353M024j152p322L856l919M401l97o53P209
13574c461J666r476Q618M709O289M329o011M276O969k709m233n539N080n685j0434
13559e612N699N061P494N866L645O534o349J0392R853q338n681l161r72p812m671
13544A1948k525m776l719O934L093l410p368J974Q123M625j317J1652J1161M490
$$ plain form
13648 6992 2121 1467 1828 -1295 282 -6659 -11676 -5436 7329 16532 14755 13247 12637 6841 1068
13633 1068 -5240 -12408 -153 9966 10418 5575 5308 7549 10076 9458 11756 5005 1785 12659 17073
13618 17073 16661 15001 10488 7109 5775 -5036 -11163 -1436 -1603 1617 5920 2004 1181 1825 -3722
13603 -3722 -6255 -559 5423 6933 568 -10877 -9659 -6533 1857 -3628 1185 13162 22745 26512
13589 26512 21863 15076 8050 2065 -4155 -9508 -5484 -6636 -13958 -10102 -14021 -9620 -10017 -10670 -3461
13574 -3461 -1795 -11271 -2653 2056 8345 12674 6663 10939 17908 15199 10966 5427 10507 4822 -5612
13559 -5612 87 5148 12642 18508 22153 28687 22338 32730 42583 34245 28564 25403 24431 16619 11948
13544 11948 9423 4647 928 7862 10955 7545 177 2151 10274 14899 13582 25234 36395 40885
13530D0885l814j810p09O451O42M023L018K023q913q90n362j1993J130N724o703
13515B3702j8189j651Q886Q173m278j182j038p926J725K957j565K245M887L685
13501B0431k067j0102J598o454O740K57p464J194j9537n332J0332N520K273J1050
13487H439N202n067P612J6757j530j1497l683P455Q633R632j799R382M939L712
13473E8187R581P630J8861J1878J7503K1262K2348M0524O2935R1098J69174L01276
13461H32257M56973M77689K23166j32990k88549l02159l08170k83416k00952j27346
13451C46503q4623n3838l8225k9742k9249j8361o420r657j7661j6985k35O732
13439D8239j968l870J316l884j242L509N978o462n456r95p635N31k199p149Q179
$$ plain form
13530 40885 37071 35261 34552 41003 41645 45668 48686 50709 41796 40906 35544 23551 24681 30405 23702
13515 23702 5513 3862 12748 20921 16643 15461 14423 6497 8222 11179 9614 11859 16746 20431
13501 20431 18364 8262 9860 3406 10146 10403 2939 4133 -15404 -20736 -10404 -4884 -2611 8439
13487 8439 13641 8574 16186 32943 31413 19916 16233 23688 32321 41953 40154 49536 54475 58187
13473 58187 67768 75398 94259 106137 123640 144902 167250 207774 270709 361807 530981 832257
13461 832257 1289230 1766919 1990085 1857095 1568546 1266387 958217 674801 473849 346503
13451 346503 261880 208042 169817 140075 110826 92465 86045 76388 58727 41742 41507 48239
13439 48239 46271 42401 43717 39833 38591 42100 48078 41616 36160 35165 27530 28061 25862 18713 26892
13424B6892J528o577p681p767R726J1212j356m639O82J883J3822M061j1629j2062
13410A8095o167k155K805n701O68l275K73J0433R636M876J625M724J77l818K724
13395C4920J0319Q663k271j3898m385k439r336K977P94R276P500r714k439J906
13381C1873j0477q190m974p709P622O059N326K081Q704L835m544M429P747J3638
13367E5420R581o594q215n648j3204l706k965n480m115N394n25r898l409K286
13353H922L299R769P042j344l044k249p962m027j969o215Q16K800k679m952L960
13338B167k822q449r870o915L168L336M703K175n637p075P85J3854m675j615J4114
13323b756J1466j305L323M85p898l756L680J1969J0445K52j921n202K041R706
$$ plain form
13424 26892 28420 21843 14162 6395 16121 27333 25977 21338 22020 23903 37725 41786 30157 18095
13410 18095 11928 9773 12578 6877 7545 4270 4543 14976 24612 29488 31113 35837 36014 32196 34920
13395 34920 45239 53902 51631 37733 33348 30909 21573 24550 25344 34620 42120 32406 29967 31873
13381 31873 21396 13206 8232 523 8145 14204 19530 21611 30315 34150 29606 34035 41782 55420
13367 55420 65001 58407 50192 44544 31340 27634 24669 19189 15074 20468 19943 10045 6636 8922
13353 8922 12221 21990 29032 27688 24644 22395 14433 10406 8437 2222 3038 5838 3159 -1793 2167
13338 2167 -655 -9104 -18974 -25889 -22721 -19385 -14682 -12507 -18144 -25219 -24434 -10580 -15255 -16870 -2756
13323 -2756 8710 7405 10728 11213 3315 -441 3239 15208 25653 25905 23984 18782 20823 30529
13309C0529L05k870j0589n786P637K080K910n501m048j2087m578P356j672j0745
13295g059j0731m91J3750n420L197N338N167M945P727o090J1326J6857k819j44
13281C5553J1088J4604P472J0714J0377K1520J7098K1800K5891K2191J3770o010
13269B06068j7247l3607m0840l6007k2896j6718j4906j8034p120k752J568R321
13257F830N196M493P015J1972J5810O297l265j0455r85Q962j556M134m442l978
13243D6028M084L530L863P072J1995K3284r90j8377k4224k4974j8939r743j3842
13230a1233j1258j2009j3387p584M595K073P692P093J0132K1216N10o624j3042
13217b1826j4090J1765N340j7985j7757O087M9814M1325J0639j7318L596J7077
$$ plain form
13309 30529 30834 27964 17375 11589 19226 21306 24216 18715 14667 2580 -1998 5358 3686 -7059
13295 -7059 -17790 -18281 -4531 -9951 -6754 -1416 3751 8696 16423 10333 21659 38516 35697 35553
13281 35553 46641 61245 68717 79431 89808 111328 128426 150226 176117 198308 212078 206068
13269 206068 188821 155214 114374 78367 55471 38753 23847 5813 -1307 -4059 -2491 6830
13257 6830 12026 16519 23534 35506 51316 57613 54348 43893 42908 51870 50314 54448 50006 46028
13243 46028 50112 53642 57505 64577 76572 99856 98866 80489 56265 31291 12352 2609 -11233
13230 -11233 -22491 -34500 -47887 -55471 -50876 -48803 -41111 -34018 -23886 -2670 -2160 -8784 -21826
13217 -21826 -35916 -24151 -18811 -36796 -54553 -48466 1348 42673 53312 35994 39590 56667
13205E6667Q084j447k171K461J1958K956j705p55K782m43K592K688o142j5168
13191F2357q351o38n520j2336k446J1096L215K43j4013l648J4443J7885J5889
13178G8176J3973P703K187p030j6514j0466j1001r397N592L941j2377o228M861
13165D3420K0620K6458K5044K4663L724r516l1009l8348j9658j8728j1404j6152
13153h86j8157j4173k4945j7890j0804K1659N2815O1403O6970M1341J6900K1019
13141A95252L184q761j6419r077j4525m532P649J0477J5184K940j633K3855J4683
13128B18277O377K0280J6189O756m702j5164p806L781P59K6458L7709L0304K7355
13115C66573O372k5465k8997k1754j4001p321q066j3092L043J836j034R773O097
$$ plain form
13205 56667 64751 63304 61133 63594 75552 78508 76803 76048 78830 78387 80979 83667 77525 62357
13191 62357 54006 53368 47848 35512 33066 44162 47377 47620 33607 29959 44402 62287 78176
13178 78176 92149 99852 102039 95009 78495 68029 57028 47631 53223 57164 44787 38559 43420
13165 43420 64040 90498 115542 140205 143929 134413 103404 65056 45398 26670 15266 -886
13153 -886 -19043 -33216 -58161 -76051 -86855 -65196 -12381 49022 115992 157333 174233 195252
13141 195252 198436 189675 173256 164179 149654 145122 152771 163248 178432 181372 179739 203594 218277
13128 218277 224654 244934 261123 267879 263177 248013 240207 243988 244747 271205 308914 339218 366573
13115 366573 372945 347480 318483 296729 282728 275407 267341 254249 257292 259128 258094 267867 273964
13102B73964p050o767p398Q776p325o00J0226L0784L9164K0938J9528J4548K6239
13089D15027L0202K0323J0508J977n848n973K023o339K462K125j9754j1180L922
13076D39475K3848L9599M2887N6630L9228J6355L639J8264M2372L7455M3336M4893
13064H47981L2118J7367L7149M2993K6331K7694O1071J15021J28262J13677Q4599
13053A534263P7771R5055J25870J60229J84548J87904J91111J69439J62269J96247
13043C084706L14892M11840M61773M98313N42700O59045Q24141R87755J121012
13034H906177J362810J848541K554602L443248M593318O133368Q195026J1407917
13026D8445007J7361733K9035063N1150501Q2180440R5470983N6839654j1709368
$$ plain form
13102 273964 266914 260147 252749 261525 254200 253600 263826 294610 333774 354712 374240 388788 415027
13089 415027 445229 465552 476060 478037 472189 466216 468239 461900 464362 466487 446733 435553 439475
13076 439475 463323 502922 545809 602439 641667 658022 661661 679925 722297 759752 803088 847981
13064 847981 880099 897466 934615 977608 1003939 1031633 1092704 1207725 1335987 1449664 1534263
13053 1534263 1612034 1707089 1832959 1993188 2177736 2365640 2556751 2726190 2888459 3084706
13043 3084706 3399598 3811438 4273211 4771524 5314224 5973269 6797410 7785165 8906177
13034 8906177 10268987 12117528 14672130 18115378 22708696 28842064 37037090 48445007
13026 48445007 65806740 94841803 145992304 228172744 323643727 380483381 368774013
13019C68774013n1309524n6837541n8847583n6573981m3321420k8386299j8648520
13012E4849145j3103178r477828o839064m941456l612208k691673k047028j586036
13004A0550674j217724r25542p10564o15718o11392o03338n90317n71708n17850
12995D186521m24286l56975k92394k27722j94538j89036k04599j70779j27594
12986A998598q6746n6811o3965p9877p7010o7975p7234r3796r5201p6588n7306
12975A166089l0390j3416q808j3975m3971m2029l6307l3706j2793j0490k2668
12964H97536m0968n1637m2925l7724n0475l1092m5290m0748k5248k5182k1050
12953D85197j9282p479k239J009J340O009R901M58k367m127N732R503Q707K126
$$ plain form
13019 368774013 317464489 260626948 201779365 145205384 101883964 73497665 54849145
13012 54849145 41745967 32268139 25429075 20487619 16875411 14183738 12136710 10550674
13004 10550674 9332950 8407408 7696844 7081126 6469734 5866396 5276079 4704371 4186521
12995 4186521 3762235 3405260 3112866 2885144 2690606 2501570 2296971 2126192 1998598
12986 1998598 1911852 1855041 1791076 1711199 1634189 1566214 1488980 1395184 1299983 1223395 1166089
12975 1166089 1135699 1122283 1113475 1099500 1055529 1013500 977193 943487 930694 920204 897536
12964 897536 856568 804931 762006 724282 673807 642715 597425 556677 531429 506247 485197
12953 485197 465915 458436 456197 457206 458546 464555 474456 474914 472547 468420 474152 483655 492362 494488
12939D94488J1793L5778L8252J8327j5414m2209n2822l9628l0391l3787k1189
12928C63198j7067k2669j0996l608m560p866o470n024j5010k2357j7815q346p094
12915B14316r121k447l37q198K79p495o78M444J4707L981L308J7981M55k1047
12901B10148j9429k6167j7816k1663K257N4468O9154L9957K4895L2134K3290J4205
12889C85433O628j2170j5836j9157k0561j6033j7088j2189p625j4361j5022l01
12877B41718k342p101l225o442j1975o954o109m093r80k0380q925o014j6562j1310
12863A29306m124M724J0578K623J0895J0426j138K376j3143j2529o320N175J1794
12850A50643N906K338n417R27k843q071j7765j8211j1378P851L226l990P484J2843
$$ plain form
12939 494488 506281 542059 580311 598638 583224 541015 488193 448565 418174 384387 363198
12928 363198 346131 323462 312466 308858 304298 296432 289962 284938 269928 247571 229756 221410 214316
12915 214316 205195 202748 202411 194213 194492 186997 186319 190763 205470 209451 212759 230740 231195 210148
12901 210148 190719 164552 146736 125073 127330 181798 250952 290909 315804 347938 371228 385433
12889 385433 392061 379891 364055 344898 324337 308304 291216 279027 271402 257041 242019 241718
12877 241718 239376 232275 229050 222608 210633 203679 197570 193477 192497 172117 163192 157178 140616 129306
12863 129306 125182 129906 140484 143107 154002 164428 163290 165666 152523 139994 133674 138849 150643
12850 150643 156549 158887 153470 154397 151554 143483 125718 107507 96129 103980 107206 103216 110700 123543
12836A23543J0435j4771k2634l962K3013K4403K442j0991J5050L6749K9825r043
12824B04059k9089k5029r459O329M338Q313K0179Q363j028m190p131R6q047k647
12810A65057j2177j1885l125R549j315j4784j1618j0429j7501n641K348n793M46
12797H3132R298j890j6342j0245j133r73M315K037l405r935J1532J9906O447Q729
12783A01473L068o806L089q1j0566n537q022q141j24l174M392P584Q266P618q244
12768H4795m640J7855J3442j713n811K075m071m458m794j3142r196N714J3686
12755H9742K40q40J0393O301l423M583P472j728o410m475q675p469m988j537k115
12740G7071p203j3845j775O916M314j4926q009J616Q959j233m075K914J0674J1153
$$ plain form
12836 123543 133978 119207 96573 92611 115624 140027 142469 131478 146528 183277 213102 204059
12824 204059 174970 149941 140482 146811 151149 159462 179641 188004 186976 182786 175655 175751 167704 165057
12810 165057 152880 140995 137870 147419 146104 131320 119702 109273 91772 86131 88479 82686 83132
12797 83132 92430 90540 74198 63953 62820 61847 66162 68199 64794 54859 66391 86297 92744 101473
12783 101473 104541 97735 100824 100743 90177 84640 76618 68477 68353 65179 69571 77155 85421 93039 84795
12768 84795 80155 98010 111452 109739 103928 106003 101932 97474 92680 79538 70342 76056 89742
12755 89742 89982 89142 99535 105836 102413 106996 114468 112740 106330 101855 93180 85711 80723 79186 77071
12740 77071 69868 56023 54248 61164 65478 50552 42543 44159 53118 51885 47810 50724 61398 72551
12726G2551M634j615k674q003q213J110K816r4K427J3063K080o500p395R862p34
12711G3315J359N992j938o661J456O638r869o762R300O946n772n334j1251o510
12697E0909L804N360j262l203m847l812P947N759o196o957j041R77l523L440P780
12682E5135l459n578m81J0200J3199Q4o317j3399o155j321J575l925m236k499
12668C2823k306L087N007P549N968p657p497P71L295k543o200n30N142r750K34
12653B7393j398O65O444P655P628l969J9L212j407p670k751N54l75j2984j0586
12638A2430P32M47P075J0759J07P73N988J0086o43Q585L470m268m062o352l858
12623D1269m205o932Q3q470P488J1070J720n229m105l968n016K424J487M662K361
$$ plain form
12726 72551 77185 75570 72896 64893 56680 57790 60606 60512 62939 76002 78082 71582 64187 74049 73315
12711 73315 74674 80666 78728 72067 73523 80161 70292 63530 72830 79776 74004 68670 57419 50909
12697 50909 54713 60073 58811 55608 50761 46949 54896 60655 54459 47502 46461 47438 43915 47355 55135
12682 55135 51676 46098 45617 55817 69016 69100 62783 49384 43229 41908 43483 39558 35322 32823
12668 32823 30517 33604 38611 46160 52128 44471 36974 37745 41040 38497 32297 31767 36909 27159 27393
12653 27393 25995 26660 33104 40759 48387 44418 44437 47649 46242 38572 35821 36375 36000 23016 12430
12638 12430 13162 13609 20684 31443 31550 32323 38311 48397 47754 56339 59809 55541 51479 45127 41269
12623 41269 37064 30132 30215 21745 29233 40303 42023 36794 32689 28721 23705 26129 27616 32278 34639
12608C4639L032Q50r13J522k52j68M273K295n239J0681J5579l891J4M012q496
12593E7938o052P953J7485R815P934J4373J4257J0300J0537K7064M8254M7333
12581B67191R1691J59366K59765M08656M96841L16944m1087k62919l11546l17329
12571A067573k95830k21704j45944r2838n8202n0308l1855l0922k2512j0655j1651
12560I5152r102M269q21p448j4421j0049K705L915q026O709j482j0796m333M42
12546D6714j916q704J409o09O139J446r780L813J127o915k770K681J777L966L483
12531D1861P500j1467L175J6207n671r795J401J552p472r82o2R040j148j98j0037
12516C3904o075K680m864J545j061O13N631J701L393n953k924o139R835N095j411
$$ plain form
12608 34639 37671 38521 37608 39130 38878 38710 42983 45278 40039 50720 66299 62408 62422 66434 57938
12593 57938 51886 59839 77324 87139 95073 109446 123703 134003 144540 171604 219858 267191
12581 267191 358882 518248 778013 1186669 1683510 2000454 1959367 1696448 1384902 1067573
12571 1067573 771743 550039 404095 311257 253055 202747 170892 139970 117458 106803 95152
12560 95152 86050 90319 89498 82050 67629 57580 60285 64200 56174 62883 61401 50605 46272 46714
12546 46714 44798 36094 37503 36894 43033 44479 34699 38512 39639 32724 29954 32635 34412 38378 41861
12531 41861 49361 37894 41069 57276 51605 41810 43211 44763 37291 36309 36247 45287 44139 43941 33904
12516 33904 27829 30509 25645 27190 26129 26742 32373 34074 37467 31514 28590 22451 32286 37381 35970
12501C5970n096J517P10n622o654r084R430J7090k917r841m749M687M881K997
12487C3319j189j893j944j2603k824p544R990J2367k069L660L825l58j0435q098
12473A4204j982O975Q054N210N218L576l559n385j3978L261k214O553O113N460
12459C7506k133l308j685o993j0875J58R290L384Q428R788M60q145l842l637L37
12444B8733l282J0056j44p666k190K202L82J277m97N658N175m606r614r36q164
12429A6384l628k997n54J3632N183n743J065M382J03J106m929L888l665q782m864
12414A0581O384l031J858J0083l014o589J801P39k152O165j436k685l005J662
12400A7361l101K345J0396K798j761k863r766j102n881M7N645M611q09j85n391
$$ plain form
12501 35970 30874 32391 33101 27479 20825 11741 21171 38261 35344 25503 20754 25441 30322 33319
12487 33319 32130 30237 28293 15690 12866 5322 15312 27679 25610 29270 33095 32737 22302 14204
12473 14204 12222 19197 27251 32461 37679 41255 37696 32311 18333 21594 19380 25933 32046 37506
12459 37506 35373 32065 30380 23387 12512 12670 21960 25344 33772 43560 44020 35875 32033 28396 28733
12444 28733 25451 35507 35363 27697 25507 27709 28091 29368 28871 34529 39704 35098 25484 24548 16384
12429 16384 12756 9759 9205 22837 28020 22277 23342 27724 27827 28933 24004 27892 24227 15445 10581
12414 10581 16965 13934 15792 25875 22861 16272 18073 18812 16660 22825 21389 18704 15699 17361
12400 17361 14260 16605 27001 29799 28038 25175 15409 14307 8426 8473 14118 18729 17920 17735 12344
12385A2344l377K609K0896K777n463j3498r264M846O212Q56k453k052M473J402
12371B0308r3M774j168q54M207j446J832j18M170o36o845m544j374L508o019P647
12355B3349R639l816j3769k666N322K03j430R91M202k485j471K376P290N543m36
12340C2842m012r656j184o511n934O328R77q66R787N378r024r638l591k542J3504
12325A5858J6847M763j5304j1954n678N449P870J165O994J32J0401Q8l484m600
12311B8547p158p287k945J691n350j748n390J431N124K521j0626J368J2072L297
12297A5547M324N824P600o628m411K440N809l435j1010o966M423M645N43O563
12283B5268K17K357k770M289O067q551J997j764n627l761K712L584L991j3983
$$ plain form
12385 12344 8967 11576 32472 35249 29786 16288 7024 11870 18082 18938 16485 14433 18906 20308
12371 20308 20215 24989 23821 22967 27174 25728 27560 27442 31612 30976 24131 19587 18213 21721 15702 23349
12355 23349 32988 29172 15403 12737 18059 18262 16832 17823 22025 19540 18069 20445 27735 33278 32842
12340 32842 28830 19174 17990 11479 5545 11873 12850 11984 21771 27149 18125 8487 4896 2354 15858
12325 15858 32705 37468 22164 10210 4532 9981 17851 19016 26010 26142 36543 36631 33147 28547
12311 28547 21389 14102 11157 12848 7498 5750 360 1791 6915 9436 -1190 178 12250 15547
12297 15547 19871 25695 33295 26667 22256 24696 30505 27070 16060 9094 13517 18162 18705 25268
12283 25268 25485 27842 25072 29361 35428 26877 28874 27110 21483 17722 20434 24018 28009 14026
12269A4026q608M023J0909J746l510K808j195K783J851O390l9J87P834M04j94
12254C9415r184j712M191q865n146R411j681l863J234L265J165j946m919l055
12240A8310N151j395l539K493P311r0m060j0588p293P09P854O95Q46j0361J18
12225F161Q840j983n853L082O541L655m086O451k225m407J586J093p905m364J638
12210H224M154j658M029O777J932r650o171m117O398j098N689R09m27N828N318
12195B6137J012J459r128k694J516R522R827o572j3938j5147J960Q011k135P86
12181A0616Q67l073o32K285M673p88q752n124m379P283k108m343k08N987o713
12166d409O003j730j253R58m3j698M479L587O866M356p340n205l122j694R128
$$ plain form
12269 14026 5418 9441 20350 22096 18586 21394 20199 22982 24833 31223 31184 31371 39205 39609 39415
12254 39415 30231 28519 32710 23845 18699 28110 26429 22566 23800 27065 28230 26284 21365 18310
12240 18310 23461 22066 18527 21020 28331 28241 24181 13593 6300 7009 14863 15558 16404 6043 6161
12225 6161 15001 13018 7165 10247 16788 20443 16357 22808 20583 16176 17762 18855 10950 6586 8224
12210 8224 12378 10720 14749 21526 23458 13808 7637 3520 9918 8820 14509 15418 14991 20819 26137
12195 26137 27149 28608 19480 16786 18302 27824 37651 31079 17141 1994 3954 11965 9830 10616
12181 10616 11483 8410 7778 10063 14736 13948 5196 72 -4307 2976 868 -3475 -3683 2304 -4409
12166 -4409 1594 -136 -1389 -431 -474 -2172 2307 5894 12760 17116 9776 4571 1449 -245 8883
12151H883J0382K03m574k035m088N240M62j131m596m326L730Q625m611J495j591
12136A2068m46R2p733K60J0250Q14o435n400m93N530M833k889j44k969L463j938
12120H863M888K602M677m824p181p357l500R46P803Q389O17q182k844p139l254
12105e496k615M376n46L344K353Q152J357M630j769p588o044j67O535k7M234j309
12089I420n782q154k187J193O029L951K607p262J398J864N397L516j466Q897K271
12074B1692l205K948o783j2123J068j4010n487J0973P878O397m264n262K672N550
12060H044M125m269p645n374O349K810o660J182N202K224P989Q899r3q077p430
12045G276O894o541K98M333R836o308j869N153K836M935j1541j3919r71J198k225
$$ plain form
12151 8883 19265 19468 14894 12859 8771 14011 14473 13342 8746 4420 8150 16775 12164 13659 12068
12136 12068 11622 11714 3981 4241 14491 15305 8870 3470 2977 8507 13340 10451 10307 7338 10801 8863
12120 8863 13751 16353 21030 16206 9025 1668 -1832 -886 6917 15306 15923 7741 4897 -2242 -5496
12105 -5496 -8111 -3735 -4281 -937 1416 9568 10925 15555 13786 6198 154 -13 6522 6495 10729 9420
12089 9420 3638 -4516 -6703 -5510 519 4470 7077 -185 1213 3077 8474 11990 10524 19421 21692
12074 21692 18487 21435 14652 2529 3597 -10413 -15900 -4927 2951 9348 5084 -178 2494 8044
12060 8044 12169 7900 255 -5119 1230 4040 -2620 -1438 3764 5988 13977 22876 22783 14706 7276
12045 7276 14170 7629 7927 12260 22096 15788 13919 19072 21908 26843 15302 1383 412 1610 -615
12030f15L965L840K707M431R47K205k788o788m650P052R160p65m913p401q983
12015b596L556l680N772J6477n295j310R36k121J486j407l715P091N161L859j0448
12000A3766r476M549j318K135l866n43k672J131l286m578j083J714L022n29J902
11985H68M77k194j973L602J334n933O45N149o690j099q80L765N921Q71l369L636
11969D130M72l062o475k911N898J0648L493l710q72l36J156K677K432l393l733
11954F414k188k11k830J744M449j735l76l655l600N566N245p024k218P03O9l299
11938b946j2312l652Q375N491Q277J0445p85j87k183N748J0602l539l914j4125
11924E295j619N104l484n259M870j53k463n886o501l175O176L113L975l28j2887
$$ plain form
12030 -615 3350 7190 9897 14328 15275 17480 14692 7904 3254 10306 19466 18701 13788 6387 -2596
12015 -2596 960 -2720 3052 19529 14234 12924 13860 11739 13225 11818 8103 15194 20355 24214 13766
12000 13766 4290 8839 7521 9656 5790 5247 2575 3706 420 -4158 -5241 -3527 -505 -1034 868
11985 868 1345 -849 -2822 780 2114 -3819 -3174 1975 -4715 -5814 -6694 -2929 2992 3863 494 4130
11969 4130 4602 1540 -4935 -7846 -1948 8700 12193 8483 7611 7275 8431 11108 13540 10147 6414
11954 6414 4226 4015 1185 2929 7378 5643 5267 1612 -1988 3578 8823 1799 -419 284 353 -2946
11938 -2946 -15258 -18910 -10535 -5044 3233 13678 12893 12706 10523 16271 26873 23334 19420 5295
11924 5295 3676 8780 5296 37 4907 4754 2291 -3595 -10096 -13271 -7095 -3982 -7 -335 -13222
11909a3222n371O610J253j98P711J5468P124m79q009j3813L136M632k738N867
11895G971j511L947P210l144j079j401j550K049K919o447j918k161J008j518k752
11880A623J0336M82k658n917q668m75k676j591k679k463J2588O669q63n425r761
11865a1478J860Q882l40m376J286M708M88K173J525l704o397j784M519L403j94
11850E71n052j294o686j831N803J208J3607k653j499J1143p925l117L005m787
11836D93J957l117K676N528o564K401R521l40q155m634j803n68N032N911k650
11821E688j180M200m574m31J128n17k142r519p69N55j648N8R74l164k093M843
11805h591n68J86L039j149j060J248o815k676J980M728m13R264P184o173m744
$$ plain form
11909 -13222 -18593 -11983 -10730 -10928 -3217 12251 19375 18896 10887 -2926 210 4842 2104 7971
11895 7971 6460 10407 17617 14473 13394 11993 10443 12492 15411 8964 7046 4885 5893 4375 1623
11880 1623 11959 12441 9783 3866 -4802 -5277 -7953 -9544 -12223 -14686 -2098 4571 3708 -1717 -11478
11865 -11478 -9618 -736 -1076 -5452 -4166 542 1030 3203 4728 1024 -5373 -7157 -2638 765 571
11850 571 -4481 -5775 -12461 -14292 -8489 -7281 6326 3673 2174 13317 5392 2275 5280 493
11836 493 2450 -667 2009 7537 973 3374 12895 12555 4400 -234 -2037 -2605 2427 8338 5688
11821 5688 4508 8708 4134 3703 4831 4314 2172 -7347 -8116 -7561 -9209 -9151 -8177 -11341 -13434 -8591
11805 -8591 -9159 -8973 -5934 -7083 -8143 -6895 -13710 -16386 -14406 -9678 -10091 -827 6357 184 -4560
11790d560K393M723L985M848J352j1023q068K827O113N334j58j675j285P20r87
11775D539j1172l065L047O883n147j916M102M190N398o932rm507N33J929j0618
11760a2745J291R143J301o963R93J911P10R57L466K994M823N581L908P093o13
11745B3850p940j3356m107K677m092J13M534R725N645j1761p392M157N20P33p774
11730d468r364M574N312N604J2612J739j0522M314o124j0784p316R294J0466n165
11716A72k7O111J806L134K183N1n53k423l856k803J678j2272r581J487L716J3273
11700B096k788L449N899r303n491k717R650l404o481K639k172K096N825r40P14
11685i28L667k743m576n581K339P167K030m913j250l127p934J1586P583l860o031
$$ plain form
11790 -4560 -2167 2556 6541 11389 12741 1718 -6350 -3523 2590 7924 7766 6091 4806 5526 4539
11775 4539 -6633 -9698 -6651 232 -4915 -6831 -2729 1461 6859 -73 -82 -4589 -4056 -2127 -12745
11760 -12745 -11454 -2311 -1010 -7973 -6980 -5069 -4359 -3402 64 3058 7881 13462 17370 24463 23850
11745 23850 15910 2554 -1553 1124 -2968 -2855 1679 11404 17049 5288 -2104 2053 2573 3306 -4468
11730 -4468 -13832 -9258 -3946 1658 14270 16009 5487 9801 3677 -7107 -14423 -5129 5337 172
11716 172 145 6256 8062 11196 13379 13430 12877 10454 6598 3795 5473 -6799 -16380 -14893 -11177 2096
11700 2096 -692 2757 8656 -647 -6138 -8855 795 -2609 -9090 -6451 -8623 -6527 -702 -1642 -928
11685 -928 2739 -4 -4580 -10161 -7822 -655 1375 -3538 -4788 -7915 -15849 -4263 3320 -540 -6571
11670f571N108Q475j029K236k860l414J1298r53j6822n158J514R139J361J190
11656C514j1958k102K982M982J2885L527p256Q21q567r21M378k748J032k026M720
11641C263M490q503m750M64J220k730k202L917k152K504R00j46O728O398L369
11626A2770l860n816l704m297j274Q13N622P982p144p992O483k238k644m298N489
11611d108Q224J657K94l469k77M829o006k386k182k57n210M958M149L317P865
11596A1398R471K148n353j2091o993M690K230L841J4248n229q066l777Q376L677
11582A8570O944j5912q687L526k89n620R83N826O772K85m95m874n390n53l234
11567b148m583l242j242m959J2181K685l487q547L280J4133K9838K6141O369j0622
$$ plain form
11670 -6571 -1463 7012 5983 8219 5359 1945 13243 12290 -4532 -9690 -8176 963 2324 3514
11656 3514 -8444 -10546 -7564 -2582 10303 13830 6574 7395 -1172 -2093 2285 -463 569 -1457 3263
11641 3263 7753 -750 -5500 -5036 -3816 -6546 -8748 -4831 -6983 -4479 -3579 -3725 3003 9401 12770
11626 12770 8910 3094 -610 -4907 -6181 -5368 254 8236 1092 -6900 -417 -2655 -5299 -9597 -4108
11611 -4108 4116 5773 6067 2598 2321 7150 1144 -1242 -3424 -3681 -8891 -3933 216 3533 11398
11596 11398 20869 23017 17664 5573 -1420 3270 5500 9341 23589 18360 10294 6517 14893 18570
11582 18570 25514 9602 915 4441 4152 -1468 -485 5341 12113 12398 11903 7029 1639 1086 -2148
11567 -2148 -6731 -9973 -11215 -16174 -3993 -1308 -4795 -13342 -10062 4071 33909 60050 66419 55797
11553E5797k0566k2430j8037j1707j175l580k265M569J1787J2395J48o433n848
11540g345n18J992N208m717J494R757n097p731P712l41j461N838k766r399M734
11525b640J316N274M475j531q440j27L329r78j4444J900R007Q575J348j050k463
11510C551j1454k735K33N309M32j973N99L243R841k44q190L012P38M876k97r36
11494F005J375K054M984l739o746q613m827K391R107O77K453n413m861M206m19
11479a366J366n449q070m078J310R275J3537K159j1136o034L784n424k556l404
11465a6086Q675J1582K727p149l783P44K777M818j1777j656J861n323m8L675J195
11450g768K334j678M156k386q702k513M276R754J2992k961j1787q309k652O367
$$ plain form
11553 55797 35231 12801 -5236 -16943 -18118 -21698 -23963 -19394 -7607 4788 4936 -1497 -7345
11540 -7345 -7863 -5871 -663 -5380 -3886 5871 774 -6957 755 414 -1047 4791 2025 -7374 -2640
11525 -2640 -1324 3950 8425 6894 -1546 -1673 1656 678 -13766 -11866 -2859 5716 7064 6014 3551
11510 3551 -7903 -10638 -10405 -5096 -4664 -6637 -6038 -2795 7046 6802 -1388 1624 2362 7238 6941 6005
11494 6005 7380 9434 14418 10679 3933 -4680 -9507 -7116 1991 2668 5121 -292 -5153 -947 -1366
11479 -1366 0 -5449 -13519 -17597 -16287 -7012 6525 8684 -2452 -8486 -4702 -10126 -12682 -16086
11465 -16086 -7411 4171 6898 -251 -4034 -3290 -513 4305 -7472 -9128 -7267 -12590 -12638 -8963 -7768
11450 -7768 -5434 -7112 -2956 -5342 -14044 -16557 -12281 -2527 10465 7504 -4283 -12592 -15244 -8877
11436h877O790k814N368M642M678j1406q798N903j748L104l341o722j798P516
11422g503R446q264o141O6Q142k17o24q93p407K377P877K426o526O582J715L433
11406D489L140K832l365m210L376N66k90l420j808j3154l161N404L837l689n682
11391a5135o064N932M035N52r674l970K038K4994J0830j380j1295o236Q999n623
11377a997p805L992M469N603j0634j4662N035O714K27j060P243J833l190m41l736
11362h409j208J784n871o373L005M319m055k765O195P975k932o393j578J3354
11348b952p92m026o10O41O067L767O667J1783l64o694j5866L455L995k183p744
11333d856n417l7M022N314n875L157M40m776L66L824L331m229O863N01k112k180
$$ plain form
11436 -8877 -2087 -4901 467 5109 9787 -1619 -10417 -4514 -6262 -3158 -6499 -13221 -15019 -7503
11422 -7503 1943 -6321 -12462 -12396 -4254 -4471 -5095 -5988 -13395 -11018 -3141 -715 -7241 -659 1056 4489
11406 4489 7629 10461 7096 2886 6262 6828 6538 3118 1310 -11844 -15005 -9601 -5764 -9453 -15135
11391 -15135 -21199 -15267 -11232 -10680 -20354 -24324 -22286 2708 13538 12158 863 -5373 3626 -1997
11377 -1997 -9802 -5810 -1341 4262 -6372 -21034 -15999 -9285 -9058 -10118 -2875 -1042 -4232 -4673 -8409
11362 -8409 -9617 -7833 -13704 -20077 -17072 -12753 -16808 -19573 -13378 -5403 -8335 -14728 -16306 -2952
11348 -2952 -3744 -7770 -8380 -7739 -1672 2095 8762 20545 20181 13487 -2379 1076 5071 2888 -4856
11333 -4856 -10273 -10310 -6288 -974 -6849 -3692 -3252 -8028 -7662 -3838 -507 -4736 2127 2628 516 -1664
11317a664K008l461q926j1103M061P65N119L341J579N127O176J0024p537j356
11303D153l049j3359k853k90P784Q71N790J0108l233l290l992O886Q867o219j2630
11288d456j0826n08O340O904Q926N85J109o893k858m71N895O546K889k027q664
11273B491j0787P503N341k422j115j415m486L036O280n197q530j952o575J3455
11259d373N75M580P269k797L017L992j019L246m506k170l046m455l967R716l734
11244B328q431l023Q58Q870M012J318K976l520M333N662J127L468j0437n267L873
11229H147l287n399j540O112R548N811q123n707j1570N667p182o653Q285R193
11215C302r51p798K97J4642J119m627m46J54j27j752Q67q259q728L066M094l536
$$ plain form
11317 -1664 344 -3117 -12043 -23146 -19085 -18320 -13201 -9860 -8281 -3154 3022 13046 5509 4153
11303 4153 1104 -12255 -15108 -15398 -7614 -6743 -953 9155 5922 2632 -1360 5526 14393 8174 -4456
11288 -4456 -15282 -15790 -9450 -2546 6380 6965 8074 1181 -1677 -2148 3747 10293 13182 11155 2491
11273 2491 -8296 -793 4548 2126 1011 -404 -4890 -1854 4426 -771 -9301 -11253 -17828 -4373
11259 -4373 -3798 782 8051 5254 8271 12263 11244 14490 9984 7814 4768 313 -3654 6062 2328
11244 2328 -6103 -9126 -8268 602 4614 5932 8908 5388 9721 15383 16510 19978 9541 4274 8147
11229 8147 4860 -539 -2079 4033 13581 19392 11269 5562 -6008 -341 -7523 -14176 -5891 3302
11215 3302 2351 -5447 -5150 9492 10611 5984 5538 5692 5565 3813 4680 -3579 -12307 -9241 -5147 -8683
11199h683R682K495j2137o416J844n27M003J0645Q432N414m629p600J1638O591
11185B0752j3615j1971l802Q725J0685n68J100l686j252M634o424R988J329k17
11171A5678l592r329m4n08n178j1329Q133n44M43K502n575L915L451l096n533
11156a0606n99L125N563K95M71l316K43q97J733J813l64l98R038M511K772j1443
11140A941N32P483L058M48r266l186m095l769O932o3o064N57J1631P435k664n798
11124E112j430M135k862m076K312j788J1423R126j506n402j980q022j722n737
11110b417M687P866k150m256m568j492O876K161j0890p364N573J1063j149j104
11096B836j914n309j273L927o187O44M157M143n68K479m883Q841k08m529j547
$$ plain form
11199 -8683 999 3494 -8643 -15059 -13215 -13742 -9739 906 9338 14752 10123 2523 14161 20752
11185 20752 7137 -4834 -8636 89 10774 10206 11306 7620 6368 11002 4578 14566 15895 15678
11171 15678 12086 2757 2713 2205 -2973 -14302 -6169 -6713 -6270 -3768 -9343 -5428 -1977 -5073 -10606
11156 -10606 -11205 -8080 -2517 -2222 -1751 -5067 -4824 -5721 -3988 -2175 -2539 -2937 6101 10612 13384 1941
11140 1941 2473 9956 13014 13462 4196 1010 -3085 -6854 78 15 -6049 -5492 6139 13574 10910 5112
11124 5112 3682 7817 4955 879 3191 1403 12826 21952 20446 15044 13064 5042 3320 -2417
11110 -2417 2270 10136 7986 3730 -838 -2330 4546 6707 -4183 -11547 -5974 5089 3940 2836
11096 2836 922 -4387 -5660 -1733 -7920 -7276 -3119 1024 456 2935 -1948 6893 6685 2156 609
11081F09k014q350K891M289n964M304P833o6j1861m637J2518M154k246p825K264
11066d101K440j434m624r784Q753J1413M923l204L126m579L278m817l225o93N921
11051C393L916p159K608q21L611k926l610n122j02J0671K195L736m94r743M597
11036D750j220n384K722M47Q900j167m793j072J729P990N581r022m366K392K408
11021I895k501j1624L80l814p79m780k693p882M058Q204Q424J5343K404k646l102
11006H887j2847k873R350j843p07J628j412j053J0015K084J105l785r775l042
10992d268J4j168p29J918L267l366q035Q374P627q945K654J378M401N139l119
10977E142J284q537p442N054k593p00O03r462j389P038m047J928P829J143l996
$$ plain form
11081 609 -1405 -9755 -6864 -2575 -8539 -4235 3598 3532 -8329 -12966 -448 3706 1460 -6365 -4101
11066 -4101 -1661 -3095 -7719 -17503 -8750 2663 7586 4382 7508 2929 6207 1390 -1835 -2528 3393
11051 3393 7309 150 2758 1937 5548 2622 -988 -6110 -6212 4459 6654 10390 9896 153 4750
11036 4750 3530 -1854 868 1315 10215 9048 4255 3183 4912 12902 18483 9461 5095 7487 9895
11021 9895 7394 -4230 -3850 -7664 -8443 -13223 -15916 -23798 -19740 -11536 -3112 12231 14635 11989 8887
11006 8887 -3960 -6833 2517 674 -33 1595 183 -870 9145 11229 12334 8549 -1226 -4268
10992 -4268 -4254 -5422 -6151 -4233 -966 -4332 -12367 -3993 3634 -5311 -2657 -1279 3122 8261 5142
10977 5142 6426 -2111 -9553 -4499 -7092 -7792 -7189 -16651 -18040 -11002 -15049 -13121 -5292 -4149 -8145
10962h145q562N910O070N29j724Q109P73J3805k987j1107k554M025q48r019O346
10947F21J290p309n410P876P863q19L67r244k003J903O739J172lm569n131J973
10931d684L481M461l627K231J1722o739q167p226l706J0748P901k338l284r490
10917h717j4723K971O088O384J225j78J949L853m268l963N127P482n524q818L070
10902h042M225R866j0167j0484N928l229P434J2669n704J138Q37P401n894n634
10888C44O22l874j856k248N446J0229N887r006q132q229K875K967J0471J0112
10874A5608R56o480m431j956Q60n109K416Qo64M574R81n151o904o633k978N169
10858i734m168m129P503N116K489N352J5959p97Q739k052m882L145p137j0056
$$ plain form
10962 -8145 -16707 -10797 -4727 -4198 -5922 2187 2960 16765 13778 2671 117 4142 3294 -5725 621
10947 621 1911 -5398 -10808 -2932 4931 4112 4479 -4765 -6768 -4865 1874 3046 3043 -1526 -6657 -4684
10931 -4684 -1203 3258 -369 1862 13584 6845 -1322 -8548 -12254 -1506 6395 4057 773 -8717
10917 -8717 -23440 -20469 -14381 -7997 -6772 -6950 -5001 -1148 -5416 -9379 -4252 3230 -2294 -11112 -8042
10902 -8042 -3817 6049 -4118 -14602 -8674 -11903 -4469 8200 2496 3634 4471 11872 5978 344
10888 344 966 -2908 -4764 -7012 -1566 8663 14550 5544 -2588 -10817 -7942 -4975 5496 15608
10874 15608 16564 10084 5653 3697 4557 -552 1864 1872 1208 5782 6763 1612 -5292 -11925 -14903 -9734
10858 -9734 -13902 -18031 -10528 -5412 -2923 2429 18388 17591 26330 24278 19396 22541 15404 5348
10844E348k045j2016L373o49j624k394J505J2598j161m256P797O505J730l736
10830A0975J537j0901m930L128J1099m966o230r283o504q53M836L286k01K693
10816f314k899o238P379L623M074n898N671J665L71j454K78L533k927M868n413
10801C19q946Q205P17k664J591m428q32m683K954j160K134N349N263k54M208n333
10785B440J440Q01o537j02L353J993j67n621K235k718J58m360m308j523K008k655
10769a3563M247J2878j852l592m325p577L705J3047J6535j74j6404j8813p426
10756b3314P971J1149J016m08m183N245M799L839k030l045N151K949M316O429
10742A9884qM65r969p404P117k170l268m790K889J1938j388j418Jq634j176o798
$$ plain form
10844 5348 3303 -8713 -5340 -5989 -7613 -10007 -8502 4096 2935 -1321 6476 12981 14711 10975
10830 10975 12512 1611 -3319 -191 10908 5942 -288 -9571 -16075 -16928 -12092 -8806 -9007 -6314
10816 -6314 -9213 -15451 -8072 -4449 -375 -6273 -602 1063 1434 -20 258 3791 864 5732 319
10801 319 -8627 -422 295 -2369 -778 -5206 -6038 -10721 -7767 -8927 -6793 -1444 3819 3565 7773 2440
10785 2440 3880 4681 -1856 -1958 1395 3388 3221 -2400 -165 -2883 -2725 -7085 -11393 -12916 -10908 -13563
10769 -13563 -9316 3562 1710 -1882 -6207 -13784 -10079 2968 19503 19329 2925 -15888 -23314
10756 -23314 -15343 -4194 -3178 -3586 -7769 -2524 2275 6114 4084 1039 6190 9139 13455 19884
10742 19884 19876 20341 10372 2968 10085 7915 4647 -143 2746 14684 13296 11878 11879 3245 2069 -4729
10726d729j2042m535Q800L456J984J242o81J39r45j104R381l888o540m563J508
10711a2517J1803J5259l373j3801k420o78P873Q112p823J0527M392o434R61J1409
10697B3290P47n955j1163r020n496J30M266L192k482n980l91o272L004J932N528
10682d670k52n1m650J918Q548R13R60j5K112p635N264K562j792j1486m765K632
10666a0407M338N557Q91L765n357j772n99M831k522j747p983m477O697J4419Q996
10651A4630m303k505M843K274j4939k077N322J1259R96o069l658n29P228k786
10637I686p813p006Q569J3055m939j2086j0180J58Q178R272N310O199K006q063
10623A2346m156p049q864l001J808O681L153o1j42K18m413O60m16j122k278M028
$$ plain form
10726 -4729 -16771 -21306 -12506 -9050 -7066 -5824 -6505 -6366 -7311 -8415 966 -2922 -9462 -14025 -12517
10711 -12517 -714 14545 11172 -2629 -5049 -5727 2146 10258 2435 12962 17354 10920 11881 23290
10697 23290 24037 18082 6919 -2101 -7597 -7467 -3201 -9 -2491 -8471 -8862 -15134 -12130 -10198 -4670
10682 -4670 -4922 -4973 -9623 -7705 843 1756 2716 2701 4813 -2822 2442 5004 3212 -8274 -13039 -10407
10666 -10407 -6069 -512 379 4144 -1213 -2985 -3584 1247 -1275 -3022 -11005 -15482 -8785 5634 14630
10651 14630 10327 7822 12665 14939 0 -2077 3245 14504 15500 9431 5773 5244 12472 9686
10637 9686 1873 -5133 3436 16491 11552 -534 -10714 -10556 -2378 6894 12204 18403 20409 12346
10623 12346 8190 1141 -7723 -10724 -8916 -2235 918 857 715 933 -3480 -2820 -3236 -4358 -6636 -2608
10607b608J940j681q750M801M094J817O922p956n501K595L364K847j636l420N586
10592B414m172P530J865K347n752j465k465q843J0281q89k53L489O151q783j1817
10577a0362L113L97J0564o09m938j197P66J705j131K27j1670k17J2516O87l527
10562c676N720J646n388n427r0J580J1984m996L911K019k821k772M23j694M871
10547E290M344j003j781k119l268j873L806n079j075K555n612K840N523o663o60
10532d775R014R861j500o732p95o042k894Q039Q408L341o070p942n746P440J4221
10517A7828O102r4l643L079o92o05k730j358N93K529o268M785n705q491n09O755
10501A1576J000o495o465j60M120J5722K957n037r916n589p9R643N189Q328j1317
$$ plain form
10607 -2608 -668 -2349 -11099 -6298 -2204 -387 6535 -1421 -6922 -4327 -963 1884 248 -3172 2414
10592 2414 -1758 5772 7637 9984 4232 2767 302 -8541 1740 851 598 4087 10238 1455 -10362
10577 -10362 -7249 -6852 3712 3103 -1835 -3032 -2266 -561 -1692 -1465 -13135 -13352 -836 -149 -3676
10562 -3676 2044 3690 -1698 -7125 -7215 -5635 6349 1353 5264 7283 4462 1690 2113 419 5290
10547 5290 9634 8631 6850 4731 1463 -410 3396 -1683 -2758 -203 -5815 -2975 2548 -4115 -4775
10532 -4775 4239 14100 12600 5868 5073 -969 -3863 4176 12584 15925 9855 1913 -3833 3607 17828
10517 17828 23930 23836 20193 23272 22580 21975 19245 17887 18480 21009 14741 19526 13821 5330 4821 11576
10501 11576 12576 6081 -384 -544 3576 19298 22255 17218 7302 1713 1634 11277 16466 24794 13477
10486A3477o927k339K739L306p780j889n472p914L726Q478J660J0405p822l243
10472D05o023j0388j047M247R564P967P605j386N624L19k703j791l323n711J626
10457D985J17N147p31m799P542J735Q75p895O747P135m635o145k32O833j2J546
10441A8213n594k97L240L06L151r872r88M131M664n259j548j0675N60P130O580
10426A3742k364j254q113q19M17K869O581o341j861L820k659j521l031j81J327
10411F12m545K587J3608R428M740j6105j7081m593J1143K0288r994r669M544L847
10397H810j2371j614Q858J158J124k473l036k935M751K101l148k817J0097R032
10383A7537p018j916l467k47R062o209m219N287j0370q475R252J0522o387j081
$$ plain form
10486 13477 6550 4211 6950 10256 2476 587 -4885 -12799 -9073 -595 1065 11470 3648 405
10472 405 -5618 -16006 -17053 -12806 -3242 4725 12330 10944 16568 16887 14184 12393 9070 3359 4985
10457 4985 5102 10249 9518 4719 12261 13996 14871 6976 13723 20858 16223 10078 9846 16679 16667 18213
10441 18213 12619 12322 15562 15868 19019 9147 8159 12290 16954 11695 10147 -528 32 7162 13742
10426 13742 11378 10124 2011 1192 1609 4478 11059 4718 2857 6677 4018 2497 -534 -715 612
10411 612 -3933 -1346 12262 21690 26430 10325 -6756 -11349 -206 20082 10088 419 4963 8810
10397 8810 -3561 -5175 3683 4841 5965 3492 456 -2479 2272 4373 1225 -1592 8505 17537
10383 17537 10519 8603 5136 4889 13951 7742 3523 8810 -1560 -10035 -783 9739 3352 2271
10369B271L133N099l119n181m265M991k265M691J3803P861l63L65o948r042n953
10354E078J054l89J1535K288Q545q97O371J0090N714j0623m602m307r932n56K056
10339B1425P040O151k694o077m322P809J194J002l409j0258j081k411Q87Q883
10325B4139L708o108p134R11k988l055N658p210j0514l700Q926P310J918m027
10311G834M518Q77k654L573p00M959J47N657K028N010l429j1584n794P00m925
10296F217n948M325q8l055j39n344O391l895k079N686Q788m74M646l91O281J269
10280B2190n955m356J163m830m828J0967L175k429J732n33M700L300k010K757
10266B5043k396q592L650J3550J4050L559j4055p117l536j855j760L119N392p611
$$ plain form
10369 2271 5404 10503 7384 2203 -2062 2929 664 5355 19158 27019 26656 27021 20073 11031 5078
10354 5078 6132 5743 17278 19566 28111 27214 33585 43675 49389 38766 34164 29857 19925 19369 21425
10339 21425 28465 34616 31922 25845 21523 29332 30526 31528 28119 17861 16780 14369 15256 24139
10325 24139 27847 21739 14605 15516 12528 9473 15131 7921 -2593 -6293 2633 9943 11861 7834
10311 7834 12352 13229 10575 14148 13448 18407 18554 24211 26239 31249 27820 16236 10442 11142 6217
10296 6217 269 4594 4506 1451 1312 -4032 2359 -1536 -3615 2071 10859 10385 15031 14640 20921 22190
10280 22190 16235 11879 13042 8212 3384 14351 17526 15097 16829 16296 20996 24296 22286 25043
10266 25043 22647 14055 17705 31255 45305 48864 34809 27692 24156 22301 20541 23660 29052 21441
10252B1441j0148l058N045L766N470L924O385L236o32K705l32Q252j736l651j712
10237C8955q797k54M06m30M308n868K561r321m287Q367J889j910m340o199O181
10222B1261J2020l12q244J971M128r159o806q563L853J3214j261J36m7n636p003
10207I552K269o271p965N372k765N45J938m488o224M001R503L222k297k093O784
10192A1083L412k058J083q01R91Q076q676q565k1J561P141L011L063j282K891
10177B0909o084K38j632P193j066p633O55N007J482K428l003j330Q565P877q768
10162B4838K85J5591j047o787j6954Q89R22O843R995m408j2147L007j01j806l96
10147A8724r76J364P286O41L799K140m276m058r04O603q126j583P026k575j4395
$$ plain form
10252 21441 11293 8235 13280 17046 22516 26440 32825 36061 35429 38134 37802 46054 44318 40667 38955
10237 38955 30158 29904 30310 29880 34188 28320 30881 21560 17273 25640 27529 25619 21279 15080 21261
10222 21261 33281 32969 24725 26696 30824 21665 14859 6296 10149 23363 22102 22238 22191 16555 9552
10207 9552 11821 5550 -2415 2957 192 737 2675 -1813 -8037 -4036 5467 8689 6392 4299 11083
10192 11083 14495 12437 13520 12719 13710 21786 13110 4545 4524 6085 13226 16237 19300 18018 20909
10177 20909 14825 15063 13431 20624 19558 11925 12580 17587 19069 21497 18494 17164 25729 33606 24838
10162 24838 25123 40714 39667 32880 15926 16815 17737 24580 34575 30167 18020 21027 20926 19120 18724
10147 18724 17748 19112 26398 27039 30838 32978 28702 24644 23740 30343 22217 20634 27660 25085 10690
10132A0690o015R085N403P142N547l904P29o82L852J985j417q976j7698J0794
10118A6535P245k082K201O302J94j430M962N971j951k229J265r356n111P386L110
10103C3012m9j735p194j935N03j275Q913J828k6m866q145m226r546j3202J988
10088e955k803J770J5139J9118M489n915J000M364k903p263l038r343m902L203
10074F961P412R980O827M339L404o12J368j223m270P34o736j125N861K224n392
10059B9752M94k955n457K608O529L488M021n609l64Q777l72L802j3642j36N046
10044C5982J358l761k170J0031P202O36J524M928l11m518m969k40m770m339L314
10029C9897N902O072J586J0844K288j552n683j1750k839M698L112p513Q999N161
$$ plain form
10132 10690 4675 13760 19163 26305 31852 27948 28677 27995 31847 33832 32415 23439 5741 16535
10118 16535 23780 21698 23899 30201 30395 28965 33927 39898 37947 35718 36983 27627 22516 29902 33012
10103 33012 32963 31228 24034 22099 22602 21327 30240 32068 32042 27176 19031 14805 5259 -7943 -5955
10088 -5955 -8758 -6988 8151 27269 31758 25843 26843 31207 28304 21041 18003 8660 3758 6961
10074 6961 14373 24353 31180 35519 38923 38311 39679 38456 34186 34920 28184 27059 32920 35144 29752
10059 29752 30246 27291 21834 24442 30971 34459 38480 32871 32507 41284 40912 44714 31072 30936 35982
10044 35982 37340 33579 31409 41440 48642 49278 50802 55730 55419 50901 45932 45692 40922 36583 39897
10029 39897 45799 51871 53457 64301 66589 65037 59354 47604 44765 49463 52575 45062 54061 59222
10015E9222k841m673m701O258j110k531j439J1359m30l777K274p733n210j126
10001D3542L588m61Q648O481P832k913o347k388m723l507J649n133J654P980m889
9986E1013l501J65l898j465R082J1742J578m032o923J0228J618p582r95k371j26
9971E4533P684M951j0334l697N982J228m281J765l148R554N712P26R610L712o425
9956G7572n905O16J4753J4088O240j590n821o586l590j53p642p131J0074K3008
9942A07933K4969K6758K3565J5322j8560k9275j1091j3753j2091k0088j117N132
9930I7704P410m254q029m085r045m589P253R026L951n368j612k323k477j110Q282
9915I0734m042q530M017K1k679K009M025L111M8P023J900K580m332m298P22P832
$$ plain form
10015 59222 56381 51708 47007 53265 52155 49624 48185 59544 59114 55337 57611 49878 44668 43542
10001 43542 47130 46669 55317 61798 69630 66717 60370 57982 53259 49752 51401 46268 47922 55902 51013
9986 51013 47512 47677 43779 42314 51396 63138 64716 60684 53761 63989 65607 58025 57030 54659 54533
9971 54533 62217 67168 56834 53137 59119 60347 56066 57831 54683 64237 69949 70675 80285 83997 77572
9956 77572 71667 72283 87036 101124 107364 105774 99953 93367 89777 89624 81982 74851 84925 107933
9942 107933 132902 159660 183225 198547 179987 150712 139621 125868 113777 93689 92572 97704
9930 97704 105114 100860 92831 88746 79701 75112 82365 91391 95342 89974 88362 86039 83562 82452 90734
9915 90734 86692 78162 82179 82200 79521 81530 85555 88666 88714 95737 97637 100217 95885 91587 92309 100141
9899A00141p774K832O163N739L118Q789O592j0353n154K661L547j371M945q905
9885A10970j0715r654K244J926N50M647J2850J1132K768j5056j0970j945K329
9872A01076J0649J7403L769k092J818l480l446L42j602R38M552K0783J1514P678
9858A69902J8203K7719L9237Q7406J46199J86179J29271j3301r6864j04279j07062
9847D82610r7936p8667m4744k4343k2928k3043j7318n457j878r436J2l861o529
9834A46482j1825m39J4763J0575k276M571k437q591J981J025j0046j527M860j849
9820A45267J315J0673M270n98k910j481P744k654J0922L597j0745j1904L621L864
9806A60981P331Q406r849j668J478L820j453j0808n548P124O776M772l786j72
$$ plain form
9899 100141 92367 95199 101362 107101 110219 119008 125600 115247 110093 112754 116301 114930 119875 110970
9885 110970 100255 90601 92845 94771 95321 99968 112818 123950 126718 111662 100692 98747 101076
9872 101076 111725 129128 132897 130805 132623 129143 125697 126039 124437 125375 129927 150710 162224 169902
9858 169902 188105 215824 255061 342467 488666 674845 804116 790815 693951 589672 482610
9847 482610 384674 306007 261263 236920 213992 190949 173631 168174 166296 156860 156872 153011 146482
9834 146482 134657 134218 148981 159556 157280 161851 159414 150823 152804 153829 143783 142256 147116 145267
9820 145267 146582 157255 161525 160927 158017 156536 164280 161626 172548 176145 165400 153496 157117 160981
9806 160981 168312 176718 166869 165201 166679 170499 169046 158238 152690 159814 166590 171362 167576 167404
9792A67404l906k370J282l211p049k111K069L686j706K525K712Q397N62k569n674
9777A60041P320n32j3518L510P031P324R589L15p613j1270J005n67r699k245K386
9762A53077L347J711j379j730j136J2818L113M435K434p928p723L266L389M666
9748A72360N889m049p523o791k426l028j693M338P086M402J413J308j0160j0639
9734A50487k544P346J4089P171j1930j5855m331L398p65l612R135Q329o233j1687
9720A42998k285J761N752J0135J696J69q858p882L271Q909J000M23n427L662N491
9705A60815o010m613L114J814Q732p725p962q103Q629J505K459m666r554M194
9691A42629o424O575Q467n404k148j724Q09n227r806J32O469J033j0478r14N525
$$ plain form
9792 167404 163498 161128 162410 159199 152150 150039 152108 155794 154088 156613 159325 167722 168284 165715 160041
9777 160041 167361 166829 153311 156821 163852 171176 180765 181080 173467 162197 163202 162635 152936 150691 153077
9762 153077 156424 158135 156756 155026 153890 166708 169821 174256 176690 168762 161039 164305 167694 172360
9748 172360 178249 174200 166677 159886 157460 154432 152739 157077 164163 168565 169978 171286 161126 150487
9734 150487 147943 155289 169378 176549 164619 148764 144433 147831 147066 143454 152589 160918 154685 142998
9720 142998 140713 142474 148226 158361 160057 160226 151368 143486 146757 155666 156666 157089 151662 155324 160815
9705 160815 154805 150192 153306 155120 163852 156127 148165 140062 148691 150196 152655 147989 138435 142629
9691 142629 136205 142780 151247 145843 143695 141971 142780 137553 127747 127879 134348 135381 124903 123989 129514
9676A29514k377n1Kl234M148k935n09n892l481O085N118k79K523K303M762J284
9660A36981j0130j2141l814J2671L667l623n249o325j772j2374r083J8606N269
9647A12683j805k287o580o947k05J2771K624j7642l668O586P966N86j1006l15
9633I2761k342k767M289k050L97k30j61M42O82k682q888N226N741j337N466L896
9617I8443K701m332j1206j0504M81n952m52o1L572O603N420J332L701R126o452
9602I2420j1639L257J411K29m717o347j04o149Q186N901k807M350l547K002k796
9587G9650j4675l313K144M726L072m128m511N39l435L939J046o62k315n200K105
9572E8982n824j2199N904J0936J4165m88m588K484M811M96j018J367M559L344
$$ plain form
9676 129514 127137 127086 127088 123854 128002 125067 124558 118666 115185 121270 126388 126109 128632 130935 135697 136981
9660 136981 126851 114710 110896 123567 127234 123611 118362 112037 110265 97891 88808 107414 112683
9647 112683 110878 108591 102011 95064 94859 107630 110254 92612 88944 95530 103496 104082 93076 92761
9633 92761 90419 87652 91941 89891 90288 90058 89897 90339 91021 88339 79451 84677 90418 89081 94547 98443
9617 98443 101144 96812 85606 75102 75583 69631 69179 69118 72690 79293 84713 86045 89746 98872 92420
9602 92420 80781 84038 85449 85678 80961 74614 74510 68361 76547 82448 79641 83991 80444 82446 79650
9587 79650 64975 61662 63806 68532 71604 67476 62965 63504 60069 64008 65054 64392 62077 56877 58982
9572 58982 53158 40959 46863 57799 71964 71476 66888 69372 74183 74679 73661 75028 79587 82931
9558H2931n014o240n009N950j91N47q083l673l409K188k227m463k966P958Q722
9543F7021N648m140m431O85k929K137O31n393L196n421n258L025Q35m257l872
9528D7477k41j481r439J2303N057J112J047j124j629P054L08j0512j111Q007J0197
9513F7025p200q707J720N470R54J256p99o104o367l911J462p032L273N513O707
9498E3260j817j5728K47J0088R179J0375o625p067q335n809j206K453k249K391
9484C9157n568n466O249N793L68K123m762L667j281J845J643m420J910O9k499
9469C8828J165q10j38m974r62J782r60L251M098l939p015n349O704O569n536R44
9453C3658m038m721r58K428M742J0365N647j0073l380L110J0944Q564p498k740
$$ plain form
9558 82931 77917 71677 66668 72618 72427 72974 64891 61218 57809 59997 57770 53307 50341 58299 67021
9543 67021 72669 68529 64098 64783 61854 63991 64622 59229 62425 57004 51746 54771 55606 51349 47477
9528 47477 47236 45755 36316 48619 53676 54788 55835 54711 53082 60136 60444 49932 48821 56828 67025
9513 67025 59825 51118 52838 58308 59262 60518 59719 53615 47248 43337 44799 37767 41040 46553 53260
9498 53260 51443 35715 35962 46050 55229 65604 58979 51912 43577 37768 36562 39015 36766 39157
9484 39157 33589 28123 34372 40165 40533 42656 37894 41561 40280 42125 43768 39348 41258 41327 38828
9469 38828 39993 39183 39045 34071 33109 34891 33931 37182 41280 37341 30326 24977 31681 38250 32714 33658
9453 33658 29620 24899 23941 26369 31111 41476 47123 37050 33670 36780 47724 56288 48790 46050
9439D6050j1055M380O336J220m489K778K66L809O2l899r109n724o426J850P497
9424C3546l302l892L288L293n379K151J433p329j244l099N887J1060j434p687
9410B7292l229M93O189m072m03J2593j730l819l530L350M646k049J05p45M272
9395C9363r164k018P517J179k115J5179n459j2416k616K35l51J965j126p535q544
9380A4094J625N562R340P840j569m473m251n690n033k12K293J0956L372M227Q689
9365D6770k380n038p885q695k354J742j724R395K277l104R11L240k841L971P936
9350D2221j332J736p787n194L662J613k185j373L093k371p9j1379M234J3985K242
9335D1086j0282P141P790k182m724M546P960K64j494n168j506n583O475R838M324
$$ plain form
9439 46050 34995 39375 45711 46931 42442 45220 45486 49295 49357 45458 36349 30625 24199 26049 33546
9424 33546 30244 26352 29640 32933 27554 29705 31138 23809 22565 19466 25353 36413 34979 27292
9410 27292 24063 24556 30745 26673 26270 38863 37133 33314 29784 33134 37780 35731 35836 35091 39363
9395 39363 30199 28181 35698 36877 34762 49941 44482 32066 29450 29685 29334 31299 30173 22638 14094
9380 14094 15719 21281 30621 38461 36892 32419 28168 22478 17445 17233 19526 30482 33854 38081 46770
9365 46770 44390 39352 31467 22772 20418 22160 20436 29831 32108 29004 29915 33155 30314 34285 42221
9350 42221 40889 42625 34838 29644 33306 34919 32734 31361 34454 32083 32004 20625 24859 38844 41086
9335 41086 30804 37945 45735 43553 38829 43375 51335 51599 50105 44937 43431 37848 44323 54161 58485
9320E8485j4641j5154p796O266P872k119K442Q152q476l63R87o707k19m701J3741
9305C7769M813K069O154r907r843m341j389J162l184J023J1832K898p041N75K333
9290C4923J812N768m627n749M584J959n447q227k666K629j796p516K078p034r52
9275I739K351J0669O948m448m844O810j173k006k492m305l737R245K463o554O34
9260A9300J8935N224M13J697K273l744r885r010j2461k06L259O596L778K75J481
9245B7925o766k898L229l71R99M062m825n548J621K042j289Q315Q227o23j1043
9230B3057j0830N220J3694J177l190p541n503M39J623N613n106j0017J1828R827
9216C0291k872j0443L702m584q947M476M868M132Q26l888M083L775p86o372p727
$$ plain form
9320 58485 43844 28690 20894 27160 35032 32913 35355 43507 35031 34668 35655 28948 28729 24028 37769
9305 37769 42582 44651 50805 40898 31055 26714 25325 26487 23303 24326 36158 39056 32015 32590 34923
9290 34923 36735 42503 37876 32127 36711 38670 33223 24996 22330 24959 23163 15647 17725 10691 9739
9275 9739 12090 22759 29707 25259 20415 27225 26052 24046 21554 17249 13512 22757 25220 18666 19300
9260 19300 38235 43459 43872 45569 47842 44098 34213 25203 12742 12536 15795 22391 26169 26444 27925
9245 27925 21159 18261 21490 21119 22118 26180 21355 15807 17428 19470 18181 26496 34723 34100 23057
9230 23057 12227 17447 31141 32318 29128 21587 16084 16523 18146 23759 18653 8636 20464 30291
9216 30291 27419 16976 20678 16094 7147 11623 16491 20623 21449 17561 21644 25419 24633 18261 10534
9201A0534L839N98l099r334J0136J9135L272j004j2949p138l782M555K651Q9m597
9186A2906j96O236k495L74l401L116J0139M529l994p74N266j594j3582Q669R404
9171C4603M063l972J073j605l191o096k613m415K359Q697O737p284o135m208m120
9156A3893j002o27K831N407N203K853K846k557n724l651j39M009K408L018o262
9141B2506o914N63K0196J1420N091m804o655q082p214M105J562O657o430m763
9127B7238j523J906N526L583l252n741j145K585j6260J6k744L608J333k545L157
9112A5742q09L410O694k861l584m052Q835N937n970j338L143Q960J4974o33k613
9097D5835k69n106R921j601J270L861r362k830p932n993k052K001M998J006l722
$$ plain form
9201 10534 14373 14971 11872 2538 12674 31809 35081 34077 21128 13990 10208 14763 17414 17503 12906
9186 12906 12710 18946 16451 16825 13424 16540 26679 31208 27214 26440 31706 30112 16530 25199 34603
9171 34603 38666 34694 35767 34162 30971 24875 22262 17847 20206 28903 35640 28356 22221 18013 13893
9156 13893 12891 12264 15095 20502 25705 28558 31404 28847 23123 19472 19333 23342 25750 28768 22506
9141 22506 15592 16155 36351 47771 52862 48058 41403 33321 26107 30212 31774 38431 32001 27238
9127 27238 25715 27621 33147 36730 33478 27737 26592 29177 12917 12933 10189 13797 15130 12585 15742
9112 15742 14933 18343 25037 22176 18592 14540 23375 29312 23342 22004 25147 34107 49081 48448 45835
9097 45835 45566 40460 50381 48780 50050 53911 44549 41719 33787 27794 25742 27743 32741 33747 30025
9082C0025k369O504m905k90p263p060m283l421K031K263L446K238L261L481l726
9067A9932j0794K944M295k310N876k914n549J0527J2282J8847O378J1928J362
9054G2804o440o90q044o609K408J057j0916k968O333j046j865n319j0446p605
9040B0654N284M181K23L126m963m690O042p400j681K751j076n615k664N771m5
9025A9898M103N45j885j951P91M308K283M865M649l35n489L632j715o011p088
9010B0600M275P721j635m280k007j59P943K800P053l608O180l373j1098l679o045
8995B0688j0942K308P691k744m059L35O966k139r35M998Q710k779n775k851o735
8980A2737J0969m663o490R545L829R172P015l762q541m246m148N119j21j2645
$$ plain form
9082 30025 27656 34160 29255 28965 21702 14642 10359 6938 8969 11232 14678 16916 20177 23658 19932
9067 19932 9138 12082 16377 14067 19943 17029 11480 22007 34289 53136 59514 71442 72804
9054 72804 66364 65674 57630 51021 53429 54486 43570 40602 46935 45889 44024 38705 28259 20654
9040 20654 25938 30119 30342 33468 28505 23815 29857 22457 20776 23527 22451 16836 14172 19943 19898
9025 19898 24001 24546 22661 20710 21501 25809 28092 32957 37606 37271 31782 35414 33699 27688 20600
9010 20600 24875 32596 30961 26681 24674 24515 32458 35258 42311 38703 44883 41510 30412 26733 20688
8995 20688 9746 12054 19745 17001 12942 13277 20243 18104 17169 22167 30877 28098 22323 19472 12737
8980 12737 23706 19043 12553 22098 25927 35099 42114 38352 29811 25565 21417 26536 26415 13770
8966A3770q615j0407M279L821L759J1565j045j084M326L845j1900O278L220k776
8952A9036r172l917R284O515l514l584Q647M676l800j2601q361m569O557L935
8938I132J2167l02k469k063M67p830o972P86M070O38l21L211J295j25o674p923
8922b913L265M472L800K442q74l822n043P979L780k646n660K030K908r71N628
8907A4375j573r899M096L309l255l257J214J869j2156L410M109J547p70M626L169
8892A0814k557o595o45N742l78o000P008J5188Q629M615R404M336O853L0368M4636
8877A31418N5531R0676J04236N6527j9603n6231o3235o3941o5926m5598k9369
8866I4485k3827j4481n475M953o898j0529m874L423J383J189n836N19k985o578
$$ plain form
8966 13770 5155 -5252 -973 2848 6607 18172 17127 16043 20369 24214 12314 18592 21812 19036
8952 19036 9864 5947 15231 21746 18232 14648 23295 27971 24171 11570 3209 -1360 5197 9132
8938 9132 21299 20997 18528 16465 16932 9102 2130 2916 6986 7624 7303 10514 11809 11684 5010 -2913
8922 -2913 352 4824 8624 11066 10192 6370 1327 9306 13086 10440 4780 6810 9718 8747 14375
8907 14375 12802 2903 6999 10308 7053 3796 5010 6879 -5277 -1867 2242 3789 3019 7645 10814
8892 10814 8257 1662 1017 6759 6381 381 7389 22577 31206 35821 45225 49561 56414 86782 131418
8877 131418 186949 277625 381861 438388 418785 362554 299319 235378 169452 123854 94485
8866 94485 70658 56177 50702 55655 48757 38228 33354 36777 38160 39349 33513 34032 31047 24469
8852B4469O245N127j4215m752J58J1645J477l483j2665l902J0294K905k779q149
8838A2375Q537R171o876o764n450P86l848K277L046m423j356O295k351M619M855
8823B0893L670k363J073L251m857j613o291j2063K378l349M346j833P40M199J2627
8808B0808K122J846k882m753q888l917K436P885l772N006Q355o569l047k895J76
8793A1911N362M620m806k541R31k848l136N149O623j016K108J1260O382j1602
8779B8397p953L87K848j468k60m100N816N248N296P782k522q049M80m768m834
8764B2300p806r207M598J2404L899K610R729R793j039j2441o265J072R81K194
8750C2822l110K391j556j547Q577M248J0288J2541j21j262n756N177J5367O269
$$ plain form
8852 24469 30714 35841 21626 16874 17032 28677 30154 26671 14006 10104 20398 23303 20524 12375
8838 12375 20912 30083 23207 16443 10993 11779 7931 10208 13254 8831 7475 13770 11419 16038 20893
8823 20893 24563 22200 23273 26524 21667 20054 13763 1700 4078 729 5075 3242 3982 8181 20808
8808 20808 22930 24776 21894 17141 8253 4336 6772 14657 10885 15891 24246 17677 14630 11735 11911
8793 11911 17273 21893 17087 14546 15477 12629 9493 14642 21265 20249 22357 33617 39999 28397
8779 28397 20444 20831 23679 22211 21951 17851 23667 28915 34211 41993 39471 31422 31902 27134 22300
8764 22300 14494 5287 9885 22289 26188 28798 38527 48320 47281 34840 28575 29647 30628 32822
8750 32822 29712 32103 30547 29000 37577 41825 52113 64654 64533 63271 57515 62692 78059 84328
8736H4328l729l844m577M148J1710m093j1860j0836o139q392P955N657R53k875
8722E8406P428O389n978M926M582n718K865N15j195P215k752N372O507J6895M20
8707A05877k343j744R168Q790p690j0045K357J6073O502K716M689n070J887l058
8693A28109o39Q009Q847K409K603l726p316M550J0498J688k972l390q29p605j364
8678A38872m968n362j0811O283J4293N920N660j663J1332N263R64J0788J7857
8665A94428J5537J1836O523J3762N540Q932J1002R512l063Q154J8167L0268N5758
8652C86356N4184J4297k6939k3489k8180k7365j7328l323K29N305P377K7943J5590
8639C84657J5654L1664L5077K9812K4813L1450M1371K9381K8299L2740L8114L3375
$$ plain form
8736 84328 80599 76755 72178 76326 88036 83943 72083 61247 55108 46716 54671 60328 61281 58406
8722 58406 65834 72223 66245 71171 75753 70035 72900 73415 72220 79435 76683 82055 88562 105457 105877
8707 105877 103534 101790 110958 119748 112058 102013 104370 120443 126945 129661 134350 129280 131167 128109
8693 128109 127470 135479 144326 146735 149338 145612 138296 142846 153344 155032 152060 148670 147841 140236 138872
8678 138872 133904 128542 117731 124014 138307 144227 149887 148224 159556 164819 165783 176571 194428
8665 194428 209965 221801 228324 242086 247626 256558 267560 277072 274009 282163 300330 330598 386356
8652 386356 440540 454837 427898 404409 376229 348864 331536 328213 328442 333747 341124 369067 384657
8639 384657 400311 431975 467052 496864 521677 553127 594498 623879 652178 684918 723032 756407
8627G56407K0339J2170K1985R689J856p562j2231k7588k8568j4278j5903k1991
8615F94325j7355j5592j3792k239O645K8694N0618Q7185J02324N0439m8807p1603
8603H50842q5392r6305r7871q0636o2726l4536l7021l1831k7499l1256k2643k0405
8591B22721j6499r321j2983j5973j4075r561p287j5240p395m433j822j0815o241
8578I1076K849j3691O194N735N468J047J668K88l21Q176l113j1943j067k354J9870
8563A09882M3615M8595K5909o592l2278j8461k2784l5133r174p829j5336r979
8551G0435k895l256M687N570R207Q9r899j0797p175q551o170O82J595m647K549
8536D1424j788k027L573K538P55p549j2033K719P995o041q390k788M891M984k720
$$ plain form
8627 756407 776746 788916 810901 820590 822446 814884 802653 775065 746497 732219 716316 694325
8615 694325 676970 661378 647586 645347 651992 680686 731304 818489 920813 971252 922445 850842
8603 850842 765450 669145 571274 490638 427912 393376 356355 324524 297025 265769 243126 222721
8591 222721 206222 196901 183918 167945 153870 144309 137022 121782 114387 109954 108132 97317 91076
8578 91076 93925 80234 86428 92163 97631 98678 100346 100634 100313 108489 105376 93433 92366 90012 109882
8563 109882 153497 202092 228001 221409 189131 170670 147886 112753 103579 95750 80414 70435
8551 70435 67540 64284 68971 74541 83748 83837 73938 63141 55966 47415 41245 41927 43522 38875 41424
8536 41424 39636 37609 41182 43720 44475 36926 24893 27612 35607 29566 21176 18388 23279 28263 25543
8521B5543K420J659j78K738P160J176m810j026p010K186J807p201o667o152N187
8506A6832Q223j431j212M094m046k331j855o572p3N317P42R779M056k242L547
8491C2828J293n757O615J2820P087n280O75P17k806r249n620Q7p262M974J6122
8476D7244q756n355M267L219p709q437K952R860k496j4619J19R468M865N710O74
8461D1006k215l275n090m564M897K487n392q672K188J3490k444m174P557J2324
8447D8123J0137n433n514k422L373q891k698R863M486n992N53n972j0381M814
8433C4046M197P231J8434J1781l877n353q200j15N726K021j5072r857P475m231
8419D4206j4754q041O817l214l536m342k777k787p551J038Q788J816j204J786
$$ plain form
8521 25543 27963 29622 29444 32182 39342 40518 35708 34682 27672 29858 31665 24464 17797 11645 16832
8506 16832 25055 23624 22412 26506 22460 20129 18274 11702 11629 16946 17688 27467 31523 29281 32828
8491 32828 34121 28364 34979 47799 54886 49606 50281 50998 48192 38943 33323 33410 26148 31122 47244
8476 47244 38488 33133 37400 40619 32910 24473 27425 37285 34789 20170 20289 29757 34622 40332 41006
8461 41006 38791 35516 30426 25862 30759 33246 27854 19182 21370 34860 32416 28242 35799 48123
8447 48123 58260 52827 47313 44891 48264 39373 36675 46538 51024 45032 45585 39613 29232 34046
8433 34046 38243 45474 63908 75689 71812 66459 58259 58144 63870 65891 50819 40962 48437 44206
8419 44206 29452 21411 28228 25014 21478 17136 14359 11572 4021 5059 13847 15663 14459 16245
8405A6245J1732K758k532k916m647R940Q87j124M482M636l743l234O559Q528K34
8390D7805R580O95q465j4464p948r652K885O431J444O515L415l066m388j371r303
8375B0113j1314j933N002R314O480k57J083l924l827p867j0384j729K745N622
8361I124L494Q935R135K246k073K19L272J462J677p422L178J822L271P830N47
8346D6717l26p16M814r701q370N220k698k55j97k017o497l555m048n921n249N420
8330A2621N041J800n455L003N852L933J683J060p484j0948l485j877n949L981
8316C776L023j707J182Q268p293J487P251k943j978l379M006j77Q305O560L105
8301B9486p131n589Q869L011m064j231n4j0831P803j620N42K358M795o176L183
$$ plain form
8405 16245 27977 30735 28203 25287 20640 30580 31467 30343 34825 39461 35718 32484 39043 47571 47805
8390 47805 57385 58080 49615 35151 27203 17551 20436 26867 28311 34826 38241 35175 30787 29416 20113
8375 20113 8799 6866 11868 21182 27662 27405 28488 24564 20737 12870 2486 757 3502 9124
8361 9124 12618 21553 30688 32934 30861 31080 34352 35814 37491 30069 33247 35069 38340 46170 46717
8346 46717 46391 45675 50489 40788 32418 37638 34940 34685 34488 32471 25974 22419 18371 12450 7201 12621
8330 12621 17662 19462 14007 17010 22862 26795 28478 29538 22054 11106 7621 5744 -205 3776
8316 3776 6799 5092 6274 14542 7249 8736 15987 13044 11066 7687 11693 11516 19821 26381 29486
8301 29486 22355 16766 25635 28646 24582 23351 23297 12466 20269 18649 19191 21549 26344 20168 23351
8286B3351L625N541o688l138l704k410l083K631M513K964J503j0477M985K531
8272B2144R000R012q791p495n456o59o80r058o752P687O929K190r204j436P474
8257A4905L712p901j1042R813Q330K096N236m074m467r169r55l112M460L694Q12
8242A2338n594q991J654R458M656k884j815R48o137o486j366J1828P511o744m296
8227D080J764N209M957l250k85N866L649M021o893r491n994n57r29L64J274N8
8211C843L22o636j4620N868J0200J5090L398j481o598k166J4006O587m141q017
8197A5655m028m583p121m079J0575O333K723p923p862p802N853M354M896J8344
8183B5335J0667l860j2757n582k863J158m250j5659M169O518R413J0657J5818
$$ plain form
8286 23351 26976 32517 25829 22691 18987 16577 13494 16125 20638 23602 25105 14628 19613 22144
8272 22144 31144 40156 31365 23870 18414 17755 17075 8017 1265 8952 15881 18071 8867 7431 14905
8257 14905 18617 10716 -326 9487 17817 19913 25149 21075 16608 7439 6484 3372 7832 11526 12338
8242 12338 6744 -2247 -593 8865 13521 10637 8822 9770 3633 -2853 -4219 7609 15120 8376 4080
8227 4080 5844 11053 16010 12760 12475 18341 21990 26011 19118 9627 3633 3076 2147 2511 3785 3843
8211 3843 4165 -2471 -17091 -11223 -1023 14067 17465 15984 9386 7220 21226 27813 23672 15655
8197 15655 11627 7044 -77 -4156 6419 12752 15475 7552 -310 -8112 -2259 2095 6991 25335
8183 25335 36002 32142 19385 13803 10940 12098 7848 -7811 -3642 2876 12289 22946 38764
8170C8764L4437M7804M5865J8958k1095k7667k4020k7698k9126j5650L63p128
8158C3807k971j2370j0201K555J2412l10p803n604p774q256L062N381M592K520
8144I040n963n224M531J709J5805N799m619m819Q50L856K102N681J100N171J8630
8129E3649L2576M0406L3998J4861j1701k8607l0252k8411k2565j3460o160L765
8117C8099l459J374k325N856L105l083k2587m082L862K012O575J198j3690m172
8103H683J2644L604K759n422j384L20l292j264n874l379J1005M360j0526o217
8089F017O777K409J0246K887p130j0283J737J2088J0631J0510M264Q16Q957N145
8075F5071R916L089n385N002N131R487O968J5223Q561R642J9195K1179Q534K9917
$$ plain form
8170 38764 73201 121005 166870 185828 164733 137066 113046 85348 56222 40572 40935 33807
8158 33807 30836 18466 8265 10820 23232 22922 15119 9515 1741 -6515 -3453 1928 6520 9040
8144 9040 3077 -2147 2384 4093 19898 25697 21078 16259 17109 20965 23067 28748 29848 35019 53649
8129 53649 86225 126631 160629 175490 163789 135182 104930 76519 53954 40494 34334 38099
8117 38099 34640 36014 33689 39545 42650 39567 16980 12898 16760 18772 25347 26545 12855 8683
8103 8683 21327 24931 27690 22268 20884 21204 17912 16648 10774 7395 18400 22760 12234 6017
8089 6017 12794 15203 25449 28336 21206 10923 12660 24748 35379 45889 50153 50969 59926 65071
8075 65071 74987 78076 72691 77693 82824 92311 99279 114502 123063 132705 151900 173079 181613 211530
8061B11530L1603K5993K9353Q951R379l203k666J0729L362m59n386k289P64J412
8047C19073P691p963k0365j5997j4422j1394l683j0641o967k530L08N441j981
8034B36570J305n633K008l28K244K197J0216J8693K0003J7493L6793M0894O8322
8021D50777R0776J22638J65569K05723J37869l483q1898j00857j23539j25368
8011G38207j16530p3032k9568R577N0959R0060J14939N0757m2697j00696j10285
8000E81691j03019q3620o8018m6609l3480j5949j3251j5646p408o03m001p495
7988A82592J2417K2860J1576N301J0237N555M824J3206O663K3542M0027O0340
7976C99140P4868Q4927P1273N2988M0566J8903j2928l5106n5043m6034k4369J583
$$ plain form
8061 211530 243133 269126 298479 307430 316809 313606 310940 321669 325031 324572 319186 316897 317661 319073
8047 319073 326764 318801 298436 282439 268017 256623 252940 242299 235332 232802 233110 238551 236570
8034 236570 237875 232242 234250 233922 236166 238363 248579 267272 287275 304768 341561 382455 450777
8021 450777 541553 664191 829760 1035483 1173352 1169869 1087971 987114 863575 738207
8011 738207 621677 548645 519077 528654 579613 669673 784612 835369 792672 691976 581691
8000 581691 478672 395052 327034 280425 246945 230996 217745 202099 194691 194088 190087 182592
7988 182592 195009 217869 229445 234746 244983 250538 255362 268568 275231 298773 338800 399140
7976 399140 474008 558935 630208 683196 723762 742665 729737 694631 639588 593554 569185 570768
7964E70768M3983N6732J8923n3160o5650p4923p8898p5956o3726m1890l3472k4981
7952A77750j7868r157p423p063q541k1673j3197O64O295k730m445j346k895j185
7938H7186P120J6916R032Q549J5724K1641L7620L7933J2769J90p947k2794k1892
7925B02047j5611j5566j2191j4940j8899o334k754p740j4350j1740j4649j3051
7913E4222j3044o825J543r805M331O648J182q670j002N355j896M79r021r417l157
7898A0923K255O038R777m392j4238n2P204O224n510p662o504n24L195P473l80
7883A3827j0112p498p593R195N890j742L49L654O02M032O78m10O129K638j0293
7868I346J357n76j4589r956l79J0341J2749M431n003k563J226n313m67m97M734
$$ plain form
7964 570768 614751 671483 690406 637246 571596 496673 417775 341819 278093 236203 202731 177750
7952 177750 159882 150725 143302 136239 127698 106025 92828 93492 99787 97057 92612 91266 88371 87186
7938 87186 94306 111222 120254 128803 144527 166168 203788 241721 254490 254680 246733 223939 202047
7925 202047 186436 170870 158679 143739 124840 118506 115752 108012 93662 81922 67273 54222
7913 54222 41178 34353 35896 26091 30422 37070 38252 29582 28580 33935 32039 32518 23497 14080 10923
7898 10923 13178 19216 28993 24601 10363 10311 17515 23739 18229 10567 4063 3539 6734 14207 13827
7883 13827 3715 -3783 -11376 -2181 3709 1967 2316 5970 6572 10604 11282 10872 17001 19639 9346
7868 9346 10703 10127 -4462 -14418 -14797 -4456 8293 12724 7721 5158 6384 1071 604 107 4841
7853D841L940n241o556L457M469M752K043n61k876l490O369J738K192L009j940
7838A6146K054j4548q983r26P270M211n612J547M070k55k758r18j913k327M889
7823A947J190r84J1611N849m524m000q523o449k869J506L901J4961N403J772l808
7808A6983o124q540J951L630l60K638m833l596q389Q77L86r229j109Q173N12j156
7792h186j70k299j068M955J4058K389m469k102M747K206p029P50m386L990n04
7777B882k418j150Q1N29P773n354k174l759l32l429j374K808L398q454n63Q151
7761c385j0267l697J296n31j714j173K452M890r331L558j264R497O819N737r21
7746A966k592O044r79M087K790m431j1248j2880j869L130j440M822J473k154L115
$$ plain form
7853 4841 8781 3540 -3016 441 4910 9662 11705 11144 8268 4778 11147 12885 15077 18086 16146
7838 16146 18200 3652 -5331 -6257 1013 5224 -388 1159 5229 4974 2216 1298 -615 -2942 1947
7823 1947 3137 2153 13764 19613 15089 11089 2566 -3883 -6752 -5246 -1345 13616 19019 20791 16983
7808 16983 10859 2319 4270 7900 7540 10178 5345 1749 -6640 -5763 -5377 -14606 -15715 -7542 -7030 -8186
7792 -8186 -8356 -10655 -11723 -6768 7290 9679 5210 3108 7855 10061 3032 3782 -604 3386 2882
7777 2882 464 -686 -605 -76 7697 2343 169 -3590 -3922 -7351 -8725 -5917 -2519 -10973 -11536 -3385
7761 -3385 -13652 -17349 -16053 -16584 -18298 -19471 -17019 -12129 -21460 -17902 -19166 -9669 -2850 2887 1966
7746 1966 -626 5418 4439 8526 11316 6885 -4363 -17243 -19112 -15982 -17422 -12600 -11127 -13281 -10166
7731a0166O866K900L257o129l700M427K576k781L368j226j510m836P370P171N688
7716A3275q921j2467k183Q631P286Q30n197J443j945j1568p54P063N246K15J326
7701B280J0147o474o562L66Q817o172p672n212r602R32q971Q44J1344K154p96
7686a4577P204o098L121J2828O096j0198n210K993N139O074k682j313n115k82
7672b020l197P568J2792l78L949n50j0982k495k513p51j625L814j293m411L09
7657a783R956J624o531k715k737n213M636M906N22n947j343L374l525K295J693
7642g88k093j369j228m693J548J473k1p848K928M598P35q141q075P99J3199L726
7626e250Q157J3012J1428o714o537n932P589j882n132l535J5K416M602m274j0311
$$ plain form
7731 -10166 -3300 -400 2857 -3272 -6972 -2545 31 -2750 618 -608 -2118 -6954 416 7587 13275
7716 13275 4354 -8113 -10296 -1665 5621 6451 1254 2697 752 -10816 -11570 -4507 739 954 2280
7701 2280 12427 5953 -609 -243 8574 2402 -5270 -10482 -20084 -19152 -28123 -27279 -15935 -13781 -14577
7686 -14577 -7373 -13471 -10350 2478 8574 -1624 -6834 -3841 1298 7372 4690 3377 -1738 -2020
7672 -2020 -5217 2351 15143 14765 18714 18164 7182 4687 2174 1423 -202 3612 2319 -2092 -1783
7657 -1783 8173 9797 3266 551 -2186 -7399 -2763 2143 2665 -3282 -4625 -1251 -4776 -2481 -788
7642 -788 -2881 -4250 -5478 -10171 -8623 -7150 -7171 -15019 -12091 -7493 -6758 -14899 -22974 -22175 -8976 -5250
7626 -5250 2907 15919 27347 20633 14096 8164 15753 13871 8739 5204 5219 7635 12237 7963 -2348
7611b348k39K867p528K319M932n92q455n708Q326l76j823p9p32j707l283M782
7595i644K215m930l825J1976N438K797q223L30k804m187J926M482J2518L297l1
7580A1335O04m793m355P376N248n373P64j0704n569L862R572J228j3503j0281
7566a4589M059P342L922l548o54p229o11N493N924K397o369l500j951J9362m20
7551I628K695k689o195N27k452j724O41j573k833k157j287L012Q159N328m496
7536D584K801l411R071l441o909q525l433L003K201o445l192L005J896k07p16
7521i718L229J0795K78j4920k369K047o012O593L053L047J1501L117N9m090r851
7506c241m417p314j525K765R117J0856q004j1412j595R32Q759Q90l70k501j370
$$ plain form
7611 -2348 -2587 280 -7248 -4929 3 -589 -9044 -14752 -6426 -6802 -8625 -8704 -9436 -11143 -14426 -9644
7595 -9644 -7429 -12359 -16184 -4208 1230 4027 -4196 -3866 -6670 -10857 -8931 -4449 8069 11366 11335
7580 11335 11939 7146 2791 10167 15415 10042 10806 102 -5467 -1605 7967 9195 -4308 -14589
7566 -14589 -10530 -3188 734 -2814 -3468 -10697 -11308 -5815 109 2506 -3863 -7363 -9314 10048 9628
7551 9628 12323 9634 3439 3966 1514 -210 431 -1142 -3975 -6132 -7419 -4407 3752 9080 4584
7536 4584 7385 3974 13045 9604 2695 -5830 -9263 -6260 -4059 -10504 -13696 -10691 -8795 -9002 -9718
7521 -9718 -6489 4306 4584 -10336 -12705 -10658 -16670 -10077 -7024 -3977 7524 10641 10700 6610 -3241
7506 -3241 -7658 -14972 -16497 -13732 -4615 6241 -1763 -13175 -14770 -13838 -5079 -4189 -4559 -7060 -8430
7491h430M229L356M702Q446n608j0564o668n706N35R763M186N639p47r090o675
7476a2632l60K282J2937m6O254p034n215P025R212j557K844m368l220q873j539
7461d290m624j0125l531J5191K575o690k863L593q33j309J0394M324n932q599
7447a2719L183k755n403l878J515R554l742k070P50p942n608Q333P657j422L382
7432a1165q61q28j103o414P658P293R53R3q28O293n33m085J105J136o88j12p493
7415i579m237n93n455M913R721l330j123p456J5250J0439l817k967k960k066j213
7400d473j179k321K376n16K062N387m825R47N980j1162k985M266l585p490o150
7385b3668J1688R146K547K157j423j0508L445O707L393L274l142j628r399R513
$$ plain form
7491 -8430 -4201 -845 3857 12303 6695 -3869 -10537 -16243 -15708 -5945 -1759 3880 3133 -5957 -12632
7476 -12632 -12992 -10710 2227 2181 8435 1401 -3814 3211 12423 10866 13710 9342 6122 -2751 -4290
7461 -4290 -8914 -19039 -22570 -7379 -4804 -11494 -14357 -10764 -11597 -12906 -2512 1812 -4120 -12719
7447 -12719 -9536 -12291 -17694 -21572 -20057 -10503 -14245 -16315 -15565 -23507 -29115 -20782 -13125 -14547 -11165
7432 -11165 -12026 -12854 -13957 -20371 -12713 -5420 -4467 -4374 -5202 1091 558 -3527 -2422 -1286 -1974 -2086 -9579
7415 -9579 -13816 -14409 -19864 -14951 -5230 -8560 -9683 -17139 -1889 8550 4733 1766 -1194 -3260 -4473
7400 -4473 -5652 -7973 -5597 -6113 -4051 1336 -3489 -2542 3438 -7724 -10709 -6443 -10028 -17518 -23668
7385 -23668 -11980 -2834 -287 1870 447 -10061 -6616 91 3484 6758 3616 1988 -7411 2102
7371B102l210n603j282q21j713M035J2640p335n000j479j782K019q72o054Q633
7356e722P888O2M032n91k601m48K725n096l350J919k516o285j220k63O796P034
7340B364O156j392K844R25n985n385n338l022J453j859n134K111R047n271j589
7325a0075j88o185q272o950O904J4989Q026J471o079J0886P603k73m502k507J011
7310E859J327k71n081j710j356l603l040k177O747O252n877j0719r682N114M877
7295a3340j791M32N745j153L118R40L767K819k025k62P12k566L73M040n51o812
7279f554N312J84n424J334q14k754o567J767j426J048M36L186P130J928P95l898
7263d317q1q7O40J3307M421l896K886Q215N90k171k834j3607q539q29q86l112
$$ plain form
7371 2102 -1108 -6711 -7993 -8814 -10527 -6492 6148 -1187 -6187 -7666 -9448 -7429 -8301 -14355 -5722
7356 -5722 2166 2228 6260 5669 3068 2620 5345 249 -3101 -1182 -3698 -9983 -11203 -11466 -4670 2364
7340 2364 8520 7128 9972 10897 4912 -473 -5811 -8833 -7380 -9239 -14373 -12262 -3215 -8486 -10075
7325 -10075 -10263 -16448 -24720 -31670 -24766 -9777 -1751 -280 -6359 4527 12130 11857 7355 4848 5859
7310 5859 7186 6915 1834 124 -1232 -4835 -7875 -10052 -3305 2947 -2930 -13649 -23331 -18217 -13340
7295 -13340 -15131 -14699 -8954 -10107 -6989 -6049 -2282 537 -1488 -1750 -1038 -3604 -3231 809 258 -6554
7279 -6554 -1242 -1058 -6482 -5148 -5962 -8716 -15283 -13516 -14942 -13894 -13458 -10272 -3142 -1214 -419 -4317
7263 -4317 -4398 -4485 -3845 9462 13883 9987 12873 21088 21678 19507 16673 3066 -5473 -6302 -7188 -10300
7247a0300N50Q56r849n34P78P895O752q769m357m721k275M142J3564Q206k724
7232g86p629j271O304J3079j3136j200M685P00k879R710l460j3190j1440N80K963
7217a6970K563N030N844Q676r470j2446J529K731J156L742j900q995O004R488
7203c018j495k117L595J18J221N854m211j6349P042R061M695M874j681k376m211
7188A002O853m885l124p342r444R318N603P143j473o062r4p618n887J355O569
7173h086M562Q335n132j999m795J1963k821p343k836O553o047J0392L918p413
7159g49J790n225J194J077j014L84K871k980J924K723j404P980M60k001j321j1998
7143f289L656L446K481L48n789m668O287r41q629q910k434J0245m494N291P646
$$ plain form
7247 -10300 -9750 -8894 -18743 -19277 -18499 -10604 -3852 -12621 -16978 -21699 -23974 -19832 -6268 1938 -786
7232 -786 -8415 -9686 -3382 9697 -3439 -4639 46 746 -2133 7577 4117 -9073 -20513 -19933 -16970
7217 -16970 -14407 -9377 -3533 5143 -4327 -16773 -15244 -12513 -11357 -7615 -9515 -18510 -12506 -3018
7203 -3018 -4513 -6630 -3035 -2917 -1696 4158 -53 -16402 -9360 -299 4396 9270 7589 5213 1002
7188 1002 7855 2970 -154 -7496 -16940 -7622 -2019 5124 3651 -2411 -2505 -10123 -16010 -14655 -8086
7173 -8086 -3524 4811 -321 -2320 -7115 4848 2027 -5316 -8152 -1599 -7646 2746 6664 -749
7159 -749 1041 -4184 -2990 -1913 -2927 -2543 328 -2652 -728 1995 591 8571 9031 7030 5709 -6289
7143 -6289 -2633 813 3294 3642 -2147 -6815 -528 -1469 -10098 -19008 -21442 -11197 -15691 -10400 -2754
7128b754n56p810m664j327R376J0239L5O722N88q169o412K489l654Q673N645n939
7112B482j245r540P17J593l040m586o842m76R645L981J1814J015p49L075m844
7097C000j6902o752K371l580q08M849n97j189j728J1893J6642j392o289n775n369
7082a1626Q106N263j559j741j127M668J2153K686l560o26j3115l555j3614j778
7068a9425p524N59L090O817K062O021P56M126j82r529K81O613R52j789j008n050
7052a3230M376P497k580K85L123L526n152o0O074q623o425l78j823m228M092l231
7036a6757j309M772l730O692K685m957k050R06J863Q807k237Q27j0738K437Q147
7021d642J1239O692j1391r803n137L687J2431Q405J915r038l601j1402K970L371
$$ plain form
7128 -2754 -3310 -11120 -15784 -17111 -7735 2504 2539 9261 9849 1680 -4732 -2243 -5897 2776 8421 2482
7112 2482 1237 -8303 -7586 -5993 -9033 -13619 -20461 -20937 -11292 -7311 4503 5518 4769 7844 3000
7097 3000 -13902 -20654 -18283 -21863 -22671 -17822 -18419 -19608 -21336 -9443 7199 5807 -482 -6257 -11626
7082 -11626 -3520 1743 184 -1557 -2684 1984 14137 16823 13263 12637 -478 -4033 -17647 -19425
7068 -19425 -26949 -26390 -23300 -16483 -14421 -8400 -7644 -3518 -3700 -13229 -12948 -6335 -5383 -7172 -8180 -13230
7052 -13230 -8854 -1357 -3937 -3652 -529 2997 -2155 -2215 3859 -4764 -11189 -11567 -13390 -17618 -13526 -16757
7036 -16757 -18066 -13294 -17024 -10332 -7647 -12604 -14654 -13748 -11885 -3078 -5315 -4488 -15226 -12789 -4642
7021 -4642 6597 13289 1898 -7905 -13042 -9355 3076 11481 13396 4358 757 -10645 -7675 -4304
7007d304k76R96k86k113m94l065o903P97N072N342L116j950q233J371n098N538
6991a0490J4700m373j0757k394q6m936r56k326R63L515J2447m759j2000Q720J0281
6976b451L695L773K063j510m277j642M254n81k231M661P61J820J122k825j1119
6961d487j0151J1547J3564j653J389k672n869o370K640J1834k473j032r720j027
6947d480N206O975L520j877q716n667j499J921J0639K043j143m216j694K43j452
6932a97j3987l712L581M588R097N188k413o88l599j979K682o525j864J2129N539
6917G840J574k245k137l779m083l086q02m985O842L801J002K648p55l398L226
6902A663r804N48M686R610L584r705n662k013l650J165K900P638p384m53r56P11
$$ plain form
7007 -4304 -4580 -3584 -3870 -5983 -6477 -9542 -16445 -15648 -10576 -5234 -2118 -4068 -12301 -10930 -16028 -10490
6991 -10490 4210 -163 -10920 -13314 -13400 -18336 -19292 -21618 -20655 -17140 -4693 -9452 -21452 -12732 -2451
6976 -2451 1244 5017 7080 5570 1293 -349 3905 3324 1093 5754 6515 8335 9457 6632 -4487
6961 -4487 -14638 -3091 10473 8820 10209 7537 1668 -4702 -2062 9772 7299 6267 -3453 -4480
6947 -4480 726 7701 11221 9344 628 -5039 -6538 -4617 6022 8065 6922 2706 1012 1255 -197
6932 -197 -14184 -17896 -14315 -9727 -630 4558 2145 1457 -2142 -4121 -1439 -7964 -9828 2301 7840
6917 7840 9414 7169 5032 1253 -2830 -5916 -6718 -11703 -4861 -1060 -58 2590 1835 -1563 1663
6902 1663 -8141 -7593 -2907 6703 10287 582 -5080 -7093 -10743 -9578 -6678 960 -6424 -6877 -7833 -7122
6886g122M041O282l715m851o591k410J2389L524o787l725J4623j1055j2743k933
6872b1073L70j383M328K783R231O102L788k253p297r414O501J2786J6167K303
6858B2939j3740r644J793O517o632k239N16m751N738J3519J148n557j2775r840
6844a3008M551m116p336P878Q453k273j0598N04P950O245q44l655J331J2851m344
6829C589r002k050r22n961M084N875M249Q607O228l566j8157q677N208M084p92
6814g203J4787O985m906q527r876k292J783J601k887o130K142J039j12J104J349
6799a1143l907J736j577j132M789L624R52n777q01Q552K953j85O90j655r695P60
6783a1816M721K765m880K989O715K642J2353J1580j6551r335J0369L168k436o344
$$ plain form
6886 -7122 -3081 3201 -514 -5365 -11956 -14366 -1977 1547 -5240 -8965 5658 -5397 -18140 -21073
6872 -21073 -20703 -22086 -17758 -14975 -5744 358 4146 1893 -5404 -14818 -8317 4469 20636 22939
6858 22939 9199 -445 1348 7865 1233 -1006 -490 -5241 497 14016 15164 9607 -3168 -13008
6844 -13008 -8457 -12573 -19909 -12031 -3578 -5851 -16449 -15945 -7995 -1750 -2594 -6249 -4918 7933 3589
6829 3589 -5413 -7463 -8385 -14346 -10262 -4387 -138 8469 14697 11131 -7026 -15703 -10495 -6411 -7203
6814 -7203 7584 14569 9663 1136 -8740 -11032 -9249 -7648 -10535 -16665 -14523 -13484 -13596 -12492 -11143
6799 -11143 -15050 -13314 -14891 -16023 -11234 -7610 -6658 -12435 -13236 -4684 -1731 -1916 -1226 -2881 -12576 -11816
6783 -11816 -7095 -4330 -9210 -6221 494 3136 15489 27069 10518 1183 11552 14720 12284 5940
6769E940m508P525K520M456k841O492J6688O589r478j9501j5372l03L11J134L364
6754C016K0932J1126Q311Q457O383J0684J7661K6297L9772O1196R4435J41965
6742D50235J12989J2248p5096q9306q3459r4164o9447n2072l2229k0104j5410
6731D4185j0262m477J988l969p430L690L680o678n304n11K828j799J356j813N175
6716B0659M538j3676l655j452L512p242r218J1498k235Q66q338q838k558J2741
6702c398R823J886m077N293q12j212K665r482J234J977J592P338P059Q361r919
6687A8328p640j612j4681J0786M046o171P77J566M613Q805o338l636j6123o254
6673a3534M918k307M005j544k331M363K612j0650N990K009O204j558r539Q976
$$ plain form
6769 5940 1432 8957 11477 15933 13092 19584 36272 42861 33383 13882 -1490 -1793 -1482 -348 3016
6754 3016 23948 35074 43385 51842 58225 68909 86570 112867 152639 213835 308270 450235
6742 450235 563224 575472 500376 411070 327611 233447 164000 111928 79699 59595 44185
6731 44185 33923 29446 31434 27465 20035 23725 27405 20727 15423 14912 17740 15941 17297 15484 20659
6716 20659 25197 11521 7866 6414 9926 2684 -6534 4964 2729 3595 -4743 -13581 -16139 -3398
6702 -3398 6425 8311 4234 9527 8715 7503 10168 686 1920 3897 5489 12827 19886 28247 18328
6687 18328 10688 9076 -5605 5181 9227 3056 3833 5399 10012 18817 12479 8843 -7280 -13534
6673 -13534 -8616 -10923 -6918 -8462 -10793 -6430 -3818 -14468 -8478 -6469 -265 -1823 -11362 -2386
6659b386l853J325j69J677J713M999m678r753n750rM263K377m43m402O687P920
6643d82r75l891L508K693P25M119k406k566n391p696N512Q028P475Q7J623o789
6627C574k074o676J908L845m36n206r91q08r987m384J0366K446O158L692m704
6612c277k871J552M59M059L223l217n65J127m535p582N400l903m233J0391Q00
6597c172o19M663M917j143p390k760M440l717o017m805J870J1171N089L686K781
6582H994M273p594l851o661L65M494o854Q53n067P067j863K410l681J213L026
6567b876n843J619l462L106m44O453k3J588j079m055n945l79o408R467L433l637
6551h485O559Q036q154p603l462l83L549p395o125K072J8468R556o757J486R565
$$ plain form
6659 -2386 -6239 -4914 -5083 -3406 -1693 3306 -1372 -11125 -16875 -16884 -12621 -10244 -10687 -15089 -8402 -482
6643 -482 -1457 -5348 -1840 853 1578 5697 3291 725 -4666 -12362 -6850 1178 8653 8740 10363 3574
6627 3574 1500 -5176 -3268 577 141 -5065 -6056 -6864 -16851 -21235 -10869 -8423 -2265 1427 -3277
6612 -3277 -6148 -4596 -4137 -78 3145 -72 -637 490 -4045 -11627 -6227 -10130 -14363 -3972 -3172
6597 -3172 -3791 872 5789 4646 -2744 -5504 -1064 -4781 -10798 -15603 -13733 -2562 2527 6213 8994
6582 8994 13267 5673 1822 -4839 -4474 20 -6834 -5981 -11048 -3981 -5844 -3434 -7115 -5902 -2876
6567 -2876 -8719 -7100 -10562 -7456 -7900 -1447 -1470 118 -961 -5016 -10961 -11340 -17748 -8281 -4848 -8485
6551 -8485 -1926 6110 -2044 -9647 -13109 -13492 -9943 -17338 -23463 -21391 -2923 6633 -124 1362 10927
6536A0927l624p337k612j0118K625k753p441p72L84N717J3287R585j611K831n462
6521C626m735o381J961N929j804o89l4K945l483m138L008O150o618q009J856l285
6505a3701K716N174N914J134k899j314m30L300o303j10J1954N094L367l00j328
6490A2268j1972L97J7438O612o116j2692r993n636o287l897j0054K405J0886R325
6476g316p868p13P60j0610l985m857N248P269P380R574Q168o709o955J725K07
6461h682J532P701j750j2883J740L862o86n86j025R40K099j679J462p53n79J435
6445g852r61j346k241K638O109j629N635j214l520p504l249n449J369J3441L627
6430b146p130L552J0665N653m43J8J156k818n824o834j603N459J642N110L948
$$ plain form
6536 10927 7303 -34 -2646 -12764 -10139 -12892 -20333 -21105 -20721 -15004 -1717 7868 6257 9088 3626
6521 3626 -1109 -7490 -5529 400 -1404 -2093 -2127 818 -2665 -6803 -3795 2355 -4263 -12272 -10416 -13701
6505 -13701 -10985 -5811 103 1237 -1662 -2976 -3406 -106 -6409 -6519 5435 10529 13896 13596 12268
6490 12268 296 693 18131 24743 18627 5935 -4058 -9694 -15981 -19878 -29932 -27527 -16641 -7316
6476 -7316 -15184 -15897 -15137 -25747 -29732 -34589 -29341 -22072 -14692 -5118 3050 -3659 -10614 -8889 -8682
6461 -8682 -7150 551 -1199 -14082 -12342 -8480 -9166 -9752 -10777 -9837 -7738 -9417 -7955 -8708 -9287 -7852
6445 -7852 -8813 -10159 -12400 -9762 -3653 -5282 353 -861 -4381 -11885 -15134 -20583 -19214 -5773 -2146
6430 -2146 -9276 -5724 4941 10594 10151 10169 11325 8507 2683 -4151 -5754 -295 1347 6457 10405
6415A0405j374K121p071j5009m208m485o56L33P875l198l434l465K852O37k467
6400b1144O901J3829K162m575l583K52k500k053q602r269J11Q496L567K150J686
6385a2572O149Q210P08q025K688N21Q089M935l291l648L32j0810j871O578K362
6370C55j1443l022J75O822p476j401J0494R686p516K189Q949O485k611r685j219
6355G82p138J665L860j323l250k365j334k291O651o20P655O802m294p790n323
6340h313Q06J2148j072n647Q832k498L05j630l659r278J774J539K326P023n271
6325b615r199m527j582k742M654L935k165J0758K403k125l604p561q29J517K512
6310a1170k156O85O939j498l062m814R872N650r138o135R11O19l121r66q3K788
$$ plain form
6415 10405 9031 11152 4081 -10928 -15136 -19621 -20277 -19944 -12069 -15267 -18701 -22166 -19314 -18677 -21144
6400 -21144 -14243 -414 1748 -2827 -6410 -6158 -8658 -10711 -19313 -28582 -28471 -19975 -16408 -14258 -12572
6385 -12572 -6423 1787 2495 -5530 -2842 -2321 5768 10703 7412 3764 4096 -6714 -8585 -2007 355
6370 355 -11088 -14110 -13935 -7113 -14589 -15990 -5496 4190 -3326 -1137 7812 14297 11686 2001 782
6355 782 -6356 -4691 -831 -2154 -5404 -7769 -9103 -11394 -4743 -5363 2292 9094 4800 -2990 -8313
6340 -8313 -7507 4641 3569 -2078 6754 4256 4561 2931 -728 -10006 -8232 -6693 -4367 2656 -2615
6325 -2615 -11814 -16341 -17923 -20665 -16011 -12076 -14241 -3483 -1080 -3205 -6809 -14370 -15199 -13682 -11170
6310 -11170 -13326 -12641 -5702 -7200 -10262 -15076 -5204 446 -8692 -14827 -13916 -13297 -16418 -17384 -17467 -14679
6294a4679J921R10k343j1549p63P184P475l669j4006N517J6088J1230O98m738
6280g24o923J735K228K47m883R62o993k410k242j321J1638R598l338M602q11M029
$$ plain form
6294 -14679 -12758 -11848 -14191 -25740 -26503 -19319 -11844 -15513 -29519 -24002 -7914 3316 4014 -724
6280 -724 -7647 -5912 -3684 -3437 -8320 -7358 -14351 -16761 -19003 -20324 -8686 912 -2426 2176 1365 5394
$$ [...]
##END NTUPLES=NMR SPECTRUM
##END=
