##TITLE=Analysis number 320530
Compound Code ac 31181
Project Code adrs
Chemist Name apollo
##JCAMPDX= 6.0         $$ Bruker NMR JCAMP-DX V2.0
##DATA TYPE= NMR SPECTRUM
##DATA CLASS= NTUPLES
##ORIGIN= Bruker BioSpin GmbH
##OWNER= nmr
$$ XWIN-NMR		Version 3.5
$$ Wed Jun 28 13:22:24 2006 GMT Daylight Time (UT+1h)  MAYBRIDGE\nmr@NMR_250MHZ
##.OBSERVE FREQUENCY= 250.131544655141
##.OBSERVE NUCLEUS= ^1H
##.ACQUISITION MODE= SIMULTANEOUS (DQD)
##.ACQUISITION SCHEME= undefined
##.AVERAGES= 16
##.DIGITISER RES= 18
##SPECTROMETER/DATA SYSTEM= dpx250
##.PULSE SEQUENCE= zg30
##.SOLVENT NAME= CDCl3
##.SHIFT REFERENCE= (INTERNAL, CDCl3, 0, 16.522)
##AUDIT TRAIL= $$ (NUMBER, WHEN, WHO, WHERE, WHAT)
$$ ##TITLE= Audit trail, XWIN-NMR		Version 3.5
$$ ##JCAMPDX= 5.01
$$ ##ORIGIN= Bruker BioSpin GmbH
$$ ##OWNER= nmr
$$ C:\u/data/dgb/nmr/ADRS/1720/pdata/1/auditp.txt
$$ ##AUDIT TRAIL=  $$ (NUMBER, WHEN, WHO, WHERE, WHAT)
(   1,<2006-06-28 13:21:59.78 +100>,<MAYBRIDGE\nmr>,<NMR_250MHZ>,
      <created by zg, POWCHK disabled, PULCHK disabled
       configuration hash MD5:
       E2 DF 36 D8 04 B2 41 60 5A D7 A3 38 5A 4B D0 FE
       data hash MD5: 64K
       0C 4C 27 BB 1B E1 5F 60 6D A6 62 FD E0 D6 6A 54>)
(   2,<2006-06-28 13:22:14.94 +100>,<MAYBRIDGE\nmr>,<NMR_250MHZ>,
      <Start of raw data processing
       ef LB = 0.3 FT_mod = 6 PKNL = 1 SI = 32K 
       data hash MD5: 32K
       BA B7 2D 6C 40 FC 3B 45 65 F8 4F CE A4 0E E2 12>)
(   3,<2006-06-28 13:22:16.50 +100>,<MAYBRIDGE\nmr>,<NMR_250MHZ>,
      <apk 
       data hash MD5: 32K
       F9 B4 A5 DA 39 18 00 E2 D2 81 DE 3E 8E 16 25 E3>)
(   4,<2006-06-28 13:22:17.35 +100>,<MAYBRIDGE\nmr>,<NMR_250MHZ>,
      <abs ABSG = 5 
       data hash MD5: 32K
       E3 E0 97 0F E7 AB 12 A1 CC 71 B3 C0 B5 62 BE D0>)
$$ ##END=
$$ 
$$ hash MD5
$$ EA FF 8A 5A 46 87 87 8B C8 57 08 C8 64 F9 2C 3A
##$RELAX= 
##$RELAX= 
##$RELAX= 
##$RELAX= 
##$RELAX= 
##$RELAX= 
##$RELAX= 
$$ Bruker specific parameters
$$ --------------------------
##$DU= <C:\u>
##$EXPNO= 1720
##$NAME= <ADRS>
##$PROCNO= 1
##$TYPE= <nmr>
##$USER= <dgb>
##$AMP= (0..31)
100 100 100 100 100 100 100 100 100 100 100 100 100 100 100 100 100 100 
100 100 100 100 100 100 100 100 100 100 100 100 100 100 
##$AQSEQ= 0
##$AQ_mod= 3
##$AUNM= <au_zg>
##$AUTOPOS= <31 >
##$BF1= 250.13
##$BF2= 250.13
##$BF3= 250.13
##$BF4= 250.13
##$BF5= 500.13
##$BF6= 500.13
##$BF7= 500.13
##$BF8= 500.13
##$BYTORDA= 1
##$CFDGTYP= 0
##$CFRGTYP= 5
##$CHEMSTR= <none>
##$CNST= (0..31)
1 1 145 1 1 1 1 1 1 1 1 1 1 1 1 1 1 1 1 1 1 1 1 1 1 1 1 1 1 1 1 1 
##$CPDPRG= <>
##$CPDPRG1= <>
##$CPDPRG2= <>
##$CPDPRG3= <>
##$CPDPRG4= <mlev>
##$CPDPRG5= <mlev>
##$CPDPRG6= <mlev>
##$CPDPRG7= <mlev>
##$CPDPRG8= <mlev>
##$CPDPRGB= <>
##$CPDPRGT= <>
##$D= (0..31)
0 1 0 0 0 0 0 0 0 0.06 0 0 0 0 0 0 0.0002 0 0 0 0 0 0 0 0 0 0 0 0 0 0 
0 
##$DATE= 1151497318
##$DBL= (0..7)
120 120 120 120 120 120 120 120 
##$DBP= (0..7)
150 150 150 150 150 150 150 150 
##$DBP07= 0
##$DBPNAM0= <>
##$DBPNAM1= <>
##$DBPNAM2= <>
$$ [...]
##$SUBNAM7= <"">
##$SUBNAM8= <"">
##$SUBNAM9= <"">
##$SW= 20.6930455092707
##$SWIBOX= (0..15)
0 0 3 0 0 0 0 0 0 0 0 0 0 0 0 0 
##$SW_h= 5175.983436853
##$TD= 65536
##$TD0= 1
##$TE= 295.16
##$TE2= 300
##$TE3= 300
##$TEG= 300
##$TL= (0..7)
0 120 120 120 120 120 120 120 
##$TP= (0..7)
150 150 150 150 150 150 150 150 
##$TP07= 0
##$TPNAME0= <>
##$TPNAME1= <>
##$TPNAME2= <>
##$TPNAME3= <>
##$TPNAME4= <>
##$TPNAME5= <>
##$TPNAME6= <>
##$TPNAME7= <>
##$TPOAL= (0..7)
0.5 0.5 0.5 0.5 0.5 0.5 0.5 0.5 
##$TPOFFS= (0..7)
0 0 0 0 0 0 0 0 
##$TUNHIN= 0
##$TUNHOUT= 0
##$TUNXOUT= 0
##$USERA1= <user>
##$USERA2= <user>
##$USERA3= <user>
##$USERA4= <user>
##$USERA5= <user>
##$V9= 5
##$VALIST= <valist>
##$VCLIST= <CCCCCCCCCCCCCCC>
##$VD= 0
##$VDLIST= <DDDDDDDDDDDDDDD>
##$VPLIST= <PPPPPPPPPPPPPPP>
##$VTLIST= <TTTTTTTTTTTTTTT>
##$WBST= 1024
##$WBSW= 4
##$XGAIN= (0..3)
0 0 0 0 
##$XL= 0
##$YL= 0
##$YMAX_a= 239701
##$YMIN_a= -275462
##$ZGOPTNS= <>
##$ZL1= 120
##$ZL2= 120
##$ZL3= 120
##$ZL4= 120
##$ABSF1= 16.522
##$ABSF2= -4.171173
##$ABSG= 5
##$ABSL= 3
##$ALPHA= 0
##$AQORDER= 0
##$ASSFAC= 0
##$ASSFACI= 0
##$ASSFACX= 0
##$ASSWID= 0
##$AUNMP= <proc_1d>
##$AZFE= 0.1
##$AZFW= 0.1
##$BCFW= 0
##$BC_mod= 0
##$BYTORDP= 0
##$COROFFS= 0
##$CY= 12.5
##$DATMOD= 1
##$DC= 0
##$DFILT= <>
##$DTYPP= 0
##$F1P= 14.0000005364418
##$F2P= -0.99999901652339
##$FCOR= 0.5
##$FTSIZE= 32768
##$FT_mod= 6
##$GAMMA= 0
##$GB= 0
##$INTBC= 1
##$INTSCL= 1
##$ISEN= 128
##$LB= 0.3
##$LEV0= 0
##$LPBIN= 0
##$MAXI= 10000
##$MC2= 0
##$MEAN= 0
##$ME_mod= 0
##$MI= 0
##$NCOEF= 0
##$NC_proc= -4
##$NLEV= 6
##$NOISF1= 0
##$NOISF2= 0
##$NSP= 0
##$NTH_PI= 0
##$NZP= 0
##$OFFSET= 16.522
##$PC= 1
##$PHC0= 176.6962
##$PHC1= 7.396175
##$PH_mod= 1
##$PKNL= yes
##$PPARMOD= 0
##$PSCAL= 4
##$PSIGN= 0
##$REVERSE= no
##$SF= 250.13
##$SI= 32768
##$SIGF1= 0
##$SIGF2= 0
##$SINO= 400
##$SIOLD= 32768
##$SREGLST= <1H.CDCl3>
##$SSB= 0
##$STSI= 32768
##$STSR= 0
##$SW_p= 5175.98343685301
##$SYMM= 0
##$S_DEV= 0
##$TDeff= 65536
##$TDoff= 0
##$TI= <Analysis number 999999
Compound Code 99
Book Reference 9
Project Code 9>
##$TILT= no
##$TM1= 0
##$TM2= 0
##$TOPLEV= 0
##$USERP1= <user>
##$USERP2= <user>
##$USERP3= <user>
##$USERP4= <user>
##$USERP5= <user>
##$WDW= 1
##$XDIM= 32768
##$YMAX_p= 366599621
##$YMIN_p= -658874
$$ End of Bruker specific parameters
$$ ---------------------------------
##NTUPLES= NMR SPECTRUM
##VAR_NAME=  FREQUENCY,     SPECTRUM/REAL,   SPECTRUM/IMAG
##SYMBOL=    X,             R,               I
##VAR_TYPE=  INDEPENDENT,   DEPENDENT,       DEPENDENT
##VAR_FORM=  AFFN,          ASDF,            ASDF
##VAR_DIM=   32768,         32768,           32768
##UNITS=     HZ,            ARBITRARY UNITS, ARBITRARY UNITS
##FACTOR=    0.157963299565203, 1,           1
##FIRST=     4132.6476996994, 0,             0
##LAST=      -1043.33573715361, 0,           0
##MIN=       -1043.33573715361, -658874,     0
##MAX=       4132.6476996994, 366599621,     0
$$ Real data points
##PAGE= N=1
##DATA TABLE= (X++(R..R)), XYDATA
$$ [...]
$$ plain form
22833 84232 61962 183142 299744 155957 205374 197969 278315 165837 105851 -1747 140270
22822 140270 345407 280476 277545 279107 277304 136794 99998 -34769 -70407 -35319 16324
22811 16324 -45473 -33551 -68778 -60484 -190879 -24009 13133 150300 156847 36573 -45029
22800 -45029 -71615 -30580 -54327 160651 231582 88900 43168 10 53724 89208 30525
22789 30525 19996 166716 205749 209793 274840 370931 419715 284240 429029 529284 337738
22778 337738 144303 -50775 94355 140750 103535 107204 93134 111656 173722 429890 355145
22767 355145 245739 307673 194986 159465 137169 76905 -66642 28702 86280 78005 100684
22756 100684 -76664 -295054 -148135 -45975 -37739 26112 23897 -32129 -55423 56161 60694
$$ packed form
22833H4232k2270J21180J16602j43787M9417p405Q0346j12478n9986j07598J42017
22822A40270K05137o4931k931J562j803j40510l6796j34767l5638L5088N1643
22811A6324o1797J1922l5227Q294j30395J66870L7142J37167O547j20274q1602
22800d5029k6586M1035k3747K14978P0931j42682m5732m3158N3714L5484n8683
22789C0525j0529J46720L9033M044O5047R6091M8784j35475J44789J00255j91546
22778C37738j93435j95078J45130M6395l7215L669j4070J8522O2066K56168p4745
22767C55145j09406O1934j12687l5521k2296o0264j43547R5344N7578q275K2679
22756A00684j77348k18390J46919J02160Q236O3851k215n6026k3294J11584M533
$$ plain form
22745 60694 34807 -257800 -444105 -345386 157409 253291 191576 329546 339232 335545 324880
22734 324880 335863 453789 509513 365412 214750 241669 280598 305575 134790 24233
22724 24233 37687 -84934 -66403 87781 149357 178784 263059 342613 232029 238502 116617
22713 116617 300182 479884 392228 288583 234958 101731 -23160 15037 88717 265677
22703 265677 248692 91275 26926 -99715 -10809 30087 133140 -33704 -63731 14697 227888
22692 227888 165500 176931 253729 174442 300784 453656 492887 382252 421969 282606 171910
22681 171910 222857 125647 270301 294417 292423 253063 194893 23696 -47591 66405 333465
22670 333465 395376 351795 461501 320291 166867 125185 160075 335227 226440 131410
$$ packed form
22745F0694k5887k92607j86305R8719N02795R5882o1715J37970R686l687j0665
22734C24880J0983J17926N5724j44101j50662K6919L8929K4977j70785j10557
22724B4233J3454j22621J8531J54184O1576K9427Q4275P9554j10584O473j21885
22713A16617J83565J79702q7656j03645n3625j33227j24891L8197P3680J76960
22703B65677j6985j57417o4349j26641Q8906M0896J03053j66844l0027P8428K13191
22692B27888o2388J1431P6798p9287J26342J52872L9231j10635L9717j39363j10696
22681A71910N0947r7210J44654K4116j994l9360n8170j71197p1287J13996K67060
22670C33465O1911m3581J09706j41210j53424m1682L4890J75152j08787r5030
$$ plain form
22660 131410 122038 86153 -54989 -146493 76078 108144 94745 164218 141733 13748 183407
22649 183407 182932 218318 348323 263249 77358 -13838 -135297 -99453 141249 401274 475800
22638 475800 357843 213390 257136 365489 346188 340305 179115 75419 -19899 168108
22628 168108 135901 80111 113339 85703 45038 182600 212237 125937 37465 -50480 87271
22617 87271 128050 218637 253375 273769 234243 161898 216296 305983 172457 291219 312172
22606 312172 259479 158838 76792 35134 -134497 -255469 -64605 40704 -53027 -116867
22596 -116867 -11065 101202 145307 78923 119194 134080 263354 143500 11392 17368 64990
22585 64990 144587 -58127 77082 31148 78135 242345 301171 114451 -41407 -101394 273972
$$ packed form
22660A31410r372l5885j41142r1504K22571L2066j3399O9473k2485j27985J69659
22649A83407m75L5386J30005q5074j85891r1196j21459L5844K40702K60025P4526
22638D75800j17957j44453M3746J08353j9301n883j61190j03696r5318J88007
22628A68108l2207n5790L3228k7636m0665J37562K9637q6300q8472q7945J37751
22617H7271M0779R0587L4738K0394l9526p2345N4398Q9687j33526J18762K0953
22606C12172n2693j00641q2046m1658j69631j20972J90864J05309r3731o3840
22596a16867J05802J12267M4105o6384M0271J4886J29274j19854j32108N976M7622
22585F4990P9597k02714J35209m5934M6987J64210N8826j86720j55858n9987L75366
$$ plain form
22574 273972 199199 218806 156093 36209 -86417 -205635 -226315 -224601 -90252 177676 178151
22563 178151 120346 48334 149225 118186 -27379 82149 76016 49391 36456 -2676 152798
22552 152798 207643 -66837 -158596 -187449 -252166 -96201 1255 99319 207764 3603 -52982
22541 -52982 101759 106489 184846 142596 29956 -6689 34490 91275 -4957 -118194 -46331
22530 -46331 5925 -81972 -99028 -73644 -24493 -21893 -59823 -37839 199419 246001 40325
22519 40325 -112389 50136 81684 121813 217222 157934 129353 104068 79168 17978 -171230
22508 -171230 -231145 -122224 -77585 -128411 -66143 -56625 -37960 -67669 -126526 -197888 -6027
22497 -6027 92922 130188 78276 -50655 -67860 -25598 -120263 -85142 93477 160400 131701
$$ packed form
22574B73972p4773J9607o2713j19884j22626j19218k0680J714J34349K67928M75
22563A78151n7805p2012J00891l1039j45565J09528o133k6625j2935l9132J55474
22552A52798N4845k74480r1759k8853o4717J55965R7456R8064J08445k04161n6585
22541e2982J54741M730P8357m2250j12640l6645M1179N6785r6232j13237P1863
22530d6331N2256q7897j7056K5384M9151K600l7930K1984K37258M6582k05676
22519D0325j52714J62525L1548M0129R5409n9288k8581k5285k4900o1190j89208
22508a71230n9915J08921M4639n0826O2268R518J8665k9709n8857p1362J91861
22497f027R8949L7266n1912j28931j7205M2262r4665L5121J78619O6923k8699
$$ plain form
22486 131701 75442 21794 87732 142925 83533 5073 -18530 57636 116445 -45103 -16135
22475 -16135 70281 224768 343859 310901 184996 152897 27734 -222276 -349278 -180318
22465 -180318 -166828 -23380 70506 -120239 -95524 82073 293027 247880 260775 361450
22455 361450 348791 228129 178283 271444 302841 199513 52943 -5053 137433 245604
22445 245604 77794 6866 32310 69004 146198 169860 194930 100870 -39426 -116765 48840
22434 48840 106079 11053 -126 -65791 -72022 -92643 48259 34911 -113317 -62945 90312
22423 90312 -40025 -95483 44944 198118 272958 287269 224728 81229 -44252 -81559 -126663
22412 -126663 -6889 100006 173648 123399 164432 274216 258386 145305 86571 248586
$$ packed form
22486A31701n6259n3648O5938N5193n9392p8460k3603P6166N8809j61548K8968
22475a6135Q6416J54487J19091l2958j25905l2099j25163k50010j27002J68960
22465a80318J3490J43448R3886j90745K4715J77597K10954m5147J2895J00675
22455C61450j2659j20662m9846R3161L1397j03328j46570n7996J42486J08171
22445B45604j67810p0928K5444L6694P7194K3662K5070r4060j40296p7339J65605
22434D8840N7239r5026j1179o5665o231k0621J40902j3348j48228N0372J53257
22423I0312j30337n5458J40427J53174P4840J4311o2541j43499j25481l7307m5104
22412a26663J19774J06895P3642n0249M1033J09784j5830j13081n8734J62015
$$ plain form
22402 248586 315747 219794 80185 126975 166899 263567 399415 326782 269045 339496 327984
22391 327984 257889 272077 125579 26122 -140714 -100250 193046 169590 42130 -200371
22381 -200371 -328592 76784 179540 61865 35567 78570 70669 -55389 -142440 -78816 13048
22370 13048 57168 -40294 -7614 156002 261468 303779 312695 208298 180016 234558 358076
22359 358076 327828 7341 -141727 -36094 131587 202640 176276 232975 183109 80920
22349 80920 37676 -133898 -268286 -250904 -132837 -114901 -118361 -56781 34779 52873 44588
22338 44588 5139 -233930 -354430 -247947 -112151 -24318 22275 4630 -123890 -77991 156730
22327 156730 3416 -298224 -313197 -137741 -45330 -57756 113280 66195 51111 2019 114341
$$ packed form
22402B48586O7161r5953j39609M6790L9924R6668J35848p2633n7737P0451j1512
22391C27984p0095J4188j46498r9457j66836M0464K93296k3456j27460k42501
22381b00371j28221M05376J02756j17675k6298M3003p901j26058q7051O3624R1864
22370A3048M4120r7462L2680J63616J05466M2311Q916j04397k8282N4542J23518
22359C58076l0248l20487j49068J05633J67681P1053k6364N6699m9866j02189
22349H0920m3244j71574j34388J7382J18067J7936l460O1580R1560J8094q285
22338D4588l9449k39069j20500J06483J35796Q7833M6593j7645j28520M5899K34721
22327A56730j53314l01640j4973J75456R2411j2426J71036m7085j5084m9092J12322
$$ plain form
22316 114341 -6322 -148687 -143818 -87703 -117668 -182845 -323829 -233719 92624 221974 104465
22305 104465 49757 32679 109220 101977 113333 74210 162895 73216 -102229 -194152 -109916
22294 -109916 -126284 -23110 1710 89585 84651 194111 171582 214524 226994 211487 301075
22283 301075 177824 69465 -86876 -100044 -100100 -189792 -144578 -276476 -216578 -97692 -41572
22272 -41572 -263970 -278010 1601 139826 112422 217458 390662 420216 405472 377852 229282
22261 229282 128922 92419 64699 123327 79218 220185 295481 203285 12890 145144 133964
22250 133964 149166 128618 43816 -73847 -41065 -51955 -208707 -285370 -255449 -302284 -198349
22239 -198349 -71786 51374 176862 121672 17593 -106683 -59589 -66734 20973 83299 166945
$$ packed form
22316A14341j20663j42365M869N6115k9965o5177j40984R0110L26343J29350j17509
22305A04465n4708j7078P6541p243J1356l9123Q8685q9679j75445r1923Q4236
22294a09916j6368J03174K4820Q7875m934J09460k2529M2942J2470j5507Q9588
22283C01075j23251j08359j56341j3168n6q9692M5214j31898N9898J18886N6120
22272d1572k22398j4040K79611J38225k7404J05036J73204K9554j4744k7620j48570
22261B29282j00360l6503k7720N8628m4109J40967P5296r2196j90395J32254j1180
22250A33964J5202k0548q4802j17663L2782j0890j56752p6663K9921m6835J03935
22239a98349J26563J23160J25488n5190j04079j24276M7094p145Q7707O2326Q3646
$$ plain form
22228 166945 268740 245408 17918 -2403 -1165 113634 168737 246549 163619 202027 401494
22217 401494 351404 352599 355656 237644 166243 20839 13932 187850 158671 -51082 -132763
22206 -132763 10364 114598 114860 41471 172248 221214 240759 215998 173304 166032 -12810
22195 -12810 -177459 -310062 -101039 10386 -183050 -336016 -205856 -52273 -18960 -5525
22185 -5525 -91334 82431 168075 261182 270487 244826 359502 324421 239677 222848 381171
22174 381171 320598 320015 381461 262035 183506 165040 69739 96692 49466 46205 293723 353022
22162 353022 274234 340339 226351 121582 82839 -9651 101502 200116 144111 56242 23
22151 23 56489 15056 75498 149487 149789 -25729 -67012 -10556 13922 -36087 -51463 -160630
$$ packed form
22228A66945J01795k3332k27490k0321J238J14799N5103P7812q2930L8408J99467
22217D01494n0090J195L057j18012p1401j45404o907J73918k9179k09753q1681
22206a32763J43127J04234K62p3389J30777M8966J9545k4761m2694p272j78842
22195a2810j64649j32603K09023J11425j93436j52966J30160J53583L3313J3435
22185e525q5809J73765Q5644R3107R305k5661J14676l5081q4744j6829J58323
22174C81171o0573n83O1446j19426p8529j8466r5301K6953m7226l261K47518N9299
22162C53022p8788O6105j13988j04769l8743r2490J11153R8614n6005q7869n6219
22151B3N6466m1433O0442P3989L02j75518m1283N6456K4478n0009j5376j09167
$$ plain form
22139 -160630 -200600 -214720 -58433 118546 127878 186706 61815 -170513 -163366 24851 181381
22128 181381 128762 52376 54589 157871 93073 156550 102415 -106867 -127031 -107098 -116528
22117 -116528 -266917 -144746 131076 124562 82594 -18277 18791 127304 195663 120335 -44845
22106 -44845 -74145 -60900 -160726 -143604 -177017 -148817 -248365 -182966 -135630 -76463 -72363 -54762
22094 -54762 -92124 -233646 -100891 -90827 -152108 -293918 -152104 7142 -32640 -84087 -77396
22083 -77396 60811 32170 -119673 -116428 -111403 -70166 19599 35894 -60462 -60675 -80196 -25243
22071 -25243 -29084 136724 251299 167960 174756 74444 -24325 48847 110511 -139432 -161757
22060 -161757 -55878 -10916 -68459 -232757 -313559 -208793 -9045 290629 253728 248627 249972
$$ packed form
22139a60630l9970j4120J56287J76979R332N8828j24891k32328P147J88217J56530
22128A81381n2619p6386K213J03282o4798O3477n4135k09282k0164J9933r430
22117a16528j50389J22171K75822o514m1968j00871L7068J08513O8359p5328j65180
22106d4845k9300J3245r9826J7122l3413K8200r9548O5399M7336N9167M100J7601
22094e4762l7362j41522J32755J0064o1281j41810J41814J59246l9782n1447O691
22083g7396J38207k8641j51843L245N025M1237Q9765J6295r6356k13j9521N4953
22071b5243l841J65808J14575q3339O796j00312r8769P3172O1664k49943k2325
22060a61757J05879M4962n7543j64298q0802J04766J99748K99674l6901n101J345
$$ plain form
22049 249972 129785 58963 49287 -111975 -96037 -108460 -111318 -160022 -90083 37265 235907
22038 235907 236597 47516 42211 84542 105107 -169980 -323397 -211307 23949 41477 47939
22027 47939 138854 447 -158802 -136642 -63890 62192 -2822 -119747 -47085 4245 -62525
22016 -62525 57397 154081 70046 47114 -66125 -187781 -172370 -137863 -151638 -186366 -140372
22005 -140372 75395 13099 -40239 -20538 -20909 -13519 -72548 -47579 -99979 -65481 -17953 -174270
21993 -174270 -274786 -172936 -158955 -153469 1012 51867 231592 352294 267522 51245
21983 51245 939 2872 234765 234104 71630 -237397 -264659 -145431 -142091 -142292 -52492 176409
21971 176409 399258 66110 -64804 56801 69494 89972 -86714 -256733 -421526 -359446
$$ packed form
22049B49972j20187p0822r676j61262J5938j2423k858m8704O9939J27348J98642
22038B35907O90j89081n305M2331K0565k75087j53417J12090K35256J7528O462
22027D7939R0915j38407j59249K2160P2752J26082o5014j16925P2662N1330o6770
22016f2525J19922R6684q4035k2932j13239j21656J5411L4507j3775l4728M5994
22005a40372K15767o2296n3338J9701l71P390n9029K4969n2400L4498M7528j56317
21993a74270j00516J01850J3981N486J54481N0855J79725J20702q4772k16277
21983E1245n0306J933K31893o61j62474l09027k7262J19228L340k01Q9800K28901
21971A76409K22849l33148j30914J21605J2693K0478j76686j70019j64793O2080
$$ plain form
21961 -359446 -342130 -233919 -252829 -48481 47101 163198 69484 -202917 -280802 -159018
21951 -159018 -40530 32653 -69641 24386 73647 71204 122603 168097 184989 140849 4018
21940 4018 -73073 -161029 -266362 -238478 -173202 -62189 114036 17463 188798 113378 35504
21929 35504 13752 -143103 -178845 -59496 20795 -51053 121653 133666 -12493 129557 52385
21918 52385 -36254 -9900 -21354 -87304 -254492 -277409 -149425 -45329 52386 -34788 -201479
21907 -201479 -104939 57266 -140984 1221 40912 -139229 -49087 -31833 3023 36463 -9283
21896 -9283 30488 119724 86263 -65973 -67373 -62211 62164 -114435 -350384 -274743 -245329
21885 -245329 -460602 -315357 -59002 -82260 55393 323188 290770 366928 459959 325389
$$ packed form
21961c59446J7316J08211j8910K04348R5582J16097r3714k72401p7885J21784
21951a59018J18488P3183j02294R4027M9261k443N1399M5494J6892m4140j36831
21940D018p7091q7956j05333K7884O5276J11013J76225r6573J71335p5420p7874
21929C5504k1752j56855l5742J19349Q0291p1848J72706J2013j46159J42050p7172
21918E2385q8639K6354j1454o5950j67188k2917J27984J04096R7715q7174j66691
21907b01479R6540J62205j98250J42205L9691j80141R0142J7254L4856L3440m5746
21896i283L9771Q9236l3461j52236j400N162J24375j76599k35949P5641K9414
21885b45329k15273J45245K56355k3258J37653K67795l2418P6158R3031j34570
$$ plain form
21875 325389 12944 -47202 16391 -111993 -200965 -50612 -165928 -186100 -188960 -90277 61954
21864 61954 185939 265601 114282 -162840 -133318 -125809 -251813 -218751 -199157 -260730 -345928
21853 -345928 -298135 -151341 -79019 -218497 -179538 -24461 81853 62204 -47166 -136920
21843 -136920 -212777 68905 267389 187411 189202 199518 19963 147721 72939 -6564 20194
21832 20194 -50454 -194507 -206030 -3818 47043 -31691 -112304 -114534 -164374 -266950 -331934
21821 -331934 -362585 -317418 -158188 -215301 -344221 -153823 -93273 -156001 -96184 -108214 -135984
21810 -135984 117481 171192 67854 -68406 -299016 -465568 -426553 -369614 -401177 -505613
21800 -505613 -426722 -406499 -306420 -294639 -405643 -293623 -70272 -9693 19115 152848
$$ packed form
21875C25389l12445o0146O3593j28384q8972J50353j15316k0172k860R8683J52231
21864F1954J23985P9662j51319k77122K9522P509j26004L3062J9594o1573q5198
21853c45928M7793J46794P2322j39478L8959J55077J06314j9649j09370q9754
21843a36920p5857K81682J98484p9978J791J0316j79555J27758p4782p9503K6758
21832B0194p0648j44053j1523K02212N0861p8734q0613k230m9840j02576o4984
21821c31934l0651M5167J59230n7113j28920J90398O0550o2728N9817j2030k7770
21810a35984K53465N3711j03338j36260k30610j66552L9015N6939l1563j04436
21800e05613P8891K0223J00079J1781j11004J12020K23351O0579K8808J33733
$$ plain form
21790 152848 284904 146194 93336 46190 28975 -207362 -352433 -355876 -113429 -7949
21780 -7949 -9994 7079 24780 132079 150362 -104216 -261579 -179373 74750 12798 -127835
21769 -127835 -189881 -130472 -206202 -229996 -114741 -6630 73364 109344 215819 302609 190267
21758 190267 35892 -129934 -57959 187291 -54869 -243203 -118876 -46891 -122535 -64026
21748 -64026 -95263 -191312 -244753 -70766 -112375 -121980 -19264 69846 31183 -66589 -155084
21737 -155084 -127127 -157644 -38267 -38664 15224 109288 -65522 -94903 77975 135876 550
21726 550 15166 79611 135843 261453 268243 379387 465211 314633 163140 166043 -7019
21715 -7019 53051 89864 20171 -166903 -30169 32845 65717 78721 62198 -44252 -168925
$$ packed form
21790A52848J32056j38710n2858m7146j7215k36337j45071l443K42447J05480
21780g949k045J7073J7701J07299J8283k54578j57363Q2206K54123o1952j40633
21769a27835o2046N9409p5730k3794J15255J08111P9994L5980J06475Q6790j12342
21758A90267j54375j65826P1975K45250k42160j88334J24327P1985p5644N8509
21748f4026l1237r6049n3441J73987m1609r605J02716Q9110l8663r7772q8495
21737a55084K7957l0517J19377l97N3888R4064j74810k9381J72878N7901j35326
21726E50J4616O4445N6232J25610O790J11144Q5824j50578j51493K903j73062
21715g019O0070L6813o9693j87074J36734O3014L2872J3004j6523j06450j24673
$$ plain form
21704 -168925 -250491 -291986 -48394 98559 -52072 -174457 -35385 33936 -137119 -280775
21694 -280775 -73638 136353 -24976 -250831 -167796 1899 68188 98196 139667 24296
21684 24296 48999 80087 2102 93681 229414 235227 220691 59880 -27482 -10686 14183
21673 14183 103836 186533 96485 92259 200386 158348 31517 -10118 -52815 -128462 -177365
21662 -177365 -349779 -271499 -193799 -298412 -372192 -104432 -106754 -181993 -249690 -124977 -64184
21651 -64184 76401 225327 161116 130074 211964 217221 225623 42659 93465 124947 96680
21640 96680 49244 -175089 -247901 -193303 -88764 64337 55741 -56842 -28196 -54196 -38768
21629 -38768 84581 162564 48381 -153698 -324099 -260190 32719 41892 9293 -31964 -36178
$$ packed form
21704a68925q1566m1495K43592J46953j50631j22385J39072O9321j71055j43656
21694b80775K07137K09991j61329k25855Q3035J69695O6289L0008M1471j15371
21684B4296K4703L1088p7985R1579J35733N813j4536j60811q7362J6796K4869
21673A4183Q9653Q2697r0048m226J08127m2038j26831m1635m2697p5647m8903
21662a77365j72414P8280P7700j04613p3780K67760k322p5239o7697J24713O0793
21651f4184J40585J48926o4211l1042Q1890N257Q402j82964N0806L1482k8267
21640I6680m7436k24333p2812N4598J04539J53101q596j12583K8646k6000J5428
21629c8768J23349P7983j14183k02079j70401O3909K92909R173l2599m1257m214
$$ plain form
21618 -36178 -34160 52551 -144429 -365498 -260677 -86319 -203188 -134492 -125175 -261177 -213292
21607 -213292 -107925 92502 310325 255702 238200 313990 415029 495085 244563 172322
21597 172322 339721 295764 186505 63740 -122995 -219063 -98104 -216027 -396467 -368825
21587 -368825 -416120 -255394 -178678 -273169 -278718 -202606 -307539 -211295 17832 44436 28542
21576 28542 -67487 -67725 -110517 -61325 -44009 -139594 -88153 -42877 -75763 -241731 -235903 -144671
21564 -144671 69046 126393 52115 128097 181277 114952 69571 68439 10980 -164122 -167399
21553 -167399 -84736 56933 227666 106351 64100 50122 -93963 -89554 -168317 -311701 -240279
21542 -240279 -222147 -191175 -210814 -215808 -244943 -260244 -263915 -362033 -300497 -154417 4827
$$ packed form
21618c6178K018Q6711j96980k21069J04821J74358j16869O8696R317j36002M7885
21607b13292J05367K00427K17823n4623j7502P5790J01039Q0056k50522p2241
21597A72322J67399m3957j09259j22765j86735r6068J20959j17923j80440K7642
21587c68825m7295J60726P6716r4491n549P6112j04933R6244K29127K6604j5894
21576B8542r6029k38m2792M9192J7316r5585N1441M5276l2886j65968N828R1232
21564a44671K13717N7347p4278P5982N3180o6325m5381j132n7459j75102l277
21553a67399Q2663J41669J70733j21315m2251j3978j44085M409p8763j43384P1422
21542b40279J8132L0972j9639m994k9135j5301l671r8118O1536J46080J59244
$$ plain form
21531 4827 99810 -49481 115705 321004 254591 181625 193363 211621 143810 135696 256314
21520 256314 321348 278975 152714 120817 102280 67335 -42448 6380 117712 101480 33449
21509 33449 -56332 -43704 59601 52052 92099 147769 -83673 -184868 -147222 -222570 -78932
21498 -78932 133903 -76216 -132857 -164922 -287174 -234841 -37695 83506 52328 37934 81038
21487 81038 241043 263005 4363 -25753 100078 -69434 -93468 82114 87361 -119627 -173748
21476 -173748 -115021 -193178 -125746 -86053 106419 119686 -201467 -304579 -220918 -306939 -206161
21465 -206161 -146652 -90696 109366 202316 217175 207950 276531 298945 71208 -46004 81061
21454 81061 244505 250708 182808 158557 17690 37881 -59367 -254728 -260776 -82862 142570
$$ packed form
21531D827R4983j49291J65186K05299o6413p2966J1738J8258o7811q114J20618
21520B56314O5034m2373j26261l1897j8537l4945j09783M8828J11332j6232o8031
21509C3449q9781J2628J03305p549M0047N5670k31442j01195L7646p5348J43638
21498g8932K12835k10119n6641l2065j22252N2333J97146J21201l1178j4394M3104
21487H1038J60005K1962k58642l0116J25831j69512k4034J75582N247k06988n4121
21476a73748N8727p8157O7432L9693J92472J3267l21153j03112Q3661q6021J00778
21465b06161N9509N5956K00062R2950J4859r225O8581K2414k27737j17212J27065
21454H1061J63444O203o7900k4251j40867K0191r7248j95361o048J77914K25432
$$ plain form
21443 142570 209361 208774 131366 44382 65684 -21277 33439 -54397 -186954 -368300 -438648
21432 -438648 -220569 41862 14029 -103339 -241370 -308658 -293012 -157534 -79269 -22805
21422 -22805 -14035 65432 167029 67212 6333 -19431 36948 7325 -158041 -220531 -111525
21411 -111525 -28409 -18235 41699 245007 252989 235782 201511 98926 -19520 -60554 50716
21400 50716 145856 192815 7005 -28741 112661 -9796 52583 71654 -46632 -222570 -209094
21389 -209094 -68924 65771 29650 -145415 -260040 -323766 -265671 -169273 -158494 -168235 -146126
21378 -146126 -205757 -161678 -85510 8796 -243808 -386248 -230804 -49133 133011 14652
21368 14652 55382 20331 -20768 -40391 -101608 -71838 -123656 -93582 43217 197775 302425
$$ packed form
21443A42570O6791n87p7408q6984K1302q6961N4716q7836j32557j81346p0348
21432d38648K18079K62431k7833j17368j38031o7288J5646J35478P8265N6464
21422b2805Q770P9467J01597r9817o0879k5764N6379k9623j65366o2490J09006
21411a11525Q3116J0174N9934K03308P982j7207l4271j02585j18446m1034J11270
21400E0716R5140M6959j85810l5746J41402j22457O2379J9071j18286j75938J3476
21389b09094J40170J34695l6121j75065j14625o3726N8095R6398J0779r741K2109
21378a46126n9631M4079P6168R4306k52604j42440J55444J81671J82144j18359
21368A4652M0730l5051m1099j9623o1217K9770n1818L0074J36799J54558J04650
$$ plain form
21357 302425 256260 80140 26409 34555 57111 87415 -30452 -229621 -359796 -255962 -147362
21346 -147362 -96282 -19018 63942 -81551 -130523 -130734 -227387 -198478 -132872 -102198 -157908 -308439
21334 -308439 -229368 -104908 50314 -94521 -128993 15979 -94693 -199808 -43460 -32316
21324 -32316 -59175 -81535 -297730 -301522 -163418 -171838 -41777 7895 22859 112326 283633
21313 283633 289524 138032 88227 -52877 -242318 -457838 -349413 -3258 223835 333505
21303 333505 289706 178489 66937 -66866 64126 123635 88713 42802 4669 73250 25175
21292 25175 -108130 -58317 68345 85738 162152 330785 181245 71954 46758 16364 84345
21281 84345 358447 442957 297915 79470 93116 199536 150028 -49722 205966 319333
$$ packed form
21357C02425m6165j76120n3731Q146K2556L0304j17867j99169j30175J03834J08600
21346a47362N1080P7264Q2960j45493m8972k11r6653K8909O5606L0674n5710j50531
21334c08439P9071J24460J55222j44835l4472J44972j10672j05115J56348J1144
21324c2316k6859k2360k16195l792J38104q420J30061M9672J4964Q9467J71307
21313B83633N891j51492m9805j41104j89441k15520J08425L46155K27093J09670
21303C33505m3799j11217j11552j33803J30992N9509l4922m5911l8133O8581m8075
21292B5175j33305M9813J26662J7393P6414J68633j49540j09291k5196l0394O7981
21281H4345K74102Q4510j45042k18445J3646J06420m9508j99750K55688J13367
$$ plain form
21271 319333 209141 85503 -15009 -185767 -239435 -235636 -111922 -192917 -161152 -97213 -6809
21260 -6809 -127261 -75490 6660 -34658 32165 79481 -94005 -396323 -379101 -318589 -241855
21249 -241855 -106330 -109623 -153453 -127549 -60722 -76207 -82414 -155486 -343987 -336924 -155586
21238 -155586 -102976 69849 105605 7052 145697 118661 -54219 -77515 -215741 -145275 44440
21227 44440 19536 -100603 -51506 43423 42159 31521 99876 136012 13641 -173272 71652
21216 71652 162083 185870 196984 126677 25968 19522 -78829 57879 159376 173365 295044
21205 295044 221932 90476 -28899 -38229 115716 82928 26196 -80800 -189281 -181941 -23755
21194 -23755 269223 379879 178263 -76565 -74305 -61788 -53931 15430 134898 70663 212659
$$ packed form
21271C19333j10192j23638j00512j70758n3668L799J23714q0995L1765O3939R0404
21260f809j20452N1771Q2150m1318O6823M7316j73486l02318J7222O0512P6734
21249b41855J35525l293m3830K5904O6827j5485o207p3072j88501P063J81338
21238a55586N2610J72825L5756r8553J38645k7036j72880k3296j38226P0466J89715
21227D4440k4904j20139M9097R4929j264j0638O8355L6136j22371j86913K44924
21216G1652R0431K3787J1114p0307j00709o446r8351J36708J01497J3989J21679
21205B95044p3112j31456j19375r330J53945l2788n6732j06996j08481P340J58186
21194b3755K92978J10656k01616k54828K260J2517P857O9361J19468o4235J41996
$$ plain form
21183 212659 192823 153657 92166 140143 94528 97575 239467 287443 423636 366292 213224
21172 213224 179914 -58036 -176347 -206701 -205410 -159816 6297 195197 264029 120343 80099
21161 80099 84866 83337 168401 151594 179108 248950 -97193 -179208 -130833 -18686 86612
21150 86612 29926 -52130 -25202 55201 219163 155898 232438 152661 -180959 -281152 -298624
21139 -298624 -192737 -132515 -7070 149601 215700 69336 -49702 -164589 -176567 -199995
21129 -199995 -204009 -55265 58277 107654 84508 151456 101919 44913 -38639 -54830 -198088
21118 -198088 -100465 40819 42762 -134241 -112815 -119190 -91884 5573 131411 170015 199734
21107 199734 48619 126009 278723 267097 -20074 -269611 -398274 -185305 -157032 -128859
$$ packed form
21183B12659j9836l9166o1491M7977m5615L047J41892M7976J36193n7344j53068
21172B13224l3310k37950j18311l0354J291M5594J66113J88900O8832j43686m0244
21161H0099M767j529Q5064j6807K7514O9842l46143q2015M8375J12147J05298
21150H6612n6686q2056K6928Q0403J63962o3265P6540p9777l33620j00193j7472
21139b98624J05887O0222J25445J56671O6099j46364j19038j14887j1978k3428
21129a99995m014J48744J13542M9377k3146O6948m9537n7006q3552j6191j43258
21118a98088R7623J41284J943j77003K1426o375K7306R7457J25838L8604K9719
21107A99734j51115P7390J52714j1626k87171k49537j28663K12969K8273K8173
$$ plain form
21097 -128859 -62248 -145676 -217419 -177928 -139991 -48801 94254 107785 122643 159141 -650
21086 -650 -95260 -89995 -200932 -352590 -291817 -228086 -211853 -144561 -140812 -183197 -155281 -252105
21074 -252105 -172712 -157856 42808 181025 213545 171669 -89418 -37041 -42177 -109544 -154537
21063 -154537 -48366 64484 -8696 -81235 -116919 -19800 -1689 -145351 -219740 -165293 -42830
21052 -42830 -18136 151508 90814 109307 190259 266394 147332 -124743 -257367 -75430 -32292
21041 -32292 -38502 -41570 152884 131174 21147 -146842 -269533 -233021 -188541 -18061 139328
21030 139328 159436 200168 297877 265580 147263 152960 239349 389139 313062 134977 208910
21019 208910 156610 -65994 -38395 151392 105651 10101 -79023 -73617 -81001 -66332 -26976
$$ packed form
21097a28859O6611q3428p1743L9491L7937R1190J43055J3531J4858L6498j59791
21086f50r4610N265j10937j51658O0773O3731J6233O7292L749m2385K7916r6824
21074b52105P9393J4856K00664J38217L2520m1876k61087N2377n136o7367m4993
21063a54537J06171J12850p3180p2539l5684R7119J8111j43662p4389N4447J22463
21052d2830K4694J69644o0694J8493Q0952P6135j19062k72075j32624J81937M3138
21041c2292o210l068J94454k1710j10027j67989j22691L6512M4480J70480J57389
21030A39328K0108M0732R7709l2297j18317N697Q6389J49790p6077j78085P3933
21019B08910n2300k22604K7599J89787m5741r5550q9124N406p384J4669L9356
$$ plain form
21008 -26976 -84634 -110916 -235660 -196907 -33725 24011 -12884 -86634 18203 165070 94285
20997 94285 -35899 -37519 -86095 -275306 -312352 -287508 -307684 -290151 -212915 -144718 42498
20986 42498 -12562 -102484 -129767 -201911 -174570 -90382 856 239857 400157 293618 78066
20975 78066 67488 -9168 -140873 -153394 14752 98762 77548 222695 173339 230523 197913
20964 197913 17609 -111857 -19658 -35746 13482 -273242 -428996 -281915 -99485 -163795
20954 -163795 -130475 -202764 -59059 174454 244888 153282 145167 169473 -56427 -57905 -51167
20943 -51167 8502 -25044 -154700 -156717 -28999 51362 -106588 -224385 -60396 40767 -82133
20932 -82133 -109922 -85153 -17563 37210 110580 -105174 -303309 -390216 -284204 -227002 -258882
$$ packed form
21008b6976n7658k6282j24744L8753J63182N7736l6895p3750J04837J46867p0785
20997I4285j30184j620m8576j89211l7046K4844k0176J7533P7236O8197J87216
20986D2498n5060q9922k7283p2144K7341Q4188R1238K39001J60300j06539k15552
20975G8066j0578p6656j31705j2521J68146Q4010k1214J45147m9356N7184l2610
20964A97913j80304j29466R2199j6088M9228k86724j55754J47081J82430o4310
20954a63795L3320p2289J43705K33513P0434r1606q115K4306k25900j478O738
20943e1167N9669l3546j29656k017J27718Q0361j57950j17797J63989J01163j22900
20932h2133k7789K4769O7590N4773P3370k15754j98135q6907J06012N7202l1880
$$ plain form
20921 -258882 -304901 -279266 -217544 -138770 -24502 -49920 -62849 -43701 -3596 338 -90074
20910 -90074 -269223 -459206 -368733 -167756 -111364 8140 60659 -45660 -111911 -267521
20900 -267521 -216934 23249 40019 52708 121257 150727 221610 274547 59471 -106566 -18179
20889 -18179 109779 96561 100178 249398 350686 421102 400745 285746 36907 197853 162784
20878 162784 4670 -239145 -250034 -253815 -148067 -167280 -230343 -178916 -78908 -18157 -103899
20867 -103899 -177787 -185997 -199810 -248310 -166142 13889 126204 124921 -88470 -134919 -115548
20856 -115548 -66436 152919 325236 348873 169602 28436 -144222 -61396 -181344 -285420
20846 -285420 -314428 -223440 -151438 -144343 -164280 -128255 -44965 -142046 -242952 16541 8896
$$ packed form
20921b58882m6019K5635O1722P8774J14268k5418j2929J9148M0105L934r0412
20910i0074j79149j89983R0473K00977N6392J19504N2519j06319o6251j55610
20900b67521N0587K40183J6770J2689O8549K9470P0883N2937k15076j66037Q8387
20889a8179J27958j3218L617J49220J01288P0416k0357j14999k48839J60946l5069
20878A62784j58114k43815j0889l781J05748j9213o3063N1427J00008O0751q5742
20867a03899p3888q210j3813m8500Q2168J80031J12315j283k13391m6449J9371
20856a15548M9112K19355J72317K3637j79271j41166j72658Q2826j19948j04076
20846b85420k9008R0988P2002P095j9937L6025Q3290r7081j00906K59493p645
$$ plain form
20835 8896 -19829 60137 200594 207220 153986 -177953 -91503 176365 -66081 -282629 -266680
20824 -266680 -169481 -55630 -30502 -192040 -178642 -145340 -67588 -242935 -264879 -41095 56378
20813 56378 77051 110637 -51726 -173257 -253214 -290035 -190566 -139896 -178220 -52771 2454
20802 2454 68287 32245 -250204 -291772 -27499 86316 125514 62415 165809 124534 29930
20791 29930 39812 -8938 -106932 -98722 -13335 33091 25392 7939 -61292 -48051 -56844 -175222
20779 -175222 -235984 -70564 -12466 -179734 -204417 -77543 31350 -34696 -73553 -114257 -120102
20768 -120102 -138188 -251654 -138879 -101491 21057 19528 4812 -43337 -80095 -199744 -409382
20757 -409382 -390244 -294680 -203338 -137583 -55376 120548 166077 58811 -24945 -223278 -310508
$$ packed form
20835H896k8725P9966J40457O626n3234l31939Q6450K67868k42446k16548J5949
20824b66680R7199J13851K5128j61538J3398L3302P7752j75347k1944K23784R7473
20813E6378K0673L3586j62363j21531p9957l6821R9469N0670l8324J25449N5225
20802B454O5833l6042k82449m1568K64273J13815L9198o3099J03394m1275r4604
20791B9930R882m8750r7994Q210Q5387M6426p699j7453o9231J3241q793j18378
20779a75222o0762J65420N8098j67268k4683J26874J08893o6046l8857m0704n845
20768a20102j8086j13466J12775L7388J22548j529j4716m8149l6758j19649k09638
20757d09382J9138R5564R1342O5755Q2207J75924M5529j07266q3756j98333q7230
$$ plain form
20746 -310508 -123734 -5274 -5343 -72913 -144276 -128359 -63534 65717 170446 44860 -41094
20735 -41094 -17819 16013 17899 174083 135774 67392 -35511 -41435 71369 -49426 -10267
20724 -10267 54336 -95373 -224206 -82314 172032 318453 474245 337089 340271 244436
20714 244436 262752 243328 179326 117136 8620 14173 -97727 -133722 -96489 14270 -8564
20703 -8564 -48870 56590 221851 93239 -172994 -301101 -91194 -88297 -67752 -30507 -31459
20692 -31459 -78500 38840 160241 310254 286992 256749 215455 176492 288256 334931 303910
20681 303910 100879 64632 202539 259213 100319 -50397 -60418 -133023 -49195 -94418 -25490
20670 -25490 -11879 -166626 -180169 -86353 -163593 -174200 -100114 -103792 -244053 -183052 -142350
$$ packed form
20746c10508J86774J18460o9o7570p1363J5917O4825J29251J04729j25586q5954
20735d1094K3275L3832J886J56184l8309o8382j02903n924J12804j20795L9159
20724a0267O4603j49709j28833J41892K54346J46421J55792j37156L182r5835
20714B44436J8316j9424o4002o2190j08516N553j11900l5995L7233J10759k2834
20703h564m0306J05460J65261j28612k66233j28107K09907K897K0545L7245r52
20692c1459m7041J17340J21401J50013k3262l0243m1294l8963J11764M6675l1021
20681C03910k03031l6247J37907N6674j58894j50716j0021p2605Q3828m5223O8928
20670b5490J3611j54747j3543R3816p7240j0607P4086l678j40261O1001M0702
$$ plain form
20659 -142350 -25485 -37692 -31294 -137392 -153350 -44423 51605 126308 -85898 -13712 120236
20648 120236 70690 -63493 -71841 79464 74699 -4963 -256810 -294108 -153992 -168786 -272653
20637 -272653 -271250 -62368 73325 185351 282843 208895 205095 87744 -64186 -146516 26368
20626 26368 241689 123676 -225186 -263454 -226194 -91400 -98659 -194396 -310277 -253093 -362529
20615 -362529 -358148 -278290 -138195 -139970 -278470 -243724 -203405 -112914 -74505 -24702 89446
20604 89446 33984 -33283 127842 58788 -25800 2272 62587 -267826 -341687 -237150 -378697
20593 -378697 -305640 -124665 25333 -79075 -190510 -321693 -294135 -278546 -21067 76069
20583 76069 -50335 -109082 -144285 -208988 -372740 -285056 -251210 -333852 -288787 -93820 27908
$$ packed form
20659a42350J16865j2207O398j06098j5958J08927R6028P4703k12206P2186J33948
20648A20236m9546j34183q348J51305m765p9662k51847l7298J40116j4794j03867
20637b72653J403K08882J35693J12026R7492p3948l800j17351j51930q2330J72884
20626B6368K15321j18013l48862l8268L7260J34794p259r5737j15881N7184j09436
20615c62529M381P9858J40095j775j38500L4746M0319R0491L8409M9803J14148
20604H9446n5462o7267J61125o9054q4588K8072O0315l30413p3861J04537j41547
20593c78697P3057J80975J49998j04408j11435j31183K7558J5589K57479R7136
20583G6069j26404n8747l5203o4703j63752Q7684L3846q2642M5065J94967J21728
$$ plain form
20572 27908 23578 35505 -157518 -237125 -203938 14384 169720 65342 62669 22142 16504
20561 16504 -34128 31505 84057 -25147 10995 117050 -141244 -396456 -397305 -161211 -118652
20550 -118652 17269 145077 242470 289018 221506 -41875 -80912 -38989 -71381 -80801 -80366
20539 -80366 -114897 -71644 -20447 153604 106409 4148 140833 311824 131687 189440 278892
20528 278892 160153 114065 207230 256430 131507 60861 25249 -115930 -190785 -137597 -105009
20517 -105009 -61056 -167501 -282391 -353392 -307677 -78180 14573 -5470 21343 98847 104753
20506 104753 -157883 -211499 -75120 38315 49803 32281 189508 130537 88649 30909 6057
20495 6057 11222 -168241 -314611 -314320 -139564 -150209 -270314 -182932 -63962 913 -26716
$$ packed form
20572B7908m330J1927j93023p9607L3187K18322J55336j04378k673m0527n638
20561A6504n0632O5633N2552j09204L6142J06055k58294k55212q49K36094M2559
20550a18652J35921J27808R7393M6548o7512k63381l9037M1923l2392r420M35
20539h0366l4531M3253N1197J74051m7195j02261J36685J70991j80137N7753Q9452
20528B78892j18739m6088R3165M9200j24923p0646l5612j41179p4855N3188L2588
20517a05009M3953j06445j14890p1001M5715K29497R2753k0043K6813P7504N906
20506A04753k62636n3616J36379J13435J1488j7522J57227n8971m1888n7740k4852
20495F057N165j79463j46370K91J74756j0645j20105Q7382J18970O4875k7629
$$ plain form
20484 -26716 -95951 42898 160402 119282 139979 61847 27356 -15514 -178140 -194606 -15899
20473 -15899 -110588 -172983 -315895 -425469 -250253 -66292 -75104 -23445 -95959 -90217 -201373
20462 -201373 -97411 124364 105908 -78339 -160007 -168830 -195588 -145196 -72498 -124839 -242989
20451 -242989 -373044 -174321 36101 52070 -5446 -74548 573 111441 -99036 -321693
20441 -321693 -352352 -101348 -35310 -202248 -211854 -141812 -118660 -157821 -162452 -143734 -6101
20430 -6101 -17724 2369 -128878 -212173 -83218 151141 74487 -26526 -142679 -326604 -378807
20419 -378807 -316815 -249885 -44500 125759 96788 121484 163581 187261 164127 163729 65850
20408 65850 41484 -9620 51010 234225 -50329 -310141 -234122 -152970 -82583 -47639 -107686
$$ packed form
20484b6716o9235J38849J17504m1120K0697p8132l4491m2870j62626j6466J78707
20473a5899r4689o2395j42912j09574J75216J83961q812N1659p2514N742j11156
20462b01373J03962K21775j8456j84247q1668q823k6758N0392P2698n2341j18150
20451b42989j30055J98723K10422J5969n7516o9102P5121J10868k10477k22657
20441c21693l0659K51004O6038j66938r606P0042K3152l9161m631J8718J37633
20430f101j1623K0093j31247q3295J28955K34359p6654j01013j16153j83925n2203
20419c78807O1992O6930K05385J70259k8971K4696M2097K3680k3134l98r7879
20408F5850k4366n1104O0630J83215k84554k59812P6019Q1152P0387L4944o0047
$$ plain form
20397 -107686 -229628 -317005 -246176 -102373 -254931 -353222 -455985 -361443 -134667 -88398
20387 -88398 82754 64039 -96441 -243649 -314347 -330632 -216989 -79377 39938 172521
20377 172521 125039 17276 -137243 -12474 -71635 -296001 -200011 -56664 -120170 -74812
20367 -74812 -146280 -144970 -137218 -119260 -209922 -328862 -380166 -481074 -489733 -296147 -165662
20356 -165662 6059 89380 -30079 -42012 65534 61417 24816 111008 43487 -208023 -321877
20345 -321877 -198935 -121167 -14400 -17694 95308 204167 189312 285403 243276 309143 265933
20334 265933 85146 -89296 14249 72992 -81796 -79409 -59940 -4632 -173172 -199196 -77120
20323 -77120 160641 177932 87410 96835 149493 42836 -52361 -269028 -164090 -18025 -71890
$$ packed form
20397a07686j21942q7377P0829J43803j52558r8291j02763R4542K26776M6269
20387h8398J71152j8715j60480j47208p0698j6285J13643J37612J19315J32583
20377A72521m7482j07763j54519J24769n9161k24366R5990J43347o3506M5358
20367g4812p1468J310P752J7958r0662j18940n1304j00908q659J93586J30485
20356a65662J71721Q3321j19459j1933J07546m117l6601Q6192o7521k51510j13854
20345c21877J22942P7768J06767l294J13002J08859j4855R6091m2127O5867m3210
20334B65933j80787j74442J03545N8743j54788K387J9469N5308j68540k6024J22076
20323g7120K37761J7291r0522R425N2658j06657r5197k16667J04938J46065n3865
$$ plain form
20312 -71890 -12642 76638 52517 -122060 6566 -40840 -178569 -176194 41193 -40797 -80920
20301 -80920 9319 129131 100681 261967 299507 250112 183532 119007 90606 -2648 231920
20290 231920 373267 184708 107974 51622 -50669 -28510 12629 -60785 16433 -26790 -116899
20279 -116899 -82473 17024 -44484 -156794 -158527 -273727 -244504 -252 32736 54979 54615
20268 54615 -24496 -56985 28586 -76511 -118167 -7560 -79246 24548 88798 35650 -200397
20257 -200397 -284600 -286545 -219145 -99000 -22547 -135555 -188218 69149 202965 -4866 2493
20246 2493 -1906 55790 2349 -128673 -409465 -387796 -465454 -343231 -286037 -278801 -231318 -255773
20234 -255773 -378833 -250746 24199 17372 -35620 -120986 39468 9867 -58720 -29191 -25912
$$ packed form
20312g1890N9248Q9280k4121j74577J28626m7406j37729K375K17387q1990m0123
20301h0920R0239J19812k8450J61286L7540m9395o6580o4525k8401r3254K34568
20290B31920J41347j88559p6734n6352j02291K2159M1139p3414P7218m3223r0109
20279a16899L4426R9497o1508j12310j733j15200K9223K44252L2988K2243l64
20268E4615p9111l2489Q5571j05097m1656J10607p1686J03794O4250n3148k36047
20257b00397q4203j945O7400J20145P6453j13008n2663K57367J33816k07831P359
20246B493m399N7696n3441j31022k80792K1669p7658J22223N7194P236M7483k4455
20234b55773j23060J28087K74945o827n2992q5366J60454k9601o8587K9529L279
$$ plain form
20223 -25912 -97027 -75931 -91662 -71426 -53197 163429 205038 146790 147333 190705 35923 -57498
20211 -57498 -210327 -300306 -371394 -208215 16923 47036 10948 -49729 -205569 -246866 -265363
20200 -265363 -245645 -96608 151840 339817 87880 38280 -41876 -22983 -100119 16728
20190 16728 212015 349596 193691 67319 -23775 -131342 -164160 -124405 -70187 -16836 -51617
20179 -51617 20619 -8768 -8221 194884 201846 196424 181084 219544 200083 106265 91052 -128039
20167 -128039 -148528 -34311 -84700 -165535 -223027 -364391 -314613 -211291 -45363 10845 134446
20156 134446 190509 168182 62173 71455 57126 -101623 -51193 -40260 -11207 -79325 -55406
20145 -55406 14815 -60850 -161642 -194623 -67907 9021 -46478 -41350 -15523 -80882 -69240
$$ packed form
20223b5912p1115K1096j5731K0236J8229K16626M1609n8248N43M3372j54782r3421
20211e7498j52829q9979p1088J63179K25138L0113l6088o0677j55840m1297j8497
20200b65363J9718J49037K48448J87977k51937m9600q0156J8893p7136J16847
20190A6728J95287J37581j55905j26372r1094j07567l2818L9755N4218N3351l4781
20179e1617P2236k9387N47K03105O962n422j5340L8460j9461r3818j5213k19091
20167a28039k0489J14217n0389q0835n7492j41364M9778J03322J65928N6208J23601
20156A34446N6063k2327j06009R282j4329j58749N0430J0933K9053o8118K3919
20145e5406P0221p5665j00792l2981J26716P6928n5499N128K5827o5359J1642
$$ plain form
20134 -69240 -33501 -17969 21356 -36098 117499 43228 25668 10261 -58359 -44846 -27501
20123 -27501 -207396 -235081 -310867 -65052 -105637 -365447 -401605 -263656 -5435 217888
20113 217888 167385 16438 -110895 -265693 -232242 -220474 -93749 -49367 -65508 -83546 -148378
20102 -148378 -137448 -109747 -110910 -94399 -50348 -87426 111356 49685 118138 165899 54854
20091 54854 2996 -47072 -36130 -21407 224518 249952 110957 -50385 -157623 1193 5044
20080 5044 -102795 -294750 -171477 -129639 -264886 -301782 -331285 -81103 104477 -52158
20070 -52158 -141017 -118383 -81738 49441 147719 114965 -202552 -227939 -11668 132554 269129
20059 269129 121443 14347 -21287 -45649 90265 70968 -183427 -188168 -123469 -156018 -50799
$$ packed form
20134f9240L5739J5532L9325n7454J53597p4271j7560j5407o8620J3513J7345
20123b7501j79895k7685p5786K45815m0585k59810l6158J37949K58221K23323
20113B17888n0503j50947j27333j54798L3451J1768J26725M4382j6141j8038o4832
20102a48378J0930K7701j163J6511M4051l7078J98782o1671O8453M7761j11045
20091E4854n1858n0068J0942J4723K45925K5434j38995j61342j07238J58816L851
20080E044j07839j91955J23273M1838j35247l6896k9503K50182J85580j56635
20070e2158q8859K2634L6645J31179R8278l2754l17517k5387K16271J44222J36575
20059B69129j47686j07096l5634k4362J35914j9297k54395m741O4699l2549J05219
$$ plain form
20048 -50799 -32848 -71772 -178148 -305371 -332524 -207052 -61453 -48943 -132960 -78085 18271
20037 18271 -59561 -221285 -149399 153735 446292 264040 46557 34898 -126056 -13863
20027 -13863 -14978 24939 100905 112346 136971 9174 -29425 -20238 -102416 -122139 -140327 -117339
20015 -117339 -84685 -21583 50052 -88348 -175399 -195579 -198417 -292566 -163311 -44293 -154256
20004 -154256 -327120 -409393 9138 84526 -58748 -13763 -37472 -152229 -367298 -381080
19994 -381080 -214753 -56000 154513 44401 -11214 -43607 2238 105793 202674 172140
19984 172140 -6980 271763 242764 -117620 -33500 154125 75851 129089 122950 163027 232690
19973 232690 176821 70481 -172203 -34584 -178336 -109960 -132782 -263896 -217757 -120097
$$ packed form
20048e0799J7951l8924j06376j27223k7153J25472J45599J2510q4017N4875R6356
20037A8271p7832j61724P1886L03134K92557j82252k17483j1659j60954J12193
20027a3863j115L9917P5966J1441K4625j27797l8599R187q2178j9723j8188K2988
20015a17339L2654O3102P1635j38400q7051k0180k838r4149J29255J19018j09963
20004a54256j72864q2273M18531P5388j43274M4985k3709j14757k15069j3782
19994c81080J66327J58753K10513j10112n5615l2393M5845J03555R6881l0534
19984A72140j79120K78743k8999l60384Q4120J87625p8274N3238o139M0077O9663
19973B32690n5869j06340k42684J37619j43752O8376k2822j31114M6139R7660
$$ plain form
19963 -120097 -103720 48855 62591 33286 -17773 -300015 -333356 -132312 40126 20782 -133952
19952 -133952 -294485 -225223 -307608 -217175 -127207 -61115 -80632 -73189 -98458 -109751 -245966
19941 -245966 -322959 -217233 -79142 13097 10893 -14877 -86318 28104 46117 108544 117878
19930 117878 8321 41317 119696 138308 191792 326192 262695 85998 68950 -5336 -39020
19919 -39020 -20143 -46979 -178801 -117219 -83958 10793 63518 30744 113614 141965 176595
19908 176595 114442 53028 -15990 -80285 -289455 -499637 -404492 -279400 -221735 -217163 -294640
19897 -294640 -199779 -90774 -80744 -177335 -171315 -159434 -279442 -176877 -90122 -58788 6261
19886 6261 4718 -118260 -46861 19654 14697 -82208 -114461 -87085 51192 92672 45655 29715
$$ packed form
19963a20097J6377J52575J3736k9305n1059k82242l3341K01044J72438j9344j54734
19952a33952j60533O9262q2385R0433Q9968O6092j9517P443k5269j1293j36215
19941b45966p6993J05726J38091R2239k204k5770p1441J14422J8013O2427R334
19930A17878j09557L2996P8379J8612N3484J34400o3497j76697j7048p4286l3684
19919c9020J8877k6836j31822O1582L3261R4751N2725l2774Q2870K8351L4630
19908A76595o2153o1414o9018o4295k09170k10182R5145J25092N7665M572p7477
19897b94640R4861J09005J0030r6591O020J1881j20008J02565Q6755L1334O5049
19886F261j543j22978P1399O6515m957r6905l2253K7376J38277M1480m7017j5940
$$ plain form
19874 29715 29272 -124197 -182035 -267216 -182215 9177 -106679 -25880 -84804 -196345 -129580
19863 -129580 -213684 -238421 -277219 -308316 -310797 -371036 -199054 -9032 51191 -58751 -91611
19852 -91611 113084 176161 -143972 -310797 -166962 55568 203515 41292 -97357 -167590
19842 -167590 5707 -35760 -55786 -51370 -32518 -52343 -160964 -231550 -213217 89143 178684
19831 178684 167977 198104 184155 147704 95676 -19559 24416 153756 126390 184572 309709
19820 309709 299102 77947 -166802 -139599 -173664 -119705 -339863 -330113 -259120 -139914 -180352
19809 -180352 39309 133181 198028 229060 277551 481195 385246 183489 -4493 -168179
19799 -168179 -257678 -233212 -26196 132968 11081 -19285 50396 -69381 -120386 -108589 -146114
$$ packed form
19874B9715m43j53469n7838q5181Q5001J91392j15856Q0799n8924j11541O6765
19863a29580q4104k4737l8798l1097k481o0239J71982J90022O0223j09942l2860
19852i1611K04695O3077l20133j66825J43835K22530J47947j62223j38649p0233
19842a67590J73297m1467k0026M416J8852j9825j08621p0586J8333L02360Q9541
19831A78684j0707L0127j3949l6451n2028j15235M3975J29340k7366N8182J25137
19820C09709j0607k21155k44749K7203l4065N3959k20158R750P0993J19206m0438
19809a80352K19661R3872O4847L1032M8491K03644r5949k01757j87982j63686
19799a68179q9499K4466K07016J59164j21887l0366O9681j19777n1005J1797l7525
$$ plain form
19788 -146114 -203963 -242028 -268209 -114676 -40643 -164433 -280008 -184118 7318 112767
19778 112767 49619 57074 101732 163344 184902 74299 174174 201331 18919 -156542 -92432
19767 -92432 55117 -149944 -188677 -167439 -295867 -343441 -234824 -219779 -227253 -174522 -172402
19756 -172402 -76816 -54615 -106266 -96027 5321 63695 -149779 -138223 -183427 -252268 -246467
19745 -246467 -174639 -158660 -123821 -99870 -34829 25982 108821 152768 12027 -35929 -69275
19734 -69275 -107800 14192 41079 42142 -112901 -69686 -143757 -150687 -161967 26390 57874
19723 57874 -33031 -90910 -105986 -174238 -329585 -90774 78630 -113655 -252362 -347955 -291655
19712 -291655 -141072 -53590 12905 -1976 21027 36440 -58537 -99350 -156804 -55479 127973
$$ packed form
19788a46114n7849l8065k6181J53533P4033j23790j15575R5890J91436J05449
19778A12767o3148P455M4658O1612K1558j10603R9875K7157j82412j75461O4110
19767i2432J47549k05061l8733K1238j28428m7574J08617J5045p474N2731K120
19756a72402R5586K2201n1651J0239J01348N8374k13474J1556m5204o8841N801
19745b46467P1828J5979L4839K3951O5041O0811Q2839M3947j40741m7956l3346
19734f9275l8525J21992K6887J063j55043M3215p4071o930j1280J88357L1484
19723E7874r0905n7879j5076o8252j55347K38811J69404j92285j38707r5593N6300
19712b91655J50583Q7482O6495j4881K3003J5413r4977m0813n7454J01325J83452
$$ plain form
19701 127973 148556 83176 15942 -91983 -115589 35408 96616 184863 126439 108551 74520
19690 74520 -7832 64812 227697 195523 186788 192346 73139 -95219 -198602 -269212 -252685
19679 -252685 -194145 -29983 -90899 -91403 -11946 14983 -157948 -209226 -111863 -103657 -271475
19668 -271475 -337588 -405284 -352557 -195232 35358 -18820 -36932 -82270 -172179 -199949 -217088
19657 -217088 -43492 73620 34431 -13929 154992 -5514 -147265 -88143 -88467 -152075 84613
19646 84613 146847 -31651 -184563 -204770 -287667 -258053 -248642 -332180 -419913 -350975 -334111
19635 -334111 -239635 -129786 24659 117241 -31846 -129584 -196868 -192780 -47617 46265 102347
19624 102347 34525 4760 -163652 -309906 -18401 205589 142295 81123 88505 98299 36325
$$ packed form
19701A27973K0583o5380o7234j07925k3606J50997O1208Q8247n8424j7888l4031
19690G4520q2352P2644J62885l2174q735N558j19207j68358j03383p0610J6527
19679b52685N8540J64162o0916n04P9457K6929j72931n1278R7363Q206j67818
19668b71475o6113o7696N2727J57325K30590n4178j8112m5338q9909k7770j7139
19657b17088J73596J17112l9189m8360J68921j60506j41751N9122l24o3608K36688
19646H4613O2234j78498j52912k0207q2897K9614R411q3538q7733O8938J6864
19635c34111R4476J09849J54445R2582j49087r7738o7284M088J45163R3882N6082
19624A02347o7822k9765j68412j46254K91505K23990o3294o1172P382R794o1974
$$ plain form
19613 36325 67869 117429 109159 -43254 16873 13306 -30626 -92501 -185429 -174079 -93820 -176610
19601 -176610 -278847 -364284 -318045 -163389 -5978 141586 -823 111598 118666 21865
19591 21865 -112948 -86801 -142771 -145591 -120313 -100259 -96339 -257995 -409249 -424003 -449002
19580 -449002 -377763 -301757 -289322 -40782 98773 58177 -50634 -100142 36140 20602 -87472
19569 -87472 -107672 168950 58767 203271 251929 80496 -29179 -34983 10851 53579 -231277
19558 -231277 -214582 -65661 -70162 -252463 -354689 -346637 -423240 -362960 -275237 -199305 -35148
19547 -35148 -115081 -42749 101833 78327 25690 -11444 -71876 -197747 -252579 -192561 -243584
19536 -243584 -398723 -350214 -236465 -233086 -306421 -245483 -279194 -384702 -490553 -419980 -238036
$$ packed form
19613C6325L1544M9560q270j52413O0127l567m3932o1875r2928J1350Q0259q2790
19601a76610j02237q5437M6239J54656J57411J47564j42409J12421P068r6801
19591B1865j34813K6147n5970k820K5278K0054L920j61656j51254j4754k4999
19580d49002P1239P6006J2435K48540J39555m0596j08811m9508J36282j5538j08074
19569h7472k0200K76622j10183J44504M8658j71433j09675n804M5834M2728k84856
19558b31277J6695J48921m501j82301j02226Q052p6603O0280Q7723P5932J64157
19547c5148p9933P2332J44582k3506n2637l7134o0432j25871n4832O0018n1023
19536b43584j55139M8509J13749L379p3335O0938l3711j05508j05851P0573J81944
$$ plain form
19525 -238036 -79527 -153306 -122590 -64417 91450 93771 63574 -96352 -256486 -284390 -298481
19514 -298481 -462275 -361517 -82516 -22241 -180533 -255434 -347514 -369452 -378221 -259488 -168948
19503 -168948 -187480 -193360 -315754 -425685 -456350 -289730 -10885 60092 -58316 103359
19493 103359 209149 -13369 -112222 -120116 -244208 -181167 -44011 -56682 -149848 -142946 -190232
19482 -190232 -129331 -16927 44455 -56499 -150732 -83353 -68502 -108398 -198787 -135305 -102736
19471 -102736 -182884 -126794 -34429 -17680 41391 -77032 -160145 -141779 73884 52708 107463
19460 107463 45236 97414 79194 116176 50970 24197 109578 -18984 -80681 -6834 98157
19449 98157 115247 225185 116606 -37076 -89669 95183 3398 -259232 -342231 -337566 -237545
$$ packed form
19525b38036J58509p3779L0716N8173J55867K321l0197j59926j60134k7904j4091
19514b98481j63794J00758K79001O0275j58292p4901r2080k1938q769J18733R0540
19503a68948j8532n880j22394j09931l0665J66620K78845P0977j18408J61675
19493A03359J05790k22518r8853p894j24092O3041J37156j2671r3166O902m7286
19482a90232O0901J12404O1382j00954r4233O7379J4851l9896r0389O3482L2569
19471a02736q0148N6090R2365J6749N9071j18423q3113J8366K15663k1176N4755
19460A07463o2227N2178j8220L6982o5206k6773Q5381j28562o1697P3847J04991
19449I8157J7090J09938j08579j53682n2593J84852r1785k62630q2999M665J00021
$$ plain form
19438 -237545 -77342 -15963 -65669 -49068 -6742 -136130 -194431 -95484 -181278 -192151 -34596
19427 -34596 16303 -90677 -184609 -7540 -35538 -104194 -98003 -209411 -164968 -78655 -152988
19416 -152988 -196258 -224026 -228102 -65324 22496 -60714 -184360 -255939 -322761 -173657 -48716
19405 -48716 42562 -58061 -50547 91823 55097 5796 -41367 -124065 -107616 -177548 -319632
19394 -319632 -364266 -385827 -324586 -357660 -326631 -316574 -246168 -150437 -117168 -77369 -118560
19383 -118560 -273840 -162819 -69211 -186858 -256469 -92838 174094 42503 -188780 -212691
19373 -212691 -81855 85761 697 -137180 -323396 -207764 -124443 -119539 -108640 -108625 53182
19362 53182 78808 33623 69044 105740 -38098 -135747 -175041 -179832 -185079 -182720 -30941 -111544
$$ packed form
19438b37545J60203O1379m9706J6601M2326j29388n8301R8947q5794j0873J57555
19427c4596N0899j06980r3932J77069k7998o8656O191j11408M4443Q6313p4333
19416a52988m3270k7768m076J62778Q7820q3210j23646p1579o6822J49104J24941
19405d8716R1278j00623P514J42370l6726m9301m7163q2698J6449o9932j42084
19394c19632m4634k1561O1241l3074L1029J0057P0406R5731L3269L9799m1191
19383a18560j55280J11021R3608j17647o9611J63631K66932j31591k31283k3911
19373b12691J30836J67616q5064j37877j86216J15632Q3321M904J0899J5J61807
19362E3182K5626m5185L5421L6696j43838r7649l9294m791n247K359J51779q0603
$$ plain form
19350 -111544 -112670 -24292 -79325 -208222 -169007 -87073 -144905 -304980 -304804 -160300 39032
19339 39032 201489 283081 311922 296232 250701 212789 154992 38062 -23004 -123938 -92638
19328 -92638 -103922 -138125 34035 85700 39818 175204 97035 -92132 7049 147847 194845
19317 194845 68802 -9226 43191 77019 -47986 -141128 13366 -70856 -101660 -34715 123636
19306 123636 100754 12284 37136 43109 109967 93748 188298 -41671 -180985 -175284 -42820
19295 -42820 160652 204977 191829 -11456 -176182 -251030 -213824 -120908 -126954 -284731 -316978
19284 -316978 -131992 -72256 -55989 47306 13321 -52704 -46499 120804 59555 -146723 -140564
19273 -140564 -9880 172521 272320 292150 129146 23867 -7046 -122533 -375538 -267372
$$ packed form
19350a11544j126Q8378n5033j28897L9215Q1934n7832j60075J76J44504J99332
19339C9032J62457Q1592K8841j5690m5531l7912n7797j16930o1066j00934L1300
19328i2638j1284l4203J72160N1665m5882J35386p8169j89167R9181J40798M6998
19317A94845j26043p8028N2417L3828j25005r3142J54494q4222l0804O6945J58351
19306A23636k2882q8470K4852N973O6858j6219R4550k29969j39314N701J32464
19295d2820K03472M4325j3148k03285j64726p4848L7206R2916o046j57777l2247
19284c16978J84986N9736J6267J03295l3985o6025O205J67303o1249k06278O159
19273a40564J30684J82401R9799J9830j63004j05279l0913j15487k53005J08166
$$ plain form
19263 -267372 -272057 -357101 -420987 -413929 -322981 -257341 -262888 -337193 -323666 -357640 -380994 -336850
19251 -336850 -364297 -339435 -241556 -224352 -225869 -437429 -481857 -453186 -392206 -212606 -171154
19240 -171154 -242979 -236182 -112677 3302 24489 -259398 -455550 -375235 -128086 19901
19230 19901 -114921 -160914 -199153 -173285 -18831 31611 -2009 -181853 -178690 -129324 -159929
19219 -159929 -94406 -178941 -279384 -296140 -121277 86035 124095 24626 -25855 -127381 -218680
19208 -218680 -129518 -76832 -176459 -357103 -297697 -144350 40848 -15197 132614 68988 -27729
19197 -27729 -124832 -242457 -308912 -256404 -197598 -58319 32940 -129790 -305755 -259642 -19407
19186 -19407 -38894 -106562 -159409 -141088 -216397 -178018 -222694 -217577 -221883 -194676 -114920 -42402
$$ packed form
19263b67372m685q5044o3886P058R0948O5640n547p4305J3527l3974k3354M4144
19251c36850k7447K4862R7879J7204j517k11560m4428K8671O0980J79600M1452
19240a71154p1825O797J23505J15979K1187k83887j96152Q0315K47149J47987
19230A9901j34822m5993l8239K5868J54454N0442l3620j79844L163M9366l0605
19219a59929O5523q4535j00443j6756J74863K07312L8060r9469n0481j01526r1299
19208b18680Q9162N2686r9627j80644N9406J53347J85198n6045J47811o3626r6717
19197b7729r7103j17625o6455N2508N8806J39279R1259j62730j75965M6113K40235
19186a9407j9487o7668n2847J8321p5309L8379m4676N117m306K7207P9756P2518
$$ plain form
19174 -42402 -144671 -189744 -173436 -328705 -379855 -413658 -272252 -318149 -209421 -281422 -173133
19163 -173133 -20788 74991 89202 96947 80334 3564 -49854 -6895 31742 -55531 -87373
19152 -87373 35915 -61067 -163507 -116190 -36091 -99197 67039 78238 100629 89132 77455
19141 77455 100903 67395 -74305 -233969 -227183 -162159 -253112 -154680 -52102 8253 59445
19130 59445 -11167 -180361 -323623 -306181 -84846 2229 180418 215065 113495 90158 -102790
19119 -102790 -189843 -84340 -125900 -189388 -300511 -251150 -213219 -100033 -74375 -164920 -30160
19108 -30160 -34960 -84110 -167692 -315945 -335141 -210400 -408936 -319853 -243738 -23492 1378
19097 1378 72995 112919 -1378 -64546 -6217 150668 180362 81067 54027 23010 -137067
$$ packed form
19174d2402j02269m5073J6308j55269n1150l3803J41406m5897J08728p2001J08289
19163a73133J52345R5779J4211P745j6613p6770n3418M2959L8637q7273l1842
19152h7373J23288r6982j02440M7317Q0099o3106J66236J1199K2391j1497j1677
19141G7455K3448l3508j41700j59664O786O5024r0953R8432J02578O0355N1192
19130E9445p0612j69194j43262J7442K21335Q7075J78189L4647j01570k3337j92948
19119a02790q7053J05503m1560o3488j11123M9361L7931J13186K5658r0545J34760
19108c0160m800m9150q3582j48253j9196J24741j98536Q9083P6115K20246K4870
19097A378P1617L9924j14297o3168N8329J56885K9694r9295k7040l1017j60077
$$ plain form
19086 -137067 -151032 33087 -89285 -32708 53351 -116081 -61745 26653 73562 17012 -26614
19075 -26614 -75641 -137280 89935 153471 60703 -36445 -160920 -89201 -91643 23858 21437
19064 21437 -28428 -43967 15586 -109012 -374330 -531490 -467374 -372390 -329831 -325316 -120409
19053 -120409 66421 -119330 -233060 -19940 9487 -176227 -277158 -395739 -467982 -250440
19043 -250440 -77685 -8432 54044 21692 -32348 35210 3372 -73188 -96422 -1486 -2216 -179035
19031 -179035 -193671 -49005 42340 243753 178202 61866 -67679 -203942 -342625 -255386
19021 -255386 -196518 -202676 1814 36352 27499 33541 183660 298912 276341 101332 182124
19010 182124 191015 107571 31434 -149662 -54874 8626 -61029 22050 198200 203479 148229
$$ packed form
19086a37067j3965J84119j22372N6577Q6059j69432N4336Q8398M6909n6550m3626
19075b6614m9027o1639K27215O3536r2768r7148j24475P1719k442J15501k421
19064B1437m9865j5539N9553j24598k65318j57160O4116R4984M2559M515K04907
19053a20409J86830j85751j13730K13120K9427j85714j00931j18581p2243K17542
19043b50440J72755O9253O2476l2352n4040O7558l1838p6560k3234R4936p30j76819
19031a79035j4636J44666R1345K01413o5551j16336j29545j36263j38683Q7239
19021b55386N8868o158K04490L4538q853O042J50119J15252k2571j75009Q0792
19010A82124Q891q3444p6137j81096R4788O3500o9655Q3079J76150N279n5250
$$ plain form
18999 148229 19324 -103391 -281540 -235544 -26719 -21773 -2248 111881 130471 58284 -78801
18988 -78801 -173524 -323025 -167064 -28916 32295 -96745 -165708 -130230 -81432 119809 136350
18977 136350 43397 -44082 -3311 -111520 -119279 90558 315656 296887 316001 219596 114285
18966 114285 227862 387905 162337 -43602 -77030 -110062 -186108 -108803 -112566 116888 171206
18955 171206 109869 212121 269292 -34051 -50082 50537 122833 200465 129724 24653 27013
18944 27013 -3804 147063 262801 195716 226473 360608 246134 180179 -29432 -76178 86986
18933 86986 176755 77444 63008 -63630 -70348 -43299 37869 -7681 20589 121277 243347
18922 243347 32786 -166926 -127364 13301 -61750 -36281 -59841 13772 -31786 -104426 -177218
$$ packed form
18999A48229j28905j22715j78149M5996K08825M946J9525J14129J8590p2187j37085
18988g8801r4723j49501J55961J38148O1211j29040o8963L5478M8798K01241J6541
18977A36350r2953q7479M0771j08209p759K09837K25098j8769J9114r6405j05311
18966A14285J13577J60043k25568k05939l3428l3032p6046P7305l763K29454N4318
18955A71206o1337J02252N7171l03343j6031J00619P2296P7632p0741j05071K360
18944B7013l0817J50867J15738o7085L0757J34135j14474o5955k09611m6746J63164
18933H6986Q9769r9311j4436j26638o718K7049Q1168m5550K8270J00688J22070
18922B43347k10561j99712L9562J40665p5051K5469k3560P3613m5558p2640p2792
$$ plain form
18911 -177218 -8645 124530 69018 69798 16586 23327 -63895 -25509 -55823 -78303 -132265 -94343
18899 -94343 -188164 -276700 -341723 -237880 -130081 -106952 -35286 69537 -14961 103767 313290
18888 313290 192176 69122 47838 -55880 -49467 -17975 -16131 -40557 -162786 -241403 -191806
18877 -191806 -25687 42993 48837 -1311 -87545 -190124 -180006 -138211 -234551 -166523 -152037
18866 -152037 -100127 -70308 -116859 -209762 -294186 -276422 -282735 -328275 -308681 -151941 -246428
18855 -246428 -300523 -102361 206180 270211 157300 33307 133391 149194 165736 -11031
18845 -11031 -248939 -166736 -60110 -42798 60211 137740 241890 326957 334872 184326 -1251
18834 -1251 -35388 100686 265578 107821 20082 -57452 -143756 -48672 -20829 -62847 5909
$$ packed form
18911a77218J68573J33175n5512P80n3212O741q7222L8386l0314k2480n3962L7922
18899i4343r3821q8536o5023J03843J07799K3129P1666J04823q4498J18728K09523
18888C13290j21114j23054k1284j03718O413L1492J844k4426j22229p8617M9597
18877a91806J66119O8680N844n0148q6234j02579J0118M1795r6340O8028J4486
18866a52037N1910K9819m6551r2903q4424J7764o313m5540J9594J56740r4487
18855b46428n4095J98162L08541O4031j12911j23993J00084J5803J6542j76767
18845a1031k37908Q2203J06626J7312J03009P7529J04150Q5067P915j50546j85577
18834a251l4137J36074J64892j57757q7739p7534q6304R5084K7843m2018O8756
$$ plain form
18823 5909 137592 15402 -44677 -21241 -183408 -172451 115092 243181 233232 215459 71572
18812 71572 28077 48971 -4072 -93072 -115150 -141332 -60428 -26716 -66743 -116963 -296143
18801 -296143 -517305 -539087 -210826 77313 232934 224967 240883 162241 165304 322676 343135
18790 343135 231116 74280 -146202 -102298 -31341 -134834 -107692 -6104 23941 -104784
18780 -104784 -285130 -447809 -378285 -198469 95387 222843 113875 172424 268228 331398
18770 331398 534851 597051 704964 879350 877488 868432 841913 716718 536975 462683 391030
18759 391030 327176 314585 412420 460610 404632 117480 -85171 -71412 111583 119176 121352
18748 121352 149230 348360 275821 62301 -70145 -177926 -200815 -76469 31650 -58369
$$ packed form
18823E909J31683j22190o0079K3436j62167J0957K87543J28089r949j7773j43887
18812G1572m3495K0894n3043q9000k2078k6182Q0904L3712m0027n0220j79180
18801b96143k21162k1782L28261K88139J55621p967J5916p8642L063J57372K0459
18790C43135j12019j56836k20482M3904P0957j03493K7142J01588L0045j28725
18780a04784j80346j62679O9524J79816K93856J27456j08968N8549R5804O3170
18770C31398K03453O2200J07913J74386j862r056k6519j25195j79743p4292p1653
18759C91030o3854j2591R7835M8190n5978k87152k02651J3759J82995P593K176
18748A21352K7878J99130p2539k13520j32446j07781k2889J24346J08119r0019
$$ plain form
18738 -58369 6048 188210 144643 203112 145623 50825 51310 162431 120725 54686 -28520 -156314
18726 -156314 -39397 -14773 -152869 -120375 94107 -5194 99094 266358 285747 286835 168545
18715 168545 253890 213623 138211 56631 81510 150786 245213 165214 149489 86910 -71103
18704 -71103 -129192 -178076 -63363 91573 53731 82385 62814 -31443 144825 112869 59126
18693 59126 -199 -16014 47531 23926 44741 25763 85301 159283 36996 65124 45491
18682 45491 58290 -75805 -198019 -244570 -242677 -211432 -82281 -25923 825 -63824 -38152
18671 -38152 71826 30925 -3808 -151866 -240898 -27273 150997 123885 229659 337970
18661 337970 209714 261139 233777 81847 -109929 78639 121654 48953 57020 7410 5594
$$ packed form
18738e8369O4417J82162m3567N8469n7489r4798M85J11121m1706o6039q3206j27794
18726a56314J16917K4624j38096L2494K14482r9301J04288J67264J9389J088j18290
18715A68545Q5345m0267p5412q1580K4879O9276R4427p9999j5725o2579j58013
18704g1103n8089m8884J14713J54936l7842K8654j9571r4257J76268l1956n3743
18693E9126n9325j5815O3545k3605K0815j8978N9538P3982j22287K8128j9633
18682D5491J2799j34095j22214m6551J893L1245J29151N6358K6748o4649K5672
18671c8152J09978m0901l4733j48058q9032K13625J78270k7112J05774J08311
18661C37970j28256N1425k7362j51930j91776J88568M3015p2701Q067m9610j816
$$ plain form
18650 5594 62693 116280 122714 131955 -190981 -244926 -175625 -191751 -204297 -224642 -149500 -123229
18638 -123229 -138274 -98363 245534 165093 -23747 -111203 -50134 -63371 -144350 -133813 -33220
18627 -33220 72025 81720 14757 71296 129525 33705 96581 216294 111845 -100846 -323514
18616 -323514 -252536 -125643 -18673 -137058 -124084 -112924 -169071 -121737 -81456 -118848 103214
18605 103214 -25694 -117910 -74531 -251705 -271307 -295676 -294553 -110769 97467 261742 140501
18594 140501 -184917 -184163 -196885 -157628 -151596 -75930 -97125 -164431 -210767 -262431 -130645 172220
18582 172220 223572 57155 -47680 -45160 123963 166519 29597 -43595 171990 320292
18572 320292 293616 116581 79671 -70138 -197168 -72404 88077 147303 217297 471
$$ packed form
18650E594N7099N3587O434R241l22936n3945O9301j6126j2546k0345P5142K6271
18638a23229j5045L9911L43897q0441j88840q7456O1069j3237q0979J0537J00593
18627c3220J05245R695o6963N6539N8229r5820O2876J19713j04449k12691k22668
18616c23514P0978J26893J06970j18385J2974J1160n6147M7334M0281l7392K22062
18605A03214j28908r2216M3379j77174j9602k4369J123J83784K08236J64275j21241
18594A40501l25418P54j2722L9257O032P5666k1195o7306m6336n1664J31786L02865
18582A72220N1352j66417j04835K520J69123M2556j36922p3192K15585J48302
18572C20292k6676j77035l6910j49809j27030J24764J60481N9226O9994k16826
$$ plain form
18562 471 -107845 -102395 -223850 -169056 -85012 -88524 36324 48211 -53824 96066 -17681
18551 -17681 -147536 -37418 107160 -15084 6647 -109037 -141298 -129010 -271822 -546279
18541 -546279 -465558 -263965 -190038 -267452 -106701 -226400 -141236 -169747 -104511 -124410 -270137
18530 -270137 -286306 -331285 -174955 -130676 -91251 10839 -52025 -41069 -83197 -203428 -171947
18519 -171947 -120608 -60456 62922 105682 37289 24136 -98060 -86130 129756 74903 -131457
18508 -131457 -253925 -279766 -190749 -42473 -63565 -88850 90009 166955 177487 108988 -84298
18497 -84298 -14375 -112627 -185321 35990 -8125 -40813 17657 -185869 -251571 -219828 -174548
18486 -174548 -48679 32574 -128720 40714 -31366 -97406 20347 33766 -38815 103279
$$ packed form
18562D71j08316N450j21455N4794Q4044l512J24848J1887j02035J49890j13747
18551a7681j29855J10118J44578j22244K1731j15684l2261J2288j42812k74457
18541e46279Q0721K01593P3927p7414J60751j19699Q5164k8511O5236j9899j45727
18530b70137j6169m4979J56330M4279L9425J02090o2864J0956m2128j20231L1481
18519a71947N1339O0152J23378M2760o8393j3153j22196J1930K15886n4853k06360
18508a31457j22468k5841Q9017J48276k1092k5285J78859P6946J0532o8499j93286
18497h4298O9923r8252p2694K21311m4115l2688N8470k03526o5702L1743M5280
18486a74548J25869Q1253j61294J69434p2080o6040J17753J3419p2581J42094
$$ plain form
18476 103279 148267 24617 11031 88770 46646 244896 230689 218715 91350 11996 116714
18465 116714 196738 160368 46054 -55318 -64488 -102293 -2518 6869 -278605 -291066 -92028
18454 -92028 53793 32687 -11882 33830 21036 -83492 -222297 -305609 -268730 -10963 32733
18443 32733 90888 -41086 -19833 -61056 12230 -68668 -73916 -114996 -104349 -113094 -72656 -61049
18431 -61049 -17478 165250 231696 211965 115812 217925 348531 235557 32108 51622 -61493
18420 -61493 79527 96910 2668 -54750 -149087 -334463 -198463 -111314 -192732 -174966 93484
18409 93484 84357 -22226 -132941 -184296 -19555 209152 254788 25508 -75516 -93107 -168818
18398 -168818 -297030 -329164 -108291 -52522 39613 195627 166775 89697 62380 -15230 -230502
$$ packed form
18476A03279M4988j23650j3586P7739m2124J98250j4207j1974j27365p9354J04718
18465A16714Q0024l6370j14314j01372r170l7805R9775R387k85474j2461J99038
18454i2028J45821k1106m4569M5712j2794j04528j38805q3312L6879K57767M3696
18443C2733N8155j31974K1253m1223P3286q0898n248m1080J0647q745M0438J1607
18431f1049M3571J82728O6446j9731r6153J02113J30606j12974k03449J9514j13115
18420f1493J41020J7383r4242n7418r4337j85376J36000Q7149q1418J7766K68450
18409I3484r127j06583j10715n1355J64741K28707M5636k29280j01024j7591p5711
18398a68818j28212l2134K20873N5769R2135J56014k8852p7078k7317p7610k15272
$$ plain form
18387 -230502 -276644 -110405 119652 113838 155163 239336 273949 333965 227926 -52402 -181656
18376 -181656 5603 89903 -51945 -31849 145210 66985 117671 111840 -20848 -3483 182217
18365 182217 380982 161606 149741 94177 -79402 -175855 -84503 56162 223329 199597
18355 199597 165419 325246 400396 292064 160569 125860 56704 186899 302765 224756
18345 224756 185627 210165 228759 285623 335043 287762 336898 459089 444630 415030 424443
18334 424443 243290 146697 68590 119129 22462 -109586 -178899 -128398 -217809 -156050 -19131
18323 -19131 98157 35518 25086 46410 115474 220126 299358 202228 272951 384286 328589
18312 328589 163991 150930 54130 4225 -32297 21701 155117 -70099 -218696 -37006
$$ packed form
18387b30502m6142J66239K30057n814M1325Q4173L4613O0016j06039k80328j29254
18376a81656J87259Q4300j41848K0096J77059p8225N0686n831j32688J7365J85700
18365A82217J98765k19376j1865n5564j73579r6453R1352J40665J67167k3732
18355A99597l4178J59827P5150j08332j31495l4709o9156J30195J15866p8009
18345B24756l9129K4538J8594N6864M9420m7281M9136J22191j4459k9600R413
18334D24443j81153r6593p8107N0539r6667j32048o9313N0501q9411O1759J36919
18323a9131J17288o2639j0432K1324O9064J04652P9232r7130P0723J11335n5697
18312C28589j64598j3061r6800m9905l6522N3998J33416k25216j48597J81690
$$ plain form
18302 -37006 143049 134114 -15759 -259742 -378715 -213872 -166590 -276119 -282212 -155593 27997
18291 27997 136596 26454 51882 130149 109804 -264 44502 -9847 -177157 -253088 -119956
18280 -119956 93718 100007 154888 159586 188889 83322 2795 32082 57505 305118 92864
18269 92864 73983 277675 190251 152555 147067 117043 137237 181575 181583 207980 333141 295043
18257 295043 280793 252416 81911 -9844 160643 268292 242607 132647 133859 228211 112134
18246 112134 15767 -537 207046 262053 214558 130133 15842 85697 67629 234560 476391
18235 476391 663450 673442 551848 539918 415718 360761 613262 622651 438042 583575 862760
18224 862760 826719 859328 902925 978362 1028977 1046389 1028246 994141 927622 1109430 1315218
$$ packed form
18302c7006J80055q935j49873k43983j18973J64843M7282j09529o093J26619J83590
18291B7997J08599j10142K5428P8267k0345j10068M4766n4349j67310p5931J33132
18280a19956K13674O289N4881M698K9303j05567q0527K9287K5423K47613k12254
18269I2864j8881K03692q7424l7696n488l0024K0194M4338QK6397J25161l8098
18257B95043j4250k8377j70505r1755J70487J07649k5685j09960J212R4352j16077
18246A12134r6367j6304K07583N5007m7495q4425j14291O9855j8068J66931K41831
18235D76391J87059R992j21594j1930j24200n4957K52501R389j84609J45533K79185
18224H62760l6041L2609M3597P5437N0615J7412j8143l4105o6519J81808K05788
$$ plain form
18213 1315218 1423806 1508125 1551960 1837622 2005453 2003258 1984981 2252184 2404383 2257477
18203 2257477 2047527 1872828 1795797 1508831 1354832 1236881 1122165 1176344 1038713 685352
18193 685352 345173 322685 330345 267063 320320 361134 292534 175896 293977 456380 370591
18182 370591 294892 308304 333652 412711 598418 479484 312281 345489 424417 339747 259399
18171 259399 440429 382888 405770 559746 648541 618855 408067 370213 609376 585779 520669
18160 520669 568028 535994 571214 485579 442972 463018 588192 480007 375084 410205 834301
18149 834301 1167918 1154876 1115376 1149954 1262323 1329314 1335301 1480520 1570889 1614923 1588900
18138 1588900 1525356 1694492 2037876 2344898 2726819 3096836 3158074 3408642 3867856 4318056
$$ packed form
18213A315218J08588Q4319M3835K85662J67831k195j8277K67203J52199j46906
18203B257477k09950j74699p7031k86966j53999j17951j14716N4179j37631l53361
18193F85352l40179k2488P660o3282N3257M0814o8600j16638J18081J62403q5789
18182C70591p5699J3412K5348P9059J85707j18934j67203L3208P8928q4670q0348
18171B59399J81030n7541K2882J53976Q8795k9686k10788l7854K39163k3597o5110
18160E20669M7359l2034L5220q5635m2607K0046J25174j08185j04923L5121M24096
18149H34301L33617j3042l9500L4578J12369O6991N987J45219R0369M4034k6023
18138A588900o3544J69136L43384L07022L81921L70017O1238K50568M59214M50200
$$ plain form
18128 4318056 4651581 4975460 5484177 5989407 6471135 7178949 8112387 9348209 10750480
18119 10750480 12435770 14916109 18106385 22890328 30444002 42850976 64670461 104835611
18111 104835611 160413732 192552648 195683575 191705267 187609596 163718572 110062210
18104 110062210 70538184 50152862 39080844 32291953 27644961 24522642 22013023
18097 22013023 19825507 17807007 16030654 14700340 13562836 12789477 11901925 10979233
18089 10979233 10007920 9375720 8843348 8378056 7925570 7577236 7413605 6865898 6505964
18080 6505964 6241938 5874387 5719954 5593759 5456002 5190671 4872213 4696574 4368203
18071 4368203 4067464 3914509 3505585 3177249 3150568 3228762 3221408 3138318 3047840 2930980
$$ packed form
18128D318056L33525L23879N08717N05230M81728P07814R33438J235822J402271
18119A0750480J685290K480339L190276M783943P553674J2406974K1819485M0165150
18111A04835611N5578121L2138916L130927l978308m095671k3891024n3656362
18104A10062210l9524026k0385322j1072018o788891m646992l122319k509619
18097B2013023k187516k018500j776353j330314j137504p73359q87552r22692
18089A0979233r71313o32200n32372m65292m52486l48334j63631n47707l59934
18080F505964k64026l67551j54433j26195j37757k65331l18458j75639l28371
18071D368203l00739j52955m08924l28336k6681P8194p354q3090r0478j16860
$$ plain form
18061 2930980 2649042 2368787 2231465 2424777 2465884 2457694 2349363 2145799 2007488 1974410
18051 1974410 1947422 1901036 2006346 1890214 1766645 1576459 1449643 1405076 1502149 1438697
18041 1438697 1267323 1294953 1265041 1222368 1099372 1012057 1047173 903165 1009390 963571
18031 963571 857922 818903 574478 434882 491353 594930 667560 495704 392395 265646
18021 265646 236777 47428 171857 150430 112261 55056 -54035 22433 218749 268990 174118
18010 174118 206687 238072 59912 63981 168720 104892 -40862 -126196 -104892 16975 -84568
17999 -84568 -88758 15690 228391 121985 163424 200344 144346 113199 123747 167343 38067
17988 38067 -116530 -254993 -213170 -41292 197804 280517 382680 599500 162790 26017
$$ packed form
18061B930980k81938k80255j37322J93312M1107q190j08331k03564j38311l3078
18051A974410k6988m6386J05310j16132j23569j90186j26816m4567R7073o3452
18041A438697j71374K7630k9912m2673j22996q7315L5116j44008J06225m5819
18031I63571j05649l9019k44425j39596N6471J03577P2630j71856j03309j26749
18021B65646k8869j89349J24429k1427l8169n7205j09091P6468J96316N0241r4872
18010A74118L2569L1385j78160M069J04739o3828j45754q5334K1304J21867j01543
17999h4568m190J04448K12701j06406M1439L6920n5998l1147J0548M3596j29276
17988C8067j54597j38463M1823J71878K39096Q2713J02163K16820m36710j36773
$$ plain form
17978 26017 53338 87135 164631 132628 111572 215679 42350 -3800 119767 138700 123400
17967 123400 158240 183487 282366 290670 299194 385537 412607 217295 102677 206941 114595
17956 114595 105491 248033 372586 320309 177598 41847 -47649 -33160 49245 252219 404198
17945 404198 527545 489747 421227 328993 450363 615102 445045 366861 332002 169278
17935 169278 195701 316230 344617 251195 287837 230572 321589 492714 358157 26548 174780
17924 174780 384380 445032 556568 464395 490748 360169 429983 399548 239698 -40340
17914 -40340 67301 120222 -210343 -440921 -347590 -96460 -7017 149035 173542 74388 -105278
17903 -105278 190009 280859 153789 121790 92235 67331 92148 219295 327706 223055
$$ packed form
17978B6017K7321L3797P7496l2003k1056J04107j73329m6150J23567J8933j5300
17967A23400L4840K5247R8879Q304Q524Q6343K7070j95312j14618J04264r2346
17956A14595r104J42542J24553n2277j42711j35751q9496J4489Q2405K02974J51979
17945D04198J23347l7798o8520r2234J21370J64739j70057p8184l4859j62724
17935A69278K6423J20529K8387r3422L6642n7265R1017J71125j34557l31609J48232
17924A74780K09600O0652J11536r2173K6353j30579O9814l0435j59850k80038
17914d0340J07641N2921l30565k30578R3331K51130Q9443J56052K4507r9154j79666
17903a05278K95287R0850j27070l1999k9555k4904K4817J27147J08411j04651
$$ plain form
17893 223055 312051 438459 187007 53471 -6785 50262 97229 144421 330135 392508 366724
17882 366724 429903 505565 387694 171186 104446 279938 258704 243820 187357 279782 292497
17871 292497 296294 463581 506904 354517 464205 530303 493977 337027 194823 120255 215012
17860 215012 208193 272126 316778 291760 127719 195515 490500 529201 502783 434884 382686
17849 382686 305127 369455 353957 428105 532105 554284 597789 472944 311940 339804 254436
17838 254436 318239 293357 236899 242649 237624 170777 200289 225774 227786 102037 149019 142050
17826 142050 258751 271952 186837 168270 108386 -40933 -34650 21916 99393 -27298 -93132
17815 -93132 -90763 -166662 -275152 -421378 -460927 -281548 -229397 -304482 -308939 -414315 -391051
$$ packed form
17893B23055Q8996J26408k51452j33536o0256N7047M6967M7192J85714O2373k5784
17882C66724O3179P5662j17871k16508o6740J75492k1234j4884n6463R2425J2715
17871B92497L797J67287M3323j52387J09688O6098l6326j56950j42204p4568R4757
17860B15012o819O3933M4652k5018j64041O7796K94985L8701k6418o7899n2198
17849C82686p7559O4328j5498P4148J04000K2179M3505j24845j61004K7864q5368
17838B54436O3803k4882n6458N750n025o6847K9512K5485K012j25749M6982o969
17826A42050J16701J3201q5115j8567n9884j49319O283N6566P7477j26691o5834
17815i3132K369p5899j08490j46226l9549J79379N2151p5085m457j05376K3264
$$ plain form
17804 -391051 -381047 -308248 -257588 -104203 1009 10506 4042 93558 142740 41368 41176 288983
17792 288983 343815 270216 198546 -23033 -149479 -108790 -57371 -102127 35373 -332 13409
17781 13409 -72304 -178088 -122898 88056 174902 56424 220459 514651 602131 545993 369257
17770 369257 316746 372594 388775 345782 375465 464172 441517 478890 493760 558657 643631
17759 643631 727745 529282 616231 791933 886755 747405 777752 835263 817633 694389 768890
17748 768890 803695 894404 869732 941883 980654 1060726 1270353 1156432 947951 900106 913024
17737 913024 919367 1054454 1144565 991624 907465 1093704 1068052 997776 1042848 1160790 1215783
17726 1215783 1202215 1204357 999061 940609 878180 967655 1212047 1299969 1033762 924176 838994
$$ packed form
17804c91051J0004P2799N0660J53385J05212R497o464Q9516M9182j01372j92K47807
17792B88983N4832p3599p1670k21579j26446M0689N1419m4756J37500l5705J3741
17781A3409q5713j05784N5190K10954Q6846j18478J64035K94192Q7480n6138j76736
17770C69257n2511N5848J6181m2993K9683Q8707k2655L7373J4870O4897Q4974
17759F43631Q4114j98463Q6949J75702R4822j39350L0347N7511j7630j23244P4501
17748G68890L4805R0709k4672P2151L8771Q0072K09627j13921k08481m7845J2918
17737I13024O343J35087R0111j52941q4159J86239k5652p0276M5072J17942N4993
17726A215783j3568K142k05296n8452o2429Q9475K44392Q7922k66207j09586q5182
$$ plain form
17715 838994 781425 885302 1155735 1352853 1194235 1095930 1053267 1068028 1045310 888579
17705 888579 746914 807150 850918 986238 983013 1058207 942537 981916 1086597 1128331 1232116
17694 1232116 1260839 1276514 1280477 1317512 1557782 1656956 1590583 1568645 1472966 1543599 1685415
17683 1685415 1865942 1919471 2030966 2060940 1932827 1889671 2058187 2074793 2026834 2352716
17673 2352716 2480556 2512113 2671627 2817695 2839073 2883614 2999716 3129911 3370408 3658004
17663 3658004 4068205 4615404 4933880 5222650 5627818 6115163 6904980 7508393 8186573
17654 8186573 9025733 9998913 11250306 12517096 13771834 15171083 16842592 18846250
17646 18846250 21238165 23837000 26896341 30719098 35615538 42054848 49646879 58886663
$$ packed form
17715H38994n7569J03877K70433J97118j58618r8305m2663J4761k2718j56731
17705H88579j41665O0236M3768J35320l225P5194j15670L9379J04681M1734J03785
17694A232116K8723J5675L963L7035K40270R9174o6373k1938r5679P0633J41816
17683A685415J80527N3529J11495K9974j28113m3156J68516J6606m7959L25882
17673B352716J27840L1557J59514J46068K1378M4541J16102J30195K40497K87596
17663C658004M10201N47199L18476K88770M05168M87345P89817O03413O78180
17654H186573Q39160R73180J251393J266790J254738J399249J671509K003658
17646A8846250K391915K598835L059341L822757M896440O439310P592031R239784
$$ plain form
17638 58886663 70921485 86517182 105437425 125509840 146768102 172321679 204018931
17631 204018931 236432448 262502064 285258697 311427950 340495649 360297042 364784568
17624 364784568 364500742 366599621 366322791 351525746 325635156 300897025 279554752 256116224
17616 256116224 226168954 195959307 170953390 150165458 130693086 111930875 96155849
17609 96155849 84033299 74455073 66217891 59377210 53778484 49210678 45440793 41956651
17601 41956651 38841874 36348446 34122240 31898216 29833873 28100034 26443276 24956275
17593 24956275 23568383 22258763 21101824 20063408 19238582 18361532 17386268 16503342 15597814
17584 15597814 14833610 14226956 13678178 12924101 12280634 11863385 11496681 10986774 10499325
$$ packed form
17638E8886663J2034822J5595697J8920243K0072415K1258262K5553577L1697252
17631B04018931L2413517K6069616K2756633K6169253K9067699J9801393M487526
17624C64784568k83826K098879k76830j4797045k5890590k4738131k1342273k3438528
17616B56116224k9947270l0209647k5005917k0787932j9472372j8762211j5775026
17609I6155849j2122550r578226q237182o840681n598726m567806l769885l484142
17601D1956651l114777k493428k226206k224024k064343j733839j656758j487001
17593B4956275j387892j309620j156939j038416q24826q77050r75264q82926r05528
17584A5597814p64204o06654n48778p54077o43467m17249l66704n09907m87449
$$ plain form
17575 10499325 10309762 9863666 9546475 9178153 8856557 8551679 8254368 7899572 7640253
17566 7640253 7407141 7259289 6985124 6619110 6266620 6002295 5557760 5122262 4718738
17557 4718738 4531697 4357852 4266519 4047105 3660840 3122439 2928897 2848374 2789555 2626542
17547 2626542 2250326 2188290 2211548 1843619 1407288 1401211 1435792 1227000 1142721 1100972 1109862
17536 1109862 1004796 1063831 1077575 1073165 924170 533256 411474 499033 340566 417228
17526 417228 573246 720964 694213 562930 623443 624115 572417 465454 500449 466490 337781
17515 337781 323740 436463 586541 684738 548872 518243 563854 552573 687770 706220 541102
17504 541102 449279 431622 492973 653532 564427 451466 305792 241864 264728 247453 379937
$$ packed form
17575A0499325j89563m46096l17191l68322l21596l04878k97311l54796k59319
17566G640253k33112j47852k74165l66014l52490k64325m44535m35498m03524
17557D718738j87041j73845r1333k19414l86265n38401j93542q0523n8819j63013
17547B626542l76216o2036K3258l67929m36331o077L4581k08792q4279m1749Q890
17536A109862j05066N9035J3744m410j48995l90914j21782Q7559j58467P6662
17526D17228J56018J47718k6751j31283O0513O72n1698j06963L4995l3959j28709
17515C37781j4041J12723J50078R8197j35866l0629M5611j1281J35197J8450j65118
17504E41102r1823j7657O1351J60559q9105j12961j45674o3928K2864j7275J32484
$$ plain form
17493 379937 672818 842621 565121 537326 591357 697695 772389 813284 784763 693460 376078
17482 376078 290407 372129 549198 594091 678027 485709 297863 305836 245210 354402 532895
17471 532895 397653 454033 519684 527162 361028 367152 342805 312993 172845 248632 331714
17460 331714 238776 210717 400603 517565 611409 590154 424656 516864 397226 331305 417653
17449 417653 559565 948500 1128944 1261837 1602236 1885032 2222668 2330715 2308743 2201959
17439 2201959 1818503 1441972 1119886 1003760 1084739 1167399 1177938 1105729 765598 581631
17429 581631 568892 530314 463456 221497 164225 189466 10275 -34724 -2289 -32864 22241
17418 22241 -49129 -15144 -1431 42283 -115859 -141454 -120879 -56649 -42928 -106411 -195876
$$ packed form
17493C79937K92881J69803k77500k7795N4031J06338P4694M0895k8521r1303l17382
17482C76078q5671Q1722J77069M4893Q3936j92318j87846P973o0626J09192J78493
17471E32895j35242N6380O5651P478j66134O124k4347k9812j40148P5787Q3082
17460C31714r2938k8059J89886J16962R3844k1255j65498R2208j19638o5921Q6348
17449D17653J41912L88935J80444J32893L40399K82796L37636J08047k1972j06784
17439B201959l83456l76531l22086j16126Q0979Q2660J0539p2209l40131j83967
17429E81631j2739l8578o6858k41959n7272K5241j79191m4999L2435l0575N5105
17418B2241p1370L3985J3713M3714j58142k5595K0575O4230J3721o3483q9465
$$ plain form
17407 -195876 -360916 -338537 -172414 -127867 -83424 -48781 59122 4574 -4843 94167 141131
17396 141131 -44689 -55086 16086 -23194 -111981 -247330 -364428 -193076 -86969 -180578
17386 -180578 -184342 -130603 3200 134432 208748 149729 140534 157221 105232 18375 -136770
17375 -136770 -146839 -49974 -69626 -63640 -61835 -128402 -27877 -40446 -146140 -29492 -101383
17364 -101383 -147532 -266310 -280223 -138591 -194070 -209892 -199494 -48072 34576 -34625 -129822
17353 -129822 36526 138088 160870 229418 107499 -23843 -66688 -36655 -239894 -187131
17343 -187131 90026 169495 212939 131234 -29282 -172325 -239509 -174761 -206520 -211650 -323713
17332 -323713 -216130 -197986 -98063 17145 12417 -135940 -93325 -80829 5260 -31336 -42616
$$ packed form
17407a95876j65040K2379J66123M4547M4443L4643J07903n4548r417R9010M6964
17396A41131j85820j0397P1172l9280q8787j35349j17098J71352J06107r3609
17386a80578l764N3739J33803J31232P4316n9019r195J6687n1989q6857j55145
17375a36770j0069R6865j9652N986J805o6567J00525j2569j05694J16648p1891
17364a01383m6149j18778j3913J41632n5479j5822J0398J51422Q2648o9201r5197
17353a29822J66348J01562K2782O8548j21919j31342m2845L0033k03239N2763
17343a87131K77157P9469M3444q1705j60516j43043o7184O4748l1759n130j12063
17332c23713J07583J8144R9923J15208m728j48357M2615J2496Q6089l6596j1280
$$ plain form
17321 -42616 -191694 -290273 -290778 -124532 -89145 -81806 -149307 -114163 -32149 -105378 -17798 -92453
17309 -92453 -97480 -49756 -99309 -64981 -113383 -181012 -155668 -217675 -34049 -94357 -300626
17298 -300626 -268761 -160393 -346351 -388220 -228669 -81184 -81719 -127907 -174932 -86436 -53542
17287 -53542 -124219 -84758 -16301 -121177 -50503 -62433 -116224 -80384 12627 -103092 -142908
17276 -142908 -72043 -122568 -249103 -221216 -357137 -423687 -205897 -77193 11806 71585 85886
17265 85886 95546 179540 81945 -206336 -202677 -301390 -217219 -60064 68265 50846 -15596
17254 -15596 -60870 -271992 -501636 -457111 -321574 -271093 -199464 -356659 -413359 -236423 -302827
17243 -302827 -133397 -81791 -172218 -1164 67889 81994 6965 4257 140218 193534 -56215
$$ packed form
17321d2616j49078r8579n05J66246L5387P339o7501L5144Q2014p3229Q7580p4655
17309i2453n027M7724m9553L4328m8402o7629K5344o2007J83626o0308k06269
17298c00626L1865J08368j85958m1869J59551J47485n35m6188m7025Q8496L2894
17287e3542p0677L9461O8457j04876P0674j1930n3791L5840R3011j15719l9816
17276a42908P0865n0525j26535K7887j35921o6550K17790J28704Q8999N9779J4301
17265H5886R660Q3994r7595k88281L659r8713Q4171J57155J28329j7419o6442
17254a5596m5274k11122k29644M4525J35537N0481P1629j57195n6700J76936o6404
17243c02827J69430N1606r0427J71054O9053J4105p5029k708J35961N3316k49749
$$ plain form
17232 -56215 -94290 -176284 -300684 -306081 -128904 57646 -82804 23780 -34493 -126631 -132868
17221 -132868 34361 129470 69526 -88123 -262075 -194947 -213876 -179546 -261613 -276896 -296654
17210 -296654 -175247 -173856 -78412 -59594 -237737 -160649 -42434 -30933 -106106 -9455 -210363
17199 -210363 -238452 41827 111475 -47336 -85602 -92919 -66238 -78411 -41862 37299 30235
17188 30235 -23697 -34920 -39517 -65538 -140499 -165058 -219517 -366906 -232593 -128163 -80418
17177 -80418 -65563 -76934 -119501 -16025 -8667 -68665 -235963 -110880 48682 201540 271540
17166 271540 317811 213667 117557 9873 98419 118082 82096 146914 44420 -167789 -224441
17155 -224441 -268619 -274394 -266352 -312952 -258463 -133943 13385 -41366 -172847 -136641 -10370
$$ packed form
17232e6215l8075q1994j24400n397J77177J86550j40450J06584n8273r2138o237
17221a32868J67229R5109n9944j57649j73952O7128j8929L4330q2067j5283j9758
17210b96654J21407J391R5444J8818j78143P7088J18215J1501p5173R6651k00908
17199b10363k8089K80279O9648j58811l8266p317K6681j2173L6549P9161p064
17188C0235n3932j1223m597k6021p4961k4559n4459j47389J34313J04430M7745
17177h0418J4855j1371m2567J03476P358n9998j67298J25083J59562J52858P0000
17166B71540M6271j04144r6110j07684Q8546J9663l5986O4818j02494k12209n6652
17155b24441m4178n775Q042m6600N4489J24520J47328n4751j31481L6206J26271
$$ plain form
17144 -10370 47775 168534 50058 92045 191995 196501 122132 68126 -10973 -57041 119012
17133 119012 84170 -23795 -25343 -84585 -101593 -149165 -165519 -117026 -167762 -115752 -154361
17122 -154361 -206961 -287652 -166636 28949 79383 156516 256334 224531 96691 -24358 -74553
17111 -74553 -129450 -381464 -429520 -385031 -261058 -180231 -192104 -203458 -233103 -285262 -179034
17100 -179034 20002 96498 29021 -20435 163092 190699 35387 -188933 -194810 -118635 -226111
17089 -226111 -248703 -237477 -190321 -152808 -241833 -419989 -282652 -120433 -138827 -74154 -107616
17078 -107616 -134153 -15221 -105987 -31210 -134246 -115452 -82141 -86606 -108731 -264246 -554996
17067 -554996 -514789 -218783 18314 39867 -281840 -223238 -121511 -112629 98331 341060
$$ packed form
17144a0370N8145J20759j18476M1987R9950M506p4369n4006p9099m6068J76053
17133A19012l4842j07965j548n9242j7008m7572j6354M8493n0736N2010l8609
17122a54361n2600q0691J21016J95585N0434P7133R9818l1803j27840j21049n0195
17111g4553n4897k52014m8056M4489J23973Q0827j1873j1354k9645n2159J06228
17100a79034J99036P6496o7477m9456J83527K7607j55312k24320n877P6175j07476
17089b26111k2592J1226M7156L7513q9025j78156J37337J62219j8394O4673l3462
17078a07616k6537J18932r0766P4777j03036J8794L3311m465k2125j55515k90750
17067e54996M0207K96006K37097K1553l21707N8602J01727Q882K10960K42729
$$ plain form
17057 341060 405931 471647 311680 180290 52684 -41442 -10402 119898 190057 106304 296240
17046 296240 608760 659288 700265 700932 843976 1040703 1297560 1371096 1538213 1695366 1782153
17035 1782153 1692218 1854499 1987696 1846223 1603479 1414254 1327091 1206116 1018530 725862
17025 725862 800804 722921 678242 503160 233588 216364 237107 397572 369069 389606 332746
17014 332746 317692 207769 186838 102558 2908 -83476 -237548 -51717 -49932 -250372 -159660
17003 -159660 5904 4233 91467 74779 189783 95630 90953 93305 72925 -58170 -11391
16992 -11391 -7197 -23418 128691 131034 103849 204595 94226 14721 9244 -27614 51097 161541
16980 161541 63878 -82688 -36896 210136 169923 84843 -118723 -107255 -19746 15890 -48283
$$ packed form
17057C41060O4871O5716j59967j31390j27606r4126L1040J30300P0159q3753J89936
17046B96240L12520N0528M0977O67J43044J96727K56857P3536J67117J57153Q6787
17035A782153q9935J62281J33197j41473k42744j89225q7163j20975j87586k92668
17025G25862P4942p7883m4679j75082k69572j7224K0743J60465k8503K0537n6860
17014C32746j5054j09923k0931q4280r9650q6384j54072J85831J785k00440R0712
17003a59660J65564j671Q7234j6688J15004r4153m677K352k0380j31095M6779
16992a1391M194j6221J52109K343k7185J00746j10369p9505n477l6858P8711J10444
16980A61541r7663j46566M5792K47032m0213q5080k03566J1468Q7509L5636o4173
$$ plain form
16969 -48283 -124435 -247138 -193826 16538 206091 265602 178571 96737 123405 8964 -163057
16958 -163057 -190056 -200046 -171868 -83322 -1906 43439 148140 180732 77217 -106544 -191733
16947 -191733 -367971 -508353 -390277 -299289 -171046 -18005 71487 118131 187134 10207
16937 10207 -79318 -304865 -147643 -70498 -124472 25689 59589 -77524 -162290 -76386 -146632
16926 -146632 -115656 -166824 -152609 93739 79970 10940 -63098 -125150 -227276 -277598 -289570
16915 -289570 -316562 -497395 -418458 -239170 -274872 -222900 -391824 -376995 -361039 -219629 -45308
16904 -45308 -22332 -74966 -94495 100562 111485 222035 65144 51268 -89757 -232384 -257429
16893 -257429 -165375 -155997 -59828 -102959 -257761 -161541 -31753 -44939 -125742 -156284 -133983
$$ packed form
16969d8283p6152j22703N3312K10364J89553N9511q7031q1834K6668j14441j72021
16958a63057k6999r990K8178Q8546Q1416M5345J04701L2592j03515j83761q5189
16947a91733j76238j40382J18076R0988J28243J53041Q9492M6644O9003j76927
16937A0207q9525k25547J57222P7145n3974J50161L3900j37113q4766Q5904p0246
16926a46632L0976n1168J4215K46348j3769o9030p4038o2052j02126n0322j1972
16915b89570k6992j80833P8937J79288l5702N1972j68924J4829J5956J41410J74321
16904d5308K2976n2634j9529J95057J0923J10550j56891j3876j41025j42627k5045
16893b57429R2054R378R6169m3131j54802R6220J29788j3186q0803l0542K2301
$$ plain form
16882 -133983 98353 328019 173494 91675 -2359 -177963 -116339 -29613 31071 44330 -7398
16871 -7398 18015 -80945 67855 160967 -73569 -153763 107461 135947 -41198 -239876 -257533
16860 -257533 -123364 -22496 41958 102508 17371 73748 144463 48934 1245 61392 -5554
16849 -5554 -43506 26337 42046 139445 77033 104781 252675 281324 13343 30708 83714
16838 83714 7280 -39842 11673 -25564 7450 -16923 -134508 -275514 -334722 -194637 -157139
16827 -157139 -228995 -302544 -303331 -342944 -331298 -361870 -283214 -120702 -120786 -14142 -83092 22774
16815 22774 78116 -44514 -94948 -181720 -245186 -208632 -228083 -314614 -38769 -31563 -211449
16804 -211449 -149694 -92261 -40698 -183741 -109023 -121169 -296516 -279754 -256001 -52893 -55391
$$ packed form
16882a33983K32336K29666j54525q1819r4034j75604O1624Q6726O0684J3259n1728
16871g398K5413r8960J48800R3112k34536q0194K61224K8486j77145j98678j7657
16860b57533J34169J00868O4454O0550q5137N6377P0715r5529m7689O0147o6946
16849e554l7952O9843J5709R7399o2412K7748J47894K8649k67981J7365N3006
16838H3714p6434m7122N1515l7237L3014k4373j17585j41006n9208J40085L7498
16827a57139p1856p3549p87l9613J1646l0572P8656J62512q4J06644o8950J05866
16815B2774N5342j22630n0434q6772o3466L6554j9451q6531K75845P206j79886
16804b11449O1755N7433N1563j43043P4718j2146j75347J6762K3753K03108k498
$$ plain form
16793 -55391 -182553 -218925 -87885 -86140 -103642 -165375 -169268 -193094 -256094 -283431 -253039 -194807
16781 -194807 -74109 -34611 -105838 400 51184 -30105 -89313 -35448 -41582 5849 123627
16770 123627 62123 139290 165746 63487 -26052 -147411 -244519 -197790 -91175 65591 210697
16759 210697 152600 28770 -20484 -26799 -67289 -149315 -177090 -195478 -67073 -135084 -178619
16748 -178619 -265302 -191100 -213759 -273258 -156948 -143535 -126122 -66990 -29419 43226 -46733
16737 -46733 -123611 -160347 -112869 -87017 -6585 -140814 -151031 494 -289094 -116707 -135293
16726 -135293 -295260 -200725 -2015 -3735 -143245 -166486 -229700 -271749 -161275 -72457 -56777
16715 -56777 -149866 -177523 -138004 -139698 -156829 -186524 -144237 31704 192132 194438 110751 28982
$$ packed form
16793e5391j27162l6372J31040J745j7502o1733l893k3826o3000k7337L0392N8232
16781a94807J20698L9498p1227J06238N0784q1289n9208N3865o134M7431J17778
16770A23627o1504P7167K6456j02259q9539j21359r7108M6729J06615J56766J45106
16759B10697n8097j23830m9254o315m0490q2026k7775j8388J28405o8011m3535
16748a78619q6683P4202k2659n9499J16310J3413J7413N9132L7571P2645q9959
16737d6733p6878l6736M7478K5852Q0432j34229j0217J51525k89588J72387j8586
16726a35293j59967R4535J98710j720j39510k3241o3214m2049J10474Q8818J5680
16715e6777r3089k7657L9519j694j7131k9695M2287J75941J60428K306q3687q1769
$$ plain form
16703 28982 36377 106200 -15637 -134105 -186637 -294742 -319264 -121901 26005 -60553 -315670
16692 -315670 -303670 -133459 -101004 -93212 -154400 -213183 -140576 -133357 -195786 -304472 -200728
16681 -200728 -179752 -148004 -85279 -61432 -71354 -8376 -117346 -91411 -140617 -174558 -234103
16670 -234103 -308998 -130874 -75016 -242902 -133304 -39986 164141 147933 100969 41261 125910
16659 125910 129688 -59743 -167008 -76735 -115434 -107393 -57867 -72454 -140034 -82157 38546
16648 38546 85924 98080 43442 66536 118062 29944 160128 165557 70803 -30058 -121041
16637 -121041 -309665 -250201 -193537 -263555 -287584 -243863 -349260 -266541 -178593 -79545 -208447
16626 -208447 -415736 -490752 -245670 -88110 -91040 -268594 -350159 -423739 -465063 -481710 -487420
$$ packed form
16703B8982P395O9823j21837j18468n2532j08105k4522J97363J47906q6558k55117
16692c15670J2000J70211L2455P792o1188n8783P2607P219o2429j08686J03744
16681b00728K0976L1748O2725K3847r922O2978j08970K5935m9206l3941n9545
16670b34103p4895J78124N5858j67886J09598R3318K04127j6208m6964n9708Q4649
16659A25910L778j89431j07265R0273l8699Q041M9526j4587o7580N7877J20703
16648C8546M7378J2156n4638K3094N1526q8118J30184N429r4754j00861r0983
16637a21041j88624N9464N6664p0018k4029M3721j05397Q2719Q7948R9048j28902
16626b08447k07289p5016K45082J57560k930j77554q1565p3580m1324j6647n710
$$ plain form
16615 -487420 -385885 -642687 -564133 -192887 -86368 -162648 -178296 -152915 -42695 -45709 9928
16604 9928 113793 -13024 -53659 35392 -44768 54878 196737 104987 60326 88024 -16143
16593 -16143 -177471 -161813 -92385 -30155 19631 47435 66671 57148 99779 104235 88319 -42106
16581 -42106 -108378 -118237 -237416 -131537 59115 168603 31234 -65345 -210091 -243269 -186523
16570 -186523 -361599 -356583 -146168 -275100 -314044 21029 146906 -68325 -188069 -259795
16560 -259795 -126541 -37619 -143145 -64194 -182156 -146369 -116664 15587 179292 163762
16550 163762 48943 55889 -104047 -241447 -168226 -11013 99042 187986 192199 21627 21260
16539 21260 7153 -42030 -217737 -148910 24977 174368 93736 5055 -26372 -88262 -149444
$$ packed form
16615d87420J01535k56802P8554L71246J06519p6280j5648K5381J10220l014N5637
16604I928J03865j26817m0635Q9051q0160R9646J41859r1750m4661K7698j04167
16593a6143j61328J5658O9428O2230M9786K7804J9236r523M2631M456j5916j30425
16581d2106o6272r859j19179J05879J90652J09488j37369r6579j44746l3178N6746
16570a86523j75076N016K10415j28932l8944L35073J25877k15231j19744p1726
16560b59795J33254Q8922j05526P8951j17962L5787K9705J32251J63705j5530
16550A63762j14819O946j59936j37400P3221J57213J10055Q8944M213j70572l67
16539B1260j4107m9183j75707O8827J73887J49391q0632q8681l1427o1890o1182
$$ plain form
16528 -149444 -199348 -68176 8928 -29954 -221034 -220673 -37367 150280 82846 -59966 -115842
16517 -115842 -157434 -113918 19443 -4009 9743 61210 -103956 -338738 -382631 -322403 -256811
16506 -256811 84943 180961 119970 50544 -71542 -20330 95267 90854 21401 -65855 46273
16495 46273 12945 -173078 -315965 -271682 -156852 -68299 -90660 67750 73451 44228 71954
16484 71954 7614 195181 106909 -154790 -203240 -341139 -414512 -344081 -271098 -102325 -13887
16473 -13887 75834 160333 260643 224605 254977 149148 76957 118459 -38430 -8742 93872
16462 93872 148928 120655 63862 122609 166552 178250 106626 -31158 -78302 -176769 -268051
16451 -268051 -234252 -141908 -39505 -124142 -151232 -298696 -159384 103044 128145 26415
$$ packed form
16528a49444m9904J31172P7104l8882j91080L61J83306J87647o7434j42812n5876
16517a15842m1592M3516J33361k3452J3752N1467j65166k34782m3893O0228O5592
16506b56811L41754R6018o0991o9426j22086N1212J15597m413o9453q7256J12128
16495D6273l3328j86023j42887M4283J14830Q8553k2361J58410N701k9223K7726
16484G1954o4340J87567q8272k61699m8450j37899p3373P0431P2983J68773Q8438
16473a3887Q9721Q4499J00310l6038L0372j05829p2191M1502j56889K9688J02614
16462I3872N5056k8273n6793N8747M3943J1698p1624j37784m7144r8467r1282
16451b68051L3799R2344J02403q4637k7090j47464J39312K62428K5101j01730
$$ plain form
16441 26415 48403 -37669 -195142 -245932 -286350 -54131 9581 -42106 -188112 -223123 -121733
16430 -121733 14185 41943 -37062 16866 -34851 -172770 -143633 -151520 -63327 -183001 -296673
16419 -296673 -302279 -247764 -276589 -146570 -138483 -240571 -164703 -69388 -107318 85261 104095
16408 104095 4665 -235394 -77880 16349 21800 -105772 -36891 -59924 -112473 -89468 -230996
16397 -230996 -133747 -197063 -192888 -157334 -17410 62092 4482 -139017 -138908 -72229 121606
16386 121606 276756 389861 253018 105737 68469 1864 -51691 -198566 -227288 -114940
16376 -114940 -73325 -130318 32505 167240 136482 27788 21216 163752 115040 4163 20301
16365 20301 30338 7399 -66949 -178920 -19570 91038 122757 -29418 -60073 -31256 -9151
$$ packed form
16441B6415K1988q6072j57473n0790m0418K32219O3712n1687j46006l5011J01390
16430a21733J35918K7758p9005N3928n1717j37919K9137p887Q8193j19674j13672
16419b96673n606N4515k8825J30019Q087j02088P5868R5315l7930J92579J8834
16408A04095r9430k40059J57514R4229N451j27572O8881k3033n2549K3005j41528
16397b30996R7249o3316M175L5554J39924P9502n7610j43499J09O6679J93835
16386A21606J55150J13105j36843j47281l7268o6605n3555j46875k8722J12348
16376a14940M1615n6993J62823J34735l0758j08694o572J42536m8712j10877J6138
16365B0301J0037k2939p4348j11971J59350J10608L1719j52175l0655K8817K2105
$$ plain form
16354 -9151 219446 255997 136302 148712 59267 -69929 131721 37011 -138554 -4650 115191
16343 115191 113601 257318 6087 -2967 9421 -54428 -97836 42927 150292 55926 -81337
16332 -81337 -143462 -37494 23074 -82437 -62380 -168701 -204888 -88331 7169 192819 257946
16321 257946 8911 -79815 -144541 -37616 -86442 -203420 -112120 -201814 -212308 -158039 -181920
16310 -181920 -206622 -212865 -242737 -199987 -142378 -145384 -99270 4336 25129 202041 85143
16299 85143 36391 -206475 -231897 -216537 -219821 -64732 53004 13612 60214 42750 -23599
16288 -23599 5276 -38365 -59073 -139994 -179558 -67697 -173142 -315862 -295498 -344472 -257432
16277 -257432 14474 108259 123682 -47571 -223896 -207496 -268175 -164527 -131418 -235808
$$ packed form
16354i151K28597L6551j19695J2410q9445j29196K01650r4710j75565J33904J19841
16343A15191j590J43717k51231r054J2388o3849m3408J40763J07365r4366j37263
16332h1337o2125J05968O0568j05511K0057j06321l6187J16557R5500J85650O5127
16321B57946k49035q8726o4726J06925m8826j16978R1300q9694j0494N4269k3881
16310a81920k4702o243k9872M2750N7609l006M6114J03606K0793J76912j16898
16299H5143m8752k42866k5422J5360l284J55089J17736l9392M6602j7464o6349
16288b3599K8875m3641k0708q0921l9564J11861j05445j42720K0364m8974Q7040
16277b57432K71906R3785J5423j71253j76325J6400o0679J03648L3109j04390
$$ plain form
16267 -235808 -110330 -9442 22074 53048 18714 -104888 -148126 -208061 -124965 -5143 -217781
16256 -217781 -213997 -95206 -111019 95393 220022 46503 -68825 36551 -46798 -54679 -69085
16245 -69085 -2962 -49598 -147468 -3133 62614 135334 138699 159153 189904 46757 -138026
16234 -138026 -128649 28572 249109 178430 -109425 -199658 -296086 -298633 -371339 -390176 -271826
16223 -271826 -207236 -186555 -252421 -304385 -142937 -129928 -106601 -14367 113653 209261 103260
16212 103260 -88589 10343 199114 323907 237583 128424 78189 -35175 -89565 8842
16202 8842 47314 -121024 -9209 -1283 -110489 -224593 -188333 -199158 -248109 -247565 -134770
16191 -134770 -35376 -51261 -75768 -178307 -212421 -150640 -230938 -328570 -341733 -245621 -153271
$$ packed form
16267b35808J25478J00888L1516L0974l4334j23602m3238n9935Q3096J19822k12638
16256b17781L784J18791j5813K06412J24629j73519j15328J05376q3349p881j4406
16245f9085O6123m6636r7870J44335O5747P2720L365K0454L0751j43147j84783
16234a38026R377J57221K20537p0679k87855r0233r6428k547p2706j8837J18350
16223b71826O4590K0681o5866n1964J61448J3009K3327R2234J28020R5608j06001
16212A03260j91849R8932J88771J24793q6324j09159n0235j13364n4390R8407
16202H842L8472j68338J11815P926j09206j14104L6260j0825m8951N44J12795
16191a34770R9394j5885k4507j02539l4114O1781q0298r7632j3163R6112R2350
$$ plain form
16180 -153271 -207217 -120713 -121332 -222025 -122168 72666 115978 172601 248076 209787 5271
16169 5271 34544 3648 12588 -3238 69892 57240 -72273 -162225 -177937 -114048 -75004 -106025
16157 -106025 -10793 125757 128209 119851 49072 -23652 -3279 44163 -154277 -261417 -118744
16146 -118744 41118 9493 -155876 -308753 -411387 -287998 -304579 -274535 -191892 -154332
16136 -154332 144049 204500 182973 -34876 -164851 -268536 -280683 -358502 -324960 -211450
16126 -211450 -61497 -20016 75421 256339 121105 -10036 -215366 -160261 -9662 -1392
16116 -1392 21537 -13522 10587 -140921 -168282 -63722 63133 124271 37468 6572 160076
16105 160076 38583 -64026 -104181 -119840 27519 19125 24119 -100836 -42934 31271 39713
$$ packed form
16180a53271n3946Q6504o19j00693R9857J94834M3312N6623P5475l8289k04516
16169E271K9273l0896Q940j5826P3130j2652j29513q9952j5712O3889L9044l1021
16157a06025R5232J36550K452q358p0779p2724K0373M7442j98440j07140J42673
16146a18744J59862l1625j65369j52877j02634J23389j6581L0044Q2643L7560
16136a54332K98381O0451k1527k17849j29975j03685j2147p7819L3542J13510
16126b11450J49953M1481R5437J80918j35234j31141k05330N5105J50599Q270
16116a392K2929l5059K4109j51508k7361J04560J26855O1138q6803l0896J53504
16105A60076j21493j02609m0155j5659J47359q394M994j24955N7902P4205Q442
$$ plain form
16094 39713 146172 40315 -96648 -151639 -157598 -11408 1885 54468 155358 -6584 -85937
16083 -85937 -50040 -108249 -159556 -298618 -262827 -223746 -302000 -254332 -286752 -293693 -129871
16072 -129871 -72422 26477 23098 114745 133377 33396 -95744 -23289 165800 211979 31392
16061 31392 84401 7860 -48978 -32670 -13551 15681 -41653 123563 249968 177594 115294
16050 115294 18231 16049 127615 169145 171493 67010 17889 -10817 116791 193615 184901
16039 184901 76918 -76497 -86778 33586 309481 320817 426977 376078 401221 373955
16029 373955 498026 511411 398387 339299 181015 67777 -104502 -97433 -144935 -123046 -98063
16018 -98063 -164599 -93161 -108811 -69506 36234 196324 185024 71480 98712 128535 23274
$$ packed form
16094C9713J06459j05857j36963n4991n959J46190J3293N2583J00890j61942p9353
16083h5937L5897n8209n1307j39062L5791L9081p8254M7668l2420o941J63822
16072a29871N7449R8899l379R1647J8632r9981j29140P2455J89089M6179j80587
16061C1392N3009p6541n6838J6308J9119K9232n7334J65216J26405p2374o2300
16050A15294r7063k182J11566M1530K348j04483m9121k8706J27608P6824q714
16039A84901j07983j53415j0281J20364K75895J1336J06160n0899K5143k7266
16029C73955J24071J3385j13024n9088j58284j13238j72279P069m7502K1889K4983
16018i8063o6536P1438j5650L9305J05740J60090j1300j13544K7232K9823j05261
$$ plain form
16007 23274 43092 99246 -54207 -53781 54494 68627 -19810 13026 -123871 -159809 -8274
15996 -8274 -23175 -104261 -49378 48737 130370 43778 -48540 -64378 -80881 130444 143013 102050
15984 102050 -15490 -135529 -29247 85099 35641 127989 72678 78777 220646 207263 219420
15973 219420 183963 228704 171028 100004 106692 193500 160623 122591 117135 140830 -149899 -237304
15961 -237304 91812 215078 138063 35564 266377 126459 91172 149062 162442 19148
15951 19148 140808 204144 317843 109831 8689 175619 246095 273720 184821 458485
15941 458485 586244 403387 246459 382785 549216 695498 586226 621486 616657 503237
15931 503237 524259 545204 627177 526974 396010 292979 434036 602719 645575 726861
$$ packed form
16007B3274J9818N6154j53453M26J08275J4133q8437L2836j36897l5938J51535
15996h274j4901q1086N4883R8115Q1633q6592r2318j5838j6503K11325J2569m0963
15984A02050j17540j20039J06282J14346m9458R2348n5311O099J41869j3383J2157
15973B19420l5457M4741n7676p1024O688Q6808l2877l8032n456K3695k90729q7405
15961b37304L29116J23266p7015j02499K30813j39918l5287N7890J3380j43294
15951A9148J21660O3336J13699k08012j01142J66930P0476K7625q8899K73664
15941D58485J27759j82857j56928J36326J66431J46282j09272L5260m829j13420
15931E03237K1022K0945Q1973j00203j30964j03031J41057J68683M2856Q1286
$$ plain form
15921 726861 638439 591679 684199 617283 807195 1011889 954512 823561 611432 605177 706932
15910 706932 755402 755360 688844 613676 504565 326400 235652 332027 330807 365875 460580 488738
15898 488738 431754 425151 505389 446023 447816 439181 409300 336419 291499 227116 66536 172272
15886 172272 503078 496758 177455 104967 260236 414476 487435 515312 520734 445120 457307
15875 457307 355961 229460 378536 424396 422087 404042 306930 33218 -3503 85717 80130
15864 80130 161101 282367 307917 417675 407428 413263 448951 373918 413554 487312 462415
15853 462415 343094 164701 37543 7119 -15333 75708 48795 43293 91055 83669 137756
15842 137756 192552 207706 45510 38 -70523 -180442 63833 109833 57165 83927 -1143
$$ packed form
15921G26861q8422m6760R2520o6916J89912K04694n7377j30951k12129o255J01755
15910G06932M8470m2o6516p5168j09111j78165r0748R6375j220L5068R4705K8158
15898D88738n6984o603Q0238n9366J793q635k9881p2881m4920o4383j60580J05736
15886A72272L30806o320l19303p2488J55269J54240P2959K7877N422p5614J2187
15875D57307j01346j26501J49076M5860k309j8045r7112k73712l6721Q9220n587
15864H0130Q0971J21266K5550J09758j0247N835L5688p5033L9636P3758k4897
15853D62415j19321j78393j27158l0424k2452R1041k6913n502M7762p386N4087
15842A37756N4796J5154j62196m5472p0561j09919K44275M6000n2668K6762q5070
$$ plain form
15831 -1143 -176219 -101829 118388 258866 89119 4163 92414 15610 -62075 -155002 -179675
15820 -179675 -24348 94373 220925 144320 33362 5450 -130474 -305125 -197289 -21106
15810 -21106 40760 66305 296469 368759 322930 131136 76731 147142 75389 95773 140275
15799 140275 37678 239103 268415 121033 164575 183360 122492 82871 154357 207578 143141
15788 143141 159547 -157319 -236266 -310737 -151417 -237850 -159268 70400 64575 -77581 -183930
15777 -183930 -8875 356775 514178 288042 137118 34350 -116597 -175237 -74167 141334
15767 141334 226929 162714 32157 -207564 -77732 -119854 -125007 -94449 -199710 -253032 -202349
15756 -202349 -176908 -271104 -243602 -287465 -202053 -87036 43192 198474 162410 36904 116541
$$ packed form
15831a143j75076P4390K20217J40478j69747q4956Q8251p6804p7685r2927k4673
15820a79675J55327J18721J26552p6605j10958k7912j35924j74651J07836J76183
15810b1106O1866K5545K30164P2290m5829j91794n4405P0411p1753K0384M4502
15799A40275j02597K01425K9312j47382M3542J8785o0868l9621P1486N3221o4437
15788A43141J6406l16866p8947p4471J59320q6433P8582K29668n825j42156j06349
15777a83930J75055L65650J57403k26136j50924j02768j50947n8640J01070K15501
15767A41334Q5595o4215j30557k39721J29832m2122n153L0558j05261n3322N0683
15756b02349K5441r4196K7502m3863Q5412J15017J30228J55282l6064j25506P9637
$$ plain form
15745 116541 50728 98833 198112 242948 159097 175531 154486 58485 -17415 -15257 -10361 -145834
15733 -145834 -4322 52945 -123131 -144714 -91121 -40220 -54571 -148685 -94098 -31446 -23303
15722 -23303 -85776 -70192 -41631 51087 37902 91058 39926 133986 265448 255375 450673
15711 450673 492926 409679 275000 271076 210696 380695 548908 516876 615457 573046 242161
15700 242161 38887 -109716 -187531 -279174 -127214 -44114 -24443 100394 -99777 -118594
15690 -118594 884 -77137 -50286 -164628 -238566 -213862 -76565 -91957 -100478 -123077 20927
15679 20927 190195 214927 201366 194196 126932 -6541 -51117 121123 173221 49864 -85232
15668 -85232 -127073 -118540 -136676 -38504 107836 53389 34788 20196 82117 148089 932
$$ packed form
15745A16541o5813M8105R9279M4836q3851J6434k1045r6001p5900K158M896j35473
15733a45834J41512N7267j76076k1583N3593N0901j4351r4114N4587O2652Q143
15722b3303o2473J5584K8561R2718j3185N3156n1132R4060J31462j0073J95298
15711D50673M2253q3247j34679l924o0380J69999J68213l2032R8581m2411l30885
15700B42161k03274j48603p7815r1643J51960Q3100J9671J24837k00171j8817
15690a18594J19478p8021K6851j14342p3938K4704J37297j5392q521k2599J44004
15679B0927J69268K4732j3561p170o7264j33473m4576J72240N2098j23357j35096
15668h5232m1841Q533j8136R8172J46340n4447j8601j4592O1921O5972j47157
$$ plain form
15657 932 -71389 32378 101060 142609 98170 79598 33165 87518 -12710 -229860 -360002
15646 -360002 -327742 -164836 -57564 -87009 -230505 -124361 47901 188259 238533 191212
15636 191212 180939 141859 253504 303564 178761 118284 30073 -61013 -70066 -207578 -291523
15625 -291523 -105873 -72813 -162296 -198465 -317593 -421607 -336420 -260824 -286558 -304323 -93548
15614 -93548 104085 95332 118977 128248 53985 60635 54682 -94503 -144639 -21631 21190 29853
15602 29853 -161574 -136867 -193629 -205542 -165956 -228613 -135740 -154071 -150684 -23548 -71511
15591 -71511 -79956 -118001 -107028 2993 229464 181528 174228 -137559 -257551 -97237 243601
15580 243601 298248 258478 333363 235115 95634 -35236 -167149 -105532 143184 10408
$$ packed form
15657I32p2321J03767O8682M1549m4439j8572m6433N4353j00228k17150j30142
15646c60002L2260J62906J07272k9445j43496J06144J72262J40358N0274m7321
15636A91212j0273l9080J11645N0060j24803o0477q8211r1086r053j37512q3945
15625b91523J85650L3060q9483l6169j19128j04014Q5187P5596k5734j7765K10775
15614i3548J97633q753K3645R271p4263O650n953j49185n0136J23008M2821Q663
15602B9853j91427K4707n6762j1913L9586o2657R2873j8331L387J27136m7963
15591g1511q445l8045J0973J10021K26471m7936p300l11787j19992J60314L40838
15580B43601N4647l9770P4885r8248j39481j30870j31913O1617K48716j32776
$$ plain form
15570 10408 -21107 50471 167770 7460 -63033 -244679 -390738 -200465 -121136 -205508 -231781
15559 -231781 -172272 -257328 -272904 -229617 -372166 -292477 -192409 -126035 -246990 -226991 -62512
15548 -62512 195305 278918 166339 94527 86381 84932 153878 -21228 -165690 -55177 196817
15537 196817 391842 399478 311218 77921 19064 -84104 -227037 -237187 -159581 -126968 -96992
15526 -96992 -170361 -156876 -13535 -46944 38435 126173 166225 352120 325927 119915 109229
15515 109229 217374 265959 400233 254790 207663 199759 91283 154559 262200 156986
15505 156986 68171 -47670 -65025 -32167 -205264 -316396 -279041 -325802 -424538 -492874 -406716
15494 -406716 -145898 -114372 -142683 73150 96574 -81711 -119474 -94085 -99731 -186079 -16192
$$ packed form
15570A0408l1515P1578J17299j60310p0493j81646j46059J90273P9329q4372k6273
15559b31781N9509q5056j5576M3287j42549P9689J00068O6374j20955J9999J64479
15548f2512K57817Q3613j12579p1812q146j449O8946j75106j44462J10513K51994
15537A96817J95025P636q8260k33297n8857j03168j42933j0150P7606L2613K9976
15526i6992p3369J3485J43341l3409Q5379Q7738M0052J85895k6193k06012j0686
15515A09229J08145M8585J34274j45443m7127p904j08476O3276J07641j05214
15505A56986q8815j15841j7355L2858j73097j11132L7355m6761r8736o8336Q6158
15494d06716K60818L1526k8311K15833K3424j78285l7763K5389n646q6348J69887
$$ plain form
15483 -16192 -7998 -89342 -180992 -322211 -209364 -24368 194506 293611 101408 161503 142092
15472 142092 149522 178181 217013 211347 334395 244377 139135 219012 47477 -68228 -48023
15461 -48023 -95564 -49424 67924 102673 16633 -274541 -226082 56761 6120 292 3118
15450 3118 -86081 -124143 -31920 140339 247142 194266 144817 95441 113699 41806 -82078
15439 -82078 -206657 -108800 -27353 18745 111970 121328 41020 11524 -4956 23714 25575 71747
15427 71747 65683 -158446 -340710 -224055 -154150 -178039 -200393 -70408 -23303 24237 73588
15416 73588 -24066 -118780 -232802 -210097 -283980 -165673 -82197 -24327 -44946 -245439 -101191
15405 -101191 99078 17751 -105653 -34997 110323 152462 64516 121043 -7743 -126790
$$ packed form
15483a6192Q194q1344r1650j41219J12847J84996K18874R9105j92203O0095j9411
15472A42092P430K8659L8832n666J23048r0018j05242P9877j71535j15705K0205
15461d8023m7541M6140J17348L4749q6040k91174M8459K82843n0641n828K826
15450C118q9199l8062R2223J72259J06803n2876m9449m9376J8258p1893j23884
15439h2078j24579R7857Q1447M6098R3225R358q0308k9496j6480K8670J861M6172
15427G1747o064k24129j82264J16655O9905k3889k2354J29985M7105M7540M9351
15416G3588r7654r4714j14022K2705p3883J18307Q3476N7870k0619k00493J44248
15405a01191K00269q1327j23404P0656J45320M2139q7946N6527j28786j19047
$$ plain form
15395 -126790 -235745 -289303 -354447 -256510 -94028 554 342423 498422 501632 420797 338383
15384 338383 363789 180620 12183 -150666 -160753 -75484 64325 94312 188466 137101 111385
15373 111385 286856 273141 195352 52412 19940 -42727 -64115 23578 110255 162650 84128
15362 84128 36416 -192106 -174637 -70846 -133481 -198063 -338979 -367183 -216255 -878 48423
15351 48423 -796 -182471 -266871 -145603 -128250 35375 -118763 -281986 -135368 45568
15341 45568 131897 106365 124582 -9118 -9151 -103659 -142367 -131268 -207180 -50754 -177405 -436298
15329 -436298 -357223 -200756 -100490 -238517 -220874 -74582 -9938 36323 11872 -240117
15319 -240117 -370700 -374283 -183541 -131294 -157790 -61194 -80807 -46579 -40026 23489 -34678
$$ packed form
15395a26790j08955n3558o5144R7937J62482R4582L41869J55999L210q0835q2414
15384C38383K5406j83169j68437j62849j0087Q5269J39809K9987R4154n1365k5716
15373A11385J75471j3715p7789j42940l2472o2667k1388Q7693Q6677N2395p8522
15362H4128m7712k28522J7469J03791o2635o4582j40916k8204J50928K15377M9301
15351D8423m9219j81675q4400J21268J7353J63625j54138j63223J46618J80936
15341D5568Q6329k5532J8217j33700l3r4508l8708J1099p5912J56426j26651k58893
15329d36298P9075J56467J00266j38027J7643J46292O4644M6261k4451k51989
15319b40117j30583l583J90742N2247k6496R6596j9613L4228O553O3515n8167
$$ plain form
15308 -34678 -13004 -1331 -189513 -192502 -59238 -126503 -190600 -70447 62377 -15162 -167332
15297 -167332 -143993 -142477 -66032 -171421 -258554 -391164 -237174 -39894 28994 -2216 -6861
15286 -6861 -129562 -197082 -285993 -250013 -209693 -267785 -351047 -227694 -90560 -121464 -127834
15275 -127834 -157645 -102204 -10371 26910 80191 -94139 -150861 -83439 76115 63929 -73625
15264 -73625 -43636 14362 -7130 12283 -27127 -110025 -158779 -202151 -7894 -138471 -201992
15253 -201992 -316919 -352801 -173181 16409 37410 -28703 -50555 -26507 39956 -59070 -255186
15242 -255186 -227437 -235623 -113637 -102409 -104795 -52919 -90123 -25507 110316 256890 253762
15231 253762 207198 262324 225891 284944 141872 -195755 -395742 -376396 -152466 -50807
$$ packed form
15308c4678K1674J1673j88182k989J33264o7265o4097J20153J32824p7539j52170
15297a67332K3339J516P6445j05389q7133j32610J53990J97280O8888l1210m645
15286f861j22701o7520q8911L5980M0320n8092q3262J23353J37134l0904o370
15275a27834k9811N5441R1833L7281N3281j74330n6722O7422J59554j2186j37554
15264g3625K9989N7998k1492J9413l9410q2898m8754m3372J94257j30577o3521
15253b01992j14927l5882J79620J89590K1001o6113k1852K4048O6463r9026j96116
15242b55186K7749q186J21986J1228k386N1876l7204O4616J35823J46574l128
15231B53762m6564N5126l6433N9053j43072l37627j99987J9346K23930J01659
$$ plain form
15221 -50807 -98693 -98929 -69710 -23369 -71341 -180364 -130034 -196438 -386957 -333203 -168521
15210 -168521 -59750 101198 57337 6840 -10052 -47786 -183126 -58408 89613 99214 70863
15199 70863 -50179 -125809 -37630 -39714 -41338 -168719 -282848 -194828 -139500 -118197 -61793
15188 -61793 -119923 -84674 -158884 -125384 11945 188186 289415 293523 345434 300751 261260
15177 261260 132504 38325 30887 155442 168058 155035 67955 56919 162699 389763 382094
15166 382094 251410 285580 73084 -82201 35991 77129 -16672 -364 -50454 38740 187149
15155 187149 121591 149313 334895 214005 -65347 -97184 7423 112690 28536 -29951
15145 -29951 -24610 -69430 -62423 -10092 -199228 -115521 -89930 -74793 -129704 -226523 -182633 -97984
$$ packed form
15221e0807m7886k36K9219M6341m7972j09023N0330o6404j90519N3754J64682
15210a68521J08771J60948m3861n0497j6892l7734j35340J24718J48021R601k8351
15199G0863j21042p5630Q8179k084j624j27381j14129Q8020N5328K1303N6404
15188f1793n8130L5249p4210L3500J37329J76241J01229M108N1911m4683l9491
15177B61260j28756r4179p438J24555J2616j3023q7080j1036J05780K27064p669
15166C82094j30684L4170k12496j55285J18192M1138r3801J6308n0090Q9194J48409
15155A87149o5558K7722J85582j20890k79352l1837J04607J05267q4154n8487
15145b9951N341m4820P007N2331j89136Q3707K5591J5137n4911r6819M3890Q4649
$$ plain form
15133 -97984 -93694 -97312 -77342 -76572 -133839 -153352 -145760 -142488 -35749 11183 42856 -26001 -32005
15120 -32005 -58759 5123 -101277 -49169 199585 78231 -18863 -73848 -170734 -230298 -252955
15109 -252955 -120783 -27942 48932 149035 150270 42831 -155043 -105821 -13715 -32114 -23736
15098 -23736 72154 2715 -58584 -186264 -243975 -257986 -147361 -16650 62525 -149078 -98720
15087 -98720 -125819 -158121 -66510 212142 221689 115241 -49012 -184045 -316708 -372943 -189800
15076 -189800 -140385 -114756 -153266 -191452 -357932 -399602 -358275 -215032 -60939 36200 -41083
15065 -41083 47682 76567 53315 112919 198430 2067 -341156 -257897 -152268 -50653 -43599
15054 -43599 -62300 -251937 -415654 -328672 -188694 -326533 -383076 -289406 -233570 -137600 -2330
$$ packed form
15133i7984M290l618J9970P70n7267j9513P592L272J06739M6932L1673o8857o004
15120c2005k6754O3882j06400N2108K48754j21354r7094n4985r6886n9564k2657
15109b52955J32172R2841P6874J00103J235j07439j97874M9222R2106j8399Q378
15098b3736R5890o9439o1299j27680n7711j4011J10625J30711P9175k11603N0358
15087i8720k7099l2302R1611K78652R547j06448j64253j35033j32663n6235J83143
15076a89800M9415K5629l8510l8186j66480m1670M1327J43243J54093R7139p7283
15065d1083Q8765K8885k3252N9604Q5511j96363l43223Q3259J05629J01615P054
15054d3599j8701j89637j63717Q6982J39978j37839n6543R3670N5836R5970J35270
$$ plain form
15043 -2330 159975 154095 26577 -35312 -63903 41735 -33624 -84598 -66161 -110035 -111858 -374430
15031 -374430 -296607 -68941 50211 109790 54506 -99272 -11293 -149877 -282599 -242017
15021 -242017 -169831 -166280 -209370 -151513 -136483 -349715 -341298 -210445 -153882 38168 -68780
15010 -68780 -21651 -81518 -711 104813 221638 256700 146879 7521 20801 195935 138195
14999 138195 149809 153846 181078 233021 237040 114925 221954 261467 273106 286818 233407
14988 233407 -62422 -111361 13317 199635 392868 363448 270094 194025 105975 16688 -85591
14977 -85591 -213574 -173617 -302698 -410789 -255611 -122045 106143 85395 -129841 -263799
14967 -263799 -360985 -236715 -72752 -138986 -193726 -96444 -106173 -128496 -244880 -247425 -55938
$$ packed form
15043b330J62305n880j27518o1889k8591J05638p5359n0974J8437m3874j823k62572
15031c74430P7823K27666J19152N9579n5284j53778Q7979j38584j32722M0582
15021b42017P2186L551m3090N7857J5030k13232Q417J30853N6563J92050j06948
15010f8780M7129n9867Q0807J05524J16825L5062j09821j39358J3280J75134n7740
14999A38195J1614M037K7232N1943M019j22115J07029L9513J1639J3712n3411
14988B33407k95829m8939J24678J86318J93233k9420r3354p6069q8050q9287j02279
14977h5591j27983L9957j29081j08091J55178J33566K28188k0748k15236j33958
14967b63799r7186J24270J63963o6234n4740R7282r729k2323j16384k545J91487
$$ plain form
14956 -55938 140631 282537 229074 125499 48680 12230 179472 147287 -94881 -138788 -65570
14945 -65570 46567 56004 114222 49343 -108265 -67119 -107246 -171558 -188365 -16122 -205905
14934 -205905 -371349 -243206 -88153 -21030 -170364 -188830 -93268 61995 72355 -15316
14924 -15316 82953 229760 291042 372339 260471 39414 -148298 -288578 -353216 -359526 -338780
14913 -338780 -208900 -115666 -125120 -217799 -127514 -76584 65961 124078 94146 186528 85910
14902 85910 49941 124887 -21830 -185755 -200004 -77434 -201227 -76091 114761 12206
14892 12206 85952 126913 55843 -2013 -94710 -118353 11342 172690 242523 282700 245954
14881 245954 170732 162622 180313 196633 200788 265028 187476 161388 51138 9805 -2239 22490
$$ packed form
14956e5938J96569J41906n3463j03575p6819l6450J67242l2185k42168m3907P3218
14945f5570J12137R437N8218o4879j57608M1146m0127o4312j6807J72243j89783
14934b05905j65444J28143J55053O7123j49334j8466R5562J55263J0360q7671
14924a5316R8269J46807O1282Q1297j11868k21057j87712j40280o4638o310K0746
14913c38780J29880R3234r454r2679R0285N0930J42545N8117k9932R2382j00618
14902H5910l5969P4946j46717j63925j4249J22570j23793J25136J90852j02555
14892A2206P3746M0961p1070n7856r2697k3643J29695J61348O9833M0177l6746
14881B45954p5222q110J7691J6320M155O4240p7552k6088j10250m1333j2044K4729
$$ plain form
14869 22490 12159 -47598 -89995 -12437 -40715 -107271 -189247 -246762 -336005 -380058 -235893
14858 -235893 -69417 -23052 8141 162455 198614 80877 122765 167683 54185 46038 66672
14847 66672 -46330 -352190 -305362 -269424 -56896 38927 -21490 -79806 45308 140144 -112557
14836 -112557 -236834 -208595 -126987 -70641 53918 41810 79538 131795 120312 110099 27963
14825 27963 21590 18930 -129362 -9556 49394 77495 -159974 -197329 -250169 -319423 -211358
14814 -211358 -205508 -141085 -176387 -109756 -167368 -345406 -294974 -98507 170059 185799 197286
14803 197286 118089 64255 6505 62006 90451 52671 -185044 -388538 -322426 -193025 -52444
14792 -52444 102096 135214 120298 150119 59128 -52277 57438 -21635 -266605 -280563 -413038
$$ packed form
14869B2490j0331n9757m2397P7558k8278o6556q1976n7515q9243m4053J44165
14858b35893J66476M6365L1193J54314L6159j17737M1888M4918j13498q147K0634
14847F6672j13002l05860M6828L5938K12528R5823o0417n8316J25114R4836k52701
14836a12557j24277K8239Q1608N6346J24559j2108L7728N2257j1483j0213q2136
14825B7963o373k660j48292J19806N8950K8101k37469l7355n2840o9254J08065
14814b11358N850O4423l5302O6631n7612j78038N0432J96467K68566J5740J1487
14803A97286p9197n3834n7750N5501K8445l7780k37715k03494O6112J29401J40581
14792e2444J54540L3118j4916K9821r0991j11405J09715p9073k44970j3958j32475
$$ plain form
14781 -413038 -413972 -295124 -268222 -136232 -118772 -225083 -28796 -18760 -262115 -264813 -253941
14770 -253941 -251183 -286235 -186457 -46299 1892 -49497 -29981 25022 107245 200926 178226
14759 178226 197410 196995 82869 41942 45958 45931 46761 -49055 -1884 -54518 -143835 -86535 -21520
14746 -21520 -131204 -93762 57313 -32908 -44383 147150 6072 80736 141654 134008 -3323
14735 -3323 61919 26750 -74120 -161995 -89515 -9494 -142172 -117722 -174539 -207026 -78588
14724 -78588 56883 50820 62500 30215 -39242 -270885 -485704 -284601 -140485 -190139 -176664
14713 -176664 -100798 -14844 12091 36928 -41447 -84307 -57642 60031 -63456 -81862 927
14702 927 -214050 -148365 44425 32143 40839 65876 -22832 -69129 -12336 153254 70006 -3035
$$ packed form
14781d13038r34J18848K6902J31990J7460j06311J96287J0036k43355k698J0872
14770b53941K758l5052R9778J40158M8191n1389J9516N5003Q2223R3681k2700
14759A78226J9184m15j14126m0927M016k7Q30r5816M7171n2634q9317N7300O5015
14746b1520j09684L7442J51075r0221j1475J91533j41078P4664O0918p646j37331
14735c323O5242l5169j00870q7875P2480Q0021j32678K4450n6817l2487J28438
14724g8588J35471o063J1680l2285o9457k31643k14819K01103J44116m9654J3475
14713a76664P5866Q5954K6935K4837p8375m2860K6665J17673j23487j8406Q2789
14702I27k14977O5685J92790j2282Q696K5037q8708m6297N6793J65590q3248p3041
$$ plain form
14690 -3035 -49263 53850 70942 9774 63548 38378 66450 182368 120091 -5626 8206
14679 8206 -82398 -88535 -185865 -448740 -369679 -264983 -324080 -132521 -225431 -425293 -360915
14668 -360915 -160377 28942 -28088 -133008 -66700 -39259 -61982 29341 223262 354450
14658 354450 153273 67863 28617 181920 173775 140581 89270 91804 249552 187684 151649
14647 151649 196187 109485 -9670 -94364 -65631 76273 173529 -54451 -95377 -98074 -88505
14636 -88505 -80219 92307 52682 31694 -35271 -122596 23445 122981 133814 143836 131814
14625 131814 67984 -167662 -59871 106664 79947 18353 -7957 111538 235505 91681
14615 91681 28589 -17278 -137052 -229942 -146555 12816 -127846 -332169 -447046 -216676
$$ packed form
14690c035m6228J03113J7092o1168N3774k5170K8072J15918o2277j25717J3832
14679H206r0604o137r7330k62875P9061J04696n9097J91559r2910j99862O4378
14668c60915K00538J89319n7030j04920O6308K7441k2723R1323J93921J31188
14658C54450k01177q5410l9246J53303q145l3194n1311K534J57748o1868l6035
14647A51649M4538q6702j19155q4694K8733J41904R7256k27980m0926k697R569
14636h8505Q286J72526l9625k0988o6965q7325J46041R9536J0833J0022j2022
14625A31814o3830k35646J07791J66535k6717o1594k6310J19495J23967j43824
14615I1681o3092m5867j19774r2890Q3387J59371j40662k04323j14877K30370
$$ plain form
14605 -216676 -171923 -191843 -148956 -30946 157530 256372 235136 61445 -74857 -111253 -195186
14594 -195186 -236613 -244204 -367716 -479811 -388543 -199771 -106596 -9445 -290112 -235389 -130881
14583 -130881 185484 292596 161679 117501 223936 50186 -65524 33726 -66948 -62854
14573 -62854 32011 -33337 37231 54999 -2670 -140763 -136547 72052 113738 232540 276003
14562 276003 157678 -15965 -24520 103049 137347 49124 60950 -7675 112477 -2447 -50694
14551 -50694 -59282 -24577 23901 37263 44184 21397 50370 -5818 9948 -77158 -60636 -86040
14539 -86040 -111694 -41050 71041 -17666 29855 -26102 21771 49587 -97711 -225187 -179415
14528 -179415 -131987 -128191 -77550 -24370 -124017 -293521 -392843 -416573 -318705 -270730 -176452
$$ packed form
14605b16676M4753j9920M2887J18010J88476R8842k1236j73691j36302l6396q3933
14594a95186m1427p591j23512j12095R1268J88772R3175R7151k80667N4723J04508
14583a30881L16365J07112j30917m4178J06435j73750j15710R9250j00674M094
14573f2854R4865o5348P0568J7768n7669j38093M216K08599M1686J18802M3463
14562B76003j18325j73643q555J27569L4298q8223J1826o8625J20152j14924m8247
14551e0694q588L4705M8478J3362O921k2787K8973n6188J5766q7106J6522k5404
14539h6040k5654P0644J12091q8707M7521n5957M7873K7816j47298j27476M5772
14528a79415M7428L796N0641N3180r9647j69504r9322k3730R7868M7975R4278
$$ plain form
14517 -176452 -169151 -60316 -77167 -186797 -135799 -221065 -1475 79282 36183 4265 66734
14506 66734 69594 2475 53384 207580 258484 55486 -109583 -389317 -544660 -507140 -307882
14495 -307882 -281326 -264288 -83717 42919 62919 -12413 -56058 -53053 -76231 -78245 -23255
14484 -23255 -21875 30810 47616 146067 1499 -246230 -383819 -372616 -260835 -272589 -172301
14473 -172301 -45075 49929 -119329 -94632 84800 112826 -16461 -194093 -177339 -7914
14463 -7914 178518 200041 129523 35803 -100778 -154359 -129508 -218531 -402298 -413340 -347203
14452 -347203 -156311 5519 144770 -110450 -170082 -94135 -29147 -57010 45402 127816
14442 127816 233302 332708 388966 342617 316375 248071 7736 -136944 -100481 25994 -64350
$$ packed form
14517a76452P301J08835j6851j09630N0998q5266K19590Q0757m3099l1918O2469
14506F6734K860o7119N0909J54196N0904k02998j65069k79734j55343L7520J99258
14495c07882K6556J7038J80571J26636K0000p5332m3645L005k3178k014N4990
14484b3255J380N2685J6806R8451j44568k47729j37589J1203J11781j1754J00288
14473a72301J27226R5004j69258K4697J79432K8026j29287j77632J6754J69425
14463g914J86432K1523p0518r3720j36581n3581K4851q9023j83767j1042O6137
14452c47203J90892J61830J39251k55220n9632P5947O4988k7863J02412Q2414
14442A27816J05486R9406N6258m6349k6242o8304k40335j44680L6463J26475r0344
$$ plain form
14431 -64350 -107444 -57416 -85505 -104579 -35623 -40406 -182305 -226725 -239947 -348212 -376467
14420 -376467 -119630 -118181 -221502 -322313 -401763 -254751 -6696 94859 161500 -25568
14410 -25568 -5835 184581 227183 392503 395054 178097 215054 248398 293153 240135 141683
14399 141683 57573 14509 -83220 -162238 -76924 20981 -138014 -245432 -187762 -280515 -148042
14388 -148042 -43358 88058 81337 -59136 -157922 -113216 -25455 -128515 -116846 -122510 -226160
14377 -226160 -516509 -412698 -273360 -269640 -205281 44511 23364 -7013 -112920 -215438
14367 -215438 -257818 -316506 -435820 -326496 -305082 -345872 -265845 -128537 -138392 -65371 -66718
14356 -66718 -197155 -212817 -97844 -125993 -70779 -12196 -24107 -7143 97975 157163 136442
$$ packed form
14431f4350m3094N0028k8089j9074O8956m783j41899m4420j3222j08265k8255
14420c76467K56837J449j03321j00811p9450J47012K48055J01555O6641j87068
14410b5568J9733J90416M2602J65320K551k16957L6957L3344M4755n3018r8452
14399A41683q4110m3064r7729p9018Q5314R7905j58995j07418N7670r2753J32473
14388a48042J04684J31416o721j40473r8786M4706Q7761j03060J1669n664j03650
14377b26160k90349J03811J39338L720O4359K49792k1147l0377j05907j02518
14367b15438m2380n8688j19314J09324K1414m0790Q0027J37308r855P3021j347
14356f6718j30437j5662J14973k8149N5214N8583j1911J6964J05118N9188k0721
$$ plain form
14345 136442 168985 9122 -191122 -128421 31687 102770 -47182 109726 180342 130040
14335 130040 185224 153627 -85251 -44995 57839 -11279 -180893 -206049 50511 376683
14325 376683 334422 239259 69208 -156256 -120961 -63613 65102 263737 291263 140472
14315 140472 -48805 -71460 -124855 -65007 -107088 -87328 -57449 -131977 -283049 -197047 -195685
14304 -195685 -107885 -40672 -164565 -246722 -201147 -273534 -385863 -394487 -274743 -205390 -159461
14293 -159461 -96778 -27150 3044 -15890 68056 -75882 -221335 -227577 -86606 88329 159348
14282 159348 179974 109617 107985 143296 166297 113792 89486 83612 296228 215354 218213 116868
14270 116868 -6203 -111526 -92008 53625 51919 -119109 -234495 -169156 -27531 63908
$$ packed form
14345A36442L2543j59863k00244O2701J60108P1083j49952J56908P0616n0302
14335A30040N5184l1597k38878M0256J02834o9118j69614k5156K56560L26172
14325C76683m2261r5163j70051k25464L5295N7348J28715J98635K7526j50791
14315A40472j89277k2655n3395N9848m2081J9760K9879p4528j51072Q6002J362
14304a95685Q7800O7213j23893q2157M5575p2387j12329q624J19744O9353M5929
14293a59461O2683O9628L0194j8934Q3946j43938j45453o242J40971J74935P1019
14282A59348K0626p0357j632L5311K3001n2505k4306n874K12616q0874K859j01345
14270A16868j23071j05323J9518J45633j706j71028j15386O5339J41625R1439
$$ plain form
14260 63908 -13729 -255242 -420924 -464722 -333559 -191596 -212193 -164711 -133698 -168366 -72797
14249 -72797 -37828 -28535 -120733 -180578 -102804 -20088 -17158 -42099 -50230 -170790 -157053 -233345
14237 -233345 -142017 4215 43298 708 -75246 -109852 -185921 -127662 -232536 -221464 -166125
14226 -166125 -228144 -190899 -157437 -142535 -30829 16391 83058 210961 186220 144176 174548
14215 174548 21848 56822 109349 -58564 -63646 -87865 -230358 -246995 -215659 -137455 -198486
14204 -198486 -340331 -469541 -446171 -249384 68665 89268 -3688 -13739 -89733 -186578 -114626
14193 -114626 12841 141409 177729 55926 19388 -90025 -142113 -225863 -265414 -264485 -219052
14182 -219052 -258712 -242183 -256662 -403360 -470570 -315698 -97963 -94412 -86015 -52414 -114480
$$ packed form
14260F3908p7637k41513j65682m3798J31163J41963k0597M7482L1013l4668R5569
14249g2797L4969R293r2198n9845P7774Q2716K930k4941q131j20560J3737p6292
14237b33345R1328J46232L9083m2590p5954l4606p6069N8259j04874J1072N5339
14226a66125o2019L7245L3462J4902J11706M7220O6667J27903k4741m2044L0372
14215A74548j52700L4974N2527j67913n082k4219j42493j6637L1336P8204o1031
14204a98486j41845j29210K3370J96787L18049K0603r2956j0051p5994r6845P1952
14193a14626J27467J28568L6320j21803l6538j09413n2088q3750l9551R29M5433
14182b19052l9660J6529j4479j46698o7210J54872K17735L551Q397L3601o2066
$$ plain form
14171 -114480 -143325 -168206 -103452 -62585 -121527 -261068 -191597 -153411 -172793 -213142 -70849
14160 -70849 93704 165678 103466 -80758 -46433 -96589 -93159 61282 126766 143779 109395
14149 109395 42401 -135091 -36609 -89732 -254605 -159431 -133663 5170 262904 278109 51691
14138 51691 -163536 -80781 -33901 -76411 -80817 -85554 -148253 -266768 -164054 -12097 64452
14127 64452 34413 -128601 -81153 -130458 -150695 -206280 -26596 -119410 -277296 -356850 -160328
14116 -160328 -188489 -100394 -53274 -184750 -293084 -345760 -361283 -308770 -81657 133867 271720
14105 271720 215882 117660 33865 -18927 -209903 -77374 181419 146339 -39117 -114332 -60295
14094 -60295 88135 -89815 -258665 -243128 -199642 -194781 -114775 -88159 -35924 -103135 -180277
$$ packed form
14171a14480k8845k4881O4754M0867n8942j39541O9471L8186j9382m0349J42293
14160g0849J64553P1974o2212j84224L4325n0156L430J54441O5484J7013l4384
14149A09395o6994j77492R8482n3123j64873R5174K5768J38833K57734J5205k26418
14138E1691k15227Q2755M6880m2510m406m737o2699j18515J02714J51957P6549
14127F4452l0039j63014M7448m9305k0237n5585J79684r2814j57886p9554J96522
14116a60328k8161Q8095M7120j31476j08334n2676j5523N2513K27113K15524J37853
14105B71720n5838r8222q3795n2792j90976J32529K58793l5080j85456p5215N4037
14094f0295J48430j77950j68850J5537M3486M861Q0006K6616N2235o7211p7142
$$ plain form
14083 -180277 -72095 -47479 -79050 -58261 -73756 -90632 -110964 19359 -55642 -200792 -259465
14072 -259465 -274096 -226230 -29718 58338 -19332 41757 44269 -54295 -136811 -54911 -132300
14061 -132300 -137412 -123802 -12459 193314 292858 -15538 -164573 -137197 -68237 -203566 -94428
14050 -94428 -131578 -132028 -81435 -72378 -77983 23168 23721 90555 276826 313980 130492 9349
14038 9349 -115215 -139270 -177589 -108733 16790 36403 23766 -64582 -35516 5634 -151435
14027 -151435 -222668 -140428 -134606 -163534 -169058 -50948 106779 111837 51030 143145 139529 180549
14015 180549 166532 14273 -148514 -56495 26039 -100243 -98669 -311329 -391742 -262343 -83043
14004 -83043 -11803 -9032 -57340 -41100 -101846 -240797 -335561 -371995 -236812 -293644 -474269
$$ packed form
14083a80277J08182K4616l1571K0789j5495j6876k0332J30323p5001j45150n8673
14072b59465j4631M7866J96512Q8056p7670O1089K512r8564q2516Q1900p7389
14061a32300n112J3610J11343K05773R9544l08396j49035K7376O8960j35329J09138
14050i4428l7150m50N0593R057n605J01151N53O6834J86271L7154j83488j21143
14038I349j24564k4055l8319O8856J25523J9613j2637q8348K9066M1150j57069
14027a51435p1233Q2240N822k8928n524J18110J57727N058o0807R2115l616M1020
14015A80549j4017j52259j62787R2019Q2534j26282J574k12660q0413J29399J79300
14004h3043P1240K771m8308J6240o0746j38951r4764l6434J35183n6832j80625
$$ plain form
13993 -474269 -417404 -283938 -190593 -175295 -219635 -275997 -152299 -287755 -301410 -260699 -181874
13982 -181874 -164457 -29886 -151322 -189251 -80135 54248 213633 99187 84079 28301
13972 28301 -53462 112382 264511 192804 92216 -21081 -192222 -83940 25103 126757
13962 126757 321140 343345 276831 300976 316031 283332 126447 61832 3449 20062 134174
13951 134174 116720 184748 189867 8728 1883 55188 -9678 -114084 -141050 -114479 -107656 -200782
13939 -200782 -288120 -210162 -244223 -172882 -206263 -104969 179501 249562 392683 302430 262663
13928 262663 263507 136018 100128 100165 94121 116609 203383 278606 151252 86349 -86770 -197543
13916 -197543 -17510 -43858 -54168 67889 -64471 -225752 -257635 -269662 -140073 -81683
$$ packed form
13993d74269N6865J33466R3345J5298m4340n6362J23698j35456j3655M0711P8825
13982a81874J7417J34571j21436l7929J09116J34383J59385j14446j5108n5778
13972B8301q1763J65844J52129p1707j00588j13297j71141J08282J09043J01654
13962A26757J94383K2205o6514K4145J5055l2699j56885o4615n8383J6613J14112
13951A34174j7454O8028N119j81139o845N3305o4866j04406k6966K6571O823r3126
13939b00782q7338P7958l4061P1341l3381J01294K84470P0061J43121r0253l9767
13928B62663Q44j27489l5890L7o044K2488Q6774P5223j27354o4903j73119j10773
13916a97543J80033k6348j0310J22057j32360j61281l1883j2027J29589N8390
$$ plain form
13906 -81683 -108179 -68072 -116385 -186446 -134890 -133125 -180290 -80703 -286066 -418976 -200475
13895 -200475 -68690 -57737 -360943 -478573 -359521 -105313 -92686 14423 -81458 -284171
13885 -284171 -337615 -263955 -195526 -101882 -95117 84250 14171 1484 44793 21826 33466
13874 33466 121661 42091 4767 37809 152093 168230 -10360 -55404 12976 -157668 -209924
13863 -209924 -259483 -187028 -37983 -19876 92963 -22570 -138663 -206274 -289482 -212043 -274477
13852 -274477 -108418 31128 50178 -114084 -52637 67399 49233 48107 122340 104629 189827
13841 189827 168523 117962 99024 147118 72305 -5696 -101801 -251849 -248964 -115808 10547
13830 10547 94007 42702 110742 38497 13619 80097 158540 269600 181724 57061 98208
$$ packed form
13906h1683k6496M0107m8313p0061N1556J765m7165R9587k05363j32910K18501
13895b00475J31785J0953l03206j17630J19052K54208J2627J07109r5881k02713
13885b84171n3444P3660O8429R3644O765J79367p0079j2687M3309k2967J1640
13874C3466Q8195p9570l7324L3042J14284J6137j78590m5044O8380j70644n2256
13863b09924m9559P2455J49045J8107J12839j15533j16093o7611q3208P7439o2434
13852b74477J66059J39546J9050j64262O1447J20036j8166j126P4233j7711Q5198
13841A89827k1304n0561j8938M8094p4813p8001r6105j50048K885J33156J26355
13830A0547Q3460n1305O8040p2245k4878O6478P8443J11060q7876j24663M1147
$$ plain form
13819 98208 -17245 22673 -19647 -95446 -25410 -152218 -96862 -53089 -170361 -171761 -110543
13808 -110543 95956 35207 -164128 -159556 -210072 -341158 -130719 -36215 -66837 -119023 -91200
13797 -91200 94463 60219 -72116 -128920 -140212 -32540 22255 -43356 -61725 -193103 -127909
13786 -127909 -158866 -226262 -212666 -219581 -77046 76663 7395 8113 54890 16139 109823 67194
13774 67194 -7735 -42915 3662 107147 221898 203477 350088 382986 208439 181174 233273
13763 233273 151492 113468 90633 -56598 -195939 -207088 32736 263329 277293 215798 238489
13752 238489 284048 200979 124374 68088 121789 97602 203386 73925 -129525 -33552 75872
13741 75872 -64047 -216971 -300937 -384596 -298515 -228296 -379104 -378798 -187592 -82611 -61164
$$ packed form
13819I8208j15453L9918m2320p5799P0036j26808N5356M3773j17272j400O1218
13808a10543K06499o0749j99335M572n0516j31086K10439R4504l0622n2186K7823
13797i1200J85663l4244j32335n6804j1292J07672N4795o5611j8369j31378O5194
13786a27909l0957o7396J3596o915J42535J53709o9268P18M6777l8751R3684m2629
13774F7194p4929l5180M6577J03485J14751j8421J46611L2898j74547k7265N2099
13763B33273q1781l8024k2835j47231j39341j1149K39824K30593J3964o1495K2691
13752B38489M5559q3069p6605n6286N3701k4187J05784j29461k03450R5973J09424
13741G5872j39919j52924q3966q3659Q6081P0219j50808L06J91206J04981K1447
$$ plain form
13730 -61164 -112944 -111086 -333816 -321083 -201715 -177295 -408 158940 175665 180340 71094
13719 71094 4488 -102055 -68863 21970 -28994 10749 19073 53450 62050 167691 358191
13708 358191 522811 332604 67539 -145399 -224290 -270474 -233197 -112041 -51898 -80364
13698 -80364 -136381 -218131 -218318 -106052 59376 -10784 -7023 -83684 -104685 -92922 -123422 -203369
13686 -203369 -221634 -91333 18602 1484 -1690 62290 66912 -223931 -243010 -78565 51083
13675 51083 -49922 -110282 -127649 -110082 26850 83401 30441 -64848 -151921 -62596 -81601
13664 -81601 -166155 -72222 -137624 -216110 -159976 -164292 -371998 -444077 -330536 -245542 -109164
13653 -109164 -8634 183884 356838 311453 186019 -85023 -151533 38820 -75861 -72443
$$ packed form
13730f1164n1780J858k22730J2733J19368K4420J76887J59348J6725M675j09246
13719G1094o6606j06543L3192R0833n0964L9743Q324L4377Q600J05641J90500
13708C58191J64620j90207k65065k12938p8891m6184L7277J21156O0143k8466
13698h0364n6017q1750j87J12266J65428p0160L761p6661k1001J1763l0500p9947
13686b03369j8265J30301J09935j7118l174O3980M622k90843j9079J64445J29648
13675E1083j01005o0360j7367J7567J36932N6551n2960r5289q7073Q9325j9005
13664h1601q4554R3933o5402p8486N6134m316k07706p2079J13541Q4994J36378
13653a09164J00530J92518J72954m5385j25434k71042o6510J90353j14681L418
$$ plain form
13643 -72443 -193799 -320028 -115960 -84218 -252190 -263216 -119887 -118507 -7255 229388
13633 229388 107733 -238434 -241248 -218599 -236984 -249289 16207 309398 185829 226408 407735
13622 407735 371407 325148 367353 130615 -19371 78052 208769 92150 128641 97258 42503
13611 42503 152324 168420 -80179 -195908 -266707 -200246 -30106 158220 213823 345652
13601 345652 349118 353413 123671 -55249 -139660 -138653 -67202 4045 -15932 -102295 -13045 -101278
13589 -101278 -29747 214998 178698 -11063 -91368 -72765 -72322 -53991 -90324 -125287 -42841
13578 -42841 17596 20050 38796 46203 -20844 108061 229457 219292 -66327 -185350 3098
13567 3098 68861 -90876 -144456 -182495 -204034 -27671 74650 116971 155846 58131 -45224
$$ packed form
13643g2443j21356j26229K04068L1742j67972j1026J43329J380J11252K36643
13633B29388j21655l46167k814K2649j8385j2305K65496K93191j23569M0579J81327
13622D07735l6328m6259M2205k36738j49986R7423J30717j16619L6491l1383n4755
13611D2503J09821J6096k48599j15729p0799O6461J70140J88326N5603J31829
13601C45652L466M295k29742j78920q4411J007P1451P1247j9977q6363Q9250q8233
13589a01278P1531K44745l6300j89761q0305J8603M43J8331l6333l4963Q2446
13578d2841O0437K454J8746P407o7047J28905J21396j0165k85619j19023J88448
13567C098O5763j59737n3580l8039k1539J76363J02321M2321L8875r7715j03355
$$ plain form
13556 -45224 -34067 -171497 -265888 -133027 -178142 1818 90731 144845 129337 12139 -55222
13545 -55222 -166527 -331002 -151792 -100400 -102942 -39389 -82463 42080 -30284 -130106 -8100
13534 -8100 -22087 -61379 -21968 -91778 -28022 55044 237842 240440 69058 137500 144369 -146290
13522 -146290 -251809 -277475 -235962 53446 115305 49120 -37536 108730 232363 7703
13512 7703 -17715 11188 -138273 -174645 41183 182896 160012 167311 197287 157793 214860
13501 214860 96974 -30475 56358 35127 106556 123268 -94101 -224000 -336876 -243062
13491 -243062 -182349 -180320 -71072 19833 45604 259907 288364 223083 21896 -93844 -67536
13480 -67536 77911 252187 223053 92981 -178 -135937 -125320 47542 288514 173862
$$ packed form
13556d5224J1157j37430r4391J32861m5115J79960Q8913N4114j5508j17198o7361
13545e5222j11305j64475J79210N1392k542O3553m3074J24543p2364r9822J22006
13534h100j3987l9292L9411o9810O3756Q3066J82798K598j71382O8442O869k90659
13522a46290j05519k5666M1513K89408O1859o6185q6656J46266J23633k24660
13512G703k5418K8903j49461l6372K15828J41713k2884P299K9976l9494N7067
13501B14860j17886j27449Q6833k1231P1429J6712k17369j29899j12876R3814
13491b43062O0713K029J09248R0905K5771K14303K8457o5281k01187j15740K6308
13480f7536J45447J74276k9134j30072r3159j35759J0617J72862K40972j14652
$$ plain form
13470 173862 120193 15089 -86893 5985 150525 152998 4845 -6774 -31614 -6775 -62480
13459 -62480 25730 36188 233045 363021 347136 298995 343915 254960 101380 157108 17087
13448 17087 -69337 -26780 -66881 -157786 -378559 -394887 -289772 -176916 -40682 76020 48644
13437 48644 80401 237324 262861 210978 142723 187056 63977 -26648 -102779 -78638 -107109
13426 -107109 -192343 -260386 -176266 -87336 72213 131331 142135 144456 270164 478718 386800
13415 386800 291070 176912 53451 68449 215848 199743 222363 213883 299390 426211 342779
13404 342779 351093 348274 371262 279585 251037 293983 390871 517740 503071 322472 121728
13393 121728 29847 72247 7799 97869 127285 219709 198710 -172919 -345210 -169385 42516
$$ packed form
13470A73862n3669j05104j01982R2878J44540K473j48153j1619k4840K4839n5705
13459f2480Q8210J0458J96857J29976j5885m8141M4920q8955j53580N5728j40021
13448A7087q6424M2557m0101r0905k20773j6328J05115J12856J36234J16702k7376
13437D8644L1757J56923K5537n1883o8255M4333j23079r0625p6131K4141k8471
13426a07109q5234o8043Q4120Q8930J59549N9118J0804K321J25708K08554r1918
13415C86800r5730j14158j23461J4998J47399j6105K2620q480Q5507J26821q3432
13404C42779Q314k819K2988r1677k8548M2946R6888J26869j4669j80599k00744
13393A21728r1881M2400o4448R0070K9416R2424k0999l71629j72291J75825K11901
$$ plain form
13382 42516 43792 -227035 -126831 184209 183684 150843 187047 152614 59366 -26608 -22915 61786
13370 61786 134125 40691 51122 160485 354239 294804 -94067 -198395 -43057 -25304 150512
13359 150512 127574 215148 270734 206163 129318 99892 73036 -2019 -60989 -33364 194661
13348 194661 367767 196177 176429 309326 257560 199090 -135457 -159075 32907 -120001
13338 -120001 -134191 -149405 -254497 -432895 -333115 -329118 -345000 -477264 -385340 -127160 179444
13327 179444 283400 240495 228114 102146 -46947 -117762 -120175 -45952 76182 147173 149445
13316 149445 108106 75450 -10436 94315 114855 38067 134820 211264 142123 119996 151285
13305 151285 174267 172400 75956 -77893 120695 334953 286573 111459 -11094 -1285 -51430
$$ packed form
13382D2516J276k70827J00204L11040n25l2841L6204l4433r3248q5974L693Q4701
13370F1786P2339r3434J0431J09363J93754n9435l88871j04328J55338J7753J75816
13359A50512k2938Q7574N5586o4571p6845k9426k6856p5055n8970K7625K28025
13348A94661J73106j71590j9748J32897n1766n8470l34547k3618J91982j52908
13338a20001j4190j5214j05092j78398R9780L997j5882j32264R1924K58180L06604
13327A79444J03956m2905j2381j25968j49093p0815k413P4223J22134P0991K272
13316A49445m1339l2656q5886J04751K0540p6788R6753P6444o9141k2127L1289
13305A51285K2982j867r6444j53849J98588K14258m8380j75114j22553R809n0145
$$ plain form
13294 -51430 67736 203434 165674 206697 235116 188750 189621 132885 158934 267154 53815
13283 53815 -128079 -187257 -9360 -30786 -94438 618 -6840 -54643 -174245 -62419 -35970
13272 -35970 16326 -98189 -136214 -138967 -128008 50451 281232 177220 -128244 -226098 -265983
13261 -265983 -297765 -151614 29497 144806 197889 213095 34378 -95297 -49303 108998
13251 108998 170004 169558 88316 -100861 -187207 -75459 133975 193311 125020 207500 193670
13240 193670 170726 286550 209564 136099 232316 437896 342668 161769 92132 111771 95539
13229 95539 53358 195781 246467 94128 57746 -76143 -53309 -70620 -77404 14565 151758
13218 151758 273647 123868 64381 147084 214292 217989 232177 106998 97942 121657 95584
$$ packed form
13294e1430J19166J35698l7760M1023K8419m6366Q71n6736K6049J08220k13339
13283E3815j81894n9178J77897k1426o3652R5056p458m7803j19602J11826K6449
13272c5970N2296j14515l8025k753J0959J78459K30781j04012l05464r7854l9885
13261b65983l1782J46151J81111J15309N3083J5206j78717j29675M5994J58301
13251A08998O1006m46q1242j89177q6346J11748K09434N9336o8291Q2480j3830
13240A93670k2944J15824p6986p3465R6217K05580r5228j80899o9637J9639j6232
13229I5539m2181J42423N0686j52339l6382j33889K2834j7311o784R1969J37193
13218A51758J21889j49779n9487Q2703O7208L697J4188j25179r056K3715k6073
$$ plain form
13207 95584 42543 -49626 -136114 -23809 50418 47461 198 -9172 172830 121574 143158 2858
13195 2858 40467 100225 -33984 166572 329978 250452 117709 -150279 -260914 -183860 -147433
13184 -147433 -134078 -33695 -15247 -66440 38450 52657 81513 159454 199744 212665 182743
13173 182743 138052 25855 18109 -12104 68537 -130003 -217227 -69027 17657 86400 245643
13162 245643 167017 -28995 234726 274420 215731 130332 10942 10611 21165 84049 52132
13151 52132 -70722 -310709 -272721 -164513 -42031 -80196 -165433 -223807 -178589 -93050 54373
13140 54373 145001 139581 -206462 -198978 -128099 -105778 36509 138974 92301 17317 43813
13129 43813 65748 -88829 31308 73347 -37603 43887 120984 -34195 -176614 -48093
$$ packed form
13207I5584n3041r2169q6488J12305P4227k957m7263r370J82002n1256K1584j40300
13195B858L7609N9758j34209K00556J63406p9526j32743k67988j10635P7054L6427
13184a47433J3355J00383J8448n1193J04890J4207K8856P7941M0290J2921k9922
13173A82743m4691j12197p746l0213Q0641j98540q7224J48200Q6684O8743J59243
13162B45643p8626j96012K63721L9694n8689q5399j19390l31J0554O2884l1917
13151E2132j22854k39987L7988J08208J22482l8165q5237n8374M5218Q5539J47423
13140E4373R0628n420l46043P484P0879K2321J42287J02465m6673p4984K6496
13129D3813K1935j54577J20137M2039j10950Q1490P7097j55179j42419J28521
$$ plain form
13119 -48093 109651 94291 48219 99606 85567 11492 17222 -52799 -26263 108567 276732
13108 276732 280079 284652 163604 64172 82678 48280 -10540 -49225 -27341 -128242 -200884
13097 -200884 -334197 -247532 -132195 -58783 35871 64280 4557 -87128 -146462 -51632 160205
13086 160205 298763 349937 267107 14555 -52947 51021 87047 256529 491655 428956
13076 428956 296009 371914 375595 353028 284979 269077 325555 225547 74540 131156 76364
13065 76364 30753 87913 35042 -9699 -147460 -109939 27523 137599 182064 223923 223918 228903
13053 228903 144223 -198461 -275031 -172489 -210809 -254598 -355314 -333211 -167998 80823
13043 80823 109703 15198 -54995 -30204 54606 82461 223157 228926 164158 14681 -166268
$$ packed form
13119d8093J57744j5360m6072N1387j4039p4075N730p0021K6536J34830J68165
13108B76732L347M573j21048r9432J8506l4398n8820l8685K1884j00901p2642
13097b00884j33313Q6665J15337P3412R4654K8409n9723r1685n9334R4830K11837
13086A60205J38558N1174q2830k52552o7502J03968L6026J69482K35126o2699
13076D28956j32947P5905L681k2567o8049j5902N6478j00008j51007N6616n4792
13065G6364m5611N7160n2871m4741j37761L7521J37462J10076M4465M1859nM985
13053B28903q4680l42684p6570J02542l8320m3789j00716K2103J65213K48821
13043H0823K8880r4505p0193K4791Q4810K7855J40696N769o4768j49477j80949
$$ plain form
13032 -166268 -302932 -329705 -171677 -2484 120203 15120 -64829 -173960 -87542 -34243
13022 -34243 43654 89926 24889 504 47621 -8556 11254 30476 52898 -40117 -128162 -182264
13010 -182264 -170113 -133613 10183 131812 172797 22304 -114263 1488 115047 183873
13000 183873 131044 16160 -98533 -103589 -32296 -61947 -82660 -99569 -159522 -81622 123294
12989 123294 147257 297 69937 114309 6818 -74358 -122106 -219432 33384 77944 -28451
12978 -28451 -1940 -22404 -92882 -98499 -95524 -101005 15421 85821 27363 -26707 4345 -227249
12966 -227249 -217749 -141451 -148431 -156872 -131876 -166989 -245593 -327654 -189125 -58948 36032 -16832
12954 -16832 716 -174 -63101 -103544 6310 -14499 -18780 -5611 24328 143111 131930 100410
$$ packed form
13032a66268j36664k6773J58028J69193J22687j05083p9949j09131Q6418N3299
13022c4243P7897M6272o5037k4385M7117n6177J9810J9222K2422r3015q8045n4102
13010a82264J2151L6500J43796J21629M0985j50493j36567J15751J13559O8826
13000A83873n2829j14884j14693n056P1293k9651k0713j6909n9953P7900K04916
12989A23294K3963j46960O9640M4372j07491q1176m7748r7326K52816M4560j06395
12978b8451K6511k0464p0478n617K975n481J16426P0400n8458n4070L1052k31594
12966b27249R500P6298o980q441K4996l5113p8604q2061J38529J30177R4980n2864
12954a6832J7548q90o2927m0443J09854k0809m281J3169K9939J18783j1181l1520
$$ plain form
12942 100410 96302 73691 210253 209077 -39701 -127174 67316 133975 41982 -87559 -45189
12931 -45189 -293346 -432998 -295264 -321441 -306428 -155631 -112991 -24436 97229 -73753
12921 -73753 -306083 -220272 -83829 26975 167860 212327 271482 203533 258616 212724 145509
12910 145509 148805 294929 165023 126424 229331 223518 161941 249555 162707 -78337 -190167
12899 -190167 -176478 -118857 -84028 704 -67225 -41269 44431 83865 -109552 -43097 7981
12888 7981 81885 69997 105316 214791 290138 265082 210420 12720 -117881 61496 147323
12877 147323 115437 88180 106574 -79154 -273082 -444574 -486835 -314175 -189631 -220922
12867 -220922 -271609 -205817 -159162 -261245 -264700 -190438 -141261 -81530 23180 22876 104115 114311
$$ packed form
12942A00410m108k2611J36562j176k48778q7473J94490O6659r1993j29541M2370
12931d5189k48157j39652J37734k6177J5013J50797M2640Q8555J21665j70982
12921g3753k32330Q5811J36443J10804J40885M4467N9155o7949N5083m5892o7215
12910A45509L296J46124j29906l8599J02907n813o1577Q7614q6848k41044j11830
12899a90167J3689N7621L4829Q4732o7929K5956Q5700L9434j93417O6455N1078
12888G981P3904j1888L5319J09475P5347k5056n4662j97700j30601J79377Q5827
12877A47323l1886k7257J8394j85728j93928j71492m2261J72660J24544l1291
12867b20922n0687O5792M6655j02083l455P4262M9177N9731J04710l04Q1239J0196
$$ plain form
12855 114311 45407 897 -48207 -230581 -371578 -225132 -157881 -60287 -28516 16868 -41236
12844 -41236 -157980 -130579 -45887 -2266 121383 76053 203730 103541 84 -117578
12834 -117578 -191662 31698 89585 58302 49257 4535 71865 206807 203302 233324 230284 96118
12822 96118 -5113 -37956 -92897 -111846 -154825 -166479 -40483 136888 95955 -109129 -111053
12811 -111053 -109270 -90276 -170993 -241482 60180 93705 5532 -115300 -232447 -76695 53748
12800 53748 40999 -12078 -10884 37131 21990 50460 -14536 -14391 33387 -143835 10996 -79578
12788 -79578 -46696 172084 212569 37206 -71486 137033 176796 34452 -60760 -177916
12778 -177916 -106909 -155861 -109204 -165109 -236246 -200222 -10753 204937 286216 182486 166639
$$ packed form
12855A14311o8904m4510m9104j82374j40997J46446O7251R7594L1771M5384n8104
12844d1236j16744K7401Q4692M3621J23649m5330J27677j00189j03457j17662
12834a17578p4084K23360N7887l1283r045m4722O7330J34942l505L0022l040j34166
12822I6118j01231l2843n4941j8949m2979j1654J25996J77371m0933k05084j924
12811a11053J783J8994q0717p0489L01662L3525q8173j20832j17147J55752J30443
12800E3748j2749n3077J194M8015j5141K8470o4996J45M7778j77222J54831r0574
12788g9578L2882K18780M0485j75363j08692K08519L9763j42344r5212j17156
12778a77916P1007m8952M6657n5905p1137L6024J89469K15690Q1279j03730j5847
$$ plain form
12767 166639 54058 -26639 -25918 -41963 -50222 -225623 -174474 -12699 23824 73601 -45317
12756 -45317 84885 75810 75914 64974 -36459 -78919 -140985 -26151 -35618 47652 75042 -29537
12744 -29537 -112194 -107245 -31254 44690 187379 89742 15065 61552 192718 282887 477159
12733 477159 379678 193956 127114 205992 261898 258614 219141 335917 291316 170544 116972
12722 116972 120416 11525 7746 -5335 36138 111429 212906 28735 -16905 -3465 5753
12711 5753 5674 85352 92880 72005 90962 -28013 -71954 -113849 -39283 -61652 -54087 -1386 -89731
12698 -89731 -92337 -143875 -286312 -231540 -15330 -16285 146269 297887 350742 339127 84379
12687 84379 17691 56928 -35009 -24256 37112 79406 168557 178217 319206 456295 251185
$$ packed form
12767A66639j12581q0697P21j6045q259j75401N1149J61775L6523M9777j18918
12756d5317J30202r075J04j0940j01433m2460o2066J14834r467Q3270K7390j04579
12744b9537q2657M949P5991P5944J42689r7637p4677M6487J31166R0169J94272
12733D77159r7481j85722o6842P8878N5906l284l9473J16776m4601j20772n3572
12722A16972L444j08891l779j3081M1473P5291J01477j84171m5640J3440R218
12711E753p9P9678P528k0875J8957j18975m3941m1895P4566k2369P565N2701q8345
12698h9731k606n1538j42437N4772K16210r55J62554J51618N2855j1615k54748
12687H4379o6688L9237r1937J0753O1368M2294Q9151R660J40989J37089k05110
$$ plain form
12676 251185 27105 -2820 72179 18331 -37172 167781 193762 142415 158084 144642 62762
12665 62762 -47398 77393 34133 66212 -3419 -89243 -131991 -15740 194129 52240 27726
12654 27726 97801 7760 155051 362986 227888 171179 291415 172590 82061 103738 180026
12643 180026 -14900 -93196 -181137 -393894 -210147 -70568 155804 196839 391267 511362
12633 511362 402988 346812 380964 372942 172664 -16274 -148425 -142306 -68972 138362 140202
12622 140202 284727 304123 96231 22168 49081 87080 198519 161955 128179 111254 158258
12611 158258 182016 135495 43965 13948 -92121 -171601 -41879 127471 197853 101198 -53587
12600 -53587 -96862 -149539 85262 79335 172930 102451 77389 -123412 -330482 -112844 30436
$$ packed form
12676B51185k24080k9925P4999n3848n5503K04953K5981n1347J5669j3442q1880
12665F2762j10160J24791m3260L2079o9631q5824m2748J16251K09869j41889k4514
12654B7726P0075r0041J47291K07935j35098n6709J20236j18825r0529K1677P6288
12643A80026j94926p8296q7941k12757J83747J39579K26372M1035J94428J20095
12633E11362j08374n6176L4152q022k00278j88938j32151O119P3334K07334J840
12622A40202J44525J9396k07892p4063K6913L7999J11439l6564l3776j6925M7004
12611A58258K3758m6521r1530l0017j06069p9480J29722J69350P0382r6655j54785
12600e3587m3275n2677K34801n927R3595p0479k5062k00801k07070K17638J43280
$$ plain form
12589 30436 83386 20077 -166239 -279037 -277031 -154418 8926 190156 283563 210952 55817
12578 55817 47041 -122232 -143591 -139440 -2161 159909 188397 70710 -17393 -39939 22276
12567 22276 69975 -58499 -230565 -189510 -75048 -88480 -17161 -92944 -48651 95433 -41218
12556 -41218 -256374 -165379 -142591 -176242 30260 -350 50312 -108935 -168928 -240328 -155416
12545 -155416 -116217 21377 31538 -6523 119857 91542 -160872 -350412 -342171 -253509 -94161
12534 -94161 87581 206842 154245 132527 56588 45382 91303 165683 241031 275842 324287
12523 324287 211233 113384 113422 214927 313721 288526 156351 -9799 -185739 -212497 -188432
12512 -188432 -235878 -101533 -137205 -9908 4884 49385 76441 168366 -65772 -119011 -164039
$$ packed form
12589C0436N2950o3309j86316j12798K006J22613J63344J81230R3407p2611j55135
12578E5817q776j69273k1359M151J37279J62070K8488j17687q8103k2546O2215
12567B2276M7699j28474j72066M1055J14462j3432P1319p5783M4293J44084j36651
12556d1218k15156R0995K2788l3651K06502l0610N0662j59247n9993p1400Q4912
12545a55416L9199J37594J0161l8061J26380k8315k52414j89540Q241Q8662J59348
12534i4161J81742J19261n2597k1718p5939j1206M5921P4380P5348L4811M8445
12523C24287j13054r7849L8J01505R8794k5195j32175j66150j75940k6758K4065
12512a88432m7446J34345l5672J27297J4792M4501K7056R1925k34138n3239m5028
$$ plain form
12501 -164039 -422107 -312692 -97256 -104121 -1975 -68605 -161440 -79810 51557 114662 53465
12490 53465 -265664 -435673 -205287 -157574 -40140 109680 264243 462139 429475 366802
12480 366802 368514 212599 63049 -16159 -28119 -6320 8751 -16463 1045 17841 -10605
12469 -10605 -175551 -238843 -162279 -64172 8684 -1573 -44947 -222047 -237194 -197399 -289168
12458 -289168 -332610 -132010 1336 25444 -97683 -73222 14953 15450 -44702 -138829 77665
12447 77665 215458 111880 72454 79451 107652 -10893 -159392 -117197 -49490 59828 16723
12436 16723 11154 -26057 -352959 -410776 -62712 249538 200174 150963 112329 55908 -155890
12425 -155890 -92641 -84126 -65839 -98725 -83051 31487 45812 62192 -42837 -148723 -186337
$$ packed form
12501a64039k58068J09415K15436o865J02146o6630r2835Q1630J31367O3105o1197
12490E3465l19129j70009K30386M7713J17434J49820J54563J97896l2664o2673
12480C66802J712j55915j49550p9208j1960K1799J5071k5214J7508J6796k8446
12469a0605j64946o3292P6564R8107P2856j0257m3374j77100j5147L9795r1769
12458b89168m3442K00600J33346K4108j23127K4461Q8175M97o0152r4127K16494
12447G7665J37793j03578l9426O997K8201j18545j48499M2195O7707J09318m3105
12436A6723n569l7211l26902n7817L48064L12250m9364m9211l8634n6421k11798
12425a55890O3249Q515J8287l2886J5674J14538J4325J6380j05029j05886l7614
$$ plain form
12414 -186337 -316989 -244530 -119497 -111796 -167492 -115918 33312 135918 10572 -82607 29000
12403 29000 6057 -84641 -156488 -37662 34674 51712 181267 229769 228845 175185 147552 145318
12391 145318 50247 -72267 -119527 -298343 -135449 6374 -81877 -115912 -108361 -222219 -181835
12380 -181835 2695 106281 22454 -256993 -318572 -352097 -371901 -337226 -111358 55956
12370 55956 23718 -31548 -256544 -185405 -215355 -301794 -157062 -70932 172188 226329 87268
12359 87268 85042 116345 155401 188296 78714 18207 62981 52995 29855 -78075 -13800 -27841
$$ packed form
12414a86337j30652P2459J25033P701n5696N1574J49230J02606j25346r3179J11607
12403B9000k2943r0698p1847J18826P2336J7038J29555M8502r24n3660k7633k234
12391A45318r5071j22514m7260j78816J62894J41823q8251l4035P551j13858M0384
12380a81835J84530J03586q3827k79447o1579l3525j9804L4675K25868J67314
12370E5956l2238n5266k24996P1139k9950q6439J44732Q6130K43120N4141j39061
12359H7268k226L1303L9056L2895j09582o0507M4774r986k3140j07930O4275j4041
$$ [...]
##END NTUPLES=NMR SPECTRUM
##END=
