##TITLE=Analysis number 314489
Compound Code cc 06610
Project Code adrs
Chemist Name fudan
##JCAMPDX= 6.0         $$ Bruker NMR JCAMP-DX V2.0
##DATA TYPE= NMR SPECTRUM
##DATA CLASS= NTUPLES
##ORIGIN= Bruker BioSpin GmbH
##OWNER= NMR
$$ XWIN-NMR		Version 3.5
$$ Tue Oct 18 13:03:58 2005 GMT Daylight Time (UT+1h)  MAYBRIDGE\NMR@NMR_250MHZ
##.OBSERVE FREQUENCY= 250.131544655141
##.OBSERVE NUCLEUS= ^1H
##.ACQUISITION MODE= SIMULTANEOUS (DQD)
##.ACQUISITION SCHEME= undefined
##.AVERAGES= 16
##.DIGITISER RES= 18
##SPECTROMETER/DATA SYSTEM= dpx250
##.PULSE SEQUENCE= zg30
##.SOLVENT NAME= CDCl3
##.SHIFT REFERENCE= (INTERNAL, CDCl3, 0, 16.522)
##AUDIT TRAIL= $$ (NUMBER, WHEN, WHO, WHERE, WHAT)
$$ ##TITLE= Audit trail, XWIN-NMR		Version 3.5
$$ ##JCAMPDX= 5.01
$$ ##ORIGIN= Bruker BioSpin GmbH
$$ ##OWNER= NMR
$$ C:\u/data/dgb/nmr/ADRS/10960/pdata/1/auditp.txt
$$ ##AUDIT TRAIL=  $$ (NUMBER, WHEN, WHO, WHERE, WHAT)
(   1,<2005-10-18 13:03:35.66 +100>,<MAYBRIDGE\NMR>,<NMR_250MHZ>,
      <created by zg, POWCHK disabled, PULCHK disabled
       configuration hash MD5:
       62 19 C7 07 E1 42 D1 B7 37 6C 3D D0 77 39 F9 E6
       data hash MD5: 64K
       17 35 9E CA F1 FC 59 4D AF 59 A0 EF 8A 7B CB 3A>)
(   2,<2005-10-18 13:03:49.86 +100>,<MAYBRIDGE\NMR>,<NMR_250MHZ>,
      <Start of raw data processing
       ef LB = 0.3 FT_mod = 6 PKNL = 1 SI = 32K 
       data hash MD5: 32K
       5A 57 1A 95 B0 45 4C DC A0 0A 9F 02 8C 4F 56 5A>)
(   3,<2005-10-18 13:03:51.66 +100>,<MAYBRIDGE\NMR>,<NMR_250MHZ>,
      <apk 
       data hash MD5: 32K
       30 F0 36 69 C1 77 41 5B 04 B8 C7 65 25 22 63 FE>)
(   4,<2005-10-18 13:03:52.41 +100>,<MAYBRIDGE\NMR>,<NMR_250MHZ>,
      <abs ABSG = 5 
       data hash MD5: 32K
       FD E8 D7 D1 D1 CD 56 D5 F7 4D 48 1B A9 9C 0F AD>)
$$ ##END=
$$ 
$$ hash MD5
$$ 43 3F 77 4F B9 4A 9F C8 EB 4B 6C 13 A1 28 EB 43
##$RELAX= 
##$RELAX= 
##$RELAX= 
##$RELAX= 
##$RELAX= 
##$RELAX= 
##$RELAX= 
$$ Bruker specific parameters
$$ --------------------------
##$DU= <C:\u>
##$EXPNO= 10960
##$NAME= <ADRS>
##$PROCNO= 1
##$TYPE= <nmr>
##$USER= <dgb>
##$AMP= (0..31)
100 100 100 100 100 100 100 100 100 100 100 100 100 100 100 100 100 100 
100 100 100 100 100 100 100 100 100 100 100 100 100 100 
##$AQSEQ= 0
##$AQ_mod= 3
##$AUNM= <au_zg>
##$AUTOPOS= <26 >
##$BF1= 250.13
##$BF2= 250.13
##$BF3= 250.13
##$BF4= 250.13
##$BF5= 500.13
##$BF6= 500.13
##$BF7= 500.13
##$BF8= 500.13
##$BYTORDA= 1
##$CFDGTYP= 0
##$CFRGTYP= 5
##$CHEMSTR= <none>
##$CNST= (0..31)
1 1 145 1 1 1 1 1 1 1 1 1 1 1 1 1 1 1 1 1 1 1 1 1 1 1 1 1 1 1 1 1 
##$CPDPRG= <>
##$CPDPRG1= <>
##$CPDPRG2= <>
##$CPDPRG3= <>
##$CPDPRG4= <mlev>
##$CPDPRG5= <mlev>
##$CPDPRG6= <mlev>
##$CPDPRG7= <mlev>
##$CPDPRG8= <mlev>
##$CPDPRGB= <>
##$CPDPRGT= <>
##$D= (0..31)
0 1 0 0 0 0 0 0 0 0.06 0 0 0 0 0 0 0.0002 0 0 0 0 0 0 0 0 0 0 0 0 0 0 
0 
##$DATE= 1129637014
##$DBL= (0..7)
120 120 120 120 120 120 120 120 
##$DBP= (0..7)
150 150 150 150 150 150 150 150 
##$DBP07= 0
##$DBPNAM0= <>
##$DBPNAM1= <>
##$DBPNAM2= <>
$$ [...]
##$SUBNAM7= <"">
##$SUBNAM8= <"">
##$SUBNAM9= <"">
##$SW= 20.6930455092707
##$SWIBOX= (0..15)
0 0 3 0 0 0 0 0 0 0 0 0 0 0 0 0 
##$SW_h= 5175.983436853
##$TD= 65536
##$TD0= 1
##$TE= 294.16
##$TE2= 300
##$TE3= 300
##$TEG= 300
##$TL= (0..7)
0 120 120 120 120 120 120 120 
##$TP= (0..7)
150 150 150 150 150 150 150 150 
##$TP07= 0
##$TPNAME0= <>
##$TPNAME1= <>
##$TPNAME2= <>
##$TPNAME3= <>
##$TPNAME4= <>
##$TPNAME5= <>
##$TPNAME6= <>
##$TPNAME7= <>
##$TPOAL= (0..7)
0.5 0.5 0.5 0.5 0.5 0.5 0.5 0.5 
##$TPOFFS= (0..7)
0 0 0 0 0 0 0 0 
##$TUNHIN= 0
##$TUNHOUT= 0
##$TUNXOUT= 0
##$USERA1= <user>
##$USERA2= <user>
##$USERA3= <user>
##$USERA4= <user>
##$USERA5= <user>
##$V9= 5
##$VALIST= <valist>
##$VCLIST= <CCCCCCCCCCCCCCC>
##$VD= 0
##$VDLIST= <DDDDDDDDDDDDDDD>
##$VPLIST= <PPPPPPPPPPPPPPP>
##$VTLIST= <TTTTTTTTTTTTTTT>
##$WBST= 1024
##$WBSW= 4
##$XGAIN= (0..3)
0 0 0 0 
##$XL= 0
##$YL= 0
##$YMAX_a= 804656
##$YMIN_a= -547685
##$ZGOPTNS= <>
##$ZL1= 120
##$ZL2= 120
##$ZL3= 120
##$ZL4= 120
##$ABSF1= 16.522
##$ABSF2= -4.171173
##$ABSG= 5
##$ABSL= 3
##$ALPHA= 0
##$AQORDER= 0
##$ASSFAC= 0
##$ASSFACI= 0
##$ASSFACX= 0
##$ASSWID= 0
##$AUNMP= <proc_1d>
##$AZFE= 0.1
##$AZFW= 0.1
##$BCFW= 0
##$BC_mod= 0
##$BYTORDP= 0
##$COROFFS= 0
##$CY= 12.5
##$DATMOD= 1
##$DC= 0
##$DFILT= <>
##$DTYPP= 0
##$F1P= 14.0000005364418
##$F2P= -0.99999901652339
##$FCOR= 0.5
##$FTSIZE= 32768
##$FT_mod= 6
##$GAMMA= 0
##$GB= 0
##$INTBC= 1
##$INTSCL= 1
##$ISEN= 128
##$LB= 0.3
##$LEV0= 0
##$LPBIN= 0
##$MAXI= 10000
##$MC2= 0
##$MEAN= 0
##$ME_mod= 0
##$MI= 0
##$NCOEF= 0
##$NC_proc= -3
##$NLEV= 6
##$NOISF1= 0
##$NOISF2= 0
##$NSP= 0
##$NTH_PI= 0
##$NZP= 0
##$OFFSET= 16.522
##$PC= 1
##$PHC0= -69.89694
##$PHC1= 7.95707
##$PH_mod= 1
##$PKNL= yes
##$PPARMOD= 0
##$PSCAL= 4
##$PSIGN= 0
##$REVERSE= no
##$SF= 250.13
##$SI= 32768
##$SIGF1= 0
##$SIGF2= 0
##$SINO= 400
##$SIOLD= 32768
##$SREGLST= <1H.CDCl3>
##$SSB= 0
##$STSI= 32768
##$STSR= 0
##$SW_p= 5175.98343685301
##$SYMM= 0
##$S_DEV= 0
##$TDeff= 65536
##$TDoff= 0
##$TI= <Analysis number 999999
Compound Code 99
Book Reference 9
Project Code 9>
##$TILT= no
##$TM1= 0
##$TM2= 0
##$TOPLEV= 0
##$USERP1= <user>
##$USERP2= <user>
##$USERP3= <user>
##$USERP4= <user>
##$USERP5= <user>
##$WDW= 1
##$XDIM= 32768
##$YMAX_p= 314802036
##$YMIN_p= -155040
$$ End of Bruker specific parameters
$$ ---------------------------------
##NTUPLES= NMR SPECTRUM
##VAR_NAME=  FREQUENCY,     SPECTRUM/REAL,   SPECTRUM/IMAG
##SYMBOL=    X,             R,               I
##VAR_TYPE=  INDEPENDENT,   DEPENDENT,       DEPENDENT
##VAR_FORM=  AFFN,          ASDF,            ASDF
##VAR_DIM=   32768,         32768,           32768
##UNITS=     HZ,            ARBITRARY UNITS, ARBITRARY UNITS
##FACTOR=    0.157963299565203, 1,           1
##FIRST=     4132.6476996994, 0,             0
##LAST=      -1043.33573715361, 0,           0
##MIN=       -1043.33573715361, -155040,     0
##MAX=       4132.6476996994, 314802036,     0
$$ Real data points
##PAGE= N=1
##DATA TABLE= (X++(R..R)), XYDATA
$$ [...]
27938 -2118 7041 14817 25297 15908 1979 -5209 -2829 -317 5814 11693 10267 -4488 -20138 -26526
27924 -26526 -32552 -31193 -23910 -17868 -7776 -4669 -9810 -10257 1097 7481 -1103 2514 5562 14075
27910 14075 5474 4378 8818 4833 823 2288 2086 -2872 -887 246 -10005 36 18280 10508
27896 10508 3303 2359 14827 22476 17274 4211 266 5359 1720 -3751 -1127 5580 6360 -5679
27882 -5679 -6371 -7655 -3014 -6390 -10081 -11807 -7402 8057 5885 5511 -6662 -17204 -25206 -6870
27868 -6870 4205 3611 -6228 -3157 -897 2278 11845 22655 19678 11834 -4780 -8910 -2237 2086
27854 2086 11880 9043 2170 -4646 -5572 7855 12396 2619 1500 -612 2540 444 3983 4223 8923
27839 8923 8792 1736 -2613 -736 -416 -4037 -15608 -15458 -5177 189 10198 14972 3681 8101
27825 8101 14803 21088 14456 15428 24156 27368 23786 7291 6424 9379 4823 1788 -887 3041 16849
27810 16849 1202 3693 12525 8119 5446 -3760 3455 12061 15329 11362 4067 9100 -1391 5423
27796 5423 3071 -991 -2048 -4042 -4993 2917 26045 19497 -1241 1881 9505 35609 38960 19505
27782 19505 12671 16501 9697 5924 3774 2341 6199 -1449 -4990 8871 23694 16262 14877 8435
27768 8435 14568 11264 7189 4977 -5027 -8873 5116 5227 2221 -10868 -16715 -9957 -12950 -5033
27754 -5033 4368 -12130 -16109 -20588 -18208 -5799 9138 16359 15268 9211 1026 644 -2283 -4366
27740 -4366 5681 20968 37372 38947 21583 13854 6396 1490 -3179 -1163 9788 16494 20617
27727 20617 15044 3640 -16711 -25052 -31581 -23107 -19050 -21643 -15757 -11362 -4752 -1002 -13488 -16888
27713 -16888 -6650 352 -2153 -1050 13799 15012 1280 -887 10118 21084 25596 14287 -11
27700 -11 -11156 2831 16356 13608 9967 8471 -3614 -6445 2917 8759 5130 6943 -921 797
27686 797 -4663 -6484 -9338 -8937 -6090 -4671 -8124 932 -354 3099 12844 8708 -5745 -5133 -6482
27671 -6482 -3546 1021 3283 16112 20963 18270 21757 15549 5417 1574 -4831 10524 11407 4554
27657 4554 7914 141 -4307 -3577 -10892 -21048 -15911 4715 11674 3313 -6880 -19514 -20769 -12894
27643 -12894 -3192 -16006 -12279 2855 -2014 -2306 -679 10380 14123 13521 12960 13639 16580 2979
27629 2979 6613 17963 11328 14512 15436 8061 10310 12560 6462 1185 4343 342 -10117 -797
27615 -797 8744 20145 23783 28000 23679 19991 14147 17198 19861 19810 7000 -2950 3567 11836 18693
27600 18693 28791 34849 31849 21614 7638 3687 397 -9124 -5722 5367 13538 8545 9664
27587 9664 12002 11320 14929 20678 10281 15359 22008 16816 -1316 -2510 -6503 -6294 1527 -930 -3683
27572 -3683 761 1148 -8715 -16216 -9597 2751 18214 13392 -2650 3375 7352 16684 1845 -17010
27558 -17010 -11874 -1754 15803 21156 26029 32017 23019 14595 7789 2306 9149 4388 2051 5084
27544 5084 -1620 -4263 -7917 -8877 14519 20164 17437 12593 8974 -2978 -12962 -21951 -21350 -12817 -6231
27529 -6231 1451 -2393 -12220 -7550 -1374 7170 14704 16040 15522 21323 30146 29522 18514 18529 20409
27514 20409 7405 2881 6496 19059 18290 5501 -4022 -11716 3364 14654 15837 13898 -302
27501 -302 -3621 747 1044 5703 16552 13784 9299 11694 12841 8400 7338 10077 -7500 -16145 -4713
27486 -4713 -2677 5702 2832 2201 5984 3193 -10585 -10281 11047 19190 5748 9283 14309 22376
27472 22376 22837 6557 -1830 -10462 -3268 1531 -1690 -5469 -10862 -12762 -1795 5701 4750 1753
27458 1753 3116 7320 6330 5153 -7288 -15144 -9812 666 8042 8181 6037 13915 27749 21130
27444 21130 1137 -1787 -1986 11331 15070 18404 8305 4376 18737 20091 14611 9901 7204 9294
27430 9294 2954 -4284 6754 10557 -129 8204 7776 7453 4384 -3301 -1919 7670 17927 18943
27416 18943 10237 26722 35623 31146 19611 11533 3723 4546 11329 21501 23180 14625 13451 23761
27402 23761 30892 21891 7034 10075 14261 18956 13758 -382 -8350 -2606 4231 8497 6579 8466
27388 8466 10415 -457 -9939 -2952 467 -5343 -3101 13592 14805 -3658 -8154 1899 5540 9456
27374 9456 20853 25927 11868 -4795 -9114 1899 5178 -5185 -14460 -9604 -2173 7340 11237
27361 11237 11490 2606 1824 6536 7941 2384 2762 -7080 -7619 6964 6675 -640 -3602 6718 2228
27346 2228 -4110 -17218 -16201 -10475 11610 22974 3082 -18017 -14187 -13966 -7707 -1560 12266
27333 12266 6330 12901 13902 6279 -5747 -7197 3722 4095 6527 8314 9166 9254 15956 21209 30434
27318 30434 21037 13333 14908 19001 24645 25852 25709 15997 9352 11799 8249 24303 34394 23474
27304 23474 16638 17252 15709 10079 20011 20678 11239 -5696 -767 2251 7373 12444 18769 13491 -1022
27289 -1022 -2249 -2453 -11977 -7582 1804 9274 223 12328 13212 12958 20936 30572 20188 9297 7410
27274 7410 3869 12318 12245 5895 3545 5946 15322 20245 22468 17435 11932 12776 16524 24386 23422 17683
27258 17683 6001 8720 1121 -6060 -2259 -5222 -8274 -854 10544 13333 -1318 -1447 3803 3805 12261
27243 12261 11315 4818 -15227 -13122 1013 10137 4014 -2548 284 204 -8434 -80 3052 -2041 7566
27228 7566 14315 -17993 -21744 -10467 -7443 2914 10486 11460 12622 7288 4967 3476 6415 19506
27214 19506 14873 12121 13664 8657 -2274 -5853 5599 8532 -1432 -3498 -241 -5687 -15772 -17208
27200 -17208 -13376 4788 17336 22627 1095 -3206 -4203 -2439 -4307 -17075 -11724 -5349 -13347 -14476
27186 -14476 -11837 -11072 4217 13461 5263 -3569 -17718 -6338 13541 33669 40065 18740 5107
27173 5107 10689 11754 2728 6948 10899 9787 8011 18991 14708 8055 2787 -6629 -10522 1675
27159 1675 14880 17447 -10102 -15991 -17491 -17821 -27413 -23278 -21705 -13435 1559 -1136 -3679 -1985
27145 -1985 -9216 -12244 1370 14147 3189 -137 8923 19242 7755 -3477 -3210 -1650 -9758
27132 -9758 -2435 -10166 -23306 -29621 -20402 -4992 -221 1479 -9293 -5541 2411 962 8453 7115
27118 7115 1256 10348 14457 18880 30936 39159 43502 30752 10839 2627 5021 1762 6838 15925
27104 15925 18187 9647 13260 12064 8959 4347 -321 4438 23237 27175 24124 23286 20682 13833
27090 13833 10506 5889 -7923 -7547 -3304 -10894 -8878 -283 2250 1030 -5240 -18177 -18278 -14892
27076 -14892 -20705 -10673 -17440 -21069 -11824 -10517 -15554 -1046 -1396 -16540 -11742 14787 21553 18406
27062 18406 21332 22378 7257 6513 45 4066 19964 27998 25125 24687 17289 11841 14239 33060
27048 33060 35143 17385 11730 3818 -9794 -14238 -520 3441 -7624 -7863 116 2461 16205
27035 16205 19195 20255 15020 6090 6318 5776 -4791 -18728 -30003 -25369 -8267 3660 -5370 -17060
27021 -17060 -12851 -6832 -9474 -8929 -2090 -1409 -11245 -20936 -26343 -23339 -23219 -11836 -641 -9825 -21274
27006 -21274 -15604 -5889 8089 17421 22860 17995 19403 29336 35442 25254 9362 3918 4871 9844
26992 9844 12935 5156 -448 8224 23301 12033 8461 9631 -1408 -12491 -6768 -9004 -75 14235
26978 14235 10588 16650 13770 11561 13513 14041 17707 7207 -6318 -2697 -5018 -3697 11726 20314
26964 20314 17198 13723 13166 1961 -16504 -9964 853 4724 10658 5012 13279 12352 2493 -3665
26950 -3665 9287 21642 16483 13609 11088 -1109 10703 11548 9152 2863 -1306 -4452 3720 9029
26936 9029 1541 -14036 -5096 -3709 4940 15035 4226 -1235 10426 -5291 -13458 3704 5509
26923 5509 5131 19942 21107 13092 15343 2480 -2931 -12233 -19056 -26634 -38175 -44920 -23451 -5899
26909 -5899 -332 4352 6291 12541 16197 6720 16298 2789 -12636 -16737 -21170 -28566 -33858 -20763
26895 -20763 -8440 -1500 4476 -5470 -9404 -4619 -9246 -14966 -11465 -28036 -27661 -22667 -17617 -10713
26881 -10713 -5696 -7180 743 16685 14750 18460 28022 35986 25999 19528 12893 8464 5037 -1608
26867 -1608 3769 12988 5564 -4056 -998 11054 7045 963 -4533 -7291 -7315 -1008 -9937 6287 11381
26852 11381 -9783 -2651 9378 -3562 -10152 -15445 -25228 -32223 -21874 -12283 -10834 -7124 -1237
26839 -1237 8145 1318 2610 12176 4869 2943 9919 10920 3510 2725 1742 4346 -3545 -10205 2599
26824 2599 8706 8883 10881 17886 7515 10487 24366 19573 20678 17379 5351 16479 12011 1300
26810 1300 -3893 -10525 -4911 770 4782 4647 -433 -10569 -4859 -872 -1077 6574 6884 6247 14033
26795 14033 15499 9052 -19248 -20297 1841 10271 12037 13071 8757 -6600 -4601 3370 20251
26782 20251 11186 -5370 -911 -16970 -15709 -15314 -8045 6676 13455 -1392 -3560 8845 15990
26769 15990 -296 4937 14652 14760 6423 12548 5530 -6088 -13335 -7524 -1887 -6599 -5419 -8532
26755 -8532 -712 -1405 7868 28869 33115 29422 17631 13577 14669 24480 29085 25892 25831 29807 26130
26740 26130 22501 27232 25274 15760 20400 14984 9546 7367 962 -10599 -3496 3157 23140 28544
26726 28544 14327 6478 9619 15823 18759 24038 24292 15672 1363 -7513 1661 1969 7820 26204
26712 26204 26950 31405 23169 12941 5090 7420 6448 -6438 -15176 -5026 6786 1458 -4443 -9901
26698 -9901 -15461 -23898 -21933 -17664 -16103 -7669 -206 13043 15808 11502 -6680 -8744 4564 640
26684 640 12380 20465 20277 13473 12056 11323 10984 36110 35678 35039 41182 28864 14583 5114 7387
26669 7387 1211 -4368 -6739 -12695 -7101 -11865 -13960 -8193 469 15786 15695 10611 16621 17323 13321
26654 13321 15432 7611 5052 -1155 3945 -5042 -22266 -14677 -19288 -19849 -19170 -11077 -2744 -8652 -2808
26639 -2808 6744 10472 13046 6025 10347 12086 13350 -124 -12082 -24839 -22637 -5845 -1024 977
26625 977 -4165 -5589 -1105 4453 -6924 -12358 -6478 -5318 -1275 4470 4840 1113 -769 5078 4431
26610 4431 12562 16313 19864 28756 20866 6967 -5506 -4811 -3707 -5693 11779 17465 10703 9264
26596 9264 16161 16387 12204 362 -7371 -6049 16013 28929 42356 49423 49328 20129 15091 22965
26582 22965 25300 22693 16855 25295 26143 21887 15234 6642 1387 -10455 -6181 15202 15319 8406
26568 8406 -2553 -8147 7639 21307 21247 13296 -3390 -9299 -694 -1711 -12915 -17434 -4936 7883
26554 7883 7306 8748 19203 43615 39907 33172 25118 7608 -11889 -27144 -27933 -7809 -4993 -2660
26540 -2660 -5752 2233 -3241 -523 8737 22957 39942 23689 17573 17719 20725 29975 25824 24032
26526 24032 31195 19477 9855 -5391 -2215 -7506 -6006 7891 8718 3842 9947 19243 7901 -3908
26512 -3908 -1343 3202 4689 -864 -13193 1841 13936 18123 20180 7719 1604 865 -4822 2444
26498 2444 13424 9917 9397 14103 9986 16760 22375 12008 16554 11377 13310 13074 14141 16582 7868
26483 7868 -1295 6617 3137 -5989 -4843 -1073 -4817 -5521 -3483 -9357 -6413 -144 4611 8435 14222
26468 14222 32757 34841 29012 23694 27914 20084 24606 28222 20597 20333 5089 -1588 -4242 -9123
26454 -9123 -8873 1281 5195 1336 -2982 8753 14756 10527 4020 7710 3406 2717 -680 -6658 -3737
26439 -3737 -3685 -22459 -18372 -8131 -10124 -15336 -5711 -1122 7102 17240 17331 15270 13731 8949 -7439
26424 -7439 -14377 -15779 -11317 -1125 4328 -2342 888 5633 12119 14818 20138 4299 -2556 2748
26410 2748 3949 7117 11615 -3502 -5421 7885 20177 18059 8422 8504 10942 23736 13711 11926
26396 11926 22250 14930 3387 -8428 -3770 -8161 -20268 -19639 -14977 -10534 -6944 -3365 2104 -7644
26382 -7644 3820 5330 -7270 -21752 -9966 -9733 -22733 -14614 3256 -5693 -18065 -14753 -6083
26369 -6083 -12804 -1612 8278 14097 19593 17804 19054 20700 26222 26594 18320 21602 25555 24367 16267
26354 16267 16219 16605 22351 13587 10242 4789 2075 1941 5402 13089 17221 24530 20326 3034 8995
26339 8995 6109 6366 13292 -1426 -71 14182 8116 1334 -9347 -5190 -6417 -5957 -2629 -301
26325 -301 3561 2606 10144 13384 7890 -2283 2255 2998 14222 32576 38495 39225 38913 24209 8466
26310 8466 2516 -535 12880 26043 33748 19244 4905 12977 12847 14022 6575 2566 9015 762
26296 762 17775 20748 12902 -17224 -8944 11878 9563 -2170 -14379 -17179 -5086 16471 27055
26283 27055 23108 10410 14622 18297 14704 9833 -13053 -25543 -16898 829 5613 256 -9427
26270 -9427 -3173 2986 13660 19644 16039 10043 1731 -9143 -17426 -12629 -1077 -8682 -7159 -5380
26256 -5380 -19777 -10820 5338 -211 3631 9399 13792 -5420 -11500 7984 15291 9889 19085 17390
26242 17390 11771 8453 1056 -5293 10622 25950 23665 14410 15653 13396 9782 11914 5734 12370
26228 12370 11709 925 -3604 2522 5834 16833 24013 4137 -1786 -4154 -11808 -11744 -9283 -125
26214 -125 6061 -501 -9894 -16597 -708 21336 22722 10585 4115 1863 -11652 -11033 -9245 -2322
26200 -2322 -410 1659 882 -6973 7135 11635 2859 -14020 -3356 11830 10326 18934 12573 -2820
26186 -2820 -651 8211 959 -4220 -4222 5440 11725 9323 4057 -5172 -8870 -5455 5241 19259 10588
26171 10588 2212 -1974 3969 487 7431 11893 13033 5186 11308 9336 1040 -14029 -23734 -20204
26157 -20204 -10550 -4462 3264 6495 21579 17787 3241 -8690 -9172 -8848 -15960 -21627 -9424 3055
26143 3055 17413 24955 26937 29919 18188 10799 13510 5254 -2231 5688 4513 7548 7584 -984 -1093
26128 -1093 -1143 -450 -1466 -8658 -1811 -2556 -8056 2524 -2044 -13545 -19601 -15766 -5774 -2834 -7642
26113 -7642 1758 8302 3806 -935 5733 3259 -989 -3086 6417 16144 8822 10623 16249 21691 12388
26098 12388 -266 10201 8652 -2948 -2348 1822 -11670 -9384 -7639 -258 -445 -1825 -10034 -17007
26084 -17007 -11617 7879 1335 -3255 12865 13173 14357 19964 20109 24145 15104 6314 -5456 -2774
26070 -2774 11178 6023 9685 20381 8912 6958 17618 13845 8069 1194 -4008 7162 22567
26057 22567 21298 -485 -3898 5389 3798 4362 3137 5455 4843 -1810 -2103 5014 9097 4105 1999
26042 1999 1520 4737 -10850 -15130 -17432 -26398 -31592 -22136 -9890 -12309 -19644 -9898 224 -7624
26028 -7624 -14298 -10067 -3473 -6064 -8914 -11054 -3091 7616 22075 29440 28972 40173 27871 28775
26014 28775 21601 3950 9989 13676 368 -10667 -11483 -3609 7998 10616 11801 19148 5593
26001 5593 -1084 11506 -2239 -7503 -10215 -6076 -4418 -3585 -943 11079 20194 14629 11969 5566
25987 5566 -7317 -2115 5662 2897 1197 7455 18112 34510 16146 8737 -1140 -944 -14879 -9698
25973 -9698 -11629 -4074 -8087 -13403 -8000 4259 10029 943 7943 14218 13221 14221 6938 5748 4161
25958 4161 6172 15563 20226 19187 18570 15924 14039 10750 14476 14308 2973 301 7158 17005 23721
25943 23721 18932 12457 6038 999 -4481 -14489 -11025 -13595 -15927 -8838 -2176 1971 9499 13929
25929 13929 -838 -4451 -5051 -21706 -22534 -11258 -12333 -19271 -27790 -12950 -154 -1238 2031 4065
25915 4065 -3151 -4991 -5604 -2457 1555 2986 -8345 -9154 1833 4353 11490 5149 4399 388 -5788
25900 -5788 -6613 -17381 -15389 -14344 -16922 -16559 182 5152 -1031 10019 14775 21358 4332 -527
25886 -527 2062 -1147 2482 4801 -3456 -5779 1607 11860 -2774 3719 2066 -8372 -6186 -608
25872 -608 -3587 -13981 -22140 -21929 -34418 -23524 7442 2498 -765 12514 19601 10968 -10028 -22178
25858 -22178 -21712 -22854 -22734 -17442 -15329 -2441 -6903 -3290 -9216 -4065 -2463 -4441 -242 -5043 -14189
25843 -14189 -9039 -5283 641 -1990 2706 10732 -184 -1675 5483 6981 2219 47 5791 6462
25829 6462 14711 27945 3161 -12759 -14710 -14048 -20045 -11447 -3678 -1127 -2989 -3737 -13031 -26378
25815 -26378 -19969 -16437 -18166 -20450 -12825 -2158 759 5797 267 -3229 -11652 -15667 -15086 -2072
25801 -2072 6076 12163 4278 5822 5120 9938 12860 11742 5950 3571 -6687 -6653 -1273 -1263 7920 6358
25785 6358 9447 6966 18264 24964 22184 10008 14918 13273 2298 -5341 -2525 -1035 -2144 -1752
25771 -1752 -894 13994 23811 33059 33063 36452 26681 15972 1644 3942 13719 8726 -853 -2034 6626
25756 6626 7143 5042 11623 10942 7447 13010 9698 7732 10386 5168 -14141 -14985 -16329 -833 -6663
25741 -6663 -15715 -7229 -2130 4963 4505 -1118 -1741 -15155 -10987 -11445 3052 8202 -5895 2917 2532
25726 2532 -16374 -16492 3256 17716 16921 9300 14730 20265 15213 18476 32710 16416 -6334 -19794
25712 -19794 -6122 7937 15366 5312 2236 2905 -4866 -8714 -1743 2584 15976 17195 13874 11196
25698 11196 11819 10075 10990 11919 6576 1932 18475 24923 18472 12367 17181 31933 24676 66
25684 66 -11729 -7161 -5936 15657 15300 9323 9761 4902 -4388 -1123 -4235 3196 11522 15346 18859
25669 18859 5610 3183 -1745 5592 9492 12080 19393 4773 5525 13805 16197 25598 7421 -6303
25655 -6303 3062 8665 16821 29622 14897 5627 14253 14193 3391 -2020 4663 4228 -2757 9767
25641 9767 28710 20641 2134 -10072 -16483 -5148 3524 -1603 5291 19311 14829 13477 9893
25628 9893 15365 -3489 -13251 -1917 585 -7492 -22511 -20148 -6166 9674 19416 6934 12661
25615 12661 22750 20200 16810 15256 12635 -987 -2083 2327 3997 17466 29247 29995 23809 10201
25601 10201 -61 9954 473 -4721 7435 26897 16515 8323 211 4846 9835 13199 18419
25588 18419 3230 -8916 -19185 -19140 -7356 1793 -9345 -4963 -2298 7860 -1980 -7173 -11777
25575 -11777 -16946 -17363 -7027 871 -879 -164 -5293 -14342 -7797 9733 10415 13431 11938 9613 9226
25560 9226 246 5002 15587 17722 20535 23358 14526 18965 23392 24646 22961 29614 10622 -5597
25546 -5597 -12089 -16653 -12205 -4448 17046 20292 12679 3848 -2667 -9944 3731 -2593 -13753 -23573
25532 -23573 -20285 -2276 3141 -18217 -22956 -12159 -8899 -9321 9248 11845 18692 15140 9621 -900
25518 -900 -9896 -2041 3809 198 6266 23241 41475 45061 45775 39330 34963 24940 9140 -5939
25504 -5939 -3840 3849 2397 6256 -593 -13880 -9130 -752 -9521 -9296 -2552 -8077 -7730 -8660 -16431
25489 -16431 -14366 -7959 8191 9472 2105 -11110 83 17817 30935 34001 27145 27764 19237
25476 19237 3474 10192 18538 12702 5631 14146 9602 -485 -9608 -11732 -24314 -19324 2199
25463 2199 2860 -1337 397 1909 11384 10609 12243 12864 14044 1699 -1151 7292 419 -12477 3105
25448 3105 3804 5460 1643 -3148 -1731 -19532 -9451 8507 62 11544 28154 20618 9692
25435 9692 247 848 -5691 -9040 -1407 -12445 -6083 -3602 -10314 -5290 1776 1820 356 -4813 -7921
25420 -7921 -12078 -11128 -8954 -10760 -8488 2982 4799 2418 3819 -11143 -22074 -16407 587 -1238
25406 -1238 -14294 -7406 431 -10560 -29083 -27149 -9992 -3040 -1765 -1279 -14636 -20416 -12005 3356
25392 3356 -8396 1644 -1484 -2652 -12997 -14591 -7466 1917 1485 -7296 1417 4221 7503 389
25378 389 -9056 -1752 12625 12848 8605 2608 -4271 -8265 -12143 -13100 -19357 -19315 -12718 -7800 -4938 3779
25362 3779 17589 16572 12654 4776 1137 -1081 -3485 2806 -3902 8795 27820 33198 35198 25530
25348 25530 9620 1208 -4783 -7164 6312 10392 14000 11483 -1452 -15263 -17194 -8152 -4791
25335 -4791 -5556 -6357 -1510 3523 -4990 -6726 -5776 -2574 -13570 -22101 -14516 -11159 -7019 -5991 -4106
25320 -4106 45 1098 -8540 -3785 -11278 -4169 3545 -4486 -8783 -3086 -1687 4167 2836 9428 -2809
25305 -2809 -13193 -8159 7846 8721 7797 10360 -2201 -6380 2524 1076 -13222 -11363 -8116 -18680
25291 -18680 -22232 -3592 3894 -3609 -4273 -257 11243 15052 19236 26780 13213 -1981 -2800 13613
25277 13613 14659 8981 2029 5285 -2585 -11399 -6211 2355 5951 7930 1133 5977 15298 -880
25263 -880 -19103 -35329 -20307 -11279 10905 22925 5333 -4200 5053 829 -12754 -8495 -7964
25250 -7964 -6396 386 -1649 -112 -2999 -5087 -16315 -17598 -6859 -5709 -15944 -19947 -17088 -15891
25236 -15891 -3026 4035 10540 4541 -4772 226 1789 -3411 -14787 -15054 -12868 -19217 -15658 -20255
25222 -20255 -19263 -19706 -20596 -13991 3108 22479 21568 7871 1686 13225 12721 12462 12099 8435 17761
25207 17761 10225 -237 -7470 -6027 -3823 -5938 -9830 -22454 -26515 -3850 445 4937 -4930 -12742
25193 -12742 -14499 -15666 -13957 -17789 -21256 -19403 -20959 -17538 -9793 1266 14196 7106 -4138 -9168
25179 -9168 -6700 -1363 5836 14849 10766 10718 5646 -499 -6936 -1557 5758 -4510 -15718 -24894 -12779
25164 -12779 -2148 4437 8325 12539 1291 -9652 -3987 2422 4594 -4161 -1802 -1720 -1270 3609
25150 3609 9260 6581 10854 12577 11326 12015 5002 13243 7992 2036 -15906 -22444 -19670 -24204 -24706
25135 -24706 -18364 -19745 -17162 -9545 -7698 -16509 -10955 -2295 -76 -2254 -2918 -4287 -8323 -18593
25121 -18593 -17043 -11862 -11001 -17005 -16224 -8261 -22080 -22235 -10711 -11617 -11896 -9087 -27197 -18040 6774
25106 6774 22732 7118 19456 30512 12653 8007 4790 -5440 -10236 -12870 -21462 -20906 -5509
25093 -5509 5218 6259 -1003 -1101 6172 12418 5091 255 75 9140 1651 7220 8436 5329 1046
25078 1046 4460 1929 -2192 -10150 -20691 -26673 -12688 2812 -1454 -10070 -15127 -14189 -7308 -21931
25064 -21931 -22373 -13399 -13049 -17737 -7989 -11571 -6803 -7441 -9097 -8288 -8636 -8791 -4355 -4476 4023 7740
25048 7740 9476 7378 11038 15754 7244 -5049 -4398 -2964 1206 7944 15493 14294 13788 6633 6778
25033 6778 3355 12656 9278 -1085 1384 8785 2583 -16474 -24714 -31243 -12542 -3050 1011 -993
25019 -993 -1299 1595 -5271 -1103 -1911 -13778 -20021 -10529 442 5003 3422 -5230 -7372 -2845 -1003
25004 -1003 -508 11510 18480 16059 12743 4553 -4042 2267 10270 4214 1819 3939 5392 3559 -2926
24989 -2926 -4826 -2761 -2332 -8169 -5781 -7291 -922 -1566 -13960 -15802 -11703 -2743 -6559 -17367 -21832
24974 -21832 -18418 -13822 -13443 -10056 -11608 -11706 -13025 -22305 -7313 10520 4600 2540 10891 13788 2069
24959 2069 4630 12744 23409 28573 31036 22543 10201 15915 13066 1269 -6611 -7990 -523 20071
24945 20071 14343 5484 5976 10158 9044 5323 8888 12363 13361 5166 -2558 -4093 -7948 -4978 8024
24930 8024 7706 7066 10222 5265 -2964 -13428 -17096 -13553 -17627 -7803 -7060 -4004 -1465 -6383 -12247
24915 -12247 -12500 1805 8490 2587 450 6068 -4326 -4558 3369 18406 21898 5938 3098 7693
24901 7693 -6176 -16005 -12174 -7724 -8270 301 5384 28366 31807 26422 23696 19899 12667 -6929
24887 -6929 -15209 3491 801 -5418 -14452 -18110 -16256 -18212 -7758 3032 4910 226 -1995 -7943
24873 -7943 -13762 -11665 -19596 -24084 -20565 -26502 -14953 5031 -1982 -15010 -28312 -35626 -37095 -27910
24859 -27910 -19849 -7087 1968 3862 9384 6101 -689 -1745 -6243 -14334 -23229 -25632 -15242 -14110
24845 -14110 -14385 -14996 -20967 -23838 -10668 740 3762 -6288 -8944 -6790 -11022 9045 24228 33803
24831 33803 26118 8832 -6303 -15497 3542 14936 21046 16218 10382 11149 6245 1475 -2216 -7317
24817 -7317 -19194 -21551 -23751 -5872 -8755 -3956 5218 14006 12128 6839 1321 -4812 -1115 5480
24803 5480 10302 10847 -1520 1148 -626 -1107 3955 15395 20204 6594 -3187 -10504 -5955 -7204
24789 -7204 -6999 -2563 -6772 -1875 10117 13201 24723 33422 24385 14495 11328 21115 22066 14536 6873
24774 6873 5663 11520 15489 8521 -5655 -8122 -1127 9939 12738 -984 -4424 -1348 -1707 -11030
24760 -11030 -19129 -17493 -14001 -15857 -21821 -532 -9784 -13422 -6726 -535 1407 4289 -7412 3039
24746 3039 7834 4771 2214 5645 2966 -1479 -12983 -9716 -9802 -389 752 -3922 4906 -6107 -10815
24731 -10815 -10458 -12013 -8605 -23626 -28619 -21194 -2578 -1590 -8381 -2475 14777 7336 -2935 -15503
24717 -15503 -21203 -19892 -25966 -18460 -17082 -18380 -12742 1947 9828 8165 -1477 -21880 -11867 -1887
24703 -1887 -1029 3394 11832 3578 -1683 -3029 258 -8920 -20192 -21280 -15911 -11971 -13897 -6077 2021
24688 2021 -670 2954 -2871 -5748 -4533 -10725 -7597 -11324 -21367 -18791 -23082 -20544 -16252 -12393
24674 -12393 -15961 -13061 -6257 -16473 -15388 -8849 -11142 -14250 -8179 8958 6066 5676 -3688 -21473
24660 -21473 -19628 -12710 -15887 -12509 -14895 -1302 -20 2154 1867 14611 1746 -8365 -3839 -7884
24646 -7884 -15854 -22872 -25992 -41226 -25628 -12486 -14870 -13033 70 11855 1391 -2123 1709
24633 1709 -7997 -19047 -5271 1124 -2332 -2146 9142 11804 861 -411 4911 7031 -9212 -20629
24619 -20629 -25476 -19716 -14577 -6499 -11829 -7821 -19431 -18005 -13049 4384 3085 377 -3348 3208
24605 3208 17353 21924 15533 1470 5168 -3579 7058 18856 14781 10317 -7471 -12798 3525
24592 3525 13880 -5100 -18908 -23697 -17459 -8790 -15871 -16559 -12242 -9578 421 -6813 -8787 -4491
24578 -4491 -7960 -5788 -5454 -7559 -6794 -3771 4457 2556 1599 -3988 -4447 -1520 1535 -7434 -8991 -13926
24562 -13926 -15487 -18100 -11621 -10297 3648 16454 18025 20100 18929 18721 16121 12049 -555 3929
24548 3929 4317 1098 -3601 -1686 -1213 5117 16876 10487 -7567 -24837 -11282 -7677 -9381 -17469
24534 -17469 -10929 -14198 -1564 -575 -11327 -8516 -2032 -6637 -7582 5879 9167 3100 1088 -5344
24520 -5344 -5791 -4188 -3584 5746 182 1386 4687 1386 10701 15503 22145 13214 -4490 -2497 -883
24505 -883 1481 -2503 279 6340 -4830 -2001 361 -706 2274 -4271 -4648 -251 3222 -5250 -22120
24490 -22120 -35735 -25035 -25540 -24763 -11178 735 8489 2715 -4676 -9716 -9087 -2056 5495 8424
24476 8424 3619 2264 9180 23759 26686 18692 5726 -6294 -8906 1061 -6834 -15002 -19786 -10797
24462 -10797 614 6932 8887 636 -18536 -18130 -11470 -11254 -7851 -5410 -5534 257 -9234 -16227 -4468
24447 -4468 6634 7398 14282 4651 -4447 10844 13783 9470 7973 19242 16378 14034 5576 -3159
24433 -3159 -7013 -3433 1307 15474 10988 -143 8572 14310 5704 -12407 -12443 -12148 2875 -128
24419 -128 -3097 -687 -223 -1382 7469 21198 18321 16376 18720 17587 8167 13848 11098 13316 5429
24404 5429 2441 -2257 6307 9250 4299 -6639 792 6077 11714 10198 7228 7856 19549 16046
24390 16046 7936 4329 7139 9996 -969 570 -2601 -3263 5903 10981 3866 3881 11718 18563 11716
24375 11716 -266 2144 18334 12966 -3206 -9889 -20533 -11762 -7349 -4520 8790 -9579 -13927
24362 -13927 1551 8133 8585 11802 3759 -4106 -13383 -508 1422 -3102 5954 9074 19309 27625
24348 27625 19364 6754 -2821 -4749 10343 17919 12565 7977 -328 2114 6501 -5335 -15230 -2580
24334 -2580 18891 17895 5329 -5625 -4387 4152 6343 5892 -886 5623 11504 1969 -11394 -22580
24320 -22580 -20109 -3839 4656 12 760 -6720 -10806 -9614 -956 10085 5231 1411 -1970 8480
24306 8480 12658 4874 -3511 -6877 -20280 -19335 -6826 -2673 -8013 -10721 -11629 -10726 -7953 -8472 -15422
24291 -15422 -16381 -5313 -8453 -22319 -19837 1205 14000 11262 6672 7486 -62 -5496 -7839 -1579
24277 -1579 -3549 -18026 -17866 -3784 10303 16290 7231 -11412 -12513 -13087 -5297 5144 2675 12098
24263 12098 6591 -2483 -3737 244 -12976 -24982 -19948 -30443 -39435 -37357 -27423 -23991 -20716 -16070
24249 -16070 -5486 3022 8099 -3843 -5421 3180 5129 18380 24554 15162 3189 4645 5778
24236 5778 -443 -1844 -15538 -21905 938 12636 14153 14637 6412 -2228 -184 -7044 -12215 -7570
24222 -7570 -13322 -14653 -9739 -543 -2646 -16281 -20471 -16228 -13335 -33502 -26629 -25004 -13333 -12020
24208 -12020 -5050 882 -11160 -20333 -19997 -8250 394 -5493 -4267 -13078 -1084 12325 6567 3879
24194 3879 13386 18747 13669 12161 -1422 -5580 -5488 -5775 -1390 -15711 -18465 -795 3233 -9134
24180 -9134 -6861 7122 4313 -10764 -4689 6711 10662 1369 -11917 -6698 -2668 882 7735 6218
24166 6218 -8711 4781 6756 -771 8715 29216 12251 -1751 -5114 -4579 3512 -5232 -7677 -13751
24152 -13751 -12733 -20813 -20116 -5734 3485 9664 3230 3089 1522 -5024 2138 4184 5911 5951 -93
24137 -93 9468 4577 2807 -2162 581 -4052 -10639 -1957 8077 1938 5712 7593 -4385 -8526 -1444
24122 -1444 7947 10544 17953 8649 -8418 -28124 -25815 -14893 -1270 1557 -8869 -17718 -12746
24109 -12746 -8922 -4152 -6367 -2561 -2982 -16666 -25294 -14426 -9537 -3677 -7954 -2400 3084 -3997
24095 -3997 -10082 -8923 -565 -6736 -4623 5249 1699 -4167 2088 679 -2323 -3578 -8876 -10140 -7311
24080 -7311 -9861 -17280 -16868 -6539 2329 -81 -485 5052 -1375 -5912 -18437 -34245 -36999 -28856
24066 -28856 -20826 -6471 -7286 2368 10094 5352 5417 -763 -7431 -1825 -2749 8158 13606 1833 -1425
24051 -1425 -343 -6837 -10919 -17044 -32008 -27614 -8319 -4646 -1609 2805 931 -2923 -12327 -14705
24037 -14705 94 7794 -9691 -10894 -6696 -3798 -1797 -133 -7122 -18186 -33849 -21220 -12053
24024 -12053 -8939 3505 -664 -6511 3513 29545 19463 5439 769 3099 6835 -1979 4875
24011 4875 10513 -2906 -5012 9041 1219 -6508 -11123 -15236 -18029 -14753 -23197 -14107 -1615 10048
23997 10048 8058 6744 -7297 -2586 12379 19441 7387 -4847 -12669 -8533 -11564 -8955 17893
23984 17893 25848 3800 -10189 -6287 -6921 -5810 -27122 -31782 -23547 -22240 -24178 -26611 -19688 -13709
23970 -13709 -14439 -15501 -12385 -21747 -28360 -14853 -1955 -2039 2781 14250 13956 12231 10797 -652
23956 -652 -7545 4647 9835 7727 5921 13 -5817 -10468 -23256 -25556 -6820 891 4764 7377
23942 7377 9492 9992 9439 16446 8691 -1676 -6594 -3398 215 7907 7281 11060 16327 3261 10749
23927 10749 13513 -1728 5063 12374 7652 3408 6333 6673 11377 13386 17791 10692 10043 10792 17505
23912 17505 9287 -2027 -10366 -9939 -15891 -11171 -5119 3695 6386 1382 5540 4089 -12281 -20137
23898 -20137 -15100 -12505 -11311 -4082 -176 -3922 -12628 -2860 -4650 -9057 -9764 -5760 -370 -12503
23884 -12503 -13233 -5574 -2831 866 8656 6878 9522 17597 17445 22186 22267 23753 14863 9617 4612
23869 4612 264 -13301 -21529 -25467 -15786 -367 -555 2241 -10066 -20098 -8077 -5832 -7123 -5979
23855 -5979 3871 6598 5128 1715 -13247 -14873 -25849 -29574 -19241 -25456 -18156 1371 12234
23842 12234 20412 8356 47 3205 -489 -1421 4687 3471 11849 12088 10552 18298 12081 -1318
23828 -1318 -12415 1579 2389 -2283 -3414 -63 746 -419 -7102 -5934 -3639 -17706 -9605 4670
23814 4670 13015 16175 15223 4079 6788 9793 -13674 -6462 1019 -1298 -11327 -21565 -16152 -5988
23800 -5988 9399 7086 -1557 2990 13254 14620 4713 3705 -2551 10256 6782 -2489 484 5953
23786 5953 -1038 -844 2042 11124 16366 12036 3811 5205 -1485 -2622 -262 6583 17047 12142 8523
23771 8523 9333 9292 7289 -6035 -21811 -18403 -27318 -26995 -17235 -5480 -492 -2772 -18588 -14147 -1846
23756 -1846 -3779 9893 4218 -213 -18649 -20493 -5311 2359 -14103 -19751 -13127 -19360 -16611 -13071
23742 -13071 -590 -5720 -3511 -3234 -2275 8388 -2010 432 17925 11974 3707 10339 3435 -4014
23728 -4014 -7038 -5312 4024 1522 -7696 5379 12567 12651 10172 6933 -11665 -11387 9080 22314
23714 22314 19816 9590 -5772 879 12754 19882 27982 25700 18734 5789 162 1317 13437
23701 13437 5140 3958 5179 -4308 564 -1773 -5911 -8630 -6839 -10266 -10802 -2973 4187 9715 7242
23686 7242 -8630 -15411 1054 1486 -562 16998 17978 3770 -5760 -7836 -1456 -11541 -20438 -19601
23672 -19601 -26204 -27613 -21143 -10816 -18410 -14283 -9026 -3582 -7832 -11022 -16216 -9472 -7799 -1994
23658 -1994 1692 -1667 -5539 -764 2309 1016 -11957 -20523 -7161 12263 17830 6833 -4071
23645 -4071 -513 4530 10323 13356 6842 5273 2429 -5061 -17282 -16243 -13849 3301 4937 7699
23631 7699 1796 -5438 -1730 -5057 -15053 -12361 4 -24927 -35021 -26852 -19547 -5150 -3029 -2113
23617 -2113 7747 16845 21914 17277 8419 -3518 -14277 -29706 -28409 -18161 -6712 -7589 -9475 -13388
23603 -13388 -16289 -13080 -15804 -14989 -3061 -4548 -6432 -3175 -12339 -17108 -9433 -10096 -11802 -21062 -25345
23588 -25345 -21328 -13306 -15022 -13341 -18894 -20012 -20428 -16232 -31939 -35115 -33229 -24447 -4654 -2491
23574 -2491 -2313 -2897 -2931 -14068 -23067 -18171 -18599 -10334 4639 7682 4698 3613 5287 -10745 -26276
23559 -26276 -26167 -30550 -28299 -15915 -8593 -5579 -17188 -22232 -17060 -11505 -5947 1077 -4510 -7277
23545 -7277 -6145 -3369 -7940 -8069 -5364 -12591 -8064 11467 15527 8156 -14703 -18441 -30069 -15077
23531 -15077 456 10 -10071 -10773 10875 19204 12725 7575 2753 5335 3225 -968 -9743 -5300
23517 -5300 -7990 -5056 3233 7844 -3020 -6674 -10814 -295 9376 6024 5896 4194 -11673 -21985
23503 -21985 -12680 6766 10001 541 -3511 -13256 -19891 -16363 -13287 -2430 4593 -8441 -7173 7122
23489 7122 6885 -6329 -20928 -10943 -13417 -2765 -12025 -8965 5955 7403 10161 3796 -6873 -7695
23475 -7695 -5559 -20104 -9377 -6866 -6936 -6373 -9258 -11878 -13814 -11090 5695 9102 -4993 -7964
23461 -7964 -26778 -38071 -23602 -5433 -18823 -10378 -7637 -2089 1870 1283 -3976 -10210 -8054 -3923
23447 -3923 -5607 4599 -6507 -20398 -28153 -27972 -25751 -20361 -13263 -9643 -2919 15658 11328 2940
23433 2940 544 -4686 -1403 325 -11595 -18483 -15644 -4388 -15926 -26072 -14428 -18497 -18865 -24586
23419 -24586 -32486 -29524 -18581 -2041 6848 -1005 -18356 -23341 -9259 -7625 -19398 -23752 -17987
23406 -17987 -9062 -11064 -12004 -14851 -8438 587 -11958 -12311 -12567 -20685 -26099 -11773 4061 18051
23392 18051 19470 16223 5672 -3240 -26278 -38266 -28676 -18892 -23834 -22986 -8977 -8179 -12720 -16850
23378 -16850 -11546 -21349 -26673 -16182 3615 8455 2008 3911 3901 -20168 -34513 -22567 -7054
23365 -7054 4587 7518 -7051 -5794 -4515 -11472 -13555 -9916 -10350 1570 1993 7540 3521 -3788
23351 -3788 -12069 -13387 -20812 -26568 -27669 -32750 -29964 -25787 -32622 -41781 -40530 -14325 -3875 -12182
23337 -12182 -20175 -31833 -34782 -32189 -34894 -32183 -20534 -19098 -6785 -10133 -16489 -22158 -31823 -19389
23323 -19389 -9797 -19175 -24220 -21466 -17697 -18535 -15404 -15160 -7784 -9472 -7965 -2511 -4451 -5599 -6582
23308 -6582 -6056 -14037 -7294 1571 -888 -9571 -4871 -1913 -1282 -236 -5336 -19732 -19447 -16221 -16616
23293 -16616 -10176 -2496 4570 1139 -3371 7133 3090 -1833 -2460 -7525 -4384 -1868 487 -8670
23279 -8670 14823 28749 19219 20709 25958 22823 13392 9985 16856 27047 16851 -717 -9440
23266 -9440 -14509 -11097 203 -6548 2197 3357 -2687 -6991 -4029 3878 12796 4191 -4715 -4244 11704
23251 11704 23933 12703 4691 3898 1958 -12975 -28127 -24373 -9741 -3583 -4833 -6575 488
23238 488 -8873 -15400 -13261 -2536 5210 6764 -1333 -1263 -13168 -18251 -9789 -1758 12426 6656 -12206
23223 -12206 -13173 2172 5596 -3578 -3996 762 -9001 -22980 -25603 -18347 -6835 -9820 -8956 -10773
23209 -10773 -17734 -15434 -10130 -211 12355 3661 -6559 -5180 -17614 -14686 -3814 -7539 -886
23196 -886 11102 5262 2191 -5390 -193 -411 -16513 -10475 -6369 -11746 -16470 -6966 -737 -4876 -20171
23181 -20171 -32941 -27013 -15204 -10439 -4650 -3517 4910 6223 4987 928 -3007 -3302 -9125 -11150
23167 -11150 -8821 -9258 -15125 -27110 -27263 -15311 -11020 -17978 -34535 -32367 -22883 -19003 -13638 -12684
23153 -12684 -13297 -6568 -5013 -19449 -20759 -2659 6701 4507 3412 -11501 -15384 -3387 4311 3698
23139 3698 -5114 -6580 -2568 -4527 -4680 2448 -2341 43 -12229 986 12609 -316 4857 9043
23125 9043 -1577 -7255 -6597 -8201 -11513 -9715 -4096 -9159 -13623 -17540 -17362 -16839 -19000 -19791 -18715
23110 -18715 -13652 783 -8083 -11356 -14553 -18801 -5376 -6602 -10844 -11025 -8178 -12138 -10246 -11111
23096 -11111 898 5278 3010 235 -823 -10378 -12873 320 3233 -10637 -13975 -2292 7506
23083 7506 7081 3946 -8291 -18002 -11930 -9588 -9553 -12319 -10464 -8811 5123 4151 6457 -4814 -7733
23068 -7733 -3096 -14556 -5534 -8107 -16724 -7138 -8414 -18169 -25595 -22188 -29432 -25278 -10478 -12658
23054 -12658 -17015 -2678 6147 13362 19357 7645 -304 -9075 -16784 -8670 -9194 -12290 -16905 -19068
23040 -19068 -9872 -11809 -16965 -791 -1123 -11496 639 9496 18442 8361 4331 -5224 -12630 -3793
23026 -3793 -5052 -7973 -10751 5371 12673 7876 4802 1834 2885 10006 4756 -8377 -12025 -2732
23012 -2732 4384 2372 -1735 4069 -11149 -29141 -24070 -21688 -14978 -10407 -11765 -9189 1865 11169
22998 11169 12558 6500 -26385 -33642 -24646 -7615 -516 4800 16773 19285 7805 9967 4131
22985 4131 -8645 -6500 -6776 -12592 -12652 -21513 -31493 -18754 -6011 -9304 -11509 -17029 -15608 -15183 -9874
22970 -9874 -9697 -10609 -3985 -21323 -9523 14236 2184 -17497 -16778 3738 5560 5230 6558 -1924
22956 -1924 -22528 -26527 -15961 -21102 -10898 -15408 -12566 -16196 -16491 -14254 -19118 -14614 -5060 -7424
22942 -7424 -7614 -11159 -13920 -24427 -33373 -41059 -41735 -30405 -9617 -983 -13354 -21339 -26253 -24712
22928 -24712 -6793 1285 -3556 -11798 -4117 7132 8803 9728 11502 7619 1718 -11131 -31150 -15816
22914 -15816 -11575 -19900 -27274 -25422 -21524 -16527 -16553 -17151 -6915 -11508 -15662 -20449 -16678 -18948 -33101
22899 -33101 -28316 -8665 -8355 11215 14535 -3879 -1217 -2197 -7107 -3398 -2878 -2956 -2972 -9812 -19876
22884 -19876 -25449 -8139 8570 14214 12273 13055 3566 109 6426 945 2411 9823 1901 -4056
22870 -4056 5958 17121 4334 -19964 -27967 -16684 -20068 -23655 -18930 -15672 -11151 -10920 -11135 -2527
22856 -2527 5607 10199 2622 7753 2731 -3667 6802 17862 10805 -9500 -13497 -12564 -10540 -4738
22842 -4738 398 11392 10006 4321 -10807 -15155 -24235 -24172 -26071 -12299 2531 -9795 -41467 -39586
22828 -39586 -34274 -30362 -27189 -23484 -14054 -13262 5436 7245 5586 4868 -3605 -9695 -9393 -4830 -6822
22813 -6822 -10672 -6042 -22887 -22584 -25752 -22031 -24979 -14969 -9654 1151 -7450 -17390 -14418 -10673
22799 -10673 43 -4931 -7634 -8045 -8570 -11909 -11510 -7069 -17035 -19160 -10391 -13390 -31658 -37978 -37158
22784 -37158 -47900 -49102 -39069 -31547 -33035 -32714 -10616 -16809 -30494 -26417 -12232 -7776 6866
22771 6866 12141 9384 -3632 -2738 4789 -7496 -6901 -3460 7395 -6238 -23500 -18981 -9069 -2833
22757 -2833 8834 19815 13968 -1839 -4136 -10395 -19151 -30598 -28637 -18542 -16548 -19045 -4020
22744 -4020 13745 21941 14065 27079 30928 24408 30124 27294 11653 15028 17589 6007 9657 1855
22730 1855 -6212 -12832 -19566 -7124 482 16596 11464 -6742 -13078 -3902 7699 -9257 -19812
22717 -19812 -22249 -22195 -15017 -22189 -19403 -12711 -6741 6855 7712 -5426 -5074 5344 3619 4956 -148
22702 -148 -5596 -13185 -21851 -26244 -20965 -7983 -4402 12150 9313 1862 13109 24817 15041 488
22688 488 7562 1490 -8232 3326 1481 -568 -2581 -6805 -18871 -6277 2632 5827 375 12418
22674 12418 9265 -3697 -24244 -28031 -30246 -28620 -26987 -37531 -40348 -36140 -20800 -1623 4288
22661 4288 -4745 -8500 -11921 -9048 3829 1716 -7423 -5750 -5162 -3432 -1158 -13907 -15929 -4804
22647 -4804 -14783 -20243 -31491 -30153 -31544 -33294 -13882 8682 11927 2873 -1568 1249 134 -2287
22633 -2287 -11437 -17840 -15716 -22431 -45159 -43467 -26493 -19586 -29354 -46143 -16821 5417 1947
22620 1947 6020 10794 8652 -954 -11261 -17127 -12839 195 5508 -2988 -13369 -18119 -22855 -30711
22606 -30711 -29763 -10033 4763 12256 3847 -506 -8211 -6707 -2995 -2101 329 -1477 -12264 -19854
22592 -19854 -18720 -28032 -25795 -20083 -7974 -827 -5608 -5357 -1249 -1279 -4362 -1876 -6981 -23867 -41561
22577 -41561 -22434 5732 17938 19988 13121 20060 28535 4134 -9486 -16217 -11710 -11088 -1053
22564 -1053 -8761 -7433 -7278 -8417 10721 8348 -122 7016 10107 5910 -5471 -9112 2400 6931
22550 6931 1626 -8980 -16261 -8694 -10316 -23575 -22909 -32440 -32430 -25409 -25118 -20737 -14416 -8737 -5245
22535 -5245 -17839 -21601 -21212 -15230 -412 -4747 -17766 -24221 -27865 -45264 -44326 -42708 -29799 -10382
22521 -10382 9000 16260 4063 -4064 -4600 -10764 -9940 -2927 -8744 -8373 -5241 -10204 -15884 -24703 -10528
22506 -10528 10412 12003 4877 -1318 -13378 -4026 887 10631 12121 -498 -4681 -8424 -5377 -14074
22492 -14074 -16868 -34989 -42375 -26573 -17709 -9977 -317 8627 13936 -7075 -26487 -21328 -17106
22479 -17106 -13287 -13222 -18255 -34002 -41179 -25413 -12583 -10241 -4543 633 -4151 7537 12227 2063
22465 2063 -8967 -3136 6764 3406 6366 798 4177 16023 22422 11707 3145 2937 6042 13321
22451 13321 14576 -3182 -33957 -52603 -46745 -50119 -26080 -30343 -36797 -19805 -5478 -6127 -19521
22438 -19521 -20414 -16680 -17959 -9100 862 1427 6106 -2316 5783 11305 11417 5649 1023 4166 -2819
22423 -2819 -6808 -4912 -3277 -469 -8509 -4220 -1750 -13764 -13310 -4594 -8576 -6409 -1185 -4191 655
22408 655 2873 -2108 -4794 -1234 5716 8233 19846 8561 -3193 -16040 -13434 -17203 -25489 -21837
22394 -21837 -8863 -6261 -2799 12255 12535 13877 6916 9103 4648 8309 12405 16453 8321 -6682
22380 -6682 -12951 -6812 5126 2118 2696 7737 3827 -1330 -286 1895 11263 12658 13931 4256 311
22365 311 -1496 -1732 -6139 -5534 998 6983 4855 -13178 -9383 -275 -536 -3678 -3330 -12808 -26275
22350 -26275 -29111 -24252 -18733 -7906 -5294 -2017 -10078 -20234 -30969 -19563 -15146 -17174 -13179
22337 -13179 -2859 2819 366 1641 -14091 -29141 -34023 -28848 -15563 -16577 -23096 -16918 -15753
22324 -15753 3419 13664 31166 19727 8179 14114 7265 -10156 -20079 -13607 -12942 -13552 -19558
22311 -19558 -20162 -16550 -15504 -19490 -23475 -16912 -6670 -16260 -28560 -23057 -15050 -12256 -8135 -12678
22297 -12678 -6419 1321 7360 779 -16620 -23714 -19527 -3408 -1763 -10755 -11563 -20081 -19799 -25303
22283 -25303 -10020 -5675 -12971 2532 7507 4442 -4161 -10646 -10543 -8233 -11152 -11848 -16479 -10784
22269 -10784 -3898 -1651 818 15002 6478 6734 65 -11941 -28438 -33788 -15631 -1728 7837
22256 7837 8509 11631 6839 -5429 -2357 93 -6743 -6651 -1310 -4887 -6741 -16676 -27962 -27691 -32984
22241 -32984 -20481 -12189 -12173 -17618 -12485 -14558 -20132 -13428 6953 -513 -3169 3915 2122 -16236
22227 -16236 -21583 -28013 -29296 -25281 -25710 -15027 -14400 -11710 -14670 -23431 -26225 -23647 -31694 -27896 -8331
22212 -8331 -6207 -1044 6614 5171 -4468 -17001 -33970 -21563 35 8209 -7312 -22589 -23010
22199 -23010 -12979 -7784 -15577 -10105 -8814 -19382 -15667 -10366 2737 -1761 -7959 -3242 -1941 3828
22185 3828 12900 4776 -7121 -27821 -25136 -11732 -117 -5631 -18175 -20537 -20286 -14662 -1324
22172 -1324 4020 -1615 -7354 -7060 1883 16019 10497 -2582 -8172 38 -3027 -16176 -20741 -3025
22158 -3025 9276 -380 -20153 -19908 -11237 -17956 -27170 -34406 -30156 -15376 -16906 -29236 -32245 -25543
22144 -25543 -22360 -19400 -20673 -5458 -17070 -19501 -13564 -15341 -23364 -21552 -16113 -455 7377 1301
22130 1301 -2019 -5635 -8102 -7051 3139 -2870 808 13176 10366 2117 742 1617 -2634 -6241
22116 -6241 -5023 -6188 -5680 383 -11869 -27987 -20939 -8576 291 -19955 -29814 -28954 -29254 -21207
22102 -21207 -19166 -22553 -16933 -3834 5749 -5567 -9804 -5029 -2537 -6850 -14564 -4732 -2797 1059
22088 1059 -589 -2924 -12203 -22870 -14392 -12285 -18598 -20496 -16027 -2266 2513 -9269 -12533 -14488
22074 -14488 -16974 -4904 2126 -5465 -12717 -2116 -3559 6652 5751 -2309 -13153 -5118 2834 677
22060 677 -5709 -1462 2516 -1449 2871 2303 -6428 -11136 -13996 -875 -5816 -11610 -17567 -24316 -22437
22045 -22437 -9526 -18471 -22872 -21183 -16649 -19106 -26031 -19376 -9886 -11575 -12344 -6909 -18451 -27619
22031 -27619 -16825 -16272 -19367 -19766 -26121 -27968 -23814 -15763 -19419 -16429 8512 25093 21583 8033
22017 8033 -11780 -19548 -14023 -20540 -17186 -16685 -8366 -6696 -6231 -10227 -10318 -3988 4830 7320 -3056
22002 -3056 -4379 -16136 -15622 -354 8510 -2617 -16472 -18625 -29499 -22348 -12207 -12700 -13227 -6827
21988 -6827 2958 11388 1871 -4007 -7413 2319 -419 -3083 -10234 -6394 5166 -2855 -2748 21500
21974 21500 19979 1064 -13506 -9698 1439 598 -1936 -3457 -4959 1844 1709 5658 15202 -1020
21960 -1020 -9594 -14445 -15998 -6572 -8047 -12715 -10916 -13344 -23025 -10240 -11859 -4979 1214 3544
21946 3544 -9906 -9341 -17759 -35552 -26685 -15308 -14339 -7038 -2459 -13431 -23027 -8013 -16944 -25409
21932 -25409 -19919 -26269 -29791 -19141 -10815 -19767 -5129 8630 -3692 -6226 -5274 8819 6718
21919 6718 -7142 -15208 -10677 -11783 -5145 10191 15643 11116 19609 20134 9868 4119 227 3877
21905 3877 -4338 59 4530 -4985 -107 -5810 -6248 -15647 -26124 -24020 -8257 -17477 -36451 -34111
21891 -34111 -18223 -25604 -27872 -16659 -4224 -5450 -7979 -13193 -15647 -8560 4378 13768 19687
21878 19687 13493 11895 -4511 -17485 -12938 -9818 -8157 -3000 2793 -4705 -5909 -1157 -4685 -13689
21864 -13689 -15978 -25817 -19484 -9268 -6267 -1332 3275 8161 -6439 -16716 -26582 -24411 -14419 -17197
21850 -17197 -10837 -9266 -2669 -3524 -11500 -16053 -17983 -4877 -3287 -8500 -11053 3889 17581 13627
21836 13627 -619 -3708 -6349 -11537 2618 19703 -1752 -11525 2466 1581 -9656 -8346 -13801
21823 -13801 -19334 -12904 -3734 -7018 -3824 -3609 -13310 -11715 -3911 -9745 -1700 5249 5598 23211 18413
21808 18413 -45 -5599 -7583 -5742 -3680 -4917 -14980 -28607 -27308 -19384 -9722 -7845 -13908 -12048
21794 -12048 -14329 -1464 4132 7630 6849 4269 207 -2399 -4239 -7107 -13147 -7856 1597 -5233
21780 -5233 -9906 388 18676 18479 13784 7531 2612 1847 -2932 9652 7714 -9293 -19549 -19317
21766 -19317 680 2192 -4376 -8026 -10086 -16883 -20870 -27141 -29591 -12772 -14986 -6243 5082 3645
21752 3645 9799 8213 -5852 -11764 -15082 -6795 -6675 -18630 -17626 -16493 -4994 -913 -4038 -7081
21738 -7081 -14794 -37876 -30300 -10860 -6879 -4569 -9587 -15625 -13927 -23710 -34394 -29583 -11372 801
21724 801 -3429 -9362 -2504 -8104 -17744 -26629 -35452 -38254 -37703 -20537 -13493 2962 20203 28162
21710 28162 28936 19645 13818 17917 16743 13737 21684 20776 13302 7078 932 -12971 -20228 -13177 -2577
21695 -2577 3329 -1760 1505 14339 9070 11623 10791 8502 -3833 -12845 -2355 8955 15676 1124
21681 1124 -13888 -11761 -10325 -7976 -5751 2825 1010 -52 -7230 -1919 -11696 -15938 3040 20316
21667 20316 24954 14783 -6745 -13374 -10941 -16596 -2673 1323 -724 3129 11859 15815 16216 7510
21653 7510 7617 14429 13613 2591 -4790 -122 -2638 -19028 -17008 167 -7425 -16473 -10684 -8717
21639 -8717 -7660 -10263 -16808 -12911 7976 9773 983 -4057 -6778 -13975 -16358 -9906 -1336 -9402
21625 -9402 -15740 -21398 -10553 -16860 -11353 -1824 158 -12971 -17571 -15729 -12266 -14987 -17481 -19117
21611 -19117 -24599 -17509 -18355 -22317 -5403 -13456 -21656 -11108 -1309 3824 2055 1801 5041 1361
21597 1361 -14467 -15303 -9268 -10878 -10007 -8436 -12311 -5912 -1035 8749 16742 7068 -10166 -17353 -12765
21582 -12765 -8403 -491 -6621 -9527 -8153 -5660 -594 -8498 -22951 -20594 -17726 -26395 -21788 -9446
21568 -9446 -7935 -14576 -11727 -19759 -17763 -14457 -17590 -29302 -22445 -5039 -2712 -543 -10059 -5543
21554 -5543 -11177 -15282 -6905 764 -9960 -24719 -29366 -15462 1106 -9141 -3001 9585 22008
21541 22008 3662 -15464 -19933 -15964 -17806 -18541 -21025 -26060 -26049 -27354 -17664 -2187 4039 -2470
21527 -2470 -5095 -2453 -1682 449 -2601 14448 25520 16463 2491 -11374 -4740 -11615 -8284 -5774
21513 -5774 -15857 -8639 -6867 -6531 -13737 -19799 -20101 -10488 4292 22332 25550 15097 -1797 -10606
21499 -10606 1689 8535 5874 -107 -7300 -15608 -17012 -15808 -8876 -13550 -11870 -6644 -11739 -14726
21485 -14726 -18053 -11792 -15686 -22310 -1679 12842 815 -5226 -12398 -11860 -11837 -21061 -23733 -14420
21471 -14420 -9216 -8459 -2791 -3892 -11895 -14180 -12034 -11018 -25809 -29126 -28670 -22333 -23985 -12333
21457 -12333 7322 347 -11609 -27518 -26990 -18580 -18180 -13857 -9864 -21709 -18783 -13904 -15863 -18431
21443 -18431 -8029 4790 3312 6705 3292 3889 9576 8189 7141 6189 -12727 -9399 5919 14368
21429 14368 10895 12219 3811 -4729 -15069 -21573 -15438 -6497 -12670 -15711 -16956 -18450 -10182 -9267
21415 -9267 -12813 -8349 -4648 -16939 -27740 -31785 -34200 -10159 1691 -5461 -5993 -2799 -8309 -10564
21401 -10564 -21474 -27484 -18002 -14309 -17654 -8547 -8393 -14472 -15684 -21719 -40843 -45424 -28279 -16624
21387 -16624 -8869 1443 -436 -26418 -34032 -25275 -14291 -8344 -1907 1962 -2012 3704 -2751 -3938
21373 -3938 -4015 -7561 -22847 -26349 -20831 -12520 -2702 -8754 -9455 -4110 -2216 -3620 -3035 -6172 -15541
21358 -15541 -31678 -32124 -25826 -15546 -19004 -37152 -32429 -36780 -38341 -41841 -34901 -29735 -12740 -17232
21344 -17232 -20751 -20253 -9422 -4123 -2250 654 11020 2360 -707 7552 6200 5641 14733 11463
21330 11463 5756 2551 -6827 -23521 -18848 -2487 -11337 -4099 1068 2288 2673 -10260 -12526 -5965
21316 -5965 9117 10437 6731 -4 1857 -840 -22 -478 -5080 -3090 9207 4449 289 287 962 -5993
21300 -5993 -21505 -21332 -8466 -3918 -9860 -9724 -17778 -14173 -13890 -15440 -16423 -9197 -10551 -23200 -35431
21285 -35431 -42307 -34627 -23820 -1287 -6681 -27655 -23732 -21196 -25822 -21905 -6135 -3366 -11421
21272 -11421 -13500 -13122 -16563 -12131 -8540 -2435 2416 -756 -11428 -14180 -10852 -5201 -11173 -17445
21258 -17445 -9721 -5448 -1869 7561 10486 12214 17260 14633 -237 -6616 -319 -6825 -14755 -10589
21244 -10589 628 -5339 -16799 -27839 -19821 -21238 -26576 -33427 -34318 -25185 -18104 -10687 2593 -4130
21230 -4130 -16018 -21975 -20895 -5064 1500 -6773 -11797 -11127 -13329 -14780 -28077 -7820 4669 6967
21216 6967 5433 655 1263 -764 -7783 -15563 -13715 -21725 -25630 -20222 -15463 -10729 -19168 -22792 -22164
21201 -22164 -26582 -20826 -9070 -12606 -28440 -28182 -22481 -23389 -18894 -8269 -9642 -22580 -12607 3750
21187 3750 4334 4883 -6176 -25409 -29288 -36392 -41746 -30648 -13200 2121 3646 -1725 5081 -2333
21173 -2333 -7267 -11581 -8173 -15136 -9252 -6142 -8154 -3506 9177 2703 -4167 -9859 -1144 2658
21159 2658 3354 -1773 -10662 -20667 -20592 -13888 -15850 -20858 -19719 -14769 -16570 -6430 -1422 -5831 -21590
21144 -21590 -31139 -41140 -33926 -20005 -10379 -6602 -6046 2061 -4088 2037 10252 14673 1900 -12441
21130 -12441 -10305 -3551 12998 15435 16968 640 -13181 -16055 -18160 -5764 2211 -16004 -30117
21117 -30117 -25345 -17770 -24530 -11704 -518 7985 -40 -13606 -22088 -11750 -4135 -9698 -21229
21104 -21229 -29849 -32185 -19835 -9551 -7523 -13986 -141 8804 -1220 -4184 3746 11183 -2093
21091 -2093 -19785 -22313 -16459 -10856 -6129 9407 1873 -3485 -12772 -14913 -1530 -1275 -5275 -18631
21077 -18631 -26815 -16527 -7854 1892 14502 13127 -361 -12346 4617 24920 19342 1317 -12533
21064 -12533 -28972 -19179 -2211 -752 3186 -4070 -3307 221 -216 -6093 -13314 -25693 -21154 -6992
21050 -6992 5397 -6548 -12961 -14357 -18174 -14007 -5241 45 -14561 -17716 -13008 -6098 -11738 -15790
21036 -15790 -22307 -15751 4147 14718 8491 3452 9833 4497 -6936 -7437 -2956 -97 1516 -849
21022 -849 7366 9653 5116 4207 -695 -7082 -1464 -4795 -5066 -6757 -6523 5972 6292 8924 8440 5987
21006 5987 -2455 5743 9839 1740 5554 14889 25571 7559 -3653 -6214 -13229 -22336 -5600 790
20992 790 -4326 -11980 -6983 -2753 -4538 -4098 -16354 -649 11677 6188 8853 18178 1744 -10287
20978 -10287 -17060 -12727 -16748 -9400 -6152 9181 9464 -44 -3797 -4564 -4771 -7021 -3105 9851 17256
20963 17256 14793 11018 5447 8436 2587 -2962 4314 4857 7497 12023 16857 3424 -9848 -10798
20949 -10798 3991 13102 10681 5995 11096 -1351 -11463 -8663 -4873 -7016 -6170 6314 -2601 -16580
20935 -16580 -24863 -18254 -12004 -8123 -10377 -13075 -16421 -15545 -11651 -1014 -4358 -4347 -1876 -18427 -37386
20920 -37386 -46132 -43954 -28677 -13551 -12367 -13633 -19550 -14020 -13579 -19401 -10668 1484 -6959 -12825
20906 -12825 1962 5975 -970 -7306 -16275 -20681 -17544 -1120 5887 5449 -1041 -3805 -527 -12372
20892 -12372 -13546 -20735 4010 22869 16163 5076 -6927 -1700 457 4432 12250 7848 2951
20879 2951 5021 -7405 -22859 -14350 -6368 -6577 -3560 -3543 -10711 -9679 -7356 -8541 -17051 -25044 -7980
20864 -7980 1716 -2716 -6497 -6354 -8949 -16044 -20428 -26072 -21205 -17895 -10627 -3432 -12047 -6900 -3627
20849 -3627 -20159 -25547 -15788 -4960 -3533 -7718 -12206 -19817 -10407 -3991 -4122 7314 23952 27114
20835 27114 17343 15779 2470 -2747 -1750 -9111 -9750 -8249 3835 9129 402 7339 16681 19384
20821 19384 -2311 -25176 -11618 -4893 1855 2316 6551 9050 12939 639 -10726 -8213 -2971
20808 -2971 2839 -3103 -11534 -19570 -16860 -5602 -5589 2699 -6477 -19891 -21024 -6170 13150 17507
20794 17507 10829 12499 7236 -6813 -4027 2976 4842 -7909 -8673 2407 -7186 -11608 -9967 -8250
20780 -8250 1585 5540 16733 14225 -11839 -1404 6272 -12391 -14970 -8967 -4554 -6148 -3027 -10061
20766 -10061 -12320 -6736 3383 7865 13290 16297 4770 -8126 -2706 11244 23099 16193 1653
20753 1653 2036 8950 3352 -3183 6120 18509 9711 12516 13906 -6400 -19198 -23438 -14933 8987
20739 8987 20370 8946 5583 -8564 -22908 -32355 -24044 -4392 4826 6938 -1056 -2425 3280
20726 3280 -467 -11324 2581 8648 5041 -2709 -12442 -8445 -6375 4983 8027 6213 207 3096
20712 3096 -1707 -3066 5040 -5532 -959 9198 11775 6497 10125 21777 13836 -1922 -4057 964
20698 964 2404 10005 17383 22054 14221 -4724 -15561 -10832 -8105 -11824 -12033 -5441 -7443 -16507 -15509
20683 -15509 -3477 -3539 -20596 -14212 -5411 -15181 -21069 -18630 -12572 -9848 -19713 -30422 -25800 -27795
20669 -27795 -13257 -4956 -2240 -750 2023 4020 6011 7520 -9979 -18088 -10984 -7851 -15989 -17288
20655 -17288 -27410 -15806 -8770 -12444 -16397 -10435 -14739 -13570 -6242 -1008 -9148 -14103 -22830 -18454
20641 -18454 -15243 -2135 -3694 -595 -763 -5963 -917 -2645 702 12351 13458 5778 1223 412
20627 412 2754 -4559 -14380 -20302 -19730 -9310 2279 5894 -13004 -17637 -20158 -23733 -20490 -20879 -17586
20612 -17586 -14543 -15389 -6127 9845 12276 13877 2656 -2258 -3569 8272 -7158 -16700 -19910 -20836
20598 -20836 -19323 -17925 -18707 -10581 -2398 8281 1605 8100 12261 -4403 -15044 -27231 -29570 -26411
20584 -26411 -18838 -24562 -23759 -12156 -2092 -4301 -7755 4226 2194 -536 -5153 -320 -889 1211
20570 1211 881 8950 11780 11626 12494 14127 4532 -6893 -3776 5705 8908 7286 -1252 616 11352
20555 11352 10627 8606 8198 4653 -1858 -4161 -4858 -2952 749 -15240 -24565 -10154 -6875 -2217 904
20540 904 -11076 -4093 -1876 -10436 -4871 -13164 -19879 -16171 -16674 -20105 -24669 -22549 -418 9639
20526 9639 -3853 -24226 -34371 -19066 -7854 -13588 -23598 -37973 -48019 -31701 -20223 -6044
20514 -6044 -2227 -2768 8022 10199 6300 3847 14702 6724 12835 -387 -13987 -18976 -23999 -18720
20500 -18720 -22186 -10058 -3290 -8364 -17051 -16182 -11168 2658 13297 8616 20315 31400 29627
20487 29627 20658 7393 3778 -1769 8266 9633 16754 9591 -2011 -2868 -6022 -8693 -11012 -13515
20473 -13515 -17904 -8928 4453 -8801 -10930 -447 -14422 -20154 -30561 -31521 -25479 -20849 -23235
20460 -23235 -29063 -31144 -26091 -27975 -29174 -27347 -19086 -23129 -32318 -28369 -33570 -28720 -28904 -18850
20446 -18850 -7212 -6837 -9844 -3440 -1519 8195 -8740 -21797 -32449 -38509 -26580 -14579 -23119
20433 -23119 -16074 -556 15433 23065 22965 11534 7953 5758 -3318 -17385 -13838 -16596 -13236 -5277
20419 -5277 -18250 -18678 -17909 -7055 3082 16961 2729 -13934 -30296 -25709 -1538 4955 13858
20406 13858 24981 21417 8766 9628 15543 7543 4373 -5005 -13225 -10813 -6394 -15990 -4468 784
20392 784 -5069 10668 15477 10311 9657 -2599 -14135 -14245 -15774 -22749 -21754 -2043 13430 -2415
20378 -2415 -4517 -13242 -13812 -4868 -6445 271 10954 6451 15139 15444 11540 14265 5521 15 -5293
20363 -5293 -10963 -11269 -10673 -4945 -11387 -26404 -41678 -44990 -50057 -40879 -21425 -18197 -3484 5623
20349 5623 5710 -7299 -1144 -10026 -12765 -3593 13101 8916 -4622 -9746 385 18550 12163 1812
20335 1812 2775 1002 -4154 3711 5793 -2741 -713 1129 -9774 -13731 3351 -1833 -2381 -2708 -5432
20320 -5432 -10637 -8141 5445 4873 2583 8874 15559 10891 16898 28933 17454 2161 -10964 -29923
20306 -29923 -34689 -21780 -7240 -7086 -6399 -17080 -28319 -28855 -15311 7651 3140 7906 792 -17015
20292 -17015 -11189 -25 4126 1403 1503 3421 1985 -1116 5197 8867 1933 -19 -3049 -4344
20278 -4344 -8157 -18115 -14645 -2910 -8004 -17434 -22453 -14087 -13541 -17311 -15862 -12221 -9094 -10346 -9809
20263 -9809 1925 8549 2501 8095 2944 3892 -9266 -17193 -8336 7665 8115 3974 7715 10966
20249 10966 158 5772 21632 17751 8492 4832 -2979 -13307 -2316 12808 22626 6830 -6813
20236 -6813 -6624 -8781 -6766 -3631 -8689 -14950 -4034 2715 -7112 -4540 -1262 -6766 -17996 -23161
20222 -23161 -11104 -15968 -31479 -33422 -19504 -11286 1833 12593 12218 1215 2915 14569 14346
20209 14346 15511 9498 3840 -1328 -2550 -3770 2925 -392 11627 13900 7980 2766 -2155 -4286
20195 -4286 21821 18334 -1730 -11674 -8627 -6626 -16822 -3542 5404 4475 -6801 -7411 -12759 -9866
20181 -9866 -5931 5577 3787 14200 16302 2148 47 -1343 -13244 -15061 -14165 -20842 -31651 -15793
20167 -15793 4836 15703 806 -8949 -6388 -1456 -13422 -12402 -6602 1366 15318 18738 10102
20154 10102 -2666 -2666 253 -77 -2493 -9554 -17494 -21177 -2414 -8090 -21934 -7904 -1666 -13838
20140 -13838 -28165 -13531 -15965 -21620 -19523 998 7952 8875 2068 -1848 10680 25345 9970
20127 9970 13788 24146 -645 -12435 -18779 -14932 -16225 -7406 -7173 -8822 -1731 -2101 5337 18215
20113 18215 13320 3947 4228 20840 23606 7197 -7672 -7995 7651 18308 19461 11785 7836 4791
20099 4791 6357 2025 -9310 -8026 -5729 4416 15087 -939 -2388 10082 18387 14831 5426
20086 5426 2157 -1319 -7886 -4772 -8199 -20990 -12295 3410 14561 20891 13203 439 -1105 3714
20072 3714 17597 26880 15795 -10932 -23344 -21621 -15328 -6184 10564 18231 16825 5937 3713
20059 3713 626 -6920 -19319 -17710 -11445 -3711 -3880 -17765 -16720 -22344 -20389 -5836 9686 9552
20045 9552 -2215 -1764 -968 -4174 -221 1193 892 -1337 -12488 -28583 -16491 -1824 7059 4157
20031 4157 544 4015 10562 28749 44202 36697 21717 22484 20777 11039 10857 9349 7252 3065
20017 3065 9797 18416 15801 14152 4890 4292 2203 87 4733 5824 10169 1308 -12607 -6779 14588
20002 14588 17011 10084 12750 13187 14748 13750 -2095 -13311 -8613 2848 8882 20285 18404 444
19988 444 -9431 -14151 -19930 -18339 -2368 17159 25735 12886 1038 8545 17240 7875 -219 7377
19974 7377 9257 -6485 1715 5316 14680 16074 9627 10243 -6640 -22870 -19721 -12621 -10961 -13434
19960 -13434 -11132 -9290 -6335 -12886 -5987 -3145 5395 17015 11976 7353 -3686 -1185 3449 -7320
19946 -7320 -11430 -10293 -6360 8179 12719 16368 18528 19610 16914 9635 16083 28660 14832 -3946
19932 -3946 -9382 -969 -5495 -10209 9115 22858 19591 10285 7803 10947 25214 11207 2956 2111
19918 2111 3022 247 6287 9740 21061 34744 28382 5700 -13534 -16721 -17969 -9671 -185 -8405
19904 -8405 -19552 -4726 9078 -673 -5707 12670 19586 17796 21392 26534 23251 11028 17377
19891 17377 25863 45259 50559 32350 10524 -10729 -13309 26 7377 2920 -2724 -9215 -12268
19878 -12268 -15028 -7292 2480 5785 -1837 -4295 -686 2419 6235 8671 -8968 -12761 -13345 -11035
19864 -11035 12724 30627 29406 21504 3195 997 3063 27430 24149 13844 10062 1737 -3041
19851 -3041 8126 6025 -11371 -22085 -15836 -8172 1859 -1370 -10000 -14485 -9557 -5585 3343 614
19837 614 -9224 897 2457 -7393 -9667 -19197 -1234 9753 15273 22287 15966 19129 26248 20991
19823 20991 11763 262 5796 6645 9780 16477 18315 4082 -4614 9150 12111 14189 14909 5689
19809 5689 12047 24622 31163 29408 25378 29443 31210 32261 34872 39023 35159 19272 19156 20119 16852
19794 16852 7751 6184 -537 -2136 1384 3579 12952 11515 5228 4903 16410 21686 27567 21647
19780 21647 23004 32791 32438 24302 13979 17141 15032 13215 -3708 -13098 -5028 -12558 -6316 10301
19766 10301 27337 31515 28436 24518 18256 6089 1797 -966 10884 29612 31414 22993 1970
19753 1970 -8713 -2677 19071 15426 5810 15686 5003 -4763 -3827 7259 5111 18967 27675 20774
19739 20774 22594 29613 15632 -421 22369 22804 9537 13647 11065 6731 8587 12321 11361 3652
19725 3652 -1194 7197 13419 14795 28127 23444 8013 10000 3957 994 932 -139 -7808 4488
19711 4488 16630 14818 16785 28879 36363 33648 34874 27770 7233 -575 8330 14455 9158 -3795
19697 -3795 -3046 -4071 -5004 -1549 -2835 5434 25433 38838 37672 24783 21063 23104 25762 19544
19683 19544 18373 25251 19716 19239 13361 7551 17534 3059 213 5354 9539 10815 3043 -10576
19669 -10576 -17516 -9859 -787 -10967 -5137 8399 700 -6270 411 4583 14543 21958 31342 36912
19655 36912 26489 23421 22336 11428 13214 4340 1246 5277 7408 9221 15015 16221 26936 35550
19641 35550 37852 45626 50204 54909 50177 48380 47039 43075 37519 22297 16761 20913 28763 23245
19627 23245 13525 -592 3282 13355 27770 41962 44864 37396 30674 33312 37024 21392 15130
19614 15130 1915 4844 13941 24508 21028 5437 -1327 -2795 -8127 -8103 -9866 16328 27241 23840
19600 23840 28151 20250 5853 -17786 -14096 4914 3142 -136 9268 8252 6392 3776 7324 20855
19586 20855 28404 33094 23348 22782 25028 25879 27139 24702 18125 1158 -1998 -7152 -1646 -1408 -2839
19571 -2839 6466 16783 30204 28990 27167 21268 4190 -230 2052 8760 8944 7224 3442 352
19557 352 18690 20801 10334 580 880 4569 3638 -7828 9898 12055 1199 2682 13035 9413
19543 9413 -4436 -13705 4507 14469 14982 14862 21890 31217 19356 21454 9560 18071 18653 11381
19529 11381 3143 8241 11853 22721 22534 22865 26233 25150 18096 11070 28232 33344 29005 26266
19515 26266 18749 16183 6849 8495 20470 18953 17382 23759 24066 14548 11651 14303 14363 16168 19444
19500 19444 23089 28907 26718 23842 18646 27384 36517 43011 38616 25391 31736 34037 32924 24196
19486 24196 24680 19601 16506 15513 10944 13505 13888 9302 22062 36776 43046 61914 78671 67591
19472 67591 45420 52664 51290 49106 48062 40912 29275 21224 13367 18831 31815 29335 28895 23947
19458 23947 17269 14013 16009 18680 25067 31856 30916 25554 18695 16307 11864 7199 1168 -7512 2515
19443 2515 14853 8842 5633 -3820 -5207 147 -7505 -3834 -8621 294 14187 14068 20736 28044
19429 28044 24608 24299 27421 28767 27811 18678 9954 20319 28231 41470 32571 18519 24578 37585
19415 37585 40869 22363 24862 41662 57095 62809 67776 55694 44721 38185 36954 46041 53985
19402 53985 38437 35492 40662 41485 42109 32409 30753 31863 31751 11501 13706 19484 16294 15960 12951
19387 12951 16335 23116 28391 38224 33518 27653 32488 47874 42354 33790 30239 43333 40252 46819
19373 46819 48099 29984 34793 34322 32211 43629 49108 40326 31844 35358 42345 42362 38917 38808 50012
19358 50012 50839 49675 52356 56240 47011 42705 36200 49834 50907 64574 80784 82301 74570 62307
19344 62307 56512 55482 56075 54573 46028 42772 51515 45112 47375 47032 52110 38976 22004 16734
19330 16734 26373 29157 23682 20978 13922 25491 51733 55752 38912 26342 13974 21529 29163
19317 29163 16226 29480 44757 34505 10122 17652 36154 42447 55484 58479 49572 44338 51028
19304 51028 39457 23202 35821 41754 44974 51001 51282 51691 60925 50659 35755 27332 31618 58582
19290 58582 75245 62701 45310 35063 26521 31321 27885 26507 22412 22698 20927 20222 17329 32292
19276 32292 37998 46206 51422 42259 42441 43383 37538 38068 36876 21040 20323 28035 31727 41725 32429
19261 32429 25802 24815 19730 22801 35667 33223 29452 32544 23495 35668 60150 61721 47405 44471
19247 44471 50616 68126 72394 56775 44153 59126 57886 55255 49521 37886 47919 54848 47076
19234 47076 36727 33135 34841 31615 36361 39831 38808 48178 48642 52596 56076 60185 50930 49310
19220 49310 49574 51204 47839 34875 17641 29007 41513 47046 52208 49562 37521 46829 48064
19207 48064 52101 40410 49862 55598 51786 45053 45858 54676 51442 43285 34811 30002 48643 53413
19193 53413 48581 49345 45799 48908 51319 52243 53489 64710 58452 62384 62455 56564 50813 49064 66965
19178 66965 77752 84456 75511 70734 72801 71697 84749 92592 91039 84431 66989 52889 52946 64874
19164 64874 64484 53400 62767 68901 61415 46755 31620 31898 42549 43752 54839 54496 52612 51723
19150 51723 49982 42432 37184 40581 44326 52124 45881 43166 55621 55643 60865 55634 55236 58743 67871
19135 67871 68951 63333 53280 55168 54675 60075 62641 66571 65430 58975 53699 47870 51835 61197
19121 61197 57077 54659 57291 49829 35655 42611 53418 60239 60361 61189 64195 75009 72467 83173
19107 83173 92059 84395 73012 73655 81186 84109 89395 101481 103303 110357 111113 98525 90032 79820
19093 79820 79179 82388 92079 85326 86264 81249 81895 94254 101661 98233 106893 106618 99190 106473 103674
19078 103674 99562 102817 106095 118239 120960 112943 110300 109544 114299 141023 162344 208577 266468
19065 266468 351217 445059 490650 480380 496015 541581 558403 526302 484629 463239 489810
19054 489810 559294 593085 538458 467514 422618 409281 402870 417453 467423 531083 536195 472690
19042 472690 420217 355097 300710 273638 260102 230816 209367 190993 188331 184771 186397 188491
19030 188491 192276 185640 196126 219904 233349 244672 253541 269274 291048 315241 360773 447516
19018 447516 588142 758298 827040 740540 624421 543241 469978 447386 452880 476101 546508
19007 546508 634891 700413 704763 689368 744141 816939 829254 772513 700884 661922 645097 648189
18995 648189 616533 568895 522866 506844 504529 483373 453715 421377 384403 362479 376450 395597
18983 395597 397511 406673 400771 384154 375794 391774 419833 430307 426407 418111 446678 462535 461891
18970 461891 485159 494277 480786 469602 450383 444963 442283 431555 382372 350708 339725 312813
18958 312813 280340 271490 263875 256225 254273 267396 302294 340263 355237 352926 357651 382829 428661
18945 428661 470647 472133 460265 476035 479292 491569 519986 570349 620631 614337 562768 511868
18933 511868 488364 495768 481944 422595 366552 328325 291718 262362 241414 227461 215636 219257
18921 219257 222269 240095 245531 228433 195185 180963 187458 176579 163263 168411 167876 160531 148637
18908 148637 151526 148293 128564 127228 139939 149024 144391 139823 147336 146452 131941 135708 124828
18895 124828 130963 136549 131610 134673 130996 124142 118205 109123 120207 125045 113802 116183 128862
18882 128862 140897 148482 134979 141872 147816 143632 133823 116379 109974 114319 123285 123359 116279 121756
18868 121756 129226 135779 134296 120246 110722 107233 113831 120457 110935 111166 111355 110760 116054 108278 92195
18853 92195 106348 122219 124811 122817 124274 128760 134409 133934 133909 120150 128132 156245 157134 142903
18839 142903 141261 139654 137199 137569 138983 131587 127979 140456 143117 138023 128742 117078 113111 125907
18825 125907 135195 149234 158813 160653 153819 148671 159788 157585 136316 148537 164381 172633 180665
18812 180665 186422 184091 172662 172992 199394 220434 234532 234432 241466 249569 250638 225109 200806
18799 200806 193201 187072 193948 208111 224291 233230 225676 216908 218434 225802 237545 233284 252476
18786 252476 280037 292168 306441 314619 328016 330625 336866 345609 356085 353167 351868 356578 371239
18773 371239 381684 399548 423521 448673 481777 531851 571637 617159 676119 747994 823315
18762 823315 871271 929969 1014436 1164903 1393888 1786776 2488390 3643686 5169075 6542738
18752 6542738 7133530 6886800 6085374 4957508 3941205 3186540 2652359 2284668 2038650
18743 2038650 1877536 1789887 1759984 1770449 1849791 2013589 2322389 2734436 3126413 3373416
18733 3373416 3547297 3838628 4445872 5376194 6447452 7254099 7846489 8214130 8061336
18724 8061336 7153485 5949312 5040668 4532710 4383591 4486787 4699996 4980977 5423859
18715 5423859 6122722 6904369 7427147 7380037 6771035 5842503 4821021 3995207 3408678
18706 3408678 3007274 2722268 2476021 2264865 2096663 1970095 1869328 1807141 1779728 1769464
18696 1769464 1735862 1668785 1604192 1577890 1612291 1726216 1971079 2371521 2895251 3383714
18686 3383714 3689769 3674321 3366972 2933520 2604026 2456061 2511418 2772785 3089872 3281331
18676 3281331 3289110 3232584 3285946 3350738 3221423 2857526 2420212 2077955 1821506 1642777
18666 1642777 1509181 1426705 1374842 1332652 1320094 1337944 1405853 1465534 1522410 1637554 1851955
18655 1851955 2131079 2369843 2506618 2616754 2701479 2691424 2541084 2328867 2162166 2092487
18645 2092487 2170014 2325127 2353236 2233354 2024822 1807442 1642839 1536954 1472402 1439618
18635 1439618 1443137 1507817 1652410 1776819 1809133 1759125 1617317 1469678 1356416 1278919
18625 1278919 1233669 1219069 1208195 1203246 1219596 1241874 1280762 1321311 1363700 1432539 1554013
18614 1554013 1750253 2062171 2563395 3201367 3748330 4005275 3992340 3848666 3627413 3394621
18604 3394621 3194625 3092212 3153998 3448636 3916813 4332821 4602412 4806963 5011551 5158371
18594 5158371 5231866 5289322 5296042 5311983 5389935 5410991 5243034 4983385 4714848 4624351 4760137
18583 4760137 4972672 5168182 5354518 5468770 5695239 6301729 7486172 9061649 10062807
18574 10062807 9663231 8655005 7936704 7524736 7201757 7010772 7078252 7364387 7783318
18565 7783318 8366010 9133277 9964481 10847025 11979522 13727962 16361600 20226396 26179074
18556 26179074 35774165 50373630 65665061 71331084 69836516 72832169 81910553 86202316
18548 86202316 77189245 64766668 56877261 54128359 56518107 65158158 77051088 79964281
18540 79964281 69999588 58365411 50088912 44456455 40644060 38461995 38001575 39589132
18532 39589132 43764393 50854390 60633732 68431294 68181921 60357660 50358553 42501629
18524 42501629 36866088 32963330 30323168 28680918 27962796 28144452 29212963 31476031
18516 31476031 35680422 43045325 55365625 72692267 87298684 90384635 90045865 93517130
18508 93517130 94943969 88679521 78493208 68910390 60493981 54588700 51309895 50538325
18500 50538325 52626672 58801349 71115986 89407219 104249872 105327846 102630572 108198355
18492 108198355 118380943 116705516 99457216 81712575 69692706 62690439 59971133
18485 59971133 61707227 66049726 67323999 65487410 66696035 73107399 81071787 83510730
18477 83510730 78780440 72248858 69451437 70312610 70223571 66661921 64980298 68232403
18469 68232403 73301153 75112674 76387158 80318414 83074694 81449725 77425733 72785379
18461 72785379 68576238 66652613 63552626 55972755 47372767 40577052 35625455 32009685
18453 32009685 29391062 27583040 26462209 25931057 25800592 26185279 27738573 31342486
18445 31342486 37511993 43989250 45320459 42521951 41239073 42532635 45824372 51351219
18437 51351219 55676355 52926214 47472320 44702626 45557914 50749222 59000134 63204447
18429 63204447 60927191 60289481 66081729 80272150 98619484 105548046 98152006 92972872
18421 92972872 96791579 105443405 108458005 100897130 88850861 81495284 79864891 77292904
18413 77292904 67659732 56061231 47012928 40429134 35452846 31556570 28473674 26154381
18405 26154381 24451757 22999972 21476439 20075197 19029687 18392255 18184243 18485882
18397 18485882 18698128 17617691 15781012 14368790 13756565 13950438 14244361 13321668 11460719
18388 11460719 9766291 8438142 7421091 6635115 6033929 5593265 5231862 4860890 4483336
18379 4483336 4162582 3898866 3685090 3492190 3308326 3160810 3040995 2972424 2971501 3102313
18369 3102313 3393876 3778643 3937335 3739556 3470015 3309100 3316708 3461055 3472886 3153767
18359 3153767 2744658 2464763 2292042 2201150 2199549 2184819 2117782 2019130 1855675 1708405
18349 1708405 1601882 1495140 1400650 1326042 1255668 1182381 1129428 1096098 1051133 1029074 1007070
18338 1007070 977703 944686 902222 858106 831183 811892 803218 802462 827770 862894 900331 943728
18326 943728 982851 1029528 1124968 1329195 1661914 2053946 2312692 2404871 2306626 2056740
18316 2056740 1814251 1643796 1520469 1454694 1474674 1601985 1861656 2117363 2242948 2297621
18306 2297621 2201863 1995652 1803385 1687653 1638251 1597762 1554880 1510245 1484231 1496255 1588831
18295 1588831 1793541 2154551 2647184 2969924 2820498 2486534 2246484 2125988 2102548 2107828
18285 2107828 2008938 1864722 1824076 1896984 2054469 2321526 2827989 3601893 4388358 4807216
18275 4807216 4664987 4238112 3902718 3634490 3381497 3091618 2794703 2555699 2429391
18266 2429391 2418756 2526959 2711028 2946208 3215632 3520262 3783891 3948361 4140374 4435779
18256 4435779 4565041 4273514 3825814 3553755 3483300 3661002 4035354 4360799 4431654 4487500
18246 4487500 4500591 4220022 3844508 3648307 3708156 3948583 4116285 4052574 4030185 4146414
18236 4146414 4097264 3805293 3558529 3424878 3344260 3355742 3572212 4042981 4775992 5641868
18226 5641868 6333951 6557155 6321340 5932719 5648431 5585372 5697203 5733569 5810522 5991480
18216 5991480 6084542 6108578 5970253 5769179 5716127 5833959 6059044 6377921 6878757 7575223
18206 7575223 8410624 9837365 12509980 17257707 24061724 28933149 27246675 22534930
18198 22534930 18918555 16811374 15903703 15979221 16841080 18681259 22158998 28725703 39325117
18189 39325117 49105300 48418398 39665901 31385377 25384092 21112139 18113034 16157678
18181 16157678 14989180 14488078 14422446 14308071 14023357 13578864 12982363 12614766 12659862
18172 12659862 13070950 13753502 14302157 14304749 14205467 14478791 15175289 16232240 17706241
18163 17706241 19578527 22070516 25682094 30656372 37607522 49138360 69333387 100227436
18155 100227436 129636098 132029853 110767095 89157421 73902173 63966452 58096206
18148 58096206 56026136 57712085 63463120 74724695 94371676 118321049 127771439 118005550
18140 118005550 105510836 94571763 86140740 82572227 86813954 102207439 129311221
18133 129311221 151970890 144924485 119929689 98434617 83096159 72049220 63998078
18126 63998078 58243964 54427005 52416670 52013676 52772944 54808361 59368778 68028822
18118 68028822 83802280 112742413 163512795 231704539 267087254 233045072 180808365
18111 180808365 141704749 114573882 95334628 82546198 75604571 73882353 74670115
18104 74670115 71139241 64028284 58893105 56160025 55432843 56772278 60314233 66997261
18096 66997261 80061698 101495430 122374570 124314150 111561890 101991830 101595228 112525265
18088 112525265 130704852 138462915 125487067 105515971 89485440 77985663 70782400
18081 70782400 68553750 72637207 85430927 106948274 122482333 112841540 91283175
18074 91283175 73649644 60944187 51739996 44893205 39616079 35246511 31459366 28164046
18066 28164046 25384338 23175169 21462865 20048460 18836170 17708068 16430453 15028971
18058 15028971 13712845 12616399 11733524 11061449 10561088 10167528 9890655 9661368 9389372
18049 9389372 9234331 9335747 9794113 10760700 12491566 15674954 21352298 29460895 34577554
18040 34577554 31271654 25068964 20339949 17113781 14989190 13879097 13867763 15271206
18032 15271206 18516631 22119958 21927288 18295107 14890532 12411552 10651765 9351341
18024 9351341 8308879 7356710 6504915 5808124 5271677 4846521 4548264 4337080 4140639
18015 4140639 3979758 3860365 3721974 3482554 3176345 2885071 2636758 2438552 2278589
18006 2278589 2151368 2057553 1947292 1831235 1732046 1673676 1631460 1580256 1552134 1549143 1556866
17995 1556866 1575117 1567228 1531757 1445140 1348239 1258833 1181874 1125075 1100141 1131487 1170537
17984 1170537 1139968 1072511 976428 918603 884038 844486 802245 780100 777815 777571 766840 760322
17972 760322 771767 789162 818360 849747 852310 823678 814479 860230 896670 895544 845780 792683
17960 792683 759783 756031 791158 831937 867343 918426 984130 1019089 1027434 1073821 1152845 1248624
17948 1248624 1304678 1308103 1302703 1310509 1342529 1377839 1402167 1440340 1440467 1350394 1260999 1205310
17936 1205310 1211280 1242534 1216873 1139392 1070665 1027750 979566 944361 910392 859668 798264
17925 798264 771262 784339 800130 803176 752249 706570 702134 710110 682639 632198 578578 577414
17913 577414 569650 571377 553845 559609 563493 581034 559258 535711 529740 556709 626223 692502
17901 692502 704921 706439 695738 680910 683201 733532 785186 788993 757017 731853 735566 737918
17889 737918 721339 690149 665796 650720 646821 615800 558588 522108 499347 488085 480142 472173
17877 472173 455852 464843 468027 466883 478725 502871 515664 538380 577265 618367 696244 838884
17865 838884 1097638 1499643 1859123 1910152 1748851 1665097 1806865 2136548 2389623 2303056
17855 2303056 2023520 1754213 1495868 1245056 1064219 947596 850954 770809 714035 664854
17845 664854 633757 600305 571800 540057 517530 489923 464780 433006 394272 371233 356411
17834 356411 340879 330188 314089 284781 268473 253821 239657 232392 211517 189631 206231 214932
17822 214932 221017 224995 215708 204976 198876 185392 180324 184484 191213 191678 182952 179706 176269 170774
17808 170774 181216 185557 182933 177646 187266 187674 188014 183636 169380 158703 150851 146650 153345 176003
17794 176003 180471 164923 163851 162777 155543 142743 139834 144937 135810 136976 143598 148637 156669 155569
17780 155569 140511 143520 130768 128890 131555 151560 144922 144972 137359 125086 116819 126184 144298
17767 144298 152081 162059 164865 165997 168353 166546 181078 186156 181677 193893 209638 228387 256078
17754 256078 256898 271839 292245 309659 334927 339175 340783 363090 391950 405324 404376 417680 420511
17741 420511 422232 411440 402408 393782 381828 368632 373410 344315 302520 285053 275881 271733 273687
17728 273687 256877 241753 223421 222718 207870 187692 174469 158979 156003 165067 175306 174185
17716 174185 166101 158161 141616 120735 121993 135536 137296 144927 154298 161020 155643 160589 164043
17703 164043 187259 203478 205977 209859 214238 228172 247347 255238 241951 222441 208813 203013
17691 203013 208532 226451 233655 220923 216667 210461 216884 230687 260661 317363 376262 453044
17679 453044 536589 554354 498029 442808 404260 400112 418270 457530 509097 546348 516133 437961
17667 437961 389298 351001 307888 272036 241541 218256 195283 180841 182829 186021 178076 171741
17655 171741 178162 172769 156513 137631 126554 118134 113177 125748 141281 143008 140284 143768 173027
17642 173027 187632 188374 200821 239051 278959 312834 384778 509460 695127 869238 920786
17631 920786 867795 827495 831514 924291 1075526 1153949 1103137 1010568 905640 808101 742382
17620 742382 704505 718333 746906 709596 625299 543083 474381 430655 392663 353455 323110
17609 323110 291952 289770 293492 281103 255943 224556 208797 185911 179014 178348 181225 189286 171102
17596 171102 172176 197855 223309 226173 227614 245303 288579 366307 482900 599779 673405 724991
17584 724991 800803 851730 913881 1012463 1059962 1026247 982892 930286 836749 744472 665927
17573 665927 631940 650712 648778 590020 496187 414953 358758 329981 312509 278396 247292 220084
17561 220084 202866 200559 193373 185496 164932 162554 153436 144667 143850 134514 124402 135165 157885
17548 157885 164492 172957 193334 210025 244060 293181 331682 356069 394568 459779 554497 585013
17536 585013 553749 505831 466655 457638 493799 514753 475221 399274 323071 267782 227402 200491
17524 200491 192734 201213 201303 201612 188871 178598 167276 169108 155078 142648 144484 154008 149724 138677
17510 138677 128919 112887 107184 107383 92360 74460 74380 85954 94681 110206 106091 98210 66425
17497 66425 54937 78552 100393 100052 97298 77025 49168 39007 49709 47283 21056 -23572
17485 -23572 -56791 -47690 -29981 -50676 -86706 -135180 -155040 -135287 -89740 -43085 -44042 -64085
17473 -64085 -82841 -74340 -38780 13637 54404 62196 66461 80150 81055 92434 111948 113493 113927
17460 113927 112636 121431 121393 128215 128682 114268 107639 106609 111670 116777 126132 125452 130792 148015 163645
17445 163645 178086 199594 209809 201857 202750 234661 276666 288527 264473 237011 216758 213803
17433 213803 198949 185162 173402 169611 162677 150528 161627 182062 190965 180770 161860 163054
17421 163054 166182 186187 194110 182285 207068 245514 250499 257205 276099 331474 374330 372377
17409 372377 374725 378187 368640 385065 393560 387955 390280 412416 434388 472293 527858 573149 621035
17396 621035 683149 774492 897246 1008779 1149080 1341714 1634703 2137408 2967900 3970107
17386 3970107 4466657 4172523 3744148 3645991 3997161 4661943 5047682 4650516 3969437 3512144
17376 3512144 3373116 3559380 4115265 4897261 5251694 4847516 4304562 4102383 4341423
17367 4341423 4915811 5190468 4623859 3775560 3109245 2623501 2271440 2005872 1809204
17358 1809204 1667737 1546257 1442655 1353625 1291360 1232436 1183430 1179586 1157854 1105718 1062766
17347 1062766 1048336 1035636 1042787 1031800 1002868 974822 946869 909643 904178 884090 840056 800003
17335 800003 793665 798279 795646 787701 800265 859447 956780 1039491 1122938 1194854 1309428 1447900
17323 1447900 1580053 1716171 1844143 1973816 2146947 2358017 2564588 2815750 3140465
17314 3140465 3588033 4221439 5075642 6070356 6899927 7478424 8268567 9436653 10748807
17305 10748807 12038313 13158230 14171798 15511209 17231276 19010546 20810311 23172461
17297 23172461 26491357 31033472 37292411 46039329 59185442 81074950 119630548 183657024
17289 183657024 258661087 290729364 267248004 241462681 242477403 273579513 314802036
17282 314802036 311469358 255586431 197103373 155087462 125495667 103939460 88577727
17275 88577727 77510072 69116270 62738859 57510211 52971610 49184370 45835540 42868498
17267 42868498 40278717 37164589 33393262 29817094 26860680 24578986 22601053 20440223
17259 20440223 18154455 16084071 14389703 12982671 11717868 10633081 9706215 8895676
17251 8895676 8169470 7505299 6906799 6387283 5942374 5544721 5151916 4791495 4462124
17242 4462124 4157651 3888732 3621695 3360680 3125520 2915094 2696470 2482956 2271332
17233 2271332 2069702 1907378 1768469 1641583 1543958 1457911 1352937 1250315 1180716 1113457
17223 1113457 1075057 1034791 986529 932584 908721 889301 857387 813181 767490 720279 707009
17212 707009 684214 647597 627813 599790 571793 556175 533129 497583 471996 449708 426116
17201 426116 414449 399928 387854 372979 364908 362748 355548 342818 320966 305064 310146 322016
17189 322016 319979 297640 285062 276157 258439 248193 244236 236794 235909 232869 217192 212561 214287
17176 214287 211930 224648 236446 248895 254473 274939 286820 292074 290019 299559 325805 351999
17164 351999 336539 304083 274275 257577 288054 332990 345979 313396 273802 251369 276982
17153 276982 316393 322094 299355 263617 272473 291523 280878 258157 239938 246536 249106 267614
17141 267614 277131 262603 242934 232104 216308 214968 222535 221983 213342 205853 209090 195013 175208
17128 175208 177545 183139 201568 205727 202380 209084 197799 195978 196626 199293 202891 200902 191742 193604
17114 193604 199422 206701 203049 174912 158373 159284 166774 153340 135980 137113 128697 127602 121984
17101 121984 112201 120379 138147 185748 250233 270789 248981 234367 273294 335924 373747 340822
17089 340822 280838 265126 284935 297768 280013 242534 199647 184172 180690 180850 177838 150849
17077 150849 122706 123420 122183 124731 127347 136441 133918 132765 125220 119020 121140 127540 126281 116272
17063 116272 119725 119256 107646 102298 123912 152603 173653 168303 161977 166514 182983 200331 198918
17050 198918 162469 125466 113096 120112 112672 113115 97295 71936 76520 91860 110088 117460 119665
17037 119665 110841 96427 88782 68919 63277 71716 88803 86980 71771 64550 70590 93295 112881
17024 112881 134844 111523 94202 89731 95569 101030 97459 97638 95643 94330 91100 91802 91868 96766
17010 96766 103155 100539 85212 78944 87364 102135 100355 89061 83225 78318 66687 56883 63245
16997 63245 59562 59616 56215 50447 58193 55537 49423 40722 38975 54377 65607 58445 58959 81957
16983 81957 92441 86623 75342 82534 98845 96217 96312 91979 80561 77966 85511 94614 89389 67249
16969 67249 59971 59375 45691 44393 38602 32434 25956 25792 37235 44549 41951 41759 30653 19341
16955 19341 15719 18762 21601 34322 46885 47991 47037 58009 58968 49081 41475 41072 28962 24331
16941 24331 28391 27853 21792 25451 26832 8087 24178 33050 39039 43170 43694 25226 14461 3714
16927 3714 8761 31549 38943 33416 22109 19380 13457 14327 11694 16628 11297 -5633 -12194 -4861
16913 -4861 4811 19782 25841 19286 31490 26451 26101 24211 23739 25380 28793 30628 31204 31006 25395
16898 25395 10566 2165 6769 18016 17605 25327 37111 30079 19313 15937 17105 20724 32006
16885 32006 40497 45988 51089 38537 40914 49406 43618 41315 38332 48820 61327 57524 45620
16872 45620 34559 29741 25786 31347 19893 16060 6300 -9749 -5659 19059 19662 7360 410
16859 410 9239 15484 25045 32321 17865 9105 3798 -3926 6356 2096 4630 13983 16371 16632 4620
16844 4620 -6813 -22223 -20034 -10288 10776 3181 -521 6517 3484 -663 7178 10253 4374 -2069
16830 -2069 1327 14504 6860 -2667 236 21331 18544 -2117 1804 21852 34193 39962 38923
16817 38923 26107 20896 38022 51352 49494 40940 52748 49322 49163 51415 41062 33292 47457
16804 47457 60034 69024 62748 59389 57880 50458 59264 67627 58148 47131 43643 54932 55744 41889
16790 41889 34119 19360 1116 4557 4184 17387 23335 16373 13293 9855 10519 9748 6112 22188
16776 22188 23081 14873 9316 6210 6704 2275 2570 18265 8456 -6110 -3965 4838 11291 1958 -1534
16761 -1534 -7979 -2552 11702 12585 12606 29186 48326 43773 28431 27503 18929 18097 32859 26223 15963
16746 15963 6850 14173 35460 38928 25848 12090 13212 13973 12162 18829 23838 31417 40652 63535
16732 63535 77650 82650 89380 93620 92497 82561 75710 76230 87813 76193 77909 94182 104534
16719 104534 116871 135279 158867 177654 185386 205556 249736 327003 436424 640449 956344
16708 956344 1375941 1633170 1549261 1376516 1336770 1485826 1731878 1773641 1501611 1166569
16698 1166569 915012 737181 611562 530101 465543 415371 374859 340185 304760 279602 258772
16687 258772 240740 220030 201464 197185 171981 145231 127822 137094 129464 108974 99987 113151
16675 113151 103433 72595 51460 54645 53112 43490 49200 54077 43012 41352 38094 31339 25855
16662 25855 23186 7959 -2383 -1955 5796 18448 22546 11666 20749 28498 27818 26815 18323 17610
16648 17610 4298 -7227 1008 3209 -3707 -3636 3834 2362 7725 17545 10459 -3488 -2708 -556
16634 -556 -6538 2615 21362 23709 12521 8160 12988 15344 28317 33326 20345 16425 14113 10017
16620 10017 5986 5388 8289 23013 24821 20914 11668 -2722 -753 -7370 -232 7749 8908 4594
16606 4594 4673 9068 17482 28775 28788 23159 -466 -7694 -5442 3204 559 2683 -5897 -3058 17660
16591 17660 27577 26406 16961 2310 2239 15054 9656 11142 18071 10931 4771 -1741 -4750 515
16577 515 8039 5439 12898 24347 15034 -2955 -8429 -6692 -5521 4938 3135 -704 4959 6029
16563 6029 12814 22290 11356 3419 1719 -1250 -10104 -12442 -4066 5111 13458 21302 20310 1033
16549 1033 1195 12447 14024 15586 12772 11289 9917 13548 7971 3297 11865 13526 23439 12781
16535 12781 22226 21467 -8405 -17596 -16368 -3316 8209 -851 -10817 -14536 -9776 -5909 -15490 -10494
16521 -10494 3987 7599 753 6617 7091 7806 14425 18497 18390 12667 8390 57 -6753 3153 10264
16506 10264 6336 -692 9583 -674 -17802 -9504 3823 -7069 -17923 -18057 3444 6039 16895
16493 16895 25571 23486 8427 8794 11660 11951 12589 6154 23561 30882 30951 33709 41429 25493 23391
16478 23391 30228 22030 10583 -2792 10456 11334 -2414 -9484 -20831 -27218 -25547 -14388 -6460
16465 -6460 4110 4530 -5619 -9678 -11414 -2048 22380 60752 61559 53279 31182 11652 17852 23373
16451 23373 16757 16044 7701 10781 1908 29 -6525 4299 6335 -16201 -16405 -763 7261 7158
16437 7158 -4655 -22235 -14380 14004 18589 23863 37073 34155 23675 16015 18139 20436 12655
16424 12655 19977 29837 32248 17728 2648 16430 30152 25430 15505 20282 16436 1332 6380
16411 6380 4309 -995 -4603 -3435 15475 733 -18451 -23640 -14595 -3020 4954 6524 -772 -8004
16397 -8004 -17556 -14601 -12396 -5554 -247 -9897 -13376 -13302 -16723 -10927 -7297 -16770 -24680 -20435 -23465
16382 -23465 -6167 10018 13268 10577 6227 20375 22438 11368 -3100 6363 16011 17464 30575
16369 30575 25623 8043 7343 1323 -10130 -20495 -7525 3758 14192 15736 14780 6176 -6057
16356 -6057 -17013 -11804 -7903 -3154 -5852 -10490 -3374 -1236 -128 3769 -669 -4564 -3580 10022
16342 10022 16276 10098 357 -5129 3676 4700 -5935 -11761 -2985 940 7677 25094 31044 29102
16328 29102 23212 15902 13052 18646 14302 5467 -1422 2867 7487 836 -36 2323 8181 -5335
16314 -5335 -12149 7272 25344 17921 -4366 -16963 -15657 -15816 -1012 1736 -219 -12365 -13537
16301 -13537 -1486 -6632 -11060 -6995 -12364 -19705 5022 22255 28469 32537 22537 9412 -1722
16288 -1722 -3776 4026 4814 7705 8369 -864 -7038 -80 -4342 -14726 8064 24003 22810 13669
16274 13669 20207 7009 10490 30123 23250 12264 8427 10023 12574 5178 -4561 -5545 10911 10901
16260 10901 -4533 -5650 -12145 -29132 -25084 -10891 -1510 5527 9282 15370 4680 -2395 -2847 5970
16246 5970 4152 -854 7918 6158 1591 9565 10895 263 11584 10509 10278 8119 9476 16879
16232 16879 16555 21943 22997 8935 6216 665 -2645 -3057 -3823 1169 9910 2101 -2470 892 6694
16217 6694 785 -3761 -4276 17766 21575 3200 1547 -2811 -7893 2552 6289 8367 16371 19348
16203 19348 21182 15332 -1932 321 1278 2240 2924 -12497 -17459 -26035 -20813 6258 13730 -5781
16189 -5781 -14906 -19792 -9849 -3817 10689 8565 -2893 -5327 550 20671 39927 42609 35347 19448
16175 19448 7800 306 -9364 10813 25603 10925 -8658 -5834 -10901 -142 4976 -3662 -5707
16162 -5707 6815 2654 -13296 -17029 -12743 -9969 -1938 10596 18115 24209 24703 25490 15217 11306
16148 11306 12557 12246 21239 20624 12126 17821 17634 20207 24016 34641 23506 22626 23296 8452 7151
16133 7151 -4162 -13468 5085 3105 -17166 -22586 -14348 -11943 -9275 -3473 -1470 -18522 -28943
16120 -28943 -33091 -28033 -25289 -31572 -21417 -23226 -31619 -34476 -28399 -20000 -5065 15920 31162
16107 31162 7120 1122 3058 -4401 -9210 6121 26143 31147 31451 12022 9760 12718 9120 17066
16093 17066 4458 -13184 -10588 -16109 -8370 4605 15190 17822 17581 4115 437 7792 12065
16080 12065 11040 5681 -4725 184 6484 17755 27913 14572 167 -6218 -26163 -25923 -20230
16067 -20230 -9745 -5290 -1274 -5152 -2350 -733 6281 10344 3996 -1091 -747 -14417 -36505 -27049
16053 -27049 -16616 -9384 -14015 -35472 -24766 -6577 8734 3491 5615 13720 11385 5934 3259
16040 3259 179 -15605 -15624 -5122 -6104 -10548 630 3925 649 4160 5376 10076 3927 1939 1168
16025 1168 342 -4132 1803 7654 17757 7957 4895 12223 21288 33853 26853 19016 6241 2950
16011 2950 7612 325 -1670 -417 1479 -127 6099 8159 -10145 -10379 -9702 -7916 -8023 -2731 7750
15996 7750 1261 4723 9145 3084 12629 18332 -2299 -860 5254 16802 14514 14208 8668 4078
15982 4078 6088 15089 10717 5007 15457 19460 17084 16001 8297 11453 6900 10402 15050 14314 16968
15967 16968 14347 20603 25724 19602 7260 6672 4331 6977 -1992 -43 9476 13690 13733 12208 15293
15952 15293 11597 2175 -585 11599 15314 -4283 -4073 2511 15917 19181 12237 -1901 -568 1437
15938 1437 -3272 7821 8507 306 8315 1711 -799 6965 18893 12686 16511 7752 6732 7004 5717
15923 5717 7816 12084 21040 28005 21348 11985 12359 6096 11375 28928 36105 23771 11550 13168
15909 13168 13030 18745 16135 11940 12075 25213 41692 40377 32366 26011 5639 -5459 -7260 -1045
15895 -1045 9464 16581 22597 1540 6847 -7354 -12011 1126 412 -11980 -20674 -12822 -10601 -5486
15881 -5486 -9867 -6088 -6780 -5263 1516 -5506 -10875 -5442 6250 10730 7963 -3590 -3122 6703 25709
15866 25709 29116 21156 26491 17113 17220 16897 12459 5445 10926 6248 -13379 -17819 -6551 -124
15852 -124 -12475 -10705 1065 1360 -2580 -161 8282 9640 7826 9790 7678 7767 11607 3459 8655
15837 8655 13485 7281 1923 10279 5489 -12518 -13889 -8113 6258 17493 14953 10584 13818 25213
15823 25213 20743 12089 4154 -4870 -3594 -4096 -11111 -13631 -3791 14418 22838 14715 13814 14692 7411
15808 7411 7361 9655 14102 10708 -5238 -9484 3937 9330 15335 12053 13260 22757 14280 906
15794 906 -1080 995 5688 761 1914 -9502 -7773 5068 18189 10919 10015 11498 -2926 -13870
15780 -13870 -19988 -6779 3953 10595 13619 10548 8228 6712 -3146 913 -8593 -2962 14683 16559
15766 16559 6878 4455 1088 -4458 -6269 -4385 2016 -3840 -18916 -20149 -11404 -16642 -20629 -20663 -5795
15751 -5795 3741 6249 8346 -751 -963 12454 24950 19872 16171 14422 12384 10942 -3031 -10221
15737 -10221 -15203 -14388 -7054 -19397 -28493 -22985 -12464 -14100 -6809 5166 11161 2970 -495 3820
15723 3820 -6937 3945 15135 8172 -292 -1288 -445 8033 6483 -290 -9133 -12919 -3553 602
15709 602 -6291 -11363 -1830 -3585 -3290 8874 14882 14001 3765 7152 3094 -6858 -9455 -2864 -14570
15694 -14570 -14903 -4641 -1228 -10649 -8756 -1094 3087 6312 4831 9815 18304 12091 10251 6337
15680 6337 -7583 1269 -2356 -1130 -3167 -9163 -11337 6555 20953 19412 15965 15760 115 -5520
15666 -5520 7550 1194 3825 14022 11019 8422 9832 7504 12999 15635 15209 15939 9192 -4230
15652 -4230 -6725 -1527 9094 16266 11970 12142 7139 3335 3504 708 10570 14379 14858 7410 -2419
15637 -2419 -24292 -39753 -33516 -23072 -16396 -8232 -8511 -6707 -11006 -16599 -14531 -12931 -5453 2
15623 2 -5184 4243 11026 6436 3149 1437 22442 36286 28158 24467 11492 3663 10845 6495 5195
15608 5195 8802 12862 8559 3262 9062 22893 26645 28449 23544 14324 8352 149 1323 -1684
15594 -1684 -1706 -913 -7360 -11287 -22862 -7574 13746 17929 23992 31605 24822 23238 12440 13552
15580 13552 8109 15357 6665 -6419 -3249 9722 17618 9556 -1529 -11075 -5903 -5926 -10291 -9309
15566 -9309 -10650 -7181 -1993 -3019 179 -1020 -11165 -10337 -7242 -11050 -31564 -33441 -21542 -5338
15552 -5338 9173 625 -6875 -5349 -1659 5431 14795 12514 5677 9196 6040 1219 14331 18693
15538 18693 14362 28616 23429 2286 -6242 -6071 -12020 -8339 -5258 -91 20562 15100 3081 -5519
15524 -5519 -8400 -9231 -9978 -1862 -6396 -14690 -12323 -17031 -13400 -6875 -8734 -14874 2486 14702 24156
15509 24156 26408 15565 -3289 -3951 699 6868 17690 14386 -1391 -12291 -13386 -719 4922
15496 4922 -5315 -17450 -28048 -23900 -15695 -13222 -2625 2562 -3660 -9331 -8305 -13992 -16358 134
15482 134 18514 11905 10893 4426 12759 14048 6104 -1208 443 10466 5090 -11194 -10793 -3450
15468 -3450 7408 664 -10266 -7738 -10265 -18489 -18100 -10600 -16312 -22347 -23337 -15135 -1742 4606
15454 4606 -9733 -18086 -22549 -18234 -18732 -2907 4402 -4706 1527 12480 12068 520 -9601 -27666
15440 -27666 -37156 -34155 -22227 -23278 -24230 -15954 2244 14924 17630 21171 12828 -8335 -7384 -3981
15426 -3981 -368 12338 13389 14275 17856 23505 16256 2967 13334 19612 12198 5408 8355 5901
15412 5901 3993 3530 6641 11327 14324 16978 10435 14645 17780 19839 18588 9462 6659 9067 9518
15397 9518 4247 -9473 -4583 1322 -5078 -13162 -11747 -4614 -4544 -60 -9418 -25801 -19601 -13087 -9841
15382 -9841 -18349 -8277 5292 10610 2835 786 2549 4753 -918 8953 11576 12225 21187 18813
15368 18813 13318 4590 3219 -2213 2682 -401 -5147 -2543 -11057 -9846 -3795 -1714 -3882 3312
15354 3312 -3409 -9078 -6919 5264 3192 -5372 -7013 -2819 11646 20977 13049 -5491 -2953 3910
15340 3910 3368 6579 8425 10715 4734 2304 4302 -4779 5287 -4941 -14755 -9864 -4120 -5907
15326 -5907 1577 4710 -7665 -9213 -19068 -21276 -12715 -3421 1027 2365 8802 17453 14696 3389
15312 3389 7960 10697 16603 16289 10609 9093 4923 6217 9725 5867 8592 3288 -15267 -10994 1545
15297 1545 14858 24161 18616 14882 14646 12147 19895 16035 9423 7629 1670 -12518 -18689 -21492
15283 -21492 -9231 -2636 -8826 -542 7441 8768 12378 12271 15864 18761 30090 24554 8030 7185
15269 7185 -2489 -11823 -9692 -4314 17008 22228 12945 2733 -1038 22960 36434 42141 21590
15256 21590 -6885 -10763 -4389 10139 5997 10055 13224 18097 13985 13475 15919 15304 21753 21191 17020
15241 17020 7159 2645 -1502 -8651 -19207 -6613 438 -6571 -10799 -11173 -8869 2786 13233 12761
15227 12761 3838 4655 10708 5278 -748 -5455 4927 14874 2751 -6566 -2108 -1894 6142 15886
15213 15886 19258 12522 8598 13574 25223 42231 37650 33862 25661 16321 5085 -10728 -10095 -9848
15199 -9848 -18343 -12922 -9614 10753 18856 3852 -14200 -18094 -4943 -478 -7832 -6643 -541 6370
15185 6370 7917 8488 1576 -2576 -10152 -11226 4613 -1685 -8122 3805 17809 12342 -852 -4770
15171 -4770 -591 -3840 -289 -3971 35 -2207 -8988 -10692 -7109 8696 15574 5602 5603 -2471 -12694
15156 -12694 9389 10918 4376 15081 9897 -550 -6245 4995 23987 12957 6529 7123 -2828
15143 -2828 -12540 -14199 -15290 -15385 -23281 -13427 -6321 -6374 -12622 -13729 -268 8656 15264 12009 18665
15128 18665 23295 23407 16297 -653 3362 -2348 -7690 -2246 23356 34723 25139 16507 20291 16901
15114 16901 23119 22293 17567 5180 2998 10189 14807 -7244 9052 15580 16245 11625 1847 2259
15100 2259 -3195 7910 16303 13366 -899 -1237 960 -11519 -13187 -5608 1803 8920 6364 15329
15086 15329 12300 -5257 -5966 -13829 -25506 -27814 -21562 -15748 -12316 -17926 -12494 -11300 -5940 5360
15072 5360 3076 -4785 -18104 -19408 -17990 -5364 -3219 -7276 3903 16492 28507 29837 26367
15059 26367 20597 17092 18358 21645 22214 21102 16386 8096 -3990 1272 8894 7108 8370 5029
15045 5029 5016 14181 12928 16905 12124 -1461 -3100 -17750 -20860 -18837 -18417 -22509 -12098 -14638 -14726
15030 -14726 -17796 -21975 -21220 -15347 263 12979 5909 -9581 -9374 -1923 -4934 812 14489 13879
15016 13879 -2861 -8009 -8088 858 15133 13269 9263 18737 44389 82375 131670 204641 245666
15003 245666 206812 153164 117336 89731 75871 56719 42367 28710 22294 26429 22799 28310
14991 28310 27296 15477 9187 14501 5110 -9134 -9197 721 -1710 -6895 4511 13265 3878 14018
14977 14018 21688 25040 29851 31555 25024 18847 4627 3330 8434 6813 6790 7034 11366 5195 -13900
14962 -13900 -10021 4123 4287 10698 22818 22926 26657 33415 36251 20882 5318 -6906 -3333 -4607
14948 -4607 -9491 -24994 -25190 -9909 9626 14322 10169 718 -11220 -15639 -5975 5970 1238 16330
14934 16330 14884 7191 5111 8000 10238 6792 -3149 -5066 -7264 -11708 4185 -25 -14324 -14464
14920 -14464 7551 5682 9642 1817 -2633 1502 -7452 -12251 -5592 -7292 -11377 -7022 -6347 -11358
14906 -11358 -5872 1445 -7032 -5371 -12206 -14054 -10466 -1375 -1167 -2148 -201 -1957 -1608 -26001 -14855
14891 -14855 1140 6357 4662 9581 18294 13205 8920 3941 -4315 -834 2285 3016 4951 -3461
14877 -3461 -5865 2431 5299 14367 23827 26953 12977 16026 14775 16612 10320 -4440 -8300 796
14863 796 7430 7300 944 -13369 -17613 -20030 -16682 -15858 1443 10406 14081 6674 7758 1724 -159
14848 -159 4173 -1215 7288 2272 1473 -6392 -9108 -20922 -30285 -28302 -24436 -12833 -5438 -7002 -17970
14833 -17970 -4964 -5996 -6861 3225 15670 17058 16912 9636 1968 3725 9906 240 -403 1922
14819 1922 1621 -8805 -10428 -8526 -9259 -11559 -9053 1048 -5240 -6930 4408 12908 13148 16193 13219
14804 13219 26598 37326 15031 797 -680 -151 846 -8 -2612 1821 -1729 5538 7317 -4921
14790 -4921 -1346 16158 25562 16162 3950 7202 -4002 4202 18729 23989 14551 -989 -7857
14777 -7857 -21382 -12251 -14139 -20127 -18482 -9820 -13493 -14767 -4545 2911 -841 -5808 -8835 -17026
14763 -17026 -8053 -5379 235 -8709 -7475 5563 3895 2764 2780 -2369 -14355 -16029 -15045 -1087
14749 -1087 1151 -8922 -9998 -3708 7805 -2009 -5133 -6848 1534 16567 7532 -6611 14029
14736 14029 34381 23163 26289 13386 15409 6853 11219 7148 5899 7750 6353 -3833 5381
14723 5381 25770 22667 27425 8891 532 7108 7434 10938 22404 28052 16616 11531 11679 8087
14709 8087 7400 6301 -3055 -6259 -2897 -2318 5721 11903 -1004 1160 -2411 -6150 -2165 -9572 -15508
14694 -15508 -14395 -7602 -9296 -2373 5120 2293 13224 13993 7417 2365 7726 12243 -1649 -7950
14680 -7950 -5704 -8741 -902 6094 -14497 -23210 -30094 -27408 -23495 -19579 -21805 -19431 -12248 -12144 -7764
14665 -7764 -5120 -580 -4465 195 5805 4191 -897 -16533 -12743 3326 12773 -55 -16514 -15417
14651 -15417 -13076 -15170 -22829 -12556 -7063 -6825 5540 16940 25969 24551 26182 34161 9558 5606
14637 5606 14321 11499 15178 21870 20086 13021 9817 5982 3410 -5014 -3194 1763 -9261 -12173
14623 -12173 4838 16810 19647 12202 2236 -152 -3527 3993 6521 6423 -2774 -25228 -23746 -11544
14609 -11544 -2752 17781 43534 34795 25220 19508 20371 6263 -13810 632 15584 20064 9339
14596 9339 3469 3082 -969 8087 17986 16384 16022 14755 12114 13752 6466 5187 8750 10471 16625
14581 16625 13953 496 -4222 -3980 -2169 -1085 8397 5590 1674 2690 -2241 -9018 -14325 -12435
14567 -12435 -11922 -12431 -24397 -32368 -14671 12369 8698 5045 3754 -8137 -4213 4634 7750 4059
14553 4059 -8548 -12767 -11171 -7711 -12965 -6235 -6503 -10916 -9451 -10200 -13648 -13091 -5306 -9720 673
14538 673 9503 12744 13449 24154 30589 19317 16921 25578 28430 24155 15999 10047 9204 16344 21626
14523 21626 17894 13380 9569 5286 7906 13953 18193 8238 -1806 -3379 4907 -2690 -7866 -8413
14509 -8413 -9290 -5198 -5427 -4695 -4545 -3163 1708 5472 -2284 76 15157 16130 7125 6760 -6260 -8432
14493 -8432 -5683 -6735 -28098 -25758 -9990 11479 10641 5203 -2002 1000 -6557 -5014 7906 11803
14479 11803 10705 21047 21009 18574 23917 23109 13038 724 -4051 -9034 -11451 -29040 -28678 -19542
14465 -19542 1935 10903 9875 6861 17851 18407 17638 18974 17511 7775 -1486 17338 33468 21206
14451 21206 2130 2178 3102 -3322 -2131 10740 -924 3334 -4876 -12516 -15217 -10718 553 4807
14437 4807 -17212 -22999 -18564 -5629 -3701 -8557 -13014 -15013 -21977 -35549 -32402 -22878 -14093 -6986
14423 -6986 -7153 -1238 11100 22890 16412 18886 29154 19434 14098 10835 14567 18150 15958 15637
14409 15637 25011 26191 9035 -7940 -12594 -4418 179 5386 9648 -5195 -8761 -5453 -13073 -19228
14395 -19228 -20337 -16712 -1915 11609 -3173 -5719 -1807 -2450 -4013 -4742 -10001 -19198 -15586 -6815
14381 -6815 -6652 -16759 -10049 -2080 -1245 -3477 -6620 -15171 -30116 -19812 -14509 -27439 -24016 -26257
14367 -26257 -11620 846 2166 12618 10917 26050 24369 5109 3049 14254 9285 446 603
14354 603 1337 -677 -7964 -7813 -1552 10369 22139 23026 22159 19724 4645 -886 -3761 -3286 -18189
14339 -18189 -22493 -21187 -5813 1448 -1802 877 13935 14882 19479 10509 5855 -5466 -3083 2399
14325 2399 5312 -9694 -15142 -3558 -204 -7361 -899 -957 -17645 -12882 3226 5514 -5585 -17463
14311 -17463 -11066 -2852 -6939 -1433 11663 6820 19543 12096 7529 10926 10793 -8260 -10969 -13965
14297 -13965 -12857 -24781 -22272 -7651 -2889 -5649 -14132 -7632 -11344 -18029 -14802 -4629 -12181 -18050
14283 -18050 -20014 -27827 -28831 -35297 -23314 -23627 -25252 -20456 -29134 -19022 7028 21853 15947 3426
14269 3426 -7127 -8221 -10132 -13520 -23230 -22399 -16004 -8237 -6812 3652 5471 19066 19470 3487
14255 3487 4503 -8357 -25815 -25054 -13246 -13280 -21071 -21705 -14611 -9796 -9598 -23257 -34586 -25609 6754
14240 6754 9772 -8583 -17716 -708 9835 2367 6102 3674 -4370 -11737 -5712 -1341 -3766 -18982
14226 -18982 -24352 970 7505 3658 -7049 -15894 -17854 -9882 -8488 -4250 -1500 -16875 -24967 -21176
14212 -21176 -5887 -865 -2970 -8738 -8879 -6473 -5497 -4257 -27 -7607 -6590 5153 -961 -6619
14198 -6619 -5968 8254 10181 7948 14029 8176 4253 -2462 -11179 -13545 -17319 -25202 -10028 17419
14184 17419 22474 -4862 -6157 4948 3954 7032 -904 -12366 -12077 -18233 -7011 14172 21621 33448
14170 33448 32111 24929 11613 3556 12600 17110 17725 14676 10752 2201 -8476 -14777 7005 22761
14156 22761 11319 1981 3127 -10134 -17300 -9050 661 10226 9890 -4584 -1292 6317 14361 3758
14142 3758 -7336 -5613 2152 5108 18748 19773 826 -6921 -9718 -13996 -12226 -7772 -2539 159
14128 159 -3079 -8415 -7796 -6487 10333 9974 8539 5549 1292 -3502 -7273 -7471 -18366 -10078 1564
14113 1564 4484 523 -3676 2327 4415 -2517 -1699 -1912 -6614 -17630 -23579 -8169 -3212 -3975 -6094
14098 -6094 -14197 3065 11859 12460 16453 6571 10022 9614 -3153 -17113 -21996 -15802 10294 15278
14084 15278 14438 -596 -21129 -13717 -5332 -7699 8655 22600 27205 10026 -914 -16782 -21609
14071 -21609 -24263 -7869 16542 22069 13099 17284 10105 9167 7287 10615 10169 18637 -1105 -12440
14057 -12440 -12966 2330 15774 2189 3764 7345 -7627 -14373 -8790 -2607 3819 14646 20606
14044 20606 6492 -6325 -2809 -1775 -9504 -17386 -19951 -20498 -10881 -17092 -24399 -9185 3457 3319
14030 3319 19593 14056 -1588 1763 -344 -10232 -22453 -21129 -20622 -7965 5930 1254 11948
14017 11948 19352 15405 12909 13574 27565 23755 10282 8294 8426 3060 3237 -1008 -5670 -16060
14003 -16060 -13315 7995 16239 426 -16396 -13657 -12415 -21703 -14388 -5102 -7900 -884 14291
13990 14291 5589 -11676 -18264 -12799 -411 -4748 -1724 12433 15974 12107 10219 5301 -597 1116
13976 1116 -3593 7770 11455 3903 -947 3119 -822 -3523 -11780 -32341 -32783 -6263 7134 1467
13962 1467 174 -9236 -11154 2505 8804 7284 16422 5965 -11977 -18954 -8030 -713 4921 3178
13948 3178 -3353 870 1103 -9283 -18166 -17315 -8698 5952 1236 202 3170 5900 11069 4007 10582
13933 10582 18834 31079 32364 18100 14207 4534 226 2563 9107 16517 16942 5850 20312 29209
13919 29209 37292 47326 56737 38052 17807 17219 4133 -6313 -10269 -10985 1689 15863 15857 12742
13905 12742 12320 -7620 -8657 1328 12539 11286 1646 -595 1701 8783 9644 4109 1323 -9711
13891 -9711 -14623 -17747 -12239 8554 16933 11187 6227 4051 5313 10438 21033 27174 33265 12900
13877 12900 -2288 -6135 -2202 -14298 -32020 -36532 -20734 -2412 -339 -6819 -9669 -9163 16411
13864 16411 17633 19714 11016 12142 20591 12020 -3520 -6133 -456 10585 13810 6846 3692 530
13850 530 5707 2864 1278 -538 -13223 -5928 -7124 7780 21348 18927 17430 14264 5152 -7948
13836 -7948 -15504 -29260 -28052 -25123 -16767 -6944 -4567 -11077 -19548 -13273 -4740 -6080 -9295 -5742
13822 -5742 4829 704 -10514 -11845 -14299 -25490 -18423 -6959 3425 1297 838 -5155 -5268 514
13808 514 2148 11728 23233 15845 23202 7001 1784 -11116 -13810 -6507 -11147 -17370 -13058 -8835
13794 -8835 -26197 -36392 -22417 -2621 -2906 -10445 -7913 -3981 -5202 -9500 -12252 -2590 -6134 -16606
13780 -16606 -19293 -7209 -16789 -14267 -11616 -8960 -17876 -24814 -17876 -4481 9349 8983 -1823 -8662
13766 -8662 -6625 -1214 -5690 -13355 -6718 -6171 -7290 -3566 7911 6742 10161 18992 11532 -2259
13752 -2259 -15036 -15158 -18483 -21011 -22830 -15968 -5230 -4975 -13596 -19664 -17693 -15123 -19884 -19679 -6581
13737 -6581 -4286 375 5896 4832 1708 3790 9155 18821 14065 13688 17811 6946 -3670 -7831
13723 -7831 -4943 -4015 -7959 -13291 -8836 -637 7322 5581 -659 -3180 -10175 -23289 -7448 4308
13709 4308 10095 14051 15503 33623 33541 24956 17700 16308 13790 5525 2671 1011 896 10842 -4985
13694 -4985 -22310 -7408 6226 9408 4728 -14179 -18551 -13663 -8751 -3485 5453 8765 9647 1658
13680 1658 3359 -5076 -11889 -4153 -286 -1381 -5078 -5649 -3907 -8105 -11878 -22060 -19125 -10657 2242
13665 2242 15532 13156 10127 4569 4198 1954 15459 18556 21222 13464 -6947 -13577 -5141 15566
13651 15566 5930 -16015 -18154 -22535 -26446 -18640 -22695 -17786 -11699 710 16664 14404 9299 4174
13637 4174 5429 20786 14048 11175 -2519 -4515 4872 10100 3083 5925 15067 2951 2702 586
13623 586 2847 5177 6114 2639 12018 13110 -2915 1108 -82 -1211 -293 -9349 -15157 -1713 6500
13608 6500 7380 -3382 -9449 -15682 -11457 -9355 -23228 -15939 -6280 928 4545 3180 7252 4782
13594 4782 11285 19738 13191 8819 2340 -3129 1578 -5447 -25448 -35110 -17667 -14988 -12880 -5391
13580 -5391 -6173 8713 21343 17556 13404 2768 -8561 -9732 3031 2927 -5550 -15570 -20797 -14499
13566 -14499 -4570 8307 13855 13054 10896 10953 18838 18431 24335 22005 14884 17725 21004 8670 2415
13551 2415 -11030 -16494 -13426 -11046 -4310 -3269 6144 13403 20107 15831 14713 10840 19356 17318
13537 17318 19710 14431 15343 12812 4575 -7649 -16623 -2295 2100 12885 21335 13363 -475 -538
13523 -538 -5859 6615 20604 22652 20124 20892 15273 1902 -17076 -17551 -10105 -3649 -627 509
13509 509 -3501 4308 17250 11870 -1342 -2895 6837 12113 8135 11289 8295 7149 12188 13740
13495 13740 11445 24952 34726 39047 26709 15099 22640 12140 3801 11945 9741 6810 8791
13482 8791 1372 -15463 -26803 -31071 -34210 -27359 -9846 -16027 -8316 -7877 -23947 -22637 -7998 -19048
13468 -19048 -18149 -13937 -7333 -4350 7517 7107 10407 -2685 -11978 -11512 -5134 365 -1393 -1192 -1558
13453 -1558 -13107 -25194 -22940 -17880 -17422 -16198 -17136 -20860 -10105 -1179 -1600 -3896 -3621 -13653 1773
13438 1773 19164 18851 18563 16473 16930 24497 28318 23131 21173 12269 54 -401 3281 -705 -3520
13423 -3520 -8707 -10724 -9043 -12501 -8726 -15736 -12878 -13377 -95 14892 18206 8935 1738 11326
13409 11326 16033 9824 -7648 -16903 -21814 -13738 -17237 -9132 5965 1000 5857 19865 16824 4739
13395 4739 -5196 -14144 -15366 -10283 2588 3604 5466 -864 -13141 -12415 -28549 -34168 -26285 -27768
13381 -27768 -17703 -3214 11560 18721 12856 -1631 -1246 -5453 -14630 189 -2166 -1756 -3050 -159
13367 -159 4441 10265 16341 28741 24658 10294 -3980 -8703 -7733 -191 -6254 -8229 -12957 -2865
13353 -2865 10702 20235 12848 3186 4769 2155 -2584 -3605 -13194 -20096 -28954 -32483 -22074 -20959
13339 -20959 -9932 194 18540 23763 9303 8118 1221 1146 21463 28807 25173 7626 3722
13326 3722 6282 15220 14525 6762 -17556 -11975 -3794 -7733 -15325 -16084 -18016 6227 12376 -4667
13312 -4667 -17195 -16884 -18905 -24229 -26435 -24536 -22876 -23678 -20521 -19011 -12963 -2533 8503 18056
13298 18056 14292 8340 1618 -5326 -7857 -2757 -492 -2543 2645 7512 13264 30275 21816 4288
13284 4288 -7766 -13654 -18706 -20789 -29694 -32544 -22324 -19759 -20729 -10724 -2185 4324 19503 23511
13270 23511 19888 21988 35559 21555 19394 18118 683 -3768 -4597 5323 17643 15180 603
13257 603 -6281 -1056 -8237 -17871 -8008 -151 6144 -1605 -7959 3375 7115 -5557 7258 17957
13243 17957 18836 18284 26996 27754 22499 22224 19906 16196 27407 33630 33859 23514 9704 -7637 -3568
13228 -3568 2812 -7391 -12069 -4833 -1784 -2798 -3759 -3641 -5690 12545 19553 19201 15973 5946 -6908
13213 -6908 -7577 -4170 -1622 -2017 11009 23548 16833 17153 20496 15855 22272 19587 17013 10349 6539
13198 6539 -4645 -7683 -22356 -30069 -28604 -11760 -9018 -17354 -13914 -3311 -8943 -12099 -12277 -20375
13184 -20375 -22032 -12701 -891 2330 -5711 -7954 -8661 4546 7812 3165 5539 1515 -5345 -9145
13170 -9145 -11963 -18846 -19329 -12236 -12493 -18479 -4493 -647 -7001 -8871 -2311 8500 9678 -1572
13156 -1572 -7424 -4837 -2394 4001 5052 -2224 -9296 -2738 2875 -4606 -10226 -10937 37 -6168 -15478
13141 -15478 -25686 -27738 -17618 -23109 -25340 -21638 -19016 -9109 -2812 -16857 -20584 -3317 11725
13128 11725 27542 32320 24154 15282 6665 4773 12098 553 -14532 -4722 -5093 -9629 3404 3989
13114 3989 8027 -3961 -15095 1202 8296 10518 11264 6611 -1090 -13397 -25678 -39379 -39180 -33064
13100 -33064 -35534 -36574 -22423 -14245 -9276 -16728 -17923 -19863 -6179 -10624 -15899 -16508 -23040 -13089
13086 -13089 -5404 761 -5235 -12660 -7010 -3904 -6044 -497 -6563 -11242 -10262 -15007 -6571 2225 12934
13071 12934 14574 2702 1404 1913 12819 9337 12859 16633 1594 -1832 -9939 -12603 -8940 5505
13057 5505 14061 13962 3436 -4056 -15301 -14267 -12997 -14198 -12900 -11941 -14254 -9681 -1988 886 -15463
13042 -15463 -13021 -4758 -12321 -27199 -36254 -38254 -26855 -19436 -10810 -3286 17867 11858 5790 3770
13028 3770 9284 10679 9459 -8420 -15137 -6914 -3955 -12080 -27284 -35572 -33409 -21421 -22448 -25909
13014 -25909 -29392 -18756 -7361 -22902 -30308 -27122 -28909 -24795 -10168 5261 10414 -7255 -11445
13001 -11445 -1098 -18255 -21730 -9364 -5220 -21510 -32079 -29094 -18136 -11881 1495 -2114 -8410
12988 -8410 -4833 945 18042 18681 -271 3493 5144 21221 19578 -8264 -7744 3424 1348 1396
12974 1396 -2342 -10509 -9505 -2348 -11342 -21116 -26631 -22708 -1565 8089 -513 -11950 -16936 -25823
12960 -25823 -25708 -18150 -13477 -10784 -5346 -8978 -9498 -3593 -601 -2003 -4673 -6693 -770 -1805 7437
12945 7437 19674 21916 22252 19104 19292 16943 15700 11804 -3393 -3165 6485 -11185 -23692 -24818
12931 -24818 -20991 -16261 -18917 -22566 -5433 5571 7416 9461 8442 1732 5569 13026 11396 11225
12917 11225 355 3663 23855 31936 15522 11086 19070 12100 1822 -18050 -20110 -12754 -19964
12904 -19964 -4350 -1892 -6733 4915 4903 -4785 6730 9777 14521 11838 9451 14882 13415 524
12890 524 1605 5233 12839 11264 7336 7796 4531 -1447 -10103 1409 11830 12798 20475 4496 -14471
12875 -14471 -6858 -9786 -9865 -11870 -593 1355 -12678 -11445 -3383 -6618 -20932 -26640 -21650 -28843
12861 -28843 -33290 -30993 -14409 -1387 -22007 -21756 -9815 9364 6260 6164 -2619 -11877 -19069 -14477
12847 -14477 167 17216 19823 11021 17858 29235 37501 41748 37107 30261 28238 24825 19566 7377
12833 7377 -121 -12970 -12104 -7340 7268 18364 17576 10465 9512 18259 22309 26913 17266 12505 21930
12818 21930 22975 15690 10785 20000 21649 6487 -9949 -20119 -14488 -5790 -1712 -2150 4289 5861
12804 5861 -1806 -4610 -15552 -12032 -12012 -18901 -11934 5152 16450 10656 -1815 -8631 -13192 -5777
12790 -5777 11288 23451 18354 3612 5430 8716 6824 5626 4004 11611 11420 2261 4575 -2624
12776 -2624 -10800 -13178 -10498 -8095 -11691 -6019 -9322 -5930 1874 16259 28621 38366 34671 29583
12762 29583 35488 52843 73908 78586 69529 69849 57004 43602 31534 23706 14638 17551 19841
12749 19841 14996 -3756 -22184 -6473 -7854 -5370 -162 17201 14889 9071 14009 7020 8829
12736 8829 28072 16419 5578 13578 13947 8873 -3574 -20039 -25545 -20316 -16851 -9351 -9750 -1769
12722 -1769 -3192 -13551 -5536 -43 6256 7396 369 -17409 -33161 -23124 -12781 -9484 -9552 -11151
12708 -11151 -16083 -7212 4720 -1339 -2273 -2873 4083 -2671 -13381 -15189 -10971 -9082 -14378 -8331
12694 -8331 13602 27384 26293 25479 18731 2533 -3928 8570 20025 15186 1085 -6065 4156
12681 4156 12887 1446 -11259 -13852 -11829 -26620 -23481 -15910 -19608 -11983 -7465 -8451 -5419 -612
12667 -612 5302 375 11654 17552 12374 13886 7754 -2280 -6248 -1158 -9755 -13120 -5365 -6565
12653 -6565 -2826 12384 5482 -4168 -7693 -7038 -11101 -5835 -637 -1333 2698 -3415 -7457 -2352 6228
12638 6228 -2566 -6875 -8351 -9567 -3066 222 6345 -2584 -17379 -18602 -29451 -22406 -18678 -12760
12624 -12760 -7255 -16705 -24703 -28240 -26965 -5790 5671 6224 5048 -7695 -19642 -12943 -3520 -11838
12610 -11838 6028 13856 6778 4294 3014 -3513 -6649 -12710 -10336 -1796 -9311 -4445 -8264 -5334
12596 -5334 -2543 544 11125 11632 4069 -950 -5158 -7582 -9417 -10558 -2079 -3221 -8910 -11304 -17994
12581 -17994 -18527 -11723 -9305 -1707 -2963 -13307 -32624 -30160 -21295 -15901 -16055 -15551 -3581 1146
12567 1146 8151 6412 7456 -6524 -12712 -3010 -7266 820 15309 19498 -2199 -19707 -16714 -10645
12553 -10645 -22773 -26952 -6685 8297 12540 6698 13927 350 -13762 -16262 -15424 -16060 -19568 -15839
12539 -15839 -7721 1164 -7628 -7513 -14504 -662 5573 -16486 -34038 -33583 -24578 -11872 -8524 -11943
12525 -11943 -20497 -8766 298 -6634 2489 7070 17355 23317 26173 14235 2731 -10362 -4568
12512 -4568 -868 1624 10786 14840 16121 27695 36495 26628 13937 6722 10457 17836 6326 4748
12498 4748 -5332 -2953 3103 -3916 -618 6355 1128 -10378 -18584 -24035 -2367 18444 9351 -9423
12484 -9423 -8545 12542 11928 13267 18907 18537 13797 -9062 -5188 -1046 3537 -3394 -4980 -6223 -9258
12469 -9258 -3977 4293 553 -10099 1928 5752 -2488 -16412 -11833 -1515 -2988 -17912 -16786
12456 -16786 -11534 -16613 -10638 -28304 -24138 -13092 -2810 -2469 -8722 -11279 -11243 -9549 -16793 -14448
12442 -14448 -6597 -4118 -2363 -6852 -11064 -5228 -2695 -5260 -6559 -3547 -6218 -4060 -14152 -30351
12428 -30351 -17669 -7614 -9930 -17615 -15189 -1513 11124 7846 632 -411 17950 10432 -953
12415 -953 -3383 -3875 -16311 -20399 -686 2616 -13552 -21887 -8443 -14997 -15694 -15076 -7195 2485 11590
12400 11590 7256 -10417 -11276 -4829 435 -10345 -20129 -16773 -7278 -1547 -1135 -3531 -13368 -1675
12386 -1675 -3649 -901 3876 -300 -1741 -5061 -3748 -16083 -23664 -19342 -6299 11494 2416 -3062
12372 -3062 -3006 -3393 -98 1830 508 -10343 -20742 -19972 3033 14489 11612 5096 -12035 -31879
12358 -31879 -40203 -32378 -12391 5306 23745 25190 14696 -3761 3067 -7546 -4683 5305 8805
12345 8805 -1168 -3530 6960 9812 3538 1917 -9651 -1169 6457 -17424 -30984 -18585 -10397
12332 -10397 -16092 -13996 8828 6667 1027 10977 4800 -5605 -1085 1038 5857 2522 -12180 -25891
12318 -25891 -18379 -1752 -3160 -11851 -3175 13077 21324 11408 5127 13739 25140 5013 -19840
12305 -19840 -23038 -18947 -9967 -12141 -3782 9885 12765 11063 7603 -8404 -16074 -22860 -4818 -4025
12291 -4025 -7482 -1397 -11204 -9070 -9615 -19224 -23991 -17110 -5628 -13249 -19485 -32075 -35472 -14097
12277 -14097 -4492 -8618 -21743 -23580 -16770 -10574 1128 4201 -1762 -7004 -8890 -8103 -4357 5886
12263 5886 -9280 -14585 -11286 -8610 -3965 4790 -6626 -313 -4015 -14170 -15285 -3895 -4359 -1096
12249 -1096 11257 20944 20614 22977 2883 -18416 -14276 -4942 -6591 -12977 -21456 -16411 3840 11697
12235 11697 1961 -20694 -10777 -458 -10674 -15867 -23314 -25346 -21510 -14688 -10449 -4637 -2192 2455
12221 2455 5227 4846 5633 -1061 -7607 -3184 -9101 -1764 8683 13938 13920 10500 5809 6614 13908 14660
12205 14660 -4082 -4578 6519 4717 -1950 3441 5974 12211 14287 4202 1569 -1002 -8331 -15644
12191 -15644 -9246 3782 3222 4102 4843 7055 6813 2019 6258 -2628 -8740 -4074 3642 5200 8619
12176 8619 18674 23575 3448 -4004 -1801 1126 8192 9795 13312 3231 -3536 -7227 -14771 -25262
12162 -25262 -15627 -12468 -24441 -27438 -3707 8781 629 -2778 3165 -1886 -10936 -2850 -7842 4112
12148 4112 2030 -9305 -5612 -10186 -21909 -9773 3087 3025 -9844 -21596 -17547 -8210 -4161 4252
12134 4252 7716 2190 6852 9856 6930 -3373 -9143 -15433 -17114 -13481 -4093 -18378 -29439 -24669
12120 -24669 -32351 -37614 -31570 -17052 -7477 -10234 -2172 7097 -241 2725 5660 2835 -3263 -14929
12106 -14929 -12756 -9335 -1854 821 -3599 -8425 -4848 -915 -991 -15896 -25063 -25267 -19932 -13444 -16900
12091 -16900 -14697 -6512 -2953 -18529 -15494 -5037 -4817 -6050 -11343 1657 -4030 -20222 -25792 -29069
12077 -29069 -24921 -6733 2342 1732 3855 1145 -8239 -14875 -6981 199 2836 133 -2237 8165
12063 8165 24682 28119 33226 16974 -1339 -12916 -9223 -4620 -7497 -7222 -4014 -1222 -2535 14628
12049 14628 12893 4671 -10232 -15642 -6789 9007 13649 12308 -186 460 1098 -2524 -4013 6416
12035 6416 -1175 -4492 6612 15538 11212 5033 -15660 -15640 -2855 3837 -32 -5417 -7265 -12572
12021 -12572 -11669 -105 23672 24681 17732 9848 -3020 -10246 -2541 1174 8031 3450 -3731 -4549
12007 -4549 -3422 -5211 -19421 -12627 -3599 -10937 -7510 -4028 -17179 -19732 -16452 699 17454 21895
11993 21895 13744 12563 8641 -313 -15049 -23779 -10429 -9772 -1995 -2756 -8580 -10027 -5597 -16601
11979 -16601 -27000 -30964 -21127 -19950 -11815 -3642 14520 20195 8974 2047 -9339 -9836 -17740 -28468
11965 -28468 -20100 3737 3826 -2391 -1556 -20180 -31025 -33824 -33542 -30572 -23704 -20452 -7784 7976
11951 7976 -116 -12226 -9419 -13651 -11342 -16298 -14808 -19093 -13251 -10489 -14349 -12691 1350 6097
11937 6097 7707 -4923 -15995 -30347 -20604 -9593 -10386 -9805 870 6461 5160 7266 8257 13836
11923 13836 19340 14591 11313 -10309 -22431 -17663 -18302 -11853 627 7026 34 -7637 -23477 -31904
11909 -31904 -29623 -19400 -19166 -18173 2623 -1500 -15380 -17989 -9953 4070 -2745 -9902 -2662 -1816
11895 -1816 -5002 -2564 -4048 -10990 -9806 -1969 -5987 -9931 -18000 -22078 -22218 -16886 -16240 -17474 -16749
11880 -16749 -20635 -20814 -7986 -3553 -16300 -19364 -11329 -6136 -8477 -29819 -35283 -21315 -4837
11867 -4837 2243 6366 8112 12098 12587 7517 10718 6021 1150 -224 3311 -918 4298 -2031 -4100
11852 -4100 -19042 -24137 -27970 -9106 1840 -9974 -14145 -4690 -2017 -8964 -4271 -545 -9610 -18285
11838 -18285 -14649 -16094 -11369 -11870 -8437 -23686 -19173 -15140 -12361 5221 11653 6052 1384 -10553
11824 -10553 -14020 320 15652 10330 2014 -22215 -36268 -29813 -24347 -24449 -20435 -17200 -23846 -20918
11810 -20918 -17468 -20290 -16574 -17965 -17788 -19856 -10622 -1392 -1450 -3860 -2119 -3510 4872 2999 -3820
11795 -3820 -1866 6043 -17985 -30516 -24948 -32662 -32423 -27093 -11798 -9680 -15775 -6064 -6556 -23640
11781 -23640 -22714 -19848 -19778 -19789 -24546 -29552 -29386 -12617 -13034 -10202 -4991 -10444 -6322 4779 5565 -7311
11765 -7311 -1627 12973 22457 4314 9589 6217 9755 7147 3190 4849 -2021 -13799 -4695 -3358
11751 -3358 -6129 -15501 -18951 -14767 -10215 -13855 -29002 -27993 -9839 1889 -1407 -7018 -16276 -25118
11737 -25118 -30403 -18038 -8836 -14206 -13038 -6854 3399 3394 -8417 -20375 -23582 -22316 -2261 20504
11723 20504 7958 -11129 -4031 4818 -5673 -24265 -24210 -13610 -21472 -26014 -10724 7130 7730
11710 7730 6694 12344 -1256 -5587 -11704 -20474 -21681 -13954 -2187 -3345 -15920 -16239 -7827 -5930
11696 -5930 -4877 4676 10970 4318 -7062 -8959 -8805 -6008 -10300 720 5564 7838 2867 -4138
11682 -4138 -13774 -13615 -9306 -19877 -20411 -18178 -15242 -16208 -16340 -6965 -2805 13927 12131 -7636 -22468
11667 -22468 -26682 -18968 -14702 -10738 -11925 -620 21333 21528 13749 7296 7826 -9092 -14991 -23176
11653 -23176 -4047 717 -6542 -16555 -23265 -27382 -19891 -13920 -15497 -23924 -32972 -17834 -8119 -18798
11639 -18798 -30049 -25702 -22798 -23195 -15007 -10124 -2545 -2114 7941 13188 -3694 -18769 -18514 -13098
11625 -13098 -6212 -4440 -6227 -5061 -5758 -1850 -956 -3992 2037 -3793 -8878 -2622 -8649 -31521 -38401
11610 -38401 -23870 -6919 -4567 -21236 -37896 -22297 -17174 -1567 8343 10382 9952 -14306 -22038
11597 -22038 -23104 -12075 -11922 -25729 -11599 -8084 -5883 -19611 -4355 -3908 -23793 -20418 128
11584 128 2437 1725 -4674 329 -4046 3798 -3656 -7563 -13419 -16313 -19182 -15742 -12331 -7223 4440
11569 4440 -7585 -19816 -22036 -22906 -18310 -24393 -20319 -11731 -3402 171 -13404 -16720 -19899 -14187
11555 -14187 -12153 -28416 -28632 -17827 -5 3747 -10441 -16380 -16157 -9793 -8946 -9313 -11901 -4376
11541 -4376 -2938 -14253 -13012 -26703 -35400 -29336 -33494 -34966 -33263 -29834 -28103 -24602 -10925 -8609
11527 -8609 -11690 9994 22136 12973 2249 7837 -3561 -17633 -17438 -13953 -18139 -14100 -10022 -16879
11513 -16879 -10215 -5432 -4915 3797 -3990 -17757 -17448 -18181 -9359 1491 6844 11349 4290 -6736
11499 -6736 -12871 -10162 -9025 -9466 -14569 -21955 -14879 -17023 -20999 -33312 -32085 -25402 -21876 -14397 -13893
11484 -13893 2834 12922 13808 5095 931 -19409 -17053 -9157 -5335 -5128 -13491 -13167 -4645 -10979
11470 -10979 -3956 2705 9279 7404 8807 -4002 -20893 -20771 -22500 -21233 -27575 -32468 -20368 -10795
11456 -10795 -10522 -15841 -11073 -10023 3908 8970 4640 7036 9580 14626 10705 12124 15324 11847
11442 11847 2652 -6385 11671 10348 8554 2644 -12967 -9780 2550 -5711 -22222 -7531 3582
11429 3582 -1304 -4377 -14902 -22342 -26480 -27024 -21980 -18698 -15603 -30619 -33685 -24206 -18917 -23993
11415 -23993 -27034 -24085 -22004 -19850 -20370 -15056 -15102 -17049 -13280 -11584 -6147 -4195 -20977 -35651 -23152
11400 -23152 -781 1149 -5333 -14778 -13317 -15153 -24680 -19759 -8220 7364 3916 -5250 -14412 -13145
11386 -13145 -15722 -6599 14447 24487 13961 -2646 143 3361 -10373 -20836 -16123 -24056 -22164
11373 -22164 -11588 -10514 -7353 -3747 -11456 -12215 -13043 -11596 -7281 -5270 6033 10364 -5609 -13942
11359 -13942 -22603 -26320 -33958 -35669 -37511 -28982 -24730 -26761 -18041 -14161 -13582 -20346 -25374 -25884 -26698
11344 -26698 -15734 -7252 -829 5529 41 -11064 -9546 5021 7160 -8156 -23082 -25518 -10410
11331 -10410 -10783 -22892 -5793 -4663 -15430 -26891 -24759 -17382 -23886 -10728 3922 7873 3497
11318 3497 3187 4824 12102 5411 6879 4347 -2693 -5196 -10306 -6587 949 -1102 -11877 -18238 -6442
11303 -6442 -567 -7084 -11477 -6583 -5096 -3668 6206 -2834 -10002 -21966 -24521 -2503 12258 19463
11289 19463 14964 -12 -13937 -26095 -27984 -29627 -18519 8692 13675 -6123 -16075 -20691 -11314
11276 -11314 -3138 -8667 -6707 6287 7508 -4626 -7512 -1648 2062 3311 14561 9175 -1450
11263 -1450 -5510 -9456 -15247 -10116 -8336 -25361 -25172 -9260 3841 15745 14925 5179 -8369 -19070
11249 -19070 -21715 -5133 5484 5278 -7425 -10066 -8962 -5277 -9069 -6661 220 -1621 81 1641
11235 1641 -6775 -6029 -2081 -15749 -11419 -5471 -10558 -8698 -2594 -4793 -9445 -1526 389 -123 -3668
11220 -3668 4207 5582 24916 12267 -7413 -12245 -4947 -4141 206 1685 -5778 1543 -5143 -3460
11206 -3460 -1870 -3711 -16039 -20158 -4823 -20802 -39332 -26528 -22898 -22065 -12578 -10790 -15097 -4812
11192 -4812 8987 14479 12548 7567 1546 10931 4652 -2564 -13712 -19336 -17616 -19380 -20402 -21395
11178 -21395 -17285 -1869 3861 -525 -6675 -6121 1172 -11636 -13104 -9709 2837 6368 13024 12227
11164 12227 8967 -1459 -565 -11360 -20445 -27576 -16587 -9960 -6935 121 9952 854 -9127 -11338
11150 -11338 2167 6134 -12009 -9494 -9398 -11054 -10595 -10525 -13255 -11688 -17116 -26152 -22678 -23855 -20805
11135 -20805 -8547 -13300 -19560 -21210 -17267 -11346 -21741 -22449 -17769 -27258 -31578 -17356 2172 -17442
11121 -17442 -19062 -12392 -10385 -376 2122 -6935 -1954 3505 2661 -9569 -1225 -774 2030 -7708
11107 -7708 -26669 -20395 -17529 -17439 -24982 -13771 7625 19039 5933 -10141 -8849 -16003 -8689 -12783
11093 -12783 -36921 -36076 -18324 -12218 3333 4546 -9592 608 9654 14147 10412 1993 -13209
11080 -13209 -27723 -24566 -21562 -23856 -26716 -14958 -18078 -17538 -22880 -10776 5070 3798 3857 2551
11066 2551 -6147 -11532 -22790 -33140 -38681 -37924 -28839 -4714 2762 -8301 -16235 -13720 -11130 -15267
11052 -15267 -9620 10922 8892 1438 -7428 -9396 -4344 -8645 -19947 -20671 -7141 9523 9380 -14
11038 -14 -3970 12003 13782 5651 5135 -6208 -2038 9860 2346 -4499 -7471 1986 1823 8993 1244
11023 1244 -4816 -10605 -4585 -5365 -17244 -26243 -25033 -23375 -23725 -14308 -11107 -20764 -19353 -22068 -36738
11008 -36738 -33083 -26600 -20082 -20133 -9416 -2795 -13102 -10006 -7025 -7443 -12159 -7063 -9479 -8769 2560
10993 2560 1903 -3862 3979 -382 -9034 -15834 -19778 -2704 2116 -20760 -33771 -28106 -28052 -31095 -26829
10978 -26829 -26083 -31662 -29228 -21643 -23842 -25400 -10863 -2719 -18879 -22570 -19643 -5674 -11306 -10094
10964 -10094 -10217 -13627 -6572 -4406 -4556 -1775 -12087 -21823 -25153 -17854 -9109 -557 17488 21359
10950 21359 -1695 -12014 -7358 -5935 -8585 -3355 6543 17212 3517 3560 7217 16010 25985 21486
10936 21486 12150 3842 11859 10588 8059 19401 25479 25123 17010 5215 9297 9766 -2695 -1549
10922 -1549 -6295 -19403 -37488 -34851 -16997 -11086 -9244 -17443 -24865 -17370 -8955 5266 10596 9245
10908 9245 30366 33416 25920 21504 6060 9269 14183 14715 13249 15833 26199 24496 17454 11848
10894 11848 32114 50693 61924 58477 47817 47484 54790 57105 48800 36477 28241 32178 30914
10881 30914 27019 21780 16907 24390 23087 22405 14883 9845 16838 27342 22655 12049 -1750 -4297
10867 -4297 6497 12897 -1550 3921 1180 2726 -3085 -1166 1168 7887 2179 -5303 -9109 -7258
10853 -7258 8933 3511 3060 1731 12927 22124 20304 30846 37502 25324 35586 32415 26381 35189
10839 35189 38796 38605 31296 25413 28370 41700 29512 12260 7449 16975 25789 23160 8356 12543
10825 12543 11058 8064 17893 23003 16913 1158 4834 1570 4030 3616 3956 -5850 -17564 -23806
10811 -23806 -244 14954 10675 13190 13826 2202 -7640 -2363 -20 -525 -2663 -10056 -22175 -13382
10797 -13382 -6354 1071 -3455 -1621 10174 27416 24136 8607 -2087 -6608 -4237 5293 8294
10784 8294 16171 11466 12645 19011 19605 22077 13831 8223 983 8667 9255 8343 19990 11633 11783
10769 11783 4604 3482 6614 11817 20310 19978 25788 11885 7639 14244 31251 30671 16957 7902
10755 7902 2637 -4187 -1505 14417 16922 12229 11348 16324 19659 21977 19907 12299 2690 -5202 -4042
10740 -4042 -4065 -6368 -1696 -14470 -16265 -14608 -10853 3805 10727 11571 16899 10239 12279 15242 8648
10725 8648 7068 -9481 -24648 -23399 -11319 8193 17264 18818 5973 -13382 -13755 -9209 -15491
10712 -15491 -16389 -3821 -6704 -5599 -400 1096 -3674 684 -5953 -2581 916 1215 -152 10644
10698 10644 13597 7770 6734 5889 1280 13988 21517 22289 25532 25768 25875 23840 15225 11138 18479
10683 18479 12948 8194 16549 23663 15703 9259 -8463 -23169 -23876 -14504 4514 11136 7155 5787
10669 5787 6811 -3193 -2237 -1694 1730 14676 1792 5162 10955 12363 10976 21665 26730 6750
10655 6750 -10371 -17152 -14576 -20628 -20353 -11425 -1174 -2341 -5893 -6445 -3940 -5755 -14533 -13350 -15603
10640 -15603 -11739 13272 5488 2871 3581 9544 11533 -11052 -12416 -20714 -25853 -29548 -23900 -24227
10626 -24227 -8316 -9651 -19167 -18517 -5920 1070 -5597 -12399 -24745 -24187 -17860 -8613 -7310 -6741
10612 -6741 -2612 -10385 -18633 -25555 -23565 -15578 -11535 -12306 -11193 -16910 -8042 -15754 -21523 -13914 1291
10597 1291 -7384 -11763 -8034 5309 -7264 -12532 -17490 -30380 -25515 -17718 -23583 -28848 -11608 -2050
10583 -2050 -8470 -5381 -10065 -23931 -29962 -8941 6707 -5065 -9137 -12198 1694 7954 7276 -1303
10569 -1303 8290 -11651 -14633 -11829 -16013 -8964 8842 22096 24741 28645 11508 -6970 -13350
10556 -13350 -3508 7666 2630 -8712 -9408 -6403 1624 -4761 -14331 -25529 -20128 -20192 -28760 -21588
10542 -21588 -24893 -26747 -10885 3053 -4151 -11687 -14545 -10420 -6927 1079 18729 19004 9275 4751
10528 4751 -7066 -7696 -763 13431 8460 16794 22880 23349 19465 6170 -12140 -20041 -15374 -14522
10514 -14522 -8249 -3659 -12832 -11712 -13751 -23429 -18345 -23787 -22742 -20414 -22821 -27864 -21627 -15086
10500 -15086 -12619 -534 -3367 -27370 -23410 -15834 -3584 3408 3947 3805 -2142 13397 4932 -2082
10486 -2082 -4041 -8049 -14696 -8691 -968 -1637 2987 -6914 -15586 -5171 -7470 -14870 -16926 -11625 8443
10471 8443 15129 3842 -9566 -13717 -10058 -9441 -2595 -11080 -6054 1503 3224 -1396 -2877 2329
10457 2329 14457 11552 -13306 -13603 -21325 -19985 -3678 -5954 -2784 8755 6847 1939 -14868 -15039
10443 -15039 -717 12068 20606 11932 1245 -17521 -28129 -14467 3738 1444 -3123 -813 11663
10430 11663 10527 4185 -5706 2095 -1131 -14754 -27022 -29079 -23997 -19621 -16926 -17323 -11505 -6856
10416 -6856 -3709 -2635 -4835 5731 -4472 11496 26649 21962 21755 24651 19098 9966 9486 12329
10402 12329 24750 20825 18430 26442 47733 49201 49957 65298 84406 83482 76866 73903 75617 64523
10388 64523 63035 66910 53757 45346 43942 38455 36749 33000 20781 14295 25633 23980 4716
10375 4716 7581 17931 37116 52243 58486 61514 49398 39268 31068 21552 29032 41116 61071
10362 61071 68493 66862 84940 93476 90790 75101 73073 79814 79703 80630 89875 103541 118299 130984
10348 130984 144099 163558 172663 205461 251370 299585 373300 475097 600032 732438 883729
10337 883729 1043750 1180844 1258617 1285018 1317565 1326877 1294176 1198208 1082252 1000329 943224
10326 943224 916883 944046 1054360 1198146 1255210 1182607 1016258 840031 684340 576423
10316 576423 498007 428656 366260 335960 324222 302142 271176 250408 233567 223979 205100 191161
10304 191161 173825 163244 152633 135312 114008 96630 100644 99170 98366 93945 87326 79715 67108
10291 67108 75131 105862 119403 131892 137779 131401 132283 145925 164152 171984 176475 182503 176446
10278 176446 165202 137794 142678 137626 118084 107727 102849 102597 95196 103658 114781 107949 85991
10265 85991 74689 64652 61625 76965 84983 100530 107949 104738 110713 123898 142691 154885 167523
10252 167523 193656 233016 278686 354076 502889 754773 1104620 1422285 1563041 1435227
10242 1435227 1150457 887709 701028 565885 451057 384943 355732 303955 271240 241373
10232 241373 233484 233735 224111 195800 178547 168320 155059 139720 121258 117700 110826 116082 106521
10219 106521 98012 89690 71586 69325 50125 46850 39152 38797 46768 35501 26671 27308 29246 41938
10205 41938 51343 42620 22336 11129 5968 11079 32155 45040 45616 48463 66028 80387 73309
10192 73309 79069 90618 104849 113396 109363 112099 126802 127860 123420 117508 102649 90462 83498
10179 83498 86530 106861 103994 86483 69243 63164 58243 69812 67028 55841 54852 46364 31251
10166 31251 28948 29125 23752 2210 2294 3183 1517 -7842 -18889 -22536 -13892 -9390 5977 23819
10152 23819 20097 7897 -363 6629 12137 22170 26496 21769 17115 10881 13020 10449 8842 6282
10138 6282 3679 1296 18727 9697 9808 18289 13294 17816 19148 12264 12438 4635 8059 6029 3173
10123 3173 -5318 -7259 -21908 -21768 -20128 -15551 -19300 -1046 553 -9477 -6173 -4372 4886 21117
10109 21117 13074 -5038 -11113 -14487 -4464 -5870 6768 14286 17246 19490 26914 31297 49869
10096 49869 56606 49324 39829 30708 24864 13691 10329 -3160 -19309 -28410 -18138 -16494 -16691 -3039
10082 -3039 17919 22218 28511 19047 22406 45999 75943 121142 138926 118632 87582 61221 37431
10069 37431 30607 17602 12479 13623 25480 33523 24483 22171 25326 23785 19307 11824 14334 22146
10055 22146 13941 21590 18942 25254 28027 19113 19690 19887 17717 2798 -4524 3797 7914 18472
10041 18472 15970 8599 1936 1113 3978 18171 33829 34830 34355 20115 12271 14089 -4132 -8530
10027 -8530 13113 11809 8780 9489 2612 4148 -2692 1146 5913 3912 -7202 -1789 4760 1999
10013 1999 -1762 -344 11339 23192 18009 11878 16760 26531 31555 13515 14572 11054 15981 24277
9999 24277 13097 7915 -11506 -12070 -4862 -10595 -17956 -12501 -4564 -737 9712 6173 -4156 -1158
9985 -1158 6615 1506 -10424 -3074 4404 6849 12982 9701 5664 11630 13071 17275 23865 24021 19185
9970 19185 28254 19723 23748 12743 -2580 150 11433 19239 25531 11973 9580 19893 16547
9957 16547 8050 12588 11446 -224 -2965 7112 13982 5892 -3960 -13686 -13100 -15343 -13677 -14261 -2748
9942 -2748 3652 -9925 -13638 2811 11771 14846 18470 17434 7966 689 4905 11717 16861 18371
9928 18371 29042 22275 14857 19018 31301 21183 7118 8066 32217 38728 26941 18846 20036
9915 20036 27817 18305 11881 10111 8479 5728 8928 22986 26312 25032 22252 18692 12044 3903
9901 3903 1299 28993 45840 52788 38513 32525 32331 11518 1946 4495 10228 14024 10845 14148
9887 14148 19265 21007 28981 28125 38365 41038 38814 28480 18548 23385 21772 17983 15039 9748
9873 9748 6965 81 10187 982 8428 16390 17684 15480 12992 10075 15362 14533 13974 -1401 -4551
9858 -4551 -2483 -301 4581 9648 5222 -3312 -571 1245 -262 218 24 354 14548 24081 11732
9843 11732 -6620 -17466 -24728 -20602 -3838 11491 15104 22289 22595 11824 8167 13856 25150
9830 25150 33015 30934 11502 3428 -13876 -12963 -4899 4070 4457 2477 -3659 7564 31509 39919
9816 39919 38385 26361 12612 15728 10505 4955 -1394 -2856 3632 5446 5469 6589 9480 16202 17545
9801 17545 5416 -8568 -7152 3852 25316 33217 21341 22798 43313 75784 91576 106404
9789 106404 100996 84477 68738 60361 44106 26680 7325 -5980 12733 22574 8307 1909
9777 1909 3764 8037 623 -1345 5940 11542 29196 25327 22426 7964 -6561 7134 2964 6407
9763 6407 -3463 -3540 930 18788 38281 17450 -5912 -14229 -1034 5850 2628 5987 1988 3842
9749 3842 9072 16546 9301 3656 7017 15208 13265 12994 11744 7337 1860 -1882 -3142 -3597 6415
9734 6415 32809 43102 50944 52524 48908 37520 36027 29167 34237 47500 59846 61466 50159
9721 50159 45998 44020 48118 48511 40987 37358 40594 34836 26890 34574 50046 55728 50131 38335
9707 38335 29007 33300 30044 15360 7797 10453 9831 12008 22646 24767 10100 13814 14565 2314
9693 2314 -3778 -4344 2296 7675 23750 42102 29071 -789 4215 24947 26514 21832 22201 13004
9679 13004 8517 4482 9516 26717 36241 35523 30766 27801 20064 19101 20894 14767 2456 1202 10583
9664 10583 -1979 -11455 -10978 -6051 -9194 -19226 -10960 -7521 342 4614 -3227 -5158 1814 10539
9650 10539 9107 -2042 4188 11308 8303 4507 2682 11665 21261 17040 13719 21709 22937 11826
9636 11826 12885 15752 20120 23692 20936 9667 15108 18116 22637 14493 6356 1327 10887 3316
9622 3316 -13329 9184 31855 59192 68045 58048 50731 43111 21318 17272 19258 29255 17691
9609 17691 16423 24000 16466 -2774 -620 8345 6017 3937 5680 -12630 -12282 -7038 -4423 5474
9595 5474 11735 5535 5907 15399 10453 1137 -402 -12194 -11047 -10205 -1649 13325 18998 16909 20921
9580 20921 17031 19560 17881 16008 20356 29255 24028 7680 20253 27352 19893 25337 15096 5229
9566 5229 12444 9879 4783 4877 -1882 1455 1037 6585 7940 11803 18045 14959 18347 22760 19070 9672
9550 9672 -2743 -2225 -3576 5887 12814 21861 20074 11595 -2413 -8945 6650 9587 4164 5906
9536 5906 11646 13329 8397 4747 4900 177 12887 17881 14682 14714 7980 11791 15281 22686 12085
9521 12085 -2688 -13327 -15582 -2757 5238 8599 7575 9635 -471 -6371 -8666 7660 21874
9508 21874 20896 14128 14965 14378 24645 23471 17229 20733 3952 1795 11649 20062 14434 16139 37651
9493 37651 43227 24274 24020 27767 19415 24165 15324 -10454 -7169 12839 20373 26299 36427 47644
9479 47644 47941 27812 7193 2839 17941 24466 37466 45357 39781 30336 22564 11503 19170 17102
9465 17102 9848 -2471 -8277 10024 12390 18564 25961 35452 20759 10265 23456 24415 31079 31601
9451 31601 15600 16800 31073 33328 40091 35595 42498 35772 27948 32416 29342 33665 32023 29229
9437 29229 32438 30457 37272 43265 17294 5800 5249 23726 20437 13515 4940 5407 5905 11228 4719
9422 4719 1139 24741 26237 18835 16796 10413 -5500 7059 36195 44527 25054 18242 9436 8017
9408 8017 13202 18568 14983 20570 31377 45115 42635 27784 23289 19894 13443 2220 4593 16989
9394 16989 25351 23874 27783 40568 38930 38892 47893 37255 28952 15987 6602 14393 29492 46578
9380 46578 56429 44733 33748 41048 46547 42942 21266 15849 11002 2345 637 7465 13503 8436
9366 8436 1545 12896 21984 20589 14564 8707 13168 26577 26812 17295 22183 32083 38830 41206 30246
9351 30246 22213 32115 36383 40713 43601 40377 48588 50004 40563 29216 30335 48159 56474 49430
9337 49430 40064 37301 36163 37889 36626 36059 32398 30074 29275 31632 38964 44028 43291 35541 33751
9322 33751 30902 42462 50943 44844 37006 37510 46954 45995 34729 36963 45906 62308 58560 57100
9308 57100 47762 46436 43050 37629 24263 29008 28682 31071 31537 30218 31402 18487 27362 43841
9294 43841 36078 35605 30640 35334 39135 38558 36931 47961 41598 29581 33243 43117 37001 28948 37825
9279 37825 43680 32342 23950 26639 40015 36845 37724 21625 12675 19139 29406 36403 41949 37513
9265 37513 23353 15337 24829 28469 38917 31236 15113 12304 16165 13529 22097 20203 11808 23292
9251 23292 29207 33138 20328 22505 38536 43866 44842 49360 46453 48863 47087 39173 30684 25236
9237 25236 27659 22831 19837 15167 19145 17184 25670 34557 21492 20113 25560 32222 33370 23690
9223 23690 19996 34225 43705 54627 53405 42441 26341 25421 24450 17870 17833 15054 15742 30585 37938
9208 37938 35678 36186 50072 66439 72956 62877 57020 64074 66580 62435 65995 71412 60783 37138
9194 37138 26045 30374 35291 37101 25504 19012 28809 29222 27848 25909 31374 49007 45980 47037
9180 47037 39908 26983 28854 46808 48566 46898 44649 39080 52227 77331 74270 78716 82290 71923
9166 71923 64286 51764 44018 43065 44783 56224 67444 69654 73737 67652 63133 62314 65427 67897
9152 67897 63140 55051 51048 47448 43448 52236 51061 50565 41774 47899 49234 43705 45475 41344 46626
9137 46626 45235 43473 50245 60581 63403 58565 53029 55508 58399 67030 73478 72273 64145 57791
9123 57791 61309 68386 80029 75448 71068 74290 75824 83605 78039 72943 60866 64117 66615 66824
9109 66824 66183 82468 75706 59577 56643 58260 59132 71806 84222 95377 95989 102262 101760 105154
9095 105154 106604 103571 109342 112046 106989 115370 125926 121535 124285 126504 146786 177091 194662
9082 194662 205449 220080 243852 287551 331814 355993 390869 439615 475442 508514 554828 622137
9070 622137 722404 851579 997718 1212528 1502688 1933751 2595266 3728184 5669735
9061 5669735 8641153 11437843 11594290 9473374 7309130 5713782 4525448 3643605 3015887
9052 3015887 2560874 2215956 1957628 1760696 1614402 1508368 1431627 1368316 1303790 1200418
9042 1200418 1074563 978776 895237 801179 724067 654148 603521 534893 498923 459715 427262
9031 427262 404229 368461 340951 314030 280586 263420 247294 231782 215951 201784 190513 185439
9019 185439 165706 154588 155998 150769 146653 141472 129281 105901 100685 111334 118502 119743 119943
9006 119943 108748 87743 89820 73901 66006 60872 48160 54138 51867 54188 61043 73963 76723
8993 76723 89885 97002 97423 101536 109968 110337 90390 66569 67599 77912 70706 78612 73903 76179
8979 76179 74636 64698 51131 50928 53192 59631 62427 69262 73312 58569 45743 43570 57403 57590
8965 57590 57239 63611 71423 56203 40408 47569 42900 39271 47027 51504 52901 62277 72529 81619
8951 81619 75808 89880 116354 146141 176060 180635 152910 139570 125340 108520 116295 111024 104890
8938 104890 109924 97681 76902 64965 63157 61667 64229 65628 58114 65996 69031 63224 68457 68860
8924 68860 67042 73843 64745 60729 60517 69601 84863 85548 84523 89113 81730 74359 59678 53694 50619
8909 50619 60079 79596 74372 66242 62816 50726 33194 39311 48198 53412 59997 59312 62044 60048
8895 60048 55920 66208 76035 85119 74730 60440 61584 50348 48496 52170 47357 48203 38543 38933
8881 38933 43599 39547 34427 33102 49055 65809 72135 67990 64140 67465 56034 67848 69662 66754
8867 66754 79528 73468 85573 94013 87542 66940 77042 74738 71499 76461 91489 95973 86769
8854 86769 61074 63295 78700 86484 97824 91114 85935 80667 87261 105880 107981 96342 86449
8841 86449 90890 101835 109310 93461 86258 77474 78869 91309 100036 90299 71977 75977 85696 94704
8827 94704 109145 117278 113590 109218 107801 97012 96670 94653 95025 95449 101981 112278 114506 117354 132386
8812 132386 137001 142539 151789 150806 157577 155323 144806 147647 152045 160352 168286 173794 166974 163439
8798 163439 163948 184426 194472 203397 208816 206244 208779 213733 207038 204892 211158 222029 227172 238124
8784 238124 221927 212149 208109 205969 209042 208299 226839 229098 235035 244405 247124 247117 243083 260418 270041
8769 270041 263185 249456 252932 255385 262315 268679 273484 276301 282738 292648 298201 306443 312369 325052
8755 325052 329973 334416 327293 335814 346840 343223 347948 354400 367437 360612 376681 389713 404137
8742 404137 410272 415054 409230 420614 428100 420546 417820 415551 417630 433918 448644 446617 441129 452768
8728 452768 479190 490758 505423 514113 505675 515853 528746 528072 530247 534132 539551 530249 520235
8715 520235 520371 525895 531778 549415 556169 568689 576923 579666 580360 591567 626888 653852 677066
8702 677066 693973 703708 740380 765410 785003 807900 832331 864044 896238 929670 955231 973065
8690 973065 1019973 1083891 1147139 1215456 1291144 1362864 1463687 1589167 1715409 1830256 1910184
8679 1910184 1976004 2049901 2137331 2242396 2370569 2498059 2622606 2762396 2918341 3080304
8669 3080304 3260765 3444809 3627099 3772109 3817500 3731187 3525608 3245491 2952723 2710326
8659 2710326 2488141 2299113 2134006 1977674 1831763 1713313 1615679 1537484 1455749 1378622
8649 1378622 1308397 1236035 1179322 1116685 1052877 995205 942628 903791 876118 860344 861678 863573
8637 863573 867492 878663 874850 850094 786878 717877 667359 637194 608464 579340 551128 521564
8625 521564 507701 502970 501537 487033 473677 464516 460692 466793 461587 455534 436698 408715 401164
8612 401164 397860 397232 399453 393279 379570 380631 383969 381969 370847 361878 355934 340397 320812 309051
8598 309051 301936 284696 279900 279100 288905 298815 295898 278657 261166 261343 275362 303345 315500
8585 315500 310874 294144 286063 273662 275333 270186 250871 248335 253402 243093 217576 203385 201866
8572 201866 197311 185881 199003 209474 199507 199407 197459 180375 177505 166137 164103 162577 167672
8559 167672 170950 161209 175060 177528 198185 213260 201327 204912 208588 197461 188939 195340 194148
8546 194148 178060 166429 154434 160407 160821 158819 151558 160055 164539 183070 181103 174318 177305 190259
8532 190259 178746 186678 196755 189262 189188 191790 189443 200748 204927 190943 187150 182665 187740 184026
8518 184026 170576 166546 166688 183628 192315 179042 192037 213024 207711 193635 184514 180232 176922
8505 176922 179008 188158 183653 183904 167073 143842 146557 146758 150765 148423 157518 164670 176910 188963
8491 188963 188335 185664 196928 212919 211173 209004 194366 177992 170245 160306 152695 155287 135178
8478 135178 131695 146703 156828 152814 150482 158113 149624 146784 157172 152610 150298 153261 154328 156058
8464 156058 144883 135374 140405 138185 128230 135437 137591 124445 125559 128194 129449 145360 153721 152185
8450 152185 143415 132573 139287 123155 120469 121029 123405 142819 147142 133307 130482 131545 134350 128341
8436 128341 116260 115419 121735 116334 111061 105769 110467 126291 136676 133277 136197 139400 146177 138835
8422 138835 120052 109204 111141 119413 115258 106321 102573 115118 123603 125578 130821 126876 116725
8409 116725 127530 139445 132990 123389 111458 106142 86209 86489 98357 113360 115348 117987 128012
8396 128012 120192 118053 108197 93274 101928 107978 104269 94578 101997 118021 121677 117476 125243 106942
8382 106942 93510 100805 95493 97633 101943 100462 94126 99227 103453 100394 91841 94409 99934 111434
8368 111434 114067 105815 91165 76214 80594 94145 79329 68380 73409 68073 66635 65871 82531
8355 82531 83384 90290 96606 91425 89186 94536 101606 96720 96062 85883 79113 80139 86775 83086 80219
8340 80219 77676 88234 93665 86368 82411 88193 76795 67302 65989 68890 84287 81838 77446 70435
8326 70435 67064 68725 72704 73160 65473 68027 74779 64629 64873 67118 71216 69430 66589 55174 54840
8311 54840 68999 62188 53098 52406 52391 66777 71671 85447 90752 86502 71112 62093 68964 76972
8297 76972 86560 80595 67622 65684 76659 73729 61530 59172 54710 49708 52438 60999 69926 67721
8283 67721 64910 57019 60116 57172 54380 61652 61234 53993 46497 55205 45312 38632 46007 51763 52919
8268 52919 42566 28888 36760 47115 45341 37334 25975 39585 60174 62332 66704 58520 41676
8255 41676 26424 41441 44995 46732 49313 57857 55019 51380 60411 60957 64064 74645 80280 66560
8241 66560 65398 69130 70046 57244 45356 62329 71167 86455 90834 74261 66523 68583 56447
8228 56447 52064 45534 66994 79592 73788 75449 84421 71934 73972 72562 58561 51318 52356 57273
8214 57273 45875 48811 64300 74280 74998 64854 63498 67368 73361 78498 98937 110431 103495 95496
8200 95496 81066 91325 95052 97749 115246 140163 144089 140618 139538 137706 146523 137319 138228 132371
8186 132371 137115 145166 144587 137268 121171 122254 137256 142433 135918 122728 118292 111671 100371 97827
8172 97827 108639 108339 95355 100973 111557 117488 99151 108436 123443 110134 107038 109282 107738
8159 107738 99396 106621 124100 124429 130873 140882 148544 146532 151205 150421 150167 160496 162137 149631
8145 149631 134814 137260 149754 154145 164665 172836 182254 190415 206018 206716 229017 243173 250890
8132 250890 265823 293350 315319 338951 360140 372420 388721 409450 442519 478295 510275 535437
8120 535437 562107 588922 606282 613492 617418 612872 610628 611745 611962 612664 630808 627551 620979 627009
8106 627009 616574 605756 606310 609562 621964 613419 613720 612754 608164 616741 637663 668427 678839 686269
8092 686269 708610 748633 788593 826832 882150 926442 969496 1048509 1164111 1255912 1367742
8081 1367742 1496131 1651602 1794385 1859185 1843571 1786073 1745804 1703878 1658673 1661485 1673859
8070 1673859 1684122 1636186 1545706 1411442 1269724 1151975 1056398 975716 918389 868199 836906
8059 836906 834279 838063 838643 826112 803403 806604 833172 860697 916177 1035165 1174985 1292867
8047 1292867 1292389 1224938 1163629 1125534 1108977 1120638 1150658 1186515 1242429 1316654 1412375 1521048
8035 1521048 1633308 1724944 1779459 1808303 1811615 1805639 1828714 1839112 1777838 1639073 1464212
8024 1464212 1305871 1186516 1071384 976949 892944 828212 774538 729948 697599 666374 636425
8013 636425 614903 598491 576901 551236 555994 581402 578976 581216 577669 566522 576546 569581 569950
8000 569950 592618 598347 599007 621351 653825 672117 689937 705534 721536 740143 748855 758454 773471
7987 773471 762808 729453 679659 615032 560052 512057 469036 435191 405021 379828 379519 364065
7975 364065 330008 317854 326252 320486 313124 294621 275692 252454 223813 217419 230356 245856
7963 245856 274585 311563 329739 349493 373451 360046 356054 376252 414986 418087 405892 384195
7951 384195 354315 327064 294197 268609 241847 226714 224963 222402 220985 223773 219324 225944 233886
7938 233886 225468 223093 219605 199871 177933 164203 149113 129915 135141 138945 148110 147056 144657
7925 144657 140933 138407 143035 145193 151219 168298 178039 180506 187240 190846 170445 157455 153284 132622
7911 132622 123900 129470 136008 145499 137749 127939 123197 127734 128085 124067 118424 100885 99320 112268
7897 112268 118735 120399 109302 103591 88949 77409 86282 96020 90872 79905 68992 56035 50622
7884 50622 67416 69536 65647 84472 99909 94964 92275 80318 84023 96370 94641 97170 92562
7871 92562 83314 95805 99561 89455 94300 100511 101387 97295 86885 73724 65047 61377 53451 52138
7857 52138 43802 34819 28234 36858 38049 35195 37970 34656 35349 40216 53019 66349 69396 71219
7843 71219 55858 39996 30397 20831 15329 27526 41465 53415 55664 50345 50634 52228 47834 40716
7829 40716 33644 57457 66386 63955 50083 50771 74914 76795 67856 47511 36691 34755 33490 34281
7815 34281 23095 32577 32519 27228 25658 26962 30952 13871 9985 13717 21057 28826 29235 28012 30036
7800 30036 28453 24974 14937 8427 7513 8979 9131 3116 -7790 -127 17078 22923 18090 19033 9600
7785 9600 121 15735 21542 21483 10164 -1138 -8963 -862 3803 -1719 -20338 -26020 -18296 -2586
7771 -2586 -1730 5807 20514 30618 28998 25265 18177 22791 33663 30519 23480 30348 20869 28041
7757 28041 30866 37390 29825 15308 -4658 -13549 -7614 -9544 -14344 -18221 2659 11429 12507 10965
7743 10965 5630 6186 -13816 -9849 -6864 -7134 -22512 -8340 326 14695 25464 22945 13626 14241
7729 14241 11255 8418 7762 10736 2735 6103 6669 3470 -9319 -9130 532 7399 12054 20332 14008
7714 14008 4320 1151 9619 16343 12182 10568 8923 -296 1049 -702 2946 5837 -3794 1092 -1796
7699 -1796 -1707 8749 12091 4684 -2708 -10475 -8342 -9872 -8822 -11603 -15253 -18935 -13534 -11862 -724
7684 -724 9887 5534 1602 4987 3210 3982 7945 6633 562 -2783 -757 12909 12653 18000 21021
7669 21021 14274 17181 16633 10173 6716 6136 372 -821 9530 21183 25406 15563 11682 7955 -10725
7654 -10725 -14540 7000 8836 15938 -714 -10272 -978 10538 9187 -2123 -710 1975 -8144
7641 -8144 -9786 875 4310 13707 19664 20623 23146 17830 18494 13279 12382 7768 -4606 4784 11673
7626 11673 3586 -4 -9449 -13918 -19176 -18533 -9916 -1607 -1783 17451 21060 10094 5522 5012 1740
7611 1740 -7263 -6407 513 55 6085 -5742 -9389 -10478 -2794 1160 24404 33411 32206 27116 20505
7596 20505 26441 20211 12994 19078 29291 34864 28836 31799 24374 13137 1848 -600 -4726 3519
7582 3519 1729 -609 -6141 -8 13258 21811 17741 6440 -12133 -6666 2888 7821 9857 11367
7568 11367 11306 6102 8406 3109 -403 -7095 -2515 8143 16933 8935 -4091 -16219 -26923 -23918
7554 -23918 -11967 -16603 -18150 -14609 -3668 -4053 -10935 -27222 -16587 -122 6574 -15875 -30883
7541 -30883 -21097 -12640 -2627 8156 12866 1096 -9663 -18050 -18677 -15165 -33341 -38937 -20825
7528 -20825 -24999 -15908 -2070 4259 -4589 -20913 -18009 -3678 693 -3305 -14546 -16232 -6094
7515 -6094 2695 19569 14373 -6315 -17400 -6213 -5999 -5039 5464 11287 -7647 -13312 -15305 -23228
7501 -23228 -3460 9583 2045 -4906 -11813 -5994 -14142 -10889 -11127 -5895 1254 -4318 -13596 -25276
7487 -25276 -32027 -18068 -12499 -17927 -13414 -14486 -23994 -26249 -14619 8319 8106 -11580 -17600 -23263
7473 -23263 -24397 -30425 -28714 -22201 -7058 -13369 -8944 -14176 -22450 -6383 5886 -1369 -3747 1653
7459 1653 -1438 -14292 -3028 9474 8174 2870 2443 -6026 1100 3293 10337 4155 -5224 4878
7445 4878 7691 16316 22769 6290 -4791 -1111 612 -3050 -8638 559 -3665 -11296 -22985 -19013
7431 -19013 -9565 -3614 -3623 -15028 -32562 -39744 -6420 4441 -7941 -2428 -3122 -10036 -15808 -24066
7417 -24066 -20252 5665 23550 10639 -4026 -2168 3217 -2048 -11293 7875 11641 1997 -9851
7404 -9851 -3863 -4849 6186 952 -7231 -5814 -4672 -6984 5530 19317 17723 2957 -1002 2612
7390 2612 3059 4943 -487 -11547 -15587 -13771 -14971 -15587 -21711 -17017 -18089 -14986 -2283 2110 -1876
7375 -1876 -10932 -15815 3071 2721 -25213 -31191 -24636 -25461 -31602 -28230 -15920 1785 19828 27899
7361 27899 23032 12023 4307 2385 10771 8065 1639 2312 4395 -8979 -12971 -4203 6028 9318
7347 9318 11169 6843 7642 6999 -11093 -9678 -2284 -4079 -3852 14698 2732 -2064 339 -2296 -13549
7332 -13549 -18037 -20806 -5717 7981 2461 -6136 -8958 -7773 1362 14899 16015 1482 4225 6896
7318 6896 6809 3855 12156 22517 20951 13593 3265 -5387 -19520 -21066 -10345 -8948 -16859 -9069
7304 -9069 -12762 -13543 -12136 -10168 1124 9311 -3136 -13939 -20662 -5195 -2352 -3941 -11504 -14313
7290 -14313 -15781 -16977 -8094 -11351 -6234 3175 -6566 -10927 5320 6914 10940 16415 7302 -7896
7276 -7896 5149 14308 16977 9688 -4873 -10465 -11512 -17922 -22506 -22784 -7510 781 -6728 -7980
7262 -7980 -7591 -7724 4711 2873 -609 4212 5022 38 -8886 -17775 -14423 1339 7122 9362 10198
7247 10198 4453 -889 -11787 -24340 -19633 -11289 -5288 -18120 -10471 -13184 -6407 -2143 1761 4442
7233 4442 4281 193 -10320 -18949 -19293 -11683 -19985 -27100 -27656 -15473 -8419 -10574 -7708 64 -4186
7218 -4186 -7227 -8219 7427 13510 2976 -833 -6263 -311 4555 4372 -7643 -4093 3297 1855 -5645
7203 -5645 -7152 -3182 -741 3156 -5624 -14076 1130 3570 -3824 -13355 -25264 -20021 -22822 -19115
7189 -19115 -11652 -19023 -32599 -31305 -15521 -14451 -10980 -3783 10092 17331 13150 902 -11342
7176 -11342 -8929 -7629 -11349 -11638 -9467 3175 -1202 -6255 -13771 -18484 -16130 -9880 -21538 -24121
7162 -24121 -15886 -20305 -12980 -3076 -2993 -564 3265 37 149 -275 8403 9531 5743 3606 9346 11069
7146 11069 -306 -5616 -63 10293 -274 -898 -11994 -2618 2698 -9188 -2147 -2508 -8709 -18033
7132 -18033 -997 9849 16066 20685 29957 3883 -6492 -2482 10806 12050 14887 18907 19550 13216
7118 13216 -724 -5387 -4562 2737 12003 -234 -16941 -17174 -4126 4458 11017 15426 14491 14626 4016
7103 4016 -20872 -32493 -18829 -15170 -26304 -22912 -13773 -12747 -9467 -1959 -11508 -18421 -11414 -8357
7089 -8357 -9934 -8939 -4481 -10482 -10863 -4200 4807 -1482 -7570 -15238 -16215 -2341 7373 18437 20077
7074 20077 3599 5893 59 10508 9982 -6438 -8258 -4006 4732 630 7664 2740 -9451 973
7060 973 4096 6023 5397 9711 -1215 -6956 -9255 1851 11284 10775 2633 -1128 -10933 -11353 5890
7045 5890 22839 18129 16975 6072 -69 9817 9343 10034 19632 13667 2655 -329 -9784 -20652
7031 -20652 -17427 -12911 -24815 -33612 -27841 -10883 1656 -3419 -14784 -26008 -26745 -12069 628
7018 628 3422 -1684 -3115 -3024 -12148 -10651 -5060 1178 -5122 -12962 -17275 -17293 -11996 -7523 -10337 -19791
7002 -19791 -27990 -26879 -23748 -17056 -12546 -16426 -16977 -13315 -8512 -2423 -5929 -3422 -13058 -12656 -16229
6987 -16229 -17183 -19085 -11190 -10473 -16242 -11800 10286 4571 4292 14977 11111 -2570 -20585 -26968
6973 -26968 -13195 -6627 -316 7761 12562 4324 5981 -2239 -14107 -18902 -5437 193 1805 -6526
6959 -6526 -6735 -4504 284 -2117 -208 -4302 -9730 -21325 -18865 -12498 -12372 -23419 -10218 -1444 -1024
6944 -1024 -11470 -5169 -8676 -2771 -4219 3271 4233 14087 11793 9410 14129 19832 15927 98 -234
6929 -234 5675 10794 1386 -3567 -1973 1538 6750 -3458 -9562 -2502 -1721 6359 15331 16728 11371
6914 11371 8515 13512 12926 18057 9003 4170 -8306 -18583 -25008 -11871 -15979 -14812 -8257 -4886
6900 -4886 -7726 -8102 -15959 -14198 -3902 5766 2221 7913 4610 3298 -1732 3336 16829 16122 7953
6885 7953 457 -1027 14132 10661 6946 9442 9051 -7 -4630 -7669 -1181 6308 9604 3723 11012
6870 11012 15338 16698 10020 14557 13707 3041 174 -557 4329 11444 26801 52548 74063 102986
6856 102986 122280 105654 84676 71795 61417 50202 37200 30694 26593 22668 16299 21049 22148
6843 22148 17602 32481 45450 42198 38267 21970 6608 13255 43710 55925 81596 101353 93118
6830 93118 80130 72822 79013 71136 55378 38700 19954 20028 21796 24419 22368 21887 16010 21870
6816 21870 28779 27923 12611 16114 16296 968 1930 3546 17071 13902 15821 26267 33462 26124
6802 26124 19087 24475 29980 19204 -5141 -11459 -3100 -11678 -11082 -6392 -5807 -10429 -2506 5248 3959
6787 3959 -274 -13084 -6114 -14632 -12666 -23298 -19368 -5377 -5270 -11125 -6001 -6829 -9665 -4083 -1089
6772 -1089 -6034 -18525 -24406 -14828 -17291 -4158 13469 10602 -2577 -4494 -17106 -9199 -7494 -18331
6758 -18331 -29793 -20992 -6801 2652 -7045 -25605 -17401 -9712 4516 7121 2137 -9842 -15301
6745 -15301 5696 15977 11040 13061 22695 9455 8390 12097 5418 -3911 -11421 3660 9220 -4020
6731 -4020 -11225 -17410 -14650 -14604 -3432 -2472 -1617 -17277 -28884 -28410 -18863 -12908 -21814 -21323 -1848
6716 -1848 634 2504 1741 5400 -8028 -15912 -13860 -5962 -9120 -10821 -4433 1514 -5916 842 14933
6701 14933 14892 -3449 -6018 4651 -10880 -15504 -15711 -5214 -13513 -10803 1690 9407 10910 3392
6687 3392 -8376 -27009 -27183 -34067 -26007 -13741 -26607 -31545 -31052 -26968 -13519 -20301 -20509 -9644
6673 -9644 -10724 -7569 -17161 -16427 -11013 -23863 -20648 -22215 -18244 -8953 -14774 -11284 -6383 4570 5427
6658 5427 -4624 -299 6078 -3680 -1181 12891 2348 -8151 -22479 -24247 -17298 -11781 -5073 -11850
6644 -11850 -12344 -22321 -22532 -17027 -9794 -11641 -11526 -13237 -16671 -16330 -19780 -3216 -11077 -9492 -693
6629 -693 4898 -16934 -16027 -361 5417 1322 -2884 -4583 -5660 -5904 173 -55 -4315 -27312 -26083
6614 -26083 -28277 -25704 1926 13916 23236 14368 3234 4879 4189 -671 1602 3902 6044 5661
6600 5661 -11327 -18108 -11771 -9411 -15198 -23168 -19671 189 3727 -8411 -11190 -9449 -4841 -2366
6586 -2366 -1086 -16881 -27759 -14818 -18451 -17435 -9251 -7298 -21993 -29510 -14399 2402 -2071
6573 -2071 -11585 -5846 -5963 1081 1572 6532 8899 2445 -7760 -13581 -14117 -3086 9670 2463 -3946
6558 -3946 -15330 -29591 -26998 -17695 -14746 -10324 -1343 8117 842 -13256 -31004 -14933 -8828 -1945
6544 -1945 -13593 -20933 -16900 -18189 -18434 -5985 1761 1148 -5814 -13686 -9691 -10220 -4288 -4242 -6375 -10900
6528 -10900 -8049 -5138 -8271 9629 6496 6549 13400 4841 -1151 -1102 -8552 -8913 -10297 -14070 -13807 -7058
6512 -7058 -4549 -11409 -6732 2922 -634 3383 -65 6365 3878 7064 15529 21107 17374 -2059 -17104
6497 -17104 -25912 -25885 -22993 -16431 -14571 -15063 -15950 -8928 3486 13065 2665 -2691 1648 4650 -12713
6482 -12713 -6745 330 555 4174 11058 6578 5248 6528 8464 2600 4407 2789 5162 -2677 -8830
6467 -8830 -17767 -22355 -16949 -3741 -6834 -4625 2831 5404 4535 12910 11005 9008 2334 -8911 -1452
6452 -1452 12595 4458 11944 16974 5553 -7941 -8002 -10148 -12813 -9568 -822 -10611 -7231 -4046 -8132
6437 -8132 -3489 9278 10263 2821 -8915 -13698 -6653 -10498 -25778 -17441 -19118 -13168 -13443 -6257 -478
6422 -478 -3214 -14385 -30778 -39237 -27470 -24226 -14763 -20374 -24390 -43353 -51220 -45852 -17936 -5447
6408 -5447 2414 2149 1313 -5496 -10994 -13392 -2995 -17092 -31031 -24495 -26843 -18017 -12378 -6071 -3585
6393 -3585 -3594 -17977 -26147 -16793 -12843 -3764 -1895 -8444 -10501 -13810 -7962 -1403 11049 21273 36407
6378 36407 25937 6263 4213 153 -3277 4930 12325 14329 -7066 -23006 -21938 -16562 -2522
6365 -2522 -17668 -17365 -13558 -14404 -8225 10659 7483 -11125 -12444 -17550 -16836 -12681 -7571 -11895 -18597
6350 -18597 -14255 -12638 -12035 -5742 -11602 -10649 5377 -627 -1110 -203 3624 -1880 -12504 1123 4951
6335 4951 -9740 -16057 -7593 -10192 -12836 -4054 -10297 -12340 -17468 -13601 -18657 -13080 1787 4484
6321 4484 11165 24696 18437 15590 11576 14763 20836 18946 -9849 -4356 -12989 -19543 -20517 -17943 -3268
6306 -3268 5345 14294 25161 13096 -8378 -17130 -20439 -18679 -20076 -14440 -6468 -2028 -308 5389
6292 5389 4090 -6180 -9859 -13157 -5851 -18392 -26517 -21579 -19509 -22878 -15283 -6386 -9380 -9349 -11733
6277 -11733 -16810 -23730 -21208 -29795 -32230 -22941 -20709 -9756 -10252 -5075 2938 -4402 -563 5907 24
6262 24 -3831 -1784 -609 7976 -2128 -15318 -23137 -33588 -38391 -36772 -32138 -31670 -26137 -27900 -26607
6247 -26607 -23579 -16170 -4776 -4027 5659 14873 17242 23944 25758 29091 24709 23219 12261 11543 9050
6232 9050 -722 -13030 -12574 -9682 7917 11575 15758 12456 2000 -3255 -4103 -6944 -12798 -15962 -31660
6217 -31660 -26380 -21726 -21447 -16903 -14415 -8000 -13501 -23033 -20087 -20082 -36207 -32598 -13287 -15971 -24694
6202 -24694 -11935 1338 3058 -2204 3363 12641 -1134 -9630 -10472 -5291 -7511 -19247 -13062 -7807
6188 -7807 -7529 -11025 -2047 -1075 -15124 -5807 -12161 -10478 697 -4847 -5597 -10154 -7997 -6755 -2802
6173 -2802 -13740 -25113 -17148 -7346 -10009 -9229 -11454 -9355 -9436 -3446 -2078 -5061 -2871 -358 -1030
$$ [...]
##END NTUPLES=NMR SPECTRUM
##END=
