##TITLE=Analysis number 314997
Compound Code cc 07101
Book Reference 378/177/2
Project Code adrs
Chemist Name benw
##JCAMPDX= 6.0         $$ Bruker NMR JCAMP-DX V2.0
##DATA TYPE= NMR SPECTRUM
##DATA CLASS= NTUPLES
##ORIGIN= Bruker BioSpin GmbH
##OWNER= NMR
$$ XWIN-NMR		Version 3.5
$$ Wed Nov  2 14:20:46 2005 GMT Standard Time (UT+0h)  MAYBRIDGE\NMR@NMR_250MHZ
##.OBSERVE FREQUENCY= 250.131544655141
##.OBSERVE NUCLEUS= ^1H
##.ACQUISITION MODE= SIMULTANEOUS (DQD)
##.ACQUISITION SCHEME= undefined
##.AVERAGES= 16
##.DIGITISER RES= 18
##SPECTROMETER/DATA SYSTEM= dpx250
##.PULSE SEQUENCE= zg30
##.SOLVENT NAME= DMSO
##.SHIFT REFERENCE= (INTERNAL, DMSO, 0, 16.522)
##AUDIT TRAIL= $$ (NUMBER, WHEN, WHO, WHERE, WHAT)
$$ ##TITLE= Audit trail, XWIN-NMR		Version 3.5
$$ ##JCAMPDX= 5.01
$$ ##ORIGIN= Bruker BioSpin GmbH
$$ ##OWNER= NMR
$$ C:\u/data/dgb/nmr/ADRS/11770/pdata/1/auditp.txt
$$ ##AUDIT TRAIL=  $$ (NUMBER, WHEN, WHO, WHERE, WHAT)
(   1,<2005-11-02 14:20:15.60 +000>,<MAYBRIDGE\NMR>,<NMR_250MHZ>,
      <created by zg, POWCHK disabled, PULCHK disabled
       configuration hash MD5:
       62 19 C7 07 E1 42 D1 B7 37 6C 3D D0 77 39 F9 E6
       data hash MD5: 64K
       E5 A3 03 C2 59 8B 98 00 BB EF 97 BA CF 0A 11 7E>)
(   2,<2005-11-02 14:20:31.46 +000>,<MAYBRIDGE\NMR>,<NMR_250MHZ>,
      <Start of raw data processing
       ef LB = 0.3 FT_mod = 6 PKNL = 1 SI = 32K 
       data hash MD5: 32K
       17 B9 59 87 FB 0B C2 3C 35 50 A8 CF 4C 3A E3 52>)
(   3,<2005-11-02 14:20:33.55 +000>,<MAYBRIDGE\NMR>,<NMR_250MHZ>,
      <apk 
       data hash MD5: 32K
       3F 6C D6 88 DF F3 A2 0C 6F B4 38 A4 CF A0 60 B1>)
(   4,<2005-11-02 14:20:34.83 +000>,<MAYBRIDGE\NMR>,<NMR_250MHZ>,
      <abs ABSG = 5 
       data hash MD5: 32K
       02 77 3F C8 F7 FC AA 88 D7 E3 95 02 47 31 FF 97>)
$$ ##END=
$$ 
$$ hash MD5
$$ 6B 5B 88 73 70 94 3E C3 9B 5E C2 7B AC 4E 37 3A
##$RELAX= 
##$RELAX= 
##$RELAX= 
##$RELAX= 
##$RELAX= 
##$RELAX= 
##$RELAX= 
$$ Bruker specific parameters
$$ --------------------------
##$DU= <C:\u>
##$EXPNO= 11770
##$NAME= <ADRS>
##$PROCNO= 1
##$TYPE= <nmr>
##$USER= <dgb>
##$AMP= (0..31)
100 100 100 100 100 100 100 100 100 100 100 100 100 100 100 100 100 100 
100 100 100 100 100 100 100 100 100 100 100 100 100 100 
##$AQSEQ= 0
##$AQ_mod= 3
##$AUNM= <au_zg>
##$AUTOPOS= <29 >
##$BF1= 250.13
##$BF2= 250.13
##$BF3= 250.13
##$BF4= 250.13
##$BF5= 500.13
##$BF6= 500.13
##$BF7= 500.13
##$BF8= 500.13
##$BYTORDA= 1
##$CFDGTYP= 0
##$CFRGTYP= 5
##$CHEMSTR= <none>
##$CNST= (0..31)
1 1 145 1 1 1 1 1 1 1 1 1 1 1 1 1 1 1 1 1 1 1 1 1 1 1 1 1 1 1 1 1 
##$CPDPRG= <>
##$CPDPRG1= <>
##$CPDPRG2= <>
##$CPDPRG3= <>
##$CPDPRG4= <mlev>
##$CPDPRG5= <mlev>
##$CPDPRG6= <mlev>
##$CPDPRG7= <mlev>
##$CPDPRG8= <mlev>
##$CPDPRGB= <>
##$CPDPRGT= <>
##$D= (0..31)
0 1 0 0 0 0 0 0 0 0.06 0 0 0 0 0 0 0.0002 0 0 0 0 0 0 0 0 0 0 0 0 0 0 
0 
##$DATE= 1130941214
##$DBL= (0..7)
120 120 120 120 120 120 120 120 
##$DBP= (0..7)
150 150 150 150 150 150 150 150 
##$DBP07= 0
##$DBPNAM0= <>
##$DBPNAM1= <>
$$ [...]
##$SUBNAM7= <"">
##$SUBNAM8= <"">
##$SUBNAM9= <"">
##$SW= 20.6930455092707
##$SWIBOX= (0..15)
0 0 3 0 0 0 0 0 0 0 0 0 0 0 0 0 
##$SW_h= 5175.983436853
##$TD= 65536
##$TD0= 1
##$TE= 296.16
##$TE2= 300
##$TE3= 300
##$TEG= 300
##$TL= (0..7)
0 120 120 120 120 120 120 120 
##$TP= (0..7)
150 150 150 150 150 150 150 150 
##$TP07= 0
##$TPNAME0= <>
##$TPNAME1= <>
##$TPNAME2= <>
##$TPNAME3= <>
##$TPNAME4= <>
##$TPNAME5= <>
##$TPNAME6= <>
##$TPNAME7= <>
##$TPOAL= (0..7)
0.5 0.5 0.5 0.5 0.5 0.5 0.5 0.5 
##$TPOFFS= (0..7)
0 0 0 0 0 0 0 0 
##$TUNHIN= 0
##$TUNHOUT= 0
##$TUNXOUT= 0
##$USERA1= <user>
##$USERA2= <user>
##$USERA3= <user>
##$USERA4= <user>
##$USERA5= <user>
##$V9= 5
##$VALIST= <valist>
##$VCLIST= <CCCCCCCCCCCCCCC>
##$VD= 0
##$VDLIST= <DDDDDDDDDDDDDDD>
##$VPLIST= <PPPPPPPPPPPPPPP>
##$VTLIST= <TTTTTTTTTTTTTTT>
##$WBST= 1024
##$WBSW= 4
##$XGAIN= (0..3)
0 0 0 0 
##$XL= 0
##$YL= 0
##$YMAX_a= 451457
##$YMIN_a= -380064
##$ZGOPTNS= <>
##$ZL1= 120
##$ZL2= 120
##$ZL3= 120
##$ZL4= 120
##$ABSF1= 16.522
##$ABSF2= -4.171173
##$ABSG= 5
##$ABSL= 3
##$ALPHA= 0
##$AQORDER= 0
##$ASSFAC= 0
##$ASSFACI= 0
##$ASSFACX= 0
##$ASSWID= 0
##$AUNMP= <proc_1d>
##$AZFE= 0.1
##$AZFW= 0.1
##$BCFW= 0
##$BC_mod= 0
##$BYTORDP= 0
##$COROFFS= 0
##$CY= 12.5
##$DATMOD= 1
##$DC= 0
##$DFILT= <>
##$DTYPP= 0
##$F1P= 14.0000005364418
##$F2P= -0.99999901652339
##$FCOR= 0.5
##$FTSIZE= 32768
##$FT_mod= 6
##$GAMMA= 0
##$GB= 0
##$INTBC= 1
##$INTSCL= 1
##$ISEN= 128
##$LB= 0.3
##$LEV0= 0
##$LPBIN= 0
##$MAXI= 10000
##$MC2= 0
##$MEAN= 0
##$ME_mod= 0
##$MI= 0
##$NCOEF= 0
##$NC_proc= -5
##$NLEV= 6
##$NOISF1= 0
##$NOISF2= 0
##$NSP= 0
##$NTH_PI= 0
##$NZP= 0
##$OFFSET= 16.522
##$PC= 1
##$PHC0= 66.42309
##$PHC1= 8.035619
##$PH_mod= 1
##$PKNL= yes
##$PPARMOD= 0
##$PSCAL= 4
##$PSIGN= 0
##$REVERSE= no
##$SF= 250.13
##$SI= 32768
##$SIGF1= 0
##$SIGF2= 0
##$SINO= 400
##$SIOLD= 32768
##$SREGLST= <1H.DMSO>
##$SSB= 0
##$STSI= 32768
##$STSR= 0
##$SW_p= 5175.98343685301
##$SYMM= 0
##$S_DEV= 0
##$TDeff= 65536
##$TDoff= 0
##$TI= <Analysis number 999999
Compound Code 99
Book Reference 9
Project Code 9>
##$TILT= no
##$TM1= 0
##$TM2= 0
##$TOPLEV= 0
##$USERP1= <user>
##$USERP2= <user>
##$USERP3= <user>
##$USERP4= <user>
##$USERP5= <user>
##$WDW= 1
##$XDIM= 32768
##$YMAX_p= 474167122
##$YMIN_p= -938394
$$ End of Bruker specific parameters
$$ ---------------------------------
##NTUPLES= NMR SPECTRUM
##VAR_NAME=  FREQUENCY,     SPECTRUM/REAL,   SPECTRUM/IMAG
##SYMBOL=    X,             R,               I
##VAR_TYPE=  INDEPENDENT,   DEPENDENT,       DEPENDENT
##VAR_FORM=  AFFN,          ASDF,            ASDF
##VAR_DIM=   32768,         32768,           32768
##UNITS=     HZ,            ARBITRARY UNITS, ARBITRARY UNITS
##FACTOR=    0.157963299565203, 1,           1
##FIRST=     4132.6476996994, 0,             0
##LAST=      -1043.33573715361, 0,           0
##MIN=       -1043.33573715361, -938394,     0
##MAX=       4132.6476996994, 474167122,     0
$$ Real data points
##PAGE= N=1
##DATA TABLE= (X++(R..R)), XYDATA
$$ [...]
24912f5963R33J07818o619j15349n6356R8756P4920J0330o6412j64643j51258
24901c33843j52947o166L2999J33198M3166o8600q7049j9800K06211k8670J14213
24890a67288R5659k22919M1768J35029Q758J31970Q9666r1421k8192k15954m0627
24879b63551j45001q6900K58331J21251l0842R1088j38582j79991P4881J32824
24869a66492r627K62215n8424j67965o0351Q471o8824J02340J25249L7396j80347
24858a76359o4254n393Q6048J38665o2060k02670J48628o3944k92446M3133N3895
24847c96757r5101j28559l1619M72996L82873J14921J00887j50286j49551j55210
24837c5406P1224m2110q9073l36358L5765K89415J58043J2381j59578K30287J71854
$$ plain form
24912 -65963 -65030 42788 36169 -79180 -135536 -36780 38140 48470 -17942 -182585 -333843
24901 -333843 -486790 -492956 -459957 -326759 -283593 -352193 -439242 -459042 -252831 -281501 -167288
24890 -167288 -71629 -294548 -252780 -117751 -108993 22977 112643 21222 -6970 -222924 -263551
24879 -263551 -408552 -495452 -237121 -115870 -146712 -55624 -194206 -374197 -299316 -166492
24869 -166492 -176119 86096 27672 -140293 -200644 -192173 -260997 -158657 -33408 3988 -176359
24858 -176359 -240613 -246006 -159958 -21293 -83353 -286023 -137395 -201339 -493785 -450652 -396757
24847 -396757 -491858 -620417 -652036 -179040 203833 318754 419641 269355 119804 -35406
24837 -35406 35818 -6292 -95365 -431723 -395958 -106543 51500 63881 -95697 134590 306444
24826C06444j85294l49332p3328Q3390K53743L7219L0772l6732l6744N9386m4919
24815D4605j78671Q0843J21562J3091P2102J67887l48846j93812j2219j7371K00590
24804e0239L67590J25546j84273m5155j0122j85662L5667j4173J19532N9891k13186
24793E416n6637J2524p0772r7903k56329L57337J75898r2044j74291j51976q4615
24782d33392J29685n3162L9278Q3936J54771J43388j00732j10928j95161M251
24772c38066J68508m5482N7985L52545n2994o6640k17533j11642K66207K23366
24762B36254P1136r6818j97575n5302J80690o9797k13993K063K03089J10857Q7073
24751B57677m8184k04491k03730J25697R8545J16350n1828L4695j18473J20315
$$ plain form
24826 306444 121150 -228182 -301510 -218120 35623 72842 103614 66882 30138 89524 44605
24815 44605 -134066 -53223 68339 81430 153532 321419 -27427 -221239 -233458 -250829 -50239
24804 -50239 317351 442897 258624 213469 203347 17685 53352 39179 158711 218602 5416
24793 5416 -51221 -38697 -109469 -207372 -463701 -106364 69534 -22510 -196801 -348777 -433392
24782 -433392 -303707 -356869 -317591 -233655 -78884 64504 -36228 -147156 -342317 -338066
24772 -338066 -169558 -215040 -157055 195490 142496 75856 -141677 -253319 12888 236254
24762 236254 307390 210572 12997 -42305 138385 68588 -145405 -143342 59747 170604 257677
24751 257677 209493 5002 -198728 -73031 25514 141864 90036 124731 6258 126573
24741A26573j2116j90850J8316K7608O1114j29518j30759k10283J16529P5440
24731b47946j32001J61433J63170j27317j85091K207L6808o6674Q0349J03765
24721b11297J43835N7102n6551M3599K866o3562K36440K95229j58492j5856l4169
24710B39144j3251J13595k83479k71978m9874J08178M8222K08678l7323j10568
24700d8656R1159J41826n2722j56292J39396J56398K94477M9195o731M2654j64531
24689D86173k42053j32018l17361k88914M4549J19826J15707J50944L56225N2270
24679C45348k42660k71699J25174J07554M7748m6970J12846j97673j7617J21387
24669H3438K11889j89950k85559o5404q8588J18181J89118n7123N8152K55662
$$ plain form
24741 126573 114457 -76393 -58077 -30469 30645 -98873 -229632 -439915 -323386 -247946
24731 -247946 -379947 -218514 -55344 -182661 -367752 -365545 -328737 -395411 -315062 -211297
24721 -211297 -67462 -10360 -66911 -23312 -20446 -84008 152432 447661 289169 273313 239144
24710 239144 225893 339488 56009 -215969 -265843 -157665 -109443 99235 61912 -48656
24700 -48656 42503 184329 131607 -24685 114711 271109 565586 614781 608050 650704 486173
24689 486173 244120 112102 -205259 -494173 -449624 -329798 -214091 -63147 293078 345348
24679 345348 102688 -169011 -43837 63717 111465 64495 177341 -20332 -37949 83438
24669 83438 295327 105377 -180182 -245586 -334174 -215993 -26875 -83998 -25846 229816
24659B29816l3185n044o1017L159M9909j87324j25019J55546O720j57649k43313
24648c67401k729J25806M7472Q8489O438j66937k4354k2417L5268R935K04608
24637f5822J99351J38807j83078j64773J8302j46843q91J89096J75987k10670
24627e0534j02238K04844k1398j05774n2426J45700P0515r5j91175j68199R0687
24616a80093P751p745J54764Q107k13740l8776k0964L2314l5503N5689K3143P096
24604b07957j7188m2659k47544O2126K29114J23229J44976m0130q3366j15872
24594a95271r938J47519J09208j26196k2160n3925J55485O1809k5552j61624j72169
24583b92814j20480j40719K7426R2033L8090J71572K2731J67802k3765o6576q0850
$$ plain form
24659 229816 196631 191587 130570 133729 183638 -3686 -128705 26841 33561 -124088 -367401
24648 -367401 -370130 -244324 -196852 -108363 -101925 -268862 -293216 -315633 -280365 -270430 -65822
24637 -65822 133529 272336 89258 -75515 -57213 -204056 -204947 -15851 160136 -50534
24627 -50534 -152772 52072 30674 -75100 -127526 18174 88689 88594 -102581 -270780 -180093
24616 -180093 -172342 -180087 -25323 -17216 -230956 -269732 -290696 -258382 -293885 -238196 -215053 -207957
24604 -207957 -225145 -267804 -515348 -453222 -224108 -100879 44097 3967 -79399 -195271
24594 -195271 -205209 -57690 51518 -74678 -96838 -150763 4722 66531 40979 -120645 -292814
24583 -292814 -413294 -554013 -526587 -434554 -396464 -224892 -202161 -34359 -58124 -124700 -205550
24572b05550O062M2223L4297K36179r2168J91316P9763q5280j69098p3871N6019
24561A9892M4204J76615k2547j60260J43737o8261k84898J36388J71092L414j70445
24550a1069k09401j01699J6855J25750J85257M4390q1226n2985L6501K04126n992
24539A50507k9887p369P3401m3422p7056j68953j34090J88264p7902O7961n6670
24528a15216l2421j35886J23605K31358K05558L5276r0980o6910k03707j40716
24518a90039J11600j8843J0913r8758J35931r3680K63383J2983j68408N321q5233
24507a14830L6155J89320n7821q6442j08888L9317Q3991M7179j08195J58182j68539
24496i0571P3304m4642N1632J3813k37219k14176K9104L52588J16926k52703R8848
$$ plain form
24572 -205550 -199488 -157265 -122968 113211 21043 212359 292122 206842 37744 -36127 19892
24561 19892 64096 240711 218164 57904 201641 133380 -151518 -15130 155962 159376 -11069
24550 -11069 -220470 -322169 -305314 -179564 5693 50083 -31143 -84128 -47627 156499 150507
24539 150507 120620 113251 186652 143230 66174 -102779 -236869 -48605 -126507 -58546 -115216
24528 -115216 -147637 -283523 -159918 71440 276998 312274 221294 154384 -49323 -190039
24518 -190039 -78439 -97282 -86369 -185127 -49196 -142876 120507 133490 -34918 -29597 -114830
24507 -114830 -78675 110645 52824 -33618 -142506 -103189 -19198 27981 -80214 77968 -90571
24496 -90571 -17267 -61909 -10277 3536 -233683 -447859 -418755 -66167 50759 -201944 -103096
24485a03096M6170K26933l171j34408J81676P2618Q6127j39807k12979k06659
24475a86596M4353Q8023j5714J73384M6267K95049J49885n9207k53539l75219
24465i3314j30736J89360j96765J05763J25709n9975n775R7285j68199J50796
24455A4149M8443J40233P8515k43859k78999l01027J61792K35979K66664L0129
24445A52019j41629j75415M7156J90234j8853p8380n3924J01397J83552o2796
24435A43361j27683Q8582K84174K2270n7770k40628j96595j06067J0691k4476
24425b04141M5502N7841q9519k80083q7486R8846K46418J54759l3468j64323J28824
24414a26830J2760P5928j47354J11699K44802R6334k86684l14353m4056J32936
$$ plain form
24485 -103096 -56926 170007 166836 32428 214104 286722 372849 233042 20063 -186596
24475 -186596 -142243 -54220 -69934 103450 149717 444766 594651 535444 281905 -93314
24465 -93314 -224050 -34690 -231455 -125692 17 -59958 -65733 31552 -136647 14149
24455 14149 62592 202825 281340 37481 -241518 -542545 -380753 -144774 121890 152019
24445 152019 10390 -165025 -117869 72365 53512 -24868 -78792 22605 206157 143361
24435 143361 15678 104260 388434 410704 352934 112306 -84289 -190356 -179665 -204141
24425 -204141 -158639 -100798 -190317 -470400 -557886 -459040 -212622 -57863 -91331 -255654 -126830
24414 -126830 -114070 -38142 -185496 -73797 171005 267339 -19345 -333698 -377754 -244818
24404b44818J46089J28789J79968j63365j53923N2279J57405m8535P0151J64491
24394B88531J02483j02454k646J7021j1746j76509J99991J04354j63175j69883
24384H5967J81389O5870j47812p7838O1447j47502J726J15615N4230J74133k10703
24373A56522r1849M1752j76217j09920j14037m3903R1151J30072j51779J70424
24363i7784J5630j03994N0727l558j592J58335l55q1206j57990j6297M06669J71088
24351C39673K9826l99225j5512o4998J52724p512J02544J85261k9353k75539r5371
24340g7482j29738J635L3348J29004J62205p2237n2951r9261K22893o5708j00632
24329d8924j07662J03652J2744j32417K5343k3511K42836J11606n4343p4856j75366
$$ plain form
24404 -244818 -98729 30060 210028 46663 -107260 -54981 102424 53889 124040 288531
24394 288531 391014 288560 285914 302935 291189 114680 314671 419025 255850 85967
24384 85967 267356 333226 185414 107576 169023 21521 23247 138862 193092 367225 156522
24373 156522 64673 106425 -69792 -179712 -293749 -337652 -246501 -116429 -268208 -97784
24363 -97784 -82154 -186148 -135421 -138979 -140571 17764 17409 -63797 -221787 -238084 168585 339673
24351 339673 369499 -29726 -45238 -110236 42488 34976 137520 322781 293428 17889 -77482
24340 -77482 -207220 -205585 -172237 -43233 118972 46735 -6216 -105477 117416 51708 -48924
24329 -48924 -156586 -52934 -40190 -172607 -147264 -170775 72061 183667 129324 54468 -120898
24318a20898J09702K01251q8112K5263R558j26711J90206R6705J29868J9150o4979
24307C81003j62011R337r1984m8882k2473J3618j42049O3972l5397M37n3279K44526
24295A56818j07618j57873l12776L4687J28247r849q4282K4875k2526K40007K55640
24284A45350J12089m3393q5538l443l4759J35575j52706K4861J89689L7278q0367
24273B44636O0748q8647j31565K16391r3843k87737k04443J21505K60345J86011
24263B83401j69834P6439m500k19578j24138Q669n8817l4441M8212K18196J33814
24252A57423k74910k54775J06032K82242j34946m2438k54327M6427L06324q0684
24242a43632j43305j21232j87109j518Q531N2267J40667J305o7865J08595L02692
$$ plain form
24318 -120898 -11196 190055 101943 127206 136764 10053 200259 296964 426832 445982 381003
24307 381003 218992 228329 136345 87463 64990 78608 -63441 531 -34866 -34429 -87708 156818
24295 156818 49200 -108673 -421449 -386762 -258515 -268364 -352646 -327771 -350297 -110290 145350
24284 145350 257439 214046 128508 125065 90306 225881 73175 98036 287725 325003 244636
24273 244636 305384 216737 85172 301563 207720 -80017 -284460 -162955 97390 283401
24263 283401 113567 190006 185506 -34072 -158210 -149541 -208358 -242799 -194587 23609 157423
24252 157423 -117487 -372262 -266230 16012 -118934 -161372 -415699 -369272 -62948 -143632
24242 -143632 -286937 -408169 -595278 -596796 -588265 -535998 -395331 -394026 -461891 -353296 -50604
24231e0604J01722k0366o006J46546N5565j8191p0565l94903m2823J15425K1254
24220a62946N8183K75911J958k44994m39932r4607J32393J77692L01562M2338
24210D7558o7714K67486O3829j63184n6101o1368r9514J71118q5848k42439j60144
24199c86321R159J16764J13376Q823p9438j6973j71975L674Q5995J13448j8332
24188b21800K279j24060J04732J30064r8089j45848L3345J33751K81695l9220
24178E6849K21653k75350j21486N3308J35793q2741j40531M6465N8331J04586
24168E6877J11847p4307J48869m6348M6994j67133m2827O0644n7130j51959k4174
24157a38647M8268K6793P6115K1201k08198j3671Q4471R0621j32466M999k6050
$$ plain form
24231 -50604 51118 30752 24746 171292 226857 208666 138101 -256802 -299625 -184200 -162946
24220 -162946 -104763 171148 173106 -71888 -511820 -606427 -474034 -296342 5220 47558
24210 47558 -20156 247330 311159 147975 91874 30506 -69008 102110 16262 -226177 -386321
24199 -386321 -377162 -260398 -147022 -138199 -217637 -234610 -406585 -402911 -316916 -203468 -221800
24188 -221800 -219521 -343581 -238849 -108785 -206874 -352722 -319377 -185626 96069 56849
24178 56849 278502 3152 -118334 -65026 70767 -11974 -152505 -106040 -47709 56877
24168 56877 168724 94417 243286 196938 243932 76799 33972 94616 37486 -114473 -138647
24157 -138647 -90379 -63586 12529 33730 -174468 -188139 -103668 -13047 -145513 -140514 -166564
24146a66564J95087k7210k26022j45731J07147J5090m7767Q8844K97148j36238
24136d6216J05074K48320j05963j64765J5991j4342J95585m7076J7732K2508N7742
24125B84590k12956j72195p6106P7220P7595m2964l5010J14008K98702P49j81500
24114A32133q9364q052k9532J90371Q8973n6737O3743k4242R0833k0189j53174
24103A84763k45271j59978J12785O3707k11860p3698R7734J22599k08440o3764
24093c81423J22103J70747K3754j96478j72601O7692R7690J08060k75950j812
24083d38218J60868m191Q7836p2142J52568m8175L3156L8285K972k8849Q6300
24072b9590J7073j0065j54825r7857K49203j72376J7509L90366j19298l8265l7878
$$ plain form
24146 -166564 28523 1313 -224709 -370440 -263293 -248203 -295970 -207126 90022 -46216
24136 -46216 58858 307178 201215 36450 52441 38099 233684 186608 204340 226848 284590
24125 284590 71634 -100561 -176667 -99447 -21852 -64816 -99826 14182 312884 313633 132133
24114 132133 42769 34717 5185 195556 284529 227792 291535 267293 358126 337937 184763
24103 184763 -60508 -220486 -107701 -43994 -255854 -329552 -231818 -109219 -317659 -381423
24093 -381423 -259320 -88573 -64819 -261297 -433898 -366206 -268516 -160456 -436406 -438218
24083 -438218 -277350 -281541 -193705 -265847 -113279 -161454 -128298 -90013 -87041 -115890 -29590
24072 -29590 -12517 -22582 -177407 -275264 -26061 -198437 -180928 209438 90140 51875 13997
24061A3997J12090o5947p370p0212l5886K7928K1132n2237J28683N2858J39120
24050B64156j36933j75735K76132k2979j525R2696J38359k17165O077j12196k50025
24039a39138q3229J02306N9338O6441r1978M058J90261j93529k79807J26505O6327
24028a72445q636j60451J06350K878q9373Q4394M0125j3204k7071j22330J53639
24017b06124L75000N6630q9014J3943j07009j36694l963j55966O3795O3448k9673
24006a55627K91213J6709n1918j24502P863J97519n7388K1349J64220n9779l69392
23995a19733k83811O6759R780j5058J8856R8840R0235O3969P7454K17397P240
23984B31928j74515r7486k0418M0811q2548j50037L7558m5330J07411J61136l40475
$$ plain form
24061 13997 126087 60140 52770 -17442 -53328 -25400 -4268 -56505 72178 125036 264156
24050 264156 127223 -48512 227620 204641 203116 295812 434171 217006 223083 110887 -139138
24039 -139138 -222367 -120061 -60723 5718 -86260 -82202 108059 -85470 -365277 -238772 -172445
24028 -172445 -181081 -341532 -235182 -232304 -321677 -237283 -197158 -210362 -237433 -359763 -206124
24017 -206124 168876 225506 136492 150435 43426 -93268 -97231 -253197 -189402 -125954 -155627
24006 -155627 135586 152295 100377 -24125 -16262 181257 123869 145218 309438 249659 -119733
23995 -119733 -403544 -336785 -327005 -342063 -323207 -224367 -134132 -70163 7291 224688 231928
23984 231928 57413 -40073 -60491 -19680 -102228 -252265 -214707 -260037 -152626 8510 -331965
23973c31965j06047J53273K00618j11254L8151L3571k5116J4915J28675o1562
23963f6741j36378P3586J70374j09201K4363J32659o1384o2013j45739N2392o6640
23952a94722r8889o1702K90336n8635J44497J95354l54967m2903P5005K19489
23942A12863L0888L8737M5730j48856j81911j10495J66401q286M6888Q0305k9917
23931D2347o3214N0370J087j75887j16830M3650J8129j35145K55944K28644n5590
23920I3505J29716J23761o311n7484n453o941L3886k34484k79461M3973J1937
23909a53356L6538L27344R1889k49970n3907j8878p7977J00619p7779p6628P6404
23898g5701m0063K5791J10911J44062Q0403p2526n9291p3592O456J73222J3320
$$ plain form
23973 -331965 -438012 -284739 -84121 -195375 -157224 -123653 -148769 -133854 -5179 -66741
23963 -66741 -203119 -129533 40841 -68360 -43997 88662 27278 -34735 -180474 -128082 -194722
23952 -194722 -293611 -355313 -64977 -123612 20885 216239 -138728 -181631 -106626 112863
23942 112863 143751 182488 228218 79362 -102549 -213044 -46643 -54929 -8041 72264 42347
23931 42347 -20867 29503 30590 -145297 -262127 -218477 -200348 -335493 -79549 149095 93505
23920 93505 223221 346982 340671 283187 277734 270793 304679 70195 -209266 -165293 -153356
23909 -153356 -116818 210526 302415 52445 -1462 -20340 -98317 2302 -75477 -152105 -75701
23898 -75701 -115764 -89973 20938 165000 245403 172877 113586 39994 46450 219672 232992
23887B32992r6108l4306o5277O1366J15097j6749j7097o3530k14388k31929R1389
23876b38540K30197r7027r4290J4231k34869K3354J24940J9380J0306Q3156K715
23865a56447P6137k8400J93587J36618L7192P9851k07561j67481l6426P8394K13164
23854B18628o173l49324o8790j14129m8273J25645J68172J34288k7136j40660
23844a07752r808j38886r0619J16136J00854j32312j30436J41873L34216k6259
23834E7007p2221J05882m8022j09727j3954P1290P6294j2271K87010o1618j58633
23823A21037j61008M9018k5137K27611J38390N8519j69426j46621j87732k34173
23813c29522N0250j4015K0014Q1165K20715j0254j19419q7931J34950J15445J06241
$$ plain form
23887 232992 136884 102578 37301 98667 213764 197015 179918 116388 -98000 -329929 -238540
23876 -238540 -8343 -105370 -199660 -185429 -420298 -396944 -272004 -252624 -242318 -159162 -156447
23865 -156447 -80310 -108710 84877 221495 258687 338538 130977 -36504 -72930 5464 218628
23854 218628 212455 -136869 -205659 -319788 -368061 -242416 -74244 60044 32908 -107752
23844 -107752 -117560 -256446 -347065 -230929 -130075 -262387 -392823 -250950 83266 57007
23834 57007 -15214 90668 42646 -67081 -81035 -9745 66549 54278 341288 279670 121037
23823 121037 -39971 9047 -16090 211521 349911 408430 239004 92383 -95349 -329522
23813 -329522 -279272 -293287 -273273 -192108 28607 18353 -101066 -188997 -54047 61398 167639
23802A67639o758j61304j57741J24699j0716j60634n7404k4699r9072J04215J88128
23791i3647o0392j76603L8926Q6983l7215R7785n2971j76507L3394K61973J24877
23780D6603N4581O1289k4285P6752j17442k74187k121K33907j4693k26342k58666
23769d44604K02409j2534q6092P3543R7201j5600M2442N7446K4035M7372j05073
23758a19455n6166J9099J0774O9576j54442J36804j53182j8731m378J59819m7073
23747a57355o7469N1930J97647K2537j9074j2741n8133j14791J72934p3086o3571
23736a21172O3952L98622o4489k9930j34822j39802J25188O723r7920j6329K00364
23725A90385j72522k68178k36044P0409M11390L4292p0287R9695k4177j8898J0155
$$ plain form
23802 167639 160881 -423 -158164 -33465 -44181 -204815 -262219 -286918 -385990 -281775 -93647
23791 -93647 -154039 -330642 -291716 -204733 -241948 -144163 -197134 -373641 -340247 -78274 46603
23780 46603 101184 162473 138188 214940 97498 -176689 -178810 55097 40404 -185938 -444604
23769 -444604 -242195 -254729 -340821 -267278 -170077 -185677 -143235 -85789 -61754 -14382 -119455
23758 -119455 -175621 -156522 -145748 -76172 -230614 -93810 -246992 -265723 -270101 -110282 -157355
23747 -157355 -224824 -172894 24753 47290 28216 15475 -42658 -157449 15485 -57601 -121172
23736 -121172 -57220 341402 276913 246983 112161 -27641 97547 104270 6350 -9979 190385
23725 190385 17863 -250315 -486359 -415950 -4560 29732 -40555 59140 34963 16065 26220
23714B6220m5977j09666J9326k4624l3022P6054K69997K9940j59208j83207l149
23703a37316N9815P3468p5167J1926j94284l4312r235K13105R9585l23656k60786
23692e76857Q6878J41134J50134K58028K77232O5022J67292j71077o7993q0915
23682B48878j25550k6786M8706j49384o3071j7710m5358K0554r0185N8254J36694
23671d958Q1286K24601L7335k24371l59261p1159L00409Q2694l72254j00865o840
23660d13383K08684K88314J32420J3955j24428p0301O5836j0790k30520p1884
23650b12097O9447J37162J5102N2839m670j37598j03186K34699o2393J792Q5920
23639G7017K7965k94919j37807m9557J66644J14025k0677k11485M3557L12681
$$ plain form
23714 26220 -19757 -129423 -110097 -134721 -167743 -91689 178308 208248 49040 -134167 -137316
23703 -137316 -77501 -4033 -79200 -67274 -261558 -295870 -305105 -92000 7585 -316071 -576857
23692 -576857 -489979 -348845 -198711 59317 336549 401571 568863 397786 329793 248878
23682 248878 123328 96542 145248 -4136 -67207 -84917 -130275 -109721 -199906 -141652 -4958
23671 -4958 76328 300929 338264 113893 -245368 -316527 -16118 66576 -305678 -406543 -413383
23660 -413383 -204699 83615 216035 229990 105562 35261 101097 90307 -140213 -212097
23650 -212097 -142650 -5488 9614 62453 57783 -79815 -183001 51698 -10695 -8903 77017
23639 77017 104982 -189937 -327744 -377301 -210657 -96632 -117309 -328794 -285237 27444
23629B7444p7087k51348N9757K7073j59487O2860L48935K03073J1663j33662j25686
23618f465l5067r2670j15002q9363J9403K22539K15694K50984J24015k21383l64031
23607i1346j73813n0227q2110K85652J45626K76343L1593p4046J94340k42562
23597B19450J0520O7381m7229r1291q1904n6525r5833j14682L3897L46989J08700
23586B99473n427j85485j37578L5470K3975j54983P580Q7397L2235j50821j6912
23575a65076N415O6624m6975j27429M7434o6023J03410K89726k43653q594J31569
23564a3572J07552j53601K6843K09717J24468j51024j56991k32567J18477J39018
23554A8320n6294J7456L0159q3999R170n6431j325R6042k1835j79065J11302p4815
$$ plain form
23629 27444 -49643 -300991 -241234 -214161 -373648 -310788 38147 241220 252883 119221 -6465
23618 -6465 -41532 -134202 -249204 -338567 -319164 -96625 119069 370053 494068 272685 -91346
23607 -91346 -265159 -315386 -397496 -111844 33782 310125 341718 267672 462012 219450
23597 219450 229970 297351 250122 158831 76927 20402 -75431 -190113 -156216 190773 299473
23586 299473 294046 108561 -29017 6453 30428 -124555 -116975 -29578 2657 -148164 -165076
23575 -165076 -159661 -93037 -140012 -267441 -220007 -286030 -182620 107106 -136547 -145141 -13572
23564 -13572 93980 -59621 -32778 176939 301407 150383 -6608 -239175 -120698 18320
23554 18320 -37974 -20518 9641 -74358 -65188 -121619 -122944 -26902 -48737 -227802 -116500 -191315
23542a91315M8016p0541Q9361N7657J1771j5513j54349l4118R521L1892K4477
23531a93141K548M9079M0797J42592K06553P3837j87404p4126o7442q6788j49959
23520b43454l3658K0661j44531J29036J64375o1341r4588J42772O6924p2898Q6845
23509c9857J79409o7080k4690M5620N9212k88335q1404K36590Q8704M6447j04579
23498E0037j42993p9527p6536Q5997R7785j02662p6201J65610K84581J9525J36752
23487C62368m8791j01614k45823o1195K61713o102j29115k54028K09918K92461
23477B79792J07665k07023k82953l52637J70047M08060K07329j13812l54096j9749
23467a57377K23771O1192M2774j69445j55118k1488P2886j20513R5254K75438
$$ plain form
23542 -191315 -143299 -213840 -124479 -66822 -55051 -70564 -224913 -259031 -249510 -217618 -193141
23531 -193141 -190593 -141514 -100717 41875 248428 322265 134861 60735 -6707 -93495 -243454
23520 -243454 -277112 -256451 -400982 -271946 -107571 -168912 -263500 -120728 -53804 -126702 -39857
23509 -39857 139552 72472 47782 93402 152614 -135721 -217125 19465 108169 154616 50037
23498 50037 -92956 -172483 -249019 -163022 -65237 -167899 -244100 -78490 206091 225616 362368
23487 362368 313577 211963 -33860 -95055 166658 160556 31441 -222587 -12669 279792
23477 279792 387457 180434 -102519 -455156 -285109 122951 330280 216468 -137628 -157377
23467 -157377 66394 127586 170360 915 -154203 -175691 -102805 -223318 -128064 147374
23457A47374m8069r2063j03612j59460J39202K23669J07383j65697J0256Q8579
23447A47562Q1487M4867m6801j24871O9009N0911p6345K7246K71008j64573k92012
23436a2512J3093M5319q9861j77248J74059Q0778R6899M4604j34681p6116j45094
23425a80760j34704K70109O4274m5074L2377o3006j27070j41582J02546J18496
23415a04394p0179R26j70805j5317L52533J35450j32219p1127N4599r6174o8716
23404a85423L8402L0791J65573N7289n5870k90636M0309J79462P7192m8450Q1503
23393I0142M0828K5887P7768j17226j05464r3350j13605K9246k1753J13182J04264
23382B9919r5048O5761J60152J29343Q5598m0316L2970N719j09142k30845P1454
$$ plain form
23457 147374 99305 7242 -96370 -255830 -116628 107041 214424 48727 58983 147562
23447 147562 229049 273916 227115 102244 171253 222164 145819 173065 444073 279500 -12512
23436 -12512 581 45900 -43961 -221209 -47150 33628 130527 175131 40450 -35666 -180760
23425 -180760 -315464 -45355 18919 -26155 6222 -56784 -183854 -325436 -222890 -104394
23415 -104394 -174573 -173647 -344452 -359769 -7236 128214 -4005 -75132 -20533 -116707 -185423
23404 -185423 -147021 -116230 49343 106632 50762 -239874 -199565 -20103 57089 8639 90142
23393 90142 130970 156857 234625 117399 11935 -81415 -195020 -165774 -187527 -74345 29919
23382 29919 -65129 632 160784 290127 375725 335409 368379 374098 264956 34111 105565
23371A05565Q6750l92370k89314J43972L61309M7384N776j0248J7536K69068m0538
23360C04890l9184N1897j13624j04330l08422P4370J28710j2060K4604M5232P4685
23349A26768j45016m8389J6502j6285J23920k72429j19864N8280j44761K1155
23339d00119K28993J16978j28389J33829K16224n9143J9349l9995k6613O0869
23329A21983k71092l3569J82837R1896j87568m9482j20049K9726L6538J25756
23319g3024K88261M3383k07295k61732K4157k9158J28445K5428o0705j42307n9324
23308c23871j05591P434L14575K66412j18457j34582j41416Q9264Q4141P2129
23298A0038J3748j0856j25616l47418j38585J34305K51729k4669k02941O7573
$$ plain form
23371 105565 192315 -200055 -489369 -345397 15912 63296 69072 58824 76360 345428 304890
23360 304890 265706 317603 203979 99649 -208773 -134403 -5693 -17753 6851 52083 126768
23349 126768 -18248 -66637 -50135 -66420 57500 -214929 -334793 -276513 -421274 -400119
23339 -400119 -171126 -54148 -182537 -48708 167516 108373 127722 87727 61114 121983
23329 121983 -149109 -182678 159 92055 -95513 -144995 -265044 -235318 -198780 -73024
23319 -73024 215237 258620 51325 -210407 -186250 -215408 -86963 -61535 -122240 -264547 -323871
23308 -323871 -429462 -422028 -107453 158959 40502 -94080 -235496 -146232 -62091 10038
23298 10038 23786 12930 -112686 -460104 -598689 -464384 -212655 -237324 -440265 -372692
23288c72692M3994R8216J80834J30626o6799k30407j48130J6197N7317L86306
23278I5462J33881l1573j25400J05221K8873l7266J47583R1215m6522j21813r0097
23267A49564n2869r3397j63476j9746l0901p8944o2868l1091L76988J64554j10296
23256D7518P0533p5631L1190j62667j50770l6147P6888q5159J54983q6254L4787
23245a80729N1465r9464l6511j92987J85518P3163J20638K8827M9727k3145k03850
23234b27348R967O9928J40113K04673n620j05460k26429k22466n3216K67978J52611
23223D731J25896O6860j32452Q7300n7792j03515J2990k31315N8393J93581L4144
23212E8821M9019j29539p8686J54024J44068L5792L5517k36843j03648J48044
$$ plain form
23288 -372692 -328698 -230482 -49648 80978 14179 -216228 -364358 -348161 -290844 95462
23278 95462 229343 197770 72370 177591 206464 169198 316781 407996 361474 239661 149564
23267 149564 96695 3298 -160178 -179924 -210825 -289769 -352637 -383728 -6740 157814 47518
23256 47518 118051 42420 73610 -89057 -239827 -275974 -199086 -284245 -129262 -215516 -180729
23245 -180729 -129264 -228728 -265239 -458226 -272708 -199545 -78907 -50080 -353 -23498 -227348
23234 -227348 -217381 -147453 -7340 197333 191713 86253 -140176 -362642 -415858 -147880 4731
23223 4731 130627 197487 65035 152335 94543 -8972 4018 -227297 -168904 24677 58821
23212 58821 107840 -21699 -100385 53639 197707 233499 269016 32173 -71475 76569
23202G6569K6941k5689J25537q2749J31607J88434p4824j57075O334j5720p2329
23191A27036p4131j84676J33557m8061j80501m1810L9152J42104n3215n8326N9135
23180a39736R6302j39815l3162K19101j27687J3732J01875K53161K99337L1723
23170E74831j99640j84018j00441o538O6049L7657j19700j41190L35929K2914
23160B85853l71834l69Q5168q4585l4111K54469r9629q2322R4409J3546j47683
23149h7088l863j21532O9535N0706n755J61041P0647j19213J43332k7319j11781
23138A8710m4014k6191q2766l6895j25457K04301K60932J13743j66062l80931
23128b64630K7669P1571R4774K30703M4948j06617j83100j34853L7287M3766J19096
$$ plain form
23202 76569 103510 77821 203358 120609 252216 440650 365826 208751 215085 199365 127036
23191 127036 52905 -131771 1786 -46275 -226776 -268586 -229434 -87330 -140545 -198871 -139736
23180 -139736 -43434 -183249 -216411 2690 -124997 -111265 -9390 243771 543108 574831
23170 574831 375191 191173 90732 84194 150243 187900 68200 -72990 262939 285853
23160 285853 -85981 -86350 -1182 -85767 -119878 134591 34962 -47360 47049 60595 -87088
23149 -87088 -90951 -212483 -142948 -92242 -97997 63044 133691 14478 157810 130491 18710
23138 18710 -25304 -51495 -134261 -171156 -296613 -92312 168620 282363 116301 -264630
23128 -264630 -236961 -165390 -70616 160087 205035 98418 -84682 -219535 -182248 -138482 -19386
23117a9386J04137J17884J43149k94596k68552J493j27235J7775M270j22246j3146
23106d56453K64770K69262k6592N3918k1777j78675N3436K32052J91277j48797
23096B32421q0065k1877m4372L9050k2000J63242K6517j31493n5481k90737J5629
23085a69166Q4817L5591Q2449j52413M3456Q858K6078L70182r8153p3121o326
23074A52252L0994j12111j36772K32245K4854r9275J25315q0328j5340k4490j5966
23063H1378K5945j34042P7995K0415o0646j08076L5719j04116p2310j08937K11981
23052a34694K93693L2567j5319m4542j25045j0585J14318o1540j93503j95338
23042c39988n8183K36343K44397J08178P3368l47976r9755o0551M2634O5754k7905
$$ plain form
23117 -19386 84751 202635 345784 51188 -217364 -215871 -343106 -325331 -321061 -443307 -456453
23106 -456453 -191683 77579 50987 104905 83128 -95547 -42111 189941 381218 232421
23096 232421 152356 130479 86107 125157 103157 266399 292916 161423 105942 -184795 -169166
23085 -169166 -84349 -48758 33691 -118722 -75266 -66408 -40330 329852 231699 158578 152252
23074 152252 183246 71135 -65637 166608 191462 92187 217502 137174 121834 97344 81378
23063 81378 107323 -26719 51276 71691 11045 -97031 -61312 -165428 -237738 -346675 -134694
23052 -134694 158999 191566 176247 131705 6660 -3925 110393 48853 -144650 -339988
23042 -339988 -398171 -161828 82569 190747 264115 -83861 -183616 -244167 -201533 -135779 -163684
23031a63684K1932q8794J12241N7072K04837p3228k3379l71373r3896o7830J73802
23020c12300Q3564K42571J50201Q2699q9344M3782o2920Q1840p473O6949j6259
23009B63310R7956J84607j23401k88094j35696R9059K397J1016j65510J15262
22999F0906R0181k54199o6918J39454J14970j5440J16151p2225J6917j46688M2437
22988B5546J93745J72510j78293j99879N285p5718J62216j4146k01530k89591
22978c99855j2432L36231J58417O0413j50834n6577P0005r8651n5691j68410J13020
22967b04364K07370K10030K54682P8997o0341k06778k84082q8165r1619q4070
22957b68340J8272K11128K93325J58670j07280J13179Q728L004m00041k37953
$$ plain form
23031 -163684 -141752 -230546 -118305 -61233 143604 70376 46997 -324376 -418272 -486102 -312300
23020 -312300 -228736 13835 164036 246735 157391 201173 138253 220093 212620 279569 263310
23009 263310 361266 545873 422472 134378 -1318 97741 100138 111154 -54356 60906
22999 60906 151087 -103112 -170030 -30576 84394 68954 185105 112880 129797 -16891 25546
22988 25546 219291 391801 213508 13629 18914 -56804 105412 91266 -110264 -399855
22978 -399855 -412287 -76056 82361 142774 -8060 -64637 5368 -93283 -148974 -317384 -204364
22967 -204364 3006 213036 467718 546715 486374 279596 -4486 -92651 -184270 -268340
22957 -268340 -250068 -38940 254385 413055 305775 418954 427682 430686 30645 -207308
22947b07308M524L2560J25075p8897j94849r6421J2118J3095j33823J21372J45167
22936b57387K0652j28700O2570r3438N7342L32454J04690k27950l8839J65052
22926c554m6453l06054J88482K19683L440j7871k56949J40340k5197k86016j38821
22915e28970K05629j8398j59679j22754j02640K73353P7000J22085K71591j10010
22905i2793J64875K17146n5013j64147K3357R4242J01454j46378j38476J68008
22895A72275j79679j32529k5212j02357J35997m7491m1832j07319L6134J65404
22885a26609L07164Q8848k57393n9127K09825j22056j98308j43987J95772j26366
22875b32237J1647J76249m6712k80568J5240J84220N469P5538N3515J56126j06605
$$ plain form
22947 -207308 -202784 -170224 -45149 -124046 -318895 -415316 -403198 -390103 -523926 -402554 -257387
22936 -257387 -236735 -365435 -302865 -396303 -338961 -6507 98183 -129767 -168606 -3554
22926 -3554 -50007 -356061 -167579 52104 55544 37673 -219276 -78936 -104133 -390149 -528970
22915 -528970 -323341 -341739 -501418 -624172 -726812 -453459 -376459 -254374 17217 -92793
22905 -92793 72082 289228 234215 70068 93425 187667 289121 142743 4267 172275
22895 172275 -7404 -139933 -165145 -267502 -131505 -178996 -220828 -328147 -292013 -126609
22885 -126609 180555 269403 12010 -47117 162708 40652 -157656 -301643 -105871 -232237
22875 -232237 -220590 -44341 -91053 -371621 -356381 -172161 -166692 -91154 -37639 118487 11882
22864A1882r3303M4510J05251J17762P1318R8428j15817k52535k3604J1104j11712
22853a36716J96806J51948j27488j46774k22063j19450J23774L79073q2806j86982
22843a70678K43559J39023j44647j8570n0836j51753J9645J6304l2163P4320k27252
22832c03048J14479O6973O8626n3999k9090R2177K02497J3436j49651j01030K82595
22821B03965R1780k05545k45125j3479R1177K49251R5235j85200o6425j18088
22811a02454J22515n6634L5875p2027j52989j58348L8455J47160K25018J97049
22801B23620r7821j90249K9673L37174j27045k97554J37677P026j28826l4076
22791a40401j4013M7623l087R5627j20357j54378J80658k9630j71187m5472n1852
$$ plain form
22864 11882 -81421 -36911 68340 186102 257420 355848 240031 -12504 -36108 -25004 -136716
22853 -136716 60090 212038 84550 -62224 -284287 -403737 -279963 99110 16304 -170678
22843 -170678 72881 211904 67257 48687 -2149 -153902 -134257 -117953 -150116 -75796 -303048
22832 -303048 -188569 -121596 -52970 -106969 -136059 -43882 158615 172051 22400 -78630 203965
22821 203965 295745 90200 -154925 -168404 -77227 172024 267259 82059 15634 -102454
22811 -102454 20061 -36573 -698 -72725 -225714 -384062 -345607 -198447 26571 223620
22801 223620 125799 -64450 -34777 302397 175352 -122202 15475 22501 -106325 -140401
22791 -140401 -154414 -106791 -109878 -14251 -134608 -288986 -108328 -137958 -309145 -354617 -406469
22780d06469K8629L66326R2449J41254p0784n0691j33898o6488K2302R6040J33788
22769A52458j94749j17683R5619j50422k86465J98174K07289J93130J30382P9688
22759C07421Q037j51427j41748Q984K3501J48809J0908N4494O104j15017q983
22748A51083L5272n4404K2693l1611j59493r9672j60088r0687r1855J99006J92488
22737h7268J2149L5025j59860j61387J9190J41211J43606N2975l6600j3724K20418
22726A65735K9379k6821j21275K9370k7701N8699J7847k02817J64374J51608P5297
22715C13695j17125O0861Q800r9077j33194K299p2937J69179P5362m7242j04486
22704E6135j91628n5370P9654K14188L5469l34575k91635p4466R7621J49391J94932
$$ plain form
22780 -406469 -377840 -11514 80935 222189 151405 100714 -33184 -99672 -77370 18670 152458
22769 152458 -42291 -159974 -64355 -214777 -501242 -303068 -95779 97351 227733 307421
22759 307421 315458 164031 22283 31267 54768 203577 214485 268979 275083 160066 151083
22748 151083 186355 131951 154644 123033 -36460 -136132 -296220 -386907 -478762 -279756 -87268
22737 -87268 -75119 -40094 -199954 -361341 -342151 -200940 -57334 -4359 -40959 -54683 165735
22726 165735 195114 168293 47018 76388 48687 107386 125233 -77584 86790 238398 313695
22715 313695 196570 257431 266231 167154 33960 36259 -36678 132501 207863 160621 56135
22704 56135 -135493 -190863 -111209 102979 138448 -196127 -487762 -562228 -464607 -315216 -120284
22693a20284J77864J37630K09407j33028k96189r4230j30237k6826J19896J34095
22683b1902l72300P8790L04479j1664J9006O4981L172j0888J39791j91413j93354
22672a91302j1544J38243J89224o7857j10458k2844J59728K6246o6305J12451
22662A55582r5079k25231K7956Q4959J13417M796j22244P9141K3023P61k1076
22651B6005q1315K2725J59151J72575k46381j60210j13346j6755J71506K0406
22641d5639K2661l1902J5160Q223j43369l86375M5761K55206J51026p8371j50932
22630c38551L2895m2030J64629q3587j18173n6340L5434M6122P3530j3502k3960
22619c23533P1287J4728J01100J16159r4636j25326M3901j53956o509K64238n5640
$$ plain form
22693 -120284 57580 195210 404617 271589 -24600 -118830 -249067 -275893 -155997 -21902
22683 -21902 -394202 -315412 -10933 -22597 -3591 61390 64562 53674 193465 2052 -191302
22672 -191302 -202846 -64603 124621 56764 -53694 -76538 83190 109436 43131 155582
22662 155582 60503 -164728 -136772 -51813 61604 66400 -55844 23297 46320 47081 26005
22651 26005 -55310 -32585 126566 299141 52760 -107450 -220796 -237551 -66045 -45639
22641 -45639 -22978 -54880 -39720 -31497 -174866 -561241 -515480 -260274 -109248 -187619 -338551
22630 -338551 -305656 -347686 -183057 -266644 -384817 -441157 -405723 -359601 -286071 -299573 -323533
22619 -323533 -252246 -237518 -136418 -20259 -114895 -240221 -196320 -350276 -356785 -92547 -148187
22608a48187l16520J47498J84477J8446J12624K6557L3857o6331j46149k18359
22598c72087K28897L03444J59229j35805J3034q5479n5881p0078j21545r056J50203
22587D876J92368J10130n4657n2938l382j46316j83369K9935m1938J29526J63225
22576A47460p1072l5205o1849o460L5341M4832J91075l51767j58048n8057P5629
22565b48121m3418j46258K3064K30100J28059q849L6885j81458l171J18234J07682
22554A2749o4744j20088j1555l0500K6083Q8582J57990K00205J12446n564l6422
22543C29182j04494j50991o5409r0810J06810l8623j7488j43580J43744J59703
22533A28044m122J3165r0751j63950j33822j56769K91361K6685k03970j10683
$$ plain form
22608 -148187 -464707 -317209 -132732 -114286 -1662 24895 58752 -7579 -153728 -372087
22598 -372087 -143190 160254 319483 183678 196712 111233 55352 -14726 -136271 -145327 4876
22587 4876 197244 307374 252717 199779 196397 50081 -133288 -103353 -145291 -15765 147460
22576 147460 76388 41183 -20666 -27126 8215 53047 244122 -107645 -265693 -323750 -248121
22565 -248121 -291539 -437797 -414733 -184633 -56574 -65423 -28538 -209996 -213167 -94933 12749
22554 12749 -51995 -172083 -183638 -214138 -188055 -99473 58517 258722 371168 365604 329182
22543 329182 224688 73697 8288 -82522 24288 -14335 -31823 -175403 -31659 128044
22533 128044 123922 137087 46336 -117614 -251436 -408205 -116844 -90159 -294129 -404812
22523d04812K6908O5042j12233Q1845K90730J57769o189J38137J2105J2221j73612
22512H7911j64807K34789M4733j10307p0908q0321m3838n5890J85385J53532L6554
22501B16833J22993R5584O5584j52378m8058j27249n5336R7611l7509j20376k4256
22490C3443J18630o4189J939L545m7289J16644J85387m9552l58002J03929r9068
22479e4583p0983j7796M8096R5910j9578j4522m069m4969k62904R025P9260o4706
22467c21819R4637L47628J23269j54617P730K81553q6483l60552j41016j6159
22457b25829k6624K24199Q9366j73396j13187K5003J00168J5822p7662J0024R6626
22446e5490Q4303r5939j6924K22249K55888j81963k13540K6546L07931Q9176m9790
$$ plain form
22523 -404812 -377904 -312862 -425095 -343250 -52520 105249 99060 237197 249302 261523 87911
22512 87911 -76896 157893 202626 92319 21411 -58910 -102748 -158638 26747 180279 216833
22501 216833 339826 435410 500994 348616 300558 173309 117973 215584 178075 57699 33443
22490 33443 152073 87884 89823 93368 46079 162723 348110 298558 -59444 44485 -54583
22479 -54583 -125566 -143362 -95266 644 -18934 -33456 -37525 -82494 -345398 -336373 -257113 -321819
22467 -321819 -227182 120446 243715 89098 96828 378381 291898 -68654 -209670 -225829
22457 -225829 -252453 -28254 61112 -112284 -225471 -200468 -100300 -84478 -162140 -152116 -55490
22446 -55490 28813 -67126 -84050 138199 394087 212124 -1416 25130 333061 422237 372447
22435C72447j32973r5253j22351p9134K2265J88929j79066j70548K38632J62969
22425B05917j15335k97368j20782N4427O6050k05397p6522K16310k0874J11765
22415a81809P7367j87228L582J79898P0178J01776j0850o7179Q874Q6656Q0515
22404A61780o060J32017Q2558p8048K19301k26230k74806j08493K64147N8767
22394B24933r5027L6987J89378r9400q8373j17904q9834j20585L1193M691J39386
22383A5445j05762j43315r1186R1887O3488K5346r9284N5111O0182J40013o1158
22372d9233J01618K81450K0789l9786j11853r92r9078J06282k7481J05784J30854
22361D18354n8898j78403j08616L0704j29812j17365j16122J19920j05082K756
$$ plain form
22435 372447 239474 144221 21870 -57264 -34999 153930 -25136 -195684 42948 205917
22425 205917 90582 -206786 -327568 -273141 -207091 -412488 -489010 -272700 -293574 -181809
22415 -181809 -104442 -291670 -288088 -108190 -38012 63764 52914 -14265 -5391 81265 161780
22404 161780 155720 287737 370295 292247 511548 285318 10512 -97981 166166 224933
22394 224933 129906 166893 356271 256871 168498 50594 -39240 -159825 -128632 -123941 15445
22383 15445 -90317 -233632 -324818 -232931 -169443 -144097 -243381 -188270 -128088 11925 -49233
22372 -49233 52385 333835 354624 314838 202985 201993 102915 209197 181716 287500 418354
22361 418354 359456 181053 72437 103141 -26671 -144036 -260158 -140238 -245320 -242564
22351b42564Q9172r46J38750R0134o2786j41623L0789J26775K72546K4760l56827
22340c1820k74221J88889J89829J10005M7962o392k13294K54442r410n5360r7084
22329A03546k21721L7371J37766J49986k73506k95306J8648n48K80314K82939
22319B19489Q7476r7797K11553k74413k80213j38632n9625l8132R9812J75128
22309i5354J26004P3954o402J6535l9990J59364j69410l50159K0756J93215K18633
22298A47146O6643k256o6303M4256K29418O3106j68346K182J44627k35426n5400
22287A69647j45379n5400m4313L6061J1406K1532Q8719p2930j69900P4812P2339
22276a3406m246j51819J24704R2544J8124l4351J51683J74470j56132j97911l08407
$$ plain form
22351 -242564 -153392 -154338 -15588 74546 11760 -129863 -99074 27701 300247 325007 -31820
22340 -31820 -306041 -117152 72677 182682 230644 224252 10958 265400 255990 200630 103546
22329 103546 -118175 -80804 56962 206948 -66558 -361864 -343216 -343764 -63450 219489
22319 219489 306965 209168 420721 146308 -133905 -272537 -332162 -370294 -270482 -95354
22309 -95354 30650 104604 98202 114737 74747 234111 64701 -285458 -264702 -71487 147146
22298 147146 213789 211533 145230 189486 418904 482010 313664 315846 460473 225047 169647
22287 169647 24268 -31132 -75445 -39384 -27978 -6446 82273 9343 -160557 -85745 -13406
22276 -13406 -17652 -169471 -44767 47777 65901 31550 183233 357703 201571 3660 -304747
22265c04747k768K58660L14131N4431q5627k752j79487p9226j12813k00326J74216
22254a66308J28757J85347J50299m7996Q531l3363j43959k42957P8484n144J44497
22243E6188J45409J1522k30873l988N0795p7656J28055l8450p8389j93463L38
22232b30512K35936K58999O3332k50933J59971N6010k14477N7818j81206M5995
22222I33L202Q7047M9476k37582j46964j61892p3199M5798n2155J45966K79577
22211e9793j287o2529N7762J12698m931J36585j19879k0568n0680O8281J4562
22200G0221J0288M7622o3541p2330K0346J20716K73814Q4743m1511j95531j67317
22189H7520j09439R2937J0796M859L5374j1867k16104q2503J58900L65705q1888
$$ plain form
22265 -304747 -307515 -48855 265276 319707 234080 231328 51841 -27385 -140198 -340524 -166308
22254 -166308 -37551 147796 298095 250099 258630 225267 81308 -161649 -83165 -88309 56188
22243 56188 201597 213119 -17754 -21742 29053 -48603 79452 41002 -37387 -230850 -230512
22232 -230512 5424 264423 327755 76822 236793 292803 78326 136144 -45062 933
22222 933 4135 91182 140658 -96924 -243888 -405780 -478979 -433181 -485336 -339370 -59793
22211 -59793 -61080 -123609 -65847 46851 41920 178505 58626 38058 -12622 55659 70221
22200 70221 80509 128131 64590 -7740 12606 133322 407136 491879 450368 254837 87520
22189 87520 -21919 71018 81814 86673 122047 110180 -105924 -188427 -29527 336178 254290
22178B54290L3414j5927j77532L5982J75096J04666k22686k98033r4547J30781
22168g4496N8172O0186k6893J94061R7824k38904j13265o0410k3016j82353J73740
22157a35354O47J02237J51829j39505r4733n3417J22856k2212P7817j01580O4802
22146b6613L0087m0860m6724j36123K06368Q2993l29136k78998Q3829L21418l3801
22135a67560Q660L84817n9j67656r9868M3993k1463p8261r113j54463j05889k8035
22123c94897l0556R6800R9714J9007j5282M8535j15309J38296M5350L5399p4822
22112a47765J69857J7584j0599n2240q2101k6773L4423j02162J23974N6849Q3468
22101F4515J09889k5992N5248l48131k90882K92838K49163N2538j32192r2410
$$ plain form
22178 254290 287704 271777 94245 130227 305323 409989 187303 -110730 -205277 -74496
22168 -74496 -16324 43862 16969 211030 308854 69950 -43315 -103725 -126741 -309094 -135354
22157 -135354 -134707 -32470 119359 -20146 -114879 -168296 -45440 -67652 10165 -91415 -26613
22146 -26613 3474 -37386 -84110 -220233 -13865 69128 -260008 -539006 -455177 -133759 -167560
22135 -167560 -158900 225917 225858 58202 -41666 2327 -19136 -97397 -106510 -260973 -366862 -394897
22123 -394897 -425453 -328653 -228939 -209932 -225214 -176679 -291988 -153692 -108342 -72943 -147765
22112 -147765 22092 39676 29077 -23163 -105264 -132037 -97614 -199776 -75802 -18953 64515
22101 64515 174404 148412 203660 -144471 -435353 -142515 106648 159186 26994 -65416
22091f5416n10J78881n9332j64141j75047K50899l6470o3902o816L62953j9223
22080B01876j35379j47013Q7486k4847J10800Q8474j0267j19186q4439l6964j73420
22069b42879R274J8544j08837k32978j612j27559N3674J03389n9305M61970M84578
22058C58259j69277j85283k1495k98367j26323Q6638o4963j48616K95093Q1773
22048a92561N213J27770l0638J87310K9324p668J22754k01075l6920J52269K4157
22037A79935n7619j22931k15615P631J47273N1622r8073n1476L1727j72165j49020
22026d48711L6614N7021M5653J10287N0768k9985J62370k52158j32149J11492
22016b88798Q948J87504K61429j38598j11423m3810j6455j17541k21418R3005
$$ plain form
22091 -65416 -65926 112955 53623 -110518 -285565 -34666 -71136 -135038 -141854 221099 201876
22080 201876 66497 -80516 6970 -17877 92923 181397 171130 51944 -32495 -69459 -242879
22069 -242879 -233605 -215061 -323898 -556876 -558488 -686047 -632373 -528984 -588289 -126319 358259
22058 358259 188982 3699 -17796 -316163 -442486 -355848 -420811 -569427 -274334 -192561
22048 -192561 -187348 -59578 -90216 97094 126418 118750 241504 40429 3509 155778 179935
22037 179935 122316 -615 -216230 -208599 -61326 -9704 -107777 -159253 -127526 -299691 -448711
22026 -448711 -412097 -355076 -309423 -199136 -148368 -178353 -15983 -268141 -400290 -288798
22016 -288798 -279850 -92346 169083 30485 -80938 -124748 -141203 -258744 -480162 -387157
22006c87157J76101L87166J15978j58213M3545L3910j09255q1817j04871n5263
21996a39876R7282K75363o1320o652q509L2100J77471j93898q6957r3664j59809
21985a68469J22334o1867k9848J52439l1536l841L2615Q5620m5384l3614J68302
21974A86751R6034Q9086M1523j01499R4058m289k53719j61095o9014q9252j59810
21963c31226J2934J87021o8802j24732o390p9665n4818J33478R3664L2792K55905
21952E0161L3251j25849q0444j59838j02083Q7224Q0965k5201J39934Q303j0878
21941a04455J86212K61868K65111r1769j19265j58206j23613m4283p1439j85507
21931a85346J66856m1404k17668n3298J61379O4377J60232K61538m2815q5827
$$ plain form
22006 -387157 -211056 176110 292088 133875 177420 211330 102075 20258 -84613 -139876
21996 -139876 -42594 232769 171449 164797 156288 188388 365859 171961 85004 -8660 -168469
21985 -168469 -46135 -108002 -137850 14589 -16947 -20788 11827 97447 52063 18449 186751
21974 186751 282785 371871 413394 311895 405953 401664 147945 -13150 -82164 -171416 -331226
21963 -331226 -318292 -131271 -200073 -324805 -331195 -410860 -465678 -332200 -238536 -205744 50161
21952 50161 83412 -42437 -122881 -282719 -384802 -297578 -216613 -241814 -101880 -93577 -104455
21941 -104455 81757 343625 608736 516967 397702 239496 115883 71600 161 -185346
21931 -185346 -18490 -59894 -277562 -330860 -169481 -105104 55128 316666 273851 188024
21921A88024j04225k35176j0577J18811n8362j74423m4011J57017J21188J96331
21911A54597q0403j53733q6674j10693n7879J51211R9275j02208L4273j13519
21901b65753j32433J32063J80218M43841K5587j79050L3564J15021k38318j94098
21891g9358L9443J16937J84959k1381J6715j83259j14338q7080K42580J83362
21881B98580M4082M6966n9395k84534o0301K5317J02593q0379J0397R6860O4117
21870B04303L206j49331l0108J3686j02997k80066p6738L68431K32482J05872
21860B88740j09793q4920p0220L7034m8350o7648j44867M7162K19968l6189j92083
21849a61166J41075k7264k20352l4668O19444K41700r9140j34113n6884j26979
$$ plain form
21921 188024 83799 -151377 -161954 -43143 -101505 -275928 -319939 -162922 -41734 154597
21911 154597 74194 -79539 -166213 -276906 -334785 -183574 -84299 -186507 -152234 -265753
21901 -265753 -398186 -266123 -85905 357936 383523 204473 238037 353058 114740 -79358
21891 -79358 -39915 77022 261981 240600 257315 74056 -40282 -127362 115218 298580
21881 298580 342662 389628 330233 45699 -14602 10715 113308 32929 43326 140186 204303
21870 204303 207509 58178 28070 41756 -61241 -341307 -418045 -49614 182868 288740
21860 288740 178947 94027 23807 60841 12491 -55157 -200024 -152862 67106 30917 -161166
21849 -161166 -20091 -47355 -267707 -302375 317069 558769 459629 325516 268632 141653
21839A41653j60868l41900n0534P6172J31325o3144J14426J43897k00047q683
21829b17703K2089L2612J73091k44904k67244J4309K6179J27565L53462J7256
21819C6712j97979O172J72027K882j32778L5928q1655j17026J28219o2277J23385
21808h6390J20607l22996M9224j5751J47616j26010o7991j18697N5006R9899k1689
21797b87172J23299K22572P7688J4791r6115j65295q6814n6325J05574K27008
21787G9211J54005j05395k24845j38588J18562N4218l8442J30799M6346r3202
21777a7331j27259l8455J22704L2587M172O0030j18847j635Q7574J07900p3660
21766C7780j0148l13615K60362K21888k44066k45296j32809K20721L38570j2310
$$ plain form
21839 141653 -19215 -361115 -411649 -335477 -204152 -267296 -152870 -8973 -209020 -217703
21829 -217703 -195614 -163002 10089 -234815 -502059 -487750 -461571 -334006 19456 36712
21819 36712 -161267 -155095 16932 19814 -112964 -77036 -158691 -275717 -147498 -209775 -86390
21808 -86390 34217 -288779 -239555 -255306 -107690 -233700 -301691 -420388 -365382 -265483 -287172
21797 -287172 -163873 58699 136387 151178 55063 -110232 -197046 -253371 -147797 79211
21787 79211 233216 127821 -97024 -235612 -117050 -62832 -101274 29525 75871 -17331
21777 -17331 -144590 -183045 -60341 -27754 -23582 36448 -82399 -84034 3540 111440 37780
21766 37780 27632 -285983 -25621 196267 -47799 -293095 -425904 -205183 133387 121077
21756A21077n4360n1565k8054R014l4346j46473K8179L14605r9018j14739j7105
21745g2785M9107k39007j60546N6424K9387j21210J4946J24102M7072L4711k5365
21734b63164J15952J56765k0144j78197j64287K92821J51930k87077J4037j14250
21724b95614r480r6297J05204K46023j4693J12519p6284k0065M2988m6521M7390
21713d830J52727r5538j57230L1616Q3645j59844j76862R4550P417n993J01661
21702a28681J53780l333J15053l4115P877n3233j08977K32269L5629r1924L6715
21691A61060K12226j6024l89565j37026o4009L11463K48568J34940p7920k83068
21681A00645J521J21973o7028j31839J59489J01192j41349j13626j972L2156n1687
$$ plain form
21756 121077 66717 15152 -12902 -3888 -38234 -184707 -156528 158077 59059 -55680 -72785
21745 -72785 -23678 -262685 -423231 -366807 -337420 -458630 -443684 -319582 -272510 -237799 -263164
21734 -263164 -147212 9553 -10591 -188788 -353075 -60254 91676 -195401 -181364 -295614
21724 -295614 -305094 -401391 -296187 -50164 -64857 47662 -28622 -48687 -5699 -52220 -4830
21713 -4830 147897 52359 -104871 -73255 10390 -149454 -326316 -231766 -224349 -230342 -128681
21702 -128681 25099 21766 136819 102704 110581 57348 -51629 180640 216269 124345 161060
21691 161060 373286 357262 -32303 -169329 -233338 78125 326693 461633 383713 100645
21681 100645 102166 224139 157111 25272 184761 285953 144604 30978 29006 61162 9475
21670I475j28645J77661K13321k39301k62170r9153m8471n4285J51307R8056n8524
21659b40729R1918N3425J34590J11882J10841O4224j69424l34004o1033J72707
21649f5603j2555j13589J32966n8630J00658J43019p3256k96753L5940K46935
21639C9132J45091l6918J60393N5603l18823L7418O258j46783N5718m4753M8019
21628C55q8654k7872K8734P9742J33420j81132N0219j62588J7005J96526q8289
21617d2534l13056k18962J44355L01662K26534k42037k09257r061K00962j11468
21607b72862J46419J18053l2971j29766L7295R6437J6974J67302r8301k01282
21597a52702j34855N1384K4216P071J10989J22662q4768P7718R7979k6404l01695
$$ plain form
21670 9475 -119170 58491 271812 32511 -229659 -328812 -377283 -431568 -280261 -182205 -240729
21659 -240729 -148811 -95386 39204 151086 261927 326151 156727 -177277 -238310 -65603
21649 -65603 -78158 -191747 -58781 -117411 -16753 126266 53010 -243743 -207803 39132
21639 39132 184223 147305 307698 363301 44478 81896 88154 -58629 -2911 -47664 355
21628 355 -88299 -116171 -87437 -7695 125725 -55407 -5188 -167776 -150771 45755 -42534
21617 -42534 -355590 -574552 -430197 -128535 97999 -144038 -353295 -362356 -161394 -272862
21607 -272862 -126443 -8390 -41361 -171127 -133832 -37395 -20421 146881 48580 -152702
21597 -152702 -287557 -236173 -211957 -204886 -93897 28765 -56003 21715 119694 93290 -208405
21586b08405j02725K637J05398M8449J3842P0137J91782K6397k20320q4220o201
21575a63229P7990R645K08241k03350M7786j60472J1548J71131K12241Q7901k48333
21564E1099p7424L4690r6248P3767l8918j33843J23990o9183o1440R1590J22407
21553B0487k51939k85312P9472m9371K35452J677J09106J08020j48484j89642
21543c70534j30281J68006q50J0411K18448J81795K3116j40659l439j22406M3818
21532a22575R3910N2566j84198J87579L53639k5011k95704k39402O5533p983J05177
21521a6469P5655O42j53348o4450j65242p382l1005K30910J58621j52337r7448
21510b21853j14308L26628R4281l30291j63228M2348m0054O2662J90251K33091
$$ plain form
21586 -208405 -311130 -308493 -203095 -154646 -140804 -70667 121115 147512 -72808 -157028 -163229
21575 -163229 -85239 -75594 132647 -70703 -22917 -183389 -171841 -710 211531 299432 51099
21564 51099 -26325 8365 -87883 -14116 -53034 -186877 -62887 -132070 -193510 -101920 20487
21553 20487 -231452 -516764 -437292 -486663 -251211 -249534 -140428 -32408 -180892 -370534
21543 -370534 -500815 -332809 -333659 -323248 -104800 76995 100111 -40548 -43987 -166393 -122575
21532 -122575 -28665 23901 -160297 27282 380921 355910 60206 -179196 -113663 -121646 -16469
21521 -16469 59186 59828 -93520 -157970 -323212 -330594 -361599 -130689 27932 -124405 -221853
21510 -221853 -336161 -9533 84748 -245543 -408771 -366423 -406477 -343815 -153564 79527
21500G9527R0913j77678j40450j53405J85447l3803n2194j09801K82105R7614
21490F8275m5500J22527N0011R0797j17489l54788m5142J92316K09453j87424
21480a6964j7666j81373j13797n2619O7556J82550r5978l6367J72524O7161j2312
21469c7285M2035m2139K03702k5942q2014n1496j48007q7258j3601m5960o5398
21458c53363O5701P7625K87159P7404o1734N6438K71852k4235k86213l28446K94299
21447G6487j06090k64055J55493K49728J21117k9766J197k52412q8118J33228
21437c191j42502n1490L8115M2448J19216L57302N2639K50727k93759m14383J8982
21426b5896Q6420J07241m1272R1241l0847J9047k72140k0131k159k5547J35682
$$ plain form
21500 79527 170440 -7238 -147688 -301093 -115646 -149449 -201643 -311444 -29339 68275
21490 68275 22775 145302 195313 286110 168621 -186167 -231309 -38993 170460 -16964
21480 -16964 -34630 -216003 -329800 -382419 -314863 -132313 -228291 -264658 -92134 -24973 -37285
21469 -37285 4750 -37389 166313 140371 58357 6861 -141146 -228404 -242005 -287965 -353363
21458 -353363 -287662 -210037 77122 154526 92792 149230 421082 396847 110634 -217812 76487
21447 76487 -29603 -293658 -138165 111563 232680 202914 204111 -48301 -136419 -3191
21437 -3191 -145693 -197183 -159068 -116620 2596 359898 412537 663264 369505 -44878 -25896
21426 -25896 60524 167765 126493 217734 186887 205934 -66206 -86337 -88496 -114043 21639
21415B1639J84162Q2414k64442k83993J71544J65136n872J5235r1702l22443l7827
21404c66149j80769j08927L04857R7898n0037p4738P776P4486L91244P9140j52901
21393B1880O9465j73664j88435K06204n0721j49877J47230j64201j15114K7736
21383c69497O7966K3310O1288P8036J43046J07627p4521R2129l0313k74278L8285
21372a36922L6451k9763l01728O277r67k720J69111j37658Q5268K81735o732Q344
21360b9304r0092J15597M7626P240j15285k43641J7541n3208m2517M6954K37676
21349a01413J11701k8891j14502J50217K7218k9411K11785J35963j66090l22070
21339a25493J4973K09892N0013n2919p7738m3913m2982j37909j35783j35596P5273
$$ plain form
21415 21639 205801 288215 23773 -260220 -88676 76460 70588 85823 -5879 -328322 -366149
21404 -366149 -546918 -655845 -350988 -253090 -303127 -377865 -370089 -295603 95641 174781 21880
21393 21880 91345 -82319 -270754 -64550 -115271 -265148 -117918 -282119 -397233 -369497
21383 -369497 -301531 -278221 -216933 -138897 4149 111776 37255 129384 99071 -175207 -136922
21372 -136922 -100471 -130234 -431962 -425685 -426652 -429372 -260261 -397919 -312651 -30916 -37648 -29304
21360 -29304 -119396 -3799 43827 51067 -64218 -307859 -290318 -343526 -386043 -339089 -101413
21349 -101413 10288 -18603 -133105 17112 44330 14919 226704 362667 196577 -125493
21339 -125493 -110520 99372 149385 96466 18728 -25185 -68167 -206076 -341859 -477455 -402182
21328d02182J61584K37683O9565K10660j0319J18011j1294K5110j03478j73860
21318A21480j44920j23026j70351P3567n6736M4004l0072r7162M6306K3805j35587
21307d48692K56268J42922q855Q5671j9560K14732K1518j96623k8544L21043J05385
21296D45265j54580Q8440K6514l37981j92417K54914j6766l02026l99958p4302
21286f62897K48873L59684O1086n5691k37413Q1652N3580J65382n2857j63719
21276b02320k69923J33684J44781K9702J46516j7831j99516j8934J07152k0669
21266a67358J06572L2452j10696l28792j05174K2730j6055K49132K26096J13110
21256B2017k10860m3824J32032K47971J4457j12102j82676M5420L7988n5515j10333
$$ plain form
21328 -402182 -240598 -2915 66650 277310 266991 385002 373708 398818 295340 121480
21318 121480 -23440 -146466 -316817 -243250 -299986 -255982 -286054 -383216 -336910 -313105 -448692
21307 -448692 -192424 -49502 -58357 27314 7754 222486 244004 47381 18837 339880 445265
21296 445265 290685 379125 405639 67658 -124759 130155 113389 -188637 -588595 -662897
21286 -662897 -414024 -54340 6746 -48945 -286358 -204706 -151126 14256 -38601 -202320
21276 -202320 -472243 -338559 -193778 -164076 -17560 -35391 -234907 -253841 -146689 -167358
21266 -167358 -60786 -28334 -139030 -467822 -572996 -550266 -566321 -317189 -91093 22017
21256 22017 -188843 -232667 -100635 147336 161793 49691 -132985 -87565 -49577 -105092 -215425
21245b15425m2121L2721J85013K15128j5794j64616r6031J25578J92442J9408
21235B36303j54652k18369l21219k9874L7297J28085K28493K18269J06924J50999
21225C82256J3915j90020j27644j3890l7409j11963j55572O6451j6208Q2898J97162
21214H9976m2048l1307l05763j75134J10540K56023J87560Q4397k6889k5889Q4713
21203B06179L1147m0823K2728k30185k8713p7279n6281j8322o5255J83426L96602
21192C23224J98767m7892j88594l86813j00858J20240j08250k88623r9825J23799
21182d54825K57674k9840J04905J65064K30359j80967k42054l2824k7595j71497
21172c81600J10395J87271R5901O9986q0201O4352j00059o3498J39741J199J34225
$$ plain form
21245 -215425 -257546 -224825 -39812 175316 159522 -5094 -101125 24453 216895 236303
21235 236303 81651 -136718 -457937 -487811 -450514 -322429 -93936 124333 231257 382256
21225 382256 396171 206151 78507 64617 27208 -84755 -240327 -173876 -190084 -107186 89976
21214 89976 47928 16621 -289142 -464276 -353736 -97713 89847 174244 147355 121466 206179
21203 206179 237326 196503 219231 -10954 -39667 -116946 -173227 -191549 -256804 -73378 323224
21192 323224 521991 474099 285505 -101308 -202166 -81926 -190176 -478799 -578624 -454825
21182 -454825 -197151 -226991 -122086 42978 273337 92370 -149684 -182508 -210103 -381600
21172 -381600 -271205 -83934 11967 81953 1752 66104 -33955 -97453 42288 43487 177712
21161A77712k653J01727j98679m0880P969M28920J62680p8311k56947j43926n8238
21150I9374j31897N9758m1333j62064N0747N8289J94386M7569j01374K0167Q9668
21139A83290J7413K3550J09968j15806m14869K0993K95184j17317P4297m8743
21129B7960j73881J33538J65446n0076j9260K211k17693j26077P2566K8300k8410
21118a85376p5581r0358J04786K68930L69613j10660o1725J4673k58971j64519
21108a89188k6536J65166m9335N8106J04227j14263r4767J2628O1797J13199Q1611
21097A22645J05718k83208o2782K15353J77443l14100p5908l6452O8623K9854
21087e2814j61874Q8323J3188j69013j55997J86103L54051j06013j13534R9503
$$ plain form
21161 177712 175059 276786 78107 37227 45196 474116 636796 558485 301538 157612 99374
21150 99374 -32523 27235 -14098 -176162 -125415 -67126 127260 174829 73455 93622 183290
21139 183290 200703 224253 334221 218415 -196454 -175461 119723 2406 76703 27960
21129 27960 -145921 -12383 153063 102987 83727 85938 -131755 -257832 -185266 -156966 -185376
21118 -185376 -260957 -351315 -246529 22401 392014 281354 219629 234302 -24669 -189188
21108 -189188 -215724 -50558 -99893 -41787 62440 -51823 -146590 -133962 -72165 41034 122645
21097 122645 228363 -54845 -117627 97726 275169 -38931 -114839 -151291 -82668 -52814
21087 -52814 -214688 -126365 -113177 -282190 -438187 -252084 101967 -4046 -117580 -18077
21077a8077p8790K46999M8606k45189m8989O4319J29573m1410R3329j33979J72906
21066A89298J97119k01653r1698j38112J02253J45764P860k43713k14493K53590
21056F215K77479j06838n0325R7337J37251n496k61434k80550j9417J50228o604
21045f2154n7691k09154r2582M6467J87529j6787j8284J67821K02393q9511k19519
21034a61472p2101L02809n945j28041L884l6399q3439j14257J23394m9919Q7209
21023a34277K56932J55966q5558j36503j43884J79347r0745P7592P688R6182N3882
21012B36622Q015P6941J5726k45664l26184k09346o7780J46435N0132J00903K26235
21001A2035R3643j44074R1961J11992Q8432j97797L7396O9388J388o2893N3711
$$ plain form
21077 -18077 -96867 150132 198738 -46451 -95440 -31121 98452 57042 150371 16392 189298
21066 189298 386417 184764 93066 -45046 57207 202971 210831 -32882 -247375 6215
21056 6215 283694 176856 126531 223868 361119 355623 94189 -186361 -205778 -55550 -62154
21045 -62154 -119845 -328999 -421581 -375114 -187585 -204372 -222656 -54835 147558 58047 -161472
21034 -161472 -233573 69236 63291 -64750 -60866 -97265 -180704 -294961 -171567 -221486 -134277
21023 -134277 122655 278621 193063 56560 -87324 92023 1278 78870 86558 182740 236622
21012 236622 244637 321578 337304 91640 -234544 -443890 -511670 -365235 -315103 -214200 12035
21001 12035 105678 -38396 53565 165557 253989 56192 93588 162976 164364 101471 155182
20990A55182N0504k09868j81500J75441J12639J60661k08501q4676J50338N4215
20980A74435p7497r619N5030N6420j82291m0961J12844M0176n5267l3345r9540
20969e9615m7393J35419J44757K7056k23474j36708L43507N4896j78913k0347
20959C9185R2654j2905J51188J52868k38095l14976K33331K9102k90518j21399
20949b79565P4683K87234J02300P4887p6768P470Q6894p0786j19315L2152J6564
20938A35750j65821q5502J13030n5493j51216R9834K61597K75845J16801j71382
20928C73443j93102k19628Q9537J91263j09795j45611j50821J47952J47397j55672
20918b5037k30326L973K54952k7076m3481j42767p5725J70124J49224j65527j10726
$$ plain form
20990 155182 205686 -4182 -185682 -10241 102398 263059 54558 -30118 120220 174435
20980 174435 96938 87319 142349 198769 16478 -24483 88361 128537 73270 39925 -59615
20969 -59615 -107008 28411 173168 200224 -23250 -159958 183549 238445 59532 39185
20959 39185 131839 118934 270122 422990 184895 -130081 103250 132352 -158166 -279565
20949 -279565 -204882 82352 184652 259539 182771 190241 277135 206349 87034 119186 135750
20938 135750 -30071 -115573 -2543 -58036 -209252 -109418 152179 428024 544825 373443
20928 373443 180341 -39287 50250 241513 131718 -13893 -164714 -16762 130635 -25037
20918 -25037 -255363 -251390 3562 -23514 -66995 -209762 -285487 -115363 33861 -131666 -242392
20907b42392K8900K3924J48302N2455r5185O6284J35370j07240j1398K16613j27588
20896H8045j36839J1306p3746J3988P3330n7775J4451K79235p876r0323M9348
20885A63144J58097j26067j60007m1284M8365K03290l9015k4853k46449O4990
20875B11l8024K06708J18315q3173o204R8861J05985R9398M9370k22190k64433
20864F4824l7660j34984o9170k6231k23451r9924J14268J35774M5977O1220J71220
20853A863L6096j18541p2239J0295P9535N0041l7619M9556j3739J55395p9691
20842F0952m2776J19238J18737Q7052j27727k05592m5677J02899J70383N0433
20832B87922p3999N3740Q4319M9107j58763k23121j1933j85641N5855J6398p1387
$$ plain form
20907 -242392 -213492 -189568 -41266 11189 -83996 -17712 117658 10418 -980 215633 88045
20896 88045 -48794 -37488 -111234 -97246 -23916 -81691 -67240 211995 204119 113796 163144
20885 163144 321241 195174 35167 -6117 42248 245538 206523 181670 -64779 211
20875 211 -37813 168895 287210 204037 197833 296694 402679 502077 551447 329257 64824
20864 64824 27164 -107820 -176990 -203221 -426672 -526596 -412328 -276554 -230577 -169357 1863
20853 1863 37959 -80582 -152821 -142526 -62991 -12950 -50569 -1013 -14752 140643 60952
20842 60952 18176 137414 256151 343203 215476 9884 -35793 67106 237489 287922
20832 287922 213923 267663 351982 401089 242326 19205 7272 -178369 -122514 -106116 -177503
20821a77503j30808o9679K79840K14412k29p2330o4538k792n6100M4100J38162
20810A02535J73916j25894j44809q1534M1807K59732Q7909m5200N8360j32359
20800A94463k32270O2850K94564J48004n5708k36178j01509K68426J37905j18409
20790C62138Q6424p6641j08519j9651L8133o2187O7182o1100R2264J78238J55690
20779F51971O7598j48933j19346q2490k26161k7279J01662j52060q9519l6935
20769f1492j01654q3497j07054K21609J75410J40450m149k95584j80577m4687
20759c41225J08608j6643J86785j4645m0118j52206r4322J69868L05057R2704
20749B03863j92684o8438K41933j10742j2665J76332Q523k10625j11038J04719
$$ plain form
20821 -177503 -308311 -377990 -98150 116262 116033 43703 -20835 -23627 -79727 -35627 102535
20810 102535 276451 150557 5748 -75786 -33979 225753 313662 268462 326822 194463
20800 194463 -37807 25043 319607 467611 411903 175725 74216 342642 480547 362138
20790 362138 448562 371921 263402 243751 281884 219697 286879 225779 318043 496281 651971
20779 651971 719569 570636 451290 368800 142639 115360 217022 64962 -24557 -61492
20769 -61492 -163146 -246643 -353697 -132088 43322 183772 179623 -115961 -296538 -341225
20759 -341225 -232617 -249260 -62475 -77120 -117238 -269444 -363766 -193898 111159 203863
20749 203863 11179 -57259 184674 73932 61267 237599 246122 35497 -75541 29178
20739B9178J1474J49326o8056j98554j97131r575L35958K07279J3118n9877J46472
20728C59612R9010k15602l62648r397J91464p1010j22204m4308J58052K76554
20718B59523k7736O1705j95931j16257M8522J35060j27755K04799O7002k66286
20708D2646l5860j07624J8028J02689l3335L14209O0943M5917j67632k07093j22115
20697h9227O3197J90991K67336p3526q4448m7510k1411r9920J1511j8169j26115
20686b7291r300K18539J0602O4881j20207j48037j15223P331K06169N0926j2780
20675A25610J8656n1166m8097N4770P0639K31145l7674k01635m9835j85786k14438
20664b87811J10230l377P9203K30987O9751o791k63k20673j49487j31649J2122
$$ plain form
20739 29178 40652 189978 121922 -76632 -273763 -283338 52620 259899 273017 213140 359612
20728 359612 458622 243020 -119628 -129025 62439 -8571 -130775 -175083 -17031 259523
20718 259523 231787 293492 97561 -18696 29826 164886 37131 241930 308932 42646
20708 42646 6786 -100838 -82810 19879 -13456 300753 361696 407613 239981 32888 -89227
20697 -89227 -26030 164961 432297 358771 274323 226813 205402 105482 116993 98824 -27291
20686 -27291 -36591 181948 192550 257431 137224 -10813 -126036 -118705 87464 138390 125610
20675 125610 144266 93100 45003 99773 170412 401557 363883 162248 112413 -73373 -287811
20664 -287811 -177581 -180958 -101755 129232 198983 192192 191929 -28744 -178231 -309880 -297758
20653b97758L974k3675J90917K02896K11198j99989j83347r625K28251M1118o1054
20642A02906q9479j19919j99705M3759J37087n6963j44153k1200J60193P4410
20632a13064p567K12603K7900K3064k8749k20445K05124K37904m4336p6703j54471
20621F1260K27226l2698j86329q3967j38401J9597M8106J14645P3298J49137n4752
20610A97122l5702n3408L2834j48650m8232K2845J02761L5304K03246K7879O000
20599C41999J23656j50456j89032K7863Q5915m4122o667r8823Q4924J19574p9404
20588B15427K1890N1258l13783j69015J50721J20614Q404K85564k9812r5635j14412
20577A31221o0770J04214o7405j27382L265l6795J32598J19617q8559q1367M086
$$ plain form
20653 -297758 -293784 -317459 -126542 76354 287552 87563 -95784 -105409 122842 163960 102906
20642 102906 13427 -106492 -306197 -262438 -125351 -182314 -326467 -347667 -187474 -113064
20632 -113064 -120631 91972 119872 142936 114187 -106258 98866 336770 292434 215731 61260
20621 61260 288486 255788 69459 -14508 -152909 -133312 -85206 29439 102737 251874 197122
20610 197122 161420 108012 140846 -7804 -56036 -33191 69570 104874 308120 335999 341999
20599 341999 465655 315199 126167 154030 239945 195823 189156 90333 175257 294831 215427
20588 215427 237317 288575 -25208 -194223 -43502 77112 85516 371080 341268 245633 131221
20577 131221 70451 174665 107260 -20122 -16857 -53652 78946 198563 110004 28637 32723
20566C2723J21780J79435j84809n3443j00680K24450p6870K968J59586j29756
20556A75384j05203q2060J03805K3434q9867m7316r1781O1282O4011j04467Q8055
20545d723J21453J04461N7648j85557r1799J6350J48934R7483m4661K3914J10092
20534C53595j32448k12136j04975j8700k8457j71866o8489O7739L0334N7592l4054
20523b61865n5624j04311n0112K71027K02418p3713j98881k4627m6886K00319
20513a42255R8775M4224J80584M6276j6650O082k39994k76463k3969L09034J50789
20502A36433j58032j83360k321O9462J91063p8002r8461Q9482N0358j16948l8998
20491a39324R6811J41593J37419K2643k31351j78713M0102J62130j3133j36293
$$ plain form
20566 32723 154503 333938 149129 95686 -4994 219456 142586 145554 305140 175384
20556 175384 70181 -11879 91926 115360 25493 -21823 -113604 -52322 11689 -92778 -4723
20545 -4723 116730 221191 278839 93282 1483 17833 166767 264250 219589 243503 353595
20534 353595 221147 9011 -95964 -114664 -143121 -314987 -383476 -315737 -285403 -227811 -261865
20523 -261865 -317489 -421800 -471912 -200885 1533 -72180 -271061 -295688 -342574 -142255
20513 -142255 -43480 744 181328 227604 210954 217036 -22958 -299421 -323390 -14356 136433
20502 136433 -21599 -204959 -207280 -137818 53245 -24757 -123218 -33736 16622 -100326 -139324
20491 -139324 -42513 99080 236499 259142 27791 -150922 -110820 51310 38177 -98116
20481i8116m8919M7195J8664R2898J89983L826j17283J111P8641p038q4654j30924
20469e4616J49518j3838j88968K59347J49188l8033k32729j50745q2324o9033
20459b72233R0998K52930J48269k23599j68108l5483J58151L4841o1346j15417
20449a90997k41871K08184J38150P322j58382K26180J97612j47425J34632J61274
20439C34679j51047k38777l9640J45167o1090O8796J94249N3295j83209k10210
20429h7787m1027P6296J48977k1455J59973o6331j18011j25789m3406q1773q5414
20418b85747J11734J92505R1605r9940o1778J28690M6421o3489n919J61093p1003
20407A44172o1734J6213J10209J36705P3815J83506L4716k09224k05520O8644
$$ plain form
20481 -98116 -147035 -99840 -81176 11722 201705 205531 88248 89359 168000 160962 76308 -54616
20469 -54616 94902 81064 -107904 151443 300631 262598 29869 -120876 -203200 -272233
20459 -272233 -181235 71695 219964 -3635 -171743 -207226 -49075 -14234 -75580 -190997
20449 -190997 -432868 -224684 -86534 -79212 -237594 -11414 186198 38773 173405 334679
20439 334679 183632 -55145 -94785 50382 -10708 58088 252337 305632 122423 -87787
20429 -87787 -128814 -52518 96459 75004 234977 168646 50635 -75154 -118560 -200333 -285747
20418 -285747 -174013 18492 110097 10157 -51621 77069 123490 60001 54082 215175 144172
20407 144172 82438 98651 208860 345565 419380 602886 637602 428378 222858 291502
20397B91502j59888n0812L6485J01695M3007Q3615J13520j11660J03669l70078
20387H1055l04143K6809J71394M1266P59L2990J31836k6745J54182J69688m946
20376D74145k71994l43245m1464J58729K06939J61522k7327Q2k00450Q7893J31360
20365C36190l6644k95142j58952j27657J91486J90071j37909k6743o3958M0915
20355h8343j39866R7905n0654J67108L41380j59104j12276J16187J50071q0120
20345B42288J13919n6324m6952J75994l2555K6275N6498j13983q2458k93776j28955
20334a40029O0314n4151K9307J6201R0177L20314l047l00344j27971J85307M6669
20323A22747K96488O8995k50299k37384j83818P3069o3807k27467K2510K53717
$$ plain form
20397 291502 131614 80802 117287 218982 261989 345604 459124 347464 451133 81055
20387 81055 -223088 -196279 -24885 16381 17140 50130 181966 155221 309403 479091 474145
20376 474145 202151 -141094 -182558 -23829 183110 344632 317305 317387 116937 204830 336190
20365 336190 299546 4404 -154548 -282205 -90719 99352 -38557 -65300 -129258 -88343
20355 -88343 -228209 -130304 -180958 -13850 327530 168426 56150 172337 322408 242288
20345 242288 356207 299883 252931 428925 396370 422645 479143 365160 282702 -11074 -140029
20334 -140029 -79715 -133866 -104559 -88358 1819 322133 319086 18742 -109229 76078 122747
20323 122747 419235 488230 237931 547 -183271 -110202 -174009 -401476 -378966 -125249
20313a25249Q0842O6534J3051J08570j55765n3016N7268q1481P872Q2296N8292
20302E9214J52524K63850J5525K4337J79731J92381L25581J02401L28729L01526
20292A945799O9537k40988j45396j15638k08104l01705j25194M72J51660M19498
20282A449941L42249J42977K19006q2440k33065l66062l05664k88657r5096j08061
20272F75128j65432j7316j70641k73721J4708O3634o2652j29696j26489L1803
20262a60674J01088K69351K37251j44208P6624J4137m48117n1404j79533K7194
20252b58291K60618L8448l4178j7533o8688j62627K1149j04913N0691J76997j0133
20241a08460R0196N9714J06834M2689p8991o9273L4049J77398o7534p627K09270
$$ plain form
20313 -125249 -44407 22127 35178 143748 -12017 -65033 -7765 -89246 -81374 922 59214
20302 59214 211738 475588 491113 515450 695181 887562 1213143 1315544 1644273 1945799
20292 1945799 2015336 1774348 1628952 1513314 1305210 1003505 878311 878783 1030443 1449941
20282 1449941 1792190 1935167 2154173 2071733 1838668 1472606 1166942 878285 783189 675128
20272 675128 509696 492380 321739 48018 62726 126360 63708 -65988 -192477 -160674
20262 -160674 -59586 209765 447016 302808 379432 393569 -54548 -105952 -285485 -258291
20252 -258291 2327 40775 6597 -10936 -79624 -242251 -221102 -326015 -275324 -98327 -108460
20241 -108460 -18264 41450 148284 190973 111982 42709 76758 254156 186622 178995 388265
20230C88265P039N7569K3961o3504J42246K2375k2756j87409j4164j94099J02494
20219B62017Q4021j62909m2619N4016J42727j49049j36942k15418L4286K85322
20209A55452R324j8180j03092l63414j08891J06179J11276J27662R461j6565J9918
20198g0870M9863q4914M9330L88881J13946j98428j15275J30469P4701o4432p8351
20187A94920m4194j90747J91160O7849j06769j85929o4271N2051J06707K66510
20177B87287Q0981m0723j25312L0169j92920j04240j34661J87862J14968M4164
20167A47575k4953m3554k7906j96834M001K28701N7099q4717O0659K91031J39378
20156E50480j20494J0771m9158q5382p8386l9719O3132M32400J57834j61717k18176
$$ plain form
20230 388265 395304 452873 476834 413330 555576 577951 555195 367786 353622 159523 262017
20219 262017 346038 183129 140510 194526 337253 188204 51262 -164156 -129870 155452
20209 155452 164776 146596 43504 -319910 -428801 -322622 -211346 -83684 -74223 -90788 -70870
20198 -70870 -21007 -105921 -56591 332290 446236 247808 132533 263002 337703 273271 194920
20187 194920 150726 -40021 151139 218988 112219 -73710 -137981 -85930 20777 287287
20177 287287 368268 327545 202233 232402 39482 -64758 -199419 -11557 103411 147575
20167 147575 122622 79068 51162 -145672 -141671 87030 144129 59412 120071 411102 550480
20156 550480 429986 440757 391599 306217 227831 188112 251244 683644 841478 679761 461585
20145D61585L7940q5443r9148J08141j3648O8176J88872j22072j48083p6843p6638
20134B42839J37966K25632q2016j25616J9294k0196N2352o2981J06415j05876
20124C87813J27707L3522l6271J57589J54336O6261K56738J28676L82176J72029
20114A830576R6463J98554j05098l25257j7361l40574m53868j86572j92862Q3883
20104E87884L35120K44394K15974J26349K25760L57072K98440k15553l82107l45906
20094A447427l85015j74251j61017k17450l5998j11097L30298k6543j6669n8939
20084E90746P6671m3914l62566k89151Q177J41536Q3662K02789k00596o4423l2967
20073A09964J6767n7395J11083Q865P4541P1043L46930k9192k61549j39954N4884
$$ plain form
20145 461585 499525 414082 314934 423075 409427 477603 666475 544403 396320 319477 242839
20134 242839 380805 606437 524421 398805 418099 397903 450255 387274 493689 387813
20124 387813 515520 549042 512771 670360 824696 890957 1147695 1276371 1658547 1830576
20114 1830576 1927039 2125593 2020495 1695238 1677877 1337303 883435 696863 504001 587884
20104 587884 923004 1167398 1383372 1509721 1735481 2092553 2390993 2175440 1793333 1447427
20094 1447427 1062412 888161 727144 509694 473696 362599 692897 666354 649685 590746
20084 590746 667417 623503 260937 -28214 -20037 121499 205161 407950 207354 142931 109964
20073 109964 126731 69336 180419 189284 263825 334868 681798 652606 391057 251103 305987
20062C05987J87992l0069K0389p1945O5682J64174J04091q6416O8285j83619l80846
20051A63705k19192M9201p4414J1108l088L39041J3575n8662M2821J7451k9515
20040B52031j23930P5561N7262k8740Q5653k59592J26567M7962O5279N3842l3776
20029C18119J3785j97525L8292K32155L83731j74584p5565j7023r8981J43725
20019E66129j18066N6585j35261j38909J02099j2576j19421K40364J57522n9282
20009E39184j62730k14942l6108j8919R3636J42354R1719j06484p1789J29271
19999C85192J58604L2421L259r4439j75136r7891J44218J44625j26100j76977
19989A97776j14206o9331K249m3330n0409r8997R8847P9850p9904k1319K13933
$$ plain form
20062 305987 493979 463910 484299 412354 478036 642210 746301 659885 728170 544551 163705
20051 163705 -55487 -6286 -80700 -69592 -72680 266361 279936 221274 264095 281546 252031
20040 252031 128101 203662 260924 232184 317837 58245 184812 232774 298053 351895 318119
20029 318119 331904 134379 172671 404826 788557 613973 538408 521385 422404 566129
20019 566129 448063 504648 369387 230478 332577 320001 200580 440944 598466 539184
20009 539184 376454 161512 125404 106485 200121 342475 434194 327710 255921 385192
19999 385192 543796 576217 579476 485037 309901 212010 356228 500853 374753 197776
19989 197776 83570 14239 16488 -26842 -77251 -176248 -77401 2449 -77455 -98774 115159
19978A15159M6750o0137o8559j50595n1768K27379K24567J6011j49237j91791
19968d2221o773L18185J03416L9279j1022j36799J02466k8096Q9442J42323M2126
19957F12326M9164j09288j34655Q9526M0647p8890k35217j36892j90598P9342
19947a4535K63474Q8514j44459n3598j1615k06200M9895J08881N2191O050j3117
19936A25481o4830M8849K33788J71493j89965k40764j32180k28415j24318J11267
19926b89594M9137J09146K72452o0117N3583O0736K01639L02852k05734k25388
19916B68712j07533k6402M2934M08437Q8405m706k35307j44047J08667J3144k91218
19905A21086q8176J28471J12268J20127l6355J67576n8086N6311K01453o3412
$$ plain form
19978 115159 161909 101772 33213 -117382 -169150 58229 282796 298807 149570 -42221
19968 -42221 -48994 269191 372607 411886 400864 264065 366531 338435 427877 570200 612326
19957 612326 661490 552202 417547 507073 547720 468830 233613 96721 -93877 -14535
19947 -14535 248939 337453 192994 139396 127781 -78419 -28524 80357 132548 138598 125481
19936 125481 60651 109500 343288 514781 324816 84052 -48128 -276543 -400861 -289594
19926 -289594 -240457 -131311 141141 81024 134607 195343 396982 699834 494100 268712
19916 268712 161179 134777 177711 586148 674553 669847 434540 290493 399160 412304 121086
19905 121086 32910 161381 273649 393776 357421 524997 466911 523222 724675 661263
19895F61263j32412k01567R7899j91773J75541P5151k47808R721J18026j16443
19885B47598j30751M5030n1102L00371J51608n383k07022L8907L62045j42113
19875F09188j15072J68146L6443l9827k062j03820o8968K42N8868m3253O4540
19864E64425M978k56893L0893J66012O5303K53278O0105j21426j36927n7855J48303
19853G20196j8960k15645K09867K82588q1736j9411l7114J00340R8294L5105J10149
19842A183673P3176N1098j07292K8277J50716M2729k49518r4032j41495K87774
19832A225106J86153n8935n3444J22709R5251j44109o4019n4395J00707J35116
19822A490140J84022J94495J84098o6516l05118J7948K16446J02190K31841L38412
$$ plain form
19895 661263 528851 327284 425183 233410 408951 484102 236294 246015 364041 247598
19885 247598 116847 161877 110775 411146 562754 557371 350349 389256 751301 609188
19875 609188 494116 662262 698705 658878 656816 552996 484028 484270 543138 499885 564425
19864 564425 569403 312510 343403 509415 574718 827996 888101 766675 629748 571893 720196
19853 720196 701236 485591 695458 978046 896310 876899 839785 940125 1038419 1073524 1183673
19842 1183673 1256849 1307947 1200655 1228932 1379648 1422377 1172859 1078827 937332 1225106
19832 1225106 1411259 1352324 1298880 1421589 1516840 1372731 1308712 1254317 1355024 1490140
19822 1490140 1674162 1868657 2052755 1986239 1681121 1699069 1915515 2017705 2249546 2587958
19812B587958j38999k1885L06238O1763j5613K91347J83130L19827J66287M97460
19802D237513N24429N21413N87263Q29493M01626M84946N10933L71846K47692
19793H717154M22960N42173R13726J383027J541641J367021J497323K039533K599314
19784B1023872K590322K899154L734588N470476Q113918J2881983K1406816L5600705
19776A13721834N5543567O6950640N8666556L6972136J9292863J3810736L877495
19769C68835827j7296693m2525708m7077394k5642646J3214154M5451567M9556206
19762C44515313L0537335N062640m554256r951471k4159115n0249696o7104780
19755B24095970o3440311m7075151l0466674j9187377j2781867q740078o020426
$$ plain form
19812 2587958 2448959 2427074 2733312 2795075 2779462 3070809 3253939 3573766 3740053 4237513
19802 4237513 4761942 5283355 5870618 6700111 7101737 7586683 8097616 8469462 8717154
19793 8717154 9140114 9682287 10596013 11979040 13520681 14887702 16385025 18424558 21023872
19784 21023872 23614194 26513348 30247936 35718412 43832330 56714313 78121129 113721834
19776 113721834 169265401 236216041 294882597 331854733 351147596 364958332 368835827
19769 368835827 351539134 309013426 261936032 236293386 249507540 294959107 344515313
19762 344515313 375052648 380115288 375561032 365609561 341450446 291200750 224095970
19755 224095970 160655659 113580508 83113834 63926457 51144590 42404512 36384086
19748C6384086m496148l628728l020516k378943k053617j838080j622574j599423
19740A5746057j497285j345734j066668p50106p41015p41425m61600n53359n64619
19731H024246m95087p35074o74616o09701n38295m93118j93629l10135j34555
19722C840036L4050j26790k87731o8084P9044r575l66588m53396j28501k03791
19712B308674k94182J69074L15056K21421J28404p7950l70220k74683k19125j15687
19702A790782o6009j74023j30147p8224k43641j57854P8612k09841k71966J74905
19692G12594L15248p8262j17026K2373J12141J41264Q3228L086k27992j27620
19682H39034J33229k1119M3166L763o5790J64268j6708k72451l2124J48850r015
$$ plain form
19748 36384086 31887938 28259210 25238694 22859751 20806134 18968054 17345480 15746057
19740 15746057 14248772 12903038 11836370 11086264 10345249 9603824 9142224 8588865 8024246
19731 8024246 7529159 6794085 6119469 5509768 4971473 4478355 4284726 3974591 3840036
19722 3840036 3874086 3747296 3459565 3391481 3470525 3460950 3094362 2640966 2512465 2308674
19712 2308674 2014492 2183566 2498622 2720043 2848447 2770497 2400277 2125594 1906469 1790782
19702 1790782 1724773 1550750 1420603 1342379 1098738 940884 1019496 809655 537689 712594
19692 712594 1027842 949580 832554 854927 967068 1108332 1191560 1194646 966654 839034
19682 839034 972263 951144 994310 998073 932283 1096551 1079843 807392 775268 924118 915103
19671I15103j02691m5140M80152J43401K04571K12562O3547j07643o7037j63702
19661A533123m4789k94811l6333J54240L04671K67370K9017K42202j03531N7570
19651B108729j12404J7264l1205o742j12778j07219j73435K96491L14143K52917
19641B445761K87110O88182R90866J699807K234413K062553J296654O36825L18151
19632A2660322L37972o6764j160464j719126j157364R6568Q12508J335311J323954
19623A2462917N86373k58492j52242j91109r48250j651587k031482j813575j222712
19614D779841r63282o56637m72694k27959m46256k32326j48600n4690K1201J05281
19604A703879j35819L0076K36450j76062k92561l883j61372j17863j90588J13093
$$ plain form
19671 915103 812412 767272 1247424 1390825 1595396 1807958 1871505 1763862 1696825 1533123
19661 1533123 1488334 1193523 1157190 1311430 1616101 1883471 1912488 2154690 2051159 2108729
19651 2108729 1996325 2013589 1982384 1975642 1862864 1755645 1582210 1878701 2192844 2445761
19641 2445761 2732871 3421053 4411919 6111726 8346139 10408692 11705346 12342171 12660322
19632 12660322 12998294 12931530 11771066 10051940 8894576 8991144 9803652 11138963 12462917
19623 12462917 13049290 12790798 12638556 12447447 11499197 9847610 7816128 6002553 4779841
19614 4779841 3816559 3159922 2687228 2459269 2013013 1780687 1632087 1577397 1598598 1703879
19604 1703879 1568060 1598136 1834586 1658524 1365963 1362080 1200708 1082845 892257 1005350
19594A005350K29446o9251j99073k05696l3397p2391k2820M1607J03266k59237
19584E17804l18427P9570L70704L19232k1844K3799j37053k24492j05212r4297
19574D09784L7041j03266L4833Q6553j56990n3407j31280O9674J25477J20920
19564D39339J16727M4971j93782L00344L69082J15788j84936j77383j92902R7322
19554G34570k098n1299j11988o0872J68392J32360m2431j11578m1065j8108Q9446
19543F85329m0308M6582K56266K06502j4932k5202Q6473J33237j10985O5974j01022
19532A187914J24679K1121l3129r6560K6729J72565p2453j60612J05637J89556
19522A465447K49019n0369R7576J1777J00973J93997O2897l7454q2176K46177
$$ plain form
19594 1005350 1234796 1165545 966472 760776 727379 654988 632168 673775 777041 517804
19584 517804 199377 278947 649651 968883 947039 970838 833785 609293 504081 409784
19574 409784 446825 343559 378392 464945 307955 254548 123268 192942 318419 439339
19564 439339 556066 601037 407255 707599 1076681 1192469 1007533 830150 637248 734570
19554 734570 732472 681173 569185 508313 676705 809065 766634 655056 613991 595883 685329
19543 685329 645021 691603 947869 1154371 1139439 1114237 1200710 1333947 1222962 1288936 1187914
19532 1187914 1312593 1333714 1300585 1204025 1230754 1403319 1330866 1170254 1275891 1465447
19522 1465447 1714466 1664097 1761673 1773450 1874423 2068420 2131317 2093863 2011687 2257864
19512B257864n0924J94837L55077N92039N43675L86349J30001N9853k43645k97649
19502C927477q855R6498J12027N1810K1590M24372M88959P37266R62614R06972
19492G720730J068728P15404N42896N66345M84246Q7904k62568k98738j52786
19483A0472161K57049N65159R90099J412419J853660K483359L294438M461041
19475B5789385N666141P671590J1012413J7958749L1517664N5503585Q3793345
19468B38912872R4785896Q5838602M2254353j3766509o2202372q9363175q4234629
19461B12225038o0875317l4313500j4097937K505039K0686003M6765681P8720849
19454B51615856R2712142Q4897877M4941247j3564772o3535906r4158290r0945745
$$ plain form
19512 2257864 2206940 2401777 2756854 3348893 3892568 4278917 4408918 4468771 4225126 3927477
19502 3927477 3918622 4015120 4127147 4178957 4200547 4624919 5113878 5851144 6813758 7720730
19492 7720730 8789458 9504862 10047758 10614103 11098349 11186253 10923685 10624947 10472161
19483 10472161 10729210 11294369 12284468 13696887 15550547 18033906 21328344 25789385
19475 25789385 31455526 39127116 50139529 68098278 99615942 155119527 238912872
19468 238912872 333698768 419537370 461791723 448025214 385822842 296459667 212225038
19461 212225038 151349721 117036221 102938284 105443323 126129326 172895007 251615856
19454 251615856 344327998 429225875 474167122 460602350 397066444 302908154 211962409
19447B11962409o9236458m4197012k6324091j6111298j0621554p901894o370109
19440C1199993m716156l782507k754843j960829j577726j206874n49222m78076
19432A4173760r7633k43466k90428o46657r63633j072991q12496o47315n83122
19423H816019l53889k76160j36757j50767o3204N33219J556225K654810L235077
19414A5814573K785708J181057n09426k295418k938847k718734j936944j453050
19406G928919q43498n8688N01735J587564K551072K929949K685633J589494r23900
19397A7948280k698565l635666l119937k197953j410963j012441m50916k12327
19389C209512l51718j63642l28522k37474M1356k06883j64011j99961j0020l2049
$$ plain form
19447 211962409 142725951 98528939 72204848 56093550 45471996 37570102 31199993
19440 31199993 26483837 22701330 19946487 17985658 16407932 15201058 14651836 14173760
19432 14173760 14076127 13832661 13542233 12895576 11931943 10858952 10046456 9399141 8816019
19423 8816019 8462130 8185970 8049213 7898446 7835242 8368461 9924686 12579496 15814573
19414 15814573 18600281 19781338 19271912 16976494 14037647 11318913 9381969 7928919
19406 7928919 7085421 7026733 7528468 9116032 11667104 14597053 17282686 18872180 17948280
19397 17948280 15249715 11614049 8494112 6296159 4885196 3872755 3421839 3209512
19389 3209512 2857794 2694152 2365630 2128156 2169512 1962629 1798618 1598657 1588637 1556588
19379A556588M4611L9613o6621j61541j24482p3268j15401l1879J76790J57762
19369A402172l2446J3491k07749o5969O5098Q8667k551L5525K37814R9799j60364
19358A473487J63924L58582L45169K32886N9545N5233j06129q7734l0342L1208
19348B495829K0808j02920k31662j34989m23222M2725K14119K12519N6577k1106
19338B128678j84227n5173J31961J56988P7412q0083l5827J08049K0594K16120
19328B484492j9538O163J22203K63302M9583k90210r4857o2956J27463J10688
19318B696333J06447M3712N7028R7330J18795K52527K33007J8385o379L8019K00472
19307C855676J76923J28532R2610L60036L61220Q1358l1469L32337M87947J8809
$$ plain form
19379 1556588 1601199 1640812 1574191 1412650 1288168 1214900 1099499 1067620 1244410 1402172
19369 1402172 1369726 1383217 1175468 1109499 1174597 1263264 1260713 1296238 1534052 1633851 1473487
19358 1473487 1637411 1995993 2341162 2574048 2633593 2688826 2582697 2494963 2464621 2495829
19348 2495829 2516637 2413717 2182055 2047066 1623844 1666569 1880688 2093207 2149784 2128678
19338 2128678 1944451 1889278 2021239 2178227 2255639 2175556 2139729 2247778 2268372 2484492
19328 2484492 2464954 2471117 2593320 2856622 2906205 2615995 2521138 2458182 2585645 2696333
19318 2696333 2802780 2846492 2903520 3000850 3119645 3372172 3605179 3623564 3617185 3655204 3855676
19307 3855676 4032599 4161131 4253741 4613777 4974997 5056355 5024886 5357223 5845170 5863979
19297E863979J2315q0416j03439Q5541j23408k94620k02399k88384k37638j97952
19287D433579j71001k02862N885r7934k85778j65550j84805k7023O8169l1290
19277C341390j69010J12923k12827j70897l2198j2985j07852k39011J7942k5643
19267B501832m1708O8239J95772q3763k18724K1257P8897j55869k1225O7851P8718
19256B491277J42082j14402k4466J01586J91368R7151J68439L65202J30266k6057
19246C522446L17560J65537L65167M93753K89834j17678K4574J69732P1080p5510
19236E226495O648q0210j2036J38250L63204L96624Q2557J11211N6219k1062J01184
19225F369084o8597m7698J55104K13334O01021P81430J069063R51165J093391
$$ plain form
19297 5863979 5876294 5795878 5692439 5777980 5654572 5359952 5157553 4869169 4631531 4433579
19287 4433579 4262578 4059716 4065601 3967667 3681889 3516339 3331534 3304511 3372680 3341390
19277 3341390 3172380 3285303 3072476 2901579 2869381 2856396 2748544 2509533 2527475 2501832
19267 2501832 2460124 2528363 2724135 2640372 2421648 2442905 2521802 2365933 2344708 2412559 2491277
19256 2491277 2633359 2518957 2494491 2596077 2787445 2884596 3053035 3418237 3548503 3522446
19246 3522446 3840006 4005543 4370710 4864463 5154297 5036619 5061193 5230925 5302005 5226495
19236 5226495 5233143 5152933 5140897 5279147 5642351 6038975 6121532 6232743 6288962 6267900 6369084
19225 6369084 6300487 6252789 6407893 6621227 7222248 8003678 9072741 10023906 11117297
19216A1117297J122872J314505K174061L005340M569332P350430J2062665K1373849
19208F4090351L5938005M6989403L8848180K1553202R86830k3726237l8036107
19201A46643627l6061950k2896636q056785N789926K1059380L5589427L5583682
19194A77650671K1194462L582318j9459460l6824860m0586257l1860896k0287274
19187E3408704j2659304q081898n430939l740007k937952k168425k003698j768656
19179A4617825j305194r02675n15760j13409J3725L06472J99486j00333k37072
19170A1963065k97815k53394m37341K48638N02526P49874J251330J516437J556882
19161A6800202J719226K096052K935442M156317O645918J0971064J8223234L1501228
$$ plain form
19216 11117297 12240169 13554674 15728735 18734075 23303407 30653837 42716502 64090351
19208 64090351 100028356 147017759 185865939 207419141 208405971 184679734 146643627
19201 146643627 110581677 87685041 79628256 85418182 106477562 142066989 177650671
19194 177650671 198845133 202427451 182967991 146143131 105556874 73695978 53408704
19187 53408704 40749400 32667502 27236563 23496556 20558604 18390179 16386481 14617825
19179 14617825 13312631 12409956 11894196 11780787 11794512 12100984 12300470 12200137 11963065
19170 11963065 11665250 11411856 10974515 11223153 11725679 12475553 13726883 15243320 16800202
19161 16800202 18519428 20615480 23550922 27707239 34353157 45324221 63547455 95048683
19153I5048683N0822428O1228723M5817574K2344901o673359l7079564n0736757
19146A80772629m3882526k5596625o912891J1356583L3457833N2231262M5803466
19139B47229731K3477668j718019l3627188n3743334n4179719m0100348k5229328
19132F2109463j5679066j0043083o801267m623367l097478k509135k337859k031471
19124A4986737j677259j487886j076928p87231m56498l27377l45290j87428m68015
19115H172825o07372o48852m42074m29429n81767l69008l05465J47794O23854
19106E560506R54481J336781J369279R30701J51166p20836j200690j216609j283172
19097E881607q66735l65736R5443O91463J088059J171490O51633j12045q14977
$$ plain form
19153 95048683 145871111 207099834 252917408 275262309 268588950 231509386 180772629
19146 180772629 136890103 111293478 104380587 115737170 149195003 201426265 247229731
19139 247229731 270707399 268989380 235362192 181618858 127439139 87338791 62109463
19132 62109463 46430397 36387314 29586047 24962680 21865202 19356067 17018208 14986737
19124 14986737 13309478 11821592 10744664 9957433 9500935 9173558 8828268 8640840 8172825
19115 8172825 7565453 6916601 6474527 6045098 5463331 5094323 4788858 4936652 5560506
19106 5560506 6514987 7851768 9221047 10151748 10302914 9582078 8381388 7164779 5881607
19097 5881607 5014872 4649136 4744579 5436042 6524101 7695591 8347224 8235179 7420202
19088G420202j221309j241744j023736n99295n84240l12512j30384l67868k24845
19079A714269m0411l3022l8218N8170O2785j5057J32966J50883n9582r5344q9330
19068A748109L36j76082r1808p3496J3554j0029q5264K53493M6285p1814n373
19057A547911n419j74205R5405K34912K88482R53159J752652J869932J859458
19048H422287J220496L30269n79581j463977j588503j363926o43514j53259O30945
19039D811237J180815J687822J325824N02051N5747j056478j585442j555046j410031
19030C956499j106145q13750l85342r9812j87714q0965j2424k06127j90156R4531
19020I68595J28614K2445N2263l5867l56970j00296J93013J78518J82641o258
$$ plain form
19088 7420202 6198893 4957149 3933413 3334118 2749878 2437366 2306982 1939114 1714269
19079 1714269 1673858 1640836 1602618 1660788 1723573 1708516 1841482 1992365 1932783 1837439 1748109
19068 1748109 1748445 1572363 1480555 1407059 1420613 1410584 1325320 1578813 1625098 1553284 1547911
19057 1547911 1542492 1368287 1463692 1698604 1987086 2940245 4692897 6562829 8422287
19048 8422287 9642783 9973052 9393471 7929494 6340991 4977065 4333551 4180292 4811237
19039 4811237 5992052 7679874 9005698 9507749 9563496 8507018 6921576 5366530 3956499
19030 3956499 2850354 2036604 1651262 1551450 1363736 1282771 1270347 1064220 874064 968595
19020 968595 1097209 1119654 1171917 1136050 779080 678784 871797 1050315 1232956 1226698
19010A226698l89695l57751j10745J69440J74349k54481n5761J44210O1464J48692
19000G56420J40151j90030k31396j24629l41235K02583Q011Q9253k534j6133N8474
18989C48935j385K9408j3511m35188L9756P6810P2018K18957j47709K0830k79592
18978g0671O9755J20201N9365J04134J15099O350k61328j56388J46807J83662
18968C16986L0305j82179j37148L61928R5799M5574K25308n6827p1835l23881
18958C04030q4266J33042j17953j52428O6780k0345J9563J46897K55591j67452
18948C83459j13318n5585m1617N1651m5022n1664l5166j47087k6862Q1241K04197
18937B04227N9593j2508r7002J71414J14109p0584j92857j54194n5995p7081Q4023
$$ plain form
19010 1226698 837003 479252 368507 537947 712296 457815 402054 546264 607728 756420
19000 756420 896571 706541 475145 350516 9281 211864 219875 309128 306594 290461 348935
18989 348935 347550 376958 363447 -71741 -31985 44825 116843 335800 188091 208921 -70671
18978 -70671 -916 119285 178650 282784 397883 404233 142905 -13483 133324 316986
18968 316986 347291 165112 27964 389892 485691 531265 756573 699746 627911 304030
18958 304030 219764 352806 234853 82425 149205 128860 148423 295320 550911 383459
18948 383459 270141 214556 172939 224590 179568 127904 92738 -54349 -81211 30 204227
18937 204227 263820 251312 154310 325724 439833 369249 176392 22198 -33797 -110878 -26855
18926b6855k8097J66573M06557O9186j30499j7087k6061l2542J63799q8605J4766
18915D71135J38068l9317q0211k5368J55072j39952k6115k7568L00062P1417o7231
18904G29992J59228K049k12300R281J20265K2987M2550O6666J144k9477k36337
18893F76048j84260q356R5627j49152r041R6059O3391K45216K91852j33223j67994
18882H16167J49372J444J04199l9850K29499J04476J7936M8333j51244j03855
18872A176477O1961L03442o9262p7542j02097n4305m4111J57203L54997K9931
18862A736694K25356K50494J71888J30415r1832J02130N3720l7219M94879L83692
18852C420217J87270K95023M16650K80868M49207M42770P08326Q24735N62103
$$ plain form
18926 -26855 -54952 111621 518178 587364 456865 439778 413717 381175 544974 456369 471135
18915 471135 609203 569886 489675 464307 619379 479427 453312 425744 725806 797223 729992
18904 729992 889220 891269 678969 688250 808515 831502 874052 940718 941862 912385 676048
18893 676048 491788 483432 579059 429907 420866 516925 580316 825532 1117384 984161 816167
18882 816167 965539 966983 1071182 1031332 1260831 1365307 1383243 1431576 1280332 1176477
18872 1176477 1238438 1541880 1472618 1395076 1292979 1238674 1194563 1351766 1706763 1736694
18862 1736694 1962050 2212544 2384432 2514847 2423015 2525145 2578865 2541646 3036525 3420217
18852 3420217 3607487 3902510 4319160 4600028 5049235 5492005 6200331 7025066 7587169
18843G587169P36567J018129P52827P71776Q49802J099418J532330K029267K711226
18834A9088511L622277M941898P155277J1087219J7792368L0145826M7000933
18827A40834309N1245341K8388748J0040555J6856965L6729819L5460267J5768464
18820C35324468j7332441l7109064k9055943r223527j3072755l5353092m7977416
18813A46200230m2158369k8973465j8637898j2110702p905252n385125m188515
18806B6840904l431752k359273j888391j578429j185504r08349q23918m54173
18798A4211115n27490p11433n99593n00250n04444n78294m10646k70067j78925
18789I929973Q1617k9233J37530K92159L7171M70232R70405J146080J606900K113071
$$ plain form
18843 7587169 8323736 9341865 10094692 10866468 11716270 12815688 14348018 16377285 19088511
18834 19088511 22710788 27652686 34807963 45895182 63687550 93833376 140834309
18827 140834309 192079650 220468398 230508953 247365918 284095737 319556004 335324468
18820 335324468 317992027 280882963 251827020 242603493 229530738 194177646 146200230
18813 146200230 104041861 75068396 56430498 44319796 36414544 31029419 26840904
18806 26840904 23409152 21049879 19161488 17583059 16397555 15489206 14665288 14211115
18798 14211115 13683625 12972192 12372599 11872349 11367905 10789611 10378965 10108898 9929973
18789 9929973 10011590 9982357 10119887 10412046 10449217 10919449 11889854 13035934 14642834 16755905
18779A6755905K758931L934125N635426Q855592J4992346K5324292L7768125L6154842
18771A52179584J6776636O173358J5956994L0002709K5125745Q189531j8505000
18764B35899557k9510694j8783150l635229j2594235l0586890l6935970k9367160
18757G4486229j8471516j1309192p337340m888938k644197j585153j507825j866179
18749B4875889k385265k364422j505520j136692j660518k195903k225961j790879
18741I610729j400472r40437o28014o89047p88527n40095n19363m56329k58672
18732C389773j76824j76327m85824j63601j22639l3329j28646n1559j87835k81319
18722A581870J66650K31723j75001m3850j1319K507j07728l57946M2711J49894
$$ plain form
18779 16755905 19514836 23448961 29084387 37939979 52932325 78256617 116024742 152179584
18771 152179584 168956220 175129578 191086572 221089281 246215026 254404557 235899557
18764 235899557 206388863 187605713 183970484 171376249 140789359 103853389 74486229
18757 74486229 56014713 44705521 37368181 32479243 29835046 28249893 26742068 24875889
18749 24875889 22490624 20126202 18620682 17483990 15823472 13627569 11401608 9610729
18741 9610729 8210257 7269820 6641806 5952759 5164232 4624137 4104774 3648445 3389773
18732 3389773 3212949 3036622 2550798 2387197 2264558 2231229 2102583 2051024 1863189 1581870
18722 1581870 1748520 1980243 1805242 1761392 1750073 1752580 1644852 1286906 1329617 1479511
18712A479511L6036j58598k6411p1354K49654L08900M84062J17892N09705J144129
18702D073526J427074R12840L68371K52798Q37534R50523M74119m23564p59176
18693H114045r05186l96760k74059q87625j202144j125637p78093m31567p9585
18684B033389j25188l03585K5416L8302K60286J46078J26964J80005k98514j30862
18674A952291j30901o2178k68258k48616J57131K72325J22077L2401J87707L25471
18664B339450K3414k03807m58123n02451p1516q0623k67793k50668k20212J19744
18654D27415r8820r940O8774q0751M9590J61715j5555J11630r2696o4799r3262
18643C63301m538J5778m1616R4390o7872j13905m5635P4058J165k4154o38n0058
$$ plain form
18712 1479511 1515547 1356949 1330538 1259184 1508838 1817738 2301800 2419692 2929397 4073526
18702 4073526 5500600 6413440 6781811 7034609 7872143 8822666 9296785 8873221 8114045
18693 8114045 7208859 6812099 6538040 5650415 4448271 3322634 2544541 2112974 2033389
18684 2033389 1908201 1604616 1630032 1668334 1928620 2074698 2201662 2381667 2083153 1952291
18674 1952291 1821390 1759212 1490954 1242338 1399469 1671794 1793871 1826272 2013979 2339450
18664 2339450 2362864 2159057 1700934 1198483 1126967 1046344 778551 527883 307671 427415
18654 427415 328595 318655 387429 306678 356268 517983 502428 614058 521362 456563 363301
18643 363301 358763 374541 332925 427315 359443 245538 199903 273961 275126 250972 250334 200276
18631B00276o79J06716J96290K80102J24554O1924j66475J14254J84510q2126
18621A019346j46277J9899k05q5990m3778j21831J02769O5309O6334j7853K04141
18610A061864J48126o3505l52281k34484j46859n1249L8543m1178Q7676P0905
18600E17558j0252p360M1980j5555n1801j18534m3696j23657k44926j58180K87146
18589G2723J92207q3479j06083O3105K40306J61805k01712k58661p9936n2340
18579e2065J76980L133j21657L94743J19206p0859r3292J80966K58624n269j52033
18568F38477M8840k9674k07990k6051k5808l5412p6596j42064j31260l3470J31729
18557A10721J37079l9133j64521o3562r2781L03084k0495j14663j23335J17295
$$ plain form
18631 200276 199597 306313 502603 782705 907259 969183 802708 916962 1101472 1019346
18621 1019346 873069 892968 892763 806773 762995 641164 743933 809242 875576 857723 1061864
18610 1061864 1209990 1146485 794204 559720 412861 361612 400155 358977 446653 517558
18600 517558 507306 499946 541926 526371 474570 356036 312340 188683 -56243 -214423 72723
18589 72723 264930 181451 75368 138473 378779 540584 338872 80211 275 -52065
18579 -52065 124915 128048 6391 401134 520340 449481 356189 537155 795779 790510 638477
18568 638477 687317 657643 449653 423602 397794 362382 285786 143722 12462 -21008 110721
18557 110721 247800 208667 44146 -19416 -112197 190887 170392 55729 -67606 49689
18547D9689N8962j29325L9591M7481M3213r3277J16047J14286j19782j22403J53506
18536A57988m3370j67645j30652J9730L27920L823j90320m2154N8259Q7126P8082
18525A58787J96328J06438k11513k08226n8390R4129j08878r0401N5024l8734
18515a05436L5060J18753J23226L2015P9984n9894J60259J30817R2776j25717
18505D81843q5625R9946j4074J18694m6005o1445M56j75313k3625q8650q9191
18494A17011j42879K135N1976J51250M3050j15631n8031O4688L6131J05170M1437
18483B96307R5315Q5649l6201N4415p7102p3339j99671j49535O5846J65135J74334
18472D01153m7161k8126m5909M0874Q3846r1834R539R3450K705l1458J99349l7590
$$ plain form
18547 49689 108651 -20674 18917 66398 109611 16334 132381 246667 126885 4482 157988
18536 157988 114618 -53027 -183679 -163949 163971 167794 -22526 -64680 -6421 80705 158787
18525 158787 355115 461553 250040 41814 -16576 77553 -31325 -121726 -66702 -105436
18515 -105436 -70376 48377 171603 203618 283602 223708 383967 514784 607560 481843
18505 481843 396218 496164 482090 600784 554779 493334 493790 318477 294852 206202 117011
18494 117011 -25868 -23733 28243 179493 222543 106912 48881 113569 149700 254870 296307
18483 296307 391622 477271 441070 495485 418383 345044 145373 -4162 61684 226819 401153
18472 401153 353992 325866 279957 320831 404677 312843 322382 415832 418537 387079 586428 548838
18460E48838n8096j74009j70056q3113m9150l5999J5572o011J30441J93071o0365
18449B51123j20722j31377j33658O3342J87416P0080o7274j49152k28142j14764
18439c73128N7787J53293J75724J46451k40277k9288N7901j76640j09647K10132
18429a27692P4402K12203L89165p2864Q8100P8482J07847J31913K55426K65000
18419A401982K41938j08360k93168J2193P3628L90839K20233p8859l11347j29726
18409A419353p0209L4755J68315J32596K1145m2008j69948J0990J13033l369k66872
18398A347781p5159r4803j64975j44390l92554k24196L5890q3037n623p0674l45449
18387b17189J19142J06915M6005J59004L3860o3758P5424K26788J42617K6098
$$ plain form
18460 548838 490742 316733 146677 63564 14414 -21585 -6013 -12024 118417 311488 251123
18449 251123 130401 -976 -134634 -71292 116124 186204 118930 -30222 -258364 -373128
18439 -373128 -315341 -162048 13676 160127 -80150 -109438 -51537 -228177 -337824 -127692
18429 -127692 -53290 158913 548078 475214 563314 641796 749643 881556 1136982 1401982
18419 1401982 1643920 1535560 1242392 1254585 1328213 1719052 1939285 1860426 1549079 1419353
18409 1419353 1349144 1383899 1552214 1684810 1705955 1663947 1493999 1504989 1618022 1614653 1347781
18398 1347781 1272622 1177819 1012844 868454 475900 251704 287594 204557 198934 128260 -217189
18387 -217189 -98047 8868 54873 213877 247737 183979 259403 486191 628808 654906
18377F54906j10155m9105r8487k15456p8018k99124m1311L60001J13405J3943
18367B50599R1260j66250k48205N1092M0961L2712l9380J54371R4018j53602n0236
18356E7340j18433q231K04212K18044O7625J64431J229n026l8209K6726N7615
18345F27323k69940j72988J02768j46687n3544J92960j9416k7817J96199j21865
18335C06993j01371j54880p3889j62214K52031L09690m6959l6448p8603j09374
18325A04976J73619J149K17274J5867j15287M6480k29813k78676k6170J16742
18315B6161J34686O1998J12309l6117J79375j3779K42474J91884j76576j04490
18305F17925M791J68031L4123O7520p491o911R1265K15523M55993J27505J9103
$$ plain form
18377 654906 544751 495646 397159 181703 103685 -195439 -236750 123251 236656 250599
18367 250599 341859 175609 -72596 -21504 19457 52169 12789 167160 261178 107576 57340
18356 57340 -61093 -69324 134888 352932 420557 584988 586217 581191 542982 569708 627323
18345 627323 357383 184395 287163 140476 86932 279892 260476 232659 428858 306993
18335 306993 205622 50742 -23147 -185361 66670 376360 329401 292953 214350 104976
18325 104976 278595 279744 497018 512885 397598 444078 214265 -64411 -90581 26161
18315 26161 160847 222845 335154 299037 478412 464633 707107 898991 722415 617925
18305 617925 622716 790747 824870 892390 884899 877988 969253 1184776 1640769 1768274 1787377
18294A787377J55319K64120R6781O2515l65524l15891j07566k37910j26339J49950
18284A362832N802k33274o6505N2131K77625n822l04312l52004K3546J41559N24696
18273A426274L85394j8173j03801q9056k26734j73399J22423K5854k220K12019
18263A558581Q2515K86382J0066j61571p0627J78071K30817R7143j1893J4801
18253B214285J15572J44874K12601K76383J06857L3141q7187Q8409K74338J84990
18243C564263L06539J42302J58096K00004J47265o040K22675j01044j44862k77767
18233D211431j95892j59123j00040Q3901j32121k83245k47005p4317j58234k09201
18223B736154K035J24141J3719q7404m6837j85674k39766l392o357j05049j9954
$$ plain form
18294 1787377 1942696 2206816 2303597 2366112 2000588 1684697 1577131 1339221 1212882 1362832
18284 1362832 1368634 1135360 1068855 1120986 1398611 1392789 1088477 736473 760019 901578 1426274
18273 1426274 1811668 1793495 1689694 1600638 1373904 1200505 1322928 1348782 1346562 1558581
18263 1558581 1641096 1927478 1937544 1775973 1705346 1883417 2114234 2211377 2199484 2214285
18253 2214285 2329857 2474731 2687332 2963715 3070572 3103713 3016526 3104935 3379273 3564263
18243 3564263 3870802 4013104 4171200 4371204 4518469 4512429 4735104 4634060 4489198 4211431
18233 4211431 4015539 3856416 3756376 3840277 3708156 3424911 3177906 3103589 2945355 2736154
18223 2736154 2738189 2862330 2876049 2788645 2741808 2556134 2316368 2312976 2306619 2201570 2181616
18212B181616j46861k8377l09217k46521J3344J91308L8198L680J81878J18322
18202A997370j84269j11636J65965p8420j73233k16048j67279Q5780J00536k08125
18192A210641k27872O008q8602j04054Q9910o815l5314O3182J54131O5615l79647
18181G47183r4197j58579P9534J85227J28261j21652j79211k79414K055K1944
18171C31151k0109m6407N2911K31707j3037r4868K46934l3344J6124J59914R8103
18160I29079M3874N6166L4920r4446k88649J4485K80023k00491l40471J24673
18150E59163K08405r1483K3209L6115j1797J32648j4910j29315j690j99289J53293
18139F64349L3705J57152J79754L3378j96403j48621k81524J87597K46467o3388
$$ plain form
18212 2181616 2034755 2006378 1697161 1450640 1463984 1655292 1693490 1697170 1879048 1997370
18202 1997370 1813101 1701465 1867430 1789010 1615777 1399729 1232450 1318230 1418766 1210641
18192 1210641 982769 988777 900175 796121 886031 879216 843902 907084 1061215 1126830 747183
18181 747183 652986 494407 573941 759168 887429 765777 586566 307152 309207 331151
18171 331151 311042 264635 317546 549253 536216 441348 688282 654938 671062 830976 929079
18160 929079 972953 1029119 1064039 969593 680944 695429 975452 774961 434490 559163
18150 559163 767568 676085 699294 735409 723612 856260 841350 712035 710345 511056 664349
18139 664349 698054 855206 1034960 1068338 871935 723314 441790 629387 875854 812466
18129H12466l79833j47675R2701K68651j4877k8522l0832k05884j68091J54977
18119C53081n777j8304j19755r7483K08782J64196K27765j22944l8607J99565
18109G50519J04439M1290L5399m5313P1830K3583N5585N7737K71977J10769p9434
18098A398381j88886J7310J55302J7591R3840O6080k2418o7789p3632k52617k57384
18087H85778k27332k30406k5446l69644o8776j3309J32074Q9552K24432J16909
18077E13832k65876p488K1534O7615R6753M6926M7979r5332q8993n9446J7484
18066B94988J25924j59296p9326N7574K39605M144J45711K31745L96708L93169
18056A650946K57844l9937k06637k41824l72944O0674R3324k59200k56326j47340
$$ plain form
18129 812466 432633 284958 377659 646310 631433 602911 572079 366195 198104 353081
18119 353081 347304 329000 209245 111762 320544 484740 712505 589561 550954 750519
18109 750519 854958 896248 931647 886334 958164 981747 1037332 1095069 1367046 1477815 1398381
18098 1398381 1209495 1226805 1382107 1399698 1493538 1559618 1537200 1469411 1395779 1143162 885778
18087 885778 658446 428040 402594 32950 -35826 -49135 82939 172491 396923 513832
18077 513832 247956 240468 262002 329617 426370 473296 521275 425943 336950 277504 294988
18066 294988 420912 261616 182290 239864 479469 483613 629324 861069 1257777 1650946
18056 1650946 1908790 1868853 1662216 1420392 1047448 1108122 1201446 942246 685920 538580
18046E38580R2930N3079k62284k57579J16139J86963k38397k60525O8725r5237
18036e7606j71819K09050J22442K37514j72373r1049K02596J5128j19721k26362
18026e2200l0158K2324J52583O6553l9860J07697Q2714J79199l0713k32193q0151
18015A45795O2346p8913J43775K18728j3193n4000J64279J33918j98905J1023
18005E34853K29413r55q9590J06568P3914J06346l862L3377J1527l9304M15230
17994A377517L55711P7197j22737j42051R4056j87051j29333k68151j19572P6212
17984A011798j62575j25592J02459J7738l2756K29133K48242k5278O1170j37310
17974A187029k2745j64876j42357N3984J32793N4332j07258k92368m0330K19938
$$ plain form
18046 538580 631510 684589 422305 164726 280865 467828 229431 -31094 37631 -57606
18036 -57606 -229425 -20375 102067 339581 167208 76159 278755 293883 174162 -52200
18026 -52200 -82358 -60034 92549 159102 119242 226939 309653 488852 458139 225946 145795
18015 145795 208141 129228 273003 491731 478538 424538 588817 722735 523830 534853
18005 534853 764266 763311 673721 780289 854203 960549 956687 990064 1001591 962287 1377517
17994 1377517 1733228 1810425 1687688 1545637 1639693 1452642 1323309 1055158 935586 1011798
17984 1011798 849223 723631 826090 843828 811072 1040205 1288447 1263169 1324339 1187029
17974 1187029 1164284 999408 857051 911035 1043828 1098160 990902 698534 658204 878142
17964H78142J3367k37794K30715J72609r0946j74604M6173R5261p2797J53108
17954A013234j49065K6657N1726j73212J21789K507L9005q4990Q352k43215N4626
17943F67414K12394K5896J39521J86244L3777J76393j13094k18992l9281J26889
17933A197161N1099p4817j18065q6881l817K72747J69166K05819m324k17632j69748
17922A220708L8646j32271P7229L2461o1132K52235M5243j18209r7313j46160
17912A111437K7634O4294J4119J62954J89935q5381r7089J71532O606p0590Q3472
17901A578923J34391j08622L15935J44513J63762J81478J06038j55706Q3888N2690
17891B497290k771R4856L46851L67696N25124K56748K35847J43094K31345K30183
$$ plain form
17964 878142 891509 653715 884430 1057039 966093 791489 837662 932923 860126 1013234
17954 1013234 864169 890826 942552 769340 891129 893636 932641 847651 856003 612788 667414
17943 667414 879808 905704 1045225 1231469 1265246 1441639 1328545 1109553 1070272 1197161
17933 1197161 1248260 1173443 1055378 968497 964680 1237427 1406593 1612412 1608088 1390456 1220708
17922 1220708 1259354 1127083 1204312 1236773 1175641 1427876 1473119 1354910 1257597 1111437
17912 1111437 1139071 1203365 1217484 1380438 1570373 1484992 1387903 1559435 1566041 1495451 1578923
17901 1578923 1713314 1604692 1920627 2065140 2228902 2410380 2516418 2360712 2444600 2497290
17891 2497290 2494519 2589375 2936226 3303922 3829046 4085794 4321641 4464735 4696080 4926263
17881D926263K06138J14703L73481L35756J82936N23824O66798R95786P58524
17872I084209M39523M08848O99762J202854J424872J523117J358395J079008J098701
17863A8319289K027284L459329N313751P434586J1407876J8531607L2480339N7390781
17855A56364842Q3676696O9679839J1527719l4479453l6850941k098259M0340951
17848B88161394M6990559j320141n1999743o5121810m2962092q040689K9499446
17841A95206924O4926067O3616950J1831469l6195475m3602746j1685586L1690427
17834B75788030M5153287J178314n4498413p6291009o3004520m0088288k4041465
17827F4195936j4776320r667499o581884n013490l747613k613542j692082j629822
$$ plain form
17881 4926263 5132401 5247104 5620585 5956341 6139277 6663101 7329899 8325685 9084209
17872 9084209 9523732 9932580 10632342 11835196 13260068 14783185 16141580 17220588 18319289
17863 18319289 20346573 23805902 29119653 36554239 47962115 66493722 98974061 156364842
17855 156364842 240041538 309721377 321249096 286769643 249918702 247820443 288161394
17848 288161394 335151953 333831812 281832069 216710259 173748167 165707478 195206924
17841 195206924 260132991 323749941 335581410 299385935 255783189 244097603 275788030
17834 275788030 320941317 322119631 267621218 191330209 128325689 88237401 64195936
17827 64195936 49419616 39752117 33170233 28156743 24409130 21795588 20103506 18473684
17819A8473684j479220j697691j388304o16619o16412o93312j121608j139825
17811I720693q21904n57832l61526j74853m62891o96205m68554o50217o8046Q1098
17801E539763k70135q5550j51726m9553J36467P92532J636485K286252K432362
17792A2266897J648981m68674j762680j282785L42633J822417Q73145j215985
17784A2223949j985155k087100j154170o4710J610807K688268J805663l54684
17776A2682868j891551j428816j25433J330815J416826o89279k183351k693904
17768F418175j847843j244107o36660l24153l78191l79814j79466l22j25991j69033
17758A132595l46285M2072K0246j2765j55685p3300J9571k39325k6732K26902
$$ plain form
17819 18473684 16994464 15296773 13908469 13291850 12675438 11982126 10860518 9720693
17811 9720693 8898789 8340957 7979431 7804578 7341687 6645482 6176928 5526711 5458665 5539763
17801 5539763 5269628 5184078 5032352 4982799 5119266 5911798 7548283 9834535 12266897
17792 12266897 13915878 13447204 11684524 10401739 10744372 12566789 13439934 12223949
17784 12223949 10238794 8151694 6997524 6932814 8543621 11231889 13037552 12682868
17776 12682868 10791317 9362501 9237068 10567883 11984709 11295430 9112079 6418175
17768 6418175 4570332 3326225 2689565 2365412 1987221 1607407 1427941 1427619 1301628 1132595
17758 1132595 786310 828382 848628 835863 680178 606878 626449 387124 360392 587294
17748E87294o6580q560R6341j09047N6814K7453j34365l19204r1175P464J23796
17737A70231J37094k2151N2490M5027m0425j75862j57389L7667K53240j033p851
17726B91038j57286J41819J73293O2884r4953q921K70339L18815j37113j29429
17716G30486K6223k18047j24342L8884N9049J95131J1388j25592k13050j09347
17706B70783J74393O5433o0454k08274p7477o8584j20554m6358J41427m2974J95087
17695B22448K3052R5441o0681L1279l4269J54887O0763j08145r7150j01065O299
17684A92859J05896J13640R824l9813k04329j46870L3219J57405N1910k6040R8858
17673C46559j00003L2981J6281j67208k3508P8357J16482J04415k26306N0150
$$ plain form
17748 587294 520714 512154 608495 499448 556262 583715 449350 130146 38971 46435 170231
17737 170231 307325 285174 337664 382691 342266 166404 9015 46682 299922 298889 291038
17726 291038 133752 275571 448864 511748 416795 407874 678213 997028 859915 730486
17716 730486 756709 538662 414320 453204 512253 707384 718772 593180 380130 270783
17706 270783 445176 510609 450155 241881 164404 95820 -24734 -71092 70335 27361 222448
17695 222448 245500 340941 280260 311539 277270 432157 492920 384775 287625 186560 192859
17684 192859 298755 412395 422219 382406 178077 31207 64426 221831 273741 247701 346559
17673 346559 246556 279537 295818 128610 105102 183459 299941 404356 178050 228200
17663B28200J07284p8274j34819k3920K9304N2636j1046J89930q8858j729j09402
17652A59306R1437P174j15493Q0285J43685k09425j13694K51106J650l05062j82662
17641a91693j84072j9199R1889K51172K762l5825K4531N7964o4468J07528P6279
17630A16868k62221L60472J75001k33777k35697j23611j53701j01936K72078J54873
17620c1651K35723P4911j02721k12604n0661O9299P2680J03607K53471j23467
17610B88587o0431k4118J78722Q7633j68128j43455n3388r2241l3315r370j00684
17599a30188Q0528K87208l1876k12750o353M0148J83399j04126o9258q119j60779
17588a32166J96368J42484k20602J18070O0507m7154l42869J97015J42013j69211
$$ plain form
17663 228200 335484 257210 122391 98471 127775 180411 169365 359295 270437 268708 159306
17652 159306 250743 257917 142424 222709 366394 156969 43275 294381 296031 -9031 -191693
17641 -191693 -375765 -394964 -303075 -51903 -49141 -84966 -60435 -2471 -66939 40589 116868
17630 116868 -145353 215119 390120 156343 -79354 -202965 -356666 -458602 -186524 -31651
17620 -31651 204072 278983 176262 -36342 -87003 -17704 54976 158583 412054 288587
17610 288587 228156 204038 382760 470393 302265 158810 105422 13181 -20134 -29504 -130188
17599 -130188 -49660 237548 205672 -7078 -13431 26717 210116 105990 36732 28613 -132166
17588 -132166 64202 206686 -13916 104154 164661 117507 -225362 -28347 113666 -55545
17578e5545n9212J85910q1165m6673j52769j53724O1901o1756p3206P6535J07199
17567b52505J98975K66201O3338j50050n6851p4171k55597j62283O0454P6252
17557b86237k0940j4561j42919R4428K32000L14575Q5873J43783p3242j84242
17547A48518l1173j84421o3693o994l856K1507K16296q958J50369k78722M2161
17536A034J62874j01311k12058n8641N238Q0597P403M3369J79584J59865J2016
17525B79970N8554m6427j44094k14022j19586O5613K41476N6854o9830J56078
17515B64586m8718k45924k75388K76676J32388R0097O4014j48313r7061J79116
17505A91473j28939n848J28894O3965O2287L2307p6695k08732k1337j11047J19784
$$ plain form
17578 -55545 -114757 71153 -10012 -56685 -209454 -363178 -301277 -363033 -436239 -359704 -252505
17567 -252505 -53530 212671 276009 125959 69108 -5063 -260660 -422943 -362489 -286237
17557 -286237 -307177 -321738 -464657 -370229 -138229 176346 262219 406002 332760 148518
17547 148518 117345 -67076 -130769 -137763 -141619 -120112 96184 87226 237595 -41127 1034
17536 1034 163908 62597 -149461 -208102 -202864 -122267 -114864 -71495 108089 267954 279970
17525 279970 338524 292097 148003 -66019 -185605 -119992 121484 178338 108508 264586
17515 264586 215868 -30056 -305444 -28768 103620 193717 257731 109418 12357 191473
17505 191473 62534 56686 185580 249545 311832 344139 267444 58712 37375 -73672 46112
17494D6112J55728q0046r4043j43377J38502J55496l15694O0230K97531J78982
17484C99421K47582j52894l37249l36912j03626K10993Q9354j42457k83923j75034
17474e84745J09282J42998P8154L4456K05444L22523k41388m33173p1449J82458
17464b55440L37905K65100k7337q5708k27573j56122M2458J61838j25786j78575
17454b49240o3319J02818K96222k851N0790J24959P4452j16966P019L2947j92846
17443F3985k48085j6577R1050j33905K57790J21717M7284K11508j78821k14834
17433A112J81988K35474J0968j81970j6937q9317N8379L6008j08156N3646l4266
17422A46929k19711j40138m3133J32328r49K5940P478j04451K95966R4976k05187
$$ plain form
17494 46112 201840 121794 27751 -115626 22876 178372 -137322 -77092 220439 399421
17484 399421 647003 494109 156860 -180052 -283678 -72685 16669 -125788 -409711 -584745
17474 -584745 -475463 -332465 -254311 -219855 -14411 308112 66724 -366449 -437898 -255440
17464 -255440 82465 347565 320228 234520 6947 -149175 -106717 55121 -70665 -249240
17454 -249240 -312559 -209741 86481 83630 134420 259379 333831 216865 223884 256831 63985
17443 63985 -184100 -200677 -109627 -243532 14258 135975 183259 394767 215946 1112
17433 1112 183100 418574 429542 247572 230635 141318 199697 235705 127549 181195 146929
17422 146929 -72782 -212920 -256053 -123725 -124674 -98734 -91256 -195707 100259 195235 -9952
17411i952k14181k333m2106N7293K89727J67758r8411L2229k00738r3469Q3536
17400c0647J54560P2538j61346o4366J57555j71070k25681L12122n1229j37385
17390a44949j57245L711K28400J05010j18705j08643j44524j02593J47179L0879
17380b61480K05774n8537j65789K5868K65620P4146l301n6696N4479K29757O995
17369C16836j81722j76811k23922K31462J44418j64936j07160k5459J15784J2509
17359e9001q9451R2813J17354j53817o3245O5930j16810j79345k8297J79994M7605
17348a86270P8431q6499r4600J91161K49482j22251R627j79851j08746J31794
17338a17722J06349j02007q7527R9747Q8924j56439J14268O8780j45132K2338
$$ plain form
17411 -9952 -224133 -226466 -268572 -211279 78448 246206 147795 180024 -20714 -114183 -30647
17400 -30647 123913 196451 35105 -29261 128294 -42776 -268457 43665 -7564 -144949
17390 -144949 -302194 -298483 -70083 34927 -83778 -192421 -336945 -439538 -292359 -261480
17380 -261480 -55706 -114243 -280032 -254164 11456 85602 82301 25605 80084 309841 316836
17369 316836 135114 -41697 -265619 -34157 110261 -54675 -161835 -187294 -71510 -59001
17359 -59001 -148452 -55639 61715 -92102 -155347 -89417 -206227 -385572 -413869 -233875 -186270
17348 -186270 -107839 -194338 -288938 -97777 151705 29454 39081 -140770 -249516 -117722
17338 -117722 -11373 -113380 -200907 -101160 -12236 -168675 -54407 14373 -130759 -108421
17328a08421o9396L593K4046L2500K29342J7895j04191l9137k72285J937J12428
17317a71689M7616j96577n5672J19835P9364K13835J41020n4979j61179J1373
17307b7053k8300j45739J27798K13214q4785k78001K0126J94175j4303k38420
17297b61288k21077J8077M9175L1497K08495Q0571j31106R2390O7246j24699q2462
17286b73181K91541M85382K75412K35375K48017O0577m221K46982J21587J58282
17276A845753P4853j68696j58894j97905j13506j35262J3384M20951K49425J30998
17266A961101k64566l47327j46270L5744O2250m7923j63561l23216l81792j21416
17256B63024q8738K13795J67083p8532j22606j96834j09236k57550Q0179J82594
$$ plain form
17328 -108421 -177817 -174224 -150178 -117678 111664 129559 25368 -13769 -286054 -284117 -171689
17317 -171689 -124073 -320650 -376322 -256487 -177123 36712 177732 122753 -38426 -27053
17307 -27053 -55353 -201092 -73294 139920 55135 -222866 -202740 -8565 -22868 -261288
17297 -261288 -482365 -464288 -415113 -383616 -175121 -94550 -225656 -133266 -66020 -190719 -273181
17286 -273181 18360 503742 779154 1014529 1262546 1323123 1318902 1565884 1687471 1845753
17276 1845753 1920606 1751910 1593016 1395111 1281605 1146343 1159727 1580678 1830103 1961101
17266 1961101 1696535 1349208 1202938 1238682 1300932 1253009 1089448 766232 384440 263024
17256 263024 174286 388081 555164 476632 354026 157192 47956 -209594 -129415 53179
17246E3179J9223j15210J9488O7441R213N1943J01826r4459q3195O7535j72978
17235g5994j88706q7016J11784J83450J3804j5428k4051p0929J05691J05597J72830
17224B31032j06124L5266l7366l97998j22177L24920M4504r4364j03713k3714
17214b49734P7908O3334J14475J50267O4099L2075j70407j81901r0166J98559
17204H509j10508J02802J43580Q5798k49370l52547k20327J27122L32697Q2062
17194e0182k08101k3743r7440o1087l8577K7840J5262J66588J27920K27048J61705
17183B47233q1073M4270k30273j09898P2072K43447N9996M406q1608j26375j08925
17172f6728J03374q241j21948J67271R6450j5787j73594k55505M9231K61223K46570
$$ plain form
17246 53179 72402 -42808 -23320 44121 53334 105277 207103 112644 29449 96984 -75994
17235 -75994 -264700 -351716 -239932 -56482 -42678 -58106 -82157 -153086 -47395 58202 231032
17224 231032 124908 160174 122808 -275190 -397367 -72447 -27943 -122307 -226020 -249734
17214 -249734 -171826 -108492 5983 156250 220349 252424 82017 -99884 -190050 8509
17204 8509 -101999 803 144383 230181 -19189 -371736 -592063 -464941 -132244 -50182
17194 -50182 -258283 -282026 -379466 -440553 -479130 -451290 -436028 -269440 -141520 85528 247233
17183 247233 166160 210430 -19843 -129741 -57669 185778 245774 250180 168572 42197 -66728
17172 -66728 36646 28405 -93543 73728 170178 154391 -19203 -274708 -225477 35746 282316
17161B82316Q998j27779l6163J8668K27806j11579k23739j3721o6988n3150J7367
17150g7964N3123J40555P2407o3452J44481p5709J05973R6991L0106K5745l54996
17139I7260j62583K232K9007m3350n5065J96500K36499R963q2762p1863Q4743
17128B40581J33397n0020r2610r7772k97697n7675Q9382L8061m7565R8359l4465
17117g8024J01769J60759j75389n4288m6296j5154R6184k5781J88915K07755j72215
17106A88235j21519k6592N7764M7249J9635j89849k76271Q0649O1232M7095J82593
17095G0221J0861j95289p9385J36089J40320m1091q4266r6850R9426N9341J07940
17084A27317N4468k3500n9480j34608j55626q3136J82718J14484K0628l8510K1640
$$ plain form
17161 282316 291314 163535 127372 146040 373846 262267 38528 24807 -42181 -95331 -77964
17150 -77964 -24841 115714 188121 124669 269150 193441 299414 396405 426511 452256 97260
17139 97260 -65323 -63091 -34084 -77434 -132499 64001 300500 310463 227701 155838 240581
17128 240581 373978 323958 231348 133576 -164121 -221796 -132414 -94353 -141918 -43559 -78024
17117 -78024 23745 184504 9115 -45173 -91469 -106623 -10439 -36220 152695 360450 188235
17106 188235 66716 40124 97888 145137 164772 -25077 -301348 -220699 -159467 -112372 70221
17095 70221 81082 -114207 -193592 -57503 82817 41726 -42540 -139390 -39964 19377 127317
17084 127317 181785 158285 98805 -35803 -191429 -274565 -91847 22637 43265 4755 26395
17073B6395J76781K60386Q8025j23055k38068J0475K19473o5470l5590k0953l22789
17062b4390q1692R4413p7828j44617Q9042K8653J62121J77504M6705j06957j54465
17051H489l0109L4549L3577L481J77052K37240L3516j85026m07978J16554J84328
17040B05673K5383o9826j37677q3144J46774j02884Q5826R0002j07452q7317N5849
17029B1207k7609L4358N1688k46132j17737q0526O2653J49100J21228J21392j61793
17018g2171j50901J80023J16112j24954j45171k17532k10182K25951L62025j59131
17008a95931o0948L29204j3157j0828l0984R6942j52325j08061n1386L6403J10065
16997e1006M7424j30732k55884o203K3535k7272q4294K90832L4261J6595K18401
$$ plain form
17073 26395 203176 463562 551587 428532 190464 200939 420412 354942 319352 298399 -24390
17062 -24390 -106082 -11669 -89497 -234114 -145072 -116419 45702 223206 269911 162954 8489
17051 8489 -21620 12929 46506 49987 227039 464279 497795 312769 -95209 21345 205673
17040 205673 231056 161230 23553 -59591 87183 -15701 70125 160127 52675 -34642 21207
17029 21207 -6402 27956 79644 -166488 -284225 -364751 -302098 -152998 -31770 89622 -72171
17018 -72171 -223072 -43049 73063 -51891 -197062 -414594 -624776 -398825 -36800 -195931
17008 -195931 -256879 72325 59168 48340 17356 114298 -38027 -146088 -197474 -161071 -51006
16997 -51006 -3582 -134314 -390198 -396401 -372866 -400138 -484432 -193600 -159339 -142744 75657
16986G5657K2519K22990l8372l95203q1678r2637K979J83196L43000L1735k33826
16975D0360r0503M8441N441J03178K0934j1766l490K2031J07951n1579j63570
16964B7428k2563k60384L5200K40554K0003k47575k1565J60157P0158l92425j46515
16953e37527L86721L32161q9356l164M3755j04804O8831j492O5671K2417k01434
16942a8221m636J2349p3391j657j43295o0702K45286j85195n7109J26207j6664
16931a77028O3439Q2361n1214l8149n0238l7209M1570M5274k77462p7709M7353
16920d29012q4081Q7171K95383M2508j55793j29900J37084R5697J18204P3137
16910E0398J42049R7798k62006k3146m94Q4204J32743j70097j17119J35735m1236
$$ plain form
16986 75657 98176 321166 282794 -112409 -194087 -286724 -283745 -100549 242451 274186 40360
16975 40360 -50143 -1702 3739 106917 127851 116085 112595 134626 242577 190998 27428
16964 27428 4865 -255519 -220319 20235 40238 -207337 -228902 -68745 1413 -391012 -537527
16953 -537527 -150806 181355 91999 88835 132590 27786 96617 95125 160796 183213 -18221
16942 -18221 -22857 -10508 -83899 -85556 -228851 -289553 -44267 -229462 -286571 -160364 -177028
16931 -177028 -113589 -31228 -82442 -120591 -170829 -208038 -166468 -121194 -398656 -476365 -429012
16920 -429012 -513093 -425922 -130539 -88031 -243824 -373724 -236640 -140943 -22739 50398
16910 50398 192447 290245 28239 5093 4599 88803 221546 51449 -65670 70065 28829
16899B8829j13445K74503J74277J05349K45038j27855l52515j41542J9949j80428
16889f7840O8917K62430P7344j99438j50992r988n4837j94087J642K1591K08249
16878c7009L2354j89386j04425K86610L36663j70933j22808J64529O6155r2505
16868A69245j73054l9879J4000J06702n5706j85226j64298k1501J30103P6107
16858a43507l0650k93100L5725J72203R1688O2756N2495q5507l189K51547k2526
16847H7935O6206j0948j02784m2656q4163j28811j45796j07256J61163K51873
16837e5237K74376L9689K1769j60031j87389N5089j8753p4976n4354K25660K6538
16826I2381j52269j64833Q2922M4310R7730L9702l21743Q9582K61783K27475p5316
$$ plain form
16899 28829 -84616 189887 364164 469513 714551 586696 234181 92639 112588 -67840
16889 -67840 1077 263507 340851 141413 -9579 -19567 -74404 -268491 -266849 -245258 -37009
16878 -37009 -4655 -194041 -298466 -11856 324807 153874 31066 195595 261750 169245
16868 169245 -3809 -43688 -29688 77014 21308 -163918 -328216 -349717 -219614 -143507
16858 -143507 -174157 -467257 -431532 -259329 -167641 -104885 -52390 -137897 -141086 110461 87935
16847 87935 154141 143193 40409 -2247 -86410 -215221 -361017 -468273 -307110 -55237
16837 -55237 219139 258828 280597 120566 -66823 -11734 -30487 -105463 -159817 65843 92381
16826 92381 -59888 -224721 -141799 -97489 241 39943 -281800 -192218 69565 297040 221724
16815B21724k06026j45148r8135J02194K21848j2872j72714m5136j85026k49109
16805e68400o7278O3206J43516J41834Q0736k9928J57552K35447L7526l65606
16795a71395J3471J13189O178M19j77683L9282r9269j12993r925J61265J61988
16784g5473j19214K38754Q1619k19280j58797r8643K00498J61529J1701j28608
16774a05914r203j0910O1253l5073m4093J77059J12977o4215Q3419o9445j40098
16763d4243j83721o7190K6045M8982Q0972k44538m4712J62770J39389m4986j4254
16752a85486L49333j26981j90644p5097N3480j04879j66255K04077K2822O3266
16742a56364J63582R1616j83381J6928L7346n3870J26250J85730K88383j94981
$$ plain form
16815 221724 15698 -129450 -227585 -125391 96457 83585 -89129 -134265 -319291 -568400
16805 -568400 -635678 -572472 -428956 -287122 -206386 -236314 -78762 156685 194211 -171395
16795 -171395 -157924 -44735 -38557 -38138 -215821 -176539 -275808 -388801 -398726 -237461 -75473
16784 -75473 -194687 44067 125686 -93594 -252391 -351034 -150536 10993 22694 -105914
16774 -105914 -115117 -126027 -64774 -99847 -143940 33119 146096 81881 165300 95855 -44243
16763 -44243 -227964 -295154 -269109 -220127 -139155 -383693 -428405 -265635 -126246 -171232 -185486
16752 -185486 163847 36866 -153778 -228875 -175395 -280274 -446529 -242452 -219630 -156364
16742 -156364 7218 98834 -84547 -67619 -30273 -84143 42107 227837 516220 321239
16732C21239j72018J27707L5160n137R0499P7520j06309j19401o1247j27407p5145
16721a4539K11204R4268j03071j13014J31087k1408k44086K15661L77697j23494
16711D10305l29533l53431o7455Q3904O5849Q6809K92273J4497j61115j48195
16701a06092j19018K3102k0057r1800N7298K2038j82250M9075j6609j37052q413
16690e29778R6644J24022m9289l7493O1520N6745J31953K02281O4592o4627l70834
16679c14264k46591K77977J71764L0463j55838q7046J6263J47733Q1154j7966
16669i6351j3345J68290O3358k42668K5205J04589J04706n7769l5951j62800p1393
16658b14129J44065J14211J16940j03666j9065Q277o0920k80086P2896J46892
$$ plain form
16732 321239 149221 276928 312088 306951 397450 474970 368661 249260 188013 60606 -14539
16721 -14539 196665 290933 187862 74848 205935 184527 -59559 156102 533799 410305
16711 410305 80772 -272659 -340114 -256210 -190361 -103552 188721 203218 42103 -106092
16701 -106092 -225110 -202008 -222065 -313865 -256567 -234529 -416779 -367704 -384313 -521365 -529778
16690 -529778 -433134 -309112 -358401 -395894 -334374 -277629 -145676 56605 121197 56570 -314264
16679 -314264 -560855 -282878 -111114 -80651 -236489 -323535 -307272 -159539 -78385 -96351
16669 -96351 -109696 58594 121952 -120716 -95511 9078 113784 56015 20064 -142736 -214129
16658 -214129 -70064 44147 161087 57421 38356 46633 -14287 -294373 -221477 -74585
16648g4585J94310l8539k9390O9940R1114j85232o9800M010J23327r8682j30883
16637a44410p7829p7185R5847K84757n9162j11891p4235M3486k91650Q6252R1987
16626b34033L5154K20767O1913J30968k05666j04819j20209r1483R5332n0198
16616b62274j15966P7904L6182j8155j36746l12770j51439L04879P5914j20820
16606f23291j461P3737J1989K06051J34L1455j21217J08319j17483Q1475J00336
16595b49956Q6866J22911K3328m1097J44149J47192M8303J36007M9011k84484
16585A82230j98727O4059K4707j95774k31954L5797K4512N774j14295j0428R8736
16574c15363j24007M50455N8866k73262k4577J70712k09923J55955J97790j82177
$$ plain form
16648 -74585 119725 81186 51796 121736 212850 27618 -42182 -38172 85155 -13527 -144410
16637 -144410 -222239 -299424 -203577 81180 22018 -89873 -164108 -120622 -412272 -326020 -234033
16626 -234033 -198879 21888 83801 214769 9103 -95716 -215925 -307408 -212076 -262274
16616 -262274 -378240 -300336 -264154 -282309 -419055 -731825 -883264 -578385 -502471 -623291
16606 -623291 -624752 -551015 -539026 -332975 -332841 -301386 -422603 -314284 -431767 -350292 -249956
16595 -249956 -163090 -40179 -16851 -57948 86201 233393 281696 417703 466714 182230
16585 182230 -16497 47562 72269 -123505 -355459 -319662 -295150 -289376 -403671 -414099 -315363
16574 -315363 -439370 11085 69951 -203311 -227888 -57176 -267099 -111144 86646 -95531
16564i5531K581J41310J56241N9004j10828j03816M8385j00829k19938L5262K69411
16553H1252j5504j79516j80258l1880L23181J41506k2587q9654k08493Q2918l1467
16542a30502L5274n5438O657K655J17548J34964j0162O1955K79294j10369P4762
16531D06638j63869l46038j47334K37824J86677o3500k19234O403n0509k22634
16521c75576N1582J21463M912j2238o7358j2343J55868K29663J63497P0818k30341
16510I9947r8427R695O9381p5692k01557L548J30573m8746Q4626J93067m5704
16499A20711n23344l36663L42584J5607J65155J44240o4039j23889n5441K11156
16489a03923n0733q5324j2831j27380M3177R8987J42569J59056J46667k24272
$$ plain form
16564 -95531 -92950 48360 204601 263605 152777 48961 97346 -3483 -223421 -188159 81252
16553 81252 65748 -113768 -294026 -325906 -2725 138781 116194 26540 -181953 -99035 -130502
16542 -130502 -95228 -150666 -144009 -141354 -23806 111158 100996 162951 442245 331876 406638
16531 406638 242769 -103269 -250603 -12779 173898 110398 -108836 -102433 -152942 -375576
16521 -375576 -323994 -202531 -197619 -209857 -277215 -289558 -133690 95973 259470 330288 99947
16510 99947 1520 11215 80596 4904 -196653 -193105 -62532 -111278 -26652 166415 120711
16499 120711 -402633 -739296 -396712 -381105 -215950 -71710 -135749 -259638 -315079 -103923
16489 -103923 -154656 -239980 -252811 -380191 -337014 -238027 -95458 63598 210265 -14007
16479a4007k20451R1580k01789J3506J45065L54302k2960n2282k8120O0723p2872
16468E2695j9727j30802m7132M9046K6179n7054N9142P354Q6061o5704j22254
16457a62196j6203J31241p6898M694L56061n062J7874j07033j23649o6993P3905
16446B5741P0086n4502p0631j55336m3008o749N8807K31890l6018k13813p3991
16435b67524K09428l6838m4087r758j91001K3669O4030J12085p5133P3094N8198
16424h3837J08581j53373l1540J44034O8523j35981j47392k01137P3670J05203
16414b53249k2093K38948K0607q1858o0064R8576j54303j06134j07862L4103k3827
16403d17156P7064j5638k2096K25349L61275R5111j94908k824R4330L05500j44596
$$ plain form
16479 -14007 -234458 -142878 -344667 -331161 -186096 168206 145246 92964 64844 125567 52695
16468 52695 32968 -97834 -144966 -95920 -69741 -126795 -67653 -60299 25762 -39942 -162196
16457 -162196 -178399 -47158 -124056 -119362 236699 231637 249511 142478 18829 -48164 25741
16446 25741 95827 41325 -29306 -184642 -227650 -234399 -175592 56298 20280 -193533 -267524
16435 -267524 -58096 -94934 -139021 -148779 -339780 -316111 -252081 -139996 -215129 -142035 -83837
16424 -83837 24744 -128629 -160169 -16135 52388 -83593 -230985 -432122 -358452 -253249
16414 -253249 -275342 -36394 -15787 -97645 -157709 -59133 -213436 -319570 -427432 -393329 -417156
16403 -417156 -340092 -355730 -377826 -152477 208798 303909 109001 106177 200507 506007 361411
16392C61411j43553j8213k676j37873n3240M6885o7932p5344j77991L4766K0636
16381b13124R0624k4148K15478J54723J52222r355l03673k74476Q2895R5320K56767
16370B23253j08877l26803j47013k67494j54357P7029P5209j82514j26827K49566
16360f88828L26077K77261j01071j38799J67373K28724N0423j79434j41890K60081
16350E9917q5908J58039o0752k31444K9304K8937j32184J04770N6319R1411k59478
16339b41069j77287Q2516K0265M8753j42401Q6427J78277J22753J80921j11669
16329D7486J38212K54420n4649j40543l17328J8707K35841k63601j37396J01712
16319a17139J97358J22632j208j71478M2537J0579j11873J23200J76528m9060
$$ plain form
16392 361411 217858 199645 196969 59096 5856 52741 -15191 -90535 -268526 -233760 -213124
16381 -213124 -122500 -146648 68830 223553 375775 366420 62747 -211729 -128834 -33514 223253
16370 223253 114376 -212427 -359440 -626934 -781291 -704262 -629053 -811567 -938394 -688828
16360 -688828 -362751 -85490 -186561 -325360 -157987 70737 121160 -58274 -200164 59917
16350 59917 -25991 132048 71296 -160148 -130844 -101907 -234091 -129321 -73002 18409 -241069
16339 -241069 -418356 -335840 -315575 -266822 -409223 -322796 -144519 -21766 159155 47486
16329 47486 185698 440118 385469 244926 -72402 -53695 182146 -81455 -218851 -117139
16319 -117139 80219 202851 201643 30165 72702 83281 -28592 94608 271136 222076
16309B22076j23571k89364k75459K33724J93168J29632j1861k9320m6217J33968
16299A36776p1742J15418J07073j87910k21763N1027j73050L6931m1929j1021
16289b60190J18361J0821O5756L9613J56050J12350L659j04859o3710j8142n64537
16278e04828j4030J29184Q6137j11646L7758j41037n500L34682J6602k04475k17973
16267e95126j47337m567N6117j01911O6087L18938J22017J03267J73137p910J13290
16256I6002q3208O7985n9744k36455j46689K25539J38112J95260k35785q4972
16246a23955K56666J83815o6660r5029n5193k27578o0571L37198J23578q1612
16236A90659J2778J19677J12991k79272l48267j73501J89612J36365k27804j38496
$$ plain form
16309 222076 98505 -190859 -466318 -232594 -39426 90206 78345 49025 2808 136776
16299 136776 65034 180452 287525 99615 -122148 -71121 -244171 -207240 -249169 -260190
16289 -260190 -141829 -131008 -65252 -25639 130411 242761 246420 141561 77851 59709 -504828
16278 -504828 -518858 -389674 -303537 -415183 -377425 -518462 -523962 -189280 -172678 -377153 -595126
16267 -595126 -742463 -747030 -690913 -792824 -726737 -407799 -285782 -182515 -9378 -17288 96002
16256 96002 12794 80779 21035 -215420 -362109 -136570 1542 196802 -38983 -123955
16246 -123955 132711 316526 249866 154837 99644 -127934 -188505 148693 272271 190659
16236 190659 203437 323114 436105 156833 -191434 -364935 -175323 -38958 -266762 -405258
16226d05258Q5012r7806p1015j26987K77317K59552l1702J55808q9883l9129o5403
16215a49494J08762K01386m2387Q2394l15071k72392j15869j75406J80166L7401
16205d60510j10419J16171O1762r3216O1732J55218Q963K99084J42820k22728
16195d1123l75143J2340K03990J27959j459o6183Q3729o7913l32066J0908L07743
16184a37218J48786k653J29408M7227l10514P5605L311j01600Q2489K62441J83155
16173C80437K4818j21359k32236k01569J75698J80662M8741l31177k48542l5432
16163c59959o1437j08453O0605J83467l1513m8414m0099J10340M1073R0048K12559
16152D8217N8196l1602m086K9004l4226j2451L1633o3463K1145J12995l2010j00966
$$ plain form
16226 -405258 -320246 -418052 -489067 -616054 -338737 -79185 -110887 44921 -44962 -84091 -149494
16215 -149494 -40732 160654 118267 200661 -114410 -386802 -502671 -678077 -497911 -460510
16205 -460510 -570929 -454758 -392996 -486212 -424480 -269262 -260299 38785 181605 -41123
16195 -41123 -416266 -403926 -199936 -71977 -73436 -139619 -55890 -123803 -455869 -444961 -137218
16184 -137218 11568 8915 138323 185550 -124964 -49359 -46048 -147648 -65159 197282 380437
16173 380437 405255 283896 51660 -149909 25789 206451 255192 -75985 -324527 -359959
16163 -359959 -421396 -529849 -469244 -285777 -317290 -365704 -405803 -295463 -254390 -164342 48217
16152 48217 106413 74811 70725 99729 65503 53052 84685 21222 42367 155362 123352 22386
16140B2386k9658j6369Q853K49654j6020M9880J17084q3187l37175j18883L9494
16129a13941J40469K40568K92905j65980k44535j72416R3509L5789r1418j05156
16119i0206j50120j18229r0027K39796N4057l2059N1613J3811j04852n098q0376
16108c11690J93201M4919r2550K8272J12684J20263o6745j15777j6539j35212
16098b39174J09772j86732O2765n109J11684J83453M7024J9311k20790j38637
16088b56433j26625j0093J58798J29387K26483J23748j59452p8178o9697l4005
16078i6067K3491k1890J46372P4538k01423j21693M0625j07964J32352m3715J73705
16067a669J61849j01686j85448k18074j10383R9215J12173R0705K929P7885K7517
$$ plain form
16140 22386 -7272 -23641 -14788 234866 218846 268726 385810 302623 -34552 -153435 -113941
16129 -113941 26528 267096 560001 394021 149486 -22930 70579 106368 14950 -90206
16119 -90206 -240326 -358555 -448582 -208786 -154729 -186788 -135175 -121364 -226216 -231314 -311690
16108 -311690 -118489 -73570 -166120 -137848 -25164 95099 28354 -87423 -103962 -239174
16098 -239174 -129402 -316134 -253369 -258478 -146794 36659 83683 102994 -117796 -256433
16088 -256433 -383058 -393151 -234353 -104966 121517 245265 85813 7635 -62062 -96067
16078 -96067 -72576 -94466 51906 126444 -74979 -196672 -156047 -264011 -131659 -175374 -1669
16067 -1669 160180 58494 -126954 -345028 -455411 -356196 -244023 -153318 -150389 -72504 -44987
16056d4987J51443p8144j73027J18289K00497j46181l26806k69955K03561L75673
16046A0363J97280K8937m4147l11369k45611J02668J87115L5574m4578P9702r0492
16035i4558K00771J78517j48815j69494j32579k8619n8733K16049M9270J7715
16025B9524j42894L88826J48679k30456K1933P7683k20084k14243m2904J12930
16015g1006L3407K46736L896o5105j66344l26518M2064J70474j73100l937K14677
16004i4756Q6107Q1939L09382j93053l11163p4850K47636j9408j40276Q539j7032
15993a16935P3261J69368j89079P5558J55589J7259j17456k69623q4104J40627
15983a45535K68686Q4349l7909J99118k70577j97901K3732n1949K1140k22157
$$ plain form
16056 -44987 106456 28312 -144715 -26426 174071 27890 -298916 -568871 -365310 10363
16046 10363 207643 236580 192433 -118936 -364547 -261879 -74764 -39190 -83768 -4066 -94558
16035 -94558 106213 284730 135915 -33579 -166158 -194777 -253510 -37461 11809 29524
16025 29524 -113370 275456 424135 193679 215612 293295 73211 -141032 -183936 -71006
16015 -71006 -37599 209137 213033 147928 -18416 -344934 -302870 -132396 -305496 -309433 -94756
16004 -94756 -8649 73290 382672 189619 -121544 -196394 51242 31834 -108442 -99903 -116935
15993 -116935 -43674 125694 -63385 12173 167762 185021 67565 -202058 -286162 -145535
15983 -145535 123151 207500 169591 368709 98132 -99769 -76037 -127986 -106846 -329003
15973c29003K97098K63513j82590p1779J2688m3862j45287l3565R2190K63219
15963A22622M289m6295J10093q9095j43110J3785J96286m649j90203j17859J76981
15952C2845P7410L7692m5902j0726L8183n7681k78841q6054q0062k2317K30094
15941a65359J47414J38022J88416P6139j11470j64406k85550J55951J0449K45987
15931B35593J44171l4253k44239j91340r3764P3266R4665o6662L6794M8781R4418
15920I7430m5787k46857R4995K4414J82231J03950j62479O0059R1721M0122q2839
15909A56960r5650K5297q312m7709J9388j13510q9587r3292k5257J48344Q9199
15898c4129J49316R2077p500o4043R9021J0420O1301j57423o521k1284q3794p5579
$$ plain form
15973 -329003 -31905 231608 49018 -22761 -10073 -53935 -199222 -232787 -140597 122622
15963 122622 126911 80616 190709 101614 -41496 -27711 168575 163926 -26277 -144136 32845
15952 32845 110255 147947 102045 91319 129502 71821 -207020 -293074 -373136 -395453 -165359
15941 -165359 -17945 120077 308493 384632 273162 108756 -176794 -20843 -10394 235593
15931 235593 379764 345511 101272 -90068 -183832 -110566 -15901 -82563 -45769 3012 97430
15920 97430 51643 -195214 -100219 -75805 106426 210376 47897 107956 199677 239799 156960
15909 156960 61310 86607 78295 30586 49974 -63536 -153123 -246415 -271672 -123328 -34129
15898 -34129 115187 207264 199764 135721 234742 245162 306463 149040 142519 121235 37441 -38138
15886c8138p6902j80317k3276J58668J07331K25465J92764R5520l26198j67212
15876c2295m1281j01379J31579l9088J00908M2751j37363J53414J19716j68336
15866B8626k36569K3435J09239q7296n6919l9634J45908Q6543j35762o0605J36928
15855h6106j37084J1645K8348J33038J69821J60395j63160j20109J25680N201
15845A27669m4019j52460k24968j41963K9863J28408N8130K62176n4881L7908
15835B5863O9961m4142M0007j92941m7625n0800K4707Q497N0398p7345j01155
15824b94575M9232J81677K31611J33090j8741m0402k3831N9858j87859q018m2569
15813C9473J42160k15597J24546J32438l21537j92979o8894K45903K68297P0953
$$ plain form
15886 -38138 -115040 -295357 -318633 -159965 -52634 172831 365595 461115 134917 -32295
15876 -32295 -73576 -174955 -43376 -82464 18444 61195 -76168 77246 196962 28626
15866 28626 -207943 -184508 -75269 -162565 -219484 -259118 -113210 -26667 -162429 -223034 -86106
15855 -86106 -223190 -211545 -183197 -50159 119662 280057 116897 -3212 122468 127669
15845 127669 83650 -68810 -293778 -435741 -405878 -277470 -219340 42836 -12045 25863
15835 25863 95824 51682 91689 -101252 -148877 -199677 -174970 -166473 -116075 -193420 -294575
15824 -294575 -245343 -63666 167945 301035 282294 241892 218061 277919 90060 82042 39473
15813 39473 181633 -33964 90582 223020 -98517 -291496 -360390 -114487 153810 224763
15803B24763n2173j12900j08277p7469K51748K24826L0674l7805j23193k01400
15793A8794k07115j28576K44236n2510j90905n8240J51909K2088j2380q872J53338
15782f8233J8639p5169k66623L3163K68265J31690o5759j31562j82163m25989
15772g63741M242J54031J65622J7665J32922K22613L04893l4568N953j31909o7793
15761I930q0824P317P313m4972p9283q5210r8454K27257j09822j01261J68589
15750a79420q52l5728J512p994K6163j06874j6562J12434P0303Q5485j99380j35219
15738c86132r2488J35251P6245K40429N6742K7309K04657l7579j38176j31388
15728d5130r3164J87888J75817P9406k58526J3935r4253k02853n003R2594k05591
$$ plain form
15803 224763 172590 59690 -48587 -126056 125692 350518 381192 343387 220194 18794
15793 18794 -188321 -316897 -72661 -125171 -316076 -374316 -222407 -200319 -212699 -221571 -68233
15782 -68233 -49594 -124763 -391386 -358223 -89958 41732 -24027 -155589 -337752 -763741
15772 -763741 -759499 -605468 -439846 -422181 -289259 -66646 238247 203679 209632 77723 9930
15761 9930 -70894 -63577 -56264 -101236 -180519 -265729 -364183 -136926 -246748 -348009 -179420
15750 -179420 -180272 -216000 -214488 -222482 -196319 -303193 -319755 -207321 -137018 -51533 -250913 -386132
15738 -386132 -478620 -343369 -267124 -26695 30047 57356 262013 224434 86258 -45130
15728 -45130 -138294 49594 225411 304817 46291 60226 -34027 -236880 -241883 -149289 -354880
15717c54880P1204K12527N6305k17430o2997L93764k2996o5689J10588P0551M2106
15706B33053P8893j43884n5498p330M6158K52353L5655j65907j03439m1183k86105
15695a57234o1216K16851n7169k92484j52126J16322J71332j11035j29066J58486
15685b97339L45810j53633J27092j21644j21629J4132p7835O9793K88573J64407
15675B37727J17858l2740k02741j94762p5665L8509J62515N870K16854L93746
15665F67171n559L3388l9941k96675r6411M9683j77097j49942n1224O1643J9835
15654A4871j03473J34313K4207N8767Q1934m0467n9540j20867l8472o4050p674
15643a20451M6775J12093k20067j2958L7111J03288K75027N688K4888L4306M5830
$$ plain form
15717 -354880 -283676 -71149 -14844 -232274 -295271 98493 75497 9808 120396 190947 233053
15706 233053 311946 168062 112564 105234 151392 403745 439400 273493 170054 128871 -157234
15695 -157234 -218450 -1599 -58768 -351252 -503378 -387056 -215724 -326759 -455825 -297339
15685 -297339 48471 -105162 21930 -99714 -221343 -207211 -285046 -215253 73320 237727
15675 237727 355585 322845 120104 -74658 -150323 -111814 50701 56571 273425 667171
15665 667171 661612 695000 655059 358384 261973 311656 134559 -15383 -66607 -4964 14871
15654 14871 -88602 45711 69918 128685 210619 170152 110612 -10255 -48727 -112777 -120451
15643 -120451 -73676 38417 -181650 -194608 -157497 -54209 220818 226506 251394 285700 331530
15632C31530L7489o2530j44739L4596q3739q4980r8502k21280j28864J64344J73578
15621h3097J52545j10793j21689p4843J05410Q2955J93311K9752k85432O5722
15611d6159Q4869j51581j10554Q6587P6702k5315M1997o3187M0839K17640J24345
15600B76183J8679o9332j36904M8950P8044j88159n4852j46970j6123J7542j19743
15589b92685O0779r4006K43238K44780q4293M1938O2508j97373K1175n6782p5170
15578a25891o0500J6908o3432r0837J13266J34972O7481k517L4806J3218N9522
15567I6996J0813O5022l6363j15535L5079j49498k6461P1866J49044k81271J321
15556a78987R4908m9430J12431j13745R8408j62844k13083K87974N8782p232l62546
$$ plain form
15632 331530 369019 306489 161750 196346 112607 27627 -70875 -292155 -421019 -256675 -83097
15621 -83097 69448 -41345 -163034 -237877 -132467 -49512 143799 173551 -111881 -46159
15611 -46159 38710 -112871 -223425 -136838 -60136 -85451 -43454 -106641 -65802 151838 276183
15600 276183 294862 225530 88626 137576 215620 27461 -27391 -174361 -190484 -172942 -292685
15589 -292685 -231906 -325912 -82674 162106 77813 119751 182259 -15114 6061 -50721 -125891
15578 -125891 -186391 -169483 -232915 -323752 -210486 -75514 -8033 -10550 24256 37474 96996
15567 96996 107809 172831 136468 20933 56012 -93486 -119947 -48081 100963 -180308 -178987
15556 -178987 -84079 -133509 -21078 -134823 -36415 -199259 -412342 -124368 -65586 -72818 -435364
15545d35364J12036L59257l1688j52830L7164J1655Q4757l3013J65949j39690
15535b1767j85249k9356R4561l3589j85695Q5o030J25572k17785K0077N2631J00508
15523b86037m033J17623j7633K3730o2145N2329L1959r1659J08716J14819J14817
15512A02486J14639j51055k46742q7045L13364K9854j3342J76271R1734J76058
15502E06222J19600k31739j03567j38142k8746r416o0564k68813n6365K17580
15492e3950J2480j88966k8094N6548K2546k02519J15796J02319J99111N6516P5546
15481A67333p7974j28376m2172J76701N0916K3614L02660K9143k81958J8384o1581
15470A76690k46773n876j1484n1096L1558J44652J1804M8987o1330M8852n9066
$$ plain form
15545 -435364 -323328 35929 4241 -148589 -111425 -99770 -15013 -48026 117923 -21767
15535 -21767 -207016 -236372 -141811 -175400 -361095 -361010 -367040 -241468 -459253 -439176 -386545 -286037
15523 -286037 -290070 -172447 -190080 -166350 -228495 -176166 -144207 -235866 -127150 -12331 102486
15512 102486 217125 66070 -180672 -267717 45647 75501 62159 238430 330164 506222
15502 506222 625822 394083 290516 152374 123628 114212 53648 -215165 -271530 -53950
15492 -53950 -41470 -230436 -258530 -201982 -179436 -381955 -266159 -163840 35271 91787 167333
15481 167333 89359 -39017 -81189 95512 146428 170042 472702 501845 219887 238271 176690
15470 176690 -70083 -75959 -87443 -138539 -106981 37671 49475 98462 37132 85984 26918
15459B6918J17285j55251j59836m6312k57093J02633N9110J1811K55118J74376
15449A28759m8752k16883m8855K03171n8042j91362M228J01563l00921J53257
15439b73837M36364j37968p3362j5422K08703j0446m072l0484k77560J09548K07767
15428A39231m2371j42684n4714q181k4661J34180j57637q9974j31425j35J20368
15417b58003Q4726O5123K24391M7798O6697Q5574q5289j95021j76757R730R2904
15406c8127n6023j0283J46973j2839j0659J66919J2147l2807j5613j79817k52128
15395b82257j80756J04997K60105j39654n3000L31011L60661J05747j63210r8905
15385B44739J59371j08573m8705J92221k0673k66433j22166j49007n2830K1442
$$ plain form
15459 26918 144203 -11048 -170884 -217196 -474289 -371656 -312546 -300735 -45617 128759
15449 128759 80007 -136876 -185731 17440 -40602 -231964 -227736 -126173 -427094 -273837
15439 -273837 162527 24559 -48803 -64225 144478 134032 129960 99476 -178084 -68536 139231
15428 139231 96860 -45824 -100538 -108719 -133380 800 -156837 -246811 -378236 -378371 -258003
15417 -258003 -173277 -108154 116237 164035 230732 316306 231017 35996 -140761 -131031 -38127
15406 -38127 -94150 -104433 42540 29701 19042 185961 198108 165301 149688 -30129 -282257
15395 -282257 -463013 -358016 -97911 -237565 -290565 40446 401107 506854 343644 244739
15385 244739 404110 295537 246832 439053 418380 151947 29781 -119226 -172056 -150614
15375a50614P0668K42334P8578j4500k90791m3954j9077r6089l2750N4404L3621
15364a68170j7001k195J27141O3886r904j22842l9422n7198j14199J01291L2556
15353b06057q7076j33881j04303M944M9337J60874R8362r9811k5992J19496K20904
15342c203R3956O2873Q7796o5275j37302p3934p942O7718L4856l00748Q0254J63123
15330B172L3696Q1457j47414j96946L2981K67729N899j77065N1425K7890l3787
15319e1963K41681J95139j11984l75986l96845J0120J03776l177P9811l9232l6857
15308c85517J9080p1178J11236J91563l2131L7875J3004k28628K9414L08714k9021
15297c5589k28584L2985J16071j35988n8852J57331N3397P1492L1870o0578j61912
$$ plain form
15375 -150614 -79946 162388 240966 226466 -64325 -108279 -127356 -223445 -256195 -201791 -168170
15364 -168170 -185171 -187366 -60225 3661 -6243 -129085 -168507 -225705 -339904 -238613 -206057
15353 -206057 -293133 -427014 -531317 -526373 -477036 -316162 -217800 -317611 -343603 -224107 -3203
15342 -3203 90753 153626 241422 176147 38845 -35089 -43031 24687 59543 -241205 -160951 2172
15330 2172 35868 117325 -30089 -227035 -194054 73675 79574 -97491 -46066 -18176 -51963
15319 -51963 189718 384857 272873 -103113 -499958 -489838 -386062 -389239 -309428 -348660 -385517
15308 -385517 -366437 -437615 -326379 -134816 -166947 -129072 -116068 -344696 -315282 -6568 -35589
15297 -35589 -264173 -231188 -115117 -251105 -309957 -152626 -99229 -27737 4133 -56445 -218357
15286b18357q2304O4587J0525j64552J32052j6564r1449J19857j38489J25984
15276b58710Q8001J21107R4948N3847j51179j32246j93302J63800K47977K29815
15266B64058J75933m8947j04919P3427j26557K00728j21015n7966L9914q1566
15256B13090k21337j27006O7623r941k53698o2522K48525L55504q4288p8211j64229
15245a16490R612J4037l5147m6938j92097l98694J01509J92884O1538O4017K80719
15234f5050N4081R6677k19978p0099K62253j8295k03646P6546L86789k21327k85118
15223b07167K84827L2693l048N8042k3130j00010k34309q0167R9177J18288j35023
15212a89827K1084j02011q6277P6806q5783J63742L52882j26097M6079l0578N2329
$$ plain form
15286 -218357 -300661 -236074 -225549 -390101 -258049 -274613 -366062 -246205 -384694 -258710
15276 -258710 -170709 -49602 45346 99193 -51986 -184232 -377534 -213734 34243 264058
15266 264058 439991 391044 286125 359552 232995 433723 312708 254742 294656 213090
15256 213090 -8247 -135253 -67630 -77571 -331269 -393791 -145266 210238 125950 47739 -116490
15245 -116490 -106878 -92841 -127988 -174926 -367023 -765717 -664208 -471324 -409786 -345769 -65050
15234 -65050 -10969 85708 -134270 -204369 57884 39589 -164057 -87511 299278 77951 -207167
15223 -207167 77660 110353 107305 165347 142217 42207 -192102 -272269 -173092 -54804 -189827
15212 -189827 -168743 -270754 -357031 -280225 -366008 -202266 150616 24519 70598 40020 92349
15201I2349J03049n7402p6921J42548Q8244p4531j52426k36674j52285J96181
15191a27868K3081j00399K91466J12205r4133j34849M6004J59215q982J26991
15181B92731p1279J74371j22073p6937l27470K4932k4301Q1934J5367M550Q0057
15170E1882P1553J98510j40674k12223J14042m7626r4714L2737k5257k3371j34227
15159b09368j8262K2968j6376J1800J49640O4389j6273K94819J8302k21640l63182
15148b83183k974J7265R2006N1606q5419j64012r2569M10545J13605k12774k41852
15137c97756J3232O6061o9451N7415K97172R9023q2138O0389J08395k02633k09830
15126b60121O5937l884k00352r4993q0411J90771p3528R5619K64163K16697J33537
$$ plain form
15201 92349 195398 137996 61075 203623 291867 217336 64910 -171764 -324049 -127868
15191 -127868 -104787 -205186 86280 198485 104352 -30497 15507 174722 165740 292731
15181 292731 221452 395823 273750 196813 -130657 -105725 -130026 -48092 -32725 -28175 51882
15170 51882 123435 321945 181271 -30952 83090 35464 -59250 -26513 -51770 -75141 -209368
15159 -209368 -227630 -204662 -221038 -209238 -59598 4791 -11482 283337 301639 79999 -283183
15148 -283183 -286157 -268892 -176886 -125280 -210699 -374711 -467280 -56735 56870 -155904 -397756
15137 -397756 -384524 -318463 -387914 -330499 -33327 65696 -16442 43947 152342 -50291 -260121
15126 -260121 -194184 -198068 -398420 -493413 -573824 -383053 -456581 -360962 -96799 119898 253435
15115B53435J49892k45603k21227q8230k35337m6181O9200L4058J54437J51147
15105b4409n6791j80355K5636J11967r6585K00935l7090r9726K835Q3985j60543
15094b30141l4124J60652J99570p5378k4096Q7237Q7880Q3625j96391n8905j23243
15083a23314K47579K81263j25274m39805j20485P5834J38313Q3915J16373j71853
15073c7454j54990R4089q7350o8434K7882j7995K03214R1640j19198j92106p466
15062b68168K46963p8210j01020M1156K31063K6085j84982q9554n5763J42565
15052h9865K43477R0796j42471k64260k3670K7991j9742k6495J12237J54908j25032
15041f2126l08372l6186Q8825J88555J72361R5653J7709j55688J71463r2843k11262
$$ plain form
15115 253435 403327 157724 -63503 -151733 -387070 -433251 -364051 -329993 -175556 -24409
15105 -24409 -81200 -261555 -235919 -123952 -220537 -19602 -56692 -156418 -153583 -69598 -230141
15094 -230141 -264265 -103613 95957 20579 -3517 83720 171600 255225 58834 -71 -123314
15083 -123314 124265 405528 280254 -159551 -280036 -204202 -65889 18026 134399 -37454
15073 -37454 -192444 -98355 -185705 -254139 -226257 -244252 -41038 50602 -68596 -260702 -268168
15062 -268168 -21205 -99415 -200435 -159279 71784 97869 -87113 -176667 -232430 -89865
15052 -89865 153612 244408 101937 -162323 -185993 -158002 -177744 -204239 -92002 62906 -62126
15041 -62126 -370498 -406684 -317859 -129304 43057 138710 156419 731 172194 79351 -131911
15030a31911j24628Q491J15718j78201j27723M7932k49649P547L66203K2998P840
15019b35383J61379n0319L97j07803j47772J94P056j745J24769j95747J87752
15008b57222L36413M8312n0005N1263J04100k40055k8584J12280Q9665J75257
14998C41424K09614r5644k74662k21689o4146N9823j18018M2268j83672J8365
14988b86337K05129r1310J76540k38108n9032N3863p7098J41242M19046q8855
14978A55080Q8822j93574j13510q2485R3939K70218Q3951j09953j20143q4116
14968a1771l8953Q1135q249k9519j74388q8739J64667R5918P0761J02792k51383
14957h7729k36737j10761R8800Q0451j09597o5422K26769K62943Q640j29740l33367
$$ plain form
15030 -131911 -256539 -248048 -132330 -310531 -438254 -390322 -639971 -632424 -266221 -243223 -235383
15019 -235383 -74004 -124323 -123926 -231729 -379501 -379307 -372251 -373996 -249227 -444974 -257222
15008 -257222 79191 127503 77498 128761 232861 -7194 -35778 76502 166167 341424
14998 341424 551038 455394 180732 -40957 -105103 -45280 -163298 -121030 -304702 -286337
14988 -286337 -81208 -172518 4022 -234086 -293118 -239255 -316353 -175111 243935 155080
14978 155080 243902 50328 -63182 -145667 -51728 218490 302441 192488 72345 -11771
14968 -11771 -50724 30411 22162 -7357 -181745 -270484 -105817 -9899 60862 163654 -87729
14957 -87729 -324466 -435227 -336427 -255976 -365573 -430995 -204226 58717 67357 -62383 -395750
14946c95750j4126K45187O5339J4361K9143j25589k82397J27924J29765J09825
14936i6318J11085j4535j95772Q3846R9317R1223j5326l5122k12532j29173J29245
14925a84062K27877j53266j51438k6411Q1423J5387j26227o8094K98630K59748
14915A73567L1371O6577j2133j67322k20524j42204P9388m1380O6538j09529k11623
14904d87274J59790P5124J24377J44663J02710K7715m7023j51345o5275r7272
14894b13810J37217j90054j07113L37408L48507k10081j55540j79758Q5516K56579
14884A08871J56476o1703q9720j38282m9963j80398k5346K64434j00509j69506
14874b85646j3366n4527J93209J75158J33948J30744R4634m8839l474k02536L2152
$$ plain form
14946 -395750 -409876 -164689 -99350 -84989 -55846 -181435 -463832 -335908 -206143 -96318
14936 -96318 14767 232 -195540 -111694 -12377 78846 63520 28398 -184134 -313307 -184062
14925 -184062 43815 -109451 -260889 -287300 -205877 -190490 -316717 -384811 -86181 173567
14915 173567 204938 271515 259382 92060 -128464 -270668 -191280 -232660 -166122 -275651 -487274
14904 -487274 -327484 -252360 -127983 16680 119390 147105 100082 -51263 -116538 -213810
14894 -213810 -76593 -266647 -373760 -36352 312155 102074 -53466 -233224 -147708 108871
14884 108871 265347 203644 113924 -24358 -74321 -254719 -280065 -15631 -116140 -285646
14874 -285646 -299012 -353539 -160330 14828 148776 279520 374154 325315 321841 119305 151457
14863A51457K8462j83460j59046k1025J31585J79508P0986k8143k00071j22393
14853a52140J57422J16281q8476r8801L7812j56251N8502J80004l7462k95094
14843b78203o151J00146j5927l9698L5011J93877P0827p3019k49404l8043n1180
$$ plain form
14863 151457 179919 -3541 -162587 -183612 -52027 127481 198467 170324 -29747 -152140
14853 -152140 5282 121563 33087 -65714 -27902 -184153 -125651 54353 16891 -278203
14843 -278203 -284354 -184208 -200135 -239833 -204822 -10945 59882 -13137 -262541 -300584 -351764
$$ [...]
##END NTUPLES=NMR SPECTRUM
##END=
