##TITLE=Analysis number 315158
Compound Code cc 07104
Project Code adrs
Chemist Name ugmt
##JCAMPDX= 6.0         $$ Bruker NMR JCAMP-DX V2.0
##DATA TYPE= NMR SPECTRUM
##DATA CLASS= NTUPLES
##ORIGIN= Bruker BioSpin GmbH
##OWNER= NMR
$$ XWIN-NMR		Version 3.5
$$ Wed Nov  9 13:22:38 2005 GMT Standard Time (UT+0h)  MAYBRIDGE\NMR@NMR_250MHZ
##.OBSERVE FREQUENCY= 250.131544655141
##.OBSERVE NUCLEUS= ^1H
##.ACQUISITION MODE= SIMULTANEOUS (DQD)
##.ACQUISITION SCHEME= undefined
##.AVERAGES= 16
##.DIGITISER RES= 18
##SPECTROMETER/DATA SYSTEM= dpx250
##.PULSE SEQUENCE= zg30
##.SOLVENT NAME= CDCl3
##.SHIFT REFERENCE= (INTERNAL, CDCl3, 0, 16.522)
##AUDIT TRAIL= $$ (NUMBER, WHEN, WHO, WHERE, WHAT)
$$ ##TITLE= Audit trail, XWIN-NMR		Version 3.5
$$ ##JCAMPDX= 5.01
$$ ##ORIGIN= Bruker BioSpin GmbH
$$ ##OWNER= NMR
$$ C:\u/data/dgb/nmr/ADRS/12110/pdata/1/auditp.txt
$$ ##AUDIT TRAIL=  $$ (NUMBER, WHEN, WHO, WHERE, WHAT)
(   1,<2005-11-09 13:22:15.88 +000>,<MAYBRIDGE\NMR>,<NMR_250MHZ>,
      <created by zg, POWCHK disabled, PULCHK disabled
       configuration hash MD5:
       62 19 C7 07 E1 42 D1 B7 37 6C 3D D0 77 39 F9 E6
       data hash MD5: 64K
       A3 7A 15 CF D5 EF 80 0C BE 7A A0 54 FA AB 40 D4>)
(   2,<2005-11-09 13:22:28.64 +000>,<MAYBRIDGE\NMR>,<NMR_250MHZ>,
      <Start of raw data processing
       ef LB = 0.3 FT_mod = 6 PKNL = 1 SI = 32K 
       data hash MD5: 32K
       B2 BC AE D8 23 31 A8 0D 73 11 C8 88 C9 DD 63 1E>)
(   3,<2005-11-09 13:22:30.64 +000>,<MAYBRIDGE\NMR>,<NMR_250MHZ>,
      <apk 
       data hash MD5: 32K
       2C 81 B1 F9 56 11 D1 BC 0B EF 2B DD AB 2F 2A 75>)
(   4,<2005-11-09 13:22:31.58 +000>,<MAYBRIDGE\NMR>,<NMR_250MHZ>,
      <abs ABSG = 5 
       data hash MD5: 32K
       5E F9 5F C9 B5 84 1F 40 A4 DF 02 96 BC D4 EB 36>)
$$ ##END=
$$ 
$$ hash MD5
$$ FC 4F 65 87 C1 79 84 33 CE 09 FD 07 96 52 D3 68
##$RELAX= 
##$RELAX= 
##$RELAX= 
##$RELAX= 
##$RELAX= 
##$RELAX= 
##$RELAX= 
$$ Bruker specific parameters
$$ --------------------------
##$DU= <C:\u>
##$EXPNO= 12110
##$NAME= <ADRS>
##$PROCNO= 1
##$TYPE= <nmr>
##$USER= <dgb>
##$AMP= (0..31)
100 100 100 100 100 100 100 100 100 100 100 100 100 100 100 100 100 100 
100 100 100 100 100 100 100 100 100 100 100 100 100 100 
##$AQSEQ= 0
##$AQ_mod= 3
##$AUNM= <au_zg>
##$AUTOPOS= <34 >
##$BF1= 250.13
##$BF2= 250.13
##$BF3= 250.13
##$BF4= 250.13
##$BF5= 500.13
##$BF6= 500.13
##$BF7= 500.13
##$BF8= 500.13
##$BYTORDA= 1
##$CFDGTYP= 0
##$CFRGTYP= 5
##$CHEMSTR= <none>
##$CNST= (0..31)
1 1 145 1 1 1 1 1 1 1 1 1 1 1 1 1 1 1 1 1 1 1 1 1 1 1 1 1 1 1 1 1 
##$CPDPRG= <>
##$CPDPRG1= <>
##$CPDPRG2= <>
##$CPDPRG3= <>
##$CPDPRG4= <mlev>
##$CPDPRG5= <mlev>
##$CPDPRG6= <mlev>
##$CPDPRG7= <mlev>
##$CPDPRG8= <mlev>
##$CPDPRGB= <>
##$CPDPRGT= <>
##$D= (0..31)
0 1 0 0 0 0 0 0 0 0.06 0 0 0 0 0 0 0.0002 0 0 0 0 0 0 0 0 0 0 0 0 0 0 
0 
##$DATE= 1131542534
##$DBL= (0..7)
120 120 120 120 120 120 120 120 
##$DBP= (0..7)
150 150 150 150 150 150 150 150 
##$DBP07= 0
##$DBPNAM0= <>
##$DBPNAM1= <>
##$DBPNAM2= <>
$$ [...]
##$SUBNAM7= <"">
##$SUBNAM8= <"">
##$SUBNAM9= <"">
##$SW= 20.6930455092707
##$SWIBOX= (0..15)
0 0 3 0 0 0 0 0 0 0 0 0 0 0 0 0 
##$SW_h= 5175.983436853
##$TD= 65536
##$TD0= 1
##$TE= 295.16
##$TE2= 300
##$TE3= 300
##$TEG= 300
##$TL= (0..7)
0 120 120 120 120 120 120 120 
##$TP= (0..7)
150 150 150 150 150 150 150 150 
##$TP07= 0
##$TPNAME0= <>
##$TPNAME1= <>
##$TPNAME2= <>
##$TPNAME3= <>
##$TPNAME4= <>
##$TPNAME5= <>
##$TPNAME6= <>
##$TPNAME7= <>
##$TPOAL= (0..7)
0.5 0.5 0.5 0.5 0.5 0.5 0.5 0.5 
##$TPOFFS= (0..7)
0 0 0 0 0 0 0 0 
##$TUNHIN= 0
##$TUNHOUT= 0
##$TUNXOUT= 0
##$USERA1= <user>
##$USERA2= <user>
##$USERA3= <user>
##$USERA4= <user>
##$USERA5= <user>
##$V9= 5
##$VALIST= <valist>
##$VCLIST= <CCCCCCCCCCCCCCC>
##$VD= 0
##$VDLIST= <DDDDDDDDDDDDDDD>
##$VPLIST= <PPPPPPPPPPPPPPP>
##$VTLIST= <TTTTTTTTTTTTTTT>
##$WBST= 1024
##$WBSW= 4
##$XGAIN= (0..3)
0 0 0 0 
##$XL= 0
##$YL= 0
##$YMAX_a= 613862
##$YMIN_a= -603865
##$ZGOPTNS= <>
##$ZL1= 120
##$ZL2= 120
##$ZL3= 120
##$ZL4= 120
##$ABSF1= 16.522
##$ABSF2= -4.171173
##$ABSG= 5
##$ABSL= 3
##$ALPHA= 0
##$AQORDER= 0
##$ASSFAC= 0
##$ASSFACI= 0
##$ASSFACX= 0
##$ASSWID= 0
##$AUNMP= <proc_1d>
##$AZFE= 0.1
##$AZFW= 0.1
##$BCFW= 0
##$BC_mod= 0
##$BYTORDP= 0
##$COROFFS= 0
##$CY= 12.5
##$DATMOD= 1
##$DC= 0
##$DFILT= <>
##$DTYPP= 0
##$F1P= 14.0000005364418
##$F2P= -0.99999901652339
##$FCOR= 0.5
##$FTSIZE= 32768
##$FT_mod= 6
##$GAMMA= 0
##$GB= 0
##$INTBC= 1
##$INTSCL= 1
##$ISEN= 128
##$LB= 0.3
##$LEV0= 0
##$LPBIN= 0
##$MAXI= 10000
##$MC2= 0
##$MEAN= 0
##$ME_mod= 0
##$MI= 0
##$NCOEF= 0
##$NC_proc= -3
##$NLEV= 6
##$NOISF1= 0
##$NOISF2= 0
##$NSP= 0
##$NTH_PI= 0
##$NZP= 0
##$OFFSET= 16.522
##$PC= 1
##$PHC0= 78.10651
##$PHC1= 4.16288
##$PH_mod= 1
##$PKNL= yes
##$PPARMOD= 0
##$PSCAL= 4
##$PSIGN= 0
##$REVERSE= no
##$SF= 250.13
##$SI= 32768
##$SIGF1= 0
##$SIGF2= 0
##$SINO= 400
##$SIOLD= 32768
##$SREGLST= <1H.CDCl3>
##$SSB= 0
##$STSI= 32768
##$STSR= 0
##$SW_p= 5175.98343685301
##$SYMM= 0
##$S_DEV= 0
##$TDeff= 65536
##$TDoff= 0
##$TI= <Analysis number 999999
Compound Code 99
Book Reference 9
Project Code 9>
##$TILT= no
##$TM1= 0
##$TM2= 0
##$TOPLEV= 0
##$USERP1= <user>
##$USERP2= <user>
##$USERP3= <user>
##$USERP4= <user>
##$USERP5= <user>
##$WDW= 1
##$XDIM= 32768
##$YMAX_p= 357959810
##$YMIN_p= -178399
$$ End of Bruker specific parameters
$$ ---------------------------------
##NTUPLES= NMR SPECTRUM
##VAR_NAME=  FREQUENCY,     SPECTRUM/REAL,   SPECTRUM/IMAG
##SYMBOL=    X,             R,               I
##VAR_TYPE=  INDEPENDENT,   DEPENDENT,       DEPENDENT
##VAR_FORM=  AFFN,          ASDF,            ASDF
##VAR_DIM=   32768,         32768,           32768
##UNITS=     HZ,            ARBITRARY UNITS, ARBITRARY UNITS
##FACTOR=    0.157963299565203, 1,           1
##FIRST=     4132.6476996994, 0,             0
##LAST=      -1043.33573715361, 0,           0
##MIN=       -1043.33573715361, -178399,     0
##MAX=       4132.6476996994, 357959810,     0
$$ Real data points
##PAGE= N=1
##DATA TABLE= (X++(R..R)), XYDATA
32767 -6126 6019 19495 16597 3441 -6059 -2521 3866 3021 -6478 2966 6057 6998 7415 6363 766
32752 766 -3809 -4144 -6991 -1842 -5760 -2978 -3760 -5245 -548 5605 10377 7313 -1033 -4779 5733
32737 5733 17903 11996 6151 -272 858 -5004 -11267 -8784 -5209 -7984 -4911 2140 2643 1089 -3353
32722 -3353 -6878 -7481 -8538 -7673 -158 3560 4185 6939 -536 -3094 -8372 -11661 -7486 -5192 -15064
32707 -15064 -27875 -23867 -23922 -22234 -16006 -5507 -206 -4118 5364 9938 -5109 -12296 -9425 -4258
32693 -4258 -2236 -2592 -8973 -11025 -8582 -4293 -5370 2844 7239 6300 8411 6406 -3141 -1499 -2342
32678 -2342 -1038 -6885 -8681 -6156 -6742 -3154 -9164 -14383 -16950 -12086 -4361 -1113 457 4760 -481
32663 -481 -5879 -1532 1351 9655 7712 8553 2029 8973 11726 22842 27935 15743 11125 4397 9878
32648 9878 6928 5969 5987 -857 -9840 -3494 971 3288 6060 4831 8163 15101 5394 -3136 1341
32633 1341 12622 18474 17645 10414 7762 1035 -3072 -19869 -16562 -15370 -10065 -14977 -11261 -3029
32619 -3029 -11883 -13499 -14218 -12362 -14209 -13519 -13915 -17373 -15505 -13540 -12879 -11132 -9564 -8094 -8126 799
32603 799 12107 14153 21363 29785 24035 17062 12062 1188 -8914 -6790 -941 5460 2996 2041
32589 2041 2990 2597 2304 -5179 -9968 -10824 -10577 -4723 555 6265 3575 -551 -5058 615 10070 13271
32573 13271 9571 -2455 -48 -115 -4750 -3047 -4060 -5797 306 5895 2796 -930 -9489 -8649 -7617
32558 -7617 -3994 3815 11021 19150 11512 3101 -1589 -11814 -11071 2963 2554 -1836 -2248 -2449 343
32543 343 3575 5787 2257 -6047 -5022 -12909 -12937 -2137 -3518 -4409 1026 11327 10808 -3629 1474
32528 1474 -2917 -1150 -1324 740 8850 9181 9736 6633 12707 7930 2548 20207 26629 16990 24213
32513 24213 27709 31623 16192 6682 11430 16056 1546 -5838 -5548 -8065 -6050 -15922 -15552 -8429
32499 -8429 -173 6242 -10456 -13104 -14571 -14136 1214 4277 1025 2816 -8942 -5638 -13779 -20667
32485 -20667 -11546 -15445 -15792 -9962 -4437 -12127 -13916 -15203 -13569 -6126 -15998 -15572 -4592 -3746 2600
32470 2600 -2256 -3868 -4197 -14270 -20637 -23475 -21548 -10551 -6149 -5867 4118 -629 -2167 -5053 -5943
32455 -5943 108 -2063 28 6274 7087 -1630 -6456 -4637 3135 17250 13352 -2878 3157 4625
32441 4625 8114 11167 4094 -6641 9519 16783 8902 11934 3704 -10916 -7806 7554 3291 5715
32427 5715 11824 3893 -6666 -10016 -6980 1019 -6917 5410 15319 22595 17153 10440 -4266 -4254
32413 -4254 8008 5463 -1949 -3657 -8398 -6631 4241 16610 27606 18642 9647 6598 6218 8535
32399 8535 5655 3510 5657 16376 6847 -10005 -7643 4747 8956 13284 19533 10084 786 3040
32385 3040 3350 -2155 -2495 -11307 -2118 3401 3611 448 -13605 -4473 10810 719 -9253 -9348 -1844
32370 -1844 5163 5143 180 7429 15599 22830 16014 10106 -2145 -2967 -7411 -15477 -8481 311 9235
32355 9235 11753 19846 34847 41559 38847 33562 17310 16798 15530 1603 -6874 -9680 7731 5972
32341 5972 2424 -4509 -1151 -538 -8076 -22922 -28465 -33562 -25609 -18416 -26628 -22692 -12726 2932
32327 2932 2564 -3574 5395 7225 14024 11487 5165 -301 -12549 -17984 -11806 -11180 -9334 -981 -146
32312 -146 -8045 -2579 -6288 -17550 -28091 -10415 12493 22278 16848 10863 2570 15219 14640 5621
32298 5621 -3982 -1098 -19039 -24115 -29192 -28888 -32128 -31140 -21041 -12442 -22290 -18492 -1727 -4317
32284 -4317 -13486 -16724 -19682 -19446 -8371 -7663 -15663 -15254 -13623 -8464 -7635 3905 1947 17017 25712
32269 25712 24142 19276 9670 -13178 -17084 -10007 -7306 -6887 -8580 6168 19863 8286 -1979
32256 -1979 -10765 -15366 -23050 -23949 -4737 2907 -5425 -1783 -4206 -12694 -11513 -5392 -1189 -1512 -4309
32241 -4309 -3068 -8909 -1999 10802 10901 13169 5591 2807 8041 10119 7275 4174 1329 -4487 -9865
32226 -9865 -15849 -20102 -6188 -8697 403 3710 2051 -1027 11583 8841 -4021 -15698 4200
32213 4200 16778 4524 -13540 -28706 -14173 -1624 -4314 -11215 -6835 1376 -1897 -10768 -1878
32200 -1878 17350 15195 13431 10818 11068 -2129 -7169 -13032 -13992 -7930 -9914 -3745 1409 15219
32186 15219 21644 17195 7308 7593 18140 16808 6692 -2359 805 -6136 -17710 -10795 4007 8367
32172 8367 10778 12381 5258 12420 18983 14499 11433 23112 28053 16447 20589 12474 13445 15237
32158 15237 3501 4733 -2116 2616 18600 22861 13857 6157 8177 12377 10920 1597 8461 19475
32144 19475 21692 21665 5876 -3879 -8273 -6521 -5392 -2634 -7772 -5035 -10178 -9483 1056 14615
32130 14615 19809 22038 22888 17686 9130 4131 -4955 -2861 -5698 -1811 11161 5027 -6824 -7310
32116 -7310 -9861 -19523 -7256 12748 23732 26004 9538 -10417 -18865 -18429 -3161 -1249 1711
32103 1711 -2667 -13474 1470 10673 4922 66 -5782 -3183 -2071 -3701 -8427 -9212 -13240 -13017 -5303
32088 -5303 14116 9036 -2226 -12666 -16133 -14711 -3486 -4371 -9927 -11396 -14228 -11655 7495 31685
32074 31685 18954 14568 10516 8718 654 3831 -2077 -10406 -1379 6835 10978 21914 17474 11412
32060 11412 18325 11637 3103 -7198 -18901 -7862 -6312 -2890 8276 -3013 -12856 -17039 -11170
32047 -11170 -5956 -3582 -11100 -12299 -14644 -4563 -3028 3928 5396 10269 9539 4672 2397 1917 5734
32032 5734 -2997 -19090 -17646 -12479 -4049 -9977 -14976 -13453 -1420 -3162 -17050 -15212 -5695 2217
32018 2217 449 9445 9738 9059 2690 -4943 -14998 -19749 -18433 -18982 -15096 -6818 -16066 -16735 -15008
32003 -15008 -6862 -6068 -11304 -9718 773 6505 13731 14435 7402 13353 8614 16033 13770 15041 19836
31988 19836 26201 23760 21720 16431 10611 13198 3379 -9953 -14699 -816 11638 10186 12904 5658
31974 5658 -3228 1736 1119 5130 2053 14502 5605 -4680 3835 11685 -3515 1913 1032 8387
31960 8387 5573 -3647 -4516 9121 9462 3084 -2961 -5678 -1132 -22268 -41360 -35806 -8085 -1193
31946 -1193 -11867 -16384 -9636 -8004 -12848 -13870 -7195 -12662 -8876 -1268 -3171 -5850 3587 5861
31932 5861 2253 -15555 -23006 -18109 -4972 985 8436 -4505 -11143 -8863 -11389 -14217 -5773 2459
31918 2459 -13391 -20920 -6591 5791 -11103 -23100 -24306 -24119 -18674 -7561 -2904 -11611 -29167
31905 -29167 -27473 -16227 -11230 2085 7353 3081 -10746 -24150 -27528 -16068 -11157 1126 18141
31892 18141 17918 -1602 -7618 -602 1241 -48 4241 -2870 -5329 -11477 -12688 -10973 -17075 -17853 -4121
31877 -4121 3410 2252 -6703 -17637 -4918 575 -18149 -22896 -14079 -9589 -7634 -5389 2755 6439
31863 6439 -2526 -2835 -2867 -11543 -9992 5537 12103 22305 28525 21625 3877 -13724 -10617 -1814
31849 -1814 -7841 -20395 -17937 -16953 -16183 -24396 -22315 -23627 -32763 -45157 -31417 -20380 -8160 -16788
31835 -16788 -13380 -6193 -8122 -16523 -15016 -13357 -25381 -38578 -38908 -38058 -30445 -22154 -22255 -26251 -29858
31820 -29858 -23241 -15779 2961 -4262 -10676 -19943 -33031 -31469 -30773 -21834 -9904 -10126 -18499 -19756
31806 -19756 -6018 -1139 -2711 -8071 -5733 -11257 -25491 -34257 -23233 -10768 -2661 -18201 -24194
31793 -24194 -18626 -14318 -10196 1517 8396 1120 10236 4947 9581 6154 -1634 -2133 -874 3040
31779 3040 12892 9046 10412 15606 12498 -1470 -8630 2483 -3376 4863 7305 5060 12331 14234
31765 14234 8788 -7532 -9101 -8018 -12114 -14070 -7392 -3958 1332 13192 15547 -1169 -1883 -1157
31751 -1157 -9976 -10799 -15716 -21403 -16439 -9732 -4831 11745 12013 868 -1387 1898 2928 393 -10497
31736 -10497 -19865 -18657 7927 12550 6957 626 -13498 -9819 -8921 -5555 -3582 19243 5770 -4635
31722 -4635 -8679 -4617 -9969 -20586 -16809 -7598 -7192 -7770 238 10766 -5771 -13594 -27943 -31547
31708 -31547 -29941 -21201 -7262 -2463 -14972 -18002 -19295 -30830 -26936 -6511 -2753 5198 804
31695 804 -1715 -4084 2385 6950 -8721 -11764 -7640 -13371 -16658 -16580 -26911 -35174 -26774 -33182 -27113
31680 -27113 -9604 4396 5190 1608 -7711 -8382 -10401 -19622 -13259 -5655 -3926 -5811 -3629 -9662
31666 -9662 -11459 -9602 -12939 -13867 7087 27912 15407 -1347 5040 8732 -8433 -20626 -24904
31653 -24904 -411 7704 -2582 -10352 -17370 -16684 -3424 4168 7440 12580 9662 10044 1109 -2342
31639 -2342 529 -6634 5966 14635 -8741 -10243 -5016 -12113 -11437 -8036 -12218 -4293 1050 -1017
31625 -1017 8972 1507 -5294 -14396 -27479 -20892 4286 6245 -1400 2874 6034 -11333 -10970 -1886
31611 -1886 -12624 -12366 -7877 -11773 -16608 -15446 -16647 -17380 -22286 -41353 -44605 -30194 -17675 -9580
31597 -9580 -13808 -6542 -7900 -6067 1256 -2345 -15568 -20620 -15591 -3089 -2598 4265 17040 14281
31583 14281 9709 8582 3216 -8378 -8372 -15931 -21597 -24197 -18929 -18299 -23996 -14679 -6794 -2681 -5633
31568 -5633 1718 -2542 -14318 -19721 -22374 -33984 -23558 4912 14298 29019 26027 5162 -8220
31555 -8220 -26662 -20659 -12460 -13507 -3866 5778 3044 11687 11861 -5829 -11751 -1091 13229 11451
31541 11451 -3841 -9454 -9214 6953 -595 -9264 -9661 -4894 -19078 -21769 -21860 -11597 -19279 -13215
31527 -13215 -8794 -491 -7067 -17992 -18756 -13160 -3821 6558 -246 1550 9563 15126 7427 -9161
31513 -9161 1263 -906 4061 4055 -15601 -11417 -12650 -5393 -608 -3927 -5870 -4313 2652 -2582 -15626
31498 -15626 -14931 -12143 -18375 -23562 -31278 -25610 -12494 -5326 -9278 -17509 -17416 -9351 12974 18190 14841
31483 14841 9638 18458 10230 4625 3843 2914 -5066 -18442 -6653 1662 -3592 -4993 -5293 -5807 -2399
31468 -2399 29 -11230 -17339 -20271 -8412 -3864 -2912 491 -12632 -26049 -19468 -7610 -6689 -4213
31454 -4213 213 -3226 3230 17668 14398 1712 7774 -87 -497 13049 5476 -140 -9451 -4391
31440 -4391 -4035 -17872 -30803 -17253 -14898 -1470 6144 -255 2887 3666 -2784 -8483 -11633 -6460
31426 -6460 2595 -1050 -97 2143 -1422 -10133 -12071 -13794 -21983 -25974 -22468 -8870 919 5247 -10403
31411 -10403 -13528 -20848 -8773 11000 11394 20597 24465 25460 31460 37721 34841 30834 21427 4399
31397 4399 -14682 -25320 -20109 -6902 -9657 3197 5532 -15168 -8400 -3534 -19773 -12748 -18869
31384 -18869 -23113 -19255 -4383 6296 9425 1407 -4664 -2859 -5753 -1874 -387 3774 -692 -2171
31370 -2171 -5023 -8294 -13833 85 -4759 -5354 8408 16237 9288 11829 16063 9457 9618 13962 9344
31355 9344 307 344 1907 -3991 -11221 -22001 -15587 -5249 -8138 -16158 -10392 -16707 -11094 -17071 -19516
31340 -19516 -12518 -13578 -20475 -17694 -15171 -4215 -424 -6315 -9051 -15120 -7991 -8521 -8611 -13067 -27303
31325 -27303 -27431 -24625 -28593 -19066 -10805 -10552 -20602 -14880 -14255 -18933 -8162 -10026 -5110 -3985 -14493
31310 -14493 -18936 -770 14275 -2884 -15448 -16466 -17842 -15983 -15894 -20731 -21748 -5134 11696
31297 11696 8747 10310 9643 10864 8919 3862 4335 -11082 5099 12208 -885 -16291 -18380 -14599
31283 -14599 -8193 -4477 656 -2302 -15344 -2254 7509 15647 18255 23681 22576 23095 21503 599
31269 599 -1877 922 -3519 2963 4710 -4050 -13368 -17422 -26150 -16357 -10546 -13054 -4198 -9687 -19274
31254 -19274 -20569 -13709 -6891 -943 -6629 -21541 -37813 -30541 -15514 -10207 2067 -3782 2146
31241 2146 6327 -2114 -6895 -2424 1868 -506 -7290 -11471 -13232 -16793 -11439 -14737 -9945 -4263 -2070
31226 -2070 -11973 -19242 -17292 -17666 -2493 -2633 -13839 -21490 -16222 -13893 -14993 -13360 -15349 -35305
31212 -35305 -42225 -21027 -9083 -5845 -10715 -11275 -8692 -6270 -7232 -15025 -13427 -5422 8326 1548
31198 1548 -3181 -911 479 -1285 -4353 -4201 -240 6123 781 -6815 -5279 -10351 -13161 -21687 -23915
31183 -23915 -12807 5867 -3456 -6731 6154 21894 20326 1256 -16345 -22515 -27159 -28839 -21818
31170 -21818 -21611 -28645 -25032 -22269 -8529 -6727 -11064 -11652 -14736 -32545 -28638 -27624 -13401 -5472
31156 -5472 -1522 -8745 -1491 6253 220 -414 76 -4511 599 -9247 -10364 9099 16534 1459 -11148
31141 -11148 -12479 -14070 -4600 -3012 -7218 -11323 -12796 -16626 -3598 -7058 1335 9083 4134 -118
31127 -118 -4348 -1620 3076 11915 15791 13876 20364 27321 3264 -12877 -13029 -11174 -16079 -19109 -9441
31112 -9441 -6449 -1111 -15777 -24955 -21297 -15175 -14369 -5884 4341 4229 1966 -4683 -9616 -11865 -8155
31097 -8155 -13265 -12628 -18318 -12420 -9446 -20334 -23939 -17100 -19755 -26099 -20575 -12378 -13519 -3574 4158
31082 4158 -6569 -8869 -7621 2105 11823 13726 7616 8835 -1048 -6579 -13537 -27799 -28606 -12227
31068 -12227 1604 -9302 -6108 -7743 -10802 -12592 -24503 -24679 -5605 -453 -5582 13014 15051
31055 15051 13829 4847 8556 13477 6338 4994 4538 13516 13790 19806 24811 7795 5286 15779
31041 15779 5777 1365 7624 -333 1535 2474 10456 13961 14027 11011 797 -12701 761 6954
31027 6954 4885 6859 -3211 -5872 -8931 -13555 -5429 2142 -1902 8559 10084 3336 2966 -8037
31013 -8037 -17265 -16067 -9672 4428 12299 11500 7535 -3095 9062 13465 3984 -10467 -9091 -9749
30999 -9749 -7656 -4098 6859 17357 27063 23234 11982 4500 -2148 -19232 -19058 -9608 1886 -10739
30985 -10739 -13089 -9450 778 6245 5769 6378 18668 6258 6775 6393 -13581 -8014 -406 -15301
30971 -15301 -15357 -6562 6082 15715 18369 11356 16060 23644 13629 -87 -11905 -10337 -7523 -2391
30957 -2391 -5674 -3751 -2472 -3993 5474 875 -4617 -10123 1880 -3314 -6740 -5664 -16819 -21923
30943 -21923 -19809 -24828 -12495 -5104 -5827 -9719 -3860 -11466 -19569 -21087 -28101 -8755 2399 -7256
30929 -7256 -23092 -3640 6072 -189 -7040 -12310 -26191 -33734 -21661 -8240 -8522 -12749 -887
30916 -887 320 4363 -4601 -8013 -15034 -11624 -2196 -9437 -15602 -12065 -646 2857 -1137 1828 7098
30901 7098 -1513 -3972 -8903 -7915 -6294 -1879 5063 4898 -3298 -10179 -6470 -22284 -22911 -22414 -26309
30886 -26309 -29590 -12827 7433 3478 -8242 -2783 -9866 -12284 -9219 1368 4888 2058 -3135
30873 -3135 9152 7166 -1622 -15476 -5428 6606 -2817 5708 15433 6951 -5069 -7870 2491
30860 2491 12244 12153 12227 28336 30647 30604 23307 8127 -3469 -1963 9276 5915 -8544 -14530 -24164
30845 -24164 -27088 -22432 -14694 -8869 1926 959 -4722 -23247 -27021 -21788 -17726 -25189 -27996 -18486
30831 -18486 -8679 -5766 6498 19177 28525 28990 21236 8868 -293 3810 9032 8242 4804 -446
30817 -446 -9780 -8643 -805 7418 5560 -4454 -2123 -9230 -5345 -14545 -26417 -24631 -8573 2473
30803 2473 8414 7649 -5406 -9973 -3026 -4608 -8977 -13188 -7863 -7034 -5492 -5411 -10045 -19163 -15079
30788 -15079 -15941 -13916 -3024 14500 17927 16363 15259 11159 3053 -1762 -8437 -2202 -9975 -15528
30774 -15528 -13788 -14118 -11171 -13337 27 11567 17529 17875 6679 3686 10182 -991 -6884 917
30760 917 1725 -885 -3647 -4337 -1531 6506 2092 -2038 -11403 -8178 1530 7437 14966 11584 -4682
30745 -4682 -14289 -15243 -23835 -12144 2523 -524 -1332 -122 8861 13960 7110 -2694 -11061 -8670 600
30730 600 3313 -4826 -3753 -10517 -14967 -18572 -19731 -14408 -8844 -4963 -4317 -342 6880 7261 4701
30715 4701 13362 10523 3116 -6364 -1829 -6254 575 10848 16486 9669 5103 -587 5088 2500
30701 2500 -1357 8638 14497 20289 13526 10108 9607 -1557 -2066 20435 22971 17915 13979 12729 12650
30686 12650 3463 -3979 2385 14067 7652 2648 -4364 -800 -14156 -18250 -19126 -7248 -2494 -4605
30672 -4605 191 -549 -2163 -8140 1662 -10555 -10511 -7819 8399 1455 -13217 -27511 -17528 1722
30658 1722 -5592 -13325 -6352 10631 12145 21567 21537 10351 10608 7892 -4027 -18941 -22290 -10105
30644 -10105 -12634 2332 13720 16950 18096 15735 21717 7280 139 -83 7381 17775 11630 11768
30630 11768 5616 16155 14651 4829 8396 -126 -15764 -15956 -26335 -26475 -18058 -16620 -9255 -14311
30616 -14311 -20566 -13915 -14318 -20687 -23435 -8407 -2022 11324 12522 -5709 -6756 4674 7080 4024
30602 4024 13171 9005 6065 8443 9486 13584 27520 21593 12462 3023 1778 -6771 -5514 137
30588 137 -10131 -8740 6690 2158 -10291 -13736 -18218 -12962 8422 8329 10215 14234 4083 2296
30574 2296 -2347 -2945 -19078 -22437 -4883 13838 1991 -13754 -9185 -8583 2022 4994 0 -10258
30560 -10258 -11402 -12061 -9532 5223 18763 8767 1551 22897 28549 20122 6027 -1745 3717 45
30546 45 2573 3096 -7321 -10416 875 1858 34 -10948 -5156 4434 -2623 -8899 4285 7567 4083
30531 4083 2860 5616 5731 19009 37680 36467 17036 9719 2430 -7050 -5100 -6728 -11593 -14138
30517 -14138 -13786 -5814 3703 6417 -1174 7210 14527 16666 18709 16265 22482 26428 26211 32622 28194
30502 28194 30484 1960 -13303 -5336 -8478 -16341 -12539 -9512 -10168 1178 -2173 -6108 -8060 -8427
30488 -8427 -8504 -7157 2985 4452 -3752 4875 -6950 -14837 -10182 -12554 -24608 -18005 -2596 -1026
30474 -1026 7296 21251 15729 8054 11568 18181 7102 -2350 11153 6986 2874 6167 10027 20647
30460 20647 22604 32187 29898 23187 17567 16282 22909 15874 10999 1925 -4974 -971 7091 9812
30446 9812 16593 12030 7886 16532 11792 1879 4586 15041 17105 12080 15027 12843 11868 13920 10331
30431 10331 -2828 -5214 -13580 -18320 -17132 -1037 1006 -3767 984 6210 15224 22421 29377 18162
30417 18162 12694 4001 3791 1148 -1868 -1849 -8310 -5230 3442 2721 1708 -9491 -7749 -8028 10645
30402 10645 9135 15198 15239 6620 8934 4169 -6559 2261 -6632 -7115 -6562 -11191 -22698 -12438 -10420
30387 -10420 -9325 969 5681 1705 -1168 -7317 -6607 -17210 -7745 5847 8041 8146 8478 25059
30373 25059 29979 18943 25573 29234 25127 13247 -801 1895 16944 14247 19856 26767 24668
30360 24668 10041 6811 14923 9098 463 5326 -4005 545 3718 11264 20486 10821 3755 13921
30346 13921 15032 10820 11861 15448 13821 11440 13233 4287 -13082 -25715 -22564 -1836 5774 12277
30332 12277 16235 13437 17397 1272 -2849 -7007 7988 6098 -3137 643 -2894 -1096 7537 24081
30318 24081 11335 -4166 -2521 2365 1990 864 1321 -1342 -7260 6144 18316 28720 24127 9738
30304 9738 2568 2254 2509 -4233 1746 9968 16242 1866 -12052 -4042 13413 11867 3556 10326
30290 10326 15697 9624 5867 9080 235 4102 19819 24996 37198 20915 7535 11809 3957
30277 3957 1418 5421 18258 25647 20236 17162 6806 3797 9362 20293 20983 26397 22647 18594
30263 18594 14783 10571 18892 12413 6752 796 -6825 -3868 -1524 -5876 -11190 -9528 2759 3937
30249 3937 4097 4958 7824 5434 7402 9371 13016 8848 -5069 -13730 -3767 7444 6653 -879 -5436
30234 -5436 -6185 -963 -3243 -13957 -27311 -24498 -16075 -9855 -11669 -6503 -12262 -6175 1513 7238
30220 7238 8521 8967 2038 3690 4967 3902 13594 11102 -2617 -8788 1308 18483 14698 10116
30206 10116 -7279 -18346 -3809 -1432 -1106 7889 12955 14042 15928 27211 32235 25871 10706
30193 10706 5442 -841 6848 9908 8233 4346 5409 16337 25744 20634 22998 24007 28978 23121
30179 23121 20709 11083 8081 -6395 3625 1109 -14218 -11488 -4614 -16966 -16198 2273 17161
30166 17161 5900 -15873 -13563 -21861 -25463 -17826 -15618 -14185 -15338 -18621 -7082 -3935 -1272 -7503
30152 -7503 -4628 -6036 -5677 -7118 -16341 -10100 -3865 953 -3203 2039 10161 9905 9592 9062 1307 -14068
30136 -14068 -3760 4439 5890 -5426 -5604 -1487 6119 15266 13841 1861 -7377 -14111 2444 10884
30122 10884 21805 30172 36075 26300 8001 3672 9913 12496 15503 9101 3254 -1360 7146 5714
30108 5714 -5008 -4956 4227 11879 12769 14482 -3832 -25709 -25347 -22844 -17309 -13179 -15273 -21354 -30291
30093 -30291 -46431 -48221 -41174 -29913 -8319 3747 2127 1474 11813 8095 16246 16814 -5168
30080 -5168 -7034 -3962 -81 1920 1708 15797 26873 18538 23085 28078 9134 9673 3774 8428
30066 8428 7218 13991 17481 24888 18401 14397 22016 35131 32477 23660 2734 -5464 -9136 -12639
30052 -12639 10027 11962 10107 17192 8040 37 9945 3601 7125 13808 11399 13922 14973 4968
30038 4968 4262 -6616 -18793 -23359 -16864 -7656 -1982 -6580 -12170 -9354 -9083 -3718 720 -1730 -19313
30023 -19313 -22910 -23080 -24625 -18437 -13313 -9941 -10523 -7396 4241 5817 13275 10775 -6548 -10164
30009 -10164 -8920 -5406 -2649 17768 26435 9072 9479 21100 10188 6424 -2849 -8912 -4159 -5403
29995 -5403 -907 6340 21007 21821 7382 9426 11313 8283 15069 15276 13062 17985 4729 -3932
29981 -3932 -7214 -13452 -23256 -22319 -19153 -6399 50 -1189 -21387 -24126 -22963 -15901 -13702 -2634
29967 -2634 9492 15679 16820 17220 31110 28175 18453 14082 -3536 -9989 -5950 -291 4692 15818
29953 15818 15766 23338 27283 26703 16846 1410 -1695 5709 3858 2527 11467 22837 18690 -2569
29939 -2569 -21136 -32690 -27261 -16197 -7394 -19171 -28928 -13502 3347 1105 5204 12471 17005
29926 17005 13703 5129 -2467 5652 -2156 -3572 -7678 -8608 -11274 -16873 -15300 -12450 7100 17801
29912 17801 14854 4317 -3083 -4259 1954 5014 -5089 1539 -1619 -17743 -28415 -21584 -10269
29899 -10269 -12277 -11847 -1794 7466 -288 -12441 -14917 -13418 -9901 1785 -6979 -2592 -8025 -9234
29885 -9234 -4855 -8698 2659 21014 22364 3798 4370 6664 11970 -5927 -14768 -24537 -11415 -6137
29871 -6137 -10829 -9367 -6368 -8751 2867 -1131 -1983 -5427 267 6730 7539 2343 -1437 4633 13488
29856 13488 14940 5749 -1246 1410 8268 6798 7055 5697 1769 -3241 -3858 -5985 -18793 -22801 -7495
29841 -7495 -5263 -8013 10352 29037 27829 19058 19453 19132 22610 22917 15767 4224 -1119 5635 10716
29826 10716 21597 32021 15259 16935 13687 -1561 9430 20426 4152 -3445 -3598 -3912 -1556
29813 -1556 -7108 6195 18758 13892 1510 1698 -4216 -12140 -17554 -8131 -48 4524 -9562 -8228
29799 -8228 -9568 -5397 -1754 2182 6297 7768 6278 2586 1779 -821 1911 -4777 9570 8497 -9040
29784 -9040 -1044 8867 23730 20456 28446 30766 28943 32826 23381 21284 20576 30114 25475 19640 10199
29769 10199 6931 5953 -8878 -18997 -19761 -16682 -9064 -4229 -10143 -11567 -1857 -9998 -21920 -18808
29755 -18808 -5670 2987 -7878 -6955 -1862 2648 3748 -5755 4454 10172 10686 14399 13274 13902
29741 13902 5349 18589 21423 18108 23088 23103 15024 5876 -2204 -4786 -5249 12388 29888 31679
29727 31679 11145 -7919 941 7401 7277 8497 7550 -1388 -12644 -25647 -22009 -21438 -18927 1321
29713 1321 13957 -2330 -1961 5314 15714 7799 -1958 -1301 -2545 1582 10449 12943 18753 11511
29699 11511 -2139 -17114 -14956 -8314 -2244 -3134 5450 10570 11116 5146 24109 35782 34551 38084
29685 38084 33759 24149 12981 22563 37214 39125 40194 24348 10190 -283 -5352 -5762 -7124
29672 -7124 -15419 -19705 -12290 64 6889 15104 14425 -4261 -19300 -10752 -9415 -21597 -27694 -26855
29658 -26855 -17487 -17515 -32339 -27503 -7006 11101 10396 6480 10957 20865 12829 -8964 -11826 -17020
29644 -17020 -6483 3102 5908 447 -7776 -170 5860 14279 9207 856 -10219 -5747 3743 -3484
29630 -3484 -4906 -6256 2686 14621 9471 9361 390 -1081 -3234 -6925 -6393 -6139 -10928 -25226 -16106
29615 -16106 3030 2216 -3540 1520 6631 -13325 -9885 14794 21605 18030 8708 2042 12565 11765
29601 11765 7797 -41 -8667 2217 14668 21608 20378 27673 15601 2473 2281 8696 7989 1271
29587 1271 -5291 -11574 4423 5889 -2791 -13516 -13019 -2555 8738 4578 13278 19325 16109 5141
29573 5141 809 10121 7498 9037 8515 9326 21906 18378 10269 1159 2363 -7481 -6518 7207 -5151
29558 -5151 -17907 -10077 -1242 10191 10571 2014 -2652 -2368 157 6817 3472 10408 7209 659 2848
29543 2848 13195 14591 6822 458 -670 3678 1367 -10657 -9347 -9157 -13643 -14180 -3918 -724
29529 -724 -7983 -24512 -31566 -29012 -16533 -3766 -6691 -12574 -13754 -20451 -17576 -24010 -17263 -13135
29515 -13135 -13634 -12319 -773 -21 -2603 -4800 1237 -2713 4623 10907 -5833 -4472 5378 9919
29501 9919 8229 9935 2272 3762 25866 29277 13844 5155 5625 -9366 -21521 -22863 -19886 -14962
29487 -14962 -20590 -10305 -819 3630 6611 -224 7096 18802 27458 2081 -8523 2143 12623
29474 12623 11432 673 -15928 -25769 -27629 -28101 -21853 -16446 -10192 -16208 -16830 -10193 -12644 -15204
29460 -15204 -18797 -16802 -26768 -31996 -21535 1281 11991 640 1867 10123 11725 1600 -1260
29447 -1260 1233 3100 13361 16995 8412 4598 10143 20574 23105 17125 18299 8723 1745 11762
29433 11762 4997 723 6049 18730 43067 38965 26780 19499 22081 22746 19281 14866 6651 -13016
29419 -13016 -2227 2990 2779 -17349 -22782 -18449 -5239 892 -2928 4573 12879 -4592 -7226 -2208
29405 -2208 1565 370 1690 9417 10963 24307 17029 8067 13131 7587 6199 2641 -5320 -10187
29391 -10187 -5799 -1764 -11557 -9958 -484 6583 25590 21850 18328 19182 5357 18825 26629 29104
29377 29104 31830 27935 19104 14086 835 -2745 -4350 1161 12906 10147 17786 19701 23365 22439
29363 22439 26076 18442 8778 -821 -7479 -8584 5905 22442 14996 689 13261 9067 12709
29350 12709 27966 27949 10211 -9400 -15458 -6194 4758 11874 11668 5011 4120 1715 -6007 -8853
29336 -8853 -10893 44 -2900 -12226 -6653 -6138 2842 395 -4264 -4055 -2689 -915 -4671 -10398 -2822
29321 -2822 -2204 -6048 6245 10495 13420 8388 -1999 -13231 -15269 5866 12435 10907 -2104 -12862
29307 -12862 -9979 1176 11737 22502 14113 19197 11578 -176 7069 1364 -3479 1244 2084 4193
29293 4193 2017 4767 12163 -4032 -11803 -2342 -3257 -2391 1480 1973 -2082 -6634 -7484 -7036 -18773
29278 -18773 -21556 -17708 -7777 -3210 -1589 -3931 -11641 -5396 -5865 -4134 3388 4918 2034 7126 8056
29263 8056 -7194 -9358 2043 -5405 -12425 -4251 -7177 -22643 -11008 6906 22547 33955 38533
29250 38533 35662 25598 9994 -4331 -5940 -7864 -10113 -5293 -731 10682 16157 25635 13868
29237 13868 1055 159 7556 18822 14107 405 -6750 8688 18207 22567 12975 5157 -4189 -15279
29223 -15279 -17485 -12534 4155 24305 28749 19063 15785 12600 20173 21010 -5448 -22905 -8920
29210 -8920 5839 -1692 -1944 -8132 -21655 -23185 -17619 -2403 -3037 -14123 -19594 -6947 8883 10896
29196 10896 233 6730 21179 20046 26572 26047 2634 -9265 -12898 -28529 -31807 -13145 -6541
29183 -6541 -11243 -10792 -25275 -18952 115 2975 -6804 -7774 6325 2977 2169 7406 1225 6488 10747
29168 10747 6721 3777 6240 15951 19546 10379 -7885 -9120 -12161 -10403 916 3075 4344 3312
29154 3312 -7802 7266 24171 13488 11740 15095 7694 944 2852 2228 7199 3820 5942 9029
29140 9029 9800 13167 4196 -2576 3352 3763 3557 1218 6232 14505 15904 16815 11148 7729 181 -2366
29124 -2366 2761 3137 -9307 -11019 -1314 8395 9013 26924 28765 17828 4803 14133 20295 9414
29110 9414 17541 19275 25103 27488 30063 28105 17946 1227 -1022 1332 -946 -2915 -1262 -1656
29096 -1656 3416 4354 -1883 -10893 -5018 4423 -9121 -8826 571 -3187 -3183 3750 15225 26013 22682
29081 22682 25326 20385 12185 2540 -18581 -12779 1493 4852 -2693 -3512 8474 10455 7079 2397
29067 2397 4078 1940 7066 11257 26572 27094 12804 4159 -7022 -13282 -11242 12808 15932 9658
29053 9658 8801 14384 17639 19831 27218 26646 27212 24744 13732 6844 15110 19971 2701 -10329 -2296
29038 -2296 -5998 -5188 -1350 -12491 -9538 -14950 -20883 1393 4353 3372 -5917 -2483 9553 6743
29024 6743 5361 9526 11002 11526 17533 5586 -3130 -5647 -3612 1727 12715 1545 2028 9245
29010 9245 7332 -88 2609 10554 6784 4316 4471 9741 14765 23199 12773 7086 3720 12376 6307
28995 6307 -285 8467 20288 24334 17443 20574 25595 18757 14082 4951 -160 -4138 -5310 -889
28981 -889 13750 17269 10496 13045 8912 -2989 -11267 4597 10683 6037 2178 2241 153 7222 2712
28966 2712 8539 15205 11730 -1096 -1258 2303 -4633 -1462 935 8435 6726 14290 4008 -2513
28952 -2513 -1853 -6631 -14836 -14780 -18790 -3724 -2305 -5310 -2872 -112 12265 24520 17435 10505 12324
28937 12324 -3293 -19060 -17713 -14118 5373 5505 648 13373 13389 2403 -8906 -5777 -1604 2443
28923 2443 2340 -20 -3140 -4074 -7868 -3887 -2068 1668 4793 15556 20627 22530 16916 12489 5513
28908 5513 11001 -7299 -15074 -15080 -10248 -9774 -11341 -1203 -2352 -9846 1419 8954 14539 12528 11925
28893 11925 13646 -86 -5462 -16078 -14404 -13466 3391 28260 30451 16217 14373 -5262 -5164 1830
28879 1830 13205 11147 2986 16633 20346 28701 17825 11644 16912 14444 22750 29748 22854 12072
28865 12072 4257 2207 3037 2373 15698 35483 37792 21489 7529 10241 8591 22230 25413 23154
28851 23154 9283 15602 9785 4585 17670 31707 33566 35598 27997 20875 22458 19559 24233 16374
28837 16374 12099 11411 1622 176 9681 14442 14408 24354 17150 15843 13078 5837 -1923 4085 9265
28822 9265 15295 8955 5624 4914 -7401 931 7091 10689 20298 19992 24703 20957 12594 13534 11784
28807 11784 8017 15973 21909 16513 17595 18968 18419 19520 16809 -1370 -1781 48 12332 22097
28793 22097 5093 -2493 4303 23791 23720 15502 1423 -3412 -402 -627 -3481 -8711 -2025 2848
28779 2848 13435 9851 981 -7126 4017 -9641 -14556 -18243 -19206 2845 26797 18031 19147 19236
28765 19236 17224 25502 20421 11558 -5927 3272 18289 22125 11834 13450 15911 14376 19059 4224
28751 4224 -5958 -17623 -18943 -19369 -24271 -21894 -4889 3060 11722 14851 15504 7113 -11554 -8439
28737 -8439 -5419 -4009 15420 24847 25471 17127 10825 -1008 -11997 -15916 -11243 -19458 -17312 -11745
28723 -11745 -1205 -6893 -10427 -8868 -9885 -5035 -12 6457 2367 9645 6983 9857 12759 5889
28709 5889 9198 25429 18174 6302 3211 -3450 -4331 1925 4149 24223 37145 31827 24773 19203
28695 19203 14071 -389 -5929 -4683 5589 19546 13553 -6068 -8537 -8339 -3987 1045 3339 10351
28681 10351 9954 -2406 -4666 14167 8204 2618 5580 7013 10606 12702 16309 18063 14995 10918
28667 10918 6050 2702 -7104 -1093 25667 24104 19220 13465 16682 8348 7217 9137 14808 13074
28653 13074 13784 11753 -3935 -8374 -2593 2417 14957 1759 4576 7242 4113 4281 4416 1237
28639 1237 4435 16446 31993 30822 22984 28966 28570 16224 10499 1328 -4483 -1665 -1228 -1391 3896
28624 3896 8366 19142 17625 24807 36096 36746 24020 17298 16472 5605 6276 9622 9155 17333 10229
28609 10229 6749 239 -1932 -4957 -12282 -13451 -12489 -977 -2968 -7245 -10433 -7844 -19465 -15558
28595 -15558 -9817 -19056 -19214 -195 14772 6256 -181 -1254 3584 14758 14973 4122 4957 2620
28581 2620 779 -1663 -7231 -12990 -24894 -29269 -15934 -2716 7136 6354 4593 312 -1634 6746
28567 6746 9369 -6363 -9395 2816 10954 601 -5295 4152 -3324 10618 8060 8750 4087 -7933
28553 -7933 -5164 -2749 -8583 -919 -4240 -9488 -6675 -9147 -13345 -14872 -7703 -6251 -7740 9266
28539 9266 20067 16616 7449 9207 13716 5810 -11840 -6073 -8106 -6706 7746 12885 19707 21940
28525 21940 15096 4039 7164 5671 -7044 2344 20188 19083 23098 18266 19564 31695 23058
28512 23058 8390 8818 23376 32883 20804 18642 4118 -4929 -10456 -2944 2746 -9488 -21928
28499 -21928 -21433 -20552 -20919 -16868 -14913 -4464 18838 25236 15730 568 -8107 -5772 3876 713
28485 713 13081 12427 10081 3918 -7177 -4249 -2645 1998 19424 25170 19385 15965 17481 13409
28471 13409 -4127 -8117 -3951 2139 3114 -3804 -9047 -557 6015 2776 10732 3389 -19237 -24221
28457 -24221 -24077 -27237 -19143 -6987 -1956 3248 7826 8088 16526 29301 24882 23389 33169 29232
28443 29232 25281 17062 6207 1082 -2146 -7490 -2909 11257 -8917 -14548 -10850 -6724 -5483 834
28429 834 -5936 -2525 1597 13910 15589 19191 27843 25956 25339 19576 6711 -5972 4318 -4831
28415 -4831 -6957 -11992 -12156 -6289 13771 7782 13210 1738 -12117 -15888 -6113 -5221 5715 2324
28401 2324 1255 -6656 -2053 2543 -155 1234 7631 15432 13322 13023 -6346 -20006 -16896 7300
28387 7300 10738 136 -3429 -8333 -15826 -11675 -14082 -14330 -9741 9125 3624 7495 7655 8284 7521
28372 7521 -14830 -18754 -601 1641 -11709 -14590 -7612 12542 39601 47102 32491 35777 29585
28359 29585 28016 25089 26616 23255 9604 14028 14627 10334 16523 13765 16388 17709 24250 34063
28345 34063 35997 32775 26274 28560 26270 26406 37094 28670 10428 4648 17076 21385 17383 10668
28331 10668 16058 22307 5385 -3474 9803 3944 -3590 -10593 -6984 -3676 9424 16696 5498
28318 5498 12713 9832 9096 14932 20223 24330 21624 14373 12691 15091 13204 14116 16006 12475 11187
28303 11187 7484 14016 30674 26948 12679 4574 5700 -13538 -33519 -29429 -20812 -25888 -30341
28290 -30341 -32633 -15712 -5507 -15963 -15567 -16057 -11499 -9742 -572 -4308 9921 12092 -3133 -17984
28276 -17984 -9405 4594 7451 4691 -3141 -693 -2564 -11202 -1401 20725 40348 30730 19794
28263 19794 18008 16809 13976 10078 11278 -1328 -5476 9187 -2989 -7658 -1406 -2637 6285 7683
28249 7683 965 -895 8180 16444 12378 14052 9780 11484 10199 1882 -10108 -7754 -6782 9985
28235 9985 17980 2644 6517 16479 390 2939 -347 -6973 -15839 -6382 11714 4348 -13932 -13868
28221 -13868 1112 13134 10454 7748 11504 15285 5260 1817 19293 29198 30687 34273 28417
28208 28417 29143 15800 2820 -4089 6938 10829 7698 -3243 -7001 -2082 -3338 623 4722 -2352
28194 -2352 4172 15886 18995 13543 11372 2831 19473 39892 26717 20677 18514 27726 23202 9415
28180 9415 -6423 782 -8198 -12811 2084 22395 28110 26167 26653 23481 26206 19356 19607 12423
28166 12423 9935 6283 5884 10438 11580 11460 12522 9509 5888 -3603 -3757 456 -8287 -5359 382
28151 382 7320 15787 21519 14673 12800 19066 16271 15147 16369 11126 11785 9474 5218 3813 1142
28136 1142 3642 -2265 6200 18520 15549 1922 11175 21963 24480 9381 9112 19427 25885 21568
28122 21568 9326 1970 11893 7484 1653 -12313 -15804 -5382 6237 13803 26077 7798 1282
28109 1282 -2773 3998 10484 15019 10949 16699 33564 32830 25907 26072 21906 4356 -8871 -9465 -14295
28094 -14295 -21811 -18087 -11434 2407 8952 10329 20505 18818 2158 -150 1054 2938 -9692
28081 -9692 -8427 8368 14386 4629 -2693 1201 -816 5065 -4433 700 3916 1593 5851 5963 7546
28066 7546 11122 18496 23505 13160 6970 11158 21411 17192 15628 11106 23445 35650 41680 43911
28052 43911 23186 11176 12789 10657 -84 -5524 -7638 -5813 -7303 -6290 -2239 9897 24325
28039 24325 17834 13368 16410 14180 -34 3926 15913 22611 18807 16077 14684 16663 13825 14852
28025 14852 10128 15717 27506 27724 34096 34990 25223 20056 -3769 -11515 -2797 -7417 -9857 -18067
28011 -18067 -2619 2411 -8490 -2066 6592 9760 15498 9596 17987 17442 13191 16905 12517 1870
27997 1870 3505 4214 -5501 -6763 -4602 3670 9281 13831 12173 14185 4770 2346 19260 25856 10452
27982 10452 4916 7829 10073 8031 6104 -86 193 11465 20449 11497 743 8481 24284 10592
27968 10592 10261 1793 -1310 -11246 -21072 -20920 -17290 -12943 -6475 -3380 -1669 -5857 -3014 5931 17707
27953 17707 22664 25085 17618 8282 875 3500 3612 3612 2157 10446 18588 8894 -4739 -2961 11930
27938 11930 25656 45417 40169 22097 9961 17600 25808 16244 -68 -1316 21388 10665 5910
27925 5910 6479 10973 21262 20967 12669 11494 10606 2983 3244 -2315 -16715 -14387 -4608 409 7817
27910 7817 5383 781 -10589 -19431 -4593 11578 20349 22783 12327 -4338 -15307 -10954 14160
27897 14160 11091 -1422 7033 2426 5977 -1098 2461 10110 7567 15223 21067 27393 35102 28970
27883 28970 14875 1566 -219 -505 -6092 -232 2054 -711 7736 16925 -1176 -2964 -3924 -160
27869 -160 6829 13179 18768 17698 11510 5008 12351 7749 6027 10955 -2032 -16031 -11357 -4382
27855 -4382 2808 -5449 -1670 -6502 -6254 -6826 5576 -1981 -4051 3005 -827 6634 8584 2010 6767
27840 6767 10293 11880 2766 8651 -14760 -17219 -1964 12333 19113 13428 8226 4071 2011 4147
27826 4147 12575 9250 7241 17517 14101 4080 -3118 -10740 -2360 10062 22521 19519 5068
27813 5068 -2623 4100 441 -2637 1800 -5683 -8446 729 10963 11685 -6100 -12625 384 1610
27799 1610 -6410 -3978 8041 7858 1265 -8517 -1805 9714 10467 5879 12116 11649 15313 10985 12716
27784 12716 15450 13708 -1918 42 12736 15372 26536 30283 20670 11201 -7962 -25551 -19839
27771 -19839 -14969 2157 1557 -440 1462 -8477 -13236 -8239 -13273 -9533 4014 19155 21769 8185
27757 8185 4676 14531 57 -2334 15449 26797 6789 -10672 -13747 -10985 -9210 -8290 -3159 6518
27743 6518 10062 23811 26982 18370 12767 9938 8270 6767 2152 4967 7465 14775 8979 -16287
27729 -16287 -6605 3308 -640 -5598 1080 14216 10818 2576 3743 -137 6931 14784 10922 -2655
27715 -2655 -12535 -14677 -12437 -277 -6306 -2503 3322 1673 6207 -2866 2206 -8781 -7885 3644
27701 3644 -5853 -13914 -4950 1617 -1403 -8778 -8636 -317 3568 2113 7229 -7998 -4302 -2172 4262
27686 4262 19509 34013 33147 23201 4358 -5354 2616 10799 7539 -5905 -11537 -4190 12060 6488
27672 6488 3565 7099 7902 16287 13575 1763 337 -2429 10753 13573 21892 7618 -1440 8462
27658 8462 6062 10420 9336 14885 12132 16831 21446 26026 22560 10207 -5579 -2539 5379 8108
27644 8108 15062 16877 5372 8981 24710 26207 10035 7593 8987 9637 13210 21246 22137 14122
27630 14122 14228 18640 21584 18157 20462 24702 22649 30660 26468 18756 19546 6202 13036 9214 1071
27615 1071 7837 17721 8446 -5574 -5845 -7957 1769 3986 -1157 1461 115 -200 -4562 -13308 -13259
27600 -13259 -5270 -3357 4170 3419 4919 9846 6468 -14083 -15922 -5385 -3678 520 439 -9548 -22637
27585 -22637 -25733 -18088 -1990 1922 32 457 8663 12156 5759 2992 18052 34685 46466 38150
27571 38150 22417 16860 13173 3990 -10056 -29415 -37338 -29685 -23617 -20814 -16771 -9166 -6798 -11418
27557 -11418 -7669 -10086 -19512 -17372 -2591 18635 26392 10959 -5810 -9603 -18185 -5822 11924
27544 11924 25903 28853 24322 9521 -14792 -18786 -4252 -3850 1050 13863 23808 22888 33937
27531 33937 42662 41399 34244 35239 25336 6865 5146 14197 -3362 -6679 -14495 -14324 -12277 -16050
27517 -16050 -16753 -8261 -13766 -9613 -9581 -1758 9075 18138 20630 32957 38310 33008 23618 2264
27503 2264 -8274 2886 1117 1136 10743 -5521 -10521 4684 9955 6124 759 2095 6097 7281
27489 7281 988 -13449 -9352 624 4283 11180 18604 15534 10417 10843 4913 7857 6747 61 3999
27474 3999 -6237 -6062 -5525 -272 2457 1637 -5459 3028 8658 15990 20791 16547 5126 10832 10476
27459 10476 15596 19730 12164 -4777 -11549 -473 5877 2914 -786 -7662 -5476 2594 -798 -5291
27445 -5291 -2782 -2966 -5980 -17300 -12643 537 10431 8555 3989 6489 3963 10258 9227 6775
27431 6775 -2106 -6702 4955 13997 18840 3479 -2671 -119 -3801 -6432 -5274 4001 16440 9433
27417 9433 -2472 10667 24682 19245 -244 -5684 -4253 -8695 -8490 -6813 -7322 -18136 -9018 -12651
27403 -12651 -10583 -12974 -13709 261 19892 22633 10668 17311 23159 14924 11109 17277 22777 14417
27389 14417 5773 3031 -1889 16759 19468 11462 11468 13984 28798 27054 13818 4264 11149 24080
27375 24080 36578 28664 19700 7138 8141 5937 4005 76 -8121 -10023 -3838 9457 10186 -409
27361 -409 -2073 -1150 1084 5253 3456 5367 10867 20956 21807 34177 36522 26961 18609 6347 -3680
27346 -3680 2076 16240 14612 13824 15218 9116 -1108 -10187 -8142 -2306 1272 -8201 -4342 3805
27332 3805 20745 14950 -1511 -1953 8361 17457 30002 25116 8540 1274 6240 12020 5900 -3497
27318 -3497 -2853 12059 13857 8628 13950 23461 27503 30142 37017 33961 28944 29005 21756 7526 -1477
27303 -1477 7132 21025 18311 24300 28634 29463 13212 -6743 -6754 -6819 -362 7594 1548 -3366 -15921
27288 -15921 1179 16857 23474 24415 19764 15772 8459 -710 -4939 -8448 -6394 12014 13839 1038
27274 1038 3730 8599 9069 6701 16623 15672 11231 -4663 -68 3027 13326 13524 12367 17943 24640
27259 24640 26218 20811 26644 21185 13229 14256 16434 7569 6679 10448 12447 7995 -5763 -7750
27245 -7750 6513 12505 2616 3248 7121 -854 -9322 -6131 933 9411 10476 6567 7085 8939 4586
27230 4586 -6816 -8512 -9324 -9429 -13245 -2886 4260 17084 29718 28923 24388 15857 6077 17601
27216 17601 38323 29425 14414 9455 6091 3579 -9281 -12551 -2308 5336 1842 -112 -2861
27203 -2861 13604 23322 12301 2440 5579 3503 -4052 9488 15675 7192 8511 20339 24910 15884
27189 15884 13256 34496 25857 15681 14043 2573 15287 18457 34367 43628 38374 34672 9936
27176 9936 12953 21477 3060 -2686 -2781 -3277 4027 -1557 -11092 3467 7972 11102 9571 12513 17105
27161 17105 10115 3703 -11311 -8348 -633 7093 11299 -4965 -6373 -1318 -6881 -16101 -11100 1420
27147 1420 10885 17928 18920 16766 7854 5786 -8047 -885 -9304 -12391 -18136 -12373 3598 18313
27133 18313 19936 22472 36439 38053 31737 15087 7847 21900 1689 -708 8630 14748 6415
27120 6415 -8095 -720 -7786 -3050 -3258 -8053 3549 39 -7400 -16887 -10915 -4419 -2695 6706
27106 6706 -1483 -12691 -9976 7547 1409 -19941 -21579 -15614 -16029 -16125 -13934 -3657 -1784 5707
27092 5707 1061 -5101 -14832 -12321 -1774 -3553 -14065 -8408 12171 12714 5877 9997 11269 6635
27078 6635 1369 -3936 -5002 5579 9021 14725 9383 9116 11668 6599 -9135 -11453 -4971 7492
27064 7492 8176 4737 1805 -6767 -1331 7049 8521 13704 10992 6660 3909 16519 18320 17558 26411
27049 26411 27974 29392 26471 19926 167 -4750 10132 31290 41475 36962 38777 24986 7280
27036 7280 7 1860 2479 5482 7917 -5065 -10201 -15891 -14528 937 13028 1628 -13425 -12952
27022 -12952 -12136 -839 8241 -10735 -17145 -4969 1674 3069 2929 -2208 1617 3832 -2549 -4803
27008 -4803 -711 819 4400 8917 6367 16447 23068 20163 10046 7842 4251 5854 -8500 -17835
26994 -17835 -18780 -23457 -27444 -18207 -416 6492 6126 6448 10621 20167 27792 29036 23700 13216 7921
26979 7921 6528 22315 20760 10165 -300 -907 -3762 1302 10848 21374 5241 -8369 -1915
26966 -1915 -5245 7825 26178 30945 20605 12294 7070 1016 -1682 3985 14717 19091 12676 -1500
26952 -1500 -3459 -1341 -12393 -12448 -2171 -7206 -21005 -26407 -23298 -19759 -20099 -18934 -5255 -2351
26938 -2351 -9993 -20688 -11233 -3076 -6098 -5982 -127 6767 11603 7456 9324 18494 8649 9170 7561
26923 7561 13527 11707 3191 5207 -7687 -1793 16840 21111 14208 13925 431 1378 -7500 -22250
26909 -22250 -16539 -9158 1883 14403 29251 43685 42877 32578 19854 1501 -632 -4109 -12562
26896 -12562 -689 10437 14618 7283 -12550 -18548 -15972 852 3787 -14580 -10585 -5359 -11979
26883 -11979 -12521 -19908 -36487 -8126 -8187 -17370 -19572 -20173 -10720 7854 11731 -2175 2329 5946
26869 5946 12709 -2405 -2762 11709 13824 6537 2149 10397 3825 2792 -7871 1999 3976 -10553
26855 -10553 -17618 -16983 1967 17580 19035 15302 15436 5850 -2122 -533 8554 3121 -623 7989
26841 7989 10509 1842 491 -4112 2368 9386 -16283 -27329 -28742 -13958 6810 11900 6173 -5445
26827 -5445 -11509 -24486 -16062 -13561 -8327 -6738 1432 8836 12070 7469 12881 13664 3467 -1574
26813 -1574 1699 -253 3121 10723 14824 7859 4812 6359 13479 19190 19965 11032 -6096 -26544
26799 -26544 -32044 -24058 -16529 -3937 7367 8496 -1980 3819 11974 14629 -6930 -10028 -7119
26786 -7119 -1384 -4817 -9855 -19311 -4789 14131 14843 4951 2325 -10875 -16611 -3583 -2352 -12472
26772 -12472 -14924 -6913 -3033 1422 11709 6571 -527 -1516 4921 9485 11333 3693 -16973 -20738
26758 -20738 -3976 10921 4605 -8049 2891 12043 20501 9437 8196 11193 23363 16668 4611
26745 4611 10563 11982 10534 11670 15196 3798 4871 15735 19886 22475 8836 -1285 -13342
26732 -13342 -17596 -6831 -5888 -20097 -16419 -15522 -13085 -1024 7074 16616 9606 15720 11006 5565
26718 5565 6007 5331 13876 7348 15321 17250 16636 16815 3504 -14064 -11711 -8212 -15538 -14980 2769
26703 2769 12574 -910 2457 3899 3626 -2498 2710 -444 -6493 -15146 -24021 -7177 10548 7916
26689 7916 8686 25926 24466 21408 15983 15176 2091 5617 2716 1899 -4750 -7670 -2104 -7042 254
26674 254 3469 3590 2847 -6402 -9851 -8108 -9080 -13497 -16414 -10188 5515 1431 -6127 1077 -731
26659 -731 7739 11419 8366 2206 518 5710 19234 20300 13462 10403 12795 4325 8426 -5479
26645 -5479 -10143 -8636 -16438 -17819 -21828 -7415 -801 3432 17755 -2761 -13120 1634 18165
26632 18165 21888 16220 3004 -2289 6843 -1649 -15757 -27015 -13501 -7145 -4277 8044 10983
26619 10983 2784 2291 4152 -4369 -9237 -10173 -15420 -24955 -27577 -18222 -3439 3464 14631 10161
26605 10161 19444 24079 20455 13991 6455 8824 5419 13260 19703 17113 6284 8879 20837 8258
26591 8258 -929 -1560 -2673 -5926 -11536 -16443 -15155 -14910 -22526 -16145 -4505 -7918 -10592 -8062 2515
26576 2515 10429 2829 2784 1096 5701 4270 -7747 -14102 -12946 1374 -7117 -16854 -13279 -10156 -4811
26561 -4811 -17608 -14673 -1048 16071 8964 10722 10397 -4248 -3845 1498 12044 -3434 283 3906
26547 3906 4406 15286 4922 -7229 -6723 -933 384 12421 9181 -6499 -5813 7287 4800 9324
26533 9324 4634 4789 4785 1623 4852 2792 -1455 7487 13995 18349 25394 18567 12850 -2271 -14855
26518 -14855 -15690 -13827 -11440 -2075 13700 17643 18024 7563 -4895 -6493 -10761 -8814 -11683 -13994
26504 -13994 -14541 9960 13683 5259 -57 9215 10158 8439 7200 17959 24744 21264 30097 18057
26490 18057 11953 15595 16068 5629 -2999 -13049 -10421 -7122 -4513 10146 7006 9995 5313 2690
26476 2690 4628 4331 -2503 -7176 -1969 14115 6834 -7420 -8765 -6861 -12790 -6815 -2105 -7959
26462 -7959 -8374 8432 16330 8061 -558 -9364 -21489 -23545 -21022 -19415 -4940 3326 10972 8301
26448 8301 5961 9508 1028 -11479 -14123 -13122 -12625 -8649 -1793 -7662 -13236 -14338 -5864 5669
26434 5669 10012 9453 13339 11151 21044 14774 -84 -4044 9985 22152 16592 9208 5069 12781
26420 12781 12868 -2293 -2582 3837 -2120 -17559 -23482 -13632 -9402 -17407 -22553 -13690 -9131 -2382 -1278
26405 -1278 -9012 -13225 4379 11535 15235 19967 21703 19459 4037 -10019 -9791 10871 6883 -11221
26391 -11221 -13158 -11217 -15950 -6216 660 -5380 -6136 -6548 -17773 -29870 -36086 -28267 -4241 3412
26377 3412 10436 9651 6677 15223 13185 15397 23112 15463 7659 -3918 886 6035 5167 -3340 -13167
26362 -13167 -6745 -7383 -13007 -13301 -21360 -29857 -22092 -13021 -1230 1991 -669 3686 3095 -1477 -2392
26347 -2392 13343 28548 35886 40457 34287 28285 19391 6291 4883 -572 7978 15028 15827 20094
26333 20094 6344 -7766 2893 14591 11909 16246 20844 16496 10379 6911 -5448 -21356 -23313
26320 -23313 -16794 -412 15616 7724 5161 6313 -508 -11670 -9065 -12143 -18458 -15711 -8473 -4533
26306 -4533 3253 -3091 -15486 -22361 -21852 -9341 -6256 -2978 2063 -3320 2016 414 -1354 9416
26292 9416 13746 4465 -11582 -17761 -10768 -12665 2790 5171 12653 12620 10671 11995 2422 12059 6287
26277 6287 -9083 -283 7186 8935 12756 13057 12149 10148 2869 -7909 -7787 8544 24232 20904
26263 20904 15956 7890 1851 -10480 -12923 2150 19916 17703 5173 -1178 -8539 -6058 -9502
26250 -9502 -17650 857 2093 -20269 -30745 -21811 -343 4413 3631 9546 14831 -195 -10488
26237 -10488 -6659 -5350 -10349 -23718 -17565 -7445 -6312 -3209 -1090 -5154 475 6344 11955 14479
26223 14479 17048 17993 23907 9789 -9183 -19732 -17341 -23632 -18543 -12269 -6103 14929 28412
26210 28412 36905 28122 25483 17583 12579 13332 15270 11626 22172 24786 24313 20244 14446 3695
26196 3695 11508 9861 2558 3311 -826 -7170 -6137 2926 16974 22963 4562 7373 10668 10049 15249
26181 15249 14397 8602 1191 -4955 16494 25841 22522 11375 -901 -8026 -12756 -892 -4637 -13077
26167 -13077 -1307 789 -804 -7832 -10697 -10822 -1407 -4115 -11822 -11817 -12310 -7748 -6770 283 -1056 -8109
26151 -8109 -10217 -16688 -3722 14042 15121 8463 7598 7412 -3758 -9458 6765 13350 9226 -4105
26137 -4105 -9178 2815 6719 19092 17817 14493 15177 6133 11722 19351 7626 -7975 -7954 -10010
26123 -10010 -6551 8358 4993 -9677 -18104 -18419 -6947 3662 15382 16562 25260 30888 18726
26110 18726 -3778 -13947 -9025 -8109 -18619 -2870 -1765 -6661 -3526 3338 8967 3604 -2579 4996
26096 4996 2732 12974 28002 35813 29454 15376 13942 20486 8919 6448 5518 20170 15015 23439
26082 23439 23740 29002 29271 10773 -11855 -4922 3822 4379 3008 16411 24410 24144 8295 2280
26068 2280 17161 17254 16992 3625 -1604 846 4569 991 -13554 -9440 -6821 -5303 4477 12167 25164
26053 25164 31735 25391 16862 2506 -9152 -18541 -12935 -1660 10473 19065 14793 15846 -1513
26040 -1513 -9445 6166 26146 25055 16677 16731 11635 13393 13793 7069 -2269 6546 11661 2170 -2844
26025 -2844 -13758 -12751 1036 4341 6556 8311 9553 4167 -12193 -21490 -17429 -14836 -14840 -5741 6696
26010 6696 3974 2539 7307 -4284 -17996 -23396 -23580 -15163 -12622 -11042 -9937 -337 11812 15794
25996 15794 14659 4934 564 11345 17016 6208 7020 24666 29808 7569 1434 -5148 -12126 -9346
25982 -9346 -9732 -2429 -1225 -8065 -9017 -13423 -21618 -12397 -7392 -2665 4956 -1684 -2917 8571 6447
25967 6447 9951 12619 14617 -8521 -5837 1688 332 -1966 3749 9781 23794 33232 31062 22670
25953 22670 22199 23869 13056 1073 -5152 -8140 -14887 -17389 -17566 -13418 -20323 -8566 -1295 -3561
25939 -3561 3237 5201 16236 10309 -10627 -21019 -14694 6478 9445 12779 14217 18800 6364
25926 6364 -1487 5279 5849 -14436 -25604 -34093 -29367 -13990 -7901 -544 25801 32868 16662 -2414
25912 -2414 -19525 -20612 -5205 -5488 -21628 -32913 -13358 -14973 -4486 -6312 -7888 -16899 -23109
25899 -23109 -9826 2985 10801 -6719 -17896 -12930 -7898 -19571 -16555 -4906 22411 25738 11431
25886 11431 2658 -3350 -2795 -10117 -21300 -13921 -8332 7337 1068 -4802 3906 -3039 4898 9342
25872 9342 39 -15168 -12004 5960 12575 14522 8739 5418 -3486 -12966 -10303 -1550 -8714 -23905
25858 -23905 -35124 -40045 -32675 -26454 -21863 -8320 6015 4268 -10514 -20128 -29453 -23199 -11920
25845 -11920 -15931 -8313 -7647 -3860 6016 8274 4696 4427 8697 4746 -2914 -909 2971 8689 13303
25830 13303 2491 -8766 -7850 15515 31502 33232 26712 28509 10956 -4675 -2326 1756 5146
25817 5146 895 5272 5113 7460 7011 -8446 -10142 -2218 1703 6518 3494 3806 1043 -22212 -26091
25802 -26091 -8239 -1302 -858 3477 15177 13157 17836 12360 13097 3596 -743 3586 -4478 -12865
25788 -12865 7724 20333 14870 5740 1879 -6354 -12441 -9631 9876 34021 24741 20057 19683 24059
25774 24059 28082 22696 23025 34337 17718 7902 1490 -13611 -15007 1100 9596 -5364 -12809
25761 -12809 -10068 -6801 -11799 -9661 1413 3131 -7006 -19493 -22472 -24880 -17434 -20794 -21343 -27845
25747 -27845 -11724 9210 10806 -4628 -9601 -17061 -4878 3664 -7439 4368 21372 12119 8014
25734 8014 9390 12000 13563 18060 16887 5385 6075 -527 1098 624 -5379 -9896 -15000 -10351 -9341
25719 -9341 -1317 1746 -628 3335 12069 1156 635 9317 4926 5113 -3785 -1468 13152 10831 6844
25704 6844 -129 -5973 3632 8892 8531 6973 5092 -11459 -23684 -29738 -29063 -24720 -11674 -7971
25690 -7971 1800 1122 -6108 -8608 -4455 3473 2824 -2202 -1044 14732 23788 6448 1192 -1567 3163
25675 3163 22727 19811 -5403 -17458 -13797 -12978 -8919 4695 4046 -1334 8032 3928 8235 -531
25661 -531 6012 1254 -7795 797 7045 12021 19525 15177 14100 -6835 4386 5394 1903 -2932
25647 -2932 -1651 -13243 -8648 2751 -4575 -3678 14700 16677 10424 -6020 -13253 1510 6204 -11269
25633 -11269 -29336 -19204 1286 6411 -974 -2628 -1911 -6001 2157 28214 37151 22656 8550
25620 8550 -5290 -16288 -17314 -4753 -4171 -10040 798 8515 8338 -36 -1177 -2161 3075 4339
25606 4339 2783 7893 3833 687 -11857 -27721 -18013 -8788 2170 15339 24084 18834 12759 11193
25592 11193 14434 4315 -6186 -3151 -3437 -12172 -1377 10505 2540 5817 5046 -4461 -13817 -22853
25578 -22853 -26700 -25788 -24732 -18170 -23991 -20533 -7689 -4288 -13313 -8338 -256 5019 -8739 -5931
25564 -5931 -5670 -7294 3854 11733 2594 4101 7621 13373 20685 15418 -2020 6121 22036 33151
25550 33151 32452 16068 6731 -769 -6515 14047 3531 -13906 -15457 -16166 -21729 -23491 -10604 -12038
25536 -12038 -15917 -10116 -2360 3460 -4164 -3097 -10150 -23799 -22082 -18391 -12942 -12457 -14352 -7551
25522 -7551 2887 2112 114 8594 -332 -11700 -20738 -7967 6089 6513 5513 4341 10091 19807
25508 19807 12854 3507 -922 -7351 3184 5662 -2733 -10069 -12670 -13909 -8394 10958 17282 11749
25494 11749 4713 -13161 -16993 -6906 6968 2496 -4332 -5506 -5639 -12894 -4977 -10354 -13216 -2963
25480 -2963 1642 -811 -9523 -20974 -18574 -9956 -5927 -22407 -25046 -15234 -18866 -7130 4816 -7659
25466 -7659 -18607 -12761 -11798 -10092 5340 7183 11943 22569 19753 14049 3678 2050 225 4000
25452 4000 18796 19489 15447 4750 -9946 -18929 -25805 -24207 -18313 -10387 -9774 -23317 -26157 -19580
25438 -19580 -13639 189 8659 3069 -14836 -20862 -9224 -8846 885 4740 5926 11775 8063 -131
25424 -131 -6083 -18525 -5634 3135 6978 6914 -1211 -15870 -21554 -18300 -6817 -3763 -13782 -14816
25410 -14816 -7792 -14144 -12554 -3171 1245 20371 26671 29939 18699 17322 4480 -5973 77
25397 77 -344 -1074 -11566 -4028 -1012 -16875 -29106 -19761 -5230 -1339 3440 1103 4724 -8695
25383 -8695 -14603 -3876 13912 7536 6638 6737 5560 10830 15445 16754 10289 -508 2495 10885 2442
25368 2442 -1305 -5576 -4045 2159 -2203 1494 4212 3657 -786 -14994 -27197 -23965 -12618 717
25354 717 7091 6007 -3468 -4378 -4385 -7453 -7236 -343 7298 -1954 -9683 -4411 -3498 4641 -2628 -22397
25338 -22397 -19582 -14026 -9640 -13399 -7079 -7805 -10129 -10620 -1209 7636 6635 -2266 -22272 -22987 -30124
25323 -30124 -33690 -31012 -29351 -25312 -15455 -14982 -14667 -11443 -11963 319 3820 3826 -4814 -16089 -17383
25308 -17383 1874 1352 -7377 -12370 -15617 -36402 -28217 -16055 -11151 -5680 -1485 -5722 -7678 -26823
25294 -26823 -18685 -16792 -2446 9356 7655 6640 6842 -6 -507 9027 13414 5365 -2983 2861
25280 2861 2349 3971 10767 9359 -464 -10739 -16276 -9382 -10208 -1844 5844 485 -5155 -4780 -7633
25265 -7633 -157 -1081 1391 8212 2209 -3214 -6755 -13364 -2886 -2407 -461 -183 305 6468 20537
25250 20537 25514 20402 11835 -497 -9824 -16583 -5813 -4160 -6761 -15092 -18058 -20250 -16196 -11943
25236 -11943 -17372 -7214 644 -10125 -10316 -12057 -11331 -8572 -9340 -10326 -17442 -17642 -13771 -7671 -7081
25221 -7081 -12711 -11715 3711 14614 1220 4173 16676 11097 4281 15459 20979 18254 10120 3283
25207 3283 -1 3791 16505 22032 19386 13962 -4155 -6538 -7865 -28084 -22676 -10657 -6996 -4736
25193 -4736 -355 -3714 -3672 1455 -7117 -6912 -6695 -11628 -11582 -14019 -11064 -1558 -12435 -31235 -24067 -4969
25177 -4969 2061 -4502 -2269 2091 19997 20146 12803 -3190 -7562 4869 2116 -6594 -16301 -8939
25163 -8939 -2499 -4181 -703 3279 13806 13706 18923 5600 -738 2904 12240 3173 -2277 -2071 -6886
25148 -6886 -16349 -18620 -6537 -7841 -13838 -11307 -9285 -10123 -13311 -3145 -7447 -14322 -8070 -3120
25134 -3120 -14174 -21031 -7398 -9636 -6248 -624 4184 3516 -7872 -19688 -23765 -3040 13175
25121 13175 8325 1606 -3935 -3464 3004 12659 13316 15635 17473 13198 17938 8085 -2513 -1077 5662
25106 5662 -71 -4782 2421 17214 24533 16442 -379 -33384 -39559 -27630 -24668 -8891 -5581
25093 -5581 423 -15059 -27234 -20530 -11214 -14473 -16974 -9227 1251 2944 -6383 -20932 -14600 2974
25079 2974 7107 9943 -2679 -12304 -5298 2246 6301 10311 1047 -12800 -7829 -7422 -8476 -9064 2287
25064 2287 13182 6134 8256 2877 2430 8467 -809 -15691 -10349 -8676 -5257 -5834 -11744 -25806
25050 -25806 -16775 -14428 -6369 -2810 2696 -4806 -15035 -17770 -1037 5285 -4846 -12596 -13340 -9747
25036 -9747 -13628 -20064 -20115 -16704 -2481 -9389 -3088 -5897 -13897 -6933 1884 12165 13770 11597 10168
25021 10168 394 -14091 -14795 -5468 -2419 1794 1050 -3043 2465 2518 -17886 -34872 -29095 -23249 -15867
25006 -15867 -11343 -19563 -18305 -1990 7817 3840 -1120 -1399 771 5686 -922 -15024 -12933 7004
24992 7004 23098 7444 -6454 -8103 -1408 -11840 -9563 -7798 -3566 -7316 -16248 -15561 -7214 567
24978 567 -1210 -14589 -25126 -18291 -10495 3793 7058 661 -13761 -18224 -3662 7429 6673 -8426
24964 -8426 -8450 1161 -4241 -1376 6545 33226 31335 19276 11340 11318 16703 12850 16929 19005 23193
24949 23193 5628 -18372 -17280 -8782 404 11111 15172 8345 2097 -4213 -18278 -19753 -21456
24936 -21456 -16195 955 6125 17161 21454 14868 9781 11704 10380 19889 14433 6066 8872 -690
24922 -690 9118 12008 21433 13899 7638 -1711 -11861 -30127 -31117 -26323 -12420 -5672 -10458 -17151
24908 -17151 -12700 -18309 -21245 -18531 -13248 -7932 8630 2477 -6619 -2453 3102 -10605 -14732 -9936
24894 -9936 -15742 -31186 -14549 -8073 -5878 -15567 -27931 -23906 -18828 -958 16791 8407 1618
24881 1618 -17714 -8915 -3317 -2642 4236 12855 14086 4377 -2950 -6168 -1086 -5249 1613 4436 -2405
24866 -2405 -3865 920 -7153 -7111 -1181 1179 -552 -14988 -22945 -25930 -37678 -30994 -17440 -13627
24852 -13627 -7264 -20135 -27843 -16688 -8846 -7296 2058 9553 39 6140 13128 -2059 -28165
24839 -28165 -27547 -19185 -14413 -17220 -18463 -17588 -24687 -12546 -2902 -2854 -1595 -615 -4772 -601 -10605
24824 -10605 -11746 -4690 -13393 -69 17287 12779 4425 1307 -42 7952 -5214 -13569 -13865 -11415
24810 -11415 1710 7998 19034 22561 11533 3674 -3455 -100 7888 5538 7715 -909 -1326 1181
24796 1181 -1574 8207 23729 33889 40103 23452 4771 5695 14574 9460 -2263 -2552 -3451 5386
24782 5386 10363 2270 3168 -1168 681 -3853 -8138 -7221 8650 5330 -7241 -15042 -16030 -16693 -14210
24767 -14210 -8609 2911 7636 13803 6517 -13161 -3427 -4621 -8273 -8683 -9229 -7803 -10116 -7167
24753 -7167 -11220 -2871 -11020 -21703 -15152 2216 -1534 1543 -1966 -4478 -9157 -12488 2131 -6005
24739 -6005 -6753 1410 5772 2447 -375 -7365 -5912 -10242 -11909 -6193 -4197 587 -11129 -10037 -1356
24724 -1356 11079 14572 4968 -4579 -13684 -15168 -12466 -22550 -27238 -13646 -6632 -9868 -7445 -5042
24710 -5042 -4638 -16338 -23910 -522 22782 26788 14256 5795 10522 10940 17292 7115 -7691 -13379
24696 -13379 -23558 -25550 -23326 -30839 -23483 -17279 -4679 -1005 140 -9019 -18936 -7486 3109
24683 3109 -8142 -17085 -18387 -11735 -13178 -9328 185 8161 14330 24150 29078 27566 15438 7962
24669 7962 13457 13575 10875 -1539 -7724 -5153 -6368 -10268 -14300 -18452 -24117 -31336 -18290 -18865 -27431
24654 -27431 -24724 -12953 -2272 -8763 -26773 -26575 -10040 8989 3885 -6299 -9129 -9438 6231
24641 6231 10016 4584 -7150 -1032 13777 10957 5234 -9962 -27109 -17150 -14561 -7031 -181 -15190
24627 -15190 -14861 -6107 -1682 10223 1609 417 5604 9324 321 -8571 -11078 -2795 5577 -3963
24613 -3963 -6653 8893 27130 21086 5669 -6843 -20334 -17033 -16789 -17671 -14353 -4044 7761
24600 7761 5814 -5797 -9452 -7203 3565 25103 19303 7511 -8270 -3740 2028 -1328 1088
24587 1088 -12275 -15342 -231 -622 -1272 2718 2297 1376 -10145 -16394 -21640 -30751 -29676 -14140 -8281
24572 -8281 -5786 709 12442 23058 17100 -1631 -15070 -7352 -13310 -9741 -5587 -8239 -7514 2340
24558 2340 -4087 -280 2650 -8245 -13514 -1565 -11107 -32505 -40854 -37152 -23996 -16219 -20353 -17506
24544 -17506 -12772 -11489 -2236 10883 7192 20861 11083 -18279 -25540 -18745 -8146 1671 -638
24531 -638 -21837 -27762 -23269 -8205 -643 118 9275 4934 -12407 -26696 -21660 -13553 -11183 -8923
24517 -8923 2355 -238 -18337 -21866 -21409 -17166 -9911 -7284 -997 8566 18336 3304 -2523 6540
24503 6540 8391 -7356 -13655 -19677 -24157 -19350 -8821 4343 6843 -11573 -22635 -20537 -16525
24490 -16525 -4539 5181 127 4064 -7171 -14360 -8370 1070 13175 6214 -15002 -5019 -4271 -12518
24476 -12518 -18145 -15705 -9544 -11535 -25614 -26301 -17334 -4662 -11961 -18526 -12085 -8305 -17420 -14794
24462 -14794 3005 13851 10298 10261 1813 -14309 -26024 -18954 -10840 -22105 -22813 -13996 -2978 1225
24448 1225 -1073 -557 -4526 -13728 -22804 -5091 -7397 -17638 -23894 -10843 -5644 -2800 -8887 -16490
24434 -16490 -11085 -4301 7201 9444 5700 3970 7092 -341 -3178 1470 9907 1805 -16826 -17123
24420 -17123 1669 7266 1676 -3656 -9569 -9191 -4600 -3731 8322 13072 3383 1097 -6626 -4451
24406 -4451 -7800 -3870 -2577 -2752 -15036 -11071 -1093 4490 9087 2869 -8258 -9333 -14608 -19183
24392 -19183 -9774 -17178 -21837 -17670 -15069 -16262 -9574 480 532 3092 14213 4495 -8496 -11009
24378 -11009 -16665 -18918 -11143 -5853 1337 13296 26677 30813 17056 6972 7625 7405 -1474 -3450
24364 -3450 -5973 -12195 1708 -2294 -16254 -16369 -9853 -7161 -7853 -11161 -11365 -14320 -8819 -16406 -18334
24349 -18334 -19181 -12175 -3003 -14238 -22728 -17680 -8406 1853 -281 -10724 -13036 -11571 -6483 -16762
24335 -16762 -22083 -19914 -18789 -13321 -20342 -21117 -27129 -31785 -30447 -29665 -13545 -11500 -10186 3004
24321 3004 -2906 -4661 -6723 -4463 -5144 -10074 -15701 -18059 -15974 -5492 -5630 -6458 2331 248 -13538
24306 -13538 -17756 -11320 -19624 -21765 -20493 -17227 -19896 -27497 -34545 -21842 -14951 -6265 -1626 -10846
24292 -10846 -13797 -10572 -8108 -2982 4412 2065 2036 126 -6221 -19957 -21531 -18198 -30981 -28684
24278 -28684 -23497 -16566 -18501 -23454 -20043 -10289 -9981 -19907 -10559 323 -5960 -6311 -9085 -10241 -7086
24263 -7086 -15744 -24828 -23405 -13534 -10292 -2062 -9140 -5088 859 -4541 8757 -191 -12131 -20853
24249 -20853 -11620 -5750 -11291 -14920 -19256 -9816 -954 -9252 -15673 -12609 -17089 -20963 -13632 -1586
24235 -1586 9996 18097 9863 639 -5204 -4801 -7413 -19398 -23392 -20650 -26591 -34344 -35593 -20251
24221 -20251 -15814 -15532 -8181 -10135 -25118 -12535 2312 5269 -206 -5710 -11039 -15663 -6612 -4097
24207 -4097 -7009 -10304 -19492 -21149 -16391 -358 2741 7152 11110 8650 -7128 -17732 -18718 -14438
24193 -14438 -4928 -5815 -21427 -15391 -5968 1504 4573 -518 1359 590 -1350 -2598 -5800 -10518 -15163
24178 -15163 -10347 6824 17170 20549 15599 4328 553 -11536 -13283 -20592 -18839 -29922 -31276
24165 -31276 -14175 -18498 -32041 -50959 -41915 -32084 -28999 -32352 -32652 -29173 -30550 -35596 -42517 -14601
24151 -14601 1246 -16369 -22088 -13999 -6652 -1621 17459 17680 27385 21825 9842 1341 -10770
24138 -10770 -18643 -20757 -17570 -26133 -23907 -10972 7787 -7218 -9504 -2591 17672 8984 9672 11888
24124 11888 -4659 -20710 -24284 -19469 -3768 10182 20602 13609 10158 627 -5432 -9331 -7904
24111 -7904 -14512 -21179 -4297 4668 -2854 -1386 -12885 -18325 -10685 10682 14236 6474 -1579 -9403
24097 -9403 -6423 -12623 -16023 -11292 -13152 -29340 -32396 -17284 -11351 -13981 -21127 -23864 4245 8511
24083 8511 -3224 -25722 -40381 -31306 -24014 -25486 -32755 -21203 -18313 -7516 -15402 -16468 -8257
24070 -8257 1476 -9533 -14994 -16859 -7526 -2172 -18353 -32934 -27609 -14408 3899 -3875 -5630
24057 -5630 -12937 -15516 -24833 -25123 -11488 -14455 -22373 -28894 -20811 -3959 11925 10574 -7848 -18034
24043 -18034 -20667 -11704 -11771 -2833 1649 -2957 -4502 -15695 -29429 -22502 -18177 -16744 -10694 -3954
24029 -3954 1147 -1694 -2517 -3589 -626 5593 6688 -15553 -15287 -9277 -17657 -23330 -17395 -11104 -2863
24014 -2863 -5477 -13894 -7771 2616 3098 12449 7298 -4997 -10308 -8253 -8809 -14543 -36210 -47963
24000 -47963 -37461 -29557 -34674 -32918 -18346 -5668 -6149 -18094 -22451 -32033 -24210 -15782 -5092
23987 -5092 -4520 -14623 -6792 1435 -13362 -6359 4683 -1381 2534 -4346 -12302 -19601 -21666 -26942
23973 -26942 -18738 -12397 -13981 -13641 -13412 -7495 10031 -7481 -4549 12794 10516 -8679 -13472 -10642
23959 -10642 -8929 -19595 -8628 -10950 -25569 -23224 -12294 -12725 -16333 -1100 9067 -4399 4326
23946 4326 9387 5369 5084 -664 -11549 -13671 -8515 166 9161 11540 -2478 -25296 -35393 -22883
23932 -22883 -12407 -23667 -31471 -25797 -6931 -2801 -20878 -26381 -11992 -11557 -12725 -16235 -3857
23919 -3857 7941 4337 -175 2126 302 4223 5100 -749 1201 -3265 4823 12788 23908 18711
23905 18711 5488 -18997 -22569 -25594 -14357 -7758 -3593 -5971 -13053 -18694 -17773 -10437 -26098 -36995
23891 -36995 -28671 -18347 -12604 -16405 -21348 -35311 -31610 -20643 -12094 -14658 -28995 -34527 -26865
23878 -26865 -22164 -27774 -20261 -18922 -32678 -38008 -28808 -8062 -8701 -13749 -31271 -30656 -24158 -9934
23864 -9934 -3232 -10123 -9830 3509 -3846 -7421 -6110 -10245 -6713 -5929 -11982 -3490 -10051 -15051 -31647
23849 -31647 -27573 -11974 -3328 -3550 -13286 -15971 -13685 -10506 -1872 -2844 -605 8809 10487 18105 -1312
23834 -1312 -2236 6164 15619 15702 -659 -10617 -16437 -31859 -27624 -18752 -12904 1392 -7374 -7646 -548
23819 -548 2160 12357 8032 1414 -6908 -12841 -23437 -22743 -19458 -8304 861 2005 -5239 -5224 -6282
23804 -6282 -18245 -17150 -3204 2519 19201 17941 -3824 -2988 8927 13566 2144 -1177 -9546
23791 -9546 -3856 -4250 -7870 -12957 -2324 -3231 -5642 -6739 -10198 -6177 -7129 -1061 -7062 -11886 -1043
23776 -1043 1366 -3064 -7236 -15470 -12661 -23547 -23835 -25001 -14182 -15153 -17047 -25930 -33284 -27977 -23776
23761 -23776 -23147 -20562 -11165 -8626 -11236 -17340 -11248 -13423 -22874 -31764 -22153 -23357 -20245 -4907
23747 -4907 1626 2428 -6197 642 2430 -1388 -7117 -8404 -27416 -29060 -10332 7166 -5980 -12788
23733 -12788 3629 8970 -19411 -19575 -25827 -22023 -7150 -3780 -8534 -10889 -25233 -24111 -16304 -3816
23719 -3816 -8631 -16510 -10456 8271 9004 -17123 -4273 5529 32 107 -3525 -4274 2793 -1041 -12010
23704 -12010 -19804 -27205 -35595 -26090 1671 15552 11321 1473 378 -6335 -4050 -15601 -25813
23691 -25813 -22335 -23569 -18208 -21004 -7079 -1942 -1612 -17373 -21963 -14963 -20190 -24744 -25825 -19175
23677 -19175 -7976 -8642 -14823 -14416 -6541 -9065 -15502 -21766 -32668 -28737 -14380 -2899 6644 10494
23663 10494 7017 -11540 -6612 -7387 -18846 -16595 2942 7391 -30 -25325 -37594 -36192 -31329
23650 -31329 -33254 -21435 -10387 -4019 182 3391 3553 -5202 -9284 -1627 -7347 -15554 -7761 -6455
23636 -6455 -27626 -19065 -9491 -15397 -22934 -22504 -20584 -21367 -19406 -21265 -21677 -21587 -17219 -8113 -4078 -10586
23620 -10586 -4744 -7501 -12669 -9146 -4438 4618 17213 19408 24800 18022 5413 1118 -7577 -14660
23606 -14660 -4163 -8109 -13832 -15056 -24629 -22968 -27969 -25905 -16433 -11692 -13952 -10637 -16147 -19045
23592 -19045 -15084 -16704 -15425 -20792 -18365 -11240 -6302 -829 11346 19026 26954 26930 16631 15834 6908
23577 6908 575 -2251 -1164 -582 10939 24744 13369 10916 2882 5362 20327 21828 10368 -13569
23563 -13569 -13906 -6122 -7954 -15031 -9057 -7622 -6204 -10641 -20731 -11706 1492 1262 197 1081 3013
23548 3013 1069 -5881 -14756 -6084 4073 10088 -9880 -20946 -20215 -16310 -8163 -650 -3703 -6849
23534 -6849 -7211 -10806 -4524 1751 0 -14848 -31668 -27437 -12889 -19166 -18686 -13111 -11171 -12773
23520 -12773 -16912 -23834 -25208 -33186 -36240 -19970 -24682 -18000 -10254 -12708 -25406 -33961 -29147 -23235
23506 -23235 -19267 -5326 6030 2703 -8909 -12208 4207 3543 -9048 1892 383 -21189 -25553
23493 -25553 -20054 -20611 -18455 -12016 -24855 -16148 -14027 -10000 -5547 -15200 -23338 -25550 -25377 -22946 -17950
23478 -17950 -12647 -3674 -9723 -26833 -21514 -21156 -26329 -26791 -15754 -12539 -24514 -25288 -29069 -17994
23464 -17994 -10367 -5431 -30 4307 1038 -5441 -13230 -19018 -13247 2180 -6661 -7696 -9565 -16402
23450 -16402 -18118 -11698 -12431 -12197 -20519 -24804 -27294 -43367 -44154 -43676 -29070 -23313 -32139 -33425 -29340
23435 -29340 -26354 -25559 -31146 -32736 -18266 -4407 -13314 -22620 -23576 -8057 -5183 -15788 -32396 -23575
23421 -23575 5965 10751 99 -2054 2320 -3267 -20224 -22341 -10664 721 -131 -1599 -313
23408 -313 -1435 -11081 -18066 -20269 -23728 -16148 -7624 -1709 8774 25601 14357 -6518 -7346 -14672
23394 -14672 -13832 -15192 2091 7236 5902 4687 4917 7110 -2837 -15947 -12075 -19351 -29567 -8290
23380 -8290 -7867 -20799 -26079 -14084 -2967 -16801 -25524 -17676 -24266 -16601 -8574 -4054 786 -3053
23366 -3053 -6308 -279 -2688 -16557 -27294 -24859 -17802 -23346 -20631 -7004 -1879 -8538 -14308 -21302
23352 -21302 -20853 -30515 -22875 -25425 -19039 -13359 -8209 -22476 -18079 -31680 -33742 -32793 -31555 -15267
23338 -15267 -8317 4168 10216 -5367 -17808 -24407 -15522 4061 5196 -3890 -3192 -17847 -12491
23325 -12491 -11181 -2933 2485 6079 -6674 -15861 -11938 -7112 -6869 -11875 -11779 -18652 -30100 -24947 -16269
23310 -16269 -4717 241 -6953 -22248 -32389 -32994 -26485 -19615 -16783 -12230 -11361 -9790 -6977 10987
23296 10987 13024 13748 4559 -9677 -11362 -22264 -19010 -18285 -20609 -17436 -15098 -4418 7904 3647
23282 3647 1139 1321 -1033 -3771 -2174 9281 12184 6163 -6647 -9411 -12807 -15121 -15207 -15125 -13123
23267 -13123 -8668 -6065 -7495 -18834 -21957 -13907 -3962 -6685 -12046 -11677 -13542 -13054 -10829 -17692 -7072
23252 -7072 -12993 -14343 -4442 -6596 -6682 968 -8260 1994 4217 -8314 -27173 -30717 -29198 -21667
23238 -21667 -9658 -3021 -551 -6945 -14890 -13144 -12723 -8908 -14336 -34985 -33085 -29320 -24499 -16566
23224 -16566 -10362 -5956 2882 -2287 -21975 -23258 -8000 -7691 -8665 -16787 -7462 -530 -9462 -5825
23210 -5825 -9810 -10245 -6695 -12535 -26326 -11914 -8348 -12922 -15278 -17142 -8934 -7057 -10102 -18057
23196 -18057 -29240 -25770 -35521 -31209 -28091 -38876 -42999 -23310 1571 19664 18186 9397 1239
23183 1239 -15820 -12991 -10019 -6337 2265 7281 -3573 -7534 2096 10092 13126 8077 -9340 -21256
23169 -21256 -19762 -8202 -4915 -4470 -3561 4008 1075 1595 -429 -3821 -7896 -6481 -1225 9358 5476
23154 5476 11531 10662 -2109 -2067 -5810 -2394 5742 2943 -18763 -25410 -22903 -16513 -10388 -4787 134
23139 134 -1051 -5442 2600 12728 -5507 -22120 -18040 -18708 -22300 -17129 -10711 -4569 2969 6182
23125 6182 -182 7536 2632 -10593 -18757 -13480 -2790 5121 5073 -73 -5484 -8434 -6801 -3326 -938
23110 -938 -12356 -19213 -3127 1172 -1669 1289 3231 -3274 -7948 5416 -5088 -17110 -21536 -16172
23096 -16172 -2722 12982 18387 13337 14427 10854 9354 450 -13697 -691 12863 7296 4842
23083 4842 7212 11905 18051 6619 11302 15409 22959 20052 31058 60858 86618 77532 69882 83519
23069 83519 109752 137488 171470 210432 285340 380836 518526 749055 1096814 1450134 1707987
23058 1707987 1869516 1957350 1876244 1633010 1335887 1082008 843585 635243 467650 326194
23048 326194 238486 183318 149200 112966 77727 59130 48683 43300 42602 51058 44511 29106
23036 29106 28442 37276 36141 36951 28492 20764 9308 11894 9173 6608 2816 12664 12910 17223 17911
23021 17911 10462 10732 13247 12853 16267 7326 3965 -2972 -17743 -8593 -10510 -6017 -5118 -1386 -14117
23006 -14117 -15807 2787 21176 26351 17664 12212 15459 9374 -2182 -6736 673 7464 -3013
22993 -3013 10572 13356 21289 7752 -3044 3085 10841 14457 16896 25667 25560 14692 4437 1346
22979 1346 1901 12772 31539 12614 -479 1523 -6536 1014 6025 -3610 -4705 -24413 -21859 -6314
22965 -6314 10598 4205 -1302 5085 10675 -6025 -18227 -5251 9002 13826 21988 21416 3278
22952 3278 -1376 -9489 -8771 5882 17581 12911 9904 15530 14908 11419 14030 3684 500 748 -1687
22937 -1687 -11210 -9005 -10512 -10594 -9603 4716 5132 -1406 -6620 -2722 -1928 -13521 -19979 -1 6146
22922 6146 -7878 -23112 -20491 -21073 -23168 -27405 -19163 -8210 -15946 -18357 -21236 -24091 -28115 -5922
22908 -5922 17722 15303 2185 8023 27296 30788 17491 15975 17253 20137 35590 36391 36826 38252
22894 38252 43620 39695 15802 5717 14813 17475 21411 21186 14220 14581 9693 -1812 -19795 -26234
22880 -26234 -21981 -17286 -20532 -16340 -6135 6137 7011 6606 8200 8193 9799 6975 5896 9721 -2915
22865 -2915 -8769 -4676 4333 8599 6583 11947 1209 -22215 -23911 -15318 -25673 -15398 2870
22852 2870 7444 8241 6360 4414 11176 -551 -4959 -11549 -14246 -29998 -31176 -20527 -8532 -2011
22838 -2011 13896 26578 25260 18410 10911 9532 -772 -20605 -20986 -11713 -1779 -2368 -3744 -11095
22824 -11095 -13303 5601 8708 12783 10943 8977 23538 21236 13812 -2437 -11057 2463 7890
22811 7890 3364 7730 26393 26212 20489 25622 26119 25048 18542 3461 4086 11993 17540 2167 3237
22796 3237 13222 17587 12385 12668 23214 35395 28203 15186 11845 21546 32402 48381 34682
22783 34682 34617 41994 53852 58916 62603 61447 52533 57953 76562 108558 144574 169282 182900
22770 182900 191090 190731 191981 197754 184787 164868 168566 160430 147813 134880 107690 77667 46677
22757 46677 35074 25427 20310 20804 26493 20368 7206 7156 8941 15824 17495 1387 -13819 -10391
22743 -10391 -4443 1153 5483 7364 10332 12568 7093 4027 9283 20222 27669 25919 27636 24801
22729 24801 30908 31300 13941 -811 -5337 -2946 9326 9245 6936 19168 20159 9916 11915 23821
22715 23821 32819 32121 18219 3191 -8512 -3155 -314 3681 65337 144458 190268 239781 283776
22702 283776 300038 302356 266062 227232 206631 185917 171371 169824 180299 179944 178408 168613 159848
22689 159848 148939 156941 153355 133599 126629 121019 124599 123332 121651 116549 125037 120114 105851
22676 105851 99156 99350 111442 119215 127320 111644 78343 60828 51949 27460 21156 21626 26894
22663 26894 39323 49241 44749 46656 62388 65799 55374 66694 65159 53627 36026 29753 22065
22650 22065 23274 20839 13826 -8510 -38095 -94212 -148075 -178399 -175748 -162983 -129384 -72029
22638 -72029 -2065 66946 95915 105173 125383 165566 201019 214600 219099 218721 224751 223947 220281
22625 220281 219142 218892 219752 200884 192985 198956 206769 209205 221841 215959 226883 240640 250278 262544
22611 262544 286980 309576 317868 325996 320987 315229 311636 310872 333619 357639 358142 363823 384865
22598 384865 415896 458465 514383 600121 711210 905879 1246098 1659887 1995263 2190721
22588 2190721 2342282 2365500 2187239 1902577 1645408 1440387 1264684 1083764 945042 861146
22578 861146 809635 775242 753433 730926 708854 708175 742150 776499 795056 808867 819281 848864
22566 848864 859751 857636 856399 867458 877311 901369 948530 996868 1049307 1124072 1216923 1319761
22554 1319761 1413644 1520155 1636276 1724550 1801307 1893381 1987394 2094498 2217124 2369229
22544 2369229 2554000 2781080 3040708 3297787 3529503 3777043 4051810 4361394 4708570
22535 4708570 5123208 5641165 6297629 7072936 8014910 9192078 10595296 12226192 14241867
22526 14241867 16861696 20345270 24879795 30662664 38257631 48878624 64596635 89790164
22518 89790164 133308836 200318596 268759940 313295774 341920194 357959810 343051107
22511 343051107 297286871 242590341 195916233 156017553 117206920 83280602 58909390
22504 58909390 43196748 33035226 26178681 21368487 17740592 14928926 12825943 11228331
22496 11228331 9936891 8866699 7986404 7226142 6530298 5894756 5329143 4844528 4410273
22487 4410273 4041789 3729416 3476847 3273712 3095588 2945760 2803377 2647845 2502922
22478 2502922 2368245 2220337 2078843 1972003 1876910 1798158 1757351 1731598 1679980 1631615
22468 1631615 1603592 1569278 1505585 1426286 1366084 1320280 1266292 1213669 1167444 1128977 1082091
22457 1082091 1044272 1002891 969465 938997 900709 882400 880452 877417 863396 849543 836884 827541
22445 827541 832762 881750 985281 1182665 1506066 1916266 2231394 2428382 2557915 2544221
22435 2544221 2318319 1996851 1687522 1436305 1214636 1022624 860997 742453 663062 594252
22425 594252 561476 535380 504262 468974 442138 415486 390528 362030 352516 355341 340654 336836
22413 336836 340600 338700 349462 362338 358243 338253 321891 304142 290379 288329 276623 268780
22401 268780 263683 259374 247430 236489 243676 247001 258846 259287 271224 298786 338843 373506 410043
22388 410043 432517 447479 474842 510592 532023 539950 524881 483403 426744 374564 338066 313679
22376 313679 298731 271335 252915 236669 238297 240677 252407 240597 209303 211099 210850 215778 233147
22363 233147 246810 258254 244928 232805 225617 197856 170665 150440 143143 146727 159989 180883
22351 180883 201609 211681 213431 199520 176265 153586 130386 128450 114308 87813 71506 60898
22339 60898 46861 32096 20503 15918 29236 24334 2571 -4315 8412 -760 -20290 -59789
22327 -59789 -100443 -122191 -113695 -97747 -86896 -55177 -5183 47715 84161 109844 122187 130945
22315 130945 135196 155164 155239 143656 142740 149723 146235 136141 132727 119212 98729 90200 93043 92110
22301 92110 102901 110459 124023 144776 131103 112470 103690 91879 92514 105343 117447 120975 126035
22288 126035 121274 116111 102975 101832 102153 104992 126700 129832 142128 147564 133753 117655 117257
22275 117257 111653 105023 106146 104915 96407 95609 97644 85829 87299 91036 83586 74826 83886 84436
22261 84436 72639 62832 58746 65893 61237 77585 89051 85400 77258 70698 75811 77741 74385 76521
22247 76521 79993 83471 99769 103442 108671 106438 101299 102074 120585 143652 165390 221198 289671
22234 289671 341540 379040 413022 418218 395663 355312 303054 258376 217889 188716 180420 196811
22222 196811 222586 280594 363026 458329 556610 667532 716045 717478 679656 617977 532614
22211 532614 433550 361666 295739 220730 162341 124728 106636 106956 94310 80721 83625 102124
22199 102124 112573 111709 114489 113951 110044 93818 83781 91779 93945 88554 93801 96392 96478 81389
22185 81389 83753 83613 78384 67337 69400 69618 64470 52271 48764 39879 45762 47021 46720 40519 56433
22170 56433 60847 40757 19083 22809 30027 23726 13932 16712 26136 35950 54293 60017 52204 65465
22156 65465 69460 61743 45821 32602 35471 44120 43951 52100 65196 66050 55840 51334 52214 55582
22142 55582 47344 46008 37850 35966 38096 38601 39843 49554 43102 30152 33795 34627 25746 10395
22128 10395 8538 15481 15690 25463 28850 31050 49926 50716 40884 22786 2934 2232 11207 11441 14192
22113 14192 23675 31139 31220 25722 19481 15233 7267 5241 12622 21611 16216 19203 21919 20807 35242
22098 35242 20666 8641 17847 25244 11473 9117 26456 48874 42822 42824 36696 18050 7223
22085 7223 6314 6061 5222 12045 14839 10314 9561 16670 18100 26767 38379 35789 12211 -150 -4745
22070 -4745 -17285 -11768 -7399 2086 22328 17348 3119 2661 14015 14104 18549 35845 39994 34416
22056 34416 24807 23144 20558 25541 19846 18864 9869 2079 -2014 5675 10200 11286 17055 19885 7514
22041 7514 4273 6916 12606 21582 42321 42962 42988 23803 6503 5096 12283 18830 9271 12834 10238
22026 10238 14543 11080 19894 29418 24521 27995 35992 48987 45254 35034 36000 35663 35607 49472 59676
22011 59676 76895 91946 98676 94684 86011 53573 44856 32482 38442 46070 36689 36528 26748 14060
21997 14060 10067 9003 16325 19956 37680 54804 36728 34842 38891 33033 42874 47837 44491 36878
21983 36878 33054 30546 26150 14450 27245 47912 60522 60101 64098 81951 92857 111411 129101
21970 129101 159473 211348 255518 334628 441564 615966 927988 1323150 1654890 1861492
21960 1861492 1994745 1987404 1810756 1530927 1244169 995748 771803 565900 397203 288160
21950 288160 222697 180536 151071 130877 117166 102183 93572 86592 79693 62329 47763 47700 61721
21937 61721 81840 75413 65947 83701 117021 145780 163857 154306 137329 122118 101985 81791
21925 81791 74720 76904 72684 52750 45995 47124 39558 40885 36177 39847 34603 23880 14802 9411
21911 9411 8893 11955 8285 -2391 -1478 4837 22700 34344 23961 14891 13793 16103 29088 34378
21897 34378 27410 22316 15756 6307 13752 21306 19446 23387 28019 33702 57083 78786 92909 107248
21883 107248 139324 136997 107189 90109 89240 78694 68198 41805 36578 42180 38206 23114 12514
21870 12514 19396 29863 27908 22103 12869 22957 20235 16318 11839 3359 -14660 -3230 10545
21857 10545 16115 12982 16585 27521 27713 24913 25888 12954 7516 2628 2089 4180 11972 11293 2756
21842 2756 8672 1608 -7304 -5 -1352 -7567 -20906 -13920 -14673 -11548 -12772 -3529 2593 6375 10510
21827 10510 22529 21102 21337 19960 20460 16514 10850 10750 8173 979 -7904 -22499 -29272 -26679 -21674
21812 -21674 -10386 -13998 -23855 -13087 84 2598 -6616 -6567 8244 15096 14649 12270 16013 2541
21798 2541 -12461 -7199 410 8348 2651 731 10423 15159 31 -4152 -17058 -24768 -21947 -23685
21784 -23685 -17388 -22155 -24357 -30239 -32102 -31835 -31010 -27964 -19570 -13091 -13098 -18159 -17725 -12137 4636 5452
21768 5452 -3491 -1507 -5175 3989 10948 4182 -10277 -1842 21787 12226 -5202 -5138 2485 -18838
21754 -18838 -27128 -22070 -10499 -7959 1150 144 6485 14339 17852 24892 35969 23472 3592
21741 3592 -2683 -10110 -9021 -13422 -2388 -536 -1434 -7808 -5753 -1117 6741 16567 26262 31302 21398
21726 21398 14258 1540 5688 -943 3849 -2136 5488 8925 -7508 -13360 -397 5038 -8129
21713 -8129 -12417 -26880 -35255 -36513 -39239 -25771 -7937 -3822 6697 12504 17664 10671 -2821
21700 -2821 -3369 13188 23785 19619 17543 11353 6502 2903 4827 6315 3264 12906 1199 -2909
21686 -2909 -2311 -8344 -842 4864 320 -3691 -4413 607 253 -7613 851 5615 1763 -4331 5949
21671 5949 16229 11400 1588 159 2259 2181 -6883 -12282 -15852 -12943 -12082 -24467 -19209 -6253 -5493
21656 -5493 1440 -1185 -9000 -13405 -16503 -7340 -9329 -5706 -12247 -12859 -9936 -8503 -4488 -12580 -8995
21641 -8995 -3838 -13671 -3128 -1082 6441 5461 3625 12383 14711 -944 -10913 -9110 8494 9798
21627 9798 -675 -4044 -11395 -18263 -7738 18884 16954 6243 1950 11194 14654 3187 525
21614 525 -4199 -21579 -26799 -12320 -5090 2717 6004 1448 -1406 7771 6010 9088 19802 30741
21600 30741 23467 12439 -8193 -18099 -25851 -24348 -21632 -20118 -20624 -334 7415 9673 4932 -9162
21586 -9162 -11060 326 1557 1141 4165 -3407 -5735 -17625 -24929 -18823 -6047 -3583 -702 -1549
21572 -1549 -19553 -19284 -3979 14203 11768 9506 4500 -6784 -3402 1114 12402 7713 -2184 -2147
21558 -2147 -6952 -15842 -14222 -5508 -11579 -13978 -19334 -18672 -2242 219 -6889 -7100 -10007 -4868 4718
21543 4718 3683 -12497 -24955 -29700 -13361 615 9762 13877 18285 25168 37673 32674 3456
21530 3456 -29153 -26079 -12411 -12334 -20798 -28672 -13216 -8650 -24292 -28238 -28755 -27225 -14432 -6617
21516 -6617 19344 22840 21516 3427 -4994 -7428 -3643 -7290 -9552 -13801 -7760 -1651 -7366 -7978
21502 -7978 -5420 -875 795 -1875 -6202 -10098 -9124 -5541 -1006 -8513 -19721 -23097 -22706 -27785 -26867
21487 -26867 -20539 -12323 -5560 -2412 4823 -1596 -16208 -20365 -7960 -7960 -11321 -18687 -19289 -19174 -1757
21472 -1757 17984 9192 -8090 -22176 -27363 -12548 -7757 -10456 -11201 -9895 4365 6673 13622 19361
21458 19361 7260 -3948 -3912 9645 14600 648 -19516 -20946 -20746 -23841 -13919 -14656 -7034 11347
21444 11347 5144 -8475 -7029 -9366 614 -3660 -7489 -9610 -11401 -13437 -21945 -20771 -10732 4439
21430 4439 13629 11078 3703 -1269 -18804 -16989 -8847 6618 6814 -10639 -10672 -5868 -7526 1974 1913
21415 1913 3574 3551 4867 5928 -3822 7590 -1976 -28486 -28544 3402 15919 -5193 -4416 12195
21401 12195 9693 -7169 -3344 447 9263 14830 6913 -3892 -7007 4223 8754 13555 92
21388 92 4340 17463 14495 7717 -300 -1936 -10384 -8123 -4436 -10039 -9130 -4582 -6296 6981 11062
21373 11062 -2787 -8757 -14860 -8303 3048 -1677 -9780 -14695 -4481 -6019 -11076 -10687 -2968 6396
21359 6396 8866 3911 -725 -8644 -9775 -11264 -3768 13856 16434 7208 7647 14738 8702 9247 7759
21344 7759 24422 25807 17014 679 -816 -1522 -8417 -28380 -34592 -31582 -10645 -3058 -10438 -8584
21330 -8584 -18966 -23499 -12168 -9472 -12698 -1052 3903 1273 -1762 5638 15101 1830 -9212
21317 -9212 -16846 -18471 -10022 -19907 -34239 -26771 -14029 -11737 -14019 -7419 -12483 -11423 724 7143
21303 7143 6075 -2467 -14262 -18433 -23046 -23631 -22198 -17463 -10665 -8611 -1281 -10940 -14986 -5321 -2787
21288 -2787 -9818 -16492 -25793 -17449 -2329 5082 -3730 -16256 -22830 -16948 -4158 8395 10496 5301
21274 5301 10508 -5292 -15260 -23471 -28970 -28734 -21684 -28586 -32978 -29165 -19922 -19772 -9926 -3866 -6238
21259 -6238 -6407 3694 11400 7749 2228 -1286 -5162 -8857 -2185 3535 15702 13881 -2207 -6122
21245 -6122 -7168 -17719 -6685 -1988 1577 101 -3781 -17540 -27207 -31375 -16330 -2570 843
21232 843 -10463 -15163 -8338 -9795 -8555 -3330 -12480 -24519 -31473 -28043 -28101 -27547 -25616 -37645 -22816
21217 -22816 4296 14249 -2719 -14521 -14793 -11604 -1105 -8841 -7292 -20598 -29869 -22953 -4678
21204 -4678 -8791 -14406 -14698 -13220 -17403 -31902 -23220 8742 5272 -14364 -12660 -19659 -20472 -9331
21190 -9331 -3979 -1587 -5184 -22776 -39714 -29063 -26932 -19272 -20057 -25852 -19981 -13330 -21597 -22893
21176 -22893 -14230 -5270 -15701 -7974 -13085 -10449 -12360 -27095 -23302 -22844 -33639 -39029 -32006 -14765
21162 -14765 -18318 -18714 -18668 -18048 -8206 3896 7046 -4672 -753 1731 -747 -6647 -7868 -8721 -20354
21147 -20354 -13485 -4008 -7432 10728 28494 16598 7102 2530 3475 331 -2904 -4395 -437 10921
21133 10921 15277 17343 2988 -7780 -1109 -9337 -26231 -24708 -7649 3080 961 -6167 -357
21120 -357 -4522 831 -5492 -12571 -9414 -11133 -15750 -16637 -13349 -20283 -21210 -19544 -16348 -29858 -10788
21105 -10788 -21718 -23550 -12692 -13190 -10766 -20638 -27131 -16741 -30541 -30179 -18489 -9590 1121
21092 1121 6943 3174 -15615 -18529 -11580 -16782 -30901 -32859 -22216 -22364 -28610 -25166 -25253 -26538 -19618
21077 -19618 -23825 -23229 -15880 5668 1185 -20472 -18704 -14774 -13593 -11982 -6452 -7003 -17863 -20633
21063 -20633 -12411 -5944 -11448 -14440 -19663 -24420 -20743 -4902 -479 7192 9492 10645 -8510 -23387
21049 -23387 -20754 -13408 -11178 -21981 -18287 -5350 -3792 -2060 24455 24814 4745 -10030 -4511
21036 -4511 2712 -282 -8301 -7146 -10288 -7050 3387 -4087 -13542 -29155 -21499 -11257 -13041 -18825
21022 -18825 -17181 -16000 -16850 -18323 -2714 9686 4930 -486 -13200 -21218 -25129 -26629 -19108 -10844
21008 -10844 -18297 -13943 2743 -428 -5117 -6226 -10321 -1869 -520 -15594 -20957 -14675 -4443 -4597
20994 -4597 -6891 -642 -3060 -8354 -9579 -6578 -11389 -24657 -17591 -23748 -23576 -13528 -9936 -12853
20980 -12853 -12089 -20105 -27684 -14138 7382 5741 2652 -17186 -15420 -14577 -16372 -1069 7720 -8981
20966 -8981 -27775 -20113 -7201 -2321 6444 -2885 -22286 -21459 -24736 -29063 -21557 -25324 -24252 -18113
20952 -18113 -21449 -20755 -19773 -8414 -14538 -7443 -195 3160 -252 -6000 -16768 -15743 -14485 -11763
20938 -11763 -4822 -738 16308 4534 -12561 -12179 -19015 -16027 -18471 -19727 -20911 -10704 -8325 -10709
20924 -10709 1650 7935 -3515 -13744 -1005 -7873 -6841 -16594 -23080 -20042 -7248 -3379 8675
20911 8675 11475 6357 11839 6842 3124 3176 -11455 -18303 -18114 -17368 -14949 -6277 14959 499 -18009
20896 -18009 -39941 -35002 -7540 7523 3769 2998 215 -7893 912 -535 -787 -6993 -21871 -24472
20882 -24472 -23000 -18440 -21914 -16652 -9950 -16119 -16426 -7476 333 1919 -14926 -12860 -20253 -23117
20868 -23117 -26545 -28315 -19629 -12485 774 3614 -9978 -17697 -13675 -18631 -36114 -37605 -44523 -42595
20854 -42595 -46650 -47636 -35301 -18865 -17783 -18270 -19182 -27950 -22694 -26714 -32125 -23353 -17214 -9655 1862
20839 1862 2308 -4758 1466 6933 3590 -8001 -7867 -9440 -22094 -24472 -29641 -17168 -8502 -9355 4053
20824 4053 7908 -12640 -22894 -9816 3527 18864 131 -9135 -8131 -7516 -7485 -4129 -5743 -2411
20810 -2411 4035 1750 -1169 20130 14776 -19511 -35862 -31648 -41810 -40249 -25175 -13367 -425
20797 -425 8530 8503 12253 2724 -20821 -28653 -19360 -18526 -27381 -34803 -31336 -21359 -22659 -21461 -15417
20782 -15417 -9651 -7092 -6078 -9739 -3848 -2617 -18567 -19903 -18920 4570 -1533 -37791 -43760 -28931
20768 -28931 -21527 -12807 -3951 -650 -12150 -18802 -21330 -17279 -49 -10129 -17430 -26745 -27232 -19563
20754 -19563 -19045 -16676 -25045 -21905 -13747 -12869 -6581 -7126 -8142 -14027 -35507 -41031 -32020 -14629 -14570
20739 -14570 -20337 -17944 -23634 -12573 8214 10439 2344 3819 1201 -7762 -19830 -14295 -12831 -5108
20725 -5108 -512 -5139 -13088 -10708 -7349 -1700 -463 -11101 -23712 -23730 -16121 -5233 -10270 -6504
20711 -6504 -13006 -3083 5211 -3459 -5076 -9551 -13618 -15137 -15417 -26676 -27047 -10371 3096 -5701
20697 -5701 -8110 -3757 -21006 -30782 -14961 -2320 -5511 -20645 -27192 -23843 -22215 -20366 -19897 -15234
20683 -15234 -24234 -29704 -22887 -17298 -22891 -27685 -24170 -20966 -13216 -6917 -7249 -3452 -10048 -2079 7458
20668 7458 9047 -3694 -13122 -4273 -7757 -20058 -32372 -36893 -32155 -34127 -23292 -25447 -16978 -11127
20654 -11127 -12857 -11186 -17221 -3928 -10264 -18440 -23009 -20686 -17309 -10804 -7742 -24029 -27872 -10262
20640 -10262 -5765 -11782 -8338 -2584 -375 4674 9217 6340 -2482 -390 -7470 -20428 -12073 -3754
20626 -3754 -8886 -20745 -8947 397 -9766 -10833 -4046 -1252 8759 6653 -5227 -4838 -13062 -13987
20612 -13987 -3184 -7504 -4578 4280 9373 -893 -13590 -18257 -21275 -19491 -14352 -9850 -13896 -13732
20598 -13732 -10455 -2706 -11159 -20407 -11887 -16501 -22059 -11383 -14973 -9537 -9687 -6279 5988 -5720
20584 -5720 -8674 2856 -49 -12789 -27125 -21638 -17955 -6086 15033 19493 20339 14086 -5102
20571 -5102 -10699 -15552 -11750 -1768 -1461 -7746 491 3020 878 -3296 -9519 -12762 -663 2909 -4718
20556 -4718 -12645 -18778 -15437 -15526 -4607 5248 10558 1567 -9034 -4386 6672 6007 3826 4954 9304
20541 9304 3817 2723 -5348 3934 10297 6874 1236 -7981 -19530 -8986 -43 942 -10723 1146
20527 1146 12352 2737 -2076 -6749 2849 9711 3877 -243 -6644 -17160 -16417 -21486 -25983 -20588
20513 -20588 -27561 -27092 -18315 -10343 -3554 -10248 -23327 -24722 -17492 -4660 -2754 -10094 -10774 -11404 -8974
20498 -8974 6091 -408 -10151 2725 15174 9542 7405 1716 -18972 -32072 -23688 -8813 -16820
20485 -16820 -11380 -3064 -3425 -9915 -19910 -23970 -33783 -42109 -43454 -34914 -13642 -3251 -6767 -7918
20471 -7918 -6199 7484 10051 8814 7080 3681 1747 4693 13869 12441 9493 5996 14005 8735
20457 8735 -4399 -4449 -2562 4506 -6054 -8856 -4220 -7185 -9959 1001 -3726 402 6814 2857
20443 2857 784 2484 -4608 -8437 -2279 14446 22664 9073 -6170 -19851 -11767 -6570 -4095 7105
20429 7105 20748 17027 5991 -4077 -8747 -12130 -13758 -9646 -7347 -8728 -15112 -33094 -28932 -20786
20415 -20786 -14287 -5127 4072 4945 1237 -9668 -1900 -524 10515 -4062 -2634 -348 417 -1346
20401 -1346 -15930 -26096 -24090 -12161 -5868 -6842 1063 12792 8317 8302 9855 10961 11747 12999 19
20386 19 -15610 -4967 2356 7741 3178 2876 5912 23533 29123 34907 32887 44716 44365 42364 43676
20371 43676 38644 48452 40682 38729 24552 14467 7481 3818 9562 17934 7500 -10382 -13837
20358 -13837 -2481 -8940 -6952 -12721 -1392 10719 2352 -15132 -21755 -7706 1397 -2261 -3964
20345 -3964 -2825 -7358 -13281 -25588 -23885 -19388 -4069 2828 12737 14437 7573 -1365 -6767 -15041
20331 -15041 -10818 -3764 1155 9126 -4921 2237 -9636 -14928 -2474 7444 7482 524 -6061 -262
20317 -262 -7307 -21044 -21833 -3502 11878 6631 9264 10933 -359 913 12222 3260 1428 -4539
20303 -4539 -3616 -11408 -19239 -11685 -12611 -13915 -7406 -9668 -10409 -9831 -7872 -4781 643 10380 5913 -216
20287 -216 4395 6377 -2902 -4521 -5744 -13326 -9309 -6552 -9562 -11137 -1328 6679 25894 29556 10325
20272 10325 268 -479 4432 3819 -1497 -4041 -1189 -10581 -22320 -8100 -8537 -22642 -34772 -15807
20258 -15807 7365 5700 -940 -7163 -3437 -331 8207 -4344 -11206 -8988 -6888 -18903 -26245 -19170
20244 -19170 -8515 2507 -1270 -20437 -3149 17347 31220 22592 22352 35483 39582 44514 35425
20231 35425 18632 4220 -14127 -10270 -1653 5128 -5218 -12073 -14265 3702 1687 -10414 -9373
20218 -9373 -5826 -800 13936 8598 8740 11701 6025 -10980 -17286 -14151 -10911 -19496 -14677 -4135
20204 -4135 -5501 -15013 -14765 -14919 -11030 -19709 -12537 5166 6829 8929 9955 3610 -10600 -4436 1994
20189 1994 -4364 -28259 -22526 -15194 -14921 -12658 -14436 -4553 3668 283 -11684 -13129 -7058 1568
20175 1568 -1452 -3044 -2882 6357 -4129 -6924 -11424 -11649 -15258 -8642 8376 24311 17368 -1213
20161 -1213 -8617 5048 14889 -2598 -18418 -14516 -19027 -10083 -4537 -7182 -2954 3478 13968 15662
20147 15662 10156 7422 16518 12936 11497 16340 14577 10974 5846 -1848 232 -6140 -16477 -4883
20133 -4883 -4892 -6278 -7774 5706 1213 6866 6176 4930 3061 426 8925 7255 13424 7526 -4265
20118 -4265 -10326 1714 9613 12684 3362 7162 11616 19684 22685 21344 22825 18365 14525 -4866
20104 -4866 -9435 -1988 10317 1621 8211 13324 15654 14215 22913 23068 31040 23487 7815 -6156
20090 -6156 -9308 -7777 -9244 -13469 -10019 -19390 -13826 1648 5565 5309 -5711 -20028 -21918 -11486
20076 -11486 -9153 -13218 -8838 -9868 -24333 -29458 -19776 -26220 -22946 -9146 -2180 -11656 -2981 3828
20062 3828 -2659 -3123 -9543 -4005 -8707 -13921 -17247 -15626 3316 7702 -4578 -850 -5158 9309
20048 9309 14709 5924 -4558 2842 7415 5749 15810 8854 -2481 -10148 -2101 12358 11999 3867
20034 3867 2180 14903 18368 14272 23205 26301 35148 22515 21377 39033 39506 23232 24133 29016
20020 29016 37006 30131 27759 24785 13577 21860 26637 16777 19169 37163 57138 56992 51956 66690
20006 66690 55823 45269 41419 46954 62665 84459 98384 107019 111328 128685 159409 177881
19994 177881 232551 336231 467716 597361 700794 770063 846999 915338 928392 900211 830584
19983 830584 785181 786357 844573 898115 919452 921420 933139 943126 902984 798455 669203 550986
19971 550986 463090 384538 297698 222489 168745 132200 103279 85007 88305 98227 90614 81063
19959 81063 82260 79980 59270 49710 40179 47047 43985 28793 28034 32342 41116 48587 36393 33949
19945 33949 32691 23075 23723 20410 18858 19349 15354 15612 21334 28757 22887 18284 31086 25547 3083
19930 3083 -4770 6579 6094 5757 30104 34120 40755 50906 47259 28737 28373 33697 25888 23422
19916 23422 17938 14174 24559 31225 15816 15460 25242 28711 18265 18672 17902 19597 23167 21416
19902 21416 16835 16044 24750 35370 41559 50224 58240 53157 42249 44938 47441 44428 42736 40021
19888 40021 32288 25996 22178 18854 16042 12827 12331 20206 11148 4355 2708 -10477 -16370 -11188
19874 -11188 1683 9879 3561 6926 663 9692 20890 19542 13386 3876 2678 12512 16640 24197
19860 24197 18170 7893 15057 20773 22673 25465 27484 26746 26090 35438 35846 36997 15423 -5596
19846 -5596 -1253 3602 3627 4909 10770 22139 31398 39660 48405 44762 13865 6143 8644 10828 2346
19831 2346 32 16703 21389 26214 33361 26162 35666 36456 34061 23496 15845 12884 3467 -9928
19817 -9928 -3549 11522 16171 2692 12510 24003 19819 10690 18381 30397 19132 21508 35214
19804 35214 35245 31212 35633 36698 36634 45705 47472 51070 59522 42539 41543 44230 40486 37778 35751
19789 35751 23200 14196 7494 1909 5100 15420 20242 18421 16883 26446 30810 21297 31695 24377
19775 24377 15180 18589 18382 22022 31768 36269 37795 28537 38274 43172 49763 34001 15152 24134
19761 24134 31624 51229 60262 54666 42961 49792 65040 68260 55759 51269 52698 55419 51773
19748 51773 41443 38407 48013 46467 36771 50462 54262 46922 40794 46854 64702 80647 99121
19735 99121 103511 114320 126545 137780 143614 154309 142550 132213 134722 141754 154971 166982
19723 166982 184511 180630 175703 170269 154212 144906 135157 115454 104774 96485 89710 80707 77232
19710 77232 78657 70292 63315 58656 45774 46011 51476 53071 52691 42700 30353 41694 41782 38549 46241
19695 46241 54870 45748 44953 59877 57465 55469 52619 46330 43554 57686 72001 62813 61210 60142
19681 60142 57680 64796 67935 59669 53264 47824 43518 54112 41956 37793 51586 67252 80135
19668 80135 97402 115343 135155 152540 159518 158753 162024 158581 146076 152616 178670 209150 219213
19655 219213 229977 245085 258730 259257 248984 229142 199390 166553 172891 180096 178686 179822 171368
19642 171368 170770 165031 156501 159006 157731 153348 150855 155718 169840 163668 145064 122317 122344 122455
19628 122455 113826 116124 122263 121019 131140 130152 123333 115097 107364 99402 88251 76647 84276 85169
19614 85169 90254 88198 82453 73891 69388 58508 43843 22801 24238 24575 25191 35534 38298 34729
19600 34729 61267 83967 80649 81429 85041 96598 117899 135577 139686 172031 214396 273635 337797
19587 337797 421550 511079 575582 631464 679904 676505 645626 604321 587487 578709 588709 647716
19575 647716 747907 834311 880416 870345 808232 728794 657300 599979 542328 476709 421774
19564 421774 391537 381923 386447 378883 383973 395756 396346 393248 393308 390559 396600 392082 406369 414898
19550 414898 424942 440577 458360 481851 500499 518176 548932 582161 607165 620750 635455
19539 635455 661612 674924 710359 767208 825791 892963 992975 1086392 1169016 1214920 1234466
19528 1234466 1216871 1202833 1196474 1182073 1206251 1284812 1416688 1592380 1725574 1806692 1835479
19517 1835479 1828376 1807914 1786384 1768119 1766366 1770295 1812198 1889429 2019139 2184802 2424224
19506 2424224 2714123 3011770 3295053 3605175 3948251 4326448 4706083 5037091 5368592
19497 5368592 5799391 6372290 7026713 7674760 8292597 8956792 9757242 10717153 11819993
19488 11819993 13096516 14691507 16845654 19823861 23932592 29821745 38836529 53470970
19480 53470970 75873021 101725784 123668107 138504975 149832634 161452122 168695444
19473 168695444 165895377 153357800 141166915 138571750 146783193 157532556 163889105
19466 163889105 165486453 167964296 172058154 170415591 156813948 133209824 108996754
19459 108996754 88876991 71771877 55900559 41993268 31623340 24768615 20324658
19452 20324658 17223515 14878847 13068519 11732528 10791393 10086216 9454739 8827934 8272819
19443 8272819 7789488 7302922 6749635 6135470 5558452 5058957 4600628 4171310 3754520
19434 3754520 3375300 3055893 2802024 2561587 2354851 2197552 2062636 1930128 1803652
19425 1803652 1697228 1627854 1571472 1514808 1448505 1388146 1325419 1273725 1222858 1176376 1125343
19414 1125343 1081318 1042201 995233 954650 909752 866364 844286 825405 794395 777792 769506
19403 769506 755788 728553 710561 683837 640669 625394 617734 607049 603316 602769 596646 591424 571982
19390 571982 562195 550131 526549 515435 510251 494201 469637 462667 443067 430122 422146 423240
19378 423240 426913 424913 421956 407205 383406 367079 352373 364810 379448 358979 343499 347002
19366 347002 342433 339322 345037 340525 343844 343420 336260 338056 333355 324952 310730 308083 312390 325161
19352 325161 341639 345011 341296 354621 385411 404136 400261 406289 415149 422496 422216 416997 397938
19339 397938 385665 392568 402256 408581 402464 394216 393216 383812 374960 363817 354598 347352 336055
19326 336055 326525 323045 331962 333812 331721 323349 308124 289562 274591 263197 270837 277134 274292
19313 274292 283558 288612 267776 249041 221816 193425 174124 159306 143970 132719 137264 144862
19301 144862 126105 112394 112389 99380 98706 105401 101228 86812 89392 93944 77111 66908 66731 48066
19287 48066 21639 7186 6915 19272 42023 69133 89958 98001 98671 105144 119458 123852 132421
19274 132421 133396 132321 154666 189222 196557 203778 226780 254211 262603 278948 279620 274310 259057
19261 259057 270136 271667 278127 276043 247801 227202 211743 227166 248650 255441 259354 258919 249389
19248 249389 239293 224068 219916 220272 226511 229564 211259 213502 206575 205315 202573 204277 208484 203845
19234 203845 210808 207284 202375 211930 221306 214595 199418 185399 177658 164499 177090 189876 181495
19221 181495 177073 167111 157883 169552 174883 164258 166203 162030 155596 163841 173902 205434 219941
19208 219941 242307 254187 243395 225945 206104 181534 168567 171032 203426 236197 267549 317790
19196 317790 360032 369431 388863 423871 442190 464191 507045 555089 594068 640581 676852 678116
19184 678116 660849 646909 622802 585306 557741 534176 495849 458274 420715 389730 355605
19173 355605 333046 305691 301767 285726 288346 312251 332573 332965 324971 301733 302126 298841 296803
19160 296803 310254 328515 349226 352598 344128 334048 340309 345978 346534 356658 364510 348452 346632
19147 346632 346558 356016 378121 409312 464309 541823 598368 662602 740536 813330 892550 990123
19135 990123 1098682 1212770 1312778 1376414 1412389 1433086 1416029 1367027 1316691 1278099 1196623
19124 1196623 1093647 990965 922527 871625 825488 803746 796468 817360 832466 855298 898607
19113 898607 962538 1051956 1181018 1296373 1393299 1458811 1490062 1494395 1498748 1533385 1571061
19102 1571061 1647216 1755724 1912122 2130551 2366905 2560704 2696398 2771353 2823533 2895215
19092 2895215 3026963 3216854 3499585 3853441 4271782 4753584 5250041 5795902 6446697
19083 6446697 7275490 8393240 9953457 12191936 15504862 20581273 28839800 42356018
19075 42356018 59709447 74725527 84578364 87908176 83656087 75158921 66465122 59742392
19067 59742392 55363063 54815174 61040657 71665323 80573246 85285967 83852762 75857907
19059 75857907 64883133 54015222 44249817 34937084 26365658 19757864 15325513 12438703
19051 12438703 10476449 9099997 8110967 7368958 6825960 6485742 6300572 6223040 6214182
19042 6214182 6239609 6261159 6263357 6251874 6246150 6278967 6379930 6612485 6966088 7402166 7914985
19031 7914985 8536836 9320152 10341926 11722401 13640361 16342650 20325805 26414010
19023 26414010 36276822 52551429 74387567 94225925 107589125 113030879 108710456
19016 108710456 98187141 86821518 77718892 71612946 70105968 77032728 90605175
19009 90605175 102788572 109675247 108989965 99454586 85320615 70839903 57685583 45240487
19001 45240487 33635736 24475157 18282301 14327862 11732599 9959725 8688260 7757660
18993 7757660 7058930 6489627 5959473 5485105 5118836 4885208 4724379 4558596 4324624
18984 4324624 4056380 3753152 3433391 3142444 2897394 2695249 2531776 2426483 2378942 2370544
18974 2370544 2354225 2304274 2217582 2100806 1956918 1805625 1686013 1583812 1492827 1441254
18964 1441254 1425770 1464973 1562027 1705915 1861077 1993101 2074148 2085691 2092186 2095023 2048723
18953 2048723 1914128 1767070 1674637 1660534 1664236 1632827 1572215 1519238 1513071 1508687 1470370
18942 1470370 1386619 1328397 1294396 1269958 1271842 1310757 1371720 1372235 1284327 1168351 1075498 994524
18930 994524 938429 883800 826496 780815 746929 734394 718852 714693 704524 696948 707800 729265
18918 729265 742627 735687 725778 726881 730242 733276 728876 725518 721191 720206 722080 722323 706746 689570
18904 689570 667706 655906 658568 651869 653506 653995 649632 644759 638322 640185 645084 638434 648482 674352
18890 674352 714590 745703 740097 735960 745581 746389 757313 767758 797676 829967 847998 868429
18878 868429 894055 909012 933142 951206 964211 995502 1017086 1043581 1089301 1129203 1161425
18867 1161425 1194546 1231429 1270640 1318396 1404741 1531169 1712687 1952122 2203100 2437298
18857 2437298 2578956 2622491 2597932 2536518 2480025 2443551 2429576 2454223 2547571 2719767 2996965
18846 2996965 3398381 3866237 4382271 4915501 5408912 5807382 6095862 6301474 6380550 6416824
18836 6416824 6491221 6683416 7021857 7532525 8240204 9177450 10438428 12112170 14302680
18827 14302680 17130437 20773400 25756853 32905664 44040121 62611008 92321605 126355041
18819 126355041 159060932 180577731 184880796 176476202 156455849 134024615 112467853
18812 112467853 93279535 77636174 67186252 64985812 73387826 95323891 126454909
18805 126454909 157555258 182317973 188988519 182544474 162701373 137807920 113066463
18798 113066463 89602794 68533049 50183047 36413564 27245823 21321847 17274875
18791 17274875 14351959 12183714 10591595 9428925 8613683 8100873 7789205 7574472 7407106
18782 7407106 7152819 6865810 6536625 6240841 5970387 5687171 5352818 4942951 4519774
18773 4519774 4122593 3746572 3406491 3118402 2866716 2659732 2525020 2460229 2464596 2537349
18763 2537349 2636970 2710589 2703056 2620439 2470413 2301267 2126345 1959490 1799378 1658782
18753 1658782 1532209 1406503 1304791 1217805 1159377 1117990 1108124 1096329 1072157 1055154 1056590
18742 1056590 1054597 1030625 995190 958433 933479 913206 895417 872457 844449 839751 846061 839553
18730 839553 844695 853803 867336 876562 885985 879038 875344 877602 888765 899898 898302 917556 941493
18717 941493 964155 973394 965088 965985 966639 965677 975212 961363 958133 954270 957948 969494 997123 1021903
18703 1021903 1045851 1073771 1097804 1127647 1169701 1219739 1273863 1339068 1404131 1487803 1575140
18692 1575140 1664061 1749157 1828147 1905592 2024149 2145289 2275123 2436649 2629222 2813110
18682 2813110 3037573 3311347 3618635 3933439 4285137 4661640 5070343 5538992 6081697
18673 6081697 6723450 7441274 8272133 9306971 10614120 12281312 14573485 17790951 22520542
18664 22520542 29994178 41764531 55358127 66124595 78367790 94454769 108980502
18657 108980502 118572506 126856882 133006870 134921913 134818974 130999830 121464198 109648398
18649 109648398 99707547 87661949 72256060 56924114 45193036 36592175 28919777
18642 28919777 22357510 17591943 14415267 12231848 10648261 9491577 8613124 7928788
18634 7928788 7436158 7084427 6818020 6638733 6514471 6370733 6193755 6015021 5861336
18625 5861336 5743702 5682285 5698396 5775135 5914877 6114566 6428881 6874802 7421198 8120995
18615 8120995 9050374 10278237 11965410 14330395 17782659 23186652 31831545 42467008
18607 42467008 50868518 59755246 71812597 83399630 91108150 97509610 102519258 104247180
18599 104247180 104342153 101914391 94998160 85619728 77704518 68703928 56854510 44602933
18591 44602933 34941635 27983356 21936188 16734964 12973574 10482603 8764155 7539255
18583 7539255 6652001 5954080 5372491 4888302 4483747 4116211 3782777 3485718 3216230
18574 3216230 2963337 2736899 2544354 2355334 2181187 2043270 1915879 1816951 1731874 1649619
18564 1649619 1576079 1505243 1434533 1389103 1354632 1308871 1276218 1260403 1235377 1202594 1190136
18553 1190136 1191269 1197389 1249803 1341445 1464622 1566854 1635900 1642615 1573902 1502488 1443951
18542 1443951 1398169 1375134 1372625 1419980 1468474 1491721 1482482 1416499 1316622 1210242 1137601
18531 1137601 1068318 1004964 966970 954753 934904 918888 879925 850454 806943 771826 729049
18520 729049 697465 661175 634424 612353 583346 548107 532563 512295 498361 475299 453666
18509 453666 451412 460765 466803 464276 466710 476044 480871 474215 471908 449094 442494 461874 486940
18496 486940 536069 582844 621537 647544 651551 634033 612980 604830 591302 582869 575887 607190
18484 607190 638717 666755 685471 654022 615366 583744 543569 504236 464936 431344 412177
18473 412177 401691 362908 343243 331899 322624 315007 301458 304718 293773 284661 289197 294737 294672
18460 294672 291538 283475 287611 300849 309707 331559 356329 359547 362910 369455 386020 412677 418143
18447 418143 420877 413809 403443 400217 395571 378951 361338 352489 335629 326127 322613 307943 291706
18434 291706 255954 235907 232834 249572 257389 244270 236945 222924 223862 222472 223786 222012 218055
18421 218055 210176 200795 189967 186733 209825 221442 227467 250491 285772 329207 344709 341497
18409 341497 335362 330269 346626 345809 333632 332054 333453 336648 335643 350290 348714 354211 358924 372699
18395 372699 380477 400497 418718 409586 399866 391932 400873 369266 329868 310971 294240 259059
18383 259059 237048 215644 202629 186677 178336 172643 164024 160724 171913 184046 181783 190731 197484
18370 197484 204076 211249 202423 203240 202908 209849 223485 254943 268777 286724 299317 309399 318174
18357 318174 327235 334425 323126 300160 276339 264343 260893 257919 237349 226431 221673 216016 199058
18344 199058 201237 208123 219660 235715 240635 238466 248402 264400 282690 292568 285690 282458 288431
18331 288431 288455 263931 238046 221967 210435 207046 200003 183703 175649 184281 192653 187068 185880
18318 185880 199594 218920 244979 261803 278391 281371 289792 294941 299701 296269 288442 278532 270463
18305 270463 260829 250992 253971 261106 260290 258682 272752 279486 267105 260637 275902 288835 272333
18292 272333 264404 271879 295602 298726 311928 320270 343947 369407 383832 398041 422655 464214
18280 464214 492532 505054 502450 526304 544659 541453 549321 584710 649879 756676 863983 923912
18268 923912 975923 1067308 1172440 1345540 1560273 1688939 1728553 1714966 1631152 1506097
18258 1506097 1336496 1177570 1051821 962261 938624 975153 1110046 1353408 1683789 2061023
18248 2061023 2335654 2457345 2480153 2502032 2509526 2455859 2427029 2438602 2461162 2409656 2324770
18237 2324770 2176991 1964930 1753204 1588034 1465431 1394579 1336377 1273131 1219237 1214061
18227 1214061 1262284 1294536 1271916 1187598 1056872 909102 779015 659345 548468 455659
18217 455659 403630 362723 328594 305873 303217 301532 314234 319792 312545 293916 275031 269044
18205 269044 273885 253124 239983 239971 256819 270673 284161 300123 319863 344818 373933 418331
18193 418331 468925 508575 535898 548913 542923 551980 547068 525013 505373 497171 525538 562682
18181 562682 566758 573612 603936 638340 677396 725629 764372 798366 890942 1027912 1166243
18170 1166243 1272038 1313006 1310835 1230293 1129174 1039684 954672 887820 823038 780724 782301
18159 782301 851004 985978 1135919 1273927 1340302 1322595 1258469 1147205 1040341 936139
18149 936139 845916 758502 684395 654641 656958 640490 609586 582151 578738 604431 618369 613473
18137 613473 638720 693054 759704 854958 947391 1019841 1095957 1152879 1202341 1242494 1267747
18126 1267747 1283400 1273260 1259156 1222915 1183330 1155999 1141705 1122834 1136416 1153520 1196200
18115 1196200 1254391 1370413 1548918 1800377 2125132 2603997 3345103 4499234 6423761
18106 6423761 10047695 16752113 22341586 21203440 17308545 14313299 12871960 10853099
18098 10853099 7773002 5161418 3546039 2627108 2061367 1670686 1413451 1233017 1091442
18089 1091442 984305 905874 834958 800753 784952 771263 758787 742461 755530 795727 822735
18078 822735 849512 916301 986430 1011621 1043508 1068499 1072665 1100770 1122764 1116322 1086429 1053439
18066 1053439 1019834 1001233 1020557 1113589 1216951 1227330 1165878 1115102 1155322 1270374 1378242
18055 1378242 1358066 1282214 1201380 1135230 1107228 1109606 1169258 1288358 1316589 1251281 1168716
18044 1168716 1150265 1187571 1245856 1208124 1080650 941931 841741 751194 646972 561448
18034 561448 495572 438217 392614 351950 322374 295513 273864 259187 252613 243185 229676 212857
18022 212857 214796 222714 236899 255522 263573 264451 275422 290035 306656 317038 324803 308792 289881
18009 289881 285990 284934 273108 251305 257021 274540 301508 330489 369479 388600 404105 402020
17997 402020 396684 402067 417196 423006 416657 388032 351513 321682 310638 287249 257427 230650
17985 230650 220332 208327 193675 194562 201869 200769 188794 178554 173937 183062 189440 196982 192747
17972 192747 171663 154922 159042 167035 162831 166674 148970 150908 159961 158568 159111 162437 170268 163820
17958 163820 159768 156327 159222 167441 167991 162593 152700 147895 158950 155396 144452 144817 146961 141884
17944 141884 150407 164059 189044 192775 168433 166888 171909 180839 176085 171361 169957 170985 163672
17931 163672 153536 155244 144993 138264 146398 151167 161291 171061 178432 162995 147800 150681 160991
17918 160991 156332 155338 163166 162214 149451 150262 161238 165494 167807 165451 168645 176401 181484 178576
17904 178576 190263 190112 175798 178742 183842 187696 192986 191437 194981 199576 199455 181905 170482 175326
17890 175326 183031 187110 184101 184779 168076 158538 177714 192386 205572 217677 201605 201397 201888
17877 201888 198506 198455 195759 197662 196732 204377 205384 205495 196781 176604 166647 154418 145474 140957 145323
17862 145323 147239 147276 148933 151017 137151 138953 142296 143126 159610 168743 167429 161446 177536 182353
17848 182353 175650 168080 149181 145850 143302 151538 143420 143473 141151 143678 137775 136848 140682 142483 139096
17833 139096 134976 138214 145222 146622 143617 158119 151511 144147 140954 131367 124842 126522 139955 149442
17819 149442 156594 171139 178592 182349 177870 166970 170739 186738 180100 163179 167172 172052 168962
17806 168962 178477 183173 188524 185411 183682 196787 201323 217589 223346 215143 218048 236499 255565
17793 255565 308982 349048 371019 362631 341329 318832 293094 276337 257891 233293 227007 251496
17781 251496 292076 342065 377442 377903 363478 323772 309899 299142 264966 225152 175057 162236
17769 162236 172545 189000 185194 175543 169595 172054 172839 166710 143733 131385 142068 163918 186705
17756 186705 201382 213487 229954 230035 219635 216947 211645 208435 219333 212501 207509 204493 189122
17743 189122 199297 232340 252597 250073 243338 247307 246880 235599 232863 230002 217188 200455 193792
17730 193792 172465 153896 150570 151171 136176 125097 115226 107358 101710 99024 102818 109547 112632
17717 112632 98096 83729 96190 107770 109678 110382 119734 128654 139171 143099 149937 150161 156660
17704 156660 170761 178811 165528 159219 164443 177940 172656 184140 186685 196076 203061 216040 241361
17691 241361 289171 376455 461078 510720 531540 509424 473494 453511 443429 427870 401962
17680 401962 354729 333835 331264 335279 358821 402264 422485 410656 391050 362878 351560 374919
17668 374919 382283 377811 360610 347989 323912 319982 345091 379213 437013 511138 596581 679512
17656 679512 737390 764359 736617 694566 650568 596175 547118 515142 474382 455033 464285 481478
17644 481478 484030 483623 482170 469663 439850 407624 383653 368829 356691 362980 379853 387273 394407
17631 394407 383500 370932 334085 269445 228171 200096 199476 212493 200199 169631 151363 159904
17619 159904 186533 217870 254010 287535 297125 301462 308041 300528 310172 343831 339713 324956 315638
17606 315638 345169 391797 473858 556286 636543 701830 737064 764308 748227 699415 643931
17595 643931 585593 544607 504548 462338 431373 410949 388641 381317 393109 391949 375150 401023
17583 401023 412937 400740 403368 422458 436635 444705 430118 412904 419552 423175 433329 439117
17571 439117 435668 444515 451821 468357 488890 506779 537569 560253 582584 598483 606082 622115
17559 622115 643433 669615 698789 731962 774561 825449 857713 882912 927881 981413 1021566
17548 1021566 1061335 1128372 1173041 1182660 1187741 1204452 1245461 1289820 1312650 1346266 1407436 1463283
17536 1463283 1513426 1581734 1717333 1913878 2131001 2275711 2343777 2425294 2563790 2737199
17526 2737199 2926486 3067660 3164090 3283280 3466885 3749298 4134659 4570214 4978962 5323751
17516 5323751 5678336 6182857 6905948 7777998 8591761 9302683 10085884 11210739 12852315
17507 12852315 15061645 17940842 21811909 27374394 36006799 50568854 75988316 109614130
17499 109614130 128036531 124686592 116445896 117671795 131425774 150386690 154744527
17492 154744527 138390149 117622855 105042331 100594524 98717444 103789529 122698789
17485 122698789 138673407 134649196 122217845 116930924 124634527 140834506 148802884
17478 148802884 134475740 110024118 90068221 77440898 64809799 49104762 35074474
17471 35074474 25468943 19478683 15611740 12999928 11295013 10143814 9184118 8350453
17463 8350453 7670410 7096448 6604786 6153577 5701301 5272736 4897729 4531662 4145698
17454 4145698 3755024 3428438 3196149 3036320 2918767 2869275 2789232 2642729 2478201 2373832
17444 2373832 2341861 2336533 2278180 2144379 1982037 1849559 1767566 1700806 1585246 1459563
17434 1459563 1360825 1286997 1210767 1125502 1052205 983835 941503 895513 847419 797535 768063
17423 768063 752005 738546 714712 692462 689402 676910 660914 645639 631559 630891 633520 612454
17411 612454 584985 562437 559860 568336 556766 547171 534397 522957 506896 492195 481393 469929
17399 469929 458265 462597 461764 447136 450989 454411 447407 435846 415447 387479 378728 375565 361313
17386 361313 341893 341874 344173 351860 338818 331499 329793 336476 333244 334609 336443 348877 360974 366687
17372 366687 369743 392853 437653 454035 464377 459260 446305 437101 421269 402459 398992 392091
17360 392091 372065 374059 381570 394963 406867 409104 414813 414071 408662 408925 404821 407816 417735 408234
17346 408234 386410 366313 335219 307644 307694 309456 302566 291379 257859 234119 245232 251040 258157
17333 258157 268654 271636 267741 243996 239726 238353 234894 227495 202734 178113 162309 156396 149210
17320 149210 149472 141825 153782 157256 139941 139930 139532 123225 97547 73771 37574 27643 59233
17307 59233 77931 66492 44162 30166 25469 57547 92687 97807 112952 137559 128898 123123
17295 123123 121867 121051 125786 123521 110792 105136 112472 138255 150247 150714 149476 161157 180742
17282 180742 184326 179274 178059 177044 179134 185190 192049 222268 256030 288650 314432 322058 319731
17269 319731 334853 351784 372825 373318 341578 310654 289838 285226 286751 306008 336036 331777
17257 331777 333422 341493 328395 328013 347314 347111 309124 268466 245703 241624 211373 184535 163550
17244 163550 159375 143723 118656 123476 131118 132001 124372 115390 122378 119248 106669 122645 140493
17231 140493 160131 167148 173459 187964 215127 222037 220740 200411 202857 210077 216346 217433 233301
17218 233301 274139 319463 344586 358728 373363 411766 509126 643125 770357 854028 880590
17207 880590 894996 906636 884389 805635 725846 654700 588435 537381 529872 571777 666555 766348
17195 766348 835901 859474 861105 842861 783209 681848 561986 446499 370916 291064 230051
17184 230051 181084 150416 143414 140201 132852 157784 174215 173207 178265 169883 154491 152321 144447
17171 144447 128346 124516 125546 119625 126628 130319 116748 103954 92040 85049 89631 103188 104389
17158 104389 95913 104029 111033 114745 102897 91415 85561 79902 69776 70747 72520 77630 72643 60841
17144 60841 63502 62027 56082 63448 63057 57479 58560 61192 62630 72647 82745 83903 87314 75557
17130 75557 72628 77865 82949 92616 108104 116913 122885 117747 109103 108166 95236 82302 73128 53145
17116 53145 38399 43785 65146 72709 80497 70767 55241 62677 83828 92839 101821 105173 102944
17103 102944 94288 80713 78123 67938 57649 49491 45359 59767 65110 71282 79543 83545 68285
17090 68285 67520 66204 61706 65714 63247 70383 72979 76322 76751 82492 86492 104554 109583 101566 98044
17075 98044 100672 94057 103499 96113 72833 55650 59678 63373 66037 61737 52951 42259 36215 24913
17061 24913 38829 50860 50826 49806 57043 63656 68522 78829 73763 65125 58285 63010 75919 67281
17047 67281 65237 57856 33729 43653 50887 36303 32854 33188 47892 56347 70772 73981 51600
17034 51600 51744 58587 58697 56085 52745 49680 44210 52650 55199 48658 64448 72377 64118 70419 73123
17019 73123 65710 53863 43182 40939 22062 23939 44734 43562 49217 58498 57759 51679 54703 51155
17005 51155 42923 46795 49939 50873 53983 49907 37493 42184 45048 48169 61411 58490 50708 38133
16991 38133 36605 50773 50571 42380 44258 34839 27047 27760 37037 42098 41727 51334 63949 62604 50551
16976 50551 39328 33364 47367 46322 43795 38781 40390 40790 45409 38527 37731 39879 49780 51239
16962 51239 32908 27715 39000 46232 33110 45033 50890 40151 40993 37814 38466 41988 53536
16949 53536 46971 41288 42955 44982 43009 53328 64099 66754 86287 92690 103814 107649 115482
16936 115482 152604 192369 228548 297944 409917 573080 694831 683052 629674 634227 716451
16925 716451 817445 866469 795731 670555 595347 565987 555709 586039 670852 744734 740313
16914 740313 696561 663700 680900 744278 792084 735571 626963 520984 449921 390542 307498
16903 307498 223442 167673 138643 119461 105842 81352 76223 77233 73749 65931 77858 74915
16891 74915 68263 50629 40487 46625 49050 49253 48822 53099 55213 63142 70537 62037 54039 44747
16877 44747 42059 24653 11628 14151 28730 27676 27541 35395 46082 30372 10077 8635 12604
16864 12604 6836 4292 13555 12315 764 84 13465 11163 5043 17213 13416 1797 7181 27852
16850 27852 23749 29237 11867 7547 18713 21771 6470 -7238 -5124 5267 12388 25714 31574
16837 31574 35314 30516 19019 24037 23238 24603 27577 30241 27506 21222 26346 27390 20656 16409
16823 16409 29155 37535 28561 22378 21120 14797 30113 37484 38084 41135 28874 19872 19321 19972
16809 19972 27916 26922 24022 17429 9389 12989 24012 17823 12680 18022 20988 8512 -11253 -9800
16795 -9800 555 7546 12134 16932 7959 6163 13559 32923 43096 31100 23708 29379 35393 31999
16781 31999 19148 6009 -6219 3247 17192 27527 24484 30630 27341 34033 36297 32710 19946
16768 19946 6449 -1127 -8160 2285 10979 22957 22453 8410 1185 12917 14705 17489 18384 23318
16754 23318 18160 11234 2553 16096 11060 1642 -8248 -9529 -9230 -7725 -6077 -8045 201 -2731
16740 -2731 620 10350 18158 32931 35444 30003 33250 26363 21835 10627 -5702 -9718 -418 10905
16726 10905 8973 -435 -974 2647 16113 11436 1934 923 -1187 -9880 -10097 845 9185 13243
16712 13243 22198 24810 14965 7448 -6559 -4304 12062 26715 29590 37193 31228 31877 16144 16027
16698 16027 11820 9763 8468 21117 15795 13622 16767 20153 27365 25621 12141 11955 8352 3851
16684 3851 10539 18936 5908 2597 12781 12236 10888 13163 15412 23576 29345 37945 24957 30697
16670 30697 32424 24371 14663 19104 20230 24835 25330 20444 19630 22670 26961 23190 29430 19407 8021
16655 8021 3126 3278 -15369 -16644 -27127 -15079 -14570 -19703 -10844 -2185 13015 22853 26345 26045
16641 26045 27069 31815 25935 28979 12609 2436 14928 14367 906 3894 15046 17819 2033
16628 2033 -8435 -2534 8087 13400 5862 11930 12821 7934 13240 34243 37397 33348 28182 20373
16614 20373 30341 37073 43283 42054 25349 21480 26149 26076 16675 130 2348 4843 11086 13275
16600 13275 4946 -72 4830 15097 20909 10851 12557 20330 29919 24420 12490 -4013 -15329
16587 -15329 -9195 9694 19748 24174 19222 16527 24762 20698 26169 31495 20622 27759 13410
16574 13410 327 -6554 3121 9800 18971 16960 12243 7466 1381 5689 13611 5173 -214 -2975
16560 -2975 -20253 -22187 -10229 -14630 -20410 -27332 -16842 -18891 -21540 -10240 6403 18697 24602
16547 24602 12896 18977 17081 17039 8590 15307 18307 6911 3643 7830 15626 22174 20622 26795
16533 26795 35931 35234 24840 19498 14805 7798 12596 15732 13993 21806 5506 4771 19222 14172
16519 14172 206 -6462 13791 22915 11544 5495 -6776 -11461 -3940 1188 4672 8136 -5196
16506 -5196 -11138 -7107 2135 7787 10469 9209 19825 16816 16982 17390 5575 14595 13762 10142 7624
16491 7624 6435 8531 3476 13864 26095 29241 33110 23522 19013 13224 14380 10050 -6878 -4849
16477 -4849 130 2575 6676 7482 1702 8095 24319 18852 9029 9064 9950 19460 20902 11389 234
16462 234 -9298 -4387 -6721 -18978 -16883 -1457 -2061 -2874 7414 14926 7844 -4784 -6945 -13096
16448 -13096 -28807 -6217 4638 -4072 3450 3732 4203 1367 20488 15183 -3109 3824 -3248 -9540
16434 -9540 -9284 -12784 -10414 -9962 -12228 2803 25163 29844 18128 12128 12944 12564 13513 4403 928
16419 928 12514 12867 8821 20566 23734 21630 16078 6649 1633 -3222 3825 7356 4732 6893 8126
16404 8126 21908 27413 19025 18582 20055 9501 -1436 -9828 -5551 8839 19615 14580 10157 14548
16390 14548 20732 27614 28191 9599 26 3048 -8127 -23892 -14150 -6122 -12354 -9782 -2033 1085
16376 1085 11037 6438 9417 5664 11839 2503 6648 5825 10420 19281 20065 31976 29977 10234 7800
16361 7800 3605 -2186 6487 7491 14930 10268 8455 14500 9035 23356 26740 22040 20327 16619
16347 16619 9160 13189 25442 17933 -4234 -14653 -14787 -9154 -11927 -8244 18813 18199 11939 13255
16333 13255 6106 -1692 -5280 -145 113 -1611 -89 -5769 -7053 -11760 -20030 -11530 -18597 -16175 -4082
16318 -4082 78 12529 29351 31338 25002 17486 20230 18679 7906 8465 -450 -6427 9218 23365
16304 23365 26985 22615 26937 16107 20323 27658 23261 17656 21476 15370 5855 5528 8765 15303
16290 15303 24292 25061 21608 21623 15465 16496 14496 9009 4978 15645 9933 11657 4802 8260 -3805
16275 -3805 -4140 -2264 6535 4942 12565 18860 6032 -4409 121 7433 13833 10599 12108 14531
16261 14531 18311 19063 12195 5741 4910 14807 16345 15442 29703 40240 31422 20346 16943 14909
16247 14909 26452 50676 44609 27294 25846 7544 -22518 -27142 -26124 -14558 -10022 -7822 8155
16234 8155 5097 1745 2462 -10523 -18575 -3056 8961 13926 4252 3646 5028 6459 97 -8543
16220 -8543 -10299 -10689 -7491 -5414 1371 3111 -11762 -20301 -20186 -14432 -14493 -5029 6454 17147 11532
16205 11532 8168 16863 19712 15502 16046 6242 907 -14116 -11628 -2831 4630 -243 -1594 -4446
16191 -4446 6905 10191 15584 3858 -6220 -14441 -9750 -3140 -5331 -13730 -23192 -34793 -32818 -19104
16177 -19104 -10543 -8624 -15258 -18603 -17859 -23583 -32510 -36405 -29285 -4875 -3714 -13839 -6138 976
16163 976 -6870 -2102 -6297 -1265 5621 -6480 -14376 -6198 650 3222 1886 -11376 -12786 -17369
16149 -17369 -5622 2203 13165 7120 -1749 -4695 -7941 -5817 -7609 -7587 -5132 -10162 -20831 -27054
16135 -27054 -28937 -13768 -9876 -31487 -30900 -25087 -11152 8713 18421 13959 15079 13933 14703 5801
16121 5801 -11987 -16205 -11488 -8704 -19556 -31317 -37696 -30328 -12785 4213 2082 -17986 -26725
16108 -26725 -23405 -17235 -10217 783 5685 -4263 -22352 -26115 -13321 -4685 1060 -2462 -2420 -5705
16094 -5705 -8736 -3709 -8177 -6795 -4038 7617 4307 8831 12924 10608 4889 8332 188 -1942
16080 -1942 3167 -7786 -6810 -13352 -6754 -2422 5787 -1941 -3322 -1799 6963 3467 -7929 -21143
16066 -21143 -12763 897 -203 -14319 -16235 1945 4122 1049 -3934 -15911 -15519 657 -1842
16053 -1842 -3928 18882 29832 30469 26544 12260 -2547 -3971 11680 15673 8562 1254 -7622 -4524
16039 -4524 -5358 2562 9864 5823 13035 19142 3422 -939 -3222 -4421 -5596 -1799 4965 10189 9037
16024 9037 9571 4451 -4636 -7566 -4331 -15073 -27031 -10690 -2392 -8389 -13189 -14045 -8905 -5070
16010 -5070 5670 5551 392 -4263 4294 9708 1634 -5102 3404 13073 -2256 -6899 4028 16932
15996 16932 6654 -6367 -15601 -22789 -15155 -3693 -1411 2089 18 -2814 14771 20833 11707
15983 11707 7541 11454 11334 -904 -804 2932 4551 1713 15229 20158 15541 29874 22344 13123
15969 13123 21370 28620 34101 30611 12895 -6963 -19917 -13458 6842 23003 25573 17673 9748
15956 9748 8198 7064 -5396 -17176 -8231 -2913 -13934 -21645 -23961 -28030 -21594 -16182 -5304 3370
15942 3370 9696 18164 12692 8883 10451 15049 17453 11035 16114 8737 3424 9997 24432 39484
15928 39484 47147 38961 31626 33803 36647 26675 15184 10817 4649 4310 2559 -2048 -2196 -8590 -15062
15913 -15062 -21899 -28738 -31471 -20587 -9747 -1935 10571 13582 5927 -5465 -4519 -8645 2180
15900 2180 14380 12304 18080 30480 42283 32929 27588 21365 24169 22119 20449 23134 26053 7224
15886 7224 -1698 -3296 -5573 7090 15920 11217 22382 13847 16799 12958 23032 24182 29304 8737
15872 8737 -18620 -23299 -15351 -6322 -6078 1018 -2103 -10071 -15556 -3244 -93 8448 18811 22009
15858 22009 8897 -7424 -17962 -17527 -8153 5245 23603 18696 16615 23507 19161 14179 19127
15845 19127 20339 27933 34774 18280 12707 7826 10640 3183 5988 17516 10182 -3274 9773
15832 9773 20663 -2270 -2543 4457 12079 2231 -7917 -19742 -25086 -18951 -18628 -9898 7558 6281
15818 6281 7451 11798 11868 7878 16885 18446 13281 9720 9225 9988 9337 3475 1735 -3279 502 -8127
15802 -8127 -14185 -10351 7853 10053 -1247 -4692 4720 -10748 -4968 1848 7075 21122 19037 13021
15788 13021 6989 2107 12293 16333 17048 9187 1692 6180 11307 13154 13622 8397 4100 7599 5132
15773 5132 -940 11994 10084 9341 8284 19109 48597 55487 36043 23854 16289 17652 10067 4792
15759 4792 -2599 -23446 -42322 -36224 -7999 8598 3502 224 12497 -8077 -30457 -27488 -16361
15746 -16361 -7165 -11633 -4214 2193 3420 7800 1768 5290 15078 12375 6560 -5117 -13217 -14801
15732 -14801 -8578 -18299 -23372 -16197 -14528 -4328 367 10682 17691 8326 -2430 -4379 -11288 -7985
15718 -7985 4024 -3411 -10434 -5076 -2960 -18239 -20894 -19952 -21127 -21473 -24850 -7367 -9641 -12652
15704 -12652 -6496 1227 5087 -4586 -11586 -14638 -17662 -12733 1906 15498 11884 12323 13356 7655
15690 7655 2772 1993 13129 16674 3311 -4104 -2820 -10654 -8031 6639 4547 5952 1505 212
15676 212 -1059 -2465 9241 15889 10307 7370 9238 9015 3862 -13545 -10568 -4851 264 -4562 1094
15661 1094 9093 14055 12107 -6070 -3374 12683 17842 16657 5777 -18172 -27957 -34002 -20803
15648 -20803 -12423 -16084 -11698 -6420 -3346 -6070 -6241 -5606 -2549 299 1439 6892 10737 12273 13355
15633 13355 2716 -14784 -15953 -17708 -24019 -22645 -30586 -42197 -33140 -11487 1021 1392 -8496
15620 -8496 -17916 -14667 -15851 -17058 -6550 -12572 -12287 -3065 -7358 2077 18797 32762 32216 14152
15606 14152 -1172 -892 13909 9163 -2512 1326 12971 10004 2464 1456 9560 15655 23704 12232
15592 12232 10631 -2423 -12178 -7176 -1264 -5067 -4229 -5 -7323 -4191 -2798 8968 14580 14402
15578 14402 3859 8320 24206 24549 4620 3806 7192 12652 2182 -6365 -6653 -5944 -10348 -17388
15564 -17388 -13808 -12708 -5598 -4102 -698 -6505 2928 12520 4989 4256 -388 -16432 -29207 -19388
15550 -19388 6378 3350 -3049 -12684 -4679 5562 318 -11677 -12343 -5574 4216 2261 1541 -4153
15536 -4153 -12042 -13187 -17088 -28931 -19842 -9276 -3493 -7684 -1326 10147 1435 -2376 -747 -8940
15522 -8940 -4596 -9061 -3468 10135 3675 2576 -2308 -5197 2858 -1863 -10784 -16629 -1204 -3299
15508 -3299 -14365 -5917 5336 3960 -148 1551 14184 22897 5472 -2229 9998 12216 -710
15495 -710 8574 10439 4195 3918 7865 -3994 -10533 -4930 -2432 -4138 -198 -6190 -20123 -26935 -10070
15480 -10070 -8483 -1409 6957 -2922 8483 24195 19013 19004 19779 14044 14961 8694 17797 22562 14294
15465 14294 4760 4488 -10353 -8071 -7111 -4175 -14603 -25113 -16129 -22367 -31219 -7323 -3725 -13711
15451 -13711 -24409 -23729 -7419 -1033 -1990 -5719 -7033 -10675 -6127 -7885 -7972 -12771 -16522 -16092 -27520
15436 -27520 -40007 -22897 -7588 -10058 -22309 -22554 -26453 -31617 -29188 -11436 -3213 -321 -8129
15423 -8129 -15562 -24723 -10725 -7164 -15782 -14392 8558 7491 1925 8122 3384 2972 -1849 8003
15409 8003 6446 14914 5550 -13355 -19451 -25259 -31375 -19413 -9606 5714 -4544 2058 265 -3000
15395 -3000 5435 4581 9686 15828 4296 -5923 -6522 -10518 -9091 -3296 2345 -1355 -4597 2600 16804
15380 16804 5800 -11501 -15964 -12943 -12222 -10130 -16578 -6185 416 5672 2066 1797 -19238 -20691
15366 -20691 -14645 -25149 -23144 -12447 -1571 4510 -760 -4662 -7745 -8843 -1270 12054 9014
15353 9014 13909 13813 17451 22612 25933 22772 5928 -1955 -5581 2785 -4978 -25342 -26446 -954
15339 -954 13596 7533 4695 -4465 -20298 -27424 -15797 -9411 1502 -4424 -10895 -10149 -5161 -10171
15325 -10171 -24919 -8877 7888 7805 -1074 -10073 -17820 -38719 -40667 -35851 -26539 -15850 -5925 11334
15311 11334 17237 23317 23915 22732 11087 -7484 -25566 -29030 -16395 -10555 -5946 -8755 -10280 1227
15297 1227 4005 -4063 -19673 -25851 -31007 -16613 -3255 1955 -2501 -7737 -14460 -18984 -15313 -23759
15283 -23759 -31438 -35816 -23957 -18482 -4826 1507 -5001 -8684 3619 5028 1981 18867 25540
15270 25540 -1869 -8446 -7821 -5034 1139 -16852 -21595 -18432 -6315 2951 7234 14214 14378 12857
15256 12857 9118 9080 7641 10813 16364 5497 -8417 -14769 -4750 -4723 4005 6747 7015 1120 -5250
15241 -5250 -6560 -1777 8602 5679 3028 900 261 -3154 -1165 7573 2646 -4831 -5550 -1235 -4081
15226 -4081 3376 14301 13573 7098 13272 25343 23546 19918 9161 733 7379 18212 24224 28095
15212 28095 27387 18610 10305 25911 28986 12225 7734 -6033 -11072 -14808 -11589 -12358 -12732 -198
15198 -198 -6995 -7913 4353 -1336 10100 18001 -1921 -10986 -6651 3222 9212 6462 9789 6351
15184 6351 -585 7620 -6188 -18252 -21634 -7094 18662 27951 17404 1385 -11817 -17021 -13935
15171 -13935 -9354 -8128 -9493 -15559 -23287 -23801 -9531 -6171 -24427 -36223 -24084 -16107 -12942 -6583
15157 -6583 13933 4246 -2966 3291 -2858 -347 -10559 -33595 -30175 -20240 -16118 -19474 -20776 -8083
15143 -8083 -4928 96 -465 5094 4898 -9810 -16207 -20658 -24225 -21506 -14424 -11163 -9874 -15847 -11070
15128 -11070 39 847 1485 6651 595 8297 9826 654 -26160 -30337 -28241 -31183 -24467 -34312
15114 -34312 -48494 -35993 -22338 -22881 -12515 -5539 -21182 -25584 -16271 -8064 -26678 -36739 -34289
15101 -34289 -29824 -28880 -10774 -4464 -2749 -6934 612 1432 8514 6197 5595 3424 -1270 15193 20722
15086 20722 18609 3334 -7892 -7819 -7552 -5508 -502 3818 -9567 -9354 -7816 1090 -5036 -9050 -5270
15071 -5270 5764 6854 11488 7915 11364 17071 22332 14532 -269 -1356 1019 1097 -8305 -3614 5104
15056 5104 15036 -1791 -15118 -8153 -11536 -6078 2225 1269 14261 23261 22560 9305 -4283 -7781
15042 -7781 -11842 -10934 -7079 959 6695 -9630 -15169 -1307 5785 -3150 -11724 -8680 -13830 -25401
15028 -25401 -23643 -14545 -13343 -5339 5143 612 2324 9722 4159 -5705 -26213 -30186 -30164 -22374
15014 -22374 -5780 -8131 -6245 -9943 5608 13146 21368 17589 6089 21306 23131 26540 16812
15001 16812 2719 5738 -8508 -22626 -14023 -9482 -7357 -4684 8371 -79 -7247 -8231 -8854 -2808
14987 -2808 3976 1389 2137 733 5769 -3158 -4165 -13195 -17564 -5952 -11657 -9903 -3407 5095 5027
14972 5027 3456 -11397 -22368 -31303 -29576 -23449 -26998 -12934 -9538 -9281 -9130 -9169 -3683 -4728 -7589
14957 -7589 -4866 -16441 -22964 -20473 -21126 -22757 -17897 1085 -7684 -240 5368 -1607 -9927 -16935
14943 -16935 -13852 268 -7626 -9515 -4413 6258 6947 5359 -3780 -5560 7458 -7355 -16011 -13212
14929 -13212 -10396 -12272 -22365 -28001 -22754 -10621 -15412 -29122 -28595 -25650 -12620 -5749 -8680 -18799
14915 -18799 -33590 -22485 -12665 -6339 -4720 -15743 -2558 5740 8178 11019 2802 3518 15458
14902 15458 13421 8687 5011 -989 -2103 -584 -5776 -12070 -3024 -2251 6099 3559 -11 7131 12247
14887 12247 11232 6784 9556 20687 29426 25999 17758 20829 10990 -12334 -28291 -20293 -20766 -9784
14873 -9784 -6443 -3904 -5978 -7564 -3176 -13935 -4802 -3146 -2411 -3251 275 -5621 -12885 -15737 -8920
14858 -8920 -5798 -10397 -20861 -21768 -14356 -1571 -3928 -5271 -13143 -10320 -10580 814 10679 -9174
14844 -9174 -15332 -9416 -12784 -25166 -24406 -14687 -8274 11314 8688 -8516 -24680 -19432 -6778 -1620
14830 -1620 -9608 -6081 -2629 -10916 -19800 -22761 -26806 -28020 -21299 -8602 3356 3092 976 -3860
14816 -3860 -12788 -23288 -30488 -32261 -28970 -35819 -30761 -34247 -36900 -28756 -11657 -7804 -15334 -14461
14802 -14461 -7563 -6970 5405 2204 3344 4749 2563 -12627 -25895 -28850 -15627 -28112 -37667
14789 -37667 -16829 -379 -5437 -2270 -5076 2219 778 7040 7329 1693 -7916 -7243 -18947 -22568
14775 -22568 -16457 -14814 -21031 -22210 -18751 -17747 -12285 4681 -2336 -20086 -30279 -24190 -31112 -46583
14761 -46583 -35046 -24445 -28599 -27930 -19051 -777 6330 -15429 -30173 -32581 -7294 5292 -5568
14748 -5568 -9894 -18946 -22408 -11907 -2073 2307 -3475 -11717 -10927 -8192 -5251 -3465 1420 -1928 -2896
14733 -2896 -8322 -9924 -10267 -21222 -37033 -36491 -6067 -6636 -28037 -37066 -33411 -31414 -20740 -15856
14719 -15856 -26081 -15077 -12389 -2050 4635 9409 8542 9840 1701 -8402 972 12644 13688
14706 13688 2618 -2744 -8585 5351 612 181 -1825 -10768 -4713 -1133 -3619 -4150 -20187 -20568
14692 -20568 -11963 -5906 -9367 -6711 3283 7354 715 1030 1635 17899 26342 23235 2046 -2403
14678 -2403 3397 -6615 -23576 -17679 2888 -1579 -6544 -1984 -12014 -27533 -44876 -29734 -9234
14665 -9234 -163 15225 4283 5982 6596 11766 -6628 -17462 -21577 -27345 -24295 -26118 -14332 -6387
14651 -6387 -11873 -11855 -5702 -2148 -6411 -4981 -12930 -8098 -7445 -10099 -8747 -16419 -18442 -20340 -21526
14636 -21526 -24321 -13549 2802 -3330 -9004 -9705 -14778 -12885 -6527 -2256 4638 14141 7916 6645
14622 6645 -1995 4655 7084 3805 -2732 -8846 -3187 -1133 4630 -514 139 -8673 -15312 -17374 -30965
14607 -30965 -29641 -26867 -23669 -8680 -7624 -20977 -17025 -9334 879 9529 3707 -992 -6057 -9829
14593 -9829 -11564 -14999 -15143 -9554 -8662 -10518 -5933 -4754 1122 3742 -337 -8780 -10340 5726 8054
14578 8054 13979 15818 10698 11387 22050 25521 21646 25619 30235 29160 29357 25576 24819 33705 22938
14563 22938 21505 11964 10125 -2128 -6171 -6667 -3952 12321 2479 -9010 -5670 -14432 -14749 -5895
14549 -5895 -4008 -20231 -12759 -8383 -7057 -4862 -947 6598 23052 12873 8897 13052 593 -7419
14535 -7419 -21067 -27884 -22119 -1519 9695 3655 3750 13909 5459 1062 -6407 -19972 -17106 -25324
14521 -25324 -19541 -20927 -13259 -237 5914 4532 10193 4975 15 3278 3178 -10476 1940 4806
14507 4806 2941 8380 18486 9003 5293 -1386 -7349 2193 20502 18998 -3190 -3011 -3175 2592
14493 2592 8928 2909 -8317 -14412 -7525 -21546 -26699 -25354 -22987 -14966 -12980 -24713 -32568 -39444
14479 -39444 -46814 -36394 -28552 -23779 -28855 -21851 -19965 -3017 8714 13871 19457 11325 -11348
14466 -11348 -26008 -31359 -30145 -18677 -7808 -4153 -4862 2641 -631 -893 7740 5561 5308 -6135
14452 -6135 -9793 -14140 -24736 -29047 -8402 1177 3176 3621 7879 10352 3471 24 2285 -12814
14438 -12814 -13082 2852 3864 -3871 257 3 2890 8489 -6078 -7111 -13757 -19045 -25829 -24087
14424 -24087 -26927 -30009 -14117 -1740 7836 397 1664 -6720 -21016 -17544 -14800 -7849 -22554
14411 -22554 -29712 -6158 13915 15826 1794 4431 14740 11209 8062 1085 -3935 -7950 -14902
14398 -14902 -7003 9440 15458 6810 6611 3084 -6267 -5325 -12345 -13507 -7667 -13207 -10299 -17024 -21432
14383 -21432 -15091 -20890 -18391 -7255 6938 9357 4347 12761 27075 21124 12329 15547 21327 17026
14369 17026 -2005 -746 7796 15959 674 -966 -558 -6239 -3014 -5203 4688 19625 18293 8664
14355 8664 13599 14766 695 -559 -3292 -5844 -3554 998 -1201 -14531 -11647 -1465 -7261 -5246
14341 -5246 6323 -3485 -15172 -18661 -16882 -2955 -790 -1230 -2979 -599 -6090 -11152 -21983 -20407
14327 -20407 -1669 -5666 -10996 -15517 -14631 -19417 -23114 -21262 -18581 -4841 2573 439 -4733 -2827
14313 -2827 5257 -6908 -17806 -24395 -30163 -24046 -9686 -2231 7968 7339 9095 1335 941 10656
14299 10656 8287 -1428 -12171 -12526 -6106 -2589 -10554 -22536 -19585 -10735 -18308 -34209 -33185 -38087
14285 -38087 -24390 -19285 -15479 -24695 -25129 -21681 -16038 3557 4899 -15701 -29716 -28133 -20091 -4501
14271 -4501 -3155 4476 8582 2716 -10604 -20620 -14164 -2974 -8059 -27283 -30251 -34753 -19466
14258 -19466 -1905 -6416 -10650 -8452 -6263 -1395 3448 13771 8401 18098 12442 9026 8051 5460
14244 5460 3339 8709 8042 -4146 9102 10723 3254 20077 16156 7701 -7381 -12084 -15358 -23900
14230 -23900 -3248 9623 -1943 690 4133 2110 3279 -3948 -9567 -7497 -4693 8265 16740
14217 16740 15901 15349 18630 12215 -2605 -5930 -1795 6847 2926 -2291 -7333 2757 14001 20152
14203 20152 9749 8813 -1180 -16554 -5602 2595 1370 10651 14339 11547 -2260 5079 14351 17744
14189 17744 17807 25835 33046 43496 41996 61213 71813 84970 114613 125709 129711 141317 167192
14176 167192 175359 186667 201829 227893 235333 229997 213376 198698 204487 209733 209106 203529 199589
14163 199589 200183 202034 189782 188495 185903 178930 173865 188959 194788 202176 204415 216586 219528 211687
14149 211687 220887 219157 211266 211592 219664 219538 220689 206498 194093 181469 177465 165152 165109 162976
14135 162976 144270 115388 98675 80762 74873 75728 69440 74994 70049 58245 39322 26260 23360
14122 23360 23263 24570 22299 32000 21889 14706 8372 15790 20359 10701 11505 20860 20846 19857 27081 30623
14106 30623 18244 4541 12697 31573 40901 44650 37676 31321 18125 7807 -11568 -8035 22059
14093 22059 26561 26763 30821 41550 42166 37083 46389 58410 56230 61015 62774 68848 72037 81941
14079 81941 97285 120527 133620 138561 154451 162103 182276 212358 250273 274964 297709 323400
14067 323400 363490 395934 444637 482153 492999 502762 520988 531405 544667 553619 558162 547569
14055 547569 527024 513134 498898 494862 489589 490483 485551 474396 467316 472001 479336 480721 480283 489584
14041 489584 481939 477976 487500 497497 505291 522142 545929 563391 578308 577410 562657 543989 529519
14028 529519 504796 472818 439449 412007 375587 349224 318041 283820 246224 211302 192381
14017 192381 184029 173085 149336 120970 104026 87449 76487 70506 69016 68373 61484 48662 39030
14004 39030 36130 34718 35083 36711 27198 26898 31587 18785 27506 25932 18468 16593 18594 22242 19595
13989 19595 25723 20633 12547 5409 23492 24247 16800 9235 8010 1248 5024 17346 15699 4551
13975 4551 14596 13577 7204 4740 -3509 -9302 -6403 -5967 -6437 -7135 6985 16172 17222 12949 458
13960 458 -1133 -57 -6293 -12309 2375 -379 900 7261 15990 17034 27362 28899 25440 8934
13946 8934 -8998 -11181 -9298 -19853 -31881 -17696 -3146 1187 8240 9344 11128 18365 8274
13933 8274 8427 4437 3520 -12389 -28727 -29539 -20298 -6677 -11109 -21428 -24625 -28097 -24725 -26134
13919 -26134 -29481 -31567 -25635 -30340 -33949 -28391 -28534 -18915 -11966 -23341 -30891 -26145 -20039 -13301
13905 -13301 -16824 -15195 -11140 -10843 -12431 -15019 -9386 1607 5229 -3691 8275 14502 15009 6596
13891 6596 12251 16432 53 -6655 -4977 -5398 -11926 -7272 -685 5607 15628 16979 6193 -3090
13877 -3090 -14192 -7086 -296 6626 -1581 5387 6671 -1379 -6774 -9114 -7715 -3144 -15735 -19227
13863 -19227 -20156 -16983 -15624 -13770 -19459 -10631 -15926 -17427 -7617 -5949 3530 606 -17632 -32986
13849 -32986 -28743 -20711 -23424 -22066 -8633 -2600 -12608 -9340 -4014 -4337 -11481 -17795 -14221 -7340
13835 -7340 -1568 -6117 -9135 -4433 5526 -7444 -23476 -12550 -9942 -10007 -9981 -15496 -9451 -6112 -6757
13820 -6757 -1128 150 2338 -12829 -14735 -10620 -6412 477 -2677 1862 -7017 -2897 376 523 -4988
13805 -4988 -16270 -30096 -31021 -8441 -4940 -11100 -22140 -17902 -12719 -22123 -29475 -20339 -17974 -26641
13791 -26641 -19822 -13458 -5715 5959 11423 3460 -1619 -847 -4525 8263 8470 -5268 -16897 -17079
13777 -17079 -17336 -21050 -30848 -30145 -19650 -7303 -6552 6422 15869 3498 -13314 1799 1012 63
13763 63 5989 3860 -493 992 -6162 -5111 -11616 -8768 -1791 1237 -6263 -1814 5699 -13978 -18323
13748 -18323 -15876 -12604 -12826 -16546 -22729 -11795 11931 10724 9511 3470 -9090 -21516 -35576
13735 -35576 -38351 -28630 -24010 -22824 -18613 -15368 -13050 -16859 -24427 -26538 -29313 -28811 -5409 -5463 74
13720 74 17991 25620 15380 436 -11828 -24607 -30020 -41979 -37681 -28471 -12550 -1043 4172
13707 4172 999 -3743 -14433 -22075 -18166 -16544 -18745 -27417 -28648 -26725 -16782 -5928 -18767 -23214
13693 -23214 -21699 -14916 -15610 -12994 -8327 -5998 -24682 -27101 -27437 -31471 -20146 -14354 -13766 -3579
13679 -3579 -3179 -513 -6300 -6499 -3062 485 -5721 -8965 -10051 1058 -1639 -25055 -20711 -15240 -3321
13664 -3321 -7377 -7274 -6115 -10928 -21101 -15678 -13142 -4877 -1988 9259 17527 5844 -9325 -22457
13650 -22457 -18876 -9560 -6466 -14551 -24143 -21770 -11718 -6071 -3548 -10073 -18001 -20829 -20315 -21956
13636 -21956 -21648 -25858 -28549 -41072 -48658 -48109 -41980 -43606 -41657 -24924 -3854 5396 -1943 5205
13622 5205 12593 2258 -4260 -8261 -6106 -14329 -23935 -20499 -30114 -37896 -30199 -37763 -31565 -35580
13608 -35580 -28352 -17325 -19149 -19012 -20772 -17399 -10410 -10149 -2705 -6608 -6196 -26494 -16833 -20776 -23362
13593 -23362 -15830 -14964 -18939 -15255 -18563 -14808 -18920 -9730 -9301 2557 11251 11576 16378 3235 -68
13578 -68 -16666 -18380 1764 3863 -2349 -4906 8866 -1400 -14712 -10661 -21679 -20841 -6141 -10858
13564 -10858 -21891 -13940 -21959 -31242 -35916 -35068 -37928 -44861 -47711 -27811 -5805 -12141 -20546 -25339
13550 -25339 -22737 -15941 -10095 -5683 -12544 -11197 -12711 -17340 -15986 -17095 -11660 -15838 -3207 8733
13536 8733 4437 -1369 -8816 -10350 -8418 -13386 -20473 -25492 -24471 -20392 -15760 -20145 -9545 -13210
13522 -13210 -7700 -11066 -12063 1087 -118 1590 -2428 -9754 -18882 -12851 -4212 -3968 3697 -885 772
13507 772 4552 1546 3030 -1167 -9445 -21530 -16135 -23382 -20898 -24882 -21351 -26407 -26768 -17190 -12232
13492 -12232 -20768 -12494 -10377 -8800 -10292 -18694 -12283 -20466 -7413 9747 13004 7596 -5041 -1354
13478 -1354 5856 -7622 -14931 -15680 -10202 -8264 -10090 -17386 -22670 -16569 -10507 -8162 -7792 -8872 -602
13463 -602 4576 8662 10053 13081 -1337 -30081 -41382 -32656 -21758 -5202 1388 -9708 -18621
13450 -18621 -24428 -4586 -1161 -2304 -13560 -10913 53 1196 -5217 -4270 2118 9777 749 -10212
13436 -10212 -8101 -10220 -19653 -23579 -11194 53 4770 7777 2505 3178 10507 -1123 -16839 -21242
13422 -21242 -16331 -19587 -21271 -24350 -24166 -27267 -34329 -35512 -20546 -3589 -6525 -11357 -20473 -14974
13408 -14974 -23062 -16634 -15227 -13837 -12252 -7676 -5532 -7429 -14901 -18202 -10801 -10805 -17182 -19115 -7985
13393 -7985 -13181 -19863 -13222 -17109 -23162 -27029 -19964 -14434 -7597 -8848 -19905 -20901 -30893 -36984 -28480
13378 -28480 -14561 -18998 -20154 -7844 -2042 4784 5246 -3597 -415 17896 13182 -7 -8763 -12820
13364 -12820 -14406 -18196 -12094 455 -5881 9435 13951 8546 4066 11769 22564 11674 -2064
13351 -2064 -4185 -714 -8288 6411 9882 -4108 -7514 -19792 -35776 -23318 -7340 -16239 -16884
13338 -16884 -18209 -15184 -20959 -19149 -10971 -12735 -13345 -10076 -2178 -1437 -4715 -8848 -16373 -15585 -23159
13323 -23159 -19187 -19113 -22134 -12866 2582 -8720 -13298 -5581 -3878 -4993 -9693 -7741 -7374 -6148 3489
13308 3489 8692 -8156 -4496 -475 7873 12463 6150 2110 -6921 -4382 -367 -1917 -12440 -14398
13294 -14398 -4826 -8440 -15209 -9616 3175 -3511 3843 11330 947 -11668 -23529 -10836 -108
13281 -108 -12786 -12384 -12636 -28096 -23929 -28810 -26346 -28784 -20862 -11987 -9605 2844 15787 20259
13267 20259 9085 9404 12518 10038 7985 -5656 -1048 2025 4367 -685 -9737 -13035 -3840 -6499
13253 -6499 -5423 -12018 -5648 7134 9935 7219 2784 7912 8748 -1026 -9665 -11485 -17169 -20556 -24580
13238 -24580 -5383 -10570 -25894 -28943 -24710 -4072 15496 8990 1677 4954 2591 -6339 -6972 -2729
13224 -2729 -9525 -13365 -5418 -12898 -6735 484 9636 13575 -490 3462 13431 11705 2678 -587
13210 -587 -10513 -16670 -33000 -50988 -42610 -29519 -28025 -17846 -7258 -6023 2801 10171 3702 -3663
13196 -3663 -8470 -14704 -15138 -12834 -2669 1364 -2496 -11339 -11122 -6456 -11076 -10122 -20452 -31192 -24334
13181 -24334 -1754 6507 -1803 -1571 -1655 -3363 -8167 -2591 -6124 7118 6172 2250 6245 -18220 -30694
13166 -30694 -38222 -30877 -9872 -1343 14416 29075 9101 -3334 14143 22831 18850 25855 29872
13153 29872 33334 59485 84371 104847 127367 142615 147826 136888 118657 105286 104151 89481
13141 89481 57967 38709 40235 26788 3982 -10798 -28246 -32602 -27270 -23503 -12195 -1274
13129 -1274 -8515 -1372 14128 21768 21913 10641 5880 10929 18709 26586 27877 28240 28229 21906 28197
13114 28197 27671 39287 42398 58505 82359 99248 132651 186753 259758 376765 485468 543514
13102 543514 517527 454464 384419 333542 279826 202215 144788 106343 81572 68259 40391
13091 40391 26614 20221 14510 19614 16349 15879 3837 8410 23275 27321 12617 -1649 6392
13078 6392 25413 39078 32983 24717 32873 46104 58058 59343 64270 65096 71785 71581 88519 98911
13064 98911 122885 169648 239564 351138 474091 554531 546104 497790 425522 365744 292871
13053 292871 227561 178422 126583 94331 60529 52900 46858 41717 29693 15408 16421 12872
13041 12872 -1147 -6682 -7723 -7801 6678 31150 33296 19979 1816 -6318 -10222 8621 20530
13028 20530 16311 20571 26206 25878 19224 28916 38637 44170 48504 54411 64020 87894 111134 147427
13014 147427 167111 153967 135699 112560 96036 86181 75136 52133 25959 6658 -5045 -2100
13002 -2100 -6001 6177 5881 -5184 -1112 -1043 -9808 4673 11924 7792 11196 10548 8033 8712 782
12987 782 -15041 807 2682 11682 19668 -3132 -7520 21954 33697 19375 16914 20332 3579
12974 3579 -259 15765 11883 -63 8752 11479 8245 -8539 -16599 -15539 -12499 5065 12612 15179
12960 15179 6476 -8761 -27107 -37471 -20135 452 17741 20856 8162 -7424 -14288 -23764
12948 -23764 -37364 -41056 -35593 -27865 -15344 -10692 -8371 -16210 -19007 -3085 -3995 4295 3295 -15691
12934 -15691 -22549 -23402 -26094 -14243 -13924 -13837 -16029 -20659 -17473 -22295 -34676 -38083 -21390 -10463
12920 -10463 -16955 -12507 -5768 549 -3711 -12605 -13682 -7033 -11807 -8377 -28849 -17999 -8459 -20271
12906 -20271 -5897 1694 5707 14930 3172 -1129 -4102 2633 -7936 -14452 5140 17712 6490
12893 6490 -17387 -11970 -8368 1913 11415 -250 -841 -14396 -25058 -5919 17564 30897 37580
12880 37580 46547 55734 61289 60486 49341 51169 48439 63874 46582 30298 34451 20216 6560
12867 6560 -2441 -10660 -13503 -196 16610 22783 11989 10530 -6138 -22884 -22315 -18496 -23213 -19637
12853 -19637 -17498 -11953 1704 7903 11867 23930 20703 13910 7703 -4653 -3033 81 -5559 3988
12839 3988 2304 -9272 -19657 -29847 -24718 -17463 -10834 -6173 -15608 -19812 -9149 1296 -1195
12826 -1195 -12140 -19976 -18511 -17874 -13649 6219 28857 36172 23282 18521 27653 32898 34235 41358
12812 41358 62041 95025 108788 96953 110134 121112 107203 101283 103169 104692 105064 99454 89312
12799 89312 60758 55759 51741 50349 59555 65945 55533 39206 44106 36482 33886 14908 1976
12786 1976 3575 9602 7265 1029 -936 1228 8731 -2296 4643 9558 5775 4449 4523 -1001 -2543
12771 -2543 -2379 -10848 -26218 -24702 -5880 11231 11739 13299 14224 9807 6038 2425 -316 -2078 -3551
12756 -3551 21780 42541 35326 24140 23762 21972 10190 19751 37226 45604 44155 51776 59560 66511
12742 66511 63117 79133 85135 74804 73867 71522 75594 82058 82145 103214 133426 161770 210728 269023
12728 269023 357697 539094 822023 1148643 1319309 1241854 1063366 913929 776998 618547
12718 618547 427105 275267 193357 143227 131668 119707 93685 64037 34781 30750 29379
12707 29379 20553 7425 10249 15312 16406 6375 -3164 -13374 -7230 -4691 -4134 -3189 -4460 -14469
12693 -14469 2774 3597 15078 25853 35692 23488 9593 525 -1407 -13072 -16195 -13277 -2812
12680 -2812 96 3427 7099 5967 2769 13669 6007 -5966 -4249 -6132 -12344 -5782 5693 7450
12666 7450 1338 775 10465 13987 7870 6214 10623 -15751 -11330 2183 10006 13256 13623 13522 9148
12651 9148 -8022 -16867 -15135 -11106 1638 3329 -9109 -13890 -4205 4720 -4546 -12559 -5889 2846
12637 2846 4057 7577 4342 -1292 -1087 1650 723 3303 -12547 -2472 5374 12623 6428 -6637
12623 -6637 -4935 12844 -4493 -15073 -16962 -8795 5748 2828 -3299 -4998 4060 5166 -1945 -11506
12609 -11506 -12784 -7699 -5036 9771 11791 -470 -11993 -1920 5674 -1193 722 7582 -4538
12596 -4538 -10285 -4332 1525 -11897 -16610 -17399 -30690 -24820 -18825 -16851 -18035 -5370 5599 3448
12582 3448 -8027 1022 9236 3570 3717 11230 2665 -10719 -8262 -20848 -10956 -6590 -12839 -16571
12568 -16571 -9375 8003 14669 2926 -3584 -9908 -2564 -11291 -14751 -14657 -9684 626 9595 1554
12554 1554 -9399 -16651 -12014 -11915 -24393 -25588 -9519 -989 892 3587 15039 1219 -9641 -17580
12540 -17580 -12016 -6941 15260 37626 49393 33073 25675 6735 -8080 -6451 -6054 -13076 -9560
12527 -9560 -7121 -7790 1400 6654 17801 23972 17576 7141 -4201 -13067 -8604 -11133 -14819 -4651
12513 -4651 -11532 -3449 -6001 -18683 -21117 -20928 -28036 -21480 -12209 -19661 -32253 -17083 1849 -1088
12499 -1088 2203 3888 4353 -1323 475 -3759 3049 -9454 -19004 -19008 -9167 -4718 1768 5718 -6092
12484 -6092 -11974 -17529 -23600 -21120 -25511 -21702 -15006 -14468 -10700 -3402 -13450 -20075 -25599 -30419 -23690
12469 -23690 -15099 -20902 -26326 -27874 -18651 -12456 -17610 -9021 -14314 -13317 -6550 -4271 -6246 -18722
12455 -18722 -25334 -27589 -24653 -32757 -27256 -8583 -12438 -17211 -11102 -9209 -20263 -17073 -10284 -20381
12441 -20381 -26019 -38551 -38123 -25459 -29633 -33985 -29893 -16170 -11512 -16649 -24050 -26838 -34603 -29618
12427 -29618 -14327 168 9020 3602 -1431 -6207 27 3434 4992 2593 -9371 -25076 -23174
12414 -23174 -18492 2671 1429 -7192 -13963 -4574 4056 1138 -3593 8086 19381 28505 29141 18747
12400 18747 1781 662 7991 4934 -9873 -3660 3583 4429 3363 3147 -4543 -2775 6207 1096
12386 1096 7521 11503 15060 9413 9670 11972 12839 7799 -903 2675 13883 16571 1492 -8829
12372 -8829 -18195 -14850 -1278 -2144 -10840 -12862 786 5085 297 2883 9596 12726 4423 -19
12358 -19 5504 21707 30085 32895 37663 28775 22310 20513 15045 11199 2519 1454 2844 -2879 -3139
12343 -3139 -4394 -10815 -6287 66 -2045 2955 -835 -20482 -25714 -13631 -1270 -4365 789 6935
12329 6935 20429 25889 24277 11822 2831 2100 2899 195 7322 8889 21436 12308 5995 -8605
12315 -8605 -12613 -17163 -24021 -21385 -17483 1109 19961 8589 11816 10109 13845 10302 14201 23322
12301 23322 22644 16901 -5677 -5510 6021 9270 11597 5193 5512 -13876 -18956 -10157 -10023 -13743 -15816
12286 -15816 -9042 -11462 -12194 -2948 599 1195 -11747 -16742 -4321 -2406 -2254 -8632 -6192 -7560 -28157
12271 -28157 -26442 -11659 -59 1559 -296 -7025 -4373 -2832 -18009 -15321 6887 19380 10146
12258 10146 -3776 1320 -557 -10794 -1571 9208 998 -13502 -36244 -52512 -44015 -30471 -24339
12245 -24339 -26442 -33102 -13340 1983 -10467 -7166 -1105 -1314 -5036 -2873 3345 11867 12110 6658
12231 6658 -1126 5981 11597 19760 8884 -1584 -5879 -15857 -11362 -10811 3966 9490 16910 19140
12217 19140 18159 20030 18973 5391 10061 13073 6184 8083 14132 11186 5029 12839 16782 2100
12203 2100 5462 22877 27646 28445 24124 24009 1887 -8313 2381 -2743 -17629 -28594 -15523
12190 -15523 -7508 -7928 -8223 -13996 -12914 -6706 2387 385 -9203 -17919 -11465 14480 20250 14019 13880
12175 13880 1187 -23335 -36792 -35096 -28746 -24434 -6985 2732 5751 16047 26271 21302 7620
12162 7620 1856 9448 12021 7072 5998 -9804 -17412 -8526 83 11910 7979 9450 5468 17500
12148 17500 18909 7383 -1829 -5720 -5501 -12986 -9932 1369 -808 8050 20510 24751 15766 20830
12134 20830 30052 39812 31829 24562 26158 26886 13060 8097 5618 5783 1271 -1484 -272 14088
12120 14088 10669 10896 20200 18307 14354 -1141 -8554 -8749 -3102 -3606 7252 5033 -7961 -22037
12106 -22037 -27842 -19175 -22116 -12858 -4725 12759 4746 -1215 -3422 4510 6537 17093 27605 22782
12092 22782 6424 5633 9545 16294 30278 21625 17727 10973 8268 10646 13016 18738 22660 15579
12078 15579 13789 5866 -1667 7087 20278 14372 1670 3832 -6423 -3520 9188 16176 21114
12065 21114 20068 29424 20082 11203 13664 27770 10843 -5263 3097 16869 7139 10913 14114
12052 14114 20784 22012 19902 23112 19485 28088 23214 13293 7100 5207 5830 13596 13946 11026 2250
12037 2250 8706 8606 10838 7887 13079 7735 -2181 -4986 -6611 -10777 -12862 -13034 -15268 -12886 -6422
12022 -6422 13780 18830 24777 17740 15696 7851 9575 8948 1512 8972 23258 36808 31365 15244
12008 15244 20497 12759 5921 5056 13718 20079 12315 9327 21772 24943 18102 7217 11158 18737
11994 18737 18300 19163 15681 18845 24579 25425 24059 6580 13020 22206 18817 28320 28054 22655 10507
11979 10507 22057 33022 38225 60793 75297 79553 82525 92025 103982 123250 154256 169406
11967 169406 187725 215774 264778 317568 373398 442616 564942 757217 1025082 1420825 1936905
11956 1936905 2471165 2912482 3148150 3121076 2893600 2535185 2125055 1727334 1359228 1039976
11946 1039976 791451 611274 482793 402970 346746 316001 306868 294234 273627 268489 296627
11935 296627 333773 366809 401502 439252 456576 433058 410524 385734 378483 374127 374743 377959
11923 377959 414097 460154 517680 621051 761687 972286 1275994 1681368 2192812 2763315
11913 2763315 3324315 3853396 4306826 4592083 4664547 4571807 4414325 4196090 3840750 3334839
11903 3334839 2758298 2231634 1790473 1429805 1118683 870159 688212 563252 478599 417702
11893 417702 372484 367414 373181 381553 393239 398364 395445 374815 351417 327782 296223 271549
11881 271549 267007 279921 302132 303860 326526 367459 387300 428310 505461 617647 781334
11870 781334 1014822 1367385 1853798 2410105 2938477 3310906 3425748 3281920 2955912 2528645
11860 2528645 2075405 1639087 1259955 952067 692782 511354 400763 325444 288798 246541
11850 246541 192312 150794 135295 120640 106868 108216 94898 86049 69074 51891 40233 31783
11838 31783 28196 28538 24374 32756 36486 35509 41088 51895 48677 43928 39245 31743 37483 40461 33019
11823 33019 25297 15025 19550 32791 36207 37228 34411 26447 17357 26446 26551 34108 31781 19083
11809 19083 14717 13311 12902 12550 13733 23021 30332 29529 24368 19465 7358 -7988 -921 13782
11795 13782 12549 12616 4072 -4562 3423 -1471 -8185 483 9704 24657 16293 26301 36790 42699
11781 42699 36513 23105 7928 7053 4753 7305 19396 22024 21354 19514 23621 26594 19080 13085
11767 13085 10723 6803 6997 3800 -10205 -16326 -8814 9476 9528 -2943 -14296 -19115 -4187 -2115
11753 -2115 525 -5176 -11837 -15818 -17360 -24930 -27078 -19446 -10744 -3807 -469 145 4015 -4864 -5432
11738 -5432 4538 11452 11855 6338 16988 33020 35307 22474 19057 15552 16534 11810 -4380 2469
11724 2469 -12124 -24084 -19889 -6987 1669 -3129 -6826 -20757 -41114 -41118 -27404 -14899 -11096 -6732
11710 -6732 1808 20556 13087 1271 -6513 -8789 2846 -2336 -3074 -3262 -8823 -7446 -18373 -28100
11696 -28100 -22007 -20552 -10977 -5978 -677 5531 6033 4512 -7550 -14857 -5908 -483 -2093 875
11682 875 -1872 -3027 -7178 -15100 -5475 -14774 -23421 -23235 -15724 -22546 -25357 -17217 -20178 -19581 -15996
11667 -15996 -10245 -8103 -364 1391 3979 3865 9824 15508 7378 -2777 -7991 4439 11642 6098
11653 6098 2861 -3972 3658 8102 4018 -8255 -16818 -25251 -29334 -18695 -5258 -4005 -13718 -7175
11639 -7175 -18943 -21797 -20674 -16579 -16165 -27093 -31076 -35179 -21500 -25757 -33842 -23841 -26596 -30224
11625 -30224 -28834 -24199 -21342 -11946 778 -3525 -6594 835 10216 15208 6154 54 5656 5195
11611 5195 13480 -4646 -5598 -15263 -26166 -21559 -14463 -18966 -1454 -3759 -12905 -11184 -9423 -139
11597 -139 3878 6957 2519 8430 6292 -227 -6771 -8975 -7970 -3915 11270 8802 9354 4893 -1806
11582 -1806 -7460 -10365 -8135 -10505 -9437 -6032 -6080 -15123 -17239 -12028 -13144 -1459 4128 -7745 -5773
11567 -5773 -7723 1024 5080 -2534 -5716 2759 11362 15360 16018 13454 -1374 -13356 -7942 -10888
11553 -10888 -11888 -5970 -5000 1552 6273 3381 430 10351 4843 3590 1272 14407 15790 9179
11539 9179 6552 2726 381 -3695 -7648 -12006 -10453 -11367 -9564 -11407 -9450 -2440 -4027 -13631 -9601
11524 -9601 -7510 -8412 -9770 -6181 3398 4061 1842 10366 5626 2506 9970 18004 35792 39974 41547
11509 41547 57793 67967 79431 86174 85685 77789 74819 74628 64119 45206 36243 37060 26137 15173
11495 15173 1722 4381 81 -486 -10903 -9530 -11040 -16261 -28549 -37641 -22819 -9309 -5759
11482 -5759 11097 8346 -1342 -8459 -23956 -19639 -18622 -10836 -7640 -11759 -9633 -1371 2798 7108
11468 7108 2290 -5959 -10766 -15551 -8689 105 3711 5984 9504 3511 -6777 -4962 2903 13119
11454 13119 14525 8263 6934 -1314 -5078 -2241 -14142 -23078 -18441 -19157 -12932 -6476 -25387 -29199
11440 -29199 -19675 -15248 -15479 -20295 -29065 -17662 -7288 -6420 -3603 -61 -8148 -16073 -26048 -38307
11426 -38307 -29113 -28373 -19951 -19130 -10801 -73 1168 2202 17546 4299 -638 17751 10294 -6711
11412 -6711 -13518 962 16646 8803 18760 20941 13159 13309 -1248 -4612 -16214 -11386 -6517 -19518
11398 -19518 -28316 -23751 -22043 -23945 -12714 -786 4009 6921 11523 1967 -2412 -3431 -2238 -14256
11384 -14256 -15758 -23333 -33734 -24231 -23023 -22868 -22940 -26311 -33868 -29421 -33213 -34427 -29986 -12251 -14150
11369 -14150 -13017 -13254 -448 7601 9146 1937 -6205 -4444 16092 18729 10133 822 2926 -5079
11355 -5079 -11567 425 14293 19014 14993 9865 -5228 -4665 -10746 -23345 -17461 -19841 -26880 -24783
11341 -24783 -12572 -4214 -16808 -7339 -5336 -3272 -91 -13516 -17577 -22488 -9370 -9259 -6728 -4071
11327 -4071 -4824 -13336 -7147 -7396 -3687 -1527 15405 10466 3017 443 11440 16350 8243 -1996
11313 -1996 -7014 -23655 -34133 -38204 -22673 -8744 -24233 -14191 -5362 -8124 -14986 -5379 -9755
11300 -9755 -25403 -28267 -25431 -17384 -11993 -20784 -20862 -15311 -10556 -14242 -32842 -42193 -36112 -18928
11286 -18928 -4168 -5817 -8312 -2974 17616 9104 -1339 663 6581 3267 -7925 -12398 -24700
11273 -24700 -29599 -31665 -15146 -9362 -5723 -3798 -12818 -13776 1141 11890 10033 2113 -3573 404
11259 404 9623 14446 19313 6066 -8240 1006 -4923 -13056 -14852 -17884 -15164 -6177 -1285 -4276
11245 -4276 -6668 -7681 -9505 -16384 -16986 -25092 -10702 5413 16892 10953 3896 635 4353 -5417
11231 -5417 -6465 -10979 2488 13374 27100 37024 39297 28394 20619 8746 10954 13877 14128 25621
11217 25621 29890 34909 27896 17984 -8326 -26187 -17889 -9571 -21218 -21997 -32323 -19643 -11910
11204 -11910 -13123 -15527 -10378 -3113 14876 31633 40029 31857 24862 22333 22858 20882 3159 12246
11190 12246 14320 11791 15260 15210 16337 19060 28304 34323 25532 16234 16315 25010 33788 30941 33057
11175 33057 31575 18156 16011 12161 4438 9775 18395 28347 26212 15688 20093 17609 13563 18584
11161 18584 35730 42381 50363 51793 38341 34130 39411 29142 31005 23384 23314 26774 28661 31219
11147 31219 26051 30647 29045 36436 27676 18144 24215 34844 44210 38352 30676 25409 31519 43975
11133 43975 38207 30527 41468 39295 42974 47665 52984 60103 51870 57543 71872 72389 59627 61266
11119 61266 70978 84601 89455 84349 91327 94159 98077 102256 107510 117931 137714 134558 132923 130148
$$ [...]
##END NTUPLES=NMR SPECTRUM
##END=
