##TITLE=Analysis number 320163
Compound Code ac 35192
Project Code adrs
Chemist Name acros
##JCAMPDX= 6.0         $$ Bruker NMR JCAMP-DX V2.0
##DATA TYPE= NMR SPECTRUM
##DATA CLASS= NTUPLES
##ORIGIN= Bruker BioSpin GmbH
##OWNER= nmr
$$ XWIN-NMR		Version 3.5
$$ Thu Jun 15 09:47:01 2006 GMT Daylight Time (UT+1h)  MAYBRIDGE\nmr@NMR_250MHZ
##.OBSERVE FREQUENCY= 250.131544655141
##.OBSERVE NUCLEUS= ^1H
##.ACQUISITION MODE= SIMULTANEOUS (DQD)
##.ACQUISITION SCHEME= undefined
##.AVERAGES= 16
##.DIGITISER RES= 18
##SPECTROMETER/DATA SYSTEM= dpx250
##.PULSE SEQUENCE= zg30
##.SOLVENT NAME= CDCl3
##.SHIFT REFERENCE= (INTERNAL, CDCl3, 0, 16.522)
##AUDIT TRAIL= $$ (NUMBER, WHEN, WHO, WHERE, WHAT)
$$ ##TITLE= Audit trail, XWIN-NMR		Version 3.5
$$ ##JCAMPDX= 5.01
$$ ##ORIGIN= Bruker BioSpin GmbH
$$ ##OWNER= nmr
$$ C:\u/data/dgb/nmr/ADRS/830/pdata/1/auditp.txt
$$ ##AUDIT TRAIL=  $$ (NUMBER, WHEN, WHO, WHERE, WHAT)
(   1,<2006-06-15 09:46:31.14 +100>,<MAYBRIDGE\nmr>,<NMR_250MHZ>,
      <created by zg, POWCHK disabled, PULCHK disabled
       configuration hash MD5:
       E2 DF 36 D8 04 B2 41 60 5A D7 A3 38 5A 4B D0 FE
       data hash MD5: 64K
       86 BE 89 02 78 A8 96 F0 EA 4F 22 9C F3 27 12 38>)
(   2,<2006-06-15 09:46:46.58 +100>,<MAYBRIDGE\nmr>,<NMR_250MHZ>,
      <Start of raw data processing
       ef LB = 0.3 FT_mod = 6 PKNL = 1 SI = 32K 
       data hash MD5: 32K
       EE 40 CC 29 0D 5C AC DB AE 62 7E B7 DE 03 EC DE>)
(   3,<2006-06-15 09:46:48.18 +100>,<MAYBRIDGE\nmr>,<NMR_250MHZ>,
      <apk 
       data hash MD5: 32K
       35 3C 55 4C 10 7E 97 8C 9B FB FC E5 59 15 B4 9B>)
(   4,<2006-06-15 09:46:49.09 +100>,<MAYBRIDGE\nmr>,<NMR_250MHZ>,
      <abs ABSG = 5 
       data hash MD5: 32K
       69 7E 39 6F CB E4 B0 67 A6 86 6E D6 15 98 1D EC>)
$$ ##END=
$$ 
$$ hash MD5
$$ 79 8A 1D F0 1C 78 66 A0 55 6E 40 C0 CF B3 40 84
##$RELAX= 
##$RELAX= 
##$RELAX= 
##$RELAX= 
##$RELAX= 
##$RELAX= 
##$RELAX= 
$$ Bruker specific parameters
$$ --------------------------
##$DU= <C:\u>
##$EXPNO= 830
##$NAME= <ADRS>
##$PROCNO= 1
##$TYPE= <nmr>
##$USER= <dgb>
##$AMP= (0..31)
100 100 100 100 100 100 100 100 100 100 100 100 100 100 100 100 100 100 
100 100 100 100 100 100 100 100 100 100 100 100 100 100 
##$AQSEQ= 0
##$AQ_mod= 3
##$AUNM= <au_zg>
##$AUTOPOS= <27 >
##$BF1= 250.13
##$BF2= 250.13
##$BF3= 250.13
##$BF4= 250.13
##$BF5= 500.13
##$BF6= 500.13
##$BF7= 500.13
##$BF8= 500.13
##$BYTORDA= 1
##$CFDGTYP= 0
##$CFRGTYP= 5
##$CHEMSTR= <none>
##$CNST= (0..31)
1 1 145 1 1 1 1 1 1 1 1 1 1 1 1 1 1 1 1 1 1 1 1 1 1 1 1 1 1 1 1 1 
##$CPDPRG= <>
##$CPDPRG1= <>
##$CPDPRG2= <>
##$CPDPRG3= <>
##$CPDPRG4= <mlev>
##$CPDPRG5= <mlev>
##$CPDPRG6= <mlev>
##$CPDPRG7= <mlev>
##$CPDPRG8= <mlev>
##$CPDPRGB= <>
##$CPDPRGT= <>
##$D= (0..31)
0 1 0 0 0 0 0 0 0 0.06 0 0 0 0 0 0 0.0002 0 0 0 0 0 0 0 0 0 0 0 0 0 0 
0 
##$DATE= 1150361190
##$DBL= (0..7)
120 120 120 120 120 120 120 120 
##$DBP= (0..7)
150 150 150 150 150 150 150 150 
##$DBP07= 0
##$DBPNAM0= <>
##$DBPNAM1= <>
##$DBPNAM2= <>
##$DBPNAM3= <>
$$ [...]
##$SUBNAM7= <"">
##$SUBNAM8= <"">
##$SUBNAM9= <"">
##$SW= 20.6930455092707
##$SWIBOX= (0..15)
0 0 3 0 0 0 0 0 0 0 0 0 0 0 0 0 
##$SW_h= 5175.983436853
##$TD= 65536
##$TD0= 1
##$TE= 294.16
##$TE2= 300
##$TE3= 300
##$TEG= 300
##$TL= (0..7)
0 120 120 120 120 120 120 120 
##$TP= (0..7)
150 150 150 150 150 150 150 150 
##$TP07= 0
##$TPNAME0= <>
##$TPNAME1= <>
##$TPNAME2= <>
##$TPNAME3= <>
##$TPNAME4= <>
##$TPNAME5= <>
##$TPNAME6= <>
##$TPNAME7= <>
##$TPOAL= (0..7)
0.5 0.5 0.5 0.5 0.5 0.5 0.5 0.5 
##$TPOFFS= (0..7)
0 0 0 0 0 0 0 0 
##$TUNHIN= 0
##$TUNHOUT= 0
##$TUNXOUT= 0
##$USERA1= <user>
##$USERA2= <user>
##$USERA3= <user>
##$USERA4= <user>
##$USERA5= <user>
##$V9= 5
##$VALIST= <valist>
##$VCLIST= <CCCCCCCCCCCCCCC>
##$VD= 0
##$VDLIST= <DDDDDDDDDDDDDDD>
##$VPLIST= <PPPPPPPPPPPPPPP>
##$VTLIST= <TTTTTTTTTTTTTTT>
##$WBST= 1024
##$WBSW= 4
##$XGAIN= (0..3)
0 0 0 0 
##$XL= 0
##$YL= 0
##$YMAX_a= 420229
##$YMIN_a= -573017
##$ZGOPTNS= <>
##$ZL1= 120
##$ZL2= 120
##$ZL3= 120
##$ZL4= 120
##$ABSF1= 16.522
##$ABSF2= -4.171173
##$ABSG= 5
##$ABSL= 3
##$ALPHA= 0
##$AQORDER= 0
##$ASSFAC= 0
##$ASSFACI= 0
##$ASSFACX= 0
##$ASSWID= 0
##$AUNMP= <proc_1d>
##$AZFE= 0.1
##$AZFW= 0.1
##$BCFW= 0
##$BC_mod= 0
##$BYTORDP= 0
##$COROFFS= 0
##$CY= 12.5
##$DATMOD= 1
##$DC= 0
##$DFILT= <>
##$DTYPP= 0
##$F1P= 14.0000005364418
##$F2P= -0.99999901652339
##$FCOR= 0.5
##$FTSIZE= 32768
##$FT_mod= 6
##$GAMMA= 0
##$GB= 0
##$INTBC= 1
##$INTSCL= 1
##$ISEN= 128
##$LB= 0.3
##$LEV0= 0
##$LPBIN= 0
##$MAXI= 10000
##$MC2= 0
##$MEAN= 0
##$ME_mod= 0
##$MI= 0
##$NCOEF= 0
##$NC_proc= -4
##$NLEV= 6
##$NOISF1= 0
##$NOISF2= 0
##$NSP= 0
##$NTH_PI= 0
##$NZP= 0
##$OFFSET= 16.522
##$PC= 1
##$PHC0= 169.5412
##$PHC1= 11.3312
##$PH_mod= 1
##$PKNL= yes
##$PPARMOD= 0
##$PSCAL= 4
##$PSIGN= 0
##$REVERSE= no
##$SF= 250.13
##$SI= 32768
##$SIGF1= 0
##$SIGF2= 0
##$SINO= 400
##$SIOLD= 32768
##$SREGLST= <1H.CDCl3>
##$SSB= 0
##$STSI= 32768
##$STSR= 0
##$SW_p= 5175.98343685301
##$SYMM= 0
##$S_DEV= 0
##$TDeff= 65536
##$TDoff= 0
##$TI= <Analysis number 999999
Compound Code 99
Book Reference 9
Project Code 9>
##$TILT= no
##$TM1= 0
##$TM2= 0
##$TOPLEV= 0
##$USERP1= <user>
##$USERP2= <user>
##$USERP3= <user>
##$USERP4= <user>
##$USERP5= <user>
##$WDW= 1
##$XDIM= 32768
##$YMAX_p= 298077533
##$YMIN_p= -135823
$$ End of Bruker specific parameters
$$ ---------------------------------
##NTUPLES= NMR SPECTRUM
##VAR_NAME=  FREQUENCY,     SPECTRUM/REAL,   SPECTRUM/IMAG
##SYMBOL=    X,             R,               I
##VAR_TYPE=  INDEPENDENT,   DEPENDENT,       DEPENDENT
##VAR_FORM=  AFFN,          ASDF,            ASDF
##VAR_DIM=   32768,         32768,           32768
##UNITS=     HZ,            ARBITRARY UNITS, ARBITRARY UNITS
##FACTOR=    0.157963299565203, 1,           1
##FIRST=     4132.6476996994, 0,             0
##LAST=      -1043.33573715361, 0,           0
##MIN=       -1043.33573715361, -135823,     0
##MAX=       4132.6476996994, 298077533,     0
$$ Real data points
##PAGE= N=1
##DATA TABLE= (X++(R..R)), XYDATA
$$ [...]
30762 5024 -16421 -26773 -3197 10485 18076 12590 10659 12360 5311 -4519 12725 34263 14162
30749 14162 -7712 -5507 -8884 -4416 -17194 -37187 -39085 -43227 -53010 -48787 -33694 -40211 -22699
30736 -22699 -13115 -19384 -31665 -29175 -11125 -27568 -24181 -41406 -46583 -48391 -53133 -45920 -33128
30723 -33128 -24955 -23998 -31568 -46483 -31997 -5040 -20645 -31300 -16304 -15038 -18100 -21978 3421
30710 3421 19542 2948 -22482 -19167 -9206 10926 19327 -16384 -46220 -47317 -24937 -15927 -40834
30697 -40834 -25170 -20777 -18944 -3062 6318 11192 -19484 4036 19439 -10718 -17213 -14455 -8567
30684 -8567 -18966 10457 26717 9621 14216 8124 -18812 -11033 30610 7586 -27172 -20854 -26796
30671 -26796 -22670 -25355 -45868 -26142 4561 28123 36078 9939 -36215 -62208 -68821 -43734
30659 -43734 -18346 -11295 -30621 -24044 3653 5542 15011 21550 2990 -17383 -28675 -992 1699
30646 1699 -5197 -6828 -30909 -25495 -19515 3093 35474 11099 -26118 -22235 3263 10119 15029
30633 15029 -4621 -16268 2814 401 -6323 3573 20029 49790 18883 13426 2972 1495 11251
30620 11251 373 -15162 -3050 3166 -17820 -18136 -35990 -27725 -32485 -15323 -36440 -52010 -44722
30607 -44722 -29485 10165 -6693 -28228 -20446 19776 14031 -5220 -17 5876 1871 -16045 -10557
30594 -10557 -6972 -26710 -27065 -4673 -17933 -1611 17359 11151 -923 -3989 -7006 -26650 -32813
30581 -32813 -40593 -10488 -13422 -22457 12314 12577 -2508 17870 22885 19040 6658 -9290 -26119
30568 -26119 -41274 -24410 -7043 16341 53949 34695 -9552 -36924 -7733 5587 13936 29190
30556 29190 19038 -11624 -35173 -23544 -34649 -55318 -37654 -26 18254 12695 19533 -25289
30544 -25289 -33695 -31083 -53581 -46962 -30958 -32215 -5577 -22140 -36168 -20279 -2921 -5076 -10806
30531 -10806 3915 19591 13396 -1747 -5947 17292 -11148 -17906 -17436 2424 -1749 -2176 6342
30518 6342 -403 21494 32431 29758 -642 -5695 -1365 16534 28554 20802 -8832 -14695 4607
30505 4607 22529 34404 17762 3597 1130 -3899 -5721 -16422 -22794 -14613 -8006 20960 24710
30492 24710 25923 19353 18552 2106 -5588 13409 38050 34855 15673 14780 71944 90713 68374
30479 68374 56131 22073 -1352 43202 40426 42516 44539 13154 -10342 -5204 28472 33202 50924
30466 50924 34693 39621 3369 -19222 4582 35181 39329 32095 42035 28287 29684 53287 65219
30453 65219 36892 -17621 -30112 -5431 4472 2500 -10336 -29382 -33594 -28961 -17723 -32458
30441 -32458 -63978 -51532 -32922 -17766 2960 -9161 -15217 -15877 -26466 -33047 -38617 -27469 -18815
30428 -18815 -8356 -13664 -29632 -12557 -1042 7450 18559 8707 -32698 -8303 13011 -1616
30416 -1616 -8186 -5791 -11023 -2267 2815 1420 -9024 -4313 9185 19010 35134 7307 172 11647
30402 11647 27580 26029 28318 36075 28093 25942 21830 -20541 -26785 13424 -6454 -17279 21137
30389 21137 57516 37164 11908 18418 37440 55627 64169 42165 35823 44384 60177 53020 28644
30376 28644 -13083 -21666 -28938 -46241 -24750 -1787 -7564 10077 5335 9547 21913 15062 -14626
30363 -14626 -13340 6691 -12428 -3164 -17586 -8926 22048 22769 -7606 -19105 19040 24839 34676
30350 34676 41860 45918 33377 -14768 -29447 -26437 -22429 -5807 1860 13947 18419 -9497 -7789
30337 -7789 1818 12466 -12016 -16189 -18815 10786 32695 24997 34473 32792 580 -10480 -27807
30324 -27807 -45563 -2179 15957 16498 -12002 -18442 27767 66560 44849 6773 -30573 -38809
30312 -38809 -37965 -37976 -46070 -13857 17421 34446 11789 -1417 21338 30340 23168 36747 41858
30299 41858 22459 4169 22214 47012 35147 36185 18537 -5835 16210 -4960 -23082 -12277
30287 -12277 9326 3272 -18802 -33927 -34179 -23122 -12095 9595 27602 26073 19256 50819 70557
30274 70557 69447 63855 49409 40971 63471 45026 -497 -36458 -23637 -11766 -24260 -23411 -19978
30261 -19978 -20970 2735 -2311 5557 -1870 -2913 12012 30550 53468 65149 51488 41702 25677
30248 25677 23064 26568 22196 32002 22953 21543 6604 -7731 -4640 241 17146 35469 9487
30235 9487 6334 18420 14967 -27810 -38118 -9291 -27851 -39502 -5976 -16544 -24906 -242
30223 -242 -7300 -9021 334 -8938 -47000 -63840 -29562 -9763 -32725 -40985 -12364 2834 -11749
30210 -11749 -2674 21823 50035 27575 12616 8449 -13712 -8602 10712 6797 1721 9895 26171
30197 26171 43497 23075 7042 -5985 -8427 -17853 -18737 15585 29238 8554 -12581 -5347 -4045
30184 -4045 -356 7314 14458 14542 10031 2415 -27965 -32249 4299 25953 32783 45808 31386 1963
30170 1963 5977 -2421 -36582 -20751 8261 1385 -5774 -12107 -962 -3510 -8059 3255 -6937
30157 -6937 -50928 -51540 -48860 -29349 -32182 -22275 -2026 1272 21151 31947 22460 8350 19737
30144 19737 20067 12984 -5062 -26577 -16987 -7202 1690 -4930 -8364 -11286 -29520 -33313 -3870 9427
30130 9427 -4586 16474 33073 15556 -16563 -23561 -32418 -33827 -27690 -169 29320 23561 11029
30117 11029 27158 41035 18616 -5914 -23903 -16720 -16753 9478 41374 50402 22236 15650 26031
30104 26031 17619 3546 1930 12457 -2758 -27057 -23356 -29237 4092 15418 3084 -14454
30092 -14454 -26105 -39695 -53355 -53442 -22059 -25940 -30184 -25023 -5657 -2400 -26052 -35738 -28634
30079 -28634 -24016 -8715 10408 7197 -30687 -67923 -53491 -36200 -39438 -31052 -15405 1118
30067 1118 -17274 -6585 -14873 -22330 -29225 -28484 -36257 -42094 -55392 -52432 -23841 -12208 -32797
30054 -32797 -67862 -47521 -14988 -17833 -24057 -13178 -19079 -16279 -7637 -8809 10912 -12419 -21766
30041 -21766 16244 6231 -4007 -27612 -63200 -39583 -5799 -9864 -30216 -42271 -60825 -43293
30029 -43293 -61758 -68548 -79867 -49378 4085 45385 34743 11692 667 18870 13430 19152
30017 19152 -11532 -9181 -6438 6537 43049 29410 -8415 -22439 9749 15441 6545 -6613
30005 -6613 -7122 -947 9764 26352 18834 -8483 -39805 -30417 -9848 -11637 -23791 -14919 -3374
29992 -3374 12461 3639 -1718 -7182 930 16085 47868 53114 48174 57238 30112 3797 -7974
29979 -7974 -22729 -51270 -62694 -61494 -39977 -12337 24036 9321 -30903 -26817 23343 41626
29967 41626 19586 11141 8226 41924 32161 19175 15371 21221 -6385 -32734 -34195 -27316 -25913
29954 -25913 -18975 22172 33498 31708 37490 62708 63707 38107 38130 45103 38719 26306 31888 31322
29940 31322 40720 35860 31817 21463 4439 2551 21619 17985 3022 2692 -8529 11848 49290
29927 49290 63154 59872 53400 17745 20960 12601 16667 25952 15375 -14129 -16309 3783 20441
29914 20441 30903 31305 -10089 8162 25409 8326 6602 14292 13854 18170 556 -34347 -37531
29901 -37531 -19748 -28334 -9228 30445 16237 6781 7185 -6943 -27462 -11760 6038 -4737
29889 -4737 4479 16513 25200 18947 -11703 -22076 -19782 6112 11035 40368 38270 1117 -6503
29876 -6503 -14082 10395 25833 11921 24338 405 -28263 -44402 -30371 -10450 -20691 -18779
29864 -18779 20209 35443 36814 21091 12197 5437 -5360 7222 51821 22935 -4129 16625
29852 16625 4152 -22783 -43231 -59438 -510 38718 16951 49515 52679 26887 26757 40012
29840 40012 8835 -9728 -22826 -30359 -17258 -13951 -12087 -6489 16703 27096 29741 11551 -16669
29827 -16669 -30085 -9424 -15837 2803 8853 17419 7977 -14370 -41572 -25752 -3567 18582
29815 18582 23040 11944 12764 10756 15454 15409 9147 18260 21398 24201 28233 69289 83208 55013
29801 55013 49091 37542 39353 42364 42578 -3640 -18059 13042 21862 18217 23666 34071 31977
29788 31977 22914 -1435 -22049 -20989 -36588 -29394 7219 17288 36014 25038 -15385 -14042
29776 -14042 -20296 -11848 -5573 -7780 -11464 -6228 11603 18836 17010 14458 -1306 -16844 -31596
29763 -31596 -14448 -19026 -39352 -18095 177 -3033 5184 16970 25709 20719 37650 33676 22918
29750 22918 35508 27382 22139 44200 48042 24451 17483 10089 -23651 -32342 -11313 13830 15211
29737 15211 6306 -6476 -12531 858 27929 14113 18692 15457 6155 3287 36113 41691 42724
29724 42724 17551 13905 28956 56340 60530 42627 11524 353 5180 -3210 -4449 -17648 -3105
29711 -3105 10402 -10164 -16942 -33011 -19246 -27298 -30727 -14678 -2300 1308 31989 26122 24637
29698 24637 21257 7462 17131 26396 -5242 -16713 -2101 33103 41165 18220 12407 15589 10296
29685 10296 19142 28394 -2656 -1545 20750 15122 24865 18366 8127 -6709 -13141 -14537 -13603 -1243
29671 -1243 16361 26261 42418 64337 50469 36857 26655 40079 52642 26914 16252 6038
29659 6038 17139 10984 12981 10725 12155 -736 -5853 -6918 -1682 -1887 25514 10080 20936 -832
29645 -832 -12235 -9218 -4723 3720 -1917 -51944 -48536 -22723 -3335 7825 -11410 -9922 -5072
29632 -5072 2005 -5476 -35959 -24331 -17874 -17039 -316 25985 4181 -33390 -40068 -15058 -17611
29619 -17611 -28014 -1010 -1828 -6943 -3656 -998 -18502 -43526 -27378 -3166 20094 -1926 -48334
29606 -48334 -61125 -12858 -16304 -37110 -15374 -13188 -11377 -25712 -32083 -9722 -8301 -26988 5332
29593 5332 19289 -9820 -33006 -9415 16606 33611 15267 -16216 -29696 -31315 -7942 -4051
29581 -4051 4972 27096 78 -22593 -45776 -37246 -21205 -29276 -13372 -27097 -2672 -16364
29569 -16364 -43879 -62564 -59004 -53440 -45654 -16671 -6209 -19017 -9592 -1007 9020 13102 16892
29556 16892 6919 -5649 -15511 -33584 -51046 -29137 -4569 5896 20298 36898 60333 52820
29544 52820 45635 43980 46391 53326 44888 38889 28027 -16962 -49449 -35731 -27714 -28794 7970
29531 7970 48786 9637 18293 32266 33618 17239 25646 26940 22391 7888 -5503 17588 -2035
29518 -2035 -28113 -30504 -22192 -41485 -40956 -35424 -24683 -4515 18952 23835 37229 44294 33619
29505 33619 18660 18749 13317 -6717 -6378 13343 21817 47997 32519 41827 50445 43565 5503 -31226
29491 -31226 -23084 -10694 -40127 -25111 -8051 1902 -5327 -16999 -41525 -22104 -1638 15154
29479 15154 25546 16114 27268 37427 45118 59795 46263 51452 58825 38557 37426 56563 72861
29466 72861 48547 44390 14051 10864 -1868 -9037 -8997 -13646 12904 27011 29158 47070 52310
29453 52310 32336 36600 20441 -6082 -2542 10218 24554 19706 -8551 -9269 1145 25512 22628
29440 22628 26213 -11823 -32733 -32041 -20086 -4477 -2533 -7391 12825 3595 7390 28600 51637
29427 51637 45154 21902 24926 44040 37706 33489 49139 40917 28541 18873 27579 28905 6764
29414 6764 15291 3945 -12516 -45807 -25838 -2994 14887 38149 31845 31958 14771 23899 25964
29401 25964 25693 27310 22068 322 -29461 -23964 -11794 -13982 69 18387 3703 -12770 -8304
29388 -8304 19414 12509 32464 49088 50063 27505 7107 20174 16795 32224 45222 33262 51924
29375 51924 42715 15234 16745 31664 30974 52721 74551 78059 58260 39978 9588 -8118 -13573
29362 -13573 -7895 24426 32438 17955 2671 -8484 -24425 -21286 2516 32271 4235 6376
29350 6376 23637 12728 -18037 -31415 -1356 17875 9638 -18616 -24266 -19315 3083 -4336 -2621
29337 -2621 -11534 -7347 4236 -15665 -24876 2294 -3370 -14779 -10665 -7800 -12549 -17836 -12002 -436
29323 -436 1457 8093 119 -7708 -11710 -7165 15713 6143 3887 14039 5729 29246 46499 29333
29309 29333 19264 14606 14430 4272 274 13724 22591 34750 28685 -5129 13312 48136 85001
29296 85001 77584 55169 24041 -4727 10184 24804 5816 -3086 -4099 9260 16879 21991 18237
29283 18237 6263 -12307 -12822 23052 46079 25606 52363 61901 56331 59290 55031 47338 45072
29270 45072 22964 4981 -25314 -18413 -29953 -19469 -43181 -31435 -12926 -16949 1807 24919
29258 24919 19319 9813 13062 27601 41413 20521 -9791 -30522 -4892 3672 7966 1011 9333
29245 9333 8285 -18493 -22059 6205 37656 34572 13276 8341 -9310 -12766 -38972 -58121 -35480
29232 -35480 -33875 -24192 -4994 -13010 -14328 8572 28348 42944 63126 35875 37790 24569 -24345
29219 -24345 -4766 -14734 -7893 18309 32768 16852 -7406 3201 -2187 -4326 -23300 -14579 -687
29206 -687 -37787 -66976 -32763 -17308 -11462 -9373 -904 12956 20344 20873 980 -13143 -1372
29193 -1372 -8423 7641 46936 43079 17432 1207 -5979 -21513 -14075 -25224 -24755 -11641 -17635
29180 -17635 -33180 -21185 -47094 -32227 -9642 2190 -19742 -41231 -8117 -20253 -37897 -33647
29168 -33647 -26400 -8156 3079 5120 34065 37531 21456 -138 32904 35890 12908 22400 23454
29155 23454 34543 25032 -2505 -28170 -12140 3476 7714 32976 15952 -19472 -23307 -18883
29143 -18883 -16739 -4697 399 -7698 5949 8476 10748 -5858 -4018 -5254 -31250 -40914 -32413
29130 -32413 -26769 -30495 -26607 10472 31789 24851 43188 46187 -9540 -16720 10234 13819 6449
29117 6449 -14575 -22266 -18615 3086 24088 14499 6598 -9626 -8120 25014 46445 26945 23987
29104 23987 19835 8713 17938 26496 32365 15718 -2163 13099 41317 30206 2641 1650 17166
29091 17166 21447 8438 -276 14841 43548 51891 29791 32041 24472 -3060 -5718 -20113 -34880
29078 -34880 -30911 -16590 1576 -4882 -18892 6434 6536 -2296 -3623 979 -713 -1498 -5676 3420
29064 3420 2048 -16303 3158 37140 18705 868 6205 1698 2921 13867 24405 19194 20077
29051 20077 7554 19570 32430 -2225 -17145 -26136 -9215 -13976 -20561 -17296 -18376 10150 46010
29038 46010 45962 14543 -3360 -4424 -9509 -402 15646 3034 8562 29302 36244 49312 40230
29025 40230 38416 23768 -14785 -23314 -19389 -29079 -41019 -21861 8542 -5074 -40929 -29410
29013 -29410 -33744 -15599 38765 69370 58898 63819 42638 34271 32803 31305 5994 7881 4373
29000 4373 -4361 291 29293 27610 23848 16036 20178 -17040 -11627 -202 -3469 -7815 -1914 13032
28986 13032 3586 -28733 -44521 -53861 -27993 -8283 19119 6429 5046 13828 26697 24322 26532
28973 26532 7776 -23456 -50735 -23474 757 13097 30327 62900 68289 41429 26785 -268
28961 -268 -29576 -28420 -37812 -37585 -3534 32699 9261 -12203 15305 35833 42793 63602 65665
28948 65665 73965 71257 71465 66581 42490 18595 37433 62956 72808 83464 38406 -1081 4218
28935 4218 -13348 6997 10035 6246 12728 -6629 -5863 232 -11530 -12252 -29248 -50258 -45650 -34647
28921 -34647 -38810 -27614 -4879 26477 40703 37521 25359 20087 -31180 -65045 -32179 8470
28909 8470 12723 -1949 -3713 30899 48669 44328 38734 34624 24859 12479 15208 44073 54824
28896 54824 29739 27665 41679 32196 -2024 10947 30040 49102 27362 -9719 -7371 18636
28884 18636 24514 8888 -1653 20208 33542 34733 49811 48001 51287 74601 57740 20319
28872 20319 9321 44718 44201 4434 6161 9440 7364 33498 24896 13361 22865 5840 5592
28859 5592 23203 38063 51557 66339 57831 43676 23250 5617 25330 28218 43975 59378
28847 59378 45395 20492 -25576 -6106 43026 40943 3688 -25558 -16627 -944 -5344 -17570
28835 -17570 -1963 9223 5929 14917 12558 -18736 -55145 -46729 -27276 -26815 -14756 15680 5470
28822 5470 5984 1248 22257 40077 23402 -14965 662 24257 24499 28441 39560 40835 6500
28809 6500 -2182 -15076 -58 37486 34441 28674 -555 -2326 -19373 -28064 -24017 -15322 -8818
28796 -8818 10140 1735 -2874 -6862 -11751 8032 66663 28568 -13383 6025 9506 8754 9157 11025
28782 11025 29778 51746 37491 592 -11613 -26952 -13761 -16027 18448 5041 127 12767
28770 12767 6226 28751 36358 18346 14731 32519 14007 -7762 1256 6822 17890 18183 14197
28757 14197 7421 10035 33822 14264 -17791 -21746 -5808 10155 -643 -20954 -12348 6866
28745 6866 18294 2263 -18142 -34039 -8629 8176 17157 19274 12522 21109 36798 25622 6909
28732 6909 -3725 -10380 -3267 -26 -321 9601 4907 17831 26380 23237 14012 -23681 1064 19369
28718 19369 -5782 -26509 -15323 -12988 19796 24851 4449 -1124 -7725 -12205 -1897 -9331 -6253
28705 -6253 -20552 -40155 -25762 -26023 -11968 12604 18989 -16342 -35922 -55199 -52708 -56877 -62408
28692 -62408 -55961 -53429 -36298 -18156 -33186 -30742 -26656 -9446 10507 26314 34081 30775 16112
28679 16112 9618 2647 -24149 -22709 -13882 6563 20692 22161 46381 17051 -6308 11581 28476
28666 28476 24075 -17 39719 26529 -5393 -34475 -22723 -22010 -1436 10163 -599 22018
28654 22018 8454 -27174 -33784 -26559 -8929 18694 44823 14246 -13257 -47852 -30583 -8377
28642 -8377 -17913 -9281 16291 5248 -9959 -703 6501 766 -15303 7013 7001 -10301 -15098 -39826
28628 -39826 -22918 -19959 -4420 -1375 -11428 -18631 -23665 -13626 -2075 -2966 -12428 -25293 6452
28615 6452 28356 28797 26884 3166 -18734 -31641 -2545 4001 -12655 -14590 -57267 -43591 8407
28602 8407 53861 36867 14888 -12003 1366 34658 45165 31266 8747 -11984 -15333 -10319
28590 -10319 12980 16636 -2475 14673 3110 15008 14953 2509 402 21280 35266 15013 2497
28577 2497 -2441 -5455 21166 24986 29768 388 -11678 -18342 -27869 -22846 -603 2018 -10571
28564 -10571 6215 34413 24767 2406 1036 -4873 -7525 -13692 1626 19255 3149 -7294 8848
28551 8848 35348 13700 -6293 -27147 -2400 44011 38453 36871 13328 6070 16581 11526 7320
28538 7320 -6828 7035 36969 51903 75547 31446 20873 41678 50002 49179 -6530 -30348
28526 -30348 -22162 -13209 5227 22746 -11898 -19618 4823 13019 -6995 -6053 -7351 -36838 -42460
28513 -42460 -27460 19962 31664 -8326 -24972 -2488 -3801 18538 8406 -10291 -18140 -11649
28501 -11649 -6109 -26709 14424 79828 62476 45499 60931 30887 39334 32342 24985 11190
28489 11190 34416 31714 20744 34504 34607 36554 23952 3920 -2638 5001 -10693 -293 12156
28476 12156 -1130 -7532 -13838 -6727 3505 36024 54769 66838 37878 9334 15741 13248 3191
28463 3191 1576 19093 22207 -19294 -13223 2073 35184 56834 65141 60358 49216 31412 25864
28450 25864 30618 18454 8945 21269 27677 -3971 -38537 -34000 4250 2542 -8958 -22099 -5124
28437 -5124 -15882 -32747 -5853 9780 23581 29761 41716 31114 19268 429 -14430 -3171
28425 -3171 10728 45406 39102 28865 -8064 -20667 -20559 -5774 11252 2195 22046 294 -28837
28412 -28837 -47525 -27880 -2569 -14172 -35863 -54503 -53572 -29245 -5141 27461 34038 20193
28400 20193 3809 7795 9971 7244 6149 -31140 -65406 -57635 -24370 4349 25013 31704 30411
28387 30411 27310 22901 12900 28805 51413 29462 3476 -6287 -22603 -11907 -2313 3776 3409
28374 3409 -9476 -1724 7366 -4138 2459 13930 12890 13948 9782 14662 36788 17763 1619
28361 1619 8266 6137 3294 12032 9322 3668 723 -4723 -16069 -19804 -16984 18452 24137 2414
28347 2414 6593 -14838 -691 33568 52806 69433 70105 58006 59273 50879 17219 33059 39104
28334 39104 19371 17704 -13185 -24457 -17773 -31796 -52706 -35087 -10890 3943 -20819 -27684
28322 -27684 -5455 23487 18680 -11975 -46405 -52489 -37027 -600 4754 941 -22820 -36950
28310 -36950 -42066 -60161 -40914 -52973 -38961 481 -10650 -18689 5502 13679 20008 22859 9467
28297 9467 -15809 -19090 -46419 -33793 -28789 -33838 -10578 -15216 -26994 -31170 -6448 -11115 -2734
28284 -2734 7644 11251 -2497 -24737 -12531 -3934 14688 -24502 -61063 -66068 -54879 -38585
28272 -38585 -48009 -35595 13193 48506 40237 18396 -17313 3859 13581 19219 -11609 -11781 -5510
28259 -5510 -35662 -18081 -22357 -18719 3040 16111 18428 25067 47153 45820 15401 -214 4697
28246 4697 2772 -28961 -1642 20285 27728 42936 31166 2019 9998 -4381 -3686 -3218 9598
28233 9598 43159 40816 54030 60199 43139 40756 27174 7187 6913 55633 61324 14166 -10336
28220 -10336 -30144 -23447 -21217 -31220 -20952 7838 31538 8086 7378 20124 43638 28215
28208 28215 8869 681 -6043 18593 3942 5442 8370 16201 30955 44828 35979 20403 20319
28195 20319 24443 39355 43430 43088 60879 58726 37208 1215 -43595 -67152 -73065 -36361 20689
28182 20689 -1622 -54518 -77247 -69757 -39484 3042 4699 7348 19850 -2009 1396 9452 14971
28169 14971 -16171 -23216 -14002 -29037 -18534 -6940 -4886 19040 41077 25433 15301 16442
28157 16442 -981 -16181 10192 33503 49087 30673 19783 35733 5136 -2312 24791 52171
28145 52171 39080 12235 -5299 -24314 -10413 5494 629 8202 -7035 -9261 -1452 -24860
28133 -24860 -5675 7508 33387 30415 27081 13558 13479 2975 -3862 -21958 -37570 -26696 21722
28120 21722 9741 -22869 -17179 -17588 -12046 -2335 21802 23852 20090 9329 11464 3192 2770 -7859
28106 -7859 -24606 -10332 10344 -16100 -30581 -31058 13155 -26240 -29050 -9551 -1758 2905 -7940
28093 -7940 150 -21168 -30046 -32649 -9636 9323 3240 -7773 -18673 -35800 -16481 -410 -2475
28080 -2475 15603 25873 12202 10217 -13712 946 22488 7276 -23448 -4868 2282 18080
28068 18080 27595 25348 35009 45183 41434 36569 -1576 -5569 -2673 4691 23819 1131 7152
28055 7152 29880 35872 40548 23178 17998 346 -11812 -26432 -17344 -5006 1920 -11310 -27154
28042 -27154 -36542 -34422 -15506 -20802 -5084 -7629 13422 25275 19835 -1773 -5996 -23849 -24656
28029 -24656 -31299 -41109 -7356 36983 50685 49601 53960 15903 -515 3755 18751 42798 72971
28016 72971 70126 45800 42244 43810 33568 -18635 -26159 12228 63659 47811 23155 21731 4191
28003 4191 8212 -2129 8387 14728 27875 79028 91029 91852 40301 9761 -6901 -3997 -4664
27990 -4664 -20952 -27870 -13714 -1860 -3310 2018 -4736 7399 14499 -9812 -34618 -12731 2529
27977 2529 -8124 -1974 10697 13856 13549 -11993 -21463 -1966 -2148 10882 20045 13632 -6356 -10918
27963 -10918 -3764 3554 -4198 -13319 -22161 -837 17584 20372 19348 -17949 -13948 -25975 -23679
27950 -23679 -19510 -17507 -21584 -19086 -24634 -28620 -13593 24458 22592 -5293 -260 5270 8436 15945
27936 15945 22449 22495 -2451 -17668 -16592 -45358 -46858 -27873 -34247 -17698 11710 31012 31441
27923 31441 28034 16405 18887 29354 58528 50493 29052 11478 2708 13879 45133 66457
27911 66457 50767 44651 33447 20631 20234 8262 -3992 -2135 -4213 -24769 -22378 -12291 3625
27898 3625 8662 -3191 -18637 2037 7723 6176 28995 30602 26465 3903 21126 16480 4566
27885 4566 31375 32609 30855 48518 44369 29569 28713 43802 50853 33338 15822 3950 14385
27872 14385 12365 10875 -2474 -16395 -8875 535 11645 23767 27404 20078 -17355 -31161 2808
27859 2808 23662 15844 -4378 -17298 -13154 2552 -9481 -25509 -8748 -17445 -3651 15616
27847 15616 1815 -4031 9110 8031 2217 -492 11569 8254 27110 19849 32436 57502 49730
27834 49730 38923 46076 26593 -1081 -3013 34782 41266 33393 45095 36142 42035 82411 93317
27821 93317 83405 72338 29759 -301 -10235 -26481 -14215 2778 13494 14789 11912 -1424
27809 -1424 -20455 -26306 -2398 -14052 -6695 -9702 -16261 -26763 -33260 -28722 -31320 -13802 -15117
27796 -15117 -14130 -34745 -19866 -3503 15017 11654 -25064 -16810 7980 15928 6714 6378 -760
27783 -760 -13208 2237 7346 12919 35956 46824 18755 5959 22125 42801 58473 65502 45820
27770 45820 18930 -5001 -14209 -11676 -22824 -11530 45728 74238 54703 29937 -11637 1058
27758 1058 27308 44279 27177 2849 10201 27714 46413 34358 28521 21035 10430 10277 3174
27745 3174 35782 47783 45649 15116 -11384 -11491 17134 19072 -12400 -195 5509 6637 20897
27732 20897 43686 41877 12789 19802 22273 8178 -32456 -31189 5904 35558 41095 6379 -17523
27719 -17523 14641 19797 24384 20855 16312 22181 30704 16446 24212 32211 9137 1182 -12621
27706 -12621 15280 26803 2471 -14519 -6442 6575 6859 5316 -4405 -22600 -42858 -58965 -45788
27693 -45788 -17974 -16619 -24876 -7840 3216 -7975 -13234 4330 37740 57724 31521 11744
27681 11744 -11029 15038 7407 -15343 -12765 18426 35042 19830 1164 3274 250 -5634 -6681
27668 -6681 426 13290 28521 10913 194 1671 20804 20493 6409 -4973 -6455 -13606 -8287
27655 -8287 360 4590 -8202 -19266 11891 47668 47393 34021 12797 -7597 9264 7047 11795
27642 11795 13087 13468 16227 30497 -2045 4370 17702 18923 23472 7158 -13289 -5614 -8582
27629 -8582 -899 15529 8839 -7368 -18726 3793 29274 40530 23076 16510 18461 15432 28128
27616 28128 36180 26523 5064 -3240 2972 -11323 -52564 -68757 -26466 129 15972 51723
27604 51723 54475 44172 20319 10261 2158 824 6662 31461 35477 3387 -16919 -9878 3640
27591 3640 4878 3082 6024 991 -693 -7039 -17891 -57343 -36583 -11129 20601 11367 -14504
27578 -14504 -1592 14339 -9452 -31939 -23228 11335 22163 13791 7552 36489 58537 54187
27566 54187 18994 -16746 -8915 6713 26158 47555 49329 15579 4197 -10140 -21276 -17295
27554 -17295 3058 -11591 -22500 -15173 -17587 -6998 2768 13640 2040 -16193 -11398 19304
27542 19304 24407 4078 15906 32655 42542 21481 16459 8781 8530 4588 -20586 -40736 -41222
27529 -41222 -28757 -42182 -13995 -23941 -14055 -10374 10611 16163 19716 3694 -21526 -32129 -33299
27516 -33299 -20403 -12446 18170 48842 29924 24294 14145 -12857 -83 -11973 23904 19777
27504 19777 27231 36685 22248 3722 34400 36110 5873 -31988 -52052 -52007 -16332 4466 -11481
27491 -11481 -1531 28505 59453 14431 35479 53153 37408 15818 23977 9764 -14079 7385
27479 7385 35910 29395 18285 14595 19244 20345 43475 42239 6509 16704 36587 23063 -4724
27466 -4724 -14816 -17748 -5719 -21422 -4366 -8956 -43336 -41091 -47336 -2822 28328 11018 1790
27453 1790 1833 -4340 1642 -384 -11365 -15799 -7089 -10100 -29355 -16923 -31972 -32582 23634 9996
27439 9996 -11386 -11853 -28397 -27088 -4867 -3089 -23796 -7937 10907 33778 32903 25423 696
27426 696 -32221 -47812 -27169 2061 3245 -2205 2452 -36758 -39041 -13724 9830 15084 26383
27413 26383 36149 25106 35793 43892 19747 -8660 -7774 2452 -5464 -103 8766 15124 -2335
27400 -2335 -35242 -41645 -5488 13572 -28 -6968 7916 7737 30832 26649 9849 13287 32259
27387 32259 40666 65174 36882 2941 20765 26638 4346 6757 -6052 -3996 -4049 -13692 -17754
27374 -17754 -18752 -6850 -8826 -33737 -25973 -3700 2364 4081 1765 8282 -1475 -6079 -23109 -44619
27360 -44619 -21920 6663 20568 10835 9492 29760 41048 44650 26115 2410 -10885 -49704
27348 -49704 -53435 -31806 -16601 -19816 -17521 -17194 4024 19253 34308 26261 40304 22958 -14126
27335 -14126 -23935 -22431 -28622 -26709 -26763 -13458 25084 25198 57716 57691 41713 29283 7104 -3635
27321 -3635 4601 11028 14703 8834 13155 8574 -2378 20877 26116 39355 37192 39394 41916 27144
27307 27144 8636 377 11069 6778 9513 18389 36064 44870 44065 42859 28906 33103 56546
27294 56546 28188 4617 21069 46722 28292 10650 -7142 1674 -5926 25844 37987 37111
27282 37111 39390 38655 23575 28310 49337 61478 42975 31397 10942 36779 21160 5234
27270 5234 31661 36204 37596 33939 26983 31016 12336 25156 31250 39851 48044 32661 26733 33600
27256 33600 42513 46509 16612 -1537 -10087 -34892 -33999 -19850 -13283 26 17277 5041 -12170
27243 -12170 -1054 6648 11139 12448 28677 26194 9119 -32806 -60308 -31333 -15259 8289
27231 8289 19087 28862 59740 67718 55481 39670 -3527 -13775 5845 38624 57696 30355
27219 30355 -8953 -17185 20598 5701 6554 12040 -22906 -10986 9911 14537 5479 -25563 -42310
27206 -42310 -10094 14709 29721 21432 15677 29481 -17658 -17703 -20238 -7581 2420 -4917 15178
27193 15178 36156 53917 62167 22164 -3073 13317 38006 37768 10026 483 25561 44427
27181 44427 63341 68935 61530 42479 1045 -4303 -26754 -37878 -36455 -23501 7596 18532
27169 18532 11347 -17712 2563 -6856 -32467 -26111 -38834 -43716 -51361 -53805 -47137 -32857 -16948
27156 -16948 1897 -23044 -42386 -25101 -11258 4039 24588 32535 28792 17523 9685 7974
27144 7974 42743 19188 -10379 -11717 6278 15676 16265 -1184 -24653 -39189 -19306 -32789 -41732
27131 -41732 -22354 16832 48236 59152 70356 57162 16027 9582 -24849 -41156 -12941 -5183
27119 -5183 -2329 28938 22999 -6917 4947 -4225 -4973 6534 6245 -14100 -23874 -8731 -26554
27106 -26554 -31448 -28143 -11123 -13906 4860 -6298 -340 4563 8787 -17878 -50598 -31463 12720
27093 12720 46403 27105 26261 35054 24307 15059 -5047 -31008 -21862 -41142 -56569 -41355 -13114
27080 -13114 5956 25716 18550 28281 43290 37860 32596 20539 10975 -767 -9576 -18574 -33468
27067 -33468 -35659 -41845 -22553 76 -4373 1563 -7395 -4374 8167 -15108 -12947 -492 5529
27054 5529 23539 -4522 -20755 -46830 -32618 -6868 -17213 -23409 -15672 -11959 12122 11992 258
27041 258 -5462 -8151 -2782 -8879 -18230 -19962 -22562 -21543 -8938 8065 -13993 -7064 -4654 -18101
27027 -18101 -3710 9406 -4764 -32422 -19286 5738 25029 32461 17326 3874 -8238 -32180
27015 -32180 -22816 974 -3000 -11986 14456 26538 23460 16040 -2287 -1234 -29224 -30785 -31850
27002 -31850 -68011 -59975 -60848 -55153 -34772 -19722 -12210 7051 18788 4944 -13859 -7261 -19709
26989 -19709 -30131 -22937 -15003 488 8777 -5791 -8320 25392 28037 31114 31814 15497 8265
26976 8265 26437 28610 7821 -27544 -49128 -37720 4657 21533 31610 50907 25216 13704
26964 13704 23263 19615 24887 64500 53148 39403 25995 34999 8010 -1 6260 15130 3908
26951 3908 9039 31122 42021 31127 15622 -14243 -26994 -18044 -8981 -10790 -27766 -45505 -36139
26938 -36139 -32833 -32955 -51955 -53012 -15778 -6651 -9435 23578 30843 20712 31945 10121 -11773
26925 -11773 -25406 -27299 -41088 -47788 -23637 2134 27343 22940 23383 44717 20564 -628 -6469
26912 -6469 -41501 -60693 -39825 -29799 -37935 -7045 -13942 -24986 -13482 18919 10302 9911 28737
26899 28737 21963 11661 27827 35741 -11314 -18036 -15810 -33408 -19653 -30034 -40232 -39404 -33980
26886 -33980 -26607 -13592 5603 18274 10313 -2095 30517 25555 4286 9897 4734 17688 21531
26873 21531 4826 14492 -5561 -16978 -42786 -46292 -28854 -33910 -37600 -28078 -33415 -38280 -11871
26860 -11871 18662 22377 26810 17838 10514 391 4230 1209 7598 5555 -279 -9520 -30636 -13665
26846 -13665 6710 10372 7580 6154 4515 31029 33552 4732 -13264 7588 26690 -2722 -10747
26833 -10747 13481 13067 -22146 -15611 -18216 324 7315 28632 19734 599 8951 14130 16140
26820 16140 22417 -1516 -19392 -37178 2609 39797 41710 32505 18074 17201 -6966 -23122 -38188
26807 -38188 -64045 -77536 -48558 -39581 -37020 -21582 -29189 -14338 152 5714 1751 1161 7756
26794 7756 10274 25761 16744 14006 14837 8330 2370 13621 1554 -21887 -35407 -29895 -21386 -31927
26780 -31927 -8196 30023 44434 59145 35281 -7455 -2397 -4166 1864 -4604 -2527 -22721 -16144
26767 -16144 -14406 -43507 -26409 -1512 2344 -3202 807 2972 29054 27285 28002 40404 34012
26754 34012 47284 32222 8372 29604 7484 9974 34000 22640 3355 14017 22253 -5375
26742 -5375 -14104 25757 40884 4205 22455 37712 44111 28965 33920 33536 30541 6795 387
26729 387 -9749 -9517 -12122 -2205 30142 48833 49963 10837 -2649 9785 7513 -8306 -25109
26716 -25109 -33640 -34136 -10590 -27378 -38301 -37020 -8618 9076 12494 34749 45935 60109 26719
26703 26719 8813 23314 30798 39955 42223 -6196 -22519 -13772 -15361 11152 31371 29880 -4722
26690 -4722 7855 38757 47158 51253 50113 53167 14070 -8107 12739 45728 42939 7742 6670
26677 6670 1730 970 4907 -10262 -32071 -48878 -52250 -26127 -4484 23195 43254 37684 31659
26664 31659 41085 13084 13591 41384 28798 18672 21065 13958 18786 8058 -5779 -20185 -47352
26651 -47352 -54613 -44303 -25529 -40115 -34459 -3848 -16993 -19370 -6063 13588 8768 -5561
26639 -5561 -4885 -6285 20301 19128 24511 22193 39074 65579 72047 50259 15036 10170 23780
26626 23780 14647 18761 24716 32649 -9029 -20736 -5752 -12204 -6869 -12520 -13082 -12513 -43910 -46058
26612 -46058 -51178 -15321 -1520 16028 45855 49540 47324 71770 103344 78258 65808 54652
26600 54652 21666 -9713 7381 13525 -15541 -18059 24325 28497 50012 36883 -5935 -17773
26588 -17773 -29882 -34196 -6779 -3437 -19323 -43647 -46721 -10475 -5750 17416 25942 20520 2244
26575 2244 -25810 -35505 -6301 8025 5179 3038 -5454 7146 13533 11197 13603 -18894 -35490
26562 -35490 -19397 -16653 -20265 -15682 -23405 14119 20098 -31043 -44271 -55951 -26251 -17285 -5764
26549 -5764 14554 -3496 24781 26942 17171 25432 28217 14812 5460 -302 -21351 3903 22378
26536 22378 4093 -2625 23391 14265 979 15324 22101 22615 7300 -2820 -32956 -63727 -72785
26523 -72785 -49294 -10215 6334 6200 1321 -9873 -3134 -7560 -23906 -23995 -21430 -10380 -9366 -13810
26509 -13810 5035 19497 -4378 -17432 -4452 -7734 -38877 -18777 7829 14461 34814 12656
26497 12656 -30734 -45431 -33308 -12598 17890 38444 29145 35685 47870 31826 27418 24269
26485 24269 31651 23775 7719 -18745 -12189 -13197 -25032 -22022 -24748 -7686 16924 31298 34271
26472 34271 5106 -19011 6348 9220 -13994 -24208 -27211 -10231 -3815 1281 -21010 -46167
26460 -46167 -37047 -10696 1753 9751 39836 52422 34418 16959 17724 26630 26180 14998 1103
26447 1103 -3751 -2181 -21565 -61242 -66175 -33469 -41443 -62846 -58146 -38733 -37562 -42099 -19884
26434 -19884 -1243 -4146 -6754 -20260 -17363 1507 2547 -5119 -10273 -19462 -11211 -8983 4965
26421 4965 6342 9364 19164 21948 12196 -6089 -24185 -26796 -17477 -23108 -43671 -50186 -27407 -20356
26407 -20356 -18269 550 4959 28650 52189 49609 45028 42113 28875 14862 15323 36676 26084
26394 26084 15644 6309 1902 25568 6077 15411 28391 18275 -10798 2104 -14181 -11135
26382 -11135 -25851 -42904 -46070 -31696 -17948 -4337 2458 -9712 749 10692 9124 -34507
26370 -34507 -36953 -5013 8885 13172 43297 58670 22464 9697 11456 8610 -12754 -45719
26358 -45719 -70659 -27809 244 16191 30472 13264 13669 13975 -1510 -2992 6825 20205 38591
26345 38591 30089 37947 19813 23251 26847 18398 9075 -8061 -10318 -6416 -2132 -8051 -6536 1321
26331 1321 -4121 -8938 7345 21895 8832 2231 -10300 -21108 6530 35331 26741 -1828 -3500
26318 -3500 -7440 -27019 -34185 -46705 -40472 -21576 27402 16807 -19063 -18914 -15152 -1542 -8130
26305 -8130 -31723 -30278 -31052 9513 38956 60053 22601 10567 16212 -8544 -1523 14510 43364
26292 43364 47319 22297 17191 21619 19530 8455 -8701 -39173 -50691 -43850 2283 17675 1172
26279 1172 11359 -10828 -23070 -10542 16194 4308 1968 48247 56262 38189 -12557 -10704
26267 -10704 6217 38447 18809 26327 27404 25345 14410 -5377 -9342 850 4103 15102 34507
26254 34507 38955 41632 24121 -4666 -9043 -5378 -20605 -44183 -54036 1693 18886 -13109 -39143
26241 -39143 -46360 -34881 -15384 -19884 -28601 -16079 5768 12325 -22828 -38571 -21350 10611
26229 10611 29837 26941 31962 32532 654 9176 30422 38768 28963 18293 -13954 -19387 -15190
26216 -15190 -1570 3694 769 -3890 17198 33205 19117 27236 47265 71023 46469 18189
26204 18189 23694 8204 24177 5841 -29300 -41269 -44505 -32619 -13456 -133 14085 31045
26192 31045 34597 8306 7267 -15189 -27083 -22207 14351 32414 30610 -3895 -43991 -46319 -35783
26179 -35783 -42507 -40071 -39416 -20832 -19606 -12081 -25073 10 9198 8290 -2089 16398 11159 2273
26165 2273 -5263 -12904 8322 -4549 -13016 -4731 9595 29857 25490 18901 -21835 -35918 -4620
26152 -4620 -14462 -42077 -25422 -27211 -26160 -40133 -30775 -28978 -17720 4306 24369 -6263 -7144
26139 -7144 3987 22709 12544 -8895 -14448 5377 3090 -12775 15332 47770 27865 4384
26127 4384 33639 40336 78203 69660 48936 39490 11267 -5834 -21585 -21700 -5726 7598 46871
26114 46871 54885 31265 24943 -2497 -12157 -15429 -19890 -5663 -354 18670 -15539 -26427 -5619
26101 -5619 -11043 -19804 -19027 -3702 -14195 -45569 -43380 -4175 -24443 -44094 -12062 -291 -2351
26088 -2351 6484 9480 -11357 -23780 -15790 8753 16310 20725 35239 33674 -1610 -6640 21426
26075 21426 45095 49159 28655 36312 35877 -4739 -9412 9980 -18233 -28717 -28245 -14270 13373
26062 13373 -3333 -1118 6221 20021 44020 41753 37190 13940 -7035 -1976 23294 21428 11486
26049 11486 -1028 -9522 -4184 -11894 -12611 -17489 -5714 1483 10943 10458 24041 5406 -1984 -23522
26035 -23522 -18759 -17066 -2323 -1573 -9360 -15247 -25909 -20522 -24896 -9120 18375 37929 40912
26022 40912 59519 82868 78151 68536 56905 72424 86330 66794 49068 11165 981 8391
26010 8391 -8688 -35459 -41207 -67649 -74982 -50812 -37145 -36787 -13977 10356 -7107 -30583 -60131
25997 -60131 -39416 -32395 -38941 -20789 -12996 -4228 4243 -8941 -5101 15369 27405 37778 10080
25984 10080 615 -16171 -18303 -33493 -14143 24256 54622 54571 30574 4190 -4284 21058 18667
25971 18667 4265 10420 9063 974 3158 10752 3027 -2542 -10597 6506 15804 -8447 843 10048
25957 10048 11532 31573 28821 29463 41415 32598 28083 21238 3437 40895 42571 35766 1026
25944 1026 -20714 -6994 -2221 325 -800 19210 33269 7833 -3139 2294 -3816 25086 32151
25931 32151 18719 12997 23774 1250 -12382 6610 7264 -17709 -8467 -9571 -13466 -5934 14772
25918 14772 1321 -4173 16271 25885 -8311 -26324 -36849 -28295 -12213 -1851 12653 4384
25906 4384 -20498 -598 17096 14497 -13097 -13468 2921 -28 -3517 -22276 -29473 -18195 -36492
25893 -36492 -19686 -288 4612 9262 466 -10453 -3957 33363 51291 17777 -6313 -19355
25881 -19355 -28582 6293 29279 -5649 -19681 -18412 -33384 -44155 -8653 37200 18053 -8999
25869 -8999 -275 7282 -15482 -4572 6341 17024 44542 71615 72752 72734 69836 41677 19396
25856 19396 35647 74552 59098 35752 39849 29709 14688 -8721 -16371 -10618 -14567 -16444 4192
25843 4192 11137 18757 55178 55733 25001 14953 -7388 -28331 -19945 -6967 16052 13888 13777
25830 13777 15021 13991 3842 -50280 -77666 -34890 -6712 6469 2065 12115 7553 -23815
25818 -23815 -26470 -2404 2966 7439 -6060 -23716 -24544 16419 47096 61905 52041 48545 51502
25805 51502 43720 35713 12222 22635 28329 18289 4351 -2039 -7377 -45353 -51637 -1842 16812
25792 16812 28259 25571 59187 51886 58500 38012 22864 23188 12895 -4326 -23886 -14236 13229
25779 13229 38467 22568 -1152 -4698 3919 9859 -7969 -19540 -14009 -14226 -27415 -32977 -24853
25766 -24853 -23287 -23106 -36628 -14896 -524 -13880 -37326 -41638 -48366 -29921 -21200 -6816 2924
25753 2924 17338 26885 3720 -29201 -41713 -6778 -5677 6478 178 -20707 -11829 -7526 -7063
25740 -7063 -13124 -29699 -30979 5873 31914 7952 14451 5035 -6989 10736 -7984 -5056 24070
25727 24070 16399 4114 4255 9449 -12603 -18985 -1689 -3843 -19934 3704 28321 -4215 -11893
25714 -11893 14371 16589 -14489 -22668 -58915 -59402 -44736 -25661 5277 -14869 -19573 -5890 -3557
25701 -3557 -23134 -37447 -16706 188 24008 13657 25994 23533 21336 37642 35602 12000
25689 12000 29912 52459 52902 41276 10995 4396 -692 16510 8664 30303 28570 20937 -2496
25676 -2496 -9002 10590 30291 11193 20816 31031 41435 37546 -6746 -27712 -27416 498 36750
25663 36750 34486 -365 -5699 5756 24331 50616 52559 7126 5177 19037 11255 16808 19405
25650 19405 -5005 -7738 -472 -4405 -11512 -13671 5527 -1863 -524 -1163 196 -8518 9911 14368
25636 14368 -14617 -10363 -165 26966 24944 258 -14526 518 -4611 18528 6758 5312
25624 5312 -1742 -19427 -24706 -33254 -39292 -42046 -39613 -40381 -17400 -1619 -38114 -17858 24213
25611 24213 31958 28080 1365 -2872 15628 14170 -5125 -22009 -26640 -8867 -17299 -14948 -22972
25598 -22972 -19018 -10173 11480 15447 -1120 -14118 -31756 -46490 -65514 -36545 -33207 -29361 -37769
25585 -37769 -33914 -19828 15136 16462 13565 15727 15103 1256 29450 53861 47666 25966 -4432
25572 -4432 -459 11052 22844 25359 34218 31520 -169 -7656 5365 3986 4077 -1194 3670 239
25558 239 2012 28501 11970 6441 11255 11212 15531 39219 51304 39255 30078 -6147 -31362 -14607
25544 -14607 -13294 10268 15015 16041 11513 -16111 -9127 16063 38052 36998 27049 24455 30902
25531 30902 32961 -7114 2994 53255 66225 53133 32287 26986 40124 40562 32853 35031 28467
25518 28467 19770 -1953 -23802 -8447 18076 26415 34716 49954 53707 19669 -9908 -22843
25506 -22843 -4012 13218 -8544 5763 8421 -21994 -34411 -7015 13528 42368 36106 10689
25494 10689 -1913 -7871 6872 9862 -475 10125 17354 31317 41800 31231 30974 23664 39655
25481 39655 62808 35515 21814 36566 57447 37670 27850 47277 44718 22881 37213 38875
25469 38875 27431 30262 36834 30683 9598 -7490 19988 19472 -1941 -6628 -3600 -5380 23405
25456 23405 65359 50182 -8373 -22159 -13944 -4978 3317 2248 10901 3697 -4837 7994 27853
25443 27853 27179 2250 -32046 -26572 -24145 -30385 -29937 -28039 -31367 -37639 -31413 -16159 3571 9582
25429 9582 9358 -27601 -69513 -51451 -36385 -40077 -25793 -22181 -31413 -38267 -22111 -21375 -7405
25416 -7405 -1843 -20006 -1200 17095 -11397 3050 33434 27728 38263 44382 63928 78907
25404 78907 59635 51349 4871 8575 14282 21813 30623 14387 41182 22912 10054 3298 21210
25391 21210 1386 863 2350 -9222 -17331 -32796 -44349 -65149 -35813 5332 14089 7742 16112
25378 16112 10038 15692 13228 322 7936 15376 15737 -12975 -12440 -12108 -12602 6678 13225 9129 12261
25363 12261 17223 -7025 -30824 -13882 12711 12563 6844 18561 25877 12818 3505 -22779 -8750
25350 -8750 -17006 -23231 -18222 -9916 15053 25823 9782 -6593 -26345 -35750 -44667 -37573 -35200
25337 -35200 -25547 -5202 -5400 -13792 -22369 -5050 34153 49095 59981 65897 39398 1156 10473
25324 10473 31012 25730 36581 7721 4191 20881 47218 48018 57539 24133 -24750 -60435 -51052
25311 -51052 -15172 22838 44315 39714 20099 20994 53214 32609 -9435 -5149 18183 -7551
25299 -7551 -28079 -16265 -3932 33819 62069 34534 12261 -17882 -32924 -33147 -24612 -14716 -10672
25286 -10672 -15369 -37049 -35046 -42336 -21144 -25067 -23501 -32822 -40683 -37675 -7474 13912 1067
25273 1067 13422 17354 14770 11691 -423 -27524 -32978 -4251 -4376 117 -20569 -29152 -9997
25260 -9997 16609 20999 18454 39436 15741 -9059 -4094 1035 30208 32699 2558 6713 -1232
25247 -1232 -27306 -31364 -33831 -23000 -28088 8146 -1825 -30385 -38171 -40779 -35258 -36517 7292
25234 7292 17297 26569 9637 -20914 -17888 315 -9580 -21892 -1464 -22668 -47924 -44045 -28538
25221 -28538 -2838 20243 2271 -12163 -20732 4361 -10446 -15292 4917 42869 30112 3711
25209 3711 -5389 -3418 7928 21919 9989 5465 -13414 -36857 -43823 -62296 -72391 -46590 -5277
25196 -5277 -17007 -32578 -10727 10397 14121 5599 15629 17879 1879 -18369 -32999 -35168 -47862
25183 -47862 -57452 -21694 -3773 -60 18663 33367 33943 -2024 10051 6435 28382 36644 34303
25170 34303 29880 25012 14323 -37 424 991 11755 23910 8374 -13414 -12720 30799 23541
25157 23541 8112 -679 1660 -11123 -10018 -26002 -30850 -10009 8796 3856 29687 21457 -404
25144 -404 7009 -5862 -8141 -19734 -12518 -3667 -15463 12295 47957 29200 40814 5594 -43776
25131 -43776 -40525 -2740 1143 -8408 -11575 -22913 -10050 -2120 1029 3661 9684 9590 1516 -6973
25117 -6973 -29305 -14208 -13222 -33486 -32452 -21287 -3915 -1865 -15773 -12459 -30395 -23401 -19597
25104 -19597 -36021 -18919 6627 -16052 -50091 -42156 -14659 -3537 5255 8075 -16718 2292
25092 2292 30645 20453 -6143 -4209 -32877 -55917 -27976 -5737 -14579 -13982 3693 649 25674
25079 25674 17614 22174 13039 7817 -405 -19410 -16634 -4039 -147 13431 22038 29778 32192 56351
25065 56351 57687 56625 35376 35326 25763 29082 7716 -6862 2763 10481 -1482 -17767 -22413 -8698
25051 -8698 -9587 6106 18167 4860 16166 9544 14213 12674 12303 11838 9362 9974 7497 9039 14858
25036 14858 -6246 -22461 -1443 11605 8333 -3782 -25587 -21542 -19037 -7393 16482 39025
25024 39025 27906 -7076 -16308 -21496 -7847 -13395 -13343 -11911 -12014 -10028 -19053 10252 46236 27283
25010 27283 21725 19197 -3303 -29953 -21249 -24655 -26856 -29060 -34523 -41136 -33106 -9580 -4130 -5819
24996 -5819 -8204 -1188 -34295 -53523 -49753 -37751 -24746 -17992 -16030 8896 3618 -2460 -938
24983 -938 4768 -9963 -37327 5692 45406 48807 41911 25182 935 -4175 -12045 -16709 -43088
24970 -43088 -41644 -20188 -24577 -10573 3039 3825 8708 15949 36606 5935 5408 16737 21970
24957 21970 20464 10922 -2370 -20642 -33894 -44264 -35498 -28789 -17450 86 -23867 -40492
24945 -40492 -41390 -34858 -7887 -12953 -25363 -39185 -59189 -52208 -18259 -4094 9754 12435 17649
24932 17649 4669 -36320 -7962 32383 38521 -4873 -41377 -31087 -6678 857 14308 35941
24920 35941 34245 10144 -5370 4810 -16422 -27513 -11976 -22018 -15453 -3903 -1790 -20672
24908 -20672 -24950 -7031 -17537 -3236 27413 45152 41268 6210 -11253 -24883 -7334 1200
24896 1200 -24316 -23448 -14116 -24344 -36594 -14680 20086 36698 41065 27916 15228 -478 14628
24883 14628 -3157 -10348 -28978 -38690 -18125 -1217 -31339 -50664 -31274 -56225 -60863 -36264
24871 -36264 -37999 -24455 -6665 -2322 23607 32541 61304 49465 30686 27320 6368 2205 -19413
24858 -19413 -5716 -3129 -18682 -28865 -32412 -44180 -42342 5036 19454 4564 33898 18394
24846 18394 -14661 -14697 2807 20106 47637 35855 27819 18926 19337 23238 16498 7801 13366 9589
24832 9589 4211 5113 -29768 -21614 -7437 -5112 7786 33155 43425 28477 19308 6886 -9642
24819 -9642 -35456 -36808 -3378 26604 22127 7251 24189 72962 70186 48622 24844 12484
24807 12484 21273 10665 17105 8826 26103 47294 66122 53596 15426 -6513 -16497 -22772 -11056
24794 -11056 11155 47097 68044 88969 79225 59937 31049 -10963 -42236 -28482 -13165 -2880
24782 -2880 2176 -29771 -33735 -30265 -13888 -5044 1383 -13523 -25151 -55200 -43743 -14783 -4777
24769 -4777 -37534 -14611 26055 17806 -5542 117 4465 -24326 -11284 -26796 -10924 21374
24757 21374 12683 10885 38 -30032 -58791 -40370 -9730 2076 11172 -8252 -24785 -40353
24745 -40353 -42406 -34771 -4554 4450 -14893 -5982 -1131 -20387 -35209 -19703 -12043 9482 16381
24732 16381 24156 24314 57908 85115 67708 37031 19837 28555 3376 -11496 1171 14140
24720 14140 20269 18267 4519 12116 58045 70088 27688 -18044 -14580 -3607 11427 20740 12373
24707 12373 8794 -9794 -10858 -12058 -36561 -54897 -72600 -53930 -25702 -25885 -24246 -38093 -18763
24694 -18763 -11024 -14459 5635 28517 13938 576 24780 10021 -7334 -22048 257 7315
24682 7315 -1617 -20616 -2095 2463 4328 5416 6014 23629 32140 29702 -15361 -30430 -11655
24669 -11655 -9591 -45371 -49181 -33640 -26615 -13146 -12330 -7869 1453 16092 4706 -4309 -14650
24656 -14650 -5870 5267 30896 37752 39694 48871 45929 25631 15129 2263 15372 10690 3805
24643 3805 23103 23030 763 -14579 -42775 -26267 -42471 -30412 -19932 -15591 -3691 4405 11902
24630 11902 9919 2938 23912 51436 54308 30319 -8090 -1176 -12720 6471 17342 25061 25240
24617 25240 11071 28670 41185 17995 2110 -11116 -13771 -25940 -19526 -15807 -6081 8235
24605 8235 19598 12646 122 -13420 -18446 15080 41073 39650 18220 35541 28766 16883 27376
24592 27376 -8088 -11889 14128 446 -509 23691 37328 15593 3082 -1486 1681 -1772 -42727
24579 -42727 -51991 -8870 3340 9843 -4350 -16396 -1499 8532 6681 -25230 -38900 -33678
24567 -33678 -56065 -38193 -23511 -9386 17706 -2231 8880 36475 44441 45811 -5098 -42482
24555 -42482 -29720 -8692 -14769 -30045 -34245 -30556 -23913 -9183 5534 -10198 1094 12850
24543 12850 -13698 -32035 -4882 -2649 3532 16843 12188 9119 23216 12400 16200 26819 31642
24530 31642 24344 1143 -68 -24827 -21522 724 -15882 -42079 -34380 -19678 -38795 -23361
24518 -23361 -10391 14341 23863 28724 19414 -34809 -41938 -16324 -22846 -29226 -31484 -27618 -28614 -32272
24504 -32272 -8530 -8795 5164 -3653 -20150 -3450 10448 10083 3061 3389 6009 -5719 -7760 -2779
24490 -2779 -4941 -8047 -9788 -17447 -29909 -24710 -29201 -31709 -22865 6896 51774 44890 4765 -19954
24476 -19954 -3267 10556 36873 43371 27822 8182 -19836 -18944 -4683 6427 16171 24255 32171
24463 32171 33220 33162 30613 37159 45062 46895 45837 5298 -23368 -11454 -8995 -28742 -38147 -24872
24449 -24872 -6166 60 3298 32015 49916 31455 13424 -2602 -2624 -16030 -30149 -13907 -26347
24436 -26347 6226 27556 30311 2892 -8013 -17562 -18715 -34643 -32771 -20933 1041 17770
24424 17770 4958 -10008 -37861 -48724 -46212 -33718 -21042 -37974 -50529 -53552 -45320 -34613
24412 -34613 -35339 -37112 5541 23292 18306 -8195 -25420 -28745 -18621 -11239 -11788 -31109 -13611
24399 -13611 -3667 2628 13717 32523 26735 132 -41846 -39285 -45782 -27240 2283 -23728 -45541
24386 -45541 -20132 -9258 6800 34721 14047 -19566 -52691 -54665 -50872 -30344 -64354 -65234
24374 -65234 -52344 -40293 -14892 -30615 -29626 -25093 -16309 -10140 -8436 -25964 -26673 -5854 -225
24361 -225 -10864 -20871 -12867 -13191 -44791 -61089 -54508 -19152 -5847 138 -5982 -216 -7989 2809
24347 2809 10027 -10473 -23315 -32877 -34964 -27839 -14923 -12448 -42348 -54647 -4693 34894 -10806
24334 -10806 -49837 -37635 -28542 7570 42411 57706 62198 59750 41048 5019 3662 -20754
24322 -20754 -45766 -73209 -87589 -56899 -20393 -14151 7218 17651 9166 11921 36186 22803
24310 22803 7614 11604 48906 39855 21283 7620 9422 48623 54858 32966 15687 -15267
24298 -15267 -21664 -12342 -393 10316 22971 13217 2816 -12217 -10366 15078 42072 32205 9079
24285 9079 10565 2539 2058 1186 -9682 -13562 -11861 -13264 11247 27109 9401 20709 23950 31322
24271 31322 44534 3495 2824 16016 32962 74419 96256 66750 44249 22646 6107 22977
24259 22977 25989 20116 7234 -6860 -45937 -35596 1844 17936 7469 16071 12616 9949 16096
24246 16096 9758 11907 -8772 -17546 -27025 -11009 -15770 -37045 -36685 -46657 -55415 -58012 -67584 -66900
24232 -66900 -39521 11041 9719 -22341 -32737 -26351 -14606 -8829 5954 -12917 -25079 -35478
24220 -35478 -23494 -18297 -15167 -51538 -66329 -67559 -46493 -28668 -42899 -43338 -29073 -12349 -15960
24207 -15960 -12411 -18859 -25805 -22152 -31629 -39498 -42242 -43737 -25324 -21404 -31062 -48642 -65089 -61000
24193 -61000 -55023 -45362 -62906 -30359 -1602 41342 36735 5235 -6135 -3656 -7343 -11466 -3927
24180 -3927 -33195 -51226 -60587 -56386 -20082 -14472 -32609 -36896 -52852 -69629 -62760 -45781 -22752
24167 -22752 5658 27822 -6879 -23979 -39406 -30168 1718 30184 39276 20210 -1462 -26372
24155 -26372 -47206 -32283 -12438 -21128 -10648 6305 -10460 -14949 -13141 -30512 -26821 -25121 -22733
24142 -22733 -17073 -18825 -14425 -34983 -53051 -56072 -53703 -53762 -67106 -61133 -38105 -48436 -49213 -30480
24128 -30480 -3580 19706 7057 -35910 -31305 -34881 -31981 -26997 -34151 -18243 -19987 10316 63428
24115 63428 69389 39476 28575 4114 -21312 -17985 -20825 -9172 -10286 3175 44385 37408 37623
24102 37623 47638 46185 37468 24109 37771 31966 31536 34299 3332 -17435 11357 8004 16251
24089 16251 28891 23876 23367 43771 19397 188 17522 20165 30386 22436 -25057 -26372 9174
24076 9174 26505 10942 8392 22986 31970 15253 22726 31939 6632 -5165 -15826 -4694 -25567
24063 -25567 -36565 -27473 -20901 -9637 304 15116 12564 42898 33337 19870 1836 -14922 -16221
24050 -16221 -26750 -33634 -60289 -49610 13700 26685 -10818 -47155 -57782 -22942 -17379 12689
24038 12689 30746 22885 8519 -2108 10570 16118 -8833 -33838 -29783 -12532 2546 1076
24026 1076 -2651 -3155 22944 23280 5856 17571 32668 11985 -13171 -23514 -8943 -19489 -19842
24013 -19842 -20771 -15656 115 -5250 -4575 21118 21614 22846 30340 27635 -10015 -9301 -4910 11075
23999 11075 26950 45354 52968 51227 77 -3082 29637 9337 5691 16671 30669 25331 36529
23986 36529 27071 27166 32933 28775 19293 3542 -3802 -27015 -16773 -23707 -35386 -15457 -31589
23973 -31589 -31033 -15682 -50129 -46182 -34239 -29006 -9770 14847 -5304 -27926 -22894 -44347 -56025
23960 -56025 -51807 -33223 -9138 -3883 7100 25783 19722 -5664 -9711 -1850 16144 1661 -22162
23947 -22162 -16759 -2865 -8148 5705 -3584 -39854 -56942 -42302 -32255 -44206 -64466 -87196
23935 -87196 -85300 -56063 -55753 -35164 -25614 -8016 -5971 -38119 -43157 -41751 -61900 -55139 -56866
23922 -56866 -17483 20441 -465 -38896 -56924 -47510 -21036 -33471 -55323 -44124 -23733 -21470
23910 -21470 -49854 -52744 -51958 -38073 -28126 -28760 -54569 -64243 -42010 -16876 -12942 -19872 -50012
23897 -50012 -48091 -21441 -878 6206 -18225 -19786 8991 -14218 -24456 -15225 -22930 -30074 -16152
23884 -16152 -5920 -30701 -38274 -36227 -15358 15637 -342 -4205 -7818 -16291 -39289 -38280 -50369
23871 -50369 -61192 -97926 -80113 -65812 -72965 -50392 -17221 -1828 -2940 1460 19587 38795
23859 38795 15460 5129 -2370 -12242 -20585 -31000 -11954 -34202 -37762 -33273 -17095 -3552 -18879
23846 -18879 -22421 -13740 -2567 19344 26963 12796 5867 -15278 -26631 -25860 -19366 -16871 -23545
23833 -23545 17249 -1886 -36772 -40311 -17313 1081 11848 15595 26052 -4693 -31856 -11297
23821 -11297 -4859 -19992 -21593 -15242 -14243 -1353 -30021 -52788 -28660 13932 10643 20399 32565
23808 32565 25149 5902 -2506 -12491 -3697 -12337 -10833 -33193 -1088 9767 5253 -3631 -15740
23795 -15740 -47387 -47943 -36087 -26732 -21742 -36437 -36691 -26328 -44116 -60416 -39200 1938 9940
23782 9940 4411 13159 30263 -3673 -17380 -19537 -32110 -23316 -31279 -42638 -58575 -39265 -22810
23769 -22810 1688 -6050 -27752 -32786 -35954 -39944 -13550 6736 -14503 -30943 960 5782 -20556
23756 -20556 -55547 -81312 -67623 -48198 -37120 -60526 -43230 -11020 -4936 -6966 16464 11467
23744 11467 -10646 -23750 -33134 -37201 -13721 27814 42237 40815 30358 -9132 -2547 26515
23732 26515 20370 18877 24375 12417 -10026 -4259 38727 31583 -1012 -9712 -75 19923 42399
23719 42399 41965 34115 38806 34563 47745 36004 25340 20942 21300 -2208 32979 35138 -15871
23706 -15871 -19912 -13621 -41746 -45913 -30899 -28801 -19906 108 -4990 -10496 -1728 7872 4656 -11800
23692 -11800 -50969 -41703 -15413 11835 15137 -2423 -12719 14949 9445 36711 58023 53346
23680 53346 27500 -4260 -1955 1686 33937 27142 2966 -11527 -13783 -6325 -1958 11009 24175
23667 24175 27060 26519 48018 21300 -6856 -7636 10063 25293 25148 33822 20594 15331 31632
23654 31632 32436 34402 28398 28226 25250 2352 -10675 -1390 -11402 -48750 -54584 -36080 -34824 -46760
23640 -46760 -51383 -33517 -8174 -5758 -17149 -29806 -27208 -21158 8260 34562 31380 19075 11346
23627 11346 12226 -5053 -18314 -11059 -6572 -24004 -24299 -17256 -79 5961 5400 -3311 2443 19131
23613 19131 28617 2892 10183 13675 15103 -7143 -13163 -18315 -29018 -2470 -15330 -64796 -68636
23600 -68636 -46643 -19797 -11343 -26026 -2855 7076 15082 4979 -10755 -19067 -5454 35319
23588 35319 81298 83976 48476 53151 56416 28861 -3134 -18114 -15797 -14434 -13043 -23182 -46491
23575 -46491 -51786 -76017 -86482 -76043 -53267 -42628 -16443 10433 16044 -2026 -1899 15478
23563 15478 9729 13514 34317 32587 28610 20010 23985 41610 19238 -29202 -33089 17899 25595
23550 25595 12324 1093 -12448 -20713 -36721 -22454 -20452 -11579 -10636 20313 16498 -914 19926
23537 19926 38413 11305 -18335 -17177 -17924 1588 29713 39231 50155 27133 19050 17788 -12
23524 -12 313 -4196 -1260 1322 13684 10978 9757 -11183 -37080 -48926 -15463 -15881 -21609 -30907
23510 -30907 -16907 -12475 -15905 -20219 14297 29663 27452 8528 1741 12331 -12657 -37883 -26910
23497 -26910 -3499 6608 -7873 -4735 7762 15827 -9606 -27994 -26848 -17155 -17074 -25158 -2957
23484 -2957 -4494 -16337 14658 -11787 -35360 -63682 -38422 -17635 -20254 -47661 -40677 -46902 -68527
23471 -68527 -51291 -30276 -24507 -31543 -10602 -11675 -16569 -1844 3461 -9790 -791 9228 17955
23458 17955 -14483 -17556 -14875 -15374 -26498 -51034 -68325 -62696 -58960 -48070 -9050 -11783 -28833
23445 -28833 -11227 386 -16594 -14331 14042 38117 62249 83109 84829 43033 -14439 -50808
23433 -50808 -38090 -36267 -36277 15226 31505 37736 40502 19124 -10365 -13208 -26856 -12193 -6138
23420 -6138 -13502 -23584 -13535 -4338 836 16564 5838 85 16336 25788 16499 -1710 967
23407 967 -465 4546 1348 1662 -26873 -43948 -28184 -2622 25804 18874 3059 1888 29266
23394 29266 22247 -2485 -5257 -10990 -8832 -9070 -15490 -9539 43409 37464 44098 27082 -842 -22507
23380 -22507 -15941 -18118 -6147 9243 9780 -5426 -31817 -51533 -69798 -51488 -24022 -15175 -2082
23367 -2082 -11476 -38692 -23034 -22180 -7811 -15573 -61204 -70614 -48339 -24884 -5989 -16963 -48655
23354 -48655 -58810 -41777 -4310 18736 8989 -21679 -44473 -33482 -2127 -12768 -35126 -29426
23342 -29426 -25225 -44041 -24713 5766 2323 4293 2836 -7616 -9743 132 -4114 11636 37186
23329 37186 33152 19459 24856 13326 15645 11660 7763 -13688 -6534 -15992 -8473 16414 4683
23316 4683 8672 23571 22797 18320 16155 -10504 -14250 -6922 -975 -13816 -3082 7148 -13280
23303 -13280 14986 35560 27103 19087 13355 -5364 -32568 -38494 -24796 -2174 17447 22314 13355
23290 13355 25456 45136 38638 20226 -3200 -27374 -29382 -9824 -409 -17739 -35806 -16646
23278 -16646 -7054 -7524 -7014 3216 38991 65561 56269 12850 -7857 -30144 -2135 5130 -27451
23265 -27451 -18575 -20996 -21473 -40005 -50781 -43410 -22894 -20573 -27980 -35877 -35410 -41395 -63651 -48362
23251 -48362 -25374 -17320 -1268 -4719 -5163 -8157 11858 1701 -11544 -24630 -22278 -21432 -10645
23238 -10645 -21307 -32941 -36033 -31583 -39336 -24025 -477 -3283 -26832 -28350 5746 10274 -3858
23225 -3858 -11790 -1963 -16075 -24328 -32924 -33966 -41697 -32535 -4632 -18749 -30704 -53339 -61265
23212 -61265 -74027 -64556 -24745 -26391 -31795 -52357 -32351 -57789 -45414 -5358 -11131 1124
23200 1124 40179 42439 10447 -3339 5786 -4525 -14801 -15770 1981 22648 9501 -1590 10806
23187 10806 6134 -10862 -22950 -43365 -27925 13988 8985 -18968 -8106 -31209 -70487 -48423
23175 -48423 11414 3704 -19751 -27121 -46430 -55198 -52744 -20264 3180 10829 -22211 -35865 -26078
23162 -26078 -25621 -14677 -26076 -30934 -28196 -38045 -56594 -61516 -32059 -13659 -20800 -34823 -29915
23149 -29915 -12167 -32247 -29368 -21355 -24758 -44674 -67020 -52635 -58312 -54565 -24433 -25457 -20090
23136 -20090 -24581 -33030 -70030 -80001 -74889 -39531 -24248 -35900 -63188 -80709 -54091 -9056
23124 -9056 14110 10258 4825 -14944 -19639 -24855 -27116 -11709 -21375 -17969 -27991 -59042 -82557
23111 -82557 -70051 -45442 -43189 -33223 -26339 -35488 -967 23884 12776 4871 -31120 -46762 -40448
23098 -40448 -30705 -11106 -11737 -13793 6689 -7460 7369 -13746 -20787 -26321 5051 -586 -10353
23085 -10353 -15574 -10909 -8348 3499 12656 -26913 -23596 -10541 695 -7471 4869 23241 -5520
23072 -5520 -10190 -3741 18678 12009 20588 46937 14891 -1280 20525 24771 18367 28245 261
23059 261 -10934 -15130 -26552 -31892 -11897 5864 28710 4902 -1391 -21316 -37692 -38722 -20651
23046 -20651 -11769 -16670 -28304 -41476 -15104 4532 16854 22679 18882 20638 2257 -8592 -3656
23033 -3656 -16979 -44569 -38341 -30463 -7483 986 -14361 -19828 -20123 4061 -9521 764 19135
23020 19135 43747 55989 18200 -1566 -16523 -16523 -10281 -41096 -27448 8860 9728 -5847 -24409
23007 -24409 -16626 11819 14443 22609 27480 27183 8502 27224 21390 19424 667 -15516 -2188
22994 -2188 4845 -6404 -15950 -17554 2161 -299 -19048 452 28554 20615 -5450 -11525 -26832
22981 -26832 -43891 -21722 -17804 -26248 -26944 -703 -8853 -16464 2561 -697 -15598 6801 -1087
22968 -1087 -13118 5971 9854 31297 32599 14798 3118 2141 14517 28251 25336 31667 18799
22955 18799 9806 10644 3701 1187 10675 -15032 -37070 -43099 -41055 -57451 -62132 -21619 10286
22942 10286 2384 -11832 -16225 -21912 4818 28488 26126 41373 50855 62919 10898 -16876 -30844
22929 -30844 -32056 -16483 -4031 -8806 -9734 -17206 2510 6486 37839 21917 11696 -36269 -37697
22916 -37697 -9073 -9079 -28902 -22774 -40031 -42486 -9901 -892 -39285 -73151 -58787 -40979 -55590
22903 -55590 -53082 -41951 -3243 33232 4120 -8121 -13287 -14726 -17758 -13372 -13523 -14360 -6593 -32365
22889 -32365 -15176 11324 -4338 -18457 -11409 9270 22354 -2437 -24734 -53517 -49150 -28982
22877 -28982 -11460 -37149 -38474 -42195 -35660 -13809 -17226 -33364 -66263 -44332 -22437 3142
22865 3142 14282 5432 -10847 -13524 -5314 -2319 4028 7122 -394 -46105 -58612 -46103 -18439
22852 -18439 7119 -14894 -21808 -21323 -20552 -50965 -49041 -24347 1611 24156 40454 20491 31910
22839 31910 33080 9500 -7627 -2964 -4424 18869 15452 -10709 -28762 -52389 -24295 8658
22827 8658 12002 6393 -2559 -2770 -6848 -1578 -5136 -16326 -27585 -31636 -37254 -41469 -30331 -27088
22813 -27088 -36820 -51336 -34888 -21691 8974 37599 25906 -26503 -34855 -14403 6792 29421
22801 29421 24421 23048 4 -37068 -31000 362 5037 -5307 -18014 -29509 -13614 3057
22789 3057 -15006 -14310 -5704 -789 -12252 -8299 19419 -7378 -22563 -13022 -9634 1111 11521
22776 11521 22744 9105 13063 6711 -19652 -41270 -60877 -44411 -11659 -5456 -16186 -18441
22764 -18441 -33180 -40940 -35484 -19799 15222 17160 2154 1189 14733 20649 18410 6828 -18653
22751 -18653 -32984 -26056 -38844 -8198 2837 9757 -8319 -32984 -9094 13164 16656 9412
22739 9412 -5182 -37636 -21023 8555 -2753 -2126 35796 42631 22489 -15558 -36783 -24384
22727 -24384 -42792 -53623 -31063 -50563 -39361 -39168 -51678 -76649 -75105 -41070 -18524 -27312
22715 -27312 -31746 18197 4415 -14791 -504 -14663 -16115 -28243 -31709 -33476 -43096 -47737 -34867
22702 -34867 -70191 -70650 -28844 -415 8535 4146 -11770 -3528 -30684 -24341 -29150 -24904 -6952
22689 -6952 -7013 11361 21109 22574 15977 24311 10519 12827 -8159 -43052 -56487 -45197 -35516 -43340
22675 -43340 -35501 -13615 13856 23289 434 -13618 21295 11305 -5361 -27331 -21052 -22984 -15796
22662 -15796 -5052 -21702 -23875 300 19173 25579 -21193 -48281 -50988 -30071 -22332 -11009
22650 -11009 -4756 -22351 -23286 -1240 -1742 2535 -14051 -14775 -20425 -37895 -32346 -21956 -10614 -33436
22636 -33436 -31202 -39355 -25967 -25546 -32129 -52158 -64135 -43731 -4556 4220 9981 -3196 -42895
22623 -42895 -52064 -55314 -51652 -48586 -19420 -4600 -5723 -548 8000 6793 -9818 -21558 -22227 -24330
22609 -24330 -23734 -24903 -48937 -26276 8887 5068 -20608 -23374 -25861 -25742 -14602 -30717 -59244
22596 -59244 -46918 -22670 82 5345 12883 -6684 -23998 -36964 -21919 -2891 -20760 -40939
22584 -40939 -39144 -46438 -41931 -40583 -10290 332 -34444 -20135 -14 16529 -9595 -28237
22572 -28237 -19971 -24512 -14095 -22203 -40465 -32473 -37100 -18987 -9517 4901 6379 -10296 -7882
22559 -7882 8339 -18424 -14297 -6712 -14406 -5176 -13082 -11147 -12706 -2726 7158 18822 5822 12775
22545 12775 43347 61566 52831 34579 36133 -1131 -9420 9073 -8395 -21761 -13895 -10585 -15506
22532 -15506 -6514 -6769 -3481 -18428 -31741 -35390 -23114 -16265 -22648 -27804 1631 15721 36828
22519 36828 36252 18997 -3256 -25704 4606 15520 40463 43539 34745 46778 26596 -621
22507 -621 38206 30044 27425 36466 51889 32019 -10581 -36236 -36679 -32707 -10045 -5287 -11635 -8268
22493 -8268 716 -18985 22 40661 40161 19587 -2447 8010 8805 -9870 -9187 19848 17493
22480 17493 -6828 -20120 12509 16552 18672 -645 -9028 9466 614 -48091 -68077 -55017
22468 -55017 -32416 1524 10445 -27311 -44598 -43823 -11735 21249 1809 -15153 -19762 -22057 10297
22455 10297 6507 1644 11460 20239 58 -5689 -22864 -4776 14281 18938 30547 36580 36045
22442 36045 40743 19889 -173 2524 7178 -460 -5901 -10935 -25569 -54077 -43995 -25338 -23293
22429 -23293 -26766 -47030 -48828 -44573 -64498 -61378 -39937 -18539 -22615 4721 28909 1783 -14720
22416 -14720 -20443 -36655 -45679 -58236 -47180 -27864 -8495 -52868 -91646 -77592 -38432 -15792
22404 -15792 -25924 -35744 -3079 29634 29849 10771 -17963 -1047 14555 -17459 -24367 -27931 -23528
22391 -23528 -28552 -36372 -16641 12065 39345 10164 -3233 -27824 -37973 -12600 8582 34974
22379 34974 30799 29291 26903 9536 -11501 -20458 -22043 -21027 -26417 -27752 -19892 -1759 12815
22366 12815 13967 10225 -4344 10773 -1928 -22503 -33049 -31398 -37120 -18766 -16943 -15156 -8824
22353 -8824 -7514 -272 -10457 -14229 -7946 -17202 -14651 -13096 4633 -29086 -37560 -51848 -84901
22340 -84901 -106852 -54528 -37662 -29823 -16774 -3556 -14615 -23364 -30734 -25311 1116 29853
22328 29853 19767 -12897 -30092 -7456 35511 41331 25932 -9372 -30600 -18827 -16416 -13559
22316 -13559 -26994 -35261 -15792 6853 5202 -5171 23868 21210 -12456 -34601 -31021 -8423
22304 -8423 -12544 -23074 -27306 -12828 -604 11170 9114 -33467 -72531 -37217 -16733 -33904
22292 -33904 -56363 -53024 -28465 -13763 -5277 -10353 4751 14092 19463 31394 16619 -4181 -2074
22279 -2074 -3627 -18884 14339 26616 39366 9129 3362 -5762 4005 -2524 -14264 -8015 -2201
22266 -2201 -8852 1066 16638 2205 3494 12795 7919 696 -35666 -43167 -6168 -12563 8907
22253 8907 20806 11090 -8621 -3274 41438 16326 14417 26900 29085 6522 -17390 -24706 -31078
22240 -31078 -15217 -110 1189 2983 2733 17709 15451 -10919 -24975 -21366 1144 -8337 -12605
22227 -12605 -25585 -26957 -23200 -35342 -46449 -43098 -49888 -45733 -31640 -31918 -39289 -14911 21561
22214 21561 22219 -7537 -37665 -45752 -35934 2699 -16874 -42242 -15998 -10207 -6409 10136 24939
22201 24939 35146 13044 -7880 -28886 -22704 -8478 22340 7620 1769 12109 -14224 -23062
22189 -23062 -26057 -39171 -51893 -37998 -36730 -35183 -9634 11081 -696 -26960 -14685 -18290
22177 -18290 -652 -2062 -2407 -28586 -6515 1374 15767 12782 12745 34454 70006 60023 52395 24752
22163 24752 -14232 -24796 -3846 10075 16038 -8267 -2684 -13011 -44969 -43019 -39383 -36551 -3987
22150 -3987 7529 10120 34353 34939 -6166 -3576 -25670 -33037 -29083 -33402 -20674 -14089 -20234 -11874
22136 -11874 -34013 -37989 -26910 -25728 3625 24398 26524 31680 46073 40366 49766 31449 23690
22123 23690 20355 3026 -32105 -31827 -51091 -45650 -64579 -60181 -26460 -8638 -7997 -13369 -24057
22110 -24057 -16212 16626 46480 66131 81239 74294 48648 16757 9036 1701 13743 13848 -1618
22097 -1618 199 29017 54246 37820 13071 3823 9516 3481 2550 -14504 -29124 -36046 -12789
22084 -12789 -8597 -653 -3754 -7788 -33842 -51450 -40995 -14192 -961 9405 -6298 3919
22072 3919 6447 11448 24928 8450 5954 -958 5238 3637 -4526 -18335 -24089 -12377 -7438 13946
22058 13946 28654 39581 61969 44560 29173 13490 2421 -26931 -25976 7275 20815 -2694
22046 -2694 -17660 -42730 -59259 -47286 -49687 -51208 -25942 -28025 -23552 -5402 -2269 -32073 -13360
22033 -13360 26091 21723 2781 -24342 -43162 -41611 -21538 -12822 -19441 627 5860 7782 10785
22020 10785 -1787 4521 24823 25398 21334 20926 11922 18433 10112 16600 33570 29558 1430 -19233
22006 -19233 -8550 -16819 -15328 6785 -15761 -14658 1322 10687 14865 16022 -3735 -9301 -2823
21993 -2823 6907 21564 -3431 -29417 -19950 -17 16498 25811 28962 33336 23117 25949 16495
21980 16495 23393 44324 8394 -9106 4845 -2868 16895 38615 23071 15714 18848 -7565
21968 -7565 -22583 -11857 14227 28232 28466 6775 -24807 -26349 -24586 -13723 -7580 16125 27294
21955 27294 26223 -11792 -314 17412 12721 -12903 -21887 -22772 -13825 -23089 -8427 4085 1723
21942 1723 -25274 -61123 -58698 -43911 -33107 -14580 28225 51835 43392 27417 38431 25688
21930 25688 -1183 2007 53133 70238 57148 7405 -33751 -55140 -30669 -32065 15988 36497
21918 36497 29066 21714 15484 -9923 -1256 17895 -4218 -19905 -1229 16369 13110 20769 14848
21905 14848 9324 13291 13907 22424 25134 12619 12618 -10960 -10614 -6898 -5103 18122 22412 18038 26242
21890 26242 39978 40162 48553 25948 10215 8920 -14230 -20775 -8544 15939 5383 950 -8469
21877 -8469 -7849 4579 11651 6219 -8217 -6908 -12010 -6208 -10918 -19711 -23911 -30385 -9177 -280
21863 -280 520 27306 57269 11637 -4382 18772 14598 5799 -4932 2612 -3444 2922 23038
21850 23038 30455 26495 18564 10318 21472 13378 -6362 2566 -9261 10255 20662 9615 4102
21837 4102 25020 40545 18801 -13320 -13261 -1773 2199 2659 6022 12415 37874 50290 44640 38959
21823 38959 52794 22903 7470 8296 -4027 -11014 -15527 -23418 -34082 -45514 -56651 -44740 -31910
21810 -31910 -37173 -45884 -15604 18622 33857 50927 60945 45962 34930 31660 -468 -21750
21798 -21750 -7869 31128 65625 61458 60585 71200 74611 50508 37308 40485 30200 18886 28590
21785 28590 28165 17910 -4726 10392 32028 24704 8751 18049 15550 15323 6153 5710 -895 5611
21771 5611 8359 -25459 -55490 -57159 -24070 19060 49537 39578 7655 -11981 -8682 -21686 -45121
21758 -45121 -11229 -2809 -30720 -35670 -24169 11687 27309 21481 25771 34149 5263 -16274 -11653
21745 -11653 19584 24838 24343 60145 78047 51790 17375 -9300 -1405 20998 47772 66432
21733 66432 43067 42665 31102 29982 -13486 -21745 -20932 -28209 -10030 6825 14760 20608 15256 4927
21719 4927 11603 13789 12196 1179 -29388 -36866 -28319 -31834 5556 23555 31090 -16549 -38995
21706 -38995 -25871 -40811 -69231 -44435 -59329 -54344 -47622 -44859 -44027 -31965 -25801 -5043 9203
21693 9203 15503 16891 2204 901 -6299 173 -363 5210 27014 39571 12944 -17502 -10656 -6907
21679 -6907 -18017 -6978 7659 -6056 -8011 13993 2925 -2745 47010 72259 58249 58607 46330
21666 46330 53290 60749 67429 61182 29714 39212 28502 10738 36202 24886 -7252 -1412 15082
21653 15082 9215 17172 36583 22767 7486 20454 1540 -18009 -14387 -11528 -1563 3710 269
21640 269 -13384 -20364 -26476 2360 11296 23934 15661 -3231 400 -85 -3500 -25376 -7172 -1797
21626 -1797 -6873 -2082 -21315 -17449 11907 45073 45402 58797 40850 17346 1702 1791 -1803 12940
21612 12940 52632 70832 57501 43630 53906 28938 -12209 6294 11027 -498 4154 780
21600 780 17427 55568 66848 53853 38918 36665 47491 41762 31652 32365 55058 36540 807
21587 807 -20774 -38059 -55828 -70963 -64920 -52976 -18754 -24200 -998 46777 58714 46051
21575 46051 34698 23832 36197 13827 4167 5349 -1177 -15767 -3037 -6537 5014 23582
21563 23582 15033 23407 30547 26752 25478 34789 18668 32243 12929 1694 1874 -16637 -28272
21550 -28272 -15025 69 -11613 2082 29036 38453 21293 6770 8818 9858 18770 31142
21538 31142 11138 17919 35317 48643 50358 59322 7284 -31298 -23474 7408 -30761 -40453 -48651
21525 -48651 -32337 -14103 -4051 -4117 -19906 -16689 -26728 -21081 -1979 5112 6898 17826 -2050
21512 -2050 -6912 16945 -6810 -15701 -6315 13325 34651 22077 26249 47462 54844 55407 28373
21499 28373 19405 14619 12829 16213 29203 64641 77297 34990 19139 -1372 14544 38444
21487 38444 46590 41805 31759 9857 11481 37642 63696 27876 27178 35379 30416 4691 22805
21474 22805 54271 39196 1155 -29274 -24854 -4501 4990 6638 8339 -2515 -12965 2648
21462 2648 14198 42283 30183 -1381 -2841 983 -35766 -24827 -37910 -48368 -13360 23807
21450 23807 9599 4897 34115 28760 23954 32420 9850 -21696 8121 19338 29833 14258
21438 14258 -13134 -29851 -33385 -32169 -37605 -48455 -29038 3783 28006 46572 29693 677
21426 677 -13037 -9709 -58735 -49222 -19003 13852 36356 43536 62870 22519 -30569 -18292 -12841
21413 -12841 2052 36568 28184 27217 54484 59669 58949 44222 21003 44244 57342 54634 29851
21400 29851 16484 -7382 -14208 -11676 2337 29691 31640 9409 -22487 3916 16779 23313
21388 23313 26643 28976 24095 11189 -7891 -9179 -11213 -12427 23019 24198 5356 18326 37428
21375 37428 47552 82795 96234 76594 77555 52935 -11446 -22438 -6203 42016 48534 34569
21363 34569 66066 52196 30615 38936 26564 12929 15679 22064 32350 43263 39312 36930 50782
21350 50782 46414 65405 82721 65113 41059 46925 30197 27120 26776 12933 11334 31552 11722
21337 11722 -18882 -18165 -11486 -17925 -11135 15470 49364 81721 43501 39830 40649 30751 9251
21324 9251 26210 27520 29011 45640 83748 65475 52037 50778 22372 10449 2259 10053 30600
21311 30600 38995 19171 33609 72493 81431 66655 46955 31836 10543 4820 -3702 -1198 6269
21298 6269 841 31871 62428 77818 51434 61873 90873 95745 72913 49889 48503 36464
21286 36464 39606 26370 4852 -8460 25940 65859 48328 61549 60132 46903 30935 31965
21274 31965 15348 28262 34770 39438 28009 47403 51947 24771 3121 11709 27157 57468
21262 57468 56260 15120 -14098 -3592 14954 18884 51532 65190 29841 841 5502 13537
21250 13537 21595 40463 67344 65942 67084 69726 50142 46405 60712 58207 49827 63535 63787
21237 63787 28251 30130 71797 72345 82702 87201 81803 50954 51152 53030 41280 25426 21447
21224 21447 36795 50268 48971 5737 3798 26043 48099 30584 31346 22892 31702 15096 -4499
21211 -4499 13065 24197 19222 17225 -4896 4305 44953 70008 56247 25293 47660 37795 9425
21198 9425 3658 40223 57874 36742 52628 44340 12787 3989 -4721 -8399 19344 40275 30003
21185 30003 36698 39634 64348 57364 65093 65413 58810 60334 64196 66324 47743 37508 35508 36692
21171 36692 62578 83529 72111 82461 103471 85209 57596 42832 33780 60973 96599 94063
21159 94063 68833 61250 85576 85143 80086 83828 55142 18976 10198 31519 42602 18440 23763
21146 23763 26573 25682 23880 -2474 8740 33050 28611 80536 114990 95157 63401 31197 27581
21133 27581 27409 21280 19249 27026 35061 66146 58532 55076 42806 69512 82535 83604 90640 81274
21119 81274 83156 74071 55472 64118 72567 91960 86434 71047 72395 58923 51918 50595 71042
21106 71042 49213 15458 14445 47467 98451 63290 55632 64234 60642 51529 44207 35266 71908
21093 71908 80654 89827 79109 79630 87240 61330 43614 64268 82692 82291 98467 107545 83073
21080 83073 70775 39244 23687 28725 22948 17298 47207 78719 67561 77183 87924 73715
21068 73715 83382 83150 80997 94890 93240 106511 84591 47790 24628 35391 39582 58619 65725
21055 65725 49996 33209 50600 74862 74199 41134 33216 44542 74678 81531 69688 49748
21043 49748 46573 40223 46220 73188 92337 74589 70808 81791 83927 78400 52642 13836 -685
21030 -685 12419 36549 49376 11724 2391 13563 19667 58416 78255 53489 21244 47459
21018 47459 45133 41721 43911 43138 59484 57584 48934 43466 45674 23741 24071 19113 30180 37301
21004 37301 48007 56442 64104 62884 55482 44209 35797 42480 53922 71697 68494 74214 86181
20991 86181 64578 56089 49179 23237 14122 18554 26386 36715 45568 42323 54632 59978 79168
20978 79168 74073 68072 58880 65546 70917 59599 81523 92133 61035 54372 66540 104852 111384
20965 111384 82069 67343 49288 37253 63689 78513 54596 64351 73446 52281 33640 15871
20953 15871 41432 60102 88860 98175 100929 108797 103434 86404 72863 96531 101746 70307 72336
20940 72336 52001 48598 43427 75064 83625 102793 79663 84240 83177 75491 91283 58522 37467
20927 37467 42261 28520 8355 45687 87420 83845 77776 94871 86532 69995 69739 98674 90361
20914 90361 118832 130624 133428 107210 76149 76405 73395 90702 103835 114441 117222 112588 93816
20901 93816 82620 74848 79327 59382 45546 60390 68493 56221 51630 71330 71643 55735 50246
20888 50246 73165 83421 88120 83399 95745 94985 78391 81185 99467 129911 162629 168111 157313
20875 157313 135091 118657 146096 157486 141373 135316 140470 122051 104301 121620 101306 73761
20863 73761 97933 133874 161879 139602 143982 175303 162736 162306 139307 147759 154027 169320 155823
20850 155823 149086 150556 125663 100632 119831 139384 136234 157645 169814 171187 168605 150056
20838 150056 117968 114795 150525 162874 178848 170931 150080 164275 149169 124176 125592 143570
20826 143570 147128 118850 133975 132767 105992 91094 101389 118661 121018 119590 156587 158812
20814 158812 149920 152303 162630 155092 140053 142085 142999 144943 156175 143791 129471 125015 141445
20801 141445 143681 160989 169423 156237 145086 137239 128722 142026 140358 146961 145324 166748 176577
20788 176577 172302 156189 129135 103114 133442 162925 151472 146483 171957 183894 151343 174572
20776 174572 186859 191128 194690 194181 199484 205793 201403 230816 242769 228531 215823 224033 238749
20763 238749 253403 261785 264247 280845 284536 292375 308881 313743 306753 318974 324048 354290 450353
20750 450353 558665 699669 842316 1006815 1181576 1357010 1513793 1605289 1652775 1684535
20740 1684535 1655471 1594090 1553816 1584031 1657080 1689244 1702211 1703933 1638360 1506607 1338389
20729 1338389 1153646 954591 790421 665521 585694 502438 423218 375824 369388 356576 334833
20718 334833 301107 299945 300099 305547 290447 291923 302381 302905 311921 323327 298146 290994 282625
20705 282625 290823 284156 291906 269716 257508 242327 231842 235883 231614 231239 254057 271664 264765
20692 264765 265151 262674 236860 214960 210964 220673 224713 228407 235940 212941 269548 269411 255351
20679 255351 252090 242730 231280 229124 227984 219262 224899 236083 240104 247198 247725 255194 274276 268802
20665 268802 252951 242557 238066 237539 249945 255517 275043 275621 248084 250630 252287 260221 270254
20652 270254 243277 222560 245072 262032 294700 321731 328061 330538 360407 387838 449441 506031
20640 506031 609120 721366 830496 907149 958752 956145 966914 1001636 1013591 999794 1029517
20629 1029517 1102798 1168591 1219086 1254184 1300795 1362875 1395913 1375653 1331136 1297227 1285069
20618 1285069 1245240 1168567 1081689 1050201 1066273 1092889 1128958 1146606 1131119 1069626 962118
20607 962118 873800 762210 645905 589021 548889 505053 476644 476943 462226 447837 414177
20596 414177 407199 410247 398923 390793 378454 391532 371017 324151 331117 314901 301514 300952 303418
20583 303418 310744 304974 322423 320776 320431 342109 338783 312154 319975 355669 337495 329997 319283
20570 319283 319202 297516 307580 306063 307769 311487 314603 324503 336892 319125 353552 343735 353487
20557 353487 351819 359703 367363 383913 379218 359246 337230 347263 319771 298809 306074 298253 272027
20544 272027 269678 299376 282517 278904 305814 289925 289003 286304 275515 270417 294742 305000 284459
20531 284459 269721 263256 273441 297104 288042 278342 277034 283091 285815 293220 335508 359037 362599
20518 362599 350687 351346 346727 348619 335330 332195 340257 370434 357152 352316 374526 374332 391519
20505 391519 395489 395568 390112 387361 388904 404844 422771 442421 466422 483372 494292 524901 598630
20492 598630 694746 827032 983563 1171087 1338853 1502990 1592161 1592896 1554038 1534673 1473658
20481 1473658 1351011 1212868 1104650 1070707 1068613 1099110 1210539 1333151 1489462 1657118
20471 1657118 1822680 1864794 1833429 1782900 1663032 1525619 1378886 1209073 1060885 907991
20461 907991 779343 735094 693182 669326 630549 615523 605579 602257 610050 594079 599441 583495
20449 583495 570134 576162 577824 563936 562340 547742 501858 501989 526090 532869 550618 550483 546331
20436 546331 565618 581996 602612 641645 685299 698433 701348 696448 706768 736676 725991 707549
20424 707549 694493 667822 650191 669973 724158 757915 766979 758510 712705 655890 627846 607391
20412 607391 570115 554621 568647 562503 523860 519051 510932 494357 475612 465365 459670 461250
20400 461250 480028 468842 458206 467486 470037 471084 473590 482014 499739 476825 453226 464097
20388 464097 484454 502951 503636 487862 482482 488680 504193 527948 524382 520427 495058 477325 500226
20375 500226 509588 510038 542127 570955 597357 633105 663166 666110 661131 646639 617492 611221 585725
20362 585725 595522 622314 635685 654085 655948 643173 615095 629762 645712 632529 604080 595633
20350 595633 605897 600715 592646 618620 630561 629635 613955 582040 574893 585340 616546 627365
20338 627365 625533 627553 625855 638982 633031 617532 639792 659625 643264 652059 643096 644403 661091
20325 661091 712035 755835 751685 767111 789331 820076 850963 856759 840185 831091 823145 815275
20313 815275 790681 794220 844597 901256 964957 988726 1018516 1073264 1152008 1205478 1215283 1203119
20301 1203119 1229254 1252910 1280020 1321608 1332091 1320104 1313928 1326082 1326341 1362822 1401323 1426233
20289 1426233 1428479 1428821 1383061 1366613 1356052 1321661 1296365 1275362 1276142 1271241 1278280 1316258 1373040
20276 1373040 1399333 1397051 1396755 1383109 1404414 1421209 1420526 1454768 1490401 1506364 1489164 1446315
20264 1446315 1462709 1513518 1542188 1573316 1579752 1604851 1623083 1652839 1679456 1677370 1667389 1673940
20252 1673940 1702102 1715982 1702212 1697753 1716555 1738121 1745395 1719429 1693999 1688972 1694558 1705315
20240 1705315 1724201 1749070 1737610 1753243 1783333 1837935 1869869 1934960 1985600 2007026 2050053
20229 2050053 2103546 2151929 2209968 2247438 2281574 2397034 2510680 2629353 2747548 2845621
20219 2845621 2963472 3056960 3200643 3360273 3508986 3658768 3847679 4082561 4368585 4773737
20209 4773737 5237914 5771231 6371936 6988906 7584738 8090660 8520056 8920366 9292957
20200 9292957 9694538 10154788 10706461 11433010 12275155 13174916 14028209 14859862 15744540
20191 15744540 16675858 17692291 18961014 20571716 22681846 25489239 29254212 34338296
20183 34338296 41306139 50989951 64741432 84104468 109866358 140809948 173838598
20176 173838598 205027323 230379130 247577290 255932131 257072589 254087482 250922019
20169 250922019 252546680 260400101 273023228 287016683 296823083 298077533 288480737 268442732
20161 268442732 239248588 204111945 168455788 135850246 109234105 89829132 76147179
20154 76147179 66229276 58841733 53122431 48568353 44932194 41994948 39586052 37592715
20146 37592715 35886538 34398933 33041241 31727587 30469031 29240480 28076632 27007203
20138 27007203 26058319 25238858 24541552 23889284 23216688 22491763 21681666 20779008 19787950
20129 19787950 18819544 17854200 16938382 16112419 15391617 14723597 14106044 13571958 13093004
20120 13093004 12668284 12252440 11896547 11614662 11346887 11078095 10857123 10614704 10399986
20111 10399986 10218252 10071039 9927905 9813853 9727457 9629348 9540969 9507330 9493472 9493385 9598854
20100 9598854 9753655 9907685 10077333 10247386 10380634 10462359 10487110 10483888 10449850 10471501
20090 10471501 10589409 10799188 11059985 11395733 11835108 12336030 12906254 13489207 14070478
20081 14070478 14696532 15394801 16184759 17160710 18425521 19999800 22082594 24922224 28783458
20072 28783458 34085006 41582318 52311156 67307964 86026813 105398353 122070692
20065 122070692 134584657 142042083 144360043 141796355 136879295 132333846 130213150 133742981
20057 133742981 141971154 152032626 162636510 173643998 185521153 197184820 206709834
20050 206709834 211136804 210313506 206278560 199461979 189134702 177701118 167577522 160736641
20042 160736641 160321127 164259048 168283314 169598404 166456945 158019183 144077851 127006829
20034 127006829 107673689 88325750 72933836 62041896 54269246 48481814 44008540
20027 44008540 40410854 37487225 35072160 33060732 31342443 29873054 28593520 27476328
20019 27476328 26506710 25558084 24659593 23802794 22926346 22056224 21202497 20398268 19667644
20010 19667644 18976535 18306454 17679582 17113823 16572848 16048039 15511740 15000081 14480861
20001 14480861 13981399 13487556 12987987 12500688 12013871 11583278 11177281 10808683 10500386
19992 10500386 10224689 10001532 9751643 9526643 9352409 9220444 9063504 8911195 8746213
19983 8746213 8551858 8360848 8156985 7970257 7755798 7556955 7333083 7142965 6964963
19974 6964963 6792736 6644231 6549956 6430533 6307653 6232230 6180924 6159260 6136294 6094949
19964 6094949 6003221 5928830 5849156 5732008 5615047 5486494 5399977 5364694 5340487 5350761 5392040
19953 5392040 5454648 5501363 5571783 5673400 5791833 5950634 6147322 6428864 6835077 7296597
19943 7296597 7799384 8279002 8661159 8934768 9093077 9145569 9126895 9071774 9034410 9080091
19933 9080091 9239660 9554687 10080810 10800849 11718314 12797489 13996011 15305401 16715200
19924 16715200 18227381 19936728 21927481 24365618 27583593 31876324 37720531 45896889
19916 45896889 57501880 74081040 97082305 126958492 161963752 198017054 230028344
19909 230028344 253371520 265326487 264952702 252761785 230770502 202429886 172748758
19902 172748758 146683099 128019410 118458074 118347904 127305282 144287790 166980684
19895 166980684 191430967 213098145 228005310 233832530 229724826 216038824 194416771
19888 194416771 167498398 139246277 113319464 92162850 76323962 64986489 56828968
19881 56828968 50789970 46232243 42679957 39849397 37495310 35470331 33659397 31953150
19873 31953150 30306635 28677033 27121494 25667045 24303989 23055222 21949027 21009773
19865 21009773 20249197 19666976 19208191 18902570 18636112 18287115 17859923 17419343 16889562
19856 16889562 16217655 15450605 14648324 13847821 13107672 12431084 11822379 11273895 10814840
19847 10814840 10440869 10124454 9829487 9562044 9294777 9041599 8807089 8563406 8317333
19838 8317333 8061748 7817831 7573341 7318619 7100899 6887267 6708528 6526255 6365258
19829 6365258 6209491 6100535 5959162 5786264 5640283 5503513 5387708 5263047 5095543
19820 5095543 4940303 4807113 4708949 4577034 4426902 4242632 4052721 3912705 3763724 3606957
19810 3606957 3472152 3359800 3253724 3142342 3031871 2888171 2733398 2647965 2582337 2474904
19800 2474904 2363030 2280509 2195839 2096969 1973955 1875213 1823846 1724350 1622424 1568709 1519606
19789 1519606 1460445 1419946 1372346 1342444 1328873 1313720 1288490 1262182 1203671 1160951 1145978
19778 1145978 1110971 1079236 1051809 995658 989896 973882 963455 975479 949332 934391 941845 945921
19766 945921 952300 955162 935607 929939 894762 841251 796489 775050 787812 790527 788686 825970
19754 825970 847286 831208 849476 858493 838761 844173 866415 828392 825118 820018 809515 792847
19742 792847 786414 775921 769566 781288 789883 747304 720908 745190 781238 766831 729537 727522
19730 727522 712590 725217 709167 698232 702318 695543 696895 716575 732663 719291 709207 715341
19718 715341 684666 637496 649562 656577 616723 602576 604188 657258 667576 688376 697694 685890
19706 685890 672136 697009 698103 704745 672343 626036 608627 623769 636391 632475 618478 623917
19694 623917 616668 636524 661491 675597 698571 722443 714424 679339 668703 684362 725922 737950
19682 737950 701960 676081 648627 623455 593948 577017 567957 577890 604718 608690 577832 564048
19670 564048 524888 528584 518907 488027 468659 455016 425158 413917 421162 400900 403884 412048
19658 412048 409526 419675 412902 398849 376866 362957 341699 351265 360779 319892 306370 305738 294186
19645 294186 311313 325596 306198 311369 304339 276711 265995 256178 225049 233927 236575 230064 188325
19632 188325 185391 201859 202587 208319 216133 220558 229976 253905 278340 268536 268276 253284 225870
19619 225870 226016 220107 223400 252626 266221 287618 306772 326925 327839 358299 382077 384118 395839
19606 395839 415594 460312 559666 689712 804141 985322 1195697 1383913 1575711 1721188
19596 1721188 1798401 1798158 1749596 1697726 1659235 1650053 1658348 1726660 1815161 1804511 1762543 1678245
19584 1678245 1553167 1411656 1235073 1029630 858298 743517 680083 651453 588698 546230
19574 546230 567080 546019 501875 473565 457028 441052 438458 459317 421113 398601 392323 375185
19562 375185 381662 364489 330196 330222 347646 349954 350133 329962 330153 371211 382847 379629 352231
19549 352231 334633 326973 313008 311565 317995 306880 279760 258388 240204 262654 273345 278545
19537 278545 267465 271396 250202 236480 237426 237592 219114 234514 261364 269186 268341 255772 240765
19524 240765 241853 243410 251948 263018 239868 227887 270885 263804 240208 233615 227722 239748 244647
19511 244647 258185 263736 244571 233351 224022 225310 252419 255893 245115 215689 195674 205619
19499 205619 234658 236059 249081 273961 297330 313416 315764 319453 363485 422184 476403 602585
19487 602585 720678 818005 900332 967525 983977 971562 941081 936173 936188 950220 967361 1027082
19475 1027082 1102606 1138563 1173558 1220346 1259000 1244080 1224066 1180874 1142788 1111084 1078483
19464 1078483 1028890 982100 971564 990331 1019398 1021741 982937 945785 863912 765646 668229
19453 668229 585100 518094 463225 432502 373978 339968 328044 300435 280604 276626 260606 248350
19441 248350 249900 267338 261368 236328 232046 201069 204347 185880 192547 205140 215781 221679 213357
19428 213357 191020 202294 213387 181814 161846 141642 110779 143200 172952 161087 158802 154506
19416 154506 138963 123024 95241 98640 102842 71748 65143 85190 61735 90193 118671 129676
19404 129676 122287 97637 77251 94843 100740 116956 84521 56855 66181 58737 35246 8050
19392 8050 13692 8457 6437 26172 51232 56068 38023 30091 27685 12423 14319 29121 18801
19379 18801 11851 33216 60666 59024 56872 39013 1002 16138 15377 25714 34275 41254 76802
19366 76802 71045 90292 101809 98454 87538 71291 59189 77464 93835 108646 137079 151209
19354 151209 155419 137470 151532 163162 131959 145735 159453 160405 165384 149620 154140 175771
19342 175771 199416 219334 217177 207231 219417 243862 219342 230342 281098 321000 371915 431751
19330 431751 550896 712557 871440 1062276 1266066 1388661 1456827 1437889 1380285 1307715
19320 1307715 1222507 1052801 917362 848098 781838 763278 794757 869005 1015300 1160727
19310 1160727 1263587 1344647 1419243 1411859 1338519 1206386 1046756 850325 675066 572698
19300 572698 491877 409356 329919 291534 297489 273680 231918 199892 208093 195487 183111 191423
19288 191423 171245 161908 144254 128589 118179 83715 79640 105268 113825 101079 83382 99432
19276 99432 133636 134681 110607 97717 115477 117741 97145 75846 71298 66340 54368 65140
19264 65140 43761 29199 37646 66241 73805 84767 94650 91861 104020 94787 78063 63283 66701
19251 66701 75847 45771 37706 82010 91613 73341 54708 43486 52341 52205 46985 40754 51321
19238 51321 69413 49446 22289 26268 11829 -11442 -19341 22752 18444 -5051 -930 28933
19226 28933 41136 35254 36681 22480 -2800 -20496 -36196 -42275 -49446 -48025 -47137 -32755 -60156
19213 -60156 -55358 -45623 -50028 -53916 -48699 -41085 -30133 -22006 -17834 -25501 -19682 -12103 2918 3620
19199 3620 6796 3746 -26456 -26419 -9991 -27146 -12208 4494 10512 12050 15016 12611 -9433 -39951
19185 -39951 -60783 -57033 -68230 -86775 -75542 -51830 -42185 -65763 -69338 -55817 -50067 -72986
19173 -72986 -75678 -60764 -33717 -12219 -9817 -16636 -16052 -13180 -29565 -12281 -33109 -49829 -56428
19160 -56428 -33783 -15970 -10344 -10774 -34833 -39336 -43739 -34413 -24923 -54106 -61002 -46154 -24127
19147 -24127 -11935 -14434 -15193 -18854 -33094 -28147 -21353 -39621 -34278 -23620 -39597 -42447 -35171
19134 -35171 -28659 -37801 -50838 -50315 -58784 -58680 -50006 -49860 -28973 -28339 -18864 -17047 -11124 -31607 -25648
19119 -25648 -25054 -28940 -27582 -14928 -17974 -31605 -35874 -39320 -53598 -48573 -30046 -42177 -52745
19106 -52745 -66538 -62229 -53256 -71582 -44942 -29334 -45524 -39221 -52441 -60729 -51961 -39430 -50373
19093 -50373 -72233 -71324 -65873 -66871 -61179 -59919 -61106 -53903 -31017 -61809 -80210 -91862 -115150
19080 -115150 -113117 -82237 -26869 -13544 -19389 -36516 -68414 -91923 -97415 -78403 -72565 -45034
19068 -45034 -43507 -59257 -33248 -35148 -73688 -96261 -103176 -65943 -30241 -23055 -24230 -40034 -49174
19055 -49174 -54400 -63066 -60607 -80406 -95970 -101228 -97856 -103682 -121761 -121925 -124577 -77905 -56039
19042 -56039 -61861 -71882 -61814 -36347 -23042 -19692 -29300 -38467 -40027 -18518 -7353 2469 18453
19029 18453 17518 5931 -51557 -103398 -89242 -74898 -71680 -51145 -54955 -50409 -26410 -64929 -91242
19016 -91242 -89693 -76803 -76943 -94546 -87556 -86251 -105813 -101634 -101830 -101892 -95522 -97569 -95997 -88332 -65502
19001 -65502 -41516 -37805 -39803 -63770 -66418 -62219 -50319 -55240 -65270 -89050 -74207 -68624 -87608
18988 -87608 -75122 -67176 -107772 -101466 -69500 -50607 -48959 -48742 -52423 -62995 -64144 -61594 -69068
18975 -69068 -55427 -61203 -62534 -78283 -66616 -66737 -66921 -52220 -54936 -62468 -60894 -55701 -66952 -61719
18961 -61719 -53300 -46917 -58221 -67662 -31462 -23099 -48528 -35887 -15820 -15531 -28073 -38668 -72726
18948 -72726 -68432 -81717 -103252 -57429 -45685 -52377 -46297 -77827 -115594 -135823 -131121 -49907
18936 -49907 -3478 -29334 -59498 -73844 -88361 -88723 -63605 -80374 -99407 -73319 -55993 -56155
18924 -56155 -41110 -33745 -48849 -32922 -24968 -20406 -12477 -8256 -27524 -36546 -43386 -45630 -33975
18911 -33975 -33588 -49114 -20821 -13010 -12459 -38815 -51411 -71156 -74685 -74256 -88295 -61691 -28220
18898 -28220 -28643 -52672 -60244 -44379 -47073 -93282 -100544 -68457 -53837 -66743 -81176 -72732 -53702
18885 -53702 -52993 -32817 -33522 -31105 -44206 -86524 -78235 -79953 -76727 -57088 -34273 -19790 -19098 -34987
18871 -34987 -70600 -69503 -59822 -26418 -6436 -10201 -31657 -60349 -63245 -48906 -37607 -37062 -39991
18858 -39991 -38423 -31424 -15897 -17117 -24087 -16440 -2590 19278 -5112 -4152 -20299 7016 13896
18845 13896 -5534 -8189 -2798 9776 11311 -5633 10185 22674 28844 20529 11811 11017 12808
18832 12808 14795 34152 21510 4008 47691 65224 29554 7251 22304 28986 23253 15709
18820 15709 31107 42054 33905 -2452 -16326 -1229 -9953 -3211 23814 16067 5508 -23225
18808 -23225 -18757 -3117 5315 -21334 -54675 -70639 -50974 -19443 3827 2360 13026 217
18796 217 17674 48610 13496 34006 57550 64668 44305 16360 4055 24047 13058 19495
18784 19495 53102 30261 14296 27851 44531 69917 100461 100788 99400 90000 68184 64106 103733
18771 103733 154862 190027 209566 213626 219131 250711 250935 213965 185403 142182 109937 112509
18759 112509 118870 137542 118369 120724 136803 134269 98804 98471 84839 92327 105406 106759 75403
18746 75403 44805 51325 97236 107877 123597 119651 122438 127273 111438 124738 127286 134063 152155
18733 152155 133302 153729 140441 121555 120756 130786 131739 141119 134055 139363 141627 133651 137392
18720 137392 158140 161801 138486 115806 115406 132668 133669 111281 113793 155211 204479 202241 191719
18707 191719 195744 166785 148005 160960 161015 152350 143257 130136 138836 128411 147530 151174 178220
18694 178220 190036 202515 199018 175773 173107 180895 181657 176076 154655 121452 118515 134607 150487
18681 150487 184086 184801 183678 190136 179377 165178 161643 152222 131352 147168 168384 170615 143616
18668 143616 157791 166237 190772 199069 194621 191987 186896 185404 168315 157067 157228 194885 181537
18655 181537 150033 151186 128888 131680 144273 179618 174395 150180 160002 178734 152775 121271
18643 121271 125031 134516 107295 96838 93839 113842 106323 87055 85171 81514 74229 92419 71109
18630 71109 70290 90991 76409 87159 95673 73207 77319 79892 112125 140282 127395 87366 73796
18617 73796 66445 47803 62559 94068 106311 104543 115937 120025 103599 101978 110109 115983 129646
18604 129646 124758 106647 81764 87444 107965 115706 102659 119411 129257 128962 121427 115645 112749
18591 112749 128682 136644 112488 126990 156371 130715 87365 78851 97036 103676 83016 94932
18579 94932 93963 78708 58251 83131 98619 63811 48804 72345 55989 32813 51819 77492
18567 77492 68752 64039 32047 -3051 -16385 -19038 -16656 -7067 26980 29453 19832 4423 -277
18554 -277 -6915 -3165 21352 5257 -34893 -34612 -32288 -11655 5220 -2515 17449 33199 18167
18541 18167 8636 1089 -746 18104 22501 -6152 -31837 -17727 -8990 -19350 -20696 -38363 -54692
18528 -54692 -27951 -24769 -22964 -17551 7047 -32139 -51598 -52074 -41994 -35512 -17801 885 12650
18515 12650 -6424 -28118 -40450 -63525 -62051 -55044 -46281 -73092 -54181 -52887 -59730 -49639 -20040
18502 -20040 -40348 -43653 -32600 -19838 -16994 -28852 -44949 -53786 -16917 -12646 -27356 -44068
18490 -44068 -58017 -82613 -69019 -47728 -30023 -25547 -50200 -45779 -17646 -30078 -22344 -17567
18478 -17567 -54772 -91359 -108443 -88640 -66236 -56309 -55523 -46285 -63384 -89254 -98867 -88078 -83702
18465 -83702 -64619 -39578 -52744 -59798 -62473 -59726 -52466 -41401 -25020 -49864 -58475 -39161 -38079
18452 -38079 -29985 -33458 -50727 -44325 -60016 -65618 -53648 -45381 -50490 -60492 -69079 -58920 -39587
18439 -39587 -58136 -75163 -72746 -82644 -125791 -130091 -101704 -76602 -120271 -129299 -103881 -82156
18427 -82156 -80897 -97652 -84244 -78274 -51358 -53995 -65325 -54025 -42728 -38336 -46217 -58929 -54628
18414 -54628 -53398 -72158 -75441 -64732 -77764 -83515 -84043 -77032 -90166 -79623 -46663 -46135 -48468
18401 -48468 -12551 33199 24647 5061 -14782 -47973 -63977 -84336 -84672 -79414 -76124 -68938 -72275
18388 -72275 -72308 -32127 -36485 -53670 -47817 -33524 -34325 -38843 -58922 -63785 -33095 -55997 -76729
18375 -76729 -78503 -67770 -85510 -67818 -71177 -45202 -29262 -43838 -29709 -28687 -19700 -5241
18363 -5241 -27111 -36488 -32308 -21025 -8692 -1787 -6634 -22051 -29333 -16239 -45037 -60664 -79546
18350 -79546 -75518 -48416 -34397 -63541 -55148 -32082 -22385 -18974 -4535 1840 -15273 -44128 -35623
18337 -35623 -30832 -54986 -55355 -76397 -77969 -78195 -34039 -18303 -9904 5282 19133 -3751 -57475
18324 -57475 -70651 -58002 -48581 -35148 -40273 -43439 -229 -5078 -39082 -64419 -49666 -47660 -39759
18311 -39759 -62847 -69924 -72413 -48898 -62051 -99361 -88857 -63257 -52282 -64984 -63305 -46479
18299 -46479 -31623 -28531 -26615 -42763 -50597 -44556 -50215 -50563 -56513 -40549 -36129 -18903 -39327
18286 -39327 -57619 -36372 -16563 -7018 -16864 -29630 -52973 -69532 -60997 -62501 -77893 -65782
18274 -65782 -73714 -85954 -67856 -55070 -47507 -49618 -24414 7601 -7890 -34304 -47488 -47408 -60663
18261 -60663 -54580 -68550 -57959 -60226 -74380 -100586 -127477 -116167 -94193 -88777 -60723 -50116
18249 -50116 -35027 -33688 -35364 -55735 -74617 -76538 -67856 -71257 -67859 -67421 -59862 -44676 -46524 -27881
18235 -27881 -13357 -21360 -35762 -6865 -13998 -37474 -26188 -43331 -83805 -69337 -39976 -46324
18223 -46324 -36960 -52371 -46609 -58808 -53280 -38326 -8138 -18310 -6212 14542 -2458 3210
18211 3210 233 12583 15793 16616 10167 22474 42226 34176 9498 -8014 18145 56534 72553
18198 72553 52466 52032 60400 11829 -34726 -35183 -35632 -34269 -62527 -59050 -46339 -27267 -1030
18185 -1030 -4192 -26436 -9291 -10010 7974 10263 -15617 -5259 -5557 -16196 -31718 -30818 -4052
18172 -4052 9968 10531 -30556 -8929 9805 7081 -4146 -3127 -5846 7252 -37574 -49629 -40049
18159 -40049 -41711 -11409 355 28435 29771 9420 742 -2647 26905 31463 12501 11040 28965
18146 28965 52756 95061 104342 77259 68679 68746 62731 71815 95232 137118 165341 177292 218202
18133 218202 252221 277485 324078 359185 380128 413378 471041 528355 598206 699901 809393
18122 809393 936562 1096861 1296422 1573476 1942507 2409346 3147845 4249833 6045568
18113 6045568 9296003 15039573 22934693 28299682 27993234 26583224 27115849 26896217 20067037
18104 20067037 12647023 8653144 6533228 5262541 4425950 3808709 3357284 3010876 2707768
18095 2707768 2441092 2212440 2011965 1874989 1768138 1663587 1571714 1489136 1415260 1319924
18085 1319924 1241149 1199479 1147150 1094047 1043252 1009380 955426 927285 876363 851795 824988
18074 824988 768385 746728 722524 682024 643085 637694 619894 590366 543183 530659 520831 515233
18062 515233 511423 504436 472829 425987 369132 358128 367099 344321 318841 289151 295212 310229
18050 310229 307311 284117 267961 279922 295261 314796 329619 296934 287658 249991 239440 234622
18038 234622 206406 183085 170109 162838 157633 117636 113480 132881 147172 118010 93260 132556
18026 132556 172710 165189 128837 103770 112366 118238 120482 124905 118438 121692 94041 78509 68386
18013 68386 86068 111818 105875 65022 46760 7395 -10784 -10794 -37606 -41830 -16965 -2892 -15647
18000 -15647 -14318 -3702 -4264 15628 29280 63875 36528 -4924 -13589 858 20146 31039
17988 31039 12872 3335 6116 -12858 4024 16496 14914 12132 5673 -2694 -16927 -13367 -25141
17975 -25141 -14991 -17167 -16145 -15659 10188 8187 11766 12589 37711 50931 20306 -9701 -31170
17962 -31170 -21952 -13738 -12836 12595 34705 41591 65086 132478 198971 241778 294722 368979 496131
17949 496131 615600 658087 621401 566793 526580 449842 354933 249955 193439 130824 81301
17938 81301 61105 66004 90328 82278 63617 62030 44664 43193 50473 42368 36598 35552 46214
17925 46214 53719 31513 24463 44648 53222 51477 49511 34631 10747 -623 -12866 7313 14649
17912 14649 -22038 -19038 8613 37947 37577 40355 24049 -18978 -18712 -40639 -17384 -11890 -2274
17899 -2274 1444 7847 9421 15985 31530 29275 21655 23792 41703 40685 79058 120590 170122
17886 170122 209527 224915 256529 343108 415948 516669 620954 631813 631055 604056 551278
17875 551278 488269 386486 304387 215164 153626 101266 69027 39073 2712 -1092 6516 19358
17863 19358 19027 26184 48280 41082 21713 27460 34561 34157 47082 45353 27133 26544 35216 56279
17849 56279 38576 56364 53199 68597 113547 168802 250245 366141 486528 582428 674866
17838 674866 782327 796569 785149 728978 631249 492420 354815 277914 207841 181839 189912
17827 189912 174417 183172 160111 124676 88100 55926 22843 29403 57485 65315 57968 49111
17815 49111 20326 -5257 -6393 15640 14393 21513 37291 49514 -3798 4624 13257 -9675 -13969
17802 -13969 10867 -7357 11625 42134 53611 41945 45320 66456 28217 10858 21476 14488
17790 14488 11618 30669 51547 40918 22284 54668 60665 77518 80054 72114 93353 103175 90739
17777 90739 78074 113187 149748 230496 316821 436446 564032 647086 700978 726524 699781
17766 699781 642565 583611 477958 368476 296405 245662 238166 195097 138586 101803 82067
17755 82067 97707 103994 94051 91778 98584 96844 95375 91657 87064 78471 18499 816 15094
17742 15094 25215 33434 8511 29186 36882 39671 11031 17459 34827 16987 5491 -13773
17730 -13773 -2684 5605 40216 74841 103731 110197 72151 43382 32706 18485 36659 46564
17718 46564 44362 35281 43077 49378 77383 73889 62020 81743 85319 94758 117637 155748 163380
17705 163380 139000 137057 113523 84798 62015 28284 34559 5865 2669 35234 29908 8247
17693 8247 6621 17468 31049 41705 52867 40245 36267 39065 40230 26383 16358 19710 19097
17680 19097 -2426 -12858 17367 38840 14248 23130 45874 28576 45065 42395 53894 28560
17668 28560 4592 9558 -4316 -27632 -13390 13861 23327 19152 18953 27253 12219 1363 14880
17655 14880 52863 53627 47919 38990 27952 39677 66180 111233 133902 132667 145335 152964 151304
17642 151304 167839 161038 166148 170210 181171 195481 179100 141536 94130 79513 79868 61738
17630 61738 59649 42205 53526 46699 50442 44522 33547 36439 45978 33448 32055 29298 34053
17617 34053 28266 28908 39421 63161 111545 123240 125614 100698 74460 63603 70997 63637 74610
17604 74610 66977 52229 67365 105152 144645 175024 177894 170780 196682 191668 168681 148126
17592 148126 120766 112014 128519 118155 103690 106250 120623 154976 150522 139081 160306 186468
17580 186468 217950 248909 250562 273707 272449 246940 238544 241048 189626 120069 85279 87011
17568 87011 93019 116600 114861 121622 134558 134402 164059 195635 203756 178675 161642 158311 142988
17555 142988 129203 138125 140847 163947 186081 211661 211662 207099 198143 216852 229214 226364 227191 213097
17541 213097 213275 213438 205486 242126 280010 290184 272659 284369 321123 348738 376655 361848
17529 361848 337461 322154 313197 321350 303523 265782 245464 229436 223324 212318 229677 263300
17517 263300 280388 306782 353763 369294 357396 358822 391414 417140 426715 412658 401387 394235
17505 394235 360808 318318 295564 272503 263652 311992 398031 454287 508363 556007 569620 578752
17493 578752 600856 611206 606691 619757 643309 674932 696417 747587 825506 881080 925340 1020470
17481 1020470 1127460 1242491 1338210 1454289 1569697 1714312 1894142 2095117 2342591 2657187
17471 2657187 2972674 3349980 3874738 4493583 5177935 5976740 6926842 8029899 9401743
17462 9401743 11267949 13925820 18016928 24503246 34338772 47581969 63051669 78930160
17454 78930160 92783829 102539159 106381282 104414880 97013305 84992068 70367243 55613542
17446 55613542 42837182 32740636 25998686 21720911 18808194 16694565 15074517 13715861
17438 13715861 12517180 11453991 10477895 9639705 8926763 8329439 7841577 7426822 7070434
17429 7070434 6757342 6458404 6192404 5960008 5760099 5543325 5347617 5229494 5125998
17420 5125998 4984285 4850114 4723005 4641187 4567637 4492659 4408561 4336101 4295020 4229953 4213977
17409 4213977 4230821 4274983 4360263 4493578 4685979 4920662 5152062 5461325 5843611 6368945
17399 6368945 7020823 7745960 8582127 9580421 10794895 12369402 14507603 17678385 22612177
17390 22612177 30418072 41982216 56969969 73951555 90672804 104491453 113258675
17383 113258675 115435586 111667903 102097513 88178566 72075969 56619412 43496730
17376 43496730 33602248 27256261 23253461 20512857 18505533 16956831 15695320 14600374
17368 14600374 13659975 12849477 12184281 11662472 11283356 10981913 10780087 10738898 10798211 11004803
17358 11004803 11382957 11928873 12616490 13499448 14627558 16057712 17900612 20498414 24397151
17349 24397151 30606610 40491617 55197455 74141921 95428327 116229345 133244134
17342 133244134 143858926 146260628 141225131 128824836 111074983 90677358 71299189
17335 71299189 54920724 42571717 34598591 29501321 25938499 23290401 21155605 19343220
17327 19343220 17753225 16347332 15105119 14038432 13140839 12347983 11661218 11084993 10585385
17318 10585385 10183502 9805094 9427017 9084716 8778854 8448458 8163144 7870373 7640490
17309 7640490 7435941 7223993 7059429 6912076 6772259 6665807 6575825 6496249 6434204 6416277
17299 6416277 6389166 6383858 6451078 6568349 6693827 6860056 7114504 7441369 7818869 8338807
17289 8338807 9048410 9892578 10905726 12149491 13638113 15481343 17914418 21318520
17281 21318520 26404940 34277458 46447883 63630599 84823555 107764600 129152521
17274 129152521 145669884 154585867 154816241 147262131 132185024 112217559 90365953
17267 90365953 70439355 53893707 41949593 34313053 29314530 25789125 23098047 20917728
17259 20917728 19037655 17417216 15999169 14733740 13653197 12708550 11883410 11178405
17251 11178405 10564895 10018130 9523811 9097020 8677543 8276270 7898335 7566176 7267342
17242 7267342 6962816 6680816 6430889 6179414 5974809 5734807 5491270 5296386 5082829
17233 5082829 4914552 4722685 4501225 4291440 4133124 3994598 3848624 3734990 3628648
17224 3628648 3539065 3445994 3348546 3246513 3141017 3032934 2929644 2815512 2743078 2704639
17214 2704639 2669329 2633005 2608785 2547422 2511311 2516822 2526315 2547769 2605437 2767292 3054282
17203 3054282 3435048 3762909 3786273 3657792 3584825 3555214 3222491 2676295 2311413 2058793
17193 2058793 1859827 1737573 1661252 1622775 1566886 1519665 1489407 1459799 1435527 1415114 1422257
17182 1422257 1403234 1342897 1278158 1233333 1235968 1239103 1251214 1293110 1437164 1626239 1763844
17171 1763844 1799623 1797778 1792155 1760227 1643689 1504087 1419897 1423329 1542130 1670526 1782333
17160 1782333 1777214 1718309 1658931 1519781 1332383 1102616 891844 784966 721440 695496
17150 695496 640506 609892 582809 576530 557180 523429 510090 483047 435816 436353 464972 474158
17138 474158 486671 462456 432189 420593 423523 435093 429426 409767 404967 385759 357853 334591
17126 334591 317060 334777 355027 320431 278400 281643 309459 331272 358224 350797 329767 304859
17114 304859 294490 295002 308123 323663 294888 278969 252920 250525 239969 237556 241173 259630
17102 259630 286233 293066 269469 242359 231002 230009 229767 192838 176611 169241 200017 233073 210530
17089 210530 197728 203311 215692 196592 180045 169713 157967 90106 51132 42871 67708 88913
17077 88913 91365 94250 87098 104760 141184 178810 181987 162968 164118 181222 214399 242563 277256
17064 277256 298917 347955 435215 517687 565288 601167 620392 601315 530391 478476 446677
17053 446677 449335 483037 545151 584067 552941 515476 502596 455776 378263 305636 243981 219862
17041 219862 184805 167526 158858 148233 145618 166627 155320 125473 110454 107229 84769 82542
17029 82542 98179 113782 136880 146428 130168 100886 105156 117700 95580 97185 95290 76179
17017 76179 57993 39545 32817 21958 13035 10014 5688 12738 6630 -11258 4442 30470 57130
17004 57130 57010 56953 49313 49871 26109 -1607 6341 5650 -27280 -35915 -8150 26655 25065 -1859
16990 -1859 3286 24063 49173 67475 62637 77855 81578 64710 47160 64943 105186 107722 97494
16977 97494 98869 86962 49360 28362 14888 14368 23089 40618 55575 63477 74176 92036 128224
16964 128224 133679 141704 159483 201536 292098 371600 389083 411400 398918 386037 385969 333714
16952 333714 314408 270306 186952 117303 114691 92983 118337 156835 156177 163225 158529 159474 182011
16939 182011 163547 166133 197445 230788 263970 281573 267346 237030 209277 217764 231411 230001
16927 230001 227489 232623 232406 197013 149227 118347 112655 126062 134241 136145 120149 71654 64920
16914 64920 77468 111942 139331 137907 127357 117872 105298 123064 97790 68522 69155 70787 63130
16901 63130 44455 48741 69135 96556 138579 183942 239335 273840 332540 376925 387853 411781
16889 411781 409245 378887 310481 236342 169731 141715 122863 104957 86726 107804 125262 145561
16877 145561 145642 140510 132208 123464 133666 158842 154400 123701 95951 83492 83691 124961 161296
16864 161296 159812 155746 150174 130889 88823 85144 81953 99059 130907 201992 246174 277428
16852 277428 332544 428614 564847 690671 782016 882228 956081 984795 947548 870616 780143
16841 780143 622283 469210 357502 287854 279714 266203 248255 237396 234069 235765 242739 228917
16829 228917 216536 246021 257542 297829 336858 298414 283535 282494 268803 276448 276758 268151
16817 268151 259355 284194 306524 300598 260499 246833 248099 281317 316170 349554 370480 440316
16805 440316 482039 436364 392113 371799 359765 428399 482168 507407 500016 452737 419322 392785
16793 392785 366850 384272 412644 445920 492317 543689 600862 680570 815028 961880 1127258
16782 1127258 1256064 1398846 1470368 1456102 1438552 1332172 1145860 988152 852397 740449
16772 740449 680203 657799 654348 666977 660502 640248 593937 565405 579863 576973 569224 560724
16760 560724 565989 543635 522962 510325 506682 471991 464998 453762 433636 448555 417398 382904
16748 382904 397944 371830 361184 352669 371622 371301 388426 411841 434319 477483 516261 514228
16736 514228 499523 513554 539527 543929 580111 615752 629580 663196 693146 747292 809627 851129
16724 851129 899645 915097 935443 971657 1022258 1079274 1132242 1205029 1301315 1397285 1478001
16713 1478001 1565242 1685117 1804195 1982162 2202848 2485141 2835119 3220871 3634393 4048833
16703 4048833 4422805 4804346 5292107 5776092 6316706 6991999 7735109 8603038 9582661
16694 9582661 10717112 12130003 13932872 16315412 19627940 24431242 31717488 43244483
16686 43244483 61968518 90478672 125711961 156769853 174912917 182367292 188940932
16679 188940932 195913519 198397531 199270230 203153950 207535414 204952327 197097083 189486488
16671 189486488 175342459 148175927 113014024 82924521 63881875 52280193 44681126
16664 44681126 39349051 35391998 32314639 29742039 27578098 25711266 24039556 22498540
16656 22498540 21178107 20004692 18953295 17998794 17135951 16362750 15620041 14857564 14074189
16647 14074189 13348446 12711641 12143829 11676635 11223322 10746059 10269428 9864403 9497018
16638 9497018 9151455 8811768 8483435 8157492 7866987 7604672 7341280 7067806 6815291
16629 6815291 6595494 6404702 6192326 6010477 5843177 5676403 5534026 5401572 5253937
16620 5253937 5146967 5062667 4986504 4923647 4843134 4770578 4684576 4591252 4508030 4447198 4369281
16609 4369281 4271494 4218540 4211518 4186826 4160644 4094602 4048727 4000436 3993889 4033594 4085336 4150408
16597 4150408 4293652 4472836 4703178 4956645 5217695 5446608 5660348 5904688 6206631
16588 6206631 6548413 6960301 7470079 8054347 8736686 9591836 10674919 12042104 13886635
16579 13886635 16555245 20550798 26735316 36710373 52960651 76743046 103604545 124437607
16571 124437607 134813397 139200381 144466763 148322263 148458534 148317620 150885409 152255263
16563 152255263 148197268 142195824 135948774 122654827 100178479 74636344 55386758
16556 55386758 43685127 36405029 31484281 27966871 25334527 23274932 21529163 19997957
16548 19997957 18667644 17467684 16371630 15383867 14532525 13804794 13131226 12522921 11984975
16539 11984975 11418962 10826335 10270539 9798284 9368260 8948551 8597585 8209644 7844154
16530 7844154 7548357 7262366 6991445 6727828 6491980 6234433 5988211 5795167 5603341
16521 5603341 5395645 5209666 5041114 4877014 4713497 4571064 4420338 4298981 4160041
16512 4160041 4022376 3911124 3811086 3723557 3644045 3561499 3423358 3335663 3281977 3218459
16502 3218459 3147982 3081780 3017211 2941139 2853826 2754557 2665591 2600299 2512407 2397389 2321069
16491 2321069 2254504 2187378 2131412 2058722 1983503 1895832 1854513 1820440 1755719 1697372 1673001
16480 1673001 1581999 1523105 1508233 1481692 1406742 1330547 1319979 1320776 1276592 1245360 1188194 1117494
16468 1117494 1051714 1011560 947764 892760 882228 867784 834494 811350 782276 753197 733251
16457 733251 723038 699955 660591 640064 609235 587078 574910 566945 545215 556663 596809 594559
16445 594559 560813 548020 550846 529943 512589 474557 434912 435967 439105 416666 402689 384059
16433 384059 388787 363947 376875 386902 362356 352183 351318 334180 340820 334285 322462 318853 323249
16420 323249 281710 280441 293380 292350 285569 263134 242721 261207 274961 257622 245767 263153
16408 263153 269115 255952 246074 255431 278801 279487 284043 269586 253204 269559 256109 244076 196477
16395 196477 196255 187892 189807 221453 229133 230873 218483 180716 198141 230898 218264 198446 179627
16382 179627 173258 161828 148601 154569 131019 128291 77920 44767 42675 53377 90289 98214
16370 98214 96016 77994 74300 75226 105144 150075 154304 161341 159050 148431 169895 168179 151390
16357 151390 132012 148176 173339 202821 199482 163337 157061 131496 145668 149286 153524 165333
16345 165333 149254 151337 170407 158409 165872 171605 161093 120739 115383 165482 171738 140522
16333 140522 98425 80589 76737 88866 74324 65502 83070 103713 85645 78789 56784 67251
16321 67251 83498 70203 52744 33277 48659 42380 47912 21963 37956 50943 29801 6192
16309 6192 25257 703 -32362 -29286 -18464 -17725 3094 12112 -5076 -5414 -20452 -36493 -24045
16296 -24045 -11296 7073 12886 6020 5143 10868 5080 1101 5787 5590 -26438 -40510 -72369 -76643
16282 -76643 -58572 -77629 -55316 -19698 -17330 -35379 -30297 -18638 -14730 -61532 -85429 -75311
16270 -75311 -79090 -92035 -69605 -70034 -99973 -86170 -41649 -32399 -47580 -35265 -31863 -58580 -60390
16257 -60390 -26601 8842 9929 29031 35074 40167 27053 24129 14855 16029 13738 4740 5662 13593
16243 13593 16240 -5047 -13687 -10600 3191 7365 24024 47244 15343 -5395 -11318 3438 10911
16230 10911 14227 1649 -15463 -31534 -53250 -69244 -26403 27085 23341 -3051 -11787 -7653
16218 -7653 -1387 -339 -11389 -14940 8617 -10794 -10903 12931 20644 10162 9055 13069 18993 11472
16204 11472 19725 25090 45888 42315 33564 15548 59221 87836 84462 60758 41263 46489 40178
16191 40178 77690 92305 113085 120228 138510 197442 282252 411102 555889 729543 870287
16180 870287 945771 977957 1034586 1078301 1073796 1080073 1074498 1026756 961480 898307 836396 757818
16168 757818 600156 454331 364801 301532 252019 228974 194565 171069 175179 189834 183376
16157 183376 142623 138518 140611 132993 104595 96673 112647 118620 123471 94060 89601 82504 80810
16144 80810 99291 91974 50931 46284 51512 70212 49689 25643 47314 69004 77880 82530 59282
16131 59282 44016 42280 6218 -31201 -48688 -47666 -24410 -30084 -35571 -8864 19362 51679
16119 51679 67969 93785 42521 -308 -19149 -2803 30082 27050 39370 26375 38654 14316
16107 14316 19315 19974 31945 29342 28740 11479 3475 -7195 3491 47734 50364 29557 25229
16094 25229 15591 14006 5501 20265 61905 54387 33989 19149 -422 3245 34900 63106 53318
16081 53318 59054 47438 58718 93965 133323 167568 196419 241591 349576 468390 614826
16070 614826 722120 762411 818108 878137 880363 865061 859270 874961 851165 774207 734337 684828
16058 684828 583824 441646 337927 256661 197876 189908 145160 101608 109818 119661 119188 112690
16046 112690 85950 67298 108179 117441 119727 103474 79217 71204 51506 17927 30563 32017
16034 32017 17316 37669 52830 73201 69971 44091 61255 65509 57525 46395 28878 51584
16022 51584 60531 75526 91001 92052 72923 63878 103852 130901 111986 93897 87070 102930
16010 102930 119025 200018 291034 377032 495189 629266 735903 789318 806793 807701 790902
15999 790902 736495 682950 700106 761073 837978 921017 954312 934952 890414 790754 680095
15988 680095 533398 388976 301953 245333 199520 162311 122031 111554 108774 120601 108032
15977 108032 95524 123383 108946 75178 63753 46469 49648 99591 106406 98008 112739 128349
15965 128349 138250 134059 125020 108990 117316 107359 99561 145326 139170 116476 81480 68660 50748
15952 50748 77588 76418 76133 107906 111614 101427 130637 160049 179741 215927 317095 447632
15940 447632 556617 633341 679869 726587 739271 723672 680876 639201 613637 594292 630340
15929 630340 725638 800064 816001 824651 809397 742827 645179 493755 368559 296965 257824
15918 257824 204535 164671 167431 129612 106986 95843 79315 90481 69153 46514 39479 39804
15906 39804 63662 61400 47289 70416 85152 88912 84625 48697 49611 75865 82950 66559 55790
15893 55790 57989 43931 46709 60771 65271 68700 83903 92569 100858 91802 71271 57353 46699
15880 46699 19395 20079 28842 30349 37492 42980 32022 45642 41793 27643 24123 12045 3983
15867 3983 7127 21140 14430 10684 18788 25811 26777 22296 30726 26496 13594 -14354 -21369 -23795
15853 -23795 -18563 28208 41745 31183 25790 40754 53836 41008 17996 9648 -16581 -25573
15841 -25573 -39262 -25869 12239 22501 -13455 -28484 -20423 -10856 24918 34473 23679 10005
15829 10005 -15058 -27867 -41486 -33735 -28477 -14507 -4652 -20156 -37248 -16480 -19306 -12329 -4633
15816 -4633 -33256 -42808 -24687 -8455 -16375 -47932 -38331 12957 28279 10240 12569 29687 40666
15803 40666 25345 29268 28551 37651 31513 33659 24980 -6125 -46 28972 32657 21867 37982
15790 37982 52139 47833 47300 57333 51415 47066 65176 61622 49258 42216 58648 86220 72513
15777 72513 42128 10519 -7410 -14041 -18573 7376 37477 17721 -15754 -14711 9371 14939
15765 14939 36315 45037 28067 31568 33447 50965 62345 57128 61655 87373 96498 120051 121733
15752 121733 124094 138533 182415 172523 192072 200056 188401 154606 136020 131327 109741 115529
15740 115529 136885 113362 75248 33736 19845 21703 38532 95623 92271 72776 71502 81715
15728 81715 78375 92487 66518 8265 21761 51723 35357 28133 28387 39357 40877 50389 37112
15715 37112 44490 45559 39609 33649 26488 27857 12128 10438 7820 45032 42986 3608 -4383 15498
15701 15498 41995 38977 -12616 -32591 -18444 7483 51524 60005 58555 64636 69884 102986 109063
15688 109063 99311 129726 149568 161716 207838 230048 243793 255985 238919 233307 207182 161154
15676 161154 135720 139277 121895 127420 120550 98228 100563 99566 73598 55123 69063 72543 78600
15663 78600 96067 113921 105499 91887 82947 50670 10058 -18803 -43709 -47866 -17825 43608
15651 43608 76715 85861 69022 60477 71023 86268 89046 69238 64815 47367 20677 41887
15639 41887 61325 72164 69458 56828 55739 55424 50848 54681 48656 71456 122679 141710 154190
15626 154190 190739 211212 243505 273050 311009 348712 388660 374139 340692 303656 248062
15615 248062 247970 329917 378389 370196 346081 313866 276855 234205 211741 202705 179246 158245
15603 158245 173590 205133 202264 196873 193235 207343 226039 246451 245861 265295 270064 271013 269771
15590 269771 248418 249804 260296 294339 300033 324630 322848 302403 306366 300910 328065 338661
15578 338661 325449 318758 335947 374088 391186 384015 361198 337222 318397 305673 262599 257316
15566 257316 288037 291619 289894 298380 302208 318663 314205 339804 393168 416419 425588 461976 500940
15553 500940 575213 655639 707718 704704 698382 703568 720698 723480 770697 831975 860378 903154
15541 903154 955641 1013508 1151913 1337666 1533311 1689814 1813419 1919688 2026845 2073764
15531 2073764 2148094 2241388 2309773 2390958 2471873 2555003 2573042 2581894 2569596 2572194 2649418 2836237
15519 2836237 3046728 3283609 3571619 3926972 4328652 4760722 5242261 5821137 6488562
15510 6488562 7306221 8302002 9577247 11180258 13305353 16180670 20269723 26360258
15502 26360258 35905410 51412260 75034369 104629034 132814471 153568481 165815439
15495 165815439 173249954 178290897 180761293 182928166 183713825 183472602 182422919 178176083
15487 178176083 171006481 158393801 138424450 112748297 85578938 64629046 51395836
15480 51395836 42863254 36920434 32591293 29315446 26722630 24584099 22815806 21341759
15472 21341759 20107310 19086295 18204508 17448464 16787934 16147532 15596006 15080748 14602702
15463 14602702 14179688 13841229 13577085 13375173 13159786 12902356 12640029 12354214 12050046
15454 12050046 11706105 11418455 11193479 11006342 10902878 10829774 10822533 10849979 10862277 10902050
15444 10902050 11057563 11339477 11767159 12383166 13179606 14247437 15723371 17769409 20647937
15435 20647937 24784049 31080347 41147897 57438777 81165171 108663789 132882147
15428 132882147 149534879 158917235 164933145 168600797 170753181 173133759 174144033 174471737
15420 174471737 173005501 168192973 160437121 146527051 125837866 100280108 75293378
15413 75293378 57566955 46615490 39467727 34466347 30784151 27904035 25569130 23610381
15405 23610381 21978913 20562946 19326822 18201906 17179442 16271276 15492066 14807995
15397 14807995 14174701 13580825 13022590 12518092 12079454 11700010 11394548 11084190 10758251
15388 10758251 10419644 10054727 9705845 9382602 9075945 8777362 8498360 8191525 7863969
15379 7863969 7567782 7226159 6886329 6533286 6208938 5940694 5717367 5503713 5280714
15370 5280714 5100781 4958054 4824513 4681796 4568689 4438020 4283611 4174147 4087943 3986480
15360 3986480 3883422 3774164 3673592 3577563 3504213 3425763 3339862 3242555 3163324 3126486 3034019
15349 3034019 2935974 2825752 2750595 2679295 2563324 2482674 2423324 2347037 2288626 2236781 2197959
15338 2197959 2173963 2120714 2047389 1987973 1939997 1899777 1865973 1819106 1759848 1681873 1611821
15327 1611821 1547032 1448133 1364641 1320759 1311498 1288272 1233888 1185078 1151590 1119508 1097836
15316 1097836 1041663 990423 966358 929383 916233 921007 907288 857320 819901 800983 765419
15305 765419 760182 766651 774258 774457 739107 741846 723440 727828 703177 660948 632497 594441 581317
15292 581317 580313 610468 620628 609361 612662 612453 608354 569911 579695 576723 572649 589735 582446
15279 582446 573486 548278 538556 530102 502378 479026 489337 529981 556465 576193 576635 566573
15267 566573 552970 550083 548372 542981 538698 524976 499616 468791 455032 419140 416127 464992
15255 464992 452995 440825 443747 426022 412129 377040 348543 353712 360772 364493 372961 373624 388546
15242 388546 396751 375402 350767 327123 336472 351710 345991 323612 305018 288912 275517 283367
15230 283367 247171 214991 198822 193384 196311 198852 189153 209827 228042 262775 251997 263313
15218 263313 307779 351947 340091 289482 247251 258765 258568 260770 249555 230567 227083 221963
15206 221963 199500 196452 205160 184133 198707 218309 209596 213022 241132 227340 225642 207215
15194 207215 181403 187304 204151 187736 187064 203736 189351 190411 197879 163031 145285 134361
15182 134361 130597 145160 170696 151417 139953 153141 164686 184023 166781 145444 152377 182699
15170 182699 177213 155556 140857 95324 94380 126672 112619 93406 63917 54408 38222 58627
15158 58627 49615 32403 42024 50625 82751 124862 139588 134632 160539 161806 157951 137502 121163
15145 121163 123442 124041 127099 131964 120094 123647 140700 156366 155773 134405 146371 161477 145769
15132 145769 121674 104530 92741 86798 79476 82024 49155 28375 25861 29211 41267 49162 52569
15119 52569 28965 29649 23222 5109 34188 21424 42696 58527 60183 93022 148958 116378
15107 116378 93559 86706 85053 91899 83953 88014 88974 73500 49044 70561 67248 61706 50668
15094 50668 35884 52918 56893 61348 44362 12611 9173 39871 42731 66698 78276 84412 91331
15081 91331 101859 82000 82211 67455 53688 70098 81254 60285 81127 94451 118039 120544
15069 120544 109212 88132 97986 117756 118705 117022 129219 153479 131727 103201 62501 32446
15057 32446 34089 59267 33526 28900 32329 28355 39774 47822 57779 69955 57094 38080 5385
15044 5385 -30111 658 28931 25429 40904 58903 71719 78202 60736 17580 -11581 7609
15032 7609 15673 -7142 -5885 14994 30339 20686 13079 18215 28155 23595 31458 32218 34817 63593
15018 63593 42907 63888 87102 89256 72724 60922 45055 45413 36587 13594 10928 38059 63181
15005 63181 65952 61398 71761 70102 81116 98366 86220 94640 100554 90136 109486 100099 111226
14992 111226 134479 124299 104713 141636 209585 271661 375713 535981 715429 835709 895876
14981 895876 921489 960219 1016090 1032762 1048230 1025564 1001833 979639 928410 842315 685980
14970 685980 540277 420386 324581 254588 230853 218187 172552 157623 158692 158251 133337 123050
14958 123050 109442 110021 109696 123562 114590 110076 99965 61407 45558 64460 107007 117905 104385
14945 104385 80628 71488 88603 97476 79795 93844 102810 109205 100425 114597 140427 122456
14933 122456 102699 68215 63930 63628 44947 53385 67614 75065 89403 96943 91200 109370 153741
14920 153741 194397 213860 271386 367731 483063 610104 751039 868204 894899 923231 954363
14909 954363 973059 976269 967153 981981 945087 885624 815835 717418 622897 482026 372635
14898 372635 323540 292754 263036 196614 156159 121599 83190 77469 81439 78357 53267 40999
14886 40999 60700 66405 90647 111987 93705 80072 45431 44194 47589 62754 66422 77729
14874 77729 59560 49821 73839 47226 37398 32942 17459 13712 25591 16425 19302 28091 53990
14861 53990 84910 76603 78243 79251 44770 60430 46784 26452 35817 29274 32687 25985 27153
14848 27153 22065 21372 10675 9413 26833 38116 54701 31407 -13822 1758 25681 32684 45957
14835 45957 52864 67085 83056 57640 46428 55577 40812 50992 54877 27225 17837 16647 11987
14822 11987 3804 -1448 37182 47963 35102 34763 39656 62053 73347 67123 51164 53744 36183
14809 36183 36811 32432 28483 19197 12187 29376 35185 23546 23650 24153 37343 46424 39005 11362
14795 11362 6965 -3667 -15344 -29097 -12361 30530 50964 37223 31883 46214 33186 2056
14783 2056 -11024 -7426 2288 8289 17263 21103 -14509 -24517 -29775 -51348 -19307 9090 22807
14770 22807 23194 20138 35776 31728 6788 -15966 33363 44199 29254 24445 24440 21145 14848 17047
14756 17047 11697 -15441 -7279 -8075 2775 -947 -14389 13405 25747 17292 17278 37447 31035 -5770
14742 -5770 -7401 -10531 9139 28538 14050 21336 30479 34063 37523 13720 11403 28006 27661 45299
14728 45299 52364 40438 25858 14867 27160 14373 18482 2311 -10613 -4963 -2476 34109
14716 34109 45257 56776 63849 52560 29184 -6408 -2928 -3221 8307 16470 50898 60817 45866
14703 45866 11814 -27067 -44309 -35501 -34789 -25327 -15323 -17290 11131 15806 17732 26176 1164
14690 1164 8129 14401 15416 17376 26696 31245 21516 27514 21316 166 -11454 -30797 -33936 -268
14676 -268 10296 23557 43159 21010 3827 11714 15348 31855 28643 45299 31969 4834 -34044
14663 -34044 -38036 -22136 10291 -6721 -14269 -8443 -13132 25597 17847 -6621 -6735 -16415 -13982
14650 -13982 -42161 -43903 -40690 -54406 -51234 -33311 -25823 7044 26880 33474 32066 13302 135
14637 135 -5361 8067 2419 -4003 8346 -20172 -34596 -10878 -3185 -1779 27879 28923 48072
14624 48072 51447 46543 50980 35775 10046 -11799 10041 8319 25213 36921 22563 10373
14612 10373 -3286 -252 -2173 8713 10014 7123 16009 -1189 -6949 14902 9944 34139 7887
14599 7887 -17449 -5549 3656 -9143 -20220 -20579 -12351 -36678 -53590 -43707 -34363 -31745 -20901
14586 -20901 -37553 -45623 -32158 1329 6996 11897 18670 13665 4851 11150 35321 46920 41758
14573 41758 2444 -10428 29743 16896 -929 -941 -20145 -9653 15000 1840 -5494 -21013
14561 -21013 2575 1228 -22187 -37208 -2621 38811 41427 32961 20980 -4754 -26480 -45402
14549 -45402 -9197 5383 -7393 -12166 1440 16970 22450 29185 17181 -28516 -12739 -13475 9979
14536 9979 18674 21252 31573 30971 33984 26528 -6799 -34427 -33864 -21125 -7881 3797 -14752
14523 -14752 -16400 -27462 -58430 -96268 -46247 18589 15550 6566 -1805 -7390 3107 6375 9604
14510 9604 -1070 -18630 -18571 -3953 -2015 -4371 5925 23879 27393 12918 -25890 -58662 -43790
14497 -43790 -15754 7786 8081 1204 -17186 -11139 -18772 -35538 -26237 -4585 4253 13477 25411
14484 25411 38733 21178 1457 -8449 -8425 -433 -9324 -24512 -16489 -19975 -17041 -14192 18339 1145
14470 1145 -1379 -3490 8210 -5533 -28678 -57572 -64997 -45419 -60240 -83981 -98709 -74484
14458 -74484 -40292 -20649 -33392 -39394 -9597 -10009 -12628 -19352 -12258 -12735 -15526 3590 19627
14445 19627 598 -10376 -828 -11595 -18772 -30746 -26927 -31442 -29443 -16792 -18373 -20160 -26752
14432 -26752 -23571 -5237 -17244 -27822 -14004 -15279 2394 4265 5500 -26502 -56149 -28941
14420 -28941 9391 -10945 -71182 -61953 -24180 34247 35509 -8117 -26877 -12285 9017 17234
14408 17234 4221 -10217 4590 -2178 -12390 2007 8208 4145 -270 11165 135 5143 4547
14395 4547 19104 34925 17138 -10415 -5587 35416 15198 -10186 -15811 -24290 -19806 -36941 -25485
14382 -25485 -11915 -29418 -29147 -21327 -15126 -18421 -17116 -12011 3237 1820 4596 9731 -13907 -26806
14368 -26806 -19162 -37649 -71839 -61568 -38866 -42424 -38123 -11838 19462 2958 106 -4020 -3845
14355 -3845 31892 50814 14158 -9245 -10529 19049 5563 -10210 18435 40011 -17832 -53373
14343 -53373 -39663 -28294 -30220 -28665 -34106 -26571 -6160 -36453 -47431 -18744 23359 16354 -31548
14330 -31548 -33384 -11167 -24 -8366 5113 -5660 -4627 -6347 -32446 -14197 -10682 7169 9424
14317 9424 13875 -4576 -12538 8086 9980 14065 3831 -15721 -18368 -1081 27085 13251 -14435
14304 -14435 -31343 -32187 -22391 -25895 -6307 -1723 -3458 1582 -12919 -21240 17625 20213 -19922
14291 -19922 -25343 -26834 -4800 13529 5572 11769 13106 27750 36132 19229 -1041 -4368 -23976
14278 -23976 -24439 -12362 -18972 -47566 -38829 -32249 -35769 -25872 3835 17335 -10079 -35112 -33207
14265 -33207 -9946 -2116 -12797 -1475 25280 18723 -11699 -33881 -27863 -20940 -18002 -6999 -16547
14252 -16547 -45154 -69198 -49992 -40990 -53726 -60098 -63125 -30970 -23768 -8872 4368 11980 -7169
14239 -7169 -21407 -12438 -16465 -5740 5697 11256 32557 35412 23981 12844 14635 -243 -16554
14226 -16554 -34135 -62699 -76474 -64129 -851 -4592 -28832 -10531 13135 38506 29069 1617
14214 1617 -46251 -42878 -39885 -31463 -29662 -7301 7145 12521 21889 18562 -8144 -3572 -26127
14201 -26127 -16370 -28448 -39317 -16960 3951 4309 7793 -4336 -4896 -13429 -17339 4 24502
14188 24502 15240 -28076 -18226 -19110 199 -17329 -11495 -17601 -28456 -21222 -22815 -46116 -65909
14175 -65909 -52768 -16625 -23635 -36956 -41093 -22124 -11477 -35482 -71677 -50884 -25025 -6839
14163 -6839 37922 45491 29004 32033 6508 -7235 14492 -4000 382 26783 38114 28338 15594
14150 15594 9647 -20840 -31807 -34676 -25751 -30053 -21897 -6479 -3681 -10469 -15274 -23349 -55073
14137 -55073 -50496 -15718 9135 7050 1627 -992 -20998 -35155 -31081 -3980 -1380 -23444 -8699
14124 -8699 -582 -3557 -483 -23489 -13421 -24610 -42679 -49501 -50655 -59032 -50177 -34738 -64719
14111 -64719 -47678 -21598 -1498 -2495 -16689 -17471 -22336 -4561 -143 -6820 -22000 -15597 -42428
14098 -42428 -41851 -19603 2620 -23978 -16291 -13091 12827 26378 19091 33183 61795 43552 24463
14085 24463 254 -40610 -49949 -41315 -5740 -21362 -46932 -63838 -49436 -55354 -65206 -40391
14073 -40391 -41170 -28526 -11298 -14175 -16615 -23284 -20805 10691 41961 44421 52608 50966 64329
14060 64329 71784 61780 36836 37658 20439 -38822 -92572 -63984 -21114 -15553 -27161 -13824
14048 -13824 -22009 -5034 27120 48283 47418 44435 29846 4374 -17443 -11232 18927 32342 19532
14035 19532 8373 -26058 -39130 -45372 -12448 -29021 -55718 -68821 -55778 -76625 -59936 -29312
14023 -29312 -2104 -14344 -22331 -29596 -34246 -33241 -22870 -29806 -34877 -28926 -27329 -16510 2582
14010 2582 17722 17178 13022 25693 39650 37828 9367 -17805 -11579 6625 19037 9328 -5118
13997 -5118 3185 2157 -3353 -5591 -24760 -45782 -30904 -16459 -25868 -47735 -65607 -41528 -7507
13984 -7507 445 -25239 -44449 -43365 -39695 -28750 -62301 -69204 -46485 910 23153 10110 4948
13971 4948 -9180 -617 -22647 -24413 -16818 -5279 -1569 14728 -3220 1060 26049 23531 14407
13958 14407 25570 26122 22358 43112 61145 48520 28189 12534 -1889 -528 2410 3660 29761
13945 29761 27518 15253 15876 4439 -14486 -24886 -20524 -16007 7186 27004 10774 -35490 -54287
13932 -54287 -58239 -40099 -30625 -21552 6542 3468 -22670 -10231 -16577 -42880 -60954 -68302 -59812
13919 -59812 -73399 -61977 -33932 -10538 8899 -3030 -15353 -12885 -15649 -35948 -59775 -41962
13907 -41962 -23169 4060 6407 -14412 -19716 -20055 -26232 -53462 -56413 -38732 -37611 -41158 -50843
13894 -50843 -42015 -37859 -24308 -3669 8431 -5134 -20062 -29321 -7631 -10595 -20235 -39163 -60723
13881 -60723 -53178 -40036 -36177 -22791 6000 20088 2066 -1172 5753 -9666 -11258 28085 19728
13868 19728 -640 -23302 -31030 -59691 -48315 -33047 -19635 9850 -5695 318 -13349 -64001
13856 -64001 -49223 -33009 -30397 -28049 -6608 88 37903 48090 6655 -25413 -15769 -8750 7906
13843 7906 -2705 1648 5725 12949 -10855 7966 38958 20378 -26883 -49231 -39686 -20907 -16054
13830 -16054 -11235 1059 7021 -16249 -22733 -22117 -8615 1901 36833 61729 71902 33568 -15037
13817 -15037 -18455 -11177 -847 -27122 -41375 -30225 4476 20163 1446 66 447 -13855 -18606
13804 -18606 -25231 -20191 3034 -15355 -43904 -48247 -34059 586 -15078 -23154 -24387 -15866 -20083
13791 -20083 -13893 -3464 -14338 1048 16878 -6077 -11759 1192 -12913 -2950 8334 21073
13779 21073 309 -9423 3403 10224 -812 3549 3231 11459 17134 37901 40453 31150 16313
13766 16313 -12773 -55145 -65964 -40260 -545 13485 38376 30235 -1010 -7201 -21027 -39276
13754 -39276 -10843 814 -3120 -22743 -30914 -16116 -25558 -24257 -28339 -28920 -18088 -18930 -37792
13741 -37792 -44 18073 -10423 -3798 4222 12901 17260 43114 30980 -3746 3098 -7172 1408
13728 1408 26593 24450 -16476 -669 12628 9223 16472 18710 3376 32696 29962 36165 32971
13715 32971 27607 28191 2785 -20062 2811 -6953 -26018 -8996 10219 40866 51021 19865
13703 19865 17122 31609 8948 1869 -854 -2485 6690 26525 24002 19812 17418 8605 19268
13690 19268 20936 16752 26895 12292 15610 38957 39794 42023 36276 39882 52099 56937 41138
13677 41138 47165 67106 52087 36653 46105 26067 20267 2913 -12333 -24715 -14711 -6347
13665 -6347 -6908 -20207 -10280 -6670 -7832 -1449 -1168 -6526 381 -15739 -28018 -42369 -48282 -25853
13651 -25853 -5352 -4931 3665 6548 13364 -2316 4019 18450 49981 39179 41133 40951 52612
13638 52612 46601 38144 15795 -4524 -25250 2350 44418 45292 43319 18536 -5267 6219 17918
13625 17918 -491 15916 28228 48965 14624 -11112 -18042 -19039 2620 21563 4491 6631
13613 6631 14543 -8947 -19591 -34435 -71424 -74361 -12489 5243 1874 -17253 -4271 12223
13601 12223 4149 679 -11675 -27331 -28115 -8788 -13276 -13415 -18535 -22105 -16689 -13044 -30976 -15118
13587 -15118 -1376 4355 19887 13766 29043 18458 19917 11176 5568 8302 16892 3144 -3681
13574 -3681 13428 10852 20439 18763 6585 14367 12703 5837 -7279 -27529 -28880 15419 4035
13561 4035 5705 19293 -904 950 20914 31085 44658 41527 14482 -246 -7486 7450 19083
13548 19083 13676 4875 7669 10671 35217 30951 11599 -1908 6765 2747 -22473 -25841 6621
13535 6621 -2268 -13680 -17650 -17591 -5036 -19271 -20706 -19645 -11805 -7806 -32388 -19061 -6420 -19278
13521 -19278 -8177 15988 19871 14223 -13382 -29774 -37832 -58473 -45319 -28868 -24543 -12462
13509 -12462 -7329 -20058 -22245 -14340 -32509 -16692 23983 14095 17704 17505 15951 -21689 -35705
13496 -35705 -29240 -14221 5180 16180 40956 37296 12154 -18377 -24701 -4162 -11382 -11102 3538
13483 3538 49645 52880 32823 26990 33030 18152 -3755 -20481 -17883 10541 13195 17440 24163
13470 24163 25430 36761 18476 -8531 -48740 -73091 -61704 -15823 8934 15197 9065 12805
13458 12805 13490 19268 20653 32108 51653 58347 33171 19174 6787 12239 6253 4449 6543
13445 6543 10450 -5266 -15990 -31151 -27766 -39380 -26777 -32351 -37110 -29231 -24638 -25512 -27432 -26620
13431 -26620 -28850 -18580 -16392 -26672 -22933 5526 10988 -18788 -20904 -24125 -38415 -51380 -54468
13418 -54468 -49356 -20893 -11828 -16192 -3310 40907 20427 -19898 -7055 2335 17736 2272
13406 2272 10930 35720 9009 -5056 9556 14052 3225 7697 -887 292 19082 -6979 -3084
13393 -3084 -1400 -22988 -44926 -36909 -24119 -9821 -56535 -76592 -36884 -9257 826 -2444
13381 -2444 -33231 -31545 -21533 -18095 7455 31405 34576 -5002 -43786 -30002 -36587 -14387 8499
13368 8499 5760 -6140 16034 24642 -7508 -57528 -71642 -44341 -18111 -27200 -28323 -45402 -27255
13355 -27255 1894 19503 28373 23162 10519 -2553 -17412 -14678 -12112 -30524 -26985 -24395 -28289
13342 -28289 -16619 -20308 -17733 -32277 -40103 -46445 -61057 -56245 -23472 -18327 -43273 -56162 -68021
13329 -68021 -53216 -34175 -33939 -5798 -12022 -6191 -912 14858 34671 20926 -3604 15906 33412
13316 33412 -1896 -2011 7873 12726 9091 219 4563 -7745 2160 19649 236 -12177 -24279
13303 -24279 -29295 -20685 -21007 -22787 -265 -21625 -20324 -50659 -27189 -14770 -26951 -34526 -57450
13290 -57450 -48322 -24114 -1063 709 -553 37815 19093 -30735 -28490 -20645 -17872 -2681 -13519
13277 -13519 -10406 7370 16299 23147 20685 11012 2093 -4564 -2029 12935 16575 13321 -8670 -35115
13263 -35115 -28881 -44149 -43632 -23564 -3656 4132 12576 12732 652 -3070 21580 15888 33257
13250 33257 57198 29244 7666 -18059 -46520 -43038 -44094 -55858 -55347 -72524 -38141 -13059
13238 -13059 -18072 -15592 -26147 -19368 7788 3940 -12138 -37181 -36960 -27868 -46102 -46574 -37941 -28392
13224 -28392 -5020 24979 5332 -4676 -18261 -37416 -76184 -71643 -64350 -49786 -14109 2585
13212 2585 -14432 -22439 -21275 -22194 -29160 -43737 -18284 18114 30569 2255 -15171 -19701 -4331
13199 -4331 -30084 -34542 -52281 -38685 -38044 -25244 -2231 2945 16582 -5661 -30869 -10888 -15771
13186 -15771 -32136 -49394 -22062 -3584 1215 -3847 -11168 -9877 -5681 4563 -1079 -14166 7004
13173 7004 33488 19827 -18328 -33674 -26302 -42150 -42555 -37453 -21781 -16331 -29083 -16921 -5447
13160 -5447 -23242 -38502 -41003 -1422 -5090 -41113 -29346 -34891 -14995 8494 -6694 -198 11990
13147 11990 -10250 -29623 -56377 -42871 -8677 9151 3590 -705 16618 24672 39617 46510
13135 46510 47483 46047 12633 22621 21732 15249 11573 -9376 -40978 -40497 24 34522 34058 38661
13121 38661 6594 13916 3720 -20504 -25561 -14037 -18402 -26775 -20232 -4242 15828 28108 14269
13108 14269 -2209 3884 1605 -10874 -9340 1079 -2858 -1583 9311 24020 104 -504 -6143
13095 -6143 -7413 21219 57419 47960 30088 20863 -7870 -37485 -46036 -45935 -41996 -5892 16616
13082 16616 19665 23968 39164 20763 707 -27908 -10224 -4667 12649 27584 20860 3783
13070 3783 13988 14623 14861 8677 -19387 -39141 -35717 -36275 -6836 -9456 2213 17465 4603 4399
13056 4399 -22942 -21010 -7864 -28823 -51197 -67256 -69961 -51800 -16826 1301 21004 29768
13044 29768 23937 47499 49164 65004 69187 48154 35836 57912 66471 44464 5572 -8034
13032 -8034 -24171 -38505 -38810 -27111 -31451 -33501 -49004 -55008 -50239 -31115 -19337 -15031 75
13019 75 5190 14219 522 7836 29645 -15323 -50284 -61506 -33267 -30808 -33915 -48957 -67592
13006 -67592 -51274 -38137 -36338 -46565 -49713 -59039 -45189 -14558 -13796 -33786 -18408 18880 50899
12993 50899 34409 26741 10285 34738 49481 56185 29297 21959 16770 14218 9089 -4126 -19767
12980 -19767 -17556 3674 727 -29408 -55729 -64595 -47426 -11153 -12636 -24597 -17875 -13864 12058
12967 12058 -1095 -19966 -19081 -41411 -24284 -4624 -1119 -6184 21237 16310 14470 23653 37976
12954 37976 31639 20264 6463 -7429 -21368 6889 1609 5770 -513 14332 20708 28199 14695
12941 14695 -19221 -9481 4274 -1886 -31024 -32197 -59193 -73553 -72717 -41375 -28497 -9693 13662
12928 13662 9487 9624 6227 -2721 -13347 -2216 -2533 -11041 -22876 -31343 -31990 -17818 11416 -4426
12914 -4426 -20253 -43221 -48684 -34361 -29510 9793 25943 -14020 -28577 -19925 -10271 11194 -1695
12901 -1695 -6951 -26648 -37697 -55044 -60627 -62703 -47953 -12506 1172 24469 9922 18057 16150
12888 16150 -26929 -45835 -21364 6134 25208 6539 -9688 -10715 5759 -2077 -24688 3089
12876 3089 23498 3372 -7411 -5134 12174 30885 16687 -8032 -18525 -28299 -1151 -12141
12864 -12141 -3859 1325 -23439 -27617 -28402 -16786 29417 30107 -2068 -37819 -57514 -45600 -26079
12851 -26079 -23548 2084 22671 10002 -20031 -28719 -20690 -3499 -7814 -5018 4299 30349 13930
12838 13930 -8898 -3127 -36204 -37618 529 23268 29518 39439 7606 6072 14756 9933 31140
12825 31140 57900 49641 27650 -3488 -4392 -7533 4762 -20651 -48900 -20907 -5727 -9134 -29218
12812 -29218 -33077 -27237 -18974 -20962 -37383 -19990 7554 37527 52733 55536 22875 -17423 -9606
12799 -9606 -11092 -34787 -22323 -41383 -22243 11520 24799 21738 10645 6333 33175 38935 50362
12786 50362 55662 45982 42721 48458 39543 33319 10716 20526 36449 16755 3482 -16037 -36323
12773 -36323 -35690 -35077 -43070 -33424 -27575 -51223 -71580 -38388 797 -6667 -24383 -21834 -32159
12760 -32159 -48167 -18037 -1085 -923 -3801 22570 7259 -17754 -23203 -27830 -30627 -52100 -61363
12747 -61363 -49079 -11653 -9110 -3233 28264 27009 -24562 -32733 -23809 -36176 -39871 -30010 -20325
12734 -20325 -12238 -18366 -6605 -9932 -15775 -20404 -22784 -49008 -53338 -42889 -24944 5298 -9706
12721 -9706 -15784 -9413 17332 27522 -978 -29439 -28069 -25119 -27104 -27821 -25816 -15312 17769
12708 17769 -5901 -22420 -3852 24405 18531 -15327 -14193 25209 27140 3396 -7761 -4704
12696 -4704 5952 3863 -11522 6539 8902 3002 -15774 67 4962 7084 498 -13031 -22545
12683 -22545 -16903 -32037 -11177 -10604 -29451 -19845 12463 14413 5667 -6295 -3913 -5534 -15360
12670 -15360 2715 -972 -19863 -39157 -27603 6069 24875 12191 18502 14188 -8350 -22648
12658 -22648 7957 41631 26168 15249 25462 21590 4850 -16042 -37917 -34712 -16292 21023
12646 21023 23203 -2518 -6603 1428 -9068 -3208 22146 44990 35828 -16283 -34728 -41191 -38977
12633 -38977 -40265 -62430 -73176 -64587 -50354 -35705 -40143 -24982 6521 -2247 954 20036 19406
12620 19406 -5798 -26708 -7855 29923 32581 16367 24803 15896 -8857 -5765 -6015 -31580 -3378
12607 -3378 28357 32562 39462 16996 27429 18378 -1201 18969 52743 100005 87858 59914
12595 59914 38338 18818 -12373 -10543 -14975 -12043 3296 1394 3953 6465 -6251 -1630 -6169
12582 -6169 -5919 -18086 -16493 -1422 12323 21493 9908 3157 41931 60045 46936 36767 14673
12569 14673 19118 47663 80086 105761 95038 126336 114177 84106 99114 140500 138765 111539
12557 111539 93059 109681 112394 117534 126862 115523 109377 116228 116701 118479 93441 100042 131848
12544 131848 145302 147409 145266 166377 135153 130046 144333 171769 198021 216573 232804 230445
12532 230445 229741 208562 183345 181527 163438 182491 213211 233630 238466 204795 191235 169020
12520 169020 155887 139732 109610 97055 114242 134820 154496 167249 145887 157849 192436
12509 192436 213523 229199 267073 299365 317645 315523 286093 262120 236266 207910 140988 69510
12497 69510 62519 88290 90913 68518 70875 69268 56565 51830 67277 85977 102795 106848 80235
12484 80235 81178 79745 62883 46906 40537 44798 33995 -11540 -22249 -6138 -23399 -34458 -24066
12471 -24066 -352 -4629 -13360 -10114 28409 29825 4832 10804 8943 1558 906 -6702 29933 58599
12457 58599 76419 85896 106754 133532 149984 124383 119022 104018 68845 -4635 -44648 -31019
12445 -31019 2086 12173 12138 47827 38334 -14719 -38929 -52871 -18862 34680 57336 64959 59565
12432 59565 43480 15613 -4613 -19278 19980 62552 68326 48004 34500 23862 8498 14276
12420 14276 37225 23955 -18966 -26252 -14838 6012 -4907 -8450 8078 -6423 -16867 -16724
12408 -16724 -16279 -24809 637 9465 7989 9838 12799 2150 -13822 -34032 -35776 -20312 -10695
12395 -10695 5619 31719 5200 -21516 4779 11752 -8488 -27368 -35666 -44368 -48282 -36041
12383 -36041 -56502 -1728 36433 38800 32066 14191 -6425 -18749 -17621 2545 -27579 -30813
12371 -30813 -18745 -20823 -45075 -62055 -58180 -36406 3232 8246 3770 9050 24321 20430 30836
12358 30836 14968 3347 35122 61421 61140 62846 80236 123459 184610 229127 277825 326569
12346 326569 365342 387759 374197 314380 277979 196948 154397 120990 116524 125244 115508 105305
12334 105305 110311 127589 126916 132978 129163 148264 178502 175152 161831 188545 198558 165014 136642
12321 136642 145760 161936 202985 245584 282697 303480 335386 364864 349762 345740 322249 271336
12309 271336 225480 175447 125138 100531 81386 100091 108046 134288 135387 103846 91856 91377
12297 91377 75710 80337 102206 141089 162750 190347 188920 172284 191056 199121 174827 173092
12285 173092 176710 147935 145739 131696 121090 96838 70440 59428 38162 56146 85056 57963
12273 57963 21179 6775 8261 34414 16858 13397 44582 68224 71286 47558 45991 59062
12261 59062 62912 57125 72842 48494 23766 35009 44805 27559 8326 18882 14609 30178
12249 30178 32524 41676 47259 47520 27523 13081 13160 4496 -12927 -47495 -58933 -12788 -17448 -28993
12235 -28993 2124 26768 28007 42953 40387 27885 24902 54122 70329 80841 69035 64037
12223 64037 59898 60079 80108 95690 78361 54629 48167 30820 11577 48508 54871 35911 25677
12210 25677 27356 29488 42689 78224 98253 79870 71636 48721 42197 52535 63380 41654
12198 41654 46653 63733 44783 31411 37336 37632 47154 68435 44538 16750 23385 2695 8498
12185 8498 6311 9587 19466 40302 67607 58671 5747 -26245 -29229 -39406 -14845 -14090 -17830
12172 -17830 -43748 -49772 -54618 -9657 209 -11973 13524 17452 38476 37141 25897 7315 3568
12159 3568 3173 -22329 -35632 -27924 -9464 10585 16245 35318 41092 25141 -581 5031 -9583
12146 -9583 -25948 -14662 30834 54926 53396 48278 59050 41445 -1833 -37751 -71086 -34446
12134 -34446 -10391 -4643 -6167 16165 16283 -14667 -27952 -13553 -26893 -2557 27832 33054 53346
12121 53346 46610 50386 31070 -15856 1641 49873 40379 -16250 6520 21573 16958 13690 -17227
12108 -17227 -14201 -1417 -20033 -34125 -17466 -7017 -652 3472 -1388 1242 -6319 -14009 20205
12095 20205 17930 12692 12463 2449 17184 7807 10212 -949 -10983 -32512 -50291 -40805 402
12082 402 21217 29431 19441 25737 57199 81718 73368 48576 29609 37072 12835 16078 -1469
12069 -1469 -33877 -17528 13069 12000 -7005 13896 19177 -2201 23339 26586 4396 -9245
12057 -9245 -32630 -35213 -44631 -64457 -44845 -30696 3403 -7804 -214 4427 -11795 -3991 -2303
12044 -2303 -17685 -48280 -64423 -50288 -29897 -13617 -1365 18846 6810 -8274 -8040 -23494
12032 -23494 -29995 -6676 6882 3756 19021 5327 -10211 -21591 -21522 -18421 11511 60871 39355
12019 39355 -6673 -12806 -9996 -7891 41 16398 28648 1803 9628 22947 24215 21997 39605
12006 39605 55667 40721 17659 3530 -2246 5510 22182 23618 27560 46984 47734 29197 56399
11993 56399 63878 31852 11154 -10645 -23848 -32862 -49118 -45895 5211 33511 27985 -8449
11981 -8449 -23743 -11057 1222 10754 8552 5993 7414 18904 8233 5415 -16918 7700 38744
11968 38744 87693 72655 81308 89784 65230 56034 59447 73881 104443 101375 80148 81617 95874
11955 95874 92471 75755 63620 32061 31229 36075 46113 54659 23219 21381 24413 42581 40998
11942 40998 32350 17777 47932 77055 103398 96669 65092 64203 47655 33895 9111 -7988
11930 -7988 2236 4569 18413 17684 16312 20209 45431 57964 30709 22360 30839 41221 765
11917 765 -24563 -27706 -36934 -53330 -57240 -32007 -10158 14979 52546 64060 21878 21229 26532
11904 26532 26156 19611 9673 1572 1653 -1743 9366 20404 -16320 -30931 -10868 21497 29124 14441
11890 14441 1572 -6804 -24029 -37388 1108 23385 23747 31711 63377 66518 40996 28460 41923
11877 41923 43312 34710 34881 37208 40234 31376 20623 40553 12776 300 5183 19783 4816
11864 4816 -16256 -26020 -5806 15179 26777 12692 -3345 1127 10582 10074 -23571 -23915 5165
11851 5165 17370 11149 22554 35218 20482 -1846 5799 -50682 -74841 -66731 -16495 1229
11839 1229 -14039 -6601 10379 17341 27313 39440 57547 36617 11349 8608 -13686 -33595 -28680
11826 -28680 -15017 -9093 7853 12473 -13759 -16523 20475 22639 13845 12577 45264 54112 37747
11813 37747 15792 32065 55458 25182 6163 42886 70392 52626 27443 -4756 -12190 8587
11801 8587 15477 -5907 -17479 -31339 -29199 -8515 27517 33050 12261 -14624 -47302 -38222 -21050
11788 -21050 273 18633 34211 34416 9726 -6200 -11619 4781 21230 35815 39572 32031 38567
11775 38567 53472 36435 25480 7943 4401 19914 35118 38307 50578 38814 35852 58292
11763 58292 25591 8692 3758 19872 19009 28965 5789 23786 21141 25961 41305 72479 56996
11750 56996 2532 9011 21042 27074 32903 3737 15220 44426 25560 13293 15276 2172
11738 2172 11625 18292 13535 23031 46543 61018 48951 18626 21381 47726 49504 31140 16271
11725 16271 9575 -5141 -11205 8443 40272 57879 63432 34937 18687 38617 47164 16841
11713 16841 -4409 510 40329 58640 57004 64379 90463 77153 61063 63997 39214 14384
11701 14384 14957 12607 22025 46899 39331 17292 23346 42019 45707 65044 57927 39283 20390
11688 20390 16244 24780 22658 12438 23539 29489 42549 23283 5741 -7486 19262 37647
11676 37647 43215 53157 20477 15868 31135 41422 16754 -5782 11059 41480 59841 39746
11664 39746 31069 36900 29096 37287 38819 48190 27349 32840 54594 38264 19443 24636 31622
11651 31622 44295 53725 37926 46635 28245 24535 37211 34747 44034 35067 29528 61750 60984
11638 60984 77949 81296 70035 50871 53590 25211 -12099 28064 39473 33615 57815 51579
11626 51579 39612 52356 13408 -2869 -13986 15985 34695 50050 22613 17741 27461 35278
11614 35278 18911 31428 31482 27343 32269 39757 48808 28149 22253 24475 27486 33300 26323 19442
11600 19442 24322 45300 62181 30384 3132 -8706 -21321 1027 12381 5132 13262 26283
11588 26283 19847 29269 16292 8131 8139 37177 30541 19847 18467 13943 -3024 -11908 -26361 -3297
11574 -3297 -9819 6187 11859 30883 69541 49964 11561 13728 16072 24053 28212 6366 152
11561 152 14118 30603 27514 36441 50703 40856 57047 19709 -27085 -33288 -25832 -8648 23735
11548 23735 30079 -6011 -23100 -16187 1407 8052 7370 9590 35345 29024 33687 41103 54020
11535 54020 52807 62821 54778 22040 14440 26877 37258 21193 12966 40044 31941 29799 52516
11522 52516 53154 38422 34133 53673 37006 32152 42947 30398 41250 45419 51412 97656 106731
11509 106731 62989 51316 77381 51401 31818 46242 66892 52407 54495 74907 57463 29084
11497 29084 59614 79193 80861 67452 40679 43798 36381 26801 23844 38470 55348 65569 72033
11484 72033 72029 48435 31181 48891 59507 66007 54672 40010 35900 50975 67802 62341 52302
11471 52302 46301 39147 43372 35462 42689 38458 66917 100820 121132 120333 117896 117464 107863 91293
11457 91293 102330 135238 153883 142505 93067 84344 80510 69851 54561 46785 32235 -9776
11445 -9776 -22414 22102 29096 12471 -5410 -32639 -12841 -19137 9729 39716 72724 79536
11433 79536 66852 43346 27980 24846 27778 25654 35985 73311 70786 72956 80189 94150 72227
11420 72227 55754 41406 55303 60467 40469 33149 50237 11659 -1001 37574 61588 66126
11408 66126 78613 70349 42044 38399 40917 13543 26735 34876 10674 -25131 -22790 -3525 6484
11395 6484 -4809 9357 32137 20948 41875 67594 52707 23777 23072 34577 47616 34079
11383 34079 9772 -10045 -1477 35012 33403 32034 30092 26921 35567 35420 33824 30771 49602 27861
11369 27861 30462 23590 33769 61828 88714 97735 54492 25407 22813 26116 25228 30098 27295
11356 27295 14880 18679 26466 49764 88608 101479 90411 87569 88649 78911 46525 53163 66999
11343 66999 70459 65424 58970 47806 4732 -3009 24731 55532 69397 67626 68906 82122 83556
11330 83556 104591 107214 103696 90841 113217 157059 157736 132205 95341 77216 66395 81016
11318 81016 77153 102868 127825 149119 160559 173628 181295 168058 175119 176994 137091 94201
11306 94201 71779 58047 29005 17423 33412 60115 78404 79843 68141 44371 66184 77101
11294 77101 72666 92412 121240 137250 152893 149338 136128 175108 196028 162306 137926 133728
11282 133728 161325 181041 179416 173805 154978 122051 103202 88845 69052 60096 54519 64298
11270 64298 52630 32607 73105 95956 93432 107377 102143 88284 88453 81392 83654 91958 126591
11257 126591 78218 55263 67478 39867 49517 65055 69219 73226 83252 79803 74136 99607
11245 99607 80466 62445 48852 36948 50194 83033 105475 120518 147499 158181 154428 154570
11233 154570 162610 162115 146207 128968 117410 141225 138785 125880 124395 104591 104095 102807 114900
11220 114900 115954 95487 81562 71323 88410 87086 82636 84845 93934 111694 81129 89259 126389
11207 126389 149803 137507 119602 144731 152939 147851 134678 100228 67400 54470 68336 121323
11195 121323 97487 99758 105321 100346 101920 101079 114578 111673 90586 71523 48807 11673 3091
11182 3091 29987 39728 63290 104959 101459 88099 81125 87727 67734 60215 62180 65295 72080
11169 72080 99302 97170 68446 30391 27245 19415 28848 40340 57918 62540 36497 46740 65195
11156 65195 78274 62035 61390 73256 59029 45753 21373 31455 72749 93724 110456 133524
11144 133524 123449 92102 92155 113934 115710 93720 82655 91891 68513 57961 73195 66709 19276
11131 19276 24859 31747 37275 23849 42444 63708 63162 80994 98641 85077 72325 87078 87960
11118 87960 74982 122510 129980 124072 99404 91154 113143 142813 148084 127595 130447 127951 108106
11105 108106 110735 123476 123700 125720 144682 187959 213705 234750 252764 262001 268463 280358 257925
11092 257925 213056 171219 166723 148560 157882 148412 119046 110400 88483 94540 104976 75918
11080 75918 86519 100204 120320 94535 91406 87180 83083 103064 112632 121605 137605 149625 135279
11067 135279 110417 111884 109844 105517 115094 115112 131747 120624 108154 110719 108160 111381 117910 119546
11053 119546 141790 183648 239460 247422 263299 281637 272780 290987 292043 264279 232638 211131
11041 211131 192503 166937 151589 145657 141493 144770 148527 148727 148522 126199 130049 146578 157446
11028 157446 149669 123870 101787 102366 109188 115766 110484 158519 137794 107243 148399 134964 101761
11015 101761 112682 128184 109407 81561 86254 104924 112883 85350 98651 115906 118319 113188
11003 113188 109718 113824 129534 148659 146979 138994 137481 156243 159524 147300 145130 145145 117647
10990 117647 89465 51146 39616 70695 84185 100738 112050 71001 45969 34053 41741 72154
10978 72154 94845 103509 94176 80689 58158 70112 87227 89683 89112 69431 91332 60681 48382
10965 48382 53694 75054 94895 117938 134180 101937 81312 63646 69194 42201 36029 48277
10953 48277 50672 34491 55123 74651 45113 15233 6802 47132 78495 71173 97892 61942
10941 61942 9853 13702 27565 52479 50484 52973 56016 76333 97778 101840 95575 93924 112861
10928 112861 92895 89199 82552 57040 65396 58481 62096 69696 54790 55822 63907 77217 88905
10915 88905 110459 117627 138890 142020 142243 130566 149524 147322 166604 185170 184159 175758 156075
10902 156075 134132 136072 123097 140244 107780 75027 71719 67257 83521 74856 67672 82032
10890 82032 90497 106224 100712 100855 99767 102628 70908 56933 55981 73542 86095 74923 84059
10877 84059 114999 126306 139126 135061 173474 198023 167734 147476 159781 170407 154110 127733
10865 127733 151474 162166 145545 152296 156259 174767 171129 184394 187423 205378 196110 178730
10853 178730 164957 153307 138794 127114 125847 140384 144311 121859 89171 91766 87817 72964
10841 72964 58365 67341 84205 49446 31228 49841 76290 103770 106503 84648 66551 35481
10829 35481 36463 61640 81751 97442 85096 79617 108065 97706 83141 106358 80413 74402
10817 74402 115527 126359 134999 170271 191475 153057 129636 131903 145688 154559 135495 129923
10805 129923 127422 111199 80972 83338 80275 114976 127585 84376 99774 136079 116651 106489
10793 106489 105091 92554 81801 55811 43647 44115 48164 35295 80505 107744 101480 94405 101107
10780 101107 106102 118195 119025 96643 97027 101546 104956 95510 90852 77092 68239 53178 39052
10767 39052 47643 79827 91957 103563 105575 79911 68657 59965 56388 67865 46690 36237
10755 36237 31991 64624 54819 42859 35248 35462 37380 35022 50753 61149 69748 75557 77054 63037
10741 63037 43486 72761 93130 68853 55924 66875 89857 85192 75298 68826 64055 51983
10729 51983 25020 12037 20307 15689 3209 17925 53790 60842 77587 109964 115357 94674
10717 94674 75050 81846 58821 51540 74737 90737 91965 81997 84301 66757 41916 26331 47869
10704 47869 63825 69255 55722 51170 20266 41675 49475 19099 18646 15396 22075 35697 50444
10691 50444 58002 71493 79824 81885 84521 89546 73124 48432 47203 49895 51535 44997 20269
10678 20269 761 13675 27963 22398 13084 21629 10996 -9081 4290 24804 25020 24108 19646
10665 19646 9774 22548 42035 66584 103716 121481 133780 103145 81614 48135 38683 57613
10653 57613 63369 51110 47434 56620 59274 68527 84734 108736 137999 152376 131164 104391 104694
10640 104694 118903 124158 148545 163207 194185 232783 286849 354376 441869 532100 649380
10629 649380 767517 914891 1066512 1201156 1302064 1302806 1233257 1162974 1076373 911770 742023
10618 742023 550000 428644 367699 343997 308600 271048 244448 232098 238154 218815 205528
10607 205528 170529 156255 189058 210330 217504 216633 213009 192229 158914 169504 180634 148750
10595 148750 112499 93011 94664 105810 95196 121274 89831 68553 75622 89516 78388 81907
10583 81907 91984 101737 89785 91098 98351 91780 89773 70352 47720 15555 12197 33242 45281
10570 45281 55824 80134 109218 128491 108218 66657 67062 76799 45217 38783 53164 88143
10558 88143 134836 161818 139416 131468 118031 125829 133756 119940 111232 119503 98246 92222 84188
10545 84188 107196 137020 141444 142600 105841 114181 112806 76429 77369 81700 86595 60066 55646
10532 55646 63001 61686 37331 32602 52729 71284 61180 37566 53960 59537 50259 60779 79211
10519 79211 111844 137168 158664 140520 99982 87690 45760 22955 6194 -5024 8351 32402
10507 32402 42703 76597 92470 81873 94021 63353 41888 58028 70784 107937 125181 93253
10495 93253 72103 62900 45508 56586 78351 100786 94705 66854 74068 93274 99887 91983 79493
10482 79493 82933 88360 76745 78462 83305 111653 130065 128077 102159 106250 128832 111710 84886
10469 84886 70798 59162 67342 54235 62556 63703 60483 66351 75324 79751 74461 80331 73105 51866
10455 51866 46455 54132 49331 34268 65953 75433 58258 48569 33749 66699 122765 138614 121406
10442 121406 101441 85809 63093 82524 88885 74720 82964 65778 63559 60313 61214 69427 64108
10429 64108 84185 76638 63246 79662 62115 62968 98192 112031 129588 106774 96365 96447 44588
10416 44588 33111 46291 54787 62394 82224 88876 86911 81453 70985 86561 80065 77936 80618
10403 80618 76624 107741 110275 70256 60074 71901 77294 84353 90288 91821 81827 67744 59596
10390 59596 67720 67103 59497 70750 91543 94504 124967 136201 117961 85690 57346 78238 76559
10377 76559 82328 102491 69388 71657 100973 89636 92305 83837 68208 71222 68802 46302 51523
10364 51523 73395 66380 47290 30579 37678 53147 67681 71117 68420 76474 79496 65541 86898
10351 86898 75234 67324 41794 62475 85323 83742 76860 102323 105960 90788 62875 34165
10339 34165 52872 61355 69245 70476 77897 84119 64562 83836 108712 110491 120690 113412 102858
10326 102858 87226 69709 53211 45221 61377 49895 40351 30676 47478 60016 59166 46017
10314 46017 61130 60353 48738 59647 99714 85637 80224 63106 37239 72294 62337 71543 84460
10301 84460 72952 91479 89903 89602 95221 70301 77650 92700 76529 65029 45444 60536 90182
10288 90182 119484 127739 151668 149933 119207 84362 112508 144101 117210 102930 119163 108303
10276 108303 68312 93549 138011 150827 158517 134468 114276 93936 101863 145576 153784 150449
10264 150449 149676 134096 129830 132992 119313 119370 145121 152173 152539 162713 162134 183853 199146 181183
10250 181183 153729 134513 140493 130884 117718 118593 109999 128759 144890 112323 107251 145209 148469
10237 148469 133539 140002 143792 142006 117717 138134 141379 132583 130296 172355 219411 229511 229241
10224 229241 226661 195151 190312 192448 225706 257598 280645 303099 289176 266856 291179 305163
$$ [...]
##END NTUPLES=NMR SPECTRUM
##END=
