##TITLE=Analysis number 319003
Compound Code cc 07106
Book Reference 467/28
Project Code adrs
Chemist Name benw
##JCAMPDX= 6.0         $$ Bruker NMR JCAMP-DX V2.0
##DATA TYPE= NMR SPECTRUM
##DATA CLASS= NTUPLES
##ORIGIN= Bruker BioSpin GmbH
##OWNER= nmr
$$ XWIN-NMR		Version 3.5
$$ Wed Apr 26 16:47:02 2006 GMT Daylight Time (UT+1h)  MAYBRIDGE\nmr@NMR_250MHZ
##.OBSERVE FREQUENCY= 250.131544655141
##.OBSERVE NUCLEUS= ^1H
##.ACQUISITION MODE= SIMULTANEOUS (DQD)
##.ACQUISITION SCHEME= undefined
##.AVERAGES= 16
##.DIGITISER RES= 18
##SPECTROMETER/DATA SYSTEM= dpx250
##.PULSE SEQUENCE= zg30
##.SOLVENT NAME= CDCl3
##.SHIFT REFERENCE= (INTERNAL, CDCl3, 0, 16.522)
##AUDIT TRAIL= $$ (NUMBER, WHEN, WHO, WHERE, WHAT)
$$ ##TITLE= Audit trail, XWIN-NMR		Version 3.5
$$ ##JCAMPDX= 5.01
$$ ##ORIGIN= Bruker BioSpin GmbH
$$ ##OWNER= nmr
$$ C:\u/data/dgb/nmr/ADRS/3260/pdata/1/auditp.txt
$$ ##AUDIT TRAIL=  $$ (NUMBER, WHEN, WHO, WHERE, WHAT)
(   1,<2006-04-26 16:46:15.21 +100>,<MAYBRIDGE\nmr>,<NMR_250MHZ>,
      <created by zg, POWCHK disabled, PULCHK disabled
       configuration hash MD5:
       84 BC 41 DB A1 6E 1D 46 DA 25 12 A5 C1 ED C5 3A
       data hash MD5: 64K
       5D 2E 6B BD 71 A9 AC B8 03 B5 9D 98 66 16 AF 28>)
(   2,<2006-04-26 16:46:38.91 +100>,<MAYBRIDGE\nmr>,<NMR_250MHZ>,
      <Start of raw data processing
       ef LB = 0.3 FT_mod = 6 PKNL = 1 SI = 32K 
       data hash MD5: 32K
       01 DD 19 78 8D B9 C4 A3 AA B9 F7 92 D6 71 A2 9E>)
(   3,<2006-04-26 16:46:41.62 +100>,<MAYBRIDGE\nmr>,<NMR_250MHZ>,
      <apk 
       data hash MD5: 32K
       83 55 55 EB DD E7 41 29 18 5A 28 44 5A 04 72 86>)
(   4,<2006-04-26 16:46:43.05 +100>,<MAYBRIDGE\nmr>,<NMR_250MHZ>,
      <abs ABSG = 5 
       data hash MD5: 32K
       FD 28 D1 2C B4 11 C7 F7 3C 13 B6 F8 05 B1 52 B1>)
$$ ##END=
$$ 
$$ hash MD5
$$ CF D6 0D AA 3B 35 E8 78 85 84 65 63 D1 EF 3E 9A
##$RELAX= 
##$RELAX= 
##$RELAX= 
##$RELAX= 
##$RELAX= 
##$RELAX= 
##$RELAX= 
$$ Bruker specific parameters
$$ --------------------------
##$DU= <C:\u>
##$EXPNO= 3260
##$NAME= <ADRS>
##$PROCNO= 1
##$TYPE= <nmr>
##$USER= <dgb>
##$AMP= (0..31)
100 100 100 100 100 100 100 100 100 100 100 100 100 100 100 100 100 100 
100 100 100 100 100 100 100 100 100 100 100 100 100 100 
##$AQSEQ= 0
##$AQ_mod= 3
##$AUNM= <au_zg>
##$AUTOPOS= <57 >
##$BF1= 250.13
##$BF2= 250.13
##$BF3= 250.13
##$BF4= 250.13
##$BF5= 500.13
##$BF6= 500.13
##$BF7= 500.13
##$BF8= 500.13
##$BYTORDA= 1
##$CFDGTYP= 0
##$CFRGTYP= 5
##$CHEMSTR= <none>
##$CNST= (0..31)
1 1 145 1 1 1 1 1 1 1 1 1 1 1 1 1 1 1 1 1 1 1 1 1 1 1 1 1 1 1 1 1 
##$CPDPRG= <>
##$CPDPRG1= <>
##$CPDPRG2= <>
##$CPDPRG3= <>
##$CPDPRG4= <mlev>
##$CPDPRG5= <mlev>
##$CPDPRG6= <mlev>
##$CPDPRG7= <mlev>
##$CPDPRG8= <mlev>
##$CPDPRGB= <>
##$CPDPRGT= <>
##$D= (0..31)
0 1 0 0 0 0 0 0 0 0.06 0 0 0 0 0 0 0.0002 0 0 0 0 0 0 0 0 0 0 0 0 0 0 
0 
##$DATE= 1146066373
##$DBL= (0..7)
120 120 120 120 120 120 120 120 
##$DBP= (0..7)
150 150 150 150 150 150 150 150 
##$DBP07= 0
##$DBPNAM0= <>
##$DBPNAM1= <>
$$ [...]
##$SUBNAM7= <"">
##$SUBNAM8= <"">
##$SUBNAM9= <"">
##$SW= 20.6930455092707
##$SWIBOX= (0..15)
0 0 3 0 0 0 0 0 0 0 0 0 0 0 0 0 
##$SW_h= 5175.983436853
##$TD= 65536
##$TD0= 1
##$TE= 295.16
##$TE2= 300
##$TE3= 300
##$TEG= 300
##$TL= (0..7)
0 120 120 120 120 120 120 120 
##$TP= (0..7)
150 150 150 150 150 150 150 150 
##$TP07= 0
##$TPNAME0= <>
##$TPNAME1= <>
##$TPNAME2= <>
##$TPNAME3= <>
##$TPNAME4= <>
##$TPNAME5= <>
##$TPNAME6= <>
##$TPNAME7= <>
##$TPOAL= (0..7)
0.5 0.5 0.5 0.5 0.5 0.5 0.5 0.5 
##$TPOFFS= (0..7)
0 0 0 0 0 0 0 0 
##$TUNHIN= 0
##$TUNHOUT= 0
##$TUNXOUT= 0
##$USERA1= <user>
##$USERA2= <user>
##$USERA3= <user>
##$USERA4= <user>
##$USERA5= <user>
##$V9= 5
##$VALIST= <valist>
##$VCLIST= <CCCCCCCCCCCCCCC>
##$VD= 0
##$VDLIST= <DDDDDDDDDDDDDDD>
##$VPLIST= <PPPPPPPPPPPPPPP>
##$VTLIST= <TTTTTTTTTTTTTTT>
##$WBST= 1024
##$WBSW= 4
##$XGAIN= (0..3)
0 0 0 0 
##$XL= 0
##$YL= 0
##$YMAX_a= 581062
##$YMIN_a= -883074
##$ZGOPTNS= <>
##$ZL1= 120
##$ZL2= 120
##$ZL3= 120
##$ZL4= 120
##$ABSF1= 16.522
##$ABSF2= -4.171173
##$ABSG= 5
##$ABSL= 3
##$ALPHA= 0
##$AQORDER= 0
##$ASSFAC= 0
##$ASSFACI= 0
##$ASSFACX= 0
##$ASSWID= 0
##$AUNMP= <proc_1d>
##$AZFE= 0.1
##$AZFW= 0.1
##$BCFW= 0
##$BC_mod= 0
##$BYTORDP= 0
##$COROFFS= 0
##$CY= 12.5
##$DATMOD= 1
##$DC= 0
##$DFILT= <>
##$DTYPP= 0
##$F1P= 14.0000005364418
##$F2P= -0.99999901652339
##$FCOR= 0.5
##$FTSIZE= 32768
##$FT_mod= 6
##$GAMMA= 0
##$GB= 0
##$INTBC= 1
##$INTSCL= 1
##$ISEN= 128
##$LB= 0.3
##$LEV0= 0
##$LPBIN= 0
##$MAXI= 10000
##$MC2= 0
##$MEAN= 0
##$ME_mod= 0
##$MI= 0
##$NCOEF= 0
##$NC_proc= -4
##$NLEV= 6
##$NOISF1= 0
##$NOISF2= 0
##$NSP= 0
##$NTH_PI= 0
##$NZP= 0
##$OFFSET= 16.522
##$PC= 1
##$PHC0= 163.4293
##$PHC1= 9.669263
##$PH_mod= 1
##$PKNL= yes
##$PPARMOD= 0
##$PSCAL= 4
##$PSIGN= 0
##$REVERSE= no
##$SF= 250.13
##$SI= 32768
##$SIGF1= 0
##$SIGF2= 0
##$SINO= 400
##$SIOLD= 32768
##$SREGLST= <1H.CDCl3>
##$SSB= 0
##$STSI= 32768
##$STSR= 0
##$SW_p= 5175.98343685301
##$SYMM= 0
##$S_DEV= 0
##$TDeff= 65536
##$TDoff= 0
##$TI= <Analysis number 999999
Compound Code 99
Book Reference 9
Project Code 9>
##$TILT= no
##$TM1= 0
##$TM2= 0
##$TOPLEV= 0
##$USERP1= <user>
##$USERP2= <user>
##$USERP3= <user>
##$USERP4= <user>
##$USERP5= <user>
##$WDW= 1
##$XDIM= 32768
##$YMAX_p= 456896266
##$YMIN_p= -132591
$$ End of Bruker specific parameters
$$ ---------------------------------
##NTUPLES= NMR SPECTRUM
##VAR_NAME=  FREQUENCY,     SPECTRUM/REAL,   SPECTRUM/IMAG
##SYMBOL=    X,             R,               I
##VAR_TYPE=  INDEPENDENT,   DEPENDENT,       DEPENDENT
##VAR_FORM=  AFFN,          ASDF,            ASDF
##VAR_DIM=   32768,         32768,           32768
##UNITS=     HZ,            ARBITRARY UNITS, ARBITRARY UNITS
##FACTOR=    0.157963299565203, 1,           1
##FIRST=     4132.6476996994, 0,             0
##LAST=      -1043.33573715361, 0,           0
##MIN=       -1043.33573715361, -132591,     0
##MAX=       4132.6476996994, 456896266,     0
$$ Real data points
##PAGE= N=1
##DATA TABLE= (X++(R..R)), XYDATA
$$ [...]
24690A7415k1368N304M486J838K474m940R074J5195k428j8693k0446q174r57R758
$$ 17415 -3953 1351 5837 7675 10149 5209 14283 29478 27050 8357 -12089 -20263 -21220 -11462
24676a1462l2J7404K399j0662O410j3371O229M791j7595j8731J3544J6820K516
$$ -11462 -11494 5910 8309 -2353 4057 -9314 -3085 1706 -15889 -34620 -21076 -4256 -1740
24663a740j1141J1792j484P921r610J4677L503n111r904j146j3117J1071m111
$$ -1740 -12881 -1089 -2573 5348 -4262 10415 13918 8807 -1097 -2243 -15360 -4289 -8400
24650h400k3728j4997O195J5731L3016j3667r7Q544J7585j8953k2844o363R70
$$ -8400 -32128 -47125 -40930 -25199 7817 -5850 -5947 2597 20182 1229 -21615 -27978 -27008
24637b7008K1591k696q814k798j5459J3473L8690j1784M035j7020l3208k7216
$$ -27008 -5417 -8113 -16927 -19725 -35184 -21711 16979 5195 9230 -7790 -40998 -68214
24625f8214K4209M0618J527j2325k715q631J6525P229K1620j3061l5662N214n28
$$ -68214 -44005 -3387 -1860 -14185 -16900 -25531 -9006 -1777 19843 6782 -28880 -23666 -24194
24612b4194j624K3961Q892r651K524k498j9011l161J5430o828j0795N978R828
$$ -24194 -25818 -1857 7035 -2616 -92 -2590 -21601 -24762 -9332 -16160 -26955 -20977 -11149
24599a1149J9534N856j7853N063M330k5930l2205K1633L0786j838K984Q230j1839
$$ -11149 8385 14241 -3612 1451 5781 -20149 -52354 -30721 65 -1773 1211 9441 -2398
24586b398l267L391J4915k3062j7797P178k5671j9743J2153J9228J7098J7698
$$ -2398 -5665 -2274 12641 -10421 -28218 -21040 -46711 -66454 -54301 -35073 -17975 -277
24574b77m835j0298j1831k141Q021O905K588R342j6873k9742Q355p684J5260J741
$$ -277 -5112 -15410 -27241 -29382 -21361 -14456 -11868 -2526 -19399 -49141 -40786 -48470 -33210 -31469
24560c1469J382j7700j6429j339L5433L3355k8580k9377L5303M6150k9799k4144
$$ -31469 -30087 -47787 -64216 -65555 -30122 3233 -25347 -54724 -19421 26729 -3070 -27214
24548b7214j4967L555k428k5029n201K1907m416N880J348J4094M264q743Q736
$$ -27214 -42181 -38626 -41054 -66083 -71284 -49377 -53793 -47913 -46565 -32471 -28207 -36950 -28214
24535b8214K4699K2195K3109j6709l7689q364k96N47k0131N779P651L0023o04
$$ -28214 -3515 18680 41789 25080 -12609 -20973 -21269 -20722 -40853 -35074 -27423 2600 1996
24522A996l3654k1856J339J9103Q86J1357K277J0709j6982j175Q624J6616k466
$$ 1996 -31658 -53514 -52175 -33072 -32186 -20829 -18552 -7843 -24825 -26000 -17376 -760 -3226
24509c226j7722j836J0641J279J5961j0191O433K435R660R890j0271k195K6557
$$ -3226 -20948 -22784 -12143 -10864 5097 -5094 1339 3774 13434 23324 13053 10858 37415
24496C7415l0982l0177L504M405j7768J6930J7979O473l5158o4K2959O774J5434
$$ 37415 6433 -23744 -20240 -15835 -33603 -16673 1306 7779 -27379 -27443 -4484 2290 17724
24483A7724J2468n867Q520j0596j9470k4729P121k365K4520L0542k323k379K8621
$$ 17724 30192 24325 32845 22249 2779 -21950 -14829 -17194 7326 37868 35545 33166 61787
24470F1787j2133l0227m530l0274j0524j3070K6055N759O674J3124j3441j4958
$$ 61787 49654 19427 14897 -15377 -25901 -38971 -12916 -7157 -483 12641 -800 -15758
24458a5758j4231J7523K6175J5657J2457l1520m8873j8567M2566k621l2675L201
$$ -15758 -29989 -12466 13709 29366 41823 10303 -38570 -57137 -14571 -17192 -49867 -46666
24446d6666J4153L2151N0024m684k3126m787m598m64j4702j0267J435J2875K2331
$$ -46666 -32513 -362 49662 44978 21852 17065 12467 12003 -2699 -12966 -11531 1344 23675
24433B3675o93j1271k9983K3305J5918m869k6843j267J216o382j0864M676J5237
$$ 23675 22982 11711 -18272 5033 20951 16082 -10761 -12028 -10812 -17194 -28058 -23382 -8145
24420h145L7426r373r197J0880J1202j112L708m0008n055N22L4653j4325k3786
$$ -8145 29281 19908 10711 21591 32793 31681 35389 -4619 -9674 -9152 25501 11176 -12610
24407a2610j4704p892l846M1314J5076J697j4341k2818k535r298o803p226j3397
$$ -12610 -27314 -35206 -39052 2262 17338 19035 4694 -18124 -20659 -29957 -36760 -43986 -57383
24394e7383j2820K9384L6042K2319p499j1118o844J9880J8775k7820m8953k100
$$ -57383 -70203 -40819 -4777 17542 10043 -1075 -7919 11961 30736 2916 -46037 -48137
24382d8137M0554K4324P656K363j6578m962L812N483j9839p474j9753j329M19
$$ -48137 -7583 16741 24397 26760 10182 5220 9032 14515 -5324 -12798 -32551 -33880 -33461
24369c3461k49J2648R974J5589j8826l0643J359m0509J569M7531K9732O004j051
$$ -33461 -33710 -21062 -11088 4501 -14325 -44968 -43609 -84118 -82549 -35018 -5286 718 -333
24356c33K2454n532j2956k1088l6427L11K6081L3723K2704j1889r280j5676J0799
$$ -333 22121 16589 3633 -17455 -53882 -53571 -27490 6233 28937 17048 7768 -7908 2891
24343B891J922j5082J1420J6423K121J1948p62k5574n184j1107j2322j9150k5270
$$ 2891 4813 -10269 1151 17574 19695 31643 30881 5307 123 -10984 -23306 -42456 -67726
24330f7726J3337M9727J377k0074r134P56k1144K320J4144L6228K7006l2324l1332
$$ -67726 -54389 -4662 -3285 -23359 -32493 -31737 -52881 -50561 -36417 -189 26817 -5507 -36839
24317c6839K8510o841o022K7481r160m02o494J9909J8811L717o269J8170K1360
$$ -36839 -8329 -15170 -21192 6289 -2871 -3273 -9767 10142 28953 32670 26401 44571 65931
24304F5931m4681k7338N46j4025k5009k3630J3495j1267l620N211Q27K3366J7141
$$ 65931 21250 -6088 -5542 -19567 -44576 -68206 -54711 -65978 -69598 -64387 -63560 -40194 -23053
24291b3053r207K8124K7118l073k8600k0450n155J0356J7093L0454j1574k3488
$$ -23053 -32260 -4136 22982 19909 -8691 -29141 -34296 -23940 -6847 23607 12033 -11455
24279a1455j6828K699K4577K1273j6210k988L9203P841j6053k4373j4024q680
$$ -11455 -28283 -25584 -1007 20266 4056 1068 40271 48112 32059 7686 -6338 -15018
24267a5018K806J934k6630j4049K9722m219r263L2569J2924j2781k5612j2548
$$ -15018 -12212 -10278 -36908 -50957 -21235 -25454 -34717 -2148 10776 -2005 -27617 -40165
24255d0165M4446J2035j6854M107K2070l3884j5843q956K6172K2932l919k755
$$ -40165 4281 16316 -538 3569 25639 -8245 -24088 -33044 -6872 16060 12141 9386
24243I386q34J1381k010J68p673J3602M491O2K6528j180m225k6271k044Q258J5358
$$ 9386 8552 19933 17923 18091 10418 24020 28511 28573 55101 53921 49696 23425 21381 29639 44997
24228D4997L0477k534l7198k2775j7534j1333m610M9648j3396k907q370P058K0416
$$ 44997 75474 72940 35742 12967 -4567 -15900 -20510 29138 15742 12835 4465 11523 31939
24215C1939L475k6374p011J3505P662k3682j9363J932K460j2281n48j7198r200
$$ 31939 35414 9040 2029 15534 23196 -486 -19849 -17917 -15457 -27738 -28286 -45484 -54684
24202e4684J1067J4704K804R566J4698M408j1555J1990N809j4782r772J2585J9832
$$ -54684 -43617 -28913 -26109 -16543 -1845 2563 -8992 2998 8807 -5975 -15747 -3162 16670
24189A6670k0749k2455j827J4831m331J4208J7511K9891j957j9964p091j8673
$$ 16670 -4079 -26534 -28361 -13530 -17861 -3653 13858 43749 41792 21828 14737 -3936
24177c936o544J0891J9283j8835j0970K3585n724k2139p32M557n684N46K6354
$$ -3936 -10480 411 19694 859 -10111 13474 7750 -14389 -15121 -10564 -16248 -15702 10652
24164A0652m649J19k255Q176O484O925q692q743k811q909k5978k423K4616J9088
$$ 10652 6003 6122 3867 12043 18527 25452 16760 8017 5206 -3703 -29681 -32104 -7488 11600
24150A1600j4987j4685K0914Q279Q858k6497k6207R761Q911K5977J5897j7862
$$ 11600 -3387 -18072 2842 11121 19979 -6518 -32725 -22964 -14053 11924 27821 9959
24138I959M581K147j198k5644K0346K626r280k209j1838o087j6018p916m93J4146
$$ 9959 14540 16687 15489 -10155 10191 12817 3537 1328 -10510 -16597 -32615 -40531 -41024 -26878
24124b6878l917J1852N356j1749M516q336R326K6524L2724o905o924k6493k9118
$$ -26878 -30795 -18943 -13587 -25336 -20820 -29156 -19830 6694 39418 32513 25589 -904 -30022
24111c0022k2544j1001r486J4054J7181J6612K1594K9459r689k6453j3951j743
$$ -30022 -52566 -63567 -73053 -58999 -41818 -25206 -3612 25847 16158 -10295 -24246 -25989
24099b5989m310J1514Q636k4778M11L4510J7417k0585p292j3291j9228q182K0081
$$ -25989 -30299 -18785 -10149 -34927 -34516 -6 17411 -3174 -10466 -23757 -42985 -51167 -31086
24086c1086N69J946k408J458J0795M0361K0463N027j093j9102j7813n206P456
$$ -31086 -30517 -28571 -30979 -29521 -18726 21635 42098 47125 46032 26930 9117 3911 11367
24073A1367j4013q9J76K4881O300K232J9065J4371k8033l2706k6159j1811P093
$$ 11367 -2646 -2735 -2559 22322 28622 30854 49919 64290 36257 3551 -22608 -34419 -27326
24060b7326k588j71k927K1741k272K8256J0715K956P854j9827j4063O569K6242
$$ -27326 -29914 -30085 -33012 -11271 -13543 14713 25428 28384 36238 16411 2348 8917 35159
24047C5159J0188j2045l1681k0573k1429K868K7280L7724J3256L769J493l9241
$$ 35159 45347 33302 1621 -18952 -40381 -37513 -10233 27491 40747 44516 46009 6768
24035F768n4594l301K4600l800j648K9955l5078r874K7270q590k7783J0160l081
$$ 6768 -47826 -51127 -26527 -30327 -31975 -2020 -37098 -46972 -19702 -28292 -56075 -45915 -48996
24022d8996N442K3886j55n305j0270j8969j3382J9445N0271J5937q297J6127K0043
$$ -48996 -43554 -19668 -19823 -25128 -35398 -54367 -67749 -48304 1967 17904 9607 25734 45777
24009D5777l4237m0655M519p663l1088p075K7626L1197J3005J1758J8499K5202
$$ 45777 11540 -29115 -24596 -32259 -63347 -70422 -42796 -11599 1406 13164 31663 56865
23997E6865k0055k1957j4824o986j4941k1566l3764k575L928j2027J7064L5489
$$ 56865 36810 14853 29 -6957 -21898 -43464 -77228 -79803 -75875 -87902 -70838 -35349
23985c5349K2087k8748p868K4313K1899J3658m632j1607j5427k4835j6147J4502
$$ -35349 -13262 -42010 -49878 -25565 -3666 9992 5360 -6247 -21674 -46509 -62656 -48154
23973d8154J9402k9198J6624K0388q898j7072O544L5421K9559l030j9906J288
$$ -48154 -28752 -57950 -41326 -20938 -29836 -46908 -40364 -4943 24616 21586 1680 2968
23961B968p181J971N732J2128l854Q366k0679j4753n164J5694J0808j5800j7284
$$ 2968 -4213 -2242 3490 15618 11764 20130 -549 -15302 -20466 -4772 6036 -9764 -27048
23948b7048p216k6041K0964M0843k652j7605q277K1042J1813j5643k1095J2476
$$ -27048 -34264 -60305 -39341 1502 -1150 -18755 -27032 -5990 5823 -9820 -30915 -18439
23936a8439K7367k0161r15J2701J0740j5212j4400J2350K1619Q05J0671j8307
$$ -18439 8928 -11233 -12148 553 11293 -3919 -18319 -5969 15650 16455 27126 8819
23924H819J1493R543j3567o700l426J0190J2991j3501k171k092m697j0905k0082
$$ 8819 20312 29855 16288 9588 6162 16352 29343 15842 13671 11579 6882 -4023 -24105
23911b4105k9967j2741Q728R506J9917M177N604K3096k2087k9900J5654L9085
$$ -24105 -54072 -66813 -58085 -48579 -28662 -24485 -18881 4215 -17872 -47772 -32118 6967
23899F967k010j0034k0585n346K299k6721J5027K7423P702j5908J9540O351k2056
$$ 6967 4957 -5077 -25662 -31008 -28709 -55430 -40403 -12980 -5278 -21186 -1646 4705 -17351
23886a7351j5850M766j8545k674K4409L9636N21r838J996r901j0724k2016J5796
$$ -17351 -33201 -28435 -46980 -49654 -25245 14391 14912 5074 7070 -2831 -13555 -35571 -19775
23873a9775M5890J833j3849L227r379k2783Q071j361k1144N111n916R458K2083
$$ -19775 26115 27948 14099 17326 7947 -14836 -6765 -8126 -29270 -24159 -30075 -20617 1466
23860A466j1005k1930j1937R985K3521M3778j9733k2117P42J0677J3308j717j0452
$$ 1466 -9539 -31469 -43406 -33421 -9900 33878 14145 -7972 -7230 3447 16755 15038 4586
23847D586L709j6522j6230L0248K730k4765q466J7091l770j8249M048J0450l686
$$ 4586 8295 -8227 -24457 5791 8521 -16244 -24710 -7619 -11389 -29638 -25590 -15140 -18826
23834a8826R195K0500p852K6931L099l5322j3189k0015R288J1243O860R891j1678
$$ -18826 -9631 10869 3017 29948 33047 -2275 -15464 -35479 -26191 -14948 -8088 1803 -9875
23821i875K7517K4972N778j9226K3703J216m1507n523K7631J2603k6563l5319
$$ -9875 17642 42614 48392 29166 52869 54085 12578 7055 34686 47289 20726 -14593
23809a4593O60j634K7660K4807j903j2848j6798l703R066r764j1444R447j2694
$$ -14593 -13933 -15567 12093 36900 34997 22149 5351 1648 10714 950 -10494 -1047 -13741
23796a3741k1211j6059J4874J8906m5m067l1700j5539L6057K0056O892j68j0588
$$ -13741 -34952 -51011 -36137 -17231 -17276 -21343 -53043 -68582 -32525 -12469 -5577 -5745 -16333
23783a6333O650L2611K317j4767j1850O542J610j3599M70K895j4420J39k0157
$$ -16333 -9683 22928 25245 10478 -1372 5170 6780 -6819 -6349 -3454 -17874 -17735 -37892
23770c7892k026j9965j1236J3287L444Q783K5411M150l2789p286K1428J9385l08
$$ -37892 -39918 -59883 -71119 -57832 -54388 -45605 -20194 -16044 -48833 -56119 -34691 -15306 -15614
23757a5614J149j2433N17o814j3237J6339J396p961j7523J7245K4582O397Q901
$$ -15614 -14465 -26898 -26381 -33195 -46432 -30093 -28697 -36658 -54181 -36936 -12354 -5957 2944
23744B944O072o844l802j9296p98K1012j497j1106p017K7880J2909r391J59l7852
$$ 2944 9016 2172 -1630 -20926 -21724 -712 -2209 -13315 -20332 7548 20457 11066 11225 -26627
23730b6627j4013J2979J1688M211o890m430J4819J0984j3177l0283l882K4208
$$ -26627 -40640 -27661 -15973 -11762 -18652 -23082 -8263 2721 -10456 -40739 -44621 -20413
23718b0413j759p176m746O410j5073J4987l075K983k6482J666j731J0320J5334
$$ -20413 -22172 -29348 -34094 -27684 -42757 -27770 -30845 -27862 -54344 -52678 -54409 -44089 -28755
23705b8755j1533P362q687n685j2646K4158J7749J2599j0807k0227r386O769K7882
$$ -28755 -40288 -32926 -41613 -47298 -59944 -35786 -18037 -5438 -16245 -36472 -45858 -39089 -11207
23692a1207r370k5957L671K3755K7775K6941L2279k4282k1967j0261k8969q762
$$ -11207 -20577 -46534 -42863 -19108 8667 35608 67887 43605 21638 11377 -17592 -26354
23680b6354q607l072J1340J6526P203O50j7097K1609K418j286j741R560K594J0100
$$ -26354 -34961 -38033 -26693 -10167 -2964 -2314 -19411 2198 4616 3330 1589 11149 13743 23843
23666B3843m3438k9874K449J448J6104N858J1150j192o846n747J2626J7287j9856
$$ 23843 -19595 -49469 -47020 -45572 -29468 -23610 -12460 -13652 -20498 -26245 -13619 3668 -16188
23653a6188J675L8544J8610j9698l9119k9188J1821J4621K2393K5992j705L613
$$ -16188 -14513 24031 42641 22943 -16176 -45364 -33543 -18922 3471 29463 27758 31371
23641C1371k7489m9484K3908K0630J1961l834r792j4516J2370k1527P564J0097
$$ 31371 3882 -45602 -21694 -1064 10897 7063 -2729 -17245 -4875 -26402 -18838 -8741
23629h741J0151J7435M96N104L852j1056p597K659k9459K444K8448J4335j2208
$$ -8741 1410 18845 19341 24445 28297 17241 9644 12303 -17156 -14712 13736 28071 15863
23616A5863Q7k9257N478m454O903K9996K3692J1281k4437k6428r484J568j5111
$$ 15863 15950 -13307 -7829 -12283 -5380 24616 48308 59589 35152 8724 -760 808 -14303
23603a4303J476O813K901p935K315J1892J999J577J9078R368k1983p192J0827
$$ -14303 -12827 -6014 -3113 -11048 -8733 3159 5158 6735 25813 35181 13198 6006 16833
23590A6833j1370K018L2276J6237k9233k8300J1220k6460j3492Q655L1998L017
$$ 16833 5463 7481 39757 55994 26761 -1539 9681 -16779 -30271 -21616 10382 13399
23578A3399j1444j7106l30o740J582o992O691J797l510j8314m733P006K5997O275
$$ 13399 1955 -15151 -15481 -22221 -20639 -27631 -20940 -19143 -22653 -40967 -45700 -38694 -12697 -6422
23564f422k3716k5457m650L5945M299J2377K3834L047K6536O327o186k597k4228
$$ -6422 -30138 -55595 -60245 -24300 -20001 -7624 16210 19257 45793 52120 45934 43337 19109
23551A9109j8756J3794J9810J095k6953J6064p669M561M617Q794j840k5490j0975
$$ 19109 353 14147 33957 35052 8099 24163 16494 21055 25672 34466 32626 7136 -3839
23538c839K0004j3280k356J6828p669j9123j9077K056K9293J724k334O889j6606
$$ -3839 16165 2885 529 17357 9688 -9435 -28512 -26456 2837 4561 2227 9116 -7490
23525g490k496j2856K1219P219J0529J7952j6136k3156j9537j2760o54J257R476
$$ -7490 -9986 -22842 -1623 5596 16125 34077 17941 -5215 -24752 -37512 -38166 -36909 -27433
23512b7433l129J9191j0190k6906j2984J09K981K1731K0978l481n167J3393p626
$$ -27433 -30562 -11371 -21561 -48467 -61451 -61342 -58361 -36630 -15652 -19133 -24300 -10907 -18533
23499a8533k261p175j0942k3508j771K2853J4289K7819P183q612P89N316K4444
$$ -18533 -20794 -27969 -38911 -62419 -64190 -41337 -27048 771 7954 -658 131 5447 29891
23486B9891J0352k1382j5486k1006j16J7338M296j6311K6708J1496m823j5841
$$ 29891 40243 18861 3375 -17631 -17747 -409 3887 -12424 14284 25780 20957 5116
23474E116l714j1048j9750P432J249j5311k4744R648n370k3155P001K7474O971
$$ 5116 1402 -9646 -29396 -21964 -20715 -36026 -60770 -51122 -56492 -79647 -72646 -45172 -38201
23461c8201j6798K6658K477n762j4447O556L5384J5702j8525m252j0580j2693
$$ -38201 -54999 -28341 -25864 -31626 -46073 -39517 -4133 11569 -6956 -11208 -21788 -34481
23449c4481J8914m696L03J3475K7623j1455j4423m403K1325q01j2256j139m797
$$ -34481 -15567 -20263 -19960 -6485 21138 9683 -4740 -9143 12182 11381 -875 -2014 -6811
23436f811R410o225l356k197K3154R193l7714l928J1292J3186N964N531J0203
$$ -6811 2599 -3626 -6982 -9179 13975 23168 -14546 -18474 -7182 6004 11968 17499 27702
23423B7702o917J273n823L035j2816K3504J4026m2895k8039j6379J9786K0699
$$ 27702 20785 22058 16235 19270 6454 29958 43984 1089 -26950 -43329 -23543 -2844
23411b844N999q462j3388j9890k8360J9802o361J0744L8200K1059m16k924Q129
$$ -2844 3155 -5307 -18695 -38585 -66945 -47143 -53504 -42760 -4560 16499 16083 13159 21288
23398B1288j7005m75m032l3323Q58q918m010P015R817M862o256j9715J1507M7453
$$ 21288 4283 3808 -224 -33547 -32689 -41607 -45617 -38602 -28785 -23923 -30179 -49894 -38387 9066
23384I066P179j8738P52p288j2281k8521Q778K4288n004q377J469l698J0695p130
$$ 9066 16245 -2493 -1741 -9029 -21310 -49831 -41053 -16765 -21769 -30146 -28677 -32375 -21680 -28810
23370b8810J2122J7098k6759m891O129k5798k2034J3447j544j0850j0002K8162
$$ -28810 -16688 410 -26349 -31240 -25111 -50909 -72943 -59496 -61040 -71890 -81892 -53730
23358e3730L2509K5781P739p475m182n960k1613P161j101l063j7541j8232L1936
$$ -53730 -21221 4560 12299 4824 642 -5318 -26931 -19770 -20871 -23934 -41475 -59707 -27771
23345b7771J4925l1775L929J1334k534K6927k076j8343L434l998k176M0334K8180
$$ -27771 -12846 -44621 -40692 -29358 -31892 -4965 -7041 -25384 -21950 -25948 -28124 12210 40390
23332D0390j8565j2519r760j527j3728q82n983K13R690p77J283J8843k333K228
$$ 40390 21825 9306 -454 -1981 -15709 -16591 -22574 -22361 -12671 -13448 -12165 6678 4345 6573
23318F573J6885j6727K5962J4405l0074r334j718k5754j6932j0064N911K9291
$$ 6573 23458 6731 32693 47098 17024 7690 5972 -19782 -36714 -46778 -40867 -11576
23306a1576J2521k519r097j0725J0428J0747r24J6924J3089O636K438j0698k685
$$ -11576 945 -1574 -10671 -21396 -10968 -221 -1145 15779 28868 35504 37942 27244 24559
23293B4559j135j9863j7514J7304O771k5627J4797K386J639j2833j4864K9639
$$ 24559 23424 3561 -13953 3351 10122 -15505 -708 1678 3317 -9516 -24380 5259
23281E259J4756j5002Q955J0773m634J331j212k2248J2545j837q146J8262N413
$$ 5259 20015 5013 13968 24741 20107 21438 20226 -2022 10523 8686 540 18802 24215
23268B4215r186k9444k419M8750L0834k1823j0974j2246q450l1883j1568J5908
$$ 24215 15029 -14415 -16834 31916 62750 40927 29953 17707 9257 -22626 -34194 -18286
23256a8286P675P450K032r041J7079j1857k8691J3442l00k1791J3877L3762l216
$$ -18286 -10611 -3161 -1129 -10170 6909 -4948 -33639 -20197 -20497 -42288 -28411 5351 2135
23243B135k5416j6432k4011K8159K5471J0654L352l2545l007J3357q220O418R57
$$ 2135 -23281 -39713 -63724 -35565 -10094 560 3912 -28633 -31640 -18283 -26503 -20085 -19128
23230a9128J0570j697J80K3586J3560k4470q107j4632K4977L684j0764k3110r119
$$ -19128 -8558 -10255 -10075 13511 27071 2601 -5506 -20138 4839 8523 -2241 -25351 -34470
23217c4470q040r258J5971R111q671J5481p077l1877J8289K8912J2213j0020J8137
$$ -34470 -42510 -51768 -35797 -26686 -35357 -19876 -26953 -58830 -40541 -11629 584 -9436 8701
23204H701r726P55o051k3248J2742q020j8502p355K0647J5924J5191n374q075
$$ 8701 -1025 -270 -6321 -29569 -16827 -24847 -43349 -50704 -30057 -14133 1058 -4316 -12391
23191a2391l8402J8598K8410J7865k8661k8219J3685J4976P045L0379J2305o3136
$$ -12391 -50793 -32195 -3785 14080 -14581 -42800 -29115 -14139 -7094 23285 35590 -27546
23179b7546j5469j7305J1838K0338j3831N718L4072r948k6200J5720k277R920
$$ -27546 -43015 -60320 -48482 -28144 -41975 -36257 -2185 -12133 -38333 -22613 -24890 -14970
23167a4970K1370M322Q28l0380j4145J6397P287L4525j2225r925j2714J0618j1234
$$ -14970 6400 10722 11550 -18830 -32975 -16578 -9291 25234 13009 3084 -9630 988 -10246
23154a0246N208J0733o102L117K0918j9933J4046J1254k1910j9877o862L9720
$$ -10246 -5038 5695 -407 2710 23628 3695 17741 28995 7085 -12792 -19654 20066
23142B0066K784J8819q97j3039j9570k49J6753k0099j6993L648p167l459P182
$$ 20066 22850 41669 40772 27733 8163 7914 24667 4568 -12425 -8777 -15944 -19403 -12221
23129a2221n095p492K0763K792j1063j7934J9626L70m442K3456J1668J0937P352
$$ -12221 -17316 -24808 -4045 -1253 -12316 -30250 -10624 -10254 -14696 8760 20428 31365 38717
23116C8717k0930j4245k2265J4436J4793k2789k885O562O368j6157L287R869J8446
$$ 38717 17787 3542 -18723 -4287 10506 -12283 -15168 -8606 -2238 -18395 -15108 -5239 13207
23103A3207J6569J6049k0152j0176j0490O250L068O340l4335j1968m845N677M884
$$ 13207 29776 45825 25673 15497 5007 11257 14325 20665 -13670 -25638 -30483 -24806 -19922
23090a9922j0021O7N167n879l2105M970O748J1809J4782L431P897P65l355K339
$$ -19922 -29943 -29876 -24709 -30588 -62693 -57723 -50975 -39166 -24384 -20953 -13056 -12291 -15646 -13307
23076a3307l421M110p309l873J2391J7406P246j0644j7402N015L515j2143N525
$$ -13307 -16728 -12618 -19927 -23800 -11409 5997 13243 2599 -14803 -9788 -6273 -18416 -12891
23063a2891j6722o349k1760J2302P824P999p139J4899L6563k2428k2559K8272
$$ -12891 -29613 -35962 -57722 -45420 -37596 -29597 -36736 -21837 14726 -7702 -30261 -1989
23051a989l774j4664J5907O815J5881j0930k5967j3685k951j946n110o953J774
$$ -1989 -5763 -20427 -4520 2295 18176 7246 -18721 -32406 -35357 -37303 -42413 -49366 -47592
23038d7592K3092O018R172k833L113J4266j6108j7519J0800K4743N076k438j3453
$$ -47592 -24500 -18482 -9310 -12143 -9030 5236 -10872 -28391 -17591 7152 12228 9790 -3663
23025c663m2689n101J9267N381l8326p77J6065K7988R22k7210p074R215J1468
$$ -3663 -46352 -51453 -32186 -26805 -65131 -65908 -49843 -21855 -20933 -48143 -55217 -46002 -34534
23012c4534k530j2387j0876n179K6544M1675K4577r766j0518j8721j7097J1652
$$ -34534 -37064 -49451 -60327 -65506 -38962 2713 27290 17524 7006 -11715 -28812 -17160
23000a7160j5757j7812k035J630K7572O631J870P684o437p941j5594k1440l325
$$ -17160 -32917 -50729 -52764 -51134 -23562 -16931 -15061 -7377 -13814 -21755 -37349 -58789 -62114
22987f2114j417M6238J7597j1825j6974L602K0117J4398J0211K4857q920l0353
$$ -62114 -63531 -17293 304 -11521 -28495 -24893 -4776 9622 19833 44690 35770 5417
22975E417J6756j8109o288m406j901r420K5955K2958j5316j8018k1224M256J7122
$$ 5417 22173 4064 -2224 -6630 -8531 -17951 8004 30962 15646 -2372 -23596 -19340 -2218
22962b218k1853K4071J9146k6794J5787L9303p684m581p971M004k4271j7536n36
$$ -2218 -24071 0 19146 -7648 8139 47442 39758 35177 27206 31210 6939 -10597 -11133
22949a1133P32R027j2901k5283j4802O167o364j2527J5730K6899R334k8584q192
$$ -11133 -10401 -1374 -14275 -39558 -54360 -48193 -54557 -67084 -51354 -24455 -15121 -43705 -51897
22936e1897P213N954K1690j0529l0676j1542J2130K2703K3797M650J6876j3550
$$ -51897 -44684 -38730 -17040 -27569 -58245 -69787 -57657 -34954 -11157 -6507 10369 -3181
22924c181j5300R715j1562K135O499K5306j2253j0068O445J3608j0002m344r548
$$ -3181 -18481 -8766 -20328 -18193 -11694 13612 1359 -8709 -2264 11344 1342 -3002 -12550
22911a2550q564k391N820K2301j5478R211j7854j3941M944k0749l367j3953J7994
$$ -12550 -21114 -23505 -17685 4616 -10862 -1651 -19505 -33446 -28502 -49251 -52618 -66571 -48577
22898d8577R873j0070K5440J1585J68K8685Q446j7904j1512k50P625q099N115
$$ -48577 -38704 -48774 -23334 -11749 -11581 17104 25550 7646 -3866 -4116 3509 -4590 525
22885E25M830J7865j6869k5892J2846K178K4430J2144j7202q692k4056k6317J6162
$$ 525 5355 23220 6351 -19541 -6695 -4517 19913 32057 14855 6163 -17893 -44210 -28048
22872b8048p224J912K805J8797j5988j4747O49L2395K5761k7518l9761l0497K149
$$ -28048 -35272 -33360 -30555 -11758 -27746 -42493 -41844 -9449 16312 -11206 -50967 -81464 -79315
22859g9315Q638K692r9J8856R747k2136M269l958j495k283k223N715L8899K7640
$$ -79315 -70677 -67985 -68084 -49228 -39481 -61617 -57348 -61306 -62801 -65084 -67307 -61592 -22693 4947
22845D947k997J34j6157L416j2587j8635J0111J1190l583L365J1528K6913R706
$$ 4947 1950 2084 -14073 -10657 -23244 -41879 -31768 -20578 -24161 -20796 -9268 17645 27351
22832B7351p793P402j1005j8027j1942k9502J231J0797P677j683M034j4885k2362
$$ 27351 19558 26960 15955 -2072 -14014 -43516 -42285 -31488 -23811 -25494 -21460 -36345 -58707
22819e8707k111n116J5186K1358J7460K7471o548K937P294j1939k997N574j3108
$$ -58707 -60818 -65934 -50748 -29390 -11930 15541 8993 11930 19224 7285 4288 9862 -3246
22806c246j5908j385m130R999j7228O833o67k2795K960l337q459q292J5612K8910
$$ -3246 -19154 -20539 -24669 -14670 -31898 -25065 -25732 -48527 -45567 -48904 -57363 -65655 -50043 -21133
22792b1133n402J2455Q583o522N469J3774J7358K959k6848j4164P75K0030r440
$$ -21133 -26535 -14080 -5497 -12019 -6550 7224 24582 27541 693 -13471 -12696 7334 -2106
22779b106k2731n972L8205K1283j4939k2851o232M1139R30O124r195j6727R675
$$ -2106 -24837 -30809 7396 28679 13740 -9111 -15343 25796 26726 32850 23655 6928 16603
22766A6603k392l2849L236J6092n911k0664m21m135L020q751J637R712M069P543
$$ 16603 14211 -18638 -15402 690 -5221 -25885 -26306 -30441 -27421 -36172 -34535 -24823 -20754 -13211
22752a3211j3454J6692K3351j4324k2433Q74l396k070o906j0565J5196j0045L167
$$ -13211 -26665 -9973 13378 -946 -23379 -22505 -25901 -27971 -34877 -45442 -30246 -40291 -37124
22739c7124L7078K3831Q892j3483k0450k4523J2314j3071N551k505p887K045M5901
$$ -37124 -46 23785 32677 19194 -1256 -25779 -13465 -26536 -20985 -23490 -31377 -29332 16569
22726A6569j4988l2898j2594J2918L370q963J7383m800j1723l611K8123p764M46
$$ 16569 1581 -31317 -43911 -30993 -27623 -36586 -19203 -24003 -35726 -39337 -11214 -18978 -18532
22713a8532N379j4834L456K0965j9418K4270K3567m474l0350k1742n40p743j6205
$$ -18532 -13153 -27987 -24531 -3566 -22984 1286 24853 20379 -9971 -31713 -32253 -39996 -56201
22700e6201J5632J3417r3J4672k4702l3580j692J9152L5063O728j1301q232J0595
$$ -56201 -40569 -27152 -27245 -12573 -37275 -70855 -72547 -53395 -18332 -11604 -22905 -31137 -20542
22687b0542M244K4905J875k8956K4739r446K928N02j5646K1543P35l1630j7000
$$ -20542 -16298 8607 10482 -18474 6265 -3181 -253 249 -15397 6146 6881 -24749 -41749
22674d1749L412J9057J448l445K662k981O065J680q927r321J8750m1j3327L418
$$ -41749 -38337 -19280 -17832 -21277 -18615 -21596 -15531 -13851 -22778 -32099 -13349 -13390 -26717 -23299
22660b3299M298l849J4850l742j9357m4M926K4164M0707L7419o774k0989j6806
$$ -23299 -19001 -22850 -8000 -11742 -31099 -31143 -26217 -2053 38654 76073 69299 48310 31504
22647C1504l7033k8138J0849K0036L2951J47k9600p824K7903n559j2571N061J4296
$$ 31504 -5529 -33667 -22818 -2782 30169 30316 716 -7108 20795 15236 2665 7726 22022
22634B2022j3510r129j9932j7284o036m018L3702J97M114P95P632j3656k0475
$$ 22022 8512 -617 -20549 -37833 -43869 -47887 -14185 -13988 -9874 -9079 -1447 -15103 -35578
22621c5578p931K2941r466k4436N728K3090J1407R332j4730l6034l0334K8118
$$ -35578 -43509 -20568 -30034 -54470 -48742 -25652 -14245 -4913 -19643 -55677 -86011 -57893
22609e7893K8694J8884K1647J8267k6122j2027K655K5356j6177j2799m478K5569
$$ -57893 -29199 -10315 11332 29599 3477 -8550 -5895 19461 3284 -9515 -13993 11576
22597A1576J0603n455k281N413O896k3059j7945j0036m246P990K1199r300M802
$$ 11576 22179 16724 14443 19856 26752 3693 -14252 -24288 -28534 -20544 655 -8645 -3843
22584c843r727r70L935k0028k2751J4853R299j7784K0916K9436O802J88j7415
$$ -3843 -13570 -14540 -10605 -30633 -53384 -38531 -29232 -47016 -26100 3336 10138 10326 -7089
22571g089j4435Q436r93O179J3212r350j970p794J982J4272k9170n741M2583P580
$$ -7089 -21524 -13088 -14081 -7902 5310 -4040 -6010 -13804 -11822 2450 -26720 -32461 10122 17702
22557A7702k9102o522p82j5479j840M9926L731q472j1796k5835r39J4713J1098
$$ 17702 -11400 -17922 -18704 -34183 -36023 13903 17634 9162 -2634 -28469 -29408 -14695 -3597
22544c597P636p122J6052K6196k2401p835J4520P701q411j9083p908m138l889
$$ -3597 4039 -3083 12969 39165 16764 8929 23449 31150 22739 3656 -4252 -8390 -12279
22531a2279O49K530j912j8177j7496J8943K701J2220Q401J679j555j1265j8498
$$ -12279 -11630 -9100 -11012 -29189 -46685 -27742 -25041 -12821 -4420 -2741 -4296 -15561 -34059
22518c4059j3366o88J1703K9620j1723n749K9285l0039j9072J3400J5428M748
$$ -34059 -47425 -48113 -36410 -6790 -18513 -24262 5023 -25016 -44088 -30688 -15260 -10512
22506a0512J2335n716k0577N799Q344J3255R945k0418k7035K391J8462K5183k0022
$$ -10512 1823 -3893 -24470 -18671 -10327 2928 12873 -7545 -34580 -32189 -13727 11456 -8566
22493h566J4076K1886J2122j812l6467k5647j3767K7307J4191j0293J8391K112
$$ -8566 5510 27396 39518 37706 1239 -24408 -38175 -10868 3323 -6970 11421 13533
22481A3533k1732m3033N497K8196K0975n671j6411k9840K5905o129j3517J4251
$$ 13533 -8199 -51232 -45735 -17539 3436 -2235 -18646 -48486 -22581 -28710 -42227 -27976
22469b7976J6482J3070J8787j1955r904K0712N245k016k6767j4086N664R826o98
$$ -27976 -11494 1576 20363 8408 -1496 19216 24461 22445 -4322 -18408 -12744 -2918 -3616
22456c616l223l13m24L62m420J1334j4281k6659M070K5232K06K917j5127K3080
$$ -3616 -6839 -7152 -7576 -7214 -11634 -300 -14581 -41240 -37170 -11938 -11732 -8815 -23942 -862
22442h62K2912R70k2152p978J6508j9265J0691K1283J7860k1354r345l260R553
$$ -862 22050 23020 868 -7110 9398 -9867 824 22107 39967 18613 9268 6008 15561
22429A5561j7674j2813K364R941J481Q092J1123J890k7476k3485M606P848K2526
$$ 15561 -2113 -14926 -12562 -2621 -1140 6952 18075 19965 -7511 -30996 -26390 -18542 3984
22416C984Q419J1568k4965P401J6441k1361k4825j8826p036O192K7098J3999k933
$$ 3984 12403 23971 -994 6407 22848 1487 -23338 -42164 -49200 -43008 -15910 -1911 -4844
22403d844J9295j83k0483k7876j0170j1324j812R283J1020l81K8562J1872L444
$$ -4844 14451 14268 -6215 -34091 -44261 -55585 -57397 -48114 -37094 -37475 -8913 2959 6403
22390F403Q314M191J1510j1084j5852n932J2257k5786j9274j3006J3121J267m781
$$ 6403 14717 18908 30418 19334 3482 -2450 9807 -15979 -35253 -48259 -35138 -33871 -38652
22377c8652P511J979J1174Q333J8290m806L840J1155L2231K1160k1374k1031l3696
$$ -38652 -31141 -29162 -17988 -9655 8635 3829 7669 18824 51055 72215 50841 29810 -3886
22364c886j7176J1744L9018r971k3110l074k7391p633P653r154J2620L268j2356
$$ -3886 -21062 -9318 29700 19729 -3381 -6455 -33846 -41479 -33826 -42980 -30360 -27092 -39448
22351c9448l191P868K0542L935L9278P713o959j3318j7098p562j1629M437M398
$$ -39448 -42639 -34771 -14229 -10294 28984 36697 29738 16420 -678 -8240 -19869 -15432 -11034
22338a1034k7574q848J4176K2043l421M70J442J7811j1520K1198R285j2005l2816
$$ -11034 -38608 -47456 -33280 -11237 -14658 -14188 -12746 5065 -6455 14743 24028 12023 -20793
22325b0793k1244m72K6590j237J619K8020j4118j2441j0617M0707K7158M431M210
$$ -20793 -42037 -42509 -15919 -17156 -15537 12483 -1635 -14076 -24693 16014 43172 47603 51813
22312E1813k9547n105j113k3980n773L663J9404j9787n59M292J856J7986j3117
$$ 51813 22266 17161 16048 -7932 -13705 -10042 9362 -10425 -10984 -6692 -4836 13150 33
22299C3j492J4683q297q625k2604n420J9851K6548l8917k0795J5225L5732K2100
$$ 33 -1459 13224 4927 -3698 -26302 -31722 -11871 14677 -24240 -45035 -29810 5922 28022
22286B8022p49m1090j8394k6061L3597K8903q124J5717P591k881k828k5705k3358
$$ 28022 27273 -13817 -32211 -58272 -24675 4228 -3896 11821 19412 16531 13703 -12002 -35360
22273c5360J2024J3721j893j4985J0882J7889k1111Q939j7008j8860j9550K1536
$$ -35360 -23336 -9615 -11508 -26493 -15611 2278 -18833 -9894 -26902 -45762 -65312 -43776
22261d3776J2638J9058k1438k4032p562J5955r186Q315K8980K7531n719j4369
$$ -43776 -31138 -12080 -33518 -57550 -65112 -49157 -58343 -50028 -21048 6483 764 -13605
22249a3605O578j2120P922P25J1005Q82J1649J7165k982j1312J2181l0229m1449
$$ -13605 -7027 -19147 -11225 -10500 505 1387 13036 30201 27219 15907 28088 -2141 -43590
22236d3590r89J6828L1015q98j3960j7014O271k1886j8228K628J0615J299L6044
$$ -43590 -44579 -27751 3264 2366 -11594 -28608 -22337 -44223 -62451 -59823 -49208 -47909 -11865
22223a1865K8287j6625R660k8242k0496m152K4799O218L885K1268m520j8093P578
$$ -11865 16422 -203 9457 -18785 -39281 -43433 -18634 -12416 -8531 12737 8217 -9876 -2298
22210b298j3136J762P763j0167j4568j9308J3796J0275k866K3392L830k9145J639
$$ -2298 -15434 -13672 -5909 -16076 -30644 -49952 -36156 -25881 -28747 -5355 -1525 -30670 -29031
22197b9031l528l309P908j07J2518M77m127J5661j3664k4521l641J4898r93o887
$$ -29031 -32559 -35868 -27960 -28067 -15549 -15072 -19199 -3538 -17202 -41723 -45364 -30466 -31459 -38346
22183c8346K185j7292k5413o496R427J6627J923R665J6067J9157n096m976p951
$$ -38346 -36161 -53453 -78866 -85362 -75935 -59308 -57385 -47720 -31653 -12496 -17592 -22568 -30519
22170c0519K0234n856M438J3488j3580J2415j3701L08K2529l727k5375K1562l660
$$ -30519 -10285 -16141 -11703 1785 -11795 620 -13081 -12773 9756 6029 -19346 2216 -1444
22157a444J1647Q276l1241n833J6928K4182k0933p381R119j6675k1924K2447J9209
$$ -1444 10203 18479 -12762 -18595 -1667 22515 1582 -5799 3320 -13355 -35279 -12832 6377
22144F377j8432k8297l724l801K924J2974J277J1504k0894j6804J5910r665p663
$$ 6377 -12055 -40352 -44076 -47877 -44953 -31979 -30702 -19198 -40092 -56896 -40986 -50651 -58314
22131e8314n527n391m189J1271J5020L7070K303j8862m600j0474P365j1153k0331
$$ -58314 -63841 -69232 -73421 -62150 -47130 -10060 -7757 -26619 -31219 -41693 -34328 -45481 -65812
22118f5812l761k795Q080M124Q373J1638J9592l7165j0129R164j960J1413L1532
$$ -65812 -69573 -72368 -64288 -60164 -51791 -40153 -20561 -57726 -67855 -58691 -60651 -49238 -17706
22105a7706J0618j8595R276o900o698j4111M561J5861N887J1574n248N654j7739
$$ -17706 -7088 -25683 -16407 -23307 -30005 -44116 -39555 -23694 -17807 -6233 -11481 -5827 -23566
22092b3566k9038k2542J9011P827J7823K8567J7768L620L2990k7k3863j2691j054
$$ -23566 -52604 -75146 -56135 -48308 -30485 -1918 15850 19470 52460 52433 28570 15879 14825
22079A4825k658k532O455k2312j0500K7172J8578k6069j6536k93j8089j6324K76
$$ 14825 12167 9635 16090 -6222 -16722 10450 29028 2959 -13577 -13870 -31959 -48283 -48007
22066d8007J2150K5633J7264j267J1092k1925j8201l736K924J6394l013m3645
$$ -48007 -35857 -10224 7040 5773 16865 -5060 -23261 -26997 -24073 -7679 -10692 -54337
22054e4337J126L1320P21K194q894J7758L9596O220j1098j9596k8679j4113J9066
$$ -54337 -53211 -21891 -21170 -18976 -27870 -10112 29484 35704 24606 5010 -23669 -37782 -18716
22041a8716M500J167J3658K9763k898k1802p591k2233n636J0316o475M13p770
$$ -18716 -14216 -13049 609 30372 27474 5672 -1919 -24152 -29788 -19472 -25947 -25534 -33304
22028c3304j1798J0426K3735J6149K047Q742K2853k6971k4162j6250r040K0399
$$ -33304 -45102 -34676 -10941 5208 7255 15997 38850 11879 -12283 -28533 -37573 -17174
22016a7174J5257J0729j737k1524K9224O063n625j8826l5927q462p797j8948J4913
$$ -17174 -1917 8812 7075 -14449 14775 20838 15213 -3613 -39540 -48002 -55799 -74747 -59834
22003e9834L4720K1376L457n823r380N043K2619j3838j4500j7078j4719n371o861
$$ -59834 -25114 -3738 -281 -6104 -15484 -10441 12178 -1660 -16160 -33238 -47957 -53328 -60189
21990f0189l808K1477L6192K0526k7896J4532P686K9315l622l2025j8035j2277
$$ -60189 -63997 -42520 -6328 14198 -13698 834 8520 37835 34213 2188 -15847 -28124
21978b8124J0139K5067J8027p550j6644j6871j2259L514J2206j2827k3691K2317
$$ -28124 -17985 7082 25109 17559 915 -15956 -28215 -24701 -12495 -25322 -49013 -26696
21966b6696K4862R68j9651k4618Q828j6591o255J6569K0019N229J3981N533J0552
$$ -26696 -1834 -866 -20517 -45135 -36307 -52898 -59153 -42584 -22565 -17336 -3355 2178 12730
21953A2730J4983k6880k6193J0322j185L813J8373m99k9272k573K6312j3617l6799
$$ 12730 27713 833 -25360 -15038 -16223 -12410 5963 5464 -23808 -26381 -69 -13686 -50485
21940e0485j1696l538P242J0619J4638l894K1211J9608J0689k5844k1221L344
$$ -50485 -62181 -65719 -58477 -47858 -33220 -37114 -15903 3705 14394 -11450 -32671 -29327
21928b9327P494Q735J5539P145q253J7906k6866k5482N603J8272Q385J4970N842
$$ -29327 -21833 -13098 2441 9586 1333 19239 -7627 -33109 -27506 -9234 -849 14121 19963
21915A9963R753m453q926j4067P414j8482P723K2201K0243j0761j0289k391j1056
$$ 19963 29716 25263 16337 2270 9684 -8798 -1075 21126 41369 30608 20319 17928 6872
21902F872k0707j3827O299R365K107J505o378j9056j9470M854L4804L813k62j3378
$$ 6872 -13835 -27662 -21363 -11998 -9891 -8386 -14764 -33820 -53290 -48436 -13632 -9819 -10081 -23459
21888b3459P126N147k845J2405q924P870N971K032J2222j4046J3838r955p402
$$ -23459 -16333 -11186 -14031 -1626 -10550 -2680 3291 5323 17545 3499 17337 7382 -20
21875b0K760j8410j0229k2339j4881R537L5859J5601J4920L3662j0378k2951l2649
$$ -20 2740 -15670 -25899 -48238 -63119 -53582 -17723 -2122 12798 46460 36082 13131 -19518
21862a9518j8880L662L3381N070j6666l5244O784J4944j8468K2308L2288k4868
$$ -19518 -38398 -34736 -1355 3715 -12951 -48195 -41411 -26467 -44935 -22627 9661 -15207
21850a5207m4301l2928R905K9497O126N919L8704L0954k4797R64p276k7723j787
$$ -15207 -59508 -92436 -82531 -53034 -46908 -40989 -2285 28669 3872 4836 -2440 -30163 -31950
21837c1950J3663K617L8670O4148n519m4166j3525n673m0224r254J2740N2204
$$ -31950 -18287 -15670 23000 87148 81629 37463 23938 18265 -21959 -31213 -18473 33731
21825C3731J733m4766P720p135L756o428k107K1075j6014j5205N115L018K5902
$$ 33731 35464 -9302 -1582 -8717 -4961 -11389 -13496 7579 -8435 -23640 -18525 -15507 10395
21812A0395K4495r086j8705K6615m359j7711J9105J0232j3754J724J9831k5619
$$ 10395 34890 25804 7099 33714 29355 11644 30749 40981 27227 28951 48782 23163
21800B3163k4978k4268j2342J5110J4801j4405J9976J280o577q084j7133Q571
$$ 23163 -1815 -26083 -38425 -23315 -8514 -22919 -2943 -1663 -8240 -16324 -33457 -24886
21788b4886R401L105J7002K5179l970P880k368k6976k980k3104r056P220K7715
$$ -24886 -15485 -12380 4622 29801 25831 33711 31343 4367 1387 -21717 -30773 -23553 4162
21775D162K1119J3256j1458P714J2843n4230n72L1507M345j6117l8767J8131J9074
$$ 4162 25281 38537 27079 34793 47636 -6594 -7166 24341 28686 12569 -26198 -8067 11007
21762A1007j1111p6o612p170J9549K4073j729K715k473K0474k1875N018k0141
$$ 11007 -104 -180 -6792 -13962 5587 29660 27931 30646 28173 48647 26772 31790 11649
21749A1649l0806J9570J6094K733r733m404k0210q115K5319K2848m3937l0340
$$ 11649 -19157 413 16507 19240 9507 5103 -15107 -23222 2097 24945 -18992 -49332
21737d9332M467K8986J5647L538j1903j6191j1003N452m72K592Q706R554K8491
$$ -49332 -44865 -15879 -232 3306 -8597 -24788 -35791 -30339 -30811 -28219 -19513 -9959 18532
21724A8532R299j8434J3274J0325k6271k0687k662q863J1967J5501P985J8105
$$ 18532 27831 9397 22671 32996 6725 -13962 -16624 -25487 -13520 1981 9966 28071
21712B8071K0417j1369j3028j6876Q425k0371j0783k8103m7205n024K2496K5210
$$ 28071 48488 37119 24091 7215 15640 -4731 -15514 -43617 -90822 -95846 -73350 -48140
21700d8140M8072J1817n5P236k3427j013q338o439k5156L7869k034o546k1422
$$ -48140 -68 11749 11694 18930 -4497 -5510 -13848 -20287 -45443 -7574 -9608 -16154 -37576
21687c7576K472L7513J3298k5815o734P160n095l2475r068J0331q707K0203k2962
$$ -37576 -35104 2409 15707 -10108 -16842 -9682 -14777 -47252 -56320 -45989 -54696 -34493 -57455
21674e7455m713K9076J0078j4205j2050l772m178p479Q564J9390R246K0090K393
$$ -57455 -62168 -33092 -23014 -37219 -49269 -53041 -57219 -64698 -56134 -36744 -27498 -7408 -5015
21661e015j5313k6729J4262j751J199N525M5223J3504j7927j6249l799j2047m300
$$ -5015 -20328 -47057 -32795 -34546 -33347 -27822 17401 30905 12978 -3271 -7070 -19117 -23417
21648b3417K245l098j442n046K633K470j678K3068R205m3673l864J8365K441l114
$$ -23417 -21172 -24270 -25712 -30758 -28125 -25655 -27333 -4265 4940 -38733 -42597 -24232 -21791 -24905
21634b4905L116o266j7873J0372k1964k2240K638m622M2445K2381J7879J3666
$$ -24905 -21789 -28055 -45928 -35556 -57520 -79760 -77122 -81744 -39299 -16918 961 14627
21622A4627j8933j0159j1837J1425R426k7022j0020q369j779L6568K8594o631
$$ 14627 -4306 -14465 -26302 -14877 -5451 -32473 -42493 -50862 -52641 -16073 12521 5890
21610E890j4694o228M934j6404l1321n63K8350j0409J8004j7649J242J838mJ8698
$$ 5890 -8804 -15032 -10098 -26502 -57823 -58386 -30036 -40445 -22441 -40090 -38848 -37010 -37014 -18316
21596a8316J9223L0952J018L975j5772k7924p279J401J535j6911k795n61p67K2105
$$ -18316 907 31859 32877 36852 21080 -6844 -14123 -12722 -11187 -28098 -30893 -31454 -32221 -10116
21582a0116k446k9750K303J4274P537N796K4480m030j2993o110M753j4880M356
$$ -10116 -12562 -42312 -40009 -25735 -18198 -12402 12078 8048 -4945 -11055 -6302 -21182 -16826
21569a6826J9577l489j2175j061p478q493J8873P27j1719q290N773N430j0744
$$ -16826 2751 -738 -12913 -13974 -21452 -29945 -11072 -10345 -22064 -30354 -24581 -19151 -29895
21556b9895J2448p662M63p795k0954k0128J9715K5544k905J5301k946m812O316
$$ -29895 -17447 -25109 -24646 -32441 -53395 -73523 -53808 -28264 -31169 -15868 -18814 -23626 -17310
21543a7310q10j679p811o100r212N446n394J6100J1087J3110k2736j2259K1684
$$ -17310 -18120 -19799 -27610 -33710 -42922 -37476 -42870 -26770 -15683 -2573 -25309 -37568 -15884
21530a5884M2530K5082l423Q624m43q45j6672l1948k7180J717j631j8687K8596
$$ -15884 26646 51728 48305 56929 56486 55641 38969 7021 -20159 -18442 -20073 -38760 -10164
21517a0164J9854m5391q191J6040J5982J1909N822J2417J5998j972k4069j4928
$$ -10164 9690 -35701 -43892 -27852 -11870 39 5861 18278 34276 32304 8235 -6693
21505f693J592l1376p57L8382p98l109m960K7230L0442j095k5599k0070M316j7209
$$ -6693 -5101 -36477 -37234 1148 350 -2759 -7719 19511 49953 48858 23259 3189 7505 -9704
21491i704p930k2433j6957J0199J4236j5320K1913K4576q268J3818o599j1889
$$ -9704 -17634 -40067 -57024 -46825 -32589 -47909 -25996 -1420 -9688 4130 -2469 -14358
21479a4358j9155j1211P765K7443r044j0292k2221K9870J9160R345K6119k699
$$ -14358 -33513 -44724 -36959 -9516 -18560 -28852 -51073 -21203 -2043 7302 33421 30722
21467C0722l1189q863L707j5245n411l3110j1580m88N077K9442J6986l34r4r0
$$ 30722 -467 -9330 -5623 -20868 -26279 -59389 -70969 -71457 -66380 -36938 -19952 -20286 -20380 -20470
21453b0470K7741N360l4587k8199j4110R958J7690J316K407J438J1499J1762j6289
$$ -20470 7271 12631 -21956 -50155 -64265 -54307 -36617 -35301 -32894 -31456 -19957 -8195 -24484
21440b4484J1346J0511p570j3759P818L2327n887l1714J7006n051N000J7547j12
$$ -24484 -13138 -2627 -10197 -23956 -16138 16189 10302 -21412 -4406 -9457 -4457 13090 12978
21427A2978q813n1946m538J0j3720J0287L8552M636l5894K874K9503L970m406
$$ 12978 4165 -47781 -52319 -52309 -66029 -55742 -17190 -12554 -48448 -45574 -16071 -12101 -16507
21414a6507K1174p048m0762k8768K8692K5330J7644K67P845j5931q010k3650p716
$$ -16507 4667 -2381 -43143 -71911 -43219 -17889 -245 22 7867 -8064 -16074 -39724 -47440
21401d7440Q0k7149M102L8527l703L091j0748J2108P680J410l495m103R123J4422
$$ -47440 -47360 -74509 -70407 -31880 -35583 -32492 -43240 -31132 -23452 -22042 -25537 -29640 -20517 -6095
21387f095r975M825n731q807J6617j705j7677q07p599n867p120J6860J9196J0037
$$ -6095 -16070 -11245 -16976 -25783 -9166 -10871 -28548 -29355 -36954 -42821 -49941 -33081 -13885 -3848
21373c848j8309j0470j5012k764L5141J9034R540j1582o942q352q014o552j7334
$$ -3848 -22157 -32627 -47639 -50403 -15262 3772 13312 1730 -5212 -13564 -21578 -28130 -45464
21360d5464K0186J4838L0374K2774l3486l3755N195j7859K0492M458k0072M077
$$ -45464 -25278 -10440 19934 42708 9222 -24533 -19338 -37197 -16705 -12247 -32319 -28242
21348b8242J4987j0909K0233k8479j992K3558J9503J740q406J955m393P368n089
$$ -28242 -13255 -24164 -3931 -32410 -34402 -10844 8659 10399 1993 3948 -445 6923 1834
21335A834k1796l4640j9702K1230K3794J5316j401p58L609K210m673R223j8078
$$ 1834 -19962 -54602 -74304 -53074 -29280 -13964 -15365 -16123 -12514 -10304 -14977 -5754 -23832
21322b3832J1443J7848O663L345r365j2185m829k0927j4746Q714J9407J7102k2123
$$ -23832 -12389 5459 12122 15467 6102 -6083 -10912 -31839 -46585 -37871 -18464 -1362 -23485
21309b3485j8979M178K4333n3j5995k4532j310Q772N94J6973R470p978r840l053
$$ -23485 -42464 -38286 -13953 -14006 -30001 -54533 -55843 -47071 -46477 -29504 -20034 -28012 -37852 -40905
21295d0905k509J3679k129j125q085J7913J5489K4800k471q870M306k3465l018
$$ -40905 -43414 -29735 -31864 -32989 -41074 -23161 -7672 17128 14657 5787 10093 -13372 -16390
21282a6390N445q86n301J0505J4538J4149n537m557o109j941q904j452j7173K9874
$$ -16390 -10945 -11831 -17132 -6627 7911 22060 16523 11966 5857 3916 -4988 -6440 -23613 6261
21268F261J9633j4249l4069J5654M6099Q429k3591k8901N010M754j048J2695k5367
$$ 6261 25894 11645 -22424 -6770 39329 47758 24167 -4734 276 5030 3982 16677 -8690
21255h690j6066K3495K2448k4377J4205k3103J2135K648j9539p412j3412K2178
$$ -8690 -24756 -1261 21187 -3190 11015 -12088 47 2695 -16844 -24256 -37668 -15490
21243a5490J9516j9596P471p268j888J5891k080J446j1570k5765K3598M4132j274
$$ -15490 4026 -15570 -8099 -15367 -17255 -1364 -3444 -1998 -13568 -39333 -15735 28397 27123
21230B7123j9891l8320j595o193j9948J536J9319K0222M0365j7017l2231n2932
$$ 27123 7232 -31088 -32683 -38876 -58824 -57288 -37969 -17747 22618 5601 -26630 -79562
21218g9562M521L8709J7428J1615k7981L457L3186J1277J0388j0994r005k2264
$$ -79562 -75041 -36332 -18904 -7289 -35270 -31813 1373 12650 23038 12044 3039 -19225
21206a9225K130P183j8168j7760O268J5038K2686o256j4326p953L3894K1013j0611
$$ -19225 -17095 -9912 -28080 -45840 -39572 -24534 -1848 -8104 -22430 -30383 3511 24524 13913
21193A3913K259P250j2611J9242N706k5007R989n367j1885q662M732k0331j2024
$$ 13913 16172 23422 10811 30053 35759 10752 20741 15374 3489 -5173 -441 -20772 -32796
21180c2796J2379J2069K3198K0514R368j3159j5901n03o870K4247K6202L22j9365
$$ -32796 -20417 -8348 14850 35364 44732 31573 15672 15169 8299 32546 58748 59070 39705
21167C9705k7177r776N682l32l0287N204k3315O033J5237m150p945j0852L5508
$$ 39705 12528 2752 8434 8102 -22185 -16981 -40296 -34263 -19026 -23176 -31121 -41973 -6465
21154f465K8306R638k3949n1818j9005J9086J0042K2460k98r335K1664K3808j7909
$$ -6465 21841 31479 7530 -44288 -63293 -44207 -34165 -11705 -12003 -21338 326 24134 6225
21141F225n504J4411k5034j7324J6770L1561k702j537P281J1522J7803J19M552
$$ 6225 721 15132 -9902 -27226 -10456 21105 18403 16866 24147 35669 53472 53591 58143
21128E8143k9589m1824J4540K2666j2007j2092R987J1410j5217l2033j2999J4303
$$ 58143 28554 -13270 1270 23936 11929 -163 9824 21234 6017 -26016 -39015 -24712
21116b4712J8131j432j768Q67P797k2122M497K0548J0634l729j4342j1770J545
$$ -24712 -6581 -8013 -9781 -8914 -1117 -23239 -18742 1806 12440 8711 -5631 -17401 -15856
21103a5856j5430L733J3891K3093Q291k0561l2024O094K2883p174O333J1521J8713
$$ -15856 -31286 -27553 -13662 9431 17722 -2839 -34863 -28769 -5886 -13060 -6727 4794 23507
21090B3507J6143l4801l0689K5747J9321j7961j5016J8510L8661J0055l8024k9437
$$ 23507 39650 4849 -25840 -93 19228 1267 -13749 4761 43422 53477 15453 -13984
21078a3984k7481O91J313r529J3777K4213L852j510K904k2394o470K005J7519
$$ -13984 -41465 -40774 -39461 -48990 -35213 -11000 -7148 -8658 -5754 -28148 -34618 -32613 -15094
21065a5094N3160K6134m4094j9939P084j0353j6656P693K7320J6006j4965q678
$$ -15094 38066 64200 20106 167 7251 -3102 -19758 -12065 15255 31261 16296 7618
21053G618n542L778K1251J0737m0597k4869R449L6471N805j2905k1910L659J6605
$$ 7618 2076 5854 27105 37842 -2755 -27624 -18175 18296 24101 11196 -10714 -7055 9550
21040I550K221J1538L0566J963J6554R121k1929k5100K175j4731q747l191k522
$$ 9550 11771 23309 53875 55838 72392 81513 59584 34484 36659 21928 13181 9990 7468
21027G468j6168r635J5089J4921k1004k0328K6622L809l518P846K1914Q715R24
$$ 7468 -8700 -18335 -3246 11675 -9329 -29657 -3035 774 -2744 5102 27016 35731 36655
21014C6655J8481N598R78l8876j5591K281M185k7367l260L667J7684J7073L070
$$ 36655 55136 60734 61712 22836 7245 9526 13711 -13656 -16916 -13249 4435 21508 24578
21001B4578Q445J1770j502k2851R783K4494J0662K4009m0932l3651k3248o839
$$ 24578 33023 44793 43291 20440 30223 54717 65379 89388 48456 14805 -8443 -15282
20989a5282k2980j4933J8399R808L63k5356j3074o227R483J2959M3635K3009J5067
$$ -15282 -38262 -53195 -34796 -24988 -24625 -49981 -63055 -69282 -59799 -46840 -3205 19804 34871
20976C4871n88J7k6402P038J228K904k0330M83K8233q662K396O962j2178k8030
$$ 34871 34283 34300 7898 14936 16164 19068 -1262 -779 27454 18792 21188 28150 15972 -12058
20962a2058L22l442M499J5758O062m1689l632j879K8009p707P86J3776J002J001
$$ -12058 -11736 -15178 -10679 5079 11141 -30548 -34180 -36059 -8050 -15757 -14971 -1195 -193 808
20948H08j3531j0766j9446k437J4143O768J042J4119N416l0564J3964L0682J0709
$$ 808 -12723 -23489 -42935 -45372 -31229 -24461 -23419 -9300 -3884 -34448 -20484 10198 20907
20935B0907J4852k6413j2915J3175K1373j6463M025J0096N551J2601r924L902
$$ 20907 35759 9346 -3569 9606 30979 14516 18541 28637 34188 46789 36865 40767
20923D0767J6751o582j720j6042j3702j982K1110L998k2660J4965l242L622j0810
$$ 40767 57518 50936 49216 33174 19472 17490 38600 42598 19938 34903 31661 35283 24473
20910B4473k5376k8244J0170Q701N201J4346J0318l6538j7871K1698J0362j4700
$$ 24473 -903 -29147 -18977 -10276 -5075 9271 19589 -16949 -34820 -13122 -2760 -17460
20898a7460m367q87L4950J6655L339k0621j2873M327m279j0159K2591l549k0895
$$ -17460 -21827 -22714 12236 28891 32230 11609 -1264 3063 -1216 -11375 11216 7667 -13228
20885a3228n559N852O031L3619J7679k5546k896o625j2755L980p584j9889J0882
$$ -13228 -18787 -12935 -6904 26715 44394 18848 15952 9327 -3428 552 -7032 -26921 -16039
20872a6039J2044O479J6151l451O122l9809L3256L8008Q046k359j0348m1560k8933
$$ -16039 -3995 2484 18635 15184 21306 -18503 14753 52761 60807 58448 48100 6540 -22393
20859b2393K879K3526k2397j7532J74j8935j586K0733N649K0792o22l464p608
$$ -22393 -19514 4012 -18385 -35917 -35743 -54678 -56264 -35531 -29882 -9090 -9712 -13176 -20784
20846b0784L242k9577P337K4843p623m669K3660j380J722j0055L157R848J1239
$$ -20784 -17542 -47119 -39782 -14939 -22562 -27231 -3571 -4951 -3229 -13284 -10127 -279 10960
20833A0960J2048k1193l2031K349l6466J4845L2298K676m936M374J1437J6346
$$ 10960 23008 1815 -30216 -27867 -64333 -49488 -17190 -14514 -19450 -15076 -3639 12707
20821A2707p342k3110N901L3773n293j0735p048j4104j5455p587n875J3048L8635
$$ 12707 5365 -17745 -11844 21929 16636 5901 -1147 -15251 -30706 -38293 -44168 -31120 7515
20808G515j203j5935k0181J5330m297m521J3469M253p739M66K4690J6098J4974
$$ 7515 6312 -9623 -29804 -14474 -18771 -23292 -9823 -5570 -13309 -12843 11847 27945 42919
20795D2919N205k1697j0327j5695j5821L56j1256J1291K833j3077j5650J1240
$$ 42919 48124 26427 16100 405 -15416 -15060 -26316 -15025 -12192 -25269 -40919 -29679
20783b9679K8321O101L973J896m97J0635k4279m0033j6831R810L0938N010J447
$$ -29679 -1358 4743 8716 10612 10115 20750 -3529 -43562 -60393 -50583 -19645 -14635 -13188
20770a3188M459K16j399M081L435M617K512p101q522k4853K0046L3101j7347j2361
$$ -13188 -8729 -8513 -9912 -5831 -2396 2221 4733 -2368 -10890 -35743 -15697 17404 57 -12304
20756a2304l3202J0739J3825J2064J1908P363j5418J5132K1560L1473r309k2465
$$ -12304 -45506 -34767 -20942 -8878 3030 10393 -5025 10107 31667 63140 53831 31366
20744C1366j0465k3481N05q082L1504K1153k6108k0938j7031l347l404m843J2590
$$ 31366 20901 -2580 -2075 -10157 21347 42500 16392 -4546 -21577 -24924 -28328 -33171 -20581
20731b0581J338O681L1174l125l3283J6078k5185m9093O749K1163m721J4453k0459
$$ -20581 -19243 -12562 18612 15487 -17796 -1718 -26903 -75996 -69247 -48084 -52805 -38352 -58811
20718e8811j4735M3895K5336O57p503m056N505K6324l813k3348k6851j2729M0692
$$ -58811 -73546 -29651 -4315 -3658 -11161 -15217 -9712 16612 12799 -10549 -37400 -50129 -9437
20705i437J3807m34p625k5493L307J3139J3766M800P936Q653K5j470K853k2021
$$ -9437 4370 3936 -3689 -29182 -25875 -12736 1030 5830 13766 22419 22444 20974 23827 1806
20691A806j0275R223m430J6361K415j8153o38N565p042k810k231N27N78q421q579
$$ 1806 -8469 754 -3676 12685 15100 -3053 -3691 1874 -5168 -7978 -10209 -9682 -9104 -17525 -26104
20676b6104Q861R394j9026j912J5180J6739j311K773j1088J3652j521J5624K630
$$ -26104 -17243 -7849 -26875 -28787 -13607 3132 1821 4594 -6494 7158 5637 21261 23891
20663B3891l7754l310K2265j4305j9897j6407J5146K4193M006k1104j320J4754
$$ 23891 -13863 -17173 5092 -9213 -29110 -45517 -30371 -6178 -2172 -23276 -24596 -9842
20651i842J2718j1729O559o295J4766L5985k0678j0213Q024j8429j1185J4976
$$ -9842 2876 -8853 -2294 -8589 6177 42162 21484 11271 19295 866 -10319 4657
20639D657R767j6243M309j2483r879l021j6484M194L2139l930r335K0483R277
$$ 4657 14424 -1819 2490 -9993 -19872 -22893 -39377 -35183 -3044 -6974 -16309 4174 13451
20626A3451o71M290l678k5236l9269j3524K3691J1280r432J1045L7357J102j9903
$$ 13451 12780 17070 13392 -11844 -51113 -64637 -40946 -29666 -39098 -28053 9304 10406 -9497
20613i497o790J6056K1868R012l99k4920j9994P204J0338q398j8134n820P253
$$ -9497 -16287 -231 21637 30649 30250 5330 -14664 -7460 2878 -5520 -23654 -29474 -22221
20600b2221j3151n123j364L2078K3505N535K277L092j5385m098J3525J1467o822
$$ -22221 -35372 -40495 -41859 -9781 13724 19259 21536 24628 9243 5145 18670 30137 23315
20587B3315k392k6552l3545j5519R480J8238R525j705L8834K1210j257j6925O655
$$ 23315 20923 -5629 -39174 -54693 -45213 -26975 -17450 -19155 19679 40889 39632 22707 29362
20574B9362k1864N910J7180j7905j9440J4473J5729K3538l520r887j4330k1944
$$ 29362 7498 13408 30588 12683 -6757 7716 23445 46983 43463 33576 19246 -2698
20562b698k5217K1632J3880j471j6876k7388k8594k74r67L5716J7618K6191n281
$$ -2698 -27915 -6283 7597 6126 -10750 -38138 -66732 -67006 -67973 -32257 -14639 11552 6271
20549F271k9620K2089L4812P325J5514j4512n1314j1731l081n866J0818K271N266
$$ 6271 -23349 -1260 33552 40877 56391 41879 -9435 -21166 -24247 -30113 -19295 -17024 -11758
20536a1758L2910J0192j3432J9546l533l9819N66J3555M4899K8255r074q134j9137
$$ -11758 21152 31344 17912 37458 33925 -5894 -5328 8227 53126 81381 72307 64173 45036
20523D5036n2583k756q57J7075q785k879r996J5479k9596j9195K3007N192j4215
$$ 45036 -7547 -10303 -11160 5915 -2870 -5749 -15745 -266 -29862 -49057 -26050 -20858 -35073
20510c5073j2706j287K9396K0397K0020M0842L438p076J1613P016l3671k1132
$$ -35073 -47779 -49066 -19670 727 20747 61589 65027 57951 69564 76580 42909 21777
20498B1777l865M774k3216n703l787j070K4354K5621k7648n4620K0362M2370j407
$$ 21777 17912 22686 -530 -6233 -10020 -11090 13264 38885 11237 -43383 -23021 19349 17942
20485A7942k0404K9449m1j975k8079o541K7590J4243Q996q08K408j5346k6380
$$ 17942 -2462 26987 26946 24971 -3108 -9649 17941 32184 41180 40372 42780 27434 1054
20472A054j3118J1179j3335j1829o359K2133R035l05J6240J6190j3054m1537O967
$$ 1054 -12064 -885 -14220 -26049 -32408 -10275 -1240 -1545 14695 30885 17831 -23706 -16739
20459a6739J6244o18R773m563J891J787j3914P103j3119m89J7025J847j0551J1888
$$ -16739 -495 -1113 8660 4097 5988 7775 -6139 964 -12155 -12644 4381 6228 -4323 7565
20445G565o77j37k919k850m801l2588j530K1490J9477J5530Q419q717l2375J986
$$ 7565 6888 6751 3832 982 -3819 -36407 -37937 -16447 3030 18560 26979 18262 -14113 -12127
20431a2127L9087P737k7445j0647K2722r186j5060K861n564J6123j453o738k1354
$$ -12127 26960 34697 7252 -3395 19327 10141 -4919 -2058 -7622 8501 7048 310 -21044
20418b1044j8358Q357J2580N540Q088J4123j0044O733o722J6712l435k1058J0659
$$ -21044 -39402 -31045 -18465 -12925 -4837 9286 -758 5975 -747 15965 12530 -8528 2131
20405B131M115K970l361J9143l5j4197K082q415j3626q391l268J5513Q024l277
$$ 2131 6246 9216 5855 24998 24963 10766 12848 4433 -9193 -17584 -20852 -5339 2685 -592
20391e92j136j2547j803J4760O147K6239r656k6682m424q105Q69P471j4397J0192
$$ -592 -1728 -14275 -16078 -1318 4829 31068 21412 -5270 -9694 -17799 -16930 -9459 -23856 -13664
20377a3664K0432K2727m090l3055Q360L742m4864P727K7350l203r541J9107j9849
$$ -13664 6768 29495 25405 -7650 710 4452 -40412 -32685 -5335 -8538 -18079 1028 -18821
20364a8821j6696k156J9830J5668O499k3672o47j557p548K622k2221J3222P268
$$ -18821 -35517 -37673 -17843 -2175 4324 -19348 -19995 -21552 -29100 -26478 -48699 -35477 -28209
20351b8209j7201J7545K7964q633O702K1556J6639j0408J7341j4296n507j0513
$$ -28209 -45410 -27865 99 -8534 -1832 19724 36363 25955 43296 29000 23493 12980
20339A2980j3288m177J2180r706k23N448k987Q183O254o84J768O520j8773J0042
$$ 12980 -308 -4485 7695 -2011 -2234 3214 227 8410 14664 13980 15748 22268 3495 13537
20325A3537j7336r270K961K532L0123K5423j6290R715k7435j2380J5047j5621
$$ 13537 -3799 -13069 -10108 -7576 22547 47970 31680 41395 13960 1580 16627 1006
20313A006J5305o35k0357J3842Q076K997p096K3853m573m1778q229q624J0982
$$ 1006 16311 15676 -4681 9161 17237 20234 13138 36991 32418 -9360 -17589 -26213 -15231
20300a5231K414K0986j9169K44L718J5883L3987J0346j374m4779k0543j2839K7012
$$ -15231 -12817 8169 -11000 -10756 -7038 8845 42832 53178 51804 7025 -13518 -26357 655
20287F55J6802m889r972l0838P364O657J0703j572K783P501l270l429o041R943
$$ 655 17457 12568 2596 -28242 -20878 -14221 -3518 -5090 -2307 5194 1924 -1505 -7546 2397
20273B397J4444K9625K0420q500n1774L96J8466J119K317j9906j0059k8671J124
$$ 2397 16841 46466 66886 58386 6612 7008 25474 26593 28910 9004 -1055 -29726 -28602
20260b8602J5033j4009j1666K4296J4120o365l693j5840r771r491J0041K3586
$$ -28602 -13569 -27578 -39244 -14948 -828 -7193 -10886 -26726 -36497 -45988 -35947 -12361
20248a2361J2389N36o541K1585K393M1693L5843j3609j5822k1559P013K102p281
$$ -12361 28 564 -5977 15608 18001 59694 95537 81928 66106 44547 51560 53662 46381
20235D6381j5083m7825q741k165m78J4678O223n079J8376J9790j3154l5454M191
$$ 46381 31298 -16527 -25268 -27433 -27911 -13233 -7010 -12089 6287 26077 12923 -22531 -18340
20222a8340K4267L274j7254O858K3067J1158K1596k1329m0503J241K8649P765
$$ -18340 5927 9201 -8053 -1195 21872 33030 54626 33297 -7206 -5965 22684 30449
20210C0449k673k8410n257J0183O310Q612j0367q362o622R275J1590Q195j1930
$$ 30449 27776 -634 -5891 4292 10602 19214 8847 485 -6137 3138 14728 22923 10993
20197A0993K9016J8052j758k2064K715Q795L929j6541j2145j9018p490J1962K4645
$$ 10993 40009 58061 56303 34239 36954 45749 49678 33137 20992 1974 -5516 6446 31091
20184C1091K8547p567k8280J0374J1292K4486k5234k9829n723R642K0885j1583
$$ 31091 59638 52071 23791 34165 45457 69943 44709 14880 9157 18799 39684 28101
20172B8101j047m95O333p68k4990j840M1266J2256k3431K0785k1558j5884k0426
$$ 28101 27054 26559 32892 32124 7134 5294 46560 58816 35385 56170 34612 18728 -1698
20159a698J339J2913j7560J4924J1795k8222J5198k7676J0936R252K2332O785
$$ -1698 -359 12554 -5006 9918 21713 -6509 8689 -18987 -8051 1201 23533 30318
20147C0318Q099k1475Q753J5289Q896j0345N744r789J2794k62p098j7239K4258
$$ 30318 38417 16942 25695 40984 49880 39535 45279 35490 48284 48022 40924 23685 47943
20134D7943K8179p846k2901K069J2072j7469J2597P568k3194k8239k618K5955
$$ 47943 76122 68276 45375 47444 59516 42047 54644 62212 39018 10779 8161 34116
20122C4116L4880P357j4962k4642l654J0055o397k0222o104R560p462J1021M111
$$ 34116 68996 76353 61391 36749 33095 43150 36753 16531 10427 19987 12525 23546 27657
20109B7657M573j3928k4984m478K6843M056j0681J1652k9125j1236M388M426L141
$$ 27657 32230 18302 -6682 -11160 15683 19739 9058 20710 -8415 -19651 -15263 -10837 -7696
20096g696j711J3677L742J0324J168j6579n809j6433Q937J1873J4610K0350j3231
$$ -7696 -9407 4270 8012 18336 19504 2925 -2884 -19317 -10380 1493 16103 36453 23222
20083B3222j8184j1250J2111K3866R81o531P110p672R476p167J5230K3198L831
$$ 23222 5038 -6212 5899 29765 30746 24215 31325 23653 33129 25962 41192 64390 68221
20070F8221Q74J981j8215j9672j923K1644K057j8272j02k0292k3328j490M166
$$ 68221 69095 71076 52861 33189 31266 52910 54967 36695 36593 16301 -7027 -8517 -4351
20057d351J6853m206J1058o409Q572j7082M306L578J4113K7826O096j4788j8335
$$ -4351 12502 8296 19354 12945 21517 4435 8741 12319 26432 54258 60354 45566 27231
20044B7231k4787n399J3602J7751J8992n610j3447j8995N300j4232l708j1243
$$ 27231 2444 -2955 10647 28398 47390 41780 28333 9338 14638 406 -3302 -14545
20032a4545j1780L2849M2689j2801J864r550k4553j1230j1312m168j4107o32J5338
$$ -14545 -26325 6524 49213 36412 38276 28726 4173 -7057 -18369 -22537 -36644 -37276 -21938
20019b1938o242R93n383J1137J5322K0329P226n089J2195J0608m2951l8056M035
$$ -21938 -28180 -27187 -32570 -21433 -6111 14218 21444 16355 28550 39158 -3793 -41849 -37814
20006c7814L7694K4335J0292j2669j3742j3042J075N690M109J9278l568j255J299
$$ -37814 -120 24215 34507 21838 8096 -4946 -3871 1819 5928 25206 21638 20383 21682
19993B1682K4626o400k8692j0322J3485k1599K8886K615j0562J860O022k9097
$$ 21682 46308 39908 11216 894 14379 -7220 21666 24281 13719 15579 21601 -7496
19981g496K6909K2933J3059n551R593M759j1545j406j5826k3961n260J3744K6500
$$ -7496 19413 42346 55405 49854 59447 64206 52661 51255 35429 11468 6208 19952 46452
19968D6452n207q611J2100L42m787k5977j404K6204L4553K843L866k1102k2782
$$ 46452 41245 32634 44734 45076 40289 14312 12908 39112 73665 76508 80374 59272 36490
19955C6490k0646p814j8343k3817m99M3994L2774j1171j0222j1117Q608J915r24
$$ 36490 15844 8030 -10313 -34130 -34629 9365 42139 30968 20746 9629 18237 20152 19228
19942A9228j4030K3102R592k5333q050j0042J319J5334Q916j165j5892m033m995
$$ 19228 5198 28300 37892 12559 4509 -5533 -4214 11120 20036 18871 2979 -1054 -6049
19929f049M739j0714K514J8166L6915K2645j2221j563l1973l0497K3551J1922
$$ -6049 -1310 -12024 -9510 8656 45571 68216 55995 54432 22459 -8038 15513 27435
19917B7435n396l788J5787J6131J8523n80j7018j1225p872N344R674k8372J2448
$$ 27435 22039 18251 34038 50169 68692 68112 51094 39869 31997 37341 47015 18643 31091
19904C1091j0671J4733L746j2600p40L6247Q844L0516j3895k2931O037K5364j5704
$$ 31091 20420 35153 38899 26299 25559 61806 70650 101166 87271 64340 70377 95741 80037
19891H0037l0716k4505N85K6177K1622l4391p65n187n704K687J517J0300q222
$$ 80037 49321 24816 25401 51578 73200 38809 38044 32857 27153 29840 31357 41657 33435
19878C3435O161n259k3506O167j0953l9012k1766j0243N6053K2163M322K0921
$$ 33435 39596 34337 10831 16998 6045 -32967 -54733 -64976 -8923 13240 17562 38483
19866C8483L3982J9985P701o047J636K9517K3876q41N090R668k3245m2647k6126
$$ 38483 72465 92450 100151 94104 95740 125257 149133 148292 153382 163050 139805 97158 71032
19853G1032J5716N075P353J2047J4869P700j4394j5320O393J6871q762k8060m312
$$ 71032 86748 91823 99176 111223 126092 133792 119398 104078 110471 127342 118580 90520 86208
19840H6208j0489j6547j7810k3955R529p309L056k2897Q383J6369L391J5003L104
$$ 86208 75719 59172 41362 17407 26936 19627 22683 -214 8169 24538 27929 42932 46036
19827D6036J795N334J3973J2100O221P869j0064m5644l0813j9412O395L3507m672
$$ 46036 47831 53165 67138 79238 85459 93328 83264 37620 6807 -12605 -6210 27297 22625
19814B2625j116J5077J1891L9205K283k0400j5691N835J84L2996L5146j8908l1298
$$ 22625 21509 36586 48477 87682 89965 69565 53874 59709 59893 92889 128035 109127 77829
19801G7829k5428j0952k3557k4612q997K3412K1108K7851M950j8048j2654J1984
$$ 77829 52401 41449 17892 -6720 -15717 7695 28803 56654 61604 43556 30902 42886
19789D2886n576L96J7426J3134Q251q215j664L6692j5296k8146p318k4858k6243
$$ 42886 37310 37706 55132 68266 76517 68302 66638 103330 88034 59888 52570 27712 1469
19776A469K4983P812n039r404k431K3704J5334j1567J7099k579n657j1489j1745
$$ 1469 26452 34264 29225 19821 17390 41094 56428 44861 61960 59381 53724 42235 30490
19763C0490l838K1441N855K9687K1865k4517k0687J877K651l0955q5j1826q641
$$ 30490 26652 48093 53948 83635 105500 80983 60296 62173 64824 33869 33784 21958 13317
19750A3317J5030K4758L140M394k1627M537M916j2226n187n902j5526o124O892
$$ 13317 28347 53105 56245 60639 39012 43549 48465 36239 31052 25150 9624 3500 10392
19737A0392J2009J6648K5996j473j1388j1601j3153p331j1977j1471l72K7375
$$ 10392 22401 39049 65045 63572 52184 40583 27430 20099 8122 -3349 -3721 23654
19725B3654J1789j778J5775q386j511n8K980O305O329k0083R84J5091j067n032
$$ 23654 35443 33665 49440 41054 39543 39485 42465 48770 55099 35016 36000 51091 50024 44992
19711D4992J349k314m275q756J0310P0l3229J4108n100j4794j647R051L133L5607
$$ 44992 46341 44027 39752 30996 41306 41376 8147 22255 17155 2361 714 9765 12898 48505
19697D8505K3263k9488m911J7413M24j6926O766P741K328L1999k243m6744k0196
$$ 48505 71768 42280 37369 54782 55206 38280 45046 52787 55115 87114 84871 38127 17931
19684A7931j3795J6586L941J0419K5178Q375j8065R013P104k4617j5045K8287
$$ 17931 4136 20722 24663 35082 60260 68635 50570 59583 66687 42070 27025 55312
19672E5312K8944K1161j6750j9249j9953j2521n893r527j6969P762J1025J1541
$$ 55312 84256 105417 88667 69418 49465 36944 31051 21524 4555 12317 23342 34883
19660C4883P837j906j0877j2456J0489L3353J8358O795q376k0462K7267P546o538
$$ 34883 42720 40814 29937 17481 27970 61323 79681 86476 78100 57638 84905 92451 85913
19647H5913j3756j7201k4660K5037K4876k7660K1124L219k8409l174O712j0961
$$ 85913 72157 54956 30296 55333 80209 52549 73673 76892 48483 45309 52021 41060
19635D1060J139M924J3525j1413M0265L7521l8688o074j0806k5698j1389L055
$$ 41060 42199 47123 60648 49235 89500 127021 88333 82259 71453 45755 34366 37421
19623C7421J6225j5149L780L1018P182j6040o072m459P412j1178J270J9715K6062
$$ 37421 53646 38497 42277 73295 80477 64437 58365 53906 61318 50140 51410 71125 97187
19610I7187Q322k2181j1147K6730J7760N236R59l6462m0974j4783J1400P701q276
$$ 97187 105509 83328 72181 98911 116671 121907 122866 86404 45430 30647 42047 49748 41472
19597D1472j937j1412J4179M4750P521p715Q330j6991j1440j7611k9035k2099
$$ 41472 39535 28123 42302 87052 94573 86858 95188 78197 66757 49146 20111 -1988
19585a988l236N826j0757O6j0830k0618J9188K6961J8467M671P161J1948K8712
$$ -1988 -5224 602 -10155 -10089 -20919 -41537 -22349 4612 23079 27750 34911 46859 75571
19572G5571J2189j7601q884K1598K4897m680j9840j1016j8398j6257j3678L3123
$$ 75571 87760 70159 61275 82873 107770 103090 83250 72234 53836 37579 23901 57024
19560E7024J8589k1185j5679J951J2048J2700Q439l9435j3233J0043K1382j550
$$ 57024 75613 54428 38749 40700 52748 65448 73887 34452 21219 31262 52644 51094
19548E1094J9707q974j9394O633J7315J964j7238M694r004K2995O70j1473J4053
$$ 51094 70801 61827 42433 49066 66381 68345 51107 55801 46797 69792 70462 58989 73042
19535G3042N518j0498K093p866p086K2509O672j2457l895j2388k4850J6274L1667
$$ 73042 78560 68062 70155 62289 55203 77712 84384 71927 68032 55644 30794 47068 78735
19522G8735M878r002L548M498j0916J6873l4614k0743j66M4641L3281r003j2246
$$ 78735 83613 74611 78159 82657 71741 88614 54000 33257 33091 77732 111013 102010 89764
19509H9764k7607k2453k1615K0238N0739p915l9298N570J5439J7439j2221Q651
$$ 89764 62157 39704 18089 38327 89066 81151 41853 47423 62862 80301 68080 76731
19497G6731K6801j1810k8473k5881j3111J6380J6386L0763J4048l371j6953J196
$$ 76731 103532 91722 63249 37368 24257 40637 57023 87786 101834 98463 81510 82706
19485H2706K0449K5025J5435k3914J2767J7007k9354j0269K0657o075j741j9176
$$ 82706 103155 128180 143615 119701 132468 149475 120121 109852 130509 124434 122693 103517
19473A03517r440J5297l8422r414K199p15q757J1475l55K1827k39P72k3895p477
$$ 103517 94077 109374 70952 61538 63737 63022 54265 65740 65385 87212 86973 87745 63850 56373
19459E6373J9666J064P507J2370r110M866Q614J1949J4993K9722n11J1125k1784
$$ 56373 76039 77103 84610 96980 87870 92736 101350 113299 128292 158014 157503 168628 146844
19446A46844l5065j7876l5855j5494K8657M1767l999j4266k523J136L420J9798
$$ 146844 111779 93903 58048 42554 71211 112978 108979 94713 92190 93326 96746 116544
19434A16544R391L85M000J0041K4990k6224m2700j854j790j2189J403K7780L3758
$$ 116544 125935 126320 130320 140361 165351 139127 96427 94573 92783 80594 81997 109777 143535
19421A43535o161l5701K134K4041K5595j185J3148K9098j2599l5951k3287J606
$$ 143535 137374 101673 103807 127848 153443 152258 165406 194504 181905 145954 122667 124273
19409A24273L0081J2437k586J3034q728L0917j7767j8792j3808k0272p073n27
$$ 124273 154354 166791 164205 177239 168511 199428 181661 162869 149061 128789 121716 121189
19397A21189P050L387k026j828j3204p908P814j2181n073K8742M7287L3317j9046
$$ 121189 128239 131626 129600 127772 114568 106660 114474 102293 97220 125962 173249 206566 187520
19384A87520N792J1412J1721j0487J4033k101J1200L591k1026K5712L5983K751
$$ 187520 193312 204724 216445 205958 219991 217890 229090 232681 211655 237367 273350 276101
19372B76101J8085K0873P0595P6448R7147J33864J83255K92232L72660L78670
$$ 276101 294186 315059 385654 462102 559249 693113 876368 1168600 1541260 1919930
19362A919930K92522J59884k0505k12261l12611l53802l01179j57283m8773N7626
$$ 1919930 2212452 2372336 2351831 2139570 1826959 1473157 1171978 1014695 965922 1023548
19352A023548J82260K75013L36237L48296K80819J52461m6857k43859l66661l71192
$$ 1023548 1205808 1480821 1817058 2165354 2446173 2598634 2551777 2307918 1941257 1570065
19342A570065l30363j96742j53239j43590q6518n2490m8129k3954l83l1394q910
$$ 1570065 1239702 1042960 889721 746131 659613 607123 558994 535040 534657 503263 494353
19331D94353J5187j2452m5881m4523n243K9669N91p507q411j9626j3048J1552
$$ 494353 509540 497088 451207 406684 401441 431110 431701 424194 415783 396157 383109 394661
19319C94661q255J4211J2314J6750K0032l6310k6042l9636j1576k9515k5941J8867
$$ 394661 386406 400617 412931 429681 449713 413403 387361 347725 336149 306634 280693 299560
19307B99560L1761R179j0431m576P127k9438j1308o418k7856j0043k3281j1421
$$ 299560 331321 340500 330069 325493 332620 303182 291874 285456 257600 247557 224276 212855
19295B12855K0994O385q648L385k535O58L609j5617j9474J7140M855j3529K547
$$ 212855 233849 240234 231586 234971 232436 233094 236703 221086 201612 218752 223607 210078 212625
19282B12625J043J9162J5565l0769k492j6531l163j2544J622N627J1781J4524
$$ 212625 213668 232830 248395 217626 215134 198603 195440 182896 184518 190145 201926 216450
19270B16450J6819q645k5826K9356j0059j9853j6242l654j5839m424j0144N543
$$ 216450 233269 224624 198798 228154 218095 198242 182000 178346 162507 158083 147939 153482
19258A53482K785L8325J841k6977j506k4385j1387O725L1625J952k994k590J1299
$$ 153482 156267 194592 196433 169456 167950 143565 132178 138903 170528 172480 169486 166896 178195
19245A78195j725j442R68r339L77K7517N516j1k3243m0977m1676J7705J6863Q045
$$ 178195 176470 175028 175996 166657 167034 194551 200067 200056 176813 135836 94160 111865 128728 136773
19231A36773K2070K3135K4194p563l2368k1073J8236k342J5422L0950J4715l2472
$$ 136773 158843 181978 206172 198609 166241 145168 163404 161062 176484 207434 222149 189677
19219A89677l2746j0481K3511K8566L541n344q771r928K0421J1018L776l3932
$$ 189677 156931 146450 169961 198527 202068 196724 187953 178025 198446 209464 213240 179308
19207A79308q636J5222N524J7763j8660k1643o744j1411J2461n272k1029q082
$$ 179308 170672 185894 191418 209181 190521 168878 162134 150723 163184 157912 136883 128801
19195A28801N672q445L54L1803M7335K4295K5366j571K0992K9212K885o410m195
$$ 128801 134473 126028 126382 158185 205520 229815 255181 253610 274602 303814 306699 300289 296094
19182B96094j2737K5532q942l6701l5859j8002J2629M263K6522K302M484J2520
$$ 296094 283357 308889 299947 263246 227387 209385 222014 226277 252799 255101 259585 272105
19170B72105O754l3377M095j7537j3184L4513j6176j1884k518o234K0323J6041
$$ 272105 278859 245482 249577 232040 218856 253369 237193 225309 222791 216557 236880 252921
19158B52921j0532l6972l187n082K4642J9772K6888j3949k0682j5300k3632Q605
$$ 252921 242389 205417 202230 197148 221790 241562 268450 254501 233819 218519 194887 203492
19146B03492k494l797R782j6653o62J8931K0176R563M3740M4436k0066j2224r583
$$ 203492 200998 197201 206983 190330 189668 208599 228775 238338 282078 326514 306448 294224 284641
19133B84641j6551o818l4167l897J6988J1719m372L357q632l4213L3455N5596
$$ 284641 268090 261272 227105 223208 240196 251915 247543 250900 242268 208055 241510 297106
19121B97106O3295P1033J53777K51830K21396O6897p327j96664k70091j56124
$$ 297106 360401 431434 585211 837041 1058437 1125334 1118007 921343 651252 495128
19111D95128p6140p2793k1026j0542l1610P517K7000O772k8628k5828M504l053
$$ 495128 418988 346195 325169 314627 283017 290534 317534 324306 295678 269850 274354 271301
19099B71301o979J2795J6573J1937L427K708J3064N450j6196J2662L840j674K2885
$$ 271301 264322 277117 293690 305627 309054 311762 324826 330276 314080 326742 330582 328908 351793
19086C51793q611r512k1261p800o72Q36k4363k8804q010j1067J1278O938j4781
$$ 351793 343182 333670 312409 304609 303937 304773 280410 251606 243596 232529 243807 250745 235964
19073B35964j802L7324j0888k855J3116Q258K53r141j7887j1828K126K4327j1279
$$ 235964 234162 271486 260598 257743 270859 279117 279370 270229 252342 240514 242640 266967 255688
19060B55688J914k1093n301j0621l2396n960Q235k3L3970K6023R449j9878O676
$$ 255688 257602 236509 231208 220587 188191 182231 190466 190443 224413 250436 259885 240007 246683
19047B46683J3538J0760l448K0106J0869J1637j778k3299k879j0880j5334p137
$$ 246683 260221 270981 267533 287639 298508 310145 308367 285068 282189 271309 255975 248838
19035B48838J5117J5826k2590j722J067J9586K6469j046J7135J5190n703j6424
$$ 248838 263955 279781 257191 255469 256536 276122 302591 301545 318680 333870 328167 311743
19023C11743k6010O457K044K7922L9469M432j2501k6005k8846k849L069j8985
$$ 311743 285733 292190 294234 322156 361625 366057 353556 327551 298705 295856 298925 279940
19011B79940l4224l748K353L5578j347R15m647R512J2607J4775k9723L669J0338
$$ 279940 245716 241968 244321 279899 278552 279467 274820 284332 296939 311714 281991 285660 295998
18998B95998J1876J6150k2l0748j1655K2650L6812M3819K806J4115M0835N5892
$$ 295998 307874 324024 324002 293254 281599 304249 341061 384880 387686 401801 442636 498528
18986D98528M2334M1920K4589k0991j4274J8211j274N28K9330K1062J6495J5070
$$ 498528 540862 582782 607371 586380 572106 590317 589043 589571 618901 639963 656458 671528
18974F71528J7399K226j999J487J0726j5551j9805r203k8378l9728j1243j712
$$ 671528 688927 691153 689154 690641 701367 685816 666011 656808 628430 588702 577459 575747
18962E75747j4465j5825Q72j1045o067k7935j9065J5361P049n4966m0315j1975
$$ 575747 561282 545457 546329 535284 529217 501282 482217 497578 504627 449661 409346 397371
18950C97371J8048M754J7802k9156j4951J3103M6720N306k7782r767j4166M935
$$ 397371 415419 420173 437975 408819 393868 406971 453691 458997 431215 421448 407282 412217
18938D12217K0687K575P560J9908Q23k4897K297k6682r395k4321L8887K5611J1843
$$ 412217 432904 435479 443039 462947 463770 438873 441170 414488 405093 380772 419659 445270 457113
18925D57113M5965k894j1067L427K0055J10938J62535K16537K31277J69940J90927
$$ 457113 503078 500184 489117 492544 512599 623537 786072 1002609 1233886 1403826 1594753
18914A594753J48926R9498J42365J06261n0657n7180o8958j28557j35439j33379
$$ 1594753 1743679 1843177 1985542 2091803 2041146 1983966 1915008 1786451 1651012 1517633
18904A517633j80572k04314j39636o6036k5842q415n606p706j2677k6712L0445
$$ 1517633 1337061 1132747 993111 927075 901233 892818 887212 879506 866829 840117 870562
18893H70562N5711J9539q263k3141m7660l2602R599l5678m4642p418k2883J1470
$$ 870562 926273 945812 937549 914408 866748 834146 843745 808067 763425 756007 733124 744594
18881G44594N1848L0957O3451M7757K8498N3358L8405K4123l249n303j0642m1566
$$ 744594 796442 827399 890850 938607 967105 1020463 1058868 1082991 1079742 1074439 1063797 1022231
18869A022231k2440P263L2948J00069J60793K31314L27071L21517L13830L00393
$$ 1022231 999791 1007054 1040002 1140071 1300864 1532178 1859249 2180766 2494596 2794989
18859B794989K97096L04415M50335M91427M37270M52252L30503J25533j34410
$$ 2794989 3092085 3396500 3846835 4338262 4775532 5227784 5558287 5683820 5549410
18850E549410l17826n17713n86974m52373l60245k29017j23117Q8293K91867M46300
$$ 5549410 5231584 4713871 4126897 3674524 3314279 3085262 2962145 3050438 3342305 3788605
18840C788605M78064L69033J62124m5191k00195l31564m19713m04204l85512l46926
$$ 3788605 4266669 4635702 4797826 4752635 4552440 4220876 3801163 3396959 3011447 2664521
18830B664521k95063k21838k00306j40568o9584l7179L116K461L786O929j4927
$$ 2664521 2369458 2147620 1947314 1806746 1737162 1699983 1703099 1705560 1709346 1716275 1701348
18819A701348j2921j741J2958k3952j3420k095J1190J1236J1253K7989r109k6672
$$ 1701348 1688427 1686686 1699644 1675692 1662272 1660177 1671367 1682603 1693856 1721845 1712736 1686064
18807A686064r138M883k8171j4404j0484J9407J0560J5351J5590M2171K974K2219
$$ 1686064 1676926 1681809 1653638 1639234 1628750 1648157 1658717 1674068 1689658 1731829 1734803 1757022
18795A757022L4890K2279R793K3113M7241M0518O5857R2084O5116K3361O6885
$$ 1757022 1791912 1814191 1823984 1847097 1894338 1934856 2000713 2092797 2157913 2181274 2248159
18784B248159O4051N4908R0709R9634N7668M0085L8256J5641Q5427R7777Q0802
$$ 2248159 2312210 2367118 2457827 2557461 2615129 2655214 2693470 2709111 2794538 2892315 2973117
18773B973117J13117J51592J61185K18576K77214L66699M10203L79486K51438
$$ 2973117 3086234 3237826 3399011 3617587 3894801 4261500 4671703 5051189 5302627
18764E302627Q1392o0691j90800k35052k29723j03830Q4015K36800L92822O79772
$$ 5302627 5384019 5323328 5132528 4897476 4667753 4563923 4647938 4884738 5277560 5957332
18754E957332Q84652J068886J172673J087807R69888N64466K74434N3791j39223
$$ 5957332 6841984 7910870 9083543 10171350 11141238 11705704 11980138 12033929 11894706
18745A1894706n9493M6587L15460O98958J091320J605062K136211K683055L276569
$$ 11894706 11835213 11881800 12197260 12896218 13987538 15592600 17728811 20411866 23688435
18736B3688435M124205N229959O967387J0006203J5486890K5490636M1813255
$$ 23688435 27812640 33042599 40009986 50016189 65503079 90993715 132806970
18729A32806970O2275577P3046802P3532775N9012271K1949179j0005939m5953571
$$ 132806970 195082547 268129349 341662124 400674395 422623574 412617635 366664064
18722C66664064o3986279o2815338n4180433l0026968q182350J0377203L1372296
$$ 366664064 302677785 239862447 185682014 155655046 147472696 157849899 189222195
18715A89222195N4848100O7888848O9165648N6483247J9288228j3330703m9385741
$$ 189222195 244070295 311959143 381124791 437608038 456896266 443565563 394179822
18708C94179822p0103034o9854919o3442988m2287753k5168441j5978705j0994920
$$ 394179822 324076788 254221869 190778881 148491128 123322687 107343982 96349062
18701I6349062q231138o585248n523002m737455m076101l590605l058408k544424
$$ 96349062 88117924 81532676 76009674 71272219 67196118 63605513 60547105 58002681
18693E8002681k173383j801449j560771j450733j324156j226659j199476j109115
$$ 58002681 55829298 54027849 52467078 51016345 49692189 48465530 47266054 46156939
18685D6156939j128560j165542j285533j434396j592178j678295j676156j571982
$$ 46156939 45028379 43862837 42577304 41142908 39550730 37872435 36196279 34624297
18677C4624297j396294j177575j043092q82514o55579m94026l67854l30496m80057
$$ 34624297 33228003 32050428 31007336 30124822 29469243 28975217 28607363 28276867 27796810
18668B7796810o55747p78600r44630r66174r81377q81979p01751o14977n72874
$$ 27796810 27141063 26362463 25417833 24451659 23470282 22588303 21886552 21271575 20698701
18659B0698701n26372m87856m53072m32853m38588m22821l91575l92251l96189
$$ 20698701 20172329 19684473 19231401 18798548 18359960 17937139 17545564 17153313 16757124
18650A6757124l88244l75267l71805l50061l37057l63791l99474l77243l62558
$$ 16757124 16368880 15993613 15621808 15271747 14934690 14570899 14171425 13794182 13431624
18641A3431624l46183l14928l30533k86710k36156k48351k74931k83602k52381
$$ 13431624 13085441 12770513 12439980 12153270 11917114 11668763 11393832 11110230 10857849
18632A0857849k26944k43292k37215k31485k30232k37172k21980j74236j73255
$$ 10857849 10630905 10387613 10150398 9918913 9688681 9451509 9229529 9055293 8882038
18623H882038k12499j83380j56961j45933j60157j57278j07097j25993j37041
$$ 8882038 8669539 8486159 8329198 8183265 8023108 7865830 7758733 7632740 7495699
18614G495699j16375j02174r3042q6565m6467k9027l1160q40N6364J36227K52063
$$ 7495699 7379324 7277150 7184108 7097543 7051076 7022049 6990889 6990049 7046413 7182640 7434703
18603G434703L68672M03967L69924K55694J18358P946j30129k41148l12443l45494
$$ 7434703 7803375 8207342 8577266 8832960 8951318 8959264 8829135 8587987 8275544 7930050
18593G930050k67065j64314p1601L1337J29219K21745K34700J52561K3803o3341
$$ 7930050 7662985 7498671 7427070 7458407 7587626 7809371 8044071 8196632 8220435 8157094
18583H157094k54401l88689m02506m31881m29887l61561k81993k42268k16348
$$ 8157094 7902693 7514004 7111498 6679617 6249730 5888169 5606176 5363908 5147560
18574E147560j39703r1480r6073j26709j17307j13034j09768q4472r0677j00197
$$ 5147560 5007857 4916377 4820304 4693595 4576288 4463254 4353486 4269014 4178337 4078140
18564D078140r4690p7670o7858o4407n2148m1122q6459n8538j0961l2471p6605
$$ 4078140 3983450 3905780 3837922 3773515 3721367 3680245 3593786 3535248 3524287 3491816 3415211
18553C415211q7920j06453r8471o7014o2278o7194q7588p4649o1421m6456m5368
$$ 3415211 3327291 3220838 3122367 3055353 2993075 2925881 2838293 2763644 2702223 2655767 2610399
18542B610399L990p565k1756r972j9114K3425q633k8242n5696j0188j3224k5567
$$ 2610399 2614389 2606824 2585068 2575096 2555982 2579407 2570774 2542532 2486836 2476648 2463424 2437857
18530B437857J2303L6819P6749J21082J70640J90037K55723K65040K01858J92440
$$ 2437857 2450160 2486979 2563728 2684810 2855450 3045487 3301210 3566250 3768108 3960548
18520C960548K19364J54967P8286k1123q8125j15857j06359j89210k57496k93118
$$ 3960548 4179912 4334879 4413165 4392042 4303917 4188060 4081701 3892491 3634995 3341877
18510C341877k70497j98033j40369j43178j58770j30555q3362n8847j7675k4623
$$ 3341877 3071380 2873347 2732978 2589800 2431030 2300475 2217113 2158266 2140591 2115968
18500B115968n2911n4640n1772k1068l0560j6053j3419Q820J6641K3583Q034J8132
$$ 2115968 2063057 2008417 1956645 1935577 1905017 1888964 1875545 1884365 1901006 1924589 1932623 1950755
18488A950755J3500m326k899K335M535K8946J8530L415k085j2720K083J8635J4487
$$ 1950755 1964255 1959929 1957030 1959365 1963900 1992846 2011376 2014791 2012706 1999986 2002069 2020704 2035191
18475B035191M4254R0132J14548J55032K06822K83112L05552K92432K95238K72170
$$ 2035191 2079445 2169577 2284125 2439157 2645979 2929091 3234643 3527075 3822313 4094483
18465D094483K45116K00216J47223K8225m4915q5041q6426k39755l08479l08669
$$ 4094483 4339599 4539815 4687038 4715263 4670348 4585307 4498881 4259126 3950647 3641978
18455C641978k62091k23703j58609j69153j29424o7892k3656k9815k4728R407
$$ 3641978 3379887 3156184 2997575 2828422 2698998 2631106 2607450 2577635 2552907 2562314
18445B562314N4358M1524J0426M3617J2349P674K3627L2073J9767J8156J1747
$$ 2562314 2616672 2658196 2668622 2712239 2724588 2732262 2755889 2787962 2807729 2825885 2837632
18434B837632N1847M8333M6849Q3492J86519K67916K73403K40284K18533K16905
$$ 2837632 2889479 2937812 2984661 3068153 3254672 3522588 3795991 4036275 4254808 4471713
18424D471713K14794K56550K53034J57334J10533J98502J74904K00434K56080
$$ 4471713 4686507 4943057 5196091 5353425 5463958 5662460 5837364 6037798 6293878
18415F293878L22937L80978M73906O02919O87268Q02714J002374J262455J513681
$$ 6293878 6616815 6997793 7471699 8074618 8761886 9564600 10566974 11829429 13343110
18406A3343110J765245K284027L026760M119929N953087R162568J4881521K4031728
$$ 13343110 15108355 17392382 20419142 24539071 30492158 39654726 54536247 78567975
18398G8567975L4445424L4855533K6539262K6136899J9277851J4637210J7638663
$$ 78567975 113013399 147868932 174408194 200545093 219822944 234460154 252098817
18391B52098817J2878566j1377019j1438396j0935212j7286774k0979482k3340641
$$ 252098817 264977383 253600364 242161968 231226756 213939982 192960500 169619859
18384A69619859l5891848l3583959k0868136j2618931q389563n946931m374127
$$ 169619859 133728011 100144052 79275916 66656985 58267422 52320491 47946364
18377D7946364l473210k845868k370417k116460j805789j436981j226449j066041
$$ 47946364 44473154 41627286 39256869 37140409 35334620 33897639 32671190 31605149
18369C1605149r01809p48755n20874n11424m96723m10854l97974k94057j34568
$$ 31605149 30703340 29954585 29433711 28922287 28425564 28014710 27616736 27322679 27188111
18360B7188111j85133j95634k2608O2871J70587L82034N68349Q46387J202948
$$ 27188111 27002978 26807344 26784736 26847607 27018194 27400228 27968577 28814964 30017912
18351C0017912J636383K357651L340142M672886O764375J0547418J7391906K8291811
$$ 30017912 31654295 34011946 37352088 42024974 48789349 59336767 76728673 105020484
18343A05020484M0438367M0632836L1068803L0398947K2370846J6967463K0457602
$$ 105020484 145458851 186091687 217160490 247559437 269930283 286897746 307355348
18336C07355348J4270983j3897400j3557565j3041794k0508490k4930079k8079271
$$ 307355348 321626331 307728931 294171366 281129572 260621082 235691003 207611732
18329B07611732m2946216l9822209k4815600j5142735j0121572p261825n388028
$$ 207611732 164665516 124843307 100027707 84884972 74763400 67501575 62113547
18322F2113547m264336l597057l153210k912863k583340k135833j829219j567047
$$ 62113547 57849211 54252154 51098944 48186081 45602741 43466908 41637689 40070642
18314D0070642j249766j012843p76990o28941n93414o34200p38918p42604p85099
$$ 40070642 38820876 37808033 37031043 36402102 35808688 35174488 34435570 33692966 32907867
18305C2907867j009375j148045j011624r59944q70185p35015o97334o42952n27811
$$ 32907867 31898492 30750447 29738823 28778879 27908694 27173679 26476345 25833393 25305582
18296B5305582n08864n14826n53567n97800p28834q29142q34106p60297p22985
$$ 25305582 24796718 24281892 23728325 23130525 22401691 21572549 20738443 19978146 19255161
18287A9255161o44756n93310n62414m99631m05801l64136l38036l05011l05913
$$ 19255161 18610405 18017095 17454681 16955050 16549249 16185113 15847077 15542066 15236153
18278A5236153k61925j87230j94572j38596j13868p2745O4419J55269J54518J72364
$$ 15236153 14974228 14786998 14592426 14453830 14339962 14267217 14331636 14486905 14641423 14813787
18268A4813787M3479j43000k58481k90022l95588l47338l35191l20813k72398
$$ 14813787 14857266 14714266 14455785 14165763 13770175 13422837 13087646 12766833 12494435
18259A2494435j57545j06341j2565l8362o1164j95780m04069m65922m88882n14058
$$ 12494435 12336890 12230549 12217984 12179622 12118458 11922678 11518609 11052687 10563805 10049747
18249A0049747m48079l42614k81250k01967j68665j46027j48642j36172r9530
$$ 10049747 9601668 9259054 8977804 8775837 8607172 8461145 8312503 8176331 8076801
18240H076801n6748o1789p6874m7901m2895n4624j8261O081K1290M267m2473j04216
$$ 8076801 8020053 7958264 7881390 7833489 7790594 7735970 7717709 7723790 7745080 7749347 7706874 7602658
18228G602658p2442o0439o6298o0805l6448K9984P2498N4228J37396K26455K71014
$$ 7602658 7530216 7469777 7403479 7342674 7306226 7336210 7408708 7462936 7600332 7826787 8097801
18217H097801L19143L49228L67702N07420N75562O33561O38715O65867M81872
$$ 8097801 8416944 8766172 9133874 9641294 10216856 10850417 11489132 12154999 12636871
18208A2636871M01350K62135K05638J86757L27947M99097P00038Q76633R73660
$$ 12636871 13038221 13300356 13505994 13692751 14020698 14519795 15219833 16096466 17070126
18199A7070126J116935J453840J867674K398956K837375L234765L719329M600938
$$ 17070126 18187061 19640901 21508575 23907531 26744906 29979671 33699000 38299938
18191C8299938O213642R235643J4748650K4277243L8889529N4469185N9811362
$$ 38299938 44513580 53749223 68497873 92775116 131664645 186133830 245945192
18184B45945192N5481395M1520843K2183775K650659j5687324l2508146m5420023
$$ 245945192 301426587 342947430 365131205 367781864 352094540 319586394 274166371
18177B74166371m8131920l8428250j6276547O315344K8652181M9041800N6720707
$$ 274166371 226034451 187606201 171329654 177644998 206297179 255338979 312059686
18170C12059686N2486834L7029086J5315248n660518k4955332m1802304n5277342
$$ 312059686 364546520 401575606 416890854 411230336 386275004 344472700 289195358
18163B89195358n9343703n2380719l5197108k1700186j4146324r941296p498710
$$ 289195358 229851655 177470936 142273828 120573642 106427318 96486022 88987312
18156H8987312o093327n231918m606089m065498l648987l255336k960121k753584
$$ 88987312 82893985 77662067 73055978 68990480 65341493 62086157 59126036 56372452
18148E6372452k524578k306129k038843j795416j550269j373265j309814j247833
$$ 56372452 53847874 51541745 49502902 47707486 46157217 44783952 43474138 42226305
18140D2226305j193689j157818j244711j276935j258746j174872j079600j052567
$$ 42226305 41032616 39874798 38630087 37353152 36094406 34919534 33839934 32787367
18132C2787367j025027r36610q83158q30992q04967p64399p28876o74419o46473
$$ 32787367 31762340 30825730 29942572 29111580 28306613 27542214 26813338 26138919 25492446
18123B5492446o39315n90205n24714n03796m98466m70966m41590m12392l43436
$$ 25492446 24853131 24262926 23738212 23234416 22735950 22264984 21823394 21411002 21067566
18114B1067566k70981k04791o8935R8154M05069R62336J985773L944654O770174
$$ 21067566 20796585 20591794 20522859 20621013 21026082 21988418 23974191 27918845 34689019
18105C4689019Q209538L697959k35432m657824r346296o669767l655895k145227
$$ 34689019 42898557 46596516 46361084 41703260 32356964 25687197 22031302 19886075
18097A9886075j420578j008151p97225o74336n96210n16380m32001l99992l54717
$$ 19886075 18465497 17457346 16660121 15985785 15389575 14873195 14441194 14041202 13686485
18088A3686485l04618k47953j57971k2046O5833J09505N8183o4426k29154m04525
$$ 13686485 13381867 13133914 12975943 12953897 13019730 13129235 13187418 13122992 12893838 12489313
18078A2489313n17793n41571m95696l81112k41450j63226m0425R4117K06595K35942
$$ 12489313 11971520 11429949 10934253 10553141 10311691 10148465 10108040 10202157 10408752 10644694
18068A0644694K07653O0095j29886l07398l81487l56825k91507j40124O1026J41781
$$ 10644694 10852347 10912442 10782556 10475158 10093671 9736846 9445339 9305215 9366241 9508022
18058I508022J45945J04005R0201j7432j30213k32425k58363k94275k83937j42804
$$ 9508022 9653967 9757972 9848173 9830741 9700528 9468103 9209740 8915465 8631528 8488724
18048H488724o6074J0808J06940J57899J51618J28006K5093j08106k13707l30580
$$ 8488724 8422650 8433458 8540398 8698297 8849915 8977921 9003014 8894908 8681201 8350621
18038H350621l79820m61027m30737l89854l44127k49835k33625k03720j43347
$$ 8350621 7970801 7509774 7079037 6689183 6345056 6095221 5861596 5657876 5514529
18029E514529j44090j35948j21828q7377r7282j11959j58890j20224j19447j21616
$$ 5514529 5370439 5234491 5112663 5025286 4928004 4816045 4657155 4536931 4417484 4295868
18019D295868q0933n4305o7724o2318p5715m4477p1597o4677o8827m6455q4793
$$ 4295868 4214935 4160630 4092906 4030588 3954873 3910396 3838799 3774122 3705295 3658840 3574047
18008C574047r5225n9920n1633p6656o7783o9284m9618m0677n2285m6037l5445
$$ 3574047 3478822 3418902 3367269 3290613 3222830 3153546 3103928 3063251 3010966 2964929 2929484
17997B929484j5734m0894n8550p8777p0058m0001l8744l7947l1191m5381l9055
$$ 2929484 2913750 2872856 2814306 2735529 2665471 2625470 2586726 2548779 2517588 2472207 2433152
17986B433152n2073k0811l4746n8211k9072l560K5984Q950Q83j1655l6065j2756
$$ 2433152 2381079 2360268 2325522 2267311 2238239 2234679 2260663 2269613 2270496 2258841 2222776 2210020
17974B210020n7763o2782l7547m5713p1423l2068R962j5950k7560Q516m6512j3861
$$ 2210020 2152257 2089475 2051928 2006215 1934792 1902724 1912686 1896736 1869176 1877692 1831180 1817319
17962A817319k2782m8257j5344j3327l9584k2848N184j9380l4620l0146l3742
$$ 1817319 1794537 1746280 1730936 1717609 1678025 1655177 1660361 1640981 1606361 1576215 1542473
17951A542473j2261k1949l3502K1229N229k3740J8994K5193o802k1394o267n0733
$$ 1542473 1530212 1508263 1474761 1495990 1501219 1477479 1496473 1521666 1514864 1493470 1487203 1436470
17939A436470n3413m2533r038P925j8296k414J497j6853r985L021j887l8268k190
$$ 1436470 1383057 1340524 1331486 1339411 1321115 1318701 1320198 1303345 1293360 1296381 1294494 1256226 1254036
17926A254036N726j0031j7758j2460n886l2647l6569j8391l2985J9771K8572j8893
$$ 1254036 1259762 1249731 1231973 1219513 1213627 1180980 1144411 1126020 1093035 1112806 1141378 1122485
17914A122485J808p847J461j8462j4760j5786j4607l3366k463J8631M280l9224
$$ 1122485 1124293 1116446 1117907 1099445 1084685 1068899 1054292 1020926 1018463 1037094 1041374 1002150
17902A002150k7165k5388l5142j1084j6714q48O1477O3523M6403J04482J06916
$$ 1002150 974985 949597 914455 903371 886657 885809 947286 1010809 1057212 1161694 1268610
17891A268610J23489K05613K33877K35416K62842K45379J44952K9917n6440j27733
$$ 1268610 1392099 1597712 1831589 2067005 2329847 2575226 2720178 2750095 2693655 2565922
17881B565922j79085j67813j01686O364P1734J54613K01818K74984L21840K96755
$$ 2565922 2386837 2219024 2117338 2123702 2195436 2350049 2551867 2826851 3148691 3445446
17871C445446J91571O0760p9705k47975k86639l04231l10986k51573k59792k32827
$$ 3445446 3637017 3697777 3618072 3370097 3083458 2779227 2468241 2216668 1956876 1724049
17861A724049j53107j35954q6313m1053L3334L5985J1868l2065j7445N964j6661
$$ 1724049 1570942 1434988 1348675 1307622 1340956 1376941 1388809 1356744 1339299 1345263 1328602
17850A328602k4954j8843l62J3497n748j3111l2859q157L4028O4586N0765P0024
$$ 1328602 1303648 1284805 1284443 1297940 1292192 1279081 1246222 1238065 1272093 1336679 1387444 1457468
17838A457468O1854Q3615R7998J56935K35104K58299K70041K69302J59544R1059
$$ 1457468 1519322 1602937 1700935 1857870 2092974 2351273 2621314 2890616 3050160 3141219
17828C141219J2953l3417L0619J35884L33855M98884M85446L98526L16243K86460
$$ 3141219 3154172 3120755 3151374 3287258 3621113 4119997 4605443 5003969 5320212 5606672
17818E606672L89955N36621M26361J33625k96103n86402m62840k57842j37261
$$ 5606672 5996627 6533248 6959609 7093234 6797131 6210729 5747889 5490047 5352786
17809E352786o2345k11508k97340l04347k71193r1673N4724N4066l2638j68895
$$ 5352786 5290441 5078933 4781593 4477246 4206053 4114380 4169104 4223170 4190532 4021637
17799D021637k83245j89881J987J40700K04393J96817J56101L0097j04609j09437
$$ 4021637 3738392 3548511 3550498 3691198 3895591 4092408 4248509 4278606 4173997 4064560
17789D064560j57237q4475N6337J53765K17961K79412L19028M16746N02277N01311
$$ 4064560 3907323 3822848 3879185 4032950 4250911 4530323 4849351 5266097 5768374 6269685
17779F269685N28881M66955L77565L81260L58181M39536O23621Q83044J163182
$$ 6269685 6798566 7265521 7643086 8024346 8382527 8822063 9445684 10328728 11491910
17770A1491910J535020K064505K809715L873030N488664Q062473J2615422K0465325
$$ 11491910 13026930 15091435 17901150 21774180 27262844 35325317 47940739 68406064
17762F8406064L2274719M3552022M2439843L4401494K3186654o706954k5483411
$$ 68406064 100680783 144232805 186672648 221074142 244260796 237553842 212070431
17755B12070431l1107698l9500550l1847630j6708956n610091L052196J2540802
$$ 212070431 180962733 141462183 109614553 92905597 87295506 90347702 102888504
17748A02888504K4848337L6217394L5954414K8760618J8897401q641427k6725819
$$ 102888504 127736841 163954235 199908649 228669267 247566668 238925241 212199422
17741B12199422l1908264m0193696l4195538k1237920j3063393q916666o541116
$$ 212199422 180291158 140097462 105901924 84664004 71600611 62683945 56142829
17734E6142829n139667m163697l317844k505504j822003j337232j002789o90906
$$ 56142829 51003162 46839465 43521621 41016117 39194114 37856882 36854093 36163187
17726C6163187n67236o75746o94322r13154j066615j007212r49734p06392l55950
$$ 36163187 35595951 34920205 34225883 33312729 32246114 31238902 30289168 29582776 29226826
17717B9226826M0675M10611Q28044J345354K026919K923163M246459O404299J0082407
$$ 29226826 29267501 29678112 30506156 31851510 33878429 36801592 41048051 47452350 57534757
17708E7534757J6622873K6661871L6114539L5000877K8411268J8866414o663967
$$ 57534757 74157630 100819501 136934040 171934917 200346185 219212599 212548632
17701B12548632k2117445k6837004l3917141k7125999j4324999m978190K446721
$$ 212548632 190431187 163594183 129677042 102551043 88226044 83247854 85694575
17694H5694575J0608561K1129631L0857882L0345042K4187606J5596059q325910
$$ 85694575 96303136 117432767 148290649 178635691 202823297 218419356 210093446
17687B10093446k3386153k7805841l4925699k9340368j8172510j1149987p425061
$$ 210093446 186707293 158901452 123975753 94635385 76462875 65312888 57887827
17680E7887827n434363m225258l403722k806149k236893j751028j405809j189753
$$ 57887827 52453464 48228206 44824484 42018335 39781442 38030414 36624605 35434852
17672C5434852j114777j139086j140126j134776j208045j253227j143802r76086
$$ 35434852 34320075 33180989 32040863 30906087 29698042 28444815 27301013 26324927
17664B6324927p50035n06351l35712k77044k89048l34233k39168k75642l86601
$$ 26324927 25574892 25068541 24732829 24455785 24166737 23832504 23593336 23317694 22931093
17655B2931093n65600q46652r92195r38388p85957n80731l73261l23089k73326
$$ 22931093 22365493 21518841 20526646 19588258 18802301 18221570 17848309 17525220 17251894
17646A7251894k97980l69529m36165m17089m14969l82032m26752m13550l23654
$$ 17251894 16953914 16584385 16148220 15731131 15316162 14934130 14507378 14093828 13770174
17637A3770174k34470j46853m2710p3286q2881j01906k15550k68499l12028l87573
$$ 13770174 13535704 13388851 13346141 13272855 13189974 13088068 12872518 12604019 12291991 11904418
17627A1904418l63441l47906l33266k14507j64609q7967k7113l4137j01717j29514
$$ 11904418 11540977 11193071 10859805 10645298 10480689 10392722 10365609 10331472 10229755 10100241
17617A0100241k01651k43367k98731l11645l40907l55588k90282k46206k75238
$$ 10100241 9898590 9655223 9356492 9044847 8703940 8348352 8058070 7811864 7536626
17608G536626k31914j59477j46302j58426j78894j67681j68649j21463j11439
$$ 7536626 7304712 7145235 6998933 6840507 6661613 6493932 6325283 6203820 6092381
17599F092381j62704j30880j21039j45308j10455r7196r5583q2798r9399p2127
$$ 6092381 5929677 5798797 5677758 5532450 5421995 5324799 5229216 5146418 5047019 4974892
17589D974892n7111n0258k2348j8068q7259m6708J7464N7044J19362J14667Q5485
$$ 4974892 4917781 4867523 4845175 4827107 4739848 4693140 4710604 4767648 4887010 5001677 5087162
17578E087162P5573N5503k3284p6429j29518j90238j90311j71462j00629l2742
$$ 5087162 5162735 5218238 5194954 5118525 4989007 4798769 4608458 4436996 4336367 4303625
17568D303625n511P6456J01564M9521N7095N2872r2335j32471j74205k18882j80344
$$ 4303625 4298114 4374570 4476134 4525655 4582750 4635622 4543287 4410816 4236611 4017729 3837385
17557C837385j78479j78384j30231j09935j02992q2185m8263k2230m9308o5332
$$ 3837385 3658906 3480522 3350291 3240356 3137364 3055179 3006916 2984686 2935378 2870046
17547B870046n6126q2747o9406p8864o5208o1979n1685m7271m7132m9107n6302
$$ 2870046 2813920 2731173 2661767 2582903 2517695 2455716 2404031 2356760 2309628 2260521 2204219
17536B204219j4225k1521j5080l4173l0358k7703l0365n5815n5438o4245m0719
$$ 2204219 2189994 2168473 2153393 2119220 2088862 2061159 2030794 1974979 1919541 1855296 1814577
17525A814577l9747l1204l593L695q470P609K116k2994j5019L1595J4473k4829
$$ 1814577 1774830 1743626 1740033 1743728 1735258 1742867 1744983 1721989 1706970 1738565 1753038 1728209
17513A728209j3281k522p500J2813l475k6847j7994k4532q169l3152l8998k510
$$ 1728209 1714928 1712406 1704906 1717719 1714244 1687397 1669403 1644871 1636702 1603550 1564552 1562042
17501A562042J0350k7928l3356q931o92k7581k3060n3908m2299l4587k5403l706
$$ 1562042 1572392 1544464 1511108 1502177 1501485 1473904 1450844 1396936 1354637 1320050 1294647 1290941
17489A290941R95m1337p0750n9974j5398j9886j2387k0134j0282k4148k5741O89
$$ 1290941 1291936 1250599 1179849 1119875 1104477 1084591 1072204 1052070 1041788 1017640 991899 992588
17477I92588k2386k1500k8983m9233k7448o720J2111J6388o836l5578n0260j926
$$ 992588 970202 948702 919719 870486 843038 836318 848429 864817 857981 822403 772143 770217
17465G70217J6562J4262j3536j4422j5275K901j0332j458k4981M682k144j6668
$$ 770217 786779 801041 787505 773083 757808 760709 750377 748919 723938 728620 726476 709808
17453G09808j0545O078K4161K7443K7997K7362J8121j2729J9047M9938M1632M431
$$ 709808 699263 705341 729502 756945 784942 812304 830425 817696 836743 886681 928313 932744
17441I32744K9468L0514N9803O1404m783k4143o6156r0955n6369k4786Q749k7144
$$ 932744 962212 992726 1052529 1113933 1109150 1085007 1018851 927896 871527 846741 855490 828346
17429H28346J4634J7964J9511l226m0400q834p094l2986l2160m7848k3082m0985
$$ 828346 842980 860944 880455 877229 836829 827995 820901 787915 755755 707907 684825 643840
17417F43840j8146k2407j1855K471K9191K7254K2027J2005j1357k377J2781K8800
$$ 643840 625694 603287 591432 593903 623094 650348 672375 684380 673023 670646 683427 712227
17405G12227J4914K4529M562q27L2960L0311N390L7084L7906P4286J03449K06090
$$ 712227 727141 751670 756232 755405 788365 818676 824066 861150 899056 973342 1076791 1282881
17393A282881K77608L42733M03626L93058K85877J13584M6837J33665J62259J61163
$$ 1282881 1560489 1903222 2306848 2699906 2985783 3099367 3146204 3279869 3442128 3603291
17383C603291M3811j81757k89198j85801l6671J10066J50871J58841J08475l5611
$$ 3603291 3647102 3465345 3176147 2990346 2953675 3063741 3214612 3373453 3481928 3446317
17373C446317m0254K7651J06508J35184P309k12899l64232l65136l23163k31390
$$ 3446317 3406063 3433714 3540222 3675406 3682715 3469816 3105584 2740448 2417285 2185895
17363B185895k11373k21206j51852j31945j00153o1471k9157j7761n62J3452N045
$$ 2185895 1974522 1753316 1601464 1469519 1369366 1307895 1278738 1260977 1260415 1273867 1278912
17352A278912j5175l9446l2549j7335p399K2688J7291j1440K464K880l749l0134
$$ 1278912 1263737 1224291 1191742 1174407 1167008 1189696 1206987 1195547 1198011 1200891 1197142 1167008
17340A167008k7642k308l247M662L835K2155L2218K8022Q799K0641l942o969l534
$$ 1167008 1139366 1137058 1133811 1138473 1142308 1164463 1196681 1224703 1233502 1254143 1250201 1243232 1239698
17327A239698K6805N2144O245j4473L4918P0389Q7113P7812O6038N7451P8398
$$ 1239698 1266503 1318647 1324892 1310419 1345337 1415726 1502839 1580651 1646689 1704140 1782538
17316A782538K4435J0314N8354P4263N2690Q6819N1424J5871j527j5402J8984
$$ 1782538 1806973 1817287 1875641 1949904 2002594 2089413 2140837 2156708 2155181 2139779 2158763
17305B158763P7261O9225N9130Q7880J06881J20694J47888J86217L01872L75666
$$ 2158763 2236024 2305249 2364379 2452259 2559140 2679834 2827722 3013939 3315811 3691477
17295C691477L55742K99508J49491P1835J14341K75384M15099L91165L10691K04245
$$ 3691477 4047219 4346727 4496218 4568053 4682394 4957778 5372877 5764042 6074733 6278978
17285F278978J97475M20633P03179R15286Q94043Q20746O92885P14615J107715
$$ 6278978 6476453 6897086 7600265 8515551 9409594 10230340 10923225 11637840 12745555
17276A2745555J632222J861308J812136J783029J992641K871469M578395O936876
$$ 12745555 14377777 16239085 18051221 19834250 21826891 24698360 29276755 36213631
17268C6213631J0233528J5956091K6319704M3296201O2347137O2095673L4991360
$$ 36213631 46447159 62403250 88722954 132019155 194366292 256461965 291453325
17261B91453325J0036161j6702364k0702890J2437864L2389950J5613752p445544
$$ 291453325 301489486 284787122 264084232 276522096 308912046 324525798 317080254
17254C17080254l5164601n0410443k5882823J1084596M1866923M9479678K6961150
$$ 317080254 281915653 231505210 205622387 216706983 258573906 308053584 335014734
17247C35014734L909655k1150009k6761885N353525K6819880J0683845j4120640
$$ 335014734 338924389 317774380 291012495 296366020 323185900 333869745 319749105
17240C19749105m3653334o5558995n2278808l1310318j9004141j2681483r102246
$$ 319749105 276095771 210536776 158257968 126947650 107943509 95262026 86159780
17233H6159780o887882n483138m310538l269148k654218k326576k295669k435824
$$ 86159780 79271898 73788760 69478222 66209074 63554856 61228280 58932611 56496787
17225E6496787k300537k082518k067170j960869j863966j876469j799201j614640
$$ 56496787 54196250 52113732 50046562 48085693 46221727 44345258 42546057 40931417
17217D0931417j460646j333010j147832r39827p97539p69884q78107q83775r45928
$$ 40931417 39470771 38137761 36989929 36050102 35252563 34482679 33604572 32720797 31774869
17208C1774869q92263p70494p59140q21936q81475j000275r51251q01649p42857
$$ 31774869 30882606 30112112 29352972 28531036 27649561 26649286 25698035 24896386 24153529
17199B4153529o61187n97632o26567o09659n39510n28182m87609m37784l81339
$$ 24153529 23492342 22894710 22268143 21658484 21118974 20590792 20103183 19665399 19284060
17190A9284060l76823l74844l39325k44010k51281k52707k10511l50472m89213
$$ 19284060 18907237 18532393 18193068 17949058 17697777 17445070 17234559 16884087 16394874
17181A6394874n47029n94472n38644m24262l43621l25442k46447k05130j47633
$$ 16394874 15847845 15253373 14714729 14290467 13946846 13621404 13374957 13169827 13022194
17172A3022194j13415j27571j60479k47006l57106m09151m27376m26967l44270
$$ 13022194 12908779 12781208 12620729 12373723 12016617 11607466 11180090 10753123 10408853
17163A0408853k67214k87274k54135k14881k14019k17074k04993k13222j90827
$$ 10408853 10141639 9854365 9600230 9385349 9171330 8954256 8749263 8536041 8345214
17154H345214j74117j45215j61615j23043r2706r8210q8293j10533j15164j32950
$$ 8345214 8171097 8025882 7864267 7741224 7648518 7550308 7462015 7351482 7236318 7103368
17144G103368r3654n2904q251N7519J57928J76687K01896J83553R9220J11296
$$ 7103368 7009714 6956810 6948559 7006078 7164006 7340693 7542589 7726142 7825362 7936658
17134G936658P5602L3206M8079k0475j02740j20171j87983j75962j11404j2628
$$ 7936658 8012260 8045466 8093545 8073070 7970330 7850159 7662176 7486214 7374810 7362182
17124G362182L2296M2043n5679k5743k6573o3000m0450m3216j50788k34437k77609
$$ 7362182 7394478 7436521 7380842 7355099 7328526 7265526 7225076 7181860 7031072 6796635 6519026
17113F519026l38168l70761l06761k50634k28540j85316j81660j54694j23089
$$ 6519026 6180858 5810097 5503336 5252702 5024162 4838846 4657186 4502492 4379403
17104D379403r9585r9352q3479q7628j11179j18884r5745j01927r4435r1296n2933
$$ 4379403 4279818 4180466 4096987 4009359 3898180 3779296 3683551 3581624 3487189 3395893 3342960
17093C342960o2358m8186o6434p1656p1648m3537m8424p9273p5368o1286r4760
$$ 3342960 3280602 3232416 3165982 3094326 3022678 2979141 2930717 2851444 2776076 2714790 2620030
17082B620030o7878n0263o9906q2178l5475l5049l1067l7398l2923k5374l8066
$$ 2620030 2552152 2501889 2431983 2349805 2314330 2279281 2248214 2210816 2177893 2152519 2114453
17071B114453k5914l2149m9646k3384o993m0225l1007m7551m6500l1801j7769
$$ 2114453 2088539 2056390 2006744 1983360 1976367 1936142 1905135 1857584 1811084 1779283 1761514
17060A761514j9338k8498l2324l3895l7678k9250J273j4091l4179o571m6701m3524
$$ 1761514 1742176 1713678 1681354 1647459 1609781 1580531 1581804 1567713 1533534 1526963 1480262 1436738
17048A436738Q348j345k4522o742k7718k7953l7890m9805k4485Q777K8874j9763
$$ 1436738 1445086 1443741 1419219 1412477 1384759 1356806 1318916 1269111 1244626 1253403 1282277 1262514
17036A262514j1158q883k9081o4483j2088n724m1809j1998L40k7828k7278l3374
$$ 1262514 1251356 1242473 1213392 1148909 1136821 1131097 1089288 1077290 1077630 1049802 1022524 989150
17024I89150j1883J939k3878l1711j7068O32J2218P600k5196k2279j4000L544
$$ 989150 977267 979206 955328 923617 906549 907181 919399 926999 901803 879524 865524 869068
17012H69068K8228m171j0793k4621l5034l4744j172J062j5177o230O245k3425
$$ 869068 897296 893125 882332 857711 822677 787933 786761 787823 772646 766416 772661 749236
17000G49236m5816N51J4224J8072j830J1076k0882l7288k282L981j7670j2997
$$ 749236 703420 703971 718195 736267 734437 745513 724631 687343 685061 689042 671372 658375
16988F58375j7223j8498j0143k2587J5988J5840l1471j5095K3843N891r656j8558
$$ 658375 641152 622654 612511 589924 605912 621752 590281 575186 599029 604920 595264 576706
16976E76706j3524j5081j4697k121L312o196k8145j3335L039r324K2589n565k5754
$$ 576706 563182 548101 533404 531283 534595 528399 500254 486919 489958 480634 503223 497658 471904
16963D71904k2248q297o240p41k8248j343J4368L957q333l3591l6328j6631P105
$$ 471904 449656 441359 435119 434378 406130 404787 419155 423112 414779 381188 344860 328229 335334
16950C35334l245M768J5669J3319j0806j9825j0374K417K516l942q191j3472l0683
$$ 335334 332089 336857 352526 365845 355039 335214 324840 327257 329773 325831 317640 304168 273485
16937B73485q435k706J0213K0872J9057k5026N819J0024k2685k7189j1119q072
$$ 273485 265050 262344 272557 293429 312486 287460 293279 303303 280618 253429 242310 234238
16925B34238p235j0109J1881K2539K5375J601k9234k7520J6325k7755k9905K1896
$$ 234238 227003 216894 228775 251314 276689 278290 249056 221536 237861 210106 180201 202097
16913B02097L4680R439l718k3543j3027k4496J571j5764J1996K512n867k9881
$$ 202097 236777 246216 242498 218955 205928 181432 183003 167239 179235 181747 175880 145999
16901A45999n704J1816K8675j9k1447Q019l003R314M038j7426j0070l751k3180
$$ 145999 140295 152111 180786 180767 159320 167339 164336 173650 177688 160262 150192 146441 123261
16888A23261q939K518L284k1673j234j3532j5655j6622J5022J7212j2122o726
$$ 123261 114322 116840 120124 98451 97217 83685 68030 51408 66430 83642 71520 64794
16876F4794m090J3545R467l530J9204O426r373n420L148j0867k5670J636o696
$$ 64794 60704 74249 83716 80186 99390 105816 96443 91023 94171 83304 57634 59270 52574
16863E2574J1649J151J0328M016M264j8374k9109O643o787J1900K2938j0995l3091
$$ 52574 64223 65374 75702 79718 83982 65608 36499 43142 36355 48255 71193 60198 27107
16850B7107n477K2434L0132j0850j3718k872m834L1273O216p626k011k7266k6559
$$ 27107 21630 44064 74196 63346 49628 46756 41922 73195 79411 71785 69774 42508 15949
16837A5949P990L3867k15j9140m343J2317k157j6195K001M575J6853J5805O658
$$ 15949 23939 57806 57591 38451 34108 46425 44268 28073 30074 34649 51502 67307 73965
16824G3965M499k1665k2324r38M563p186O5P165j1404n526L859j3214k7571L76
$$ 73965 78464 56799 34475 33537 38100 30914 30979 38144 26740 21214 25073 11859 -15712 -15336
16810a5336K5562K6418K7819J4565k5422j6721l956o860j4834l605k701j1834
$$ -15336 10226 36644 64463 79028 53606 36885 32929 26069 11235 7630 4929 -6905
16798f905l515n928L714O230M0342K7169j2661k1460r135R351J6134J8704K957
$$ -6905 -10420 -16348 -12634 -6404 33938 61107 48446 26986 17851 27202 43336 62040 64997
16785F4997k8062k3117K5781R177J0148p218K0648J3014O516J1641j5411p762
$$ 64997 36935 13818 39599 48776 58924 51706 72354 85368 91884 103525 88114 80352
16773H0352l1471k1964L255K2905m136k676J7212k0071j2801R931R71j1156J3999
$$ 80352 48881 26917 30172 53077 48941 46265 63477 43406 30605 40536 41507 30351 44350
16760D4350K2922l151k2599j5719p171o819P581K460K124J0759l141r333J7975
$$ 44350 67272 64121 41522 25803 18632 11813 19394 21854 23978 34737 31596 22263 40238
16747D0238L971l311j6067j3334j5085J3525L7062P16K774J3047j8857o40o26
$$ 40238 44209 40898 24831 11497 -3588 9937 46999 47715 50489 63536 44679 44039 43413
16734D3413j6760q333O136K0748n968j7667L201J1807M557L906q877o385R859
$$ 43413 26653 18320 24456 45204 39236 21569 24770 36577 41134 45040 36163 29778 39637
16721C9637L1098K7787K110l929P090P224m135K4038K0017L742p39j3902k197
$$ 39637 70735 98522 100632 96703 103793 111017 106882 130920 150937 154679 153940 140038 137841
16708A37841j8126K249R733J8058J0008K570N1783J01369J40641J81556K54246
$$ 137841 119715 121964 131697 149755 159763 162333 214116 315485 456126 637682 891928
16697H91928L32281K52937J18393l2655j35988q928J64657J33628J8774j12837
$$ 891928 1224209 1477146 1595539 1562884 1426896 1417968 1582625 1716253 1735027 1622190
16687A622190k39917k14586j7838J70686K75901J81785N3382n5947j36170j7631
$$ 1622190 1382273 1167687 1149849 1320535 1596436 1778221 1831603 1775656 1639486 1621855
16677A621855J24274P6549n3294j99530k99196k83840k16341j44596o9239j2765
$$ 1621855 1746129 1822678 1769384 1569854 1270658 986818 770477 625881 556642 543877
16667E43877j1540p8928l3969l418n6523m2546k4441l4949j3569Q153r876k9741
$$ 543877 532337 453409 419440 416022 359499 316953 292512 257563 243994 252147 242271 212530
16655B12530m067P975P040J0944j0028r270J738n455p279k0004J1523L07l9981
$$ 212530 208463 216438 223478 234422 224394 215124 216862 211407 204128 184124 195647 195954 155973
16642A55973M143O25Q884J3974m1763k5013K3965J3654k2777k7006O835j459P400
$$ 155973 160116 160741 169625 183599 141836 116823 140788 154442 131665 104659 111494 110035 117435
16629A17435o990K4694r468M724M165m214p040r20P309K1472k4267l4947o302
$$ 117435 110445 135139 125671 130395 134560 130346 123306 122386 129695 151167 126900 91953 85651
16616H5651J8200M108l0032q404R078P818J2642N0181K019j6684k6613l0603M764
$$ 85651 103851 107959 77927 69523 78601 86419 99061 149242 151261 134577 107964 77361 82125
16603H2125j9301o553K6243l510k7773Q698J4699O577O143k7835k6814K476J4567
$$ 82125 62824 56271 82514 79004 51231 59929 74628 81205 87348 59513 32699 35175 49742
16590D9742j4144j8477K1268j2518k3828j089K9489o041J3524O471J2571J2622
$$ 49742 35598 17121 38389 25871 2043 954 30443 24402 37926 44397 56968 69590
16578F9590j9863j8008Q39J3912K7846P220m837j1177Q739N658l014l4806j205
$$ 69590 49727 31719 32558 46470 74316 81536 76699 65522 74261 79919 76905 42099 40894
16565D0894K1471N059N320q22j2564k2102j6474Q756L845K251p647J1687p223
$$ 40894 62365 67424 72744 71922 59358 37256 20782 29538 33383 35634 27987 39674 32451
16552C2451j4536k7089J4947L9287r380J7710J6681m0715l9267Q859j0456R55
$$ 32451 17915 -9174 5773 45060 35680 53390 70071 29356 -9911 -1052 -11508 -10553
16540a0553Q181j3003K0446M5652J9625k4396k1123j7790j3081K3160K1804k7060
$$ -10553 -2372 -15375 5071 50723 70348 45952 24829 7039 -6042 17118 38922 11862
16528A1862j1100J1120m512K5345m14K216J1273k31k467l3135j6952L0802m3443
$$ 11862 762 11882 7370 32715 32301 34517 45790 45559 43092 9957 -6995 23807 -19636
16515a9636m2073J2M3099L2478J1548J6260N472k4505r132J4224j0826m809J6058
$$ -19636 -61709 -61697 -18598 13880 25428 41688 47160 22655 13523 27747 16921 12112 28170
16502B8170N02J6245j802k7791j7638j0136J2741K2393K825P92J1115j3073l7363
$$ 28170 28672 44917 43115 15324 -2314 -12450 291 22684 25509 26301 37416 24343 -13020
16489a3020q204K6303J1295k3000J180K1619R743m367J4939R022j5525J2175k103
$$ -13020 -21224 5079 16374 -6626 -5446 16173 25916 21549 36488 45510 29985 42160 40057
16476D0057q140l557j1201k9637k685J6900J5924O212J0369j7018l4318q913j2304
$$ 40057 31917 28360 17159 -12478 -15163 1737 17661 23873 34242 17224 -17094 -26007 -38311
16463c8311N36K600L9077L053n830j003J7514J7661j2085j0569J1218l512j7689
$$ -38311 -37775 -35175 3902 6955 1125 122 17636 35297 23212 12643 23861 20349 2660
16450B660J2551j7499o013r429k417l0354M197K3287J0704j1261K1084Q130K029
$$ 2660 15211 -2288 -8301 -17730 -20147 -50501 -46304 -23017 -12313 -23574 -2490 5640 7669
16437G669j0332l677R340J1101q608Q283L8396J7258J1400j5879j8425l9478K444
$$ 7669 -2663 -6340 3000 14101 5493 13776 52172 69430 80830 64951 46526 7048 9492
16424I492J7076J0977j9786M549N084j5462j5093O022J6884k071k653k5065k3213
$$ 9492 26568 37545 17759 22308 27392 11930 -3163 2859 19743 17672 15019 -10046 -33259
16411c3259P691J0171p442M494K2454n613p38O126L1013M787j930j068k6888Q455
$$ -33259 -25568 -15397 -22839 -18345 4109 -1504 -2242 3884 34897 39684 37754 36686 9798 18253
16397A8253K5190R701l6518j4697J2567N027K2727j4127n914k9021M49l78M493
$$ 18253 43443 53144 16626 1929 14496 19523 42250 28123 22209 -6812 -6363 -6741 -2248
16384b248J5332k2397k4307R399l893k161R555l738k281K5618p36J8291J5722
$$ -2248 13084 -9313 -33620 -24221 -28114 -30275 -20720 -24458 -26739 -1121 -1857 16434 32156
16371C2156k5619m0352J1628J8825K347O056J076l375n228j6487J1828J6365r449
$$ 32156 6537 -33815 -22187 -3362 -1015 5041 6117 2742 -2486 -18973 -7145 9220 -229
16358b29r312j886J8538N515j9073P862J4950k9887k1110l058O184L7853K0245
$$ -229 -9541 -11427 7111 12626 -6447 1415 16365 -13522 -34632 -37690 -31506 6347 26592
16345B6592n713q408J0521J7098j4713j139M846n67J4659O00L660j8020m047K5898
$$ 26592 20879 12471 22992 40090 25377 24238 29084 28517 43176 43776 47436 29416 25369 51267
16331E1267K799k1784j8981k6590J9309J3208J9079J5603k1658k9128r269j4615
$$ 51267 54066 32282 13301 -13289 6020 19228 38307 53910 32252 3124 -6145 -20760
16319b0760j2059L1841Q456n7380j5647K778J5564K6671j5814N463k272L418K0166
$$ -20760 -32819 -978 7478 -49902 -65549 -62771 -47207 -20536 -36350 -30887 -33159 -29741 -9575
16306i575J2343J4823j8217o111K865k7777N505L4591K7223j4210k8398K595J6662
$$ -9575 2768 17591 -626 -6737 -3872 -31649 -26144 8447 35670 21460 -6938 -4343 12319
16293A2319r446Q772j568j4743k8499R374L876j5349o115j5131J418J6966K8516
$$ 12319 2873 11645 10077 -4666 -33165 -23791 -19915 -35264 -41379 -56510 -55092 -38126 -9610
16280i610J0639k2276K305M596j0925k112R454J424M813q380k7760J5290j923
$$ -9610 1029 -21247 -18942 -14346 -25271 -27383 -17929 -16505 -11692 -20072 -47832 -32542 -34465
16267c4465l525p534K3604L7048j1539j5904O67J6616J995j9293l1222j7362M074
$$ -34465 -37990 -45524 -21920 15128 3589 -12315 -11648 4968 6963 -12330 -43552 -60914 -56840
16254e6840k182N578J6996J0294L6024L526j8096j0716O612j1786M400J2151K407
$$ -56840 -59022 -53444 -36448 -26154 9870 13396 -4700 -15416 -8804 -20590 -16190 -4039 -1632
16241a632R105j0399J904J3041l670q958K903r105L2004J4795n282p366M338J891
$$ -1632 7473 -2926 -1022 12019 8349 -609 2294 -6811 25193 39988 34706 27340 31678 33569
16227C3569k072j4322n871J4333M289l4865k9461Q796O950k126J0705K6631M433
$$ 33569 31497 17175 11304 25637 29926 -4939 -34400 -25604 -18654 -20780 -10075 16556 20989
16214B0989k7297K4272K3876q690k6504n642K5673Q780J0984R993k2205q336O065
$$ 20989 -6308 17964 41840 33150 6646 1004 26677 35457 46441 56434 34229 25893 31958
16201C1958R3j3735M218j8981m7500K1150L4615J1671J5888J3252j8721l675J5044
$$ 31958 32051 18316 22534 3553 -43947 -22797 11818 23489 39377 52629 33908 30233 45277
16188D5277L717J4823n06l0507n000m870j6012j7600j4504M465j0819O825K0406
$$ 45277 48994 63817 63311 32804 27804 22934 6922 -10678 -25182 -20717 -31536 -24711 -4305
16175d305R878Q428j3688M559n160r011J6769L4722l1805j2056Q26j0048M885
$$ -4305 5573 14001 313 4872 -288 -9299 7470 42192 10387 -1669 -843 -10891 -6006
16162f006k1301k0664N96j8836K7268K063p524R138K6253M282j1584k9357l7132
$$ -6006 -27307 -47971 -47375 -66211 -38943 -36880 -44404 -35266 -9013 -4731 -16315 -45672 -82804
16149h2804J3213J5214K2981L3970K2616K864Q431j6313l4401j027K3862l2616
$$ -82804 -69591 -54377 -31396 2574 25190 28054 36485 20172 -14229 -15256 8606 -24010
16137b4010j8779J9418j915n147j2359J5559J4726o41K3757q286l5672J526K0876
$$ -24010 -42789 -23371 -25286 -30433 -42792 -27233 -12507 -13148 10609 2323 -33349 -31823 -10947
16124a0947k0098j1226M983K0593J9406J1972J158J8164J9731k495r655k5407
$$ -10947 -31045 -42271 -37288 -16695 2711 14683 15841 34005 53736 51241 41586 16179
16112A6179j5518K2277l187n168j1048P280J102m5495m4001J0385K0645M2266
$$ 16179 661 22938 19751 14583 3535 10815 11917 -33578 -77579 -67194 -46549 -4283
16100d283L1527m55J2655r041l8157k4771r658L371P806Q365L5995m880r072J2415
$$ -4283 27244 26789 39444 30403 -7754 -32525 -42183 -38812 -31006 -22641 13354 8474 -598 11817
16086A1817j9398j1118K212r504k713K43o64P687M4015l863q374K1558l009k0173
$$ 11817 -7581 -18699 -16487 -25991 -28704 -28461 -29125 -21438 22577 18714 10340 31898 28889 8716
16072H716n850o653J6617J2830M796j4081J411l2262m8379K5157K9761N843O851
$$ 8716 2866 -3787 12830 25660 30456 16375 17786 -14476 -62855 -37698 -7937 -2094 4757
16059D757q316l1015k4908J2662L3288J6032O632o512J6789q221j2768l1318j8185
$$ 4757 -3559 -34574 -59482 -46820 -13532 2500 9132 2620 19409 11188 -1580 -32898 -51083
16046e1083J1452J1997j9250K1349K7781P785p771P581K2787L465m4064j0506
$$ -51083 -39631 -27634 -46884 -25535 2246 10031 2260 9841 32628 36093 -7971 -18477
16034a8477L73M234J6546R163J0620o443k3130k485j023K5065q274l7651O505
$$ -18477 -18104 -13870 2676 11839 22459 16016 -7114 -9599 -10622 14443 6169 -31482 -24977
16021b4977Q249m231K5165O146J1928m509j5784J8199K1644j1016k6767m0782
$$ -24977 -16728 -20959 4206 10352 22280 17771 1987 20186 41830 30814 4047 -36735
16009c6735l679L5488J8774k0162r780J3832J3950m086o142k8398N373K2534J6865
$$ -36735 -40414 -4926 13848 -6314 -16094 -2262 11688 7602 1460 -26938 -21565 969 17834
15996A7834M04p875M639P204n675K658K376J3711K5759j5502l5733p732o662Q533
$$ 17834 18238 10363 15002 22206 16531 19189 21565 35276 61035 45533 9800 2068 -4594 3939
15982C939m21N604K9776K870j6269M85n884n120L7005K8933k496k2089n880k700
$$ 3939 3518 9122 38898 41768 25499 25984 20100 14980 51985 80918 78422 56333 50453 47753
15968D7753l145k5386j5364n552q585Q356J6802j0743J2196j3595J259K845j0650
$$ 47753 44608 19222 3858 -1694 -10279 -1923 14879 4136 16332 2737 3996 6841 -3809
15955c809r014J79r390j6059M229R465K6504L384l591L617k1170P958J2392K286
$$ -3809 -12823 -12644 -22034 -38093 -33864 -24399 2105 5489 1898 5515 -15655 -7697 4695 6981
15941F981J2620j0940j6215l317N713p900M465K4472k1369q863O05K178J8440
$$ 6981 19601 8661 -7554 -10871 -5158 -13058 -8593 15879 -5490 -14353 -13748 -11570 6870
15928F870L86l8620l293K0413J986O863J3013j8860J660Q602L7994p270l4468
$$ 6870 7256 -31364 -34657 -14244 -12258 -5395 7618 -11242 -9582 -980 37014 29744 -4724
15915d724l837j4622J1139p10N343J6645J0913j0605J5198J7235j3369j0765o177
$$ -4724 -8561 -23183 -12044 -12754 -7411 9234 20147 9542 24740 41975 28606 17841 11664
15902A1664J1411j505k6225m627K4443k9482m253n187l834K3362K3064p336j6148
$$ 11664 23075 21570 -4655 -9282 15161 -14321 -18574 -23761 -27595 -4233 18831 11495 -4653
15889d653j5354k3652j2840P236R235K0219K3466P49j2456r882Q818L4330K6376
$$ -4653 -20007 -43659 -56499 -49263 -40028 -19809 3657 4406 -8050 -17932 -9114 25216 51592
15876E1592j3831o133k1204k6336j897n914J1710J23q12j294j6058p599J0733
$$ 51592 37761 31628 10424 -15912 -17809 -23723 -12013 -11890 -12702 -13996 -30054 -37653 -26920
15863b6920K3965m882j1672j7492M479J5474n297J4947o700L625J2776R507J1337
$$ -26920 -2955 -7837 -19509 -37001 -32522 -17048 -22345 -7398 -14098 -10473 2303 11810 23147
15850B3147O270n065m361k5420R210J3248j2515N191l903m973K4680J0949N688
$$ 23147 29417 24352 19991 -5429 3781 17029 4514 9705 5802 829 25509 36458 42146
15837D2146k9488p241J1100L505j1299l6974j5461Q575O605M169K2983K5639j5129
$$ 42146 12658 5417 16517 20022 8723 -28251 -43712 -35137 -28532 -24363 -1380 24259 9130
15824I130o490j061J1090K281j8023l2407k2647j621N087L138n926J9120K7563
$$ 9130 2640 1579 12669 14950 -3073 -35480 -58127 -59748 -54661 -51523 -57449 -38329 -10766
15811a0766P182j4718q318K1168J3546P276k3773j1534j4079k4253J6453J8851
$$ -10766 -3584 -18302 -26620 -5452 8094 15370 -8403 -19937 -34016 -58269 -41816 -22965
15799b2965K0478j5199Q630r498j5275L4804Q389k9358j5647J6758K0169o963
$$ -22965 -2487 -17686 -9056 -18554 -33829 975 9364 -19994 -35641 -18883 1286 -5677
15787e677j7800j0929L9591Q560j6953o086P778J4971K719j7431k3976j0432l897
$$ -5677 -23477 -34406 5185 13745 -3208 -9294 -1516 13455 16174 -1257 -25233 -35665 -39562
15774c9562K3136J0811J8866K17o721m0911J5458j3898r585Q918J3484j0032r867
$$ -39562 -16426 -5615 13251 13468 6747 -34164 -18706 -32604 -42189 -33271 -19787 -29819 -39686
15761c9686J1363l478J5330J4331J4399K4331J0227K6322k1652n1026l7025j8623
$$ -39686 -28323 -31801 -16471 -2140 12259 36590 46817 73139 51487 461 -36564 -55187
15749e5187J1598J5587j6639r312m320N028J9007Q388P61J226m581Q515o46m608
$$ -55187 -43589 -28002 -44641 -53953 -58273 -53245 -34238 -25850 -25089 -23863 -28444 -19929 -20575 -25183
15735b5183J7679k4227Q224p023o216j362R423k912k484K0064J9860j3916K8415
$$ -25183 -7504 -31731 -23507 -30530 -36746 -38108 -28685 -31597 -34081 -14017 5843 -8073 20342
15722B0342J0886k825j716j7407r220j535p015n989R702j6604J2744K7275j8945
$$ 20342 31228 28403 26687 9280 60 -1475 -8490 -14479 -4777 -21381 -8637 18638 -307
15709c07j5854R817J151P606p789K0952P547N20Q423J4878j6250k0149j7314L387
$$ -307 -16161 -6344 -5193 2413 -5376 15576 23123 23643 32066 46944 30694 10545 -6769 -3382
15695c382L665J5251k763k514j2478q341P931J9235j5168j3658O408N48M594Q897
$$ -3382 283 15534 12771 10257 -2221 -10562 -2631 16604 1436 -12222 -5814 -5266 -672 8225
15681H225n316j0283J4526j1396k7251M689N24Q632M875q022Q20K3940K9042K2976
$$ 8225 2909 -7374 7152 -4244 -31495 -26806 -26282 -17650 -12775 -20797 -19977 3963 33005 55981
15667E5981k247l0827j7845N974J5336k4022k63k1026j2307K163p1J0078m574
$$ 55981 53734 22907 5062 11036 26372 2350 2087 -18939 -31246 -29083 -29154 -19076 -23650
15654b3650k5561K1569M5888J5174J5854j348j3016j5027m855k4862j4399N614
$$ -23650 -49211 -27642 18246 33420 49274 47926 34910 19883 15028 -9834 -24233 -18619
15642a8619M573J8975J0939l3892p497K1837m242J6655K8809k365q283r373J4806
$$ -18619 -14046 4929 15868 -18024 -25521 -3684 -7926 8729 37538 35173 26890 17517 32323
15629C2323Q541k5316k3042j0250M690n573L759l471J4608r972p877M459n965
$$ 32323 40864 15548 -7494 -17744 -13054 -18627 -14868 -18339 -3731 -13703 -21580 -17121 -23086
15616b3086o700K654r54N44Q952j378j3691N710R566r667j355L4420J0657m431
$$ -23086 -29786 -27132 -28086 -27542 -18590 -19968 -33659 -27949 -18383 -28050 -29405 5015 15672 11241
15602A1241o210j0353j6158k2095q568M318J5318M5379j1511k0668J4309L3251
$$ 11241 5031 -5322 -21480 -43575 -52143 -47825 -32507 12872 1361 -19307 -4998 28253
15590B8253o061l8986j7147J19K0996Q204k6152j0660J3594J0479j4187k9579
$$ 28253 22192 -16794 -33941 -33822 -12826 -4622 -30774 -41434 -27840 -17361 -31548 -61127
15578f1127j9752N745L0742L2661J6077P411K5807k17m887q781K0968J2785j7492
$$ -61127 -80879 -75134 -44392 -11731 4346 11757 37564 37347 32460 23679 44647 57432 39940
15565C9940j6693K3594m287J2390J0572m3529k9556j5116j5822j2340Q346J3546
$$ 39940 23247 46841 42554 54944 65516 21987 -7569 -22685 -38507 -50847 -42501 -28955
15553b8955n142Q337N412j1036K1213j333j4132r108K5955J5588R57J1035l534
$$ -28955 -34097 -25760 -20348 -31384 -10171 -11504 -25636 -34744 -8789 6799 7756 18791 15257
15540A5257k3679J0809K7158n731l0618J340j0302j5819J0815J696k3163R202
$$ 15257 -8422 2387 29545 23814 -6804 -5464 -15766 -31585 -20770 -19074 -42237 -33035
15528c3035K2822L4964K5135l6281j4548K1306J9778j8974k7702k6625K0869L9342
$$ -33035 -10213 24751 49886 13605 -943 20363 40141 21167 -6535 -33160 -12291 27051
15516B7051J2767j3291r953K768L195j463J3395m002k2331O166L0344l1898k8264
$$ 27051 39818 26527 16574 19342 22537 21074 34469 30467 8136 14302 44646 12748 -15516
15503a5516P493L4474J926P622j6192n2538J1610J2171j4772q401P069k697q279
$$ -15516 -8023 26451 28377 35999 19807 -32731 -21121 -8950 -23722 -32123 -25054 -27751 -36030
15490c6030K5940L8943J4862n4828k832K4448K534J661J2113J8687M664o541k0418
$$ -36030 -10090 28853 43715 -11113 -13945 10503 13037 14698 26811 45498 50162 43621 23203
15477B3203j1334Q776q394p505k9291J0831O050p700o206N862j8095m619l87q58
$$ 23203 11869 20645 12251 4746 -24545 -13714 -7664 -15364 -21570 -15708 -33803 -38422 -38809 -39667
15463c9667K2402k634L092j4671K415k6156q612K5500Q473j515J8081J5394R78
$$ -39667 -17265 -19899 -16807 -31478 -29063 -55219 -63831 -38331 -29858 -31373 -13292 2102 3080
15450C080j2194L712J9610K2456j9125k4456n235j093j7092r562P963J6663J1673
$$ 3080 -9114 -5402 14208 36664 17539 -6917 -12152 -13245 -30337 -39899 -31936 -15273 -3600
15437c600K3412K652j7389k5959r144J0068j2136R637K2904K1569j6615j8855
$$ -3600 19812 22464 5075 -20884 -30028 -19960 -32096 -22459 445 22014 5399 -13456
15425a3456k2908p112J343J8023O492J0844L806j9386K2917L166m8321J9344k381
$$ -13456 -36364 -43476 -42133 -24110 -17618 -6774 -2968 -22354 563 3729 -44592 -25248 -27629
15412b7629j5732p420J2325k823M4679L917q393N941J0564k9704j0870L937p168
$$ -27629 -43361 -50781 -38456 -41279 3400 7317 -1076 4865 15429 -14275 -25145 -21208 -28376
15399b8376n843J7829M715K9763K3265r126l418Q433j5814n717k752n533l57j0339
$$ -28376 -34219 -16390 -11675 18088 41353 32227 28809 37242 21428 15711 12959 7426 7069 -3270
15385c270j9057J608J7963j786o199p221k2386J6663Q252O916R410p259N429K0498
$$ -3270 -22327 -20719 -2756 -4542 -10741 -17962 -40348 -23685 -15433 -8517 893 -6366 -937 19561
15371A9561q378l068R340j5248k2211J4291j0465O120K6571j064l6967k3888K3654
$$ 19561 11183 8115 17455 2207 -20004 -5713 -16178 -10058 16513 15449 -21518 -45406 -21752
15358b1752P053j291m006P163L723m555j575J3532J0107j156n271n700l250q56
$$ -21752 -14699 -15990 -19996 -12833 -9110 -13665 -15240 -1708 8399 7243 1972 -3728 -6978 -7834
15344g834k284K2027P423j1697j0333j786J5025J899l376o78J1511J9862k780
$$ -7834 -10118 11909 19332 7635 -2698 -4484 10541 12440 9064 8386 19897 39759 36979
15331C6979R37j1795j6782N465J2313j1025k722l6775O130M0060J5637K304M118
$$ 36979 37916 26121 9339 14804 27117 16092 13370 -23405 -17275 22785 38422 40726 44844
15318D4844J0100j6147l8646l0637P602j5925j7921J1797K5652Q751K2129M108
$$ 44844 54944 38797 151 -30486 -22884 -38809 -56730 -44933 -19281 -10530 11599 15707
15306A5707n355l882M752L609N373O027k2032j3399j0809K2379K6591p835K0408
$$ 15707 10352 6470 11222 14831 20204 26231 4199 -9200 -20009 2370 28961 21126 41534
15293D1534j7583L532J1326p077l4266l0010K3538O255l655k1997P168K6064R616
$$ 41534 23951 27483 38809 31732 -2534 -32544 -9006 -2751 -6406 -28403 -21235 4829 14445
15280A4445j8028l119m083k271J2378k126R695j2973k948K7238j0811k5389k765
$$ 14445 -3583 -6702 -10785 -13056 -678 -2804 6891 -6082 -9030 18208 7397 -17992 -20757
15267b0757K2779q882j0065J8508N348k711P99j57M522l638k7355J6569K6724
$$ -20757 2022 -6860 -16925 1583 6931 4220 5019 4862 9384 5746 -21609 -5040 21684
15254B1684k4992k0218j6807k588J7574P362n1j147j2824J0822Q896j7793l988
$$ 21684 -3308 -23526 -40333 -42921 -25347 -17985 -18036 -19183 -32007 -21185 -12289 -30082 -34070
15241c4070J2784q418j1424P972J0205M1625m161l14K352P296o828j7854L181
$$ -34070 -21286 -29704 -41128 -33156 -22951 18674 14513 14199 16551 23847 17019 -835 2346
15228B346J2230K6039J9781j3779k0583k361l0032j0139K0766q006o183J8847
$$ 2346 14576 40615 60396 46617 26034 23673 -6359 -16498 4268 -3738 -9921 8926
15216H926J8197j0417o336J3043j0734k1892l7171n406J0395J0640K020j198J5428
$$ 8926 27123 16706 10370 23413 12679 -9213 -46384 -51790 -41395 -30755 -28735 -29933 -14505
15203a4505r886j2408K5510M960k1623j7039N15O300O959j7094K9732K5499l557
$$ -14505 -24391 -36799 -11289 -6329 -27952 -44991 -44476 -38176 -31217 -48311 -18579 6920 3363
15190C363j2115l7991R46L1203J3517K0642J1748k1891P15K3125J3994l7895R559
$$ 3363 -8752 -46743 -45797 -14594 -1077 19565 31313 9422 10137 33262 47256 9361 18920
15177A8920K1387J7937k8869k4658M879j21K8636j5201J1009j6296k2650q518
$$ 18920 40307 58244 29375 4717 9596 9475 38111 22910 33919 17623 -5027 -13545
15165a3545m350j9888j9603M0750K4168N661P388j7728q044k9768K0131J8553
$$ -13545 -17895 -37783 -57386 -16636 7532 13193 20581 2853 -5191 -34959 -14828 3725
15153C725j2029k777r517K6032j9115k0750l1238k636o938L2337K1462p63m483
$$ 3725 -8304 -11081 -20598 5434 -13681 -34431 -65669 -68305 -75243 -42906 -21444 -22207 -26690
15140b6690J9259J4655J367N963K5495j9642l1513k778L541j4592J5112L0361
$$ -26690 -7431 7224 8591 14554 40049 20407 -11106 -13884 -10343 -24935 -9823 20538
15128B0538J9113N682k0199n754M792k7746k8770j2014J2747J4181K0855N618
$$ 20538 39651 45333 25134 19380 24172 -3574 -32344 -44358 -31611 -17430 3425 9043
15116I043k449J238O123P661R079m445j0036l7404o592K7238j2567j2015j8942
$$ 9043 6594 7832 13955 21616 30695 26250 16214 -21190 -27782 -544 -13111 -25126 -44068
15103d4068j8304K7413N0662q959j5489k4005j6686K995L6139J8796N722n736
$$ -44068 -62372 -34959 15703 6744 -8745 -32750 -49436 -46441 -10302 8494 14216 8480
15091H480J9495q860l3245q175O569R581J6733L169q414k6530M606K3538j8642
$$ 8480 27975 19115 -14130 -22305 -15736 -6155 10578 13747 5333 -21197 -16591 6947 -11695
15078a1695J8820K847K455J184j67r511j1976o461O029J1754n833j3195j196K864
$$ -11695 7125 9972 12427 13611 13444 3933 -8043 -14504 -8475 3279 -2554 -15749 -16945 -14081
15064a4081q618k8555J7334N403r7K0803r468j1599M608J7431J90j4615l188M648
$$ -14081 -22699 -51254 -33920 -28517 -28614 -7811 -17279 -28878 -24270 -6839 -6649 -21264 -24452 -19804
15050a9804J6389J5274r247k7925j9885M1372L4002k6599J0032L1882J2565l799
$$ -19804 -3415 11859 2612 -25313 -45198 -3826 30176 3577 13609 45491 58056 54257
15038E4257Q703l3917m9402j6110j2442K404K1154j0429J9630K0264M973k5276
$$ 54257 62960 29043 -20359 -36469 -48911 -46507 -25353 -35782 -16152 4112 9085 -16191
15026a6191o505l988j5257j5181K3083K8108Q898j0664j8960r422m656J177J3468
$$ -16191 -22696 -26684 -41941 -57122 -34039 -5931 2967 -7697 -26657 -36079 -40735 -39558 -26090
15013b6090M929N630o244n232L97J2043J7406n772P899J919Q126r076J2037K2544
$$ -26090 -21161 -15531 -21775 -27007 -26610 -14567 2839 -2933 4966 6885 15011 5935 17972 40516
14999D0516K0090l1486j0150m698N380J9918k4577q986J9188j8192k2026j0119
$$ 40516 60606 29120 18970 14272 19652 39570 14993 6007 25195 7003 -15023 -25142
14987b5142r464q05L280J3425J5890J2975P350O553k2896l5961L1782L1874q492
$$ -25142 -34606 -35411 -32131 -18706 -2816 10159 17509 24062 1166 -34795 -3013 28861 20369
14974B0369j5916n2607k2253K8003K0243j3546j5510J1762j0977M629j6664q694
$$ 20369 4453 -48154 -70407 -42404 -22161 -35707 -51217 -39455 -50432 -45803 -62467 -71161
14962g1161J2600R122j1382J1690R920J867J3425j1377k404J4928J646R140J6339
$$ -71161 -58561 -49439 -60821 -49131 -39211 -37344 -23919 -35296 -37700 -22772 -21126 -11986 4353
14949D353j0577j6909J924M976R707K0986J024k6485m592m2277r244P121K6574
$$ 4353 -6224 -23133 -21209 -16233 -6526 14460 15484 -11001 -15593 -57870 -67114 -59993 -33419
14936c3419K1910K163q661K110k898n708q965l1Q94L002J6491P97K7644J2558
$$ -33419 -11509 -9346 -18007 -15897 -18795 -24503 -33468 -33499 -32605 -29603 -13112 -12315 15329 27887
14922B7887k9264j2482O523j0294J4065L6145J5224j1220k1533j0756j5101k1777
$$ 27887 -1377 -13859 -7336 -17630 -3565 32580 47804 36584 15051 4295 -10806 -32583
14910c2583p297R385K4752J7361j7272j0509k329R746J2638j6176J0028J9709
$$ -32583 -39880 -30495 -5743 11618 -5654 -16163 -18492 -8746 3892 -12284 -2256 17453
14898A7453l350J687O597j2358O776k316l580J5800J704l0782l4993O94j9417
$$ 17453 14103 15790 22387 10029 16805 14489 10909 26709 28413 -2369 -37362 -36668 -56085
14885e6085o980n641q76k911J5038J1644j4483N237L3783J6383K5630M506k6483
$$ -56085 -63065 -68706 -69582 -72493 -57455 -45811 -60294 -55057 -21274 -4891 20739 25245 -1238
14872a238j1331L7837K1734J4743j7712l0309j646L218P761N010K7971J6640m107
$$ -1238 -12569 25268 47002 61745 44033 13724 12078 15296 23057 28067 56038 72678 68571
14859F8571k9042l3360k9079R524r188K506J0388J6709k7355J3350J5738m65q100
$$ 68571 39529 6169 -22910 -13386 -22574 -20068 -9680 7029 -20326 -6976 8762 8297 197
14846A97K0491J0266p607n1971l806N6747L074n0087m450K3193J1653K7009n366
$$ 197 20688 30954 23347 -28624 -32430 24317 27391 -22696 -27146 -3953 7700 34709 29343
14833B9343j6734M075j1926k5137r341J6460J7333r114J698L1858R77R12m4446
$$ 29343 12609 16684 4758 -20379 -29720 -13260 4073 -5041 -3343 28515 29492 30404 -14042
14820a4042k3744J7658J3663K591P339O701J5805j1615r14j0719M4950J0871l0939
$$ -14042 -37786 -20128 -6465 -3874 3465 10166 25971 14356 13442 2723 47673 58544 27605
14807B7605l4053n730j1539P777O411J0071k99O352j9915K6124j6231r105O83
$$ 27605 -6448 -12178 -23717 -15940 -9529 542 243 6595 -13320 12804 -3427 -12532 -11849
14794a1849N890P547N875l3664j5494L0350j1951j3681j9711R278l174L4320L06
$$ -11849 -5959 1588 7463 -26201 -41695 -11345 -23296 -36977 -56688 -47410 -50584 -16264 -15958
14781a5958j2923J7532J9354J0147j1996P722j4026m054o98j4977j7421m83j866
$$ -15958 -28881 -11349 8005 18152 6156 13878 -148 -4202 -4900 -19877 -37298 -37781 -39647
14768c9647M158p37L1937J7375k0162l301P883j1777Q293N044q974j7995L5747
$$ -39647 -35489 -36226 -4289 13086 -7076 -10377 -2494 -14271 -5978 -934 -9908 -27903 7844
14755G844J7345l799m486O320j0653R70r827q439j0907J1311J7417K22P377j0062
$$ 7844 25189 21390 16904 23224 12571 13541 3714 -4725 -15632 -4321 13096 13318 20695 10633
14741A0633k1114j7040K81O494L3677J3143l4948m2504N239K0482j227k0769L074
$$ 10633 -10481 -27521 -27240 -20746 12931 26074 -8874 -51378 -46139 -25657 -26884 -47653 -44579
14728d4579J997l973k1390Q544K1888j2759r145L5916J5285J9847k0989K313J2693
$$ -44579 -42582 -46555 -67945 -59401 -37513 -50272 -59417 -23501 -8216 11631 -9358 -7045 5648
14715E648k1166k6007O000M4879j5865k4944L871J0472j1086L590L424L280P850
$$ 5648 -15518 -41525 -35525 9354 -6511 -31455 -27584 -17112 -28198 -24608 -21184 -17904 -10054
14702a0054k1770Q220J4256J7386J4608j4210k3734o979K6430L262l5454k2931
$$ -10054 -31824 -23604 -9348 8038 22646 8436 -15298 -22277 4153 7415 -28039 -50970
14690e0970J036L5945K3569q368j8956k0982p641J130k983k8665K1107L0625O237
$$ -50970 -49934 -13989 9580 1212 -17744 -38726 -46367 -45237 -48220 -76885 -55778 -25153 -18916
14677a8916K2574o102k1718L4K226K3216M19L4646k00k3248j9143l5512l0264
$$ -18916 3658 -2444 -24162 -24128 -21902 1314 1733 36379 36179 12931 -6212 -41724 -71988
14664g1988J3347J2922L1228M862Q329p917K432Q899J1318l6421l459J6528j0855
$$ -71988 -58641 -45719 -14491 -9629 -1300 -9217 -6785 2114 13432 -22989 -26448 -9920 -20775
14651b0775P048M709M355o105L371p368j9060J8072N3745k7o703j1104J3987J4058
$$ -20775 -13727 -9018 -4663 -10768 -7397 -14765 -33825 -15753 37992 37965 31262 20158 34145 48203
14637D8203J1749k3813k4181j3340J6375j7803m870l789L9612r825J1360k011
$$ 48203 59952 36139 11958 -1382 14993 -2810 -7680 -11469 28143 18318 29678 27667
14625B7667l835k0465k0253K380K6584K0443P689l0150j7335Q360o019l766j4255
$$ 27667 23832 3367 -16886 -14506 12078 32521 40210 10060 -7275 1085 -4934 -8700 -22955
14612b2955j450j6187r795K1566R519K465p673m757J1373K2359q731l9894l962
$$ -22955 -24405 -40592 -50387 -28821 -19302 -16837 -24510 -29267 -17894 4465 -4266 -44160 -48122
14599d8122J063L505j193p584K588j7001J94K9853K3278j791L340Q688O898k389
$$ -48122 -47059 -43554 -44747 -52331 -49743 -66744 -66550 -36697 -13419 -15210 -11870 -3182 3716 1327
14585A327l365l8761k1033K4676J1773L913J9364N820j2912k7859j8608j0927
$$ 1327 -2038 -40799 -61832 -37156 -25383 -21470 -2106 3714 -9198 -37057 -55665 -66592
14573f6592p060l38J2377J2045L5131j8505L2039K4828n1701k5911M5091J6424
$$ -66592 -73652 -73990 -61613 -49568 -14437 -32942 -903 23925 -27776 -53687 -8596 7828
14561G828J8871P361m7226k4819K0600J0704o536O638m41K46K2459P389k6663
$$ 7828 26699 34060 -13166 -37985 -17385 -6681 -13217 -6579 -7020 -6774 15685 23074 -3589
14548c589k3883O255P35k3394J3527l016J5685l108j2560j3269J1352m580J0207
$$ -3589 -27472 -21217 -20482 -43876 -30349 -33365 -17680 -20788 -33348 -46617 -35265 -39845 -29638
14535b9638L189M66O739j087k0385N706K7989J7056o663L854j8635n983K3513
$$ -29638 -26449 -25983 -19244 -20331 -40716 -35010 -7021 10035 3372 7226 -11409 -17392 6121
14522F121j6316o532j539j7382q083J0246M11k103K9527J3702j1882j0430J3739
$$ 6121 -10195 -16727 -18266 -35648 -43731 -33485 -33074 -35177 -5650 8052 -3830 -14260 -521
14509e21M3717J9696l306j9344k5515p04k140j0538o856n448l648P770M1900J8996
$$ -521 43196 62892 59586 40242 14727 14023 11883 1345 -5511 -10959 -14607 -6837 35063 54059
14495E4059l0020l0565K960L6258L7807j4536j3011m9893k6910J8055K559k6544
$$ 54059 24039 -6526 -3566 32692 70499 55963 42952 -6941 -33851 -15796 -13237 -39781
14483c9781J2611L7280J1634l1178P332m911j9666m38K0147p644j6988J9921R818
$$ -39781 -27170 10110 21744 -9434 -2102 -7013 -26679 -27117 -6970 -14614 -31602 -11681 -1863
14470a863k1606k1300P214R634K9677J2920j4272k3798l5819q684L2360o643p535
$$ -1863 -23469 -44769 -37555 -27921 1756 14676 404 -23394 -59213 -67897 -35537 -42180 -49715
14457d9715N350p421K1388J7122P021l049k3190M47k3701r050J7286L2480p59
$$ -49715 -44365 -51786 -30398 -13276 -6255 -9304 -32494 -32047 -55748 -64798 -47512 -15032 -15791
14444a5791J1847J936j1421j4170J9137o83o19N359k755k3952k1955J3771K6991
$$ -15791 -3944 -2008 -13429 -27599 -8462 -9145 -9764 -4405 -7160 -31112 -53067 -39296 -12305
14431a2305M158P100j9091K407m124O366K0011j4991j243q299j8045r417R752
$$ -12305 -8147 -1047 -20138 -17731 -21855 -15489 4522 -10469 -11712 -20011 -38056 -47473 -37721
14418c7721O586j5255m895L5009m167P341K241J172J8189J1803j3744K477k4256
$$ -37721 -31135 -46390 -51285 -16276 -20443 -13102 -10861 -9689 8500 20303 6559 9036 -15220
14405a5220j2748J1134J9547j932k1308m121N30J8517J7914k5392n055L670J5826
$$ -15220 -27968 -16834 2713 781 -20527 -24648 -24118 -5601 12313 -13079 -18134 -14464 1362
14392A362M523M589K893o072q331K2659l215R03L856j2180j6399j560L3515J6603
$$ 1362 5885 10474 13367 7295 -1036 21623 18408 19311 23167 10987 -5412 -6972 26543 43146
14378D3146m397k0271j770M77r398J9469J3943k8296k3056L333j0981l368J4320
$$ 43146 38749 18478 16708 17185 7787 27256 41199 12903 -10153 -6820 -17801 -21169 -6849
14365f849J4085M365J3088n73k2819K179j1002K6630K9050l0706k2669j1641j2248
$$ -6849 7236 11601 24689 24116 1297 3476 -7526 19104 48154 17448 -5221 -16862 -29110
14352b9110j628J9552K9487k3474j5603j8230j5481M785J1783K4982K2811O850
$$ -29110 -30738 -11186 18301 -5173 -20776 -39006 -54487 -49702 -37919 -12937 9874 16724
14340A6724K0652j1764l0885j0738J797j3172l4107j868J9910K7000P370M3k3856
$$ 16724 37376 25612 -5273 -16011 -14214 -27386 -61493 -63361 -43451 -16451 -9081 -9038 -32894
14327c2894Q33O579j1545j4540J4250K2579L963j7964j7696O381K1416o160m077
$$ -32894 -32061 -25482 -37027 -51567 -37317 -14738 -10775 -28739 -46435 -40054 -18638 -24798 -28875
14314b8875J5609J6057n620j2396m245O438J4913j0818L5933K7437j7123n2049
$$ -28875 -13266 2791 -2829 -15225 -19470 -13032 1881 -8937 26996 54433 37310 -14739
14302a4739o1322J7170M0608J0001J8451R123J0581k0643o452P898K7116n651
$$ -14739 -76061 -58891 -18283 -8282 10169 19292 29873 9230 2778 10676 37792 32141
14290C2141l387j5704j0087O176J795n321j220J2882k329q016R15K0615L527J1615
$$ 32141 28754 13050 2963 9139 10934 5613 4393 17275 14946 6930 7845 28460 31987 43602
14276D3602J1050j6013k2037J3621k8285k0020k4072j8972K0342J0049L3288L1897
$$ 43602 54652 38639 16602 30223 1938 -18082 -42154 -61126 -40784 -30735 2553 34450
14264C4450l0827R575k0446L100K7691M980j8225P492J2239l0459K1224J2889
$$ 34450 3623 13198 -7248 -4148 23543 28523 10298 17790 30029 -430 20794 33683
14252C3683J9602J4836k147j3512Q246j9767p690q827l859j2787k519R437K4575
$$ 33683 53285 68121 65974 52462 60708 40941 33251 24424 20565 7778 5259 14696 39271
14239C9271p043l8765K685J2810L3245J4858j7907j8345j6904j0823J6493J3695
$$ 39271 32228 -6537 -3852 8958 42203 57061 39154 20809 3905 -6918 9575 23270
14227B3270m5970j5816K076J255N20J7232j1986k8892j058R208K377M7551q147
$$ 23270 -22700 -38516 -36440 -35185 -34665 -17433 -29419 -58311 -59369 -50161 -47784 -233 -8380
14214h380K0426J1981k1167j2565J7383j641q898J83J3206J0883J8683j4809o0980
$$ -8380 12046 24027 2860 -9705 7678 6037 -2861 -2678 10528 21411 40094 25285 -35695
14201c5695n429K3254J6812n900j2777N043J5997o426j0344l28K3009K2479k7264
$$ -35695 -41124 -17870 -1058 -6958 -19735 -14692 1305 -5121 -15465 -15793 7216 29695 2431
14188B431j6383p934q522q636L155K7459l604k011j494j2324j593K538j8974L6751
$$ 2431 -13952 -21886 -30408 -39044 -35889 -8430 -12034 -14045 -15539 -27863 -29456 -26918 -45892 -9141
14174i141O046J3849l828k1678R072j9700N511k519j5171j1470J5358K1861r977
$$ -9141 -3095 10754 6926 -14752 -5680 -25380 -19869 -22388 -37559 -49029 -33671 -11810 -21787
14161b1787L3095J9463K3125m80j2176k8823n4709k2299J5392J3364M752K3616
$$ -21787 11308 30771 53896 53416 41240 12417 -42292 -64591 -49199 -35835 -31083 -7467
14149g467n176O392p235Q70r420O311K3413J7744k4716r856j2055l6098m66J8080
$$ -7467 -12643 -6251 -13486 -12616 -22036 -15725 7688 25432 716 -9140 -21195 -57293 -57759 -39679
14135c9679L253J5361K0538j9916q185M360R207J0721k0174l606K0184M058j1874
$$ -39679 -36426 -21065 -527 -20443 -28628 -24268 -15061 -4340 -24514 -28120 -7936 -3878 -15752
14122a5752j6009j6205r11P850P926J5158J1133J1632k5588l54N113j3908J8050
$$ -15752 -31761 -47966 -48877 -41027 -33101 -17943 -6810 4822 -20766 -21120 -16007 -29915 -11865
14109a1865M070k113k2403J6475Q707m120r992k4228j4894R885O884K4853J4558
$$ -11865 -7795 -9908 -32311 -15836 -7129 -11249 -21241 -45469 -60363 -50478 -43594 -18741 -4183
14096d183Q017L166p155j2757j4534l431Q928J926j2747K8671R678j2162j1781
$$ -4183 3834 7000 -155 -12912 -27446 -30877 -21949 -20023 -32770 -4099 5579 -6583 -18364
14083a8364m544k4249k2500q714N809o983Q323L5962q830J936P100j5579o848
$$ -18364 -22908 -47157 -69657 -78371 -72562 -79545 -71222 -35260 -44090 -42154 -35054 -50633 -57481
14070e7481K6117J5815m799j2052K1004L6844j8613o507J3051l364j7016j8564
$$ -57481 -31364 -15549 -20348 -32400 -11396 25448 6835 328 13379 10015 -7001 -25565
14058b5565l3023Q647K622J9766L2907m272k3837J6960K2946K5307R925k4748
$$ -25565 -58588 -49941 -47319 -27553 5354 1082 -22755 -5795 17151 42458 52383 27635
14046B7635j5876j5112R24J033J3931J455j4915l164Q7j424l77J4324j1732Q618
$$ 27635 11759 -3353 -2429 -1396 12535 13990 -925 -4089 -4002 -5426 -5803 8521 -3211 5407
14032E407J4895m2974k3776L253o016J5839K0838o676J6230q031N929L6309j3082
$$ 5407 20302 -22672 -46448 -43195 -49211 -33372 -12534 -19210 -2980 -11011 -5082 31227 18145
14019A8145l2724J558j3001P062O404K4865J2410j4037r637l7376J0686M178j5551
$$ 18145 -14579 -13021 -26022 -18960 -12556 12309 24719 10682 1045 -36331 -25645 -21467 -37018
14006c7018j4233j0486J6641L6565R614j2014j3607j1364L8587m211j8465L077
$$ -37018 -51251 -61737 -45096 -8531 1083 -10931 -24538 -35902 2685 -1526 -19991 -16914
13994a6914P170j8889K1327L995j6932r5l533Q829q594k5921M454K6382M0571
$$ -16914 -9744 -28633 -7306 -3311 -20243 -20338 -23871 -15042 -23636 -49557 -45103 -18721 21850
13981B1850Q457Q758J4914j1741l1840l07k3630m5052K1418O837j6129q476K2770
$$ 21850 30307 39065 53979 42238 10398 10091 -13539 -58591 -37173 -30336 -46465 -54941 -32171
13968c2171M7370j4694q246P197j9366M85J508o706J9480J3080K7340j3423m4194
$$ -32171 15199 505 -7741 -544 -19910 -19425 -17917 -24623 -5143 7937 35277 21854 -22340
13955b2340k0262j5075n898L8264k984j670k1080k2658K6692R153K5040O382l734
$$ -22340 -42602 -57677 -63575 -25311 -28295 -29965 -51045 -73703 -47011 -37858 -12818 -6436 -10170
13942a0170J1424L2272k0101l066J8535j7456l4164r671K844k7012m963m015L0142
$$ -10170 1254 33526 13425 10359 28894 11438 -22726 -32397 -29553 -56565 -61528 -65543 -35401
13929c5401R241p069M3063J9232j6487M199K47p412j2314j4757N62k9364j339
$$ -35401 -26160 -33229 9834 29066 12579 16778 17025 9613 -2701 -17458 -16896 -46260 -47599
13916d7599L7198O646r009L16k3578j1966K3172K7043k1078j0943n532p305J0742
$$ -47599 -10401 -3755 -12764 -12448 -36026 -47992 -24820 2223 -18855 -29798 -35330 -42635 -31893
13903c1893K105j2322J9601K8593j204K085R042J7237o143k9814q145J1292K3072
$$ -31893 -29788 -42110 -22509 6084 4880 6965 16007 33244 27101 -2713 -10858 434 23506
13890B3506p706j8111J1557r342l2423J8935R296j193L3416m17j8100o544O352
$$ 23506 15800 -2311 9246 -96 -32519 -13584 -4288 -5481 27935 27518 9418 2874 9226
13877I226j1427l4571m208q90K9388J3896j6680j1952j6863o883J5192J4201k4909
$$ 9226 -2201 -36772 -40980 -41870 -12482 1414 -15266 -27218 -44081 -50964 -35772 -21571 -46480
13864d6480K8221K6562j3831j8899P362K5860k358n401p257J7335R492J1832j6419
$$ -46480 -18259 8303 -5528 -24427 -17065 8795 6437 1036 -6221 11114 20606 32438 16019
13851A6019R826o055m2243j1168K2505l202l635l91O052j0772k0399N878J2854
$$ 16019 25845 19790 -22453 -33621 -11116 -14318 -17953 -18344 -12292 -23064 -43463 -37585 -24731
13838b4731R675K3594k073l552M048k0617j8512l044J3960O216r793j0683Q428
$$ -24731 -15056 8538 6465 2913 6961 -13656 -32168 -35212 -21252 -15036 -24829 -35512 -27084
13825b7084J0944R551Q388l596j3012m137N158L769K5736K5989j4628l717J2808
$$ -27084 -16140 -6589 1799 -1797 -14809 -18946 -13788 -10019 15717 41706 27078 23361 36169
13812C6169j6625j5524J981K3355J4320r060j3286m777k5895J1717j3522q123
$$ 36169 19544 4020 6001 29356 43676 34616 21330 16553 -9342 2375 -11147 -19270
13800a9270M75Q313L006L959j5920Q88M4550j5779o050P373k9076n838P329N618
$$ -19270 -18795 -10482 -7476 -3517 -19437 -18549 26001 10222 4172 11545 -17531 -23369 -16040 -10422
13786a0422o392k488J4847J7760K4568K326l1134k4142r437j0689K4821K4870
$$ -10422 -16814 -19302 -4455 13305 37873 40199 9065 -15077 -24514 -35203 -10382 14488
13774A4488l881m56r77J6378j181l1907j535j7699j1798j4777K7075K2872J8973
$$ 14488 10607 10151 9174 25552 24371 -7536 -9071 -26770 -38568 -53345 -26270 -3398 15575
13761A5575J622Q861p78P096q994K315J1302K183p035j1782l1880l723j0368j691
$$ 15575 17197 26058 25280 32376 23382 25697 36999 39182 32147 20365 -11515 -15238 -25606 -27297
13747b7297J4907l029j7808Q217j3552m004J6479J9726K076Q910K5340j1533j1079
$$ -27297 -12390 -15419 -33227 -25010 -38562 -42566 -26087 -6361 -4285 4625 29965 18432 7353
13734G353j2654J7700j2164J9503j678l1760l6443J9808K8799J752J2804l327
$$ 7353 -5301 12399 235 19738 18060 -13700 -50143 -30335 -1536 216 13020 9693
13722I693j8082o522k8739j9005J8871J9245K5674m36q07k1692j5206r101J1991
$$ 9693 -8389 -14911 -43650 -62655 -43784 -24539 1135 699 -108 -21800 -37006 -46107 -34116
13709c4116q967o947J6714n738j4942Q151l788N643J1653K8935L841Q219K3128
$$ -34116 -43083 -50030 -33316 -39054 -53996 -45845 -49633 -43990 -32337 -3402 439 8658 31786
13696C1786J5788k7215l2639J3993j66k1209L5540L457J505L0806k3722j0191
$$ 31786 47574 20359 -12280 1713 1547 -19662 15878 19335 20840 51646 27924 17733
13684A7733M406k2612k5798o976o908l4717l836r275K7376L1469P590K83J9096
$$ 17733 22139 -473 -26271 -33247 -40155 -74872 -78708 -87983 -60607 -29138 -21548 -21265 -2169
13671b169L845J050j0425k6303M3030K1704m756k2087j7593M476k0773l4423L6053
$$ -2169 1676 2726 -7699 -34002 9028 30732 25976 3889 -13704 -9228 -30001 -64424 -28371
13658b8371j3895k2421J2666K0848p413p699Q306K614M7159J1538N021l2361m5102
$$ -28371 -42266 -64687 -52021 -31173 -38586 -46285 -37979 -35365 11794 23332 28353 -4008 -49110
13645d9110k2744K1024K8125j340K0782J8355q768j8155J1295J3032K043M410
$$ -49110 -71854 -50830 -22705 -24045 -3263 15092 6324 -11831 -536 12496 14539 18949
13633A8949k8442N252R050L1370K8019O8k7261n6243m072L5759K3367l6742k0700
$$ 18949 -9493 -4241 4809 36179 64198 64266 37005 -19238 -23310 12449 35816 -926 -21626
13620b1626J3328J2573K4941J85J860j2803L564K1319J2189k0193l5353l3077
$$ -21626 -8298 4275 29216 29401 31261 18458 22022 43341 55530 35337 -16 -33093
13608c3093K8047J2095k8612j5096J9890M239j0715J4095J8828k0126k5605k1899
$$ -33093 -5046 7049 -21563 -36659 -16769 -12530 -23245 -9150 9678 -10448 -36053 -57952
13596e7952j2763K6365J3361k602q358k964J9741p141K3572J4545k5854l6290
$$ -57952 -70715 -44350 -30989 -33591 -41949 -44913 -25172 -32313 -8741 5804 -20050 -56340
13584e6340M637K243J763m564j9995K8551K2427N127K0616R785k8101j1547l382
$$ -56340 -51703 -49460 -47697 -52261 -72256 -43705 -21278 -16151 4465 14250 -13851 -25398 -28780
13571b8780K0323Q044j4215j716K6736J8930l0022m3425k0703j7679Q719J687
$$ -28780 -8457 -413 -14628 -16344 10392 29322 -700 -44125 -64828 -82507 -73788 -72101
13559g2101K9473J3414J5525L3500j2631j282R372O498J2046J4339j4377j1286
$$ -72101 -42628 -29214 -13689 19811 7180 5898 15270 21768 33814 48153 33776 22490
13547B2490P039j6781p103J1149p063m573j4702n936j503k3916p077K9875L5663
$$ 22490 29529 12748 5645 16794 9731 5158 -9544 -15480 -16983 -40899 -47976 -18101 17562
13534A7562J5114j7667k0783O516L6455K9276k7730j4085L2225o4k7910k2257
$$ 17562 32676 15009 -5774 742 37197 66473 38743 24658 56883 56819 28909 6652
13522F652l1547O277L0025N456m85l3557m5013J2779K1632J8052J910j898r205
$$ 6652 -24895 -18618 11407 16863 16378 -17179 -62192 -49413 -27781 -9729 -7819 -9717 -18922
13509a8922J705J8718Q487J114L8926J6180k632k461j0893J560j6622Q97j5777
$$ -18922 -17217 1501 9988 11102 50028 66208 63576 61115 50222 51782 35160 36057 20280
13496B0280l0201K526R864m022L7998q457k0000Q096L5356j1787j0616k2465l1700
$$ 20280 -9921 -7395 2469 -1553 36445 27988 7988 16084 51440 39653 29037 6572 -25128
13483b5128J25n241K8650K4330M344J2668P107j1768k2543r154n316R723K1410
$$ -25128 -25003 -30244 -1594 22736 27080 39748 46855 35087 12544 3390 -1926 7797 29207
13470B9207K653k8027k0933n011R14R89n227l712J2054R268k880R991K6016k593
$$ 29207 31860 3833 -17100 -22111 -21197 -20208 -25435 -29147 -17093 -7825 -10705 -714 25302 22709
13456B2709l5745j3017p470K0724J6900J2888K0269J3206J0272o895j6341J292
$$ 22709 -13036 -26053 -33523 -12799 4101 16989 37258 50464 60736 53841 37500 38792
13444C8792j4691l9807J2025J6082j8653j7763J5869R035J2213L891l2586l1674
$$ 38792 24101 -15706 -3681 12401 -6252 -24015 -8146 889 13102 16993 -15593 -47267
13432d7267j5853K0917J6482J0670l898L623P128j4400M007M8642q756n203J5877
$$ -47267 -63120 -42203 -25721 -15051 -18949 -15326 -8198 -22598 -18591 30051 21295 16092 31969
13419C1969j1829j8073j1440P167J3595p053J4023n515j4292l5143j205J6841
$$ 31969 20140 2067 -9373 -2206 11389 4336 18359 12844 -1448 -36591 -37796 -20955
13407b0955K9645n440j4626K6201M051q025o13K319N332J9595K210j1291K3412
$$ -20955 8690 3250 -11376 14825 18876 10851 10238 12557 17889 37484 39694 28403 51815
13394E1815J77m4324m6824j817K5362N552l963J7553j7330l04L42K8751J1462
$$ 51815 51992 7668 -39156 -40973 -15611 -10059 -14022 3531 -13799 -14103 -13761 14990 26452
13381B6452k938K975j315j7159Q248K208k831P284l3185k2163m060J1901J0345
$$ 26452 23514 26489 25174 8015 16263 18471 15640 22924 -10261 -32424 -36484 -24583 -14238
13368a4238n316J1363j5796J3961j24k099Q808m099j2865L0267L1568k4380P1
$$ -14238 -19554 -8191 -23987 -10026 -10150 -12249 -3441 -7540 -20405 9862 41430 17050 17121
13355A7121K5113j9397j673J384J244j4932J2467J2967l289k2450j3239J4741
$$ 17121 42234 22837 21164 22548 23792 8860 21327 34294 31005 8555 -4684 10057
13343A0057m700n5215r977J7485J6047M12J4272k502m2304k2400Q492M9971K2370
$$ 10057 5357 -49858 -59835 -42350 -26303 -25891 -11619 -14121 -56425 -78825 -70333 -20362 2008
13330B008J9362J6289J1366k2353j0701P803k6882j6105n834L2222J7606m3456
$$ 2008 21370 37659 49025 26672 15971 23774 -3108 -19213 -25047 7175 24781 -18675
13318a8675j5759J6751j961n188K2241K29J5349j9779l5393J5219K0375J9341
$$ -18675 -34434 -17683 -19644 -24832 -2591 -2362 12987 -6792 -42185 -26966 -6591 12750
13306A2750P976j6654n410j3715J1974n723J1119o681j1576J1321K8828J4236
$$ 12750 20726 4072 -1338 -15053 -3079 -8802 2317 -4364 -15940 -4619 24209 38445
13294C8445l4282j2546q411j1915L486m157J517O5J3373q291n689k5979J2807
$$ 38445 4163 -8383 -16794 -28709 -25223 -29380 -27863 -27798 -14425 -22716 -28405 -54384 -41577
13281d1577m357k427J6730J1309j5031N912M569j0328M81M754K1499K3395k741
$$ -41577 -45934 -48361 -31631 -20322 -35353 -29441 -24872 -35200 -34719 -29965 -8466 14929 12188
13268A2188o803J167j3902Q740n062K542N806l1276p074J5634j6431k4054j1263
$$ 12188 5385 6552 -7350 1390 -3672 -1130 4676 -26600 -33674 -18040 -34471 -58525 -69788
13255f9788J8328q304l492K2357K9434k2654j3080N499r22L1453L82j6175K9657
$$ -69788 -51460 -59764 -63256 -40899 -11465 -34119 -47199 -41700 -42622 -11169 -10787 -26962 2695
13242B695J6905K093k5110l0424l932J9367P901j9273o512j2887k6576K5757K8228
$$ 2695 19600 21693 -3417 -33841 -37773 -18406 -10505 -29778 -36290 -49177 -75753 -49996 -21768
13229b1768K6352n348q84j321N420J4640j2029l713K2813k5273j8205R753j1664
$$ -21768 4584 -764 -1648 -2969 2451 17091 5062 1349 24162 -1111 -19316 -9563 -21227
13216b1227N458K9674M850k1527j7676r092L421N989j5886K42j6680k1302M2609
$$ -21227 -15769 13905 18755 -2772 -20448 -29540 -26119 -20130 -36016 -35774 -52454 -73756 -31147
$$ [...]
##END NTUPLES=NMR SPECTRUM
##END=
