##TITLE=Analysis number 318942
Compound Code cc 07110
Project Code adrs
Chemist Name endeavour
##JCAMPDX= 6.0         $$ Bruker NMR JCAMP-DX V2.0
##DATA TYPE= NMR SPECTRUM
##DATA CLASS= NTUPLES
##ORIGIN= Bruker BioSpin GmbH
##OWNER= nmr
$$ XWIN-NMR		Version 3.5
$$ Tue Apr 25 13:25:51 2006 GMT Daylight Time (UT+1h)  MAYBRIDGE\nmr@NMR_250MHZ
##.OBSERVE FREQUENCY= 250.131544655141
##.OBSERVE NUCLEUS= ^1H
##.ACQUISITION MODE= SIMULTANEOUS (DQD)
##.ACQUISITION SCHEME= undefined
##.AVERAGES= 16
##.DIGITISER RES= 18
##SPECTROMETER/DATA SYSTEM= dpx250
##.PULSE SEQUENCE= zg30
##.SOLVENT NAME= CDCl3
##.SHIFT REFERENCE= (INTERNAL, CDCl3, 0, 16.522)
##AUDIT TRAIL= $$ (NUMBER, WHEN, WHO, WHERE, WHAT)
$$ ##TITLE= Audit trail, XWIN-NMR		Version 3.5
$$ ##JCAMPDX= 5.01
$$ ##ORIGIN= Bruker BioSpin GmbH
$$ ##OWNER= nmr
$$ C:\u/data/dgb/nmr/ADRS/3050/pdata/1/auditp.txt
$$ ##AUDIT TRAIL=  $$ (NUMBER, WHEN, WHO, WHERE, WHAT)
(   1,<2006-04-25 13:25:25.50 +100>,<MAYBRIDGE\nmr>,<NMR_250MHZ>,
      <created by zg, POWCHK disabled, PULCHK disabled
       configuration hash MD5:
       84 BC 41 DB A1 6E 1D 46 DA 25 12 A5 C1 ED C5 3A
       data hash MD5: 64K
       35 4E 1B 75 39 C3 8B E1 5D 37 D0 04 5A 4C 85 DE>)
(   2,<2006-04-25 13:25:40.31 +100>,<MAYBRIDGE\nmr>,<NMR_250MHZ>,
      <Start of raw data processing
       ef LB = 0.3 FT_mod = 6 PKNL = 1 SI = 32K 
       data hash MD5: 32K
       F6 D2 EB 49 17 3D 58 0E 59 1E 62 1C ED 7F B9 44>)
(   3,<2006-04-25 13:25:42.05 +100>,<MAYBRIDGE\nmr>,<NMR_250MHZ>,
      <apk 
       data hash MD5: 32K
       8B 45 38 D5 1B 14 1F 68 E8 2D 4E 39 4F 43 56 93>)
(   4,<2006-04-25 13:25:42.89 +100>,<MAYBRIDGE\nmr>,<NMR_250MHZ>,
      <abs ABSG = 5 
       data hash MD5: 32K
       2C C3 AC 9E 06 63 2B F1 CB 0D AF 86 0F 63 ED DD>)
$$ ##END=
$$ 
$$ hash MD5
$$ CA A8 B5 A7 60 83 77 2F D7 E1 F0 23 46 DA FF AF
##$RELAX= 
##$RELAX= 
##$RELAX= 
##$RELAX= 
##$RELAX= 
##$RELAX= 
##$RELAX= 
$$ Bruker specific parameters
$$ --------------------------
##$DU= <C:\u>
##$EXPNO= 3050
##$NAME= <ADRS>
##$PROCNO= 1
##$TYPE= <nmr>
##$USER= <dgb>
##$AMP= (0..31)
100 100 100 100 100 100 100 100 100 100 100 100 100 100 100 100 100 100 
100 100 100 100 100 100 100 100 100 100 100 100 100 100 
##$AQSEQ= 0
##$AQ_mod= 3
##$AUNM= <au_zg>
##$AUTOPOS= <36 >
##$BF1= 250.13
##$BF2= 250.13
##$BF3= 250.13
##$BF4= 250.13
##$BF5= 500.13
##$BF6= 500.13
##$BF7= 500.13
##$BF8= 500.13
##$BYTORDA= 1
##$CFDGTYP= 0
##$CFRGTYP= 5
##$CHEMSTR= <none>
##$CNST= (0..31)
1 1 145 1 1 1 1 1 1 1 1 1 1 1 1 1 1 1 1 1 1 1 1 1 1 1 1 1 1 1 1 1 
##$CPDPRG= <>
##$CPDPRG1= <>
##$CPDPRG2= <>
##$CPDPRG3= <>
##$CPDPRG4= <mlev>
##$CPDPRG5= <mlev>
##$CPDPRG6= <mlev>
##$CPDPRG7= <mlev>
##$CPDPRG8= <mlev>
##$CPDPRGB= <>
##$CPDPRGT= <>
##$D= (0..31)
0 1 0 0 0 0 0 0 0 0.06 0 0 0 0 0 0 0.0002 0 0 0 0 0 0 0 0 0 0 0 0 0 0 
0 
##$DATE= 1145967924
##$DBL= (0..7)
120 120 120 120 120 120 120 120 
##$DBP= (0..7)
150 150 150 150 150 150 150 150 
##$DBP07= 0
##$DBPNAM0= <>
##$DBPNAM1= <>
##$DBPNAM2= <>
$$ [...]
##$SUBNAM7= <"">
##$SUBNAM8= <"">
##$SUBNAM9= <"">
##$SW= 20.6930455092707
##$SWIBOX= (0..15)
0 0 3 0 0 0 0 0 0 0 0 0 0 0 0 0 
##$SW_h= 5175.983436853
##$TD= 65536
##$TD0= 1
##$TE= 295.16
##$TE2= 300
##$TE3= 300
##$TEG= 300
##$TL= (0..7)
0 120 120 120 120 120 120 120 
##$TP= (0..7)
150 150 150 150 150 150 150 150 
##$TP07= 0
##$TPNAME0= <>
##$TPNAME1= <>
##$TPNAME2= <>
##$TPNAME3= <>
##$TPNAME4= <>
##$TPNAME5= <>
##$TPNAME6= <>
##$TPNAME7= <>
##$TPOAL= (0..7)
0.5 0.5 0.5 0.5 0.5 0.5 0.5 0.5 
##$TPOFFS= (0..7)
0 0 0 0 0 0 0 0 
##$TUNHIN= 0
##$TUNHOUT= 0
##$TUNXOUT= 0
##$USERA1= <user>
##$USERA2= <user>
##$USERA3= <user>
##$USERA4= <user>
##$USERA5= <user>
##$V9= 5
##$VALIST= <valist>
##$VCLIST= <CCCCCCCCCCCCCCC>
##$VD= 0
##$VDLIST= <DDDDDDDDDDDDDDD>
##$VPLIST= <PPPPPPPPPPPPPPP>
##$VTLIST= <TTTTTTTTTTTTTTT>
##$WBST= 1024
##$WBSW= 4
##$XGAIN= (0..3)
0 0 0 0 
##$XL= 0
##$YL= 0
##$YMAX_a= 452188
##$YMIN_a= -578121
##$ZGOPTNS= <>
##$ZL1= 120
##$ZL2= 120
##$ZL3= 120
##$ZL4= 120
##$ABSF1= 16.522
##$ABSF2= -4.171173
##$ABSG= 5
##$ABSL= 3
##$ALPHA= 0
##$AQORDER= 0
##$ASSFAC= 0
##$ASSFACI= 0
##$ASSFACX= 0
##$ASSWID= 0
##$AUNMP= <proc_1d>
##$AZFE= 0.1
##$AZFW= 0.1
##$BCFW= 0
##$BC_mod= 0
##$BYTORDP= 0
##$COROFFS= 0
##$CY= 12.5
##$DATMOD= 1
##$DC= 0
##$DFILT= <>
##$DTYPP= 0
##$F1P= 14.0000005364418
##$F2P= -0.99999901652339
##$FCOR= 0.5
##$FTSIZE= 32768
##$FT_mod= 6
##$GAMMA= 0
##$GB= 0
##$INTBC= 1
##$INTSCL= 1
##$ISEN= 128
##$LB= 0.3
##$LEV0= 0
##$LPBIN= 0
##$MAXI= 10000
##$MC2= 0
##$MEAN= 0
##$ME_mod= 0
##$MI= 0
##$NCOEF= 0
##$NC_proc= -3
##$NLEV= 6
##$NOISF1= 0
##$NOISF2= 0
##$NSP= 0
##$NTH_PI= 0
##$NZP= 0
##$OFFSET= 16.522
##$PC= 1
##$PHC0= 163.0185
##$PHC1= 9.415257
##$PH_mod= 1
##$PKNL= yes
##$PPARMOD= 0
##$PSCAL= 4
##$PSIGN= 0
##$REVERSE= no
##$SF= 250.13
##$SI= 32768
##$SIGF1= 0
##$SIGF2= 0
##$SINO= 400
##$SIOLD= 32768
##$SREGLST= <1H.CDCl3>
##$SSB= 0
##$STSI= 32768
##$STSR= 0
##$SW_p= 5175.98343685301
##$SYMM= 0
##$S_DEV= 0
##$TDeff= 65536
##$TDoff= 0
##$TI= <Analysis number 999999
Compound Code 99
Book Reference 9
Project Code 9>
##$TILT= no
##$TM1= 0
##$TM2= 0
##$TOPLEV= 0
##$USERP1= <user>
##$USERP2= <user>
##$USERP3= <user>
##$USERP4= <user>
##$USERP5= <user>
##$WDW= 1
##$XDIM= 32768
##$YMAX_p= 333160043
##$YMIN_p= -81349
$$ End of Bruker specific parameters
$$ ---------------------------------
##NTUPLES= NMR SPECTRUM
##VAR_NAME=  FREQUENCY,     SPECTRUM/REAL,   SPECTRUM/IMAG
##SYMBOL=    X,             R,               I
##VAR_TYPE=  INDEPENDENT,   DEPENDENT,       DEPENDENT
##VAR_FORM=  AFFN,          ASDF,            ASDF
##VAR_DIM=   32768,         32768,           32768
##UNITS=     HZ,            ARBITRARY UNITS, ARBITRARY UNITS
##FACTOR=    0.157963299565203, 1,           1
##FIRST=     4132.6476996994, 0,             0
##LAST=      -1043.33573715361, 0,           0
##MIN=       -1043.33573715361, -81349,      0
##MAX=       4132.6476996994, 333160043,     0
$$ Real data points
##PAGE= N=1
##DATA TABLE= (X++(R..R)), XYDATA
$$ [...]
24534A8523K633k3595j2487L177q577J657k969M879Q956J326J2958j148K085n145
24520B273j2294M214N305k650r929K848R682l407k097j587L382m658K965j601
24506g554j294J3623J2098n259j2353l307J198m86j0309J611l684o516R960O443
24492e829J4669K0575l347n566M043m376k1446r269J2120J3262r15K323n751j0526
24478c3o010j3479l06k270m554J4002Q536l367Q716O057j260L537j4654o439N304
24463f220M392m512O358N94k824Q23K780J357J650m052l513n74J918J623K521
24448B321q989j994Q589l182j3346J2344L956M338k13l580j1547j3921q932K644
24434c1512J2397J9024m888m981Q318l82j0599M322J0520l903K470j652j2028
$$ plain form
24534 18523 21156 -2439 -14926 -11749 -20326 -18669 -21638 -16759 -7803 -6477 6481 5333 7418 2273
24520 2273 -10021 -5807 -502 -3152 -13081 -10233 -551 -3958 -6055 -7642 -4260 -8918 -5953 -7554
24506 -7554 -8848 4775 16873 11614 -739 -4046 -2848 -3334 -13643 -12032 -15716 -22232 -12272 -5829
24492 -5829 8840 29415 26068 20502 24545 20169 -1277 -10546 1574 14836 13921 16244 10493 -33
24478 -33 -6043 -19522 -19828 -22098 -26652 -12650 -4114 -7481 1235 7292 6032 9569 -5085 -11524 -6220
24463 -6220 -1828 -6340 18 612 -2212 -1389 1391 2748 4398 346 -3167 -3741 -1823 -200 2321
24448 2321 -6668 -8662 -73 -3255 -16601 -4257 -301 4037 3824 244 -11303 -25224 -34156 -31512
24434 -31512 -19115 -91 -4979 -9960 -1642 -2024 -12623 -8301 2219 -1684 786 -866 -12894
24421a2894p973j446q43O760J4213M67M032N466r029p341q79N256J979J2675o497
24406C946J2635J9119j2757j9808q363L023N146j0948N579J806J3857K515j871
24393A3879O088l508j1294l984m972l662r715L913Q403K521M276j7365P026J0422
24379B028q677j2738J0708M280k971J4955J1182l219j865K412p105j1887K486
24366d11L417j5944j8082J0473L756q15q415K470J1805J3803J4724o791k0653
24353a0663r445l335j093J0870l58o84R153j90n426Q32J4250N427L131k854m188
24338E427J326M328O275j0079K206m923q672m489n547L221J0672P309j1428j2167
24324a6541N522M125J047r799j0874K884J259J2266J6246L333j439L938k519j1889
$$ plain form
24421 -12894 -20867 -22313 -23156 -16396 -2183 -1716 2316 7782 -1247 -8588 -9467 -4211 -2232 10443 3946
24406 3946 16581 35700 22943 3135 -5228 -2205 2941 -8007 -2428 -622 13235 15750 13879
24393 13879 19967 16459 5165 1181 -3791 -7453 -17168 -13255 -4852 -2331 1945 -15420 -8394 2028
24379 2028 -6649 -19387 -8679 -4399 -7370 7585 18767 15548 13683 16095 8990 -2897 -411
24366 -411 3006 -12938 -31020 -20547 -16791 -17606 -26021 -23551 -11746 2057 16781 9990 -10663
24353 -10663 -20108 -23443 -24536 -13666 -14024 -14708 -5555 -5745 -11171 -10339 3911 9338 12469 9615 5427
24338 5427 6753 11081 17356 7277 9483 4560 -4112 -8601 -14148 -10927 -255 7054 -4374 -16541
24324 -16541 -11019 -6894 -5847 -15646 -26520 -23636 -22377 -10111 6135 9468 8029 11967 9448 -2441
24310b441P296o21n913k615Q80K073n293L907J0127N274K498j858j0563j1221
24296h470J4907J5038O065J3384j333j6693j0500j1022j815P414K636q495P851
24283H967L631n299J5532P884k2519j4288J1361K012p188j834R137j6659j1941
24270b1204M172N913J928L266k618j0286J2134R416L445j1032J317J0801q176
24257i24j2163j7337q970K9092R920n683M534k988m646j526J2396r352N06j067
24243h208p395n659P137K0581J3164l760j103k830J483o169j4449m762J070r472
24229b0372m323j354J1793J8538O148o214j7138M401J0961l546j188J395j138
24216b037l64L610O69o438K072k698q80j361J9623K554p762J472R347k428K589
$$ plain form
24310 -2441 4855 4234 -1679 -4294 -3414 -1341 -6634 -2727 7400 12674 15172 13314 2751 -8470
24296 -8470 6437 21475 27540 40924 39591 22898 12398 1376 -439 6975 9611 1116 8967
24283 8967 12598 7299 22831 30715 8196 -6092 5269 7281 93 -1741 7396 -9263 -21204
24270 -21204 -17032 -11119 -9191 -5925 -8543 -18829 -6695 2721 6166 -4866 -3549 7252 -924
24257 -924 -13087 -30424 -39394 -10302 -382 -6065 -1531 -4519 -9165 -10691 1705 -7647 -7141 -8208
24243 -8208 -15603 -21262 -14125 6456 19620 15860 14757 11927 13410 7241 -7208 -11970 -10900 -20372
24229 -20372 -24695 -26049 -14256 4282 10430 4216 -12922 -8521 2440 -1106 -2294 -899 -2037
24216 -2037 -2401 1209 1878 -4560 -2488 -5186 -6066 -7427 12196 14750 6988 8460 17807 15379 17968
24201A7968m390l368Q216l559o7j245L651M330k2265K858J1553L806l019n15m827
24186I127j2331j502n949k984l382m729r113P805K0482J0152M236k3K841j939
24172A2691r85n885O593p406r569n819J2597Q231J232q824j3113M859M877l394
24158c915p339n923M857J6107Q035j151N332M63J494n996q992l814O838l208r93
24143A795P16j684O835j4896o500Q851P539l504j0035R783k961j0042j989M158
24129a1934K0353N512P609J820n199r737j4744p976o389J0090L821R417J275m692
24115g74K604j3604p44N70R412r70J6067L750j0432l1602l23J2833J5676L313
24101E776L234m455L250j626n110l465j8877j0217O967N578Q168J7422p04k546
$$ plain form
24201 17968 13578 10210 18426 14867 14800 13555 17206 21536 -729 2129 13682 17488 14469 13954 9127
24186 9127 -3204 -4706 -10655 -13639 -17021 -21750 -30863 -23058 -2576 7576 11812 11789 14630 12691
24172 12691 11706 5821 12414 5008 -4561 -10380 2217 10448 11680 2856 -10257 -5398 -521 -3915
24158 -3915 -11254 -17177 -12320 3787 11822 10671 16003 16466 17960 11964 2972 -842 5996 2788 1795
24143 1795 2511 827 7662 -7234 -13734 -4883 2656 -848 -10883 -1100 -4061 -14103 -16092 -11934
24129 -11934 8419 13931 21540 23360 18161 8424 -6320 -14296 -20685 -10595 -6774 2643 3918 -774
24115 -774 1830 -11774 -12518 -11948 -2536 -3506 12561 16311 5879 -25723 -26046 -13213 2463 5776
24101 5776 9010 4555 7805 6179 1069 -2396 -21273 -31490 -24523 -18945 -10777 6645 5941 3395
24087C395m885O889K813j0894m89m187l709o40J2647O000k177M613j0328j4593
24073a5545R013O307J4j619O384J6616J197j3023q18Q45o888k129K829J047J7297
24058B1527Q418r572j7209l405L585P147L342o3j3324o289K594r93j865L046q628
24043a1689j5828J5530J6138o347m549p275N132j946J0079N575q853j9893M649
24030a9277J5076P388m924j05j4970m602m988N920K604Q193J5096P157L899K11
24016A6678o253k4518j5873o118J7057M234O942m557j7523j515J1248M189L004
24003a3005N054K118j799m245J1621J0755o899r130k946o359m376O862Q252k090
23989f187j4957n693n433J4660K0421J3061j1649j6567k727j983K964l585j19
$$ plain form
24087 3395 -1490 5399 8212 -2682 -3171 -7358 -11067 -11707 940 6940 4763 9376 -952 -15545
24073 -15545 -6532 -225 -211 -1830 4554 21170 22367 9344 8526 9371 2483 354 3183 4230 21527
24058 21527 29945 20373 3164 -241 3344 10491 13833 13770 446 -5843 -3249 -4242 -6107 -3061 -11689
24043 -11689 -27517 -11987 4151 -2196 -6745 -14020 -8888 -10834 -755 4820 -4033 -23926 -19277
24030 -19277 -4201 3187 -1737 -1842 -16812 -21414 -26402 -20482 -17878 -9685 5411 12568 16467 16678
24016 16678 10425 -14093 -29966 -36084 -19027 -14793 -7851 -12408 -29931 -31446 -20198 -16009 -13005
24003 -13005 -7951 -5833 -7632 -11877 -256 10499 3600 -5530 -8476 -14835 -19211 -12349 -4097 -6187
23989 -6187 -21144 -26837 -32270 -17610 2811 15872 4223 -12344 -15071 -17054 -14090 -17675 -17794
23976a7794r05L042o726J0459R219N81p339n186k880N879m124l748j779l4k093
23961b3428j326n880O025J0351J4744J7201K46j3063j6732m744Q527K835K2686
23948A7442N800j931L43j2814R28N356k498p646r606L010J7892j127m216N895
23934A6828n214j5135l026k507M497j726r373l680M880L662p562K118J3595Q216
23920E573K825j2199n925J4708J0468n476l463K479R701K819l910n803j876j0720
23906g99O291l048l984O62M512r457k699M563q265N809K1073M043j877p825M395
23891A3394R535j6522j5790J1705k817m256K587j1392l749J2154J2262p410j6113
23878a6412J6099J2553P407p612K545n682N950J803k239p572n764j8473o726J9862
$$ plain form
23976 -17794 -18699 -15657 -22383 -11924 -2705 -2124 -9463 -14649 -17529 -11650 -15774 -19522 -21301 -21335 -23428
23961 -23428 -24754 -30634 -24609 -14258 486 17687 17933 4870 -11862 -16606 -8079 -5244 17442
23948 17442 23242 21311 21654 8840 9768 15124 12626 4980 -4626 -1616 16276 15149 10933 16828
23934 16828 11614 -3521 -6547 -9054 -4557 -6283 -15656 -19336 -14456 -10794 -18356 -16238 -2643 5573
23920 5573 8398 -3801 -9726 4982 15450 9974 6511 8990 18691 21510 17600 11797 9921 -799
23906 -799 5492 2444 -1540 -878 3634 -5823 -8522 -3959 -12224 -6415 14658 18701 16824 8999 13394
23891 13394 22929 6407 -9383 2322 -495 -4751 -2164 -13556 -17305 -5151 7111 -299 -16412
23878 -16412 -313 12240 19647 12035 14580 8898 14848 16651 14412 6840 1076 -17397 -24123 -4261
23864d261N916j3874n955j045Q571N140p257J099P370p494j2537K435J6368R393
23850C869j4912j2104J0948L405l393m969M981J386M372J1946Q767N182k0892
23837a414M85o121r784N974R399m09N876N532N733Q461l68O646o940j1961j1286
23822a77k81K432j377M91j462L182L598j54k242m801M836l949Q083j5611j084
23807h516K917Q633P912O999L304r279j1442j7162J594J9757M473L848l87p033
23793E618N237q09k84j890r919l958N683N775Q40o580k0540l022m635N783O201
23778a6500R10P485O29J0627n827p913j0897Q108M23R70M726P467j1313J1488
23764C83J1528j2045r430k2074j678K702J62J4708J1493M198M923j3627m666p126
$$ plain form
23864 -4261 1655 -12219 -18174 -19219 -10648 -5508 -12765 -11666 -4296 -11790 -24327 -21892 -5524 3869
23850 3869 -11043 -23147 -12199 -8794 -12187 -17156 -12175 -10789 -6417 5529 14296 19478 -1414
23837 -1414 -929 -7050 -16834 -10860 -1461 -1870 4006 9538 15271 23732 23364 30010 23070 11109 -177
23822 -177 -458 1974 597 1088 -374 2808 6406 6252 4010 -791 4045 96 8179 -7432 -8516
23807 -8516 -5599 3034 10946 17945 21249 11970 528 -16634 -15040 4717 9190 13038 12651 5618
23793 5618 10855 10046 9762 7872 -2047 -6005 -322 5453 6293 -287 -20827 -23849 -28484 -22701 -16500
23778 -16500 -15590 -8105 -7476 3151 -2676 -10589 -21486 -13378 -12955 -11985 -7259 208 -11105 383
23764 383 11911 -134 -9564 -31638 -33316 -30614 -30452 -15744 -4251 -53 4870 -8757 -13423 -20549
23750b0549o4O601M319P138l835j6630j2909K919J2094J167L169J0722P806k071
23736a23o421O073n465P50K0069J402J2746N959q005l735p759j2587R633L888
23722A6425p429o17n952j6827J0705J6061J0370m490j1945j0446n68K1387R048
23709B5722q169q069m865j826n464m78r371p81l36J3748J7960N584m510j2416
23695F729n715l846j038j0326o023K185l515L426M996k867q597m751j1398J7014
23681b3726L220n455K221k623J6211J2845k462l435L406j1346Q087J0541j0573
23668c089j537J1224J2287j3004j262P03j506o288J902N760k489o038j232K499
23654b070j659L026o228o355O65J5325L195j0456j7871M101P459M642k404p507
$$ plain form
23750 -20549 -20613 -14012 -9693 -2555 -6390 -23020 -35929 -33010 -20916 -19749 -16580 -5858 1948 -123
23736 -123 -6544 -471 -5936 -5186 14883 16285 29031 34990 26985 23250 15491 2904 12537 16425
23722 16425 8996 8379 2427 -14400 -3695 12366 22736 18246 6301 -4145 -4713 16674 25722
23709 25722 17553 9484 4619 2793 -2671 -3149 -12520 -13301 -13637 111 18071 23655 19145 6729
23695 6729 1014 -2832 -3870 -14196 -20219 -18034 -21549 -18123 -13127 -15994 -24591 -29342 -40740 -23726
23681 -23726 -20506 -25961 -23740 -26363 -10152 2693 231 -3204 202 -11144 -3057 7484 -3089
23668 -3089 -4626 6598 18885 5881 4619 5322 3816 -2472 -570 5190 2701 -3337 -4569 -2070
23654 -2070 -3729 -703 -6931 -13286 -12621 2704 5899 -4557 -22428 -18327 -10868 -6226 -8630 -16137
23640a6137o13P491N878n633m074K826J193j1783m569P192K232M242m247P582
23626h420J0021P021J406n334K597q948j0628K0056P568j0037k269o823n152J1464
23612B522L992j5164j2986P172K146N189J1386J5648j5500j1820R97l199r379
23599a8996J3696J1570J5325q310j1317j6778o060O776J2274R324q888o799L75
23586g808L910J1673r429J300q748Q027L144j0626j17p584J9188j694p879P333
23572F90K79o627p143m894L397M805R124j4564j1336M9P294J4996q291k3515n834
23557d1570Q746K5735J9217o463q987O556O4j238L7Q959n323p981L488M964J954
23542H158p616q654p695J2869l993r067l861M173O74M378J0345J2779j0095m097
$$ plain form
23640 -16137 -16750 -9259 -3381 -9014 -13088 -10262 -9069 -20852 -25421 -18229 -15997 -11755 -16002 -8420
23626 -8420 1601 8622 10028 4694 7291 -1657 -12285 7771 15339 5302 3033 -3790 -8942 2522
23612 2522 6514 -8650 -21636 -14464 -12318 -7129 4257 19905 4405 -7415 -6418 -9617 -18996
23599 -18996 -5300 6270 21595 13285 1968 -14810 -20870 -14094 -1820 7504 -1384 -8183 -7808
23586 -7808 -3898 7775 -1654 -354 -9102 -1075 2069 -8557 -8674 -16258 2930 1236 -6643 690
23572 690 969 -5658 -12801 -17695 -14298 -9493 -369 -14933 -26269 -26220 -18926 -3930 -12221 -35736 -41570
23557 -41570 -32824 -7089 12128 5665 -3322 3234 3298 2060 2097 11056 5733 -2248 1240 6204 8158
23542 8158 542 -8112 -15807 -2938 -6931 -15998 -19859 -15686 -15012 -10634 -289 12490 2395 -1702
23528a702k913j0282O763P950O01J430J620R274r530p782p495P875K229m994q569
23513a5525K503J1846Q464o561j0099R77J0447k447j963n462p497M893N990K346
23499b088q742O614M128l306J481M758L931N315L954o219p558q699j901o747k047
23484a7126J1255J2190m891j2541N608J1807Q419K414j5972j2519k24Q730p151
23471a0001p201n539L574O245r02J1152l510k597n245J2433M034k429l057p997
23457a1040J430l646Q559N701P727k449o020N609k451J1771J1445j6442k2181
23444a1987r752J3222M588J897P35k896M955P204M191l319r740n607J3663M546
23430A1700j7890j4067M973J9493J4119j0380r296q675k0812j3563L434Q361J1198
$$ plain form
23528 -1702 -4615 -14897 -8134 -184 417 1847 3467 12741 3211 -4571 -12066 -4191 -1962 -6956 -15525
23513 -15525 -13022 -1176 7288 727 -9372 -8395 2052 -395 -2358 -7820 -15317 -10424 -4434 -2088
23499 -2088 -10830 -4216 -88 -3394 -1913 2845 6776 12091 16045 9826 2268 -6431 -8332 -15079 -17126
23484 -17126 -5871 6319 1428 -11113 -5505 6302 14721 17135 1163 -11356 -11580 -2850 -10001
23471 -10001 -17202 -22741 -19167 -12922 -13824 -2672 -6182 -8779 -14024 -1591 2443 14 -3043 -11040
23457 -11040 -9610 -13256 -4697 1004 8731 6282 262 5871 3420 15191 26636 10194 -11987
23444 -11987 -21739 -8517 -3929 -2032 -1297 -4193 762 7966 12157 8838 -902 -6509 7154 11700
23430 11700 -6190 -20257 -15284 4209 18328 7948 -1348 -10023 -30835 -44398 -40964 -32603 -21405
23417b1405K6506R797j4185M62q768M86J0967L978k405j4307M269l181j5534m205
23403b7525J2614J4591K724O907L172J471q069o710M929o099j5938k929p276R367
23389a8771K0576N577o23j54L903q701m335J0579l273k3683j3006p41P524R794
23375a5334r877J080o28L954R393M186M803P464J539N227m076L87O729q11o385
23360G651P026J5231j0791j5156k028R919M018o772m909N311m402n833P681O905
23346A3851j4982N478R832k901Q955j6657j6946p400l056O16r876j4752P876K2807
23332a7155P400j759n68J3530J1656j1150j5912k513J0640R302j1061P740K271
23319B421j3650M750J1105K655o943p197j30j174n102n915O68j770n020J8619
$$ plain form
23417 -21405 5101 14898 713 1175 -7593 -7107 3860 7838 5433 -8874 -4605 -7786 -23320 -27525
23403 -27525 -14911 -320 2404 9311 12483 13954 5885 -825 4104 -1995 -17933 -20862 -28138 -18771
23389 -18771 1805 7382 6759 6605 10508 1807 -2528 8051 4778 -18905 -31911 -32652 -25128 -15334
23375 -15334 -25211 -24131 -24759 -20805 -11412 -7226 -2423 5041 6580 11807 7731 8118 14847 14036 7651
23360 7651 14677 29908 19117 3961 1933 11852 15870 9098 4189 9500 5098 -735 6946 13851
23346 13851 -1131 4347 14179 11278 20233 3576 -13370 -20770 -23826 -23210 -33086 -47838 -39962 -17155
23332 -17155 -9755 -11514 -12082 1448 13104 1954 -13958 -16471 -5831 3471 -7590 150 2421
23319 2421 -11229 -6479 4626 7281 338 -6859 -6989 -8163 -13265 -19180 -18512 -20282 -25302 -6683
23305f683R541o186o164P15m939L944J4013l907r229J655M174L785j1314l14R627
23290a282l098m991k1970j1414L26R678O555j518J5382Q779K725L787n134j2096
23276a4271j0572L178P477n280k494j968J4995J1455k214j0571k925J7026R193
23263A3029l553p652J1086m2m345J700k0646r368J0299N559J6889L4n267m76R74
23248H221Q147k761j4628J005J1179O951j4361j3530j4812n389J1576q394J3269
23235a3527J7146J2920J2886k2785j4068K397j41l294M441J5200P892j2890m998
23222A179J5227J529m76J354O600m367r796j5839k613M670q497l56J0435N821
23208D871K125M924n467M166k24m057l902o108J0641J6427Q055k747j7753j4310
$$ plain form
23305 -6683 2858 -3328 -9492 -8777 -13716 -9772 4241 334 -8895 -7240 -3066 719 -10595 -10909 -1282
23290 -1282 -4380 -9371 -31341 -42755 -42429 -32751 -26196 -27714 -12332 -3553 -828 2959 -2175 -14271
23276 -14271 -24843 -21665 -14188 -19468 -21962 -23930 -8935 2520 306 -10265 -13190 3836 13029
23263 13029 9476 1824 12910 12868 8523 10223 -10423 -19791 -9492 -3933 12956 12990 7723 7247 8221
23248 8221 16368 13607 -1021 -16 11163 18114 3753 -9777 -24589 -29978 -18402 -26796 -13527
23235 -13527 3619 16539 29425 6640 -7428 -5031 -5172 -8466 -4025 11175 19067 6177 1179
23222 1179 16406 17935 17459 18813 25413 21046 11250 -4589 -7202 -2532 -11029 -11385 -950 4871
23208 4871 6996 11920 6453 10619 10395 6338 2436 -3672 6969 23396 31451 28704 10951 -3359
23194c359l948n873m387J0762N439Rr975J87L916K496M215R703J5695p038j7143
23179F99p537j1657M052k208o732J2617L839j3063J1920m733m719P337L80l525
23165a3330q991J2885R448J898j0967q904R796J3920J0866l599K07k239j5711
23152d721q601K666J3481r437m991J3439q850J598l148o458J0844J7110o476r494
23138c038j2319J222J5005p819j873K427k550N340n731n740O735K577R56J9280
23124A4472K982k279L485l869m828p474j1995n748K513l95J0105N177M991j921
23110E216J531k845J02r348o582j471O89O465J4213O370k323N652O709m525p140
23095A2713n514p664K361R728J8914K598k9675q108P586r799j871L116M459Q692
$$ plain form
23194 -3359 -7307 -13180 -17567 -6805 -1366 -1357 -11332 -11145 -7229 -4733 -518 9185 24880 17842 699
23179 699 -6838 -18495 -14443 -16651 -23383 -10766 -6927 -19990 -8070 -12803 -17522 -10185 -9805 -13330
23165 -13330 -22321 -9436 12 1910 -9057 -17961 -8165 5755 16621 13022 13229 10990 -4721
23152 -4721 -13322 -10656 2825 -6612 -11603 1836 -7014 -5416 -8564 -15022 -4178 12932 6456 -3038
23138 -3038 -15357 -14135 870 -6949 -8822 -6395 -8945 -3605 -9336 -15076 -8341 -5764 -4808 14472
23124 14472 17454 15175 18660 14791 9963 2489 -9506 -15254 -12741 -13136 -3031 2146 7137 5216
23110 5216 6747 3902 4004 -5344 -11926 -13397 -12708 -6243 7970 14340 12017 17669 24378 19853 12713
23095 12713 7199 -465 1896 11624 30538 33136 3461 -4647 2939 -6860 -8731 -5615 -1156 7536
23081G536J1795n234j552j1214K861J5972n245j091l803N797m81j9296o363M423
23067e895O766J2632O096p428n266j0129O378J462m329n010P239q288J2722K845
23053I795m085m474n617n485L151N676J654J786J095J984M435l118J437j1991
23039c757M039O241Q43K687K005j199J0033o04k0943j5432j2322K234N018Q683
23025a2474R029J467n67k883K172j6312j7876M671J3494N34J439M115j5702j532
23011c0425K6044K1855J72j0371K599K064o049l339J570K473q646q635k748N680
22997g756j355K652j989k763M395o675J529O303J6031m574r670j2402j139J0699
22983f714M700M478L151n225l559k391j152j955Q061k828n320n416p49j5470J040
$$ plain form
23081 7536 19331 14097 12545 1331 4192 20164 14919 13828 10025 15822 15341 -3955 -10318 -5895
23067 -5895 871 13503 19599 12171 6905 -3224 3154 4616 287 -4723 2516 -5772 6950 9795
23053 9795 5710 1236 -4381 -9866 -6715 -1039 615 2401 3496 5480 9915 6797 8234 -3757
23039 -3757 282 6523 7366 10053 12058 10859 20892 20288 -655 -16087 -28409 -26175 -21157 -12474
23025 -12474 -3445 -1978 -2545 -5428 -3256 -19568 -37444 -32773 -19279 -18745 -17306 -13191 -28893 -30425
23011 -30425 -4381 17474 17646 7275 9874 11938 5889 2550 4120 6593 -2053 -10688 -13436 -7756
22997 -7756 -9111 -6459 -8448 -11211 -6816 -13491 -11962 -5659 10372 5798 -3872 -16274 -17413 -6714
22983 -6714 -2014 2464 5615 390 -3169 -5560 -6712 -8667 -606 -3434 -8754 -14170 -14919 -30389 -29349
22968b9349J2317M144L626j90r290j564M76P850r047J8949Q832p062n110M137
22954a281l858m609m188Q795K066l257k054Q930l231Q599J1037j2263j2828N322
22940b820m57M070M324o204J3847N56l268j1648j5735j702J7570k767j5774O698
22926a3310J3159M162k235K1n278R231J3261j3958j5894j7149P706M289j4427
22913c0422R349J2335l406J1851J2005J208l377p334j4344N39K445m962N515J6600
22899H002J1639P952j7792j3965o702L723o866N142M027J103P828r14m001l094
22885c918K1224l530k327l799j1974j488q423j1919J0502R412J2750N945q769
22872C686k262K630N580R54k399m057p269N864Q779o732M689J1384j0985j1384
$$ plain form
22968 -29349 -17032 -12888 -9262 -9452 -18742 -20306 -19830 -11980 -21027 -2078 6754 -308 -5418 -1281
22954 -1281 -5139 -9748 -13936 -5141 -3075 -6332 -8386 544 -2687 5912 16949 4686 -8142 -2820
22940 -2820 -3277 793 5117 -1087 12760 13316 10048 -1600 -17335 -19037 -1467 -4234 -20008 -13310
22926 -13310 -151 4011 1776 1797 -3481 5750 19011 5053 -10841 -27990 -20284 -15995 -30422
22913 -30422 -21073 -8738 -12144 -293 11712 12920 9543 2209 -12135 -11596 -9151 -14113 -8598 8002
22899 8002 19641 27593 9801 -4164 -10866 -7143 -14009 -8867 -4840 -3737 4091 3177 -824 -3918
22885 -3918 17306 13776 11449 7650 -4324 -5812 -14235 -26154 -15652 -6240 6510 12455 3686
22872 3686 1424 4054 9634 10588 8189 4132 -3137 2727 11506 4774 9463 20847 9862 -1522
22858a522K1J576r135j1065O696J3461k443j3345o819L849K456N116j245j251
22844a3650m486O175N489J0404n366k951J871L830K132P719j5472k0365o291K3935
22830g026R659P125n162j1060j8237l527J8232P816j2881o341L122R303J0599
22817A622M582k627P515O574k920j6115k700j391N874r719o685p100R448P532
22803f110R158m405m290o682J2258k256L762q652p931J1515m009O730L741j0665
22789g836j2591J5414J7132R234j4746j9152o931N130K579L707K139M139J497
22776b85n503L179R451q800j3022j1934k840K1187o402o100Q132j465j868K116
22762a4154P843R202L020j8516j1090L100J3136O396q155LM02l947k697J9434
$$ plain form
22858 -1522 -1501 75 -9060 -20125 -13429 32 -2411 -15756 -22575 -18726 -16270 -11154 -12399 -13650
22844 -13650 -18136 -11961 -6472 3932 -1434 -4385 -2514 1316 3448 11167 -4305 -24670 -30961 -7026
22830 -7026 2633 9758 4596 -6464 -24701 -28228 -9996 -2180 -15061 -21402 -18280 -8977 1622
22817 1622 6204 3577 11092 17666 14746 -1369 -4069 -5460 414 -9305 -15990 -23090 -13642 -6110
22803 -6110 3048 -1357 -5647 -12329 -71 -2327 1435 -7217 -15148 -3633 -7642 -912 2829 -7836
22789 -7836 -20427 -5013 12119 21353 6607 -12545 -19476 -14346 -11767 -8060 -5921 -1782 -285
22776 -285 -5788 -2609 6842 -1958 -14980 -26914 -29754 -8567 -14969 -21069 -12937 -14402 -16270 -14154
22762 -14154 -6311 2891 5911 -12605 -23695 -20595 -7459 -1063 -9218 -9215 -8813 -12760 -15457 3977
22748C977J8998q229p311J347p409K705M595L462K983p91M076m179j2842N96k542
22733e64j7143m189Q233K302m48n797N844K145J3339k384j6850k08M176O605l775
22718h714o8m259J2975K955p199M973l232q411o18P098M877k3513p878J6810J7758
22703C554l587l047l570O617J4195M261j3988q97o781n014q116n113J2030J700
22689g756j451q285m184J4103J554J998k8q038M528N610q471j0491n39j002N917
22674a6535R030j613J3635O43n683L260J611j050k256j7441j2245J24r023m335
22660d1878N465P736L190N256M522P218L029K359m618q829J1117P350l563J630
22646a6m526k606J3008J343k892l635R973j1970n460l595n927P668m033M135Q536
$$ plain form
22748 3977 22975 14746 7435 8782 1373 4078 8673 12135 15118 14327 18403 14224 1382 1978 -564
22733 -564 -17707 -21896 -13663 -11361 -11809 -17606 -11762 -9617 3722 1338 -15512 -15720 -11544 -4939 -8714
22718 -8714 -8782 -13041 -66 2889 -4310 663 -2569 -10980 -11598 -4500 377 -23136 -31014 -14204 3554
22703 3554 -33 -3080 -6650 -33 14162 18423 4435 3538 -3243 -8257 -16373 -21486 -9456 -7756
22689 -7756 -9207 -17492 -21676 -7573 -6019 -4021 -4049 -12087 -7559 -1949 -10420 -20911 -21450 -22452 -16535
22674 -16535 -7505 -9118 4517 5160 -523 2737 4348 3298 1042 -16399 -28644 -28520 -37543 -41878
22660 -41878 -36413 -28677 -25487 -20231 -15709 -8491 -5462 -3103 -7721 -16550 -5433 1917 -1646 -16
22646 -16 -4542 -7148 5860 7203 4311 676 10649 -1321 -6781 -10376 -16303 -8635 -12668 -8533 3
22631CP047k0172j1577P144J3254J079M849n204m65j3395q79Q248J4128K229n494
22616G95q121j308J9344P656m155k102j8979K248J461Q0L676j4895J0986J2720
22602I406N81N053p055K297j2552m297k896k176R209o587n653o362N688M277Q291
22587b776J135L259J219n432n423o769M263O157k913k084J0845Q418q392J097
22573B604Q927k74L174k766j4742q724K4007P885j3873J198j2892j9000o767J1986
22559a9257N237Q460L674J0950p100j3638j0642r313J1594J4648M322J3480J772
22546A4187q466r918m734L991J4639m179Q33J3247J192K471L225r161r044q545
22532b62M448M017l840J4724N697j5543j1081J492J0953J2891n524j3480j3762
$$ plain form
22631 3 7050 -13122 -24699 -17555 -4301 -3222 1627 -3577 -4042 -17437 -18316 -10068 4060 6289 795
22616 795 -7326 -8634 10710 18366 14211 12109 -6870 -4622 -3161 -3081 595 -14300 -3314 9406
22602 9406 9987 15040 7985 10282 -2270 -6567 -9463 -11639 -2430 -9017 -14670 -21032 -15344 -11067 -2776
22587 -2776 -1641 1618 2837 -2595 -8018 -14787 -10524 -4367 -7280 -9364 1481 9899 1507 2604
22573 2604 11531 11257 14431 11665 -3077 -11801 12206 20091 6218 7416 -5476 -24476 -31243 -19257
22559 -19257 -14020 -5560 -1886 9064 1964 -11674 -22316 -31629 -20035 -5387 -1065 12415 14187
22546 14187 5721 -4197 -8931 -4940 9699 5520 6353 19600 20792 23263 26488 17327 8283 -262
22532 -262 4186 8203 4363 19087 24784 9241 -1840 -348 10605 23496 17972 4492 -9270
22519i270J1527N633O361J2282p327l219r312l987L077r872R287l361j0565k225
22505a0971j1143K664L903R862R817j230k170j5770o649M594R93Q896k813J588
22491h429M250q267J0843J5897j1175l461k465k1526J1537M209M327P135K533
22478E408q431j4356m382j505L993J2296J1566k614j0773O265J6106j0789j3741
22465a0957q838j595J3351J0517j017M233J0209P507n08r646j2989p637j2294
22452a9664l791K716P60r169R607N968j324k264l570k099K4164J8724r972j3814
22438c728J468J3261n034m970K974J080O472l439m603j6001L486k359N088N200
22424a105M769J0189K923j9005n701Q934J852k98J7435k620j5676j9746j0769
$$ plain form
22519 -9270 2257 7890 14251 26533 19206 15987 6675 2688 5765 -4107 5180 1819 -8746 -10971
22505 -10971 -22114 -19450 -15547 -5685 4132 2902 732 -15038 -21687 -17093 -16100 -7204 -10017 -8429
22491 -8429 -4179 -12446 -1603 14294 3119 -342 -2807 -24333 -12796 -8587 -4260 2875 5408
22478 5408 -3023 -17379 -21761 -23266 -19273 -6977 4589 1975 -8798 -2533 13573 2784 -10957
22465 -10957 -19795 -21390 -8039 2478 1461 5694 15903 23410 22902 13256 267 -7370 -19664
22452 -19664 -23455 -20739 -19979 -29148 -19541 -13573 -14897 -17161 -20731 -22830 1334 20058 10086 -3728
22438 -3728 -2260 11001 5967 997 3971 5051 11523 8084 3481 -12520 -9034 -11393 -6305 -1105
22424 -1105 3664 13853 16776 -2229 -7930 1004 2856 2558 19993 17373 1697 -18049 -28818
22411b8818j856J5639J7273P329k817J640J0744k679q746l973j6023o786J4405
22398d668J3028J2625K156R32N790j2944j3616l682n785o91P574O016j968r99
22384C768J0082m348j3405K512M236k138n301j0802J237J4504O368r93n249l561
22370c090J983l790m242m69Q940K296P087j1727j5996o453J7680M943M441Q728
22356A0331J9060j9487j5448q966k893J4393o359j0210l935J1270K0319j999j2294
22343f218J3081o494n304p783m037j117J340p453j2932N307Q263R946R283O919
22329B801K411M697k344J872r540j3628K145J463M755N958o210J3570N027K29
22315A3206p666j2258Q643r64j0584m777J3634M822L948N604l166j1722J1668
$$ plain form
22411 -28818 -30674 -15035 2238 9567 6750 8390 19134 16455 7709 3736 -12287 -19073 -4668
22398 -4668 8360 20985 23141 24073 29863 16919 3303 -379 -6164 -6855 719 6735 4767 3768
22384 3768 13850 9502 -3903 -1391 2845 707 -4594 -15396 -14159 345 6713 5720 471 -3090
22370 -3090 -1107 -4897 -9139 -9608 -668 1628 8715 -3012 -19008 -25461 -7781 -2838 1603 10331
22356 10331 29391 9904 -5544 -14510 -17403 -3010 -9369 -19579 -23514 -12244 8075 6076 -6218
22343 -6218 6863 369 -4935 -12718 -16755 -17872 -16532 -23985 -36917 -31610 -23347 -13401 -4118 2801
22329 2801 5212 9909 7565 9437 -103 -13731 -11586 -10123 -5368 590 -5620 7950 12977 13206
22315 13206 5540 -6718 1925 961 -9623 -14400 -766 4056 8004 13608 10442 -1280 10388
22302A0388O174O44j4841k652J7361L758K056q382p457j8631Q367J8717l276k365
22288I861j6620P351L674j0134L736M262j019p75J922M277q271j38m272J1458
22274E312K009p000J042K1446p026j5270k86J263J4302K589r337j4097P039M770
22260F756o320o526n270m081Q550k970l427j080P401j875q380K2400P748j5700
22246b774o942J8490J4472n306o463o079l321q385k224J978q61L419l503l405
22232a0904P096J535L877k77o313Q081N618Q60o717n223j3597l349J641n391K621
22217b0442P129j1576p761l968J3566R760J434k624N560M482k862M443k683J1001
22203E459J2773J0535q730j6291j4730j1844R815o204J3708J1380m596l803j120
$$ plain form
22302 10388 16562 17206 2365 -287 17074 20832 22888 14506 7049 -11582 -3215 15502 12226 9861
22288 9861 -6759 592 4266 -5868 -2132 2130 1111 336 2258 6535 -1736 -1874 -6146 5312
22274 5312 7321 321 1363 22809 15783 513 227 1490 15792 18381 9044 -5053 1986 6756
22260 6756 436 -6090 -11360 -15441 -6891 -9861 -13288 -14368 -6967 -8842 -17222 5178 12926 -2774
22246 -2774 -9716 8774 23246 17940 11477 5398 2077 -6308 -8532 -6554 -7415 -3996 -7499 -10904
22232 -10904 -3808 -2273 1604 1327 -4986 3095 8713 9573 2856 -2367 -15964 -19313 -17672 -23063 -20442
22217 -20442 -13313 -24889 -32650 -36618 -23052 -13292 -11858 -14482 -8922 -4440 -7302 -2859 -5542 5459
22203 5459 18232 28767 20037 3746 -10984 -22828 -13013 -19217 -5509 5871 1275 -2528 -3648
22190c648R725Q312R31j0136j4444J6103J1018k3921m726O446q98n363N243J5086
22176I728L578J770j6198j2074J390J8232q310j1597O812P629q455o156j2822
22163b6473K240J5606M439M020J8624L832j7801J0285M679P761j3604n994J0524
22150A8138J656O96n536m805j279j5749J0246M773j991J1201j1876O180r27j734
22136H993j8386l477o02J526J0849K789J507j1130r362K483m477R726J0103P930
22122H472R00K790L653m879k400J178M396j4764J2160K0278l301l902n020o96
22108A8865N635Q583p299p48j4611j6164m370O688L489J3667K99p338J823m632
22094C887l798n483M966k251K339j607j4930j963K833J5271J5243O6j3956n576
$$ plain form
22190 -3648 6077 14389 15320 5184 -9260 6843 17861 -6060 -10786 -4340 -5238 -10601 -5358 9728
22176 9728 13306 15076 -1122 -13196 -11806 6426 -1884 -13481 -6669 960 -7495 -13651 -26473
22163 -26473 -24233 -8627 -4188 -168 18456 22288 4487 14772 19451 27212 13608 7614 18138
22150 18138 19794 20490 14954 10149 8870 -6879 3367 8140 6149 17350 5474 11654 10727 8993
22136 8993 -9393 -12870 -13472 -11946 -1097 1692 3199 -7931 -17293 -14810 -19287 -9561 542 8472
22122 8472 9372 12162 15815 10936 8536 9714 14110 -654 11506 31784 28483 24581 19561 18865
22108 18865 24500 33083 25784 25036 10425 -5739 -10109 -3421 68 13735 14034 6696 8519 3887
22094 3887 89 -5394 -428 -2679 -340 -1947 -16877 -18840 -16007 -736 14507 14573 617 -4959
22080d959K139K76q053N56K852O365j0460P12J4479J2755J3881n45k0988k4054
22066a5044j5368J0844K342N210K242l756r87P641J1081M263J0447M92j3115L484
22052I776k470l656k981J2944J2421R664K3105K7663l173j5875j3879j4089o647
22039C2803K012l504j325J3258L322K4458M8691M0870J9585J0386p867m4042m5118
22026I3529j4404j3250k7187j7856r168j155O960N539J2051L1137L2291J3975
22014A12462j7266p737M953R131Q934L02l0498k9355j6203j62L077n722N418M208
22000D1542J4367L0643L2404L2168K3656J9422l0011n1255l5162j6044L699j4836
21988E0593j03J0407o429Q024J8952K9770P624j0028o624k4683k3945k0133Q454
$$ plain form
22080 -4959 -2820 -2544 -10597 -10041 -7189 -824 -11284 -10572 3907 16662 30543 29998 9010 -15044
22066 -15044 -30412 -19568 -17226 -12016 -9774 -13530 -14517 -6876 4205 8468 18915 19407 6292 9776
22052 9776 7306 3650 669 13613 26034 35698 58803 86466 83293 67418 53539 39450 32803
22039 32803 34815 31311 29986 43244 46566 71024 119715 160585 180170 190556 182689 138647 93529
22026 93529 79125 65875 38688 20832 11664 10509 17469 23008 35059 66196 98487 112462
22014 112462 95196 87459 92412 101543 110477 110779 80281 50926 34723 34561 37638 31916 37334 41542
22000 41542 55909 86552 118956 151124 174780 194202 164191 112936 77774 61730 65429 50593
21988 50593 50490 60897 54468 62492 81444 111214 118838 108810 102186 77503 53558 33425 41879
21975D1879q20j6421k077J9470r39k5945j3000m168l767R684J856J1022L378J0589
21961C0741k940J877K178r10j3946M034J1363K093M37j2913j0915r860k55J0401
21947A1385J4956N978N228K414j2683m973j0756J168o096p916J8476J3733J50
21934C1064m374o626k000j239K721j0550q052j6464k287L370Q277M233r269P760
21920c436J1444J4043Q607j0649o103N480r54n184k748r226r254L717Q014M820
21906H571N126K3704J3898j0886j2036m369j2663j4480l860R00o502j668J5406
21893A141m002J796j134J00n95o358P106R370J4487J251r437L393Q363r741j1335
21878D405P318n521q195L453L880p640J989r251q718R214J3845k1832j504J1537
$$ plain form
21975 41879 41059 24638 22561 42031 41092 15147 2147 -2021 -5788 3896 5752 16774 20152 30741
21961 30741 27801 29678 31856 30946 17000 21034 32397 34490 34927 22014 11099 1239 984 11385
21947 11385 26341 32319 37547 39961 27278 22305 11549 12717 6621 -1295 17181 30914 31064
21934 31064 26690 20064 18064 16825 19546 8996 944 -15520 -17807 -14437 -6160 -1927 -11196 -3436
21920 -3436 8008 22051 30658 20009 13906 19386 18432 13248 10500 1274 -7980 -4263 3751 8571
21906 8571 13697 37401 51299 40413 28377 24008 11345 -3135 -6995 -6095 -12597 -14265 1141
21893 1141 -2861 -1065 -2199 -2099 -2694 -9052 -1946 7424 21911 23162 13725 17118 25481 15740 4405
21878 4405 11723 6202 -1993 1460 5340 -2300 -311 -9562 -18280 -9066 4779 -17053 -18557 -7020
21864g020J3027k238l699n066l202p96r15J5178L81L482J0084k704j0692o340
21850e20j282P470R139J965j4940m087M889j3595o661j69J4299J4333l210P43
21836H374J114r941j586J1444J298k235j1631N518O060K250l840M34J2426m957
21822A4728j630J13j432j3390J6322J2950k5890j9670K430O74J0800J9115r723
21809E397j890L270o99J4416m821j6015l099K946Q105M018K868j2267j6927k347
21795a7045M672J296Q56m343R355N010P840n77j0079P586o178l45l617j1082L313
21780a3338O374m824k707j3997M360J2467P372O338p12J3715o762j4898j2250
21767a8862q357L061L759K1564P847j4881Q822L141l797n402n079j871k810p602
$$ plain form
21864 -7020 6007 3769 70 -4996 -8198 -8994 -9909 5269 5650 9132 19216 16512 5820 -520
21850 -520 -1802 5668 14807 16772 1832 -2255 2634 -10961 -17622 -17791 -3492 10841 7631 8374
21836 8374 9488 -453 -2039 9405 10703 8468 -3163 2355 8415 10665 6825 7259 19685 14728
21822 14728 13098 13211 11779 -1611 14711 27661 1771 -17899 -15469 -14795 -3995 15120 5397
21809 5397 3507 6777 6078 20494 15673 -342 -3441 -495 7610 11628 14496 2229 -14698 -17045
21795 -17045 -12373 -11077 -10221 -14564 -5209 -199 7641 7064 -3015 4571 -1607 -1952 -5569 -16651 -13338
21780 -13338 -6964 -11788 -14495 -28492 -24132 -11665 -4293 2045 1333 15048 8286 -6612 -18862
21767 -18862 -27219 -24158 -20399 1165 9012 -5869 2953 6094 2297 -3105 -8184 -10055 -12865 -20467
21753b0467J1683J2967q560j3578J9498j4043j1436r881o837Q461J4255P857Q33
21740i248J1241K4085r825k1934J359J1258L602R204j3963o022l081j992m943
21727a0259J5947Q968M206Q081l82P353j4596k2669m458M441K309K056k437L883
21713B443l782o651L822k809j9648L562L297J0314K8392r581o590L101J998j1627
21699c759m555J843J1815R058j5064m662p759N982J0484K585o783q521o216R77
21685a4575oK541P342M427p530m305Q183k040q152m928k838o38Q872l29l797Q534
21669i239O183Q229N907O209j1726j4062j0779L992Q999j653K835J7175Q603k826
21655A7847n383j44R25j3328j456Q746J718L076j657n757N519q93n546n401n937
$$ plain form
21753 -20467 -8784 4183 -4377 -17955 1543 -12500 -23936 -33817 -40654 -32193 -17938 -10081 -9248
21740 -9248 1993 26078 16253 -5681 -4322 6936 10538 19742 5779 -243 -3324 -5316 -10259
21727 -10259 5688 14656 18862 26943 26561 33914 19318 -3351 -7809 -3368 -1059 997 -1440 2443
21713 2443 -1339 -7990 -4168 -6977 -26625 -23063 -19766 -9452 18940 9359 2769 5870 7868 -3759
21699 -3759 -8314 -6471 5344 14402 -662 -5324 -13083 -7101 3383 5968 -815 -9336 -15552 -14575
21685 -14575 -14581 -12040 -4698 -271 -7801 -12106 -3923 -5963 -14115 -19043 -21881 -22519 -13647 -13976 -17773 -9239
21669 -9239 -3056 5173 11080 17289 5563 -8499 -19278 -15286 -6287 -7940 -5105 12070 20673 17847
21655 17847 12464 12320 13245 -83 -1539 7207 8925 12001 10344 4587 10106 9213 3667 -1734 -7671
21640g671k494k39M044m775J198J8138p577Q577j294o406J8173k679n060p497
21626D438j1546P215N14N293K43j0789m430N95L731O518m776j2376j607M273n913
21611a8617P282M620L438l666l333o108L546o897O46J9946K5898j16j0373q214
21597H052k722r377j3121q618l740L457m742j296J7098J4749m912l958J2069Q804
21583A1743K867m546o504k498j2557J448l9K56K036N101R137j1097j494n844n168
21568a7159j657j976J0949J5033N831M59J578k619j4420l318J836p254j065k277
21554a6059o973r244J469M600O528O769O205J731L769j192l689o701J1686L815
21540B714p175p006M712q373j0151p442L641J0311M351K400l17J897L850L836
$$ plain form
21640 -7671 -10165 -10404 -6360 -11135 -9937 8201 624 9201 7907 1501 19674 16995 11935 4438
21626 4438 -7108 107 621 5914 6157 -4632 -9062 -8467 -4736 1782 -2994 -15370 -16977 -12704 -18617
21611 -18617 -11335 -6715 -3277 -6943 -10276 -16384 -12838 -19735 -19089 857 26755 26639 16266 8052
21597 8052 5330 -4047 -17168 -25786 -29526 -26069 -30811 -32107 -15009 -260 -5172 -9130 2939 11743
21583 11743 14610 10064 3560 1062 -11495 -10047 -10086 -9830 -7794 -2693 6444 -4653 -6147 -11991 -17159
21568 -17159 -18816 -20792 -9843 5190 11021 11480 13058 10439 -3981 -7299 -5463 -12717 -13782 -16059
21554 -16059 -23032 -32276 -30807 -26207 -19679 -12910 -6705 -4974 -1205 -2397 -6086 -12787 -1101 2714
21540 2714 -4461 -11467 -6755 -15128 -25279 -32721 -29080 -18769 -14418 -12018 -12335 -10438 -6588 -2752
21526b752n301p996K345M176k417j0413N230P329n345N837J4711J5373L817L666
21512B8260q044j5918K073l428K370L851N931Q056m159n012J217n347r446K993
21498C397L354L528R39O287m769p678L43j0084N237P901K734P929O38m300q644
21483F812j6940k783O06n036n888m888M83P040P536J5723R538l508R754m818n280
21468H351r939j1019j4952n305j64R752M003l233l251j390J0991M528J3853J0099
21454A2324k861J993O712l701m408j843m358p671M673M096j6506l224P082J0802
21440C110j401J0127r540k732J7646Q292K465j153J316j1504n506j4663l45K683
21426a205L809Q96j3934L947O471o726m70o657j3325l850K1837J3645j0636L954
$$ plain form
21526 -2752 -8053 -16049 -13704 -9528 -11945 -22358 -17128 -9799 -15144 -9307 5404 20777 24594 28260
21512 28260 20216 4298 6371 2943 5313 9164 15095 23151 18992 13980 15197 9850 404 3397
21498 3397 6751 10279 11218 17505 12736 5058 5401 -4683 554 8455 11189 19118 19756 15456 6812
21483 6812 -10128 -12911 -12305 -17341 -23229 -28117 -27634 -20594 -13058 2665 12203 8695 18449 13631 8351
21468 8351 -1588 -12607 -27559 -32864 -33028 -23276 -19273 -22506 -25757 -27147 -16156 -11628 2225 12324
21454 12324 9463 11456 18168 14467 10059 8216 3858 -3813 860 4956 -11550 -14774 -7692 3110
21440 3110 1709 11836 2296 -436 17210 25502 27967 26814 28130 16626 11120 -3543 -3888 -1205
21426 -1205 2604 3500 -10434 -6487 -16 -6742 -7212 -13869 -27194 -31044 -9207 4438 -6198 -2244
21412b244p487N240R347m044o647j480l189J0561n945j026l064p626P89L818J1046
21397a951J3663p219j5102p251N562m203o563P173o832O155L434N307K787R251
21383D211N840p016k0483q669P009j0277L061J918K417O240L902J0736m406R826
21369D309q505J741n45O580O106M08q547o921o255r548p224M848P626J3528K1574
21354A9175Q788j340l717n810Q685K1628o195p573K860M848j812j5317j0537Q63
21340A4546L58O800k783j620J447k340j2186n472P530L665j778K438L383m16k336
21325A1236l717N0J064J735O970L018j0747n872j8757N484j5704K572J0615O96
21311a1357K075J1441k780N743Q822q2j3594K136Q995n390M656K3490q50n670
$$ plain form
21412 -2244 -9731 -4491 4856 812 -5835 -7315 -10504 57 -5888 -6914 -9978 -17604 -16815 -12997 -1951
21397 -1951 11712 4493 -10609 -17860 -12298 -16501 -23064 -15891 -22723 -16568 -13134 -7827 -5040 4211
21383 4211 10051 3035 -17448 -26117 -19108 -29385 -26324 -24406 -21989 -15749 -11847 -1111 -5517 4309
21369 4309 -4196 -2455 -3000 3580 9686 10094 1547 -5374 -11629 -21177 -28401 -23553 -15927 -2399 19175
21354 19175 27963 26623 22906 17096 25781 47409 41214 33641 36501 41349 39537 24220 13683 14546
21340 14546 14904 21704 18921 17301 18748 16408 4222 -1250 6280 9945 8167 10605 13988 13572 11236
21325 11236 7519 7569 8633 10368 17338 20356 9609 3737 -15020 -9536 -25240 -22668 -12053 -11357
21311 -11357 -9282 2159 -621 5122 13944 13862 268 2404 11399 6009 10665 34155 33305 27635
21297B7635j742l591r101K030K619k0603j9489j672J137M845J2231Q607o433K145
21283a382J3787n068J6263j791j461r691j1823j195k962P762R97P476j273l879
21269E760j1241r749J3533l460k994J9501n422p335k502M697k513M410K294P817
21255A2796K3122j4185j7695k96J1146m008j2769K591J584p88j410K179J318k106
21241A479K418M016n029j5485m201p302m378J933l51k381n472k001Q618R104Q823
21226a0209M67R868J2165j736k1152j3344Q85J9569j669N33J2487r228N066J462
21212E164o14L089l396K283O472p891l449J2960n810k070o549N93j3782K212J0016
21197g72P640p981k202l192k474O896R36J1500j5375K40P574o240N629J2004j0810
$$ plain form
21297 27635 25893 22302 13201 15231 17850 -2753 -22242 -23914 -22777 -17932 -5701 2906 -3527 -1382
21283 -1382 12405 7337 23600 21809 20348 10657 -1166 -2361 -5323 2439 3436 10912 9639 5760
21269 5760 -5481 -15230 -1697 -5157 -8151 11350 5928 -1407 -3909 788 -1725 2685 4979 12796
21255 12796 35918 21733 4038 3742 14888 10880 -1889 702 2286 1498 88 2267 3585 1479
21241 1479 3897 7913 2884 -12601 -16802 -24104 -28482 -26549 -26900 -29281 -34753 -36754 -28136 -19032 -10209
21226 -10209 -9742 126 12291 10555 -10597 -23941 -23056 -3487 -5156 -4623 7864 -1364 3702 5164
21212 5164 4550 7639 4243 6526 12998 5107 1658 14618 8808 6738 189 782 -13000 -10788 -772
21197 -772 6868 -1113 -3315 -6507 -8981 -2085 -1149 10351 -5024 -4784 2790 -3450 2179 14183 3373
21182C373r018r15Q686J2915J1808o461J89J763o96j4658j5284j1680L134P701
21168i143J7886R423k816j7187j3512K181J2524J028O511L054K65j4100n848N132
21154d602J2055j5294j176R875p40M534J732J2374m892j1865l807O313P766k705
21140I568j8597j1478M181J5335o345K056M548n367q036M498M711j603j499J0241
21126B213q13j5942R79J3316N468j2538j2465l71Q935N123j169r147o467L224
21112a9654J2680K4721Q403j884r715j553l232j2970m806Q976J3151R814j0206
21099A3725j3839j0355N556J067L509N456K558K720N392L929r006j3673k909O01
21085e269P3M195j4151M543j029M45k94j2857M570N671l449l262j038o84K687
$$ plain form
21182 3373 -5645 -6560 2126 15041 26849 20388 20577 22340 21644 6986 -8298 -19978 -16844 -9143
21168 -9143 8743 18166 15350 -1837 -15349 -13168 -644 384 6895 9949 10214 -3886 -9734 -4602
21154 -4602 7453 -7841 -9017 858 118 4652 6384 18758 13866 2001 -1806 4507 12273 9568
21140 9568 -9029 -20507 -16326 -991 -7336 -5280 -732 -6099 -14135 -9637 -4926 -6529 -8028 2213
21126 2213 1400 -14542 -13563 -247 5221 -7317 -19782 -20153 -11218 -6095 -7264 -16411 -22878 -19654
21112 -19654 -6974 17747 26150 24266 14551 12998 9766 -3204 -8010 966 14117 23931 13725
21099 13725 -114 -10469 -4913 -3846 -337 5119 7677 10397 15789 19718 10712 -2961 -5870 -5269
21085 -5269 -5196 -1001 -15152 -10609 -11638 -11193 -11487 -24344 -19774 -14103 -17552 -20814 -21852 -22536 -19849
21070a9849J1225N571L709J7392N643j390j2110j7475m499o006L362J1531j8046
21057b0942j141P250p605J587J2880P833k122N489k188k040K923R768q439j9105
21043a5852J695M23M533kJ0847r233q425j1423L768P344J3042N493k724J085j1181
21028a0610p024j519N403J6762p643p1J2431P376J696n164o115m863p245j2161
21014a8747O73O639l223R42K779J4044P484k2840r333K2493K5033m7p186M013
21000B2724j2859q501J576m098j400k464Q505j191k1031O497J7055k519p089N152
20986C57J6710o00r230M993K018k482J96K711l976J876n393m460R460j067m549
20971F564n421m973Q069m270j2418M609k122j5391K109J630K3560Q259j0295j1574
$$ plain form
21070 -19849 -8624 -3053 656 18048 23691 22301 10191 -7284 -11783 -17789 -14427 -2896 -20942
21057 -20942 -22083 -14833 -22438 -20851 -7971 -138 -2260 3229 1041 -999 1924 11692 3253 -15852
21043 -15852 -14157 -13734 -9201 -9203 1644 -7589 -16014 -27437 -23669 -16325 -3283 2210 -514 571 -10610
21028 -10610 -17634 -19153 -13750 3012 -4631 -4702 7729 15105 16801 11637 5522 659 -6586 -18747
21014 -18747 -18074 -11435 -14658 -13716 -10937 3107 10591 -12249 -21582 911 25944 25897 18711 22724
21000 22724 9865 1364 2940 -1158 -2558 -5022 3483 2292 -18739 -12242 4813 2294 -4795 357
20986 357 17067 16467 7237 12230 14248 11766 11962 14673 10697 12573 7180 2720 12180 11113 6564
20971 6564 1143 -3830 4239 -31 -12449 -7840 -9962 -25353 -23244 -21614 1946 10205 -90 -11664
20957a1664L596J9611R622J112k854N876k35j5755p879L903j200J5472M405r610
20943A4400j0421j4861O361J9513n067n092Q194N246n092r941o518o134L439J0700
20929D727r727k908O299O128J347J582P638J7031m548j6050K257q594n33N043
20915I692J0535L357N334m728k0461j5074o849o667J2009J8637m907l998J1353
20902H233o507j457m772j4043L946J622O513O943J938m003O271m27j1039j4174
20888b0956O071M104M304J3443K3577O087j7148j2347l540j1878m303N945J0459
20875C818l529O301J0336j1383R56R759p34n569j0605k706P899Q01q197J0835
20861G982L864p040k625r923N884q631J2858j0313j6398J03J3131m86K770J5605
$$ plain form
20957 -11664 -8068 11543 21165 22277 19423 25299 25064 9309 1430 5333 4133 19605 24010 14400
20943 14400 3979 -10882 -4521 14992 9925 4833 13027 18273 13181 3240 -3278 -9412 -5973 4727
20929 4727 -5000 -7908 -1609 4519 5866 7448 15086 32117 27569 11519 13776 5182 4649 9692
20915 9692 20227 23584 28918 24190 3729 -11345 -18194 -24861 -12852 5785 878 -3120 8233
20902 8233 1726 269 -4503 -18546 -14600 -12978 -6465 478 2416 -1587 4684 4257 -6782 -20956
20888 -20956 -14885 -10781 -6477 6966 30543 36630 19482 7135 3595 -8283 -12586 -6641 3818
20875 3818 289 6590 16926 5543 6499 16258 15524 9955 -650 -3356 4543 5344 -2853 7982
20861 7982 11846 4806 2181 -7742 -1858 -10489 2369 -7944 -24342 -24239 -11108 -11594 -8824 6781
20847F781J2166P35m57r251j3931p747j0214O916N541r23Q323O577j814m916j825
20832d039J0941O463j2784o674P513L006r099K42N577M417L252j2477n704q915
20818a8281Q2J0251o013J3973O620j0601J553O679N701R917j5984j8434l331J4865
20804c003J5731n065p191J2209P898K002O055J589L577K13m424j0188j6200k2026
20790a8823n28K3199K586j077N859J0000j401l529R202j175n391m458p707P919
20776A4676M223o302N050j2086j1421j0174j6578L76N052J196J4942J780j59J560
20762g865J857J751Q250J862o800j1442P35L0777n600k0619j1298o700R74O986
20748a7132J3045N498n294j2028n403R293J7669j6967n210J7655J5818M984l579
$$ plain form
20847 6781 18947 19682 19225 9974 -3957 -11704 -21918 -15002 -9461 -10384 -2061 4516 2702 -2214 -4039
20832 -4039 6902 13365 581 -6093 1420 4426 -4673 -4431 1146 5563 8815 -3662 -9366 -18281
20818 -18281 -18199 -7948 -13961 12 6632 -3969 -2416 4263 9964 19881 3897 -14537 -17868 -3003
20804 -3003 12728 7663 472 12681 20579 22581 28636 30225 33802 34015 29591 19403 3203 -18823
20790 -18823 -19351 3848 6434 5357 11216 21216 19815 16286 25488 24313 18922 14464 6757 14676
20776 14676 18899 12597 17647 5561 -5860 -16034 -32612 -32236 -27184 -25988 -11046 -9266 -9425 -7865
20762 -7865 -6008 -4257 3993 5855 -945 -12387 -11652 19125 13525 -7094 -18392 -25092 -24118 -17132
20748 -17132 -4087 1411 -3883 -15911 -21314 -12021 5648 -11319 -16529 1126 16944 21928 18349
20735A8349n201Q466q840n436j4019o035J0030K421K795o616q80q497K1134J7808
20721B5479j329J0642L983m809j0251J526j8533p949k889q253j6786m033J6482
20708a6720r96N909R110J0760p196m978Q603P565J7969J3866M729j4494j4559
20695A9568J607j92q28k369j4152j6477P40J3464J4210j1269Q496o828k110o393
20681b533n416P942l930o318j836o003J0507R323K907p42R152j0458k004M790
20667E381j2380j844M070j692k069J2847M489J0904k147o762l946O120j075p752
20653D144o98J0912O444n93k461l981O33j90r263J2j3963l074J8541R315M926
20638B0704q062O302K55J488m279n265r306O646q86N359K091N567j109j7604N66
$$ plain form
20735 18349 13148 21614 12774 7338 -6681 -12716 -2686 -265 2530 -4086 -4966 -13463 7671 25479
20721 25479 24150 34792 38775 33966 23715 25241 6708 -1241 -4130 -12383 -29169 -33202 -16720
20708 -16720 -17716 -11807 -2697 8063 867 -4111 4492 12057 30026 43892 48621 34127 19568
20695 19568 21175 20983 20155 17786 3634 -12843 -12103 1361 15571 4302 12798 5970 3860 -2533
20681 -2533 -7949 -7 -3937 -10255 -12091 -18094 -7587 1736 4643 3901 13053 2595 591 5381
20667 5381 -6999 -8843 -4773 -6465 -8534 4313 8802 19706 17559 10797 6851 12971 11896 4144
20653 4144 3446 14358 20802 20209 17748 13767 14400 14210 4947 4959 -9004 -12078 6463 15778 20704
20638 20704 12642 18944 19199 20687 16408 11143 1837 8483 7597 12956 15047 20614 19505 1901 2467
20623B467J1297J1563J3378j998j5793r480n383j199L428n955k28O093o415O360
20609H135K7417k289j1908j2323q381k367K1382J1164m002J766m261J667j068
20596B4932o567J974J328n541o673J0631j699j0761n532n18n213N646o764J3374
20582H617J2902J1911n991p301n928j992l553J23n310J71K088M499n393l346l172
20567a675J4945l184j3862J3087J1940m472j9025r740Q090N302j0944R334N950
20554E746Q92M205j1150J3071J1504l811r858K181O23o616j0022J6290J1816J0108
20540C4979q98j5052j4890o896k3102k746m13R315J0635J4496O869R275l920j957
20526A5695m22j0033j652j008P94K522O380l969k433K580r909q632p151L639j042
$$ plain form
20623 2467 13764 25327 38705 36707 20914 11434 6051 4852 8280 2325 2097 8190 1775 8135
20609 8135 35552 33263 21355 9032 651 -1716 19666 30830 26828 28594 24333 26000 24932
20596 24932 18365 20339 21667 16126 9453 20084 18385 7624 2092 1574 -3639 2007 -4757 8617
20582 8617 21519 33430 27439 20138 14210 12218 8665 8788 3478 3649 5737 10236 4843 1497 -1675
20567 -1675 13270 10086 -3776 9311 21251 16779 -2246 -11986 -3896 1406 -9538 -204 5746
20554 5746 6638 10843 -307 12764 24268 20457 10599 12780 13403 6787 -3235 13055 24871 34979
20540 34979 34081 19029 4139 -2757 -25859 -28605 -29018 -19703 -9068 5428 12297 21572 17652 15695
20526 15695 15273 5240 3588 2580 3374 5896 12276 8307 5874 8454 -1455 -10087 -17238 -13599 -14641
20511a4641P252N608k025J288J902P277P320o507j4199j3636J236n944P585R296
20497h188J651L535J2936L906l904M83j12o534o547j0968O77j0936j5555J2807
20483b6749J1086L416m826Q554J4304P212q531N426l509j841P985L20L57J5208
20469B8412k0480j4101J0904O599j396l813O510N685q825j1834R245n800r487
20456h381P059J2891L879m983r15J1367j791N855p198r450k651K574M696j1151
20442A801M091M749m496o859L832j243M281J0354L30O369q290j3231j0285L440
20428e157J0579j6095j5085P576K2340R510J3401k527o192j6715k841p714J59
20415h761q43J2771J0057q050l126J7931K2972K977r261j1537j4684n557k010
$$ plain form
20511 -14641 -7389 -1781 -3806 -2518 -616 6661 13981 7474 -6725 -20361 -19125 -25069 -17484 -8188
20497 -8188 -6537 -3002 9934 13840 9936 10419 10307 3773 -2774 -13742 -13065 -24001 -39556 -26749
20483 -26749 -15663 -12247 -17073 -8519 5785 12997 4466 9892 6383 4542 12527 12847 13204 28412
20469 28412 7932 -6169 4735 11334 9938 6125 12635 18320 9495 -2339 6906 1106 -8381
20456 -8381 -1322 11569 15448 10465 9550 20917 19126 24981 17783 8333 5682 8256 12952 1801
20442 1801 5892 10641 6145 -714 3118 1875 6156 16510 16840 23209 14919 1688 -8597 -5157
20428 -5157 5422 -10673 -25758 -18182 4158 13668 27069 24542 18350 1635 -1206 -8920 -8761
20415 -8761 -9604 3167 13224 5174 2048 19979 42951 45928 36667 25130 10446 4889 2879
20402B879K652L035j083m204Q32j1750J745P110R079Q920J837p324k980j1081
20388c33K894M638m368p447q108k33j1430J1398J7966P93N735J844O490n205J1914
20373B6548N270j0023j0122j3443o240K318j21J293j875N095R416J4680o433j5525
20359H38p626n079J30J41Q636J09N742N762j652M964l948K070J4481J4705j4930
20344B4343j5077r230j269p608j3954J3893J6553N910P342R35j753n935M344m968
20330A3526o609n331j3680Q13J5417L326p552p844m041K5515N375j0624r562J2368
20316A1097k485r94N692n270K137j1008k350N774p186K907J3305J6400j435K503
20302B9087m540M393m365j082o175N997q155l363R941K936q206n790l754q797
$$ plain form
20402 2879 5531 8566 7483 3279 4111 -7639 -5894 1216 10295 19215 21052 13728 10748 -333
20388 -333 2561 7199 2831 -4616 -12724 -12957 -24387 -12989 4977 5770 11505 13349 19839 14634 26548
20373 26548 31818 21795 11673 -1770 -8010 -5692 -5813 -4520 -6395 -1300 8116 22796 16363 838
20359 838 -6788 -11867 -11737 -11596 -2960 -2851 2891 8653 7001 11965 8017 10087 24568 39273 24343
20344 24343 9266 36 -1233 -8841 -22795 -8902 7651 13561 20903 21838 20085 14150 18494 13526
20330 13526 6917 1586 -12094 -11281 4136 7462 -90 -7934 -11975 13540 18915 8291 -1271 11097
20316 11097 8612 7618 13310 8040 10177 -831 -3181 2593 -4593 -1686 11619 28019 26584 29087
20302 29087 24547 28940 24575 23493 17318 23315 15160 11797 21738 24674 16468 10678 6924 -1873
20288a873q201J5093J1899o818j2770O756J803O382n549q069M891J1587Q930m630
20274A9431K232j413K083j33J1849P862o385o421L609o955j7828r68m042R525
20260A2446J7469O903o178K629J88r309j474j088M054r861j3350R847m528L338
20246A1086R445m601k271q88j200k822n123k0014j2285K0121K1242j0918j1127
20233i355L872P435l34K401m316O099o289P946J0982o372l338o945P48J0778J468
20218A4780N174k817J424J1408M798n052k0378q161P363q77J0987J7883R351o12
20204D5271o075j4111n7q083L246O754m70J2337o650j8233J1223m74K384j2362
20190A4700j0737l7M135M229R951j9910j0864J8938J5604j479j1723K013P857
$$ plain form
20288 -1873 -10074 5019 16918 10100 -2670 4086 5889 12271 6722 -1347 3544 15131 24061 19431
20274 19431 21663 20250 22333 22200 34049 41911 35526 29105 32714 25759 7931 6963 2921 12446
20260 12446 29915 36818 30640 33269 33457 24148 22674 21586 25640 15779 2429 12276 7748 11086
20246 11086 20531 15930 13659 12771 11571 8749 3626 -16388 -28673 -8552 12690 1772 -9355
20233 -9355 -5483 1952 1618 4019 -297 5802 -487 7459 18441 12069 8731 1786 2534 13312 14780
20218 14780 19954 17137 18561 29969 34767 29715 9337 1176 8539 7662 18649 36532 45883 45271
20204 45271 39196 25085 25028 16945 20191 26945 26475 38812 32162 13929 25152 24678 27062 14700
20190 14700 3963 3926 8061 12290 22241 2331 -8533 10405 26009 24530 12807 14820 22677
20177B2677Q710j173n028M768K439l816p168l169p034m679k289m287p701l79J0256
20162B127j236n502M666J017n522J211J151Q984n792j1443K429O67N103k10O180
20147C830k941o301q61J2236N302J3368M880j1030j0404n202l452O49k414J2178
20133I838K3828p239j3213n033k038n770l3O266P571K10O091k648P89J9303Q792
20118D6714j717j9448j6093p910n18l872j0668K40O364L121K113K3195J8484m139
20104C5866k083Q928k719j5909j1074R9k624q020J508J5748M145L537j461j660
20090B4281L673o961j945l05n839P666L192M76m190o307O816j911Q31M313l860
20075A9930n815J6189j168j4313k626J3130K89r070o431n504j164P829M785P358
$$ plain form
20177 22677 31387 30214 25186 29954 32393 28577 21409 18240 11206 6527 4238 -49 -7750 -8129 2127
20162 2127 891 -4611 55 1072 -4450 -3239 -2088 6896 1104 -10339 -7910 -7243 -2140 -2350 3830
20147 3830 889 -5412 -6273 5963 11265 24633 29513 18483 8079 2877 -575 74 -2340 9838
20133 9838 33666 26427 13214 8181 6143 373 340 6606 14177 14387 20478 17830 18619 37922 46714
20118 46714 44997 25549 9456 1546 1028 -2844 -13512 -13272 -6908 -3787 -1674 21521 40005 35866
20104 35866 33783 42711 39992 24083 13009 13108 10484 2464 3972 19720 23865 27402 25941 24281
20090 24281 27954 20993 19048 18743 12904 20570 23762 24238 20048 13741 20557 18646 19477 23790 19930
20075 19930 14115 30304 29136 14823 12197 25327 25616 16546 10115 4611 3447 11276 16061 23419
20061B3419L745J225j1543p336n423M042m131p665N030L520n391J961J0798j1012
20047A239q901J5882K213R228J1403n986r491L453R041K823k1407j7184N559J2784
20033A0656Q969n657L880J2793K700m286K458P12L069P243O48m349l232j3790
20019B1814j831J493P268J285j9109l520J382o199j821R459k11K224M174j2216
20005D192m075J5066O075O95q131j4611o048j734m727j274J6111J1112p42k958
19991H951P712J020r005Q577Q061L028N087J687j909j4099j0762J225J904R109
19977B0586j659q491L339J5799j1539q364J0521q692J2438O180p561o925P146
19964B2778Q374M007p300j1101M703K094k021J1383J0143q868q335j4515M554
$$ plain form
20061 23419 27164 28389 16846 9510 4087 8129 3998 -3667 1363 4883 -508 1453 12251 1239
20047 1239 -7662 8220 10433 19661 31064 25078 15587 19040 28081 30904 9497 -7687 -2128 10656
20033 10656 19625 13968 17848 30641 33341 29055 31513 32225 35294 42537 43185 38836 35604 21814
20019 21814 19983 21476 28744 30029 10920 7400 8782 2583 762 10221 10010 12234 16408 4192
20005 4192 117 15183 21258 21953 13822 -789 -6837 -8571 -13298 -14572 1539 12651 11909 8951
19991 8951 16663 17683 8678 17255 25316 28344 33431 35118 33209 19110 8348 9573 11477 20586
19977 20586 18927 10436 13775 29574 18035 9671 20192 11500 23938 30118 22557 15632 22778
19964 22778 31152 35159 27859 16758 21461 23555 21534 32917 43060 34192 25857 11342 15896
19951A5896J0040J931Q597N756j5531k2090j5439J1481j864k003k952K262R503
19938E587n363L670n50J0677n337Q125J4455K948N283O783M101P53P408p28j0695
19923D7117M240n696P709j4075k5182l70Q333M570q483j26j269K943n967k345
19909A1399R910J1477P369o205r946k328M352q53K611l054j0069j093K927n263
19895A1234J2020J2213o593k3597r624p642q857J4892J8152p55j591j4621o056
19882a0825O667J3049J6822o841M409P246j081J757J529j0570n94R815k585j3434
19868A5364j0058j285M11r189J1477J0868M39k787r09L741J1692L824k539M651
19854C5700j265m340R840N94j405l609P913N577o552q285k012j1332j8964l770
$$ plain form
19951 15896 25936 27867 36464 42220 26689 4599 -10840 641 -1223 -3226 -6178 -3916 5587
19938 5587 224 3894 3344 14021 8684 16809 31264 34212 39495 46278 50379 51132 58540 57812 47117
19923 47117 51357 45661 53370 39295 14113 13743 22076 26646 18163 18037 16768 19711 13744 11399
19909 11399 21309 32786 40155 33950 24004 21676 26028 25175 27786 24732 14663 13570 16497 11234
19895 11234 23254 35467 28874 5277 -4347 -11989 -20846 -5954 12198 11443 9852 -4769 -10825
19882 -10825 -4158 8891 25713 18872 23281 30527 29446 31203 32732 22162 21568 31383 28798 15364
19868 15364 5306 4021 4432 -4757 6720 17588 18027 15240 14331 18072 29764 33588 31049 35700
19854 35700 34435 30095 39935 40529 39124 35515 43428 49005 42453 34168 32156 20824 1860 -1910
19840a910J2550L832M69j1819o263K434J781J8780K1794R170q802o116p761o550
19826B1589r679p45N949o169M450K642K473p185k310Q247O400R298M146m954r97
19811C3155J696J0253o93p958j1877M319M421K605p423p237l687L855L385N16
19797B5330p24o458K499j909j895J1004J5230q002o723o253J0472Q408J1555n710
19783D6824o399J486k5257k979J174o480M51J7366J3431N340l167J890j4624j8
19769B9038O966j236m072K140q586J5411o857j869R339J4269k914j1293m376L253
19755C9213J0723m275n215J2172J0027j2331k080j2452q350L66q801p224P340
19742A9113J8977R883p690M773L821j8009r915j1372n401p387p408o555J2652
$$ plain form
19840 -1910 10640 14472 14941 3122 -3141 -707 1074 19854 41648 50818 42016 35900 28139 21589
19826 21589 11910 11165 17114 10945 15395 18037 20510 13325 11015 19262 25662 34960 39106 34152 33155
19811 33155 34851 45104 44411 36453 24576 28895 33316 35921 28498 21261 17574 21429 24814 25330
19797 25330 24606 18148 20647 18738 16843 27847 43077 35075 28352 22099 32571 40979 52534 46824
19783 46824 40425 41911 16654 13675 14849 8369 8820 26186 39617 44957 41790 43680 29056 29038
19769 29038 36004 34768 30696 32836 24250 39661 32804 30935 40274 54543 51629 40336 35960 39213
19755 39213 49936 45661 40446 52618 62645 50314 48234 35782 27432 27798 18997 11773 19113
19742 19113 38090 47973 40283 45056 48877 30868 20953 9581 4180 -3207 -10615 -17170 -4518
19729d518N858L584J5776J0373J512J1136N888k646O075q85j2736l879L061K031
19715D0630p162k505m1l921N75J265N252q533q149J3624O188J4683P161M476q1
19700F3462j7461j0099l231J3321j071j3594m899Q114M192o380R020N552n859
19687D1067J156J125l240J946l703j5926Q40K2186K577n199J2829O099j5197j3469
19673C3091n393k685j5950j0452J9621J1970K097m514J090l546O399J2871M196
19660D8795j4268k320L124n944o694M654J1358J4177r784K513p703M161J0331
19647E2400J769j6266l691K7L98L058o935q928n238k542O798Q922J8662R287j1705
19632D6016j1933l599L044M294O730N151j0002j0054J0596K592o135m791J6208
$$ plain form
19729 -4518 1340 4924 20700 31073 32585 43721 49609 46963 53038 52153 39417 35538 38599 40630
19715 40630 33468 30963 30922 27001 27576 28841 34093 25560 17411 31035 37223 51906 59067 63543 63462
19700 63462 46001 35902 32671 45992 44921 31327 26428 34542 38734 32354 41374 46926 41067
19687 41067 42223 43348 40108 42054 38351 22425 23265 45451 48028 42829 55658 61757 46560 33091
19673 33091 27698 25013 9063 -1389 18232 30202 32299 27785 28875 25329 31728 44599 48795
19660 48795 34527 32207 35331 29387 22693 27347 38705 52882 43098 45611 37908 42069 52400
19647 52400 54169 37903 34212 34239 34637 37695 30760 21832 16594 14052 20850 29772 48434 57721 46016
19632 46016 34083 30484 33528 37822 44552 49703 39701 29647 40243 42835 36700 31909 48117
19619D8117J1921l044j0437L885O120l886j5679kJ5517M111M248Q09J510r779
19605E3411j7927J0207j882L72j342j850o485o242J462o119M557M911j076k858
19591B9139j1601n032J4609J9860J7956o670Q00j0315q139l674p133M018r34K430
19577C5314P635O848m398j6606N72k579q823n220J7100K5235J4213j8968n391
19564D4932j0700k920O728J9421j173k370j708Pj2185p335L248P509J2275O703
19550F2432j3772j9503q902J0921k089j0498m227J4850J5938J148J166J487Q115
19537E7066L820n968J550J0018m43m578R48J415n464n51J3770k320J718L622m126
19522G0477M467r093j6436r680o860N8J6847J2715O291Q295J5644n409q913j4612
$$ plain form
19619 48117 60038 56994 46557 50442 56562 52676 36997 36995 52512 56623 60871 61680 63190 53411
19605 53411 35484 45691 43809 44181 42839 40989 34504 28262 29724 23605 28162 33073 31997 29139
19591 29139 17538 12506 27115 46975 64931 58261 59061 48746 40607 36933 29800 33818 32884 35314
19577 35314 42949 49797 45399 28793 29365 26786 17963 12743 29843 55078 69291 50323 44932
19564 44932 34232 31312 38040 57461 56288 53918 52210 52217 40032 32697 35945 43454 55729 62432
19550 62432 48660 29157 20255 31176 29087 18589 14362 29212 45150 46298 47464 48951 57066
19537 57066 60886 54918 56468 66486 66043 61465 62413 63828 58364 57813 71583 69263 70981 74603 70477
19522 70477 74944 65851 49415 39735 32875 32933 49780 62495 68786 77081 92725 87316 78403 63791
19508F3791n21J728m209R778n637m187k307q701L753P668r881j5552O025K0642
19494F2390k858m02J2999r69j2151k23j1899K163K0448R492J6189m901j8002o757
19480F5519P985K04K414L086n432L575M216J0884n252m111J821j6947j1833j3203
19466D2926L947O460M794M227M980k062M235L135P27m429j1900n305J0959P442
19452G0136J3634J1717j2117j1400n407L909L568l326m740j5305j609R881Q241
19439F7182P715O32J0569m259l636j3016j4331N194O729J6136l1j4046n64R496
19425G3770l369o917j750Q806J6679K0773m954r884j7336J0642K107n441M994
19412H8120n553k247J0148O602J6118o66q155j852n168R438P26J063J830J7302
$$ plain form
19508 63791 63270 64998 60789 70567 64930 60743 58436 49735 53488 61156 51275 35723 41748 62390
19494 62390 59532 59130 72129 71160 59009 58786 46887 49050 69498 78990 95179 90278 72276 65519
19480 65519 73504 73708 76122 79208 73776 77351 81567 92451 87199 83088 84909 67962 56129 42926
19466 42926 46873 53333 58127 62354 67334 65272 69507 72642 73369 68940 57040 51735 62694 70136
19452 70136 83770 95487 83370 71970 66563 70472 74040 70714 65974 50669 49060 58941 67182
19439 67182 74897 75529 86098 81839 78203 65187 50856 56050 62779 78915 78884 64838 64274 73770
19425 73770 70401 63484 61734 70540 87219 107992 103038 93154 75818 86460 88567 83126 88120
19412 88120 82567 80320 90468 97070 113188 112522 104367 102515 97347 106785 107511 108574 110404 127706
19398A27706J2247J2714P66J7218M9129P6180R7194R3076R2236O3183J7509P80
19386F59938L351K0853L2392J6633m950r47N002L301J6538Q438k5267j8913N728
19373G22097j0059m1480p7669j03847r1679n0713l1283k6571k2854p283p851p880
19361B42928J0693k473j8613j5937k322J666j2055m521o896q195m28R080j916
19348A91011p122p454j1658K65P7M083q314n211K2854J4798L272P848n461l926
19334A95062o767L866J5959J0117K8468N2218O8301J23143J62099J52891J16967
19323I22324N3313k4927j10096j46053j46646q7601l6520o105n771M8159Q9985
19312E50062J29459J52359J25093N4854k6794r8682j60527j53635j09729q4449
$$ plain form
19398 127706 139953 152667 153433 170651 219780 295960 393154 486230 578466 641649 659158 659938
19386 659938 663289 684142 716534 733167 728217 727270 732272 735573 752111 760549 735282 716369 722097
19373 722097 712038 670558 592889 489042 397363 346650 315367 288796 265942 258659 250808 242928
19361 242928 253621 251148 232535 216598 214276 215942 203887 199366 192470 184275 183847 192927 191011
19348 191011 183889 176435 164777 165042 165119 169202 160888 155677 178531 193329 196601 204449 198988 195062
19334 195062 188295 192161 208120 218237 246705 298923 367224 490367 652466 805357 922324
19323 922324 975637 950710 840614 694561 547915 460314 423794 417689 411918 460077 550062
19312 550062 679521 831880 956973 1011827 985033 886351 725824 572189 462460 378011
19302C78011m5937k7250j8977o280j6402j3751p415k6205j0847N67j3402l934
19290A88178J1444N546J0591q293j9249j7395L920n43l1j6941p196J2849L486
19277A66366N722m096j3052j6105P54l526m306m208j0272o131Q561R599M331M086
19263A37723O445j671O833O527J593J67j557K870j0945o502m277j5689k170j0909
19249A08438Q945J4423o878K0240L439r860j7157j1190L055k1J0583J2435J1303
19236A47755Q241j609k367R707l890j7614R75j93l035o864J1599L351k8479j3222
19222A04355M053P720j774Q404N943o433j618j1593M879M829J3067o803M43j599
19208A23873r233k3381j4261L763J495l518R821O993Q320J4400P437l235K192
$$ plain form
19302 378011 332074 304824 285847 279567 263165 249414 241999 215794 204947 205514 192112 188178
19290 188178 199622 205168 215759 207466 188217 170822 174742 174199 174168 157227 150031 162880 166366
19277 166366 172088 167992 154940 138835 139589 136063 131757 127549 117277 111146 119707 129306 133637 137723
19263 137723 144168 142497 149330 155857 157450 157617 156060 158930 147985 141483 137206 121517 119347 108438
19249 108438 117383 131806 124928 145168 148607 138747 121590 110400 113455 113434 124017 136452 147755
19236 147755 155996 154387 152020 161727 157837 140223 141198 141005 137970 131106 142705 146056 117577 104355
19222 104355 108408 116128 114354 122758 128701 122268 120650 109057 113936 118765 131832 125029 125472 123873
19208 123873 114640 91259 76998 80761 82256 78738 88559 95552 103872 118272 125709 122474 124666
19195A24666l554K91J161O380r87J881j1704O51L430J0820R058K063o490k025
19181A35641J0510O350o07P36k950j2829n284M302o081P292K2033l005j0069L078
19167A49117j0887m530j3007n250J1596J4618K610l306J776L74j049P691O030
19154A55783L077L958J1819k909r917j2443j1457m64j1464j3560o642K5400K6738
19141A57919Q590K335j14j2529J937n670k6369l494J4947M532J099l974p79O032
19127A44462J08K524Q207o964M7J6944k358N537J8303J0086J726M560J0292J2803
19113B26277R941J489r007O165J6254m87N601O712j9744m314j0715j5754o350
19100B06068N118j611M323k48l541j4327j2488o69m711J4380K0041l412L848n384
$$ plain form
19195 124666 121112 121403 122564 128944 127957 129838 118134 118785 122215 133035 142093 144156 137666 135641
19181 135641 146151 152501 151894 152630 149680 136851 131567 135869 129788 137080 159113 156108 146039 149117
19167 149117 138230 133700 120693 115443 127039 141657 144267 140961 142737 143111 142062 149753 155783
19154 155783 158860 162818 174637 171728 161811 149368 137911 137447 125983 112423 105781 131181 157919
19141 157919 166509 168844 168730 156201 158138 152468 126099 122605 137552 142084 143183 139209 138430 144462
19127 144462 144570 147094 155301 148337 148384 165328 162970 168507 186810 196896 198622 203182 213474 226277
19113 226277 236218 237707 228700 234865 251119 250632 256233 262945 243201 238887 228172 212418 206068
19100 206068 211186 209575 213898 213650 210109 195782 183294 182625 177914 192294 212335 208923 212771 207387
19086B07387o217j1626o648o02k230J2276J5488j4804q948L741P830L919K4501
19073B24067J33o218n119k966p317J6281K0722J1829m694l421M0K300k881J8333
19059B61089J9380J390j4467N03J0750p783N51j6984l7078j6138n183K824J0302
19046B09156M562j8687l4539l0879k5040l6842j4438J9336K2758J4891O329j1744
19034A04863k0807j3524k490K0462K4756J0893P648R554M421L803P832J8969L919
19021A80299j3967j1746q167j391j4217J646K6424L1870J2357R581M607K441N948
19008B25685K532o5J2214K921K299L935M883J5538K8549O367L532M618J0542L6130
18994C59680K6657L8661M0040M6872M4939M3425O2957Q1093P0710N3956L5636
$$ plain form
19086 207387 201170 189544 182896 182294 180064 192340 207828 193024 184076 187817 195647 199566 224067
19073 224067 224200 217982 212863 209897 202580 218861 239583 251412 246718 243297 243337 245637 242756 261089
19059 261089 280469 281859 267392 267895 278645 270862 271413 254429 217351 201213 196030 198854 209156
19046 209156 213718 195031 160492 129613 104573 67731 53293 72629 95387 110278 116607 104863
19034 104863 84056 70532 68042 88504 113260 124153 131801 141355 145776 149579 157411 176380 180299
19021 180299 166332 154586 146419 145028 130811 132457 158881 190751 203108 212689 217296 219737 225685
19008 225685 228217 228152 240366 243287 245586 249521 254404 269942 298491 304858 308390 313008 323550 359680
18994 359680 386337 424998 465038 511910 556849 600274 663231 744324 815034 868990 904626
18983I04626K5731M1834M9410M9831K2917K9535M470N300j820j573k5909k3987
18971A080365j2922Q544K928j4852n4686o5145o6730p520J7110j2276j6786k252
18959H55778j0806k7621j3187J1847k915j3946r987j5489j2180J8929L3820K2725
18947H36968R648J2017R101J152M930L848K494j0854k737o287p759m290K273Q721
18933H59225R951P989J987J5824J4018m330k802j0666R769l123j373r91o194k474
18919H86810N432J4002O455K8517N5015O5732P6121P2429L3161q48n1581l9915
18907A151330m6515l7102j6571j1012K0885M4391Q752J0906L5508L8711M6873
18896A246156N9820O0028N1467P5401J00368J19992J28402J31927J77259J96799
$$ plain form
18983 904626 930357 972191 1021601 1071432 1094349 1123884 1128354 1133654 1131834 1130261 1104352 1080365
18971 1080365 1067443 1075987 1078915 1064063 1009377 944232 877502 869982 887092 874816 858030 855778
18959 855778 844972 817351 804164 816011 813096 799150 789163 773674 761494 780423 814243 836968
18947 836968 846616 858633 867734 868886 873816 877664 880158 869304 866567 860280 852521 848231 850504 859225
18933 859225 869176 877165 879152 894976 908994 904664 901862 891196 900965 897842 896469 895478 889284 886810
18919 886810 892242 906244 912699 941216 996231 1061963 1138084 1210513 1243674 1242826 1191245 1151330
18907 1151330 1104815 1067713 1051142 1040130 1061015 1105406 1114158 1125064 1160572 1199283 1246156
18896 1246156 1305976 1366004 1417471 1492872 1593240 1713232 1841634 1973561 2150820 2347619
18886B347619J76805J60290J45688J88202J86351K17641K73609L56490M99447
18877D552142O37897P15330P76607P77896O57120O33544P10619Q89885J371785
18868A1722825K233126L725921O425689J0712028J4989657J6644562J5717219
18861H2171027J0479528K156669l002936k872583M289413J3216665J8731751J7150108
18853A42319642R451385O68905q738123j6243344j7362618r730949J046284O242493
18845A07653675M341397m356553j3303953j9036448j7750291j1792509p135804
18838C8619514m550917l178721k420255j930950j604298j369260j150923r58196
18830B1455994q09745p13733o81362o91452o87774o64476o65959o41141n96410
$$ plain form
18886 2347619 2524424 2684714 2830402 3018604 3204955 3422596 3696205 4052695 4552142
18877 4552142 5190039 5905369 6681976 7459872 8116992 8750536 9461155 10351040 11722825
18868 11722825 13955951 17681872 24107561 34819589 49809246 66453808 82171027
18861 82171027 92650555 94807224 91804288 88931705 93221118 106437783 125169534 142319642
18853 142319642 151771027 152439932 143701809 127458465 110095847 100364898 101411182 107653675
18845 107653675 111995072 107638519 94334566 75298118 57547827 45755318 38619514
18838 38619514 34068597 30889876 28469621 26538671 24934373 23565113 22414190 21455994
18830 21455994 20646249 19932516 19251154 18559702 17871928 17207452 16541493 15900352 15303942
18821A5303942n58476m77556l82967l73490l62951l59363l60142l24925k73571
18812A1830501k91127l25720l29269l22933l22998k59307j69367j10590n2911
18803I646279n5670r5849j12331j21202q4282m3641l7861p8195j61314k74470
18793H581464l56399l64929l47361k89410k32564k20933j99826j70146j54093
18784F245803j26774j32034j32958j49571j50182j33991j39841j22708j18844
18775E038900j05726r4986r2487j00364j06640j01996r3907r7232r8700q0906
18765D065956o7619p3288o4963o1406q8785q0666p6257q4165p0449p7104n6433
18754C264821m5583l9420l1915k6337k2945j6936k6091k7084j7160m0715l8892
$$ plain form
18821 15303942 14745466 14267910 13884943 13511453 13148502 12789139 12428997 12104072 11830501
18812 11830501 11539374 11213654 10884385 10561452 10238454 9979147 9809780 9699190 9646279
18803 9646279 9590609 9494760 9382429 9261227 9176945 9133304 9095443 9017248 8855934 8581464
18793 8581464 8225065 7860136 7512775 7223365 6990801 6769868 6570042 6399896 6245803
18784 6245803 6119029 5986995 5854037 5704466 5554284 5420293 5280452 5157744 5038900
18775 5038900 4933174 4838188 4745701 4645337 4538697 4436701 4342794 4245562 4146862 4065956
18765 4065956 3998337 3925049 3860086 3798680 3709895 3629229 3552972 3468807 3398358 3321254 3264821
18754 3264821 3219238 3179818 3147903 3121566 3098621 3081685 3055594 3028510 3011350 2970635 2931743
18743B931743l3514k069J9143J8848K3466M2034L8511L5904M4991M4794O7668
18732C231519J23453J44908J58826J81081J56096R9881K7072o6045j06735j10082
18722C839974o7634K0749M7068M9965Q3372J19191J92036K62225L32438L41277
18712E220661K99249K26881J46696O9665r861l8154o4315l8953K9692J39630L04161
18701F285352M98112O81301R22002J191203J519635K038198K860631M304916P055866
18692B7357216J1898417J8567503K4842497K8553745K5659057J4457463q23759
18685A50512139j6797689k6869130k6475088j9123716j0267119l436681K135629
18678D9678345Q524208J6018715K2646190K6968367K4859138J3790909r43366
$$ plain form
18743 2931743 2898229 2896160 2915303 2934151 2957617 2999651 3038162 3074066 3119057 3163851 3231519
18732 3231519 3354972 3499880 3658706 3839787 3995883 4095764 4122836 4056791 3950056 3839974
18722 3839974 3772340 3793089 3840157 3890122 3973494 4092685 4284721 4546946 4879384 5220661
18712 5220661 5519910 5746791 5893487 5963152 5953291 5915137 5850822 5811869 5841561 5981191 6285352
18701 6285352 6783464 7464765 8386767 9577970 11097605 13135803 15996434 20301350 27357216
18692 27357216 39255633 57823136 82665633 111219378 136878435 151335898 150512139
18685 150512139 133714450 106845320 80370232 61246516 50979397 47542716 49678345
18678 49678345 58202553 74221268 96867458 123835825 148694963 162485872 161542506
18671A61542506j7077485k8061179k8936560k2537539j4179931q370036n290200
18664C7089576l695724k855660k371636k025162j749495j503592j284415j062556
18656B0541336q71050p36593o08055n21946m64743m24179m47474m84301n07305
18647A5475690n00964m93509m70438m70621m90075n07889m97899m54566l97248
18638A1192481l32955k80722k46725k03161j47615j13513j11401j29635j87720
18629I439034k55860l26494l49939l19018k71246k40108k03025j89302j67238
18620G116804j50388j65292j61747j54848j52815j50858j45547j39372j35124
18611E760813j27387j34377j35992j36070j55758j42175j24826j11807j10269
$$ plain form
18671 161542506 144465021 116403842 87467282 64929743 50749812 42379776 37089576
18664 37089576 33393852 30538192 28166556 26141394 24391899 22888307 21603892 20541336
18656 20541336 19670286 18933693 18325638 17803692 17338949 16914770 16467296 15982995 15475690
18647 15475690 14974726 14481217 14010779 13540158 13050083 12542194 12044295 11589729 11192481
18638 11192481 10859526 10578804 10332079 10128918 9981303 9867790 9756389 9626754 9439034
18629 9439034 9183174 8856680 8506741 8187723 7916477 7676369 7473344 7284042 7116804
18620 7116804 6966416 6801124 6639377 6484529 6331714 6180856 6035309 5895937 5760813
18611 5760813 5633426 5499049 5363057 5226987 5071229 4929054 4804228 4692421 4582152
18602D582152r6337j12766j05641r7769j09331r2647r1477r4786p6671r4260r7265
18591C513202n9794m7826o7021p3053n2284n9290p8850n5250o2476o3650l9150
18580B854558l7868m5941l1426j8700j7467j0811NJ0664J5856Q579m096M096L658
18567B731107L8157L1456K3897L5138J8056J4446j4384l9607m1512k1136k0790
18556B754828j6301r703j9837k4944k460k429q15m596L49j9413n0403n9881m0017
18543B504378l2102k4464k2196l3863m0039l6450m0241o3072o0681p0296n3770
18532B027204m9212l9066m9030n0037l2954m4475l0302l1685l408L630l402j4623
18520A682640j2051p942k4774k6615j1604J091r80k1227k3407k7313n0400o0656
$$ plain form
18602 4582152 4485815 4373049 4267408 4169639 4060308 3967661 3876184 3781398 3704727 3610467 3513202
18591 3513202 3453408 3405582 3338561 3265508 3213224 3153934 3075084 3019834 2957358 2893708 2854558
18580 2854558 2816690 2770749 2739323 2720623 2703156 2692345 2692350 2703014 2718870 2727449 2723353 2727449 2731107
18567 2731107 2769264 2800720 2824617 2859755 2877811 2892257 2877873 2838266 2796754 2775618 2754828
18556 2754828 2738527 2728824 2708987 2684043 2681583 2679154 2678339 2673743 2674092 2654679 2604276 2544395 2504378
18543 2504378 2472276 2447812 2425616 2391753 2351714 2315264 2275023 2211951 2151270 2080974 2027204
18532 2027204 1977992 1938926 1889896 1839859 1806905 1762430 1732128 1700443 1697035 1700665 1697263 1682640
18520 1682640 1670589 1662647 1637873 1611258 1599654 1600745 1599765 1578538 1555131 1527818 1477418 1416762
18508A416762o4896o1742o3893n0376k8322j7599j696M223N531j8808o3862j00841
18496I54481j13102j00514n2288j5260O576L7311M1626L8183M0067K6590J8943
18485H82613o343m8492o8518o2399o6717l4563K137K1792J4330p934j5352m853
18473F05701P308P176m305j2108l6621k6530O207L3749J9506J7894J3841m688
18461F27130M737J2291J1249J3118P279K2245K4799J7791K7251K5838L8718O7130
18449H99576Q0060R8253J16684J24683J23935J31576J26020J13965J11638J14613
18439B041003R8488O7543M6690O4825P1277N5749K6791m0136q3065r5742j10782
18428B142641j13717o9036k9508k2478l3446l8552m7861m6107p0496q0465o7231
$$ plain form
18508 1416762 1351866 1290124 1226231 1175855 1147533 1129934 1128238 1132461 1137992 1119184 1055322 954481
18496 954481 841379 740865 688577 673317 679893 717204 758830 797013 837080 863670 882613
18485 882613 876270 827778 759260 696861 630144 595581 597718 619510 633840 625906 610554 605701
18473 605701 613009 620185 615880 603772 567151 540621 546828 580577 600083 617977 631818 627130
18461 627130 631867 644158 655407 668525 675804 698049 722848 740639 767890 793728 832446 899576
18449 899576 979636 1077889 1194573 1319256 1443191 1574767 1700787 1814752 1926390 2041003
18439 2041003 2139491 2207034 2253724 2318549 2389826 2445575 2472366 2432230 2349165 2253423 2142641
18428 2142641 2028924 1959888 1930380 1907902 1874456 1835904 1788043 1741936 1671440 1590975 1523744
18417A523744l6221j2307J2760Q400P808m32r012R41J1387j0039O15k179o072
18404A489393p300N252N450J2144J7664L6840K8482j4541l3873l6605k8315k2880
18392A451711P039L0746L1354L0663N3996O1052N7336K9079K5036J7349K1156
18381A816517L6632Q2263J68369K72494M49072P52086J057211J181882J067808
18372F884334O49749q1543q24388j087947j018850o46086k02123Q8589K28198
18363C989933K10191J07511r1834k99299l55409l24028j60245p847Q6409J50988
18353C306370J51766J10316L7281L598l084k1619N1852J76429K56099L23572L74503
18342D767083L50218L43126L43707K87938L21642M20173N08429O48566Q61462
$$ plain form
18417 1523744 1487523 1475216 1487976 1496376 1504184 1503752 1494740 1495681 1507068 1497029 1497644 1495465 1489393
18404 1489393 1482093 1487345 1492795 1504939 1522603 1559443 1587925 1573384 1539511 1502906 1474591 1451711
18392 1451711 1458750 1489496 1520850 1551513 1605509 1666561 1723897 1752976 1778012 1795361 1816517
18381 1816517 1853149 1935412 2103781 2376275 2825347 3577433 4634644 5816526 6884334
18372 6884334 7534083 7452540 6628152 5540205 4521355 3875269 3673146 3761735 3989933
18363 3989933 4200124 4307635 4215801 3916502 3561093 3237065 3076820 3068973 3155382 3306370
18353 3306370 3458136 3568452 3605733 3609331 3606247 3584628 3636480 3812909 4069008 4392580 4767083
18342 4767083 5117301 5460427 5804134 6092072 6413714 6833887 7342316 7990882 8852344
18333H852344J015083J101933J181573J152826J259173J491387J933929K662847
18325B0651095L748431N341733Q054258J2942755K0729228K9621361L6871511
18318A37960372M0754351L7553546K4128827O752766k062770n827515l507644
18311B35751933J2216806K9564197K9789814J7805105Q032188r892380l4107892
18304B89159771m1507175m1678821m3001518l7001533k4923400j5382705j0083254
18297G5581365p414958n916157m815662m020687l432247k928550k511614k144311
18289D2397179j908490j714643j509079j347194j209779j184405j240676j188266
18281C1094647j079917j014250r73926q96153q21584p51099p11709p13076o89608
$$ plain form
18333 8852344 9867427 10969360 12150933 13303759 14562932 16054319 17988248 20651095
18325 20651095 24399526 29741259 37795517 50738272 71467500 101088861 137960372
18318 137960372 178714723 216268269 240397096 247149862 245087092 239259577 235751933
18311 235751933 247968739 277532936 307322750 325127855 333160043 323267663 289159771
18304 289159771 247652596 205973775 162972257 125970724 101047324 85664619 75581365
18297 75581365 68166407 62250250 57434588 53413901 49981654 47053104 44541490 42397179
18289 42397179 40488689 38774046 37264967 35917773 34707994 33523589 32282913 31094647
18281 31094647 30014730 29000480 28026554 27130401 26308817 25557718 24846009 24132933 23443325
18272B3443325o79287p05071o57972o12812n61786n58230n18430m64619l50017
18263A8335101j62960N8702K13346K71820L95419M19133J47789p9523q8580m40803
18253A9069444j011248r66942o10337m98489m72737n08859p37452q50549p07880
18244A2704951n36501m32222l77535l66666l18892k94270k46812k28373k55328
18235I648352k26833k27766k34371k12836k03315j93059k03391k04011k01889
18226G740881k11204k20274k12289k11073j88451j81807j62904j40594j33006
18217F079279j30114j18530j17885j24573j26608j27347j02759j05544j04995
18208E020924r9275q6792p4654m2572m8071m2565j3138p595l0967l2204k1155
$$ plain form
18272 23443325 22764038 22058967 21400995 20788183 20226397 19668167 19149737 18685118 18335101
18263 18335101 18172141 18230843 18444189 18716009 19111428 19530561 19678350 19598827 19510247 19069444
18253 19069444 18058196 17091254 16480917 15982428 15509691 15000832 14263380 13412831 12704951
18244 12704951 12168450 11736228 11358693 10992027 10673135 10378865 10132053 9903680 9648352
18235 9648352 9421519 9193753 8959382 8746546 8543231 8350172 8146781 7942770 7740881
18226 7740881 7529677 7309403 7097114 6886041 6697590 6515783 6352879 6212285 6079279
18217 6079279 5949165 5830635 5712750 5588177 5461569 5334222 5231463 5125919 5020924
18208 5020924 4921649 4834857 4760203 4717631 4669560 4626995 4613857 4606262 4575295 4543091 4521936
18197D521936j0475J5291L4534P8626P6186O4331N2772M9888J3316K5645N1315
18186D973365N9891P3128O3981K8671k2268n5327o3156q1555p4178j00024r3418
18175D709110r2693r1054j07957j20119j20826j14475j08308j17550j11521r4362
18165C630245o5890q2974p7462n3620p5387q2204p7135p1074n8026m5659m3876
18154B896938m4413m7384n1671n0782m9539n8243n3033m7625m5279n4131n2473
18143B342365l1894l6088m9092m4564l7040l1970k3588r506k016K480q060j0657
18131B060370J1739K1886K3469j7137l3489m4707m5160m2442J097P137J6985J478
18119A961226j6194l1890l7908m3434j9978K5398P8125J56905K99243N54624J019851
$$ plain form
18197 4521936 4511461 4526752 4561286 4639912 4716098 4780429 4833201 4883089 4896405 4922050 4973365
18186 4973365 5033256 5106384 5170365 5199036 5176768 5121441 5058285 4976730 4902552 4802528 4709110
18175 4709110 4616417 4525363 4417406 4297287 4176461 4061986 3953678 3836128 3724607 3630245
18165 3630245 3564355 3481381 3403919 3350299 3274912 3192708 3115573 3044499 2986473 2940814 2896938
18154 2896938 2852525 2805141 2753470 2702688 2653149 2594906 2541873 2494248 2448969 2394838 2342365
18143 2342365 2310471 2274383 2225291 2180727 2143687 2111717 2088129 2078623 2076607 2079087 2071027 2060370
18131 2060370 2072109 2093995 2117464 2100327 2066838 2022131 1976971 1934529 1935626 1942763 1959748 1961226
18119 1961226 1945032 1913142 1875234 1831800 1811822 1837220 1915345 2072250 2371493 2926117 3945968
18108C945968J922845L271569L575079K360748J730054q59327m516812l975165
18100G454959k169992j119549o22050l71194k59279k17368j82930j53279j24711
18091B234607j23246j00304r0192o3950o1031p9483p2110n4242l3349k9765m2233
18080A484702n8612l9490j9639K876p36o369r194k2879j6953m217j1308J2504
18068A310685L1131R509R69j0389m4826o7830p8580o2081l4580l4082j4036p534
18056I98356k126K2380K7811L4173L5569L0734K444j1438N484M6975P6549J11020
18044A377931J39441J15592N0767l6344j18082j52683j45818p9290l7161r368
18034A104985J0896M5333R1432J36496J35843J20132L5579l1524j10630j54582
$$ plain form
18108 3945968 5868813 9140382 12715461 15076209 16806263 15946936 11430124 7454959
18100 7454959 5284967 4165418 3543368 3172174 2912895 2695527 2512597 2359318 2234607
18091 2234607 2111361 2011057 1920865 1856915 1795884 1716401 1644291 1590049 1556700 1526935 1484702
18080 1484702 1426090 1386600 1366961 1369837 1369101 1362732 1353538 1330659 1313706 1309489 1298181 1310685
18068 1310685 1341816 1351325 1352294 1341905 1297079 1229249 1150669 1088588 1054008 1019926 1005890 998356
18056 998356 996230 1018610 1046421 1080594 1116163 1146897 1149341 1137903 1143387 1190362 1266911 1377931
18044 1377931 1517372 1632964 1683731 1647387 1529305 1376622 1230804 1151514 1114353 1104985
18034 1104985 1115881 1161214 1252646 1389142 1524985 1645117 1680696 1649172 1538542 1383960
18024A383960j40275j14845q1615n8488k2393L537j0028J6166O213N306n030k1612
18012I60896k1680k1662n0230l8966m8357j5228k9353l7372l5595j8980J833P077
18000F52383K1240J9801m713j6828J875J6467j507j3248l3548j6625k449l2451
17988E90397l2194k3401m549J0037J7070J4186J8902K0319L2361K9331N910J3822
17976F92191K8972L7212K3412K3432K6984L3547M5399M7293O9165Q0466N5397
17965A163470L8484K0724l696m0817p7945r9330j02633r7799q8751o5982l6151
17954F09574k9349j1182r186K955M046L669J4141J6628o963k1556j7260k4069
17942E31448j2845R90r892k6673j7701J6189K5487L1191N2884P6102Q2130Q8978
$$ plain form
18024 1383960 1243685 1128840 1047225 988737 966344 969881 959853 976019 982232 987538 982508 960896
18012 960896 939216 917554 867324 828358 780001 764773 735420 698048 662453 643473 645306 652383
18000 652383 673623 693424 688711 671883 673758 690225 688718 675470 641922 625297 622848 590397
17988 590397 558203 534802 530253 540290 557360 571546 590448 610767 643128 672459 678369 692191
17976 692191 721163 758375 781787 805219 832203 865750 911149 958442 1027607 1108073 1163470
17965 1163470 1201954 1222678 1218982 1178165 1100220 1000890 898257 800458 711707 645725 609574
17954 609574 580225 569043 559857 562812 566858 570527 584668 601296 594333 572777 555517 531448
17942 531448 518603 519593 509701 483028 465327 481516 507003 538194 591078 667180 749310 838288
17930H38288R5594P8064N5645K0120k728l3074p8924q4064p8730p6400p0783n5460
17918F07548l7955j3458k1756j6407j3625l5839k1083j2780m033J174k82K6900
17906D58404K5087J4903J1216J3093K0128L9214M8791N8573O4173P6483P9200
17895I09265O4223N0172L2498L2462k843j3084j7997k6316k9626k6307J664j8599
17883I55512k5883j2186k9477k4831n1715o4396n6394m5242l3881l9772k4531
17872E47204q870l4083j7475j4650j9124j7483j5878j9772j318K608r156O021
17860C98024J0484J4407K2793K8001J9753J9588K3795M653K819p603n808j8575
17848E12331j1917k542j8670j8153k7088k7440k4647k0176J0871K9484N263n707
$$ plain form
17930 838288 933882 1011946 1067591 1087711 1084983 1051909 972985 888921 810191 733791 663008 607548
17918 607548 569593 556135 534379 517972 504347 468508 447425 434645 430612 431786 431504 458404
17906 458404 483491 498394 509610 522703 542831 582045 630836 689409 753582 830065 909265
17895 909265 973488 1023660 1056158 1088620 1085777 1072693 1054696 1028380 998754 972447 974111 955512
17883 955512 929629 917443 887966 863135 811420 747024 690630 645388 611507 571735 547204
17872 547204 538334 504251 486776 472126 453002 435519 419641 399869 398551 401159 392003 398024
17860 398024 408508 422915 445708 473709 493462 513050 536845 541498 544317 536714 530906 512331
17848 512331 500414 497872 479202 461049 433961 406521 381874 361698 372569 402053 407316 401609
17836D01609K371Q808M681J2288K0407J6653J0803K4639L0720K2813M8147P5230
17824F79169Q5835Q5173J21361J36252J07856Q3946O6684K4700k1772l9617l6021
17813A293566j0945k2348k3017K3516J17638J70385J54552J29611J49109J08652
17803B090719L2111L0713O828r4336j28029j43197j99855k15897j96147j86076
17793I96834j52225q8781p3024o5669m0599j2970j9935j9551k1541l0472j4023
17782D58044l915J700R322J103n230M978o39q51P849K0349L2245K6577K4356J9648
17768E95536M5543M7100N1050K8120p463j9752l4977o3773n3879k9531j4759j815
17756E41400L3197M5881P2045R5657P5403K0614K3376p948l9343l9903l838j6512
$$ plain form
17836 401609 403980 412788 417469 429757 450164 466817 477620 502259 532979 555792 603939 679169
17824 679169 765004 850177 971538 1107790 1215646 1299592 1366276 1390976 1369204 1329587 1293566
17813 1293566 1282621 1260273 1237256 1260772 1378410 1548795 1703347 1832958 1982067 2090719
17803 2090719 2122830 2153543 2160371 2066035 1938006 1794809 1594954 1379057 1182910 996834
17793 996834 844609 755828 682804 617135 576536 563566 543631 524080 502539 472067 458044
17782 458044 454129 455829 465151 466254 461024 466002 465363 464512 472361 492710 524955 551532 575888 595536
17768 595536 641079 688179 739229 767349 759886 740134 705157 641384 587505 557974 543215 541400
17756 541400 574597 620478 692523 788180 863583 884197 907573 899625 860282 820379 816541 800029
17744H00029k1964j7006m3314m8579m0585o7231o6897o2502k6327o970j0786j7891
17732C69977p405J287J0656k534p461J8646L2842L1131K9506L3300M2373M0797
17720E93115J8952L6700L4675K9677J1163j5542j4390j3910j6050k1437l3740
17709F09213n526l564j4651j9564l1083k0856q967n618p701o242O559R842L0389
17696E32231J3927K7069K6045N812k0007l0933k1017j6632l9468k0722j6253M808
17684D44860J6224K8071K5343L212J0491j7018l6485l5303m6955m2232k6564j2712
17672C10932j2745k0095j2654q349k0347l1236k5970j273j825j2295o887m976
17660A52280j0991L552j947K631l691l002J2413o114l85R038l03J3040K3349L0157
$$ plain form
17744 800029 778065 761059 717745 669166 628581 561350 494453 431951 405624 398654 387868 369977
17732 369977 362572 363859 374515 371981 364520 383166 416008 447139 476645 509945 552318 593115
17720 593115 612067 648767 683442 713119 724282 708740 694350 680440 664390 642953 609213
17709 609213 603687 600123 585472 565908 534825 513969 505002 499384 491683 485441 492000 501842 532231
17696 532231 546158 573227 599272 605084 585077 554144 533127 516495 477027 456305 440052 444860
17684 444860 461084 489155 514498 517710 528201 511183 474698 439395 392440 350208 323644 310932
17672 310932 298187 278092 265438 257089 236742 205506 179536 178263 176438 164143 157256 152280
17660 152280 141289 144841 142894 145525 141834 138832 151245 145131 144746 153784 153481 166521 189870 220027
17646B20027K9497L5440N412j5001j4862j6768q603l848j085o617M486J0696K4049
17633B62823L218N003Q967j5930k8541k9158q022j7896j9623j4492m31J2522Q35
17620A59275j4492j9365j7373j3059p777N042j766k252L876J522j0510J795J1503
17607I6419m860q875J364M917K992m345n234q43J851M990j0809K214j0211J481
17593G1051o113q585j26L904n722J263N643j3976m540N062J1032m328p542k999
17579D4024O566k725L42N834J0212L460m86j1210j2487K46k658J6894J9328K801
17565H0141m505j139j0701p904o529J3480L641J3409J1196J3021J3148O22O099
17552A23979O446m506q336j4448P69j2743o749p021R555N306J9502K611o978J874
$$ plain form
17646 220027 249524 284964 290376 275375 260513 243745 235142 231294 230209 223592 228078 238774 262823
17633 262823 266041 271044 280011 264081 235540 206382 198360 180464 160841 146349 145918 158440 159275
17620 159275 144783 125418 108045 94986 87209 92251 90485 88233 92109 93631 83121 84916 96419
17607 96419 91559 82684 84048 88965 91957 87612 82378 81535 83386 88376 77567 79781 69570 71051
17593 71051 64938 56353 56227 60131 54409 55672 61315 47339 42799 47861 58893 54565 47023 44024
17579 44024 50590 47865 48207 54041 64253 67713 67227 56017 43530 43776 41118 58012 77340 80141
17565 80141 75636 74497 63796 55892 49363 62843 66484 79893 91089 104110 117258 117880 123979
17552 123979 130425 125919 117583 103135 103904 91161 84412 77391 86946 92252 111754 114365 107387 109261
17538A09261m867j716L871P724J5496M063J7056Q800J796l310J3339p83l961n272
17524A61497P156l55k264j1735k479M330J124Q995R843R991r54Q482O478j2696
17510A87413n943k415r585n562q325q041K644J8325Q713l385O049q08K981l663
17496A78398q8r060p450j73J659n589j5270m40p262j1495p988M024k809j0469
17482A05988q51M947M173k482R9l110j5395p349l241r813L852N271N12K7267J8635
17467A28503n911j1137J1256J7358R317R380P031m357j7506q277J155j0361r291
17454A17160J0462q1J3310J7073J9620N556l839j2946l2669l1118j7108k3734
17442F1686p508O901J6791J8557L8096J5279k4124k8427j9774k4252l7623m1921
$$ plain form
17538 109261 104394 102678 106549 114273 129769 133832 150888 159688 161484 158174 171513 170730 166769 161497
17524 161497 168653 168298 166034 154299 151820 156150 157274 166269 176112 186103 185149 193631 200109 187413
17510 187413 181470 179055 169470 163908 155583 147542 150186 168511 177224 173839 179888 179080 182061 178398
17496 178398 178310 169250 161800 161627 163286 157697 142427 141987 134725 123230 115242 119266 116457 105988
17482 105988 105137 110084 114257 111775 111874 108764 93369 86020 82779 72966 76818 82089 82601 109868 128503
17467 128503 122592 111455 122711 140069 149386 158766 165797 161440 143934 135657 136812 126451 117160
17454 117160 127622 127541 140851 157924 177544 183100 179261 166315 133646 102528 85420 61686
17442 61686 54178 61079 77870 96427 134523 149802 125678 97251 77477 53225 15602 -26319
17430b6319k5932j7307k987M63r267J4363K0544J9474R505M460J116K5526K2828
17417C6467R828q096N37j984r95L629n72j3690j3427k870J2271L6436J0458J1395
17403G9387R622p018l130J4453J6402M206j4456o936m85J2866J7649K5879L8541
17390A86980N4202P7618Q7657P2380Q8883P8606P1904O8478N0303l188l5087l9342
17378G59394l0362j5062L314K1942L7535N1021N2496L5944N1373K5286K7183J1324
17366A031388j1590j5208l7114l1671l9551m3545m4310l3242k5090j4627p428
17355G28012l132n665n486k7763k0796n13O138j7422l5879j7933J0422P254J3377
17342F30614j024j5409q171k149o247J93O198l023j3640J841J7234J1766J3671
$$ plain form
17430 -26319 -52251 -69558 -72545 -72082 -81349 -66986 -46442 -26968 -17463 -13003 -11887 13639 36467
17417 36467 46295 38199 38736 36752 35757 39386 38814 25124 11697 8827 21098 57534 67992 79387
17403 79387 89009 81991 78861 93314 109716 113922 99466 92530 92045 104911 122560 148439 186980
17390 186980 241182 318800 406457 478837 567720 646326 718230 786708 837011 833823 798736 759394
17378 759394 729032 713970 717284 739226 776761 827782 880278 916222 967595 992881 1020064 1031388
17366 1031388 1019798 1004590 967476 935805 896254 852709 808399 775157 750067 735440 728012
17355 728012 724880 719215 713729 685966 665170 664657 670795 653373 617494 599561 609983 617237 630614
17342 630614 629590 614181 606010 603861 597614 597807 604005 600982 587342 589183 606417 618183 631854
17329F31854L367K5382J7323K615q876j5034j1136j0020o995k075J2220J4084
17317F52709J4124J8610J4975L0978J9604m543k9600l1795p838K7049K4842K0166
17305G49281P895j0573K7242K7355K3084M1445M9143J9264o171j4765Q848K0471
17293I42519N4696J12433J55019J60796J62472J50838J15365N6129N923J3986
17283A930176K1408M1067J01832K05843K84396L20074L74710L77933L15638L05588
17273D278665L23674L56506L86704L83866M43409N69636Q17873J191966J650085
17264A0402384K441594L826770O292025J0516643J5960192K0076028K2010158
17257I1525794K0205524J4018620O027801l743816r065713j1315306j6190427
$$ plain form
17329 631854 635221 660603 677926 680541 671665 656631 645495 635475 628480 626405 638625 652709
17317 652709 666833 685443 700418 731396 751000 746457 716857 685062 677224 704273 729115 749281
17305 749281 757176 746603 773845 801200 824284 865729 914872 934136 927965 913200 922048 942519
17293 942519 997215 1109648 1264667 1425463 1587935 1738773 1854138 1910267 1916190 1930176
17283 1930176 1951584 1992651 2094483 2300326 2584722 2904796 3279506 3657439 3973077 4278665
17273 4278665 4602339 4958845 5345549 5729415 6172824 6742460 7560333 8752299 10402384
17264 10402384 12843978 16670748 22962773 33479416 49439608 69515636 91525794
17257 91525794 111731318 125749938 131777739 128033923 118968210 107652904 91462477
17250I1462477j9233628j3694867m815370L433992J0873950J6150140J9446082
17243A03622776J8989548J2755452N754431l591427j1567921j4204622j7861543
17236I3896694k1298971j7645903j1100474o699718m349726l082531k345293j865247
17228B5508831j542271j321900j091372r07949q10970p70882p57980o85735o03650
17219A7016122n89018o42425o79061o38097o01527n60628n10230m41499l71847
17210A1981790l00998k48056k33864j97348k00431k14757k51596k88965l03918
17201I741857l13301l19419l45112k96337k34207k16110k08388j86272j71607
17192G451104j59844j64135j76247j54667j55311j51501j51960j44595j31667
$$ plain form
17250 91462477 72228849 58533982 53718612 57152604 68026554 84176694 103622776
17243 103622776 122612324 135367776 141122207 137530780 125962859 111758237 93896694
17236 93896694 72597723 54951820 43851346 37151628 32801902 29719371 27374078 25508831
17228 25508831 23966560 22644660 21553288 20645339 19834369 19063487 18305507 17619772 17016122
17219 17016122 16427104 15784679 15105618 14467521 13865994 13305366 12795136 12353637 11981790
17210 11981790 11680792 11432736 11198872 11001524 10801093 10586336 10334740 10045775 9741857
17201 9741857 9428556 9109137 8764025 8467688 8233481 8017371 7808983 7622711 7451104
17192 7451104 7291260 7127125 6950878 6796211 6640900 6489399 6337439 6192844 6061177
17183F061177j56301j54102j49972j52501j50541j45746j14618j21749j31533
17174D784114j10402j25729j20139j17644j08728r9670r6587j08306j09168j04169
17164C683572r6326p1469q2754q0594p4466o5387p6913p9936o8185o4775o6611
17153B856156n7488n0935m9504n2116o6713o9279n3219l2751k5349n0425k8800
17142B319577j0670j1753k0010K812o296j2419m102R095K1138K9149K3880J0320
17130B350721j0116j119K0842N560k036r099O920R27L99m569j0355J6386J7550
17117B382011J3796l2547m4327m1013l0276m6380l8791l4441l8125l5723n2329
17106B001855n8098m9964k0936m0000o3796n5069l7433l1951m6306n0911m0091
$$ plain form
17183 6061177 5904876 5750774 5600802 5448301 5297760 5152014 5037396 4915647 4784114
17174 4784114 4673712 4547983 4427844 4310200 4201472 4101802 4005215 3896909 3787741 3683572
17164 3683572 3587246 3515777 3433023 3352429 3277963 3212576 3135663 3055727 2987542 2922767 2856156
17153 2856156 2798668 2747733 2698229 2646113 2579400 2510121 2456902 2424151 2398802 2348377 2319577
17142 2319577 2308907 2297154 2277144 2279956 2273660 2261241 2257139 2266234 2287372 2316521 2340401 2350721
17130 2350721 2340605 2339486 2360328 2365888 2363852 2354753 2361673 2362600 2362999 2358430 2348075 2364461 2382011
17117 2382011 2395807 2363260 2318933 2277920 2247644 2201264 2162473 2128032 2089907 2054184 2001855
17106 2001855 1943757 1893793 1872857 1832857 1769061 1713992 1676559 1644608 1598302 1547391 1507300
17095A507300k9050k7997k7155j9344j4180j4550k5135r217j2930l4124m5387
17084A248231l6667k6747k3594l7621k1255j5190j1176k2675j0363j2937j1306
17073A018700j7201L83J2907R014M56j5990k0372l5352m2488m5944k9035k7493
17061H07585l6408j1902n792p507M945J0265n384k3048k3069k6599l1585n8602
17049E92899m7777m1828k7776j1348Q826N458M733Q259l115n291j0094l7017k3437
17036D12492j9816j8203j5354o155J1391J2031o39j0716n193M983j6527o023L31
17023C42602k3135o756O714n73o427k028k743Q53K415n8j6684Q16J1671q506j3648
17008B84513j4294j5153j7305p917j8859m114P013j233j4107P741K576R647K624
$$ plain form
17095 1507300 1478250 1450253 1423098 1403754 1389574 1375024 1349889 1340672 1327742 1293618 1248231
17084 1248231 1211564 1184817 1161223 1123602 1102347 1087157 1075981 1053306 1042943 1030006 1018700
17073 1018700 1001499 1001882 1014789 1023803 1024259 1008269 987897 952545 910057 864113 835078 807585
17061 807585 771177 759275 753483 745976 750921 761186 755802 732754 709685 683086 651501 592899
17049 592899 545122 503294 475518 464170 472996 478454 483187 491446 488331 483040 472946 435929 412492
17036 412492 392676 374473 359119 352964 364355 376386 375747 365031 359838 364821 348294 342271 342602
17023 342602 319467 312711 319425 318852 312425 310397 307654 308507 310922 310864 294180 294996 306667 298161 284513
17008 284513 270219 255066 237761 229844 210985 206871 213884 212651 198544 206285 208861 218508 221132
16995B21132M21R047Q141p3j3188j4003j818o250k9436j3660j434P208J2249m021
16981A74315O701R147Q595J9773k740o671l783p650j9275n28O609m101j7925o284
16967A56183L243O674K54o497l494r194q59n983P59j843j6482r152L886J066N895
16952A24456N154J023o944j0637j8373j5067R913J444r531M337q114M509l905
16939G8265j1671O59o073j1650N081J4591K0285L229j1166r430l058j1903P352
16926F4511M506k164L406K997j050L749M468j4079L173J8683P590j6387j6452
16913F2951j8182m792j2670J9580K2578n241j3335j1586L37P469k135m107j8097
16900B2770m40j1650O534J1625j3130q327J8466J1623p592o927j206J6226N147
$$ plain form
16995 221132 221553 230600 238741 238668 225480 211477 209659 203409 173973 160313 158879 166087 178336 174315
16981 174315 181016 190163 198758 218531 215791 209120 205337 197687 178412 177884 184493 180392 162467 156183
16967 156183 159426 166100 166354 159857 156363 147169 146310 140327 141086 139243 122761 113609 117495 118561 124456
16952 124456 129610 130633 123689 113052 94679 79612 89525 90969 81438 85775 77661 82170 78265
16939 78265 66594 67253 61180 49530 54611 69202 89487 92716 81550 72120 69062 57159 64511
16926 64511 69017 66853 70259 73256 72206 75955 80423 66344 69517 88200 95790 79403 62951
16913 62951 44769 39977 27307 46887 69465 64224 50889 39303 39640 47109 44974 40867 22770
16900 22770 22330 10680 17214 28839 15709 7382 25848 37471 29879 22952 21746 37972 43119
16887D3119m600l810n563l037r914K37n77k121M943Q550j977P281j122r688K807
16872B4528P116o838n616j4210k1460j068j200q36J8868K5496L662j045L632k260
16858B8769k913r813j1293o240j694l4Q60J2191l827r940l006R892L935n884l567
16843b564O194J0996j916J912J2924J0813k849j0741p873R398R518K695P391j322
16829D4576J089K45J544j5654k1100n390n288L720N097N657N624k417p610o218
16815C875J607K0279P644j2250j5743o443M988o938q337J7315m948o611M324R299
16801H061M097r057j4274m818m384J634P040l509q885m881J2828j098P46l236
16787a9736j4390j311J3338J6356R572J4336L66j5887m672j9990j8333r673O706
$$ plain form
16887 43119 38519 34709 29146 26109 16195 16432 15855 13734 18677 27227 25250 32531 31409 21721 24528
16872 24528 31644 24806 19190 4980 -16480 -17548 -18748 -19584 -716 24780 28442 27397 31029 28769
16858 28769 25856 16043 4750 -1490 -3184 -3218 -2358 9833 6006 -3934 -6940 2952 6887 1003 -2564
16843 -2564 3630 14626 12710 14622 27546 38359 35510 24769 16896 26294 35812 38507 45898 44576
16829 44576 45665 45910 47454 31800 10700 5310 22 3742 8839 14496 20120 17703 10093 3875
16815 3875 5482 25761 33405 21155 5412 -1031 3957 -2981 -11318 5997 1049 -5562 -1238 8061
16801 8061 12158 3101 -11173 -15991 -20375 -18741 -11701 -15210 -24095 -28976 -16148 -17246 -16500 -19736
16787 -19736 -34126 -35437 -22099 -5743 3829 18165 18531 2644 -2028 -22018 -40351 -50024 -43318
16774d3318j398P078J0821J0729J367L618o15o665K824N586J6170R893q860j7691
16760a0461o576Qj514l124P427R699p177N220J333O68j6597n649M205J4159P995
16745c84n943r213p94R98j4613L371J2031J3941M230o776r183j0408P459J6416
16731A132J2252o561m303j397o847j3717M457O199K72J540K668j595l541j761
16717a1202j1922J038p995O001J3100O908j561l440k716Q548J1454M738K346O776
16703B2073j324k0233L774J9436M696K1969K9345J1238K9408M9416O8628R8718
16691C37144J18475J11005Q8216M2088j2501l5787m8981q5690q9155q0246l6752
16680C07816N992L8591R0228J13666J07858O9267K3808k5765n0500p4120q9278
$$ plain form
16774 -43318 -44716 -37638 -26817 -16088 -14721 -11103 -11718 -18383 -15559 -9973 6197 16090 7230 -10461
16760 -10461 -17037 -17029 -18543 -21667 -14240 -4541 -11718 -6498 -5165 -4497 -21094 -26743 -22538 -8379 -384
16745 -384 -6327 -15540 -16334 -15336 -29949 -26578 -14547 -606 3624 -3152 -12335 -22743 -15284 1132
16731 1132 13384 6823 2520 1123 -5724 -19441 -14984 -8785 -8513 -6973 -4305 -5900 -9441 -11202
16717 -11202 -23124 -22086 -30081 -24080 -10980 -4072 -5633 -9073 -11789 -3241 8213 12951 15297 22073
16703 22073 20749 516 4290 23726 28422 50391 79736 90974 120382 169798 238426 337144
16691 337144 455619 566624 654840 696928 684427 648640 599659 513969 424814 344568 307816
16680 307816 313808 352399 442627 556293 664151 733418 757226 731461 680961 606841 517563
16669E17563j16170r6160o0109m0136k5763j7730k1838j2437j0099j3358p369
16658I6394r669J0211R24j0786r271j8815r345O863j755P788P576K035n98J0100
16644H1652L18m783J297r881p656k0617K949n2k1259O59r379k089O9o839P456
16629A1845Q982K786o211r288p262m102M705O389o931L638J0422L638K403L036
16615B4050j867j0109n786J3353n841o233l789n102K942L113l72P333J9274R27
16601C1893k1301k369K511N56M577J7868j3178q549L497k590j180q778R398J1130
16587B3485k271J042K557o150m812Q997P54j3695k103o026O013N791p250j3643
16573g311P01J5864P180N246J2665k429k4051j7939N125L457j969J510N62k774
$$ plain form
16669 517563 401393 305233 245124 204988 179225 161495 139657 127220 117121 103763 96394
16658 96394 86725 96936 97860 87074 77803 58988 49643 56506 54751 62539 70115 72150 71552 81652
16644 81652 81970 77187 78484 68603 60947 40330 43279 43227 21968 22627 13248 11159 11228 4389 11845
16629 11845 20827 23613 17402 8114 852 -3250 1455 7844 913 4551 14973 18611 21014 24050
16615 24050 22183 12074 6288 19641 13800 7567 3778 -1324 1618 4731 4359 11692 30966 31893
16601 31893 10592 8223 10734 11290 15867 33735 20557 12008 15505 12915 11735 2957 12355 23485
16587 23485 21214 22256 24813 18663 13851 22848 23602 9907 7804 1778 7791 13582 6332 -7311
16573 -7311 -6610 9254 16434 21680 34345 31916 7865 -10074 -4949 -1492 -3461 -1951 -1389 -4163
16559d163J7000m92K963o343j7102l977k035J6348K4055q214p418p767P94r514
16545e865j1448j0021k965J0106R626o84n545m783m990R223r288k86J6478M350
16531f092K120L795q589n974M91Q715J6769O659j8630j2081O059K709j342r195
16517a4586R401J1625K010j551Q811p554L129k787q530Q875j53J659j2269q866
16503a0786j933Q527J8699Q271K177n339j0194j6903n65r514n30J6704J0992J7739
16489B7345N914N165l931k2222k3229q106j7898R440m386q46k352J9786Q024N349
16475a947M574Q586K485o503j6778r031J648J7984J5206M655q05m694j3353J3311
16461A5338N817p028p796q945O427n582j5763j4235P84J6138J3415O194N313q811
$$ plain form
16559 -4163 12837 12345 15308 8965 -8137 -12114 -14149 2199 26254 18040 10622 2855 3649 -5865
16545 -5865 -17313 -27334 -30299 -20193 -10567 -11251 -16796 -21579 -26569 -17346 -26634 -26920 -10442 -6092
16531 -6092 -3972 -177 -8766 -14740 -14249 -5534 11235 17894 -736 -12817 -6758 -4049 -5391 -14586
16517 -14586 -5185 6440 8450 6899 15710 8156 11285 8498 -32 8843 8690 10349 -1920 -10786
16503 -10786 -12719 -4192 14507 22778 24955 19616 9422 -7481 -8046 -17560 -18090 -1386 9606 27345
16489 27345 33259 38424 34493 12271 -10958 -19064 -36962 -27522 -31908 -32754 -35106 -15320 -7296 -1947
16475 -1947 2627 11213 13698 7195 -9583 -18614 -16966 1018 16224 20879 20074 15380 2027 15338
16461 15338 21155 14127 6331 -2614 3813 -1769 -17532 -31767 -30983 -14845 -1430 4764 10077 1266
16447A266j5313q521J1758R986l069K484o122L096p953o091O02J65N162P532k384
16432g402J540m510J3566J3073k1329l270n582p777J3761O290q836p096J0534
16419g038K390J9120j12l155j0933l780J3589o118l639J920O165q151n802o566
16405a2110j2363j039J0564J0902M79R46j582l452p143l401R68J650j326J1956
16391d951M806k0477j418P148R817Q651r218r406j3306J0659j909o083k223k332
16377c0242R253J0308M542p603j880R439k424M177m615n300J2574J050n923Q202
16363A558J429p593p353Q575N714M545q954q088p643r43P091K779j166l730m498
16348a8277j044Q227m743J160n5p123r297N330P001j198L134j7417j5545K385
$$ plain form
16447 1266 -14047 -22568 -10810 -824 -3893 -1409 -7531 -4435 -12388 -18479 -17877 -17712 -12550 -5018 -7402
16432 -7402 -5862 -10372 3194 16267 -5062 -8332 -13914 -21691 -7930 -1640 -10476 -17572 -7038
16419 -7038 -4648 14472 14360 11205 272 -3508 10081 3963 324 2244 8409 258 -5544 -12110
16405 -12110 -24473 -25512 -14948 -4046 -3567 -2621 -4203 -7655 -14798 -18199 -17231 -15581 -16907 -4951
16391 -4951 -145 -20622 -22040 -14892 -5075 3576 -5642 -15048 -28354 -17695 -19604 -25687 -27910 -30242
16377 -30242 -20989 -10681 -6139 -13742 -15622 -6183 -8607 -4430 -9045 -14345 -1771 -721 -6644 1558
16363 1558 2987 -4606 -11959 -3384 2330 6875 -2079 -10167 -17810 -18753 -11662 -8883 -10049 -13779 -18277
16348 -18277 -19321 -11094 -15837 -14677 -14732 -21855 -31152 -25822 -18821 -20019 -16885 -34302 -49847 -47462
16334d7462M230q04J5703J2703j989l209O210Q81k1691p6J5263O503l816K573
16320a4981J8152N673K911O943j050j2886q848o629m711q250Q303M452P90k438
16306a2569O087R678n954r093K650Q332J952j362p009j8283P101J3453R786O598
16292A1367m489j0680q577l799m093q085K374K0927J0628J4246J1539j3189q884
16279I285m115m309j878r086j1839M039n49j901M313O359l237J1837P886K158
16265H963J931m814l848k645r602m759K055p786j4503J0541R376J708m760n316
16251b3459o973K866K753K0740Q081m726j2644O58J1146N577J402j393n312j878
16237c162P03o746j3980l245L414J294J0597m146J429l100m152J0448J8587j870
$$ plain form
16334 -47462 -43232 -44036 -28333 -15630 -17619 -20828 -14618 -13737 -35428 -35504 -20241 -13738 -17554 -14981
16320 -14981 3171 8844 11755 18698 17648 4762 -4086 -10715 -15426 -23676 -15373 -10921 -10131 -12569
16306 -12569 -6482 3196 -2758 -11851 -9201 -869 1083 -279 -7288 -25571 -18470 -5017 4769 11367
16292 11367 6878 -3802 -12379 -16178 -20271 -28356 -25982 -5055 5573 19819 31358 18169 9285
16279 9285 5170 861 -1017 -10103 -21942 -17903 -18452 -20353 -16040 -9681 -12918 -1081 6805 8963
16265 8963 10894 6080 2232 -413 -10015 -14774 -12719 -20505 -35008 -24467 -15091 -13383 -18143 -23459
16251 -23459 -30432 -27566 -24813 -4073 4008 -718 -13362 -12704 -1558 4019 5421 4028 -1284 -3162
16237 -3162 -2459 -9205 -23185 -26430 -23016 -21722 -11125 -15271 -13842 -16942 -21094 -10646 7941 6071
16223F071r354J02K224k087p282o603M008M623l321l392N164P142m480M084M729
16208A628Ol444j6336j144J1541M559j7166P729J6955j754J28l021r523k4387
16194c4229k689Q758Q112J1280P118j402o660O529Q689Q074l421j2447k242m055
16180h585q837q20J3535N416j3036l805J1436O59j15r81K35J059k0992K264K821
16165a9746j963m942K644P545L264n646J1000n01R04P673M6j1700q984R36k315
16150b1785j0234J4648p92l708J5805J6416q794n675N620O632J0005j065m758
16137A2315k621j2421n910j090N293M653o76j3276m956Q816O904j0418j1511j629
16123b6527J1711P414N320j606m503J1801j629j7109p982j1677N89J530L809O454
$$ plain form
16223 6071 -3283 -3181 -957 -3044 -10326 -16929 -12921 -8298 -11619 -15011 -9847 -2705 -7185 -3101 1628
16208 1628 1634 -1810 -18146 -19290 -7749 -3190 -20356 -12627 4328 2574 2702 -319 -9842 -34229
16194 -34229 -36918 -28160 -20048 -8768 -1650 -3052 -9712 -3183 5506 13580 10159 -2288 -4530 -8585
16180 -8585 -17422 -18242 -4707 709 -12327 -16132 -4696 -4037 -4152 -5133 -4898 -3839 -24831 -22567 -19746
16165 -19746 -21709 -26651 -24007 -16462 -13198 -18844 -7844 -8345 -7441 232 278 -11422 -20406 -19470 -21785
16150 -21785 -32019 -17371 -18163 -21871 -6066 10350 1556 -4119 1501 8133 18138 17073 12315
16137 12315 9694 -2727 -8637 -9727 -4434 219 -457 -13733 -18689 -9873 -2969 -13387 -24898 -26527
16123 -26527 -14816 -7402 -2082 -3688 -8191 3610 1981 -15128 -23110 -34787 -34198 -32668 -28859 -22405
16109b2405m46m942R17J6977N488K166K993l341N968M393j0303O561N693q7N476
16094A5108k943K96n272j6341r617j110Q214k642L298o575j7024o889M080O191
16080c1226J3335Q097n364N585R357j3086m561m973J1279N981L802l942j0932
16067a6648l161j109r633o667l684J5952M084j256J5878Q92r21P340l893q075
16053a0901j1808K715O978J2776j3177J0405J7525j208K287j6145m779P790m669
16040b211M37Q54k131j767O470j0062k945L052J427o973j593r377Q725J5360p543
16025h277M150j1071j1007o339j63O336M342j983K621k646j1532J2061P452j407
16011a7463k339l961L72K245r665j1446L615J5303R11R74J1547n236P128q17j3594
$$ plain form
16109 -22405 -22851 -27793 -26876 -9899 -4411 -2245 748 -2593 3375 7768 -2535 4026 9719 9632 15108
16094 15108 12165 12461 7189 -9152 -18769 -19879 -11665 -14307 -11009 -17584 -34608 -41497 -37417 -31226
16080 -31226 -17891 -9794 -15158 -9573 -216 -13302 -17863 -22836 -11557 -5576 -1774 -5716 -16648
16067 -16648 -19809 -20918 -30551 -37218 -40902 -24950 -20866 -22122 -6244 -5352 -6273 1067 -2826 -10901
16053 -10901 -22709 -19994 -13016 -240 -13417 -3012 14513 13305 15592 -553 -5332 2458 -2211
16040 -2211 -1774 -920 -3051 -4818 1652 -8410 -11355 -8303 -6876 -13849 -15442 -24819 -16094 -734 -8277
16025 -8277 -4127 -15198 -26205 -32544 -32707 -26371 -22029 -24012 -21391 -24037 -35569 -23508 -16056 -17463
16011 -17463 -19802 -23763 -23391 -21146 -30811 -42257 -38642 -23339 -22428 -21454 -9907 -15143 -8015 -8832 -22426
15996b2426j0730j4001O84J6505L115K739R627K77r923m390O226L064j326J1807
15982h752J713j0665Q783K759o356J8287J0329q775j768K000p307p790N083P583
15968E124N187J22k216Q700q904k6662j5506R256n745R564j333N759L436p0m01
15953a3689J586R697Q879J1406J110j4777l574J073O744R715p221r583n258n595
15939i487K364R849p18k434R74J152l446q137r811R888k210p669J412P533J0511
15924b29p107j3450p953J3804N537K885K249m247m667O860o436O417J5543j2570
15910c364o741n145L550J1727K2695J814r537N356j3590j0883K191n601r662j383
15896a8573Q999n06Q089M300m284j690Q989N765j107l89k244k649J1486J1259
$$ plain form
15996 -22426 -33156 -47157 -46473 -29968 -26853 -24114 -14487 -14210 -24133 -28523 -22297 -19233 -20559 -8752
15982 -8752 -7039 -17704 -8921 -6162 -12518 5769 16098 7323 5555 7555 248 -7542 -2459 5124
15968 5124 10311 10433 8217 16917 8013 -18649 -34155 -24899 -30644 -21080 -22413 -16654 -13218 -13288 -13689
15953 -13689 -12103 -2406 6473 17879 18989 4212 638 1711 8455 18170 10949 1366 -3892 -9487
15939 -9487 -7123 2726 2008 -426 548 1700 -1746 -9883 -19694 -9806 -12016 -19685 -18273 -10740 -229
15924 -229 -7336 -20786 -28739 -14935 -9398 -6513 -4264 -8511 -13178 -6318 -12754 -6337 9206 -3364
15910 -3364 -10105 -15250 -11700 27 22722 24536 14999 20355 6765 -4118 -1927 -7528 -17190 -18573
15896 -18573 -9574 -10080 -1991 2309 -1975 -3665 5324 11089 9982 9593 7349 4700 16186 27445
15882B7445p652j3790k467j623q389J236J860L186Q211o112k4338p723j1179J0599
15868c0736J1098R58N842K1602J668m817j2183j439M933j4656j3292J9747P275
15855d000k064o50n903m929K470n186R856P381J109k87R420o921K179J5662R249
15840B7386j0560k8417J477O531r174j6876m872J0051M274O563J3232K298j841
15827G2Q658q568n390M597K581r007n280j0333l967M272k696Q331K912p897J2023
15812i692K5320P376j8246j0943m31J337L244j48l435K335m588J367N382K906
15798A784j5868m891J1613J2008l984J512J4376J2980j5728j6025j852P4N639
15785A638K976N186l398k736j0609p695m898n952q85o418J6883J9842Q284p471
$$ plain form
15882 27445 19793 6003 3536 1913 -6476 -5240 -3380 -194 8017 1905 -22433 -30156 -41335 -30736
15868 -30736 -19638 -18680 -12838 8764 10432 5615 -6568 -8007 -3074 -17730 -31022 -11275 -4000
15855 -4000 -6064 -6714 -12617 -17546 -15076 -20262 -10406 -3025 -1916 -2203 7217 296 2475 18137 27386
15840 27386 16826 -11591 -10114 -3583 -12757 -29633 -34505 -24454 -20180 -13617 -385 1913 72
15827 72 8730 162 -5228 -631 1950 -7057 -12337 -22670 -26637 -22365 -25061 -16730 -13818 -21715 -9692
15812 -9692 15628 23004 4758 -6185 -6616 -5279 -2035 -2183 -5618 -3283 -7871 -6504 -1122 1784
15798 1784 -14084 -18975 -7362 4646 662 2174 16550 29530 13802 -2223 -4075 -4001 1638
15785 1638 4614 9800 6402 3666 -6943 -14638 -19536 -25488 -26373 -32791 -15908 3934 12218 4747
15771D747J0194J1123J443r841j998r192R81O75j3447j4027J0916O073k483Q454
15757C618j448L389j2922k2144Q464J6033M750q859J2348q937j3331q779n506
15744c3324q181M507J6492O072O994j246m513j1849r425J2918J4522M00m37j360
15730h430K30m19r142n134J2209n852K288J1704M99q313l680J16j0043m285J3468
15715a4784k473j3871J517k056M111O727M443n47O729K730K536R206J0664J1603
15701B6535K187j3264n898J6732n240j6416M538r600p919N259J3580O296q553
15688H237k0225p726N14n697J0722P724L305M049o400j9200M432J1638P125M293
15674B791j0326k851P591L064L368J675j1554j1469m252R039J4562m036j2047
$$ plain form
15771 4747 14941 26064 27507 17666 15668 6476 7457 8132 -5315 -19342 -8426 -2353 -4836 3618
15757 3618 2170 5559 -7363 -29507 -21043 -5010 -260 -9119 3229 -5708 -19039 -27818 -33324
15744 -33324 -41505 -36998 -20506 -14434 -7440 -8686 -13199 -25048 -34473 -21555 -7033 -6633 -7070 -8430
15730 -8430 -8200 -8619 -17761 -22895 -10686 -16538 -14250 -2546 -2047 -10360 -14040 -13924 -23967 -28252 -14784
15715 -14784 -17257 -31128 -29611 -31667 -27556 -20829 -16386 -16933 -10204 -7474 -4938 4268 14932 26535
15701 26535 28722 15458 9560 26292 21052 4636 9174 -426 -8345 -3086 10494 16790 8237
15688 8237 -11988 -19714 -19200 -24897 -14175 -6451 -3146 903 -5497 -24697 -20265 -8627 -1502 2791
15674 2791 -7535 -10386 -2795 269 3637 5312 -6242 -17711 -21963 -12924 1638 -2398 -14445
15661a4445K739O329j2523p97N237R013q907n082J225L871N596o986l437Q660
15647i507O308l419j4087m088k073J3887P35p55R181m176J2000M980n304m154
15633d72J921L524p383K621m819r733k495O661L454p940N787J0100Q906m392j6359
15618a0619j2090k623J2258J7036j0170j4410O726J316p73R559J0765J77j2646
15605e494o316L872R858M998p188n889j0038k276L873L709j66L860L619k95J805
15590b068r841j0679L06L561J6445Q512J889K704n062n991M527Q405j096j422
15576A0190o12j0690j360m513P575J624J3566l541q566n558L931l103n059q109
15562a4225l726J704R531Q416R187P426P151J321o387j1252j3118o79m778q38
$$ plain form
15661 -14445 -11706 -5377 -17900 -18697 -13460 -4447 -13354 -18436 -17211 -13340 -7744 -14730 -18167 -9507
15647 -9507 -3199 -6618 -20705 -24793 -26866 -12979 -12244 -12999 -3818 -7994 4006 8986 3682 -472
15633 -472 1449 4973 -2410 211 -4608 -14341 -16836 -10175 -6721 -14661 -8874 1226 10132 5740 -10619
15618 -10619 -22709 -25332 -13074 3962 -6208 -20618 -13892 -12576 -13349 -3790 6975 7152 -5494
15605 -5494 -11810 -7938 1920 6918 -270 -6159 -16197 -18473 -14600 -10891 -11057 -7197 -3578 -3873 -2068
15590 -2068 -11909 -22588 -22282 -18721 -2276 6236 8125 10829 5767 -224 4303 12708 11612 10190
15576 10190 9578 -1112 -2472 -6985 590 2214 15780 12239 3673 -1885 2046 -1057 -6116 -14225
15562 -14225 -17951 -16247 -6716 1700 10887 18313 25464 26785 20398 9146 -3972 -4651 -9429 -10267
15548a0267N717q546N612J9169J0303k69n556j3816R99J0917o349L792M483J0518
15534B6707K9j5810j2884k97j5016Q058N177M935q81o615p372P182K095m655q004
15519a7351M780N823n640j745R853N490o212O306J871r514l573M099J2013R74
15505G174j535K905Q989l07j6306j7531k397R93M869N661L564r29j3510j6321
15491c4681k252J5147Q339J2660O043o822k1262L920J1108j1541l357O470q213
15478b4441P124J2817K316r186p117L831l467J7123J4722q026m875j3160O381
15465e958M468J4305J0709n618q982j6309R301K184j4779n935j0090J5291K006
15452i407n739J5901k70o633o739J4394P650p285m024P823j950j0750r11O360
$$ plain form
15548 -10267 -4550 -13096 -7484 11685 21988 21719 16163 2347 3346 14263 7914 11706 16189 26707
15534 26707 26736 10926 -1958 -2255 -17271 -9213 -4036 899 18 -6597 -13969 -6787 -4692 -9347 -17351
15519 -17351 -12571 -6748 -12388 -14133 -4280 1210 -5002 1304 3175 -6339 -9912 -5813 6200 7174
15505 7174 5639 8544 17533 17226 920 -16611 -19008 -18015 -13146 -7485 -3921 -4850 -18360 -34681
15491 -34681 -36933 -21786 -13447 -787 5256 -1566 -22828 -18908 -7800 -19341 -22698 -16228 -24441
15478 -24441 -17317 -4500 -2184 -11370 -18487 -14656 -18123 -1000 13722 5696 821 -12339 -5958
15465 -5958 -1490 12815 23524 17906 8924 -7385 1916 4100 -10679 -16614 -26704 -11413 -9407
15452 -9407 -15146 755 485 -6148 -12887 1507 9157 1872 -2152 5671 3721 -7029 -7940 -1580
15438a580O157l89j702k5J4285k286j1307j4604j860q119p555o24J5371P375J3245
15423F382J167j0429o805J0664l157r03l421Q86P441l68q639k610J8068O198J005
15408A5479r9j7101p522Q244o248K814r691j1827P261N64M380J169p509J1039
15394i047J1056m481r41L699m644M599j539K660P20j1379q421j065J2926L319
15380b538j1052p78Q069N132l546r901j1829P463R623m047O956O632J517J906
15366C607l11m204j1032k005n790Q468J1144O946p382k0247m028J1623M011J0260
15352A060r22j7179o643R137J7222K0742J574j4610j5230M661O39k101O527p007
15338b130Q85j820R3N322LJ320J566m156j361K353N16m582o615J1779Q044J686
$$ plain form
15438 -1580 4577 4188 2486 2461 16746 14460 3153 -11451 -13311 -21430 -28985 -29609 -14238 -6863 6382
15423 6382 7549 -2880 -9685 979 -2178 -3081 -6502 -5616 1825 1457 -7182 -9792 8276 14474 15479
15408 15479 15380 -1721 -9243 -999 -7247 -4433 -14124 -25951 -18690 -18126 -13746 -12577 -20086 -9047
15394 -9047 2009 -2472 -3413 286 -4358 241 -1298 1362 2082 -9297 -17718 -18783 -5857 -2538
15380 -2538 -13590 -14368 -6299 -1167 -4713 -14614 -26443 -18980 -9357 -13404 -6448 184 1701 3607
15366 3607 3296 -908 -11940 -13945 -19735 -11267 -123 6823 -559 -20806 -24834 -13211 -9200 1060
15352 1060 138 -17041 -23684 -14547 2675 23417 24991 10381 -4849 -188 451 -1650 4877 -2130
15338 -2130 -1245 -3065 -2972 2350 2353 3673 5239 1083 -278 2075 2591 -1991 -8606 3173 11217 12903
15322A2903q700k1093k97J0138J9708l162j1332q999n965N871J6262J359m338
15309B355J2787j5802k539N388k094p803N717N928o905m013L60m938r166O703
15295a4022R998J2660j4237k5835n849O557J7454M41o484J7340k411M42k15j0899
15281a5060j094J2458o178j940J964J1169j4149r68l443M232k745J613R176N635
15267F70j0536k745l0443O720J7412J8402K0872j133j0187k453j1280j1444j692
15254a7837N745o183J5675N623j943Q616N399j2977k4235l247J442J1836m060
15241a6146K884Q243M433qr941k0896l197R930N697P53N472P49j1674m275k981
15226c0957N356j24l304J5863J917j696J2365K245P150N426J1609j5091J881n001
$$ plain form
15322 12903 4203 -16890 -17187 -7049 12659 9497 -1835 -10834 -16799 -10928 5334 6693 2355
15309 2355 15142 -660 -3199 2189 95 -7708 -1991 3937 -2968 -6981 -6621 -11559 -20725 -14022
15295 -14022 -4024 8636 -5601 -31436 -37285 -30728 -13274 -12833 -19317 -1977 -4388 -3946 -4161 -15060
15281 -15060 -16154 -3696 -9874 -11814 -9850 1319 -12830 -13798 -17241 -13009 -15754 -14141 -4965 670
15267 670 -9866 -12611 -43054 -36334 -18922 -520 20352 19219 9032 6579 -4701 -16145 -17837
15254 -17837 -12092 -18275 -2600 3023 1080 9696 15095 2118 -22117 -25364 -23922 -12086 -16146
15241 -16146 -13262 -5019 -586 -594 -10535 -31431 -34628 -24698 -19001 -18248 -12776 -12027 -23701 -27976 -30957
15226 -30957 -25601 -25725 -29029 -13166 -11249 -12945 -580 1665 8815 14241 25850 10759 12640 7639
15212G639m501O766J0169o102k3151N263K407j614o836o977o99M482J0342j893
15198d705p113r46O290K430o93k582P429J481n761l905j922O314j1804q733J1866
15183a2354L139j1319j4565J328N591K568J4333R164l941L270J1505k790j5737
15170i808r414J1047N52j0164O512M892q075p80J7995J7439J3580p916j2130p21
15156A3009j1841m884r049N133J1912m155n619L2l183n176N226n880L50J3172
15142i53J816l86l047Q742n604j0167K344O902M866J283j2430n554l7r18Q152
15127d991k001N081Q57J6783Q250j2596o630j1278q928O203k730N343n497M929
15113g205J3707p479L770M291M2m76j2015r073J2756J0002Q312j1727q808m543
$$ plain form
15212 7639 3138 9904 20073 13971 -9180 -3917 -1510 -3124 -9960 -16937 -17636 -13154 -2812 -4705
15198 -4705 -11818 -12764 -6474 -4044 -4737 -7319 110 1591 -4170 -8075 -9997 -3683 -15487 -24220 -12354
15183 -12354 -9215 -20534 -35099 -33771 -28180 -25612 -11279 -2115 -6056 -2786 8719 5929 -9808
15170 -9808 -19222 -8175 -7623 -17787 -11275 -6383 -14458 -15238 2757 20196 33776 25860 13730 13009
15156 13009 1168 -3716 -12765 -7632 4280 125 -5494 -5462 -8645 -13821 -8595 -14475 -14125 -953
15142 -953 863 477 -2570 6172 568 -9599 -7255 -353 4513 5796 -6634 -12188 -12225 -13143 -4991
15127 -4991 -6992 -1911 -1054 15729 23979 11383 4753 -6525 -15453 -9250 -11980 -6637 -12134 -7205
15113 -7205 6502 -977 2793 7084 7126 6650 -5365 -14438 -1682 8320 16632 4905 -3903 -8446
15099h446o562Q013J2353k28n401o162l018J0109J1732P335J3763k0118k5243
15086a1873J354o684l921J2422J2144o288o706j2830K587L066Q598j243M76R099
15072B01J2793K481L682m133k806l538k0364o302P075N963J694K235n76O221n289
15057f63j2041k645o431N238l279L267J0211J2807N94M944r214o534j2254M68
15043a5532O822O525J0578J6311M604j519j3163j3802j8160o14N468P640Q58K2359
15029A8375n065o236j2185o808j1018K582P454K66P981j2237k775o214R986M602
15015a1292o376j2021k904L209m09m221O945K1871J1938l210p388O084j853p30
15001c57J0532n533l839J1956O076j1035j6240N638Q308k914j4729m420J2456
$$ plain form
15099 -8446 -15008 -6995 5358 5130 -271 -6433 -9451 658 12390 19725 33488 13370 -11873
15086 -11873 -10519 -17203 -21124 -8702 3442 -2846 -9552 -22382 -19795 -16729 -8131 -9374 -8898 201
15072 201 12994 15475 19157 15024 12218 8680 -11684 -17986 -10911 -4948 -3254 -1019 -1595 4626 -663
15057 -663 -12704 -15349 -21780 -16542 -19821 -16554 -6343 6464 7058 12002 2788 -3746 -16000 -15532
15043 -15532 -8710 -2185 8393 24704 29308 27789 14626 824 -17336 -17950 -12482 -4842 -3984 18375
15029 18375 13310 7074 -5111 -11919 -22937 -20355 -12901 -12635 -4654 -16891 -19666 -25880 -15894 -11292
15015 -11292 -17668 -29689 -32593 -29384 -29793 -34014 -27069 -5198 6740 3530 -3858 2226 373 -357
15001 -357 10175 4642 803 12759 18835 7800 -8440 -2802 5506 2592 -12137 -16557 -4101
14988d101k465P719o673L636j7449j9070K8284J3454l24j221K837k277M604N695
14974A2649M074k450N252n80K300m362r068q120j1300P933j44L07K73L665J4272
14959A4701r153Q584j2437j5262O304P883p998K803K93M605O333k110j691m005
14945a150l904p259j2894O023P933J3983J1553k251n906M992Q33J6112o095k8276
14931f306j4774n816P889o42Q110m053q495o86Q64p532K266M119R316J4192K6908
14916B5360Q986k1127k5677R192J788j0763j1837n347L398o056M410J1097n858
14903b2434J696K738P716Q416m729q994K852J1921L091J570j0219j21j475j943
14889i915k653n972Q570m731j5526k213J4999K579j1571J6584Q523J708r053o462
$$ plain form
14988 -4101 -6566 1153 -5520 -1884 -19333 -38403 -10119 3335 3011 1790 4627 2350 6954 12649
14974 12649 16723 14273 19525 18945 21245 16883 7815 -305 -11605 -3672 -3816 -3509 -3236 429 14701
14959 14701 5548 14132 1695 -13567 -7263 620 -7378 -4575 -4282 323 6656 4546 2855 -1150
14945 -1150 -5054 -12313 -25207 -19184 -11251 2732 14285 12034 6128 11120 11953 28065 21970 -6306
14931 -6306 -21080 -26896 -19007 -19649 -11539 -15592 -24087 -24773 -23909 -31441 -29175 -25056 -15740 -1548 25360
14916 25360 34346 13219 -12458 -3266 -1478 -12241 -24078 -29425 -26027 -32083 -27673 -16576 -22434
14903 -22434 -20738 -18000 -10284 -1868 -6597 -15591 -12739 -818 2273 3843 -6376 -6497 -7972 -9915
14889 -9915 -12568 -18540 -9970 -14701 -30227 -32440 -17441 -14862 -26433 -9849 -1326 382 -8671 -15133
14875a5133P131j029j0737M34O845j410Q339p269j634M61J3305K2863k958j3013
14861F195j5849L201J657M713n42J850j70k984j631j2691P584J0361j147j8700
14847a8153k027Q922J3042R276N903L897M715J1102k4648l0581N744J8788L367
14834I347m025l902m552q622o632k114P34J3440k44k390J0597J2124j5644m824
14820f707M101O719N334K12J772j1875q778k815J2483Q98p250o211j1540M755
14806a8902R788N044L369l635K356J5852l318n827o680N280J947O912o11J085
14792A2660M883o604q790k463k909M547J7154J0181K465r949p171j1438r951p221
14778a4606j111Q274K1876N581J3658o233k6291j6227n490J1490J1096M706o579
$$ plain form
14875 -15133 -8002 -9031 -19768 -19334 -12489 -13899 -5560 -12829 -14463 -14002 -697 22166 19208 6195
14861 6195 -9654 -6453 -4796 -83 -625 1225 1055 -1929 -3560 -16251 -8667 1694 547 -18153
14847 -18153 -20180 -11258 1784 11060 16963 20860 25575 36677 12029 -18552 -12808 5980 9347
14834 9347 5322 1420 -3132 -11754 -18386 -20500 -19766 -6326 -6570 -8960 1637 13761 -1883 -6707
14820 -6707 -2606 4113 9447 9659 11431 -444 -9222 -12037 446 1344 -5906 -12117 -23657 -18902
14806 -18902 -9114 -4070 -701 -4336 -1980 13872 10554 4727 -1953 3327 5274 12186 11575 12660
14792 12660 17543 10939 2149 -314 -3223 1324 18478 28659 31124 21175 14004 2566 -7385 -14606
14778 -14606 -15717 -7443 14433 20014 33672 27439 1148 -15079 -20569 -9079 2017 6723 144
14765A44q581j53j2445p491N477M413J1920J1975j0768M931J0966O039l375l597
14751I455q475N621J0528J0275J2684N542J486k0364j2093N306l790j1576r351
14738d752j730P556q647p289q42j0605j171Q386n129p872K002J6178R84N549Q014
14723F32J52m098M139o14K112r877l838p84l991Q88K114Q867J0842M670J936j0027
14707C123k340l140n663L31O907J2473R28J356K223o344L582M03j0801q649J3799
14692H188J0060j2985o91Q422o918N832R08K583L794q931p362j2103j5835j534
14678b6572J0401J2919n851M316m314K695N174R021l97p083K748O015L491R470
14664B2033M617n444k651l65j9196j2291R034L589N65P914l186o892o649O533
$$ plain form
14765 144 -8437 -8590 -21035 -28526 -23049 -18636 -6716 5259 -5509 -578 10388 16427 13052 9455
14751 9455 980 6601 17129 27404 40088 45630 47116 26752 14659 19965 16175 4599 -4752
14738 -4752 -6482 1074 -7573 -14862 -15704 -26309 -27480 -19094 -24223 -32095 -30093 -13915 -12931 -7382 632
14723 632 784 -3314 825 211 2323 -7554 -11392 -12176 -16167 -15279 -13165 -4298 6544 11214 13150 3123
14707 3123 783 -2357 -8020 -7689 -782 11691 12619 13975 16198 9854 13436 13839 3038 -5611 8188
14692 8188 18248 5263 4572 12994 6076 11908 12816 15399 19193 10262 2900 -9203 -25038 -26572
14678 -26572 -16171 -3252 -9103 -4787 -9101 -6406 -1232 7789 7392 309 3057 9072 12563 22033
14664 22033 26650 21206 18555 18190 -1006 -13297 -4263 -674 -109 7805 4619 -2273 -8922 -2389
14650b389N762K528l491j8558l850j677J1070K1515O462r645j5175P063l16p648
14636h349p495J2896J0156l71k859J2005j5892K057P184j6843K484N290j181l408
14622d326J9394l323j0500K737k090p992q04p475m537P510M558Q374l325K153
14608C54p355M120P578k278j737L503K346r292k099M690L692l871j77j26n951
14593f603n36K464N951q927j8397J331j108o950J4775R888O617o595J616J1223
14579D749m092q192O12m600M637K809J3225O967j6990k437n551O252m376q039
14565a5026j1499J292J1481P264p436m290O528J3937P589l619q390m477J4192
14552G546J4411l083p914k1663n250J0R12l03J9383O444L154j0325p093P996Q448
$$ plain form
14650 -2389 3373 5901 2410 -16148 -19998 -21675 -10605 10910 17372 7727 -7448 -385 -701 -8349
14636 -8349 -15844 -2948 7208 6837 3978 15983 91 2148 9332 -7511 -5027 263 -918 -4326
14622 -4326 15068 11745 1245 3982 1892 -6100 -6904 -14379 -18916 -11406 -6848 1526 -1799 354
14608 354 -7001 -2881 4697 2419 682 4185 6531 -2761 -4860 -170 3522 -349 -526 -652 -6603
14593 -6603 -7139 -4675 1276 -7651 -26048 -24717 -25825 -32775 -18000 -8112 -1495 -8090 -6474 4749
14579 4749 657 -7535 -6923 -11523 -6886 -4077 9148 16115 -875 -3312 -8863 -2611 -6987 -15026
14565 -15026 -26525 -25233 -13752 -6488 -13924 -18214 -11686 2251 9840 6221 -2169 -6646 7546
14552 7546 21957 18874 10960 -10703 -15953 -15943 -15031 -15334 4049 10493 13647 3322 -3771 4225 12673
14537A2673q918n474M214o541r249j6604K0843K2134j237j5195k894o497j055
14524a3800k76j308J2631q328m239m875k546n169M506K65j2216K392J1516Q189
14510a3258J109K55j0031k057O982P514M87M744j922J229L371R98j5394p320K0643
14495b650L041j1461J3335K0126l260N63n870j6519o729n640K833M325N000p804
14481a0710j0142n85q44Q809J5356R249j912n682J615m252l955R368K825K144
14467A1284j0088p830K245j1393L282K4241k634k6142P467J353L269J1616j286
14454E384j4489q542J4688j22l394O229J1664k930r621j5227l077M928P363M360
14440b786Q905N484J5281k0768j6263q38j0670J409P886J5760l031O564m849o323
$$ plain form
14537 12673 3755 -1719 2495 -4046 -13295 -29899 -9056 13078 11841 -3354 -6248 -12745 -13800
14524 -13800 -14076 -15384 -2753 -11081 -15320 -20195 -22741 -27910 -23404 -23139 -35355 -32963 -21447 -13258
14510 -13258 -12149 -11894 -21925 -23982 -17000 -9486 -8999 -4255 -6177 -4948 -1577 -579 -15973 -23293 -2650
14495 -2650 391 -11070 2265 22391 19131 19694 13824 -2695 -9424 -15064 -12231 -7906 -2906 -10710
14481 -10710 -20852 -21437 -22281 -13472 1884 11133 9221 3539 5154 902 -3053 6315 9140 11284
14467 11284 1196 -6634 -4389 -15782 -12500 11741 9107 -17035 -9568 -8215 -4946 6670 5384
14454 5384 -9105 -17647 -2959 -3081 -6475 -246 11418 8488 -1133 -16360 -19437 -14509 -7146 -2786
14440 -2786 6119 11603 26884 6116 -10147 -10985 -21655 -20246 -12360 3400 369 6933 2084 -4239
14426d239l441j101j0311j166L083J1711n095j4536o543J0035P982K0493o073
14413G99n754q06L28K970p520k3958N983J6203L365j239l895J4304J1302M055
14399A6137n367Q574m327j1322l644j7306j9004M506R015Q195P17j5800R638K4519
14385D531J845L113j162j0241j8515O698J0346J0845m278L456Q754m526r314J18
14371A670j1110n31n822m3M424o197j337P171q199M398K1616K594k85k711r336
14356c698o039q909L607Q986J0491r515O641P320K72j0625q911M991k38o531o926
14341a9084k777n384J1227J0574n035M764o754n053J1340K726p382j4960J193
14328b4605K189k97Q829J9641M945l835p950m809o97J11j748J0073N571L242n451
$$ plain form
14426 -4239 -7680 -8781 -19092 -20258 -17175 -5464 -10559 -25095 -31638 -21603 -13621 6872 799
14413 799 -4955 -5761 -5433 -2463 -9983 -33941 -27958 -11755 -8390 -9629 -13524 780 12082 16137
14399 16137 10770 19344 15017 3695 51 -17255 -36259 -31753 -22738 -14543 -13826 -29626 -19988 4531
14385 4531 6376 9489 8327 -1914 -20429 -13731 -3385 7460 3182 6638 15392 10866 1552 1670
14371 1670 -9440 -9971 -15793 -15836 -11412 -17609 -18946 -11775 -19974 -15576 6040 8634 8349 5638 -3698
14356 -3698 -9737 -18646 -15039 -6053 4438 -5077 1564 8884 9156 -1469 -10380 -5389 -5627 -12158 -19084
14341 -19084 -21861 -27245 -16018 -5444 -10479 -5715 -12469 -17522 -6182 -3456 -10838 -25798 -24605
14328 -24605 -22416 -22713 -13884 5757 10702 6867 -1083 -5892 -6589 -6478 -8226 1847 7418 10660 5209
14313E209j1872o863J372Q118j68k267o164j336q481m28O655J9131J4639k0204
14299b659j0670M262M812p475q166j793O398P364O179K292P446L908j875k479
14285G544n706j064r97L235J1188m031j4585j0765Q300l551q001l34M345l442
14271a7864j0011l913J0859R486K43r400K835q365N994K0575O011q690q162N967
14257d435K5403o045j5908j1588L739J841m623j553N943J0986p075j0982J2810
14244a487L013j4529J4101J1928j3966J537J3037r939j2841L68J607L820K981
14231c70p486j5925o68K497J523J6648k632Q469N752o484j4793L444P446P302
14217D723j4020j233J0778k805r280q886N122m506J9490m312L544m01j2721R781
$$ plain form
14313 5209 -6663 -13526 -12154 -4036 -4204 -6471 -12635 -13971 -22452 -22880 -16225 2906 17545 -2659
14299 -2659 -13329 -9067 -4255 -11730 -19896 -21689 -15291 -7927 -1748 544 7990 11898 10023 7544
14285 7544 1838 774 -223 3012 14200 10169 -4416 -15181 -6881 -10432 -18433 -18767 -14422 -17864
14271 -17864 -27875 -31788 -20929 -11443 -11200 -20600 -17765 -26130 -20136 439 6450 -2240 -10402 -4435
14257 -4435 20968 14923 -985 -12573 -8834 -6993 -11616 -13169 -7226 3760 -3315 -14297 -1487
14244 -1487 1526 -13003 1098 13026 -940 597 13634 3695 -9146 -8778 -7171 -3351 -370
14231 -370 -7856 -23781 -24449 -21952 -20429 -3781 -6413 2056 7808 1324 -13469 -10025 -2579 4723
14217 4723 -9297 -10530 248 -2557 -11837 -20723 -15601 -20107 -617 -4929 -1385 -1786 -14507 -4726
14203d726L116K884J3294k151N224K875J3177K1760R230J1695j511J587k200k4742
14189D9512k7154q547o043R187O990q596L890j170p195n03n655j5223k817j0942
14175b4266j0433L988J0267K2538J2775o246n034j0055l624N968R546J6986R134
14162C1544P478k175j3163k0307l474N770p75j7898P769J3002R332j961m717Q423
14148A8848O244j0708j0390N038q613M169K777l449j3576m441Q694j950P514J6004
14134A6161q834K734J76N145j7145r015J2582J790j5424J1730N037j35j415J861
14120E248j1401l777O449J0331M764j9633j3203j5424J918J0250M156Q371N039
14107f912R05J3752O142j2515j2462O044K370M369k0831j6237J6026L5606O439
$$ plain form
14203 -4726 -1610 1274 14568 12417 17641 20516 33693 55453 64683 76378 74867 76454 74254 49512
14189 49512 22358 13811 7768 16955 23945 15349 19239 18069 10874 10371 4716 -10507 -13324 -24266
14175 -24266 -34699 -30711 -20444 2094 14869 8623 3589 -6466 -10090 -4122 5424 22410 31544
14162 31544 39022 36847 23684 3377 -97 5673 4898 -13000 -5231 7771 17103 15142 10425 18848
14148 18848 25092 14384 3994 9032 419 4588 7365 3916 -9660 -14101 -5407 -7357 157 16161
14134 16161 7327 10061 10237 15382 -1763 -10778 1804 3594 -11830 -100 4937 4802 3387 5248
14120 5248 -6153 -9930 -3481 6850 11614 -8019 -21222 -36646 -34728 -24478 -20322 -11951 -6912
14107 -6912 -6007 7745 13887 1372 -11090 -5046 -2676 1693 -19138 -35375 -19349 16257 22696
14094B2696n861k2083o802J091j0638l375J025P248R336m439R14N602l972k557
14080a1815P677j5432K55J2060P896L868K971J3978k489p726j5236k843N77O54
14066e605q549L301l691k730m78R344J1699j0835j242M105M974N923O505K238
14052A4959o993l067o573n793l417P666r191P081j0812N567K1343k766K511n997
14038D518r803j672M889n952P477p954p23O208j876q524m957K541l207l233P549
14023a4719N65p482N230O089j050J3328M77j024j689P213r670j0294j2822j9329
14009d5177j3810J3737K2821R446M416n543j4877J7415l517p065k567Q388O144
13996a0189J3998j673l338j1328p309J4283O902m614Q930k436k0881j447J6793
$$ plain form
14094 22696 16835 -5248 -12050 -10959 -21597 -24972 -23947 -16699 -7363 -11802 -10888 -5286 -9258 -11815
14080 -11815 -4138 -19570 -19315 -7255 641 4509 7480 21458 18969 11243 -3993 -6836 -6259 -5605
14066 -5605 -14154 -10853 -14544 -17274 -17752 -8408 3291 -7544 -8786 -4681 293 6216 12721 14959
14052 14959 7966 4899 -1674 -7467 -10884 -3218 -12409 -5328 -16140 -10573 10770 8004 10515 4518
14038 4518 -5285 -6957 -2068 -8020 -543 -8497 -9220 -3012 -4888 -13412 -18369 -15828 -19035 -22268 -14719
14023 -14719 -14154 -21636 -16406 -10317 -11367 1961 2438 1414 -275 6938 -2732 -13026 -25848 -45177
14009 -45177 -58987 -45250 -22429 -12983 -8567 -14110 -28987 -11572 -15089 -22154 -24721 -16333 -10189
13996 -10189 3809 2136 -1202 -12530 -19839 -5556 1346 -3268 5662 3226 -17655 -19102 -2309
13983b309N854R354r458l659P833N106M524r453N314m41m770p506J946l430J3469
13968A2374n780o263M982L504k2893M707N232k778k098J3909k866o419O800m333
13954a922r182j4542l088P049O80J279j955N867L655M294m60j4629M26J3605l657
13939a2580O474k035j6173m126K080J2643J0439o0j723M058K364m720L915Q393
13925H949m267j3245q300l613Q598p736M965Q43q716o029N219J1122J9419N110
13911A2319l397L194J2631O509j2177j4060L069j146p717l533J0932k605j0003
13898e984o101Q070J1751P03j937q849k848R52L811L057j0142r898j1279k470
13884c1164J7587J7641j56l671p465l925L527J90o901p81P46J0209J3781J0594
$$ plain form
13983 -2309 3545 12899 3441 -218 7615 12721 17245 7792 13106 12665 7895 389 2335 -1095 12374
13968 12374 6594 331 5313 8817 -14076 -9369 -4137 -6915 -9013 4896 2030 -4389 2411 -1922
13954 -1922 -11104 -25646 -28734 -21685 -21005 -19726 -21681 -15814 -12159 -7865 -8325 -22954 -22528 -8923 -12580
13939 -12580 -6106 -8141 -24314 -28440 -26360 -13717 -3278 -3338 -5061 -1003 1361 -3359 556 8949
13925 8949 4682 -8563 -16863 -20476 -11878 -19614 -14649 -13806 -22522 -28551 -23332 -12210 7209 12319
13911 12319 8922 12116 24747 31256 19079 5019 8088 6942 -775 -4308 6624 4019 -5984
13898 -5984 -12085 -4015 7736 8439 6502 -2347 -5195 -4243 -432 2625 -7517 -17415 -28694 -31164
13884 -31164 -13577 4064 3908 237 -7228 -11153 -7626 -7436 -14337 -15118 -14372 -4163 9618 20212
13870B0212j278j6528k033L009j110M799Q868R356P09n074K027M111J715j0337
13856A8446k2337O007k476l376O275R129O226k3K367j3153j2433P892n751j4979
13842a8186k81k589M362j3448r268O32J8450K1121m334j2480R569n009m62l242
13828a5165j633o61o315k226J1820L108k365K073P590k848j1143L795m27n280
13814a9677m864L239k378J2037j242J877j4003k517K767N585l4L71K520K338j699
13799a5680l041R763R170J915m008j8265p900M036R891M844l012k014L937n00
13785a0864n721Q606J7302j666P129J0360j0452j718o396N660Q39j3345q831k383
13771a1480n9N398M001k41m056J2213O770m246L509l455j1081P633l706k761J1127
$$ plain form
13870 20212 18934 2406 373 3382 2272 7071 15939 25295 26004 20930 22957 27068 28783 18446
13856 18446 -3891 2116 -360 -3736 2539 11668 17894 17871 20238 7085 -5348 2544 -3207 -18186
13842 -18186 -18467 -21056 -16694 -30142 -39410 -38778 -20328 793 -3541 -16021 -6452 -11461 -11923 -15165
13828 -15165 -16798 -17459 -23774 -26000 -14180 -11072 -13437 -11364 -3774 -6622 -17765 -13970 -14397 -19677
13814 -19677 -24541 -21302 -23680 -11643 -12885 -11008 -25011 -27528 -24761 -19176 -19210 -18839 -16319 -13981 -15680
13799 -15680 -18721 -8958 212 2127 -1881 -20146 -28046 -24010 -14119 -9275 -12287 -14301 -10364 -10864
13785 -10864 -16585 -7979 9323 7657 14786 25146 14694 12976 6580 12240 13079 -266 -9097 -11480
13771 -11480 -11539 -6141 -2140 -2381 -6437 5776 12546 8300 11809 8354 -2727 4906 1200 -1561 9566
13756I566p356j8514P417Q737p557J0318L492N537K891j1037j5683q277l391N475
13742a8382q002q855J7637K979R807R829o009l154J2425O266r326L392R473j6721
13728A359j0302L365l619R442R565O590j3155n07O769m191K607N724o54j5128
13714b135r543L896J490j0917q923L087L517Q673P786p589J4612n241p722j631
13700a0640J0859N532n805r87l412n363o059J254J3483k521k471m8O091P254Q887
13685A6054j544n687j248j0328J1681j134L081P164j159n453q142M033j0803P079
13671C594p502j2782j001O152N010J1267o604q154J3781N340N674o165J081n347
13657D344Q784j199o902q958o245j2137q225J9168L826j6273j975R926K0397k191
$$ plain form
13756 9566 2210 -16304 -8887 -150 -7707 2611 6103 11640 14531 3494 -12189 -20466 -23857 -18382
13742 -18382 -26384 -35239 -17602 -14623 -4816 5013 -996 -4150 8275 14541 5215 8607 18080 1359
13728 1359 -8943 -5578 -9197 245 9810 16400 3245 2738 9507 5316 7923 13647 12993 -2135
13714 -2135 -11678 -7782 -6292 -17209 -26132 -23045 -19528 -10855 -3069 -10658 3954 -1287 -9009 -10640
13700 -10640 219 5751 -54 -1041 -4453 -9816 -15875 -14621 -1138 -3659 -6130 -6178 -87 7167 16054
13685 16054 14510 8823 7575 -2753 8928 7794 10875 18039 16880 11427 3285 7318 -3485 3594
13671 3594 -3908 -16690 -17691 -11539 -6529 4738 -1866 -10020 3761 9101 14775 8610 9691 4344
13657 4344 13128 11929 5027 -3931 -10176 -22313 -30538 -11370 -7544 -23817 -25792 -15866 4531 2340
13643B340p483R388N612j123j7278Q024m823o827k060q272N905J4667N223j1390
13629h097j1203j320J1511J5959r478n211N202K538o653J6211J701m574j2112
13616e526j829M260j1812m589K994P005J2977Q69N798j9629r902P509N749J0648
13602D522o269k730l768P385q70n977j777O061N331O35j874o387j3002Q91m370
13587b2199L737J5656L689N302r493M701K502K308k4247k941J5705P456Q229p717
13573B688j7100L082M033n043P290o269j331J6296J0423N105M240j1910l1825
13560b0321l129J6372N554k06J3531J1622M335J2303k373j4551j2026j1995J606
13547G22N457M916l072j6026J7301J6000L597j3962r283L477j192p274k989l41
$$ plain form
13643 2340 -5143 4245 9857 8734 -8544 -520 -5343 -12170 -14230 -22502 -16597 -1930 3293 -8097
13629 -8097 -19300 -20620 -9109 6850 -2628 -7839 -2637 -99 -6752 9459 11160 6586 -5526
13616 -5526 -7355 -3095 -14907 -19496 -16502 -9497 3480 4349 10147 -9482 -19384 -11875 -6126 4522
13602 4522 -1747 -4477 -8245 -860 -1730 -7707 -9484 -3423 1908 2543 669 -5718 -18720 -17829 -22199
13587 -22199 -18462 -2806 883 6185 -3308 1393 3895 6203 -18044 -20985 -5280 2176 10405 2688
13573 2688 -14412 -11330 -7297 -12340 -5050 -11319 -12650 3646 14069 19174 23414 11504 -20321
13560 -20321 -23450 -7078 -1524 -1730 11801 23423 27758 40061 37688 23137 11111 -884 722
13547 722 6179 11095 8023 -8003 9298 25298 28895 14933 5650 9127 7935 661 -2328 -2669
13533b669j2446J244n856L013J2036R378N893O058n624r326O609n462j0704p839
13519a5695K213p78L530N072l957J182R661L145K498m097j5009j0088p619n900
13505c5842P780J2184J6424K058n678J056m122q590J713R39l858J6250L304l185
13491D33L25l54R546J97n555j727J3952M640r933o247j0123L363J7590k479j1647
13476A981M162k47k0304l327m104l058M047K6866O274N133R886K432J328r396
13462B1673n907p63j0817k2717M44n394J1579n123r331J3473K2515J341p121j625
13448B227J0318o463J1957p72J982N590j4815j7270J95M04j3722j386J1633J2992
13434B870K295l217m985j2457J0173J6656n477K461J538J1999O393K2613j5179
$$ plain form
13533 -2669 -15115 -13871 -19727 -16714 -4678 4700 10593 16651 11027 1701 8310 2848 -7856 -15695
13519 -15695 -13482 -14260 -10730 -5658 -9615 -8433 1228 4373 6871 2774 -12235 -22323 -29942 -35842
13505 -35842 -28062 -15878 546 2604 -3074 -2018 -6140 -14730 -13017 -12078 -15936 314 3618 433
13491 433 758 404 9950 10147 4592 2865 16817 21457 11524 5277 -4846 -1483 16107 13628 1981
13476 1981 6143 5896 -14408 -17735 -21839 -24897 -20850 6016 12290 17423 27309 29741 31069 21673
13462 21673 15766 15003 4186 -18531 -18087 -23481 -11902 -17025 -26356 -12883 9632 10973 3852 2227
13448 2227 12545 6082 18039 17267 19249 24839 10024 -7246 -7051 -6647 -20369 -21755 -10122 2870
13434 2870 5165 1948 -3037 -15494 -5321 11335 5858 8319 9857 21856 28249 50862 35683
13421C5683k6520j1579j5584L028J4319J1033o338j0868m392O144M76M616J1783
13408A1801L994q317p850q704J0052K246q395j2843q089J3886R270J2306J13j8584
13394i114m775M202q612J88R549j38N010J1078N365j7668k674L065M294J892J167
13379B829K828k67M446M966J387k600j1382R396O401l688j4729q784J597qQ62
13364f746M152O764l228m539M754n752o929R956L921P159Q356Q163j3024p351
13350E656p148O867r763R008P94J467k375n587N14J004p51j6434k1364P648J960
13335b8504j958M196J8614O519m753J1128J1423P93j3332N909o849j8470p191
13322b2475J6631P671r351N439p915K607R543j1017P10k365N703J5361P643r580
$$ plain form
13421 35683 9163 -2416 -18000 -14972 -653 10380 4042 -6826 -11218 -5074 -4598 18 11801
13408 11801 15795 7478 -372 -9076 976 3222 -5173 -18016 -26105 -12219 -2949 9357 9470 -9114
13394 -9114 -13889 -9687 -18299 -18111 -8562 -8700 -3690 7388 12753 -4915 -7589 -4524 -230 1662 2829
13379 2829 5657 5390 9836 14802 16189 13589 2207 11603 18004 14316 -413 -9197 -7600 -7608 -6746
13364 -6746 -2594 4170 942 -3597 1157 -4595 -11524 -1568 2353 9512 17868 26031 13007 5656
13350 5656 -1492 5375 -4388 4620 5414 6881 4506 -1081 -567 437 -314 -16748 -38112 -30464 -28504
13335 -28504 -30462 -26266 -7652 -1133 -5886 5242 16665 17458 4126 10035 3186 -15284 -22475
13322 -22475 -5844 1827 -7524 -2085 -10000 -7393 2150 -8867 -8157 -10522 -4819 10542 18185 8605
13308H605n192M842j0647j3069j954l299j2865J1133J8085K389N31j462p622j361
13294a1886k370l256l375P522l017p243r216J2341J2461J5360J2996K500j5357
13281G460o089q453j832J8015J344o282r272j819N528J252k501K249l045K047
13267a398R6R80N47O08q928j876Q893j3046J1824J5482k193p066r104Q541P817
13252A1177o906L726J5915L777k2489n173J1705Q259o253j0415j2349j2861Q913
13239a2974L923K605O127J9511J1317j4454j0409m712l001R305M967J0896j99
13226B2902O224q217n178R101l528p586o699k843N231J2180J1533j1250k080K043
13212B1833l889P519J9134K6168J8831J2318J8020J030j3484q05j3952k640j475
$$ plain form
13308 8605 3413 8255 -2392 -15461 -17415 -20714 -33579 -22446 -4361 -1972 -1441 -2903 -10525 -11886
13294 -11886 -14256 -17512 -20887 -13365 -16382 -23625 -32841 -20500 -8039 7321 20317 22817 7460
13281 7460 1371 -7082 -8914 9101 10445 4163 -5109 -6928 -1400 -148 -2649 -400 -3445 -1398
13267 -1398 -1302 -322 225 833 -8095 -9971 -1078 -14124 -2300 13182 10989 3923 -5181 3360 11177
13252 11177 4271 7997 23912 27689 5200 27 11732 19991 13738 3323 -9026 -21887 -12974
13239 -12974 -9051 -6446 -319 19192 30509 16055 5646 934 -2067 7238 12205 23101 22902
13226 22902 29126 20909 15731 24832 21304 13718 7019 4176 9407 21587 33120 21870 19790 21833
13212 21833 17944 25463 44597 70765 89596 101914 119934 120964 107480 106675 92723 90083 88608
13199H8608j0827j1414k5052k1412j0775R306J623k2k958j0679j371K0822J5105
13186D0954L513j8876j9168p940R694L103m586j33J2230P97p85j1626R265K2052
13172C8494O295O924j814j5139j7042J2750J3862Q757K6403K3543J6447J8650
13160A38130J1085l691o707J3787K1342l921m9015l1514k856P758j1097k8377
13148E4924r133j1242q01j3738m957J4744J5058j0937q969j929K848K886k660
13135B6094L125J486k435K355j9520j7591j522Q490J0601N026k220k536n736P393
13121A3010k466J3848K1553J1274P907L815J7197K5378K9619J1597j4104n668
13109A32960k2601l3046j5591j9544o367l591j4023o3R276j1632n098N120q013
$$ plain form
13199 88608 77781 66367 41315 19903 9128 18434 20057 20035 17077 6398 5027 25849 40954
13186 40954 44467 25591 6423 -1517 8177 11280 6694 6561 18791 19588 18803 7177 16442 38494
13172 38494 44789 51713 49899 34760 17718 30468 44330 53087 79490 103033 119480 138130
13160 138130 149215 145524 138817 152604 173946 170025 121010 89496 86640 94398 83301 54924
13148 54924 45791 34549 33748 20010 15053 29797 44855 33918 24949 23020 25868 28754 26094
13135 26094 29219 30705 28270 30625 11105 -6486 -8008 482 11083 16109 13889 11353 5617 13010
13121 13010 10544 24392 45945 57219 65126 68941 86138 111516 141135 152732 138628 132960
13109 132960 110359 77313 61722 42178 35811 32220 18197 18134 27410 15778 10680 15800 7787
13096G787P626L876J1147o106l86q590j5681l751K137L513M427l75O489L942N423
13081B1478j803k370k401J28m92P974J0137j7941j0848l839J0427J3744m658K829
13067B2365l96n601J755J747m699k4399j1333O022k581K78N095M314N381N684
13053C632n122M996N834N893Q196k464n216Q053j7695q137J0216O617m94M222
13039A8531p4n552j2661q308K553L752Q157l112m847R481m263O821J1056q31o532
13024A4171n395O159N971o426l527N498M968j5023o339j34j211J417m974j1505
13010a6350O406J7496Q937j2481k783M729j0564r72Q203O164r134Q095J0483j859
12996A6370O798N169J235M034P17j399l454N283P510j0645r556j1999J3812N555
$$ plain form
13096 7787 15413 19289 30436 24330 23944 15354 -327 -4078 -1941 1572 5999 5624 12113 16055 21478
13081 21478 19675 17305 14904 15032 14540 22514 32651 14710 3862 23 10450 24194 19536 22365
13067 22365 21969 16368 18123 19870 15171 -9228 -20561 -14539 -17120 -16842 -11747 -7433 -2052 3632
13053 3632 -1490 3506 9340 15233 23429 20965 15749 23802 6107 -2030 8186 14803 14309 18531
13039 18531 18457 12905 244 -8064 -5511 -1759 6398 3286 -1561 7920 3657 10478 21534 20703 14171
13024 14171 8776 14935 20906 14480 10953 16451 21419 6396 57 -77 -1288 129 -4845 -16350
13010 -16350 -9944 7552 16489 4008 1225 5954 -4610 -5582 2621 8785 -349 7746 18229 16370
12996 16370 23168 28337 29572 33606 34323 32924 29470 34753 42263 31618 22062 10063 23875 29430
12982B9430j3516n006M196k099n151q10K2836r887p185J0866M095o002j1125R455
12968B0097n785j2244p391j3505J2559M324r6k361Q66J822N730m742l247n236
12954i209jJ0463j4844j9838N031J7833J3183L2065K1908M398N212K47r574j0983
12940D5891r862n645n001K030J030j1410p946o457L363J5036J8334j2103j4965
12927A2295j6513r346k233R429J4128r247o133q531M95J2642l459L796J901J1506
12913A0730O183R758Q49P78j4628l36J864K227K4177J9223M574R354M321L012
12899H2086j889p377k9972j5809J329p528j0577Q012J707l335J0645j1541j608
12886A4143j1143n097N270j1306O537N398m899j3467O019O377l806o79M850j629
$$ plain form
12982 29430 15914 10908 15104 13005 7854 7044 29880 19993 12808 23674 27769 21767 10642 20097
12968 20097 14312 2068 -5323 -18828 -6269 -1945 -2041 -4402 -3536 -1714 4016 -726 -3973 -9209
12954 -9209 -9210 1253 -13591 -33429 -28398 -10565 2618 34683 56591 60989 66201 66448 56874 45891
12940 45891 36029 30384 25383 27413 28443 17033 9087 2630 5993 21029 39363 27260 12295
12927 12295 -4218 -13564 -15797 -6368 7760 -1487 -7620 -16151 -15656 -3014 -6473 -2677 -776 10730
12913 10730 16913 26671 27520 28298 13670 13334 15198 17425 41602 60825 65399 74753 79074 82086
12899 82086 80197 72820 42848 27039 28368 20840 10263 18275 19982 16647 27292 15751 14143
12886 14143 3000 -2097 3173 -8133 -1596 3802 -1097 -14564 -8545 -2168 -5974 -6653 -1803 -3432
12872c432P313L765P049J6260N883j8017r872l416L507n5p146J0663R837m781
12858A7558r979j519J644R313N042j8061j0308L935n137m305j088R648J997p307
12844h567M137O86M089J3041J2739q041m556r267m486O914J553j1428j4601m565
12830b2352Q455J8583J6647J039J229k246j0274j5814q041M093K458J741m05M735
12816a52M957j282r329q042M809M036J369q387m320R59J0834q06k693J3946J7394
12801B3293K703k630r329l357k797m505j283k026P347p1p853r82n430O749o270
12786f441J1820J4856o308R252O737j9207J061J67o786m661q831k465M995K031
12772c780K329P43q985j434P436P943j0924Q254K141p464Q574m278j4066J248
$$ plain form
12872 -3432 3881 7646 14695 30955 36838 18821 8949 5533 9040 8985 1839 12502 22339 17558
12858 17558 7579 6060 7704 17017 22059 3998 -6310 -2375 -7512 -11817 -12905 -3257 -1260 -8567
12844 -8567 -4430 -3744 345 13386 26125 18084 13528 4261 -225 6689 8242 -3186 -17787 -22352
12830 -22352 -13897 4686 21333 22372 23601 21355 11081 -4733 -12774 -8681 -6223 -4482 -4887 -152
12816 -152 4805 3523 -5806 -13848 -9039 -5003 -3634 -12021 -16341 -15382 -4548 -5354 -8047 5899 23293
12801 23293 25996 23366 14037 10680 7883 3378 2095 69 7416 7345 -508 -1490 -6920 -171 -6441
12786 -6441 5379 20235 13927 23179 29916 10709 11770 11937 5151 490 -8341 -10806 -5811 -3780
12772 -3780 -1451 -708 -9693 -11127 -3691 4252 -6672 1582 3723 -3741 4833 555 -13511 -12263
12758a2263P165R575J2105p787p473j0562o653P712P127J1549L953n508q107N29
12744A362J4381M190r499j8416k692L808O733o0j7708P965R829L061M705M496
12730A2155j2730n044J6667P342N721O63K587N497j6591k2224J637K602J1822
12717A0104P886j576q865R26j09j643K1833L644j9814l211R704O382n711K147
12703B1697l54j2364M564M284K910J9854M397q38o453j3208O271L518j3814l205
12689A7259j2341p758k516O474J0046L462l659k527p35J4474o999k2066p571J2028
12675b429L354k196P238m604j4767L954L347R308J0695M254J5457N999n440R69
12661C5139m07j0665m28j6577O534k472m43L11L065P487Q189j265o894p839j0594
$$ plain form
12758 -12263 -5098 4477 16582 8795 1322 -9240 -15893 -8181 -1054 10495 14448 8940 833 1362
12744 1362 15743 19933 10434 -7982 -10674 -6866 -133 -193 -17901 -9936 -107 2954 7659 12155
12730 12155 -575 -5619 11048 18390 24111 24774 27361 32858 16267 -5957 -4320 -1718 10104
12717 10104 17990 16414 7549 8475 8366 6723 28556 32200 12386 9175 18879 25261 19550 21697
12703 21697 21343 8979 13543 17827 20737 40591 44988 44150 37697 24489 30760 34278 20464 17259
12689 17259 4918 -2840 -5356 1118 11164 14626 10967 8440 7705 22179 15180 -6886 -14457 -2429
12675 -2429 925 -1271 5967 1363 -13404 -9450 -6103 3205 13900 18154 33611 39610 34170 35139
12661 35139 34732 24067 23639 7062 13596 11124 10681 10992 14057 21544 29733 28468 21574 13735 3141
12646C141m846L652o210M622L614R212O806j335l341j6831k617J3655J917q594
12632B845o160p347N946M254M473N216p185Q622j139J3827O253pr244r634L133
12617A3853n469j0391m393r12Q306m045K1848L713Q263O639K041j090r348O737
12603C5752K7565Q099K282J2684L3124Q6032J25997J41606J05299M8893k5498
12592F01835j25366j50844r2627m2600l3831k8770k5215k3280r88J015j0239N195
12580G4285j0813n310k589m959l515r038l475p404O619K206l714L362J090N099
12566D1844Q156j4799j0212Q10p64k3555M671J9255N628k501j1084O256P112J0185
12552D1002j4678r382k174m810m530K597J6496j849J812m144Q93J0647j0806O180
$$ plain form
12646 3141 -1705 1947 -4263 359 3973 13185 19991 18656 15315 -1516 -4133 9522 11439 2845
12632 2845 -3315 -10662 -4716 -462 4011 9227 2042 10664 9525 23352 29605 29598 20354 10720 13853
12617 13853 8384 -2007 -6400 -7312 994 -3051 18797 22510 30773 37412 39453 38363 29015 35752
12603 35752 63317 71416 73698 86382 119506 205538 331535 473141 578440 627333 601835
12592 601835 476469 325625 232998 190398 156567 127797 102582 79302 78314 79329 69090 74285
12580 74285 63472 58162 55573 50614 47099 38061 34586 27182 33801 36007 32293 35655 36745 41844
12566 41844 50000 35201 24989 25799 25035 1480 6151 25406 31034 28533 17449 23705 30817 41002
12552 41002 26324 16942 14768 9958 5428 8025 24521 22672 24484 20340 21233 31880 21074 27254
12538B7254P909p745m358K233L730M755L178j6560M47J905L614M366k735J6042
12524D4035o832j5444n301l272O800K2410O44j4254l551j789m34K980k791j2067
12510A1134K407O14N68K617P16J7505l110n790j2028j52l25K825N038j321l069
12495A7629J308J8737R747J6271K7965K9096L8705L7361L6363K6526J2042K367
12483B74117k8915m8157l5773k3372r907j6682m039K5371L8135M4937K0575K1177
12471B57467J9403k371k5251k4865m0643m1393l1720j3932n577j9618r432p816
12459E4252q65Q639k774P706L2r003k722m793o066p990p28Q107l877N688j288
12444D4318o521M873m001l827j4490l099l520j4833P988J6753N831m305r409J0498
$$ plain form
12538 27254 35163 27418 23060 25293 29023 33778 36956 20396 20843 22748 26362 30728 27993 44035
12524 44035 37203 21759 16458 13186 19986 42396 43040 28786 25235 23446 23012 25992 23201 11134
12510 11134 13541 14155 14723 17340 18056 35561 32451 26661 14633 14481 14156 16981 22019 20698 17629
12495 17629 18937 37674 47421 63692 91657 120753 159458 196819 233182 259708 271750 274117
12483 274117 245202 197045 161272 137900 127993 111311 107272 132643 170778 215715 236290 257467
12471 257467 276870 274499 249248 224383 183740 142347 110627 96695 91118 71500 62068 54252
12459 54252 53387 62026 59252 66958 66990 57987 55265 50472 44406 36416 35688 43795 39918 45606 44318
12444 44318 37797 42670 38669 34842 20352 17253 13733 -1100 6888 23641 29472 25167 15758 26256
12430B6256J4954l514j474l956j7322j0030R138L337K510J278O783L769l632j0448
12416A7649j842L674n617o96J5021k194j984K0310J1944J0205l816J1022O487
12403H0163L860K4278K7691K0968K8876K3861K2548J1893m307j7303j0869n329
12391B06330j0007j6525j3543N326J2670K54J4446K2103J3960J3342K7553j283
12379B74626l0976j5240k3939l3624l9096k4834k4633p498j0689L452r774N026
12367F2801J1246o324L289l962K640j247J233j1554o85N396O823M338P008M979
12353H5981o129n672j670j4939j2506L564Q91P75K2428J3856N174o714o873q591
12339F9575j1834n76k0255p003m478r273J775N757k084J037M380J622J413Q012
$$ plain form
12430 26256 41210 37696 36222 32266 14944 4914 14052 17389 19899 21177 27960 31729 28097 17649
12416 17649 15807 19481 13864 13168 28189 25995 24011 44321 56265 66470 62654 73676 80163
12403 80163 84023 108301 135992 156960 185836 209697 232245 244138 239831 222528 211659 206330
12391 206330 196323 179798 166255 171581 184251 184505 198951 221054 235014 248356 275909 274626
12379 274626 243650 228410 204471 170847 131751 106917 82284 74786 64097 67549 57775 62801
12367 62801 74047 67723 71012 67050 69690 68443 69676 58122 57437 62833 69656 73994 81002 85981
12353 85981 79852 74180 72510 57571 45065 48629 49520 50295 72723 86579 91753 85039 78166 69575
12339 69575 57741 57165 36910 29907 25429 16156 17931 23688 21604 22641 27021 28643 30056 38068
12325C8068n305l881N65l168j4083n631K0398R663o588p315J450R002L766l844
12311C3097J5606P634M164j1241r800J0985j353K819r418j0202K719K458p966
12298B9502N664J2691m144j0617r35j2514j498R568K222r901l84Q25O925Q237
12284C5641P292m612j2866j6336L546J3377m931O116o67N966J720J2314J515r919
12270C8156l4J0407N692k1653k2389J553J4581R408j196k3518j5794L307K0596
12257A9116o628J1955Q721M895p236j35J9839q033K02M574j4852p385L548j309
12243B7272Q960m002M921Q207P212O502M978j6185r440j380k701M194k030P40
12229C7248R659M370r28n382l159K647k547j8049Q587J0300k2P783J377l911j1905
$$ plain form
12325 38068 32763 28882 29447 26279 12196 6565 26963 36626 30038 22723 24173 33175 36941 33097
12311 33097 48703 56337 60501 49260 39460 50445 49092 51911 42493 32291 35010 37468 29502
12298 29502 35166 47857 43713 33096 32161 19647 18149 27717 29939 20038 19654 20479 27404 35641
12284 35641 42933 38321 25455 9119 12665 26042 21111 27227 26560 32526 34246 46560 48075 38156
12270 38156 38122 48529 54221 32568 10179 11732 26313 35721 34525 11007 -4787 -1480 19116
12257 19116 12488 24443 33164 38059 30823 30688 50527 42494 42696 47270 32418 25033 28581 27272
12243 27272 36232 32230 37151 45358 52570 59072 64050 47865 38425 37045 34344 38538 36508 37248
12229 37248 46907 51277 50349 44967 41808 44455 41908 23859 32446 42746 42724 50507 51884 47973 36068
12214C6068j1332j1944L949P024J0266N810j0724o200K174R542N081r791j3725
12201A6198N730J4386J2412K6990p339o447p09j4485j653K747m553L741j1184
12188C5834j4274M092l2j695j920j2464Q529J8643N731p468J0817Q845o662j59
12174D7817o387j0957K167L06N796Q038K858m589j4066r232r983j0471Q223j300
12160H220r814j78K60J1099Q689J3201K2277O186o23j4247m038N974J3828j3789
12146D7045l2092K05K0084j1861j7067K543M530l605K59K0483m129j0122k392
12133A3881r59R103m519K137K2518M544k1239n997q523m502l713O280P197j105
12119A5103j487L847j0241q676J1461J3769j782O369l636j2180O488O508j984
$$ plain form
12214 36068 24736 12792 16741 23765 34031 39841 29117 22917 25091 34633 39714 29923 16198
12201 16198 21928 36314 48726 75716 68377 61930 61221 46736 45083 47830 43277 47018 35834
12188 35834 21560 25652 25620 23925 22005 9541 18070 36713 42444 34976 45793 54638 47976 47817
12174 47817 41430 30473 32640 32946 38742 46780 49638 45049 30983 21751 11768 1297 9520 8220
12160 8220 -1594 -1772 -1512 9587 18276 31477 53754 59940 59317 45070 41032 47006 60834 47045
12146 47045 14953 15158 35242 23381 6314 8857 13387 9782 10041 30524 26395 16273 13881
12133 13881 12922 22025 17506 19643 42161 46705 25466 19469 10946 6444 2731 9011 16208 15103
12119 15103 13616 17463 7222 -1454 10007 23776 21994 28363 24727 12547 19035 25543 23559
12106B3559j0408r734n499P682j970J625r942k805N091L853j87L118p616q843
$$ plain form
12106 23559 13151 3417 -2082 5600 3630 5255 -4687 -7492 -2401 1452 1265 4383 -3233 -12076
$$ [...]
##END NTUPLES=NMR SPECTRUM
##END=
