##TITLE=Analysis number 320433
Compound Code ac 35929
Project Code adrs
Chemist Name cuschem
##JCAMPDX= 6.0         $$ Bruker NMR JCAMP-DX V2.0
##DATA TYPE= NMR SPECTRUM
##DATA CLASS= NTUPLES
##ORIGIN= Bruker BioSpin GmbH
##OWNER= nmr
$$ XWIN-NMR		Version 3.5
$$ Mon Jun 26 09:21:23 2006 GMT Daylight Time (UT+1h)  MAYBRIDGE\nmr@NMR_250MHZ
##.OBSERVE FREQUENCY= 250.131544655141
##.OBSERVE NUCLEUS= ^1H
##.ACQUISITION MODE= SIMULTANEOUS (DQD)
##.ACQUISITION SCHEME= undefined
##.AVERAGES= 16
##.DIGITISER RES= 18
##SPECTROMETER/DATA SYSTEM= dpx250
##.PULSE SEQUENCE= zg30
##.SOLVENT NAME= DMSO
##.SHIFT REFERENCE= (INTERNAL, DMSO, 0, 16.522)
##AUDIT TRAIL= $$ (NUMBER, WHEN, WHO, WHERE, WHAT)
$$ ##TITLE= Audit trail, XWIN-NMR		Version 3.5
$$ ##JCAMPDX= 5.01
$$ ##ORIGIN= Bruker BioSpin GmbH
$$ ##OWNER= nmr
$$ C:\u/data/dgb/nmr/ADRS/1400/pdata/1/auditp.txt
$$ ##AUDIT TRAIL=  $$ (NUMBER, WHEN, WHO, WHERE, WHAT)
(   1,<2006-06-26 09:20:55.20 +100>,<MAYBRIDGE\nmr>,<NMR_250MHZ>,
      <created by zg, POWCHK disabled, PULCHK disabled
       configuration hash MD5:
       E2 DF 36 D8 04 B2 41 60 5A D7 A3 38 5A 4B D0 FE
       data hash MD5: 64K
       2F EA C9 A3 34 79 25 78 1A 93 D0 AE 0E 65 76 AD>)
(   2,<2006-06-26 09:21:11.20 +100>,<MAYBRIDGE\nmr>,<NMR_250MHZ>,
      <Start of raw data processing
       ef LB = 0.3 FT_mod = 6 PKNL = 1 SI = 32K 
       data hash MD5: 32K
       18 04 F7 20 A4 9D 48 DC 54 E1 A5 88 7D CB 5B EC>)
(   3,<2006-06-26 09:21:15.35 +100>,<MAYBRIDGE\nmr>,<NMR_250MHZ>,
      <apk 
       data hash MD5: 32K
       24 37 91 B6 E4 A5 B5 8B 03 F5 9F 4E AB 9A 35 25>)
(   4,<2006-06-26 09:21:16.18 +100>,<MAYBRIDGE\nmr>,<NMR_250MHZ>,
      <abs ABSG = 5 
       data hash MD5: 32K
       41 6E 27 75 8C A3 01 A0 33 2A 04 80 5F 60 DA 71>)
$$ ##END=
$$ 
$$ hash MD5
$$ 1C BF A0 52 27 43 90 62 2B E0 AF 83 46 99 CD A6
##$RELAX= 
##$RELAX= 
##$RELAX= 
##$RELAX= 
##$RELAX= 
##$RELAX= 
##$RELAX= 
$$ Bruker specific parameters
$$ --------------------------
##$DU= <C:\u>
##$EXPNO= 1400
##$NAME= <ADRS>
##$PROCNO= 1
##$TYPE= <nmr>
##$USER= <dgb>
##$AMP= (0..31)
100 100 100 100 100 100 100 100 100 100 100 100 100 100 100 100 100 100 
100 100 100 100 100 100 100 100 100 100 100 100 100 100 
##$AQSEQ= 0
##$AQ_mod= 3
##$AUNM= <au_zg>
##$AUTOPOS= <6 >
##$BF1= 250.13
##$BF2= 250.13
##$BF3= 250.13
##$BF4= 250.13
##$BF5= 500.13
##$BF6= 500.13
##$BF7= 500.13
##$BF8= 500.13
##$BYTORDA= 1
##$CFDGTYP= 0
##$CFRGTYP= 5
##$CHEMSTR= <none>
##$CNST= (0..31)
1 1 145 1 1 1 1 1 1 1 1 1 1 1 1 1 1 1 1 1 1 1 1 1 1 1 1 1 1 1 1 1 
##$CPDPRG= <>
##$CPDPRG1= <>
##$CPDPRG2= <>
##$CPDPRG3= <>
##$CPDPRG4= <mlev>
##$CPDPRG5= <mlev>
##$CPDPRG6= <mlev>
##$CPDPRG7= <mlev>
##$CPDPRG8= <mlev>
##$CPDPRGB= <>
##$CPDPRGT= <>
##$D= (0..31)
0 1 0 0 0 0 0 0 0 0.06 0 0 0 0 0 0 0.0002 0 0 0 0 0 0 0 0 0 0 0 0 0 0 
0 
##$DATE= 1151310054
##$DBL= (0..7)
120 120 120 120 120 120 120 120 
##$DBP= (0..7)
150 150 150 150 150 150 150 150 
##$DBP07= 0
##$DBPNAM0= <>
##$DBPNAM1= <>
##$DBPNAM2= <>
##$DBPNAM3= <>
$$ [...]
##$SUBNAM7= <"">
##$SUBNAM8= <"">
##$SUBNAM9= <"">
##$SW= 20.6930455092707
##$SWIBOX= (0..15)
0 0 3 0 0 0 0 0 0 0 0 0 0 0 0 0 
##$SW_h= 5175.983436853
##$TD= 65536
##$TD0= 1
##$TE= 296.16
##$TE2= 300
##$TE3= 300
##$TEG= 300
##$TL= (0..7)
0 120 120 120 120 120 120 120 
##$TP= (0..7)
150 150 150 150 150 150 150 150 
##$TP07= 0
##$TPNAME0= <>
##$TPNAME1= <>
##$TPNAME2= <>
##$TPNAME3= <>
##$TPNAME4= <>
##$TPNAME5= <>
##$TPNAME6= <>
##$TPNAME7= <>
##$TPOAL= (0..7)
0.5 0.5 0.5 0.5 0.5 0.5 0.5 0.5 
##$TPOFFS= (0..7)
0 0 0 0 0 0 0 0 
##$TUNHIN= 0
##$TUNHOUT= 0
##$TUNXOUT= 0
##$USERA1= <user>
##$USERA2= <user>
##$USERA3= <user>
##$USERA4= <user>
##$USERA5= <user>
##$V9= 5
##$VALIST= <valist>
##$VCLIST= <CCCCCCCCCCCCCCC>
##$VD= 0
##$VDLIST= <DDDDDDDDDDDDDDD>
##$VPLIST= <PPPPPPPPPPPPPPP>
##$VTLIST= <TTTTTTTTTTTTTTT>
##$WBST= 1024
##$WBSW= 4
##$XGAIN= (0..3)
0 0 0 0 
##$XL= 0
##$YL= 0
##$YMAX_a= 305503
##$YMIN_a= -421597
##$ZGOPTNS= <>
##$ZL1= 120
##$ZL2= 120
##$ZL3= 120
##$ZL4= 120
##$ABSF1= 16.522
##$ABSF2= -4.171173
##$ABSG= 5
##$ABSL= 3
##$ALPHA= 0
##$AQORDER= 0
##$ASSFAC= 0
##$ASSFACI= 0
##$ASSFACX= 0
##$ASSWID= 0
##$AUNMP= <proc_1d>
##$AZFE= 0.1
##$AZFW= 0.1
##$BCFW= 0
##$BC_mod= 0
##$BYTORDP= 0
##$COROFFS= 0
##$CY= 12.5
##$DATMOD= 1
##$DC= 0
##$DFILT= <>
##$DTYPP= 0
##$F1P= 14.0000005364418
##$F2P= -0.99999901652339
##$FCOR= 0.5
##$FTSIZE= 32768
##$FT_mod= 6
##$GAMMA= 0
##$GB= 0
##$INTBC= 1
##$INTSCL= 1
##$ISEN= 128
##$LB= 0.3
##$LEV0= 0
##$LPBIN= 0
##$MAXI= 10000
##$MC2= 0
##$MEAN= 0
##$ME_mod= 0
##$MI= 0
##$NCOEF= 0
##$NC_proc= -4
##$NLEV= 6
##$NOISF1= 0
##$NOISF2= 0
##$NSP= 0
##$NTH_PI= 0
##$NZP= 0
##$OFFSET= 16.522
##$PC= 1
##$PHC0= 171.5832
##$PHC1= -0.5204954
##$PH_mod= 1
##$PKNL= yes
##$PPARMOD= 0
##$PSCAL= 4
##$PSIGN= 0
##$REVERSE= no
##$SF= 250.13
##$SI= 32768
##$SIGF1= 0
##$SIGF2= 0
##$SINO= 400
##$SIOLD= 32768
##$SREGLST= <1H.DMSO>
##$SSB= 0
##$STSI= 32768
##$STSR= 0
##$SW_p= 5175.98343685301
##$SYMM= 0
##$S_DEV= 0
##$TDeff= 65536
##$TDoff= 0
##$TI= <Analysis number 999999
Compound Code 99
Book Reference 9
Project Code 9>
##$TILT= no
##$TM1= 0
##$TM2= 0
##$TOPLEV= 0
##$USERP1= <user>
##$USERP2= <user>
##$USERP3= <user>
##$USERP4= <user>
##$USERP5= <user>
##$WDW= 1
##$XDIM= 32768
##$YMAX_p= 344749865
##$YMIN_p= -460638
$$ End of Bruker specific parameters
$$ ---------------------------------
##NTUPLES= NMR SPECTRUM
##VAR_NAME=  FREQUENCY,     SPECTRUM/REAL,   SPECTRUM/IMAG
##SYMBOL=    X,             R,               I
##VAR_TYPE=  INDEPENDENT,   DEPENDENT,       DEPENDENT
##VAR_FORM=  AFFN,          ASDF,            ASDF
##VAR_DIM=   32768,         32768,           32768
##UNITS=     HZ,            ARBITRARY UNITS, ARBITRARY UNITS
##FACTOR=    0.157963299565203, 1,           1
##FIRST=     4132.6476996994, 0,             0
##LAST=      -1043.33573715361, 0,           0
##MIN=       -1043.33573715361, -460638,     0
##MAX=       4132.6476996994, 344749865,     0
$$ Real data points
##PAGE= N=1
##DATA TABLE= (X++(R..R)), XYDATA
$$ [...]
$$ plain form
15648 3677 96509 119211 71529 -47337 -47434 -12737 -49798 -108598 -61509 -564 -1662 -63002
15636 -63002 -73269 -132703 -194592 -200705 -187656 -115668 -174053 -112471 -26532 -86275 -183039 -245212
15624 -245212 -199696 -238355 -214038 -123961 -105440 -108809 -89797 100604 270977 180112 65627
15613 65627 43919 82549 171599 211403 178487 183762 208635 59762 61032 90094 85538 95431
15601 95431 51729 176021 110100 50548 -32461 -48014 47635 55796 87040 119291 152682 106297
15589 106297 -123485 -173840 -135412 -215133 -236479 -221745 -174907 -190535 -163845 -204835 -162218
15578 -162218 -204991 -240687 -116819 -2128 -12093 65162 127148 65945 -84056 -150213 -2937
15567 -2937 97200 138925 137197 25863 48907 58847 78942 32618 -34592 53014 135253 202852
$$ packed form
15648C677R2832K2702m7682j18866r7L4697l7061n8800M7089O0945j098o1340
15636f3002j0267n9434o1889o113J3049P1988n8385O1582Q5939n9743r6764o2173
15624b45212M5516l8659K4317R0077J8521l369J9012J90401J70373r0865j14485
15613F5627k1708L8630Q9050L9804l2916N275K4873j48873J270K9062m556R893
15601I5431m3702J24292o5921n9552q3009j5553R5649Q161L1244L2251L3391m6385
15589A06297k29782n0355L8428p9721k1346J4734M6838j5628K6690m0990M2617
15578a62218m2773l5696J23868J14691r965P7255O1986o1203j50001o6157J47276
15567b937J00137M1725j728j11334K3044R940K0095m6324o7210Q7606Q2239O7599
$$ plain form
15555 202852 254545 244510 228073 196176 48592 -80777 -55052 -7224 -24142 -81835 -95637
15544 -95637 -200529 -266202 -173409 -96951 -64219 8212 -11683 1974 -62887 -142976 -63385
15533 -63385 -105315 -115240 -44289 37952 49795 -146373 -215699 -143801 11213 134540 97624
15522 97624 22508 108659 81771 21903 -37829 -39518 160188 186226 182836 35423 -52677 47904
15510 47904 -120660 -62848 -84283 14596 32068 -39122 -49662 -51412 -7985 19113 4824 19029
15498 19029 53825 177074 67952 -54450 -118888 -235443 -216760 -152495 -69937 -38070 -113052
15487 -113052 -161648 -121176 -40268 36173 55783 9214 48835 60552 -44493 -53076 13330
15476 13330 -2016 -66245 -51901 -35355 35113 71283 109905 75365 33425 39851 39730 31174
$$ packed form
15555B02852N1693j0035j6437l1897j47584j29369K5725M7828j6918n7693j3802
15544i5637j04892o5673R2793P6458L2732P2431j9895J3657o4861q0089P9591
15533f3385m1930r925P0951Q2241J1843j96168o9326P1898J55014J23327l6916
15522I7624p5116Q6151k6888n9868n9732j689J99706K6038l390j47413q8100J00581
15510D7904j68564N7812k1435R8879J7472p1190j0540j750M3427K7098j4289J4205
15498A9029L4796J23249j09122j22402o4438j16555J8683O4265Q2558L1867p4982
15487a13052m8596M0472Q0908P6441J9610m6569L9621J1717j05045q583O6406
15476A3330j5346o4229J4344J6546P0468L6170L8622l4540m1940O426j21q556
$$ plain form
15464 31174 88536 30265 -16673 29558 35306 -52979 -30265 -57169 -112912 -89009 -40928 15030
15452 15030 149055 181987 -50337 -116997 -103443 -27593 109641 174583 212004 297614 115054
15441 115054 33891 12319 -34207 -32899 34270 -56021 -13593 -59528 -47488 -3008 68639 29901
15429 29901 12257 87694 30760 -95668 -190571 -199223 -18643 -54321 -64691 -33125 43031
15418 43031 116705 101395 112198 52539 -38914 44389 44606 -32357 -23989 -40540 -65366 -45445
15406 -45445 1705 -46149 -113976 -141193 -47524 -20919 -87806 -151221 -194183 -101034 -33874 10153
15394 10153 -25278 -35640 -37711 30699 112086 61222 48446 -22356 33335 11270 140521 57510
15382 57510 -135647 -49597 -24873 -137411 -62375 -55249 -123745 -180520 -283152 -195896 -16824
$$ packed form
15464C1174N7362n8271m6938M6231N748q8285K2714k6904n5743K3903M8081N5958
15452A5030J34025L2932k32324o6660J3554P5850J37234O4942L7421Q5610j82560
15441A15054q1163k1572m6526J308O7169r0291M2428m5935J2040M4480P1647l8738
15429B9901j7644P5437n6934j26428r4903q652J80580l5678j0370L1566P6156
15418D3031P3674j5310J0803n9659r1453Q3303K17p6963Q368j6551k4826J9921
15406d5445M7150m7854o7827k7217R3669K6605o6887o3415m2962R3149O7160M4027
15394A0153l5431j0362k071O8410Q1387n0864j2776p0802N5691k2065J29251q3011
15382E7510j93157Q6050K4724j12538P5036P126o8496n6775j02632Q7256J79072
$$ plain form
15371 -16824 85916 69906 26157 -13548 72069 128836 46434 65011 156146 135170 34018
15360 34018 -21717 -103712 -144060 -84820 -13003 41041 31326 97080 124123 16716 -38888 64610
15348 64610 13724 -57451 -122198 -187740 -124066 -22313 131451 183695 31192 -40367 -10729
15337 -10729 -88199 19953 195184 254102 202540 47344 -109112 -42830 -66153 -75200 -60016
15326 -60016 -82857 -85356 -123563 3980 48657 38694 24807 68596 41132 -133793 -145532 -10470
15314 -10470 59244 60755 51287 -34239 -151523 -325860 -312371 -232291 -105085 -33263 -94828
15303 -94828 -91706 -50164 35258 121536 76276 59003 708 -8495 -48805 -121733 -192287 -182985
15291 -182985 -146632 -97740 22954 7344 11011 -14431 -91539 -257966 -380722 -404803 -267900
$$ packed form
15371a6824J02740j6010m3749l9705Q5617N6767q2402J8577R1135k0976j01152
15360C4018n5735q1995m0348N9240P1817N4044r715O5754K7043j07407n5604J03498
15348F4610n0886p1175o4747o5542O3674J01753J53764N2244j52503p1559K9638
15337a0729p7470J08152J75231N8918n1562j55196j56456O6282k3323r047J5184
15326f0016k2841k499l8207J27543M4677r963j3887M3789k7464j74925j1739J35062
15314a0470O9714J511r468q5526j17284j74337J3489Q0080J27206P1822o1565
15303i4828L122M1542Q5422Q6278m5260j7273n8295r203m0310p2928p0554R302
15291a82985L6353M8892J20694j5610L667k5442p7108j66427j22756k4081J36903
$$ plain form
15280 -267900 -89855 -30949 -174557 -215173 -93609 -79296 -64714 -54567 -37849 80133 68933
15269 68933 79981 2198 -78260 -93971 -162976 -257399 -130496 -14446 -28884 -86674 -116740
15258 -116740 -43861 50307 38402 33934 -18494 -20436 -38394 -32397 -98187 -136461 -141166 -36687
15246 -36687 -32832 12178 62701 82333 245967 68425 52728 89507 18240 -24714 -3942
15235 -3942 153949 161319 111785 93871 27199 8697 72647 101194 110291 110024 47218 -31761
15223 -31761 -39478 112645 190973 285702 81260 34927 83508 151226 99636 64577 87282
15212 87282 114643 87217 44147 -26286 -12037 -34676 -88277 -149541 -215862 -71828 -12608
15201 -12608 -73740 -131469 -94448 -214678 -295391 -154576 -28902 -4619 -58774 -14032 66105
$$ packed form
15280b67900J78045N8906j43608m0616J21564J4313J4582J0147J6718J17982j1200
15269F8933J1048p7783q0458j5711o9005r4423J26903J16050j4438n7790l0066
15258a16740P2879R4168j1905m468n2428j942j7958N997o5790l8274m705J04479
15246c6687L855M5010N0523J9632J63634j77542j5697L6779p1267m2954K0772
15235c942J57891P370m9534j7914o6672j8502O3950K8547R097k67o2806p8979
15223c1761p717J52123P8328R4729k04442m6333M8581O7718n1590l5059K2705
15212H7282K7361k7426m3070p0433J4249k2639n3601o1264o6321J44034N9220
15201a2608o1132n7729L7021j20230q0713J40815J25674K4283n4155M4742Q0137
$$ plain form
15190 66105 29659 -8244 -103951 -64219 4619 53112 67111 61784 -55638 -664 7122 -21883
15178 -21883 31727 -4862 -36555 -147325 -214588 -126487 -90672 -197011 -195158 -172313 -220936
15167 -220936 -196127 -89097 -101418 -79285 -83107 -54029 -108468 -160258 -144877 -78178 -76126 -96866
15155 -96866 -139924 -7952 104211 162959 93550 26014 -9229 32191 4435 -3268 -31660
15144 -31660 -41175 -145558 -54933 -32357 8930 115712 141985 125824 35510 30301 -24862 -4803
15132 -4803 62503 67538 160935 150760 59303 7797 -112790 -133360 -131181 -129379 -40034 -45767
15120 -45767 -65699 -143198 -160231 -144882 -29144 -100372 -22566 71879 98198 -31185 -115140
15109 -115140 34971 54623 22156 -34823 97582 144673 180163 90474 31806 -15218 -17847
$$ packed form
15190F6105l6446l7903r5707L9732O8838M8493J3999n327j17422N4974P786k9005
15178b1883N3610l6589l1693j10770o7263Q8101L5815j06339J853K2845m8623
15167b20936K4809J07030j2321K2133l822K9078n4439n1790J5381O6699K052k0740
15155i6866m3058J31972J12163N8748o9409o7536l5243M1420k7756p703k8392
15144c1660r515j04383R0625K2576M1287J06782K6273j6161r0314n209n5163K0059
15132d803O7306N035R3397j0175r1457n1506j20587k0570K179J802Q9345n733
15120d5767j9932p7499j7033J5349J15738p1228P7806R4445K6319j29383q3955
15109a15140J50111J9652l2467n6979J32405M7091L5490q9689n8668m7024k629
$$ plain form
15098 -17847 -221 106687 141243 33779 80365 90875 27024 -28149 -94299 -55144 21035
15087 21035 172849 164925 35538 -40089 -119613 -243341 -205170 -80860 57607 14101 -42639
15076 -42639 15800 44897 -27023 -40303 25292 96997 113278 174543 158073 18913 -31218
15065 -31218 -28671 -46166 36773 -44493 -73344 -57479 -135163 -54194 76601 169051 25001
15054 25001 -258425 -320878 -202439 -153600 -126535 19990 -41169 -148754 -196134 -212248 -212726
15043 -212726 -146192 -174114 -110721 -65229 -17481 -52064 20741 70926 93428 11039 -84261
15032 -84261 -108623 -139049 -84938 -29676 -30109 -61429 -26781 23606 2119 -4668 79022 15858
15020 15858 -97553 -142782 -193698 -210654 -228788 -158992 -37576 76793 42700 18313 35042
$$ packed form
15098a7847J7626J06908L4556j07464M6586J0510o3851n5173o6150L9155P6179
15087B1035J51814p924j29387p5627p9524j23728L8171J24310J38467m3506n6740
15076d2639N8439K9097p1920j3280O5595P1705J6281O1265j6470j39160n0131
15065c1218K547j7495Q2939q1266k8851J5865p7684Q0969J30795R2450j44050
15054B5001k83426o2453J18439M8839K7065J46525o1159j07585m7380j6114m78
15043b12726O6534k7922O3393M5492M7748l4583P2805N0185K2502q2389r5300
15032h4261k4362l0426N4111N5262m33l1320L4648N0387k1487o787Q3690o3164
15020A5858j13411m5229n0916j6956j8134O9796J21416J14369l4093k4387J6729
$$ plain form
15009 35042 -3689 -69017 -32926 76067 46105 -17462 -8100 469 -5092 11528 -15932 -98057
14997 -98057 -84397 -27484 -161592 -213309 -137539 -149464 -157081 -231313 -273952 -176596 -122225 -26949
14985 -26949 89720 86463 -44075 -43425 22581 107054 127571 221974 242121 228011 105452 11785
14973 11785 115511 196746 224549 217641 162401 202543 157975 182254 138622 108390 21857 -75387
14961 -75387 -84754 -57172 -30886 69019 101092 3412 -186703 -123025 -172727 -98031 45102
14950 45102 -72918 -148155 -133820 -69234 -24135 -107802 -76670 -50055 -150089 -106011 -83876
14939 -83876 -104422 -1379 -878 -29287 -44462 -132233 -130522 -155980 -274038 -215037 -134897 -91682
14927 -91682 16542 34257 -3184 20860 -90746 -160008 -198448 -250909 -109491 -20973 -34844
$$ packed form
15009C5042l8731o5328L6091J08993k9962o3567R362Q569n561J6620k7460q2125
14997i8057J3660N6913j34108n1717P5770j1925p617p4232m2639R7356N4371R5276
14985b6949J16669l257j30538O50O6006Q4473K0517R4403K0147j4110j22559r3667
14973A1785J03726Q1235K7803o908n5240M0142m4568K4279m3632l0232q6533r7244
14961g5387r367K7582K6286R9905L2073r7680j90115O3678m9702P4696J43133
14950D5102j18020p5237J4335O4586M5099q3667L1132K6615j00034M4078K2135
14939h3876k0546J03043N01k8409j5175q7771J711k5458j18058N9001Q0140M3215
14927i1682J08224J7715l7441K4044j11606o9262l8440n2461J41418Q8518j3871
$$ plain form
14916 -34844 1214 78664 21788 -83440 -111321 -131178 -113456 -105236 -190581 -186814 -124647 -166164
14904 -166164 -103521 -96663 -86505 -75375 -30403 71225 33089 -15754 5189 -34966 -100267
14893 -100267 -134263 -114833 -160647 -224885 -198614 98768 239472 229127 294575 231729 77903
14882 77903 -27965 -55489 4210 129116 49740 9292 6104 -1486 17903 42768 23163 4367
14870 4367 -43252 -17054 4147 -36129 -25916 -59122 40425 63725 -74584 -71680 33015 45024
14858 45024 183772 289180 132439 -75092 -40205 26947 65740 123091 114592 137706 95511
14847 95511 -8566 -98094 -114114 18353 73475 -46393 -103599 -43890 -3211 -59890 -79598
14836 -79598 86660 222363 54985 -11395 72528 191176 211757 268915 143888 25936
$$ packed form
14916c4844L6058P7450n6876j05228k7881j9857J7722Q220q5345L767O2167m1517
14904a66164O2643O858J0158J1130M4972J01628l8136m8843K0943m0155o5301
14893a00267l3996J9430m5814o4238K6271K97382J40704j0345O5448o2846j53826
14882G7903j05868k7524N9699J24906p9376m0448l188p590J9389K4865j9605j8796
14870D367m7619K6198K1201m0276J0213l3206R9547K3300j38309K904J04695J2009
14858D5024J38748J05408j56741k07531L4887O7152L8793N7351q499K3114m2195
14847I5511j04077q9528j6020J32467N5122j19868n7206N9709M0679n6679j9708
14836g9598J66258J35703j67378o6380Q3923J18648K0581N7158j25027j17952
$$ plain form
14826 25936 -49777 61538 87709 25271 -22052 20820 154538 267426 159362 126462 151408
14815 151408 162604 125679 38529 44222 -120865 -181409 -109417 -138523 -194312 -161058 -64552
14804 -64552 -46357 -8377 22909 72851 97590 81953 64746 78690 146178 112336 89886 -6475
14792 -6475 -43449 -8563 -61548 -61868 -133773 -118228 -63534 -68502 -126945 -79514 -30163 -95312
14780 -95312 -75300 71114 162381 17711 -138571 -213514 -95623 -25937 9207 36355 -4265
14769 -4265 -35079 -61264 34692 -35192 -117458 -119488 -82803 -6593 -17570 85584 15661 -127246
14757 -127246 -140027 52203 72341 23609 -59161 -139781 -129884 -37655 56464 66370 110441 118670
14745 118670 99929 131968 81781 20337 69875 61493 27526 61593 103515 -49617 -163251
$$ packed form
14826B5936p5713J11315K6171o2438m7323M2872J33718J12888j08064l2900K4946
14815A51408J1196l6925q7150N693j65087o0544P1992k9106n5789L3254R6506
14804f4552J8195L7980L1286M9942K4739j5637j7207J3944O7488l3842k2450r6361
14792f475l6974L4886n2985l20p1905J5545N4694m968n8443M7431M9351o5149
14780i5312K0012J46414R1267j44670j56282p4943J17891O9686L5144K7148m0620
14769d265l0814k6185R5956o9884q2266k030L6685P6210j0977J03154o9923j42907
14757a27246j2781J92230K0138m8732q2770q0620R897R2229R4119R906M4071Q229
14745A18670j8741L2039n0187o1444M9538q382l3967L4067M1922j53132j13634
$$ plain form
14734 -163251 -181479 -153293 -193314 -76717 22729 46178 -34697 -100956 -152814 -111379 -45476
14723 -45476 62699 32532 67869 277847 296422 85188 -209961 -80494 -12650 10407 -82732
14712 -82732 -66008 -85301 -156509 -64199 79224 248584 146571 -46064 -35454 49400 4578
14701 4578 -5799 -34828 -82527 -50751 6129 -163719 -235251 -169898 -95200 -142568 -149322 -104710
14689 -104710 -52197 66309 93229 131969 174988 152701 118891 54277 64566 122178 169315
14678 169315 -31135 -126251 -65040 55403 78261 -56619 -71430 -66934 -89479 -12258 59211
14667 59211 4407 -28106 -84548 -148276 -121523 -87842 67070 148298 85457 124318 26143
14656 26143 18326 47553 102579 166609 100903 -96111 -155529 -211840 -303381 -189968 -118133
$$ packed form
14734a63251j8228K8186m0021J16597R9446K3449q0875o6259n1858M1435O5903
14723d5476J08175l0167L5337K09978J8575k11234k95149J29467O7844K3057r3139
14712h2732J6724j9293p1208R2310J43423J69360j02013j92635J0610Q4854m4822
14701D578j0377k9029m7699L1776N6880j69848p1532O5353P4698m7368o754M4612
14689a04710N2513J18506K6920L8740M3019k2287l3810o4614J0289N7612M7137
14678A69315k00450r5116O1211J20443K2858j34880j4811M496k2545P7221P1469
14667E9211n4804l2513n6442o3728K6753L3681J54912Q1228o2841L8861r8175
14656B6143p817K9227N5026O4030o5706j97014n9418n6311r1541J13413P1835
$$ plain form
14645 -118133 35668 49399 6455 88459 46629 50195 1819 132420 183825 81323 -42709
14634 -42709 58226 2616 -148277 -198446 -157411 -127845 -173155 -136591 -81848 -159893 -181710
14623 -181710 -206960 -157156 -210065 -275074 -246511 -277335 -163942 -104031 15831 72267 116000
14612 116000 27078 -82016 -6190 61582 101344 141425 153244 32306 -29161 12071 -9812
14601 -9812 -167578 -266820 -322542 -297735 -76112 16483 -39573 -77073 -50807 -93621 -198857
14590 -198857 -141121 4110 74823 253093 260453 192731 137461 37187 17747 97140 111215
14579 111215 -1763 -88138 -167247 -119114 -10363 -50606 -77522 -193913 -185959 -144993 -113773
14568 -113773 -38306 71730 150103 174712 -75929 -171894 6469 215583 208443 176635 140641
$$ packed form
14645a18133J53801J3731m2944Q2004m1830L566m8376J30601N1405j02502j24032
14634d2709J00935n5610j50893n0169M1035K9566m5310L6564N4743p8045k1817
14623a81710k5250M9804n2909o5009K8563l0824J13393N9911J19862N6436M3733
14612A16000q8922j09094P5826O7772L9762M0081J1819j20938o1467M1232k1883
14601i812j57766r9242n5722K4807K21623R2595n6056l7500K6266m2814j05236
14590a98857N7736J45231P0713J78270P360o7722n5270j00274j9440P9393J4075
14579A11215j12978q6375p9109M8133J08751m0243k6916j16391P954M0966L1220
14568a13773P5467J10036P8373K4609k50641r5965J78363K09114p140l1808l5994
$$ plain form
14557 140641 87362 51815 113204 191534 227456 282972 175152 -74357 -240694 -276324 -333808
14546 -333808 -248742 -151252 -72354 -32654 81580 92518 72955 -58169 -66084 -18585 47007
14535 47007 107796 216059 314985 261226 153582 96736 24059 -72721 -49818 24368 29364
14524 29364 -23466 -37609 7359 -45432 -137383 -169216 -156348 -38890 -64152 -132129 -160906
14513 -160906 -97631 -25835 -98319 -83019 87958 178411 105035 50499 89809 128536 12865
14502 12865 -64423 36050 65532 125203 199892 297758 201258 50455 -105441 -73684 5658
14491 5658 -12578 45562 20008 18255 155693 185983 130663 37450 -26845 -103402 -110711 958
14479 958 36814 -31698 -72671 -38139 -17482 -36024 -109662 -124234 -86139 -34751 3665 40520
$$ packed form
14557A40641n3279l5547O1389P8330L5922N5516j07820k49509j66337l5630n7484
14546c33808Q5066R7490P8898L9700J14234J0938j9563j31124p915M7499O5592
14535D7007O0789J08263R8926n3759j07644n6846p2677r6780K2903P4186M996
14524B9364n2830j4143M4968n2791r1951l1833J2868J17458k5262o7977k8777
14513a60906O3275P1796p2484J5300J70977R0453p3376n4536L9310L8727j15671
14502A2865p7288J00473K9482N9671P4689R7866r6500j50803j55896L1757P9342
14491E658j8236N8140k5554j753J37438L0290n5320r3213o4295p6557p309J11669
14479I58L5856o8512m0973L4532K0657j8542p3638j4572L8095N1388L8416L6855
$$ plain form
14467 40520 34091 -48626 298 107233 114550 43945 -41096 60586 91985 69255 32589 104525
14455 104525 80178 102623 106937 93419 123958 137674 103368 103071 110111 122255 115762 101232
14443 101232 39567 79561 -9387 -19393 -50956 19049 64997 48873 14606 -68825 -156629
14432 -156629 -127692 -133427 -237795 -121813 167046 368344 324351 232836 166599 23276 -125455
14421 -125455 -88656 -68555 -108687 54665 155032 153879 119855 80048 42276 66136 91944
14410 91944 51566 60434 -15679 -9024 24775 44968 -58994 -123907 -72809 -48958 4964 -7935
14398 -7935 12495 23021 61062 -32027 -157578 32544 104967 -44538 -200059 -265704 -343310
14387 -343310 -307865 -137766 -171926 -205461 -88613 -24836 -172591 -151056 -35260 19691 129649
$$ packed form
14467D0520o429q2717M8924J06935P317p0605q5041J01682L1399k2730l6666P1936
14455A04525k4347K2445M314j3518L0539J3716l4306k97P040J2144o493j4530
14443A01232o1665L9994q8948j0006l1563P0005M5948j6124l4267q3431q7804
14432a56629K8937n735j04368J15982K88859K01298m3993r1515o6237j43323j48731
14421a25455L6799K0101m0132J63352J00367j153l4024l9807l7772K3860K5808
14410I1944m0378Q868p6113O655L3799K0193j03962o4913N1098K3851N3922j2899
14398g935K0430J0526L8041r3089j25551J90122P2423j49505j55521o5645p7606
14387c43310L5445J70099l4160l3535J16848O3777j47755K1535J15796N4951J09958
$$ plain form
14376 129649 204672 139848 85503 101192 73866 -50888 -327013 -315855 -196669 -85238 1927
14365 1927 117084 6513 -138014 -175155 -126219 -27266 -40480 59000 149826 121917 98867
14354 98867 33188 103205 77710 -6171 37368 -24932 -47499 -84115 -172796 -153113 -150190 15007
14342 15007 17810 14376 -15946 -81339 -99373 12004 98055 58429 -60576 -53352 25053 33061
14330 33061 30658 -3689 15024 -75476 -130467 -155821 -181729 -223665 -206151 -125026 -36836 -82428
14318 -82428 -97156 34505 -39171 -86165 -130190 -97905 18917 -39300 -39375 19790 59834 218267
14306 218267 179450 142917 14311 38732 32595 -54983 14895 43446 32858 27635 -53490 34627
14294 34627 63113 33053 -35593 32402 45005 44684 80762 62508 130553 47741 1744 192406
$$ packed form
14376A29649P5023o4824n4345J5689k7326j24754k76125J1158J19186J11431Q7165
14365A927J15157j10571j44527l7141M8936R8953j3214R9480R0826k7909k3050
14354I8867o5679P0017k5495q3881M3539o2300k2567l6616q8681J9683K923J65197
14342A5007K803l434l0322o5393j8034J11377Q6051l9626j19005P224P8405Q008
14330C3061k403l4347J8713r0500n4991k5354k5908m1936J7514Q1125Q8190m5592
14318h2428j4728J31661p3676m6994m4025L2285J16822n8217p5N9165M0044J58433
14306B18267l8817l6533j28606K4421o137q7578O9878K8551j0588n223q1125Q8117
14294C4627K8486l0060o8646O7995J2603l21L6078j8254O8045q2812m5997J90662
$$ plain form
14282 192406 236970 212455 271456 226074 141351 149072 179050 226092 283542 238775 96173
14271 96173 121773 249943 171722 120213 11582 -104714 -20212 65666 20871 2829 21432
14260 21432 -34773 14969 -27743 -81526 -165568 -130970 -67176 -65871 -163612 -239371 -272010 -208955
14248 -208955 -169964 -94137 -145269 -110443 -194627 -279075 -232216 -159331 -79685 -114811 -230584
14237 -230584 -258101 -153368 78959 72165 23768 -10664 -65444 -20823 20735 -121838 -49549
14226 -49549 99716 -63682 -46613 -81618 -85562 -81884 -156778 -81804 83534 65429 -2341
14215 -2341 -25008 -83883 -88787 -28178 133720 118196 153700 152671 -1010 -92263 -198088 -195010
14203 -195010 -41650 16260 103 -25492 86151 165428 108659 160608 144385 33931 56316
$$ packed form
14282A92406M4564k4515N9001m5382q4723P721K9978M7042N7450m4767j42602
14271I6173K5600J28170p8221n1509j08631j16296Q4502Q5878m4795j8042J8603
14260B1432n6205M9742m2712n3783q4042L4598O3794J305r7741p5759l2639O3055
14248b08955L8991P5827n1132L4826q4184q4448M6859P2885P9646l5126j15773
14237b30584k7517J04733K32327o794m8397l4432n4780M4621M1558j42573P2289
14226d9549J49265j63398J7069l5005l944L678p4894P4974J65338j8105o7770
14215b341k2667n8875m904O0609J61898j5524L5504j029j53681r1253j05825L078
14203a95010J53360N7910j6157k5595J11643P9277n6769N1949j6223j10454K2385
$$ plain form
14192 56316 102451 -62373 -131400 -39789 -11505 -57378 -23143 -95767 -158949 -113140 -1008
14181 -1008 90026 30929 80635 144023 16828 3007 7799 15820 -61885 -78646 -14419 54025
14169 54025 -12240 -131795 -184409 -27203 -30222 -97706 -187845 -254654 -187536 -42137 -17129
14158 -17129 -53308 14914 5618 -6501 -80027 -118125 -65152 -164265 -160971 36922 162136 154864
14146 154864 206966 147329 -20706 -66037 -33903 -8652 -58866 -117746 -102207 -84165 -29222
14135 -29222 13627 29644 -94755 -147076 -87715 3762 877 -16545 53616 150186 127950 -7106
14123 -7106 -92698 -119836 -85688 -2838 -16106 -13312 32887 67529 28413 88292 158378 146204
14111 146204 51175 13714 191497 87486 -14680 3180 -1498 -8872 85721 -42331 -88188
$$ packed form
14192E6316M6135j64824o9027R1611K8284m5873L4235p2624o3182M5809J12132
14181a008R1034n9097M9706O3388j27195j3821M792Q021p7705j6761O4227O8444
14169E4025o6265j19555n2614J57206l019o7484r0139o6809O7118J45399K5008
14158a7129l6179O8222r296j2119p3526l8098N2973r9113L294J97893J25214p272
14146A54864N2102n9637j68035m5331L2134K5251n0214n8880J5539J8042N4943
14135b9222M2849J6017j24399n2321N9361R1477k885j7422P0161R6570k2236j35056
14123g106q5592k7138L4148Q2850j3268K794M6199L4642l9116N9879P0086j2174
14111A46204r5029l7461J77783j04011j02166J7860m678p374R4593j28052m5857
$$ plain form
14100 -88188 -68373 4589 -19747 -8930 50037 185783 269553 209739 124469 64423 101841
14089 101841 250893 327911 285138 211441 237561 242501 277583 175270 31443 23263 110883
14078 110883 121644 229491 124378 29171 29671 34645 -44967 -27546 56716 96448 27717 -32885
14066 -32885 -94281 -69980 -56051 33430 -30455 -119167 -138464 -135087 -108760 30816 88787 76133
14054 76133 53558 62959 70543 14352 -7508 36309 53601 77923 42462 25749 -12676 -37621
14042 -37621 49233 315 -57454 -16496 109981 67594 17505 70288 157085 68444 -65246
14031 -65246 -42318 -119565 -87700 -21759 160669 200478 186626 117401 116674 203305 260674 52393
14019 52393 -97358 -126987 -192817 -94110 -84251 -53289 45666 44361 -45641 -151868 -199495 -152049
$$ packed form
14100h8188J9815P2962k4336J0817N8967J35746Q3770n9814q5270o0046L7418
14089A01841J49052P7018m2773p3697K6120M940L5082j02313j43827q180Q7620
14078A10883J0761J07847j05113r5207N00M974p9612J7421Q4262L9732o8731o0602
14066c2885o1396K4301J3929Q9481o3885q8712j9297L377K6327J39576N7971j2654
14054G6133k2575R401P584n6191k1860M3817J7292K4322l5461j6713l8425k4945
14042c7621Q6854m8918n7769M0958J26477m2387n0089N2783Q6797q8641j33690
14031f5246K2928p7247L1865O5941J82428L9809j3852o9225p27Q6631N7369k08281
14019E2393j49751k9629o5830R8707R859L0962R8955j305r0002j06227m7627M7446
$$ plain form
14007 -152049 -113658 -29101 79248 3293 -96766 555 7186 -88333 -156498 -104174 -98150
13996 -98150 -67496 -100547 -81779 18072 74846 17405 50781 53369 29946 59297 88626 106801
13984 106801 155486 345162 251950 204219 215386 202887 217502 157706 47896 -34600 -75574
13973 -75574 -88920 -38369 -18534 30742 12082 21656 15755 4129 43746 97901 169433 187641
13961 187641 204666 223164 306963 162145 51959 -96315 -101952 -146887 -201436 -161382 -134875
13950 -134875 -108535 19957 143974 219957 311991 200379 3840 -76036 -58901 -167061
13940 -167061 -175926 -15005 159820 136443 -87190 -144788 -66414 -62949 -128196 -166528 -178858
13929 -178858 -10459 98528 66515 35419 34019 83564 132104 111921 81625 178110 151883
$$ packed form
14007a52049L8391Q4557J08349p5955j00059R7321O631r5519o8165N2324O024
13996i8150L0654l3051J8768R9851N6774n7441L3376K588k3423K9351K9329J8175
13984A06801M8685J89676r3212m7731J1167j2499J4615n9796j09810q2496m0974
13973g5574j3346N0551J9835M9276j8660R574n901j1626L9617N4155P1532J8208
13961A87641J7025J8498Q3799j44818j10186j48274n637m4935n4549M0054K6507
13950a34875K6340J28492J24017P5983R2034j11612j96539p9876J7135j08160
13940a67061q865J60921J74825k3377k23633n7598P8374L465o5247l8332j2330
13929a78858J68399J08987l2013l1096j400M9545M8540k0183l0296R6485k6227
$$ plain form
13918 151883 113505 -61299 -60827 22707 32731 -8966 -38743 79289 47839 -23920 -41380
13907 -41380 33692 -5718 -4400 44544 88539 59735 69032 95815 73552 56670 -36060 -94682
13895 -94682 -92250 -80041 -87797 9787 52893 45019 24428 93408 63005 31198 67474 17802
13883 17802 21124 -100785 -242090 -230887 -129429 14608 133740 86365 129278 136459 84308
13872 84308 61840 12630 49221 51364 83037 165705 250836 183321 150797 94074 30303 31857
13860 31857 76394 31329 -110309 -128083 -61424 -100971 -159275 -60339 130877 96349 57130
13849 57130 22228 -3817 -82879 -91422 -113495 -116419 25252 92602 6235 -22522 -53388 -125371
13837 -125371 -99909 10471 184344 259264 273101 291387 237795 275357 188255 91710 -36399
$$ packed form
13918A51883l8378j74804M72Q3534J0024m1697k9777J18032l1450p1759j7460
13907d1380P5072l9410J318M8944M3995k8804R297K6783k2263j6882r2730n8622
13895i4682K432J2209p756R7584M3106p874k0591O8980l0403l1807L6276m9672
13883A7802L322j21909j41305J1203J01458J44037J19132m7375M2913P181n2151
13872H4308k2468m9210L6591K143L1673Q2668Q5131o7515l2524n6723o3771J554
13860C1857M4537m5065j41638j7774O6659l9547n8304R8936J91216l4528l9219
13849E7130l4902k6045p9062q543k2073k924J41671O7350q6367k8757l0866p1983
13837a25371K5462J10380J73873P4920J3837J8286n3592L7562q7102r6545j28109
$$ plain form
13826 -36399 -88795 -76988 -160794 -112354 -122168 -101526 -155105 -197133 -243741 -240070 -43225 -5971
13814 -5971 47927 -32055 42152 41581 33835 30970 -53753 -68214 85566 37430 -20285 -47418
13802 -47418 -157779 -160995 -143283 -121285 -108024 -26261 26699 11903 -35470 34328 92561 52439
13790 52439 -35612 -108128 -8481 58828 141948 168726 190240 123089 67586 36818 22595 118074
13778 118074 195306 240500 238899 210425 189983 88236 65187 56343 61076 -4681 -57204 -84337
13766 -84337 -126527 -153953 -112975 41288 146393 56291 117291 5011 -34682 -67786 -92473
13755 -92473 -33240 54822 100519 79889 3681 -143385 -107963 -119915 -158235 -179508 -106167
13744 -106167 33859 93008 -67669 -78851 -8180 -70932 -48227 -90820 -63240 14429 33322
$$ packed form
13826c6399n2396J1807q3806M8440r814K0642n3579m2028m6608L671J96845L7254
13814e971N3898p9982P4207n71p746k865q4723j4461J53780m8136n7715k7133
13802d7418j10361l216J7712K1998J3261Q1763N2960j4796m7373O9798N8233m0122
13790E2439q8051p2516R9647O7309Q3120K6778K1514o7151n5503l0768j4223R5479
13778A18074P7232M5194j601k8474k0442j01747k3049q844M733o5757n2523k7133
13766h4337m2190k7426M0978J54263J05105r0102O1000j12280l9693l3104k4687
13755i2473N9233Q8062M5697k0630p6208j47066L5422j1952l8320k1273P3341
13744a06167J40026N9149j60677j1182P0671o2752K2705m2593K7580P7669J8893
$$ plain form
13733 33322 42061 -22234 -103270 -42679 -36800 -17898 38566 86353 -48012 -128032 -103254 -78676
13721 -78676 -116710 -110857 -163931 -89017 -59546 -84030 6592 2525 -109345 -115625 -74540 68788
13709 68788 29364 28624 65575 -30698 -14976 17385 19517 49023 83233 25612 -67882 -107974
13697 -107974 -191823 -210482 -139132 26520 427 -52291 -98041 -21834 4522 85924 16798
13686 16798 -108588 726 70059 25771 -42679 -9567 -97351 7875 61706 -42609 -156298
13675 -156298 -76356 -103055 -79383 -11100 -42954 -25394 -99728 11735 84406 -15392 -120272
13664 -120272 -89601 -27835 -47135 73246 40873 -3912 -51310 -101715 -27697 113436 84083
13653 84083 5364 -30507 -13678 -82733 -111869 -90765 -110096 -216758 -178154 -96248 20512
$$ packed form
13733C3322Q739o4295q1036O0591N879J8902N6464M7787j34365q0020K4778K4578
13721g8676l8034N853n3074P4914K9471k4484R0622m067j11870o280M1085J43328
13709F8788l9424p40L6951r6273J5722L2361K132K9506L4210n7621r3494m0092
13697a07974q3849j8659P1350J65652k6093n2718m5750P6207K6356Q1402o9126
13686A6798j25386J09314O9333m4288o8450L3112q7784J05226N3831j04315j13689
13675a56298P9942k6699K3672O8283l1854J7560p4334J11463P2671r9798j04880
13664a20272L0671O1766j9300J20381l2373m4785m7398n0405P4018J41133k9353
13653H4083p8719l5871J6829o9055k9136K1104j9331j06662L8604Q1906J16760
$$ plain form
13642 20512 57164 107008 111908 56835 -66766 -76844 -67369 -124738 -12486 -70853 -150479 -118623
13630 -118623 -18757 -49110 -135004 -151895 -64123 36934 157039 92312 5080 -93925 -94413
13619 -94413 -43199 -141050 -138019 -193830 -150041 -47082 172 -27226 128475 132568 77866 9683
13607 9683 7879 -63054 -144597 -114987 -77753 31785 127055 86173 137084 99244 163314 75349
13595 75349 -35441 -67723 -140835 -126365 -101925 -24466 17245 24238 -20404 48258 104037 74340
13583 74340 61196 -105252 -47506 95393 93176 86037 11801 -70136 -68910 -44270 -102317 -171896
13571 -171896 -165915 -48614 -30361 -83383 19600 55878 57035 145459 223962 243453 85076
13560 85076 47193 24434 -52936 7053 -52094 -180385 -136575 -121825 -112825 -86963 -58405 -153212
$$ packed form
13642B0512L6652M9844M900n5073j23601j0078R475n7369J12252n8367p9626L1856
13630a18623R9866l0353q5894j6891Q7772J01057J20105o4727q7232r9005m88
13619i4413N1214r7851L031n5811M3789J02959M7254k7398J55701M093n4702o8183
13607I683j804p0933q1543K9610L7234J09538R5270m0882N0911l7840O4070q7965
13595G5349j10790l2282p3112J4470K4440P7459M1711O993m4642O8662N5779k9697
13583G4340j3144j66448N7746J42899k217p139p4236q1937J226K4640n8047o9579
13571a71896N981J17301J8253n3022J02983L6278J157Q8424P8503J9491j58377
13560H5076l7883k2759p7370N9989n9147j28291M3810J4750R000K5862K8558r4807
$$ plain form
13548 -153212 -137518 -62817 -35405 -7911 12764 25976 41560 75764 -41538 -63925 -16284
13537 -16284 -56031 -132907 -96445 -82483 -159812 -99766 -48202 26074 72731 -3866 33435 49863
13525 49863 2327 -552 60328 85923 94451 189410 148605 90163 65411 121976 190190 172389
13513 172389 164358 42213 25218 86055 131961 66661 88252 150614 108504 -19223 -42616
13502 -42616 -128446 -174786 -62481 -10400 27160 20319 16630 -45712 -146131 -130833 -89535 -99039
13490 -99039 35480 124411 -5172 -84801 -103176 -109596 -77669 -114051 -122707 -27686 30553 -85362
13478 -85362 -113387 -83938 -2474 -28067 -96243 -111235 6605 37490 -33522 -103639 -50838
13467 -50838 -8285 13252 -51820 -180609 -225210 -253566 -163046 -205476 -205494 -200798 -70929 -20114
$$ packed form
13548a53212J5694P4701K7412K7494K0675J3212J5584L4204j17302k2387M7641
13537a6284l9747p6876L6462J3962p7329O0046N1564P4276M6657p6597L7301J6428
13525D9863m7536k879O0880K5595Q528R4959m0805n8442k4752N6565O8214j7801
13513A72389q031j22145j6995O0837M5906o5300K1591O2362m2110j27727k3393
13502d2616q5830m6340J12305N2081L7560o841l689o2342j00419J5298M1298r504
13490i9039J34519Q8931j29583p9629j8375o420L1927l6382q656R5021N8239j15915
13478h5362k8025K9449Q1464k5593o8176j4992J17840L0885p1012p0117N2801
13467e0838M2553K1537o5072j28789m4601k8356R0520m2430j8M696J29869N0815
$$ plain form
13455 -20114 6342 -6401 35564 -5690 -116269 -121291 -167949 -141484 -161669 -72009 -35222 42796
13443 42796 97120 80384 60924 36516 163533 207789 238391 192634 169468 15090 -72522
13432 -72522 -17092 -47477 -118649 -47448 -31180 -7967 79687 -64125 -150554 -182160 -133508
13421 -133508 -167190 -106091 -141727 -140924 -36888 1078 -59298 -78302 -104728 8173 78419
13410 78419 -4095 -78161 57643 191689 86293 42857 95551 82061 91332 110359 131978
13399 131978 83528 64906 86719 116506 173054 279573 225893 125495 181133 173004 3854
13388 3854 -80788 -159211 -179808 -182316 -66386 -5619 12318 29159 88672 -33425 -100669 -92009
13376 -92009 -76422 -49414 -61098 42599 -31921 3679 -17882 -47123 -4193 -31540 18844
$$ packed form
13455b0114K6456j2743M1965m1254j10579n022m6658K6465k0185Q9660L6787P8018
13443D2796N4324j6736j9460k4408J27017M4256L0602m5757k3166j54378q7612
13432g2522N5430l0385p1172P1201J6268K3213Q7654j43812q6429l1606M8652
13421a33508l3682O1099l5636Q03J04036L7966o0376j9004k6426J12901P0246
13410G8419q2514p4066J35804J34046j05396m3436N2694j3490R271J9027K1619
13399A31978m8450j8622K1813K9787N6548J06519n3680j00398N5638q129j69150
13388C854q4642p8423k0597k508J15930O0767J7937J6841N9513j22097o7244Q660
13376i2009J5587K7008j1684J03697p4520L5600k1561k9241M2930k7347N0384
$$ plain form
13365 18844 142819 149187 -33356 -44794 22994 -83599 -140069 -128248 -31894 46733 69725
13354 69725 48781 36824 29497 -19065 -78778 -92262 -63517 -170124 -151232 -57575 -95288 -43597
13342 -43597 41695 58764 39682 -69864 -142765 4194 27951 -51635 -159371 -199355 -201249
13331 -201249 -156473 -58513 74596 129156 47058 22345 -10866 -82885 -12140 35164 63689
13320 63689 125373 62753 12368 43837 54949 -22623 -63326 -75567 -6808 38896 -9688 8342
13308 8342 -83041 -149077 -137721 -89264 -53040 -8675 82239 147941 71411 172882 194943 125149
13296 125149 61844 -45949 -161566 -180319 -132311 -165487 -185746 -163674 -37376 -9289 -41128
13285 -41128 -16602 -57216 -107918 -74913 -69089 -122385 -132085 -88239 -68360 40854 162922 93929
$$ packed form
13365A8844J23975O368j82543j1438O7788j06593n6470J1821R6354P8627K2992
13354F9725k0944j1957p327m8562n9713j3484K8745j06607J8892R3657l7713N1691
13342d3597Q5292J7069j9082j09546p2901J46959K3757p9586j07736l9984j894
13331b01249M4776R7960J33109N4560q2098k4713l3211p2019P0745M7304K8525
13320F3689O1684o2620n0385L1469J1112p7572m0703j2241O8759M5704m8584J8030
13308H342r1383o6036J1356M8457L6224M4365R0914O5702p6530J01471K2061o9794
13296A25149o3305j07793j15617j8753M8008l3176k0259K2072J26298K8087l1839
13285d1128K4526m0614n0702L3005N824n3296r700M3846J9879J09214J22068o8993
$$ plain form
13273 93929 -50280 -79208 62700 107725 164549 167517 80384 -42595 -73696 -21887 75698
13262 75698 169994 127000 160556 146840 77053 124306 218429 143924 -21246 -63772 -61774 -31156
13250 -31156 128728 274037 261361 177077 176123 176560 113609 83781 99907 111041 -85393 -160654
13238 -160654 -72337 -101893 -76535 11158 -4053 -18855 -1094 17595 2044 17371 -72534
13227 -72534 -69509 41638 -82235 -214906 -193194 -136435 -115997 -203302 -77381 44938 108739
13216 108739 120197 172679 99018 -91579 -163791 -98120 26468 131681 67276 56859 99306
13205 99306 176353 155016 62361 -2242 39592 -7395 -3865 50476 122684 199696 137135 149244
13193 149244 160605 182447 137271 132266 70943 19147 -65711 -72692 -44741 27839 109027 84624
$$ packed form
13273I3929j44209k8928J41908M5025N6824K968q7133j22979l1101N1809R7585
13262G5698R4296m2994L3556j3716o9787M7253R4123p4505j65170m2526J998L0618
13250c1156J59884J45309j2676q4284r54M37o2951k9828J6126J1134j96434p5261
13238a60654Q8317k9556K5358Q7693j5211j4802J7761J8689j5551J5327q9905
13227g2534L025J11147j23873j32671K1712N6759K0438q7305J25921J22319O3801
13216A08739J1458N2482p3661j90597p2212O5671J24588J05213o4405j0417M2447
13205I9306P7047k1337r2655o4603M1834m6987L530N4341P2208P7012o2561J2109
13193A49244J1361K1842m5176n005o1323n1796q4858o981K7951P2580Q1188k4403
$$ plain form
13181 84624 62509 83750 48008 93070 -104420 -183702 -140605 -166171 -68127 -115686 -186051
13170 -186051 -268865 -296348 -200867 -214455 -182675 -48293 85452 123616 130133 116131 58191
13159 58191 6804 24678 -80521 -225453 -238819 -75968 3028 -7886 -64840 -38770 -77376
13148 -77376 -2818 -11633 -85746 -114976 -129600 -170957 -94260 32938 -56439 -81446 -67802 -20612
13136 -20612 -37254 -100238 -61634 -233172 -410903 -418534 -337677 -280790 -131383 -68745 -18652
13125 -18652 -124118 -261903 -201027 -154515 -116815 -139265 -27872 81188 32111 -3774 -56914
13114 -56914 -81670 33077 81973 72559 94214 116872 60257 -31592 -33375 33850 127655 160201
13102 160201 39594 -26130 -59564 -158160 -131626 -53779 -10200 112548 217268 138819 132892
$$ packed form
13181H4624k2115K1241l5742M5062j97490p9282M3097k5566R8044m7559p0365
13170a86051q2814k7483R5481j3588L1780J34382J33745L8164O517j4002n7940
13159E8191n1387J7874j05199j44932j3366J62851P8996j0914n6954K6070l8606
13148g7376P4558q815p4113k9230j4624m1357P6697J27198q9377k5007J3644M7190
13136b0612j6642o2984L8604j71538j77731p631Q0857N6887J49407O2638N0093
13125a8652j05466j37785O0876M6512L7700k2450J11393J09060m9077l5885n3140
13114e6914k4756J14747M8896r414K1655K2658n6615r1849j783O7225R3805L2546
13102A60201j20607o5724l3434r8596K6534P7847M3579J22748J04720p8449n927
$$ plain form
13091 132892 64883 1196 -61054 -113490 -81241 -58503 -43529 -20126 -3302 56484 155632
13080 155632 132743 140713 23849 -91052 -141528 -73876 -82775 -91055 -123578 -116033 -57002 -89135
13068 -89135 -156718 -306071 -316715 -223869 -139779 -32298 102167 125823 -73274 -283180 -264449
13057 -264449 -95210 -10572 -2440 49253 50711 9743 -126666 -183416 -138133 -68082 -9233
13046 -9233 -14667 13010 -26416 -118525 -156680 -93578 -114074 -86935 -119598 -143293 -191173 -129037
13034 -129037 -149596 -168755 -146355 -125244 -88258 -14059 65356 79972 35685 72572 -26097
13023 -26097 35551 106860 117569 136561 133076 53394 45683 -75428 -205210 -115100 -18896 72170
13011 72170 46619 -150603 -154834 -216907 -214509 -98113 88142 159465 170155 212493 60587
$$ packed form
13091A32892o8009o3687o2250n2436L2249K2738J4974K3403J6824N9786R9148
13080A55632k2889P970j16864j14901n0476O7652q899q280l2523P545N9031l2133
13068h9135o7583j49353j0644R2846Q4090J07481J34465K3656j99097k09906J8731
13057b64449J69239Q4638Q132N1693J458m0968j36409n6750M5283P0051N8849
13046i233n434K7677l9426r2109l8155O3102k0496K7139l2663k3695m7880O2136
13034a29037k0559j9159K2400K1111L6986P4199P9415J4616m4287L6887r8669
13023b6097O1648P1309J0709J8992l485p9682p711j21111j29782R0110R6204R1066
13011G2170k5551j97222m231o2073K398J16396J86255P1323J0690M2338j51906
$$ plain form
13000 60587 -4403 91969 -11049 -51037 -6691 -24703 -45533 -52861 -66355 -136240 -69652 17541
12988 17541 85322 92657 154220 239792 94900 6547 -41406 890 109002 114794 -14925
12977 -14925 -168640 -163683 -100537 -134486 -87156 6329 -52321 -59674 -63206 -10619 -25666 -6562
12965 -6562 98168 163308 169268 79664 19481 28243 -9476 -14536 -43910 -127171 -99171 -79871
12953 -79871 -99055 -103590 -101687 -85785 -33130 -59218 -16617 42036 68916 21879 -75573 -190673
12941 -190673 -200273 -179430 -98913 -120342 -17744 24667 -64314 -27863 -35002 -150803 -147307 -76526
12929 -76526 -15614 79206 41405 60211 -47877 -87114 -162141 -157003 -71392 -93489 -8038 161898
12917 161898 133428 48141 12531 -15178 57183 61069 95890 91618 6186 -137657 -199202 -139038
$$ packed form
13000F0587o4990R6372j03018l9988M4346j8012k0830p328j3494o9885O6588Q7193
12988A7541O7781P335O1563Q5572j44892q8353m7953M2296J08112N792j29719
12977a4925j53715M957O3146l3949M7330R3485n8650p353l532N2587j5047J9104
12965f562J04730O5140N960q9604o0183Q762l7719n060k9374q3261K8000J9300
12953g9871j9184m535J903J5902N2655k6088M2601N8653K6880m7037r7452j15100
12941a90673r600K0843Q0517k1429J02598M2411q8981L6451p139j15801L496P0781
12929g6526O0912R4820l7801J8806j08088l9237p5027N138Q5611k2097Q5451J69936
12917A61898k8470q5287l5610k7709P2361L886L4821m272q5432j43843o1545O0164
$$ plain form
12905 -139038 -73019 -109646 -125259 -53389 -52167 -44530 2974 -52868 -84192 -39124 -16117 -28415
12893 -28415 -54995 -58111 -95442 -99290 -28283 -3224 36417 152484 229235 240100 218144 118574
12881 118574 -38686 -88933 -100681 -146718 -166177 -191787 -106131 -128509 -107139 -121220 -116736
12870 -116736 -141362 -26319 10856 130441 265271 206886 148752 121029 123782 117198 130134
12859 130134 128745 44120 -47102 -89215 -168815 -143487 -162550 -85989 -75131 -144123 -105382 -36629
12847 -36629 -26466 -63747 -148965 -220431 -204799 -199715 -205237 -106910 -40879 -184251 -145574 -56892
12835 -56892 -37974 12879 15603 12998 -33176 -42069 -54736 -58059 -20865 27208 -64407 -140276
12823 -140276 -176639 -225087 -100727 14106 70457 4491 -76807 714 161017 229582 150776
$$ packed form
12905a39038O6019l6627j5613P1870J222P637M7504n5842l1324M5068K3007j2298
12893b8415k6580l116l7331l848P1007K5059L9641J16067P6751J0865k1956r9570
12881A18574j57260n0247j1748m6037j9459k5610Q5656k2378K1370j4081M484
12870a16736k4626J15043L7175J19585J34830n8385n8134k7723K753o584J2936
12859A30134j389q4625r1222m2113p9600K5328j9063P6561J0858o8992L8741O8753
12847c6629J0163l7281q5218p1466J5632N084n522R8327O6031j43372L8677Q8682
12835e6892J8918N0853K724k605m6174q893j2667l323L7194M8073r1615p5869
12823a40276l6363m8448J24360J14833N6351o5966q1298P7521J60303O8565p8806
$$ plain form
12812 150776 195775 251201 70226 44836 -56451 -137136 -186148 -166830 -114901 -36443 -51888
12801 -51888 -99500 -78217 -179647 -110022 -88712 -69129 27860 53589 10675 4514 -44716 -120863
12789 -120863 -133673 -46695 -6721 -43039 -74165 -67183 -67921 66230 2478 -28972 16330 104484
12777 104484 43145 83582 14609 36641 17369 83594 129030 108965 30228 58478 -64366
12766 -64366 -96090 25497 123765 91188 -5856 -61084 -177246 -159282 -92571 -49884 -26823
12755 -26823 -15682 -50300 9022 30010 17097 -10558 92034 189833 81899 -7246 -8648
12744 -8648 -62014 -132901 -135370 -150639 -219558 -64480 -73723 -238913 -118031 -124984 -183224 -76108
12732 -76108 -16470 109297 75059 36627 31200 21040 95358 100188 52826 69873 54785 41892
$$ packed form
12812A50776M4999N5426j80975k5390j01287q0685m9012J9318N1929P8458j5445
12801e1888m7612K1283j01430O9625K1310J9583R6989K5729m2914o161m9230p6147
12789a20863j2810Q6978L9974l6318l1126O982p38J34151o3752l1450M5302Q8154
12777A04484o1339M0437o8973K2032j9272O6225M5436k0065p8737K8250j22844
12766f4366l1724J21587R8268l2577r7044n5228j16162J7964O6711M2687K3061
12755b6823J1141l4618N9322K0988j2913k7655J02592R7799j07934q9145j402
12744h648n3366p0887k469j5269o8919J55078r243j65190J20882o953n8240J07116
12732g6108N9638J25767l4238l8432n427j0160P4318M830m7362J7047j5088j2893
$$ plain form
12720 41892 92042 72328 -23358 1024 -88132 -155625 -183004 -113231 -26509 86471 107880
12709 107880 92494 38390 65302 48847 44566 99735 83138 14886 103520 83757 -101898
12698 -101898 -206228 -172910 -43413 28907 26704 -59855 -116110 -82780 -27568 132709 59003
12687 59003 -73925 -71149 97360 82840 14294 33565 -47964 -82201 -85319 -55112 -139132 -71143
12675 -71143 -43244 -78408 -216311 -139476 -86557 -53454 -64570 -77956 -94593 -28309 -50759
12664 -50759 -625 53161 66107 20923 -113033 -193785 -124841 -98417 -158182 -123491 -98470
12653 -98470 -113663 9522 66367 -123086 -141250 -10551 6549 -52090 -35340 -38155 -93720
12642 -93720 343 44170 -36909 -36965 -44499 -19198 -2677 50952 132070 129188 77450 99463 76297
$$ packed form
12720D1892N0150j9714r5686K4382q9156o7493k7379O9773Q6722J12980K1409
12709A07880j5386n4104K6912j6455m281N5169j6597o8252Q8634j9763j85655
12698a01898j04330L3318J29497P2320k203q6559n6255L3330N5212J60277p3706
12687E9003j32928K776J68509j4520o8546J9271q1529l4237l118L0207q4020O7989
12675g1143K7899l5164j37903P6835N2919L3103j1116j3386j6637O6284k2450
12664e0759N0134N3786J2946m5184j33956q0752O8944K6424n9765L4691K5021
12653i8470j5193J23185N6845j89453j8164J30699J7100n8639J6750k815n5565
12642i3720R4063M3827q1079n6p534K5301J6521N3629Q1118k882n1738K2013k3166
$$ plain form
12629 76297 56733 26005 20056 33858 59192 101032 244680 188568 146615 97459 19673 10861
12617 10861 33760 33343 116767 110231 23037 -69105 -102815 -92012 -55233 -121068 -122272 -190566
12605 -190566 -141375 -174024 -183050 -107114 -45030 14217 60608 -9300 -7048 22974 133046 192861
12593 192861 201230 167515 149549 205086 243306 233276 168435 95277 105656 170407 160266 70365
12581 70365 29305 97928 219596 275732 207013 126383 176591 196085 275769 328934 254123
12570 254123 202521 271083 273844 198772 170426 170259 120740 151421 228530 234938 169069 -3162
12558 -3162 -37759 -470 -31279 -3559 156388 287279 181543 -46883 -51100 -80299 -3219
12547 -3219 57766 1903 49967 160427 183233 153544 160885 228777 231445 183270 135995 228054
$$ packed form
12629G6297j9564l0728n949J3802K5334M1840J43648n6112m1953m9156p7786q812
12617A0861K2899m17Q3424o536q7194r2142l3710J0803L6779o5835j204o8294
12605a90566M9191l2649r026P5936O2084N9247M6391o9908K252L0022J10072N9815
12593A92861Q369l3715j7966N5537L8220j0030o4841p3158J0379O4751j0141q9901
12581G0365m1060O8623J21668N6136o8719q0630N0208J9494P9684N3165p4811
12570B54123n1602O8562K761p5072k8346j67m9519L0681P7109O408o5869j72231
12558c162l4597L7289l0809K7720J59947J30891j05736k28426m217k9199P7080
12547c219O0985n5863M8064J10460K2806k9689P341O7892K668m8175m7275R2059
$$ plain form
12535 228054 139074 105818 112003 85505 3976 2874 -35452 -78100 -61244 -27218 49294 47682
12523 47682 17013 27235 66491 -71694 -105830 -172014 -185749 -8574 20724 -213392 -181094
12512 -181094 -107204 -107429 -164278 -97168 -63518 57970 -26168 -178017 -155716 -62051 -43860
12501 -43860 3612 30056 39321 -45191 -82771 -58600 -68028 -20377 97784 73368 -55616 29416
12489 29416 110082 170330 239723 140695 7523 -88042 -132217 -96534 -17488 -82031 -4339
12478 -4339 27792 -17308 -61349 -169384 -209065 -4035 5600 -208191 -194376 -192905 -142086 -137697
12466 -137697 -114885 28854 211492 219946 176138 203574 39714 -18222 187 23530 30117
12455 30117 -7819 -41989 -36731 -165864 -91161 -56780 -24692 4632 44117 85001 126798 37651
$$ packed form
12535B28054q8980l3256O185k6498q1529j102l8326m2648J6856L4026P6512j612
12523D7682l0669J0222L9256j38185l4136o6184j3735J77175K9298k34116L2298
12512a81094P3890k25n6849O7110L3650J21488q4138j51849K2301R3665J8191
12501d3860M7472K6444R265q4512l7580K4171r428M7651J18161k4416j28984Q5032
12489B9416Q0666O0248O9393r9028j33172r5565m4175L5683P9046o4543P7692
12478d339L2131m5100m4041j08035l9681K05030R635k13791J3815J471N0819M389
12466a37697K2812J43739J82638Q454m3808K7436j63860n7936J8409K3343O587
12455C0117l7936l4170N258j29133P4703L4381L2088K9324L9485M0884M1797q9147
$$ plain form
12443 37651 -6562 133194 20606 -67762 28395 6202 -196324 -291120 -219355 -134569 -161839
12432 -161839 -122852 -71221 -11897 -11113 17789 10010 -105673 -128805 -220341 -214226 -216694 -206736
12420 -206736 -167932 -191907 -49356 86442 98983 138225 100633 32490 -26445 -70241 -86242
12409 -86242 48462 67083 106641 194597 300475 264715 191479 190190 134520 51023 62217
12398 62217 45583 67308 38733 48302 76805 86509 102943 -3475 -79319 37725 201018
12387 201018 173608 64156 22391 2246 -27858 18521 92399 24859 -82939 -59462 -118793
12376 -118793 -119182 -123386 -155585 -74270 1093 70487 -25802 -175350 -188792 -148951 -160984 -137384
12364 -137384 -137897 16772 86297 76993 136473 121717 181152 95101 36905 19760 81792 159339
$$ packed form
12443C7651m4213J39756j12588q8368R6157k2193k02526r4796P1765Q4786k7270
12432a61839L8987N1631N9324P84K8902p779j15683k3132r1536O115k468R958
12420b06736L8804k3975J42551J35798J2541L9242l7592o8143n8935m3796j6001
12409h6242J34704J8621L9558Q7956J05878l5760p3236j289n5670q3497J1194
12398F2217j6634K1725k8575R569K8503R704J6434j06418p5844J17044J63293
12387B01018k7410j09452m1765k0145l0104M6379P3878o7540j07798K3477n9331
12376a18793l89m204l2199Q1315P5363O9394r6289j49548j3442L9841j2033K3600
12364a37384n13J54669O9525r304N9480j4756N9435q6051n8196j7145O2032P7547
$$ plain form
12352 159339 89163 106001 80494 17393 -94426 -230011 -267745 -264646 -199571 -79745 25074
12341 25074 22935 134066 78614 -54656 -45920 56033 128594 149045 151990 74138 60017 53094
12329 53094 92639 88420 -21131 90833 16017 -87780 -3830 118375 -10698 -50223 -73033
12318 -73033 -5655 -80228 -112019 -145371 -82485 39872 48718 -12420 22447 13127 3800 20518
12306 20518 66670 -79456 -36782 76354 -20208 -89345 -127041 -175413 -129764 -97080 -112396
12295 -112396 -154382 -77635 20386 235788 287152 190340 128736 141007 185788 128684 100623
12284 100623 4126 57482 94152 -48007 -80314 -124424 -153673 -117125 -198357 -258891 -135949
12273 -135949 -63399 -102666 -109992 -64381 -42918 88192 108210 148076 145292 142178 123098 143819
$$ packed form
12352A59339p0176J6838k5507o3101j11819j35585l7734L099O5075J19826J04819
12341B5074k139J11131n5452j33270Q736J01953P2561K0451K945p7852j4121o923
12329E3094L9545m219j09551J11964p4816j03797Q3950J22205j29073l9525k2810
12318g3033O7378p4573l1791l3352O2886J22357Q846o1138L4867r320r327J6718
12306B0518M6152j46126M2674J13136r6562o9137l7696m8372M5649L2684j5316
12295a12396m1986P6747R8021K15402N1364r6812o1604J2271M4781n7104k8061
12284A00623r6497N3356L6670j42159l2307m4110k9249L6548q1232o0534J22942
12273a35949P2550l9267p326M5611K1463J31110K0018L9866k784l114j9080K0721
$$ plain form
12261 143819 22900 -8701 -44311 -64416 -26098 69104 24961 -74056 35633 199125 238836
12250 238836 173865 195303 247232 185306 112632 -63518 -29237 -46805 -53549 50690 55777
12239 55777 88571 249856 274546 115151 32888 101491 152924 148365 127629 40653 -89231
12228 -89231 -35162 -104110 -157517 -180791 -40679 83343 91370 109225 166088 118011 54737
12217 54737 -144436 -114848 20649 31964 53738 -8616 -64791 -65611 -107969 -97387 -54688 -30071
12205 -30071 114053 311434 220678 -18735 -31398 -35571 -65815 -93550 -166632 -139735 -152123
12194 -152123 -129758 -24936 10231 57340 76945 -28586 -11921 -34877 -94724 -33613 80783
12183 80783 38128 55125 58160 -63673 -29224 7376 -32414 -81245 31401 138780 2225
$$ packed form
12261A43819j20919l1601l5610k0105L8318R5202m4143r9017J09689J63492L9711
12250B38836o4971K1438N1929o1926p2674j76150L4281j7568o744J04239N087
12239E5777L2794J61285K4690j59395q2263O8603N1433m559k0736q6976j29884
12228h9231N4069o8948n3407k3274J40112J24022Q027J7855N6863m8077o3274
12217E4737j99173K9588J35497J1315K1774o2354n6175q20m2358J0582M2699K4617
12205c0071J44124J97381r0756k39413j2663m173l0244k7735p3082K6897j2388
12194a52123K2365J04822L5167M7109J9605j05531J6665k2956n9847O1111J14396
12183H0783m2655J6997L035j21833L4449L6600l9790m8831J12646J07379j36555
$$ plain form
12172 2225 -113216 -176979 -93554 83300 133976 91836 3400 16579 32422 4370 -2972 67700
12160 67700 159837 223262 110631 31210 29750 -12783 -12916 8025 23322 49869 93404 176132
12148 176132 174392 153184 50555 -130295 -142400 -50956 31614 66168 90337 24707 16233
12137 16233 47288 93012 60639 99315 154473 168563 146408 140747 -23573 -151512 -112347
12126 -112347 102052 229295 183320 91336 33498 53503 1622 -5373 27245 102735 188931
12115 188931 138321 123178 3060 -6525 40469 13170 40168 -76239 -104954 -25070 60231
12104 60231 162656 155052 75857 84213 125876 106257 90392 -24988 -83340 -39535 21374 -26274
12092 -26274 4317 78499 59310 11238 27060 2913 -128407 -116020 -142227 -79456 13776
$$ packed form
12172B225j15441o3763Q3425J76854N0676m2140q8436J3179J5843k8052p342P0672
12160F7700R2137O3425j12631p9421j460m2533j33K0941J5297K6547M3535Q2728
12148A76132j740k1208j02629j80850j2105R1444Q2570L4554K4169o5630q474
12137A6233L1055M5724l2373L8676N5158J4090k2155n661j64320j27939L9165
12126a12347K14399J27243m5975r1984n7838K0005n1881o995L2618P5490Q6196
12115A88931n0610j5143j20118r585M6994k7299K6998j16407k8715P9884Q5301
12104F0231J02425p604p9195Q356M1663j9619j5865j15380n8352M3805O0909m7648
12092b6274L0591P4182j9189m8072J5822k4147j31320J2387k6207O2771R3232
$$ plain form
12081 13776 12149 -33912 29649 100562 170004 110332 96864 122860 71958 -14088 -2474 -59485
12069 -59485 26338 115745 -12119 -213059 -148577 79758 141835 114194 81688 86479 137534
12058 137534 66219 68751 49218 57058 46535 191719 355857 409213 363382 225530 189495
12047 189495 171037 129841 115430 118880 74020 71650 102846 103334 66904 59967 114039 274386
12035 274386 197463 8305 38793 119706 63009 174363 219167 276096 297964 367370 274521
12024 274521 116992 136961 254694 238724 215261 89186 82524 132087 82068 82908 107169
12013 107169 97909 157149 183092 333999 436794 423816 398985 455665 554250 551605 397004
12002 397004 252519 239605 149602 151175 207544 248900 325296 355748 475023 528584 529981
$$ packed form
12081A3776j627m6061O3561P0913O9442n9672j3468K5996n0902q6046J1614n7011
12069e9485Q5823Q9407j27864k00940O4482K28335O2077k7641l2506M791N1055
12058A37534p1315K532j9533P840j0523J45184J64138N3356m5831j37852l6035
12047A89495j8458m1196j4411L450m4860k370L1196M88l6430o937N4072J60347
12035B74386p6923j89158L0488Q0913n6697J11354M4804N6929K1868O9406r2849
12024B74521j57529J9969J17733j5970k3463j26075o662M9563n0019Q40K4261
12013A07169r260N9240K5943J50907J02795j2978k4831N6680R8585k645j54601
12002C97004j44485j2914r0003J573N6369M1356P6396L0452J19275N3561J397
$$ plain form
11991 529981 519078 533541 579392 555661 519866 470137 442028 518900 569358 427450 434873
11980 434873 523983 426651 521750 705564 660633 670518 723458 692289 757808 890165 880253
11969 880253 945951 1062175 1077069 1185229 1239566 1230528 1352652 1550079 1689881 1788475 1865978
11958 1865978 1873620 2010790 2127949 2359152 2605216 2842449 3025990 3266134 3573065 3912034
11948 3912034 4375313 4872207 5431449 5981392 6591147 7367898 8328491 9466426 10942775
11939 10942775 12748155 15049739 17975765 21734824 26646470 33043148 41305270 51230421
11931 51230421 62192089 72937945 82618862 90832019 97640275 102429516 103564852 99432101
11923 99432101 89686992 76754867 63903560 52848952 44052837 37414872 32361674 28495598
$$ packed form
11991E29981j0903J4463M5851k3731l5795m9729k8109P6872N0458j41908P423
11980D34873Q9110r7332R5099J83814m4931R885N2940l1169O5519J32357r912
11969H80253O5698J16224J4894J08160N4337r038J22124J97427J39802R8594P7503
11958A865978P642J37170J17159K31203K46064K37233J83541K40144L06931L38969
11948C912034M63279M96894N59242N49943O09755P76751R60593J137935J476349
11939A0942775J805380K301584K926026L759059M911646O396678Q262122R925151
11931E1230421J0961668J0745856R680917Q213157O808256M789241J135336m132751
11923I9432101r745109j2932125j2851307j1054608q796115o637965n053198l866076
$$ plain form
11915 28495598 25212725 22562363 20392791 18638289 17231701 16151274 15165063 14219135
11907 14219135 13384648 12793946 12201346 11583059 10990460 10436775 9871832 9389421 8935748
11898 8935748 8545484 8131607 7746576 7415310 7099561 6778505 6503209 6210962 6012112
11889 6012112 5804832 5764857 5535984 5183990 5105053 4981421 4812642 4581174 4282626 4169243
11879 4169243 4053680 3962779 3806904 3625279 3509639 3404170 3266485 3107893 3047293 3018588
11869 3018588 3006780 2903285 2743405 2727243 2617110 2485794 2562543 2624792 2440991 2255575
11859 2255575 2208658 2139124 2053093 1950892 2020970 2011374 1854392 1789148 1707693 1615433 1560503
11848 1560503 1627362 1670662 1551125 1492218 1429525 1389834 1326943 1309561 1289561 1430573 1382160
$$ packed form
11915B8495598l282873k650362k169572j754502j406588j080427r86211r45928
11907A4219135q34487n90702n92600o18287n92599n53685n64943m82411m53673
11898H935748l90264m13877l85031l31266l15749l21056k75296k92247j98850
11889F012112k07280l9975k28873l51994p8937j23632j68779k31468k98548j13383
11879D169243j15563r0901j55875j81625j15640j05469j37685j58592o0600k8705
11869C018588j1808j03495j59880j6162j10133j31316P6749O2249j83801j85416
11859B255575m6917o9534q6031j02201P0078r596j56982o5244q1455r2260n4930
11848A560503O6859M3300j19537n8907o2693l9691o2891j7382k0000J41012m8413
$$ plain form
11837 1382160 1276944 1202638 1208547 1290118 1246309 1208455 1176825 1180847 1096698 1036864 1066942
11826 1066942 927006 987544 1009187 956690 923058 875482 936366 881844 824863 791957 741897
11815 741897 690451 644540 738230 774388 853919 772270 699457 664997 593302 647422 637600 683809
11803 683809 604022 748357 816627 751529 607354 517028 532037 584347 590313 512073 545762
11792 545762 547076 494713 441695 479058 387595 323567 362856 442163 462808 390439 297908 204951
11780 204951 197076 214014 212276 211800 239176 292402 266023 271001 380308 486679 504320 351738
11768 351738 321242 308772 247773 268530 321075 216625 305554 347154 248574 227013 191513
11757 191513 182298 72196 123829 100082 37227 59342 142397 188962 237641 276656 262418
$$ packed form
11837A382160j05216p4306N909Q1571m3809l7854l1630M022q4149n9834L0078
11826A066942j39936O0538K1643n2497l3632m7576O0884n4522n6981l2906n0060
11815G41897n1446m5911R3690L6158P9531q1649p2813l4460p1695N4120r822M6209
11803F83809p9787J44335O8270o5098j44175r0326J5009N2310N966p8240L3689
11792E45762J314n2363n3018L7363r1463o4028L9289P9307K0645p2369r2531r2957
11780B04951p875J6938j738m76K7376N3226k6379M978J09307J06371J7641j52582
11768C51738l0496j2470o0999K0757N2545j04450Q8929M1600r8580k1561l5500
11757A91513r215j10102N1633k3747o2855K2115Q3055M6565M8679L9015j4238
$$ plain form
11746 262418 217704 151980 216071 281575 223168 196380 238308 238891 268933 249407 235522 73271
11734 73271 -46663 70077 77607 130805 191112 118684 153955 143097 9498 -148224 -24212
11723 -24212 189458 214961 117387 64099 -4493 19964 85123 118658 214236 282842 241134
11712 241134 145738 114901 118544 120460 52352 -28858 78496 166114 170209 228453 178301 173278
11700 173278 164283 310828 323529 301274 352323 324740 297641 258311 228496 206847 131234
11689 131234 -1116 52535 97638 109389 202383 153139 -31190 28833 22131 -44860 -86045
11678 -86045 39532 160379 66651 -13357 -116998 -104399 41800 92505 7660 -161266 -123763
11667 -123763 19713 7544 1873 -33313 -97796 -73293 -45366 27197 131921 221723 234395
$$ packed form
11746B62418m4714o5724O4091O5504n8407k6788M1928N83L0042j9526j3885j62251
11734G3271j19934J16740P530N3198O0307p2428L5271j0858j33599j57722J24012
11723b4212K13670K5503r7574n3288o8592K4457O5159L3535R5578O8606m1708
11712B41134r5396l0837L643J916o8108q1210J07354Q7618M095N8244n0152n023
11700A73278q995J46545J2701k2255N1049k7583k7099l9330k9815k1649p5613
11689A31234j32350N3651M5103J1751R2994m9244j84329O0023o702o6991m1185
11678h6045J25577J20847r3728q0008j03641J2599J46199N0705q4845j68926L7503
11667a23763J43476j2169n671l5186o4483K4503K7927P2563J04724Q9802J2672
$$ plain form
11656 234395 214923 270332 306950 125404 83237 140728 157334 199854 226419 93170 58230
11645 58230 -1723 -76970 -46059 -23374 -60526 -38949 77712 91990 81781 165600 175471 25208
11633 25208 -222362 -96738 86531 11556 11871 153301 255766 183756 160842 112769 5187
11622 5187 70292 51059 -31896 37104 -34443 -89547 -36392 -59379 -112926 -50733 38112 146706
11610 146706 146811 102451 49151 36108 103083 30859 -25590 8843 17295 44923 120827 55409
11598 55409 -7945 10618 54271 71412 -7164 -56406 18423 -1564 -22143 47112 120732 219873
11586 219873 174994 -24579 -144259 -52689 -24184 -48425 68217 52519 -7501 -9449 51151
11575 51151 90931 40473 -25072 -89099 -148063 -127247 -84691 70457 60330 -103694 -75478
$$ packed form
11656B34395j9472N5409L6618j81546m2167N7491J6606M2520K6565j33249l4940
11645E8230n9953p5247L0911K2685l7152K1577J16661J4278j0209Q3819R871j50263
11633B5208k47570J25624J83269p4975L15J41430J02465p2010k2914m8073j07582
11622E187O5105j9233q2955O9000p1547n5104N3155k2987n3547O2193Q8845J08594
11610A46706J05m4360n3300j3043O6975p2224n6449L4433Q452K7628P5904o5418
11598E5409o3354J8563M3653J7141p8576m9242P4829j9987k0579O9255P3620R9141
11586B19873m4879j99573j19680R1570K8505k4241J16642j5698o0020j948O0600
11575E1151L9780n0458o5545o4027n8964K0816M2556J55148j0127j64024K8216
$$ plain form
11564 -75478 28879 196843 221195 22247 -78869 -141086 -15980 -32125 -72082 -31785 -108442
11553 -108442 -56590 -74257 -61151 -59276 -91009 -79089 28704 82146 20575 -31507 -82590
11542 -82590 -26876 -6633 -17078 -37787 -70210 -114637 -121353 -50989 -24638 132653 301621
11531 301621 309034 115320 -6111 -98336 24975 181745 220305 143651 159502 150258 76243
11520 76243 31983 -78682 -34765 -20817 6676 15913 17255 -12017 -29681 -90354 -11174 137726
11508 137726 216688 139432 129534 130764 136243 87481 75268 102581 19431 -51036 -59720 8015
11496 8015 86242 30501 55134 103453 98870 146541 151591 130195 141422 238448 211154 111065
11484 111065 92017 55407 4276 121029 148003 191941 178628 138036 112932 70126 44052
$$ packed form
11564g5478J04357J67964K4352j98948j01116o2217J25106j6145l9957M0297p6657
11553a08442N1852j7667J3106J875l1733J1920J07793N3442o1571n2082n1083
11542h2590N5714K0243j0445k0709l2423m4427o716P0364K6351J57291J68968
11531C01621P413j93714j21431r2225J23311J56770L8560p6654J5851r244p4015
11520G6243m4260j10665M3917J3948K7493R237J342k9272j7664o0673P9180J48900
11508A37726P8962p7256r898J230N479m8762j2213K7313q3150p0467q684O7735
11496H015P8227n5741K4633M8319m583M7671N050k1396J1227R7026k7294j00089
11484A11065j9048l6610n1131J16753K6974M3938j3313m0592k5104m2806k6074
$$ plain form
11473 44052 99540 74650 68136 40379 -41892 -111239 -67923 -104799 -148649 -72724 -23999 154959
11461 154959 235632 81257 -37281 -68933 -4728 68199 -25406 -118502 -168462 -161178 -25343
11450 -25343 -38059 -58792 -45198 -9234 -102221 -162169 -96199 -125823 -106119 -36436 50818 85799
11438 85799 120775 103076 9402 -40882 -17948 -18323 63390 146573 111794 60313 67393 35259
11426 35259 -26838 -136739 -61432 -96945 -108208 -193174 -342611 -320736 -198551 -95131 -25416
11415 -25416 -125059 -52144 -8203 95557 76551 7714 15543 38687 -2050 -57510 -16446 12774
11403 12774 -36452 -104814 -128226 -80747 -13554 16605 31726 -57177 -48328 -31524 -85182 -40950
11391 -40950 27214 65972 39415 1044 -53565 -82040 75026 65222 23155 -32708 -115932 -53396
$$ packed form
11473D4052N5488k4890o514k7757q2271o9347M3316l6876m3850P5925M8725J78958
11461A54959Q0673j54375j18538l1652O4205P2927r3605r3096m9960P284J35835
11450b5343j2716k0733J3594L5964r2987n9948O5970k9624J9704O9683Q7254L4981
11438H5799L4976j7699r3674n0284K2934l75Q1713Q3183l4779n1481P080l2134
11426C5259o2097j09901P5307l5513j1263q4966j49437K1875J22185J03420O9715
11415b5416r9643P2915M3941J03760j9006o8837P829K3144m0737n5460M1064K9220
11403A2774m9226o8362k3412M7479O7193L0159J5121q8903Q849J6804n3658M4232
11391d0950O8164L8758k6557l8371n4609k8475J57066r804m2067n5863q3224O2536
$$ plain form
11379 -53396 79830 55290 -32795 49209 258866 175401 40520 47805 52112 -29083 -108832
11368 -108832 26122 51473 33449 9638 39031 82718 97727 28809 -34066 23123 27242
11357 27242 57813 81745 183929 58435 -33062 41719 67357 52738 70562 -44818 24373
11346 24373 194975 160132 136194 203040 200983 136252 75612 -23469 -44628 46364 64969 63023
11334 63023 -20877 -54119 -7002 -61949 -36480 -53668 -50965 2253 67882 198929 236720 102010
11322 102010 -62843 -163074 -218601 -149941 -46763 -39279 -44741 85395 252905 278121 257063
11311 257063 284515 308768 308953 385324 323429 140297 27601 -27962 -45279 -137047 -189709
11300 -189709 135732 239591 119128 80942 54546 57670 -8532 10446 18535 74844 51823
$$ packed form
11379e3396J33226k4540q8085Q2004K09657q3465j34881P285M307q1195p9749
11368a08832J34954K5351j8024k3811K9393M3687J5009o8918o2875N7189M119
11357B7242L0571K3932J02184j25494r1497P4781K5638j4619J7824j15380O9191
11346B4373J70602l4843k3938O6846k057o4731o0640r9081k1159R0992J8605j946
11334F3023q3900l3242M7117n4947K5469j7188K703N3218O5629J31047L7791j34710
11322A02010j64853j00231n5527O8660J03178P484n462J30136J67510K5216k1058
11311B57063K7452K4253J85P6371o1895j83132j12696n5563j7317r1768n2662
11300a89709L25441J03859j20463l8186k6396L124o6202J8978Q089N6309k3021
$$ plain form
11289 51823 92475 20234 -31134 -24498 931 -44724 -164606 -133141 -89836 91662 147021
11278 147021 124577 95425 120644 143065 136430 53877 22149 -38568 -47304 -84366 -108002 -51911
11266 -51911 -100793 -169684 -192342 -162624 -84746 114471 107731 56165 -3733 -23584 22172 69787
11254 69787 15546 15827 -796 -69112 90369 109795 87913 77220 88293 33080 -61584 -103486
11242 -103486 -47569 77789 71822 39323 36324 -28146 -48907 53905 57592 36941 -159840
11231 -159840 -149914 -45528 -142326 -188031 -206800 -154455 -43110 50200 91055 23920 -142995
11220 -142995 -90476 -44078 31885 99718 122969 123373 202206 193370 110651 165608 164935 126397
11208 126397 106449 38973 -79610 -89290 -192361 -165106 -40999 -98409 -100343 -69509 -116201
$$ packed form
11289E1823M0652p2241n1368O636K5429m5655j19882L1465M3305J81498N5359
11278A47021k2444k9152K5219K2421o635q2553l1728o0717q736l7062k3636N6091
11266e1911m8882o8891k2658K9718P7878J99217o740n1566n9898j9851M5756M7615
11254F9787n4241K81j6623o8316J59481J9426k1882j0693J1073n5213r4664m1902
11242a03486N5917J25358n967l2499k999o4470k0761J02812L687k0651j96781
11231a59840R926J04386r6798m5705j8769N2345J11345R3310M0855o7135j66915
11220a42995N2519M6398P5963O7833K3251M04P8833q836q2719N4957o73l8538
11208A26397j9948o7476j18583r680j03071K7255J24107n7410j934L0834m6692
$$ plain form
11197 -116201 -204696 -268449 -217942 -74982 34364 -48528 -93134 -28492 6872 -778 33003
11186 33003 -124367 -140315 -91347 -126943 -40479 -38402 -40172 -10441 6469 -36443 25853 63117
11174 63117 66777 79953 136507 121715 80654 -53339 -94806 -100135 -141048 -36725 87978
11163 87978 178985 222854 84668 640 18511 19805 -12237 29470 32754 -4710 -68089 -42211
11151 -42211 -45024 -73325 -54053 70130 154665 84838 -577 9875 -9219 22721 19647 -63814
11139 -63814 -88785 -11047 78419 126109 226503 82706 -58786 -59948 -9784 36735 150646
11128 150646 181838 76220 -1275 -97721 -132920 -45930 3753 59439 110006 86352 77029
11117 77029 -40763 -42000 78455 162513 14561 -36054 1233 -160306 -163578 -125632 -132334
$$ packed form
11197a16201q8495o3753N0507J42960J09346q2892m4606O4642L5364p650L3781
11186C3003j57370j5948M8968l5596Q6464K077j770K9731J6910m2912O2296L7264
11174F3117L660J3176N6554j4792m1061j33993m1467n329m0913J04323J24703
11163H7978R1007M3869j38186q4028J7871J294l2042M1707L284l7464o3379K5878
11151d2211k813k8301J9272J24183Q4535o9827q5415J0452j9094L1940l074q3461
11139f3814k4971P7738Q9466M7690J00394j43797j41492j162N0164M6519J13911
11128A50646L1192j05618p7495r6446l5199Q6990M9683N5686N0567k3654r323
11117G7029j17792j237J20455Q4058j47952n0615L7287j61539l272L7946o702
$$ plain form
11106 -132334 -172381 -117742 -146637 -124624 -122170 -77668 -70665 -25769 17493 -14242 13984 -30747
11094 -30747 -79144 -73844 -80091 -119066 65308 97302 13187 -13317 14295 12232 47878 -146638
11082 -146638 -230955 -297026 -259066 -217960 -71951 63657 131554 -6051 -166956 -188322 -172405
11071 -172405 -126157 6861 64066 17198 -47405 -74655 -108593 -28198 54526 66531 52123
11060 52123 23813 32934 3821 -123722 -234734 -130873 1977 36333 -3049 -14380 22440
11049 22440 80789 84281 3551 -77456 51496 209549 256427 252912 285995 411236 491156
11038 491156 475564 488503 524578 462755 612120 605542 586688 613439 666324 607143 669498
11027 669498 715469 801764 866243 904909 981166 1007305 1057947 958946 803101 671975 585772
$$ packed form
11106a32334m0047N4639k8895K2013K454M4502P003M4896M3262l1735K8226m4731
11094c0747m8397N300o247l8975J84374L1994q4115k6504K7612k063L5646j94516
11082a46638q4317o6071L7960M1106J46009J35608O7897j37605j60905k1366J5917
11071a72405M6248J33018N7205m6868o4603k7250l3938Q0395Q2724J2005j4408
11060E2123k8310R121k9113j27543j11012J03861J32850L4356l9382j1331L6820
11049B2440N8349L492q0730q1007J28952J58053M6878l515L3083J25241P9920
11038D91156j5592J2939L6075o1823J49365o578j8854K6751N2885n9181O2355
11027F69498M5971Q6295O4479L8666P6257K6139N0642r9001j55845j31126q6203
$$ plain form
11016 585772 528074 531833 559205 564449 580419 664637 734333 781541 744461 666683 423626 364911
11004 364911 513426 465047 541600 591131 532594 381564 284521 198694 288657 293188 270471
10993 270471 266930 265408 314223 318850 224134 184141 150427 271080 369083 270935 118881 53494
10981 53494 83771 133146 164570 162169 67135 39692 71016 208260 265949 285533 367025 353948
10969 353948 157642 -77330 -1823 95097 124350 136588 152045 45498 -31311 10575 76498
10958 76498 91278 112147 65359 -58529 35501 65672 4598 58219 48839 27112 172866
10947 172866 175574 183898 175331 65146 238535 382692 312131 209269 219461 210474 184801
10936 184801 50249 83257 182767 135154 22617 65600 37520 -54932 29506 66319 16917
$$ packed form
11016E85772n7698L759K7372N244J5970Q4218O9696M7208l7080p7778k43057n8715
11004C64911J48515m8379P6553M9531n8537j51030r7043q5827Q9963M531k2717
10993B70471l541j522M8815M627r4716l9993l3714J20653R8003r8148j52054o5387
10981E3494L0277M9375L1424k401r5034k7443L1324J37244N7689J9584Q1492j3077
10969C53948j96306k34972P5507R6920K9253J2238J5457j06547p6809M1886O5923
10958G6498J4780K0869m6788j23888R4030L0171o1074N3621r380k1727J45754
10947A72866K708Q324q567j10185J73389J44157p0561j02862J0192q987k5673
10936A84801j34552L3008R9510m7613j12537M2983k8080r2452Q4438L6813m9402
$$ plain form
10925 16917 -59593 -52648 -106259 3432 51668 59666 40155 93677 68320 40136 11980 86641
10913 86641 214038 224073 171899 109864 91120 121434 51740 -136143 -194078 -211892 -261976
10902 -261976 -47286 70029 151239 157248 230406 334091 363154 195761 78958 100719 130705
10891 130705 101710 35191 6387 42068 57227 -49712 -26825 -15510 -33074 -77989 -40005
10880 -40005 -27114 -6315 -60052 29160 -36197 70074 167251 234508 197192 70358 57967
10869 57967 31570 68440 197623 196995 77573 -30221 -99168 -183643 -118534 -53048 -71203
10858 -71203 68841 138562 163483 158444 115034 36002 91919 143661 161303 172885 141576 156282
10846 156282 69852 22903 45581 79572 243935 290172 202109 169999 256771 254356 226143
$$ packed form
10925A6917p6510O945n3611J09691M8236P998j9511N3522k5357k8184k8156P4661
10913H6641J27397J0035n2174o2035j8744L0314o9694j87883n7935j7814n0084
10902b61976K14690J17315Q1210O009P3158J03685K9063j67393j16803K1761K9986
10891A30705k8995o6519k8804L5681J5159j06939K2887J1315j7564m4915L7984
10880d0005J2891K0799n3737Q9212o5357J06271R7177O7257l7316j26834j2391
10869E7967k6397L6870J29183o28j19422j07794o8947q4475O5109O5486j8155
10858g1203J40044O9721K4921n039m3410p9032N5917N1742J7642J1582l1309J4706
10846A56282q6430m6949K2678L3991J64363M6237q8063l2110Q6772k415k8213
$$ plain form
10835 226143 214157 324162 311235 297932 251407 203003 174067 119370 205315 243558 226025
10824 226025 318443 374952 465738 410845 276743 93104 49142 43739 118560 241035 329133
10813 329133 303039 298723 316014 319457 143456 133374 145595 181680 127651 131385 176191 209902
10801 209902 125527 10953 27976 28747 128360 254104 192433 92881 57415 115199 136974
10790 136974 127776 212837 129814 -80982 -158296 46161 129768 59410 30416 166043 210892
10779 210892 173747 29843 -6343 34648 80532 105216 89070 127393 -3092 -88527 -12397
10768 -12397 35707 43705 18538 -91082 -122088 -198615 -236666 -69399 -25430 43990 134030
10757 134030 177108 234173 309375 227212 210732 268254 272753 274833 256252 174704 17344 -8811
$$ packed form
10835B26143j1986J10005j2927j3303m6525m8404k8936n4697Q5945L8243j7533
10824B26025R2418N6509R0786n4893j34102j83639m3962n403P4821J22475Q8098
10813C29133k6094m316J7291L443j76001j0082J2221L6085n4029L734M4806L3711
10801B09902q4375j14574J7023P71R9613J25744o1671r9552l5466N7784K1775
10790A36974r198Q5061q3023k10796p7314K04457Q3607p0358k8994J35627M4849
10779B10892l7145j43904l6186M0991M5884K4684j6146L8323j30485q5435P6130
10768a2397M8104P998k5167j09620l1006p6527l8051J67267M3969O9420R0040
10757A34030M3078N7065P5202q2163j6480N7522M499K080j8581q1548j57360k6155
$$ plain form
10745 -8811 5493 73628 164989 236937 198470 265577 252715 285708 328723 228070 195613 301457
10733 301457 491268 603310 566800 374383 189453 203702 245805 276255 307209 402597 357948
10722 357948 391180 461534 443916 386717 390808 379122 303288 388464 403181 303347 361319 527258
10710 527258 572073 545356 494515 432075 472981 441281 377505 352092 318785 387284 493425
10699 493425 531495 661106 766020 761511 797109 808816 768062 634079 506241 527871 529663
10688 529663 524239 538697 532176 574894 821390 946370 1101352 1222639 1366506 1455546 1460754
10677 1460754 1666468 1897306 1976819 2110738 2224843 2313071 2470232 2481638 2244960 2216654
10667 2216654 2252790 2131380 2002382 1781939 1542870 1380599 1429114 1492856 1461848 1523656
$$ packed form
10745h811J4304O8135R1361P1948l8467O7107j2862L2993M3015j00653l2457J05844
10733C01457J89811J12042l6510j92417j84930J4249M2103L0450L0954R5388m4649
10722C57948L3232P0354j7618n7199M091j1686p5834Q5176J4717r9834N7972J65939
10710E27258M4815k6717n0841o2440M0906l1700o3776k5413l3307O8499J06141
10699D93425L8070J29611J04914m509L5598J1707m0754j33983j27838K1630J792
10688E29663n424J4458o521M2718K46496J24980J54982J21287J43867Q9040N208
10677A460754K05714K30838P9513J33919J14105Q8228J57161J1406k36678k8306
10667B216654L6136j21410j28998k20443k39069j62271M8515O3742l1008O1808
$$ plain form
10657 1523656 1629606 1548205 1614432 1962776 2085509 2011381 1781051 1738248 1656908 1686763
10647 1686763 1615648 1590527 1742700 1757493 1818207 1947072 2054953 2129965 2260178 2516394
10637 2516394 2798770 3168387 3430848 3634566 3995777 4389813 4847830 5272189 5801292
10628 5801292 6365032 7197331 8459308 10021776 12146432 15132308 18980422 23579928
10620 23579928 28580748 33542946 37989334 42351244 46540358 50233691 52919173 53959885
10612 53959885 54461201 56322963 60835134 67751381 75787133 83355276 90136667 96937288
10604 96937288 103788671 109315304 111111369 108584869 104296409 102403618 105286668 112200548
10596 112200548 120805375 128787396 135791552 142483511 148572286 151609557 148325047 138071063
$$ packed form
10657A523656J05950q1401O6227L48344J22733p4128k30330m2803q1340K9855
10647A686763p1115k5121J52173J4793O0714J28865J07881P5012J30213K56216
10637B516394K82376L69617K62461K03718L61211L94036M58017M24359N29103
10628E801292N63740Q32299J261977J562468K124656K985876L848114M599506
10620B3579928N000820M962198M446388M361910M189114L693333K685482J040712
10612E3959885N01316J861762M512171O916247Q035752P568143O781391O800621
10604I6937288O851383N526633J796065k526500m288460j892791K883050O913880
10596A12200548Q604827P982021P004156O691959O088775L037271l284510j0253984
$$ plain form
10588 138071063 125043112 114768326 109559285 108697538 110045559 111633267 113171573 114762207
10580 114762207 115866439 114691387 109206165 99264427 87909858 78617194 72687437 69371304
10572 69371304 67500532 66192125 65122764 64138044 62632187 59887722 55478805 49328252
10564 49328252 42834866 37104464 32355349 28792444 26097593 24081751 22488898 21146038
10556 21146038 20049024 19077672 18069337 17088973 16186551 15509469 15029672 14459080 13889704
10547 13889704 13317207 12838137 12279982 11716812 11313488 10959744 10644924 10300179 10015436
10538 10015436 9711741 9503658 9213545 8951948 8691018 8497063 8428243 8169901 7916494
10529 7916494 7676369 7472443 7232626 7067237 6964912 6744710 6515257 6283291 6095769
$$ packed form
10588A38071063j3027951j0274786n209041q61747J348021J587708J538306J590634
10580A14762207J104232j175052n485222r941738j1354569r292664n929757l316133
10572F9371304j870772j308407j069361r84720j505857k744465m408917o150553
10564D9328252o493386n730402m749115l562905k694851k015842j592853j342860
10556B1146038j097014r71352j008335r80364r02422o77082m79797n70592n69376
10547A3889704n72497m79070n58155n63170m03324l53744l14820l44745k84743
10538A0015436l03695k08083k90113k61597k60930j93955o8820k58342k53407
10529G916494k40125k03926k39817j65389j02325k20202k29453k31966j87522
$$ plain form
10520 6095769 5892015 5563754 5433473 5486010 5415748 5187009 5020679 4833210 4730121 4643087
10510 4643087 4490682 4315472 4154174 3989459 3921329 3923584 3787878 3787700 3799737 3803035 3697730
10499 3697730 3650544 3733894 3701858 3472328 3226123 3133720 3010285 2904818 2889198 2838933
10489 2838933 2691331 2635801 2643254 2769038 2725050 2555159 2426235 2336633 2376149 2354690 2238303
10478 2238303 2276356 2261084 2254575 2227364 2022113 1916414 1854780 1866247 1775255 1672610 1719558
10467 1719558 1721418 1619463 1558813 1559433 1412590 1556528 1602353 1505478 1546411 1522075 1515538
10456 1515538 1616611 1682035 1616370 1484519 1432086 1435264 1391463 1248984 1336421 1380335 1323274
10445 1323274 1355651 1362265 1349290 1500484 1555239 1454041 1233375 1050792 1033946 1039080 1065772
$$ packed form
10520F095769k03754l28261j30281N2537p0262k28739j66330j87469j03089q7034
10510D643087j52405j75210j61298j64715o8130K255j35706j78J2037L298j05305
10499C697730m7186Q3350l2036k29530k46205r2403j23435j05467j5620n0265
10489B838933j47602n5530P453J25784m3988j69891j28924q9602L9516k1459j16387
10478B238303L8053j5272o509k7211k05251j05699o1634J1467r0992j02645M6948
10467A719558J860j01955o0650O20j46843J43938M5825r6875M0933k4336o537
10456A515538J01073O5424o5665j31851n2433L178m3801j42479Q7437M3914n7061
10445A323274L2377O614j2975J51194N4755j01198k20666j82583j6846N134K6692
$$ plain form
10434 1065772 1066493 1118970 1062690 950397 959820 1060615 1092061 1084047 1175224 1139700 1145638 1173834
10422 1173834 1177323 1121108 1034879 942322 849871 762102 829099 986504 1059049 1208519 1198563
10411 1198563 1184530 1222801 1381563 1416967 1385809 1435056 1498941 1470200 1393199 1427057 1526159
10400 1526159 1529915 1495063 1507754 1342453 1254948 1274847 1286864 1336536 1263330 1254791 1150995
10389 1150995 1152881 1248616 1288485 1257416 1234166 1172853 1240947 1344944 1347508 1378273 1486061
10378 1486061 1587069 1529431 1489250 1530798 1409193 1342681 1373657 1428044 1492025 1512766 1534761
10367 1534761 1515206 1570331 1601074 1572848 1655824 1744762 1823475 1805786 1725370 1801429 1921888
10356 1921888 1888937 1852238 1929729 2077650 2197593 2205460 2129508 2208259 2292178 2259958 2301852
$$ packed form
10434A065772P21N2477n6280j12293R423J00795L1446q014R1177l5524N938K8196
10422A173834L489n6215q6229r2557r2451q7769O6997J57405P2545J49470r956
10411A198563j4033L8271J58762L5404l1158M9247O3885k8741p7001L3858R9102
10400A526159L756l4852J2691j65301q7505J9899J2017M9672p3206q539j03796
10389A150995J886R5735L9869l1069k3250o1313O8094J03997K564L0765J07788
10378A486061J01008n7638m0181M1548j21605o6512L0976N4387O3981K0741K1995
10367A534761j9555N5125L0743k8226Q2976Q8938P8713j7689q0416P6059J20459
10356A921888l2951l6699P7491J47921J19943P867p5952P8751Q3919l2220M1894
$$ plain form
10345 2301852 2381411 2378982 2397283 2438583 2435030 2514121 2662992 2781942 3003632 3162383 3211530
10334 3211530 3302288 3422525 3585448 3700715 3867617 4049394 4171487 4356873 4506161 4669887
10324 4669887 4851462 5131332 5445709 5651417 5857851 6038121 6289646 6469186 6800998
10315 6800998 7166026 7584522 8031883 8437227 8919226 9400663 9912462 10586487 11332281
10306 11332281 12102152 13004058 14050043 15352053 16768838 18384872 20102769 21910352
10298 21910352 24103007 26497791 29191465 32283293 35847301 39927442 45062298 51315667
10290 51315667 58799900 67950049 79631894 94170158 111713703 132338555 155998459
10283 155998459 182738305 211951863 241696117 270105745 295928455 318071314 334776173
$$ packed form
10345B301852P9559k429J8301M1300l553P9091J48871J18950K21690J58751M9147
10334C211530R0758J20237J62923J15267J66902J81777J22093J85386J49288J63726
10324D669887J81575K79870L14377K05708K06434J80270K51525J79540L31812
10315F800998L65028M18496M47361M05344M81999M81437N11799O74025P45794
10306A1332281P69871R01906J045985J302010J416785J616034J717897J807583
10298B1910352K192655K394784K693674L091828L564008M080141N134856O253369
10290E1315667P484233R150149J1681845J4538264J7543545K0624852K3659904
10283A55998459K6739846K9213558K9744254K8409628K5822710K2142859J6704859
$$ plain form
10276 334776173 344160272 344749865 337010004 322897322 303625983 279286601 251172087
10269 251172087 222477929 195601978 171100106 148921496 129785317 114136020 101666730
10262 101666730 91755379 83799241 77212773 71707754 67019495 62851174 59124439 55855484
10254 55855484 52871336 49971904 47315035 44922974 42644230 40477840 38380481 36578764
10246 36578764 34927360 33352553 31938659 30599823 29437786 28380228 27568458 26642149
10238 26642149 25716785 24888273 24245540 23648626 22997740 22481205 22104077 21679870 21160721
10229 21160721 20819210 20503656 20379576 20250636 19984150 19909111 20216595 20595661 21048532
10220 21048532 21541942 22149847 22887395 23786391 24931251 26501240 28520769 31050910 34657451
$$ packed form
10276C34776173R384099N89593p739861j4112682j9271339k4339382k8114514
10269B51172087k8694158k6875951k4501872k2178610j9136179j5649297j2469290
10262A01666730r911351p956138o586468n505019m688259m168321l726735l268955
10254E5855484k984148k899432k656869k392061k278744k166390k097359j801717
10246C6578764j651404j574807j413894j338836j162037j057558q11770r26309
10238B6642149r25364q28512o42733n96914o50886n16535l77128m24207n19149
10229B1160721l41511l15554j24080j28940k66486p5039L07484L79066M52871
10220B1048532M93410O07905P37548Q98996J144860J569989K019529K530141L606541
$$ plain form
10211 34657451 39606607 46360001 55116145 65713301 78494466 94131180 112275454
10204 112275454 131125961 148732033 165163051 180352105 193031038 200619516 201260695
10197 201260695 195807596 187315317 176071671 160693428 141443979 122242914 105494177
10190 105494177 90638472 77072157 65517866 56593005 50005147 45174224 41463276
10183 41463276 38483801 36143368 34146150 32373863 30677153 28985524 27652223 26394749
10175 26394749 25041753 23847697 22710134 21690925 20684925 19806482 18908047 18207968
10167 18207968 17515642 16853742 16291117 15682826 15087987 14733066 14435282 14033330 13548059
10158 13548059 13210190 12926165 12548237 12063997 11690775 11413765 10941528 10573036 10282627
$$ packed form
10211C4657451M949156O753394Q756144J0597156J2781165J5636714J8144274
10204A12275454J8850507J7606072J6431018J5189054J2678933P588478O41179
10197B01260695n453099q492279j1243646j5378243j9249449j9201065j6748737
10190A05494177j4855705j3566315j1554291q924861o587858m830923l710948
10183D1463276k979475k340433j997218j772287j696710j691629j333301j257474
10175B6394749j352996j194056j137563j019209j006000q78443q98435p00079
10167A8207968o92326o61900n62625o08291n94839l54921k97784m01952m85271
10158A3548059l37869k84025l77928m84240l73222k77010m72237l68492k90409
$$ plain form
10149 10282627 10009990 9706733 9453220 9285521 9013466 8783309 8482166 8138843 7980035
10140 7980035 7727672 7496172 7278035 6966372 6778509 6697664 6515963 6271092 6142280 6003254
10130 6003254 5825052 5663690 5504324 5344838 5261782 4978727 4802136 4632521 4411298 4200990
10120 4200990 4049675 4136070 4136955 3995738 3908609 3852285 3759951 3684995 3527824 3365380 3261964
10109 3261964 3359872 3292547 3145265 3059885 2970519 3057836 2906525 2659351 2611052 2586602 2467483
10098 2467483 2265482 2195796 2211533 2249153 2208778 2222923 2183589 2180482 2179223 2165195 2102060
10087 2102060 2086724 2105806 1966807 1955732 2009665 1930848 1976569 2111285 2041315 1881695 1821200
10076 1821200 1816022 1798459 1839872 1883790 1754558 1626261 1543716 1518164 1614325 1595656 1525364
$$ packed form
10149A0282627k72637l03257k53513j67699k72055k30157l01143l43323j58808
10140G980035k52363k31500k18137l11663j87863q0845j81701k44871j28812j39026
10130F003254j78202j61362j59366j59486q3056k83055j76591j69615k21223k10308
10120D200990j51315Q6395Q85j41217q7129n6324r2334p4956j57171j62444j03416
10109C261964R7908o7325j47282q5380q9366Q7317j51311k47174m8299k4450j19119
10098B467483k02001o9686J5737L7620m0375J4145l9334l107j259j4028o3135
10087B102060j5336J9082j38999j1075N3933p8817M5721J34716o9970j59620o0495
10076A821200n178j7563M1413M3918j29232j28297q2545k5552R6161j8669p0292
$$ plain form
10065 1525364 1436179 1359702 1305114 1339485 1325236 1266043 1296646 1278124 1099028 1017518 1042712
10054 1042712 1075925 1113169 1175221 1206454 1116815 947848 810145 801798 898302 977053 981658
10043 981658 996516 974708 894371 743506 754169 769372 718157 754523 791810 908088 966139
10032 966139 861251 863934 922111 925285 879097 781676 901628 971476 924915 851605 821957
10021 821957 867912 884824 745430 799588 796234 778925 723369 643611 700176 734124 676763
10010 676763 657728 705079 789775 851799 806286 886973 904791 841569 800935 657478 574241
9999 574241 578575 567724 537715 540444 580800 574914 552895 476654 598749 685795 633900 536512
9987 536512 575772 676652 724917 592625 498540 450795 546949 577256 535163 419844 315233
$$ packed form
10065A525364q9185p6477n4588L4371j4249n9193L0603j8522j79096q1510K5194
10054A042712L3213L7244O2052L1233q9639j68967j37703q347R6504P8751M605
10043I81658J4858k1808q0337j50865J0663J5203n1215L6366L7287J16278N8051
10032I66139j04888K683N8177L174m6188r7421J19952O9848m6561p3310k9648
10021H21957M5955J6912j39394N4158l354j7309n5556p9758N6565L3948n7361
10010F76763j9035M7351Q4696O2024m5513Q0687J7818o3222m0634j43457q3237
9999E74241M334j0851l0009K729M0356n886k2019p6241J22095Q7046n1895r7388
9987E36512L9260J00880M8265j32292r4085m7745R6154L0307m2093j15319j04611
$$ plain form
9976 315233 284030 411420 502633 643052 648915 655958 614950 648974 638744 561704 468286 445173
9964 445173 457819 397857 342137 458121 436671 530995 561479 526755 482561 484840 463183 414556
9952 414556 377759 287406 232675 205894 284338 259413 250710 228528 150909 88264 156138 254538
9940 254538 275424 256297 276747 281400 253698 265525 334174 328263 298368 193180 234759 279889
9928 279889 297704 350727 288589 221792 143689 42143 88004 148930 328509 286593 245292
9917 245292 189589 239357 289170 276290 264384 177619 196351 305262 290790 316686 297802
9906 297802 326450 322095 412124 442834 375013 216703 204967 395845 477467 463837 339671
9895 339671 253030 263560 347606 413232 402773 568284 576474 653757 786415 866594 904839
$$ packed form
9976C15233l1203J27390R1213J40419N863P043m1008L4024j0230p7040r3418k3113
9964D45173J2646n9962n5720J15984k1450R4324L0484l4724m4194K279k1657m8627
9952D14556l6797r0353n4731k6781P8444k4925q703k2182p7619o2645O7874R8400
9940B54538K0886j9127K0450M653k7702J1827O8649n911k9895j05188M1579M5130
9928B79889J7815N3023o2138o6797p8103j01546M5861O0926J79579m1916m1301
9917B45292n5703M9768M9813j2880j1906q6765J8732J08911j4472K5896j8884
9906B97802K8648m355R0029L0710o7821j58310j1736J90878Q1622j3630j24166
9895C39671q6641J0530Q4046O5626j0459J65511Q190P7283J32658Q0179L8245
$$ plain form
9884 904839 916571 988255 1116534 1411618 1516490 1563021 1597173 1713018 1859613 1867192 1873206
9873 1873206 1749179 1557665 1616025 1626057 1470649 1211633 1166937 1061290 919866 728591
9863 728591 760485 795771 715347 642831 580285 515292 509898 584787 546498 546903 511918 421479
9851 421479 375877 526497 618222 606151 652849 638704 550974 529983 507214 444023 469754
9840 469754 360174 275272 248993 160540 180611 68540 149529 284318 385936 390121 222995
9829 222995 80518 105846 134434 137601 143726 203496 234738 250953 280238 273809 416915 458683
9817 458683 335030 184499 235575 325440 385966 435193 493952 432036 433641 373150 414639
9806 414639 530828 659490 830746 851772 886486 1030543 1082595 1042104 970415 945167 983544
$$ packed form
9884I04839J1732P1684J28279K95084J04872M6531L4152J15845J46595P579O014
9873A873206j24027j91514N8360J0032j55408k59016m4696j05647j41424j91275
9863G28591L1894L5286q0424p2516o2546o4993n394P4889l8289M05l4985r0439
9851D21479m5602J50620R1725j2071M6698j4145q7730k0991k2769o3191K5731
9840D69754j09580q4902k6279q8453K0071j12071Q0989J34789J01618M185j67126
9829B22995j42477K5328K8588L167O125N9770L1242J6215K9285o429J43106M1768
9817D58683j23653j50531N1076Q9865O0526M9227N8759o1916J605o0491M1489
9806D14639J16189J28662J71256K1026L4714J44057N2052m0491p1689k5248L8377
$$ plain form
9795 983544 1003766 929424 893540 838298 738774 609069 565799 514377 424006 310947 235486
9784 235486 305480 198904 228452 381041 344058 240617 240713 336476 319508 290131 287536 338063
9772 338063 282779 284375 247108 202610 192980 159435 166671 49043 56673 114661 110105 213139
9760 213139 254475 274636 244484 147758 206210 277685 268140 311353 313503 331118 270740 201741
9748 201741 143652 49752 6140 -41111 -14055 -2389 14952 69453 187969 208241 141302
9737 141302 24089 10540 85390 108937 84945 95199 69244 67870 82065 70217 52455 28382
9725 28382 -76715 -87261 60658 158526 174455 48108 140346 245582 396152 410920 353055
9714 353055 338990 276095 114084 45583 23020 85882 48896 -74997 -63682 -175508 -198275
$$ packed form
9795I83544K0222p4342l5884n5242r9524j29705m3270n1422r0371j13059p5461
9784B35486O9994j06576K9548J52589l6983j03441R6R5763j6968k9377k595N0527
9772C38063n5284J596l7267m4498r630l3545P236j17628P630N7988m556J03034
9760B13139M1336K0161l0152r6726N8452P1475r545M3213K150J7615o0378o8999
9748B01741n8089r3900m3612m7251K7056J1666J7341N4501J18516K0272o6939
9737A41302j17213j3549P4850K3547k3992J0254k5955j374J4195j1848j7762k4073
9725B8382j05097j0546J47919R7868J5929j26347R2238J05236J50570J4768n7865
9714C53055j4065o2895j62011o8501k2563O2862l6986j23893J1315j11826k2767
$$ plain form
9703 -198275 -196977 -135907 -88559 -19214 51134 88857 62053 132965 248516 143382 59172
9692 59172 116147 197059 169467 268819 232033 170640 130810 90569 44392 52027 108039 218810
9680 218810 156959 56230 95837 84338 194221 188946 66410 106090 265245 326893 266810
9669 266810 203673 222993 157300 202116 134498 108847 125207 234286 263754 234709 233156 230582
9657 230582 102720 18223 84827 283113 362665 365359 435957 294119 161437 124857 187302
9646 187302 196721 190606 108632 16975 -22719 31588 -67472 -72910 -12665 -32930 -5390 50434
9634 50434 -31188 -112139 -120135 -137010 -95118 -127295 -168658 -164043 -130259 -50906 72291 215242
9622 215242 309481 259246 229821 183483 122802 146869 117006 137336 90147 -88292 -98857
$$ packed form
9703a98275J298O1070M7348O9345P0348L7723k6804P0912J15551j05134q4210
9692E9172N6975Q0912k7592R9352l6786o1393l9830m0241m6177P635N6012J10771
9680B18810o1851j00729L9607j1499J09883n275j22536L9680J59155O1648o0083
9669B66810o3137J9320o5693M4816o7618k5651J6360J09079K9468k9045j553k574
9657B30582j27862q4497O6604J98286P9552K694P0598j41838j32682l6580O2445
9646A87302R419o115q1974r1657l9694N4307r9060n438O0245k0265K7540N5824
9634E0434q1622q0951p996j6875M1892l2177m1363M615L3784P9353J23197J42951
9622B15242R4239n0235k9425m6338o0681K4067k9863K0330m7189j78439j0565
$$ plain form
9611 -98857 -11322 38513 93439 67308 127463 152125 188491 92665 71615 41128 29096 53811
9599 53811 149349 150178 186792 50406 85340 68000 41265 -12682 -30922 61170 207023 134697
9587 134697 70115 123039 147622 46562 -77745 -89216 -108672 -121508 -156343 -104484 -19254
9576 -19254 189304 270523 162033 46237 62695 -26054 -161694 -159470 -143329 -73085 -12865
9565 -12865 16520 77263 82984 51471 -3093 -77646 -4384 27473 40435 81471 45848 75016
9553 75016 151370 15526 -70280 -14442 56000 54227 16929 34701 12641 27771 -71568 -107090
9541 -107090 -103073 -122279 -173674 -180022 -156733 -78115 -73499 -44317 11658 132872 30349 -154266
9529 -154266 -115176 76614 17853 -52498 -10698 66953 3588 116710 159268 109723 -96910
$$ packed form
9611i8857Q7535M9835N4926k6131O0155K4662L6366r5826k1050l0487j2032K4715
9599E3811R5538Q29L6614j36386L4934j7340k6735n3947j8240R2092J45853p2326
9587A34697o4582N2924K4583j01060j24307j1471j9456j2836l4835N1859Q5230
9576a9254K08558Q1219j08490j15796J6458q8749j35640K224J6141P0244O0220
9565a2865K9385O0743N721l1513n4564p4553P3262L1857J2962M1036l5623K9168
9553G5016P6354j35844q5806N5838P0442j773l7298J7772k2060J5130r9339l5522
9541a07090M017j9206n1395o348K3289P8618M616K9182N5975J21214j02523j84615
9529a54266L9090J91790n8761p0351M1800P7651o3365J13122M2558m9545k06633
$$ plain form
9518 -96910 -57575 26867 -56136 -6172 -31854 -21873 -86254 -119038 -88134 -30631 15811 -72174
9506 -72174 -50828 46366 50631 114696 116835 12541 -67130 -48338 -29347 -127696 -210167 -95064
9494 -95064 55701 -5825 -64912 -70764 2344 82336 97203 128560 58119 122550 177231 191938
9482 191938 153343 88291 145825 118596 28565 -9035 12931 182782 307926 192208 96464
9471 96464 189705 182808 19644 -43566 -83987 -89034 -1745 29306 25456 85715 64875 -33872
9459 -33872 -40456 -27652 22184 19848 77078 90202 105158 111331 186089 163048 125800 34063
9447 34063 114936 155178 101471 118364 129123 46741 20282 -18052 -17917 33119 96615 130081
9435 130081 125690 231443 324847 270355 252422 251403 144371 24931 158561 174708 139511
$$ packed form
9518i6910L9335Q4442q3003M9964k5682R981o4381l2784L0904N7503M6442q7985
9506g2174K1346R7194M265O4065K139j04294p9671J8792J8991r8349q2471J15103
9494i5064J50765o1526n9087n852P3108P9992J4867L1357p0441O4431N4681J4707
9482A91938l8595o5052N7534k7229r0031l7600K1966J69851J25144j15718r5744
9471I6464R3241o897j63164o3210m0421n047Q7289L1051l850O0259k0840r8747
9459c3872o584J2804M9836k336N7230J3124J4956O173P4758k3041l7248r1737
9447C4063Q0873M0242n3707J6893J0759q2382k6459l8334J35N1036O3496L3466
9435A30081m391J05753R3404n4492j7933j019j07032j19440J33630J6147l5197
$$ plain form
9424 139511 127304 99747 65585 -46520 44496 231724 223843 215022 133957 13614 141830
9413 141830 181112 181720 185338 74915 1878 -44676 34955 149949 169854 104423 33591 -120719
9401 -120719 -228519 -272575 -195494 -193746 -119229 -13694 20960 63047 -20657 -98299 -20176
9390 -20176 12499 183073 159762 -43873 -26816 69453 24654 -84770 -55136 10285 -71835
9379 -71835 -36259 -43192 -30628 -82935 4359 86932 51031 -1107 -65375 -43026 52877 63988
9367 63988 -41966 -68687 -69588 22408 18031 41788 89998 164600 72218 -89031 -167032 -78946
9355 -78946 114566 157579 65704 -52038 -44729 20435 45484 81328 17666 -18836 21197 104972
9343 104972 144991 57239 -45412 -45730 -110130 -225243 -152885 -125089 -233764 -224833 -127335 -37710
$$ packed form
9424A39511j2207k7557l4162j12105R1016J87228p881q821q1065j20343J28216
9413A41830L9282O08L618j10423p3037m6554P9631J14994J9905o5431p0832j54310
9401a20719j07800m4056P7081J748P4517J05535L4654M2087q3704p7642P8123
9390b0176L2675J70574k3311k03635J7057R6269m4799j09424K9634O5421q2120
9379g1835L5576o933J2564n2307Q7294Q2573l5901n2138o4268K2349R5903J1111
9367F3988j05954k6721r01R1996m377K3757M8210P4602r2382j61249p8001Q8086
9355g8946J93512M3013r1875j17742P309O5164K5049L5844o3662l6502M0033Q3775
9343A04972M0019q7752j02651l18o4400j15113P2358K7796j08675Q931R7498Q9625
$$ plain form
9331 -37710 5706 -71667 -24135 -42668 -165586 -233063 -193378 -56737 -47702 -86969 -76582 76482
9319 76482 188371 125801 -32180 -72920 -14300 3953 -66421 -108979 -124874 -38773 36906
9308 36906 11 -113990 -243270 -185514 -50671 -2958 -174073 -125973 -37790 17514 119640
9297 119640 192801 148032 144204 159572 192046 338499 216780 203871 212375 110675 59299
9286 59299 49641 58972 152578 116738 -17472 -167755 -151968 -106185 -18598 76210 123816 72362
9274 72362 45128 68585 95693 101762 -6578 33291 73846 119374 46010 4367 -21843 -55574
9262 -55574 -61135 -5439 -11640 72676 121724 35245 50638 15493 -95257 -47902 -93866 -105992
9250 -105992 -24620 31222 188702 170467 49978 -67987 -156901 -132611 -116183 -87362 -82069
$$ packed form
9331c7710M3416p7373M7532j8533j22918o7477L9685J36641R035l9267J0387J53064
9319G6482J11889o2570j57981m0740N8620J8253p0374m2558j5895Q6101P5679
9308C6906l6895j14001j29280N7756J34843M7713j71115M8100Q8183N5304J02126
9297A19640P3161m4769l828J5368L2474J46453j21719j2909Q504j01700n1376
9286E9299r658R331R3606l5840j34210j50283J5787M5783Q7587R4808M7606n1454
9274G2362k7234K3457K7108O069j08340L9869M0555M5528p3364m1643k6210l3731
9262e5574n561N5696o201Q4316M9048q6479J5393l5145j10750M7355m5964j2126
9250a05992Q1372N5842J57480j8235j20489j17965q8914K4290J6428K8821N293
$$ plain form
9239 -82069 -10219 -93033 -159449 -70848 -66388 -68367 16645 -4568 -14633 26460 -635 -49847
9227 -49847 15711 90749 25003 -19449 -78482 -233689 -216576 -170011 -159933 -4339 55690
9216 55690 68090 7805 -126586 -272345 -322131 -89335 7643 117345 125349 5232 -143552
9205 -143552 -54628 8088 -107184 -150674 -25819 -4021 46918 11897 -4923 -8338 -24266
9194 -24266 -3932 -9499 -19294 -38929 -53066 -18182 -28660 -103405 -94108 -115227 -62800 -16136
9182 -16136 -10227 -21445 -24605 57971 18195 -15981 64317 136547 171877 167242 153696 78651
9170 78651 90256 99092 63087 -4361 -33009 -52200 -104704 40440 211899 109288 2567
9159 2567 38093 -13384 -166574 -332423 -267687 -240140 -250092 -194205 -215625 -209711 -46641 3338
$$ packed form
9239h2069P1850q2814o6416Q8601M460j979Q5012k1213j0065M1093k7095m9212
9227d9847O5558P5038o5746m4452n9033j55207J7113M6565J0078J55594O0029
9216E5690J2400o0285j34391j45759m9786K32796R6978J09702Q004j20117j48784
9205a43552Q8924O2716j15272m3490J24855K1798N0939l5021j6820l415j5928
9194b4266K0334n567r795j9635j4137L4884j0478p4745R297k1119N2427M6664
9182a6136N909j1218l160Q2576l9776l4176Q0298P2230L5330m635j3546p5045
9170G8651J1605Q836l6005o7448k8648j9191n2504J45144J71459j02611j06721
9159B567L5526n1477j53190j65849O4736K7547r952N5887k1420N914J63070M9979
$$ plain form
9147 3338 153355 173236 55940 -62126 -9217 -21185 30924 -10431 -90131 -169714 -151331
9136 -151331 -213254 -96689 120463 105089 77248 97135 90803 121875 210204 105679 84921
9125 84921 27010 -79621 -242434 -178759 -123080 5690 25152 97159 77077 79832 111611
9114 111611 61508 28906 -37113 1575 77089 47933 48995 135152 246994 108917 -63053
9103 -63053 -92656 -86418 -107789 -99554 -124321 -53597 58698 49848 -11305 -23209 -202 24698
9091 24698 47579 32892 194258 333463 279693 261592 142379 83405 13903 -29318 -132250
9080 -132250 -107488 -73881 -82046 -51170 -17701 -111264 44896 132625 41733 -30628 -20768 -52819
9068 -52819 -11632 -24497 -97533 -133181 -11576 64444 97389 69184 47210 46335 25169 35697
$$ packed form
9147C338J50017J9881j17296j18066N2909j1968N2109m1355p9700p9583J8383
9136a51331o1923J16565K17152j5374k7841J9887o332L1072Q8329j04525k0758
9125H4921n7911j06631j62813O3675N5679J28770J9462P2007k0082K755L1779
9114A11611n0103l2602o6019L8688P5514k9156J062Q6157J11842j38077j71970
9103f3053k9603O238k1371Q235k4767P0724J12295q850o1153j1904K3007K4900
9091B4698K2881j4687J61366J39205n3770j8101j19213n8974o9502m3221j02932
9080a32250K4762L3607q165L0876L3469r3563J56160Q7729r0892p2361R860l2051
9068e2819M1187j2865p3036l5648J21605P6020L2945k8205k1974q75k1166J0528
$$ plain form
9056 35697 -79333 -147058 -88389 70323 -31372 -37588 -94616 -87858 -70160 -33993 -35806 -45673
9044 -45673 -151705 -169056 -156534 -106153 -50838 -44996 -113321 -244163 -264978 -206220 -124563 36626
9032 36626 88158 99172 68587 75591 -16912 -88575 -134010 -138875 -150282 -117588 -24364 29137
9020 29137 57105 38937 -38382 39080 39852 126814 223806 93212 -89284 -7827 150589 138489
9008 138489 147776 73873 -5525 43995 -35900 -96857 -54940 -50206 -134084 -134754 -61602 26427
8996 26427 70843 44864 17989 86089 62135 31933 19375 93900 625 16511 3969 -1342
8984 -1342 156049 137330 45140 35538 110574 172720 201784 216572 133436 80184 119892 115924
8972 115924 5306 -59107 -62563 -64481 37344 -36878 -69154 -116721 -132124 -81222 56087
$$ packed form
9056C5697j15030o7725N8669J58712j01695o216n7028O758J7698L6167j813r867
9044d5673j06032j7351J2522N0381N5315N842o8325j30842k0815N8758Q1657J61189
9032C6626N1532J1014l0585P004r2503p1663m5435m865j1407L2694R3224N3501
9020B9137K7968j8168p7319P7462P72Q6962R6992j30594j82496Q1457J58416j2100
9008A38489R287p3903p9398M9520p9895o0957M1917M734q3878o70P3152Q8029
8996B6427M4416k5979k6875O8100k3954l0202j2558P4525r3275J5886j2542n311
8984a342J57391j8719r2190r602P5036O2146K9064J4788q3136n3252L9708l968
8972A15924j10618o4413l456j918J01825p4222l2276m7567j5403N0902J37309
$$ plain form
8961 56087 -30416 -125050 14150 21325 11119 15037 18115 13016 139588 288767 259927 216683
8949 216683 168027 136308 9570 31445 -27875 -182788 -248747 -238240 -220366 -177760 -76830
8938 -76830 99050 161010 146560 75891 19485 60960 -5195 -74972 -37737 -29785 -19935 63749
8926 63749 51440 -26139 -11172 25862 10056 92835 81891 7719 36921 -24665 -35047 -37721
8914 -37721 -80897 -143383 -149064 -207739 -318058 -192872 -111105 -49190 70522 141955 142622 201795
8902 201795 137663 113405 80529 68889 33442 25447 5372 40278 -46744 -17264 -61553 -26052
8890 -26052 64641 149983 86289 128445 34670 -8203 6501 -72320 -102307 -26424 50918 -37967
8878 -37967 -46081 -68902 -107765 -61401 17548 80256 23327 24596 71080 4183 -44544 80929
$$ packed form
8961E6087q6503r4634J39200P175j0206L918L078n099J26572J49179k8840m3244
8949B16683m8656l1719j26738K1875n9320j54913o5959J0507J7874M2606J00930
8938g6830J75880O1960j4450p0669n6406M1475o6155o9777L7235P952R850Q3684
8926F3749j2309p7579J4967L7034j5806Q2779j0944p4172K9202o1586j0382k674
8914c7721m3176o2486n681n8675j10319J25186Q1767O1915J19712P1433O67N9173
8902B01795o4132k4258l2876j1640l5447p995k0075L4906q7022K9480m4289L5501
8890b6052R0693Q5342o3694M2156r3775m2873J4704p8821k9987P5883P7342q8885
8878c7967q114k2821l8863M6364P8949O2708n6929J269M6484o6897m8727J25473
$$ plain form
8866 80929 53238 -44502 -138695 -153475 -237552 -250225 -287065 -158603 -45483 44155 109228
8855 109228 165007 129148 72483 69012 89754 89492 101675 146450 57651 56295 -75082 -99452
8843 -99452 -115779 -169465 -218551 -292146 -209382 -35374 121917 225244 -54248 -146735 -64716
8832 -64716 33840 4293 -44961 499 105108 12281 -50624 -193329 -261210 -238220 -238891 -299875
8820 -299875 -238565 -288502 -358778 -361711 -280654 -180953 -105390 -150404 -110157 -56221 -37118 -70740
8808 -70740 -65454 -43015 -38210 -101347 -174128 -132866 -62911 -100234 -86017 -3653 96906 111492
8796 111492 38113 -114571 -133278 -92452 -125193 -207278 -115072 -9245 -56665 -37624 -51107
8785 -51107 -49569 46723 16066 -154899 -168712 -150605 -134690 -23144 -16484 -18876 -176699 -206354
$$ packed form
8866H0929k7691r7740r4193j4780q4077j2673l6840J28462J13120Q9638O5073
8855A09228N5779l5859n6665l471K0742k62J2183M4775q8799j356j31377k4370
8843i9452j6327n3686m9086p3595Q2764J74008J57291J03327k79492r2487Q2019
8832f4716R8556k9547m9254M5460J04609r2827o2905j42705o7881K2990o71o0984
8820b99875O1310m9937p0276k933Q1057R9701P5563m5014M0247N3936J9103l3622
8808g0740N286K2439M805o3137p2781M1262O9955l7323J4217Q2364J00559J4586
8796A11492p3379j52684j8707M0826l2741q2085R2206J05827m7420J9041j3483
8785e1107J538R6292l0657j70965j3813J8107J5915J11546O660k392j57823k9655
$$ plain form
8773 -206354 -84482 -124546 -149228 -116556 27094 -52208 -93747 -103698 -25150 -4954 28465
8762 28465 -20086 -78239 -90788 -31715 2286 -79258 -77116 -59174 -68073 -61557 -81294 -164008
8750 -164008 -41133 50250 121096 284432 150304 -75806 -147520 -97218 -78840 -21361 -110077
8739 -110077 -155118 -25363 35061 82912 14576 -66901 -48440 -2529 90161 207630 234732
8728 234732 216858 142792 103571 18588 99032 184080 192225 23219 -85636 -110480 -37358
8717 -37358 17549 -8768 9455 -51262 -49595 -29329 -29538 -60130 -110556 -47346 2930 37912
8705 37912 118411 22936 53140 114555 111726 117749 38591 -134308 -252703 -186956 -1314 80576
8693 80576 101065 98867 11698 -12503 25073 -24963 -56507 -84008 -86899 -79207 -149673 -152372 -41298
$$ packed form
8773b06354J21872m0064k4682L2672J43650p9302m1539r951P8548K0196L3419
8762B8465m8551n8153j2549N9073L4001q1544K142J7942q899O516j9737q2714
8750a64008J22875R1383P0846J63336j34128k26110p1714N0302J8378N7479q8716
8739a10077m5041J29755O0424M7851o8336q1477J8461M5911R2690J17469K7102
8728B34732j7874p4066l9221q4983Q0444Q5048Q145j69006j08855k4844P3122
8717c7358N4907k6317J8223o0717J667K0266k09l0592n0426O3210N0276L4982
8705C7912Q0499r5475L0204O1415k829O023p9158j72899j18395O5747J85642Q1890
8693H0576K0489k198q7169k4201L7576n0036l1544k7501k891P692p0466k699J11074
$$ plain form
8680 -41298 -45029 -77062 49483 60308 -75324 -39577 134263 88806 20156 6437 -30743
8669 -30743 81810 105598 76938 44815 15507 49054 33040 103348 45018 -67135 -91557
8658 -91557 11111 50314 93313 77659 23579 -22198 -55553 -64930 -62114 4825 22343 -19910
8646 -19910 -47311 19750 -54068 -155022 -99362 -86173 -77057 -90753 63483 77464 154051 87034
8634 87034 77066 212954 212642 61557 37921 95611 74878 -47859 -67262 -47374 -947 147540
8622 147540 265333 155800 41228 -22031 -63298 -113674 -40725 48434 135261 134215 55089
8611 55089 63461 36633 -66205 121443 222793 170206 106190 63991 -8911 -59134 -103280
8600 -103280 -109374 -138294 -91193 32037 93265 80448 81871 8387 -13041 -37030 45540 -23495
$$ packed form
8680d1298l731l2033J26545J0825j35632L5747J73840m5457o8650j3719l7180
8669c0743J12553K3788k8660l2123k9308L3547j6014P0308n8330j12153k4422
8658i1557J02668L9203M2999j5654n4080m5777l3355r377K816O6939J7518m2253
8646a9910k7401O7061p3818j00954N5660J3189R116j3696J54236J3981P6587o7017
8634H7034r968J35888l12j51085k3636N7690k0733j22737j9403J9888M6427J48487
8622A47540J17793j09533j14572o3259m1267n0376P2949Q9159Q6827j046p9126
8611E5089Q372k6828j02838J87648J01350n2587o4016m2199p2902n0223m4146
8600a03280o094k8920M7101J23230O1228j2817J423p3484k1428k3989Q2570o9035
$$ plain form
8588 -23495 757 36659 33764 180616 259503 259468 286289 233678 339488 439532 310994 270252
8576 270252 242825 124621 71695 182498 280709 306714 224346 143318 178212 161220 132718
8565 132718 127700 27093 -2897 47244 185809 132013 27329 46767 22516 131293 168959
8554 168959 94174 47632 126870 161498 130299 60390 110859 26086 -109112 -119490 -260593
8543 -260593 -125270 94595 110040 198295 269697 187433 45872 -34121 27886 128753 135170
8532 135170 53031 40486 98767 57034 106004 72096 -33030 -91909 -74583 -5131 95255
8521 95255 92004 -14872 23035 32665 -47208 -28731 -12073 -45732 -125701 -55947 -33936 15284
8509 15284 47304 -45474 -96096 -96953 -22387 -13114 46645 -20634 -63202 -83966 29513 100292
$$ packed form
8588b3495K4252L5902k895J46852P8887l5K6821n2611J05810J00044j28538m0742
8576B70252k7427j18204n2926J10803R8211K6005q2368q1028L4894j6992k8502
8565A32718n018j00607k9990N0141J38565n3796j04684J9438k4251J08777L7666
8554A68959p4785m6542P9238L4628l1199o9909N0469q4773j35198j0378j41103
8543b60593J35323K19865J5445Q8255P1402q2264j41561p9993O2007J00867O417
8532A35170q2139j2545N8281m1733M8970l3908j05126n8879J7326O9452J00386
8521I5255l251j06876L7907R630p9873J8477J6658l3659p9969O9754K2011M9220
8509A5284L2020r2778n0622q57P4566R273N9759o7279m2568k0764J13479P0779
$$ plain form
8497 100292 -24908 -137775 -138931 -12930 1505 43666 145127 118448 62975 14073 -40592
8486 -40592 -138057 -87635 -41980 6786 16149 67757 182456 137734 154868 129778 -41452 -166568
8474 -166568 -117052 22191 28930 58240 -44282 -96333 -69631 -54686 -1898 70217 67231 -58804
8462 -58804 -117022 -146260 -124459 -84662 -63085 71102 165903 117919 120812 -37660 -96492 -107305
8450 -107305 -25678 -46939 9901 194434 166828 -11146 -84190 -45721 128585 206540 148082
8439 148082 115089 -15057 -49285 56789 165607 146478 93102 13174 -30630 -49153 -986
8428 -986 143320 175526 112168 151999 158476 245466 116880 -20029 -22248 36620 155393 234619
8416 234619 198256 80933 62483 106679 127377 156583 88774 31017 97703 88327 37590 58264
$$ packed form
8497A00292j25200j12867j156J26001J4435M2161J01461k6679n5473m8902n4665
8486d0592r7465N0422M5655M8766R363N1608J14699m4722J7134k5090j71230j25116
8474a66568M9516J39243O739K9310j02522n2051K6702J4945N2788P2115k986j26035
8462e8804n8218k9238K1801L9797K1577J34187R4801m7984K893j58472n8832j0813
8450a07305Q1627k1261N6840J84533k7606j77974p3044L8469J74306P7955n8458
8439A48082l2993j30146l4228J06074J08818j9129n3376p9928m3804j8523M8167
8428i86J44306L2206o3358L9831O477Q6990j28586j36909k219N8868J18773P9226
8416B34619l6363j17323j8450M4196K0698K9206o7809n7757O6686r376n0737K0674
$$ plain form
8404 58264 -17072 -22561 -15979 69068 29931 34861 169880 157644 105379 141937 115692 160149
8392 160149 186204 73649 34198 -42975 -137985 -88642 -57242 94358 196439 47415 31307
8381 31307 -33940 -144114 -68770 -63755 -67229 31665 130676 157904 221702 157530 199089 179624
8369 179624 120660 -33461 -75718 30760 44240 -43545 16590 69465 113042 -42735 -130134
8358 -130134 -7122 59989 10874 -77518 -61022 24076 -23369 -109319 35812 117453 132844
8347 132844 120639 46851 -4805 46213 29747 -30122 -57975 -47405 -86321 -121915 -97481 -111787
8335 -111787 -173420 -225174 -172095 -159250 -85439 -79583 29875 65223 81085 130399 36792 26044
8323 26044 89048 101236 50631 -26805 -71452 -128958 -116810 -21885 7898 93601 -3086 -69632
$$ packed form
8404E8264p5336n489O582Q5047l9137M930J35019j2236n2265L6558k6245M4457
8392A60149K6055j12555l9451p7173r5010M9343L1400J51600J02081j49024j6108
8381C1307o5247j10174P5344N015l474R8894R9011K7228O3798o4172M1559j9465
8369A79624n8964j54121m2257J06478J3480q7785O0135N2875M3577j55777q7399
8358a30134J23012O7111m9115q8392J6496Q5098m7445q5950J45131Q1641J5391
8347A32844j2205p3788n1656N1018j6466n9869k7853J0570l8916l5594K4434j4306
8335a11787o1633n1754N3079J2845P3811N856J09458L5348J5862M9314r3607j0748
8323B6044O3004J2188n0605p7436m4647n7506J2148R4925K9783Q5703r6687o6546
$$ plain form
8311 -69632 -63629 -97356 -163024 -153543 -172699 -107723 -22154 -24133 -19174 7531 -63873 72797
8299 72797 159147 110739 109636 61737 65303 111908 148146 87302 16776 -107635 -95473 38167
8287 38167 -28485 -102985 -102518 -128695 -117703 17576 70624 36681 66113 123395 83243 102550
8275 102550 81524 85341 73672 -2272 -12599 -155609 -138274 1093 107837 -8059 -11943
8264 -11943 70114 87468 20323 -61567 -117769 4394 102182 59027 -172415 -200383 -179607
8253 -179607 -91265 -3357 -3669 44803 56884 -45304 -29376 -71211 -153259 -242539 -262409 -150280
8241 -150280 -30959 20558 -27523 -90296 -96917 -17010 79047 70796 23701 -73653 -133722 -79785
8229 -79785 -73349 -82442 -60529 36749 132608 18665 -73939 5270 18611 -26703 -31839 -13440
$$ packed form
8311f9632O003l3727o5668R481j9156O4976Q5569j979M959K6705p1404J36670
8299G2797Q6350m8408j103m7899L566M6605L6238o0844p0526j24411J2162J33640
8287C8167o6652p4500M67k6177J0992J35279N3048l3943K9432N7282m0152J9307
8275A02550k1026L817j1669p5944j0327j43010J7335J39367J06744j15896l884
8264a1943Q2057J7354o7145q1890n6202J22163R7788m3155k31442k7968K0776
8253a79607Q8342Q7908l12M8472J2081j02188J5928m1835q2048q9280j9870J12129
8241a50280J19321N1517m8081o2773o621P9907R6057q251m7095r7354o0069N3937
8229g9785O436r093K1913R7278R5859j13943r2604P9209J3341m5314n136J8399
$$ plain form
8217 -13440 -13686 -18825 25731 82983 51152 -65575 -112464 -64110 -24218 -84564 -73297 24622
8205 24622 -49899 -130647 -126539 -122147 -72427 -112099 -42827 -78075 -83168 13309 102485 -17140
8193 -17140 19285 75479 38140 63784 72514 52888 127126 146347 119315 62916 60019 22231
8181 22231 26877 32605 65820 54286 63520 168209 182119 122612 32670 -88865 -223100 -321781
8169 -321781 -300003 -268970 -264310 -258390 -255774 -276573 -166337 -34106 1770 91455 -27398 -212221
8157 -212221 -164359 -53104 62439 48350 59222 125176 131461 115037 -90071 -72955 15805
8146 15805 -45078 -22904 121420 90081 7931 9423 94831 206734 154473 54966 106061 18336
8134 18336 -5894 93789 54583 -44208 -162853 -265131 -241001 -193745 -104384 15910 21879
$$ packed form
8217a3440k46n139M4556N7252l1831j16727m6889M8354L9892o0346J1267R7919
8205B4622p4521q0748M108M392M9720l9672O9272l5248n093R6477Q9176j19625
8193a7140L6425N6194l7339K5644Q730j9626P4238J9221k7032n6399k897l7788
8181B2231M646N728L3215j1534R234J04689J3910n9507q9942j21535j34235r8681
8169c21781K1778L1033M660N920K616k0799J10236J32231L5876Q9685j18853j84823
8157b12221M7862J11255J15543j4089J0872O5954O285j6424k05108J7116Q8760
8146A5805o0883K2174J44324l1339q2150J492Q5408J11903n2261r9507N1095q7725
8134A8336k4230R9683l9206r8791j18645j02278K4130M7256Q9361J20294N969
$$ plain form
8123 21879 -58515 -33499 -19724 4629 98397 124875 -82214 -200804 -219256 -136112 31645
8112 31645 36860 5128 -30926 119016 97526 139936 188260 189250 195091 120332 23496 19595 23016
8099 23016 66166 24602 -57790 -19321 -82412 -144703 -193080 -295481 -211172 -84573 -128737
8088 -128737 -161052 -60130 11765 29349 28245 -73393 -120467 -120853 -127253 -147967 -108703 -136461
8076 -136461 -117880 -194723 -250766 -157280 -64666 -61879 -11698 9502 62679 56897 8014 -41681
8064 -41681 -77467 45549 68896 63298 95990 89980 -29982 -118630 -57602 -8793 -43315 -30284
8052 -30284 -1885 -11314 -10139 25939 36900 38474 73589 61181 -59028 -122301 -183148 -229849
8040 -229849 -325216 -348122 -433522 -454309 -234561 -15223 58726 86532 69875 138626 104846
$$ packed form
8123B1879q0394K5016J3775K4353R3768K6478k07089j18590j8452Q3144J67757
8112C1645N215l1732l6054J49942k1490M2410M8324R90N841p4759r6836l901L421
8099B3016M3150m1564q2392L8469o3091o2291m8377j02401Q4309J26599m4164
8088a28737l2315J00922P1895J7584j104j01638m7074l86o400k0714L9264k7758
8076a36461J8581p6843n6043R3486R2614K787N0181K1200N3177n782m8883m9695
8064d1681l5786J23016K3347n598L2692o010j19962q8648O1028M8809l4522J3031
8052c0284K8399r429J175L6078J0961J574L5115j2408j20209o3273o0847m6701
8040b29849r5367k2906q5400k0787K19748K19338P3949K7806j6657O8751l3780
$$ plain form
8029 104846 2043 -34936 -49612 -11552 -63487 -135875 -122405 -16432 33098 -26275 -42293
8018 -42293 8626 25280 -45857 -84043 -50848 21561 116873 146484 133827 67871 -52077 -162239
8006 -162239 -237000 -269209 -244628 -15004 152608 143994 134012 117379 38750 72954 2020 35491
7994 35491 126515 98083 139770 126836 29346 -57554 -123095 1843 83618 105080 52575 21818
7982 21818 18975 117429 178113 137692 112204 15976 90509 142318 47823 3634 153053 151260
7970 151260 100372 97862 36614 -49363 -75468 -22418 71359 85625 128352 165494 55654 156955
7958 156955 195334 186755 210089 129582 139636 174204 147779 149400 177043 256526 210184 185439
7946 185439 225692 192363 211346 285476 239341 139695 36387 5648 145847 87414 26332
$$ packed form
8029A04846j02803l6979j4676L8060n1935p2388J3470J05973M9530n9373j6018
8018d2293N0919J6654p1137l8186L3195P2409R5312K9611j2657o5956j19948j10162
8006a62239p4761l2209K4581K29624J67612q614r982j6633p8629L4204p0934L3471
7994C5491R1024k8432M1687j2934r7490q6900o5541J24938Q1775K1462n2505l0757
7982B1818k843R8454O0684m0421k5488r6228P4533N1809r4495m4189J49419j793
7970A51260n0888k510o1248q5977k6105N3050R3777J4266M2727L7142j09840J01301
7958A56955L8379q579K3334q0507J0054L4568k6425J621K7643P9483m6342k4745
7946A85439M0253l3329J8983P4130m6135r9646j03308l0739J40199n8433o1082
$$ plain form
7935 26332 35398 144283 189856 162361 127570 53043 3139 14557 100035 138662 121795 98798
7923 98798 -2521 -152669 -179792 -105375 -78079 -103012 -125527 -40647 89323 89124 41188 50960
7911 50960 30488 150706 126770 153986 81442 -65170 -68837 40641 40456 -91634 -7213 -1301
7899 -1301 61369 87192 37303 -107700 -60006 -36052 -109077 -65728 42734 207717 156897
7888 156897 90559 108768 119938 88241 81570 146767 141672 70852 47857 30027 -69401 -115783
7876 -115783 -131232 -136787 -103315 -59062 -34188 -246 9852 83749 70618 -53380 -10824 21834
7864 21834 -96627 -193108 -127534 -124345 92300 159920 120046 117809 30130 5941 55144 -18156
7852 -18156 -133744 -85919 -83321 24959 -17937 -94350 -36244 51499 5895 59913 81768 -48561
$$ packed form
7935B6332R066J08885M5573k7495l4791p4527m9904J1418Q5478L8627j6867k2997
7923I8798j01319j50148k7123P4417K7296k4933k2515Q4880J29970j99m7936R772
7911E0960k0472J20218k3936K7216p2544j46612l667J09478j85j32090Q4421N912
7899a301O2670K5823m9889j45003M7694K3954p3025M3349J08462J64983n0820
7888A56897o6338J8209J1170l1697o671O5197n095p0820k2995j7830r9428m6382
7876a15783j5449n555L3472M4253K4874L3942J0098P3897j3131j23998M2556L2658
7864B1834j18461r6481O5574L189K16645O7620l9874k237q7679k4189M9203p3300
7852a8156j15588M7825K598J08280m2896p6413N8106Q7743m5604N4018K1855j30329
$$ plain form
7840 -48561 -126013 -61486 19394 66799 111531 65358 30206 -26413 109171 150981 250781 202971
7828 202971 77755 -21691 -138685 -118297 -201775 -246951 -226707 -132069 -136142 -186882 -102624
7817 -102624 -61331 -15795 65005 67205 88958 100648 151989 57408 7041 95808 135417 47846
7805 47846 50479 56200 57482 44672 -4746 -53827 28880 -28183 -178302 -193753 -249160 -265357
7793 -265357 -313482 -197663 -207309 -91952 -3301 -2243 5523 -31143 -168382 -207422 -51218
7782 -51218 92578 12355 -99286 -129655 -122367 -5548 88905 -14599 -38730 -59941 -61171
7771 -61171 -78760 14194 64603 -58096 -238161 -284272 -81752 69329 57059 -33610 -111176
7760 -111176 -188799 -133878 -46592 -26719 16609 221714 173501 41519 85463 145451 131279
$$ packed form
7840d8561p7452O4527Q0880M7405M4732m6173l5152n6619J35584M1810R9800m7810
7828B02971j25216r9446j16994K0388q3478m5176K0244R4638m073n0740Q4258
7817a02624M1293M5536Q0800K200K1753J1690N1341r4581n0367Q8767L9609q7571
7805D7846K633N721J282j2810m9418m9081Q2707n7063j50119j5451n5407j6197
7793b65357m8125J15819r646J15357Q8651J058P766l6666j37239l9040J56204
7782e1218J43796q0223j11641l0369P288J16819R4453j03504k4131k1211j230
7771f1171j7589R2954N0409j22699j80065m6111K02520J51081j2270r0669p7566
7760a11176p7623N4921Q7286J9873M3328K05105m8213j31982M3944N9988j4172
$$ plain form
7749 131279 26079 4807 -8210 36595 106148 108185 41934 -56789 -145350 -146095 -130841 -157228
7737 -157228 -167516 -88617 36368 9683 32352 -31378 -195926 -126633 -48443 -25661 -23675
7726 -23675 -3438 -2353 118227 98896 16750 -30607 70749 47252 -111168 -253017 -212664
7715 -212664 -166845 -215481 -264577 -237018 -273392 -276051 -214106 -284111 -242292 -202920 -148412 -142090
7703 -142090 -184456 -63861 54388 34787 28196 7309 -74330 -4919 6756 -37908 -55155
7692 -55155 -42097 52854 -538 44210 117919 76999 -9845 -63512 -170483 -210659 -282366 -238002
7680 -238002 -89005 -52159 -157752 -140692 -55659 12479 -46325 -72295 27403 106042 -17040
7669 -17040 -85728 -58905 5809 21450 28448 -95101 -116087 -100967 -62688 1035 97082 91556
$$ packed form
7749A31279j05200k1272j3017M4805O9553K037o6251r8723q8561p45J5254k6387
7737a57228j0288P8899J24985k6685K2669o3730j64548O9293P8190K2782J986
7726b3675K0237J085J20580j9331q2146m7357J01356k3497j58420j41849M0353
7715b12664M5819m8636m9096K7559l6374k659O1945p0005M1819L9372N4508O322
7703a42090m2366J20595J18249j9601o591k0887q1639O9411J1675m4664j7247
7692e5155J3058R4951n3392M4748P3709m0920q6844n3667j06971m0176p1707M4364
7680b38002J48997L6846j05593J7060Q5033O8138n8804k5970R9698P8639j23082
7669a7040o8688K6823O4714J5641O998j23549k0986J5120L8279O3723R6047n526
$$ plain form
7657 91556 121562 139991 158147 72742 47551 -74324 10806 49105 62130 -62226 -167312
7646 -167312 -294329 -311640 -172952 -50885 18451 94821 23094 5452 32296 -1483 -11416
7635 -11416 -39753 -43366 2972 -9785 26419 13739 -123874 -57740 -24264 21643 18631 12364
7623 12364 51442 48547 181060 116876 27402 -3769 -1567 3990 -80377 -64036 28055 65369
7611 65369 38115 32623 -11803 14106 -15680 -39761 22561 94393 90659 62656 26970 -8541
7599 -8541 11190 72057 19024 -35813 -86719 -120165 27158 46746 14498 -89652 -186644 -162681
7587 -162681 -225194 -97504 -12505 118765 134244 -1619 -35958 -89254 -45435 -112629 -270748
7576 -270748 -289109 -201036 -10404 -11454 -169106 -73174 63933 -35205 -35308 -41119 37552 58767
$$ packed form
7657I1556L0006J8429J8156q5405k5191j21875Q5130L8299J3025j24356j05086
7646a67312j27017j7311J38688J22067O9336P6370p1727j7642K6844l3779r933
7635a1416k8337l613M6338j2757L6204j2680j37613O6134L3476M5907l012o267
7623A2364L9078k895J32513o4184q9474l1171K202N557q4367J6341R2091L7314
7611F5369k7254n492m4426K5909k9786k4081O2322P1832l734k8003l5686l5511
7599h541J9731O0867n3033n4837n0906l3446J47323J9588l2248j04150r6992K3963
7587a62681o2513J27690Q4999J31270J5479j35863l4339n3296M3819o7194j58119
7576b70748j8361Q8073J90632j050j57652R5932J37107r9138j03n811P8671K1215
$$ plain form
7564 58767 9236 -33531 -9160 7010 -132646 -28029 12044 12195 49638 -44467 -239338 -104559
7552 -104559 -109315 -93939 -34317 -107671 11673 76513 -65778 -182834 -56854 37026 68661
7541 68661 46279 -7049 -28345 -39204 77552 229549 209762 160010 158216 254328 235931 174461
7529 174461 136690 23151 -33923 53948 210346 297966 260334 157064 102161 3347 -17246
7518 -17246 -93675 -5093 45654 6448 -68780 -102127 -116386 -153568 -177037 -106579 -214 167032
7506 167032 218598 11281 -18188 -55829 -132472 -85353 -247983 -232632 -190425 -87839 8581
7495 8581 14003 -28677 -33798 -3245 -116086 -99158 -7369 26335 -43488 -40934 76888 60562
7483 60562 -4684 -28528 -144744 -109231 -74585 4755 25340 -32709 -40007 -6686 -57259 -63749
$$ packed form
7564E8767m9531m2767K4371J6170j39656J04617M0073J51L7443r4105j94871J34779
7552a04559m756J5376N9622p3354J19344O4840j42291j17056J25980R3880L1635
7541F8661k2382n3328k1296j0859J16756J51997j9787m9752j794R6112j8397o1470
7529A74461l7771j13539n7074Q7871J56398Q7620l7632j03270n4903r8814k0593
7518a7246p6429Q8582N0747l9206p5228l3347j4259l7182k3469P0458J06365J67246
7506A67032N1566k07317k9469l7641p6643M7119j62630J5351M2207J02586R6420
7495H581N422m2680n121L0553j12841J6928R1789L3704o9823K554J17822j6326
7483F0562o5246k3844j16216L5513L4646P9340K0585n8049p298L3321n0573o490
$$ plain form
7471 -63749 -79271 -78821 -68058 -55464 -39197 -106004 -114664 17395 104775 106850 96561 73907
7459 73907 -82560 -147825 9697 95927 18995 -101653 -246557 -214541 -192685 -110430 -84966
7448 -84966 -26925 77167 119997 122435 70381 -68962 -178554 -130186 -84195 -156035 -147834 -135610
7436 -135610 -196070 -211033 -99561 922 -38236 -104570 -93852 4785 26767 47446 -59396
7425 -59396 -30706 -39611 -25093 5102 20447 37629 96157 118423 48528 -40396 31766 64298
7413 64298 16073 41549 45638 94812 49834 12203 63969 30862 -35691 69533 132313 107430
7401 107430 66227 108792 101707 41860 31096 5304 -57764 -61615 -34539 -100399 -169502 -75849
7389 -75849 -13192 6911 29092 -209930 -241616 -151734 24711 77252 7295 15154 90861 -40226
$$ packed form
7471f3749j5522M50J0763J2594J6267o6807q660J32059Q7380K075j0289k2654
7459G3907j56467o5265J57522Q6230p6932j20648j44904L2016K1856Q2255K5464
7448h4966N8041J04092M2830K438n2054j39343j09592M8368M5991p1840Q201J2224
7436a35610o0460j4963J11472J00483l9158o6334J0718R8637K1982K0679j06842
7425e9396K8690q905J4518L0195J5345J7182N8528K2266o9895q8924P2162L2532
7413F4298m8225K5476M089M9174m4978l7631N1766l3107o6553J05224O2780k4883
7401A07430m1203M2565p085n9847j0764k5792o3068l851K7076o5860o9103R3653
7389g5849O2657K0103K2181k39022l1686Q9882J76445N2541o9957P859P5707j31087
$$ plain form
7377 -40226 -185958 -164236 -95831 33246 211357 342405 285681 59574 -15933 -152012 -238360
7366 -238360 -136495 -24339 89838 12290 -33387 -131382 -208692 -174688 -100671 40039 94089
7355 94089 92799 -21979 -37320 -43507 -190442 -191166 -82210 30694 26815 -132749 -55834 -14829
7343 -14829 -138823 -198855 -128299 -14322 -14865 -77482 -132234 -143640 -90980 -1402 -49054 -128875
7331 -128875 -191605 -76302 -90643 -150353 -214680 -107026 -132616 -167983 -207671 -176338 -141200
7320 -141200 -118773 -42796 113743 240539 158601 108724 60831 60665 131477 114554 54739 24498
7308 24498 75834 87330 129498 193914 312909 348736 226315 172052 89308 40655 162586
7297 162586 216224 137829 199915 174467 126230 174386 102684 54844 21939 6273 37401 108114
$$ packed form
7377d0226j45732K1722O8405J29077J78111J31048n6724k26107p5507j36079q6348
7366b38360J01865J12156J14177p7548m5677r7995p7310L4004P4017J40710N4050
7355I4089j290j14778j5341o187j46935p24J08956J12904l879j59564P6915M1005
7343a4829j23994o0032P0556J13977n43o2617n4752j1406N2660Q9578m7652p9821
7331a28875o2730J15303j4341n9710o4327J07654k5590l5367l9688L1333L5138
7320a41200K2427P5977J56539J26796q1938m9877m7893j66P0812j6923n9815l0241
7308B4498N1336J1496M2168O4416J18995L5827j22421n4263q2744m8653J21931
7297A62586N3638p8395O2086k5448m8237M8156p1702m7840l2905j5666L1128P0713
$$ plain form
7285 108114 211501 167825 48266 16301 158423 95490 -81347 -100061 -18750 15488 114440
7274 114440 86792 114601 173731 105150 -16244 -108218 -64793 -65519 -120082 -123365 -34270 -1279
7262 -1279 135367 187282 174742 119335 142981 143778 91841 -48371 10400 128481 183293 -18261
7250 -18261 -13227 39789 67739 71902 201218 183587 153111 61830 -29881 -100410 -129810 7172
7238 7172 38484 -24175 -134271 -112726 -68334 40561 144575 122380 142791 125283 62379
7227 62379 -65104 -89490 -33061 18303 -16007 20057 59953 124798 186305 78079 -52152
7216 -52152 19036 -24036 58892 54384 -23567 -20272 -12830 -106242 -165740 -279902 -292727 -177650
7204 -177650 -78845 -101102 -70337 58760 21280 -136327 -217744 -257537 -214814 -101501 111482
$$ packed form
7285A08114J03387m3676j19559l1965J42122o2933j76837j8714Q1311L4238R8952
7274A14440k7648K7809N9130o8581j21394r1974M3425p26n4563l283Q9095L2991
7262a279J36646N1915j2540n5407K3646P97n1937j40212N8771J18081N4812k01554
7250a8261N034N3016K7950M163J29316j7631l0476r1281r1711p0529k9400J36982
7238G172L1312o2659j10096K1545M4392J08895J04014k2195K0411j7508o2904
7227F2379j27483k4386N6429N1364l4310L6064L9896O4845O1507j08226j30231
7216e2152P1188m3072Q2928m508p7951L295P442r3412n9498j14162j2825J15077
7204a77650R8805k2257L0765J29097l7480j57607q1417l9793M2723J13313K12983
$$ plain form
7193 111482 240903 229850 160324 185060 164710 163128 141563 33999 -43178 17369 50178
7182 50178 78954 45417 -35781 -34496 -40788 -40283 -103055 -122720 -156807 -127608 -24663 21894
7170 21894 44039 11035 -37029 -12317 58819 104335 78723 109206 85286 150855 198729 159046
7158 159046 60924 83523 108591 3286 22025 123186 162303 153511 196720 75482 127132
7147 127132 74622 6818 -66260 -110704 -156631 -101447 -48861 -121932 -186764 -203379 -249476 -296335
7135 -296335 -170859 -44807 -101551 -205820 -212332 -143699 -44868 -118045 -111383 30735 -9509
7124 -9509 -134749 -57795 49607 60437 21117 -90687 -87869 32371 114514 -58869 -49122
7113 -49122 72895 123793 55924 36223 24178 66284 94705 -5742 -52848 -120162 -82625
$$ packed form
7193A11482J29421j1053o9526K4736k0350j582k1565j07564p7177O0547L2809
7182E0178K8776l3537q1198J285o292N05o2772j9665l4087K9199J02945M6557
7170B1894K2145l3004m8064K4712P1136M5516k5612L0483k3920O5569M7874l9683
7158A59046r8122K2599K5068j05305J8739J01161L9117q792M3209j21238N1650
7147A27132n2510o7804p3078m4444m5927N5184N2586p3071o4832j6615m6097m6859
7135b96335J25476J26052n6744j04269o512O8633R8831p3177O662J42118m0244
7124i509j25240P6954J07402J0830l9320j11804K818J20240Q2143j73383R747
7113d9122J22017N0898o7869j9701j2045M2106K8421j00447m7106o7314L7537
$$ plain form
7102 -82625 -79368 -65051 -61135 -110749 -114365 62590 31539 -11225 -129359 -200276 -233921 -235026
7090 -235026 -294486 -241198 -81452 -61300 -35265 -29016 -70128 40784 108266 49985 52871 -52999
7078 -52999 -100400 3293 37896 57436 8526 -2596 -92681 -123814 -91693 -144511 -82414 8511
7066 8511 759 -63668 -69158 29552 133791 79689 131277 109315 100895 -59839 -39649 29959
7054 29959 9442 76591 139653 152604 99031 108897 86774 33405 70006 81262 123294 11823
7042 11823 -87582 -179785 -193020 -148680 -226337 -127721 -131505 -128141 25791 20258 -97760 -86584
7030 -86584 -26896 -39320 -102821 -142171 -125530 -185152 -247700 -270507 -347598 -252467 -117840 -166937
7018 -166937 -252285 -190310 -135371 -164276 -238438 -171768 -38601 -71095 -162688 -247618 -229902
$$ packed form
7102h2625L257J4317L916m9614l616J76955l1051m2764j18134p0917l3645j105
7090b35026n9460N3288J59746K0152K6035O249m1112J10912O7482n8281K886j05870
7078e2999m7401J03693L4603J9540m8910j1122r0085l1133L2121n2818O2097R0925
7066H511p752o4427n490R8710J04239n4102N1588k1962q420j60734K0190O9608
7054B9959k0517O7149O3062J2951n3573R866k2123n3369L6601J1256M2032j11471
7042A1823r9405r2203j3235M4340p7657R8616l784L364J53932n533j18018J1176
7030h6584N9688j2424o3501l9350J6641n9622o2548k2807p7091R5131J34627m9097
7018a66937q5348O1975N4939k8905p4162O6670J33167l2494r1593q4930J7716
$$ plain form
7007 -229902 -277861 -226951 -158960 -21204 17215 -4259 -13289 56471 181523 194408 105822
6996 105822 82324 103096 20205 -930 20788 104960 80623 6534 -60632 16724 20176 -53825
6984 -53825 -77136 10894 19618 12567 -7822 -50991 22772 145675 173280 3741 -78717 -54229
6972 -54229 -109523 -100306 -130513 -57851 45887 59589 -10929 21336 74816 11715 -63627 -88971
6960 -88971 -8132 -14395 -56927 -145085 -258395 -399338 -357416 -198117 -333305 -281768 -97676
6949 -97676 -41574 62379 92814 67663 -46833 -132381 -123133 91665 -27589 -184359 -110879
6938 -110879 -162129 -114870 -128697 -93639 -89850 -216700 -236391 -137027 -82111 -120390 -26076 -39009
6926 -39009 -62262 -57172 -118190 -62730 27052 12515 -3227 -61091 -98359 -168991 -149487 -25834
$$ packed form
7007b29902m7959N0910O7991J37756L8419k1474r030O9760J25052J2885q8586
6996A05822k3498K0772q2891k1135K1718Q4172k4337p4089o7166P7356L452p4001
6984e3825k3311Q8030Q724p051k0389m3169P3763J22903K7605j69539q2458K4488
6972e4229n5294R217l0207P2662J03738J3702p0518L2265N3480o3101p5342k5344
6960h8971Q0839o263m2532q8158j13310j40943M1922J59299j35188N1537J84092
6949i7676N6102J03953L0435k5151j14496q5548R248K14798j19254j56770P3480
6938a10879n1250M7259j3827L5058L789j26850j9691R9364N4916l8279R4314j2933
6926c9009k3253N090o1018N5460Q9782j4537j5742n7864l7268p0632J9504J23653
$$ plain form
6914 -25834 -110884 -87416 19801 16677 101313 127824 30659 3754 -64929 42860 106523 26511
6902 26511 29305 -71261 -5834 -23541 -30739 47583 90488 1346 90612 105859 97885 71232
6890 71232 54101 -27441 -7382 12896 77791 162121 64693 -46056 16960 126267 94038
6879 94038 -11230 14456 -55574 -62987 39304 -43133 -57054 -71327 -162806 -162796 -97921 56433
6867 56433 167217 187149 101810 26729 -135212 -216730 -142687 -72293 -54485 -5920 17661
6856 17661 32270 -14757 -61953 38390 117582 204290 160648 136808 68304 94147 3233 -76223
6844 -76223 19109 74361 130267 153159 156125 104383 -25390 -71858 -92645 -35740 125222 136757
6832 136757 127273 57496 -30283 28734 33413 7074 -37691 -7120 -90651 -104453 -2288 -32413
$$ packed form
6914b5834q5050K3468J07217l124Q4636K6511r7165k6905o8683J07789O3663q0012
6902B6511K794j00566O5427j7707p198P8322M2905q9142Q9266J5247p974k6653
6890G1232j7131q1542K0059K0278O4895Q4330r7428j10749O3016J09307l2229
6879I4038j05268K5686p0030p413J02291q2437j3921j4273r1479J0O4875J54354
6867E6433J10784J9932q5339p5081j61941q1518P4043P0394J7808M8565K3581
6856A7661J4609m7027m7196J00343P9192Q6708m3642k3840o8504K5843r0914p9456
6844g6223R5332N5252N5906K2892K966n1742j29773m6468k0787N6905J60962J1535
6832A36757r484o9777q7779N9017M679k6339m4765L0571q3531j3802J02165l0125
$$ plain form
6820 -32413 -66064 -163565 -175805 -157702 -65875 -56669 -28582 -85777 -161191 -87130 36247 62300
6808 62300 1881 92768 122002 -18378 -30906 -111961 -145715 -75695 -91684 -108613 -121292 -77676
6796 -77676 -189922 -250673 -199743 -183920 -145510 -170056 -171484 -119886 -1108 104346 141060
6785 141060 88731 14002 -26020 -75172 -162632 -142004 -106586 -13787 -94889 -164576 -137865 -95671
6773 -95671 -146058 -181126 -36308 -44225 28371 20796 -26647 -6216 57262 2250 -25623 -8339
6761 -8339 -105680 -178295 -178305 -252474 -229520 -252525 -130579 -117277 -68045 -1255 25499 5040
6749 5040 -51306 -123170 43357 113240 2769 22370 55356 89770 128416 47206 -113828
6738 -113828 -135802 -108482 -17620 82437 119554 36741 -21269 -100181 -27626 124738 156096
$$ packed form
6820c2413l3651r7501j2240J8103R1827R206K8087n7195p5414P4061J23377K6053
6808F2300o0419R0887K9234j40380j2528q1055l3754P0020j5989j6929j2679M3616
6796g7676j12246o0751N0930J5823L8410k4546j428N1598J18778J05454L6714
6785A41060n2329p4729m0022m9152q7460K0628L5418R2799q1102o9687K6711M2194
6773i5671n0387l5068J44818p917P2596p575m7443K0431O3478n5012k7873J7284
6761h339r7341p2615j0p4169K2954k3005J21946J3302M9232O6790K6754k0459
6749E040n6346p1864J66527O9883j10471J9601L2986L4414L8646q1210j61034
6738a13828k1974K7320R0862J00057L7117q2813n8010p8912P2555J52364L1358
$$ plain form
6727 156096 119760 -39349 -257445 -378295 -252234 -92993 -96289 -140552 -75425 -116323 -180306
6716 -180306 -183565 -229721 -84336 110724 134536 201031 187309 127867 74157 39618 -28181
6705 -28181 -45152 -14393 -90862 -101737 -40767 38228 91762 85794 33222 42197 143667 75950
6693 75950 150512 277613 209696 117908 156397 84165 125916 36628 30720 53719 14042 28896
6681 28896 31747 42235 59810 69784 67052 70898 6806 -40106 -58968 2004 63556 -17660 -104896
6668 -104896 -69315 -3748 -32116 -161312 -148958 -37126 -35911 -57851 -84696 26634 11527
6657 11527 -22163 -71000 -63644 -5848 -4776 -27968 -50901 -29332 -39663 7192 41406 43919
6645 43919 97513 65312 43577 54273 106049 71445 153485 259713 317011 205961 -9367
$$ packed form
6727A56096l6336j59109k18096j20850J26061J59241l296m4263O5127m0898o3983
6716a80306l259m6156J45385J95060K3812O6495j3722n9442n3710l4539o7799
6705b8181j6971L0759p6469j0875O0970P8995N3534n968n2572Q975J01470o7717
6693G5950P4562J27101o7917r1788L8489p2232M1751q9288n908K2999l9677J4854
6681B8896K851J0488J7575R974k732L846o4092m6912j8862O0972O1552q1216q7236
6668a04896L5581O5567k8368j29196J2354J11832J215k1940k6845J11330j5107
6657A1527l3690m8837P356N7796J072k3192k2933K1569j0331M6855L4214K513
6645D3919N3594l2201k1735J0696N1776l4604Q2040J06228N7298j11050k15328
$$ plain form
6634 -9367 -109839 -106923 -101740 -73905 -82279 -80567 -39751 6295 25985 -12489 -112599 5431
6622 5431 -16728 -55277 97592 144895 36273 -128189 -191987 -274558 -335655 -206432 -98757
6611 -98757 93022 74372 -53884 -169855 -194754 -124389 -50145 -48081 5611 128862 137888
6600 137888 186186 204955 122516 81010 22213 7873 -107864 -158465 -198830 -158615 -58723
6589 -58723 -47890 -16073 -44506 -75440 -102527 622 124021 194768 158271 142464 184038
6578 184038 115269 52428 59981 145762 67181 29596 -28442 -27642 -95417 -121358 -31994 11539
6566 11539 25718 36382 -16862 -88676 -47632 62243 100162 30154 -40493 22091 14583 38931
6554 38931 57647 141504 146312 41350 10748 -102785 -96946 -43031 -8089 27202 -43738 -80943
$$ packed form
6634i367j00472K916N183K7835q374J712M0816M6046J9690l8474j00110J18030
6622E431k2159l8549J52869M7303j08622j64462o3798q2571o1097J29223J07675
6611i8757J91779j8650j28256j15971k4899P0365P4244K064N3692J23251R026
6600A37888M8298J8769q2439m1506n8797j4340j15737n0601m0365M0215R9892
6589e8723J0833L1817k8433l0934k7087J03149J23399P0747l6497j5807M1574
6578A84038o8769o2841P553Q5781p8581l7585n8038Q00o7775k5941Q9364M3533
6566A1539J4179J0664n3244p1814M1044J09875L7919p0008p0647O2584p508K4348
6554C8931J8716Q3857M808j04962l0602j13533N839N3915L4942L5291p0940l7205
$$ plain form
6542 -80943 -109101 -108970 -79874 -85334 -43442 18876 71130 104441 -47375 -128866 -293175 -313854
6530 -313854 -143830 -106524 -160519 -121813 -125174 -149590 -126649 -48742 -159898 -318866 -346793
6519 -346793 -385298 -416625 -323179 -258311 -218925 -106664 38640 33079 -18022 -35041 -71502
6508 -71502 -79284 13539 119393 32942 -123549 -86933 -5801 12949 15873 -16838 -19410 34201
6496 34201 18941 -42290 -76160 -195610 -243386 -179510 -103855 -33758 -11971 1966 37137 101882
6484 101882 67101 28951 72253 52823 -60937 -15930 46168 31738 107760 134778 178703
6473 178703 140599 154538 60718 22446 -82721 -214264 -121551 -119184 -179380 -202467 -11383
6462 -11383 -59438 -156062 -131595 -51279 -61965 -83075 9688 8351 -68612 -46329 -94305 -88416
$$ packed form
6542h0943k8158J31K9096n460M1892O2318N2254L3311j51816q1491j64309k0679
6530c13854J70024L7306n3995L8706l361k4416K2941P7907j11156j58968k7927
6519c46793l8505l1327R3446O4868L9386J12261J45304n561n1101j7019l6461
6508g1502p782R2823J05854q6451j56491L6616Q1132J8750K924l2711k572N3611
6496C4201j5260o1231l3870j19450m7776O3876P5655P0097K1787J3937L5171O4745
6484A01882l4781l8150M3302j9430j13760M5007O2098j4430P6022K7018M3925
6473A78703l8104J3939r3820l8272j05167j31543R2713K367o0196k3087J91084
6462a1383m8055r6624K4467Q0316j0686k1110R2763j337p6963K2283m7976N889
$$ plain form
6450 -88416 -60620 -61591 -219016 -247934 -51566 -9660 -89510 -93251 -81317 33245 48237 -38112
6438 -38112 -41110 -92022 -102562 -120089 33505 143558 49443 93532 152510 110290 34624 -66645
6426 -66645 -155955 -79689 -16739 -71098 -196126 -248047 -112962 -31152 -22812 -129175 -214217
6415 -214217 -228177 -117495 -138685 -306617 -315327 -237751 -66335 26194 175200 31919 -97595
6404 -97595 -26304 16738 14089 -48759 -116866 -210775 -204778 -110577 -225513 -128948 -9589 7515
6392 7515 21825 -38918 -148367 -139245 -243436 -195960 -69928 -26240 -176024 -271399 -132734
6381 -132734 -27374 44137 -97736 -34455 126062 112169 59837 83807 -25401 -108940 -113631
6370 -113631 -76878 -29369 45820 62132 83273 106108 117084 46667 -41359 -99514 -37705 67783
$$ packed form
6450h8416K7796r71j57425k8918J96368M1906p9850l741J1934J14562J4992q6349
6438c8112k998n0912j0540j7527J53594J10053r4115M4089N8978m2220p5666j01269
6426f6645q9310P6266O2950n4359j25028n1921J35085Q1810Q340j06363q5042
6415b14217j3960J10682k1190j67932q710P7576J71416R2529J49006j43281j29514
6404i7595P1291M3042k649o2848o8107r3909N997R4201j14936R6565J19359J7104
6392G515J4310o0743j09449R122j04191M7476J26032M3688j49784r5375J38665
6381a32734J05360P1511j41873O3281J60517j3893n2332K3970j09208q3539m691
6370a13631L6753M7509P5189J6312K1141K2835J0976p0417q8026n8155O1809J05488
$$ plain form
6358 67783 -11847 -41872 34490 92123 -41609 -47030 -30623 68475 177104 235640 161548 138781
6346 138781 95759 -10412 20036 178900 131420 117411 190166 191276 112190 -32835 -145402
6335 -145402 -163612 -84930 80201 92198 22340 38462 -34514 5735 39764 -6247 -44790
6324 -44790 -99008 -131744 -247092 -232234 -152919 -113158 -97423 25892 92836 89640 -25589
6313 -25589 -26120 13036 34398 -7241 -14011 26798 55484 10245 59388 124911 102710 -18205
6301 -18205 -84322 -95896 -72313 -56112 -33749 -15358 -142548 -181832 -168205 -168826 -128384 -6121
6289 -6121 660 -29547 -2822 26249 -27140 -118091 -143843 29621 169856 161496 138325 44049
6277 44049 -38974 11317 52104 -8412 -18069 -52266 -43629 17174 17172 62298 144146 195056 183442
$$ packed form
6358F7783p9630l0025P6362N7633j33732n421J6407R9098J08629N8536p4092k2767
6346A38781m3022j06171L0448J58864m7480j4009P2755J110p9086j45025j12567
6335a45402j8210P8682J65131J1997o9858J6122p2976M0249L4029m6011l8543
6324d4790n4218l2736j15348J4858P9315L9761J5735J23315O6944l196j15229
6313b5589n31L9156K1362m1639o770M0809K8686m5239M9143O5523k2201j20915
6301a8205o6117j1574K3583J6201K2363J8391j27190l9284J3627o21M0442J22263
6289f121O781l0207K6725K9071n3389r0951k5752J73464J40235q360k3171r4276
6277D4049q3023N0291M0787o0516r657l4197Q637O0803kM5126Q1848N0910j1614
$$ plain form
6264 183442 151621 57269 -29094 -10280 -38369 -41606 -63155 -129218 -138227 235 27187 53235
6252 53235 33404 28888 11246 -10518 7950 52510 121430 101794 108301 107256 75479 69639 119004
6239 119004 114921 233612 302650 288676 187450 51797 -54860 -16702 -43159 -64392 -40032
6228 -40032 -12886 -49937 41968 71399 108545 44130 119970 136473 147751 86028 -170073 -185515
6216 -185515 -36800 7909 -42541 -78527 -94747 -106053 -132958 -77015 10723 50031 65398
6205 65398 25219 80180 107885 25240 43497 62214 78594 181805 107402 64208 -42302
6194 -42302 -81315 -104922 -130980 -153025 -103677 24292 -90682 -183463 -29474 77875 78059
6183 78059 -85955 -30775 25551 15632 91731 100883 37204 -49868 11978 34584 27731 -83954
$$ packed form
6264A83442l1821r4352q6363J8814k8089l237k1549o6063r009J38462K6952K6048
6252E3235j9831m516j7642k1764J8468M4560O8920j9636O507j045l1777n840M9365
6239A19004m083J18691O9038j3974j01226j35653j06657L8158k6457k1233K4360
6228d0032K7146l7051R1905K9431L7146o4415P5840J6503J1278o1723k56101j5442
6216a85515J48715M4709n0450l5986j6220j1306k6905N5943Q7738L9308J5367
6205F5398m0179N4961K7705q2645J8257J8717J6380J03211p4403m3194j06510
6194d2302l9013k3607k6058k2045M9348J27969j14974r2781J53989J07349J84
6183G8059j64014N5180N6326r919P6099R152o3679q7072O1846K2606o853j11685
$$ plain form
6171 -83954 -136829 -52742 -76529 -18703 85371 76695 43330 92454 225826 195010 90568
6160 90568 -52495 -119522 -29045 -28596 49533 134775 68911 71113 107336 40742 -54898 -23218
6148 -23218 30368 -122657 -233846 -94677 -7883 4805 70803 118852 81169 49582 5982
6137 5982 30992 14864 6483 -18714 -62378 7682 81335 -37105 -221598 -238136 -327591 -363448
6125 -363448 -226342 -160773 -73921 4275 -10557 34414 136848 140824 130726 121686 113688 -37201
6113 -37201 -137872 -88901 -40443 1804 -26693 -110932 -19700 55206 -1394 -105790 -73191
6102 -73191 9888 61188 114248 12304 255 -36661 -56546 -128925 -18549 8629 53812
6091 53812 -31845 -117692 -90950 -72351 -73126 -48472 -123473 -105806 -14666 -95602 -200194 -113656
$$ packed form
6171h3954n2875Q4087k3787N7826J04074q676l3365M9124J33372l0816j04442
6160I0568j43063o7027R0477M49P8129Q5242o5864K202L6223o6594r5640L1680
6148b3218N3586j53025j11189J39169Q6794J2688O5998M8049l7683l1587m3600
6137E982K5010j6128q381k5197m3664P0060P3653j18440j84493j6538q9455l5857
6125c63448J37106O5569Q6852P8196j4832M4971J02434L976j0098r040p998j50889
6113c7201j00671M8971M8458M2247k8497q4239R1232P4906n6600j04396L2599
6102g3191Q3079N1300N3060j01944j2049l6916j9885p2379J10376K7178M5183
6091E3812q5657q5847K6742J8599p75K4654p5001J7667R1140q0936j04592Q6538
$$ plain form
6079 -113656 -94659 -51232 -36701 -57297 16804 82217 65121 -47325 -3319 -10633 -8510 -147645
6067 -147645 -170001 -147153 -211169 -260732 -85610 -13583 -38009 -5876 -23149 70608 154534
6056 154534 40880 -89622 -51665 -68076 -165300 -188466 -83626 -9477 -9996 -134858 -237770
6045 -237770 -194988 -123044 79911 203876 184245 201950 222210 259074 234294 325556 233129
6034 233129 111407 12393 -6790 -22178 -108521 -88798 -21057 51208 32634 121239 110107
6023 110107 37889 11060 28394 111882 213368 132770 89411 89791 124383 123038 41981 -13823
6011 -13823 14919 92513 42930 -76610 -193872 -170134 -119134 -171992 -231964 -218148 -36842
6000 -36842 -26110 22959 15810 15894 105330 189914 267138 273994 293949 255935 195957 85176 38134
$$ packed form
6079a13656J8997M3427J4531k0596P4101O5413j7096j12446M4006p314K123j39135
6067a47645k2356K2848o4016m9563J75122P2027k4426L2133j7273R3757Q3926
6056A54534j13654j30502L7957j6411r7224k3166J04840P4149n19j24862j02912
6045b37770M2782P1944K02955J23965j9631J7705K0260L6864k4780R1262r2427
6034B33129j21722r9014j9183j5388q6343J9723O7741P2265j8574Q8605j1132
6023A10107p2218k6829J7334Q3488J01486q0598m3359L80L4592j345q1057n5804
6011a3823K8742P7594m9583j19540j17262K3738N1000n2858n9972J3816J81306
6000c6842J0732M9069p149Q4Q9436Q4584P7224O856J9955l8014n9978j10781m7042
$$ plain form
5987 38134 139569 190339 140425 151869 150465 132312 82147 13974 52524 45877 117227 70320
5975 70320 37507 95192 146591 73541 -68921 -70403 -44241 78956 129822 41723 -17965 57613
5963 57613 61181 81928 -1202 93909 95486 57588 40530 -34165 37476 148840 168208 32287
5951 32287 -52714 18797 96487 95014 36343 82470 12680 -58587 10427 18037 127871 27525
5939 27525 -20377 78965 130656 214210 287412 259131 175020 246930 267065 117598 69097 45423
5927 45423 -13362 20343 -24672 -106773 -46185 100728 259537 323879 337161 233304 181103
5916 181103 111311 25331 112748 129997 112939 15740 -48898 -4000 33740 12471 82962 42020
5904 42020 27973 159109 151987 65841 101395 106317 89766 136955 204455 237230 108309 76267
$$ packed form
5987C8134J01435N0770m9914J1444j404j8153n0165o8173L8550o647P1350m6907
5975G0320l2813N7685N1399p3050j42462j482K6162J23197N0866q8099n9688P5578
5963E7613L568K0747q3130R5111J577l7898j7058p4695P1641J11364J9368j35921
5951C2287q5001P1511P7690j473n8671M6127o9790p1267O9014P610J09834j00346
5939B7525m7902R9342N1691Q3554P3202k8281q4111P1910K0135j49467m8501k3674
5927D5423n8785L3705m5015q2101O0588J46913J58809O4342J3282j03857n2201
5916A81103o9792q5980Q7417J7249j7058r7199o4638M4898L7740k1269P0491m0942
5904D2020j4047J31136p122q6146L5554M922j6551M7189O7500L2775j28921l2042
$$ plain form
5892 76267 21522 78565 8586 -95599 -149380 -61247 102171 171786 128950 135972 65165 56312
5880 56312 117678 252148 249010 133820 -70575 -95100 -209971 -241859 -232050 -98475 -75779
5869 -75779 -57014 -52548 -51579 21750 -37506 -22689 57253 28638 -94982 -156382 -66543 9006
5857 9006 -136008 -160044 -72410 -17523 22144 -21086 -100587 -53016 41759 63673 111428 105765
5845 105765 66447 65151 155954 244043 252429 95827 6025 -58783 -70509 41860 109583 54079
5833 54079 128688 194952 88663 39854 67630 112571 164455 196050 200070 106019 -15805 -77594
5821 -77594 6869 98526 88087 50049 54909 83372 -35639 -113719 -155585 -11884 -39003 -128543
5809 -128543 -66763 -38563 16030 -14195 12906 14793 118117 182294 135511 15802 -73262
$$ packed form
5892G6267n4745N7043o9979j04185n3781Q8133J63418O9615m2836P022p0807q853
5880E6312O1366J34470l138j15190k04395k4525j14871l1888R809J33575K2696
5869g5779J8765M466R69P3329n9256J4817P9942k8615j23620o1400Q9839P5549
5857I006j45014k4036Q7634N4887L9667m3230p9501M7571R4775K1914M7755n663
5845A05765l9318j296R0803Q8089Q386j56602q9802o4808j1726J12369O7723n5504
5833E4079P4609O6264j06289m8809K7776M4941N1884L1595M020r4051j21824o1789
5821g7594Q4463R1657j0439l8038M860K8463j19011p8080m1866J43701k7119q9540
5809a28543O1780K8200N4593l0225K7101J887J03324O4177m6783j19709q9064
$$ plain form
5798 -73262 -99858 -72455 -120580 -170704 -100188 7710 4192 -49013 -11468 38054 -43473 -6309
5786 -6309 88249 116613 251419 234137 71931 23670 66342 79355 105186 29906 23262 109345
5774 109345 191916 186796 75567 66662 39431 79793 120598 -61532 -135200 -42712 -88932 -215586
5762 -215586 -227013 -171003 -125476 -143613 -107462 -104715 -140749 -144809 -188423 -109447 -14964 -44496
5750 -44496 -213767 -196804 -62502 -77192 -39987 -10790 -41730 18140 -6937 -171250 -161773
5739 -161773 -168781 -33761 116809 66298 -71335 -24996 115045 68735 -17819 -75573 -130967
5728 -130967 -52832 -2182 14711 -38366 110933 152081 163604 157440 42943 59693 42806
5717 42806 34243 30256 1191 10672 73308 26757 -21786 -71830 -68373 134349 259484 253553
$$ packed form
5798g3262k6596K7403m8125n0124P0516J07898l518n3205L7545M9522q1527L7164
5786f309R4558K8364J34806j7282j62206m8261M2672J3013K5831p5280o644Q6083
5774A09345Q2571n120j11229q905k7231M0362M0805j82130p3668R2488m6220j26654
5762b15586j1427N6010M5527j8137L6151K747l6034m060m3614P8976R4483k9532
5750d4496j69271J6963J34302j4690L7205K9197l0940N9870k5077j64313R477
5739a61773p008J35020J50570n0511j37633M6339J40041m6310q6554n7754n5394
5728a30967P8135N0650J6893n3077J49299M1148J1523o164j14497J6750j6887
5717D2806q563l987k9065R481O2636m6551m8543n0044L457K02722J25135n931
$$ plain form
5705 253553 206354 62793 -36294 -87593 -28742 -65426 -24321 117344 123854 19520 30682
5694 30682 47218 -23175 -12231 -13296 -104722 -115166 -145127 -215505 -204100 -299914 -213574 -85401
5682 -85401 42504 52702 7098 -6127 -40344 -96434 -32927 106973 107898 67543 92237 200371
5670 200371 166498 7905 -102166 -135310 -180591 -261854 -232780 -35724 39619 83553 252153
5659 252153 260864 260375 233271 194531 170013 19385 -85821 -34766 36244 92005 55247 47001
5647 47001 10639 24166 85498 105081 47207 14905 -47077 -94570 -76630 -167864 -68600 -19764
5635 -19764 -21260 -50695 45495 99965 86432 43736 -35744 -39108 3009 165084 178602 252764
5623 252764 311565 241569 167766 242058 210992 138898 130180 4763 -43976 27004 72263 20546
$$ packed form
5705B53553m7199j43561r9087n1299N8851l6684M1105J41665O510j04334J1162
5694C0682J6536p0393J0944j065r1426j0444k9961p0378J1405r5814Q6340J28173
5682h5401J27905J0198m5604j3225l4217n6090O3507J39900R25m0355K4694J08134
5670B00371l3873j58593j10071l3144m5281q1263K9074J97056P5343M3934J68600
5659B52153Q711m89k7104l8740k4518j50628j05206N1055P1010N5761l6758q246
5647D7001l6362J3527O1332J9583n7874l2302o1982m7493J7940r1234R9264M8836
5635a9764j496k9435R6190N4470j3533m2696p9480l364M2117J62075J3518P4162
5623B52764N8801o9996p3803P4292l1066p2094q718j25417m8739P0980M5259n1717
$$ plain form
5611 20546 -81566 -260680 -176418 -101023 -29254 13899 23698 5510 45453 178235 141961
5600 141961 57385 -77346 -166169 -142000 -140309 -194742 -205432 -217433 -146135 -108959 -126172 -176413
5588 -176413 -214640 -153793 -134944 -69722 33128 92434 100449 60152 -7165 58427 121119 127179
5576 127179 144181 207089 164720 -9806 -15774 62792 83979 -13187 -49547 54107 161367
5565 161367 71190 -79557 -84382 8386 6037 12994 52165 99652 82534 95519 -44272 -99202
5553 -99202 51796 33471 60030 43946 -61414 -68985 -127905 -209421 -156026 -116169 -55626 -54434
5541 -54434 -5638 -42843 -89661 -106711 -108174 -123320 -227624 -229729 -240073 -167137 -165100 -154245
5529 -154245 -31850 13963 -102506 -83631 -35728 -49053 -124852 -116920 -111435 -87170 -28163 -4777
$$ packed form
5611B0546j02112j79114Q4262P5395P1769M3153R799j8188L9943J32782l6274
5600A41961q4576j34731q8823K4169J691n4433j0690j2001P1298L7176j7213n0241
5588a76413l8227O0847J8849O5222J02850N9306Q015m0297o7317O5592O2692O060
5576A27179J7002O2908m2369j74526n968P8566K1187r7166l6360J03654J07260
5565A61367r0177j50747m825R2768k349O957L9171M7487j7118J2985j39791n4930
5553i9202J50998j8325K6559j6084j05360p571n8920q1516N3395L9857O0543J192
5541e4434M8796l7205m6818j7050j463j5146j04304k105j0344P2936K037J0855
5529a54245J22395M5813j16469J8875M7903j3325p5799P932N485K4265N9007K3386
$$ plain form
5517 -4777 -70001 -168953 -229030 -257998 -151561 -123126 -80835 -116393 -76385 -83721 -119381 -135222
5505 -135222 -90105 4215 -69523 7675 24639 -407 60204 -7234 24715 484 23470 29411
5493 29411 78352 -42737 -106036 -71280 -69596 -57383 -2081 -8183 16803 2034 -96231 -123620
5481 -123620 4189 71706 37021 40207 85668 97207 29482 82327 107247 -41502 -66324
5470 -66324 -27256 -81102 -45624 -6184 -34093 -193419 -287553 -246338 -152103 -58382 -1608 -160222
5458 -160222 -128616 64371 13990 -27998 -17279 -74395 -92524 -72294 -48047 29347 30612 -104537
5446 -104537 -105444 -67251 28709 120081 92274 97069 110629 71154 -28024 -10859 -57214 -132081
5434 -132081 -23267 -79594 -166094 -225829 -194593 -77888 -38675 77484 74328 99557 97347
$$ packed form
5517d777o5224r8952o0077k8968J06437K8435M2291l5558M0008p336l5660j5841
5505a35222M5117R4320p3738P7198J6964k5046O0611o7438L1949k4231K2986N941
5493B9411M8941j21089o3299L4756J684J2213N5302o102K4986j4769r8265k7389
5481a23620J27809O7517l4685L186M5461J1539o7725N2845K4920j48749k4822
5470f6324L9068n3846L5478L9440k7909j59326r4134M1215R4235R3721N6774j58614
5458a60222L1606J92987n0381m1988J0719n7116j8129K0230K4247P7394J265j35149
5446a04537r07L8193R5960R1372k7807M795J3560l9475r9178J7165m6355p4867
5434a32081J08814n6327q6500n9735L1236J16705L9213J16159l156K5229k210
$$ plain form
5423 97347 178749 186566 60255 22219 36144 90497 202989 251263 106456 108966 171276 154556
5411 154556 119529 85612 20161 -57268 -110717 -129147 3965 108919 133972 83642 88787
5400 88787 120622 10769 -34442 -184311 -207198 -102799 -151110 -101789 -35177 -11260 -11028 1366
5388 1366 -26539 10787 24166 -3746 -32913 -88148 -149229 -206012 -147177 -50177 -12956 60972
5376 60972 37499 45825 175356 109598 120234 131396 198026 142045 -134961 -199452 -123609 -61894
5364 -61894 16806 164347 149487 7391 66377 117950 51003 -35508 -69914 -127985 -210925
5353 -210925 -206932 -163793 -64597 74493 71245 -13715 -25443 -117302 -162012 -183021 -50772 121355
5341 121355 111823 7596 -122773 -97139 -38175 -71798 -29410 -55407 5576 57957 28114
$$ packed form
5423I7347Q1402P817j26311l8036J3925N4353J12492M8274j44807K510O2310j6720
5411A54556l5027l3917o5451p7429n3449j8430J33112J04954K5053n0330N145
5400H8787L1835j09853m5211j49869k2887J04399m8311M9321O6612K3917K32J2394
5388A366k7905L7326J3379k7912k9167n5235o1081n6783N8835R7000L7221P3928
5376F0972k3473Q326J29531o5758J0636J1162O6630n5981k77006o4491P5843O1715
5364f1894P8700J47541j4860j42096N8986N1573o6947q6511l4406n8071q2940
5353b10925L993M3139R9196J39090l248q4960j1728r1859m4710k1009J32249J72127
5341A21355r532j04227j30369K5634N8964l3623M2388k5997O0983N2381k9843
$$ plain form
5330 28114 129501 186558 37258 -71761 -119933 -166559 -48103 42049 72743 107200 136078
5319 136078 87315 100335 111161 73350 50432 106466 90362 11546 -19885 17715 -13309 63413
5307 63413 122348 139705 -11387 -84119 -13346 6447 19664 18252 -19482 62860 82949 63053
5295 63053 -13624 -220850 -284382 -190798 -63394 89136 163857 144693 54459 -46561 -117696
5284 -117696 -121992 -140458 -103324 44444 28430 -54115 -29998 4153 -10057 -130658 -188025
5273 -188025 -70024 56432 68180 16080 135 3889 26352 40772 7858 -145 -112621
5262 -112621 -268181 -263488 -178671 -195806 -160055 -107857 -88915 -89202 -125898 -59528 -22708 -116369
5250 -116369 -27456 -47439 -110784 -186597 -219826 -164306 -21136 98604 124332 183588 85501
$$ packed form
5330B8114J01387N7057j49300j09019m8172m6626J18456R0152L0694L4457K8878
5319A36078m8763J3020J0826l7811k2918N6034j6104p8816l1431L7600l1024P6722
5307F3413N8935J7357j51092p2732P0773J9793J3217j412l7734Q2342K0089j9896
5295F3053p6677k07226o3532R3584J27404J52530P4721j9164r0234j01020p1135
5284a17696m296j8466L7134J47768j6014q2545K4117L4151j4210j20601n7367
5273a88025J18001J26456J1748n2100j5945L754K2463J4420l2914q003j12476
5262a12621j55560M693Q4817j7135L5751N2198J8942k87l6696O6370L6820r3661
5250a16369Q8913j9983o3345p5813l3229N5520J43170J19740K5728N9256r8087
$$ plain form
5239 85501 -127937 -36312 21098 30130 33694 55908 132386 144945 75070 94382 100467 16899
5227 16899 -47976 32759 -15811 -600 -45260 -85157 -20032 15440 -76909 -110834 -139384 -153783
5215 -153783 -135918 -47533 -32776 -167072 -98088 20244 -44272 -75026 -116151 -154298 -82373
5204 -82373 -30588 -3268 -4507 -46338 -53757 -132680 -97923 74139 120143 77010 32235 20808
5192 20808 -84718 -182247 -174437 -90226 25762 -1352 11291 12176 32809 44249 -55515 41013
5180 41013 103666 21987 -12782 -13778 -112939 -187300 -141335 -38578 31620 5002 52370 17199
5168 17199 -125605 -174120 -97868 -63653 -111941 -20250 -40181 -88456 -72435 -131929 -97239 -21937
5156 -21937 40623 -131409 -95826 12576 -33615 -127494 -125442 -37917 9827 -65156 -90139 -54831
$$ packed form
5239H5501k13438R1625N7410R032L564K2214P6478J2559o9875J9312O085q3568
5227A6899o4875Q0735m8570J5211m4660l9897O5125L5472r2349l3925k8550j4399
5215a53783J7865Q8385J4757j34296O8984J18332o4516l0754m1125l8147P1925
5204h2373N1785K7320j239m1831p419p8923L4757J72062M6004m3133m4775j1427
5192B0808j05526r7529P810Q4211J15988k7114J2643Q85K0633J1440r9764R6528
5180D1013O2653q1679l4769r96r9161p4361M5965J02757P0198k6618M7368l5171
5168A7199j42804m8515P6252L4215m8288R1691j9931m8275J6021n9494L4690P5302
5156b1937O2560j72032L5583J08402m6191r3879K052Q7525M7744p4983k4983L5308
$$ plain form
5144 -54831 41452 38714 51043 -19166 -75459 -5297 -11141 19409 -61553 -100351 -132874 -139886
5132 -139886 6896 -39306 -86432 -32604 -18857 3929 103259 116719 44308 2619 17496
5121 17496 -45604 -47994 -31700 -39587 38792 160429 102809 -1821 5454 -53090 -111077 -122140
5109 -122140 -252581 -215629 -179263 -72394 32664 100606 66813 -10521 12512 19492 3245
5098 3245 -94938 -125682 -196044 -270903 -142964 32237 -4828 -10310 -769 -98279 -109103 -32806
5086 -32806 6959 71190 163981 163336 131632 88378 -21486 -48111 -46288 -31685 9754 43242
5074 43242 105024 136852 63288 84834 30378 -25038 -1091 -71904 -43456 119245 125251 117232
5062 117232 21332 -59719 -207147 -193526 -93325 -53720 -19570 13738 -63809 -17665 19559
$$ packed form
5144e4831R6283k738J2329p0209n6293P0162n844L0550q0962l8798l2523p012
5132a39886J46782m6202m7126N3828J3747K2786R9330J3460p2411m1689J4877
5121A7496o3100k390J6294p887P8379J21637n7620j04630P275n8544n7987j1063
5109a22140j30441L6952L6366J06869J05058O7942l3793p7334K3033O980j6247
5098C245r8183l0744p0362p4859J27939J75201l7065n482R541r7510j0824P6297
5086c2806L9765O4231R2791o45l1704m3254j09864k6625J823J4603M1439L3488
5074D3242O1782L1828p3564K1546n4456n5416K3947p0813K8448J62701O006q019
5062A17232r5900q1051j47428J3621J00201L9605L4150L3308p7547M6144L7224
$$ plain form
5051 19559 -106572 -167202 -134104 -172346 -204347 -90552 -5437 89116 147507 122010 10364
5040 10364 -96633 -7624 14303 -38043 -149743 -226579 -174787 -102235 -15352 -33515 27399
5029 27399 -38221 -77736 -140362 -209753 -134523 43415 53477 31186 30991 59030 116309 19906
5017 19906 -31407 86467 17946 -35013 -51470 -50572 -138066 -188344 -190303 -53205 47341 23490
5005 23490 -29257 -27504 -51850 -52782 -55785 -19588 -10554 -43373 49567 58112 53327 -62061 6946
4992 6946 112728 130570 73476 36412 -110645 -173408 -192589 -120185 -68284 -158140 -145804 -154935
4980 -154935 -35 -21530 -19933 -33688 24320 29471 -38252 23284 92443 105741 -44659 -8031
4968 -8031 41532 113710 201451 197503 120152 -1270 -89384 1639 32986 -8490 23323 -2884
$$ packed form
5051A9559j26131o0630L3098l8242l2001J13795Q5115R4553N8391k5497j11646
5040A0364j06997Q9009K1927n2346j11700p6836N1792P2552Q6883j8163O0914
5029B7399o5620l9515o2626o9391P5230J77938J0062k2291j95K8039N7279r6403
5017A9906n1313J17874o8521n2959j6457Q98q7494n0278j959J37098J00546k3851
5005B3490n2747J753k4346r32l003L6197R034l2819R2940Q545m785j15388O9007
4992F946J05782J7842n7094l7064j47057o2763j9181P2404N1901q9856J2336r131
4980a54935J54900k1495J597j3755N8008N151o7723O1536O9159J3298j50400L6628
4968h031M9563P2178Q7741l948p7351j21422q8114R1023L1347m1476L1813k6207
$$ plain form
4956 -2884 -148347 -120775 -95434 -83460 -11479 18076 -45847 -63937 12775 -53101 -90159 -52918
4944 -52918 1277 -5453 -5424 -47070 -70341 -71071 -4999 -5861 -58914 -49619 -138936 -215184 -317407
4931 -317407 -353360 -153589 -53344 33739 62563 19507 25320 58583 72497 68264 -38347
4920 -38347 -45299 -110783 -57438 149027 92424 -12188 -65096 44576 96354 70332 89561
4909 89561 90493 274095 231633 75872 29400 20042 110860 223032 -10659 -176024 -76995
4898 -76995 -22610 -29213 -32324 -85176 -153987 -181215 -123413 25076 213423 167950 137094 98589
4886 98589 86711 167962 98779 12030 -50148 -281189 -273125 -167238 -129185 33934 40619 -66232
4874 -66232 -23298 39728 35203 -13479 -2501 -42046 -172272 -130499 5357 17022 -38450 -100500
$$ packed form
4956b884j45463K7572K5341J1974P1981K9555o3923j8090P6712o5876l7058L7241
4944e2918N4195o730K9m1646k3271p30O6072q62n3053R295q9317p6248j02223
4931c17407l5953J99771J00245Q7083K8824m3056N813L3263J3914m233j06611
4920c8347o952o5484N3345K06465n6603j04612n2908J09672N1778k6022J9229
4909H9561R32J83602m2462j55761m6472r358R0818J12172k33691j65365R9029
4898g6995N4385o603l111n2852o8811k7228N7802J48489J88347m5473l0856l8505
4886I8589j1878Q1251o9183q6749o2178k31041Q064J05887L8053J63119O685j06851
4874f6232M2934O3026m525m8682J0978l9545j30226M1773J35856J1665n5472o2050
$$ plain form
4862 -100500 -28228 -62707 -100082 -38817 83858 105140 56568 -22810 -138962 -201184 -150980
4851 -150980 -99510 -34053 -9427 12613 -60867 -98766 -196339 -198073 -52988 119419 322067
4840 322067 309282 278642 201692 205236 124779 46372 71761 121539 14779 -49624 -35260 -46709
4828 -46709 62658 195936 129123 198654 119780 1507 57206 106702 36572 -50712 -87803
4817 -87803 -18503 8293 -26952 -102950 -16491 65358 92658 85833 11936 -46397 -16309 155955
4805 155955 237617 242118 200849 175440 129330 62607 -23005 -76177 53432 106956 65857 46784
4793 46784 -80426 -170053 -146659 -137932 -72835 -94867 -55234 -13906 -69572 -74906 113811 90620
4781 90620 92017 124060 154595 145782 79641 61324 26664 43850 161849 170673 178164 79355
$$ packed form
4862a00500P2272l4479l7375O1265J22675K1282m8572p9378j16152o2222N0204
4851a50980N1470O5457K4626K2040p3480l7899r7573j734J45085J72407K02648
4840C22067j2785l0640p6950L544q0457p8407K5389M9778j06760o4403J4364j1449
4828d6709J09367J33278o6813O9531p8874j18273N5699M9496p0130q7284l7091
4817h7803O9300K6796l5245p5998Q6459Q1849K7300o825p3897n8333L0088J72264
4805A55955Q1662M501m1269k5409m6110o6723q5612n3172J29609N3524m1099j9073
4793D6784j27210q9627K3394Q727O5097k2032L9633M1328n5666n334J88717k3191
4781I0620J397L2043L0535q813o6141j8317l4660J7186J17999Q824P491r8809
$$ plain form
4769 79355 -4705 -86807 -66942 -124189 -106417 -39798 -58297 -69926 -58607 -59148 -34883 -89255
4757 -89255 -38856 92529 79619 -30391 -123643 -164495 -183707 -141294 -35810 23858 12627
$$ packed form
4769G9355q4060q2102J9865n7247J7772O6619j8499j1629J1319n41K4265n4372
4757h9255N0399J31385j2910j10010r3252m0852j9212M2413J05484N9668j1231
$$ [...]
##END NTUPLES=NMR SPECTRUM
##END=
