##TITLE=Analysis number 318472
Compound Code cc 07113
Project Code adrs
Chemist Name endeavour
##JCAMPDX= 6.0         $$ Bruker NMR JCAMP-DX V2.0
##DATA TYPE= NMR SPECTRUM
##DATA CLASS= NTUPLES
##ORIGIN= Bruker BioSpin GmbH
##OWNER= nmr
$$ XWIN-NMR		Version 3.5
$$ Wed Mar 29 16:14:22 2006 GMT Daylight Time (UT+1h)  MAYBRIDGE\nmr@NMR_250MHZ
##.OBSERVE FREQUENCY= 250.131544655141
##.OBSERVE NUCLEUS= ^1H
##.ACQUISITION MODE= SIMULTANEOUS (DQD)
##.ACQUISITION SCHEME= undefined
##.AVERAGES= 16
##.DIGITISER RES= 18
##SPECTROMETER/DATA SYSTEM= dpx250
##.PULSE SEQUENCE= zg30
##.SOLVENT NAME= CDCl3
##.SHIFT REFERENCE= (INTERNAL, CDCl3, 0, 16.522)
##AUDIT TRAIL= $$ (NUMBER, WHEN, WHO, WHERE, WHAT)
$$ ##TITLE= Audit trail, XWIN-NMR		Version 3.5
$$ ##JCAMPDX= 5.01
$$ ##ORIGIN= Bruker BioSpin GmbH
$$ ##OWNER= nmr
$$ C:\u/data/dgb/nmr/ADRS/1800/pdata/1/auditp.txt
$$ ##AUDIT TRAIL=  $$ (NUMBER, WHEN, WHO, WHERE, WHAT)
(   1,<2006-03-29 16:14:00.58 +100>,<MAYBRIDGE\nmr>,<NMR_250MHZ>,
      <created by zg, POWCHK disabled, PULCHK disabled
       configuration hash MD5:
       84 BC 41 DB A1 6E 1D 46 DA 25 12 A5 C1 ED C5 3A
       data hash MD5: 64K
       EB 15 48 C9 D3 34 13 FD 5E BA 9A F3 AB 31 CB 92>)
(   2,<2006-03-29 16:14:12.69 +100>,<MAYBRIDGE\nmr>,<NMR_250MHZ>,
      <Start of raw data processing
       ef LB = 0.3 FT_mod = 6 PKNL = 1 SI = 32K 
       data hash MD5: 32K
       51 4A 36 78 9A E0 45 30 A0 91 FC 76 30 D3 06 F7>)
(   3,<2006-03-29 16:14:14.22 +100>,<MAYBRIDGE\nmr>,<NMR_250MHZ>,
      <apk 
       data hash MD5: 32K
       97 42 59 A2 A9 6C 0D 6A 5B 1A D3 BB 13 94 E6 FD>)
(   4,<2006-03-29 16:14:15.02 +100>,<MAYBRIDGE\nmr>,<NMR_250MHZ>,
      <abs ABSG = 5 
       data hash MD5: 32K
       F4 2A 03 47 61 ED 14 C6 FD F9 F9 EE A2 E8 DB 42>)
$$ ##END=
$$ 
$$ hash MD5
$$ 07 C1 0C DC 04 1E 17 BE 7E C7 01 F2 1F BD 65 E6
##$RELAX= 
##$RELAX= 
##$RELAX= 
##$RELAX= 
##$RELAX= 
##$RELAX= 
##$RELAX= 
$$ Bruker specific parameters
$$ --------------------------
##$DU= <C:\u>
##$EXPNO= 1800
##$NAME= <ADRS>
##$PROCNO= 1
##$TYPE= <nmr>
##$USER= <dgb>
##$AMP= (0..31)
100 100 100 100 100 100 100 100 100 100 100 100 100 100 100 100 100 100 
100 100 100 100 100 100 100 100 100 100 100 100 100 100 
##$AQSEQ= 0
##$AQ_mod= 3
##$AUNM= <au_zg>
##$AUTOPOS= <51 >
##$BF1= 250.13
##$BF2= 250.13
##$BF3= 250.13
##$BF4= 250.13
##$BF5= 500.13
##$BF6= 500.13
##$BF7= 500.13
##$BF8= 500.13
##$BYTORDA= 1
##$CFDGTYP= 0
##$CFRGTYP= 5
##$CHEMSTR= <none>
##$CNST= (0..31)
1 1 145 1 1 1 1 1 1 1 1 1 1 1 1 1 1 1 1 1 1 1 1 1 1 1 1 1 1 1 1 1 
##$CPDPRG= <>
##$CPDPRG1= <>
##$CPDPRG2= <>
##$CPDPRG3= <>
##$CPDPRG4= <mlev>
##$CPDPRG5= <mlev>
##$CPDPRG6= <mlev>
##$CPDPRG7= <mlev>
##$CPDPRG8= <mlev>
##$CPDPRGB= <>
##$CPDPRGT= <>
##$D= (0..31)
0 1 0 0 0 0 0 0 0 0.06 0 0 0 0 0 0 0.0002 0 0 0 0 0 0 0 0 0 0 0 0 0 0 
0 
##$DATE= 1143645239
##$DBL= (0..7)
120 120 120 120 120 120 120 120 
##$DBP= (0..7)
150 150 150 150 150 150 150 150 
##$DBP07= 0
##$DBPNAM0= <>
##$DBPNAM1= <>
##$DBPNAM2= <>
$$ [...]
##$SUBNAM7= <"">
##$SUBNAM8= <"">
##$SUBNAM9= <"">
##$SW= 20.6930455092707
##$SWIBOX= (0..15)
0 0 3 0 0 0 0 0 0 0 0 0 0 0 0 0 
##$SW_h= 5175.983436853
##$TD= 65536
##$TD0= 1
##$TE= 295.16
##$TE2= 300
##$TE3= 300
##$TEG= 300
##$TL= (0..7)
0 120 120 120 120 120 120 120 
##$TP= (0..7)
150 150 150 150 150 150 150 150 
##$TP07= 0
##$TPNAME0= <>
##$TPNAME1= <>
##$TPNAME2= <>
##$TPNAME3= <>
##$TPNAME4= <>
##$TPNAME5= <>
##$TPNAME6= <>
##$TPNAME7= <>
##$TPOAL= (0..7)
0.5 0.5 0.5 0.5 0.5 0.5 0.5 0.5 
##$TPOFFS= (0..7)
0 0 0 0 0 0 0 0 
##$TUNHIN= 0
##$TUNHOUT= 0
##$TUNXOUT= 0
##$USERA1= <user>
##$USERA2= <user>
##$USERA3= <user>
##$USERA4= <user>
##$USERA5= <user>
##$V9= 5
##$VALIST= <valist>
##$VCLIST= <CCCCCCCCCCCCCCC>
##$VD= 0
##$VDLIST= <DDDDDDDDDDDDDDD>
##$VPLIST= <PPPPPPPPPPPPPPP>
##$VTLIST= <TTTTTTTTTTTTTTT>
##$WBST= 1024
##$WBSW= 4
##$XGAIN= (0..3)
0 0 0 0 
##$XL= 0
##$YL= 0
##$YMAX_a= 359426
##$YMIN_a= -445534
##$ZGOPTNS= <>
##$ZL1= 120
##$ZL2= 120
##$ZL3= 120
##$ZL4= 120
##$ABSF1= 16.522
##$ABSF2= -4.171173
##$ABSG= 5
##$ABSL= 3
##$ALPHA= 0
##$AQORDER= 0
##$ASSFAC= 0
##$ASSFACI= 0
##$ASSFACX= 0
##$ASSWID= 0
##$AUNMP= <proc_1d>
##$AZFE= 0.1
##$AZFW= 0.1
##$BCFW= 0
##$BC_mod= 0
##$BYTORDP= 0
##$COROFFS= 0
##$CY= 12.5
##$DATMOD= 1
##$DC= 0
##$DFILT= <>
##$DTYPP= 0
##$F1P= 14.0000005364418
##$F2P= -0.99999901652339
##$FCOR= 0.5
##$FTSIZE= 32768
##$FT_mod= 6
##$GAMMA= 0
##$GB= 0
##$INTBC= 1
##$INTSCL= 1
##$ISEN= 128
##$LB= 0.3
##$LEV0= 0
##$LPBIN= 0
##$MAXI= 10000
##$MC2= 0
##$MEAN= 0
##$ME_mod= 0
##$MI= 0
##$NCOEF= 0
##$NC_proc= -4
##$NLEV= 6
##$NOISF1= 0
##$NOISF2= 0
##$NSP= 0
##$NTH_PI= 0
##$NZP= 0
##$OFFSET= 16.522
##$PC= 1
##$PHC0= 169.3665
##$PHC1= 5.933814
##$PH_mod= 1
##$PKNL= yes
##$PPARMOD= 0
##$PSCAL= 4
##$PSIGN= 0
##$REVERSE= no
##$SF= 250.13
##$SI= 32768
##$SIGF1= 0
##$SIGF2= 0
##$SINO= 400
##$SIOLD= 32768
##$SREGLST= <1H.CDCl3>
##$SSB= 0
##$STSI= 32768
##$STSR= 0
##$SW_p= 5175.98343685301
##$SYMM= 0
##$S_DEV= 0
##$TDeff= 65536
##$TDoff= 0
##$TI= <Analysis number 999999
Compound Code 99
Book Reference 9
Project Code 9>
##$TILT= no
##$TM1= 0
##$TM2= 0
##$TOPLEV= 0
##$USERP1= <user>
##$USERP2= <user>
##$USERP3= <user>
##$USERP4= <user>
##$USERP5= <user>
##$WDW= 1
##$XDIM= 32768
##$YMAX_p= 459626262
##$YMIN_p= -271831
$$ End of Bruker specific parameters
$$ ---------------------------------
##NTUPLES= NMR SPECTRUM
##VAR_NAME=  FREQUENCY,     SPECTRUM/REAL,   SPECTRUM/IMAG
##SYMBOL=    X,             R,               I
##VAR_TYPE=  INDEPENDENT,   DEPENDENT,       DEPENDENT
##VAR_FORM=  AFFN,          ASDF,            ASDF
##VAR_DIM=   32768,         32768,           32768
##UNITS=     HZ,            ARBITRARY UNITS, ARBITRARY UNITS
##FACTOR=    0.157963299565203, 1,           1
##FIRST=     4132.6476996994, 0,             0
##LAST=      -1043.33573715361, 0,           0
##MIN=       -1043.33573715361, -271831,     0
##MAX=       4132.6476996994, 459626262,     0
$$ Real data points
##PAGE= N=1
##DATA TABLE= (X++(R..R)), XYDATA
$$ [...]
22607 -102392 -127540 -75565 -81727 -41351 44099 53569 43306 61764 73607 52154 59394 76047
22595 76047 71446 11620 -8096 -27998 15744 43874 11496 -19753 -50976 -50784 -57832 -85578
22583 -85578 -80309 -92213 -135116 -91765 -36657 5162 -34632 -48556 -56923 -71513 -106741 -98568
22571 -98568 -25147 -33582 -4340 -34846 -31488 -9886 2814 -73218 -32490 10555 5971 -27503
22559 -27503 -28239 -68184 -43588 -6764 63168 73256 39660 69637 76212 40912 27501 32560
22547 32560 50617 10215 83985 82113 24149 67531 57332 42702 11949 -10946 -21187 39570
22535 39570 66282 22102 -18326 -13201 22466 42998 77320 102406 139798 139327 82969 -23318
22523 -23318 -29336 -15943 42354 68264 51910 21723 37718 32864 -9944 -75564 -58126 -47154
22511 -47154 -31366 -7791 18878 4736 41557 94857 154915 156083 104201 87764 -10012 -13109
22499 -13109 19583 56423 63896 55362 -18024 -69321 -100942 -91043 -78101 -28842 -17273 -4390
22487 -4390 28107 26463 34375 25718 2234 -24377 -18699 8929 52708 101802 71948 23092 7932
22474 7932 16493 54753 82186 68331 64783 87235 98612 90239 -3742 -63258 -143712 -137753 -41568
22461 -41568 -54003 -29389 1381 -21114 13958 6920 43018 -13893 -36363 -51370 -32139 -16623
22449 -16623 13353 19012 -7848 -30820 -87604 -107372 -127429 -69134 3552 -62553 -40160 2485
22437 2485 -14607 -1623 4709 23360 -29677 -82597 -14636 2461 722 -32516 704 -16318
22425 -16318 -94472 -100030 -89325 -74462 -101009 -95585 -47205 -8164 -64923 -84742 -31414 -73951
22413 -73951 -47162 -48626 -1366 -1502 -53837 -48259 -38794 -35599 -20649 -10698 -53678 -76616 -78862
22400 -78862 -76619 -61710 -32238 -35292 -1187 5593 -62215 -78650 -42562 -14556 -4158 -8682
22388 -8682 -27379 -28248 14066 28859 -8674 -4215 -72528 -85644 -28079 -31696 -61843 -32369 81854
22375 81854 106990 58696 80502 37859 -36505 -34223 -117453 -146428 -174309 -207184 -226674 -231671
22363 -231671 -141016 -88547 -71231 -76810 -66259 -18427 31505 56473 68684 87485 35827 19930
22351 19930 25595 47683 72838 14516 -45463 -99110 -83920 -14119 13103 -11214 -22173 -3304
22339 -3304 -218 44786 -5442 -101624 -140125 -116444 -104423 -110320 -75656 -13532 62337 35170
22327 35170 -5696 49630 50529 2414 -22225 2533 -21333 29162 -3520 38826 46380 15166
22315 15166 -8442 23423 -15179 -40843 3746 -5424 -4970 47669 154186 164711 116477 48785
22303 48785 36278 79036 100409 112171 138344 103397 75627 94851 57524 18569 33668 55897
22291 55897 49634 -34023 -87484 -15170 35189 32212 27782 31858 -25593 -27887 -66205 -88834 -39264
22278 -39264 -21960 7045 -14838 -109896 -140236 -118924 -76365 -54116 -53523 -34518 -74959 -115979
22266 -115979 -87946 -95281 -50883 1406 5260 -76811 -63870 -34127 13494 57822 38392 23984
22254 23984 63230 55090 94118 85773 75375 22351 -15026 -5540 42933 -2150 -23321 -7011
22242 -7011 -79131 -80791 -15758 -24243 -69479 -123111 -81661 -24571 -37524 -20078 -17847 17133
22230 17133 69594 43087 -43867 -11914 42538 74358 46029 -15768 -47803 -3342 -7244 -27457
22218 -27457 -54872 -103391 -104998 -111015 -93184 -87486 -83779 -66090 -101827 -140335 -64443 -20953
22206 -20953 -15868 -81154 -119777 -105288 -61444 -36818 -78354 -58336 -17781 -9696 8419 -6001
22194 -6001 20512 80036 89184 31290 -15188 5844 6889 52261 52526 -48951 -1172 40765
22182 40765 40169 130121 168748 151597 132433 63694 -9854 -16546 -12599 -12177 -7025 32111 156882
22169 156882 227925 203960 127087 62833 42303 30945 19467 36876 5863 -4563 38944
22158 38944 44836 21120 -30473 -29414 -8187 -1051 -50971 -57994 -42654 -20691 32619 -25153
22146 -25153 -26033 29943 -6269 -53419 -75371 -70867 -69651 -99300 -137102 -145202 -102677 -84779 -61914
22133 -61914 -50927 -89655 -24922 -8829 -83485 -100800 -85519 -54879 -26730 -5044 27631 50513
22121 50513 -4781 22421 22310 -41231 -31192 -9174 -30 89489 139704 137117 100795 54649
22109 54649 32461 80952 44046 -7434 -58778 -78406 -46715 -6644 -11365 55484 108461 38035
22097 38035 9129 41449 84638 80286 30687 -25731 456 42036 46236 56949 54887 36394
22085 36394 -10460 36190 37695 39961 9315 -21335 -23475 7735 50052 51458 26240 -18637
22073 -18637 -43816 -51577 -72837 -113969 -108660 -163128 -140440 -41050 -7449 -46174 -66319 -87070
22061 -87070 7105 13288 -63408 -84947 -76677 -71736 -57185 31689 99797 78035 2398 -42026
22049 -42026 -76929 -111940 -132507 -94993 -54313 -20884 -73033 -66207 -24518 18236 -1918 -59200
22037 -59200 -73194 -35575 -2059 57050 65846 -5965 -28466 -32708 -67492 -80174 -83947 -87399
22025 -87399 -72079 -47061 -41482 -43882 -27956 -72627 -106828 -86876 -12275 -771 -46003 33488
22013 33488 72280 -2953 -44941 -29864 11604 22245 -14517 -6554 44518 77509 33320 49129
22001 49129 34931 -9391 -58338 -83884 -15397 -24122 -65558 -36004 1369 -10543 -86586 -124304
21989 -124304 -73107 -72417 997 29265 -7790 1311 78887 86871 37844 32566 35013 57109 13369
21976 13369 -75398 -63614 -24659 78031 66593 33042 23715 6567 37554 18918 -10009 -64346
21964 -64346 -28350 -99357 -101130 -90605 -97924 -99966 -98761 -102958 -82387 -64361 -14193 -3505 -20136
21951 -20136 -2664 34664 22042 2120 -27047 -4553 -887 5177 -4251 23133 48309 -10429
21939 -10429 -73687 -51760 -6274 49306 46306 28849 -13286 -17979 27647 44912 28820 39340
21927 39340 58420 61417 -9991 -12333 -31582 -10607 3882 -8190 -25227 -55848 -41485 -52334
21915 -52334 -44696 -38101 -82900 -93889 -45914 -14951 -7678 16605 -65908 -71160 -61293 -43667 -12738
21902 -12738 13158 21702 46254 80979 17074 -6771 -39601 -94183 -119451 -72448 -97479 -117428
21890 -117428 -68016 -52120 -73172 -73344 -32776 -122362 -105996 -48494 -71294 -102090 -138249 -100350
21878 -100350 -62731 -87527 -91107 -54440 8164 63135 120576 130313 160765 114705 20021 -26591
21866 -26591 -29825 -24954 -32016 -36038 -49556 -140296 -92916 -32344 -30014 -32987 -12925 -29075 -71073
21853 -71073 -111599 -103093 -65871 -45890 -47408 -38346 -34972 -7530 -97979 -228217 -271831 -182431
21841 -182431 -133193 -124307 -109338 -83523 -91697 -67387 -65404 -79901 -25772 -24908 -29507 28636 1336
21828 1336 3443 56873 23432 20271 -4504 41505 85122 53724 42687 94691 123693 53275
21816 53275 -40969 -65324 -84919 -185836 -159893 -94729 -85250 -99736 -70410 -75577 -8623 8223
21804 8223 -12975 19634 43241 24338 32439 19609 21288 -27442 -73944 -56803 -23865 -23212 8941
21791 8941 48034 -32855 -49509 -25670 -68343 -145635 -126665 -87098 -37771 18383 -23454 -73432
21779 -73432 -64515 -21719 -2991 6458 -34192 -71614 -44872 68093 63370 36556 -34136 -65905
21767 -65905 -81218 -112386 -5473 10857 -6006 -51930 -84006 -97871 -119464 -162253 -107206
21756 -107206 -111134 -72290 -26829 -35926 -66272 -133816 -140914 -64815 -13142 17498 -3875 -32795
21744 -32795 -46449 -16426 -5233 -39718 -101141 -105131 -28540 -55640 -35870 20690 -35550 -79639
21732 -79639 -107784 -29022 27421 -22903 -37373 -25398 -1915 21184 24465 -35082 -72786 -65201
21720 -65201 -59308 -62335 28617 38454 -3409 -72162 -80402 3528 49764 39740 30568 25592 16023
21707 16023 -12316 -76331 -69573 -56488 28155 -634 -47893 -58428 -25265 28231 25713 -17139
21695 -17139 -1296 36076 72794 56307 29867 13860 10224 41016 -12945 -57644 -66496 -66751
21683 -66751 -3357 24619 23364 -53160 -47375 -5314 -21613 -46867 -6023 -10806 -5302 -8546 -9819
21670 -9819 -27928 -32477 -36786 -57009 -43015 -25363 -56086 -111688 -79580 -50947 -68445 -83855
21658 -83855 -134198 -130699 -45780 -58013 -35485 11293 -16069 -31903 -57735 -58913 -77153 -125681
21646 -125681 -79742 -9517 73073 51207 -3427 -23208 6741 -2941 -64259 -54181 -26254 1081
21634 1081 -27790 -2233 -968 9721 -67472 -63472 -45020 -88193 -53341 -40710 -86427 -51704
21622 -51704 57027 128682 179849 145772 89362 36387 53472 10130 -44641 -62487 -95663
21611 -95663 -72609 -93281 -68650 -40912 -1385 21393 -6653 26228 114195 117539 16632 10223
21599 10223 65260 78688 107036 74811 96187 49093 31520 74073 77279 -14047 14067 25519
21587 25519 -16760 -67441 -81830 -86153 -73056 -6009 19332 71640 78995 85299 45766 44921 86580
21574 86580 74182 40815 90015 166099 91067 33779 27253 23024 23438 -31965 -8876 50976
21562 50976 44740 3139 -20725 62788 64448 -15110 5751 7845 28209 75761 68181 -54132
21550 -54132 -142214 -104115 8418 16023 -25152 -781 -3243 -5352 20850 52077 64616 99737
21538 99737 73988 9992 53805 51621 464 22412 106116 98603 76291 70173 -1375 -77268
21526 -77268 -49937 26623 77640 70213 68358 35470 22560 29657 30886 18707 -9472 -38125
21514 -38125 -48181 -5734 63717 140105 164909 200247 169418 44791 -18734 -47313 -16575
21503 -16575 -30573 -20091 35333 99400 82955 50678 34722 17221 -44354 -70819 -72810 -99667
21491 -99667 -64550 -5876 5880 32077 23671 -1727 18013 43797 -1878 15436 85325 11198
21479 11198 -84172 -129064 -86022 7709 -51463 -70683 -55438 -55862 -75745 -110750 -77963 -43059
21467 -43059 15317 14246 39716 -5604 -20745 -34717 -21221 -11344 -18564 -29491 -66991 -13242
21455 -13242 -12646 -76557 -97573 -84571 -76318 -20954 -15074 6936 39470 36930 594 -953 -91449
21442 -91449 -131649 -66011 22621 50385 11593 13535 30046 -10929 46399 59823 49968 61850
21430 61850 30099 10300 26708 17823 -40274 -79559 -91889 -99311 -103227 -61450 -22823 -40762
21418 -40762 -84503 -100733 -113479 -102693 -91732 -74856 -18419 -3382 43770 11426 4129 91117
21406 91117 115857 77079 37079 32173 -20118 21003 76528 62397 32384 32477 25674 -21297 -34645
21393 -34645 -5578 -13297 -69767 -66580 -83744 -47034 -18639 -7711 -9393 8209 24040 -11121
21381 -11121 -28806 -73479 -160920 -189045 -152590 -83796 1945 11331 -20989 -52618 8647 44849
21369 44849 33325 74934 83560 55479 60144 52519 6098 676 14284 10301 -5739 -6062 -12947
21356 -12947 -58476 -107399 -62804 11356 33210 18407 -29854 -52946 -73479 -27218 -81223 -77989
21344 -77989 -57972 -114891 -113789 -128083 -147666 -97750 -42032 8604 -40869 -53574 -15901 19489
21332 19489 -64263 -101335 -41052 -64568 -67187 -28429 -37270 -62975 -141286 -143827 -100499 -69107
21320 -69107 -37275 -21764 -78562 -92664 -41736 18338 81891 117163 86549 55184 45273 -44707
21308 -44707 -38260 25617 37626 28837 -65415 -137923 -82360 -27360 14557 61856 1375 -38235
21296 -38235 -63001 -62489 -59701 -48186 -69870 -53302 -34706 -2423 10613 16794 26701 92986 94177
21283 94177 58319 3438 -42654 -57691 -100929 -45592 -40296 -29769 -33773 -10887 31168 13597
21271 13597 -30266 -20897 2092 12945 64133 73850 34630 98017 169031 177537 87256 26528
21259 26528 22916 -61092 -66756 -5803 -37893 -41170 51907 96679 11167 -99942 -88686 -5305
21247 -5305 -3727 -36884 -2540 90440 50007 4865 33627 85638 -25192 -94348 -101866 -90994
21235 -90994 -97882 -111464 -96633 -27170 -57171 -92868 -113622 -96867 -34106 26041 78711 94496
21223 94496 83610 100317 68391 32113 -1565 -84545 -145788 -202026 -168639 -98998 -86319 -88067
21211 -88067 -70963 -24376 -34874 -24729 12810 47554 87349 150183 127775 103464 94373 79396
21199 79396 60078 62470 50031 10616 56741 93703 105547 60484 22878 66781 32749 -50563
21187 -50563 -55052 -60029 21693 79662 10109 -41150 -58204 -60382 -42165 -92303 -129368 -132370
21175 -132370 -69599 806 12804 29005 -28046 -45728 -16630 29462 12385 -43546 7762
21164 7762 76690 126621 117216 92857 41563 14415 -2057 4120 -10403 7172 685 -27174
21152 -27174 -757 -45914 11266 14706 51155 118937 77404 32268 70397 -3953 7806 -7284
21140 -7284 -92293 -87726 5408 8742 11940 -693 -755 39577 21766 34331 68067 40447 -51290
21127 -51290 -77234 -40228 -41413 2625 67048 83747 96838 58093 19751 -48498 -18307 36209
21115 36209 63856 97948 46843 33649 28576 -30148 -22478 302 26447 51923 -44381 -42728
21103 -42728 -27801 -41189 -69175 -34969 -44522 -78429 -119372 -123571 -76867 -50112 -20109 -16001
21091 -16001 -26063 -22694 -32366 -36740 -9623 29746 -22192 -57365 -24821 8902 48155 18525
21079 18525 26669 86277 58576 5533 -12103 -68392 -118439 -137735 -69025 -20349 -75673 -118818
21067 -118818 -85396 -99917 -60117 -81885 -135460 -165614 -141568 -50607 -16599 37216 55882
21056 55882 -12975 -73597 -83077 -73313 -44447 -36779 1627 21309 -23942 -76546 -67225 -39020
21044 -39020 -69972 -119310 -135024 -37449 -61347 -116820 -101954 -70699 -50532 -41523 -74713 -73474
21032 -73474 -84621 -120366 -153902 -169545 -146401 -151735 -204275 -190941 -147821 -87259 -93270 -133045
21020 -133045 -44941 16083 81645 3560 -56463 -77599 -90555 -35318 -13893 85226 85565 45204
21008 45204 26276 29586 -16795 -63961 -46770 -87661 -113343 -101379 -107726 -151297 -119652 -33035
20996 -33035 -45477 -98651 -73264 -34879 -57200 -4646 34999 17074 26674 91455 25673 -50674
20984 -50674 -53812 -106823 -124434 -41045 -28053 36288 13329 2500 -29018 -32035 -79050 -105215
20972 -105215 -17637 7541 -55927 -9137 36546 -38139 -13562 16280 44497 46364 -15037 -11018
20960 -11018 -22946 2695 6475 19283 13772 8546 20668 -13674 1964 58721 20424 -195
20948 -195 4450 -6665 -5229 -53933 -154663 -127817 -53820 21134 62939 20225 10032 -8990
20936 -8990 -40710 -68472 -28137 -11418 29416 53350 20502 38933 69967 103548 80220 26659
20924 26659 -48408 -120706 -135706 -91819 35186 77535 25680 -16777 -5551 -13157 -16428 -12029
20912 -12029 44313 -15362 -20456 -23755 9029 -14481 -3026 -34021 -81158 -38490 6022 -24547
20900 -24547 -55090 -78807 -74980 -62848 -54799 -79915 -73551 -61658 -138285 -169648 -150661 -155366
20888 -155366 -145372 -178905 -160097 -146329 -43934 15092 10352 3746 -10593 40063 19823 -75604
20876 -75604 -79451 -30884 -706 7141 68829 -12172 -26091 -8756 -24366 -68997 -88133 -80823
20864 -80823 -37769 -11821 31222 72610 24283 -15928 -45594 -78667 2645 7505 -27362 -43344
20852 -43344 -58956 -15706 -11175 -23082 -70537 -89083 -53744 16158 82316 30261 -29094 -12657
20840 -12657 221 -4136 -7954 -36207 18978 -30267 -113059 -39464 -19722 -74702 -90932 -134363
20828 -134363 -186204 -150934 -14183 26042 11424 48840 23754 45936 49234 61130 83621
20817 83621 5121 -89509 -126995 -77354 -25255 63401 7984 -47808 -28726 15978 8933 -58302
20805 -58302 -122981 -86094 -30561 60406 60212 -47055 -84284 -60738 -43091 -84029 -60877 -28822
20793 -28822 -15935 15051 7246 15422 10576 -25923 -38975 -66264 -64758 -48274 -93283 -69323
20781 -69323 -11448 -14792 19921 47416 23856 39316 7989 19154 49941 43380 104426 112569
20769 112569 97520 10392 7262 -47844 -70555 -27608 40316 62213 18409 63631 83953 124648
20757 124648 82020 17374 -54180 -46046 23657 23422 -6237 -2868 8260 -3763 -38878 -84
20745 -84 -25107 -30515 -31431 -34811 813 74691 103449 122772 22035 -61201 -87123 -88434 -35806
20732 -35806 -33473 -50332 -60466 -79747 -80401 -52691 1623 55923 41577 13778 -14010 -29850
20720 -29850 -43968 -138230 -71497 -26583 -55264 -49354 -29902 21146 -12133 -22039 -89929 -76745
20708 -76745 47168 5096 -127551 -151717 -115446 -152043 -164156 -99385 -13244 23373 -2383
20697 -2383 19720 -3125 -57401 -70413 -70111 -70776 -45320 24897 -7766 -68478 -111871 -94709 -16899
20684 -16899 4042 -50836 -38717 -48548 -43011 3722 24171 40093 -2148 -25596 987 38654
20672 38654 27103 -20243 -87426 -50524 71238 63429 -13222 31220 71822 56838 93193 135683
20660 135683 76814 70199 52730 55505 8003 44341 107759 109201 -15664 -24855 -24684 -78482
20648 -78482 -120972 -89766 -54707 6294 36451 -18952 -110656 -93232 -55294 -68056 -94288 -91274
20636 -91274 -84399 -127108 -182873 -150957 -115133 -59032 23106 -5034 -13088 -56228 -57037 -35706
20624 -35706 -47734 -562 35561 22525 -28850 -97224 -29720 48418 31527 38221 23578 11147
20612 11147 12880 29232 -18988 -27730 -7507 13019 -34543 -30472 -52074 -22004 -67754 -31589
20600 -31589 21562 26255 56198 71954 56437 79943 87999 71567 62354 18797 12611 -19209
20588 -19209 -66712 -134856 -81154 28870 967 -49870 -86989 -28028 5115 32929 100962
20577 100962 146040 119183 115902 3498 -21185 -16379 40404 42581 30687 14247 3215 849
20565 849 -77477 -84937 -29588 -26037 -6592 41808 49003 -3760 -54640 -107970 -135147 -133309 -96594
20552 -96594 2375 -4356 -8236 22384 80545 52917 33937 40572 21493 -95464 -174232 -120135
20540 -120135 -47982 -12509 4121 44511 34971 -16500 -44850 -80522 -137429 -217001 -157683 -91106
20528 -91106 -119112 -136957 -116300 -52766 -66709 -13663 44214 62499 -12657 -25491 5766 -45830
20516 -45830 -45259 -25280 -7171 -14439 -31222 -79445 -113387 -13014 35426 6419 -44659 -27088
20504 -27088 -60482 -35250 11118 -16983 -4222 -40234 -107742 -65561 -84622 -125621 -65631 52587
20492 52587 -13347 -86635 -80756 -36402 80474 37264 -66339 -86322 -56148 -42278 -5393
20481 -5393 -12406 -52127 -36991 823 -10675 -57360 -84524 -83603 -32653 -21198 -19758 18128 50397
20468 50397 128177 87748 3419 -41039 -98691 -61873 -50935 -45917 14531 -3516 -858 -11706
20456 -11706 -38712 -41728 -68469 -88927 -30534 -33603 -98919 -45632 30879 59251 19003 34049
20444 34049 13594 -50666 -74787 -30351 -26338 -106726 -149002 -135883 -128046 -97893 -75604 -127254
20432 -127254 -205092 -139835 -75758 -79795 -151011 -104687 -48930 -41183 -4979 11087 64362 75550
20420 75550 61100 -6589 -42976 23600 -22774 -75869 -103217 -63838 53902 130075 144257
20409 144257 91063 26393 -25644 -32078 -23051 27532 30454 -8136 -51047 -40273 -21964 -53701
20397 -53701 -41465 -6036 -41309 -38203 -1371 -20672 -25478 -66472 -60671 -46599 -80514 -55142
20385 -55142 3327 40155 53552 6793 -57307 4154 64892 62755 -11549 -71287 -20431 36473
20373 36473 77825 68539 42588 94167 89312 16946 -18023 -16455 -16647 -78914 -117251 -88199 -17480
20360 -17480 -7761 -19182 2814 -67679 -89214 -104668 -72699 -82865 -159161 -131854 -112945 -48147
20348 -48147 20159 27066 67434 24023 -84168 -90265 -52769 -11019 -59802 -78289 -83955 -80518
20336 -80518 -78940 -68752 -42552 -34100 -18991 26062 50071 79345 85656 -32692 -93248 -89689
20324 -89689 -60866 -40337 -58444 -60342 -98115 -57318 -29680 -7730 26249 35318 54619 88594
20312 88594 47457 60784 81297 79639 35772 -38229 -118915 -110658 -88993 -70014 -60719 -16641
20300 -16641 -12035 -37836 -32402 -26855 -71779 -61083 -22203 -53391 -91121 -78944 -103541 -96288
20288 -96288 -64771 -78205 -53507 -51164 -79764 -99532 -99758 -41833 19039 35891 86530 107785
20276 107785 -5672 -22890 22869 28689 3541 8407 624 -34147 -41258 -48309 -2968 -30765
20264 -30765 -55150 -42513 -31257 -37094 -70363 35747 68261 92849 44999 22750 39725 67904
20252 67904 67312 -23567 -47195 -4647 -37326 -44469 -81736 -47750 25327 44552 24387 18826
20240 18826 -39004 -39236 31669 60114 5840 101265 174006 103378 54006 19131 -2273 42853
20228 42853 22739 -33372 -64709 -14414 37303 29253 30660 49851 46951 48378 18770 -77680
20216 -77680 -23399 -161 34198 25985 -36463 -72648 -85776 -37773 -52807 -25027 -86923 -79209
20204 -79209 -30988 -63023 -65303 -63051 -81675 71268 56003 -94747 -203337 -161385 -39159
20193 -39159 -22828 -22634 23727 41709 39016 6882 -48811 -12389 -15169 -41534 -2825 -36551
20181 -36551 -59284 -33044 -31187 -26611 -68559 -36132 -4683 19669 14602 -54673 -77542 -139217
20169 -139217 -112143 -54329 11815 8082 -18468 -22426 -64295 -10867 17621 12605 -10792 -15015
20157 -15015 27225 -35183 3771 56726 7247 -1904 22404 93913 20669 -26913 -47680 -43087
20145 -43087 -46418 -11202 16286 23062 -17505 -63619 -45075 -12126 -85304 -151699 -102840 -30806
20133 -30806 56909 42711 -5654 44653 69914 64975 -23942 -33513 35699 44979 16578 35388
20121 35388 55150 16952 -25896 -2647 19536 38805 103632 90970 45393 -5125 -9912 -21727
20109 -21727 -50130 -34994 1238 22509 -49113 -11099 2158 -31922 -1527 50297 -6222 -47505
20097 -47505 10212 32461 21868 -54842 -115683 -124574 -126560 -41045 30636 135824 98555 1504
20085 1504 -48695 -65616 -95669 -105825 -61386 -23405 -67520 -83127 -54788 -41892 2825 -32973
20073 -32973 -76921 -82886 -104480 -63967 -101557 -61217 4894 -33380 -43551 -13973 47273 -1545
20061 -1545 11662 21296 385 -56763 -54018 -80815 -113382 -67449 -80186 -124724 -69834 -10395
20049 -10395 3759 -26755 -23087 -32543 -46884 34415 33479 76303 124235 79715 98022 80507
20037 80507 89393 102837 76481 18344 50141 92283 21086 -14323 -39996 -63423 -33063 -24911
20025 -24911 4280 -56094 -39534 -38418 -77929 -86752 -114175 -131334 -111486 -99817 -126554 -105444
20013 -105444 -89216 -99213 -130182 -63169 12443 19220 1015 33377 103758 69860 37630 -15954
20001 -15954 -22809 26976 44478 13718 -40998 -25278 14734 -25956 -95416 -75138 -63414 -70941
19989 -70941 -46665 -81896 -57985 -81167 -48005 -79805 -122108 -45338 -19951 -90706 -103212 -80319
19977 -80319 -29596 39035 20499 -6376 -53483 -159446 -142534 -61277 -22244 -12452 5375 -7563
19965 -7563 -44228 -97027 -77072 -31957 583 29219 44442 41942 45004 28790 -12672 -43277
19953 -43277 30911 45852 92212 35656 34617 34797 -11435 -18510 -40631 -68556 -15486 -32316
19941 -32316 -16427 -28990 -57859 12547 94822 120486 75252 50647 -3405 -41056 -4267 7095
19929 7095 41342 11020 16729 -4833 -10403 7481 39073 -13336 -60258 -56809 -73415 -16218
19917 -16218 78155 125913 90331 63233 69177 64458 42080 32033 -17835 -52032 -40994 13478
19905 13478 26688 -39621 -73079 -107300 -96310 -64759 -55428 -55233 -59033 -90355 -125632 -130459 -53659
19892 -53659 -35407 -43341 -71057 -133639 -128585 -68050 -62318 -132293 -166477 -164246 -167089 -133368 -57660
19879 -57660 62449 73855 5753 -64638 -7051 12119 -35365 -83596 -15419 45578 -3616
19868 -3616 3387 58919 31192 45430 60561 19005 67434 42863 6642 -16772 -26063 -42934
19856 -42934 -127221 -138190 -123018 -140270 -79786 -1620 -13042 -79408 -101630 -71905 -41068 -57230
19844 -57230 -84226 -85074 -41189 -18199 12053 17801 -11547 12491 -4865 -70851 -49581 -30173
19832 -30173 7977 3040 -43128 -61654 -44569 -81695 -74385 32250 15597 -6445 14077 31500
19820 31500 16629 -35070 -124694 -185546 -158726 -58768 26459 -7482 -65020 -48748 -60883 -67038
19808 -67038 -32093 4325 -24346 -85861 -91372 -84286 -8848 7473 29234 3620 -8149 -19981
19796 -19981 19821 48828 105797 80099 23471 25083 41917 79631 78335 89869 17455 -87041
19784 -87041 -150290 -164806 -144953 -45254 -25924 -42935 32695 -16325 -64766 -72322 -98159 -94536
19772 -94536 -94143 -81305 -85197 -51690 -28643 -70509 -102461 -51711 -35784 -33247 -8690 41550
19760 41550 93008 82788 94024 19742 -12103 2193 31153 64330 29538 28769 55593 44634
19748 44634 3265 35119 22085 7268 -54044 -122336 -50220 73398 -2937 -31569 -85134
19737 -85134 -93410 -132310 -172872 -126746 -102314 -44721 -44524 -131411 -59099 -19346 16353 24235
19725 24235 -29675 -48638 -80310 -52552 -56036 -89673 -76322 9965 37292 32346 29849 46733
19713 46733 84639 65042 -3197 -76888 -99748 -71751 21268 28436 15773 26393 19560 24717
19701 24717 51768 62336 31879 -33932 -117481 -126778 -98520 -34704 -12092 46077 55346 35339
19689 35339 24402 18682 -48694 -81136 -33968 -6767 -50411 -91300 -65929 -52404 10388 55668
19677 55668 5245 10734 43981 25934 42517 57013 63226 63171 3719 -11349 32512 70693 -16342
19664 -16342 -64843 -32755 -73785 -78342 -50988 -38427 -38128 -28981 19288 29935 -34858 -54645
19652 -54645 -47594 -58606 -87125 -79262 -26525 -47408 -27937 -13663 70 26794 13732 -64507
19640 -64507 -52067 -12777 17627 82446 60828 78039 5031 2391 -7811 -38778 -47757 -74456
19628 -74456 -71204 -47003 -5296 -39419 -49796 -81529 -70918 -24389 38005 53958 13583 13281
19616 13281 109970 152721 129841 52515 -10360 -48704 -59553 -33661 -67372 -54572 -67491 -71298
19604 -71298 -54280 -55632 -18386 -47379 -62520 -72586 40023 75547 53078 -41749 -118041 -103529
19592 -103529 -50113 503 19929 -29469 40691 134492 95467 6666 37869 64931 41534
19581 41534 14436 60348 62917 56080 44175 22806 -7292 -87651 -26633 15050 28085 -24054
19569 -24054 -26282 48250 5135 -100701 -138424 -139392 -163497 -134422 -89317 -111711 -128232 -118522
19557 -118522 -63596 -34385 -47149 -60831 -51807 -39097 -44528 -30747 -63689 -129875 -153110 -135595
19545 -135595 -164497 -93327 35478 21504 -27175 -155142 -177107 -46558 37694 49332 14318
19534 14318 32199 724 1940 -24717 -64335 -56458 -39493 -42281 -50969 -58655 -49512 -34945 -39565
19521 -39565 -62305 -30734 -15538 -37943 -27340 28689 56035 -7236 -36127 18834 85176 74682
19509 74682 24101 8867 37530 116075 134408 56482 50243 74994 61833 -5731 25120 48606
19497 48606 23305 1290 5734 28232 -2470 26868 56080 72508 36577 1733 -46762 -57758
19485 -57758 -60528 -118924 -120581 -166782 -164645 -84504 -39339 -30180 -1262 -38820 -92477 -108508
19473 -108508 -35072 30548 26401 7321 -3104 -38528 -66844 -104424 -61609 -49375 -127198 -55468
19461 -55468 36984 -40195 -84354 -61306 -89507 -38273 -9288 -66283 -100832 -40762 -28612 -108651
19449 -108651 -122387 -132328 -65599 -38013 -19731 -60189 -27400 24229 23842 -14679 -29113 -49070
19437 -49070 -15710 -16326 -26685 -18012 34873 60532 43275 23306 -29056 -70548 -61069 -62216 -17474
19424 -17474 7872 -335 -48452 -65947 14496 76161 151806 95645 73785 14109 59677 65340
19412 65340 17952 32172 -413 -56452 -52345 -34716 -10100 -23168 -76750 -50282 -85550 -98552
19400 -98552 -117924 -112382 -81188 -73600 -70357 -24478 -13444 -26880 -111469 -168348 -161623 -93537
19388 -93537 -110601 -93284 -62062 24037 40585 -37833 -27611 -5052 -41346 -24067 -39696 -78591
19376 -78591 -71924 -21570 -25065 -44288 -52886 -68463 -39846 -81734 -117098 -107919 -128650 -87690
19364 -87690 -39436 -31297 1073 -81844 -71687 -13860 -18192 -85314 -127397 -69996 -139313 -160811
19352 -160811 -123607 -28031 -42215 -47929 -38866 -58121 -90224 -133967 -151565 -147619 -105670 -116889
19340 -116889 -121976 -99242 -11080 -17581 -4867 11632 88 -52900 -95395 -56434 -24986 -81319
19328 -81319 -41791 48199 26548 -26708 -40500 -13154 -10886 84791 50468 40182 118439 196049
19316 196049 298163 374285 565665 744666 894263 1014306 924086 718913 587829 441515
19306 441515 332272 317488 377171 412159 476957 593104 701646 854818 1000806 1103145
19296 1103145 1132057 951174 679039 524103 435126 322381 234006 92185 7141 -19734
19286 -19734 23207 101637 77080 26728 70574 69770 89678 131445 135422 112207 132614 127634
19274 127634 110579 61550 100338 68972 -24977 -45404 34345 117262 66324 -10722 -57110
19263 -57110 -9567 24437 93235 76976 90875 72435 63364 55017 86493 75091 84332 96024
19251 96024 95092 81435 74792 88108 27823 -95 9546 -31221 -50109 -37603 24362 26822 -12302
19238 -12302 -12644 -23445 42774 106675 170007 154497 141517 125303 63722 -19858 -51156 -46491
19226 -46491 -32315 -20924 22339 -6667 40233 61021 15967 -9799 1423 18266 19913 25534
19214 25534 -14811 -32178 -6995 6919 -43469 -44019 -44899 -27194 -44039 -15605 100435 104397
19202 104397 102881 82768 72451 20027 -14411 21615 60444 -30953 -50456 -54683 -99948 -107341
19190 -107341 -94308 -53323 18331 -4716 -59631 -34684 21934 -15175 -68803 34951 57969
19179 57969 24048 49736 16111 44828 1106 18181 82916 12785 -26573 4147 80579 45309
19167 45309 3080 -27213 -35327 -12157 -51446 -33393 -189 24762 -14433 -98986 -79605 -91083
19155 -91083 -105058 -79892 -71467 -50861 -40535 -76322 -122230 -87920 -115216 -155932 -180632 -107597
19143 -107597 -8923 6619 51357 -19800 9559 76183 58971 -7514 -18696 42199 85562
19132 85562 110545 84787 29908 17532 15159 -37418 -71529 -59925 -26510 23701 104071 126047
19120 126047 90746 115394 86458 27423 -16858 -19866 56229 112900 86974 77158 99013 88134
19108 88134 18755 -49424 -69682 -58532 -50158 -47658 36187 -15149 -78801 -128255 -121999 -71239
19096 -71239 -87805 -108551 -114019 -101423 -91203 -62889 -57356 -39639 -31102 -105097 -90439 -27794
19084 -27794 -52059 -34894 29814 95243 106863 38108 48653 65807 102398 131347 104290 -12092
19072 -12092 -1115 105057 83549 64628 71274 86662 42508 98969 181135 194390 205386 266955
19060 266955 293082 393895 531076 588901 632743 691606 658490 649988 622283 643290 641804
19049 641804 585878 538345 532189 573417 703961 786011 811454 808456 762033 737091 656270 547719
19037 547719 482155 335134 229982 230580 217959 218411 210893 169494 104161 -32437 -20877 51500
19025 51500 60074 38331 91389 94585 179323 115148 21443 -37813 30438 28512 -11765 45791
19013 45791 74457 87120 84898 71972 66079 -820 10779 35893 32941 25105 -20191 -99179
19001 -99179 -144800 -104454 -42531 -9877 -18543 -24950 -86951 -137053 -98843 -64706 -31999 -83182
18989 -83182 -114901 -68354 1934 46453 26472 33283 8161 25521 106216 143414 169710 161324
18977 161324 125159 99564 70585 87412 180001 278166 262721 316802 360649 395270 471179
18966 471179 506190 481925 481101 408287 391290 384888 360224 266495 157435 130412 155087 109904
18954 109904 -15089 -79278 -82592 7301 -2446 15332 49642 95510 84236 95771 123901 224194
18942 224194 259544 213517 169788 199848 206699 138538 56645 67769 67853 106800 122619 50180
18930 50180 48051 -3307 -6920 87669 198994 182693 159410 196308 301666 378303 407216 426509
18918 426509 487931 497343 581620 674711 712262 668384 589497 489809 447993 485831 498650 441596
18906 441596 342886 287256 242991 182654 155665 109010 84833 79649 76146 68748 72128 115059
18894 115059 80707 80085 82373 106761 112092 86802 95830 121015 48087 -2339 46653 146305
18882 146305 189211 135518 179802 220582 186936 151548 109754 100898 68978 102959 110407 76906
18870 76906 94813 90480 44159 61656 27963 13790 9163 29045 -6129 11339 44335 65673
18858 65673 -5515 -58221 -56055 -44274 13392 -7626 38518 -51893 -121028 -90606 -12805 -21558
18846 -21558 -11647 -8245 -9205 22358 7752 -2306 -1731 -6020 -65099 -27718 989 10163 24125
18833 24125 44293 40329 50417 75277 54767 72105 34457 20445 -21126 -16888 -33293 -88575
18821 -88575 -64317 -23207 30466 76643 91541 144629 169376 169805 178124 220475 308392 327006
18809 327006 315749 293144 291372 303288 275122 277697 294264 327825 362582 425479 412293 425781
18797 425781 377862 312648 287828 294720 320223 229749 177842 209031 227964 151541 185041 176696
18785 176696 165856 140975 64174 128189 178316 199165 182111 180485 199452 151348 148582 189875
18773 189875 197215 130737 91023 170462 164493 206469 289900 248789 362264 702201 915888
18762 915888 800337 554468 305094 198978 233957 277133 287303 241810 193930 172933 126854
18751 126854 103822 186573 266616 277711 233678 199212 218039 228226 295748 245742 208877
18740 208877 208134 147301 124376 255990 297410 288580 379752 380891 385108 354107 384026 421749
18728 421749 478524 489409 459412 455766 552456 684843 781373 885029 1046153 1239927 1347977
18717 1347977 1417423 1369328 1196306 1080812 1028582 1039685 1042976 1114906 1299757 1456495 1691778
18706 1691778 2001332 2409578 2796939 3146225 3414252 3559160 3623827 3525665 3399891 3332582
18696 3332582 3307321 3359268 3522200 3837067 4453255 5380260 6437744 7793054 9603114
18687 9603114 12012272 15262351 20043539 28056066 42645212 68838924 103710846 138091657
18679 138091657 162974667 169651019 159397600 132088611 100645245 73935994 56981030
18672 56981030 48812749 46561912 49766193 60979566 85001044 118158859 150881318
18665 150881318 173906180 178228268 165397381 135391049 101470519 72440599 52851176
18658 52851176 41181441 33556319 27919546 23503535 19960336 17163280 14985633 13127394
18650 13127394 11677413 10610687 9837263 9400564 9090523 8779769 8480935 8169155 7663675
18641 7663675 7067555 6595877 6130324 5739859 5393436 5022529 4618348 4298744 4026451
18632 4026451 3747283 3471250 3263578 3082834 2950306 2834759 2803716 2856181 2892616 2830914
18622 2830914 2750601 2673537 2531541 2321801 2077337 1892151 1729598 1585095 1501079 1459209
18612 1459209 1386666 1319670 1388910 1466281 1495836 1458656 1468008 1476057 1413316 1343133 1284080 1229009
18600 1229009 1186674 1254091 1237322 1250544 1259378 1288300 1238998 1220137 1240114 1327745 1371612
18589 1371612 1386705 1504655 1565197 1699557 1896475 2067543 2218371 2364700 2534812 2714754
18579 2714754 2899010 3079280 3184351 3382551 3663472 4053833 4485264 4897368 5460080
18570 5460080 6219421 7213742 8404086 9951578 12019444 15184328 20228943 27582289
18562 27582289 36388696 45528051 55334062 68277077 83375204 96229033 103354727 107282088
18554 107282088 112530430 117973508 120732489 118932800 115887886 114177546 115962932 121082955
18546 121082955 125845626 127100583 124242469 122176187 121130570 117726408 107955430 93930612
18538 93930612 80326821 68901750 58434372 47895450 38225512 30545962 25202995
18531 25202995 21441602 18551965 16262226 14483608 13021350 11806295 10675788 9746617
18523 9746617 8962106 8272832 7715032 7196308 6730385 6220529 5782404 5472071 5157421
18514 5157421 4829591 4486199 4109166 3787248 3543681 3341261 3207899 3046395 2860862
18505 2860862 2658415 2490894 2366320 2194386 2054284 2028646 1944850 1881204 1813918 1721800
18495 1721800 1671294 1609920 1553105 1516181 1494758 1510385 1525234 1455240 1359779 1322124 1402374
18484 1402374 1457970 1488680 1573948 1707044 1857816 1915112 2045966 2129304 2295496 2494463
18474 2494463 2666671 2779741 2983147 3230541 3533632 4032870 4662000 5454559 6566275
18465 6566275 8187386 10650720 14804454 21783286 31814811 43465122 53285431 60028999
18457 60028999 65378317 72138909 80649779 87157023 88673730 84197234 77816204 72095995
18449 72095995 67716834 61239623 52105607 41312487 31683780 24439204 19542459 16131402
18441 16131402 13653651 11886378 10496307 9468167 8590168 7816929 7198972 6652549 6182985
18432 6182985 5844206 5562482 5336596 5147327 5060351 4992124 4867396 4813242 4775540 4714396
18422 4714396 4742348 4752327 4777442 4919017 5170638 5593780 6064944 6668033 7508936 8650560
18412 8650560 10330350 12914091 17200545 24581822 36243843 51283029 66532350 77574777
18404 77574777 85463222 93101152 104050033 114726416 120868477 118203888 110212228 101392363
18396 101392363 94736058 87600973 77002061 63094619 48692492 36982132 28738593
18389 28738593 23202436 19410710 16650122 14535691 12845953 11457574 10165035 9118920
18381 9118920 8350954 7725347 7155663 6620134 6089962 5556128 5151385 4741315 4390319
18372 4390319 4121264 3821829 3505490 3205779 2946252 2781665 2605746 2420368 2286517
18363 2286517 2176795 2066467 1999461 1839841 1723304 1598081 1507446 1412347 1354203 1295699
18353 1295699 1244144 1148202 1094304 1044175 978358 942021 992525 1003924 941286 832629 766319
18342 766319 768765 812305 819305 757245 657117 564720 549286 573634 567777 521137 498156 540073
18330 540073 509929 455489 382328 378449 416618 388803 335720 326511 324600 365378 283743 198084
18318 198084 227404 399485 489217 437679 429420 424934 399494 352221 311036 340279 403485 456364
18306 456364 486329 463405 442876 419571 369671 311607 362833 343891 284898 267968 274001 351530
18294 351530 401039 438393 357179 288781 358732 356958 385127 406435 334686 320176 285302 215445
18282 215445 178009 223325 257098 180024 94858 58944 83076 117262 167767 156864 140715
18271 140715 134505 187451 201161 184963 139080 116598 95021 145331 87300 88535 124468 173216
18259 173216 232337 172214 126721 51654 101100 149098 195714 240434 272307 214786 239184
18248 239184 286951 325801 328384 303536 360498 392241 372076 326204 318880 340577 379444 368732
18236 368732 406042 460179 382585 369068 381115 352374 321411 346489 302446 279305 248071
18225 248071 286997 262660 227062 222957 165816 185625 233099 195162 169199 152430 209738 214973
18213 214973 175769 114355 185172 210463 270438 323700 338627 360022 321802 306363 319358
18202 319358 299263 300006 348023 328480 374549 390724 322475 270149 235649 240081 294024 245359
18190 245359 271980 300850 249351 258478 253883 274266 290512 314620 347445 306527 223797 217100
18178 217100 280277 337973 345015 330474 299474 233711 239370 274171 289330 223843 267112 349736
18166 349736 388152 374702 381249 393728 440895 448472 469992 499707 512404 510589 456789 476744
18154 476744 641237 790296 850120 933068 1018248 1071325 1172606 1292873 1321620 1274189 1279607
18143 1279607 1300673 1374045 1481170 1602229 1743319 1935494 2063580 2232858 2367432 2367193
18133 2367193 2399272 2514930 2714238 2948501 3298896 3752098 4261870 4791413 5444229 6339241
18123 6339241 7534312 9229935 11784206 15920557 22559817 31650545 42213681 54968902
18115 54968902 68541778 78557005 85484449 89414175 88628860 85939242 85008339 91830916
18107 91830916 116619275 163677571 191382680 186692708 161081494 132388879 116230923
18100 116230923 104703167 92132872 78397566 64271273 51587414 40983292 32532490
18093 32532490 26494374 22272190 19199987 16834953 14960104 13438688 12235437 11227571
18085 11227571 10452259 9708062 9095864 8599198 8231665 7937417 7582037 7321933 7102918
18076 7102918 6961556 6843808 6798006 6854412 7053208 7316709 7777133 8610422 9855509 11936677
18066 11936677 15500273 21011922 27866301 35810805 45275874 53736528 59060406 62312516
18058 62312516 61979494 58108439 52723670 47541509 44384947 43818927 45468352 50048141
18050 50048141 56303581 60575190 62617822 62415941 58241360 51471052 43393338 35347527
18042 35347527 28198846 22297606 17962810 15115903 13223603 11784192 10573152 9465494
18034 9465494 8565534 7702221 6889796 6235345 5655217 5155087 4745656 4463272 4251373
18025 4251373 4180004 4175727 4031440 3753423 3502668 3128387 2810195 2558495 2360481 2243393
18015 2243393 2165118 2064588 1995306 1862852 1768011 1609777 1512544 1432849 1366557 1329874 1213838
18004 1213838 1083561 1048040 1041411 966627 848833 803585 779895 748499 662079 625686 592800
17993 592800 585694 496628 439960 523281 585456 487590 375580 272616 270594 272377 253420 251744
17981 251744 314000 368360 417692 445296 437881 354732 316197 335761 287911 273706 273283 215700
17969 215700 197355 206826 281271 332723 333425 342457 454958 518301 562359 576793 550555 520385
17957 520385 511406 568509 597777 621035 640007 690747 712946 708126 642894 639558 642760 621949
17945 621949 646408 600455 509244 473387 493796 468304 422394 403461 457465 488394 566685
17934 566685 646006 761486 721782 667904 731473 803129 797748 783916 793246 743898 676456 669630
17922 669630 625036 554228 511707 430373 387904 329207 321358 269806 185789 167149 244755 265691
17910 265691 231478 201961 264776 272595 197545 197224 237474 191564 156345 203880 205435 208373
17898 208373 107748 101409 210868 243487 233576 174398 133790 85323 53638 59932 85766 103441
17886 103441 133266 140526 161722 135113 171469 323288 417874 426440 392519 426987 513864 520072
17874 520072 577600 553943 569498 544140 466934 436845 368405 347750 299400 298193 332533 228768
17862 228768 223878 158867 160398 213685 266441 335580 408790 414456 387652 525698 666387 776541
17850 776541 807985 767192 675282 689615 775500 824320 796667 701083 552824 484118 527545
17839 527545 639145 703860 848298 808081 611668 551896 636713 805570 876742 771135
17829 771135 596125 468845 344728 279215 302600 283513 322590 315168 346154 309120 299892
17818 299892 295875 237553 265938 315908 272313 186173 159708 215197 180212 153598 108924 106192
17806 106192 95033 22903 5086 46825 156093 135491 82262 88520 146482 142517 124167 65359
17794 65359 15966 47659 145060 174724 180924 117119 89592 55740 49312 36476 77675 127313
17782 127313 166878 206147 165875 97946 200783 208096 204786 221886 184225 136314 157234 182205
17770 182205 229015 199523 192099 219113 196526 126355 217623 342710 340499 287972 200085 210706
17758 210706 226970 192627 135481 180194 178397 84648 67538 152250 158325 113160 59663 75561
17746 75561 69598 29684 50048 -5022 -1523 20487 39335 107639 136968 89957 106254 98760
17734 98760 63044 133855 174245 116221 139596 212845 315132 279099 207254 228143 263508
17723 263508 247277 199961 162562 177357 243662 298613 299432 225096 192359 175566 207264 322518
17711 322518 334852 284333 194513 190213 173517 178665 148523 145508 210113 162487 102451 96950
17699 96950 97384 96725 117327 58340 -27198 -28531 -56678 -11108 39116 33238 82386 123415 206266
17686 206266 220946 117711 124930 187062 220114 202879 168149 126234 147849 189758 155538
17675 155538 184743 242714 249047 239719 388206 421259 488615 654028 833168 973917 966740
17664 966740 865946 842573 899378 870390 750659 674318 596943 530168 413361 344580 312051
17653 312051 264645 261592 242615 198113 216870 156045 87218 82192 147494 181801 123201 80193
17641 80193 142306 137742 94772 9487 -33574 -54883 -72026 -15570 66525 93937 76759 92213
17629 92213 133937 123755 110449 79686 91706 156986 134762 110409 79548 66303 96964 15299
17617 15299 7527 124961 197581 214461 250870 304511 341981 290427 211694 140859 124893 241410
17605 241410 332121 419823 446997 532277 520171 465086 445795 425262 426454 390848 297959 218823
17593 218823 243848 312821 228417 127340 121247 102673 105915 69467 52087 55801 33649 20858
17581 20858 -31888 -27047 -62046 -30030 -11410 4155 38392 59170 43236 14307 66418 106918
17569 106918 153606 213498 197718 203444 178115 195761 245046 298573 316408 319950 355764 393058
17557 393058 343367 353103 384149 315389 310603 394024 397574 414920 469733 485370 503661 459998
17545 459998 396231 380140 362564 313168 253920 235163 228393 168703 56465 81945 70322
17534 70322 23775 94066 111233 91620 170145 189119 160983 136659 211618 365029 556194
17523 556194 736049 793397 803078 715979 589360 469139 313891 214546 181845 178687 155042
17512 155042 213819 282514 243460 246451 329277 374361 345878 391832 363520 398042 274743
17501 274743 188318 223712 256297 286248 222768 128964 105668 94416 120438 124349 108061 128194
17489 128194 116201 142144 154639 156896 151493 107650 97061 148704 186720 226709 257542 245708
17477 245708 183836 224889 210392 261611 286262 254855 334757 446605 480569 476556 534891
17466 534891 633165 675122 640679 506602 361485 365582 293649 235758 160359 165035 224641
17455 224641 255007 286582 240393 246079 207603 215728 255137 309828 372572 322536 225242 175324
17443 175324 191896 235846 314079 466020 659474 724002 588883 401172 359386 280032 213459
17432 213459 163095 126506 148505 173825 215061 208875 172159 254509 285870 247820 195774 191864
17420 191864 204578 200061 245424 267781 251314 244476 278579 317073 376663 420035 398754 349635
17408 349635 286310 259974 280966 215136 143815 191667 306056 234455 162341 239273 319940
17397 319940 312799 269621 268238 291372 213786 166650 170004 189581 133795 65243 69206 95759
17385 95759 71241 18260 -61211 -70037 -76939 -28944 -15341 30387 72738 101700 134823 105806
17373 105806 142606 229890 204033 161624 123501 103471 60414 29578 27435 48150 143516 120308
17361 120308 80246 63469 45130 79366 89662 83406 200664 290222 287040 261252 215005 159844
17349 159844 206511 223496 211677 233716 275999 263001 273887 268732 286016 293157 357603 393301
17337 393301 399769 486592 482279 478605 514204 603839 718296 839823 1002705 1230048 1309797
17326 1309797 1186298 1159177 1310612 1436280 1584711 1656598 1684102 1693496 1727725 1925365
17316 1925365 2355348 2788946 3051972 3078342 3194465 3514543 4191233 5007172 5572046 5883242
17306 5883242 6216775 6883565 8082977 9920959 12401510 15830836 21378854 31279863
17298 31279863 50727766 83677467 114119367 120219662 106904417 89094115 85800385
17291 85800385 103923555 127841081 130841433 112948487 87000027 69000135 65289618
17284 65289618 76681495 103744788 129014843 130840240 114513914 94912029 90292422
17277 90292422 106722209 127975993 127781132 106604388 76763891 53058552 39506768
17270 39506768 31723347 26387179 22307663 18983942 16352112 14321029 12862190 11898365
17262 11898365 11118307 10344100 9612588 8933777 8396094 7942830 7378728 6772394 6307930
17253 6307930 5957122 5484408 4911325 4462765 4133381 3845078 3577684 3520860 3507339 3372840
17243 3372840 3132332 2925240 2791247 2627905 2558029 2472948 2239009 2009499 1817072 1609641
17233 1609641 1422906 1319145 1253221 1160380 1110759 1064709 982691 953151 942467 878649 842318
17222 842318 873363 853597 794431 711122 666282 680164 681314 713880 642128 540832 560267
17211 560267 546342 423254 401935 456449 506305 440213 411519 400811 417350 411618 366137
17200 366137 350095 334203 350543 393797 402078 417926 327302 287813 314142 270623 277855 274133
17188 274133 316515 316069 304116 315458 266369 260103 321562 332942 240378 153358 166121 257636
17176 257636 241276 205292 171108 154871 147965 213822 212443 148365 79687 83041 108444 141248
17164 141248 92166 32260 36175 9129 16392 21285 61290 160623 159397 54429 -21120 -32702
17152 -32702 7262 69600 90684 47272 12227 52930 52124 -29128 -21726 69861 28813 47095
17140 47095 82265 47116 16086 -2165 68618 112652 101990 164583 164785 121165 121878 162287
17128 162287 216662 256555 308635 318018 252231 175426 131903 130664 192255 186442 172550 99170
17116 99170 156821 195233 179823 276443 324103 241081 156371 107942 49929 35564 53597 51919
17104 51919 -10709 -15608 83396 95568 -46720 -60732 -16607 77719 99095 93213 65298 95897
17092 95897 65890 20837 68777 93323 72916 38039 34641 112178 96432 89010 146408 179273
17080 179273 150161 81941 51437 51535 83976 152085 160354 118025 73016 62944 11765 2148
17068 2148 70304 98912 78640 125591 56016 54719 108873 70286 106867 133707 65555 36522
17056 36522 20802 -58586 -81680 2983 99233 93034 61727 76329 120993 110818 135720 152562
17044 152562 115928 90921 96269 97224 147536 162498 123082 108770 70845 40924 27692 91530
17032 91530 76681 14369 -10683 40871 28548 27323 29338 18243 -8486 -65157 -77119 -82239
17020 -82239 -9377 13234 80963 117221 112605 109844 48007 75621 44644 8534 -29802 -55487
17008 -55487 -19735 11103 57057 31417 15857 18740 67680 96700 42422 37177 85742 4222
16996 4222 26469 50912 103851 75513 25123 -45981 -17285 16745 832 2750 51731 69591
16984 69591 131581 92985 59909 95118 64790 59631 32184 25662 19972 26222 53053 22567
16972 22567 30233 20657 65423 102081 66610 43286 93562 142262 184026 179038 147586 150371
16960 150371 123270 89206 130663 154042 201820 256531 288983 230568 248005 226302 246997
16949 246997 204773 218036 208938 204265 162110 112888 95528 119922 61368 11207 96992 101919
16937 101919 76144 44501 35984 32 -32795 -21310 -9633 16709 50790 3676 -3508 85541
16925 85541 110675 100238 41378 99482 61606 -3754 74394 80650 86586 40016 -33145 -34019
16913 -34019 -28204 -35567 -15662 -15125 -52702 -42725 -42210 -3994 38555 31944 33244 38622 42827 28906
16899 28906 68022 84471 31518 36131 28535 19628 16438 8382 67826 55896 -36620 -2177 -4001
16886 -4001 20564 36624 13662 52397 83470 84070 131068 94620 77974 105309 126017 61513
16874 61513 57581 103012 95132 34054 18755 19716 -4383 -14815 33416 71128 109417 100293 85255
16861 85255 32636 13668 -39076 -47338 -26749 -14031 -13910 46508 59964 20374 -31290 -48777
16849 -48777 -14941 -38430 4743 19536 49512 1732 32723 21591 51513 82547 10312 -32800
16837 -32800 415 42292 -2710 14557 75715 138238 184563 217747 101158 46004 78856
16826 78856 62944 -3694 -51579 -90730 -128466 -89014 -72225 -58822 -67012 -61737 -36534 -5340
16814 -5340 48027 26486 71041 72433 -4953 47845 86700 84157 97336 63324 11341 -8171
16802 -8171 29029 128287 110429 39957 -44030 -50888 -1367 471 -37348 -136719 -194999 -100862
16790 -100862 -31949 2492 14917 52669 84656 115329 83310 70142 16625 57052 119914
16779 119914 53806 29596 -27340 -32219 -8083 -55415 -94904 -112800 -93943 -78888 10239 79221
16767 79221 -13432 -74907 -81847 27510 82534 30945 58883 79007 40382 22589 -29064 -27703
16755 -27703 -16941 88637 82433 21509 3489 -25298 37274 56208 30388 28625 -30 6034
16743 6034 5682 74805 78392 39576 83197 222395 282977 369366 470165 613900 689875 659779
16731 659779 552339 462753 471936 583419 625665 589720 506702 373255 394869 398386 506623
16720 506623 681440 732787 635337 513885 467448 604305 708790 750875 680944 548490
16710 548490 409728 288367 244000 154539 101935 82496 52725 117726 152709 135318 96327
16699 96327 35182 -29268 -56885 18390 35945 61280 34917 45964 49707 54676 106768 76269
16687 76269 30490 24039 11654 5985 -10013 -5040 913 -4383 26077 32865 -22815 -62217 -9137
16674 -9137 21856 -64393 -54125 6802 48801 27114 56459 85815 118568 151320 176160 110289
16662 110289 116034 116973 127724 128634 85960 13769 -107781 -162426 -114606 -64492 -727 49598
16650 49598 85402 73310 31622 31436 67702 70329 87284 31392 -83270 -124656 -89727 -93237
16638 -93237 -142344 -132447 -112814 -16228 31511 9824 -28739 -23956 -2620 -51002 -90570 -50619
16626 -50619 -45072 -31149 -50950 -33887 775 77055 40203 27468 53332 42087 14551 18769
16614 18769 21268 -30116 -39326 -111932 -169565 -132340 -43760 -5524 -8990 54432 125991 109310
16602 109310 29886 -50347 -69570 -32245 -25528 -53233 -10104 -49249 -49744 -18943 21198 77673
16590 77673 55008 -9035 50994 79363 2323 47662 92802 72111 83112 80665 21930 -20455
16578 -20455 -1416 61467 146441 152889 69845 -32727 -64783 -12773 -7487 -37771 -21360 12671
16566 12671 -3973 -10693 3981 -750 -50075 -38707 -41690 -54559 12617 -15694 -57783 -40942
16554 -40942 -9815 -61985 -62793 -4888 3984 37965 97952 72486 45135 47453 32144 13686
16542 13686 26696 25486 -14529 -51290 -3981 35956 22763 39709 57007 39454 18917 -16295
16530 -16295 -82827 -101644 -123216 -147618 -87399 -32181 -19899 -64759 -65984 -56982 -88109 -44971
16518 -44971 -469 68838 55723 56949 95897 30854 26174 60406 88734 60218 64535 30551
16506 30551 -19426 -57549 -46823 -14041 -20806 -100969 -92525 -37506 -55173 -88817 -141488 -117999
16494 -117999 -79642 -29902 15321 72320 67263 98563 87701 17009 25819 26881 -44271 -64065
16482 -64065 -688 49129 54491 29127 -29788 -33506 4171 20648 15768 31796 20809 -4786
16470 -4786 -67517 -86172 20884 75358 141249 175463 113416 53989 99164 121551 120179 88584
16458 88584 51406 19675 21483 -14449 -38519 -29098 -57179 -108821 -116119 -59144 -82612 -134652
16446 -134652 -183458 -176447 -128008 -123804 -101217 -150016 -155877 -122032 -55751 12847 63768 90273
16434 90273 100858 27333 18093 16969 -1512 -60171 -155896 -131267 -65123 -50593 -60112 -69017
16422 -69017 -99053 -88586 -36054 3004 9409 -83439 -49138 -57565 -128588 -87586 22021 -4002
16410 -4002 -17963 53764 23586 68571 88864 59327 -11628 -78587 -102530 -52975 13761 51668
16398 51668 32663 36677 -30031 -34514 -1361 -2509 21837 37196 27944 107199 102857 55952 -21364
16385 -21364 -47013 -49398 -51330 25504 42112 8965 -15790 -60169 -70958 -39760 -9850 72907
16373 72907 59817 56480 -541 -55211 -89498 -40645 48767 46985 16190 45778 617 -68302
16361 -68302 -113780 -115791 -70198 -59411 -53777 -48684 12571 100488 45828 -19282 18694 73945
16349 73945 21962 46919 56298 22204 -37559 -116373 -106326 -48234 -21322 -59587 -18875 -12584
16337 -12584 -5050 -51563 -125200 -156389 -160065 -116379 7982 37385 46279 52215 75156 56728
16325 56728 63058 57461 -10300 -49329 -158082 -123801 -90939 -64612 -53165 26426 6801 -53844
16313 -53844 -13538 23569 -9699 10714 -10408 22538 45124 -17458 44713 153979 184511
16302 184511 77140 -4310 36812 95934 122740 122014 51485 22885 31071 53070 95197 84525
16290 84525 -23153 -28533 -69903 -101551 -42257 -26194 16812 -7181 -49544 -109646 -203021 -213092
16278 -213092 -104182 -3799 -31582 -60784 -89954 -134556 -123150 -88105 -132660 -110364 -123792
16267 -123792 -108651 -88022 -106803 -71690 18265 102944 131249 87794 83232 88076 112733 91009
16255 91009 69759 13408 -56944 -48554 24424 75190 58727 36983 41495 93493 71505 5279
16243 5279 27371 6356 -83755 -40002 46920 25063 37519 42552 3981 -30646 -26280 23660
16231 23660 16361 23526 17496 -2197 6871 -1295 71973 105081 4576 10484 93615 136136 90824
16218 90824 -321 -70462 -43182 -17881 41203 9255 -60570 -62522 37971 96652 127849 149491
16206 149491 70942 26890 57018 32255 -41468 5131 59954 45244 25869 30332 -37069 -34751
16194 -34751 16193 45403 58975 74837 61815 65580 81239 79801 70349 93732 26116 12582
16182 12582 11873 10282 2308 -21054 -63082 13255 -2688 -63637 -38820 -8585 37375 75589
16170 75589 14114 -90544 -74698 -22546 -4631 31297 51939 49633 48090 -24261 -87469 -47355
16158 -47355 -53555 -31334 2610 84357 42923 29733 38670 54571 105347 108331 136795 78292
16146 78292 33263 -20347 -46981 -89704 -46521 -12459 11275 51509 49317 30053 -42421 -74478
16134 -74478 -32995 -61830 -119435 -135436 -88559 -27619 -8853 10466 -9534 92306 118291
16123 118291 10035 57882 66002 74461 38043 -36653 -85014 -28644 -22387 -33583 -57104 1688
16111 1688 94947 123481 119630 4580 -1612 9894 9307 39937 30820 63353 95490 81605 -9497
16098 -9497 -119233 -24483 71022 46037 30254 63114 52147 25531 -92304 -128146 -90129
16087 -90129 -69678 -44713 -7315 45063 75485 63291 69348 32724 -12116 -11090 -38237 -26873
16075 -26873 -39208 -144977 -166875 -121641 -122180 -89370 -111178 -70693 -45891 -65562 -64079 -56813
16063 -56813 -18460 3248 21020 27141 44597 87959 90920 9369 26187 66829 20103 4457
16051 4457 -3998 -71375 -89119 -96081 -70947 -44599 -78939 -139198 -168949 -165829 -126237 -74994
16039 -74994 -65699 -28103 -47854 -65862 981 37431 79603 74261 72965 96263 30461 43668
16027 43668 64841 72622 55465 115093 181438 134949 99706 67242 73909 106741 61952 27582
16015 27582 51239 19916 33124 26051 -9 44030 73371 -28700 -76345 -71751 -49015 -7324
16003 -7324 -28514 -34911 8442 16591 69176 155320 109633 5942 -60276 -37120 -5149 9199
15991 9199 -37070 -13185 -5662 3361 -2234 4464 -10476 -7496 -1420 4549 69028 -24384 -103335
15978 -103335 -100186 -143227 -118767 -97672 -81889 -17386 -55656 -51178 -12318 64027 65115 95659
15966 95659 85010 16824 -44225 -20917 4211 84049 94512 83904 60745 -1910 -60421 -29570
15954 -29570 53691 95285 88461 122847 183226 176718 61780 14210 -10122 -24293 16069 18090
15942 18090 55926 28862 -9647 -30909 16062 89760 83213 124332 146914 85639 70691 35052
15930 35052 -21777 -41646 -59721 -37614 -51792 -62091 -15722 -57316 -112755 -77249 32445
15919 32445 57274 24327 -10450 6752 -15887 -16126 394 -7307 -18190 6246 -28026 -12568
15907 -12568 -32902 9500 29019 29428 32920 -1030 -69528 -145967 -141348 -96906 -41487 -57567
15895 -57567 -48911 15777 64524 103525 107504 81700 56347 86201 84648 28201 3449 12220
15883 12220 28745 -4089 -72729 -81882 -1246 30861 -20710 -52823 -28700 -51356 -39242 -45072
15871 -45072 50006 63602 80238 25406 51890 123458 -17384 -104785 -93360 -111449 -101828 -51571
15859 -51571 -84587 -101025 -115078 -100292 -110805 -94800 -62930 -47274 -85583 -73933 -42541 13456
15847 13456 22734 66178 55053 -66490 -128552 -137664 -102153 -109831 -77142 -90441 -27322 5151
15835 5151 -8544 -23101 -29030 -17359 44509 51854 35791 -35769 -89838 -56729 -53617 -75196
15823 -75196 -80364 -104336 -100577 -82659 -41269 -14023 20573 -35647 -100281 -122375 -127099 -53852
15811 -53852 -10516 -42042 -221 18595 29385 5071 -16594 40354 72037 85807 116338 128270
15799 128270 115837 50273 -39430 -103567 -96622 -68579 -85302 -70283 -62538 -48577 -30130 6405
15787 6405 24921 86321 135870 175292 156648 126763 73666 15494 14727 -19551 -56784 -25349
15775 -25349 83294 153440 84733 -24406 -39222 21968 -49563 -117527 -65385 4830 47097
15764 47097 41835 7032 6878 86834 113669 93801 71206 -27421 -24880 -17353 -28082 -54214 -36283
15751 -36283 35198 60480 60415 -11357 -54753 -66711 -38795 37107 -17403 -73874 -66513 -65978 -94544
15738 -94544 -41614 20971 -28420 -48581 -30891 -41019 15276 -21105 -82684 -108469 -93313 -29437
15726 -29437 -42738 -68996 -88999 -27347 -38630 -48101 -89200 -107717 -39852 43303 39772 41035
15714 41035 -24428 -71166 -101925 -84606 8672 25253 9206 -10772 -14848 18093 32393 49955
15702 49955 52245 -24352 -91691 -75214 -12189 27470 85671 115384 109008 132560 132894 100021
15690 100021 61663 20287 14955 41804 -2101 26773 68433 46132 28140 -8218 -113449
15679 -113449 -132566 -100715 -8636 25577 -45774 -41867 -52175 -14067 -40409 -65558 -55803 -36248
15667 -36248 21477 36171 -37530 28489 31166 -33094 -44242 -12010 9853 -6715 20094 -13201
15655 -13201 -38934 -41839 -16258 20371 -6818 -19661 -18679 33976 51123 25057 8785 16745
15643 16745 20579 72009 107886 106792 116021 40580 31825 75757 78542 -72272 -119115 -6879
15631 -6879 62675 55924 92645 120267 75717 43474 31810 52233 67453 57075 30731 43630
15619 43630 49972 70613 31041 45364 43020 10189 -14130 17480 23004 3029 7893 -52009
15607 -52009 -70938 -20550 -13253 17450 13096 -17385 -25244 -75469 -119251 -86076 -42010 -14723
15595 -14723 19449 -46540 -63854 40420 -21351 -39129 -60355 -83875 -125457 -155997 -134008
15584 -134008 -86364 -5388 41961 8984 -29098 -73288 -78900 -54080 -57884 -67260 -65531 -75925
15572 -75925 -85000 -120183 -154603 -157742 -139703 -73639 -31660 -9568 -19367 -31135 -7927 12371
15560 12371 -12902 -45729 -18399 -32628 -85088 -77928 -55623 -26738 -5431 -38087 -99523 -114563
15548 -114563 -100988 -141965 -151961 -138006 -101028 -66694 -32356 -37335 -43661 -20050 -41905 -16803
15536 -16803 12927 -1316 16146 35762 82525 93705 29057 21272 68664 34328 32983 44840
15524 44840 63174 26528 -45513 -121257 -111782 -45012 -75650 -114807 -85478 -2889 29830 -5179
15512 -5179 -25952 -15387 -1333 10046 -38629 -114978 -80013 -7050 -36637 -78175 -71729 -76427
15500 -76427 -22019 -26724 2091 26380 -26700 -81468 -80952 -53692 -83958 -132260 -126505 -66353
15488 -66353 -44650 -17723 51294 63812 87141 96085 10470 -81704 -166666 -173277 -163715 -14530
15476 -14530 137456 63763 -41642 -7464 -20675 5380 55378 83974 33919 129251 213351
15465 213351 164075 95738 61692 69894 50060 35532 53015 82309 30115 -56963 -115587 -87081
15453 -87081 -45696 -2675 25020 7614 52464 94504 71902 78042 109978 62903 58482 48841
15441 48841 31984 79093 72405 69955 18242 -36482 -63646 -87586 -38308 -14510 8166 55626
15429 55626 82901 145023 121666 46600 -14197 -67898 -101281 -77283 -95762 -67606 -94107 -90422
15417 -90422 -107256 -108322 -120515 -39089 40879 86073 83869 6766 -62355 -76822 -80738 31107
15405 31107 43911 28905 14014 13878 -1280 -35524 -45998 -101262 -143062 -125411 -88549 -57721
15393 -57721 -25653 -11380 -14171 -20866 -24137 8100 -15732 8516 22648 -7488 -63631 -111492
15381 -111492 -176065 -121872 -69680 -52028 -49144 -33905 -76843 -70862 -24996 12940 57166 69729
15369 69729 52590 44891 15458 57633 21000 -21621 -14336 19097 22275 -3224 21296 2092
15357 2092 11263 34580 27960 -31894 -52017 -17397 3901 18893 -34556 -41548 -40076 -31441 -75849
15344 -75849 -53479 20294 -24669 -66045 -11855 74437 51204 35595 12954 14893 -21084 -66995
15332 -66995 -40212 24552 38958 26226 35578 86202 46429 -72764 -63903 -70105 -26115 50995
15320 50995 45843 2980 42780 50479 27714 90133 110156 69730 26266 86518 59310 -19455
15308 -19455 -50770 -32610 11709 23330 -10307 -40975 -106903 -121226 -34982 -58457 -60427 -87257
15296 -87257 -120035 -67496 -38337 -47221 -38246 -50516 -104646 -89811 -29296 38574 80186 30868
15284 30868 -38950 -48203 1751 -5065 -14549 -52383 -80040 -74964 -74689 -145904 -102778 -42641 -14626
15271 -14626 35788 6221 -15678 -53014 -52771 -38826 -24143 -18158 -14594 17810 -55876 -101531
15259 -101531 -102569 -130630 -107313 -35984 46602 40265 20221 -6251 32040 -10426 -34176 -46226
15247 -46226 -16513 -43651 -33838 23861 102887 70043 -27940 -52199 -85650 -22826 92886 110081
15235 110081 109712 33367 25405 27727 32952 119289 123333 44928 -21663 -29086 -16391 47067 56180
15222 56180 47345 103131 112613 44235 9283 75357 80338 76849 52024 -37017 -41724 -60811 -78849
15209 -78849 -34739 -30651 32852 78456 -2415 19959 2656 -107880 -124544 -92840 -33086 -18764
15197 -18764 -57606 -71090 -55590 -133066 -178672 -122602 -90014 -73602 -20233 -32207 -52478 -95763
15185 -95763 -154410 -168045 -115579 -98787 -86703 -48348 -26425 10155 -14718 -23048 -6271 -13601
15173 -13601 -1690 -10139 -48190 -97210 -64657 -4977 59568 78463 25372 -15032 4620 -49218
15161 -49218 -25830 -6959 28346 128077 115946 78197 -18546 -120946 -119216 -108820 -74987 -44621
15149 -44621 -50366 -88622 -31280 21587 70652 75394 44071 15041 37716 58606 142967 126220
15137 126220 38757 -20198 -39111 -80821 -33746 -32129 -43373 -48829 -72350 -33617 18096 -27214
15125 -27214 -4759 1363 3050 59558 44859 -10887 16279 381 -40993 -39655 -76216 -100858
15113 -100858 -66169 -119113 -118765 -47224 10320 43502 33081 53181 91094 53550 29254 33609
15101 33609 57685 20728 -17839 -38236 -31857 9306 9736 47425 75201 14487 -30762 -27912
15089 -27912 21093 49594 147389 155605 106389 150529 102587 -1891 49617 111318 41992 -24742
15077 -24742 20476 38505 69369 32141 39198 66633 34478 -2855 -43211 -72972 -67201 -117631
15065 -117631 -85103 -25161 40478 70148 104052 55981 -15291 -25734 -6113 -42014 -17614
15054 -17614 68804 99542 14063 27949 46055 -31345 -112312 -86396 -43446 -52750 -111458 -92885
15042 -92885 -41951 -9094 4577 -71578 -111859 -48564 -52270 -35215 -43912 -15350 36517 -3939
15030 -3939 -82406 -60227 -48583 -93617 -100469 5595 21844 -63897 -27707 12489 7923 -31603
15018 -31603 -2202 45135 71363 45236 62445 47005 -702 -22555 -53322 -93778 -120322 -86403
15006 -86403 3771 13218 -53551 -84749 -42219 -22969 10250 -35497 -49571 -26696 -11104 -40673
14994 -40673 -96086 -109230 -44004 -10211 -23626 35283 87191 92732 -16077 -46763 -7616 -90905
14982 -90905 -96935 -65169 -15003 60515 81156 48880 -71124 -128200 -9705 12725 33202
14971 33202 43095 -43026 -93247 -108201 -32950 -34885 -39820 -10289 37820 4798 32707 37958
14959 37958 -34431 -112762 -120306 -61113 50065 58189 28430 13641 51886 48144 -26014 -53252
14947 -53252 -57221 -39048 -17682 -34915 4390 -39561 -45074 52210 141633 129152 104853 -27151
14935 -27151 -76626 -100444 -65842 21934 -13101 -88988 -86417 -58857 -78327 -39498 -18840 -60878
14923 -60878 -51622 -19178 40169 54053 -35240 -39178 16308 15319 -13931 -2509 28394 39183
14911 39183 18846 903 60255 94224 -13258 -62775 -33528 -2479 -39448 -1418 24692
14900 24692 59216 40418 -19082 -44634 -4415 -48820 37126 50756 -24496 -58999 -103539 -57368
14888 -57368 -621 20297 44531 64118 103029 76448 49382 86273 19727 -54607 -37249 -10057
14876 -10057 -20900 -46731 -1569 40460 19366 21437 -31493 -23738 -15477 -37823 -29764 -12225
14864 -12225 611 -40959 -80779 -106686 -120476 -78762 -34487 -53981 -46782 -57588 -21520 -7566
14852 -7566 18276 27620 61501 42409 -488 -9170 -31018 -38806 14150 73459 34997 -71761
14840 -71761 -87464 -30393 -50032 -7398 668 -16901 -9687 1282 1275 -5443 -4118 36715 72121
14827 72121 99326 77869 -9530 7265 47863 21440 53742 91604 23366 52510 63683 7184
14815 7184 -50083 -124306 -97999 -40791 -6140 39515 11328 -41692 -53195 -113808 -83764 -49702
14803 -49702 -69988 -127476 -81738 -36725 -42665 -82539 -68241 -74302 -36120 -14978 -65595 -39664
14791 -39664 19138 52260 -5779 21947 2697 -44905 -46267 -77644 -75544 -54658 -65234 -68545
14779 -68545 -31778 2525 -58069 -85417 -75982 -75929 -40237 -29080 -17633 -26969 -68922 -85158 -9416
14766 -9416 -26346 -124013 -114529 -49857 -44595 -7009 14591 10338 -3506 -35401 -40882 -41942 -816
14753 -816 44408 67304 34212 16360 73202 149181 143602 78093 31401 1762 51732 20
14741 20 4098 20396 -164 -21519 -48464 -43602 27206 35067 62935 50220 29422 -16885 -35974
14728 -35974 -15268 -3182 -27799 36676 -18002 -9695 65338 120489 101468 15372 -31948 -53607
14716 -53607 -28803 -96651 -90624 7187 -24503 -14905 -16993 40479 12016 -33926 -51995 -91935
14704 -91935 -109998 -20885 25041 53413 7220 7206 -6524 521 -31878 -70323 -45000 33450
14692 33450 75774 82857 65702 15532 -31115 -6133 31185 36484 -35517 -29245 -745 -25051
14680 -25051 -56561 -23440 -38937 -30993 47595 39411 17205 -56534 18927 32766 -57002 -69844
14668 -69844 -61150 -35920 -61390 -119289 -177886 -143577 2605 109934 -16712 -99472 -90446
14657 -90446 15600 103755 74755 36018 335 26921 -8421 -129857 -130387 -104143 -38148 -22336
14645 -22336 -86516 -90642 -83744 -43385 -32738 -47663 -129957 -99757 -23529 -23271 47002 132944
14633 132944 116166 65041 22535 33746 26053 -2651 46099 -1363 -71067 -55025 -49018 -61829
14621 -61829 -44348 42020 91826 61860 27174 25210 -15692 -89454 -98751 -31978 30899 26912
14609 26912 51501 60371 9743 11383 47994 54138 -2810 -23833 -45600 -6050 65638 90788
14597 90788 157748 127142 88669 35431 13833 77381 104286 92711 56869 95908 160993 108900
14585 108900 63575 81218 468 -57626 -66418 -74618 -23120 1936 26156 5763 -47650 -55556
14573 -55556 -85157 -24061 -20136 -78488 -27329 -32883 -22405 13686 51103 72384 54345 -13982
14561 -13982 -20296 -15673 -28629 -5597 41352 31204 45660 49700 51238 93444 63758 85119
14549 85119 106584 177241 176114 87636 12568 -16537 -54082 -68385 -53808 -48433 72378 79100
14537 79100 57161 -879 -43908 3342 128929 96624 -8342 -90269 -106461 -82751 -45349
14526 -45349 -43920 -46492 -8279 54069 -25688 -69865 -105735 -126184 -120750 -89305 -58495 -38786
14514 -38786 17006 59610 -48564 -102488 -31491 24235 25875 41553 15475 66645 28308 19313
14502 19313 47269 92505 76675 8865 28200 1042 -7515 19524 18500 44093 58872 99338
14490 99338 32514 44058 56057 90089 46352 -3967 78110 113432 29738 -93473 -140249
14479 -140249 -149764 -78189 -67684 -46422 -9598 -23757 -36095 -37529 -39999 18261 71077 68335
14467 68335 23195 -57852 -55166 -88904 -103732 -37437 6265 -19455 9146 85171 84799 82248
14455 82248 52349 -5315 -2818 83480 135983 137051 85552 34323 93662 163180 132834 35316
14443 35316 22541 63530 11689 -51458 -21337 19382 79460 145591 180902 106351 35345 -35837
14431 -35837 29898 87875 64413 14229 -5066 -17570 29110 -3026 76522 61425 -7580 -14440
14419 -14440 38634 32433 -43497 -75022 -58238 -90994 -71751 -39078 -63768 -45595 -32198 -72036
14407 -72036 -51844 -51716 -47224 -29144 55997 -29230 -127522 -87354 -92723 -110265 -77946 -71678 -75757
14394 -75757 -89831 -101527 -64735 -34906 -53578 -119863 -107889 21923 -8957 -59870 -80008
14383 -80008 -81688 -91944 -110577 -120570 -94268 -47940 -91668 -113656 -86591 -67897 -110806 -136694
14371 -136694 -143861 -145928 -116853 -74787 -59698 -47264 -47316 404 40732 51861 68750 46840
14359 46840 57332 9653 -75495 -12530 -36591 -95191 -125420 -63679 18581 51742 39536 7858
14347 7858 -6076 6588 -52999 -22379 17071 67159 36798 -23990 10604 -58002 -51550 -14016
14335 -14016 10585 36558 -38039 -72462 -25592 -2413 -28743 -6300 -22020 -59343 -122150 -95708
14323 -95708 -28246 42129 -362 20564 79299 102022 19713 23477 -4914 -77197 -76810 -51634
14311 -51634 -49107 1617 55767 13168 34313 38970 14047 -54278 -60755 12249 15056 12399 -14357
14298 -14357 3380 -55193 -58280 -1159 51551 74597 26098 -8230 -7610 23651 33416 9880
14286 9880 103749 110049 70519 36594 37775 -72657 -123500 -140763 -93731 -166019 -232309 -163239
14274 -163239 -97791 -105384 -190282 -186379 -162046 -62952 -7739 38141 72169 109241 45433 856
14262 856 -5102 -32846 38954 100832 85737 111693 133723 193702 181283 168690 148610 118813
14250 118813 55504 13397 -43176 -116590 -70891 -100264 -157351 -47731 77089 91614 86459
14239 86459 71134 90527 118822 99754 25507 22698 17497 12422 12368 26115 15354 -3873 32186
14226 32186 51503 12279 -36027 -90748 -70659 -93631 -118835 -159318 -118497 -64465 -63431 -99976
14214 -99976 11892 77152 3866 -10372 -67914 -58243 -55829 -75390 -59933 -40278 -103529 -136097
14202 -136097 -55861 14112 30243 42792 17270 -30281 -40731 -10460 11367 -45971 -81546
14191 -81546 -43143 -49510 22842 44534 2322 -81498 -99396 -69731 -40675 -40173 -58663 -89865
14179 -89865 -45697 -40052 -75171 -86828 808 62989 65146 113058 157277 119047 110683 96365
14167 96365 10032 23110 70198 -488 5050 70471 154759 251440 276785 282374 319370 400463
14155 400463 428773 461312 494454 424249 274163 214747 199133 75321 11433 -4893 -44209
14144 -44209 -14815 21954 9071 33073 -1848 -20909 9446 54159 53480 26130 14310 53541
14132 53541 73922 95529 105312 74288 76294 99070 25095 -21665 35564 77181 36945 5118
14120 5118 9854 -23014 -38370 -25407 -34590 -16088 -43133 -42865 -9684 -58428 -73952 -80587 -27414
14107 -27414 -3214 767 26405 1991 -63312 5178 54613 54150 -6823 -52520 -72035 -105446
14095 -105446 -95138 6196 39600 42997 26764 -4378 13017 -20216 39755 89666 73959
14084 73959 -1549 -65410 -144482 -178471 -103637 -51588 -49602 -50209 -67237 -65182 -84508 -56397
14072 -56397 -79660 -109285 -109548 -35221 -43822 -50230 -67754 -43808 -21037 12073 -25788 -13730
14060 -13730 -7213 -84325 -67723 -44830 -6418 44981 87899 110082 78902 11241 -50801 -80554
14048 -80554 11562 61150 64437 90605 101698 137001 160247 137706 106566 125732 92096 89418
14036 89418 68306 71786 -3107 -55961 -55463 -52241 -11402 -14429 -23520 -46680 -68575 -121863 -108600
14023 -108600 -63845 -41685 23466 2539 -30583 -28927 -82791 -105353 -62451 -44695 -40009 -26756
14011 -26756 -17762 -30642 -59220 -102431 -94520 -46213 10919 50724 72912 19820 -21720 -31766
13999 -31766 -47973 -31989 15411 19061 23610 39829 -38987 -103589 -51466 27103 56634 108585
13987 108585 56533 40119 -12575 15650 -16643 -54866 -6292 94251 133795 93031 -25455
13976 -25455 -48222 -69976 -101107 -57399 -10174 -25527 -96262 -139601 -132901 -55213 -18674 35660
13964 35660 39106 13024 -53895 -50061 -13019 -34323 -63030 16712 91256 107768 152559 155108
13952 155108 127019 121036 73372 69554 101756 47619 48851 37731 614 -35823 12180 34661
13940 34661 -12337 -29490 -62986 -136516 -164663 -174848 -173751 -195614 -144694 -77104 -86687 -103826
13928 -103826 -77924 13869 86368 56314 -35221 -61328 -13189 24719 114870 117740 53117 59498
13916 59498 73279 26193 20931 1571 -5033 -9133 37449 81496 40083 3385 -88854 -144554
13904 -144554 -137670 -72632 1303 -11275 -83530 -84627 -36306 -23356 -12153 28452 77924 78750
13892 78750 79177 24421 68951 187604 308685 402475 484087 523124 459685 333390 200219
13881 200219 146972 65355 19406 7055 46247 43931 26164 26161 82180 23806 6096 -18899
13869 -18899 -31777 -39635 -20673 -32436 6920 771 -51912 -8459 70027 31657 -95199 -131316
13857 -131316 -113165 -94589 -51237 -16697 -26486 24827 50738 88477 62518 50403 25368 64493
13845 64493 30517 37002 70886 133974 138078 98882 119190 112572 188878 276102 317816 436058
13833 436058 670947 856985 961257 934920 857086 752888 536655 403684 292280 259594
13823 259594 275435 211655 133618 151925 176271 159743 111586 64633 85866 73925 85851
13812 85851 98127 56460 37501 55633 58379 -16357 -76475 -56100 -55560 25436 94334 67365
13800 67365 64655 75019 158607 232313 306762 363446 355189 289669 218845 250848 266298 339361
13788 339361 406365 432070 492261 510764 508587 505290 481631 509331 571656 657206 740799 812036
13776 812036 924137 1015610 929437 777195 660484 586929 472193 329838 263070 294804
13766 294804 291619 250955 190248 206045 248229 237546 152472 114591 96414 143135 81973 13539
13754 13539 -54259 -117267 -68718 -5770 -4616 -12784 -49826 -79560 -4850 -44932 -11778 22134
13742 22134 37720 59675 52587 -3134 -36042 41587 95564 90105 102815 38388 -28767 -17085
13730 -17085 -12908 18338 878 -26898 12603 36562 53043 48365 42662 70119 -21566 -48645
13718 -48645 -103683 -88587 -49023 -36515 -80257 -55043 55237 35247 -6497 22238 -10802
13707 -10802 -16963 -27488 -32273 -52883 -1567 94138 120897 69829 57301 8435 21902 72551
13695 72551 98357 12176 -36939 -3167 68388 66879 77419 121688 62286 49804 58476 51460
13683 51460 65985 130480 131644 88841 32038 58520 83517 84169 146065 150165 107403 107282 30318
13670 30318 -19500 -38569 -51232 -55586 7508 -51742 -44793 20623 21804 18955 64789 68376 4795
13657 4795 -69164 -65751 -55352 24349 138017 135676 124420 89796 34475 -33065 -13818 105994
13645 105994 195581 92037 -18912 -15387 -46193 -72892 -116138 -150389 -177165 -177876 -75613
13634 -75613 -424 44013 41082 9315 62115 47956 22238 81629 78128 32941 -39781 -105310
13622 -105310 -17070 7067 -14824 -25305 -7591 -45227 -98320 -134652 -72115 -70037 -144028 -127413
13610 -127413 -111844 -98910 -109946 -105594 -49619 -61559 -65464 -10045 22069 -37692 -76649 -33072
13598 -33072 -50095 -70937 -49621 -68817 -82660 -10389 -10936 31634 92864 47354 -2387 8111
13586 8111 -52500 -50474 -20531 -24716 -58163 -62171 -78901 -63878 -41165 -18591 -69056 -65526 -81824
13573 -81824 -75090 -17751 -29308 -65326 -64975 -32816 -27686 28660 6777 -21115 -3654 29518
13561 29518 105850 101027 13408 -95221 -141125 -59352 -16299 -51252 16379 46980 31549 -41171
13549 -41171 -42880 -68669 -30655 17355 -8197 31009 -23938 -44611 -15305 35852 73307 2065
13537 2065 -11157 -20230 -16198 -37384 16893 52464 39321 12386 49984 78592 42750 -6455
13525 -6455 -7440 20182 -491 9183 71948 58983 -4562 -48824 -43200 -48707 -32825 25311 15474
13512 15474 3180 26650 115011 107845 54913 -2021 38110 111718 134025 161452 87492 73748
13500 73748 5567 -86504 -122061 -122505 -70509 -26745 -42472 -68635 -36643 -8069 -27511 13979
13488 13979 114119 100910 54559 -11620 -23426 -6841 -54985 -127876 -148078 -153154 -169228 -171804
13476 -171804 -159404 -110068 -32139 -15500 -64225 -176466 -165872 -145582 -184690 -111964 -48120
13465 -48120 11247 46761 68901 53473 -5467 -62134 -3337 96081 99855 95544 34090 21298
13453 21298 32840 39545 63027 9292 -52641 -79147 -87481 -57061 -78879 -94008 -63483 -11573
13441 -11573 -17991 -10649 -14134 -7059 59243 -14150 -49844 -42577 15166 73178 74914 70003 22124
13428 22124 -101752 -153422 -162399 -128635 -84726 -66409 -49695 -86977 -104159 -119500 -110435 -59378
13416 -59378 17030 19374 8599 -552 -9934 -37236 -9905 -39586 6480 68934 41640 -10299
13404 -10299 -47832 -43233 1584 1428 29751 20264 -15592 21342 98234 105493 11518 -69928 -70104
13391 -70104 -24808 -55714 -14061 22173 5657 25403 51665 17607 -23329 -40361 -73502 -18332
13379 -18332 -11507 57998 147253 160796 122773 26176 -6122 45082 83807 107588 28307 12835
13367 12835 26224 -1812 16876 4153 54951 47186 43034 36650 40176 75526 48984 13737
13355 13737 -6754 -51230 8612 39630 10656 -38368 -10104 22509 25165 -27610 -76959 -6318
13343 -6318 9159 11107 42004 51267 -44263 -31844 40000 107835 118891 72669 89571 61779
13331 61779 -46820 -57788 -31251 -72115 -90860 -95421 -49296 12004 76962 120596 74848 6401
13319 6401 -28362 -42840 -5952 59627 44730 65235 82566 82677 119446 153082 211497 188553
13307 188553 148235 105442 181027 293144 422430 480858 520612 715326 1034650 1445407
13297 1445407 1787590 2071252 2330891 2490547 2547402 2455551 2290381 1996792 1629762 1227810
13287 1227810 924285 707482 578205 471626 346714 322680 363347 396122 388494 376875
13277 376875 380035 327140 287412 293233 190391 97848 84579 111261 145111 129913 143314 125102
13265 125102 103211 108647 130338 126852 140701 114815 74325 73161 59457 54519 78436 73634
13253 73634 53197 81631 77427 18326 31655 40434 -844 -4862 42049 22276 65147 30086
13241 30086 -43297 32386 61485 85201 81924 16971 -16478 35923 65701 116484 144511 154676
13229 154676 127193 43265 859 36160 17707 -1557 -18373 656 13203 -3578 28510
13218 28510 54456 39231 60533 72998 63090 23172 18320 -22149 -25734 -25892 -24487 -27191 8981
13205 8981 18423 -31204 -1271 56628 90716 116142 58341 17786 23196 -29435 -43477 -20266
13193 -20266 42103 5712 -83124 -29660 76714 88524 36108 6210 39271 18379 -40292
13182 -40292 -45882 -16784 -50459 -59795 -7188 31957 -5940 -44978 -50309 -36541 -21108 -27863
13170 -27863 -74869 -9268 -600 -18770 -6512 57742 57413 74039 11170 -49335 -91698 -77939
13158 -77939 -82875 -68381 -41285 -7205 29483 65024 110287 94793 50774 102242 112268 50023
13146 50023 48446 30745 6971 63222 170344 127582 96067 87828 117754 134593 100921 17003
13134 17003 29318 139198 157336 155293 192438 213488 244160 260094 227850 236174 279318 247060
13122 247060 228064 158382 131146 155080 145919 120681 127737 124292 125425 95282 34500 29744
13110 29744 4385 58617 44074 25391 -24944 -22814 1128 49052 116903 109410 55716 278
13098 278 -55790 -25102 -26401 3982 36056 65636 36347 -746 17770 25895 43288 30801
13086 30801 26252 24808 81792 46284 -18988 26651 76116 37583 -20298 18049 82499 62083
13074 62083 82462 108122 121304 71444 64514 119948 166742 101888 52723 47992 35099 12522
13062 12522 41875 83367 54347 -16705 42611 40911 -3263 21266 103387 123284 96877 12913
13050 12913 -57085 -53572 -110555 -26779 63248 136419 142540 143431 127467 177809 139889 95060
13038 95060 158089 141947 82895 54531 46002 88726 44476 -272 10896 19301 24590 -21727
13026 -21727 -85696 -108938 -85408 -135009 -193204 -115743 9326 98441 97100 80011 88908 100676
13014 100676 94864 110646 161168 196124 245727 265822 214647 306833 381501 443772 560268
13003 560268 624915 694169 714388 667441 631334 686625 668546 640139 619800 562937 557372 584357
12991 584357 515735 475813 433165 447758 468941 431906 408468 408939 362369 354567 414029 453132
12979 453132 409232 339859 348675 327077 294395 295329 286324 330387 339338 325822 274477 233354
12967 233354 236710 259622 272163 305356 289014 300021 386702 430802 407252 401367 456785 526750
12955 526750 539450 522238 514470 481482 415792 368305 393594 417808 403283 454150 471303 490649
12943 490649 454758 471233 558885 504843 543533 552960 602996 667521 737221 756332 792929 846411
12931 846411 857071 854895 842466 859322 931664 1030381 1055729 1040427 1084654 1270764 1360426
12920 1360426 1461556 1587669 1605415 1621171 1755786 1824185 1875817 1917002 2055733 2171478
12910 2171478 2198710 2217633 2288486 2359860 2431831 2591219 2689861 2825910 3019455 3357036
12900 3357036 3704800 4078908 4426669 4835705 5305776 5834102 6422194 7243658 8295869
12891 8295869 9658643 11304645 13263109 15512026 18095152 20919458 24102767 27551752
12883 27551752 31512044 36386316 42892681 52274693 66406812 88676028 124043787 174808028
12875 174808028 234153394 294137580 349699706 399810076 440007812 459626262 453671311
12868 453671311 426866840 387002676 339178258 283315604 225753390 174884206 136113157
12861 136113157 109342518 90773459 77201933 66848728 58832648 52219348 46545772
12854 46545772 41527379 37073117 32998977 29322639 25986951 23152630 20781223 18800232
12846 18800232 17047801 15538479 14219029 13104283 12128146 11348272 10614700 9946798 9291311
12837 9291311 8706995 8214937 7770979 7399315 6901467 6438446 6096684 5738664 5445945
12828 5445945 5132903 4808690 4522659 4302954 4123897 3945630 3741516 3595558 3416890
12819 3416890 3266708 3205203 3083284 2852192 2658451 2543799 2427403 2336078 2194699 2197967
12809 2197967 2069296 1896949 1868752 1779560 1665486 1649213 1600302 1609062 1511500 1413240 1395039
12798 1395039 1337338 1281421 1202241 1158963 1136365 1107839 1040411 1005360 1030593 999717 1008670
12787 1008670 1073197 1041852 991683 985225 982558 952818 904699 832532 810911 834675 838829 699261
12775 699261 625185 610297 627389 614429 639823 685971 709660 684027 657932 594762 593511 623253
12763 623253 569340 488879 528137 570250 484895 477594 507262 473500 435200 504648 547154 504405
12751 504405 473847 381463 373796 450665 447036 378686 354046 345193 318292 280810 178820 142484
12739 142484 173229 190093 217430 218771 305767 417529 527217 693915 848206 1082962 1219970
12728 1219970 1319378 1444658 1526477 1483360 1385277 1246272 1142408 1011407 864086 764421
12718 764421 762099 804465 843859 830632 759648 743212 683552 668379 710741 627396 460557
12707 460557 421627 421048 386930 395541 409559 324594 262455 308859 415074 379202 277924 237401
12695 237401 301109 335995 366914 371386 361840 290213 224593 270497 262342 262104 322885 284165
12683 284165 319487 357025 317790 282592 324517 388056 456902 495388 595209 585452 593793 581234
12671 581234 458440 315982 253594 290104 358885 330373 255471 218414 190978 226386 280918
12660 280918 220731 239445 227973 283211 336422 345054 308618 380231 350853 322147 278121 225100
12648 225100 207735 164728 176822 266114 300767 323320 414364 583293 727021 877458 1088399
12637 1088399 1316506 1519353 1671636 1839799 1957228 2267177 2751689 3610916 4425374
12628 4425374 4536149 3911419 3010591 2223459 1731677 1451504 1249439 1120518 995119
12619 995119 830427 759685 750431 614915 465028 416864 452804 461268 423241 411830 396218
12608 396218 425247 445505 437424 441035 392521 350749 430307 444689 503260 653246 839799
12597 839799 1072773 1254483 1391429 1493704 1535340 1515313 1401658 1303698 1120247 956117
12587 956117 774351 695621 641079 479685 373629 295011 355214 454165 368812 272693 242841
12576 242841 276814 317053 323794 267805 256594 180065 162234 221986 204985 134991 100348 140510
12564 140510 183974 153142 173136 242837 257583 255846 216635 133877 115692 65372 120712 157045
12552 157045 154302 100945 84545 110862 130018 125168 159517 133281 161420 209861 191780 132668
12540 132668 87619 105646 132428 167633 181674 114759 20909 80679 130945 185158 182974 181148
12528 181148 268523 269803 193397 185413 208149 206892 177163 143191 143765 159282 114146 77546
12516 77546 154332 203322 220812 185550 195406 254233 186418 122160 64040 77364 108670 116254
12504 116254 167729 110410 34907 73599 97917 67974 84087 128135 180440 136567 137505 161460
12492 161460 223799 201944 194216 161479 115152 135780 100755 107618 154201 102482 56923 22705
12480 22705 54679 2228 -26885 43747 50213 69480 128986 87892 -1438 -9233 27793 28269
12468 28269 -1191 73495 106286 117177 91681 88795 134272 98489 55582 95720 178179 200822
12456 200822 173639 256083 327184 364938 390829 367245 334744 409305 595265 789408 1079973
12445 1079973 1425655 1716306 2026461 2333718 2442928 2555781 2583426 2376799 2123374 1881525
12435 1881525 1626017 1330889 1025303 820585 751604 604635 508735 444137 340264 302694
12425 302694 303719 230480 177192 222080 241820 208470 183823 175874 156122 196368 165599 145718
12413 145718 198174 232018 220244 258368 223222 98714 29318 57274 62247 25188 1662
12402 1662 16006 26446 -4931 -1510 7115 5071 -20259 34235 96151 81925 58774 41897
12390 41897 8141 14199 58387 90522 34469 -31572 -1350 41253 32389 -72254 -38628 55247
12378 55247 102491 60020 13496 12771 6319 35738 83580 107433 122480 92286 154627 114028
12366 114028 90429 88154 96656 99323 107697 126759 95840 62519 39228 77916 95281 116276
12354 116276 115075 96285 31645 -27449 -43148 -24067 -19659 -20268 -30802 -46857 -90711 -80679
12342 -80679 -53464 -48599 -91705 -103086 -78274 -67379 -130513 -119063 -104706 -52959 -48967 -68701
12330 -68701 -56909 -62376 -96917 -128897 -89344 -85369 -69581 -76690 -41957 59968 27773 -59225
12318 -59225 -39397 55103 6920 9701 25701 39028 -6812 31366 101149 103743 99429 88376
12306 88376 43074 59149 45076 46093 26481 -17014 -36236 -47339 -37331 -52144 -31819 44506
12294 44506 40164 41751 83215 107279 47952 -25582 -17825 24527 72605 106006 114925 94163
12282 94163 132680 76029 75428 36083 -3293 59202 139110 161170 113546 106142 140915 169913
12270 169913 104813 14172 -15703 -42491 -79251 -25114 -22158 -17648 21372 -28793 -34072 30291
12258 30291 46814 46364 1973 22153 37671 101930 39331 90963 131509 174253 266735 331779
12246 331779 350985 296988 324887 314568 299895 168950 129377 131516 65424 53180 108010
12235 108010 137073 82322 82754 92632 92505 91325 57049 1442 -12855 19947 21892 70429 64706
12222 64706 72273 62049 89847 100106 184446 179697 204154 206961 110232 77727 64129 90538
12210 90538 160444 197753 168750 110621 84427 134343 170999 105590 89011 145977 160395 222002
12198 222002 214257 176549 143477 165550 129560 49440 20911 18934 -34768 44558 49067 60733
12186 60733 116941 100671 105723 74946 42238 43171 -16100 -24562 -26302 -56309 -24715 -22871 -6758
12173 -6758 -15927 -15607 57177 135643 149872 102244 -2813 -71784 -67191 -35479 -44703 -12795 -10074
12160 -10074 20965 21575 42318 -5871 -21398 9211 26906 73623 65212 53194 30017 4358
12148 4358 20046 -25409 -11287 55032 22452 14946 37211 81037 102528 103085 79478 98963
12136 98963 154004 170957 112469 51727 4433 -11684 -35944 -62106 -39063 26532 72687 15077
12124 15077 80577 42526 -13468 12092 39534 7630 -1878 -42534 -72904 -36357 -6019 11683
12112 11683 30303 -15398 28556 16875 -19627 -86296 -131674 -142857 -86676 -67657 -42815 -17926
12100 -17926 -10799 -7886 -7769 -63525 -40575 -12021 -64457 -43482 4744 7993 556 -21626 -70359
12087 -70359 -107808 -103149 -86560 -63077 -68357 -87020 -110441 -95824 -62529 -63911 -53052 -35591
12075 -35591 1474 74702 124131 85945 -22424 -59220 -33721 -73999 -85352 -80145 -110453 -131505
12063 -131505 -89631 -92476 -104844 -68009 -42444 -49345 -45394 25596 -10099 65834 108414 85348
12051 85348 75533 60146 56343 58180 56318 -13719 -18263 7284 -13247 -33129 -63231 -7811 21389
12038 21389 8451 14891 -83350 -142599 -117917 -83147 4580 60880 -5472 60100 57375 -27867
12026 -27867 -63560 -49679 -59175 -28260 8487 107818 127812 105965 25332 32155 3690 64824
12014 64824 123062 123173 119511 -8563 -118698 -141959 -90222 -83388 -74020 -82981 -109221 -88505
12002 -88505 -86141 -89666 -43796 11663 44507 50081 77141 38069 3359 51746 57553 58660 62649
11989 62649 85817 66922 96292 119332 90750 63188 24920 -20997 -68374 -110941 -54827 19905
11977 19905 12904 46786 46515 -34030 -66765 -82043 -58084 -38406 82595 250363 361284 328111
11965 328111 251753 203699 130133 19934 -13301 -6805 35 -16035 22560 -3104 -295 36777
11953 36777 77096 -11237 -50479 8802 16222 317 -25571 -89150 -139907 -187136 -180185 -106878
11941 -106878 -51080 -11182 60844 65828 100869 140289 216229 292618 292184 229866 143279 110849
11929 110849 87845 61220 69820 45363 6889 -50042 -90446 -71357 6167 39712 44830 46465
11917 46465 25987 -16592 -26364 -90686 -101270 -67988 4010 53517 -65 -64844 -28608 -23767
11905 -23767 -132587 -126376 -83191 49733 44283 -2130 -6637 15169 11933 -30112 -42083 -13234
11893 -13234 -24579 729 -9369 -45579 -22585 12895 35898 36953 81754 94434 120255 86143
11881 86143 53694 8005 37833 36523 17029 -2719 81364 35082 -41224 -29402 -59300 -106746
11869 -106746 -102230 -135351 -145814 -185627 -125370 -54887 -37528 -24235 186 5540 -40639 -74739
11857 -74739 -81343 -102230 -79810 -39460 23383 73486 34941 -7732 -293 40646 -21390 -83553
11845 -83553 -48537 -68151 -72467 -82214 -91246 -99166 -146601 -195103 -144013 -75987 -15219 28039
11833 28039 -25431 -117112 -125779 -107957 -102450 -34698 -26572 -61967 -81026 -96416 -61459 -24473
11821 -24473 -11794 -43103 -34153 -38187 -70676 -81513 -65869 -52603 -6658 42015 32042 -13879
11809 -13879 -69019 -39973 -50556 -90964 -122923 -87061 -93961 -35186 -44654 -40110 -54647 -49569
11797 -49569 -39830 18870 127364 70327 -18754 -56727 -72987 -45099 -96905 -129880 -86948 -84486
11785 -84486 -88847 -41455 14695 68988 133155 148742 180541 85134 13158 -47097 -80748 -51137
11773 -51137 -29806 -27015 -25456 21950 21430 40933 58483 30770 -50096 -79162 -78084 -54076 -42215
11760 -42215 -49226 -112842 -137829 -41348 374 -15084 -18346 -82528 -78925 -67029 -25508 -9915
11748 -9915 -20875 44802 140690 196817 190024 224024 194930 213349 169399 100766 53042 56178
11736 56178 93037 55782 20934 29291 123627 98603 47046 91562 89722 24772 60100 87528
11724 87528 36701 76605 170624 199906 268714 328678 315878 229801 258108 283801 294239 277242
11712 277242 226412 161398 130278 57702 24257 55235 102751 128173 132556 104905 47587 9056
11700 9056 -65238 -48249 -30735 -2263 62051 119647 67130 51203 79218 75921 67278 49246
11688 49246 41867 82442 44492 59861 32928 35960 74466 70451 77996 51461 74554 128625
11676 128625 121354 122704 126517 195134 280246 379023 414641 413059 430567 475922 479333 441381
11664 441381 421459 431398 480137 474455 441283 414180 367292 305924 299693 237107 229375 218940
11652 218940 176721 142668 142006 66705 63278 103959 84513 42217 -14076 -53440 -66209 -73984
11640 -73984 -59008 32403 92708 85451 92847 109658 43721 67105 87406 18843 -51196 -78070
11628 -78070 -54110 -113389 -97353 -40455 8707 64175 31221 38520 46481 53823 124175 248433
11616 248433 330586 260769 252847 317344 292328 258681 186077 190434 240642 272424 236998 177555
11604 177555 98927 89401 136626 113801 112424 118480 82066 9195 -44129 -85565 -79897 -54351
11592 -54351 -63888 -41468 -93219 -60620 7812 -51321 -37379 27254 -1027 -120926 -128059 -107978
11580 -107978 -116444 -114518 -55663 -11848 -47905 -20532 7005 -19307 30724 82996 34800 -8856
11568 -8856 31233 -12322 -22725 33657 19162 -16063 -56260 -39628 38490 61390 -61742 -99185
11556 -99185 -38328 -22215 -82594 -36084 59550 86430 26934 -14419 52622 99178 44269 -26065
11544 -26065 6750 36188 19034 69857 48562 -36867 -22415 -6920 -45054 -60285 -100122 -92767
11532 -92767 -166203 -202262 -155830 -155475 -128058 -140724 -114706 -84395 -8245 -19216 -113682 -144762
11520 -144762 -70565 -53290 36608 116674 74047 -39684 -52239 -54183 -37049 -9509 -2091 -25659
11508 -25659 -65606 -95127 -130976 -166614 -165732 -161016 -81511 5454 21392 12737 -57127 -66739 -97317
11495 -97317 -101187 -51315 -79097 -46339 49875 56224 95710 115767 27319 -1516 -9113 38631
11483 38631 53586 17757 50281 56886 45387 42047 98951 63713 11827 -17207 -15701 -812
11471 -812 19335 71573 44606 65414 98457 78714 97382 84371 27802 -30293 -34845 -43177
11459 -43177 -83853 -162905 -140668 -143899 -149833 -173627 -80171 46656 4326 -50383 -113203 -72982
11447 -72982 -36413 -7814 49070 48175 67777 80752 48133 -4888 11267 22204 -10769 9173
11435 9173 72934 47798 27982 75284 38293 -717 -3857 -37121 -58775 -23605 -49375 -90922
11423 -90922 -106063 -96783 -48224 -58115 -64142 -98342 -128726 -159951 -117652 -102355 -102350 -129897 -69859
11410 -69859 -57265 -75828 -103105 -70079 -255 40844 77372 66979 75669 37700 78425 70126
11398 70126 -17581 -73501 -59375 -2881 30204 53870 5467 3092 -78918 -110887 -55808 25208
11386 25208 4019 148 7977 -50937 -45941 2612 -3094 -60696 -77425 -8607 -24378 -66806
11374 -66806 7343 21813 18760 -33333 -79270 -20465 -7464 5677 49952 22206 70481 118530
11362 118530 132132 158795 186948 186160 79971 38117 -61760 -111454 -85923 -60044 -58590 -61462
11350 -61462 -76008 -71030 -68778 -38442 -90827 -49609 4472 -47814 -50329 28991 76612 80327
11338 80327 64175 -20421 18258 17394 -10339 -9413 -13697 -92811 -112476 -70069 -8422 -5077 -16559
11325 -16559 -26090 -110209 -86245 -105184 -154850 -142349 -131717 -114959 -89416 -52521 -148466 -225763
11313 -225763 -172423 -109676 -104120 -10566 34680 -739 37573 34105 99407 162619 117760 39069
11301 39069 33226 21893 -3243 44447 73557 25445 19853 -1212 -21986 45251 64960 9381
11289 9381 -23920 -30553 46686 19046 -74120 -89970 -42113 -21006 -26011 -52733 -83787 -67279
11277 -67279 14734 55728 40820 2399 -32046 7887 57103 64445 29426 111470 174183 97895
11265 97895 -39849 -176922 -140114 -66042 -25276 -101209 -140525 -109333 -75721 -41317 -51978
11254 -51978 -60094 2433 -1656 -49300 -93731 -149405 -138103 -89864 34240 76432 81362 67297
11242 67297 14813 27363 60267 50336 50686 -1699 -44624 -87485 -62194 92602 97791 -22182
11230 -22182 -91025 -44409 10094 28453 37728 6342 -23394 -88207 -42019 -17909 49170 61955
11218 61955 28736 7393 -37531 -37410 18182 93266 171151 130733 62591 91275 84994 57790
11206 57790 -8070 -42552 34765 17004 -98264 -127333 -63582 -12141 18089 36323 45411 -12562
11194 -12562 -54084 -72493 -73269 -78998 -38468 36437 57630 89327 124800 11889 -53659 17281
11182 17281 102684 98752 32790 -67964 -122797 -45678 -9924 -18801 -13133 16548 98934 61261
11170 61261 55013 49298 56919 93556 159730 273103 271626 221376 163889 54474 62692 59661
11158 59661 35117 -37846 -89976 -38281 -3980 -29706 -70798 -76602 -73511 -96847 -137016 -152239
11146 -152239 -177320 -105990 -36696 18365 -22516 -100996 -142661 -91416 -601 53011 75928
11135 75928 54754 -15156 -22438 54967 60738 84019 110589 65039 44380 141815 237270 210456
11123 210456 160616 87944 47648 43954 5654 30823 53249 123631 218814 258935 209028 134699
11111 134699 171061 233740 365587 369438 321771 250382 217940 206185 136924 113710 57463
11100 57463 70227 95315 95260 37479 36384 49569 38793 40836 68113 162788 176276 133943 93935
11087 93935 82908 64856 47149 -51300 -21360 -21631 -45973 -68317 -118164 -58035 8699 -15227
11075 -15227 -33416 -83557 -154674 -133419 -79245 -107432 -99323 -59023 -31379 -49276 -72998 8620
11063 8620 70211 33191 44426 18580 42531 20578 -15362 -18448 12175 -59481 -75515 -109599
11051 -109599 -87577 1706 60239 20256 17048 -38300 -59146 -32945 -29205 -7304 -10785 -40559
11039 -40559 -53467 -5957 -98294 -112901 -89901 -29668 23457 62327 49324 79582 62501 -56703
11027 -56703 -53626 18123 -19634 -44970 -31315 -560 57171 55396 -3283 75003 195528 245869
11015 245869 267101 209662 136622 154013 132620 84203 46293 23811 -38236 -9867 56259
11004 56259 110956 109422 20787 9903 64559 19363 3384 4489 -14337 12660 41113 -20983
10992 -20983 -73656 -77712 -106082 -142527 -115675 -94413 -35177 -13174 26360 36696 -62143 -79673
10980 -79673 -19542 56360 119617 41315 -47667 12500 44152 42533 30677 39226 -1052 19929
10968 19929 3634 15149 53349 51233 18428 37223 95183 69424 57837 58676 19685 -32888
10956 -32888 6079 81470 70754 46996 38910 20869 51345 62060 90825 143664 156214 150339
10944 150339 57654 -8377 -21083 2437 -21676 -5571 37749 28500 -40048 -68114 -82414 -21753
10932 -21753 42672 23198 -32306 -65357 -85906 -68855 -39875 -112117 -158929 -70635 -21205 36686
10920 36686 26717 59515 46372 -39018 -9960 30327 50458 -5760 -70383 -39232 -10407 -64012
10908 -64012 -78956 -96346 -124234 -66360 -20342 -19034 -33147 6822 -2938 45802 60502 -38686
10896 -38686 -54552 -15835 -1665 5768 -4740 -36015 40884 102964 44367 24129 16118 29757
10884 29757 -16479 -7176 -27653 -69160 -43933 -41218 25480 111147 113548 79908 1231 -22945
10872 -22945 -62944 16434 38721 6420 15770 -41532 -7523 70810 38564 7990 26250 74285
10860 74285 90396 132255 106465 11364 -1832 49761 82930 105661 130640 126051 139552 115918
10848 115918 125514 135905 142587 123013 23117 -25569 -81417 -124406 -41658 22872 53459 90129
10836 90129 44347 39439 -7902 16068 57280 87572 108304 141045 143457 95748 72474 3609
10824 3609 811 8883 29641 -103 -74011 -134724 -126060 -140637 -133233 -97081 -13822 -22765 -33221
10811 -33221 -28237 696 -25687 -58607 -17271 38349 108999 70936 45196 17125 -15894 22529
10799 22529 36855 28631 31942 21926 31520 45519 82963 8147 -29681 5063 43010 28997
10787 28997 -26352 -43291 -29256 -2540 -28820 -18025 -3843 -33073 -34838 -31261 5192 35305
10775 35305 24926 -17158 56071 39066 26143 35543 67588 40077 -16461 -70424 -30190 9250
10763 9250 24486 65317 51104 62343 48808 70328 148196 100077 33208 79881 100648 41021
10751 41021 -30223 -93909 -87319 -15825 -60637 -93369 -105013 -70794 -21189 12404 -10172 -30234
10739 -30234 -2723 29387 -15611 -30592 3044 60332 49308 360 -15628 -42417 -55568 -24842
10727 -24842 41011 112090 110272 147298 93496 120041 141434 64930 58702 37609 78399 58130
10715 58130 19296 12437 60411 132450 100865 40557 -19898 -8238 38792 1817 -29044 31235
10703 31235 96299 111547 97871 10906 -26277 32103 89608 81926 36266 -13413 -17337 -15353
10691 -15353 -26029 -43058 -15559 -28823 -18991 -27519 -27196 -25467 -70923 -76533 -41288 -28999 34089
10678 34089 55705 13258 -3775 73831 83651 96149 145927 82934 22139 61949 75156 136603
10666 136603 90249 21379 17656 68873 50872 12677 1520 57116 123098 57191 -3024 16012
10654 16012 -59414 7821 44789 -5275 11843 13209 27184 11953 -41780 -44478 -18193 -28421
10642 -28421 -41447 -65747 -65242 -78527 -52982 -6423 1520 6122 4867 -43712 -57778 -8440 -20878
10629 -20878 -9960 57974 26742 -29189 -107512 -107421 -60735 -19918 -78158 -118134 -84577 -45887
10617 -45887 -96348 -74838 -113085 -133393 -146331 -107123 -46452 -63182 -13771 -38710 -92430 -109676
10605 -109676 -44855 -67020 -122714 -87274 18862 71673 20046 43406 118316 143463 102769
10594 102769 56143 84869 72517 22327 36744 59968 113233 73514 18669 -5220 37492
10583 37492 110105 132375 66694 -53436 -25886 -28335 -101412 -127906 -135422 -119748 -96833 -65445
10571 -65445 -17533 54301 24867 9406 90965 97842 37003 -71247 -87705 -89983 -89249 -38930
10559 -38930 61420 62114 81667 73234 -12585 -46198 -64595 -75089 -20412 26457 19021 7851
10547 7851 -46081 -33863 53717 105757 100316 100720 118562 81261 94186 85567 35842 -14083 -9106
10534 -9106 37574 -22096 -75130 -60950 -52238 -8652 -55594 -60657 -44939 -23596 2 88829
10522 88829 235800 396012 511580 549136 512989 433871 261923 235721 253945 202390 129089
10511 129089 107283 45804 28302 11099 -30189 -23604 23309 32361 110581 67257 9138 86161
10499 86161 143199 80343 144910 241279 234682 176321 133879 108970 87221 94477 99431 92237
10487 92237 116935 93570 67134 12585 -28198 9615 59966 66359 70617 52788 73975 80884
10475 80884 90391 79407 91509 61075 35667 36065 103020 148460 71324 65548 40762 47332 33614
10462 33614 28447 86335 124962 149159 169510 115144 140366 177745 120909 -8887 -92994 -69660
10450 -69660 2137 75395 94324 130919 192017 221892 229874 277524 270448 216692 144972 152725
10438 152725 166067 105126 49465 75761 144045 126150 78342 42208 39241 17548 -14613 20040
10426 20040 64696 71204 61395 65297 69835 45721 34279 -10622 -37297 3862 8450 -21690 -63923
10413 -63923 -41549 -2280 -36760 24876 4120 -39442 -77406 -9698 54359 10173 -33050 -2385
10401 -2385 -9722 6798 44247 126699 46404 -24666 -33855 5204 47682 -12133 55419 72883
10389 72883 -27613 -95830 -37897 -39004 -44808 -42190 -12698 -30833 -34734 -37221 -23141 34855
10377 34855 118950 85643 -16209 22631 78775 137296 203117 112634 41964 57633 36573
10366 36573 45908 56027 17939 -40454 -49835 -70108 -18549 -37312 7299 67479 31275 -48929
10354 -48929 -62395 -8497 64920 90305 26620 -9803 -27694 15239 5902 -88 -40070 -7941
10342 -7941 -11231 -15400 9809 39855 65197 67715 127737 125987 122766 130761 94270 32834 -3485
10329 -3485 -6583 34308 38544 80922 125221 107134 125423 137369 133262 54981 15965 67153
10317 67153 32227 30395 80161 179207 177325 92308 25482 54146 137284 161926 148757 176723
10305 176723 161747 135491 51761 25979 12761 52110 27373 16521 69327 66040 75538 70096
10293 70096 32153 -34134 -61802 9916 -7922 47224 61409 12939 -16023 -21655 -39113 -35221
10281 -35221 -20711 18924 54038 61856 16619 30756 60771 75777 86630 126952 163140 119764
10269 119764 59141 48053 58119 32399 -5503 -22121 -9530 26393 60320 21904 19968 24839
10257 24839 -47838 -65145 31459 34162 -19450 -15154 -11118 -37042 -70775 -68956 -33438 -21752
10245 -21752 9727 24407 15859 16550 -311 -44193 -16393 73866 73529 9877 32930 55231 1561
10232 1561 -47378 -74314 -61000 -107183 -90631 -53798 -4983 68104 68653 65181 87100 133925
10220 133925 168324 149372 135871 234201 339863 429024 504092 678023 870129 1012757 1268040
10209 1268040 1516936 1721291 1677571 1494772 1287257 1161517 1035091 893681 650578 448905
10199 448905 386102 265388 225792 179768 127142 156116 141952 125538 142073 167541 198631
10188 198631 185103 172096 148384 165092 166458 131593 114197 34867 -54292 -4479 45423 60607
10176 60607 70213 60580 17764 58583 126532 106993 91471 120327 54033 -10888 -12306 -32478
10164 -32478 -34571 30345 52426 43848 74406 135030 98847 35120 15796 66085 115977 152727
10152 152727 117925 105334 125957 117102 80441 38889 3841 21990 10111 28244 30920 41197
10140 41197 87498 98005 92297 37222 -41188 -63699 -30135 -27264 -33558 -19653 -28350 -9431
10128 -9431 38038 92141 92401 71469 36312 -13778 -70259 -35252 -42087 -76061 -95086 -90852 -86499
10115 -86499 -145164 -145191 1525 68008 87546 125822 133893 59103 50568 32497 68194 65230 48103
10102 48103 33775 48452 85827 105722 93969 86001 115977 163554 149641 155531 190329 148088
10090 148088 71826 38650 94388 121251 116528 75946 80270 144787 170596 163893 119123 73504
10078 73504 32462 42984 47771 7022 -20131 -34144 31436 10794 -30626 -25435 -30994 -35430
10066 -35430 20000 96613 86936 34182 99545 176483 234112 156802 70003 76623 120285 218249
10054 218249 305075 357318 478318 591386 758023 1008847 1482291 2428061 4427031 7465405
10044 7465405 8296050 7142491 4857686 2964939 1996287 1520601 1263968 1038067 838507
10035 838507 694793 542189 513112 492356 455589 321101 255585 281369 258169 276388 265078
10024 265078 203372 191853 157622 135743 168049 110468 102665 156847 159830 195264 185841 187530
10012 187530 112008 85660 80288 59563 87110 9644 -320 57130 86004 146125 123796 89779
10000 89779 43931 -20305 -54721 -55208 -34972 -33484 31758 27675 33881 114011 131702 172016 246978
9987 246978 276271 306726 304874 224343 113999 94320 125970 98619 46867 2190 39000 51717
9975 51717 43450 29338 -6839 -43017 -34787 -36749 17324 66227 12648 18645 44177 72736 114989
9962 114989 116277 148927 114731 86566 36654 43465 26386 -30948 52899 106547 147670 176727
9950 176727 157678 138916 94016 85389 177277 452866 665046 688589 676591 626461 572029
9939 572029 549070 646375 827311 1127420 1402976 1392297 1148857 911889 692693 612863
9929 612863 728127 793066 842079 828947 729845 568590 428517 377937 355706 320255 307684
9918 307684 317960 297713 258659 185271 78872 70604 102441 154213 155153 142440 112149 81401
9906 81401 119802 141829 94995 106122 161612 140065 109713 110454 104846 57585 133479 180184
9894 180184 167222 129384 124415 161341 112339 123483 213326 140437 44064 42705 73242 124819
9882 124819 194157 258433 270149 225214 207634 166702 170752 230411 202246 215557 188560 164780
9870 164780 137540 143246 128853 69408 26066 53264 170421 217286 189874 206755 191625 193088
9858 193088 208028 238220 212401 170936 198179 269029 261693 212629 214198 196630 163843 96345
9846 96345 98939 79422 55870 165949 223211 267488 208860 171393 149136 177009 184024 88463
9834 88463 47237 61980 59795 76927 78135 58638 62217 138054 134925 119569 124071 141867 130502
9821 130502 156837 188894 148366 92718 25367 49295 108908 82935 69656 92213 198368
9810 198368 208935 178984 129378 76380 121772 186669 199791 223973 244496 265468 265299 228039
9798 228039 253954 173185 118292 90817 175741 193671 169463 193835 217151 267592 275645 227326
9786 227326 200560 212497 219899 216500 209978 164665 162922 234462 230070 228295 255484 259994 269203
9773 269203 236524 255991 249177 212710 123506 58770 74510 73410 125790 121170 134037 108704
9761 108704 165582 256652 194645 146083 115098 124035 174568 209188 220298 225111 204061 166763
9749 166763 109293 60429 -14328 19860 105719 88403 121531 134466 122070 99657 76187 117542
9737 117542 151597 214695 265672 263988 234454 215192 221282 264939 372837 507622 709441
9726 709441 905373 1041192 1067137 1142175 1363161 1625330 1721251 1563853 1304240 1166143
9716 1166143 1176218 1042935 908103 704445 505199 470152 430857 441397 418436 332752 299319
9705 299319 328550 361713 357948 340928 282997 233093 194178 227033 203429 188358 212271 289777
9693 289777 298934 232907 168550 144581 73778 95792 82016 59110 83369 218127 260653 248239
9681 248239 279244 250103 294055 302217 257999 213022 195041 227174 266213 204102 208807 185533
9669 185533 176392 188987 144291 93104 138999 182172 221217 259255 132797 65430 141553 137377
9657 137377 124395 90495 88351 37390 60874 147294 242693 251514 290628 282319 199362 199872 279882
9644 279882 278597 254138 222000 218410 180529 219383 237591 177323 170290 178352 205332 203667 231780
9631 231780 255813 255870 216734 275249 202509 200867 226034 191381 130447 122088 207847 217807 142841
9618 142841 144707 123037 138903 186804 108051 114536 182403 218077 211181 207121 253275 317992
9606 317992 319889 256435 241166 201094 157761 164933 182350 202242 224997 290689 296871 252432
9594 252432 221949 264748 228389 243025 247457 328595 389071 415562 485929 474565 285475 261035
9582 261035 253074 255178 253810 262329 327048 367061 315237 280336 239638 217480 263076 292720
9570 292720 239230 234934 268397 325459 270609 224445 228999 183260 195359 174707 168769 175572
9558 175572 218954 235425 267132 298709 283029 238425 102259 134200 282832 335920 374522
9547 374522 413327 450072 425322 376169 360071 327019 264406 276537 236052 199005 227540 269872
9535 269872 309144 364717 367139 383600 377253 394111 398734 342007 285157 298370 345181 318099
9523 318099 326403 331915 319148 323819 326962 385008 326912 279046 275082 295306 362467 315710 290233
9510 290233 374727 389089 355831 315543 280766 309163 369727 326664 319836 426749 441623 424071
9498 424071 406378 401769 426182 415348 389511 324981 239360 295783 362873 367001 329412 301377
9486 301377 330167 401059 462224 483721 560996 606237 521208 380239 378547 374633 406225 431043
9474 431043 374440 385714 407395 418856 421105 442718 451037 380885 344673 433107 448754 406435
9462 406435 347571 306629 298694 331180 333250 351559 388500 379311 350776 392062 440830 473942
9450 473942 469605 455741 480388 515932 469687 435070 347407 318296 321232 383082 459041 496536
9438 496536 516629 502396 451325 483889 526761 548235 559919 479028 450018 494507 500703 526640
9426 526640 551928 539902 497503 461517 506025 491978 520033 519507 563493 577351 519748 579893
9414 579893 588748 541025 541484 560301 580115 549347 481919 491255 561048 657336 675523 619561
9402 619561 559275 539880 553770 557587 548153 507016 476838 449050 492502 477662 456620 458102
9390 458102 466369 526264 613279 626426 520937 487754 547693 570827 529877 525731 592677 615657
9378 615657 594429 578709 567894 523336 484687 503439 600443 628025 644389 645878 608006 528315
9366 528315 556366 602553 577355 619666 701406 690402 613496 656825 695184 695373 734881 738704
9354 738704 692788 676570 683247 732038 715062 666345 708326 757559 768831 795546 843504 830799
9342 830799 889456 860204 786792 743215 760385 713190 638737 665081 672211 721773 735995 721600
9330 721600 774709 777349 775448 753888 802019 802174 776165 804401 739513 657225 643560 659653
9318 659653 741852 817876 818009 791530 795882 828874 814146 749196 805255 855177 849688 847980 841301
9305 841301 878360 934358 936497 904181 959587 1011342 1004480 987085 939613 976356 959135 884645
9293 884645 904390 941018 904208 903896 874755 881469 951330 975939 951239 937786 908393 856170
9281 856170 893231 993849 1059714 1080674 1063508 1100852 1078207 1017808 1027382 1039142 1030422 1034049
9269 1034049 1047011 1098210 1098043 1041062 999175 996219 1032966 1005308 996381 975555 1017312 1097163
9257 1097163 1080921 1044431 1021085 1047644 1060916 1082004 1102866 1122566 1175838 1219642 1215478 1192516
9245 1192516 1210094 1191027 1252582 1289357 1319099 1288348 1278692 1258261 1202452 1179573 1204670 1283262
9233 1283262 1297354 1195240 1167182 1260416 1243057 1304388 1416202 1401278 1371395 1392384 1364905
9222 1364905 1326768 1288403 1374980 1455278 1496918 1535650 1548567 1513447 1497601 1487185 1499747
9211 1499747 1539188 1569975 1604261 1657368 1651998 1610939 1572829 1572929 1508813 1463637 1538035 1599897
9199 1599897 1640353 1671694 1636997 1693284 1646016 1648399 1705413 1750973 1763021 1747149 1760536 1730200
9187 1730200 1728532 1769591 1823256 1857456 1859655 1832261 1810330 1825728 1886047 1934468 1924548 1952124
9175 1952124 1930646 1885270 1830596 1868393 1926982 1944163 1974988 2016824 2032777 1998257 2031861
9164 2031861 2038157 2091109 2196165 2219900 2172824 2214856 2156893 2167413 2206806 2164784 2207810
9153 2207810 2233809 2247071 2256059 2236162 2250952 2297267 2347450 2374865 2420564 2402808 2458674 2501483
9141 2501483 2527934 2580362 2512505 2491974 2557978 2659774 2714458 2718470 2740223 2780961 2865337
9130 2865337 2916947 2918118 2873196 2830360 2831372 2861679 2876007 2936399 2937523 2948080 3022566 3169248
9118 3169248 3214910 3230788 3305108 3295552 3279655 3337478 3337359 3331248 3333571 3400667 3479464 3472672 3536550
9105 3536550 3588523 3613082 3619374 3648982 3690633 3730985 3811637 3846018 3855876 3900916 3996889 4035364
9093 4035364 4073824 4093801 4191112 4274247 4255123 4261164 4379254 4464107 4483113 4538229 4601332
9082 4601332 4682744 4719939 4780850 4853885 4903939 4976360 5033197 5026550 5091848 5203888 5285013
9071 5285013 5356696 5387605 5428826 5468145 5571137 5643921 5667549 5684124 5738731 5881731 6022933
9060 6022933 6083926 6179851 6309263 6376144 6414014 6466900 6589330 6686447 6792981 6999854 7109140
9049 7109140 7185000 7275491 7338150 7426799 7580313 7696943 7730291 7836410 8007684 8125724
9039 8125724 8217119 8341703 8465098 8704357 8876786 8993235 9052837 9140532 9321959 9443781
9029 9443781 9565846 9748994 9969297 10130891 10304258 10473650 10616256 10822013 11053275 11259602
9019 11259602 11475912 11709959 11929113 12079397 12303379 12532776 12738589 12969520 13195016
9010 13195016 13436819 13680880 13925359 14216081 14467570 14736460 15031951 15340037 15672033
9001 15672033 15971505 16302625 16597074 16910677 17229309 17644155 18058270 18408340 18790996
8992 18790996 19228309 19670324 20084631 20458120 20859464 21311250 21747470 22126564 22586529
8983 22586529 23090650 23603584 24084150 24550718 25042029 25600962 26216836 26898214 27561733
8974 27561733 28148796 28752769 29385779 29970985 30533754 31163424 31817359 32446397 33095649
8965 33095649 33794806 34576112 35295343 35954265 36570617 37277020 37934927 38700550 39392495
8956 39392495 40121959 40880747 41548842 42266187 42943690 43591603 44318150 45052482 45691082
8947 45691082 46329933 46880973 47402090 47881569 48344677 48777557 49244808 49627920 50037241
8938 50037241 50372482 50664083 50914721 51133981 51281755 51398142 51421603 51436183 51447813 51351658
8928 51351658 51193052 51084736 50887057 50547669 50181439 49847732 49469996 49100525 48622133
8919 48622133 48136136 47694966 47130031 46567461 45942418 45380247 44719663 44025457 43361971
8910 43361971 42614051 41954906 41339647 40704259 40001409 39211860 38447370 37750719 37099720
8901 37099720 36384388 35703712 35019289 34339763 33675349 33006285 32344516 31676573 31068756
8892 31068756 30524358 29932591 29421403 28945335 28400376 27903815 27406227 26953503 26626040
8883 26626040 26350567 26152105 26071978 26255346 26901617 28477772 31340522 34471692 35183499
8874 35183499 33151591 29596217 26268981 24056478 22636907 21565956 20635471 19772204
8866 19772204 19112826 18622081 18095657 17627180 17201180 16800980 16378362 15942487 15519475
8857 15519475 15144821 14810001 14496904 14216576 13974401 13669306 13411902 13151038 12883040
8848 12883040 12599487 12338166 12167688 11968743 11744049 11565158 11364675 11143682 11012903
8839 11012903 10956739 10857536 10605734 10298731 10019680 9741838 9526822 9397603 9275092 9139104
8829 9139104 8937237 8722708 8580460 8477400 8363533 8235523 8124077 7889907 7692861 7579439
8819 7579439 7467663 7398887 7253914 7137304 7080122 6986471 6874342 6788640 6730118 6579122
8809 6579122 6456053 6308601 6158944 6078588 6018093 5984540 5850525 5724685 5607349 5496521
8799 5496521 5476583 5429109 5373714 5376663 5319945 5288180 5179076 5139630 5062172 4994269 4935772
8788 4935772 4867879 4807148 4779539 4706908 4609938 4572812 4639184 4551463 4427246 4341887 4324354
8777 4324354 4308439 4246934 4146869 4059850 4063778 4017100 3963701 3926209 3861480 3747627 3682402
8766 3682402 3669871 3681114 3677572 3624897 3547114 3444568 3431685 3408544 3292582 3271970 3311736
8755 3311736 3230058 3142894 3087886 3115290 3154990 3118184 3122079 3104090 3075573 3053938 3003400 2861534
8743 2861534 2760767 2707237 2709060 2804347 2815428 2756647 2654940 2627779 2675323 2625225 2585535
8732 2585535 2545882 2524375 2564562 2575710 2567028 2522264 2451400 2413762 2450197 2514867 2531597 2521745
8720 2521745 2456977 2364978 2315868 2293521 2246117 2152759 2143180 2150760 2139981 2098408 2058159 2094628
8708 2094628 2109624 2066200 2112913 2154673 2115439 2066901 2040834 1951514 1927689 1940546 1948820 1928523
8696 1928523 1948860 1900295 1860037 1832957 1809467 1813353 1856392 1813827 1870798 1804778 1755089 1732633
8684 1732633 1771834 1727756 1676946 1660953 1603043 1600310 1613020 1553804 1501557 1491804 1465951 1438600
8672 1438600 1448883 1489659 1512908 1514348 1469244 1453533 1514434 1547089 1533007 1491547 1443367 1410683
8660 1410683 1414995 1398154 1336823 1342492 1349556 1327692 1321019 1308563 1283626 1316735 1371327 1436577
8648 1436577 1410106 1386647 1371803 1403954 1389227 1316125 1215789 1114313 1096343 1153830 1151488
8637 1151488 1213652 1244799 1226463 1222585 1197474 1266425 1286960 1192889 1105023 1125545 1132648 1172612
8625 1172612 1163172 1128571 1183719 1147207 1039045 994374 995611 1060381 1088197 1059789 1037577 1016582
8613 1016582 996226 1019435 1030508 1104947 1052750 1056301 1045844 988783 934697 943827 1077805 1119906
8601 1119906 1104527 1158902 1105188 1052868 1047776 995216 996561 1042708 1071257 1086754 1121382 1127881
8589 1127881 1129650 1194988 1131654 964678 861642 858439 858367 813305 813449 811030 808573 813239 783208
8576 783208 766511 733364 718245 637866 677279 727090 783026 830942 825087 825139 828426 803182 772083
8563 772083 770639 749551 738973 716100 669986 598453 680004 766880 811120 785324 819847 796833
8551 796833 726260 753499 850365 932588 1052791 1103866 985219 948438 965871 897649 879450
8540 879450 952501 1031457 1000526 971264 883822 824361 793153 721623 744233 752760 695649 679635
8528 679635 673242 651807 646061 595610 593137 564979 580913 596975 576393 558380 545586 510677
8516 510677 525963 543182 578445 609833 488529 476054 506895 527169 530652 569810 591763 549501
8504 549501 564239 629886 613618 601615 612395 640465 682440 687408 635174 520123 432811 468257
8492 468257 450389 498740 523463 505966 538185 552601 546442 617923 563887 524565 554961 508671
8480 508671 506832 498953 465797 466906 417812 399786 379586 442746 468470 461855 449207 436735
8468 436735 443285 466881 464501 473030 522924 533176 555132 652516 577783 494608 528510 531425
8456 531425 547787 476592 407570 409427 374549 309551 343023 385490 412223 401899 456037 411384
8444 411384 331730 329644 346908 330551 317704 348449 383739 370444 425563 435357 348565 374307
8432 374307 452283 439252 421044 378250 357500 390661 469155 463961 427996 331542 302508 331166
8420 331166 418786 464392 443899 489701 526019 548905 523771 461709 470764 406556 284728 272333
8408 272333 277371 290700 294002 310454 312202 277735 330486 323852 315022 325543 396481 428946 457169
8395 457169 505243 533311 527352 510772 583236 697769 875174 1176984 1631825 2432071 3243581
8384 3243581 3435029 2968280 2238317 1669363 1332461 1087901 841997 720411 683836 633319
8374 633319 625425 635335 639546 598440 579062 609724 510834 515567 587256 524335 451585 412432
8362 412432 412220 416815 405876 352106 365930 431961 472449 423799 413901 483617 540641 685159
8350 685159 828077 982001 1387014 2043284 2867840 3366259 3180034 2579666 1839172 1319556
8340 1319556 1071876 966234 867840 782876 662283 575535 559854 578851 493391 477043 451513
8329 451513 427692 384458 395508 415940 400823 386355 427504 441128 375400 314619 325394 334356
8317 334356 286249 191564 174076 193106 237971 294772 369998 307209 313548 363782 335135 289706
8305 289706 228441 258109 276133 299800 313793 284227 249686 209208 131441 86236 68496 100929
8293 100929 123675 144711 178184 173844 140152 167449 184059 166959 153479 114711 124949 128551
8281 128551 103319 154657 208210 209446 248581 258786 136539 127013 137731 84558 117985 152107
8269 152107 123772 148912 234661 299693 265807 256315 230417 226016 210671 252023 268397 326035
8257 326035 281960 218717 202354 209140 219772 230876 261971 297014 282903 229829 233094 203537
8245 203537 93232 66892 55790 27071 22175 101007 120785 160325 160544 115030 132327 172538
8233 172538 133454 113749 138960 148477 136605 156286 156405 108191 55990 35176 37910 120005
8221 120005 158163 201440 213658 138992 179930 174912 164482 212140 269894 282074 264991 214561
8209 214561 170665 181217 189270 173176 212227 236921 255748 189562 178514 207725 251109 191927
8197 191927 155297 192156 190242 208013 236981 288713 312312 291593 210145 244513 243673 186010
8185 186010 131825 137378 163779 160912 141116 157933 171582 154683 123705 132125 176452 183475
8173 183475 190226 146653 94804 135356 138640 71947 37276 51067 70030 83883 175340 193176
8161 193176 143674 113213 127472 184960 154521 77302 114096 143789 162236 150196 52834 78336
8149 78336 86102 94725 106168 128189 166751 119185 91249 118416 103811 47455 77394 122455
8137 122455 143613 163738 130493 94116 93817 140413 78832 93372 88606 137539 95640 122321
8125 122321 160016 155988 205231 208247 163219 134736 157542 139660 157859 149624 108493 94839
8113 94839 82103 87982 90735 87061 103345 147278 202672 264269 235116 184573 160405 138508
8101 138508 135417 100730 70019 72240 99976 91389 116399 151288 110433 159497 131918 128595
8089 128595 144356 107823 103901 159930 219242 150325 65098 8676 42064 89954 102363 151034
8077 151034 219859 208061 253443 308598 265089 253453 214923 221233 189876 163241 175885 165133
8065 165133 152775 64404 50562 63256 77522 157965 209422 153744 108776 88932 9245 85257
8053 85257 141446 141713 123176 85550 11048 7683 48062 103888 101602 101719 100463 99760 89683 80975
8039 80975 156743 188327 219578 179997 190749 195254 265942 277093 209720 82366 77000 152292
8027 152292 162531 161378 142982 146264 203928 227459 183799 180509 186902 176243 135386 139556 147405
8014 147405 209486 233560 156588 158512 138779 47833 11485 -28229 -35294 -31719 88552 150387
8002 150387 183934 196352 192919 135189 69033 58845 22696 43050 150747 193457 268496 287136
7990 287136 216167 180789 246160 270787 223438 247020 284379 325047 316229 266524 224773 175979
7978 175979 202050 195766 153253 171449 140738 66068 52025 106826 32406 53899 154158 157860
7966 157860 177915 169783 103915 43082 41288 87525 116956 69809 74137 95147 84509 31012
7954 31012 -7694 -34289 -643 7074 67804 134711 126785 109576 125811 79764 38080 39869
7942 39869 90628 105834 68586 58583 72888 83647 -21666 -39764 -33053 46799 112119 167105
7930 167105 183325 80096 54962 101883 84547 111978 109546 58047 -25890 -15095 23723 2975
7918 2975 -48906 15516 59273 104588 130658 167171 197873 139040 100217 100059 104524 49829 29886
7905 29886 29534 50114 45585 19978 81654 81286 70552 8625 -13632 20929 -6932 39964 91391
7892 91391 125670 68122 17929 65004 102608 113201 58643 52759 75622 101641 125306 119088
7880 119088 82231 84808 64322 -10381 19926 -1127 -22418 -21789 -39691 20486 58533 46649
7868 46649 45540 73563 91504 73590 91481 72663 4971 19808 -11018 -41705 -17579 8411
7856 8411 -15421 2092 -8860 43862 41064 49207 -15367 10699 75722 55403 43294 13771
7844 13771 57605 67034 -4806 10377 68244 56876 58582 12457 38955 26908 3631 -34737
7832 -34737 7120 33576 1278 24901 20403 16268 8718 -24630 59586 90243 42439 -25840
7820 -25840 -18327 -26481 -107792 -81423 -34953 -11485 -54568 -25321 44321 71970 96733 54457
7808 54457 7531 18315 61364 24675 -21234 -21363 -32592 42924 130500 125057 101881 75246
7796 75246 92371 46545 80899 74442 110231 87792 6759 -13789 7010 51247 38195 37808
7784 37808 6650 -18924 -70066 -24441 35670 101968 67075 -15355 -12800 3937 46651 43105
7772 43105 -6711 2974 73760 140437 124196 131200 94394 113078 36608 10625 -49429 748
7760 748 9431 39815 -34328 -3458 131256 147649 129041 110658 57015 32255 11198 -15255
7748 -15255 -43908 -39858 -23296 -52724 448 65309 72161 72411 51785 59257 35215 33219 23723
7735 23723 51651 58115 18862 -12104 -57640 -62736 -153860 -150924 -60591 13121 53615 127275
7723 127275 44144 18114 27047 -31186 -67696 -48418 -44780 -91313 -17761 58353 56006 37809
7711 37809 20721 15367 -44182 -103167 -118142 -73596 -51843 -33000 22124 -42862 -133897 -138925
7699 -138925 -89107 -28008 9689 -15513 -75897 -106710 -114559 -94299 -42613 -64693 -16642 29712
7687 29712 61235 33657 -33744 -15409 27633 22310 72674 39303 -11103 -11285 -7229 3291 -11880
7674 -11880 -69133 -97802 -120528 -54877 56815 73098 94281 66836 46933 14481 2070 -18570
7662 -18570 54962 183985 164254 101978 25964 -52948 -69599 -61459 -14114 57759 94968 134642
7650 134642 69362 -8276 -72112 -85488 -74485 -47203 23061 89565 126818 81708 46995 -22834
7638 -22834 30606 55815 13612 68448 71210 158207 151457 100879 51802 6277 -3808 32358
7626 32358 -3140 35274 71149 59904 1774 -32331 17915 48294 70938 65945 89837 17824
7614 17824 -38729 -56883 -6447 46894 89689 85019 44277 949 32530 7201 24761 77454
7602 77454 75616 135974 109361 15386 3743 64211 117245 124463 107089 166337 241102 209097
7590 209097 168370 169567 134060 63979 57933 18302 -25775 -9334 26657 54654 57375 26484
7578 26484 36575 88811 72258 95498 90771 30934 -10290 56596 128689 105969 60103 65387
7566 65387 80592 46176 37041 40690 56009 -2838 17168 -20657 -28535 23889 15724 14101 -24406
7553 -24406 -77385 -103397 -83238 -59951 -38043 -2035 36364 46344 141642 182435 143506 42084
7541 42084 51745 106549 44239 -35404 -93456 -64139 -70144 -71798 -59370 -61933 -12764 -124072
7529 -124072 -182478 -103243 -134504 -107045 -16024 -40136 -91699 1078 536 -41678 -33846 -32398
7517 -32398 -7080 28976 54714 42762 26714 30531 63320 71664 43729 4361 -4228 -5442 -39537
7504 -39537 -1850 11440 26741 12861 11395 -17630 -87894 -123979 -77495 5769 60721 106400
7492 106400 120211 15740 -30056 18946 30427 -31052 -48850 1373 -3809 -45829 -55431 -36917
7480 -36917 -64188 -74629 -36007 19841 57252 55864 55127 66269 57140 16372 75692 68732 64445
7467 64445 15102 -16242 -22000 -41471 -69134 -85772 -48654 -55502 -38590 -30764 60901 137237
7455 137237 86330 20504 -62042 -77582 -42841 -29865 -8213 25483 19539 -4452 -118062 -66208
7443 -66208 84421 55671 55797 114867 88512 53640 131421 121630 79520 56356 -14747 -58190
7431 -58190 -132672 -102434 -23172 74600 82659 55678 25307 41665 16014 -4491 -99025 -122865
7419 -122865 29140 107548 85782 27484 -29319 -10201 -5553 22642 78027 73631 19399 -9631
7407 -9631 -80999 -52055 -17307 -8118 10452 33539 60668 45460 58684 79916 90712 117478
7395 117478 97411 63855 86105 58106 2075 -33555 3891 -6912 1089 -3237 -10147 38263
7383 38263 35378 -2387 -75071 -158364 -158799 2583 71276 49590 47560 -31981 -28054 -6079 27079
7370 27079 -18173 -43777 27647 74868 116030 127625 126943 93453 95809 19576 71254 82634
7358 82634 118066 97772 76512 78351 65841 58290 22797 58027 77862 40090 20606 2915
7346 2915 20379 87656 165501 158406 97188 95370 108090 57028 23622 -856 14517 -8275
7334 -8275 -60054 -64632 -19048 -9467 -870 -48506 -104281 -54125 -34756 -25414 -1572 34515 787
7321 787 11646 47896 104904 95810 -696 -71286 -65730 -19230 3222 23834 -13052 -13018 -7682
7308 -7682 5397 -55176 -113557 -89292 -85787 -72943 -107270 -85767 -30736 -21404 -31935 11903
7296 11903 -81088 -119747 -55323 -2981 30485 25620 48453 55496 46759 51092 34497 26705 43509
7283 43509 16453 -6356 22621 4314 -67472 -55845 -16166 8407 -17730 -936 -27376 -104368
7271 -104368 -102912 -26284 15130 24799 1722 -53932 -112982 -118533 -147251 -152040 -83974 4309
7259 4309 67659 31158 20184 -7942 39394 105144 67669 9791 -19124 -12920 41381 35069
7247 35069 41388 -32411 -71991 -50365 -72907 -31054 13108 -24262 -35570 -93706 -165172 -183078
7235 -183078 -120864 -44913 -23294 4962 -35829 -63489 -83621 -38030 14468 -17375 12060 27243
7223 27243 46158 34910 31971 6708 -29796 -21317 -52995 -114410 -26571 62344 50190 15310
7211 15310 -4321 -9114 54337 39601 53852 64300 40552 35218 34708 23472 15084 -21416 -52230
7198 -52230 -33888 61413 96309 110570 44286 -8132 10792 68255 -8197 -45215 -46152 -28935
7186 -28935 -46673 -87927 -88647 1902 -36064 32065 65253 17681 32156 -15536 -89443 -45616
7174 -45616 43755 61522 43940 43536 54204 87444 50144 69178 -200 1579 58598 78906
7162 78906 -23448 -127693 -71605 2418 -27226 -35993 -45775 -54284 -28631 -14213 -2627 18529
7150 18529 51418 58688 -32998 -100490 -56819 -40460 -76405 -108837 -84916 -34612 -39842 -29716
7138 -29716 -14991 -6154 11447 -2769 -5792 -15376 -68294 -70252 -117622 -112310 -71522 -79950 -41705
7125 -41705 -63950 -64456 -15149 36191 46430 100628 96678 57759 107490 125305 80420 35523
7113 35523 17944 -38209 17052 -10398 -87744 -35230 21600 18207 -29604 -48822 -70490 -60819
7101 -60819 -64449 -123117 -208460 -194190 -113214 -79791 -41253 1523 14686 33997 58880 87692
7089 87692 89570 116438 88192 -15612 -62073 -43838 -3843 31839 28970 -30797 -29458 30032
7077 30032 44037 -21252 -82600 -118813 -37872 -23435 -74957 -125721 -102114 -77261 -85713 -58569
7065 -58569 -18817 -14249 1552 79842 -11208 -94861 -120815 -116292 -33909 51151 15292 -4542
7053 -4542 -14850 -53276 -48406 -6910 35986 47163 25377 -21738 -102461 -144268 -140894 -64237
7041 -64237 43944 44672 61454 84397 103941 97743 59252 14864 -13936 -26955 -83763 -18121
7029 -18121 26695 33207 62784 12715 -15453 -36846 -54941 -172890 -249510 -188173 -91109 -59809
7017 -59809 -100063 -71684 -25822 -10903 -25063 -15697 -23875 -56732 -23837 80473 142781 159873
7005 159873 90774 -46969 -69815 -103 -9566 -19114 15114 -44162 -99589 -41388 -18352 -38708
6993 -38708 -50749 4188 22474 58393 17996 -6634 -13244 -24371 -3085 24343 -24430 -53552
6981 -53552 -49643 -67271 -71060 -7711 7061 21483 -8871 -24684 18493 18229 19213 19223 10595 -29090
6967 -29090 -10368 33834 51880 65539 42794 40410 17610 25928 6255 5451 34757 180358
6955 180358 157744 129306 96549 75861 44295 76900 73786 69228 46561 -30262 -15764 -19955
6943 -19955 -57499 -17183 4561 12309 -26804 -17644 -55421 -77019 -67654 -53632 -35191 48747
6931 48747 16985 22228 -50401 -96724 -138509 -128682 -74585 -68056 -113503 -186453 -198412 -125281
6919 -125281 -67707 -44078 42949 19100 -63493 -39828 -56672 -123139 9552 85168 48797
6908 48797 25160 -39306 -12313 -16579 -40096 -42057 -36575 -27923 -43201 -103483 -128289 -48048 -77184
6895 -77184 -109971 -36020 8183 -25645 -41105 8540 26410 -47237 -100026 -80097 -51962 -104654
6883 -104654 -185288 -158031 -98881 -36559 -12430 46708 99453 131879 138194 132411 112716 142516
6871 142516 92514 2447 2117 -62448 -60627 -39265 -31300 18318 20460 -12759 -60370 -37906 12842
6858 12842 38330 37701 41699 29176 29562 27049 -27643 -109518 -47170 9777 42118 55360 25992
6845 25992 -38291 -26470 -10683 24375 126917 111982 96836 86702 -1745 -54874 -22341 -59232
6833 -59232 -14016 65056 33957 8898 16660 -22059 -12874 20743 60343 -35678 -86081 -84753
6821 -84753 -25930 -48940 14801 31677 -17598 25867 59549 44994 22077 -19927 -35143 26958
6809 26958 73633 89773 56020 21915 -18330 21217 18999 26914 38375 21603 -25757 -20224
6797 -20224 27727 7428 21494 14959 26942 -25500 -103545 -63765 -78832 -130174 -91883 11184
6785 11184 46725 33475 5601 13925 51912 69212 94975 -7608 -90483 -38453 48118 77897
6773 77897 2765 -30997 30796 41723 -7035 -53285 -81267 -114704 -92513 -58352 -49461 46481
6761 46481 25769 -310 -13372 -21323 -2208 12605 -73072 -109327 -60726 -65911 -61985 24445
6749 24445 54229 19788 1506 654 50367 79961 109342 127509 50480 38560 68917 67083
6737 67083 56834 19163 9171 14037 63131 114939 54496 8534 6881 12853 13630 63092 49653
6724 49653 10158 13934 73464 110635 127294 83131 59476 51376 32667 91034 164105 123992
6712 123992 72538 58658 70340 80449 26809 -57746 -109075 -117427 -98670 38283 37321 4199
6700 4199 -18751 17641 19578 18162 -4461 -56921 -67331 -107329 -99375 -28172 18688 73340 43537
6687 43537 -4641 37546 60786 65026 19037 -32209 -61587 4318 196 -73240 -129678 -165083
6675 -165083 -154833 -95795 -53011 -20407 10689 76580 99427 120850 111053 102966 96236 53281
6663 53281 35897 12500 -4748 27601 104578 71384 17400 -2516 -18208 -49342 -72012 -68546
6651 -68546 -34291 22919 43564 65781 45757 -57526 -133978 -157815 -174973 -135569 -96056 -63409
6639 -63409 -20844 -19308 -28775 -65770 -59082 -57736 -96176 -89388 -25509 24608 55190 60759 60486
6626 60486 -1304 18441 25115 4296 -35667 -54146 -25578 26179 28919 11782 -34674 -67065
6614 -67065 -39362 8499 2253 -42380 -44769 -37458 -68647 -56351 -96558 -125949 -141143 -148228 -81369
6601 -81369 17090 74424 59597 13957 -6847 -52487 -3033 -37929 -81580 -72364 -31392 -166
6589 -166 5507 -50485 -19654 49479 -16594 -34509 -40822 17359 87078 35311 -86169 -91452 -116346
6576 -116346 -67999 -25899 -31391 14637 21410 -9566 -65147 -143518 -142820 -24023 25147 13535
6564 13535 -20177 -19177 -88817 -105072 -106834 -133553 -146389 -194191 -222684 -196424 -208388 -185934
6552 -185934 -126418 -111876 -76503 -43276 -51271 -66750 -58965 -91739 -93144 -59857 -64742 -35039
6540 -35039 19889 35883 -8028 -94474 -181936 -162091 -129526 -115663 -91044 -45102 38812 42351
6528 42351 48233 24936 -37864 -45492 41813 72198 45803 20554 15271 -114502 -120305 -128122 -127403
6515 -127403 -96234 -69652 -92204 -93862 -57830 5068 46433 47098 -5467 18931 13003 20699 38349
6502 38349 -3199 35623 79763 100334 89374 21959 -43767 -38633 -41074 -25282 -19911 -30576
6490 -30576 -12710 -70753 -63896 -12231 -35514 -51317 -70080 -35990 -5670 -13658 -75615 -59151
6478 -59151 -37077 -43485 45870 21477 -43529 -47768 10978 67057 76372 48025 18654 39010
6466 39010 80281 81824 78118 55658 14734 -77984 -120300 -90475 -153522 -168302 -121436 -97552
6454 -97552 -48462 -55456 -64169 -82744 -60241 -38162 -70755 -49544 -113977 -119390 -102033 -109094 -20389
6441 -20389 89105 111439 65491 21005 -5946 2615 74634 83577 99313 47865 71676 26883
6429 26883 -34468 -64422 -126150 -97751 -32262 413 59513 37933 -38055 -39292 -27445 9397
6417 9397 26442 13557 -41126 -84166 -41884 -71096 -105039 -75793 -40955 4117 15573 2618
6405 2618 -80037 -93152 -67749 -71382 -113059 -130147 -89645 -29762 -1127 18830 -20065 -9853
6393 -9853 23529 -57194 -78743 -78086 -6435 89777 79297 117182 97716 56713 82433 70797
6381 70797 81827 61523 12199 2544 44137 93062 133307 190276 104849 49268 70458 -1538
6369 -1538 -49570 14922 33623 70130 108138 24571 -75156 -90122 -79759 -49915 -21720 33693
6357 33693 5241 -38388 -62946 -71860 -75852 -21561 14228 -75781 -167489 -106157 -31893 34248
6345 34248 41125 -23400 -41142 -27133 50631 64461 31953 24699 -10069 -15556 -8257 -37168 -19007
6332 -19007 23696 -32915 -27939 -19586 17920 45361 14899 -18454 9754 6385 -16363 17346
6320 17346 -37267 -49012 -54977 -4624 44428 -20075 -57923 -21524 58833 38891 -33633 -37573
6308 -37573 -46914 -38051 50495 24807 23804 32646 -8240 4780 72079 101441 50300 18918 -35635
6295 -35635 -15799 8820 -14532 -60776 -61272 -56054 4718 25568 29119 -5178 7499 -33178 -2710
6282 -2710 56829 72785 21932 -6894 -44397 -51062 -66282 -38693 4781 4877 -23043 16855 -45648
6269 -45648 -63718 -100084 -119875 -141855 -145377 -118058 -60557 -28247 -84735 -23786 5558 7990
6257 7990 -35660 -16008 -4534 52201 97427 143313 78766 31238 20093 19417 -49630 -83914
6245 -83914 12211 69960 69122 6468 -84317 -112618 -76782 -101390 -83796 -19249 -41126 -27553
6233 -27553 -29739 16508 32280 102692 122118 30488 -541 -35975 -11207 -1580 16444 104159
6221 104159 13906 -50454 -53421 -58497 -26128 -43959 -1277 69498 67537 84032 65036 -10848
6209 -10848 17951 57027 60669 74708 26909 44114 12530 26654 60115 83881 90743 51988
6197 51988 -44143 -49784 -57458 -81068 -82418 -88780 -78239 -72654 -26947 -16021 -22943 27416 92544
6184 92544 30005 -49633 -59090 -56500 -56196 -14857 -64781 -58569 9758 32493 49508 48120 11447
6171 11447 -51643 -69859 -20670 35331 -6578 -20713 -672 24363 -23716 -71246 -87064 -71462
6159 -71462 -12131 -42817 -33969 -34702 -2888 41322 63326 57141 23570 -19730 -64482 -77451 -67353
6146 -67353 -16015 32351 32905 61375 42224 36203 41989 14315 1747 -25508 -10314 -37146 -45842
6133 -45842 -6352 8009 12698 25830 38264 50668 -13384 -94374 -159982 -154591 -82164 26157
6121 26157 89740 28918 -51158 -67748 -17376 -55958 -90804 -87675 -72332 -107054 -128867 -80471
6109 -80471 -41724 -46279 -56135 -93389 -117537 -105547 -69698 54790 121710 39731 -4221 16684
6097 16684 45639 -2104 -20316 -15775 -72327 -77854 -26467 36324 -12431 -86637 -69550 -67405
6085 -67405 -67048 -15876 -55622 -70586 -67600 -58893 19800 37603 14507 -356 -8545 -85032 -127356
6072 -127356 -98499 -127747 -175244 -136161 -97233 -103812 -150264 -135547 -120174 -101953 -44234 -114284
6060 -114284 -219149 -170744 -116684 -85140 27189 97199 79992 17732 -26277 3934 63343
6049 63343 40558 25708 21422 -31812 -69611 -8366 56151 -6568 -31825 -12693 42282 62176
6037 62176 -9814 -10598 9746 17405 35289 66287 23868 -76261 -41650 -14901 -44442 -84775
6025 -84775 -120441 -111278 -106440 -117934 -148326 -109797 -55323 -43024 4566 1866 -34658 4327
6013 4327 54750 66994 26484 -13066 32304 59768 66822 37610 35336 97635 99381 100370 46984
6000 46984 35824 10659 -27888 25865 100399 158075 40388 -54485 -3924 59803 109783 65770
5988 65770 -10367 -24066 17984 87062 120435 78041 95403 83431 62932 20377 47519 75277
5976 75277 45030 -34692 -55026 39805 23333 -21013 15204 -12974 -116984 -138493 -91635 15155
5964 15155 16048 -90434 -82313 -18316 12475 69898 55965 -13974 -64771 -89730 -128959 -128338 -170410
5951 -170410 -105784 -44797 -82694 -50971 -462 -65780 -125557 -106161 -97524 -120997 -11054 73490
5939 73490 35572 -23492 -19261 -1679 -45978 -80867 -109760 35461 166343 146852 84786 60659
5927 60659 93861 39896 -58263 -146717 -195670 -190666 -170209 -175627 -145194 -23863 -29336 -51077
5915 -51077 -35239 -37380 -47359 -78562 -104456 -40752 8667 -33537 -34470 36668 55608 42580 -67904
5902 -67904 -122949 -70862 -76559 -60517 -39108 -82110 -28885 14286 3209 39126 -1891 -123939
5890 -123939 -137188 -12012 45698 19249 31608 38017 -18692 6702 29276 -40934 -59940 -54199
5878 -54199 -110127 -92728 -103671 -120209 -121817 -124458 -63192 14285 2033 -30948 -32291 106706
5866 106706 183149 170879 119592 698 -47409 -100821 -73766 -83755 -55864 -36875 -72775 -80313
5854 -80313 -48084 -24593 -34250 -67507 -83000 -18586 4610 -5271 -81983 -118834 -107668 -69770
5842 -69770 -61161 -23709 12592 58381 34486 -90623 -155291 -137176 -89360 -27979 -10731 31422
5830 31422 15972 -88790 -98762 -61765 -84870 -104403 -85958 8482 41461 -45178 -54165 21526
5818 21526 33770 -1334 -44704 -112950 -99157 -86193 -113317 -76649 -95271 -118168 -104313 -141541
5806 -141541 -132934 -81610 -49218 -47671 -2092 4774 -4540 -49828 -98334 -68053 -31223 -9638
5794 -9638 -9007 8567 -15895 -31716 -38936 -22438 658 -78562 -88500 -76897 -88618 -111873 -98142
5781 -98142 -110909 -62278 -26047 9650 28989 30617 12936 -21036 -27526 -29856 24606 -1303
5769 -1303 -39661 -86861 -66285 1348 13350 55630 -1293 -27352 -59198 -63398 -49984 -63849
5757 -63849 -110028 -95316 -43665 11387 -18470 -53176 -22793 19390 -31740 3538 -5467 -7691
5745 -7691 35325 44184 9720 -41634 -52830 -59522 -43409 -53650 22424 -9861 16797 -14914
5733 -14914 -12480 11792 13323 -17643 -18809 -4917 52115 48425 16536 69623 93387 44799 -23435
5720 -23435 -37798 -51438 -26549 -21541 37861 56912 -50962 -133955 -132578 -128769 -66549 -94985
5708 -94985 -74877 -49193 -42311 50813 59044 -13857 -47032 -53066 -18510 8274 4078 -18664 -31715
5695 -31715 -73171 -91713 -80867 -119655 -158034 -95268 -47592 -6564 5834 24749 35358 -8141
5683 -8141 -95899 -180560 -182218 -201554 -231259 -186465 -141409 -118051 -131201 -138519 -188072 -127734
5671 -127734 -48035 -50878 -46920 27560 41221 22971 26326 -14994 -98804 -84932 -118069 -109716
5659 -109716 -146392 -84943 81162 121201 85807 12483 -62983 -34452 18809 -957 22182
5648 22182 30193 522 22063 50900 46759 114650 109537 77392 67593 -1546 -43922 -42747 38816
5635 38816 74551 82605 54026 73358 105134 90196 68978 117577 74256 31707 81244 96866
5623 96866 -32117 -88953 -99789 -58357 2168 -27157 -49020 -52920 -4146 -40305 -98282 -97301
5611 -97301 -106092 -85345 -102754 -94223 -91438 -61836 -35599 15975 -12787 -2558 -73989 -121975
5599 -121975 -107446 -70100 -26225 23075 39401 12736 24553 9957 -62133 -45719 -66948 -144549
5587 -144549 -177167 -141472 -36431 -65252 -173437 -87501 -7098 -30207 -119728 -113322 -65324
5576 -65324 -54496 -89662 -118616 -95653 -3294 -38485 -81105 -9135 30400 63666 55346 49815
5564 49815 34536 -8827 -48287 -62254 -71708 -94038 -99165 -180748 -211924 -161401 -193647 -251552
5552 -251552 -188353 -98424 -46138 -32012 660 -5701 22183 39736 11751 -5717 28580 21571
5540 21571 -29519 -49887 -43639 -11589 32016 12414 -15790 18510 -3818 -7520 17862 40647
5528 40647 42354 24388 -25680 -56850 -19582 -5956 -11917 31454 -47999 4646 91782 88394
5516 88394 13764 4836 15084 24726 23129 94363 86591 51549 47020 79975 116930 94040 81004
5503 81004 49281 81511 86217 46759 21102 -17555 6965 425 11228 34676 58141 49420
5491 49420 6340 -20928 47751 40744 -18233 -29847 -8443 57333 79553 80336 25207 -67167
5479 -67167 -134670 -64564 1308 -39326 -155596 -131050 -95436 -24027 -36945 -49680 -88571 -105357
5467 -105357 -52038 -58881 -96380 -102541 -66163 -6103 15708 -16253 -56671 -122438 -85834 8191
5455 8191 26504 14301 -11535 -90759 -89570 -87174 -103758 -38090 18953 1928 -19014 -71350
5443 -71350 -165132 -167388 -96179 -51467 -71035 -114472 -84360 -39848 -107725 -111171 -29236 10746
5431 10746 -29692 -97230 -139912 -55054 56739 86594 109347 67771 7983 -107860 -167435
5420 -167435 -147560 -109486 -18735 33918 -30103 -89374 -53872 -63088 -144688 -183690 -180165 -116993
5408 -116993 -97349 -91738 -43037 -74818 -121340 -165186 -153794 -50451 -59194 -69879 -56905 -111808
5396 -111808 -80343 -29990 -23064 12310 100230 87478 89686 94584 805 -4865 47215 10284
5384 10284 -47969 -30907 -54655 -20516 17691 -14874 -110810 -183343 -204609 -131124 -22574 -12347
5372 -12347 -89936 -170130 -162735 -88410 -77541 -42681 -61141 -87928 -12798 -38760 -66312 -27509
5360 -27509 -15383 -3091 20380 100697 84100 37433 64640 43809 -13382 -16440 -81631 -120256
5348 -120256 -72066 -18923 -2340 23874 80611 114459 89997 -8263 -11339 -42496 -38828 59837
5336 59837 27808 -26171 -75448 -53037 -52653 -63066 -62295 -57553 -74477 -86269 -94542 -101439 -82157
5323 -82157 -107236 -185775 -190935 -200000 -132243 -64626 -43502 -3816 -9692 6576 25781 -2759
5311 -2759 -38579 -56407 -13219 -551 -12861 -82431 -125481 -127983 -78073 -126758 -84938 -37069
5299 -37069 -14269 -56287 -37834 17030 66053 9723 -65367 42109 137626 131786 50672 -3784
5287 -3784 -26422 8469 27474 33445 -21385 595 34691 -18753 -9889 945 22084 -39253
5275 -39253 -38886 -21890 -70594 -56661 -49939 2578 16352 31267 26330 -22008 -64001 -61872 -42329
5262 -42329 -62010 -45881 -48945 -26462 -32546 -102645 -108593 -64046 -19516 33497 43819 21230
5250 21230 5703 -74552 -70706 -17217 31357 42489 18474 13696 42875 -6409 -51648 -27786
5238 -27786 31326 51103 -1328 -7443 29736 99315 31394 15050 39790 -14321 -59526 -26791
5226 -26791 -22877 21177 68958 116007 114654 100032 45662 49613 15850 -87343 -79383 41027
5214 41027 68642 114334 84020 50531 25339 15849 -29671 -93487 -41070 -71455 -73385 -66120
5202 -66120 -90194 -63521 -43285 -60540 -30672 -30644 15474 29024 6362 44562 40773 21632 -5285
5189 -5285 -28741 -56086 -25300 -29672 16136 6525 -26043 -55083 -1461 54074 32821 4678
5177 4678 -7332 -26722 -67318 30986 121108 148067 90796 66583 66586 61497 28787 35172 43055
5164 43055 73117 33294 21522 -30375 -46596 -41752 -25740 36794 53535 16869 88077 89538
5152 89538 40815 65126 62252 101575 28048 -1094 19079 2989 6195 39017 84289 34317
5140 34317 -14729 -24650 -62633 -59350 829 39661 58583 7479 -42517 -75158 -149094 -185494
5128 -185494 -136008 -92160 -107283 -73648 -95651 -57306 61012 66236 -1026 -37934 -136405 -99900
5116 -99900 -73487 -34622 16810 48619 68135 29538 32873 26455 51392 61673 53990 69550
5104 69550 9167 -41082 -8100 35450 269 -20268 -38087 -115534 -98849 -40636 -60670 -19313
5092 -19313 2173 -8994 48408 46447 71867 41678 64967 77613 2964 -21600 -5631 -64770
5080 -64770 -52426 -12980 6414 34312 66098 74425 70372 121911 95281 16815 78166 34148
5068 34148 -51393 -4228 17785 45574 52598 21438 -41756 -44867 -8074 23756 39546 46349
5056 46349 -37925 -64049 -6986 -67035 -105589 -88480 -76711 -58398 -92203 -61293 -40247 -871
5044 -871 104728 135272 124264 90667 73283 36112 73348 34873 10653 33970 75546 130706
5032 130706 192310 164972 144023 52722 7150 -28714 -3441 -2708 -8394 -6390 -14431 -35301 11531
5019 11531 47404 64045 75250 8894 -37132 -51722 -45436 -38483 -26659 -95703 -104647 -69427
5007 -69427 -22171 -25363 19414 58262 110411 34863 -65308 -108273 -152101 -81116 -23592 30182
4995 30182 34858 57481 33112 49728 38563 20622 37796 31744 70604 72104 29706 28668 15357
4982 15357 55556 27204 23880 34632 27290 24647 26021 -30339 -38715 6864 65178 78557 70480
4969 70480 9501 20897 5149 -15264 -10719 14885 87522 102158 106064 42862 -20261 -2676
4957 -2676 39874 51717 76313 75906 58242 -6653 -4479 -28082 -111206 -69242 -45706 -11593 -23510
4944 -23510 -44286 -30476 -22673 -43166 8150 -16051 -49367 -42631 4361 -9242 37802 35268
4932 35268 -10233 5827 29808 11429 -37254 -54674 -40221 -17030 20287 32755 92673 33276
4920 33276 -78917 -9329 53302 25297 29226 31056 -3620 10459 100845 123080 90735 78382
4908 78382 96874 53348 -1879 -72861 -124439 -131063 -52790 -2398 -54653 -61076 -40527 1272
4896 1272 -49856 -69021 -47212 -77843 -78446 -54758 -29685 -5196 -14746 -21497 -13373 -75507 -84243
4883 -84243 -77161 -55791 -120890 -148169 -132082 -111478 -151872 -156047 -97713 -40841 33977 48225
4871 48225 16823 35515 98307 115666 114763 132410 76778 19578 -7289 -37803 -3470 5126
4859 5126 13921 57627 106796 52953 -7967 -53299 -72770 -71932 -5392 2204 -49790 -100560 -101329
4846 -101329 -169141 -181831 -117716 -143523 -168841 -117002 -130531 -127491 -130114 -106022 -78071 -114710
4834 -114710 -126511 -87377 -24146 -114440 -114906 -26469 24624 18207 -42539 -98066 -40267 -66446
4822 -66446 -87909 -25741 -14871 4231 75219 -8729 -112371 -84093 -36899 -60157 -74444 -102593
4810 -102593 -121735 -78010 -7980 -1838 -18724 -49141 2292 19377 -87355 -78286 -18173 20106
4798 20106 38047 26192 19322 -38223 -59689 -64089 -44996 8096 19735 9824 52610 -3936
4786 -3936 -75173 -94713 -143896 -140697 -41519 -23298 19253 76574 45191 -22390 -68499 -102570
4774 -102570 -103369 -64602 -131832 -84957 4473 49670 36301 56989 52750 36904 53900 -33092
4762 -33092 -79276 -67592 -46136 -88650 -87158 -32476 -27978 -10741 7182 -9555 -22168 -22681 -69491
4749 -69491 -107490 -86404 -42544 21413 70134 61369 59595 35273 16562 -17828 -75319 -55376
4737 -55376 -18200 -9560 3693 -24758 -42561 -25276 -55666 -47571 -43317 -90913 -90350 -39880 -49278
4724 -49278 -64987 -36843 -62005 -64421 40524 123184 107166 95790 16382 -2358 -12402 -29407
4712 -29407 -83180 -45536 -45406 17485 62782 77980 86880 104873 82943 77199 85196 34668 -7915
4699 -7915 50578 102944 79163 40102 58 1638 -15395 -106478 -119420 -57314 -38315 -7519
4687 -7519 29805 31670 54323 -15840 -50223 13016 -8205 -45869 -38611 -114682 -77127 -60774
4675 -60774 -58313 -25392 -42298 -31516 -10471 -26888 -2667 20517 -32574 -51230 -25720 -37801
4663 -37801 8135 78040 67627 55088 3042 -43607 -4079 69416 41231 -28121 -75149 -68839
4651 -68839 -47745 -90172 -113322 -37567 -854 -48973 -129416 -135308 -103930 -50339 -20137 -74541
4639 -74541 -80282 -77548 -89561 -5102 49877 1259 -57324 1846 -7020 -70100 -113225 -122308 -118507
4626 -118507 -59976 -98647 -95609 -48591 -57915 -88769 -103675 -101413 -113538 -107520 -102614 -101787 -69412
4613 -69412 -96303 1403 -25991 -138185 -140011 -82531 -8202 41112 63606 97147 32595 11557
4601 11557 35366 73142 40271 -5614 -12042 -16384 -73227 -64869 -58260 -50487 -49522 -29946 -27353
4588 -27353 -100666 -143829 -124323 -37776 -4952 -45119 -100828 -62920 21870 117154 161288 173241
4576 173241 102996 69040 -18434 -22933 24260 -6555 -49753 30846 91126 138438 84847 46789
4564 46789 10203 -16698 -36217 -43012 -92045 -96033 -121592 -80266 -11891 4742 -65120 -63736
4552 -63736 -71614 -75867 -30050 -52935 -78749 -51394 -51545 -72331 -30175 -5907 -25187 -54860 -70860
4539 -70860 -65283 -57958 -56618 670 -29033 -36796 30835 88356 63217 99383 25720 -14269 8289
4526 8289 21072 71170 36539 6383 16610 2444 26704 5099 -3990 -3931 -41782 -36191 1478
4513 1478 -5534 -3088 15013 -3224 -51409 -58858 -17580 19290 8013 10822 -35757 -55743 -16454
4500 -16454 -24268 -23487 -11753 38045 -28995 -76847 -54473 -26628 -22848 -26154 -48780 -99026 -63170
4487 -63170 27130 33575 6213 -6963 -27456 -3159 -56028 711 22949 -44818 -79756 -19380
4475 -19380 15251 33403 35453 -50608 -88386 -82767 -125225 -130532 -75710 -18747 17767 51010
4463 51010 43670 37742 -4891 -35887 -27606 -57817 -74763 -34956 29618 7875 24928 30165 -25103
4450 -25103 -31970 26492 76031 72381 25927 -32497 19654 37021 -40883 -23301 1984 21962
4438 21962 -11778 2963 15580 -11683 -42455 -17136 13998 24286 26965 55270 -22844 -105301
4426 -105301 -94453 -146024 -186401 -69554 3499 -21714 -16846 -23695 -5064 -35281 -38323 7884
4414 7884 72548 6946 -120078 -158588 -176732 -90127 -69652 -17332 -3487 -24302 -57853 -70558
4402 -70558 -80335 -21925 -15888 -23663 -68640 -49640 -41670 -66637 -40638 -47768 -43486 15150 90597
4389 90597 52128 -25707 -107037 -98586 -43159 5233 -28206 -80268 -53014 -35082 19478 20341
4377 20341 56309 88088 25743 -40780 -16869 15567 81190 64226 87032 -25462 -89391 -13725
4365 -13725 1781 -2801 -6408 -58135 -50390 -1514 49801 98341 84184 114608 114419 51653 37461
4352 37461 -48961 -20570 -30799 -33530 -1141 13074 24836 36268 -910 -22268 7244 -66430
4340 -66430 -102355 -110789 -178033 -205818 -185552 -113708 -53830 -67242 -61131 -74934 -20893 11249
4328 11249 -2745 41183 50816 120450 100512 -1368 -17282 -28943 -19379 37196 57569 468
4316 468 -53163 -89422 -58736 34274 66083 52699 67977 116122 54198 -22450 842 -29296
4304 -29296 -56520 -27995 -1224 -6179 25214 35374 115519 160520 97763 101163 133359 87746
4292 87746 127789 108979 55038 36561 8576 31540 13128 6250 -57506 -115027 -150176 -156000
4280 -156000 -38814 371 -61676 -111573 -68524 -20698 -42910 -86279 -29241 61152 38716
4269 38716 -3543 -84283 -107872 -111349 -79276 -12491 -39820 -66641 -42178 -27322 -19469 1034
4257 1034 14605 -72892 -26539 -44652 -60745 13665 50402 15768 59481 76958 28796 24448
4245 24448 25167 50743 45718 86044 110058 112179 19518 36432 30240 23180 26985 661 45603
4232 45603 85752 66810 83840 50738 -10463 29504 23791 -31446 -105522 -144715 -65082 -36994
4220 -36994 -53682 -36049 -5518 -5344 -37034 -68099 -60314 -81696 -10304 76579 87973 93647 77491
4207 77491 60294 22692 11975 11826 -13544 -57609 -74538 -83782 -25643 19618 54314 9534
4195 9534 -64651 -94730 -131599 -62183 48108 124769 122707 48002 68559 6417 -69017 -45496
4183 -45496 -9673 -83611 -61571 -9589 69751 87818 88185 98172 -3003 -35410 -50212 -51535
4171 -51535 -34341 -7463 15073 -20945 -55728 18728 45388 -10509 -46233 -77577 -139726 -85047
4159 -85047 -41897 -93612 -140584 -92961 -40567 -2450 18142 5636 13825 29647 -11875 -38611
4147 -38611 41387 60209 25667 5301 53599 79807 -26844 -82380 -84954 -76431 -110946 -97446
4135 -97446 -118236 -155511 -139000 -146349 -97977 -96780 -68646 32642 84892 8885 21389 -8490
4123 -8490 -41667 -44876 4702 18607 -46904 -48876 -7457 -99851 -186424 -167306 -103523 -57126
4111 -57126 8029 19793 -2260 80197 50490 5679 24950 47712 22591 -7717 1763 42799
4099 42799 39214 -7743 -46607 -37160 -13081 -59551 -78008 -59042 -15846 27935 22364 -3356
4087 -3356 -43265 -1951 40223 3032 12137 -51837 -65233 -37343 829 23363 -7268 -34472
4075 -34472 28774 -36682 -133972 -139477 -74766 27608 10555 -31438 -18618 -26632 -46576 -35350
4063 -35350 16694 -33335 -73165 -69742 -98479 -51999 -8033 -35388 4461 20845 18202 -64346
4051 -64346 -102118 -151123 -53036 43214 109922 63832 41420 23576 2147 4488 -19480 -26023
4039 -26023 32657 6740 -16696 31270 1066 5357 2210 -37450 -27298 9480 23041 27972
4027 27972 19526 81047 83161 23912 -55275 -100519 -136348 -212625 -202287 -86784 -53063 -82367
4015 -82367 -77346 -44784 -92809 -122986 -107366 -116649 -43002 -7101 20003 13436 -21334 11885
4003 11885 70945 14225 -7875 -23491 18576 45344 67457 59932 16352 46475 17946 -11300
3991 -11300 -60445 -98573 -65804 -18601 -26387 -82949 -140995 -182731 -182099 -120687 -47236 -69507
3979 -69507 -94157 -63372 44522 66511 84013 74707 -3381 -38698 34300 156277 133125 109076
3967 109076 96118 33598 -3886 61502 71734 17970 -17303 -21187 24670 93471 99133 45540
3955 45540 14188 123391 133582 16641 47472 25908 20631 20798 28344 52876 37660 5956
3943 5956 -96291 -129906 -101289 -44008 -8385 44576 77569 59310 67298 153142 127193 59950
3931 59950 15730 38333 16514 40398 62438 61813 64940 -32742 -25862 47333 22918 -30166 -66187
3918 -66187 -104006 -110815 -105718 -117465 -84228 -63250 -11218 87928 111562 56560 7077 -2912
3906 -2912 -52121 -44553 36576 35645 -15333 -2483 5942 10037 10954 -16048 -43107 -11160 -26239
3893 -26239 -30765 -21526 -17822 -84898 -60774 -110298 -170935 -135923 -75841 -43058 -72669 -70945 -20456
3880 -20456 31707 23523 33643 51849 51687 63778 43719 54159 63898 44620 -57816 -70814
3868 -70814 -41221 -107386 -166377 -148733 -38845 36698 83855 53883 21141 -30789 64581 58231
3856 58231 -14680 15639 48628 54239 19796 -27357 -6713 4875 -30867 -39903 -32931 -11480
3844 -11480 -71551 -52669 -73465 -58217 -7885 33314 12142 -56548 -141168 -134924 -99187 -70055
3832 -70055 -49016 -70461 -52168 -51112 11346 88931 107954 88219 95918 100799 79214 28122
3820 28122 -8046 -10873 29667 11922 11461 60658 67469 16074 -70338 -51753 -62819 -47972 -44585
3807 -44585 -40569 -40548 -48814 -33559 -18752 -9799 34502 -18589 -37240 -26436 -15888 20181 -27039
3794 -27039 -75881 -37944 3348 -29760 8277 4926 -9232 94484 163913 88496 23704 -34171
3782 -34171 -20690 -36 6545 18794 49977 32680 -40339 -53354 -74977 -82576 -37211 -20447
3770 -20447 14999 29447 62206 57153 52530 -15678 17443 61510 81374 108210 52827 11914
3758 11914 26833 82473 100668 106189 80163 19739 15660 -30092 -39541 -93637 -125370 -97900
3746 -97900 2060 21520 -493 73097 85688 60194 -3225 -16624 -62466 -152831 -148027 -128311
3734 -128311 -85349 -20419 -11166 23435 17101 1970 -15239 4964 18203 -41545 -1441 43778
3722 43778 56165 -3723 -10076 -18160 -8494 -28038 -23958 1940 83182 58516 -22739 -28474 -35822
3709 -35822 -21831 3387 39508 62601 -5938 47573 69942 -44556 -75864 25514 75442
3698 75442 71296 13579 -31119 -10541 15590 -2560 10070 -70118 -75836 7370 16011 -9985
3686 -9985 49779 63234 64513 92864 91508 79321 -39731 -44781 20283 18133 -10169 16114 14961
3673 14961 9216 -15218 -15885 -64399 -66770 -10835 -9499 -19415 -5427 -50447 -9803 13933 -14641
3660 -14641 26123 57407 25571 -47379 -53193 1272 65588 44181 55621 61761 43818 53226
3648 53226 66233 14997 6844 30125 91139 110791 79265 34270 8279 41490 18215 -4792
3636 -4792 37969 70145 2788 -75818 -198288 -227503 -176280 -63793 9440 63132 31575 16368
3624 16368 13911 -16062 -40266 -34361 -56872 -17071 110439 152426 116860 25221 -64301 -92216
3612 -92216 -122440 -112369 -56396 -42808 -53598 -24418 57155 66972 35661 -34136 -48953 -43311
3600 -43311 -95859 -69649 47579 107681 14419 -43923 -78735 -63969 -84817 -20799 38888 73516
3588 73516 89070 20953 -10677 11451 4653 67344 63207 68745 105136 69975 67841 18471 79077
3575 79077 64400 29097 -16995 -34014 -49306 -97717 -131606 -98668 -18416 -48300 -68526 -20359
3563 -20359 -26413 -36898 -51134 -34489 -2008 3866 44378 4101 -43983 -49981 -84367 -70590
3551 -70590 -35761 -29056 10650 62773 55466 38297 -35284 -13827 -34340 -75774 -62149 -68085
3539 -68085 -85123 -102981 -71418 -19186 -3898 45676 48368 61162 10015 -45743 -48703 -102433
3527 -102433 -151824 -156811 -30302 -38320 2939 -8132 630 33390 27399 44853 31230 -13749
3515 -13749 4708 42244 32658 1520 -81372 -124702 -107367 -46808 -413 -50842 -40040 -33948
3503 -33948 4371 15824 -26985 13976 20349 23110 32534 48017 20155 -20874 -20243 41043 39110
3490 39110 71208 109668 67931 -30620 -30966 -33775 -30605 38803 64717 20824 3422 18547 56961
3477 56961 18883 28578 14937 59975 47687 3378 -16602 47925 32711 13482 -17857 -43422
3465 -43422 -44511 -15866 -64765 -83985 -69398 -8148 -21111 -52961 -69538 -66934 -40606 6390
3453 6390 -26771 -59130 -78565 -78162 -40683 32835 68446 45159 3437 -48478 37739 14582
3441 14582 21994 51259 64559 -20136 -73875 -27878 -73636 -85663 -54327 -92579 -4957 81000
3429 81000 135244 124065 77747 51175 82368 50881 131020 213592 194549 153346 123750 106941
3417 106941 109000 51351 30298 22434 5256 36946 42785 65060 46670 70697 46151 54585
3405 54585 -58389 -23405 15476 55219 59305 70054 33997 43650 17449 -37053 -62859 -52978
3393 -52978 -47447 -2349 -42382 -43007 -85497 -134327 -136150 -83110 -49721 18204 -39223 -45053 -23416
3380 -23416 -37349 -79224 -39550 -41961 -72522 -110055 -82393 -92993 -108839 -112678 -91089 -74031
3368 -74031 -89717 -104428 -80924 -45143 -5532 31000 21985 52263 84676 14568 -29929 -47600
3356 -47600 -75055 -37783 -2672 22305 48460 29970 75619 134894 85370 46126 9967 12041
3344 12041 -23348 13392 18839 3495 29927 15665 -9417 19485 64041 139150 163959 160579
3332 160579 75718 -17726 -44753 -27053 -38050 -23985 15642 34719 46804 14634 59522 75007
3320 75007 51279 59568 -13821 -7623 17797 58986 59207 63933 15053 14975 22062 28748 6715 -31451
3306 -31451 -46155 -40088 23152 17709 16658 -45168 -10050 98759 146875 160537 94508 -6765
3294 -6765 13443 63883 96914 87578 94573 46565 -13680 43207 42687 13062 43038 81661 66368
3281 66368 39176 -264 10338 21405 -3581 33597 23613 -9324 -2865 1045 10380 46553 59373
3268 59373 45981 27791 36655 93222 83472 38363 10649 -9971 -16632 33239 8336 -35151
3256 -35151 -17836 4405 -21623 -9059 -3438 -35243 1834 22959 23697 32652 -62391 -99832 -61358
3243 -61358 -60185 -80929 -25224 -19432 -13972 -35069 -39537 -28060 -32017 3772 -6301 -9392 -10813
3230 -10813 74727 87546 26312 16727 43499 120922 100361 65324 88185 96459 20155 -7879
3218 -7879 22399 59228 16532 27443 50873 19543 -1899 -33937 -90230 -5553 91655 26846
3206 26846 50947 148357 191319 142086 59083 28646 51981 24686 -2301 74536 64617 15171
3194 15171 -147615 -198326 -127516 -115822 -93231 -45463 6079 8662 -58908 -54473 -14239 13062
3182 13062 117072 109639 93898 84266 20746 1861 -26036 -92012 -62021 -18326 -51128 -33543
3170 -33543 -29588 -70094 -70784 12035 37584 -43333 -27796 21312 -2746 -45656 -83231 -47990
3158 -47990 -36473 -23918 -30531 -27900 -59285 -66156 -48053 -39102 -53960 -97175 -98170 -55599 -654
3145 -654 329 46351 53251 64023 91202 83614 73621 66059 39424 -24539 -6879 838 1387 -62555
3131 -62555 -40080 1920 -36487 -81211 -81486 -75359 -71497 -80995 -22545 -11648 -51782 -12683 17161
3118 17161 -9852 21998 12106 -10005 -98902 -71920 61846 41633 -24486 -5285 35915 73357
3106 73357 55378 39396 30439 34318 -32960 81 55203 47407 81424 36587 -14700 -533
3094 -533 29248 -13294 -59811 -70853 -53111 -33783 -57629 -124156 -88562 -3455 79918 48882
3082 48882 25035 8226 40206 89316 46405 -45300 -108449 -112009 -118817 -109757 -110578 -23583 -41464
3069 -41464 -85342 -77997 -21179 -22887 -60203 -15390 -38309 -49184 -11964 -9328 15661 83511
3057 83511 64429 75601 72794 37688 -16331 -5968 -11689 38496 43567 12755 5956 33349 5334
3044 5334 -8588 -14971 19726 63358 74569 -14683 -47043 -78161 -71415 -41026 -31763 37605 49633
3031 49633 -57227 -130069 -99254 -60793 -53645 -71040 -91016 -63409 -37108 -27718 -32529 -54970
3019 -54970 -91713 -139470 -55053 -1015 -35354 -65672 -28515 -24768 -1722 -24391 -43188 -41378
3007 -41378 -97407 -76015 -115177 -118773 -163573 -108928 -45546 4131 -5878 63097 37841 6903
2995 6903 -28924 -97338 -152362 -160500 -102781 -95135 -1807 21345 9044 14545 -19375 -94238 -95314
2982 -95314 -92004 -79335 -84374 -62148 -92223 -167816 -173822 -129017 -111696 -157114 -187613 -140285
2970 -140285 -215244 -172161 -68842 -80265 -197066 -219415 -226133 -197080 -141301 -104043 -43319
2959 -43319 1048 5574 -30174 18949 -21354 -21206 -10330 -4056 44076 66848 -4312 -108953
2947 -108953 -82935 -70651 -49542 -23034 -66630 -74965 -48219 -8654 14351 24841 -33269 -102011
2935 -102011 -163807 -89091 9064 19965 12066 5078 -80186 -104355 -65680 -3086 -9040 -24526
2923 -24526 48294 120305 119685 82045 59433 -68553 -103389 -73810 -68775 -120325 -59070 -25107
2911 -25107 10595 59857 15180 -65391 -27138 -55375 -112288 -92605 -40539 -71032 -93650 -66788
2899 -66788 -20399 29631 46642 -27293 -91214 -60975 -51554 -46139 -41717 -11027 -23338 -74223
2887 -74223 -47614 -33211 21321 96402 50633 18164 86218 74828 57305 17934 77451 81791
$$ [...]
##END NTUPLES=NMR SPECTRUM
##END=
