##TITLE=Analysis number 318203
Compound Code cc 07114
Book Reference 467/16
Project Code adrs
Chemist Name benw
##JCAMPDX= 6.0         $$ Bruker NMR JCAMP-DX V2.0
##DATA TYPE= NMR SPECTRUM
##DATA CLASS= NTUPLES
##ORIGIN= Bruker BioSpin GmbH
##OWNER= nmr
$$ XWIN-NMR		Version 3.5
$$ Mon Mar 20 13:43:56 2006 GMT Standard Time (UT+0h)  MAYBRIDGE\nmr@NMR_250MHZ
##.OBSERVE FREQUENCY= 250.131544655141
##.OBSERVE NUCLEUS= ^1H
##.ACQUISITION MODE= SIMULTANEOUS (DQD)
##.ACQUISITION SCHEME= undefined
##.AVERAGES= 16
##.DIGITISER RES= 18
##SPECTROMETER/DATA SYSTEM= dpx250
##.PULSE SEQUENCE= zg30
##.SOLVENT NAME= CDCl3
##.SHIFT REFERENCE= (INTERNAL, CDCl3, 0, 16.522)
##AUDIT TRAIL= $$ (NUMBER, WHEN, WHO, WHERE, WHAT)
$$ ##TITLE= Audit trail, XWIN-NMR		Version 3.5
$$ ##JCAMPDX= 5.01
$$ ##ORIGIN= Bruker BioSpin GmbH
$$ ##OWNER= nmr
$$ C:\u/data/dgb/nmr/ADRS/1070/pdata/1/auditp.txt
$$ ##AUDIT TRAIL=  $$ (NUMBER, WHEN, WHO, WHERE, WHAT)
(   1,<2006-03-20 13:43:19.40 +000>,<MAYBRIDGE\nmr>,<NMR_250MHZ>,
      <created by zg, POWCHK disabled, PULCHK disabled
       configuration hash MD5:
       84 BC 41 DB A1 6E 1D 46 DA 25 12 A5 C1 ED C5 3A
       data hash MD5: 64K
       63 8B 2A ED E7 9C 5E 13 E8 73 2E 72 9F 6B 20 29>)
(   2,<2006-03-20 13:43:36.51 +000>,<MAYBRIDGE\nmr>,<NMR_250MHZ>,
      <Start of raw data processing
       ef LB = 0.3 FT_mod = 6 PKNL = 1 SI = 32K 
       data hash MD5: 32K
       F2 34 8E 15 66 90 3F 98 A3 C6 E0 FF BF 2C A3 AE>)
(   3,<2006-03-20 13:43:40.73 +000>,<MAYBRIDGE\nmr>,<NMR_250MHZ>,
      <apk 
       data hash MD5: 32K
       38 66 8B 30 B1 BF C2 2A 08 47 7E 61 28 AE 3C A7>)
(   4,<2006-03-20 13:43:42.29 +000>,<MAYBRIDGE\nmr>,<NMR_250MHZ>,
      <abs ABSG = 5 
       data hash MD5: 32K
       AE B7 69 02 0A 1A 7D BC AE D6 E4 F6 48 24 49 E9>)
$$ ##END=
$$ 
$$ hash MD5
$$ B9 D8 65 3D CB 0D 1E 3E BF D2 CA BD 6B 6E BC 82
##$RELAX= 
##$RELAX= 
##$RELAX= 
##$RELAX= 
##$RELAX= 
##$RELAX= 
##$RELAX= 
$$ Bruker specific parameters
$$ --------------------------
##$DU= <C:\u>
##$EXPNO= 1070
##$NAME= <ADRS>
##$PROCNO= 1
##$TYPE= <nmr>
##$USER= <dgb>
##$AMP= (0..31)
100 100 100 100 100 100 100 100 100 100 100 100 100 100 100 100 100 100 
100 100 100 100 100 100 100 100 100 100 100 100 100 100 
##$AQSEQ= 0
##$AQ_mod= 3
##$AUNM= <au_zg>
##$AUTOPOS= <39 >
##$BF1= 250.13
##$BF2= 250.13
##$BF3= 250.13
##$BF4= 250.13
##$BF5= 500.13
##$BF6= 500.13
##$BF7= 500.13
##$BF8= 500.13
##$BYTORDA= 1
##$CFDGTYP= 0
##$CFRGTYP= 5
##$CHEMSTR= <none>
##$CNST= (0..31)
1 1 145 1 1 1 1 1 1 1 1 1 1 1 1 1 1 1 1 1 1 1 1 1 1 1 1 1 1 1 1 1 
##$CPDPRG= <>
##$CPDPRG1= <>
##$CPDPRG2= <>
##$CPDPRG3= <>
##$CPDPRG4= <mlev>
##$CPDPRG5= <mlev>
##$CPDPRG6= <mlev>
##$CPDPRG7= <mlev>
##$CPDPRG8= <mlev>
##$CPDPRGB= <>
##$CPDPRGT= <>
##$D= (0..31)
0 1 0 0 0 0 0 0 0 0.06 0 0 0 0 0 0 0.0002 0 0 0 0 0 0 0 0 0 0 0 0 0 0 
0 
##$DATE= 1142862197
##$DBL= (0..7)
120 120 120 120 120 120 120 120 
##$DBP= (0..7)
150 150 150 150 150 150 150 150 
##$DBP07= 0
##$DBPNAM0= <>
##$DBPNAM1= <>
$$ [...]
##$SUBNAM7= <"">
##$SUBNAM8= <"">
##$SUBNAM9= <"">
##$SW= 20.6930455092707
##$SWIBOX= (0..15)
0 0 3 0 0 0 0 0 0 0 0 0 0 0 0 0 
##$SW_h= 5175.983436853
##$TD= 65536
##$TD0= 1
##$TE= 294.16
##$TE2= 300
##$TE3= 300
##$TEG= 300
##$TL= (0..7)
0 120 120 120 120 120 120 120 
##$TP= (0..7)
150 150 150 150 150 150 150 150 
##$TP07= 0
##$TPNAME0= <>
##$TPNAME1= <>
##$TPNAME2= <>
##$TPNAME3= <>
##$TPNAME4= <>
##$TPNAME5= <>
##$TPNAME6= <>
##$TPNAME7= <>
##$TPOAL= (0..7)
0.5 0.5 0.5 0.5 0.5 0.5 0.5 0.5 
##$TPOFFS= (0..7)
0 0 0 0 0 0 0 0 
##$TUNHIN= 0
##$TUNHOUT= 0
##$TUNXOUT= 0
##$USERA1= <user>
##$USERA2= <user>
##$USERA3= <user>
##$USERA4= <user>
##$USERA5= <user>
##$V9= 5
##$VALIST= <valist>
##$VCLIST= <CCCCCCCCCCCCCCC>
##$VD= 0
##$VDLIST= <DDDDDDDDDDDDDDD>
##$VPLIST= <PPPPPPPPPPPPPPP>
##$VTLIST= <TTTTTTTTTTTTTTT>
##$WBST= 1024
##$WBSW= 4
##$XGAIN= (0..3)
0 0 0 0 
##$XL= 0
##$YL= 0
##$YMAX_a= 317140
##$YMIN_a= -456375
##$ZGOPTNS= <>
##$ZL1= 120
##$ZL2= 120
##$ZL3= 120
##$ZL4= 120
##$ABSF1= 16.522
##$ABSF2= -4.171173
##$ABSG= 5
##$ABSL= 3
##$ALPHA= 0
##$AQORDER= 0
##$ASSFAC= 0
##$ASSFACI= 0
##$ASSFACX= 0
##$ASSWID= 0
##$AUNMP= <proc_1d>
##$AZFE= 0.1
##$AZFW= 0.1
##$BCFW= 0
##$BC_mod= 0
##$BYTORDP= 0
##$COROFFS= 0
##$CY= 12.5
##$DATMOD= 1
##$DC= 0
##$DFILT= <>
##$DTYPP= 0
##$F1P= 14.0000005364418
##$F2P= -0.99999901652339
##$FCOR= 0.5
##$FTSIZE= 32768
##$FT_mod= 6
##$GAMMA= 0
##$GB= 0
##$INTBC= 1
##$INTSCL= 1
##$ISEN= 128
##$LB= 0.3
##$LEV0= 0
##$LPBIN= 0
##$MAXI= 10000
##$MC2= 0
##$MEAN= 0
##$ME_mod= 0
##$MI= 0
##$NCOEF= 0
##$NC_proc= -5
##$NLEV= 6
##$NOISF1= 0
##$NOISF2= 0
##$NSP= 0
##$NTH_PI= 0
##$NZP= 0
##$OFFSET= 16.522
##$PC= 1
##$PHC0= 173.1258
##$PHC1= 6.676522
##$PH_mod= 1
##$PKNL= yes
##$PPARMOD= 0
##$PSCAL= 4
##$PSIGN= 0
##$REVERSE= no
##$SF= 250.13
##$SI= 32768
##$SIGF1= 0
##$SIGF2= 0
##$SINO= 400
##$SIOLD= 32768
##$SREGLST= <1H.CDCl3>
##$SSB= 0
##$STSI= 32768
##$STSR= 0
##$SW_p= 5175.98343685301
##$SYMM= 0
##$S_DEV= 0
##$TDeff= 65536
##$TDoff= 0
##$TI= <Analysis number 999999
Compound Code 99
Book Reference 9
Project Code 9>
##$TILT= no
##$TM1= 0
##$TM2= 0
##$TOPLEV= 0
##$USERP1= <user>
##$USERP2= <user>
##$USERP3= <user>
##$USERP4= <user>
##$USERP5= <user>
##$WDW= 1
##$XDIM= 32768
##$YMAX_p= 475477598
##$YMIN_p= -230550
$$ End of Bruker specific parameters
$$ ---------------------------------
##NTUPLES= NMR SPECTRUM
##VAR_NAME=  FREQUENCY,     SPECTRUM/REAL,   SPECTRUM/IMAG
##SYMBOL=    X,             R,               I
##VAR_TYPE=  INDEPENDENT,   DEPENDENT,       DEPENDENT
##VAR_FORM=  AFFN,          ASDF,            ASDF
##VAR_DIM=   32768,         32768,           32768
##UNITS=     HZ,            ARBITRARY UNITS, ARBITRARY UNITS
##FACTOR=    0.157963299565203, 1,           1
##FIRST=     4132.6476996994, 0,             0
##LAST=      -1043.33573715361, 0,           0
##MIN=       -1043.33573715361, -230550,     0
##MAX=       4132.6476996994, 475477598,     0
$$ Real data points
##PAGE= N=1
##DATA TABLE= (X++(R..R)), XYDATA
$$ [...]
24351E3365j1915K7319p791L7579J8692M714j5109k5206r298q938L891m675L6256
24338I8884p121n7189l6455o5455K4305M3713j4041j6654j8402K793L3451j809
24326a3980k5558L5677J5268o988m845J2318j2769L2650J731j339n5207J2580
24314a0462P8638Q1711M290J0186n5807k5972o7971l9089r792L2420P3731k7966
24302D3917p4938L8514J4872N3968o501P134M3406m050k4255r8920P924N6541
24290E7612L8306M8079j958o5268J21k9187n3613M110J0307M2189L8274k7091
24278F1881n5440K2425L7423p162n0364l0366M663l4962L9114P0053J7181p3133
24266A313k0587M7420M503l3568j3225L0776K092N4233n819l9131m029l1809j0385
$$ y = [53365, 41450, 68769, 60978, 98557, 117249, 121963, 106854, 81648, 72350, 63412, 67303, 62628, 98884, 91763, 34574, -1881, -67336, -43031, 682, -13359, -30013, -48415, -45622, -12171, -13980, -39538, -3861, 11407, 4419, -426, 11892, -877, 31773, 33504, 32165, -23042, -10462, 68176, 149887, 154177, 164363, 108556, 82584, 14613, -24476, -34268, -1848, 71883, 43917, -31021, 7493, 22365, 76333, 69832, 76966, 120372, 116322, 92067, -6853, 1071, 57612, 95918, 143997, 142039, 76771, 76892, 47705, -5908, -1798, 8509, 50698, 88972, 61881, 6441, 28866, 66289, 59127, 8763, -21603, -16940, -51902, -12788, 57265, 74446, 1313, -19274, 28146, 32649, -919, -14144, 16632, 18724, 72957, 67138, 28007, 23978, -7831, -18216]
24253a8216P473k2841M7097M0663l3523N1634M9831n0441j8066L6113j0031l0721
24241D8972K1641m5456o5452n824K7303j2736J3558L1433j1107J1656k2125l1046
24229c9183r138r747M7450J5266L9579J3789m4437l7158P523l9412p0065m5755
24217a71288N8817J2717J6705Q8981J0301n4904p898J1831j4039J3708J353l3026
24205f6742L4082k2451m8817L8940M8854J6766j5427l3095L3861P99R624O710
24193C104L5687K3421m2480j603J2609J2870j8912j1527J8655O484O946j0153
24181C5101m1805J7817k902J0194n1702O0127M9273j0196L473o505l0361l3647
24169a133N49P173k8999l8741k6900K7949L0961N2069Q1146P261o9426m4615p503
$$ y = [-18216, -10743, -33584, 13513, 54176, 20653, 72287, 122118, 71677, 53611, 89724, 79693, 48972, 70613, 25157, -40295, -46119, -18816, -31552, -17994, 13439, 2332, 13988, -8137, -39183, -48321, -58068, -10618, 4648, 44227, 58016, 13579, -23579, -16056, -55468, -125533, -171288, -112471, -99754, -83049, 5932, 16233, -38671, -46569, -34738, -48777, -35069, -33716, -66742, -32660, -55111, -103928, -64988, -16134, 632, -14795, -47890, -14029, -13230, -3606, 3104, 38791, 62212, 19732, 18129, 30738, 43608, 24696, 13169, 31824, 38308, 45254, 35101, -6704, 11113, 8211, 18405, -33297, 26830, 76103, 65907, 69380, 62875, 32514, -1133, -584, 6589, -22410, -61151, -88051, -60102, -29141, 22928, 104074, 111335, 41909, -2706, -10209]
24156a0209K7960J9649K9038l1282l8530K3291m1170l7672k7531j3743L900M6284
24144e0015J8537L7677R214m7777m6377M1398P3139L093m6139M895J6577L8390
24132E2612l30n2196K660L6667J7786l0352n3392m0192n2402K9477M6265m2984
24120h6381O8300O1723j5830q438n6126j21045K087N3805L1288K903j6763L1656
24108e2821M3606K6211k0559p838p184J7933l3954k5676o901J6937J1488m2266
24096h1024j3279N7165J4570L0322J7963K7965J7783m6784r514J3977n981K8693
24084E1856J1037L9059n4178O423M0793J667l0745M3274j9080R202o5495n2253
24072a8440j5192m8780J5447Q759n9610O6408J5128o5707q376O6356N6734J2838
$$ y = [-10209, 17751, 37400, 66438, 35156, -3374, 19917, -21253, -58925, -86456, -100199, -96299, -50015, -31478, 6199, 15413, -32364, -78741, -37343, 35796, 38889, -7250, -2355, 14222, 52612, 52282, 86, 2746, 39413, 57199, 26847, -26545, -66737, -119139, -89662, -43397, -86381, -18081, 43642, 27812, 19374, -36752, -157797, -155710, -101905, -70617, -67714, -84477, -52821, -9215, 16996, -3563, -11401, -18585, -652, -34606, -60282, -67183, -50246, -38758, -81024, -94303, -37138, -22568, 7754, 25717, 53682, 71465, 24681, 15167, 29144, 23163, 51856, 62893, 101952, 47774, 54197, 94990, 96657, 65912, 109186, 90106, 99308, 33813, -18440, -33632, -82412, -66965, -58206, -117816, -51408, -36280, -101987, -110363, -44007, 12727, 25565]
24060B5565m6112q3187m7850N3137L786J8276j0744l8170O7842M0437j4543j3714
24048d5277K7762K0627m6139l4148J3367L3414J0235P166r815J2576K9872Q069
24036B7709M102L4841J3222o5684N202J4643L6508J3955L206n3332k7036n8464
24024e1128l7756N7425M0338m5733j4058M4200N838L883J2462R591J6109K5954
24012F7125M0474m7129q1141o487J2063p512j221o541j1454M5932L361K9090m191
23999C2369M825j0210n6969j9661k3621J4652l8624m2034L3218M4685L046N085
23987e3239l659M9563j0800n6376P1786R1429J03399j2160o2608m6588o2228q9481
23975h0962L5675J1461j604N0007k672P773j5548K3792K22J8428k1215P521k3424
$$ y = [25565, -20547, -103734, -151584, -98447, -94661, -76385, -87129, -125299, -57457, -17020, -31563, -45277, -17515, 3112, -43027, -77175, -63808, -30394, -20159, -12993, -22808, -10232, 19640, 27709, 31811, 66652, 79874, 14190, 19392, 34035, 70543, 84498, 87704, 34372, 7336, -51128, -88884, -31459, 8879, -36854, -50912, -6712, -874, 3009, 15471, 25062, 41171, 67125, 107599, 60470, -20671, -27158, -15095, -22607, -23828, -30369, -41823, 4109, 7470, 36560, 32369, 37194, 26984, -29985, -49646, -73267, -58615, -97239, -139273, -106055, -61370, -58324, -53239, -56898, -7335, -18135, -74511, -2725, 88704, 192103, 179943, 117335, 70747, 8519, -80962, -45287, -33826, -35430, 14577, 11905, 19678, 4130, 27922, 28144, 46572, 25357, 32878, 9454]
23962I454L8416R004k2058n9531O699J3198p1540k0876J2864N6679N9640N491
23950C7440q4062l1005L0456L0768r586K55k8739k4145L3279K870J4830K1504
23938f135k9219P047Q2750Q533k6935O8575K7389l2928m3755o7906k0205K6276
23926f513J2908j1444n5516n010K9520J5368J0795R526K330R762M000K9674k2044
23913B3356m8532O363K8930l6880M2206J11801m77p5183o6111M517m987n0446
23901f5443l5181K4174L9235N4318l6558n6828O511k1032K645K4231M4881K5715
23889F668R026j5617l8930k7423K0301M036j1933l6894O11N2139M5637P4259K4093
23876A05973m6176j5613j4292j9848m3499L1817n659J8705l1068r6023K6824R4538
$$ y = [9454, 47870, 56874, 34816, -24715, -18016, -4818, -76358, -97234, -84370, -27691, 31949, 37440, -46622, -77627, -47171, -16403, -25989, -25734, -54473, -78618, -45339, -42469, -27639, -6135, -35354, -28307, 54443, 62976, 36041, 104616, 132005, 99077, 55322, -12584, -32789, -6513, 6395, -5049, -60565, -65575, -36055, -20687, -9892, -366, 1964, 11726, 15726, 45400, 23356, -25176, -18813, 10117, -26763, 15443, 127244, 126767, 51584, -14527, -10010, -14997, -65443, -100624, -76450, -37215, 17103, -19455, -76283, -69772, -90804, -88159, -63928, -19047, 6668, 15694, 77, -38853, -66276, -45975, -41939, -53872, -90766, -90155, -38016, 7621, 81880, 105973, 59797, 44184, 29892, 10044, -33455, -1638, -7297, 11408, -19660, -115683, -88859, 5679]
23864E679N0382m2378k1745J2936N4031J9487o4709o3932J4943J2455p841j9730
23852e0422n2070j4066K3503N8905K7779Q562L3920J0258m7978o162m9554l7068
23840i4393J0877O6119Q3720m5475m8637J0200j8995o8945m5252K5030L5614k8068
23828a18205N411N340j2346Q641M4866m3479j278N7971J4117L5451M5555J8893
23816F0937J2952j7115o4865m0298n5104m1195N4253M6900j0175L3744O4079l5198
23804H915L3784L2011j5272k3701n621M0222j3665m1620k7908r883p855O7709
23792C7116j8737p2706p589K5115o433J1077N1969Q52J7726j3473K4680K2615
23780G2212j9463k3739K706l5536k1836K5257Q718n5497k6969O0772J3325n2300
$$ y = [5679, 56061, 13683, -8062, 4874, 58905, 78392, 13683, -50249, -35306, -22851, -30692, -50422, -102492, -116558, -93055, -34150, -6371, 2191, 36111, 46369, -1609, -7771, -57325, -94393, -83516, -17397, 66323, 20848, -27789, -17589, -36584, -105529, -150781, -125751, -90137, -118205, -112794, -107454, -119800, -111159, -66293, -109772, -111050, -53079, -38962, -3511, 42044, 60937, 73889, 56774, -8091, -48389, -103493, -144688, -90435, -43535, -53710, -19966, 44113, 8915, 42699, 74710, 59438, 35737, 30116, 70338, 56673, 15053, -12855, -22738, -30593, 37116, 18379, -54327, -61916, -36801, -43234, -32157, 19812, 20664, 38390, 24917, 49597, 72212, 52749, 29010, 31716, -3820, -25656, -399, 8319, -47178, -74147, -13375, -50, -52350]
23768e2350m4153P9785l794j5758P6110L61j0223K9716K4944r277l8763o760K8913
23755E8751O815l3299L768L881P211m3386j6331O45J8713K0607p100n4497K6323
23742g899L4476p114J7801n909j5986k9442K0495O7822k898l8670R338j170q97
23729C9947k7345n072k829L4842j7350n6316l8430m0806r607N7197L5977P984
23717b1808R069P6145L1147q784m5154n5900L65L7926l9179J3369o974J0059J6590
23704A6871o218j1547l3948l5600L9184P8517k469j7337J7375J731k7354K9854
23692D9059K0580Q195p7664p769p042L6613J4378L182L0135q696m7620p1948j7810
23679g6407j6503p632N1978L6152m3246r545J0312n2995J0047K0478O061O225
$$ y = [-52350, -96503, -16718, -20512, -36270, 39840, 40201, 29978, 59694, 84638, 75361, 36598, 29838, 58751, 65566, 32267, 36035, 39916, 47127, 3741, -12590, -11945, 6768, 27375, 20275, -34222, -7899, 26577, 19463, 37264, 31355, 15369, -14073, 6422, 74244, 71346, 32676, 42014, 40844, 39947, 12602, 7530, 4701, 39543, 22193, -34123, -72553, -113359, -122966, -65769, -29792, -21808, -12739, 63406, 94553, 85769, 40615, -15285, -14920, 23006, -16173, -2804, -9778, 281, 16871, 10653, -894, -34842, -70442, -31258, 47259, 44790, 27453, 44828, 46559, 19205, 49059, 69639, 77834, 170, -7599, -14641, 21972, 36350, 39532, 69667, 60971, 13351, -58597, -76407, -92910, -100542, -48564, -12412, -55658, -65203, -54891, -107886, -97839, -77361, -71300, -65075]
23667f5075m004O8786R97K578L3038K2109L1947r684J4635k8985n9696K5836k7487
23654D995l6961l2849J416k7710m6245L7635Q1579M8832K133l2614L22L5718o6906
23641c0655k3227J9642k5773o91l775M9040L7752l5929P66m012J1959L2553O578
23628C4228n891l1729K2937N467j1804j7845j4960r50J1040K7611J7859J7994
23616E3957j9208P04k3450j4422K9050l338j2248k1703J4048j35P9827J724k6712
23603E8094p91K2051j7394n4317q765K6223p261k6087j691j763J4519m1011J4171
23590b4022K3907m0889j5476j0093p414J1982P579P369K4648K5951m9418m5889
23578i1765N960O3466R7081O4286p5236p7406J7037M0337K8303l5238O942o9602
$$ y = [-65075, -69079, -293, 704, 3282, 36320, 58429, 90376, 80692, 95327, 66342, 6646, 32482, 4995, -31966, -64815, -63399, -91109, -137354, -99719, -18140, 30692, 32825, 211, 533, 36251, -30655, -53882, -34240, -60013, -60704, -64479, -15439, 22313, -13616, -12850, -16862, -4903, 27650, 34228, 28337, -3392, 19545, 25012, 13208, -4637, -19597, -20547, -9507, 18104, 35963, 53957, 34749, 35453, 12003, -2419, 26631, 23293, 11045, -10658, 3390, 3255, 83082, 84806, 58094, 57303, 79354, 61960, 7643, -1122, 25101, 17840, -8247, -9938, -11701, 2818, -38193, -24022, -115, -41004, -56480, -66573, -73987, -62005, -54426, -47057, -22409, 3542, -45876, -91765, -85805, -22339, 74742, 139028, 63792, -13614, 3423, 43760, 72063, 36825, 43767, -25835]
23566b5835r4552L8244L5102M9638J4615j4715k6091n5208j7418l7254j0679Q7627
23554e6526L9567K0279J8979m8649n419J1794K4076j4091p8019k0271O9566L845
23542c4869L8798O9421L3597m1085o9277j7513m0133M4266O1551P2035O943j9507
23530A04227j5907p7596Q183O5373l9872n252r791P91J343J2109J3508l0699m7816
23517b1399R39M4594k3856K4366Q091L9662J3579n8827o9916l7799P4773O6348
23505F0555Q485j2427n783K821k8712l1315m2431K1817J0101M9532L6732j3544
23493E5831o786m1300P213m6847j2513L9837K5425j8225k1958M315k543L9771
23481B2220L1026j1352l2098o0694L821j7154j8743r846K9456L6425j1743k2650
$$ y = [-25835, -120387, -82143, -47041, 2597, 17212, 2497, -23594, -78802, -96220, -133474, -144153, -56526, -16959, 3320, 22299, -26350, -31769, -19975, 4101, -9990, -88009, -108280, -38714, -34869, 3929, 73350, 106947, 65862, -3415, -20928, -61061, -16795, 44756, 116791, 123734, 104227, 88320, 10724, 18907, 84280, 44408, 39156, 29365, 30156, 31499, 43608, 57116, 26417, -21399, -20460, 24134, 278, 24644, 32735, 72397, 85976, 27149, -42767, -80566, -5793, 60555, 69040, 56613, 50830, 53651, 24939, -6376, -48807, -26990, -16889, 32643, 69375, 55831, 49045, 7745, 14958, -31889, -44402, -4565, 20860, 2635, -19323, -15008, -17551, 22220, 53246, 41894, 9796, -50898, -47077, -64231, -82974, -92820, -63364, -26939, -38682, -61332]
23469f1332k9085M3326O0351j2325l8229n1742m999J4622M7633J5054P247M336
23457e143K571n51l895l0845n606M1758M5390J0277n5986J2502J6875K2124K6432
23444G5903k2593m5047k3210n118K3923J0094q1606r919K7386l7859j498M8696
23432d0848N3364J4544J7765o191l9011l9997O5492n7169j321l550l4374O0019
23420a1277K3654l0747j5944k6979j7792L4640J4421k3532N2916J7329M0981L7153
23408I4823o305q100M299j9643o3973o5677K0740K8315K0199K457O708K4132m535
23395C3440J1284j8207j9293m2131k2885j2845Q661m7636J7550M0951J6393L4631
23383h7K5986n869P674p42l055l2215j360k222K0634k4872J6397N8837L2703m4806
$$ y = [-61332, -90417, -47091, 13260, 935, -37294, -89036, -94035, -79413, -31780, -16726, -9479, -5143, -2572, -3123, -7018, -37863, -43469, -1711, 43679, 53956, -2030, 10472, 27347, 49471, 75903, 53310, 8263, -14947, -20065, 3858, 13952, -67654, -77573, -50187, -88046, -89544, -40848, 12516, 27060, 44825, 38634, -377, -40374, 25118, -32051, -33372, -36922, -71296, -11277, 12377, -18370, -34314, -61293, -79085, -44445, -30024, -53556, -640, 16689, 57670, 94823, 88518, 80418, 84717, 65074, 1101, -64576, -43836, -15521, 4678, 7135, 13843, 37975, 33440, 44724, 26517, 7224, -34907, -57792, -70637, -61976, -109612, -92062, -51111, -34718, -87, 25899, 20030, 27704, 26962, 23907, -8308, -9668, -11890, 8744, -16128, 269, 59106, 91809, 47003]
23369D7003l3612o077m6498M1655M3890L2954K5985K7102m089m4653m3828R083
23357D8915R6075K8511n3966j2885P103J3849p8617k5762J6579l5751j7657J4394
23345G88k6237L1703K0777k429K9286j1811K1627j4986p0350J639J9457L4323
23333C3787J1936M2422L734O017k2435k3455l171k0998m9191j5893L1922L9654
23321C4329k1007m9574l2205K5355K7880j8557o519N3926K777j9958m160M9641
23309D1928M6045j8622j1588K3323n41o7074l173R929q584L0476l8293n9089J5750
23296c9513Q088J2853L3093N6234l8457M007J958m3670k380N848K3797l1407N661
23283c888l9435k9118L2151K7975K3318J2799K2360p95k8519n0854k3613n8224
$$ y = [47003, 13391, 7314, -39184, 2471, 46361, 79315, 105300, 132402, 128313, 83660, 39832, 48915, 144990, 173501, 119535, 106650, 113753, 127602, 48985, 23223, 39802, 4051, -13606, 788, -25449, 6254, 27031, 24602, 53888, 42077, 63704, 48718, -21632, -19993, -536, 33787, 45723, 88145, 91879, 97896, 75461, 52006, 48835, 27837, -21354, -37247, -5325, 34329, 13322, -36252, -68457, -43102, -15222, -33779, -40298, 13628, 16405, -3553, -7713, 41928, 87973, 69351, 57763, 81086, 80545, 13471, 10298, 20227, 11643, 42119, 3826, -55263, -39513, -31425, -18572, 14521, 70755, 32298, 36305, 38263, -5407, -7787, -1939, 21858, -9549, -3888, -43323, -72441, -40290, -12315, 11003, 23802, 46162, 45367, 16848, -34006, -57619, -115843]
23271a15843L6950q292M395j087M7334J3487j3949L2167M3377J702o4297l6338
23259f0394n3344J2127M8299j2395K2887M9717L4078m1485o6410j375Q741L6383
23247b3171L6350J9443l301l0343L9763k5637m3719n2840m4676J8041L6905N2758
23235b0427l5377j2272K2953M440J5364M0655L8348L8176m4605q1230j6108J2353
23223c7730P538M3537L0550M8426L2616k8297p3064j5182l3564j4261M5630n183
23211A016M7446M5143N532m3838j17618j5048O5084K1446K8414L7589k0323m1199
23199A3644L3222j1900j8672m0709o676M4448J3990M96k3996k1573J784P889k7761
23186c5814l4966L6471P863k9787N2922J01386p59j07008p0664J9364j9841R283
$$ y = [-115843, -78893, -87185, -82790, -83877, -36543, -23056, -37005, -4838, 38539, 40241, -24056, -60394, -113738, -101611, -53312, -65707, -42820, 6897, 40975, -510, -66920, -68295, -59554, -23171, 13179, 32622, 29321, -1022, 38741, 13104, -30615, -83455, -128131, -110090, -73185, -20427, -55804, -68076, -45123, -40683, -25319, 15336, 53684, 91860, 47255, -33975, -50083, -37730, -30192, 13345, 43895, 92321, 124937, 96640, 23576, 8394, -25170, -39431, 6199, 1016, 48462, 93605, 99137, 55299, -62319, -77367, -12283, 9163, 37577, 75166, 54843, 13644, 46866, 34966, 16294, -24415, -31091, 13357, 27347, 27843, 3847, -17726, -15942, -8053, -35814, -70780, -34309, -26446, -56233, -3311, 98075, 97316, -9692, -80356, -60992, -80833, -71550]
23174g1550N6678K410l0806j34K2347k6681k6804O3402O4357J7048j5192m3873
23162A1202m7153j8603R738R099J3591q918J3156O0958M0234O366l8380l711k1524
23149B6055m07M355J9605L4285j1765n0871j1176K6238O1935j0018m9605m5859
23137g228o923p47k8224m7177K9524L5345R263K3271m5142k3168N6310J374J1732
23124H210m3404K1964q091l8898L8206L2245J9585M3965k9293n7479p22L693k0903
23111c0922J0647k3238k3177k3627K46Q1435P0446n153K604n0152p242k9235l2417
23098e9785M266J07931O628k2332o1209O343L0564M6056k839m4026n5131L8217
23086e317J0634p199n9679l8589p296N5468P1175O826R206l6010l0430J1447n6799
$$ y = [-71550, -14872, -12462, -43268, -43402, -21055, -47736, -74540, -11138, 53219, 70267, 55075, 11202, -35951, -54554, -44816, -35717, -22126, -31044, -17888, 43070, 83304, 89670, 51290, 47579, 26055, 25648, 30003, 49608, 83893, 72128, 21257, 10081, 36319, 98254, 88236, 38631, -7228, -14151, -14898, -43122, -90299, -60775, -25430, -16167, 7104, -38038, -61206, -4896, -3522, 8210, -35194, -13230, -21321, -60219, -22013, 10232, 29817, 73782, 44489, -12990, -13712, -10019, -30922, -20275, -43513, -66690, -90317, -90071, -8636, 61810, 56657, 59261, 9109, 1867, -27368, -59785, -55519, 52412, 59040, 36708, -24501, -18158, 12406, 58462, 55623, 11597, -43534, -5317, 5317, -1882, -61561, -100150, -107446, -51978, 19197, 26023, 35229, -781, -31211, -19764, -76563]
23073g6563j9435K2700L5157j9264p0213M6736J00410l065q1796O09N5806J8483
23061I565k9322k2662K776k3086N146j9147k0500M1860R471l4640R106l261m5545
23048a20239j897L788P0544O4347P5344n4342n4077k0361J9010k2453j9629M3385
23036a6580O4449k1911m5484P879J1563m5329L7187N7044m571j6308J2789K5579
23024F6307O446K493r7842p6848K019N9931J8460j6722m778m4062k9805J7118
23012i7283J5348j2119l8840J5195p46K5267O8410L0751L5088J7199p3457J7564
23000B377M4881o63j457N469k1352l9976k2558O133j6398m0227J2264M6607L7164
22987A2264K9829K7241k0290l6392l8341l2219K219K8114j5510R98M2900K5133
$$ y = [-76563, -95998, -73298, -38141, -57405, -127618, -80882, 19528, 16463, -65333, -64724, -8918, 9565, -19757, -42419, -39643, -62729, -57583, -76730, -97230, -55370, -45899, -80539, -71433, -74694, -120239, -122136, -118348, -47804, 16543, 91887, 37545, -16532, -36893, -17883, -40336, -59965, -16580, 47869, 25958, -19526, -11647, -84, -45413, -8226, 48818, 44247, 27939, 40728, 66307, 72753, 75246, -22596, -99444, -97425, -37494, -19034, -35756, -40534, -84596, -114401, -97283, -81935, -94054, -132894, -117699, -118445, -93178, -24768, 5983, 41071, 58270, -15187, 2377, 47258, 46595, 45138, 50607, 29255, -10721, -33279, -27146, -43544, -83771, -71507, -24900, 12264, 42093, 69334, 49044, 12652, -25689, -57908, -55689, -27575, -43085, -42087, 813, 25946]
22975B5946o0334n3961m150K3802K5423o0892j3398N0829J8697l710o38m337l0668
22962h7391L2036n456j6843j5852K8495J9875M7340m3758k0045K1922j2465M0994
22950a1148P2200m2996O597k0929m786P0701K1989o0530p025N9748K3371L5038
22938A42230J4239k2494n8438k3395k4312j9513k2038k0904L432L9248j7238k8391
22926c7574o3275j3402l028q696m7189L694K1946m1852N1291L6311j8346L9883
22914h0237P3565O0737j3826J0087o0638p6802J5291o856M7885q059j7127j7291
22902g3271R148k0895N9840M1626J3901L544m6091Q753K7420M3004k9834l1828
22890E317K2010j7305K0671J3645J7434K1686L4133k5588l5254l1179L0881k5692
$$ y = [25946, -34388, -88349, -92499, -68697, -43274, -104166, -117564, -66735, -48038, -51748, -52386, -56723, -87391, -55355, -60811, -77654, -93506, -65011, -45136, 2204, -41554, -61599, -39677, -52142, -11148, 61052, 18056, 24653, 3724, -1062, 69639, 91628, 31098, 24073, 83821, 107192, 142230, 156469, 133975, 75537, 52142, 27830, 8317, -13721, -34625, -31193, 8055, -9183, -37574, -100849, -114251, -117279, -125975, -173164, -169470, -147524, -189376, -138085, -101774, -120120, -80237, -6672, 54065, 40239, 50326, -10312, -87114, -71823, -78679, -30794, -38853, -55980, -73271, -64123, -85018, -25178, 16448, 30349, 33893, -12198, -3445, 23975, 66979, 37145, 5317, 27327, 10022, 30693, 44338, 61772, 83458, 117591, 92003, 56749, 25570, 56451, 30759]
22878C0759k8091O229j9409N099j7962k0550l3984J7744N3461P765j9473j1963
22866c0375J7972j05014n0499J3112J7533N8616M1469L2865m2230J7990J0836
22855a7725l3146K7914r702j6003J8916K6619j294k1296m7293K6884M24J2353
22843c3349L0759m0868K9130M3246k0782k0706j265K1800N220K1260q174J2623
22831C8894m1845k8545q474K5289R872P808M3933j8746q399J4488o101r211m1994
22818b3031j1113K3459K0216N692k5221r526r584p848P118Q708l2241K3227K4200
22805e944J182K9313J4434m0090J7840l2766j5787O7182M7524j5006l1155k7024
22793I703L6387K335J2454J8463M601n9680n2175m484k473K5581j024m0011J3005
$$ y = [30759, 2668, 8897, -10512, -5413, -23375, -43925, -77909, -60165, -6704, 1061, -18412, -30375, -12403, -117417, -167916, -154804, -137271, -78655, -37186, -4321, -46551, -28561, -17725, -50871, -22957, -32659, -48662, -29746, -3127, -4421, -25717, -73010, -46126, -45702, -33349, -2590, -43458, -14328, 28918, 8136, -12570, -13835, 7965, 13185, 34445, 26271, 38894, -2951, -31496, -39970, -14681, -4809, 2999, 46932, 28186, 19787, 34275, 28174, 18963, -23031, -34144, -10685, 9531, 15223, -9998, -19524, -29108, -36956, -29838, -21130, -53371, -30144, -5944, -4762, 24551, 38985, -1105, 16735, -16031, -31818, 35364, 82888, 67882, 36727, 9703, 46090, 48425, 60879, 79342, 83943, 24263, -27912, -32396, -34869, -9288, -10312, -50323, -37318]
22780c7318l167j1235L3799o581k9N0466L1693m1653j4272j1913k5612m8325N677
22767g8470L1004K2494L8118M3274p288k009N413n6638j1313p8964r245L7156
22755f6468L0585K6682L012N6897O376j4134k0763K3251l0682o6759k0796n1566
22743a24365q313N1637N9419O2986l8879m9368Q462L5526m4987l2194J0448R588
22731f0040k7595J6764j477K6157K2502m084l3967K5458O6868L4484k5697L1806
22719G1179p9181l6252j7952N5225O4019r588p1677m0525p093L61l7657J01083
22707h058P8440O124K0821K2903J8747o2099l8955J376R69k8349l6588L0451n621
22694A61j2150k8063K4440l503n1056L1708N4552N792k1735l4178J9478k5621
$$ y = [-37318, -40485, -51720, -17921, -24502, -24531, 25935, 57628, 15975, 1703, -10210, -35822, -84147, -78470, -47466, -24972, 13146, 56420, 49132, 47123, 52536, -4102, -15415, -94379, -103624, -66468, -35883, -9201, -6189, 50708, 57084, 42950, 22187, 45438, 14756, -52003, -72799, -124365, -132678, -81041, -21622, 41364, 2485, -46883, -38421, -2895, -47882, -80076, -69628, -60040, -87635, -70871, -72348, -46191, -23689, -27773, -61740, -36282, 30586, 65070, 39373, 71179, -8002, -44254, -62206, -6981, 57038, 47450, -24227, -64752, -71845, -71484, -109141, -8058, 70382, 76506, 97327, 120230, 138977, 76878, 37923, 39299, 40268, 11919, -24669, 5782, 161, -11989, -40052, -15612, -19115, -70171, -38463, 16089, 21881, 146, -34032, -14554, -40175]
22682d0175J0752j4883r534l7615J708N512M218J2128p515N6783J3484J0260J8480
22669B3603j0591l9312M9807L7280L6697k6472n6071k8594k9227n694K0321N628
22657b2625k0023J9193N54M704m5298K0053J8723m1918j0289L0567j0231L8951
22645a7639J7775r477J0961J4825j3338K8518j0557l0733p6827n0573M8225L3198
22633e5642J9108N0033j2788l6850l5643K0522P6416K0271r065m1709Q364j8948
22621a5931l6001k2976L551M4095L6120P528K4914R921m534l0184m550M2842L6088
22608I0883k8649l6513j8527k1922J2472J7281K8468j5112J5888j8811j0738K380
22596A7100m258O363m2491j2164J0291M6793O5988k7086k5950L1092k5018j12383
$$ y = [-40175, -29423, -44306, -53840, -91455, -89747, -84235, -80017, -67889, -75404, -18621, -5137, 5123, 23603, 13012, -26300, 23507, 60787, 97484, 71012, 14941, -13653, -42880, -48574, -28253, -22625, -42648, -23455, -22901, -18197, -63495, -43442, -24719, -66637, -76926, -46359, -56590, -17639, 136, -9341, 1620, 16445, 3107, 31625, 21068, -9665, -86492, -137065, -88840, -55642, -36534, 13499, 711, -36139, -71782, -51260, 25156, 45427, 36362, -5347, 3017, -15931, -51932, -74908, -71357, -27262, 8858, 16386, 41300, 51221, 46687, 16503, 11953, 54795, 90883, 62234, 25721, 7194, -14728, -2256, 15025, 43493, 28381, 44269, 25458, 14720, 17100, 12842, 19205, -23286, -35450, -25159, 21634, 87622, 60536, 34586, 65678, 40660, -71723]
22584g1723L5815P2386N2467K3778l773k7783K0060k6349o7427n0839J9190j9194
22572d3392J5415M9054N2079K7394o6446j6021j9437o5936l3435O2414r003m449
22560e1763Q6194k8755o156Q527m2096k9349N1670K349K1663m632j9717K7080
22548A5015L1571p8133N273l3174N585L0306N001Q383M614M112K2781k9240O185
22535a721N8019j3921o242l6453l6556Q130p882M1235k4216o1561j3038P0526
22523b3680k4639j5696m511k191J2424K4077j3483K9375L2385R447j3196M5063
22511E5375k2181q0516m848N5524N3812j0380J5929k9471j7207j736j5044K1413
22499B0670p120n55O702j4449l777m024k3135l87r726m4663L3258M5563M7031
$$ y = [-71723, -35908, 36478, 88945, 112723, 108950, 81167, 101227, 74878, 7451, -43388, -24198, -43392, -27977, 21077, 73156, 100550, 34104, 18083, -1354, -67290, -100725, -38311, -47314, -51763, 34431, 5676, -480, 8047, -34049, -63398, -11728, -9379, 12284, 7652, -12065, 15015, 46586, -31547, -26274, -59448, -53863, -23557, -18556, -10173, -5559, -1447, 21334, -7906, -1721, 56298, 42377, 36135, -318, -36874, -28744, -36626, 4609, -19607, -81168, -94206, -23680, -48319, -64015, -68526, -70717, -58293, -34216, -47699, -18324, 14061, 23508, 10312, 55375, 33194, -47322, -52170, 3354, 57166, 46786, 62715, 33244, 16037, 14301, -743, 20670, 13550, 12995, 19697, 5248, 1471, -2553, -25688, -26075, -35801, -80464, -47206, -1643, 45388]
22486D5388j5343l1096k0725K9178j4586l0602j3011K1595L3314n6961k1891M3942
22474c0798J226m5632J9275L1088J3021J9101J2677p477j3200M5249l2509j790
22462A0231n0190k3635j6022L9089L7944K6835k5409j0935q7509k4627M4174L6919
22450d3135M0468J8800J1511m4393j4836J2655k7753o98Q9243k6650o762N181
22438A3631L1557J5506L3576p562o3165k3390N4365M2555M966o5954n9395k6081
22426d9391k9672K0567k854L874n731j843M3533Q0194L3042j0538l1913q0673
22414c1405m0385J6577J3386K3388L8179K5453n6396l0057J4368j2575j3095L1128
22402b1434M0603K7380k4749l4050k9792k9991K7114Q430K2918P1057o9028j1677
$$ y = [45388, 30045, -1051, -21776, 7402, -7184, -37786, -50797, -29202, 4112, -52849, -74740, -30798, -29572, -75204, -55929, -24841, -11820, 7281, 19958, 12481, -719, 44530, 12021, 10231, -39959, -63594, -79616, -40527, -2583, 24252, -1157, -12092, -99601, -124228, -80054, -43135, -2667, 16133, 27644, -16749, -31585, -18930, -46683, -47381, 41862, 15212, 8450, 13631, 45188, 60694, 94270, 86708, 23543, 153, 54518, 97073, 102039, 36085, -23310, -49391, -79063, -58496, -61350, -57476, -63207, -65050, -21517, 58677, 91719, 81181, 49268, -31405, -71790, -55213, -41827, -18439, 19740, 45193, -11203, -41260, -26892, -39467, -52562, -21434, 19169, 46549, 21800, -12250, -42042, -72033, -44919, -36489, -13571, 57486, -11542, -23219]
22390b3219L3923j8868k9032k316n579L757K6186m8712J9281O9920o707m2905
22378b4271J414K4727L514L0333j4377p4094k9894l7127L809O9630L9598l3149
22366c9887K188L9495J1191J9974L7950p575Q093j5989j6184k3568O5462J8556
22354I9706n6344l6159j8390K6949M073M3141J9497m5317k8862k984K1201l2796
22342f285N2j0804m7689M339L9625J6900j6731m1781J1698j713m243N1346R445
22329D159l7610m9000k534Q8341P422m2163l7051J0587o8361L5340P6286l8626
22317e3210l1893J5377O4643J9581j4340J8922K0941J6538K362j2404l3050O3900
22305G7367j5732q239k5681k840J2731K5042l8558n8314J6111n316L8980M5982
$$ y = [-23219, 10704, -8164, -37196, -39512, -45091, -41334, -15148, -63860, -44579, 25341, 18634, -24271, -22857, 1870, 5384, 35717, 21340, -52754, -82648, -119775, -115966, -46336, -6738, -39887, -37699, 1796, 12987, 32961, 70911, 63336, 71429, 55440, 39256, 15688, 81150, 99706, 43362, 7203, -11187, 15762, 19835, 62976, 82473, 37156, 8294, 5310, 26511, -6285, -6233, -17037, -64726, -60387, -20762, -3862, -20593, -62374, -50676, -52389, -56632, -5286, 4159, -33451, -82451, -84985, 3356, 10778, -31385, -68436, -57849, -126210, -90870, -14584, -53210, -85103, -69726, -5083, 14498, 158, 19080, 40021, 56559, 58921, 46517, 13467, 77367, 61635, 53396, 27715, 24875, 37606, 62648, 24090, -34224, -18113, -23429, 15551, 61533]
22293F1533j8801m386j939j6022n9191k2146L309M4976J3000l4320k771J6710
22281b0048L0009j2016M9105k6554l9539M2243k7594m2095L75j00425J8378P5049
22269e3112j6609L8240M2167M1212n0662l0774N7937k3600n7940J0178M8422j1767
22257f308M329q573l7362K026M2807N6297l7276l2702K4597r671J4971m4565n3128
22244h4558O4979K2838l8689j2902j4719K0325Q525K3939n6684p0097k574J7028
22232a22589L1509K7036J6529L540M3750M310P5625m763p1729n697K5240l0457
22220g696n7623o3330o2669m726P3965N6053l6075j1927M5345Q923O499p5635
22208a28896j6799N9555L7421k8959j8684L6504m4108N6018K5980P156K8122k6561
$$ y = [61533, 42732, 38346, 36407, 20385, -38806, -60952, -57643, -12667, 333, -33987, -36758, -20048, 9961, -2055, 47050, 20496, -19043, 23200, -4394, -46489, -46114, -146539, -128161, -53112, -69721, -31481, 10686, 51898, 1236, -29538, 28399, 4799, -53141, -42963, 5459, -6308, -1979, -10552, -47914, -45888, -3081, 53216, 15940, -16762, 7835, -1836, 13135, -31430, -84558, -19579, 3259, -35430, -48332, -63051, -42726, -34201, -10262, -66946, -137043, -139617, -122589, -91080, -64044, -47515, -43975, -225, 4085, 79710, 74947, 3218, -2479, 22761, -7696, -65319, -128649, -191318, -196044, -122079, -66026, -102101, -114028, -68683, -59760, -53261, -128896, -145695, -86140, -48719, -77678, -96362, -59858, -103966, -47948, -21968, -14812, 13310, -13251]
22196a3251k0124J2365Q17k9279P556q552P760K3042J6901j4937l1916l479j2102
22183f5199J7560k041K7295J6432J8469N70j6803K9755j6223N6208k638o2652
22171G33M961q285l5972l0567O716O3328J0254l8537K0790J4502K8310l0000k4112
22158a7879J1194O2970n0071o0030n9818l0274O3884K0430m6664M9279L1061J3006
22146a2912j2580k1416k485K8021O6998l187n2514K7067k6908N1447J451k6945
22134A6037L942j341q9230j3433J7541K8673L1965N1005k7929o110J2422l5804
22122a2262k2730K8340L9764j7308o0992k3407J1572p831L8204k497j4163p13
22110d4023n9713j7452l4427J7132O4857P744k9217j3266J8306J0102m613K9946
$$ y = [-13251, -33375, -21010, -20193, -49472, -41916, -50468, -42708, -19666, -2765, -17702, -49618, -53097, -65199, -47639, -49680, -22385, -5953, 12516, 13086, -3717, 26038, 9815, 66023, 63385, 733, 5694, -2591, -38563, -69130, -62414, 914, 11168, -27369, -6579, 7923, 36233, 6233, -17879, -6685, 56285, 6214, -53816, -113634, -143908, -80024, -59594, -106258, -56979, -25918, -12912, -25492, -46908, -49393, -21372, 45626, 42439, -10075, 16992, -9916, 41531, 42982, 16037, 19979, 18638, -70592, -84025, -66484, -37811, -5846, 45159, 17230, 11120, 23542, -12262, -34992, -6652, 33112, 15804, -45188, -68595, -57023, -64854, -26650, -29147, -43310, -44023, -103736, -121188, -155615, -138483, -73626, -65882, -95099, -108365, -90059, -79957, -84570, -54624]
22098e4624k3865Q876L7113k4449m0007M162L200N267m220K8068M8730M687L8823
22085C1761L3405M7167k220K06l3451K3214m4045Q671k11j8865j333n9242m0414
22072e5357j3352J7362K5362L2181J438m9792o6115J5457K0157O9375P070m2887
22060c9101p735L0054J3215m411m2946o948j2444k8045j2321P6287N8384n221
22048A8768N800l2777J2225L7483o3865P79P6204m652m3269o8043l7010K4854
22036g3503j7272O187Q0705P3786J8102l0411l6418m8878K7079K7084r998r4978
22024g8515k077J0130k3106L993j3674J1201L9365K1625j2830n556R709L9801
22012F6K1595j7472n9017j8104K5385K8624o152Q192Q231j3308p228j3207q473
$$ y = [-54624, -78489, -69613, -32500, -56949, -96956, -92794, -89594, -84327, -88547, -60479, -11749, -7062, 31761, 65166, 112333, 110113, 110319, 76868, 100082, 56037, 64708, 64497, 45632, 44299, -14943, -55357, -68709, -51347, -25985, 6196, 7634, -42158, -108273, -92816, -72659, -3284, 3786, -39101, -46836, -16782, -3567, -7978, -50924, -57872, -70316, -98361, -110682, -34395, 23989, 18768, 24568, -8209, 4016, 41499, -22366, -21587, 54617, 49965, 6696, -61347, -98357, -73503, -90775, -84588, -3883, 69903, 88005, 57594, 21176, -27702, -623, 26461, 16463, -78515, -80592, -70462, -93568, -89575, -103249, -92048, -52683, -31058, -43888, -49444, -39735, 66, 21661, 4189, -54828, -72932, -47547, -18923, -25075, -16883, -8652, -21960, -29188, -42395, -50868]
21999e0868k9778k9900R3365O0825O176r47m2753k7338K8305j1384l8041L3853
21987h485K5430k7976m5874O489K8253k3401R795M094j823M6473l429j1960K0030
21974A7616K3221k849m3449k2243J7542Q616J1285j280P556k6100j6069o46l1862
21961e8662N1331k2864m925j0591K2831P3429q870k54r825N5231N008m8362q6063
21948d2586O797p463j2072K7146m2008n0817P407K0727m711K9240k1078L9338
21936e0080J7388R946L02K551K0780J3112j5415n29L2484M1999k5863N165K0752
21923G2592p1853l5827j273j8483p4265N8765J9462j3478n231P2621M5536Q920
21911E7486k2193k4280l8898K7224O182L751L1759N9862l5954n8035R292j4241
$$ y = [-50868, -80646, -110546, -17181, 43644, 49820, 48873, 6120, -21218, 7087, -4297, -42338, -8485, 16945, -11031, -56905, -50416, -22163, -45564, -35769, -31675, -33498, 12975, 9546, -2414, 17616, 40837, 37988, -5461, -27704, -10162, -1546, 9739, 8459, 16015, -10085, -26154, -26800, -58662, -7331, -30195, -35120, -45711, -22880, 50549, 41679, 41425, 31600, 86831, 91839, 43477, -42586, -35789, -43252, -55324, -28178, -70186, -121003, -113596, -92869, -97580, -68340, -89418, -50080, -32692, -22746, -22444, -19893, 887, 13999, -1416, -1945, 30539, 72538, 46675, 51840, 72592, 739, -35088, -36361, -54844, -129109, -70344, -50882, -64360, -69591, 3030, 48566, 57486, 35293, 11013, -27885, -661, 5521, 9272, 41031, 100893, 64939, 6904, 16196, 1955]
21899A955j1435K8079J3574J890j059j8215M0550O160l5678j0828j5021o8884
21887f8912n9725L6532P5876n8451K2600J306O8922L0929k7571Q461n503k2521
21875A943J7962j6478o064N583M587K6495L7749o1760k5619n61l4983J8170L8071
21862E095n217j9593K3441M114j3803K0189J2326o2528m5291l406M7431J475M155
21849c1612n802k6270j668P2621L2529j698o6837n1253J1126l9900j6517L5276
21837i0005M0099j4058m1035p583o296O7926K2684L71j4533k953N6025n181N6576
21824F2037j9340k7816n7350l730K6750N6608k3304o937j5357l3377j3386J9921
21812c5281l843N5827K1330R145j2901J6469O452j6736n7967k2660K8507j168
$$ y = [1955, -9480, 18599, 32173, 34063, 33004, 14789, 55339, 61499, 25821, 14993, -28, -68912, -128637, -92105, -16229, -74680, -52080, -50774, 18148, 49077, 21506, 29967, 24464, 1943, 19905, 3427, -2637, 2946, 7533, 34028, 71777, 10017, -15602, -16163, -51146, -32976, 5095, -122, -19715, 3726, 7840, -5963, 14226, 26552, -35976, -81267, -84673, -37242, -35767, -31612, -37414, -63684, -65352, 7269, 39798, 38100, -28737, -79990, -68864, -108764, -125281, -90005, -49906, -63964, -104999, -112582, -118878, -50952, -28268, -27897, -42430, -45383, 10642, 5461, 62037, 42697, 14881, -42469, -46199, -19449, 37159, 13855, 6918, -8439, -41816, -55202, -35281, -39124, 16703, 38033, 47178, 34277, 50746, 57198, 40462, -17505, -40165, -11658, -12826]
21800a2826Q1481q16l4203K1302K5182p86Q835j6878J605l8163q1751n3305k3927
21787a24250M764o96L1537L137J5008O7640L7452N337m2517J2912L8500J4898
21775F3722k5902q633l4290n9273J2399L9555j0018k0559K9495L5913p2602k6821
21763g7014K1072M2067L3100M23k4943j5201q465P184L6045m7319j5247O5163
21751A6865N8795J4367m3515k0023M4680j0235l0565K5420P6248m9693j25718
21740d3374l83Q9430K0714k8906K7426n818j672K0737j2686M0836p487n2823l296
21727D2698M4102j644o912n1490m72M0841K5978P241j0073j4854n717k8875m7836
21714g013J7206k3506k4195J2867K4867N123o0499j3932K3370n0177N0898O8223
$$ y = [-12826, 68655, 67839, 33636, 54938, 80120, 79334, 88169, 71291, 72896, 34733, -47018, -100323, -124250, -119486, -120182, -88645, -85508, -70500, -2860, 34592, 39929, -2588, 10324, 48824, 63722, 37820, 29187, -5103, -64376, -51977, -12422, -22440, -42999, -13504, 22409, -50193, -77014, -55942, -13875, 19225, 19648, -5295, -20496, -28961, -21777, 14268, -33051, -48298, 16865, 75660, 90027, 46512, 26489, 71169, 60934, 30369, 55789, 132037, 82344, -43374, -43757, 45673, 66387, 37481, 64907, 59089, 57417, 78154, 65468, 106304, 98817, 45994, 42698, 86800, 85156, 78244, 26754, 26282, 67123, 93101, 100342, 90269, 75415, 69698, 40823, -7013, 10193, -13313, -37508, -24641, 226, 5349, -55150, -69082, -45712, -95889, -44991, 23232]
21702B3232J6261m3677K6414N780l5082m5420Q346J9632N6517R537l9335m7835
21690d5630n8124O737K6764k3682j5106M4599j174K2328L4153J8322O70J1947
21678B1804m0216m1912K6308m6047r260J3815J7347K2447M9706J3347K1169j5455
21666C3053j8331Q0568j1752q0990J1247p349j1955K2781L339j1344n0302p1044
21654a12079P1096N325K59j4429K2932K3593O2903L4683k9744m5289K9512n0868
21642b106P881L1483l706q1445J1608K1980n119N738J3524N4973m7333R719j7801
21629f04n7908o347M0350P66k9539O1492R375j8058j8182J7375J7042j6996l365
21616d599J0912m3591n5469k9044P136P098K4749N0999J6017m0217l6534O5584
$$ y = [23232, 39493, -4184, 22230, 28010, -7072, -52492, -44146, -24514, 32003, 41540, 2205, -45630, -103754, -97017, -70253, -93935, -109041, -64442, -65616, -43288, -9135, 9187, 9857, 21804, -18412, -60324, -34016, -80063, -89323, -75508, -58161, -35714, 13992, 27339, 48508, 33053, 14722, 95290, 83538, 2548, 13795, 6446, -5509, 17272, 20611, 9267, -41035, -112079, -40983, -35658, -35399, -49828, -26896, -3303, 59600, 94283, 64539, 19250, 48762, -2106, 5775, 37258, 33552, -47893, -36285, -14305, -19424, -13686, -162, 54811, 7478, 17197, -604, -58512, -64859, -24509, -23743, -53282, 8210, 17585, -473, -18655, -1280, 15762, -1234, -4599, 6313, -37278, -92747, -121791, -114655, -107557, -82808, -31809, -15792, -56009, -92543, -26959]
21604b6959M062p0845l2353l9864J7627N8600R154L483N0866N992l5817l3060
21592h9114L1397L0842J7186R61j2892n9983L4393N2582j4679l8035j3455M0939
21580a9858l5389n9693k5770J4878L1801O7714P9277m044Q646l2714Q769J4956
21568D8573L9245o2121o6664M2181K2937j8348R52l1214k2242l6404m9676j8490
21556a51271k862K0297k582J0986N2371J73K2378K9050n3141K3227j0408P156
21544e4626N062n8103L6915J2827j2190M174M5996L1788o6665n314J2152k4942
21532g2926m557l8391n702M380K4601J2638L6170M1730L4841L7283l5595p9991
21520d5519l7270l3281J9945K7429M3391K2426l5507m6349k5863L4742N1060j0997
$$ y = [-26959, -22897, -93742, -126095, -165959, -148332, -89732, -80578, -77095, -26229, -20237, -56054, -89114, -57717, -26875, -9689, -8728, -21620, -81603, -47210, 5372, -9307, -47342, -60797, -19858, -55247, -114940, -140710, -125832, -94031, -26317, 52960, 48916, 57562, 24848, 33617, 48573, 87818, 25697, -40967, 1214, 24151, 5803, 6755, -24459, -46701, -83105, -132781, -151271, -154133, -133836, -136418, -125432, -73061, -72888, -50510, -21460, -74601, -51374, -61782, -54626, -49564, -107667, -70752, -57925, -70115, -65941, -19945, 11843, -54822, -60136, -47984, -72926, -77483, -115874, -121576, -117196, -92595, -79957, -43787, -2057, 32784, 70067, 34472, -45519, -82789, -116070, -96125, -68696, -25305, -2879, -38386, -84735, -110598, -75856, -24796, -35793]
21508c5793J2273j262J2186k1930J222k5430l3586L4825L7686n6345m6660J3823
21496a08991L6487p617j2604p446L6212N6762J2646Q5807L4771o0515j5073n5430
21484d991n2996O4610q044J2597K0410J0866J4326l8625L838o550l6498p8339
21472i9396K5518M6625K1723L7746J7198N104Q608m5498n9588p42J0133k3303
21460e5872N5705K3660m6713k1413n2489K8529L3332m851K1741k4505J6522k2354
21448d8708m4768N5449J1084j572L0693n7148q3071L1870N8557k1798k6094K2575
21436g2931J2922n2926n127N8373l9734m5074Q544K3243K8559O907K4106k738
21424e5876L5887J381n6650m5847j1092J111j3800m8537Q89P4499L5408L8657
$$ y = [-35793, -23520, -24782, -12596, -34526, -33304, -58734, -92320, -57495, -19809, -76154, -122814, -108991, -72504, -80121, -92725, -100171, -63959, -7197, 5449, 91256, 126027, 65512, 50439, -4991, -57987, 6623, -1421, 11176, 31586, 42452, 56778, 18153, 21991, 15441, -21057, -99396, -73878, -27253, -5530, 32216, 49414, 54518, 63126, 17628, -41960, -42702, -32569, -55872, -167, 23493, -23220, -44633, -97122, -68593, -35261, -40112, -18371, -42876, -26354, -48708, -93476, -38027, -26943, -28515, 2178, -54970, -138041, -106171, -47614, -69412, -95506, -72931, -60009, -112935, -118062, -59689, -99423, -144497, -135953, -112710, -84151, -77244, -53138, -55876, -19989, -18608, -75258, -121105, -132197, -131086, -144886, -193423, -192534, -118035, -82627, -43970]
21412d3970M6763K6175j8412M9630J9628n5620L1519l3116k6987K03k7067L934
21400b7320L141m723O452L606l5709L0100M2742l0857J610J607K1912m6576l606
21387c7621j2296l4882L7888J2929l3355M65P0933J2909l1456j2852L066M1129
21375A6857n303J6905R659k461k0262k573R242k5169K9221M6548l6713n0324L7349
21362B2976l3037J750J5978j0486J8804j7879l6630o5899L6294L6022K7437k1124
21350b5794N760k8664J5434l6449K7957M3799l3709l0364n0118J9162Q2141L5333
21338B4488L6442R65k2242L4101j1260o32j8467m1387k289j3795j6867k8813L0805
21325b8951J6386k1450l0174K0847j21J0224m455o9239P956N5355K8370m8839
$$ y = [-43970, 2793, 28968, 10556, 60186, 79814, 24194, 55713, 22597, -4390, -4187, -31254, -27320, -24179, -28902, -22450, -18844, -54553, -24453, 18289, -12568, -10958, -9351, 12561, -34015, -37621, -49917, -84799, -46911, -33982, -67337, -66872, 4061, 16970, -14486, -27338, -24272, 16857, 11554, 28459, 38118, 35657, 15395, 12822, 22064, -3105, 26116, 72664, 35951, -14373, 22976, -10061, -8311, 7667, -2819, 15985, -1894, -38524, -104423, -68129, -32107, -4670, -25794, -20034, -48698, -33264, -69713, -41756, 2043, -31666, -62030, -112148, -92986, -10845, 24488, 60930, 61895, 39653, 73754, 62494, 61862, 43395, 2008, -281, -14076, -30943, -59756, -28951, -12565, -34015, -64189, -43342, -43463, -33239, -37694, -106933, -98977, -43622, -15252, -64091]
21313f4091L7817J2130k6587L2100L0679O616M057J2578J2635l1449m7861l5156
21301e6532k3251L7187M1440M845o9367J5656M7498K3135M3963j256N424j7669
21289E1073k3770l0020p4835k2318P447M7085M6980L1965n1567k8559n240l0780
21277h2539l2217M5832K2365M8337L189J6292M0249k5826j8758O0156L3766m7627
21265F3219m3501O7941L0014m9174l3776k4962k2251K641J7497M1822j2500k3268
21253A3702j1067L4837L6892r723l2852l4497l3671M285N4907Q3021m9255o8259
21241a1680n9518K4191K9761M2225j3442j2654m829n2169M2384r332m3644j671
21229g0378K1232o561L7237N0364J319o26p641m6776k3602N2447K005m1622j7277
$$ y = [-64091, -26274, -14144, -40731, -8631, 22048, 28664, 32721, 45299, 57934, 26485, -21376, -56532, -79783, -42596, -1156, 3689, -65678, -50022, -2524, 20611, 64574, 63318, 68742, 51073, 27303, -2717, -77552, -99870, -92423, -45338, 1642, 33607, -17960, -46519, -51759, -82539, -114756, -68924, -46559, 1778, 4967, 21259, 61508, 35682, 16924, 77080, 110846, 63219, 19718, 87659, 117673, 68499, 34723, 9761, -12490, -9849, 7648, 49470, 36970, 13702, 2635, 37472, 74364, 64641, 31789, -2708, -36379, -32094, 22813, 105834, 56579, -11680, -71198, -47007, -17246, 24979, 11537, -1117, -5946, -58115, -15731, -25063, -68707, -70378, -49146, -55707, -18470, 31894, 33213, 32587, 24946, -21830, -45432, 7015, 9020, -32602, -49879]
21216d9879N8360L6793L265K3396l3332r7314J3130N7167L0845k2794n7542J9398
21204a8507N974k5031K5203J366l3023m1928N1344M7178l0326m2860K8698k417
21192c4329k3435L1208K6837k6106j1754R490K907o469Q140K7857K3450J9791
21180D7587l5485o5611J5091M5443k5698l2805M41n2635j7539j6104K3842N9205
21168e4268J4744N7063M5974k8919o306k1086l3527l9654j0167Q234j1045L2143
21156d6814O1915K2861L5644K5283j7646j3769q326J5156j5238j3498l5110j5392
21144d934k2887K2173l0755k6304p011L1705J9539j1132q35Q025K7109l9041O172
21131b8176M8154N0358N0206O683k2881j03630q702L363O936K9199R857k8227
$$ y = [-49879, 8481, 45274, 48539, 71935, 38603, -58711, -45581, 11586, 42431, 19637, -37905, -18507, -12533, -37564, -12361, -10995, -44018, -85946, -34602, 12576, -17750, -60610, -31912, -34329, -57764, -26556, 281, -25825, -37579, -28089, -25182, -31651, -23511, 4346, 27796, 47587, 12102, -53509, -38418, 7025, -18673, -51478, -51037, -103672, -121211, -137315, -113473, -54268, -39524, 17539, 63513, 34594, 28288, 7202, -26325, -65979, -76146, -67912, -78957, -46814, 15101, 37962, 73606, 98889, 81243, 67474, 59148, 74304, 59066, 45568, 10458, -4934, -27821, -5648, -36403, -62707, -69718, -38013, -18474, -29606, -30441, -22416, 4693, -34348, -28176, 19978, 70336, 120542, 127225, 104344, 714, -7988, -4625, 2311, 31510, 41367, 13140]
21119A3140J2367J1157N0819J501o6491J6408j2159n6717k2342L222q12J6249
21107c3658L1186M9281K8218j0054l7733l0076n9026l3857P7357J138j7601o0055
21095i4880o299K4483J4810K9610N1131M8017o3058l7301j7764L7717M7607j91
21083C3882l5763n8522k5400M9525M5252j5656J4440r502L67m4861o5456J1278
21071a00416J5162q197k8543l992M7509M2795P2385K3786l5859m8142m2792L2033
21059c4271p136J3277m5712l3701N581J9129N7450K0833j5896m5712K846j6393
21047g9705l580K7008j3175L8487N4370k1544J805j6160k396k7153M2604K0875
21035B1436M4254P607m8359q770K9180M4209l5545n8143j6587r767J9408j1797
$$ y = [13140, 25507, 36664, 87483, 88984, 22493, 38901, 26742, -29975, -52317, -49095, -49907, -33658, -2472, 46809, 75027, 64973, 27240, -2836, -61862, -95719, -18362, -17224, -34825, -94880, -101179, -76696, -61886, -32276, 18855, 66872, 3814, -33487, -51251, -13534, 34073, 33882, -1881, -60403, -85803, -36278, 8974, -6682, 7758, -1744, -1377, -46238, -111694, -100416, -85254, -93451, -121994, -125986, -78477, -35682, 36703, 60489, 24630, -23512, -66304, -34271, -41407, -28130, -73842, -107543, -101962, -82833, -25383, -4550, -20446, -66158, -63312, -79705, -83285, -56277, -69452, -30965, 23405, 1861, 3666, -12494, -14890, -42043, 561, 21436, 65690, 73297, 24938, 16168, 45348, 89557, 54012, -4131, -20718, -30485, -11077, -22874]
21023b2874k7453R93N2845j2852k2863K71L6488L1337o165m9775l8485j3139q718
21010h0390N8040m0229m8931R382L4491R584n116N2110O31r844J2021P1628J3168
20997G6545n7455j8846j8763q47O57r051J8846j7570K3081M9539M2659L0764n8763
20984F0796k7658L9801l4072Q192k7223o1516R687P85j9006O5195L3854m5394
20972C441l6291n144J3367p160Q16m843O6534K8182k0429J0207L8m8835k9718
20959b9835o0051O657L3791K8605m0415m686J7002L1852K009O691n809k4585K1711
20946a7063o064J0471N3913k55k8643l1724n4958j10136J5287O6135O3995K1001
20934a8041k0494R61J2687j5065j6647K785J1810k0038K8360P397L90L3659L4338
$$ y = [-22874, -50327, -49334, 3511, -9341, -32204, -31933, 4555, 35892, 29727, -20048, -58533, -71672, -80390, -22350, -62579, -111510, -102128, -67637, -58053, -63169, -11059, -10428, -20272, -8251, 63377, 76545, 19090, 244, -18519, -19366, -18709, -27760, -8914, -26484, -3403, 46136, 88795, 119559, 60796, 33138, 72939, 38867, 47059, 19836, -41680, -31993, -31208, -50214, 14981, 48835, 3441, -32850, -37994, -24627, -31787, -30971, -35814, 30720, 58902, 38473, 48680, 48718, -117, -29835, -89886, -83229, -49438, -20833, -61248, -65934, -48932, -17080, -15071, -8380, -14189, -38774, -17063, -23127, -12656, 41257, 41002, 12359, -19365, -74323, -184459, -169172, -103037, -39042, -18041, -38535, -37574, -24887, -39952, -56599, -53814, -42004, -62042, -33682, -26285, -25895, 7764, 42102]
20921D2102o7581l4445k3662O2490L272M881r006J961L3840L4013o95n8175M293
20908f712N7059o967j0766m8018Q98K8419K2960j6697K7779m1570J4875L8375
20896E9635K7634K4308r750n8454K4674m745p0528k8176K5253k1404k7394J4464
20884d4483j9172j3460J5676K7805R8661l8521n8918M4401L8852J2276j3089n0278
20872b50r3830j5891J2205j351L9226J3010o36J3728p534P9554j3664m8947j0143
20859c4523m3637O666O2798l6418M383M339q728m3989R9356Q3640m9034p1850
20847b6997p952l399k7653j4531O1265Q2114j959K4157o1707l9386N300L1356
20835B0608l5677R486L4996n6791Q223K084l0141k7750j3860P742k487k6518L8112
$$ y = [42102, -25479, -59924, -83586, -21096, -17824, -12943, -21949, -19988, 13852, 47865, 47170, -11005, -6712, 50347, 43380, 32614, -15404, -14506, 13913, 36873, 20176, 47955, 6385, 21260, 59635, 87269, 111577, 101827, 43373, 68047, 63302, -7226, -35402, -10149, -31553, -58947, -44483, -63655, -77115, -61439, -33634, 65027, 26506, -32412, 11989, 50841, 63117, 50028, -250, -94080, -109971, -97766, -99117, -59891, -46881, -47517, -33789, -41323, 38231, 24567, -24380, -34523, -78160, -71494, -8696, -45114, -40731, -36392, -45120, -89109, 10247, 93887, 44853, -26997, -34949, -38348, -66001, -80532, -19267, 62847, 60888, 85045, 23338, -16048, -10748, 20608, -15069, -5583, 29413, -27378, -19155, -17071, -47212, -74962, -88822, -81080, -83567, -110085, -71973]
20822g1973O030M0420L0671k0196K4490L0149k1170k3869m3680k3718L6633K2713
20810a3500k7166n313j5618L3375q494p0133k5493K8606M8844L3166N3009L5375
20798F6658m1035k0528N7920J766l501m737p8494n2894N0921J4679o1625r0054
20786a60924k6054p423L0575K8232J1207P264N5904M0267N2932J3020o9827j6363
20774d1190J1924J178m125M3126K969o8623l018N1459K0913l3776J1295J3833
20762E965j2729m4862K8553O187N3615J6805j1103p402m7893q600p383K1359l5992
20749d3480J1363Q6157J7266o7522n4651J5263Q308l16N232kp550j787J7826J086
20735a2807l7702J8604k1002K0732l666L5222O707p0979j8704O437L5222r977
$$ y = [-71973, -65943, -25523, 5148, -15048, 9442, 39591, 18421, -5448, -49128, -72846, -36213, -13500, -40666, -45979, -61597, -28222, -36716, -106849, -132342, -103736, -54892, -21726, 31283, 66658, 25623, 5095, 63015, 64781, 61280, 56543, -21951, -74845, -23924, -9245, -70870, -160924, -186978, -194401, -163826, -135594, -124387, -117123, -61219, -20952, 31980, 45000, -24827, -41190, -29266, -28088, -32213, 10913, 13882, -54741, -57759, -6300, 14613, -19163, -7868, 5965, -6764, -51626, -23073, -16886, 36729, 53534, 42431, 35029, -12864, -21464, -28847, -7488, -43480, -32117, 54040, 71306, 3784, -50867, -35604, -27296, -27612, -22380, -22382, -29932, -31719, -13893, -12807, -50509, -31905, -52907, -32175, -35841, -619, 6088, -64891, -83595, -77158, -41936, -51913]
20723e1913j6808J5882j4018K2013M7942P810m3444m969J5080k4956l4471M8625
20711c3227o540j9241p242J9443J1589L3707k9628l6524N2911O8847l3508r344
20699A1243J579p510N200L5612j2265n4189j1103J8344K6024k5068K7216K3253
20687C8336j750k0351n3233M7837P625J5002m8704k8884J5227k6165L7639J8262
20675H41j6141j3837j6807p939q32O1344M4502l3582L9708k0090m8519K2858L310
20662A4816q443j4568o6429o4487M4486L6614O530o0940J613K4860l3188j4483
20650a33619J5433J6456m170k0442P790J8301K0769K0813J9195L5502j0172m3156
20638e7300m0466o12L9045l879j3198L1402K2166N648L1491K7534m6193j4815
$$ y = [-51913, -68721, -52839, -66857, -44844, 3098, 10908, -32536, -37505, -22425, -47381, -81852, -33227, -39767, -59008, -66250, -46807, -35218, -1511, -31139, -67663, -14752, 54095, 20587, 11243, 12822, 5312, 10512, 46124, 33859, -20330, -31433, -13089, 12935, -12133, 15083, 38336, 36586, 16235, -36998, 10839, 18464, 33466, -15238, -44122, -28895, -55060, -17421, 841, -15300, -29137, -45944, -53883, -54715, 6629, 51131, 17549, 57257, 37167, -11352, 11506, 14816, 6373, -8195, -74624, -139111, -94625, -58011, -51481, -112421, -110808, -85948, -119136, -133619, -118186, -101730, -105900, -126342, -118552, -100251, -79482, -58669, -39474, -3972, -14144, -57300, -97766, -98378, -59333, -63212, -76410, -45008, -22842, -17194, 14297, 41831, -4362, -19177]
20626a9177K9172k8533J2819K9632o9988n2841j7133N7867M2004n454k6196N571
20614d2257J4996m2746J5744K4546O760N8573L733j9622k4746k7762k4788K0501
20602c7068K5028M2858J6564j0436l1183K3962K0364L1988l6292j0879l1431k5414
20590b1939N567r0208n4155L1306j4343M2067M2034L0220J7005L7790n5792p7139
20578a07587m303O8259M5869J7559l0234k7034k681j1951O494j985k5099k2989
20566i5682Q991J6592J0803j7550K3160k6226p6071R4867P6318m183o046o955
20554a982k5236m2689j0076n3549n6752J3237N6409N1913K361P089L2962O606
20542a9707j7754J7006j7964j191K4210P933k5801j3423L863m38N585j3794J9899
$$ y = [-19177, 9995, -18538, -5719, 23913, -46075, -98916, -116049, -58182, -16178, -21632, -47828, -42257, -27261, -70007, -54263, -29717, -22957, 35616, 39349, 19727, -5019, -32781, -57569, -37068, -12040, 30818, 47382, 36946, 5763, 29725, 50089, 82077, 45785, 34906, 3475, -21939, -16372, -106580, -160735, -129429, -143772, -101705, -59671, -29451, -12446, 25344, -30448, -107587, -111890, -43631, 2238, 19797, -10437, -37471, -40152, -52103, -45609, -47594, -72693, -95682, -86691, -70099, -59296, -76846, -53686, -79912, -155983, -61116, 15202, 11019, 4973, -1982, -27218, -69907, -79983, -133532, -190284, -177047, -120638, -68725, -66364, -59275, -26313, -19707, -37461, -20455, -38419, -39610, -15400, -7467, -33268, -46691, -42828, -43266, -37681, -51475, -31576]
20529c1576N1057j9391o1168N0919P5603k325n4889l8476M0248K3979M5323o9376
20517I928l7652L6918j1588L1294k246o4755o3407K4208L0194r2j6546o412l7720
20504a07876J3499Q4805k7831l4720L7859O7094L4688J1488j05150l9902L1558
20493c4488M1722L3929l1116k9990L3841J4960m2344l1202n4614P049N1709j8873
20481e9417l4359L2352L3906l862n282P46m4263L517l370J9867J0014N694k6887
20468g1344J1172j2501m4464j9791L7061J3885l289J0043n668k4352J0441O4047
20456c4760L2702n2720n637R360l6887k5721M2896K1748P91l9885l4976O6142
20444e6947N8946N168n2052k1276j3698j3911l4784m5997P3596J6388k4128K9501
$$ y = [-31576, 19481, 90, -61078, -10159, 65444, 63119, 8230, -30246, 10002, 33981, 79304, 9928, -27724, 9194, -2394, 28900, 26654, -38101, -101508, -77300, -47106, -47198, -63744, -70156, -107876, -94377, -9572, -37403, -72123, -34264, 32830, 67518, 79006, -26144, -66046, -34488, 7234, 41163, 10047, -19943, 13898, 28858, -13486, -44688, -99302, -92253, -40544, -59417, -93776, -61424, -27518, -31380, -36662, -35916, -80179, -76662, -80032, -60165, -50151, -44457, -71344, -60172, -72673, -117137, -136928, -99867, -85982, -89271, -79228, -84896, -109248, -98807, -34760, -2058, -54778, -60415, -51055, -87942, -113663, -70767, -49019, -48228, -88113, -123089, -56947, 1999, 7167, -44885, -66161, -79859, -93770, -128554, -174551, -100955, -84567, -108695, -79194]
20432g9194O1887J1131j7162L573l4596q2101j0263J9025J2035N6428J131M019
20420e4087L1029r885L1409K2901P0865J7113n0697k6687l5536k7298k8521k1890
20408h1284K116K0227J2491j915q804m498o101j1089K2371K4488K2981l104J8737
20395F616L8675J4986q389l8215n4226m6551J6881j0180L1544M5447K578m0224
20383d1058l2956M1084Q6311K6450l4918M6511l2136q0709n8106n9414l6618Q4125
20371i1434N4870O6306n6731L9891P930K6572K6225J5824K624j9406n5791n8021
20359d1141N258j2013q52j6853l169n584J9286J2029j4978K3054k1085N111k5747
20346g6684J8928k0492J2966M1659P2057L4858k4351k2036p058n3404J1665J6844
$$ y = [-79194, -17307, -6176, -23338, -19765, -54361, -136462, -146725, -127700, -115665, -59237, -58106, -54087, -23058, -32943, -1534, 21367, 92232, 109345, 58648, 31961, -3575, -30873, -59394, -81284, -79168, -58941, -46450, -48365, -57169, -61667, -67768, -78857, -56486, -31998, -9017, -12121, 6616, 45291, 60277, 51888, 13673, -40553, -87104, -70223, -80403, -48859, -3412, -834, -41058, -74014, -32930, 53381, 79831, 44913, 91424, 59288, -21421, -79527, -138941, -175559, -91434, -36564, 29742, -26989, 12902, 20832, 47404, 73629, 89453, 92077, 72671, 16880, -41141, -35883, -47896, -48748, -65601, -68770, -74354, -55068, -43039, -58017, -34963, -56048, -50937, -76684, -57756, -78248, -65282, -23623, 48434, 83292, 58941, 36905, 29847, -23557, -11892, 4952]
20334D952l0370J6435j4113l581n256k99j5790k3098J1997L7258K9273K5064p834
20321B4638l9488L5J094P357k3436k914N1890O687l7994K7881p410m191l0384
20308b6235m2946j1970J4656K6311J663K2617R391p616J861K5735k9652j4953
20296c1138m0686L2919N1427k8867l7716J803J3144j3132m83N7585O091m2466
20284c1519m3261L2143K6654k0011L4141P057j2603o1920K4584Q0856L2519o8414
20272B26l6607L4932J7125j1158j9965k3927J1830O7691m982l0141j5058n756
20260a5790R33k674m2558K2007M6967K3416j2660M7362R880j4855j4687n7963
20248a0622O12k763j9074J3396l724j0839j596M6267K775l2991j8910o0762J7677
$$ y = [4952, -25418, -8983, -23096, -26677, -31933, -32232, -48022, -71120, -59123, -21865, 7408, 32472, 24638, -14850, -14815, -13721, -6364, -29800, -32714, 19176, 25863, -12131, 15750, 8340, 4149, -26235, -69181, -81151, -66495, -40184, -38521, -15904, -6513, -14129, -12268, 13467, -16185, -31138, -71824, -38905, 12522, -16345, -54061, -52258, -39114, -52246, -52729, 4856, 10947, -31519, -74780, -42637, -15983, -35994, -1853, 5204, -7399, -69319, -44735, 36121, 68640, 226, -36381, -1449, 15676, 4518, -15447, -39374, -27544, 40147, 35165, 5024, -10034, -15790, -14857, -17531, -60089, -38082, 8885, 32301, 19641, 67003, 76883, 62028, 47341, -10622, -10010, -12773, -31847, -18451, -22175, -33014, -34610, 11657, 14432, -18559, -37469, -98231, -80554]
20235h0554P4356P815p8009o6945J7876K4691n044Q901R739n713l1466K8477L3166
20222f2710M2647M4888L2869j7923m7558p46J7726k3208l9214R617l306l7764
20210h4682K0177J2387J7178k3715l4081J3469K6092l8436P776Q0845K0861R88
20198A8859j5386l1990k5612K7390J2699j740r78k7050L9816J6949o9479R566
20186d6956J8708j4116j5281l3212L1552N3498j5622K11q059j0401M2981J0902
20174A4205m0081k6924J7902L8233R993L9801n382j9023m047l6841K1022K6162
20162C5020k6931m3101j3747n523N953K1252L8608L026L113l6069n8088J7119
20150e9368K9477p891J8116L6811q734j9226K5809l478k7840p854m8722o000L9800
$$ y = [-80554, -6198, 1617, -76392, -143337, -125461, -100770, -105814, -96913, -87174, -92887, -124353, -95876, -62710, -20063, 24825, 57694, 39771, -7787, -8533, 9193, -14015, -53229, -43612, -46918, -84682, -64505, -52118, -34940, -58655, -92736, -79267, -53175, -91611, -83835, -2990, 17871, 18859, 3473, -28517, -54129, -26739, -14040, -15780, -16758, -43808, -3992, 12957, -56522, -46956, -28248, -42364, -57645, -90857, -59305, -5807, -21429, -21218, -29277, -39678, 3303, 14205, -25876, -52800, -34898, 3335, 13328, 53129, 47747, 28724, 24677, -12164, 8858, 35020, 8089, -35012, -48759, -54282, -48329, -27077, 11531, 14557, 17670, -18399, -76487, -59368, -29891, -37782, -19666, 17145, 8411, -10815, 14994, 11516, -16324, -24178, -72900, -78900, -39100]
20137c9100k6763L3321N804O302p77M2446K3907p1681j046K2821l2917l2241K521
20124f7403L4611N2938M4519k2760m7981k9918K4188O2021j4435K5509N5488p0117
20112D6660m5320j9959j437J7291n503j0152J7069N3387K8359l3432j9738K2346
20100D9571L7942o261K0307j1784j5238m6177m6285j2172l4173M836L4908L2972
20088H446m4762o3648j1848l701O3405K6371j8745m4214K1484N8610M2714k803
20076C1309n6874l4406q0984K0329O0451J6046k162M7930K0049O382p0994o208
20064d9132K3587j6043K4469j0728J542o736j4617O550K3953J1326k8572M8351
20052A3950k3585R776j7305L4541j6412o7194k2652O0269O0135L6596j9864J3891
$$ y = [-39100, -65863, -32542, -26738, -20436, -21213, 21233, 45140, -26541, -27587, -4766, -37683, -69924, -67403, -32792, 20146, 64665, 41905, -6076, -35994, -11806, 50215, 35780, 61289, 116777, 46660, 1340, -18619, -20056, -2765, -8268, -18420, -1351, 52036, 80395, 46963, 27225, 49571, 87513, 81252, 101559, 89775, 74537, 28360, -17925, -30097, -64270, -59434, -24526, 8446, -36316, -99964, -111812, -115513, -52108, -25737, -44482, -88696, -67212, -8602, 34112, 31309, -25565, -59971, -140955, -120626, -60175, -44129, -46291, 1639, 21688, 28070, -42924, -49132, -25545, -41588, -17119, -27847, -26305, -33041, -47658, -41108, -17155, -5829, -34401, 13950, -9635, 141, -17164, 17377, 965, -66229, -88881, -28612, 31523, 68119, 48255, 62146]
20040F2146k9822k2566M9853R922O705l1253l3372j2948P500r796q1469l768R8745
20027I877L8203j1511m0006q547K9810L6147M8835n0906L188J7484j0982n7073
20015D519m4173N549M0302j9649J6102j586L8110M545o1598l5242j22k0130L907
20002f9466K7797K5999m0675J469k086K2819L2010k5990j6982o5212L904J3063
19990i3350m006K3275O3852l150m0466L7141M9086K3795k8830m6726J5447l266
19978g198J0939l2164l8546J1543J6653J3165M8459m0071k1373L9745K1951O6358
19966H9461N396l4384o991n7020j1189n145O6444N4965N2603k4976o0973L7589
19954A05780j3355J2384o8774q1985q4241N5392L9625K882K5640k8516K2763p525
$$ y = [62146, 32324, 9758, 59611, 69533, 76238, 44985, 11613, -1335, 6165, -3631, -85100, -88868, 9877, 48080, 36569, -3437, -11984, 17826, 53973, 102808, 51902, 55090, 72574, 61592, 4519, -39654, -34105, 6197, -13452, 2650, 1064, 39174, 43719, -17879, -53121, -53243, -73373, -69466, -41669, -15670, -56345, -54876, -56962, -34143, -2133, -28123, -45105, -110317, -106413, -93350, -97356, -74081, -10229, -13379, -53845, -16704, 32382, 56177, 27347, -19379, -3932, -7198, 3741, -28423, -66969, -55426, -38773, -25608, 22851, -17220, -38593, 1152, 23103, 89461, 94857, 60473, 53482, -3538, -14727, -19872, 46572, 101537, 154140, 129164, 68191, 105780, 92425, 104809, 36035, -45950, -130191, -74799, -35174, -32292, -6652, -35168, -12405, -19930]
19942a9930L2242K8948k6402l7486m6864n28n5468k8387L0013L8728L4503P3400
19930B2769M8907n8125l7707J1763j2551K192O3677L2074q529o1949n1528n541
19918e4548O3779K977R574Q751j3524K9513n606r795M503L9824j3691n683K9647
19905H5721J585P893j4679k535J0453m7544l613N027j4166k9381m2124K1663K1750
19892E0l9468R069M55k0077K4060M3667l1064q6170j8997J8381j0598K1180k68
19879h9780N4244N3272l4103K2252J9735j4656j2733M0270N0439J1108K5020j8878
19867A06190l2985K5n5996k3333N9098N9653j9435n900L0875Q881O1652k2017
19855A66708l7291M5418K8325k2006q487J9632r1270m8853k1834r347k0066j0860
$$ y = [-19930, 12312, 41260, 14858, -22628, -69492, -70020, -125488, -153875, -123862, -85134, -50631, 22769, 71676, 13551, -24156, -12393, -24944, -22752, 40925, 72999, 64470, 2521, -49007, -54548, 9231, 12208, 21782, 30533, 17009, 46522, 40916, 31121, 35624, 75448, 61757, 56074, 85721, 87306, 95199, 80520, 77985, 88438, 40894, 37281, 42308, 28142, -1239, -43363, -21700, 50, -39418, -30349, -29894, -49971, -25911, 17756, -13308, -99478, -118475, -100094, -110692, -89512, -89780, -35536, 17736, -16367, 5885, 25620, 10964, -1769, 38501, 88940, 100048, 125068, 106190, 73205, 73230, 17234, -6099, 52999, 112652, 93217, 87317, 118192, 127073, 188725, 166708, 129417, 174835, 203160, 181154, 172667, 192299, 101029, 52176, 30342, 20995, 929, -9931]
19843i931N2121j078K2928M3142L3212p0127j2069j4414k9533m095j1742K5165
19831B3579L0608l9986m264K210R949J800r069K4940K3275P368O213l9638k4555
19818A2430j1196l9583l218j4513M737R850j3137J702j5857K0368N9731K3379
19806C4693K374j368J7717q566K4282J8318l6333k9362l306n6207j3402K9422
19794b1738j1130q893j860k1009K0431N0634O831m2979J2188J5589K8617N290
19782C1971o0244P894J2468K5702n048l236J0693M0482N073J8684O003q6579j21339
19769a17476J816L3292M3110K7696N5596M0035J5706K0879o9635r1844M0591l9156
19757c9390l2942l3493M851K3722R1414Q790o7463m4978k0500L3413P5576R61
$$ y = [-9931, 42190, 41112, 64040, 107182, 140394, 70267, 58198, 43784, 14251, 10156, -1586, 23579, 54187, 14201, 9937, 12147, 22096, 23896, 14827, 39767, 63042, 70410, 76623, 36985, 12430, 1234, -38349, -41567, -56080, -51343, -41493, -54630, -52928, -68785, -48417, 11314, 34693, 37067, 35699, 53416, 44850, 69132, 87450, 51117, 21755, 18449, -37758, -51160, -21738, -32868, -41761, -43621, -64630, -44199, 6435, 13266, -29713, -17525, -1936, 26681, 31971, -28273, -20379, -7911, 17791, 12743, 9507, 20200, 60682, 65755, 84439, 90442, 3863, -117476, -115660, -82368, -39258, -11562, 44034, 84069, 99775, 120654, 51019, -40825, -234, -39390, -72332, -105825, -100974, -77252, 14162, 22952, -44511, -89489, -109989, -76576, -1000, -39]
19745c9o7676K3368L0849j445k5816l0818K874j723N9722m879J312l0142m909
19732d9322K6152o6278N221N3614N2158J3746k8156p0865k8463L4252M4855l9550
19720e2636j1718K5253K1410J4038J0903L3224J8946J507L3400m3762p1913j2410
19708c3758J4835j1209j9287k1315k6837K7461l6191L3660M7152K4322q517j8906
19696b8590K1774n6671j3150n249k0633M4372L7219q095k2936L465j2664K0165
19684d0993L8762O5932j1510j7337N488L2711N846m2746j2888k6088r3998j4508
19672a11329Q2152M5130M2646K0317j89p9251m0158k3764m6011j4283M5558Q1025
19660A843M70k9644L9232P9315j645L2816p3577p6616L4176k1854n1819m9569
$$ y = [-39, -67715, -44347, -13498, -14943, -40759, -71577, -68703, -70426, -10704, -15583, -14271, -44413, -49322, -23170, -89448, -84227, -30613, 21545, 35291, 7135, -63730, -92193, -57941, -13086, -52636, -64354, -39101, -17691, -3653, 7250, 40474, 59420, 60927, 94327, 50565, -21348, -33758, -18923, -30132, -49419, -70734, -97571, -70110, -106301, -72641, -25489, -1167, -9684, -28590, -6816, -63487, -76637, -81886, -102519, -58147, -20928, -29023, -51959, -48494, -61158, -40993, -2231, 63701, 52191, 34854, 40342, 73053, 78899, 36153, 23265, -2823, -96821, -111329, -29177, 15953, 58599, 78916, 78727, -524, -40682, -64446, -110457, -124740, -79182, 1843, 2313, -27331, 11901, 91216, 89571, 122387, 48810, -27806, 6370, -15484, -67303, -116872]
19648a16872l85R792M6246Q8069O8251m6685q4273p9161m1471L2279O145K9432
19636h8633P0520L2594M5411J1915L9542N357k0285o9326q2072K0075J575j1652
19624d4979j652J4702O1804O4106m061m292r661n2569k7182K9319M554J2300k094
19611D0295j6401j5727k1421P382o0093p1085Q312J9604M0197k3653Q770N4990
19599b8830k6262K4941P5840k3777k273R2215L7228q3442r5083n532K3360l550
19587a5165l3028N4046K0493m4289O05K1255n6523j2066m1616O633P0577K6893
19575b185j359l5386L2227K6709o029j2441k2164N315K9878Q32k0480J4034j1538
19562b587j4533k394R263j68L7082q561N1614J4557m8168p7898j6001Q4870M2133
$$ y = [-116872, -117257, -107465, -61219, 26850, 95101, 48416, -35857, -115018, -156489, -124210, -118065, -88633, -18113, 14481, 59892, 71807, 111349, 116706, 96421, 27095, -54977, -34902, -33327, -44979, -46631, -31929, 29875, 93981, 89920, 85628, 75967, 23398, -3784, 25535, 30089, 42389, 40295, 23894, 8167, -13254, -5872, -65965, -137050, -128738, -109134, -68937, -92590, -83820, -28830, -55092, -30151, 45689, 21912, 19639, 111854, 149082, 65640, -29443, -34975, -11615, -15165, -48193, 5853, 26346, -17943, -17338, 3917, -52606, -64672, -106288, -99655, -29078, -2185, -3544, -38930, -6703, 20006, 13977, 1536, -20628, -15313, 14565, 15397, -5083, 8951, -2587, -17120, -19514, -10251, -10419, 26663, 18102, 69716, 84273, 36105, -41793, -57794, 27076, 69209]
19549F9209k9269l5018p96L157j1728O716Q363K5682M9678K6503K0529m8298k4985
19536E9743j4702o790j3527n405J8505J9952P019l5155Q742j5541J3064J95m6049
19523i949K9751L2365J3967n122M773k2809N393m7702n5131l638n107q831L0112
19510d1928J7952L0661N2648o768l1179P018M4506q5896K8134M0229J6914k1066
19498E1225n6972n4348J5456J8325N7721J505k74L4343N907M9189j7327l8437
19486F6313q0048J6650m3604Q926Q0996J3240K0756m1085m0778k094O052k0424
19474a5100J4512j434M231j1662j306L5732j050J7734l081J3275J0207j710L9502
19461I9850j588p9409j8517K7780J9948J9214k0640j0818R685J3425k5533j2749
$$ y = [69209, 39940, 4922, 4126, 7283, -4445, 2271, 10634, 36316, 85994, 112497, 133026, 84728, 59743, 45041, 38251, 24724, 19319, 37824, 57776, 64795, 29640, 38382, 22841, 35905, 36100, -9949, 19802, 52167, 66134, 61012, 65785, 42976, 48369, 667, -54464, -58102, -63209, -72040, -41928, -23976, 6685, 59333, 52565, 21386, 28404, 72910, -12986, 15148, 55377, 72291, 51225, -5747, -60095, -44639, -26314, 31407, 32912, 32638, 66981, 72888, 122077, 104750, 66313, -13735, 2915, -40689, -31763, 49233, 62473, 83229, 42144, 1366, -728, 5324, -15100, -588, -2022, 2209, -9453, -10759, 24973, 23923, 41657, 38576, 51851, 62058, 60348, 99850, 98262, 18853, 336, 28116, 48064, 67278, 46638, 35820, 45505, 58930, 33397, 20648]
19449B0648L575r999m020l724k2437L3929p102K6486N5355p7910l6636K5892N8383
19436F2440O6442k5716n8152L8983L2391n7149k4638J299k7585j7748N0323O0144
19424A01034O7163M721K886n9171j0781p4083k8962R40p478j7926l7428O7934
19412H849P3360n184M5798r70m7001o6899j1308K4224L1652j1796n700j2900o1812
19399c9687k7341N6735L6399M1211M0891k0859l4090j4299P658L2073l786n923
19387F8982N5258N0144m4752p4443j4701J1335o479K8449m5222k8149M4374J4861
19375E9657r076K9787P0534q210K1745J0123k8804m1003p5058k8986j8820L162
19363a4949M9724K2460n0316j3970m0857l5988L5872L0357k1496K2429j1138j9428
$$ y = [20648, 24223, 14224, 10204, 6480, -15957, 17972, 10870, 37356, 92711, 14801, -21835, 4057, 62440, 128882, 103166, 45014, 83997, 116388, 59239, 34601, 35900, 8315, -9433, 40890, 101034, 168197, 172918, 175804, 116633, 105852, 31769, 2807, 3747, -3731, -21657, -59085, 8849, 82209, 77025, 122823, 121853, 74852, 7953, -3355, 20869, 52521, 40725, 35025, 22125, -39687, -67028, -10293, 26106, 67317, 108208, 87349, 53259, 38960, 46618, 78691, 74905, 68982, 124240, 174384, 129632, 55189, 40488, 51823, 45344, 73793, 28571, 422, 44796, 59657, 50581, 80368, 150902, 142692, 164437, 174560, 145756, 104753, 29695, 709, -18111, -14949, 34775, 57235, 6919, -7051, -47908, -83896, -48024, -17667, -39163, -16734, -27872, -47300]
19351d7300P439P914q102J0726K7376K8575K1435m3814l0690k6707K5419K7966
19339B37m78K3621o920K9713M7152J5308J0968J2590J5640J9629L0560j1660n6497
19326A29863j06060l4369L5663P1951K9197J1442j5757o940J2482l066J3577o3876
19314G4107K031M4565k7905k6125m0906k4266M988M6743J7362o0918l3058Q2834
19302E9452J4455P035l5141p613N1451j0942l5397L2690M3630k4249l2886j131
19290F1354N1255O263k5023J8709N8526k2861l1625l1308n5165m9026k0216J7484
19278b1633L1741L5225o3936J5154N4647J1997Q018l1405l3845J3581l9976K9871
19266I439K3558J0739j6818l9379m4919j425j3123k0379N5759L6104R279J565
$$ y = [-47300, -39861, -31947, -40049, -29323, -1947, 26628, 48063, 4249, -26441, -53148, -27729, 237, -241, 23380, 16460, 46173, 93325, 108633, 119601, 132191, 147831, 167460, 198020, 186360, 129863, 23803, -10566, 25097, 97048, 126245, 137687, 121930, 114990, 127472, 124406, 137983, 74107, 76138, 120703, 92798, 66673, 25767, 1501, 6489, 53232, 70594, 9676, -23382, 59452, 73907, 80942, 45801, 38188, 89639, 78697, 43300, 75990, 119620, 95371, 62485, 61354, 112609, 118872, 93849, 112558, 171084, 148223, 116598, 85290, 30125, -18901, -39117, -21633, 10108, 45333, -18603, -3449, 51198, 63195, 71213, 39808, 5963, 19544, -20432, 9439, 32997, 43736, 26918, -12461, -57380, -58805, -71928, -92307, -36548, -444, 8835, 10400]
19254A0400K5384j9291O00M3090n279n2769j8642M6199m4J1435R81l2853M6824
19241E6035l7046p541l481jO1053p269J4377K7210p1502k5956O571K8335J5805
19228E6590J0427m1019J6101L6292R069J2098L6745Q7l619p285k4871K5325L1365
19215A57305m9721p529M1310P0894J6220L3211k0159j5957r596L233L5268M2667
19203B97146N4041J24388J80322K95308M81000M96998M33106K23531L8161k06519
19193B417482m16045m92013l78259k58664j18278k0439J02697L21594M81655M25991
19183B065721L20440J69039k98k36488m53062n04396l62797k64593j77804j32950
19173D22812n3380o3660l5357N637q075m0407J8309L7754K475n331o0111p0950
$$ y = [10400, 35784, 16493, 17093, 60183, 54904, 2135, -16507, 29692, 29648, 41083, 42064, 9211, 56035, 18989, 11448, 7967, 7966, 69019, 61750, 76127, 103337, 31835, 5879, 12450, 40785, 56590, 67017, 25998, 42099, 78391, 87460, 99558, 136303, 136390, 132771, 125486, 100615, 125940, 157305, 107584, 100055, 141365, 212259, 228479, 261690, 241531, 225574, 215978, 219211, 254479, 297146, 351187, 475575, 655897, 951205, 1432205, 1929203, 2362309, 2585840, 2624001, 2417482, 2001437, 1509424, 1131165, 872501, 754223, 733784, 836481, 1158075, 1639730, 2065721, 2386161, 2555200, 2554902, 2318414, 1865352, 1360956, 998159, 733566, 555762, 422812, 369432, 305772, 270415, 276052, 267977, 227570, 245879, 283633, 286108, 280777, 220666, 149716]
19161A49716j5244L424N154J1340k3023r7005j9532k6334K4318P3565J7300l8374
19149F5305l319m7050L561K3439J954l9107O860p27L7809L4820O441k0752l8606
19136C0628J2326L0222L7507L2859k0335n6193n5739j0858p215M3479L184q898
19124C0967l5831J0048j5687K4189j3203K435N887L3481N3384l6583j6376J0611
19112E3322L1887N3856K3393p120n6547o2299j2713j7684N8717N7213m3560n9047
19100A9418m7516p9681j9583O9125P3415p493r073K2587k9224M1521L4870o1183
19088G183k4158p931O315J657j0245M8207K3212L3580k2257m4106k5659J6517
19076B315M7929J6109j4497m3442K5980M6171L5192j7771J0045k7318K637j5101
$$ y = [149716, 134472, 137896, 143050, 154390, 131367, 34362, 14830, -11504, 12814, 86379, 103679, 65305, 61986, 14936, 18497, 41936, 43890, 4783, 11643, 10916, 48725, 83545, 89986, 69234, 30628, 42954, 73176, 110683, 143542, 123207, 67014, 11275, 417, -6798, 36681, 39865, 30967, -4864, 5184, -10503, 13686, 483, 2918, 8805, 42286, 95670, 59087, 42711, 53322, 85209, 139065, 162458, 155338, 98791, 36492, 23779, 6095, 64812, 122025, 78465, 19418, -28098, -107779, -127362, -58237, 15178, 7685, -1388, 21199, -8025, 33496, 68366, 7183, -16975, -24906, -18591, -16934, -27179, 21028, 44240, 77820, 55563, 11457, -14202, 2315, 50244, 66353, 51856, 8414, 34394, 80565, 115757, 97986, 108031, 80713, 83350, 68249]
19064F8249p2898r5175j2287J7789N9799K5905N38L2114Q349J4700l0258N039
19052B1864P644N0538N486J3204Q749n2310o7992J150L5879j029n319L2385J6046
19039F6295j9241k0632L5087k8914k5857n6737J62P6028q844k2245O5421P7658
19027A38181O1961L7593n757k7908o0108m7083p546M3921K2200j6016o01l5411
19015A03426o4490m8915P4910O2066J1216k2500k1296r8303k9751l978p784j4168
19003e9567L1823J6551N071K6355J6778L4094K761q62o1637Q311O2838l9292k2045
18990B1179P04J1101j7352M187j8813k3628K2190N3244N8708J6675o2830J7949
18978H3314N79J0343P987K5637M6788N2243M203o289j1654o4379J3419j7635L3285
$$ y = [68249, -4649, -99824, -112111, -94322, -34523, -8618, -8080, 24034, 32383, 47083, 16825, 21864, 29508, 80046, 85532, 98736, 107485, 55175, -12817, -11667, 24212, 23183, 17864, 50249, 66295, 47054, 26422, 61509, 32595, 6738, -49999, -49837, 26191, 17347, -4898, 60523, 138181, 200142, 237735, 231978, 204070, 143962, 96879, 89333, 133254, 155454, 139438, 138837, 103426, 38936, -9979, 64931, 126997, 138213, 115713, 94417, -3886, -33637, -37615, -45399, -59567, -27744, -11193, -6122, 20233, 37011, 71105, 73866, 73004, 11367, 19678, 82516, 43224, 21179, 21883, 32984, 15632, 19819, 1006, -22622, -432, 52812, 111520, 128195, 65365, 83314, 83893, 94236, 102223, 127860, 174648, 226891, 231094, 224805, 213151, 148772, 162191, 144556, 177841]
18965A77841k6815n6056l9489k1057P906K8467K9778L0193M8236L4540J3985k305
18953B25224J1715q265L9933j170l7769m4398j4282J3527m2303K8987K6923l1550
18941A66572j1496j1844j1037N2990O756N12j9145l7920l8851J7405l1404j9023
18929F3515J4160M1940O6056K1926M609J5043j0837k0078o7217J5820O10M59O2230
18916B08236M5125j9752j1290P103K082J0434L6616L4403n2929l2079M3882j8388
18904B53443J9852L5641k0738j9692n3561R801J1706K3007L490P0712j0461o218
18892C16982Q6433K7001J4470N520N3131P4143K1584l8818m9838L6251j2604r531
18880E24724N6860L6469N2599q041k7165n8812q031p5856N34J6088l2910J5355
$$ y = [177841, 151026, 94970, 55481, 34424, 42330, 70797, 100575, 130768, 179004, 213544, 227529, 225224, 236939, 228674, 268607, 267437, 229668, 185270, 170988, 184515, 142212, 171199, 198122, 166572, 155076, 143232, 132195, 185185, 191941, 192453, 173308, 135388, 96537, 113942, 82538, 63515, 77675, 119615, 185671, 207597, 212206, 227249, 216412, 196334, 129117, 144937, 145547, 146006, 208236, 253361, 233609, 222319, 229422, 231504, 241938, 278554, 312957, 260028, 227949, 271831, 253443, 273295, 308936, 288198, 268506, 214945, 224746, 236452, 259459, 262949, 333661, 323200, 316982, 403415, 430416, 444886, 450406, 503537, 577680, 599264, 560446, 510608, 546859, 534255, 524724, 581584, 618053, 670652, 662611, 635446, 576634, 568603, 492747, 493281, 509369, 476459, 491814]
18868D91814o3311p957O1596l7412O725j4089j9205k6612m1560K0323P948p5046
18856C03214m4242J3545J8312K8039o186p350k96J5712k6261k2118j7954o1704
18844A92711K022J0087L9652M421j0082K3864K2193p37L4540l2438j6249k2650
18832B47334l6752n822j4934k4982j3619N2113N5741p106j9473R4908J73096P9222
18820E79726m4748J8942K6395J9958j31324j27753p8062P61Q1534J830K5847N9103
18808D32209R1136K0667n3362P1002j2884n5599r3066k5592K7827M0856J7375
18797D60569K5675m3410m1794J0818l1168k9152j01270k9924K3492K4972l3124
18786B35684O1231O0618P8498N622P589K5826l6957n8642m766m0457n0752j1518
$$ y = [491814, 428503, 420546, 482142, 444730, 451455, 437366, 418161, 391549, 349989, 370312, 378260, 303214, 258972, 272517, 290829, 318868, 312682, 305332, 305036, 320748, 294487, 272369, 254415, 192711, 194733, 204820, 244472, 248893, 238811, 262675, 284868, 284131, 318671, 286233, 269984, 247334, 210582, 204760, 189826, 164844, 151225, 203338, 259079, 251973, 232500, 327408, 500504, 579726, 534978, 553920, 580315, 600273, 468949, 341196, 263134, 263895, 345429, 347259, 373106, 432209, 523345, 544012, 490650, 561652, 548768, 493169, 400103, 374511, 402338, 443194, 460569, 486244, 442834, 401040, 411858, 380690, 351538, 250268, 220344, 243836, 268808, 235684, 296915, 357533, 436031, 441653, 449242, 475068, 438111, 379469, 374703, 334246, 283494, 271976]
18774B71976K188J413m520M8548M6556N0765J21500J30397P0471q7843j32130
18763E19321n1333n0690m3807K22K1517J7421k0317K7479L9468j0197q1629r4064
18751B73391q7691K6550J1250k9685N502J9088O6224N6855J09277j4367q9902
18740C46492j20708n0926j5384J0521k662N9725P375o9788l3527M2342N6405J8347
18728B48212K9432j9947k3211k041K8303J07215J27706J88537K29565K38848K02684
18717A355303Q1709R6350J62218J72150O3732j09526j92850r7954j5637j02020
18707A413475k40481k58742j78773q4194l1895J089K1307k5528j9883k3429o0690
18696E12256p4141q4581J0514J00075M1026K6480M5552K3898k4470m254k1208
$$ y = [271976, 274164, 275577, 271057, 319605, 366161, 416926, 538426, 668823, 739294, 651451, 519321, 467988, 417298, 373491, 373713, 395230, 412651, 392334, 419813, 459281, 449084, 367455, 273391, 185700, 212250, 223500, 193815, 199317, 218405, 284629, 341484, 450761, 436394, 346492, 225784, 174858, 159474, 169995, 167333, 227058, 234433, 164645, 131118, 173460, 229865, 248212, 277644, 257697, 234486, 232445, 260748, 367963, 495669, 684206, 913771, 1152619, 1355303, 1437012, 1533362, 1695580, 1867730, 1931462, 1821936, 1629086, 1531132, 1515495, 1413475, 1172994, 914252, 735479, 651285, 619390, 620479, 641786, 616258, 596375, 572946, 512256, 438115, 353534, 364048, 464123, 505149, 531629, 577181, 601079, 576609, 572355, 551147]
18685E51147L109o97j9653j7072L1021N6382j6218k0106O2777O2524p32m7695
18673F44787R253O3688N2705Q6796J50454J56304K00375K57230M73644M64405
18663B559641K58751J31818M4604k8440j24503j08621j86269j65374p4315k7618
18653B279674o8654o3794m7931j166k7285o3804r8540j64814k07470j55862j65631
18642A214723j31103o3133j7497n8852l4836n1129K446j8615M228l2201J19005
18631I33036N3906J8958K3383M6222O6723Q5146J03425Q9843j4317K684M0140
18620A449149M48l2634L213M3939J65120J02681R0598J12731J11332J53913K31349
18609B431839M12898N31368M76081L87331K73925N2637j23353k49804k63447k29644
$$ y = [551147, 554256, 553559, 533906, 516834, 547855, 604237, 588019, 567913, 630690, 693214, 692482, 644787, 654040, 717728, 770433, 857229, 1007683, 1163987, 1364362, 1621592, 2095236, 2559641, 2818392, 2950210, 2994814, 2966374, 2841871, 2733250, 2546981, 2381607, 2307292, 2279674, 2211020, 2147226, 2099295, 2098129, 2070844, 2007040, 1908500, 1743686, 1536216, 1380354, 1214723, 1083620, 1020487, 1002990, 944138, 909302, 858173, 860619, 842004, 846232, 814031, 933036, 986942, 1005900, 1029283, 1075505, 1142228, 1227374, 1330799, 1420642, 1406325, 1409009, 1449149, 1449597, 1416963, 1420176, 1464115, 1629235, 1731916, 1822514, 1935245, 2046577, 2200490, 2431839, 2844737, 3376105, 3852186, 4239517, 4513442, 4566079, 4442726, 4192922, 3929475, 3699831]
18599C699831k7151R3221K25559M40026P23788J005755J192929J225141J149401
18590I728500Q58625O15372L59271Q9353j23936k3131L0400J61562M80358R03289
18580A3079663J491526K147810K774434L298430M079598N225941O927247R767848
18572D8792497J5233910K5634056M5230041P5975445R4592588Q4329086N5728243
18565D45515866J9429845k1143067o3722338q5246715p8162882n5290441k9068470
18558A32311798o964970J3832192M1001664P5664750R0133964P6586388M5188673
18551D67754459P723139l4185708p6466444r2318086q2558470n9509911l7149869
18544I3289110k2566044j4573303j0060348p306545n506262m365572l532089k851141
$$ y = [3699831, 3672680, 3765901, 3991460, 4431486, 5155274, 6161029, 7353958, 8579099, 9728500, 10587125, 11202497, 11561768, 11651121, 11527185, 11504054, 11534454, 11696016, 12176374, 13079663, 14571189, 16718999, 19493433, 22791863, 26871461, 32097402, 39024649, 48792497, 64026407, 89660463, 134890504, 210865949, 305458537, 389787623, 445515866, 464945711, 443802644, 380080306, 294833591, 216670709, 161380268, 132311798, 125346828, 139179020, 180180684, 255845434, 345979398, 422565786, 467754459, 475477598, 441291890, 364825446, 272507360, 189948890, 130438979, 93289110, 70723066, 56149763, 46089415, 38782870, 33276608, 28911036, 25378947, 22527806]
18536B2527806k190308j591917j089848q07899o94008n89948n83722p33276q47906
18527A3398974p60722n67002n79321o46506p40195p48994q60267j045786r29075
18518F521106p89781n89247m25544l33780j33141J11402K24553K26443J65255
18509D977266L9291j65951m53788n72791n41680m85747l25931k37021j89829q8179
18499A955640o5037o1948n1123q7995j13671q9860p3232r5601p9054J339k0265
18488A219193j0286J1340m9485q708J5713n6767n2794j5890k8887q3108r4855
18477H45466o6323L432J9490J1693L4009J4986K7887o315J3510k1345k4584l971
18465H47935L076j4054m7601j7909n852k7529j29348n4292M3965R4513M9278j6120
$$ y = [22527806, 20337498, 18745581, 17655733, 16847834, 16153826, 15563878, 14980156, 14246880, 13398974, 12638252, 12071250, 11491929, 10845423, 10105228, 9356234, 8495967, 7450181, 6521106, 5731325, 5142078, 4716534, 4382754, 4249613, 4361015, 4585568, 4812011, 4977266, 5016557, 4850606, 4396818, 3824027, 3282347, 2796600, 2470669, 2233648, 2043819, 1955640, 1890603, 1828655, 1777532, 1689537, 1575866, 1486006, 1412774, 1317173, 1238119, 1239458, 1219193, 1208907, 1220247, 1170762, 1162054, 1177767, 1121000, 1068206, 1052316, 1023429, 940321, 845466, 779143, 782575, 802065, 813758, 847767, 862753, 890640, 884325, 897835, 876490, 851906, 847935, 851011, 836957, 789356, 771447, 765595, 738066, 608718, 554426, 598391, 692904, 742182, 726062]
18453G26062n0088P053o2682m9469j9975K3550k5115m6903n7002k8701j7586N3414
18441D52558K6961n727q92M8208K5941j4141n0605k4507M7162L7054l4065o7468
18429D40479k4890M3770O0579O0924J6112K434m2180l9636o6899k2768M0617K8836
18417D97378o0254K8794J0158o6175O7422K8680o513M5869M59k1686K5331M5055
18405E94518J9979m7281j5591M3125J16254J44271J6798k1079L777O9663o9431
18394H55003o3515n327M9350M5230K2012M9136M4838O974k5974l2523L8822J9136
18382A003162k5562m7561j0057n1583o9747j19055j10937j11173j24741n9896
18372B72850L8376Q8533N1741J1744k5584m3302m983m5711q1983k2254l1219o3913
$$ y = [726062, 675974, 683027, 620345, 570876, 550901, 574451, 549336, 502433, 445431, 416730, 399144, 452558, 479519, 473792, 472900, 521108, 547049, 532908, 482303, 457796, 504958, 542012, 507947, 440479, 415589, 459359, 519938, 580862, 596974, 599408, 557228, 517592, 450693, 427925, 468542, 497378, 437124, 465918, 476076, 409901, 477323, 506003, 499490, 545359, 545818, 524132, 549463, 594518, 614497, 567216, 551625, 594750, 711004, 855275, 872073, 850994, 854771, 924434, 855003, 791488, 786161, 835511, 880741, 902753, 951889, 996727, 1003701, 977727, 945204, 984026, 1003162, 977600, 930039, 919982, 868399, 798652, 679597, 568660, 457487, 332746, 272850, 311226, 399759, 451500, 463244, 437660, 394358, 389375, 343664, 261681, 239427, 208208, 144295]
18360A44295o3279L5568R8441K3442K7301K8925p679k1188q336n127K7574j7748
18348B62189O9823l6842M5484Q5299Q2543Q4350J5821m7402l4278j2832K7203
18337E41358N461L2943J16893J32765R9625J14279P9052L7040O912N7796k7946
18326A196178j20292n6809p8074j08790q6413m3988o7221r3895o9992o963J3594
18315D77335m184o2507k986M3254K6307o23J4576L3628n862o8910q8637k9711
18303C31680m403j6973L5399J04305M3364l0062M2180J3072r7660J702K5234l8081
18291D09757j3452J2570l9314M0391O4546K2051O4734L6617l7421M3176N0077
18280F53732l1661m5349r403O8394N4757J436J3092k1096M1498K2005k3609l4204
$$ y = [144295, 81016, 116584, 215025, 238467, 265768, 294693, 287014, 265826, 257490, 252363, 279937, 262189, 332012, 295170, 340654, 425953, 508496, 592846, 608667, 561265, 526987, 514155, 541358, 546819, 579762, 696655, 829420, 929045, 1043324, 1122376, 1159416, 1166328, 1224124, 1196178, 1075886, 1019077, 941003, 832213, 745800, 701812, 634591, 540696, 470704, 463741, 477335, 473151, 410644, 407658, 450912, 477219, 476596, 491172, 524800, 518938, 450028, 361391, 331680, 327277, 310304, 345703, 450008, 493372, 463310, 505490, 518562, 420902, 422604, 447838, 409757, 396305, 408875, 369561, 409952, 474498, 496549, 561283, 597900, 560479, 603655, 653732, 622071, 576722, 567319, 635713, 690470, 691906, 704998, 683902, 725400, 747405, 723796, 689592]
18268F89592P192L384K9645L2772J0649J6380P4083Q2415N4730O3347O3856P2909
18256A200954L4976R688K6628P0575j8437p7880l851J461N3677J22101J17201
18245A537093J05503J67503J78024J72960J25131J32308J27245J55774J21433
18236B822974P5503J70375L69471L86394K56893J16785K06947L34178K90726L01602
18226E331848K42816K92139N72477O72653N44591M85582O72691Q72044J142986
18217A0829827J475553J800547K142726K756859L788420N425761P990251J2803022
18209D9012966K1939055L7508879M9063880L2849403J4757265J6306190K7108263
18202B48545901K1859151J4980771p005068k5295676j9461039o481373j6949144
$$ y = [689592, 696784, 700168, 729813, 762585, 773234, 789614, 863697, 946112, 1000842, 1064189, 1128045, 1200954, 1235930, 1245618, 1272246, 1342821, 1324384, 1246504, 1242653, 1244114, 1297791, 1419892, 1537093, 1642596, 1810099, 1988123, 2161083, 2286214, 2418522, 2545767, 2701541, 2822974, 2898477, 3068852, 3438323, 3824717, 4081610, 4198395, 4405342, 4739520, 5030246, 5331848, 5574664, 5866803, 6439280, 7111933, 7656524, 8142106, 8814797, 9686841, 10829827, 12305380, 14105927, 16248653, 19005512, 22793932, 28219693, 36209944, 49012966, 70952021, 108460900, 157524780, 190374183, 205131448, 221437638, 248545901, 270405052, 285385823, 278380755, 253085079, 233624040, 227142667, 210193523]
18195B10193523l5620177m3587553l8748935k6454690j6231839j0229204o893357
18188C2427768m828886l337992k414753k034185j815716j536055j051900o13832
18180A4794449n95594n96952m13668l84313l22989j55261j74028k89984k47719
18171A1613941m4241J626J88432L76900J91425J76597M89246Q11874J070753J504633
18161A6381186J962762K384542L154405M411262O420334R644845J5733648K7253728
18153H7346712M5338892N3747860L1322895J5225958K0405656L0450393K2398123
18146C06236489J3827658j3664468k8563083j8866862p057536k3794763m2436427
18139A85681008m8987394m1054498k7134133j6586812j0609825p330152n181172
$$ y = [210193523, 174573346, 130985793, 92236858, 65782168, 49550329, 39321125, 32427768, 27598882, 24260890, 21846137, 19811952, 17996236, 16460181, 15408281, 14794449, 14198855, 13601903, 13188235, 12803922, 12480933, 12325672, 12151644, 11861660, 11613941, 11569700, 11571326, 11759758, 12136658, 12328083, 12504680, 12993926, 13805800, 14876553, 16381186, 18343948, 20728490, 23882895, 28294157, 34714491, 44359336, 60092984, 87346712, 132685604, 186433464, 217756359, 232982317, 253387973, 283838366, 306236489, 320064147, 306399679, 277836596, 258969734, 251912198, 228117435, 185681008, 136693614, 95639116, 68504983, 51918171, 41308346, 33978194, 28797022]
18132B8797022l735130k845147k333414k054257j746324j239164q42836q30106
18124A3170644q67873p44391m51145l10347k12103j77215j19097J19754N97512
18115A1005739R37952J482749K894347N706126J1508850K2703891L1307878J0999731
18107I8547263j2653984k3761708k2319750j4260126p880107m496450k863698
18100A0311440j945747j353191j016924p48593o40404m45609l85484l15556k71289
18091C188643k55943j69471j05098l7090j18634j44222j18297j39523j94040j08886
18081A797439q7135n1808j9091o2921o6610q9701q8844K3245n7572j65329p7441
18070A054232K9672l4082q7907l8890l7443l3785l9462j4706p026K4288J0621
$$ y = [28797022, 25061892, 22216745, 19883331, 17829074, 16082750, 14843586, 14000750, 13170644, 12302771, 11558380, 11107235, 10796888, 10584785, 10407570, 10288473, 10408227, 11005739, 11943691, 13426440, 16320787, 22026913, 33535763, 56239654, 87547532, 98547263, 85893279, 62131571, 39811821, 25551695, 17671588, 13175138, 10311440, 8365693, 7012502, 5995578, 5246985, 4606581, 4160972, 3775488, 3459932, 3188643, 2932700, 2763229, 2658131, 2621041, 2502407, 2358185, 2239888, 2100365, 1906325, 1797439, 1710304, 1658496, 1639405, 1576484, 1509874, 1420173, 1331329, 1354574, 1297002, 1131673, 1054232, 1083904, 1049822, 961915, 923025, 885582, 851797, 812335, 797629, 790603, 814891, 825512]
18059H25512p1457j092p751L305K2843J043P102k2004r5380P257R8906M9613O850
18046H24747l9852N8773L9114P0313O3786J05421M4851J1667n2512p8236n6587
18035I91485k9377N0130J0931j3846r7583j03522q0919l2740n2103l3979L3618
18024F42095J6800j0836j5670k3749Q0399J1802J1349o1187j33569m1625P341
18013D83150m0202k7375L2424p947l9251m0458j1291L2083P6192R6320J62163
18002G15808K34647M23362N03926L61688J39228L0597N1601l4898k11138k46138
17992A968683k72206k33205j36942J7052J43618K45542L69969L71178L37328J23804
17982B934821o6330j3848o6903j95260l43436k96428k35388k27526k34331k15690
$$ y = [825512, 754055, 752963, 745212, 748517, 771360, 772403, 779505, 757501, 662121, 669378, 768284, 817897, 824747, 784895, 843668, 882782, 953095, 1016881, 1122302, 1167153, 1178820, 1126308, 1048072, 991485, 962108, 1012238, 1023169, 1009323, 911740, 808218, 727299, 694559, 642456, 608477, 642095, 658895, 648059, 632389, 608640, 689039, 700841, 712190, 651003, 517434, 475809, 483150, 442948, 415573, 447997, 440050, 400799, 360341, 349050, 381133, 457325, 553645, 715808, 950455, 1373817, 1877743, 2239431, 2378659, 2409256, 2460857, 2425959, 2214821, 1968683, 1696477, 1463272, 1326330, 1343382, 1487000, 1732542, 2102511, 2473689, 2811017, 2934821, 2868491, 2854643, 2787740, 2592480, 2249044, 1952616, 1717228, 1489702, 1255371, 1039681]
17972A039681j72984j12610r668J6811l3388l0906R2002L8686J4085K8511p618
17961H62602l4051r4271j20483r8020l1943p0011o3597l1915K7156O878q4644
17950B67701n8952k0814r96Q1848P7707l7570M0607L4131j04080p9210K9129j0804
17938B18697L1782J2403K0816O5475Q8370O6288J72444L59520M56393N29269M28618
17927B450075K90901J17425j15734l18922l54403l16627k33504j91178j05503
17918A222530O970J95743L96892M01256L73784K50825L3495j37592l72968m57365
17908A913570l25613k54064j63123r6041j85892j31290r4860j15810q9718n5253
17898D01906q9473j2635K3362L1550j8835k513l8520M0024O4731j7581n1897m7869
$$ y = [1039681, 866697, 754087, 744419, 761230, 727842, 696936, 788938, 827624, 841709, 870220, 862602, 828551, 734280, 613797, 515777, 483834, 413823, 350226, 318311, 345467, 352345, 267701, 208749, 187935, 186939, 268787, 346494, 308924, 349531, 383662, 279582, 200372, 229501, 218697, 250479, 262882, 283698, 349173, 437543, 503831, 676275, 1035795, 1492188, 2021457, 2450075, 2740976, 2858401, 2742667, 2423745, 2069342, 1752715, 1519211, 1328033, 1222530, 1229500, 1425243, 1822135, 2223391, 2597175, 2848000, 2881495, 2743903, 2370935, 1913570, 1587957, 1333893, 1170770, 1074729, 888837, 757547, 662687, 546877, 457159, 401906, 312433, 299798, 323160, 354710, 335875, 333362, 294842, 334866, 399597, 382016, 330119, 282250]
17886B82250p418l785o1405n1830O4202N3891m174j9266M8562l8117j4063K442
17874B51289L4316P79p1938k6549L8421r785k0222k8395q1171j922l2335J6849
17862F9337O0124J1804P817J5850p167m3471k1718R853L9838J4347L1990K1961
17850B10565K2262N0176L3268j6052K988l6521k8554l936J616l7176N877K4650
17838B29163L5090k037K7285k8259k6073j9793o1718j5598J5675j4546O207J7664
17826A63060O3723k3527L5648M2746k665j0075m2101k0179L7895L3437j1740k4136
17814B42086K6855Q6925N4835k6175o982O1068J0532r2522o4493r722o9641k7885
17802A84881K5212K1369O7817M0506r724O5311N9946k1026n4248j01408l7097
$$ y = [282250, 274832, 271047, 209642, 157812, 222014, 275905, 271731, 252465, 301027, 262910, 248847, 251289, 285605, 286384, 214446, 187897, 226318, 216533, 196311, 167916, 86745, 84823, 52488, 69337, 129461, 141265, 149082, 164932, 157765, 114294, 92576, 102429, 142267, 156614, 188604, 210565, 232827, 283003, 316271, 300219, 303207, 266686, 238132, 234196, 235812, 198636, 204513, 229163, 264253, 262216, 289501, 261242, 235169, 215376, 153658, 138060, 153735, 139189, 145396, 163060, 226783, 203256, 238904, 281650, 278985, 268910, 226809, 206630, 244525, 277962, 266222, 242086, 268941, 355866, 410701, 384526, 377544, 438612, 449144, 356622, 292129, 282407, 212766, 184881, 210093, 231462, 299279, 339785, 330061, 395372, 455318, 434292, 380044, 278636, 241539]
17791B41539k6369M518J7211l5334l8359L5970M1443L2578K4588N4212m3119r3692
17779B15186j6524k1747q6298j7802P1765O2548m3694m9231L2652K4414K3679
17768A94948k2538O925M9920k122j5197l4295q090O7694M5965k1517m2223R7466
17756C16936M3619L4618N0398L4467K9950O1075l7189j22848p7843l1269Q419
17745C10333K7134j5771l9950L4879J02456R8237k0821p0302l306N6160L4610
17734E13659j5517m9400O65M0207J17360J93782K50960K53292J27026J6716k8643
17723A420107k18887k75485j71872r4676q0757o0234L7802M7561J68386K52932
17713A024877L31047K23943J27529O2049J998k03089k95520l02796k46882j05397
$$ y = [241539, 215170, 219688, 236899, 201565, 163206, 199176, 240619, 273197, 297785, 351997, 308878, 215186, 198662, 176915, 90617, 72815, 144580, 207128, 163434, 114203, 146855, 171269, 194948, 172410, 179335, 229255, 227133, 211936, 177641, 169551, 237245, 283210, 261693, 219470, 316936, 360555, 395173, 445571, 480038, 509988, 571063, 533874, 411026, 333183, 301914, 310333, 337467, 321696, 281746, 316625, 419081, 517318, 496497, 426195, 422889, 479049, 513659, 498142, 448742, 449407, 489614, 606974, 800756, 1051716, 1305008, 1432034, 1448750, 1420107, 1201220, 925735, 753863, 659187, 578430, 518196, 555998, 603559, 771945, 1024877, 1355924, 1579867, 1707396, 1769445, 1771443, 1568354, 1272834, 970038, 723156, 617759]
17703F17759o3853j9591l0137J8527J532J7592K0525r181M3841N9950O9052J72747
17691H98763K27596J62070J17625M8759O4267J58828Q1875J5848J9211m2212j09058
17680A643572n3637l8161j36215j09287p6877m2433L9725O6890J22469J9709q7685
17669A348070j22333j76255j63837p2778l9328p9941J6030R3978R8721K06809
17659A109136L96812O36297O33998M25318M5728l00096l71471j79601Q0383R4978
17649B571482j68788l51641l41572k09818k645K36972M06302K23890o0979k19872
17639B083331j51018J86207M95629M05358P0982j33166k84061j56286m6734m0632
17629B429610J7867r9654k10395j29933n5253r0335k18805k68020k32988j43766
$$ y = [617759, 553906, 534315, 504178, 522705, 524237, 541829, 562354, 553173, 597014, 656964, 726016, 898763, 1126359, 1288429, 1406054, 1454813, 1519080, 1677908, 1759783, 1775631, 1794842, 1752630, 1643572, 1589935, 1551774, 1415559, 1306272, 1229395, 1186962, 1226687, 1293577, 1416046, 1435755, 1348070, 1225737, 1049482, 885645, 812867, 773539, 693598, 709628, 803606, 902327, 1109136, 1505948, 2142245, 2776243, 3201561, 3247289, 2947193, 2575722, 2396121, 2476504, 2571482, 2402694, 2051053, 1709481, 1499663, 1497018, 1733990, 2140292, 2364182, 2303203, 2083331, 1932313, 2118520, 2614149, 3019507, 3090489, 2957323, 2673262, 2516976, 2470242, 2429610, 2447477, 2347823, 2137428, 2007495, 1952242, 1861907, 1643102, 1375082, 1142094, 998328]
17619I98328j18135p6105n819p3657j17212k9583M8379L4151l3205l9859l2191
17608E55092M8978K2235j9487l1161k5227n908L5343M7323J5622P4785L429o0214
17596F60810k6947L379j8347J6446K2716j6604J8284Q6740R5111J2652o9520l3476
17584G51244j4947J8292R0471O8417M6421j7357J7093M822o6214r329O7913l8133
17572I18693j5647k2659q632J1233p4738l9391K2745J5417N4975Q4987O0290R274
17560A016547O5602M0521P240k758N6522P6872j5844J0191l4779k1864j4463O3368
17548A247155J66274J55043N9752J10814J48258L9497L7724O5044J47098J86809
17538B363468R9030N1964J89248K63459K02951K43184J67903J98900L72367N42875
$$ y = [998328, 880193, 804088, 798269, 724612, 607400, 577817, 626196, 660347, 627142, 587283, 555092, 604070, 626305, 606818, 575657, 550430, 544522, 579865, 627188, 642810, 717595, 721024, 660810, 633863, 637242, 618895, 635341, 658057, 641453, 659737, 746477, 841588, 854240, 784720, 751244, 736297, 754589, 845060, 913477, 959898, 942541, 959634, 964456, 898242, 888913, 956826, 918693, 903046, 880387, 871755, 882988, 808250, 768859, 791604, 807021, 861996, 946983, 1007273, 1016547, 1082149, 1122670, 1129910, 1127152, 1183674, 1260546, 1244702, 1254893, 1220114, 1198250, 1183787, 1247155, 1413429, 1568472, 1628224, 1739038, 1887296, 1926793, 1964517, 2029561, 2176659, 2363468, 2462498, 2514462, 2703710, 2967169, 3170120, 3413304, 3581207, 3780107, 4152474, 4695349]
17528D695349O16223N71534N07223M58699M79963M93561M49202N65220O41041
17519I478015O20119P58911R66748J129681J439359J854323K237837K670341L224218
17510B4379552L993896N313091P351448J0793475J6852664K8136157M7973151
17503A44793434P1082248P3955928N2699187K4898544J3775291J572681k2823478
17496C59953835n4068439o6457761n8049566l7864414j7311316r2523J7815822
17489A43925638M2558743P0882406P7782071N5907802K3600286Q764296l643902
17482D19777340k8588698o2375502p8237747p1690535n2372954l3464180k1104299
17475G1943425j4125617r993018p318286n526544m391187l633078k900200k299875
$$ y = [4695349, 5311572, 5883106, 6390329, 6849028, 7328991, 7822552, 8271754, 8836974, 9478015, 10098134, 10857045, 11823793, 12953474, 14392833, 16247156, 18484993, 21155334, 24379552, 28373448, 33686539, 41037987, 51831462, 68684126, 96820283, 144793434, 215875682, 289831610, 342530797, 367429341, 381204632, 382777313, 359953835, 305885396, 239427635, 181378069, 143513655, 126202339, 126109816, 143925638, 186484381, 257366787, 335148858, 391056660, 414656946, 423421242, 419777340, 391188642, 328813140, 250575393, 178884858, 126511904, 93047724, 71943425, 57817808, 47824790, 40506504, 34979960, 30588773, 26955695, 24055495, 21755620]
17467B1755620j966037j685126j383394j120730j040623j015492q93078q30752
17459A1820388p46431o37083n30334o11061p56658q49042q44717o84520n43990
17450E616552m27663l08819k69081l26601k51374j77985q2990p9O1056j52233
17440C680783l03278l59399k82100k63104j62043q5522k5443m1961J7910J3942
17430B189785l9819p850p4059q1834j28731j03948r8795m895m0754j49327j9298
17419A440475n5426p156O0577m5529k0396m5953q5554p9841r3519q8561j312m255
17407I73550o2397J6080O26p116k5114q099j9143p8414m2633N985J6271M987k9207
17394G45376m8196l2699j2454j1094k0573P0796L6522L5721K2619J8043M3846
$$ y = [21755620, 19789583, 18104457, 16721063, 15600333, 14559710, 13544218, 12651140, 11820388, 11073957, 10436874, 9906540, 9295479, 8538821, 7689779, 6845062, 6160542, 5616552, 5188889, 4880070, 4610989, 4284388, 4033014, 3855029, 3772039, 3771960, 3833016, 3680783, 3377505, 3018106, 2736006, 2472902, 2310859, 2225337, 2199894, 2157933, 2175843, 2189785, 2149966, 2142116, 2068057, 1986223, 1857492, 1753544, 1654749, 1649854, 1609100, 1459773, 1440475, 1385049, 1377893, 1438470, 1392941, 1372545, 1326592, 1241038, 1161197, 1067678, 979117, 977805, 973550, 911153, 927233, 927859, 920743, 895629, 887530, 868387, 789973, 747340, 753325, 769596, 774583, 745376, 697180, 664481, 652027, 640933, 620360, 691156, 727678, 763399, 786018, 804061, 847907]
17383H47907m718O433L7709L6812J2084K8429k9054L823j553J14513J44471J53851
17371A350707K03826j6483r2964r2352p8576j7080J22477R3860k8057j16196j39098
17360A190064J2887K8815J11055R6588N8974p7040r2803o5820K7865J13967J48616
17349A553168J05476N7093L3847o660K2908J09788J28171k2063j17217j90049
17339A674462k13082r9980r3618m1185J2014Q7164J24982J38006J73871J82534
17329A945168J66763O2549l3160j20313j94917j76124r4978j27044j64500o6922
17319A196522r896N1395P5424R991n419m2183p3784l1388j6319M0046M6382m3622
17307A197149l7454o5225k4481j7542j5617o2435l4422L1290L4504n5966j05039
$$ y = [847907, 843189, 849622, 887331, 924143, 936227, 964656, 935602, 939425, 937872, 1052385, 1196856, 1350707, 1554533, 1538050, 1445086, 1352734, 1274158, 1257078, 1379555, 1473415, 1445358, 1329162, 1190064, 1202951, 1231766, 1342821, 1439409, 1498383, 1421343, 1328540, 1262720, 1290585, 1404552, 1553168, 1658644, 1715737, 1749584, 1742924, 1765832, 1875620, 2003791, 1981728, 1864511, 1674462, 1461380, 1361400, 1267782, 1226597, 1238611, 1325775, 1450757, 1588763, 1762634, 1945168, 2111931, 2174480, 2141320, 2021007, 1826090, 1649966, 1554988, 1427944, 1263444, 1196522, 1186626, 1238021, 1313445, 1323436, 1318017, 1275834, 1202050, 1170662, 1154343, 1194389, 1240771, 1197149, 1159695, 1094470, 1069989, 1052447, 1036830, 974395, 939973, 971263, 1005767, 949801, 844762]
17296H44762l3890O7278Q7282L9922K4238M1490j7667J1405O0297Q3415M1401
17285A249933K2863n2354p3931j3178M1115P4012P2334N3177j4593k3615P8297
17274A414060L8152P9019J16244J17186J72246K70464L98940N51369N40634L08863
17264D007177O9228j21141j11127l9990k0868r1541p4390P3926J62009L01747
17254D155030O26716Q36867Q65585O52057M82516L90937K88146K84453L58822
17245H941129M33398N99639Q83690J266584J945923K640800L707378N381074Q001352
17236C3800967J2529286K1044477L6412957N5018599N3088764L1116881J7520080
17229B60532011l617300l3109751m7716828m7334339l5146521k0986410j0479626
$$ y = [844762, 810872, 878150, 965432, 1005354, 1029592, 1071082, 1053415, 1064820, 1125117, 1208532, 1249933, 1272796, 1220442, 1146511, 1133333, 1174448, 1248460, 1320794, 1373971, 1359378, 1335763, 1414060, 1452212, 1531231, 1647475, 1764661, 1936907, 2207371, 2606311, 3157680, 3698314, 4007177, 4076405, 3955264, 3844137, 3804147, 3783279, 3691738, 3617348, 3691274, 3853283, 4155030, 4781746, 5618613, 6484198, 7136255, 7618771, 8009708, 8297854, 8582307, 8941129, 9374527, 9974166, 10857856, 12124440, 14070363, 16711163, 20418541, 25799615, 33800967, 46330253, 67374730, 103787687, 158806286, 211895050, 243011931, 260532011, 256914711, 223804960, 176088132, 128753793, 93607272, 72620862, 62141236]
17222F2141236k907826M235395J3311743K7542636M5286901M6557301K7265496
17215B23432882J4609733k749009k9588909m4116654m4988706l5114278k2916516
17208E8568543j4401755r471919o436223m580990l205102k196979j580138j041186
17200A5654251m70070M3290L50834K29350R554k03769n03672p09998q00140o44960
17190A2954670j31072L25015P62883J283849J783096K472914L567367N165350
17182B8184072P620232J2091403K0473680L5305606N0488480M3764067K4481371
17175B22408911J3061351q554105l3406136m3703477m0895773k8866049j6600341
17168F3444381p838343j262368N268717J4195948K8090093M3283485L9826115
$$ y = [62141236, 59233410, 63468805, 76780548, 104323184, 149610085, 196167386, 223432882, 238042615, 235293606, 205704697, 161588043, 116599337, 81485059, 58568543, 44166788, 34694869, 28258646, 23677656, 20472554, 18275575, 16695437, 15654251, 15184181, 15227471, 15578305, 15807655, 15817209, 15613440, 15109768, 14399770, 13599630, 12954670, 12823598, 13148613, 13911496, 15195345, 16978441, 19451355, 23018722, 28184072, 35804304, 47895707, 68369387, 103674993, 154163473, 197927540, 222408911, 235470262, 226916157, 193510021, 149806544, 108910771, 80044722, 63444381, 55606038, 54343670, 59612387, 73808335, 101898428, 145181913, 185008028]
17161A85008028K1742141J0927772p510754l1012461m1384456l9810633k9699955
17154F8259682j9066824j1972468p818355n245532l536784k380721j664250j316881
17146A5257867j151320q44433m65429l18374l33624m06849o89340q52345q31630
17137I364523o49135k49553O3746k6990k22848k17975p9324K79782N21091M33326
17127I216643Q5347o6272j17321L1731M99494Q68846P93296M87382K72709L23512
17117A2395367R20206J722643K128141J884465J337925J447760K414180L966475
17109B8217162O128358Q857189J2955619K1092817L7559056O7121626R2021574
17102B73953401O1417561l063666l9841943l5305638O964581N3294661M4544081
$$ y = [185008028, 206750169, 217677941, 210167187, 179154726, 137770270, 97959637, 68259682, 49192858, 37220390, 29402035, 24156503, 20619719, 18238998, 16574748, 15257867, 14106547, 13262114, 12796685, 12478311, 12144687, 11737838, 11048498, 10196153, 9364523, 8715388, 8465835, 8529581, 8502591, 8279743, 8061768, 7982444, 8262226, 8783317, 9216643, 9301990, 9235718, 9118397, 9150128, 9649622, 10518468, 11311764, 11799146, 12071855, 12395367, 13315573, 15038216, 17166357, 19050822, 20388747, 21836507, 24250687, 28217162, 34345520, 43202709, 56158328, 77251145, 114810201, 181931827, 273953401, 335370962, 332307296, 292465353, 257159715, 264124296, 317418957, 361963038]
17095C61963038j4327596n5744379o2058601l6479569L933951M9405253P5311574
17088C22003671L8303376k0804152m8197282l4482903J1883348N1616808K8783778
17081C49106644l2372193p0080273p4569004n4993813l3470583j9852541j2779115
17074E0989122r042945o789173m937374l300119k008452j665723j809444j871478
17066A9564414j534796j235163j059302j148036j279004j090428q07387p49469
17058A0660829q90749q91771q18152o27585k94589j33230k2783j71978m15089
17049F394903m95033l75301j41443n4336k72612l84214n30856n58546m30277l18085
17039B834200k37153j30631p1554k4423j14415j34985q5375p6993q0535q883o3080
$$ y = [361963038, 347635442, 291891063, 229832462, 193352893, 197286844, 246692097, 322003671, 360307047, 339502895, 291305613, 256822710, 268706058, 320322866, 349106644, 316734451, 246654178, 172085174, 117091361, 83620778, 63768237, 50989122, 41946177, 35157004, 30219630, 26919511, 24911059, 23245336, 21435892, 19564414, 18029618, 16794455, 15735153, 14587117, 13308113, 12217685, 11410298, 10660829, 9770080, 8878309, 8060157, 7432572, 7137983, 7004753, 6981970, 6809992, 6394903, 5899870, 5524569, 5383126, 5328790, 5056178, 4671964, 4141108, 3582562, 3152285, 2834200, 2597047, 2466416, 2394862, 2370439, 2256024, 2121039, 2035664, 1958671, 1878136, 1869253, 1806173]
17028A806173q7797j99247q1216l2045l051l1176o7160l8062J6111Q737N1622
17017A342889j5137q8752o0972J2938m5274n3528k038k0146l2513P7894M9583
17006A164944n2147k9257M3851J05520R9934J89409L05935M15119L38822K64870
16996B847000J90445M6895Q72k30642m04363l95584l59267k76542j52396J6218
16986A282636J38266K19826L20282K86713J67406R4358K0843o4557j90676l23925
16976A951172k89308k55346j76493j95698j84804j75727j24958O2475N6784J7628
16966F85725m3834o8882j03392m0429Q0612K3834r4257m3939P8244M6265O754
16955E26701L4484Q2599j8681j16864j32212L5648L7886K0539j3978n0751o294
$$ y = [1806173, 1718376, 1519129, 1437913, 1405868, 1402817, 1371641, 1304481, 1266419, 1282530, 1291267, 1342889, 1327752, 1239000, 1178028, 1190966, 1145692, 1092164, 1090126, 1069980, 1037467, 1115361, 1164944, 1112797, 1083540, 1127391, 1232911, 1332845, 1522254, 1828189, 2243308, 2582130, 2847000, 3037445, 3084340, 3085212, 2854570, 2450207, 2054623, 1695356, 1418814, 1266418, 1282636, 1420902, 1640728, 1961010, 2247723, 2415129, 2509487, 2530330, 2465773, 2275097, 1951172, 1661864, 1406518, 1230025, 1034327, 849523, 673796, 548838, 611313, 668097, 685725, 641891, 573009, 469617, 429188, 509800, 533634, 439377, 395438, 473682, 519947, 526701, 561185, 643784, 625103, 508239, 376027, 411675, 449561, 470100, 456122, 405371, 399077]
16944C99077p0798j6074k4881R810N2657R158O4399k3886K69l020J3118J4218
16932D24047j183k0448j4731j02121m7339K270M4107R1558M5915J9117o2442j0703
16920C68047j4821k4253l7806k9326K3998M7456M758l7546n8455J0045N3276J7780
16908C23153k2640o0503o9006l6234J9105K2611L1079k5583l7641r9344J7199
16897F2196L6903M8982N980m0641q6207n1639J3888L2968N1728N4962j5392j733
16885A11995J6045J2882k1845n7302k9263p2170K3668R0750l083M6721M6210O3931
16873B28539K5217j5127J9853o1036n1814M5574P7426O508k9181l0768j6621m1832
16861A56738k5153M3364m4181l4312p948k3308J6078K9815N279l9546k1327K4845
$$ y = [399077, 328279, 312205, 287324, 297134, 349791, 358949, 423348, 399462, 399731, 396711, 409829, 424047, 422864, 402416, 387685, 285564, 238225, 240495, 284602, 376160, 422075, 441192, 378750, 368047, 353226, 328973, 291167, 261841, 285839, 333295, 338053, 300507, 242052, 252097, 305373, 323153, 300513, 240010, 171004, 134770, 153875, 176486, 207565, 181982, 144341, 44997, 62196, 99099, 148081, 154061, 113420, 27213, -24426, -10538, 22430, 74158, 129120, 113728, 111995, 128040, 140922, 119077, 61775, 32512, -39658, -15990, 74760, 71677, 118398, 164608, 228539, 253756, 238629, 258482, 197446, 145632, 191206, 268632, 275140, 245959, 215191, 198570, 156738, 131585, 174949, 130768, 96456, 88508, 65200, 81278, 111093, 116372, 76826, 55499, 80344]
16849H0344M8880n1704J1584Q0065J9022p0621o122P323L5292L0989n0114j6174
16837A18764n195l222o910l1823K1740j059j6036j1022M969Q390L779j1115L2157
16824A03417L6110J3674k7959m2515J2859J6704m6290m1430K0680n397r009N9730
16812I0574J5896L6954L4251m3394l7576P330k1797K4571k1273q544l8326l4631
16800D035l5989q363L377Q2850J18144N0511p424j7860n5365N350K54j0056l1272
16787I8192k2626K0661N0117K6749K6458Q879k8349J9275j115N0100j5986n2072
16775A80283j9926j3800q473k7754n8165k4995j9293J6503K2656Q2657J3537J6156
16763A59386j1916k3989p066j1700k3387j5568k5116j6527o960q8231n7049O2104
$$ y = [80344, 129224, 77520, 89104, 169169, 188191, 117570, 111448, 118771, 154063, 185052, 134938, 118764, 113569, 110347, 103437, 71614, 93354, 92295, 76259, 65237, 70206, 78596, 82375, 71260, 103417, 139527, 153201, 125242, 82727, 95586, 112290, 66000, 24570, 45250, 39853, 30844, 90574, 106470, 143424, 177675, 134281, 96705, 104035, 82238, 106809, 85536, 76992, 38666, 4035, -31954, -40317, -36940, 45910, 164054, 214565, 207141, 189281, 133916, 139266, 139520, 129464, 98192, 75566, 96227, 146344, 173093, 199551, 208430, 180081, 199356, 198241, 248341, 232355, 180283, 160357, 146557, 138084, 110330, 52165, 27170, 7877, 24380, 47036, 129693, 143230, 159386, 147470, 123481, 116415, 104715, 81328, 65760, 40644, 24117, 17157, -71074, -128123, -66019]
16751f6019O4485K0795J9561M440M0568J9344Q911J5317l6332l4208K5987L9678
16739A22527K0185K7209R1395Q6873R618R1791K34798K46520J64189J10159Q7496
16728A292760k5908k27923k65841j84131j28400q6059l7135J5572N0913J33113
16718E36961J52165K15237K36337J22709N3431j52975j81188j77319j87031k00440
16708D17887j44227m2240m2851l2928K159l2169m4743L3544M714r181n4860L473
16696E8578O5950L0184j5153q422m4537k0422K2130K6712l1841J4840M9237L5439
16684A82695L2805K3332L395r491M0871R4714K04337L27385K20418J50023L3174
16673A303658j04745j60691k57988k39460j45201j17669k7072J1427M2444K05732
$$ y = [-66019, -1534, 19261, 38822, 43262, 83830, 103174, 112085, 127402, 91070, 56862, 82849, 122527, 142712, 169921, 261316, 348189, 357807, 449598, 684396, 930916, 1095105, 1205264, 1292760, 1266852, 1038929, 773088, 588957, 460557, 374498, 337363, 352935, 403848, 536961, 689126, 904363, 1140700, 1263409, 1316840, 1163865, 982677, 805358, 618327, 417887, 273660, 231420, 188569, 155641, 157800, 125631, 80888, 114432, 119146, 109965, 55105, 58578, 124528, 154712, 139559, 131137, 86600, 66178, 88308, 115020, 83179, 98019, 147256, 182695, 215500, 238832, 242227, 232736, 273607, 368321, 572658, 900043, 1120461, 1270484, 1303658, 1198913, 1038222, 780234, 540774, 395573, 277904, 250832, 262259, 304703, 510435]
16663E10435K09974K35515J66434J53014P9859j07642k11253k78206k47055j56883
16653C54192o7946n5555o7414l0335n009p7n540m4083n7091K8990M7003p98J5072
16640A11409l2744M697Q574l2839k0772l7539J3566J6121k0645J2482J5817K7216
16628F5343Q016J5744m7472k6101J800L6882K1641k5606j5032M4533M0191l213
16616A16726k6590p2320m5927L724J4547M7179R242K9354J8165r653M5530K9459
16604A59436j24186m8108M928J2134K2737J9088j2219q945j3214k5001M9764K8343
16592F4757R021P544K2422m4557q130J2578j500J3324L1378l1208j3678O054K8410
16579I6415k4503j2930l9774J0229L2879k3062l1052j9579L6416J9792p316K5711
$$ y = [510435, 720409, 955924, 1122358, 1275372, 1355231, 1247589, 1036336, 758130, 511075, 354192, 286246, 230691, 163277, 132942, 127933, 127856, 122316, 78233, 21142, 50132, 97135, 96337, 111409, 78665, 83362, 91936, 59097, 38325, 786, 14352, 30473, 9828, 22310, 38127, 65343, 73359, 89103, 41631, 15530, 17330, 54212, 75853, 50247, 35215, 79748, 119939, 116726, 90136, 17816, -28111, -24387, -9840, 37339, 46581, 75935, 94100, 84447, 129977, 159436, 35250, -12858, -7930, 4204, 26941, 46029, 33810, 24865, 11651, -13350, 36414, 64757, 73778, 81322, 103744, 59187, 51057, 63635, 62135, 75459, 106837, 75629, 61951, 68005, 96415, 71912, 58982, 19208, 29437, 62316, 39254, 8202, -11377, 25039, 44831, 37515, 63226]
16567F3226J0755k5410J7692L5732M386k5944j6850m7333k656M8048P684J2531
16555H1861j7328L801K7876L8760K0259N1193O6848P059K8717N9574R4707K75595
16543G38922M33798L95585J98293j23442j47650o1059J36995K75280R4888k06730
16533A734880l66418k57248m2613J55934L46182L71337O4609k00737j77546j15011
16523A513369J40063K78276n6969k39415l92001l25400k48897k56009j54088k3564
16513B35365J7635k5820n1939l1546J625k8110m4492j3730k1826k1208L3533J3609
16501F3096K6691l3155r092M3792N2738M7175m8736n9657Q244q9892j2612N6050
16489D4642M885q32r447K1688l3864m9060o34J3253O791P8823J9887j6283M2607
$$ y = [63226, 73981, 48571, 66263, 101995, 106381, 80437, 63587, 16254, 13598, 61646, 69330, 81861, 64533, 68334, 96210, 134970, 155229, 206422, 273270, 280329, 309046, 368620, 463327, 738922, 1172720, 1568305, 1766598, 1643156, 1495506, 1434447, 1571442, 1846722, 1941610, 1734880, 1368462, 1111214, 1068601, 1224535, 1570717, 1942054, 2006663, 1805926, 1628380, 1513369, 1653432, 1931708, 1874739, 1635324, 1243323, 917923, 669026, 413017, 258929, 235365, 253000, 227180, 175241, 143695, 145320, 117210, 72718, 58988, 37162, 15954, 49487, 63096, 89787, 56632, 47540, 91332, 144070, 191245, 142509, 82852, 91096, 1204, -11408, 44642, 49527, 48695, 39248, 60936, 27072, -21988, -22622, -9369, -2578, 76245, 96132, 79849, 122456]
16476A22456k1399J5687m1509q876J2721l1359j8217K4566m4211l1672K2094M0235
16464D0516K5869m414L5726M0907o332k0516j29525j9102N6020L1814j6897O425
16452D0491J9559M6717J9703p6502l0491k2732l6567K073P4437N0061Q577J7784
16440A13110k6197K676k4828l5516M5636J804k1550k6062K8776L6088o938j9830
16428F7169k3928j8694p8281K8972j9942q2330J4515O3283L0330L7731N5195J7323
16416I1343o1722m4015k0503m0517l059K4476k9822r94L305O1375L8538J2232
16404C0637k0521k270r649J4191k2651j6439r213J2543o661M1992P461J1778k8186
16391C012j6123l0770n340N4365P9657M8251j9114j6685J432J6313k5084o8759
$$ y = [122456, 101057, 116744, 75235, 66359, 79080, 47721, 29504, 54070, 9859, -21813, 281, 40516, 66385, 61971, 97697, 138604, 132272, 111756, -17769, -36871, 19149, 50963, 34066, 40491, 60050, 106767, 126470, 49968, 19477, -3255, -39822, -37749, 36688, 86749, 95326, 113110, 86913, 89589, 64761, 29245, 74881, 76685, 55135, 29073, 57849, 93937, 86999, 67169, 43241, 24547, -53734, -24762, -44704, -127034, -112519, -49236, -18906, 18825, 74020, 91343, 29621, -14394, -34897, -75414, -78473, -53997, -83819, -84813, -81508, -20133, 18405, 30637, 10116, 7846, -1803, 12388, -10263, -26702, -35915, -23372, -30033, 11959, 19420, 31198, 3012, -13111, -43881, -49221, 5144, 84801, 133052, 113938, 97253, 98685, 114998, 89914, 21155]
16379B1155k4234J5987M1258l872J3884k4290l8849l3265k5717J9561l357J3003
16367b8736K6360k476J6036R204k4278k9835J5933Q137m2029K043K801l6258J027
16354h2071j5209K6070O1690P436J7785p4610l5650N5584P924l343N7974L4465
16342E8045l4520n9605m1201M3963J866L2931o56K8746n172k1902q263j9809L2542
16329F965L4851L6096k2910o280J5029M9308n843l2313J1357k0552n5707l3214
16317b3213K2686L1259R518J1403m7047n3269J0557j6332k2140M9966J4130P050
16305e432Q0533m371k683m9655m9967J183j9353N601J3484M687Q407P728o8473
16292g8311o5595l1910M7966J2377M876K8756K5958P4718O5318j6451o0755J5065
$$ y = [21155, -3079, 12908, 54166, 50294, 64178, 39888, 1039, -32226, -57943, -38382, -41739, -28736, -2376, -4852, 11184, 20388, -3890, -33725, -17792, -9655, -51684, -49641, -46840, -83098, -82071, -97280, -71210, -9520, -2084, 15701, -58909, -94559, -38975, -31051, -34394, 23580, 58045, 23525, -36080, -77281, -33318, -31452, 1479, 823, 29569, 24397, 2495, -5768, -25577, 6965, 41816, 77912, 55002, 48722, 63751, 113059, 107216, 74903, 86260, 65708, 10001, -23213, -527, 30732, 40250, 51653, 4606, -48663, -38106, -54438, -76578, -26612, -12482, -5432, 75101, 70730, 68047, 18392, -31575, -30392, -49745, -44144, -30660, -25973, -17566, -9838, -78311, -143906, -175816, -127850, -115473, -110597, -81841, -55883, 18835, 84153, 67702, 6947, 22012]
16280B2012J3693o2598m6290L2549M4163p237n4481p249R669k0430K3083L2157
16268b0959j1561r779l4892O8487J00644m2035o1650j5011K6175M0506k7839m0746
16256b8660K483n3499J5181J765J6514P9685P787k2475n2696R101M3666K3530
16244D2382q9609k6712n508j4237L1859K1034M5639O167K8486j2353k059o614
16232A8475p2814K249J2346l2713K3510O0083o6249l6441K0182L7038j1935m6839
16220i3108K1459K2404O0570R117l3560p751N5626P5169K1566n954l2640l4170
16208E8728k8821l9568l1251k3477M2141R732l3768j6158N236k9385k5031L0875
16196h0747J09143L0036l4673q904k743j5762N2833L0257m7266p4378n0010j9499
$$ y = [22012, 35705, -26893, -73183, -40634, 3529, -3708, -58189, -65438, -55769, -76199, -53116, -20959, -32520, -42299, -77191, -8704, 91940, 49905, -11745, -26756, -581, 39925, 12086, -28660, -26177, -79676, -64495, -62730, -46216, 33469, 41256, 18781, -33915, -24814, 18852, 42382, -47227, -73939, -79447, -93684, -61825, -40791, 4848, 11015, 39501, 27148, 25089, 18475, -54339, -52090, -39744, -72457, -48947, 11136, -55113, -91554, -71372, -34334, -46269, -93108, -71649, -49245, 11325, 20442, -13118, -20869, 34757, 109926, 131492, 125538, 92898, 58728, 29907, -9661, -40912, -64389, -22248, -12516, -46284, -62442, -57206, -86591, -111622, -80747, 28396, 58432, 23759, 14855, 12112, -3650, 49183, 79440, 32174, -42204, -92214, -111713]
16184a11713N8491O1607k5712Q051R981j3043J3437M0395O370l3278m0226M5238
16172A9598K7906p3568m6052L4461O5493M0309P504n529K453m3777J69l0425o6232
16159f7690k8330M0672J9988l8492K8615J9114j4960M6702M3934J7220J7447m9924
16147C4296m9355k6125j5582m2630L1607J757K1250L4123J0816K1157P836o9407
16135d0257k6905L0387Q931J5967M6040j9990k8616K747L7242L1695k4393j6726
16123A6122l0165J9569m0401j1094k8752L952j1842k4117L0527L403J7560N0085
16111e153q414o83P2921J0587n911j8785j9261k6141l4075l8582l4165O729J5639
16098h5294K3777M1327J5343M9985j7875k7409K7838p805l2749m8766M3430K4039
$$ y = [-111713, -53222, 8385, -17327, -9276, 705, -12338, 1099, 41494, 47864, 14586, -25640, 19598, 47504, -26064, -72116, -37655, 27838, 68147, 75651, 70122, 72575, 28798, 28967, -1458, -67690, -96020, -55348, -35360, -73852, -45237, -26123, -41083, 5619, 49553, 66773, 84220, 34296, -15059, -41184, -56766, -99396, -67789, -66032, -44782, -10659, 157, 21314, 29150, -40257, -67162, -36775, -27844, -11877, 34163, 14173, -14443, -11696, 25546, 57241, 32848, 16122, -14043, 5526, -34875, -45969, -74721, -70769, -82611, -106728, -76201, -72798, -55238, -5153, -13567, -14250, 58671, 69258, 63347, 44562, 25301, -840, -34915, -73497, -107662, -100933, -85294, -61517, -20190, -4847, 45138, 27263, -146, 27692, 19887, -12862, -61628, -18198, 5841]
16086E841n5629n0617P1898j1287O045o956l2165J3591m9249j7452R3256J8037
16074a4687m619k6630j6830N1083k4647m6912J7152L5672O566l369K7664O0082
16062F0525K9985m1109n0181J1365J6997j5396j5609n4168p3503q446k6435N1254
16050a14721N5719k175k9342K9548O1377L7866N06k7535l5599k0163m000J0925
16038c7594J5423n449K6787M3935L4024l541j9370j6659l9437l3394j2592p976
16026e5843j2605J5040J3666J4759L0047P8119j2518n2015l4105L7948r368n0020
16014c6895O448J6078q186P803L6065m8183j8539K9784k8240r880L8667K9614
16002A4536k5788n2497R642j7974j5396O274J5473J5913K2164N2715L34l3731
$$ y = [5841, -49788, -100405, -28507, -39794, -33749, -40705, -72870, -59279, -108528, -125980, -32724, -14687, -19306, -45936, -62766, -11683, -36330, -83242, -66090, -30418, -23852, -27221, 443, 60525, 90510, 49401, -780, 10585, 27582, 12186, -3423, -57591, -131094, -139540, -165975, -114721, -59002, -61177, -90519, -60971, 406, 38272, 38778, 11243, -24356, -44519, -48519, -37594, -22171, -27620, -833, 43102, 77126, 73585, 54215, 37556, -1881, -35275, -47867, -55843, -68448, -53408, -39742, -24983, 5064, 83183, 70665, 18650, -15455, 22493, 13125, -36895, -30447, -14369, -22555, -14752, 21313, -26870, -45409, -15625, -43865, -53745, -15078, 14536, -11252, -63749, -54107, -72081, -87477, -81203, -65730, -49817, -27653, 25062, 25396, -8335]
15990h335M8142l0929n6817k4335L2156N0250l544n6087o0590N9690J390p2273
15978a21282k7708L3978N3460L4398m6625N7882P5651N1009j9607o9716j1014
15967A0426J132j5786n6484p6014p810N9349P1216J485r662O3925J3758j7644
15955C7891m1549K4421L2337p455r322k8790j0244O4470l981j1833Q910m7583
15943G272J484K029q0340j6145P2674M4675j8043l9129k4310J3565p044j4515
15931e7827J6438j980J043L9373L3732L0201N9267J3622j6338m5885q1184j9758
15919b9296k4858k2370R868P0917M5184m4828j1887J157l4714l565K7224N0455
15907C3287q746l9530O421L3411l6562m6962l2864j4738q233R413K0601L283L7204
$$ y = [-8335, 39807, 8878, -47939, -72274, -40118, 10132, 6588, -49499, -110089, -50399, -49009, -121282, -148990, -115012, -61552, -27154, -73779, -15897, 59754, 110763, 91156, 21440, 10426, 11558, -4228, -60712, -136726, -144536, -85187, -13971, -12486, -22148, 41777, 55535, 37891, -3658, 20763, 53100, 45645, 36323, 7533, -2711, 61759, 57778, 45945, 54855, 7272, 8756, 10785, -69555, -85700, -13026, 31649, 13606, -25523, -49833, -36268, -43312, -57827, -41389, -43369, -42326, -2953, 30779, 60980, 120247, 133869, 117531, 71646, -9538, -29296, -54154, -76524, -66656, 4261, 49445, 4617, -7270, -6113, -40827, -44392, -17168, 33287, 24541, -14989, -8568, 24843, -11719, -58681, -91545, -106283, -114516, -105103, -84502, -81219, -44015]
15894d4015L5650L665l4263m5496P705K8538J3167N6325k1410k2766K0955k4530
15882b6475l4757K635L8619M4878J177n1881m7789N531N7279k2973l1673L66j9474
15869h4537n706L5520J0444N072J1710j1203J6001J6648K7821m8741o3037J1135
15857g8873j9157k210M6837M2219l5225j9909j5536M0320M4111O675j9345k8629
15845c8722L3231k6596k647K5668n958K2704n438j0694Q477j1142N3184P891l8798
15832A1160j5236O300p742L2790L6M4768O0198L6590m9916o9383J9426k5757o2949
15819a9715p8703M6917O2482K8931R63r141m628j6719o9622L538J0197L2187k5917
15806c9230l9737m5792N6977Q334k644K4826l747n2261M9546L6906k5490P016
$$ y = [-44015, -8365, -4700, -38963, -84459, -76754, -48216, -35049, 21276, -134, -22900, -1945, -26475, -61232, -58597, -19978, 24900, 26077, -25804, -73593, -68062, -10783, -33756, -65429, -65063, -84537, -90243, -54723, -44279, -39207, -27497, -38700, -22699, -6051, 21770, -26971, -90008, -78873, -98030, -100240, -53403, -11184, -46409, -66318, -81854, -41534, 2577, 9252, -10093, -38722, -5491, -32087, -34734, -9066, -15024, 7680, 2242, -8452, 25, -11117, 42067, 49958, 11160, -4076, 2224, -5518, 27272, 27308, 72076, 132274, 168864, 118948, 49565, 68991, 43234, -19715, -98418, -51501, 10981, 39912, 40875, 31734, 27106, 10387, -59235, -55697, -45500, -13313, -39230, -78967, -124759, -67782, -59448, -62092, -37266, -41013, -93274, -43728, -6822, -32312, -25296]
15794b5296Q870j3928j262l0047n8500Q359K3353K3894O0345M0630N641q619j7893
15781A5547m1410l2930P516p1339J6579j319L5148J7269n017M313j5116k2456
15769i3215L5172M2644P0763o5862o1695n5225L2041P0704K1039L4704j7955j2433
15757F82J0496n4220n3125R3969K7555j7328j435M5152L2230m5113j6791q214
15745A3858j067j2832q857J9276k4306j012K4617l4799j4579N1111K1866o6997
15733c3721k5554J7755P026J352n3839j5665J9518J548L6476j1083L080L7086
15721a6021R547j7588q715N8908k6581l3658L9162R0136j3733m9652p4448K5301
15709a7342K2832m633r548J9643M7647N1767O479m1832j263k069l6486l5828j2728
$$ y = [-25296, -16426, -30354, -31616, -61663, -120163, -111804, -88451, -64557, -4212, 36418, 42059, 33440, 15547, -25863, -58793, -51277, -122616, -106037, -107356, -72208, -54939, -59956, -55643, -70759, -93215, -58043, -15399, 55364, -10498, -72193, -127418, -95377, -24673, -3634, 31070, 13115, 682, 11178, -43042, -96167, -2198, 25357, 8029, 6594, 51746, 83976, 38863, 22072, 13858, 12791, -41, -8898, 10378, -13928, -14940, 9677, -25122, -39701, 11410, 33276, -33721, -59275, -41520, -34494, -33142, -86981, -102646, -83128, -81580, -45104, -56187, -53107, -16021, -6474, -24062, -32777, 26131, -450, -34108, 5054, 95190, 81457, 31805, -42643, -17342, 5490, 857, -8691, 10952, 58599, 110366, 116845, 75013, 73750, 71681, 35195, -633, -13361]
15696a3361K7086K0184o7749n1909L1415j4288J4470L6250k270r74m54k7930p914
15683e7444j4716J0252J8880K6890N5988M5840l7145m8671L0238k2946n9041q1864
15671a33739k211N2836N5600J127L6948n1871j8622M4158q569j4938P4034j760
15659C2993m8798J8552j2447l9583j8386K5064j6818K1678l5306j7923M963L4339
15647e1672j176Q163p069J7756L5902N980M4629Q65q6260p6531n033k260K6906
15634h9800N7052N1824O3838Q768j09008r6455O115O4361M9171K6836l9605j7679
15622b4582m0281j8405j881K1187j8141L2792M1989J7616n7726j9765R78N0427
15610a5792k4792N7588q452O6925M7479l7080M6447M3410p7071q5102l1063R0803
$$ y = [-13361, 13725, 33909, -33840, -85749, -54334, -68622, -54152, -17902, -20172, -21146, -21600, -49530, -57444, -72160, -61908, -43028, -16138, 39850, 85690, 48545, -126, 30112, 7166, -51875, -133739, -135950, -83114, -27514, -26387, 10561, -41310, -59932, -15774, -24343, -39281, 34753, 32993, -15805, 2747, -9700, -49283, -67669, -42605, -59423, -37745, -73051, -90974, -86011, -51672, -52848, -44685, -51754, -33998, 1904, 7884, 52513, 53378, -32882, -109413, -114446, -116706, -89800, -32748, 19076, 82914, 91682, -17326, -113781, -107666, -43305, 5866, 32702, -6903, -24582, -64863, -83268, -85149, -63962, -82103, -49311, -7322, 10294, -47432, -67197, -66219, -15792, -40584, 17004, 8552, 75477, 122956, 85876, 132323, 175733, 98662, 13560, -17503, 73300]
15598G3300Q2939l0174p0197J4503m5961l0530N950N918N814N632m6109J374O890
15585b0651m1618m4110K1626L8292M4440l5881p401L192L6788R25p4717K5949
15573e3166N5110m537n8319j2504k6862Q928M448P543O2482J0341J4889l6850
15561b8497l8776k0318N5735O6800m2716m5152O3659N1292L8158k8744n0228k5426
15549d213q0817k7404N0351R194J4871r158k0190j7344L3300J2202M2775m1808
15537c8241j2687r698J3249l3857m4079L0650L4992k3710J6212J5759l145m2759
15525i7314J4134Q420M178J3570P589j1859M2937R475K847o198L7344q507Q189
15512B4805j2068m0399m5257K4573J5685J6075m6615j1452L0078l4322k2174P32
$$ y = [73300, 156239, 126065, 55868, 70371, 24410, -6120, -170, 5748, 11562, 17194, -28915, -27541, -20651, -62269, -106379, -84753, -46461, -2021, -37902, -45303, -42111, -5323, -4398, -79115, -53166, 1944, -2593, -60912, -73416, -100278, -91350, -86902, -79359, -16877, -6536, 8353, -28497, -67273, -87591, -31856, 34944, -7772, -52924, 10735, 62027, 100185, 71441, 21213, -4213, -85030, -112434, -62083, -52889, -38018, -47176, -67366, -84710, -51410, -39208, 3567, -38241, -50928, -60626, -47377, -81234, -125313, -94663, -59671, -83381, -67169, -51410, -54555, -97314, -83180, -74760, -70582, -57012, -49423, -61282, -18345, -8870, -6023, -12221, 25123, 16616, 24805, 12737, -27662, -72919, -48346, -32661, -16586, -63201, -74653, -44575, -78897, -101071, -100339]
15500a00339O1683M5329j2049l3043L107k4337k6919r279Q1270N0816j9687l1249
15488a4697K9526O5501o783j9437j9209j8570J6640J4149O1691n0533p6699K1442
15476C021k1138m041r079J526J8836J1506j2859k3085l88K8337j2434j6773K2238
15463a4333M5777j4552m3680j4957j2489K1625L8340k3455j2005j9363j7489k438
15451f9019J1893L279O3572o768J2503r339K9665L7869l4560k4885j2752k9148
15439b7690O1500l7117L078N3875n19k0897p782M270m6163k7408L5778J8883L5771
15426D5579P2733J7428j2222o521P632j9036o990J2058p58o2821j9775r154m5882
15413b7729k1848j1377L9962N1583J359k8207j9908M1836R3228Q9895p4427j00019
$$ y = [-100339, -38656, 6673, -5376, -38419, -35312, -59649, -86568, -95847, -14577, 36239, 16552, -14697, 14829, 80330, 73547, 54110, 34901, 16331, 32971, 47120, 108811, 58278, -18421, 3021, -18117, -22158, -31237, -29711, -10875, 631, -12228, -35313, -35701, -7364, -19798, -36571, -14333, 31444, 16892, -26788, -41745, -54234, -32609, 5731, -17724, -29729, -49092, -66581, -69019, -57126, -53847, 9725, 2957, 15460, 6121, 35786, 73655, 39095, 14210, 1458, -27690, 33810, -3307, -229, 53646, 53127, 32230, 24448, 28718, -17445, -44853, -9075, 9808, 45579, 118312, 135740, 123518, 116997, 124629, 105593, 98603, 110661, 109903, 47082, 27307, 18153, -27729, -49577, -60954, -20992, 30591, 31950, 3743, -16165, 25671, 118899, 208794, 134367, 34348]
15401C4348L492K9776j9358n9855m0016J0759k1938J4360R178L3753K5338j9431
15389D06m710J7815P630k3589K0594N1306J3960m2074K044j8030k7137j5885Q986
15376h684K2671K766n2201J552L3293k3908K8916j616O904m0994j7796K2295L0198
15363C396J0832j6837o357P539N0444k4837J5536n4119j8956J8817O524k5667
15351c3685j0258L6187N2144J8930k5440o2289m5313N5667J1676J4269j7477l4188
15339c9777P797Q6536j4604J3537O065L0967J8099o0305n6286L202k5243m3241
15327g3253j1362J0721J8815J9174J1731M233L146k5121n7982N1206K3492k7878
15315e3078j8760j0679J0094P7288N6145m8580l2625n373j069K0962J0970m4406
$$ y = [34348, 37840, 67616, 48258, -11597, -51613, -40854, -62792, -48432, -39254, -5501, 19837, 406, -4304, 13511, 21141, -2448, 18146, 69452, 83412, 41338, 43382, 25352, -1785, -17670, -8684, 13987, 16753, -35448, -33896, -603, -24511, 4405, 2789, 9693, -31301, -49097, -26802, 3396, 14228, -2609, -8966, -1427, 49017, 24180, 39716, -14403, -33359, -14542, -8018, -33685, -43943, -7756, 44388, 63318, 37878, -24411, -69724, -14057, -2381, 11888, -5589, -39777, -31980, 54556, 39952, 53489, 59554, 90521, 108620, 48315, -7971, -4769, -30012, -73253, -84615, -73894, -55079, -35905, -24174, -19941, -16795, -41916, -99898, -48692, -25200, -53078, -71838, -82517, -72423, 4865, 61010, 12430, -20195, -25568, -26637, -5675, 5295, -39111]
15303c9111k2671O2108J8542J1838Q203K6425L0529k4097j6384K2694J0518o6074
15291B2520m3574j9848J1406m0483L7100J9359J8394n2044p493L0829K1950L3595
15279C1711j9571N705K3236J3456j4979J5653l2443j2470O834J1319o4489k851
15267c8889L58m033n5870K2451K5114l0339k51R565P8708j6896K6253J724l1683
15254a3788j896Q158K7154J2078l1729k8736j6034m4001P487M1351P0345O0502
15242I0891j6647r9631l4453M7959m675j2700o641K4642M2917q525J351l1388
15230f900l1665L1141K7011O708p672o753l4802l1517K5990l4749L0822M0744
15218H358J07967J2708o6151O644k4521j8491j993o972q2676K783O4070o8321
$$ y = [-39111, -61782, 326, 18868, 30706, 38909, 65334, 95863, 71766, 55382, 78076, 88594, 22520, -21054, -40902, -29496, -69979, -32879, -13520, 4874, -47170, -54663, -23834, -1884, 31711, 12140, 17845, 41081, 54537, 39558, 55211, 22768, 10298, 17132, 28451, -36038, -38889, -38531, -42564, -98434, -75983, -50869, -81208, -81459, -71894, 6814, -10082, 16171, 17895, -13788, -15684, -7526, 19628, 31706, -23, -28759, -44793, -88794, -81307, -39956, 30389, 90891, 74244, -25387, -59840, -11881, -16556, -29256, -35897, -11255, 31662, 23137, 24488, -6900, -38565, -7424, 19587, 26295, 18623, 11870, -22932, -54449, -28459, -63208, -32386, 8358, 116325, 129033, 62882, 69526, 45005, 26514, 24521, 17549, -65127, -62344, 1726, -66595]
15206f6595m6326J9285M4308K3852K9729R519j7276n746J9073Q091J7438K9216
15194F4568L5643J0646l8203K936o3412K728M1710J1684m0784l8518L7637K4907
15182E1542m1683n276k3000l0013L5352k569J4974N2738J3102L1316J484l448
15170I4519k1777j9109m1645j392J1994K5958m1352k5377K5798J4960P1883n9757
15158C4703k8010K8068K6653Q912J3692q989n0825l8368M192J477M6916P892k5289
15145B1024q647J8991K407J8094q2859p3310J0091L2672N9091j6162K711r491
15133b5388n129K0564M045K4152k8929J813K8768j2371J8763J7711o739R335k0899
15120B5696R534M4170K412o3165j6732O43j9745O548o755k403k6273k9459j8105
$$ y = [-66595, -112921, -93636, -49328, -25476, 4253, 13772, -3504, -9250, 9823, 17914, 35352, 64568, 100211, 110857, 72654, 75590, 12178, 14906, 56616, 68300, 27516, -11002, 26635, 51542, 9859, 4583, -18417, -48430, -13078, -15647, -673, 52065, 65167, 96483, 97967, 94519, 72742, 53633, 11988, 10596, 22590, 48548, 7196, -18181, 7617, 22577, 94460, 34703, 6693, 34761, 61414, 70326, 84018, 75029, 24204, -14164, -9972, -8495, 38421, 46313, 21024, 12377, 31368, 33775, 51869, -30990, -104300, -94209, -61537, -2446, -18608, -15897, -25388, -30517, -9953, -5908, 18244, -10685, -8872, 19896, 7525, 26288, 43999, 37260, 46595, 25696, 35230, 79400, 81812, 18647, 1915, 2558, -17187, -10639, -17394, -19797, -46070, -75529, -93634]
15107i3634K30N3818P7060N3132M8827n2319J1633k3418j5130j5931j4528J742
15095C1482j1444N0840q493p979M5882M6790N673n5800r6507j9175n266J44M1882
15082A8029J9587n7070J9553J4127K0761l2248K0932j7782j0288O3541N2035j0967
15070A00210k6138j5074p895q769J7887L4590Q3900J7790n9203k7971j6622J8943
15058A11648l9075j09459l4473L0963L5754q706l7289N967O1399J1650k3549k5818
15046b0988p159M8902L7607M318k3838L30m3403m0074K3338J9930n718J6395o893
15033B747n2070p858K1387k442Q982k6817J8738N3165J868k749J5785K0566q318
15020D2984k9853j4804o535K7585J5948j1949N0207j160p655N9823J4001n1834
$$ y = [-93634, -93404, -39586, 37474, 90606, 139433, 87114, 98747, 75329, 60199, 44268, 29740, 31482, 20038, 70878, 62385, 54406, 100288, 147078, 152751, 96951, 444, -18731, -23997, -23853, 18029, 37616, -19454, 99, 14226, 34987, 2739, 23671, 5889, -4399, 59142, 111177, 100210, 74072, 58998, 51103, 42334, 60221, 94811, 178711, 196501, 137298, 109327, 92705, 111648, 72573, -36886, -71359, -40396, -4642, -13348, -50637, -44670, 16729, 28379, 4830, -20988, -28147, 20755, 58362, 62680, 38842, 39172, -4231, -44305, -20967, -1037, -6755, 9640, 2747, -49323, -57181, -35794, -38236, -29254, -56071, -37333, 15832, 17700, 14951, 30736, 51302, 42984, 13131, -1673, -8208, 19377, 35325, 23376, 73583, 72423, 64768, 124591, 138592, 86758]
15008H6758o9306j9430m0256m9626P100P4330Q7674M761l3349o1230m4664J3652
14996d3586N6869M9365j4426n099J0093K6917K2265n2538k3584L9844l1859l8041
14984c780O2700K3845k9025o3295K414K8418j830J579m2063n6975K980N3721K2662
14971A351n4560j4169P4876N560o0897m5720j2066J8778N2101N5308j5510J3352
14959A8404m7036Q145L8430J4766j1174l3319p941J9777Q262p851k3797K8608
14947E274J3615K0526k5757r642K9310J9451m5114j3929J0924J213L1085K1152
14935E8108M3755k3167J8499k5603M627j4577k9273J0775K0225K9063j4527q4037
14923f132o600l8893J9886K731j096m779N1013m803o1090k099L4316L7289L8098
$$ y = [86758, 17452, -1978, -42234, -91860, -84760, -10430, 77244, 82005, 48656, -12574, -57238, -43586, 13283, 62648, 48222, 43123, 53216, 80133, 102398, 49860, 26276, 66120, 34261, -3780, 58920, 82765, 53740, -9555, -7141, 21277, 19447, 21026, -21037, -78012, -75032, -21311, 1351, -53209, -67378, 7498, 13058, -47839, -93559, -105625, -86847, -34746, 20562, 5052, 18404, -28632, -20487, 17943, 32709, 21535, -11784, -19725, 52, 8314, 463, -23334, 5274, 18889, 39415, 13658, 4016, 33326, 52777, 7663, -6266, 4658, 5871, 36956, 58108, 101863, 78696, 97195, 71592, 76219, 61642, 32369, 43144, 63369, 92432, 77905, -6132, -12732, -51625, -31739, -29008, -30104, -34883, 16130, 11327, -49763, -51862, -17546, 19743, 57841]
14910E7841j191N087M9201l6452n8362p3252N0480J1460l9986L5639n824L0042
14898B4683p2305J9066M2210J5525J9509M3682R0n6217p7374j6368j2328K975
14886f6852L5200N834j9672m438O6552L6135k4578n5466R188k0917l3532J5450
14874e7096P6040L1224l8268K0839j0660l01m2794j5885M6327K4185K8351m9985
14862A1977J1192q341L0551j4100o6738k6493Q946J9571j7055J0875L0443M4083
14850C4911k9195N834k233j3139j9931M6327j6950r037K9999l9109n2180J1774
14838e2929k4392J4521L2541K3157M3518R695m8777j7835j1196n298k7831o1152
14826a25978j597K4997M7568q622m8072J1854L6643J8162L7364J6594K7158l8137
$$ y = [57841, 56650, 61737, 110938, 74486, 16124, -57128, -6648, 4812, -35174, 465, -5359, 24683, -47622, -28556, 13654, 29179, 48688, 92370, 92460, 36243, -41131, -57499, -69827, -66852, -31652, -25818, -45490, -49928, 16624, 52759, 28181, -27285, -18097, -39014, -72546, -57096, 18944, 50168, 11900, 32739, 22079, 21778, -21016, -36901, 9426, 33611, 61962, 11977, 23169, 14828, 45379, 31279, -35459, -61952, -53006, -33435, -50490, -39615, -9172, 34911, 5716, 11550, 9317, -3822, -23753, 22574, 5624, -3413, 26586, -12523, -64703, -52929, -77321, -62800, -30259, -7102, 36416, 46111, -2666, -20501, -31697, -36995, -64826, -125978, -127575, -102578, -55010, -63632, -111704, -99850, -63207, -45045, -7681, 8913, 36071, -2066]
14814b066k3078M534K3018q253J7754Q8436k1029k2890k4990k5114k858R032K5079
14801C7575J1625m018q8823j7962K6946J9831l1114k4986q52k2276k5148J4358
14789a04844O3698L2752j2123j084l4203j9988j2725L0207R143K1514J8004O381
14777c268R656J221m0942l9736J0070O5489p594k2003j240k1982n179K6969k3992
14764e2531m2256j5533J0079M492K9772N0713j3044k1057k9631J7616K8023O4000
14752C0643r172p8785K6633K6868K1730K9960K1804j6064k0189q914P208k3799
14740G923n1734q2549L9169J00033M8561l3041j8074j2917j0491l9670O5847M2241
14728E5298l5004n5727k1458k464O4545L5419l8557m1910p710K4350L9289m0497
$$ y = [-2066, -25144, -20610, 2408, -5845, 11909, 100345, 79316, 56426, 31436, 6322, 3464, 12496, 37575, 49200, 45182, -43641, -61603, -34657, -14826, -45940, -70926, -71778, -94054, -119202, -104844, -41146, -8394, -20517, -21601, -55804, -75792, -88517, -58310, -49167, -27653, -9649, -3268, 6388, 7609, -33333, -73069, -62999, 2490, -5104, -27107, -28347, -50329, -55508, -28539, -52531, -94787, -110320, -100241, -95749, -65977, -15264, -28308, -49365, -78996, -61380, -33357, 30643, 21471, -57314, -30681, -3813, 17917, 47877, 69681, 53617, 33428, 24514, 31722, 7923, -43811, -126360, -87191, 12842, 61403, 28362, 10288, -2629, -13120, -52790, 13057, 55298, 20294, -35433, -56891, -59355, 5190, 40609, 2052, -39858, -47568, -23218, 16071, -24426]
14716b4426o2538l7470l2577M9560N5766J4052M4624K2411M0157m4489L1540j1308
14704D5302L2775q31j7463n3995m835k5001K2244m2067L48o708J10347L0158o7543
14691B2731J605J1718R3123N5649r31M090q9657k9985K7330j9078q6041q5195
14679i4641l7600N2802N9310p07M5971J2308k3125j9590j3771N244O3293M843
14667E4337l3552j7706k717J9486L3M2463l3365L3554K1581r1415k1490J1208
14655a7583L7172M7614N3545K1279K7313O5417J01168O8794M3662k8744R945j11925
14643C17657j44741j02067o7488K926l1548K0502K8383O8468j1955l6305M2938
14632H6770K1004m541Q049k0767j0888J1470j9032l0283K9125K7968n4008p8250
$$ y = [-24426, -86964, -124434, -157011, -107451, -51685, -37633, 6991, 29402, 69559, 25070, 56610, 45302, 78077, 77246, 59783, 5788, 953, -24048, -1804, -43871, -43523, -50231, 60116, 90274, 22731, 24336, 36054, 129177, 184826, 183895, 187985, 98328, 68343, 95673, 76595, -9446, -94641, -132241, -79439, -20129, -20836, 25135, 37443, 14318, -5272, -19043, -13799, 49494, 54337, 20785, 3079, 362, 19848, 19881, 62344, 28979, 62533, 84114, -7301, -28791, -17583, 19589, 67203, 120748, 142027, 169340, 234757, 335925, 404719, 448381, 419637, 429582, 317657, 172916, 70849, 3361, 6287, -25261, -4759, 23624, 92092, 80137, 43832, 86770, 107774, 103233, 111282, 90515, 79627, 91097, 72065, 41782, 70907, 98875, 44867, -33383]
14620c3383M337L7970L0950L2398r863j8231K1608K3560N8579Q3505J21175J58137
14608E10742J03777N0600n6238m3135j16934j05444p7594l5439k7349j3606l0215
14597A59165k9058k1292j2526J6421n066L6553m746r5321O817J8877k9711Q377
14585D8490J2375r523m7604k0253J3136L617K8453q812j5618M9942M7512L0259
14573A31974L712M7112Q8405R7961P1215K6277l7394l8096n0811j26153r8919
14562A15283j9233N604P639n0202k5188o5892j790Q572K8590l0927K972j8889
14550d3461k8428J5585j7800J1453K9005K4416Q4416K3302l2028M284l3838O481
14538D3387L1491m870L9281O9850k7673p3203L8205L1791L9912L3894K364n0072
$$ y = [-33383, -29046, 8924, 39874, 72272, 62409, 44178, 65786, 89346, 147925, 231430, 352605, 510742, 614519, 665119, 608881, 565746, 448812, 343368, 265774, 230335, 202986, 189380, 159165, 130107, 108815, 96289, 112710, 107644, 144197, 139451, 44130, 50947, 69824, 40113, 48490, 60865, 51342, 3738, -16515, -3379, 238, 28691, 19879, 4261, 54203, 101715, 131974, 135686, 182798, 271203, 369164, 440379, 466656, 429262, 391166, 340355, 214202, 115283, 96050, 101654, 109293, 59091, 33903, -31989, -33779, -25207, 3383, -27544, -24572, -43461, -71889, -56304, -74104, -62651, -33646, -9230, 75186, 98488, 66460, 70744, 36906, 43387, 74878, 70008, 109289, 179139, 151466, 78263, 116468, 148259, 188171, 222065, 224429, 174357]
14526A74357j5391k0224r7220k7043R107J3422l3657j1463o719N354J7023P468
14514A5014k7735k1749J909l6720k5262J0679M9778L4510M3794r604j06142p1369
14502a42897J4700P4023j6489L4357K8015j1185J2588L6848j9240l3422j361k697
14490b6760K5840l948j0332l9834P301L7902L5268J732m0706J017n1716p703N2141
14477a9798O5304l9736q2369M9855L2285K4535k4998k4P3786K1654q4190k9034
14465a2730q568L9463J4442o107k1321l9965J92O294j4511q441k2970j5444L1706
14452e7960M1210j698J9877k3334L6685k4509k5534L1590O462m9971O5581M4767
14440F3166j1012Q847m05k0741o4247l8233J2190Q2647K0471k2229L3707J0238
$$ y = [174357, 158966, 138742, 41522, 14479, 23586, 37008, 3351, -8112, -14831, -9477, 7546, 15014, -12721, -34470, -32561, -69281, -94543, -83864, -34086, 424, 44218, 34614, -71528, -142897, -128197, -54174, -70663, -36306, -8291, -19476, -6888, 29960, 10720, -22702, -24063, -26760, -920, -4868, -15200, -55034, -47733, -9831, 25437, 27169, -13537, -12520, -64236, -71939, -19798, 45506, 5770, -76599, -26744, 5541, 30076, 5078, 5054, 78840, 100494, 16304, -12730, -21298, 18165, 32607, 26500, 5179, -34786, -34594, -28300, -42811, -51252, -74222, -89666, -57960, -16750, -18448, 1429, -21905, 14780, -9729, -35263, -3673, 2789, -47182, 18399, 63166, 52154, 61001, 60596, 39855, -24392, -62625, -50435, 32212, 52683, 30454, 64161, 74399]
14428G4399q152n1748k6593j6902m7512r0552K3946N6588M7398L5126k603L045
14416c560k6756J8876K6664o365l6992p068K5850K4873J5921j1274J7429J3256
14404E0854m4921n5599l9277N7869P5158P9646K4873m2700l761k4803l2675P930
14392E2594j7847r13J3200N1429m912k257R709l9842o5404R881K6421l9695p9454
14379h7090j796r720K0373L4988k8025j5944m4031J221P3957M3861L3979L6667
14367E8440l3288j8303J0123p223j9362P637k800K142K6582j5556m2831m1844
14355g6283k9617K8530N4345M6000J3848J8322L2334k5210j05451L712O2682L150
14343B6362N912L6654n762k5369j2225j5405m5364l6394j0635P9216O7039o645
$$ y = [74399, 66247, 14499, -12094, -28996, -76508, -167060, -143114, -86526, -39128, -4002, -6605, -3560, -30316, -11440, 15224, 8859, -28133, -35201, -9351, 15522, 31443, 20169, 37598, 50854, 5933, -49666, -88943, -31074, 44084, 123730, 148603, 105903, 102142, 77339, 44664, 52594, 34747, 33834, 47034, 98463, 93551, 91294, 101003, 61161, -4243, 5638, 32059, -7636, -87090, -88886, -98606, -78233, -43245, -71270, -87214, -131245, -130024, -56067, -12206, 21773, 58440, 25152, 6849, 16972, 9749, -9613, -1976, -4776, -2634, 23948, 8392, -34439, -76283, -105900, -77370, -23025, 22975, 36823, 55145, 87479, 62269, -43182, -39470, 23212, 26362, 32274, 68928, 63166, 37797, 25572, 10167, -35197, -71591, -82226, -3010, 64029, 57384]
14331E7384q356q55o3852P964M8423L8739j9544m613o4958q599P145m120L5808
14318B0566k2268k3813l9296j34M8242L4543N479l2463K4441j3843m8241l2752
14306g9539r953J0652j7838J5704J7718r645J2573J1510J4719j4698Q5315K4190
14294F0708q8466j9787L4705J3778k0247L5505J0877q5511m8466N0082k538N49
14282e8811L7059L2011M0998J1401l9873r194k2849p0133R824J9471M8453p336
14270h979j6697k1275N8792J79j7738P2339j546k3336K6671l415m7764m4992J7087
14257a0674k2371N9176J3739R457j3408o3986l7232J2123K1945J1715L1072q314
14245C242K5904L7464l5151r278J9657J5847M7473o0773o1077K0371J4384K2893
$$ y = [57384, 49028, 48173, -15679, -7715, 40708, 79447, 59903, 55290, -9668, -18267, -11122, -15242, 20566, -1702, -25515, -64811, -64945, -16703, 17840, 23319, -9144, 15297, 1454, -46787, -79539, -89492, -78840, -96678, -80974, -63256, -72901, -60328, -48818, -34099, -48797, 36518, 60708, -27758, -47545, -12840, 938, -19309, 16196, 27073, -58438, -106904, -56822, -59360, -58811, -21752, 10259, 51257, 62658, 22785, 13591, -9258, -79391, -69567, -50096, -1643, -8979, -25676, -46951, 11841, 12020, -5718, 66621, 65075, 41739, 68410, 64995, 17231, -27761, -10674, -33045, 26131, 39870, 49327, 35919, -28067, -65299, -53176, -31231, -19516, 11556, 3242, 29146, 66610, 31459, 22181, 41838, 57685, 105158, 44385, -16692, 3679, 18063, 40956]
14233D0956K5257k207j4105m290J9094l4579k0631j0439j5685j6664K6462j0474
14221a7305K1588L4807R094J810K149l0645l2518k512J7420k6884k9622O5207
14209A2589R953l3591m6405L3549J681j250N8554r12k9975m780K48J26j3766J8868
14195D889j1356n611j8487m3086P986P8599P7776L4254l199J0462j8k0244k4916
14182H7049J1783k5590l3691k552m5888m1035J4953L478J7022K8783L3326J5612
14170F3250j4464n1289J1618J940K3729O400j4306n7868P680o6406J9921M4269
14158b5526J6862P0466J2184k4537J2350J6098j0359p2368k6058r693L4251L3089
14146B6759K4005o7645j0784M6985N2448J3541K9511r647l1011L6252O553m6239
$$ y = [40956, 66213, 64006, 49901, 45611, 64705, 30126, 9495, -944, -16629, -33293, -6831, -17305, 4283, 39090, 48184, 49994, 52143, 21498, -11020, -13532, 3888, -22996, -52618, 12589, 22542, -11049, -57454, -23905, -22224, -23474, 35080, 34168, 4193, -587, -339, -213, -13979, 4889, -6467, -12078, -30565, -73651, -65665, 12934, 90710, 124964, 121765, 132227, 132209, 111965, 87049, 98832, 73242, 39551, 36999, -8889, -49924, -34971, -31493, -14471, 14312, 47638, 63250, 48786, -2503, 9115, 11055, 34784, 41184, 26878, -30990, -23310, -89716, -69795, -25526, -8664, 61802, 73986, 49449, 61799, 77897, 67538, -4830, -30888, -40581, -6330, 26759, 50764, -16881, -27665, 19320, 71768, 85309, 114820, 105173, 74162, 110414, 116967, 70728]
14134G0728m4694K9800j5920l6312l0078K5360k2516m964L1462J5872J7768J4430
14122E0936o8521k1845k3946M2747Q9582j9536k6901l3274J3642J5645k8718J9445
14110I256j2377q109l1138k0438N3308o808j4701K5849K8691m0956j6943L4856
14098D90K7552O0441L0381k6262l4408m1597m6662l0467Q103J1006P16J3652K6080
14085i75J6270k0854J5027K1210L2331O0950l7022l6351n5458J9146J9367j6402
14073A7239J8731O019r35m5899Q691L52K4701M8751j0032L1358P182n2112l7067
14060A6979j1245l5014J2434N5424L6245o5188k8236K0001K7052L1837l3001r57
14048B6331K0703L6826M5480j5180o4364r936M8j5697l1864J6309M5327M4452
$$ y = [70728, 26034, 55834, 39914, 3602, -26476, -1116, -23632, -28596, 2866, 18738, 36506, 50936, -17585, -39430, -63376, -20629, 68953, 49417, 22516, -10758, 2884, 18529, -10189, 9256, -3121, -11230, -42368, -62806, -9498, -16306, -31007, -5158, 23533, -17423, -34366, 490, 28042, 88483, 118864, 92602, 58194, 16597, -30065, -60532, -52429, -41423, -40707, -27055, -975, 15295, -5559, 9468, 30678, 63009, 123959, 86937, 50586, -4872, 14274, 33641, 17239, 35970, 41989, 41054, -4845, 3846, 4198, 28899, 77650, 67618, 98976, 106158, 54046, 16979, 5734, -29280, -16846, 38578, 74823, 9635, -18601, 1400, 28452, 60289, 27288, 26331, 47034, 83860, 129340, 114160, 49796, 39860, 39908, 24211, -7653, 8656, 53983, 98435]
14036I8435J7348j435j7831p9363k6990N801j6216n1474K9792j3696n791M6337
14024a5083N9076k5936j0835k2518J317M9285K1770l5438L831M3979K6310j5815
14012G9943m4496n9756r63K8444q531j8421M6343j0377l8202K2929N0165m622
14000D2456k6259J448J3847L3010n4912n013M1126M180M7483O2269k5435o7233
13988F6967q01n5187l5856J8851J0211q601M522J0944l2821k925N5069k2357k850
13975E166N9036j0012n7804P3822N1224j5300m7522j0783N463K7956K1004K4272
13963A26522J3241K3304Q004o8413k8851J5380Q233l1669n6575R34K3133L0432
13951F3675o711l5696J6219l3173P969J2606l131j0444k4004l744n9924k6261
$$ y = [98435, 115783, 114348, 96517, 17154, -9836, -4035, -20251, -71725, -41933, -55629, -61420, -15083, 43993, 18057, 7222, -15296, -13979, 35306, 57076, 21638, 25469, 69448, 95758, 79943, 35447, -24309, -25272, 3172, -5359, -23780, 22563, 12186, -26016, -3087, 47078, 42456, 16197, 17645, 31492, 64502, 9590, 4577, 45703, 49883, 97366, 159635, 134200, 66967, 66166, 10979, -24877, -6026, 4185, -4416, 106, 11050, -21771, -24696, 30373, 8016, 5166, 64202, 54190, -3614, 70208, 121432, 106132, 58610, 47827, 53290, 81246, 102250, 126522, 139763, 163067, 171071, 102658, 73807, 89187, 97420, 65751, 9176, 10110, 33243, 63675, 56964, 21268, 37487, 4314, 12283, 24889, 21758, 11314, -12690, -16434, -76358, -102619]
13939a02619M2067N6848n4552k7149K9260O7325K1525J4090J2027M195n1254m2276
13927c0513k230l0603K7805O7380L0420j6557j05166n6134k628L4102K343K9630
13915e2151M5715N9220L3187j3011k3350r663Q953K9163l3405k3789K8838j5703
13903C4004j0738K9829l973Q580J2261k1946J0131K0811J1529r404M239J7367
13891A02690j2713L277k4880m7254M336k6776j6818M411K5530J9489O2134K6866
13879A20292n811O38l9725k069j485j29713j8660K2866K9230J6050j9998J1122
13867a7263P1588J1225j2611K4337M1866K0752l5748k1131o0523m282j0770J3660
13855B1100M382J726L0602K5854L8128P925n3628k8161j9088J4931J7311p003
$$ y = [-102619, -60552, -3704, -58256, -85405, -56145, 11180, 32705, 46795, 58822, 63017, 11763, -30513, -32743, -63346, -35541, 31839, 62259, 45702, -59464, -115598, -118226, -84124, -81781, -52151, -6436, 52784, 85971, 72960, 49610, 39947, 48900, 78063, 44658, 20869, 49707, 34004, 23266, 53095, 49122, 57702, 69963, 48017, 58148, 78959, 90488, 81084, 85323, 102690, 89977, 93254, 68374, 21120, 25456, -1320, -18138, -13727, 11803, 31292, 93426, 120292, 114481, 115119, 75394, 73325, 71840, -57873, -76533, -53667, -24437, -8387, -28385, -17263, 54325, 65550, 52939, 77276, 119142, 139894, 104146, 83015, 22492, 18210, 7440, 21100, 25482, 27208, 57810, 83664, 121792, 129717, 76089, 47928, 28840, 43771, 61082, 54079]
13843E4079m4037o053m744m1305O5601N4578M4439L5824n9211r8603K317L6416
13831C9301J0580J5752j273M8200L3254n0675m1892k1358J1538M6204k6516l7390
13819B5725j6733K6184k33O472j9453j6627L7089L4093O914o3957q512K9038j9644
13806B0356l8198L1055N7641R024o0681m5262N076M7077L8428Q564M2571O1406
13794A77057j3877n5196Q018p452j5592K873l7800j3729R254o3346Q904R609m5192
13781c6469L0181P3447J6235m3720j333R7091j5935n3330j9064l3340O9352L2511
13769A15626J1694k234m9297o6040J6430K7793j3032J5081N5224n2805j2817Q783
13757E4406K4890o573N5306j071n1732r082Q267l3879o1167j3902R564O9714Q1534
$$ y = [54079, 10042, 3989, -755, -42060, 23541, 78119, 122558, 158382, 99171, 568, 2885, 39301, 49881, 65633, 64360, 112560, 145814, 95139, 53247, 31889, 43427, 89631, 63115, 25725, 8992, 35176, 34943, 41415, 21962, 5335, 42424, 76517, 83431, 19474, 10962, 40000, 20356, -17842, 13213, 70854, 79878, 19197, -26065, -20989, 26088, 64516, 73080, 115651, 177057, 163180, 107984, 116002, 108550, 92958, 95831, 58031, 44302, 53556, -9790, -886, 8723, -36469, -6288, 67159, 83394, 39674, 38341, 135432, 119497, 66167, 47103, 13763, 83115, 115626, 127320, 125086, 75789, 9749, 26179, 53972, 40940, 56021, 111245, 58440, 45623, 54406, 79296, 72723, 128029, 126958, 75226, 66144, 74411, 40532, -20635, -34537, -24973, 44741, 126275]
13744A26275N0623l930r6282q893M4275J5729l7337k5242k8571L5958M4464j1340
13732A05729p6306N7340j9469k6381J4989m107P354N4520K3138M580N1281k473
13720A90195k5138p2174r963M232l1595N2089j9856k8005k854L9740K4930N6783
13708A78384k8148k6979L6753j3550J3684P192m5097n3542o833P085l8734l7761
13696g546M3559N1643k0646N0388J1425j3875R073m0370J9198J8750m0970l9430
13684D1199k6577Q6656P3720j9635m0871m5877Q449N5350N166M587J878J3856
13672A57901k339L820j3883n05m9480o0580j4201J2806M6278J2776k0763r096
13660F2734L8959J5813J0426k911r387q566j9808J3386K9712J47m5044Q285J3154
$$ y = [126275, 176898, 172968, 76686, 67793, 112068, 127797, 90460, 65218, 36647, 72605, 117069, 105729, 29423, 86763, 67294, 40913, 55902, 51795, 59149, 113669, 136807, 141387, 192668, 190195, 165057, 92883, 82920, 87152, 55557, 107646, 87790, 59785, 56931, 96671, 121601, 178384, 150236, 123257, 160010, 146460, 160144, 167336, 122239, 68697, 61864, 68949, 30215, -7546, 36013, 87656, 67010, 117398, 128823, 114948, 124021, 83651, 102849, 121599, 80629, 41199, 14622, 101278, 174998, 155363, 114492, 68615, 77064, 132414, 137580, 142167, 144045, 157901, 155562, 159382, 145499, 144994, 95514, 34934, 20733, 33539, 79817, 92593, 71830, 62734, 101693, 117506, 127932, 125021, 115634, 107068, 87260, 100646, 130358, 130505, 85461, 93746, 106900]
13647A06900L0712L3123n6703p3506J1379J601n0362K669M6092M2664K1409j4009
13635A01969j2590n5048p356J8255k1528m9320j0855J4945M8709K1367k1684K6542
13623E3406L4157m700j6835K5246K6806m2651p9470M2486M4680q916Q288J5762
13611I8259J834m9014j3987L264R095J4530J7607K0807M9895L3800J5509j9249
13599A82350j16021l7486N6307r720m6252K391M4640P773j7929L8081l4439O2957
13587A32652N4504L9061o1398p4069j5880J2529K810J6737K9532k6824O453j3759
13575A02348J5977m3210m579O5142J639m2880P2592M5279p1745p1649J8619k0452
13563F7081m3594j1009Q4256o1015n7820L0322M6760K4132j5784J0822j0687J2891
$$ y = [106900, 137612, 170735, 114032, 40526, 51905, 53506, 3144, 5813, 51905, 94569, 115978, 101969, 89379, 34331, 26975, 45230, 23702, -25618, -36473, -21528, 27181, 48548, 26864, 53406, 87563, 82863, 66028, 91274, 118080, 75429, -4041, 38445, 83125, 74209, 82497, 98259, 100093, 51079, 37092, 40356, 49451, 63981, 81588, 102395, 152290, 186090, 201599, 182350, 66329, 28843, 85150, 75430, 29178, 31569, 76209, 83982, 66053, 104134, 69695, 132652, 187156, 226217, 164819, 90750, 74870, 87399, 90209, 106946, 136478, 109654, 116107, 102348, 118325, 75115, 70536, 135678, 137317, 94437, 167029, 212308, 140563, 68914, 87533, 67081, 23487, 12478, 96734, 35719, -22101, 8221, 54981, 79113, 63329, 74151, 63464, 76355]
13551G6355L9778l6515n1711J0769j6398K4878J0651k276Q0010N2245l944p2083
13539A11759o6936l5927j2696N0447M6958r58J8686O470l6048O0299L9171J6385
13527A97610M0861o2219r1165p6989o67l1497M8987K9679L6506J1933L2667J4479
13515A50185K712j2992L7784K9308k9652K0103J2392p2262p7435N1786K0709o582
13503A26056j3139l7075K9651q500N72M953K0153J5560L6894n7588r6733m2354
13491b1550N4373O4484L3779q601l5927n264M7822q240k7861O8546M2437l5596
13479A68402n153n8548n7713l2934o594M381l8717j3706K5722O3073Q0719m0646
13467H8286k9962M052m4J6035k0246N358l871L876J4839j3906P716O2829L0179
$$ y = [76355, 116133, 79618, 27907, 38676, 22278, 47156, 57807, 55531, 135541, 187786, 183842, 111759, 44823, 8896, -3800, 46647, 93605, 92647, 111333, 117803, 81755, 142054, 181225, 197610, 238471, 176252, 85087, 8098, 7431, -24066, 24921, 54600, 91106, 103039, 135706, 150185, 152897, 139905, 177689, 206997, 177345, 197448, 209840, 137578, 60143, 111929, 132638, 126056, 112917, 75842, 105493, 96993, 97565, 102518, 122671, 138231, 175125, 117537, 20804, -21550, 32823, 97307, 131086, 122485, 86558, 81294, 129116, 120876, 93015, 161561, 203998, 168402, 163249, 104701, 46988, 14054, 7460, 11841, -26876, -40582, -14860, 48213, 128932, 88286, 58324, 62376, 62332, 78367, 58121, 63479, 59608, 63484, 78323, 64417, 72133, 134962, 165141]
13454A65141k3396J3333l1018m0614K0687j393O756N042J2032m5828n1899P64
13442B9607N4446N1628m3081k8783L2792p78P912N9679J9683l1107l8341k4503
13430H9154j2965m1340J0494M3218R205j9700J6448r015M1302N4058K4090R66
13418B05915l547k7322J4945J6222k6078J8769j4771j9203j7832k73k5895n2164
13406F8766N0678K7001J4051r798Q636J2287j4851o3231k7607Q6381Q7607k9642
13394B10278k2968q1871k7759M8336M1408N2095n0028k0784p438q01N8986l2591
13382A66863L7044k89k8398n926j470m548J292J6225m7859N4659P0140j06800
13370A50933o0503L1199O3861J0274k3812k9833J475N0966o4791p4553K1053K3911
$$ y = [165141, 141745, 155078, 124060, 83446, 104133, 102740, 109496, 114538, 126570, 80742, 28843, 29607, 84053, 135681, 92600, 63817, 96609, 95831, 103743, 163422, 183105, 151998, 113657, 89154, 76189, 34849, 45343, 88561, 97766, 78066, 94514, 85499, 126801, 180859, 204949, 205915, 202368, 175046, 189991, 206213, 180135, 198904, 184133, 164930, 147098, 146825, 120930, 68766, 119444, 146445, 160496, 150698, 159334, 171621, 156770, 93539, 65932, 152313, 239920, 210278, 187310, 105439, 77680, 126016, 167424, 219519, 169491, 148707, 141269, 140468, 199454, 166863, 203907, 203618, 175220, 169294, 167824, 163276, 164568, 180793, 132934, 187593, 257733, 150933, 90430, 121629, 185490, 195764, 171952, 142119, 143594, 194560, 129769, 55216, 76269, 100180]
13358A00180O4617P122J4369K718k7628J1917l8030r822M436o2842k2396j1360
13346C3281Q2810O9777q677J242n132k9901k0000n3335K1396L0135l0071m0001
13334E1524K868O618J0416K2589L8881l3704K5993l537J6488K9690k9512L1703
13322A70017M5468J551p5764k0064P4464J4524k2143J6680J8542k6906m0575j8813
13310A36981q1L4339P758r30J806k398j9789N9780L3630l2733m4778l0799O227
13297A49013N0618J8844j982q245J4510m34n7022m1574Q203o794R760k1495j9751
13284I3651J8645M4128L0480j739o004K0521n0875p0151k6907J2313O0754P5354
13272B00170m0264l9171m7128M7876N7426j8454k2313j2695j6815l846Q2232P1401
$$ y = [100180, 164797, 171919, 186288, 189006, 161378, 173295, 135265, 125443, 129879, 67037, 44641, 33281, 116091, 185868, 177191, 178433, 173301, 143400, 123400, 70065, 91461, 121596, 91525, 51524, 54392, 61010, 71426, 94015, 132896, 99192, 125185, 121648, 138136, 167826, 138314, 170017, 215485, 217036, 141272, 121208, 195672, 210196, 188053, 204733, 223275, 196369, 155794, 136981, 136900, 171239, 178997, 178067, 179873, 177475, 157686, 217466, 251096, 218363, 173585, 142786, 149013, 199631, 218475, 216493, 208248, 222758, 222324, 165302, 123728, 131931, 125137, 134897, 113402, 93651, 112296, 156424, 186904, 185165, 179161, 199682, 148807, 78656, 51749, 64062, 124816, 200170, 159906, 120735, 73607, 121483, 178909, 160455, 138142, 125447, 108632, 104786, 187018, 258419]
13260B58419L1074k7677l9149m4944m4048q297P4002L2042m903o1398j1533m338
13248A49250j5117P3396K8488l3582N1632j876l4273n738M2816Q9199k2422k4269
13236B97504q612K050l1269j02j4332k4562l2904j8913J9102L4618N9251O0741
13224C42572n781k7973o1068o7069l9972k6288j3014N5858M4549k223l5826k9971
13212A33794m7982N7832N912M7365K3781M668K139p646m7515K029L0550q220N763
13199B02470k0306P019Q9889J8024j530o4122m4894N021J6601J3916L5003J2183
13187B69274J7457O847m079m899J336O4754L5512N6551J6665j471l1938n3322
13175C72687o0496l1215k7320k9570p019m0146l9270m3838L2871L1567N8616L4039
$$ y = [258419, 289493, 261816, 222667, 177723, 133675, 125378, 199380, 231422, 226519, 165121, 153588, 149250, 134133, 207529, 236017, 202435, 254067, 252191, 217918, 212180, 254996, 344195, 321773, 297504, 288892, 290942, 259673, 259571, 245239, 220677, 187773, 168860, 187962, 222580, 281831, 342572, 336791, 308818, 247750, 180681, 140709, 114421, 101407, 157265, 201814, 199591, 163765, 133794, 85812, 143644, 149556, 196921, 220702, 225370, 227509, 219863, 172348, 174377, 204927, 196707, 202470, 182164, 189183, 279072, 297096, 295566, 231444, 186550, 191571, 208172, 222088, 257091, 269274, 286731, 293578, 289499, 284600, 285936, 350690, 386202, 442753, 459418, 457947, 426009, 372687, 312191, 280976, 253656, 224086, 217067, 176921, 137651, 93813, 126684, 158251, 216867, 250906]
13163B50906n5119M6896L2168l229K8761L4537K2079j0082k7379m6193m9287m4522
13151A79536P1816N2908n4593j3699Q6006O8344k7093r9601j5306j5951K9100
13140B61467N0951M5173l1131L6477Q9646l141p5899n2475j7319O833N431k8168
13128B87845Q077p292l3666j4606J3425M0587m0968N3026M2939j5600m1209k6423
13116B66135L9838L0042J4954J3873J9925k8943l3107L659m3071l1431K9669J9942
$$ y = [250906, 195787, 242683, 274851, 271622, 300383, 334920, 356999, 346917, 319538, 273345, 224058, 179536, 251352, 304260, 249667, 235968, 321974, 390318, 363225, 263624, 248318, 232367, 261467, 312418, 357591, 326460, 362937, 452583, 449442, 373543, 321068, 303749, 310582, 316013, 287845, 295922, 288630, 254964, 240358, 253783, 294370, 253402, 306428, 349367, 333767, 292558, 266135, 305973, 336015, 350969, 364842, 384767, 355824, 322717, 326376, 283305, 251874, 281543, 301485]
$$ [...]
##END NTUPLES=NMR SPECTRUM
##END=
