##TITLE=Analysis number 320402
Compound Code aw 01252
Project Code adrs
Chemist Name endeavour
##JCAMPDX= 6.0         $$ Bruker NMR JCAMP-DX V2.0
##DATA TYPE= NMR SPECTRUM
##DATA CLASS= NTUPLES
##ORIGIN= Bruker BioSpin GmbH
##OWNER= nmr
$$ XWIN-NMR		Version 3.5
$$ Fri Jun 23 09:02:59 2006 GMT Daylight Time (UT+1h)  MAYBRIDGE\nmr@NMR_250MHZ
##.OBSERVE FREQUENCY= 250.131544655141
##.OBSERVE NUCLEUS= ^1H
##.ACQUISITION MODE= SIMULTANEOUS (DQD)
##.ACQUISITION SCHEME= undefined
##.AVERAGES= 16
##.DIGITISER RES= 18
##SPECTROMETER/DATA SYSTEM= dpx250
##.PULSE SEQUENCE= zg30
##.SOLVENT NAME= CDCl3
##.SHIFT REFERENCE= (INTERNAL, CDCl3, 0, 16.522)
##AUDIT TRAIL= $$ (NUMBER, WHEN, WHO, WHERE, WHAT)
$$ ##TITLE= Audit trail, XWIN-NMR		Version 3.5
$$ ##JCAMPDX= 5.01
$$ ##ORIGIN= Bruker BioSpin GmbH
$$ ##OWNER= nmr
$$ C:\u/data/dgb/nmr/ADRS/1290/pdata/1/auditp.txt
$$ ##AUDIT TRAIL=  $$ (NUMBER, WHEN, WHO, WHERE, WHAT)
(   1,<2006-06-23 09:02:38.25 +100>,<MAYBRIDGE\nmr>,<NMR_250MHZ>,
      <created by zg, POWCHK disabled, PULCHK disabled
       configuration hash MD5:
       E2 DF 36 D8 04 B2 41 60 5A D7 A3 38 5A 4B D0 FE
       data hash MD5: 64K
       0F A1 EF 4F 98 67 2F 95 03 D6 F1 FD 30 54 80 33>)
(   2,<2006-06-23 09:02:50.85 +100>,<MAYBRIDGE\nmr>,<NMR_250MHZ>,
      <Start of raw data processing
       ef LB = 0.3 FT_mod = 6 PKNL = 1 SI = 32K 
       data hash MD5: 32K
       52 3B 36 76 7F 3F F3 E2 E3 20 A9 87 0E 53 DA 44>)
(   3,<2006-06-23 09:02:52.39 +100>,<MAYBRIDGE\nmr>,<NMR_250MHZ>,
      <apk 
       data hash MD5: 32K
       9C F1 67 BA 9B BF BF 9D 03 DD 23 14 42 D5 C4 88>)
(   4,<2006-06-23 09:02:53.10 +100>,<MAYBRIDGE\nmr>,<NMR_250MHZ>,
      <abs ABSG = 5 
       data hash MD5: 32K
       38 62 A8 58 55 B6 5A 1A B4 0D 14 DA 2C CC F9 95>)
$$ ##END=
$$ 
$$ hash MD5
$$ 9B 70 D1 F9 AA AA B8 32 4E D8 3B D0 D4 0A B3 A4
##$RELAX= 
##$RELAX= 
##$RELAX= 
##$RELAX= 
##$RELAX= 
##$RELAX= 
##$RELAX= 
$$ Bruker specific parameters
$$ --------------------------
##$DU= <C:\u>
##$EXPNO= 1290
##$NAME= <ADRS>
##$PROCNO= 1
##$TYPE= <nmr>
##$USER= <dgb>
##$AMP= (0..31)
100 100 100 100 100 100 100 100 100 100 100 100 100 100 100 100 100 100 
100 100 100 100 100 100 100 100 100 100 100 100 100 100 
##$AQSEQ= 0
##$AQ_mod= 3
##$AUNM= <au_zg>
##$AUTOPOS= <5 >
##$BF1= 250.13
##$BF2= 250.13
##$BF3= 250.13
##$BF4= 250.13
##$BF5= 500.13
##$BF6= 500.13
##$BF7= 500.13
##$BF8= 500.13
##$BYTORDA= 1
##$CFDGTYP= 0
##$CFRGTYP= 5
##$CHEMSTR= <none>
##$CNST= (0..31)
1 1 145 1 1 1 1 1 1 1 1 1 1 1 1 1 1 1 1 1 1 1 1 1 1 1 1 1 1 1 1 1 
##$CPDPRG= <>
##$CPDPRG1= <>
##$CPDPRG2= <>
##$CPDPRG3= <>
##$CPDPRG4= <mlev>
##$CPDPRG5= <mlev>
##$CPDPRG6= <mlev>
##$CPDPRG7= <mlev>
##$CPDPRG8= <mlev>
##$CPDPRGB= <>
##$CPDPRGT= <>
##$D= (0..31)
0 1 0 0 0 0 0 0 0 0.06 0 0 0 0 0 0 0.0002 0 0 0 0 0 0 0 0 0 0 0 0 0 0 
0 
##$DATE= 1151049757
##$DBL= (0..7)
120 120 120 120 120 120 120 120 
##$DBP= (0..7)
150 150 150 150 150 150 150 150 
##$DBP07= 0
##$DBPNAM0= <>
##$DBPNAM1= <>
##$DBPNAM2= <>
$$ [...]
##$SUBNAM7= <"">
##$SUBNAM8= <"">
##$SUBNAM9= <"">
##$SW= 20.6930455092707
##$SWIBOX= (0..15)
0 0 3 0 0 0 0 0 0 0 0 0 0 0 0 0 
##$SW_h= 5175.983436853
##$TD= 65536
##$TD0= 1
##$TE= 295.16
##$TE2= 300
##$TE3= 300
##$TEG= 300
##$TL= (0..7)
0 120 120 120 120 120 120 120 
##$TP= (0..7)
150 150 150 150 150 150 150 150 
##$TP07= 0
##$TPNAME0= <>
##$TPNAME1= <>
##$TPNAME2= <>
##$TPNAME3= <>
##$TPNAME4= <>
##$TPNAME5= <>
##$TPNAME6= <>
##$TPNAME7= <>
##$TPOAL= (0..7)
0.5 0.5 0.5 0.5 0.5 0.5 0.5 0.5 
##$TPOFFS= (0..7)
0 0 0 0 0 0 0 0 
##$TUNHIN= 0
##$TUNHOUT= 0
##$TUNXOUT= 0
##$USERA1= <user>
##$USERA2= <user>
##$USERA3= <user>
##$USERA4= <user>
##$USERA5= <user>
##$V9= 5
##$VALIST= <valist>
##$VCLIST= <CCCCCCCCCCCCCCC>
##$VD= 0
##$VDLIST= <DDDDDDDDDDDDDDD>
##$VPLIST= <PPPPPPPPPPPPPPP>
##$VTLIST= <TTTTTTTTTTTTTTT>
##$WBST= 1024
##$WBSW= 4
##$XGAIN= (0..3)
0 0 0 0 
##$XL= 0
##$YL= 0
##$YMAX_a= 417977
##$YMIN_a= -647252
##$ZGOPTNS= <>
##$ZL1= 120
##$ZL2= 120
##$ZL3= 120
##$ZL4= 120
##$ABSF1= 16.522
##$ABSF2= -4.171173
##$ABSG= 5
##$ABSL= 3
##$ALPHA= 0
##$AQORDER= 0
##$ASSFAC= 0
##$ASSFACI= 0
##$ASSFACX= 0
##$ASSWID= 0
##$AUNMP= <proc_1d>
##$AZFE= 0.1
##$AZFW= 0.1
##$BCFW= 0
##$BC_mod= 0
##$BYTORDP= 0
##$COROFFS= 0
##$CY= 12.5
##$DATMOD= 1
##$DC= 0
##$DFILT= <>
##$DTYPP= 0
##$F1P= 14.0000005364418
##$F2P= -0.99999901652339
##$FCOR= 0.5
##$FTSIZE= 32768
##$FT_mod= 6
##$GAMMA= 0
##$GB= 0
##$INTBC= 1
##$INTSCL= 1
##$ISEN= 128
##$LB= 0.3
##$LEV0= 0
##$LPBIN= 0
##$MAXI= 10000
##$MC2= 0
##$MEAN= 0
##$ME_mod= 0
##$MI= 0
##$NCOEF= 0
##$NC_proc= -5
##$NLEV= 6
##$NOISF1= 0
##$NOISF2= 0
##$NSP= 0
##$NTH_PI= 0
##$NZP= 0
##$OFFSET= 16.522
##$PC= 1
##$PHC0= 170.591
##$PHC1= 5.545028
##$PH_mod= 1
##$PKNL= yes
##$PPARMOD= 0
##$PSCAL= 4
##$PSIGN= 0
##$REVERSE= no
##$SF= 250.13
##$SI= 32768
##$SIGF1= 0
##$SIGF2= 0
##$SINO= 400
##$SIOLD= 32768
##$SREGLST= <1H.CDCl3>
##$SSB= 0
##$STSI= 32768
##$STSR= 0
##$SW_p= 5175.98343685301
##$SYMM= 0
##$S_DEV= 0
##$TDeff= 65536
##$TDoff= 0
##$TI= <Analysis number 999999
Compound Code 99
Book Reference 9
Project Code 9>
##$TILT= no
##$TM1= 0
##$TM2= 0
##$TOPLEV= 0
##$USERP1= <user>
##$USERP2= <user>
##$USERP3= <user>
##$USERP4= <user>
##$USERP5= <user>
##$WDW= 1
##$XDIM= 32768
##$YMAX_p= 323634096
##$YMIN_p= -242087
$$ End of Bruker specific parameters
$$ ---------------------------------
##NTUPLES= NMR SPECTRUM
##VAR_NAME=  FREQUENCY,     SPECTRUM/REAL,   SPECTRUM/IMAG
##SYMBOL=    X,             R,               I
##VAR_TYPE=  INDEPENDENT,   DEPENDENT,       DEPENDENT
##VAR_FORM=  AFFN,          ASDF,            ASDF
##VAR_DIM=   32768,         32768,           32768
##UNITS=     HZ,            ARBITRARY UNITS, ARBITRARY UNITS
##FACTOR=    0.157963299565203, 1,           1
##FIRST=     4132.6476996994, 0,             0
##LAST=      -1043.33573715361, 0,           0
##MIN=       -1043.33573715361, -242087,     0
##MAX=       4132.6476996994, 323634096,     0
$$ Real data points
##PAGE= N=1
##DATA TABLE= (X++(R..R)), XYDATA
$$ [...]
22965C0984J8209K7002K4998j5372m9796l6727k0827j9063L6519L611P74L7058
$$ 30984 49193 76195 101193 85821 36025 -702 -21529 -40592 -4073 -462 312 37370
22953C7370m7617m8216P184j4627J2641M8942J4826n6426j8870J2862N725p912
$$ 37370 -10247 -58463 -51279 -65906 -53265 -4323 10503 -45923 -64793 -51931 -46206 -54118
22941e4118m735M7065J5765L0418l0574j4322J0508N6253L2416k503k9457J630
$$ -54118 -58853 -11788 3977 34395 3821 -10501 7 56260 88676 86173 56716 58346
22929E8346l4507j0824L2788K4206o246K0905n683l4789m6004j6674N9306q27
$$ 58346 23839 13015 45803 70009 63763 84668 78985 44196 -1808 -18482 40824 39997
22917C9997m6307q077J3237k5965k8986l8650k3549P5478N4315j5466n9164O056
$$ 39997 -6310 -14387 -1150 -27115 -56101 -94751 -118300 -42822 11493 -3973 -63137 -57081
22905e7081J5872K2033M926n2776j0752K2057J9485J0054N1231L7861l1088l1693
$$ -57081 -41209 -19176 -14250 -67026 -77778 -55721 -36236 -26182 25049 62910 31822 129
22893A29o368R044N6911l008j8564l8017l5904l6121j9714L6921l8002m2649J9725
$$ 129 -6239 2805 59716 56708 38144 127 -35777 -71898 -91612 -54691 -92693 -135342 -115617
22880a15617L4303M0086J2690K0341j0742j6434K0472Q749J9451n243j7707n2823
$$ -115617 -81314 -41228 -28538 -8197 -18939 -35373 -14901 -6152 13299 8056 -9651 -62474
22868f2474M5159M2025J0618o5133K485j225J3758k2140K0050L4391M434k0042
$$ -62474 -17315 24710 35328 -29805 -27320 -28545 -14787 -36927 -16877 17514 21948 1906
22856A906M3539J3287l0502n9955J0759L2768j738j0767j6740K1138J4649n4867
$$ 1906 45445 58732 28230 -31725 -20966 11802 10064 -703 -17443 3695 18344 -36523
22844c6523m8156K388K5607K4797N4178l4927m7539j3683j4126J1380n076M0870
$$ -36523 -84679 -82291 -56684 -31887 22291 -12636 -60175 -73858 -87984 -76604 -81680 -40810
22832d0810M5418j8326m9950l0288M8026N9088N1845K4920j00349q1086k3015
$$ -40810 4608 -13718 -63668 -93956 -45930 13158 65003 89923 -10426 -91512 -114527
22821a14527j664M71K9319N4952o513K791O354K4467n0816m7653L3638N310j341
$$ -114527 -116191 -115720 -86401 -31449 -37962 -35171 -28817 -4350 -55166 -102819 -69181 -63871 -65212
22808f5212K55P0799L6679J4033j3536k2132m8716l9817l334Q5387O1156J5876
$$ -65212 -64957 5842 42521 56554 43018 20886 -27830 -67647 -70981 14406 75562 91438
22796I1438J08m019l8102k8335L357R194n9450J5995L956J0030q4802j6837J4523
$$ 91438 91546 87527 49425 21090 24447 33641 -25809 -9814 -5858 4172 -80630 -97467 -82944
22783h2944k0869J0461M7349M3895K1530m2024l9548J5129K2445M1773K6798J4472
$$ -82944 -103813 -93352 -46003 -2108 19422 -22602 -62150 -47021 -24576 17197 43995 58467
22771E8467L8087P101K946J7552k4705m4996k1731P048p4707O0422Q6076J8368
$$ 58467 96554 103655 106601 124153 99448 54452 32721 39769 -34938 25484 111560 129928
22759A29928j5997q5916m4438J6985k4163n7271L2023J01361M5274n8115l4158
$$ 129928 113931 28015 -16423 562 -23601 -80872 -48849 52512 97786 39671 5513
22748E513l2288L400k5563m652j5521l2329J5075J2043k3224L7771L2135R2879
$$ 5513 -26775 -23375 -48938 -53590 -69111 -101440 -86365 -74322 -97546 -59775 -27640 65239
22736F5239m0660p0600j4771l907k2967J5570K0035J6799N838m0191l7963L2437
$$ 65239 24579 -46021 -60792 -64699 -87666 -72096 -52061 -35262 -29424 -69615 -107578 -75141
22724g5141J6338P6321j6156k8579M0972n3814n8213L121L3615K429O107N289
$$ -75141 -58803 17518 1362 -27217 13755 -40059 -98272 -95151 -61536 -59107 -53000 -47711
22712d7711L4545J526m676l929l9279k1370K8575M2740p985n1688M244J0985M1246
$$ -47711 -13166 -11640 -16316 -20245 -59524 -80894 -52319 -9579 -17564 -69252 -65008 -54023 -12777
22699a2777k8139J2286J3023O1110Q833k1867l8832R865k7000K5811K5052j1151
$$ -12777 -40916 -28630 -15607 45503 54336 32469 -6363 3502 -23498 2313 27365 16214
22687A6214p1415r820O1106J4164l4000K7338Q6665n0400p340L8138o0670n1958
$$ 16214 -55201 -65021 -3915 10249 -23751 3587 90252 39852 32512 70650 9980 -41978
22675d1978m1448K3949L0475k0489r838j6726j4104m332J3635m085J7373N7611
$$ -41978 -83426 -59477 -29002 -49491 -59329 -76055 -90159 -94491 -80856 -84941 -67568 -9957
22663i957M9217O010p7801J3625M3439p9353k7810P0119J2141m165k6684p5103
$$ -9957 39260 45270 -32531 -18906 24533 -54820 -82630 -12511 -370 -4535 -31219 -106322
22651a06322J0131J8793M8254L5706m0885P515L3537J7903J2911Q514m0654j9357
$$ -106322 -96191 -77398 -29144 6562 -34323 -26808 6729 24632 37543 46057 5403 -13954
22639a3954K6134M0277K63R33p3754j03231j4566J7187K1561k6862L6326N4970
$$ -13954 12180 52457 52720 53653 -20101 -123332 -137898 -120711 -99150 -126012 -89686 -34716
22627c4716K3990k9387J79l6249N501J8922j1638K5374L4669J5021j4084J3410
$$ -34716 -10726 -40113 -39934 -76183 -70682 -51760 -63398 -38024 -3355 11666 -2418 10992
22615A0992l9487K1243L5632l0537m9304N4813J7595j8798k9444K6777k40L692
$$ 10992 -28495 -7252 28380 -2157 -51461 3352 20947 2149 -27295 -518 -758 2934
22603B934K7593l269R672q65n6635J0548n5462j0653J0433l038j3078L7450r22
$$ 2934 30527 27258 36930 36065 -20570 -10022 -65484 -76137 -65704 -68742 -81820 -44370 -45292
22590d5292N0125K1174m3881j5999k8070l1164N8022n7606m97L1750k3264J0259
$$ -45292 4833 26007 -17874 -33873 -61943 -93107 -35085 -92691 -93188 -61438 -84702 -74443
22578g4443J074K3703O1715O1741k6064o1178j199k1940K2846M0088k561p9463
$$ -74443 -73369 -49666 12049 73790 47726 -13452 -14651 -36591 -13745 26343 23782 -55681
22566e5681n3704N5813L6963K0259M7427r910k8912k4157K1576k2280m158m3338
$$ -55681 -109385 -53572 -16609 3650 51077 41167 12255 -11902 9674 -12606 -16764 -60102
22554f0102m1182j0061k7601m1788O3467P8337K2430J7724j7264M2920M2987J2006
$$ -60102 -101284 -111345 -138946 -180734 -117267 -38930 -16500 1224 -16040 26880 69867 81873
22542H1873K5027m8569N429k0985K085R047l7203p514K959j9462k0938Q2520L4106
$$ 81873 106900 58331 63760 42775 44860 53907 16704 9190 12149 -7313 -28251 54269 88375
22529H8375j01092O7872n023m7014k4955J5712K7671L1984K808l4880j5904M5436
$$ 88375 -12717 55155 50132 3118 -21837 -6125 21546 53530 56338 21458 5554 50990
22517E0990l9939o4149K4847L0201J3800m9308m199J1973P5845L3042k2238l7350
$$ 50990 11051 -53098 -28251 1950 15750 -33558 -37757 -25784 50061 83103 60865 23515
22505B3515o0309o9176L0933J7317j6044L4107N6618K8679k3361l6902j0174m2545
$$ 23515 -36794 -105970 -75037 -57720 -73764 -39657 16961 45640 22279 -14623 -24797 -67342
22493f7342k7834K5238J6460Q755K1330k8552M1470M0360M5617j805m0682R376
$$ -67342 -95176 -69938 -53478 -44723 -23393 -51945 -10475 29885 75502 73697 33015 42391
22481D2391l2307m1566k6414J8644j7405L0758N4424k6150k3442K2777j7625r0315
$$ 42391 10084 -31482 -57896 -39252 -56657 -25899 28525 2375 -21067 1710 -15915 -106230
22469a06230O9336J03326J086k3918k3174J8174L7463K735r0738l0075J957k045
$$ -106230 -36894 66432 67518 43600 20426 38600 76063 78798 -11940 -42015 -40058 -42103
22457d2103J4130k6690j8646K1557m440R207N4062K4059j8702k9207p8266k7215
$$ -42103 -27973 -54663 -73309 -51752 -56192 -46985 7077 31136 12434 -16773 -95039 -122254
22445a22254j175M708O683O7338j0921k9185M677J2068M3236K5640R078j1970
$$ -122254 -123429 -118721 -112038 -44700 -55621 -84806 -80129 -68061 -24825 815 9893 -2077
22433b077k9751l5217j07182m2145Q7992R5571M2126n6345n289J1318o3123l647
$$ -2077 -31828 -67045 -174227 -216372 -128380 -32809 9317 -47028 -52317 -40999 -104122 -107769
22421a07769O6777J4319Q907n0867k8405N6428P3476J953k2547K9841L8373m8436
$$ -107769 -40992 -26673 -17766 -68633 -97038 -40610 32866 34819 12272 42113 80486 32050
22409C2050J7710l0864J3726l4038L8860p60r1269m951P778N0529O2206J6390
$$ 32050 49760 18896 32622 -1416 37444 36684 -54585 -59536 -51758 -1229 60977 77367
22397G7367N003l8947m6397o104M7353k5905k3652J8350K8547n9768m8264m1952
$$ 77367 82370 43423 -2974 -9078 38275 12370 -11282 7068 35615 -24153 -72417 -114369
22385a14369J9186N2064J3255L3122J1522L732K0144n1966m2034P563l18l1795
$$ -114369 -95183 -43119 -29864 3258 14780 18512 38656 -13310 -55344 -47781 -48099 -79894
22373g9894J3159M3045P0526k8326J6576q691l6564l1699n4767o700Q4345O9911
$$ -79894 -66735 -23690 46836 18510 35086 26395 -10169 -41868 -96635 -103335 -18990 50921
22361E0921l0725l9077q119j3866l326K8774J4914o860m7814k018j9805K3563
$$ 50921 20196 -18881 -27000 -40866 -44192 -15418 -504 -7364 -55178 -57196 -77001 -53438
22349e3438O767l0637O1909K8120J5859j7631J0285k4669l0257n384k4579k6674
$$ -53438 -46671 -77308 -15399 12721 28580 10949 21234 -3435 -33692 -39076 -63655 -90329
22337i0329m863L3233K3569M4249L7505K2557l2286L888q589k3566m185O6095
$$ -90329 -95192 -61959 -38390 5859 43364 65921 33635 37523 28934 5368 1183 67278
22325F7278j811j5004r4315l0276K9880J0639p469M0160J9349p5643l1950o3899
$$ 67278 65467 50463 -43852 -74128 -44248 -33609 -41078 -918 18431 -57212 -89162 -153061
22313a53061l7187R1189O5246R3044l595l5282N0209l1048j03435q6288L4142
$$ -153061 -190248 -99059 -33813 59231 55636 20354 70563 39515 -63920 -150208 -116066
22302a16066N6692l1338p130N6338N4085o617k4906N27l3341J2169O3400j612
$$ -116066 -59374 -90712 -97842 -41504 12581 5964 -18942 -18415 -51756 -39587 23813 22201
22290B2201O33o2888q667K8113o165j14J2841m8376k4391L858r692m4435K8297
$$ 22201 22834 -40054 -48721 -20608 -26773 -26887 -14046 -62422 -86813 -82955 -92647 -137082 -108785
22277a08785M2034J3018l4127q796Q40J0205k7316Q096N258j0999j336N0223J2173
$$ -108785 -66751 -53733 -87860 -96656 -95816 -85611 -112927 -104831 -99573 -110572 -111908 -61685 -49512
22264d9512J1581k8193O730K1839K3757k6050K9938k4205P660j8474K8472O3226
$$ -49512 -37931 -66124 -59394 -37555 -13798 -39848 -9910 -34115 -26455 -44929 -16457 46769
22252D6769o679n4639k7639l4837J2717N6625J1725j7451k4173M578k2494j689
$$ 46769 40090 -14549 -42188 -77025 -64308 -7683 4042 -13409 -37582 -33004 -55498 -57187
22240e7187K2148j7032k4012J7283j5594k4624Q867J3249J7328K8582l4649j0008
$$ -57187 -35039 -52071 -76083 -58800 -74394 -99018 -90151 -76902 -59574 -30992 -65641 -75649
22228g5649q066K5552n210J0010p147m7055n6190k785P1225M3242j0231j6320
$$ -75649 -83715 -58163 -63373 -53363 -60510 -107565 -163755 -166540 -95315 -52073 -62304 -78624
22216g8624L480K6943l3746j4540N9329R4814q987n4023p854l1907m1795j402
$$ -78624 -75144 -48201 -81947 -96487 -37158 57656 48669 -5354 -13208 -45115 -86910 -88312
22204h8312j8322m800K6212R5748L6171J8354N0336J2988r2630j6826R060l8411
$$ -88312 -106634 -111434 -85222 10526 46697 65051 115387 128375 35745 18919 27979 -10432
22192a0432j34017j4663M9858Q3942J453n2310n1615k4424n5932L4340M8665J601
$$ -10432 -144449 -159112 -109254 -25312 -23859 -76169 -127784 -152208 -208140 -173800 -125135 -123534
22180a23534M3142M2961k6339J8986R438n0848l1386M4230J7475N0188j5771n3251
$$ -123534 -80392 -37431 -63770 -44784 -35346 -86194 -117580 -73350 -55875 -5687 -21458 -74709
22168g4709m7432L1609K6098O7199j240J8514q571m0401O781n1156L671P5754
$$ -74709 -122141 -90532 -64434 2765 1525 20039 11468 -28933 -22152 -73308 -69637 6117
22156F117O9209P780J7163l0521n4714l6784K0168J1475P20O779j5361j6290M0419
$$ 6117 75326 83106 100269 69748 15034 -21750 -1582 9893 10613 17392 2031 -14259 26160
22143B6160o055n5694J3179M4864K8562j9157k7798J7084q349N680P877l8878
$$ 26160 20105 -35589 -22410 22454 51016 31859 4061 21145 12796 18476 26353 -12525
22131a2525j7848j1426j9543m1606J2110Q5172J0452p232j4471o5514n022q321
$$ -12525 -30373 -41799 -61342 -102948 -90838 -5666 4786 -2446 -16917 -82431 -87453 -95774
22119i5774j9240P2532L2110J6223J6088m5453k1976K2234p047O404m8441M2878
$$ -95774 -115014 -42482 -10372 5851 21939 -23514 -45490 -23256 -30303 -23899 -72340 -29462
22107b9462J14483k0303k0271j013K5422k585k6677n1817k3105j2614r774L0593
$$ -29462 85021 64718 44447 43434 68856 66271 39594 -12223 -35328 -47942 -57716 -27123
22095b7123k490k595J562m47K7899m0176m8158K6389L5161J5844j3477N668J2110
$$ -27123 -29613 -32208 -30646 -31093 -3194 -43370 -91528 -65139 -29978 -14134 -27611 -21943 -9833
22082i833j7974m9901l0031K6816Q0014J7160j50l666j3098k753M991j5179J3689
$$ -9833 -27807 -77708 -107739 -80923 -909 16251 16101 12435 -663 -3416 1575 -13604 85
22069H5N4152r89p32k07l6503j3702o0612r405l6018l3307M9324O0576K5303j257
$$ 85 54237 53248 52516 52309 15806 2104 -58508 -67913 -103931 -137238 -87914 -27338 -2035 -3292
22055c292m3951k0048j2880r451J0312L4540l7905k9780M8033M6338n311r636
$$ -3292 -47243 -67291 -80171 -89622 -79310 -44770 -82675 -112455 -64422 -18084 -23395 -33031
22043c3031J6335K5462k0227k6789j0142N3871J5438q30k0451j9810k3865K1781
$$ -33031 -16696 8766 -11461 -38250 -48392 5479 20917 20087 -364 -20174 -44039 -22258
22031b2258J0736l2035l7169M3150r017j33J8551j1941k3036N7841M840k5267
$$ -22258 -11522 -43557 -80726 -37576 -46593 -46726 -28175 -40116 -63152 -5311 -471 -25738
22019b5738l6261K0261m865K66q054k416k828O4073k3251n3358J9190l902j7051
$$ -25738 -61999 -41738 -46603 -46337 -54391 -56807 -59635 4438 -18813 -72171 -52981 -56883 -73934
22006g3934L7719K5828j0347k1888k7457l172L8816j0614M088M739J6079j5077
$$ -73934 -36215 -10387 -20734 -42622 -70079 -73251 -34435 -45049 -40961 -36222 -20143 -35220
21994c5220K6154K3154P5838J3286l0653l8313o4730o694m3300r399K7622o287
$$ -35220 -9066 14088 89926 103212 72559 34246 -30484 -37178 -80478 -89877 -62255 -68542
21982f8542q2180O296L4575K9139O104m903N5484L4411r507q937n0299o0511N9282
$$ -68542 -150722 -144426 -109851 -80712 -74608 -79511 -24027 10384 877 -8060 -58359 -118870 -59588
21969e9588M916n378O263J1038R502k8798o208N1650Q0509L649l5550p8485M236
$$ -59588 -54672 -60050 -53787 -42749 -33247 -62045 -68253 -16603 63906 67555 32005 -46480 -42244
21956d2244L0270R912L2076R117J7431M3467k4522o3139o678M0052j5232j3657
$$ -42244 -11974 -2062 30014 39131 56562 100029 75507 12368 5690 45742 30510 16853
21944A6853K3399l8156m8995j7868k9032K6332m4710K1659Q1157M0297j5399m5992
$$ 16853 40252 2096 -46899 -64767 -93799 -67467 -112177 -90518 -9361 30936 15537 -30455
21932c0455m0505J781l0875j5221L2263R825M0962K4122k1379q33j7290m4092
$$ -30455 -70960 -69179 -100054 -115275 -83012 -73187 -32225 -8103 -29482 -30315 -47605 -91697
21920i1697l958N4333K6139k569j9473k1486m2957k8644K0159M4117N7539L5688
$$ -91697 -95655 -41322 -15183 -17752 -37225 -58711 -101668 -130312 -110153 -66036 -8497 27191
21908B7191Q624M737n987n7854n7349L5706K3838J3556j9693q0642k9930J7033
$$ 27191 35815 40552 34565 -23289 -80638 -44932 -21094 -7538 -27231 -107873 -137803 -120770
21896a20770K9003O8049O2225n5266m258q125P3246K3669j646m2135k5245J0745
$$ -120770 -91767 -23718 38507 -16759 -21017 -29142 44104 67773 66127 23992 -1253 9492
21884I492L714m7332n251M0969J5612R645K836n4239m2911q736M5093j9681l2028
$$ 9492 13206 -34126 -39377 1592 17204 26849 29685 -24554 -67465 -76201 -31108 -50789 -82817
21871h2817J2826N1175N3272L646J2007o7797l1114K3488M2282L1205l6014n4936
$$ -82817 -69991 -18816 34456 38102 50109 -17688 -48802 -25314 16968 48173 12159 -42777
21859d2777j5828O115O8197M719l4723j2518j0002P4111K1031n2388N998j6929
$$ -42777 -58605 -52490 15707 20426 -14297 -26815 -36817 37294 58325 5937 11935 -4994
21847d994m3326L2692M2366M536k7493K17m8870k3675Q7664l973q029K1365k7832
$$ -4994 -48320 -15628 26738 31274 3781 3998 -44872 -68547 19117 15144 7115 28480 648
21834F48k2153Q247K0977j3394k6591l9822R749J5943p386K6223J685K5340N9266
$$ 648 -21505 -13258 7719 -5675 -32266 -72088 -62339 -46396 -53782 -27559 -25874 -534 58732
21821E8732R495K5242n9016k8298l4885l481K9959K3324j26066m1220J1666L8689
$$ 58732 68227 93469 34453 6155 -28730 -32211 -2252 21072 -104994 -146214 -134548 -95859
21809i5859k4875J6585J2423P683K561P2962q202j1866k8833J2014j7712M9003
$$ -95859 -120734 -104149 -91726 -84043 -81482 -8520 -16722 -28588 -57421 -45407 -63119 -14116
21797a4116M3487J0484P99J7626n0975k7940J9867J166l3111m1979Q947M0097
$$ -14116 29371 39855 40654 58280 7305 -20635 -768 398 -32713 -74692 -65745 -25648
21785b5648l871m8894m2895j1629O392N1056K6369P280K5119j7048k7052m6876
$$ -25648 -29519 -78413 -121308 -132937 -126545 -75489 -49120 -41840 -16721 -33769 -60821 -107697
21773a07697L4234L4136N5259L5780j2956p7468j3963M2007K6493J019k3970j8569
$$ -107697 -73463 -39327 15932 51712 38756 -38712 -52675 -10668 15825 16844 -7126 -25695
21761b5695k7415M3415O287k6107L6708N5837m3691r4785k1575M0827j4398j1373
$$ -25695 -53110 -9695 -3408 -29515 7193 63030 19339 -75446 -97021 -56194 -70592 -81965
21749h1965j5124o3963j1508L3022K2320L455o2698o848R7907k5558l3485L8755
$$ -81965 -97089 -161052 -172560 -139538 -117218 -113763 -176461 -183309 -85402 -110960 -144445 -105690
21737a05690Q106M9155O3961L0330k4856L2378o3816m7365o217L2104N5894L855
$$ -105690 -97584 -48429 15532 45862 21006 53384 -10432 -57797 -64014 -31910 23984 27839
21725B7839k5624m0528o781N2090N24k0347J9020q074K5500J5901n5739k4871
$$ 27839 2215 -38313 -45094 6996 7520 -12827 6193 -1881 23619 39520 -16219 -41090
21713d1090n3749n4734M8139R0504Q3945n0404m5367q16j0627J0987j5097l2174
$$ -41090 -94839 -149573 -101434 -10930 73015 22611 -22756 -23572 -34199 -23212 -38309 -70483
21701g0483p084k6085K8802K0963M6455J5283K8121n8657m0198K8075k6869m4871
$$ -70483 -77567 -103652 -74850 -53887 -7432 7851 35972 -22685 -62883 -34808 -61677 -106548
21689a06548P1957R2871J9550N427l8429N803P56l6500k1183P973k0082k1449
$$ -106548 -34591 58280 77830 83257 44828 50631 51387 14887 -6296 1677 -18405 -39854
21677c9854m587k776k6167J1332N6556l371k7321M3295M1946o7029n1637m0695
$$ -39854 -44441 -47217 -73384 -62052 -5496 -8867 -36188 7107 49053 -17976 -69613 -110308
21665a10308j9703N5402N371J666J1195j8606Q511P829k7211K1970m4108K3544
$$ -110308 -130011 -74609 -69238 -67572 -56377 -74983 -66472 -58643 -85854 -63884 -107992 -84448
21653h4448L010j8832O7334M6003M743n6904k5177l1460j4308L1234L4152K5412
$$ -84448 -81438 -100270 -32936 13067 17810 -39094 -64271 -95731 -110039 -78805 -44653 -19241
21641a9241j0042m9125l234L4878P0934N454k3461o460k3893j2398K7596J880
$$ -19241 -29283 -78408 -81642 -46764 24170 29624 6163 -297 -24190 -36588 -8992 -7112
21629g112l6814R806m0762l677Q4232O744m9415j8584N85k5921k6072K4675J6392
$$ -7112 -43926 -34120 -74882 -78559 5673 12417 -36998 -55582 -54997 -80918 -106990 -82315 -65923
21616f5923P011P684L5282P9741m2446k0095j1080k4046M100n535K1264p142K8065
$$ -65923 -58912 -51228 -15946 63795 21349 1254 -9826 -33872 -29772 -35307 -14043 -21185 6880
21603F880K9152L1133o5995l3748k3408l9973k736J6683K9206n7806r79K3577
$$ 6880 36032 67165 1170 -32578 -55986 -95959 -98695 -82012 -52806 -110612 -111591 -88014
21591h8014n200l961N108l7237k0704N5095j1885O99K7588q941j6772j0325N2251
$$ -88014 -93214 -97175 -92067 -129304 -150008 -94913 -106798 -106099 -78511 -87452 -104224 -114549 -62298
21578f2298K3165K3233L0366j8010K3009j9316n4955j8200K3187O2671m0501j3503
$$ -62298 -39133 -15900 14466 -3544 19465 149 -54806 -73006 -49819 12852 -27649 -41152
21566d1152J7199M0858L1519o4499m2874J1881J9234K0983L3241M8602j5568o51
$$ -41152 -23953 16905 48424 -16075 -58949 -47068 -27834 -6851 26390 74992 59424 58773
21554E8773j9994n6416j2804l990k2406k0006O004M002N441l6924l0211K1066
$$ 58773 38779 -17637 -30441 -34431 -56837 -76843 -70839 -66837 -61396 -98320 -128531 -107465
21542a07465K4688j5143M180R6743P4870Q708k1902l9177m4564l1257j2495o0545
$$ -107465 -82777 -97920 -93740 3003 77873 86581 64679 25502 -19062 -50319 -62814 -123359
21530a23359J8576k5893Q703M8234N578N998j4498J1493L3737L9360q7204m9630
$$ -123359 -104783 -130676 -121973 -73739 -68161 -62163 -76661 -65168 -31431 7929 -79275 -128905
21518a28905n2939q357N740O6543O346L1676K8036o885k7195K9963K1530L1112
$$ -128905 -181844 -190201 -184461 -117918 -111572 -79896 -51860 -58745 -85940 -55977 -34447 -3335
21506c335J1697J6297j8071l4675k9548N0647J4184J7887m5793j3083M0949K819
$$ -3335 8362 24659 6588 -28087 -57635 -6988 7196 25083 -20710 -33793 7156 9975
21494I975j3738K7227O815j7551M2621M9192l4952k7153J776L403J1676k145j4587
$$ 9975 -3763 23464 30279 12728 55349 104541 69589 42436 44212 47615 59291 57146 42559
21481D2559J4469l0337m4705l1523l7283p174O5023q530P488k481J3122R981M8890
$$ 42559 57028 26691 -18014 -49537 -86820 -93994 -28971 -37501 -30013 -32494 -19372 -9391 39499
21468C9499J7469p972k5022L073K0676J0626k9924n1890k1906j6623j7701L9872
$$ 39499 56968 48996 23974 27047 47723 58349 28425 -23465 -45371 -61994 -79695 -39823
21456c9823K0267m2997q1215r068J9467P2497k2117n5887L9331N3719k066L2941
$$ -39823 -19556 -62553 -143768 -152836 -133369 -60872 -82989 -138876 -99545 -45826 -47892 -14951
21444a4951N2884Q438k857k9436l8853J0501Q928m5091j8250j5866o1187k9015
$$ -14951 37933 46371 43514 14078 -24775 -14274 -5346 -50437 -68687 -84553 -145740 -174755
21432a74755L2237K1379N0148K9437p769q980p2453k7544M079P9775M0624k1787
$$ -174755 -142518 -121139 -70991 -41554 -49323 -58303 -130756 -158300 -154221 -74446 -33822 -55609
21420e5609n2445k5379j5037k3140n1655j8822O2557L0992N6103M2629L1405K3343
$$ -55609 -108054 -133433 -148470 -171610 -223265 -242087 -179530 -148538 -92435 -49806 -18401 4942
21408D942R113k7830l1566P849m947O8838M1754m1176l9907q098M1343O0149n6680
$$ 4942 14055 -13775 -45341 -37492 -42439 26399 68153 26977 -12930 -21028 20315 80464 23784
21395B3784p6457q443K0518j7918J8455k54q495J0038J6411j8394N748L4567K4014
$$ 23784 -52673 -61116 -40598 -58516 -40061 -40315 -48810 -38772 -22361 -40755 -35007 -440 23574
21382B3574l2540k3999K3617J4480q8120n5447o810M7563M4887P0219k2632m3147
$$ 23574 -8966 -32965 -9348 5132 -82988 -138435 -145245 -97682 -52795 17424 -5208 -48355
21370d8355l9564J3108N3638l2133j1307M5099m3105m4936m947k4568O9213K5918
$$ -48355 -87919 -74811 -21173 -53306 -64613 -19514 -62619 -107555 -112502 -137070 -67857 -41939
21358d1939R772K148l4665j3993M1633n3668o6351M3983R495r153K196l3789k5775
$$ -41939 -32167 -30019 -64684 -78677 -37044 -90712 -157063 -113080 -103585 -112738 -110542 -144331 -170106
21345a70106N6588L6973K8151k7012M1309L2958k3659l637M1229N825K9793j1434
$$ -170106 -113518 -76545 -48394 -75406 -34097 -1139 -24798 -28435 12794 18619 48412 36978
21333C6978n4651q660m387J6874Q842n7181J5206O549p912m2054L8821N6291j1607
$$ 36978 -17673 -26333 -30720 -13846 -5004 -62185 -46979 -40430 -48342 -90396 -51575 4716 -6891
21320f891J5714j2433k3226L978J7620M2818L0921m8217j02733m9384K6722L8530
$$ -6891 8823 -3610 -26836 -22858 -5238 37580 68501 20284 -82449 -131833 -105111 -66581
21308f6581K2502M1684J6842n003Q064N0696N599m9269k7821k3565k1941p3474
$$ -66581 -44079 -2395 14447 9444 17508 68204 73803 24534 -3287 -26852 -48793 -122267
21296a22267O852M8808L6223L4398J3059k0902l1784j7796n7976L7421m219K0969
$$ -122267 -115415 -66607 -30384 4014 17073 -3829 -35613 -53409 -111385 -73964 -78183 -57214
21284e7214l9828j3071N6994N2229M1014j8516o4428k2684k3979k625J9815j029
$$ -57214 -97042 -110113 -53119 -890 40124 21608 -42820 -65504 -89483 -92108 -72293 -73322
21272g3322p603r132k7099m1640n4438L4893L3795N1842N6817K9490j4683o0073
$$ -73322 -80925 -90057 -117156 -158796 -213234 -178341 -144546 -92704 -35887 -6397 -21080 -81153
21260h1153p7332N2272P6214R185J623M0610q240M324j6521k4533m730J5614p1118
$$ -81153 -158485 -106213 -29999 -20814 -19191 21419 13179 17503 982 -23551 -28281 -12667 -83785
21247h3785j8347m3610M1629L8818K1647l2680J7050l335R456j5521p713r8149
$$ -83785 -102132 -145742 -104113 -65295 -43648 -76328 -59278 -62613 -53157 -68678 -76391 -174540
21235a74540j2711L3430K2592L8009q948q618N442K5285j515K6651L095k7006
$$ -174540 -187251 -153821 -131229 -93220 -102168 -110786 -105344 -80059 -81574 -54923 -51828 -78834
21223g8834q786J3815N639J8117l2487L004k6091J6396k2106r859L9002K385l8211
$$ -78834 -87620 -73805 -68166 -50049 -82536 -79532 -105623 -89227 -111333 -121192 -82190 -79805 -118016
21210a18016l1730m2152K4704J1889Q5158N4884K4859J8271j5716k1961n0202
$$ -118016 -149746 -191898 -167194 -155305 -70147 -15263 9596 27867 12151 -9810 -60012
21199f0012j9656J1014N1873m6611l3590j2491j5417J0310Q2069O6178J4331j7907
$$ -60012 -79668 -68654 -16781 -63392 -96982 -109473 -124890 -114580 -32511 33667 47998 30091
21187C0091n9754j0317j1006K6215J5696L7221j0591n482L0909j5136o8555m8260
$$ 30091 -29663 -39980 -50986 -24771 -9075 28146 17555 12073 42982 27846 -40709 -88969
21175h8969n0736K0043M8326q97Q112l174K0564O983p276J1174r185l4534L4132
$$ -88969 -139705 -119662 -71336 -72233 -64121 -67295 -46731 -39748 -47024 -35850 -45035 -79569 -45437
21162d5437K4885j684P022L2928P316k6949n5461l650O233N492j0147N171p136
$$ -45437 -20552 -22236 -15214 17714 25030 -1919 -57380 -61030 -54797 -49305 -59452 -54281 -61417
21149f1417j501J8687L3985J3495j057q056j1469P747L1126k6514n0618J0095
$$ -61417 -62918 -44231 -10246 3249 2192 -5864 -17333 -9586 21540 -4974 -55592 -45497
21137d5497K0960l6715R526N7357K9856o1703k6972K0867J2071o356L975o749
$$ -45497 -24537 -61252 -51726 5631 35487 -26216 -53188 -32321 -20250 -26606 -22631 -29380
21125b9380J2272o2921K3699O8186J6471K3800L4036J5927p9805p2320k6088M7848
$$ -29380 -17108 -80029 -56330 11856 28327 52127 86163 102090 22285 -50035 -76123 -28275
21113b8275l6178J5985L1913L4137j4738l1561Q115J0697j017N2416m754n5720
$$ -28275 -64453 -48468 -16555 17582 2844 -28717 -20602 -9905 -10922 41494 36740 -18980
21101a8980o774J3695K6584m0582P937n7982q036r458J8599m9030P756M0784K7134
$$ -18980 -25754 -12059 14525 -26057 -18120 -76102 -84138 -93596 -74997 -124027 -116271 -75487 -48353
21088d8353J7126K094j7326L4709J1828L075o6921l7755L493Q338k6017R750Q727
$$ -48353 -31227 -29133 -46459 -11750 78 3153 -63768 -101523 -98030 -89692 -115709 -105959 -97232
21075i7232L3969K7774l3861k7025J9696J938m6660j3534L3104k786L0115M1257
$$ -97232 -63263 -35489 -69350 -96375 -76679 -74741 -121401 -134935 -101831 -104617 -74502 -33245
21063c3245k2617k403J6298M8265J687R360J460n3129k4779j3548L0233K2617
$$ -33245 -55862 -58265 -41967 6298 7985 17345 18805 -34324 -59103 -72651 -42418 -19801
21051a9801M298k1980L4508N638J5328N5756L641m4570l9655j3531k8417N2639
$$ -19801 -15503 -37483 -2975 2663 17991 73747 77388 32818 -6837 -20368 -48785 3854
21039C854M2931k5839k9605K0180r576o1356n639K2888k1208J9296l9192l71N0974
$$ 3854 46785 20946 -8659 11521 1945 -59411 -65050 -42162 -63370 -44074 -83266 -83637 -32663
21026c2663N7127q891j02435J1498j593k8847K1726j7220k32j6907K3756O5135
$$ -32663 24464 15573 -86862 -75364 -76957 -105804 -84078 -101298 -101530 -118437 -94681 -29546
21014b9546M851L5853J6632n6831o4152J6058m807l165M1775j8524j4516J9576
$$ -29546 -24695 11158 27790 -29041 -93193 -77135 -81942 -85107 -43332 -61856 -76372 -56796
21002e6796j6124k0377K1755k6125l127K8131K1912n815k5687r821m0649J6337
$$ -56796 -72920 -93297 -71542 -97667 -100794 -72663 -50751 -56566 -82253 -92074 -132723 -116386
20990a16386K8335Q983o888J2077K8271j2093Q537P7115K7510o7881k7735k6063
$$ -116386 -88051 -79068 -85956 -73879 -45608 -57701 -49164 27951 55461 -12420 -40155 -66218
20978f6218j2113k8141L870Q3682M2228K4037J4373r091n0172p1874l0972L9191
$$ -66218 -78331 -106472 -102602 -18920 23308 47345 61718 52627 2455 -69419 -100391 -61200
20966f1200l1953L3963j5164M9924K8166l5223m6930m7353l0098o937K3033r323
$$ -61200 -93153 -59190 -74354 -24430 3736 -31487 -78417 -125770 -155868 -162805 -139772 -149095
20954a49095R552K1750p056K9467N1406q57J1714k8692N1541N7309o3559j6531
$$ -149095 -139543 -117793 -124849 -95382 -43976 -44833 -33119 -61811 -10270 47039 -16520 -33051
20942c3051O742L3439l063l9062J9575N342l9363M0424L0106J5269L1821m0746
$$ -33051 -26309 7130 4067 -34995 -15420 -10078 -49441 -9017 21089 36358 68179 27433
20930B7433l7489K3395k5110m0242k8376k3937N413L6960K2253Q1956M172j9440
$$ 27433 -10056 13339 -11771 -52013 -80389 -104326 -98913 -61953 -39700 42256 46428 26988
20918B6988L9387o6600n2633j512J2098n102K6111K3717k7834k3199O1044L1222
$$ 26988 66375 -225 -52858 -54370 -42272 -47374 -21263 2454 -25380 -48579 12465 43687
20906D3687N821n2547m6379j5570J521j011J747J2984J7260K8006K291m4830j1061
$$ 43687 49508 -3039 -49418 -64988 -63467 -64478 -62731 -49747 -32487 -4481 -2190 -47020 -58081
20893e8081N2686l0438m5485k661r514M3332m882m4359k5998K9872L8542j5575
$$ -58081 -5395 -35833 -81318 -83979 -93493 -50161 -55043 -99402 -125400 -95528 -56986 -72561
20881g2561M2215P3196l3606j5611Q1426k5357r419o0139m7078J8599k7071k4506
$$ -72561 -30346 42850 9244 -6367 75059 49702 40283 -19856 -66934 -48335 -75406 -99912
20869i9912R202Q109J072Q3136J0052l6379O096L4756l7595m1569O466L0662K9864
$$ -99912 -90710 -82601 -81529 1607 11659 -24720 -18624 16132 -21463 -63032 -56566 -25904 3960
20856C960L2614r6144m4841L2731j4991l285M2959j9100o553k4127K3450k356
$$ 3960 36574 -59570 -104411 -71680 -86671 -89956 -46997 -66097 -72650 -96777 -73327 -75683
20844g5683J5938Q7034m5592m7683M786K9230l6826k6439J0567m3534r977L5350
$$ -75683 -59745 27289 -18303 -65986 -61200 -31970 -68796 -95235 -84668 -128202 -138179 -102829
20832a02829o287P57M420K7610L7342M1310J4360n779m4722J8031o729P377k3044
$$ -102829 -109116 -108359 -103939 -76329 -38987 2323 16683 10904 -33818 -15787 -22516 -15139 -38183
20819c8183n5343L0475N2132k3186J3424m998n0941n4798N1285N1851P1546J1310
$$ -38183 -93526 -63051 -10919 -34105 -20681 -25679 -76620 -131418 -80133 -28282 43264 54574
20807E4574m1779k0131L821M595n6077j6146J799n0690q833O7326R863L177j8743
$$ 54574 12795 -7336 -3515 1080 -54997 -71143 -69344 -120034 -128867 -61541 -51678 -48501 -67244
20794f7244M1731J5896j1406O88l296J504P124K4541J7707o0821l7526N7045p889
$$ -67244 -25513 -9617 -21023 -20335 -23631 -22127 -15003 9538 27245 -33576 -71102 -14057 -21946
20781b1946p3899p997L9264J7797K3878J066P47r693P99k048n918J207l4213m031
$$ -21946 -95845 -103842 -64578 -46781 -22903 -21837 -21090 -30783 -29984 -32032 -37950 -36743 -70956 -74987
20767g4987N1438K6508N741q504q5639l5206R303N4658M7771l55k0907o250N5606
$$ -74987 -23549 2959 8700 196 -85443 -120649 -111346 -56688 -8917 -9272 -30179 -36429 19177
20754A9177M3151l1492j5412L7047l3400l7154M606L0428J0883J4554J6249l106
$$ 19177 62328 30836 15424 52471 19071 -18083 -13477 16951 27834 42388 58637 55531
20742E5531L1772R84L6709r352l8737j0534j6538R75L6271l5116l3176N904L3799
$$ 55531 87303 88287 124996 115644 76907 66373 49835 50810 87081 51965 18789 24693 58492
20729E8492k5679K3664R062k5873m37m8517M117P0129K5314O241J6110l9293k1817
$$ 58492 32813 56477 65539 39666 39229 -9288 -5171 64958 90272 96513 112623 73330 51513
20716E1513k5274j1784K2009j6515L7977L0667j7582K21m888k7960k2179J2803
$$ 51513 26239 14455 36464 19949 57926 88593 71011 71232 66344 38384 16205 29008
20704B9008N868o855l8135j9529K7030j1672K1859K7405J0652l9555r0627k5973
$$ 29008 34876 28021 -10114 -29643 -2613 -14285 7574 34979 45631 6076 -84551 -110524
20692a10524M738K2605J03967O4016k0533l4016p885k8937o36M4679K1747k0760
$$ -110524 -105786 -83181 20786 84802 64269 30253 22368 -6569 -7205 37474 59221 38461
20680C8461j4515L2823j6079j5023j2305L4220N378j5709j9815R342M2802K7970
$$ 38461 23946 56769 40690 25667 13362 47582 52960 37251 17436 26778 69580 97550
20668I7550J0901j5512M7757m3390M1608M2097n2821k6679L6619O7530O0330j4355
$$ 97550 108451 92939 140696 97306 138914 181011 128190 101511 138130 205660 265990 251635
20656B51635K1423P1726R7797J34376J24136J24115R2563R9205J09556N0326l7115
$$ 251635 273058 344784 442581 576957 701093 825208 917771 1016976 1126532 1176858 1139743
20645A139743m5029r7550j59510j43809j19932r4166j13056n5341p1162j1836
$$ 1139743 1094714 997164 837654 693845 573913 479747 366691 311350 240188 228352
20635B28352N3902j2377p2113N154O6778P1784M6000J691J7728J7569R914O0700
$$ 228352 282254 269877 197764 202918 269696 341480 387480 389171 406899 424468 434382 495082
20623D95082R5331J13770J98369J19524J07355Q4686O4316o3000j3945r0484j45239
$$ 495082 590413 704183 902552 1022076 1129431 1214117 1278433 1215433 1201488 1111004 965765
20612I65765j54189j64823j53511r5465l2875m2899m7471j7046j4578q831m190
$$ 965765 811576 646753 493242 397777 364902 322003 274532 257486 242908 234077 229887
20601B29887J7598K5022n6542K4907k3825l2067K1788L6052q797q4839m7888j2698
$$ 229887 247485 272507 215965 240872 217047 184980 206768 242820 234023 149184 101296 88598
20589H8598k6480K0170J4155j0666K5391N266l9716m841K3858J2910M632m6651
$$ 88598 62118 82288 96443 85777 111168 116434 76718 71877 95735 108645 113277 66626
20577F6626p2873k5746M7870k2652p432M9306j1504k2486L9372M9070M4174l1852
$$ 66626 -6247 -31993 15877 -6775 -14207 35099 23595 1109 40481 89551 133725 101873
20565A01873J3728Q5420o517m7994k9100j8298L254J9060j1462J4044Q027j3862
$$ 101873 115601 201021 194504 146510 117410 99112 102366 121426 109964 124008 132035 118173
20553A18173m5510Q598K2909L7951p015o3063q5534Q112L0178J8879M7441J4211
$$ 118173 72663 81261 104170 142121 135106 72043 -13491 -5379 24799 43678 91119 105330
20541A05330n2K2054J3075l2713n0102K9821k0638p0089l5800q111N803J574J2395
$$ 105330 105278 127332 140407 107694 57592 87413 66775 -3314 -39114 -47225 -41422 -39848 -27453
20528b7453N2390q500Q316N1278M0429l417L2101q061k5492m048J0228j317J2565
$$ -27453 24937 16437 24753 76031 116460 113043 145144 137083 111591 107543 117771 116454 129019
20515A29019k8799o1702l7010K624J6472M1083J5928j2037q336L9071j7163m809
$$ 129019 100220 38518 1508 4132 20604 61687 77615 65578 57242 96313 79150 74341
20503G4341j9772j0472J6730Q691k866p8278n1521k103J9431l2678L251O5514
$$ 74341 54569 44097 60827 69518 66652 -11626 -63147 -65250 -45819 -78497 -75246 -9732
20491i732Q215k5808q260M7617M0157o6704m392k1197n0708L4397J00925L5013
$$ -9732 -1517 -27325 -35585 12032 52189 -14515 -18907 -40104 -90812 -56415 44510 79523
20479G9523K4648m6979l807L0175L7677n6917o3724l3373j8128J6613K2873M660
$$ 79523 104171 57192 53385 83560 121237 64320 596 -32777 -50905 -34292 -11419 -6759
20467f759l3040L642Q1698O6143p9553p7533j5953j8621j7876J8422M5787J6807
$$ -6759 -39799 -36157 45541 111684 32131 -45402 -61355 -79976 -97852 -79430 -33643 -16836
20455a6836j1825l9008M406K8583O6929N8163L7965l6232n6133l191L0934J3767
$$ -16836 -28661 -67669 -63263 -34680 32249 90412 128377 92145 36012 32821 63755 77522
20443G7522n7595L159N1957j3588j7125q032M8896J8206k3755m4780o5162j0728
$$ 77522 19927 23086 75043 61455 44330 36298 85194 103400 79645 34865 -30297 -41025
20431d1025L8185J227p3682k2251M7040M3949K7841K1148k6588m7216n028O4324
$$ -41025 -2840 -1613 -75295 -97546 -50506 -6557 21284 42432 15844 -31372 -36400 27924
20419B7924N0813k9366m9930P1492P7277K7073l9774k1354l2144K9542P5270l5454
$$ 27924 78737 49371 -559 70933 148210 175283 135509 114155 82011 111553 186823 151369
20407A51369l3013K2655m6806m6228k1341o598L4831j8504q215N144J9122Q4406
$$ 151369 118356 141011 94205 47977 26636 20038 54869 36365 28150 33294 52416 136822
20395A36822r867l1004J1730j2862m0149J0026l653n2973n508K911j4902j4390
$$ 136822 126955 95951 107681 94819 54670 64696 61043 8070 2562 5473 -9429 -23819
20383b3819L9837j3434q334L296J9932K7111K2495l2620m4620k5003K7516j5341
$$ -23819 16018 2584 -5750 -2454 17478 44589 67084 34464 -10156 -35159 -7643 -22984
20371b2984n499K324J9539N5266r542j2062l6591k6355M9160N6953k5805L7596
$$ -22984 -28483 -26159 -6620 48646 39104 27042 -9549 -35904 13256 70209 44404 82000
20359H2000M3022m9193n5497J091j0262N6661L1083L1525l657m3388j9642n5895
$$ 82000 125022 75829 20332 21423 11161 67822 98905 130430 126773 83385 63743 7848
20347G848l018O278K2950N6480L587j2531N0473O2883M5203K3161k0379R014K7604
$$ 7848 4830 11108 34058 90538 94125 81594 132067 194950 240153 263314 242935 251949 279553
20334B79553l2947n4690k5976K213N8766K6832l6195l0503k4448K6475O0757j5024
$$ 279553 246606 191916 165940 168153 226919 253751 217556 187053 162605 189080 249837 234813
20322B34813m4724o3100o0017k8516Q155m6173p646P0153J2723J8008j3935K5003
$$ 234813 190089 126989 66972 38456 46611 438 -7208 62945 75668 93676 79741 104744
20310A04744M7977M6484R998k3939L3439q359K4734R141n1489M032q437m4027
$$ 104744 152721 199205 209203 185264 218703 210344 235078 244219 192730 196762 188325 144298
20298A44298M7309M5952j8645l1332k0447j1269N49n433M9419q435k9525K052
$$ 144298 191607 237559 218914 187582 167135 155866 156415 150982 200401 191966 162441 164493
20286A64493l1107p7618m531j843n1510k3472K2424O1293N302L1138J9247J3492
$$ 164493 133386 55768 51237 49394 -2116 -25588 -3164 58129 63431 94569 113816 127308
20274A27308j3306j0780l048M523K4556J0651k2521j0304k0368K1263j4412k2841
$$ 127308 114002 103222 100174 104697 129253 139904 117383 107079 86711 107974 93562 70721
20262G0721O6914Q0783j3102p6736m5586P093n3087m5014M4634M028J5571k74
$$ 70721 137635 218418 205316 128580 82994 90087 37000 -8014 36620 40648 56219 55945
20250E5945k9617l9050J7473L5730k99L1390O6090m6241j6746M3927m904n0019
$$ 55945 26328 -12722 4751 40481 40182 71572 137662 91421 74675 118602 113698 63679
20238F3679l4441l3117J4223j1393J282k9675l160L532j7261j7469j6501J7388
$$ 63679 29238 -3879 10344 -1049 233 -29442 -32602 -29070 -46331 -63800 -80301 -62913
20226f2913M6010L7612j602j9955m7264K1445J0136Q9779N9811j4703N0304N7621
$$ -62913 -16903 20709 19107 -848 -48112 -26667 -16531 73248 133059 118356 168660 226281
20214B26281K0346K1528o366m8464j3694P8476N5903J8239R491J11417M9884j0463
$$ 226281 246627 268155 261789 213325 199631 278107 334010 352249 361740 473157 523041 512578
20202E12578P992l2025j3965p0476m0113L6708l5692k7904k6090m0583J3241O3514
$$ 512578 520570 488545 474580 404104 363991 400699 365007 337103 311013 270430 283671 347185
20190C47185j665K3572J7393K5135k1193J230N1783Q1344j7567o8123J7960N5273
$$ 347185 345520 369092 386485 411620 390427 391657 443440 524784 507217 439094 457054 512327
20178E12327k5022K2432Q6407M8002P1311O2722j2482L8514j781p2080j8660o877
$$ 512327 487305 509737 596144 644146 715457 778179 765697 804211 802430 730350 711690 704813
20166G04813R552J7595J3357R5387m340J620O4105N7592O6160R1095J23754O8204
$$ 704813 714365 731960 745317 840704 836364 837984 902089 959681 1025841 1116936 1240690 1308894
20154A308894N7609R6647Q3526J68929Q8190K5235k834l0333j49281j60809j35247
$$ 1308894 1366503 1463150 1546676 1715605 1803795 1829030 1826196 1795863 1646582 1485773 1350526
20143A350526l4158n6662l7981k3630l2507j655N5815O1621N9113k5314k714j9803
$$ 1350526 1316368 1259706 1221725 1198095 1165588 1163933 1219748 1281369 1340482 1315168 1312454 1292651
20131A292651N3283R1094K4215O5634R9563J25114J36915K78730L43357K93858
$$ 1292651 1345934 1437028 1461243 1526877 1626440 1751554 1888469 2167199 2510556 2804414
20121B804414K95580L89686K90891K30242K24443J50466N0079L336N9320R665
$$ 2804414 3099994 3489680 3780571 4010813 4235256 4385722 4435801 4439137 4498457 4508122
20111D508122J6267P9237J56040J70467K00612K10089K19487K87856L52851M04698
$$ 4508122 4524389 4603626 4759666 4930133 5130745 5340834 5560321 5848177 6201028 6605726
20101F605726L96198L93090L94929M28373M05447N37651P42716R34415J103259
$$ 6605726 7001924 7395014 7789943 8218316 8623763 9161414 9904130 10838545 11941804
20092A1941804J516767K040916K744908L791217N284197P543281J0616587J4296156
$$ 11941804 13458571 15499487 18244395 22035612 27319809 34863090 45479677 59775833
20084E9775833J8433891K3300578K7764814K8425450K5454038K3462788J7878924
$$ 59775833 78209724 101510302 129275116 157700566 183154604 206617392 224496316
20077B24496316L029865q234715j1524923j9791225k8537341k6221056k1854563
$$ 224496316 227526181 219291466 207766543 187975318 159437977 133216921 111362358
20070A11362358j9786413j6018195j1274977p632259n372534l871284k698486
$$ 111362358 91575945 75557750 64282773 56650514 51277980 47406696 44708210
20063D4708210j764807j034050k43256O25557J506703K764182M582218P143582
$$ 44708210 42943403 41909353 41666097 42291654 43798357 46562539 51144757 58288339
20055E8288339J0652164J4581063J8968659K4119879K8349762K7847445K4539414
$$ 58288339 68940503 83521566 102490225 126610104 154959866 182807311 207346725
20048B07346725K2279231J4385492j680673j0726448j4224756k3991688l0286277
$$ 207346725 229625956 244011448 242330775 231604327 217379571 193387883 163101606
20041A63101606k6404212k2509516k0222292j6089963j1400657q094938o095541
$$ 163101606 136697394 114187878 93965586 77875623 66474966 58380028 52284487
20034E2284487m660751l653234l002194k431844k011107j711722j494092j373416
$$ 52284487 47623736 43970502 40968308 38536464 36525357 34813635 33319543 31946127
20026C1946127j251084j149118j111789r78489r49611r39217r60462q97437q72263
$$ 31946127 30695043 29545925 28434136 27455647 26506036 25566819 24606357 23708920 22836657
20017B2836657q14809p44437p42237p45673n99839n64057n72465n29783m79722
$$ 22836657 22021848 21277411 20535174 19789501 19189662 18625605 18053140 17523357 17043635
20008A7043635n51926o14295o07837o43107p07895n92176m83771n40192m90181
$$ 17043635 16491709 15877414 15269577 14626470 13918575 13326399 12842628 12302436 11812255
19999A1812255m05887l60627l29289l05841k85592l10404k96646k52552k82805
$$ 11812255 11406368 11045741 10716452 10410611 10125019 9814615 9517969 9265417 8982612
19990H982612k58654j86304k54065k74442k27682k58826k44969j99017j90267
$$ 8982612 8723958 8537654 8283589 8009147 7781465 7522639 7277670 7078653 6888386
19981F888386j92730j76607j93412k03687k40407j96335j78372j61811j35647
$$ 6888386 6695656 6519049 6325637 6121950 5881543 5685208 5506836 5345025 5209378
19972E209378j15922j50751j75377j36729j25909j21864m1197o4345j33857j64266
$$ 5209378 5093456 4942705 4767328 4630599 4504690 4382826 4341629 4277284 4143427 3979161
19962C979161j27509n9942l8909j37988o2113m2831j18122p4152m7042m5544j4325
$$ 3979161 3851652 3791710 3752801 3614813 3552700 3509869 3391747 3317595 3270553 3225009 3210684
19951C210684j25685l2813n6331r4075q0955j14673j24726r0633j13138p716o0823
$$ 3210684 3084999 3052186 2995855 2901780 2820825 2706152 2581426 2490793 2377655 2369939 2309116
19940B309116r5584j28382q5723r4718n9097K2080o47r9583r3867l5336j1744
$$ 2309116 2213532 2085150 1999427 1904709 1845612 1867692 1867045 1767462 1673595 1638259 1626515
19929A626515k6405m4324m0329o7182n6843L5050O2060J3533n4580l0104k3097
$$ 1626515 1600110 1555786 1515457 1448275 1391432 1426482 1488542 1502075 1447495 1417391 1394294
19918A394294k5786l5696m4552o8207p5539m4151j399k3626m3943P301j5960j4332
$$ 1394294 1368508 1332812 1288260 1220053 1144514 1100363 1098964 1075338 1031395 1038696 1022736 1008404
19906A008404k1148n6013k9700l2283k271M843p4283n6904n39M3348J6520L5201
$$ 1008404 987256 931243 901543 869260 866989 871832 797549 740645 740106 783454 799974 835175
19894H35175n8155n3553k6057J8678N5048R3462N4898M6464M837J7154J9548j5724
$$ 835175 777020 723467 697410 716088 771136 864598 919496 965960 970797 987951 1007499 991775
19882I91775m2790r7447j16683p4345J0053n4624p2663k1102L825M513j098Q0336
$$ 991775 948985 851538 734855 660510 670563 615939 543276 522174 525999 530512 529414 609750
19870F09750O83K8872J3202k8223j6497m7j6437J9689K191k9470k4892j9453l0296
$$ 609750 610433 639305 652507 624284 607787 607740 591303 610992 613183 583713 558821 539368 509072
19857E09072p6620R190J1103L4919O3307o2842j45491m9652M1802O0107J8671
$$ 509072 432452 441642 452745 487664 550971 488129 342638 292986 334788 394895 413566
19846D13566k9391q219n1654m0650J7262M1253k3469R565J362K5088R55j510m335
$$ 413566 384175 375956 324302 283652 300914 342167 318698 328263 329625 354713 355668 354158 349823
19833C49823O3586L1401K2746j107q4169m1181j0554K2403j6046K887o0282m511
$$ 349823 413409 444810 467556 466449 382280 341099 330545 352948 336902 339789 279507 274996
19821B74996O351j4073l9205l2125n3641L6058M6409R464j5177j8874j3494K7856
$$ 274996 281347 267274 228069 195944 142303 178361 224770 234234 219057 200183 186689 214545
19809B14545J201p352N122L7273j9182j3722K0995j6847Q502j6340n5139K2852
$$ 214545 215746 208394 213516 250789 231607 217885 238880 222033 230535 214195 159056 181908
19797A81908l0584n478J285R4705P2735l4656n4530p9478k3284j7299q068M0695
$$ 181908 151324 145846 147131 241836 314571 279915 225385 145907 122623 105324 97256 137951
19785A37951l6395j3397K8516k3313k4981r378l111o026K80k2980k0173N64K9337
$$ 137951 101556 88159 116675 93362 68381 59003 55892 49866 50146 27166 6993 7557 36894
19772C6894L2242J9891L675L1346n9686l3585K0653n314m0834Q701J3211O4537
$$ 36894 69136 89027 92702 124048 64362 30777 51430 46116 5282 13983 27194 91731
19760I1731l758j6424j6123j1644n633J0934M349j5202j04313K69P9072L0407
$$ 91731 87973 71549 55426 43782 38149 49083 53432 38230 -66083 -65814 13258 43665
19748D3665L5102L2217l8803p1560o5002K3355m356L1633O514o337L5922R9255
$$ 43665 78767 110984 72181 621 -64381 -41026 -45382 -13749 -7235 -13572 22350 121605
19736A21605l8168n0976P251K9139N5685k0337m8720M824k5444j6115J4120M345
$$ 121605 83437 32461 39712 68851 124536 104199 55479 60303 34859 18744 32864 37209
19724C7209J3482j5852L5695m6351J0012j2713k8322N159M8957o964L1667L6451
$$ 37209 50691 34839 70534 24183 34195 21482 -6840 -1681 47276 40312 71979 108430
19712A08430k7521n264J1516M296m2794j2749M4443K8863m3391j9190j8126m2310
$$ 108430 80909 75645 87161 91457 48663 35914 80357 109220 65829 46639 28513 -13797
19700a3797L3467L9876o321n6404j5256J6057J3654J434l3550R51n0672O6840
$$ -13797 19670 59546 53225 -3179 -18435 -2378 11276 12710 -20840 -19889 -70561 -3721
19688c721Q0447l0154m8456J4543k0389n6068p5612k7455J05864M0315k2228K4821
$$ -3721 76726 46572 -1884 12659 -7730 -63798 -139410 -166865 -61001 -20686 -42914 -18093
19676a8093K297L9300N4206l2949q4060j6699J1074R133L5324K8756R0506j6545
$$ -18093 -15796 23504 77710 44761 -39299 -55998 -44924 -35791 -467 28289 118795 102250
19664A02250n5603j7230M5571K6923m9177M801q845l3020P306k7408k6994j2033
$$ 102250 46647 29417 74988 101911 52734 57535 48690 15670 22976 -4432 -31426 -43459
19652d3459j114M5949m598m0891L524J8874J3491q006j2646M2156l615M6128M6966
$$ -43459 -44573 1376 -3222 -44113 -40589 -21715 -8224 -16230 -28876 13280 9665 55793 102759
19639A02759n8414M246o563K3981j8322k3264j7316K1559J6341L6733L5364l8935
$$ 102759 44345 48591 42028 66009 47687 24423 7107 28666 45007 81740 117104 78169
19627G8169K020m143m1441j9382L3148m190k0816n6952J4633Q6339O8462O56m7116
$$ 78169 80189 76046 34605 15223 48371 44181 23365 -33587 -18954 67385 135847 136503 89387
19614H9387o9860m259J8274Q3645L6679k6298l1251l7183n104o2243l378L4070
$$ 89387 19527 15268 33542 117187 153866 127568 96317 59134 54030 -8213 -11591 22479
19602B2479L4422K5623n4395k9626q038Q2079j9374J5070n887p6943k2474K755
$$ 22479 56901 82524 28129 -1497 -9535 72544 53170 68240 62353 -14590 -37064 -34309
19590c4309L5839K867L9350J0475m498l4904k5011L3439r969K9946J0935L5486
$$ -34309 1530 4397 43747 54222 49724 14820 -10191 23248 13279 43225 54160 89646
19578H9646q801m5513j0909L1030K0048j8749n1709o4812n7427L6596L2240M9512
$$ 89646 80845 35332 24423 55453 75501 56752 5043 -59769 -117196 -80600 -48360 1152
19566A152K5905J3217m0145J36K7290k4970k885R321M4312m4662l9761k5053k0611
$$ 1152 27057 40274 129 265 27555 2585 -300 9021 53333 8671 -31090 -56143 -76754
19553g6754J3190M1222q667L4661J494K4822k469P317j1234l2512j7318n6998
$$ -76754 -63564 -22342 -31009 3652 5146 29968 27499 34816 23582 -8930 -26248 -83246
19541h3246J148o972L9402l5862l2948P1178l678k6895j5585m413M1181M4547
$$ -83246 -82098 -89070 -49668 -85530 -118478 -47300 -50978 -77873 -93458 -97871 -56690 -12143
19529a2143O3607L644m3649J1968J611j5155J7581j9830K1638M1163J1325K7576
$$ -12143 51464 55108 11459 23427 25038 9883 27464 7634 29272 70435 81760 109336
19517A09336Q252j4642L870m8857J9436M041J1085R0697J14625o056M250M2265
$$ 109336 117588 102946 106816 57959 77395 81436 92521 183218 297843 291787 296037 338302
19505C38302J48248J32951J30404J36785J74234J47126K9173o6232p0177l3066
$$ 338302 486550 619501 749905 886690 1060924 1208050 1237223 1170991 1100814 1067748
19495A067748r9125j67420j83406j74692r1635p12n3808l9248k3650j0165K6064
$$ 1067748 968623 801203 617797 443105 351470 350758 296950 257702 234052 223887 249951
19484B49951j1740l5878J1413M3924J1763j954j7072N4838R5760J21217L4682
$$ 249951 238211 202333 213746 257670 269433 267479 250407 305245 401005 522222 556904
19473E56904R7851J77587J50220J42286Q0289P0650k6924r2615j27323j81886
$$ 556904 654755 832342 982562 1124848 1205137 1275787 1248863 1156248 1028925 847039
19463H47039j65322r9616j08375n0690q2673p0744l4521k0771o751L0299m1639
$$ 847039 681717 582101 473726 423036 340363 269619 235098 214327 207576 237875 196236
19452A96236m1968k8985o28J559l363n3545R592n23j9095O9098P1479m1989l0858
$$ 196236 154268 125283 124655 126214 122851 69306 78898 78375 59280 128378 199857 157868 127010
19439A27010l6982k9149K0914j3995R946M1313M8672k415n580n2673J705k0584
$$ 127010 90028 60879 81793 67798 77744 119057 167729 165314 159734 107061 108766 88182
19427H8182k3130r106N3818l803m3905m2560J8689L2107l6090o0145m0257J0899
$$ 88182 65052 55946 109764 105961 62056 19496 38185 70292 34202 -25943 -66200 -55301
19415e5301N1840J1108J9137M3432q896R180O4348l6575k6136O117j452j1316
$$ -55301 -3461 7647 26784 70216 61320 70500 134848 98273 72137 78254 76802 65486
19403F5486J4913J0587p2691l8327k9697K4330M4234M066O619N0818o3380L881
$$ 65486 80399 90986 18295 -20032 -49729 -25399 18835 22901 29520 80338 16958 20839
19391B0839J6299L906m0915l3721p632L4113K8237o228l7630n4485J4085o7661
$$ 20839 37138 41044 129 -33592 -41224 -7111 21126 14898 -22732 -77217 -63132 -130793
19379a30793l581Q796k1956M2480P2022N4778K9978j6220j8992L617p3946l7052
$$ -130793 -134374 -125578 -147534 -105054 -33032 21746 51724 35504 16512 20129 -53817 -90869
19367i0869k8197j55Q1201K0913l0596J2571j9560l6380K8320n455L9144J3068
$$ -90869 -119066 -119221 -38020 -17107 -47703 -35132 -54692 -91072 -62752 -68207 -29063 -15995
19355a5995J2477K9419k366p466L669N0193l2369n6078J6697N070l1416PJ7591
$$ -15995 -3518 25901 23535 16069 19738 69931 37562 -18516 -1819 3251 -28165 -28158 -10567
19342a0567L6370j883K4389l0401o446L9623k9827o9968j4713K768K6222j4766
$$ -10567 25803 23920 48309 17908 11462 51085 21258 -48710 -63423 -60655 -34433 -49199
19330d9199l670o617j2858n283O91N4372J8455l7240p7113j6910M9545L8151J0965
$$ -49199 -52869 -59486 -72344 -77627 -76936 -22564 -4109 -41349 -118462 -135372 -85827 -47676 -36711
19317c6711P6980n572l9603m7559q0447k404K8610j4739L6707N9291N3636o041
$$ -36711 40269 34697 -4906 -52465 -132912 -135316 -106706 -121445 -84738 -25447 28189 22148
19305B2148j4224j2953N375j5831J4768K1408M6957k2515J5054K4561l7571q632
$$ 22148 7924 -5029 346 -15485 -717 20691 67648 45133 60187 84748 47177 38545
19293C8545M0503l0501n2149m1879K6983J430K1540j1347k1917j9081k5077J3384
$$ 38545 79048 48547 -3602 -45481 -18498 -17068 4472 -6875 -28792 -47873 -72950 -59566
19281e9566M5028J0750Q745K0597k4648k1947Q958N7295M6669j2948J589J747
$$ -59566 -14538 -3788 4957 25554 906 -21041 -12083 45212 91881 78933 80522 82269
19269H2269o3113O959m6727l6656k08K96L5928M977j5558k7100M6231k0578k3408
$$ 82269 19156 26115 -20612 -57268 -57476 -57180 -21252 -16275 -31833 -58933 -12702 -33280 -56688
19256e6688j2903K285M9592l3662j4123N8468M531n5575J1715K6441L9376j6538
$$ -56688 -69591 -67306 -17714 -51376 -65499 -7031 -2500 -58075 -46360 -19919 19457 2919
19244B919j0273J2850N2101l7142M050j8982m4377J2552L2725p138J1104k6899
$$ 2919 -7354 5496 57597 20455 24505 5523 -38854 -26302 6423 -715 10389 -16510
19232a6510q7463m39Q2678N1089j7542k5608j2653J4956j7152n149L2576J8391
$$ -16510 -103973 -104412 -21734 29355 11813 -13795 -26448 -11492 -28644 -33793 -1217 17174
19220A7174l051m1427j1669l2565o3102n39J4324K6280p017j1882L8831L4831
$$ 17174 14123 -27304 -38973 -71538 -134640 -135179 -120855 -94575 -101592 -113474 -74643 -39812
19208c9812J8755l6059o1199k725M5508o191J0365l5R7228Q121j9903j259l0973
$$ -39812 -21057 -57116 -118315 -121040 -75532 -81723 -71358 -71393 25835 33956 14053 12794 -18179
19195a8179j6520j0476J3226O515q480n204k6428N6303N2932O1409k0363J6570
$$ -18179 -34699 -45175 -31949 -25434 -33914 -39118 -65546 -9243 43689 105098 84735 101305
19183A01305Q177M4116J5663m321l0166m0359o1205m3471R549q633N7395K4117
$$ 101305 109482 153598 169261 164940 134774 94415 33210 -10261 -712 -9345 48050 72167
19171G2167n022m2089j9174n04j0857L196k8890k7125O086J5497N4800n6747o821
$$ 72167 67145 25056 5882 5378 -5479 -2283 -31173 -58298 -52212 -36715 18085 -38662 -45483
19158d5483J1441l2043p885L078n3270O0307R4916k4686k7702k1297n132K130
$$ -45483 -34042 -66085 -73970 -70892 -124162 -63855 31061 6375 -21327 -42624 -47756 -45626
19146d5626K5366K0769L9247k4795l96J3151L0720M6046L4k8448m0039K6298k0409
$$ -45626 -20260 509 39756 14961 14565 27716 58436 104482 104516 76068 36029 62327 41918
19133D1918P480N3785O2665O0177L558K8165j4210m0150n7140n3571K6089l7791
$$ 41918 49398 103183 165848 226025 229583 257748 243538 203388 146248 92677 118766 80975
19121H0975k8710P7859k1886j07714l5884N2080J459j6649J5026R00r981l7236
$$ 80975 52265 130124 108238 524 -35360 16720 18179 1530 16556 17456 7475 -29761
19109b9761j3355L3499L7354O3583n2564l3886K687l4952J6872l255l8782J6218
$$ -29761 -43116 -9617 27737 91320 38756 4870 7557 -27395 -10523 -13778 -52560 -36342
19097c6342l8271j1562K6649O878L9106J9026j9995j5822K4644Q4871j5331n2020
$$ -36342 -74613 -86175 -59526 -52648 -13542 5484 -14511 -30333 -5689 79182 63851 11831
19085A1831j00055j2495o612q354J2964N947L6559J9320N3112j7743m205K080
$$ 11831 -88224 -100719 -107331 -115685 -102721 -96774 -60215 -40895 12217 -5526 -9731 -7651
19073g651O982j4746l7077k3936O9876J8378m8546K2691k0599k4693Q40k0472
$$ -7651 -669 -15415 -52492 -76428 -6552 11826 -36720 -14029 -34628 -59321 -58481 -78953
19061g8953L8989K6410M0166l2553l6097p8264K3237O5146j5319k645K5397M409
$$ -78953 -39964 -13554 26612 -5941 -42038 -120302 -97065 -31919 -47238 -49883 -24486 -20077
19049b0077N8701m117j4815J6207k6381m4888J6195O207l636K2667J7045q315
$$ -20077 38624 34507 19692 35899 9518 -35370 -19175 -12968 -16604 6063 23108 14793
19037A4793J5790o2767j0451J2006r286j7065L2775M902l6231J1313j3591k4394
$$ 14793 30583 -32184 -42635 -30629 -39915 -56980 -24205 -19303 -55534 -44221 -57812 -82206
19025h2206k7858j8079P6941O1821k0814J3212Q586o7765J8644J1049j2281J9110
$$ -82206 -110064 -128143 -51202 10619 -10195 3017 11603 -56162 -37518 -26469 -38750 -19640
19013a9640K3330o6306l2612J1148k9063R1513P5041J8156m3726j3530N6968N6368
$$ -19640 3690 -62616 -95228 -84080 -113143 -21630 53411 71567 27841 14311 71279 127647
19001A27647j1031p2090j10403l7446J9095O1749k2853P9710R5888j9669l7140
$$ 127647 116616 44526 -65877 -103323 -84228 -22479 -45332 34378 130266 110597 73457
18990G3457m175l9830n9128J0609M2175p251L5605K4750m4146m7488O588L3292
$$ 73457 69282 29452 -29676 -19067 23108 15857 51462 76212 32066 -15422 -8834 24458
18978B4458j8040R570j977K1757m4595j2417K453P329O327l0529k6505j76J529
$$ 24458 6418 15988 14011 35768 -8827 -21244 -18791 -11462 -5135 -35664 -62169 -62345 -60816
18965f0816J4857M5521K2948m332m4779j769M5887J2642P081j4079J882l0856
$$ -60816 -45959 -438 22510 18178 -26601 -28370 17517 30159 37240 23161 25043 -5813
18953e813J79K1926j6478P2240K1581j7869r0100j7573J4979n646O4288N0273
$$ -5813 -5634 16292 -186 72054 93635 75766 -14334 -31907 -16928 -22574 41714 91987
18941I1987m1593k2815o8N8176J7358j8836k6147k8292j1228k2880l1266j4536
$$ 91987 50394 27579 27511 85687 103045 84209 58062 29770 18542 -4338 -35604 -50140
18929e0140M5111L7491N7390R178m2009n8221j7623M8855k5364K3613J3222n2697
$$ -50140 -5029 32462 89852 99030 57021 -1200 -18823 30032 4668 28281 41503 -11194
18917a1194m4197J5522J2026K2041n113k0540m4010k4446L6483k0172K8068k91
$$ -11194 -55391 -39869 -27843 -5802 -10915 -31455 -75465 -99911 -63428 -83600 -55532 -55823
18905e5823P093J1568L9179K9208l2801m8810J5000K2483m2803m9885J9021Q419
$$ -55823 -48730 -37162 2017 31225 -1576 -50386 -35386 -12903 -55706 -105591 -86570 -78151
18893g8151r945P6522M1609J5113M3575n6647l3910l7560l0876L1710K2445j0816
$$ -78151 -88096 -11574 30035 45148 88723 32076 -1834 -39394 -70270 -38560 -16115 -26931
18881b6931K2965m5710R11L8947J1979q306m2633l443K0130L8173j7433j4893
$$ -26931 -3966 -49676 -48765 -9818 2161 -6145 -48778 -52221 -32091 6082 -11351 -26244
18869b6244L1557J5347l2050k241p076q558l7410k9825L0000K0893O1239K5029
$$ -26244 5313 20660 -11390 -13631 -20707 -29265 -66675 -96500 -66500 -45607 15632 40661
18857D0661n4695m865J4436J6045o510k6510o407O105J8000l2920k2894l1472
$$ 40661 -14034 -18899 -4463 11582 5072 -21438 -27845 -21740 -3740 -36660 -59554 -91026
18845i1026L8328K7857l2832M0339M0688k436J483k9867m7726j2177O872M1673
$$ -91026 -52698 -24841 -57673 -17334 23354 20918 22401 -7466 -55192 -67369 -60497 -18824
18833a8824M2222k2047k8051J8920l2415p2911J4497N0580N0589N1684j4068j9416
$$ -18824 23398 1351 -26700 -7780 -40195 -113106 -98609 -48029 2560 54244 40176 20760
18821B0760J3386M9958J1047J9353l7331m7946j4796N2540l3616p6834k296k2500
$$ 20760 34146 84104 95151 114504 77173 29227 14431 66971 33355 -43479 -45775 -68275
18809f8275j5738L299j4290l2080M489K7422M10K9384L9161L041K1453j2162k5513
$$ -68275 -84013 -80714 -95004 -127084 -122595 -95173 -94763 -65379 -26218 -23177 -1724 -13886 -39399
18796c9399k3361m4850P0086M9024k4992L9022k1790K4960M6365J645m1851J795
$$ -39399 -62760 -107610 -37524 11500 -13492 25530 3740 28700 75065 76710 34859 36654
18784C6654J0271J2989M1852R331o5640m261Q6671J9842o204j1721k4911l4217
$$ 36654 46925 59914 101766 111097 45457 41196 127867 147709 141505 129784 104873 70656
18772G0656L5882O3392Q5170J38964L6738K0937j1343o5284j63776j28073J0696
$$ 70656 106538 169930 255100 394064 430802 451739 440396 375112 211336 83263 93959
18761I3959k2864K1375k1128k8001K2301K2206m3235N852j4308k6177j3115j7280
$$ 93959 71095 92470 71342 43341 65642 87848 44613 50465 36157 9980 -3135 -20415
18749b0415K0193N1476q556j4089j2662N457L8359j9122o1572j97k3668m0184
$$ -20415 -222 51254 42698 28609 15947 21404 59763 40641 -20931 -21128 -44796 -84980
18737h4980R338j3796K1081O139R898K4243m0950k0331P3958K8816J2511k9570
$$ -84980 -75642 -89438 -68357 -62218 -52320 -28077 -69027 -89358 -15400 13416 25927 -3643
18725c643N874k3587k8195k1788J5663j6319l4562o3586o760O9428O5601N862
$$ -3643 2231 -21356 -49551 -71339 -55676 -71995 -106557 -170143 -176903 -107475 -41874 -36012
18713c6012K0056l104L1871j9518k5203K5427l9384n6301Q5625L1051j3436N5380
$$ -36012 -15956 -19060 12811 -6707 -31910 -6483 -45867 -102168 -16543 14508 1072 56452
18701E6452m047m1842L6028J2348J2942J6530p7278M560J1496p723n9536l2690
$$ 56452 52405 10563 46591 58939 71881 88411 11133 15693 27189 19466 -40070 -72760
18689g2760O1910O493J8531L0515j4271p2190L958K6034o791l4511k5714o325
$$ -72760 -10850 -4357 14174 44689 30418 -41772 -37814 -11780 -18571 -53082 -78796 -85121
18677h5121P84J6816L5805R1429j3285K0527O0441j3776k7539J4309M947J2530
$$ -85121 -84337 -67521 -31716 59713 46428 66955 127396 113620 86081 100390 105337 117867
18665A17867N0950n669q192J3121k9160m7653r731l2218K290o3381J0703N190
$$ 117867 168817 163148 154956 168077 138917 91264 81533 49315 51605 -11776 -1073 4117
18653D117p774O3579j5825j7592M8550j4439m5602l1146M6092K5296k8717r9879
$$ 4117 -3657 59922 44097 26505 75055 60616 15014 -16132 29960 55256 26539 -73340
18641g3340k2144N994N6161M1758j9167k747j1038j3748j8451n9281m7044L6489
$$ -73340 -95484 -89490 -33329 8429 -10738 -13485 -24523 -38271 -56722 -116003 -163047 -126558
18629a26558O9096k408k3177K5074k230k6089J8070N3338k9591J0644l691k2130
$$ -126558 -57462 -59870 -83047 -57973 -60203 -86292 -68222 -14884 -44475 -33831 -37522 -59652
18617e9652q3317K0177M9303L917J9308M5402L7448l0245p6043o0300P1315M4478
$$ -59652 -142969 -122792 -73489 -69572 -50264 -4862 32586 2341 -73702 -134002 -62687 -18209
18605a8209J8468Q9l8714O287M2764N2171k4521L088o118j6356l7796j4123J4109
$$ -18209 259 348 -38366 -32079 10685 62856 38335 41423 35305 18949 -18847 -32970 -18861
18592a8861J2638J4257m8712j833M0925M7278k1620q346j8282m7401j4620M4368
$$ -18861 -6223 8034 -40678 -42511 -1586 45692 24072 15726 -2556 -49957 -64577 -20209
18580b0209l045l46J5497J5196J8758k1167N220j0213k3869n055K2390p233j9935
$$ -20209 -23254 -23600 -8103 7093 25851 4684 9904 -309 -24178 -29233 -6843 -14076 -34011
18567c4011K4892l8865j4916m215k2533j5041K454N7548R0887J9135l6446k1159
$$ -34011 -9119 -47984 -62900 -67115 -89648 -104689 -102235 -44687 46200 65335 28889 7730
18555G730k7609j9243L2478K696N994K2611J3549n8209O6942O46j6319n6979k2933
$$ 7730 -19879 -39122 -6644 -3948 2046 24657 38206 -20003 46939 47585 31266 -25713 -48646
18542d8646J6512J0135L2112j7921m9358m44K283O84M7565L1611K1359k3752l6667
$$ -48646 -32134 -21999 10113 -7808 -57166 -57610 -55327 -54643 -7078 24533 45892 22140 -14527
18529a4527l4130L0170M0844j2540n3276n8052m041J3497m4386M0710N5371K5756
$$ -14527 -48657 -18487 22357 9817 -43459 -101511 -105552 -92055 -136441 -95731 -40360 -14604
18517a4604m7505J9146O448j4244J9636M7225R768m1874j0553k7449Q305m033
$$ -14604 -62109 -42963 -36515 -50759 -31123 16102 25870 -16004 -26557 -54006 -45701 -49734
18505d9734r442p062R925L6972M724o557K6157m2301k303l221N4918N7429j5880
$$ -49734 -59176 -66238 -56313 -19341 -14617 -21174 4983 -37318 -39621 -42842 12076 69505 53625
18492E3625j4650J7005K5075L516j4805M5289q488q2606l8237N4574N2235K5413
$$ 53625 38975 55980 81055 84571 69766 115055 106567 23961 -14276 40298 92533 117946
18480A17946p7451j1509j77M019j7070K4473M5670l1760n6102l65N9904J1498
$$ 117946 40495 28986 28809 32828 15758 40231 85901 54141 -1961 -2326 57578 69076
18468F9076l6628k8684n6860L5942N1170l1281o4741l4233M0920N8701j6534q856
$$ 69076 32448 3764 -53096 -17154 34016 2735 -62006 -96239 -55319 3382 -13152 -22008
18456b2008J9833J7184j0530J0374K3169L4599l178k4824p7788k2951m5543J7410
$$ -22008 -2175 15009 4479 14853 38022 72621 69443 44619 -33169 -56120 -101663 -84253
18444h4253Q7429J2814k0235j897q2630J6079P1882l2j6020m955J1914j7571m5596
$$ -84253 3176 15990 -4245 -6142 -88772 -72693 -811 -843 -16863 -21818 -9904 -27475 -73071
18431g3071l375L1351M2344K870n467m7245k1718m401N0706j7137l2606K6951
$$ -73071 -76446 -45095 -2751 119 -5348 -52593 -74311 -78712 -28006 -45143 -77749 -50798
18419e0798N4846N2754j4632k3114k2749n4274M7461Q0366L1723J9174N2016l905
$$ -50798 4048 56802 42170 19056 -3693 -57967 -10506 69860 101583 120757 172773 168868
18407A68868j6283K2569k0988J4000J6402K2116k6628J5005Q0002K4277J9810
$$ 168868 152585 175154 154166 168166 184568 206684 180056 195061 275063 299340 319150
18396C19150L4346l077J8247q332r3101m0427L2434Q1217Q1721M6643K4731L0018
$$ 319150 353496 350419 368666 360334 267233 226806 259240 340457 422178 468821 493552 523570
18384E23570K7403L7310k3116j6911k0312J1207J9727N7842P0680Q9607O8083
$$ 523570 550973 588283 565167 548256 527944 539151 558878 616720 687400 777007 845090
18373H45090m9707q0747q4635m3705J3906N2233P2292O1633K4973L5327l20n5012
$$ 845090 795383 714636 630001 586296 600202 652435 724727 786360 811333 846660 846340 791328
18361G91328j32827j29236j29512m8633O6540J15001k894j4205J6688P1970K8405
$$ 791328 658501 529265 399753 351120 417660 532661 529767 515562 532250 604220 632625
18350F32625m7303o4280j08567l5520p8524j6433O8517k8746k4314j6356m2450
$$ 632625 585322 521042 412475 376955 298431 281998 350515 321769 297455 281099 238649
18339B38649M329k6467p122l2608J6955K5056k3022l0552m3841l4813O7331J3766
$$ 238649 242978 216511 209389 176781 193736 218792 195770 165218 121377 86564 153895 167661
18327A67661m2451j5658K0376L800J6148J9325K702M7029L4359n566P770k0158
$$ 167661 125210 109552 129928 133728 149876 169201 171903 218932 253291 247725 255495 235337
18315B35337K1072l2453j284K3814j2120k3834j0111Q2n6182j15272p113M7860
$$ 235337 256409 223956 222672 246486 234366 210532 200421 200503 144321 29049 21936 69796
18303F9796M4015L3972J7639k5270n7022l1590k1755k0066k8443m8342J0038P3609
$$ 69796 113811 147783 165422 140152 83130 51540 29785 9719 -18724 -67066 -57028 16581
18291A6581L7305M4089K0699j0887n2361j9265L1094K1845O6914J8302k0973l8697
$$ 16581 53886 97975 118674 107787 55426 36161 67255 89100 156014 174316 153343 114646
18279A14646k5647k1363J2888m0166j3245m710R676j347J1128k2909R409q618
$$ 114646 88999 67636 80524 40358 27113 22403 32079 30732 41860 18951 28360 19742
18267A9742L242j073n3762l7937M5125j4027m0022J2332L0403M3416J3285J9807
$$ 19742 22984 21911 -31851 -69788 -24663 -38690 -78712 -66380 -35977 7439 20724 40531
18255D0531l5159p046L1105k5995M5067P217J6213k9465N2633j492q4337J6022
$$ 40531 5372 -1674 29431 3436 48503 55720 71933 42468 95101 93609 9272 25294
18243B5294R467n8685m146L067k7899k2480J7082k9333l994M3448L2384R2882
$$ 25294 34761 -23924 -28070 -25003 -52902 -75382 -58300 -87633 -91627 -48179 -15795 77087
18231G7087J1736k4147O375k1570M3520M977M9437n698l2614l624k7485m6996
$$ 77087 88823 64676 71051 49481 93001 97978 147415 141717 109103 105479 77994 30998
18219C0998L7856K571P85j2796J0739L2331m0170J9875J7852K9623n583j0213
$$ 30998 68854 71425 72210 59414 70153 102484 62314 82189 100041 129664 124081 113868
18207A13868l0717p0379p908l054L2392Q316N4326L8770m7087k8480K3456K267
$$ 113868 83151 12772 4864 1810 34202 42518 96844 135614 88527 60047 83503 85770
18195H5770R37K0844o9306n957J05698J8039n3291P759J9476J7846J8535k649
$$ 85770 86707 107551 38245 32288 137986 156025 102734 110493 129969 147815 166350 163701
18183A63701n061k8996M2548L2525j6239p2820m6300m1069k1417K6006R190L7380
$$ 163701 158640 129644 172192 204717 188478 115658 69358 28289 6872 32878 42068 79448
18171G9448j7551M0618q557J6074O999j3924L962L8260J0879K0652m202j13365
$$ 79448 61897 102515 93958 110032 117031 103107 107069 145329 156208 176860 172658 59293
18159E9293o3876Q2180J4865K3946L7220j9120m7407L156M2357l8066m8296M349
$$ 59293 -4583 77597 92462 116408 153628 134508 87101 90257 132614 94548 46252 50601
18147E0601N4959K8333M0943j0450m6977M7659O4673k417K110m9059n1303J2232
$$ 50601 105560 133893 174836 164386 117409 165068 229741 227324 229434 180375 129072 141304
18135A41304M3460R9852J19501J01433L0037L645P9339J61240J19735J34067R0963
$$ 141304 184764 284616 404117 505550 535587 539232 618571 779811 899546 1033613 1124576
18124A124576J32400J14775J91823K89289L59220M47941O64289J090029J533337
$$ 1124576 1256976 1371751 1563574 1852863 2212083 2660024 3324313 4414342 5947679
18115E947679K270357L779363O619641J0681881J2325966Q702202Q157663P980532
$$ 5947679 8218036 11997399 18617040 29298921 41624887 50327089 58484752 66465284
18107F6465284l587541k1020005j5846457q075776m275066k609609j809573j256207
$$ 66465284 62877743 41857738 26011281 17935505 13660439 11050830 9241257 7985050
18099G985050q56609o30721m96753m41353l57608l33670k03443k21255k90794
$$ 7985050 7128441 6497720 6000967 5559614 5202006 4868336 4664893 4443638 4152844
18090D152844k11382j34587k08101j54290j36321j04386p0722o2213r9639j21690
$$ 4152844 3941462 3806875 3598774 3444484 3308163 3203777 3133055 3070842 2971203 2849513
18080B849513j32435j30570j56870j20395j23659o8404k8002j03410o1273r7744
$$ 2849513 2717078 2586508 2429638 2309243 2185584 2117180 2089178 1985768 1924495 1826751
18070A826751l3150q0095o4142m7684o823n9482p9347p0054k9495k089o0456p0842
$$ 1826751 1793601 1713506 1649364 1601680 1594857 1535375 1456028 1385974 1356479 1354390 1293934 1223092
18058A223092n6418m9631k9575m2688k4988Q472l5420m1709L7207l7511o8780
$$ 1223092 1166674 1117043 1087468 1044780 1019792 1028264 992844 951135 988342 950831 882051
18047H82051J2505k899m2973l2297n7682r5996K0637K2295J1571o1282p471j8575
$$ 882051 894556 891657 848684 816387 758705 662709 683346 705641 717212 655930 648459 629884
18035F29884k6583q243m3091m6546N688J3173r907o323j3161j0093K6199M3379
$$ 629884 603301 595058 551967 505421 511109 524282 514375 508052 494891 484798 510997 554376
18023E54376j5135k8525N83K259m1783J7986j6471o0944k7734l631j0886J21l5177
$$ 554376 539241 510716 511299 513558 471775 489761 473290 412346 384612 380981 370095 370216 335039
18010C35039J6125m6790j416P039l9083o1378M4583L3473j5863J3264p345J324
$$ 335039 351164 304374 302958 309997 270914 209536 254119 287592 271729 284993 277648 278972
17998B78972P8013k5222k7112j490k7357n3140p386m8395l4755M8230J6887K193
$$ 278972 356985 331763 304651 303161 275804 222664 215278 166883 132128 180358 197245 199438
17986A99438L5620L1943R736l3575k9400j2184r799J7782j1547K052l3095M2332
$$ 199438 235058 267001 276737 243162 213762 201578 191779 209561 198014 200066 166971 209303
17974B09303L0658L9033l9467m3520l8584N5258J1605l8941J2546J5305j6987
$$ 209303 239961 278994 239527 196007 157423 212681 224286 185345 197891 213196 196209
17963A96209k356J349l0733k3821L2343K4079j3630l2484m3475j8629k4285j561
$$ 196209 193853 195202 164469 140648 172991 197070 183440 150956 107481 88852 64567 63006
17951F3006J7227P644N8997M801m914K5440p977L6156n855j2649j2479k0342k9714
$$ 63006 80233 87877 146874 151675 146761 172201 164224 200380 194525 181876 169397 149055 119341
17938A19341n1446j8753j1393k9090L2278P3162M4245j3896k1589J0503M5806
$$ 119341 67895 49142 37749 8659 40937 114099 158344 144448 122859 133362 179168
17927A79168O9095L7990K8814k1283k4569q58L9842o2625o3561q0126m7217P0318
$$ 179168 248263 286253 315067 293784 269215 268357 308199 245574 182013 101887 54670 124988
17915A24988M5503L9190N1098o291Q998j5550J0895O6703J10652J67159J66302
$$ 124988 170491 209681 260779 254488 263486 247936 258831 325534 436186 603345 769647
17904G69647K73061K85041J94550J39414M1081j07481k63000k57779k32269j28766
$$ 769647 1042708 1327749 1522299 1661713 1702794 1595313 1332313 1074534 842265 713499
17894G13499q7441j06403o8785m7461n6438J2538J06918j0695l3894q656p2264
$$ 713499 626058 519655 450870 403409 346971 359509 466427 455732 421838 413182 340918
17883C40918m8113N3580J8403j4018O5137P714L2950J24147J59103J43492J81101
$$ 340918 292805 346385 364788 350770 415907 423621 456571 580718 739821 883313 1064414
17872A064414J97123K19037J23042k5343j46961k32198k38432k22447j44392j26010
$$ 1064414 1261537 1480574 1603616 1578273 1431312 1199114 960682 738235 593843 467833
17862D67833o3124m2589K6368J2993k5951n1347l0133r60J0526j2848j6059j06965
$$ 467833 404709 362120 388488 401481 375530 324183 294050 293090 303616 290768 274709 167744
17850A67744R918J9657q806l8395L1361L8221J7922o817r4624q640J01917M8880
$$ 167744 177662 197319 188513 150118 181479 219700 237622 230805 136181 127541 229458 278338
17838B78338m8810p3623k3458J3146N954P8805n6069k9528l3747m5890N9297O713
$$ 278338 229528 155905 132447 145593 151547 230352 174283 144755 111008 65118 124415 131128
17826A31128n258K4806m2227M6482K9929l2581Q444J7079n7801l6644r208L2180
$$ 131128 125870 150676 108449 154931 184860 152279 160723 177802 120001 83357 74149 106329
17814A06329K0373j2190N439j4648j0224m7784J5305j7327n1111J5330M2921p973
$$ 106329 126702 114512 119951 105303 95079 47295 62600 45273 -5838 9492 52413 44440
17802D4440J430m585l1629n222P6175j2691j453J1346k7276P727N116Q397o378
$$ 44440 45870 41285 9656 4434 80609 67918 66465 77811 50535 58262 63378 71775 65397
17789F5397j9024q5993n8177Q2066P6031L6558P541k5777n6004O74N2326k3339
$$ 65397 46373 -39620 -97797 -15731 60300 96858 104399 78622 22618 23292 75618 52279
17777E2279k9251J2875N175n1502m5147N6326K4905k9911j5400L2611O1479O376
$$ 52279 23028 35903 41078 -10424 -55571 755 25660 -4251 -19651 12960 74439 80815
17765H0815n3179Q626L1709r786j0265O838l8591l68j2912N0408L072o3699J7952
$$ 80815 27636 36262 67971 58185 47920 54758 16167 15799 2887 53295 56367 -7332 10620
17752A0620j5930j7230K88Q432J1140M7780m0550k8910J7027k9717j3419K2995
$$ 10620 -5310 -22540 -22252 -13820 -2680 45100 4550 -24360 -7333 -37050 -50469 -27474
17740b7474P3662M6520m3592o0423p514M7301J5114k274K6444k5857k3665N7543
$$ -27474 46188 92708 49116 -11307 -18821 28480 43594 41320 67764 41907 18242 75785
17728G5785N133l2268k3121L3402K6895p596M0125L0187o7207n3895j6905k632
$$ 75785 80918 48650 25529 58931 85826 78230 118355 148542 81335 27440 10535 7903
17716G903M6346n989m4214j6758L6975q76J55K8644m444L042L9616j5357m810
$$ 7903 54249 48260 4046 -12712 24263 23387 23542 52186 47742 50784 90400 75043 70233
17703G0233O616j6083L5750L1057P373l741j5005m669K5975l2079K6633M124k1869
$$ 70233 76849 60766 96516 127573 134946 131205 116200 111531 137506 105427 132060 136184 114315
17690A14315j5167j0944l0030m1684K5412k9191p484K0526O8047k3716r779M3679
$$ 114315 99148 88204 58174 16490 41902 12711 5227 25753 93800 70084 60305 103984
17678A03984J3736k7166o967l4282l5220l3872L591K7848j1436l9639K276M004
$$ 103984 117720 90554 83587 49305 14085 -19787 -16196 11652 216 -39423 -37147 -33143
17666c3143j7029m5372J3963J7518O9169N5486k5969J9388J3565J2081n777k8030
$$ -33143 -50172 -95544 -81581 -64063 5106 60592 34623 54011 67576 79657 73880 45850
17654D5850q653J527P1712M2095m3934p374K1402L4275n7621p3444K7399P0485
$$ 45850 37197 38724 110436 152531 108597 101223 122625 156900 99279 25835 53234 123719
17642A23719n7105j2612J9751n6067K9475J8826j5636J7996j2323j7878k299k595
$$ 123719 66614 54002 73753 17686 47161 65987 50351 68347 56024 38146 35847 33252
17630C3252j0479Q4494J5644l6579j7454M7014J7008K4092j0511q5020k2727L0152
$$ 33252 22773 107267 122911 86332 68878 115892 132900 156992 146481 61461 38734 68886
17618F8886J3961J9312L6079p574L7277O0751O8215k9667m2467j2459k5580n1563
$$ 68886 82847 102159 138238 130664 167941 228692 296907 267240 224773 212314 186734 135171
17606A35171K3162j8178O662k6681o004O6146N837l677k1613J3496k4625k0577
$$ 135171 158333 140155 146817 120136 114132 180278 186115 182438 160825 174321 149696 129119
17594A29119M3679l7188p1455M8562M0539N0908m1164l1997Q846J9282j2622K7968
$$ 129119 172798 135610 64155 112717 153256 204164 163000 131003 139849 159131 146509 174477
17582A74477M2894j1185M2705O6669j7116n9379o1548k7750m3260K8496Q0055
$$ 174477 217371 206186 248891 315560 298444 239065 177517 149767 106507 135003 215058
17571B15058K7751m1331n3748j0651l0430Q915n724Q203J1588M25M8974j6815
$$ 215058 242809 201478 147730 137079 106649 115564 109840 118043 129631 130056 179030 162215
17559A62215l1483l0040L292L4127Q87l9205m0581J8686M6871l539l9054R557
$$ 162215 130732 100692 103984 138111 138998 99793 59212 77898 124769 121230 82176 91733
17547I1733O7814j3316j6736n1928r3760k7679M0559Q990K5340l146j1447j5528
$$ 91733 159547 146231 129495 77567 -16193 -43872 -3313 5677 31017 27871 16424 896
17535H96L128j6527o142K4049L2928l0672J3751M6651j7308k2424M8414P2909
$$ 896 4024 -12503 -18645 5404 38332 7660 21411 68062 50754 28330 76744 149653
17523A49653j3781j1398J6395Q864K4001k1595m602J0382o5720o9482n4989m8173
$$ 149653 135872 124474 140869 149733 173734 152139 147537 157919 92199 22717 -32272 -80445
17511h0445K8392N7402n3173K0825O0831N6434l0070j510K4601K0532K0402l4842
$$ -80445 -52053 5349 -47824 -26999 33832 90266 60196 58686 83287 103819 124221 89379
17499H9379k9095l9043m1771k3266j3459P7125O6252K5386K7107M201L5339j5575
$$ 89379 60284 21241 -20530 -43796 -57255 19870 86122 111508 138615 142816 178155 162580
17487A62580M2142R765l555L4819P4824R8689M5542m1115m8413L5068K0123K4849
$$ 162580 204722 214487 210932 245751 320575 419264 464806 423691 375278 410346 430469 455318
17475D55318k7704n4143k9764J20j552K5684M4732J6529M335J5950P9348J49827
$$ 455318 427614 373471 343707 343827 342275 367959 412691 429220 433555 449505 528853 678680
17463F78680Q5873J74751K25862J54963J25440K10725J05356o2141k71141k63347
$$ 678680 764553 939304 1165166 1320129 1445569 1656294 1761650 1699509 1428368 1165021
17453A165021j31849l3731p3152m9869J6275K7386N8073N1896M4634N2561N9263
$$ 1165021 1033172 999441 926289 876420 892695 920081 978154 1030050 1074684 1127245 1186508
17442A186508j324K0487q1434j67187o1724l250q802O0190P7815J25196K33342
$$ 1186508 1185184 1205671 1124237 957050 895326 892076 883274 943464 1021279 1146475 1379817
17431A379817K21349K15818K16373J72818J13414j3654j77414l40811l41842k38839
$$ 1379817 1601166 1816984 2033357 2206175 2319589 2305935 2128521 1787710 1445868 1207029
17421A207029j43610m3916O7858P7991L0964M7165J13070N0369J50386K43609
$$ 1207029 1063419 1019503 1087361 1165352 1196316 1243481 1356551 1406920 1557306 1800915
17411A800915K06026J68346J01350O5537k3700j92207k87901k48292j22801j2881
$$ 1800915 2006941 2175287 2276637 2342174 2318474 2126267 1838366 1590074 1467273 1454392
17401A454392K8480L9113L9040K0639R86k432J2948L7232R1063J26363M7310o537
$$ 1454392 1482872 1521985 1561025 1581664 1582650 1580218 1593166 1630398 1721461 1847824 1895134 1888597
17389A888597P6442J03664N5804P0237J26211K07558J93673K68552M12082M66962
$$ 1888597 1965039 2068703 2124507 2194744 2320955 2528513 2722186 2990738 3402820 3869782
17379C869782N07569M81283M33797K89233J81548K84318M10639N35285P64577
$$ 3869782 4377351 4858634 5292431 5581664 5763212 6047530 6458169 6993454 7758031
17370G758031J009498J227067J543260K030554K785895L787311N294625P531877
$$ 7758031 8767529 9994596 11537856 13568410 16354305 20141616 25436241 32968118
17362C2968118J0961001J6511732K5277673L6943577M7557223N1553253M7491202
$$ 32968118 43929119 60440851 85718524 122662101 170219324 221772577 269263779
17355B69263779L6377007J4100816k1406103n3924319o2870689n0028033l2256336
$$ 269263779 305640786 319741602 298335499 244411180 181540491 131512458 99256122
17348I9256122j9474117j2150534q106460n721980l913422k759243k053306j681444
$$ 99256122 79782005 67631471 59525011 53803031 49889609 47130366 45077060 43395616
17340D3395616j477460j449279j318431o66363L65134J402597K711801M542618
$$ 43395616 41918156 40468877 39150446 38484083 38849217 40251814 42963615 47506233
17332D7506233O958767J0856580J6990016K6353616L7961750M7308631M9290299
$$ 47506233 54465000 65321580 82311596 108665212 146626962 193935593 243225892
17325B43225892M3640638L0817442N950124k9956703n7974120o0964498m5832211
$$ 243225892 286866530 317683972 323634096 293677393 235703273 174738775 128906564
17318A28906564k9096326j7793306j1479859q031303n853651m335837l347678
$$ 128906564 99810238 82016932 70537073 62505770 56652119 52316282 48968604
17311D8968604k754730k546879k539039k668590k708268k405523j940102j616728
$$ 48968604 46213874 43666995 41127956 38459366 35751098 33345575 31405473 29788745
17303B9788745j336261j181706j112483r81468r12416q48615q81756q39547q09675
$$ 29788745 28452484 27270778 26158295 25176827 24264411 23415796 22534040 21694493 20884818
17294B0884818p76419p64419p99423p18654o88075o50363n89309n37469m72029
$$ 20884818 20108399 19343980 18544557 17825903 17137828 16487465 15898156 15360687 14888658
17285A4888658m95560n29571m62697m65018m73761m55484l46329l51646l60754
$$ 14888658 14393098 13863527 13400830 12935812 12462051 12006567 11660238 11308592 10947838
17276A0947838l22217l25191k40094j72845k35835k73890k76723k36343j96733
$$ 10947838 10625621 10300430 10060336 9887491 9651656 9377766 9101043 8864700 8667967
17267H667967l06993l30205k49907k45879k47601k12474j85354k17692j52697
$$ 8667967 8360974 8030769 7780862 7534983 7287382 7074908 6889554 6671862 6519165
17258F519165j34889j95910j55081j76917j96263j77508j76961j91024j53508
$$ 6519165 6384276 6188366 6033285 5856368 5660105 5482597 5305636 5114612 4961104
17249D961104j76349j31704j15031j10957r9336n6050n5223j24373j33101j30086
$$ 4961104 4784755 4653051 4538020 4427063 4327727 4271677 4216454 4092081 3958980 3828894
17239C828894j13131n2780l1307o9906o6123j20467p3449o9025r3654q7443n7996
$$ 3828894 3715763 3662983 3631676 3561770 3495647 3375180 3301731 3232706 3139052 3051609 2993613
17228B993613n3600k4509p6655j23326j27781o7886r4024n5167m2247l2637k0078
$$ 2993613 2940013 2915504 2838849 2715523 2587742 2519856 2425832 2370665 2328418 2295781 2275703
17217B275703r8503l7433j32499m7651n7068m8135r977r6549j53638p3313m9788
$$ 2275703 2177200 2139767 2007268 1959617 1902549 1854414 1844437 1747888 1594250 1520937 1471149
17206A471149l1629r548Q992l8898m9075j4103k542J2456M3195K8470j8610l0821
$$ 1471149 1439520 1429972 1438964 1400066 1350991 1336888 1334346 1346802 1389997 1418467 1399857 1369036
17194A369036o4994n9491L896m0604n7458m0067p0231r1805r817n10L5649l0329
$$ 1369036 1304042 1244551 1248447 1207843 1150385 1110318 1040087 948282 938465 937955 973604 943275
17182I43275n3778l0206j010l5509k5556r404j4138o1472k0789J3143m9757L2399
$$ 943275 889497 859291 858281 822772 797216 787812 773674 712202 691413 704556 654799 687198
17170F87198J27849M2091k9112k3039n2681o6610r4023p0959m4887l445N0599
$$ 687198 815047 857138 828026 804987 752306 685696 591673 520714 475827 472382 522981
17159E22981k1134R38p207K3167J0219m6140k5214L23K8476L2760M453j7977j8242
$$ 522981 501847 502785 495578 518745 528964 482824 457610 457933 486409 519169 523622 505645 487403
17146D87403L0233K6236P702j471n4739q5822L1656N6541L9508N8812j4255q4738
$$ 487403 517636 543872 551574 550103 495364 409542 441198 497739 537247 596059 581804 497066
17134D97066j4141m7719j0855l0050m1985n1975K867L401K7942M3889j4314m7093
$$ 497066 482925 435206 424351 394301 352316 300341 303208 306609 334551 378440 364126 317033
17122C17033J1600R097j7386j3389L5576l626k858P3155K2622o3541j4212m0951
$$ 317033 328633 337730 320344 306955 342531 338905 336047 409202 431824 368283 354071 313120
17110C13120P460K0917j8707k4251L4324J5881m6195j6099N3495K3285K529L304
$$ 313120 320580 341497 322790 298539 332863 348744 302549 286450 339945 363230 365759 369063
17098C69063m1714o8526l8391p299j5516M255J2426L2175M730L5985k0299r061
$$ 369063 327349 258823 220432 213133 197617 201872 214298 246473 251203 287188 266889 257828
17086B57828J2565k6174k4660L2017L7953l9150K6958L2284l6081o6572j23418
$$ 257828 270393 244219 219559 251576 289529 250379 277337 309621 273540 206968 83550
17075H3550J0845Q3621j0531l2187l305J0926M1307K6762n0308j9191m6464L2572
$$ 83550 94395 178016 167485 135298 131993 142919 184226 210988 160680 141489 95025 127597
17063A27597J8221l2061l2298j112Q594n2485j8093P7205K833k8992N7195M6988
$$ 127597 145818 113757 81459 80347 88941 36456 18363 95568 98401 69409 126604 173592
17051A73592l1187K2978k4635o345K7709L3269k3976l6692O751K0327K0102J2833
$$ 173592 142405 165383 140748 134403 162112 195381 171405 134713 141464 161791 181893 194726
17039A94726J348j5237p015q751j0727j8967k0570l3052q948j3247K0163l0390
$$ 194726 196074 180837 173822 165071 154344 135377 114807 81755 72807 59560 79723 49333
17027D9333J3441o41r236J5207M3487k5457n5804K9594O5637K6972J6202l4579
$$ 49333 62774 62133 52897 68104 111591 86134 30330 59924 125561 152533 168735 134156
17015A34156m1703l4934N3116m303J6330K086K4197n4400L7433J4225L1923o7737
$$ 134156 92453 57519 110635 106332 122662 124748 148945 94545 131978 146203 178126 110389
17003A10389n9316M1230M7771k7883l4701L3763J4703k4536k4931l9377P4368
$$ 110389 51073 92303 140074 112191 77490 111253 125956 101420 76489 37112 111480
16992A11480N6036O731l3454o9625m5318j8461K937Q136K0542K7202k2420J3739
$$ 111480 167516 174247 140793 71168 25850 7389 10326 18462 39004 66206 43786 57525
16980E7525L495N592m0777n8209p972N9562K7949N2851O0773r743l805k3938k8417
$$ 57525 61020 66612 25835 -32374 -40346 19216 47165 100016 160789 151046 147241 123303 94886
16967I4886n4158k717k9214L5118Q4097J7436p914K460m8257m7338j4734j6704
$$ 94886 40728 38011 8797 43915 128012 145448 137534 139994 91737 44399 29665 12961
16955A2961m2936K548L7090P585O356k2882n829K8310J8948m960l0912k9074r410
$$ 12961 -29975 -27427 9663 17248 23604 722 -5107 23203 42151 37191 6279 -22795 -32205
16942c2205J6475N009K0045N1423m268J3186K4549K4580m0502l2020k7063K6094
$$ -32205 -15730 -10721 9324 60747 56479 69665 94214 118794 78292 46272 19209 45303
16930D5303o756L379n529j8216M6762K9043r415L6963k0929J9429J1644m4731
$$ 45303 38547 41926 36397 18181 64943 93986 84571 121534 100605 120034 131678 86947
16918H6947l6828j397k2100L1995J9141K4416j2991j8003l2214j2279L2655J7283
$$ 86947 50119 48722 26622 58617 77758 102174 89183 71180 38966 26687 59342 76625
16906G6625m7686J03683R521j1755j8965L1760J2627k2476o2724j2169K4588M38
$$ 76625 28939 132622 142143 130388 111423 143183 155810 133334 70610 58441 83029 83467
16894H3467l9101j1046K9395j2316N310J4581l4170l4753l3474M5737N3762K5002
$$ 83467 44366 33320 62715 50399 55709 70290 36120 1367 -32107 13630 67392 92394
16882I2394j1366K9852P0839L1869O095j0659p1406m5008q489l4609l7492J6035
$$ 92394 81028 110880 181719 213588 219683 209024 137618 92610 84121 49512 12020 28055
16870B8055L1701L1445k1236k0070n5079m9838O5181k4412m5400R79K1677q0675
$$ 28055 59756 91201 69965 49895 -5184 -55022 10159 -14253 -59653 -58674 -36997 -117672
16858a17672m277J0291K2192l3722j2536K9313J00291J9061K4430K5460k9571
$$ -117672 -121949 -111658 -89466 -123188 -135724 -106411 -6120 12941 37371 62831 33260
16847C3260J0262K4219O3953n2176r0805j5688k1615m590O4827M6353J5665L3095
$$ 33260 43522 67741 131694 79518 -11287 -26975 -48590 -53180 11647 58000 73665 106760
16835A06760J9990J1940N75j9759l0704l6377M912r287n6000J1975J8872L228
$$ 106760 126750 138690 139265 119506 88802 52425 57337 48050 -7950 4025 22897 26125
16823B6125K1661L1050m5272Q076J4038k5254L7593O890o518J5594O6459M6658
$$ 26125 47786 78836 33564 41640 55678 30424 68017 74907 68389 83983 150442 197100
16811A97100J3917n108P0727J24470J38898J92359K41504K51812K08136J00886
$$ 197100 211017 205909 276636 401106 540004 732363 973867 1225679 1433815 1534701
16801A534701m8761k14333k34033k56249j43886j15754n2581n2737m1217o2985
$$ 1534701 1485940 1271607 1037574 781325 637439 521685 469104 416367 375150 312165
16791C12165m8227K6279K3832L5265l7705m355O652j7098J7961J4346M3399Q3398
$$ 312165 263938 290217 314049 349314 311609 307254 313906 296808 314769 329115 372514 455912
16779D55912N2092M6382N8251J33182J72662K49854K13021J40685N1571r2335
$$ 455912 508004 554386 612637 745819 918481 1168335 1381356 1522041 1573612 1481277
16769A481277j89395k07596k50815j94971j01381p0628k0378L572j8561l4931
$$ 1481277 1291882 1084286 833471 638500 537119 466491 446113 449685 431124 396193
16759C96193r1781l2723L1954L6241o4952k0868N550k99p1650l6935k6218p262
$$ 396193 304412 271689 303643 339884 274932 254064 259614 259315 187665 150730 124512 117250
16747A17250o2553j636L4270P272k3244m2589J6039K3529O8321L873n2058O677
$$ 117250 54697 53061 87331 94603 71359 28770 44809 68338 136659 140532 88474 95151
16735I5151j0093p53K0528O915l0893j863j8366M744J9871k4075j3434q129M0290
$$ 95151 85058 84305 104833 111748 80855 78992 60626 65370 85241 61166 47732 39603 79893
16722G9893M9012j2305n4518o1581M3709K3546m3753l9391J774N5776K1958P1138
$$ 79893 128905 116600 62082 501 44210 67756 24003 -15388 -13614 42162 64120 135258
16710A35258k6759P873J0630l5727l661K4535l7834L789L4318K1493J0393j3632
$$ 135258 108499 116372 127002 91275 87614 112149 74315 78104 112422 133915 144308 130676
16698A30676J3501m3496p7913P2962j3099m3738l1035P911K4261K1751L4707r324
$$ 130676 144177 100681 22768 95730 82631 38893 7858 15769 40030 61781 96488 87164
16686H7164r019p76j7248R541j2721J0825L9j3332q256J8884J8911r189L4232
$$ 87164 78145 77369 60121 69662 56941 67766 67805 54473 46217 65101 84012 74823 109055
16673A09055l1146j1031l5929L7494M1574j6973o2272j1048p1678q826m547j0878
$$ 109055 77909 66878 30949 68443 110017 93044 30772 19724 -51954 -60780 -65327 -76205
16661g6205L0494O6212J0852n1795o1858j734L9790J4683O303j53j8075l1155
$$ -76205 -45711 20501 31353 -20442 -82300 -84034 -44244 -29561 -23258 -23411 -41486 -72641
16649g2641j3807O5627K6292j510K6179M482l7899J2774L4206J0504k1250m6497
$$ -72641 -86448 -20821 5471 3961 30140 34622 -3277 9497 43703 54207 32957 -13540
16637a3540l6639K5868l0297M8961r537K5272N2834K0663k5360j7082l0710L1068
$$ -13540 -50179 -24311 -54608 -5647 -15184 10088 62922 83585 58225 41143 10433 41501
16625D1501R934k4219k4460P194J8231k7022l4766k774K3251R02M5135M0608l2072
$$ 41501 51435 27216 2756 9950 28181 1159 -33607 -36381 -13130 -12228 32907 73515 41443
16612D1443M4439P5899k0075o7293n5018j3673L7891K0932L4933m7097o7174q3071
$$ 41443 85882 161781 141706 74413 19395 5722 43613 64545 99478 52381 -14793 -97864
16600i7864m0723j8975P3045N4096j1330j8154J7201j529K289K6629R04m2463
$$ -97864 -138587 -157562 -84517 -30421 -41751 -59905 -42704 -44233 -41944 -15315 -14411 -56874
16588e6874L475K7563K01l0050J6885N1430j8383q9339l1484M1374P0237j5627
$$ -56874 -53399 -25836 -25635 -55685 -38800 12630 -5753 -95092 -126576 -85202 -14965 -30592
16576c0592m0732L9734J7186J7158K4299l977p758l7102R66P5588l9556m3472
$$ -30592 -71324 -31590 -14404 2754 27053 23076 15318 -21784 -20818 54770 15214 -28258
16564b8258k1111k1239r225J4814K7898k0579K4579O2689N5317K6102l702K0399
$$ -28258 -49369 -70608 -79833 -65019 -37121 -57700 -33121 29568 84885 110987 107285 127684
16552A27684n6139j1044k5248M151N14M6117j8837m5120j1485J4424P773k2802
$$ 127684 71545 60501 35253 39404 39918 86035 67198 22078 10593 25017 32790 9988
16540I988l2962K4801K5678J5107r017m6569j5038L992k2112l3107L993M8527
$$ 9988 -22974 1827 27505 42612 33595 -12974 -28012 -24020 -46132 -79239 -75246 -26719
16528b6719P3850K7239L460l9328j4219l8282L4283M2476R422J2248j2209l9445
$$ -26719 47131 74370 77830 38502 24283 -13999 20284 62760 72182 84430 72221 32776
16516C2776r234k2500M3531k5568j2228l307m893m419R849m8805r8615q365J0240
$$ 32776 23542 1042 44573 19005 6777 3470 -1423 -5842 4007 -44798 -143413 -151778 -141538
16503a41538J5301J02367Q1412K8647j5280l4108K3642L3390m4127l5873q603
$$ -141538 -126237 -23870 57542 86189 70909 36801 60443 93833 49706 13833 5230
16492E230K6999k103j3360j8464K628l1764N813J6088L2641k8684j3389K009J3991
$$ 5230 32229 30126 16766 -1698 930 -30834 -25021 -8933 23708 -4976 -18365 -16356 -2365
16479b365J1817q9k1712R616K161m822P1037j1085J4560m3145j1240J3997J8202
$$ -2365 9452 9363 -12349 -2733 -572 -5394 65643 54558 69118 25973 14733 28730 46932
16466D6932R44m7987k1593O538L3768K0495m1437p473m485K0490l5783M1103M0555
$$ 46932 47876 -111 -21704 -15166 18602 39097 -2340 -9813 -14298 6192 -29591 11512 52067
16453E2067j1960o1977J5918P2144N9688k0918k6650l9231j9465j4269J9665k5774
$$ 52067 40107 -21870 -5952 66192 125880 104962 78312 39081 19616 5347 25012 -762
16441g62M4765Q9m0566m2353j2803k25L7548j1787O0885J5595J8607j7718p707
$$ -762 44003 44092 3526 -38827 -51630 -51855 -14307 -26094 34791 50386 68993 51275 43568
16428D3568J1781j4766j1730k645j3489k5896N1811K0249p531m160p7561J6514
$$ 43568 55349 40583 28853 26208 12719 -13177 38634 58883 51352 47192 -30369 -13855
16416a3855j0378N0853l9796m9392K8762N2169J6876j8342j1901j448J5577K5539
$$ -13855 -24233 26620 -13176 -62568 -33806 18363 35239 16897 4996 3548 19125 44664
16404D4664l9159j9290J8644N7911J0445m5584m2148p2985k6023j7892M1927Q9590
$$ 44664 5505 -13785 4859 62770 73215 27631 -14517 -87502 -113525 -131417 -89490 100
16392A00p885k0257l9909m2038L4323N1151p487L1383M4960L6520Q323j1444l5635
$$ 100 -7785 -28042 -67951 -109989 -75666 -24515 -32002 -619 44341 80861 89184 77740 42105
16379D2105j539O922P580L57p066l5580m8205L3392P762j4340R453k2874k7725
$$ 42105 40566 47488 55068 55425 48359 12779 -35426 -2034 5728 -8612 841 -22033 -49758
16366d9758j1607n500j4950j8863M3413Q517L57K3067P9894J0756o7296k8737
$$ -49758 -61365 -66865 -81815 -100678 -57265 -48748 -48391 -25324 54570 65326 -1970 -30707
16354c0707l1752L6638M9660q3042j0633K2617J5833j0490Q592j6161l6389Q170
$$ -30707 -62459 -25821 23839 -59203 -69836 -47219 -31386 -41876 -33284 -49445 -85834 -77664
16342g7664O6974o586m2050J667M458J0064J0150M1764J9938J0849R958j1942
$$ -77664 -10690 -17276 -59326 -57659 -53201 -43137 -32987 8777 28715 39564 49522 37580
16330C7580J6897J1637L9386L3782k9376j0891k0317j5714K278r426p0522K49
$$ 37580 54477 66114 105500 139282 109906 99015 78698 62984 65262 55836 -14686 -14437
16318a4437J4254m353l0063N0997M5185J4341J3036k2613j0196k2612J9220j6443
$$ -14437 -183 -4536 -34599 16398 61583 75924 88960 66347 56151 33539 52759 36316
16306C6316n5966l8785K4961P0993K2739l3790p097j8352N058j3364l9123O2971
$$ 36316 -19650 -58435 -33474 37519 60258 26468 19371 1019 6077 -7287 -46410 16561
16294A6561L5290j2834L635J5293L231k1490j7290j7410l503j7545p8386O5285
$$ 16561 51851 39017 42652 57945 61176 39686 22396 4986 1483 -16062 -94448 -29163
16282b9163N6327Q059L3903m5211q877L5937m3398j6382O0198P887k1702j7689
$$ -29163 27164 35223 69126 23915 15038 50975 7577 -8805 51393 59280 37578 19889
16270A9889l654o0398k4999N9483N9453L6304L365j1936j8979j6646n5274j4912
$$ 19889 16235 -44163 -69162 -9679 49774 86078 89443 77507 58528 41882 -13392 -28304
16258b8304L8049K2603m4339o4596k3093O708L4357j7928M098j1717J6102K7260
$$ -28304 9745 32348 -11991 -76587 -99680 -92972 -58615 -76543 -72445 -84162 -68060 -40800
16246d0800k1825k5166M520p843L6043O4614L4382k9062R188K7559r230l4157
$$ -40800 -62625 -87791 -83271 -91114 -55071 9543 43925 14863 24051 51610 42380 8223
16234H223o653l3744k0768P8546K4066J9504p745k3985n7014o4529N2489p238
$$ 8223 1570 -32174 -52942 25604 49670 69174 61429 37444 -19570 -84099 -31610 -38848
16222c8848j8837l1351j9795j4147J3407P601L8326N680k0282j260K7926o289
$$ -38848 -57685 -89036 -108831 -122978 -109571 -101970 -63644 -57964 -78246 -79506 -51580 -57869
16210e7869J2436L6164k4079q700O720K7917N4913j0917k2577j6059j1373l3806
$$ -57869 -45433 -9269 -33348 -42048 -35328 -7411 47502 36585 14008 -2051 -13424 -47230
16198d7230J1340N2447l5596n0495N511L2771K4468J915k3790l6556k280M3787
$$ -47230 -35890 16557 -19039 -69534 -64023 -31252 -6784 -4869 -28659 -65215 -67495 -23708
16186b3708K0445K4148J8871n4442n4628J8900m975M331M2978L5840n0736m2235
$$ -23708 -3263 20885 39756 -14686 -69314 -50414 -55389 -51058 -8080 27760 -22976 -65211
16174f5211n3711O532K7818P3J5777N863K2807M8692M569M6536K897j2605k5197
$$ -65211 -118922 -112390 -84572 -84499 -68722 -62859 -40052 8640 13209 59745 62642 50037 24840
16161B4840J9454J0448l4650J088N7364j3072n7578j1311r548q344n2989L389
$$ 24840 44294 54742 20092 21180 78544 65472 7894 -3417 -12965 -21309 -74298 -70909
16149g0909P0154M9592j6934k4529N165M0754L1124j6544j341k0606k32J2029
$$ -70909 -755 48837 31903 7374 12539 53293 84417 67873 66532 45926 45694 57723
16137E7723M070N929j4209L670p6806n4329L8701K4609n039L5637k1147K1499
$$ 57723 61793 67722 53513 57183 -19623 -73952 -35251 -10642 -15681 19956 -1191 20308
16125B0308J8445j2294K702K7620K3129l289l8028n4227k9156J3791N0614k34
$$ 20308 38753 26459 29161 56781 79910 76621 38593 -15634 -44790 -30999 19615 19381
16113A9381j1851k6827R299J5520j4781q3533j5829J3091R978L1524j2473L5090
$$ 19381 7530 -19297 -9998 5522 -9259 -92792 -108621 -95530 -85552 -54028 -66501 -31411
16101c1411P5354P676j1655K1126n1269k5467K0029k7114J2264K8289Q333l3697
$$ -31411 43943 51619 39964 61090 9821 -15646 4383 -22731 -10467 17822 26155 -7542
16089g542m7188L910M8189O35K906k2413Q09K4090k7178n0268N0736N2048l0233
$$ -7542 -54730 -50820 -2631 -1996 910 -21503 -20694 3396 -23782 -74050 -23314 28734 -1499
16076a499r345J2016m8498j9738N9624L1496l6561l7331q163O1670O9641l2563
$$ -1499 -10844 1172 -47326 -67064 -7440 24056 -12505 -49836 -57999 3671 73312 40749
16064D0749n5933l1349N5808N8742K2123o5294k5978j6390R963K1554p740l0274
$$ 40749 -15184 -46533 9275 68017 90140 24846 -1132 -17522 -7559 13995 6255 -24019
16052b4019o1048J6002L1989m197p636R424R907K9038j6594p117J2848K5166K2538
$$ -24019 -85067 -69065 -37076 -41273 -48909 -39485 -29578 -540 -17134 -24251 -11403 13763 36301
16039C6301m1370j0838L4301J4921k0037M7403O208k5814j3311j23K928L0209
$$ 36301 -5069 -15907 18394 33315 13278 60681 66889 41075 27764 27641 30569 60778
16027F0778j4630p4580m203q957O867K1208j4258r121L9349L0650j9926M2258
$$ 60778 46148 -28432 -32635 -41592 -34725 -13517 -27775 -36896 2453 33103 13177 55435
16015E5435L0039o791o7024k7213l2957n162M3378O6043n316o1620l5850P8208
$$ 55435 85474 78683 11659 -15554 -48511 -53673 -10295 55748 50432 -11188 -47038 31170
16003C1170P6138j8854l2955j2812q2556n4290j3228j7069K1510M1185J8830L9369
$$ 31170 107308 88454 55499 42687 -39869 -94159 -107387 -124456 -102946 -61761 -42931 -3562
15991c562J0164N79K224M4640k5309n7379m6086M8798N8192J9025m0231n8155
$$ -3562 6602 7181 9405 54045 28736 -28643 -74729 -25931 32261 51286 11055 -47100
15979d7100j5696L3887O519k4046J4802M6297p539K1220n9180j2600k2983n871
$$ -47100 -62796 -28909 -22390 -46436 -31634 14663 7124 28344 -30836 -43436 -66419 -72290
15967g2290k4015P0961K5089o808q503J8520K970l0488l198q69J6199M6273q376
$$ -72290 -96305 -25344 -255 -7063 -15566 2954 5924 -24564 -27762 -28631 -12432 33841 25465
15954B5465l1682k8446j5863j5603N6964P7207k2742k5726r584n0082k3924J275
$$ 25465 -6217 -34663 -50526 -66129 -9165 68042 45300 19574 9990 -40092 -64016 -62741
15942f2741k754J0897K6971P165l3852K5265K2113L9160L383o6690o2606L5984
$$ -62741 -65495 -54598 -27627 -20462 -54314 -29049 -6936 32224 35607 -31083 -93689 -57705
15930e7705O9018L877J9409O0320l1218k4773O7249n8244p3721o7297n287m6518
$$ -57705 11313 15190 34599 94919 63701 38928 106177 47933 -25788 -93085 -98372 -144890
15918a44890r638J08943M1786l9176K5868O9355o468l1k9662k6746k84L5220K724
$$ -144890 -154528 -45585 -3799 -42975 -17107 52248 45780 45749 16087 -10659 -10943 24277 27001
15905B7001L289j2742k1062J7430j7205J4028N986J8499k4424k6179L9570j714
$$ 27001 30290 17548 -3514 13916 -3289 10739 16725 35224 10800 -15379 24191 22477
15893B2477l4964l2111J3655O961J5404J1257L2431N666l2940m6128j6834J9945
$$ 22477 -12487 -44598 -30943 -23982 -8578 2679 35110 40776 7836 -38292 -55126 -35181
15881c5181J02880L0914j6115o8512R98N5266K7961m0575l8256J0741N114m3046
$$ -35181 67699 98613 82498 13986 14984 70250 98211 57636 19380 30121 35235 -7811
15869g811m966k9014k1423l7513P9426J5583l086o87m4962l5996k0119k1065J1937
$$ -7811 -12777 -41791 -63214 -100727 -21301 -5718 -8804 -9491 -54453 -90449 -110568 -131633 -119696
15856a19696R795P0562L3065k8443m3708l0123k660N4123N5964k4680K5270J3682
$$ -119696 -109901 -39339 -6274 -34717 -78425 -108548 -111208 -57085 -1121 -25801 -531 13151
15844A3151k5967L1738J7468k8692k9790l5562j2700J5639M2458O0589J9173l2377
$$ 13151 -12816 18922 36390 7698 -22092 -57654 -70354 -54715 -12257 48332 67505 35128
15832C5128n3203J782j5578J7004M1207k4057m2911k5913K4849L7567L5712K8485
$$ 35128 -18075 -16293 -31871 -14867 26340 2283 -40628 -66541 -41692 -4125 31587 60072
15820F0072k3291j0226K161k3880k2687k6060j0964M2862O231m012O73K6853j6136
$$ 60072 36781 26555 28716 4836 -17851 -43911 -54875 -12013 -5782 -9794 -9121 17732 1596
15807A596J6813n195m1638m0389k8639M987r993l8180q853K6579L002J5460N1157
$$ 1596 18409 13214 -28424 -68813 -97452 -92465 -102458 -140638 -149491 -122912 -119910 -104450 -53293
15794e3293O081J1535o3917l0652J64Q945L1028N9345r239K2602O302j2320J4080
$$ -53293 -47212 -35677 -99594 -130246 -130082 -121137 -90109 -30764 -40003 -17401 -11099 -23419 -9339
15781i339N5812n30r2595p1697K9628K7578Q626K8947p329n7349j7071O0794Q8878
$$ -9339 46473 45943 -46652 -118349 -88721 -61143 -52517 -23570 -30899 -88248 -105319 -44525 44353
15768D4353l9791j2821j2667l9529j0677P956K0806L6039J3739p1057R348K6555
$$ 44353 4562 -8259 -20926 -60455 -71132 -63176 -42370 -6331 7408 -63649 -54301 -27746
15756b7746k4559K4700l6412q340M921n4514o816L1308K9587l1480l1136K0347
$$ -27746 -52305 -27605 -64017 -72357 -67436 -121950 -128766 -97458 -67871 -99351 -130487 -110140
15744a10140L4153M4550k8750j9241N2706J9772K7595J375k8083m4131k1274N5685
$$ -110140 -75987 -31437 -60187 -79428 -26722 -6950 20645 22020 -6063 -50194 -71468 -15783
15732a5783J4020k502k5594l941L7900O1270J4173m675k4378p0390k5416L798
$$ -15783 -1763 -4265 -29859 -33800 4100 65370 79543 74868 50490 -19900 -45316 -41518
15720d1518k8939J1858K6940m85L6181O251k1339l327l3639j1220J3034l0028
$$ -41518 -70457 -58599 -31659 -32144 4037 10288 -11051 -14378 -48017 -59237 -46203 -76231
15708g6231O4628K4973m1942o3290m281O4785P086r086m1357j7781o2091J7239
$$ -76231 -11603 13370 -28572 -91862 -96143 -31358 -24272 -33358 -74715 -92496 -154587 -137348
15696a37348J2319N6571N7750k0875q556k4087j1978j2571J3562L3610n7829n852
$$ -137348 -125029 -68458 -10708 -31583 -40139 -64226 -76204 -88775 -75213 -41603 -99432 -105284
15684a05284q956O7967P5358Q670q4555P046K1212j7924j3204j9463k2397K2880
$$ -105284 -114240 -46273 29085 37755 -46800 -39754 -18542 -36466 -49670 -69133 -91530 -68650
15672f8650j5695J6227k2561k5086J324N8995J7946O51P039P1094p372o6219j3924
$$ -68650 -84345 -68118 -90679 -115765 -114441 -55446 -37500 -36849 -29810 41284 33912 -32307 -46231
15659d6231j4855k0490M9827o76n0845O0589Q290K0103l9782K515n805q6534q660
$$ -46231 -61086 -81576 -31749 -32425 -83270 -22681 -14391 5712 -34070 -31555 -37360 -123894 -132554
15646a32554M6080L3033j9607r381r686J8853l3839K0368m13k2227K8285L5262
$$ -132554 -86474 -53441 -73048 -82429 -92115 -73262 -107101 -86733 -87146 -109373 -81088 -45826
15634d5826o1362q185N6690N6005L4431K1558r759m5873l3308J091M92m3465K2741
$$ -45826 -107188 -115373 -58683 -2678 31753 53311 43552 -2321 -35629 -34538 -34046 -77511 -54770
15621e4770M7390k7533N45M3872L440n878K6723l9390k7974K3907K99n2169l3421
$$ -54770 -7380 -34913 -34368 9504 12944 7066 33789 -5601 -33575 -9668 -9369 -61538 -94959
15608i4959K6304K6869N6843K7367n5092j265J3154K0618k6929m9735L7579K4776
$$ -94959 -68655 -41786 15057 42424 -12668 -13933 -779 19839 -7090 -56825 -19246 5530
15596E530o2427m1918k6186J08949O4693j3354n731n868j4157l1012o521m4772
$$ 5530 -56897 -98815 -125001 -16052 48641 35287 29556 23688 9531 -21481 -28002 -72774
15584g2774J0145R441N863M1532J3049j3607J6713J1387o527j1806k3830K5769
$$ -72774 -62629 -53188 -47325 -5793 7256 -6351 10362 21749 15222 3416 -20414 5355
15572E355R515J0521R373j9678l2179j0794L0111R9098M3308q119m7735j11205
$$ 5355 14870 25391 34764 15086 -17093 -27887 2224 101322 144630 136511 88776 -22429
15560b2429l3355j1730O5467M1042k974p397M6751l2584k1481n3224o8217M6912
$$ -22429 -55784 -67514 -2047 38995 36021 28624 75375 42791 21310 -31914 -100131 -53219
15548e3219Q4025m414o525J7265n3311k085L4351K7849L3114m8927j4278N8996
$$ -53219 30806 26392 19867 37132 -16179 -18264 16087 43936 77050 28123 13845 72841
15536G2841K9730m3287p1843k9150O03o4416K5797K0276J7202L4843l5073r68
$$ 72841 102571 59284 -12559 -41709 -41106 -105522 -79725 -59449 -42247 -7404 -42477 -43445
15524d3445j8343j030J009Q720N563J2459J6619L1260m3595l6189J9522j6692
$$ -43445 -61788 -62818 -61809 -53089 -47526 -35067 -18448 12812 -30783 -66972 -47450 -64142
15512f4142L794K4786K7396k0791K644r5321l2720O0302j328K4035K4318K6853
$$ -64142 -60348 -35562 -8166 -28957 -26313 -121634 -154354 -94052 -95380 -71345 -47027 -20174
15500b0174j5351m3463k8990N7044L1273k2882l145K6076Q879j9594K2095r8308
$$ -20174 -35525 -78988 -107978 -50934 -19661 -42543 -45688 -19612 -10733 -30327 -8232 -106540
15488a06540k0031L8073L0942L4698n8845o5065L4542J4569N4637L1378m4313
$$ -106540 -126571 -88498 -57556 -22858 -81703 -146768 -112226 -97657 -43020 -11642 -55955
15477e5955k3724j9612j4925j4886J5119L7943L6709L6933O4191K6439o7950p9501
$$ -55955 -79679 -99291 -114216 -129102 -113983 -76040 -39331 -2398 61793 88232 20282 -59219
15465e9219p508o0541O052N6130o097j6399p6597j9260O3573o717L1962J3240
$$ -59219 -66727 -127268 -121216 -65086 -71183 -87582 -164179 -183439 -119866 -126583 -94621 -81381
15453h1381K7359M9088l4012P8550L7610k6174k051n0713l6353r077M956M1869
$$ -81381 -54022 -4934 -38946 39604 77214 51040 48989 -1724 -38077 -47154 -42198 -329
15441c29N4159k8752n2353l9208L8708K9296l9693k3223L1845L6652q623l4032
$$ -329 53830 25078 -27275 -66483 -27775 1521 -38172 -61395 -29550 7102 -1521 -35553
15429c5553k2668Q0385J2089l0083j6539j177k6648Q927J0157J0988m6110n2287
$$ -35553 -58221 22164 34253 4170 -12369 -13546 -40194 -31267 -21110 -10122 -56232 -108519
15417a08519K8170M082P0630N1887k5868j2805l1309p2271m2301k4273R49N3755
$$ -108519 -80349 -76267 -5637 46250 20382 7577 -23732 -96003 -138304 -162577 -161628 -107873
15405a07873M9181j2259m5081L7190Q1316j0587o872k4172M688J7230m919L4604
$$ -107873 -58692 -70951 -116032 -78842 2474 -8113 -14985 -39157 -34469 -17239 -22158 12446
15393A2446j6592l1181k9763p18k5659J5891N8387j8504L2810M0392k3521o7697
$$ 12446 -4146 -35327 -65090 -65808 -91467 -75576 -17189 -35693 -2883 37509 13988 -53709
15381e3709k7407J4038L1133L1387k2328k2009O685J2764J0200l620K9899q04
$$ -53709 -81116 -67078 -35945 -4558 -26886 -48895 -42210 -29446 -19246 -22866 7033 6229
15369F229m765K4230k7787k5186n070M3146K0281m4313j0879l9000p6924Q70J9765
$$ 6229 1464 25694 -2093 -27279 -32349 10797 31078 -13235 -24114 -63114 -140038 -139168 -119403
15356a19403O784k1291n0664m948M9661N3072Q220p970J9903n640M538L0103M3882
$$ -119403 -112619 -133910 -184574 -189522 -139861 -86789 -78569 -86539 -66636 -72276 -67738 -37635 6247
15343F247l8490K3787j1495q3705M9664M3516P67m7114L5122O369l8844N553L1584
$$ 6247 -32243 -8456 -19951 -103656 -53992 -10476 -9709 -56823 -21701 -15332 -54176 -48623 -17039
15330a7039N9387k5999o625k0791l1073O781l4385j7773K4089L7909N9064n9579
$$ -17039 42348 16349 9724 -11067 -42140 -35359 -69744 -87517 -63428 -25519 33545 -26034
15318b6034M3589k0586l402R60M0413P815k4528j4103L3824j7816k1932j8612
$$ -26034 17555 -3031 -6433 -5473 34940 42755 18227 4124 37948 20132 -1800 -20412
15306b0412J4392l5755Q883q566n0289m566J155K8669k499n6377l523K4862L6384
$$ -20412 -6020 -41775 -32892 -41458 -91747 -96313 -95158 -66489 -68988 -125365 -128888 -104026 -67642
15293f7642K6881o9645K3843L3765k3713n2214K9794L6734L4414r091n0020n8411
$$ -67642 -40761 -110406 -86563 -52798 -76511 -128725 -98931 -62197 -27783 -36874 -86894 -145305
15281a45305J6954K6014J2447L6966N1283n001o984M716o9165L871K6778J463
$$ -145305 -128351 -102337 -89890 -52924 -1641 -6642 -13626 -8910 -78075 -74204 -47426 -45963
15269d5963m7638L2807L6339j0344K3900L2079q9638p8517l32P9441N2104k4560
$$ -45963 -93601 -60794 -24455 -34799 -10899 21180 -68458 -146975 -147307 -67866 -15762 -40322
15257d0322p6261p245N7197J7560m1709j698L0161J2280k6702j5910R4548k3286
$$ -40322 -116583 -123828 -66631 -49071 -90780 -92478 -62317 -50037 -76739 -92649 1899 -21387
15245b1387r3574q3143M7742O3886K8650K7693l3553j4576L023m760L1969J2033
$$ -21387 -114961 -198104 -150362 -86476 -57826 -30133 -63686 -78262 -75239 -79999 -48030 -35997
15233c5997J2259J322n513j039n0440j2831K1281N4851N8939J5419j6738o4575
$$ -35997 -23738 -22416 -27929 -28968 -79408 -92239 -70958 -16107 42832 58251 41513 -23062
15221b3062n2157n0441r743K7424k1723l8995P2368K4510K44j8023K1232M2397
$$ -23062 -75219 -125660 -135403 -107979 -129702 -168697 -96329 -71819 -71575 -89598 -68366 -25969
15209b5969p7641o6764M0097L9186J0642M7727j7454j757K6408k0655L9309m1762
$$ -25969 -103610 -170374 -130277 -91091 -80449 -32722 -50176 -51933 -25525 -46180 -6871 -48633
15197d8633j7048l9131N0367m599J455J7402j8715k4745Q151n717O729M3638j5602
$$ -48633 -65681 -104812 -54445 -59044 -57589 -40187 -58902 -83647 -75496 -81213 -74484 -30846 -46448
15184d6448l7429L3795K0726o4207m1257K040O2829p474q0598L8566J2460K955
$$ -46448 -83877 -50082 -29356 -93563 -134820 -132780 -69951 -77425 -158023 -119457 -106997 -104042
15172a04042K9844L5672K0590o3070o2643j5220M8659j6569j2964J5485K2383
$$ -104042 -74198 -38526 -17936 -81006 -143649 -158869 -110210 -126779 -139743 -124258 -101875
15161a01875j7281O161L1991J4579k8950l5571l4748J8747M1282P4464K3530l8948
$$ -101875 -119156 -112995 -81004 -66425 -95375 -130946 -165694 -146947 -105665 -31201 -7671 -46619
15149d6619p2357J2733j5088q629N0464M1722j819n2167J7076l6962L2236L0172
$$ -46619 -118976 -106243 -121331 -129960 -79496 -37774 -39593 -91760 -74684 -111646 -79410 -49238
15137d9238J7905J4439k4585k5079J8035J7060l0360j0774l4684l6799j3183M6223
$$ -49238 -31333 -16894 -41479 -66558 -48523 -31463 -61823 -72597 -107281 -144080 -157263 -111040
15125a11040P327j8839K0586P335J0012n000P579j3544K7972k2208M8998L0894
$$ -111040 -103713 -122552 -101966 -94631 -84619 -89619 -82040 -95584 -67612 -89820 -40822 -9928
15113i928l509m4844k7894k1928M6298m898j1741j8188M424M3737M1677j086l3328
$$ -9928 -13437 -58281 -86175 -108103 -61805 -66703 -78444 -96632 -92208 -48471 -6794 -7880 -41208
15100d1208o9934N066K7636m2312N3819O0580j0766m7836L3231k2772J0353K7073
$$ -41208 -111142 -106076 -78440 -120752 -66933 -6353 -17119 -64955 -31724 -54496 -44143 -17070
15088a7070m8071n8723M2935j5958l7927N466j5620R520M8301J4721J5114n5258
$$ -17070 -65141 -123864 -80929 -96887 -134814 -129348 -144968 -135448 -87147 -72426 -57312 -112570
15076a12570p4103K5937Q1426J822m0900j2991L5711L0777m2707p4366J5926L0129
$$ -112570 -186673 -160736 -79310 -77488 -118388 -131379 -95668 -64891 -107598 -181964 -166038 -135909
15064a35909M0999L0879L6180K8272J0092l1096m5360q3051j9718N8234M4131
$$ -135909 -94910 -64031 -27851 421 10513 -20583 -65943 -148994 -168712 -110478 -66347
15053f6347j4894K6728J6039R272Q783k6779r1369O78J7386O121l8932p11N1654
$$ -66347 -81241 -54513 -38474 -29202 -20419 -47198 -138567 -137889 -120503 -114382 -153314 -154025 -102371
15040a02371L6309L8792l129l1677J2476l4647p861M235M0926J8122j2859L2238
$$ -102371 -66062 -27270 -30399 -62076 -49600 -84247 -92108 -87873 -46947 -28825 -41684 -9446
15028i446l9813l1176j4466J4731L3619L2700m404J895L5204p10J9996l6993J6881
$$ -9446 -49259 -80435 -94901 -80170 -46551 -13851 -18255 -16360 18844 18134 38130 1137 18018
15015A8018J7097k7817p9160n2947m2779M5487P1650L8392l6889p1214K8081L1030
$$ 18018 35115 7298 -71862 -124809 -167588 -122101 -50451 -12059 -48948 -120162 -92081 -61051
15003f1051M1048j3879K4738q5936j0016N5214R2335n233j8535K3426k3128k2278
$$ -61051 -20003 -33882 -9144 -95080 -105096 -49882 42453 37220 18685 42111 18983 -3295
14991c295k4779o0290j5828J3540Q5902K4432L5997N609k2491l7089k947K2488
$$ -3295 -28074 -88364 -104192 -90652 -4750 19682 55679 61288 38797 1708 -1239 21249
14979B1249l4284j6091j0115P391l4330j399Q977m7600n1929R555L0675O0335
$$ 21249 -13035 -29126 -39241 -31850 -66180 -67579 -58602 -106202 -158131 -148576 -117901 -57566
14967e7566L8922l7653r0474j9621N4136J6410l915L6074N0840j0958R14l528
$$ -57566 -18644 -56297 -146771 -166392 -112256 -95846 -99761 -63687 -12847 -23805 -22891 -26419
14955b6419o7958k8124K402m542Q1783K9871r478j4277k3034K8184q03M729m0833
$$ -26419 -94377 -122501 -120099 -124641 -42858 -12987 -22465 -36742 -59776 -31592 -32395 -27666 -68499
14942f8499j0217M3742k119n917K5330Q187Q170l0327O9107p1839l5008l8859
$$ -68499 -78716 -34974 -37093 -43010 -17680 -9493 -1323 -31650 37457 -34382 -69390 -108249
14930a08249J002L7757L2130K1920J7841K3913j0199l2718j1267n5844k0433K3252
$$ -108249 -107247 -69490 -37360 -15440 2401 26314 16115 -16603 -27870 -83714 -104147 -80895
14918h0895J0689m154M6943K5599j796L736L8522n596j9265L677l4952K1968j9304
$$ -80895 -70206 -74360 -27417 -1818 -3614 122 38644 33048 13783 17460 -17492 4476 -14828
14905a4828l5140j15M5813M371k6115l2236n6956k5011l059R587M4122K5100K5475
$$ -14828 -49968 -50083 -4270 101 -26014 -58250 -115206 -140217 -143276 -133689 -89567 -64467 -38992
14892c8992M1388J3715N743J5563p2532m3390K1174n9775O395K8706M7939m839
$$ -38992 2396 16111 21854 37417 -35115 -78505 -57331 -117106 -110711 -82005 -34066 -38905
14880c8905j407J4206K7278l0226j2686L7211r916k0386J7723K131l0972k6697
$$ -38905 -40312 -26106 1172 -29054 -41740 -4529 -14445 -34831 -17108 -14977 -45949 -72646
14868g2646l5184n985M7364m0945L1193J5842m3576o692Q677O2727L7756M1144
$$ -72646 -107830 -113815 -66451 -107396 -76203 -60361 -103937 -110629 -101952 -39225 -1469 39675
14856C9675O045K0414J6518k8566m2725o0100L0771l935J9275O890M1488L372
$$ 39675 45720 66134 82652 54086 11361 -48739 -17968 -21903 -2628 4262 45750 49122
14844D9122k6354n1935k2455m760M0105M1858K9600k743j2976o424J5178m9796
$$ 49122 22768 -29167 -51622 -56382 -16277 25581 55181 52438 39462 33038 48216 -1580
14832a580n1450K1389P1823J6901M635n8285m0951K6435M4819J6170K2601n1190
$$ -1580 -53030 -31641 40182 57083 61718 3433 -37518 -11083 33736 49906 72507 21317
14820B1317l4117n7388l3249R315N8098N8635L8716j8372K8527M766l0965j3806
$$ 21317 -12800 -70188 -103437 -94122 -36024 22611 61327 42955 71482 76248 45283 31477
14808C1477J467M7649O4514m3990l3033o5474N365J620L5161J5645K5345j3672
$$ 31477 32944 80593 145107 101117 68084 2610 7975 9595 44756 60401 85746 72074
14796G2074o0340k6257K1585M6637k4511n7679k1091P2704M269l4590l8499l367
$$ 72074 11734 -14523 7062 53699 29188 -28491 -49582 23122 27391 -7199 -45698 -49065
14784d9065j3978L3502M1300O6180j4752n7166k1450M2706M7999o860n1424J0530
$$ -49065 -63043 -29541 11759 77939 63187 6021 -15429 27277 75276 68416 16992 27522
14772B7522J04765K6315j0425l652r2530j1713o789M5774m9657q4322J2799L6231
$$ 27522 132287 158602 148177 144525 51995 40282 33493 79267 29610 -54712 -41913 -5682
14760e682m2023q1054N991M5411n243J4345j5197J0662J6470L0823L3843K3467
$$ -5682 -47705 -128759 -122768 -77357 -82600 -68255 -83452 -72790 -56320 -25497 8346 31813
14748C1813q146j6916M124M2558L4707K6461o6015q6209o208L6153L0247J8533
$$ 31813 23667 6751 10875 53433 88140 114601 48586 -37623 -43831 -7678 22569 41102
14736D1102n5836l829j5269k8634M0753P8431j1381p6178k6207O368J4202M9447
$$ 41102 -14734 -18563 -33832 -62466 -21713 56718 45337 -30841 -57048 -50680 -36478 12969
14724A2969j7264J0518n5014L1378P509k4117K9682Q5103k5909O493m3787n3860
$$ 12969 -4295 6223 -48791 -17413 -9904 -34021 -4339 80764 54855 61348 17561 -36299
14712c6299P4592N4049n0108p5369J595N5562j4210p7577L8007M5811j3951l17
$$ -36299 38293 92342 42234 -33135 -31540 24022 9812 -67765 -29758 16053 2102 1785
14700A785l4076k5146m8199P128l1679M5993P5933L2388k4094M2724R202L0806
$$ 1785 -32291 -57437 -105636 -98508 -130187 -84194 -8261 24127 33 42757 51959 82765
14688H2765k80l760K837M955m1642m50M4528J3768N0988j6481m1900l265o8325
$$ 82765 82485 78725 81562 86517 44875 44425 88953 102721 153709 137228 95328 92063 23738
14675B3738l5747M1462l8519k386L0573L592K2160k3369J6228J8282L1288M5737
$$ 23738 -12009 29453 -9066 -11452 19121 22713 44873 21504 37732 56014 87302 133039
14663A33039L561m3083o2510M7537m3474p1390n310k9798J8122O0084K4524N5466
$$ 133039 136600 93517 31007 78544 35070 -36320 -41630 -71428 -53306 6778 31302 86768
14651H6768M1495O2405l9803o6037L2338L8361n0553l1795k3978J1274J8123M1173
$$ 86768 128263 190668 150865 84828 117166 155527 104974 73179 49201 60475 78598 119771
14639A19771M7197L8197R553M92K5753M1578L4026M5305O6885K4944k618q452
$$ 119771 166968 205165 214718 215210 240963 282541 316567 361872 428757 453701 451083 442631
14627D42631k8072J853p6189n3830J7499L1342J7328M0284l9228m5326J11M8202
$$ 442631 414559 416412 340223 286393 303892 335234 352562 392846 353618 308292 308403 356605
14615C56605N346n4122p210M8620M9206K6224J1875M8489R5560N0772L6423M4538
$$ 356605 361951 307829 300619 349239 398445 424669 436544 485033 580593 631365 667788 712326
14603G12326M4434J14421O2497j14r4905j33628m532J4109N07J3969M2676K6408
$$ 712326 756760 871181 933678 933564 838659 705031 700499 714608 715115 729084 771760 798168
14591G98168K0689q5143j35913j01212J228n4369j0963L4179J1978n596K0808
$$ 798168 818857 733714 597801 496589 497817 443448 432485 466664 478642 473046 493854
14580D93854M9055L7657j0633j9832q779r37k9187n1526l941l2416l1042p566
$$ 493854 542909 580566 569933 550101 541322 540385 511198 459672 455731 423315 392273 384707
14568C84707j1739j2019k8324N4295K1769J5092k7494k7501m3375o0420m0143
$$ 384707 372968 360949 332625 386920 408689 423781 396287 368786 325411 264991 224848
14557B24848l3224n6125Q602M3104O6178O2457k8494O083N7046K7815j051N409
$$ 224848 191624 135499 144101 187205 253383 315840 287346 293429 350475 378290 377239 382648
14545C82648K3437r341O6569L7443m6043l4383J7523J1636k7543L5570M3133n6549
$$ 382648 406085 396744 463313 500756 454713 420330 437853 449489 421946 457516 500649 444100
14533D44100J5358M9738N6059j7347m6871q7389j2028P8462O0256m857j04530
$$ 444100 459458 509196 565255 547908 501037 413648 401620 480082 540338 535481 430951
14522D30951K5670Q9227O3257M3168Q4151M2971M8357O304j2656n2125M374L3739
$$ 430951 456621 545848 609105 652273 736424 779395 827752 834056 821400 769275 773649 807388
14510H07388K4082k9505K1354L8592k029m8960l2354p0061l9368l5855q7776m6660
$$ 807388 831470 801965 823319 861911 859882 810922 778568 708507 669139 633284 545508 498848
14498D98848j6240m353n6412M4283M6977L3511n958j4984j2551k0322j1148L5033
$$ 498848 482608 478255 421843 466126 513103 546614 540656 525672 513121 492799 481651 516684
14486E16684n8768n8273M5165Q5579j3792J6086n5911k1297n6958l975k238k3997
$$ 516684 457916 399643 444808 530387 516595 532681 476770 455473 398515 394540 392302 368305
14474C68305n4577l4453l4618p525K5253K0292o1924k8080l0702J4743j4347m789
$$ 368305 313728 279275 244657 237132 262385 282677 220753 192673 161971 176714 162367 157578
14462A57578L345L015J7480M1100l9332l8232O017j8925j3707m787J9969m0832
$$ 157578 160923 163938 181418 222518 183186 144954 150971 132046 118339 113552 133521 92689
14450I2689j7348M0724P3704J7782k1861J4223n54k4869k1424L3386l1581j9809
$$ 92689 75341 116065 189769 207551 185690 199913 199359 174490 153066 186452 154871 135062
14438A35062M8811L5511m0422p869L4519P8500M559L099j5480r430R129m8909
$$ 135062 183873 219384 178962 171093 205612 284112 288671 291770 276290 266860 275989 227080
14426B27080O618m0943k5598J3622N5387J4233J289o6173p179j5749J1133M5403
$$ 227080 233698 192755 167157 180779 236166 250399 251688 185515 178336 162587 173720 219123
14414B19123m5144N7237K1926k3509J2453N0516j4502n74Q44l8672k7116j1552
$$ 219123 173979 231216 253142 229633 242086 292602 278100 277526 278370 239698 212582 201030
14402B01030J982J6609J5906M2290j9148n2650l6999j6779q739L1115N3128m6538
$$ 201030 203012 219621 235527 277817 258669 206019 169020 152241 143502 174617 227745 181207
14390A81207L6840K3779P013l9700L3612N8756M55M3347k3799p5720n1663L3614
$$ 181207 218047 241826 248839 209139 242751 301507 301962 345309 321510 245790 194127 227741
14378B27741k5975m1403m8095J5266m2010M6186P3298O0968L4456l9664l722l585
$$ 227741 201766 160363 112268 127534 85524 131710 205008 265976 300432 260768 257046 253461
14366B53461l7056K8326K9794p0777k9718K1073J637p002j9494K0338p158n5570
$$ 253461 216405 244731 274525 203748 174030 195103 196740 189738 170244 190582 183424 127854
14354A27854l050K1955K2607J8568k1603O9861N9217k7678k6740L3817j823l6097
$$ 127854 124804 146759 169366 187934 166331 236192 295409 267731 240991 274808 272985 236888
14342B36888l1141m3989K4957J0442l80m404L8939J0551j5105L335o750J8113
$$ 236888 205747 161758 186715 197157 196777 192373 231312 241863 226758 230093 223343 241456
14330B41456m691j3509M590R5094N2438q933j8270q4054m2628P5752J00628Q299
$$ 241456 236765 223256 227846 322940 375378 366445 348175 264121 221493 297245 397873 406172
14318D06172k641K2907l85p8753r745M9252k5824O3797o2805k6992L0228m8496
$$ 406172 403531 426438 426053 347300 337555 386807 360983 424780 361975 334983 365211 316715
14306C16715J3139L8295P0633M0703j2761j8273o6867k1055J9607J00875P93j6184
$$ 316715 329854 368149 438782 479485 466724 448451 381584 360529 380136 481011 481804 465620
14294D65620j1428K435j5406j8720K8406K6472j2020J6523j1052l4932N7548M2198
$$ 465620 454192 456627 441221 422501 450907 477379 465359 481882 470830 435898 493446 535644
14282E35644K3592l2325n717K2511k130L8411P3372J6636j6402j0612K808J0122
$$ 535644 559236 526911 521194 543705 541575 579986 653358 669994 653592 642980 645788 655910
14270F55910R173k1402l5303j439M0523O3214M4480p167K415P60O7052N4176n6872
$$ 655910 665083 643681 608378 606939 647462 710676 755156 747989 750404 751164 818216 872392 815520
14257H15520l5565q3993M4704j3365J4130P1062j1591l8033N013K1229k2885K2033
$$ 815520 779955 695962 740666 727301 741431 812493 800902 762869 767882 789111 766226 788259
14245G88259L2196o190K1619N4504R674J2345J9844J2279M9623L7583o4211k088
$$ 788259 820455 814265 835884 890388 900062 912407 932251 944530 994153 1031736 967525 965437
14233I65437N8814O325M3914K1090M7991M1627L8206n6011J9172O1424J9777l0935
$$ 965437 1024251 1030576 1074490 1095580 1143571 1185198 1223404 1167393 1186565 1247989 1267766 1236831
14221A236831J556P4031J30627R5704N2689Q8046N6496J7226J3846L6450J00162
$$ 1236831 1238387 1312418 1443045 1538749 1591438 1679484 1735980 1753206 1767052 1803502 1903664
14210A903664R8956J10321J74819P2758J23769J50383J67719J64274K07442J79238
$$ 1903664 2002620 2112941 2287760 2360518 2484287 2634670 2802389 2966663 3174105 3353343
14200C353343K61938K81054K55919L01832M31654N07771N91214O63382P73240
$$ 3353343 3615281 3896335 4152254 4454086 4885740 5393511 5984725 6648107 7421347
14191G421347R07785J117956J401325J736603K191352K769173L562088M523602
$$ 7421347 8329132 9447088 10848413 12585016 14776368 17545541 21107629 25631231
14183B5631231N617577O445332O797479O709196O105891M967778L696707K706789
$$ 25631231 31248808 37694140 44491619 51200815 57306706 62274484 65971191 68677980
14175F8677980K113568J878213J824185J682765J285792L28541r76373k466817
$$ 68677980 70791548 72669761 74493946 76176711 77462503 77791044 76814671 74347854
14167G4347854l797203m552919m353781l357220j916778k18668J554968L375067
$$ 74347854 70550651 65997732 61643951 58286731 56369953 56151285 57706253 61081320
14159F1081320N348353P522658R593256J1366199J2541517J3034505J2503466
$$ 61081320 66429673 73952331 83545587 94911786 107453303 120487808 132991274
14152A32991274J1000882R121425O905205M624371K123793n69415k897223m915888
$$ 132991274 143992156 153113581 160018786 164643157 166766950 166197535 163300312 158384424
14144A58384424o444219p388805q735246j0418631j1606460j1542418j0114267
$$ 158384424 151940205 144551400 135816154 125397523 113791063 102248645 92134378
14137I2134378p952973n694745l522981j493916M18075K250859L789980M778879
$$ 92134378 84181405 78486660 74963679 73469763 73887838 76138697 79928677 84707556
14129H4707556N112448M752616L587481J916315J76563r93700j592797j748179
$$ 84707556 89820004 94572620 98160101 100076416 100252979 99259279 97666482 95918303
14121I5918303j683499j601763j668675k167400l098675m204230n454573o380527
$$ 95918303 94234804 92633041 90964366 88796966 85698291 81494061 76039488 69658961
14113F9658961o693476o227267n392966m342614l322857k543806j869962j351135
$$ 69658961 62965485 56738218 51345252 47002638 43679781 41135975 39266013 37914878
14105C7914878q81705m59777L096N94333J150886J833581K649273L623545M652779
$$ 37914878 37033173 36573396 36576492 37170825 38321711 40155292 42804565 46428110 51080889
14096E1080889N385194N954476O191900N781044M856528L705617K501998J810524
$$ 51080889 56466083 62420559 68612459 74393503 79250031 82955648 85457646 87268170
14088H7268170J721147J773035K004611J994802J503123N12787r58816k661045
$$ 87268170 88989317 90762352 92766963 94761765 96264888 96777675 95818859 93157814
14080I3157814m211487n259245n374302m438802k867101q41224J394997L543733
$$ 93157814 88946327 83687082 78312780 73873978 71006877 70165653 71560650 75104383
14072G5104383N821158Q149190J0248254J1920742J2877341J3004534J2083103
$$ 75104383 80925541 89074731 99322985 111243727 124121068 137125602 149208705
14065A49208705J0272029Q219958O367570M965183L458172J050641j839764m944141
$$ 149208705 159480734 167700692 174068262 179033445 182491617 183542258 181702494 176758353
14057A76758353p854969r647260j1009695j2136234j2667090j2144674j0568850
$$ 176758353 168903384 159256124 148246429 136110195 123443105 111298431 100729581
14050A00729581q448279o190182l934069j821683N2227J712705L168628M398978
$$ 100729581 92281302 86091120 82157051 80335368 80387595 82100300 85268928 89667906
14042H9667906N037946M906102L901585K303796O10382o49743j284722j482181
$$ 89667906 94705852 99611954 103513539 105817335 106427717 105777974 104493252 103011071
14034A03011071j440181j558960k085958l205565m582826o056142p242976p798307
$$ 103011071 101570890 100011930 97925972 94720407 90137581 84081439 76838463 69040156
14026F9040156p676231o955760n825418m635493l627364k806250k333601k036129
$$ 69040156 61363925 54408165 48582747 43947254 40319890 37513640 35180039 33143910
14018C3143910j712020j494471j380792j296073j183851j058347r37288q53295
$$ 33143910 31431890 29937419 28556627 27260554 26076703 25018356 24081068 23227773
14010B3227773q14966q09337p60261o89150o89299o54280o78583o69532o88818
$$ 23227773 22412807 21603470 20843209 20154059 19464760 18810480 18131897 17462365 16773547
14001A6773547o73467o15356n68895n54951m99617m70858m73150l91731l59011
$$ 16773547 16100080 15484724 14915829 14360878 13861261 13390403 12917253 12525522 12166511
13992A2166511m05453m20422l89895l20784k68964l15670k57085l29522l05113
$$ 12166511 11761058 11340636 10950741 10629957 10360993 10045323 9788238 9458716 9153603
13983I153603k91977k62175k59733j95545j82655k98975k21568k10171j53397
$$ 9153603 8861626 8599451 8339718 8144173 7961518 7662543 7440975 7230804 7077407
13974G077407j75932j02939j45817j63968j48218j40203j23703j37444j25917
$$ 7077407 6901475 6798536 6652719 6488751 6340533 6200330 6076627 5939183 5813266
13965E813266j32665j38406j05422j29853j88524j40263j21015l7523K2849q0333
$$ 5813266 5680601 5542195 5436773 5306920 5118396 4978133 4857118 4819595 4842444 4762111
13955D762111q2927j17851j50051j00474j41176r1634p5494j16283j07369l4798
$$ 4762111 4679184 4561333 4411282 4310808 4169632 4077998 4002504 3886221 3778852 3744054
13945C744054m8029j37404q9743m0458n5849q1138j04489n8788O864p9196n7852
$$ 3744054 3696025 3558621 3468878 3428420 3372571 3291433 3186944 3128156 3135020 3055824 2997972
13934B997972m7693L4996M101L6470l7081m5214N397L1945p2170p4386m7609k8119
$$ 2997972 2950279 2985275 2989376 3025846 2988765 2943551 2948948 2980893 2908723 2834337 2786728 2758609
13922B758609p0035p4520j14586j14758m1409j00446j21187n5745l4857m8002
$$ 2758609 2688574 2614054 2499468 2384710 2343301 2242855 2121668 2065923 2031066 1983064
13912A983064o5201j2115j14622l0528K261l1344q784Q0280M0773J1398Q5504
$$ 1983064 1917863 1905748 1791126 1760598 1762859 1731515 1722731 1803011 1843784 1855182 1940686
13901A940686M441j8222N5369K8605J7324J5131l2051j01291j62712r3261l6731
$$ 1940686 1945127 1926905 1982274 2010879 2028203 2043334 2011283 1909992 1747280 1654019 1617288
13890A617288J8333m3473m4102j13199l7995J19932J03519Q0109J78651K22286
$$ 1617288 1635621 1592148 1548046 1434847 1396852 1516784 1620303 1700412 1879063 2101349
13880B101349J96251J38737P8873l7194j61232j46387n4469j18732j36755j21623
$$ 2101349 2297600 2436337 2515210 2478016 2316784 2170397 2115928 1997196 1860441 1738818
13870A738818j24948j660Q26J2569O9364R1549R4326J67380J41396J89476J98321
$$ 1738818 1613870 1612210 1613036 1625605 1694969 1786518 1880844 2048224 2189620 2379096 2577417
13859B577417Q6954l0183m9941j14291j91972k61838k45266j79983j23447p2380
$$ 2577417 2664371 2634188 2584247 2469956 2277984 2016146 1770880 1590897 1467450 1395070
13849A395070J2344j0605k5177M8411R0828L8759K3772J13350J01209N7785Q8671
$$ 1395070 1407414 1396809 1371632 1420043 1510871 1549630 1573402 1686752 1787961 1845746 1934417
13838A934417l8389j02645r7243n6023q5255q8489j9527N055n6097j24359j53741
$$ 1934417 1896028 1793383 1696140 1640117 1554862 1466373 1446846 1451901 1395804 1271445 1117704
13827A117704q0608N1769l5597j07655n2741M015n6305m1444l786k2648m0511
$$ 1117704 1037096 1088865 1053268 945613 892872 896887 840582 799138 795352 772704 732193
13816G32193J3609P9709P5894k6080p959l8005o3296n7468J8274Q8187J1300J4543
$$ 732193 745802 825511 901405 875325 867366 829361 766065 708597 726871 815058 826358 840901
13804H40901m7815o2994q1197j08750m0822K700k3453P843J1387P520j9165k100
$$ 840901 793086 730092 648895 540145 499323 502023 478570 486413 497800 505320 486155 484055
13792D84055l3815k049m648m81k0167k2799L5171j7494l683o4315n9011J109N1626
$$ 484055 450240 448191 443543 443062 422895 400096 435267 417773 414090 349775 290764 291873 343499
13779C43499L9287j8306J2147K3788o4672p5004m2586j2307n1568j1357K7492
$$ 343499 382786 364480 376627 400415 335743 260739 218153 205846 154278 142921 170413
13768A70413J8662L6778J8046N2561j5982J3437m211k7016j1878n822k3255J3937
$$ 170413 189075 225853 243899 296460 280478 293915 289704 262688 250810 244988 221733 235670
13756B35670P5346M7086n9712l8503m8104O790K5169o5951J9334l1166l339K483
$$ 235670 311016 358102 298390 259887 211783 218573 243742 177791 197125 165959 162620 165103
13744A65103O4877j9710l8107J22k8441j220J7822O2124J0107l5189j6098j0104
$$ 165103 229980 210270 172163 172285 143844 142624 160446 222570 232677 197488 181390 171286
13732A71286l031L2008P0137P8855K5918N003j3846J2090M0558j4803O31J2510
$$ 171286 168255 200263 270400 349255 375173 380176 366330 378420 418978 404175 404806 417316
13720D17316j485J2945k6546K0239K0777l2104j2164O5245K2740K062k6719k6388
$$ 417316 415831 428776 402230 422469 443246 411142 398978 464223 486963 489025 462306 435918
13708D35918k5359K9335j5086l823L5947Q0188L8004N7158O3390J07524N3452
$$ 435918 410559 439894 424808 420985 456932 537120 575124 632282 695672 803196 856648
13697H56648K4894q60j1463j8487q069k8587j2694K9696K3063j5417l2252l1149
$$ 856648 881542 880682 869219 850732 842663 814076 801382 831078 854141 838724 806472 775323
13685G75323K7788J2634q9955r0964q2311q3790n8r798j6974J6002J6703P203
$$ 775323 803111 815745 725790 634826 552515 468725 468667 458869 441895 457897 474600 481803
13673D81803K6484N4137L2823L5810m8156m9379l0292O268M8799Q600j1237o398
$$ 481803 508287 562424 595247 631057 582901 533522 503230 509498 558297 566897 555660 549262
13661E49262j2224m9121m3675k0815n8309p5500p550l2851O0594R582n6249k81
$$ 549262 537038 487917 444242 423427 365118 289618 282068 249217 309811 319393 263144 262863
13649B62863K5371N035k8554L0450N6564n018L135L7934p026L8401N8594M4074
$$ 262863 288234 293269 264715 295165 351729 346711 349846 387780 380754 419155 477749 521823
13637E21823O0666l8696m3788m4764r620M7403J1002J0553O8779m4993o3049j3763
$$ 521823 582489 543793 500005 455241 445621 493024 504026 514579 583358 538365 475316 461553
13625D61553j6702l8758J8368L0842L063k0833k1924L3349L8931N2866N0222M2834
$$ 461553 444851 406093 424461 455303 458366 437533 415609 448958 487889 540755 590977 633811
13613F33811J19469K3893J3378K4545K3137Q076n8156o056M1682P0424K8585k7198
$$ 633811 753280 777173 790551 815096 838233 846309 788153 782097 823779 894203 922788 895590
13601H95590R557O236J6051m3543j01410q8168p2580n4780l9663J7764q738p7555
$$ 895590 905147 911383 927434 883891 782481 694313 621733 566953 527290 545054 536316 458761
13589D58761k1727R225J9626Q8026O5332R871j7045j9884l9092o1720J1001L2899
$$ 458761 437034 446259 465885 553911 619243 629114 612069 592185 553093 491373 502374 535273
13577E35273K4710J5909N881o493l0011p6791m4855k8662l4218q5583m8366j0326
$$ 535273 559983 575892 581773 575280 545269 468478 423623 394961 360743 275160 226794 216468
13565B16468l4654o981n96l1157O165K2681k3772J824m9040q1493j1569k4037
$$ 216468 181814 174833 174237 143080 149245 171926 148154 149978 100938 19445 7876 -16161
13553a6161J2465R288J9280R6668R522k0164m5216l2919K9344N4071K4883p8400
$$ -16161 -3696 5592 24872 121540 131062 110898 65682 32763 62107 116178 141061 62661
13541F2661k4367q786K6073K5091k4981n4678n1108K1138J06890N5878l1390K4259
$$ 62661 38294 29508 55581 80672 55691 1013 -50095 -28957 77933 133811 102421 126680
13529A26680j4981p8797l1271L5820k1028l325k0269J6812M0760j7310j2331O870
$$ 126680 111699 32902 1631 37451 16423 13098 -7171 9641 50401 33091 20760 27630
13517B7630M9595R572l587j5531m1152J683K472R3364l6236o4972o1155p421M5791
$$ 27630 77225 86797 83210 67679 26527 28210 30682 124046 87810 22838 -38317 -45738 53
13504E3k840j6634p75K0202L7717l6366j3174k47n1107L5726P910n3197o923M3724
$$ 53 -2787 -19421 -20196 6 37723 1357 -11817 -12064 -63171 -27445 -19535 -72732 -79655 -35931
13490c5931k5795k0467O0781L0495M150n097k4785n7441J6607J3291J175J2597
$$ -35931 -61726 -82193 -21412 9083 13233 8136 -16649 -74090 -57483 -44192 -43017 -30420
13478c0420P1660M4602r1333m377J7651l795l4488J560o667n083L766q689l6935
$$ -30420 41240 85842 -5491 -9868 7783 3988 -30500 -28940 -35607 -40690 -36924 -45613 -82548
13465h2548K2641M8486L552k46Q26p2160n061M1762K3309J229J720J8346j8408
$$ -82548 -59907 -11421 -7869 -8115 -7289 -79449 -84510 -42748 -19439 -18210 -16490 1856 -16552
13452a6552K0141L8784j8686m589j0481K9705K9730m2499k4291n5361j3633L9025
$$ -16552 3589 42373 23687 19098 8617 38322 68052 25553 1262 -54099 -67732 -28707
13440b8707Q2260K2994j2559p5439k4877M3169L3118q2173m7739j0068p873K9599
$$ -28707 53553 76547 63988 -11451 -36328 6841 39959 -42214 -89953 -100021 -107894 -78295
13428g8295P2086O1883m0605l4277K180J5387L2657P197q639k4485k2729L6332
$$ -78295 -6209 55674 15069 -19208 -17028 -1641 31016 38213 29574 5089 -17640 18692
13416A8692o8199K716K3062k7170j5163L8901L6203M0707k3823m0521O3473o6233
$$ 18692 -49507 -46791 -23729 -50899 -66062 -27161 9042 49749 25926 -14595 48878 -17355
13404a7355m2985K2630j9674O357L4610K0848K5412m4738m8105M7767R186l6059
$$ -17355 -60340 -37710 -57384 -51027 -16417 4431 29843 -14895 -63000 -15233 -6047 -42106
13392d2106j6609k11J0613q223j8562N000m5064k4309L1130J8046K5306L398k2232
$$ -42106 -58715 -58926 -48313 -56536 -75098 -70098 -115162 -139471 -108341 -90295 -64989 -61591 -83823
13379h3823k9332q297n336Q80p1621N2070N1296k284M6446J0651n27M4296Q0761
$$ -83823 -113155 -121452 -126788 -125908 -197529 -145459 -94163 -96447 -50001 -39350 -39877 4419 85180
13366H5180M6462k2625o2272R582k8124l1866m6096N6709J7895m1741k9545P680
$$ 85180 131642 109017 46745 56327 28203 -3663 -49759 6950 24845 -16896 -46441 -38761
13354c8761m5771l913L3384r050J6478J2246k1727L181l6364q64L5957J0215j874
$$ -38761 -84532 -88445 -55061 -64111 -47633 -35387 -57114 -53933 -90297 -91161 -55204 -44989 -46863
13341d6863K6991J6501k9726Q106N3984K284j1228n0489j0580M5235m90k0570
$$ -46863 -19872 -3371 -33097 -24991 28993 31277 20049 -30440 -41020 4215 3725 -16845
13329a6845j5074m482J6435J7858J5946q546n2877j0434K368K3705P920K1422
$$ -16845 -31919 -36401 -19966 -2108 13838 5292 -47585 -58019 -55651 -31946 -24026 -2604
13317b604J714k407m1540n1728J789L2470J8868J14745K3915n5335q2937m2646
$$ -2604 -890 -3297 -44837 -96565 -94776 -62306 -43438 71307 95222 39887 -43050 -85696
13305h5696O1314L6564M5248M1684M017r4755l5125M5501M1757j6714j1352n9816
$$ -85696 -24382 12182 57430 99114 103131 8376 -26749 18752 60509 43795 32443 -27373
13293b7373n2758k07k742j2286m3742J1530J5654K3133N0591M8839j833j7687
$$ -27373 -80131 -80338 -83080 -95366 -139108 -127578 -111924 -88791 -38200 10639 8806 -8881
13281h881j9836K3859k7282l4884o963n6783P987O5143n124n7205M0708L4074
$$ -8881 -28717 -4858 -32140 -67024 -73987 -130770 -122783 -57640 -62764 -119969 -79261 -45187
13269d5187J9416N7418j1385l7315k5171M5965j6608o4543k1106M2063J4054J3540
$$ -45187 -25771 31647 20262 -17053 -42224 3741 -12867 -77410 -98516 -56453 -42399 -28859
13257b8859K9730J4958n2739n9815Q0577Q0716L8418p212l5171p6498J8256j6687
$$ -28859 871 15829 -36910 -96725 -16148 64568 102986 95774 60603 -15895 2361 -14326
13245a4326j3039L7969k4065l6591L9177j8840L0933l8051N0656K7991J980J3137
$$ -14326 -27365 10604 -13461 -50052 -10875 -29715 1218 -36833 13823 41814 43794 56931
13233E6931J3466j8462m0425l1264q379L1576R506k4050l7055L0325M2151J0348
$$ 56931 70397 51935 11510 -19754 -28133 3443 12949 -11101 -48156 -17831 24320 34668
13221C4668k4546j17J1406k1633M1104l1345l7517j7338k6232l546k0780J6184
$$ 34668 10122 10005 21411 -222 40882 9537 -27980 -45318 -71550 -75096 -95876 -79692
13209g9692M8692L9645M7546Q2026l8493n1699m3304k6059r6535M6152M1640K1145
$$ -79692 -31000 8645 56191 138217 99724 48025 4721 -21338 -117873 -71721 -30081 -8936
13197h936m3487m0010n96N8148M9548l5261q805K6440K1957p9014o8586K1740
$$ -8936 -52423 -92433 -93029 -34881 14667 -20594 -29399 -2959 18998 -60016 -128602 -106862
13185a06862L9926M6642L7956L477l3139j8512K6846J8480j6850J2215m20l6506
$$ -106862 -66936 -20294 17662 21139 -12000 -30512 -3666 14814 -2036 10179 9759 -26747
13173b6747m7832k3007l1723J657M2202M9821O16j7465N820j1265r03m9056j1096
$$ -26747 -74579 -97586 -129309 -127652 -85450 -35629 -35013 -52478 -46658 -57923 -58826 -107882 -118978
13160a18978O6890J9559K381L7227l5711k9086L3874j4008l2268M8236r072L52
$$ -118978 -52088 -32529 -30148 7079 -28632 -57718 -23844 -37852 -70120 -21884 -30956 -30604
13148c0604R393k0837o3924j7109M069M534O3851Q2657N1001k6013k3349n709
$$ -30604 -21211 -42048 -105972 -123081 -119012 -114478 -50627 32030 83031 57018 33669 27960
13136B7960l2157O447N0185m093l4992n3629l8270j9885M0365j5254j0756K5523
$$ 27960 -4197 2250 52435 48342 13350 -40279 -78549 -98434 -58069 -73323 -84079 -58556
13124e8556M322J0703k7583O05M476m705j5530P242K6112R858j3074j8437j5905
$$ -58556 -54234 -43531 -71114 -70509 -66033 -70738 -86268 -79026 -52914 -43056 -56130 -74567 -90472
13111i0472j1234K3528O4249Q8902P703p9861n299Q781o610Q350k1942k9182k2154
$$ -90472 -101706 -78178 -13929 74973 82676 2815 -2484 6297 -313 8037 -13905 -43087 -65241
13098f5241k7570L9765M7476J5318m2383o081l6933q648N0331j1923K8491L5033
$$ -65241 -92811 -53046 -5570 9748 -32635 -38716 -75649 -84297 -33966 -45889 -17398 17635
13086A7635L3732m674m5223j1765K3522o126n81l913k0795j8776k1804N5268J1678
$$ 17635 51367 46693 1470 -10295 13227 7101 6520 2607 -18188 -36964 -58768 -3500 8178
13073H178K97O771l1723J3438k5486R478j8037k2016K5688M4676j3282J5277k630
$$ 8178 8475 15246 -16477 -3039 -28525 -19047 -37084 -59100 -33412 11264 -2018 13259 10629
13060A0629m2059J9046N1770j9019K755j022Q485Q0928m1067n4143q94J3831n752
$$ 10629 -31430 -12384 39386 20367 23122 22100 30585 111513 70446 16303 15409 29240 23488
13047B3488L6472L6595K3746L3561M31p3783k2243N8975P2248N4019m5291k5647
$$ 23488 59960 96555 120301 153862 154293 80510 58267 117242 189490 243509 198218 172571
13035A72571J27958J92898J69587J39892J19504J13467K5007k7183j71523j78856
$$ 172571 300529 493427 663014 802906 922410 1035877 1060884 1033701 862178 683322
13025F83322j07116p5964o5128k8726j12773m1923J3601J4035n1551q2399p0671
$$ 683322 576206 500242 435114 406388 293615 251692 265293 279328 227777 145378 74707
13014G4707M1059O1782J8209k4758k9893N0203L5464J8896L462P17N6991M8613
$$ 74707 115766 177548 195757 170999 141106 191309 226773 245669 249131 249848 306839 355452
13002C55452R5241M3525R3579K25792K29584K56517K71603L24332K72534R579
$$ 355452 450693 494218 587797 813589 1043173 1299690 1571293 1895625 2168159 2177738
12992B177738j67404l11367l71961l25244k44637j84481o9893k2948R947j8867
$$ 2177738 2010334 1698967 1327006 1001762 757125 572644 502751 479803 489750 470883
12982D70883j04019p3967Q455M0223K2235j2949k5401J2448N37K7106j8849q470
$$ 470883 366864 292897 301352 341575 363810 350861 325460 337908 338445 365551 346702 338232
12970C38232k9298J1637J5216K6018j502R220P8359L5983J00516K31783K28787
$$ 338232 308934 320571 335787 361805 360303 369523 447882 483865 584381 816164 1044951
12959A044951J21702M6025k9654j38266k06565j26376j15427j46975j07969m2931
$$ 1044951 1166653 1212678 1183024 1044758 838193 711817 596390 449415 341446 298515
12949B98515j7101m0159j186l4265j4511R347J8452o9277r872O992k5429q41o177
$$ 298515 281414 241255 240069 205804 191293 200640 219092 149815 139943 146935 121506 120665 114488
12936A14488k3525J6273k6962m785k2631k7550K6921J9962k8214m6766l0039N4574
$$ 114488 90963 107236 80274 75489 52858 25308 52229 72191 43977 -2789 -32828 21746
12924B1746K8480k9471k7244o2151K5550M9278j3145m0378k4323k4368L5473k6630
$$ 21746 50226 20755 -6489 -68640 -43090 6188 -6957 -47335 -71658 -96026 -60553 -87183
12912h7183Q301L5595l5025l6615m5292Q2493N4981N3831J9930K4388m2185l0688
$$ -87183 -78882 -43287 -78312 -114927 -160219 -77726 -22745 31086 51016 75404 33219 2531
12900B531k0678L771k156j9537N7547o349k7769j179K0110j1428K5067n243K2442
$$ 2531 -18147 -14376 -16532 -36069 21478 15129 -12640 -13819 6291 -5137 19930 14687 37129
12887C7129K800K6042J5995L4352M691n0159m129l138N351m5542j6601L6429J9142
$$ 37129 39929 65971 81966 116318 121009 70850 66721 63583 68934 23392 6791 43220 62362
12874F2362o4860k9419k0759j0733k9557m5298K0205L0840J0693M7079J0885M1293
$$ 62362 -2498 -31917 -52676 -63409 -92966 -138264 -118059 -87219 -76526 -29447 -18562 22731
12862B2731J3413m7033q5711k7105N6642o018J0216K0764L5070n024j1308m2851
$$ 22731 36144 -10889 -96600 -123705 -67063 -73081 -62865 -42101 -7031 -12055 -23363 -66214
12850f6214J287L0546m087L5897K329N885M3045j3924k5453o64O523l0989K6932
$$ -66214 -64927 -34381 -38468 -2571 -242 5643 48688 34764 9311 8647 15170 -15819 11113
12837A1113J0706K795j7294m0143m0096L7459M9687O804L1478o666k173p650J6082
$$ 11113 21819 24614 7320 -32823 -72919 -35460 14227 21031 52509 45843 43670 36020 52102
12824E2102j9816r439j2718j9887J4318k0090o984m9058q3399k1699O4578N5353
$$ 52102 32286 22847 10129 -9758 4560 -15530 -22514 -71572 -154971 -176670 -112092 -56739
12812e6739N134J4138n7481q0393O6439P2281l643o7000M8060J7773J4712q026
$$ -56739 -51605 -37467 -94948 -175341 -108902 -36621 -40264 -107264 -59204 -41431 -26719 -34745
12800c4745J2483m870j6142k8787P725O874k7713L2670r593N448M1885n248L0319
$$ -34745 -22262 -27132 -43274 -72061 -64336 -57462 -85175 -52505 -62098 -56650 -14765 -20013 10306
12787A0306N5951p0845q856M0092O2198k1687n0895n4350l8245n324j9538o5230
$$ 10306 66257 -4588 -13444 26648 88846 67159 16264 -38086 -76331 -81655 -101193 -166423
12775a66423N5920L2103j080L908K6008K1136N243k9580R284J14274K5426m7406
$$ -166423 -110503 -78400 -79480 -75572 -49564 -28428 -23185 -52765 -43481 70793 96219 48813
12763D8813l7113N8334j1708J177l1357n3203j544l5015k7626j4612P718J5583
$$ 48813 11700 70034 58326 59503 28146 -25057 -26601 -61616 -89242 -103854 -96136 -80553
12751h0553J222Q9534R837l6072o4240j4314K6462J1766k0467j8668j1162N4653
$$ -80553 -79331 10203 20040 -16032 -80272 -94586 -68124 -56358 -76825 -95493 -106655 -52002
12739e2002Q2157J3082m1127q4694j8653K1343k3737L5358N8027k8255m125j5173
$$ -52002 30155 43237 2110 -82584 -101237 -79894 -103631 -68273 -10246 -38501 -42626 -57799
12727e7799k3853N9185J7295q3070k2500P0998j1597M474N4855N8149k2044l7199
$$ -57799 -81652 -22467 -5172 -88242 -110742 -39744 -51341 -46867 7988 66137 44093 6894
12715F894K1005L1363l5463o786M3072p0724j9374n069O8082J9416J0048j9600
$$ 6894 27899 59262 23799 17013 60085 -10639 -30013 -35082 33000 52416 62464 42864
12703D2864n116k2764k1285K8560K5372J0429m7474m9175j8006L3848k3507j5309
$$ 42864 37748 14984 -6301 22259 47631 58060 10586 -38589 -56595 -22747 -46254 -61563
12691f1563l2362n6480J040M2230J0992O0843Q909j2350j9086j6517k4607J6044
$$ -61563 -93925 -150405 -149365 -107135 -96143 -35300 -26391 -38741 -57827 -74344 -98951 -82907
12679h2907N9252J6905m6872J6667L7290K929l6988R26N8326m590m2517J2271
$$ -82907 -23655 -6750 -53622 -36955 335 3264 -33724 -32798 25528 20938 -21579 -9308
12667i308R5323K0779n5540l0692K947L536l6803L2143N1033J0975m580m6725
$$ -9308 86015 106794 51254 20562 23509 27045 -9758 22385 73418 84393 79813 33088
12655C3088J8224J2579k8770o827M958Q669j240n0240O334J8503l975l7659m1698
$$ 33088 51312 63891 35121 28294 33252 41921 40681 -9559 -3225 15278 11303 -26356 -68054
12642f8054n6718J5953L7836j8489K417K2694L7225j2627J6530L4455L5246o986
$$ -68054 -124772 -108819 -70983 -89472 -87055 -64361 -27136 -39763 -23233 11222 46468 39482
12630C9482l7779j8936k4973J0569M6250k2656j9075R517r7l8109l0996J2477
$$ 39482 1703 -17233 -42206 -31637 14613 -8043 -27118 -17601 -17698 -55807 -86803 -74326
12618g4326N9162L7922k3585n7487j2853K9094r814l7633k4900L7019P791p761
$$ -74326 -15164 22758 -827 -58314 -71167 -42073 -51887 -89520 -114420 -77401 -69610 -77371
12606g7371M2781M2600n0214j9189J1936L7032J4916j8693m5564L648N5038n7958
$$ -77371 -34590 8010 -42204 -61393 -49457 -12425 2491 -16202 -61766 -58118 -3080 -61038
12594f1038l2640L1576k1089m4813J7109L2338j041K7337j8346m7344L3139Q731
$$ -61038 -93678 -62102 -83191 -128004 -110895 -78557 -79598 -52261 -70607 -117951 -84812 -76081
12582g6081J788K7713j5217L5554N6965M241m3403n181j2583j4945J9057l1433
$$ -76081 -74293 -46580 -61797 -26243 30722 34963 -8440 -13621 -26204 -41149 -22092 -53525
12570e3525J1287J7964n4162m961Q8287N8989k2185J5124P66p7801j3441J2340
$$ -53525 -42238 -24274 -78436 -83397 4890 63879 41694 56818 57584 -20217 -33658 -21318
12558b1318N444K2660j4510m7855J4598J7797q8998J0848P0388L1494o833L3385
$$ -21318 -15874 6786 -7724 -55579 -40981 -23184 -112182 -101334 -30946 548 -6285 27100
12546B7100j0960n4970l7502k471L0714L4227k988K6361L1036m7232l0276k9467
$$ 27100 16140 -38830 -76332 -78803 -48089 -13862 -16850 9511 40547 -6685 -36961 -66428
12534f6428K7272q10J9938P436j8059M1146Q337j1549N194l4049O439K4706J4629
$$ -66428 -39156 -39966 -20028 -12592 -30651 10495 18832 7283 12477 -21572 -15133 9573 24202
12521B4202n131R42J2969k8657o230M6623O6491n1447k3792l4992n066k3840k2863
$$ 24202 19071 20013 32982 4325 -1905 44718 111209 59762 35970 978 -4088 -27928 -50791
12508e0791m2317M5028L7918L7218N5852k367j8797k7966k7265J8114l8730J120
$$ -50791 -93108 -48080 -10162 27056 82908 80541 61744 33778 6513 24627 -14103 -12983
12496a2983j9493l397L4743K4745K395k872Q337l0555l4959K0691R3235N869n2096
$$ -12983 -32476 -35873 -1130 23615 26010 23138 31475 920 -34039 -13348 79887 85756 33660
12483C3660n7720n475R055J9032j8231J9742K9816k8403N669N1280R86R981N768
$$ 33660 -24060 -29535 -20480 -1448 -19679 63 29879 1476 7145 58425 59411 69392 75160
12470G5160Q045k0044l8923o703L2052Q722M8723j6425p1589n5038k8413M3947
$$ 75160 83205 63161 24238 17535 49587 58309 107032 90607 19018 -36020 -64433 -20486
12458b0486M5680m3089m2672k5088M0078J0733K8535K1084J3067P4365j0902o9475
$$ -20486 25194 -17895 -60567 -85655 -45577 -34844 -6309 14775 27842 102207 91305 21830
12446B1830M4808j5750j906R105o4090o857j5428j8684P3748R660O661M4162L3269
$$ 21830 66638 50888 48982 58087 -6003 -12860 -28288 -46972 26776 36436 43097 87259 120528
12433A20528J7627l7836m6953p547k0736L1500M0753k0922K2932o8094r5422N506
$$ 120528 138155 100319 53366 45819 25083 56583 97336 76414 99346 31252 -64170 -58664
12421e8664L8315J1705r96O033Q1406R896J5463K601k531L9388L1349J0747j1095
$$ -58664 -20349 -8644 -9640 -3607 77799 87695 103158 105759 103228 142616 173965 184712 173617
12408A73617N9408M1369J1122R458Q369K3257N807l273o2744j15936J2067N9400
$$ 173617 233025 274394 285516 294974 303343 326600 332407 329134 266390 150454 162521 221921
12396B21921o1850k2728j9728q190N8774P143j5627k4333l4071P931K2602l8175
$$ 221921 160071 137343 117615 109425 168199 175342 159715 135382 101311 109242 131844 93669
12384I3669j7586L5727L9041M1890k05N0525O2969L3906K0139j3034n0037J256
$$ 93669 76083 111810 150851 192741 192536 243061 306030 339936 360075 347041 297004 298260
12372B98260L4981r879l6563n1233P183O7714K1745k5768q0093k1666M7494M5019
$$ 298260 333241 323362 286799 235566 242749 310463 332208 306440 226347 204681 252175 297194
12360B97194L5786k8012K7262J7376P185P6706Q296n7621l0689l4399O0976K9782
$$ 297194 332980 304968 332230 349606 356791 433497 441793 384172 353483 319084 380060 409842
12348D09842j2039k1638q27l1861m4519k5893m5485l3104p5021M6109N5942M2067
$$ 409842 397803 376165 375338 343477 298958 273065 227580 194476 119455 165564 221506 263573
12336B63573M690J0652o1046o1842R771K4103l3222L8495P6645K8679J07697L8218
$$ 263573 268263 278915 217869 156027 165798 189901 156679 195174 271819 300498 408195 446413
12324D46413O8773Q9378R5081J23289K4847r0661j6273k7082o6523K1002j6178
$$ 446413 515186 604564 699645 822934 847781 757120 740847 713765 647242 668244 652066
12313F52066n4131l933q2462n7563q2869m6787j4184k821L0502J0573l7058r6651
$$ 652066 597935 594002 511540 453977 371108 324321 310137 307316 337818 348391 311333 214682
12301B14682q4108J9988q698J2264M537j4842N9671M8227K1714k3821k6620M9765
$$ 214682 130574 150562 141864 154128 158665 143823 203494 251721 273435 249614 222994 272759
12289B72759o100K970Q2907M8065N4443j5542o8037n5307l287J800j2764l9885
$$ 272759 266659 269629 352536 400601 455044 439502 371465 316158 312871 314671 301907 262022
12277B62022m5378L5019j8719k790M7077J3699J0281j1108J2581J8130O0270K9684
$$ 262022 216644 251663 232944 230154 277231 290930 301211 290103 302684 320814 381084 410768
12265D10768N8488N0571n991J1250Q903k8449n7663k5657l7712m7462n3645m2783
$$ 410768 469256 519827 513836 525086 533989 505540 447877 422220 384508 337046 283401 240618
12253B40618L3173M9936k4725l5901J6667Q162m6796l3086L6186M1166j60K1888
$$ 240618 273791 323727 299002 263101 279768 287930 241134 208048 244234 285400 285240 307128
12241C07128l3356p793L1149Q281j3867l086J8207L3623P3986N8962P6098N4857
$$ 307128 273772 265979 297128 305409 291542 288456 306663 340286 414272 473234 549332 604189
12229F04189j084l7132n8459l7509n4826j11780l6974J1388J0578j4960n760l5271
$$ 604189 603105 565973 507514 470005 415179 303399 266425 277813 288391 273431 267671 232400
12217B32400m2263n8749Q46L7190k401k1805k4437K3777J2059l9600M4113Q515
$$ 232400 190137 131388 132234 169424 167023 145218 120781 144558 156617 117017 161130 169645
12205A69645o1495m446P4369M5864l8782m6153j4489L0313N914o418n5612J4987
$$ 169645 108150 103704 178073 223937 185155 139002 124513 154826 160740 154322 98710 113697
12193A13697K0852o1491J1680N5276L2848q296O2092k4835j02819n2752N6479
$$ 113697 134549 73058 84738 140014 172862 164566 226658 201823 99004 46252 102731
12182A02731L6541J1866P747P357r969m6532N0209J1339j3065j8294p045O600
$$ 102731 139272 151138 158885 166242 156273 109741 159950 171289 158224 139930 132885 139485
12170A39485k0293q1321l7354L2630N7547M2690k9078q8989k3407O1905J0443
$$ 139485 119192 37871 517 33147 90694 133384 104306 15317 -8090 53815 64258
12159F4258J7660K8890n5048J3430Q6131O375k6739l8982L4519k8910K1619N3740
$$ 64258 81918 110808 55760 69190 155321 161696 134957 95975 130494 101584 123203 176943
12147A76943j9709K9767K9842J1822q670m4061o0754j5971n1711l7919j79l438
$$ 176943 157234 187001 216843 228665 219995 175934 115180 99209 47498 9579 9400 5962
12135E962l2214J9341L5692L8226J6082M3905N7895k6043L090K1123M449R904
$$ 5962 -26252 -6911 28781 67007 83089 126994 184889 158846 161936 183059 187508 197412
12123A97412j7735L3698L8926J5364J5440K1291K2112M8210N7344J13420J42251
$$ 197412 179677 213375 252301 267665 283105 304396 326508 374718 432062 545482 687733
12112F87733R4430l1965j8212l6723m3702o6231m8283p5305o8865o3828L4032
$$ 687733 782163 750198 731986 695263 651561 585330 537047 461742 392877 329049 363081
12101C63081l793J6215L0432M8866K7757R5886N4132R2379P7241J2487j9151m7383
$$ 363081 359288 375503 405935 454801 482558 578444 632576 724955 802196 814683 795532 748149
12089G48149q3601j10295j13349o2401m738K0340o5136m4918l955k948l1925l3688
$$ 748149 664548 554253 440904 378503 373765 394105 328969 284051 280096 277148 245223 211535
12077B11535K5272j5323j3289Q203p9710K5476k2941j3105M0513N664l9926l9994
$$ 211535 236807 221484 208195 216398 136688 162164 139223 126118 166631 172295 132369 92375
12065I2375Q5289M3188J3531O0476N4503M4483n1640n1092l3876J1123L4815k437
$$ 92375 177664 220852 234383 294859 349362 393845 342205 291113 257237 268360 303175 300738
12053C00738k0217k4548k3402L8838O2222M7346K4884j9154J6742J00638J37713
$$ 300738 280521 255973 232571 271409 333631 380977 405861 386707 403449 504087 641800
12042F41800J04788J04686O4724l3675j01906j08137j03872n6799K1295J6151
$$ 641800 746588 851274 915998 882323 780417 672280 568408 511609 532904 549055
12032E49055M1563P2352J21090Q8256Q5649M8939J20699P3315M7898O9725k4262
$$ 549055 590618 662970 784060 872316 957965 1006904 1127603 1200918 1248816 1318541 1294279
12021A294279l7595k5090j02819q9612j76308j13471p0735j2807l0894M6729m592
$$ 1294279 1256684 1231594 1128775 1039163 862855 749384 678649 665842 634948 681677 677085
12010F77085n848k4781J6636O9522N887k6023k1135o729o8153m4667p9524m2654
$$ 677085 671237 646456 663092 732614 738501 712478 691343 684614 616461 571794 492270 449616
11998D49616n2371l0073j6089k5376K0265l1385l6558j09772M158Q3695j8051
$$ 449616 397245 367172 351083 325707 345972 314587 278029 168257 172415 256110 238059
11987B38059k6641j1479P4574N2098n8711l0065J0801l6389P172l5184p075o92
$$ 238059 211418 199939 274513 326611 267900 237835 248636 212247 219419 184235 177160 176468
11975A76468J428L617q297o76L5099p308L9088K1155j6664j6489j2628k6252M2470
$$ 176468 177896 181513 173216 172540 207639 200331 239419 260574 243910 227421 214793 188541 231011
11962B31011N8049J0699J6773K4273P8427M8417Q8437J22084J00277r971r429
$$ 231011 289060 299759 316532 340805 419232 467649 556086 678170 778447 768476 759047
11951G59047m7838p0756q4869n9429n1489K9861L1015m4370m1344K0048M3918
$$ 759047 711209 640453 555584 496155 444666 474527 505542 461172 419828 439876 483794
11940D83794P8636J0992O5209P0128P8809J4682l48k2610l3448m4268m3731k5704
$$ 483794 562430 573422 638631 708759 787568 802250 801902 779292 745844 701576 657845 632141
11928F32141n5306m1698k3260l0062K7845J8085o6606o1572j8958j4086J9405
$$ 632141 576835 535137 511877 481815 509660 527745 461139 399567 380609 366523 385928
11917C85928J2731n7520k2194L688m0464j5341M2613N006N7019O3149J6404k2948
$$ 385928 398659 341139 318945 322633 282169 266828 309441 314447 371466 434615 451019 428071
11905D28071k8340N1443Q8446j2589k0384Q945K5442l9452o7921r5369j0172k012
$$ 428071 399731 451174 539620 527031 506647 515592 541034 501582 433661 338292 328120 326108
11893C26108k5586l3204J0025L7503J8852j1447m514p92m546J3398J26K4044L1899
$$ 326108 300522 267318 277343 314846 333698 322251 317737 316945 312399 325797 325923 349967 381866
11880C81866n815M9350M1777l7231N386K4728J1456k692m2973p4552K028L7391
$$ 381866 376051 425401 467178 429947 435333 460061 471517 468825 425852 351300 353328 390719
11868C90719l127J052N1756R699K424N2009L7706L031O3250J9231J198k6335k4333
$$ 390719 387592 388644 440400 450099 452523 504532 542238 545269 608519 627750 628948 602613 578280
11855E78280n2908k5612L7636j8607k7219m3751l3765l1828j5353k6180m85M1606
$$ 578280 525372 499760 537396 518789 491570 447819 414054 382226 366873 340693 340208 381814
11843C81814P1592K3447m8713M5529R3403M6887J32264J02823R6102P7978K766
$$ 381814 453406 476853 428140 473669 567072 613959 746223 849046 945148 1023126 1025892
11832A025892j9543j9562k9800j44271j04206j09192j02375j1457m563l5268k9856
$$ 1025892 1006349 986787 956987 812716 708510 599318 496943 485486 480923 445655 415799
11821D15799j416K5387J1624N4857r950l4029R9829P1067K7553L9993J28528L8570
$$ 415799 414383 439770 451394 506251 496301 462272 562101 633168 660721 700714 829242 867812
$$ [...]
##END NTUPLES=NMR SPECTRUM
##END=
