##TITLE=Analysis number 314209
Compound Code cc 07116
Book Reference 378/24
Project Code adrs
Chemist Name benw
##JCAMPDX= 6.0         $$ Bruker NMR JCAMP-DX V2.0
##DATA TYPE= NMR SPECTRUM
##DATA CLASS= NTUPLES
##ORIGIN= Bruker BioSpin GmbH
##OWNER= NMR
$$ XWIN-NMR		Version 3.5
$$ Mon Oct 10 11:28:42 2005 GMT Daylight Time (UT+1h)  MAYBRIDGE\NMR@NMR_250MHZ
##.OBSERVE FREQUENCY= 250.131544655141
##.OBSERVE NUCLEUS= ^1H
##.ACQUISITION MODE= SIMULTANEOUS (DQD)
##.ACQUISITION SCHEME= undefined
##.AVERAGES= 16
##.DIGITISER RES= 18
##SPECTROMETER/DATA SYSTEM= dpx250
##.PULSE SEQUENCE= zg30
##.SOLVENT NAME= CDCl3
##.SHIFT REFERENCE= (INTERNAL, CDCl3, 0, 16.522)
##AUDIT TRAIL= $$ (NUMBER, WHEN, WHO, WHERE, WHAT)
$$ ##TITLE= Audit trail, XWIN-NMR		Version 3.5
$$ ##JCAMPDX= 5.01
$$ ##ORIGIN= Bruker BioSpin GmbH
$$ ##OWNER= NMR
$$ C:\u/data/dgb/nmr/ADRS/10650/pdata/1/auditp.txt
$$ ##AUDIT TRAIL=  $$ (NUMBER, WHEN, WHO, WHERE, WHAT)
(   1,<2005-10-10 11:28:12.45 +100>,<MAYBRIDGE\NMR>,<NMR_250MHZ>,
      <created by zg, POWCHK disabled, PULCHK disabled
       configuration hash MD5:
       62 19 C7 07 E1 42 D1 B7 37 6C 3D D0 77 39 F9 E6
       data hash MD5: 64K
       8E FD AE 33 1D B0 06 88 8B 2A BC 0E 81 96 05 21>)
(   2,<2005-10-10 11:28:23.91 +100>,<MAYBRIDGE\NMR>,<NMR_250MHZ>,
      <Start of raw data processing
       ef LB = 0.3 FT_mod = 6 PKNL = 1 SI = 32K 
       data hash MD5: 32K
       85 76 AF E9 D2 51 EF CC 38 09 6C 8E C8 A6 71 38>)
(   3,<2005-10-10 11:28:25.57 +100>,<MAYBRIDGE\NMR>,<NMR_250MHZ>,
      <apk 
       data hash MD5: 32K
       A3 56 26 F8 A7 8B C2 AF F1 75 B2 B3 C6 45 52 A1>)
(   4,<2005-10-10 11:28:26.30 +100>,<MAYBRIDGE\NMR>,<NMR_250MHZ>,
      <abs ABSG = 5 
       data hash MD5: 32K
       1F B9 0B 55 7C DB 3E 6B BD 0C 76 2B 03 BD 33 3C>)
$$ ##END=
$$ 
$$ hash MD5
$$ 06 B8 7C 59 1E 29 25 7C 34 EE 2D BB 62 B7 F8 B8
##$RELAX= 
##$RELAX= 
##$RELAX= 
##$RELAX= 
##$RELAX= 
##$RELAX= 
##$RELAX= 
$$ Bruker specific parameters
$$ --------------------------
##$DU= <C:\u>
##$EXPNO= 10650
##$NAME= <ADRS>
##$PROCNO= 1
##$TYPE= <nmr>
##$USER= <dgb>
##$AMP= (0..31)
100 100 100 100 100 100 100 100 100 100 100 100 100 100 100 100 100 100 
100 100 100 100 100 100 100 100 100 100 100 100 100 100 
##$AQSEQ= 0
##$AQ_mod= 3
##$AUNM= <au_zg>
##$AUTOPOS= <43 >
##$BF1= 250.13
##$BF2= 250.13
##$BF3= 250.13
##$BF4= 250.13
##$BF5= 500.13
##$BF6= 500.13
##$BF7= 500.13
##$BF8= 500.13
##$BYTORDA= 1
##$CFDGTYP= 0
##$CFRGTYP= 5
##$CHEMSTR= <none>
##$CNST= (0..31)
1 1 145 1 1 1 1 1 1 1 1 1 1 1 1 1 1 1 1 1 1 1 1 1 1 1 1 1 1 1 1 1 
##$CPDPRG= <>
##$CPDPRG1= <>
##$CPDPRG2= <>
##$CPDPRG3= <>
##$CPDPRG4= <mlev>
##$CPDPRG5= <mlev>
##$CPDPRG6= <mlev>
##$CPDPRG7= <mlev>
##$CPDPRG8= <mlev>
##$CPDPRGB= <>
##$CPDPRGT= <>
##$D= (0..31)
0 1 0 0 0 0 0 0 0 0.06 0 0 0 0 0 0 0.0002 0 0 0 0 0 0 0 0 0 0 0 0 0 0 
0 
##$DATE= 1128940091
##$DBL= (0..7)
120 120 120 120 120 120 120 120 
##$DBP= (0..7)
150 150 150 150 150 150 150 150 
##$DBP07= 0
##$DBPNAM0= <>
##$DBPNAM1= <>
$$ [...]
##$SUBNAM7= <"">
##$SUBNAM8= <"">
##$SUBNAM9= <"">
##$SW= 20.6930455092707
##$SWIBOX= (0..15)
0 0 3 0 0 0 0 0 0 0 0 0 0 0 0 0 
##$SW_h= 5175.983436853
##$TD= 65536
##$TD0= 1
##$TE= 294.16
##$TE2= 300
##$TE3= 300
##$TEG= 300
##$TL= (0..7)
0 120 120 120 120 120 120 120 
##$TP= (0..7)
150 150 150 150 150 150 150 150 
##$TP07= 0
##$TPNAME0= <>
##$TPNAME1= <>
##$TPNAME2= <>
##$TPNAME3= <>
##$TPNAME4= <>
##$TPNAME5= <>
##$TPNAME6= <>
##$TPNAME7= <>
##$TPOAL= (0..7)
0.5 0.5 0.5 0.5 0.5 0.5 0.5 0.5 
##$TPOFFS= (0..7)
0 0 0 0 0 0 0 0 
##$TUNHIN= 0
##$TUNHOUT= 0
##$TUNXOUT= 0
##$USERA1= <user>
##$USERA2= <user>
##$USERA3= <user>
##$USERA4= <user>
##$USERA5= <user>
##$V9= 5
##$VALIST= <valist>
##$VCLIST= <CCCCCCCCCCCCCCC>
##$VD= 0
##$VDLIST= <DDDDDDDDDDDDDDD>
##$VPLIST= <PPPPPPPPPPPPPPP>
##$VTLIST= <TTTTTTTTTTTTTTT>
##$WBST= 1024
##$WBSW= 4
##$XGAIN= (0..3)
0 0 0 0 
##$XL= 0
##$YL= 0
##$YMAX_a= 188222
##$YMIN_a= -119604
##$ZGOPTNS= <>
##$ZL1= 120
##$ZL2= 120
##$ZL3= 120
##$ZL4= 120
##$ABSF1= 16.522
##$ABSF2= -4.171173
##$ABSG= 5
##$ABSL= 3
##$ALPHA= 0
##$AQORDER= 0
##$ASSFAC= 0
##$ASSFACI= 0
##$ASSFACX= 0
##$ASSWID= 0
##$AUNMP= <proc_1d>
##$AZFE= 0.1
##$AZFW= 0.1
##$BCFW= 0
##$BC_mod= 0
##$BYTORDP= 0
##$COROFFS= 0
##$CY= 12.5
##$DATMOD= 1
##$DC= 0
##$DFILT= <>
##$DTYPP= 0
##$F1P= 14.0000005364418
##$F2P= -0.99999901652339
##$FCOR= 0.5
##$FTSIZE= 32768
##$FT_mod= 6
##$GAMMA= 0
##$GB= 0
##$INTBC= 1
##$INTSCL= 1
##$ISEN= 128
##$LB= 0.3
##$LEV0= 0
##$LPBIN= 0
##$MAXI= 10000
##$MC2= 0
##$MEAN= 0
##$ME_mod= 0
##$MI= 0
##$NCOEF= 0
##$NC_proc= -5
##$NLEV= 6
##$NOISF1= 0
##$NOISF2= 0
##$NSP= 0
##$NTH_PI= 0
##$NZP= 0
##$OFFSET= 16.522
##$PC= 1
##$PHC0= -60.36835
##$PHC1= 2.813129
##$PH_mod= 1
##$PKNL= yes
##$PPARMOD= 0
##$PSCAL= 4
##$PSIGN= 0
##$REVERSE= no
##$SF= 250.13
##$SI= 32768
##$SIGF1= 0
##$SIGF2= 0
##$SINO= 400
##$SIOLD= 32768
##$SREGLST= <1H.CDCl3>
##$SSB= 0
##$STSI= 32768
##$STSR= 0
##$SW_p= 5175.98343685301
##$SYMM= 0
##$S_DEV= 0
##$TDeff= 65536
##$TDoff= 0
##$TI= <Analysis number 999999
Compound Code 99
Book Reference 9
Project Code 9>
##$TILT= no
##$TM1= 0
##$TM2= 0
##$TOPLEV= 0
##$USERP1= <user>
##$USERP2= <user>
##$USERP3= <user>
##$USERP4= <user>
##$USERP5= <user>
##$WDW= 1
##$XDIM= 32768
##$YMAX_p= 579187512
##$YMIN_p= -1455711
$$ End of Bruker specific parameters
$$ ---------------------------------
##NTUPLES= NMR SPECTRUM
##VAR_NAME=  FREQUENCY,     SPECTRUM/REAL,   SPECTRUM/IMAG
##SYMBOL=    X,             R,               I
##VAR_TYPE=  INDEPENDENT,   DEPENDENT,       DEPENDENT
##VAR_FORM=  AFFN,          ASDF,            ASDF
##VAR_DIM=   32768,         32768,           32768
##UNITS=     HZ,            ARBITRARY UNITS, ARBITRARY UNITS
##FACTOR=    0.157963299565203, 1,           1
##FIRST=     4132.6476996994, 0,             0
##LAST=      -1043.33573715361, 0,           0
##MIN=       -1043.33573715361, -1455711,    0
##MAX=       4132.6476996994, 579187512,     0
$$ Real data points
##PAGE= N=1
##DATA TABLE= (X++(R..R)), XYDATA
$$ [...]
26976 -689943 -622508 -644803 -532205 -422402 -349090 -209445 -196036 294431 659239 592998
26966 592998 525846 358148 209843 -116535 -193116 -223603 -237788 -365501 -535122 -704019
26956 -704019 -111402 581871 354824 -339355 -63799 102729 231484 223732 84272 66333
26946 66333 11999 -236391 -272495 -312129 -259234 -51207 77862 -78492 194935 342263
26936 342263 566647 632645 239517 278612 431624 564071 244219 -76317 -274616 -90693
26926 -90693 -276358 -557134 -415151 -437926 -511754 -630885 -888823 -758829 -257298 -98786
26916 -98786 -313678 123234 -24720 -252968 -35121 66063 373995 201301 249327 324249
26906 324249 -40634 -443322 -471857 -310817 258617 406385 435733 276299 277082 225465 133557
26895 133557 18662 279835 377501 328946 316343 41062 -662826 -368629 -152151 -160883
26885 -160883 98079 146407 47595 167957 144688 -69299 56751 108227 86355 338650
26875 338650 156934 -335680 -666215 -441850 -156489 107942 179263 -43687 -107325 -30604
26865 -30604 416347 567511 138883 -268974 -11993 371538 169182 667677 1114948 1117363
26855 1117363 981058 662755 237926 230561 399873 157426 -240802 -196675 -221202 -338271
26845 -338271 408863 651077 664671 326873 4468 411955 217608 588800 737843 567722
26835 567722 450667 436044 92830 156017 248791 90066 110384 2186 -108878 -523113
26825 -523113 -618535 -227435 297331 369132 -6770 -302678 -426768 -309610 -169626 115268
26815 115268 282497 350637 276239 252318 372154 323017 160511 304129 234756 -79842
26805 -79842 -49293 -41249 -179501 -35369 62451 -177050 -30959 115686 359795 281845 212609
26794 212609 234115 219995 46027 207811 538827 544914 333762 414953 555890 386444
26784 386444 331440 349806 -163807 -306770 166150 382939 700725 696824 444108 89773
26774 89773 -195207 -220066 -270791 -712529 -353304 -9018 -331113 -510093 -53269 531761
26764 531761 692277 403843 248301 292850 261846 439367 97303 -80290 15713 -217365
26754 -217365 -470621 -338383 -596319 -420437 -83421 47061 -12343 285217 88121 6091
26744 6091 98122 392023 1015054 1097819 703662 366754 377304 528520 559501 572014 335228
26733 335228 -115512 -416819 16871 670561 706779 457226 383218 241632 -222477 -387833
26723 -387833 -417244 -421984 -164207 3439 245941 291741 16655 298191 -263156 -520948
26713 -520948 -514064 -662592 -527547 -180230 -432909 -479650 -436209 -496599 -509033 -548630 -504854
26702 -504854 -419245 304 148096 -119642 -279762 -128504 55732 550098 44813 -598723
26692 -598723 -541224 -15073 403670 213425 -253852 -508568 -295107 -232545 -143665 -5862
26682 -5862 63639 -84231 155707 53711 246618 326125 -43252 -154213 -165491 -346755
26672 -346755 -564502 -562866 -329696 -482391 -523115 -304676 -350065 -257998 -41097 -90519 -434926
26661 -434926 44984 93677 -168620 -324296 -361215 -32743 379580 455105 564601 437794
26651 437794 341816 435782 338280 258881 136416 -197969 -49211 -107939 -272606 274253
26641 274253 201467 146747 550468 756622 715481 480451 302513 163003 117287 206981
26631 206981 166445 58382 -126886 -501336 -268296 190502 468409 283872 -55209 -34052
26621 -34052 331386 524084 704642 -37012 -107516 540456 471936 -112497 -246627 -428649
26611 -428649 -399007 -85380 266987 197478 183013 118069 20429 277983 74506 -321126
26601 -321126 -277320 -185821 -368420 -401818 -382497 -561942 -226554 272339 443343 172557
26591 172557 -65014 -237869 -197758 -202874 -146463 -421322 -644816 -700375 -533804 -215917
26581 -215917 119530 383244 470216 634929 490736 152736 -32264 -228792 -607412 -466330
26571 -466330 -566762 -413826 9776 -236744 -264831 64257 354651 76077 312987 221311
26561 221311 430841 706812 522123 -176157 -422680 -325264 -389521 -260203 -309632 -266051
26551 -266051 -495242 -539751 -521492 -329408 -322442 -297565 -78128 252074 -35831 42299 275904
26540 275904 34348 -495202 -690823 -528095 -950961 -884779 -562391 -660066 -616062 -564881
26530 -564881 -472356 -402603 -231526 79386 -132184 54791 237156 440441 253527 319367
26520 319367 363407 123691 -65787 -235275 -218118 -309357 -607420 -318787 -270436 -296730
26510 -296730 -32312 -40503 54434 128924 148523 74969 29118 -94419 -429195 108620 438977
26499 438977 402138 -195847 -443328 -714675 -502920 -529178 -158783 -350068 -388532 -234023
26489 -234023 -341524 -104198 612869 743924 219046 171434 208469 159863 80460 277062
26479 277062 447224 -207727 -643939 -297595 -206923 56609 273340 -71439 124481 867535
26469 867535 612949 493226 576435 802367 774972 301140 315556 -40582 -169271 -10251
26459 -10251 -17310 -179661 -218540 -34085 570167 1090805 846324 583353 330588 208768
26449 208768 224645 385713 645375 1020726 766451 763860 766790 576748 -28050 -217030
26439 -217030 3508 136661 -194344 206753 478119 351948 211976 287146 214293 26823
26429 26823 261203 -39385 -117540 -63208 -550285 -433009 173902 452293 663729 785054
26419 785054 988316 1067007 855366 753776 624436 545791 400277 213794 -240138 -814069
26409 -814069 -1353851 -1296715 -474321 -138382 -42010 192133 466254 725068 562027 564828
26399 564828 576720 208149 -158684 -16739 -261925 -161217 -364671 -242766 -364017 -672997
26389 -672997 -447096 -581416 -628380 -489902 -482724 -539711 -488400 -642352 -971456 -981880 -812024
26378 -812024 -291162 393148 334159 21386 -105327 -297731 -175483 -36527 -217405 -418994
26368 -418994 -394973 -461185 -263726 146327 -123596 -815838 -834255 -168091 -394729 -284182
26358 -284182 -210450 184065 365827 379546 357320 129669 -358957 -416669 -344068 11131
26348 11131 152962 455787 241770 205657 373355 708062 828473 594789 519365 356678
26338 356678 -190534 -126439 -141990 173767 25381 610864 800323 390189 48425 -64340
26328 -64340 -63222 -109282 -245149 -312241 236148 508658 -141368 -119400 -240010 -453278 -495960
26317 -495960 -437937 -171371 11496 6285 125611 102288 113360 -36511 -246164 -119296
26307 -119296 -162790 61972 33170 -477482 -502308 -306992 -210578 -317562 -164263 -54264
26297 -54264 -88253 57573 164365 357622 273253 196310 296929 -43020 -255649 -126415
26287 -126415 130321 129195 -378631 -688853 -762931 -818056 -352714 -167509 216112 77441
26277 77441 -174939 -759095 -904041 -593720 -195791 49462 -35917 6714 53566 -206327
26267 -206327 -170077 -377407 -534661 -348791 -316349 151360 351976 220085 308654 380488
26257 380488 236122 452172 -222255 -88108 640778 953992 645680 190061 27574 -80373
26247 -80373 -6610 -251274 43011 220800 216180 206937 11015 -226636 -160093 -18375 -130118
26236 -130118 -305795 -214488 81392 36906 52303 135302 54521 -162454 -381569 -530343
26226 -530343 -627607 -528698 -45281 -46160 -55601 106022 -60441 -31281 -193807 -272423 160538
26215 160538 562243 515983 421058 -21038 -157707 109423 -179083 -424211 -634665 -698778
26205 -698778 -282284 407931 659551 489227 99336 163581 263145 96688 -167262 -236332
26195 -236332 -318265 -149278 71463 -4558 192111 276924 579525 533596 335729 222983
26185 222983 107865 -46716 -75629 -135571 -338685 -197440 -721814 -655088 -157768 311863
26175 311863 238367 -261803 -350411 -98079 -106726 41932 58869 381093 446098 358509 381566
26164 381566 132963 -135258 33625 29254 -213204 -165888 -217551 -418710 -197086 -432223
26154 -432223 -429813 -510001 -752407 -351168 -220934 -109538 -209741 -423949 -733586 -1060973
26144 -1060973 -762645 -281734 -235854 -161147 218898 173800 217554 230584 50152 -106962
26134 -106962 -355520 -78263 477197 495394 311222 532418 334509 -145742 -443954 -478748
26124 -478748 -703974 -789323 -910927 -560699 17592 -113272 255166 261521 251614 544371
26114 544371 485012 -62282 -157024 -117542 -159281 -54195 130750 37583 -197489 -353152
26104 -353152 -267670 23840 70740 151236 97503 -281292 -257851 -206964 -50325 425959 411450
26093 411450 188144 144732 -34934 -30015 -279013 -318981 338132 704796 573285 716308
26083 716308 631954 561562 837338 656823 257704 -68700 -238922 -88837 -137243 -156460
26073 -156460 -4405 -76505 -113893 -419444 -382527 -449289 6433 376558 553192 585666
26063 585666 455693 312380 289036 -105959 -231346 -210051 -199841 -456356 -362356 75856
26053 75856 131912 181604 163204 -327514 -800928 -584721 -423961 -361723 -261729 -309429 -286687
26042 -286687 -383666 -635995 -660857 13712 90113 -84921 -75750 -438177 -283090 -83407
26032 -83407 14213 163767 -109944 -254066 -265357 -882043 -969172 -763341 -503352 -695237
26022 -695237 -675847 -519810 -454694 -218610 -170632 -180963 159944 487849 263258 176213
26012 176213 -158526 -93462 -82694 130601 337326 362334 439643 79948 214589 345997
26002 345997 -68757 -218291 -127372 73965 477310 133160 -619572 -502297 323047 465275
25992 465275 589512 578520 321530 269551 119180 53097 -343618 -449094 -50790 222364
25982 222364 -182140 -331063 -456951 -272718 -218293 -109010 -401428 -159900 -158096 -500182
25972 -500182 -511134 -734941 -993261 -465391 -248584 -286915 190841 389345 310763 218381
25962 218381 -211511 -212934 -333573 -138668 199948 -160627 -361615 -246579 -247136 -415336
25952 -415336 -365607 -449062 41027 -138530 -388018 -185903 -83166 -701939 -1005407 -1123839
25942 -1123839 -916160 -208429 361503 -329828 -218634 -81689 -333520 -16018 184027
25933 184027 -227647 -300305 -133283 -114595 97431 493095 290778 62792 -248108 -372099
25923 -372099 105 15787 248493 553566 245845 -240401 -519938 -158657 233670 445442
25913 445442 573182 404476 240151 109684 -198935 -165282 -94971 -251615 -451567 -466437
25903 -466437 -130033 -117888 -188576 320110 376883 -296207 -790979 -860675 -612139 -478222
25893 -478222 -541157 -696490 -625149 -538451 -339816 -213995 -707641 -1054271 -521492 -107294
25883 -107294 149796 250638 213988 -175943 -547025 -309466 -34297 -177756 -160463 -125963
25873 -125963 -420361 -311267 -438420 -431427 -673289 -234442 150556 28289 -53305 315901
25863 315901 128189 168505 509725 83488 70445 -104384 -238683 -358300 -290982 222075
25853 222075 -89036 -258516 -327735 -124216 175488 163063 192048 234183 -7569 -180599
25843 -180599 -348449 -525117 18316 252541 201157 -491211 -793760 -212334 -235909 -369504
25833 -369504 -246552 -93086 45419 695624 690016 -85551 -36672 135814 411105 180880
25823 180880 -138762 -388156 -508267 -692198 -672838 -493284 -604217 -150347 218159 -59214
25813 -59214 -301503 -314432 -240897 -143166 -195869 -352964 -378398 -704571 -443990 -69107 -15948
25802 -15948 132816 641786 714053 785933 661750 591826 686442 718184 642217 260687 -3637
25791 -3637 428172 648448 1080319 1266131 1050721 900424 404157 -138909 -499680 -292501
25781 -292501 1141 22618 95741 -480491 -1065805 -941062 -324047 70804 528242 378306
25771 378306 287764 96603 -360135 -538554 -187831 198044 -66026 -378181 -302662 -371336
25761 -371336 -357586 -213832 -162469 -153176 -111767 15406 -455892 -769871 -677155 -273089 -558668
25750 -558668 -521772 -543783 -145787 233910 199938 -420430 -227735 -37071 -165244 -84505
25740 -84505 26216 -123090 -645196 -172184 129062 -56668 -82539 -238208 -587555 -1011645
25730 -1011645 -736613 -839970 -1103699 -940844 -725019 -675511 -610208 -241256 19797 463308
25720 463308 227986 -123775 -116108 -60980 -279946 -191787 -201743 -528663 -644895 -143454 453127
25709 453127 449882 173515 329024 236562 -67299 -325328 -626004 -497136 -502790 -484457 -58756
25698 -58756 -69360 465264 303497 -263760 -169098 -117162 66187 27337 -106877 238022
25688 238022 250672 109258 243834 478327 929314 1080536 671072 330157 43851 -218427
25678 -218427 -292368 -238588 -504913 -345426 -313902 -474067 -546397 -345795 -245340 -272519
25668 -272519 -20230 60057 400287 134197 -48221 -346848 25196 68576 439532 790353
25658 790353 763008 771269 513149 376263 247718 201076 355649 189191 269604 4506
25648 4506 155858 224959 -12454 232791 184363 48199 -32301 -17409 -227636 63336 -39544
25637 -39544 130122 -287138 -620654 -364997 -103762 6089 -268032 -329504 -708944 -570177
25627 -570177 -349416 15930 96667 8371 -169937 -246158 -106846 -70483 -55457 118750
25617 118750 465737 333044 145715 -510229 -905325 -430615 8757 14120 -280712 -1220884
25607 -1220884 -1255030 -1004857 -549531 -169174 43512 34719 58303 195020 287877 368647
25597 368647 613538 332687 -159851 -521263 -237313 -54508 -40819 231627 119226 100320
25587 100320 316573 486864 554834 434370 220103 177435 333466 -21239 -449124 -312179
25577 -312179 245355 240465 87521 14571 42491 -252619 -203686 -343760 -489839 -155291
25567 -155291 229251 329965 -44306 -262781 -96598 -163078 92027 -162615 -166453 215194
25557 215194 442278 738072 651599 101622 -321853 -447241 -7801 15099 326502 51721
25547 51721 -64794 -152202 -72825 67541 182092 272329 166294 -19326 -18211 -184071 26098
25536 26098 83041 123954 96836 173345 39399 158520 80472 234160 -41461 162161 177791
25525 177791 219312 134603 86730 89602 -74251 -95108 -4325 212022 330057 182228 -44767
25514 -44767 -544942 -712958 -584074 84328 434647 574251 246590 128912 -265624 -167437
25504 -167437 284323 265494 141081 443225 515117 254535 76500 83452 357460 354677 410407
25493 410407 533603 571508 666098 615205 461420 420035 342343 371036 250735 -58485 -25873
25482 -25873 165784 -94019 100342 293843 336989 -157706 -797298 -602184 -482576 -591100
25472 -591100 -823399 -508022 -19408 -184195 127405 582273 481757 167422 107286 408346
25462 408346 -189403 -293864 -75563 -30431 -445683 -481937 -159752 -223230 166462 -1099
25452 -1099 131914 87770 -187659 -508517 -452438 -362563 -48912 -35079 77515 -119855 70263
25441 70263 366590 250336 -105003 -131556 221869 627307 230457 56070 290289 419828
25431 419828 -65016 -70089 327543 821434 613100 70377 -246577 -131180 484002 417863
25421 417863 67740 172926 373220 275201 189158 -123649 -212645 -358802 -364323 -326723 81221
25410 81221 353731 111167 658115 1009565 1042441 728336 408486 354931 586958 400393
25400 400393 -37401 -36162 55142 111250 -93377 -231484 -56661 423756 713336 470438
25390 470438 -479418 -864089 -598157 -447496 -388082 -659977 -601552 -199958 -392908 -516630
25380 -516630 -352169 -280382 -136283 54810 101959 276359 374253 369270 103112 -439505
25370 -439505 -309594 20925 79248 37404 169095 408420 366704 201498 342108 808653
25360 808653 595044 599630 750572 818500 425578 101759 398649 266860 -174731 -335910
25350 -335910 -460493 -134562 -434116 -532425 -324722 -364331 -632605 -554098 190109 534619
25340 534619 85173 -235497 15719 160088 58230 -272999 -612130 -364111 -257958 -322444
25330 -322444 -239966 -53021 230649 365312 652598 500791 369929 176522 -26096 26818
25320 26818 69065 19047 329787 -38515 -431908 -305231 -4676 -72844 -178346 -143727
25310 -143727 -246361 -181398 -128980 -129048 -50437 368388 419671 260360 98043 -160251 57274
25299 57274 8247 104333 -25486 -117712 430487 623037 823364 540542 484298 375401
25289 375401 8344 -29598 37294 27797 -22849 173866 373557 144440 315193 42005
25279 42005 89206 463133 628813 350886 -212968 -496418 -178759 -162485 -234149 -139468
25269 -139468 -316600 -742346 -712639 -319222 -6257 -366251 -643861 -343045 -263494 -248971
25259 -248971 -6985 -164 216589 -71950 -282892 22337 557534 527229 -31845 -279234
25249 -279234 -99070 189781 435120 152757 59210 -77888 -96057 -107251 -621500 -842833
25239 -842833 -420793 -107326 -35189 25918 -76653 -193632 -233681 158788 108498 103201 65637
25228 65637 -8766 148722 342397 -95367 -283335 -432286 -1077358 -1008131 -521410 -15135
25218 -15135 295632 323601 247473 1035 -130945 -8922 239544 335449 61766 -163157
25208 -163157 -298888 -62540 390135 803146 666333 345530 437297 380432 277505 343466
25198 343466 329426 222129 67580 -163814 -451909 -291176 -534041 -469127 -75330 300795
25188 300795 -53184 -585842 -203777 -268379 -187314 -169760 -154450 -146066 -426873 -439972 138951
25177 138951 185020 -174947 -359697 -311756 -413172 -517817 -887042 -827547 -600727 -179196
25167 -179196 -213736 -47393 428417 453815 147861 219054 32442 -266856 -19663 -91904
25157 -91904 -483203 -628621 -401180 -410609 -459133 -331971 -184491 -420912 8972 317709
25147 317709 109927 -348855 -420521 -428193 -681419 -100279 160320 68029 -86232 25545
25137 25545 -58529 32697 43211 67343 403586 734193 778463 409089 132258 -108972 -215588
25126 -215588 -63711 -295349 -324493 -411990 -683289 -814883 -413483 -14541 -118310 -150026
25116 -150026 -295793 -192001 -153264 -576364 -946296 -739042 -501237 -572701 -462564 -169846
25106 -169846 -215142 -326276 -112696 70023 382092 423723 -194585 -541589 -655236 -644799
25096 -644799 -371618 32899 362652 490376 476868 303624 452397 490568 272562 44407
25086 44407 130041 155846 163285 442202 396916 -116207 -34674 146652 188685 12072 -72643
25075 -72643 38079 405363 84499 -333628 -132589 -55212 -35463 -259546 101890 171840
25065 171840 485648 550731 94185 -141956 -245088 -99864 298888 276603 -63313 -323021
25055 -323021 -361537 -113038 -117021 -389009 -334302 -266182 -190607 -177904 -316269 -73537 -56837
25044 -56837 -185676 -450475 -592520 -466769 -182787 375915 274721 -73032 -230430 -168650
25034 -168650 -220364 -225642 262164 277870 -3898 -226338 -329034 -402360 -378956 -475201 -383318
25023 -383318 -79162 -249002 -532647 47345 567148 204791 -147199 -485651 -685498 -792762
25013 -792762 -802492 -574952 -599152 -446002 -257389 -400492 -399529 -464187 -310484 -218961 -589956
25002 -589956 -773678 -793849 -643777 -192940 73667 405063 216850 -28830 -175259 -328144
24992 -328144 -221752 72454 337848 419396 479645 595290 219120 283067 -21097 38900
24982 38900 281548 542354 601519 489201 711672 156278 -110326 90919 438743 354912
24972 354912 603255 901900 561330 480183 315110 -75780 -146877 -298607 -322758 27483
24962 27483 27100 45841 87823 302668 427660 254598 170685 -123405 -321615 -26008 228667
24951 228667 212111 -168067 -238561 171635 186358 119493 -365485 -641152 -512871 -410580
24941 -410580 -329551 -459410 -650918 -833594 -571931 -44269 205067 -32367 -96813 -22768
24931 -22768 153266 -55821 -67183 111553 31748 -173116 -218733 -101058 312845 276322
24921 276322 92190 471559 1027898 821579 365901 -124390 -119491 -39793 100028 15281
24911 15281 -388121 -687239 -607813 -553831 -584915 -661427 -478970 57120 -20862 -107222 -226833
24900 -226833 -98724 132974 53400 -111570 -598192 -947954 -718867 -627691 -363876 201209
24890 201209 473371 581891 575063 719262 478395 63776 -19029 102278 134231 -336828
24880 -336828 -14593 379630 268168 460736 526028 563880 645235 437244 151788 244928
24870 244928 187208 214231 296209 21997 -618396 -776154 -502896 -513704 -581725 -307612
24860 -307612 -617735 -491771 -554403 -630694 -178396 -210016 -335034 -439266 17814 22579
24850 22579 -355157 -199145 -241618 -93039 -133819 -461253 -75895 166884 511761 710611
24840 710611 610868 654599 671709 647672 365450 -296348 -261939 -188215 -256221 -211645 -440939
24829 -440939 39354 438148 398185 162360 -8294 -108139 -257065 -256860 42970 81453 -55431
24818 -55431 -424957 -556952 -319505 10713 245700 493489 544484 387425 181905 96837
24808 96837 225051 513970 312255 195675 377182 648006 556954 212220 -47521 -96165
24798 -96165 26847 138781 776086 637086 145199 -328659 -350593 -170394 161029 370884
24788 370884 120996 -108420 -115921 74564 -157723 -452508 -453491 -380890 -232518 -562631 -497337
24777 -497337 -276936 -142821 -203906 -579715 -923496 -1183897 -759036 -477213 199931 239435
24767 239435 -90755 240606 245340 105412 -277472 -349370 -210425 -199656 -192314 -58213 -57304
24756 -57304 127074 121232 217989 346767 520065 372148 339360 210357 227702 482534 831984
24745 831984 376137 84743 160269 270324 173408 70068 -110215 -710417 -499277 -400988
24735 -400988 -451412 -427345 -541982 -526281 -378571 -177451 190464 102984 -138715 -20547
24725 -20547 -66067 -225235 -506829 -367236 -577178 -287461 61893 76552 444697 612484
24715 612484 423604 25320 -58779 -85969 -411954 -347092 150214 288079 629531 404490
24705 404490 102401 -167314 -94892 296046 569798 446524 174994 437431 446484 403068
24695 403068 -45417 -402536 -357484 -647460 -471971 100613 611117 800668 565043 320564
24685 320564 -52781 -446850 -126299 -155286 -314245 -347152 -353762 -265639 -191944 -327440 -647292
24674 -647292 -385013 -147571 71212 -242984 -418027 -275414 -207089 -205948 -531041 -159714
24664 -159714 468076 460946 310881 -34151 -285589 141922 134396 299166 335585 135136
24654 135136 175718 409510 185200 20076 167776 258642 229928 -99754 -34092 -44868
24644 -44868 -19435 -46540 -119607 158575 28002 -143530 -122877 379200 -75667 -426396
24634 -426396 -344661 -54249 -266146 -227537 209114 184595 -185039 -276644 -420144 -236115
24624 -236115 -217403 -222727 47644 123525 108892 95649 43874 138827 70865 180901 140446
24613 140446 93491 117842 246496 329179 339345 258616 252364 167461 -40446 -150925 -13769
24602 -13769 -99434 261994 250498 243389 686432 879958 459223 317740 565251 463838
24592 463838 316580 376383 306721 313646 362170 550521 442853 599943 580636 342574 632456
24581 632456 602300 180568 298270 474440 210499 -234973 -29344 155534 346053 205042
24571 205042 10122 -336421 -607424 -531766 -446908 -330863 -98669 -32243 106609 228448
24561 228448 -108717 -342952 -251964 54784 213388 -39243 -117841 -429745 -673191 -604602
24551 -604602 -182338 162979 226904 66941 -256945 -721719 -134617 506216 45874 -58796
24541 -58796 234651 33884 -122332 132138 377292 521281 350878 161848 374277 382877
24531 382877 228221 80444 36238 -380910 -106642 -245284 -10928 165553 475784 354339
24521 354339 -48042 -321358 29725 572245 504048 341207 185663 -6034 76036 168327
24511 168327 -92457 -241215 59416 14957 -327636 -436490 -241883 -41895 448882 158213
24501 158213 9958 388872 36090 -141389 -6805 146172 257254 268200 -57531 204752
24491 204752 471527 -113482 202256 445325 417736 271125 269144 520420 475847 423427
24481 423427 -23507 -300614 -638643 -324689 -40462 79905 -548656 -922753 -756988 -561061
24471 -561061 -458053 -343490 -187210 -107786 -147540 -158466 -206416 -259250 95789 601807
24461 601807 800636 594000 -21078 -47171 191123 148713 524827 794792 1063441 1277841
24451 1277841 1037143 548138 189659 68991 -392985 -420328 -709009 -650936 -76665 182815
24441 182815 -154300 -263959 14697 -20920 122844 -71544 -302145 -70827 -2057 -101848
24431 -101848 137544 379727 477654 474258 414906 -180720 -365052 -416291 -498573 -111314 -148533
24420 -148533 -54871 140184 154065 15180 342957 66801 -390531 -159851 -70386 -120215
24410 -120215 37443 51615 6058 202362 71739 -113479 -300124 -653484 -804584 -788561
24400 -788561 -675560 -724806 -711099 -414550 -947154 -949937 -789131 -1070266 -1144859 -745066
24390 -745066 -444710 -515604 -582727 -428588 -519980 -684227 -652402 -437675 -189363 -253610
24380 -253610 51744 -247014 -351732 -215696 -200004 -324057 -365240 -342465 -16545 664157
24370 664157 612843 317632 353071 202363 -231856 -534916 -312293 -59596 104924 627449
24360 627449 411871 116445 181689 359388 88311 -116280 -62304 -193910 -185652 46800
24350 46800 122134 148736 506305 378413 140278 168965 327018 61721 156831 280581
24340 280581 260818 -32454 -290625 -438072 -687249 -1022496 -733300 -293696 -243621 -281251
24330 -281251 -276635 155973 46964 -57389 -121479 -322490 -642288 -590500 -595709 -151479 -182608
24319 -182608 43118 327407 836624 616491 -204482 -164936 167900 -50779 -124844 -77066
24309 -77066 -317478 -180073 48777 -231520 -648327 -549026 -71393 -121269 -46009 84343
24299 84343 -175576 -318077 -410857 -102412 -30098 37593 -266729 -324146 -142364 195250
24289 195250 -159454 -700595 -689435 -904895 -1357158 -1455711 -1198855 -931723 -374260 -583166
24279 -583166 -861498 -827069 -715998 -483973 -204588 -304002 -199272 359932 682460 761675
24269 761675 445778 4860 52497 135785 408543 614089 528881 -145930 -877334 -795065
24259 -795065 32277 284229 56745 -56232 -324902 -360805 365473 632738 792021 259912
24249 259912 -159518 -55660 309260 283010 -362036 -573068 -439855 -420666 -499725 -381599
24239 -381599 -326703 -197823 -59801 200411 715356 748288 303414 38706 -12335 63605
24229 63605 -41366 139311 149714 126829 138269 -82861 -314171 -514453 -281826 -2343
24219 -2343 -135441 -131579 -238263 -446855 -737141 -570362 -227768 -101693 -279871 -487260
24209 -487260 -593574 -287871 -30684 -261704 -423305 -221001 -107862 185095 115356 -2067
24199 -2067 -239912 270912 520801 376458 232293 461832 540671 928198 648775 439526
24189 439526 301585 -79894 97608 453466 438806 466324 74467 -223832 40273 206029
24179 206029 712793 543650 564434 463134 340887 130468 -506733 -641176 -708770 -549413
24169 -549413 -692773 -480742 -150752 -124852 63599 -124180 -18136 535726 422173 62477
24159 62477 326472 437095 149439 185536 432445 160203 -340783 -509972 -717581 -695426
24149 -695426 -566812 -343678 -377782 -451932 -709945 -612272 -420403 -81086 308927 378825
24139 378825 134705 -290099 -381003 -552078 -536802 -403656 -92881 6223 114441 -1754
24129 -1754 -11467 -365223 -672115 -444011 -271302 295752 442534 378836 142886 -53070
24119 -53070 133623 217354 162357 -257029 -264034 -356056 -355343 172647 217890 116996 549584
24108 549584 715838 424873 34659 -65921 178045 455900 279338 85678 254484 229994
24098 229994 -35365 -37452 139268 519274 381422 311147 -12082 -127419 -16463 22659
24088 22659 71646 85940 271365 340200 465259 251639 -64195 -357167 -353732 -453807 -539177
24077 -539177 -507269 -423588 -282176 -421966 -230335 138383 433575 256037 122096 134915
24067 134915 71012 37016 43298 -51703 577742 500583 117562 168720 329903 226279 -137098
24056 -137098 -371586 -641378 -784334 -331660 -385054 -552928 -281388 -94053 -141155 -512790
24046 -512790 -704777 -569143 -466156 -497602 -47267 498012 472433 428043 614668 424111
24036 424111 248682 256765 446948 347332 -189514 -201223 -457571 -599242 -321386 -357788
24026 -357788 -159203 -235470 33170 699083 580757 312110 104012 -487394 -478955 -386916
24016 -386916 -371766 -635258 4243 200821 351301 369108 538774 291967 -150567 -139917
24006 -139917 62839 -113808 -493386 -638385 -369147 -215800 -121727 159301 289749 292556
23996 292556 -141436 20582 154394 80671 -255100 -70818 79251 -20219 252962 483679
23986 483679 273995 -70004 -168872 276823 397602 -251266 -79116 175767 164665 423180
23976 423180 696781 549806 176241 219146 173821 130186 140745 192598 14181 104330 157445
23965 157445 398700 235255 218494 380692 566230 539267 400361 378311 445523 751107
23955 751107 626087 357189 179203 -162511 -129173 146502 167812 -347838 -522039 -297396
23945 -297396 688058 1097401 576503 535 -280286 -275105 -55927 155465 60468 -287249
23935 -287249 -517375 -452577 57159 517237 640672 279693 192741 485212 552463 792198
23925 792198 800829 849612 607412 585556 659918 837666 709086 697137 721279 620656 196161
23914 196161 154539 488581 257536 -7194 -84344 114 -36629 -64360 233154 376615
23904 376615 246484 -106172 -7469 -4689 -92899 -343584 -340633 -384380 312992 130325 -190703
23893 -190703 -355529 -179239 2845 -131344 -137507 255770 482169 679798 707112 549179
23883 549179 362309 153764 -15550 -103501 140928 -89583 98144 -26968 -124792 -89114
23873 -89114 -377167 -698891 -614249 -600779 -311143 -187737 -365051 -124819 8266 160708
23863 160708 187114 214266 205239 256780 284939 367411 179250 220171 435222 820905 1062187
23852 1062187 1287830 1316702 1199979 764958 -233187 -307451 -90199 -287365 -465941 -499170
23842 -499170 -226896 -34344 2648 205405 25636 -191505 -264173 -749107 -176917 -123590
23832 -123590 -281267 -447989 18286 -524732 -682565 -100265 37751 45988 -267618 -393989
23822 -393989 -162179 -482806 -335162 249488 802563 642660 218045 -161353 -174618 -238443
23812 -238443 221279 650777 600612 374282 -13902 -287001 -108446 -65991 -304222 -260060
23802 -260060 -276006 -414341 -315357 -142400 -217018 -363058 -407161 52060 608661 774756
23792 774756 542586 175991 4313 366501 686266 403439 64104 -7230 229887 323757
23782 323757 254619 457494 592507 125358 74237 90144 26112 -102916 -250228 -36151
23772 -36151 155582 452571 106884 -236872 -179214 7445 99087 387882 249261 217424
23762 217424 285467 -161926 -363009 -110940 -43633 -197074 -340092 -59524 -248557 221178
23752 221178 293613 1446 4107 -434306 -596761 -52 341465 260077 12159 187601
23742 187601 183986 -72180 98184 12991 45048 -81430 2164 134997 584430 610913 405384
23731 405384 576096 -15408 -517383 -78349 59542 -164095 -178783 -23509 163958 -16369
23721 -16369 -288695 -280523 111506 13655 -359009 -290534 -304177 -84873 223772 416976 373581
23710 373581 140347 100341 -229661 -353907 -243383 -312219 -567956 -732643 -162893 600540
23700 600540 387506 94400 530376 586673 370404 -296841 -305804 -376552 -244967 -101137
23690 -101137 -366699 -404968 -85826 96351 12172 358835 312863 158074 324130 128098
23680 128098 243989 347761 448257 145714 -170159 -144491 -3643 141191 73762 226831
23670 226831 338278 -58557 -255763 -129603 344402 313219 90213 -278059 -478140 -448984
23660 -448984 -437169 -53930 134851 136405 158639 263822 -55795 -328433 -697784 -601314
23650 -601314 -726891 -645752 -458160 -673412 -829163 -455182 -224947 107368 291817 406863
23640 406863 -108077 -354937 -470605 -316791 -45148 -61775 -131322 -170588 -376058 -165224
23630 -165224 -19892 -25655 182443 361325 273446 -162156 -242000 -77570 466667 437356
23620 437356 168378 150567 135657 386858 492661 669367 431302 312992 488788 358152
23610 358152 364425 406101 48274 -112637 -518888 -307421 -947 -165455 -136255 -50283
23600 -50283 -414347 -263063 -52618 178165 346841 -21724 -404635 -414651 -613028 -512053
23590 -512053 -292236 -469680 -411800 -216260 25203 -196243 291154 616908 294671 186287
23580 186287 485269 209780 -49626 -540658 -745475 -889869 -459921 -102389 565719 510953
23570 510953 185441 -199297 -320572 -459160 -351182 -609128 -439395 -265165 -352046 -520919
23560 -520919 -424495 22031 317582 84898 228637 286589 694828 664199 191576 -33758
23550 -33758 175475 -18642 -513255 -387294 -189393 -344950 -249024 -343561 -236065 -6744
23540 -6744 293741 276617 -110068 -59334 349568 613943 135505 -213820 -165972 -22780
23530 -22780 -140284 -387106 -40644 -171698 -470570 -428322 -377031 -58687 -153874 -593634
23520 -593634 -28871 252890 -285231 -303488 -66133 -270770 -177249 164004 61996 -18227
23510 -18227 -130780 -360123 -529020 -551260 -295946 57617 588855 702367 397338 400376
23500 400376 92508 26841 -106934 -436840 -467138 -222565 -14152 -107006 -480323 -545449
23490 -545449 -303522 -360758 -447279 -621692 -745580 -654040 20007 372846 202245 -84930
23480 -84930 171205 316265 33682 -184255 -113754 -18382 250568 592677 591264 474999
23470 474999 818479 807277 553831 367762 103198 -133841 28042 326034 475739 495453
23460 495453 398239 -87369 -300835 107380 221683 -78544 -226712 105300 -72663 -258057
23450 -258057 -163813 -49366 -179008 -179906 -70294 -283227 -231102 -282581 -193569 -257068 -104313
23439 -104313 174966 202669 -68312 -28630 290917 467244 341562 129752 299816 421283
23429 421283 134593 -49868 116743 297599 384576 238355 123180 195277 136903 37353
23419 37353 -120007 -346061 -416344 93812 -85649 -244676 -196129 -149735 61206 516729
23409 516729 207500 -23651 314305 174267 110537 -205480 -567925 -814081 -1023161 -1026079
23399 -1026079 -1038671 -1019272 -1004686 -583602 -95966 -114655 62284 -23932 -299911 -151058
23389 -151058 -154682 -171441 -121654 -236867 7709 496500 485970 124139 27012 -47799 -102555
23378 -102555 612679 1004537 812227 342721 -7189 -85819 11004 95885 110159 1207
23368 1207 -67484 -41706 -15345 142923 184998 608629 680283 465803 236037 -350955 -359977
23357 -359977 120324 609797 853574 481368 352581 234751 147566 525133 372076 -76431
23347 -76431 -894532 -924591 -834236 -1016070 -748205 -588172 -449963 -144873 -302487 -191600
23337 -191600 178240 193185 414980 609966 404948 330040 416654 358242 211460 92972
23327 92972 376077 600402 727018 367789 -129849 -35289 114405 -27115 266843 405372
23317 405372 341799 102261 131727 322252 -12738 23809 473199 349318 591925 620399
23307 620399 474223 348064 -101645 -302140 -517280 -233041 -109342 404211 546221 242479
23297 242479 336121 -73436 -294687 -349302 -426388 -488147 -272670 -484303 -792158 -553430
23287 -553430 -226523 -173566 -584548 -240822 -88657 -158149 -208741 -357114 -333544 -302526
23277 -302526 -99625 496806 204179 -212569 -163643 -219410 -318786 -443355 -236439 128195
23267 128195 182280 50027 141186 282747 20525 -419163 -505335 -99530 -92063 -347736
23257 -347736 -154742 -331415 -213553 -289593 -249352 71469 390503 447390 765089 551057
23247 551057 432272 -1569 -121622 -217158 -184236 -552823 -573219 -1016643 -1045213 -779410
23237 -779410 -296637 -144790 71662 481503 586117 362855 293454 -113303 -243860 -407410
23227 -407410 -230336 -158808 -274121 -383718 -424583 -65705 8555 88504 184138 -221236
23217 -221236 -353014 244009 325576 488916 454916 183475 263578 410959 444018 586785
23207 586785 300711 95744 536931 777433 628425 335213 46399 147843 192771 228233
23197 228233 248442 164237 323993 723 -278086 -163456 -28608 56340 -185586 -481145
23187 -481145 -969358 -593833 -636491 -104653 658672 557415 281921 155554 270321 365365
23177 365365 417550 40857 -131771 -221065 -333891 -476676 -307280 -140552 13214 166408
23167 166408 -10596 -81043 177457 -8619 -449223 -282500 -469485 -772912 -253393 -58645
23157 -58645 219916 344083 -127115 -115642 -152215 -200614 133736 -422998 -520612 -184411
23147 -184411 -79833 -65999 -214546 -138178 187312 160944 -47785 -337480 -367654 -274771
23137 -274771 -469038 -478279 -362475 -288414 -304837 21486 85778 -2833 242931 -140023 -302875
23126 -302875 -139780 180589 81377 -380869 -516310 -257170 -269240 -446198 -278084 -175233
23116 -175233 -192708 198186 326409 137208 74365 158810 -10395 -407385 -735730 -802890
23106 -802890 -648714 -490725 -331222 -168473 5824 10753 -373789 -443051 -399857 -122952
23096 -122952 232806 502484 475797 562219 1005808 800040 351366 -116038 -52894 66121
23086 66121 148069 69722 42316 -42264 -94875 102831 -209694 -333935 -215336 -300173 -235067
23075 -235067 -53628 229626 432876 592923 292063 -242099 -389264 -420221 -542850 -160672
23065 -160672 156845 333349 25822 -80185 -44489 -243080 -308032 -221572 -441754 -542641
23055 -542641 -447087 -454675 -121582 -38227 95736 -227093 -424878 -103077 41619 -434505
23045 -434505 -479572 169907 127860 25690 -50301 -316250 -184063 -287025 -73446 350565
23035 350565 376929 299377 138084 -244211 -2003 8008 6305 -108953 260859 216870 -148627
23024 -148627 -874062 -1280083 -1038820 -854401 -778888 -786036 -402902 -156900 -55929 -83600
23014 -83600 198572 45441 -250126 -415180 54265 336074 298465 36434 -30064 353285
23004 353285 522933 340659 33660 -187262 -639557 -786684 -636102 -498114 -216585 -305854
22994 -305854 -598344 -513818 -653591 -761651 -528383 -36112 380296 571471 452725 234479
22984 234479 -213273 -232096 -35115 85251 -149676 -515015 -82940 220248 522326 692102
22974 692102 851262 362611 67270 256285 522574 268177 412606 279320 178373 603269
22964 603269 743221 684486 711499 584423 262010 -18770 182243 563980 466731 196207
22954 196207 391476 348762 559687 366330 347784 360342 573913 907230 138141 28208
22944 28208 130588 -68074 218762 374659 350032 67338 -484907 -902680 -784557 -687796
22934 -687796 -721109 -313768 -527555 -532630 -328978 -184070 -305955 -218700 -404374 -293951
22924 -293951 395367 395432 175173 368709 429431 403907 327152 256710 279713 574616 701980
22913 701980 553690 147054 477370 244205 104581 296820 603421 618977 489586 186424
22903 186424 -31235 -123453 -307701 -324560 -508200 -258176 -499781 -646932 -555885 -191415
22893 -191415 -34425 205210 138207 -18906 78368 -67386 14085 532076 759195 506122
22883 506122 463899 568542 502560 -101131 -556517 -278663 -74826 80968 224356 721872
22873 721872 893694 138700 -454976 -531210 -444378 -511084 -396004 166852 201305 -24185
22863 -24185 -226337 -147365 204663 288608 149015 73786 60564 474589 634006 325654
22853 325654 501485 489625 190265 200740 -65645 -379107 -196848 154573 375839 141829
22843 141829 189594 199751 288004 -121539 -121766 -497142 -313585 -453758 -558627 -167737 -273232
22832 -273232 -200919 -137794 -312817 -430033 -536616 -492128 -289074 163373 267566 374174
22822 374174 -51488 -365036 -431627 -135213 186698 -89889 -383162 -206202 -281887 -478192
22812 -478192 -373860 105912 -24833 -74189 -35831 -27850 260334 96940 197627 66373
22802 66373 -374253 -374434 -616839 -780594 -955927 -538272 -622294 -667066 -180254 -69255 -106089
22791 -106089 -74125 -146613 -424009 -170184 -264624 -121483 -348688 -214877 -148821 -157511 -358621
22780 -358621 -341535 -336245 -279122 -616621 -741341 -888637 -639658 -301192 -282125 -547636
22770 -547636 -269927 271420 422254 -19749 151304 152797 -183433 -543235 -28839 168515
22760 168515 -160107 -43460 159190 87712 -23946 -136846 4138 40756 -90230 -211300
22750 -211300 26319 321385 530591 14491 -395542 -294942 -409541 -674585 -361943 -371666
22740 -371666 -619925 -311180 -500264 -297934 225964 61546 65212 377451 546934 379834
22730 379834 478224 544592 639707 313495 634418 376653 185636 8355 -16576 169839
22720 169839 417324 251831 122600 152392 185532 164655 -72875 210033 647456 361338
22710 361338 -140315 -364664 -435921 -216755 -93133 6124 -252085 -186891 -341396 226066
22700 226066 287692 -27010 388021 529409 87598 -2717 13855 1760 329635 153180
22690 153180 -58954 -285653 -434261 -289614 13078 202545 318601 497409 631746 422909
22680 422909 613560 379987 66855 106985 22619 -191543 181805 831501 1304761 1291786
22670 1291786 612589 482179 504040 219818 -67148 -66634 348055 11554 -52992 -369033
22660 -369033 -671551 -507598 -343962 -33335 -94673 13652 154482 -14573 -50919 -25182
22650 -25182 -203873 450331 396926 4292 -17303 -111676 150770 412405 329458 325213 231789
22639 231789 552877 717816 1354599 1639653 855128 306992 372213 227935 -118684 -365464
22629 -365464 -306694 -254649 -356516 133428 201700 -315715 -527594 -178118 379661 634804
22619 634804 670240 658374 636028 590858 500006 430240 144386 -180845 -648075 -537151 -167425
22608 -167425 -652527 -1046084 -932808 -522599 -206821 27186 -223625 -136710 28090 -443205
22598 -443205 -839869 -545939 -79618 193922 297852 -396076 -851329 -734872 -286097 -341921
22588 -341921 -608109 -511351 -141206 352699 526332 711106 409316 -55296 -236571 -256500
22578 -256500 -200804 8538 -161221 -118521 79485 -95207 -277330 -553692 -173639 -97946
22568 -97946 114278 41177 -10960 -21667 -22842 -158867 -91943 29694 -15285 -128355 -264446
22557 -264446 -558564 -756141 -332796 -60752 -174310 -307111 -635752 -917729 -267727 164133
22547 164133 119250 -291 -46765 -423763 -439504 -122198 -421757 -670173 -500073 -522786
22537 -522786 -325294 -292891 -187664 -154229 -144801 -442425 -739145 -790513 -709126 -652127 -369793
22526 -369793 471097 676066 419103 54769 82055 157490 214852 459130 511078 212691
22516 212691 363562 406107 139612 -30474 -53882 -62937 -22206 -153134 1430 15985 -351207
22505 -351207 -165537 43964 72928 -142657 -81395 225425 568236 518438 28194 -206213
22495 -206213 -30033 457009 727563 580006 629305 169055 -57034 -330920 -366369 -645844
22485 -645844 -216143 136897 338770 502841 538736 702150 651818 283489 257770 -157053
22475 -157053 -639392 -608739 -375451 -292378 -93385 -221898 -873280 -1314265 -770220 -189577
22465 -189577 -62784 -113116 397138 707252 552386 265496 -259632 -679988 -341314 -69976
22455 -69976 -72307 -201515 -536838 -678443 -94353 -164038 -592079 -253242 185261 511465
22445 511465 265791 115763 -8678 -109304 261961 240325 71222 -148204 -503725 -398413
22435 -398413 38619 282860 443253 239304 203756 263200 109835 56164 341989 215303
22425 215303 26864 87651 -74300 -28075 -542812 -413404 -189474 -92841 136836 459301
22415 459301 669568 604666 92146 26794 -45433 82398 661711 765922 664654 69603
22405 69603 -181860 -198990 -453807 -572873 -210425 -16245 31722 235517 393835 24941
22395 24941 -92298 -89373 131267 39348 262485 -132457 -226643 -250431 -311824 -639201 -787440
22384 -787440 -211182 -144717 55211 131420 -146767 -343647 -37070 187060 -191492 -260371
22374 -260371 51245 40075 32407 -224752 -183984 225943 517223 168052 -73178 -217183
22364 -217183 -144647 -190337 -446406 -665563 -379791 32340 136756 12812 -37389 -454961
22354 -454961 -638034 -480865 -634420 -412158 35834 -289496 -709336 -520936 -121549 -105649
22344 -105649 -416396 -300010 232578 244046 222560 429970 338894 415215 440013 277037
22334 277037 352743 144545 345240 279017 31007 161332 234838 292246 347754 -199307
22324 -199307 -127772 231590 537756 635464 160430 -166738 -340394 -334532 63448 97471
22314 97471 267988 224128 1187 137185 274649 31318 -286385 -314825 -182331 -608637
22304 -608637 -408107 -545364 -703630 -537778 -466030 -140544 621709 1188336 927475 243939
22294 243939 -268671 -251349 249199 49876 -36200 -60749 -191470 -469942 -565743 -579497
22284 -579497 -572798 40360 442295 123396 47718 497508 672439 540081 506175 284171
22274 284171 143806 159276 420158 152320 -378714 -911242 -1023842 -838249 -470312 84067
22264 84067 461538 622412 149325 168293 89847 -83921 -146640 -146497 -63705 -127764 -362214
22253 -362214 -391755 -138418 -84705 92581 242791 239417 -5528 148057 284578 577100
22243 577100 668672 508256 -147005 221894 458463 445394 406737 424866 425819 194894 132121
22232 132121 -251234 -370369 -339928 -342287 -189905 -234984 -241042 -261890 -206788 -401211 -316343
22221 -316343 -595394 -961394 -1167403 -1050100 -712396 -158607 -201924 -591145 -373627 -281606
22211 -281606 -143552 137835 378879 185817 -260667 -485969 -617464 -303856 19682 349169
22201 349169 742845 738045 256625 305639 -14263 11535 418384 222920 -20834 -222710
22191 -222710 -146300 -126514 160523 148679 153080 17611 -194951 -306616 -620447 -435855
22181 -435855 -243075 26869 97601 -105102 41515 -153598 -236552 -543765 -582807 -199764
22171 -199764 -151239 88800 -301768 239333 523204 499244 688540 1117365 869529 514874
22161 514874 481750 623985 954256 985717 903662 725352 701214 426968 429911 24380 100978
22150 100978 69951 95665 373454 275333 -113737 -189902 -250622 -16119 123568 -35030
22140 -35030 -46442 164012 322513 655987 595613 305415 62182 57463 528508 891682
22130 891682 576569 479375 448832 171442 -31517 -309306 -427613 -481144 -606694 -548890
22120 -548890 -363662 -80682 -135790 -498668 -682386 -838564 -663605 -247650 88166 380300
22110 380300 335554 121484 -62061 17286 133204 -78243 -589605 -522540 -247502 -238195
22100 -238195 -292389 -107919 117982 -2421 -18182 1130 129158 155720 147879 -129108 -439010
22089 -439010 -80948 73088 -213706 -53639 129514 -109651 -210130 79758 130527 20214
22079 20214 -154921 -218134 -434417 -563455 -75706 -188838 -367159 -485935 -530709 -186011
22069 -186011 293327 795610 866912 981908 790110 547460 520715 198155 -368526 -537191
22059 -537191 -514122 -160303 76894 -309894 -517977 -632943 -751748 -253029 -99174 58130
22049 58130 -35874 -56379 22662 23966 -80587 -331360 -271141 -298299 -83838 422527 449096
22038 449096 195051 -93323 -1142 315679 208067 -47515 -326623 -46956 -145758 -319105
22028 -319105 155541 261858 38707 108386 458737 255282 349433 783224 553243 113896
22018 113896 -407988 -750472 -185072 242094 520561 695433 542816 431360 381827 312111
22008 312111 221472 78072 -177486 -94931 -488552 -274300 41733 -254858 -144068 -81231
21998 -81231 519193 673467 371303 124573 58122 13654 -290328 -619227 -672064 -582776
21988 -582776 -244905 285170 237730 86113 -46015 -331209 -347373 -213641 -148132 104943
21978 104943 111393 -4168 130398 135441 182274 566857 747109 627723 135841 10700
21968 10700 -179473 60196 -55123 -117755 279929 407427 366755 648833 385625 216259
21958 216259 160262 693255 928257 372812 534249 902380 365090 -201552 -512196 -303685
21948 -303685 39632 254275 30092 -140117 -108121 88612 623406 403181 -147633 -215795
21938 -215795 -11067 102047 -314907 -544172 -420821 -180993 -405332 92437 253226 374457
21928 374457 506557 321886 115991 126187 299117 464867 264638 87151 353257 610168
21918 610168 733236 565575 850533 892051 383196 34173 -26345 8447 -81974 -46002
21908 -46002 -217664 -553286 -655745 -651965 -907855 -1005535 -735661 -239732 -26744 -41850
21898 -41850 -396981 -439242 -319662 -518608 -449450 -178501 -381557 -851020 -938822 -704867
21888 -704867 -375518 -18974 35009 -172660 -589731 -404559 -121838 43201 -235702 -505746
21878 -505746 -717842 -851421 -857586 -464698 -75799 -258005 -164083 24572 91142 -458360
21868 -458360 -548368 -148064 67737 -4470 -168016 -104547 -286478 -443726 -69662 368569
21858 368569 297627 -96210 -92674 499944 665521 284710 320818 269354 -16873 -275251
21848 -275251 38292 273555 554130 576282 558758 592650 193704 297628 114005 -80539
21838 -80539 217232 842195 691787 309507 291451 252685 18570 1030 -255192 -523079
21828 -523079 -540697 -412497 -377981 -78978 536316 666602 442151 176537 296450 482888
21818 482888 387243 218138 398314 264395 225239 32575 45308 148930 106574 27395
21808 27395 363535 296291 -52419 -270289 -127844 31702 224840 526003 350980 -297244
21798 -297244 -559480 -195811 -75003 -124390 -76804 100289 -200141 -464401 -148268 -246851
21788 -246851 -454504 -510237 -219039 -169349 61706 -111717 -177310 427262 355694 214822
21778 214822 383442 440461 321106 -38819 320822 541246 173690 -243775 -42630 129357
21768 129357 152882 276743 90017 131441 71142 23968 142091 124497 118869 -60493 -416637
21757 -416637 -301799 -37700 -154196 -263540 -243504 -336193 -410231 -74627 334838 160250
21747 160250 131415 -439 -43384 -214670 -654061 -813954 -456659 -86321 194013 -94822
21737 -94822 -315530 -377622 -497929 -353199 -95299 290239 124836 -96659 -96733 -29822 440171
21726 440171 467793 84359 288636 -163880 -56846 479597 229821 -71802 -303916 -271971
21716 -271971 -187492 -92481 -112574 -163378 -284638 -112205 139936 293687 254888 352022 350214
21705 350214 267221 456131 214072 64082 -459636 -552050 -589308 -641989 -327864 -66613
21695 -66613 -62419 124343 243779 240181 312169 -21527 -239210 -301056 -537133 -430459 27361
21684 27361 121023 -129067 350375 301599 487619 645813 11557 -16048 164259 181684
21674 181684 25079 251970 -103256 6657 113611 -257160 -546677 -200552 237526 -62504
21664 -62504 -124164 -85923 -181388 -261502 -251070 -429255 -916617 -770961 -430186 -171000 -210612
21653 -210612 -245993 -121136 -222617 8054 313242 141286 -89362 -38814 -157076 -113496
21643 -113496 315043 84213 -100448 64770 207657 43219 -106405 -97174 -66432 291971
21633 291971 319345 8640 -558969 -480151 -329043 158253 549525 608904 791147 574997
21623 574997 8251 -694872 -612770 -343027 -212176 -141270 39417 166061 365563 382724
21613 382724 30861 -13759 253217 581630 713389 451208 97287 54807 -141698 -201459
21603 -201459 -43799 -91904 273709 303562 192481 291742 475631 496945 407357 -359432
21593 -359432 -228421 98213 161256 -6027 -111075 68868 238927 -218695 -352950 -363285
21583 -363285 -194373 -581024 -814966 -1021577 -466317 -381674 -71042 155493 235062 588017
21573 588017 557475 146086 -327929 99540 -89130 -425955 -283042 -240582 -40088 15961
21563 15961 61740 170110 437407 281409 96485 15902 -81760 -148808 -345690 -377573 -443143
21552 -443143 -839449 -595166 -386770 -666170 -743952 -759418 -814204 -259372 184565 231845
21542 231845 83790 -49350 -351203 -193666 -419084 -344078 -226550 -414064 -32507 225892
21532 225892 64173 -110641 87235 32596 22789 242112 50040 -158745 219541 704861
21522 704861 788601 274884 260423 316228 344972 354889 338006 1337 29498 166299 -219805
21511 -219805 -558937 -424948 -431615 -245082 -234412 -323873 -661330 -618292 -604620 -258833 -213383
21500 -213383 -196919 -269095 -242053 -188719 -109923 41471 5038 231267 566389 282094 79583
21489 79583 -30324 -54146 237034 502553 353874 91328 -111541 -260625 41935 431786
21479 431786 133929 -8744 -28502 -305334 -227239 10489 449125 618358 393483 -81409
21469 -81409 1812 435810 316053 36796 -244569 -461960 -408503 -500579 -93618 77890
21459 77890 -197102 -273571 7533 31791 -341706 -455203 -589277 -140085 -288824 -644755
21449 -644755 -293569 -144333 -234288 -355128 -543766 -464872 -394273 -324040 -145447 221722
21439 221722 307653 97027 -328336 -370186 -380037 -184111 -101207 121121 -186354 -559227
21429 -559227 -190102 269380 29359 -107263 -456891 -444384 -526234 -203738 59008 406931
21419 406931 731215 545360 559608 527143 86812 -50529 121184 507418 481584 470217
21409 470217 261751 121745 374575 259273 362268 -348645 -643030 -156244 130454 -34236
21399 -34236 -183984 -41380 27181 312975 292025 -157097 -130884 175319 211604 282619 493321
21388 493321 206873 -161083 -364669 -505526 -350971 -13468 269426 146208 225300 358671
21378 358671 374757 896174 833427 395997 307920 -19714 7979 -185303 -2583 85574
21368 85574 99930 32598 -283660 -741548 -464764 -16043 348895 253431 131211 166016
21358 166016 -68945 -334620 -125707 250662 233411 40643 -170058 -428462 -502586 -166064
21348 -166064 -43664 136344 271000 294588 288323 124403 82914 -92184 112721 352582
21338 352582 407302 254268 -146530 -301896 -160555 97587 241670 135726 -260853 -98857
21328 -98857 155852 -22177 317802 236657 289736 288460 289610 264056 124730 112778 93048
21317 93048 -143467 -428457 -927124 -491234 -517947 -573374 -496539 -212088 180908 -212535
21307 -212535 -172033 312888 500655 597206 499409 -50595 44502 -24067 -616060 -788776
21297 -788776 -453510 -556775 -764058 -1137459 -793667 -425238 -100103 -117371 -759959 -590560
21287 -590560 -493198 -395066 -136178 -183034 228652 360213 -237740 -242857 -607673 -992257
21277 -992257 -667751 -116871 232458 292627 -15833 -164576 -432312 -326009 -510066 -387531
21267 -387531 -236847 -433510 -193819 -105491 335880 290168 177468 -8023 274864 509929
21257 509929 239361 -58051 -381556 -22110 470257 586679 227218 -343318 -589778 -378022
21247 -378022 -60765 318247 127533 -48592 405069 280044 389673 567371 463325 34796
21237 34796 112288 83401 220389 233644 57087 243578 232607 53870 554355 797494
21227 797494 591594 706816 318709 249597 259400 5476 -279209 -235429 14074 622137
21217 622137 665667 548458 1458 -319678 -239106 -132399 175894 -57097 -301883 -4898
21207 -4898 325156 757493 548260 -41541 -95680 -357284 -458854 -253870 -4578 -35907
21197 -35907 -182714 -596610 -642958 -293212 -76245 81430 -64481 -408827 -511395 -480781
21187 -480781 -55218 250354 -33258 -320278 28900 443048 412962 796659 310564 -477418
21177 -477418 -492220 -371411 -270831 82562 -4254 104956 -225933 -108607 7937 -142897
21167 -142897 -444928 -530914 -562264 -707413 -717305 -600530 -634628 -373298 6465 158986
21157 158986 379782 -37669 -354249 -555184 -664765 -395697 -87538 174589 26113 -222613
21147 -222613 -287610 -416131 -461963 -817159 -588898 -102123 -423549 -418197 -443597 -428682 -497022
21136 -497022 -179849 -129011 -444326 -568322 -690023 -384716 120804 568549 657792 501728
21126 501728 89005 -447308 -593344 -425949 -596453 -322510 151517 204125 325174 179354
21116 179354 246882 278534 195344 391624 224158 -364357 -251461 -275536 164080 -57002
21106 -57002 -126665 -750995 -817030 -397444 -114124 216929 240746 500923 615773 404005
21096 404005 395601 632879 604025 312717 -66614 -321216 -712577 -655868 -334111 -171701
21086 -171701 -150980 -280105 -160883 -368746 -86728 401328 118648 -220241 -204232 -301264
21076 -301264 -48266 52757 -325135 -445965 -184213 -386375 -859553 -615962 -752453 -801405
21066 -801405 -287177 -193395 -99928 -89457 -37775 -147440 -139435 -624126 -701754 -729578 -241547
21055 -241547 -370122 -268345 -267175 -445052 -561196 -545752 -294187 -103489 263110 204950
21045 204950 71312 -84881 1495 -386335 -544981 103476 590185 352342 -82765 -97314
21035 -97314 -6941 118054 -345471 -288207 1446 233802 660451 506991 110450 238411
21025 238411 152798 18452 64915 -69165 -584969 -600797 -452966 -274133 -118404 -301617
21015 -301617 -563271 -104436 76091 143212 -56481 -301775 -297020 21095 -47334 46442
21005 46442 136677 452067 661053 1126352 743435 595423 724244 511405 522730 1130741
20995 1130741 864665 197866 547123 585345 252766 506293 384675 272818 -283317 -225267
20985 -225267 -342386 -68384 495521 604905 39408 -368462 -223245 -227099 -153256 -309641
20975 -309641 -331039 16879 75635 147738 -4380 -81198 356058 460965 164041 -255730
20965 -255730 -245611 5269 22797 -190556 -388291 -530827 -715201 -557163 -601989 -696150
20955 -696150 -324207 57032 229669 225323 137330 -89664 95377 259631 135149 86782
20945 86782 77649 461184 670944 672895 309725 159766 142987 237405 230575 168164 -590970
20934 -590970 -637375 -627163 -826841 -223664 29359 -119771 100661 138324 -510941 -891532
20924 -891532 -1105211 -579502 -34217 183458 79128 -162782 -226696 29108 -110002 -159786
20914 -159786 -230074 -669458 -536688 12858 120162 392930 -162457 -348114 82211 312220
20904 312220 71056 -209938 -472145 -511643 -827248 -924173 -959759 -1092566 -525824 -328354
20894 -328354 -332067 -310603 -424603 -463735 -260480 82753 96515 -40784 169933 789173
20884 789173 833859 370012 -229258 -502232 -558790 -637607 -580140 -761762 -822543 -566515
20874 -566515 -271382 -91877 -268234 -107649 86128 53679 -592871 -614068 -140038 -89277
20864 -89277 15627 553628 787694 386517 146398 203833 -7183 93768 68412 -83583
20854 -83583 305791 201756 -94233 120883 540651 751453 423082 -409672 -555028 -356592
20844 -356592 -277029 79012 474218 796061 669415 128032 -73823 -410199 -659204 -635703
20834 -635703 -765524 -479125 -290301 -59808 -247409 -481137 -395288 -124692 -104406 -290689
20824 -290689 -379690 -357990 -658997 -632253 -518498 -162468 171981 77229 382306 392008 347055
20813 347055 890108 767058 625007 294966 370874 722284 550810 385150 160105 -489720
20803 -489720 121255 156968 -141504 166724 -237167 -255215 139147 583545 222031 29855
20793 29855 58208 -41261 -202747 -74056 -120371 -9726 368388 655745 409773 375647
20783 375647 27471 -139839 163187 547942 632797 563751 534181 188065 119452 222779
20773 222779 341895 498715 832261 864421 785532 694931 354299 19155 -59070 146291
20763 146291 265252 335039 685791 482104 560133 382300 462384 422069 379823 174722
20753 174722 -99914 -149627 -343469 -290698 -186058 -240614 -394528 -208750 45205 174783
20743 174783 393495 217303 -66810 -109624 399121 895342 356477 139432 130819 -25026
20733 -25026 -41581 50862 257923 234855 -2096 -178762 -3152 60741 83863 578735 886861
20722 886861 678747 387380 460966 181573 54976 123959 493208 364676 308807 275235
20712 275235 26598 -192944 -52766 297218 82772 -86127 26021 32775 -188212 -396928
20702 -396928 -167812 7279 -208078 -39449 -92367 -151913 160730 -58922 -128482 26897
20692 26897 23026 79769 400116 520981 225687 63425 44137 33095 -96300 -26682 540575
20681 540575 691827 350229 100273 384919 -178003 -466175 -381699 -491905 -250707 386131
20671 386131 526233 933667 858367 111405 -37067 -245951 -544882 -156970 232496 185739
20661 185739 -536358 -644310 -447966 -499550 -186879 73265 -22020 -206664 -44491 220621
20651 220621 179089 246140 282875 -24008 -178593 -32084 -418485 -732673 -649144 -556916
20641 -556916 -676245 -755761 -274256 123506 336454 401618 414434 -73702 94732 -168218
20631 -168218 -510377 -669949 -571899 -862009 -1200500 -861347 -488083 -532122 -584745 -666083
20621 -666083 -536857 -730622 -832207 -286010 -40573 210070 267688 386932 480084 379095
20611 379095 84120 -21309 -112923 -98501 216791 91315 -191867 -102233 -173157 -19951
20601 -19951 -63635 -105394 238022 321509 135354 -245691 -350812 -106648 -109296 -59617 -198483
20590 -198483 -91737 -214973 -298486 -163094 151254 228690 491304 303251 -14063 514376
20580 514376 742384 303723 -5652 77992 -88303 -280580 -554251 -504739 -369678 -198338
20570 -198338 196409 234723 -14232 -262561 -752249 -681781 -476176 -420155 -236376 -224741
20560 -224741 -297389 -242183 27470 247505 -12034 140908 376539 372000 109194 18247
20550 18247 10762 -19962 4479 -261334 -308584 -175300 -377121 -319482 296895 467308 279413
20539 279413 427783 558007 724312 300680 -133126 239435 327943 270962 54162 -606491
20529 -606491 -542446 -203938 -115235 -395942 -269299 147291 25154 -275196 53045 301233
20519 301233 297616 98007 -243540 81080 143 -523587 -470963 -315243 -215401 132844
20509 132844 210382 134587 278769 445642 869550 844816 767503 191907 -132925 -55102
20499 -55102 -33152 267179 296919 108526 3160 357518 578458 346596 311842 268100
20489 268100 509530 402945 89222 -42682 213516 341484 292861 -331683 -611081 -829370
20479 -829370 -507216 -127607 -196492 -326327 -237487 -245699 40446 268245 538126 419092
20469 419092 413888 -44354 -566773 -656937 -423580 -202535 -173019 -176498 -94429 -9689 47425
20458 47425 134099 442600 848693 968932 567024 219399 -206596 -739332 -668967 -554555
20448 -554555 -466180 -312697 -161094 -186439 -625910 -860051 -266362 -68213 -449731 -709801
20438 -709801 -577028 -550638 -522369 -550679 187950 633185 693724 335583 15594 -404026
20428 -404026 -519543 -611095 -446422 -234018 7267 36973 268607 113772 53603 27757
20418 27757 271801 456288 214997 463271 426608 249828 87898 -169267 -725945 -689905
20408 -689905 -37055 353202 278095 16019 302724 185044 522 -124362 -280280 -63794
20398 -63794 71683 195210 413272 534094 -9883 -61074 379788 754730 702980 397614
20388 397614 -218613 -267054 -273039 -316108 -300765 -251436 -35563 534279 744632 611090 679414
20377 679414 390633 183991 243785 503495 670431 663014 786800 793591 807593 547686 -70968
20366 -70968 -158253 88351 52211 -234209 376376 335163 41974 -214223 -201022 -701523
20356 -701523 -813369 -454199 -480280 -633637 -555818 -778063 -738181 -552338 -78271 24818
20346 24818 136050 64235 85454 116466 -166213 -336470 -325391 -107259 204138 346635
20336 346635 84601 -507108 -992757 -673931 -138745 -315589 -425983 -561072 -232529 219850
20326 219850 242020 368493 465196 20258 -118537 64166 -130846 -166312 -191534 -376880
20316 -376880 -101057 404787 712482 575205 241810 265967 83210 -28002 36874 -200997
20306 -200997 -160640 -298492 -451712 -551434 -443252 -414607 -584206 -621647 -253788 -22721
20296 -22721 -915 282789 203200 -268661 -551350 -528437 -583434 -72986 37998 248426
20286 248426 241854 59927 -219313 -663197 -681022 -295172 -403930 -223714 29845 370345
20276 370345 810647 794625 327468 -30490 -130463 -275936 110573 311062 365290 -27127
20266 -27127 -216214 -552618 -220780 135596 -54199 -395593 -480683 2974 684046 829103
20256 829103 326997 149149 132862 372148 658822 631577 517170 96139 374976 641749
20246 641749 1050544 915528 615442 585158 503000 266318 389697 389338 309138 630697 839960
20235 839960 799131 273661 -175816 -175135 -98046 -159898 -470792 -177877 177368 294227 -194243
20224 -194243 -496730 -482904 -34196 -218305 -596571 -405735 -424665 -654789 -647127 -150519
20214 -150519 278220 632581 503542 75443 -202535 -410532 -886819 -995694 -845565 -846973
20204 -846973 -790368 -511923 -286421 307751 595866 552552 273124 454310 179809 1054
20194 1054 -281696 -451447 -918602 -1078605 -793788 -264711 51764 -457292 -625210 -610350
20184 -610350 -442477 180910 -48307 -256994 181090 139012 240268 100718 -6826 -180439
20174 -180439 -227587 168636 257624 105527 131706 110761 165525 89231 -336268 -170446 28128
20163 28128 -229712 -509134 -263313 -79069 176408 407723 469834 153242 -423295 -537310
20153 -537310 -528954 -578311 -299842 -188543 -125358 -28511 -160387 -40037 96494 33177 264011
20142 264011 229807 -464288 -905040 -631343 -574043 -474314 -620453 -352635 376170 596456
20132 596456 458513 201183 319132 438956 197523 -155481 -171564 -135540 -496990 -835987
20122 -835987 -621100 35027 192572 604960 828662 858241 371622 60705 153756 -122392
20112 -122392 -150562 54904 -128730 -431593 -372138 196562 170395 -101555 -255482 -398602
20102 -398602 -177250 165492 307790 96646 162964 479268 440763 246220 469958 585649
20092 585649 265108 335915 494878 505852 595590 663360 663340 507428 341811 519723 490682
20081 490682 79683 -375660 -143328 298185 530331 538029 459204 458555 161056 -136166 -470873
20070 -470873 -357638 1289 162517 201746 268483 496378 601848 852258 267402 143636
20060 143636 48156 -97920 243340 329762 660039 603830 868854 452915 176782 323463
20050 323463 262360 -84809 -196844 -431724 -310535 -19524 64007 109275 -145973 -191983
20040 -191983 85212 -225466 -585645 -270288 -278563 -413004 -303879 -41183 117407 -21568
20030 -21568 -411224 -299881 11341 -147786 -192352 243982 442596 300544 256768 -168312
20020 -168312 26185 267899 51673 -318932 -411322 -77335 -102699 147774 432519 354595
20010 354595 341358 366618 341955 141572 237845 79710 104322 296017 351735 469367 307081
19999 307081 158309 52587 594446 421730 -89487 69309 -106449 -684430 -616586 -292070
19989 -292070 -183999 -22600 212018 230307 258692 -76174 124585 207577 77853 151132
19979 151132 -157703 -591324 -650617 -31503 320410 -159375 -562509 -753886 -494318 -714643
19969 -714643 -710985 -580916 -519926 -537509 -775614 -928309 -521755 -251665 -473523 -147858
19959 -147858 -117304 29847 -32421 -353748 -282667 -287409 -70552 464915 421569 407425 161152
19948 161152 -216903 -245582 -28490 -331185 -376618 -138231 -236671 -495219 -316328 16182
19938 16182 -15079 -155077 -529746 -524902 -442594 -490830 -386923 -244428 -195794 532366 551564
19927 551564 379665 163664 662120 846323 598082 494938 219744 -111958 -448527 -688081
19917 -688081 -546908 -240544 -278762 -240923 -198806 -172599 -149993 -62244 204465 226271 367581
19906 367581 2471 133991 261635 64070 -534518 -774381 -672346 -928509 -675097 -201519
19896 -201519 267034 113538 -128432 62586 194259 159750 43348 7059 -387181 -429603
19886 -429603 -299374 -488664 -30892 180119 34759 -194436 -171527 -224935 -772902 -622231
19876 -622231 -447818 -312836 -240024 -327030 -642255 -532209 -195623 8587 -203528 -101464
19866 -101464 287648 -67253 -474402 147212 378031 255633 371084 134509 59935 28562
19856 28562 250528 352459 80983 -44837 -245264 -163498 -229466 -544715 -349969 66092
19846 66092 -273022 -283519 -333905 -250178 -607204 -645462 -463629 -151921 -125839 46960 618096
19835 618096 788632 339422 51230 -41008 157985 85474 -162128 -230769 -398266 -144951
19825 -144951 -13654 29803 -47351 -289720 -218818 -193171 -358094 -185469 148022 155758 251724
19814 251724 122663 294172 72568 -124905 -198282 95062 30632 44647 257788 492710
19804 492710 348268 152062 259614 449768 42920 -431572 -271934 -154339 -336126 -476669
19794 -476669 -608193 -654869 -230179 111873 529605 226104 196377 455616 506156 177828
19784 177828 -47858 -159374 -16723 214614 436425 335395 313551 521916 536404 756334
19774 756334 818188 495313 -7935 -95002 -240033 -196704 409844 593122 604169 211548
19764 211548 -11499 -161535 -203523 -157550 -361908 -426494 -609021 -478273 -318863 -316328
19754 -316328 138435 92936 -366295 -372232 96008 583666 614285 687013 458999 -98193
19744 -98193 310854 591812 502633 126862 443191 409608 189182 -51562 3730 6651 307477
19733 307477 415558 95932 380021 450597 222011 311709 -120992 -301593 -157526 -130833
19723 -130833 -12982 79933 -202640 -302261 -283889 -785132 -879255 -685736 -431962 -151074
19713 -151074 -474783 -296406 -290069 186683 511060 515477 674488 502662 91999 121356
19703 121356 88043 22602 127985 697069 1033913 923017 443739 183193 74002 -99758
19693 -99758 -574651 5829 378976 258794 124654 -187180 -103251 306509 43467 -110219
19683 -110219 -358520 -71521 -39566 -161392 -27134 28817 84575 309506 299087 298161 108538
19672 108538 -499236 -439743 -191470 -294328 -567446 -332510 1824 134665 96124 -121465
19662 -121465 -51390 377162 536353 368456 -225103 -492035 -83392 -48443 -342572 11056
19652 11056 261240 81975 10534 298739 648837 742699 311122 110019 -62200 -55126
19642 -55126 -27682 277333 396917 365396 688739 837313 697584 645703 551710 325433
19632 325433 500619 571945 351394 -202063 -486641 -252773 169455 335819 693540 747457
19622 747457 158766 321585 105093 -221456 -456809 -137792 41107 113811 263590 366488
19612 366488 402836 810373 762477 627097 636588 364264 -203293 -129883 -84013 100296 471403
19601 471403 525540 590248 421743 23448 -120727 -76834 -85620 68187 155661 287062 16991
19590 16991 58067 111962 -80143 -74144 136803 89097 -567882 -874055 -855569 -835113 -720327
19579 -720327 -411221 -153836 -65645 -24404 346810 266048 -44014 -70854 -55088 150409
19569 150409 -135064 -156486 -115446 -481642 -708816 -498236 -407986 18041 92966 -253637
19559 -253637 -550725 -821582 -586995 -305125 62233 242787 470157 633064 621960 115567
19549 115567 97749 409041 87056 262695 70595 -236476 -489907 -369527 -157664 -342261
19539 -342261 -489959 -494833 -495168 -440464 -529981 161302 531120 549459 334830 273901 453454
19528 453454 559460 696291 103615 -562117 -285253 133540 16177 -200689 142029 325709
19518 325709 778109 658138 607194 296570 4515 -124661 -547229 -307760 300476 185185
19508 185185 -62067 -34157 1498 65450 106866 -17459 -155021 185577 191700 184335 106329
19497 106329 -39051 84608 24734 334471 24014 -336415 -222547 -74129 -305510 -293427
19487 -293427 -108591 -35795 14864 267150 217124 565301 1052376 1019975 1123164 1265224
19477 1265224 711061 311908 37033 171716 507371 533161 116984 15970 503115 476531
19467 476531 193001 401890 430638 210516 79487 -142519 -20189 53203 232962 400729
19457 400729 681218 339089 175385 112811 117363 26471 -431530 -372528 -284642 -339860 -798911
19446 -798911 -525391 -191471 -38918 -359343 -86830 177120 417459 313547 131755 102983
19436 102983 55376 120080 -40945 -295173 218202 348182 -37032 -212336 222695 265973
19426 265973 377303 528309 709725 172028 -71282 -70244 232569 598874 872806 1041339
19416 1041339 966229 808859 361065 -66796 -289897 -75777 -172523 -511656 -763324 -651810
19406 -651810 -298465 -498781 -647725 -448022 -173948 74773 193715 591284 740802 820303
19396 820303 721729 565965 3690 182728 694377 534403 -96063 -257385 -140699 -170672
19386 -170672 -460217 -673027 -613109 431763 973845 917012 784021 130313 -285805 -325176
19376 -325176 78180 458247 512600 216756 124723 143358 466497 885869 749138 692358
19366 692358 368793 103857 311693 702444 697911 606304 610391 663845 753280 477291 424731
19355 424731 466553 566424 920669 940739 580459 347232 -433144 -484214 -156530 346844
19345 346844 536264 856871 889869 473137 251865 364032 527945 767091 985485 1115792
19335 1115792 1110074 635670 671151 737789 1002091 927356 836775 621119 163387 -72913
19325 -72913 -289576 -491625 -497103 -142992 -23135 53647 103754 19031 126171 267417 259094
19314 259094 225060 388641 281424 139360 322595 571047 818281 1034258 1115354 975311
19304 975311 198062 41344 637668 881302 680901 44835 -273093 -229650 -66922 420231
19294 420231 698348 648595 381901 166571 161600 41191 50236 50293 129465 499831 463348
19283 463348 610760 456498 467760 688499 893093 1210336 1326482 883080 674112 684535
19273 684535 429867 583834 474136 854405 918109 994494 1133504 1464173 1561887 1654824
19263 1654824 1490444 1094485 973356 1236028 1657271 1817324 1734157 1718515 1548832 1704424
19253 1704424 1755873 2209476 2475968 2484564 3099193 3817525 4249750 4358072 4205332 4645558
19243 4645558 5362036 5875095 6295451 6322181 6742221 7996301 9076799 10307993 11712530
19234 11712530 13479760 15901937 18492838 21689678 26294615 32150140 40270880 50467019
19226 50467019 61716862 69643225 72267054 71507492 71618659 77007727 88080678 102090673
19218 102090673 111728698 112203717 102662347 90093121 79818531 73799863 73113051 75388906
19210 75388906 75335885 69817112 59150110 47205034 37487849 31368871 27636647 24873861
19202 24873861 22106442 20151413 19072752 17970286 16422945 15061599 14444523 13599867
19194 13599867 12661301 12175167 11769900 10751930 9729113 8545642 7371805 6833525 6388286
19185 6388286 5859756 5411146 4900504 4797976 4423894 4122927 3831882 3205837 2851431
19176 2851431 3037436 3269167 3168608 2753217 2523300 2250801 1731893 1604205 1364887
19167 1364887 1221243 871060 950614 695840 483651 512770 591654 920775 1237111 1755180
19157 1755180 1635464 1464229 1233277 1225896 1118233 1272865 1308194 1294191 1015633 449312
19147 449312 466453 293108 562440 883647 889157 1197892 1038815 874548 736604 813008
19137 813008 974722 1149507 1548066 1825553 1204937 1050333 1051197 1123197 1413617 1311416
19127 1311416 571735 324675 142087 -41403 215067 303015 224857 258559 189686 431447
19117 431447 573097 256038 324433 622121 524689 300573 355709 574515 203179 388698
19107 388698 423483 489390 322391 234281 52394 -118653 122195 342168 53279 -240896
19097 -240896 114625 602455 522919 361438 553537 786824 703489 580659 162510 419814
19087 419814 463172 627382 1125343 1457399 1031061 901115 1375423 1213073 497860 184263
19077 184263 462961 165117 678432 514784 209206 374960 374117 533399 378410 411486
19067 411486 398792 765761 694865 102973 -248734 100602 624677 575620 101861 -104063
19057 -104063 123982 26479 62521 -1077 152306 502498 832829 721996 159883 -328768
19047 -328768 -344830 -77199 -257474 -221759 -16075 23524 190731 130785 389421 518509
19037 518509 635329 565235 592058 402403 311971 543975 536514 351037 43784 355469
19027 355469 517724 643225 446255 -103035 -438888 -508652 -493406 -36547 249308 109279
19017 109279 4603 30914 147033 -74821 51829 237091 422630 493955 327450 136078
19007 136078 236092 285600 542619 66466 -88929 356124 294206 328272 549009 547048
18997 547048 469891 552516 679082 686284 607268 249013 224500 390644 60177 -29268 462686
18986 462686 764029 596836 150038 -131318 2253 -46258 72826 247903 481759 81169
18976 81169 -132852 1613 127787 583022 705828 810441 738247 617109 484813 518349
18966 518349 451963 466665 469615 45934 54841 337206 944783 884950 650523 687808 678317
18955 678317 777715 1235517 1611107 1281163 1195664 870024 559162 595059 379473 650319
18945 650319 843929 1212761 1343128 974593 864414 689965 276202 -295474 -36847 385716
18935 385716 872191 1099234 1252949 1807781 2491145 2145532 1804536 1772889 2113620 1613986
18925 1613986 1173557 1439135 1902125 2098179 2218075 3018788 3750397 3883266 3926387 4169292
18915 4169292 4465031 4024441 3918661 4416575 4532880 4956772 5373695 6035978 6638780
18906 6638780 7487547 8582936 9732610 11060566 13351357 15819833 17959917 20890034
18898 20890034 25442740 32089946 41466385 53543713 69344669 86414596 99251382
18891 99251382 102569484 94110414 78943469 62759977 50975126 44151629 40963384 40708348
18883 40708348 44012955 50460723 60387440 73742587 89771000 103484060 108395072 101865095
18875 101865095 85670547 66943472 50885685 39704621 32434224 27443408 23821188
18868 23821188 21030576 18836180 16881020 15539980 14677554 13850613 13337887 12643677 11958092
18859 11958092 11219547 10835021 10288269 9624853 8892083 8102664 7226067 6641095 6608875
18850 6608875 6093094 5851662 4970901 4229901 3824988 3375531 3045744 3071839 2849636 2860110
18840 2860110 2793798 2081752 1421753 1568068 2324089 2518553 2184236 2107616 1588325 1318466
18830 1318466 1447058 991031 790356 720265 820474 754662 668647 671889 385054 103909
18820 103909 -43179 550601 756342 478567 529980 650320 1402001 1595336 1179395 767316
18810 767316 401933 457036 312750 108408 125554 81990 94187 271851 570123 558239
18800 558239 690042 613580 394040 179897 -253203 -317926 -399480 29314 412067 521623
18790 521623 818943 604641 362739 44144 -51284 148655 134527 16663 204968 768818
18780 768818 992021 915311 916513 740345 298950 279007 460325 811933 1055569 412745
18770 412745 493483 1073737 1339490 1591392 1761665 2053347 2757111 3407224 3826269 3381278
18760 3381278 2441014 1782149 959517 727873 1226583 1176256 1043790 932015 950021 1257680
18750 1257680 1266298 1222704 801863 128332 -371648 -634450 -565553 -300003 -43413 15487
18740 15487 -79356 34027 256861 394027 523687 290183 -190054 379385 661845 1214070
18730 1214070 1468399 971551 768101 764122 791302 433226 208247 194045 155927 151654 240634
18719 240634 272735 521507 287649 202963 565348 946641 1245112 1051408 1024302 1451244
18709 1451244 1622847 1838721 2025446 1961531 1332547 1271977 1514561 1714800 1638596 1521534
18699 1521534 1620684 1564681 1626560 2130324 2000323 1878915 1586080 1667150 2029269 2647405
18689 2647405 3375674 3707676 3455621 3736085 4169799 4442340 4614171 4949663 5080109
18680 5080109 4920362 4492562 4707186 4822356 3869887 3584771 3532652 3231720 3433322 3570516
18670 3570516 3108242 3454828 3354045 3081965 3096098 3396682 3574883 3824598 4544526 5173246
18660 5173246 5431657 5410767 6004800 6766647 7405507 8075576 8633244 9577928 10401000 11477506
18650 11477506 12850638 14117788 15723394 17568399 19784145 22204354 25174961 28806808
18642 28806808 33205162 38204390 44754229 52792814 63653665 78541078 98554304 124239188
18634 124239188 153885288 180337216 202011346 220196186 229308197 222176278 208191147
18627 208191147 194749358 184637807 182223756 187636429 190081602 178640184 155402020
18620 155402020 126847352 100139797 80703647 67453744 58793011 52646428 47899046
18613 47899046 44187108 40800701 38144123 35669740 33435779 31467147 29448600 27320518
18605 27320518 25517171 22913486 19985009 18403292 16945137 15683233 14475869 13202442
18597 13202442 12336289 11604300 10811539 9837697 8935413 8102264 7402352 7107450 6594992
18588 6594992 6357673 6154062 6229354 5831112 5323641 4626497 4588423 4856705 4936535 4671203
18578 4671203 4292099 4390271 4490866 4137679 3535757 3274647 3448675 3386715 3842016 3974279
18568 3974279 4013280 3873693 3433295 2461479 1607479 1075997 697519 1278689 1491955 1200231
18558 1200231 1178763 839128 870485 784265 981617 1352718 1791081 1496827 1075737 1000994
18548 1000994 1067892 1017141 1060748 1153921 1212563 1081171 678152 356858 485810 703535
18538 703535 681981 528637 901322 842187 133931 -23008 -2655 2707 -149925 63816
18528 63816 134111 330424 594107 262052 197389 -178696 -439036 -27170 112143 213808
18518 213808 252926 399373 772285 553662 489499 327612 367129 354729 367872 471841
18508 471841 300843 324763 406822 437800 71435 45481 371436 261521 -86203 206766
18498 206766 558956 257691 -86218 -77455 -405883 -400441 -161254 109319 587120 512325
18488 512325 119021 -151278 -373149 -395086 -416360 -339533 -230587 -26734 -227204 -502311
18478 -502311 -430927 98527 754768 418839 -66675 149096 27032 -313217 -612149 -540794
18468 -540794 -537760 -520002 -666914 -608250 -172878 202300 -160724 -216419 -31764 -124760 -194220
18457 -194220 -140221 -3168 -155121 -157681 -350671 -549935 -303925 245165 532599 79561
18447 79561 -77062 -107722 78719 136847 362682 459214 386004 154916 164213 126546 -20791
18436 -20791 299883 80657 -110322 -192249 -330810 -282109 -38392 128243 66756 418065
18426 418065 862643 869307 836718 484911 135538 -95991 -384729 -683916 -458987 159688
18416 159688 377175 145708 -105442 238871 487330 127084 32645 -129294 -180592 265643
18406 265643 554960 204500 -498607 -215007 21178 64574 241258 615174 523581 509316
18396 509316 592967 82541 259356 88478 -290829 -48429 246893 169727 114700 -106723
18386 -106723 -265852 -108273 -255081 -212462 -574494 -727569 -479198 -312 -30516 -261273
18376 -261273 -383058 -19039 620407 413841 270947 265333 56909 352146 482730 384522
18366 384522 -80466 -217441 -251357 -397237 -85305 -73158 105012 88820 380454 346401
18356 346401 437315 694602 586630 290546 339917 624584 643967 406034 82971 179744
18346 179744 345332 688784 245463 -144071 21210 135375 109119 169608 -14372 248849
18336 248849 173676 -130253 68356 272661 236021 537587 676066 690906 489894 267403
18326 267403 299413 425953 297376 -200621 119873 123771 123187 -53220 -286642 -75040 -54427
18315 -54427 97523 170105 200312 151303 -248162 -627364 -802848 -693680 -416562 -419683 -239008
18304 -239008 146632 503452 316658 89774 -260383 136897 297245 -56615 -98509 -254175
18294 -254175 165645 125098 75134 238366 385436 497411 184648 677102 827165 525030
18284 525030 120924 308905 611754 239088 -334863 -373169 128433 -251533 -694556 -704620
18274 -704620 -402704 -127156 103089 447651 285503 278297 147285 -133644 341800 335642
18264 335642 351394 586594 224579 168203 289456 551039 1153343 1051249 1135638 1094965
18254 1094965 682858 560526 625350 699186 477241 330939 419407 352969 811516 763471
18244 763471 761741 842783 955919 833177 660693 630725 545588 669881 427297 358079 462901
18233 462901 434297 378083 692714 1089974 1130555 1376741 1037525 578089 553370 629110
18223 629110 845716 575261 561331 824251 839806 1150862 1372812 1801482 1423861 749641
18213 749641 417051 610149 500085 948891 1289644 1164609 636499 203919 -25571 -42489
18203 -42489 199101 911979 1064400 808764 759145 528376 546099 808265 781243 1432393
18193 1432393 1664451 1229983 971370 874300 1244712 1222893 1017472 1118489 1598556 1267885
18183 1267885 969686 1069748 1442327 1036166 983222 1210210 1140878 1155860 916650 951702
18173 951702 978847 1338566 1230227 843127 528446 670824 774031 1068068 1131658 1028791
18163 1028791 1264433 1458610 1733657 1940901 1956245 1728955 1652678 1465834 1305842 1544532
18153 1544532 1472819 1164755 1515594 1591360 1247882 1853045 2376625 2821049 3386764 3572876
18143 3572876 3582500 3309189 3717638 4460211 4477416 4422285 4877433 5348351 5863791 6456074
18133 6456074 7214308 7875625 8652266 9206017 9883315 11195259 12447895 13705374 14943306
18124 14943306 16114110 17637090 19815027 21921455 24901735 29073919 33257696 38004547
18116 38004547 43357389 50485107 58635370 67737020 79620833 95751563 118890753 155281779
18108 155281779 211520358 289734401 382963811 494277627 579187512 514354291 366960235
18101 366960235 248889564 177203116 135764624 109845904 91697664 78397026 67608546
18094 67608546 60092943 55336190 51924588 49414141 47611931 46536237 45549479 44671527
18086 44671527 42499087 39020352 35126572 31244482 27662928 24656439 22278095 20258068
18078 20258068 18422370 16672158 15074948 13947510 12776907 11460651 10297300 9641458
18070 9641458 9004848 8115910 7447856 6986548 6894197 6658466 6137427 5563649 5226818 4920606
18060 4920606 4688970 4544393 4203035 4153907 3943620 3319678 2635273 2247649 2230345 1835653
18050 1835653 1655542 1689026 1423035 868605 984747 919768 339982 210345 575897 1107002
18040 1107002 936333 1056242 953611 466244 393116 738438 1447931 1876702 1742119 1299004
18030 1299004 1353528 1178044 565007 492586 701397 1020234 1184983 1222745 1081145 884120
18020 884120 804028 809183 442713 283214 546890 1056057 1032322 1363547 1250830 852010
18010 852010 885131 923847 582057 447635 264351 467428 771778 1164227 1012351 831804
18000 831804 711804 415243 114759 -87234 -209845 -432133 -531906 -641502 -400242 -377822
17990 -377822 -806154 -452600 456212 766292 536136 207410 183975 628921 814886 892304
17980 892304 953399 653464 131283 11440 424573 292246 167201 339632 336601 301001
17970 301001 510101 471357 -128521 -276976 165902 161176 176575 351233 177472 280026
17960 280026 185930 127905 -45828 -200398 -211307 -118815 200281 136744 330926 202617
17950 202617 -94796 -54442 345105 232892 -148601 -268927 -205955 34230 76180 10202
17940 10202 -2488 -196580 -246896 -239325 -270330 -447106 -530356 -252731 64325 245237 323833
17929 323833 448257 509841 384512 17461 -501601 -725788 -728444 -774978 -869963 -651911
17919 -651911 -141490 -333615 -414998 -434430 -210359 -40490 33490 -150441 -155454 82042
17909 82042 -286564 -193648 135624 221302 1663 156558 678940 548555 -281669 -384344
17899 -384344 -408325 -319098 -193822 -513616 -243650 -151474 -36844 51457 -397030 -869713
17889 -869713 -398283 -489057 -770505 -598142 41039 225119 -132392 -508753 -303482 -70041
17879 -70041 -219934 27115 348681 254217 115106 174812 97228 -15293 -7186 358070 172279
17868 172279 150228 69992 246870 622696 499242 35196 -169085 -345202 -398574 -497452
17858 -497452 -327266 123071 51197 -217333 206721 163066 58383 194533 44509 219913
17848 219913 418426 -46767 -189362 33292 84016 33760 187454 421718 592174 358425
17838 358425 146967 -23490 -259666 -59890 -374180 -782883 -575864 -366275 -471133 -935057
17828 -935057 -1105108 -847495 -640332 -703217 -689550 -454128 -193192 -344349 110617 483418
17818 483418 488937 236841 476065 -28711 -498723 -403229 -288312 -305508 22248 403441
17808 403441 990361 828035 810915 633238 761431 489471 775300 776352 640915 504834
17798 504834 402381 233105 51268 -78189 41785 31083 467154 357610 -216263 -242867
17788 -242867 -203364 -105681 61747 355164 182472 184525 -331540 -307235 -371678 44528 234960
17777 234960 211 -332226 -681940 -649117 -563690 -271754 -142786 282675 268558 164343
17767 164343 557077 527407 165899 -66034 -293434 -326056 89278 732452 790035 373278
17757 373278 192655 11359 249137 154550 146104 135193 -172090 89157 408663 90867
17747 90867 -418051 -645427 -441778 -271441 -293220 155588 59910 -72246 -69620 44485
17737 44485 22299 -93405 45332 278604 350899 37518 -163386 -481583 -416087 -229488
17727 -229488 -133002 -138902 234454 227004 58924 26388 279556 344416 520363 266397 155369
17716 155369 361094 340687 565869 629551 785479 898193 559803 230505 -76669 -320403
17706 -320403 -150217 -47676 41667 111465 424149 805455 918652 733262 325633 204296
17696 204296 407167 617837 566508 334473 -306184 -613146 -336011 -91874 -289552 -379584
17686 -379584 -495896 -578121 -677101 -687424 -716291 -291742 203951 268676 -220469 -85815
17676 -85815 63208 -85320 -321414 -683947 -868784 -876763 -705067 -138022 293343 321667
17666 321667 340269 246428 59341 -19883 -265046 -6520 26590 -105870 131075 7465
17656 7465 410787 450534 115034 -221404 42571 178906 34170 -94685 -215599 -45333
17646 -45333 300238 343647 308149 535008 371648 -120724 -533199 -387493 -253562 -161150
17636 -161150 104552 -51694 -113366 -318316 -269316 78959 416846 328218 493285 648791
17626 648791 722168 740980 317058 199620 72611 247273 250399 345359 75962 -109778
17616 -109778 52942 -157592 -13366 6500 154320 -78087 241944 657851 616017 624029
17606 624029 325835 184661 180642 169699 347145 416426 272496 212661 163757 278438 331158
17595 331158 313185 37078 48564 252926 282067 294350 432307 431184 326201 278064 370614
17584 370614 604691 446441 197908 56551 139276 20937 -379 -39410 -139269 -197198
17574 -197198 -506143 -543061 -608973 -403967 -28972 94021 -49097 -309750 102407 300363
17564 300363 468908 438206 500818 133798 -317608 79498 937560 1018160 886383 772905
17554 772905 522862 272044 184949 409396 -71418 -370985 -393990 -585253 -464343 -110017
17544 -110017 461137 349245 355393 441249 655432 449420 689544 459729 299518 451840
17534 451840 435683 364944 358844 229309 473422 678195 770568 508079 132595 394757
17524 394757 691193 697599 899071 662067 583327 594436 865253 805303 1047197 1237570
17514 1237570 1133850 1410364 1727170 1989777 1879227 1852199 1833316 1625083 1395030 1626098
17504 1626098 1728809 1828539 1559233 1560296 1677703 2375290 2514806 2465859 2291666 2416393
17494 2416393 2709411 3313385 4124006 4409110 4548363 4797436 5158968 5506982 6286534
17485 6286534 7382666 8681667 9671936 10554169 11808829 13261612 15367904 17769483
17477 17769483 21616927 26695048 33857816 43067347 55223071 68771249 80020187 86054811
17469 86054811 88435941 87352062 82392353 73639618 62287619 51977854 45926623 44350789
17461 44350789 46577747 51971264 60420347 71973057 83006937 88497679 89567011 88305010
17453 88305010 83384233 74160993 61812630 48281166 37917068 30842635 26140717 22852890
17445 22852890 20420112 18780171 17078510 16068186 15574166 15442401 15403692 15645712 14734086
17436 14734086 13037411 11856769 10445642 8994043 8096002 7071094 5841362 5030698
17428 5030698 4598414 4231977 4133696 4091084 3845811 3740621 3516407 3216672 2579047 2211485
17418 2211485 2049230 2178684 2703445 2480123 2198306 2181454 2316067 1738360 1158299 1041832
17408 1041832 888108 872295 1061236 535546 305001 519464 394360 810507 908301 689277
17398 689277 99437 158712 -15677 425452 807601 655209 514031 265519 87220 164706
17388 164706 229271 -227410 -276459 41672 37228 -392711 -431598 -446172 -347060 -174865 -104046
17377 -104046 -281790 -457126 -554801 -750938 -597106 -268928 -59891 -323961 -686208 -872285
17367 -872285 -826128 -485394 -320698 -476267 -271544 10919 180468 443541 790758 636419
17357 636419 481887 95664 -123941 -276905 -352318 -369951 -602628 -227547 204514 235618
17347 235618 58914 -19711 -101666 -420259 -470321 -380637 -397244 -110655 -233680 -598610
17337 -598610 -457956 -981294 -1108992 -702615 -474860 -86101 280518 382846 677203 779113
17327 779113 707125 615155 251298 -330490 -272238 -105751 227494 218745 121486 -138592 -246547
17316 -246547 -553974 -536704 -571974 -554786 -277104 313722 960590 674448 -92589 99957
17306 99957 350912 396000 95589 182281 325974 63776 104022 139194 33270 245165
17296 245165 643293 645157 199024 -295721 -559446 -773175 -494093 -695445 -1045830 -755907
17286 -755907 -24359 -47035 -236742 231793 431489 253534 104138 365364 725601 623687
17276 623687 352165 19300 59777 378286 524144 250513 -208409 -365917 -329296 -294742
17266 -294742 51196 236718 185446 371064 472349 221191 190650 -17455 4603 -119118
17256 -119118 294875 585684 671278 839560 513219 128329 -156054 -98555 -169565 -447464
17246 -447464 -47962 182583 774087 969552 1093780 1012902 1004436 513745 223677 -320687
17236 -320687 -711268 -498632 -187245 -365769 -609368 -338740 256787 173925 308875 486560
17226 486560 390468 485734 559818 452942 383475 -89512 -56923 83365 410503 392634 443412
17215 443412 4763 -322390 -532866 -676916 -516823 -465014 -262885 -44351 131156 7671
17205 7671 -220027 -291550 -600504 -753574 -482159 6518 27388 139935 438130 243604
17195 243604 267966 110063 -214598 -568264 -549109 -249002 98625 422788 527810 -68497
17185 -68497 -220788 -229936 -306746 -487604 -509082 -104270 70336 35022 211205 356040 431920
17174 431920 -97569 -209256 -492975 -441900 26928 -293383 -633487 -348626 -191827 207708
17164 207708 737281 652710 313623 -166710 -769099 -676565 -509024 -393161 -623812 -743320
17154 -743320 -260860 -448580 -759633 -520430 -467932 -659386 -508500 -361181 -435001 -353119
17144 -353119 -144971 -113093 -56836 -134803 -137315 -12377 361464 99855 268358 332850 293407
17133 293407 288839 127618 -153372 -257436 -69735 48527 99075 37885 177698 183394 85604
17122 85604 -84609 -291835 74911 91826 16157 -56292 -261901 -468361 -203724 219342
17112 219342 232749 268 201023 242253 44676 217503 264324 210107 279201 83764
17102 83764 49098 106003 29837 -105532 364809 641538 240712 -221851 -375486 -776456
17092 -776456 -738907 -648447 -312516 127655 110695 140173 348865 692615 135068 -225172
17082 -225172 -19853 -199439 -5080 -135369 -247815 -246094 275944 638349 198018 60330
17072 60330 -88137 -244807 -350517 -312957 -148017 27509 240948 561811 741679 769937
17062 769937 215172 -46317 58650 223469 254897 -40252 179741 418001 591901 283580
17052 283580 712251 1027397 926276 615814 225123 -438235 -674285 -858834 -757350 -559292
17042 -559292 193100 514756 189863 -376507 -189009 -202512 -291180 -119959 -20509 94020
17032 94020 146907 675639 600405 237115 134632 53745 -268832 -705844 -998389 -1115702
17022 -1115702 -722497 -223883 347908 480769 252270 118474 -187142 -150779 36860 27655
17012 27655 -380987 -806683 -694040 -423666 -179899 -219945 -279380 -646789 -265875 -137305
17002 -137305 -538447 -759373 -813471 -701657 -248354 -205480 -177141 559102 758625 591435
16992 591435 117652 -7838 -229006 -243754 -121507 660193 710749 82270 -68577 -221614
16982 -221614 -437033 -276402 134143 29416 -337934 -395804 -689204 -411613 -374344 -304157
16972 -304157 212590 223285 186723 -248972 7898 58619 68067 150477 -210227 -427647 -363362
16961 -363362 -59552 -246339 -677217 -1112366 -1247538 -989093 -667928 -434102 -691932 -663014
16951 -663014 14065 370936 352065 266580 399538 380377 -207586 -779450 -790202 -420712
16941 -420712 -492872 -457526 -500502 -365500 -349704 -187373 -59362 237657 -5814 -2346 404266
16930 404266 415828 677813 552901 541730 503302 220995 312900 104843 -283334 -286495 -371179
16919 -371179 -28655 69845 5534 66266 234150 311898 237506 874019 673369 104578
16909 104578 -1415 143948 -48999 -435417 -871191 -531311 -394423 -221558 227779 420632
16899 420632 278214 169015 123092 234654 703633 803902 155742 -115440 -128210 -295793
16889 -295793 -538795 -363539 -57412 182664 89568 236705 229236 193071 63367 -142226
16879 -142226 -198829 136324 362615 456819 519733 66667 -455760 -353707 40305 621253
16869 621253 382897 -51188 -19776 -97631 -366747 -534400 -765627 -502277 -398619 -383926
16859 -383926 -258216 -71375 158500 100068 -68029 -364489 -282209 -31525 104460 -284167
16849 -284167 33861 -151526 -453162 -897939 -970504 -415546 -38766 -521784 -590446 -312269
16839 -312269 -124665 -13037 34265 434745 294933 74933 95564 -55464 159543 -142683
16829 -142683 -68587 -375507 -348721 -258120 -452231 -45635 -51760 -159753 37092 -318247
16819 -318247 -601490 -493029 -359468 -317173 -292631 213522 807731 708192 496899 520655
16809 520655 421417 515642 417989 -1033 -60076 352492 963645 847511 492169 118907
16799 118907 241532 468978 634490 399375 -264609 -385176 -452453 -174998 202278 -41879
16789 -41879 -26347 -270201 -659667 -849167 -381284 34038 13479 53353 -67163 130163
16779 130163 169852 -152506 -549045 -708003 -200609 -229791 -125559 91240 -604072 -646910
16769 -646910 -1017425 -916455 -144348 -58456 53142 -197072 -616166 -670176 -501983 -292157
16759 -292157 -119583 -425248 -564089 -590761 -661380 -482093 -540473 -528212 -246661 -64481
16749 -64481 -34185 -45651 -131529 -226301 -867105 -1020870 -679297 -894066 -632282 -266072
16739 -266072 -333333 -425426 -786252 -807098 -433581 -244657 57801 -16203 -557416 -838537
16729 -838537 -809641 -324274 -108149 111696 403482 582682 479545 997 -22804 -68941
16719 -68941 80046 -218606 -537301 -1105107 -734214 51631 -11215 -172751 -197192 -470458
16709 -470458 -604903 -360678 -444034 -47849 308769 509153 398076 263539 -84606 -188845
16699 -188845 -506282 -521278 -152971 -58190 -437570 -178513 -285892 -451486 -554390 -536962
16689 -536962 -309942 -144608 64082 281129 263707 -57065 -322501 -797533 -654112 -374325
16679 -374325 -233070 -554952 -379790 2340 168890 384073 469351 253858 84425 251294
16669 251294 143699 21025 -219216 -230004 38593 371486 471326 291506 486938 992058
16659 992058 717496 412159 222575 331081 269002 637442 725667 701432 459362 317032
16649 317032 218291 -53200 893 197897 31401 -75772 -72572 -73000 -104062 83927 188828
16638 188828 377090 -113462 -464853 -273702 220598 529323 273224 202368 66775 -380217
16628 -380217 -560265 -482805 -237179 -47416 58837 117879 -98551 118962 255644 180529
16618 180529 329437 675775 485640 178993 128364 -112508 -27177 194042 77235 -77548
16608 -77548 -105738 -11965 -138444 -245774 -238304 18367 201339 788180 690776 360471 305747
16597 305747 552469 269738 -122084 -153601 5868 -366075 -465431 -397469 -540959 -423531
16587 -423531 89369 156684 115843 -301622 -422996 -62530 411665 682881 430212 149314
16577 149314 221639 401602 544471 212491 -134637 -243599 -246143 -590105 -147175 85917
16567 85917 32237 238946 -98755 -388360 -509466 -492141 -702567 -517103 -356763 -540788
16557 -540788 229774 693598 352269 150996 6810 -367246 -622302 -498837 -300212 -110529
16547 -110529 210812 205793 -196769 -682000 -725396 -750399 -778362 -1000484 -892272 -717661
16537 -717661 -573085 -497224 -72339 -22971 -126157 -256244 -222568 -145395 -8732 307233
16527 307233 -126736 -357651 -118209 -159906 -17701 218993 320673 33913 -176959 188474
16517 188474 152643 -97598 -173815 231882 476911 573451 394883 268129 -694439 -1060306
16507 -1060306 -454830 -192678 -226286 12465 -398227 -790775 -394300 -499429 -757193 -1122990
16497 -1122990 -643463 -464439 -271476 -331808 -224452 -258105 -566865 -452862 -303576 -173305
16487 -173305 131853 316379 204863 -334328 -935058 -1003222 -372236 -229850 -363670 69691
16477 69691 4307 -83472 -127175 111040 309700 455112 350732 165580 -60618 171572
16467 171572 -118129 -328702 -335702 -71556 -62375 -66420 -235826 -435569 -575368 -307952 131587
16456 131587 249764 424555 190345 35274 342749 744788 538169 599571 472959 585666
16446 585666 487511 394298 781397 567429 254151 -150151 -112858 -35832 75422 119117
16436 119117 -11535 104188 -117250 -174587 -602592 -257749 -227044 50110 152064 76737
16426 76737 148239 168026 279729 16687 -237311 -10390 -40257 -183132 -376184 -550943
16416 -550943 -132111 247362 428877 374452 428622 331204 155929 12708 49763 -45463
16406 -45463 -259757 -217899 -55030 365887 465312 154320 348862 351496 144233 145262 250017
16395 250017 319303 407686 638203 800087 886577 729968 332072 128082 46278 -137348
16385 -137348 -105806 -187577 -693442 -958488 -834296 -454091 -15199 50167 157506 218895
16375 218895 221415 21541 -194950 153629 325169 400245 721103 619095 316877 132687
16365 132687 50519 31792 -371649 -216537 -215455 -146770 -261860 -198670 -133053 -6879 564144
16354 564144 646816 272516 -369199 -48199 228470 94221 304934 677192 430014 368152
16344 368152 247293 277478 115381 98338 268573 170522 205034 360836 569294 387950
16334 387950 148732 -301291 -547894 4509 142821 332623 289929 -317604 -389788 -414316
16324 -414316 -297935 53865 407129 768028 803429 584094 551349 232937 63035 -105366
16314 -105366 -37188 -168764 -532341 -940465 -821170 -935329 -758211 -714232 -354019 -365749
16304 -365749 -440009 9126 446160 337953 -237510 -216078 32457 15826 35142 58624
16294 58624 -52742 22393 -126041 -23223 62313 -179752 -92051 42126 -162746 -604210
16284 -604210 -535280 -510496 -570080 -446409 -529014 -739817 -530132 -179021 202251 458578
16274 458578 298464 329621 350843 430696 233676 -21832 -7814 177529 164326 73857 393324
16263 393324 692386 869348 1130687 1229654 851095 784912 668415 551648 275547 123152
16253 123152 -35825 160885 -126337 163289 423405 408630 169623 -283125 -196116 170914
16243 170914 272842 244247 25559 253437 -25697 -123725 91023 -220639 40974 -89177
16233 -89177 -24009 -17088 118216 220306 199117 429505 641296 846049 633009 309954
16223 309954 -140790 -357677 181912 439472 461171 124657 -417898 -306494 -39978 -64594
16213 -64594 -202165 44100 288193 129034 -211592 -381128 -655944 -22743 -21919 -208247
16203 -208247 -306226 46971 -14839 -372359 -808562 -237719 -26170 43135 -26574 -75582
16193 -75582 -102488 -100772 -246749 -65380 165308 77449 96171 239607 429994 285392 329425
16182 329425 -93741 -573430 -188345 -85374 394335 844607 715851 624763 759716 556677
16172 556677 -183170 -412232 -840297 -344865 176625 -402276 -830307 -733210 -195537 401198
16162 401198 738260 354176 -38020 -324200 124709 698155 766440 612629 429129 215618
16152 215618 330028 465674 890011 942914 629594 269326 60280 44621 124153 136201
16142 136201 131939 92860 -81032 563522 465582 291306 268234 390407 267408 358762 334008
16131 334008 130415 182694 290078 398551 158518 175484 286709 41714 -187902 -572461
16121 -572461 -503096 -95379 53829 257578 365271 410159 149638 336462 587124 419620
16111 419620 -45260 -405410 -312875 -127759 -124217 -20228 -43811 -443001 -496149 -575837 -449037
16100 -449037 -180425 -163153 -194377 -95095 -21785 115124 53562 -55074 -253619 144902
16090 144902 524431 371351 309130 44766 241238 86115 -186664 -206130 -44799 -12538
16080 -12538 -244617 -418045 -662796 -722166 -544111 -196500 148099 392207 410336 351506
16070 351506 -81290 -97646 86393 21556 -138230 -182146 -338015 -595389 -808355 -594822
16060 -594822 3956 -110142 -158268 389584 375704 154471 -50016 -285254 -176254 -126039
16050 -126039 3055 284574 232032 277108 103980 394151 691796 519288 236333 471502
16040 471502 616549 229944 22446 -44749 43725 205312 345972 304838 31598 -100910
16030 -100910 -7757 200666 -196369 -683850 -966534 -761556 -524750 -327573 73967 323855
16020 323855 642886 660088 114317 -408386 -547621 -482563 -215703 249787 327564 375951
16010 375951 213158 11815 -270727 -86804 97168 327540 345406 176172 72152 -309631
16000 -309631 -518757 -208114 -404856 -742854 -738212 -726024 -688056 -722732 -571463 155175
15990 155175 104238 -83073 6414 -171385 132492 687675 1022121 809288 698896 1076555
15980 1076555 938973 951793 287029 -132843 -560830 -443160 -42701 -247436 -87735 -23295
15970 -23295 92459 294545 113560 28782 257963 33429 51427 356935 649514 501035
15960 501035 104907 -308764 -505068 -314014 -127067 -335333 -567964 -338971 -18642 -308492
15950 -308492 -668730 -709528 -814020 -812421 -600700 -350908 -549521 -858100 -821042 -890479
15940 -890479 -748671 -567714 -637310 -467529 -291507 -159515 -65616 -254373 -100957 -24624
15930 -24624 24178 -34046 -467094 -785433 -616045 -490902 266046 319114 158442 121439
15920 121439 -173863 -367256 -217203 -170175 255263 467800 986915 716083 199198 -119898
15910 -119898 -353755 -262486 -113546 37783 -2844 -34527 -91948 -312970 -136993 -270542
15900 -270542 -603330 -425202 -138404 -36511 -433243 -286515 -95847 -336384 -510759 -322890
15890 -322890 -688816 -949983 -808138 -749172 -362702 94993 81850 81916 -458237 -489398 -587274
15879 -587274 -775913 -756949 -760079 -509998 -151892 -175091 -81697 -150414 -413080 -509490 -240378
15868 -240378 63838 692486 340949 -194125 -177535 208773 319540 192310 128769 -6097
15858 -6097 391824 545778 -98343 -310777 358986 168593 135056 -176306 -441421 15814
15848 15814 150762 338792 313906 432455 411534 290361 363995 135948 -169476 -453163
15838 -453163 -335399 91474 -198768 8422 342890 -38700 -567590 -201495 4527 84688
15828 84688 251052 311596 -274437 -118803 -206749 -288455 492782 418683 16170 200001
15818 200001 329027 90781 -109192 -10707 321285 234553 43967 270998 64201 -409009
15808 -409009 -268122 -522133 -310776 88029 165938 140158 -132711 18652 71182 103694
15798 103694 152773 286322 564685 269700 76185 -156604 -256979 -343945 -305884 -52996
15788 -52996 227322 76852 155978 -25847 143971 107582 139460 -48492 -164097 -252008
15778 -252008 115403 294672 21564 -438745 -592987 -769258 -761335 -537416 218574 512470
15768 512470 -70820 -81780 -15020 98297 131026 449345 600215 691177 618694 -36042
15758 -36042 -491972 -731884 -382933 -136152 -227011 -446727 -565774 -229500 129801 297353
15748 297353 -70587 -593176 -625510 -527023 -504613 -427965 -377313 -397848 -451596 -357369 -193387
15737 -193387 -363720 -113252 -132246 -104609 63069 297057 148539 32970 -141067 -34536
15727 -34536 163916 355895 142546 229040 352766 104510 -521515 -630665 -386182 -619547
15717 -619547 -695477 -574887 -221251 -62044 78798 166044 241371 214198 170155 327064
15707 327064 279617 -119336 -372287 -417650 -372832 -15241 45932 139398 197348 -144779 -176315
15696 -176315 -79402 -217402 -466273 -901556 -715878 -420817 -42981 -229227 -454930 -264423
15686 -264423 -290856 -246472 176938 110885 49962 -91762 -259021 -629047 -986195 -534810
15676 -534810 -259652 266925 -302252 -409882 -68129 -44489 -107720 -280719 -307311 -61256
15666 -61256 -431158 -508343 -347162 -271119 -200568 226238 6383 -411599 -334029 -209395
15656 -209395 -473377 1111 340657 277145 656260 638006 202738 -158369 -164723 -648375
15646 -648375 -628898 -137019 -29975 -121986 -325215 -714512 -549473 -355674 -168067 83361
15636 83361 254389 259373 270925 60411 -24699 -9829 99220 105480 218089 -217067 -32178
15625 -32178 -111979 235023 366153 512158 740028 174367 -560702 -899081 -695955 -476440
15615 -476440 125677 475124 414778 554836 575306 394049 217181 334702 572302 335089
15605 335089 87087 206044 329673 119027 -123669 -39434 -70564 -78292 -69997 -474387 -426379
15594 -426379 127158 -324291 -770083 -1077781 -903836 -883452 -787212 -451052 -237991 -268788
15584 -268788 -43866 337164 453155 235850 -27487 -66058 318782 138611 -74270 131947
15574 131947 263779 336841 419088 308757 -145705 -372555 -265881 30439 -216610 -627454
15564 -627454 -632058 -789926 -662898 -295941 -21458 107643 3439 -119807 -199403 52225
15554 52225 171676 105079 105194 174896 117989 484541 576596 323442 562380 222236 187356
15543 187356 205501 112208 244690 103645 -98185 -90626 -277237 -310555 -163352 -336453
15533 -336453 9685 434379 434801 330332 182836 -275308 -53870 46070 -54757 -87468
15523 -87468 36571 -348131 -789209 -684840 -503519 -587088 -625232 -746606 -915447 -457769
15513 -457769 213101 128982 78282 161965 -310556 -404396 -74321 298314 359191 68310
15503 68310 -297381 -15157 409279 513998 698971 814457 317169 -73208 -402401 -280360
15493 -280360 100411 103392 -83907 211084 -74021 -120882 163562 276254 162768 157684
15483 157684 134893 -244883 -148527 218107 182143 -353133 -669850 -323995 52760 242934
15473 242934 250472 273014 107994 -235980 -124569 -282720 -117322 -259277 -167445 -382901
15463 -382901 -265685 -112725 209214 348159 344715 311068 -49068 30543 58701 263077
15453 263077 413928 18706 -369315 -405358 -123125 -139413 -335713 -108802 117900 310304
15443 310304 166298 -281412 -218041 60052 128576 -128091 -69712 -275810 -596656 -375168
15433 -375168 -64910 -50082 -404149 -750296 -613969 -910673 -568869 -329216 -629318 -297327
15423 -297327 355140 396749 295998 -91114 -106607 -154724 -41906 -192923 -397814 -360071
15413 -360071 -406661 -376140 -261219 112990 382339 400249 -162165 -443772 -613474 -727096
15403 -727096 -468085 -320385 -392807 17253 -147415 -310041 -40572 199695 293307 258901
15393 258901 184668 105479 101830 -164268 32778 305730 117402 -248321 -345958 -404868 -266230
15382 -266230 -141057 -390077 -558789 -561250 -180522 -123970 7861 -125034 -242838 -603450
15372 -603450 -1030367 -886935 -285626 -79400 -224711 -296196 3556 -178050 -165515 -646314
15362 -646314 -891550 -923125 -765333 -144573 -41088 174680 -241756 -358367 -370476 -97393
15352 -97393 192075 -14194 -10349 -17884 188936 531180 297241 163122 590063 299443
15342 299443 132610 342518 315363 238205 468454 187383 81574 45923 -184765 -359120
15332 -359120 -431468 -742361 -441648 -168121 -162414 -232740 -286323 -392888 -329184 -33791 342020
15321 342020 572303 501622 293310 139011 233431 37633 -247194 -194821 -29539 373263
15311 373263 103426 -373044 -517772 -518929 -642078 -406746 50568 102743 -153394 -185166
15301 -185166 117172 209964 -234565 -492182 -226911 -450300 -244655 -11156 -185127 -157559
15291 -157559 -20668 -71523 -159890 90323 62802 -81453 -7405 121881 377548 -43658
15281 -43658 -87643 246706 85291 -149063 -169904 -592626 -543582 -77097 292271 113768
15271 113768 -44806 -24290 2069 302198 100194 -19563 10596 -327417 -419242 -97841
15261 -97841 -113507 -208239 -31150 514563 630900 273364 23321 327310 546803 115281
15251 115281 -260725 -450054 -702806 -260018 127474 137778 256275 92785 153370 107754
15241 107754 -129581 -137640 -249086 -283153 -567640 -94469 431548 109560 -150404 11503
15231 11503 -76163 39569 -121935 -111226 -340718 -253818 -54055 -463166 -516631 14432
15221 14432 -64062 -39021 442257 500804 58031 -184531 -947955 -1006470 -293556 163474
15211 163474 -9475 -506037 -570669 -202134 -99254 44808 43475 113359 131153 478982
15201 478982 440792 179368 28824 -66091 -117209 -330543 -316521 -127249 -318357 128740
15191 128740 329699 -56704 -555162 -527482 -458185 -519641 -388724 -242785 -415173 -20363
15181 -20363 148938 -42423 143117 79973 271294 427178 312963 13298 -19119 -206095
15171 -206095 -121704 -202300 -489300 -819033 -752550 -345022 146649 303761 36704 9832
15161 9832 123485 -104486 -115999 160781 242700 46761 -172761 -447333 -554645 -394028
15151 -394028 -427518 -667412 -628074 -953349 -703320 -277161 -138491 -209618 51853 -424285
15141 -424285 -1107588 -887831 -674606 -544211 -259577 -329670 -348395 -83391 -92639 -384480
15131 -384480 -235610 302986 -69685 -19127 481678 392795 -58450 -303093 -512989 -498412
15121 -498412 -318064 -165736 -175228 -348437 -151001 236587 308540 -65212 -183729 -324393
15111 -324393 -372350 -415836 -146231 -128410 -142974 -329614 -738499 -604503 -308953 -471772
15101 -471772 -541656 -275965 161492 313629 34151 -41478 -378235 -622138 -484477 -510855
15091 -510855 -270728 -397697 -569586 -188519 459740 217885 157948 485008 535399 435192
15081 435192 376045 -21861 -303908 -369407 -429516 -554108 -386777 -391430 -64944 -267026
15071 -267026 -461754 -89817 273741 -59381 -328060 -182353 -126764 -483985 -518404 -598451
15061 -598451 -914206 -626782 -307555 -193181 89480 171020 -243745 -52881 176915 113111
15051 113111 172660 -102507 -814676 -668474 -745361 -239878 -369972 -502742 188820 136071
15041 136071 -165115 -636512 -980577 -569878 -485258 -659120 -594763 -93570 95990 242605
15031 242605 332487 176189 236701 95975 -24000 -219281 -345555 -67621 10329 184907
15021 184907 -202963 -576185 -181321 379357 355240 -31407 -422950 -590781 -259491 24909
15011 24909 -179428 -539416 -686304 -302206 54974 382353 652949 336928 -71761 -297318
15001 -297318 -422345 -238468 -609440 -857298 -645052 -527037 -184659 -4994 -230829 50231
14991 50231 300927 132318 -139739 -232794 -558457 -437280 -356006 -478862 -331586 -422164
14981 -422164 -60617 99762 38039 82523 -336 -212297 -301367 248572 38399 -10281
14971 -10281 -254161 8640 215345 87196 -66936 136770 -145259 -461400 -243265 -23288
14961 -23288 79795 -392644 -661727 -498160 -306342 -45160 6225 281663 467046 544445
14951 544445 504157 447226 -22363 -174400 -473443 -402720 -483227 -141347 -514758 -852190
14941 -852190 -502933 -461156 52941 200022 -332604 -264816 170242 -68210 -283862 -156759
14931 -156759 -112366 108130 369365 293103 199141 43376 138907 203660 117837 2859 -131586
14920 -131586 -502130 -572139 -455525 -435396 90611 123371 -44897 -75113 -19723 -86108 9288
14909 9288 -429104 -443259 -39225 -55331 -93532 105045 378577 606886 449391 316192
14899 316192 579921 711321 282525 -157133 -186755 -105187 -8831 -689901 -1027113 -465822
14889 -465822 -98897 82487 15018 -189150 -169596 -188687 -207484 -156639 -74386 24241 -11442
14878 -11442 -255780 -660318 -674445 -384706 -238641 5638 4865 276624 -47663 -56948 350651
14867 350651 549624 400406 322926 -57331 -755841 -821434 -338450 120398 360093 312186
14857 312186 487376 566529 419737 642184 541030 168759 -138723 -295625 -199008 68520
14847 68520 -169949 -324682 -540944 -575101 -336456 67430 38648 -111426 -158954 -388058
14837 -388058 -631852 -381722 -345978 159137 699179 595295 182517 -153971 -175976 -326178
14827 -326178 -429107 -330129 -210691 59903 135838 82113 -156640 -419113 -320208 -259885
14817 -259885 -84994 -102036 -450472 -687838 -401140 -25036 55735 62693 43976 -164664
14807 -164664 -199100 -342869 26248 378870 123462 -289894 9980 -38843 305763 352297
14797 352297 -107122 -198950 85243 -101882 -327028 -445561 -283386 -106830 15995 18488
14787 18488 268760 360475 159184 -149745 -326916 -308365 -124233 424553 419525 252124
14777 252124 240516 -40649 -397065 108915 373041 288602 191918 297068 393950 267549
14767 267549 699476 432938 -202126 285622 272635 -118692 15059 350011 328766 292383
14757 292383 193079 180273 284445 13524 -352365 -442077 -524548 -238469 -145615 -46674 95358
14746 95358 228796 389437 514591 608621 514570 505115 245598 -484208 -548609 -443368 -245598
14735 -245598 -6720 181434 189749 9042 210332 672947 693628 236492 374202 429663
14725 429663 375877 62629 235880 498549 645622 648655 859984 461210 316958 12179
14715 12179 -171331 12111 375258 277002 399222 500891 348307 140976 188942 104538
14705 104538 -88503 -362060 -350100 -194933 -172121 -139926 38275 -29388 -25775 50307 5696
14694 5696 36644 -526255 -603584 -173503 350090 382019 489103 291269 185798 236068 347091
14683 347091 206095 -392823 -493011 -448966 -350751 -460135 -343945 -41147 437498 740928
14673 740928 655939 362530 205661 180939 64006 -400993 -205669 79394 198417 202959
14663 202959 419064 498298 100567 -139877 -316729 -500064 -438365 -264624 98131 332007
14653 332007 194913 109132 -49661 -646099 -669856 -514578 -433693 -432632 -221198 -397732
14643 -397732 -155207 -295963 -461917 -491554 -513598 -509130 -198657 -285708 -233434 -292753 -313386
14632 -313386 -398191 -561040 -500216 198977 46739 -134145 18387 -248603 -259353 -309779
14622 -309779 -75120 -247099 -573599 -855312 -500782 73951 -51130 -134142 -139914 -22659
14612 -22659 86642 -136950 -108466 39266 325784 376683 325906 174258 -184421 -189116 382615
14601 382615 266024 19482 -218378 -604932 -644240 45295 407466 413852 278438 33503
14591 33503 142383 241212 219882 160634 -654603 -1109284 -793606 -607310 -764481 -723787
14581 -723787 -519951 174867 138131 -254728 -389942 -546823 -714489 -550291 144027 329649
14571 329649 213810 -212798 -644682 -534582 -264303 -172042 -414174 57585 -228297 -607142
14561 -607142 -502576 -244387 -298447 -292439 -183767 -83899 -527705 -875402 -599631 -670608
14551 -670608 -436158 -147085 -196460 -691498 -630959 -33041 -178038 -379522 -151477 361078
14541 361078 580476 92565 -117183 287403 777256 510910 540430 373462 95409 -25042
14531 -25042 292285 220901 360215 446739 669154 610232 341234 180907 296048 -60490
14521 -60490 -635049 -802968 -735723 -917028 -421083 -92796 216538 227813 58015 -7052
14511 -7052 -11824 214684 300320 727455 688167 529897 419053 514710 153628 -50049 -13693
14500 -13693 150554 605247 734573 310779 49208 218139 363275 506847 534221 82599
14490 82599 -4091 287473 476327 209763 -572999 -860969 -396889 76391 92635 357444
14480 357444 179680 334641 381125 557755 596422 380476 341559 441080 296157 354307
14470 354307 214439 228799 411578 657692 552028 613141 957097 1004213 534087 146712
14460 146712 -274490 -437070 -702854 -406506 11721 238251 300370 286215 126143 -41401
14450 -41401 -4433 90912 90494 178737 203398 124818 -112009 -40954 -137625 -41042 -178370 -229496
14438 -229496 -213907 64351 52293 -45706 -149797 -270966 -314368 -317143 -168491 -459564 -249848
14427 -249848 -291721 -307844 31915 127556 -139984 -262995 -315434 99159 401858 180885
14417 180885 125394 63907 20187 988 63672 -128178 -268695 -512489 -324502 195316
14407 195316 412761 309677 72425 208186 -21344 -497070 -530190 -387018 -480380 -502395
14397 -502395 -166882 5827 -71478 -38245 43664 152336 144035 224416 623392 492787 358764
14386 358764 37632 -216409 171392 631764 592493 -220097 -761495 -756145 -658737 -222847
14376 -222847 340496 487211 405466 470300 393419 365646 -256 -8 273264 670200 581514
14365 581514 363867 342565 77636 78252 564697 1092944 813384 523865 174607 283554
14355 283554 105089 -118581 -230894 44795 290801 123741 -203495 -286680 -433721 -273036
14345 -273036 141055 -108350 68117 65462 54844 -78931 -164697 116090 -8309 143553
14335 143553 -202571 -43775 -36196 81543 -311052 -490201 -235764 -165478 -18651 -356640
14325 -356640 -506824 -349426 -63961 78305 285037 304319 -183704 -367789 -404236 -242642
14315 -242642 -422776 -282489 -334724 46786 -103024 -177270 -245871 -497056 -338419 -545256
14305 -545256 -733174 -829944 -591131 -488931 -96840 -316454 -117599 -48489 -218201 -520141
14295 -520141 -586866 -277171 -181727 -224756 -81765 -84267 -709859 -666627 -657445 -643474 -117826
14284 -117826 218802 -346217 -318172 -87542 -219230 -520411 -449732 -256919 -570368 -859558
14274 -859558 -397324 337762 514301 -32724 -297767 -396669 -414490 -191516 -557345 -596953
14264 -596953 -193220 205785 139980 -15346 136662 91985 -413716 -731569 -588819 51936
14254 51936 445855 733788 476738 313539 222607 -52961 222083 310994 55469 95343
14244 95343 80010 174837 228748 297160 -47218 -231095 -299991 17051 322698 190255 -68880
14233 -68880 28463 -152226 -433860 -492472 -430298 -647534 -549085 -411386 -71895 58261
14223 58261 403769 477358 156530 -130798 -101884 362956 602008 399853 290898 259091
14213 259091 364925 448753 -76476 -199009 41118 422898 523680 146666 -235141 -161854
14203 -161854 13642 383632 348199 483566 491653 535068 537882 617465 713736 475843 51955
14192 51955 -34742 9753 68414 -142729 -372698 -574940 -357257 230840 710690 597400
14182 597400 320974 130958 5495 -237092 -167661 -150951 -618509 -428777 298631 147244
14172 147244 -233514 195670 350039 288398 71165 -5992 -64215 -134810 17837 -177119
14162 -177119 27647 507032 271899 98313 -325335 -523402 -558797 -855653 -273887 -170412
14152 -170412 -174793 407563 99986 85026 334972 -47192 135177 518555 459024 321451
14142 321451 34544 -240719 -540596 -608565 -646958 -165267 -487807 -808470 -546630 -204559
14132 -204559 -519824 -582045 -538064 -132955 -275333 -114119 -147393 -229341 -474537 -78586
14122 -78586 514622 229230 -111706 -425236 -482516 -327727 -39716 -201005 -500388 -726881
14112 -726881 -862791 -616891 -638038 -393320 -266869 -263446 -276648 -337419 -392437 -56675 -50404
14101 -50404 -425128 -432155 -404260 -433488 -626471 -652605 -306786 43420 209970 -198599 -360422
14090 -360422 -18186 67107 185069 327045 502859 207411 -261522 -783227 -346038 -72346
14080 -72346 -108755 -2661 -132386 4783 264048 335836 244666 108182 -48194 -261187
14070 -261187 -217892 -219263 -88770 -281035 -103139 -371719 -366198 -216768 -24283 162419
14060 162419 245988 189065 92391 -163486 -343798 -432737 -811381 -319039 -462655 -739003
14050 -739003 -1002639 -1041042 -739315 -346626 1647 -40827 -530400 -1144211 -1050477 -529076
14040 -529076 -731678 -176684 615748 690283 665667 419176 -83296 185579 386936 -9333
14030 -9333 24518 1620 -129452 -340972 -500259 -116532 395275 418611 630265 499259
14020 499259 211119 124632 49594 -27874 416527 907171 614386 556166 871465 924445
14010 924445 612663 520874 276933 -35232 29901 -127272 -170291 -222256 -179110 -96294 20971
13999 20971 468953 421296 462841 530092 507972 384416 493126 251697 98292 -259732
13989 -259732 -645747 -901624 -606915 -516170 -848702 -647341 -588404 -230015 156109 321223
13979 321223 -136034 -594657 -375853 -321844 -274909 -352326 -623985 -732642 -636883 -406411
13969 -406411 -475000 -619542 -340023 -228026 -138464 502820 1093535 895316 442404 477069
13959 477069 499762 380909 168656 119109 -257260 -360496 -26193 142225 182073 516658
13949 516658 117423 -94190 -75002 105396 256586 384756 -106385 -636240 -213769 271078
13939 271078 59741 -110872 -75307 -128122 196497 181531 136810 245921 -147594 -568052
13929 -568052 -403214 -240364 -171091 114018 79141 -342260 -90765 335749 408144 -161771
13919 -161771 -277410 -459205 -664906 -696930 -514159 -156605 188189 -58487 -647349 -462201
13909 -462201 -65677 118177 118841 232700 307636 -112967 -72739 237647 524631 398749
13899 398749 222748 321667 250407 248145 334087 228740 237046 296041 349244 396109 153995
13888 153995 -15112 198511 -146405 -371323 -394722 -135255 -108837 -382989 -529177 -262483
13878 -262483 -221608 -536760 -297241 -215226 -108835 51584 143818 -37055 -374889 -408682
13868 -408682 -12459 111453 568322 610446 145272 324988 208671 63997 -238060 -123356
13858 -123356 -362119 -370089 -401213 -360393 1662 141840 -62264 -647841 -415317 -165392
13848 -165392 -351523 -26282 384362 662085 768020 202831 61420 206211 413578 461529
13838 461529 226359 121379 -295523 222185 381319 430881 480701 327235 589044 741250
13828 741250 483105 265251 462351 679911 478198 640612 523039 486351 319799 64114
13818 64114 137464 220145 -20804 162476 -65375 -598656 -491544 18705 232816 216559
13808 216559 236439 -108867 -301304 -91286 123559 -50144 89221 -384358 -263530 163343
13798 163343 7818 35967 58197 -140443 -187545 -141414 -151791 -743170 -814485 -482921 -131593
13787 -131593 245062 786744 1141768 1160527 1318007 877260 745447 167421 295968 377044
13777 377044 229165 -81792 113629 321282 177270 85453 -197561 190544 583210 826100
13767 826100 1065649 954973 529245 572444 622105 629552 304937 -25646 -444325 -406877
13757 -406877 -66391 479613 690750 635488 430743 42523 -51801 25797 -260951 -117931
13747 -117931 2684 217397 7544 -352310 -589345 -638214 -663732 -330261 -131923 -84545
13737 -84545 20440 -235490 -172494 -50673 -5370 274790 633606 310223 178141 191454
13727 191454 113103 318594 500118 396663 68636 -142951 -55416 235830 -24300 -167044
13717 -167044 -2241 68797 -132300 288776 659719 717264 577782 197114 91783 1774
13707 1774 -88903 276271 80202 -52437 -420959 -263589 86852 -10628 -51899 6018 -161193
13696 -161193 -391257 -612641 -409886 -219871 379113 562372 -239219 -354271 199431 495291
13686 495291 386638 122940 -170539 -418522 -514290 -402536 -224235 -375474 -153298 -204348
13676 -204348 -688674 -313050 124860 -89283 72613 449325 183163 707680 822664 151035
13666 151035 -569686 -504660 -360036 -238073 -559577 -1009378 -577064 194780 773177 654816
13656 654816 531997 512046 18584 275382 266435 249757 208590 -110002 -718516 -442066
13646 -442066 -394792 -66990 511281 501834 287106 75098 249889 449275 576896 220418
13636 220418 -328715 -573272 -182258 186738 625645 652835 181443 -357598 -304092 -211221
13626 -211221 -445686 -158716 47436 -131465 -474665 -60538 -110829 -56267 -49877 174421
13616 174421 26735 -160691 -190894 -219501 44257 138109 -120489 81334 48120 -127727
13606 -127727 -171792 67690 -75797 -107303 65363 220634 340363 559383 557550 160512
13596 160512 204130 332225 623669 680596 701028 610921 587815 29070 -605338 -759074
13586 -759074 -630531 -560871 -496513 -740827 -490642 173565 168707 -37985 -155415 78515
13576 78515 -58891 100859 235256 234972 13890 -161874 -371707 -485287 -775742 -790960
13566 -790960 -664205 -516771 -196299 3614 -280127 -719659 -615026 -340332 -139979 69184
13556 69184 80754 -122675 176923 72401 -230581 -112895 -384537 -726137 -435949 -237490
13546 -237490 -155553 -81057 23017 418018 839880 748496 334047 170852 -122 -82826
13536 -82826 -96590 -365587 -292063 -160199 -50643 -101593 -366152 -342993 -548480 -248262
13526 -248262 23310 40192 -80689 -220831 -185331 -188911 499262 619163 86378 -378083
13516 -378083 214574 319680 273406 145483 326947 271481 -54399 -421932 -359263 -126801
13506 -126801 -52375 210769 250258 327236 183954 25876 97878 121616 -19549 -486615
13496 -486615 -637714 -266085 -150834 -97865 67075 -32587 -246018 -170244 -183529 -282773
13486 -282773 -405761 -42340 59547 140763 533206 572655 404390 374475 6384 -53186
13476 -53186 134886 285227 429290 553025 729868 490265 242529 206203 -178664 -66549
13466 -66549 16939 -133071 150290 318576 455286 722948 772370 237875 -1369 -29731
13456 -29731 -61876 119499 175483 335324 481060 127284 102757 511473 -4096 -228967
13446 -228967 3060 -35976 380191 665737 704529 623476 195672 218664 83490 121422
13436 121422 493207 220261 -182090 -291850 -662797 -669228 -480332 -373339 -152668 -14516
13426 -14516 -142808 -361845 -326422 -154745 -351853 -517157 -339220 -402497 -431282 -522661
13416 -522661 -820961 -343216 -52318 -216218 -719946 -588564 -349345 -293626 -162992 -124943
13406 -124943 -8223 306861 227534 -70979 -101918 51863 -61959 -582262 -630472 -191541
13396 -191541 -81075 -294061 -454270 -141887 -41016 -126640 -56277 -148411 -155051 -327024
13386 -327024 -579331 -790463 -687211 -287358 125855 46002 214785 414702 450919 135518
13376 135518 -188946 84188 531462 618848 834977 667738 433826 589543 378423 185163
13366 185163 154261 101705 -11625 -270017 -136952 202934 -192286 -71206 -17768 54044
13356 54044 -91816 -189036 -631321 -928159 -702292 -449860 -156399 -51189 -436548 -144626
13346 -144626 427220 631934 325781 321641 569166 557699 1022940 872746 522653 171473
13336 171473 -114525 305743 436537 472043 595159 512668 459408 431765 -5201 -185562
13326 -185562 -398689 -592734 -608971 82384 442820 215839 237173 433936 -84827 -16713
13316 -16713 277945 333616 4374 -324010 -792323 -536575 67784 -239578 -240322 210668
13306 210668 90143 -291139 -491209 -258163 30295 -166634 -418357 -401455 -101966 146304
13296 146304 24173 69044 174161 169679 115090 -53998 -117228 -162342 17158 -324755 -678783
13285 -678783 -54562 178461 333152 250765 -159972 -261877 18095 105157 585540 576058
13275 576058 250186 346710 -53246 -26272 -90943 43291 73517 368515 342667 437616 158103
13264 158103 105457 217107 533629 330734 238415 -67533 -391762 165649 391561 101963
13254 101963 469391 259715 -151821 130494 206677 74307 245704 27781 -154648 285481
13244 285481 786383 1010559 862461 675651 882957 417576 -65403 -123680 -332238 -117822
13234 -117822 290573 284273 393618 204627 51223 141937 48695 -31722 382574 348405 145638
13223 145638 -253066 -625851 -458164 -221328 454082 90578 116616 301409 273447 376941
13213 376941 300952 294799 279996 79481 17481 -170301 -221635 -201233 -23153 -109836 -216453
13202 -216453 -401406 -560318 -553893 -306747 198457 -59479 58546 606303 621457 337462
13192 337462 507575 411766 18160 -259004 -285771 -133428 -268680 -510925 -209614 11226
13182 11226 -29794 235775 77107 60423 533051 522838 117685 -281650 -178587 219810
13172 219810 501200 530984 218091 317747 94839 170896 485495 666227 342943 261854
13162 261854 108530 15237 -292872 -108223 128814 288737 286402 589659 1084125 899984
13152 899984 668472 758487 821128 241492 -144525 -155274 -234755 -281628 32248 372746
13142 372746 485121 -251468 -695892 -359203 81606 39827 112883 25640 235478 242909
13132 242909 132349 226318 15189 402323 457243 -60070 79889 -212866 -349978 -109974
13122 -109974 -43489 -1282 589663 747495 635850 269149 142934 237250 624787 793349
13112 793349 612872 549049 501090 459416 52462 -318028 -275604 -67790 -171821 -173710 -203774
13101 -203774 -416140 -393636 -137840 48263 54282 126896 60226 121997 -220329 -626125 -179873
13090 -179873 -110102 -264930 -162646 -77554 92810 377060 573892 327653 67435 171553
13080 171553 156277 100039 -66259 -144468 -85600 247855 673346 726925 576869 347944
13070 347944 398855 577568 817472 727922 440804 79231 183154 36552 -53801 96636
13060 96636 449484 714560 821978 408388 -329594 -490134 -75029 -56368 -289445 -381966
13050 -381966 -290982 -316437 -208542 76862 89852 -211646 -319096 -796366 -797119 -759387 -813949
13039 -813949 -559562 -245683 -24625 -360593 29684 278741 -311589 -409357 -483409 -558570
13029 -558570 -743633 -540816 -297464 154203 531687 728622 479804 306812 -410466 -640078
13019 -640078 -255202 269987 262637 -10183 -69637 88887 359780 369322 70154 24044 511907
13008 511907 978294 550677 26041 -6745 21934 -306603 -573167 -348956 -348399 -352563 -10092
12997 -10092 -59151 24602 212332 385687 124006 12017 -344747 -315976 -141278 -311751
12987 -311751 -275609 553866 590268 503316 776136 486733 194095 -171462 -78531 -103844
12977 -103844 102918 -24964 32393 -93762 -554186 -372316 141025 112725 63873 44545
12967 44545 -87789 -550460 -767776 -393267 -90107 405485 357373 54025 -204460 -222900
12957 -222900 -294114 -422701 -472072 -118563 485285 532760 265202 -921 -17393 195666
12947 195666 -3604 262903 238685 -97516 44515 -3235 -71711 -241691 62937 651288
12937 651288 786940 543281 174685 37749 19118 -48811 -280473 -381899 -210144 -418
12927 -418 -208610 -225372 -360006 -442508 -142093 -246761 -338528 -324133 -427892 -154046 -133679
12916 -133679 216109 280140 238200 -168464 -308019 311963 482538 310352 510034 576798
12906 576798 516631 210464 -22754 173771 64848 530834 904069 931494 506569 105273
12896 105273 77505 -39143 -90210 106693 -399058 -552681 -132029 -197585 -519665 -451076
12886 -451076 -66228 -368921 -252253 -130572 318017 216999 222855 161944 292194 280951
12876 280951 -28686 -8539 206725 163701 125790 -18631 64614 294854 442586 446851 466293
12865 466293 442968 263048 -248902 -223705 -168488 -152794 331856 163306 -249751 -582310
12855 -582310 -245916 -260248 -44443 -30524 -190754 -182740 -291814 -330027 -331458 -11244 -34967
12844 -34967 316664 690490 450105 -62862 -368367 -80712 173059 -86645 -336739 -332760
12834 -332760 -237125 -154142 -360631 -326296 -137291 -514838 -595575 -416207 -431052 -638850
12824 -638850 -726032 -445669 -568960 -561305 -201225 3221 252239 87741 -121028 -426041
12814 -426041 -402113 -751423 -961198 -429752 244599 188344 122014 120660 609615 777782
12804 777782 781825 250307 188931 35901 10612 -435660 -469709 -320013 -202860 68813
12794 68813 194675 194336 -79364 -263227 -227053 114955 61744 -119850 271834 360370 312976
12783 312976 53850 -54744 -84803 -446929 -513501 -516639 -679507 -369712 -105464 -12100
12773 -12100 -179925 70365 228030 20050 -194719 -488675 -446844 -494574 -479036 -620588
12763 -620588 -897453 -495084 -61683 40577 -38254 -215546 -638496 -797394 -555359 -311934
12753 -311934 -502305 -606206 -288674 -203692 89710 345654 678585 811845 650809 102518
12743 102518 -248608 -364474 -277880 -430414 -191446 -484011 -136906 531065 687876 847770
12733 847770 631326 -162413 -591128 -619613 12215 459175 700079 642547 514476 140636
12723 140636 273942 896390 1255334 1384420 624186 -6800 284486 538330 379616 402444
12713 402444 -145674 403426 812682 612835 269840 149004 -14917 59768 333148 145533
12703 145533 91939 46976 -77980 -400544 116129 512912 499309 671250 887352 902762
12693 902762 601048 159821 -198432 -181031 444983 764282 679096 575291 257758 123636
12683 123636 236207 276492 -148744 -261669 -484215 -472157 -323863 -529556 -371505 272157
12673 272157 272483 -359954 -148564 307536 146277 -340832 -504637 -287960 -197575 170699
12663 170699 -41933 -569074 -352785 36284 332871 165291 359943 388719 643276 654312
12653 654312 175145 -217111 -463597 -755297 -830358 -251796 -499176 -541856 -221397 208351
12643 208351 317947 -263267 -382064 -293070 -135720 -40653 229131 339261 195001 157493
12633 157493 265355 -32974 76311 212530 10028 -180070 235581 61417 3258 109710
12623 109710 -91408 -15012 -94369 231506 351547 271386 -46577 -282878 -106884 -710960
12613 -710960 -861872 -332431 155676 570162 804949 602430 324786 -115979 -642140 -131416
12603 -131416 339011 806130 843478 145466 -201857 -149736 167459 593177 482168 -208558
12593 -208558 -719344 -569989 -885723 -649780 -528649 -748804 -819903 -417070 126196 286430
12583 286430 -135477 4301 156461 500937 468743 -447465 -940828 -608853 -754658 -1234108
12573 -1234108 -972201 -701530 -894132 -730406 -501125 -592432 -429694 40781 32683 86939
12563 86939 34788 6468 -80497 -350086 -934693 -943386 -1095071 -1090870 -523565 -423039 144343
12552 144343 287049 345862 316106 477472 343111 334734 44454 -128608 -97038 -9136 242888
12541 242888 189641 346290 581288 568032 331857 -155740 -105211 -165031 86195 173112
12531 173112 -9186 -196690 -307451 -275031 -50774 -107786 325376 451642 558467 78959
12521 78959 -439887 -644093 -455026 -292016 85077 83481 -39139 -10663 -91046 -185980 -312140
12510 -312140 -122048 -228460 -66337 -126996 361914 147653 88026 -22607 53690 223271
12500 223271 304445 307208 409461 167465 494480 482518 353249 594034 441382 108733
12490 108733 121642 615614 845091 727507 -11021 -210397 46107 191888 -119122 -541688
12480 -541688 -528511 -387171 -553292 -703584 -436580 -28608 79019 -126072 -357499 -214531
12470 -214531 279876 368796 320142 406982 54403 -334625 -323571 28473 243010 459755
12460 459755 634463 895206 742455 377469 135177 447601 913774 965997 799619 410931
12450 410931 83448 189186 306650 640821 622964 509632 -84803 -171536 -29472 186566
12440 186566 248842 416747 363274 129226 -413505 -345087 -701260 -188527 -264966 -424589
12430 -424589 -283343 -59136 51352 167271 500654 377318 218982 -57896 -60371 -69995
12420 -69995 -254942 -387860 -259358 110495 245473 -16959 207860 432774 112578 512285
12410 512285 902734 469783 50620 539803 824254 801429 561016 717048 708915 222839
12400 222839 141817 91582 147777 251316 761652 1101318 699977 95501 -158582 96879
12390 96879 171524 -118117 373335 346665 435390 269274 179608 171835 338818 781345 470546
12379 470546 135544 -70739 -140837 327330 125315 -28997 -425008 -573776 -440497 -260763
12369 -260763 172910 80118 132531 235934 14838 -7293 455540 618819 404213 238905
12359 238905 -49652 -88131 300454 892233 1067411 733890 418689 202559 143548 169189
12349 169189 55782 -277349 -565834 -589775 -626794 -604791 -622647 -714623 -552470 -387861
12339 -387861 -190819 -114575 240670 512409 312485 -381614 -499456 -823352 -695722 -257055
12329 -257055 -200981 -412079 -802 -109451 -17770 22895 -11830 -23053 -22265 -50026 49390
12318 49390 -81890 -355541 -340601 -661485 -742198 -219818 -21299 84280 -2572 -31912
12308 -31912 210076 207567 -84998 -11057 16184 -91069 -88143 -173586 -645067 -220464 364231
12297 364231 74625 -181165 -349616 -520314 -192866 -21913 -208373 135684 87216 175780
12287 175780 236317 -195758 -168662 -379580 -472328 -441727 -590588 -765416 -458432 -367884
12277 -367884 -220737 -159488 -142337 82253 439380 739503 368660 -309434 -398051 -2947
12267 -2947 -43250 -264496 192168 361315 -132755 -370105 -178432 93700 -141957 -96898
12257 -96898 581605 333028 -110006 -131696 -408822 -727739 -785091 51988 453139 252829
12247 252829 169194 492186 459374 405691 370786 225043 4795 60072 -103169 -647290
12237 -647290 -368477 -568379 -741589 -529441 -408934 -258564 1139 519427 258404 -58436
12227 -58436 -72813 -500742 -232919 608406 734483 129181 7024 235631 263131 227635
12217 227635 -3312 -257344 -31012 235530 125567 -138696 328522 377830 115371 -121413
12207 -121413 -484225 -397865 -10937 -16282 -217403 -270265 -426949 -599432 -337556 -136142
12197 -136142 205934 52635 213102 429717 168928 244459 -324764 -467542 -259393 24744
12187 24744 262037 137079 54959 56466 39909 -94923 -237819 -230288 -346826 -259939 -144892
12176 -144892 -110861 -311100 -259518 -310602 -387161 -312660 -238699 15574 80485 240458 349542
12165 349542 833807 973606 697450 293873 175705 50310 -563901 -486448 88106 725235
12155 725235 946455 561453 450015 673709 507192 482262 594232 289526 334687 776645
12145 776645 1008252 785235 546220 148621 -185128 -80057 100368 -23361 -371082 -625089
12135 -625089 -553453 -433860 -554333 -883930 -975856 -452411 -242694 -331846 81310 660932
12125 660932 664201 393865 25390 -431353 -637033 -406833 -552273 -672489 -460024 -549853
12115 -549853 -705064 -780802 -652684 -785032 -535759 -97174 -71619 -95472 91136 -174714
12105 -174714 -213430 -361725 -490318 -196168 80167 41216 195142 463395 121345 -496037
12095 -496037 -522271 -362799 -171531 -147994 -117264 -474665 -337009 -311382 -273958 -29230
12085 -29230 -276297 -419344 -458756 -518951 -56024 188273 19137 -45551 247584 399141
12075 399141 305456 253861 157111 132759 128227 -69654 -115559 170101 349159 205895 212242
12064 212242 302400 298872 523719 135838 -602533 -703948 -722161 -465194 -210610 -241435
12054 -241435 -600031 -351467 -193909 4986 -208219 -201370 327449 598628 452927 375640
12044 375640 125268 -197477 -250626 145130 303557 -167959 -236637 33962 223183 236021
12034 236021 -127159 -439338 -420906 -467066 -193512 -188151 -247259 -224248 -476031 -743285 -602621
12023 -602621 -707055 -554182 -606710 -659808 -314875 138159 123809 203114 206042 205450 -82550
12012 -82550 -160443 -73278 -333547 -51437 229168 239332 302019 184925 -254439 -303466 -625573
12001 -625573 -828557 -636973 -181827 -52908 56334 388102 185227 -43160 -237384 -4571
11991 -4571 -33392 -7853 -111675 -340437 -209646 136426 518919 648327 453266 306472
11981 306472 -44378 -482998 -884595 -948112 -511324 -350850 -271043 372647 544433 158761
11971 158761 386554 655516 566743 343602 -119104 129960 343857 207884 -158142 -418870
11961 -418870 -233675 -164260 -301939 -408568 -109188 -355590 -229409 65559 162155 57118
11951 57118 139439 37887 -35407 -435737 -749707 -981771 -446110 -200482 -136000 -59863
11941 -59863 292522 149951 152321 223137 163145 67414 105425 306648 228929 -63816 -174806
11930 -174806 -194012 183744 627567 813532 701419 618285 484668 617565 476667 304559
11920 304559 103180 187824 399106 435417 253866 80530 -102257 -231955 -480474 -835363
11910 -835363 -860519 -387435 -275766 -86754 -505389 -503607 -224880 -484789 -668559 -654874
11900 -654874 -460225 -98387 -361440 -178387 -35695 271620 223232 -268729 -490552 -275675
11890 -275675 56315 399652 267935 9122 66506 -5537 171559 169990 201792 459547
11880 459547 454353 140536 231021 2993 45092 167231 -278923 -491227 -417277 -349428 27342
11869 27342 -58179 -24206 -8799 -212943 -115846 -77613 303205 362698 276811 152188 -30208
11858 -30208 -24521 177639 570309 766325 727815 297715 -41420 -558070 -477436 80511
11848 80511 -44720 -460314 -57130 396944 108873 149735 209973 346198 375502 494886
11838 494886 483995 545464 549329 28232 -54410 229224 248610 258930 178314 -72261 -29548
11827 -29548 394120 336144 7414 22242 -87725 -37656 -294265 -441996 -83089 -37500
11817 -37500 31699 126719 -65697 163116 -88542 -567993 -450650 -198690 -110367 -276788
11807 -276788 -689655 -673996 -661953 -776050 -502486 -220686 -98953 -111294 45011 453586
11797 453586 287922 -180258 255566 317127 -28003 -334961 -170557 -173202 -217360 50533
11787 50533 -60618 -145018 -56874 -237910 -129686 363831 808314 513129 -127506 -443948
11777 -443948 -431340 -298197 -206920 25714 370274 637245 885374 931710 683601 631294
11767 631294 42490 -328964 97656 538076 417268 287658 223473 -75458 -405752 -305437
11757 -305437 26759 -418096 -812380 -468105 -320989 -165119 339054 -21055 -266711 -109161
11747 -109161 85164 267300 267694 480569 479195 295537 6863 175488 427928 311907
11737 311907 74153 478568 714191 610584 348200 -113508 -189883 13324 232368 470177
11727 470177 389321 439347 572599 534345 468251 286323 -69344 -91091 -350568 -284960 -63237
11716 -63237 197391 132666 -178072 -725836 -698364 -699839 -755175 -412582 -477840 -511613 -428262
11705 -428262 -325711 -390217 -545827 -388452 -187967 -77213 -70721 -292528 -442694 -162671
11695 -162671 39479 680225 594929 550891 242991 64291 -85972 -239816 -341901 -404538
11685 -404538 -316317 -91403 -201111 -761406 -658688 -293223 142141 605342 456108 -109554
11675 -109554 -318833 50771 267428 338455 194131 303992 725701 734309 348619 501460
11665 501460 128502 -475240 -675876 -289788 -218048 -223844 -666956 -161980 -66845 -757474
11655 -757474 -476195 -119459 -271329 -91837 -22213 154074 296850 3658 -359655 -131652
11645 -131652 36425 -322809 -849206 -738737 -478160 -400974 -368617 404689 867558 584167
11635 584167 291178 80377 -15601 -131754 108362 321626 570680 860327 820926 770029
11625 770029 730669 723204 452445 604924 917441 880025 722758 682788 641626 631114 492740
11614 492740 68892 -74706 -206832 80070 55934 325367 355117 335409 133855 -492621
11604 -492621 -605004 18152 403556 557136 505093 438231 -108234 -289623 -33225 166695
11594 166695 294683 262833 226606 245266 270407 189089 -496252 -780745 -518546 -52298
11584 -52298 -91306 137610 -70958 47295 -40083 -293383 -37432 185306 49119 499168
11574 499168 139516 6474 122800 -206145 -304516 -653767 -328509 363587 562641 428034
11564 428034 63378 161889 239172 480263 521761 365408 514677 231566 -90678 -106147
11554 -106147 -264645 -602699 -370325 -314755 -264533 -200071 -60898 40930 -183460 -276856
11544 -276856 309312 327008 -297753 -410945 -145322 -92431 90908 37106 116119 252668
11534 252668 151433 -116562 -534095 -563277 -242601 -38799 168832 226443 162411 682296
11524 682296 709726 470243 275796 245685 84213 -301012 -427661 -142003 94609 -690549
11514 -690549 -1114803 -1016489 -371862 -83518 -140039 -388638 -396610 -204466 -334080 -296675
11504 -296675 -418002 -354191 -443881 -553423 -347370 148316 116029 -196492 -380790 -372380
11494 -372380 -405793 -350616 -98390 -86696 -46367 -138429 -143745 -310053 -346484 31573 -112894
11483 -112894 15076 -9339 84708 -358492 -425149 119575 334434 258846 211005 -9029
11473 -9029 -251528 117009 55876 116786 327013 118710 113297 334920 471296 270636 -143347
11462 -143347 8666 -30102 275594 788900 724742 408354 389672 665993 522974 392697
11452 392697 369881 571037 343098 -26671 -190813 115113 12889 -318503 -611342 -481412
11442 -481412 -194168 -139914 -64821 -124627 -55957 -2851 13815 443006 656079 247472 89330
11431 89330 -302145 -246755 -191566 -311578 -244875 -204470 197253 49368 -268861 -26508
11421 -26508 152708 194543 20319 72149 113146 411651 725690 624769 -68733 -329085
11411 -329085 -120202 -93884 217937 569122 256168 -41384 86051 332742 272823 491277
11401 491277 129330 11457 -15628 -313322 -140228 315757 828130 442420 34870 306567
11391 306567 613696 281416 -154556 -73225 -33565 386893 365967 -358533 -932561 -820459
11381 -820459 -595114 -425602 -460601 -720400 -704203 -659905 -365664 -177870 -262682 -264713 -83083
11370 -83083 31708 -9119 327655 626573 157924 -6221 -245248 -367932 -423815 -467887
11360 -467887 -386490 -421939 -384377 -743712 -855058 -483751 -216420 46658 245386 299188
11350 299188 78768 35745 -151570 -216721 -329654 -156233 -328477 -381744 -396983 27615
11340 27615 517320 1019693 1032910 139686 -364370 -29164 -30512 88735 343007 175787
11330 175787 241511 328490 -64448 -339083 -394537 -530444 -559642 -207509 -124738 -550238
11320 -550238 -582059 -115790 -82487 -166967 -150861 -259005 -26117 73843 1189 132714 -405392
11309 -405392 -917591 -987045 -601639 -213819 380355 411941 644799 511226 394742 687867
11299 687867 716684 741715 404447 357898 137708 161680 48779 -177306 104939 -87209
11289 -87209 -152743 -72972 -48634 193290 -48574 -138707 -478809 -329700 34412 105187 -122179
11278 -122179 -103540 -160570 -369439 -548281 -117478 140594 79550 166930 344452 413784
11268 413784 167297 147366 73454 -91845 12828 71556 -310605 -237324 -125314 -153194
11258 -153194 236565 263513 -35734 -52316 50161 515463 803503 964549 429413 87569
11248 87569 68252 175293 71651 371976 433663 719557 682209 520339 464066 374368 265322
11237 265322 816040 881928 518970 237220 215101 228167 165424 -200661 -494479 -631514
11227 -631514 -331245 -17265 -176565 345505 800768 562865 341322 271054 380406 294496
11217 294496 197488 251177 403387 -202739 -212203 124054 -10154 -204820 146753 152769 -259356
11206 -259356 -514192 -642557 -540472 -677958 -93415 317006 253093 247258 230202 99554
11196 99554 -169825 -14574 -88127 -50194 3065 13196 -21494 24511 -173211 -141018 79455
11185 79455 -97110 -73474 -64834 172660 178323 -152780 -794710 -1127461 -1033174 -634490 -542636
11174 -542636 -354617 -147203 -132518 -70027 -25921 689136 792249 170111 -179713 69223
11164 69223 215060 184359 -77242 106578 325462 680004 801756 651361 795068 612633
11154 612633 780477 739171 159371 123716 -655679 -711670 -442099 -279445 -165394 -315064
11144 -315064 -305839 65945 -43216 113471 97289 62166 196243 316828 399083 142457
11134 142457 125386 187412 -69752 -302420 -616227 -556870 -481088 -359960 -190122 -652785
11124 -652785 -639144 -340569 -149441 -266408 -286793 32984 309838 494546 686623 667797
11114 667797 227719 255823 78837 313522 175837 3465 -26863 60468 162340 208634
11104 208634 102637 148222 -33439 -46648 -415346 -660573 -541871 -384892 -181961 -10670
11094 -10670 182915 -81185 -183765 -8477 266515 69008 26563 70163 -47626 49052
11084 49052 404911 331209 255140 313302 381588 428251 -33131 147402 179903 -261409 -230681
11073 -230681 47007 -179338 -87920 -79084 -238564 -401725 -112534 360465 141292 42813
11063 42813 329607 295149 -218047 -196585 -354206 5640 105865 267934 311292 439245
11053 439245 44369 -119732 -176027 -25458 -150826 191053 336762 238423 -215019 -380076
11043 -380076 -539411 17623 91339 134576 314564 450943 657345 395770 47167 -171433
11033 -171433 -77288 160339 118104 -12334 -279842 192454 562525 -126789 -557146 -231023
11023 -231023 88995 452481 320978 119792 -293683 -267023 85559 -169897 -161866 149420
11013 149420 13375 66779 174183 -27044 -21165 92685 182788 -36868 317672 392666
11003 392666 425451 167034 -58534 -451492 -720947 -585745 -676311 -848494 -989148 -849210
10993 -849210 -611366 -446006 -55398 109798 -291553 -351334 -255740 -449370 -607641 -691093
10983 -691093 -701638 -118736 -31697 -169649 328080 737274 616610 564829 322958 463225
10973 463225 776919 507591 281833 77540 169226 -177946 -395316 -426257 -346267 -431702
10963 -431702 -193664 -221372 344335 316121 540503 557034 497193 581749 667997 445582 237789
10952 237789 -22267 -277285 -43916 118432 -108979 14803 215536 113313 231705 -46877
10942 -46877 -89188 -79107 360875 343555 77961 269039 75431 -246268 -590609 -474002
10932 -474002 -169443 105302 307109 384274 229470 57650 -243958 182400 353591 135656
10922 135656 -161139 -183083 -55238 -175229 -290147 -27701 184014 97823 283717 547618
10912 547618 230508 -481235 -374114 -561614 -830552 -638409 -347545 -384903 -349523 -339528
10902 -339528 -279967 102535 134356 57093 -269393 -268362 -177200 -157040 56528 390368 406320
10891 406320 45239 319135 658225 571719 300016 -11429 -14235 57729 -15971 793592
10881 793592 759698 253393 359904 637186 532633 432206 231662 -62796 156141 569790
10871 569790 487513 173175 -69366 -19702 265340 523856 553295 372046 111835 127057
10861 127057 -322055 -302612 154884 316697 291799 563953 803371 703753 535228 639990
10851 639990 559964 342282 124736 -21144 -428187 -597556 -259553 -211792 42446 -52258
10841 -52258 122815 -175198 -393608 -518980 -475469 -411830 -269797 -400674 -682766 -648168
10831 -648168 -441498 -548292 -329538 -154439 -150281 -221305 -121354 -202201 -563836 -718847
10821 -718847 -396660 -204977 108279 321294 675099 300146 -81434 88377 506509 288312
10811 288312 23203 16088 32184 -43867 -168010 -53758 288122 152544 353653 36368
10801 36368 -75444 -233449 -260987 -152732 198995 214169 473412 746553 371551 -90177
10791 -90177 138490 230120 61295 -271444 -266168 -24966 327311 347840 363028 572533 532612
10780 532612 7543 32971 -111581 155857 569489 463884 236380 -123295 -190811 -182482
10770 -182482 -563 337406 108778 163228 -17712 -230772 -527063 -549779 -313798 -331604
10760 -331604 -384427 -478778 -356247 -304510 -275824 -54996 6480 197804 263630 40046 -489077
10749 -489077 -388821 -186425 -602275 -645257 -435406 152874 435607 122873 87266 363673
10739 363673 360041 225009 118486 -77809 -65730 332987 236593 183965 187102 -204628 -494504
10728 -494504 -449713 -599707 -818670 -1001158 -751680 -849024 -807487 -909069 -484065 -114464
10718 -114464 -182489 -685995 -367411 158020 638476 453461 175832 104775 412661 467748
10708 467748 488035 248892 363582 130039 85954 34163 381636 768275 772367 340413
10698 340413 -286537 -570462 -595569 -769942 -698282 -117659 19196 -138975 -526296 -880610
10688 -880610 -620533 -217762 164300 194662 -136716 -343780 -632196 -650091 -679168 -280659
10678 -280659 -237177 -8161 -97525 -253902 -145266 -301961 -131316 -192289 -444120 -408304
10668 -408304 5190 93619 103979 227346 904129 1245588 950275 651619 275845 -86930
10658 -86930 -269782 374880 807315 802281 500331 541529 843745 812247 756071 766936 297824
10647 297824 175158 138859 -68634 -745025 -740215 -672621 -612191 -943013 -829984 -569522
10637 -569522 -495432 -312729 -326367 -316040 -31231 109050 -11359 -61859 21711 -68464 -17061
10626 -17061 -208739 -22588 72646 88890 -80457 243172 469046 199559 -40402 -207179
10616 -207179 -162254 158626 549924 824198 257049 -243661 -437010 -211757 -472195 -326175
10606 -326175 -578504 -639827 -420059 -258271 -96598 -107626 -60273 3374 -24033 -239953
10596 -239953 -358346 -385716 -371633 -130194 202918 259037 740922 840254 628609 385111
10586 385111 265708 -144429 -215700 287208 122033 369954 596646 575366 441657 -280555
10576 -280555 -513532 -190392 131491 138303 154269 -240487 -530748 -509794 -450546 -529766 -640437
10565 -640437 -528340 -573350 -644575 -666458 -194305 457069 376387 119208 178657 -1686
10555 -1686 36024 -202705 -323132 -108754 -85738 61343 33862 135439 465446 674024
10545 674024 249014 -41145 215748 190085 97166 418243 390375 451805 55083 312983
10535 312983 582148 258540 -87852 107823 493324 864691 868690 718689 519652 361832
10525 361832 207623 622969 502214 189284 218144 608559 72416 -439247 -685775 -574847
10515 -574847 -597085 -825463 -369042 -326505 -337427 -180990 -435906 -428085 -602273 -659234 -248914
10504 -248914 234630 77536 83260 83735 31732 -35136 -535736 -767546 -101890 515094 661924
10493 661924 976530 1282162 1140818 683817 842962 678027 376508 490602 -49134 -337355
10483 -337355 -406842 -138339 -106702 210109 257234 235669 117869 136051 147043 367203 278120
10472 278120 542186 389744 199701 -37345 -89704 10044 326126 460858 462908 187697
10462 187697 135473 34850 166962 157260 -116374 -168980 -54078 -208126 -405266 -588209
10452 -588209 -496225 219697 871548 443676 -329892 -55818 64790 -70271 -31497 10735
10442 10735 90175 -135527 -334798 -178635 -314827 -505535 -225365 -123895 -373349 -30529
10432 -30529 -159160 -157100 100425 123869 -165323 273331 286498 -123131 -184776 -22693 -244989
10421 -244989 -447823 -254643 67692 124267 -68673 -404835 -375609 -435437 -508469 -550256
10411 -550256 -492917 -433491 -46176 -52016 -110836 -86731 -172754 -392509 37278 -62437 -463606
10400 -463606 -728428 -679364 -510656 -32124 -105657 -263150 -62756 224681 253876 -100887
10390 -100887 -211836 4465 89536 -147972 -31708 -110853 152585 376512 500939 357678
10380 357678 89019 8690 59540 30548 -146925 19659 74743 179563 391440 484008
10370 484008 598941 438890 156173 14260 -160717 -44878 -120114 -160101 -226344 32478
10360 32478 360087 676374 704798 519385 193634 -232742 -704710 -848341 -514249 -100668
10350 -100668 459808 638760 803010 651654 803612 1153977 861364 445335 -46580 -430559
10340 -430559 -371865 -496646 -612555 -655990 -355113 -26926 253012 519445 194959 91808
10330 91808 -447817 -360846 166485 359816 435609 339951 223183 179130 403155 346240 176820
10319 176820 27746 -247797 92893 419831 330266 123462 74517 -230742 -110124 15943
10309 15943 -101054 -187107 -378801 -656978 -1005733 -732598 -480190 -87737 -44285 -73360
10299 -73360 109546 261385 40562 -461668 -554572 -409759 -459268 -385217 -276157 -28205
10289 -28205 352019 96022 112630 681354 627318 -11709 96530 307042 443167 1061077
10279 1061077 833806 206234 115489 314055 322327 265506 224094 6359 -251948 -539834
10269 -539834 -377970 -217987 152326 488946 257749 519778 103385 -353315 -805749 -659406
10259 -659406 -272794 -507303 -431349 -29928 -159630 -414926 -184497 -2830 -227657 -472103
10249 -472103 -37013 279086 304552 148382 -34323 -35791 -430946 -455494 -250253 295828
10239 295828 49141 -192705 -425333 -334947 -8751 530388 423574 528744 472262 141246
10229 141246 -132061 -33850 -596193 -755959 -613525 -414762 -509919 -375285 -23358 265146
10219 265146 169371 386070 348521 315951 341395 309482 363575 226182 219533 456708 277994
10208 277994 649388 564473 159665 103803 299108 556418 455612 391976 611558 481604
10198 481604 14237 -113129 -196635 -294570 -362954 -58637 314529 508727 1087408 1012088
10188 1012088 535644 555318 405039 245985 -88567 -23795 -7783 405660 396768 155232
10178 155232 4602 -56992 -121206 -311768 -503168 -478148 -514558 -193559 85902 571798
10168 571798 1060676 654696 398497 29129 182126 441991 792228 996225 610137 284222
10158 284222 -339378 -481640 -514179 -587280 -445333 182542 265577 67012 -71046 -316255
10148 -316255 -408521 -231323 -383097 -171000 -137676 -331669 -20525 228411 93545 -286774
10138 -286774 -536229 -297991 12782 372623 391846 424292 259647 -42680 250459 376597
10128 376597 427788 317165 649419 601813 178349 -7628 -14012 112500 49020 295 -136451
10117 -136451 -68382 177469 149410 -237679 -34388 -176467 -347652 -13790 160846 -335958
10107 -335958 -849563 -465440 -112145 -213596 -141145 -144906 -254946 -232741 3118 297031
10097 297031 32005 -449401 -497458 -318179 140345 195664 419741 225991 2656 -377245
10087 -377245 -413707 -300401 -294062 -18504 315507 601105 676797 400717 275883 -103261
10077 -103261 -226486 277939 525077 447157 357575 86839 73698 -233286 -360255 5288
10067 5288 452124 611323 576134 -8979 38150 -32105 -353053 -352086 -494670 -663296 -230032
10056 -230032 -9782 -64003 62416 674458 657720 94538 133753 38313 94936 109571 -51393
10045 -51393 -411659 -593659 -445393 -461191 -523795 -349306 -398157 -559398 -309615 -515332
10035 -515332 -400254 -15139 284714 493700 376913 201659 62430 -337788 -285302 -81833
10025 -81833 -22148 -5377 37311 -295787 -488841 -333366 -90997 288787 809920 736184
10015 736184 327120 24862 -164850 259422 248814 -22747 16366 -178026 -228658 -23614
10005 -23614 149555 -87515 -125354 -49847 -150586 -124109 -206920 -143995 275439 129214 145873
9994 145873 -148152 -228328 -258366 -287640 -237728 -80866 43538 18838 -443721 -809568 -306627
9983 -306627 -292546 85589 213485 -115414 -216721 68602 517951 483063 505387 296069
9973 296069 201774 226025 168708 86357 -165013 18006 483130 229552 -329309 -475759
9963 -475759 15377 148330 -65077 -301417 -587915 -451641 -365172 -121075 179368 352392
9953 352392 492526 564345 163775 266914 112894 -145120 -311382 39848 -23230 -15698
9943 -15698 -266148 -26128 45528 -911 57029 252604 349533 42522 -90816 -247161 -388538
9932 -388538 -313216 -160548 -3148 -74493 13830 108508 -199850 -457776 -844691 -516853
9922 -516853 -326658 -291542 -155713 -62805 253040 180620 70712 528150 926264 1105923
9912 1105923 931765 589663 385624 6270 29210 -32454 -301428 -311459 99356 556728
9902 556728 898806 988178 715886 633788 845058 1017735 849490 1117543 1199114 718792
9892 718792 264217 -257177 -616979 -880044 -935054 -903385 -1017172 -719282 -350953 228227
9882 228227 20800 -152018 -184179 -247463 -94675 -333407 -857960 -860961 -450978 -320279
9872 -320279 329348 882112 906757 545657 32481 -327280 -167952 -94463 -87135 -212044
9862 -212044 362114 326097 319127 6849 -95122 -80296 96842 345820 331359 431366 373363
9851 373363 444408 773596 1113796 1178888 1280416 704771 430905 40263 91351 66781
9841 66781 772606 590794 120342 -5272 104694 354322 246235 72159 -112631 -251766
9831 -251766 -392120 -550465 -489912 -114561 310916 617569 360260 -181399 -293067 -218033
9821 -218033 35763 464336 605000 820545 707599 277462 -233899 -102238 -407586 -373921
9811 -373921 -336975 -481364 -261145 -195167 -74386 31764 -24955 111371 232017 -134931
9801 -134931 -182938 -333714 -415155 -730269 -574431 -68922 405351 501203 -28872 -463107
9791 -463107 -408768 -245734 33728 226361 422014 284520 424687 24496 286508 354716
9781 354716 453675 478152 633892 525630 228489 -9038 -84245 -172297 40658 -95606
9771 -95606 -251063 -222303 -360926 -385551 -126008 214345 437570 277518 321715 583194
9761 583194 524928 325265 201615 520589 793906 302380 148705 331095 297125 121456
9751 121456 -125153 -2316 7322 144615 -110980 -461958 -556114 -553856 -303875 -131585 -288741
9740 -288741 -39208 335144 189608 204115 122970 385844 465247 308097 327378 600269
9730 600269 546341 150442 -81063 -125421 76305 514301 747503 550066 633492 867806
9720 867806 948110 793874 809320 223692 -167073 -293822 -766028 -618883 -456978 -341783
9710 -341783 22617 252017 479153 711107 480015 564893 766905 763060 742626 1022816
9700 1022816 1022901 1212615 1216695 969128 1018107 717999 614442 956869 700921 280881 -197810
9689 -197810 -394927 -248679 -203919 -415883 -109820 189665 93160 66007 -239132 -6083
9679 -6083 276211 7692 41463 -42971 414935 290669 211257 324156 537668 396897 181647
9668 181647 343064 164366 351700 593622 157454 -104257 42766 37006 609214 1045027
9658 1045027 863167 557315 2318 -269987 -45743 253605 418363 358246 136273 -199679
9648 -199679 -88884 198445 349862 -129586 -291459 -483383 -180998 222880 558343 497030
9638 497030 475554 217835 112787 -296991 -17970 476086 710352 300798 -139883 -17524
9628 -17524 -279763 -989465 -1195545 -1088153 -732896 -714765 -426375 -85007 75018 159577
9618 159577 -69845 -97974 -476829 -921612 -534353 -347486 -621218 -315929 -75680 -405607
9608 -405607 -557104 -397229 -583111 -322865 -183899 -105936 25811 -41494 79501 171457
9598 171457 -194294 -217411 -73801 -410668 -471686 -202180 306851 239307 -101272 -235032
9588 -235032 -383256 -486803 -448372 -429213 -81734 244 30452 -142213 -231761 -597091 -807622
9577 -807622 -581846 -110334 48866 332760 404728 597154 360434 422149 482743 238567
9567 238567 163438 425523 333123 552406 684085 465357 198404 301586 235592 -80486
9557 -80486 -245699 -541616 -512529 -306393 -118978 -173025 -212527 22063 417455 420183 316759
9546 316759 196625 473795 103412 -18271 -16415 134053 656845 737268 413452 245881
9536 245881 360738 329891 121786 -24241 -201585 -356211 -43026 398586 541564 132218
9526 132218 -216745 -269940 85082 294738 244980 -58037 -300106 -371521 1894 107168
9516 107168 -149032 -158106 -150458 -465038 -737909 -225164 112509 406171 655223 409427
9506 409427 37133 -189430 17873 -400241 -532025 -448456 -120424 -232542 -455544 -285608
9496 -285608 97700 116442 -88571 324314 147072 -257746 -350107 -287921 240857 281486
9486 281486 455856 69028 -597588 -838442 -705388 -498679 9166 43193 242850 -147338
9476 -147338 -528647 121704 522222 359924 436336 493057 245033 45420 322738 534491
9466 534491 451993 459026 611249 526124 256264 145328 412557 318581 231921 -125328 -24038
9455 -24038 -49277 -65211 -295133 -322690 -299191 -511886 -465329 -267890 107076 50149 -390270
9444 -390270 -130317 49673 213573 309593 431690 380942 860686 980114 746715 501173
9434 501173 -35499 182585 -182470 49435 505742 355325 347254 264324 167679 592137
9424 592137 294602 -201148 49604 -122426 -367853 -462222 -660891 -659375 -385239 -258180
9414 -258180 -177308 7461 89745 24549 -161000 -47708 -21867 -91552 -477399 -231066 474736
9403 474736 784143 961238 661677 45750 -311648 -269607 -426060 -341622 146518 617245
9393 617245 1051971 1098563 893628 898512 460428 496859 414449 275989 -77589 -341832 384368
9382 384368 720266 376670 288311 537556 476041 246501 -97885 -348315 -318153 87895
9372 87895 41932 305256 176333 46376 323173 503270 103227 -262499 76227 272039
9362 272039 -2239 -89724 -85495 69689 -39923 -32485 6786 103775 544576 375337 202184
9351 202184 124805 87212 -155336 72685 -42596 4737 -215 40540 -115827 -373762 194030
9340 194030 429815 153999 35823 -10164 -29631 -36169 -141945 48560 107495 194174 -312085
9329 -312085 -531655 192217 441160 338519 583757 572340 447648 115924 -116023 -67044
9319 -67044 530994 518857 184889 263312 167345 24772 101901 145632 -127425 -482694 -551156
9308 -551156 -346807 330567 466072 414521 173910 136121 338202 693934 820906 226333
9298 226333 -30939 -167329 -41062 -24964 -388292 -360405 -103549 122984 220476 428177
9288 428177 451018 427648 475425 211142 209721 129072 251451 257551 223894 312871 435443
9277 435443 416490 81010 270368 284926 191049 184356 179345 212925 433328 400335 18707
9266 18707 -23546 -314233 -287873 30628 105800 111833 320823 780565 1107891 1134088 824935
9255 824935 533719 382110 330995 341153 388178 404926 642340 550600 230474 338818 497676
9244 497676 21081 318351 355155 91997 2220 -50690 -83679 80902 288868 238845 197565
9233 197565 159898 -104599 -467060 -403805 -274488 223434 795438 1126494 1044060 473687
9223 473687 195884 312137 405626 644841 835907 690109 495490 262659 139440 124159
9213 124159 471316 570080 561344 285527 -64006 259037 718658 839632 662138 820401
9203 820401 529986 158423 432496 221583 -91144 92389 452709 812983 1104984 887043
9193 887043 890185 642605 88056 197677 534147 738473 865341 765433 902139 672206
9183 672206 379167 504362 496463 -70839 -165803 8732 -401170 -381530 -477316 -536511 -358549
9172 -358549 -380111 -243595 -20690 116444 65878 350306 484217 461674 88356 231445
$$ [...]
##END NTUPLES=NMR SPECTRUM
##END=
