##TITLE=Analysis number 320505
Compound Code btb 09770
Project Code adrs
Chemist Name fudan
##JCAMPDX= 6.0         $$ Bruker NMR JCAMP-DX V2.0
##DATA TYPE= NMR SPECTRUM
##DATA CLASS= NTUPLES
##ORIGIN= Bruker BioSpin GmbH
##OWNER= nmr
$$ XWIN-NMR		Version 3.5
$$ Wed Jun 28 09:49:03 2006 GMT Daylight Time (UT+1h)  MAYBRIDGE\nmr@NMR_250MHZ
##.OBSERVE FREQUENCY= 250.131544655141
##.OBSERVE NUCLEUS= ^1H
##.ACQUISITION MODE= SIMULTANEOUS (DQD)
##.ACQUISITION SCHEME= undefined
##.AVERAGES= 16
##.DIGITISER RES= 18
##SPECTROMETER/DATA SYSTEM= dpx250
##.PULSE SEQUENCE= zg30
##.SOLVENT NAME= DMSO
##.SHIFT REFERENCE= (INTERNAL, DMSO, 0, 16.522)
##AUDIT TRAIL= $$ (NUMBER, WHEN, WHO, WHERE, WHAT)
$$ ##TITLE= Audit trail, XWIN-NMR		Version 3.5
$$ ##JCAMPDX= 5.01
$$ ##ORIGIN= Bruker BioSpin GmbH
$$ ##OWNER= nmr
$$ C:\u/data/dgb/nmr/ADRS/1660/pdata/1/auditp.txt
$$ ##AUDIT TRAIL=  $$ (NUMBER, WHEN, WHO, WHERE, WHAT)
(   1,<2006-06-28 09:48:39.63 +100>,<MAYBRIDGE\nmr>,<NMR_250MHZ>,
      <created by zg, POWCHK disabled, PULCHK disabled
       configuration hash MD5:
       E2 DF 36 D8 04 B2 41 60 5A D7 A3 38 5A 4B D0 FE
       data hash MD5: 64K
       8B 81 FD 76 19 52 98 A8 E7 14 D7 DC D6 33 66 04>)
(   2,<2006-06-28 09:48:53.53 +100>,<MAYBRIDGE\nmr>,<NMR_250MHZ>,
      <Start of raw data processing
       ef LB = 0.3 FT_mod = 6 PKNL = 1 SI = 32K 
       data hash MD5: 32K
       AD 0D 42 F5 27 2A 09 B5 D4 B2 BB C4 A0 42 08 0B>)
(   3,<2006-06-28 09:48:55.44 +100>,<MAYBRIDGE\nmr>,<NMR_250MHZ>,
      <apk 
       data hash MD5: 32K
       E8 7D CD 17 A3 2C 3D CC A0 AB C4 BF 59 C4 5A 09>)
(   4,<2006-06-28 09:48:56.58 +100>,<MAYBRIDGE\nmr>,<NMR_250MHZ>,
      <abs ABSG = 5 
       data hash MD5: 32K
       11 3C 13 0A D5 84 95 FF 13 3F 4A 92 A5 D9 4A E3>)
$$ ##END=
$$ 
$$ hash MD5
$$ 11 DB 34 DC 2E 9D E9 BB AC 51 CB EF 00 27 AC BD
##$RELAX= 
##$RELAX= 
##$RELAX= 
##$RELAX= 
##$RELAX= 
##$RELAX= 
##$RELAX= 
$$ Bruker specific parameters
$$ --------------------------
##$DU= <C:\u>
##$EXPNO= 1660
##$NAME= <ADRS>
##$PROCNO= 1
##$TYPE= <nmr>
##$USER= <dgb>
##$AMP= (0..31)
100 100 100 100 100 100 100 100 100 100 100 100 100 100 100 100 100 100 
100 100 100 100 100 100 100 100 100 100 100 100 100 100 
##$AQSEQ= 0
##$AQ_mod= 3
##$AUNM= <au_zg>
##$AUTOPOS= <8 >
##$BF1= 250.13
##$BF2= 250.13
##$BF3= 250.13
##$BF4= 250.13
##$BF5= 500.13
##$BF6= 500.13
##$BF7= 500.13
##$BF8= 500.13
##$BYTORDA= 1
##$CFDGTYP= 0
##$CFRGTYP= 5
##$CHEMSTR= <none>
##$CNST= (0..31)
1 1 145 1 1 1 1 1 1 1 1 1 1 1 1 1 1 1 1 1 1 1 1 1 1 1 1 1 1 1 1 1 
##$CPDPRG= <>
##$CPDPRG1= <>
##$CPDPRG2= <>
##$CPDPRG3= <>
##$CPDPRG4= <mlev>
##$CPDPRG5= <mlev>
##$CPDPRG6= <mlev>
##$CPDPRG7= <mlev>
##$CPDPRG8= <mlev>
##$CPDPRGB= <>
##$CPDPRGT= <>
##$D= (0..31)
0 1 0 0 0 0 0 0 0 0.06 0 0 0 0 0 0 0.0002 0 0 0 0 0 0 0 0 0 0 0 0 0 0 
0 
##$DATE= 1151484518
##$DBL= (0..7)
120 120 120 120 120 120 120 120 
##$DBP= (0..7)
150 150 150 150 150 150 150 150 
##$DBP07= 0
##$DBPNAM0= <>
##$DBPNAM1= <>
##$DBPNAM2= <>
##$DBPNAM3= <>
$$ [...]
##$SUBNAM7= <"">
##$SUBNAM8= <"">
##$SUBNAM9= <"">
##$SW= 20.6930455092707
##$SWIBOX= (0..15)
0 0 3 0 0 0 0 0 0 0 0 0 0 0 0 0 
##$SW_h= 5175.983436853
##$TD= 65536
##$TD0= 1
##$TE= 296.16
##$TE2= 300
##$TE3= 300
##$TEG= 300
##$TL= (0..7)
0 120 120 120 120 120 120 120 
##$TP= (0..7)
150 150 150 150 150 150 150 150 
##$TP07= 0
##$TPNAME0= <>
##$TPNAME1= <>
##$TPNAME2= <>
##$TPNAME3= <>
##$TPNAME4= <>
##$TPNAME5= <>
##$TPNAME6= <>
##$TPNAME7= <>
##$TPOAL= (0..7)
0.5 0.5 0.5 0.5 0.5 0.5 0.5 0.5 
##$TPOFFS= (0..7)
0 0 0 0 0 0 0 0 
##$TUNHIN= 0
##$TUNHOUT= 0
##$TUNXOUT= 0
##$USERA1= <user>
##$USERA2= <user>
##$USERA3= <user>
##$USERA4= <user>
##$USERA5= <user>
##$V9= 5
##$VALIST= <valist>
##$VCLIST= <CCCCCCCCCCCCCCC>
##$VD= 0
##$VDLIST= <DDDDDDDDDDDDDDD>
##$VPLIST= <PPPPPPPPPPPPPPP>
##$VTLIST= <TTTTTTTTTTTTTTT>
##$WBST= 1024
##$WBSW= 4
##$XGAIN= (0..3)
0 0 0 0 
##$XL= 0
##$YL= 0
##$YMAX_a= 542573
##$YMIN_a= -387443
##$ZGOPTNS= <>
##$ZL1= 120
##$ZL2= 120
##$ZL3= 120
##$ZL4= 120
##$ABSF1= 16.522
##$ABSF2= -4.171173
##$ABSG= 5
##$ABSL= 3
##$ALPHA= 0
##$AQORDER= 0
##$ASSFAC= 0
##$ASSFACI= 0
##$ASSFACX= 0
##$ASSWID= 0
##$AUNMP= <proc_1d>
##$AZFE= 0.1
##$AZFW= 0.1
##$BCFW= 0
##$BC_mod= 0
##$BYTORDP= 0
##$COROFFS= 0
##$CY= 12.5
##$DATMOD= 1
##$DC= 0
##$DFILT= <>
##$DTYPP= 0
##$F1P= 14.0000005364418
##$F2P= -0.99999901652339
##$FCOR= 0.5
##$FTSIZE= 32768
##$FT_mod= 6
##$GAMMA= 0
##$GB= 0
##$INTBC= 1
##$INTSCL= 1
##$ISEN= 128
##$LB= 0.3
##$LEV0= 0
##$LPBIN= 0
##$MAXI= 10000
##$MC2= 0
##$MEAN= 0
##$ME_mod= 0
##$MI= 0
##$NCOEF= 0
##$NC_proc= -2
##$NLEV= 6
##$NOISF1= 0
##$NOISF2= 0
##$NSP= 0
##$NTH_PI= 0
##$NZP= 0
##$OFFSET= 16.522
##$PC= 1
##$PHC0= 157.9573
##$PHC1= 22.76517
##$PH_mod= 1
##$PKNL= yes
##$PPARMOD= 0
##$PSCAL= 4
##$PSIGN= 0
##$REVERSE= no
##$SF= 250.13
##$SI= 32768
##$SIGF1= 0
##$SIGF2= 0
##$SINO= 400
##$SIOLD= 32768
##$SREGLST= <1H.DMSO>
##$SSB= 0
##$STSI= 32768
##$STSR= 0
##$SW_p= 5175.98343685301
##$SYMM= 0
##$S_DEV= 0
##$TDeff= 65536
##$TDoff= 0
##$TI= <Analysis number 999999
Compound Code 99
Book Reference 9
Project Code 9>
##$TILT= no
##$TM1= 0
##$TM2= 0
##$TOPLEV= 0
##$USERP1= <user>
##$USERP2= <user>
##$USERP3= <user>
##$USERP4= <user>
##$USERP5= <user>
##$WDW= 1
##$XDIM= 32768
##$YMAX_p= 291741968
##$YMIN_p= -143044
$$ End of Bruker specific parameters
$$ ---------------------------------
##NTUPLES= NMR SPECTRUM
##VAR_NAME=  FREQUENCY,     SPECTRUM/REAL,   SPECTRUM/IMAG
##SYMBOL=    X,             R,               I
##VAR_TYPE=  INDEPENDENT,   DEPENDENT,       DEPENDENT
##VAR_FORM=  AFFN,          ASDF,            ASDF
##VAR_DIM=   32768,         32768,           32768
##UNITS=     HZ,            ARBITRARY UNITS, ARBITRARY UNITS
##FACTOR=    0.157963299565203, 1,           1
##FIRST=     4132.6476996994, 0,             0
##LAST=      -1043.33573715361, 0,           0
##MIN=       -1043.33573715361, -143044,     0
##MAX=       4132.6476996994, 291741968,     0
$$ Real data points
##PAGE= N=1
##DATA TABLE= (X++(R..R)), XYDATA
$$ [...]
$$ plain form
16240 619 9895 16798 23704 234 -28958 -23758 -23045 -14946 823 6106 -6535 -3806 -12892 -3710
16226 -3710 21042 3086 -17647 4847 24018 5115 4224 24396 17612 13359 50921 56299 31739
16213 31739 -5367 -13694 -6838 -28285 -34834 -37866 -33820 16107 37619 21897 -29972 -43881 -39298
16200 -39298 -16179 1871 1074 10205 9467 -5273 -21511 -26538 -8190 15964 12179 33998 35582
16187 35582 10533 -23999 -45888 -66467 -73096 -36565 -19107 -36723 -15431 9880 24322 -7591
16175 -7591 33843 26505 19806 39247 35474 28300 19164 25531 2191 -26568 -22746 29 39503
16162 39503 25115 17335 5941 7125 27318 75680 55959 45243 49597 32127 17692 39529
16150 39529 44040 9856 -12615 -14231 -857 -344 -16258 11733 -8740 -24776 -25985 -12550 -7833
$$ packed form
16240F19R276O903O906k3470k9192N200P13Q099J5769N283j2641K729r086R182
16226c710K4752j7956k0733K2494J9171j8903q91K0172o784m253L7562N378k4560
16213C1739l7106q327O856k1447o549l032M046M9927K1512j5722n1869j3909M583
16200c9298K3119J8050p97R131p38j4740j6238n027J8348K4154l785K1819J584
16187C5582k5049l4532k1889k0579o629L6531J7458j7616K1292K5311J4442l1913
16175g591M1434p338o699J9441l773p174r136O367k3340k8759L822K2775L9474
16162C9503j4388p780j1394J184K0193M8362j9721j0716M354j7470j4435K1837
16150C9529M511l4184k2471j616J3374N13j5914K7991k0473j6036j209J3435M717
$$ plain form
16137 -7833 877 -11678 6119 14875 -3750 7115 -7831 6963 21300 -12278 -26362 -6146
16125 -6146 -13975 3069 33283 25495 16780 27712 20428 420 -4034 -17558 29 11800 26200
16112 26200 16106 -272 -20093 -18622 -4399 -34507 -50732 -25828 -15012 -3985 -5790 -16377
16100 -16377 -13194 -14203 -36538 -39932 -17940 23200 60085 29516 8460 -4680 -16671 -9372
16088 -9372 -17548 -5887 20689 23796 9253 19450 35143 53647 21658 -12620 -36449 -40552
16076 -40552 -29969 -36488 -38221 -48397 -37347 -25059 7198 33846 26157 17503 12630 9754 11043
16063 11043 -4030 -17156 -34616 -46068 42 33912 21472 10921 14013 28398 25064 41838
16051 41838 15796 -4945 14561 18262 5329 1633 28324 35722 -5765 -51748 -16026 10965
$$ packed form
16137g833Q710j2555J7797Q756j8625J0865j4946J4794J4337l3578j4084K0216
16125f146p829J7044L0214p788q715J0932p284k0008m454j3524J7587J1771J4400
16112B6200j0094j6378j9821J471J4223l0108j6225K4904J0816J1027j805j0587
16100a6377L183j009k2335l394K1992M1140L6885l0569k1056j3140j1991P299
16088i372q176J1661K6576L107j4543J0197J5693J8504l1989l4278k3829m103
16076d0552J0583o519j733j0176J1050J2288L2257K6648p689q654m873k876J289
16063A1043j5073j3126j7460j1452M6110L3870j2440j0551L092J4385l334J6774
16051D1838k6042k0741J9506L701j2933l696K6691P398m1487m5983L5722K6991
$$ plain form
16039 10965 10783 12257 -3190 -8670 -24904 -38758 -18584 -16629 13541 4297 5713 -14481 -49349
16026 -49349 -13937 -6636 4503 37545 47701 40872 -15356 -36043 -29829 -24747 -25047 -53948 -21182
16013 -21182 22397 34678 25314 8574 22750 32955 32178 25728 4539 -3753 12492 17205 -11472
16000 -11472 7786 26734 11425 11848 -4333 12038 -3640 -8243 14791 30217 22398 18111 4693
15987 4693 -18293 -51245 -56710 -58342 -41191 -45704 -50133 -30147 22579 21040 -31914 -45157 -43690
15974 -43690 -34980 11670 28862 14740 19010 21847 32357 38341 42640 23951 5523 -2889 6220
15961 6220 2941 8842 19256 14590 -2551 -28310 -43701 -39023 -4233 17634 40569 38425 17704
15948 17704 29962 28573 -1424 -18299 10667 770 -28749 6355 25859 31684 -3196 -32702
$$ packed form
16039A0965j82J474j5447n480j6234j3854K0174J955L0170r244J416k0194l4868
16026d9349L5412P301J1139L3042J0156o829n6228k0687O214N082l00k8901L2766
16013b1182M3579J2281r364j6740J4176J0205p77o450k1189q292J6245M713k8677
16000a1472J9258J8948j5309M23j6181J6371j5678m603K3034J5426p819m287j3418
15987D693k2986l2952n465j632J7151m513m429J9986N2726j539n2954j3243J467
15974d3690Q710M6650J7192j4122M270K837J0510N984M299j8689j8428q412R109
15961F220l279N901J0414m666j7141k5759j5391M678L4790K1867K2935k144k0721
15948A7704J2258j389k9997j6875K8966r897k9519L5104J9504N825l4880k9506
$$ plain form
15936 -32702 -24264 -4151 3012 -8260 -24930 -14430 -32740 -25522 11063 17838 -22531 -28396 -45299
15923 -45299 -19371 16953 15380 -10509 395 18937 31821 -6918 -18509 -1522 23793 34135
15911 34135 36815 32730 1275 -51616 -74800 -78615 -62342 -42301 -32097 -12375 -24439 -14891
15899 -14891 10890 -2429 4101 -9149 -35402 -34827 -32681 -19649 7024 -11735 -8777 -4146 23290
15886 23290 -2484 -17110 6263 1354 -14168 -5393 6290 -5704 -27479 -55959 -50724 -42066
15874 -42066 -39209 -49520 -17437 1934 19204 57441 41845 809 13177 28948 40469 63725
15862 63725 67169 49502 11488 1850 8758 34736 29773 5842 -10113 -31448 -41471 -32900 -24453
15849 -24453 -3210 2732 7655 15960 17137 29542 34255 27395 -422 15408 5910 -7491 -23606
$$ packed form
15936c2702Q438K0113P163j1272j6670J0500j8310P218L6585O775m0369n865j6903
15923d5299K5928L6324j573k5889J0904J8542J2884l8739j1591J6987K5315J0342
15911C4135K680m085l1455n2891k3184l815J6273K0041J0204J9722j2064R548
15899a4891K5781j3319O530j3250k6253N75K146J3032K6673j8759K958M631K7436
15886B3290k5774j4626K3373m909j5522Q775J1683j1994k1775k8480N235Q658
15874d2066K857j0311L2083J9371J7270L8237j5596m1036J2368J5771J1521K3256
15862F3725L444j7667l8014r638O908K5978m963k3931j5955k1335j0023Q571Q447
15849b4453K1243N942M923Q305J177J2405M713o860k7817J5830r498j3401j6115
$$ plain form
15836 -23606 -42558 -49597 -48300 -46615 -25308 -58941 -113732 -102470 -55555 -3930 21289 41364
15824 41364 12450 -17577 -23578 2518 28533 22009 134 6329 18002 33413 14460 7425
15812 7425 -23990 -26769 -6388 -20326 -48065 -53196 -26634 -1941 6416 29415 2936 -4688 -8506
15799 -8506 2537 19649 2473 3458 9834 9659 9259 22792 11911 10967 -1775 19539 24261 37680
15785 37680 38286 7186 -17747 -13874 -6926 -8025 -19972 -34995 -27247 -29840 -23770 -8356 8763
15772 8763 6062 11351 17010 12209 -20542 -18173 7992 6295 13000 18552 31430 27131 33725 18743
15758 18743 2503 -4370 -7425 -27247 -22314 -42504 -33501 -12241 -23297 10931 15646 -12456 -48593
15745 -48593 -50865 -31358 -21436 -13837 11234 2446 -28044 -21127 -13517 -39162 -58843 -46017 -26497
$$ packed form
15836b3606j8952p039J297J685K1307l3633n4791J1262M6915N1625K5219K0075
15824D1364k8914l0027o001K6096K6015o524k1875O195J1673J5411j8953p035
15812G425l1415k779K0381j3938k7739n131K6562K4693Q357K2999k6479p624l818
15799h506J1043J7112j7176R85O376j75m00J3533j0881r44j2742K1314M722J3419
15785C7680O06l1100k4933L873O948j099j1947j5023P748k593O070J5414J7119
15772H763k701N289N659m801l2751K369K6165j697O705N552J2878m299O594j4982
15758A8743j6240o873l055j9822M933k0190R003K1260j1056L4228M715k8102l6137
15745d8593k272J9507R922P599K5071q788l0490O917P610k5645j9681J2826J9520
$$ plain form
15732 -26497 10998 36797 52792 47864 18849 7815 -385 13487 -1751 -2327 -19016 -31381
15720 -31381 -43454 -8858 17501 12057 15141 3798 -34001 -63367 -84738 -70361 -40105 -37421
15708 -37421 -5909 7405 12438 -17170 -21641 5353 2257 29019 39312 21342 -11367 -28302
15696 -28302 -68516 -82993 -68702 -32499 -12165 -12751 983 16782 22035 -129 -28161 -46206
15684 -46206 -61033 -29123 19825 38975 29503 -21925 -41702 -36523 -51623 -62527 -64393 -35146
15672 -35146 -38129 -36153 5379 31627 40764 51146 29277 14879 -22128 -26791 -16375 -9279 -16286
15659 -16286 -31034 -36463 15118 45467 49675 10949 -1268 26737 53279 27557 15888 47454
15647 47454 60031 37364 41727 38123 35970 15401 -1280 15812 25037 16224 17510 44893 36407
$$ packed form
15732b6497L7495K5799J5995m928k9015j1034q200J3872j5238n76j6689j2365
15720c1381j2073L4596K6359n444L084j1343l7799k9366k1371J4377L0256K684
15708c7421L1512J3314N033k9608m471K6994l096K6762J0293j7970l2709j6935
15696b8302m0214j4477J4291L6203K0334n86J3734J5799N253k2164k8032j8045
15684d6206j4827L1910M8948J9150r472n1428j9777N179j5100j0904j866K9247
15672c5146k983J976M1532K6248R137J0382k1869j4398l7007m663J0416P096p007
15659a6286j4748n429N1581L0349M208l8726j2217K8005K6542k5722j1669L1566
15647D7454J2577k2667M363l604k153k0569j6681J7092R225q813J286K7383q486
$$ plain form
15634 36407 35586 8472 32107 52491 38548 15730 11042 7487 8536 13190 -14963 -29475 -39983
15621 -39983 -40234 -24214 -5585 9580 15885 13939 24887 -5531 -355 8364 13048 15341 2624
15608 2624 -12717 -43171 -33673 -30366 -15789 -25035 -11014 -7531 28584 22129 13559 -11711 -37448
15595 -37448 -51962 -24053 -19164 -3221 17784 31540 6608 -6001 -13055 6661 -1110 -19090
15583 -19090 -13042 -18224 -10691 -14505 -18408 -36426 -68926 -53828 -35529 -42870 -11900 -275 12885
15570 12885 -2052 12512 -31485 -50850 -14371 36349 61016 43046 -20815 -55310 -56635 -59046
15558 -59046 -47630 -77239 -79932 -38651 -16777 -5121 -7847 -27563 -32615 -20994 -14575 644
15546 644 12593 -18218 -41919 -20152 -3308 -720 -13200 -25153 -34187 -49192 -5100 19508
$$ packed form
15634C6407q21k7114K3635K0384j3943k2818m688l555J049M654k8153j4512j0508
15621c9983k51J6020J8629J5165O305j946J0948l0418N176Q719M684K293j2717
15608B624j5341l0454R498L307J4577r246J4021L483L6115o455q570k5270k5737
15595c7448j4514K7909M889J5943K1005J3756k4932j2609p054J9716p771j7980
15583a9090O048n182P533l814l903j8018l2500J5098J8299p341L0970J1625J3160
15570A2885j4937J4564m3997j9365L6479N0720K4667j7970o3861l4495j325k411
15558e9046J1416k9609k693M1281K1874J1656k726j9716n052J1621O419J5219
15546F44J1949l0811k3701K1767J6844K588j2480j1953r034j5005M4092K4608
$$ plain form
15534 19508 -3066 -1377 1583 -28652 -12380 3073 10191 16343 12308 -589 -20051 -4459 49544
15521 49544 42529 31858 11239 -8030 2171 11760 27412 23890 32733 37874 25820 -6898 -25569
15508 -25569 -14870 -16808 -7560 1402 2583 -9182 4585 -6152 -21923 -22129 -25624 -38389 -47883
15495 -47883 -59852 -62644 -27768 -20426 -8404 -27244 -32459 -41909 -42013 -39176 3379 40114 36172
15482 36172 2834 21156 39402 22365 6514 -20441 -535 2816 14449 13340 -414 -18358
15470 -18358 13964 16670 -2089 -32204 -40202 -41176 -21953 -23959 -4200 14998 29622 -5416 2402
15457 2402 -20652 -33625 -10470 4404 12740 11020 -962 -11491 -26135 -13202 -13663 -28822 -19609
15444 -19609 -16900 -4202 5031 6705 29812 35243 10405 14309 67737 55742 60961 18687 -14912
$$ packed form
15534A9508k2574J689K960l0235J6272J5453P118O152m035j2897j9462J5592N4003
15521D9544p015j0671k0619j9269J0201R589J5652l522Q843N141j2054l2718j8671
15508b5569J0699j938R248Q962J181j1765J3767j0737j5771k06l495j2765r494
15495d7883j1969k792L4876P342J2022j8840n215r450j04K837M2555L6735l942
15482C6172l3338J8322J8246j7037j5851k6955J9906L351J1633j109j3754j7944
15470a8358L2322K706j8759l0115p998r74J9223k006J9759J9198J4624l5038P818
15457B402k3054j2973K3155J4874Q336j720j1982j0529j4644J2933m61j5159R213
15444a9609K709J2698R233J674K3107N431k4838L904N3428j1995N219m2274l3599
$$ plain form
15431 -14912 -37419 -58903 -42074 -8229 -18129 -12991 -6527 -17784 -27209 -33243 -56979 -59013 -50244
15418 -50244 -38771 -47942 -58931 -24267 -15874 -6053 12166 11468 2400 -5719 -21293 -57281 -73309
15405 -73309 -50922 -15133 -7004 -23778 -18034 -20248 -32146 -39551 -54215 -28752 14739 11893 -19943
15392 -19943 -12921 2150 24311 -18963 -30097 -27653 -54153 -69057 -44958 -48434 -34226 -15030
15380 -15030 14417 24595 14508 10602 -2863 -44844 -54421 -26784 -21445 -16543 -19067 -4891 -5412
15367 -5412 -15555 -37451 -41430 -44384 -52900 -7225 23540 34118 318 -13988 -14665 12541 9672
15354 9672 -9461 11716 16402 16810 24039 95 -25214 -29861 -57926 -69075 -34928 -27055 -30643
15341 -30643 -21592 -3820 -7510 -7133 9167 6414 -5311 -4378 7834 -6954 6135 28916 14219
$$ packed form
15431a4912k2507k1484J6829L3845r900N138O464j1257r425o034k3736k034Q769
15418e0244J1473r171j0989L4664Q393R821J8219o98r068q119j5574l5988j6028
15405g3309K2387L5789Q129j6774N744k214j1898p405j4664K5463M3491k846l1836
15392a9943P022J5071K2161m3274j1134K444k6500j4904K4099l476J4208J9196
15380a5030K9447J0178j0087l906j3465m1981r577K7637N339M902k524J4176n21
15367e412j0143k1896l979k954q516M5675L0765J0578l3800j4306o77K7206k869
15354I672j9133K1177M686M08P229k3944k5309m647k8065j1149L4147P873l588
15341c0643R051J7772l690L77J6300k753j1725R33J2212j4788J3089K2781j4697
$$ plain form
15328 14219 -5393 -21293 -18735 -6061 24119 40246 13132 162 13319 -17568 -46272 -21403
15316 -21403 10418 -2606 -6798 4131 -28412 -31650 283 28482 5257 -10949 -30529 -50410
15304 -50410 -42824 -34217 -20421 -38842 -23382 8774 28221 1899 -5511 15669 -3889 -2021
15292 -2021 12885 7677 -19477 -26509 -21174 -27078 -8780 10943 2995 -10633 5171 33177 35167
15279 35167 21487 19430 17927 15492 14140 30731 52818 57668 19041 15067 17928 20768 29150
15266 29150 36929 47969 31957 18233 28749 26758 25312 26528 25732 -9893 -1945 5532 14674
15253 14674 9865 20953 30344 7674 -3704 -25724 -19754 4791 260 -25458 -18941 -12435 -34831
15240 -34831 -43385 -31954 4740 23701 18069 -6863 -28032 -14299 -20791 -4925 -7593 -19037
$$ packed form
15328A4219j9612j5900K558J2674L0180J6127k7114j2970J3157l0887k8704K4869
15316b1403L1821j3024m192J0929l2543l238L1933K8199k3225j6206j9580j9881
15304e0410P586Q607J3796j8421J5460L2156J9447k6322p410K1180j9558J868
15292b021J4906n208k7154p032N335n904J8298J9723p948j3628J5804K8006J990
15279C5167j3680k057j503k435j352J6591K2087M850l8627l974K861K840Q382
15266B9150P779J1040j6012j3724J0516j991j446J216p96l5625P948P477R142
15253A4674m809J1088R391k2670j1378k2020N970K4545m531k5718O517O506k2396
15240c4831q554J1431L6694J8961n632k4932k1169J3733o492J5866k668j1444
$$ plain form
15228 -19037 -2436 18074 9646 -5297 -27344 -35123 -45435 -36790 -1849 2527 -20678 3270
15216 3270 21622 8665 -15986 -33224 -36981 -37537 -27180 -51733 -61984 -76864 -72678 -52137 -36232
15203 -36232 -29880 -23680 23489 26333 14102 10942 26776 25533 -15307 -14595 -776 -8844 -13675
15190 -13675 -7633 34084 47509 36766 16454 30124 66962 81177 54530 42149 34441 10138
15178 10138 -17023 -18504 -31194 -9666 21616 23844 -24184 -50663 -27479 -6224 4551 -26479
15166 -26479 -29065 -1435 13749 23309 -13401 -26176 -44862 -44463 -30545 -18228 280 -10200
15154 -10200 -16342 -9902 -1357 5880 -5867 4354 19550 37473 -10587 -8034 55 -35646 -13588
15141 -13588 15349 -12407 -24960 6161 2288 -1438 12324 6185 4427 -37127 -68454 -46832
$$ packed form
15228a9037J6601K0510q428j4943k2047p779j0312Q645L4941M376k3205K3948
15216C270J8352j2957k4651j7238l757n56J0357k4553j0251j4880M186K0541J5905
15203c6232O352O200M7169K844j2231l160J5834j243m0840P12J3819q068m831
15190a3675O042M1717J3425j0743k0312J3670L6838J4215k6647j2381p708k4303
15178A0138k7161j481j2690K1528L1282K228m8028k6479K3184K1255J0775l1030
15166b6479k586K7630J5184R560l6710j2775j8686L99J3918J2317J8508j0480
15154a0200o142O440Q545P237j1747J0221J5196J7923m8060K553Q089l5701K2058
15141a3588K8937k7756j2553L1121l873l726J3762o139j758m1554l1327K1622
$$ plain form
15129 -46832 10215 37269 27511 33439 11103 -6554 10032 45787 71053 33339 13976 2367
15117 2367 -10659 -40579 -40291 -48774 -68461 -54024 -19429 -23247 -24118 -9520 16496 6961 17354
15104 17354 12832 1352 17895 13435 -18597 -2216 5696 -10974 -18363 -14533 -38931 -15025 -11024
15091 -11024 7928 18082 2635 8116 -12967 -23133 -4102 10387 -13368 3810 22295 16933
15079 16933 30211 29340 10197 19750 50582 56034 18769 -15693 -25590 -11931 -8518 -15316 -11377
15066 -11377 -16151 -37902 -48634 -51060 -62183 -46653 -46225 -29923 -26537 -58942 -55168 -42052 -41722
15053 -41722 -55514 -37505 -45937 -54008 -41701 -15554 9192 11757 12242 19576 -1018 -23639 -13944
15040 -13944 609 -9262 -46007 -62442 -21398 8491 26905 41948 8984 -31863 -60206 -36770
$$ packed form
15129d6832N7047K7054r758N928k2336j7657J6586L5755K5266l7714j9363j1609
15117B367j3026k9920K88q483j9687J4437L4595l818q71J4598K6016r535J0393
15104A7354m522j1480J6543m460l2032J6381P912j6670p389L830k4398K3906M001
15091a1024J8952J0154j5447N481k1083j0166J9031J4489k3755J7178J8485n362
15079A6933J3278q71j9143R553L0832N452l7265l4462r897J3659L413o798L939
15066a1377m774k1751j0732k426j1123J5530M28J6302L386l2405L774J3116L30
15053d1722j3792J8009q432q071J2307K6147K4746K565M85P334k0594k2621R695
15040a3944J4553r871l6745j6435M1044K9889J8414J5043l2964m0847k8343K3436
$$ plain form
15028 -36770 -15979 -23457 -34569 -37051 -38059 -39751 -27859 -10303 -25176 -35190 -39722 -55691 -54809
15015 -54809 -49198 -24235 -11938 -9325 -9781 15392 11617 -5335 -22182 9193 28569 28346 -20210
15002 -20210 -29601 2545 25898 6471 -8899 -16032 -15521 15948 4464 -23937 -29003 -27236 -23394
14989 -23394 10747 7663 -4271 -9984 -39652 -28554 8460 32552 23321 -21618 -35696 -49089
14977 -49089 -62966 -49050 -36870 -21416 -26304 -13645 25618 22903 -4267 4191 5093 27376 10255
14964 10255 -28661 -28149 -14200 -10683 -25670 -17157 11995 15973 -7464 -3630 10008 11532 7411
14951 7411 -1624 11094 14838 7238 21726 32792 46385 41633 40278 8174 -4793 -2236 26750
14938 26750 39525 14519 8975 -4084 7098 31539 30380 36879 31401 13433 -8497 -9149 -5761
$$ packed form
15028c6770K0791p478j1112k482j008j692J1892J7556j4873j0014m532j5969Q82
15015e4809N611K4963J2297K613m56K5173l775j6952j6847L1375J9376k23m8556
15002b0210r391L2146K3353j9427j5370p133N11L1469j1484k8401n066J767L842
14989b3394L4141l084j1934n713k9668J1098L7014K4092r231m4939j4078j3393
14977d9089j3877J3916J2180J5454m888J2659L9263k715k7170Q458R02K2283j7121
14964A0255l8916N12J3949L517j4987Q513K9152L978k3437L834J3638J524m121
14951G411r035J2718L744p600J4488J1066J3593m752j355l2104j2967K557K8986
14938B6750J2775k5006n544j3059J1182K4441j159O499n478j7968k1930o52L388
$$ plain form
14925 -5761 -43990 -52236 -42290 -33631 -25776 -26786 -23641 -33616 -14807 -25015 -50751 -44375 -39992 -26618
14911 -26618 -4205 -20341 -15641 7915 -138 -5980 -46032 -42083 -33206 -1287 2898 -4667 -8394
14898 -8394 -32044 -40500 -41434 -29052 4086 7589 -4245 10180 2286 -25322 -52465 -63517 -87510
14885 -87510 -101363 -79349 -36954 -14892 -26216 -14129 -7071 -29816 -40636 -30343 -3996 -1933
14873 -1933 -12803 -4318 -15501 -37002 -36260 -26642 -17026 -23301 -25951 -6312 -12775 -11060 -22052 -42790
14859 -42790 -31508 -10942 -14698 -10638 6571 27312 12343 -18137 -25683 -28168 -50008 -88395
14847 -88395 -62020 -30290 -25927 -17096 7412 -11421 -28932 -4624 6902 8971 27718 37811
14835 37811 11691 -8745 -7391 -39188 -44514 -46082 -20021 -18045 -7006 -378 4176 10747 812
$$ packed form
14925e761l8229q246R946Q659P855j010L145r975J8809j0208k5736O376M383J3374
14911b6618K2413j6136M700K3556q053n842m0052L949Q877L1919M185p565l727
14898h394k3650q456r34J2382L3138L503j1834J4425p894k7608k7143j1052k3993
14885h7510j3853K2014M2395K2062j1324J2087P058k2745j0820J0293K6347K063
14873a933j0870Q485j1183k1501P42R618R616o275k650J9639o463J715j0992k0738
14859d2790J1282K0566l756M060J7209K0741j4969l0480p546k485k1840l8387
14847h8395K6375L1730M363Q831K4508j8833j7511K4308J1526K069J8747J0093
14835C7811k6120k0436J354l1797n326j568K6061J976J1039O628M554O571r935
$$ plain form
14822 812 -11337 -11791 2671 25718 11499 -11551 -20626 5634 8153 -2912 8679 26929 3496
14809 3496 24900 61739 87306 75153 71933 53542 33784 37739 29180 16958 2265 -12724
14797 -12724 -49487 -57485 -21037 17721 23113 14058 423 -13335 7280 22049 35215 47330
14785 47330 60205 51073 29155 19478 52311 49148 24251 20026 23600 21920 28597 41134 46138
14772 46138 17387 -1126 -23312 -50598 -46224 -31447 -27084 -71762 -55939 -24750 -21230 -29587
14760 -29587 -38170 -50938 -52819 -52853 -22103 -14013 14728 36048 21712 3574 -30952 -31953 -983
14747 -983 20278 26420 7608 2751 -8694 17218 6416 34469 73497 31825 -5643 -19509
14735 -19509 -18353 -9325 -21101 -28100 -22566 -1733 21563 26667 4837 -27836 -32080 -42634 -49423
$$ packed form
14822H12j2149m54J4462K3047j4219k3050r075K6260K519j1065J1591J8250k3433
14809C496K1404L6839K5567j2153l220j8391j9758L955q559j2222j4693j4989
14797a2724l6763p998L6448L8758N392r055j3635j3758K0615J4769J3166J2115
14785D7330J2875r132k1918r677L2833l163k4897m225L574j680O677J2537N004
14772D6138k8751j8513k2186k7286M374J4777M363m4678J5823L1189L520q357
14760b9587q583j2768j881l4L0750Q090K8741K1320j4336j8138l4526j001L0970
14747i83K1261O142j8812m857j1445K5912j0802K8053L9028m1672l7468j3866
14735a9509J156R028j1776o999N534K0833K3296N104k1830l2673m244j0554o789
$$ plain form
14722 -49423 -42390 -51026 -61014 -60139 -27845 -8831 -25486 -16432 -23263 -33362 -9326 1460 16759
14709 16759 24427 29216 -2476 115 6046 5001 15767 41792 44037 2609 -60 7258 5869
14696 5869 14857 13608 10436 24423 18264 31011 24849 29382 30181 35191 17325 16667 5564 -5753
14682 -5753 -13847 -41460 -71013 -71834 -63564 -43204 -24543 -12934 9943 1430 -2605 -3447 -16037
14669 -16037 -17194 -21138 -33519 -19436 9221 5226 17089 32198 6693 -4424 2891 15053
14657 15053 30213 40248 37121 17232 11426 16098 22883 13904 -3969 -34273 -20207 -9139 -27165
14644 -27165 -5206 37225 31623 32344 17917 -6358 -12307 -16962 -16406 -19651 -12488 17850 13397 -6963
14630 -6963 -22072 17719 41531 5728 -30066 -23683 -15643 -5572 -12072 -21798 -20557 2303 1708
$$ packed form
14722d9423P033q636r988Q75L2294J9014j6655R054o831j0099K4036J0786J5299
14709A6759P668M789l1692K591N931j045J0766K6025K245m1428k669P318j389
14696E869Q988j249l172J3987o159J2747o162M533P99N010j7866o58j1103j1317
14682e753q094k7613k9553q21Q270K0360J8661J1609K2877q513m035q42j2590
14669a6037j157l944j2381J4083K8657l995J1863J5109k5505j1117P315J2162
14657A5053J5160J0035l127j9889n806M672O785q979j7873l0304J4066J1068j8026
14644b7165K1959M2431n602P21j4427k4275n949m655N56l245P163L0338m453k0360
14630f963j5109L9791K3812l5803l5794O383Q040J0071o500r726J241K2860n95
$$ plain form
14617 1708 -6104 -23872 -858 19462 28960 38377 13982 8118 12442 9502 1924 -11906 873
14604 873 -24157 -18335 -14452 -2978 -27780 -37474 -2692 1012 -14952 -33929 -23254 -46013 -45085
14591 -45085 -23910 10326 1948 -4689 -8363 -9722 -24739 -37343 -30379 5583 17429 -5479 -18128
14578 -18128 -37438 -36152 -24366 -51174 -51625 -19997 -20007 5964 -14367 -1246 2971 16747 22347
14565 22347 12346 9497 15081 4787 22336 633 -21831 -25770 -10015 -13990 -31606 -7395
14553 -7395 12442 39628 44785 45078 25492 13756 7935 -21880 -46321 -40312 -28712 -38044 -26058
14540 -26058 -6802 -19733 -17965 -11385 -45630 -36889 -21437 20623 14966 1265 17746 16865 11294
14527 11294 15138 18241 27499 13396 5911 -7723 -21690 4964 3202 -19543 -11062 1127 20748
$$ packed form
14617A708p812j7768K3014K0320R498R417k4395n864M324k940p578j3830J2779
14604H73k5030N822L883J1474k4802r694L4782L704j5964j8977J0675k2759R28
14591d5085K1175L4236q378o637l674j359j5017j2604O964L5962J1846k2908j2649
14578a8128j9310J286J1786k6808m51L1628j0K5971k0331J3121M217J3776N600
14565B2347j0001k849N584j0294J7549k1703k2464l939J5755l975j7616K4211
14553g395J9837K7186N157K93j9586j1736n821k9815k4441O009J1600r332J1986
14540b6058J9256j2931J768O580l4245Q741J5452M2060n657j3701J6481q81n571
14527A1294L844L103R258j4103p485j3634j3967K6654j762k2745Q481J2189J9621
$$ plain form
14514 20748 13410 2472 -2109 -31790 -37941 -24291 3132 11906 -9414 -25730 -25896 -29945 -62
14501 -62 55741 57927 27002 -1952 15985 20000 42352 34466 32771 60692 101630 99847 81890
14488 81890 56460 36489 20644 6589 2795 -33582 -69727 -35670 -5047 6227 3282 -11345
14476 -11345 -22086 -35996 -43511 -25967 -14518 2808 38547 37229 26220 35876 46426 39673
14464 39673 18175 -24078 -26683 -13594 6566 4770 -571 15332 29899 -20300 -50464 -39709
14452 -39709 -36005 -33688 -39749 -50974 -47790 -29748 -3301 31495 17446 -9112 -31280 -18067
14440 -18067 16133 13029 1028 -1262 4470 27742 31191 -4504 -25358 5591 59557 53529 34748
14427 34748 23451 14838 -11870 -48579 -44138 -8684 30436 25261 26357 14896 -6800 -31085
$$ packed form
14514B0748p338j0938m581k9681o151J3650K7423Q774k1320j6316j66m049K9883
14501f2N5803K186l0925k8954J7937M015K2352p886j695K7921M0938j783j7957
14488H1890k5430j9971j5845j4055l794l6377l6145L4057L0623J1274k945j4627
14476a1345j0741j3910p515J7544J1449J7326L5739j318j1009R656J0550o753
14464C9673k1498m2253k605J3089K0160j796n341J5903J4567n0199l0164J0755
14452c9709L704K317o061j1225L184J8042K6447L4796j4049k6558k2168J3213
14440a8067L4200l104j2001k290N732K3272L449l5695k0854L0949N3966o028j8781
14427C4748j1297q613k6708l6709M441L5454L9120n175J096j1461k1696k4285
$$ plain form
14415 -31085 -32433 -32886 -65008 -58748 -16184 4415 -11330 -21678 -33028 -55136 -27867 -189
14403 -189 6749 18325 24647 28694 20565 11836 -222 -18744 -10927 -6500 -16980 -31636 -34817 -40210
14389 -40210 -53415 -43311 -38885 -14344 -5695 6916 21890 29975 58174 37743 13086 10321
14377 10321 4372 -33784 -15465 25842 8973 3019 -21134 -19953 -2141 7934 11283 9206 -4705
14364 -4705 -11281 5922 -12451 -24757 -25123 -24838 -7879 -6630 19234 11975 -13462 7971 14848
14351 14848 11585 15770 36979 32284 35628 23484 10690 -9482 -4325 -7669 -7351 -3842 -28613
14338 -28613 -32550 -12749 23444 27733 27 6475 5180 2485 11854 16357 8225 -16268 -23672
14325 -23672 -24854 -37752 -43862 -42965 -54558 -61648 -63061 -81828 -76014 -63777 -54447 -41492 -30554
$$ packed form
14415c1085j348m53l2122O260M2564K0599j5745j0348j1350k2108K7269K7678
14403a89O938J1576O322M047q129q729j2058j8522P817M427j0480j4656l181n393
14389d0210j3205J0104M426K4541Q649J2611J4974Q085K8199k0431k4657k765
14377A0321n949l8156J8319M1307j6869n954k4153J181J7812J0075L349k077j3911
14364d705o576J7203j8373j2306l66K85J6959J249K5864p259k5437K1433O877
14351A4848l263M185K1209m695L344j2144j2794k0172N157l344L18L509k4771
14338b8613l937J9801L6193M289k7706O448j295k695R369M503q132k4493p404
14325b3672j182j2898o110Q97j1593p090j413j8767N814J2237R330J2955J0938
$$ plain form
14312 -30554 -63149 -59478 -32179 -10965 -46090 -82869 -64497 -36487 -20686 -3136 2072 -16627
14300 -16627 -32868 -34502 -10925 15207 -2462 -20040 -18299 -33301 -9898 4847 24589 8409
14288 8409 1549 4316 4493 4823 7796 -1275 13629 15616 9463 -7033 -8815 645 -24719 -14844
14274 -14844 25397 45328 75595 69063 46170 24447 21113 27835 55483 51031 27971 -3210
14262 -3210 -6687 -23962 -26372 -24676 -19773 -13533 -12081 -18126 -41997 -46106 -32976 -31533 -6429 -2969
14248 -2969 -20216 -73214 -85038 -80062 -66434 -52895 -15668 42950 42765 8700 -5930 -2494 23295
14235 23295 25421 33187 13252 -271 5977 14679 -7748 -31562 -24510 -1679 21231 11844 -3325
14222 -3325 -17658 -31835 -23113 -8750 20620 21417 -2285 -864 6873 14432 -121 -12194 -28062
$$ packed form
14312c0554l2595L671K7299K1214l5125l6779J8372K8010J5801J7550N208j8699
14300a6627j6241j634K3577K6132j7669j7578J741j5002K3403J4745J9742j6180
14288H409o860K767J77L30K973r071J4904J987o153j6496j782R460k5364R875
14274a4844M0241J9931L0267o532k2893k1723l334O722K7648m452k3060l1181
14262c210l477j7275k410J696M903O240J452o045k3871m109J3130J443K5104L460
14248b969j7247n2998j1824M976J3628J3539L7227N8618j85l4065j4630L436K5789
14235B3295K126P766j9935j3523O248Q702k2427k3814P052K2831K2910r387j5169
14222c325j4333j4177Q722J4363K9370P97k3702J421P737P559j4553j2073j5868
$$ plain form
14209 -28062 -37705 -47051 -45885 -17440 -29695 -45066 -9525 29415 17193 26431 46981 35851
14197 35851 -17496 -67006 -52814 -18185 7095 257 -5945 -5165 -8888 -11264 -29830 -13442 -10619
14184 -10619 -36614 -39740 -40683 -34662 18046 35482 19893 -2684 -10236 -16638 -42718 -49829 -22825
14171 -22825 -7192 -517 -2738 16053 13158 7922 23012 44419 24158 18318 3064 -5284 -2998
14158 -2998 -12514 -11179 -597 13630 24366 14212 15511 1533 -11441 -39580 -44658 -37946 -59495
14145 -59495 -52054 -48959 -14148 -23773 -49154 -47244 -42170 -27115 -22409 2112 8210 8904 -23153
14132 -23153 -22261 23001 39440 51232 63454 64124 51904 20378 15402 -3442 10575 33736 45002
14119 45002 31155 -5859 -7788 -29763 -25379 -2099 -5264 1639 -10444 -32606 -11441 8384
$$ packed form
14209b8062r643r346J166K8445j2255j5371L5541L8940j2222R238K0550j1130
14197C5851n3347m9510J4192L4629K5280o838o202P80l723k376j8566J6388K823
14184a0619k5995l126r43O021N2708J7436j5589k2577p552o402k6080p111K7004
14171b2825J5633O675k221J8791k895n236J5090K1407k0261n840j5254q348K286
14158b998r516J335J0582J4227J0736j0154J299j3978j2974k8139n078O712k1549
14145e9495P441L095L4811r625k5381J910N074J5055M706K4521O098O94l2057
14132b3153Q92M5262J6439J1792J2222O70j2220l1526m976j8844J4017K3161J1266
14119D5002j3847l7014j929k1975M384K3280l165O903j2083k2162K1165J9825
$$ plain form
14107 8384 -1502 13094 40228 40204 15389 -15828 -31477 -45879 -30866 -12669 -11125 -64 22908
14094 22908 25048 17903 18534 -7836 -18077 -6417 -1505 -22031 -20600 -8255 -14723 -10051 10500
14081 10500 -434 -342 11198 18901 39328 45736 46149 53882 41298 15714 19682 3150 -16161
14068 -16161 -28372 -12650 14180 33211 48831 33652 20184 13719 -23871 -42003 -36081 -32758
14056 -32758 -36928 -35345 -10735 20212 8416 29019 35679 19050 -15159 -88048 -93761 -97206 -73313
14043 -73313 -40149 -24858 -44241 -39375 -61154 -59546 -35708 -12901 -17846 -9345 16995 9088 -939
14030 -939 -12290 -2312 22053 57982 48786 54049 39812 20728 1038 -18586 -18337 -21381 -33189
14017 -33189 -21401 -10773 2230 -402 -7761 -25581 -21341 -18076 -17400 -13191 16779 13474 -13880
$$ packed form
14107H384r886J4596K7134k4k4815l1217j5649j4402J5013J8197J544J1061K2972
14094B2908K140p145O31k6370j0241J1660M912k0526J431J2345o468M672K0551
14081A0500j0934R2J1540P703K0427O408M13P733j2584k5584L968j6532j9311
14068a6161j2211J5722K6830J9031J5620j5179j3468o465l7590j8132N922L323
14056c2758m170J583K4610L0947j1796K0603O660j6629l4209p2889n713l445K3893
14043g3313L3164J5291j9383M866k1779J608K3838K2807m945Q501K6340p907j0027
14030i39j1351R978K4365L5929r196N263j4237j9084j9690j9624K49l044j1808
14017c3189J1788J0628J3003k632p359j7820M240L265O76M209K9970l305k7354
$$ plain form
14004 -13880 -12248 -36704 -57640 -50747 -27763 -16508 7553 18664 3050 -27793 -8774 5190
13992 5190 18037 -5358 -34448 -26606 -26522 -1755 23375 28956 12919 9785 15784 -29038 -38128
13979 -38128 -33545 -51395 -27849 10607 -15124 -26941 2761 9303 -14573 -38872 -48188 -50420
13967 -50420 -56702 -38661 -6030 23839 13815 11437 12433 -2041 4326 -19700 -51590 -60050 -48500
13954 -48500 -12902 -2128 7045 7882 7379 -26595 -23741 -15562 734 13285 17387 -3220 -44005
13941 -44005 -60442 -66976 -75268 -48200 -27634 9665 31735 21846 17720 70613 77383 76661 68136
13928 68136 8829 -15650 -15428 -5584 5218 16338 14351 37764 37389 14442 -487 7031 2652
13915 2652 -20850 -22455 -26797 -22471 14661 65704 62874 32878 3161 -8365 16146 56706 42846
$$ packed form
14004a3880J632k4456k0936O893K2984J1255K4061J1111j5614l0843J9019J3964
13992E190J2847k3395k9090P842Q4K4767K5130N581j6037l134N999m4822r090
13979c8128M583j7850K3546L8456k5731j1817K9702O542k3876k4299r316k232
13967e0420o282J8041L2631K9869j0024k378R96j4474O367k4026l1890q460J1550
13954d8500L5598J0774R173Q37n03l3974K854Q179J6296J2551M102k0607m0785
13941d4005j6437o534q292K7068K0566L7299K2070r889m126N2893O770p22q525
13928F8136n9307k4479K22R844J0802J1120j987K3413l75k2947j4929P518m379
13915B652k3502j605m342M326L7132N1043k830k9996k9717j1526K4511M0560j3860
$$ plain form
13902 42846 20892 21299 9349 6982 11663 32576 79223 107776 59117 27331 26866 31975 29824
13889 29824 -11715 -38516 -38105 -6082 12611 -10532 -19103 -22439 3762 25814 1748 -36106
13877 -36106 -43267 -29403 -21404 -46860 -36336 -17276 -37079 -52341 -29283 -17549 -8178 -27303
13865 -27303 -33765 -24263 -25924 -23587 3831 28870 35509 18525 23074 27613 34591 25375 31021 29762
13851 29762 55023 58319 37751 46269 41570 8944 9984 1048 -26479 -21287 2105 -7771 -36361
13838 -36361 -45621 -19422 13778 22727 -9303 -22141 -9800 -2089 -7178 963 9325 4178 22304
13825 22304 38208 28597 41787 16896 -3261 -44557 -50510 -41772 -34055 -43517 -33647 -30640 -32332
13812 -32332 -16381 -53879 -60460 -42530 -57508 -56365 -41202 -19169 -13971 -10574 -19228 10514 16647
$$ packed form
13902D2846k1954M07j1950k367M681K0913M6647K8553m8659l1786m65N109k151
13889B9824m1539k6801M11L2023J8693k3143q571l336K6201K2052k4066l7854
13877c6106p161J3864P999k5456J0524J9060j9803j5262K3058J1734R371j9125
13865b7303o462R502j661K337K7418K5039O639j6984M549M539O978r216N646j259
13851B9762K5261L296k0568Q518m699l2626J040q936k7527N192K3392r876k8590
13838c6361r260K6199L3200Q949l2030j2838J2341P711n089Q141Q362n147J8126
13825B2304J5904r611J3190k4891k0157m1296n953Q738P717r462R870L007j692
13812c2332J5951l7498o581J7930j4978J143J5163K2033N198L397q654K9742O133
$$ plain form
13799 16647 -37125 -44972 -23037 22800 35506 51586 45997 13045 -2376 -626 18919 18794 20143
13786 20143 3416 -6475 -32473 -52025 -56434 -50005 -13075 4578 9495 -6110 -28909 -21552 3614
13773 3614 -12304 -43396 -53685 -38213 -11539 -22232 -23569 6961 20055 5838 30356 34337
13761 34337 12637 -22501 -43335 -55384 -27225 -3510 -8976 -23139 -18839 5910 4163 8607
13749 8607 298 -16781 -22440 -14922 -23389 -18429 -33484 -59221 -71426 -56302 -51984 -49531 -39729
13736 -39729 -61531 -66943 -51704 -34666 219 17395 18421 -13623 -23737 -11213 2986 1813
13724 1813 -10645 13780 9174 14700 22573 -10939 -32160 -14627 16259 642 -3560 1650 -18407
13711 -18407 -14015 24829 25525 5551 -4699 -5927 -26163 -16619 -10351 -27725 -32479 -18599 -9604
$$ packed form
13799A6647n3772p847K1935M5837J2706J6080n589l2952j5421J750J9545j25J349
13786B0143j6727r891k5998j9552m409O429L6930J7653M917j5605k2799P357K5166
13773C614j5918l1092j0289J5472K6674j0693j337L0530J3094j4217K4518L981
13761C4337k1700l5138k0834j2049K8159K3715n466j4163M300K4749j747M444
13749H607q309j7079n659P518q467M960j5055k5737j2205J5124M318K453R802
13736c9729k1802n412J5239J7038L4885J7176J026l2044j0114J2524J4199j173
13724A813j2458K4425m606N526P873l3512k1221J7533L0886j5617m202N210k0057
13711a8407M392L8844O96j9974j0250j228k0236R544O268j7374m754J3880Q995
$$ plain form
13698 -9604 27032 27396 24124 26721 48202 34103 23194 65136 71500 28702 31452 42927 17655
13685 17655 -19196 -31293 -22175 -16289 34240 27225 27137 25950 -13360 -44826 5240 35231 18155
13672 18155 -23312 -36920 -21698 -25730 -24738 -24928 -37168 -27434 -1480 -7865 -20508 -6153 -20068
13659 -20068 -29897 -35432 -19422 11148 1937 -21279 -5250 2103 -3162 10336 4703 41940 53924
13646 53924 52968 31552 35741 24306 -10757 -32016 -12865 15261 18302 18201 12635 -3768 -5900
13633 -5900 -15731 -20467 -16469 -9446 3057 3552 -21961 -28000 -15440 -6845 -30026 -65011 -61110 -43186
13619 -43186 -42002 -16103 10396 -14040 -36171 -40028 -20073 -4199 -21639 5967 6055 -31584 -37668
13606 -37668 -7752 3182 -6972 -26765 -16059 4523 -6753 -19410 -38522 -63293 -31684 -5587
$$ packed form
13698i604L6636L64l272K597K1481j4099j0909M1942O364m2798K750J1475k5272
13685A7655l6851j2097R118N886N0529p015q8j187l9310l1466N0066K9991j7076
13672A8155m1467j3608J5222m032R92j90j2240R734K5954o385j2643J4355j3915
13659b0068r829n535J6010L0570r211k3216J6029P353n265J3498n633L7237J1984
13646E3924r56k1416M189j1435l5063k1259J9151K8126L041j01n566j6403k132
13633e900r831m736L998P023J2503M95k5513o039J2560Q595k3181l4985L901J7924
13619d3186J184K5899K6499k4436k2131l857J9955J5874j7440K7606Q8l7639o084
13606c7668K9916J0934j0154j9793J0706K0582j1276j2657j9112k4771L1609K6097
$$ plain form
13594 -5587 8869 14296 19795 31621 33172 27808 3404 -14820 -94 -5845 -1998 -13329 -39822
13581 -39822 -33408 -48901 -50183 -11492 14069 37871 33284 14316 3376 -14150 36821 35241
13569 35241 43772 38165 38572 62054 71992 33540 1611 19641 29214 47220 61356 38817 8022
13556 8022 -11851 -77 6461 35460 54598 39681 38420 33162 46965 21922 -6108 -39655
13544 -39655 -28015 -18824 -13130 -1455 27167 21559 21282 25154 12019 -4818 -25826 -4388 -14608
13531 -14608 -23969 -13545 -10573 15166 23438 23956 -2797 -11102 5415 33487 23759 -12836 -16842
13518 -16842 -25140 -8807 13686 37200 58135 61197 63601 63872 44054 29310 26197 41579 29660
13505 29660 24499 29422 38111 20746 9369 7785 1494 6869 -1943 -21155 -24450 -19873 -28459 -28129
$$ packed form
13594e587J4456N427N499J1826J551n364k4404j8224J4726n751L847j1331k6493
13581c9822O414j5493j282L8691K5561K3802m587j8968j0940j7526N0971j580
13569C5241Q531n607M07K3482R938l8452l1929J8030R573J8006J4136k2539l0795
13556H022j9873J1774O538K8999J9138j4917j261n258J3803k5043k8030l3547
13544c9655J1640R191N694J1675K8622n608k77L872j3135j6837k1008K1438j0220
13531a4608r361J0424K972K5739Q272N18k6753q305J6517K8072r728l6595m006
13518a6842q298J6333K2493K3514K0935L062K404K71j9818j4744l113J5382j1919
13505B9660n161M923Q689j7365j1377j584o291N375q812j9212l295M577q586L30
$$ plain form
13491 -28129 -18998 -21365 -15017 -11494 9855 -5425 -3329 -28878 1668 39409 37711 21656 26347
13478 26347 12423 11240 4156 -32184 -39667 -61081 -45946 -24335 -27223 -28520 -33218 -34520 6854
13465 6854 26083 22139 16463 -18872 -27783 -40247 -26746 -12447 -32599 -22218 -711 3387 -4097
13452 -4097 -7665 -12649 -17878 -26023 -12517 18931 17871 12897 -6295 -26420 2262 21361 34444
13439 34444 21633 12405 18179 37246 30780 4458 -33664 -56881 -67243 -67387 -76595 -86283 -52797
13426 -52797 -23187 -46756 -43992 -26414 2013 14833 20948 15854 -16711 -47736 -6669 38496
13414 38496 50351 26214 11344 35339 48199 9261 -133 11684 24185 16819 5002 5738
13402 5738 -11302 -14950 -29387 -45022 -44329 6714 -4475 -8919 -5269 -35048 -39697 -17083 -10377
$$ packed form
13491b8129R131k367O348L523K1349j5280K096k5549L0546L7741j698j6055M691
13478B6347j3924j183p084l6340p483k1414J5135K1611k888j297m698j302M1374
13465F854J9229l944n676l5335q911j2464J3501J4299k0152J0381K1507M098p484
13452d097l568m984n229q145J3506L1448j060m974j9192k0125K8682J9099J3083
13439C4444j2811r228N774J9067o466k6322l8122k3217j0362j44r208r688L3486
13426e2797K9610k3569K764J7578K8427J2820O115n094l2565l1025M1067M5165
13414C8496J1855k4137j4870K3995J2860l8938r394J1817J2501p366j1817P36
13402E738j7040l648j4437j5635O93N1043j1189m444L650k9779m649K2614O706
$$ plain form
13389 -10377 -10251 -20298 -38584 -20701 -12984 -21707 -19433 -1129 12562 2509 32629 38766 12666
13376 12666 11900 -2001 15276 31212 33866 22145 10021 -7693 -810 4144 -11726 -23933 3806
13363 3806 9208 -4025 2186 2447 -4517 -33198 -38889 -10337 14963 26932 53355 16822 -4571
13350 -4571 2226 18314 28535 3861 -3504 -22199 -7222 -21318 -22488 -12410 -7786 -23169 -36402
13337 -36402 -18580 -29787 -30376 -41794 -50956 -40060 -18748 -7115 25903 12943 22521 19321 1162
13324 1162 -5180 1877 -7934 -2629 4894 -16361 -37204 -41895 -37380 -37332 -36934 -17503 13908 41895
13310 41895 37790 45836 29255 -18194 -9740 2271 -4128 -15922 -23178 12611 14567 -1694 26332
13297 26332 50052 32398 18298 17443 12536 -4138 -21038 -24085 -21889 -35799 -23219 -8691 526
$$ packed form
13389a0377J26j0047j8286J7883P717q723K274J8304J3691j0053L0120O137k6100
13376A2666p66j3901J7277J5936K654j1721j2124j7714O883M954j5870j2207K7739
13363C806N402j3233O211K61o964k8681n691K8552K5300J1969K6423l6533k1393
13350d571O797J6088J0221k4674p365j8695J4977j4096j170J0078M624j5383j3233
13337c6402J7822j1207n89j1418r162J0896K1312J1633L3018j2960R578l200j8159
13324A162o342P057r811N305P523k1255k0843m691M515M8L98J9431L1411K7987
13310D1895m105Q046j6581m7449Q454J2011o399j1794p256L5789J956j6261K8026
13297B6332K3720j7654j4100q55m907j6674j6900l047K196j3910J2580J4528R217
$$ plain form
13284 526 22474 18595 4701 -19362 -38546 -35618 -30026 -3548 -12084 15325 -9434 -21793 -43940
13271 -43940 -57748 -60094 -63830 -60786 -55985 -14077 4423 438 1550 12249 13038 632 25692
13258 25692 46286 41163 -2018 -1790 -16145 -30460 -18381 -15002 -50937 -67600 -59928 -61256 -40755
13245 -40755 -10397 13642 28211 -15406 -33474 13351 48596 63821 24116 -329 2106 22176
13233 22176 30482 30290 2337 -11368 487 3649 -4125 16534 12211 -15245 -10382 10034 36497
13220 36497 35195 19761 15155 8305 5594 -12396 -23919 -6668 3270 10273 -12697 -28944 -16435
13207 -16435 8900 6096 -1213 -1599 10054 21643 -26085 -41556 -16417 -13654 1120 23610 -11008
13194 -11008 -17363 -16533 -17582 -23932 -11229 -5126 10968 24461 28642 15335 25412 23541 19514
$$ packed form
13284E26K1948l879j3894k4063j9184K928N592K6478q536K7409k4759j2359k2147
13271d3940j3808k346l736L044M801M1908J8500l985J112J0699P89j2406K5060
13258B5692K0594n123m3181K28j4355j4315J2079L379l5935j6663P672j328K0501
13245d0755L0358K4039J4569m3617j8068M6825L5245J5225l9705k4445K435K0070
13233B2176Q306j92k7953j3705J1855L162p774K0659m323k7456M863K0416K6463
13220C6497j302j5434m606o850k711j7990j1523J7251R938P003k2970j6247J2509
13207a6435K5335k804p309l86J1653J1589m7728j5471K5139K763J4774K2490l4618
13194a1008o355Q30j049o350J2703O103J6094J3493M181j3307J0077j871m027
$$ plain form
13181 19514 12537 7512 28028 21560 22064 34344 35905 41131 27414 46605 36193 56369 17458
13168 17458 -32471 -29998 -33303 -22589 -36062 -62162 -33374 -5377 1088 -20118 -21457 -12940 -21854
13155 -21854 -2092 39780 67783 74578 56024 69302 68552 29417 3658 2162 7840 10277 -11502
13142 -11502 -13382 -27214 -50021 -52647 -21459 2559 -6250 13131 14210 11322 20893 27476 25256
13129 25256 15307 15038 9943 25085 7358 -25744 -6626 19153 -7578 1715 -9830 -19793 -20014
13116 -20014 -10602 14039 -25521 -37500 -21955 -10944 -4331 -9334 22598 52462 41996 19923
13104 19923 19111 11575 2050 -14921 -1202 7093 15 2156 16500 14675 32857 20040 8282
13091 8282 2048 -10785 -40304 -40222 -3388 484 -8296 16873 6480 19691 42729 20983 23159
$$ packed form
13181A9514o977n025K0516o468N04J2280J561N226j3717J9191j0412K0176l8911
13168A7458m9929K473l305J0714j3473k6100K8788K7997O465k1206j339Q517q914
13155b1854J9762M1872K8003O795j8554J3278p50l9135k5759j496N678K437k1779
13142a1502j880j3832k2807k626L1188K4018q809J9381J079k888R571O583k220
13129B5256r949k69n095J5142j7727l3102J9118K5779k6731R293j1545r963k21
13116b0014R412K4641l9560j1979J5545J1011O613n003L1932K9864j0466k2073
13104A9923q12p536r525j6971J3719Q295p078K141J4344j825J8182j2817j1758
13091H282o234j2833k9519Q2L6834L872q780K5169j0393J3211K3038k1746K176
$$ plain form
13078 23159 18592 -9222 -13708 -2798 -7379 -909 -1524 -19718 -4829 10008 7304 16465 14063
13065 14063 12234 42046 37150 45716 65129 56395 68900 70585 59712 53023 72404 50712 27971
13052 27971 17175 32153 50323 66819 55206 39445 33557 32148 41300 44100 33392 18426
13040 18426 -10932 -8087 -7735 -14353 -82 8224 20581 12509 -1199 25335 45107 61762 41711
13027 41711 25491 28581 25205 24927 11505 9882 20582 21033 14414 21474 24559 39458 28043 12611
13013 12611 8287 6275 1991 -5878 -24040 -29570 6370 3491 -14639 -18033 4386 14551 9087
13000 9087 10191 29010 47089 70637 57988 67816 67259 51507 -2739 -7588 12846 17566 13816
12987 13816 719 -10469 4771 2890 5611 5350 35898 49910 39043 19693 26473 -1681 -4631
$$ packed form
13078B3159m567k7814m486J0910m581O470o15j8194J4889J4837k704R161k402
13065A4063j829K9812m896Q566J9413q734J2505J685j0873o689J9381k1692k2741
13052B7971j0796J4978J8170J6496j1613j5761n888j409R152K800j0708j4966
13040A8426k9358K845L52o618J4271Q306J2357q072j3708K6534J9772J6655k0051
13027D1711j6220L090l376k78j3422j623J0700M51o619P060L085J4899j1415j5432
13013A2611m324k012m284p869j8162n530L5940k879j8130l394K2419J0165n464
13000I087J104J8819J8079K3548j2649R828n57j5752n4246m849K0434M720l750
12987A3816j3097j1188J5240j881K721k61L0548J4012j0867j9350O780k8154k950
$$ plain form
12974 -4631 27057 47832 47853 5688 23611 51325 55534 50460 17505 -6738 2950 9050 4824
12961 4824 22687 29484 9004 -16341 -13745 -522 1147 22330 28768 25538 19279 -5888 25792
12948 25792 38826 49854 70629 88600 71263 72614 62921 68277 63975 51751 11475 -587
12936 -587 7564 7286 9078 2359 -1377 7981 22899 32751 16529 -10611 -35575 -9024 10897 -4600
12922 -4600 -39044 -22487 12386 15392 19196 31358 48811 74676 54392 32565 27626 38736
12910 38736 62092 64859 58253 79841 102407 116167 109255 39824 16785 18798 25521 41236 44235
12897 44235 42578 15813 21804 40261 30148 4068 -12706 837 11663 32174 38816 2152
12885 2152 -16600 36862 65488 61183 8417 11004 46038 35413 40687 68543 92381 62873
$$ packed form
12974d631L1688K0775K1m2165J7923K7714M209n074l2955k4243R688O100m226
12961D824J7863O797k0480k5345K596J3223J669K1183O438l230o259k5167L1680
12948B5792J3034J1028K0775J7971j7337J351r693N356m302j2224m0276j2062
12936e87Q151k78J792o719l736R358J4918R852j6222k7140k4964K6551J9921j5497
12922d600l4444J6557L4873L006L804J2162J7453K5865k0284k1827m939J1110
12910C8736K3356K767o606K1588K2566J3760o912o9431k3039K013O723J5715K999
12897D4235j657k6765N991J8457j0113k6080j6774J3543J0826K0511O642l6664
12885B152j8752N3462K8626m305n2766K587L5034j0625N274K7856K3838k9508
$$ plain form
12873 62873 59360 70964 61407 63382 49470 22593 4219 30042 49073 40907 34148 27271 18369
12860 18369 22176 41758 20501 39910 55007 56861 48392 87978 88763 16470 14263 35979 27652
12847 27652 6667 3602 22189 43621 63200 60824 57608 68784 60561 77696 76883 74388 90040
12834 90040 77966 49048 51433 67023 88316 66592 49728 42125 32299 63120 48978 13763
12822 13763 23460 46161 34335 34589 49871 35666 21251 39469 38363 3455 -14610 -4562
12810 -4562 -7341 -33647 10224 27971 37789 60080 89673 72123 57156 58316 53685 60989 53960
12797 53960 43964 40058 53769 58367 42097 31547 20395 13538 9122 3513 26818 25107 34065
12784 34065 14750 32138 53004 55713 43905 20118 12952 -6580 -27800 18217 46862 63875
$$ packed form
12873F2873l513J1604r557J975j3912k6877j8374K5823J9031q166o759o877q902
12860A8369L807J9582k1257J9409J5097J854q469L9586P85p2293k207K1716q327
12847B7652k0985l065J8587K1432J9579k376l216J1176q223J7135q13k495J5652
12834I0040j2074k8918K385J5590K1293k1724j6864p603r826L0821j4142l5215
12822A3763R697K2701j1826K54J5282j4205j4415J8218j106l4908j8065J0048
12810d562k779k6306M3871J7747R818K2291K9593j7550j4967J160m631P304p029
12797E3960r996l906J3711M598j6270j0550j1152o857m416n609K3305j711Q958
12784C4065j9315J7388K0866K709j1808k3787p166j9532k1220M6017K8645J7013
$$ plain form
12772 63875 52495 35016 23737 10043 31171 57348 60556 68013 95564 90604 88283 103088
12760 103088 107524 46138 13532 5400 33237 61720 60811 43427 52478 70709 62293 29264 -24530
12747 -24530 -14971 19622 74546 100505 93307 44355 40716 48333 36475 19218 21084 35306 21470
12734 21470 15762 45612 45577 47948 50959 71008 89029 110770 102897 70539 26355 14334 37777
12721 37777 58235 58907 44767 40601 35187 50403 55657 51793 42476 50201 58599 75516 77378 98127
12707 98127 103184 81426 38216 54503 70811 65311 77035 58829 38839 54355 79092 102973
12695 102973 84826 70528 73597 75330 80012 98794 86488 86358 99939 101937 56332 71961 59084
12682 59084 22285 37534 71072 80371 63853 55220 79764 74645 63433 70169 77440 73419 52746
$$ packed form
12772F3875j1380j7479j1279j3694K1128K6177L208P457K7551m960k321J4805
12760A03088M436o1386l2606q132K7837K8483r09j7384R051J8231q416l3029n3794
12747b4530R559L4593N4924K5959p198m8952l639P617j1858j7257J866J4222j3836
12734B1470n708K9850l5K371L011K0049J8021K1741p873l2358m4184j2021K3443
12721C7777K0458O72j4140m166n414J5216N254l864r317P725Q398J6917J862K0749
12707I8127N057k1758m3210J6287J6308n500J1724j8206j9990J5516K4737K3881
12695A02973j8147j4298L069J733M682J8782j2306j30J3581J998m5605J5629j2877
12682E9084l6799J5249L3538R299j6518q633K4544n119j1212O736P271m021k0673
$$ plain form
12669 52746 33150 23004 26800 49209 39505 45147 67279 72460 59103 36918 53197 66522
12657 66522 80833 75961 84486 103430 106191 101910 98453 93606 83498 62606 34325 29435 55775
12644 55775 56861 27322 30521 36868 32817 55396 67323 71083 103300 94393 74644 55761 52793
12631 52793 73587 96650 102750 89411 74077 107731 116253 72997 55446 43282 39581 60705
12619 60705 77197 68106 31513 8079 16715 49000 93168 72763 51309 36739 37476 63277
12607 63277 61369 46195 64743 67643 83685 79342 69763 70542 92208 105465 130630 113308 105322
12594 105322 103275 101481 116202 136258 128601 93967 89597 116437 116815 88918 77538 78025 74353
12581 74353 109151 123395 60987 65100 78999 96426 110151 86176 57086 58215 60783 64103
$$ packed form
12669E2746j9596j0146L796K2409r704N642K2132N181j3357k2185J6279J3325
12657F6522J4311m872Q525J8944K761m281l457m847j0108k0892k8281m890K6340
12644E5775J086k9539L199O347m051K2579J1927L760L2217q907j9749j8883k968
12631E2793K0794K3063O100j3339j5334L3654Q522m3256j7551j2164l701K1124
12619F0705J6492r091l6593k3434Q636L2285M4168k0405k1454j4570P37K5801
12607F3277j908j5174J8548K900J6042m343r579P79K1666J3257K5165j7322p986
12594A05322k047j794J4721K0056p657l4634m370K6840L78k7897j1380M87l672
12581G4353L4798J4244o2408M113J3899J7427J3725k3975k9090J129K568L320
$$ plain form
12569 64103 65637 54902 78668 88711 90461 95310 74815 78713 88191 74194 54621 71541 78627
12556 78627 70690 48835 39236 54201 69245 94935 94770 75965 88768 108589 117868 133117 112601
12543 112601 123182 127066 102569 86305 83465 108962 109133 97958 103473 127422 126348 99767 120789
12530 120789 131223 135522 143630 128378 129875 113754 114984 98444 69506 61305 60441 69576 106022
12517 106022 121854 125378 120246 134323 149135 140792 135913 128280 139070 122112 126919 143411 149440
12504 149440 148204 148781 160917 176218 135669 120091 130287 154728 162149 143482 150583 168435
12492 168435 143170 130444 146869 185774 165159 118287 109306 121740 137804 151906 142773 145218
12480 145218 153603 153487 126843 138816 139267 103486 112943 143121 142169 145319 136959 123615 159373
$$ packed form
12569F4103J534j0735K3766J0043J750M849k0495L898R478j3997j9573J6920P086
12556G8627p937k1855r599J4965J5044K5690j65j8805J2803J9821R279J5249k0516
12543A12601J0581L884k4497j6264k840K5497J71j1175N515K3949j074k6581K1022
12530A20789J0434M299Q108j5252J497j6121J230j6540k8938q201q64R135L6446
12517A06022J5832L524n132J4077J4812q343m879p633J0790j6958M807J6492O029
12504A49440j236N77J2136J5301m0549j5578J0196K4441P421j8667P101J7852
12492A68435k5265j2726J6425L8905k0615m6872q981J2434J6064J4102r133K445
12480A45218Q385j16k6644J1973M51l5781R457L0178r52L150q360j3344L5758
$$ plain form
12467 159373 182242 177682 169208 161198 158592 142909 164362 162410 168667 166483 161497 162994 136984
12454 136984 120672 147569 154828 162499 168214 155561 151949 138440 102704 77907 84421 109268
12442 109268 155337 160086 124171 135649 170535 174609 184776 154525 152806 172147 188829 182528
12430 182528 167357 160525 149167 143566 141865 157400 164030 168335 165178 187017 191052 168738 131455
12417 131455 122128 176221 180501 184398 210693 193087 147948 124302 92308 114580 109244 131776
12405 131776 155111 156873 137778 131659 171035 183495 174986 171420 178307 177579 176663 189155 195186
12392 195186 212805 214684 186522 164566 190166 183300 173853 153091 189723 214091 176896 167490
12380 167490 195733 192592 196769 145243 155860 199459 214907 204366 178717 161290 137505 153540
$$ packed form
12467A59373K2869m560q474q010k606j5683K1453j952O257k184m986J497k6010
12454A36984j6312K6897P259P671N715j2653l612j3509l5736k4797O514K4847
12442A09268M6069M749l5915J1478L4886M074J0167l0251j719J9341J6682o301
12430A82528j5171o832j1358n601j701J5535O630M305l157K1839M035k2314l7283
12417A31455r327N4093M280L897K6295j7606m5139k3646l1994K2272n336K2532
12405A31776K3335J762j9095o119L9376J2460q509l566O887p28r16J2492O031
12392A95186J7619J879k8162k1956K5600o866r447k0762L6632K4368l7195r406
12380A67490K8243l141M177n1526J0617M3599J5448j0541k5649j7427k3785J6035
$$ plain form
12368 153540 175596 199841 226469 232333 224624 229775 251071 238206 229749 229189 217869 209995 206045
12355 206045 184236 191213 214162 205551 214363 253567 260286 250973 249265 258296 253302 236105 222301
12342 222301 216451 220941 233023 229017 249152 263050 266364 291800 301170 282040 232950 199382
12330 199382 205258 208512 228130 257516 252730 243076 249985 246875 243253 228538 217683 245930 292706
12317 292706 311623 294085 282447 287300 267098 253756 216134 199663 235701 267079 244078 251412
12305 251412 281734 298216 287540 302899 294835 258185 252563 260878 287552 308435 290059 258179
12293 258179 243825 266767 303951 289246 283607 290485 267633 253207 283118 283703 291725 300249 316372
12280 316372 305730 325663 321559 327921 323134 301374 294562 300304 298367 334001 369222 365447 364639
$$ packed form
12368A53540K2056K4245K6628N864p709N151K1296j2865q457n60j1320p874l950
12355B06045k1809O977K2949q611Q812L9204O719r313j708R031m994j7197j3804
12342B22301n850M490J2082m006K0135J3898L314K5436R370j9130m9090l3568
12330A99382N876L254J9618K9386m786r654O909l110l622j4715j0855K8247M6776
12317B92706J8917j7538j1638M853k0202j3342l7622j6471L6038L1378k3001P334
12305B51412L0322J6482j0676J5359q064l6650n622Q315K6674K0883j8376l1880
12293B58179j4354K2942L7184j4705n639O878k2852j4426K9911N85Q022Q524J6123
12280C16372j0642J9933m104O362m787k1760o812N742j937L5634L5221l775q08
$$ plain form
12267 364639 341083 315807 328142 344553 307371 331484 322138 298852 289600 315487 303245 297173
12255 297173 320201 338716 330110 329792 315899 318403 318606 335322 347396 350868 362864 373637 369299
12242 369299 358107 361146 377581 387123 375719 367736 373892 385812 402728 397967 422004 437099
12230 437099 412318 418125 401150 392986 397238 388571 372520 372924 392554 397105 379232 398258 412667
12217 412667 426097 425619 436361 444504 449124 484147 476260 446295 427842 435223 440520 453504 454374
12204 454374 428784 459687 461648 454201 481177 474710 455985 466954 496051 495996 496818 491737 517266
12191 517266 520467 514984 505931 523632 509554 519579 530163 517382 537750 552619 528714 537503
12179 537503 563979 562772 551462 577428 603485 591811 547965 546228 607879 627394 614527 587927
$$ packed form
12267C64639k3556k5276J2335J6411l7182K4113r346k3286r252K5887j2242o072
12255B97173K3028J8515q606l18j3893K504K03J6716J2074L472J1996J0773m338
12242C69299j1192L039J6435R542j1404p983O156J1920J6916m761K4037J5095
12230D37099k4781N807j6975q164M252q667j6051M04J9630M551j7873J9026J4409
12217D12667J3430m78J0742Q143M620L5023p887k9965j8453P381N297J2984Q70
12204D54374k5590L0903J961p447K6976o467j8725J0969K9097n5Q22n081K5529
12191E17266L201n483r053J7701j4078J0025J0584j2781K0368J4869k3905Q789
12179E37503K6476j207j1310K5966K6057j1674m3846j737O1651J9515j2867k6600
$$ plain form
12167 587927 569581 584733 599428 586004 563185 579444 538188 543338 556022 563352 561998 582688
12155 582688 619412 632157 621968 602171 598504 621667 619322 611997 616776 633302 632985 605059 617424
12142 617424 656379 647741 663131 677178 664814 685135 699683 680592 698738 728163 725881 699701
12130 699701 712496 707915 706838 743765 750319 762027 770619 753760 742101 766174 760494 752298 761032
12117 761032 760288 764882 778127 809055 792176 798459 829423 833771 825049 825622 814775 820025 839452
12104 839452 838629 847334 866480 892550 899437 927780 958639 957023 960647 933267 933132 954054 967668
12091 967668 957920 952369 948022 954360 954041 936853 935750 958647 963990 973330 988111 956575 951054
12078 951054 973334 970047 951778 963139 980297 1020602 1011460 1009956 1016213 1034082 1046682 1042362
$$ packed form
12167E87927j8346J5152J4695j3424k2819J6259m1256N150J2684P330j354K0690
12155E82688L6724J2745j0189j9797l667K3163k345p325M779J6526l17k7926J2365
12142F17424L8955q638J5390J4047j2364K0321J4548j9091J8146K9425k282k6180
12130F99701J2795m581j077L6927O554J1708Q592j6859j1659K4073n680q196Q734
12117G61032p44M594J3245L0928j6879O283L0964M348q722N73j0847N250J9427
12104H39452q23Q705J9146K6070O887K8343L0859j616L624k7380j35K0922J3614
12091I67668r748n551m347O338l19j7188j103K2897N343R340J4781l1536n521
12078I51054K2280l287j8269J1361J7158M0305r142j504O257J7869J2600m320
$$ plain form
12066 1042362 1055994 1023706 1010255 1032309 1044630 1063505 1107891 1129035 1155585 1178560 1178640 1168812
12054 1168812 1192597 1214449 1241615 1259467 1209872 1201758 1232267 1266740 1299808 1305987 1302689 1280659
12042 1280659 1278706 1264588 1274458 1273836 1282908 1288071 1290971 1307943 1297727 1303850 1304283 1301611 1297724 1289994
12028 1289994 1338352 1360118 1365139 1397364 1421484 1411680 1408189 1439507 1454805 1450289 1429244 1419941
12016 1419941 1413800 1428800 1486352 1501078 1515581 1531973 1534005 1575255 1593313 1585079 1596226 1591425
12004 1591425 1591482 1580044 1596419 1628290 1640105 1659961 1661877 1647282 1649826 1643585 1654437 1657433 1669832
11991 1669832 1677222 1674928 1664965 1681521 1680004 1687899 1708409 1712547 1703052 1718839 1749917 1776112 1761704
11978 1761704 1756949 1772181 1779668 1786666 1778900 1782402 1802491 1800521 1805062 1819131 1799696 1781972 1809055
$$ packed form
12066A042362J3632l2288j3451K2054J2321J8875M4386K1144K6550K2975Q0r828
12054A168812K3785K1852K7166J7852m9595q114L0509L4473L3068O179l298k2030
12042A280659j953j4118R870o22R072N163K900J6972j0216O123M33k672l887p730
12028A289994M8358K1766N021L2225K4120r804l491L1318J5298m516k1045r303
12016A419941o141J5000N7552J4726J4503J6392K032M1250J8058q234J1147m801
12004A591425N7j1438J6375L1871J1815J9856J916j4595K544o241J0852K996J2399
11991A669832P390k294r963J6556j517P895K0510M138r495J5787L1078K6195j4408
11978A761704m755J5232P487O998p766L502K0089j970M541J4069j9435j7724K7083
$$ plain form
11965 1809055 1796612 1809130 1840084 1833937 1821410 1847085 1871706 1897171 1896608 1866330 1854908 1872013
11953 1872013 1899122 1925571 1931257 1944785 1965549 1978723 1935774 1921294 1915130 1910672 1935769 1947061
11941 1947061 1948378 1950219 1925667 1915372 1912093 1924964 1924331 1944370 1971698 1975707 1936003 1946881
11929 1946881 1992351 2006653 2036744 2023508 1999317 1995819 1981518 1976320 1960899 1959870 1958740 1957043
11917 1957043 1940236 1921420 1933249 1929486 1965615 1984959 1941100 1921156 1892220 1869702 1882709
11906 1882709 1915021 1928857 1934037 1937755 1928428 1922716 1962224 1954102 1925297 1917973 1921551 1882863 1862716
11893 1862716 1881494 1878464 1889022 1866246 1854565 1850443 1842795 1856384 1855613 1835159 1847760 1838483
11881 1838483 1838739 1828491 1826273 1827504 1821394 1823145 1808383 1788670 1771121 1788272 1797588 1780971 1757408
$$ packed form
11965A809055j2443J2518L0954o147j2527K5675K4621K5465n63l0278j1422J7105
11953A872013K7109K6449N686J3528K0764J3174m2949j4480o164m458K5097J1292
11941A947061J317J841k4552j0295l279J2871o33K0039K7328M009l9704J0878
11929A946881M5470J4302L0091j3236k4191l498j4301n198j5421j029j130j697
11917A957043j6807j8816J1829l763L6129J9344m3859j9944k8936k2518J3007
11906A882709L2312J3836N180L718r327n712L9508q122k8805p324L578l8688k0147
11893A862716J8778l030J0558k2776j1681m122p648J3589p71k0454J2601r277
11881A838483K56j0248k218J231o110J751j4762j9713j7549J7151R316j6617k3563
$$ plain form
11868 1757408 1736446 1751832 1744335 1757774 1793707 1774077 1744742 1710682 1690739 1715645 1737694
11857 1737694 1698141 1661225 1620837 1596336 1600978 1615923 1630410 1643620 1639299 1621708 1575742 1557348
11845 1557348 1520346 1515444 1499241 1481343 1458008 1436335 1452860 1455003 1483256 1480411 1463078 1413009
11833 1413009 1394606 1416429 1435291 1414013 1391935 1360582 1375182 1385657 1366298 1345182 1320255
11822 1320255 1298933 1287575 1297047 1320491 1332331 1322758 1281709 1265419 1264741 1260965 1263358 1271835 1280046
11809 1280046 1301216 1262326 1265722 1264906 1258357 1261383 1241083 1233643 1242373 1235405 1213554 1181258 1159626
11796 1159626 1147063 1143675 1151471 1134900 1135724 1134210 1109496 1103424 1134808 1134224 1144137 1158824 1118656
11783 1118656 1075133 1074981 1091124 1082441 1043337 1009423 990183 994477 1019231 1009936 964583 943209
$$ packed form
11868A757408k0962J5386p497J3439L5933j9630k9335l4060j9943K4906K2049
11857A737694l9553l6916m0388k4501M642J4945J4487J3210m321j7591m5966j8394
11845A557348l7002m902j6203j7898k3335k1673J6525K143K8253k845j7333n0069
11833A413009j8403K1823J8862k1278k2078l1353J4600J0475j9359k1116k4927
11822A320255k1322j1358R472K3444J1840r573m1049j6290o78l776K393Q477Q211
11809A280046K1170l8890L396q16o549L026k0300p440Q730o968k1851l2296k1632
11796A159626j2563l388P796j6571Q24j514k4714o072L1384n84R913J4687m0168
11783A118656m3523j52J6143q683l9104l3914j9240M294K4754r295m5353k1374
$$ plain form
11771 943209 943791 940417 942412 950714 956392 963750 927237 905229 919807 937463 928857 934441 914102
11758 914102 901369 899694 899160 865124 842832 831612 826631 831013 803186 801621 830079 849417 889491
11745 889491 865486 784368 766365 763668 773558 808871 801156 792499 781518 811786 842460 841961 805265
11732 805265 798554 784351 801607 785368 768580 739795 722592 725407 710150 704320 711253 674926
11720 674926 665053 690438 691810 682108 664365 656212 627299 620877 673335 683175 680132 677623 693359
11707 693359 682981 658480 616501 576043 590810 614071 591635 575492 566921 571710 590103 569634
11695 569634 568713 569900 554942 566398 575321 570994 559624 547285 519377 531292 552020 541358
11683 541358 525114 541186 543820 533791 524946 528286 526828 527545 521952 528178 527969 519123 503610 489214
$$ packed form
11771I43209N82l374J995Q302N678P358l6513k2008J4578J7656q606N584k0339
11758I14102j2733j675n34l4036k2292j1220m981M382k7827j565K8458J9338M0074
11745H89491k4005q1118j8003k697R890L5313p715q657j0981L0268L0674m99l6696
11732H05265o711j4203J7256j6239j6788k8785j7203K815j5257n830O933l6327
11720F74926r873K5385J372r702j7743q153k8913o422N2458R840l043k509J5736
11707F93359j0378k4501m1979m0458J4767K3261k2436j6143q571M789J8393k0469
11695E69634r21J187j4958J1456Q923m327j1370j2339k7908J1915K0728j0662
11683E41358j6244J6072K634j0029q845L340j458P17n593O226k09q846j5513j4396
$$ plain form
11669 489214 487267 469235 464709 471751 472359 471157 486594 513281 522353 492815 448580 451426 445514
11656 445514 430951 424886 394941 409030 409372 447240 461318 470643 421537 407334 424267 430395
11644 430395 400023 388715 375116 408637 431235 439613 406348 413963 415063 408199 392749 405423
11632 405423 422173 397996 390715 367388 350095 344955 369248 388263 372939 360290 384199 398188
11620 398188 364350 354757 364927 392380 368660 368238 383596 400471 390416 361383 345520 367996
11608 367996 393767 390331 368802 375738 371580 324375 301356 294344 311213 343340 333797 328714 311876
11595 311876 311893 296084 271223 299529 324095 323599 295229 261831 269835 287725 278947 291842 320539
11582 320539 301007 308055 276942 270414 252889 221633 208533 213943 240138 286742 293961 263107
$$ packed form
11669D89214j947j8032m526P042O08j202J5437K6687R072k9538m4235K846n912
11656D45514j4563o065k9945J4089L42L7868J4078R325m9106j4203J6933O128
11644D30395l0372j1308j3599L3521K2598Q378l3265P615J100o864j5450J2674
11632D05423J6750k4177p281k3327j7293n140K4293J9015j5324j2649K3909J3989
11620C98188l3838r593J0170K7453k3720m22J5358J6875j0055k9033j5863K2476
11608C67996K5771l436k1529O936m158m7205k3019p012J6869L2127r543n083j6838
11595C11876J7j5809k4861K8306K4566m96k8370l3398Q004J7890q778J2895K8697
11582C20539j9532P048l1113o528j7525l1256j3100N410K6195M6604P219l0854
$$ plain form
11570 263107 262592 262970 256274 261462 229662 239280 253478 246813 254911 271624 274084 276892 256077 223097
11556 223097 242344 252102 231349 220759 248363 242880 205585 185193 195411 200637 211158 233444
11544 233444 225058 223751 201520 179339 192004 191440 162385 181353 169385 161388 198892 228757
11532 228757 220754 208365 238239 255508 233416 201044 206579 236130 224280 183516 186197 210666
11520 210666 195661 217646 223778 224789 240007 229947 248070 254464 248178 254967 267958 230096
11508 230096 218804 216464 228391 233630 239629 242536 230008 229032 230051 216552 209859 199699 192742
11495 192742 179883 162299 181622 208832 209381 199788 190483 215283 250679 200302 132585 99415
11483 99415 93065 127966 165365 181546 164012 159617 154215 120135 130813 159770 160697 172648 196149
$$ packed form
11570B63107n15L78o696N188l1800R618J4198o665Q098J6713K460K808k0815l2980
11556B23097J9247R758k0753j0590K7604n483l7295k0392J0218N226J0521K2286
11544B33444q386j307k2231k2181J2665n64k9055J8968j1968p997L7504K9865
11532B28757q003j2389K9874J7269k2092l2372N535K9551j1850m0764K681K4469
11520B10666j5005K1985O132J011J5218j0060J8123O394o286O789J2991l7862
11508B30096j1292k340J1927N239N999K907j2528r76J019j3499o693j0160o957
11495A92742j2859j7584J9323K7210N49r593r305K4800L5396n0377o7717l3170
11483I9415o350L4901L7399J6181j7534m395n402l4080J0678K8957R27J1951K3501
$$ plain form
11470 196149 209575 183448 170077 167942 138087 125086 124796 112634 108554 112599 135643 120108
11458 120108 88724 75006 84428 135432 157910 161059 150267 151412 141228 157591 161754 155249
11446 155249 137495 152219 132931 121296 135911 169452 172634 157700 170965 200631 191524 172256
11434 172256 164379 155749 170221 177754 165292 161944 167863 168197 161686 177873 153577 106644 109376
11421 109376 115966 127746 125914 122413 154689 151879 116445 115526 135549 159875 155484 167954 153281
11408 153281 120183 106449 121798 151145 153585 148321 107440 133602 145275 108162 74367 82157
11396 82157 111442 119835 105559 108312 72345 78435 79761 77232 97610 113575 108109 76894 67973
11383 67973 77608 78224 69090 87304 108236 117693 130808 142405 116681 83261 63663 76595 66311
$$ packed form
11470A96149J3426k6127j3371k135k9855j3001k90j2162m080M045K3044j5535
11458A20108l1384j3718R422N1004K2478L149j0792J145j0184J6363M163o505
11446A55249j7754J4724j9288j1635J4615L3541L182j4934J3265K9666r107j9268
11434A72256p877q630J4472P533j2462l348N919L34o511J6187k4296m6933K732
11421A09376O590J1780j832l501L2276k810l5434r19K0023K4326m391J2470j4673
11408A53281l3098j3734J5349K9347K440n264m0881K6162J1673l7113l3795P790
11396H2157K9285Q393j4276K753l5967O090J326k529K0378J5965n466l1215q921
11383F7973R635O16r134J8214K0932R457J3115J1597k5724l3420j9598J2932j0284
$$ plain form
11370 66311 44144 57380 75382 71726 74495 70922 93040 109666 129128 134113 99795 79271
11358 79271 87160 67784 55629 89574 78931 58092 64713 81509 98564 84940 85932 108558
11346 108558 122157 117222 90705 36987 31250 43732 53560 63895 73085 51269 43808 59501
11334 59501 68095 42418 9982 1875 21450 13311 6763 44188 86190 93098 73781 52611 50672
11321 50672 57021 61201 41409 31403 25819 53669 91642 106883 110888 94900 61945 66256 74412
11308 74412 63577 78988 87979 75736 116781 125004 136861 133900 116348 117786 130490 119349
11296 119349 74468 73133 89473 64497 80393 65007 27751 16989 34542 46850 45875 58586
11284 58586 49260 63357 40039 49215 61957 45389 9184 16773 28436 32684 35674 32253 6555
$$ packed form
11370F6311k2167J3236J8002l656K769l573K2118J6626J9462M985l4318k0524
11358G9271P889j9376j2155L3945j0643k0839O621J6796J7055j3624R92K2626
11346A08558J3599m935k6517n3718n737J2482R828J0335R190k1816p461J5693
11334E9501Q594k5677l2436q107J9575q139o548L7425M2002O908j9317k1170j939
11321E0672O349M180j9792j0006n584K7850L7973J5241M005j5988l2955M311Q156
11308G4412j0835J5411Q991j2243M1045Q223J1857k961j7552J438J2704j1141
11296A19349m4881j335J6340k4976J5896j5386l7256j0762J7553J2308r75J2711
11284E8586r326J4097k3318R176J2742j6568l6205P589J1663M248K990l421k5698
$$ plain form
11271 6555 16509 28767 24205 47344 41634 40936 39729 33212 44299 52176 61912 91459 80015 70152
11257 70152 72947 92698 78107 102510 89518 43177 33594 49936 58044 58999 46137 30577 46899
11244 46899 64292 66644 38857 9027 2260 6645 26416 53238 87388 95416 79036 61748
11232 61748 69975 79049 97395 94167 90107 57811 38962 39801 41013 40027 40762 53235 49731 10135
11218 10135 -7296 39776 52886 11594 20724 27014 15389 27592 45256 44429 49816 58693 24806
11205 24806 8969 4425 36069 64434 89598 97246 82229 86365 93046 89416 82443 53502 40939
11192 40939 56441 45542 20689 27966 31139 26043 30662 52121 58382 66588 40788 30496 15483
11179 15483 5509 14036 -3906 16774 17660 530 7552 7067 22251 23042 19948 5861 3405 30451
$$ packed form
11271F555R954J2258m562K3139n710o98j207o517J1087P877R736K9547j1444r863
11257G0152K795J9751j4591K4403j2992m6341r583J6342Q108R55j2862j5560J6322
11244D6899J7393K352k7787k9830o767M385J9771K6822L4150Q028j6380j7288
11232F1748Q227R074J8346l228m060l2296j8849Q39J212r86P35J2473l504l9596
11218A0135j7431M7072J3110m1292R130O290j1625J2203J7664q27N387Q877l3887
11205B4806j5837m544L1644K8365K5164P648j5017M136O681l630o973k8941j2563
11192D0939J5502j0899k4853P277L173n096M619K1459O261Q206k5800j0292j5013
11179A5483r974Q527j7942K0680Q86j7130P022m85J5184P91l094j4087k456K7046
$$ plain form
11165 30451 4362 5270 -11844 -4498 26410 37683 25800 32360 33379 9048 23595 31434 11126
11152 11126 -12137 -702 26318 37651 1315 19395 28710 46252 39134 17851 48191 65060
11140 65060 75885 70750 14298 -17258 -21607 -3796 42727 43419 26785 13405 -6424 -2819 -5597
11127 -5597 11271 12961 -3351 -7645 -13833 -22621 5639 42350 54289 59816 54489 53756 47321 40779
11113 40779 38765 47451 66815 72338 67735 55500 59524 73058 70087 61230 49982 60133 58911
11100 58911 56070 45997 30454 13723 4403 9032 5429 26670 11752 24309 30758 31095 34438
11087 34438 36844 14036 7542 5603 19124 36393 25668 38433 62463 44621 15135 9126
11075 9126 -17624 -46888 -28748 15485 44697 59457 46480 35861 59543 36136 46628 55067
$$ packed form
11165C0451k6089R08j7114P346L0908J1273j1883O560J019k4331J4547P839k0308
11152A1126k3263J1435K7020J1333l6336J8080R315J7542p118k1283L0340J6869
11140F5060J0825n135n6452l1556m349J7811M6523O92j6634j3380j9829L605k778
11127e597J6868J690j6312m294o188q788K8260L6711J1939N527n327p33o435o542
11113D0779k014Q686J9364N523m603j2235M024J3534k971q857j1248J0151j222
11100E8911k841j0073j5543j6731r320M629l603K1241j4918J2557O449L37L343
11087C4438K406k2808o494j939J3521J7269j0725J2765K4030j7842k9486o009
11075I126k6750k9264J8140M4233K9212J4760j2977j0619K3682k3407J0492Q439
$$ plain form
11063 55067 52811 43731 45916 53622 18532 14881 29595 43503 53821 44342 44733 48065 41670 37860
11049 37860 82582 94998 131641 141855 115834 112005 128314 121735 121950 136145 131241 133661 138940
11036 138940 162657 170047 159900 155187 165644 156653 154187 155421 166198 189237 202114 212046 255653
11023 255653 275282 275169 276458 293000 295231 273397 241453 209145 193100 200363 177747 178965 185223
11010 185223 185980 188578 199477 168311 161373 170071 150757 132525 113845 81786 77739 64899 83476
10997 83476 69459 62580 48439 26030 40261 48655 58033 34499 15310 6557 32845 63634
10985 63634 55785 35391 20761 -2261 -3240 25256 51665 38341 -2889 4819 63146 80370
10973 80370 76543 77265 62781 42556 21749 21579 14250 44638 29178 12504 45339 62997 69373
$$ packed form
11063E5067k256r080K185P706l5090l651J4714J3908J0318r479L91L332o395l810
11049C7860M4722J2416L6643J0214k6021l829J6309o579K15J4195m904K420N279
11036A38940K3717P390j0147m713J0457q991k466J234J0777K3039J2877R932M3607
11023B55653J9629j13J289J6542K231k1834l1944l2308j6045P263k2616J218O258
11010A85223P57K598J0899l1166o938Q698j9314j8232j8680l2059m047j2840J8577
10997H3476j4017o879j4141k2409J4231Q394R378k3534j9189q753K6288L0789
10985F3634p849k0394j4630k3022r79K8496K6409j3324m1230P708N8327J7224
10973H0370l827P22j4484k0225k0807j70p329L0388j5460j6674L2835J7658O376
$$ plain form
10960 69373 72866 43763 29150 20795 22672 45282 52066 37596 23663 24399 20220 31696 41242
10947 41242 51604 35974 24384 26372 11290 1945 9396 1399 24342 35590 15355 -16213
10935 -16213 -23240 -18612 21520 44665 53255 49630 29812 5547 8534 -13210 5894 19203 4392
10922 4392 -5660 11523 8724 27816 45573 53963 51928 25727 34155 40356 9502 -27156 -28088
10909 -28088 -13606 18072 49342 58608 42894 45331 41683 37950 21506 35300 65382 47694
10897 47694 56223 35336 17916 -18412 -37572 -11362 6224 20518 -24053 -24540 -6282 15104
10885 15104 21268 4911 -10121 4619 11920 -2930 -823 33721 32367 -448 -27733 -14686
10873 -14686 -19153 -32214 -13589 -33797 -22910 -13097 -40845 -45848 -23867 7830 38873 52311
$$ packed form
10960F9373L493k9103j4613q355J877K2610O784j4470j3933P36m179J1476R546
10947D1242J0362j5630j1590J988j5082r345P451p997K2943J1248k0235l1568
10935a6213p027M628M0132K3145Q590l625j9818k4265K987k1744J9104J3309j4811
10922D392j0052J7183k799J9092J7757Q390k035k6201Q428O201l0854l6658r32
10909b8088J4482L1678L1270R266j5714K437l648l733j6444J3794L0082j7688
10897D7694Q529k0887j7420l6328j9160K6210J7586J4294m4571m87J8258K1386
10885A5104O164j6357j5032J4740P301j4850K107L4544j354l2815k7285J3047
10873a4686m467j3061J8625k0208J0887R813k7748n003K1981L1697L1043J3438
$$ plain form
10861 52311 56905 93055 102731 105467 84176 90536 72554 60820 62148 52108 49450 77774 97778
10848 97778 101262 81274 73158 52455 39375 37956 30007 22125 11917 257 2067 -5306 -13172
10835 -13172 -8333 -26531 -28213 -5204 18755 35934 32469 18688 11435 24798 32869 59388 46219
10822 46219 30319 20547 4660 270 -728 541 -2019 -5178 -13113 -29375 -46630 -49123 -22436
10809 -22436 13593 14936 22513 53755 41972 35016 44443 63108 55847 40905 28817 4468 -36145
10796 -36145 -21377 -20710 2389 29329 44374 62252 62849 40140 22939 26055 4871 -51623 -95515
10783 -95515 -77353 -62152 -14415 37047 29675 25989 9275 -19293 -5082 -18875 11231 7872
10771 7872 -10937 -37259 3243 31734 20746 17206 -3027 -14046 11993 26060 44813 67236
$$ packed form
10861E2311M594L6150R676K736k1291O360j7982j1734J328j0040k658K8324K0004
10848I7778L484j9988q116k0703j3080j419p949p882j0208j1660J810p373p866
10835a3172M839j8198j682K3009K3959J7179l465j3781p253J3363Q071K6519j3169
10822D6219j5900r772j5887m390r98J269k560l159p935j6262j7255k493K6687
10809b2436L6029J343P577L1242j1783o956R427J8665p261j4942j2088k4349m0613
10796c6145J4768O67K3099K6940J5045J7878N97k2709j7201L116k1184n6494m3892
10783i5515J8162J5201M7737N1462p372l686j6714k8568J4211j3793L0106l359
10771G872j8809k6322M0502K8491j0988l540k0233j1019K6039J4067J8753K2423
$$ plain form
10759 67236 61408 27899 36193 44557 62160 59060 49472 72263 72365 56798 35875 50148 29095
10746 29095 20820 33223 65698 92703 119426 154311 159138 151032 123246 141741 146711 125633
10734 125633 133223 161876 209879 214977 244000 266126 262487 267935 305825 318517 351614 433951
10722 433951 559794 693023 837354 1035286 1292728 1532915 1662626 1656175 1582685 1506454
10712 1506454 1431719 1253285 1044078 845437 713855 623266 550029 498788 443843 392017
10702 392017 348393 321470 307579 289872 294369 282424 282358 281489 274905 288515 242520 202452 215648
10689 215648 242392 230863 260774 271689 256849 261185 242202 231719 252507 249191 234295 226227
10677 226227 254955 269139 277745 287202 255560 225124 234733 232656 239748 254588 271594 278233 256516
$$ packed form
10759F7236n828l3509Q294Q364J7603l100r588K2791J02j5567k0923J4273k1053
10746B9095q275J2403L2475K7005K6723L4885M827q106k7786J8495M970k1078
10734A25633P590K8653M8003N098K9023K2126l639N448L7890J2692L3097Q2337
10722D33951J25843J33229J44331J97932K57442K40187J29711o451p3490p6231
10712A506454p4735j78434k09207j98641j31582r0589p3237n1241n4945n1826
10702C92017m3624k6923j3891j7707M497j1945o6q69o584J3610m5995m0068J3196
10689B15648K6744j1529K9911J0915j4840M336j8983j0483K0788l316j4896q068
10677B26227K8728J4184Q606R457l1642l0436R609k077P092J4840J7006O639k1717
$$ plain form
10664 256516 264480 260407 275396 326152 322898 341470 391396 458356 523489 540203 539601 544565 594420
10651 594420 650936 662050 646243 651031 686307 688952 704074 752787 782665 838737 878592 924528
10639 924528 1034251 1127786 1231292 1359975 1481677 1605511 1765924 1917415 2082122 2236031
10629 2236031 2413391 2621230 2875117 3195638 3611862 4130653 4789624 5620698 6593140
10620 6593140 7831788 9327351 10877068 12260524 13334606 14107137 14655310 15060236 15372211
10611 15372211 15772753 16442502 17687060 19618033 22108472 24754359 26952343 28339710
10603 28339710 29011679 29205727 29033767 28494681 27881542 27803509 28736300 30722731 33553938
10594 33553938 36534840 38688387 39502971 39262157 38336374 36746076 34427668 31907519
$$ packed form
10664B56516P964m073J4989N0756l254J8572M9926O6960O5133J6714o02M964M9855
10651E94420N6516J1114j5807M788L5276K645J5122M8713K9878N6072L9855M5936
10639I24528J09723R3535J03506J28683J21702J23834J60413J51491J64707J53909
10629B236031J77360K07839K53887L20521M16224N18791O58971Q31074R72442
10620F593140J238648J495563J549717J383456J074082P72531N48173M04926L11975
10611A5372211M00542O69749J244558J930973K490439K645887K197984J387367
10603B8339710O71969J94048j71960n39086o13139p8033R32791J986431K831207
10594C3553938K980902K153547Q14584k40814r25783j590298k318408k520149
$$ plain form
10586 31907519 29931605 29001386 29092799 29892488 30837863 31275044 30910322 29888790 28470400
10577 28470400 26597361 24303277 21958744 20033920 18739345 18024265 17741454 17574758
10569 17574758 17202864 16539262 15624648 14519075 13234607 11807080 10366941 9038135
10561 9038135 7956499 7124286 6430433 5909108 5486287 5104625 4789698 4504849 4227419
10552 4227419 4005978 3805037 3655655 3479385 3286997 3100189 2962086 2855784 2745763
10543 2745763 2611221 2507606 2412330 2277177 2174037 2104155 2007810 1939906 1877291 1794663
10533 1794663 1711542 1621952 1569770 1558026 1532159 1500327 1449758 1404060 1366827 1338128 1321660
10522 1321660 1307248 1249844 1248333 1217289 1182557 1148534 1083955 1033850 1033169 993645 975348 955312
$$ packed form
10586C1907519j975914r30219R1413P99689R45375M37181l64722j021532j418390
10577B8470400j873039k294084k344533j924824j294575p15080k82811j66696
10569A7574758l71894o63602r14614j105573j284468j427527j440139j328806
10561I038135j081636q32213o93853n21325m22821l81662l14927k84849k77430
10552D227419k21441k00941j49382j76270j92388j86808j38103j06302j10021
10543B745763j34542j03615r5276j35153j03140o9882r6345o7904o2615q2628
10533A794663q3121q9590n2182j1744k5867l1832n0569m5698l7233k8699j6468
10522A321660j4412n7404j511l1044l4732l4023o4579n0105o81l9524j8297k0036
$$ plain form
10510 955312 901196 852066 822856 826004 814384 813509 775246 716634 696124 647509 602508 581665
10498 581665 574380 546989 526290 481265 465958 465666 443878 404895 368056 366804 349892 345655
10486 345655 364882 408544 415367 412793 362004 342475 317606 309789 299490 271782 292908 304238
10474 304238 290766 290503 300942 304446 314316 337273 314013 311436 310168 321423 324088 332989 331542
10461 331542 307102 279768 266442 257816 276292 302878 311559 320236 324566 327527 349304 357634 365286
10448 365286 385207 382835 350238 342004 375320 410215 448499 481358 549115 640696 707908 748265
10436 748265 766364 759899 770919 793286 783750 755447 745541 755320 728430 700324 663897 643599
10424 643599 672519 695069 701102 668372 651500 637874 594111 556182 568086 575681 588187 599530
$$ packed form
10510I55312n4116m9130k9210L148j1620q75l8263n8612k0510m8615m5001k0843
10498E81665p285k7391k0699m5025j5307k92k1788l8983l6839j252j6912m237
10486C45655J9227M3662O823k574n0789j9529k4869p817j0299k7708K1126J1330
10474C04238j3472k63J0439L504R870K2957k3260k577j268J1255K665Q901j447
10461C31542k4440k7334j3326q626J8476K6586Q681Q677M330K961K1777Q330P652
10448C65286J9921k372l2597q234L3316L4895L8284L2859O7757R1581O7212M0357
10436G48265J8099o465J1020K2367r536k8303r906R779k6890k8106l6427k0298
10424F43599K8920K2550O033l2730j6872j3626m3763l7929J1904P595J2506J1343
$$ plain form
10412 599530 595351 556034 548834 576754 589030 580965 585139 602658 600418 610632 596562 604043 609615
10399 609615 647087 661417 667128 663106 648892 624410 635516 633601 613240 613160 647923 677546 699837
10386 699837 702108 677204 718426 753741 767885 764933 758290 789621 803054 817401 845034 888204
10374 888204 951931 1024652 1044264 1062153 1083039 1112289 1140010 1156077 1182629 1201340 1266090
10363 1266090 1327473 1388069 1470256 1570713 1655645 1749869 1825845 1888873 1990812 2093585 2168033
10352 2168033 2282164 2425751 2574731 2711947 2875092 3060383 3275678 3516129 3731160
10343 3731160 3981301 4323641 4708182 5106401 5589944 6104471 6674042 7330865 8061289
10334 8061289 8902660 9814214 10773823 11685785 12463527 13234086 14042854 14910978 15794937
$$ packed form
10412E99530m179l9317p200K7920J2276q065M174J7519k240J0214j4070P481N572
10399F09615L7472J4330N711m022j4214k4482J1106j915k0361q0L4763K9623K2291
10386F99837K271k4904M1222L5315J4144k952o643L1331J3433J4347K7633M3170
10374H88204O3727P2721J9612J7889K0886K9250K7721J6067K6552J8711O4750
10363A266090O1383O0596Q2187J00457Q4932R4224P5976O3028J01939J02773P4448
10352B168033J14131J43587J48980J37216J63145J85291K15295K40451K15031
10343C731160K50141L42340L84541L98219M83543N14527N69571O56823P30424
10334H061289Q41371R11554R59609R11962P77742P70559Q08768Q68124Q83959
$$ plain form
10325 15794937 16771655 18053173 19690523 21706668 24122891 27052743 30778537 35567636
10317 35567636 41771399 49981113 61105213 76567835 98563289 130090770 173865256
10310 173865256 227437375 274006961 291741968 286482401 276315507 264859412 239220841
10303 239220841 192971361 147160645 113907058 91382720 75955123 64986675 56838093
10296 56838093 50489422 45330674 40992129 37263434 34059696 31315957 28944573 26854631
10288 26854631 25075475 23611747 22392138 21369443 20410077 19379546 18415355 17543507
10280 17543507 16682137 15761927 14806856 13916293 13144726 12456907 11841388 11334121 10861650
10271 10861650 10411136 9971521 9516241 9086739 8668965 8280689 7930386 7615221 7344380
$$ packed form
10325A5794937R76718J281518J637350K016145K416223K929852L725794M789099
10317C5567636O203763Q209714J1124100J5462622K1995454L1527481M3774486
10310A73865256N3572119M6569586J7735007n259567j0166894j1456095k5638571
10303B39220841m6249480m5810716l3253587k2524338j5427597j0968448q148582
10296E6838093o348671n158748m338545l728695l203738k743739k371384k089942
10288B6854631j779156j463728j219609j022695r59366j030531r64191q71848
10280A7543507q61370r20210r55071q90563p71567o87819o15519n07267m72471
10271A0861650m50514m39615m55280m29502m17774l88276l50303l15165k70841
$$ plain form
10262 7344380 7076177 6806903 6570782 6412632 6268177 6080415 5865694 5688751 5544276
10253 5544276 5364687 5219686 5052944 4913942 4771769 4576317 4420983 4272983 4137210
10244 4137210 4053521 3949653 3823768 3745902 3665474 3569933 3459658 3361268 3266687 3179484 3120342
10233 3120342 3060710 2994742 2945240 2872315 2827628 2783069 2711217 2636161 2522250 2385689 2257180
10222 2257180 2144907 2050865 1932009 1845574 1783137 1717813 1630185 1581292 1510595 1446740 1369033
10211 1369033 1295831 1237395 1205285 1158409 1113623 1116253 1104403 1093574 1066674 1045207 1044473 1046916
10199 1046916 1008007 957841 926321 902611 875772 876548 866051 821514 804040 792806 778890 753806
10187 753806 730870 774541 818173 869801 851502 794056 781924 780161 786292 806937 797856 800504
$$ packed form
10262G344380k68203k69274k36121j58150j44455j87762k14721j76943j44475
10253E544276j79589j45001j66742j39002j42173j95452j55334j48000j35773
10244D137210q3689j03868j25885p7866q0428r5541j10275r8390r4581q7203n9142
10233C120342n9632o5968m9502p2925m4687m4559p1852p5056j13911j36561j28509
10222B257180j12273r4042j18856q6435o2437o5324q7628m8893p0697o3855p7707
10211A369033p3202n8436l2110m6876m4786K630j1850j0829k6900k1467p34K443
10199A046916l8909n0166l1520k3710k6839P76j0497m4537j7474j1234j3916k5084
10187G53806k2936M3671M3632N1628j8299n7446j2132j763O131K0645r081K648
$$ plain form
10175 800504 801146 807200 795613 807853 833336 853715 834647 817849 816045 820842 836097 851611
10163 851611 882216 870036 852453 844568 790885 756601 752928 777305 793229 811470 833891 842333
10151 842333 827737 791887 769206 755383 751622 739498 759966 776238 763650 758667 732468 691540
10139 691540 666116 680753 681415 656634 614072 579617 565232 565076 588156 604818 558498 564169
10127 564169 549870 559006 536178 539386 540967 524361 527761 509182 493488 527217 525138 488744
10115 488744 468161 488907 495826 467870 441134 443612 457484 450462 429627 436250 433373 427089 433424
10102 433424 419656 406455 409574 398018 359481 340926 391409 408511 404816 386773 374797 352260
10090 352260 317051 289688 307651 342071 335658 338525 313656 301094 311967 322565 312328 290432
$$ packed form
10175H00504O42O054j1587J2240K5483K0379j9068j6798j804M797J5255J5514
10163H51611L0605j2180j7583p885n3683l4284l673K4377J5924J8241K2421Q442
10151H42333j4596l5850k2681j3823l761j2124K0468J6272j2588m983k6199m0928
10139F91540k5424J4637O62k4781m2562l4455j4385j56K3080J6662m6320N671
10127E64169j4299R136k2828L208J581j6606L400j8579j5694L3729k079l6394
10115D88744k0583K0746O919k7956k6736K478J3872p022k0835O623k877o284O335
10102D33424j3768j3201L119j1556l8537j8555N0483J7102l695j8043j1976k2537
10090C52260l5209k7363J7963L4420o413K867k4869j2562J0873J0598j0237k1896
$$ plain form
10078 290432 263209 243728 228755 229579 243048 250716 272986 253993 223182 209402 194858 182516
10066 182516 167939 174676 153291 152161 192381 196156 201833 237162 245766 245297 263893 284770 275610
10053 275610 263926 295702 287110 249985 233105 227829 198917 180092 164722 174629 163721 162421
10041 162421 189272 183761 187657 205851 205917 196874 215244 175275 155890 175925 192723 169981 188849
10028 188849 189948 170902 124187 100254 106192 143260 170613 190963 187481 152212 136968 115428
10016 115428 143889 163003 152876 169235 213070 196362 167828 170541 176487 211511 237814 220796
10004 220796 176346 154830 158836 179752 163387 147060 171023 173368 176163 148966 141888 145155
9992 145155 123477 108747 107983 148208 145997 125284 106624 126179 117959 146306 167932 189892
$$ packed form
10078B90432k7223j9481j4973Q24J3469P668K2270j8993l0811j3780j4544j2342
10066A82516j4577O737k1385j130M0220L775N677L5329Q604m69J8596K0877r160
10053B75610j1684L1776q592l7125j6880n276k8912j8825j5370R907j0908j300
10041A62421K6851n511L896J8194O6r043J8370l9969j9385K0035J6798k2742J8868
10028A88849J099j9046m6715k3933N938L7068K7353K0350l482l5269j5244k1540
10016A15428K8461J9114j0127J6359M3835j6708k8534K713N946L5024K6303j7018
10004B20796m4450k1516M006K0916j6365j6327K3963K345K795k7197p078L267
9992A45155k1678j4730p64M0225k211k0713j8660J9555q220K8347K1626K1960
$$ plain form
9980 189892 187136 166170 156754 178822 172438 144900 124676 121107 125423 155316 179709 183060 168664
9967 168664 150332 134081 117277 125394 110919 106817 124728 124722 123897 125434 141303 140041 128187 110043
9953 110043 103175 84263 76842 66182 100864 126005 126544 144579 164511 168372 172555 147920 150664
9940 150664 158445 153325 135104 136672 123099 123514 123638 133343 133997 122621 135340 122113 130097 147604
9926 147604 168308 161424 152780 164087 156462 150643 136116 143976 151291 149563 133166 148318 149917
9913 149917 131477 108367 102024 125231 144790 157511 174296 224529 263990 292091 310444 369528
9901 369528 432562 511972 652518 868915 1165042 1411153 1553196 1572783 1546372 1517105 1420837
9890 1420837 1250817 1010280 807587 657201 551436 488759 441449 393990 358300 370740
$$ packed form
9980A89892k756k0966r416K2068o384k7538k0224l569M316K9893K4393L351j4396
9967A68664j8332j6251j6804Q117j4475m102J7911oq25J537J5869j262j1854j8144
9953A10043o868j8912p421j0660L4682K5141N39J8035J9932L861M183k4635K744
9940A50664P781n120j8221J568j3573M15J24R705O54j1376J2719j3227P984J7507
9926A47604K0704o884q644J1307p625n819j4527P860P315j728j6397J5152J599
9913A49917j8440k3110o343K3207J9559J2721J6785N0233L9461K8101J8353N9084
9901C69528O3034P9410J40546K16397K96127K46111J42043J9587k6411k9267r6268
9890A420837j70020k40537k02693j50386j05765o2677m7310m7459l5690J2440
$$ plain form
9880 370740 343924 305757 293929 278411 277779 270956 251092 251701 238238 234283 197946 155344 156818
9867 156818 178477 192460 157621 142545 146893 132524 104275 127800 149039 154954 170689 188363
9855 188363 161035 153305 186599 174293 134690 121196 104686 95082 82195 96896 99374 91319
9843 91319 111896 116981 130849 123258 119020 99837 75964 81079 88301 111492 106687 68931 66354
9830 66354 60107 66442 106056 111438 96861 107291 98978 106200 128959 129917 101330 82466 89738
9817 89738 115897 106005 77638 49971 49135 74330 75666 58758 32447 68227 74184 67865 76184
9804 76184 82161 101243 115900 123170 115274 107367 83168 50210 16488 25439 49932 60557 35909
9791 35909 12057 -1720 19603 69264 78445 99486 86501 77479 88792 104138 60870 52457
$$ packed form
9880C70740k6816l8167j1828j5518o32o823j9864O09j3463l955l6337m2602J474
9867A56818K1659J3983l4839j5076M348j4369k8249K3525K1239N915J5735J7674
9855A88363k7328p730L3294j2306l9603j3494j6510r604j2887J4701K478q055
9843I1319K0577N085J3868p591m238j9183k3873N115P222K3191m805l7756k577
9830F6354o247O335L9614N382j4577J0430q313P222K2759R58k8587j8864P272
9817H9738K6159r892k8367k7667q36K5195J336j6908k6311L5780N957o319Q319
9804G6184N977J9082J4657P270p896p907k4199l2958l3722Q951K4493J0625k4648
9791C5909k3852j3777K1323M9661R181K1041j2985r022J1313J5346m3268q413
$$ plain form
9779 52457 45959 59539 85172 89172 61981 46776 27364 44470 29424 51116 66912 70500
9767 70500 73769 83488 51088 31353 34453 69498 103194 124252 114973 113519 77192 66787 73886
9754 73886 76735 66509 74838 77933 60080 76014 86773 56982 44618 36306 52021 72860 91961
9741 91961 65009 72388 76744 63375 70436 56292 52387 54627 60999 64310 47709 42506 23547
9728 23547 44612 68356 64078 84765 63521 41812 61321 72278 70848 60494 52968 63454
9716 63454 75487 59487 39573 12873 16321 27443 19649 35405 43232 35462 69067 96417 104078
9703 104078 79858 50230 58682 88093 56439 39810 56472 70281 52720 43709 66746 70188
9691 70188 92556 92288 65203 59591 41950 58611 76022 84570 74288 45137 12964 31557 62011
$$ packed form
9779E2457o498J3580K5633M000k7191j5205j9412J7106j5046K1692J5796L588
9767G0500L269R719l2400j9735L100L5045L3696K1058r279j454l6327j0405P099
9754G3886K849j0226Q329L095j7853J5934J0759k9791j2364q312J5715K0839J9101
9741I1961k6952P379M356j3369P061j4144l905K240O372L311j6601n203j8959
9728B3547K1065K3744m278K0687k1244k1709J9509J0957j430j0354p526J0486
9716F3454J2033j6000j9914k6700L448J1122p794J5756P827p770L3605K7350P661
9703A04078k4220k9628Q452K9411l1654j6629J6662J3809j7561r011K3037L442
9691G0188K2368k68k7085n612j7641J6661J7411Q548j0282k9151l2173J8593L0454
$$ plain form
9678 62011 64968 42420 56436 79032 114198 104144 63402 59336 61211 89435 124861 127032 117259
9665 117259 138300 132226 66340 64400 72643 66487 47066 48632 42442 55824 93890 123803 128191
9652 128191 153807 171713 131841 124346 134242 164715 167696 128542 73761 94879 93399 65292
9640 65292 61711 30189 19048 26574 59006 72480 85226 77573 65796 70093 69194 84898 62301
9627 62301 65371 48150 39033 55757 71028 70391 81577 75552 46860 7757 30850 79919 86094
9614 86094 39958 -25715 -56086 -53372 -27897 -15649 26402 71891 65288 66351 72029 28590 30638
9601 30638 42903 31112 -1949 -3180 46449 67705 57906 65906 79592 54243 25196 33010 73720
9588 73720 89150 89960 82796 58979 23264 18069 -9664 1539 22106 16411 9313 16705 31337
$$ packed form
9678F2011K957k2548J4016K2596L5166j0054m0742m066J875K8224L5426K171r773
9665A17259K1041o074o5886j940Q243o156j9421J566o190J3382L8066K9913M388
9652A28191K5616J7906l9872p495R896L0473K981l9154n4781K1118j480k8107
9640F5292l581l1522j1141P526L2432J3474J2746p653j1777M297q99J5704k2597
9627F2301L070j7221r117J6724J5271o37J1186o025k8692l9103K3093M9069O175
9614H6094m6136o5673l0371K714K5475J2248M2051M5489o603J063N678m3439K048
9601C0638J2265j1791l3061j231M9629K1256r799Q000J3686k5349k9047P814M0710
9588G3720J5430Q10p164k3817l5715n195k7733J1203K0567n695p098P392J4632
$$ plain form
9575 31337 63953 60158 81494 69252 73009 77587 65156 39411 14767 15287 -4666 -13742 6877
9562 6877 18840 55712 106002 98318 55409 34601 29267 12133 26477 36186 27166 36509 81285
9549 81285 77208 58539 50553 37763 15690 37924 22718 29347 54937 56513 61924 62019 50564
9536 50564 58812 55854 67942 40028 25143 28050 42274 30302 41958 32636 60827 54959 30845
9523 30845 17694 52341 51128 39903 42456 48993 60879 62679 42739 25344 14190 11021 29832
9510 29832 27546 29028 33606 47787 62456 62085 39295 42775 47905 47852 34267 10058 -5622 7598
9496 7598 -104 -2850 32410 79332 52139 42365 27328 3326 19231 36278 65419 85810 78707
9483 78707 80812 73854 38862 24877 33575 54412 63632 55437 69823 59312 40384 37244 48068
$$ packed form
9575C1337L2616l795K1336j2242L757M578j2431k5745k4644N20j9953r076K0619
9562F877J1963L6872N0290p684m2909k0808n334j7134J4344R709r020R343M4776
9549H1285m077j8669p986j2790k2073K2234j5206O629K5590J576N411R5j1455
9536E0564Q248k958J2088k7914j4885K907J4224j1972J1656r322K8191n868k4114
9523C0845j3151L4647j213j1225K553O537J1886J800j9940j7395j1154l169J8811
9510B9832k286J482M578J4181J4669l71k2790L480N130n3j3585k4209j5680J3220
9496G598p702k746L5260M6922k7193r774j5037k4002J5905J7047K9141K0391p103
9483G8707K105o958l4992j3985Q698K0837R220q195J4386j0511j8928l140J0824
$$ plain form
9470 48068 50351 -4709 -9055 -18620 -2981 -682 -8889 12083 51722 34253 -21874 -16700 -840
9457 -840 16976 23398 5794 13380 40219 44719 58575 64649 94062 79568 64943 42311 7154
9444 7154 17832 28961 33244 38088 18358 -11667 -19773 4519 1239 4689 16278 23941 22371
9431 22371 27027 32344 28184 29895 52676 67737 36198 11914 -4273 2596 26046 52894 40441
9418 40441 43722 23083 12208 15052 61397 72385 43432 41477 76056 53522 47282 60638 52103
9405 52103 45837 57951 76591 74938 55965 30952 40368 41639 42844 51094 56126 84889 90176
9392 90176 60777 42457 59058 28668 -5369 13649 37016 40532 58765 68204 39866 36495
9380 36495 21421 19401 25537 14517 44662 55702 26870 31995 54033 75026 71572 42971 56848
$$ packed form
9470D8068K283n5060m346r565J5639K299q207K0972L9639j7469n6127N174J5860
9457h40J7816O422j7604P586K6839M500J3856O074K9413j4494j4625k2632l5157
9444G154J0678J1129M283M844j9730l0025q106K4292l280L450J1589P663j570
9431B2371M656N317m160J711K2781J5061l1539k4284j6187O869K3450K6848j2453
9418D0441L281k0639j0875K844M6345J0988k8953j955L4579k2534o240J3356q535
9405E2103o266J2114J8640j653j8973k5013R416J271J205Q250N032K8763N287
9392I0176k9399j8320J6601l0390l4037J9018K3367L516J8233R439k8338l371
9380C6495j5074k020O136j1020L0145J1040k8832N125K2038K0993l454k8601J3877
$$ plain form
9367 56848 48854 52345 59326 72427 33173 26277 37617 65737 89098 67960 42004 34927 46174
9354 46174 55524 19616 -2153 28786 37739 44238 23931 11482 9805 34078 44466 27463 21535
9341 21535 55064 73890 46107 20929 51734 63177 64244 60865 50073 40228 60671 46831
9329 46831 37640 23358 41513 67654 44732 54104 105353 118850 106643 83809 60658 42987
9317 42987 19685 20071 22567 22722 1341 11362 29373 16381 11886 2446 22102 19088 -6971
9304 -6971 -23764 17596 48816 22210 -1513 4957 5049 9222 25352 48867 48445 17894 4997
9291 4997 24245 41939 56229 56372 64926 35804 10879 -16569 -18856 10084 1141 -8968 -16326
9278 -16326 -11368 -29015 -35115 -14005 7682 14562 -4282 1519 27774 12517 -12753 4252 3175
$$ packed form
9367E6848p994L491O981J3101l9254o896J1340K8120K3361k1138k5956p077J1247
9354D6174R350l5908k1769L0939Q953O499k0307j2449j677K4273J0388j7003n928
9341B1535L3529J8826k7783k5178L0805J1443J067l379j0792r845K0443j3840
9329D6831r191j4282J8155K6141k2922R372N1249J3497j2207k2834k3151j7671
9317D2987k3302L86K496J55k1381J0021J8011j2992m495r440J9656l014k6059
9304f971j6793M1360L1220k6606k3723O470R2M173J6130K3515m22l0551j2897
9291D997J9248J7694J4290J43Q554k9122k4925k7448k287K8940q943j0109p358
9278a6326M958j7647o100K1110K1687O880j8844N801K6255j5257k5270J7005j077
$$ plain form
9265 3175 2870 -4614 -10312 -11746 -8648 -36023 -16649 23891 35728 43390 35996 57844 60699 81106
9251 81106 68745 4231 375 10463 18500 5077 -17115 -28498 -35704 -699 19237 60971
9239 60971 92078 54073 47989 60581 43267 24155 8779 -6023 -22798 -36525 -15001 -6691
9227 -6691 -20156 -11574 27721 40625 40650 18817 35717 31754 19960 322 3 14663 -9759
9214 -9759 -9335 10752 -27043 -35136 16659 47451 36161 39875 63954 36216 7926 3065 -463
9201 -463 -16369 3189 18127 18462 2237 18998 44983 28190 26405 37491 60201 47393 51809
9188 51809 43765 59303 35339 31636 34230 32188 29602 29956 9798 -11226 -15596 -15627 -17820 -12146
9174 -12146 11580 33098 43323 56773 52927 57089 29478 23985 38027 56900 53837 48170 51673
$$ packed form
9265C175l05p484n698j434L098k7375J9374M0540J1837P662p394K1848K855K0407
9251H1106j2361o4514l856J0088Q037j3423k2192j1383p206L5005J9936M1734
9239F0971L1107l8005o084J2592j7314j9112j5376j4802j6775j3727K1524Q310
9227f691j3465Q582L9295J2904K5k1833J6900l963j1794j9638l19J4660k4422
9214i759M24K0087l7795q093N1795L0792j1290L714K4079k7738k8290m861l528
9201d63j5906J9558J4938L35j6225J6761K5985j6793j785J1086K2710j2808M416
9188E1809q044J5538k3964l703K594k042k586L54k0158k1024m370l1k193N674
9174a2146K3726K1518J0225J3450l846M162k7611n493J4042J8873l063n667L503
$$ plain form
9161 51673 82216 100820 84759 52456 48075 38905 54623 49573 21513 21404 16986 36423 24117
9148 24117 15678 -22495 -4997 -7285 -9670 5459 10355 15866 26748 4152 16748 27790 41448
9135 41448 39898 32454 8922 14700 703 926 19343 19729 9202 5945 -20854 -47069 -69006
9122 -69006 -49618 -36776 -25330 19032 33527 25218 41306 55911 43825 29010 1347 25108
9110 25108 61442 43729 27018 23158 38423 22047 -6669 1641 13664 8351 -1157 18383 39594
9097 39594 49095 24366 9774 15838 18370 16222 40129 33634 27052 28681 31654 8270 -340 41545
9083 41545 27000 23190 12436 11658 12724 3649 -11405 -14469 -4702 6357 1749 13047 16573 36609
9069 36609 20978 24521 18299 11706 1188 -7219 -15975 -3228 15077 22571 26062 42984 51418
$$ packed form
9161E1673L0543J8604j6061l2303m381r170J5718n050k8060j09m418J9437j2306
9148B4117q439l8173J7498k288k385J5129M896N511J0882k2596J2596J1042J3658
9135D1448j550p444k3532N778j3997K23J8417L86j0527l257k6799k6215k1937
9122f9006J9388J2842J1446M4362J4495q309J6088J4605j2086j4815k7663K3761
9110B5108L6334j7713j6711l860J5265j6376k8716Q310J2023n313r508J9540K1211
9097C9594R501k4729j4592O064K532k148K3907o495o582J629K973k3384q610M1885
9083D1545j4545l810j0754p78J066r075j5054l064R767J1059m608J1298L526K0036
9069C6609j5631L543o222o593j0518q407q756J2747J8305P494L491J6922Q434
$$ plain form
9056 51418 61776 39467 42389 23850 31823 24624 -9078 14199 25189 11388 -14646 -3873
9044 -3873 31598 22211 -177 9181 26162 8995 2879 12581 15756 43808 48356 54393 71706
9031 71706 76580 68511 39341 11138 15066 18459 30706 62836 105269 74337 24772 1163 -22530
9018 -22530 -33647 -10778 24562 53672 27928 8392 -8107 3790 34417 65196 57878 45772
9006 45772 55920 802 -25503 -11913 -3702 -46117 -49993 -27076 -14852 -35612 -63388 -72614
8994 -72614 -43456 -55834 -54220 -20328 -18783 -31510 -42830 -23251 -1435 15319 5930 -33354
8982 -33354 -12954 34659 50227 37314 19396 26620 14880 -26340 -55040 -26930 -11539 -6187
8970 -6187 -11108 -17061 12301 49049 50986 43759 51449 17853 23073 48929 41384 17969 29022
$$ packed form
9056E1418J0358k2309K922j8539P973p199l3702K3277J0990j3801k6034J0773
9044c873L5471r387k2388R358J6981j7167o116R702L175K8052M548O037J7313
9031G1706M874q069k9170k8203L928L393J2247L2130M2433l0932m9565k3609k3693
9018b2530j1117K2869L5340K9110k5744j9536j6499J1897L0627L0779p318j2106
9006D5772J0148n5118k6305J3590Q211m2415l876K2917J2224k0760k7776r226
8994g2614K9158j2378J614L3892J545j2727j1320J9579K1816J6754r389l9284
8982c3354K0400M7613J5568j2913j7918P224j1740m1220k8700K8110J5391N352
8970f187m921n953K9362L6748J937p227P690l3596N220K5856p545k3415J1053
$$ plain form
8957 29022 44326 72294 67593 30747 6162 23365 27362 25050 22930 33711 38924 45259 36635
8944 36635 27980 15973 -23925 -27436 -3157 -11174 -14421 -16926 10626 11577 24488 40115 45908
8931 45908 28399 21840 49323 75679 62760 47574 40516 52470 60928 37831 10683 -1812
8919 -1812 9282 23402 6233 -22703 -22514 -31377 -18632 30 7213 15099 -3777 -8961 -11384
8906 -11384 27233 37697 23459 -12980 -3865 19364 23266 27514 62210 61910 44168 17187 15384
8893 15384 16793 5683 2130 -16628 -1633 -7179 -46020 -51631 -15663 21426 11821 13162 21741
8880 21741 -1755 11755 22663 4357 20598 43700 33393 17193 32310 73215 77274 33383
8868 33383 11829 3875 -21833 -17872 -13082 -1700 14127 1896 -5591 -12022 -37 -4054 -9608
$$ packed form
8957B9022J5304K7968m701l6846k4585J7203L997k312k120J0781N213O335q624
8944C6635q655j2007l9898l511K4279q017l247k505K7552R51J2911J5627N793
8931D5908j7509o559K7483K6356j2919j5186p058J1954Q458k3097k7148j2495
8919a812J1094J4120j7169k8936J89q863J2745J8662P183P886j8876n184k423
8906a1384L8617J0464j4238l6439R115K3229L902M248L4696l00j7742k6981j803
8893A5384J409j1110l553j8758J4995n546l8841n611L5968L7089r605J341Q579
8880B1741k3496J3510J0908j8306J6241K3102j0307j6200J5117M0905M059m3891
8868C3383k1554p954k5708L961M790J1382J5827j2231p487o431J1985m017n554
$$ plain form
8855 -9608 -30879 -20907 -38979 -24091 4438 12359 3662 -26730 -33181 -3246 9979 10995 -6424
8842 -6424 -7836 18991 46319 62438 63001 53396 38974 28361 10485 12340 -5296 -23254 12269
8829 12269 62694 46803 23962 8833 -11422 -11689 28225 38139 53066 48144 45406 34043 13165
8816 13165 -12552 3037 60310 76080 67737 82240 50975 46060 22134 2398 4102 32801
8804 32801 47958 35408 32425 29731 28959 10662 -7738 -36251 -51147 -52883 -32776 8586 17999
8791 17999 -27722 -34999 7333 -4270 -16029 13755 45986 -644 -28664 -39340 -45645 -22470
8779 -22470 -16762 -24451 -22637 -41198 -46515 -12920 21220 12544 19364 41363 17237 8707 -12131
8766 -12131 -16523 14619 29629 24094 2891 -23526 -22001 34596 63971 53196 18786 13218 34906
$$ packed form
8855i608k1271R972j8072J4888K8529P921q697l0392o451K9935J3225J016j7419
8842f424j412K6827K7328J6119N63r605j4422j0613j7876J855j7636j7958L5523
8829A2269N0425j5891k2841j5129k0255k67L9914R914J4927m922k738j1363k0878
8816A3165k5717J5589N7273J5770q343J4503l1265m915k3926j9736J704K8699
8804C2801J5157j2550k983k694p72j8297j8400k8513j4896j736K0107M1362R413
8791A7999m5721p277M2332j1603j1759K9784L2231m6630k8020j0676o305K3175
8779b2470N708p689J814j8561n317L3595L4140q676O820K1999k4126q530k0838
8766a2131m392L1142J5010n535k1203k6417J525N6597K9375j0775l4410n568K1688
$$ plain form
8753 34906 25678 3804 5645 -675 1612 510 38581 29162 7428 -2706 9614 10224 127
8740 127 1607 19424 19271 8448 8343 -2934 -2500 -8569 4696 12448 -5492 5238 3260 -9300
8726 -9300 7373 61386 87890 66397 56725 53359 77719 75757 43163 27099 11118 691 7063
8713 7063 3847 -11623 18382 27942 3872 4300 13512 12241 42899 12230 -16862 -34215 -31987
8700 -31987 -27196 -20384 -18111 12073 38728 27089 -4109 9138 32457 41916 5347 -11905 -5959
8687 -5959 -11601 -45549 -37859 -27989 -19470 -12162 -7545 -28 -30066 -35942 -25479 -14139 12121 28239
8673 28239 24396 47620 33301 29430 41336 38734 33804 15282 -10560 -20183 -8565 6269 -20783
8660 -20783 1806 18060 18383 52306 46753 39878 25852 40185 38421 -2757 -23222 10130 43783
$$ packed form
8753C4906r228k1874J841o320K287j102L8071r419k1734j0134J2320O10j0097
8740A27J480J7817j53j0823j05j1277M34o069J3265P752j7940J0730j978j2560
8726i300J6673N4013K6504k1493r672l366K4360j962l2594j6064j5981j0427O372
8713G063l216j5470L0005R560k4070M28R212j271L0658l0669k9092j7353K228
8700c1987M791O812K273L0184K6655j1639l1198J3247K3319R459l6569j7252N946
8687e959n642l3948P690R870Q519P308M617P517l0038n876J0463J1340K6260J6118
8673B8239l843K3224j4319l871J1906k602m930j8522k5842r623J1618J4834k7052
8660b0783K2589J6254L23L3923n553o875j4026J4333j764m1178k0465L3352L3653
$$ plain form
8647 43783 53488 40725 27380 28999 35682 39152 26775 20277 20839 66371 56784 26686 -11281
8634 -11281 -25603 9683 -135 -3039 -13621 -46724 -26420 7271 8739 -949 -8309 6636 14802
8621 14802 4573 1758 -26058 5745 20920 10206 7744 22056 54630 45160 33824 18574
8609 18574 8382 377 11893 5527 -17291 -6780 10869 19963 -2278 -17877 -5521 40810
8597 40810 24345 21262 36131 27109 15826 6891 15891 27528 -3020 -12740 11435 21841 44595
8584 44595 28949 4722 4851 15954 30014 29819 40505 55947 81530 63758 37270 50620 52427
8571 52427 53786 42091 29968 13992 30239 20596 3959 -4706 -1526 24974 27423 4585 15439
8558 15439 9346 5235 46138 57449 47702 12720 -10723 -21136 -15508 9563 25378 3793 -16129
$$ packed form
8647D3783R705j2763j3345J619O683L470j2377o498N62M5532r587l0098l7967
8634a1281j4322L5286r818k904j0582l3103K0304L3691J468r688p360J4945Q166
8621A4802j0229k815k7816L1803J5175j0714k462J4312L2574r470j1336j5250
8609A8574j0192q005J1516o366k2818J0511J7649R094k2241j5599J2356M6331
8597D0810j6465l083J4869r022j1283q935R000J1637l0548r720K4175J0406K2754
8584D4595j5646k4227J29J1103J4060j95J0686J5442K5583j7772k6488J3350J807
8571E2427J359j1695j2123j5976J6247r643j6637q665L180K6500K449k2838J0854
8558A5439o093m111M0903J1311r747l4982k3443j0413N628K5071J5815k1585j9922
$$ plain form
8545 -16129 -12310 -10269 27624 62896 4811 -17507 7445 23015 32583 39802 28338 11701 4513
8532 4513 -2893 -15020 -31040 -38043 -35932 -31543 -21930 -26185 -13286 -4140 -7688 8649 -1038 -20295
8518 -20295 -44130 -17109 -38384 -27836 -18030 -3109 -24083 -21753 1433 9752 17475 -15735 -37870
8505 -37870 -33849 1520 20255 18342 13342 29028 26395 44259 18482 -8546 -15840 -20813 -42311
8492 -42311 -51208 -37219 -30870 3586 16980 -19762 -25559 -9016 9786 24126 42136 26498
8480 26498 5795 436 14228 -10424 -33862 -27158 6762 43280 21450 4864 23106 -7021
8468 -7021 30258 56326 58776 68183 58791 -1495 -23542 -21798 -11768 -6664 -2968 13868 22848
8455 22848 30301 23358 34050 23070 14473 17533 31741 64898 81520 72418 61948 48856 24170
$$ packed form
8545a6129L819K041L7893L5272n8085k2318K4952J5570R568P219j1464j6637p188
8532D513p406j2127j6020p003K111M389R613m255J2899R146l548J6337r687j9257
8518b0295k3835K7021k1275J0548R806J4921k0974K330K3186Q319P723l3210k2135
8505c7870M021L5369J8735j913n000J5686k633J7864k5777k7028p294m973k1498
8492d2311q897J3989O349L4456J3394l6742n797J6543J8802J4340J8010j5638
8480B6498k0703n359J3792k4652k3438O704L3920L6518k1830j6586J8242l0127
8468g021L7279K6068K450R407r392o0286k2047J744J0030N104L696J6836Q980
8455B2848P453o943J0692j0980q597L060J4208L3157J6622r102j0470j3092k4686
$$ plain form
8442 24170 11923 19837 31522 40884 49210 33600 29648 37671 43590 20820 -1846 -28572 -5783
8429 -5783 30468 37597 62094 50535 17369 1586 -16197 -2165 29531 26376 25740 -1412 -17988
8416 -17988 -90 25749 17686 -8231 4334 -6471 -19793 4521 -20495 -35545 -22531 -12571
8404 -12571 -11993 -23484 -47735 -35023 -14736 -21880 -4140 29188 15026 -10965 -19322 -31432 -6749
8391 -6749 15065 21665 7585 -13497 -14448 -24253 -22752 -13771 -12652 -33446 -60530 -63828 -30508 -1235
8377 -1235 -18457 -37318 -4641 -17374 -22149 -12990 3806 10006 11969 11647 -8044 6486 6532 46024
8363 46024 79114 49356 11132 -17374 -28215 -15494 7057 -3108 -875 12361 22020 512
8351 512 -1928 3548 9414 25345 27524 15707 -618 1338 33323 35261 27870 48744 63576 62137
$$ packed form
8442B4170j2247P914J1685R362Q326j5610l952Q023N919k2770k2666k6726K2789
8429e783L6251P129K4497j1559l3166j5783j7783J4032L1696l155o36k7152j6576
8416a7988J7898K5839q063k5917J2565j0805j3322K4314k5016j5050J3014R960
8404a2571N78j1491k4251J2712K0287p144J7740L3328j4162k5991q357j2110K4683
8391f749K1814O600j4080k1082r51r805J501Q981J119k0794k7084l298L3320K9273
8377a235j7222j8861L2677j2733m775R159J6796O200J963l22j9691J4530M6L9492
8363D6024L3090k9758l8224k8506j0841J2721K2551j0165K233J3236R659k1508
8351E12k440N476N866J5931K179j1817j6325J956L1985J938p391K0874J4832j439
$$ plain form
8337 62137 47764 40357 48489 74148 81616 73488 64139 49432 46653 41393 15143 -1090 1604
8324 1604 -7532 -23721 -30642 -7561 -16774 1477 -11009 -40132 -8054 5597 18506 24403 7541
8311 7541 4243 1132 19375 -3886 380 -8837 17871 35668 39391 12864 -888 23690 79132
8298 79132 117855 146967 163427 143226 126473 136316 113743 98536 89967 66045 11541 -12767
8286 -12767 -14656 15195 38859 41529 55878 30529 9445 -11942 -5399 -1430 4007 20782 460
8273 460 6811 1782 5705 -14234 -30463 -25988 -12999 -37910 -50216 -49122 -75965 -66133 -34385
8260 -34385 -29480 7819 46928 69710 43691 54246 42215 40727 61724 52779 43921 86205 134385
8247 134385 132115 67372 39960 31000 51663 65273 56068 56999 22526 -33 10028 -14510 -27450
$$ packed form
8337F2137j4373p407Q132K5659P468q128r349j4707k779n260k6250j6233K694
8324A604r136j6189o921K3081r213J8251j2486k9123L2078J3651J2909N897j6862
8311G541l298l111J8243k3261M266r217K6708J7797L723k6527j3752K4578N5442
8298G9132L8723K9112J6460k0201j6753R843k2573j5207q569k3922n4504k4308
8286a2767j889K9851K3664K670J4349k5349k1084k1387O543L969N437J6775k0322
8273D60O351n029L923j9939j6229M475J2989k4911j2306J094k6843R832L1748
8260c4385M905L7299L9109K2782k6019J0555j2031j488K0997q945q858M2284M8180
8247A34385k270o4743k7412q960K0663J3610r205R31l4473k2559J0061k4538j2940
$$ plain form
8234 -27450 8596 29644 -4685 3621 35933 37947 33244 16976 -6051 -16834 16312 4428
8222 4428 -31366 -20849 13227 23217 42405 60880 35568 -13034 -17936 22964 50387 29114
8210 29114 19731 10919 18003 16475 5358 -37933 -56874 -45469 -53676 -82631 -84088 -50626 -30494
8197 -30494 -22302 -17829 -10812 -11280 -25824 -12850 -3122 9697 2315 4485 7336 19954 16346 29637
8183 29637 42584 29419 6791 13470 -11892 -33057 -22054 -10138 4729 4266 26606 -7083
8171 -7083 -14981 -12876 -20802 -20396 3668 30297 16921 20446 20134 -35878 -61577 1228 26905 17813
8157 17813 32589 23163 31867 39487 40484 57838 52277 34198 2760 -7386 -20658 -46392 -34675
8144 -34675 -15723 6235 -10567 -25175 -8613 2261 23890 32054 19252 27906 43065 55732
$$ packed form
8234b7450L6046K1048l4329Q306L2312K014m703j6268k3027j0783L3146j1884
8222D428l5794J0517L4076R990J9188J8475k5312m8602m902M0900K7423k1273
8210B9114r383q812P084j528j1117m3291j8941J1405q207k8955j457L3462K0132
8197c0494Q192M473P017m68j4544J2974R728J2819p382K170K851J2618l608J3291
8183B9637J2947j3165k2628O679k5362k1165J1003J1916J4867m63K2340l3689
8171g083p898K105p926M06K4064K6629j3376L525l12n6012k5699O2805K5677r092
8157A7813J4776r426Q704P620R97J7354n561j8079l1438j0146j3272k5734J1717
8144c4675J8952K1958j6802j4608J6562J0874K1629Q164j2802Q654J5159J2667
$$ plain form
8132 55732 68366 46561 25412 -4227 -17968 -3612 -7458 -15618 -25609 -34810 -25041 -26089 -22871
8119 -22871 -2138 3570 5304 -4514 17989 18312 6734 45634 58505 36944 11145 2000 2215
8106 2215 12675 13516 15933 15791 6547 2006 -24133 -11546 3880 -1067 16953 -392 850 9836
8092 9836 20191 41393 42698 8092 -13343 -9386 6172 41041 58017 58743 48008 28705 -15085
8079 -15085 -21179 -17520 -35558 -23314 10292 24115 44100 45816 24765 23134 10410 26765 43421
8066 43421 47194 21872 -5990 -11776 -10305 -17606 -12071 36938 74257 67762 61299 63247 62177 36197
8052 36197 24433 36564 45341 9569 -13658 -12098 -27800 4032 1223 -7220 -5930 -3333 -18222
8039 -18222 -16566 -9432 8075 33903 34804 14854 -9274 -13068 6195 4165 -1020 9417 -2927
$$ packed form
8132E5732J2634k1805k1149k9639j3741J4356l846q160r991r201R769j048L218
8119b2871K0733N708J734r818K2503L23j1578L8900J2871k1561k5799r145K15
8106B215J0460Q41K417j42r244m541k6139J2587J5426m947J8020j7345J242Q986
8092I836J0355K1202J305l4606k1435L957J5558L4869J6976P26j0735j9303m3790
8079a5085o094L659j8038J2244L3606J3823J9985J716k1051j631j2724J6355J6656
8066D3421L773k5322k7862n786J471p301N535M9009L7319o495o463J948j070k5980
8052C6197j1764J2131Q777l5772k3227J560j5702L1832k809q443J290K597j4889
8039a8222J656P134J7507K5828R01j9950k4128l794J9263k030n185J0437j2344
$$ plain form
8026 -2927 -2088 28229 55197 22431 11195 10507 16714 -3413 -26575 -14630 8218 40006 45213
8013 45213 55737 64005 68809 19694 -14943 -14391 -31560 -12147 -18748 -46768 -47317 -41533 -20397
8000 -20397 -38226 -44174 -51676 -50436 -27695 9414 13097 2314 10197 10605 22642 18707 -11843
7987 -11843 -42976 -11606 7353 14005 7868 5448 13009 29648 1344 -31829 -42520 -44684 -14940
7974 -14940 -8016 6640 17567 27075 41079 26816 -8321 -16164 -27452 -36156 -33610 -15662 -1853
7961 -1853 15007 -17921 -29332 -3248 7299 11222 25530 22674 -1048 -2753 1030 -3551 13171
7948 13171 24299 18074 15970 -9579 -24893 -7793 9498 -273 -3697 1604 19049 17143 -19182
7935 -19182 -36427 -46710 -37357 -21338 -8214 4022 -13835 -175 6611 -8675 7019 35532
$$ packed form
8026b927Q39L0317K6968l2766j1236o88O207k0127k3162J1945K2848L1788N207
8013D5213J0524Q268M804m9115l4637N52j7169J9413o601k8020n49N784K1136
8000b0397j7829n948p502J240K2741L7109L683j0783P883M08J2037l935l0550
7987a1843l1133L1370J8959O652o137k420P561J6639k8304l3173j0691k164K9744
7974a4940O924J4656J0927R508J4004j4263l5137p843j1288q704K546J7948J3809
7961a853J6860l2928j1411K6084J0547L923J4308k856k3722j705L783m581J6722
7948A3171J1128o225k104k5549j5314J7100J7291r771l424N301J7445j906l6325
7935a9182j7245j0283R353J6019J3124J2236j7857J3660O786j5286J5694K8513
$$ plain form
7923 35532 18796 684 536 -1594 -9638 -14313 -32527 -31073 -14431 1567 -3133 39163 38402 18073
7909 18073 22961 30954 41150 36893 26229 8127 3753 2802 10428 -11580 -35369 -10037 50362
7896 50362 28627 -17504 -50184 -35983 -5736 26261 32867 -3971 -23086 -23478 23603 54013
7884 54013 37616 7638 -17274 -32359 -36099 -38089 -38083 -44962 1518 40541 24059 10684 3203
7871 3203 11425 194 -38796 -47908 -28365 -15466 -13049 -20852 -24286 -27003 -25621 -2424 12450
7858 12450 15796 -1779 -14776 -24514 -19659 -1630 -8099 -37262 -12264 -10681 -18890 2856 -23386
7845 -23386 3447 6507 3162 13284 13593 -11666 -24778 -33784 -49372 -60441 -37220 -11275 9710
7832 9710 29962 36914 38594 16275 -1862 -43078 -33494 20116 53400 44864 31757 11122 -13651
$$ packed form
7923C5532j6736j8112j48k130q044m675j8214J454J6642J5998m700M2296p61k0329
7909A8073M888P993J0196m257j0664j8102m374r51P626k2008k3789K5332O0399
7896E0362k1735m6131l2680J4201L0247L1997O606l6838j9115l92M7081L0410
7884E4013j6397k9978k4912j5085l740j990Oo879M6480L9023j6482j3375p481
7871C203Q222j1231l8990r112J9543J2899K417p803l434k717J382K3197J4874
7858A2450L346j7575j2997r738M855J8029o469k9163K4998J583q209K1746k6242
7845b3386K6833L060l345J0122L09k5259j3112r006j5588j1069K3221K5945K0985
7832I710K0252O952J680k2319j8137m1216R584N3610L3284q536j3107k0635k4773
$$ plain form
7819 -13651 -2587 -2623 5456 31677 31549 4230 4694 20771 -3846 -1292 17 -19813 4310 35259
7805 35259 49046 25375 37088 50667 47226 55122 56236 36561 29387 29169 3254 -4077 -8498
7792 -8498 -41984 -39560 -12599 -22636 -31027 -44315 -23038 3415 3822 -5208 -19761 -15062 17167
7779 17167 27794 14928 9520 19621 37079 36050 513 -39897 -4291 28365 33086 54345
7767 54345 61926 42939 21777 8071 -5090 -14860 8063 8286 22324 15739 318 20270 31011
7754 31011 9539 -33120 -39037 -28775 -3456 -2558 24404 10973 -1515 9449 12550 17659 27078
7741 27078 20711 33686 55161 64524 16020 -35237 -29347 -35224 -34624 -8393 2775 -35930 -15033
7728 -15033 8523 25268 2492 -15708 -3635 8806 31788 45458 29688 23207 58313 37283
$$ packed form
7819a3651J1064l6Q079K6221j28k7319M64J6077k4617K554J309j9830K4123L0949
7805C5259J3787k3671J1713J3579l441P896J114j9675p174k18k5915p331m421
7792h498l3486K424K6961j0037q391j3288K1277K6453M07r030j4553M699L2229
7779A7167J0627j2866n408J0101J7458j029l5537m0410L5606L2656M721K1259
7767E4345P581j8987k1162j3706j3161r770K2923K23J4038o585j5421J9952J0741
7754C1011k1472m2659n917J0262K5319Q98K6962j3431j2488J0964L101N109R419
7741B7078o367J2975K1475R363m8504n1257N890n877O00K6231J1168l8705K0897
7728a5033K3556J6745k2776j8200J2073J2441K2982J3670j5770o481L5106k1030
$$ plain form
7716 37283 3021 -18443 -35098 -29983 -8289 281 -3208 8951 -2067 7597 -4141 -12581 3432
7703 3432 16697 10276 6726 1017 18315 5713 3142 197 14252 30555 19463 1056 -12463
7690 -12463 -14362 -6157 -2263 -20052 -46118 -30452 -29158 -30015 -37055 -43972 -10724 -25243 -34066 -21391
7676 -21391 -26603 -29759 -20507 -28199 -1812 29382 19858 12599 -23588 -28827 -10939 3301 26706
7663 26706 26172 18296 46899 50654 41376 60615 47947 53787 45889 56632 93417 76000 57226
7650 57226 34204 3707 672 19113 19391 -15217 -44865 -28676 -30699 -36679 -24658 -42274 -60690
7637 -60690 -41288 10979 19998 12698 -7572 12398 -6586 -38509 -31054 -17102 856 6027 6958
7624 6958 -16362 -19735 -21918 -9933 -22695 -26612 -2572 23350 7613 16404 25631 7388 -2303
$$ packed form
7716C7283l4262k1464j6655N115K1694Q570l489J2159j1018R664j1738q440J6013
7703C432J3265o421l550n709J7298j2602k571k945J4055J6303j1092j8407j3519
7690a2463j899Q205L894j7789k6066J5666J294q57p040o917L3248j4519q823J2675
7676b1391n212l156R252p692K6387L1194r524p259l6187n239J7888J4240K3405
7663B6706n34p876K8603L755r278J9239j2668N840p898J0743L6785j7417j8774
7650E7226k3022l0497l035J8441K78l4608k9648J6189k023n980J2021j7616j8416
7637f0690J9402N2267R019p300k0270J9970j8984l1923P455J3952J7958N171R31
7624F958k3320l373k183J1985j2762l917K4040K5922j5737Q791R227j8243r691
$$ plain form
7611 -2303 3154 -13168 -26149 -22627 -18378 6253 -12642 -32813 -19048 -17395 -22296 -16188 -3451
7598 -3451 16992 -1515 -23212 -36609 -24027 -5289 1028 -22482 -39291 -22178 -2869 15626
7586 15626 -19491 -19702 -2080 -3750 -5735 21419 22708 11740 17648 18178 28991 -7410 -199 -6661
7572 -6661 -6803 25660 19836 -434 -20197 -38046 -45908 -53314 -42828 -27236 -12464 -23330 -48160
7559 -48160 -18304 -1257 -1998 7057 -296 -12782 -45126 -72994 -54998 -11323 11212 26909 31941
7546 31941 -1950 -27848 -8326 20202 36370 28826 50466 53525 58922 24760 17534 2265 -175
7533 -175 3537 -15833 -5617 5603 -10333 -21 -2005 -26831 -21616 -8606 13748 19195 7983
7520 7983 5545 -30796 -37889 -15211 -12450 11158 47461 24341 -7669 -5719 1239 1553 20462
$$ packed form
7611b303N457j6322j2981L522M249K4631j8895k0171J3765J653m901O108J2737
7598c451K0443j8507k1697j3397J2582J8738O317k3510j6809J7113J9309J8495
7586A5626l5117k11J7622j670j985K7154J289j0968N908N30J0813l6401P211o462
7572f661j42L2463n824k0270j9763j7849p862p406J0486J5592J4772j0866k4830
7559d8160K9856J7047p41R055p353j2486l2344k7868J7996M3675K2535J5697N032
7546C1941l3891k5898J9522K8528J6168p544K1640L059N397l4162p226j5269k440
7533a75L712j9370J0216J1220j5936J0312j984k4826N215J3010K2354N447j1212
7520G983k438l6341p093K2678K761K3608L6303k3120l2010J950O958L14J8909
$$ plain form
7507 20462 24252 4382 729 -20836 -12095 4878 47753 42461 -16196 -4252 1522 -20891 -19801
7494 -19801 -15587 -1152 -4283 -26051 -55349 -54093 -55859 -43189 -19027 -17366 -32487 -38456 -39182
7481 -39182 -24049 -36300 -32714 -25727 -22565 15792 36392 29361 -19890 -19058 -31810 -36084 68
7468 68 20224 22575 11430 19926 31077 13488 -20493 -36495 -27991 5522 -9988 -41 16343
7455 16343 -3181 -38526 -57017 -76557 -60605 -25040 -27264 -23867 -40428 -26764 -18578 4869
7443 4869 -32424 -45473 -44023 -544 -2763 -24473 -39406 -19265 -28874 -58143 -59679 -36655 -33813
7430 -33813 -27429 -15298 -9042 -9460 12288 23105 8387 -13176 -7364 -33765 -49249 -8326 -4394
7417 -4394 -13004 -7349 24179 28530 20996 32529 35096 10960 11788 -3600 -2192 -17616 -17266 10359
$$ packed form
7507B0462L790j9870l653k1565Q741J6973M2875n292n8657J1944N774k2413J090
7494a9801M214J4435l131k1768k9298J256j766J2670K4162J661j5121n969p26
7481c9182J5133j2251L586O987L162L8357K0600p031m9251Q32j2752m274L6152
7468F8K0156K351j1145Q496J1151j7589l3981j6002Q504L3513j5510R947J6384
7455A6343j9524l5345j8491j9540J5952L5565k224L397j6561J3664Q186K3447
7443D869l7293j3049J450M3479k219k1710j4933K0141r609k9269j536K3024K842
7430c3813O384J2131O256m18K1748J0817j4718k1563N812k6401j5484M0923L932
7417d394q610N655L1528M351p534J1533K567k4136Q28j5388J408j5424L50K7625
$$ plain form
7403 10359 8186 -1068 4943 -9352 12050 26613 -10173 -32741 -7809 10122 -27417 -30621 -10298
7390 -10298 -4332 -26674 -6349 28426 30405 21557 -5150 -17409 -107 -1305 116 -12183 -16823
7377 -16823 -32134 -18893 -836 8576 -14734 -26788 -22271 -31795 -25246 10332 29078 25075 -525
7364 -525 -22633 -34357 -8182 10318 -17071 -17617 -42399 -9414 -19857 -35421 -17522 -27099 -47493
7351 -47493 -25597 -22013 -26644 6140 16159 34042 11568 -22951 -42244 -42006 -33775 -38625 -8159
7338 -8159 -18497 -15950 -8998 -17317 -44996 -43526 -31783 -9627 -24517 -23169 -21262 -22414 -17254 -43974
7324 -43974 -29157 1755 -12308 -10626 -13930 -461 2011 -14002 -14604 -15284 -10430 -26333 -13674
7311 -13674 11979 29746 26128 8731 12670 23164 -14567 -27273 -23768 -41387 -16084 12947
$$ packed form
7403A0359k173r254O011j4295K1402J4563l6786k2568K4932J7931l7539l204K0323
7390a0298N966k2342K0325L4775J979q848k6707j2259J7302j198J421j2299m640
7377a6823j5311J3241J8057R412k3310j2054M517r524O549L5578J8746m003k5600
7364e25k2108j1724K6175J8500k7389n46k4782L2985j0443j5564J7899r577k0394
7351d7493K1896L584m631L2784J0019J7883k2474l4519j9293K38Q231m850L0466
7338h159j0338K547O952q319k7679J470J1743K2156j4890J348J907j152N160k6720
7324d3974J4817L0912j4063J682l304J3469K472j6013o02o80M854j5903J2659
7311a3674K5653J7767l618j7397L939J0494l7731j2706L505j7619K5303K9031
$$ plain form
7299 12947 26495 21900 -17865 -9732 6399 -28785 -30661 -3979 -1820 93 -6460 -16229 -35862
7286 -35862 -14727 -14874 -14634 -33901 -29899 -34548 -43352 -47020 -22530 -3650 -1438 -50496 -42263 -11798
7272 -11798 9922 -4636 -12980 386 -11009 -24180 -21571 -6494 4085 -5820 5372 10939 -3927
7259 -3927 -5395 -5123 30962 24363 3823 -45724 -78800 -74519 -59723 -51497 -41963 -64007 -55204 -38407
7245 -38407 27753 47238 17069 11712 13775 1971 20108 47484 36832 8447 -17486 -39010
7233 -39010 -44068 -52935 -24681 -16420 -28841 -25968 -15264 15609 9468 17506 19256 1853 -6821
7220 -6821 2844 -22107 -40219 -49018 -14221 11161 8045 1963 -8612 6015 -17157 -26033 -11476
7207 -11476 -10644 -3425 -27880 -25259 10533 24726 6171 -15009 -32119 -24541 2619 17648 -4086
$$ packed form
7299A2947J3548m595l9765Q133J6131l5184j876K6682K159J913o553r769j9633
7286c5862K1135j47K40j9267M002m649q804l668K4490J8880K212m9058Q233L0465
7272a1798K1720j4558q344J3366j1395j3171K609J5077J0579r905J1192N567j4866
7259c927j468K72L6085o599k0540m9547l3076M281J4796Q226R534k2044Q803J6797
7245c8407O6160J9485l0169n357K063j1804J8137K7376j0652k8385k5933k1524
7233c9010n058q867K8254Q261j2421K873J0704L0873o141Q038J750j7403q674
7220f821R665k4951j8112q799L4797K5382l116o082j0575J4627k3172q876J4557
7207a1476Q32P219k4455K621L5792J4193j8555k1180j7110P578K7160J5029k1734
$$ plain form
7194 -4086 -3477 180 5598 284 9067 18836 30403 28000 2290 -4053 -346 -8974 -14297 26329
7180 26329 41638 9439 -4618 -5668 -17705 -6444 -26685 -23311 -3933 10420 14392 17356 -1868
7167 -1868 -15135 -25624 -27519 -18609 -23190 -12559 13124 5607 -23132 -15592 -1455 -9911 -7862
7154 -7862 11728 613 29003 56319 54054 59246 79273 71267 55966 25704 20188 8357 -10163
7141 -10163 -32712 -39338 -39961 -1105 7680 37775 42885 33712 -1901 -23111 -23796 -18205 -18585 -10257
7127 -10257 -597 -5643 10310 19430 21483 17001 -13625 19654 52753 26066 4289 20835 2459
7114 2459 42825 58223 30237 32524 22359 17017 7443 -13172 14217 31140 46845 1737 -17311
7101 -17311 -44162 -19739 -6198 -32877 -37784 -18989 19646 9577 22398 49465 39149 126
$$ packed form
7194d086O09L657N418n314Q783R769J1567k403k5710o343L707q628n323M0626
7180B6329J5309l2199j4057j050j2037J1261k0241L374J9378J4353L972K964j9224
7167a868j3267j0489j895Q910m581J0631K5683p517k8739P540J4137q456K049
7154g862J9590j1115K8390K7316k265N192K0027q006j5301l0262n516j1831j8520
7141a0163k2549o626o23L8856Q785L0095N110r173l5613k1210o85N591l80Q328
7127a0257R660n046J5953R120K053m482l0626L3279L3099k6687k1777J6546j8376
7114B459M0366J5398k7986K287j0165n342r574k0615K7389J6923J5705m5108j9048
7101a7311k6851K4423J3541k6679m907J8795L8635j0069J2821K7067j0316l9023
$$ plain form
7089 126 -12199 -11361 -18255 -23431 -3352 16718 5671 -5194 -4401 -2170 19937 -1249 -5097 11248
7075 11248 12263 25350 25437 15061 21387 10094 142 -14247 -13271 10882 14968 -16781 -22235 -15442
7061 -15442 -18654 -1389 292 -18634 -25516 -20229 -27671 -59235 -58094 -62875 -55629 -46066 -28725 -31796
7047 -31796 -43314 -37753 -28988 -30014 -54883 -50269 -33671 -18639 -4637 880 -11157 -29048 -22590
7034 -22590 4932 3317 -2800 15577 21326 11439 21319 9175 -13674 -23056 4878 2929 13023
7021 13023 35949 31196 5192 -9679 -42671 -37055 -46067 -27456 2822 -752 -8018 5160 24324
7008 24324 17132 16743 -10795 -10712 4359 -5805 -23983 -29094 1542 12840 3455 30909 57668
6995 57668 26349 -1870 29895 42884 27405 -5330 -23328 -7647 16244 28986 30580 8452
$$ packed form
7089A26j2325Q38o894n176K0079K0070j1047j0865P93K231K2107k1186l848J6345
7075A1248J015J3087Q7j0376O326j1293r952j4389R76K4153M086l1749n454O793
7061a5442l212J7265J681j8926o882N287p442l1564J141m781P246R563J7341l071
7047c1796j1518N561Q765j026k4869M614J6598J5032J4002N517j2037j7891O458
7034b2590K7522j615o117J8377N749r887R880j2144k2849r382K7934j949J0094
7021A3023K2926m753k6004j4871l2992N616r012J8611L0278l574p266J3178J9164
7008B4324p192l89k7538Q3J5071j0164j8178n111L0636J1298r385K7454K6759
6995E7668l1319k8219L1765J2989j5479l2735j7998J5681K3891J2742J594k2128
$$ plain form
6983 8452 3194 -15833 -12867 -2125 27772 28465 18649 22694 35214 -3362 -26756 18713 30038
6970 30038 27965 7242 -14515 -15981 -23763 -13343 -9428 -22374 -24097 -28074 -23125 -23515 -7552 -9784
6956 -9784 -15591 -20102 -6941 -7434 -27565 -58654 -74666 -43124 -35771 -10949 -5048 -271 451 13195
6942 13195 28031 18243 21188 33979 14834 -17644 6916 9320 22237 51344 50929 -1853 -13447
6929 -13447 -18578 3818 -21799 -20275 1760 8322 -34035 -42933 -41780 -3335 -13970 -20169 -13575
6916 -13575 -49998 -42329 -5283 -10928 -51296 -50960 -44114 -11900 -14965 -25866 -27370 5643 58809
6903 58809 21942 -108 9548 2047 25206 39391 29813 6918 -9073 14170 6471 19427 7345
6890 7345 18728 1526 -11429 -6319 8913 15627 37472 10167 -22697 -31521 -26586 -26550 -57160
$$ packed form
6983H452n258j9027K966J0742K9897O93r816M045J2520l8576k3394M5469J1325
6970C0038k073k0723k1757j466p782J0420L915j2946j723l977M949l90J5963k232
6956i784n807m511J3161m93k0131l1089j6012L1542P353K4822N901M777P22J2744
6942A3195J4836r788K945J2791j9145l2478K4560K404J2917K9107m15n2782j1594
6929a3447n131K2396k5617J524K2035O562m2357q898J153L8445j0635o199O594
6916a3575l6423P669L7046n645m0368L36O846L2214l065j0901j504L3013N3166
6903E8809l6867k2050R656p501K3159J4185r578k2895j5991K3243p699J2956j2082
6890G345J1383j7202j2955N110J5232O714K1845k7305l2864q824M935L6l0610
$$ plain form
6877 -57160 -55860 -28688 -31687 -9240 5674 -13405 -2024 16148 11010 31467 15588 -8997
6865 -8997 7857 45707 35896 8777 -9867 -24171 -9951 -11768 -8444 -25980 -42948 -39982 -34179
6852 -34179 -45078 -25771 -5036 -1493 18144 -10331 -31644 -10293 -1359 -10415 -35429 -18151
6840 -18151 -10979 -28361 -28979 140 -17075 -47109 -46708 -17435 -16071 -26501 -21226 -11809 13816
6827 13816 34105 17547 9849 19622 27837 17202 33989 41896 41490 22059 48132 37178 15919
6814 15919 8149 26968 21327 -2904 -23905 -10760 5642 2778 -10783 -10579 -21668 -15595 10465
6801 10465 34120 540 -7228 4097 -27322 -51961 -60440 -29398 27407 31711 13385 38114
6789 38114 37309 9814 -10640 -24855 -27453 -30438 -49739 -59313 -51681 -31506 -13368 25812 14031
$$ packed form
6877e7160J300K7172k999K2447J4914j9079J1381J8172n138K0457j5879k4585
6865h997J6854L7850r811k7119j8644j4304J4220j817L324j7536j6968K966N803
6852c4179j0899J9307K0735L543J9637k8475k1313K1351Q934r056k5014J7278
6840a8151P172j7382o18K9119j7215l0034M01K9273J364j0430N275R417K5625
6827A3816K0289j6558p698R773Q215j0635J6787P907m06j9431K6073j0954k1259
6814A5919p770J8819n641k4231k1001J3145J6402k864j3561K04j1089O073K6060
6801A0465K3655l3580p768J1325l1419k4639q479L1042N6805M304j8326K4729
6789C8114q05k7495k0454j4215k598k985j9301r574P632K0175J8138L9180j1781
$$ plain form
6776 14031 -15123 -7983 -9748 -1936 24950 -5647 -21393 -24027 -10961 5973 3663 -13362 -7585
6763 -7585 -20959 -29862 -14838 -54936 -83476 -56730 -12625 23242 59969 52783 38744 51194
6751 51194 49684 51597 27762 19679 30854 35603 7408 -3573 28319 37244 20774 3276 -37729
6738 -37729 -25366 -6288 -22590 -19227 -35057 -44497 -24053 -2285 5302 3823 9062 -8642 -15060
6725 -15060 -5822 -38075 -54459 -40222 -10895 -815 -2282 1603 -2482 -13703 -19503 1647 -8824
6712 -8824 2790 9231 21184 35571 20715 13464 166 -14262 -12675 -16881 -14174 -18621 -35304
6699 -35304 7331 19766 25931 27042 14833 -17034 2257 -3672 20798 30188 2755 -5891 -4292
6686 -4292 -10612 -10834 14732 -9224 -33776 -43719 -34676 -37502 -27132 -22594 2297 6110 -3812 -2240
$$ packed form
6776A4031k9154P140j765P812K6886l0597j5746k634J3066J6934k310j7025N777
6763g585j3374q903J5024m0098k8540K6746M4105L5867L6727p186j4039J2450
6751E1194j510J913k3835q083J1175M749k8195j0981L1892Q925j6470j7498m1005
6738c7729J2363J9078j6302L363j5830r440K0444K1768P587j479N239j7704o418
6725a5060R238l2253j6384J4237K9327J0080j467L885m085j1221n800K1150j0471
6712h824J1614O441J1953J4387j4856p251j3298j4428J587m206K707m447j6683
6699c5304M2635J2435O165J111j2209l1867J9291n929K4470R390k7433q646J599
6686d292o320k22K5566k3956k4552r943R043k826J0370M538K4891L813r922J572
$$ plain form
6672 -2240 10912 702 -20428 -19789 -3457 4917 -978 10944 28646 20604 -67 -14090 14186
6659 14186 32972 22307 6151 -5377 -33053 -40328 -20654 9313 7026 -5153 -18669 91
6647 91 -1522 -12507 -6486 11203 9361 2422 4729 943 15054 29902 34870 33734 33701 16278 3570
6632 3570 1638 32923 30234 -13759 -39683 -23026 11505 11019 -4396 -42028 -73708 -26318 -9741
6619 -9741 -2524 4071 -23469 -85546 -87380 -62835 -62065 -19980 15471 -1504 -7457 -379 -6102 -24411
6605 -24411 -51303 -33090 -11931 -1657 -15177 -6890 -16798 -27805 -8796 -34929 -43020 -32964
6593 -32964 -15561 6832 31281 38134 3826 -9796 -17835 -16962 -14356 -27017 -37085 -6895 -3704
6580 -3704 16172 -23044 -33204 6278 11024 4692 12835 -6006 -11583 17616 16764 -24242 -50853
$$ packed form
6672b240J3152j0210k1130O39J6332Q374n895J1922J7702q042k0671j4023K8276
6659A4186J8786j0665j6156j1528k7676p275J9674K9967k287j2179j3516J8760
6647I1j613j0985O021J7689j842o939K307l786J4111J4848M968j136l3j7423j2708
6632C570j932L1285k689m3993k5924J6657L4531m86j5415l7632l1680M7390J6577
6619i741P217O595k7540o2077j834K4545P70M2085L5451j6975n953P078n723j8309
6605b4411k6892J8213K1159J0274j3520Q287r908j1007J9009k6133q091J0056
6593c2964J7403K2393K4449O853l4308j3622q039Q73K606j2661j0068L0190L191
6580c704J9876l9216j0160L9482M746o332Q143j8841n577K9199q52m1006k6611
$$ plain form
6567 -50853 -41081 -27650 9545 36006 32689 3375 -26812 -38040 -30167 -31635 -35915 -39443 -45103
6554 -45103 -31072 -11707 -4958 -21274 -22457 -16609 -9249 -6296 23154 14425 2470 26471 26100
6541 26100 -6800 2096 33432 50237 44630 32123 23354 14054 -36824 -50981 -7342 29456 11921
6528 11921 -1286 5387 8681 1678 -12463 -18384 -29475 -49499 -34288 -21010 -31176 -44636 -60172
6515 -60172 -59586 -52613 -51826 -41931 -51616 -45498 -41613 -43014 -9060 11176 -548 -16930 -3267 -10866
6501 -10866 723 28939 13932 14338 29280 35609 25283 25607 26972 -18314 -38546 -30072 -38911
6488 -38911 -30839 4636 8681 19316 9561 -5401 -9128 9848 5777 -5787 -22485 -35237 -26350
6475 -26350 -11386 -16162 -1772 4835 -1516 12874 15241 6061 -12818 -6402 4180 4645 10348 29825
$$ packed form
6567e0853R772J3431L7195K6461l317k9314l0187j1228P873j468m280l528n660
6554d5103J4031J9365O749j6316j183N848P360K953K9450q729j1955K4001l71
6541B6100l2900Q896L1336J6805n607j2507q769r300n0878j4157M3639L6798j7535
6528A1921j3207O673L294p003j4141n921j1091k0024J5211J3278j0166j3460j5536
6515f0172N86O973P87R895r685O118L885j401L3954K0236j1724j6382J3663p599
6501a0866J1589K8216j5007M06J4942O329j0326L24J365m5286k0232Q474q839
6488c8911Q072L5475M045J0635r755j4962l727J8976m071j1564j6698j2752Q887
6475b6350J4964m776J4390O607o351J4390K367r180j8879O416J0582M65N703J9477
$$ plain form
6461 29825 23761 -1128 -20737 4365 8816 -5324 -10574 -18889 1077 17986 32276 8363 -11057
6448 -11057 -25867 -34440 -10810 5594 36998 1023 -14049 19284 44552 37605 15109 97
6436 97 -1874 7761 9025 -16216 -17620 30742 37887 15142 -11736 -12853 437 4023 4600 15036
6422 15036 23771 -1173 -4553 -19569 -34929 696 6850 7649 36551 54804 29364 -1 -3519
6409 -3519 -7376 -26955 -17823 -10401 -19977 -24524 -35954 -42617 -41665 -54731 -70591 -69000 -66208 -63279
6395 -63279 -37775 -53271 -43398 -39048 -56691 -60194 -50192 -45316 -29079 -28437 -52597 -34903 -16644
6382 -16644 -10915 -5121 7403 33283 24436 13397 -17977 -37057 -26535 -906 -15759 -36335
6370 -36335 -34053 -24364 -12304 -24099 -18436 -14077 -37683 -27672 -28547 -35861 -20773 3976 12302
$$ packed form
6461B9825o064k4889j9609K5102M451j4140n250q315J9966J6909J4290k3913j9420
6448a1057j4810q573K3630J6404L1404l5975j5072L3333K5268o947k2496j5012
6436I7j971R635J264k5241j404M8362P145k2745k6878j117J3290L586N77J0436
6422A5036Q735k4944l380j5016j5360L5625O154P99K8902J8253k5440k9365l518
6409c519l857j9579R132P422r576m547j1430o663R52j3066j5860J591K792K929
6395f3279K5504j5496R873M350j7643l503J0002M876J6237O42k4160J7694J8259
6382a6644N729N794J2524K5880q847j1039l1374j9080J0522K5629j4853k0576
6370c6335K282R689J2060j1795N663M359k3606J0011q75p314J5088K4749Q326
$$ plain form
6357 12302 -10539 -29734 -54793 -40457 -26277 -42844 -47518 -46138 -36012 342 9993 -4529
6345 -4529 12566 -33950 -22709 10370 -1343 -21014 -26379 -49475 -39999 -23483 -26723 -21619 -21470
6332 -21470 -13001 12626 18967 14298 40296 316 -53291 -57815 -29417 5756 22134 -12357 -43767
6319 -43767 -43606 -45945 -26201 -24430 -20282 -26524 -37479 -32797 -26802 -11312 10091 28918 18275
6306 18275 -12776 -5941 -23427 -6890 -27212 -34432 5156 29059 40905 35010 22194 37852
6294 37852 59766 35654 40494 59775 51828 15815 3563 14223 2639 -20270 -1860 25160
6282 25160 10359 -39598 -72103 -73417 -65032 -45728 -30524 -44216 -47601 -41421 -46189 -69355 -67586
6269 -67586 -37421 18005 46941 27713 14843 35830 38301 16416 10711 594 -8569 740 20292
$$ packed form
6357A2302k2841j9195k5059J4336J4180j6567m674J380J0126L6354R651j4522
6345d529J7095m6516J1241L3079j1713j9671n365k3096R476J6516l240N104J49
6332b1470Q469K5627O341m669K5998l9980n3607m524K8398L5173J6378l4491l1410
6319d3767J61k339J9744J771M148o242j0955M682N995J5490K1403J8827j0643
6306A8275l1051O835j7486J6537k0322p220L9588K3903J1846n895j2816J5658
6294C7852K1914k4112M840J9281p947l6013j2252J0660j1584k2909J8410K7020
6282B5160j4801m9957l2505j314Q385J9304J5204j3692l385O180m768k3166J769
6269f7586L0165N5426K8936j9228j2870K0987K471k1885n705j0117r163R309J9552
$$ plain form
6256 20292 -3632 -29512 -21424 -37847 -1345 31356 46376 50928 28742 6160 -7097 5940
6244 5940 42969 38501 7182 -1923 22615 1625 -18414 -10879 -18227 -13487 1108 16268 -1345
6231 -1345 -16934 -21630 -41833 -39613 -27832 -42169 -47926 -36837 -41574 -28601 -38026 -42611 -20210
6218 -20210 -32804 -23805 -22637 -20621 -26124 -45138 -30959 -23857 -14098 -11225 -8630 -549 -17062 -9966
6204 -9966 197 -8395 -4307 -4682 -575 13945 5719 -6349 7204 6107 720 -6458 -10818 -28379
6190 -28379 -55199 -52183 -36838 -26409 1238 -6127 -32638 -22542 -4862 -12563 -22296 -44094 -28260
6177 -28260 -3837 17470 13488 14731 14354 -1860 -4766 -40455 -49296 -17255 -10245 -16267 -23611 -17933
6163 -17933 -3877 -6022 -11127 6312 7309 9184 -47568 -64706 -42634 -45648 -39076 -74787 -77248
$$ packed form
6256B0292k3924k5880Q088j6423L6502L2701J5020M552k2186k2582j3257J3037
6244E940L7029m468l1319r105K4538k0990k0039P535p348M740J4595J5160j7613
6231a345j5589m696k0203K220J1781j4337n757J1089m737J2973r425m585K2401
6218b0210j2594Q999J168K016n503j9014J4179P102R759K873K595Q081j6513P096
6204i966J0163q592M088l75M107J4520q226j2068J3553j097n387p178m360j7561
6190b8379k6820L016J5345J0429K7647p365k6511J0096J7680p701r733k1798J5834
6177b8260K4423K1307l982J243l77j6214k906l5689q841L2041P010o022p344N678
6163a7933J4056k145n105J7439R97J875n6752j7138K2072l014O572l5711k461
$$ plain form
6150 -77248 -56827 -32114 -23899 -20328 2382 35125 20433 9882 36381 37499 38692 22223 -28746
6137 -28746 -11961 14867 15914 8769 22091 21168 21122 22632 11183 -14438 -25412 -34251 -34513 -63785
6123 -63785 -39724 -13859 -59683 -60159 -36805 -26427 -31955 -12580 29304 49509 46705 31125 11627
6110 11627 -38642 -68943 -64048 -45713 -41675 -24844 -23389 -17076 -24054 -38459 -5325 -5645 10196
6097 10196 4762 -24601 -22626 6661 11301 14830 5039 -18500 -33479 -16506 23120 61334 30629
6084 30629 -998 -35674 -23178 -16368 -21885 -22786 11629 15712 -1847 -10941 -21014 -17952 14267
6071 14267 15364 -26479 -34136 -14364 -25601 -21510 -12237 5527 666 -9676 -10509 -14077 -26806
6058 -26806 -35701 -41297 -39059 -22026 -830 18996 10581 -15416 -16351 22897 39113 9590 10211
$$ packed form
6150g7248K0421K4713Q215L571K2710L2743j4692j0551K6499J118J193j6469n0969
6137b8746J6785K6828J047p145J3322r23m6J510j1449k5621j0974q839k62k9272
6123f3785K4061K5865m5824m76K3354J0378n528J9375M1884K0205k804j5580j9498
6110A1627n0269l0301M895J8335M038J6831J455O313o978j4405L3134l20J5841
6097A0196n434k9363J975K9287M640L529r791k3539j4979J6973L9626L8214l0705
6084C0629l1627l4676J2496O810n517r01L4415M083j7559r094j0073L062L2219
6071A4267J097m1843p657J9772j1237M091R273J7764m861j0342q33l568j2729
6058b6806q895n596K238J7033K1196J9826q415k5997r35L9248J6216k9523O21
$$ plain form
6045 10211 3565 -17103 5353 5455 4358 -7910 14441 -6782 -17464 -6367 -919 -2725 34194
6032 34194 7470 -4336 -20357 -44700 -34590 -15381 6354 4997 9651 -7202 -27641 -2238
6020 -2238 2141 -10460 -18514 -29159 -40921 -31578 -48181 -33394 -7592 -2731 14800 9452 -16899
6007 -16899 -20768 -41658 -82827 -76424 -44972 -20071 -14459 6402 -19707 -14437 -6750 29198 45022
5994 45022 4995 -5477 -4266 11933 22816 1553 -5170 18844 13321 33632 17242 -9814
5982 -9814 -19203 -27735 -30971 -24558 -31067 -13261 32416 10646 -13388 -11022 -1998 1751 2954 -27969
5968 -27969 -49835 -24331 -22802 -39392 -55554 -58866 -43172 -10054 3747 16784 29201 35503
5956 35503 9676 -18375 -21938 3663 -12084 -19007 -23000 -46490 -44537 -5042 2955 -6876 -18484
$$ packed form
6045A0211o646k0668K2456J02j097j2268K2351k1223j0682J1097N448j806L6919
6032C4194k6724j1806j6021k4343J0110J9209K1735j357M654j6853k0439K5403
6020b238M379j2601q054j0645j1762R343j6603J4787K5802M861J7531n348k6351
6007a6899l869k0890m1169O403L1452K4901N612K0861k6109N270P687L5948J5824
5994D5022m0027j0472J211J6199J0883k1263o723K4014n523K0311j6390k7056
5982i814r389q532l236O413o509J7806M5677k1770k4034K366R024L749J203l0923
5968b7969k1866K5504J529j6590j6162l312J5694L3118J3801J3037J2417O302
5956C5503k5827k8051l563K5601j5747o923l993k3490J953L9495P997r831j1608
$$ plain form
5943 -18484 -33133 -16949 1949 -28194 -53317 -50420 -54119 -47545 -12919 -5665 -22396 -17818 -10330
5930 -10330 4453 5932 -5239 -21332 -15362 -16626 4496 8791 -4736 -20381 -28026 -16997 -24859
5917 -24859 -34266 -24506 -8472 -1595 -12784 -21650 -31500 -5462 16398 15528 -3083 2250 8559 -21281
5903 -21281 -12291 2897 7408 14454 9858 -16796 -30973 -11509 23527 5066 -11049 12084 36936
5890 36936 37627 21509 10685 -10586 -12120 -15234 653 12095 37620 33119 20477 16960 15316
5877 15316 28817 31603 30376 -6406 -25261 -15225 -14656 -29572 -58666 -54111 -48313 -58920 -59882
5864 -59882 -35762 -38849 -33125 -13532 -27713 -49810 -32831 -30149 -29394 -15826 -18905 30892 48092
5851 48092 12790 -636 -8031 9745 20261 37399 49026 14654 -9942 -25800 7205 33643
$$ packed form
5943a8484j4649J6184J8898l0143k5123K897l699O574L4626P254j6731M578P488
5930a0330J4783J479j1171j6093N970j264K1122M295j3527j5645p645J1029p862
5917b4859r407R760J6034O877j1189q866r850K6038K1860q70j8611N333O309k9840
5903b1281Q990J5188M511P046m596k6654j4177J9464L5036j8461j6115K3133K4852
5890C6936O91j6118j0824k1271j534l114J5887J1442K5525m501j2642l517j644
5877A5316J3501K786j227l6782j8855J0036N69j4916k9094M555N798j0607r62
5864e9882K4120l087N724J9593j4181k2097J6979K682P55J3568l079M9797J7200
5851D8092l5302j3426p395J7776J0516J7138J1627l4372k4596j5858L3005K6438
$$ plain form
5839 33643 13953 11479 869 -13493 -14424 -8618 4840 -18358 -38965 -37184 -47148 -27224 -9804
5826 -9804 -24108 -79126 -74239 -64004 -43559 -28310 -34539 -16214 -37989 -46281 -40624 -23526 -9214
5813 -9214 -666 -15588 -14476 -10892 -10468 -36512 -41731 -50652 -34527 -5433 -29146 -25326 -34674 -35181
5799 -35181 -20389 -8459 -24415 -8321 -5865 -11537 -5404 -37733 -50925 -34596 -11972 -453
5787 -453 -5614 -8213 5187 -526 -7561 14393 35304 22880 -12648 1312 10652 1766 10996 33853
5773 33853 -1486 -38684 -49673 -65421 -66935 -23468 -8473 -2208 6595 -9873 12538 18901 3343
5760 3343 9091 24013 -5062 -35766 -25897 -34564 845 -19520 -27772 9878 7974 2373 -10817
5747 -10817 -8473 -35159 -21598 -5754 8632 -10137 -8636 18184 9087 32770 35179 -14932 -41422
$$ packed form
5839C3643j9690k474j0610j4362r31N806J3458k3198k0607J781r964J9924J7420
5826i804j4304n5018M887J0235K0445J5249o229J8325k1775q292N657J7098J4312
5813i214Q548j4922J112L584M24k6044n219q921J6125K9094k3713L820r348n07
5799c5181J4792J1930j5956J6094K456n672O133l2329j3192J6329K2624J1519
5787d53n161k599J3400n713p035K1954K0911j2424l5528J3960R340q886R230K2857
5773C3853l5339l7198j0989j5748j514M3467J4995O265Q803j6468K2411O363j5558
5760C343N748J4922k9075l0704R869q667L5409k0365q252L7650j904n601j3190
5747a0817K344k6686J3561J5844J4386j8769J501K6820r097K3683K409n0111k6490
$$ plain form
5734 -41422 -37620 -62 22606 230 -10549 -38700 -59811 -54464 -13282 7444 23892 16496
5722 16496 -1666 -11761 1507 12740 7594 -10648 -31366 -41327 -60715 -45215 -24178 -9593
5710 -9593 -1558 12063 1713 -37130 -50519 -43512 -45620 -52708 -50513 -25566 2736 -443 -9662
5697 -9662 1966 11350 -2614 -16052 -1083 -18599 -33724 -53335 -51227 -2597 11258 19952 -18033
5684 -18033 -35710 -34514 -22156 -5491 -11246 -3527 13828 29596 32019 14156 9239 14374 -5294
5671 -5294 -22692 -30021 -43893 -28954 6825 30830 16304 22333 18694 13001 28672 22341 29857
5658 29857 22515 -3734 -11948 -2007 2413 -9394 -14575 -10494 3327 -1743 3121 6159 3289 36783
5644 36783 64287 36878 32054 44422 39637 33666 9604 -26108 -34517 -17661 -12632 -58923 -85888
$$ packed form
5734d1422L802L7558K2668k2376j0779k8151k1111N347M1182K0726J6448p396
5722A6496j8162j0095J3268J1233n146j8242k0718r961j9388J5500K1037J4585
5710i593Q035J3621j0350l8843j3389P007k108p088K195K4947K8302l179r219
5697i662J1628R384j3964j3438J4969j7516j5125j9611K108M8630J3855Q694l7985
5684a8033j7677J196J2358J6665n755P719J7355J5768K423j7863m917N135j9668
5671e294j7398p329j3872J4939L5779K4005j4526O029l639n693J5671o331P516
5658B9857p342k6249q214R941M420j1807n181M081J3821n070M864L038k870L3494
5644C6783K7504k7409m824J2368m785n971k4062l5712q409J6856N029m6291k6965
$$ plain form
5631 -85888 -71258 -67319 -22382 -27441 -16456 -1096 16151 26463 15929 33702 10412 8702
5619 8702 4586 -22842 -36664 -6945 20509 17313 16549 11893 35629 64503 36133 14052 2637
5606 2637 3529 -3131 8553 35522 39235 23581 36567 41091 46983 48740 5406 -18981 -10629 -26177
5592 -26177 -30021 -36683 -56398 -53251 -70197 -67596 -66516 -67470 -52619 -34638 -15469 -2849 -15790
5579 -15790 12282 23143 13434 13856 14709 21976 28216 13255 10586 -11835 -35300 -50775 -41380 -24987
5565 -24987 -32467 -59268 -32246 3792 9868 -4549 -8142 -12651 6523 23178 18823 16752 17336
5552 17336 20565 20143 11836 10412 19765 32953 2116 4243 34047 40952 13519 -17814 -18023 -21660
5538 -21660 5868 8456 10210 11548 1141 -21990 -16854 9897 9456 7826 14218 14104 -13060 -20699
$$ packed form
5631h5888J4630L939M4937n059J0985J5360J7247J0312j0534J7773k3290j710
5619H702m116k7428j3822K9719K7454l196p64m656K3736K8874k8370k2081j1415
5606B637Q92o660J1684K6969L713j5654J2986M524N892J757m3334k4387Q352j5548
5592b6177l844o662j9715L147j6946K601J080r54J4851J7981J9169J2620j2941
5579a5790K8072J0861r709M22Q53P267O240j4961k669k2421k3465j5475R395J6393
5565b4987p480k6801K7022L6038O076j4417l593m509J9174J6655m355k071N84
5552A7336L229m22q307j424R353J3188l0837K127K9804O905k7433l1333k09l637
5538b1660K7528K588J754J338j0407k3131N136K6751m41j630O392j14k7164p639
$$ plain form
5524 -20699 -1665 14806 2472 9588 13268 21307 25102 29256 15465 3026 11811 -1437 -17037
5511 -17037 -13125 6086 -3812 -40913 -29119 -37163 -59697 -64665 -40006 -38496 -11895 578 -5676
5498 -5676 -1363 -19528 -24424 -4983 -7187 -20405 18488 -3702 -29765 -24819 -23039 -4516 -35613
5485 -35613 -41494 -2182 36782 37156 -20001 -86558 -79364 -61720 -38891 -34589 -45052 -38011 -35926
5472 -35926 -9321 -17952 -33331 -31236 -59391 -57713 -30886 -25197 -37316 -6708 11599 -9269 -6884
5459 -6884 -21264 -33336 -52114 -77209 -72154 -54159 -46862 -2637 -2058 -34944 -34636 -32670 -23126 -10705
5445 -10705 -5632 -10103 -21631 6122 16877 13191 31728 32247 12945 2080 -1871 -27663 14350
5432 14350 32415 35931 23869 1817 -13662 -42389 -40729 -60826 -60949 -56647 -65751 -86213 -101757
$$ packed form
5524b0699J9034J6471j2334P116L680Q039L795M154j3791j2439Q785j3248j5600
5511a7037L912J9211r898l7101J1794q044k2534m968K4659J510K6601J2473o254
5498e676M313j8165m896J9441k204j3218L8893k2190k6063M946J780J8523l1097
5485c5613n881L9312L8964L74n7157o6557P194J7644K2829M302j0463P041K085
5472c5926K6605q631j5379K095k8155J678K6827N689j2119L0608J8307k0868K385
5459f884j4380j2072j8778k5095N055J7995P297M4225N79l2886L08J966R544J2421
5445a0705N073m471j1528K7753J0755l686J8537N19j9302j0865l951k5792M2013
5432A4350J8065L516j2062k2052j5479k8727J660k0097j23M302r104k0462j5544
$$ plain form
5419 -101757 -73437 -28956 -15941 -25090 -19750 12630 49833 52472 36934 24264 22908 10427
5407 10427 -10131 -16914 -31142 -20620 -28050 -3257 10557 19445 27179 13649 26079 48864 19369
5394 19369 11164 6927 -10292 26085 26352 28921 -12668 -49724 -62137 -37887 -24992 -35911 -48435
5381 -48435 -26977 -1179 24314 20494 12464 -7732 -5576 13090 19223 28771 13700 -4360 -7520
5368 -7520 10963 -20126 -31739 -35615 -44799 -34431 -31583 -15671 -3396 9175 29377 34544 31802
5355 31802 16664 21640 40813 27645 8144 -33264 -33880 -2822 18596 -12789 -15936 -13597 -41246
5342 -41246 -36654 -29893 -12300 10423 -17394 -32250 -21853 -21497 -9259 -22207 -42645 -43841 -49566
5329 -49566 -31152 -11635 -1494 -11660 -1028 7172 -20693 -47551 -39113 -31668 -58479 -51474 -48626
$$ packed form
5419a01757K8320M4481J3015r149N340L2380L7203K639j5538j2670j356j2481
5407A0427k0558o783j4228J0522p430K4793J3814Q888P734j3530J2430K2785k9495
5394A9369q205m237j7219L6377K67K569m1589l7056j2413K4250J2895j0919j2524
5381d8435K1458K5798K5493l820q030k0196K156J8666O133R548j5071j8060l160
5368g520J8483l1089j1613l876r184J0368K848J5912J2275J2571K0202N167k742
5355C1802j5138M976J9173j3168j9501m1408o16L1058K1418l1385l147K339k7649
5342d1246M592O761J7593K2723k7817j4856J0397L56J2238j2948k0438j196n725
5329d9566J8414J9517J0141j0166J0632Q200k7865k6858Q438P445k6811P005K848
$$ plain form
5316 -48626 -34329 -38583 -28532 9875 23378 3657 -28910 -29617 -3370 -4827 -10075 -4014 2390
5303 2390 -9468 -33583 -20133 -2872 -7374 -2585 8127 -2845 -19044 -31606 -16606 -30711
5291 -30711 -39866 -41117 -34427 -28617 -28036 -16917 -1261 20847 4388 -25654 -56496 -72706 -65566
5278 -65566 -49797 -37607 -27647 -15167 -21646 -28643 -2906 11646 -18736 -30767 -16305 -20474 -40808
5265 -40808 -37130 -68761 -31552 6332 -3971 -34076 -25924 12830 -19592 -52414 -50922 -33731
5253 -33731 -18210 -28479 15410 12236 -2259 -2746 -19037 -24931 -24172 -34301 -9645 -5813 -14266
5240 -14266 -19061 -24080 -28047 -9063 -249 11926 31876 19265 -8784 -42919 -68973 -90067 -74631
5227 -74631 -63053 -52203 -46977 -56458 -79339 -52944 -16668 -13307 -7563 12116 6899 -10910 -23590
$$ packed form
5316d8626J4297m254J0051L8407J3503j9721l2567p07K6247j457n248O061O404
5303B390j1858k4115J3450J7261m502M789J0712j0972j6199j2562J5000j4105
5291c0711r155j251O690N810N81J1119J5656K2108j6459l0042l0842j6210P140
5278f5566J5769J2190R960J2480o479o997K5737J4552l0382j2031J4462m169k0334
5265d0808L678l1631L7209L7884j0303l0105Q152L8754l2422l2822J492J7191
5253c3731J5521j0269M3889l174j4495m87j6291n894P59j0129K4656L832q453
5240a4266m795n019l967J8984Q814J2175J9950j2611k8049l4135k6054k1094J5436
5227g4631J1578J0850N226r481k2881K6395L6276L361N744J9679n217j7809j2680
$$ plain form
5214 -23590 -53503 -45701 -50127 -65442 -62315 -43915 -36079 -7166 16989 -44 -14183 -25819 -28855
5201 -28855 -17803 20944 24950 28594 55796 13729 1604 993 -39297 -43315 -45093 -66361 -46307
5188 -46307 -33176 -8667 -8197 -16472 -8902 4593 -16888 -28266 -13630 6717 1006 8705 8176
5175 8176 18825 -8797 -30919 -34068 -26007 -10222 -17268 -9971 4834 16295 4225 -5475 -4712
5162 -4712 -29505 -12407 -32453 -50503 -32543 -2013 17962 6747 -253 -6690 9101 22252
5150 22252 27490 22047 18934 8980 -38430 -58907 -54825 -43684 -36960 -7848 -10172 -9267 -5859 5346
5136 5346 23228 20449 27111 3478 -29773 -17529 -25079 -65531 -93873 -81500 -53198 -36642 -30782
5123 -30782 -33468 -43104 -5036 31193 16912 -31336 -44817 -6254 1834 7872 -15127 -20688 3693
$$ packed form
5214b3590k9913P802m426j5315L127J8400P836K8913K4155j7033j4139j1636l036
5201b8855J1052L8747M006L644K7202m2067j2125o11m0290m018j778k1268K0054
5188d6307J3131K4509M70q275P570J3495k1481j1378J4636K0347n711P699n29
5175H176J0649k7622k2122l149Q061J5785p046P297J4805J1461j2070r700P63
5162d712k4793J7098k0046j8050J7960L0530J9975j1215p000o437J5791J3151
5150B2252N238n443l113r954m7410k0477M082J1141O724K9112k324R05L408J1205
5136E346J7882k779O662k3633l3251J2244p550m0452k8342J2373K8302J6556N860
5123c0782k686r636L8068L6229j4281m8248j3481L8563Q088O038k2999n561K4381
$$ plain form
5110 3693 24611 28548 18444 26914 16297 8143 -5366 -24099 -18629 -33703 -27298 -4101 -613
5097 -613 15901 14471 2170 5218 34774 46686 44450 20045 -7334 -28153 -23743 -41507 -43963
5084 -43963 3815 25932 30493 28946 -936 -48126 -91978 -89572 -88948 -38372 2430 1192 -10109
5071 -10109 -24920 -17796 -22918 -33778 -42838 -35439 -46581 -47366 -22812 -14543 -8780 530 21853 38328
5057 38328 37304 24367 16942 -8456 1885 35483 41497 17989 19177 16019 -5737 -14416 -26125
5044 -26125 -4408 16821 1445 -27141 -22772 -5291 -5581 -17744 -25564 7330 5871 -6169 -17969
5031 -17969 -4998 -5575 -21583 -11154 15788 498 -29438 -44115 -20934 -26215 -27841 -38375 -31420
5018 -31420 10423 32816 30797 18239 6284 -7732 -16598 -27585 -16931 -3630 11863 13723
$$ packed form
5110C693K0918L937j0104Q470j0617q154j3509j8733N470j5074O405K3197L488
5097f13J6514j430j2301L048K9556J1912k236k4405k7379k0819M410j7764k456
5084d3963M7778K2117M561j547k9882m7190m3852K406O24N0576M0802j238j1301
5071a0109j4811P124n122j0860r060P399j1142p85K4554Q269N763R310K1323J6475
5057C8328j024j2937p425k5398J0341L3598O014k3508J188l158k1756q679j1709
5044b6125K1717K1229j5376k8586M369J7481k90j2163p820L2894j459j2040j1800
5031a7969J2971n77j6008J0429K6942j5290k9936j4677K3181n281j626j0534O955
5018c1420M1843K2393k019j2558j1955j4016q866j0987J0654J3301J5493J860
$$ plain form
5006 13723 3737 -18265 140 31892 44303 28797 -976 -8530 -28287 -27861 -43148 -25292 -8733
4993 -8733 -8450 797 -960 -23125 -3031 -958 -22465 -16476 14978 31187 33218 10346 17255 42335
4979 42335 19511 20356 20571 10151 3059 -31026 -69640 -84865 -40908 -7352 -52206 -72248 -62894
4966 -62894 -32653 -11645 2689 1225 -34688 -14501 17954 514 1700 28746 27188 15614
4954 15614 -1358 -5984 -12420 -20091 -7826 -3600 -1831 -1055 -27026 -23617 -16086 -43455 -29024 -15644
4940 -15644 -10652 23572 29058 4090 23769 41147 34404 1224 -9066 15852 22295 13977 7048
4927 7048 -18637 -36672 -45711 -31617 -17055 -7613 -17100 -28069 -33307 -18072 12349 4119 -15720
4914 -15720 8723 -15240 -58504 -47707 -37213 -25784 -39850 -33954 -35312 -43078 -32447 -22146
$$ packed form
5006A3723r986k2002J8405L1752J2411j5506k9773p554j9757M26j5287J7856J6559
4993h733K83R247j757k2165K0094K073k1507N989L1454J6209K031k2872O909K5080
4979D2335k2824Q45K15j0420p092l4085l8614j5225M3957L3556m4854k0042R354
4966f2894L0241K1008J4334j464l5913K0187L2455j7440J186K7046j558j1574
4954A5614j6972m626o436p671J2265M226J769P76k5971L409P531k7369J4431J3380
4940a5644M992L4224N486k4968J9679J7378o743l3180j0290K4918O443q318o929
4927G048k5685j8035r039J4094J4562R442r487j0969n238J5235L0421q230j9839
4914a5720K4443k3963m3264J0797J0494J1429j4066N896j358p766J0631J0301
$$ plain form
4902 -22146 -4012 14460 -5399 -22297 -18275 -20855 -23018 -20714 -3382 -22908 -38393 -11358 13656
4889 13656 35042 28301 21739 35815 37654 21999 20169 13660 18996 7711 5438 28156 56919
4876 56919 57078 31410 13129 32226 19525 -39879 -53392 -51884 -50534 -38563 -15945 28081 16742
4863 16742 9673 16311 16931 13159 13012 605 10297 11118 9001 5349 -16191 -28704 -24381 -40510
4849 -40510 -45066 -40898 -27770 -118 -20187 -46973 -34976 19649 29239 -7242 -8395 21822 13309
4836 13309 19141 14206 17829 46267 50971 42012 29803 -8502 13012 36797 38140 5641 -38525
4823 -38525 -36215 -33867 -25063 -34765 -53916 -33842 -31941 -20857 -32607 -39305 -20320 -17652 -8828
4810 -8828 5084 10162 1152 -23995 -31451 -18945 -12854 -11676 -47599 -37185 -22173 -4469 -24351
$$ packed form
4902b2146J8134J8472j9859j6898M022k580k163K304J7332j9526j5485K7035K5014
4889A3656K1386o741o562J4076J839j5655j830o509N336j1285k273K2718K8763
4876E6919J59k5668j8281J9097j2701n9404j3513J508J350J1971K2618M4026j1339
4863A6742p069O638O20l772j47j2407R692Q21k117l652k1540j2513M323j6129
4849d0510m556M168J3128K7652k0069k6786J1997N4625R590l6481j153L0217q513
4836A3309N832m935L623K8438M704q959j2209l8305K1514K3785J343l2499m4166
4823c8525K310K348Q804r702j9151K0074J901J1084j1750o698J8985K668Q824
4810h828J3912N078r010k5147p456J2506O091J178l5923J0414J5012J7704j9882
$$ plain form
4797 -24351 -44653 -43410 -21798 9983 12998 1174 -38853 -61621 -24129 24490 56749 52337
4785 52337 35564 14816 15982 23421 25599 31537 19883 3526 -23145 -16803 -6541 11842 -27804
4772 -27804 -46231 -23486 -13083 902 4058 -4532 -13021 -19235 7391 -1588 20658 11806 -14508
4759 -14508 -28630 -55512 -49175 -30890 -17802 -3077 -24494 -5094 11955 -2157 -18528 -20893
4747 -20893 -2519 27309 -6980 -35241 334 3105 3806 -1591 -26335 -41160 -13892 44386 54569
4734 54569 25275 20946 8996 5388 1966 4511 22139 37070 4006 -19145 -36259 -35478 -2350
4721 -2350 2214 -33115 -62372 -45994 -33585 -26304 -24561 -29901 -19350 -1292 20773 14837 5894
4708 5894 -11098 9059 24503 -13335 -28346 -20548 -32425 -33023 -31449 -5197 17659 21353 13653
$$ packed form
4797b4351k0302J243K1612L1781L015j1824m0027k2768L7492M8619L2259m412
4785E2337j6773k0748J166P439K178N938j1654j6357k6671O342J0262J8383l9646
4772b7804j8427K2745J0403J3985L156q590q489o214K6626q979K2246q852k6314
4759a4508j4122k6882O337J8285J3088J4725k1417J9400J7049j4112j6371k365
4747b0893J8374K9828l4289k8261L5575K771P01n397k4744j4825K7268N8278J0183
4734E4569k9294m329j1950l608l422K545J7628J4931l3064k3151j7114P81L3128
4721b350M564l5329k9257J6378J2409P281J743n340J0551J8058K2065n936q943
4708E894j6992K0157J5444l7838j5011P798j1877n98J574K6252K2856L694p700
$$ plain form
4695 13653 25745 24701 19773 30315 40492 30669 18912 193 -13896 -31672 -23512 20508 23173
4682 23173 7430 -7369 -12527 -21769 396 32049 -2668 -18549 -34031 -29133 -14446 -15513 -13879
4669 -13879 13362 12617 -15949 -13461 -194 13766 12826 -906 33238 65488 68674 20978 2915
4656 2915 31312 17084 -16697 -20358 36218 33829 -13814 -38261 -38543 -35615 -24257 -21802 -6923
4643 -6923 1482 -10106 -31361 -23951 -31273 -28576 -6864 12535 -3234 -8474 -1830 7550 -29686
4630 -29686 -40420 -18518 -23298 -31186 -15889 -2031 -15527 -46044 -63555 -1954 17228 19433
4618 19433 43367 35401 18830 -1345 -12412 -15352 1825 25179 24740 -8331 -34378 -21699 -19511
4605 -19511 -10274 -29087 -13133 -2440 9600 6889 33886 21570 -28602 -50205 -22382 -24162
$$ packed form
4695A3653J2092j044m928J0542J0177r823j1757j8719j4089j7776Q160M4020K665
4682B3173j5743j4799n158r242K2165L1653l4717j5881j5482M898J4687j067J634
4669a3879K7241p45k8566K488J3267J3960r40j3732L4144L2250L186m7696j8063
4656B915K8397j4228l3781l661N6576k389m7643k4447k82K928J1358K455J4879
4643f923Q405j1588k1255P410p322K697K1712J9399j5769n240O644R380l7236
4630b9686j0734K1902m780p888J5297J3858j3496l0517j7511O1601J9182K205
4618A9433K3934p966j6571k0175j1067k940J7177K3354m39l3071k6047J2679K188
4605a9511R237j8813J5954J0693J2040k711K6997j2316n0172k1603K7823j780
$$ plain form
4593 -24162 -16019 -26928 -1543 20239 18376 15982 11359 3204 -15649 30581 52108 35922 18311
4580 18311 -10732 -14134 -4960 -15634 -19707 11835 -1829 -18344 -7024 9198 -15658 -39042
4568 -39042 -51487 -38555 -30823 -9150 1811 5031 5875 20544 9869 -27598 -34777 -27255 -55582
4555 -55582 -52373 -31395 -25260 348 -6266 -7814 -10076 -18150 -16976 -12971 -20035 -12801 20594 35580
4541 35580 14099 11073 47854 45238 28102 9816 20135 54477 40354 23545 8219 -4300
4529 -4300 10213 20136 28643 38505 41963 8294 -39863 -43539 -53938 -42436 -29145 -41746 -25250
4516 -25250 -21831 -24627 -39481 -75921 -68877 -17124 -15983 -12585 -20871 -45263 -13095 -7358 -36874
4503 -36874 -64655 -32127 6819 -8957 -9991 11540 32333 51289 49275 41247 16583 10635 19227
$$ packed form
4593b4162Q143j0909K5385K1782j863k394m623q155j8853M6230K1527j6186j7611
4580A8311k9043l402R174j0674m073L1542j3664j6515J1320J6222k4856k3384
4568c9042j2445J2932P732K1673J0961L220Q44J4669j0675l7467p179P522k8327
4555e5582L209K0978O135K5608o614j548k262q074J174M005p064P234L3395J4986
4541C5580k1481l026L6781k616j7136j8286J0319L4342j4123j6809j5326j2519
4529d300J4513R923Q507R862L458l3669m8157l676j0399J1502J3291j2601J6496
4516b5250L419k796j4854l6440P044N1753J141L398q286k4392L2168N737k9516
4503c6874k7781L2528L8946j5776j034K1531K0793J8956k014q028k4664n948Q592
$$ plain form
4490 19227 32572 21164 6962 11458 -42082 -70031 -54133 -40574 -44394 -50503 -23790 -14511 16435
4477 16435 25859 1136 -16773 -14609 -18556 13628 4726 1431 -9926 -22112 -7954 12375 12412
4464 12412 854 1139 4247 38 -5524 15209 12994 10249 2203 2850 -25322 -34519 -28222 -15888
4450 -15888 -30417 -33379 -44113 -62160 -49281 -39032 -7217 10612 -13430 -282 -7803 5671
4438 5671 6059 -9472 1948 39177 16205 -21614 -43505 -58120 -33972 7111 25413 12493
4426 12493 7762 12660 6402 28362 25354 2368 -16066 -14912 -4373 24374 16341 -11745 -963
4413 -963 4433 -1320 -986 6682 20088 -21786 -50768 -13617 5107 109 -3556 -27104 -16390 -27820
4399 -27820 -13466 -20967 -7184 13139 21949 -22183 -35654 -2245 30101 14152 5399 455 23307
$$ packed form
4490A9227J3345j1408j4202M496n3540k7949J5898J3559l820o109K6713R279L0946
4477A6435R424k4723j7909K164l947L2184q902l295j1357j2186J4158K0329L7
4464A2412j1558K85L108m209n562K0733k215k745q046O47k8172r197O297J2334
4450a5888j4529k962j0734j8047J2879J0249L1815J7829k4042J3148p521J3474
4438E671L88j5531J1420L7229k2972l7819k1891j4615K4148M1083J8302j2920
4426A2493m731M898o258K1960l008k2986j8434J154J0539K8747q033k8086J0782
4413i63N396n753L34P668J3406m1874k8982L7151J8724m998l665k3548J0714j1430
4399b7820J4354p501J3783K0323Q810m4132j3471L3409L2346j5949q753m944K2852
$$ plain form
4386 23307 30383 17281 -15220 -13294 -1402 -8804 3831 33666 24238 4476 -9399 -35588 -45323
4373 -45323 -38456 -32617 -41390 -26171 -20069 -11360 -20720 -30643 -6923 1305 -24732 -45505 -50517 -10177
4359 -10177 33855 25525 -1589 13344 -219 -4860 -32270 -41149 -33441 8211 12018 -16331 -29318
4346 -29318 -18722 8807 -200 -13611 -12463 -20098 5612 22710 39600 25952 17863 47800 61207
4333 61207 55895 24587 13391 25957 62991 37673 6905 7187 38791 47946 5752 -16896 -12569
4320 -12569 3532 -20434 -31746 -26288 -13685 -15911 -16283 3506 15315 -11395 -12762 10791 19641
4307 19641 22420 18740 17442 14924 54 -4738 -7598 -40729 -48603 -46807 -47116 -34831 -11447 -7045
4293 -7045 -11937 -9953 7514 14474 -10452 3406 31502 45821 24738 22536 -16133 -37869 -53997
$$ packed form
4386B3307P076j3102l2501J926J1892p402J2635K9835r428j9762j3875k6189r735
4373d5323O867N839q773J5219O102Q709r360r923K3720Q228k6037k0773n012M0340
4359a0177M4032q330k7114J4933j3563m641k7410q879P708M1652L807k8349j2987
4346b9318J0596K7529r007j3411J148p635K5710J7098J6890j3648q089K9937J3407
4333F1207n312l1308j1196J2566L7034k5318l0768K82L1604R155m2194k2648M327
4320a2569J6101k3966j1312N458J2603k226l72J9789J1809k6710j367K3553Q850
4307A9641K779l680j298k518j4870m792k860l3131p874J796l09J2285K3384M402
4293g045m892J984J7467O960k4926J3858K8096J4319k1083k202l8669k1736j6128
$$ plain form
4280 -53997 -56731 -74766 -57068 -25104 -30907 -20586 -27059 -46090 -36270 -50712 -44432 -26667 -20735
4267 -20735 3501 17472 7574 -56 5936 36079 52326 33573 -11050 -19199 -18738 -11008 -18387
4254 -18387 -49515 -71460 -70295 -58811 -43699 -30480 -1963 36850 41588 40584 26546 -7475
4242 -7475 36664 83886 80669 66342 58001 27443 1074 1191 27338 41503 48591 51529 73571
4229 73571 68693 62883 60700 48915 20332 -4545 -1463 9772 30924 11456 2219 -7398 9033
4216 9033 51575 45864 -2418 -8010 1370 -23117 -60520 -77216 -56526 -16984 11910 18492 -10290
4203 -10290 13616 21576 12750 -446 11709 1214 18816 11271 -10929 -18320 -11676 -19905 -2382
$$ packed form
4280e3997k734j8035J7698L1964n803J0321o473j9031R820j4442O280J7765N932
4267b0735K4236J3971r898p630N992L0143J6247j8753m4623q149M61P730p379
4254a8387l1128k1945J165J1484J5112J3219K8517L8813M738j004j4038l4021
4242g475M4139M7222l217j4327q341l0558k6369J17K6147J4165P088K938K2042
4229G3571m878n810k183j1785k8583k4877L082J1235K1152j9468r237r617J6431
4216I033M2542n711m8282n592R380k4487l7403j6696K0690L9542K8894O582k8782
4203a0290K3906P960q826j3196J2155j0495J7602p545k2200p391O644q229J7523
$$ [...]
##END NTUPLES=NMR SPECTRUM
##END=
