##TITLE=Analysis number 320267
Compound Code btbg 00026
Project Code adrs
Chemist Name fudan
##JCAMPDX= 6.0         $$ Bruker NMR JCAMP-DX V2.0
##DATA TYPE= NMR SPECTRUM
##DATA CLASS= NTUPLES
##ORIGIN= Bruker BioSpin GmbH
##OWNER= nmr
$$ XWIN-NMR		Version 3.5
$$ Tue Jun 20 11:10:00 2006 GMT Daylight Time (UT+1h)  MAYBRIDGE\nmr@NMR_250MHZ
##.OBSERVE FREQUENCY= 250.131544655141
##.OBSERVE NUCLEUS= ^1H
##.ACQUISITION MODE= SIMULTANEOUS (DQD)
##.ACQUISITION SCHEME= undefined
##.AVERAGES= 16
##.DIGITISER RES= 18
##SPECTROMETER/DATA SYSTEM= dpx250
##.PULSE SEQUENCE= zg30
##.SOLVENT NAME= CDCl3
##.SHIFT REFERENCE= (INTERNAL, CDCl3, 0, 16.522)
##AUDIT TRAIL= $$ (NUMBER, WHEN, WHO, WHERE, WHAT)
$$ ##TITLE= Audit trail, XWIN-NMR		Version 3.5
$$ ##JCAMPDX= 5.01
$$ ##ORIGIN= Bruker BioSpin GmbH
$$ ##OWNER= nmr
$$ C:\u/data/dgb/nmr/ADRS/1100/pdata/1/auditp.txt
$$ ##AUDIT TRAIL=  $$ (NUMBER, WHEN, WHO, WHERE, WHAT)
(   1,<2006-06-20 11:09:36.29 +100>,<MAYBRIDGE\nmr>,<NMR_250MHZ>,
      <created by zg, POWCHK disabled, PULCHK disabled
       configuration hash MD5:
       E2 DF 36 D8 04 B2 41 60 5A D7 A3 38 5A 4B D0 FE
       data hash MD5: 64K
       7B 22 EB E6 7B 15 7D A0 52 A5 A7 B1 90 09 45 63>)
(   2,<2006-06-20 11:09:50.62 +100>,<MAYBRIDGE\nmr>,<NMR_250MHZ>,
      <Start of raw data processing
       ef LB = 0.3 FT_mod = 6 PKNL = 1 SI = 32K 
       data hash MD5: 32K
       6C D2 FA AC 4B CB C2 1D 86 62 FE 10 DC 4F D6 27>)
(   3,<2006-06-20 11:09:52.78 +100>,<MAYBRIDGE\nmr>,<NMR_250MHZ>,
      <apk 
       data hash MD5: 32K
       64 E5 7A A0 66 26 48 F7 80 51 16 FD 33 13 09 D1>)
(   4,<2006-06-20 11:09:53.56 +100>,<MAYBRIDGE\nmr>,<NMR_250MHZ>,
      <abs ABSG = 5 
       data hash MD5: 32K
       55 24 1F 30 F8 C2 88 50 B1 52 0C 3A 77 F2 20 D6>)
$$ ##END=
$$ 
$$ hash MD5
$$ 27 C9 DB 5A 8D 00 92 C6 9A A7 FB AD B9 C3 E7 F2
##$RELAX= 
##$RELAX= 
##$RELAX= 
##$RELAX= 
##$RELAX= 
##$RELAX= 
##$RELAX= 
$$ Bruker specific parameters
$$ --------------------------
##$DU= <C:\u>
##$EXPNO= 1100
##$NAME= <ADRS>
##$PROCNO= 1
##$TYPE= <nmr>
##$USER= <dgb>
##$AMP= (0..31)
100 100 100 100 100 100 100 100 100 100 100 100 100 100 100 100 100 100 
100 100 100 100 100 100 100 100 100 100 100 100 100 100 
##$AQSEQ= 0
##$AQ_mod= 3
##$AUNM= <au_zg>
##$AUTOPOS= <17 >
##$BF1= 250.13
##$BF2= 250.13
##$BF3= 250.13
##$BF4= 250.13
##$BF5= 500.13
##$BF6= 500.13
##$BF7= 500.13
##$BF8= 500.13
##$BYTORDA= 1
##$CFDGTYP= 0
##$CFRGTYP= 5
##$CHEMSTR= <none>
##$CNST= (0..31)
1 1 145 1 1 1 1 1 1 1 1 1 1 1 1 1 1 1 1 1 1 1 1 1 1 1 1 1 1 1 1 1 
##$CPDPRG= <>
##$CPDPRG1= <>
##$CPDPRG2= <>
##$CPDPRG3= <>
##$CPDPRG4= <mlev>
##$CPDPRG5= <mlev>
##$CPDPRG6= <mlev>
##$CPDPRG7= <mlev>
##$CPDPRG8= <mlev>
##$CPDPRGB= <>
##$CPDPRGT= <>
##$D= (0..31)
0 1 0 0 0 0 0 0 0 0.06 0 0 0 0 0 0 0.0002 0 0 0 0 0 0 0 0 0 0 0 0 0 0 
0 
##$DATE= 1150798175
##$DBL= (0..7)
120 120 120 120 120 120 120 120 
##$DBP= (0..7)
150 150 150 150 150 150 150 150 
##$DBP07= 0
##$DBPNAM0= <>
##$DBPNAM1= <>
##$DBPNAM2= <>
$$ [...]
##$SUBNAM7= <"">
##$SUBNAM8= <"">
##$SUBNAM9= <"">
##$SW= 20.6930455092707
##$SWIBOX= (0..15)
0 0 3 0 0 0 0 0 0 0 0 0 0 0 0 0 
##$SW_h= 5175.983436853
##$TD= 65536
##$TD0= 1
##$TE= 294.16
##$TE2= 300
##$TE3= 300
##$TEG= 300
##$TL= (0..7)
0 120 120 120 120 120 120 120 
##$TP= (0..7)
150 150 150 150 150 150 150 150 
##$TP07= 0
##$TPNAME0= <>
##$TPNAME1= <>
##$TPNAME2= <>
##$TPNAME3= <>
##$TPNAME4= <>
##$TPNAME5= <>
##$TPNAME6= <>
##$TPNAME7= <>
##$TPOAL= (0..7)
0.5 0.5 0.5 0.5 0.5 0.5 0.5 0.5 
##$TPOFFS= (0..7)
0 0 0 0 0 0 0 0 
##$TUNHIN= 0
##$TUNHOUT= 0
##$TUNXOUT= 0
##$USERA1= <user>
##$USERA2= <user>
##$USERA3= <user>
##$USERA4= <user>
##$USERA5= <user>
##$V9= 5
##$VALIST= <valist>
##$VCLIST= <CCCCCCCCCCCCCCC>
##$VD= 0
##$VDLIST= <DDDDDDDDDDDDDDD>
##$VPLIST= <PPPPPPPPPPPPPPP>
##$VTLIST= <TTTTTTTTTTTTTTT>
##$WBST= 1024
##$WBSW= 4
##$XGAIN= (0..3)
0 0 0 0 
##$XL= 0
##$YL= 0
##$YMAX_a= 622827
##$YMIN_a= -630524
##$ZGOPTNS= <>
##$ZL1= 120
##$ZL2= 120
##$ZL3= 120
##$ZL4= 120
##$ABSF1= 16.522
##$ABSF2= -4.171173
##$ABSG= 5
##$ABSL= 3
##$ALPHA= 0
##$AQORDER= 0
##$ASSFAC= 0
##$ASSFACI= 0
##$ASSFACX= 0
##$ASSWID= 0
##$AUNMP= <proc_1d>
##$AZFE= 0.1
##$AZFW= 0.1
##$BCFW= 0
##$BC_mod= 0
##$BYTORDP= 0
##$COROFFS= 0
##$CY= 12.5
##$DATMOD= 1
##$DC= 0
##$DFILT= <>
##$DTYPP= 0
##$F1P= 14.0000005364418
##$F2P= -0.99999901652339
##$FCOR= 0.5
##$FTSIZE= 32768
##$FT_mod= 6
##$GAMMA= 0
##$GB= 0
##$INTBC= 1
##$INTSCL= 1
##$ISEN= 128
##$LB= 0.3
##$LEV0= 0
##$LPBIN= 0
##$MAXI= 10000
##$MC2= 0
##$MEAN= 0
##$ME_mod= 0
##$MI= 0
##$NCOEF= 0
##$NC_proc= -4
##$NLEV= 6
##$NOISF1= 0
##$NOISF2= 0
##$NSP= 0
##$NTH_PI= 0
##$NZP= 0
##$OFFSET= 16.522
##$PC= 1
##$PHC0= 8.554655
##$PHC1= 18.61939
##$PH_mod= 1
##$PKNL= yes
##$PPARMOD= 0
##$PSCAL= 4
##$PSIGN= 0
##$REVERSE= no
##$SF= 250.13
##$SI= 32768
##$SIGF1= 0
##$SIGF2= 0
##$SINO= 400
##$SIOLD= 32768
##$SREGLST= <1H.CDCl3>
##$SSB= 0
##$STSI= 32768
##$STSR= 0
##$SW_p= 5175.98343685301
##$SYMM= 0
##$S_DEV= 0
##$TDeff= 65536
##$TDoff= 0
##$TI= <Analysis number 999999
Compound Code 99
Book Reference 9
Project Code 9>
##$TILT= no
##$TM1= 0
##$TM2= 0
##$TOPLEV= 0
##$USERP1= <user>
##$USERP2= <user>
##$USERP3= <user>
##$USERP4= <user>
##$USERP5= <user>
##$WDW= 1
##$XDIM= 32768
##$YMAX_p= 455058037
##$YMIN_p= -23590
$$ End of Bruker specific parameters
$$ ---------------------------------
##NTUPLES= NMR SPECTRUM
##VAR_NAME=  FREQUENCY,     SPECTRUM/REAL,   SPECTRUM/IMAG
##SYMBOL=    X,             R,               I
##VAR_TYPE=  INDEPENDENT,   DEPENDENT,       DEPENDENT
##VAR_FORM=  AFFN,          ASDF,            ASDF
##VAR_DIM=   32768,         32768,           32768
##UNITS=     HZ,            ARBITRARY UNITS, ARBITRARY UNITS
##FACTOR=    0.157963299565203, 1,           1
##FIRST=     4132.6476996994, 0,             0
##LAST=      -1043.33573715361, 0,           0
##MIN=       -1043.33573715361, -23590,      0
##MAX=       4132.6476996994, 455058037,     0
$$ Real data points
##PAGE= N=1
##DATA TABLE= (X++(R..R)), XYDATA
$$ [...]
$$ plain form
13794 45370 45687 45257 42219 39832 48177 52469 51994 48631 44039 47088 44001 37066 30605 33163 40264
13779 40264 43449 44814 44785 45398 45892 51631 54884 48856 43959 46500 52903 60720 59277 59772 63207 67138
13763 67138 71938 66566 59479 58247 62429 58864 53492 51924 47397 43307 42186 42891 42613 38821 40497
13748 40497 43806 40276 37306 40302 44728 51466 51818 52380 47539 39493 43507 42670 41286 44446 44257
13733 44257 36920 29137 28280 25549 26391 33656 35159 36682 40013 37397 37800 36637 32556 28246 25926
13718 25926 28003 31868 35377 38025 32064 33183 39618 40538 35204 31491 31262 31439 26833 27225 27085 23813
13702 23813 24036 18517 19276 26887 30912 31708 31661 35386 37270 40175 41344 44844 40600 43232 46138 42675
13686 42675 44211 52103 53530 46132 44861 36215 29403 28326 24323 18755 20214 26614 26784 22299 19386
$$ packed form
13794D5370L17m30l038k387Q345M292m75l363m592L049l087o935o461K558P101
13779D0264L185J365k9O13M94N739L253o028m897K541O403P817j443M95L435L931
13763F7138M800n372p087j232M182l565n372j568m527m090j121P05k78l792J676
13748D0497L309l530k970K996M426O738L52N62m841q046M014q37j384L160j89
13733D4257p337p783q57k731Q42P265J503J523L331k616M03j163m081m310k320
13718B5926K077L865L509K648n961J119O435R20n334l713k29J77m606L92j40l272
13702B3813K23n519P59P611M025P96m7L725J884K905J169L500m244K632K906l463
13686D2675J536P892J427p398j271q646o812j077m003n568J459O400J70m485k913
$$ plain form
13671 19386 19826 24351 32366 31179 35762 37925 39619 37529 33426 31056 27436 23284 27326 30203 30775
13656 30775 25675 24805 21668 25581 28969 26200 25085 26274 18857 14135 17603 12388 12532 14220 16791
13641 16791 21941 23767 22307 24072 24927 22149 26995 23618 17285 16895 21094 20248 21574 18681 17783
13626 17783 10204 12259 21114 25201 21916 11650 4207 5633 9327 13921 20060 25777 25942 24114
13612 24114 27596 27502 22644 25893 26869 19811 15857 12474 8442 10102 10621 8943 9667 11794 11826 14114
13596 14114 13078 14290 17681 21596 25026 24001 24785 26922 24826 20287 18636 17742 17036 15177 14619
13581 14619 19413 22244 25197 20127 16140 13542 16096 15631 18074 12117 13211 18945 16872 15364 19411
13566 19411 26264 20052 14883 13362 20536 20651 19177 22633 23167 18674 18215 19164 17070 15469 18565
$$ packed form
13671A9386M40M525Q015j187M583K163J694k090m103k370l620m152M042K877N72
13656C0775n100q70l137L913L388k769j115J189p417m722L468n215J44J688K571
13641A6791N150J826j460J765Q55k778M846l377o333l90M199q46J326k893q98
13626A7783p579K055Q855M087l285j0266p443J426L694M594O139N717J65j828
13612B4114L482r4m858L249R76p058l954l383m032J660N19j678P24K127L2K288
13596A4114j036J212L391L915L430j025P84K137k096m539j651q94p06j859n58
13581A4619M794K831K953n070l987k598K554m65K443n957J094N734k073j508M047
13566A9411O853o212n169j521P174J15j474L456N34m493m59R49k094j601L096
$$ plain form
13551 18565 20595 15577 19651 23713 18008 13199 14514 16287 15748 8926 7559 11094 21791 22654 21718
13536 21718 14716 14950 17587 17253 22917 21072 17433 15469 17647 16360 10350 10010 14292 12512 15544
13521 15544 15433 17480 22786 21059 17395 19641 21158 25010 27999 16418 8543 10043 10956 17452 24257
13506 24257 23410 21137 17975 17898 20956 21997 29457 28351 29632 29762 23803 18076 22633 22838 25010 23013
13490 23013 21677 21313 19931 16967 20908 22220 20977 19278 21419 23175 24763 22531 22044 17934 12875
13475 12875 13981 16635 16286 18193 19604 18205 19574 21449 21118 16627 19068 21355 15069 12849 12687
13460 12687 14533 14436 18533 19736 19570 26344 23675 23298 19262 17229 24591 26337 18498 13166 11850
13445 11850 12376 13603 17861 20740 21584 22146 25374 24664 21343 26119 26374 30950 34173 31963 26397 23582
$$ packed form
13551A8565K030n018M074M062n705m809J315J773n39o822j367L535J0697Q63r36
13536B1718p002K34K637l34N664j845l639j964K178j287o010l40M282j780L032
13521A5544j11K047N306j727l664K246J517L852K989j1581p875J500R13O496O805
13506B4257q47k273l162p7L058J041P460j106J281J30n959n727M557K05K172j997
13490B3013j336l64j382k964L941J312j243j699K141J756J588k232m87m110n059
13475A2875J106K654l49J907J411j399J369J875l31m491K441K287o286k220j62
13460A2687J846r7M097J203j66O774k669l77m036k033P362J746p839n332j316
13445A1850N26J227M258K879Q44N62L228p10l321M776K55M576L223k210n566k815
$$ plain form
13429 23582 25964 28724 28938 27994 32129 32253 33316 29701 23045 21811 15674 16309 21386 23719 21195
13414 21195 22838 22267 19723 22093 20001 20858 22701 21321 28317 25329 24087 26119 27268 26688 22193
13399 22193 19868 15961 24119 29119 27215 25928 28631 30900 32271 28195 23454 23899 24247 31223 32595
13384 32595 28008 29047 30930 30054 27993 25002 18913 19384 24012 31609 28579 22863 23907 21605 19166
13369 19166 17963 24678 29634 30038 31006 28608 23191 20874 23373 22001 21003 20071 21411 30463 30588 27497
13353 27497 26390 29077 31502 25383 20417 16915 23005 24739 26861 27766 19077 13675 16895 21956 24923
13338 24923 27113 34656 41044 36660 37568 39416 39436 37409 38814 37005 36375 37766 39529 33528 30179
13323 30179 24370 21112 21651 19893 19845 20007 19760 25580 35491 37880 39620 36759 35102 32596 22220
$$ packed form
13429B3582K382K760K14r44M135J24J063l615o656j234o137O35N077K333k524
13414B1195J643n71k544K370k092Q57J843j380O996k988j242K032J149n80m495
13399B2193k325l907Q158N000j904j287K703K269J371m076m741M45L48O976J372
13384C2595m587J039J883q76k061k991o089M71M628P597l030n716J044k302k439
13369A9166j203O715M956M04R68k398n417k317K499j372r98r32J340R052J25l091
13353B7497j107K687K425o119m966l502O090J734K122R05q689n402L220N061K967
13338B4923K190P543O388m384R08J848K0k027J405j809o30J391J763o001l349
13323C0179n809l258N39j758m8J62k47N820R911K389J740k861j657k506j0376
$$ plain form
13308 22220 19633 23711 24088 25547 28205 34798 32864 29376 25856 19804 15852 21239 25798 25822 30622
13293 30622 33000 34097 32324 30334 31312 36919 39006 42458 40761 44077 44618 39817 45545 44809 38079
13278 38079 33667 33760 28460 25190 23774 22907 25340 29717 36095 31257 29680 30151 36854 40587 41889
13263 41889 41671 39054 39655 39169 35361 32216 37474 45409 47318 44351 41005 43139 41357 38912 46532
13248 46532 42571 40250 44827 42228 32490 33175 34637 33829 33816 37856 40378 36581 35374 40513 39628 41001
13232 41001 38751 35428 33501 34734 36526 36450 42128 47154 48059 42192 36884 37682 38726 39617 34221 32200
13216 32200 30274 31046 30360 34307 33642 35736 31740 32158 34393 44614 52036 47355 45723 45768 43885 40068
13200 40068 39080 39301 40871 38533 34903 34486 38661 39648 35569 38099 38338 39327 36163 33569 39324 43369
$$ packed form
13308B2220k587M078L77J459K658O593j934l488l520o052l952N387M559K4M800
13293C0622K378J097j773j990R78N607K087L452j697L316N41m801N728p36o730
13278C8079m412R3n300l270j416q67K433M377O378m838j577M71O703L733J302
13263D1889k18k617O01m86l808l145N258P935J909k967l346K134j782k445P620
13248D6532l961k321M577k599r738O85J462q08j3M040K522l797j207N139q85J373
13232D1001k250l323j927J233J792p6N678N026R05n867n308P98J044Q91n396k021
13216C2200j926P72o86L947o65K094l996M18K235J0221P422m681j632M5j883l817
13200D0068r88K21J570k338l630m17M175R87m079K530K39R89l164k594N755M045
$$ plain form
13184 43369 42697 43917 48337 48124 51151 52062 39396 38535 40570 38817 43276 48014 44146 41962 44422
13169 44422 44825 43395 40031 44015 52321 52499 50156 46151 45672 45171 42358 47482 45742 38578 39717
13154 39717 48638 47257 46765 53528 53855 46442 50166 48644 46088 42744 40083 43318 39357 45661 43441
13139 43441 35249 41277 47538 44671 39528 42142 47493 54017 61421 56372 54646 61738 57918 61147
13125 61147 58993 48960 46690 55899 59305 58536 62479 60517 59533 55998 52218 51054 55238 57269 50022
13110 50022 43672 41566 38245 37179 39334 44788 50397 50107 49640 47472 48953 52544 46433 40399 40492
13095 40492 44595 41983 39875 34620 40586 48237 41453 35980 39291 40004 41608 43499 42710 38041 40729
13080 40729 42472 40050 36237 34918 39233 47130 38843 37364 44102 45563 48754 48884 44849 44616 46122
$$ packed form
13184D3369o72J220M420k13L027R11j2666q61K035j753M459M738l868k184K460
13169D4422M03j430l364L984Q306J78k343m005m79n01k813N124j740p164J139
13154C9717Q921j381m92O763L27p413L724j522k556l344k661L235l961O304k220
13139D3441q192O028O261k867n143K614N351O524P404n049j726P092l820L229
13125F1147k154j0033k270R209L406p69L943j962r84l535l780j164M184K031p247
13110E0022o350k106l321j066K155N454N609k90m67k168J481L591o111o034R3
13095D0492M103k612k108n255N966P651o784n473L311P13J604J891p89m669K688
13080D0729J743k422l813j319M315P897q287j479O738J461L191J30m035k33J506
$$ plain form
13065 46122 46090 43751 38116 38144 43967 48731 46301 52304 53399 48655 45242 37706 37638 37635 43812 46311 43019
13048 43019 46859 53528 53608 48050 44431 45554 45704 47950 37881 35905 47497 50543 47020 47286 40541
13033 40541 33324 32393 42867 47478 48601 43994 42342 48519 52878 53512 50938 45258 46434 46818 49990
13018 49990 46131 43805 42957 41772 41316 43279 46651 49043 45688 34851 30102 36817 37279 35498 36720
13003 36720 33158 39095 44229 45771 43160 33891 34163 39718 43730 48001 51410 47920 39712 35549 38666
12988 38666 37215 38383 35155 28717 36969 44853 45221 44129 49301 49722 46924 39994 39582 46463 44842
12973 44842 43891 38995 36940 44749 56492 57677 51786 52643 49337 46226 48157 46233 43768 52193 54297
12958 54297 53002 53332 56836 58818 57548 49112 48614 51045 46511 52398 56018 58891 56399 55925 57183
$$ packed form
13065D6122l2k339n635K8N823M764k430O003J095m744l413p536o8lO177K499l292
13048D3019L840O669Q0n558l619J123J50K246j0069j976J1592L046l523K66o745
13033D0541p217r31J0474M611J123m607j652O177M359O34k574n680J176L84L172
13018D9990l859k326q48j185m56J963L372K392l355j0837m749O715M62j781J222
13003C6720l562N937N134J542k611r269K72N555M012M271L409l490q208m163L117
12988C8666j451J168l228o438Q252P884L68j092N172M21k798o930m12O881j621
12973D4842r51m896k055P809J1743J185n891Q57l306l111J931j924k465Q425K104
12958E4297j295L30L504J982j270q436m98K431m534N887L620K873k492m74J258
$$ plain form
12943 57183 55752 54150 49947 48072 49010 55154 56085 51783 47877 51932 57018 50057 46485 52442 59354
12928 59354 66304 64813 61458 63315 58023 53125 49417 54968 59747 63052 62686 63290 64651 64070 62792
12913 62792 58007 56846 58544 58818 62611 63980 62041 57714 55565 57187 59889 60936 60687 59727 63897
12898 63897 69325 62664 64752 65451 70384 73894 75290 75578 75483 78538 80195 71692 72266 74531 75771 76928
12882 76928 79259 77288 77298 82975 91922 94123 95283 93197 94659 93506 97122 96337 96730 99906 104656
12867 104656 101920 96044 97983 101814 102017 102176 101340 99874 93377 91316 93311 91985 88757 86371 90361
12852 90361 93851 85786 81836 79394 79091 80566 85036 85840 84610 85935 84967 87553 85904 79090 76259
12837 76259 67871 66648 68057 61323 61673 62765 64476 66477 67957 74598 76043 74807 75662 79062 81360
$$ packed form
12943E7183j431j602m203j875R38O144R31m302l906M055N086o961l572N957O912
12928E9354O950j491l355J857n292m898l708N551M779L305l66O04J361n81j278
12913F2792m785j161J698K74L793J369j939m327k149J622K702J047k49r60M170
12898F3897N428o661K088O99M933L510J396K88r5L055J657q503N74K265J240J157
12882G6928K331j971J0N677Q947K201J160k086J462j153L616p85L93L176M750
12867A04656k736n876J939L831K03J59q36j466o497k061J995j326l228k386L990
12852I0361L490q065l950k442l03J475M470Q04j230J325r68K586j649o814k831
12837G6259q388j223J409o734L50J092J711K001J480O641J445j236Q55L400K298
$$ plain form
12822 81360 83519 86992 84304 84625 83647 82949 86285 86826 83083 78687 82295 80232 82789 83958 82437
12807 82437 74722 78407 81422 80974 73420 72589 77642 74966 79862 81669 81714 79990 76866 77016 73837 80697
12791 80697 78603 70891 69850 71912 77075 82345 82832 84898 83524 85720 83832 79570 80259 83680 81652
12776 81652 87513 90477 88357 88778 92525 96671 100573 105068 108719 110842 111853 113758 113824 114425 119068
12761 119068 121919 123167 125239 127794 134310 135655 130056 122373 120807 122300 122038 123343 124678 124420 121471
12746 121471 121979 125010 122259 125984 137370 142346 145437 141435 137586 134196 135227 143906 150427 150324
12732 150324 144916 146886 151951 159279 159685 158691 156297 155940 157774 160197 159748 155377 160525 161027 161334 162555
12716 162555 170619 175659 173641 172895 175448 185306 187032 188794 192804 190583 188174 184460 189583 194908
$$ packed form
12822H1360K159L473k688L21r78o98L336N41l743m396L608k063K557J169j521
12807H2437p715L685L015m48p554q31N053k676M896J807M5j724l124J50l179O860
12791H0697k094p712j041K062N163N270M87K066j374K196j888m262O89L421k028
12776H1652N861K964k120M21L747M146L902M495L651K123J011J905O6O01M643
12761A19068K851J248K072K555O516J345n599p683j566J493k62J305J335k58k949
12746A21471N08L031k751L725J1386M976L091m002l849l390J031Q679O521j03
12732A50324n408J970N065P328M06r94k394l57J834K423m49m371N148N02L07J221
12716A62555Q064N040k018p46K553R858J726J762M010k221k409l714N123N325
$$ plain form
12702 194908 201728 199419 196515 189159 191166 197194 191994 190665 194241 190157 186427 187685 190812 189123
12688 189123 188684 192094 192044 195165 202338 204111 202954 206294 210485 214501 217006 221538 223312 224313 223177
12673 223177 223209 218295 206707 199705 202278 204761 195855 188639 193087 191430 189827 187653 187797 190347 191302
12658 191302 190265 198480 200452 198491 199770 198577 200384 199997 201199 195005 193445 191187 183530 181569
12644 181569 184192 178988 176616 171465 173376 176266 176269 169935 162035 167652 173139 176934 178165 174186 166642
12629 166642 162638 168049 169770 169150 171992 172410 169400 169042 174117 179388 185859 191433 188732 187017 185098
12614 185098 177713 173945 169694 162158 159482 161855 160966 156351 152314 152453 149750 149536 157362 157418 153454
12599 153454 156093 157630 162769 158125 165798 173283 175259 170049 164953 164105 161297 162060 161656 159710 163740
$$ packed form
12702A94908O820k309k904p356K007O028n200j329L576m084l730J258L127j689
12688A89123m39L410n0L121P173J773j157L340M191M016K505M532J774J001j136
12673B23177L2m914j1588p002K573K483q906p216M448j657j603k174J44K550R55
12658A91302j037Q215J972j961J279j193J807l87J202o194j560k258p657j961
12644A81569K623n204k372n151J911K890Lo334p900N617N487L795J231l979p544
12629A66642m004N411J721o20K842M18l010l58N075N271O471N574k701j715j919
12614A85098p385l768m251p536k676K373q89m615m037J39k703k14P826N6l964
12599A53454K639J537N139m644P673P485J976n210n096q48k808P63m04j946M030
$$ plain form
12584 163740 165765 158692 149996 147611 148033 149960 152386 149041 146837 143262 145500 154646 156916 149620
12570 149620 148768 147509 148505 146211 145679 150031 158796 161630 162291 163638 160203 155367 156624 157067 162619
12555 162619 166712 171949 170415 167579 161382 163038 166075 166365 157930 153391 150510 153713 157344 161496
12541 161496 161277 161937 157035 156497 157809 157157 157174 160337 167214 166155 161964 168468 174240 170293 170777 171328
12525 171328 165560 166042 171218 174890 176233 175024 174146 175552 178990 172165 170016 173775 174864 177779 179547
12510 179547 182993 176309 166410 169184 173618 172458 177692 177373 174367 177384 180538 182176 182085 178040 180653
12495 180653 190237 191374 185523 183713 182545 183420 192344 198258 201356 200511 195317 193021 192851 197451 199912
12480 199912 201516 202889 208175 211349 211469 206972 207933 210563 214711 217236 218086 222081 228802 226176 223784
$$ packed form
12584A63740K025p073q696k385M22J927K426l345k204l575K238R146K270p296
12570A49620q52j259R96k294n32M352Q765K834O61J347l435m836J257M43N552
12555A62619M093N237j534k836o197J656L037K90q435m539k881L203L631M152
12541A61496k19O60m902n38J312o52J7L163O877j059m191O504N772l947M84N51
12525A71328n768M82N176L672J343j209q78J406L438o825k149L759J089K915J768
12510A79547L446o684r899K774M434j160N234l19l006L017L154J638r1m045K613
12495A80653R584J137n851j810j168Q75Q924N914L098q45n194k296j70M600K461
12480A99912J604J373N286L174J20m497R61K630M148K525Q50L995O721k626k392
$$ plain form
12465 223784 217887 214838 213192 210703 209942 220251 221266 216397 214862 218539 214534 214175 216041 215362 218674
12450 218674 222490 229850 226771 226037 230735 234021 237215 241568 245655 248901 250346 253050 261236 262406
12436 262406 257227 248114 252071 256485 263313 268482 266629 261091 264664 270772 277529 280607 283132 288580
12422 288580 288999 284547 282883 286498 288524 294110 295776 294658 295673 297389 307597 310803 315142 318533
12408 318533 322339 329736 332591 337572 343110 354132 362464 367058 366143 363455 364844 376870 385364 396562
12394 396562 407106 410877 425074 435862 437492 444574 451630 450232 457376 470636 479622 489360 496593
12381 496593 506101 509884 525546 538676 543888 549445 559451 565000 577655 597100 609780 624411
12369 624411 639590 660661 676904 685785 701022 719096 740116 758893 778240 801349 821505 848072
$$ packed form
12465B23784n897l049j646k489p61J0309J015m869j535L677m005l59J866o79L312
12450B18674L816P360l079p34M698L286L194M353M087L246J445K704Q186J170
12436B62406n179r113L957M414O828N169j853n538L573O108O757L078K525N448
12422B88580M19m452j664L615K026N586J666j118J015J716J0208L206M339L391
12408C18533L806P397K855M981N538J1022Q332M594r15k688J389J2026Q494J1198
12394C96562J0544L771J4197J0788J630P082P056j398P144J3260Q986R738P233
12381D96593R508L783J5662J3130N212N557J0006N549J2655J9445J2680J4631
12369F24411J5179K1071J6243Q881J5237J8074K1020J8777J9347K3109K0156K6567
$$ plain form
12357 848072 879782 903440 929642 961739 1003475 1045975 1094031 1146534 1199635 1253896 1321210
12346 1321210 1393606 1476567 1568895 1664023 1780186 1905977 2041647 2200774 2381081 2585716
12336 2585716 2816127 3072357 3347587 3651089 3987772 4348465 4727294 5109648 5480598
12327 5480598 5828197 6143925 6411951 6619682 6770199 6845617 6860649 6829931 6756874 6671706
12317 6671706 6581367 6504795 6452742 6444637 6479461 6555569 6691312 6885719 7122636 7416355 7758964
12306 7758964 8166311 8620775 9109842 9633975 10152612 10654121 11118428 11516747 11826956
12297 11826956 12033731 12126953 12105508 11983314 11778569 11505420 11192408 10862156 10545119 10248661
12287 10248661 9995047 9801187 9670197 9611778 9620885 9708763 9868656 10114586 10449769 10858171
$$ packed form
12357H48072L1710K3658K6202L2097M1736M2500M8056N2503N3101N4261O7314
12346A321210P2396Q2961R2328R5128J16163J25791J35670J59127J80307K04635
12336B585716K30411K56230K75230L03502L36683L60693L78829L82354L70950
12327E480598L47599L15728K68026K07731J50517P5418J5032l0718p3057q5168
12317F671706r0339p6572n2053q105L4824P6108J35743J94407K36917K93719L42609
12306G758964M07347M54464M89067N24133N18637N01509M64307L98319L10209
12297A1826956K06775R3222k1445j22194k04745k73149l13012l30252l17037k96458
12287A0248661k53614j93860j30990n8419R107Q7878J59893K45930L35183M08402
$$ plain form
12277 10858171 11342262 11896717 12526293 13207905 13927795 14666064 15399903 16102381 16734382
12268 16734382 17258175 17657318 17909035 18004837 17944038 17745020 17418566 16999396 16522449 16022587
12258 16022587 15532964 15094821 14736744 14479176 14331616 14310589 14426581 14676817 15050956
12249 15050956 15552161 16182100 16924871 17756598 18645717 19577845 20502008 21366350 22133715
12240 22133715 22753705 23184749 23394088 23377578 23148654 22722621 22123136 21398235 20594910
12231 20594910 19760779 18940126 18164860 17460311 16841431 16328336 15920739 15627266 15429291
12222 15429291 15334188 15342803 15446699 15646257 15923115 16263608 16652230 17054370 17447628 17820925
12212 17820925 18136483 18364694 18485665 18494677 18383246 18151453 17789238 17313170 16748731 16130135
$$ packed form
12277A0858171M84091N54455O29576O81612P19890P38269P33839P02478O32001
12268A6734382N23793L99143K51717R5802o0799j99018l26454m19170m76947m99862
12258A6022587m89623m38143l58077k57568j47560k1027J15992K50236L74139
12249A5050956N01205O29939P42771Q31727Q89119R32128R24163Q64342P67365
12240B2133715O19990M31044K09339j6510k28924m26033n99485p24901q03325
12231B0594910q34131q20653p75266p04549o18880n13095m07597k93473j97975
12222A5429291r5103Q615J03896J99558K76858L40493L88622M02140L93258L73297
12212A7820925L15558K28211J20971R012j11431k31793l62215m76068n64439o18596
$$ plain form
12202 16130135 15479247 14808929 14147273 13516986 12929269 12413175 11967899 11599606 11313518
12193 11313518 11106824 10987892 10956577 11008098 11135208 11326916 11580474 11884690 12215338 12552575
12183 12552575 12861248 13131297 13322164 13419855 13417199 13306711 13094854 12787682 12397427 11943779
12173 11943779 11446405 10937799 10439788 9965907 9527423 9134367 8786938 8487961 8246021
12164 8246021 8050719 7902888 7803540 7742324 7714618 7709538 7717359 7732188 7735942 7724280 7678184
12153 7678184 7591204 7458818 7287946 7083435 6837081 6565096 6274920 5969313 5666950 5364990
12143 5364990 5074078 4788072 4520333 4275806 4042296 3818050 3604173 3403724 3214105
12134 3214105 3035708 2866825 2706905 2557057 2415745 2281933 2153004 2035576 1925988
$$ packed form
12202A6130135o50888o70318o61656o30287n87717n16094m45276l68293k86088
12193A1313518k06694j18932l1315N1521J27110J91708K53558L04216L30648L37237
12183A2552575L08673K70049J90867R7691k656j10488k11857l07172l90255m53648
12173A1943779m97374n08606m98011m73881m38484l93056l47429k98977k41940
12164H246021j95302j47831r9348o1216k7706n080P821J4829L754j1662m6096
12153G678184q6980j32386j70872k04511k46354k71985k90176l05607l02363l01960
12143E364990k90912k86006k67739k44527k33510k24246k13877k00449j89619
12134C214105j78397j68883j59920j49848j41312j33812j28929j17428j09588
$$ plain form
12125 1925988 1830420 1737392 1652023 1579288 1504888 1425393 1352472 1295173 1238918 1181135 1123618
12114 1123618 1072793 1025720 985233 944040 907912 866235 826818 797474 771143 745014 710082
12103 710082 685362 665791 646463 636622 630515 641297 660680 686072 712719 719063 707951 694891
12091 694891 674289 644076 601025 555564 503495 456465 429555 400059 380013 362029 351305
12080 351305 344316 331134 323162 311169 292338 279663 271764 265183 255549 247444 239043 233717 228559
12067 228559 218576 211246 211475 210902 202335 196758 194923 188614 180845 173269 160584 156653 162029 161964 160979
12052 160979 158705 157257 154428 149489 152772 158839 159843 161298 155196 148340 153374 157690 155009 153849
12038 153849 165719 179004 183579 183814 186068 187447 191423 201753 205011 206189 207324 218023 236831
$$ packed form
12125A925988r5568r3028q5369p2735p4400p9495p2921n7299n6255n7783n7517
12114A123618n0825m7073m0487m1193l6128m1677l9417k9344k6331k6129l4932
12103G10082k4720j9571j9328r841o107J0782J9383K5392K6647O344j1112j3060
12091F94891k0602l0213m3051m5461n2069m7030k6910k9496k0046j7984j0724
12080C51305o989j3182p972j1993j8831j2675p899o581r634q105q401n326n158
12067B28559r983p330K29n73q567n577j835o309p769p576j2685l931N376o5r85
12052A60979k274j448k829m939L283O067J004J455o102o856N034M316k681j160
12038A53849J1870J3285M575K35K254J379L976J0330L258J178J135J0699J8808
$$ plain form
12025 236831 249603 254073 270183 292585 310666 328896 348450 368922 376122 393987 411180 428510
12013 428510 442172 451512 466422 475672 486531 491487 496868 503225 508059 506477 497209 492317 481261
12000 481261 465027 456413 440099 421145 405582 389415 373499 354593 341642 321319 301360 282350
11988 282350 261858 241928 225265 210938 199489 194308 181712 171793 159854 146046 138118 126094
11976 126094 116697 107076 97610 96972 92086 83458 73386 68815 67160 67309 61729 50295 47808 40868
11962 40868 34627 26107 19060 20734 21668 28279 35232 31211 29871 26630 24293 18760 13184 7642 10414
11947 10414 12669 11466 14364 7767 772 -92 230 2312 955 -5519 -10303 -4270 -5291 -4696 -6730
11932 -6730 -11795 -10319 -12395 -13872 -11949 -8829 -6655 -8761 -7542 -10528 -11450 -9419 -14396 -18479 -19478
$$ packed form
12025B36831J2772M470J6110K2402J8081J8230J9554K0472P200J7865J7193J7330
12013D28510J3662R340J4910R250J0859M956N381O357M834j582r268m892j1056
12000D81261j6234q614j6314j8954j5563j6167j5916j8906j2951k0323j9959j9010
11988B82350k0492j9930j6663j4327j1449n181j2596r919j1939j3808p928j2024
11976A26094r397r621r466o38m886q628j0072m571j655J49n580j1434k487o940
11962D0868o241q520p047J674R34O611O953m021j340l241k337n533n576n542K772
11947A0414K255j203K898o597o995q64L22K082j357o474m784O033j021N95k034
11932f730n065J476k076j477J923L120K174k106J219k986r22K031m977m083r99
$$ plain form
11917 -19478 -20089 -19584 -23590 -22639 -17704 -15180 -12836 -9214 -10402 -14498 -14472 -11544 -13138 -11883 -11347 -6224
11901 -6224 -3180 264 704 4070 5610 1970 -562 -1967 -6952 -5291 -7749 -16583 -10741 -3220 -3114
11886 -3114 -226 -3632 -857 7788 14752 19938 24590 21173 14386 13559 14307 11654 13985 15283 15847
11871 15847 10030 4663 5196 5683 8954 15316 16777 16558 18630 17806 22512 29324 33640 34675 35753
11856 35753 42138 43663 41731 42474 46317 49113 46210 41727 43683 47035 42866 42172 47062 42995 37302
11841 37302 36891 36438 36495 31514 27274 23995 27680 35620 38519 40791 45042 46935 47965 45898 50186
11826 50186 52157 52020 55246 57123 63355 69152 77829 78856 81223 78691 67025 68491 74881 67986
11812 67986 63281 63498 59215 57860 57995 53391 54878 57025 52892 54089 65565 66567 65906 72299 79581
$$ packed form
11917a9478o11N05m006R51M935K524K344L622j188m096K6K928j594J255N36N123
11901f224L044L444M40L366J540l640k532j405m985J661k458q834N842P521J06
11886c114K888l406K775Q645O964N186M652l417o787q27P48k653K331J298N64
11871A5847n817n367N33M87L271O362J461k19K072q24M706O812M316J035J078
11856C5753O385J525j932P43L843K796k903m483J956L352m169o94M890m067n693
11841C7302m11m53N7m981m240l279L685P940K899K272M251J893J030k067M288
11826E0186J971j37L226J877O232N797Q677J027K367k532j1666J466O390o895
11812F7986m705K17m283j355J35m604J487K147m133J197J1476J002o61O393P282
$$ plain form
11797 79581 81821 77833 80076 89028 90380 93615 95947 104269 110125 114302 115857 109138 107012 98179
11783 98179 97912 99197 91572 83919 70889 65521 63610 63003 57338 59314 59532 60436 57544 65122 69191
11768 69191 69823 70586 79946 82135 76464 77655 81536 87204 87087 79790 80196 79232 75052 68399 67000 62631
11752 62631 58160 60514 68880 64471 57222 56198 49960 44620 41712 44906 42716 37622 38972 44042
11738 44042 44790 53103 56696 57033 60889 59220 58855 61397 59996 57137 56995 53703 48609 45741 49971
11723 49971 49065 41044 33895 31988 26581 21556 18908 18364 19719 15728 12772 13223 14077 15930 18436
11708 18436 19506 24525 24693 30888 33917 36850 38962 34844 32576 29727 22801 19916 14371 7688 8696
11693 8696 11457 18624 14869 10340 5711 4038 2487 -2002 -3744 -3347 -6446 -7237 -11968 -4451 517
$$ packed form
11797G9581K240l988K243Q952J352L235K332Q322N856M177J555o719k126q833
11783I8179k67J285p625p653j3030n368j911o07n665J976K18R04k892P578M069
11768F9191O32P63R360K189n671J191L881N668j17p297M06r64m180o653j399m369
11752F2631m471K354Q366m409p249j024o238n340k908L194k190n094J350N070
11738D4042P48Q313L593L37L856j669l65K542j401k859j42l292n094k868M230
11723D9971r06q021p149j907n407n025k648n44J355l991k956M51Q54J853K506
11708A8436J070N019J68O195L029K933K112m118k268k849o926k885n545o683J008
11693H696K761P167l755m529m629j673j551m489j742L97l099p91m731P517M968
$$ plain form
11678 517 3367 2769 4218 5535 8602 12641 17107 17966 18960 8108 2232 -1426 -9034 -17742 -18366 -15829
11662 -15829 -9150 -2543 -3536 -3962 -3122 1422 554 -3278 -3316 -2893 -3078 2869 5215 4520 -853 -485 -2112
11645 -2112 -2741 3006 1978 -258 -2694 -1183 -3265 -7843 -6875 -4957 -1045 1525 5253 1886 -3951
11630 -3951 -8413 -5303 -4593 -3956 3039 4586 11685 21349 22533 19524 22132 26287 23627 22045 19388
11615 19388 18486 15355 15100 9866 13428 17844 21367 21988 31120 35563 37091 41438 48580 55622 58390
11600 58390 62874 67917 58437 49933 54726 61474 63167 67945 75882 83900 98271 123227 136105 151630
11586 151630 169135 191777 221087 260652 306503 361604 432030 534370 675289 879544 1231159
11575 1231159 1854714 2846979 3866475 4349904 4408503 4317905 4321172 4548901 4518570 3428432
$$ packed form
11678E17K850n98J449J317L067M039M466Q59R94j0852n876l658p608q708o24K537
11662a5829O679O607r93m26Q40M544q68l832l8M23j85N947K346o95n373L68j627
11645b112o29N747j028k236k436J511k082m578R68J918L912K570L728l367n837
11630c951m462L110P10O37O995J547P099R664J184l009K608M155k660j582k657
11615A9388r02l131k55n234L562M416L523O21R132M443J528M347P142P042K768
11600E8390M484N043r480q504M793O748J693M778P937Q018J4371K4956J2878J5525
11586A51630J7505K2642K9310L9565M5851N5101P0426J02340J40919K04255L51615
11575A231159O23555R92265J019496M83429N8599r0598L267K27729l0331j090138
$$ plain form
11565 3428432 2206027 1492700 1114918 900668 764118 659094 585912 524787 468123 432200
11555 432200 408950 385705 360870 330251 306407 284715 264051 249865 238520 231199 216250 201385
11543 201385 193995 192825 194901 186681 174633 163556 160057 148708 138723 133278 131300 124391 116955
11530 116955 107730 102436 91791 81695 83917 83373 78543 74184 67879 62852 59441 59838 55498 49490
11516 49490 45563 44322 47502 44068 44515 41070 38458 37916 37217 32081 28352 29832 29354 29287 27283 28905
11500 28905 29736 26766 19742 21189 25659 21887 23004 21109 9804 3129 3909 6173 9999 11908 7010
11485 7010 7436 8082 8696 7752 6883 2444 2264 5944 10184 12686 8213 1071 -7609 -14480 -15555 -13649
11469 -13649 -8293 -4015 2298 -2421 -10644 -8991 -521 -3151 -5920 -18620 -21823 -15830 -13790 -12646
$$ packed form
11565C428432j222405p13327l77782k14250j36550j05024p3182o1125n6664l5923
11555D32200k3250k3245k4835l0619k3844k1692k0664j4186j1345p321j4949j4865
11543B01385p390j170K076q220j2048j1077l499j1349r985n445j978o909p436
11530A16955r225n294j0645j0096K222n44m830m359o305n027l411L97m340o008
11516D9490l927j241L180l434M47l445k612n42o99n136l729J480m78o7k004J622
11500B8905Q31k970p024J447M470l772J117j895j1305o675P80K264L826J909m898
11485G010M26O46O14r44q69m439j80L680M240K502m473p142q680o871j075J906
11469a3649N356M278O313m719q223J653Q470k630k769j2700l203N993K040J144
$$ plain form
11455 -12646 -7708 -9325 -10915 -10280 -14858 -11876 -6305 -4687 -5378 -2216 2392 5619 6047 4173 1773
11440 1773 5644 1889 -4231 -6622 -6960 -3799 590 3908 -262 -6079 -1039 4495 9061 3560 -714
11425 -714 -4725 3882 7275 2397 -2210 -5484 -11503 -13613 -6230 -2534 -2416 -1346 -1593 -2750 -7270
11410 -7270 -3413 3844 6549 1713 -2301 -941 406 -1738 -3089 -5527 -13362 -15152 -14172 -14516 -8579
11395 -8579 -8189 -5758 -4699 -191 2076 -4047 -6837 -6883 -5146 -5672 -6452 -3427 -2419 -2236 4858 1578
11379 1578 -7536 -8663 -3260 1796 2953 -3579 -5520 -2581 4923 4593 3642 3902 4065 150 -1314 213
11363 213 -2099 -3868 2458 7477 9389 5260 2444 1372 334 -1349 -3509 -2173 -5897 -661 1312
11348 1312 6014 10573 12456 9123 3812 4004 -2044 -2796 -2242 -3114 1596 -382 -2657 -1951 -5196 -2104
$$ packed form
11455a2646M938j617j590O35m578K982N571J618o91L162M608L227M28j874k400
11440A773L871l755o120k391l38L161M389L318m170n817N040N534M566n501m274
11425g14m011Q607L393m878m607l274o019k110P383L696J18J070k47j157m520
11410g270L857P257K705m836m014J360J347k144j351k438p835j790R80l44N937
11395h579L90K431J059M508K267o123k790m6J737n26p80L025J008J83P094l280
11379A578r114j127N403N056J157o532j941K939P504l30r51K60J63l915j464J527
11363B13k312j769O326N019J912m129k816j072j038j683k160J336l724N236J973
11348A312M702M559J883l333n311J92o048p52N54q72M710j978k275P06l245L092
$$ plain form
11332 -2104 -2612 -10572 -6338 113 3432 -2945 -9532 -10075 -3055 694 924 -387 -1650 -2861 4035
11317 4035 3582 2628 -314 -3288 -4969 -3760 421 -2315 -5511 -5328 -920 -7786 -12762 -12200 -11739 -11633
11301 -11633 -5846 509 2940 1484 995 121 -4909 -6044 -1600 -8479 -13532 -12694 -7953 -6930 -3099
11286 -3099 -2659 1728 1905 5639 6796 975 -2204 -1914 1533 557 -2229 -5118 -6146 -2849 3613 5786
11270 5786 3434 1246 3666 4777 4106 3252 3686 4405 138 -1879 2234 -638 -2885 -3158 -232 -3985
11254 -3985 1187 2725 -575 -3368 -3270 2631 6281 7278 10823 7002 4768 799 5809 11145 8561
11239 8561 4535 5597 1840 2088 3391 5370 9861 10930 13281 14638 8223 3232 6052 8054 8146
11224 8146 9675 6346 3789 4263 5852 11315 11547 8793 6441 7715 5603 3688 3890 12721 14999
$$ packed form
11332b104n08p960M234O451L319o377o587n43P020L749K30j311j263j211O896
11317D035m53r54k942k974j681J209M181k736l196J83M408o866m976N62M61J06
11301a1633N787O355K431j456m89q74n030j135M444o879n053Q38M741J023L831
11286c099M40M387J77L734J157n821l179K90L447r76k786k889j028L297O462K173
11270E786k352k188K420J111o71q54M34P19m267k017M113k872k247k73K926l753
11254c985N172J538l300k793R8N901L650R97L545l821k234l969N010N336k584
11239H561m026J062l757K48J303J979M491J069K351J357o415m991K820K002R2
11224H146J529l329k557M74J589N463K32k754k352J274k112j915K02Q831K278
$$ plain form
11209 14999 10551 11028 13778 19298 18444 15832 14794 9027 7822 9142 4256 -320 -163 2810 5004
11194 5004 6041 6552 2917 -1268 -10728 -12875 -8955 -3399 -335 1241 3333 -511 -2690 -387 -1598
11179 -1598 789 -3063 -5515 -9598 -13710 -10291 -5130 597 3526 -1785 -379 -12 4221 10730 10664
11164 10664 9066 9479 3664 -4472 2211 8549 9820 6589 2156 1286 8327 11389 3587 5107 8372
11149 8372 5701 4901 4928 5606 9115 12312 16320 18850 9319 5592 1871 -1551 -722 -3639 -6393 148
11133 148 6869 5288 -818 -2337 727 204 -3202 -1848 -1213 8517 11211 13924 23130 25835 26553 18869
11117 18869 16393 25041 25105 16598 13705 20197 15003 4135 4692 8538 6108 3744 -590 -3650 -2634
11102 -2634 7470 12453 11891 20380 17345 13486 10263 8720 7753 2949 7684 9135 9169 11343 12030 11513
$$ packed form
11209A4999m448M77K750N520q54k612j038n767j205J320m886m576J57K973K194
11194E004J037N11l635m185r460k147L920N556L064J576K092l844k179K303j211
11179a598K387l852k452m083m112L419N161N727K929n311J406L67M233O509o6
11164A0664j598M13n815q136O683O338J271l231m433q70P041L062p802J520L265
11149H372k671q00K7O78L509L197M008K530r531l727l721l422Q29k917k754O541
11133A48O721j581o106j519L064n23l406J354O35R730K694K713R206K705P18p684
11117A8869k476Q648O4q507k893O492n194j0868N57L846k430k364m334l060J016
11102b634J0104M983n62Q489l035l859l223j543r67m804M735J451L4K174O87n17
$$ plain form
11086 11513 11868 12308 12960 12217 17475 16736 14744 10343 4889 4699 9842 6775 3793 3704 10586 17647
11070 17647 16238 15721 12955 9057 7482 3814 6637 9047 6920 7490 9543 11313 11425 9878 7974
11055 7974 7739 8218 11469 8752 1556 1982 7440 1028 -375 1360 6280 12112 15341 22130 24820
11040 24820 24625 21905 12777 8905 11492 10396 8322 9348 8014 10515 11724 16322 16304 18217 17342
11025 17342 18468 19700 21453 23598 23201 19004 21039 20960 27473 21828 23306 30407 37223 34764 30819
11010 30819 26072 23820 20009 15982 15907 21123 26765 25003 21569 15900 14403 15264 11815 13071 15383
10995 15383 16270 18909 12623 13805 15941 15563 9613 4366 5308 5387 7002 12261 13399 10236 7113 15070
10979 15070 20535 11758 5781 8054 14343 15969 7563 7999 15129 13750 15497 20270 17925 22204 24253
$$ packed form
11086A1513L55M40O52p43N258p39j992m401n454j90N143l067k982q9O882P061
11070A7647j409n17k766l898j575l668K823K410k127N70K053J770J12j547j904
11055G974k35M79L251k717p196M26N458o412j403J735M920N832L229O789K690
11040B4820j95k720r128l872K587j096k074J026j334K501J209M598j8J913q75
11025A7342J126J232J753K145l97m197K035p9O513n645J478P101O816k459l945
11010C0819m747k252l811m027p5N216N642j762l434n669j497Q61l449J256K312
10995A5383Q87K639o286J182K136l78n950n247R42P9J615N259J138l163l123P957
10979A5070N465q777n977K273O289J626q406M36P130j379J747M773k345M279K049
$$ plain form
10964 24253 20838 23550 19992 12793 13539 14043 18487 24153 17604 16583 14516 12327 8513 12566 14085
10949 14085 15200 25171 30703 29610 29182 23372 19721 21937 23211 25866 23711 25616 30318 28563 19787
10934 19787 18326 19449 15783 14859 18402 19243 19497 13894 8004 9016 19460 22267 17183 15341 16102
10919 16102 10854 11781 11413 10092 10036 10890 12699 13942 15552 15157 18391 17441 13961 14650 17855 22016
10903 22016 28267 27165 26556 26058 23346 18353 14511 21509 27332 29274 30347 30821 32425 33075 33652 31588
10887 31588 27456 27031 25942 26232 20748 21942 17394 18699 24124 27171 26659 24903 24436 24210 26185 24028
10871 24028 25604 28068 26654 27324 28818 27618 24545 22043 21359 18641 22579 26539 24659 26317 24556
10856 24556 21463 24065 18678 15036 14973 12648 15959 20320 16160 16699 25367 27490 20577 16279 16799
$$ packed form
10964B4253l415K712l558p199P46N04M444N666o549j021k067k189l814M053J519
10949A4085J115R971N532j093m28n810l651K216J274K655k155J905M702j755q776
10934A9787j461J123l666r24L543Q41K54n603n890J012J0444K807n084j842P61
10919A6102n248R27l68j321n6Q54J809J243J610l95L234r50l480O89L205M161
10903B2016O251j102o09m98k712m993l842O998N823J942J073M74J604O50N77k064
10887C1588m132m25j089K90n484J194m548J305N425L047n12j756m67k26J975k157
10871B4028J576K464j414O70J494j200l073k502o84k718L938L960j880J658j761
10856B4556l093K602n387l642o3k325L311M361m160N39Q668K123o913m298N20
$$ plain form
10841 16799 22697 22571 18709 17338 18976 17952 21769 19797 20678 22836 25107 25802 21024 21860 24606
10826 24606 26674 32378 32476 25395 31544 37483 33337 24836 22701 22152 24972 26310 30495 30963 32235
10811 32235 30052 30033 32682 29151 26592 23579 22120 30614 29935 25558 27920 30727 26274 30496 36035
10796 36035 31441 32198 30262 26498 31929 33384 26191 22317 24499 28626 25525 24438 25973 30863 37268
10781 37268 41971 40049 36497 37164 35497 39011 41481 37351 39636 42851 45284 48701 48462 50838 51193
10766 51193 47002 50016 47145 45357 48656 50781 46970 40008 37346 38447 37844 34018 35054 37823 42539
10751 42539 39411 30455 29052 32982 37196 39889 40965 34986 32696 32573 28680 27660 29844 31122 35130
10736 35130 35897 37310 34973 30562 33658 33343 31644 34326 35367 32497 31028 35543 40333 42094 45772
$$ packed form
10841A6799N898j26l862j371J638j024L817j972Q81K158K271O95m778Q36K746
10826B4606K068N704R8p081O149N939m146q501k135n49K820J338M185M68J272
10811C2235k183j9K649l531k559l013j459Q494o79m377K362K807m453M222N539
10796C6035m594P57j936l764N431J455p193l874K182M127l101j087J535M890O405
10781C7268M703j922l552O67j667L514K470m130K285L215K433L417k39K376L55
10766E1193m191L014k871j788L299K125l811o962k662J101o03l826J036K769M716
10751D2539l128q956j403L930M214K693J076n979k290j23l893j020K184J278M008
10736C5130P67J413k337m411L096l15j699K682J041k870j469M515M790J761L678
$$ plain form
10721 45772 45311 45478 48473 49559 48829 46576 46434 42036 42377 42888 42678 43729 42566 39897 43031 47084
10705 47084 45033 44370 41509 43780 43091 49806 54087 55738 55896 58288 57797 56972 45909 42149 47488
10690 47488 50182 49738 46265 48405 51949 50292 48152 46313 45269 46470 45730 39836 41969 46814 45561
10675 45561 50411 57284 56724 55304 49067 45926 48841 47418 47282 49665 45181 42734 44355 39107 45218
10660 45218 55296 53133 51372 46004 44637 43952 44281 45594 47139 45530 40684 46460 47296 42651 43306
10645 43306 42663 46855 54199 57176 51308 52677 52007 54077 50591 54833 54644 57645 50931 44799 42575
10630 42575 47821 56840 63062 56221 49710 53185 56952 56948 54079 49345 48289 50222 55126 53010 48597
10615 48597 47949 47153 46039 49654 47233 48834 49744 53489 48195 43801 45033 47815 52637 52750 51651
$$ packed form
10721D5772m61J67K995J086p30k253j42m398L41N11k10J051j163k669L134M053
10705D7084k051o63k861K271o89O715M281J651J58K392m91q25j1063l760N339
10690D7488K694m44l473K140L544j657k140j839j044J201p40n894K133M845j253
10675D5561M850O873n60j420o237l141K915j423j36K383m484k447J621n248O111
10660D5218J0078k163j761n368j367o85L29J313J545j609m846N776Q36m645O55
10645D3306o43M192P344K977n868J369o70K070l486M242j89L001o714o132k224
10630D2575N246R019O222o841o511L475L767mk869m734j056J933M904k116m413
10615D8597o48p96j114L615k421J601R10L745n294m394J232K782M822J13j099
$$ plain form
10600 51651 50974 52165 54881 58750 59795 62139 63827 65370 63564 61191 54981 51965 53219 48200 42990
10585 42990 45544 50843 51800 48032 42644 44200 51075 52685 48865 47088 46194 44748 43118 39560 38072
10570 38072 36264 34994 40834 43766 48373 50865 51355 50845 52117 53096 54818 51844 48603 51630 52254
10555 52254 54395 54759 55678 57071 54640 55471 52605 53255 55660 60021 56807 57492 61084 65888 67682 67776
10539 67776 65755 57449 50929 52614 50315 54375 59320 61578 57808 63018 59908 55684 54009 56654
10525 56654 59666 58187 54877 55742 61185 64097 61554 58213 63482 62430 62068 59703 55007 54198 56120
10510 56120 59786 64593 63519 57185 54716 52466 55205 52166 51172 50955 57569 59930 62636 69429 69811
10495 69811 70422 65914 66389 68766 70263 71126 72912 70186 72010 71899 70249 69855 72307 75868 75947 71743
$$ packed form
10600E1651o77J191K716L869J045K344J688J543j806k373o210l016J254n019n210
10585D2990K554N299R57l768n388J556O875J610l820j777q94j446j630l558j488
10570C8072j808j270N840K932M607K492M90n10J272R79J722k974l241L027O24
10555E2254K141L64R19J393k431Q31k866O50K405M361l214O85L592M804J794R4
10539F7776k021q306o520J685k299M060M945K258l770N210l110m224j675K645
10525E6654L012j479l310Q65N443K912k543l341N269j052l62k365m696q09J922
10510E6120L666M807j074o334k469k250K739l039r94k17O614K361K706O793L82
10495F9811O11m508M75K377J497Q63J786k726J824j11j650l94K452L561P9m204
$$ plain form
10479 71743 66979 63495 62460 60045 63971 70230 75268 73216 72952 69189 63717 60157 65294 72556 77645
10464 77645 75109 69216 67699 70850 75068 82460 80349 73368 77132 77654 75190 79506 76496 74992 70290
10449 70290 64202 71267 71277 68124 73636 77085 80106 78284 79700 76424 71055 68493 70241 71910 68551
10434 68551 67852 72897 79740 84613 90173 94100 89037 79839 76764 81489 84257 82797 84361 82190 76201
10419 76201 80134 89166 89708 85653 82724 84048 78815 76067 78478 85054 84171 85625 93253 95031 93089
10404 93089 93338 92383 96313 96380 90033 85907 87784 91534 90120 91043 91431 95052 100229 99555 101924 96344
10388 96344 100640 108487 104158 100372 103490 105903 106061 110498 111265 113610 110608 107884 99437 98212 102756
10373 102756 105550 99130 90390 92422 98083 100998 99070 94466 92226 89399 89259 89252 90946 89324 92251
$$ packed form
10479G1743m764l484j035k415L926O259N038k052k64l763n472l560N137P262N089
10464G7645k536n893j517L151M218P392k111o981L764N22k464M316l010j504m702
10449G0290o088P065J0l153N512L449L021j822J416l276n369k562J748J669l359
10434F8551o99N045O843M873N560L927n063r198l075M725K768j460J564k171n989
10419G6201L933R032N42m055k929J324n233k748K411O576q83J454P628J778j942
10404I3089K49r55L930O7o347m126J877L750j414R23L88L621N177o74K369n580
10388I6344M296P847m329l786L118K413J58M437P67K345l002k724q447j225M544
10373A02756K794o420q740K032N661K915j928m604k240k827j40pJ694j622K927
$$ plain form
10358 92251 96243 97372 101919 100444 99496 98249 103336 100913 105554 108220 107744 111374 112256 113200 115562
10343 115562 118034 119311 122583 128387 129730 127555 132097 138448 137703 133501 133185 132990 135992 136644 142267
10328 142267 149940 151296 154007 155806 158503 165695 165755 162745 161485 164195 171038 177959 176729 187191
10314 187191 197948 206272 214532 224771 227171 228378 227829 224667 223908 226250 218103 218880 227577 226794 229643
10299 229643 226873 218679 214836 217567 224935 228627 231615 231573 228045 231879 238824 244315 249567 263008
10285 263008 274600 283215 291970 304720 314832 324278 334040 342586 355731 374039 385170 397797
10273 397797 412651 432007 449062 466424 483834 500444 519915 540414 558058 573392 584266
10262 584266 591780 605024 619077 630570 636866 649471 665655 678608 693705 702165 709627 725220
$$ packed form
10358I2251L992J129M547j475r48j247N087k423M641K666m76L630Q82R44K362
10343A15562K472J277L272N804J343k175M542O351p45m202l16j95L002O52N623
10328A42267P673J356K711J799K697P192O0l010j260K710O843O921j230J0462
10314A87191J0757Q324Q260J0239K400J207n49l162p59K342q147P77Q697p83K849
10299B29643k770q194l843K731P368L692K988m2l528L834O945N491N252J3441
10285B63008J1592Q615Q755J2750J0112R446R762Q546J3145J8308J1131J2627
10273C97797J4854J9356J7055J7362J7410J6610J9471K0499J7644J5334J0874
10262E84266P514J3244J4053J1493O296J2605J6184J2953J5097Q460P462J5593
$$ plain form
10250 725220 738081 749184 759713 767719 774912 780423 780980 785990 791664 794606 789135 787996 785700 788420
10236 788420 785021 775634 764378 752950 748560 743078 739666 730082 717697 705459 701178 698587 695895
10223 695895 686936 676915 666181 656695 650119 632328 617133 601133 586720 576913 566333 555902
10211 555902 549828 544461 537131 538124 538249 534537 526759 525152 523714 525439 521693 515961 515164 505618 499901
10196 499901 499007 498185 497128 494974 489578 486466 482043 479372 475345 477261 479008 471905 471025 470970 466822
10181 466822 466556 468399 465299 461175 457780 461605 465517 468049 466302 465565 469892 475423 474357 471849 461474
10166 461474 457393 461284 469025 469433 468651 464439 466298 470022 471139 472050 474547 473555 477298 477030 475333
10151 475333 476113 483326 491164 493700 493687 499275 509175 514722 515191 507128 504734 502258 495942 498332 509923
$$ packed form
10250G25220J2861J1103J0529Q006P193N511N57N010N674K942n471j139k296K720
10236G88420l399r387j1256j1428m390n482l412r584j2385j2238m281k591k692
10223F95895q959j0021j0734r486o576j7791j5195j6000j4413r807j0580j0431
10211E55902o074n367p330R93J25l712p778j607j438J725l746n732p97r546n717
10196D99901q94q22j057k154n396l112m423k671m027J916J747p103q80n5m148
10181D66822k66J843l100m124l395L825L912K532j747p37M327N531j066k508j0375
10166D61474m081L891P741M08p82m212J859L724J117R11K497r92L743k68j697
10151D75333P80P213P838K536j3N588R900N547M69q063k394k476o316K390J1591
$$ plain form
10136 509923 514904 520830 533822 547216 557985 564713 576267 580779 590809 597885 604235 611100 623235
10123 623235 634085 648937 658693 670860 674788 670676 677397 686786 695899 702600 707818 721746 731137
10110 731137 741159 755477 771650 788187 803665 819671 831964 847500 861242 877878 893040
10099 893040 904330 909458 922788 938219 957924 981075 1001219 1018563 1042915 1065875 1092252 1126612
10087 1126612 1160578 1193818 1228996 1269659 1313001 1356454 1405299 1450995 1503556 1558654 1615383
10076 1615383 1671402 1723251 1790877 1863700 1938209 2020724 2108083 2200792 2290353 2392148 2507482
10065 2507482 2635763 2765463 2908446 3067892 3245443 3444529 3651617 3884230 4134015
10056 4134015 4400047 4688953 5001702 5348698 5738601 6160342 6627421 7153774 7738363
$$ packed form
10136E09923M981N926J2992J3394J0769O728J1554M512J0030P076O350O865J2135
10123F23235J0850J4852R756J2167L928m112O721R389R113O701N218J3928R391
10110G31137J0022J4318J6173J6537J5478J6006J2293J5536J3742J6636J5162
10099H93040J1290N128J3330J5431J9705K3151K0144J7344K4352K2960K6377L4360
10087A126612L3966L3240L5178M0663M3342M3453M8845M5696N2561N5098N6729
10076A615383N6019N1849O7626P2823P4509Q2515Q7359R2709Q9561J01795J15334
10065B507482J28281J29700J42983J59446J77551J99086K07088K32613K49785
10056D134015K66032K88906L12749L46996L89903M21741M67079N26353N84589
$$ plain form
10047 7738363 8391285 9128537 9956256 10884537 11931326 13108201 14434315 15936201 17637961
10038 17637961 19572642 21760022 24242591 27053262 30230381 33792953 37759098 42129802
10030 42129802 46849763 51840039 56937935 61932634 66541680 70480428 73481160 75302941
10022 75302941 75804050 74966040 72869661 69717623 65784382 61375633 56782107 52234471
10014 52234471 47897323 43874105 40201745 36897321 33943990 31317307 28983004 26924125
10006 26924125 25088500 23450614 21988744 20671949 19483374 18414854 17443932 16566152
9998 16566152 15768719 15044999 14377713 13766604 13195268 12674554 12192702 11747997 11330834
9989 11330834 10945554 10582829 10241858 9924162 9618086 9339855 9073774 8820638 8581473
$$ packed form
10047G738363O52922P37252Q27719R28281J046789J176875J326114J501886J701760
10038A7637961J934681K187380K482569K810671L177119L562572L966145M370704
10030D2129802M719961M990276N097896M994699M609046L938748L000732J821781
10022G5302941N01109q38010k096379l152038l933241m408749m593526m547636
10014E2234471m337148m023218l672360l304424k953331k626683k334303k058879
10006B6924125j835625j637886j461870j316795j188575j068520r70922q77780
9998A6566152p97433p23720o67286o11109n71336n20714m81852m44705m17163
9989A1330834l85280l62725l40971l17696l06076k78231k66081k53136k39165
$$ plain form
9980 8581473 8348499 8128490 7927186 7726390 7528665 7342044 7167794 6993672 6825575 6669944
9970 6669944 6518046 6376441 6246253 6118514 5982108 5856504 5735725 5627260 5512228 5401541
9960 5401541 5302948 5205718 5109394 5017238 4928402 4835210 4754434 4674826 4593631 4523760 4454852
9949 4454852 4378564 4295519 4219509 4147039 4077630 4008113 3934308 3856513 3774775 3702543 3631513
9938 3631513 3559554 3498658 3433199 3361599 3290359 3217814 3149365 3087210 3023497 2958876 2890573
9927 2890573 2826837 2766079 2705185 2641206 2585190 2533590 2478361 2429370 2375751 2326130 2272452
9916 2272452 2231250 2189235 2149162 2111809 2070945 2029279 1980598 1943673 1907397 1872636 1837315
9905 1837315 1806348 1772506 1744228 1718995 1687448 1650520 1621401 1589293 1555395 1529551 1503408
$$ packed form
9980H581473k32974k20009k01304k00796j97725j86621j74250j74122j68097j55631
9970F669944j51898j41605j30188j27739j36406j25604j20779j08465j15032j10687
9960E401541r8593r7230r6324r2156q8836r3192q0776p9608q1195o9871o8908
9949D454852p6288q3045p6010p2470o9409o9517p3805p7795q1738p2232p1030
9938C631513p1959o0896o5459p1600p1240p2545o8449o2155o3713o4621o8303
9927B890573o3736o0758o0894o3979n6016n1600n5229m8991n3619m9621n3678
9916B272452m1202m2015m0073l7353m0864m1666m8681l6925l6276l4761l5321
9905A837315l0967l3842k8278k5233l1547l6928k9119l2108l3898k5844k6143
$$ plain form
9894 1503408 1468074 1431840 1395114 1370976 1339873 1315480 1291569 1256605 1227740 1206182 1181452
9883 1181452 1157937 1137498 1111566 1090035 1077290 1059903 1026724 999293 979793 958978 930934
9872 930934 903338 878218 854460 826691 798109 770652 742094 722374 702190 681001 650866 623473
9860 623473 609536 591522 569756 550642 536042 527234 510146 494235 475653 456024 432146 411711
9848 411711 401493 389217 377045 358375 342876 327421 315511 306299 302970 300975 295987 290851 287366
9835 287366 286228 286754 285992 288138 294660 289128 284896 280410 271773 269062 270054 269772 263651 264385 268659 275056
9819 275056 279171 283250 288513 297079 307778 314769 327196 349151 371633 394285 405586 407294 405510
9806 405510 407296 406457 401036 375680 354796 343123 327328 317673 318296 321958 325040 329810 330108 331989
$$ packed form
9894A503408l5334l6234l6726k4138l1103k4393k3911l4964k8865k1558k4730
9883A181452k3515k0439k5932k1531j2745j7387l3179k7431j9500k0815k8044
9872I30934k7596k5120k3758k7769k8582k7457k8558j9720k0184k1189l0135k7393
9860F23473j3937j8014k1766j9114j4600q808j7088j5911j8582j9629k3878k0435
9848D11711j0218j2276j2172j8670j5499j5455j1910r212l329j995m988n136l485
9835B87366j138N26p62K146O522n532m232m486q637k711R92k82o121P34M274O397
9819B75056M115M079N263Q566J0699O991J2427K1955K2482K2652J1301J708j784
9806D05510J786q39n421k5356k0884j1673j5795r655O23L662L082M770K98J881
$$ plain form
9792 331989 342925 359658 361490 348922 341851 338955 331065 326244 322410 321955 319737 326083 330517 331918
9778 331918 333183 337126 342552 356284 378431 392055 395641 387004 384519 397000 412729 411739 413170
9765 413170 426222 427958 431435 433052 439935 450253 452979 446752 441500 433483 430828 428888 427775 422002
9751 422002 409573 406395 403358 397992 395347 392507 387499 382278 382605 384845 388302 382983 374999 372276
9737 372276 374054 378023 383104 391742 392616 388795 384303 388246 391528 393024 390845 381926 376956 374306 375322
9722 375322 371661 372655 379147 378303 377420 363264 355467 357197 356037 341749 338824 342536 346835 353132 347922
9707 347922 345181 346009 344411 332706 325317 323238 319628 314757 314893 313786 314994 320159 324851 331221 329535
9692 329535 331085 324267 321184 315876 312804 312600 311620 316290 326306 330212 342820 354451 363036 372073
$$ packed form
9792C31989J0936J6733J832j2568p071k896p890m821l834m55k218O346M434J401
9778C31918J265L943N426J3732K2147J3624L586q637k485J2481J5729r90J431
9765D13170J3052J736L477J617O883J0318K726o227n252q017k655j940j113n773
9751D22002j2429l178l037n366k645k840n008n221L27K240L457n319p984k723
9737C72276J778L969N081Q638Q74l821m492L943L282J496k179q919m970k650J016
9722C75322l661R94O492q44q83j4156p797J730j160j4288k925L712M299O297n210
9707C47922k741Q28j598j1705p389k079l610m871J36j107J208N165M692O370j686
9692C29535J550o818l083n308l072k04r80M670J0016L906J2608J1631Q585R037
$$ plain form
9678 372073 379968 379361 367276 363907 372463 374402 381191 397098 406993 408287 404323 405738 410103 403681
9664 403681 389071 368549 355320 349073 349200 349923 351536 353205 352300 359000 365816 383201 396950 406064
9650 406064 415257 420941 422118 429555 434570 429041 416822 413986 412008 420257 421532 420727 417219 408070
9636 408070 399831 388712 375951 363125 349307 329048 315314 306798 304220 313369 317442 317006 309619
9623 309619 305493 310372 314117 311019 313137 306949 298498 294791 299747 308657 312603 312882 318840 329901
9609 329901 337802 330517 320979 312090 308802 303497 303086 301512 300073 298704 299436 302305 303502 303389 294722
9594 294722 288600 283371 278880 278753 275855 276398 278700 278133 277791 280848 285515 285704 284522 283952 276389 280621
9578 280621 281219 276359 275764 276817 284330 287069 285011 283805 278457 277499 277399 280049 276984 280822 283383
$$ packed form
9678C72073P895o07j2085l369Q556J939O789J5907R895J294l964J415M365o422
9664D03681j4610k0522j3229o247J27P23J613J669r05O700O816J7385J3749R114
9650D06064R193N684J177P437N015n529j2219k836j978Q249J275q05l508r149
9636D08070q239j1119j2761j2826j3818k0259j3734q516k578R149M073m36p387
9623C09619m126M879L745l098K118o188q451l707M956Q910L946K79N958J1061
9609C29901P901p285r538q889l288n305m11j574j439j369P32K869J197j13q667
9594B94722o122n229m491j27k898N43K302n67l42L057M667J89j182n70p563M232
9578B80621N98m860n95J053P513K739k058j206n348r58j00K650l065L838K561
$$ plain form
9563 283383 279632 278994 284431 293771 293264 287417 292602 295462 296239 299819 301365 298577 296980 299385 308336
9548 308336 314291 306494 305463 308789 302627 296842 293466 292398 290882 288596 293088 298032 301493 304112
9534 304112 307541 315601 321316 319557 321381 324879 327470 330635 337661 346528 349680 347813 341040 344834
9520 344834 351419 356657 353561 352491 355047 358983 364446 366771 365560 367414 375107 380440 387578 391897
9506 391897 395260 405259 414061 409067 406085 408812 413154 417072 426198 430642 423359 419793 425569 435181
9492 435181 441565 442747 445133 448457 454542 461120 465246 472454 483150 493746 496747 495652 508251 520012
9478 520012 525683 526642 524836 526319 530807 532644 541681 551584 560196 566542 577407 590255 599808 609268
9464 609268 609174 608200 607421 602911 597232 598656 608320 613126 617318 622257 624336 635317 646591 659458 662405
$$ packed form
9563B83383l751o38N437R340n07n847N185K860P77L580J546k788j597K405Q951
9548C08336N955p797j031L326o162n785l376j068j516k286M492M944L461K619
9534C04112L429Q060N715j759J824L498K591L165P026Q867L152j867o773L794
9520C44834O585N238l096j070K556L936N463K325j211J854P693N333P138M319
9506C91897L363R999Q802m994k982K727M342L918R126M444p283l566N776R612
9492D35181O384J182K386L324O085O578M126P208J0696J0596L001j095J2599J1761
9478E20012N671R59j806J483M488J837R037R903Q612O346J0865J2848R553R460
9464F09268r4r74p79m510n679J424R664M806M192M939K079J0981J1274J2867K947
$$ plain form
9449 662405 661222 655926 656743 667057 673615 684763 692485 702759 719102 728235 732706 739833 746603 751682
9435 751682 755343 760704 771119 779050 787894 802559 810673 825064 848002 867562 886761 905936 922761
9422 922761 941782 965409 987736 1005922 1022183 1046436 1068732 1093975 1128364 1166448 1205675 1251528
9410 1251528 1300060 1353020 1405250 1471051 1550251 1631643 1715511 1791961 1868731 1957427 2062086
9399 2062086 2192547 2353377 2565594 2844075 3216595 3734969 4408674 5191836 5996483 6726267
9389 6726267 7371313 8011849 8671751 9233443 9569289 9690555 9774093 10036271 10494543 10946897
9379 10946897 11226576 11321943 11285381 11194210 11084482 10934704 10669343 10334777 10147208 10278410
9369 10278410 10750437 11489801 12396345 13472841 14802222 16378828 18067725 19702901 21209918
$$ packed form
9449F62405j183n296Q17J0314O558J1148P722J0274J6343R133M471P127O770N079
9435G51682L661N361J0415P931Q844J4665Q114J4391K2938J9560J9199J9175J6825
9422I22761J9021K3627K2327J8186J6261K4253K2296K5243L4389L8084L9227M5853
9410A251528M8532N2960N2230O5801P9200Q1392Q3868P6450P6770Q8696J04659
9399B062086J30461J60830K12217K78481L72520N18374O73705P83162Q04647P29784
9389F726267O45046O40536O59902N61692L35846J21266Q3538K62178M58272M52354
9379A0946897K79679R5367l6562r1171j09728j49778k65361l34566j87569J31202
9369A0278410M72027P39364R06544J076496J329381J576606J688897J635176J507017
$$ plain form
9360 21209918 22675972 24284045 26014173 27475476 28352478 28693852 28787831 28830665 28835255
9351 28835255 28632623 27980205 27050508 26266970 25700174 25137107 24447742 23558832 22589943
9342 22589943 21767721 21159096 20688529 20413825 20499738 21030613 22043332 23475327 25134425
9333 25134425 26740480 28050347 29024059 29793489 30406326 30760166 30692564 30176661 29492875
9324 29492875 29083815 29156539 29520277 29813226 29793186 29460492 29003084 28557146 28077460 27420504
9314 27420504 26540042 25707415 25274632 25377691 25924705 26688133 27488590 28278297 29011948
9305 29011948 29577321 29930271 30113357 30238857 30420875 30650327 30833989 30960830 31159139
9296 31159139 31417360 31400972 30837676 29893056 28929411 28062451 27188939 26279786 25630286 25663285
$$ packed form
9360B1209918J466054J608073J730128J461303Q77002L41374R3979M2834M590
9351B8835255k02632o52418r29697p83538n66796n63067o89365q88910r68889
9342B2589943q22222o08625m70567k74704Q5913N30875J012719J431995J659098
9333B5134425J606055J309867R73712P69430O12837L53840o7602n15903o83786
9324B9492875m09060P2724L63738K92949k0040l32694m57408m45938m79686o56956
9314B7420504q80462q32627m32783J03059N47014P63428Q00457P89707P33651
9305B9011948N65373L52950J83086J25500J82018K29452J83662J26841J98309
9296C1159139K58221j6388n63296r44620r63645q66960q73512r09153o49500L2999
$$ plain form
9286 25663285 26495463 27849915 29313487 30697875 32141840 33907310 35996394 38045933
9278 38045933 39667312 40848797 41924919 43246803 44915719 46518568 47413357 47421762 46897100
9269 46897100 46076494 44946547 43461712 41498516 38978542 36232653 33740890 31709116
9261 31709116 30191290 29222674 28745315 28727366 29171989 30084239 31544091 33586612 36028659
9252 36028659 38559140 40962902 43063339 44705064 45978162 47004599 47622987 47705137 47222213
9243 47222213 46106995 44706109 43484031 42297684 40863155 39112375 37056859 34843348
9235 34843348 32681243 30511259 28166275 25712758 23456381 21677407 20442234 19621082
9227 19621082 19035874 18565773 18204114 17985051 17883851 17871132 17885270 17814588 17587472 17268976
$$ packed form
9286B5663285Q32178J354452J463572J384388J443965J765470K089084K049539
9278C8045933J621379J181485J076122J321884J668916J602849Q94789Q405n24662
9269D6897100q20606j129947j484835j963196k519974k745889k491763k031774
9261C1709116j517826r68616m77359j7949M44623R12250J459852K042521K442047
9252C6028659K530481K403762K100437J641725J273098J026437O18388Q2150m82924
9243D7222213j115218j400886j222078j186347j434529j750780k055516k213511
9235C4843348k162105k169984k344984k453517k256377j778974j235173q21152
9227A9621082n85208m70101l61659k19063j01200j2719J4138p0682k27116l18496
$$ plain form
9217 17268976 16955749 16674314 16364930 15932324 15370998 14776229 14296152 13948896 13591206
9208 13591206 13151892 12710579 12383627 12146650 11894700 11533073 11018507 10409637 9785988
9199 9785988 9134675 8460132 7784687 7143101 6595840 6159426 5811063 5528281 5286815 5087145
9189 5087145 4917478 4771173 4629136 4485879 4349908 4211398 4079626 3951310 3830452 3726098
9179 3726098 3628520 3538895 3458472 3382965 3303651 3218511 3130419 3054203 2977438 2902439 2829540
9168 2829540 2760653 2699785 2633316 2560122 2491709 2423760 2351679 2286747 2220910 2165371 2117994
9157 2117994 2074943 2036622 2008481 1988210 1968332 1945577 1917143 1886742 1843508 1796062 1754049
9146 1754049 1708984 1659728 1610803 1566899 1532301 1499199 1468472 1437125 1409455 1386362 1368439
$$ packed form
9217A7268976l13227k81435l09384m32606n61326n94769m80077l47256l57690
9208A3591206m39314m41313l26952k36977k51950l61627n14566o08870o23649
9199I785988o51313o74543o75445o41586n47261m36414l48363k82782k41466j99670
9189E087145j69667j46305j42037j43257j35971j38510j31772j28316j20858j04354
9179C726098r7578q9625q0423p5507p9314q5140q8092p6216p6765p4999p2899
9168B829540o8887o0868o6469p3194o8413o7949p2081o4932o5837n5539m7377
9157B117994m3051l8321k8141k0271j9878k2755k8434l0401m3234m7446m2013
9146A754049m5065m9256m8925m3904l4598l3102l0727l1347k7670k3093j7923
$$ plain form
9135 1368439 1351831 1344435 1344160 1350209 1363568 1385231 1408411 1425528 1437074 1444415 1446782 1443502 1421037
9122 1421037 1385560 1344608 1296688 1242594 1187803 1134294 1085583 1042673 1005643 970048 942199
9111 942199 914804 888734 868313 848530 831069 817168 798055 786439 778305 767136 762612 755716
9099 755716 745416 737825 732451 730233 728556 725776 727741 726681 726198 726063 725140 723412 728791 736804 731734
9084 731734 730513 737972 743979 746552 747394 749382 757022 753785 748080 742457 730209 720346 711395 705044
9070 705044 700424 695345 696022 694286 689882 681799 670339 663170 667157 675471 680301 686550 692465 696606
9056 696606 702948 705918 712287 716817 715039 713152 707049 707781 700960 688063 680252 685256 686076 692622 693962
9041 693962 694896 696497 699422 696960 704579 709480 715909 719117 721875 732101 741692 743102 744208 754147
$$ packed form
9135A368439j6608p396k75O049J3359K1663K3180J7117J1546P341K367l280k2465
9122A421037l5477m0952m7920n4094n4791n3509m8711m2910l7030l5595k7849
9111I42199k7395k6070k0421j9783j7461j3901j9113j1616q134j1169m524o896
9099G55716j0300p591n374k218j677k780J965j060m83j35r23j728N379Q013n070
9084G31734j221P459O007K573Q42J988P640l237n705n623j2248r863q951o351
9070G05044m620n079O77j736m404q083j1460p169L987Q314M830O249N915M141
9056F96606O342K970O369M530j778j887o103P32o821j2897p811N004Q20O546J340
9041F93962R34J601K925k462P619M901O429L208K758J0226R591J410J106R939
$$ plain form
9027 754147 770891 782296 784641 788229 793038 792143 799128 809276 814571 822486 829953 846165 866623
9014 866623 886893 908627 931107 950558 972825 991533 1012089 1034738 1063958 1097732 1136263 1175801
9002 1175801 1217407 1258667 1295649 1339672 1391106 1460237 1533764 1616250 1717100 1835335 1984139
8991 1984139 2176952 2414893 2689441 3013842 3385405 3820393 4326738 4921328 5619222 6489107
8981 6489107 7667027 9246176 11136664 12949040 14279899 15100575 15710397 16302014 16687738
8972 16687738 16367369 15096546 13356115 11835288 10776761 9992051 9256118 8609746 8205867
8963 8205867 8142332 8454808 9116509 10046220 11123824 12268942 13571974 15206986 17155819
8954 17155819 19011442 20216710 20609208 20490870 20230729 19902599 19167065 17711237 15810014
$$ packed form
9027G54147J6744J1405K345L588M809q95O985J0148N295P915P467J6212K0458
9014H66623K0270K1734K2480J9451K2267J8708K0556K2649K9220L3774L8531L9538
9002A175801M1606M1260L6982M4023N1434O9131P3527Q2486J00850J18235J48804
8991A984139J92813K37941K74548L24401L71563M34988N06345N94590O97894Q69885
8981F489107J177920J579149J890488J812376J330859Q20676O09822N91617L85724
8972A6687738l20369j270823j740431j520827j058527p84710p35933o46372m03879
8963H205867o3535L12476O61701R29711J077604J145118J303032J635012J948833
8954A7155819J855623J205268L92498j18338k60141l28130p35534j455828j901223
$$ plain form
8945 15810014 13973937 12432206 11195828 10242706 9475633 8757252 8048550 7412317 6891283
8936 6891283 6494615 6207186 5994843 5854133 5796876 5810307 5907055 6079088 6311614 6599383
8926 6599383 6941541 7351586 7862511 8492468 9279748 10300710 11631222 13237451 14922323
8917 14922323 16380578 17492984 18403940 19301974 20128450 20592638 20476970 20000207 19712681
8908 19712681 20035917 20992603 22353201 23859722 25323249 26714845 28186809 29970384
8900 29970384 32060714 34005609 35266018 35972350 36761198 37993905 39366769 40107917 39747372
8891 39747372 38619567 37456035 36621535 35862573 34864751 33910772 33502267 33896315 35256819
8882 35256819 37620161 40696183 43867268 46507069 48383979 49650389 50622943 51366054
$$ packed form
8945A5810014j836077j541731j236378r53122p67073p18381p08702o36233n21034
8936F891283l96668k87429k12343j40710n7257J3431R6748J72033K32526K87769
8926F599383L42158M10045N10925O29957P87280J020962J330512J606229J684872
8917A4922323J458255J112406R10956Q98034Q26476M64188j15668m76763k87526
8908A9712681L23236R56686J360598J506521J463527J391596J471964J783575
8900B9970384K090330J944895J260409P06332P88848J232707J372864P41148l60545
8891C9747372j127805j163532q34500p58962r97822r53979m08505L94048J360504
8882C5256819K363342L076022L171085K639801J876910J266410R72554P43111
$$ plain form
8874 51366054 51577145 50851026 49162680 46947535 44695507 42752169 41192838 39800170
8866 39800170 38317415 36756810 35310200 34099031 33138790 32350767 31642905 30999706 30445831
8857 30445831 30005749 29702607 29609203 29763111 30165767 30775829 31486404 32223117 33035989 33935869
8847 33935869 34893997 36032198 37455409 39240525 41519055 44267808 47266594 50310601
8839 50310601 53184114 55709224 57907822 59816468 61422303 62803353 64205042 65978574
8831 65978574 68418112 71606436 75209692 78629973 81595725 84262539 86575605 88098644
8823 88098644 88418144 87387894 85316680 82663396 79590087 76204133 72898702 70027285
8815 70027285 67438413 64585874 61076596 57227202 53685848 50613851 47693398 44620121
$$ packed form
8874E1366054K11091p26119j688346k215145k252028j943338j559331j392668
8866C9800170j482755j560605j446610j211169r60241p88023p07862o43199n53875
8857C0445831m40082l03142r3404J53908M02656O10062P10575P36713Q12872Q99880
8847C3935869R58128J138201J423211J785116K278530K748753K998786L044007
8839E0310601K873513K525110K198598J908646J605835J381050J401689J773532
8831F5978574K439538L188324L603256L420281K965752K666814K313066J523039
8823H8098644L19500j030250k071214k653284l073309l385954l305431k871417
8815G0027285k588872k852539l509278l849394l541354l071997k920453l073277
$$ plain form
8807 44620121 41501473 38730118 36601521 35156741 34273522 33791378 33590577 33659997 34082459
8798 34082459 34900974 35913291 36763974 37213224 37426253 37806433 38587431 39628803 40610243
8789 40610243 41275669 41585951 41800712 42288353 43289625 44634191 45715470 46002099 45698034
8780 45698034 45422247 45539226 46109958 46930803 47664392 48124729 48199327 47859215 47294960 46730835
8770 46730835 46249724 45811835 45306960 44787522 44566667 44879258 45759151 47297431 49684226
8761 49684226 52951634 56593297 59800095 62277870 64418162 66681487 69095057 71167873
8753 71167873 72179303 71958275 70965396 69545326 67702140 65475194 63046829 60555050
8745 60555050 58137889 55982819 54064345 52289796 50805361 49816866 49460834 49700116 50183941
$$ packed form
8807D4620121l118648k771355k128597j444780q83219m82144k00801O9420M22462
8798C4082459Q18515J012317Q50683M49250K13029L80180P80998J041372R81440
8789D0610243O65426L10282K14761M87641J001272J344566J081279K86629l04065
8780D5698034k75787J16979N70732Q20845P33589M60337P4598l40112n64255n64125
8770D6730835m81111m37889n04875n19438k20855L12591Q79893J538280K386795
8761D9684226L267408L641663L206798K477775K140292K263325K413570K072816
8753G1167873J011430k21028r92879j420070j843186k226946k428365k491779
8745F0555050k417161k155070j918474j774549j484435r88495l56032K39282M83825
$$ plain form
8736 50183941 50442271 50285692 49902489 49535406 49127420 48325567 46857139 44798944 42522522
8727 42522522 40260006 38034527 35948294 34122394 32600933 31352974 30248184 29200575
8719 29200575 28170772 27062720 25822409 24491979 23087207 21637222 20163288 18590478
8711 18590478 16876687 15211458 13784973 12638933 11729962 11000664 10391328 9865746 9396324
8702 9396324 8953965 8539896 8138956 7755988 7398459 7070692 6776261 6512349 6272979 6048729
8692 6048729 5833135 5625871 5432419 5243557 5051517 4864985 4683381 4512247 4345488 4184304
8682 4184304 4031437 3883219 3750037 3631748 3519694 3421564 3324330 3235858 3145187 3061985
8672 3061985 2984843 2904778 2819333 2738346 2654953 2572869 2495697 2425997 2355824 2293686 2232609
$$ packed form
8736E0183941K58330j56579l83203l67083m07986q01853j468428k058195k276422
8727D2522522k262516k225479k086233j825900j521461j247959j104790j047609
8719B9200575j029803j108052j240311j330430j404772j449985j473934j572810
8711A8590478j713791j665229j426485j146040r08971p29298o09336n25582m69422
8702I396324m42359m14069m00940l82968l57529l27767k94431k63912k39370k24250
8692F048729k15594k07264j93452j88862j92040j86532j81604j71134j66759j61184
8682D184304j52867j48218j33182j18289j12054r8130r7234q8472r0671q3202
8672C061985p7142q0065q5445q0987q3393q2084p7172o9700p0173o2138o1077
$$ plain form
8661 2232609 2182018 2141022 2096508 2053718 2020009 1992068 1970886 1955341 1952903 1954904 1958986 1972081
8649 1972081 1989916 1999797 2009422 2010327 1994812 1973822 1945167 1906463 1852948 1796842 1743216 1693368
8637 1693368 1648322 1591017 1539806 1505592 1478666 1456634 1434183 1419832 1417997 1420573 1420683 1424806
8625 1424806 1435065 1456355 1474926 1488934 1514058 1536747 1558408 1589000 1621441 1655643 1689770
8614 1689770 1718382 1741577 1766966 1788152 1801234 1807899 1811671 1812660 1808035 1804829 1798938 1789216 1782690
8601 1782690 1776076 1764030 1756731 1754691 1753560 1746831 1738712 1731085 1714189 1705874 1696123 1681110 1664125
8588 1664125 1666835 1683020 1706956 1731887 1763018 1802619 1854180 1921542 2000026 2080632 2157712 2237819
8576 2237819 2317453 2411814 2510785 2615202 2729318 2863788 3017572 3194148 3397613 3630479
$$ packed form
8661B232609n0591m0996m4514m2790l3709k7941k1182j5545k438K001M082J3095
8649A972081J7835R881R625R05j5515k0990k8655l8704n3515n6106n3626m9848
8637A693368m5046n7305n1211l4214k6926k2032k2451j4351j835K576J10M123
8625A424806J0259K1290J8571J4008K5124K2689K1661L0592L2441L4202L4127
8614A689770K8612K3195K5389K1186J3082O665L772R89m625l206n891r722o526
8601A782690o614j2046p299k040j131o729q119p627j6896q315r751j5013j6985
8588A664125K710J6185K3936K4931L1131L9601N1561O7362P8484Q0606P7080Q0107
8576B237819P9634R4361R8971J04417J14116J34470J53784J76576K03465K32866
$$ plain form
8566 3630479 3900730 4210166 4570252 5012216 5558697 6213975 7011265 7974610 9134819
8557 9134819 10523048 12184637 14172308 16523242 19247175 22326545 25708405 29274550
8549 29274550 32839681 36176308 39062214 41335508 42844420 43436444 43102263 41941501
8541 41941501 40087752 37734722 35085263 32364841 29805846 27539409 25611116 24047294
8533 24047294 22849724 22001354 21464986 21177858 21132786 21346581 21810922 22505960 23443035
8524 23443035 24640072 26065145 27701132 29479492 31268217 32970579 34492462 35696881
8516 35696881 36495433 36832560 36655170 35989340 34912066 33493694 31804503 29962735 28063394
8507 28063394 26171550 24342581 22631190 21043474 19568705 18227413 17026133 15946621
$$ packed form
8566C630479K70251L09436L60086M41964N46481O55278P97290R63345J160209
8557I134819J388229J661589J987671K350934K723933L079370L381860L566145
8549B9274550L565131L336627K885906K273294J508912N92024l34181j160762
8541D1941501j853749k353030k649459k720422k558995k266437j928293j563822
8533B4047294j197570q48370n36368k87128m5072K13795M64341O95038R37075
8524B3443035J197037J425073J635987J778360J788725J702362J521883J204419
8516C5696881P98552L37127j77390o65830j077274j418372j689191j841768j899341
8507B8063394j891844j828969j711391j587716j474769j341292j201280j079512
$$ plain form
8499 15946621 14990347 14171893 13473500 12891230 12400653 11986270 11644890 11370207 11155137
8490 11155137 10987617 10881957 10836735 10853303 10937302 11089910 11318925 11640764 12080671 12645700
8480 12645700 13349231 14232772 15317481 16631950 18200476 20034955 22130657 24479480
8472 24479480 26989867 29563908 32154255 34643595 36935689 38993013 40735293 42087233
8464 42087233 43170692 44049240 44629983 44957989 45166556 45260530 45182911 44976673 44662200 44220462
8454 44220462 43721638 43266714 42891604 42639095 42618021 42871212 43357610 43992157 44712868 45414601
8444 45414601 45998910 46445944 46700130 46712977 46533328 46225686 45783394 45203828 44517966 43746066
8434 43746066 42827645 41708838 40365149 38772092 36907433 34819052 32593049 30296296
$$ packed form
8499A5946621r56274q18454o98393n82270m90577m14383l41380k74683k15070
8490A1155137j67520j05660m5222J6568Q3999J52608K29015L21839M39907N65029
8480A2645700P03531Q83541J084709J314469J568526J834479K095702K348823
8472B4479480K510387K574041K590347K489340K292094K057324J742280J351940
8464D2087233J083459Q78548N80743L28006K08567R3974p7619k06238l14473m41738
8454D4220462m98824m54924l75110k52509k1074K53191M86398O34547P20711P01733
8444D5414601N84309M47034K54186J2847j79649l07642m42292n79566o85862p71900
8434D3746066r18421j118807j343689j593057j864659k088381k226003k296753
$$ plain form
8426 30296296 27961980 25658784 23494355 21518135 19709727 18062171 16602569 15325102
8418 15325102 14218429 13260005 12429031 11715741 11112296 10605603 10190072 9834883 9544454
8409 9544454 9320630 9169658 9096551 9075680 9074366 9086136 9126382 9188102 9243195 9266048 9228776
8398 9228776 9136610 9023153 8920401 8849730 8829910 8895275 9079833 9397820 9872793 10509015
8388 10509015 11296286 12211914 13236600 14341585 15467895 16562416 17569310 18433595 19106292
8379 19106292 19539660 19718676 19664282 19387168 18943349 18432151 17924734 17464045 17140017 17003645
8369 17003645 17034781 17201691 17476203 17816624 18189870 18559056 18866197 19082266 19176913 19124173
8359 19124173 18931350 18584420 18090026 17473243 16718466 15837278 14899369 13927119 12951758
$$ packed form
8426C0296296k334316k303196k164429j976220j808408j647556j459602j277467
8418A5325102j106673r58424q30974p13290o03445n06693m15531l55189k90429
8409I544454k23824j50972p3107k0871j314J1770M0246O1720N5093K2853l7272
8398I228776r2166j13457j02752p0671j9820O5365J84558L17987M74973O36222
8388A0509015P87271R15628J024686J104985J126310J094521J006894Q64285O72697
8379A9106292M33368J79016n4394k77114m43819n11198n07417m60689l24028j36372
8369A7003645L1136J66910K74512L40421L73246L69186L07141K16069R4647n2740
8359A9124173j92823l46930m94394o16783p54777q81188r37909r72250r75361
$$ plain form
8350 12951758 12024814 11169062 10387657 9674166 9005656 8391558 7829691 7308930 6819899
8341 6819899 6346371 5914095 5526814 5168918 4846332 4550875 4280083 4023405 3784240 3568527
8331 3568527 3386027 3219788 3067942 2928133 2805838 2695537 2591075 2494134 2402022 2316535
8321 2316535 2235417 2163422 2095800 2037104 1983795 1927464 1871361 1819162 1768464 1725026 1679982
8310 1679982 1635311 1598266 1565387 1545998 1540656 1530150 1510264 1488308 1458902 1432532 1410332 1373630
8298 1373630 1319463 1260567 1212847 1176725 1143960 1130443 1130543 1151637 1204150 1296883 1380572 1406362
8286 1406362 1395905 1368887 1365120 1380164 1329938 1178324 1044343 950311 889870 855099 831748
8275 831748 808958 801751 802804 804676 817848 826649 828604 834101 844186 849546 850066 847653 840597 834189
$$ packed form
8350A2951758r26944q55752p81405p13491o68510o14098n61867n20761m89031
8341F819899m73528m32276l87281l57896l22586k95457k70792k56678k39165k15713
8331C568527j82500j66239j51846j39809j22295j10301j04462r6941r2112q5487
8321B316535q1118p1995o7622n8696n3309n6331n6103n2199n0698m3438m5044
8310A679982m4671l7045l2879j9389n342j0506j9886k1956k9406k6370k2200l6702
8298A373630n4167n8896m7720l6122l2765j3517J00K1094N2513R2733Q3689K5790
8286A406362j0457k7018l767J5044n0226j51614j33981r4032o0441l4771k3351
8275H31748k2790p207J053J872J3172Q801J955N497J0085N360N20k413p056o408
$$ plain form
8261 834189 822225 804473 788616 772269 750708 729436 713122 697947 686324 675223 670570 664372
8249 664372 658184 652958 647240 639363 628795 622681 615342 609015 610422 613641 618949 633101 640764 655670
8235 655670 672833 687757 698989 710013 719165 723355 719749 705356 692863 670263 643478 617701
8223 617701 593287 564400 540503 531244 518424 502469 493847 497463 505616 512635 525931 536089 536370
8210 536370 534516 530745 517484 499547 472984 445423 418525 395881 379810 372237 365228 365940 369812
8197 369812 376664 390671 412984 433441 455621 471424 480140 485988 493212 495038 492852 488248 481639
8184 481639 477290 477019 471167 473124 479705 494149 502256 510241 520416 529764 521349 504742 488917 461425
8170 461425 443066 424272 404273 397727 405897 418967 436142 462423 499385 542634 590554 646578
$$ packed form
8261H34189j1964j7752j5857j6347k1561k1272j6314j5175j1623j1101m653o198
8249F64372o188n226n718p877j0568o114p339o327J407L219N308J4152P663J4906
8235F55670J7163J4924J1232J1024R152M190l606j4393j2493k2600k6785k5777
8223F17701k4414k8887k3897r259j2820j5955q622L616Q153P019J3296J0158K81
8210E36370j854l771j3261j7937k6563k7561k6898k2644j6071p573p009P12L872
8197C69812O852J4007K2313K0457K2180J5803Q716N848P224J826k186m604o609
8184D81639m349k71n852J957O581J4444Q107P985J0175R348q415j6607j5825k7492
8170D61425j8359j8794j9999o546Q170J3070J7175K6281L6962M3249M7920N6024
$$ plain form
8158 646578 704825 762086 809582 856176 906476 947368 974556 991689 999927 1000148 986091 968670
8146 968670 949315 932834 920693 901808 881092 873704 883430 908965 944835 975430 1005669 1026823
8134 1026823 1040757 1047360 1051307 1053654 1058417 1068160 1075644 1085008 1097049 1117471 1148090 1175798 1199705
8121 1199705 1226827 1247977 1274913 1306979 1341324 1381023 1424219 1463294 1496803 1519546 1541619
8110 1541619 1553092 1570975 1587001 1601159 1625364 1651930 1688904 1736891 1772509 1792125 1804487
8099 1804487 1814226 1814448 1817247 1826444 1842079 1858255 1884381 1925636 1978679 2037627 2101649 2165568
8087 2165568 2221424 2272233 2313286 2348178 2394809 2450752 2511436 2587426 2671683 2754534 2842734
8076 2842734 2928848 2998991 3056234 3111917 3157557 3198235 3237884 3275272 3322258 3383727 3459509
$$ packed form
8158F46578N8247N7261M7496M6594N0300M0892K7188J7133Q238K21j4057j7421
8146I68670j9355j6481j2141j8885k0716p388R726K5535L5870L0595L0239K1154
8134A026823J3934O603L947K347M763R743P484R364J2041K0422L0619K7708K3907
8121A199705K7122K1150K6936L2066L4345L9699M3196L9075L3509K2743K2073
8110A541619J1473J7883J6026J4158K4205K6566L6974M7987L5618J9616J2362
8099A804487R739K22K799R197J5635J6176K6126M1255N3043N8948O4022O3919
8087B165568N5856N0809M1053L4892M6631N5943O0684P5990Q4257Q2851Q8200
8076B842734Q6114P0143N7243N5683M5640M0678L9649L7388M6986O1469P5782
$$ plain form
8065 3459509 3544344 3637727 3736217 3848252 3974620 4112819 4256389 4399688 4535633 4660855
8055 4660855 4785623 4909467 5041439 5174431 5315793 5478013 5659953 5879405 6142799 6436711
8045 6436711 6758944 7104912 7482360 7873085 8287224 8723650 9204118 9744261 10359151 11075890
8035 11075890 11921814 12935340 14143921 15581754 17300970 19338208 21718874 24485026
8027 24485026 27673221 31328435 35537033 40480807 46469146 54062323 64131607 77729791
8019 77729791 96045238 120220961 150550362 186279949 226429930 268564117 309039545
8012 309039545 345648711 375717363 395562584 404798874 403010685 388317472 363376256
8005 363376256 331660800 293646716 253149663 214353869 178657874 148413420 125170395
$$ packed form
8065C459509Q4835R3383R8490J12035J26368J38199J43570J43299J35945J25222
8055D660855J24768J23844J31972J32992J41362J62220J81940K19452K63394K93912
8045F436711L22233L45968L77448L90725M14139M36426M80468N40143O14890P16739
8035A1075890Q45924J013526J208581J437833J719216K037238K380666K766152
8027B4485026L188195L655214M208598M943774N988339P593177J0069284J3598184
8019G7729791J8315447K4175723L0329401L5729587M0149981M2134187M0475428
8012C09039545L6609166L0068652J9845221R236290j788189j4693213k4941216
8005C63376256l1715456l8014084m0497053l8795794l5695995l0244454k3243025
$$ plain form
7998 125170395 108101648 96159140 88252824 83159073 79890666 77816911 76626276 76154116
7990 76154116 76349762 77370082 79477807 83074312 89063663 98983044 115123903 140303191
7982 140303191 176114842 221977849 275274602 329330286 377436214 416654348 443036804
7975 443036804 455058037 454642604 439615438 407371486 364201757 312748454 257717643
7968 257717643 209260151 170224724 140897442 120642642 106891356 97130337 89751373
7961 89751373 83774261 78599130 73874587 69406191 65071408 60913693 56993731 53349818
7953 53349818 50077566 47191625 44666908 42491044 40626893 39012950 37573282 36247157
7945 36247157 34979594 33723269 32472461 31212273 29955420 28727256 27557536 26439756
$$ packed form
7998A25170395j7068747j1942508p906316n093751l268407k073755j190635m72160
7990G6154116J95646J020320K107725L596505N989351R919381J6140859K5179288
7982A40303191L5811651M5863007N3296753N4055684M8105928L9218134K6382456
7975D43036804J2021233m15433j5027166l2243952m3169729n1453303n5030811
7968B57717643m8457492l9035427k9327282k0254800j3751286r761019p378964
7961H9751373n977112n175131m724543m468396m334783m157715l919962l643913
7953E3349818l272252k885941k524717k175864j864151j613943j439668j326125
7945C6247157j267563j256325j250808j260188j256853j228164j169720j117780
$$ plain form
7937 26439756 25372991 24349114 23356529 22409275 21508125 20662262 19870801 19115512 18385646
7928 18385646 17678437 17006676 16375588 15781338 15216952 14669385 14139793 13628201 13132009
7919 13132009 12649007 12187981 11737576 11305285 10891086 10488617 10095515 9722246 9368399
7910 9368399 9036266 8724772 8430415 8153312 7899917 7662933 7438610 7227743 7029632 6838574
7900 6838574 6657366 6492575 6341456 6207154 6074711 5939122 5799446 5658400 5512194 5370046
7890 5370046 5229882 5081327 4930140 4775406 4616949 4457194 4298335 4136904 3960117 3785278
7880 3785278 3610774 3431877 3259711 3096046 2945562 2813418 2695312 2585558 2489993 2414135
7870 2414135 2349351 2287596 2237352 2199913 2169762 2142289 2115877 2098622 2089895 2084686 2084075 2085025 2087179
$$ packed form
7937B6439756j066765j023877r92585r47254r01150q45863p91461p55289p29866
7928A8385646p07209o71761o31088n94250n64386n47567n29592n11592m96192
7919A3132009m83002m61026m50405m32291m14199m02469l93102l73269l53847
7910I368399l32133l11494k94357k77103k53395k36984k24323k10867j98111j91058
7900F838574j81208j64791j51119j34302j32443j35589j39676j41046j46206j42148
7890E370046j40164j48555j51187j54734j58457j59755j58859j61431j76787j74839
7880C785278j74504j78897j72166j63665j50484j32144j18106j09754r5565p5858
7870B414135o4784o1755n0244l7439l0151k7473k6412j7255q727n209o11R50K154
$$ plain form
7857 2087179 2089498 2098641 2108552 2131097 2157411 2173910 2188442 2193075 2188124 2171427 2148674 2114714
7845 2114714 2066160 2007702 1937481 1842484 1753446 1678520 1612014 1553638 1511615 1480361 1455289
7834 1455289 1432950 1425454 1436675 1446361 1449429 1461011 1472638 1489493 1506630 1521615 1540172 1551384
7822 1551384 1565107 1576126 1576147 1568241 1560845 1540999 1508358 1471039 1441032 1409988 1378460 1347990
7810 1347990 1312455 1285271 1267502 1254954 1249991 1246118 1235395 1220510 1206593 1193067 1174473 1152907
7798 1152907 1131975 1110282 1094513 1080081 1067765 1065315 1070495 1085033 1105193 1119994 1139010 1159346
7786 1159346 1174600 1173748 1157730 1146627 1120311 1081932 1031319 978199 927597 880265 842294 810168
7774 810168 794911 789537 789754 803262 819660 829370 843918 854318 862039 866187 866042 859476 852321 843605
$$ packed form
7857B087179K319R143R911K2545K6314J6499J4532M633m951j6697k2753l3960
7845B114714m8554n8458p0221r4997q9038p4926o6506n8376m2023l1254k5072
7834A455289k2339p496J1221R686L068J1582J1627J6855J7137J4985J8557J1212
7822A551384J3723J1019K1p906p396j9846l2641l7319l0007l1044l1528l0470
7810A347990l5535k7184j7769j2548m963l873j0723j4885j3917j3526j8594k1566
7798A152907k0932k1693j5769j4432j2316k450N180J4538K0160J4801J9016K0336
7786A159346J5254q52j6018j1103k6316l8379n0613n3120n0602m7332l7971l2126
7774H10168j5257n374K17J3508J6398R710J4548J0400P721M148j45o566p155q716
$$ plain form
7760 843605 831730 818688 811103 792735 767412 741151 717802 699254 682573 666345 643914 629179
7748 629179 624545 610123 589630 572518 555972 539293 517837 489902 468069 445619 429531 412204
7736 412204 401357 402806 408569 410986 414258 415499 413215 408291 405159 402066 393221 384674 376369 370225
7722 370225 362040 350852 339949 334557 328229 320223 321629 317866 311819 311383 314950 317896 325632 326324
7708 326324 327324 318308 310608 303704 294715 280997 269340 266239 261230 252424 246026 248851 245684 249108
7694 249108 246998 249830 257842 259075 248289 237161 240741 233928 219047 219925 222591 221259 221581 227493
7680 227493 237389 242505 243106 246070 252246 257735 255749 255991 255137 249925 242957 238175 234358 232520 234765
7665 234765 235231 232533 227523 220270 220965 224794 220733 211110 209616 217512 212682 211111 206729 200143 200403
$$ packed form
7760H43605j1875j3042p585j8368k5323k6261k3349j8548j6681j6228k2431j4735
7748F29179m634j4422k0493j7112j6546j6679k1456k7935k1833k2450j6088j7327
7736D12204j0847J449N763K417L272J241k284m924l132l093q845q547q305o144
7722C70225q185j1188j0903n392o328q006J406l763o047m36L567K946P736O92
7708C26324J000r016p700o904q989j3718j1657l101n009q806o398K825l167L424
7694B49108k110K832Q012J233j0786j1128L580o813j4881Q78K666j332L22N912
7680B27493R896N116O01K964O176N489j986K42q54n212o968m782l817j838K245
7665B34765M66k698n010p253O95L829m061r623j494P896m830j571m382o586K60
$$ plain form
7650 200403 209917 215309 215202 210555 209048 215047 219786 221732 230006 235517 246700 257768 260871 267690
7636 267690 281895 294463 304548 307217 315383 330604 340822 356059 378306 408023 437127 473798
7624 473798 530917 619214 737181 895042 1087576 1312293 1558786 1805931 2032491 2222683
7614 2222683 2358469 2432437 2437385 2361632 2220177 2021386 1793446 1559449 1334166 1128794
7604 1128794 956549 827559 741266 674036 630413 605109 583930 576739 570075 561136 560713 564009
7592 564009 568985 576533 597258 636158 706890 820100 988216 1216380 1495790 1821476 2143927
7581 2143927 2421556 2631930 2749993 2772801 2700878 2521723 2271569 1973111 1643173 1340674
7571 1340674 1100135 923787 793199 702959 643435 597667 556516 521044 493306 470720 452929
$$ packed form
7650B00403R514N392j07m647j507N999M739J946Q274N511J1183J1068L103O819
7636B67690J4205J2568J0085K669Q166J5221J0218J5237K2247K9717K9104L6671
7624D73798N7119Q8297J17967J57861J92534K24717K46493K47145K26560J90192
7614B222683J35786P3968M948p5753j41455j98791k27940k33997k25283k05372
7604A128794j72245j28990q6293o7230m3623k5304k1179p191o664q939m23L296
7592E64009M976P548K0725L8900P0732J13210J68116K28164K79410L25686L22451
7581B143927K77629K10374J18063K2808p1923j79155k50154k98458l29938l02499
7571A340674k40539j76348j30588r0240n9524m5768m1151l5472k7738k2586j7791
$$ plain form
7560 452929 438367 415748 399036 384529 371466 358117 345618 333555 322725 314723 305569 302676
7548 302676 292203 289219 287218 289100 285779 288625 289888 292605 290401 285322 281458 273953 268820 259408
7534 259408 252653 241427 232463 225568 217423 208189 208003 205668 199386 190290 185905 181397 181563 175972 164872
7519 164872 154248 150289 151618 143611 135479 132475 129722 122218 122622 125444 119217 114769 119717 117452
7505 117452 122158 131756 130405 126373 128846 134156 136440 136469 131512 127779 118718 110439 106799 109524 114371
7490 114371 119198 123932 121677 119797 124736 127329 128560 128292 122293 117195 114479 108486 106030 108921 107563
7475 107563 96445 98875 97433 94027 96024 96409 94434 89793 90503 92871 90277 82157 84216 84253 82772
7460 82772 80544 79818 86389 87026 84898 82377 74524 76107 79140 80730 82872 87868 90937 93781 96041
$$ packed form
7560D52929j4562k2619j6712j4507j3063j3349j2499j2063j0830q002r154k893
7548C02676j0473k984k001J882l321K846J263K717k204n079l864p505n133r412
7534B59408o755j1226q964o895q145r234j86k335o282r096m385m508J66n591j1100
7519A64872j0624l959J329q007q132l004k753p504M04K822o227m448M948k265
7505A17452M706R598j351m032K473N310K284K9m957l733r061q279l640K725M847
7490A14371M827M734k255j880M939K593J231k68n999n098k716n993k456K891j358
7475A07563j1118K430j442l406J997L85j975m641P10K368k594q120K059L7j481
7460H2772k228p26O571O37k128k521p853J583L033J590K142M996L069K844K260
$$ plain form
7445 96041 101574 104745 106297 100975 96535 100190 98293 94911 91145 92917 81494 75911 76783 76025 75575
7430 75575 72129 75481 76243 77485 76545 80679 78091 78831 81971 76697 79400 84293 80659 78297 81042
7415 81042 80390 79873 75648 74214 82161 84810 87570 83694 75128 72921 68636 67429 67378 65271 69475 69654
7399 69654 71222 65849 72429 75286 77347 73472 74606 77346 73284 67668 64435 59224 63461 68148 66612
7384 66612 64165 61815 54675 45385 49195 50756 49820 52543 50001 45863 52398 50933 46979 49335 50325
7369 50325 48075 46364 45653 41277 40049 41999 52829 51052 47691 47525 47320 45838 42576 42727 49976
7354 49976 53486 54702 53747 46906 43341 35553 33851 35505 35547 33395 33895 40570 43077 33879 32659 39416
7338 39416 36099 32780 33349 36126 43260 40521 34957 35586 36744 36495 36155 33920 32114 26850 31711 36251
$$ packed form
7445I6041N533L171J552n322m440L655j897l382l766J772j1423n583Q72p58m50
7430G5575l446L352P62J242r40M134k588P40L140n274K703M893l634k362K745
7415H1042o52n17m225j434P947K649K760l876q566k207m285j207n1k107M204J79
7399F9654J568n373O580K857K061l875J134K740m062n616l233n211M237M687j536
7384F6612k447k350p140r290L810J561r36K723k542m138O535j465l954K356R90
7369E0325k250j711p11m376j228J950J0830j777l361j66k05j482l262J51P249
7354D9976L510J216r55o841l565p788j702J654M2k152N00O675K507r198j220O757
7338C9416l317l319N69K777P134k739n564O29J158k49l40k235j806n264M861M540
$$ plain form
7322 36251 36736 33131 31347 33289 31194 27881 31454 34116 28850 25426 29268 33089 37091 38042 33990
7307 33990 27123 27376 31267 35760 34944 32419 36605 37844 40244 43035 37723 33149 37571 37107 39530
7292 39530 43191 49563 53320 52248 46577 47583 57378 62049 64621 54589 42708 42668 43653 46662 48985
7277 48985 45325 42548 47037 52963 50910 47941 45090 40817 33868 36474 39537 39443 45028 45317 39679
7262 39679 41360 38137 43821 50185 51673 45043 41614 44288 51372 52297 55399 56245 54541 51963 49785
7247 49785 43240 34167 36070 35783 40081 36980 35480 37001 40376 45894 45906 53308 49049 45127 54549
7232 54549 60284 60613 54130 43192 35178 34208 36811 39225 36734 31391 27636 32126 28754 22774 25818
7217 25818 32037 40997 49557 51921 51933 51365 49853 45310 45110 36494 38629 39409 35276 34188 34448 34797
$$ packed form
7322C6251M85l605j784J942k095l313L573K662n266l424L842L821M002R51m052
7307C3990o867K53L891M493q16k525M186J239K400K791n312m574M422m64K423
7292C9530L661O372L757j072n671J006R795M671K572j0032j1881m0R85L009K323
7277D8985l660k777M489N926k053k969k851m273o949K606L063r4N585K89n638
7262C9679J681l223N684O364J488o630l429K674P084R25L102Q46j704k578k178
7247D9785o545r073J903k87M298l101j500J521L375N518J2P402m259l922R422
7232E4549N735L29o483j0938q014r70K603K414k491n343l755M490l372n980L044
7217B5818O219Q960Q560K364J2n68j512m543k00q616K135P80m133j088K60L49
$$ plain form
7201 34797 40781 40874 31716 27388 26692 26016 28413 31274 30151 31036 31157 27999 24067 24880 25279 26823 23222
7184 23222 20040 15856 11823 10531 16699 24308 25652 27441 27573 29144 30392 30746 32961 35134 38077
7169 38077 31711 28957 30364 26379 35106 43896 49808 53959 51417 45715 43591 49350 51325 53623 51215
7154 51215 38547 34290 25072 18736 18359 23540 30238 34083 31638 25501 20975 17474 26821 30731 26338
7139 26338 27890 27978 23238 26287 36651 45524 48026 48834 46524 42444 34360 28739 27918 25790 19622
7124 19622 15565 19940 26072 27151 27339 28324 31963 30152 18515 17911 15473 24748 30963 32798 40217
7109 40217 48860 52104 50002 46363 41070 31605 24847 25549 22047 21482 23136 20943 13033 14456 22937
7094 22937 27718 30264 28887 27578 29715 31695 31183 26973 23349 21031 15762 15614 18208 24395 32726
$$ packed form
7201C4797N984R3r158m328o96o76K397K861j123Q85J21l158l932Q13L99J544l601
7184B3222l182m184m033j292O168P609J344J789J32J571J248L54K215K173K943
7169C8077o366k754J407l985Q727Q790N912M151k542n702k124N759J975K298k408
7154E1215j2668m257r218o336l77N181O698L845k445o137m526l501R347L910m393
7139B6338J552Q8m740L049J0364Q873K502Q08k310m080q084n621q21k128o168
7124A9622m057M375O132J079J88R85L639j811j1637o04k438R275O215J835P419
7109D0217Q643L244k102l639n293r465o758P02l502n65J654k193p910J423Q481
7094B2937M781K546j377j309K137J980n12m210l624k318n269j48K594O187Q331
$$ plain form
7079 32726 30235 23751 16489 12215 18546 21642 24248 19204 17310 25394 30792 30391 22051 21141 23184
7064 23184 18505 18409 22397 23984 19742 16069 16102 23172 27314 28137 25972 26923 24338 18424 10930 7708
7048 7708 5843 2113 5244 10618 9397 17307 27494 40017 43849 45269 44128 42062 37053 37200 27627
7033 27627 20034 23758 31233 36453 34706 30816 28818 26630 18731 17469 12757 8141 4038 -764 -2156
7018 -2156 2292 10639 17810 14730 14152 16251 17260 17189 15169 10184 9116 6985 6675 2121 5682 8814
7002 8814 10588 8210 8362 15185 25088 30810 34243 29721 25840 23331 13862 5963 7739 18925 24977
6987 24977 27875 27156 23726 23603 20922 16214 14560 14891 14924 14123 13255 16522 19050 12428 5555 5836 10560
6970 10560 8649 5213 4610 8657 9992 8325 13602 14059 19973 19425 16090 9000 10955 16130 22533
$$ packed form
7079C2726k491o484p262m274O331L096K606n044j894Q084N398m01q340r10K043
7064B3184m679r6L988J587m242l673L3P070M142Q23k165R51k585n914p494l222
7048G708j865l730L131N374j221P910J0187J2523L832J420j141k066n009J47r573
7033B7627p593L724P475N220j747l890j998k188p899j262m712m616m103m802j392
7018b156M448Q347P171l080n78K099J009p1k020m985j068k131l10m554L561L132
7002H814J774k378J52O823R903N722L433m522l881k509r469p899J776J1186O052
6987B4977K898p19l430j23k681m708j654L31L3q01q68L267K528o622o873K81M724
6970A0560j911l436o03M047J335j667N277M57N914n48l335p090J955N175O403
$$ plain form
6955 22533 23870 23143 13014 9958 15655 17753 19025 14389 10781 16135 10787 5327 4674 4983 -821
6940 -821 -5356 2130 8939 15116 17857 22831 23368 18121 16908 25273 28150 22386 18636 14646 14328 13168
6924 13168 11715 9660 8902 6662 3145 4656 9354 9410 11887 14575 12677 12494 6991 6470 8532 11636
6908 11636 6958 4992 7414 17891 24099 20322 18916 17601 15867 15567 15227 17264 15951 12886 12461
6893 12461 10603 9548 13733 9765 2695 -3249 2211 5548 4125 702 -2144 2548 2282 1453 2639
6878 2639 -1322 -1521 -24 -40 511 2715 4375 7492 16347 24903 28979 24881 17448 17367 21165 16998
6862 16998 12212 8902 3052 2167 4201 5818 7875 8681 4655 1011 4015 6091 8039 8316 9066 15478
6846 15478 13904 9854 9214 8251 1775 1673 4193 7215 10517 11143 11662 15129 16898 10931 5710 2926
$$ packed form
6955B2533J337p27j0129l056N697K098J272m636l608N354n348n460o53L09n804
6940h21m535P486O809O177K741M974N37n247j213Q365K877n764l750l990l18j160
6924A3168j453k055p58k240l517J511M698N6K477K688j898j83n503n21K062L104
6908A1636m678j966K422J0477O208l777j406j315j734l00l40K037j313l065m25
6893A2461j858j055M185l968p070n944N460L337j423l423k846M692k66q29J186
6878B639l961j99J497j6N51K204J660L117Q855Q556M076m098p433q1L798m167
6862A6998m786l310n850q85K034J617K057Q06m026l644L004K076J948K77P50O412
6846A5478j574m050o40r63o476j02K520L022L302O26N19L467J769n967n221k784
$$ plain form
6830 2926 3104 10460 9873 13107 12101 4642 3499 9299 7142 3888 1318 2200 3949 10469 11378 11130
6814 11130 12141 14400 15711 16120 14884 13098 10106 8780 8606 13861 18425 17865 16615 22515 20863
6799 20863 17722 16654 14583 9442 18543 17375 13467 9319 7328 7447 14450 9439 2302 -2369 -4856
6784 -4856 514 2972 7074 12766 9594 9067 9608 10849 9529 1483 -2514 -6202 -8042 -5501 -2961
6769 -2961 -234 1730 6331 12926 14994 8931 187 -2148 945 737 8040 6365 4642 13747 17970
6754 17970 14265 12229 16316 14728 13446 16540 15359 14667 9832 9388 11936 14720 14082 10395 5726
6739 5726 9461 9061 10590 2937 4370 14090 16897 19638 18875 17660 9662 383 1532 575 2096 2915
6723 2915 4677 4156 -3739 978 6739 5531 6630 10034 9431 9694 9235 9809 12954 16018 20311 21305
$$ packed form
6830B926J78P356n87L234j006p459j143N800k157l254k570Q82J749O520R09k48
6814A1130J011K259J311M09j236j786k992j326j74N255M564n60j250N900j652
6799B0863l141j068k071n141R101j168l908m148j991J19P003n011p137m671k487
6784d856N370K458M102N692l172n27N41J241j320q046l997l688j840K541K540
6769b961K727J964M601O595K068o063q744k335L093k08P303j675j723R105M223
6754A7970l705k036M087j588j282L094j181o92m835m44K548K784o38l687m669
6739E726L735m00J529p653J433R720K807K741p63j215p998r279J149r57J521Q19
6723B915J762n21p895M717N761j208J099L404o03K63m59N74L145L064M293R94
$$ plain form
6707 21305 21384 18930 16299 17590 16379 15996 12692 13902 15084 13238 5273 -1015 -6531 -6433 -6028 -5367
6691 -5367 894 1464 1425 4355 9166 18239 19922 18904 13871 4956 3355 -1414 -5692 -8483 -5251 7608
6675 7608 7733 4253 8502 6596 4087 -916 -3440 -2846 -3487 -2430 3341 18062 22258 19745 21037
6660 21037 27967 27392 23051 19686 17160 16984 13297 5732 8657 18095 24000 23003 17616 12641 10027
6645 10027 11333 12879 9808 8423 7289 13692 20212 28506 30797 36409 31611 15972 2852 5662
6631 5662 9074 7662 12827 16315 25500 19509 11331 7628 7974 6810 1392 -5474 577 2962 366
6616 366 2214 4115 4326 2061 2091 7746 5802 -4349 -5411 3260 5151 10806 14844 20151 19054 11207
6600 11207 4104 3666 11627 12523 8468 4150 4376 9795 10268 8442 7382 9488 6929 5260 3342 4421
$$ packed form
6707B1305P9k454k631J291j211l83l304J210J182j846p965o288n516R8M05O61
6691e367O261N70l9K930M811R073J683j018n033q915j601m769m278k791L232J2859
6675G608J25l480M249j906k509n003k524N94o41J057N771J4721M196k513J292
6660B1037O930n75m341l365k526j76l687p565K925R438N905r97n387m975k614
6645A0027J306J546l071j385j134O403O520Q294K291N612m798j5639j3120K810
6631E662L412j412N165L488R185n991q178l703L46j164n418o866O051K385k596
6616C66J848J901K11k265L0N655j944j0151j062Q671J891N655M038N307j097p847
6600A1207p103m38P961Q96m055m318K26N419M73j826j060K106k559j669j918J079
$$ plain form
6584 4421 2590 939 1529 1927 -542 -1269 1264 7277 12881 5393 1209 3366 16007 18300 16417
6569 16417 18798 19476 18539 16122 13985 10675 11705 11864 12807 13926 9592 6115 10801 13754 8455 7688
6553 7688 7498 7932 8517 5889 -1440 -457 1819 3219 746 -2641 -7882 -5761 -6195 -349 242 4766
6537 4766 5047 3151 2656 5751 8713 13736 18142 21379 16592 7916 8158 7525 10583 10824 8634 1578
6521 1578 1497 6526 9567 14804 17767 13006 13318 13553 18516 24221 17106 12366 8329 8948 8922 5654 10403
6504 10403 16151 17703 19524 19540 20036 21541 24692 16561 8395 2651 5932 7931 3349 -1888 -6616
6489 -6616 -8276 -5545 297 6300 3080 5105 10347 10264 10931 11810 15684 14502 11529 4799 3979 3058
6473 3058 2455 -1588 -5391 -6716 -8738 -4294 1322 2185 -2800 -2784 -2921 242 6407 9775 4389 1374
$$ packed form
6584D421j831j651N90L98k469p27K533O013N604p488m184K157J2641K293j883
6569A6417K381O78r37k417k137l310J030J59R43J119m334l477M686K953n299p67
6553G688j90M34N85k628p329R83K276J400k473l387n241K121m34N846N91M524
6537D766K81j896m95L095K962N023M406L237m787q676K42o33L058K41k190p056
6521A578q1N029L041N237K963m761L12K35M963N705p115m740m037O19k6l268M749
6504A0403N748J552J821J6M96J505L151q131q166n744L281J999m582n237m728
6489f616j660K731N842O003l220K025N242q3O67Q79L874j182k973o730q20r21
6473C058o03m043l803j325k022M444N616Q63m985J6j37L163O165L368n386l015
$$ plain form
6457 1374 -556 1242 6148 5239 4672 3283 -1651 2626 10860 13501 12148 12305 4080 4520 8819 12101
6441 12101 9633 11558 8826 2811 1731 -1704 2467 6302 11764 14460 13803 12051 9393 6664 6750
6426 6750 3016 -942 -4033 84 3508 9754 7761 7201 8070 4426 -3723 -5002 -1207 1664 3613
6411 3613 5633 2382 -2788 -5926 -5381 3629 12109 16009 12578 10636 7930 8167 4262 -1260 27
6396 27 3384 3336 4079 7764 9418 4789 703 794 4141 2974 -448 1139 2804 2138 -1159 -2668 2149
6379 2149 3986 5308 6185 1918 -3041 -5082 -9422 -14188 -9830 -3075 -3003 -4476 -1356 685 -1678 -4541
6363 -4541 -11060 -16801 -11708 -5649 -4169 -7425 -4462 122 -1985 -7414 -9524 -8538 -2141 -2507 -4164
6348 -4164 -3789 -1486 2358 -3650 -9367 -11510 -5323 -4603 -5197 -2037 1236 8857 10230 6777 1397 48
$$ packed form
6457A374j930J798M906r09n67j389m934M277Q234K641j353J57q225M40M299L282
6441A2101k468J925k732o015j080l435M171L835N462K696o57j752k658k729Q6
6426F750l734l958l091M117L424O246j993n60Q69l644q149j279L795K871J949
6411C613K020l251n170l138N45R010Q480L900l431j942k706K37l905n522J287
6396B7L357m8P43L685J654m629m086R1L347j167l422J587J665o66l297j509M817
6379B149J837J322Q77m267m959k041m340m766M358O755P2j473L120K041k363k863
6363d541o519n741N093O059J480l256K963M584k107n429k110R86O397l66j657
6348d164L75K303L844o008n717k143O187P20n94L160L273P621J373l453n380j349
$$ plain form
6332 48 -1088 2568 868 6192 9855 4231 946 2836 706 -1321 -2327 3154 8780 6163 2217
6317 2217 3257 3112 2003 2330 1058 -1738 -3799 922 4566 3789 -1034 -4266 4059 7808 7149 4575
6301 4575 704 -3431 -644 -3000 -4391 -604 4561 5675 2707 -645 -2278 6163 11188 6628 -1144
6286 -1144 -10980 -12517 -13841 -8567 -8451 -9006 -11658 -9229 -10674 -8041 -4522 1243 287 -5271 -5975 -5412
6270 -5412 -3141 -7683 -5632 -3493 690 -1449 3463 1523 -5330 3235 8339 6241 6268 4017 2885
6255 2885 369 246 2821 3887 6101 3636 -3430 -3064 -2847 -1625 -2618 -1195 -829 -379 -2029 -2856 -3409
6238 -3409 3597 12011 15657 7552 -1413 -9457 -12254 -13295 -9558 -8228 -7577 -7523 -5628 -2138 4197 -1047
6222 -1047 -4871 -1493 30 471 6867 7683 4396 2931 7674 11497 11320 9881 4201 -1213 -9369 -11163
$$ packed form
6332D8j136L656j700N324L663n624l285J890k130k027j006N481N626k617l946
6317B217J040j45j109L27j272k796k061M721L644p77m823l232Q325L749o59k574
6301D575l871m135K787k356j391L787N165J114k968l352j633Q441N025m560p772
6286a144r836j537j324N274J16n55k652K429j445K633L519N765r56n558p04N63
6270e412K271m542K051K139M183k139M912j940o853Q565N104k098K7k251j132
6255B885k516j23K575J066K214k465p066L66K17J222r93J423L66M50j650q27n53
6238c409P006Q414L646q105q965q044k797j041L737J330O51N4J895L490O335n244
6222a047l824L378J523M41O396Q16l287j465M743L823j77j439n680n414q156j794
$$ plain form
6206 -11163 -6017 -5157 -1341 4618 14554 17545 15773 11122 5029 -578 3407 868 1889 6728 4147
6191 4147 1135 733 661 4047 7354 5879 -1813 -2932 -4131 -8470 -9309 -15000 -7048 -1775 -4260 -5958
6175 -5958 483 9057 9342 3736 -1004 -3447 -1801 1875 -349 3026 2900 926 -103 -457 188 3750
6159 3750 7266 4254 2108 5016 8753 9624 5026 3524 4577 4932 7794 10058 14108 15351 11412
6144 11412 8221 4346 2925 6043 7265 3509 975 4287 10848 11680 13260 12508 7892 6147 7014
6129 7014 8038 10461 5831 4453 7021 5662 1416 6082 12122 4967 -1984 3197 2516 -4964 -11069
6114 -11069 -2215 333 -1841 -5635 -8317 -12063 -10255 -5326 -569 -1510 -3393 -2617 1127 2304 304
6099 304 3233 2977 1437 923 4272 6043 -2280 -4486 545 2605 -1007 -6722 -9830 -2385 3411 7488
$$ packed form
6206a1163N146Q60L816N959R936K991j772m651o093n607L985k539J021M839k581
6191D147l012m02p2L386L307j475p692j119j199m339q39n691P952N273k485j698
6175e958O441Q574K85n606m740k443J646L676k224L375j26j974j029l54O45L562
6159C750L516l012k146K908L737Q71m598j502J053L55K862K264M050J243l939
6144A1412l191l875j421L118J222l756k534L312O561Q32J580p52m616j745Q67
6129G014J024K423m630j378K568j359m246M666O040p155o951N181o81p480o105
6114a1069Q854K548k174l794k682l746J808M929M757r41j883P76L744J177k000
6099C04K929k56j540n14L349J771q323k206N031K060l612n715l108P445N796M077
$$ plain form
6083 7488 10093 11887 6102 4600 6355 6784 11258 13257 9668 11038 12225 8311 -363 -1724 -4585
6068 -4585 -5751 -2363 -3005 -3598 -229 3341 4632 4870 2823 525 5643 16309 12585 6173 9351
6053 9351 9825 4621 7210 1999 -1819 5324 -1286 -9628 -9157 -9910 -6061 -1100 3794 7730 13225 8307
6037 8307 6086 13407 13822 12362 10139 8335 3987 5390 849 4171 8528 10930 10949 10004 2247 -5290
6021 -5290 -7219 -6684 -6011 -5752 -10766 -13812 -10683 -12202 -12739 -10091 -11384 -3223 -2966 -1521 7766 15406
6005 15406 12114 14613 9700 2669 -2441 -8368 -12824 -12921 -16014 -12133 -5673 -9285 -9936 -9631 -5957 -3114
5989 -3114 -1303 -7963 -9903 -976 4133 5276 10154 3757 885 1738 -1822 -4940 -8141 -8413 -5348
5974 -5348 -3197 1677 1821 8001 16489 20883 23614 35637 35481 27887 26755 26015 27011 27812 28825 26618
$$ packed form
6083G488K605J794n785j502J755M29M474J999l589J370J187l914q674j361k861
6068d585j166L388o42n93L369L570J291K38k047k298N118J0666l724o412L178
6053I351M74n204K589n211l818P143o610q342M71p53L849M961M894L936N495m918
6037H307k221P321M15j460k223j804m348J403m541L322M357K402J9r45p757p537
6021e290j929N35O73K59n014l046L129j519n37K648j293Q161K57J445R287P640
6005A5406l292K499m913p031n110n927m456r7l093L881O460l612o51L05L674K843
5989c114J811o660j940Q927N109J143M878o397k872Q53l560l118l201k72L065
5974e348K151M874J44O180Q488M394K731J2023j56p594j132p40R96Q01J013k207
$$ plain form
5958 26618 23984 23580 23318 20631 12856 9912 920 -1476 -296 -790 2260 137 5071 8484 10261
5943 10261 12371 7371 3095 -5607 -10358 -7758 1094 1634 3403 5119 -1159 -6287 -4068 221 6645
5928 6645 16184 16369 13295 5029 2728 2446 2986 4468 1710 -104 -1481 -3090 -6122 -7161 -10467 -9764
5912 -9764 -970 -302 -1166 -3105 -2864 -4142 -4295 -2645 -73 2732 1289 583 -4422 -11059 -14630 -12702
5896 -12702 -7306 -6902 -11651 -13295 -7145 -711 -323 -2818 -3645 -2878 -599 1408 -4343 -6324 -1731 -2364
5880 -2364 -1318 -642 -5046 -6085 -1994 2235 3440 4195 3783 -2898 -4591 6906 16830 20226 20901 17006
5864 17006 12139 10535 1681 1551 -852 9046 18305 11802 13319 17398 11625 12641 12528 10171 6900
5849 6900 6100 8926 8951 13021 14772 7049 2894 -776 -4518 -3844 284 -3038 -5279 -13461 -13234 -10518
$$ packed form
5958B6618k634m04k62k687p775k944q992k396J180m94L050k123M934L413J777
5943A0261K110n000m276q702m751K600Q852N40J769J716o278n128K219M289O424
5928F645R539J85l074q266k301k82N40J482k758j814j377j609l032j039l306P03
5912i764Q794O68q64j939K41j278j53J650K572K805j443p06n005o637l571J928
5896a2702N396M04m749j644O150O434L88k495q27P67K279K007n751j981M593o33
5880b364J046O76m404j039M091M229J205P55m12o681j693J1497R924L396O75l895
5864A7006m867j604q854j30k403R898R259o503J517M079n773J016j13k357l271
5849F900q00K826K5M070J751p723m155l670l742O74M128l322k241q182K27K716
$$ plain form
5833 -10518 -4819 -410 537 4662 3811 197 1636 2682 736 -2181 -5334 -234 1203 -4921 -8083
5818 -8083 -9170 -5964 -8420 -9468 -5481 -2879 -7164 -9415 -5756 -2816 -771 7442 13267 11601 5904
5803 5904 5947 10439 3430 4946 16595 12115 7493 4359 4478 9640 8648 14100 20917 17719 9311 5387
5787 5387 6387 10069 8864 8483 17678 26051 26083 18732 10696 3492 4543 1212 -2902 -5029 -2120 -1507
5771 -1507 -4494 -8343 -8017 -7374 -6953 -4381 -4050 -5365 -8475 -4626 -2382 30 -586 2505 4723 -2325
5755 -2325 -4738 4170 6234 5302 7007 6708 4330 2212 5776 6523 449 1686 5903 6409 7716 6180
5739 6180 4936 900 -2879 -7822 -6031 -8018 -8340 -1011 -792 -3749 -8228 -5386 -3354 1411 4106
5724 4106 4505 2397 4117 1844 -2170 -4862 3441 3376 7897 9662 8052 9648 4785 -423 2060 9253
$$ packed form
5833a0518N699M409R47M125q51l614J439J046j946k917l153N100J437o124l162
5818h083j087L206k456j048L987K602m285k251L659K940K045Q213N825j666n697
5803E904M3M492p009J516J1649m480m622l134J19N162r92N452O817l198q408l924
5787E387J000L682j205l81R195Q373L2p351q036p204J051l331m114k127K909O13
5771a507k987l849L26O43M21K572L31j315l110L849K244K412o16L091K218p048
5755b325k413Q908K064r32J705k99k378k118L564P47o074J237M217N06J307j536
5739F180j244m036l779m943J791j987l22P329K19k957m479K842K032M765K695
5724D106L99k108J720k273m014k692Q303o5M521J765j610J596m863n208K483P193
$$ plain form
5708 9253 12232 7977 2639 1979 7301 14831 12632 6320 3022 2151 1391 749 -8011 -8776 -5883 -426
5692 -426 1583 3723 9337 10010 4295 -5156 -7387 -6351 -7904 -7531 -7293 -12735 -8157 -2244 2105 1993
5676 1993 -417 -3088 -2843 -1843 3411 7860 4174 -107 -3747 -8184 -7893 -7555 -4713 -2173 -2102 -7349
5660 -7349 -8834 -6508 -10546 -11440 -12572 -13836 -8020 -2960 -7742 -11375 -12063 -8066 -2568 3406 6901
5645 6901 2424 -526 -2951 -4287 -779 1663 1933 1645 -764 1438 -716 -5652 -222 3913 8868
5630 8868 4865 1027 -2115 -2351 2375 9072 6894 3761 6525 4940 7260 5027 7558 6415 4938
5615 4938 -1962 -12931 -17087 -14402 -6936 3275 8579 7542 2311 1775 -2595 -10189 -9501 -6890 -386
5600 -386 1425 1497 3158 4109 8556 10131 10356 7608 7159 5325 2475 3412 3164 2777 1148 -1853 -2430
$$ packed form
5708I253K979m255n338o60N322P530k199o312l298q71p60o42q760p65K893N457
5692d26K009K140N614O73n715r451k231J036j553L73K38n442M578N913M349j12
5676A993k410k671K45J000N254M449l686m281l640m437K91L38K842K540P1n247
5660g349j485K326m038q94j132j264N816N060m782l633o88L997N498N974L495
5645F901m477k950k425j336L508K442K70k88k409K202k154m936N430M135M955
5630H868m003l838l142k36M726O697k178l133K764j585K320k233K531j143j477
5615D938o900j0969m156K685P466J0211N304j037n231n36m370p594O88K611O504
5600c86J811P2J661R51M447J575K25k748m49j834k850R37k48l87j629l001n77
$$ plain form
5583 -2430 -3858 -4283 -5680 -5523 -1066 -495 5 26 2453 6801 10519 4564 2067 1596 4733 8211 7997
5566 7997 5256 -5220 -8053 -2877 1141 10995 9714 3267 299 -894 3225 9574 15470 14677 11792
5551 11792 8479 4590 4048 9552 10378 6575 625 -692 -627 -5422 -5915 -27 9492 13800 13539 7449
5535 7449 9646 7801 11290 15674 7596 1477 1239 2558 2710 -3801 745 718 -1641 -2206 1293 3104
5519 3104 3699 3188 9480 8898 3142 5999 2818 3658 3641 376 -1310 1816 1944 409 -6954 -8836 -10514
5502 -10514 -12209 -7802 -732 -3461 -2519 -3300 669 2259 1097 -3625 -4179 1415 5616 8138 10708
5487 10708 9422 11575 16815 19075 13372 12774 13988 8254 3542 5883 8222 8234 1447 -1214 -1452 -2348
5471 -2348 728 1109 8901 10031 4426 3118 2683 7257 6844 4579 3672 -1430 -7390 -1797 6008 10519
$$ packed form
5583b430j428m25j397J57M457N71N00K1K427M348L718n955k497m71L137L478k14
5566G997k741j0476k833N176M018R854j281o447k968j193M119O349N896p93k885
5551A1792l313l889n42N504Q26l803n950j317O5m795m93N888R519M308k61o090
5535G449K197j845L489M384q078o119k38J319J52o511M546k7k359n65L499J811
5519C104N95n11O292n82n756K857l181Q40j7l265j686L126J28j535p363j882j678
5502a0514j695M407P070k729R42p81L969J590j162m722n54N594M201K522K570
5487A0708j286K153N240K260n703n98J214n734m712K341K339J2o787k661k38q96
5471b348L076L81P792J130n605j308m35M574m13k265r07n102n960N593P805M511
$$ plain form
5455 10519 10740 8288 6436 11102 7567 1476 -3976 -1315 -1043 -6160 -7118 -1464 -683 -1136 1978 -717
5439 -717 -11094 -7023 2184 4324 5416 5186 9182 9119 4134 349 -5649 -3676 -3075 -3699 -4772 -13039
5423 -13039 -13188 -10447 -2381 3562 74 -903 -313 -825 -2924 1805 4689 -3360 -4662 -1859 2316 -144
5407 -144 -7523 -7143 -3779 3325 1743 -3220 -1278 -994 -540 -3487 -2531 1538 77 1217 2397 4037
5391 4037 7132 12677 10393 7282 5607 1387 -3310 1 7441 10103 7081 -1509 -7592 -4697 -203
5376 -203 1283 3156 1031 2912 3459 3905 862 1784 3735 12577 12731 8843 10986 11944 6894 -2145
5360 -2145 -8104 -5575 4270 8075 8800 7335 2781 3124 4372 1477 -2977 -3434 1772 5548 4536 5786
5344 5786 -1048 -6756 -1752 -3015 -706 3050 11784 8403 4291 -117 1964 2384 -3345 -8595 -3325
$$ packed form
5455A0519K21k452j852M666l535o091n452K661K72n117r58N654P81m53L114k695
5439g17j0377M071R207K140J092k30L996o3m985l785n998J973O01o24j073q267
5423a3039j49K741Q066N943l488r77N90n12k099M729K884q049j302K803M175k460
5407a44p379L80L364P104j582m963J942K84M54k947R56M069j461J140J180J640
5391D037L095N545k284l111j675m220m697L311P440K662l022q590o083K895M494
5376b03J486J873k125J881N47M46l043R22J951Q842J54l888K143R58n050r039
5360b145n959K529R845L805P25j465m554L43J248k895m454m57N206L776j012J250
5344E786o834n708N004j263K309L756Q734l381m112m408K081M20n729n250N270
$$ plain form
5329 -3325 747 6468 5007 4148 7894 3899 819 -1263 -1662 -1688 -722 4998 11182 10397 12615 13415 6407
5312 6407 -32 -955 -1981 564 -233 -5446 -3843 -5291 -5117 -5135 -3930 -8105 -6157 -2803 -7048 -4796
5296 -4796 1060 2778 3927 6524 12066 12396 6380 -490 -2272 -1439 3514 3391 5301 1268 -2839 -2764
5280 -2764 1088 2725 -4646 2795 8542 7533 3003 1399 -1635 -4602 -2017 -3424 -5319 -4867 -4269
5265 -4269 -1977 3995 1895 -7574 -4925 1367 2626 7582 6294 -1992 1137 7668 10474 3173 2635
5250 2635 4533 67 4324 -1155 -4363 -1038 1016 -275 420 -2041 -6023 -10897 -9378 -6084 -9333
5235 -9333 -16135 -13509 -9402 -11919 -14932 -12858 -7861 -3659 -2084 -1694 -90 1125 2731 5526 1650
5220 1650 -64 -2228 -5526 -2396 -6759 -1254 -1228 -3589 -6564 1038 -613 -4707 -2961 -1387 681
$$ packed form
5329c325M072N721j461q59L746l995l080k082l99k6R66N720O184p85K218Q00p008
5312F407o439r23j026K545p97n213J603j448J74j8J205m175J948L354m245K252
5296d796N856J718J149K597N542L30o016o870j782Q33M953j23J910m033m107P5
5280b764L852J637p371P441N747j009m530j604l034k967K585j407j895M52N98
5265d269K292N972k100r469K649O292J259M956j288q286L129O531K806p301n38
5250B635J898m466M257n479l208L325K054j291O95k461l982m874J519L294l249
5235i333o802K626M107k517l013K074M997M202J575L90J604J215J606K795l876
5220A650j714k164l298L130m363N505K6k361k975P602j651m094J746J574K068
$$ plain form
5205 681 789 -2873 -6223 -7559 -4507 2950 4711 5383 450 -84 1510 -833 1118 7377 8199 1726
5189 1726 -2661 -11870 -10150 -9237 -10918 -4160 -2766 -6241 -5891 -957 1474 -173 -2220 2313 2933 -2560
5173 -2560 -6735 -11191 -13966 -15586 -10643 -3638 -2651 -7950 -12738 -8079 -4492 -7813 -7209 -8232 -5900
5158 -5900 -519 -1490 -7332 -8368 -2145 1721 -2590 -1433 -1215 3603 576 -3150 -5888 -2259 -2487 4337
5142 4337 7315 5795 6318 9104 6257 184 -7683 -4546 1757 3840 11109 8712 5132 4811 2977
5127 2977 2314 1306 -263 -5094 -8567 -6189 -8115 -13391 -12216 -6271 2667 -2961 -8409 -11401 -11903
5112 -11903 -12189 -13095 -7968 -3428 -1086 358 5408 7215 2955 1452 -83 -1524 -958 -3131 -10163
5097 -10163 -11043 -10833 -7513 -2557 869 2410 3591 -2185 -4872 -2316 4317 2655 -4301 -7461 -2704
$$ packed form
5205F81J08l662l350j336L052P457J761O72m933n34J594k343J951O259Q22o473
5189A726m387r209J720R13j681O758J394l475L50M934K431j647k047M533O20n493
5173b560m175m456k775j620M943P005R87n299m788M659L587l321O04j023K332
5158e900N381r71n842j036O223L866m311J157K18M818l027l726k738L629k28O824
5142D337K978j520N23K786k847o073p867L137O303K083P269k397l580l21j834
5127B977o63j008j569m831l473K378j926n276J175N945Q938n628n448k992n02
5112a1903k86r06N127M540K342J444N050J807m260j503j535j441N66k173p032
5097a0163q80K10L320M956L426J541J181n776k687K556O633j662o956l160M757
$$ plain form
5082 -2704 3631 1707 -4319 -6662 -12547 -8789 -2664 1070 3201 -3176 -9368 -5729 -2607 -877 448
5067 448 8522 8938 4177 -620 -2628 50 3258 1149 -207 -3996 1642 4805 2351 3460 7562
5052 7562 5557 3488 1290 -1986 -6938 -7342 -360 1354 2432 3952 2692 1184 837 5000 9726
5037 9726 16047 15614 14592 13858 14292 13024 9643 7939 9561 10894 9613 7786 14102 16932 10150 2985
5021 2985 3931 4994 11333 10804 4004 3859 5803 10579 9778 3903 4731 4391 6442 5653 -1754 -5342 -13544
5004 -13544 -10399 836 6805 6668 4368 710 -407 -996 -1908 -2631 -589 -1607 -10056 -9825 -10069 -9428
4988 -9428 -1075 1863 7408 10681 12050 498 -4620 -4066 -3168 -6283 -6370 -932 -3060 -5388 -5426 -5717
4972 -5717 2427 9430 13843 10121 -1528 -6259 -9090 -1560 5222 3082 -425 -5046 -7046 -7028 -1743
$$ packed form
5082b704O335j924o026k343n885L758O125L734K131o377o192L639L122J730J325
5067D48Q074M16m761m797k008K678L208k109j356l789N638L163k454J109M102
5052G562k005k069k198l276m952m04O982J714J078J520j260j508l47M163M726
5037I726O321m33j022p34M34j268l381j704J622J333j281j827O316K830o782p165
5021B985R46J063O339n29o800j45J944M776q01n875Q28l40K051p89p407l588q202
5004a3544L145J1235N969j37k300l658j117n89r12p23K042j018q449K31k44O41
4988i428Q353K938N545L273J369j1552n118N54Q98l115q7N438k128k328l8k91
4972e717Q144P003M413l722j1649m731k831P530O782k140l507m621k000J8N285
$$ plain form
4957 -1743 5244 -441 -6658 -3047 -4606 -1392 1820 2351 6886 6192 7502 10044 7814 4166 1011
4942 1011 2591 541 -3583 -7966 -9314 -10083 -9164 -4175 -559 -60 -3288 -3837 -2601 -6028 1512 580
4926 580 -281 -1666 5052 11534 10135 3943 -41 -2841 -632 -1670 -5869 -6193 -6111 384 2682 2701 7798
4909 7798 10550 13995 10735 7979 7269 3849 712 -458 -83 2311 -274 -3082 -6072 -8683 -7642
4894 -7642 -5445 -6847 -10542 -8548 -9529 -7118 -4833 -3525 -3204 -3770 -1403 -983 -1874 -3555 -1556 -84
4878 -84 -1740 1418 1329 -1145 -4893 -4934 -8930 -14345 -12921 -5108 -5044 -8520 -8864 -10339 -7271 149 -366
4861 -366 -4813 -639 -1368 -7770 -11676 -8102 -3224 2190 1952 -1480 1178 3062 -310 -2887 -2411 1670
4845 1670 5969 8712 12770 9884 9754 4660 -2906 -6707 -3416 -3004 902 -281 1084 6716 5769 3665
$$ packed form
4957a743O987n685o217L611j559L214L212N31M535o94J310K542k230l648l155
4942A011J580k050m124m383j348p69R19M989L616M99l228n49J236l427P540r32
4926E80q61j385O718O482j399o192l984k800K209j038m199l24Q2O495K298J9N097
4909G798K752L445l260k756p10l420l137j170L75K394k585k808k990k611J041
4894g642K197j402l695J994r81K411K285J308L21n66K367M20q91j681J999J472
4878h4j656L158q9k474l748m1l996n415J424P813O4l476l44j475L068P420n15
4861c66m447M174p29o402l906L574M878N414k38l432K658J884l372k577M76M081
4845A670M299K743M058k886j30n094p566l801L291M12L906j183J365N632r47k104
$$ plain form
4829 3665 1120 4028 -1577 -5578 1558 1126 -6589 -8650 -8218 -4026 -1985 -3051 -2045 -693 -937 2330
4813 2330 4418 6704 4203 2345 -1002 -1360 -271 1868 4752 6202 3873 4583 7734 9883 2615
4798 2615 -2332 1657 3632 3270 3348 6622 9182 3043 1901 2172 2497 5365 6983 7013 9514 8596 2475
4781 2475 2200 1637 2021 -144 -370 -2147 722 -611 6375 11367 12002 8567 3590 -1078 722 4773
4765 4773 5700 11259 13916 6785 1962 7340 7750 7874 6719 10181 8914 4035 2300 -866 -1996 -2444
4749 -2444 1560 6740 4846 9659 2601 4046 9408 13317 12496 8648 1975 -2103 -3532 1392 3402
4734 3402 3690 -1639 -6399 -6750 3828 4479 -2170 -7711 -5953 -3001 -6223 -1094 5062 7744 10364
4719 10364 9184 8278 2493 -2996 -10456 -14390 -8063 -4707 -4223 -9158 -8679 -5745 -5019 -781 -856 -6874
$$ packed form
4829C665k545K908n605m001P136m32p715k061M32M192K041j066J006J352k44L267
4813B330K088K286k501j858l347l58J089K139K884J450k329P10L151K149p268
4798B615m947L989J975l62P8L274K560o139j142K71L25K868J618L0K501r18o121
4781B475k75n63L84k165k26j777K869j333O986M992O35l435m977m668J800M051
4765D773R27N559K657p131m823N378M10J24j155L462j267m879j735l166j130m48
4749b444M004N180j894M813p058J445N362L909q21l848o673m078j429M924K010
4734C402K88n329m760l51J0578O51o649n541J758K952l222N129O156K682K620
4719A0364j180r06n785n489p460l934O327L356M84m935M79K934P26M238p5o018
$$ plain form
4703 -6874 -4680 -2523 -1230 566 -3012 -7446 -8676 -7089 -6103 -6200 -5981 -7669 -4256 -3225 -4978 -4730
4687 -4730 -4138 1944 6293 2602 -906 439 -1193 1032 1840 -900 3140 4418 2942 3150 1445 4221
4671 4221 -1167 2035 4012 2102 1015 4395 5073 7063 7956 2371 4132 -5689 -13672 -13714 -11263 -12527
4655 -12527 -15736 -11289 -355 6760 9376 11151 8176 2868 148 2819 -3102 -7386 -1615 5185
4641 5185 6936 2509 -4476 -4693 -199 1498 -1653 -8637 -7732 -6268 3104 8884 7916 -2157 -6429
4626 -6429 -10778 -9813 -4827 3005 2523 -970 -5492 -1111 1774 1411 2074 2521 -1017 -4755 -4089 -2620
4610 -2620 -1111 3606 2373 2515 -1191 -5956 -1163 1817 829 1064 79 8759 14256 5816 2570 4019
4594 4019 6075 744 -4318 -2134 1438 3709 -3271 -4545 -2476 3389 8975 7458 87 -6095 -7281
$$ packed form
4703f874K194K157J293J796l578m434j230J587R86r7K19j688L413J031j753K48
4687d730N92O082M349l691l508J345j632K225Q08k740M040J278j476K08j705K776
4671D221n388L202J977j910j087L380O78J990Q93n585J761r821p983m2K451j264
4655a2527l209M447J0934P115K616J775k975n308k720K671n921m284N771O800
4641E185J751m427o985k17M494J697l151o984R05J464R372N780r68j0073m272
4626f429m349R65M986P832m82l493m522M381K885l63O63M47l538l738O66J469
4610b620J509M717j233J42l706m765M793K980r88K35r85Q680N497q440l246J449
4594D019K056n331n062K184L572K271o980j274K069N865N586j517p371o182j186
$$ plain form
4579 -7281 1500 6067 9945 10445 5912 1505 -4715 -9014 -4837 479 3484 442 -143 363 -1945 -596
4563 -596 1464 2551 549 5074 2993 -1375 -2701 -285 3270 6397 4510 -120 341 -3092 -7724
4548 -7724 -12584 -13456 -7466 -7312 -8688 -6019 -6074 -7141 -6248 -6111 -15179 -16209 -10565 -1775 -887 -1969 1573
4531 1573 4889 5930 5683 8026 5934 6276 7020 3801 1818 -1418 1484 6512 2688 -2176 -5027 -10229
4515 -10229 -13974 -12732 -12765 -11694 -9147 -4027 -2848 825 -1792 -401 1049 4701 8491 7968 7021 7702
4499 7702 3905 -1617 -10603 -9251 -8767 -9584 -2420 2908 2160 3748 -3379 -4265 399 3739 7465 6320
4483 6320 4123 3653 1317 -2598 1066 7537 10632 6973 4989 5373 4512 4480 4075 4566 3695 2458 -2518
4466 -2518 -4450 -341 2310 1954 184 1265 -986 -2785 -3150 -1454 3061 5628 5543 6682 6056 3622
$$ packed form
4579g281Q781M567L878N00m533m407o220m299M177N316L005l042n85N06k308J349
4563e96K060J087k002M525k081m368j326K416L555L127j887m630M61l433m632
4548g724m860q72N990J54j376K669n5j067Q93J37r068j030N644Q790Q88j082L542
4531A573L316J041k47K343k092L42P44l219j983l236K902N028l824m864k851n202
4515a0229l745J242l3J071K547N120J179L673k617J391J450L652L790n23r47O81
4499G702l797n522q986J352M84q17P164N328p48J588p127q86M664L340L726j145
4483F320k197m70k336l915L664O471L095l659j984L84q61l2m05M91q71j237m976
4466b518j932M109K651l56j770J081k251j799l65J696M515K567q5J139o26k434
$$ plain form
4450 3622 -542 -1684 -686 -2906 844 500 2395 2913 3701 5849 10183 10845 10719 16335 17872 15253
4434 15253 13719 15966 14787 8538 5867 5773 3056 -530 -2049 -1003 -3234 5 -57 -4530 -6848 -3067
4418 -3067 -1110 2482 4105 3347 4224 11891 14132 10291 5377 700 -2964 -2845 -6648 -11907 -7701 -2409
4402 -2409 -8160 -8664 -7338 -7733 -5943 -6819 -6972 -11841 -15443 -11147 -11575 -9503 -8375 -7167 -3538 -7490
4386 -7490 -8950 -3537 -1784 -4841 -5759 -8166 -9471 -11814 -13978 -18794 -10915 -4772 -119 1558 3389
4371 3389 5255 3185 3374 -425 -1447 803 6301 7726 6980 4812 1692 -4384 -4598 3382 762 -657
4355 -657 3275 2750 1443 4267 575 -1232 1000 6087 9243 11795 15349 14057 15046 14159 8932 6953
4339 6953 6576 11986 14949 8151 7202 9073 6208 4370 3952 -4548 -12103 -9030 -7411 -6227 -2851 -2736
$$ packed form
4450C622m164j142R98k220L750l44J895N18P88K148M334O62j26N616J537k619
4434A5253j534K247j179o249k671r4k717l586j519J046k231L239o2m473k318L781
4418c067J957L592J623p58Q77P667K241l841m914m677l664J19l803n259M206N292
4402b409n751n04J326l95J790q76j53m869l602M296m28K072J128J208L629l952
4386g490j460N413J753l057r18k407j305k343k164m816P879O143M653J677J831
4371C389J866k070J89l799j022K250N498J425p46k168l120o076k14P980k620j419
4355f57L932n25j307K824l692j807K232N087L156K552L554j292R89q87n227j979
4339F953l77N410K963o798r49J871k865j838m18q500p555L073J619J184L376J15
$$ plain form
4323 -2736 -2554 -482 2128 -687 -4421 -5927 -3286 654 315 -4066 -5989 -6449 -7219 -4430 -1889 109
4307 109 -2771 -1842 -3309 -8285 -10901 -8902 -7275 -6419 -2417 -668 -4333 -6531 -1378 -2508 -1629 -3093
4291 -3093 -2664 -5135 -5700 -6839 -5232 -7178 -5666 -7869 -13185 -6509 4941 7569 6524 -1731 -8100
4276 -8100 -3695 -2556 2393 46 -8767 -5775 -1638 4527 7140 11165 7643 2813 -3342 -1081 9741
4261 9741 12122 10050 4173 1321 6203 -51 -4870 -3127 -3134 -547 -852 -1856 572 2570 5846 10187
4245 10187 9109 4725 4738 1957 1076 7639 5196 -364 627 -475 -1505 915 1420 4840 10987 7541
4229 7541 8163 6796 4967 2079 2022 9003 4438 -1386 2551 3284 1161 127 -4782 -7638 -6841 -4627
4213 -4627 337 5304 5923 5694 -358 -169 477 -3190 6523 12069 13865 3377 -3846 -4631 565 6197
$$ packed form
4323b736J82K072K610k815l734j506K641L940l39m381j923m60p70K789K541J998
4307A09k880R29j467m976k616J999J627Q56M002J749l665k198N153j130Q79j464
4291c093M29k471n65j139J607j946J512k203n316O676J1450K628j045q255o369
4276h100M405J139M949k347q813K992M137O165K613M025l522m830o155K261J0822
4261I741K381k072n877k852M882o254m819J743pK587l05j004K428J998L276M341
4245A0187j078m384J3k781q81O563k443n560R91j102j030K420N05L420O147l446
4229G541O22j367j829k888n7O981m565n824L937P33k123j034m909k856P97K214
4213d627M964M967O19k29o052J89O46l667R713N546J796j0488p223p85N196N632
$$ plain form
4197 6197 2556 3239 3564 2385 2699 756 -1368 -10354 -13803 -6398 -5225 -811 -2615 -2497 1946 1397
4181 1397 3279 8578 8989 5372 -2721 -5793 -3756 -9131 -11324 -13084 -6820 -2635 -1893 -4217 -1501
4166 -1501 506 3264 4116 9651 5839 -1950 -3888 -4498 -3089 517 3891 9699 11226 8615 7384
4151 7384 6370 2166 -200 -4960 -8290 -7274 -6484 -4389 -4580 -2410 257 674 2513 -4407 -2474 -2424
4135 -2424 -3831 -1377 -1599 -5223 -9846 -9775 768 3017 -5051 -7293 -8982 -4812 -3948 -3979 -8965 -17080
4119 -17080 -16136 -8096 -998 852 2848 779 -264 -2365 -7501 -7210 -855 -2602 -4142 -4315 -7200
4104 -7200 -6954 -2904 1581 -1812 -8694 -11900 -6475 -3637 -4314 -2940 -3746 -605 1307 1523 1198 -510
4088 -510 -3869 -6925 -3867 -2600 71 -546 -411 551 7315 1930 1208 -1305 2776 2298 470 1230 2635
$$ packed form
4197F197l641O83L25j179L14j943k124q986l449P405J173M414j804J18M443n49
4181A397J882N299M11l617q093l072K037n375k193j760O264M185P42k324K716
4166a501K007K758Q52N535l812p789j938o10J409L606L374N808J527k611j231
4151G384j014m204k366m760l330J016P90K095j91K170K667M17J839o920J933N0
4135b424j407K454k22l624m623P1J0543K249q068k242j689M170Q64l1m986q115
4119a7080R44Q040P098J850J996k069j043k101n136K91O355j747j540j73k885
4104g200K46M050M485l393o882l206N425K838o77J374q06L141J912K16l25j708
4088e10l359l056L058J267K671o17J35R62O764n385p22k513M081m78j828P60J405
$$ plain form
4071 2635 5471 8390 8649 3483 1242 4495 -703 -1193 3600 5003 3213 -488 -5273 -3283 -326
4056 -326 4830 5823 6758 1920 -3338 -5550 -4080 -3080 -715 5063 748 -2235 -895 -3073 -9245 -10098
4040 -10098 -3201 132 269 -3817 -4033 -83 -1017 -4372 -5593 -7631 -6270 -1963 -1678 -2934 -3492 -1634
4024 -1634 -2313 906 3650 2927 -6981 -12617 -9633 -3164 4365 3984 5699 3584 -525 -2702 -6252 -6491
4008 -6491 -4212 -1974 -5195 -1443 3537 4612 7605 7456 2883 -1029 -670 -3031 1353 -1790 -5114
3993 -5114 -11713 -14989 -6790 -4533 -761 3376 1137 -1305 -4344 -3048 2789 11479 19579 16016 5175
3978 5175 -3526 -8738 -9069 -8370 -2885 9231 9257 6527 469 -1468 5614 7933 6764 5976 4956 -1435
3962 -1435 -11338 -9339 -4193 2696 2566 4492 4459 7792 10712 5335 3817 1762 203 6807 7746 1304
$$ packed form
4071B635K836K919K59n166k241L253n198m90M793J403j790l701m785J990K957
4056c26N156R93R35m838n258k212J470J000K365N778m315k983J340k178o172q53
4040a0098O897L333J37m086k16L950r34l355j221k038J361M307K85j256n58J858
4024a634o79L219K744p23r908n636K984O469P529l81J715k115m109k177l550k39
4008f491K279K238l221L752M980J075K993j49m573l912L59k361M384l143l324
3993e114o599l276Q199K257L772M137k239k442l039J296N837Q690Q100l563j0841
3978E175q701n212l31O99N485J2116K6k730o058j937P082K319j169p88j020o391
3962a435r903J999N146O889j30J926l3L333K920n377j518k055j559O604R39o442
$$ plain form
3946 1304 626 -2652 -141 6931 7088 1928 -3151 -3676 -3181 -7143 -5518 -4676 -3983 -6326 -11448 -9629
3930 -9629 -4482 -6455 -6235 -3515 -1463 -6230 -9018 -8247 -10394 -13318 -11953 -5330 -7716 -9947 -12805
3915 -12805 -12123 -7246 -5916 782 -1406 -6126 -9691 -9499 -8745 -4924 3719 10650 15547 10089 2043
3900 2043 -1672 -5355 -1376 -5702 -8917 -3320 1362 -4313 -7180 -10004 -9132 -4641 -830 -2404 2537
3885 2537 6443 11148 11829 12285 7513 4990 3974 5177 6052 744 -3671 -5955 -10466 -11415 -8737 -5109
3869 -5109 -6590 -9046 -10075 -10957 -11336 -3378 -2028 -2301 -1943 1629 1091 -6922 -12590 -15091 -13266 -15066
3853 -15066 -12121 -11687 -12913 -10431 -7269 -8203 -11493 -12208 -5918 -1497 -870 -4559 589 -860 -4327 -7211
3837 -7211 -9722 -9730 -5007 -4781 -1804 679 1991 -250 2936 1481 -963 -2106 -4704 -10412 -11102 -10545
$$ packed form
3946A304o78l278K511P072J57n160n079n25M95l962J625Q42O93k343n122J819
3930i629N147j973K20K720K052m767k788P71k147k924J365O623k386k231k858
3915a2805O82M877J330O698k188m720l565J92P54L821Q643O931M897n458q046
3900B043l715l683L979m326l215N597M682n675k867k824Q72M491L811j574M941
3885B537L906M705O81M56m772k523j016J203Q75n308m415k284m511r49K678L628
3869e109j481k456j029q82l79P958J350k73L58L572n38q013n668k501J825j800
3853a5066K945M34j226K482L162r34l290p15O290M421O27l689N148j449l467k884
3837g211k511qM723K26K977K483J312k241L186j455k444j143k598n708o90N57
$$ plain form
3821 -10545 -5426 2034 1494 322 9812 4874 -1224 2655 1481 -2917 -5469 -145 584 -4298 -3148
3806 -3148 -5437 -6228 -477 4176 2760 -2802 -3215 -2901 -8809 -4435 8129 12784 11955 9116 4838 3256
3790 3256 1764 0 -47 3670 -72 -6552 -6626 -5840 -5024 -53 -1025 -4118 -2828 -1867 -2435 601 1797
3773 1797 1557 -1601 558 4202 5380 4101 -1622 -9242 -9737 -12943 -12629 -6930 -1988 -5069 -8340 -4547
3757 -4547 -6015 -9276 -5738 -5186 -8856 -5722 1734 251 -709 3404 2360 699 -1751 1978 5037
3742 5037 -371 -639 1916 3026 6069 7169 6096 2462 3498 -157 210 -2681 -557 -4175 -8093
3727 -8093 -7491 492 8123 5060 -1516 -1607 9540 16800 14603 14185 11981 8466 128 -241 -4320 -1858
3711 -1858 -1187 -158 -2624 -4974 -3441 -918 -4209 -6806 -4588 -3235 -3469 -11190 -10356 2986 156
$$ packed form
3821a0545N119P460n40j172R490m938o098L879j174m398k552N324P29m882J150
3806c148k289p91N751M653j416n562m13L14n908M374J2564M655q29k839m278j582
3790C256j492j764m7L717l742o480p4P86Q16M971r72l093J290R61n68L036J196
3773A797k40l158K159L644J178j279n723p620m95l206L14N699M942l081l271L793
3757d547j468l261L538N52l670L134P456j483r60M113j044j661k450L729L059
3742E037n408k68K555J110L043J100j073l634J036l655L67k891K124l618l918
3727h093O02P983P631l063o576r1J1147P260k197m18k204l515q338l69m079K462
3711a858O71J029k466k350J533K523l291k597K218J353k34p721Q34J3342k830
$$ plain form
3696 156 2060 3892 56 -3996 168 -1195 -5703 -5222 -3335 -844 5184 2045 -4425 -3595 1657 -1586
3680 -1586 -3367 -4018 -1087 -5152 -6969 -7161 -2443 4503 4580 -1327 -2979 -395 5690 4920 -4664 -9568
3664 -9568 -8556 -3645 1930 159 2136 4625 8371 13903 13746 7812 6554 3148 2610 5364 4916 -1018
3648 -1018 -7514 -3328 2789 261 -5374 -7767 -7616 -5867 553 5371 10797 8669 -511 -2280 -1034
3633 -1034 -4746 -2328 140 -3935 -9983 -12682 -16267 -12195 -8479 -7085 -2917 -3251 -4637 -2682 1383
3618 1383 4458 6406 4489 3248 5990 10677 9410 6593 4844 5591 1356 1764 1914 -2580 -3216 -3116
3602 -3116 -2138 -386 3922 5770 1506 -91 740 -1585 -687 3500 2353 -704 -7559 -5864 -2308 1344
3586 1344 3713 1180 -1670 615 3151 2062 -491 35 -501 -2683 -2682 3487 5678 1341 -3755 -5054
$$ packed form
3696A56J904J832l836m052M164j363m508M81J887K491O028l139o470Q30N252l243
3680a586j781o51K931m065j817j92M718O946P7n907j652K584O085p70r584m904
3664i568J012M911N575j771J977K489L746N532j57n934j258l406n38K754m48n934
3648a018o496M186O117k528n635k393J51J749O420M818N426k128r180j769J246
3633a034l712K418K468m075o048k699l585M072L716J394M168l34j386J955M065
3618A383L075J948j917j241K742M687j267k817j749P47m235M08J50m494o36J00
3602c116R78J752M308J848m264j597Q31k325Q98M187j147l057o855J695L556L652
3586A344K369k533k850K285K536j089k553N26n36k182JO169K191m337n096j299
$$ plain form
3570 -5054 -5478 -9110 -6083 4420 9333 10790 13430 12728 10199 13778 10774 9954 8398 1473 2082 1767
3554 1767 958 713 4863 3639 -802 -206 -1518 -3756 -667 8045 10758 4843 4243 2364 -881 -3229
3538 -3229 -8015 -9265 -8884 -6958 -5389 -1589 994 -1517 4063 1115 -42 2922 6128 1685 1396
3523 1396 3318 7048 4651 1078 -1375 -2820 -12162 -7951 2798 6977 5460 -1982 -6073 -8649 -11111
3508 -11111 -9622 -1519 4360 4311 3124 -5480 -8186 -2482 -20 -2987 -3824 -6620 -7403 -8056 -8988 -3977
3492 -3977 -294 3245 1636 -6647 -5950 -1167 2773 3336 -3666 -11871 -7538 -2786 -1148 2026 1649 722
3476 722 -2515 -4092 -4092 1543 2722 -9 -5527 -233 5997 2110 -4964 -7609 -3436 -7095 -5787 -714
3460 -714 -340 -2857 4594 11408 11359 5235 -3377 -3620 1104 3945 3661 6856 3011 2469 2504 3219 5162
$$ packed form
3570e054m24l632L027J0503M913J457K640p02k529L579l004q20j556o925O09l15
3554A767q09k45M150j224m441N96j312k238L089Q712K713n915o00j879l245k348
3538c229m786j250L81J926J569L800K583k511N580k948j157K964L206m443k89
3523A396J922L730k397l573k453j445r342M211J0749M179j517p442m091k576k462
3508a1111J489Q103N879m9j187q604k706N704K462k967q37k796p83o53r32N011
3492c977L683L539j609q283O97M783L940N63p002q205M333M752J638L174l77r27
3476G22l237j577%N635J179k731n518N294O230l887p074k645M173l659J308N073
3460g14L74k517P451O814m9o124q612k43M724K841k84L195l845n42L5P15J943
$$ plain form
3443 5162 -5025 -5180 -4702 -7106 -7160 -3250 -3522 -7481 -7788 -5140 -2789 -1046 -608 -2897 -9033 -8218 -633
3426 -633 -1105 3557 8724 1657 -207 6251 9376 4216 -49 -7371 -6391 -932 3551 7430 4781 3324
3410 3324 -1941 -6864 4076 4821 2414 -3708 -7908 -6073 -3204 -7850 -1323 161 330 1393 -3957
3395 -3957 -408 -6228 -14591 -13615 -9262 -7458 -4281 -3282 -6815 -6341 -1177 1731 -238 -1587 -3339 -85
3379 -85 717 2328 2797 5443 6007 6612 5881 9111 5226 331 -3645 -5632 -3167 3363 3426 -1444 -3975
3362 -3975 -926 -1732 -7963 -5148 -4921 -3728 206 5107 5018 2558 3465 60 -6266 -5462 -8827 -5770
3346 -5770 -1801 -1242 -2522 -2078 -6113 -9155 -7937 -8279 -6688 -3582 -618 585 -1821 1560 1305 -1968
3330 -1968 3569 6517 5521 3249 -3122 -4212 -4911 -7539 -6293 -5640 -3260 -679 4627 6571 5167 5674
$$ packed form
3443E162j0187j55M78k404n4L910k72l959l07K648K351J743M38k289o136Q15P585
3426f33m72M662N167p067j864O458L125n160m265p322R80N459M483L879k649j457
3410C324n265m923J0940P45k407o122m200J835K869m646O527J484J69J063n350
3395c957L549n820q363R76M353J804L177R99l533M74N164K908j969j349j752L254
3379h5Q02J611M69K646N64O05p31L230l885m895l976j987K465O530O3m870k531
3362c975L049q06o231K815K27J193L934M901q9k460R07l405o326Q04l365L057
3346e770L969N59j280M44m035l042J218l42J591L106K964J203k406L381k55l273
3330a968N537K948r96k272o371j090o99k628J246O53K380K581N306J944j404N07
$$ plain form
3314 5674 -1369 -6883 -9684 -3466 3267 4789 3135 1793 -3900 -9069 -4759 857 -3823 -10248 -7650
3299 -7650 -6374 -3814 -11388 -10216 -6662 -6861 -3424 -2955 -6737 -7970 -8359 -4078 -2978 -7768 -11338 -6143
3283 -6143 -7537 -10437 -5388 -337 6077 5619 677 -2593 -1216 5814 2716 -3182 -2857 -3483 -8337 -6576
3267 -6576 804 4146 7793 6592 10603 11028 7504 5742 6384 2292 -6629 -12518 -16028 -17367 -17803 -12987
3251 -12987 -12270 -10110 -6198 -3746 -69 2567 6638 3787 6169 6010 2849 -221 -5691 -6234 -10729
3236 -10729 -10935 -6419 -5898 -12518 -11215 -4703 -2042 -937 2965 796 -6407 -9027 -8582 -8260 -5005 -3735
3220 -3735 -5718 -5044 1309 1393 -103 3061 -1219 -4035 -1786 -526 -427 2512 -372 -2004 -1051 2786
3204 2786 1324 -5716 -11604 -7657 -5883 -8105 -11890 -11084 -4121 -5271 -8913 -12301 -7485 -9175 -7277
$$ packed form
3314E674p043n514k801O218O733J522j654j342n693n169M310N616m680o425K598
3299g650J276K560p574J172L554j99L437M69l782j233l89M281J100m790l570N195
3283f143j394k900N049N051O414m58m942l270J377P030l098n898L25o26m854J761
3267f576P380L342L647j201M011M25l524j762O42m092q921n889l510j339m36M816
3251a2987P17K160L912K452L677K636M071k851K382j59l161l070n470n43m495
3236a0729k06M516N21o620J303O512K661J105L902k169p203k620M45L22L255J270
3220c735j983O74O353Q4j496L164m280k816K249J260R9K939k884j632R53L837
3204B786j462p040n888L947J774k222l785Q06O963j150l642l388M816j690J898
$$ plain form
3189 -7277 -4423 -2532 -548 3547 2305 2783 -498 -7176 -6088 -10253 -11253 -7769 -5488 -1087 5285
3174 5285 8120 7651 8912 6256 -1536 -5207 -1694 1380 5217 7120 5288 7891 8704 5997 7529
3159 7529 6876 8769 8826 9214 -201 432 2093 1088 -3439 -5640 -606 2013 -3322 624 -3203 -6206
3143 -6206 -6960 -4117 1027 2743 1575 -5208 -11405 -11090 -2529 640 1779 1968 2512 705 -5992 -10521
3127 -10521 -10079 -6734 -5460 -1522 4565 2577 -7347 -11898 -12716 -4166 -1749 -5404 -8072 2150 6737
3112 6737 6199 4730 4564 1270 5022 4444 4214 1761 1667 -1244 -704 -1406 -3412 -2160 1951 -1201 -5342
3095 -5342 -6915 -912 3384 3474 1949 -2370 -2419 -2581 -2942 417 3762 3456 3098 1636 113 -2888 -1307
3078 -1307 597 70 -3159 -6351 -3697 -8038 -9497 -7609 -10123 -7095 -9264 -10317 -8104 -14374 -13604
$$ packed form
3189g277K854J891J984M095j242M78l281o678J088m165j000L484K281M401O372
3174E285K835m69J261k656p792l671L513L074L837J903j832K603Q13k707J532
3159G529o53J893N7L88r415O33J661j005m527k201N034K619n335L946l827l003
3143f206p54K843N144J716j168o783o197L15Q561L169J139J89N44j807o697m529
3127a0521M42L345J274L938O087j988r924m551q18Q550K417l655k668J0222M587
3112F737n38j469j66l294L752n78k30k453r4k911N40p02k006J252M111l152m141
3095e342j573O003M296R0j525m319m9j62l61L359L345l06l58j462j523l001J581
3078a307J904n27l229l192K654m341j459J888k514L028k169j053K213o270P70
$$ plain form
3063 -13604 -726 6785 4046 -2865 -5578 -4566 -4111 -2559 6180 10493 12285 11429 9917 7706 815
3048 815 4762 6871 4243 3348 3450 -1501 3856 10782 5379 -4464 -1609 2889 2929 6051 7098 6275
3032 6275 12185 7737 1473 1436 2808 5776 6751 6920 1302 -4417 -2411 971 4868 5964 3846 1058
3016 1058 323 -918 -144 7106 6811 1242 -8851 -567 1758 -7602 -9066 -3114 -2020 523 -2573
3001 -2573 -5108 -5989 -6316 -2453 -865 -1923 -4568 -6327 -8838 -8361 -469 6791 7540 4033 2332 2521
2985 2521 6952 3628 1149 7082 647 -1424 -1132 4312 8656 5770 1589 -260 529 6255 1824
2970 1824 -2675 1100 -4349 -8520 -6407 -3953 2006 -1314 -4174 -6247 -8295 -7478 -12920 -15028 -9528
2955 -9528 -1270 10 -4656 -7606 -7961 -8600 -5640 -1117 8749 7394 1601 -4101 35 1819 931 4352
$$ packed form
3063a3604J2878P511k739o911k713J012M55J552Q739M313J792q56j512k211o891
3048H15L947K109k628q95J02m951N357O926n403r843K855M498M0L122J047q23
3032F275N910m448o264l7J372K968R75J69n618n719K006L382L897J096k118k788
3016A058p35j241P74P250k95n569j0093Q284K325r360j464N952J094K543l096
3001b573k535q81l27L863J588j058k645j759k511M77P892P260P49l507j701J89
2985B521M431l324k479N933o435k071K92N444M344k886m181j849P89N726m431
2970A824m499L775n449m171K113K454N959l320k860k073k048Q17n442k108N500
2955i528Q258J280m666k950l55o39K960M523R866j355n793n702M136J784q88L421
$$ plain form
2939 4352 3378 -131 -5559 -7519 -9944 -8141 -6199 -9919 -12581 -6898 1736 2894 199 -2129 1037
2924 1037 2251 1463 -915 -6594 -12048 -3805 5852 8461 4074 -3527 -6523 -5163 -652 -2341 -7299
2909 -7299 -3030 -2005 -8283 -3673 -4234 -6500 -4231 1362 -3506 -4112 -2949 -1735 -6622 -2866 564
2894 564 -1529 -5237 -1613 -1664 -10312 -13216 -17316 -14246 -8457 -6159 -4286 -3485 -720 3092 4361 4166
2878 4166 6018 -1697 -5698 -7272 -6204 -8146 -13227 -9964 -3892 -1100 -4695 -10208 -8270 -9827 -9157
2863 -9157 -917 2281 3454 5138 7359 13948 14564 7169 7401 4902 7031 7580 6849 10585 14250 8395
2847 8395 5219 8963 10032 8510 2789 90 -122 -809 -7688 -4417 -836 -5322 -6272 -4860 -434 3583
2831 3583 2996 3864 4624 242 -1142 824 -3116 -6032 -11283 -7824 2782 3930 3987 4465 2906 -524
$$ packed form
2939D352r74l509n428j960k425J803J942l720k662N683Q634J158k695k328L166
2924A037J214p88k378n679n454Q243R657K609m387p601k996J360M511j689m958
2909g299M269J025o278M610n61k266K269N593m868o06J163J214m887L756L430
2894E64k093l708L624n1q648k904m100L070N789K298J873Q01K765L812J269j95
2878D166J852p715m001j574J068j942n081L263O072K792l595n513J938j557O70
2863i157Q240L198J173J684K221O589O16p395K32k499K129N49p31L736L665n855
2847H395l176L744J069j522n721k699k12o87o879L271L581m486r50J412M426M017
2831C583n87Q68P60m382j384J966l940k916n251L459J0606J148N7M78j559l430
$$ plain form
2815 -524 -783 -4416 -4994 -3957 -2798 -2349 2779 1705 1435 -4763 -1861 -3975 -5815 -4043 2566 2833
2799 2833 -1343 -2207 -7854 -10632 -3705 -4165 -7142 -3845 4111 457 -1384 -320 4607 3624 -1433 -5613
2783 -5613 -2058 1362 4839 7369 9130 7680 4952 3238 6366 4057 3093 8675 6898 1134 -4285
2768 -4285 -6073 -5418 -7996 -5767 3450 9201 8974 11244 5318 495 -3528 3257 3826 3903 5530 -1024
2752 -1024 -691 7224 -430 -2616 -3226 -9175 -13796 -12724 -8748 -3924 -4689 -6734 -5155 -2492 -3402 -924
2736 -924 4196 1515 -2542 -3079 4171 2699 -429 -381 1044 1134 -469 -4419 -3201 -4460 1481 1827 -2346
2719 -2346 -2568 -1321 1239 -4499 -7442 -827 428 2413 2514 1097 640 387 5218 6541 4709 324
2703 324 -3549 1493 3201 8027 11750 6534 -3257 -1052 1705 -4448 -6626 -6578 -7838 -3771 6652
$$ packed form
2815e24k59l633n78J037J159M49N128j074k70o198K902k114j840J772O609K67
2799B833m176q64n647k778O927m60k977L297P956l654j841J064M927r83n057m180
2783e613L555L420L477K530J761j450k728j714L128k309r64N582j777n764n419
2768d285j788O55k578K229R217N751k27K270n926m823m023O785N69P7J627o554
2752a024L33P915p654k186o10n949m621J072L976M824p65k045J579K663r10K478
2736i24N120k681m057n37P250j472l128M8J425R0j603l950J218j259N941L46m173
2719b346k22J247K560n738k943O615J255J985J01j417m57k53M831J323j832m385
2703C24l873N042J708M826L723n216r791K205K757o153k178M8j260M067J0423
$$ plain form
2688 6652 6308 836 1651 1649 2152 -1334 2479 6239 9586 13114 12809 8568 9740 9574 5995 4461 9601
2671 9601 6323 2458 6508 8776 7673 3533 3526 3497 -2995 -5481 -9408 -7386 -6351 1390 4247 2800
2655 2800 -495 -2173 -2787 -3527 -2532 927 1763 -3176 -4148 -2696 663 137 -1191 -6106 -11573 -10585 -6303
2638 -6303 -11310 -11133 -1212 7981 14697 13607 2414 -3031 -8081 -10683 -5154 -785 -919 1863 7046
2623 7046 6899 -135 -8871 -5345 -961 -5687 -10465 -10959 -6294 3827 10437 7879 6223 9918 10303
2608 10303 3943 -59 1819 6818 5195 2323 8513 2956 2120 6768 4441 2287 -661 -1345 139
2593 139 -787 131 9086 12598 6247 817 -2072 -3259 6180 6794 7431 -606 -489 -1461 -6436 -2558 -2101
2576 -2101 6602 10332 7752 1677 966 2535 -3711 639 98 -2086 -6968 -6397 -2775 -6126 -3462 -4175
$$ packed form
2688F652l44n472Q15kN03l486L813L760L347L528l05m241J172j66l579j534N140
2671I601l278l865M050K268j103m140pk9o492k486l927K022J035P741K857j447
2655B800l295j678o14p40R95L459Q36m939r72J452L359n26j328m915n467R88M282
2638f303n007J77R921R193O716j090j1193n445n050k602N529M369j34K782N183
2623G046j47p034q736L526M384m726m778m94M665J0121O610k558j656L695L85
2608A0303o360m002J878M999j623k872O190n557q36M648k327k154k948o84J484
2593A39r26R18Q955L512o351n430k889j187R439O14O37q037J17r72m975L878M57
2576b101Q703L730k580o075p11J569o246M350n41k184m882N71L622l351K664p13
$$ plain form
2560 -4175 -682 1005 -1812 -331 4681 2157 -2204 -3038 205 6613 2851 -311 -1252 -9251 -12879
2545 -12879 -10282 -12053 -14986 -15837 -7420 -2921 -677 -2340 169 3439 531 -4526 -3437 -6711 -6028
2530 -6028 -1512 -5596 -6493 -3647 -7007 -3731 871 -57 -3681 -2266 -4881 -2410 -6748 -9642 -10608 -6464
2514 -6464 1422 9078 9804 7493 5260 -3986 -11538 -8195 -4146 -2038 -2695 -1791 54 -353 -1739 -3324
2498 -3324 -1051 -226 -6705 -6291 -4921 -914 1786 1895 5495 6073 2449 -1836 -1754 -209 1622 3872
2482 3872 3441 6934 7624 6013 9710 8568 5261 -762 392 3387 2810 489 -5393 -12264 -12529 -8184
2466 -8184 -5440 627 1501 -1649 -1094 5177 4857 -120 -523 -786 647 -1869 -3900 -3292 -832 -1889
2450 -1889 -3225 929 4997 7935 9024 5066 -2261 -2587 -611 1960 2310 6937 8717 7130 -1833
$$ packed form
2560d175L493J687k817J481N012k524m361q34L243O408l762l162r41p999l628
2545a2879K597j771k933q51Q417M499K244j663K509L270k908n057J089l274O83
2530f028M516m084q97K846l360L276M602r28l624J415k615K471m338k894r66M144
2514f464P886P656P26k311k233r246p552L343M049K108o57R04J845m07j386j585
2498c324K273Q25o479M14J370M007K700J09L600N78l624m285Q2J545J831K250
2482C872m31L493O90j611L697j142l307o023J154K995n77k321n882o871k65M345
2466h184K744O067Q74l150N55O271l20m977m03k63J433k516k031O08K460j057
2450a889j336M154M068K938J089l958p327l26J976K571L50M627J780j587q963
$$ plain form
2435 -1833 -4167 -4786 -1800 2088 3585 1332 -2343 2486 2984 -1926 -5096 -5996 -1237 1954 1455 2170
2419 2170 -1099 -118 280 -4029 2547 8353 6662 4443 881 -4912 -6338 -9300 -9731 -5550 -5895 -7752
2403 -7752 -1322 7044 6038 -605 -4710 -3016 1617 5790 1715 747 7814 4632 4808 10142 9356 9467
2387 9467 9277 9333 7239 -760 -5159 -4249 -939 744 -3837 -5869 -6818 -6202 -5416 -4125 -2867 -6500 -5848
2370 -5848 -982 112 1706 7650 8931 1835 843 2555 -731 -1951 -4822 -7429 -3041 -1581 -409
2355 -409 783 81 -2269 -2506 619 5089 5934 1348 -2686 -6255 -677 5508 11025 7548 -1052 504
2339 504 1952 1948 537 442 -2730 -5865 749 2258 2886 2847 2603 1811 5347 6589 5068 4253 462 -2590
2321 -2590 1672 -1573 3523 8019 9918 5199 3136 1329 2423 4991 10765 14499 13563 6819 1680
$$ packed form
2435a833k334o19K986L888J497k253l675M829M98m910l170r00M759L191m99P15
2419B170l269R81L98m309O576N806j691k219l562n793j426k962m31M181l45j857
2403g752O430Q366j006o643m105J694M633M173m075r68P067l182J76N334p86J11
2387I467j90N6k094p999m399R10L310J683m581k032r49O16P86J291J258l633O52
2370e848M866J094J594N944J281p096r92J712l286j220k871k607M388J460J172
2355d09J192p02k350k37L125M470Q45m586m034l569N578O185N517l477q600J556
2339E04J448mj411r5l172l135O614J509O28l9k44p92L536J242j521q15l791l052
2321b590M262l245N096M496J899m719k063j807J094K568N774L734r36o744n139
$$ plain form
2306 1680 3253 3413 -1800 -6772 -6118 -3376 -10278 -10381 -4123 -1472 1193 -3171 -6596 -11341 -13149 -5729
2290 -5729 3427 7892 1390 3834 6878 8174 10080 5665 1906 -2260 -941 2464 7687 9019 5676
2275 5676 2212 4935 2652 179 -5774 -5214 -2260 3905 7031 8164 7771 9606 8527 2943 4647
2260 4647 290 -5136 -2760 -2588 -554 -1121 -1642 -1243 4222 5955 -2793 -11837 -7066 4369 6193 10425
2244 10425 11820 12850 15835 12686 10010 5037 -204 1421 3792 155 -3706 -3249 -3609 750 1235
2229 1235 -880 -1026 551 -580 3517 5779 5457 4098 3121 2940 1461 -1133 2455 7011 198 -6934
2213 -6934 -2461 7593 15658 14349 13573 14798 7953 9118 9958 4534 -1839 842 -3259 -38 4474
2198 4474 3947 630 439 5115 4816 -392 -196 1451 -4648 -7659 -3665 4152 4775 1561 -4117 -7926
$$ packed form
2306A680J573J60n213m972O54K742o902j03O258K651K665m364l425m745j808P420
2290e729R156M465o502K444L044J296J906m415l759m166J319L405N223J332l343
2275E676l464K723k283k473n953N60K954O165L126J133l93J835j079n584J704
2260D647m357n426K376J72K034n67n21L99N465J733q748r044M771J1435J824M232
2244A0425J395J030K985l149k676m973n241J625K371l637l861M57l60M359M85
2229A235k115j46J577j131M097K262l22j359r77j81j479k594L588M556o813p132
2213f934M473J0054Q065j309p76J225o845J165Q40n424o373K681m101L221M512
2198D474n27l317j91M676k99n208J96J647o099l011L994P817O23l214n678l809
$$ plain form
2182 -7926 98 4066 2340 955 5085 5472 4293 1314 -3421 -11660 -15246 -9870 -2236 793 -6144
2167 -6144 -5656 -651 -1675 -7701 -5174 -911 -4482 -7354 -5979 112 3625 3757 2698 297 1066 923
2151 923 -50 -6591 337 12808 10315 2756 1085 4571 4836 1854 -1088 -1651 5717 5289 1224 3047
2135 3047 -1751 4082 7598 2093 -9186 -10002 -7705 -8346 -2894 -6547 -3504 266 1513 -3487 -7976
2120 -7976 -5581 -6449 -10796 -8210 -3821 -10918 -13690 -6439 -406 -131 -6403 -5102 -4286 1886 -4962 -6915
2104 -6915 179 1425 258 808 5250 5473 3292 1620 3034 1148 2642 163 396 6 -2145 -1639
2088 -1639 -44 -9890 -9387 -3293 -4278 -377 2113 2428 4191 2915 -4224 -177 -1085 -2996 -2405 -3630
2072 -3630 1613 4036 1996 -1633 -5179 -3121 2109 3177 1463 -4381 -8937 -12543 -4521 -5984 -9536
$$ packed form
2182g926Q024L968j726j385M130L87j179k979m735q239l586N376P634L029o937
2167f144M88N005j024o026K527M263l571k872J375O091L513J32j059k401P69j43
2151I23r73o541O928J2471k493p559j671L486K65k982k942n63P368m28m065J823
2135C047m798N833L516n505j1279q16K297o41N452l653L043L770J247n000m489
2120g976K395q68m347K586M389p097k772P251O033K75o272J301Q16O172o848j953
2104f915P094J246j167N50M442K23k181j672J414j886J494k479K33l90k151N06
2088a639J595r846N03O094r85L901K490L15J763j276p139M047r08j911N91j225
2072c630N243K423k040l629l546K058N230J068j714n844m556l606Q022j463l552
$$ plain form
2057 -9536 -4357 -165 6532 7964 5372 6650 6945 4446 -3707 -8412 -6621 -6982 -3204 2156 767
2042 767 2176 9129 11219 4711 1614 5985 6328 882 -2986 -788 -332 5779 5243 -1355 -4150 -2119
2026 -2119 -3518 -5122 -1508 6782 3204 1779 1255 -2487 -200 978 -3250 -6402 -3496 -3820 -2568
2011 -2568 -3043 -4603 -6488 258 257 3880 4048 6587 8923 7706 9202 9865 8005 6678 5008 5119 11673
1994 11673 8627 -1617 -2868 -277 4244 2844 -4478 -4350 -3256 -2588 -4793 -8188 -13154 -9869 -3609
1979 -3609 -1013 3177 4531 2318 1641 5376 7175 7355 4098 607 874 517 2273 6733 1716 -4256
1963 -4256 -10877 -7029 -4521 -4564 -57 2368 -1055 -2301 2559 6524 2773 4313 2103 6931 8488
1948 8488 5902 6009 11412 18575 13829 9166 13638 13729 7614 4978 6512 14820 18152 12808 13444 9526
$$ packed form
2057i536N179M192O697J432k592J278K95k499q153m705J791l61L778N360j389
2042G67J409O953K090o508l097M371L43n446l868K198M56O111n36o598k795K031
2026b119j399j604L614Q290l578j425n24l742K287J178m228l152K906l24J252
2011b568m75j560j885O746jL623J68K539K336j217J496O63j860j327j670J11O554
1994A1673l046j0244j251K591M521j400p322J28J094O68k205l395m966L285O260
1979c609K596M190J354k213o77L735J799J80l257l491K67l57J756M460n017n972
1963d256o621L848K508m3M507K425l423j246M860L965l751J540k210M828J557
1948H488k586J07N403P163m746m663M472R1o115k636J534Q308L332n344O36l918
$$ plain form
1932 9526 8415 3713 58 -5810 -7764 -4852 -4941 -8339 -5842 -3625 -5698 -9896 -9891 -2242 -2351 -3616
1916 -3616 -5085 -6541 -9382 -5791 -770 4052 1744 1921 1760 3776 6758 4268 244 -6205 -9270
1901 -9270 -12543 -4937 674 853 -7929 -14539 -6420 -4934 -6731 -2169 -2113 -2509 -1011 -1510 -3112 -5622
1885 -5622 -8572 -6071 -10768 -11193 -10734 -11097 -6832 -5497 -6903 -5478 -7563 -10255 -8201 -5448 -4405 -6577
1869 -6577 -7714 -9287 -3790 -1588 -878 -422 -3112 -2418 -6882 -8685 -2514 802 -1246 -255 482 803
1853 803 5032 5536 3636 2636 6752 2485 1456 -4090 -3938 117 805 1146 -748 353 2445 2437 -2800
1836 -2800 -1561 -118 616 6276 10998 5152 -2028 -1366 -3824 -1206 -2011 -5647 1647 2935 -184 -1573
1820 -1573 566 6566 8642 7157 1894 -3654 -140 4281 742 -3265 1611 7617 11026 11749 13858
$$ packed form
1932I526j111m702l655n868j954K912q9l398K497K217k073m198NP649j09j265
1916c616j469j456k841L591N021M822k308J77j61K016K982k490m024o449l065
1901i270l273P606N611J79q782o610Q119J486j797M562N6l96J498m99j602k510
1885e622k950K501m697m25M59l63M265J335j406J425k085k692K054K753J043k172
1869f577j137j573N497K202P10M56k690O94m464j803O171L316k048R91P37L21
1853H03M229N04j900j000M116m267j029n546J52M055O88L41j894J101K092qn237
1836b800J239J443P34N660M722n846p180O62k458K618q05l636P294J288l119j389
1820a573K139O000K076j485n263n548L514M421l539m007M876O006L409P23K109
$$ plain form
1805 13858 11359 6917 380 2977 4114 8243 12717 13902 10364 9649 6732 10244 11383 7141 6739
1790 6739 -458 -3095 6242 16133 15970 6053 2395 2226 3366 -283 -3766 -1414 -3772 -6324 -4250
1775 -4250 3185 8231 3425 -2477 -4062 -4523 -5120 -6044 -11295 -18870 -17336 -9254 -5468 -1992 -4064 -11196
1759 -11196 -12397 -13251 -4356 -499 798 712 -3801 -6377 -1001 -2230 -3467 -2058 -3846 -5891 -7316
1744 -7316 -3194 820 -224 6207 4179 1404 -1408 -6821 -5343 -8010 -6490 -2606 -837 -8258 -7025
1729 -7025 286 4192 3874 -6072 -7039 -6194 -9351 -11632 -7911 -3982 -1011 -7330 -8946 -10989 -7862 -6540
1713 -6540 -12695 -8739 1257 3578 940 971 -2036 -3298 -2007 -3202 -6348 -4635 -4232 5457 4264 -3032
1697 -3032 -3124 -3413 -3221 3709 7395 -562 -379 4091 7614 6147 1360 2368 3193 2129 -2724 -8117
$$ packed form
1805A3858k499m442o537K597J137M129M474J185l538p15k917L512J139m242m02
1790F739p197k637R337R891j63r917l658j69J140l649l483K352k358k552K074
1775d250P435N046m806n902j585m61n97r24n251p575J534Q082L786L476k072p132
1759a1196j201q54Q895L857J297q6m513k576N376j229j237J409j788k045j425
1744g316M122M014j044O431k028k775k812n413J478k667J520L884J769p421J233
1729g025P311L906l18r946r67Q45l157k281L721L929K971o319j616k043L127J322
1713f540o155L956R996K321k638L1l007j262J291j195l146J713M03R689j193p296
1697c032r2k89J92O930L686p957J83M470L523j467m787J008Q25j064m853n393
$$ plain form
1681 -8117 -7561 -3779 -1070 -3014 474 5815 3742 -942 -37 -6290 -1222 -2927 -6504 -12028 -11117 -5031
1665 -5031 -466 3874 3464 7023 4066 877 4660 1383 -5766 -3013 1967 6851 8016 5984 1893
1650 1893 3930 6023 126 -1454 -2666 -1163 504 -5516 -13716 -11129 -1865 1630 -3955 -4541 -3813
1635 -3813 -2385 2228 276 1072 8625 1298 -8328 -7504 -5586 -2150 -2648 -1297 -445 -7026 -5435 -3122
1619 -3122 -1453 -444 -1513 5282 2537 -3640 -6885 -7080 -5866 -4061 -7837 -7423 -1794 -2032 -100 -9779
1603 -9779 -15715 -18893 -16365 -16416 -9436 -7539 -8282 -93 4635 -1080 848 3247 -68 -1449 -6490 -7574
1587 -7574 -4995 -2413 -2930 -6675 -3393 1031 -4505 -10626 -11232 -12477 -10122 -5525 -5791 -3653 302 1072
1571 1072 -846 286 -950 -2053 -973 1790 5401 1350 -774 -10 634 2226 3360 -2377 -3924
$$ packed form
1681h117N56L782K709j944L488N341k073m684R05o253N068j705l577n524R11O086
1665e031M565M340m10L559k957l189L783l277p149K753M980M884J165k032m091
1650A893K037K093n897j580j212J503J667o020q200K587R264L495n585n86P28
1635c813J428M613j952P96P553p327r626Q24J918L436m98J351Q52o581J591K313
1619c122J669J009j069O795k745o177l245j95J214J805l776M14N629k38J932r679
1603i779n936l178K528n1O980J897p43Q189M728n715J928K399l315j381n041j084
1587g574K579K582n17l745L282M424n536o121o06j245K355M597k66K138L955P70
1571A072j918J132j236j103J080K763L611m051k124P64O44J592J134n737j547
$$ plain form
1556 -3924 -4058 -6919 -2930 -648 681 4597 3099 3411 10922 10605 1903 -4274 -8148 -7202 -31 12261
1540 12261 13374 12113 9070 -3383 -3278 816 3161 -373 4032 4038 -1643 -2053 1117 -2769 -1379 2375
1524 2375 4793 -1126 3375 1976 -1079 2882 -1141 -1154 858 2206 8890 4559 -1640 -3175 -5866
1509 -5866 -8228 -7389 1137 -2344 -4059 -7480 -5843 2620 5977 2421 -2320 -1237 3953 7012 2823
1494 2823 -308 1411 -1518 -393 734 2564 3624 -199 -5813 -8916 -2890 -6190 -11619 -11211 -10147
1479 -10147 -11583 -20636 -15597 -9033 -216 6488 6648 2755 -1804 -1610 2408 3186 2777 267 -6199 -11524
1463 -11524 -12473 -13214 -8977 -12966 -10330 -3645 5717 -1089 -5003 -1739 4278 761 -6229 -4911 -3179
1448 -3179 1027 2141 1706 319 -3431 -4171 -273 3678 4385 1897 -2306 -1249 -635 2526 977 -1244
$$ packed form
1556c924j34k861L989K282J329L916j498L12P511l17q702o177l874R46P171J2292
1540A2261J113j261l043j2453J05M094K345l534M405On681m10L170l886J390L754
1524B375K418n919M501j399l055L961m023j3K012J348O684m331o199j535k691
1509e866k362Q39Q526l481j715l421J637Q463L357l556m741J083N190L059m189
1494B823l131J719k929J125J127J830J060l823n614l103O026l300n429M08J064
1479a0147j436r053N039O564Q817O704J60l893m559J94M018P78m09k510o466n325
1463a1524r49p41M237l989K636O685R362o806l914L264O017l517o990J318J732
1448c179M206J114m35j387l750p40L898L951P07k488m203J057O14L161j549k221
$$ plain form
1432 -1244 3253 3682 1688 90 4403 7341 10463 8993 1341 -446 577 4321 9901 5434 5443 895
1416 895 -449 494 -2566 -1862 358 -670 -443 3132 788 1846 3911 549 -6056 -7896 -807 7517
1400 7517 3484 2719 -234 -1036 -1056 2019 4652 1114 -4412 -3980 5768 4345 1225 -216 -85 -832 -627
1383 -627 3071 2400 4720 9294 4674 7805 7760 7381 10570 11377 9805 9171 2465 -1486 2278 7879 10891
1366 10891 11752 3747 -5210 -6741 -2036 1098 3891 4249 3048 -570 -81 -1993 171 1863 2908
1351 2908 81 -352 -981 3191 6321 3896 5880 3743 208 -2762 -4150 -4930 -9904 -4386 207 4500
1335 4500 8187 5849 5478 6639 2594 -3281 -1188 192 -229 4875 7853 10689 5124 -2788 -7545
1320 -7545 -7759 -3512 67 1710 3265 9973 13868 15135 6695 4623 3652 2416 668 -1594 -5029
$$ packed form
1432a244M497M29j994j598M313K938L122j470p652j787J023L744N580m467Rm548
1416H95j344R43l060P04K220j028K27L575k344J058K065l362o605j840P089Q324
1400G517m033p65k953q02k0L075K633l538n526M32R748j423l120j441J31p47K05
1383f27L698o71K320M574m620L131m5l79L189Q07j572o34o706l951L764N601L012
1366A0891Q61q005q957j531M705L134K793L58j201l618M89j912K164J692J045
1351B908k827m33o29M172L130k425J984k137l535k970j388p80m974N518M593M293
1335D500L687k338l71J161m045n875K093J380m21N104K978K836n565p912m757
1320g545k14M247L579J643J555O708L895J267q440k072r71j236j748k262l435
$$ plain form
1305 -5029 -2399 4089 7214 3993 -5127 -9040 -5611 1463 4953 3054 2276 3414 8650 3915 -3070
1290 -3070 -6522 -3985 5104 12343 9619 3732 3923 2315 -138 -479 1924 454 -760 1578 780 -4611
1274 -4611 -6426 -4012 -4879 -4673 -3067 2179 -747 -1934 2395 2002 -8733 -10850 -10308 -2634 7216 10340
1258 10340 10421 10309 10116 9009 4784 7086 1871 2381 5768 6563 5338 5186 4150 4744 6834 6734 5135
1241 5135 2045 1324 -3527 -659 2653 250 -4897 -2466 2709 3990 4524 2460 -626 566 4901
1226 4901 9437 7482 4182 1872 -3657 -4584 3446 1662 730 1822 -4577 -10562 -5346 -8433 -10783
1211 -10783 -7324 -5391 -3104 4444 3986 2504 7614 8199 6802 1505 2012 7501 5595 2845 9699
1196 9699 13867 4584 -1065 -201 1174 5165 1420 1639 2221 3195 7016 9444 9505 -407 -3294 -2109
$$ packed form
1305e029K630O488L125l221r120l913L429P074L490j899p78J138N236m735o985
1290c070l452K537R089P239k724n887J91j608k453l41K403j470j214K338p98n391
1274d611j815K414q67K06J606N246k926j187M329l93j0735k117N42P674R850L124
1258A0340Q1j12j93j107m225K302n215N10L387P95j225j52j036N94K090j00j599
1241E135l090p21m851K868L312k403n147K431N175J281N34k064l086J192M335
1226D901M536j955l300k310n529r27Q030j784r32J092o399n985N216l087k350
1211a0783L459J933K287P548m58j482N110N85j397n297N07N489j906k750O854
1196I699M168r283n649Q64J375L991l745K19N82R74L821K428O1r912k887J185
$$ plain form
1180 -2109 5100 2700 2269 3113 -2343 -4121 -4916 -4649 -6287 -9976 -10396 -7164 741 1663 591 -1970
1164 -1970 -9677 -9279 -4618 4353 9845 1869 -4950 -8156 -4006 645 5027 3013 -895 3661 -464
1149 -464 -4967 -2622 -4388 -6280 -4522 -6529 -4942 2509 4674 7042 8435 12048 13338 6223 7630
1134 7630 8665 9689 7062 7974 8696 4023 5068 5179 6776 1500 1590 1243 5854 -931 -3414 -5934
1118 -5934 -8886 -7755 -1875 -4223 -6964 -3711 -3636 -5766 -8327 -6456 1070 4232 830 1729 6027 3349
1102 3349 654 -2817 -2462 -704 679 -553 -4253 -234 8788 6243 5050 3228 3702 6754 4798
1087 4798 3137 -5127 -10157 -7245 -5688 -4538 -5023 671 4132 573 332 499 -529 562 957 3281
1071 3281 5869 7116 5776 7875 6885 2759 -927 -8852 -12158 -7472 -4371 -5393 -5327 -5396 -5595 -3553
$$ packed form
1180b109P209k400m31Q44n456j778p95K67j638l689m20L232P905R22j072k561
1164a970p707L98M661Q971N492p976o819l206M150M651M382k014l908M556m125
1149d64m503K345j766j892J758k007J587P451K165K368J393L613J290p115J407
1134G630J035J024k627R12P22m673J045J11J597n276R0l47M611o785k483k520
1118e934k952J131N880k348k741L253P5k130k561J871P526L162l402Q99M298k678
1102C349k695l471L55J758J383j232l700M019R022k545j193j822M74L052j956
1087D798j661q264n030K912J557J150m85N694L461l559k41J67j028J091L95K324
1071C281K588J247j340K099r90m126l686p925l306M686L101j022O6o9j99K042
$$ plain form
1055 -3553 192 302 1562 1973 -295 1879 6505 5761 8049 9001 4500 -5789 -6354 -3708 -836 2238
1039 2238 277 -3838 -7258 -4836 -3876 -638 1939 -2044 -3341 -307 640 5413 6298 3402 2169 7013
1023 7013 11001 13572 18854 12617 3247 5504 6005 5440 8355 11545 8082 4214 1186 -1075 1977
1008 1977 3947 966 -2044 5019 5124 1097 2398 -829 -485 -1093 -3276 -5459 -2111 -4189 -7732 -8616
992 -8616 -2804 -1825 130 6038 5532 6596 6843 7055 9836 7085 317 1977 6820 3380 992 2160
976 2160 961 -4737 -3311 -4216 -3130 -2940 -4427 -1374 -1017 3028 5688 8390 4887 3500 6771 830
960 830 1041 8730 6687 6521 4237 2262 -85 3971 4484 1568 1159 6810 5876 5028 5449 2486 -1143
$$ packed form
1055c553L745J10J260M11k268K174M626p44K288R52m501j0289n65K646K872L074
1039B238j961m115l420K422R60L238K577l983j297L034R47M773Q85k896j233M844
1023G013L988K571N282o237r370K257N01n65K915L190l463l868l028k261L052
1008A977J970k981l010P063J05m027J301l227L44o08k183k183L348k078l543q84
992h616N812R79J955N908n06J064K47K12K781k751o768J660M843l440k388J168
976B160j199n698J426r05J086J90j487L053L57M045K660K702l503j387L271n941
960H30K11P689k043j66k284j975k347M056N13k916m09N651r34q48M21k963l629
$$ [...]
##END NTUPLES=NMR SPECTRUM
##END=
