##TITLE=Analysis number 315612
Compound Code cc 07401
Project Code adrs
Chemist Name fudan
##JCAMPDX= 6.0         $$ Bruker NMR JCAMP-DX V2.0
##DATA TYPE= NMR SPECTRUM
##DATA CLASS= NTUPLES
##ORIGIN= Bruker BioSpin GmbH
##OWNER= NMR
$$ XWIN-NMR		Version 3.5
$$ Thu Nov 24 15:07:23 2005 GMT Standard Time (UT+0h)  MAYBRIDGE\NMR@NMR_250MHZ
##.OBSERVE FREQUENCY= 250.131544655141
##.OBSERVE NUCLEUS= ^1H
##.ACQUISITION MODE= SIMULTANEOUS (DQD)
##.ACQUISITION SCHEME= undefined
##.AVERAGES= 16
##.DIGITISER RES= 18
##SPECTROMETER/DATA SYSTEM= dpx250
##.PULSE SEQUENCE= zg30
##.SOLVENT NAME= DMSO
##.SHIFT REFERENCE= (INTERNAL, DMSO, 0, 16.522)
##AUDIT TRAIL= $$ (NUMBER, WHEN, WHO, WHERE, WHAT)
$$ ##TITLE= Audit trail, XWIN-NMR		Version 3.5
$$ ##JCAMPDX= 5.01
$$ ##ORIGIN= Bruker BioSpin GmbH
$$ ##OWNER= NMR
$$ C:\u/data/dgb/nmr/ADRS/12940/pdata/1/auditp.txt
$$ ##AUDIT TRAIL=  $$ (NUMBER, WHEN, WHO, WHERE, WHAT)
(   1,<2005-11-24 15:07:00.77 +000>,<MAYBRIDGE\NMR>,<NMR_250MHZ>,
      <created by zg, POWCHK disabled, PULCHK disabled
       configuration hash MD5:
       62 19 C7 07 E1 42 D1 B7 37 6C 3D D0 77 39 F9 E6
       data hash MD5: 64K
       A0 B8 BA BD B6 DB 0C 6B 15 25 B3 9F 81 26 FD BF>)
(   2,<2005-11-24 15:07:13.63 +000>,<MAYBRIDGE\NMR>,<NMR_250MHZ>,
      <Start of raw data processing
       ef LB = 0.3 FT_mod = 6 PKNL = 1 SI = 32K 
       data hash MD5: 32K
       27 A4 84 0E C7 C3 7D C8 F8 C9 36 32 97 2D C5 96>)
(   3,<2005-11-24 15:07:15.56 +000>,<MAYBRIDGE\NMR>,<NMR_250MHZ>,
      <apk 
       data hash MD5: 32K
       AD 3A 1E BA FB B8 DD 7C 0E EA B0 B5 7E 15 A1 C7>)
(   4,<2005-11-24 15:07:16.37 +000>,<MAYBRIDGE\NMR>,<NMR_250MHZ>,
      <abs ABSG = 5 
       data hash MD5: 32K
       8C 90 4B 6C 42 04 94 3E D1 90 59 3C E6 39 F8 B5>)
$$ ##END=
$$ 
$$ hash MD5
$$ 39 F7 30 56 B3 1D A8 66 0E 34 DD 7B BF F0 1A E9
##$RELAX= 
##$RELAX= 
##$RELAX= 
##$RELAX= 
##$RELAX= 
##$RELAX= 
##$RELAX= 
$$ Bruker specific parameters
$$ --------------------------
##$DU= <C:\u>
##$EXPNO= 12940
##$NAME= <ADRS>
##$PROCNO= 1
##$TYPE= <nmr>
##$USER= <dgb>
##$AMP= (0..31)
100 100 100 100 100 100 100 100 100 100 100 100 100 100 100 100 100 100 
100 100 100 100 100 100 100 100 100 100 100 100 100 100 
##$AQSEQ= 0
##$AQ_mod= 3
##$AUNM= <au_zg>
##$AUTOPOS= <40 >
##$BF1= 250.13
##$BF2= 250.13
##$BF3= 250.13
##$BF4= 250.13
##$BF5= 500.13
##$BF6= 500.13
##$BF7= 500.13
##$BF8= 500.13
##$BYTORDA= 1
##$CFDGTYP= 0
##$CFRGTYP= 5
##$CHEMSTR= <none>
##$CNST= (0..31)
1 1 145 1 1 1 1 1 1 1 1 1 1 1 1 1 1 1 1 1 1 1 1 1 1 1 1 1 1 1 1 1 
##$CPDPRG= <>
##$CPDPRG1= <>
##$CPDPRG2= <>
##$CPDPRG3= <>
##$CPDPRG4= <mlev>
##$CPDPRG5= <mlev>
##$CPDPRG6= <mlev>
##$CPDPRG7= <mlev>
##$CPDPRG8= <mlev>
##$CPDPRGB= <>
##$CPDPRGT= <>
##$D= (0..31)
0 1 0 0 0 0 0 0 0 0.06 0 0 0 0 0 0 0.0002 0 0 0 0 0 0 0 0 0 0 0 0 0 0 
0 
##$DATE= 1132844819
##$DBL= (0..7)
120 120 120 120 120 120 120 120 
##$DBP= (0..7)
150 150 150 150 150 150 150 150 
##$DBP07= 0
##$DBPNAM0= <>
##$DBPNAM1= <>
##$DBPNAM2= <>
$$ [...]
##$SUBNAM7= <"">
##$SUBNAM8= <"">
##$SUBNAM9= <"">
##$SW= 20.6930455092707
##$SWIBOX= (0..15)
0 0 3 0 0 0 0 0 0 0 0 0 0 0 0 0 
##$SW_h= 5175.983436853
##$TD= 65536
##$TD0= 1
##$TE= 294.16
##$TE2= 300
##$TE3= 300
##$TEG= 300
##$TL= (0..7)
0 120 120 120 120 120 120 120 
##$TP= (0..7)
150 150 150 150 150 150 150 150 
##$TP07= 0
##$TPNAME0= <>
##$TPNAME1= <>
##$TPNAME2= <>
##$TPNAME3= <>
##$TPNAME4= <>
##$TPNAME5= <>
##$TPNAME6= <>
##$TPNAME7= <>
##$TPOAL= (0..7)
0.5 0.5 0.5 0.5 0.5 0.5 0.5 0.5 
##$TPOFFS= (0..7)
0 0 0 0 0 0 0 0 
##$TUNHIN= 0
##$TUNHOUT= 0
##$TUNXOUT= 0
##$USERA1= <user>
##$USERA2= <user>
##$USERA3= <user>
##$USERA4= <user>
##$USERA5= <user>
##$V9= 5
##$VALIST= <valist>
##$VCLIST= <CCCCCCCCCCCCCCC>
##$VD= 0
##$VDLIST= <DDDDDDDDDDDDDDD>
##$VPLIST= <PPPPPPPPPPPPPPP>
##$VTLIST= <TTTTTTTTTTTTTTT>
##$WBST= 1024
##$WBSW= 4
##$XGAIN= (0..3)
0 0 0 0 
##$XL= 0
##$YL= 0
##$YMAX_a= 246234
##$YMIN_a= -289312
##$ZGOPTNS= <>
##$ZL1= 120
##$ZL2= 120
##$ZL3= 120
##$ZL4= 120
##$ABSF1= 16.522
##$ABSF2= -4.171173
##$ABSG= 5
##$ABSL= 3
##$ALPHA= 0
##$AQORDER= 0
##$ASSFAC= 0
##$ASSFACI= 0
##$ASSFACX= 0
##$ASSWID= 0
##$AUNMP= <proc_1d>
##$AZFE= 0.1
##$AZFW= 0.1
##$BCFW= 0
##$BC_mod= 0
##$BYTORDP= 0
##$COROFFS= 0
##$CY= 12.5
##$DATMOD= 1
##$DC= 0
##$DFILT= <>
##$DTYPP= 0
##$F1P= 14.0000005364418
##$F2P= -0.99999901652339
##$FCOR= 0.5
##$FTSIZE= 32768
##$FT_mod= 6
##$GAMMA= 0
##$GB= 0
##$INTBC= 1
##$INTSCL= 1
##$ISEN= 128
##$LB= 0.3
##$LEV0= 0
##$LPBIN= 0
##$MAXI= 10000
##$MC2= 0
##$MEAN= 0
##$ME_mod= 0
##$MI= 0
##$NCOEF= 0
##$NC_proc= -5
##$NLEV= 6
##$NOISF1= 0
##$NOISF2= 0
##$NSP= 0
##$NTH_PI= 0
##$NZP= 0
##$OFFSET= 16.522
##$PC= 1
##$PHC0= 70.23238
##$PHC1= 22.21229
##$PH_mod= 1
##$PKNL= yes
##$PPARMOD= 0
##$PSCAL= 4
##$PSIGN= 0
##$REVERSE= no
##$SF= 250.13
##$SI= 32768
##$SIGF1= 0
##$SIGF2= 0
##$SINO= 400
##$SIOLD= 32768
##$SREGLST= <1H.DMSO>
##$SSB= 0
##$STSI= 32768
##$STSR= 0
##$SW_p= 5175.98343685301
##$SYMM= 0
##$S_DEV= 0
##$TDeff= 65536
##$TDoff= 0
##$TI= <Analysis number 999999
Compound Code 99
Book Reference 9
Project Code 9>
##$TILT= no
##$TM1= 0
##$TM2= 0
##$TOPLEV= 0
##$USERP1= <user>
##$USERP2= <user>
##$USERP3= <user>
##$USERP4= <user>
##$USERP5= <user>
##$WDW= 1
##$XDIM= 32768
##$YMAX_p= 499077427
##$YMIN_p= -1006017
$$ End of Bruker specific parameters
$$ ---------------------------------
##NTUPLES= NMR SPECTRUM
##VAR_NAME=  FREQUENCY,     SPECTRUM/REAL,   SPECTRUM/IMAG
##SYMBOL=    X,             R,               I
##VAR_TYPE=  INDEPENDENT,   DEPENDENT,       DEPENDENT
##VAR_FORM=  AFFN,          ASDF,            ASDF
##VAR_DIM=   32768,         32768,           32768
##UNITS=     HZ,            ARBITRARY UNITS, ARBITRARY UNITS
##FACTOR=    0.157963299565203, 1,           1
##FIRST=     4132.6476996994, 0,             0
##LAST=      -1043.33573715361, 0,           0
##MIN=       -1043.33573715361, -1006017,    0
##MAX=       4132.6476996994, 499077427,     0
$$ Real data points
##PAGE= N=1
##DATA TABLE= (X++(R..R)), XYDATA
$$ [...]
26254a30585L6123O5839l9962o2439o8846J90516L10163L7170k25358N1469M3960
26243B08050j70584J12016K73899J12158k82989j20309J64131k7254j34275O8462
26233B03305k1899k53170L20414o6835n7042K75494L2954l13165J93174L5731
26223C48961J05275j00874l49461l73472j71189J92415J28760J21877J90706m9969
26213D3029l8495l08463j21927p74L61357N5310p8346j90859m8399m9251k5052
26202d01870L7227K1794K8393J52803J04810l4241J48631q2361n3410J66304n486
26191H2594k0324k8621p2705o7722K54879K0888m5338j31579j7804J78560p0778
26180H2050q3858J62801N5953k25642j80708j03683q9574J99815Q3177j1284J73150
$$ plain form
26254 -130585 -94462 -28623 -68585 -131024 -199870 -9354 300809 337979 112621 164090 208050
26243 208050 37466 149482 423381 535539 252550 132241 296372 269118 134843 203305
26233 203305 181406 -71764 248650 181815 124773 400267 433221 120056 313230 348961
26223 348961 454236 353362 3901 -369571 -540760 -348345 -219585 -97708 92998 43029
26213 43029 4534 -303929 -425856 -426630 -65273 -9963 -88309 -279168 -327567 -376818 -401870
26202 -401870 -364643 -342849 -314456 -161653 -56843 -91084 57547 -24814 -78224 88080 82594
26191 82594 62270 33649 -39056 -106778 148101 168989 123651 -7928 -25732 152828 82050
26180 82050 -1808 160993 216946 -8696 -189404 -293087 -382661 -182846 -99669 -110953 62197
26169F2197K51489n7334p5458k06823L867O7838M7996Q6355k4918j35944J10642
26158A29907k19718n3711M182K8906J90176n2859q0779j14129K68175J86364l00252
26147a3738j30806J13427Q6797l8608M2589J12263j44904l88783j6052K89969
26137h7846j17794j41302J74551K39400M7589Q5911N7479q0326j49170N3488P4147
26126A56127R2891j70962o9399J78546k42977k61043j98489O1726K8218J13351
26116c12011O6071j02310n87K30716k6161l2151k42051P6653J45488M8467j85940
26105c33816K9857P6131K0655k19666j1184J21740o1226J11842N8542J50806J31665
26094G5346K37914K0979k36378j89400j72045j44284J91729K25792K7084j31104
$$ plain form
26169 62197 313686 256352 180894 -25929 -22062 45776 93772 180127 155209 19265 129907
26158 129907 -89811 -143522 -139340 -110434 79742 26883 -53896 -168025 100150 286514 -13738
26147 -13738 -144544 -31117 55680 17072 59661 171924 27020 -361763 -377815 -87846
26137 -87846 -205640 -346942 -172391 67009 114598 200509 257988 177662 28492 81980 156127
26126 156127 249018 78056 8657 187203 -55774 -316817 -515306 -453580 -425362 -312011
26116 -312011 -245940 -348250 -348837 -118121 -144282 -176433 -418484 -341831 -196343 -147876 -333816
26105 -333816 -303959 -227828 -207173 -426839 -438023 -316283 -377509 -265667 -207125 -56319 75346
26094 75346 313260 334239 97861 -91539 -263584 -407868 -216139 9653 36737 -94367
26084i4367K08620J94047j40843J64890q6232l71974m06491k349m0294N3808K33745
26073b87440r994n0048j0252m7356J70673O7973R0588q1037j08637R6968K61709
26062I3147K2171o1035J85806J8145r8710L2713p2675p4477j60358J6359L10324
26051B11410N0732k8583j05506k53514o8711P1051M6326J90036K12297L2141n6467
26040C01212l23115r1071j2738R5045j16412J38798j54091j04910R8419J96250
26030B7387K69857k82790n10870j25535k8611J15278k31486L2813L61642P9015
26020b93300J10952n2987l1885k9899R2966K46455K76270J79762q403o1004J5148
26009D44075j01502j27272j51997j46274p4477J25115J26462J10700N2461o7884
$$ plain form
26084 -94367 114253 308300 167457 332347 246115 -125859 -532350 -534699 -574993 -521185 -287440
26073 -287440 -297434 -347482 -357734 -405090 -234417 -166444 -75856 -156893 -265530 -168562 93147
26062 93147 115318 54283 240089 258234 159524 192237 119562 45085 -115273 -98914 211410
26051 211410 262142 233559 128053 -125461 -194172 -123121 -76795 113241 325538 357679 301212
26040 301212 -21903 -112974 -125712 -30667 -147079 -8281 -162372 -267282 -168863 27387
26030 27387 297244 14454 -496416 -621951 -650562 -535284 -766770 -733957 -372315 -293300
26020 -293300 -182348 -235335 -267220 -297119 -204153 42302 318572 498334 489931 428927 444075
26009 444075 342573 215301 63304 -82970 -157447 -32332 94130 204830 257291 189407
25999A89407P179k4107N1853P0454j07456k81677l17138J45125J8226m2704L0681
25988b60157R4172K05211K33708q5898J4371O2528j9377J43207M6075j4355r2275
25977C27210k90477o0327J06922L5273o8626k21954r2067J10534k10883J8873
25967c45522Q1569J76623q6167K71074J04187j98500k09539j6619J57674k5307
25957i0527J2761J08749m9241n4042P9259L7195q7742L8723j31702r6129k0532
25946b53228J25686K41145j46452k03388J36095J33042K67790k1268j49943l25397
25936a95918J5382n8770j9413P1416N485j69380q3998K30523L47854p1583k7242
25925D4356l7706j10683J51402J66349N4965j8493o2977J5075j44787j85290l077
$$ plain form
25999 189407 196586 172479 224332 294786 187330 -94347 -411485 -266360 -248134 -290838 -260157
25988 -260157 -165985 39226 272934 187036 201407 263935 244558 387765 433840 419485 327210
25977 327210 36733 -23594 83328 118601 49975 -171979 -264046 -153512 -364395 -345522
25967 -345522 -263953 -87330 -173497 97577 201764 3264 -206275 -222894 -65220 -90527
25957 -90527 -77766 30983 -18258 -72300 6959 44154 -43588 -4865 -136567 -232696 -253228
25946 -253228 -127542 113603 -32849 -236237 -100142 32900 300690 279422 129479 -195918
25936 -195918 -180536 -239306 -258719 -187303 -181818 -351198 -435196 -204673 143181 71598 44356
25925 44356 6650 -104033 47369 213718 268683 250190 187213 202288 57501 -127789 -130866
25914a30866K38778k8784J94648j21782J202j05023o4028m3292m6307P0858J11998
25903G7402q3914m7350q2784m6967M6975Q7699Q2162j72981j23807N2448r2243
25892c03360k41729Q6365K55132Q5184m350J33786L6386k47841Q6760L37802Q3584
25881C07719j89432j20990R438K4754k45265j01439k53500k21328Q5384L04586
25871d00073K02105N1015J95854J13173r8636j94354k25188K05937N00863j0062
25861C40634k20776j28307R8650j05308j67020N6877N4167j08941p5413O5973
25851a89464J990q6623n6694J4908o888K49611m899j82159m4498O3241L6900J6640
25839a87935p4378l29100j26742k76805J04814M45516J53764P8986K19483J8699
$$ plain form
25914 -130866 107912 79128 273776 151994 153196 48173 -15855 -59147 -105454 -34596 77402
25903 77402 -6512 -53862 -136646 -183613 -136638 -48939 33223 -139758 -263565 -211117 -303360
25892 -303360 -545089 -458724 -203592 -118408 -122758 11028 47414 -200427 -113667 224135 307719
25881 307719 118287 -2703 6735 31489 -213776 -315215 -568715 -790043 -704659 -400073
25871 -400073 -197968 -146953 48901 162074 63438 -130916 -356104 -150167 350696 340634
25861 340634 119858 -8449 90201 -15107 -182127 -125250 -71083 -180024 -255437 -189464
25851 -189464 -187474 -274097 -330791 -315883 -322771 -73160 -78059 -260218 -304716 -241475 -204575 -187935
25839 -187935 -262313 -591413 -718155 -994960 -890146 -444630 -290866 -211880 7603 26302
25829B6302J76428R717l49244l09318N9122K16004K23662m3616N3492k8558j16843
25818h2852R9893J03533O7670M604J36764M5483l6241k7258p0826r323k15425
25807A6022k95998l654J47815J41360k5675j86940L5419M7558Q0975J21865K07290
25796B86037m7015j69268p8045j49141K02277j29588k22484j30557O9530L19077
25786d9177j7656m3691q1726j23274j89972L01413L65201Q8591k35955k4739j94814
25775b05799N7692L3531L10859L5326j63014k45782P9392J3108l5319k01858j8017
25764c39881L6630o6954p2113J81063j7047J25771O7396k58206n5382L54212J44064
25753I9553j85090O7549J74570J6710k6007j98688j07592K686J08732Q2284l4978
$$ plain form
25829 26302 202730 212447 -136797 -446115 -386993 -170989 52673 9057 62549 33991 -82852
25818 -82852 17041 120574 188244 192848 329612 375095 338854 311596 240770 231447 16022
25807 16022 -279976 -283630 -135815 5545 -20130 -207070 -171651 -124093 -43118 78747 286037
25796 286037 239022 69754 -8291 -157432 44845 -84743 -307227 -437784 -368254 -49177
25786 -49177 -66833 -110524 -192250 -315524 -505496 -204083 161118 249709 13754 -10985 -205799
25775 -205799 -148107 -114576 196283 231609 68595 -177187 -97795 -84687 -120006 -321864 -339881
25764 -339881 -303251 -370205 -442318 -261255 -278302 -152531 -85135 -343341 -398723 -44511 99553
25753 99553 -85537 -17988 156582 173292 147285 -51403 -158995 -156309 -47577 34707 -271
25742b71k8826J7672K63836K851O5853j03725j58447J34755j0153K1248k45561
25731d0768k13646j46226J43966P3084j42504K13429J07971l17n817k99n4875
25720f6002k5236l9561o774N5747J00529K16042j3524j98931k56721K80408m6138
25709a61q0861J12921P953j33683q7697q1902Q8473K78118Q5547P8631O4418j66269
25697A65488k64372P0790n4919j38388j39130q0471K6037M5488J00260K89690
25687B0473J46518j61977m53643J7340J49692J41752j5131R7194J19660j56552
25677i4674j48154j93496M4367J65079n9633r224J79037L11313O9007o1533J86935
25666C89024J11569k11177l1664J170k02178k23912j17350o2682K09167K45569
$$ plain form
25742 -271 -29097 -11425 252411 255262 321115 217390 58943 193698 183545 204793 -40768
25731 -40768 -254414 -400640 -256674 -183590 -326094 -112665 -4694 -5011 -10828 -11127 -66002
25720 -66002 -91238 -130799 -137573 -81826 18703 234745 221221 22290 -234431 45977 -161
25709 -161 -81022 31899 39852 -93831 -181528 -263430 -174957 103161 188708 267339 331757 165488
25697 165488 -98884 -28094 -83013 -221401 -360531 -441002 -414965 -369477 -269217 20473
25687 20473 166991 5014 -448629 -431289 -281597 -139845 -154976 -57782 61878 -94674
25677 -94674 -242828 -436324 -391957 -226878 -286511 -295735 -116698 194615 263622 202089 389024
25666 389024 500593 289416 257752 258922 56744 -167168 -284518 -347200 -138033 107536
25656A07536M6862M2363J95494K2902k54421l59609j25086R5798L35136J93760
25646C00735j34569o0415j6062k44398p9307N2337l9272J94610J56155r0469j24014
25635h4669J17012J14251l546o7269k37706R7015K20674j00369r9662M052j57624
25624a97841K02609l72492j42577K03151J08018N8995j83228n6993O3612O6330
25614b50416K30512P5734j58341j95827n747n7228J90143L67140n4224j46251
25604d505J08798j11794n7857L1171j48381R2206L0339L0279j4890K1837J7757
25593e040k54495j05036l236J24405J25753N3004J5232j41850L0763J8042j57387
25582b99845N5952M9498j34178M3835J48226o3444k8409L20426J09810m9721m5076
$$ plain form
25656 107536 154398 196761 392255 415157 160736 -198873 -323959 -228161 106975 300735
25646 300735 166166 105751 89689 -154709 -234016 -181679 -220951 -26341 129814 39345 -84669
25635 -84669 32343 146594 143048 75779 -161927 -64912 155762 55393 -44269 -40217 -197841
25624 -197841 4768 -367724 -510301 -307150 -199132 -140137 -323365 -380358 -316746 -250416
25614 -250416 -19904 55830 -102511 -298338 -304085 -361313 -171170 195970 141746 -4505
25604 -4505 104293 -7501 -65358 -34187 -182568 -90362 -60023 -29744 -44634 -22797 -5040
25593 -5040 -259535 -364571 -367807 -243402 -117649 -64645 -49413 -191263 -160500 -142458 -299845
25582 -299845 -243893 -194395 -328573 -284738 -136512 -199956 -228365 92061 201871 152150 107074
25571A07074M4785j64263j42690J7480J76919j24764r8461J32077j85005k98566
25561e35414J25201p0539N3823L2142K10642Q3376J27878m6679J04484n7225J76898
25550B04587j26101j388j72125j11413M2701J03519J83765P8391j92446k02670
25540a93180j66935o7185j6161K81208J03166J62121k25921l62796j86612L08328
25530c63967L04283P126J38255j32668p6699M1242J7029q6470K06195R7997l4568
25519A17755J4426j49520j12753K02379m8887J5662k1481k42368k80087q1240
25509e86114L13873K21932l0345M3947J19513L044n8723j23943N9251j32506k20584
25498c90655J9857j59422j74358J53478L52905J06331n567j92647K32796J22215
$$ plain form
25571 107074 151859 -12404 -155094 -137614 39305 -85459 -183920 -51843 -236848 -535414
25561 -535414 -410213 -480752 -426929 -394787 -184145 -100769 27109 -19570 84914 27689 204587
25550 204587 78486 77098 -95027 -206440 -163739 -60220 123545 201936 9490 -193180
25540 -193180 -360115 -427300 -443461 -162253 -59087 103034 -122887 -485683 -672295 -363967
25530 -363967 -59684 -52558 85697 -46971 -123670 -82428 -65399 -151869 54326 152323 117755
25519 117755 132181 -17339 -130092 72287 23400 39062 17581 -224787 -504874 -586114
25509 -586114 -272241 -50309 -80654 -36707 82806 85850 27127 -96816 -37565 -170071 -390655
25498 -390655 -370798 -530220 -704578 -551100 -198195 -91864 -97431 -290078 -57282 64933
25488F4933q0582J92984J20968j73874j89279k16068J65816J85201P1041j2029
25478A29111p3123L9313n6569j05000K40383K2049O0777J6763j78071k49614K31485
25467G7504Q1060R7107r1394m09986j70446M0495J08764q2780o9771j99481L31325
25456b87603K14901J85616J2219J3391J07544l5203j64061j2651p2462k87943
25446c26252j12560K89807J90765j72028l13163J61074K47334L1550j31685j96876
25436c32034J83667L7539j74769o1469J34305j18032k0829J19388J71250J02683
25426D1699j9010j8359n6413J19125p9641n6065Q10J4146l5947N6506J172j54990
25414a86967n633p7188O9960k6320P5931J12013O9754p8370L3280R828r9806o0606
$$ plain form
25488 64933 -15649 177335 298303 124429 -64850 -280918 -115102 70099 141140 129111
25478 129111 55988 95301 38732 -66268 174115 196164 256941 273704 95633 -153981 77504
25467 77504 158564 255671 164277 -245709 -416155 -375660 -266896 -349676 -419447 -618928 -287603
25456 -287603 -72702 112914 125133 138524 246068 210865 46804 34153 -38309 -326252
25446 -326252 -438812 -149005 41760 -130268 -443431 -282357 -35023 -3473 -135158 -332034
25436 -332034 -148367 -110828 -285597 -347066 -212761 -330793 -351622 -232234 -60984 41699
25426 41699 22689 4330 -52083 67042 -12599 -68664 -67854 -53708 -89655 -33149 -31977 -186967
25414 -186967 -192600 -269788 -199828 -226148 -150217 -38204 31550 -46820 -13540 -3712 -103518 -164124
25402a64124j6688L22149k7014j40061k20509J72235J32280j446J14657O8922
25392B40401k96160k46334J27646K88719J27476J9173p0775j39239L140m0432
25382A3615j39488q761j62242J9032L78463N7273j79327J14864J20285l2075P8172
25371B59811k1201k26821q0220j13103k4234k5722M6348j7223J5233j20830R0938
25360b17024J26494L0063K07736O1189k60029o3942J07579J2087J91669O5145
25350B60967l62932j77750J02391m5884j96285j57406L19086K58778J78278J27992
25340C07235p5974k51658r695J7116j32691j70746k57322R1027L26615o8327K796
25329b21624L6329P54j08210p8708J31982O9355q972k21694j66867J07290K16125
$$ plain form
25402 -164124 -180812 141337 114323 -25738 -246247 -74012 58268 56822 171479 240401
25392 240401 -55759 -302093 -174447 114272 241748 260921 190146 50907 54047 13615
25382 13615 -125873 -134634 -296876 -277844 100619 157892 -21435 93429 213714 181639 259811
25371 259811 238610 11789 -68431 -181534 -205768 -231490 -185142 -202365 -187132 -307962 -217024
25360 -217024 -90530 -60467 147269 208458 -51571 -115513 -7934 4153 195822 260967
25350 260967 -101965 -279715 -177324 -223208 -419493 -576899 -257813 965 179243 307235
25340 307235 231261 -20397 -30092 -12976 -145667 -316413 -573735 -482708 -156093 -224420 -221624
25329 -221624 -185295 -184541 -292751 -371459 -239477 -170122 -179094 -400788 -567655 -460365 -244240
25318b44240J27569l443j10818k04440m2662L46911R7310m4327l3074R739M23
25307a01052j8072O4643P0127N6018k45625j65301j66901R2734R425j7713J44918
25296b76799j14847J28805J02813M0944J05042K1266m2069p5461q3334j2744p8895
25285b85279M1064m410j8203Q0800J24310J2545j20174N1221n6581r7009j38985
25274d10701j64403r9057J52926K19062q136R1422J42860O9393j20768J9343J7400
25263i0659J4178k13032O9829l753j47897J86752J56892j61131m51k5355j47282
25252c61909N0177M9010K49779J62273j76477P994j0590j81831n4963j62332j37833
25241e66702P7541L32303R08p4463j69926n7719K08804j91280J21554K41894p3824
$$ plain form
25318 -244240 -116671 -120114 -230932 -435372 -478034 -131123 -33813 -78140 -111214 -101475 -101052
25307 -101052 -119124 -54481 15646 71664 -173961 -339262 -506163 -413429 -404004 -421717 -276799
25296 -276799 -391646 -262841 -160028 -119084 -14042 7224 -34845 -110306 -193640 -206384 -285279
25285 -285279 -244215 -248625 -266828 -186028 -61718 -49173 -169347 -118126 -174707 -271716 -410701
25274 -410701 -575104 -674161 -521235 -302173 -310309 -218887 -76027 -6634 -127402 -108059 -90659
25263 -90659 -76481 -289513 -219684 -223437 -371334 -184582 -27690 -188821 -189272 -214627 -361909
25252 -361909 -311732 -262722 -12943 149330 -27147 -19153 -29743 -211574 -266537 -428869 -566702
25241 -566702 -489161 -156858 -155950 -230413 -400339 -458058 -249254 -440534 -318980 -77086 -150910
25230a50910J04478M370j2441N0211l1217k19502N5944K18330K0256j2536M683
25219C1666L6257m8381j04169N0105k5965K7512k94740j85777R7758K29999J39176
25208d6559k55811n0697P8066k95262k19881J79283K33105K44270K24161j05041
25198a4366n01963j28158L43586J81010m3255K650K0807l8066j30082j54494K02897
25187b59434K76009O5801m61186N6834K96143q2254j957m845j00011k04769j6259
25176d35928K48633K98305L6520j77421j80181Q3644J675j94692N0368J73476
25166i5601J12744j21499k09478r721J67963m1325j58267P0785j14418K34315
25156a64502N5377j96276n6132R0681k34599j22000J29453J41085K53384O5117
$$ plain form
25230 -150910 -46432 -42062 -54503 -4292 -35509 -255011 -199067 19263 39519 26983 31666
25219 31666 67923 19542 -84627 -34522 -60487 -32975 -327715 -513492 -415734 -185735 -46559
25208 -46559 -302370 -353067 -275001 -570263 -790144 -610861 -377756 -133486 90675 -14366
25198 -14366 -516329 -644487 -300901 -119891 -163146 -160496 -139689 -177755 -307837 -462331 -259434
25187 -259434 16575 82376 -378810 -321976 -25833 -108087 -110044 -114889 -214900 -419669 -435928
25176 -435928 -187295 111010 147530 -29891 -210072 -126428 -124753 -319445 -269077 -95601
25166 -95601 17143 -104356 -313834 -323555 -155592 -196917 -355184 -284399 -398817 -164502
25156 -164502 -109125 -305401 -361533 -270852 -505451 -627451 -497998 -356913 -103529 -38412
25146c8412p1806o43R6500O4495J07878M4405l6163r3468J38609Q1876R3546l8383
25134C48434m8817o3032k20858j75972j87078J43032J71331j30428j8042r175
25124a90605K9895J17618Q8006K7618q9072q4909n0733j7387J33175R8442j04037
25113d1989p1085k07433j67821L9500J550m2961j20046J0322K76355Q8114j5307
25102b50801r508j85850k9727K80473K2372m835M7583K08550J69352J37829j12769
25091B72669j20747j96318J0150J53798j31707P1242J77234J6261o641J23383
25081C69324J14705p6427l11646n1364J51283J67562k40280j07511j06132j43696
25071b34182N9401M0555M1580K5903Q1320N5656j05281j92742o1762O8395r3483
$$ plain form
25146 -38412 -110218 -110861 -14361 50134 158012 202417 166254 72786 211395 293271 386817 348434
25134 348434 299617 236585 15727 -160245 -347323 -204291 -32960 -163388 -181430 -190605
25124 -190605 -160710 -43092 44914 72532 -16540 -101449 -152182 -169569 -36394 62048 -41989
25113 -41989 -113074 -320507 -488328 -448828 -447278 -490239 -610285 -599963 -323608 -235494 -250801
25102 -250801 -260309 -446159 -475886 -195413 -173041 -177876 -130293 78257 247609 385438 272669
25091 272669 151922 -44396 -34246 119552 -12155 59087 236321 252582 245941 369324
25081 369324 484029 407602 95956 44592 195875 363437 123157 15646 -90486 -234182
25071 -234182 -174781 -134226 -92646 -66743 14577 70233 -35048 -227790 -289552 -221157 -314640
25060c14640K89046j11776R1709J06999R307r3560k798K59266j04783k04639O8198
25049g671j93899j56912l7253J82171O1410N9982j49200J37688q1796l2524r7463
25038c15467J51234J50925r6402k25532P6454l0772J87374P6901j12985p4723
25028b12993k53554q6092K07660J11917l0652k12529j86789P3346K8779k08570
25018g69477J18208P7503K26970K4732J3488K26010R0457J84146N0564m7081l03240
25007a07720N0984j05411j54633J18046J20188p1243J8098Q6595r1242m1190L95981
24996B18453P514j26016j75806R300p8848j02182L0144J00063K29111l2937q5612
24985f816k0852K10915J62442p0177k23810k15089M978R7301j21315j33574J29377
$$ plain form
25060 -314640 -25594 -137370 -45661 61338 70645 -22915 -25713 233553 128770 -75869 -7671
25049 -7671 -201570 -358482 -395735 -213564 -152154 -92172 -241372 -103684 -185480 -218004 -315467
25038 -315467 -164233 -13308 -109710 -335242 -258788 -289560 -102186 -25285 -138270 -212993
25028 -212993 -466547 -552639 -344979 -233062 -263714 -476243 -663032 -589686 -560907 -769477
25018 -769477 -651269 -573766 -346796 -322064 -308576 -82566 7891 192037 242601 195520 -107720
25007 -107720 -56736 -162147 -316780 -198734 -78546 -149789 -131691 -45096 -136338 -177528 218453
24996 218453 225967 99951 -75855 -66555 -145403 -247585 -217441 -117378 111733 78796 -6816
24985 -6816 -27668 183247 345689 275512 51702 -163387 -158409 -61108 -182423 -315997 -186620
24974a86620L53350N2072r5475Q2655o1441n5275j07108J84113J22811m5891N9558
24963C02749K42757M3662p0892j28508q4375j78163j54392k65605J01196r4185
24953b85756o8690J3047N6449J47585N0464j67006p6012N7280J2895m55k481J07683
24941a54997P5417Q8384k46768j92397M3659j6981N3204j8990P7404R9613q5047
24930b77499n0988K27249J05456j14429j35414N8554K79760M03750j04421k02299
24920A89719O1393k50569j49915J205m8157m8397L5090K28963o1077j12490j72791
24909c27026j12238Q815k2919j68320K2721J94942J89834J57230M1773j05696
24899a20884j64058J50189K2733k23132J32090K69764j4569r0812q1268L1441
$$ plain form
24974 -186620 166730 218802 123327 205982 144541 89266 -17842 166271 289082 243191 302749
24963 302749 545506 589168 518276 389768 305393 127230 -27162 -292767 -191571 -285756
24953 -285756 -354446 -341399 -284950 -137365 -86901 -253907 -329919 -272639 -259744 -260199 -262680 -154997
24941 -154997 -79580 8804 -237964 -430361 -386702 -403683 -350479 -369469 -292065 -192452 -277499
24930 -277499 -328487 -101238 4218 -110211 -245625 -187071 92689 496439 392018 189719
24920 189719 251112 543 -149372 -148167 -196324 -244721 -209631 19332 -41745 -154235 -327026
24909 -327026 -439264 -430449 -453368 -621688 -598967 -404025 -214191 -56961 -15188 -120884
24899 -120884 -284942 -134753 -112020 -335152 -203062 66702 52133 -38679 -119947 -88506
24889h8506P120j4396r9301k3609M2437o3613j83533L15748Q8892N3285Q7600
24878A22124L643J47745R6743k02723j29395n4278J03264j31532J03853J72469
24868B31913j65310k27993j65338J1343o3233J58938J14561k46308q1463J30751
24858c02139j22504J66953J43113k03616j22522K0484J68208r9031k45298J04328
24848d92024J21310Q6669J05234K58493J56765j70428j13785J98557k21635l23356
24838c94200j42527o5883L13133K64600M4554o3801r5976l33152j53171j7749
24828f44172L42207K85746q0693m6652p2000q3597n0259J58033L951q8439Q8338
24817a87537J07341N4403l7482j76135p8342K51031P5127k0409j68721k59893
$$ plain form
24889 -88506 -81386 -95782 -195083 -218692 -176255 -239868 -423401 -107653 -18761 34524 122124
24878 122124 125767 273512 370255 167532 38137 -16141 87123 -44409 59444 231913
24868 231913 66603 -161390 -326728 -315385 -378618 -219680 -105119 -351427 -432890 -302139
24858 -302139 -424643 -257690 -114577 -318193 -440715 -420231 -252023 -351054 -596352 -492024
24848 -492024 -370714 -284045 -178811 79682 236447 66019 -47766 150791 -70844 -394200
24838 -394200 -536727 -602610 -289477 -24877 19677 -44124 -140100 -473252 -626423 -644172
24828 -644172 -301965 -16219 -96912 -143564 -215564 -299161 -349420 -191387 -187436 -275875 -187537
24817 -187537 -80196 -25793 -63275 -239410 -317752 -66721 8406 -12003 -180724 -440617
24807d40617K9606K15369k8335k23775K54287K68172L9464J22674j44273q0282
24797A2290K36842J41030j81461j34176K7001J15271o197J9214k0654m4556p5773
24786H8831J62098M5889R3630r859j50931k39455J26176j9338k178j81837q0473
24775a67447J73970o9533l33556l7513J07186K18923j04498p9002p2349N9716
24765c04103J4557K58759L1051P5435p6969k60121q2377J67295j34555J62832
24755a48196J95616o4155J32052J37211M0565k39238p1155j60125R2821L742o1976
24744a42838K81077j6053n1960m4054k61112Q2247K1492p9159N7136L05349j40814
24733A1311k32770k54537j25213r043J14905O7975K22891J14047j86059j0029
$$ plain form
24807 -440617 -411011 -195642 -223977 -447752 -193465 74707 114171 236845 92572 12290
24797 12290 249132 390162 208701 74525 101526 216797 210600 229814 209160 164604 88831
24786 88831 250929 296818 390448 380589 229658 -9797 116379 97041 94863 -86974 -167447
24775 -167447 6523 -63010 -396566 -434079 -326893 -107970 -212468 -291470 -363819 -304103
24765 -304103 -289546 -30787 264 75699 -1270 -261391 -343768 -176473 -311028 -148196
24755 -148196 47420 -16735 115317 252528 293093 53855 -17300 -177425 -84604 -80862 -142838
24744 -142838 138239 122186 70226 26172 -234940 -152693 -131201 -210360 -153224 152125 11311
24733 11311 -221459 -475996 -601209 -610252 -495347 -427372 -204481 -90434 -276493 -286522
24723b86522K11443J51596l07924l22864Q1251L08742J96502n4819q5592q0820
24713a89007J55583J32858p1751k20962k04943j76030L8807J4332k2982m2702
24703e86797k5983J97478J39239K43456J08372k970n6915K5663j77094J65901
24693C0350J991j38743r5250m2312k0421k238j15082R6515O6240P4517l3923l1940
24681b10296P625p0640P7523O2670J60593P2576k14291j38003N9038L25114j71360
24670c9451l75282j23617J77301K52830J76291J1485k05438r5885M1249R0777
24660h9740L6981j9376p4777R7422k17214n9293L94527L9416r3880J3407k3204
24649D269M7277j23168K7547M2067j05820p2846K15074L19914q2326l66425o7424
$$ plain form
24723 -286522 -75079 76517 -231407 -554271 -473020 -164278 32224 -22595 -108187 -189007
24713 -189007 -33424 99434 27683 -193279 -398222 -574252 -535445 -521113 -544095 -586797
24703 -586797 -612780 -415302 -276063 -32607 75765 72795 15880 41543 -135551 30350
24693 30350 32341 -106402 -201652 -243964 -264385 -266623 -381705 -285190 -218950 -144433 -178356 -210296
24681 -210296 -202671 -273311 -195788 -133118 27475 100051 -114240 -252243 -193205 131909 -39451
24670 -39451 -414733 -538350 -361049 -108219 68072 79557 -125881 -221766 -180517 -89740
24660 -89740 -52759 -72135 -146912 -49490 -266704 -325997 68530 107946 14066 27473 4269
24649 4269 51546 -71622 -44075 -2008 -107828 -180674 34400 354314 271988 -94437 -161861
24638a61861J50146j81208j17398P5862K49805K03710j57818j85937l5168K10447
24628E0580K14213L8439j94283j31730N3140j3041q6590k23867j48837K56545
24618a85431K40843K08994j65953j03412j05681J8763N7713P8179M7504j10686
24608a9167j21665L1518p2863m5329Q1378k8484o7379K153j60595o0094k11581
24597f72108P7799J90289J53454J69498K29130K75368l26420k07135J36206L0426
24587E6507P0711J22667l0170R0141k67995l27952P0855R9835J45000J5819j72235
24576a26817j45216P6492l7995K7130j0503Q2234j14218l9282j55079R4476J1874
24565c36904k04020L5733O9807r904L2646J49471O5820N5135q9952L2535J49775
$$ plain form
24638 -161861 -11715 -192923 -310321 -234459 15346 219056 61238 -124699 -159867 50580
24628 50580 264793 303232 108949 -22781 30359 17318 -69272 -293139 -441976 -185431
24618 -185431 55412 264406 98453 -4959 -110640 -91877 -34164 44015 91519 -19167
24608 -19167 -140832 -109314 -182177 -227506 -146128 -174612 -241991 -239838 -400433 -460527 -672108
24597 -672108 -594309 -404020 -250566 -81068 148062 423430 97010 -110125 26081 56507
24587 56507 127218 249885 219715 309856 41861 -286091 -215236 -115401 29599 45418 -126817
24576 -126817 -272033 -195541 -233536 -206406 -216909 -134675 -248893 -288175 -443254 -348778 -336904
24565 -336904 -540924 -505191 -435384 -445288 -412642 -263171 -197351 -142216 -232168 -199633 -49858
24554d9858L9611O8120J06401j66633j13787p2368j96461J27682R2379O7050j8852
24543a16716j06283J78602j35541j27498Q6778K03776M0248k37786j2671N3198
24533a73893m1001K70477K72477k64302l55945J21825J58216p157l22436j54710
24523d96449j30120J9454L30310p2374J50149Q2051M1848j79537k7720Q9291p2643
24512b65740o0565O7845J66785J16919J58332j21063j3068K26482j61433k61321
24502a46827R1094K46243k11049p487K01503N1461J8947j95542j6679p574O0252
24491H4342j50969l4939l0523J88167R3648j04157k49828N8122J43270O2600j04469
24480d4736m0024j53879J02967J60114J64078q8001k95942J424Q0248P1995K06113
$$ plain form
24554 -49858 -10247 57873 164274 -2359 -116146 -188514 -384975 -257293 -164914 -97864 -116716
24543 -116716 -222999 -44397 -179938 -307436 -220658 -16882 23366 -214420 -227091 -173893
24533 -173893 -214894 55583 328060 63758 -292187 -170362 -12146 -19303 -341739 -496449
24523 -496449 -626569 -607115 -276805 -349179 -199030 -116979 -75131 -254668 -282388 -193097 -265740
24512 -265740 -326305 -258460 -91675 25244 183576 62513 49445 275927 114494 -146827
24502 -146827 -55733 190510 -20539 -28026 173477 224938 243885 48343 31664 24090 84342
24491 84342 -66627 -101566 -132089 56078 149726 45569 -204259 -146137 -2867 59733 -44736
24480 -44736 -84760 -238639 -135672 24442 188520 100519 -195423 -193999 -113751 -41756 164357
24469A64357K9938j16849q4700j01787p9335J1732N3223J52693M4473O7358j00354
24458D0749L6166k2164j93856l3019K42960j07561k32033p3357O4281J83292J11312
24447A6770k2247l6902K453K62393J66236L7492k05817j66096M7419J43818J4574
24436B60093j63492j36990n0982j94876K4820j63233J34165J53519l8475k65777
24426d41228J25908J88234J30936k5870j60313j56066J38003j4942J44358J74167
24416A03187n428J657L5276L4277J13051P5697l9224j57750j50856q6267N1140
24405b5240J48339o914j10702j73683J48068l23074J9377K26630K14408o7391
24395D9818k85763j56681j18142j9042M7776L93147K26860k68694k73610j75729
$$ plain form
24469 164357 194295 77446 -7254 -109041 -188376 -176644 -123421 29272 73745 141103 40749
24458 40749 76915 54751 -139105 -172124 70836 -36725 -268758 -342115 -277834 -94542 16770
24447 16770 -5477 -42379 -39926 222467 388703 426195 220378 54282 101701 245519 260093
24436 260093 96601 -40389 -91371 -286247 -261427 -424660 -290495 -136976 -175451 -441228
24426 -441228 -315320 -127086 3850 -22020 -182333 -338399 -200396 -215338 -70980 103187
24416 103187 97759 99416 134692 168969 282020 357717 318493 160743 9887 -76380 -25240
24405 -25240 123099 116185 5483 -168200 -20132 -343206 -323829 -97199 117209 49818
24395 49818 -235945 -392626 -510768 -529810 -482034 -88887 137973 -130721 -404331 -580060
24385e80060M82J13794Q4917j72501J15004K44830K6568K6400O7442J3491K597
24374e7036j73843k0028j35894J3404l047N3196L46224N1500K5374j10865p1783
24363h2798M4323K4008J28320j73417j27955k19272n6101o8042J67958o562J66964
24352b02574R834J74288K39144k16944M8014K49176j63932O9344L5758j18702
24342A23406p2139l2046l63903j88094q2649J83662J08378O08L822P6921n0344
24331b92378J48780Q9234K21046O6313l8567j01851k17498J605J18412k1187J0508
24320a5583R8794j22176m785k2437J36058J1073k03902j76155O387O43j7933J4067
24308b95949j38803Q2617J47136K24553n8433K2005j65647K0819K07800J74019
$$ plain form
24385 -580060 -579578 -465784 -380867 -553368 -438364 -193534 -166966 -140566 -73124 -59633 -57036
24374 -57036 -230879 -250907 -386801 -373397 -376444 -323248 22976 74476 99850 -11015 -82798
24363 -82798 -38475 -14467 113853 -59564 -187519 -406791 -462892 -530934 -362976 -369538 -202574
24352 -202574 -192740 -18452 220692 3748 51762 300938 137006 206350 242108 123406
24342 123406 51267 19221 -344682 -532776 -615425 -431763 -323385 -322777 -318955 -242034 -292378
24331 -292378 -143598 -54364 166682 232995 194428 92577 -124921 -123316 -4904 -26091 -15583
24320 -15583 83211 -38965 -43750 -66187 69871 80944 -122958 -299113 -292726 -292083 -310016 -295949
24308 -295949 -434752 -352135 -204999 19554 -38879 -16874 -182521 -161702 46098 220117
24298B20117j28511p4760r4143j20490J36456K09479k63957k24785K20213K44930
24288A24549N3517l2504J3928k2519j53493j46911K38165j77071m126N9146k1705
24277f9024P9072o3080n9660R2673J62480j42023j34623R732J33676j91986r2502
24266b75265J23420M8378j83986J57161m8145q9813K21334J20704L6856K74442
24256C85086o4648k40041L1464K9620m8865J5016r1301p1577J1765k29106j981
24245b74568K04617K01103o6908j72703j0809j7069l7057O8072P8057j26949K0621
24234a33593J7814l692j48837J4371J59190J1264j8704M9133K61016R6666k68138
24223C6490k17820n1732m5307J34891p6385j54021k08119J35703J39240J6782
$$ plain form
24298 220117 91606 16846 -77297 -197787 -61331 148148 -115809 -340594 -120381 124549
24288 124549 178066 145562 159490 136971 -16522 -163433 74732 -102339 -106465 -47319 -69024
24277 -69024 10048 -53032 -112692 -20019 142461 438 -134185 -124453 9223 -182763 -275265
24266 -275265 -151845 -103467 -287453 -130292 -178437 -268250 -46916 73788 110644 385086
24256 385086 320438 80397 111861 141481 92616 107632 16331 -55246 -43481 -272587 -274568
24245 -274568 -69951 131152 64244 -108459 -119268 -136337 -173394 -105322 -27265 -154214 -133593
24234 -133593 -115779 -119471 -268308 -253937 -94747 -83483 -102187 -53054 207962 304628 36490
24223 36490 -181330 -233062 -278369 -143478 -219863 -373884 -582003 -446300 -307060 -290278
24213b90278Q7705J57265K35622K09222j62359m72177O0681N2972k95264q3191
24203d99802Q2222R2512K15053J56791j8651M2736J14588L1385o8600j08301j17070
24192g7137j77126k05454j91415l034L05434K98011k6509J17658N7402k34961
24182a37131j07697O7547J72683k2595q0692j95944K0341J71517R0214L6959n0951
24171c5749K28297J20280j55884k70227k01807j437o4419q6383L20079J50099
24161B849q8310j35371k53310M2513J07744O8737n594L2889J57553J58892M6781
24150A35373l35213j67505j39919O3091K51513K04669p3685p5697l3437J28233
24140d2577K88977j8418o1958j92792K14387O8788j04014k11783j12269K303L7170
$$ plain form
24213 -290278 -202573 -45308 190314 399536 237177 -235000 -174319 -121347 -416611 -499802
24203 -499802 -417580 -325068 -110015 46776 28125 70861 185449 216834 148234 39933 -77137
24192 -77137 -254263 -459717 -651132 -654166 -348732 -50721 -77230 40428 97830 -137131
24182 -137131 -244828 -177281 -4598 -27193 -107885 -303829 -283488 -111971 -21757 15202 -35749
24171 -35749 192548 312828 156944 -113283 -315090 -316527 -380946 -467329 -147250 2849
24161 2849 -85461 -220832 -474142 -431629 -323885 -255148 -260742 -227853 -70300 88592 135373
24150 135373 -199840 -367345 -507264 -444173 -192660 12009 -61676 -137373 -170810 -42577
24140 -42577 246400 227982 166024 -26768 187619 256407 152393 -59390 -171659 -169356 -132186
24129a32186k54496r5482K53636J32324k6540m3808n9227J34928J58073J3488
24119H0710n1324o6362J83444p7339j05801L266k1840j93393n9247K23657J86934
24108A02705j09162n1841J24363R9868j18818J03525K3090k3936j29258j72042
24098a51506o7694J69305P3082K5507K4618j55318o1496q0860L37733J34488k50527
24087b668q6483J25156k48150M7746J87610K63297p5906J4823l6621r5832k46550
24076a53578k02637n9205J07757J63249P2035l1112P0424K0321n6388J46821K61761
24065C39448J6418m05554k74635N1338P7881n378P3592K67710j05562j94852M8264
24054a11330J62421j4481k34756J69568K18499M9552j84564l6606k55532k60532
$$ plain form
24129 -132186 -386682 -482164 -228528 -96204 -122744 -166552 -225779 -90851 67222 80710
24119 80710 29386 -36976 146468 69129 -36672 -33406 -55246 -248639 -307886 -84229 102705
24108 102705 -6457 -58298 66065 165933 47115 150640 173730 149794 20536 -151506
24098 -151506 -219200 -49895 23187 48694 73312 -82006 -143502 -224362 113371 247859 -2668
24087 -2668 -89151 36005 -212145 -164399 23211 286508 210602 225425 188804 92972 -153578
24076 -153578 -356215 -415420 -307663 -144414 -72379 -103491 -33067 -12746 -69134 77687 339448
24065 339448 355866 -49688 -324323 -272985 -195104 -200482 -126890 140820 35258 -159594 -111330
24054 -111330 51091 36610 -198146 -28578 189921 239473 54909 18303 -237229 -497761
24044d97761j71526J76942L1355K67444q774m2973O7437P4123j20910q0788L42924
24033C7493J33964k86286k48362k2364K30470n2886K10198N5067N4875j03085
24023I084l2949p305j76166M3779L09725j4694m5248K91235l408k88278l4880
24012E0895k49675j92036M18764J93797j77886P8066n230l74794j78631Q3088
24002c53642J96975L8111j838K38757J14410m0071j11111j99182j69456K75698
23992a1349J9021j27993j5032J94492L3205j70210j48909K5940K5604M8417K32508
23981A05694J34145j48650m1249o790k7034J38319r0888Q91n4397R2318j21143
23970a8784k58588J04941Q4059m7695M6202j11001j2942R6533J60238j1708k13684
$$ plain form
24044 -497761 -669287 -492345 -460990 -193546 -202320 -245293 -177856 -103733 -224643 -305431 37493
24033 37493 171457 -114829 -363191 -385555 -155085 -207971 2227 57294 112169 9084
24023 9084 -23865 -31170 -207336 -163557 146168 131474 86226 377461 374053 85775 50895
24012 50895 -198780 -390816 27948 221745 43859 121925 116695 -258099 -436730 -353642
24002 -353642 -156667 -118556 -120394 118363 232773 192702 81591 -117591 -287047 -11349
23992 -11349 7672 -120321 -135353 59139 92344 -77866 -226775 -200835 -175231 -126814 105694
23981 105694 239839 91189 49940 43150 16116 154435 63547 64438 10041 102359 -18784
23970 -18784 -277372 -172431 -88372 -136067 -89865 -200866 -213808 -117275 42963 31255 -182429
23959a82429k47347J12042l9215L9547P8198p2319J92910n143j32748N45793J42523
23948D31812j9924l00573j91546O5276k6812M312P8895N9306k7480j3949q8138
23937b8821j70675R2177J4722j52743M3166n9158q7471O8830n8815O1023Q4105
23926a93660m8482O5250M0483k4628p427q4142J25212O3330j19925J00126o1159
23915a45022m0212m1141k3850o3610J62832j23813j81053O2210N0325J74460O2849
23904a06025K69067K00969Q3060k76929l01802K45112J09340j27458j70676J4838
23894f0504Q960k9960m7910P8373P3832j32750Q233j33513k82323R9960J24000
23883b93602L9862R9221P9947j6410j36421J0370r2633r9883O6664N0580M86332
$$ plain form
23959 -182429 -429776 -317734 -356949 -317402 -239204 -311523 -118613 -123756 -256504 289289 431812
23948 431812 411888 111315 -80231 -14955 -41767 -37455 41440 100746 73266 59317 -28821
23937 -28821 -199496 -107319 -92597 -245340 -202174 -261332 -348803 -279973 -338788 -277765 -193660
23926 -193660 -242142 -176892 -136409 -161037 -168464 -252606 -127394 -64064 -183989 -83863 -145022
23915 -145022 -185234 -226375 -250225 -313835 -151003 -274816 -455869 -393659 -343334 -168874 -106025
23904 -106025 163042 364011 447071 170142 -131660 113452 222792 95334 -75342 -60504
23894 -60504 -51544 -81504 -129414 -51041 22791 -109959 -101726 -235239 -517562 -417602 -293602
23883 -293602 -253740 -154519 -74572 -90982 -227403 -217033 -309666 -409549 -342885 -292305 194027
23872A94027m2456m26208j55142P8189Q0692j45987m7463K44542K28884l6298
23862b7220k33810L284o8844n9048J32380J06043L8208J52565m5745j88606J76049
23851a4744L1704j40370r0787j71214K00173o1342m7963K3895O8780J07944J36130
23840D2206p6165K5379m1917j85729p6042Q5353j1588k02055J915j14546K43120
23829c10069K9730l1336J35100L05264j9037o5121K13062k4581j10464m2104j44644
23818f4200q1535j0788M5955J6810R2878L2863j41293j26285J03228n8096j23033
23807c13496J03177p6025k02187M0270J23086K05808J5229j33768j26557p8086
23797d42549j49017O4343R3924J41709p06k0382L11048n5339j21967Q8810Q8777
$$ plain form
23872 194027 151571 -274637 -429779 -351590 -270898 -416885 -464348 -219806 9078 -27220
23862 -27220 -261030 -257746 -326590 -385638 -253258 -147215 -109007 43558 -2187 -190793 -14744
23851 -14744 16960 -123410 -214197 -385411 -185238 -246580 -294543 -270648 -201868 -93924 42206
23840 42206 -33959 -8580 -50497 -236226 -312268 -226915 -238503 -440558 -438643 -553189 -310069
23829 -310069 -280339 -311675 -176575 128689 109652 44531 257593 233012 122548 80444 -64200
23818 -64200 -145735 -156523 -110568 -93758 -880 31983 -109310 -235595 -132367 -190463 -313496
23807 -313496 -210319 -286344 -488531 -448261 -325175 -119367 -104138 -237906 -364463 -442549
23797 -442549 -591566 -527223 -433299 -291590 -292296 -312678 -1630 -56969 -178936 -90126 -1349
23786a349k0472J12679J54479j51097j54296q9343R0590J16756P674k54873Q2153
23775a07099J74482J27342R8332l14080l23859k35521j17383N5395L51023J68436
23765a22932J22771o3223k74541O6905J9730Q2458K27180j55260j00427J42303
23755e5036N4800Q9844j2453k47939l6946K62346j8848j68779J66453J16846m23740
23744b73452j69333n2990J68959N8342k39394l0852N2059K04667K61485J11403
23734I0894j86276m8221L5890o4509j15862J29537K49465o213j55421j2838K43721
23723A60167L8999k69232j97386M580R310J11165j8553O038J36317J04428J6112
23712A01945k8042K32845o9401l02935k07384j12066o7947J37857P0544r0953
$$ plain form
23786 -1349 -21821 90858 245337 94240 -60056 -149399 -58809 57947 65621 -189252 -107099
23775 -107099 67383 194725 293057 -21023 -344882 -580403 -697786 -642391 -291368 -122932
23765 -122932 -161 -63384 -337925 -271020 -251290 -168832 58348 -96912 -197339 -55036
23755 -55036 -236 89608 77155 -170784 -207730 54616 35768 -133011 33442 150288 -273452
23744 -273452 -442785 -495775 -326816 -268474 -507868 -538720 -486661 -281994 -20509 90894
23734 90894 -95382 -143603 -107713 -172222 -288084 -158547 90918 84705 -70716 -83554 160167
23723 160167 199166 -70066 -267452 -262872 -253562 -142397 -160950 -154912 -18595 85833 101945
23712 101945 73903 306748 237347 -65588 -272972 -385038 -452985 -315128 -244584 -335537
23702c35537j45096J18116j3166M7509P0361j00524K40113R0304j10449p2867
23692b11236J56492k2980l76973r7836K35418J07509K93059J16380Q9657m6606
23682B42884k02512m8219J5866p4841k15498K580K03026Q3117j17136j69962M2827
23671b37868l1537m7371J23874J98776q4053J22542k321r7207k73222M619J7564
23660c06204l4214L76602O8623l63201j69882R6085J0054J96520K5728Q6875j72904
23649a85918j65812j96705k3510L3552M4598K65749K35474J62910K2924n3009
23639A40253J5695q7357J64665l264k23365k83402J36021J43673Q2471Q8396R473
23628A83259J58077j81590K0346r6563L0628J3319J32785j23127k50684j08107
$$ plain form
23702 -335537 -480633 -362517 -375683 -328174 -257813 -358337 -118224 -27920 -138369 -211236
23692 -211236 -54744 -77724 -454697 -552533 -317115 -209606 83453 199833 289490 242884
23682 242884 40372 -7847 8019 -66822 -282320 -279740 -76714 6403 -110733 -280695 -237868
23671 -237868 -269405 -316776 -192902 5874 -78179 44363 42042 -55165 -328387 -323768 -306204
23660 -306204 -340418 36184 104807 -258394 -428276 -332191 -322137 -125617 -99889 -13014 -185918
23649 -185918 -351730 -548435 -571945 -538393 -493795 -228046 7428 170338 193262 140253
23639 140253 155948 68591 233256 229992 6627 -276775 -140754 2919 85390 173786 183259
23628 183259 341336 159746 180092 83529 114157 127476 260261 137134 -113550 -221657
23618b21657L05735L5030P6785J5788k84819p4724L92386O8548l24752j75803
23608a87483o1524j12211J71789R2671N3759m816J4751J041J34719j11178q0585
23597h9067J4831Q6851J16719J26501J45065j94508j88135j17604j91471k43937
23587e34755J76022K53838L2061j75384J23386j2845P9533L07618M3175j84532
23577A08117l5630J92143m083J10519o0283q7841R727o5447j00922q4616m1634
23566e9950J81453K03497j59618j1848j46710j89189J72630J00535l0045J19358
23556A80113l2098j72351j32183N7628l2116o5691l1000N4830L7443k15390M2714
23545c08101J80552q1298k03596J57371K54298k1303L6604J59549K8423M369m0533
$$ plain form
23618 -221657 84078 119108 195893 211681 -73138 -147862 244524 313072 -11680 -187483
23608 -187483 -249007 -361218 -189429 -96758 -42999 -47815 -33064 -32023 102696 -8482 -89067
23597 -89067 -74236 12615 129334 255835 400900 206392 18257 -99347 -290818 -534755
23587 -534755 -358733 -104895 -72834 -248218 -124832 -137677 -58144 249474 292649 108117
23577 108117 72487 264630 260547 371066 310783 222942 232669 167222 66300 -18316 -59950
23566 -59950 121503 325000 165382 153534 6824 -182365 -9735 90800 60755 180113
23556 180113 148015 -24336 -156519 -98891 -131007 -196698 -227698 -172868 -135425 -350815 -308101
23545 -308101 -127549 -208847 -412443 -255072 -774 -22077 14527 174076 202499 206868 166335
23534A66335J6089J53911L3030l01333r0679j7413K8940l4223J09674n1801M7453
23523E9983l1785j90357j71315N2349j70082L4954L5992l2533j02409M0692J09767
23512c64744J4916J44188N908j2971r1489r5349M1365j82585J22355J93790J79212
23501d5404Q993j03224j54541L17627J09883P3235Q569k55610O9592J51638K1177
23490B01935O607l00207m776J36791J0906N2272K3758j91682j03146N4097J63206
23479D9761r5502r4950R383j27035p8961R4873j87344j73123J06265K81391J85213
23468c0029J09441K3948J0864k73603j80971M6169j30845L1761J11639Q7851M6591
23457a47184l12186j76600L4764J24825k05723l2326K58453J32878K0340j88277
$$ plain form
23534 166335 182424 336335 369365 68032 -22647 -40060 -11120 -45343 64331 12530 59983
23523 59983 28198 -162159 -333474 -281125 -451207 -416253 -380261 -412794 -515203 -474511 -364744
23512 -364744 -349828 -205640 -199732 -212703 -304192 -399541 -358176 -540761 -418406 -224616 -45404
23501 -45404 -36411 -139635 -294176 23451 133334 206569 215138 -40472 29120 180758 201935
23490 201935 208542 -91665 -96441 40350 51256 103528 127286 -64396 -167542 -113445 49761
23479 49761 -45741 -140691 -131308 -258343 -337304 -242431 -429775 -602898 -496633 -215242 -30029
23468 -30029 79412 103360 114224 -159379 -340350 -294181 -425026 -393265 -281626 -193775 -147184
23457 -147184 -459370 -635970 -601206 -476381 -682104 -714430 -455977 -323099 -302759 -491036
23447d91036j72941J18784K05232J40444q1928Q2341J86751k3601k37794r7752
23437c71500K16839N8821j48030p229j59077l0084m0146L78815L66147k89646
23427b5090M7793J20337K22686J69045p0304k26409j70753j80984l7137N7464
23417i3352J23343J88113J06328p3557k47708j01687J75391m2135j4061k81927
23407b61252j69048L28144O4098j14205P72J65041J40396N7712n8791J2102j54173
23396A0796j81040j49266R8276K45497j56667m7356O4592P5476K15007K7521j42207
23385F0629o1268J89005n5209m8751q9851j73059P8388L16725R0239p7008k23262
23374F578j81056J04630j21867o579l19341q9646K69705K31797j87225Q8127J84988
$$ plain form
23447 -491036 -663977 -545193 -339961 -199517 -281445 -199104 -12353 -35954 -273748 -371500
23437 -371500 -154661 -95840 -243870 -251099 -410176 -440260 -480406 -101591 264556 -25090
23427 -25090 22703 143040 365726 534771 464467 238058 67305 -113679 -150816 -93352
23417 -93352 29991 218104 324432 250875 3167 -98520 76871 34736 20675 -261252
23407 -261252 -430300 -102156 -38058 -152263 -151491 13550 153946 211658 152867 164969 10796
23396 10796 -170244 -319510 -221234 24263 -132404 -179760 -115168 -39692 175315 202836 60629
23385 60629 -639 188366 133157 84406 -5445 -178504 -100116 216609 306848 229840 6578
23374 6578 -174478 -69848 -191715 -198294 -517635 -607281 -337576 -105779 -293004 -204877 -19889
23363a9889L8693l4079m2580J43244P9202j70169j8252j4422k30398j63210j21721
23352e53581J58858K9236L7816m5241P3351K296K77638L05720m6775l15158n2873
23341a28713j92856J2978k9254Q6888Q2819k87690m5147J58479J01139l4283n7658
23330c33298K5647K61355K47866J56712m4047o7206j10568k16836k45960L8810
23320b87525j53177m9409n5921J40964O3624m6540j18098R7813K84771L0491j36654
23309b29661q0678J03516K16375n4057k25782j19296k35929K14428N7329J37129
23299b16626J98523J06139J48432j80377r4186M5214K4240k15723j254L26009
23289A40391P3283k18173K32843N4600k44362k51374k31392K02191K02905J20655
$$ plain form
23363 -19889 18804 -15275 -57855 85389 164591 -5578 -23830 -38252 -268650 -431860 -553581
23352 -553581 -394723 -365487 -327671 -372912 -299561 -297265 -19627 286093 239318 -75840 -128713
23341 -128713 -321569 -308591 -337845 -250957 -168138 -455828 -500975 -342496 -241357 -275640 -333298
23330 -333298 -307651 -46296 201570 358282 314235 247029 136461 -80375 -326335 -287525
23320 -287525 -440702 -490111 -546032 -405068 -341444 -387984 -506082 -408269 -123498 -93007 -229661
23309 -229661 -310339 -206823 9552 -44505 -270287 -389583 -625512 -411084 -353755 -216626
23299 -216626 -18103 88036 236468 56091 -38095 7119 31359 -184364 -185618 140391
23289 140391 213674 -4499 228344 282944 38582 -212792 -444184 -241993 -39088 81567
23279H1567N9138m2941p3658k78244j3471J93414P5637r2371M799j08500K0796
23268a73834j03745o311K24641J23448L4530n8716Q9786j883R1947J40243N255
23257C65361r822k98993j71519K34379P1172J7691J6616j62256l54847K19128
23247g3090K65272k29837j46597P1495J18483r8446r641p0849k63834j3868P1706
23236c79206J63213K01357M7276j200K9799j18655j76105p1384j4283j14584N6815
23225c76957L38989L10956q2045p5369k3697q5944m5167l23303j35932J56222
23215c42247J42510N2292j63114q3253R6142j03832m108K84450K2421j51066l3518
23204b83323j37851m7408K52787L61313K6027j60870k6490m0238r70r0793R9809
$$ plain form
23279 81567 140705 97764 24106 -254138 -267609 -74195 1442 -90929 -86130 -194630 -173834
23268 -173834 -277579 -283890 -59249 64199 98729 40013 129799 127916 219863 360106 365361
23257 365361 355539 56546 -114973 119406 190578 208269 224885 62629 -292218 -73090
23247 -73090 192182 -37655 -184252 -112757 5726 -92720 -102361 -173210 -437044 -450912 -379206
23236 -379206 -215993 -14636 32640 31440 61239 -57416 -233521 -304905 -319188 -433772 -376957
23225 -376957 -37968 272988 190943 115574 91877 5933 -39234 -362537 -498469 -342247
23215 -342247 -199737 -147445 -310559 -393812 -297670 -401502 -405610 -121160 -98739 -249805 -283323
23204 -283323 -421174 -468582 -215795 145518 171545 10675 -15815 -56053 -57023 -147816 -48007
23193d8007j3452J69421K48424J25959K57382k38972k70360r3243n355m6652L919
23182H9064J06699p0573j21925J10740k5057p7371Q4009L9272J28747r9669j79440
23171a5504q8308j18920n6222j27749J72945M6959k91732J04687K07175k4111
23161a90780J43872L9095j39530j93075K39189J31327L9496j61087J50689J68922
23151B28118j19386m4799K5564j84136j90566J8133K15039j139P9201J81905J05927
23140C13861k32437k37396n7119J66722M46409m450k43166k72748p5342q5964
23130b81630K68K00642K08464J28010q4828j15745k10199J55987J86943J84948
23120C72860n3267K9287n0832j27447j03743j01524R6557M9594Q5570k69114k02612
$$ plain form
23193 -48007 -61459 107962 356386 482345 739727 500755 230395 137152 131797 85145 89064
23182 89064 195763 125190 3265 114005 88948 11577 95586 134858 263605 163936 -15504
23171 -15504 -103812 -222732 -278954 -406703 -233758 -186799 -478531 -373844 -166669 -190780
23161 -190780 -46908 -7813 -147343 -340418 -101229 30098 69594 -91493 59196 228118
23151 228118 108732 63933 89497 -94639 -285205 -267072 -52033 -53172 26029 207934 313861
23140 313861 81424 -155972 -213091 -46369 400040 395590 152424 -120324 -195666 -281630
23130 -281630 -281362 -80720 127744 255754 170926 55181 -155018 969 187912 372860
23120 372860 319593 348880 298048 170601 66858 -34666 61891 111485 197055 -72059 -274671
23109b74671j61189J76173K28131j01310k12865O7461J00546k17048J29219J59074
23099a06479N5895J10936K3458n8474j35500J38016O4107j58681j6394P3957J77335
23088A68176l2820l5203O0589k35908j77275l5761j70290M9967R3206J36780P4194
23077a04345n7837J23347R3720k7240N5411L1616J66468k48021k66182j35904
23067c68967O4823K19690p603k8255M5763O1252J47557J51431k74374l11299P5738
23056b24244J27938k29301k92236q9019L74853L73439K17353o4052j01663j56265
23046f3197l8886M9909Q8790q063N9860J33088o0142n1946O2382j62719k36218
23035b27142N6962J28685j08097J5892J45381p0952O4100J5735k27807q2998J42931
$$ plain form
23109 -274671 -435860 -259687 -31556 -132866 -345731 -278270 -177724 -394772 -265553 -106479
23099 -106479 -50584 60352 83810 25336 -110164 27852 91959 -66722 -83116 -9159 168176
23088 168176 135356 100153 160742 -75166 -252441 -288202 -458492 -408525 -315319 -178539 -104345
23077 -104345 -162182 -38835 54885 27645 83056 114672 281140 33119 -233063 -368967
23067 -368967 -304144 -84454 -92057 -120312 -74549 -13297 134260 285691 11317 -299982 -224244
23056 -224244 -96306 -325607 -617843 -706862 -332009 41430 258783 194731 93068 -63197
23046 -63197 -102083 -52174 36616 28553 88413 221501 161359 109413 171795 9076 -227142
23035 -227142 -170180 -41495 -149592 -133700 11681 -59271 4829 20564 -207243 -290241 -147310
23024a47310k73905j18024J33037l8275J06271L20499L24991k01726j24999J86770
23014A67329l67919k48180L8495N9926M6681L6200J10237K45533J94467k47743
23004C5026k32361n9029K7821j35475j43618J95954K33052K59515J28183j67414
22994A41654j26405j47354J0956Q5944l0444r3612L0076J29688N1300J5403j77439
22983a10233L2726J02137M37019o2614l27803l42561N661K65332K95956M8241
22973C43861j83871k68993q4658l3382J2344K9416J015J33774J35783J19130J31293
22962C35712j17760L7598j48674O6802Q638r8545K1224j05558M9017J53555J45476
22951C47485M8669k50080l41105j00014k16203J31370K14054J78745N8778j85728
$$ plain form
23024 -147310 -421215 -539239 -406202 -444477 -338206 -17707 307284 105558 -19441 167329
23014 167329 -200590 -448770 -410275 -350349 -303668 -267468 -157231 88302 282769 35026
23004 35026 -197335 -256364 -228543 -364018 -507636 -311682 -78630 180885 309068 141654
22994 141654 15249 -132105 -121149 -35205 -65649 -159261 -129185 503 51803 67206 -110233
22983 -110233 -77507 24630 461649 399035 71232 -271329 -265668 -336 295620 343861
22973 343861 159990 -109003 -193661 -227043 -214699 -185283 -184268 -50494 85289 204419 335712
22962 335712 217952 255550 106876 173678 182316 83771 104995 -563 48454 202009 347485
22951 347485 396154 146074 -195031 -295045 -511248 -379878 -165824 12921 71699 -114029
22941a14029j78419J32966j8802q1937J34267J2795k1543K90765n1828j39393
22931c5158k33064k18146l1119K82667K17132l7712j61946o4528K61012K63292
22921B42430M4647j38987j95400J00166J32730j19939k15815o3572P6290O4505
22911g2945m142O0766J7901K022J966q4004o9478r9514M1483K63663N3308n3209
22899E7817n0932M7980Q1547o2111q2420J95389K13441k16010l1893J1586j27390
22888C7004J89714j32467m7067r056k03129m5124q498K06057L83324N7286k43619
22877A84425l25985J3188K46403k36878k70976K5336J42667J78666L21772J35084
22867D13702k48946p9435K73843j81126j62260j20936j40951j4560N1096k0779
$$ plain form
22941 -114029 -292448 -159482 -178284 -260221 -125954 -113159 -134702 156063 104235 -35158
22931 -35158 -268222 -486368 -517487 -234820 -17688 -55400 -217346 -281874 -20862 242430
22921 242430 287077 148090 -47310 52856 185586 65647 -150168 -213740 -137450 -72945
22911 -72945 -77087 -16321 1580 3602 5568 -78436 -147914 -247428 -205945 57718 111026 57817
22899 57817 6885 54865 136412 74301 -8119 187270 400711 184701 152808 164394 37004
22888 37004 226718 94251 47184 38128 -165001 -210125 -218623 -12566 370758 428044 184425
22877 184425 -141560 -128372 118031 -118847 -389823 -364487 -221820 -43154 278618 413702
22867 413702 164756 85321 359164 178038 15778 -105158 -246109 -260669 -209573 -230352
22857b30352q286J55712J28221L5934J80465l6284j27841j60596J87089j36831
22847a2769j96825N4535J25585j11664p1725o9461j23844N1871J62049p6502o1304
22836c30054J46993K34232M8864m3374j82896q498k01991k0418K69223K13697
22826A25778j70532O9765J52737m3983k40665p1383j93149N0013M6213r3979J29456
22815b39729K72613L25044J59566P5864j86618l04849k82697L7848k8187J51937
22805a9208q6055j41326J1491k8086J30118K8474M3023j1750o7023j03097j13826
22794c57265K5456R0662M1312Q4834j25959p9950J67576K9927o5179P7213j7991
22783a29364K66680l9070n9695l5430j14756J19548r0267R1976q2101o6933n5619
$$ plain form
22857 -230352 -238638 -82926 45295 81229 261694 225410 97569 -63027 124062 -12769
22847 -12769 -209594 -155059 -29474 -141138 -212863 -282324 -406168 -354297 -192248 -268750 -330054
22836 -330054 -183061 51171 100035 56661 -126235 -134733 -336724 -357142 -87919 125778
22826 125778 -44754 25011 177748 133765 -106900 -178283 -371432 -321419 -275206 -369185 -239729
22815 -239729 32884 357928 517494 593358 406740 101891 -180806 -142958 -171145 -19208
22805 -19208 -105263 -246589 -235098 -263184 -133066 -104592 -61569 -73319 -140342 -243439 -357265
22794 -357265 -331809 -241147 -199835 -115001 -240960 -320910 -153334 -123407 -188586 -111373 -129364
22783 -129364 137316 98246 38551 3121 -111635 7913 -82354 9622 -72479 -139412 -195031
22772a95031L7408L25683R1064k10101j54024K4940n4844j12893Q9670q9172Q5822
22761a61478J66496l0012J57872k20007j33024j76625M9663J89122J16629q7901
22751a29265j60755j60469k3963J16253J06671K9870J53528o4638K7614k0313
22741a25467q7108j05434L3519N78R276J26700K28282K38424j54494m6487k28806
22730a11017p297p8756m2465J37683K23342P6541l2470j54529j74366n9738L5276
22719a87796J31545J79619J29252p8486k86922j93039J09263P7864K6962k32506
22709c24244R071O0717J45427K54794q9808k2409L1876q9477J13419K58626J02694
22698D50686j02441k00160k34612K603L57099O5400l71899j08746J50986K38904
$$ plain form
22772 -195031 -157623 168060 259124 49023 -105001 -80061 -134905 -247798 -158128 -247300 -161478
22761 -161478 5018 -24994 132878 -87129 -220153 -396778 -347115 -157993 -41364 -129265
22751 -129265 -290020 -450489 -474452 -358199 -251528 -221658 -68130 -132768 -105154 -125467
22741 -125467 -212575 -318009 -284490 -283912 -274636 -147936 80346 318770 164276 117789 -111017
22730 -111017 -118314 -197070 -239535 -101852 121490 198031 165561 11032 -163334 -223072 -187796
22719 -187796 -56251 123368 252620 174134 -112788 -305827 -196564 -118700 -91738 -324244
22709 -324244 -315173 -254456 -109029 145765 55957 33548 65424 -24053 89366 347992 450686
22698 450686 348245 148085 -86527 -83924 273175 338575 -33324 -142070 8916 247820
22688B47820N1242k35143r7429N9927R1701j6892k98242o0681J4014j64639r2855
22677e01177J17692K21171J67943p1510j37165p7372L6937J43510j8903R5615
22667b3259j75112N7842O1673K9854k8613L6935J14615O1780j31367r1523J07321
22656B0146r5210j93158O6980K8253L01037K38320j17106j63076M2919j31624
22646b519J55415l4263J21433J12752j97069k27792j34805R5802J74946l0851
22636C3049l9059j81288l2490J53133J61473O1434Q6768Q2774k11328r7471n1403
22625c4408j83412J4239J07272L1854m8191J84182R7593j37143L3797J79854j03757
22614A41880m6844J22529K95137J01773m0095j20362p7542N3397p1889j66331
$$ plain form
22688 247820 299062 63919 -33510 26417 118118 101226 -197016 -257697 -243683 -408322 -501177
22677 -501177 -383485 -162314 5629 -65881 -203046 -280418 -243481 -99971 -118874 -23259
22667 -23259 -198371 -140529 -78856 -49002 -77615 -40680 73935 135715 4348 -87175 20146
22656 20146 -75064 -268222 -201242 -172989 128048 366368 249262 86186 129105 -2519
22646 -2519 152896 118633 240066 352818 155749 -72043 -206848 -111046 63900 33049
22636 33049 -6010 -187298 -219788 -66655 94818 156252 243020 325794 114466 16995 -34408
22625 -34408 -217820 -203581 -96309 -64455 -112646 71536 169129 31986 65783 245637 141880
22614 141880 95036 217565 512702 614475 574380 454018 376476 429873 357984 191653
22604A91653R612P4716l8052O7166k44900r1418m0415l2920k538k2046j32301
22593b61443J8410K03867j30354L39080M35106M1577j09282k19558q8255M4962
22583B74110p4796L6814J11503k14556j25650j5424K23088J10306j25364k72114
22573g2083l22770P1397J09611L2464Q7048j07705J74719o1186J45325K60674
22563C17494r6066p7094J0435n1586N0069N8097j40793o1293K0096m664j31772
22552a07077J60428K30256K3103q08j54939l726m7172r2316j41831n5637J32479
22541e7240K35225p9799N6837o3176p2532K7058L8639J29445L1871m9187j602
22530A95539O7647M2129j24586J04477L7773j42502j04830j65012j30714J07396
$$ plain form
22604 191653 201265 275981 237929 305095 60195 -31223 -71638 -104558 -107096 -129142 -261443
22593 -261443 -243033 -39166 -169520 169560 604666 646243 536961 317403 229148 274110
22583 274110 199314 236128 347631 133075 7425 -7999 215089 325395 200031 -72083
22573 -72083 -394853 -323456 -213845 -181381 -94333 -202038 -27319 -88505 56820 317494
22563 317494 221428 144334 154769 103183 153252 211349 70556 9263 29359 24695 -107077
22552 -107077 53351 283607 306710 305902 150963 147237 100065 7749 -134082 -189719 -57240
22541 -57240 177985 98186 155023 91847 19315 46373 85012 214457 246328 197141 195539
22530 195539 263186 305315 180729 285206 322979 180477 75647 -89365 -220079 -112683
22520a12683J91294k52152j74733L4265J8856P2954r5602P8136J61436k6940N4924
22509e0245L7124j02395N1409p4690m3278P6051p2817p1145p7129J56931O147
22498a64037j08722k8178q6828K29665L24248M5894j25940k27285K1190K40401
22488A20408m0815K6000k01524j14194J05748M09200J04187j98808q18j8949k44516
22477e4081k2818K07518k6360K70441o0115k41459l0535n4726o375P723j21360
22466a32147O1891L71440J79024k6124j79380j42453J06831K50237O0879K6403
22456E76601l08108o38914k49809J11467K86554J24686K9804M4335L733R5666
22446G6015K08976K0408m5433k88316j99347K0752J3382K82647K27494l06986
$$ plain form
22520 -112683 78611 -173541 -348274 -314009 -295153 -222199 -317801 -239665 -78229 -105169 -50245
22509 -50245 -13121 -115516 -64107 -138797 -182075 -106024 -178841 -249986 -327115 -170184 -164037
22498 -164037 -272759 -300937 -387765 -158100 166148 212042 86102 -141183 -119993 120408
22488 120408 79593 105593 -95931 -210125 -104377 304823 409010 210202 209384 190435 -54081
22477 -54081 -76899 130619 104259 374700 314585 73126 42591 -12135 -18510 -10787 -132147
22466 -132147 -70256 301184 480208 454084 274704 132251 239082 489319 550198 576601
22456 576601 268493 -370421 -620230 -508763 -222209 -97523 -67719 -23384 -19651 76015
22446 76015 284991 305399 259966 -28350 -227697 -206945 -193563 89084 316578 9592
22436I592j25041l422j13486j74037Q7427M13928K57050k39052l61046J06772
22426a41315K32013o779k4098j81947p925J62564K26619o5117r8427k0848J21726
22415A96466j17857o8858p7312o1078J29538k3200M7743n031m3382j09508J5755
22404a16724o5138k2353k6769l3209Q3062O390k8184J97204o8123K14052M32j75656
22392c5016J34378J66358j46220j55899O8962Q7335J93271N0749k14366j06416
22382D3136J2361j20743q4805O5711J50835J34652K36127o7533L7087j99304k08094
22371e70j14129m3056o4865J22093K87900M4895K8952k5894n9585j38358k36960
22360a99577m4734l2278K6586q4068K24068J0270n7485J45346K72674k58942k74216
$$ plain form
22436 9592 -115449 -118871 -232357 -406394 -318967 94961 352011 112959 -248087 -141315
22426 -141315 90698 83919 59821 -122126 -130051 32513 259132 194015 95588 74740 196466
22415 196466 78609 9751 -67561 -128639 899 -22301 25442 20411 -22971 -132479 -116724
22404 -116724 -181862 -204215 -230984 -264193 -181131 -174741 -202925 -5721 -73844 140208 140640 -35016
22392 -35016 99362 265720 119500 -36399 32563 119898 313169 363918 149552 43136
22382 43136 55497 -65246 -150051 -84340 66495 201147 437274 369741 406828 207524 -570
22371 -570 -114699 -157755 -222620 -100527 187373 232268 261220 235326 175741 37383 -199577
22360 -199577 -244311 -276589 -250003 -334071 -110003 -99733 -157218 -11872 260802 1860 -272356
22349b72356Q5048R5373K37178L35J20247J41608Q653n7520l0893j97568M1165
22338A71270j3548r7498m0333L05398j69596l965O1825K64249j16490n7152k7833
22327B76327P9310L6224k0773j53636k3447q3607l7122L6330j75392K14907J45191
22316B94312j58004m191O2590o9691j47153J42462J48742J80344P2620l72718
22306A49313j73690K20149K3884J22078M1673k68466k13896j10910J84788j248
22296b6325M3850p792J53587Q5507k84591J46984J44309M7732J02299p3995j5628
22285C15937J2662j38025N4058j96940q4595J86437l4307k98241q551J46525L36675
22274B91635Q8764l59969j87835J11129J65750J21345j50430j43877j20859q0701
$$ plain form
22349 -272356 -187308 -91935 145243 145578 265825 407433 416086 358566 327673 130105 171270
22338 171270 157722 60224 19891 325289 155693 151728 213553 477802 361312 304160 276327
22327 276327 355637 391861 371088 217452 194005 110398 73276 109606 -65786 149121 294312
22316 294312 136308 132117 194707 125016 -22137 120325 269067 449411 522031 149313
22306 149313 -24377 195772 219656 341734 383407 114941 -98955 -209865 -25077 -26325
22296 -26325 17525 9733 163320 248827 -35764 111220 255529 303261 405560 331565 315937
22285 315937 328599 190574 244632 47692 -36903 149534 115227 -183014 -191565 -45040 291635
22274 291635 380399 20430 -167405 -56276 109474 230819 80389 -63488 -184347 -265048
22264b65048L7346O4351j0816O231j3055N4104K83091Q6915J37290m7777L4051
22253C66683N3784j97121n3301K84448k4775k29153k76877p637k2803j98755P1442
22242b34065O7484J34844J45195J35153m9904K9953k9680J7588L516r2569p7046
22231E0469M126J15268M2096j35580n2029j4022L6629r5852p0199r4565m9484
22220b63143L1561J31384m6175n0836J19029M4625P0995R9466p7660q9102j27781
22209a57637k9867P7285J16596K29286L21594O7483J9174j08682p8062N0624K0031
22198E27825q4644j2395r6843j12567n2804j2438k5532l0794j2279m2391j2364
22187C2774Q5948J09857K20588L6767l00470n6643K54491J75444r2499n2186k75388
$$ plain form
22264 -265048 -227702 -163351 -174167 -167936 -180991 -126887 156204 243119 380409 332632 366683
22253 366683 420467 223346 170045 454493 429718 200565 -76312 -83949 -106752 -305507 -234065
22242 -234065 -166581 -31737 113458 248611 198707 228660 198980 216568 220084 127515 50469
22231 50469 54595 169863 211959 76379 24350 10328 46957 -48895 -119094 -213659 -263143
22220 -263143 -231582 -100198 -146373 -197209 -78180 -33555 37440 136906 59246 -29856 -157637
22209 -157637 -187504 -110219 6377 235663 557257 624740 643914 535232 457170 507794 527825
22198 527825 443181 430786 333943 221376 168572 156134 130602 99808 87529 45138 32774
22187 32774 118722 228579 449167 485934 185464 128821 383312 558756 466257 414071 138683
22176A38683q9804J18220K4579k4278J06559k9598j62935l0966K33566K24800
22166E08826j60239j50991n0770J46769M7069J42339L3233k17647K576K34511
22156E35676n9269L4416J27734j57478Q4622p346j94647O7971J84994K22053K10862
22145A049588j40685n9491J20159M18939J19863l32570j8528J61457Q834j62435
22135A165131k12959m3014J1357Q9938r0176L903j70776m11175j1313J25309K90751
22124G46976J10697j54117j97456j23135O6008J62084n0471P2819M3035k07060
22114D69380j57966j30103K5793J00734J29400P3974J12325K58603j33966k25345
22104E22829N490j69127j61603L0369J08410l3429j14629j50046K32226N6348
$$ plain form
22176 138683 48879 167099 191678 167400 273959 244361 81426 50460 284026 508826
22166 508826 348587 197596 146826 293595 340664 483003 516236 298589 301165 535676
22156 535676 476407 510823 638557 481079 565701 558355 363708 431679 616673 838726 1049588
22145 1049588 908903 849412 969571 1388510 1508373 1175803 1157275 1318732 1327566 1165131
22135 1165131 952172 909158 920515 1010453 920277 924180 753404 342229 330916 456225 746976
22124 746976 857673 703556 506100 382965 448973 611057 560586 633405 676440 469380
22114 469380 311414 181311 207104 307838 437238 511212 623537 882140 748174 522829
22104 522829 528319 359192 197589 227958 336368 302939 188310 38264 270490 326838
22094C26838j78429j04163M1649K9919r8113q2185o2361K22876J8900j63372j53828
22083b02269Q1714R7256P6017M0110j02998J64599j12796k2882K47368K84373
22073E50492j76470J773M8915l05402r9264j11340j7795J38865K0446j45968M8406
22062d7342n7742K39147N8838k05250o6660L0235L81906j19809k05425J12491
22052A20389O0394J17626k02352j2879K24334o9319N6577K12169P3255K7922l01861
22041C06255l94420J94466K36251K05539j30177l96311L0608j2429j26432O6190
22031b0460L26207l1615k60564K33323K03555k69877k38767K6366k7592Q1076
22021B1652J46708K1390R2824J34387J31614J75494J9989j1640r4137k04222l34884
$$ plain form
22094 326838 148409 44246 85895 115814 17701 -64484 -126845 96031 114931 -48441 -202269
22083 -202269 -120555 -23299 52718 92828 -10170 154429 41633 18751 266119 550492
22073 550492 374022 375795 424710 119308 20044 -91296 -109091 29774 50220 -95748 -47342
22062 -47342 -105084 134063 192901 -12349 -79009 -48774 333132 213323 7898 120389
22052 120389 180783 298409 96057 83178 307512 238193 294770 506939 580194 608116 306255
22041 306255 -88165 106301 342552 548091 417914 21603 52211 39782 -86650 -20460
22031 -20460 305747 274132 13568 246891 450446 180569 -58198 -31832 -59424 21652
22021 21652 168360 189750 282574 416961 548575 724069 744058 732418 638281 434059 99175
22010I9175j19653K42950J77025r6993p7920j65274k2935J60972N8607j66550
22000H9404J24006K89440M82j29439k49397j52306j07403j3094L33569K17234
21990D02496K28009j16482k24463j981J24486j45254J185p3288M6989j11809k41009
21979a11121K15954J11268q0639p2407m2166j7891L15606O7999K21270m5283n9863
21968E02727J3881L0049m2048r4244n3963P1037k0508j57759N1916J79817j61313
21957C19592l5901j75555n4601J31307j79900O1829J45933l2493l1953K43771
21947C92029J13910j89748j32357j24544L8910R3675K69141R7629j1723Q2750
21937F29672M30j01774k20048q2886R2824L04446K04805k12539j51481r5929o3565
$$ plain form
22010 99175 -20478 222472 399497 302504 224584 59310 36375 197347 255954 89404
22000 89404 213410 502850 503332 373893 124496 -27810 -135213 -148307 185262 402496
21990 402496 630505 514023 289560 287579 412065 266811 267996 194708 241697 129888 -111121
21979 -111121 104833 216101 135462 63055 20889 2998 318604 386603 607873 562590 502727
21968 502727 516608 546657 504609 410365 356402 427439 406931 249172 301088 480905 319592
21957 319592 283691 108136 53535 184842 4942 66771 212704 180211 148258 392029
21947 392029 505939 316191 183834 59290 98200 191875 461016 558645 546922 629672
21937 629672 630102 528328 308280 225394 318218 622664 827469 614930 463449 367520 303955
21926C03955J79225L00717n1957k12784q0719P0438j52465j84735m3646J50287
21916B78316J60179r4305M8009J85743N8809q3136K2722J83312J20655j10769
21906G69535k29701p3937r3485r0768l4627m7205m4025m2971R3762K31357J53773
21895E91708j705k3965j48844j28432p0986K47971o8743o849o4773j31152M4740
21884B38970J6681r020p5903k1539O5488J07011J45866Q4560N6773q5888J44609
21873F67608k47358K5030K54775p9795l19558k84039M6660j01359j81283R4860
21863a24459K98775J71703J70211K0544l9074m8319o9679L48980J30799j21597
21853G37884N7497j63327j82827j82254J29946J90751J68928J76420j19211n3937
$$ plain form
21926 303955 483180 783897 731940 519156 438437 508875 356410 171675 128029 278316
21916 278316 438495 344190 392199 577942 636751 553615 576337 759649 880304 769535
21906 769535 539834 465897 372412 281644 247017 199812 155787 112816 206578 437935 591708
21895 591708 590003 566038 417194 288762 217776 465747 397004 390155 325382 194230 238970
21884 238970 255651 246631 170728 149189 214677 321688 467554 552114 608887 522999 667608
21873 667608 420250 445280 700055 620260 300702 16663 63323 -38036 -219319 -124459
21863 -124459 174316 346019 516230 536774 497700 449381 379702 728682 859481 737884
21853 737884 795381 632054 449227 266973 396919 587670 756598 933018 813807 759870
21843G59870K17259J36904j03895k72324j80974K36385o3178j64594O1218L01819
21833I28490P0634l0198m6051j82804Q3959n9904l554J28159k09477L13017J81265
21822A173536q4453J3046L52205M816q0748j00985l8999J73578K06163J69123
21812A787282K48634K10016K18258J1557l08873N4819k1688j32743m7167L3151
21802B053246K29201K28136k63618l44457R7308j08576j50688q3614K54001K57003
21792B167942r0009p2208K37402K21684J20662r0824j06850r365l62968l51579
21782A663887J50048l2825k8703j95169j20280j09367p8500J35343j01106P261
21772A290589P1691j58407k92355j22478J57999K04027r4748p4251j35108J63085
$$ plain form
21843 759870 977129 1114033 1010138 737814 556840 793225 730047 565453 626671 928490
21833 928490 999124 968926 922875 740071 824030 764126 760572 888731 679254 992271 1173536
21822 1173536 1089083 1102129 1454334 1459150 1378402 1277417 1238418 1411996 1618159 1787282
21812 1787282 2035916 2245932 2464190 2475747 2166874 2221693 2200005 2067262 2020095 2053246
21802 2053246 2282447 2510583 2246965 1902508 1999816 1891240 1740552 1656938 1910939 2167942
21792 2167942 2077933 2005725 2243127 2464811 2585473 2494649 2387799 2378434 2015466 1663887
21782 1663887 1813935 1781110 1752407 1557238 1436958 1327591 1249091 1384434 1283328 1290589
21772 1290589 1362280 1203873 911518 789040 947039 1151066 1056318 982067 846959 1010044
21762A010044l85j88091n5007o5694J66489K70435j1361n1507j77260n3785P2131
21751I16009R3689Q4072r5372N3414J71563k1430o2048Q0208J42610l1511r5353
21740A235851n5705k18559r9245J18282j36156M4836L41922R852j76560Q904n4351
21729A019071j58125R7813J22290k83139o0538j6305R9935m0790L623M0685J59390
21718I83910J9260L5887j5624j86525Q2505K37485J1318j60801J29191j11980
21708A024626L9239J85755k886Q7594R7580J86226Q0198k06692J16653k36173
21698A372120j66860p1267j13647o3824n0753m3378J85921R5081M9047Q8160K29114
21687A509714k9094k6703P231j53189p6772O2341J60592L0558J16985K0428p0188
$$ plain form
21762 1010044 1009659 821568 766561 700867 867356 1137791 1126430 1074923 897663 843878 916009
21751 916009 1009698 1093770 998398 1051812 1223375 1201945 1139897 1220105 1362715 1331204 1235851
21740 1235851 1180146 961587 862342 980624 844468 889304 1231226 1241078 1064518 1073422 1019071
21729 1019071 860946 958759 1081049 797910 737372 721067 821002 780212 783835 824520 983910
21718 983910 1003170 1039057 1023433 836908 919413 1156898 1168216 1007415 1136606 1024626
21708 1024626 1063865 1249620 1246734 1334328 1431908 1618134 1698332 1491640 1608293 1372120
21698 1372120 1205260 1133993 1020346 956522 905769 862391 1048312 1143393 1192440 1280600 1509714
21687 1509714 1480620 1453917 1461148 1307959 1231187 1293528 1454120 1484678 1601663 1622091 1551903
21676A551903k97701O8783k4889J82368j1182N169Q1137K514Q7888r0164n1140
21665A504686N1830J31396J279o8530p8394J8092J31934j39053q1627K43674Q1117
21654A796404J22250L15342j67096k41061p1917J19364L00129J07911k75681l12398
21644A693247J75685K66970K5514j87083P2894R3333K1558P2028R3676P6733j05358
21633B299197N9605j1753m4487j57116n3137K89519J07596J19570l1951P1400
21623B648443j46219r7422k9181M5722N6832m613k6540J46750K92284L242k20776
21612B668522k77576K02625K69928K7604J71489L05821j15256p6371P1755k07804
21602C040737n2562L08435J05503L30448J71750n3092j82702K44945L15486R7192
$$ plain form
21676 1551903 1254202 1322985 1298096 1480464 1469282 1474451 1555588 1558102 1645990 1555826 1504686
21665 1504686 1556516 1687912 1689191 1620661 1542267 1560359 1692293 1553240 1471613 1715287 1796404
21654 1796404 1918654 2233996 2066900 1825839 1753922 1873286 2173415 2281326 2005645 1693247
21644 1693247 1868932 2135902 2161416 1974333 2047227 2140560 2162118 2234146 2327822 2404555 2299197
21633 2299197 2358802 2347049 2302562 2145446 2092309 2381828 2489424 2608994 2577043 2648443
21623 2648443 2502224 2404802 2375621 2421343 2478175 2473562 2447022 2593772 2886056 2889298 2668522
21612 2668522 2390946 2593571 2863499 2891103 3062592 3368413 3253157 3176786 3248541 3040737
21602 3040737 2988175 3296610 3402113 3732561 3904311 3851219 3668517 3913462 4228948 4326140
21592D326140j7706m6443j06006k35718K9556K75374M57083J17631J27105K69922
21582E196938R3793m85642k77233K56195K53450K20097Q5792l6444k5750K8177
21572E309373J68630K22296K31915K19774K16872J0638Q6407J58888K75233J63633
21562G063659K31047n1208m7305K72907K16900J43261K61821K60022K13812n4148
21552H510768J79904K64241L80894O16455K40834K26745N74047M48084J38738
21543A1580710J92042K54231K79986N00327N61412L52650M28335O82168P67290
21534A5599151L06782N18538O82051O86035O96794P80270O57523O92510R34603
21525B1554257R33391J396988J354594J034597J120782J395158J626911J417536
$$ plain form
21592 4326140 4308434 4261991 4155985 3920267 3949823 4225197 4682280 4799911 4927016 5196938
21582 5196938 5290731 4805089 4527856 4784051 5037501 5257598 5343390 5306946 5281196 5309373
21572 5309373 5478003 5700299 5932214 6151988 6368860 6379498 6465905 6624793 6900026 7063659
21562 7063659 7294706 7243498 7196193 7469100 7686000 7829261 8091082 8351104 8564916 8510768
21552 8510768 8690672 8954913 9335807 9952262 10193096 10419841 10993888 11441972 11580710
21543 11580710 11772752 12026983 12306969 12807296 13368708 13721358 14149693 14831861 15599151
21534 15599151 15905933 16424471 17106522 17792557 18489351 19269621 19927144 20619654 21554257
21525 21554257 22487648 23884636 25239230 26273827 27394609 28789767 30416678 31834214
21517C1834214J468896J771164J958745K319128K411476K385201K920387L171879
21509E0241090L477226M039386M766903N500694O007302O923337P971257R234644
21501I8161839J0372294J1585974J3138976J4619418J5615680J6123018J5672927
21494A95290126J3691504J0559940O139713J435000l274855p521734j0685141
21487B05634553j2790100j3871165j4273561j4365976j3789572j2353435j1400391
21480A12790353j0506854r474921q401412p397600o417098n753500m737372m405387
21472E5696209l892310l588941l129594k603069k306096k626645k026984j600523
21464C3922047j784242j670484j713799j608324j429935j145929j371567j231960
$$ plain form
21517 31834214 33303110 35074274 37033019 39352147 41763623 44148824 47069211 50241090
21509 50241090 53718316 57757702 62524605 68025299 74032601 80955938 88927195 98161839
21501 98161839 108534133 120120107 133259083 147878501 163494181 179617199 195290126
21494 195290126 208981630 219541570 225681283 227116283 223841428 216319694 205634553
21487 205634553 192844453 178973288 164699727 150333751 136544179 124190744 112790353
21480 112790353 102283499 92808578 84407166 77009566 70592468 64838968 60101596 55696209
21472 55696209 51803899 48214958 45085364 42482295 40176199 37549554 35522570 33922047
21464 33922047 32137805 30467321 28753522 27145198 25715263 24569334 23197767 21965807
21456B1965807j040743p86668q79858r50310j009282p08541p16912p17407n58581
21447A4597505n92940n66648n47696m61098n39698m41126j7962k28129k56774
21438A0945434n31485m27183n06016k63664j98256k21218k61944l54743k74965
21429G905960j46904k69770o00365k83262J86861M7793j09244q7559k74640k86002
21419F082868J4776q6224k01845j52342k38619j40328J29896J82853j16456j23404
21409E351175k85051K8967l4192k2709K7151o6890j52598J64468k88845r5428
21399D626048p7672K29333L75406J36164o841j23836j07067R4003J973q3761k29829
21388D833921m8003l2632K86286J95756r6724j09462J39094j29484l06435j71868
$$ plain form
21456 21965807 20925064 20138396 19258538 18308228 17298946 16590405 15873493 15156086 14597505
21447 14597505 14004565 13437917 12890221 12429123 11889425 11448299 11430337 11202208 10945434
21438 10945434 10413949 9986766 9480750 9217086 9018830 8797612 8535668 8180925 7905960
21429 7905960 7759056 7489286 6888921 6605659 6792520 6840313 6731069 6643510 6368870 6082868
21419 6082868 6097644 6011420 5809575 5657233 5418614 5278286 5408182 5591035 5474579 5351175
21409 5351175 5066124 5095091 5060899 5038190 5065341 4998451 4845853 5010321 4721476 4626048
21399 4626048 4548376 4777709 5153115 5289279 5282438 5158602 5051535 5145538 5147511 5063750 4833921
21388 4833921 4785918 4753286 5039572 5235328 5138604 5029142 5168236 5038752 4732317 4560449
21378D560449L0829J54687J14743J96775J69649j22450L7000k7785J50682J60730
21368E425309k11974j09812K80052N8382j96392m7567Q9810k99261J72976K70210
21358E431733j90526j042J51525N9836j23600k05398o084n4156K4623K37617J17898
21347E442426q6021O7483J04215k2708j28639l4437O6929M046N8475L86623J25164
21336E983556Q6158k9769n4056j85965k30904k57985N6423K27813O6037R2546
21326E753854J74284l0940J14059N0981J25696k9193J14985K50878n3354j24262
21316F346988K02896J94391o5820k9057l6149k3308J74018K45342K27320J62949
21306G399570K05583L02092J28083O6163J41203L73881J08012N12259J69355J05152
$$ plain form
21378 4560449 4591278 4745965 4860708 5057483 5227132 5104682 5141682 5113897 5264579 5425309
21368 5425309 5213335 5103523 5383575 5441957 5245565 5197998 5287808 4988547 5161523 5431733
21358 5431733 5241207 5240165 5391690 5451526 5327926 5122528 5116444 5062288 5086911 5324528 5442426
21347 5442426 5356405 5423888 5528103 5505395 5376756 5342319 5409248 5413294 5471769 5858392 5983556
21336 5983556 6069714 6039945 5985889 5799924 5569020 5311035 5367458 5595271 5661308 5753854
21326 5753854 5928138 5897198 6011257 6062238 6187934 6158741 6273726 6524604 6471250 6346988
21316 6346988 6549884 6744275 6678455 6649398 6613249 6589941 6763959 7009301 7236621 7399570
21306 7399570 7605153 7907245 8035328 8101491 8242694 8616575 8724587 9236846 9406201 9511353
21296I511353K09729K61594J64586L5920K14982L90092M2817j31924J52996K90288
21286A1142433L49717J06319L42189L58862M32968L79194J51929K22344K87407
21277A3773362L51579N23134L24363L08448M83343L61471L04797M95899N88955
21268A7515351N06482N79416Q74998P54061P40285O62480Q33818O78720Q64507
21259B4010118R89184R50375Q29457R78082R24962J214802J092438J175144J083327
21250C3247889J316780J576942J649721J943747K041168K092633K215776K025163
21242D8109819K166784K467799K775691K726916L189885L651275L846696M241534
21234G3176399M706897M992140N377700O293426P328177P726523Q764408J0045348
$$ plain form
21296 9511353 9721082 9982676 10147262 10183182 10398164 10788256 10831073 10699149 10852145 11142433
21286 11142433 11492150 11598469 11940658 12299520 12732488 13111682 13263611 13485955 13773362
21277 13773362 14124941 14648075 14972438 15280886 15764229 16125700 16430497 16926396 17515351
21268 17515351 18021833 18601249 19476247 20230308 20970593 21633073 22466891 23145611 24010118
21259 24010118 24999302 25949677 26779134 27757216 28682178 29896980 30989418 32164562 33247889
21250 33247889 34564669 36141611 37791332 39735079 41776247 43868880 46084656 48109819
21242 48109819 50276603 52744402 55520093 58247009 61436894 65088169 68934865 73176399
21234 73176399 77883296 82875436 88253136 94546562 101874739 109601262 118365670 128411018
21226A28411018J1243359J2922273J4890967J7538254K0375105K3543084K6960518
21219B55884578L0973570L5117155L8102646L9135024L7334348L1524675K1820499
21212D89892495R184932m179101j6015367k4839930l0198134l3146983l3761080
21205C56936832l3080882l1375361k9270997k6502451k3348736k0628842j8383482
21198A74346081j6061175j3804749j2170141j0617961r532473q202174p458510
21191I6498898o860308n878430n274941n044427m480045m226426l753733l686203
21183E7294385l235076k710903k785366k419234k210897k263462k347795k222152
21175C7099500k033827j909300j596330j483736j374929j271670j446082j464560
$$ plain form
21226 128411018 139654377 152576650 167467617 185005871 205380976 228924060 255884578
21219 255884578 286858148 321975303 360077949 399212973 436547321 468071996 489892495
21212 489892495 499077427 494898326 478882959 454043029 423844895 390697912 356936832
21205 356936832 323855950 292480589 263209592 236707141 213358405 192729563 174346081
21198 174346081 158284906 144480157 132310016 121692055 112159582 103957408 96498898
21191 96498898 89638590 83760160 78485219 73440792 68960747 64734321 60980588 57294385
21183 57294385 54059309 51348406 48563040 46143806 43932909 41669447 39321652 37099500
21175 37099500 35065673 33156373 31560043 30076307 28701378 27429708 25983626 24519066
21167B4519066r54329q55480j042850r15993p36062q65714p72867p42878l70811
21158A7262082l83236p31871n91750m77386l96830l42788j59001k26796l29612
21149A3622812l92714r3878j54928l34489m30427n33294l06849l78114o65675
21140A0332444l96060m24342m54330j93860n6072j46865l00745l70433l73541
21131G616196l42689l08045k87949j97372j16962j32013n4623L8526k28197P498
21121E994370p4892k21638k20607j86833o5299r9184l2452l46336l99285O1107
21111D408951j7185n712M6029m855k42792j06694j50801k18238K4642J27512p135
21100C853722P4614j57589n3316J45141J2894o3754m02302j00079k38839k18798
$$ plain form
21167 24519066 23564737 22709257 21666407 20750414 20014352 19148638 18375771 17632893 17262082
21158 17262082 16878846 16146975 15555225 15077839 14681009 14338221 14179220 13952424 13622812
21149 13622812 13230098 13136220 12981292 12646803 12216376 11683082 11376233 10998119 10332444
21140 10332444 9936384 9512042 9057712 8863852 8807780 8660915 8360170 7989737 7616196
21131 7616196 7273507 6965462 6677513 6480141 6363179 6231166 6176543 6215069 5986872 5994370
21121 5994370 5919478 5697840 5477233 5290400 5225101 5125917 5093465 4747129 4347844 4408951
21111 4408951 4391766 4386054 4432083 4427228 4184436 4077742 3926941 3708703 3733345 3860857 3853722
21100 3853722 3928336 3770747 3717431 3862572 3875466 3811712 3409410 3309331 3070492 2851694
21090B851694j63139r9663R7131P2753k40592k4050q7210Q7697J36128N1433j22869
21079B559313R5508K8862j27877J03993k7012j52263n0327j19339M9341o2270
21069B297929J16880J44287k34689n5153M2847n0895q0123n2621l2569K07407
21059B303300K31189j94464j63746j21485p4641K07001J66036l50647j03116k241
21049A897186o4438j09046r0378k6349K04108M026o2666j92016N4669R2914J79461
21038A887471L15998Q2341Q936j5510l50999j74047J36419R4490j86169J00321
21028A899251L57492K30180k85305m3632K46991K29385K74383J44551P7065K20484
21018C350845K15838J15490n6576p8998R2053j09741k73711J6931j23990l15941
$$ plain form
21090 2851694 2688555 2588892 2686023 2758776 2518184 2494134 2406924 2494621 2630749 2682182 2559313
21079 2559313 2654821 2683683 2555806 2659799 2632787 2480524 2430197 2310858 2360199 2297929
21069 2297929 2414809 2559096 2324407 2269254 2312101 2261206 2181083 2128462 2095893 2303300
21059 2303300 2534489 2340025 2176279 2054794 1980153 2187154 2353190 2002543 1899427 1897186
21049 1897186 1832748 1723702 1633324 1606975 1811083 1815109 1752443 1560427 1615096 1708010 1887471
21038 1887471 2203469 2285810 2294746 2279236 1928237 1754190 1890609 1985099 1798930 1899251
21028 1899251 2256743 2486923 2201618 2157986 2404977 2634362 2908745 3053296 3130361 3350845
21018 3350845 3566683 3682173 3625597 3546599 3638652 3528911 3255200 3272131 3148141 2832200
21008B832200k93163j56212k87945K8000R9359O6290j55671m351q370j09583m5947
20997A964607j29570k27558q0143J15153p1036K67950o1060l98812k02601Q8291
20987A265221K37200K28168O2741j59250k1162m5075J73490p0811j29954K58388
20977A798956p9559k91794p10O246j86755l7378M6631n1311Q3491J27049K1964
20966A436830l53676l19138l2159L17158K72742R4637r6769p5127j21499j87822
20956I35177j8587L1509j9367L0023K05025R0062o3235R3949k8867j3169k20663
20945A021857j02722l0849N4704n2405m8304K7378R1097O3665J5666p718L06652
20934A339021j79457L5717R0244j77264l66035r272J82032j00403k40063l2786
$$ plain form
21008 2832200 2539037 2382825 2094880 2122880 2222239 2288529 2132858 2128507 2120137 2010554 1964607
20997 1964607 1835037 1607479 1527336 1642489 1571453 1839403 1778343 1379531 1176930 1265221
20987 1265221 1502421 1730589 1793330 1634080 1612918 1567843 1741333 1670522 1540568 1798956
20977 1798956 1719397 1427603 1426893 1433139 1246384 1209006 1255637 1204326 1287817 1414866 1436830
20966 1436830 1083154 764016 731857 1049015 1321757 1416394 1319625 1244498 1122999 935177
20956 935177 916590 948099 928732 958755 1163780 1253842 1190607 1284556 1255689 1242520 1021857
20945 1021857 919135 888286 942990 890585 842281 869659 960756 1024421 1040087 1032369 1339021
20934 1339021 1159564 1195281 1285525 1108261 742226 732954 914986 814583 574520 541734
20924E41734J96376M9586R903j6382K1211l1006p0500l7752O5512O5221j45866
20913F48037l34788K65405L22856O2429O402q028j81460j77544k7764J86353p8125
20902F83773P9467J93286j86065N9630M2548q0793j22184j94505k0537n5490J3232
20891D12362J78039j88793p2678Q7718j06883j56879j1106K38875J28756m7570
20881D61841N7176K50656J41922r924k38368n7168n1761p7266K16684O7405K23207
20870I84404r9633j1731P0597P1992j73019j56806l8835p5802j1969N6607K6842
20859F42647l06866K1719P2139J36419q0602l3722K72268o0711j22591k60520
20849B80180K04686K88811P3222j54832J82020K1689M0747K15398J72483M5434
$$ plain form
20924 541734 738110 787696 797599 781217 802428 771422 700922 663170 728682 793903 648037
20913 648037 313249 578654 901510 963939 970341 962313 780853 603309 575545 761898 683773
20902 683773 763240 956526 770461 830091 872639 791846 669662 475157 454620 399130 412362
20891 412362 590401 401608 328930 416648 309765 152886 141780 380655 509411 461841
20881 461841 519017 769673 911595 901671 663303 606135 554374 477108 693792 761197 984404
20870 984404 884771 873040 943637 1015629 842610 685804 646969 571167 559198 615805 642647
20859 642647 335781 357500 429639 566058 485456 451734 724002 663291 540700 280180
20849 280180 484866 773677 846899 692067 874087 895776 936523 1151921 1324404 1369838
20839A369838o6487P3699M3165j11489P5882n3995q2801l6982n3103m0338Q2061
20828A199450j75942l06K66938q3256m02303j94547k48687Q1097q6805k06992
20818A48647O3527K91273J66921j4139k07694j8225J77072j074l4163q78J806
20807E73073j26427p2865l4424k80826N1876K72106o1622o9370J7897R8857P4963
20796D43238k58306Q4142K8332p2824O3319J8292J67837L6173J20265p3733l82622
20785A74113k21898K36544K4326P8683K18553N8974J4824k32238K459J07435N0020
20774E11795j28765K7022J18963j79796k71811M8651r7070j5313o1409J18108
20764G0375l9778J1004n0163j44349M5936J99603L25751J23825k9819r0115k42226
$$ plain form
20839 1369838 1303351 1377050 1420215 1308726 1384608 1330613 1247812 1210830 1157727 1117389 1199450
20828 1199450 1023508 1023202 1290140 1206884 804581 610034 361347 442444 355639 148647
20818 148647 212174 503447 670368 656229 448535 430310 607382 606308 572145 571267 573073
20807 573073 446646 373781 339357 58531 110407 382513 320891 251521 269418 368275 443238
20796 443238 184932 269074 297406 224582 287901 306193 474030 510203 630468 556735 174113
20785 174113 -47785 188759 213085 291768 510321 569295 584119 351881 354340 461775 511795
20774 511795 383030 410052 529015 349219 77408 126059 28989 13676 -47733 70375
20764 70375 30597 41601 -8562 -152911 -106975 92628 418379 542204 512385 422270 180044
20753A80044M8423J5100R2973K1886k85025L8571J29138J14143j89514j62990
20743B749J97677k32513j40329j0094Q8898J28866K04087P8328j94842j45689
20733b2862p9318K5586p9210j10091J44665J26486O9710q7488j29517L06936J85028
20722C49925m2987O1374n6131J06493q7383R5937r621R0432j37148J61182J18123
20711F50196k41111m7167N1931k1801K54144k4640j95479j95265j72943K26957
20701B84822l4481J73290l9338l14277J08117L19517j05101l21655l7687J10283
20691A43490r8118q2561J68397J49666J14506K89094m6813n6342q7789k63391
20681B30139J48795J63041O6853j13030q1457j42093L0241j24718k08798K69943
$$ plain form
20753 180044 228467 243567 336540 358426 73401 111972 241110 355253 165739 2749
20743 2749 200426 -32087 -172416 -182510 -93612 35254 239341 317669 122827 -22862
20733 -22862 -102180 -76594 -155804 -265895 -121230 5256 74966 -12522 -142039 164897 349925
20722 349925 306938 368312 312181 418674 331291 427228 417607 508039 370891 532073 650196
20711 650196 409085 361918 413849 392048 646192 621552 426073 230808 57865 284822
20701 284822 250341 423631 384293 70016 178133 497650 392549 70894 33207 143490
20691 143490 45372 -37189 131208 280874 395380 684474 637661 581319 493530 230139
20681 230139 378934 541975 608828 495798 414341 272248 302489 177771 -31027 238916
20671B38916l7441r0194o1627j43783K17713K70877o5986k3974n5906l7735J738
20660B12598J67207P7308j91472j91826J81924K61397M03363p8276k00705n4784
20650E86734J57643j17750K49794J30624P6427N3171j10178j77538j25454O5065
20640G88538J33365O9214j4146n284J88500J52906J91458P4031k1025q7237M9932
20629A520252R1055M5645J0490K98155J59811l9746o7678j92454j48750o6981
20619A609799M073J52002n1707p1298p1410P010J57177j11967j56790O9009M6187
20608A582085J57688P6428P8536j33558N6377j50450l39066k36869k62096n2705
20598G76370Q1561J19981o1429n2237J21720O0384k02186l3425K00765O8492k7010
$$ plain form
20671 238916 201475 111281 49654 -94129 123584 394461 328475 304501 248595 210860 212598
20660 212598 379805 457113 265641 73815 255739 517136 920499 842223 641518 586734
20650 586734 744377 626627 876421 1007045 1083472 1136643 1026465 848927 723473 788538
20640 788538 921903 991117 976971 971687 1160187 1313093 1504551 1578582 1557557 1470320 1520252
20629 1520252 1611307 1656952 1667442 1965597 2125408 2085662 2017984 1825530 1676780 1609799
20619 1609799 1613872 1765874 1714167 1642869 1571459 1578469 1735646 1623679 1466889 1535898 1582085
20608 1582085 1739773 1816201 1894737 1761179 1817556 1667106 1328040 1091171 829075 776370
20598 776370 857931 977912 916483 864246 985966 1046350 844164 810739 1011504 1079996 1052986
20587A052986p6248l67977J40354q0667k18042n5454J03704M9908Q9963m9057
20577E89470j33269j10309K1782O2795J15099k0523l6931k62494K180m4418M9805
20566B33187o0355j26152j678J90990L3125k49415J26497Q1894J44224J94643
20556E66960k53604j74209N8032J4070J66311N777l2145j86948m50522k16518
20546e02796J19854J77250J98355J01619k3547J37914j05905k0106k5997n8863
20536b222P5924L9971O3871k77655o5810M49655J54042l3848n5372O0474R4507
20525E03537Q1823N5162o2456o6091J13203k07859l72234O0325J0320n5694r3789
20514c3753O0387K23436R5242j04013j54159j11112J1100N1113J6658O8356p7255
$$ plain form
20587 1052986 976738 608761 749115 668448 450406 394952 498656 548564 638527 589470
20577 589470 456201 345892 367674 430469 545568 525045 488114 225620 227800 183382 233187
20566 233187 172832 46680 45002 235992 269117 19702 146199 228093 372317 566960
20556 566960 313356 139147 197179 211249 377560 383337 351192 164244 -286278 -502796
20546 -502796 -382942 -205692 -7337 94282 70735 208649 102744 82638 56641 -2222
20536 -2222 73702 113673 177544 -100111 -165921 283734 437776 403928 348556 409030 503537
20525 503537 585360 640522 578066 511975 625178 417319 45085 105410 115730 60036 -33753
20514 -33753 26634 250070 345312 241299 87140 -23972 -12872 38241 54899 123255 46000
20503D6000o6997k3227K02839O8226j26571l6220J88822k3793R3j82778j78624
20492a32230j18706J52108J11066q0365K16900K22165J71282R9154L4963j22574
20482E53763j78236j5816q4133k30891l16410p8392K27761K9349P0754p5363p5660
20471a73274l9301N2174K2951k338n196k65261n1121r2330K94917K01837J0803
20460d6139N5288J49331r392J66486j3923j69579k7891j89788m4943K3878k65123
20449c71795n4945J63548K99952N7998O1761N0753j640j16480k65101l18832q2365
20438e77146L23541K29999J49299J99034j43148j5855K16481j03785j48220n8193
20428G2007j37075R4989j40136j006J77090J76002j15641p6176R3770J94871J5928
$$ plain form
20503 46000 -20997 -44224 158615 226841 100270 64050 252872 229079 229172 46394 -132230
20492 -132230 -250936 -98828 12238 -68127 148773 370938 542220 641374 676337 553763
20482 553763 375527 359711 275578 44687 -271723 -350115 -122354 -93005 -22251 -97614 -173274
20471 -173274 -212575 -160401 -137450 -139788 -144984 -410245 -461366 -553696 -258779 -56942 -46139
20460 -46139 9149 158480 149088 315574 301651 132072 104181 -85607 -130550 -106672 -371795
20449 -371795 -426740 -263192 36760 94758 156519 207272 205632 89152 -175949 -494781 -577146
20438 -577146 -253605 -23606 125693 324727 181579 165724 382205 278420 130200 72007
20428 72007 -65068 29921 -110215 -111221 65869 241871 126230 50054 143824 338695 354623
20417C54623l09823k67685m5491J31784K61639q6585l20212L0772K7722L2421
20407a90835J53030j1045O9796J91698l3037j9192j58940j01448p352J23963J85823
20396B02461j14789p1802p9220L15397J3629k06436r4234Q8938p5621J32097P9075
20385A89495j6665m6755j11430r0382m8641j19726l5669M5665K28768K77943J00840
20374C73443K0486k0395j28551k31928L8022J05775j43734p1739j18570L02653
20364A25462J59475j82924r5261J15022O4257r6960P9290p0941L6969O8587j18401
20353H4575j33422k47061k4654J08716J37710J25470J81011r5733l0612J26178
20343B32178J3379j98584m1001k15615J36274K45028L1750J2103K22183j72158
$$ plain form
20417 354623 44800 -222885 -268376 -136592 125047 38462 -281750 -250978 -223256 -190835
20407 -190835 -37805 -48850 20946 212644 179607 160415 1475 -99973 -107325 16638 202461
20396 202461 87672 15870 -63350 252047 265676 59240 -34994 53944 -21677 110420 189495
20385 189495 172830 126075 14645 -75737 -124378 -244104 -279773 -234108 -5340 272603 373443
20374 373443 393929 373534 244983 13055 51077 156852 13118 -58621 -177191 125462
20364 125462 284937 102013 6752 121774 186031 89071 168361 97420 134389 202976 84575
20353 84575 -48847 -295908 -320562 -211846 -74136 51334 232345 136612 106000 232178
20343 232178 245557 46973 5972 -209643 -73369 171659 203409 215512 437695 265537
20333B65537j115j02671K8590n0272k8836K8362j45213k19624L01840J46275n5202
20322A67671l2179p5220O3801l29958j30436J45225J52006K12646J31783p5303
20312B30036P0201R4295j67362j74473P1375j22835L2268K00222Q5154j821p3940
20301B43120k23128l2298M30K37265J07346q8605J86742N2093R1729j1284q4557
20290D78853j98804k5242j06661O3038q0131r7965K80871Q7353j12400j90981
20280I7931k7886J92569K91437l9885l66927j46560k7413O8945J89340o3805k48220
20269h0474r1983J15628J5588J09645M6383k34591l1902J16548j4957l17319R4953
20258b72481K83852j47389n4121O7702Q8611J17503M5060J31071j3310N9984k3119
$$ plain form
20333 265537 264422 161751 190341 140069 111233 139595 -5618 -225242 76598 222873 167671
20322 167671 135492 60272 124073 -205885 -336321 -191096 -39090 173556 305339 230036
20312 230036 300237 394532 227170 52697 124072 1237 33505 233727 318881 317060 243120
20301 243120 19992 -12306 -11876 225389 332735 244130 430872 482965 574694 563410 478853
20290 478853 280049 254807 148146 211184 131053 33088 313959 401312 288912 97931
20280 97931 70045 262614 554051 514166 147239 679 -26734 42211 231551 167746 -80474
20269 -80474 -172457 -56829 -41241 68404 114787 -119804 -151706 -35158 -50115 -367434 -272481
20258 -272481 11371 -136018 -190139 -122437 -33826 83677 128737 259808 246498 306482 283363
20247B83363k35974n9894J70735r6780j35675m8473K26061j66683l24637O0731
20237c27226K43826J14503K1775L432r0047N0987Q736j44714j21970l1116J7472
20226b54342J11585R2756p6174m895J36818R3807j03088M4699L43285k9483L904
20215C58872j76611j48754j99262j07040K39853j7148R568j2231l67512J27139
20205b93126R9224l4244j128J43150l9734n6910k8998k8270j2684L25179J50694
20194B23153l22926k65361J06940j32329l8253K98871Q2067K10350J16003J14714
20184C93229j13945j35482q9989K3074n1701o99K66986J30462k29861r0287R1006
20173A92793j38277l1463l17328Q109k3883J25694L4247J23039O4364l1917R316
$$ plain form
20247 283363 47389 -12505 158230 61450 -74225 -122698 103363 -63320 -387957 -327226
20237 -327226 -83400 31103 52878 56310 -33737 17250 25986 -118728 -240698 -271814 -254342
20226 -254342 -142757 -50001 -126175 -131070 5748 99555 -3533 41166 384451 354968 358872
20215 358872 182261 33507 -165755 -272795 -32942 -50090 -40522 -52753 -420265 -293126
20205 -293126 -193902 -228146 -229274 -86124 -125858 -182768 -211766 -240036 -252720 72459 223153
20194 223153 -99773 -365134 -258194 -390523 -428776 -129905 -47838 162512 278515 393229
20184 393229 279284 143802 53813 76887 25186 24487 291473 421935 192074 101787 192793
20173 192793 54516 23053 -294275 -286166 -310049 -184355 -150108 -27069 37295 5378 14694
20162A4694j24815k8129R6359J03514n9945j79050K1498N6843M3900q1317q6184
20151b22632L5744j6374r2421R7913J82232O2874K0266m2423l5523M9687j61835
20140a22492j93204K0403L19806J70290j64859j84294M4934O5021Q8688R0737
20130A35030j03419j71214k86716o6184o0709J90545O2970j37148o8540J86317
20120c19068K7355o5310K25420J53398J7959J4817k65635j18376k65355j10215
20110g05010O8127J25760K32759J77655O7780Q8089J04354j13057o2350k07439
20100b23332j44725j9836L4328L11130K44825p0159j48546k4002N8204L5307L9477
20089I2671R7526k45616k46116O5271k11314J8676M0667L7527K25231K29979K1251
$$ plain form
20162 14694 -110121 -138250 -41891 61623 1678 -177372 -155874 -99031 -55131 -136448 -222632
20151 -222632 -186888 -203262 -295683 -197770 -15538 47336 67602 25179 -10344 39343 -122492
20140 -122492 -315696 -295293 24513 194803 29944 -154350 -109416 -44395 44293 135030
20130 135030 31611 -139603 -426319 -492503 -553212 -362667 -299697 -436845 -505385 -319068
20120 -319068 -291713 -357023 -131603 21795 39754 54571 -211064 -329440 -594795 -705010
20110 -705010 -636883 -511123 -278364 -100709 -32929 55160 159514 46457 -15893 -223332
20100 -223332 -368057 -387893 -353565 -42435 202390 132231 -16315 -40317 17887 53194 92671
20089 92671 190197 -55419 -301535 -236264 -447578 -428902 -388235 -350708 -125477 104502 125753
20078A25753J18507N4487k87344k26226P6581J08951p1553J34453k4472m6935
20068c7798P2312J28644q009j01165j4736j00327k67631M5163K41742K18837J02237
20057B79269k00671o0154J87436K14671k1171l79973M6957j34516j05289j505
20047a74946p2972j71981J77720L79116J88788j23734l3489j40549j26438M6538
20037e1947j29634j98772n416N3359J17492J48635N9731j00851l8747O1658j96897
20026b81389m3266Q3728L44672j6565q8260j27527J8975J02995K1917q2721L1875
20015c5566m451l36491k25627Q257k1539Q3672J41693P8222R1155o5800k06892
20004d93367p8050J84494K9489L049M128J91339J14420O0709J89977k16273m47
$$ plain form
20078 125753 244260 298747 11403 -214823 -138242 -29291 -100844 33609 9137 -37798
20068 -37798 34514 163158 155149 53984 39248 -61079 -328710 -283547 -41805 177032 279269
20057 279269 78598 18444 205880 420551 399380 19407 66364 -68152 -173441 -174946
20047 -174946 -247918 -419899 -242179 136937 325725 201991 168502 27953 -98485 -51947
20037 -51947 -181581 -380353 -385769 -332410 -214918 -66283 -6552 -107403 -146150 -84492 -281389
20026 -281389 -324655 -240927 103745 87180 -1080 -128607 -109632 -6637 15280 -67441 -35566
20015 -35566 -40017 -376508 -602135 -593878 -615417 -531745 -390052 -311830 -220675 -286475 -493367
20004 -493367 -571417 -386923 -357434 -354385 -350257 -158918 -44498 16211 206188 -10085 -10532
19993a0532O5683j8285o8212k10022O0326L42397l3088k26601r0018k5551K4951
19982a88952M2739k736j75749j8826O2325K2719p8528l0752N4193k02350J12925
19971d02992P8434J67489K4699M2297L11867j19276k83852J6060J05010J3994
19961d6270M2199q6598j16299l0685P7653J62800p6260P7910P8921j40937j14622
19950a72188K54206J57149j82983J337N6325r2570R0178M3253n7133L7618m7814
19939H7378L322q37q350J80822j67451j90811R5927L7628j1746k8891J73673J25275
19927B95939j47387l41608j55183K82100J67556J6702k5421k89556J00863K60844
19917A64849J90471k6378n5039l33607k19487l9532p6037M2705L0711q4100M9317
$$ plain form
19993 -10532 55151 36866 -31346 -241368 -181042 161355 128267 -98334 -188352 -213903 -188952
19982 -188952 -146213 -148949 -324698 -343524 -281199 -258480 -337008 -367760 -313567 -515917 -402992
19971 -402992 -324558 -157069 -132370 -90073 221794 102518 -181334 -165274 -60264 -46270
19961 -46270 -4071 -90669 -206968 -237653 -160000 2800 -73460 4450 83371 -57566 -172188
19950 -172188 82018 239167 56184 57521 113846 21276 111454 154707 97574 135192 87378
19939 87378 90700 89863 81513 262335 94884 -95927 0 37628 25882 -3009 170664 295939
19927 295939 148552 -193056 -348239 -66139 101417 118119 92698 -196858 -95995 164849
19917 164849 355320 328942 273903 -59704 -279191 -318723 -394760 -352055 -321344 -405444 -356127
19906c56127K60034J96465L086j1718k34o0057o6391N0859K1761J05533o9488
19895G3723l39634J9700J16525J04836O1825O4295J1197n2085j09856j8059K11761
19884A44228j3499j43784o2604n03J35623J40512O0088j09951k38652j86006r3878
19873c68426M8548j06550j2012L09063J77317J45380j44735o3423j56354k39113
19863d10305J76761L57889r5620j13452J544O7879K75113N3718M6184R7422j72072
19852B85061j05034j76080l50852N2223Q1607j60568J00075J62926J26705j0337
19842E726N4696M42699O710k20595k21487k4717o2073K4593K05466N9392O8409
19831C38819N328L4689l12746j62484J47737k4615j12131L9952P7304M2499j09643
$$ plain form
19906 -356127 -96093 100372 103458 91740 91506 31449 -34942 15917 37678 143211 73723
19895 73723 -265911 -246211 -129686 -24850 36975 101270 112467 60382 -49474 -67533 144228
19884 144228 130729 -13055 -75659 -76162 59461 199973 260061 150110 -88542 -274548 -368426
19873 -368426 -319878 -426428 -438440 -129377 47940 193320 48585 -14838 -171192 -410305
19863 -410305 -233544 124345 28725 -84727 -83183 -15304 259809 313527 359711 457133 285061
19852 285061 180027 3947 -346905 -294682 -213075 -373643 -273568 -110642 16063 5726
19842 5726 60422 503121 509831 289236 67749 43032 -19041 5552 211018 270410 338819
19831 338819 344147 378836 66090 -96394 51343 26728 -85403 -45451 31853 74352 -35291
19820c5291P2036M0422j3799O2198J3662j41237p3070O8840J38801P3825r5685
19809A10702J35930M2497J56807K3744k12609N2472Q9511n329j28253J43K2048
19798B87663p8693q6783p9904m6082K42327J94232M6241j05154L971O5627L6821
19787D80266k71302j3189O2912Q7173q9982j16892j2369O6541J51852J67450j94934
19776C17526r6774k91040K7297O2008J70832J68944p0507p8003J67961j79735
19766A98509j91926j9339q9967L522K99167N6672K7495k532j7600j38192k62341
19755a36532R6093K28095p3423P4034j9731J15923l9063J24826P2478l4507l32647
19744G5546o8442L40297L0382l4575n2083o8056l03787j6643J08659k5019p9299
$$ plain form
19820 -35291 36745 77167 63368 125566 139228 -2009 -75079 -6239 132562 206387 110702
19809 110702 246632 289129 445936 469680 257071 309543 399054 393725 265472 265615 287663
19798 287663 208970 122187 42283 -3799 238528 432760 479001 373847 377818 443445 480266
19787 480266 208964 195775 258687 345860 255878 138986 126617 193158 345010 512460 317526
19776 317526 220752 -70288 -42991 19017 189849 358793 288286 210283 378244 198509
19766 198509 6583 -12756 -102723 -99201 199966 256638 284133 281601 264001 125809 -136532
19755 -136532 -40439 187656 114233 188267 168536 284459 245396 370222 442700 408193 75546
19744 75546 7104 347401 377783 343208 291125 223069 -80718 -97361 11298 -13721 -93020
19733i3020n2714j07148J32021J49901J6959J44818j05554j87072K81262N6451
19723B35904k23932m2037K22511J98323M5960j36257l54628m550J99047L05826
19713D46167k43913l75621q1644j75654J56973J08419j27903K17418J9045r2292
19703a49005r8082P8364J03972k1213j44407n1457J69890P3856m4298m3355J76432
19692E0697K60957K24365K09785L4077j66857j02523o6857k11697p6877m920J7895
19681A68045J14369j75456K8177J56115j22738j47710n0720p5953n4345k2480
19671a82696j37673J11767J75626J65541j75176o9525l3933k09618j7353J16666
19661b56374m9213J71936M04887k4145J3663j23350k73004j47837m2693L93940
$$ plain form
19733 -93020 -145734 -252882 -120861 29040 45999 190817 85263 -101809 179453 235904
19723 235904 11972 -30065 192446 390769 436729 300472 -54156 -58706 140341 446167
19713 446167 202254 -173367 -255011 -430665 -273692 -165273 -293176 -75758 -56713 -149005
19703 -149005 -247087 -168723 -64751 -85964 -230371 -281828 -111938 -38082 -82380 -125735 50697
19692 50697 311654 536019 745804 779881 613024 510501 443644 231947 155070 150150 168045
19681 168045 282414 106958 135135 291250 168512 20802 -29918 -105871 -160216 -182696
19671 -182696 -320369 -208602 -32976 132565 -42611 -112136 -146069 -355687 -373040 -256374
19661 -256374 -305587 -133651 271236 247091 260754 137404 -135600 -283437 -326130 67810
19651F7810O0223K6485k49857j91971K02707Q4759l6716m8917M3146r0027j5920
19640a48278q8965P0879J87510J50057j6945l21j3330P2041j52833J17606q5342
19629I2079k61927J79471L72983Q5293m48597j05389Q7974P7071j27446j74749
19619b23237J67417L14538L55321J03114k21861l02110j430Q4950q8141r4972
19609I3589J11476M8886k22009L2384J90533j50127L5792j94632j30962L059L780
19598a78231n9642M1891O9678K43545R2267l02163R7053j5580l6288J92621j4203
19587A30948k42215j13526J48912n6608r8401R4652j27365J55966K30666j24303
19577a274m1161Q5528j04740j61196r629n4004m5620Q1346J89294K0891J47903
$$ plain form
19651 67810 128033 154518 -95339 -287310 -84603 156 -36560 -85477 -42331 -132358 -148278
19640 -148278 -237243 -166364 21146 171203 154258 153937 140607 212648 59815 177421 92079
19629 92079 -169848 9623 382606 467899 19302 -86087 1887 78958 -48488 -223237
19619 -223237 -55820 258718 614039 717153 495292 193182 191752 276702 188561 93589
19609 93589 205065 253951 31942 64326 254859 104732 140524 -54108 -185070 -182011 -178231
19598 -178231 -237873 -195982 -126304 117241 209508 -92655 4398 -11182 -47470 145151 130948
19587 130948 -111267 -224793 -75881 -132489 -230890 -136238 -263603 -107637 123029 -1274
19577 -1274 -42435 43093 -61647 -222843 -232472 -286476 -332096 -250750 -61456 -40565 107338
19566A07338J35872j30221J28076r1065j79111l74805L3189j57889J58390M2372
19556c27854K3583J07435j02192n2017J3254K14603J77003K26035Q0499j64715
19546A95634k04445j25053k34393j67491K70443M1037q9173N2478J92494O7053
19536a416m9887L8102O9283K49033k47107j42861j35150K8352K68815M429j23281
19525d1688j29906j56500j2302K39406J40367j00838k12709j07236K41342j50261
19515b90325j92509J64336k2327R8614N4593K9722K56330Q9005J15057J8392L5909
19504C56797J7105r1418k31215j89287J10035p4912j8635m3586J6679L8808l10459
19493d20088k77923K1520J79336q5748J03241K80572m2926K48663J8338Q3495
$$ plain form
19566 107338 243210 112989 241065 150000 -29111 -403916 -370727 -528616 -370226 -327854
19556 -327854 -304271 -196836 -299028 -351045 -337791 -123188 53815 279850 360349 195634
19546 195634 -8811 -133864 -368257 -535748 -265305 -224268 -313441 -260963 -68469 -1416
19536 -1416 -51303 -13201 56082 305115 58008 -84853 -220003 -191651 77164 81593 -41688
19525 -41688 -171594 -328094 -340396 -100990 39377 -61461 -274170 -381406 -140064 -290325
19515 -290325 -482834 -318498 -340825 -242211 -187618 -157896 98434 187439 302496 320888 356797
19504 356797 373902 282484 51269 -138018 -27983 -102895 -121530 -165116 -148437 -109629 -420088
19493 -420088 -698011 -676491 -497155 -582903 -479662 -199090 -242016 6647 24985 108480
19483A08480j3789j68240j30119j2743K8780J10388j31651M6011N8284j882K93321
19472A86840J09670r2454j62619j06519j95480m0123K38188K4082J28829j07334
19462a6920m25080k63302O0219L87398J96088P029q1551l2254l5187J81723K92767
19451B70930J1992k93845k19604m6519J38148Q3814l6730K06512J94118j77044
19441A31772k08654J01349l326j59456J8694M29272L4066j94347j54738n7120
19431f2488R2690L5041L4650k52796k04415O1114Q9239n3330K17094J10417J99413
19420B66629J36289k40266Q3030P6843l18879j63628m5405k011o1817J8835n6058
19409c06438J12470K19720o1025j38519M657K24529J82775n2595o4843m3863k19925
$$ plain form
19483 108480 94691 -73549 -203668 -216411 -187631 -77243 -208894 -162883 -104599 -106481 186840
19472 186840 296510 204056 41437 -65082 -260562 -300685 -62497 -38415 90414 -16920
19462 -16920 -442000 -705302 -645083 -257685 -61597 -54568 -136119 -168373 -203560 -21837 270930
19451 270930 282922 -10923 -230527 -277046 -138898 -55084 -91814 114698 308816 131772
19441 131772 -76882 24467 21141 -138315 -119621 309651 343717 149370 -5368 -62488
19431 -62488 30202 65243 99893 -152903 -357318 -296204 -206965 -260295 -43201 67216 266629
19420 266629 402918 162652 245682 322525 3646 -159982 -205387 -207398 -269215 -250380 -306438
19409 -306438 -193968 25752 -35273 -173792 -169135 55394 238169 185574 120731 76868 -143057
19398a43057j53405j56947K14885r009L9934J00084n5026R5960j50100o6911N1494
19387b32098P2155K28123j9215n4776j9108J76671o329j09020k9014p5651O3665
19376d597J28008N9326p6656M4649Q0823K11511l4713j32251j68706j28841j10720
19365a32167P1330L29361j71324q4527K3780J16794k2070O8664J01571j44822
19355A56590j85723j27078K08633Q4067n1871J9306j8904r3590j97566N0986R2317
19344f2833j15385P4398J38345K192P5821O3143J58187N5177J70517n7835k95571
19333B06156j29364n3079k02343j15884n5141K5667K18947J18885J86660j9250
19323A81254n0228N578j50162J13724K36599k4916l58743P6277K92839J13871
$$ plain form
19398 -143057 -296462 -453409 -238524 -247533 -207599 -107515 -162541 -66581 -216681 -283592 -232098
19387 -232098 -159943 68180 48965 -5811 -24919 151752 145423 36403 7389 -68262 -4597
19376 -4597 123411 182737 106081 150730 231553 443064 408351 276100 107394 -21447 -132167
19365 -132167 -60837 268524 97200 12673 36453 153247 131177 199841 301412 156590
19355 156590 -29133 -156211 52422 136489 84618 103924 85020 -8570 -206136 -155150 -62833
19344 -62833 -178218 -103820 34525 36717 112538 175681 333868 389045 559562 501727 206156
19333 206156 76792 23713 -178630 -294514 -349655 -323988 -105041 13844 200504 181254
19323 181254 131026 136604 -13558 100166 336765 311849 -46894 29383 322222 436093
19313D36093j68530l23316R1248L16791n2438j0966J3058q8583j92255q6807l70
19302f6075K6821J72399m276M8284R6984J47350L5423k64841k50768m8315n4935
19291a61949j61211k3328P2261K52321O1281p7909k1159k8057j51751Q4473K20553
19280F5525k34578j94316j3394j9972J12851L29753L3908q0725p5939j15056k16980
19269d08923o3697K88275R7226j18048N033k6535n9614L48141M8975R966k34321
19258a13522l24205M24771J85436j32059j6351l4096q3398J48604K69924n3246
19248B71858j67437J07572J13946k2716l24304j05046j40494O0653j5768J10783
19238a10953n3876J65783k994N5081n037p1646r9110j452K81975J26951q1743
$$ plain form
19313 436093 267563 -55753 35495 352286 299848 288882 301940 213357 21102 -65705 -66075
19302 -66075 -39254 133145 128869 177153 274137 421487 456910 192069 -58699 -107014 -161949
19291 -161949 -323160 -346488 -274227 -21906 39375 -38534 -59693 -87750 -239501 -155028 65525
19280 65525 -169053 -363369 -376763 -396735 -283884 45869 79777 -948 -76887 -191943 -408923
19269 -408923 -472620 -184345 -87119 -205167 -200134 -226669 -286283 61858 110833 120799 -113522
19258 -113522 -437727 -12956 172480 40421 24070 -10026 -93424 55180 325104 271858
19248 271858 104421 211993 325939 303223 -21081 -126127 -266621 -205968 -221736 -110953
19238 -110953 -164829 954 -2040 53041 48004 -23642 -122752 -124204 157771 284722 202979
19227B02979J32710P589m9693k8561k9307k0893k90788j78573j53553n843J11950
19216c01983M2554J77681q2072r7434J05116k9026N9486l6845o967J63764r9488
19205a05214j7115p8370j13898J17929J54883J48663K5445q9375j486R3132q3383
19194E1211k15306R000P0412j53543j93873J53843K1017j13351P8900K69996K4500
19183B806K2576M1011j11968q0952J48566K41106q0566j31565l0733j15748Q8955
19172f512q764k91759j71196J9316K46642K70617J94961q4020M6248K31268m911
19161D41890r098k28174l07165q8695J1806l0812J17873J70002j22828J25882
19151H0681k06944j7171K2387o0802K1436O9535N0034K41682R0338l61138k09633
$$ plain form
19227 202979 335689 343278 293585 265024 235717 214824 -75964 -254537 -408090 -413933 -301983
19216 -301983 -259429 -81748 -163820 -261254 -156138 -185164 -125678 -162523 -169490 -5726 -105214
19205 -105214 -122329 -200699 -314597 -196668 -41785 106878 132323 42948 41462 134594 51211
19194 51211 -164095 -155095 -84683 -238226 -432099 -278256 -257239 -370590 -291690 -21694 2806
19183 2806 25382 66393 -45575 -126527 22039 263145 182579 51014 20281 -95467 -6512
19172 -6512 -15276 -307035 -478231 -458915 -212273 58344 253305 169285 215533 446801 441890
19161 441890 432792 204618 -102547 -191242 -179436 -210248 -92375 77627 -45201 80681
19151 80681 -126263 -143434 -121047 -181849 -160413 -90878 -40844 200838 291176 -69962 -279595
19140b79595K5912R2054K29366m171q2443P7690Q2516m6119j02906j68314r0306
19129b66316q005j19965n6233j0375K70992K2713k877J13370K0279j81523P2511
19118a45429J27215j89140l01598P2360N9914K34036J82447r0236J942l6848m8217
19107a33554L3851J26930m8975k7768R356n2445P3093K20461k96669l54860p5076
19096e25656J85739J64196N6012J94058P31N6735j41147m1623N392J2296J46722
19085A13455M9865j30803J9627j04094K1140J24285J75477j19698j97071p3986
19075a21803N8386k4003P3204Q9779N5733K61911q7840j76629K17457J98672P905
19064E52772j69898l10478k3641L55222J12898j72465o4747r9239O4494n7253
$$ plain form
19140 -279595 -253683 -161629 67737 63566 -18877 58813 141329 95210 -7696 -176010 -266316
19129 -266316 -274321 -394286 -450519 -460894 -189902 -167189 -170066 -56696 -36417 -217940 -145429
19118 -145429 -18214 -207354 -508952 -436592 -376678 -142642 39805 -50431 -48489 -85337 -133554
19107 -133554 -99703 27227 -21748 -49516 -40160 -92605 -19512 200949 -95720 -450580 -525656
19096 -525656 -339917 -175721 -119709 74349 75080 131815 -9332 -50955 -45563 -33267 113455
19085 113455 163320 32517 52144 -51950 -30810 93475 268952 149254 -47817 -121803
19075 -121803 -63417 -87420 -14216 75563 131296 393207 305367 128738 346195 544867 552772
19064 552772 382874 72396 48755 403977 516875 344410 279663 180424 244918 187665
19054A87665O2855N4885Q1346j0570J368J13026K6649j18056J10085J80771j30565
19043E59459m32962r645L0930j95776R1223L17086q4735j87668K7740J82995O8776
19032C67423n3837J8841M1030J09740M6517k16432m6135J84049J32003p0028O5173
19021E78344j44648l69069K2266J41111P8941j02872q8167j48091M6691L12698
19011C27204L7922k90966j49743J4301J78470m2471M9117k37304m5050Q3559J96527
19000A21566k3156j76350j15957k50473p8533L13998J52436j8744l2499K46180
18990A38468M0126l00968j49199J36481K05733Q0874L9566n4374j60834k1136
18980d5263k5167M677J28538o2855O217R7793N0165q2460Q232m7735j83796J80123
$$ plain form
19054 187665 250520 305405 386751 376181 377549 490575 517224 399168 509253 690024 559459
19043 559459 126497 116852 147782 -47994 43229 360315 275580 87912 115652 298647 367423
19032 367423 313586 332427 373457 483197 529714 313282 267147 451196 583199 513171 578344
19021 578344 433696 64627 86893 228004 306945 204073 115906 -32185 14506 327204
19011 327204 365126 74160 -75583 -61282 117188 74717 123834 -113470 -158520 -74961 121566
19000 121566 98410 -77940 -193897 -444370 -522903 -208905 -56469 -75213 -107712 138468
18990 138468 178594 -122374 -271573 -135092 70641 151515 191081 136707 -24127 -45263
18980 -45263 -70430 -65753 62785 -70 6147 103940 154105 71645 79877 32142 -151654 28469
18968B8469m4085J57163q2859l3737P0613L2031j21920L6359r463K90901j66530
18957A56942k22938J07651M1347Q2133J41562l2924j9377K5024j99989l62762
18947b83331k4190J47410J20600Q2346j13968J86601Q5019j13036K4031j7146
18937I4336O5166K24254P4838n277j12122k13001J08548o0349j39125m6470q3529
18926i2731j65768j02117J95427J90803R3311R0988K8476k04879j94030P2342
18916h8178N1239j97072j51231J64377J77341j75957R933J75697K31112j021j0540
18905A85700L16172R7203j21367j26373m3933K459o4294Q3146K00080k009J5153
18894E41937q2613r8337K04224J22992L9420L3930q5765j36825J58662K14373
$$ plain form
18968 28469 -15616 141547 58688 24951 95564 127595 5675 42034 32571 323472 156942
18957 156942 -65996 41655 83002 165135 306697 273773 254396 279420 79431 -283331
18947 -283331 -307521 -160111 -39511 42835 -71133 115468 200487 87451 111482 94336
18937 94336 159502 383756 458594 453317 341195 128194 236742 176393 37268 -9202 -92731
18926 -92731 -258499 -360616 -165189 25614 118925 209913 238389 33510 -160520 -88178
18916 -88178 -36939 -234011 -385242 -220865 -43524 -219481 -209548 -33851 197261 196240 185700
18905 185700 501872 599075 477708 351335 307402 309861 245567 328713 528793 526784 541937
18894 541937 459324 360987 565211 688203 727623 761553 675788 538963 697625 911998
18884I11998O2182J02537N4010k43060j172j49906j19123J16247K40976P1316
18874A046005j38081p3373m8008p7465l9813j33398k15418P8255j32959m435L1115
18863B92425j23859n5594O4387l4613l9988l2779K48104m5156j33382Q4517Q7715
18852C11777j14478J37927J10633q866j7168j21876m9895j22839k42795p3588
18842a91168M0723J73137j8889L4627J13943K58046j95955J60001q0172k71196
18832B3097o5257L563l4802K41992J33439J28577J44343o400l1737k19646Q9792
18821D06961J90133L3083r4760P7914L4939R9739K33874J94668J2637j65773j74883
18810H48532K11577M4399j1367M9711l1406J63959J33171k91979j98359j36247
$$ plain form
18884 911998 974180 1076717 1130727 887667 886495 736589 617466 733713 974689 1046005
18874 1046005 907924 834551 786543 709078 669265 535867 320449 398704 265745 261310 292425
18863 292425 168566 112972 177359 142746 102758 69979 318083 272927 139545 224062 311777
18852 311777 197299 335226 445859 436993 419825 297949 248054 125215 -117580 -191168
18842 -191168 -150445 22692 3803 38430 152373 410419 214464 374465 294293 23097
18832 23097 -42160 -38597 -73399 168593 302032 430609 574952 568552 536815 317169 406961
18821 406961 597094 630177 535417 613331 648270 748009 981883 1176551 1189188 1023415 848532
18810 848532 1060109 1104508 1093141 1142852 1111446 1275405 1408576 1116597 918238 781991
18800G81991r8364J63777L4958R8669J148k02035l08005r8555N7897j03071l12455
18789A5955J8954Q1888m7219J46070K8425k01345k69486N3477J81062n1259K7432
18778a6046L8510L11457j24871o8614O7689J24006j13000j21727O5077J82543
18768C45024R511p0700k25658k33675P0353J67871M9638j82009p6456J20271Q2704
18757E6874K6338p4699q4592N5308R0190k9170J60l5747R9654N3938L9244O0075
18745B57573m8863j52391o8979J05715q4271j15014K62744K69899K65530j09534
18735E82409K3355p247k76478K5359q7847j13274j11315k30084J03447R1127q8525
18724h9073q3549r0754N1360J57228J38823L2992q4445r1249K42780L0184k68182
$$ plain form
18800 781991 683627 847404 882362 981031 982179 780144 472139 373584 431481 328410 15955
18789 15955 34909 116797 69578 215648 244073 42728 -226758 -173281 7781 -43478 -16046
18778 -16046 22464 333921 209050 140436 208125 332131 219131 97404 162481 345024
18768 345024 354535 283835 58177 -175498 -105145 62726 112364 -69645 -146101 -25830 56874
18757 56874 83212 8513 -76079 -20771 69419 40249 40409 4662 104316 158254 197498 257573
18745 257573 208710 56319 -12660 93055 8784 -106230 156514 426413 691943 582409
18735 582409 605764 598517 322039 347398 259551 146277 34962 -195122 -91675 -548 -89073
18724 -89073 -172622 -263376 -212016 -54788 84035 117027 32582 -58667 184113 214297 -53885
18713e3885j33102l413K05099K08036K11456K4319l90102k61633j28138O1377
18703b59986Q5154r3053K9670J75533Q9770k1261k07820j12654L1205P1767J6601
18692a95074K02345p3667L7007k2854j86832Q3971K11529J98871P9162p2624O9102
18681C30936l15531p8592M7256k5199n2104j08137k57601j28715m1092J99034
18671d29745K6154K42567J86995K8648M7461j32673j29233m363L9163J37013K44107
18660B56094O297k28297Q7813P5708k71180l1761J0423O1965j94033J18355J63857
18649E5241j4130M9729R4488j07541k09027Q7320L6904l1389J03989J46917r1470
18638A21031L4086K82137j31976l20453k15975r767k7061K31895J08713p7923
$$ plain form
18713 -53885 -186987 -190400 14699 222735 434191 458510 68408 -193225 -321363 -259986
18703 -259986 -174832 -267885 -238215 -62682 27088 5827 -201993 -314647 -283442 -211675 -195074
18692 -195074 7271 -66396 -29389 -52243 -239075 -155104 56425 255296 334458 261834 330936
18681 330936 15405 -63187 -15931 -41130 -93234 -201371 -458972 -587687 -628779 -429745
18671 -429745 -403591 -161024 25971 54619 102080 -30593 -159826 -164189 -125026 11987 256094
18660 256094 262391 34094 121907 197615 -73565 -105326 -94903 -32938 -226971 -108616 55241
18649 55241 41111 90840 185328 77787 -131240 -43920 -7016 -38405 65584 212501 121031
18638 121031 155117 437254 305278 -15175 -231150 -240917 -267978 -36083 72630 -5293
18628e293j90939j89159q8693Q1003J63233J7651k1960R3320J86134K13390j3965
18617B44722j2956o6774j90097k21308J7705L10072j6451j4693q2229J48677R6789
18606B13457k30379J42452J88694j62444r0535J9376o2659j69254k72368K104
18596d21556Q2285K33428K9650j1134L9532j22490j90888J16947K07108J07921
18586G0803n8407j45716j80163Q0841K99243j3558k1397O4037N9470M4509K75564
18575D75226j48765L5520r9882j51586L4317m116j79983J84883K06279J9598n1646
18564C19845j72418k82040j22007j0452J79226K28301J82968R5599j18187p9930
18554B20905j06038j31417j57614L5841L0075J61452p786k77600j27941P5025
$$ plain form
18628 -5293 -196232 -385391 -474084 -393081 -229848 -212197 -234157 -140837 45297 258687 244722
18617 244722 231766 164992 -25105 -246413 -228708 81364 64913 50220 -32009 116668 213457
18606 213457 -16922 125530 314224 151780 61245 80621 17962 -151292 -423660 -421556
18596 -421556 -339271 -105843 -76193 -87327 -47795 -170285 -361173 -244226 -37118 70803
18586 70803 12396 -133320 -313483 -232642 66601 53043 31646 95683 155153 199662 475226
18575 475226 326461 361981 262099 110513 144830 140714 -39269 145614 351893 371491 319845
18564 319845 147427 -134613 -256620 -267072 -87846 140455 323423 419022 300835 220905
18554 220905 114867 -16550 -174164 -138323 -108248 53204 45418 -232182 -360123 -285098
18544b85098J96266m64m6793N9404n3462M5425j0251N758J85508J0003m7690L0637
18532H9243j15790o9508K5269N8393M4203n4096j33825J61650j4153m3915J75822
18521A23293N9598k0222j77161j46559K4792J80161p1636P8239N5883p737n3941
18510D4710j27283q8333K2654P9635n8754p2146J21568M6579j47733k11343Q4403
18499c06043J05703K07362J0593j26420j26235k0451J5394k49692O4939J90174
18489b34676K2524k18784j9430J30312K87391j10196o9414L2255K24756j19797
18479g5059r4093q2122l4420R5985J25660l43681n4820j0333P3363J00958J63180
18468a35382K26176L2085o6672k6367K58416N1688k6507l13377l5781J27209q0364
$$ plain form
18544 -285098 -88832 -89296 -136089 -76685 -130147 -84722 -94973 -89215 96293 106296 58606 89243
18532 89243 -26547 -96055 -70786 -12393 31810 -22286 -156111 5539 -8614 -52529 123293
18521 123293 182891 162669 -14492 -161051 -136259 43902 -27734 50505 106388 98651 44710
18510 44710 -82573 -170906 -148252 -68617 -127371 -199517 -77949 -31370 -179103 -390446 -306043
18499 -306043 -200340 7022 17615 -108805 -235040 -255491 -240097 -489789 -424850 -234676
18489 -234676 -212152 -430936 -450366 -320054 -32663 -142859 -212273 -180018 44738 -75059
18479 -75059 -169152 -251274 -285694 -189709 -64049 -407730 -462550 -472883 -399520 -298562 -135382
18468 -135382 90794 122879 56207 29840 288256 339944 313437 60 -35721 91488 11124
18457A1124q3239L8395J276L57171k2757l57072J03J08351J01130j1103J57302
18446C00681k48373k09677K9473K93829J07660j25713k41797j97737J29075J77764
18436A5185J86640k7975k26283K2151j67343j99412j12992J22507R6090o7795
18426c59227o7594J1698J11138J16500L401R1657j3295j60406n1745j2254O8242
18415b61885K65423j13530j22663j09496J04745K08605J8563k96419r72R2068
18405b15561R2571J7310J23360k2154J7280K53058j66605J6431m9076O8255j7407
18394A17462L4183m5173j772Q0450j28129j82075j12829n3555l2785j02235J32320
18383b94138j4993j46398k29362J61342L65801J18310K15347l3071k51667j15217
$$ plain form
18457 11124 -72115 -33720 -32444 324727 301970 -55102 -54999 53352 154482 143379 300681
18446 300681 52308 -157369 -127896 165933 273593 147880 -93917 -291654 -162579 15185
18436 15185 201825 173850 -52433 -30282 -197625 -397037 -510029 -387522 -291432 -359227
18426 -359227 -426821 -415123 -303985 -187485 -184084 -92427 -105722 -266128 -317873 -330127 -261885
18415 -261885 3538 -109992 -232655 -342151 -237406 -28801 -10238 -306657 -307629 -215561
18405 -215561 -122990 -105680 17680 -4474 12806 265864 99259 115690 66614 134869 117462
18394 117462 151645 106472 104700 185150 57021 -125054 -237883 -291438 -324223 -426458 -294138
18383 -294138 -309131 -455529 -684891 -523549 -157748 -39438 175909 142838 -108829 -224046
18373b24046K1620K5000J9141J5519j8593N824J08331K43068L0461j72122o7508
18362a3305J1336j11568J07549k22800N2691N2124n0042O3167j76927J61378j43873
18351b70270m32118j92580K38407L83223J13635l4295J68699R4767l02689j64740
18341c97961O0411Q949P4233J8168K42332K98588q359j54812j36488p9030K08167
18330A34198r7926j50499k4286J12130q7815k48351j51439K45242J54419q9010
18320b03337j81233o067O9773N8152J31859Q4314j18913j13927J4742m288K23399
18309d5526j32845K1217m1919j56680K4556J80513M9051J61185j77583P7777j98308
18298b38562O0701R1661j76803j49688j99209K17664P9277K03744K11263P6874
$$ plain form
18373 -224046 -202426 -177426 -158285 -142766 -161359 -155535 -47204 195864 226325 54203 -13305
18362 -13305 -1969 -113537 -5988 -228788 -176097 -123973 -174015 -110848 -287775 -126397 -270270
18351 -270270 -702388 -894968 -656561 -273338 -159703 -193998 -25299 69468 -233221 -397961
18341 -397961 -337550 -328601 -254368 -236200 6132 304720 296361 141549 5061 -73969 134198
18330 134198 36272 -114227 -138513 -26383 -114198 -362549 -513988 -268746 -114327 -203337
18320 -203337 -384570 -390637 -320864 -262712 -130853 -46539 -165452 -279379 -264637 -268925 -45526
18309 -45526 -178371 -157154 -199073 -355753 -331197 -150684 -101633 59552 -118031 -40254 -238562
18298 -238562 -177861 -86200 -263003 -412691 -611900 -394236 -314959 -111215 100048 176922
18288A76922q6615r4905R9296j51668r8451J85191Q7541j2384Q6935R6881k57566
18277C1177k08013j0012j9500j37197j64322K18507R1987K29094Q5393k10981
18267i3867j7444q1097L01682J71431j35423k84552q9950K2769J67257J11064
18257G1870o289P7469j05134J18230o0612k0307J14921j5097p2615O0759J50219
18246C13414P9418j82476o0013P1153l39783J40381L75542J17663j50975k52239
18236A12085j41375L85796M50826o6429k66572j53119k01270j75257k18792j04481
18226c78588L20238J92651m6654o0067r1733k3585j9165p7289K28625J22831k18435
18215e1171r8112J64766J53691J50818j70812j23829k36913J67361m2307r4566
$$ plain form
18288 176922 90307 -4598 94698 -56970 -155421 29770 117311 104927 191862 288743 31177
18277 31177 -176836 -186848 -206348 -343545 -507867 -289360 -197373 31721 117114 -93867
18267 -93867 -111311 -192408 109274 280705 145282 -139270 -229220 -206451 -39194 71870
18257 71870 65581 143050 37916 156146 95534 75227 190148 175051 102436 163195 313414
18246 313414 392832 210356 150343 221496 -118287 22094 397636 515299 364324 112085
18236 112085 -29290 356506 807332 740903 474331 321212 119942 -55315 -274107 -378588
18226 -378588 -58350 134301 87647 27580 -64153 -87738 -106903 -184192 44433 167264 -51171
18215 -51171 -149283 15483 169174 319992 149180 25351 -211562 -44201 -86508 -181074
18205a81074P5478q0381k66090M8245J11843K66015J10433k30976m7640J14585
18195g9562J63849o4821m1192K57877q5001k88798j1291K28426J69685p5887J8305
18184A91590r807o5934r6341o0439j85854p3565K63366l2124J26351Q9244J44647
18173B91134K8704k39978N448m4461q4810J25708J16072k34317j90226K55094
18163B8368k5846p0803J21683M28108k07312m01687n9343L91880P6583j01546
18153A80085j71788K50943J52271n7277j59568o4144J39623J82837O0100j73438
18143C39644k5452M8241o0939p0984m0813J31949k62136j40922N7989P4761J8939
18132G0277q983j71817k3949m0736q0689o4575p3796l8482L60647L29515q5916
$$ plain form
18205 -181074 -105596 -185977 -452067 -403822 -291979 -25964 84469 -146507 -194147 -79562
18195 -79562 84287 19466 -21726 236151 151150 -137648 -148939 79487 249172 173285 191590
18184 191590 181783 115849 19508 -40931 -226785 -300350 -36984 -69108 57243 146487 291134
18173 291134 319838 79860 85308 40847 -43963 81745 197817 -36500 -226726 28368
18163 28368 2522 -68281 53402 481510 274198 -127489 -186832 205048 281631 180085
18153 180085 8297 259240 411511 354234 194666 130522 270145 452982 513082 339644
18143 339644 314192 362433 301494 230510 189697 321646 59510 -81412 -23423 51338 70277
18132 70277 61294 -110523 -134472 -175208 -255897 -320472 -394268 -432750 -72103 257412 171496
18121A71496o0853j15146m4738k3105M2602j39248J05011j05316l0300L19080
18111A19483R56n046o3987m9634j26101K4614L6386k7089K86302K4620m901Q1914
18099B97517l2803J35183l8239k57734M1122L6677j60734O1668N7047q7025J48159
18088B00838k7508k32688q94J77208J07289o1607k07897P9745l4564K4254K3710
18077D7886j5740j25511j37925J4407J00680r7679k00238K6540K09188K08004
18067B9612O7726L1654j4540J6660q8870K79854o454k09829j38408J85593M3253
18056A96251J22513k12104k41039N0166j00532J01447Q2541n1778K6165j60538
18046a86908j3973J65440j563n7067j05181P1056J23095Q4826L74835J28032l2474
$$ plain form
18121 171496 110643 -4503 -49241 -72346 -29744 -168992 -63981 -169297 -199597 119483
18111 119483 120439 115393 51406 1772 -124329 -99715 -63329 -90418 195884 220504 215603 297517
18099 297517 264714 399897 361658 103924 145046 181723 20989 82657 139704 52679 200838
18088 200838 173330 -59358 -60252 116956 224245 162638 -45259 34486 -78 24176 47886
18077 47886 32146 -93365 -231290 -216883 -116203 -213882 -414120 -387580 -178392 29612
18067 29612 97338 128992 114452 131112 42242 322096 315642 105813 -32595 152998 196251
18056 196251 318764 106660 -134379 -84213 -184745 -83298 -757 -52535 -26370 -186908
18046 -186908 -200881 -35441 -37004 -94071 -199252 -128196 -5101 79725 454560 582592 550118
18035E50118j29137o1050r619j57312p2203K15734j58277k70404j78189J69833
18025a00506N8209o2300N0352J43892k1475k45784J9955K11113j53706o0391J04861
18014e5780J9823J29234K4760O9588j25196J43757l3908k78129N507k6576q9976
18003b16896L94600J39826l13364k4529J15158j58829j5605J51383q5010j69749
17993a83015j4496O3833j10651Q3275P8849L7319j03763L4182j9659J70312J65316
17982B01502k79263r8019J31026j10701k8615K0108m1999o7300j06770K24392
17972a55639M8908O7406K08656k7920k80171j27025L20390J1172l92448j94307
17962e20978K4653M29436r6744j36975k49573q2737n7662K48488L55764J46059
$$ plain form
18035 550118 420981 359931 350312 193000 120797 336531 178254 -92150 -270339 -100506
18025 -100506 -42297 -104597 -54245 89647 68172 -177612 -157657 53456 -100250 -160641 -55780
18014 -55780 -35957 93277 118037 187625 62429 206186 172278 -105851 -100344 -126920 -216896
18003 -216896 177704 317530 4166 -20363 94795 -64034 -79639 71744 -13266 -183015
17993 -183015 -197511 -133678 -244329 -161054 -82205 -44886 -148649 -114467 -134126 36186 201502
17982 201502 -77761 -175780 -44754 -155455 -184070 -163962 -205961 -273261 -380031 -155639
17972 -155639 -106731 -39325 169331 141411 -138760 -265785 54605 65777 -326671 -520978
17962 -520978 -496325 -66889 -163633 -300608 -550181 -632918 -690580 -442092 -86328 59731
17952E9731j21964r9572N6966J20498K42351r8607p6023j2100j75032N8129J66908
17941A21285r6810k40801K389q6875r060k30491k11251N6570K79981K28611K59853
17930G3401J1372j18373j55939L0197J64014J39294p0991j83776j23643J39717
17920i4727K35982K01474j07244q9986J1489P795L1538k90335l9537L07004L080
17909A76533L9340J40215j27882J38919O0392j24889j99780j62351q5303L2531
17899a12275O6025J33509o7569l3638m0276J64177J40865l7291j53751k48256
17889a88480J52174J65923p2972j53635J70195j3095k56355r9420J17202J03230
17879g5233m4055j38859K53670K65442L3200j38367K5308J2287N4502k09651q555
$$ plain form
17952 59731 -62233 -161805 -104839 15659 258010 159403 83380 71280 -103752 -45623 121285
17941 121285 24475 -216326 -213937 -300812 -309872 -540363 -751614 -695044 -415063 -186452 73401
17930 73401 84773 -33600 -189539 -159342 4672 143966 72975 -110801 -234444 -94727
17920 -94727 141255 342729 235485 145499 156988 164783 196321 -94014 -133551 173453 176533
17909 176533 215873 356088 228206 367125 427517 302628 102848 -59503 -144806 -112275
17899 -112275 -46250 87259 19690 -13948 -54224 109953 250818 213527 59776 -188480
17889 -188480 -36306 129617 56645 -96990 73205 60110 -196245 -295665 -178463 -75233
17879 -75233 -119288 -258147 -4477 260965 294165 155798 181106 193393 247895 38244 29689
17868B9689L1958o2325P4683J36268r2733j66014J1653j04517J50478K43370j64248
17857H8262l51277Q4482j00750r8609K25862M5786r2749K03637j67160k14027
17847c76543j26229K5791o641n3594K52186N4828j09412J25389J0146J28448N4689
17836b0942K2392j31596l183K4640J57993m3236k65706k24310j43779J66023J02346
17825c59358O3316O2189n6761J41300j43975k06198j43505K42443K42507Q0612
17815g7430M4517j19388j30833o4873J53123K7823O3264L53298m2343n5329k40569
17804h8740Q3766j986j13455j71321K0662j8516J52663o8548j66049N2618j66209
17793d85115l242J82752O7452J27867J52136m482j14094L1550j8298N0793J25224
$$ plain form
17868 29689 61647 -678 74005 210273 117540 -48474 -36821 -141338 9140 252510 88262
17857 88262 -263015 -178533 -279283 -377892 -152030 -106244 -198993 4644 -162516 -376543
17847 -376543 -502772 -476981 -483622 -537216 -285030 -230202 -339614 -214225 -204079 -75631 -20942
17836 -20942 1450 -130146 -133329 -108689 49304 6068 -259638 -483948 -627727 -461704 -359358
17825 -359358 -296042 -233853 -290614 -149314 -293289 -499487 -642992 -400549 -158042 -77430
17815 -77430 -32913 -152301 -283134 -348007 -194884 -167061 -103797 249501 207158 151829 -88740
17804 -88740 -4974 -6960 -120415 -291736 -271074 -289590 -136927 -205475 -371524 -318906 -485115
17793 -485115 -488357 -305605 -238153 -110286 41850 37368 -76726 -45176 -63474 -12681 112543
17782A12543m5379O8571l6898j23037N5347R2154J87243j81155m17176J33301
17772a54486L37916P5856l03553l72703O1351N0839J49914j08723q6332o7467
17762d17388k27732m6560J67906L13114L23310K7434j84749M4611J19517j46243
17752b6780j11056o5337m5488L41838M1053K62916k9805k99430j3261p8010p4159
17741i7519J30385J46132l00308j0649K59243n1381k27274m3619q8470M8408o1059
17730b96111j9515K0463M9537J18310J63821j59198q6572q0369L4223k31653n3548
17719e40612K2839n1596K97L32596J01754k20938j63201k7328J29748K57323j03125
17708b62243K22532R6342j04434M1896l89083m24058K5804J64354L39486M41526
$$ plain form
17782 112543 67164 135735 98837 -24200 31147 123301 310544 129389 -287787 -154486
17772 -154486 183430 259286 -44267 -416970 -355619 -304780 -154866 -263589 -349921 -417388
17762 -417388 -645120 -691680 -523774 -210660 112650 140084 -44665 -54 119463 -26780
17752 -26780 -137836 -203173 -248661 93177 134230 397146 367341 67911 54650 -23360 -97519
17741 -97519 32866 178998 -121310 -131959 127284 75903 -151371 -194990 -283460 -235052 -296111
17730 -296111 -315626 -295163 -245626 -127316 36505 -122693 -209265 -289634 -255411 -487064 -540612
17719 -540612 -517773 -569369 -569072 -236476 -134722 -355660 -518861 -546189 -416441 -159118 -262243
17708 -262243 -39711 56631 -47803 -5907 -394990 -819048 -793244 -628890 -289404 152122
17698A52122o0625J3119r0427j15412o691J3346J14800M8551m6346K2674J5297
17687F0408m3187l22346k02725L63881M4874q2252j37267J54955L29451P3091
17677B38883k10678j70594j74587K06738J36353j84097o9776q2196k26555J5469
17667e21040N3345R9819r7793q0071J60067L02002O4792O0717K21272k4059j31701
17656A07350j25911J16082p8663J66817l67p0243P9977j17952j49474R8642J30961
17645A57219q5060n3323J56444K9481p854Q6338J10035P487l00526l03553r6373
17634b99685K4824O5084J45133j11237k69056P920L10697K26681J43088k47886
17624d437j29333O7367O4699m2579O4426k59204p4526N2767J81350Q9573P8009
$$ plain form
17698 152122 91497 104616 14189 -101223 -107914 -94568 20232 68783 22437 45111 60408
17687 60408 17221 -305125 -507850 -143969 -99095 -181347 -318614 -163659 165792 238883
17677 238883 28205 -142389 -316976 -110238 26115 -157982 -227758 -309954 -536509 -521040
17667 -521040 -467695 -367876 -465669 -545740 -385673 -83671 -18879 41838 263110 239051 107350
17656 107350 -18561 97521 18858 185675 185308 115065 195042 77090 -72384 26258 157219
17645 157219 72159 18836 175280 204761 196907 283245 393280 400767 100241 -203312 -299685
17634 -299685 -274861 -209777 -64644 -175881 -444937 -437017 -126320 100361 243449 -4437
17624 -4437 -133770 -66403 -1704 -44283 20143 -239061 -313587 -260820 -79470 10103 88112
17613H8112o4732r1889j2868Q9140m7248l0278k61582K4134J13630K1074j5782
17602a88289J54059J30480J0580Q511p1405k53026j10546M0891m155K41444J27518
17591H6062j08319k3560K65179m5543j37690L9942Kj9245R3676L2563o8774J10758
17579B25051R865k0410L6691K3466k6524o4163ll9770L9398j01523K27762K8363
17567C38203k63715q4953r4237K25312J5991N3759n809p1561r5703j22031O5681
17556c9063K10920M6170L9345j57441k07043J2147j41885K2030K84159J98536
17546B67875l0378J15949P7834l08737j6113m7392k2541m8360l83007j50141J75035
17535c69976J40206K51472K43958l2223q3559j46682j65971J8306j14334k23216
$$ plain form
17613 88112 23380 -68509 -81377 7763 -39485 -69763 -331345 -307211 -193581 -172507 -188289
17602 -188289 -34230 96250 106830 115341 43936 -209090 -319636 -278745 -282900 -41456 86062
17591 86062 -22257 -45817 219362 173819 36129 76071 76073 56828 150504 183067 114293 225051
17579 225051 234916 214506 251197 274663 248139 183976 183973 144203 183601 82078 309840 338203
17567 338203 74488 -10465 -104702 120610 136601 190360 184551 112990 17287 -104744 -39063
17556 -39063 171857 218027 257372 99931 -107112 -94965 -236850 -214820 69339 267875
17546 267875 237497 353446 431280 122543 106430 59038 36497 -11863 -394870 -545011 -369976
17535 -369976 -229770 21702 265660 233437 149878 3196 -162775 -144469 -258803 -482019
17525d82019J69162R3670l2347j16726K55932R931k1046j89753j79338J79595
17515c12939J70013J08308O1722r1068p4585J13851j56915l17833L65980K45187
17505A11721j01204J62024J8545j12730R5151j69053J07401J01640J9112M4154
17495B76761L4171m1346q1969k15315k2621J159O9204q9321j51072j8349Q6027
17484a52671j8796j35655J72118L79161P9651J05338k35059k94072l6006J32620
17474c371J59417l08761l32091M2275P5834j4841n7111J65567P3880L18901O0399
17463A80098n4747m6482j69969l1294j4695m3992J60718n4192j88092m3451R6321
17452b09777R2134k2806J69535R6735j16358k97697r3130k6391j99589J30387
$$ plain form
17525 -482019 -312857 -219187 -251534 -368260 -112328 -102397 -123443 -313196 -492534 -312939
17515 -312939 -142926 -34618 27104 -63964 -138549 -24698 -181613 -499446 -133466 111721
17505 111721 10517 172541 191086 78356 173507 4454 111855 213495 232607 276761
17495 276761 310932 269586 187617 -27698 -50319 -49160 20044 -69277 -220349 -238698 -152671
17484 -152671 -171467 -307122 -135004 244157 323808 429146 194087 -99985 -135991 -3371
17474 -3371 156046 -152715 -484806 -442531 -366697 -381538 -438649 -273082 -199202 119699 180098
17463 180098 125351 78869 -91100 -122394 -137089 -181081 -20363 -74555 -262647 -306098 -209777
17452 -209777 -117643 -140449 29086 125821 9463 -288234 -381364 -407755 -607344 -476957
17442d76957P4151m4396J05528P4054l7460J3628J15410M9988J86038r4621n5430
17431i0067L3273j00407N0209m7042l2924N1679l33901j28698J46242L9381J69777
17420b42478j49705M600J03821L33563L5117l99852j72099J33973K63016J97390
17410A07346p6194j19664j2234j82085j23162K22987J18026n2105j83042J11338
17400a88789j5606J43290m5273o2362r6086P4399P2830o4205O6153o1414J32807
17389d4256P788n43q3197j44988O9333P5118j29772n7539k69581k59639P3885
17378g63391K44627L33971K03089J30104k93413j30848n9458J00587O1772l251
17368a76211l326j7868N8140K9369J3690N8508J52487j48930m17937o6939Q0508
$$ plain form
17442 -476957 -402806 -447202 -341674 -267620 -305080 -291452 -176042 -126054 59984 -34637 -90067
17431 -90067 -56794 -157201 -106992 -154034 -186958 -135279 -469180 -597878 -451636 -412255 -242478
17420 -242478 -392183 -387583 -283762 49801 84918 -314934 -487033 -353060 -90044 107346
17410 107346 31152 -88512 -100746 -282831 -405993 -183006 -64980 -117085 -300127 -188789
17400 -188789 -204395 -61105 -106378 -168740 -264826 -190427 -117597 -181802 -115649 -177063 -44256
17389 -44256 -36468 -37011 -120208 -265196 -195863 -120745 -250517 -308056 -577637 -837276 -763391
17378 -763391 -518764 -184793 18296 148400 -145013 -275861 -335319 -234732 -172960 -176211
17368 -176211 -179537 -197405 -139265 -109896 -96206 -37698 114789 -34141 -452078 -519017 -438509
17357d38509J82057K04486o0852J66190J65692m6936o8358j93390M6949N4742
17347A2071k4281o3039j89665k9758R9797r7571J61336m5131j89712J33296R3626
17336a39031o349L7329j06320j30828K89309K81017k0063k18827j79312k323o880
17325b02278J13561J65981K23824j24851j27288o9842o5367J85559P9390k46479
17315f7790j05419Q4536O6634P817M9152q6525L9423J73163j06353l8922J89693
17304B05409j61689N601k93477J69534L50259K15553j34412k42737j92071Q4514
17294F484k201K09751Q5099N8814j0120L9279j70459j31785j80040o087j36027
17283b37292k9862J56964J48694K10116j5608j4908r9885q2524m9512k48364M1472
$$ plain form
17357 -438509 -256452 -51966 -112818 53372 219064 172128 103770 -89620 -42671 12071
17347 12071 -12210 -75249 -264914 -294672 -194875 -292446 -131110 -176241 -365953 -232657 -139031
17336 -139031 -145380 -108051 -214371 -345199 -55890 225127 205064 -13763 -193075 -195398 -202278
17325 -202278 -88717 77264 301088 176237 48949 -20893 -86260 99299 178689 -67790
17315 -67790 -173209 -88673 -22039 -14222 34930 -51595 -12172 160991 54638 15716 205409
17304 205409 43720 49321 -244156 -74622 275637 491190 356778 114041 -78030 6484
17294 6484 4283 214034 299133 357947 347827 387106 216647 84862 -95178 -101265 -237292
17283 -237292 -267154 -110190 38504 248620 233012 218104 118219 35695 -13817 -262181 -220709
17272b20709l3930n1021P3641R1960R9199l9960J86363j37583L3299J85905J34271
17261C21435l65600k31773p2425K83981Q9950l3933N1270N6482R8612j8213K6668
17250B06454q9302m1251o3252j62360J27101J32904k20045j20621K6256J67573
17240c6543J53564j80216R8718J85883p3816p0612l0045o2606L8856j74935j12677
17229b64429J2656j036J61254j23079j52975L6689K91999R6333l5976J39976J21617
17218B83029k56864k00752K8880r804M3262j41356p3708r3691j60015j05867n3100
17207g39986K71593K52769j6205O3204m0276m2507J27393K04446M5578J65138
17197B91147o1515k19856N7401J41888l01591j3809k57057J25925L45157k2574
$$ plain form
17272 -220709 -254639 -305660 -232019 -140059 -40860 -80820 105543 -32040 1259 187164 321435
17261 321435 -44165 -275938 -348363 -64382 25568 -8365 42905 99387 197999 179786 206454
17250 206454 117152 75901 12649 -149711 -22610 110294 -109751 -230372 -204116 -36543
17240 -36543 117021 -63195 35523 221406 147590 76978 46933 -15673 23183 -151752 -264429
17229 -264429 -251773 -252809 -91555 -214634 -367609 -330920 -38921 57412 21436 161412 283029
17218 283029 26165 -174587 -145707 -155511 -112249 -253605 -327313 -421004 -581019 -686886 -739986
17207 -739986 -468393 -215624 -231829 -168625 -208901 -251408 -124015 80431 126009 291147
17197 291147 229632 9776 67177 209065 -92526 -106335 -363392 -237467 107690 85116
17187H5116J0982j73336j03333J09903J1809j36396L8623k6841J55082K18532
17177A90141q983k8757l41455j74798l1656J35774J39248m2391P472n9407n4202
17166b69014j36206j92561J20507j9051R7797K30703R9325j41385r9583K51531
17156e7937K51800O5732n0608j06740j54349r5416k13604O8172k17263J4959k19598
17145g14852n1753J35559K59425J58971j27238K96551K89917Q1647L0283P6184
17135D34694j13846m24926j95742N0500K74388l1807k00015O4437J3025J158j69192
17124b97326j92238K10247N8273M1828J01226l2388j38831P8829K16817j23777
17114g7340n668J71872k59116l30203L87743m603k12311j72882P5849J43574L8663
$$ plain form
17187 85116 96098 -77238 -180571 -70668 -58859 -195255 -156632 -183473 -28391 190141
17177 190141 181158 152401 -189054 -363852 -395508 -259734 -120486 -162877 -155405 -214812 -269014
17166 -269014 -405220 -597781 -477274 -496325 -398528 -167825 -68500 -209885 -309468 -57937
17156 -57937 193863 259595 208987 102247 -52102 -147518 -361122 -292950 -510213 -495254 -714852
17145 -714852 -766605 -631046 -371621 -212650 -339888 -43337 246580 328227 358510 434694
17135 434694 320848 -104078 -299820 -249320 25068 -6739 -206754 -142317 -129292 -128134 -297326
17124 -297326 -489564 -279317 -221044 -179216 -77990 -110378 -249209 -170380 46437 -77340
17114 -77340 -83008 88864 -170252 -500455 -112712 -117315 -329626 -502508 -426659 -283085 -244422
17103b44422J19681K03620o4095n9276j16503J10876J17102j17354k63843L4943
17093b79271J24883K26213J04636O7596j95942j17265Q633L7914m6932k8590P7588
17082b0537J14530q7946N8538K4343r2109j37683l67272k05602N3837L69526J29377
17071a60998J61083m3538k98800K44778M9072j44782j68767q9976O7159J21454
17061b63315J96260J0823Q9059K25744M6167j52058j70911j08793p0838k31351
17051d29213J44253P2694n875j12863k483K25522J03839N394J7340o2639Q9112
17040D5081J98148J29621r4348j83735k02265q2199J58879K83593J38538n0676
17030C40637l16801m75256j83938L65138L59843K52008R079m05925j41938J52842
$$ plain form
17103 -244422 -124741 78879 14784 -44492 -160995 -50119 66983 -50371 -314214 -279271
17093 -279271 -154388 71825 176461 244057 48115 -69150 -60517 -22603 -69535 -98125 -20537
17082 -20537 93993 6047 64585 88928 -3181 -140864 -508136 -713738 -659901 -290375 -160998
17071 -160998 85 -43453 -342253 -97475 -48403 -193185 -361952 -451928 -384769 -263315
17061 -263315 -67055 -56232 32827 258571 304738 152680 -18231 -127024 -197862 -429213
17051 -429213 -284960 -212266 -218141 -331004 -333487 -107965 -4126 1268 18608 -44031 45081
17040 45081 243229 372850 278502 94767 -107498 -189697 -30818 252775 391313 340637
17030 340637 23836 -451420 -635358 -270220 89623 341631 350710 -55215 -197153 -44311
17020d4311J05595j46543N038k80137M2779n0653l628R0224L9444K57666L9415
17009E4889K9140J07389L2154p5054M4162J79732k19736k34625n8226J34338J25677
16998A19840k32823k55666J16205L03535J15672j11065m5886j89879k55706j6509
16988d52282J71338m337J24638j33404l5134K94671J04284j37182k34546j35819
16978d37773m3660K8333O1792J92662J73820L7899k43359j05341Q2278J10168
16968a43181P8078k00669k56014L43862p7292j58346J18576J26256O4122o3907
16958a68515M3835J81715p6426k48940K46247L4107j01336k11048k0565p7400
16948c98326q1543R1043l5483j43205L04669L44393J00768J01585j02703k13756
$$ plain form
17020 -44311 61284 -85259 -80221 -360358 -317579 -368232 -371860 -281636 -242192 15474 54889
17009 54889 84029 191418 223572 148518 192680 372412 152676 -81949 -140175 -5837 119840
16998 119840 -112983 -368649 -252444 51091 166763 55698 9812 -180067 -435773 -452282
16988 -452282 -280944 -285281 -160643 -294047 -329181 -34510 69774 -67408 -301954 -437773
16978 -437773 -481433 -453100 -391308 -198646 -24826 13073 -230286 -335627 -253349 -143181
16968 -143181 -65103 -265772 -521786 -177924 -255216 -413562 -294986 -168730 -104608 -168515
16958 -168515 -124680 57035 -19391 -268331 -22084 12023 -89313 -300361 -320926 -398326
16948 -398326 -479869 -388826 -424309 -567514 -262845 81548 182316 283901 181198 -32558
16938c2558k9838j09720N6880Q0758J16492q5390j00300N7947N1611K5223J25390
16927A56495J81310j82984j58840P3872M7581L9930p9898j65199j35402L9408
16917a83727r178m3852j1896L5076k3166N1169K17780J28742P4609j25663P079
16906A16973J06797k4760L1189k19573l92585q4394J21943n319J29934N00682
16896B80887j69557j64545j35577j00249J02929J80920k30891j1548J48123n8598
16886a58106Q071J15591k26343L586K71131j65456m4164j21741m469j2757q0207
16875d14864J39595J78977l5276j64913k64341k7642j29578J87194N17212R5772
16865H2136k71956l71628m44569J93156K25005J57636J82973K43134O9150j59989
$$ plain form
16938 -32558 -62396 -172116 -115236 -34478 82014 -3376 -103676 -45729 5882 31105 156495
16927 156495 337805 154821 -4019 69853 117434 157364 77466 -87733 -223135 -183727
16917 -183727 -192905 -236757 -248653 -213577 -236743 -185574 32206 160948 235557 109894 116973
16906 116973 223770 199010 230199 10626 -381959 -466353 -344410 -349729 -219795 280887
16896 280887 111330 -53215 -188792 -289041 -186112 -5192 -236083 -247631 -99508 -158106
16886 -158106 -150035 -34444 -260787 -257201 13930 -151526 -195690 -317431 -321900 -334657 -414864
16875 -414864 -275269 -96292 -131568 -296481 -560822 -588464 -718042 -530848 -13636 82136
16865 82136 -189820 -561448 -1006017 -812861 -587856 -430220 -247247 -4113 65037 -94952
16855i4952k81923M2716O3091J85448L26606j4925m2935k23166k58230J04842
16845a93428J39716J70030K9817k42994l1511K88807K8538j10229q1458p8707
16835h1419o9554n9795K13456J73234J17729o1624j29112Q5226q431j28075N2139
16824A03774J46321J62746j30200j14531q5833q4365j04324J53349J90073k0574
16814B16436p7095j25271J18245R2302j19088j83698r9309j9125J77810l7247
16804e6040J35342O6925j34888O8668J53793n1896q9032j84320j7773J45862J32464
16793A69105L8998j68168N202r3598J55431M059r4951j53333Q246K5606J25209
16782B1806k3941j06440j23188P913L4989m448k9379M98j60247J91120M6237L6919
$$ plain form
16855 -94952 -376875 -334159 -271068 -85620 240986 226061 183126 -40040 -298270 -193428
16845 -193428 -53712 116318 146135 -96859 -128370 160437 188975 78746 -2712 -81419
16835 -81419 -150973 -210768 2688 175922 293651 232027 102915 188141 179710 51635 103774
16824 103774 250095 412841 282641 168110 82277 -2088 -106412 46937 237010 216436
16814 216436 139341 14070 132315 224617 105529 -78169 -177478 -196603 -18793 -56040
16804 -56040 79302 146227 11339 80007 233800 181904 92872 -91448 -109221 36641 169105
16793 169105 208103 39935 45137 -48461 106970 111029 16078 -137255 -129009 -103403 21806
16782 21806 -2135 -108575 -231763 -223850 -188861 -193309 -222688 -222190 -382437 -191317 -145080 -108161
16770a08161J38330Q604K9245L34798J15593k8243M0658l7966k4068r2783k28978
16759A47029o8902l0704l7684j13516j83104k20457R9211J03309J33582k5251
16749a96487J30786J9699J16324r011J02969j29011j37128l7523j0798m7081K7442
16738a69819J9087r474M4211R5424k6481K1824L3960K75840k56526k05911J4238
16727a63627N1574J41946q441R8916p5562k95428Q7476N5011q428P1016M2599
16716b948P6854j40206j17185J7972K09400j34986k40591m0021J85923K07932
16706B2144j34399j28250K88662J33543Q825K7327l4812r8417l67909j88615O8846
16695d03055J32758K90903J32521k9543r0403k43040n3133R2317K78364J31881
$$ plain form
16770 -108161 30169 38773 68018 402816 518409 490166 530824 492858 468790 376007 147029
16759 147029 78127 47423 9739 -103777 -286881 -507338 -408127 -304818 -171236 -196487
16749 -196487 -65701 -46002 70322 61311 164280 35269 -101859 -139382 -150180 -197261 -169819
16738 -169819 -150732 -160206 -115995 -20571 -47052 -25228 8732 284572 28046 -177865 -163627
16727 -163627 -112053 29893 21452 120368 44806 -250622 -163146 -108135 -116563 -45547 -2948
16716 -2948 73906 -66300 -183485 -165513 43887 -91099 -331690 -371711 -185788 22144
16706 22144 -112255 -240505 48157 181700 190525 217852 183040 84623 -283286 -471901 -403055
16695 -403055 -270297 20606 153127 123584 33181 -209859 -262992 -170675 107689 239570
16685B39570j23186j86071J3787j261r5177j21507l1237J61338J09784J06887
16675G2927n569J6812J16796k06368j81321k72146q9570L000K13112j09440K92667
16664a49100L27000o2092r3622n5532l447j21977k97227p562Q4662P6368j00584
16653d03113j58834N5274J3190J13416K7339k3228m1673J0210l3645J7197L27027
16642i6840M9013k61566O7220J07500J72241K70664K44350k06870j34264p4212
16632A37236k44944M8329m155j20230k72782l6109K74432J48903J18707j07913
16622e8526N1884Q2657K0459m5298r1856j3237O1147l36047j97129J89614K46948
16611h9384J39741k48950k34542j83457K15458J24948N8437k5507K82081Q9781
$$ plain form
16685 239570 116384 -69687 -55900 -57161 -152338 -273845 -305082 -143744 -33960 72927
16675 72927 67358 84170 200966 -5402 -186723 -458869 -548439 -545439 -332327 -441767 -149100
16664 -149100 177900 115808 22186 -33346 -36793 -158770 -455997 -463559 -378897 -302529 -403113
16653 -403113 -561947 -506673 -493483 -380067 -352728 -375956 -417629 -407419 -441064 -423867 -96840
16642 -96840 -47827 -309393 -242173 -134673 37568 308232 552582 345712 211448 137236
16632 137236 -107708 -59379 -63534 -183764 -456546 -492655 -218223 -69320 49387 -58526
16622 -58526 -6642 76015 96474 51176 -40680 -53917 7230 -328817 -525946 -336332 -89384
16611 -89384 50357 -198593 -433135 -616592 -401134 -276186 -217749 -243256 38825 128606
16601A28606j83183o97M6384j19931j11683J47569N3526j60511o472p8108J08343
16590a76157O7422N4241J28871j8173J23709O0470p4064j63511k54710K08145
16580d3757L193j14740l8447P5848J6048k10758j05920M6429j38947j1380J58262
16569c64169P3536O0372O8509P1940j20K2325M9427q1321k22035O659L67675L32347
16557C85145j57104j61627k38090L34918J85602Q6693j47892l28109q5444o7928
16547a93836O652L94997L67904j37092k61561j91034J152k421J55402j67763j14512
16536a42112n1907j82850J8161n867J82789Q2106J27974r5951o6060Q4471P966
16525d1280j26780j33912M2517J33262N4072j50317j15146k03203j10291J74298
$$ plain form
16601 128606 -54577 -55274 -8890 -128821 -240504 -92935 -39409 -199920 -206392 -284500 -176157
16590 -176157 -108735 -54494 74377 56204 179913 240383 166319 2808 -251902 -43757
16580 -43757 -40564 -155304 -193751 -117903 -101855 -312613 -418533 -372104 -511051 -522431 -364169
16569 -364169 -290633 -230261 -161752 -89812 -89932 -67607 -18180 -99501 -321536 -314877 52798 385145
16557 385145 228041 66414 -171676 163242 348844 435537 287645 -40464 -125908 -193836
16547 -193836 -187184 207813 575717 438625 177064 -13970 -12818 -15239 140163 -27600 -142112
16536 -142112 -194019 -376869 -358708 -364575 -181786 -99680 28294 -67657 -133717 -49246 -41280
16525 -41280 -168060 -301972 -259455 -126193 -72121 -222438 -337584 -540787 -651078 -476780
16515d76780J85102j16347j32229r7886K69804R8022k8034J59076J36319J45743
16505A42790j79200j36515o4105p5295m873J64517J32193J55686j9859l05232
16495a89893j24055J24408K02998P5906j49638l39472k47382N9778K91535N1819
16485b43996r2533M5541J35363R6844K4137L8411N9745j43990j32899o1264k6861
16474c01502q2637k9917j17450j63933p1677L0488K46136J83833K51052J27014
16464G1407o5299j70163n6979n6679O0251m5211j44551K23403J29754O617j51480
16453a98930o0037m7165P5043J11042j14754r2902r4313k48716q7248K31456L59943
16442a66581L26756k83K2153j55812k880J2440L7226K28503p3311P1542j17923
$$ plain form
16515 -476780 -291678 -408025 -540254 -638140 -368336 -270314 -298348 -139272 -2953 142790
16505 142790 -36410 -172925 -237030 -312325 -317198 -152681 -20488 135198 115339 -189893
16495 -189893 -313948 -189540 13458 89364 -60274 -399746 -647128 -587350 -295815 -243996
16485 -243996 -336529 -290988 -155625 -58781 -34644 3767 63512 -80478 -213377 -274641 -301502
16474 -301502 -384139 -414056 -531506 -695439 -767116 -736628 -490492 -306659 -55607 71407
16464 71407 6108 -164055 -221034 -277713 -217462 -262673 -407224 -183821 -54067 -47450 -198930
16453 -198930 -258967 -306132 -231089 -120047 -234801 -327703 -422016 -670732 -757980 -526524 -166581
16442 -166581 160175 159892 182045 26233 23353 35793 73019 301522 228211 299753 181830
16431A81830j24106j7696k5990J66924J15578k11994N9708M8219k33119n4339
16421i4985K16051l7966k93866r2205O3853K526m6658J2570P5968J15933j90058
16410b68837j85995q9734P3303q3799K25603J19182O0587k38132n2321Q0474N5922
16399c03747K01233J77541j80379L7615j71127k31259o3188J31422J41673P2340
16389a87876q182o8227J90268J01798m9413j84425r3671J2585K16905J07100o6803
16378b9941N8780J75979j23667j22035j50027K0154Q605K14882j37703j5896J04649
16367C780J49652n7558k47215j80161k2792j17679l2634J43331J55992m9388J71419
16356h3253m9161j38566J36472N6n6117q4313Q2479J03512Q8403l83684r8044
$$ plain form
16431 181830 57724 40028 14038 180962 296540 84546 144254 192473 -40646 -94985
16421 -94985 121066 83100 -210766 -302971 -239118 -236592 -283250 -270680 -194712 -78779 -268837
16410 -268837 -454832 -544566 -471263 -555062 -329459 -210277 -149690 -387822 -440143 -359669 -303747
16399 -303747 -102514 75027 -105352 -67737 -238864 -470123 -533311 -401889 -260216 -187876
16389 -187876 -196058 -264285 -74017 27781 -21632 -206057 -299728 -287143 -70238 36862 -29941
16378 -29941 28839 204818 81151 -40884 -190911 -170757 -162152 52730 -84973 -100869 3780
16367 3780 153432 95874 -151341 -331502 -354294 -471973 -504607 -361276 -205284 -254672 -83253
16356 -83253 -132414 -270980 -134508 -134452 -190569 -274882 -192403 -88891 -488 -384172 -482216
16345d82216L75799k1670j41706J48797N4583l5019J02379n8566j74178j06241
16335c38038J20574J24974p483p8278j73554K2490J67637o1465k11654M1750R9025
16324b94022o1085L50751M7858j3105k88390j49021R2311j24908k8067n7698Q4366
16313d41010K10859l304Q3479J96291K9830k35917l8978j3672J37727Q8068k91854
16302b78481j05594R4683j25198K14728J42422N2345N1470R2065q4812j78072
16292a24444K2494n467j29086Q2174n7688o7484K01436K34750l4804L2861j04582
16281E0160j73220r9867j7231J25284L22659M0551j39515j20770L8730l6070p4869
16270h4158P2167Q4479j1418J8911J10758J7812k78060m673K2024j90777J15251
$$ plain form
16345 -482216 -106417 -128087 -269793 -120996 -66413 -101432 947 -57619 -231797 -338038
16335 -338038 -217464 -92490 -99973 -178251 -351805 -329315 -161678 -223143 -434797 -393047 -294022
16324 -294022 -355107 -4356 43502 30397 -257993 -407014 -314703 -439611 -467678 -525376 -441010
16313 -441010 -230151 -233455 -149976 46315 76145 -159772 -198750 -212422 -74695 13373 -278481
16302 -278481 -384075 -289392 -414590 -199862 -57440 -5095 46375 138440 53628 -124444
16292 -124444 -101950 -107417 -236503 -154329 -212017 -279501 -78065 156685 121881 154742 50160
16281 50160 -123060 -222927 -240158 -114874 207785 248336 108821 -11949 26781 -9289 -84158
16270 -84158 -11991 72488 61070 79981 190739 208551 -69509 -74182 -52158 -242935 -127684
16259a27684P766j49758p5102N437J92774K98241l7288l9030k34472j28639R1513
16248a96242K45283J45025N0554j32814j57823l1576J43063P0173l08148n3105
16238b25610J12237j749j5457q5228k0102j90635r461L91549O1564J60421k6449
16227A51080j2970r0957l35253M8073J11133k9360O3953K283k08499o2546j50099
16216e13162R3540J51924J03046p9988M2874p1145l07416p3514P5636K23033M2044
16205c13128j2903K9685j03301J98431J31265k12749l9716R8279N4570J6424J15935
16194c7208p3560L7208Q5292j72342N8752J3566j10412O0859K32536j51646k33387
16183b90342J8378J15319O357o5840k52020R3452k21592Q8141J86011J59036J27194
$$ plain form
16259 -127684 -119918 -269676 -344778 -339341 -146567 151674 114386 75356 -159116 -287755 -196242
16248 -196242 49041 194066 244620 111806 -46017 -77593 65470 135643 -172505 -225610
16238 -225610 -113373 -115122 -130579 -215807 -235909 -426544 -436005 -44456 17108 177529 151080
16227 151080 138110 47153 -288100 -240027 -128894 -158254 -94301 -92018 -300517 -363063 -513162
16216 -513162 -419622 -267698 -164652 -244640 -201766 -272911 -580327 -653841 -578205 -355172 -313128
16205 -313128 -326031 -296346 -399647 -201216 -69951 -282700 -322416 -224137 -169567 -153143 -37208
16194 -37208 -110768 -73560 11732 -160610 -101858 -88292 -198704 -137845 94691 -56955 -290342
16183 -290342 -271964 -156645 -150288 -216128 -468148 -374696 -596288 -508147 -322136 -163100 -35906
16172c5906q0187N9489Q3445k8037p6596O6330m3438N4073q836l2198m342N5674
16160I471q681K3267J48141J0618k01329R0236O857O8332J69505J46961n5364
16149D08014p2635p4250k17419j28758p5188N7655k615k78376M2378K39504j16264
16138b17954j4625k14539Q3551J76712o2886J39097J46118l0855l5096k29653
16128b60130j74606J13962J56513L5115R488k9866q778k94856q2390n4137K29694
16117c59991L407J56490K51R1678R353k25296N250n4085j45911J72035K92784
$$ plain form
16172 -35906 -116093 -56604 26841 -1196 -77792 -11462 -54900 -827 -9663 -41861 -46203 9471
16160 9471 790 24057 172198 182816 -18513 71723 78580 146912 316417 463378 408014
16149 408014 335379 261129 43710 -85048 -160236 -102581 -105196 -383572 -341194 -101690 -217954
16138 -217954 -232579 -447118 -363567 -186855 -249741 -110644 35474 4619 -30477 -260130
16128 -260130 -434736 -320774 -164261 -129146 -119658 -149524 -158302 -453158 -535548 -589685 -359991
16117 -359991 -356584 -200094 -199843 -108165 -98812 -324108 -318858 -372943 -518854 -346819 -54035
$$ [...]
##END NTUPLES=NMR SPECTRUM
##END=
