##TITLE=Analysis number 319955
Compound Code cc 00502
Book Reference 3
Project Code adrs
Chemist Name stores
##JCAMPDX= 6.0         $$ Bruker NMR JCAMP-DX V2.0
##DATA TYPE= NMR SPECTRUM
##DATA CLASS= NTUPLES
##ORIGIN= Bruker BioSpin GmbH
##OWNER= nmr
$$ XWIN-NMR		Version 3.5
$$ Mon Jun  5 14:44:32 2006 GMT Daylight Time (UT+1h)  MAYBRIDGE\nmr@NMR_250MHZ
##.OBSERVE FREQUENCY= 250.131544655141
##.OBSERVE NUCLEUS= ^1H
##.ACQUISITION MODE= SIMULTANEOUS (DQD)
##.ACQUISITION SCHEME= undefined
##.AVERAGES= 16
##.DIGITISER RES= 18
##SPECTROMETER/DATA SYSTEM= dpx250
##.PULSE SEQUENCE= zg30
##.SOLVENT NAME= CDCl3
##.SHIFT REFERENCE= (INTERNAL, CDCl3, 0, 16.522)
##AUDIT TRAIL= $$ (NUMBER, WHEN, WHO, WHERE, WHAT)
$$ ##TITLE= Audit trail, XWIN-NMR		Version 3.5
$$ ##JCAMPDX= 5.01
$$ ##ORIGIN= Bruker BioSpin GmbH
$$ ##OWNER= nmr
$$ C:\u/data/dgb/nmr/ADRS/310/pdata/1/auditp.txt
$$ ##AUDIT TRAIL=  $$ (NUMBER, WHEN, WHO, WHERE, WHAT)
(   1,<2006-06-05 14:43:59.99 +100>,<MAYBRIDGE\nmr>,<NMR_250MHZ>,
      <created by zg, POWCHK disabled, PULCHK disabled
       configuration hash MD5:
       E2 DF 36 D8 04 B2 41 60 5A D7 A3 38 5A 4B D0 FE
       data hash MD5: 64K
       52 37 55 97 7B 77 E3 D5 7B 66 08 78 94 E9 5C F4>)
(   2,<2006-06-05 14:44:15.02 +100>,<MAYBRIDGE\nmr>,<NMR_250MHZ>,
      <Start of raw data processing
       ef LB = 0.3 FT_mod = 6 PKNL = 1 SI = 32K 
       data hash MD5: 32K
       D2 D9 35 7E C7 0E 15 59 E0 2E 6D F4 EC 48 0C 24>)
(   3,<2006-06-05 14:44:19.54 +100>,<MAYBRIDGE\nmr>,<NMR_250MHZ>,
      <apk 
       data hash MD5: 32K
       5B EE 60 29 53 40 FD DC 9D 53 C3 8E 46 DC B0 E4>)
(   4,<2006-06-05 14:44:21.08 +100>,<MAYBRIDGE\nmr>,<NMR_250MHZ>,
      <abs ABSG = 5 
       data hash MD5: 32K
       E2 FE 20 45 96 83 6B CD 35 5C 2E D2 EF 12 46 90>)
$$ ##END=
$$ 
$$ hash MD5
$$ 4E 5C C4 C8 70 36 18 3B 9E A5 AB FC E3 18 34 B7
##$RELAX= 
##$RELAX= 
##$RELAX= 
##$RELAX= 
##$RELAX= 
##$RELAX= 
##$RELAX= 
$$ Bruker specific parameters
$$ --------------------------
##$DU= <C:\u>
##$EXPNO= 310
##$NAME= <ADRS>
##$PROCNO= 1
##$TYPE= <nmr>
##$USER= <dgb>
##$AMP= (0..31)
100 100 100 100 100 100 100 100 100 100 100 100 100 100 100 100 100 100 
100 100 100 100 100 100 100 100 100 100 100 100 100 100 
##$AQSEQ= 0
##$AQ_mod= 3
##$AUNM= <au_zg>
##$AUTOPOS= <22 >
##$BF1= 250.13
##$BF2= 250.13
##$BF3= 250.13
##$BF4= 250.13
##$BF5= 500.13
##$BF6= 500.13
##$BF7= 500.13
##$BF8= 500.13
##$BYTORDA= 1
##$CFDGTYP= 0
##$CFRGTYP= 5
##$CHEMSTR= <none>
##$CNST= (0..31)
1 1 145 1 1 1 1 1 1 1 1 1 1 1 1 1 1 1 1 1 1 1 1 1 1 1 1 1 1 1 1 1 
##$CPDPRG= <>
##$CPDPRG1= <>
##$CPDPRG2= <>
##$CPDPRG3= <>
##$CPDPRG4= <mlev>
##$CPDPRG5= <mlev>
##$CPDPRG6= <mlev>
##$CPDPRG7= <mlev>
##$CPDPRG8= <mlev>
##$CPDPRGB= <>
##$CPDPRGT= <>
##$D= (0..31)
0 1 0 0 0 0 0 0 0 0.06 0 0 0 0 0 0 0.0002 0 0 0 0 0 0 0 0 0 0 0 0 0 0 
0 
##$DATE= 1149515038
##$DBL= (0..7)
120 120 120 120 120 120 120 120 
##$DBP= (0..7)
150 150 150 150 150 150 150 150 
##$DBP07= 0
##$DBPNAM0= <>
##$DBPNAM1= <>
$$ [...]
##$SUBNAM7= <"">
##$SUBNAM8= <"">
##$SUBNAM9= <"">
##$SW= 20.6930455092707
##$SWIBOX= (0..15)
0 0 3 0 0 0 0 0 0 0 0 0 0 0 0 0 
##$SW_h= 5175.983436853
##$TD= 65536
##$TD0= 1
##$TE= 296.16
##$TE2= 300
##$TE3= 300
##$TEG= 300
##$TL= (0..7)
0 120 120 120 120 120 120 120 
##$TP= (0..7)
150 150 150 150 150 150 150 150 
##$TP07= 0
##$TPNAME0= <>
##$TPNAME1= <>
##$TPNAME2= <>
##$TPNAME3= <>
##$TPNAME4= <>
##$TPNAME5= <>
##$TPNAME6= <>
##$TPNAME7= <>
##$TPOAL= (0..7)
0.5 0.5 0.5 0.5 0.5 0.5 0.5 0.5 
##$TPOFFS= (0..7)
0 0 0 0 0 0 0 0 
##$TUNHIN= 0
##$TUNHOUT= 0
##$TUNXOUT= 0
##$USERA1= <user>
##$USERA2= <user>
##$USERA3= <user>
##$USERA4= <user>
##$USERA5= <user>
##$V9= 5
##$VALIST= <valist>
##$VCLIST= <CCCCCCCCCCCCCCC>
##$VD= 0
##$VDLIST= <DDDDDDDDDDDDDDD>
##$VPLIST= <PPPPPPPPPPPPPPP>
##$VTLIST= <TTTTTTTTTTTTTTT>
##$WBST= 1024
##$WBSW= 4
##$XGAIN= (0..3)
0 0 0 0 
##$XL= 0
##$YL= 0
##$YMAX_a= 592720
##$YMIN_a= -587079
##$ZGOPTNS= <>
##$ZL1= 120
##$ZL2= 120
##$ZL3= 120
##$ZL4= 120
##$ABSF1= 16.522
##$ABSF2= -4.171173
##$ABSG= 5
##$ABSL= 3
##$ALPHA= 0
##$AQORDER= 0
##$ASSFAC= 0
##$ASSFACI= 0
##$ASSFACX= 0
##$ASSWID= 0
##$AUNMP= <proc_1d>
##$AZFE= 0.1
##$AZFW= 0.1
##$BCFW= 0
##$BC_mod= 0
##$BYTORDP= 0
##$COROFFS= 0
##$CY= 12.5
##$DATMOD= 1
##$DC= 0
##$DFILT= <>
##$DTYPP= 0
##$F1P= 14.0000005364418
##$F2P= -0.99999901652339
##$FCOR= 0.5
##$FTSIZE= 32768
##$FT_mod= 6
##$GAMMA= 0
##$GB= 0
##$INTBC= 1
##$INTSCL= 1
##$ISEN= 128
##$LB= 0.3
##$LEV0= 0
##$LPBIN= 0
##$MAXI= 10000
##$MC2= 0
##$MEAN= 0
##$ME_mod= 0
##$MI= 0
##$NCOEF= 0
##$NC_proc= -3
##$NLEV= 6
##$NOISF1= 0
##$NOISF2= 0
##$NSP= 0
##$NTH_PI= 0
##$NZP= 0
##$OFFSET= 16.522
##$PC= 1
##$PHC0= 170.0951
##$PHC1= 1.399535
##$PH_mod= 1
##$PKNL= yes
##$PPARMOD= 0
##$PSCAL= 4
##$PSIGN= 0
##$REVERSE= no
##$SF= 250.13
##$SI= 32768
##$SIGF1= 0
##$SIGF2= 0
##$SINO= 400
##$SIOLD= 32768
##$SREGLST= <1H.CDCl3>
##$SSB= 0
##$STSI= 32768
##$STSR= 0
##$SW_p= 5175.98343685301
##$SYMM= 0
##$S_DEV= 0
##$TDeff= 65536
##$TDoff= 0
##$TI= <Analysis number 999999
Compound Code 99
Book Reference 9
Project Code 9>
##$TILT= no
##$TM1= 0
##$TM2= 0
##$TOPLEV= 0
##$USERP1= <user>
##$USERP2= <user>
##$USERP3= <user>
##$USERP4= <user>
##$USERP5= <user>
##$WDW= 1
##$XDIM= 32768
##$YMAX_p= 534261883
##$YMIN_p= -70400
$$ End of Bruker specific parameters
$$ ---------------------------------
##NTUPLES= NMR SPECTRUM
##VAR_NAME=  FREQUENCY,     SPECTRUM/REAL,   SPECTRUM/IMAG
##SYMBOL=    X,             R,               I
##VAR_TYPE=  INDEPENDENT,   DEPENDENT,       DEPENDENT
##VAR_FORM=  AFFN,          ASDF,            ASDF
##VAR_DIM=   32768,         32768,           32768
##UNITS=     HZ,            ARBITRARY UNITS, ARBITRARY UNITS
##FACTOR=    0.157963299565203, 1,           1
##FIRST=     4132.6476996994, 0,             0
##LAST=      -1043.33573715361, 0,           0
##MIN=       -1043.33573715361, -70400,      0
##MAX=       4132.6476996994, 534261883,     0
$$ Real data points
##PAGE= N=1
##DATA TABLE= (X++(R..R)), XYDATA
$$ [...]
21882 -15218 -12979 -12327 -5181 -12501 -15974 -14902 -8724 -15764 -24003 -13251 -7400 -8014 -8303 -17553 -12544
21867 -12544 1149 -1588 5287 8202 2819 -5788 -20648 -21385 -13867 920 4781 138 -3602 -6452
21853 -6452 5046 8290 3813 1421 -10117 -150 7455 7067 8489 13927 19128 11848 7114 4904
21839 4904 11128 1977 -20050 -27015 -17744 -15064 -16767 -11591 -16840 -18065 -18538 -13064 -4361 -24123
21825 -24123 -30310 -26913 -32823 -24381 -17263 -15459 -18539 -25021 -9241 1031 -137 1610 5276 10608
21811 10608 4871 845 -1302 2931 -3714 -2398 13872 17242 -4918 -9230 -8651 -8289 -21091 -26070
21797 -26070 -24791 -15336 -20736 -19058 -13961 -16122 -25544 -26698 -21744 -5815 1537 409 -15943 -19445
21783 -19445 1769 -2380 -11197 -13025 -11860 -10157 -5926 -4686 1240 2176 1989 2502 3061 4212 -1419
21768 -1419 -6947 -12847 -12716 -23084 -22074 -3890 13697 16655 24869 30389 29415 20023 14705 11916
21754 11916 656 5720 -5137 -14471 -12426 6552 6474 5746 -9306 -17367 -13431 -5814 -6994 -7862
21740 -7862 -14036 -22946 -21887 -25279 -27593 -17094 -22119 -13732 611 4595 -970 -2713 -8179 -16060
21726 -16060 -22410 -20855 -8791 -9446 -9046 -9847 -20884 -25460 -19247 -23746 -18208 -9835 -5998 -13418 -7957
21711 -7957 -15974 -21552 -21484 -10407 -13757 -9516 -13002 -37847 -29214 -6104 14204 19960 14660 1653
21697 1653 -14096 -20805 -23245 -21727 -22328 -6834 12252 24971 15417 12439 6373 2401 -551 -12023
21683 -12023 -26036 -33297 -34450 -32051 -33704 -41609 -38493 -34677 -33961 -28960 -18289 -1428 -300 -5027
21669 -5027 -7649 -15886 -22848 -24321 -19402 -13137 -15486 -4585 -14396 -24045 -36529 -25987 -8820 -7997
21655 -7997 -5734 4120 4489 -1087 -5865 -21305 -29722 -22121 -8769 722 3168 4132 -16251 -21339
21641 -21339 -3414 1502 3337 -2319 -14829 -10052 -15476 -14625 -5283 -718 2104 3645 -2385 1301
21627 1301 -5726 -9266 -14974 -14572 -15876 -12417 -18582 -12677 -23646 -35055 -32922 -35918 -30427 -15346
21613 -15346 -7509 -9672 -2935 -11500 -13805 -14622 -17566 -16626 -14924 -10959 -12512 -32520 -37247 -33888 -43392
21598 -43392 -33270 -23559 -12470 -20320 -33942 -22191 -11845 -8371 -19547 -15550 -6172 -2597 -4307
21585 -4307 -5366 858 -2161 5405 11012 19482 15512 8785 625 -7686 -13895 -14840 -9591 -9582 -1933 5765
21569 5765 9881 10225 3377 -10699 -13004 -3486 -5364 -15820 -22001 -23711 -11090 -11873 -23466 -21482
21555 -21482 -23285 -21773 -22208 -16336 -3137 7313 1745 -12453 -24942 -23811 -14973 -5550 -9368 -9734
21541 -9734 -11756 -12881 -19959 -19455 -11726 -2610 -796 4376 -1482 -10267 -10781 -24086 -26032 -6145 -6375
21526 -6375 -12952 -9707 -13992 -11876 -15026 -21500 -22670 -26439 -25495 -7904 -89 4753 659 -13279
21512 -13279 -6884 -226 2729 -5366 -18722 -25493 -15854 -12003 584 5717 -3623 -8206 -1879 9218
21498 9218 14058 7298 9543 17166 7796 -5016 -3661 -20327 -25899 -11639 -10115 -6267 -10381 -6213
21484 -6213 6406 5099 -734 -5273 -9170 -13003 -26189 -13549 -8391 -7038 -18073 -24691 -22132 -4220
21470 -4220 -5079 -15446 -32047 -43169 -31569 -23372 -12278 -1730 2073 -1071 -17387 -20008 -854
21457 -854 15725 18108 17051 17727 14624 6300 3892 -10465 -21388 -24907 -23225 -20625 -22748 -15931
21443 -15931 -5133 -3463 1249 -7969 -14517 -12849 -2759 -12302 -19668 -15458 -23903 -12457 -16585 -8809
21429 -8809 -2961 5380 15674 13313 -6971 2468 18260 15518 13490 -1202 -17256 -21609 -21601 -15723
21415 -15723 -8307 -6646 -3705 -6370 -19757 -25660 -3756 -2317 -17009 -30015 -25792 -11470 -11059
21402 -11059 -17484 -19424 -23269 -19708 -5419 3788 2628 -6889 -8098 -17950 -18881 -18050 -4832 -3072
21388 -3072 -9974 -9707 -7053 -7959 -6799 -8211 -6933 4192 -8016 -23673 -37682 -32858 -30446 -15796
21374 -15796 2729 8095 -4451 -16874 -23180 -25673 -26037 -23682 -23038 -24298 -35215 -33338 -26618 -26626 -30528
21359 -30528 -19657 -9376 -5317 16717 16399 12087 22434 29292 18921 -11783 -25737 -17087 -22596
21346 -22596 -22062 -13029 3307 -11614 -33492 -31856 -31535 -19790 -7171 -11669 -13883 -13381 -10887 -11584
21332 -11584 -7412 -6022 -13944 -30002 -36155 -35482 -25293 -14413 -11463 -26059 -31652 -16655 -5649
21319 -5649 -3196 -1398 -7719 -6198 -6656 -8731 8616 9100 -7122 -1174 2616 3084 -5580 -20552 -7896
21304 -7896 1436 1203 -1619 -1644 -2495 -3492 8097 15864 15209 4853 -5826 -6413 -6014 -1859 -1778 -8710
21288 -8710 -7148 -5267 -15219 -13650 -23647 -26464 -22865 -2431 21646 18913 10127 10383 11008 4113 4238
21273 4238 4918 11421 16251 30737 27389 11147 -10187 -12980 -13208 -19138 -18800 -17564 -18647 -21457 -26641
21258 -26641 -28861 -29141 -21253 -14203 -13966 -12240 -18050 -21278 -12530 -11225 -8599 -9426 1348 -13150 -19756
21243 -19756 -17010 -14831 -20570 -21167 -25551 -13442 -18851 -18476 -29055 -31041 -33449 -31703 -18259 -8670
21229 -8670 -5407 -225 -1862 -6378 -21865 -23431 -19509 -31253 -40766 -48530 -35882 -21688 -21113 -8580
21215 -8580 4484 -5404 -15237 -12234 -11988 -1727 -13300 -22841 -22815 -21421 -27903 -23968 -21099 -17482 -13059
21200 -13059 -9431 -10035 -19073 -19654 -26924 -28535 -17520 -18550 -26889 -17389 -23049 -21694 -18356 -12668 -10871
21185 -10871 -5010 -5544 -1817 -11184 -11443 -11366 -2398 -3326 -453 911 885 6318 -7479 -5551 800 5492
21169 5492 1893 -12665 -10352 -4386 -12602 -24070 -25567 -23511 -35283 -35243 -29293 -5629 5552 -2803
21155 -2803 -14279 -18269 -21178 -28177 -30917 -21254 -25159 -35770 -32070 -30453 -32664 -27961 -6077 -3544
21141 -3544 -9688 -4952 -9453 -12219 -12660 -13916 -9049 -19397 -22418 -28891 -27172 -23120 -23333 -23995 -21902
21126 -21902 -27054 -12638 -6312 -2746 -1741 -7980 -14603 4120 -7170 -6291 7626 -2941 -23858
21113 -23858 -37948 -34321 -17743 -15006 -15554 -18705 -22572 -18072 -9246 -5511 -7139 -12615 -23335 -36602
21099 -36602 -36036 -32719 -31139 -10319 3425 15542 18097 10521 -16215 -21240 -22114 -18386 -11744 -20885
21085 -20885 -38352 -37825 -25432 -33420 -36901 -23430 -18608 -21293 -17813 -8028 -18518 -18884 -12906 -6944
21071 -6944 -571 -827 -10966 -7818 -20051 -23129 -12759 -9941 -4286 -10512 -14627 -19435 -11733 -13130
21057 -13130 -164 -3193 -15331 -6031 -10029 -19310 -27411 -14044 455 15690 23397 13626 2172
21044 2172 -3516 -2118 -11686 -16173 -13839 -20641 -31943 -26883 -26935 -31793 -17418 -20667 -20566 -14500 -24059
21029 -24059 -17406 -17799 -20323 -23720 -4628 -2178 -1441 -2594 -12230 -16219 -7626 -2997 549 6195 -2667
21014 -2667 -11805 -24063 -22770 -20767 -20640 -24211 -14881 -12336 -15169 -12647 -10674 -10278 -1805 -6570 -21753
20999 -21753 -26967 -18084 -27690 -22487 -14099 -16435 -20895 -7375 3371 9520 3737 -3948 -5289 -20082
20985 -20082 -25556 -24130 -17257 -5423 -19968 -26736 -21288 -8945 -5856 -2251 -6912 -19482 -32239
20972 -32239 -42047 -53147 -42550 -28310 -25871 -30013 -22974 -13915 -12873 -6897 -14197 -20573 -21143 -12382
20958 -12382 -13349 -18288 -17305 -19694 -27074 -30495 -41119 -34760 -29988 -8941 5553 -5516 2979 6041
20944 6041 14050 11224 16782 20651 15390 -2265 -34648 -45265 -33897 -40551 -37073 -18279 -12704
20931 -12704 -16114 -1763 48 4541 9699 10867 -642 -7703 -19884 -26283 -18229 -14340 -30381
20918 -30381 -44552 -26550 -13824 -8221 -2860 779 -9823 -20591 -16681 -13801 -10651 -5524 -7848
20905 -7848 -9547 -26027 -31029 -25943 -29095 -32446 -42031 -20735 -24114 -32082 -27239 -16384 -17533 -7508
20891 -7508 2094 -4554 -10061 -7004 -5369 -14131 -11383 -3828 1687 9262 6343 -7096 -21499 -30226
20877 -30226 -30622 -27310 -30859 -34893 -33918 -31168 -30643 -37665 -33600 -20220 -15100 -10882 -4590 -8961 -9922
20862 -9922 -14257 -20596 -19049 -20564 -11215 -3764 -1894 -9736 -13413 -20241 -23666 -18587 -7563 3150
20848 3150 2987 -11415 -13480 -8455 -2863 5949 3495 -11174 -18517 -22367 -15514 -16842 -27705 -32429
20834 -32429 -27938 -30085 -32760 -43549 -51081 -33598 -29564 -34676 -28238 -13791 -13049 -6700 -4132 -8415
20820 -8415 -7190 4820 -985 -9260 -8068 3068 5062 -20115 -22424 -12673 -8611 -15735 -19116 -10362
20806 -10362 -13471 -20720 -11518 -10110 -16779 -18442 -14847 -23014 -18324 -15525 -12993 -20343 -38335 -42952
20792 -42952 -29522 -14995 -6524 -19907 -10858 -7147 -8724 -18671 -20770 37 -2728 -21326 -20380
20779 -20380 6940 8487 -1250 1373 -1040 -4651 322 1964 -9173 -17770 -18910 1943 5804 10398
20765 10398 8333 4073 -5860 -18412 -14149 -10235 -17593 -23544 -12896 683 -4755 -9039 -1668 -6674
20751 -6674 -16680 -18878 -12654 5505 17147 4168 834 -10616 -12879 -16233 -28614 -17406 -15738
20738 -15738 -8015 -10962 -24525 -17563 4891 1736 -413 -9881 -7928 -10255 -22230 -18562 -4290
20725 -4290 279 -3041 7263 18152 22138 27506 15355 3614 -11076 -14553 -18445 -26231 -13502
20712 -13502 -2722 -6910 -15206 -8245 -4361 -11186 -18631 -19002 -8335 -9729 -9118 -14260 -22265 -15535
20698 -15535 -9100 -12851 -15627 -8809 730 -1134 -20482 -31371 -15645 -102 -7458 -17025 -22968
20685 -22968 -21822 -14024 -9996 -4764 -2486 1074 -3547 -5582 1061 6574 1576 4119 -14078 -19441
20671 -19441 -8496 -7531 -10243 -2824 7813 10495 1032 -4493 -12342 -8249 -7172 -2373 -6458 -21485
20657 -21485 -32364 -24669 -12897 1657 2884 1698 5495 7730 27997 25723 19393 23942 14328
20644 14328 11956 2384 -3562 -4023 397 3418 7159 -1415 9861 2526 -1139 2409 -316 -12916
20630 -12916 -25207 -23217 -576 -16406 -29468 -18002 -18839 -24878 -21849 -20783 -23414 -25998 -35327
20617 -35327 -33359 -24131 -22000 -17420 -9625 -8120 -27659 -31830 -4293 -4292 -14416 -20267 -29980 -26077
20603 -26077 -32165 -33591 -27602 -30858 -25673 -17257 -18989 -11217 3358 1658 484 -3701 2835 10008
20589 10008 1767 -13936 -20144 -18633 -27814 -33802 -19789 -10566 -7259 -6874 -5370 -6359 -6686 4402
20575 4402 -2509 -15844 -31616 -41917 -43313 -42578 -31981 -22250 -23550 -37657 -36103 -53937 -49546
20562 -49546 -22064 -25784 -21524 -20713 -14521 10038 -1829 -18780 -32456 -32097 -28932 -13079 -6175
20549 -6175 -17815 -23934 -20511 -16350 -17791 -18253 -18005 -18825 -9204 -6116 -12325 -17004 -6417 7879 6112
20534 6112 -17738 -35141 -47755 -48602 -35247 -18335 -10202 -16330 -23942 -24364 -16965 -12722 2228 4474
20520 4474 -17414 -32406 -46380 -51680 -34940 -17680 -11076 11992 17701 -186 -19314 -25547 -18703
20507 -18703 -11835 -17942 -24695 -33868 -21507 -10006 -14076 -33440 -37257 -12984 -18340 -24896 -27242
20494 -27242 -29964 -23163 -17142 -20656 -12034 -847 -3285 -6985 -9370 -15684 -1430 4741 -6864 -6707
20480 -6707 -12816 -23784 -21517 -12784 -7558 -7942 876 6968 10460 7102 12658 206 -14228 -27337
20466 -27337 -33269 -21948 68 9480 11654 5148 -5650 -23011 -14163 -13947 -22736 -28485 -31316 -23007
20452 -23007 -22545 -15132 -18279 -14462 -4068 -7588 -11536 -11884 -19593 -28601 -25471 -18995 -21009 -21321 -25879
20437 -25879 -20882 -14993 -27085 -32962 -17773 -20827 -25058 -27723 -13436 -11188 -12340 -16111 -11833 -19177
20423 -19177 -11799 -14083 -27916 -22294 -20222 -26072 -37855 -25162 -17766 -14433 -12528 -4044 -1821 4177
20409 4177 10380 -5195 -3777 1952 1164 1906 -477 -1472 5537 13336 3704 -2878 -5330 -3804 -4186
20394 -4186 -1233 -11304 -1604 -17448 -20795 -11351 -13797 -10570 -1977 -86 -470 10584 12722 9734
20380 9734 12026 -3362 -17118 -31027 -19611 -13722 -11651 -19208 -20850 -13430 -16603 -15606 -27061 -35275
20366 -35275 -27404 -19632 -15633 -16425 -10476 -13561 -23853 -33949 -34220 -30781 -25336 -27158 -29592 -17318
20352 -17318 -9666 -5403 1460 -11023 -18013 -11733 -11486 -15248 -21723 -26031 -31789 -27494 -21894 -6034
20338 -6034 -629 7465 -3487 -8992 -12444 -15092 -17855 -19117 -20097 -17525 -6141 -2954 -7587 -14591
20324 -14591 -12407 2370 3629 -444 -3839 -16794 -16329 -6511 -7362 -8379 -8075 -9807 -11284 -6692 1973
20309 1973 3721 -827 -8791 -13005 -3205 7306 -9357 -13036 -18029 -10615 1799 7346 2129 -5552
20295 -5552 -8031 -12051 -15250 -3677 -8099 -6540 5992 12064 11471 -2510 -20111 -487 1728 -13377
20281 -13377 -10954 -11928 -17290 -22866 -12857 3971 9598 -1116 -7239 -3755 -2396 7797 17729 10435
20267 10435 -7970 -10560 -4833 -3051 -3178 -6424 -16950 -22702 -17959 -5084 -8424 -10538 -19210 -19680
20253 -19680 -11271 123 5986 7164 1696 3288 -11212 -18642 -23900 -35888 -30459 -27862 -23413 -23313
20239 -23313 -13461 -13359 -27640 -24637 -13703 -12405 -2767 -573 -3528 -2108 -5411 -12194 -11137 -10474
20225 -10474 -17843 -27085 -21472 -8792 -2669 -3562 -9130 -25570 -35691 -16983 427 7800 -5474
20212 -5474 -3881 6289 8723 -573 1102 1956 331 -1290 -1832 -8827 -28212 -41442 -33838 -17191
20198 -17191 4930 20195 16212 1162 4594 18470 22861 13051 -8761 -18525 -15261 -15979 -14459
20185 -14459 -13686 -7219 -10550 -9159 -5543 534 -2399 -2119 -3194 -8994 331 -5795 -1202 -6986 -22956
20170 -22956 -28042 -24926 -24291 -25139 -18109 -8319 -13178 -13638 -16325 -22777 -30167 -37687 -28119 -10402 -6573
20155 -6573 -14082 -30117 -23112 -7557 2896 3947 2818 8077 -1777 -15140 -20379 -26200 -29193 -26160
20141 -26160 -9265 -15631 -26882 -20150 -6228 -488 -2998 6627 -601 1923 2484 -4628 -11761 -16517
20127 -16517 -3168 1209 -8368 -9741 -19227 -25573 -17590 -18814 -18284 -11896 -8738 -12751 -4518 5176
20113 5176 -3044 -10842 -16337 -22670 -16007 -12692 -18311 -6972 -4009 -7143 344 8964 7659 -1128
20099 -1128 138 2427 -15997 -28815 -21810 -14989 -6530 -3411 -5289 -15174 -9654 6803 -5778 -19210
20085 -19210 -12682 1966 6569 17962 6396 2610 740 -2389 -10970 -21659 -34149 -37488 -17950
20072 -17950 -20735 -22695 -20794 -19320 -16478 -5940 -6984 -6661 -1654 -16180 -14192 -16704 -23937 -13316
20058 -13316 -21311 -15518 -8222 3413 3311 -2259 -3511 87 837 9853 17114 12014 -7826 -8320 979
20043 979 2146 6449 18952 821 -12488 -21033 -22940 -29558 -28027 -27153 -29257 -34525 -29988 -33373
20029 -33373 -33791 -29748 -26382 -11883 -2428 -1945 -2397 -11566 -14754 -11364 -5348 -7211 -10040 -16044 -23154
20014 -23154 -28910 -26412 -19672 -19700 -20011 -13006 -7578 948 -6685 -18303 -2436 -13228 -27151 -32897
20000 -32897 -18798 -12668 -12808 -6493 -3718 5158 8596 14082 15870 7843 -5462 -11335 2268 23397
19986 23397 20221 19136 6331 8421 6269 -2562 -14258 -13445 -23564 -25924 -20286 -9341 -11360 14
19972 14 12599 11058 15873 -4859 -19783 -17998 -6674 -7720 -13277 -15689 -15173 -4764 -12513 -35459
19958 -35459 -26975 -9116 3347 -5836 -15951 -19972 -15570 -17004 -12771 -6796 -5588 -11944 -9357 -7522
19944 -7522 -6845 -28783 -41286 -43530 -49194 -44225 -27856 -11199 -11293 -21243 -24162 -23713 -22115 -28365 -33057
19929 -33057 -37895 -29951 -12917 -9608 -11498 -6742 -3370 -6994 -14585 -9280 -3121 -3987 -4142 -977 2718
19914 2718 -5424 -6306 -18646 -23036 -22327 -18988 -16684 -7509 -7332 -13710 -19521 -14616 3625 6613 -13678
19899 -13678 -11423 -3080 2022 2281 -1550 -10082 -7768 6159 9103 3380 4979 9514 9279 6564 4175
19884 4175 4637 -4016 -9826 -7304 -865 -12479 -11944 4094 7809 -3708 -3218 1829 -14866 -15925
19870 -15925 -20782 -26371 -38464 -39101 -17778 -10703 -9320 -9726 1663 7437 8024 -5777 -12706 -1726
19856 -1726 -1829 -14602 -12656 12273 20857 3051 -5112 -17660 -12204 -12275 3573 1979 -12909 -20542
19842 -20542 -10863 -16169 -14257 -13826 -11900 -7689 -6611 -7400 -15893 -25060 -27332 -16836 -12311 -15962 -11744
19827 -11744 -86 9579 6764 -6997 -8773 -5718 -11337 -21438 -18596 -868 11822 8958 -1060
19814 -1060 -19094 -20296 -20579 -28323 -36489 -36026 -37044 -45078 -43412 -37845 -44289 -34915 -30720 -36649 -25179
19799 -25179 -12292 -17388 -42928 -37069 -25060 -24215 -10962 -11886 -9233 -6876 -7922 -1710 -6837 -17631
19785 -17631 -27233 -28020 -13068 2876 4822 2738 1328 -10054 -21810 -33447 -36230 -28911 -25953
19772 -25953 -27864 -28787 -27222 -4107 -6447 -23105 -30479 -30592 -23832 -9080 -12515 -16099 -21761 -29664
19758 -29664 -26652 -23676 -21083 -16388 -13005 -10263 -16497 -10272 -12844 -17819 -23081 -33298 -34711 -29003
19744 -29003 -9670 10329 26720 11423 -12192 -20759 -13177 -4905 -3676 -4104 -2633 -9878 -5375
19731 -5375 -13270 -21847 -16640 -13970 -13740 -11065 -14588 -20420 -15078 -17997 -20106 -14368 -12291 -10101 -15324
19716 -15324 -5051 -1598 216 -12808 -21785 -21257 -20687 -16939 -14385 -3624 -4569 -9169 -4143 -7999
19702 -7999 -23747 -22666 -17900 -20649 -27134 -892 6212 21027 6124 -5608 -2168 -13569 -25853
19689 -25853 -27289 -14874 6159 9359 14021 15674 11411 16895 25997 32013 18314 2711 -3300
19676 -3300 5354 14003 11611 2969 2305 9052 2795 2301 8868 5938 -1978 -2013 -11094 -8008 -5845 3267
19660 3267 1427 -5781 -12416 -22459 -22935 -26750 -32241 -18120 -19123 -15976 -12103 -9030 -10395 -17740
19646 -17740 -10626 1603 2823 -3113 -537 -3780 -7560 -1669 7712 19259 23086 21383 19814 21658
19632 21658 17844 1614 -7067 19964 24886 19128 10928 118 -9207 -14596 -13582 6136 21031
19619 21031 4438 -2790 11709 13457 11617 4066 8218 4657 4404 -2796 -14563 -8454 7490 5897
19605 5897 7357 17068 20846 12991 10701 6180 1691 10267 4153 -2017 -2791 2316 533 4199 7817
19590 7817 6239 6758 -8214 -11556 -6724 -1057 6698 -10453 -9019 -9188 -1204 7359 9596 -2691
19576 -2691 -491 819 3051 5661 4120 8113 20096 22255 14379 10860 21063 31110 30138 25316
19562 25316 10001 -6082 -10100 6799 4740 -798 -6347 3888 16536 16430 -1443 -7869 -7637
19549 -7637 -7130 -12015 -27880 -20348 2789 -17206 -20660 -16256 -29071 -33800 -30459 -15659 -24263 -26218
19535 -26218 -17522 -15299 -19863 -21081 -2550 1961 -8027 -5534 -1584 -851 11673 12135 -8555 -10648
19521 -10648 267 10316 8648 16932 30958 43875 42122 50373 53447 45939 38855 31452 33424
19508 33424 44206 55179 45849 27418 25610 25439 14127 11593 17795 32216 25389 19871 8001
19495 8001 -6387 -8260 -3142 4500 21644 22572 18509 15131 15233 16310 18956 7291 -4195 6559
19481 6559 20078 8988 7913 20665 29355 36036 26485 14421 11009 8062 10549 18863 32349
19468 32349 42037 51959 54461 47992 50008 46463 33328 40175 39086 42443 37035 44424 48600 41553
19454 41553 34066 16509 8390 10725 20482 22937 18188 25935 31342 32875 31078 31482 25967 35817
19440 35817 24826 21617 22271 23626 19142 18382 16542 446 8539 10215 13634 17081 21320 27083
19426 27083 35838 43572 26356 14628 24984 24415 22605 21552 31592 28682 24723 22466 29341 15028
19412 15028 15671 18995 13972 3102 -4748 -8617 6040 27303 26484 3528 12892 21284 20141 15514
19398 15514 11420 10911 10957 15361 15997 18129 18223 19779 13295 16909 19206 21843 26459 21694 33473 29668
19382 29668 31982 58229 48655 32689 27075 25141 28127 24931 22922 23526 25578 14215 22333 28818
19368 28818 35925 46847 40147 33025 53390 64471 55566 40281 39222 39171 44297 44437 40044 38012
19354 38012 32006 42542 44825 31781 21763 26168 21279 19693 29645 34902 31274 26511 23825 25651
19340 25651 24339 21637 22866 26513 35247 25748 32655 41526 34238 20930 11495 -1456 5383 27018
19326 27018 23815 15402 19850 17366 12970 -3299 -5388 -4468 18767 35798 34608 15996 -750
19313 -750 4127 7164 -3136 10810 28137 33909 17446 12570 14778 11780 9489 5658 8459 25637
19299 25637 30501 28366 32049 29143 26670 29974 27759 22938 23487 26507 25099 33116 41296 41811 42320
19284 42320 42601 43711 42711 47666 48606 35534 19013 24891 27642 31924 36276 33531 21934 22644
19270 22644 23119 18184 29130 30605 30867 42018 37717 34815 42411 50267 41960 35532 40730 43291
19256 43291 36664 46118 48958 40365 35382 31916 40551 45670 33399 21697 12730 27386 33113 31419
19242 31419 35722 44368 48138 39177 28073 29005 31364 34103 33723 23918 9691 -2863 13623 39994
19228 39994 54886 64474 57375 55561 43212 34069 34936 45355 44236 46210 51969 45581 36619 36541
19214 36541 49561 50264 56114 56678 57243 51965 49606 58299 60228 52759 39515 45434 50449 48761 47124
19199 47124 58154 59411 57309 44834 32102 43863 59586 68113 64067 61300 52947 47794 45028
19186 45028 44398 42063 51979 68516 66513 64001 69798 62593 55626 55598 45236 31363 37174 42300
19172 42300 44234 44215 42698 44095 43712 45944 61111 64834 43413 52500 50296 52902 44131 34491 46350
19157 46350 53580 50943 44431 61737 56213 62306 48398 45861 56864 51749 22570 19421 15499
19144 15499 23881 22395 25132 36381 52461 64595 58899 47306 47217 42940 44394 57946 65602 69477
19130 69477 58679 59869 69866 65053 69732 78243 84662 106202 123538 145311 176475 191624 196332
19117 196332 208231 218561 226282 223824 203276 179363 187529 213029 254273 293144 332980 355421
19105 355421 368448 385647 399783 398435 391273 384534 398264 410675 408081 401917 405026 395617 365870
19092 365870 356715 352344 330691 310877 308793 312838 316575 318694 294309 266838 258202 228931 224856
19079 224856 206365 181917 173769 173251 174345 196316 204152 219766 238720 269997 294060 325607
19067 325607 354901 379054 418428 463784 485351 497456 527857 579279 639499 683553 710990
19056 710990 684280 651374 628397 599765 563759 514672 485246 459313 456661 474972 477646 476881
19044 476881 459656 422550 380199 362515 349897 320136 275609 241822 217922 200698 191407 184983
19032 184983 187693 196026 209624 201539 194863 197345 207171 228270 246134 244406 242530 247721 245860
19019 245860 266219 322804 356672 372484 403009 437525 450081 461724 485188 490191 465573 428918
19007 428918 402247 383295 367999 361155 370808 392146 395674 388108 373564 356928 350363 345169 333242
18994 333242 339723 354949 360652 367894 345365 321436 310332 293254 267078 243362 220266 205493
18982 205493 200477 202049 207496 218061 232995 253911 275951 306001 325011 352174 364113 380917
18970 380917 392164 398208 410551 444292 467024 471159 479562 486442 474424 492088 510080 526219
18958 526219 545706 563774 591151 615031 616761 576956 522947 460932 394401 349514 320095 327471
18946 327471 349496 359640 361669 365879 390063 391210 397755 404641 379055 351878 342263 319526 315717
18933 315717 310992 277555 271518 265214 270777 267208 258234 252654 251600 259739 256665 256563 268561 288299
18919 288299 286892 284089 293221 320394 330775 341594 357996 357350 359551 357221 338043 282250 242439
18906 242439 234760 250281 280912 313663 330887 338100 347699 352601 347829 327082 285656 235523
18894 235523 192840 164367 160249 160950 153099 151475 156397 157792 158527 166059 164514 173392 174936 169755
18880 169755 155384 160518 155534 152251 148982 152614 144512 141739 146124 145531 149618 138349 136908 135471
18866 135471 134594 123319 112805 122014 117879 115851 124701 108495 113135 117373 107739 93838 94636 91186
18852 91186 87260 92240 95181 95825 97144 89277 80852 65705 73991 85212 86741 97373 107813 121087
18838 121087 137983 140628 152905 157708 152012 145856 149167 145190 138405 153675 156527 159441 158708 159361
18824 159361 150916 138984 139438 137184 141549 144985 144690 138477 145820 151349 154764 165153 161015 142119
18810 142119 140634 147407 140353 151924 161105 173378 178280 189987 188886 175697 178591 183628 180577
18797 180577 181275 186319 190595 186396 173499 164393 168002 174277 167083 160597 159281 165936 170631 165777
18783 165777 167759 162985 142614 127925 127259 157945 179010 201199 209795 213311 225516 251654 263117
18770 263117 270084 275409 268891 255684 238161 240604 251113 264168 293092 345420 403658 455231
18758 455231 512997 558873 607505 615671 608420 610074 585230 550634 554209 595324 658558 714566
18746 714566 764025 795176 819963 821754 795903 728654 647884 593920 576103 577156 583213 606549
18734 606549 626991 652397 679568 685295 673036 663220 664126 679505 686190 687753 679108 658980 654334
18721 654334 660563 672214 693000 712955 742038 767256 801104 846428 896808 948374 992889 1007889
18709 1007889 975704 957710 943064 917536 892421 863606 840848 839287 862194 898393 961306
18698 961306 1018703 1064759 1124776 1169087 1191648 1171567 1108619 1033524 950929 892929 843380
18687 843380 808878 807986 797121 790563 792728 787705 769187 748050 739791 728876 715802 711813 725868
18674 725868 749449 791854 823541 840316 869340 897662 906196 898306 895773 910040 928953 938402
18662 938402 935651 941800 939206 933334 940415 964114 970059 979676 970406 942122 924152 932142 956079
18649 956079 989228 1024575 1061132 1110552 1154206 1191719 1231432 1245239 1246201 1258896 1279591 1336295
18637 1336295 1410670 1490458 1597459 1735233 1919959 2118785 2314272 2545463 2856202 3255656
18627 3255656 3713130 4173934 4539394 4836007 5155746 5435490 5648818 5792593 5722651 5603968
18617 5603968 5686151 5987804 6553566 7505988 9068392 11578601 15297136 20033277 24908076
18608 24908076 29249693 33238163 36872933 39492966 40565549 39723081 37103610 34032131
18600 34032131 33404261 35838169 39610074 43788570 48215695 52035092 54572151 56064174
18592 56064174 54801094 50004245 44192155 38211972 34237119 32482885 31866086 32383686
18584 32383686 33866029 35334837 36818270 37481235 35907697 34762679 35276450 36157503
18576 36157503 36914693 36822590 35337015 34098819 33444911 33227859 33024089 32815241 34125049
18567 34125049 37649106 42888474 49384431 57141482 65841677 74497122 81274554 85050848
18559 85050848 87029946 87125993 84309024 81342152 76575698 70160481 66860423 68399056
18551 68399056 74281235 82142395 90639882 99839219 109346124 117854429 123322478 125320514
18543 125320514 122073725 113161721 100637878 88162680 74523005 62076281 53617102
18536 53617102 47662104 43317505 39081723 34195762 30445284 28072274 26606549 25724821
18528 25724821 25309053 25405493 26105480 27640331 30037930 32750437 35278555 38174896 41881036
18519 41881036 45989079 50593180 54687336 55867025 55911000 56339979 56125127 54922360 52350789
18510 52350789 46704334 39389768 33336083 28995226 26263040 24758731 24124054 24198444
18502 24198444 24932710 26421253 28756143 32092629 36831716 43296510 51503124 60776175
18494 60776175 68718115 74260559 79595519 83696671 84434593 83934204 80415953 73804949
18486 73804949 71327886 76097576 87488458 102789531 118747203 135386402 153529743
18479 153529743 169372026 179418713 183592855 179325339 167990816 154122103 141022306
18472 141022306 126632921 111867537 101578132 96094652 93419140 89667822 85580794
18465 85580794 83358454 81573748 79507675 76594614 70623405 63347614 57141312 51945245
18457 51945245 48862841 47139370 45927593 45639109 45653463 44958694 44132407 42292472 39012465
18448 39012465 37168208 37614701 39726949 42282654 44538842 47069699 50005595 52463182
18440 52463182 54570847 55692474 54873625 54769851 56697141 60455773 65722502 69664313
18432 69664313 71161597 71987163 71462304 69722033 66609647 60735647 52396560 42531138
18424 42531138 34831334 30429017 28166421 26989390 26353720 26216834 26259772 26030327 25650383
18415 25650383 24954395 23596494 22196247 21007018 19828435 18880945 18431265 18289977 18216682
18406 18216682 18318562 18551350 18589601 18577397 18498076 18185327 18385922 19140502 19894495 20584679
18396 20584679 21488547 22143765 22378869 22591040 21510321 19309037 17695298 16465969 15345587
18387 15345587 14436788 13575556 12329323 11240893 10677907 10598573 10994366 11756799 12576305
18378 12576305 13179326 13567088 13896462 13971328 13599076 12813283 11366774 9422352 7929862
18369 7929862 7010127 6405289 5979304 5641790 5355120 5099615 4881098 4686393 4508188
18360 4508188 4359574 4222320 4080529 3947432 3834254 3731153 3607214 3507951 3407693 3322435
18350 3322435 3273472 3255944 3258386 3270754 3280151 3259058 3196994 3128351 3040168 2952627 2866577 2762333
18338 2762333 2665579 2603838 2562935 2518044 2490212 2422678 2337638 2280594 2212609 2125855 2042685
18327 2042685 1972390 1911147 1849196 1788470 1729064 1680819 1634172 1578922 1536268 1489352 1452164
18316 1452164 1412742 1392952 1359390 1331099 1325073 1315780 1283865 1264386 1250731 1232240 1227527 1224587
18304 1224587 1226734 1219118 1210202 1207654 1202421 1194312 1205084 1210746 1178987 1165262 1167713 1143626 1123809
18291 1123809 1108986 1106672 1099236 1084890 1074199 1063932 1048474 1007604 962205 914115 874603 837744
18279 837744 811764 798916 792781 796102 788733 772499 756500 735599 706217 684944 684508 686405 684184
18266 684184 667731 640408 648500 638902 642801 652922 642649 634994 622177 609860 628808 628950 613716
18253 613716 617456 626658 624143 620505 629677 628859 617709 601545 582239 559743 549273 553280 558864
18240 558864 561731 550404 556908 546334 518431 508693 506489 497844 486920 478965 475330 459070 435321
18227 435321 401785 384476 381857 381237 387276 384985 384191 388476 386596 383430 378772 373736 370189 368689
18213 368689 375295 385723 388059 384543 378160 378594 360525 330278 319474 313295 315605 319721 323859
18200 323859 325303 312605 297367 293546 297219 295423 299919 290588 303499 302414 305255 310096 300381
18187 300381 293817 290336 274453 270449 272137 267852 262012 249720 245468 252086 255661 256309 256832 249102
18173 249102 249297 245637 239908 223397 218854 215332 201271 200119 194702 190394 201136 197249 195068 179757
18159 179757 176703 198624 206746 219197 222860 216365 212948 217257 209982 195878 181678 176458 178045
18146 178045 192336 193793 196064 189415 187609 193550 214958 214152 209642 213248 219328 238157 263204
18133 263204 286384 307905 334001 358990 383793 403277 434916 474580 542287 630926 713557
18122 713557 837620 1001931 1220209 1557019 2115232 3069416 4629010 6631511 8290260
18113 8290260 9236382 10347918 11470086 11546913 11331425 10333440 7163381 4606029 3257156
18104 3257156 2521437 2093093 1812697 1615492 1469779 1353015 1272841 1204994 1142486 1077415
18094 1077415 1047806 1033096 1019542 1005712 1005506 986869 965004 954907 946495 917637 904771 920919
18082 920919 942558 940817 925947 908578 896866 901910 866903 798423 737900 690698 675186 672071
18070 672071 664059 662838 663145 662192 663861 653768 646772 640955 636654 613066 587023 574552 562256
18057 562256 547524 547323 527203 513841 525535 559171 571918 573997 582537 582373 585181 598149 596573
18044 596573 592241 578440 564763 569814 591640 604631 594552 591375 577940 574687 565227 550941
18032 550941 549532 549942 546215 558065 564960 546622 534844 519553 488895 450858 430764 424508 432819
18019 432819 432177 424606 421464 420757 401573 396369 386479 359051 323863 290830 269034 270325 271019 278610
18005 278610 293928 308551 325077 330671 330672 329924 331232 325977 328197 347812 361046 378996 397614
17992 397614 413840 425843 439877 464104 480091 488958 471287 461401 467475 485516 499511 494895
17980 494895 470061 471274 471176 465359 461409 463471 444122 434914 445654 439934 419043 399405 355422
17967 355422 296001 266069 263857 258334 242857 233661 229987 224336 214703 208377 210192 226698 242143
17954 242143 251301 256380 267215 271273 279145 282329 291140 295091 326214 361167 391185 429402 434710
17941 434710 444491 457866 463850 483036 494946 490871 528408 548241 560790 570842 569942 576502 585317
17928 585317 568101 514092 472066 446214 428104 423816 407277 400187 393121 395499 389091 365911
17916 365911 317468 271779 249254 244198 237181 243593 240017 237226 229229 206205 174716 167976 177670
17903 177670 178958 171705 158331 161180 170002 178677 194380 218380 223496 223171 222882 234423 221670
17890 221670 217985 221134 228100 246285 246657 243679 252389 250812 238868 234503 230274 242267 263893
17877 263893 262572 257406 266910 274552 264395 250761 227292 180303 147902 132207 114406 109992
17865 109992 107941 102029 100473 99134 94920 90986 92480 94273 99268 100837 101051 99185 108019 107041 93831
17850 93831 92049 93404 92975 86359 84775 94131 92464 89400 77383 50199 48829 65300 73875 66400
17836 66400 68264 78333 67102 52535 48556 55417 53706 47227 54448 51241 38167 40991 61896
17823 61896 64056 63387 57071 52790 55843 51142 30328 38362 54807 49471 47506 36270 41779 46227
17809 46227 57084 76107 77375 66454 48270 39761 40101 41007 46778 61083 58067 51202 32047
17796 32047 37511 54515 65418 62957 59352 61055 59912 54289 51509 67008 69982 82928 76348
17783 76348 61874 62685 62546 50682 36290 47440 56019 53251 43238 32756 36055 49128 57905
17770 57905 69567 63312 53594 41967 32974 35609 40975 40077 33590 25100 31817 28775 23439 14970
17756 14970 12386 18262 28004 24785 35018 51155 43400 23893 15243 15749 16191 17091 43006 54818
17742 54818 45587 41171 36322 35845 36024 51083 36331 27039 24864 34783 42224 34820 24142 31176
17728 31176 22574 26768 34090 35371 28987 22137 20214 13696 27062 30363 22422 28225 35953 36631
17714 36631 31773 24508 23425 22748 8650 3932 13160 26916 41072 47702 48984 55983 46071 41860
17700 41860 44781 44876 44742 35414 26037 23386 25264 43891 48285 46593 29467 41860 34254 6665
17686 6665 -4992 7513 10092 20340 17705 22139 34653 43310 35523 29122 34919 31740 37342 33792
17672 33792 32966 25308 17309 14312 22984 34652 37462 27781 4345 8143 1808 5803 25669 29087
17658 29087 19943 17423 25720 33099 37533 42052 42925 32819 34726 31115 15445 -593 6202 4546
17644 4546 10173 14294 20049 20953 15509 18043 20084 17738 16284 23420 12073 1461 11349 22729
17630 22729 12606 13949 17564 23919 16698 8050 4115 3478 1663 13676 6087 2110 3932 10686
17616 10686 21850 34602 42044 32274 26318 34644 27394 28412 43491 37452 15919 3532 2610
17603 2610 6275 26203 27339 9963 12481 21023 9367 -1333 -7123 -4192 -7276 -4059 -2224 -6732
17589 -6732 -7711 -4060 2543 23189 22842 18576 15652 18752 28531 29847 31060 34935 23156 856
17575 856 -2491 7918 15856 18049 25243 20685 8474 10228 29899 26166 21127 17524 9258 -10232
17561 -10232 -6857 -1904 -1908 3604 21047 25938 15867 14637 13050 17901 23909 25062 31246 22937 24919
17546 24919 23522 13749 6024 4069 7346 10416 11676 24996 25656 23539 22137 16255 10897 6752
17532 6752 -970 -4712 7464 16189 14726 7710 8778 14936 29717 34125 26713 30777 25600 22296
17518 22296 5274 7707 28260 45317 47119 28907 26698 26131 31868 23736 19685 18500 24637 27267
17504 27267 23800 28104 32550 30811 25955 24504 25786 39138 40236 31008 22935 20040 20272 17681
17490 17681 28054 20399 -1712 -6793 1893 -933 -11126 -21278 -10319 612 12871 18620 17224
17477 17224 12486 5017 15436 9674 634 12459 16186 21246 21541 18197 6127 4266 4383 12786
17463 12786 23017 20883 14867 16110 23269 36361 41636 42398 42876 51896 46151 31343 33801 36621
17449 36621 39696 43455 68210 75882 83720 75920 64545 60407 51067 33732 27392 14412 10562
17436 10562 12235 9196 15443 12461 13843 15286 25980 18879 701 -2547 7362 15686 34019 46840
17422 46840 28080 12207 555 2315 16820 26609 22020 1505 0 57 2977 -7617 -11661
17409 -11661 2475 3114 -4961 -5403 -6206 -3256 5322 9546 9892 17965 13848 12750 14010 17259 20337
17394 20337 12781 16335 28363 43526 33228 23849 25988 13059 4059 10106 18388 14744 5621
17381 5621 4949 7329 10781 17977 10165 10890 22532 24736 20335 18552 30840 25050 16417 4559
17367 4559 5854 17571 14862 12334 10518 16553 23706 19546 11546 14158 19108 16892 21843 22713 16427
17352 16427 15385 6302 7538 15984 17700 14521 18895 10053 17088 6755 -8787 8598 11633 3557
17338 3557 -884 -1771 5003 14673 23824 17524 4380 -2850 -5545 7979 13779 12678 9376 -4302
17324 -4302 -5154 4766 10972 13944 15241 17466 19640 31617 29766 19387 13183 10408 8925 3256
17310 3256 9706 21987 25966 20703 6482 -1199 11994 8420 9354 13598 10264 15572 24592 10923
17296 10923 15388 17915 25813 25251 24632 17338 5474 -2396 -3429 779 -6221 1265 -272 9667 14980
17281 14980 10102 14888 15565 18098 19311 12590 9973 15347 18111 22816 12117 16115 22035 20933
17267 20933 21377 33499 33190 27132 26429 17330 12982 14189 10369 13077 17739 14332 19569 21486 16164
17252 16164 7902 16743 26529 19725 26220 20265 -4080 -20740 -7831 4039 5234 -1448 -19448
17239 -19448 -14804 -5786 4570 6374 7027 7197 -10083 -16907 -16482 -17676 -19003 -11228 -8568 -8174 -5891
17224 -5891 -9068 9458 11694 11476 15064 35102 34566 24447 13022 13341 20533 5926 -2613 -69
17210 -69 1058 -2585 -3370 -5350 -4035 -10586 -4265 2185 -11994 -9791 -5761 2151 6191 11185 26604
17195 26604 38927 36000 32257 28741 23269 13516 3393 -659 7841 15911 24102 37218 38153 10254
17181 10254 -11567 -15300 -16701 -3636 -3179 1481 10588 4344 11403 13064 7996 10976 14037 13970 7629
17166 7629 19388 29765 17212 11541 6057 -12641 -15621 -6018 4620 11596 10425 3748 -3178
17153 -3178 6079 -2911 -7685 -3530 -1452 14926 11938 40 7221 9690 7303 16249 21272 5401
17139 5401 -4476 -5638 11909 18706 35953 28431 30304 30407 15629 4733 3266 325 -4808 -10747
17125 -10747 -498 2717 19744 12589 -8266 -9097 2556 -1884 -11574 2615 4157 4427 6795 10549
17111 10549 73 3047 5218 2516 -12668 -25608 -15806 -2822 -3195 -20527 -27603 -15985 539
17098 539 3547 -7851 -8189 -9494 -6358 -4639 -3453 -13093 -26218 -19636 -3512 -5035 -2891 7597
17084 7597 14834 34865 37870 32215 27901 19661 19152 15336 16713 17487 16952 12186 -2475 -6812 -13480
17069 -13480 -12289 -7737 -2694 13468 17649 3923 -15675 -26745 -6101 12724 14782 8839 12992
17056 12992 20419 7115 10838 12931 12924 8681 5799 545 1722 -5426 -16399 4889 19269 13745
17042 13745 498 7649 9055 22144 46454 35621 22511 16559 11864 17627 12486 5787 15048
17029 15048 26806 17560 10885 16536 19715 20838 14107 4669 -5337 -16074 -15176 -2776 1562 4195
17015 4195 10553 10603 9069 10444 15522 17895 14051 7130 6181 14254 1599 -19388 -30908 -6052
17001 -6052 11863 4743 10883 15368 16541 16405 27411 21079 15135 24689 12833 -6367 -397 3004
16987 3004 10690 11957 -814 -13456 -6204 -3658 11923 10644 931 -13480 -13100 -4560 -8084 -19421
16973 -19421 -6402 7285 -1710 8140 14263 14608 17386 13771 13433 7766 -16115 -17213 -385 9536
16959 9536 5995 9833 6845 9192 5903 -1027 5196 -638 -11443 -20485 -10846 -2365 846 6548
16945 6548 15895 6809 7860 6332 2853 4744 16732 24197 12448 -3416 -8601 -2362 4300 18010
16931 18010 18953 9554 10752 18191 3756 -4981 -9893 -23381 -18275 -4400 12380 13732 6209 -428
16917 -428 8745 6489 -5513 -13670 -5935 5739 547 -9603 -11988 -8025 -2547 2323 3901 -948
16903 -948 -5020 7127 11169 10537 18299 13619 19730 32079 25274 12097 1852 16639 27674 15879
16889 15879 2119 -2767 -4875 -660 19918 17297 7454 9098 5623 10820 21380 24001 13818
16876 13818 18398 28919 19993 8611 -8396 -20202 -21639 4849 9834 -1427 -6798 -5884 -7246
16863 -7246 -1064 14357 22302 14802 6938 6930 1898 8332 -449 -6968 -6117 -15805 -16850 -4209 -7386
16848 -7386 -12268 -7096 4511 6240 15751 34700 45488 38527 11794 -1280 -230 -8773 -11929
16835 -11929 -8209 -12 -21121 -27147 -26301 -32801 -20894 -18757 -20097 -14628 -9634 5682 11497 12817
16821 12817 18668 4991 1850 -1673 -2537 17381 20818 7961 17414 16695 7959 2159 2718 7519
16807 7519 1747 -2837 -1762 -564 1335 8973 1012 1366 11666 22534 30012 25572 1850 -2824
16793 -2824 5109 4894 -4447 -15870 -12442 -2511 852 11224 7406 -7527 -6475 7565 18017 12551
16779 12551 -948 -2131 8054 9586 6594 10547 4096 4015 4824 1527 5770 5511 4493 -4119 -4745
16764 -4745 -7248 1932 13757 13824 8475 3903 1006 -3814 5620 18291 23754 22244 18052 3160
16750 3160 -5970 -2266 -7101 -667 9905 -110 2878 635 2986 1190 8379 7852 4347 7641
16736 7641 14747 5297 -1340 7222 23714 26324 18447 16675 6422 3161 8736 6709 10966 20136
16722 20136 14964 6990 -471 -12801 -18612 -10641 -1499 9262 19629 18173 15825 18880 7405
16709 7405 -943 3136 3422 -2994 5268 12573 9845 2109 9420 9073 369 -4030 4782 15247 24582
16694 24582 24645 19294 19353 8751 -956 1304 2349 -1709 2147 12219 18824 19371 7362 14288 18030
16679 18030 24497 35345 34693 24114 20242 13023 12210 6958 8457 6605 8191 14986 12374 218
16665 218 -475 2834 -9985 -30804 -23986 -15140 -11125 2476 13587 13097 13322 22190 10288 -7915
16651 -7915 -1241 -199 7724 -1045 -1182 -5479 268 7016 4205 10363 5297 -9174 -18435 -28498
16637 -28498 -18779 -17205 -16715 -10659 -14774 -2870 2961 8995 -1617 -859 -3998 -1364 8509 12129
16623 12129 11960 4866 -8237 -11060 -51 -1627 3073 18383 32619 15110 6595 -28 -10295
16610 -10295 -24823 -23999 -11340 253 -1777 -1803 -6572 -3868 -10406 -12970 -8303 -5898 -9387 8972
16596 8972 12030 2976 465 -2781 -6996 -625 4985 -4355 -5891 -2482 -3287 -8526 -4598 -8239 -12053
16581 -12053 -10207 -283 15391 18631 17682 17017 20015 12022 9130 3836 -12479 -8479 1359 7438
16567 7438 -6212 2350 25330 29781 24483 10569 4699 10393 9391 6095 6239 -1498 -15177 -15092
16553 -15092 -7079 -4026 11842 23003 4730 -183 9038 2012 -7578 -943 6094 14564 6128 -1854
16539 -1854 5244 -2680 -15491 -13650 -9326 -6874 3246 10116 3924 9774 6068 -4637 -12075 -22913
16525 -22913 -11849 -403 -11768 -19771 -15335 -9778 -10285 -5728 115 9254 -3421 -398 9079 18184
16511 18184 14457 -248 -2069 6940 6294 7581 8483 8697 6857 -1551 -3092 5282 -5714 3813 12903
16496 12903 12672 7041 2591 4344 4043 1327 8419 -812 -13497 -4441 8255 -2451 2407 3567
16482 3567 -1711 -9933 -24531 -34046 -26838 -24498 -12980 -5737 4424 8731 -12032 -23629 -20243
16469 -20243 -4997 2891 -3839 -1836 489 -4780 -5726 -8283 -10532 -1658 -786 -4739 -9793 -14062 -8813
16454 -8813 -8980 -15655 3342 23972 22100 11143 8468 2566 2124 434 3421 10131 4783 1556
16440 1556 6469 4639 7716 12901 5932 -971 3813 2509 7791 15077 -786 -10457 -1910 -1833 10531
16425 10531 9509 4875 2257 24282 21505 -542 -3583 4901 12280 13308 6214 9560 21193 25805
16411 25805 17984 27095 18097 6546 8259 17601 12961 9959 -6626 -20342 -9322 -6961 -8663
16398 -8663 -6103 -5367 1049 5881 19267 14741 8727 4779 -7597 -2357 5313 1615 12716 19927
16384 19927 24301 16143 14403 10799 10415 -2166 -10101 -15618 -17677 -9135 5854 6710 621 7590
16370 7590 5550 -6440 -18209 -30827 -35833 -11982 -5572 -13688 -18276 -29337 -34133 -22840 -6412
16357 -6412 1204 10158 16873 12015 -4122 -2628 -10643 -12494 -11997 -11888 -11420 -10994 188 10506 9182
16342 9182 -1445 1907 14741 9731 -7441 -14770 -5827 -8032 -3499 -5237 -2245 -1859 -223 6146
16328 6146 3823 -3257 -8944 -2835 5546 13194 1766 2875 15680 -1595 1702 15359 7644 -10270
16314 -10270 -11461 -13889 -13200 -381 4692 -3288 -2159 5573 -4053 -6242 -6409 -4822 -2058 6688 13369
16299 13369 13618 7325 218 -9205 2685 6689 8622 -8929 -28367 -19993 -9757 -6828 -9998 -3772
16285 -3772 -4344 -4673 6390 7584 3697 10127 10774 11368 14964 7131 -5981 3111 12689 18405 23162
16270 23162 8686 7626 10926 9589 -3204 -16341 -24467 -14834 -4647 -11382 -5965 3849 23440
16257 23440 6053 -5585 -5039 -5809 13775 14188 9220 5069 9750 342 -3604 417 -3140 -2533 -67
16242 -67 -452 -78 10170 7275 -9101 -88 8930 -178 -8142 -7387 -14008 -31181 -31353 -16773 -692
16227 -692 -8421 -20097 -21445 -5586 1930 -11991 -10203 2442 13028 14466 5754 -6181 -856
16214 -856 1698 4680 11310 -6950 -24332 -18079 82 8225 -5887 -7479 -10650 -16394 -16478 -1246
16200 -1246 -5583 -5476 -9017 -9766 -8150 -4258 4887 7998 -3425 -5257 -4144 3009 13011 11023 16192
16185 16192 17015 1905 -273 5768 6238 3501 4560 5887 21871 35911 40494 20592 7115 2964
16171 2964 3638 -1764 -9145 -2534 1411 -1768 310 -13334 -17484 5995 15984 14112 8553 14612
16157 14612 15926 22749 16628 17413 24037 15917 5127 -266 9072 13044 4912 -12708 -13046 -15365
16143 -15365 -209 1477 17148 26696 31833 24190 8671 2464 6115 9201 8990 9564 12111 14617
16129 14617 16597 15039 4777 57 -8697 -23674 -19053 -6232 -3011 2497 -5704 -17235 -18527
16116 -18527 -9039 -8982 -15721 -3005 5722 -7774 -22389 -9203 -2674 -5665 -17627 -20533 -8235
16103 -8235 8806 21565 12478 5099 906 -1490 -578 6871 1472 -5900 -7583 -1454 1157 1068 1404
16088 1404 9092 9702 -2999 3752 995 3793 16365 27680 30053 32056 26277 13036 -637 -2715
16074 -2715 -4958 6816 14619 14371 11896 -8133 -21180 -7099 -2117 7796 -4808 -14528 -27107
16061 -27107 -31540 -25722 -12195 2210 8631 8359 11117 5457 -4188 -7396 -21610 -21922 -6606 3355
16047 3355 17402 20418 12278 2704 -5945 -6551 -6255 -5391 -8731 -7782 -6190 3256 9255 12730 16834
16032 16834 24103 23509 19133 15059 4536 9455 1622 2476 519 -401 4478 8494 10604 8740 1616
16017 1616 7513 13858 2890 -554 759 1704 -7078 1791 12086 -6 -12695 -7852 9205 14969
16003 14969 16169 7351 3744 5448 4911 -8201 -3620 6859 5645 -12292 -16382 -9920 786 2743
15989 2743 9670 1550 -2044 -6545 4907 26152 22129 601 -5723 4004 7538 4336 6816 1896
15975 1896 3503 2984 1798 10470 10695 -1536 14156 14898 -1014 -289 -6581 -17576 -25329 -9751
15961 -9751 7403 2426 -4422 3519 21290 9940 1412 -12458 -16931 -10469 -18052 -20750 -28224 -25722
15947 -25722 -13393 -14314 -31177 -20975 -22774 -26849 -32346 -13465 3517 4987 18815 20179 14188
15934 14188 3508 -27315 -40440 -30626 -20040 -17809 -1251 -2501 -4419 -5975 7657 3184 -15434
15921 -15434 -26191 -18071 -8040 -11778 -11961 -15278 -1594 8065 20808 23469 14450 75 1620
15908 1620 5710 -7008 -15756 -13649 -4040 -7864 -8285 -157 4454 9685 -963 -10426 -14470 -3017
15894 -3017 -10039 -13351 -11459 -327 -3406 -8012 -11295 -9734 4967 13736 11957 -5590 -11832 -8937
15880 -8937 -2996 4035 8862 8715 8091 9841 -828 -11336 -18173 -14057 -2212 -1597 -13922 -14175 -11097
15865 -11097 -18871 -1276 4265 -2105 -5149 -8173 -5962 -2520 14463 16965 -338 -19770 -15730
15852 -15730 1704 16952 22175 9169 7165 -517 -3419 7746 4918 2338 -3025 -7604 -1205
15839 -1205 3878 8383 8238 14828 17437 5328 -9943 -9881 -14262 -2225 3647 -4521 -13549 -11493 -10065
15824 -10065 -12077 -11684 -20251 -29691 -26657 -20636 -6763 -12246 -17323 -5644 -2909 -384 -7609 -6022
15810 -6022 -5063 -1707 10325 24785 17354 7955 6943 4831 293 10298 24782 10914 -4767
15797 -4767 -7938 -12339 -2091 -1928 -6032 3181 12724 12385 2576 12482 18036 14575 5468 -7574 -18075
15782 -18075 -14469 -20558 -12502 7417 2899 -2902 7325 8974 14785 10452 11164 18972 20316 10218
15768 10218 -191 -6984 555 8484 16841 15264 11527 1538 1438 12403 11657 218 3289 6840
15754 6840 6102 -531 -6314 -17596 -16307 -2692 818 1528 -6705 -3672 -165 -11886 -18654 -11745
15740 -11745 -2223 -5778 -11773 -23179 -31628 -22482 -6677 -3707 -4831 -12913 -18032 -604 5583 2567
15726 2567 3876 2673 1658 -5907 -5834 1880 9129 -1853 -2456 -17021 -13775 5832 4069 4308 -1374
15711 -1374 -3779 12350 9366 565 -7887 5992 9564 3446 -2848 214 -6426 -7601 -2023 6739
15697 6739 -4226 -21711 -5253 6950 -1282 -9107 -6522 -17417 -24741 -20214 -14566 -13978 -21538 -18459
15683 -18459 -5445 -4663 -10414 -16545 -20185 -8883 12928 25318 22942 24696 12627 -14567 -11284
15670 -11284 8842 1018 -4075 -4450 5720 2596 -10062 -16046 -12286 1670 9232 1343 -8181 -5703
15656 -5703 233 174 9062 13983 5655 1677 -8465 -16159 -12309 -5703 -2740 -9256 -2455 -14016 -10584
15641 -10584 -23699 -10987 -5218 -2327 6881 4500 7950 -675 13846 9131 -2287 -8156 -15457
15628 -15457 -9353 -2894 -5776 211 4474 -5165 -6303 -15751 -16370 -9440 729 -997 -2658 1234
15614 1234 -8985 -14504 -24945 -28284 -25510 -12674 -3564 444 2283 2407 5040 7822 3614 -2475
15600 -2475 357 6327 1726 5745 8986 6738 -6321 -7994 3448 20276 15146 9573 5935 10396
15586 10396 6182 -825 -257 -7492 -21575 -28106 -31066 -27336 -22376 -13873 -12236 -1808 -9469 -4866
15572 -4866 -7699 -8372 -10543 -19463 -4009 5315 -2585 -17110 -31570 -18987 6654 7251 -5552 -111
15558 -111 7696 -3079 12142 14162 8098 -1231 -13698 -12226 -3107 -9010 -20831 -26398 -29097 -25140
15544 -25140 -16553 -9407 265 5472 -14291 -6547 -6953 -11395 -11633 -14389 -2156 -8956 -11026 363
15530 363 15243 19988 12472 18198 8909 3164 2913 -3360 -21785 -33098 -13292 -4425 -6382 -7717
15516 -7717 -19142 -20569 -12944 -3982 -9076 4613 3372 -2228 -10128 -19091 -18509 -9457 -11415 -15763
15502 -15763 -17799 -19576 -6427 11768 22121 7252 -15403 -8392 -4091 -15404 -17677 -10917 -9861
15489 -9861 -13838 -18073 -20409 -31414 -29009 -27502 -27295 -30021 -20049 -3649 219 3138 -5438 -4070
15475 -4070 -4141 -11078 1300 3951 -2787 2838 -115 -2089 -15941 -11818 -7157 -773 -3349 -4612 -2282
15460 -2282 466 2301 2177 11761 8755 9033 10963 -6839 -4935 -19240 -19403 -1336 9283 6677
15446 6677 7571 3092 -4597 -18119 -9869 1042 -1382 -4752 -814 5369 -1255 -727 22410 26646
15432 26646 1192 -20797 -19079 403 -8005 -18685 -10774 -10019 -11335 -14719 -232 687 -815 17404
15418 17404 24307 13415 12703 11315 23211 11413 2984 5346 5232 3961 12636 7008 -15902 -16434
15404 -16434 -12346 -14725 -9711 1002 -13860 -23772 -16395 -8542 -10729 -5245 13069 4473 2434 7332
15390 7332 13602 15774 9332 -11897 -14791 -27996 -27395 -20262 -9136 -3256 -5455 -4544 -19567 -16867
15376 -16867 -24113 2105 12052 -7195 -1337 1790 -3185 7273 17514 7993 10963 -5826 -18257
15363 -18257 -19832 -25273 -24890 -25728 -23393 -11348 -5214 -5943 2825 4757 -543 -8529 -9478 -9455 -7473 -10789
15347 -10789 -9138 529 -10865 -23348 -19068 -21120 -22928 -28066 -37022 -24025 -10266 811 -1054
15334 -1054 1088 514 2852 -753 -3672 7120 448 -8734 10585 15665 8892 -4376 -6799 -5415
15320 -5415 -9945 -9660 -13002 -17972 -16327 -13892 -10244 -14917 -20620 -31210 -33228 -19181 -12047 964
15306 964 5553 8108 2466 2068 9853 5385 -3134 -6517 -2311 4642 -1931 -1401 -15931 -15001 -20089
15291 -20089 -19227 -12537 -4723 1248 5546 -3705 -7755 -9336 -4106 -3437 1007 3244 -3872 -14814 -9634
15276 -9634 3101 4584 -5588 5499 7635 3895 -2258 -12003 -9175 3096 13505 14664 10132
15263 10132 10858 22 -1434 -4101 -6014 -6311 1597 9233 14607 13317 13171 2529 -8787 -13457
15249 -13457 -12930 -6850 -3618 -6204 2599 22626 35850 32560 26066 18795 6791 21797 18099 13095
15235 13095 11057 6764 10073 7017 -1322 243 10661 761 -11955 -18875 -22762 -14562 -14449 -9387
15221 -9387 -163 -13391 -20626 -20871 -4026 -6443 -5346 -13522 -12162 -8155 -2419 10353 2367 -18758
15207 -18758 -27202 -18598 -14071 -1612 9745 18310 9922 14187 19777 18560 18079 14473 -7006 -805
15193 -805 -2109 -9206 10771 21586 1990 5448 7880 -2992 -434 4201 175 -6506 -20307 -15095
15179 -15095 -5502 48 16362 24450 29410 25208 -454 -14900 -6751 -4764 -11708 -5684 -14318 -23142
15165 -23142 7104 18051 6569 -2229 7581 19787 21307 6894 1614 -7637 -18921 -19481 -13572
15152 -13572 10000 31651 30730 23500 16705 1805 -10725 -337 300 -5479 -2861 -7004 -12262 -3683
15138 -3683 -1443 2799 5680 3356 -2066 -19302 -3291 4855 8782 3131 1127 569 12040 4995
15124 4995 1712 -2007 5672 -1050 1378 11335 20730 2221 -7274 -7076 -8327 138 12141 19025
15110 19025 26678 25467 3838 -6784 -8459 -1257 -3044 -4917 9685 20692 9390 -8360 -20974
15097 -20974 -8541 2770 8473 9859 5033 -9212 -11701 -598 9866 21349 39300 33042 26242
15084 26242 -1755 -14549 -2670 14690 21165 26276 21717 13072 -1054 -3103 599 -13997 -6812
15071 -6812 20804 16315 -356 -2788 -10651 -21954 -15366 -4756 313 2882 -4859 -6337 -8863 -16326
15057 -16326 -11329 6210 24561 13721 5409 6177 17730 16293 12665 1956 5184 -3793 -3705 -3012
15043 -3012 4347 3198 -10111 -5206 4256 8782 9066 10643 -130 -16481 -1358 6030 464 -4693
15029 -4693 -1772 -17100 -6335 10897 178 -21067 -29178 -18506 -10754 -2761 -9543 -9679 -12094
15016 -12094 -3564 2191 -11470 -20663 -10649 3400 -1263 -9633 3094 15290 15806 5933 4800
15003 4800 -12732 -21562 -12407 2915 2935 147 -23 7343 4617 -8645 -3763 -13915 -19915 -30106
14989 -30106 -30690 -8229 -5861 -6688 -4381 -9666 -12098 -6829 -7725 -2656 -732 -7001 -16436 -18478 -8179
14974 -8179 -2057 -12622 -22067 -17815 -3101 8912 7501 1913 1813 3809 -3298 -1128 565 -1370
14960 -1370 -10336 -12052 -14286 -24624 -12834 -4876 -21132 -28139 -18434 -16536 -16114 -9968 -5279 -13624
14946 -13624 -17781 -3593 1372 -6086 -15448 -11379 -3047 -6726 -11707 -3074 -9670 -4896 -4398 -11887
14932 -11887 -15351 -18010 -19162 -27083 -15702 -12011 -7386 2622 6479 15038 18344 4225 -3892 -21227
14918 -21227 -37294 -25385 -7722 2031 -5189 -22981 -23577 -17504 -28574 -19242 -10468 -10991 -17837 -17307
14904 -17307 -12033 -12992 -22108 -20483 -6343 12061 20098 12850 10353 1000 -5627 -4645 -5228 943 1659
14889 1659 -380 -4867 -3147 -3738 -4152 17 -5314 5955 13140 7743 6929 11741 8167 -665 -3075
14874 -3075 -3966 -8550 -10364 -967 -792 5537 3025 -6076 -13988 1119 -4714 -5408 -3799 -3532 -1085
14859 -1085 1307 -14194 -15278 -19996 -18825 -11784 -18121 -14009 -917 10148 14106 9314 -183 733
14845 733 -1155 -2098 -4898 -9934 -14877 -13389 -15593 -26396 -20384 -17717 -22387 -298 17281 5685
14831 5685 -7273 -2967 9164 -1912 -18140 -26528 -25181 -9627 -8616 -10072 -18480 -12465 -12897 -19813
14817 -19813 -15112 -14174 -18758 -15565 -14481 -19158 -392 11182 -2729 -16117 -11311 3032 5356
14804 5356 -1507 -14737 -23908 -18499 -29207 -32440 -25506 -19234 -11354 -9115 -2355 -3853 -13612 -8201
14790 -8201 -3230 -7895 -7969 -7255 -5179 -10646 -952 7500 3793 -4424 -6301 -11268 -9496 -18498 -33905
14775 -33905 -32995 -18139 -7825 -9374 -6528 -11612 -15474 -4601 1090 -4328 3034 2934 -1265 3391
14761 3391 9521 15517 12406 -302 -11876 -17723 -14520 -7480 5073 21228 10790 5707 -2812
14748 -2812 -18041 -14123 -19364 -19267 -8754 -16373 -17563 -22561 -19858 -16309 -24952 -23573 -20081 -20593 -7541
14733 -7541 7345 11183 1691 -882 -360 2533 -3296 -3804 -6522 -14067 -10657 7029 1836 2133 7648
14718 7648 5189 -9506 -21787 -26974 -24639 -28871 -37455 -31457 -24239 -29376 -30337 -18366 -8419 -21377
14704 -21377 -16709 -13051 -12342 -10616 -20528 -12870 -7535 -4735 871 -12110 -11551 -9685 -9670 874 4121
14689 4121 -8672 -9719 -9855 -2780 -8077 -9918 -1062 -8435 -17296 -19783 -2364 19612 7456 -8329
14675 -8329 2491 -5301 2081 17431 11987 15574 5244 -31789 -32899 -17611 -9856 15705 32610
14662 32610 36002 19585 4189 -2495 8361 22490 31676 33276 18765 5378 -3998 -3704 -3913
14649 -3913 4843 16025 8145 9601 2516 -9380 -15894 -55 4779 -9663 -9291 -17061 -30442 -27696
14635 -27696 -17736 -2816 -61 -5014 -14340 -14132 -18078 -14734 1589 6639 120 -951 -8425 -5362
14621 -5362 -5933 -12015 -18585 -17993 -18818 -18065 -17767 -24567 -21689 5611 3948 -488 1341 -12388 -15105
14606 -15105 -13321 -13337 -905 10545 5880 3864 -407 5242 -2388 -12262 -4608 1522 1974 806 -1787
14591 -1787 2988 1191 -903 3099 841 -3217 -9314 -18651 -20450 -9581 -6934 -5298 785 8553
14577 8553 14047 22141 25898 34755 37611 30775 11892 1859 -1252 -6398 -3579 3749 -9163 -3053
14563 -3053 9945 6474 -4600 -14271 -13647 -1428 7656 4546 4327 6748 3860 5332 15874 19503
14549 19503 9595 23837 28713 26861 23580 13269 13653 -5116 -10574 -12224 -12840 -6591 -2114 -3372
14535 -3372 77 -11444 -13350 -12312 -25451 -24920 -12608 -11211 -7503 -11676 -10864 -12677 -12491 -5065 1955
14520 1955 20840 14685 607 5440 4524 6032 22027 11865 5658 3031 -10117 -11750 -13699 -15358
14506 -15358 -26396 -32009 -20749 -10204 -6898 -6648 -440 6167 1364 958 -3020 841 306 -6850
14492 -6850 -6722 -4190 -9858 -8061 -15030 -15899 -15381 -5935 -6604 -22988 -30569 -19053 -8468 -13011 -16545
14477 -16545 -1893 3388 5774 15264 6465 -5242 6119 10606 -3677 -6133 -462 -392 -19151 -13803
14463 -13803 -4092 -996 -8950 -17125 -5889 -8285 -16797 -18328 -26533 -19025 -11761 -6191 -3958 1632
14449 1632 13567 7478 2092 -4835 -16921 -17553 -9398 -21580 -11219 -13292 -30791 -36713 -33683 -19747
14435 -19747 -11052 -996 17771 16178 8887 17167 13129 1110 6899 -1460 -12282 -9697 636
14422 636 6971 10743 22456 14398 446 -17276 -19969 -16014 -4032 1682 4756 10515 -1412 -24337
14408 -24337 -26236 -19441 -20838 -14622 -8473 -2766 -12180 -7985 -916 1366 2358 -1349 -1249 -2968 3215
14393 3215 875 4536 5020 -383 -10898 -2395 -3132 1 -6536 4171 16998 17771 13320 2711
14379 2711 2573 -1115 -14475 -15174 -8624 3320 16580 20349 22984 15537 3504 -2206 -5214 -15401
14365 -15401 -4922 15120 14320 4904 -5260 -11694 1488 10513 3441 220 -323 -1586 -8540 -21737
14351 -21737 -25769 -16459 -10876 -14278 -24951 -21256 -7517 1205 1701 8392 9592 -10027 -23525 -5430
14337 -5430 2784 1467 10657 16937 14078 11553 5073 2603 4018 5404 6368 -4291 -8745 -13897 -5331
14322 -5331 8576 932 3230 -3878 -15108 -11204 2356 -9 -8315 2513 8516 -7422 -19043
14309 -19043 -7201 9397 -276 -19965 -20681 -27009 -29332 -17585 -17201 -22203 -18960 -2785 13049
14296 13049 2633 -13113 -19491 -26927 -29408 -35377 -37309 -21731 -20657 -15674 -4324 9823 581
14283 581 -7833 7819 9079 10756 7754 5675 5402 10286 4068 -7564 -23348 -28428 -15924 -11289
14269 -11289 -8681 -21460 -24845 -14557 -1426 -9643 -27364 -25061 -16393 -8123 1031 -11164 -4422
14256 -4422 -9238 -19568 -3000 13982 7880 5385 6576 13679 15467 5309 -18149 -19409 -11225
14243 -11225 -10947 -12576 -24803 -16221 -2580 -9595 -18750 -31341 -29084 -16656 -15228 -20512 -3889
14230 -3889 -1973 2073 12576 6264 -1784 -11995 -4377 353 9829 11865 6875 3184 590 -1289
14216 -1289 4874 3298 8344 16725 16961 88 -1747 -10930 -9533 -3463 225 -5777 -10063 -4423 -5234
14201 -5234 2155 5771 2661 -939 -8520 -1826 9182 1786 -8756 -24977 -11046 -48 9634
14188 9634 6351 -8046 -11022 -6870 -2862 -25530 -37119 -25856 -25135 -32600 -23443 -7946 3203
14175 3203 -9377 -8621 -155 8258 -2567 -11503 -13523 -6265 864 -7051 -21076 -23661 -11124 -11318
14161 -11318 -28500 -24387 -17161 -22829 -33967 -31330 -12443 -12400 -15425 -13721 -1448 5290 5554 7441
14147 7441 15169 16195 7172 -453 -9774 -7178 -7637 -5324 -5010 -1308 -11339 -12615 -2593 14184
14133 14184 25888 14868 13534 8852 11507 12742 17603 -1228 -10811 -18597 -9102 -8505 -8221 5596
14119 5596 9433 2185 -4047 -6252 -7646 -11228 -19747 -17375 -1933 3328 18171 20176 10360 -1922
14105 -1922 -6212 -9248 -15017 -10573 387 -2173 -3966 -7078 -5043 3688 18486 18761 21744 24228
14091 24228 27136 12037 11563 8146 4730 12882 14739 4243 -5122 -17417 -28491 -29724 -22396 3798
14077 3798 16124 19159 19872 12611 6208 -6733 -3034 5099 9499 2000 -13889 -20981 -20837 -33983
14063 -33983 -28799 -22057 -18299 -9210 -13799 -5217 9720 16355 15910 14975 18625 14938 13050 7238 -9754
14048 -9754 -18971 -22207 -18293 -16447 -16133 -7314 -6212 -5107 -5183 3936 10525 16008 10998 -1776 -1629
14033 -1629 -8511 -6807 -2934 6832 -2765 -8020 -13129 -2831 5395 11613 -5517 -19308 -16701 -12467
14019 -12467 -7165 -2047 -14567 -16542 -15276 -5016 -3550 -4907 -1624 1838 5381 -955 -8718 -2400
14005 -2400 18015 9451 5583 12943 5771 16887 14760 -3394 -16849 -19831 -20195 -23931 -22345 -14054
13991 -14054 -8032 -6643 -13877 -32429 -35760 -21983 -11728 -3892 -2662 -11463 -12585 -18940 -19745 -6642
13977 -6642 -4440 -6337 -4165 -12594 -14814 -11747 -12735 -20063 -14689 -1151 -4687 405 1388 -5046 -7111
13962 -7111 -9254 -11078 2340 22660 29169 16422 19442 11485 4491 10789 13477 6866 -6559 -7746
13948 -7746 -12728 -3654 706 5678 10061 12813 230 5618 10472 14069 13031 11362 1384 -9619
13934 -9619 -9033 -4550 4820 5847 8998 3111 -69 16906 22604 6365 -8533 -7791 -4158 10806
13920 10806 6956 -3018 1337 8719 1260 -10534 -7062 -16340 -18588 630 4339 2328 -2139 -12278
13906 -12278 -17783 -11648 -12250 -3951 -12576 -14151 -11237 2686 -2534 -10191 -2355 -3781 -4857 -11832
13892 -11832 -17446 -12284 -13594 -1671 12203 16483 23312 6822 -7404 -12239 -19590 -5508 2959
13879 2959 -1701 -6736 9298 21296 20068 11186 21192 23593 33461 28115 5952 -7688 14895
13866 14895 15060 1340 -11234 8209 1945 -12285 -13175 -11338 -3412 -7293 -12678 -24618 -21428 -1771
13852 -1771 6091 18463 16657 13828 28400 19533 3416 -2695 9058 13811 18605 21962 5342
13839 5342 -732 -11562 -30690 -36700 -12796 -4002 -2252 -8677 -12288 -22181 -24936 -12961 -7594 9087
13825 9087 15814 16836 8210 4439 13846 14913 10711 4776 6427 12327 7759 6352 2353 -929 -4606
13810 -4606 -11130 -5390 4207 -2476 -3741 -2035 -9517 1845 -5841 -4183 11446 16698 21342 18136
13796 18136 7170 4602 19887 14164 16444 12432 16778 12886 16134 -2183 -16592 -19138 -18271 -13910
13782 -13910 -6552 -1816 -5690 6324 4704 17276 11569 -5406 -24174 -32339 -16868 2409 1048
13769 1048 9296 15943 15122 5307 -4076 -7370 -8483 -7322 575 13942 18801 626 -9200 -11780
13755 -11780 10224 15594 9109 -1967 -5867 -16580 -34235 -28998 -20009 -12055 -16314 -33765 -27990
13742 -27990 -26120 -27067 -27051 -19745 -25771 -41626 -27213 -22387 -7882 7185 10408 -1560 -10974 -5159
13728 -5159 -8 -5737 -9027 -18662 -10887 -6789 -5489 1213 2878 -2644 -3223 -7896 -2235 -9487 -15301
13713 -15301 -14399 -7560 -10514 -10072 -5221 -4699 -10728 -6560 5583 -584 4125 16759 17203 -1124 -9849
13698 -9849 -15449 -15604 -16870 -17483 -3782 13912 12415 -2436 721 -2087 -14083 -14434 -19345 -18435 1510
13683 1510 -303 -9137 -13834 -15909 -10640 -15115 -27513 -25292 -10914 -8947 -12014 -15119 -2824 6370
13669 6370 24491 18622 -1792 1330 4412 6257 12958 8115 18838 21551 17088 18484 16216 950
13655 950 -16341 -11154 -4452 -15051 -19245 -6991 14112 16575 7716 4662 13181 20896 14630 -580
13641 -580 -12408 -13333 -21978 -28718 -34462 -34919 -29421 -12856 9448 17747 9227 16204 23494 17679 22271
13626 22271 4968 -16821 -15950 -7399 -16463 -22485 -19457 -13394 5898 23445 13679 5280 -363 2406
13612 2406 -5753 -8103 -8917 3285 3843 -6265 -5326 -1547 2394 -5622 -10255 -17029 -14820 -9183 2570
13597 2570 -217 1425 2301 -7064 -10458 -5876 -8041 -203 5958 -1682 -19772 -11712 -11643 -6438 -7712
13582 -7712 1730 -1723 -12296 -18535 -167 12158 6936 6115 -21 -6379 -14661 -5182 10003 15602
13568 15602 11193 3501 -2660 3377 -6262 -17840 -19501 -17904 -11214 -8701 -9605 -2457 -1172 -10619
13554 -10619 -21310 -26342 -17542 -11621 -2148 -7320 -34995 -44476 -22237 -7337 -10593 -9114 649
13541 649 -2583 -15306 -16670 -18235 -5603 3385 -1505 -13041 -7926 -3438 -6330 -3273 757 -5978
13527 -5978 -17248 -4884 3229 3209 -8221 -10324 -14877 -17451 -22938 -26278 -16885 -16914 -3517 -674 -7654
13512 -7654 -15489 -19080 -17029 -195 -1852 -8571 -14941 4734 17463 14253 18565 12797 -5865 -14027
13498 -14027 -4649 -2319 401 -1344 7870 12466 2618 -7918 1493 -4348 -23634 -21107 -18634 -9910
13484 -9910 4495 -5775 -13299 -29053 -27004 -22226 -12583 -10783 -14836 -10775 4046 29495 31387
13471 31387 13271 9158 23157 32425 42000 29848 27342 30905 22348 14159 -1509 -9379 -1488
13458 -1488 6117 10244 -270 -409 1396 1988 2650 2323 -1177 -6506 -280 6852 -1493 -16008 -22455
13443 -22455 -17382 -1363 18044 22095 6555 -6360 -10090 -12160 -15494 -21360 -21666 -16594 -4672
13430 -4672 2962 10225 14834 8386 -1678 -11536 -2395 7192 -11493 -21123 -19903 1969 27765 14501
13416 14501 3791 7197 -4956 -9320 -8325 -2196 6208 17458 24478 9057 6175 6902 13114 13827
13402 13827 13124 5577 17524 14015 424 4369 -4897 -15847 -25255 -22847 -15634 -10698 -11853 -26187
13388 -26187 -31834 -19306 -3015 9020 -5043 -9767 -5757 -6575 -11638 1150 21096 21904 6650
13375 6650 -7847 -11541 -4442 -15878 -26495 -27265 -9364 64 -5317 1103 2556 16379 22904 19730
13361 19730 23637 17334 -960 -14626 -7131 -1014 -4054 3502 10385 1690 -4030 1323 -11656 -21520
13347 -21520 -30230 -16702 10793 10812 -8704 -13963 -23699 -34960 -23472 -20016 -5536 5795 4008
13334 4008 5170 16245 1853 4246 7433 1017 3211 11989 13991 7779 2097 -10508 -21086 -7271
13320 -7271 -3376 -2142 2987 -2165 -302 3219 -8919 -16213 -15191 -1779 -9604 -20234 -3063 2648
13306 2648 5889 15848 6653 -13538 -7152 -520 6651 9509 -1266 -3571 419 -1975 -797 -10462
13292 -10462 -9600 -8245 -13225 3256 12208 7307 -5652 -1173 -970 -9828 1479 11990 24147 31192
13278 31192 22139 10614 14617 6601 1220 6130 5098 23590 15124 17355 18493 30266 28335 30206
13264 30206 23492 4290 -3325 -18943 -19384 3548 15415 12447 13399 15633 7444 -1175 -7477 -11052
13250 -11052 -12364 -4392 -3459 -24112 -29748 -25649 -21503 -20046 -8640 4631 -1075 -5758 3981 12695
13236 12695 18567 18446 5538 -10217 -16834 -8707 -5541 -18536 -10800 2749 -2793 -14375 -5023
13223 -5023 -1350 -5035 -10498 -8993 -982 -14389 -25746 -14055 5853 27241 30842 28130 17087
13210 17087 11752 -2461 -11522 -3112 -6677 -5435 10126 3645 -6380 -7 11594 -5475 -14714
13197 -14714 -22482 -25188 -21953 -18228 -10477 12551 20318 12695 9335 14675 20224 12164 3059 -684
13183 -684 11413 12260 10446 7141 -401 -11070 -2931 185 -9174 -6778 4749 4984 2156 -9289
13169 -9289 -2331 -1938 -1690 4825 230 3785 -6826 -18277 -5517 8311 2876 -8132 -10197 -4511
13155 -4511 8719 14852 34783 20119 27993 20596 17786 10178 10425 19960 16525 10355 7658 13836
13141 13836 29421 31402 35029 17852 -7716 -3920 1714 2801 3029 -2491 8852 3294 3305 6477
13127 6477 7816 1003 5007 247 4873 15445 17365 9754 -1171 10115 -9205 -33765 -36612
13114 -36612 -28482 -12187 8874 15196 11821 13265 19630 14862 2538 -16478 -10137 13848 23233
13101 23233 32445 38608 26424 13828 14361 21103 25866 32904 34195 27253 15824 11542 18173 20175
13087 20175 2311 -13318 -10112 -1746 2760 5912 4979 14085 11857 -1048 -250 2410 9109 6928
13073 6928 10884 18964 12622 20150 40258 46557 28155 17205 21503 17587 7590 8640 13235 -6101
13059 -6101 86 -2428 4539 9038 10407 4185 -6148 -8793 4105 7704 -71 1378 2180 6758
13045 6758 7441 11075 11309 7686 -2824 8720 15701 5216 5994 4367 11474 19839 12439 5463 18265
13030 18265 15036 14452 13406 9605 12125 13982 13421 10437 9830 1878 -8048 5675 634 -1626 19965
13015 19965 24932 4313 -5514 -12117 -2932 7155 11551 13158 18251 22858 20668 6652 12408 12062
13001 12062 17006 17980 19187 21679 17099 1485 682 15732 14178 11272 7830 16402 29050 26823
12987 26823 20371 13278 18610 20089 18054 13519 10391 17421 12605 8018 11513 15631 10307 10076 5798
12972 5798 -1661 -8209 -4203 -1404 276 84 8884 5159 -10922 -19958 -10630 -11228 -19852 -14942 -2785
12957 -2785 9712 9566 4025 5603 11931 7581 6217 10664 21212 16006 11710 11856 12791 15436 5951
12942 5951 8611 21912 20080 21948 21989 18646 18827 21695 13730 8300 6850 621 1183 5074 673
12927 673 12832 13647 4113 -7057 6207 12710 9231 4945 12842 12284 -6015 3334 10905 17037
12913 17037 11983 8815 14273 12559 -11576 -16584 -20446 -19196 -12398 -2689 7883 5379 -4324 -1458
12899 -1458 3438 18752 16912 26135 38481 34620 27409 15809 3996 2177 22170 22497 18796 21395
12885 21395 22972 21415 13422 763 -10678 -21526 -5452 13972 21467 16587 12144 22692 32502
12872 32502 40477 34908 26484 22350 19075 21659 6695 7364 14837 6528 -11375 -19148 -9863 1707
12858 1707 2136 -73 -3220 -6719 4572 12533 2283 -2823 -8947 -16769 -14118 -14783 -15507 -17270 -9889
12843 -9889 -9873 -3284 -5390 -2731 -10413 -3676 -1219 7064 9106 15519 10130 15381 15691 2060 9150
12828 9150 25580 21367 5881 -3593 -3485 -7045 -5265 -1962 589 9481 15702 14624 16304 22288
12814 22288 28027 22673 14292 8684 20870 39077 33954 13744 20036 21974 34892 41972 21415
12801 21415 14714 11054 14610 14721 1031 9009 8718 8376 8370 9488 11330 13885 11979 16157 11063 -1158
12785 -1158 105 6470 -272 4473 -3695 4863 646 15274 25359 28750 21461 18671 32126 31863
12771 31863 21483 29691 38436 35219 29167 23040 12094 11967 13702 12218 23812 21304 11591 4962
12757 4962 7610 10929 13387 6982 1687 4695 5898 1938 914 -5174 -720 1232 5509 -6878
12743 -6878 -15012 4149 18928 23384 7127 5863 13043 21626 14467 -5364 4655 33164 40553
12730 40553 37528 36813 32161 25587 17870 13905 13045 9924 8621 11586 16043 18759 25457 21730 21495
12715 21495 11672 3737 1445 5637 18626 24535 15408 12565 13026 29525 41629 25309 14496
12702 14496 11569 12897 11703 9276 11267 6566 2495 -6078 -1104 -2310 6657 23137 18709 21776
12688 21776 16988 20823 20045 17794 25622 22293 14839 14455 23053 15730 15920 10279 -6577 -10908 272
12673 272 1917 -2406 -10521 -15852 -10605 -2262 260 -1998 -10961 -4398 1725 3865 -6620 -7358 3430
12658 3430 8954 9347 9841 -1835 -13272 -4489 4850 -4047 569 9989 16205 11758 9329 18780 27090
12643 27090 10119 8300 14987 11102 -5158 395 11425 17485 261 12315 24228 30899 36361
12630 36361 41168 35370 35937 49736 39835 22834 20660 17970 2368 263 14542 18556 22447 10427
12616 10427 10755 19614 14034 -2261 -12123 -10256 -5693 -13733 -1606 11307 18696 24995 21842 21526
12602 21526 14485 16149 16005 20627 18728 22637 14914 -3822 -7194 -2247 -12272 -11033 3819 2002
12588 2002 3879 8416 1298 2939 1904 2878 16260 30486 41803 34237 38228 18919 13866 12896
12574 12896 11778 11614 11 -146 19674 20022 23363 15410 2914 11607 18245 12401 9679 -1247
12560 -1247 9201 12171 15402 9858 13044 5802 9173 20223 21706 17203 21694 24609 23185 19786
12546 19786 14677 17039 20854 31240 34221 26567 17693 6717 3915 11717 21533 16045 20634 37974
12532 37974 42235 35052 23693 31673 25990 18071 6205 9443 20676 22711 9381 12682 31261
12519 31261 37343 20955 19761 19143 4773 1677 -4987 -1060 4302 3516 5735 6917 -809 4536
12505 4536 34493 51966 56703 49450 32825 11605 -774 -7134 -7728 13648 11544 5273 18823
12492 18823 37373 31845 35972 38003 24325 6513 24670 35589 25103 16767 12093 13979 15676
12479 15676 23122 16502 7451 -1232 -95 8933 22007 27128 16475 14168 29095 12131 6582
12466 6582 7525 15220 23785 20167 26182 11847 -3952 8916 12580 10838 2338 9985 20789 41073
12452 41073 36676 28213 34948 27675 33959 43529 43648 41842 35223 41463 44414 28497 19769 23936
12438 23936 33465 40203 26654 32407 39330 32902 31388 27827 19455 9638 10713 17306 21286 27634
12424 27634 14177 20119 26808 23601 21721 22629 21133 12076 13440 15257 14431 15741 23249 27952 19919
12409 19919 19905 19712 27571 31877 26884 26507 28644 32928 20892 8183 17640 24500 20270 16898 33447
12394 33447 37953 24828 2995 -173 4521 17250 23388 20277 25742 26786 22956 27878 36894 30580
12380 30580 23908 12257 19570 35541 49177 43571 26493 13907 5384 21588 29982 27498 21494
12367 21494 14695 25636 39932 26675 8835 26755 29141 3423 9121 21215 11509 17221 15459
12354 15459 14805 33383 36506 16633 14534 19949 19638 17121 19094 16164 15612 20160 22987 25664 17153
12339 17153 14771 9917 17221 17497 16732 12740 13847 10032 -1932 10067 16244 11511 1678 9089
12325 9089 12057 12630 17407 19895 27401 21644 7643 -7501 -11823 -3761 4521 4104 -702 2736 18766
12310 18766 31535 29137 25544 11606 15836 19900 29826 34436 27002 15367 8491 7397 3214 3532
12296 3532 -538 -11250 -7085 2402 14435 28955 35365 41225 46795 37465 28128 20167 6422 6745
12282 6745 13899 18561 11186 23264 25185 20848 15751 17880 31543 43757 35002 34809 49150 47730
12268 47730 39121 42465 31547 11737 5454 5797 12404 24026 39459 44329 31551 32007 40747 52946
12254 52946 47569 41787 53015 44724 42629 35615 28158 28108 26807 24319 20411 18658 28741 28805 25787
12239 25787 18618 22427 15957 848 4703 16817 20499 22173 19242 3895 31908 54424 36741
12226 36741 26950 32740 29906 17003 17088 15162 18730 24058 27813 23960 12029 8171 20504 33641
12212 33641 44735 43805 35517 22271 32367 40713 39741 33784 19051 15791 19345 16879 28657 22384
12198 22384 31862 33360 20976 30649 44183 33711 31028 26730 21502 15013 13248 15338 19604 24061
12184 24061 28477 31300 22051 10576 11630 24885 26559 36597 37543 23998 12384 10681 10191 14874
12170 14874 18298 26989 36491 24957 21377 19494 19396 22275 30324 26996 35556 34261 32975 32986 29298
12155 29298 23927 23124 27833 36555 38645 38384 38147 32491 23426 33610 59235 60516 48508 41476
12141 41476 40358 52307 46643 35421 14836 16765 29796 35108 42908 41840 33142 36521 40072
12128 40072 32427 41947 44370 46152 65315 77343 60740 36739 24283 32440 40290 34483 30131
12115 30131 33079 25364 36629 17142 10107 8973 14214 10925 19496 12032 17026 33846 43465 36126
12101 36126 35990 38256 35259 36758 35055 24616 28740 43131 40149 38706 48782 34792 19439
12088 19439 26219 39074 38167 40898 48761 56755 45516 38362 47430 46454 39859 46098 39440 38852 31968
12073 31968 40046 55330 46129 48554 52302 45139 38077 35347 46914 48998 24108 7775 17582
12060 17582 35823 49427 51026 36536 26755 21723 23621 28734 32820 44375 46359 45206 38428
12047 38428 33844 39543 38904 34648 19238 15606 31719 51225 56633 48016 52179 50428 41258 46045
12033 46045 59403 55955 37844 44986 48421 46891 45279 33240 24322 38463 53418 61519 52987
12020 52987 42367 42244 46900 43865 48999 54515 61279 59209 49649 39228 44845 43892 43175 49944 49030
12005 49030 50184 43276 35646 52723 61714 53239 46951 48146 43517 38228 28335 23543 20649 20180
11991 20180 32054 39657 39679 27511 33894 41041 55551 56932 49555 47102 34952 39245 32265 37018
11977 37018 36959 29807 43894 63661 51758 56274 48729 49224 48339 46295 39379 32845 46566 55145
11963 55145 66568 71129 56526 56553 50145 46191 46618 54768 67933 71463 68783 61192 66673 60461
11949 60461 73173 85769 78478 50672 54101 81173 78087 78429 76870 73619 65556 55122 64141
11936 64141 60864 57269 65078 66147 70822 70270 54239 60120 63381 65625 72650 56826 41110 34969
11922 34969 49413 60094 64006 55055 44127 48990 56506 57607 52363 61065 73347 70897 72545
11909 72545 75985 74490 69176 58376 54319 52870 53482 63864 64546 63998 73732 72760 62818 52380 51479
11894 51479 66257 70245 64132 66429 66924 69046 58757 49544 57959 58573 57938 64024 68915 78378 86978
11879 86978 84219 67932 48827 49234 59031 77459 86504 81572 74354 66960 78594 83175 80040 82887
11865 82887 88843 80187 71878 77772 81775 81300 74061 79284 97190 97541 88665 103211 111833 110850 107426
11850 107426 101962 95626 87749 87842 78332 67147 67776 73845 69675 72621 78544 101491 112246 97714
11836 97714 82146 80113 77718 84257 95186 97797 100386 103555 101173 90235 91009 85751 81067 88805
11822 88805 91557 93127 98580 101606 94987 72710 47476 54351 58669 68861 68126 68004 62181 72947
11808 72947 70388 54444 59451 71059 73445 76216 83963 95794 86712 80318 89761 95804 90476 92612
11794 92612 87958 80099 73886 71770 69057 77870 90682 82455 78280 85592 92655 103609 102419 101453
11780 101453 103838 111995 120495 113514 112494 114895 114868 105350 101738 101068 108937 102985 96892 95836 101805
11765 101805 100640 79417 78794 83841 87368 74086 84968 82822 84788 86507 83316 85446 92471 91040
11751 91040 86298 91677 115102 128359 121780 121863 126600 133690 125250 110544 102095 98884 108064 111557
11737 111557 105243 103549 102239 103353 103879 101009 102875 111381 111536 118962 132461 121534 106778 99294
11723 99294 104838 107103 109121 108890 111001 96888 87339 95383 98469 95711 105158 113537 106131 97268
11709 97268 93899 101062 91690 72431 57201 60075 75619 87506 85619 96452 111878 103166 83622
11696 83622 94612 102039 92329 72395 81153 90402 96352 104245 104415 99584 88283 85207 93087 105145
11682 105145 106005 97064 100727 98880 101854 106412 100461 91522 76020 78109 77882 88201 103382 89784
11668 89784 85633 91035 94585 89448 96166 104392 101251 96229 86061 87812 91787 98251 95212 89578
11654 89578 96246 106188 101105 104650 95437 90394 98734 110668 104010 85833 93537 107201 111921 118767
11640 118767 131879 136363 142603 140205 118787 107865 120550 119283 119361 125704 119322 119087 129614 125722
11626 125722 129559 145328 144962 147996 152702 134805 128940 118658 126014 133481 143460 153238 154533 134921
11612 134921 132257 145561 146437 139982 144083 150654 152591 156487 168984 159395 169090 169766 152229 121436
11598 121436 109798 116227 122902 133396 133597 136782 131104 127882 132887 134364 132833 141727 146973 145500
11584 145500 144961 135739 130222 121960 121916 119975 127307 132633 143987 149572 157246 171560 192933 206801
11570 206801 216928 215160 215067 189136 186828 191064 191951 197072 198091 208013 206330 204118 203750 214845
11556 214845 235567 239714 238149 243530 250404 255459 268744 261468 260923 283347 294030 310506 326378
11543 326378 354195 385376 432251 502764 606223 761373 989504 1361697 1826449 2244968
11533 2244968 2542667 2808423 3060440 3116760 3044931 2801855 2162191 1534361 1132904 892805
11523 892805 740154 654056 590892 537762 498729 472907 467797 455882 416933 394877 378703
11512 378703 381009 379533 366947 343814 328020 327787 321152 309728 302364 298781 297405 289863 294803
11499 294803 285450 265914 254518 250129 252270 249747 243945 229511 208207 203878 210965 198447 190287
11486 190287 193102 195145 202549 201430 197400 206223 214076 195904 197209 209188 213962 205539 208905 199112
11472 199112 190164 186499 200291 206703 211307 203832 207947 198332 203149 194982 208467 210538 207193 208387
11458 208387 212216 211685 218062 205553 185341 181879 183397 192238 197077 198074 196391 202521 195951 183127
11444 183127 186076 198134 201378 197698 205757 212973 216398 223915 244638 262838 280326 286893 290643
11431 290643 281637 261647 239755 213582 184078 151714 147403 124484 103583 102026 110146 114752
11419 114752 129964 141102 136615 123965 136335 150116 144666 145250 162338 195993 219266 218885 237753
11406 237753 238155 228182 219922 214826 195367 193795 199118 209920 208538 192672 180334 190266 216673
11393 216673 211797 211438 236654 254663 243869 236561 250007 261257 252193 239612 236722 221045 239150
11380 239150 256807 267071 279532 311141 345908 392646 452835 494492 510755 514649 509042 498810
11368 498810 492225 483732 466285 429889 388786 355684 322337 310843 296811 284456 284396 293618 307282
11355 307282 317146 325489 314499 295635 301722 327653 337371 323602 310491 310216 315236 322220 327468
11342 327468 322225 318408 312120 291984 272011 269180 267844 246120 231008 250039 261958 268678 282613
11329 282613 297465 293815 306454 321094 336186 347213 344538 324859 321776 312815 301442 302470
11317 302470 321931 335308 350634 356387 357440 372886 377276 348010 320941 302708 295736 303632
11305 303632 317379 300722 273279 248657 213360 178587 161885 152063 153588 167819 173867 191380
11293 191380 219137 223198 223712 224641 240682 263026 278691 287625 298012 303703 327198 327411 344774
11280 344774 359149 357884 358323 369028 371468 384987 393337 403136 414241 393384 372919 376138 385099
11267 385099 392991 399962 385950 368800 357389 356896 347852 341810 344928 347960 360823 354189 342531
11254 342531 348377 378342 412802 453912 515002 578285 677581 808110 973076 1087682 1182140
11243 1182140 1335197 1443568 1413766 1363803 1359068 1362746 1318885 1275784 1261366 1236725 1202856
11232 1202856 1171092 1130850 1102553 1082669 1073511 1078714 1066095 1066676 1080746 1073422 1075879 1084519 1094269
11219 1094269 1097196 1087675 1093096 1089945 1081537 1076473 1079525 1068989 1065233 1090595 1108771 1115600 1134270
11206 1134270 1169331 1207802 1246806 1264388 1271617 1276044 1302092 1332141 1349851 1351821 1385509 1434941
11194 1434941 1465237 1474174 1502558 1510789 1512514 1521001 1522525 1519007 1524863 1521629 1533400 1533514 1534275 1551789
11180 1551789 1589188 1638764 1694645 1759270 1805575 1848876 1914775 1982474 2046686 2125868 2214649
11169 2214649 2291690 2362270 2441801 2536111 2663771 2795593 2893989 2991919 3089317 3203953 3358590
11158 3358590 3514574 3666456 3826230 3998391 4119799 4251908 4418565 4624027 4865404
11149 4865404 5109504 5381245 5719449 6183860 6730047 7386550 8198036 9158752 10263019
11140 10263019 11415989 12491094 13604133 14863670 16156542 17521002 18909296 20132850
11132 20132850 21779050 24235253 27566143 31826142 37255385 44179150 53205735 65603525
11124 65603525 83628981 110798124 153055020 217477833 301153914 379132923 428893454
11117 428893454 471373476 518404693 534261883 522823103 495312435 391686317 268479806
11110 268479806 189183568 142947360 114771918 96256026 83144596 73237376 65165347
11103 65165347 58785104 53832214 49838830 46503588 43676184 41368711 39590109 38177811
11095 38177811 36827358 35427054 34135144 32887115 31560305 30305648 28864081 27264241
11087 27264241 25890929 24701510 23596306 22529717 21504226 20534310 19597763 18666250
11079 18666250 17742807 16857407 16044447 15357525 14787782 14259842 13758081 13277661 12813282
11070 12813282 12382948 11995381 11626737 11285911 10959047 10625216 10274200 9924820 9572452
11061 9572452 9245190 8947197 8659424 8381337 8104913 7840173 7599183 7393449 7207761
11052 7207761 7017273 6838535 6656704 6460906 6267248 6051675 5821381 5617916 5442311
11043 5442311 5283873 5121761 4941382 4760521 4598826 4440007 4274006 4160359 4056190
11034 4056190 3941949 3837880 3743994 3656337 3572895 3498730 3444613 3387370 3334240 3303795 3280814
11023 3280814 3258468 3221918 3147115 3038178 2887370 2717851 2549664 2369455 2210176 2061777
11013 2061777 1912596 1759302 1631110 1526894 1418541 1340818 1256598 1153720 1049271 948868
11003 948868 862200 790220 729986 690587 644572 612868 578268 526265 456465 383816 325780
10992 325780 306729 364671 414771 468549 545898 630386 821202 1047330 1159228 1251081 1390994
10981 1390994 1655271 2101486 2721313 3422615 3972111 4365393 4775651 5051576 5008912 4796132
10971 4796132 4154499 3120771 2322946 1829004 1529271 1341309 1214108 1107034 1045403
10962 1045403 1003517 962480 918449 862876 818280 771933 738686 721149 716903 714060 711920 712578
10950 712578 714253 701636 685292 675781 657253 653221 667670 685555 679768 668372 658870 669366
10938 669366 689540 694912 681458 672058 686104 690315 700199 676573 624145 593742 585957 593911 578775
10925 578775 556510 521488 462431 409950 384963 384935 383934 383982 376248 371044 340526 317037 318486
10912 318486 300239 295137 292532 303844 295696 281363 280930 303443 308185 303257 305639 314149 316425
10899 316425 334591 351983 361140 374065 367931 362711 365994 364228 359320 343551 336291 352574 369213
10886 369213 402780 428682 442789 461598 474130 466617 448740 412075 355145 319543 288903 278946
10874 278946 276157 263280 250372 247854 247926 253877 241103 210987 198885 192896 188757 185481 194507
10861 194507 205466 209130 209608 204664 211508 212544 201253 181472 157380 126202 101844 90503 82887
10848 82887 83118 91648 80533 74695 66901 59644 56366 43978 28764 28067 55407 81110 89376 69699
10834 69699 68317 73651 61124 42613 35368 23442 11481 14333 16396 2232 -10021 -4975 8109
10821 8109 10077 36977 56464 62146 86332 107013 119846 114533 109474 106402 110007 107036 104885
10808 104885 88098 65320 32586 16122 1345 -22090 -47519 -64395 -65500 -70400 -63538 -62492
10796 -62492 -42373 -34154 -33765 -14830 8505 18718 14696 10264 28274 37111 34950 46327 49587
10783 49587 40199 39377 25744 17049 26013 37081 23618 12060 21038 40534 33482 29011 17009
10770 17009 -6562 -17811 -6719 9383 23139 28793 6004 -7728 6787 21724 32899 33359
10758 33359 53077 71414 59515 59615 61522 75660 77313 72491 65992 68581 66657 59586 67049 60305
10744 60305 47545 51500 41712 49579 63264 60343 53838 52254 49600 46084 58413 57401 54500 54901
10730 54901 50104 46537 58234 81343 85431 82746 81210 78153 71428 74062 94321 95810 82476
10717 82476 70183 75754 80732 86625 92177 98841 122626 147527 167971 196851 220975 247176 313973
10704 313973 391939 491006 645167 887044 1248060 1710276 2120051 2392145 2652443 2928032
10694 2928032 3001504 2922988 2686503 2055709 1415521 1010640 762662 614827 531590 457621
10684 457621 402059 357731 319409 294085 266132 256682 250064 233426 224827 217944 236999 265041
10672 265041 264110 266438 306988 359222 421851 520587 687382 895949 1103768 1268383 1382970
10661 1382970 1502523 1559344 1535887 1452530 1206299 875881 646783 512707 431321 377577
10651 377577 334382 289459 257752 236637 222419 210252 187127 172900 172405 171846 160702 167999
10639 167999 180893 162367 149036 129444 132443 124263 116048 108679 100615 85066 88554 96424 96048
10626 96048 74659 61309 62984 55851 54365 50653 58366 64405 63270 59854 54534 55351 59331 50902
10612 50902 69307 84616 76169 54132 55573 46453 43478 47376 46385 44419 37411 36863 31183 28066
10598 28066 36665 41911 56182 50530 42366 32823 35279 45485 50022 34645 27238 26908 42054 34540
10584 34540 32368 36865 32636 35993 41162 48976 52370 57152 60957 45982 35019 25803 25974 34266
10570 34266 40077 44514 42581 45469 43041 44905 38123 28193 22404 13285 22991 39687 52388 67383
10556 67383 63286 49805 42321 53634 46686 39846 38112 31317 33411 34645 8522 -6957 6204
10543 6204 13529 19393 10324 11524 6877 7531 7572 14176 27233 52514 51383 46221 45782 57292 50216
10528 50216 36838 28306 15878 13671 20652 17456 13251 24007 31392 37040 42512 45089 52482 48879
10514 48879 39325 59258 62780 48768 50268 49766 42341 49968 37004 33445 31596 35524 48571 55476
10500 55476 38783 26526 35968 29743 29661 38970 39636 30858 24108 19449 19252 21515 26357 38974 47377
10485 47377 53035 51187 56403 52466 55257 54641 44493 37998 39782 48577 44447 35195 35885 42568 25008
10470 25008 12456 23894 21013 24638 26706 20837 13830 8467 17633 24792 27171 35915 36112 21511
10456 21511 17831 14381 17179 14251 5157 3036 6819 8412 14618 22984 7778 5558 6580 7139
10442 7139 15447 21755 22883 30997 31408 39173 44239 38794 22518 5799 23439 36198 28946 30020
10428 30020 39947 44478 23625 7068 5188 18725 19664 23464 32729 41584 49806 37344 27337
10415 27337 30203 22574 26488 39437 49055 41679 34847 34218 30612 26946 26256 25727 31633 47631 53510
10400 53510 50157 38970 34284 27619 29355 27775 28203 25809 20644 25674 29562 21605 22874 30831
10386 30831 31011 36092 37164 17839 12418 29523 39214 45078 49608 40190 27084 13890 19259 15395
10372 15395 17770 29817 32546 24465 21789 12125 6985 15361 19301 18539 18496 37739 44233 30129
10358 30129 22800 25038 31241 40323 28607 26837 45447 43645 35602 37812 47393 36528 21320
10345 21320 23866 23368 19991 24063 40176 51499 42546 36090 23228 16876 20731 27332 30968 30152
10331 30152 34976 34292 49864 67302 63515 65828 61054 52037 36253 25715 10732 11733 14922
10318 14922 23732 29071 24379 23309 47695 66994 64139 54341 46509 46325 32518 22619 36800 44673
10304 44673 42382 53870 46386 27315 30266 23131 9768 26224 35143 33395 44062 49137 49754
10291 49754 42333 38987 37587 36480 43004 28601 31153 43993 44901 38640 38294 39980 34778 30932
10277 30932 24968 32941 52873 47185 43048 28599 20457 30687 40614 48717 39884 29870 24393
10264 24393 20477 25641 18873 19015 18793 13294 12449 22393 18960 22300 28280 32959 37512 46431 56095
10249 56095 53128 36996 30608 33954 32803 36853 40259 35974 21272 14193 28796 53992 56260
10236 56260 40661 30086 31989 36912 41164 47122 40187 42125 51911 52980 49474 40295 27634 37506
10222 37506 38221 37909 27505 21118 17589 18229 24359 31962 37435 34808 36246 35640 39671 40926 35838
10207 35838 22888 20324 27043 32933 43039 51824 42058 39240 51645 55044 43883 41163 43743
10194 43743 30926 20562 29561 33299 35225 33963 37132 36221 37198 46194 53811 52495 32574 16924
10180 16924 2071 -4686 1253 11229 10711 17544 16531 23723 33341 39434 51513 52665 50377 57789
10166 57789 66170 56479 53432 52410 60382 59219 54558 50304 48604 39053 38782 25950 15812 23112
10152 23112 10754 18732 35264 31295 43089 53798 52847 47609 61388 59737 54921 55801 49824 57252
10138 57252 60697 57053 56033 56095 27044 21334 18963 15277 16879 18021 31758 48426 41577 38701
10124 38701 37991 41207 39383 32687 41128 45834 47523 52226 48184 40290 39870 48666 34723 30766 29445
10109 29445 26608 24117 30138 33682 35076 41698 31179 33923 31350 29217 43602 48384 44128 34873
10095 34873 25994 23163 27541 36741 38704 50701 56642 61910 44575 42338 28706 18552 22143
10082 22143 28299 38046 26696 20402 11508 15045 11578 18986 30255 25226 36989 50400 50250 42643
10068 42643 43297 43455 42696 37865 34023 33824 15751 2625 2773 18155 33067 23544 29176 30662 27177
10053 27177 19945 35053 47978 54431 52310 46085 51416 44911 33635 38303 49542 46174 55299
10040 55299 65755 46949 45324 42611 37460 26504 26985 36528 32592 31212 44015 59304 63150
10027 63150 58027 48231 40684 49921 59403 39750 19849 17193 10220 14810 23456 34434 36505 26285
10013 26285 22295 21857 16200 12971 19475 6123 8295 16123 7238 7414 22771 40899 43353 39770
9999 39770 39963 41140 28418 20667 23329 12169 3998 9460 23413 24084 20997 16720 14475 18023
9985 18023 13536 17031 32436 35263 32487 38247 43539 40332 34045 35984 39624 40241 38333 38327 33082
9970 33082 36066 41526 30183 30370 37342 53360 47892 37487 36050 37659 37722 30496 24133 33954 34097
9955 34097 24956 16675 23614 20910 15551 22987 24401 22583 29033 11355 13016 18265 11801 14948
9941 14948 15161 21444 39223 41338 39272 31780 42102 48717 50516 46755 55309 43395 43760 52056
9927 52056 34384 30285 39771 30368 25571 37799 39203 31107 23089 19782 19768 14862 31479 57913
9913 57913 66643 49095 36649 46097 55848 57165 54615 40429 37416 39212 47401 35133 13492
9900 13492 9864 23462 47446 52170 48949 32339 34766 38842 41022 44071 36126 45067 52509 42746
9886 42746 33620 44442 45144 42413 45107 55858 63883 45993 22058 18311 9132 10441 15067 20841
9872 20841 30606 38178 39679 34957 29392 30833 32293 27088 25143 20878 25225 15137 9422 20608
9858 20608 32065 31695 25739 37408 45989 33564 31735 34135 41818 43978 33059 34505 29871 19779
9844 19779 7685 13661 23752 7301 5113 8389 17890 26386 28582 26010 24980 30090 26212 18977
9830 18977 22630 37654 43660 40581 32743 23007 15719 1450 1234 18921 37898 33961 24340 21097
9816 21097 14799 15811 -1121 -2001 -3975 10594 30213 40979 34585 28176 31202 33217 39721 40264
9802 40264 44801 41736 15433 -8611 -11042 14862 14404 20289 24078 30546 30955 39084 31604 23095
9788 23095 27475 28690 31233 39966 45129 31641 15938 10411 20052 21559 24588 33325 35213 21560
9774 21560 8852 1394 -3391 13579 24059 21880 30308 21831 8257 16394 32290 40055 27658
9761 27658 17687 17579 23886 20332 19304 20672 13541 4647 649 3409 203 1157 2814 8569 23319
9746 23319 35795 32409 15698 18921 22198 9904 11707 15992 23297 31608 23967 26352 22603 19854
9732 19854 14433 14016 18556 13215 15875 22700 23697 24390 32092 24200 23484 20436 9933 6191 -1682
9717 -1682 -5419 14544 25232 20489 20233 18588 13323 21518 23598 31196 29447 24833 28444 19158 7848
9702 7848 3538 6759 13384 -3014 -2268 -4011 6739 4115 11301 4173 3143 5864 30014 25884
9688 25884 30635 32185 32508 32018 32554 29558 37419 45170 39275 23850 11657 5745 4335 20018 27227
9673 27227 15118 22224 32258 37286 33759 21712 21468 18490 12017 7315 8445 6755 11542 24108
9659 24108 13351 -1643 2777 11671 22251 23104 17222 11213 17881 20834 17764 1483 -262 19796
9645 19796 18196 7009 2714 9684 8411 7715 -6581 -22605 -16206 -1781 9600 8418 4341 6694
9631 6694 12906 3016 10196 20326 16600 11645 379 -11122 -12842 -10556 5727 24058 30793 44183
9617 44183 44509 44731 40788 31255 16577 15639 12049 6301 -552 -1276 4464 11722 15395 19567 14602
9602 14602 8050 14061 9872 492 5673 11537 18837 22576 4766 -7499 138 8402 12430 25377
9588 25377 26009 20223 20203 7042 6122 13650 12369 14119 4258 -7626 -5283 -4857 9486 23185 22043
9573 22043 22088 24084 22472 19477 18122 27819 26822 9473 10242 13523 2356 -10663 -10187 2172 17270
9558 17270 4827 -3367 -1178 15029 23017 5042 415 8886 10058 -3946 2011 20002 34397
9545 34397 31450 17632 15072 -6157 -17944 -9778 -7057 -3660 2764 2148 12309 20965 31991 27297
9531 27297 13189 12713 8889 -2647 5936 11489 15979 3739 -17336 -11077 11944 13060 13953 18378
9517 18378 13765 12308 14398 -16 1869 -7193 -9037 4663 12739 4510 141 9800 3175 5032
9503 5032 11958 20359 13275 18027 19570 8940 16511 13251 8676 5798 2075 1851 2248 -3279 -4312
9488 -4312 -1195 9179 10846 11123 8366 7498 7729 -1140 -6 11639 17566 4514 -4589 -3699 -5007
9473 -5007 6540 2631 -7090 -4671 7129 9774 7111 -4525 -9165 -23649 -19685 -16747 -3624 574
9459 574 -1516 1643 11707 9542 1772 -3129 -5062 -10033 -7737 -15568 -9903 -7548 -3630 -5315 -14077
9444 -14077 -16572 -13082 1406 8444 -4004 -10956 1933 10757 14243 7762 18216 16676 20152 7408
9430 7408 -2190 -5830 15326 24724 12458 -41 -18454 -36686 -34171 -25686 -14698 10602 16530
9417 16530 11480 5817 -1523 -6628 -841 -4239 -11723 -12380 -9145 -3990 54 11624 9506 -5055
9403 -5055 -16676 -4381 11883 10876 9014 5812 5505 7234 4801 13323 8220 5809 15722 29033
9389 29033 15356 6674 14493 26426 31489 35668 30252 20884 11892 -511 -5807 -5528 7776 14249
9375 14249 8051 14182 18593 14247 16759 7643 -1238 -2684 -11632 -23629 -24755 -15972 5518 7171
9361 7171 1857 -6017 -1902 -16566 -15166 -14644 -15919 -16555 -17200 -11249 -5732 12295 21160 22757 10827
9346 10827 -9283 -15937 -3430 -1390 -2857 -5411 -3155 -7089 -131 -4349 -11043 -10047 -10303 -15424 -1114
9331 -1114 11667 5319 9993 8566 2813 3541 10730 13010 21537 11974 18701 8961 -12120 -10217 -8736
9316 -8736 -7568 -1630 2428 -693 5854 18436 8465 4779 2003 -1474 9868 28621 33379 22563
9302 22563 3637 3631 12949 12341 3378 -4911 -1752 -1150 -2803 -1428 1314 -6813 -6234 2195 5529 -1339
9286 -1339 -19286 -16628 -13663 -12935 -1900 8135 -3336 -8609 3504 -2478 -8451 -9893 1491 10615
9272 10615 13039 3393 1676 7156 -14508 -11897 838 7315 10329 7634 8432 8742 3736 3049 4336
9257 4336 7799 14492 16842 17429 7402 14415 6952 -331 8422 7152 -10448 -17330 -9162 -8338 -3615
9242 -3615 3510 -3290 4100 2693 -11004 -18004 -18965 -6715 -771 -95 -971 1907 6358 -418 -9006
9227 -9006 -3323 10546 14463 7041 4323 -9003 -12112 -1552 8978 14002 7398 -8341 -17684 -8486
9213 -8486 -9341 -12941 -2765 -657 -1242 -12467 -14648 -8816 350 6297 10573 20074 19117 14447 24271
9198 24271 27447 8315 -9088 -2612 -408 -1918 1553 2942 -5083 -13045 -4982 9391 21009 33421
9184 33421 22379 932 -21922 -23472 -11909 1385 5558 7356 9028 4325 -24 -7181 -15508
9171 -15508 -14752 -13929 -25682 -29724 -657 22885 27869 21072 18785 5229 -8268 -7366 5825 9424
9157 9424 6816 14800 7296 3510 6259 -2158 -9998 -12520 -8941 6701 28195 23707 25055 11505
9143 11505 8094 621 -4112 1081 -8413 -11150 -11132 -11074 -16650 -20391 8028 17833 14505 -1400 -1726
9128 -1726 18150 25840 3665 -18727 -14265 -124 -1993 -10362 -11802 -6382 -156 -4786 -6238 -12407
9114 -12407 -13462 2498 462 439 18975 34004 23991 16315 13484 15015 13869 18496 16211 3097
9100 3097 -3228 3919 -4158 -18236 -13704 -10907 5064 21600 38849 33229 28128 21243 10941 -1626
9086 -1626 3053 15948 13501 -8675 -13234 5124 4139 -8231 -20644 -11847 12922 4816 -15056
9073 -15056 -11228 -19941 -23709 -34451 -33477 -25133 -17109 2118 10110 8299 10592 3283 5389 7252
9059 7252 -7264 -13265 -15826 -12790 2603 3210 10319 16639 13548 9080 4365 804 95 2235 7519
9044 7519 19547 18749 8705 -2646 -6636 -10743 -7348 1014 8474 2937 10536 17614 23051 19495
9030 19495 10958 5085 5491 9641 8669 12025 7507 23005 29425 12645 5093 6018 13269 8485 -14392
9015 -14392 -21779 -24847 -34217 -30963 -19296 -8804 -8714 -2314 4917 3790 -1085 -1225 -16298 -26171 -26353
9000 -26353 -12242 -1208 -9053 -20890 -14419 -9665 -10391 6711 15108 19937 7676 2492 3742 4342
8986 4342 3789 10135 1176 -6740 -17531 -757 12184 18241 13247 19281 27506 17548 11452 317
8972 317 -10356 -8420 -4059 -2667 5363 4411 -9802 -13987 -2587 13672 14821 19054 17414 2522
8958 2522 -4775 -16595 -6787 -7556 -7309 -16311 -23590 -7713 -3249 935 4859 6467 9689 4422 -4192
8943 -4192 -2453 -17640 -23370 -16160 -20682 -15826 -2707 -11705 -15056 -15514 -26900 -29713 -12696 -11628
8929 -11628 -27192 -26613 -11514 -6115 -11135 -23250 -10376 -6292 -7883 -23331 -29918 -22164 -12121
8916 -12121 -1907 -7023 -18098 -5200 1651 -7687 -13747 -13854 3227 4916 7659 122 -7978 -23009
8902 -23009 -25184 -23642 -15876 -3432 -6911 -21855 -19157 -11745 -1753 -10199 -15439 -4485 -5926 -25380
8888 -25380 -25247 -24880 -11635 -12689 -4954 11445 11532 635 -1936 -3551 -15264 -16195 -10075 -7834 -8339
8873 -8339 -7710 -17447 -18823 -21931 -22099 -11660 -12634 -28942 -34248 -19456 -2366 1940 1525 10829 15494
8858 15494 18503 16547 8777 8056 282 -8862 -12377 -1835 1095 5204 4616 -3028 1071 -4770 -4674
8843 -4674 -4196 5267 10489 13007 10806 12183 6560 4551 4858 14019 11070 19157 18017 13565 9009
8828 9009 3580 1723 -7466 -7438 11107 30391 26095 26130 28736 42843 37435 18633 21229 16334 -13556
8813 -13556 -6966 -1697 6222 3760 -9896 -17960 -24599 -19231 -19034 -8145 -8260 -2368 -3865 -3039 7652
8798 7652 17215 21426 23832 12660 524 3962 -714 -7688 3564 11727 7799 11056 2920 -4740
8784 -4740 -14877 -18364 -26994 -9174 1088 -12899 -29524 -30074 -30604 -31795 -20240 -13996 -6859 2718
8770 2718 3218 6315 13938 8951 9028 -2263 -10318 -5651 4757 15735 19950 9593 4074 11355 3224
8755 3224 -2494 5390 28956 43345 47501 41479 44185 41383 29735 30611 35054 17546 -431 5205
8741 5205 7616 5206 21731 27266 26137 24158 17122 14525 9385 3489 -71 -1808 2207 3247 4416
8726 4416 14369 18216 39702 37290 14036 3085 1098 6801 12374 11983 13382 23543 13436 17348
8712 17348 19917 12037 1880 8481 16204 12297 5629 18563 22348 33794 40628 32077 32023 20832
8698 20832 14874 8757 12647 17745 14635 -413 107 -11291 -12303 -72 2400 -10779 -22593 -22072
8684 -22072 -12314 -7499 6236 6130 4355 -2066 10434 7819 1031 1884 10151 7693 9943 15947 21840
8669 21840 13114 5279 6191 4764 14531 33063 36913 35853 26642 13494 26158 29538 34487 33529
8655 33529 24582 24847 18799 5772 3585 9173 2788 -1726 -2848 -7352 -12380 -20169 -19755 -26431 -30984
8640 -30984 -18586 -11235 -19591 -17066 -3055 3905 15131 25396 18657 1150 8142 23199 36123
8627 36123 30946 35868 41934 35629 30414 29266 44077 60052 61419 54869 50250 51855 34734 25556
8613 25556 18480 23615 32312 21899 15076 22196 27581 27977 38075 39531 39816 30219 30089 18349 15273
8598 15273 10639 3407 -10956 -19780 -18721 -11906 -11979 -7367 -8042 -12474 -4642 6631 20782 11062 14843
8583 14843 22397 9138 2445 3382 6443 13108 9286 -4262 -4994 -6602 -5978 -5318 423 -3880 -2727
8568 -2727 -1177 -244 17029 18191 10672 6437 -8921 -6714 2596 3063 13833 22012 14637 7143 2821
8553 2821 7970 -6127 -12178 -14014 -12132 -9164 -13117 -15120 -9637 9035 8751 10819 11195 9869 7058
8538 7058 1313 10394 10327 7744 12278 9641 3054 13225 -4014 -13383 -4565 11518 8917 8617 3342
8523 3342 -6124 -16933 -4491 5215 957 5044 8903 7139 15175 14124 3173 -1068 872 6286
8509 6286 -2586 -6436 -19752 -15082 -13276 -21209 -24974 -25588 -12127 8758 13395 -7533 -13039 -10517
8495 -10517 -440 1264 -10383 -10067 -15447 -17940 -9324 -9216 -16565 -14761 -9088 -21587 -36159 -21495
8481 -21495 -9144 -12859 -15082 -13790 -10638 -13871 -14313 -8280 -20146 -20773 -28020 -33781 -25490 -20016 -35292
8466 -35292 -24156 -15810 -21520 -17253 -9765 -21533 -30690 -29105 -26549 -24691 -14376 -14523 -16033 -19632
8452 -19632 -18638 -1577 23219 15022 -4126 -18908 -20181 -16940 3951 5889 9622 -3808 -8906
8439 -8906 -19167 -30157 -38248 -29751 -30152 -23176 -30346 -37371 -30763 -37402 -38748 -19359 -12476 -9487
8425 -9487 -15153 -24532 -16291 -27634 -31607 -23741 -16753 -10757 -5950 -7308 -17917 -40140 -43511 -36592
8411 -36592 -31419 -17404 -8581 -17375 -20221 -29715 -19241 -15729 -14546 -12958 -12557 -16520 -12498 946
8397 946 -1986 -1113 2336 8420 11486 12671 7265 -6273 14337 6711 -4472 -23944 -27698 -25930
8383 -25930 -18402 -23680 -22917 -8518 4575 15937 6317 -6717 -13209 -19241 -20849 -27323 -18528 -9795
8369 -9795 -20428 -14190 -12106 -11325 -8893 -12595 -38579 -36604 -26478 -7897 573 2898 12821 -1422
8355 -1422 -24188 -24047 -27408 -19543 -9921 -13063 142 7847 7929 5833 -6108 -26960 -18182 -10412 -6334
8340 -6334 -5762 -4713 -4339 -16410 -26801 -23991 -15419 3370 7773 -5391 -9119 -12009 -21898 -30431
8326 -30431 -19104 -2938 1137 -10333 -25813 -29187 -23298 -22274 -19947 -11174 -10592 -5540 5039 987
8312 987 12027 14064 3985 -17545 -23137 -8662 16739 15483 8244 -531 -15691 -19162 -11351 -5886
8298 -5886 -6990 -28596 -31213 -19308 -29776 -27417 -10442 1441 9643 6834 -3956 -10391 -4442
8285 -4442 -1757 -15147 -10743 -3542 -3705 -9444 -12347 -34437 -32335 -16878 -7712 -12754 -16749 -4895
8271 -4895 -345 880 6612 3860 -15864 -15399 -9542 -11686 -8845 -5989 -1322 -2623 -1142 1249 3822
8256 3822 514 -5645 -8306 3866 -2699 -13666 -13260 86 2011 -3695 642 -5961 -17282 -11834
8242 -11834 -10959 -12648 -21893 -19099 -26765 -27925 -15309 -14817 -3276 3579 8889 8250 -537 6095 9526
8227 9526 4921 -571 -3774 405 7953 18568 9314 10511 9244 14703 21776 14896 11795 6208 226
8212 226 -6700 -11479 -18534 -30633 -29419 -21474 -12151 1999 -9465 -14021 -2304 -8989 -3379 938
8198 938 -2151 -11784 1987 15408 -4915 -3454 -9197 -16753 -7469 -3235 -6479 -17416 -16466 915
8184 915 -5817 -23709 -22955 -32975 -32520 -33689 -35610 -35810 -16879 -810 -7322 -14955 -11049 -10284 2745
8169 2745 -2075 -3114 -14774 -20080 -16734 -5543 -5143 -13227 -25722 -28408 -7422 3075 -1950 -52
8155 -52 18289 8798 -1242 3394 11160 9664 10623 5970 4773 -7866 -10179 -9021 -12887 784 7544
8140 7544 -1708 8934 2731 8067 -6265 -30094 -42174 -40044 -34707 -18547 -8681 -9841 -8862 -29658
8126 -29658 -42603 -32770 -18136 -13946 1212 14590 6440 -9387 -1860 -6071 -11312 -7914 -10609
8113 -10609 -5809 -842 -7531 -605 845 -1842 3635 9183 4175 -1419 -790 -1532 -6209 -6063 -12810
8098 -12810 -23160 -32326 -34973 -25564 -9611 1792 -397 -10585 -2551 12639 1834 892 -4477
8085 -4477 5663 14365 22636 16242 18144 23277 19706 20396 10779 9614 11197 2795 -5745 5026 4611
8070 4611 7801 9173 3896 -2911 -4174 -11491 -7367 -4122 -17784 -17900 -15828 -27096 -26339 -8318 5386
8055 5386 1245 55 15967 21109 15739 20620 25138 7509 -2732 -2225 8242 5865 -7845 -15398
8041 -15398 -9429 -3306 -1794 2505 10663 6328 -15279 -15568 -8835 -15038 -13280 -12864 2384 1048 7453
8026 7453 -3152 -3433 1863 2468 3897 8129 6683 16600 25103 15467 8356 3562 7815 22628 32543
8011 32543 41810 37478 21595 24351 30795 31940 16073 19051 18026 7170 11261 5722 5413 20993
7997 20993 39888 23445 -2791 3711 20267 16831 14153 9981 5839 -5821 6091 16048 9584
7984 9584 12425 11048 6638 17204 34963 34670 18627 14630 13796 26079 19537 20059 21438 21808 28959
7969 28959 33065 26846 21478 8925 17286 33143 31271 29195 20292 12593 16416 25653 30035 28746
7955 28746 31265 27198 30279 42723 35839 23468 12531 13978 21939 24414 26259 26867 37469 41967
7941 41967 26376 15121 18741 12080 -670 -1108 2697 11341 21865 22264 27508 32398 33163 26922
7927 26922 22552 15489 9861 6534 8732 1000 -4775 56 5509 14595 14871 17357 12243 1243 1313
7912 1313 619 -3054 -15 11645 26285 15947 -36 -2909 -4454 -1637 -2966 -9077 -9648 -6829
7898 -6829 -9698 -22792 -10172 2056 8856 11291 22220 20347 15659 8642 -1303 5347 6607 11956
7884 11956 21257 17054 2825 -9207 -10350 -9046 709 676 -102 -11112 -22518 -4116 -3518 9961
7870 9961 23429 35100 32580 30929 24061 17561 10764 4929 6902 6226 -12390 -26947 -26252 -16290
7856 -16290 -12052 398 24541 19971 6326 6441 2911 2520 -2277 -10948 -13033 -25634 -15129 -24636
7842 -24636 -24118 -5312 -11330 -23404 -26528 -26692 -21662 -13335 363 10052 8916 2051 2683 -733 -8830
7827 -8830 509 -5212 -14482 -3019 5146 -970 -16760 -25870 -10779 -6860 -12427 -13466 -6071 -8784
7813 -8784 749 -7482 -7267 3588 7628 -1177 -6975 5402 1044 -14187 -22609 -19240 -21626 -37681
7799 -37681 -23396 -3162 5297 -12659 -8575 -1900 5453 215 -8412 10862 16849 7135 -6056
7786 -6056 -15558 -23437 -17026 -10968 -27537 -31840 -20427 -13813 -2918 -9032 -22120 -27603 -16840 -16042
7772 -16042 -11149 112 15409 10283 -6856 -20419 -18537 -8580 -6958 -7875 -2871 -3892 -12016 -7074
7758 -7074 -9421 -9016 -14487 -10379 -11954 -12055 -7654 4098 4777 -6570 -15003 -27354 -29406 -20684 -30184
7743 -30184 -31271 -21940 -22811 -31307 -31790 -29936 -8445 8915 1470 -13091 -10079 -602 -13482 -15781
7729 -15781 -11240 -12551 -25268 -42344 -55579 -41410 -25747 -16696 -23387 -28251 -22989 -14547 -17936
7716 -17936 -21293 -29081 -27582 -28165 -27025 -18651 -13886 -18827 -21824 -17585 -19157 4820 16618 -8367
7702 -8367 -23316 -23778 -25094 -21308 -15869 -20940 -25089 -18946 579 -965 -10860 -15940 -12995 -20817 -20972
7687 -20972 -11568 4486 3120 -8862 -8087 -5390 -8808 -17387 -26335 -31389 -34054 -40192 -30053 -14522
7673 -14522 -19209 -13215 -10318 -11779 -16787 -10912 -17384 -23457 -23067 -12471 -13519 -17861 -16843 -7631 -3552
7658 -3552 -22504 -32125 -31559 -27447 -8501 -13122 -26471 -26733 -15514 -3665 -17845 -25818 -31179 -29265
7644 -29265 -30444 -33088 -20436 -18975 -7297 6502 6042 -4468 -12790 -17581 -16650 -21490 -41702 -45308
7630 -45308 -29762 -19880 -36126 -41690 -35969 -45965 -50588 -53433 -42446 -25814 -22020 -10780 -9790 -18474
7616 -18474 -16021 -8690 2493 5262 11297 19513 20045 17735 8894 -1701 -9270 -11738 -19827 -14986
7602 -14986 -16485 -20750 -17550 -939 -5229 -24006 -18511 -9130 -10602 -6397 -21514 -19973 -10553 -9604
7588 -9604 1274 979 -10205 -12619 557 -8983 -15824 -9222 7140 3738 -7408 -11458 -5027 -3367
7574 -3367 -4543 -14378 -20252 -7974 -4126 -3659 -3588 -6931 -7372 -12596 -18545 -17052 -15244 -16533 -19271 -31593
7558 -31593 -43227 -38989 -35386 -24145 -7602 -5946 -10179 -13183 -184 10604 13324 -2724 -16387
7545 -16387 -17682 -19614 -15548 -11650 -15850 332 -2532 -17921 -14375 -10530 -14831 -13027 -4866 4969
7531 4969 3420 1838 -3912 -15056 -17083 -5469 -2401 -11844 -19584 -20005 -26402 -24696 -12616 -5388
7517 -5388 -14835 -12494 -10184 -14203 -8402 -3425 2703 -9414 -15289 -26456 -33510 -30476 -20657 -15018
7503 -15018 -17114 -20867 -13706 -8234 -14337 -18701 -13635 -2617 7186 6000 -4202 -4359 2791 6986
7489 6986 2007 298 -4916 -12736 -18985 -26258 -26014 -21771 -14375 -3744 -10011 -11423 -12295 5757 13107
7474 13107 8743 -12249 -18069 -30085 -25204 -17743 -13837 -13537 -5358 -13475 -22423 -9159 7971 2529
7460 2529 -2500 -10559 -16475 -19650 -10029 -10943 -11183 -20453 -26043 -17834 -18671 -17349 -8483 -9111 3235 -7475
7444 -7475 -19609 -23672 -20176 -22339 -16021 -12936 -17811 -12385 -9147 -5362 -19682 -10540 -12244 -14700
7430 -14700 3249 -2310 -16096 -11743 1214 3309 -3320 -1808 11696 7769 5685 -12042 -7450
7417 -7450 -2999 -1052 8051 4538 7834 5285 3000 1081 7662 6725 5617 6575 3849 4103 6471 -7241
7401 -7241 -12277 -16962 -16743 -16843 -24653 -22314 -16384 -24174 -20199 -12038 -12017 -5510 -6854 -11844 -21722 -42020
7385 -42020 -44000 -39134 -32921 -30209 -34028 -36123 -41516 -29522 -27547 -31397 -25217 -11566 -14696 -21784
7371 -21784 -7064 -5272 -243 -8147 -5702 -4016 -7071 -8583 3889 15338 19156 23332 5379 -9338
7357 -9338 -2737 3770 -8726 -7693 -3213 -2201 -10628 -13481 -11451 -7110 -9905 -18939 -10365 -1584 -16395
7342 -16395 -20266 -17891 -7384 -11081 -19260 -20570 -32773 -37573 -18552 1845 2792 -5970 -2222 -5552
7328 -5552 -11047 -13856 -17626 -28080 -38743 -37235 -33462 -17871 -5286 -10415 -25176 -23956 -20355 -27457
7314 -27457 -31114 -18350 -15742 -14800 -4890 15147 18357 3795 -11322 -22134 -8477 5676 -2556
7301 -2556 -8773 -4840 -17813 -28287 -39534 -36082 -30666 -36854 -28419 -21159 -9694 -7323 -2795 4030
7287 4030 -10851 -30324 -33754 -33353 -27433 -19686 -19599 -16795 -18230 -4427 143 1082 -6441 -15304 -8728
7272 -8728 6482 9483 147 -13942 -23850 -14218 -10651 -5735 3826 10359 11194 13521 3688 3774 1256
7257 1256 -2437 -11286 -9932 -2505 -8378 -17573 -24470 -33675 -25275 -11438 -9123 -3339 -5806 -16842
7243 -16842 -16392 -1690 -7329 -1635 -2393 -11617 -16205 -4735 4922 864 -9529 -18694 -22646 -25292
7229 -25292 -24395 -15501 3378 16716 15521 -6434 -13231 -16210 -6879 6759 11261 -11257 -25855
7216 -25855 -24335 -7712 -3113 2663 7486 -198 -15001 -21718 -17781 -5637 -9547 -11061 -19995 -25674
7202 -25674 -26419 -20420 -20356 -13448 -12653 -23884 -21519 -18518 -27193 -22556 -9799 -14618 -31503 -13053 290
7187 290 6362 -685 -3062 -1867 -1556 -844 -1209 1280 999 6879 18620 17839 4901 -3920 -4854 -7515
7171 -7515 -15422 -10887 -13301 -23598 -20048 -16948 -10839 -9429 -12537 -27215 -31338 -21205 -12891 -18380
7157 -18380 -21230 -15114 -1643 2638 -484 3391 1160 -7253 -8151 -10595 -10631 -8201 -18433 -11614 -8534
7142 -8534 -2613 11946 -3738 -15642 -21243 -23759 -30533 -15151 -14186 -17488 -26054 -41172 -33422 -23403
7128 -23403 -28215 -17603 -3815 -9172 -26427 -37839 -33071 -28353 -13895 -21365 -32763 -37252 -27238
7115 -27238 -22423 -25111 -20403 -9701 -11921 -14727 -9536 -4535 -16126 -19289 -20370 -33204 -33329 -30203
7101 -30203 -33819 -36687 -25714 -18337 -8444 -862 8639 -944 -5182 -13728 -18638 -14473 -6965 4345
7087 4345 7427 828 3216 9275 -4021 5546 -107 -5603 -8697 -2886 -10680 -23270 -13394 -12820 -15759
7072 -15759 -13923 -8509 -17013 -21041 -4646 4830 406 -12715 -13502 -11145 -7571 -3236 -314 -14827
7058 -14827 -12537 -11159 -16980 -1537 1212 -14219 -23785 -14710 -17663 -17855 -1890 1029 710 -30168
7044 -30168 -25783 -16380 -27499 -28667 -27271 -35821 -19129 -9676 -4912 -15923 -21015 -25272 -13541 8814
7030 8814 9065 -13775 -31035 -33297 -30695 -30936 -25471 -26758 -24354 -23506 -17275 -8327 7982 1604 -9421
7015 -9421 -9371 -6944 -3644 -1536 -9480 -13876 -1325 8218 12264 8767 12574 11182 1457 -20030 -18038
7000 -18038 -4987 6466 10572 12483 1459 8315 13985 15143 -9447 -3682 -1097 -2776 11213
6987 11213 9987 -2350 17 796 1260 -855 -1075 -5498 -9536 -201 1344 -4188 -8310 -10319 -15678
6972 -15678 -19392 -21308 -34583 -21317 -4219 3745 4095 -1092 3647 1470 -204 721 -2789 -13432
6958 -13432 -13308 -8586 -1593 -4377 -5226 -12388 -11768 5682 16324 8672 12431 20405 22488 21088 15151
6943 15151 17094 1419 -11079 -11446 3210 3213 -6636 -8934 1118 -113 -763 -7262 -15419 -22700 -35959
6928 -35959 -38088 -29324 -28072 -34640 -24164 -7269 -4872 5584 16258 -1959 -6981 -4181 -5500
6915 -5500 -2195 2246 -2519 -1049 -1038 -21829 -38347 -43934 -26582 -23659 -16422 -10386 -12099 779
6901 779 1646 -4636 4387 -802 11558 7805 -1227 -13053 -24188 -26084 -22860 -24240 -31427 -25628 -7654
6886 -7654 -11366 -16353 -27723 -28474 -2917 12194 14749 4166 -17532 -24034 -10985 364 -3635
6873 -3635 -8969 -9875 -8660 -15972 -23410 -18724 -20861 -31350 -30801 -26532 -17056 -1091 189 -17205 -24620
6858 -24620 -31311 -28425 -14676 -15153 1868 5962 -9529 -19449 -12907 -3441 2344 3091 963 -4428
6844 -4428 -4859 -3396 -5949 840 671 9887 3214 -2976 -4953 1699 14108 5100 -5470 -18854 -24560
6829 -24560 -18167 -13825 -12891 -5381 -17873 -29254 -30610 -20690 -7391 -1911 -13587 -11670 -16645 -11241
6815 -11241 -8324 -10539 4186 11602 8712 3274 3516 -5851 -13349 -20536 -14294 -8338 -4848 -471 -6625
6800 -6625 -15283 -9213 -4381 -386 8834 15449 20794 7696 -3225 -12922 -18690 -6395 -13666 -19154
6786 -19154 -18931 -25783 -27621 -31082 -26542 -18964 -18801 -5286 -12843 -13029 -5675 -8292 -17869 -27740 -15933
6771 -15933 1774 8034 9701 28885 34511 27416 14702 10168 -4180 -16098 -15732 -14063 -26503
6758 -26503 -40085 -44777 -51529 -41997 -37165 -39523 -29339 -20179 -17800 -26275 -26332 -23321 -3770 8946
6744 8946 4675 -2060 6740 14439 16732 10775 2675 4249 6423 -6724 -1239 -7577 -19238 -16351
6730 -16351 -10598 -9326 -11638 -6000 -11194 -10830 -6121 -8342 -18835 -15402 -7250 189 2982 7665 6955
6715 6955 -1280 4720 9551 -6291 -21276 -29404 -17490 2531 2542 4880 -2860 -25620 -34667 -37315
6701 -37315 -15847 -8445 -15826 -10317 -7433 -17827 -20731 -17139 -8307 9068 8881 -5555 -21259 -28375
6687 -28375 -21655 -17572 -17190 283 -522 -13623 -10884 -17628 -27252 -21469 -17730 -9799 -15746 -10697 -12116
6672 -12116 -9300 -9461 -18768 -12850 -2286 -1958 -6306 -406 6759 10437 2115 -4207 -10448 -9768 -4627
6657 -4627 -15987 -21667 -29219 -19850 -9542 -6250 -7143 -11472 -17744 -8491 -10523 -4810 9938 8992 6960
6642 6960 9053 16206 7928 5303 -2021 -22602 -18777 -15373 -13814 -10201 -4900 -10144 -347 -6101 -20656
6627 -20656 -21914 -20370 -6757 3386 5099 1170 5948 5356 -12764 -8960 -5156 8407 3505 -9149
6613 -9149 -15371 -23982 -27024 -30376 -25631 -13790 -4719 -3283 -3141 -2888 -8813 -4893 -8091 7446 7795
6598 7795 -3127 -4751 -1032 -8494 -15254 -9563 7954 9708 3373 5440 -1387 -612 11448 184
6584 184 -18534 -12344 8282 12496 3828 -9004 -11901 -7294 2973 1674 -808 8623 3145 11788
6570 11788 12664 12692 4752 5282 6547 3180 18096 24315 14547 10025 687 -6144 -13223 -9375 1332
6555 1332 -428 -8962 -21313 -19224 -14934 -17407 -5940 6124 52 -4763 -16258 -11099 -10464 -13979
6541 -13979 -28873 -27703 -24541 -26357 -15397 -9237 -2299 -7489 -11081 -5830 -793 7393 7284 3753
6527 3753 923 -2713 -7906 -1452 3129 -5532 -14365 -21051 -20460 -22067 -27105 984 11939 -2321
6513 -2321 -6548 -12570 -7201 -8797 -26268 -17420 1302 8713 -1126 -3837 -17883 -25629 -22625 -28614
6499 -28614 -30581 -29630 -17526 -17637 -28536 -29944 -25660 -22117 -16830 -5132 2450 1504 1988 -6142 16862
6484 16862 11818 -1875 -14009 -32914 -34286 -18230 -3221 -5848 -6463 -3074 15764 9956 10315 -816
6470 -816 -7354 -14055 -16071 -8680 -13405 -24949 -24117 -25436 -24812 -18755 -3335 -57 -10272 -13852 -13687
6455 -13687 -11575 -22875 -30704 -28079 -24192 -20216 -19226 -24003 -31032 -22834 -9751 2064 7405 717
6441 717 -11692 -26659 -18601 -13988 -15011 -9987 -5448 7515 -515 -4940 -3033 1101 3735 12591
6427 12591 11721 6423 970 -2950 -4037 -5902 -10286 -632 -8664 -22525 -20073 -18974 -17400 -7582 5608
6412 5608 3716 1472 4088 -820 215 2353 19921 27394 29080 15207 3582 11884 8332 8662
6398 8662 924 2683 -4948 -8730 -10933 -12396 -17324 -8681 5140 -433 1126 5932 18985 9364
6384 9364 -1371 -4962 -4584 -4240 -21856 -27295 -24402 -26367 -26056 -22453 -13076 -6161 -18585 -19544 -18028
6369 -18028 -14416 -26790 -45997 -38384 -24853 -7612 -15965 -30801 -21559 -370 5521 7602 6392
6356 6392 15665 11968 -8119 -24287 -9916 -5570 -19836 -17687 -7255 -2008 -1237 -23719 -27723 -17871
6342 -17871 -5917 2055 -14216 -18494 -11025 -25485 -18745 -4300 -4660 -10414 -8215 -11067 -17313 -28673
6328 -28673 -19358 -19151 -10323 -8072 -4870 -7274 -7822 -17159 -17505 -20963 -13608 -5828 -9729 -15726 -8739
6313 -8739 -20749 -29994 -22177 -25216 -33182 -13116 -3107 1086 -2369 -16310 -17781 -10021 -6538 -1655
6299 -1655 2617 14116 16765 13484 13257 5870 -1567 -2493 -13702 -7197 1846 4307 4395 1332 -13457
6284 -13457 -23771 -22455 -9473 -8216 -24936 -26684 -8607 3694 -1847 -6349 -18848 -9117 12750
6271 12750 6847 -12714 -15872 -14759 -7458 -5698 -9392 -10300 -13257 -5962 -7759 -5084 -8554 -683 5528
6256 5528 1026 -1678 -3353 374 -5291 -7614 -5491 -8578 -12014 -27407 -25187 -28421 -31132 -32346 -14084
6241 -14084 -2113 533 -11082 -1600 6896 21251 17161 11851 16497 20059 16491 10779 10094 -4455
6227 -4455 -18563 -18469 -14723 -11353 -9982 -14706 -16058 -16487 -17842 -18248 -14379 -15066 -17357 -9160 -7803 -3788
6211 -3788 423 -493 -16413 -24336 -25705 -8432 -4228 -19047 -22817 -14054 -16560 -26372 -17287 -10428
6197 -10428 -2567 9884 9015 -366 -1942 -1379 -14255 -18550 -11619 -3630 2563 -6071 -13392 -16152 -18263
6182 -18263 -20067 -19909 -20042 -18994 -15358 -14427 -8839 -6090 -4415 5482 532 -15010 -9967 7915 2511
6167 2511 -3896 -9441 -6994 4423 9562 9337 -4807 -3311 -2036 -8728 -8223 211 -7284 -16318 -14320
6152 -14320 -13050 -13936 -7998 -1045 -5110 -8262 1015 3661 -441 -2396 -6498 -5548 -18474 -14938 -11227
6137 -11227 -18528 -19407 -16897 -3522 3236 4269 3401 -5139 -12900 -5054 4901 8248 4927 127 5525
6122 5525 -5477 -10956 -9358 -13590 -12130 -18803 -13929 4735 4441 -6750 -9533 -13796 -4731 -1864
6108 -1864 6403 14220 17800 12258 -3145 -6489 -98 1558 -8257 -3831 -5358 -2646 7158 5794 1902
6093 1902 4029 289 -6161 -24093 -31603 -24699 -16358 -9547 -3642 -3552 -22020 -21069 -16451 -23420 -23586
6078 -23586 -19467 -4417 -7603 438 5279 3799 17341 22139 25718 23623 16095 7347 77 -1456
6064 -1456 -8314 -8684 -17519 -6768 3841 13864 21903 5101 -1281 5738 1259 289 3283 -5525
6050 -5525 807 7331 10796 5115 -4223 -2771 -360 -4507 -7262 -6415 -5635 -9366 -2031 30509 35970
6035 35970 15477 -4012 -16631 -15372 -5042 -2980 -7136 -3778 -634 -6269 -12575 -7420 -6910 -2627
6021 -2627 5643 12450 8965 7240 20733 27861 25022 28792 19514 4106 -10720 -15454 5011 9795
6007 9795 5097 -1918 -16046 -14236 -19330 -24071 -22249 -25949 -30438 -28367 -21780 -24085 -32992 -27013 -21383
5992 -21383 -22760 -15072 -5432 -9452 -8945 -128 -1502 -9268 -573 12190 12859 1285 -7829 -6117 2986
5977 2986 12231 10766 9357 -8160 745 19105 12211 -6464 -9311 -8428 -8924 -9926 -4192 -2802 1859
5962 1859 1279 1752 2586 2961 -2274 -8182 -9715 -9271 -7853 -22382 -25141 -13359 -3160 -7039 -4944
5947 -4944 -9523 -20796 -32417 -24849 -16648 -10251 -12479 1392 1557 -3077 -8340 -7538 268 1070 -489
5932 -489 -2957 3852 9344 1821 -2849 -2947 -2539 -17424 -21054 -4367 -2971 3131 27736 18756 -5350
5917 -5350 -4635 -10052 -12112 -13796 -8226 17243 6448 5244 5170 -3411 -2890 -16144 -5992 4258 -2181
5902 -2181 10004 4080 485 -3219 -14609 -16951 -18725 -12404 -6986 -799 10132 387 -18994 -28832
5888 -28832 -21680 -9829 -5005 -3648 7283 87 -14431 -26959 -34975 -32739 -15432 -1446 -5465
5875 -5465 2322 2619 5318 5920 -17563 -30603 -22276 -7768 2366 976 -6580 -18441 -29336 -29124
5861 -29124 -7226 -2242 9431 24806 34914 29128 4737 -8440 -2381 -2693 -16320 -11589 -14539
5848 -14539 -17552 -20588 -11763 -3182 2190 -8810 -20348 -23801 -22224 -13845 -15466 -23770 -22367 -15334
5834 -15334 -22095 -18195 -19297 -4805 5524 4015 -12128 -17787 -23772 -18338 -6468 -821 13343
5821 13343 2153 3219 -3630 -16320 -34264 -30302 -17382 -11500 -6659 -12472 -17331 -32214 -29732
5808 -29732 -24139 -4263 -1381 -4885 -9121 -1879 12571 11705 3533 -4334 -3993 -6879 4928 4610 316
5793 316 1424 2621 5682 20391 25036 18471 7041 259 10992 3927 -13744 -19749 -15800 -20758
5779 -20758 -17967 -12406 -13160 -5662 1074 5282 3657 -9925 -14089 -2394 -4009 -11420 -5428 -7741
5765 -7741 -5944 9597 20257 6988 -12862 -10419 -11667 -11318 -22682 -15505 -7237 5263 8811 -5340
5751 -5340 -16036 -21309 -20563 -16256 -21395 -18090 -18928 -19116 -17384 -9761 -2719 -8324 -13852 -14159 -19411 -27436
5735 -27436 -38223 -29313 -22435 -10329 -8826 -17662 -21143 -14648 -7122 -16057 -12284 -13166 -22373 -18770
5721 -18770 -18307 -18910 -6565 -1552 11261 9716 7922 4561 -3961 -7342 -6161 -14019 -17044 -15919 -11624
5706 -11624 -22625 -13132 -5996 -13367 -25733 -17702 -10981 -9913 -2480 -5198 5123 -3729 -10699 -6903
5692 -6903 5425 241 -15074 -6733 3688 750 -11515 -24547 -19522 -19758 -6673 2842 5599 8979
5678 8979 -2078 -14446 -6709 -5205 -5365 -10997 -6917 2056 4180 -8436 -9810 -9087 146 5362 1279
5663 1279 -10261 -22730 -28806 -10336 1952 -10748 -7103 -5924 -2210 -4679 -4982 -3140 -1480 8367
5649 8367 20784 18530 9644 -3747 -15482 -28647 -16653 -11101 -7547 8240 14335 24563 18017
5636 18017 12248 2844 2483 6965 3379 7108 3081 1709 -4616 7310 5866 3324 -12149 -13284
5622 -13284 -7112 -6284 -35 -5884 -19524 -17322 -11862 -8323 -16339 -22195 -6941 9608 11803 9017
5608 9017 6582 12471 19582 11397 16334 16666 11145 5844 -1267 -3917 -4132 -10331 -29538 -15033 8733
5593 8733 41459 31519 -6415 -21006 -23473 -18041 -13794 -4419 3102 2184 3922 -10222 -26226 -27746
5579 -27746 -15766 -6753 -30506 -51906 -46576 -39970 -27251 -18455 -22120 -30143 -28772 -25933 -9971
5566 -9971 -5613 5779 5971 -15315 -27418 -22237 -21652 617 17670 15042 9110 7248 5966 -9773
5552 -9773 -4859 -8062 -1892 1706 -2395 -5052 -915 -5826 -8250 -8430 -8816 8227 16716 6454 -10785
5537 -10785 -9378 -21707 -24132 -29341 -38278 -38277 -19437 -6001 -10089 -16564 -15242 -6081 -9986 -16320 -27334
5522 -27334 -36587 -25735 -24548 -38130 -32917 -12384 -16387 -25120 -15738 -14077 -13291 -17465 -20649 -23221
5508 -23221 -24139 -24721 -15318 -8770 -15336 3167 4488 -1569 5198 9918 11557 578 1016 8908 83
5493 83 -14149 1532 9707 12788 16820 3148 -10541 -6948 4023 7097 -605 -6128 874 5059
5479 5059 -1779 -7205 -3968 -4879 -7034 -3556 -6649 -12205 -30681 -40961 -34944 -23039 -9113 -86
5465 -86 3654 5278 -6613 -31128 -23999 -13505 -5371 7392 10806 -4577 -9733 -2832 2316 -1927
5451 -1927 -1259 -5000 -11511 -13590 -12785 -13579 -1757 6845 -3782 1377 20808 23200 17271 12912 7369
5436 7369 11192 -184 7084 3375 -44 -1761 -23142 -14383 -11941 -15912 -12153 -12912 2862 607
5422 607 -5347 -17905 -14297 3567 18088 23732 22672 11348 13848 13364 15635 6913 2729 -2033
5408 -2033 1789 12602 15890 1399 -2863 -8529 -15910 -13985 -9282 -4407 8771 23322 29681 15433
5394 15433 8390 3434 -2621 -3015 -6375 -3810 567 20 -8855 -15070 -21458 -23867 -26694 -14965 -2583
5379 -2583 -681 7724 -1026 4166 6012 1712 -12142 -8623 -6960 -5085 5695 14508 1846 -3407
5365 -3407 -3142 -14216 -18275 -9877 -215 4998 365 3093 3717 -3156 -1642 -12974 -27312 -33516 -16174
5350 -16174 -4813 -13904 -34781 -43657 -35027 -13758 -3153 -13058 -14761 -10106 2193 3444 -746
5337 -746 6904 -354 -13102 -20996 -17081 -11891 -9907 -1372 -6271 -2907 6619 1833 854 8387 10604
5322 10604 -2655 -16603 -9843 -2554 7284 12199 27098 19024 -2842 13101 14539 10569 21342
5309 21342 16012 5808 5154 15914 9227 -12165 -19472 -9300 864 10708 7790 2375 -1890 -1567
5295 -1567 -17895 -22836 -19398 -7444 -6092 -2558 11838 3601 -9637 -3473 -2715 -21139 -29843 -20288
5281 -20288 -6431 908 7645 1586 -6878 -8356 -8026 -8067 -2006 -1138 -1422 -14665 -21351 -18806 -23106
5266 -23106 -13899 -1327 8589 -956 -10604 -14633 -22512 -15359 -9507 5913 13328 -780 -15580 -13596
5252 -13596 -14553 -10587 -24200 -32104 -29057 -22572 -25414 -16095 352 7315 6126 -5448 539 12134
5238 12134 4858 3801 3310 4174 3365 2056 5219 -5028 -26289 -23468 -10977 -7213 -12898 -7492 -8475
5223 -8475 -11348 -7250 -9512 -4065 2972 12204 9138 6641 -6992 -13341 -20782 -26467 -30811 -15203
5209 -15203 -11704 -21219 -5142 -9261 -4763 9787 9015 11640 -1023 -13147 -6080 -12087 -16972 -13283
5195 -13283 -3714 5049 -703 8095 -508 -17066 -14351 -9842 -6958 3923 16345 15072 2780 -4807
5181 -4807 -20682 -19997 -19555 -14317 834 -16664 -36225 -45980 -48658 -42552 -31764 -24489 -23367 -12000
5167 -12000 -643 -1919 992 -4898 -7027 1257 -3152 -17073 -11907 -9794 -7171 -21581 -28043 -16296
5153 -16296 -7673 -784 4195 -3562 -7523 -15586 -14237 -4713 8396 8321 -5372 -11302 -5237 -7502 -18024
5138 -18024 -14901 12279 16008 14727 19707 16307 11935 3478 -2654 -19656 -25133 -6854 -3062 -12
5124 -12 -2761 11368 23633 28899 24577 20936 20830 18622 1144 -8253 -6097 2862 3134 9891 6224
5109 6224 9982 7635 8733 -3134 -2661 425 2251 11140 14112 4318 34 7716 18052 10631 1396
5094 1396 8104 9870 -4682 -17153 -23901 -15738 -13167 -12778 -14363 -17262 -19962 -22648 -17559 -17993 -9140
5079 -9140 2526 -1018 3544 12085 10214 -5946 -13302 -2559 9283 7328 -3413 -14892 -10957
5066 -10957 4283 5622 3334 3976 10205 6810 12577 19433 29784 20232 9515 23724 19644 15894
5052 15894 21421 3010 -17686 -18134 -9975 4425 17425 13285 -1949 -11952 -16702 -13412 -21676
5039 -21676 -21317 -28960 -25385 -17901 -17099 -13142 -3906 13742 5773 -6552 -8982 -5719 4014 -2556 3485
5024 3485 16303 21169 22570 12464 6413 15286 12025 -3354 -8444 -12621 -12989 -17527 -13504 -95
5010 -95 12370 6552 -946 -4610 -8575 -8287 -2115 9795 14555 3915 -3358 166 -6126 -8768 -6893
4995 -6893 -3121 -12044 -8687 -9792 -6195 1821 4321 2905 2531 3284 -6657 -15126 -9821 -5646 -9271
4980 -9271 -2305 9829 20358 20695 18351 16002 8181 6689 20674 22173 8465 864 -395 15676
4966 15676 26276 15906 -9316 -25855 -28067 -17570 -17725 -15809 896 12737 6163 -1270 418
4953 418 -5432 -1829 -332 -14657 -15883 219 6710 2199 -12518 -17956 -10313 4530 7453 -4008
4939 -4008 2785 9722 7282 -12511 -18383 -21543 -21570 -28516 -29450 -27783 -6053 2229 1451 -3052 -12607
4924 -12607 -15282 -2445 18824 15601 10868 -9153 -17504 -12096 -8010 8244 7882 15266 15298 642
4910 642 -16576 -10439 -2539 -9682 -7567 -6597 -16130 -14889 -1342 22402 35035 25197 7040 -10675
4896 -10675 -15213 -8771 2294 1294 -9499 -13693 -22658 -24437 -8682 5507 18145 -9564 -27879
4883 -27879 -27404 -35732 -31912 -18087 -15566 -12388 479 14191 23363 24126 25083 25150 15087 6607 3162
4868 3162 9136 2310 17457 14575 192 -5104 -10929 -11732 -12456 -17478 790 8567 620 4426 1751
4853 1751 6295 20117 13884 9593 10932 18204 6939 -9942 -25321 -19653 -11387 -14933 -15766 -15761 -4961
4838 -4961 1658 5631 12311 10910 -3127 -7317 1983 3998 13759 12981 -7854 -10947 -13196 -5891 -14843
4823 -14843 -17001 -2068 510 9350 13044 7544 -2188 -6571 -1001 16108 14126 14155 4650 12193 29783
4808 29783 26307 11026 5661 3284 -8250 -14919 -10232 -3910 -9712 -18707 -27041 -36957 -30551 -23500
4794 -23500 -14138 -3403 14412 7257 5258 6890 4219 -13583 -19843 -21174 -22338 -19287 -11754 -5671
4780 -5671 647 4415 -2630 -13632 -17333 -6985 -4946 3616 -7188 -13590 20356 29901 18726 7396
4766 7396 2395 -270 6338 13121 12765 15649 4563 -12607 -5541 1846 9402 10273 588 7517 9661
4751 9661 13010 9777 11791 13167 8711 -2254 -6999 7381 -1653 -10120 -1308 5189 14972 -3412
4737 -3412 -11415 -138 -3667 -16797 -30109 -32480 -20702 -3472 152 4740 4116 8839 5914 -1756
4723 -1756 7048 13275 11319 10034 4925 16538 20559 -152 -3256 3770 15739 17619 4377 -11193
4709 -11193 -5588 8154 15829 13314 20052 12611 -7231 -7162 -4460 -6793 -2068 188 -11904 -12325 -11679
4694 -11679 2954 11181 4335 -12346 -5376 9403 14026 4829 4338 18444 15936 18818 15092 -1792
4680 -1792 -670 8777 25362 18346 487 4028 -2637 -17345 -20446 -20735 -25758 -18773 531 13368
4666 13368 7667 -1110 -17829 -16426 -8171 -1987 2655 16744 1801 -7999 -7562 -9520 -22421 -31996
4652 -31996 -11155 -5594 -4212 -10571 -12957 -10243 7969 12439 6546 -650 -1543 3403 6268 3091
4638 3091 18544 23282 18622 17222 24075 23370 17896 34465 36847 12990 3220 -6284 -5757 2117 -3374
4623 -3374 2454 13778 4319 3608 5325 -5210 -577 14487 7716 7316 6235 3737 17202 22338
4609 22338 19946 13634 -5949 3814 21175 18019 16307 -1216 -15811 -12175 -4856 -11913 -12696 -13142
4595 -13142 -5643 -1889 7459 -865 1548 19004 10297 -2249 -6000 7900 22372 19215 8901
4582 8901 -1720 -684 17056 8022 -474 -4345 -3973 -9881 -3696 -853 -1340 -4197 -6956 -2424 -812
4567 -812 10756 7399 1027 -3263 -1852 -26600 -39638 -19192 6863 8121 193 1681 9795 12653
4553 12653 14452 5529 12045 3958 -6678 -1293 8927 14321 4402 5335 8964 11825 16663 -116
4539 -116 1037 3046 4530 15950 24426 5770 -15135 -15217 3319 8793 4745 10748 15257 16908 11088
4524 11088 2584 -5227 -5737 -6945 -8824 -8274 -19599 -21526 -19196 -6643 8249 4213 -5291 -9270
4510 -9270 -6768 -12673 -2480 6257 14589 16681 5893 10323 12928 9558 11671 4470 -5462 -8112
4496 -8112 638 6773 6197 -7376 -11552 -27908 -20324 -12577 -16693 -14793 -16380 -23004 -12354 -14535
4482 -14535 -16266 -18233 -25190 -23272 -27310 -27965 -33734 -41228 -36854 -21138 -9423 -7448 9681 17540
4468 17540 11643 8998 13891 11379 1775 -4567 -3833 -2769 -8413 -5020 2948 11638 9212 1579 6067
4453 6067 14355 13549 5056 -6573 -14215 -15537 -18679 -12643 -13053 -10737 -349 -6950 -13270 -3087 -9347
4438 -9347 -14970 -18209 -8887 -2131 1838 12259 6506 -6706 -620 6472 3912 2705 179 -7592
4424 -7592 -15231 -7358 -13445 -7474 -2676 -5221 -229 2891 170 11700 24063 8700 -9806 7844
4410 7844 11993 1806 -9992 -9973 -46 -14595 -21789 -26563 -16949 422 -5246 -5672 -1743 -228 -8603
4395 -8603 -8028 4539 13477 10568 9668 6496 1804 445 3615 -2737 -1584 -14042 -33713 -26522 -18988
4380 -18988 -7148 -13673 -6410 211 471 -3443 4309 18973 17834 -3699 -1549 11205 21311 8876
4366 8876 -3154 -16916 -8152 855 10014 10829 17712 15214 2737 -13037 -5924 -15999 -37888 -44066
4352 -44066 -49335 -63004 -51349 -35762 -24594 -16471 3649 10909 14333 13518 3009 -481 -6205
4339 -6205 -28903 -33692 -32690 -36038 -34165 -20264 -10843 2661 10356 9873 15431 16382 11730 -4292
4325 -4292 1470 -832 4033 7977 4875 -355 3050 2884 278 10925 4417 -4923 -4483 4176 1199
4310 1199 625 -4613 4025 12245 15701 27567 23191 20926 12253 8047 10708 5039 -1528 -13680 -22546
4295 -22546 -14776 -6777 -19117 -9898 -1868 -5488 -8522 -12976 -1275 4591 -7901 -9148 -4002 3037
4281 3037 -815 1369 11049 -2293 1424 3296 8718 20402 6599 -2277 -1944 -10607 1888 2786
4267 2786 3792 8937 7162 10707 18637 12656 1972 1122 9286 9051 5527 -3374 -10061 -9402 -15408
4252 -15408 -22309 -31139 -27115 -14621 -8665 -8797 -5987 -1862 -3139 -6364 4573 5393 11737 14231 17898
4237 17898 6572 3681 -5578 -12021 -10718 -2342 11313 20069 10745 10060 11437 6232 6989 3565 -7148
4222 -7148 4352 12753 -8899 -19775 -11514 -7916 4445 21289 21554 11752 9301 -372 -24137 -12935
4208 -12935 15292 4634 -2786 389 20695 21390 18635 30657 31399 19463 15040 5251 7949 1537
4194 1537 -2839 -977 1476 2506 962 4063 -3362 -8285 4788 17079 6236 3098 1062 -3427
4180 -3427 22703 31943 28616 20543 13875 8610 5522 -13920 -21644 -7191 1923 745 3022 6443
4166 6443 21194 16370 15611 18382 13146 17256 1192 -3941 217 9575 3199 -809 -3053 7408
4152 7408 11346 6154 10603 1533 -9944 -3979 -7602 -7483 11277 7229 15396 7564 -144 7107 4813
4137 4813 -3787 -701 -4451 -12371 -11653 976 1069 5205 12990 10974 -2035 1533 10841 -1159 -2084
4122 -2084 3313 4995 14924 26011 20141 11162 -4238 -7319 6190 8043 2609 -6244 -5845 8943
4108 8943 11710 1968 -9052 2617 780 -9426 -1603 6782 8286 8380 -7040 -708 7415 18065
4094 18065 16767 13397 4840 3490 -2152 -2576 119 -529 6118 1113 -7486 -10686 -14588 -7249 -12807
4079 -12807 -7359 -5660 -3159 -3033 -286 2196 4010 14873 6786 -6133 -8650 -8820 -3809 13013
4065 13013 13155 13364 11510 -19 -3200 13231 23502 28190 5672 -7939 3857 6038 11456 16622
4051 16622 14249 7643 5461 351 -592 13489 9309 -4978 -5155 -9319 -10758 4679 23297 18831
4037 18831 12085 453 1843 3639 -1727 7584 3307 1568 -6665 -5588 2636 6281 4502 1968
4023 1968 -2976 -12682 -4637 10758 17971 2506 -11222 3310 3706 12046 27382 18531 13140 21960
4009 21960 12762 -12990 -4479 5513 4459 -646 700 2447 -96 -9970 -3503 1088 12944 16851
3995 16851 25916 25192 12672 -5780 113 16573 20926 10125 14487 20061 22103 16782 2267 -9942
3981 -9942 -14137 -20454 -22064 -16699 -11161 -4843 4044 -7857 -12276 -3565 -5568 -4229 4176 -6853
3967 -6853 -10038 -4167 7213 22219 17661 8501 5378 17213 15118 6201 10008 5201 7272 6294
3953 6294 12281 17186 11998 -4470 -8997 -16708 -12961 -1356 -1444 -4082 -11174 -6759 6039 9830 9081
3938 9081 17535 16169 20699 25328 25657 17541 3430 1668 8142 17228 10719 1678 1943 0 5652
3923 5652 894 -4396 3044 -5636 1255 -1991 -1854 3119 22305 36024 21123 -3150 -13484 -5437
3909 -5437 1789 -6967 -10609 -12587 -21232 -34598 -45205 -44281 -42283 -38757 -28794 -18194 -29863 -32292
3895 -32292 -19829 -8084 -15425 -16784 -12574 -22273 -28630 -23502 -25332 -20534 -18134 -22569 -19321 -20973
3881 -20973 -10208 -1731 -11997 -15880 -19963 -15192 -2326 -3324 888 -734 4000 9033 20867 24297
3867 24297 18490 14058 15003 5634 5426 -6752 -2553 13849 17520 4044 -2049 5459 13663 16446
3853 16446 16052 5498 7232 20134 27125 21970 25787 23837 12501 16558 20732 22592 22758 15957
3839 15957 22332 32201 30208 16653 17707 16810 10815 7073 -2764 -4196 -13767 -16483 -13481 -4049 1568
3824 1568 -3093 -9261 -2770 -20482 -14735 -10590 -19419 -16801 -695 -4287 2079 3467 1206 9565
3810 9565 2131 -662 6155 14198 14420 11260 12939 15204 21312 23133 18565 9652 936 495 -5987
3795 -5987 -2449 8134 20214 16889 19613 3987 -15866 -15914 -4488 -5466 -6240 -2089 -10184 1338
3781 1338 14304 20162 14335 29833 27247 20620 10185 -6262 -23241 -23760 -14963 -11929 -2561 12630
3767 12630 12485 10030 15200 7036 -7300 -17926 -16950 -3074 -3504 8185 16838 23715 38674 56571
3753 56571 54478 41152 42644 28540 1939 -564 -12785 -27267 -22435 1185 15455 23111 18437
3740 18437 25734 35382 17258 -1240 -9743 -19362 -15880 -13941 4570 5764 8186 4738 1074 -5617
3726 -5617 -20775 -9793 -28112 -20018 -4611 -2097 -6625 -3870 7569 21656 14689 -14654 -24834
3713 -24834 -19680 -4821 10664 7058 11473 4058 -10465 -24161 -17241 -2761 -6807 -10342 10235
3700 10235 15014 2899 -3786 -10734 -8514 -6862 -4935 -841 -4216 -4499 9880 25584 34465 27623
3686 27623 28606 33476 26260 12202 -10076 -17597 -13285 -1696 317 1742 6835 12289 15584 24584
3672 24584 14460 16136 12203 5374 -1396 -7919 -5163 -9405 -10349 -15510 -24336 -18843 -11568 -2645 18528
3657 18528 30755 16727 19181 13445 14406 23360 31700 28135 17672 15473 27239 25325 5565 6298
3643 6298 6751 11023 -4537 4103 5458 -2432 8496 -3641 -1943 933 14691 5945 3396 12698
3629 12698 21093 10106 -824 3206 -2128 -15510 -19271 -23916 -12662 -15542 -10443 4658 243
3616 243 3896 4278 11397 14158 15103 -61 -1507 7782 16629 8827 9845 9301 5186 -4326 -3277 3334
3600 3334 11459 6364 -11240 -14221 1260 -255 -10751 -14649 -17925 -18790 -12700 -4993 5382 -1032
3586 -1032 -8299 -2587 490 -7986 -8914 -20096 -27101 -30578 -19647 -9753 -6749 6969 2008 -19081
3572 -19081 -20927 -17505 -1794 6714 -5691 -20471 -23400 -12969 -550 -13921 -12059 -1787 5858
3559 5858 16807 22244 18417 15969 9648 25958 27541 19006 10566 12008 5719 -5063 -8259 -9258
3545 -9258 -4295 -3517 -4909 1350 18588 7286 -1337 -5669 -8376 -6822 2236 3537 33 -1039 -4331
3530 -4331 -13316 -6836 -3454 -10108 -3788 -2627 -3585 -8312 -9687 -16903 -8982 2004 -1871 -8383 -736
3515 -736 4440 6947 -7521 -13331 -12990 -23465 -11707 -9258 -2305 11179 11040 12566 16562 31520
3501 31520 33568 29424 19926 9172 7847 4339 -7945 -9518 5971 21938 10141 6716 7511 2669
3487 2669 8490 16482 21636 20432 14319 4940 4019 893 -1242 16793 27156 28369 14918 14976 13718
3472 13718 19138 13799 21424 13821 5122 331 4744 18070 23380 27110 27373 16877 1980 9552
3458 9552 3301 -7517 660 2439 -4130 -518 9521 3201 -354 5564 5091 6204 8730 14492 18469
3443 18469 19236 445 -7462 -5270 499 18239 28916 40021 41481 26926 11486 -4267 781
3430 781 12746 3368 4675 6800 4437 7011 14874 4505 -2857 -14358 -27675 -21570 -18213 -10616
3416 -10616 2995 2586 5419 7430 6362 12521 8561 534 2201 -1702 8612 11590 16038 25388
3402 25388 16101 -867 -3081 8511 3714 -2944 10196 8881 11873 6251 14104 14001 6410 4067
3388 4067 -1837 986 715 -1501 9329 6527 4175 -1224 -964 12612 19209 14692 7566 1832 -1426
3373 -1426 193 4307 21523 15274 14289 7826 5561 10875 5813 345 -5631 -16329 -19314 -5944
3359 -5944 2572 939 -5294 -4513 11480 10907 10184 9347 -879 6815 16442 8208 10309 6289 7443
3344 7443 4686 16293 11573 19950 20114 10616 3408 2731 12298 12138 -4687 -2185 8378 3762 -772
3329 -772 -301 6820 16356 9233 3589 -1919 12776 23141 33630 28988 21618 2799 -13960 -14663
3315 -14663 -19278 -15848 -2835 12749 28472 23699 21363 24147 19585 13313 -2153 -15963 -17100
3302 -17100 -4685 -1976 17058 24668 22498 28147 20142 -4763 -11009 -23752 -23213 -10757 -1157 -1683
3288 -1683 5567 5636 -12330 -17657 -12146 -5514 -2275 2628 -4367 -7563 -18026 -28577 -17364 -2722
3274 -2722 -263 -11255 520 8321 16371 10686 5913 -1620 -9597 -2344 2966 2398 6697 -3557
3260 -3557 -4011 470 22810 17263 30013 32261 25475 18519 -1982 -876 10464 8257 -4907 -11455
3246 -11455 -17727 -21690 -30986 -25970 -20221 -17103 3642 13132 8785 11471 8924 -9287 -11886 -15307
3232 -15307 -1772 26174 27720 7976 -8815 -15167 -8612 414 12280 15400 9171 2916 -6062
3219 -6062 -15997 -12056 -16442 -10528 672 -3210 -750 9454 -3818 886 -2995 -6287 5976 12590
3205 12590 17744 20637 18476 23238 17751 7836 5152 12318 13065 9870 15563 19161 12628 8010 2012
3190 2012 -5755 -3455 1161 6003 -3437 2481 -2122 -7499 -8945 -9226 -10555 -22836 -14165 -3908 2572
3175 2572 6146 2144 1907 10584 5496 4499 17251 17768 18862 20468 26181 22350 20154 19249 12174 2587
3159 2587 7609 14088 24206 19593 22696 22194 -6707 -23284 -14689 3919 10217 13234 187 2983
3145 2983 10954 25582 11895 18555 26975 20922 13255 8888 4520 2472 -1466 1437 6802 15225
3131 15225 19282 30728 25985 15729 10092 8201 -4623 -2131 -1836 7938 6999 -2569 -1831 -10095 -19107
3116 -19107 -17183 -19830 -16041 5245 1958 12292 23026 24312 6940 -1736 -10012 -10317 -14925 -7868
3102 -7868 -11242 -21563 -28591 -20654 -22449 -11603 15138 20755 20815 14293 2226 -348 10177 -1702
3088 -1702 -9723 -12095 -6880 -13164 -25841 -639 12720 12453 -2604 -10957 -17228 -17320 -7818 7892
3074 7892 3399 -9936 -16084 -13147 -11523 -11080 -12201 -8935 -7830 -7539 -14678 -13684 7934 -2315 -12199
3059 -12199 -12468 -7757 -13768 -2702 3863 1854 8905 16401 24596 10003 -11625 -16135 -20191 -12400
3045 -12400 7732 6843 4654 1459 -3342 8219 22970 20804 14355 10188 7072 1769 -3823 2173
3031 2173 -11526 -18669 -20869 -23832 -17987 -2797 8706 10640 12442 22021 19919 7226 724 -1346
3017 -1346 -1365 -3773 660 -6438 -2580 2737 -7140 -4469 -1818 5458 7142 11667 5499 6651 -5695
3002 -5695 -18354 834 3530 -1984 -5427 -3132 16 -3051 -2615 1860 4633 24633 25532 21452 15094
2987 15094 4804 -5132 569 3381 20399 18729 7382 -1481 -6567 3822 23723 36339 36954
2974 36954 17951 -110 -1701 -5129 -7258 6674 12097 16431 3066 2733 8608 11147 15727 7835
2960 7835 -5419 -26374 -27222 -15638 -17610 -13391 -1671 -3751 -14993 -11210 -1158 -2393 3974 -10518
2946 -10518 -20908 -11075 2662 -2746 -10910 -21674 -10915 -8290 -12063 -10797 -15634 -6922 1849 -242
2932 -242 11628 22389 25591 15964 1091 8739 27003 34230 34010 19683 15684 19274 21232 9727
2918 9727 2612 16500 12517 3939 9419 16891 9535 7631 2538 19636 26854 15610 -369 565
2904 565 2510 8708 6964 -7598 811 5260 781 -13489 -8148 4564 15209 3614 10748 10433
2890 10433 -2672 -11011 1789 10269 2061 13656 21573 20486 11296 9522 11273 7833 5205 6367
2876 6367 -1953 -4360 -2352 -6874 -10991 8607 18795 24299 10396 -3056 -7888 -9082 -4679 572
2862 572 1977 -5195 -3435 -4907 -9608 -4000 7756 14039 22227 11217 11281 10994 3013 -7277 -3771
2847 -3771 3113 -2900 -7033 -11552 -3819 -3226 -14596 -13863 -23404 -23931 -12111 -7406 270 15436 12149
2832 12149 11832 17362 24595 3797 -16208 -14583 -2332 198 2902 -3524 9929 9384 6708 11387
2818 11387 13993 9183 -3247 -7964 -15405 -4847 4357 6002 1071 -187 765 725 -2563 -4409 -5867
2803 -5867 -6781 -521 3677 1284 1088 -4089 -3711 -842 -1461 12481 13693 12701 2793 2068 8285 18274
2787 18274 27223 27914 28200 14358 6536 3274 -583 12059 7059 1333 278 -2754 511 10998
2773 10998 16519 12902 3512 3519 2989 -7742 -12645 5536 20699 13655 -686 -4327 1393 10239 24976
2758 24976 22808 10720 -4032 -10039 -19729 -12878 -1895 12351 4716 -20686 -19686 -4071 1693
2745 1693 13211 11295 16007 26047 18090 12673 6330 1936 13294 19222 19307 4707 2769 -8634
2731 -8634 1721 14223 20041 1649 -3824 4802 -359 7639 33507 40383 19278 2376 3088 5394
2717 5394 3229 -10666 -13223 -18428 -5699 7918 -1256 -8768 6510 2639 1156 11794 19556 10807
2703 10807 7586 10727 13245 26882 27907 13842 8142 4549 -14457 -23482 -29468 -26537 -12452 2985
2689 2985 13181 4490 9925 7131 -1803 -22723 -29757 -27431 -29323 3095 20780 29295 30590 20857
2675 20857 17488 8568 12090 17208 19874 14513 26448 27221 17293 5283 -1328 3718 3210 -11223
2661 -11223 -5351 -11096 -64 5588 280 102 4342 1533 3175 5216 -10942 -12611 -8360 -2559
2647 -2559 4512 623 3773 1771 -1098 5118 5855 4711 717 -6077 -1189 10544 2782 -10905 199
2632 199 8636 20591 23167 6993 5632 7701 5662 1714 -221 5342 13824 13800 -9211 -25274 -6054
2617 -6054 1184 595 -7446 -2895 -9175 -15606 -2094 4210 4786 5689 14507 19191 8631 -1056 -2591
2602 -2591 7968 10017 710 -10048 -14257 -4957 10103 25610 23699 13812 2509 -3710 -4634 2635
2588 2635 12801 -912 -7483 -7226 -2377 -2935 193 -1456 13456 31361 17547 -106 -2202 -10013
2574 -10013 -7312 -2280 17673 24684 24081 18146 524 -4742 -9892 -7845 9837 15783 13760 1733
2560 1733 -1833 -3746 -11260 5375 6415 -9298 -15920 -27247 -33347 -35272 -37831 -27440 -13754 -9719
2546 -9719 -6855 -1229 -215 -5592 2536 4712 12770 25410 21705 14542 8155 8706 4293 -6048 -9170
2531 -9170 -7734 -8746 -7099 1779 15756 31317 32065 26908 11135 -23 -3290 -4088 1668 -5184
2517 -5184 -9208 -7027 2365 1176 -9136 -17996 -20047 -1692 2951 13035 15797 22832 23600 10330
2503 10330 12827 22139 11964 24 -3411 903 8390 -6508 -1166 13926 13888 13215 154 2797
2489 2797 11436 10142 3107 -9020 -11405 -15354 -7069 -46 7349 9900 5445 20373 28058 21209
2475 21209 21383 15984 21562 23754 21158 25567 19604 23572 10931 3411 3502 -169 6747 5271 -6108
2460 -6108 -29935 -31262 -23293 -22710 -7087 9 1206 -3488 1940 1459 4958 11929 1748 -4442 -6841
2445 -6841 -11374 -20527 -28526 -28614 -16678 -12454 -8464 -2169 1955 4237 -4826 -4369 -12763 -18811 -10773
2430 -10773 -10167 -18294 -11159 -9032 4557 14417 10566 3539 16256 26588 18386 6634 6504 13777
2416 13777 19386 12821 1371 15171 19258 23458 17659 20171 5037 -11484 -1714 12778 6576
2403 6576 7620 10835 5557 -2289 5224 7071 3539 697 4871 -7778 -1410 8561 7340 -170 -5803
2388 -5803 -2891 -897 -1629 4972 -470 15780 22864 15496 -9368 -19599 -17511 -7018 30 7375
2374 7375 6890 6511 14795 30447 33490 13280 15055 30992 35255 29132 27012 30173 18714 13220
2360 13220 11339 13583 13689 7825 3747 794 4556 -3489 -9895 -3615 -4425 -5685 -2660 2891 5737
2345 5737 8257 16578 13158 6739 -5980 -8156 4820 10636 6834 -2883 -6399 -8977 -6242 5941
2331 5941 651 -4289 -7044 -14698 -24055 -19764 -19083 -19026 -679 2741 1789 2733 2266 -2635 -11303 -11416
2315 -11416 -5425 -4061 671 4307 721 9078 4774 -8658 -12761 -4056 3937 5574 1099 11131
2301 11131 1821 -15093 -6312 9196 442 2063 16781 4240 -10010 -9656 -13581 -11377 2256
2288 2256 12587 10691 10819 11624 11079 6086 -4595 -7116 -19950 -23955 -24393 -19112 4182 16271 18908
2273 18908 12377 2472 -1735 5402 12347 -1471 -18546 -13891 5485 7327 5758 13743 4742 1755
2259 1755 994 11533 17668 15763 25127 39958 32297 18241 5190 10092 8554 1341 20024 23970
2245 23970 10445 1827 -5558 -12113 -4791 4419 8585 15911 12565 -541 -17155 -2013 4604 3854
2231 3854 9428 7839 9133 14785 16261 15530 3794 5385 2537 7695 7987 2761 1195 -250 -6532
2216 -6532 -5239 -7498 -5186 2162 6807 11603 11461 7826 12080 12229 19446 27927 17426 3153 -6055
2201 -6055 -4985 7451 5188 3516 7336 15122 6086 1695 3962 3547 3564 18992 16981 4657 8108
2186 8108 17732 16853 17442 9337 11259 2440 2056 9749 18792 -1134 -7385 -6269 -12220 -9530 -6274
2171 -6274 3852 7305 6737 8555 6751 6131 8634 19668 16420 8841 10217 13964 8680 -1977 -7027
2156 -7027 -5725 -3533 6107 26679 20566 1850 1470 6384 -9418 -16751 3357 7521 -10864 -19560
2142 -19560 -21702 -18802 -11571 -22134 -13112 -5742 3312 1983 8993 -7266 -21594 -25037 -11099 4650
2128 4650 4430 12454 9108 -1626 -4424 -6865 -16621 -7433 11273 25953 32059 22655 13184 -5119
2114 -5119 -2688 -3211 -3723 1984 -2557 -6807 7710 25841 12035 4980 19499 15562 -1308 -6901
2100 -6901 -2506 -3343 -3186 1240 -4682 9165 10470 16866 11864 12076 17080 15014 -4886 -2235 -1895
2085 -1895 -8597 -7395 -5959 7670 15397 5277 12543 3549 4541 10698 25626 9572 1054 2005
2071 2005 7604 12916 9763 6699 10849 20152 20012 19035 23560 23366 19985 20865 22287 9682 -1809
2056 -1809 -2810 -4730 -3203 -2398 -464 14654 34386 23660 11837 8694 11976 7884 19250 24960
2042 24960 12783 6270 1564 2931 4662 11756 16461 8475 14546 14557 19067 26970 15802 -9056
2028 -9056 -8572 510 595 -1295 7012 26472 35145 21359 2506 -10701 -10861 -16711 -17522 -14402 -7128
2013 -7128 -800 7035 17497 16533 -2140 -12210 -11646 9442 27500 20741 6146 14895 20986 12238
1999 12238 11858 8238 -2681 -2403 -13418 -11879 -16121 -15224 -6977 6175 9575 2231 -551 6634 -7682
1984 -7682 -7826 10877 8491 -3136 -7110 -2270 12862 20536 10684 7185 8735 -7555 -25434 -22860
1970 -22860 -18913 -9580 536 3663 -2948 1332 3966 11410 1304 75 8834 4008 12531 -3392
1956 -3392 -16669 -10922 -6695 -8222 -2413 -2040 -7008 -1271 11992 19009 10728 -3021 -6471 -2516
1942 -2516 551 3616 11784 -2866 2502 11838 14279 18671 -3259 -8028 -3196 10443 18119 14214
1928 14214 13159 24965 33601 29765 11664 -4213 2482 10629 10601 804 10740 6856 -9501 1993
1914 1993 16282 7703 13381 6539 -5588 -3193 12985 21276 24122 -2113 -10618 -14291 -1708 6943
1900 6943 2180 -13312 -16768 -20754 -14560 1704 7275 814 -8133 -14114 -10684 -14765 -19885 -17616
1886 -17616 -697 11524 9314 -9762 -17367 -7971 -7756 -4237 -986 -5549 3203 -1137 751 20491
1872 20491 29795 16173 12774 3959 -6156 -16205 -18268 -19568 -11168 -8925 -7520 -11594 -5577 -6383
1858 -6383 -5480 -7623 -13029 -15266 -11213 -8211 -8661 3376 -2616 -17062 -15202 -8323 125 9216 39166
1843 39166 23585 13198 12129 21276 24339 17983 17531 8977 4376 9487 10165 -6953 -13391 -10686
1829 -10686 -5708 -3954 35 -10579 -13179 -13180 -8879 -1723 2957 -2689 5661 17516 13473 6228 17358
1814 17358 16015 11160 6665 6926 18240 32011 16452 -6396 2390 15735 21270 12259 8949 9681
1800 9681 10306 7917 3665 -3335 -2224 7762 29302 24847 3660 2961 -10162 -18675 -8124 -16953
1786 -16953 -31285 -22960 -6582 -9944 -1063 1772 -1629 -13255 -1925 4308 -4924 -8743 -6631 -6561
1772 -6561 5377 26683 18528 3418 -4079 8783 21017 3570 -14210 -8141 4573 2879 -5056
1759 -5056 2388 7005 -2173 -653 9898 14551 -3200 -15781 1950 17401 28804 19277 17096
1746 17096 8661 5126 2922 -8664 -10851 -21534 -28288 -25301 -21465 -23905 -8342 -3609 -681 5783
1732 5783 7578 -446 -16150 -14251 -26934 -43169 -29919 -8510 -3300 -7833 -3316 26154 33531
1719 33531 17467 13718 16826 7322 2326 722 3636 14616 11821 11853 2133 -14319 -13681 -221
1705 -221 5583 -2120 -1290 -5664 -18072 -27705 -9515 -1038 1004 -9123 -6577 6324 18949 25548
1691 25548 18876 13862 10924 3615 2381 4154 -9198 -19527 -20551 -16000 -8396 -21099 -13404 -1803
1677 -1803 11949 11123 -10593 -21097 -4097 5251 8014 5637 12222 12519 8573 2226 -188 -9450
1663 -9450 -10353 2797 -8066 -19332 -14448 -500 6197 -1205 -9045 11608 16579 16118 9839 -6889
1649 -6889 -5181 -1606 -3488 -11723 -9880 -23458 -28578 -26941 -14162 -8204 -6606 3608 5339 3849
1635 3849 2887 9427 20074 21701 7352 -10858 -4956 3575 -5098 -513 -6721 -11536 -20239 -13633
1621 -13633 -3228 2619 13942 7694 15037 9918 5578 -4393 -8003 -12824 -4544 8861 18059 3128
1607 3128 -1659 15198 16600 16383 11460 15367 10356 23894 27827 17454 19795 21838 16706 9249
1593 9249 7918 13337 14403 10090 3046 8899 10774 922 -1014 -5701 -7346 -1819 19295 23926 9635
1578 9635 -6020 -7968 -11338 -10628 -15506 1673 20266 16517 5581 3849 -6171 3500 -1308 -225
1564 -225 4554 3748 2421 6274 624 -3603 2072 7684 19586 21093 15352 8813 8552 453 1408 5395
1548 5395 4332 5477 19577 21153 20417 18443 18177 11356 -4428 -2897 6012 3287 -12972 -12019 7028
1533 7028 19722 16635 20003 22795 8419 12442 11228 26333 11254 -4521 -17914 -20602 -7932
1520 -7932 6027 5594 -7454 -8215 3339 8299 9179 3399 -2842 -1676 -15478 -24965 -27141 -17043
1506 -17043 -22841 -31105 -36025 -15428 -121 3496 1137 -3617 -3796 -2360 -4825 -12389 -4920 334
1492 334 61 -2658 5254 16770 5540 2037 -2548 -17484 -14557 -8124 2814 5030 1229 2552
1478 2552 -12916 -11032 1040 8676 10905 7825 14379 23167 28043 26586 6886 -11351 -2537 -1084
1464 -1084 -1132 1467 9295 11676 6685 2088 3396 7700 1496 2603 -1895 2673 -5868 3260 1298
1449 1298 -2131 -1324 -9137 -12708 -9643 6824 1884 -1537 4773 -171 -1672 -4544 -572 -2467 -4008
1434 -4008 -4081 -8813 -1190 16231 17608 4083 3636 18163 15757 7297 9766 6704 -3974 -19268
1420 -19268 -18516 -14759 -7325 -3834 -10342 -31815 -29316 -13408 -6807 6037 -4481 -10113 -12638 -9513
1406 -9513 -1919 -4622 -8734 -10536 -7393 -7840 -5370 -3118 -2261 857 6577 1951 -371 -3140 4789
1391 4789 8560 6662 16039 14954 9505 4945 20258 28108 11915 -4273 -10817 -8617 -9138 -26322
1377 -26322 -22700 -33366 -34206 -23841 -13255 -14209 -13018 -2607 -9797 -11943 -780 1296 5588 10456
1363 10456 2645 -287 10249 23114 18628 14743 7074 14512 11711 12351 8901 16311 10381 7849
1349 7849 -5191 -18185 -24665 -23714 -4562 1099 -11261 -16549 -15637 -21794 -13211 -8034 9869 7917
1335 7917 -784 -18762 -28148 -30610 -19977 -3060 9289 17971 17152 -5136 -20227 -22011 -22585 -12379
1321 -12379 -6087 3648 3848 5185 -1947 -27144 -34186 -33871 -41376 -38371 -15188 -3492 -5505 -7960
1307 -7960 -16226 -13798 -5919 2148 2814 -16008 -11271 -8949 -7671 4488 5932 -10075 -2324 -1911 -10554
1292 -10554 7681 15014 9557 -998 -2736 13921 22451 11499 1086 -5589 -20807 -12883 2710
1279 2710 10830 -1992 4379 19467 9522 8183 25437 22485 5090 -2132 -9875 -9939 -6594 -6630 -4968
1264 -4968 -7820 -12589 -23363 -16669 -1449 -6536 -11100 -15510 -15561 -24224 -22474 -21238 -17519 -13720 -9138
1249 -9138 101 13107 21446 19678 13464 24978 20219 11764 11926 10726 5133 5881 -1731 -13064 -7471
1234 -7471 4302 12882 9883 7524 1257 -850 -3047 -5945 -973 -165 14593 12918 434 -20242
1220 -20242 -16206 -5214 -1273 4510 20885 17453 1639 34 -13959 -28321 -13819 3512 14131
1207 14131 8582 -3928 -4999 -2838 -470 -9062 -24471 -7201 1886 -11082 -2773 17316 18482
1194 18482 16121 17258 25092 24726 16053 4634 7169 9949 -5786 -27449 -19467 -7186 -6100 -7675
1180 -7675 6981 17441 7664 -373 11213 20669 34789 36142 33114 25512 16022 18400 18665 20136
1166 20136 15590 2175 2368 -12181 -8078 1445 4160 15058 6785 13038 14695 20871 24917 8566
1152 8566 -6677 -8006 2154 1632 -14828 -18777 -3503 -1015 -7233 -10064 -10752 -5332 -17400 -15127
1138 -15127 -4792 1871 -10709 -18765 -8705 -9348 -4429 -6346 -20649 -17875 -11975 -19960 -9518 -3520
1124 -3520 -9308 -6932 -24506 -32034 -24347 -7536 3749 10855 -2354 -1123 5131 -2806 -7628 -12907
1110 -12907 -8851 4690 -6275 -11169 -2782 -11837 -16606 -1889 -8240 -18067 -17062 -22868 -24963 -23209
1096 -23209 -19762 -9499 -7278 2922 4182 -3400 13245 17123 -4917 -5082 223 -1288 -10235 -18938
1082 -18938 -15182 -904 -3658 -6498 3721 3179 -606 -6576 -6965 2464 8923 18643 2120 -2249
1068 -2249 10216 11728 13817 19314 18440 13038 16357 10322 8683 2420 -372 4332 12325 11483 5261
1053 5261 -3756 -16127 -30366 -30918 -15576 -11912 -13970 -5171 3881 7207 2393 11276 11706 13951 9470
1038 9470 -6337 -20375 -27205 -23380 -6889 -9590 -15324 -16266 -26411 -24774 -20929 -17887 -8838 -9561
1024 -9561 -22887 -18543 -9807 4566 25659 21130 11321 844 8324 5879 -7531 -789 5675 -3266
1010 -3266 -1622 8750 8468 -1682 -15425 -14580 3159 5680 8193 9536 17195 -5385 -11431 -11407 -4854
995 -4854 -7255 -14964 -24712 -12856 -2069 2361 -9707 -11139 -9811 -4700 8840 6338 9293 28895
981 28895 18802 -3271 -4233 15197 11522 -5266 -13380 -4254 6766 8498 -5096 -16546 -16452 -5658
967 -5658 -594 3730 4941 11575 14828 8517 -1000 -4863 3968 3588 -209 5113 6519 18513 31040
952 31040 19944 13604 13869 12891 8940 12655 12320 2127 11620 18499 18022 -6263 -13066 -921 -3489
937 -3489 5682 -1737 -86 9092 13580 5806 8760 6658 -743 -9522 -20696 -18168 -9446 -1978 -4196
922 -4196 -7383 1232 5349 -1550 -10740 -10589 -8773 -1186 3041 -9927 -25965 -28988 -14593 -7218 -5450
907 -5450 5294 7254 7897 2281 11350 -10583 -8782 6399 7234 -1050 -15500 -20423 -3892 -3024 8075
892 8075 27457 17373 23680 26788 12742 -2842 -23611 -15672 -8251 2047 6939 6556 6251 10083
878 10083 14777 12718 5206 8906 9486 24 -7489 -2551 -3451 -21341 -15655 -524 -368 -8188 -1195
863 -1195 -12623 -17538 -19628 -11950 -6271 -5185 7726 10872 9267 2198 -10439 -14919 -13591 -16565
849 -16565 3152 13639 20630 27823 23704 13144 -2110 -6870 446 -389 -6403 -4850 -7393 -1605
835 -1605 -4136 -14523 -18352 -21491 -16618 -6875 -10320 -3237 5537 8177 10603 9033 5927 3801 -8180
820 -8180 -18680 -15020 -19954 -26836 -14715 -399 -2741 -9930 -19753 -20488 -15709 -10444 -23575 -31244
806 -31244 -31004 -25032 -14315 -572 -192 -1528 -17396 -16945 -38833 -27341 -25493 -22392 -18763 -6539
792 -6539 -14010 -7050 1076 6170 9144 3538 -8889 -5584 -908 -5626 -11397 -13944 -31499 -43844
778 -43844 -27344 -9110 -11893 -18679 -10885 -13535 -8759 -19552 -29515 -31549 -19762 -12415 -12716 -14758
764 -14758 -18808 -26627 -27238 -21315 -21906 -24778 -15005 2721 1117 3449 2856 -6575 -15823 -35291 -53405
749 -53405 -42442 -28587 -13091 -15074 -22587 -22562 -7264 908 -2969 440 -773 6989 12454 -29
735 -29 -25362 -24607 -29825 -18442 -18381 -16571 2734 3759 -3885 -4027 -4297 -11101 -11313 -16816 -31681 -38154
719 -38154 -36476 -30338 -20734 -31970 -28841 -23390 -20453 -17738 -30729 -35092 -13562 -2363 -8380 -21608
705 -21608 -21929 -21263 -23561 -10390 -12394 -20288 -21340 -12885 -7806 -16269 -21743 -15145 -20590 -14852 756
690 756 8372 1794 -486 -3339 -9008 -17839 -18275 -17957 -19965 -25895 -23088 -13097 -12327 -24747 -22525 -8095
674 -8095 5581 3702 -15017 -15689 -19200 -22793 -16106 -16871 -6708 9491 7859 -4373 -397 505 -2475
659 -2475 -13684 -21541 -26273 -21521 -10818 -16973 -34879 -36209 -29388 -27303 -27766 -20570 -25242 -15667 -13107
644 -13107 -20202 -49907 -66490 -42599 -30074 -17102 -13290 -20002 -14366 -5499 -10847 -14941 -19600 -23822
630 -23822 -25137 -12685 -12630 859 2550 -9013 -14094 -11238 -19312 -24677 -23220 -19498 -24256 -19609 4304
615 4304 10402 13193 17275 1094 -16988 -38508 -43714 -23188 -1694 11867 -595 -10839 -28515
602 -28515 -33028 -20344 -20235 -22460 -18373 -19073 -22547 -15226 -12215 -10557 -13016 -13886 -7926 -2194 -4557
587 -4557 -22550 -36684 -38323 -24051 -28781 -27784 -22271 -10680 -22370 -26850 -20462 -30668 -28031 -1120
573 -1120 -2257 -17119 -11135 -5723 -1300 -3400 -979 2684 11313 1249 -2344 -2102 -12419 -7670 -9616
558 -9616 8999 8778 2 293 397 -13084 -23516 -16935 -9996 -7454 -965 -7055 -23952 -28553 -35888
543 -35888 -33915 -42898 -42591 -38840 -37355 -28519 -29145 -37032 -31574 -25454 -19487 -12716 -18918 -20141 -31537
528 -31537 -26055 -20556 -20819 -13871 -9194 -14064 -20767 -34505 -33034 -32369 -27120 -11815 3772 7793 4854
513 4854 713 -3960 -4456 -2641 -10164 -18405 -12094 -9518 -10847 -15891 -11858 -5873 -9097 -10018 -16961 -2710
497 -2710 14297 5521 -15326 -12925 -11453 -24189 -10334 11617 1315 -17038 -29734 -32676 -13253
484 -13253 -24176 -37188 -44517 -43523 -34769 -26895 -16164 -2683 2309 10640 15591 2209 -17936 -15949
470 -15949 -10284 -19203 -32807 -31805 -23547 -6853 -9564 -14646 -18943 -32896 -30767 -25417 -25078 -26780
456 -26780 -22666 -18354 -21878 -44556 -57242 -50565 -37897 -40819 -31083 -40215 -44533 -31079 -25051 -20655
442 -20655 -8627 -9280 -13069 -13640 -11211 -24793 -25157 -23747 -13423 -8021 -16175 -13696 -14237 -12964 -13871
427 -13871 -17922 -31013 -19639 -8059 -17140 -20807 -32447 -30603 -27615 -20606 -17856 -23889 -21353 -3516
413 -3516 -7108 -16500 -19222 -23896 -11464 -3277 -814 -5505 -13319 -24924 -32641 -23465 -20339 -13875 -9222
398 -9222 -5766 3077 9091 8204 4218 -6477 -13097 -15102 -19212 -23306 -37706 -40025 -26982 -21269 -11844
383 -11844 -7961 -6677 -12674 -26433 -33460 -27058 -27045 -28511 -36537 -37983 -32647 -25881 -31357 -32617 -18619
368 -18619 -12705 -26014 -36207 -39722 -31946 -21404 -20050 -9992 -2170 -11633 -23458 -27871 -12564
355 -12564 -12533 -9913 -7933 -13829 -9812 7529 17747 12564 9530 11310 6012 -3177 -1528 4227 10378
340 10378 -3154 -10390 -21320 -20815 -7796 2027 1536 -11924 -15268 -17345 -20759 -14215 -16173 -15835 -25821
325 -25821 -32593 -33963 -29278 -27330 -26898 -27707 -29137 -17510 -6321 -10196 -9930 -9395 -12797 -7308 -15509
310 -15509 -25859 -16128 -7755 -11859 -16826 -14841 -6703 4679 95 -6459 -11750 -11203 -9815 -4223 -1312
295 -1312 -9630 -8643 -14077 -10190 -4242 -4768 -14367 -12160 -6014 -13485 -17362 -32064 -38881 -34872 -30371
280 -30371 -15987 -17496 -9758 -2563 9121 4598 -10503 -13892 -14194 -22587 -21103 -24246 -29234 -31038
266 -31038 -26684 -24652 -24293 -15922 -16728 -28022 -29123 -27275 -36365 -35960 -34753 -26682 -18023 -28877 -32883
251 -32883 -19973 -18354 -23925 -20559 -20125 -25748 -15749 -10920 -11393 -16482 -10011 -49 1141 -12229 -16517
236 -16517 -27399 -28436 -19588 -15319 -13926 -9597 -16478 -15908 -13723 -18416 -31034 -35623 -34195 -16053
222 -16053 -10203 -13659 -36203 -49174 -44818 -32502 -35645 -30143 -35263 -35434 -32440 -21607 -11393 -15183
208 -15183 -13507 -17555 -16936 -6308 461 -9481 -16693 -18982 -11613 -423 -9565 -24867 -26388 -23261
194 -23261 -27083 -22140 -14498 -12410 -23130 -22691 -12852 -18621 -11114 -4592 -2405 -2548 -15297 -22001 -13216
179 -13216 -15949 -20304 -20529 -22412 -11829 -12740 -16521 -12851 -10923 -21981 -23650 -16297 -20850 -39062 -37854
164 -37854 -28449 -34235 -35245 -13881 -283 -4832 -2311 5595 5745 1246 -12217 -24482 -27590 -32124
150 -32124 -41629 -31737 -22996 -20103 -22538 -18107 -16923 -19394 -21329 -16904 -22186 -20218 -9046 -5277 -6639
135 -6639 -6511 -12160 -26194 -30626 -16308 -4374 -399 -2822 2933 3583 -8026 -15489 -7978 -4939 -13043
120 -13043 -31389 -38748 -46042 -37849 -31536 -30609 -28354 -30611 -38268 -35073 -37022 -32050 -21040 -4927
106 -4927 -6222 -14637 -26222 -31239 -25781 -24975 -20820 -16838 -8554 -5235 -10859 -12318 -13963 -17011 -16158
91 -16158 -18198 -17121 -13996 -10198 -12199 -14685 -16795 -20173 -17625 -20012 -22496 -20098 -25297 -17338 -17656
76 -17656 -17529 -24721 -28123 -30390 -30258 -18087 -17848 -15419 -12808 -10253 -9749 -18513 -27874 -26372 -23922 -20357
60 -20357 -12875 -6052 6713 3099 -4288 -3326 -13040 -27891 -33570 -32590 -26491 -20783 -17103 -14960 -12669
45 -12669 -12086 -15523 -21563 -21961 -27261 -15805 -7358 -7141 -14749 -12090 -10969 -23807 -30113 -29105 -27921
30 -27921 -19941 -11135 -14406 -18767 -20950 -16050 -20186 -19231 -18016 -21641 -31423 -37351 -33738 -28321 -22072
15 -22072 -20404 -23453 -23089 -23655 -29756 -18437 -12491 -17485 -22689 -11840 -8965 -10799 -7252 -11593 -11032
0 -11032
$$ Imaginary data points
##PAGE= N=2
##DATA TABLE= (X++(I..I)), XYDATA
32767 119404 107027 106968 124115 126454 119156 119836 133516 139046 139638 132683 135205 140091 148201 146907
32753 146907 146506 145305 135923 127920 130826 146019 144505 142701 146222 146693 147032 144452 143876 152374 152665
32738 152665 149511 154118 149743 153407 153443 146630 149031 144569 144108 143856 141049 154593 168388 171817 169854
32723 169854 172316 185714 190052 181723 178398 177382 171720 173999 181195 187200 189163 184723 182640 177065
32709 177065 178404 184425 183633 182752 172859 160133 154467 162332 169589 174547 183175 181864 187333 197381
$$ [...]
##END NTUPLES=NMR SPECTRUM
##END=
