##TITLE=536-74-3-
##JCAMPDX= 6.0         $$ Bruker NMR JCAMP-DX V2.0
##DATA TYPE= NMR SPECTRUM
##DATA CLASS= NTUPLES
##ORIGIN= BRUKER
##OWNER= aubrays
$$ XWIN-NMR		Version 3.5
$$ Mon Nov 24 11:26:13 2008 "MET (UT+1h)  aubrays@icmbsg013
##.OBSERVE FREQUENCY= 400.132220680898
##.OBSERVE NUCLEUS= ^1H
##.ACQUISITION MODE= SIMULTANEOUS
##.ACQUISITION SCHEME= undefined
##.AVERAGES= 64
##.DIGITISER RES= 18
##SPECTROMETER/DATA SYSTEM= dpx400
##.PULSE SEQUENCE= zg
##.SOLVENT NAME= CDCl3
##.SHIFT REFERENCE= (INTERNAL, CDCl3, 0, 12.0991)
##AUDIT TRAIL= $$ (NUMBER, WHEN, WHO, WHERE, WHAT)
$$ ##TITLE= Audit trail, XWIN-NMR		Version 3.5
$$ ##JCAMPDX= 5.01
$$ ##ORIGIN= Bruker BioSpin GmbH
$$ ##OWNER= aubrays
$$ /level_1/data/aubrays/nmr/536-74-3/1/pdata/1/auditp.txt
$$ ##AUDIT TRAIL=  $$ (NUMBER, WHEN, WHO, WHERE, WHAT)
(   1,<2008-11-24 11:25:10.87 +0100>,<aubrays>,<icmbsg013>,
      <created by zg, POWCHK disabled, PULCHK disabled
       configuration hash MD5:
       97 CB C6 7E 4E 38 97 FD D8 EA CD 83 2A B1 DF ED
       data hash MD5: 16K
       2A DF F2 27 83 A6 BE 78 A8 48 4B 99 52 0B 11 5C>)
(   2,<2008-11-24 11:25:35.05 +0100>,<aubrays>,<icmbsg013>,
      <Start of raw data processing
       ef BC_mod = 2 LB = 1 FT_mod = 6 PKNL = 1 SI = 16K 
       data hash MD5: 16K
       ED E5 BD F7 32 54 1D 6A 79 0E C0 16 C7 BB C9 C6>)
(   3,<2008-11-24 11:25:39.54 +0100>,<aubrays>,<icmbsg013>,
      <apks 
       data hash MD5: 16K
       6E 0B 46 64 28 22 0C C7 C5 0E F3 10 AC C2 C5 54>)
(   4,<2008-11-24 11:25:47.27 +0100>,<aubrays>,<icmbsg013>,
      <abs ABSG = 5 
       data hash MD5: 16K
       9A 89 C1 DA 7E B6 43 C7 00 E9 23 1D AD AE 2E 2C>)
$$ ##END=
$$ 
$$ hash MD5
$$ AD 1B 66 A8 64 DB F0 E3 8A 95 F4 FF C1 B8 67 01
##$RELAX= 
##$RELAX= 
##$RELAX= 
##$RELAX= 
##$RELAX= 
##$RELAX= 
$$ Bruker specific parameters
$$ --------------------------
##$DU= </level_1>
##$EXPNO= 1
##$NAME= <536-74-3>
##$PROCNO= 1
##$TYPE= <nmr>
##$USER= <aubrays>
##$AMP= (0..31)
100 100 100 100 100 100 100 100 100 100 100 100 100 100 100 100 100 100 
100 100 100 100 100 100 100 100 100 100 100 100 100 100 
##$AQSEQ= 0
##$AQ_mod= 1
##$AUNM= <au_zg>
##$AUTOPOS= <>
##$BF1= 400.13
##$BF2= 400.13
##$BF3= 400.13
##$BF4= 500.13
##$BF5= 500.13
##$BF6= 500.13
##$BF7= 500.13
##$BF8= 500.13
##$BYTORDA= 1
##$CFDGTYP= 0
##$CFRGTYP= 5
##$CHEMSTR= <none>
##$CNST= (0..31)
1 1 145 1 1 1 1 1 1 1 1 1 1 1 1 1 1 1 1 1 1 1 1 1 1 1 1 1 1 1 1 1 
##$CPDPRG= <>
##$CPDPRG1= <>
##$CPDPRG2= <>
##$CPDPRG3= <>
##$CPDPRG4= <mlev>
##$CPDPRG5= <mlev>
##$CPDPRG6= <mlev>
##$CPDPRG7= <mlev>
##$CPDPRG8= <mlev>
##$CPDPRGB= <>
##$CPDPRGT= <>
##$D= (0..31)
0 2 0 0 0 0 0 0 0 0 0 0 0 0 0 0 0 0 0 0 0 0 0 0 0 0 0 0 0 0 0 0 
##$DATE= 1227522310
##$DBL= (0..7)
120 120 120 120 120 120 120 120 
##$DBP= (0..7)
150 150 150 150 150 150 150 150 
##$DBP07= 0
##$DBPNAM0= <>
##$DBPNAM1= <>
##$DBPNAM2= <>
##$DBPNAM3= <>
##$DBPNAM4= <>
##$DBPNAM5= <>
##$DBPNAM6= <>
##$DBPNAM7= <>
##$DBPOAL= (0..7)
0.5 0.5 0.5 0.5 0.5 0.5 0.5 0.5 
$$ [...]
##$SUBNAM1= <"">
##$SUBNAM2= <"">
##$SUBNAM3= <"">
##$SUBNAM4= <"">
##$SUBNAM5= <"">
##$SUBNAM6= <"">
##$SUBNAM7= <"">
##$SUBNAM8= <"">
##$SUBNAM9= <"">
##$SW= 13.0983956698909
##$SWIBOX= (0..15)
0 0 3 0 0 0 0 0 0 0 0 0 0 0 0 0 
##$SW_h= 5241.09014675052
##$TD= 16384
##$TD0= 1
##$TE= 296.16
##$TE2= 300
##$TE3= 300
##$TEG= 300
##$TL= (0..7)
120 120 120 120 120 120 120 120 
##$TP= (0..7)
150 150 150 150 150 150 150 150 
##$TP07= 0
##$TPNAME0= <>
##$TPNAME1= <>
##$TPNAME2= <>
##$TPNAME3= <>
##$TPNAME4= <>
##$TPNAME5= <>
##$TPNAME6= <>
##$TPNAME7= <>
##$TPOAL= (0..7)
0.5 0.5 0.5 0.5 0.5 0.5 0.5 0.5 
##$TPOFFS= (0..7)
0 0 0 0 0 0 0 0 
##$TUNHIN= 0
##$TUNHOUT= 0
##$TUNXOUT= 0
##$USERA1= <user>
##$USERA2= <user>
##$USERA3= <user>
##$USERA4= <user>
##$USERA5= <user>
##$V9= 5
##$VALIST= <valist>
##$VCLIST= <CCCCCCCCCCCCCCC>
##$VD= 0
##$VDLIST= <DDDDDDDDDDDDDDD>
##$VPLIST= <PPPPPPPPPPPPPPP>
##$VTLIST= <TTTTTTTTTTTTTTT>
##$WBST= 1024
##$WBSW= 4
##$XGAIN= (0..3)
0 0 0 0 
##$XL= 0
##$YL= 0
##$YMAX_a= 2259758
##$YMIN_a= -2331482
##$ZGOPTNS= <>
##$ZL1= 120
##$ZL2= 120
##$ZL3= 120
##$ZL4= 120
##$ABSF1= 12.09913
##$ABSF2= -0.9993391
##$ABSG= 5
##$ABSL= 3
##$ALPHA= 0
##$AQORDER= 0
##$ASSFAC= 0
##$ASSFACI= 0
##$ASSFACX= 0
##$ASSWID= 0
##$AUNMP= <proc_1d>
##$AZFE= 0.1
##$AZFW= 0.5
##$BCFW= 0
##$BC_mod= 2
##$BYTORDP= 1
##$COROFFS= 0
##$CY= -3
##$DATMOD= 1
##$DC= 0
##$DFILT= <>
##$DTYPP= 0
##$F1P= 0
##$F2P= 0
##$FCOR= 0.5
##$FTSIZE= 16384
##$FT_mod= 6
##$GAMMA= 0
##$GB= 0
##$INTBC= 1
##$INTSCL= 1
##$ISEN= 128
##$LB= 1
##$LEV0= 0
##$LPBIN= 0
##$MAXI= 10000
##$MC2= 0
##$MEAN= 0
##$ME_mod= 0
##$MI= 0
##$NCOEF= 0
##$NC_proc= -2
##$NLEV= 6
##$NOISF1= 6.6
##$NOISF2= 4.6
##$NSP= 0
##$NTH_PI= 0
##$NZP= 0
##$OFFSET= 12.09913
##$PC= 4
##$PHC0= -168.6117
##$PHC1= 7.362817
##$PH_mod= 1
##$PKNL= yes
##$PPARMOD= 0
##$PSCAL= 0
##$PSIGN= 0
##$REVERSE= no
##$SF= 400.13
##$SI= 16384
##$SIGF1= 3
##$SIGF2= 2
##$SINO= 16
##$SIOLD= 16384
##$SREGLST= <1H.CDCl3>
##$SSB= 0
##$STSI= 16384
##$STSR= 0
##$SW_p= 5241.0901467505
##$SYMM= 0
##$S_DEV= 0
##$TDeff= 16384
##$TDoff= 0
##$TI= <>
##$TILT= no
##$TM1= 0
##$TM2= 0
##$TOPLEV= 0
##$USERP1= <user>
##$USERP2= <user>
##$USERP3= <user>
##$USERP4= <user>
##$USERP5= <user>
##$WDW= 1
##$XDIM= 16384
##$YMAX_p= 335297775
##$YMIN_p= -139251
$$ End of Bruker specific parameters
$$ ---------------------------------
##NTUPLES= NMR SPECTRUM
##VAR_NAME=  FREQUENCY,     SPECTRUM/REAL,   SPECTRUM/IMAG
##SYMBOL=    X,             R,               I
##VAR_TYPE=  INDEPENDENT,   DEPENDENT,       DEPENDENT
##VAR_FORM=  AFFN,          ASDF,            ASDF
##VAR_DIM=   16384,         16384,           16384
##UNITS=     HZ,            ARBITRARY UNITS, ARBITRARY UNITS
##FACTOR=    0.319910281801288, 1,           1
##FIRST=     4841.22475758553, 0,            0
##LAST=      -399.865389164975, 0,           0
##MIN=       -399.865389164975, -139251,     0
##MAX=       4841.22475758553, 335297775,    0
$$ Real data points
##PAGE= N=1
##DATA TABLE= (X++(R..R)), XYDATA
16383B790k5j41k81q27j667n50Q26J362J542Q52l0j20m48n17k73m28J83N43l4
16364B757m27l57l73M45N55Q34J46l84J47l87o82k37M67M32n19j504j344k90J25
16345e96N55Q61L44J98L65j90o08o04L54P01N03O58O92O07j93p41r05p58o78k86
16325B79L78K52l08j097q39pK52L91O36K22j7L76R07N90n92j148m95Q82R58j02
16305A518N24Q41J02l84N59J162P99l39o65n39p57j135p42K88O80j69l98K79O30
16286B254J189J148R12N70n1j045j021r16j017r84r48L5O50Q66J165L65o5L6J89
16267C332m33j351j172r40k35P5o56j222n78P42J798J053P40j25j069m50O65J901
16249B075J699R91Jj335o53J280Q87l83j769k045o16M98P52L72j87l76R2M43M19
$$ y = [2790, 2765, 2624, 2343, 1516, -151, -701, 125, 1487, 3029, 3881, 3851, 3731, 3283, 2766, 2493, 2065, 2248, 2791, 2757, 2330, 1973, 1600, 2045, 2600, 3434, 3580, 3196, 3343, 2956, 2274, 2037, 2504, 2936, 2417, 913, -431, -721, -596, -41, 820, 1164, 1362, 1727, 1537, 929, 325, 679, 1380, 1883, 2541, 3233, 3840, 3647, 2906, 2001, 1243, 565, 279, 657, 909, 601, -496, -1335, -1342, -1090, -699, -63, 159, 142, 518, 1425, 2015, 1423, 275, -220, 662, 1620, 1518, 2042, 2883, 2985, 2601, 3160, 4322, 5121, 4782, 4117, 3578, 2821, 1686, 944, 1232, 1912, 1743, 1345, 1624, 2254, 3443, 4591, 5503, 6073, 6022, 4977, 3956, 3040, 2023, 1039, 91, 126, 776, 1642, 2807, 3172, 3107, 3143, 3332, 2899, 1548, 376, -564, -799, -724, -1380, -2602, -3180, -2438, -640, 413, 1153, 1028, -41, -491, 174, 2075, 3774, 4765, 4766, 3431, 2778, 4058, 4945, 4562, 2793, 748, 132, 630, 1382, 1754, 1567, 1191, 1283, 1726, 2145]
16230B145j539k238n31M19J590J821J55j273q31Q65J053J33P9n8l84p87l46R25
16212A198J158M89l1l63q60m65m48n66O08J066P64j76r82n20j43n5m64o12J49
16193b53K1n63pR25J226J170K73r1j4L56M68O4O8P15K49l11n69m23N61k48j646
16172A971r27j090r79k6R23R08N47K48N8K69K43J72j4o77k46P4o61j640q12J487
16152a72J094r15q71k26l03k93O59J361N47o14m95J42j016j424J60R88J328J361
16134A311K58k79n83k17RPl26q7j56l86K81K66L89q5m6K29n34p80N97J321N91
16113A780J48l32j94J115M44O5L57m33j359j154j51j28j79m45p45P71J892P64
16095B216l8O0k39l66L98N93K98J509J322o4j225r04j42q51j010l83q3l04R3L63
$$ y = [2145, 606, -1632, -2163, -1744, -154, 1667, 1822, 549, -282, 583, 1636, 1769, 1848, 1790, 1406, 619, 273, 1198, 2356, 2845, 2814, 2451, 1591, 1126, 678, 112, 720, 1786, 2550, 2374, 1392, 872, 729, 674, 210, -402, -253, -232, -795, -802, 123, 1349, 2519, 2792, 2701, 2687, 3043, 3511, 3575, 3643, 4358, 4607, 4296, 3727, 3304, 3865, 3617, 1971, 1044, -46, -1025, -1051, -128, 780, 1327, 1575, 1633, 1902, 2145, 2317, 2303, 1626, 1380, 1454, 793, -847, -1659, -172, 922, 7, -864, -1090, -1393, -1686, -1027, 334, 881, 267, -228, -86, -1102, -2526, -2366, -1378, -50, 1311, 1569, 1290, 707, 490, 499, 506, 180, 93, -63, -449, -168, 98, 487, 402, 356, 585, 51, -729, -132, 1189, 1780, 1928, 1596, 1402, 2517, 2961, 3026, 3383, 2950, 1591, 437, 286, 158, -21, -466, -1211, -440, 1452, 2216, 2178, 2238, 1999, 1633, 2031, 2624, 2922, 4431, 5753, 5689, 4464, 3560, 3418, 2567, 1557, 1174, 1091, 787, 880, 1243]
16075A243R86Q85P49P34J278L12j072j199j045o63j33N51L18j039k579l958l284
16058g916j067O50M70o45p93O01R89L44M31N68O65J061r2K08O63M44l29k51J815
16039b184K661J688j027n32K276K220j7o99N42Q74q46l204k444M06J209M10j079
16022B54k748l037j346K359N149M788L216K222K401K263K010J066M67R41R24j70
16006B0759j456l188n446n189k803j721j257p41j134j618j299m4m15m86M50J229
15990d359Q63l40P2J051J237J146J338J723J81j718j291N67J193J040O3j274o45
15973H47R67J656J273j89j361j059n68M48J146Q84j43p16j50K44Q07J414J147
15956F647m68j298j321n85L74M61l04k65N60P21J31q24j063P3J492L64r93j202
$$ y = [1243, 2229, 3114, 3863, 4597, 5875, 6187, 5115, 3916, 2871, 2208, 2075, 2626, 2944, 1905, -674, -4632, -7916, -8983, -8333, -7863, -8508, -9301, -8700, -7711, -7367, -6936, -6368, -5703, -4642, -4734, -4526, -3863, -3419, -3748, -3999, -2184, 477, 2165, 1138, 606, 2882, 5102, 5085, 4386, 4928, 5802, 4956, 1752, -692, -286, 923, 1333, 254, -2494, -5531, -6877, -4518, 631, 5419, 8635, 10857, 13258, 15521, 17531, 18597, 19064, 20005, 20929, 20759, 19303, 16115, 10669, 5480, 2677, 956, -301, -1042, -2176, -3794, -5093, -5137, -5552, -6038, -5588, -4359, -3496, -3836, -3764, -2713, -1476, -330, 1008, 2731, 2912, 1194, -97, 470, 1663, 2703, 2766, 1492, 847, 1814, 3470, 4743, 4554, 3193, 2134, 1566, 2014, 3160, 4044, 3901, 3185, 3035, 3279, 4086, 5500, 6647, 6179, 4881, 3560, 2975, 3349, 3810, 3506, 3241, 3801, 4522, 4653, 3829, 2766, 2839, 4331, 4695, 3702, 2500]
15938B500r38j3L51n7O07K08m81j005r20p15j526j567j20P4L72P66J109O31J84
15919e40J32l76o61m26K16M8l0j41N7L57L69R37L63m64k8R55R81M30p12j895j330
15898a758m09M46K073K612K16j726q72J66j3j40Q02J76l40o54m64N50L98M23P75
15879B261N2j223j703r94l17L86J524R80L20m08j169j238j900j475q21L40K034
15862c351K003J303P48P35J51q4J54l35j96m5L91J33K23J099J208M54l47j028
15844C216j001O17J131P7l93o11j32M20pO04J96j706l391k795n4Q62N46j80j125
15825c726j386J22K474L107J484q41k376k273j361m5J780K812J060r11p56k31
15809a067q53J38K740L839N077M043J595J766J952j824m782l396k090k087N82
$$ y = [2500, 1562, 1549, 1900, 1843, 2450, 2658, 2177, 1172, 252, -463, -1989, -3556, -3676, -3602, -3230, -2464, -1355, -724, -540, -408, -784, -1445, -1871, -1655, -1607, -1637, -1778, -1721, -1364, -995, -58, 305, -159, -187, 768, 1749, 2179, 1467, -428, -1758, -2167, -1721, 352, 2964, 3180, 1454, 582, 748, 735, 595, 1397, 1573, 1233, 579, 115, 665, 1063, 1486, 2261, 2313, 1090, -613, -1607, -1924, -1538, -14, 966, 1286, 878, -291, -1529, -3429, -4904, -5725, -5385, -3351, -1348, -45, 703, 1438, 1589, 1505, 1659, 1324, 1128, 1083, 1474, 1607, 1830, 2929, 4137, 4591, 4244, 3216, 2215, 2832, 3963, 4040, 3647, 3036, 2904, 3324, 3317, 3921, 4117, 2411, -980, -3775, -3829, -2967, -2421, -2601, -3726, -5112, -4990, -2516, 591, 2075, 1234, -1142, -3415, -4776, -4821, -3041, -229, 831, -80, -836, -1067, -1920, -1782, 958, 4797, 9874, 13917, 15512, 17278, 19230, 17406, 12624, 9228, 7138, 5051, 5633]
15794E633O32k772m442k863j41J870J171M3J55j127M79M209L645K150K549J608
15778A2799j829l280l750l829j546J576J801o31j375j10J406J100l77n98J45P52
15762B254J73j96P25Q19k62o73M40J068J14j086k232j185J516J105q51m76l06
15745I47L87J254J040N52o09j674j334NL78j68L33P18J69K66J158J245K97k73
15727D691m36p22n08m54p71n48k22p85p83J31J275R33K28J028O88m75j262k173
15709a65m48Q85Q3P7J41o72j136m90p4k10L24R24N49O76P43N13L52L20n78N93
15689B407K499Q84r59j280j438o73K06J2o10p49J30Q91K82o7N71R98P2m65K35
15670B946P30j18o61j768j532RL90K74l14l8P92L91J4p76q03j52Q8l94M9Q32J026
$$ y = [5633, 6265, 3493, -949, -3812, -3953, -2083, -912, -869, -714, -1841, -1362, 2847, 6492, 8642, 11191, 12799, 10970, 7690, 3940, 111, -1435, 141, 1942, 1311, -64, -174, 1232, 2332, 1955, 1357, 1502, 2254, 2427, 2231, 2956, 3775, 3513, 2840, 3280, 4348, 4462, 3376, 1144, -41, 1475, 2580, 1729, 1253, 947, 1334, 2588, 3628, 4180, 3571, 1897, 563, 568, 946, 778, 1111, 1829, 1998, 2264, 3422, 4667, 4964, 4691, 4255, 3533, 3025, 2571, 1800, 1252, 1030, 245, -538, -407, 868, 1801, 2029, 3057, 3745, 3270, 2008, -165, -613, 272, 355, 432, 573, -99, -1235, -1725, -1799, -2009, -1685, -761, -212, 464, 1207, 1720, 2072, 2392, 1814, 2407, 4906, 5790, 4831, 3551, 2113, 1440, 1646, 1658, 1048, 299, 429, 1320, 1602, 1535, 2106, 3104, 3176, 2711, 2946, 3676, 3558, 2897, 1129, -403, -394, -4, 270, -44, -82, 710, 1101, 1115, 339, -464, -616, -528, -922, -873, -41, 985]
15649I85l09j480k160j678l55J677J692O13J154R94k68j075j72L83J68L1p92j157
15631a749j155p15K0J250J967Q40q39q38m18M95P59Q41N35m23M84J268P69M80
15613C571J08j186j433o50M5O62J071N10K40J4K07M0N85R42N23j697l196j580
15595a224M47J202N68j02j906j871O90K171K232l57k121j238J483K319J289l80
15579C202j641j601j721j761j518j997k413j849N97K772K192N99L53j35m71K171
15563c221M224L340N42k575k384K25J042O51j039k296j469k5P05J19r54j183J59
15546d139K098L392K577L83p42j53j0r38l14N96L85k29o87k22J79m23q42k22o21
15527F8j295m26l7P82J339J142R35j66p12K2Q05J14p99p34r13o17O06Q02L84o09
$$ y = [985, 676, -804, -2964, -4642, -4997, -3320, -1628, -1015, 139, 1133, 865, -210, -382, 1, 169, 200, -592, -1749, -2904, -3619, -3599, -2349, -382, 458, -381, -1219, -1637, -1142, -383, 458, 993, 570, 1054, 2322, 3091, 3571, 3679, 2493, 1060, 410, 455, 1117, 2188, 2698, 2938, 2952, 3159, 3199, 3784, 4726, 5249, 3552, 356, -1224, -777, 425, 993, 891, -1015, -2886, -2196, -25, 2207, 1850, -271, -1509, -26, 2293, 3582, 3202, 1561, -40, -1761, -3522, -5040, -7037, -9450, -11299, -10702, -7930, -5738, -5139, -4786, -4921, -5392, -3221, 1003, 4343, 4885, 2310, -74, 151, 1193, 1844, 805, -1491, -2960, -2985, -2280, -2161, -3115, -4298, -4139, -2041, 1351, 3928, 4311, 3569, 3416, 3406, 2468, 2154, 2750, 3135, 2906, 2219, 1997, 2176, 1753, 911, 689, 68, -1227, -1653, -1690, -908, 431, 1573, 2508, 2342, 1630, 1652, 2457, 2571, 1772, 1038, 125, -492, 114, 916, 1300, 691]
15507F91m53O06J20n16j040j091p38p51K61P25N26M53J82j73k13N69R05o0k12
15488b09k51p80k60N29Q01J65n7Q7J49N68J082M60j32p02j109L76J486J146M87
15469C836n2%O63L00j027r90n98j350j468j375l84P61J236O72k46o30K12j88m61
15450a089K3J45k55l78J40J317J845P39n76j065n41K8J134J229J13k37p78j102
15432F92m52K63K03J53P20L94J09J35m91j362j507j16O55J03J109J565L28j20
15414B381m85j152j106n01R41J699J531M73k98j673k733j184Q95J650J767N68
15398B773l49l85j485j372j3N79O14N39J032O71P13R30O49o28j666j081j29k0
15380A372m81j310j760j002O32J695K680K009r09k307j273K91R42J107N88N94
$$ y = [691, 238, 844, 964, 448, -592, -1683, -2421, -3172, -2911, -2186, -1660, -1207, -1025, -1198, -1411, -842, 63, 3, -209, -460, -1240, -1500, -971, -170, -5, -62, 25, 174, 742, 1824, 2284, 2152, 1450, 341, 717, 2203, 3349, 3836, 3784, 3784, 4447, 4747, 3720, 2730, 2132, 782, -686, -2061, -2445, -1684, -448, 224, -22, -652, -440, -628, -1089, -1066, -921, -1176, -1554, -1414, -97, 1748, 2487, 1911, 846, 305, 333, 1467, 2696, 2809, 2572, 1794, 692, 240, 503, 706, 859, 1579, 1973, 2082, 2217, 1726, 364, -1143, -1259, -604, -501, 608, 2173, 2501, 2381, 1896, 744, -362, -863, 78, 1777, 3308, 3781, 3483, 1810, -923, -2107, -1212, 438, 2205, 2773, 2424, 2039, 554, -818, -831, -252, 362, 901, 1933, 2604, 3317, 4247, 4896, 4268, 2602, 1521, 1392, 1372, 891, -419, -2179, -3181, -2549, -854, 1826, 3835, 2926, 619, -654, -363, 579, 1686, 2274, 2868]
15364B868O16R4J98N73J64j87n9n7L63k16j005j694j650m7Q13J142O61p61p11
15345A105L39J698J684J177n39j081o39l65N65P28rr21j918j134MN78L37k64q78
15326D67l83J332K003J539n19k186j423J86J051J032m0r38j126o57k95n33K19
15309b71J439N32n80o79j143j692j075L2J229R04m66j027k81M94P70p9j104m42
15291c439J040J289N70j338k445j549J30R83J065N15N88Q88L31l41j593r59L82
15274c883N77J431K079J569r6j219q45l16L54Q03Q50J544J231M82j301k242j422
15257d04j268q03O94Q60j86n12L81O60q6R3N23M33K74r6N15R43q8p45j39J02M55
15236A606N46Or66j018r45k28J286O95J27p20r23k93M02L12J95M66k28n00n35
$$ y = [2868, 3484, 3578, 3776, 4349, 4513, 4326, 4267, 4210, 4573, 4357, 3352, 1658, 8, -39, 774, 1916, 2577, 1816, 1105, 1444, 3142, 4826, 6003, 5464, 4383, 3744, 3379, 3944, 4672, 4663, 3742, 1824, 690, 694, 1272, 1609, 1345, 467, 84, 1416, 3419, 4958, 4439, 2253, 830, 1016, 2067, 3099, 3059, 2121, 995, 338, 43, -490, -271, 1168, 1700, 1120, 441, -702, -2394, -3469, -3437, -2208, -1304, -1770, -2797, -3078, -2584, -1814, -1893, -2997, -3439, -2399, -1110, -540, -1878, -4323, -5872, -5742, -4759, -3694, -3179, -2591, -1703, -1372, -1713, -3306, -4265, -3883, -3306, -1875, 204, 1773, 1677, 458, -387, -703, -349, 454, 1304, 2848, 4079, 4561, 3260, 1018, -404, -1672, -2475, -1781, -921, -1107, -1619, -1238, -578, -664, -571, -48, 385, 659, 563, 1078, 2021, 1933, 1188, 1049, 1151, 1606, 2152, 2158, 1192, 174, -771, -999, 287, 982, 1109, 389, -534, -827, -425, -113, 82, 548, 320, -180, -715]
15217g15m20p12r38J1J045Q40Q35N43j05m21n01L20R89J019L46j006j422q43j83
15198a318M89Q88J464J312j78q15o18p68o85j020r11m88k93K91r6r17l58Q73Q73
15179b275J65P05J190R56O34N41k76j152l77J24m12m28R49N18l29j77l48M66P64
15160A238j3K95Q5K25N98L31j120j957o15K57J549K629J463j178j705j044l29
15143G09J042J087M22l66j238j553p69m76l51o4P7J98M32J070J106O94k63j024
15125G33j970j891p39N94M1l98l82L89K03o82j74O92M94J95o0m55m13q09j008
15106e640l27m72j91R93Q47J204K172K335M21j096q34q75m53m14q35m81j75m68
15088d289p67k48N64N04j19p27Q97K169J962O77j088j640o62K57L35J32j10J68
$$ y = [-715, -1135, -1847, -2785, -2774, -1729, -889, -54, 489, 384, -37, -538, -218, 771, 1790, 2136, 1130, -292, -1135, -1318, -829, 59, 1523, 2835, 2657, 1842, 1224, 456, -229, -1249, -2160, -2648, -2941, -2650, -2746, -3663, -4021, -3148, -2275, -2110, -1405, -215, 741, 1375, 1916, 1640, 488, 111, 235, -177, -605, 344, 862, 533, 356, 8, 474, 1238, 1225, 1520, 1605, 1830, 2428, 2759, 1639, -318, -933, -676, 873, 3502, 4965, 3787, 2082, 1038, 709, 1751, 2838, 3260, 2894, 1656, 103, -666, -1142, -1493, -1557, -1480, -1282, -850, 220, 1326, 2020, 1757, 733, -1237, -3128, -3867, -3273, -3232, -3630, -4012, -3623, -3420, -4102, -4276, -3584, -3090, -2895, -2955, -3410, -3823, -4632, -5640, -5967, -6439, -6630, -5637, -4790, -3586, -1414, 921, 1342, 246, -588, -1463, -1916, -2330, -3165, -3646, -3821, -4289, -5056, -5304, -4740, -4236, -4355, -5082, -4185, -2016, -54, 623, -465, -2105, -2767, -2510, -2175, -2043, -2153, -1985]
15070a985J94N67J253J403J287N06k24j269o65M62J250R57k42o50j824j645J005
15053C80J968J039j29m93l64k35j46M24R63R7m54k71m8l88j62L48j43l97o30j49
15033A210J25L10n11j363k88R04J513K03k49n60p29j350j779Q8J766J239k0j327
15015h18q94n17q0N29O93m9p07j88J133J516K19p66lO24M62j19m73j121j274j54
14995a987L75j15p18n8R2l04n42j55p35p76M91N71Q7O84J078O11N84L58r34q22
14975b215Q3R09J100p32j693j29N69n23j69J113J920J539Q09K6r98k033j418j11
14957a953P18N14O54J377Q36l97l12q1o8l05k14r2n37M42P87n15n95j17M32M34
14937A008J68l04M86J011P37Km33m56l33n70m72Q0j30j235q54K73J108K99k36
$$ y = [-1985, -1791, -1224, 29, 1432, 2719, 3225, 3001, 1732, 1067, 1529, 2779, 3736, 3494, 2844, 1020, -625, 380, 2348, 3387, 3258, 2765, 2401, 2166, 2020, 2444, 3407, 3504, 3050, 2779, 2731, 2343, 2181, 2529, 2386, 1989, 1359, 1210, 1335, 1645, 1134, -229, -517, 387, 1900, 2103, 1854, 1294, 565, -785, -2564, -2476, -710, 529, 509, -818, -1712, -2229, -2309, -1780, -1087, -1136, -1843, -2031, -898, 618, 837, 71, 68, 692, 1154, 1035, 562, -559, -1833, -1987, -1612, -1727, -2445, -2503, -2411, -2715, -3257, -3412, -4147, -4923, -4432, -3861, -3774, -3090, -2012, -1401, -817, -459, -1393, -2215, -2132, -1223, -123, -855, -2548, -2677, -2108, -2631, -2800, -1687, 233, 1772, 2581, 2607, 1609, -424, -1842, -1953, -1235, -721, -67, 1310, 2146, 1749, 1437, 1356, 1288, 983, 769, 677, 140, 582, 1369, 854, 259, 142, 574, 1008, 1176, 872, 1358, 2369, 3106, 3108, 2675, 2219, 1886, 1316, 844, 924, 794, -441, -1295, -1022, 86, 385, 149]
14918A49M74R36J228P01o59j634n90m68m88k80n88o87n11j61N00J167R53K21O
14899B69o25l04O83O78j38j063j424k16J3l85q8Q4J038J690O22l35j194p92l65
14880a852m02l41MO06M71J147P15j35M09L28L49k81q00o34o9J55L02M68Q25J108
14860B373K66j01k26n17L89M63o09n98L30P87R41N68K2n19j07L60O4r95p56J19
14840B254mo12O1Q50J481J248m30j562j260j187j053p59m94J8K34j69l68l59J47
14821a964N88j24p15j374r98M19O12N43m27j670k015j132O23J401J443P8m49K30
14803d931K364K889O27q77l72P62J488R46q16j588j765j695l63J281J334N5j620
14786b281j478l46p09o34o01J62J853L042K591J725R98M79K91j054p09o90m38
$$ y = [149, 623, 1559, 2787, 3488, 2829, 1195, 605, 137, -351, -631, -1219, -1906, -2417, -2578, -2078, -911, 42, 263, 269, -356, -660, 23, 701, 563, -500, -1924, -2140, -2127, -2512, -2600, -2516, -1478, 212, 834, 499, -695, -1487, -1852, -2254, -2595, -2591, -1985, -1514, -367, 348, 213, 622, 950, 1299, 1018, 218, -416, -485, -330, -28, 440, 1265, 2373, 2639, 2538, 2312, 1795, 2184, 2647, 2038, 1440, 1770, 2557, 3498, 4066, 4088, 3569, 3462, 3822, 3886, 2891, 2135, 2254, 2250, 1638, 1699, 2549, 4030, 5278, 4848, 3286, 2026, 839, -214, -973, -1467, -1449, -1215, -1384, -1752, -2111, -1964, -1376, -1500, -2215, -3589, -4587, -4168, -3556, -3013, -3440, -5110, -7125, -8257, -7634, -6233, -4790, -4712, -5161, -4931, -2567, 322, 949, 72, -300, 462, 1950, 2896, 2080, 492, -1273, -2968, -3331, -2050, -716, -661, -2281, -3759, -4105, -4814, -5448, -6049, -5887, -4034, -992, 1599, 3324, 4322, 4801, 5092, 4038, 3329, 2639, 2201]
14769B201J69L37M0l29n39j79K5m87r27r72n36l33K78O24L59L24n00n08L96M02
14749a55M17O13P55j59J88M98Qk75j17j54m91n35o23n81L83L3j254k023q50N13
14729c809K76R89J481j60q59m15nl31n13q2K1j140r41N9M88Q32R67R14N61J04
14709a563k41j280r07m17m9Q22J209J456P06q01j480j034L2M81K35J30M45Q17
14691a439Q30O24rk56M28l22j411j344r9J221Q32Q07J385P20r02j343j151m31
14673a860O51R39M16K16K01j68n9N08j89j294j439j741q43K88R70P71L8r16q9
14654c600N07Q61M73J60Q41O67Q58Q75n28j884m60M44M49J20o24j008o55r02p72
14635d178N61J302Q25O87J85r40j131NN64Q86J243P27k24r19j152j038k62J080
$$ y = [2201, 2370, 2707, 2747, 2418, 1879, 1700, 1725, 1238, 311, -661, -1197, -1530, -1252, -628, -269, 55, -445, -953, -557, -155, 262, 875, 1630, 1471, 1659, 2157, 2165, 1890, 1773, 1619, 1128, 593, -30, -611, -228, -195, -1449, -3472, -4322, -3809, -3533, -2544, -1063, -1223, -2082, -2497, -2502, -2833, -3346, -3428, -3407, -4547, -5488, -5429, -4941, -4109, -3142, -2228, -1667, -1563, -1804, -3084, -3991, -4408, -4457, -3635, -2426, -970, -264, -1065, -2545, -3579, -3547, -3066, -2831, -2701, -2256, -1439, -609, 15, 6, -250, 178, -144, -1555, -2899, -2998, -1777, -945, -138, 1247, 1967, 1065, -278, -1429, -1860, -1209, -270, 146, 362, 563, 395, 336, 844, 655, -639, -2078, -3819, -4662, -4374, -3404, -2633, -2595, -3511, -3600, -3093, -2232, -1759, -1599, -758, -91, 767, 1642, 1114, -770, -1230, -786, -337, -217, -841, -1849, -2504, -3406, -4178, -3617, -2315, -1490, -803, -618, -1558, -2689, -2684, -2120, -1234, 9, 736, 512, -407, -1559, -2597, -2859, -1779]
14617a779J679P60o42r32l18M87M07n41j292m16j27m60K12M04l51n75p19n84m81
14598e268K5J258J299k22o00m0o6k81q9m60r74n47J192J202o95j715j263L94R00
14579e950P9j02m80p71k00J417J739L62j174q34Q40K034K641J344j543j834J5
14562b417J427J959Q79j129l306k698JJ206M14j90N07K45K78J047J73o67K6J142
14544a103K141J677O81o3J34p90k486k935j867o1M37J062J191M33L90K30l28J21
14526a136Q08P77J6O72Q74j9k54n71o32n08k61k4J43n11j204k4Q85K75n51p92
14506b037q17j5K83K82l65j525j293k96M69J700J985J641J084M0jJ59p01q11n43
14487g61l07o05j68J485J349p38j767j070P80J342R93O01k29m88m41M9K47O3n39
$$ y = [-1779, -100, 660, 18, -914, -1232, -745, -338, -879, -2171, -2587, -2714, -3174, -2962, -2558, -2909, -3484, -4203, -4787, -5268, -5243, -3985, -2686, -2908, -3508, -3548, -3614, -3895, -3984, -4444, -5418, -5965, -4773, -3571, -4266, -5981, -7244, -6850, -5950, -5871, -5973, -6453, -7224, -7424, -6007, -4268, -3906, -5080, -5914, -5074, -3040, -399, 945, -598, -2432, -2417, -990, 969, 1848, 719, -2587, -5285, -5284, -4078, -3664, -3854, -3347, -3102, -2824, -1777, -1604, -2271, -2245, -1103, 1038, 2715, 3396, 3333, 3467, 2677, 191, -2744, -4611, -4672, -4235, -3173, -1982, -1549, -1159, -929, -1257, -1136, -328, 449, 465, 1137, 2011, 1992, 1738, 1167, 535, 27, -234, -258, -115, -626, -1830, -1854, -969, -694, -1245, -2037, -2854, -2869, -2586, -2304, -2669, -4194, -5487, -5783, -5314, -3614, -1629, 12, 1096, 1136, 1135, 1294, 593, -218, -761, -1068, -1673, -1841, -356, 993, 255, -1512, -2582, -1802, -460, 533, 1134, 905, 417, -24, 25, 272, 335, -204]
14468b04q58o07J77K35o0M0q09j238R56L006K370O62o91j140m82Q89J205o5j916
14449A470k059r08K50J07j069j103k89r53l67J486J713J149O52N08M53K04m52
14432G92j643j906j289O3N59P06J65j289j276p54J24M27O71M48N2R87J643N34
14414i86l78K01J023K04k21J141O54l62k54M31M30J65J00q6N1N22J057j45j590
14395A957j587n97K06L72P44K30q45o96l9N77P45l56j108j141j064PJ395J466
14377B66Q54M91j99j526j383n75M72K019K228L90j275j231j596j556p62J583K743
14360I43J802J400J721J894N97p03j752k246j970j221o91L39Q92J8j19m41p36
14343b73l06O32K149J475j88n49q03m17l03J28M42n85q68p6q69j549j72N47K13
$$ y = [-204, -1062, -1669, -1492, -1257, -1317, -1277, -2086, -3324, -2368, 638, 3008, 3670, 2979, 1839, 1357, 2246, 3451, 3386, 1470, -589, -1497, -1247, -1140, -2209, -3312, -3601, -4554, -4921, -3435, -1722, -573, 79, 587, 1040, 1244, 792, -851, -2757, -4046, -3983, -3424, -2718, -2553, -3842, -5118, -5872, -5748, -5321, -4650, -4202, -4150, -3163, -1520, -986, -1364, -1163, -140, 64, -157, 984, 1638, 1276, 1022, 1453, 1883, 2048, 2148, 2062, 2113, 2635, 3692, 3547, 1957, 370, -227, -21, 351, 1095, 1325, 480, -216, -255, 322, 1067, 711, -397, -1538, -2602, -2595, -1200, 266, 1120, 1611, 1412, -114, -1497, -2072, -1600, 419, 2647, 3037, 1762, 531, -1065, -2621, -3383, -1800, 943, 2745, 4145, 5866, 7760, 8357, 7654, 5902, 3656, 1686, 465, -226, 113, 1005, 1023, 904, 463, -273, -579, 53, 2202, 3677, 3489, 2940, 2137, 1720, 1417, 1545, 1987, 1402, 534, 458, -411, -1960, -2132, -1585, -1372]
14324a372J70j7m22q76J41R16K10l52o1N11L60O0L64M3M27J69j764k024m44O42
14304c319Q70J230N84l70j182r07K16P3k60l74P4M94N71m24o17Q04R96N18m22
14285a445o56o48r71p85l20J12j47j96l1l98j012j043o67Q38J672J053O05J206
14267b833P18p8o86k93M7L64m52j545m48R62J472J321Q66O71N02l56j516j323
14249b607p20n37n68j104o10R01J102R03R99J046P53M9p43j263l14q4j042j323
14231e162j120j67M37j58Q10J023n73j755p04J0M37K476L655K833K895K388j0
14214G315k507l311k062q46L63J120J263J113o92k294q92L35l27l67L46N00K67
14197f76l75q31q31o56k49l40m74o51Q4O96k36j347r32k7J380J258J028O90k80
$$ y = [-1372, -1202, -1219, -1641, -2517, -2376, -1460, -1250, -1602, -1663, -1152, -792, -732, -368, -325, 102, 271, -1493, -3517, -3961, -3319, -2449, -1219, -635, -1005, -2187, -3094, -2878, -2805, -3065, -3439, -3365, -2871, -2300, -2724, -3341, -2537, -1541, -1023, -1445, -2101, -2749, -3720, -4505, -4825, -4713, -4860, -5056, -5087, -5485, -6497, -7540, -8207, -7369, -5697, -4644, -4039, -2833, -2115, -2193, -2879, -3172, -3125, -2761, -3213, -4758, -5206, -4244, -2772, -1451, -585, 86, 588, 232, -1284, -2607, -3327, -3864, -4432, -5536, -6146, -5245, -4143, -3240, -2241, -1195, -442, -393, -1136, -2399, -2713, -2797, -3839, -5162, -6282, -6449, -6012, -6170, -5360, -4337, -4910, -6665, -7369, -7359, -6922, -4446, -791, 2042, 4937, 7325, 7315, 4808, 1497, -565, -1411, -1048, 72, 1335, 2448, 1756, -538, -1430, -1095, -1422, -1789, -1443, -943, -676, -1051, -1882, -2713, -3369, -3618, -3958, -4432, -5083, -4999, -4303, -4539, -5886, -6818, -6845, -5465, -4207, -3179, -2489, -2769]
14178b769K7J249J401j76q03K40Q08R81L95r23j31L00q46q77m18j11L58L46k98
14159a247m30m66j29L54M89m31j539j059K60P81O93k81j017p51r66j068Q7K88
14141f432P61J095J014N80PJ71o05m40J284Q43M52J75j176j109j78O14Q76Q17
14123a251O57M80m66r14o3M78K45n85p06q71j244m23K07N27N47N07K30r32o11
14104d188K83k65p98R5O29j50k32O60J097Q25M76R9k46l40k67p3P36P73m9o44
14084a579j52P07j06Q5P94K28o15j213o26k02M75Q07K86P0J07O48J368J104K86
14065B472m33j379j568q76r94n31K97J239J968J981N00n04Q7M64k73q15m19M03
14047A619K6k9N71P71O98o83j516n57n17R1N40n65j066p54o03m72m85q99r29N15
$$ y = [-2769, -2742, -1493, -92, -268, -1071, -831, -23, 958, 1353, 430, 299, 599, -247, -1124, -1542, -1653, -1295, -949, -1247, -1677, -2143, -2272, -1918, -1429, -1860, -3399, -4458, -4198, -3417, -2724, -3005, -4022, -4773, -5739, -6807, -6720, -6432, -5671, -4576, -3562, -2982, -2975, -2804, -3409, -3849, -2565, -1722, -1270, -1095, -2271, -3380, -3558, -2944, -2068, -1251, -594, -114, -580, -1494, -1557, -1079, -834, -1419, -2125, -2996, -4240, -4663, -4456, -3929, -3382, -2875, -2645, -3577, -4188, -3905, -4170, -4968, -4873, -4244, -4394, -4626, -3966, -2869, -2044, -1568, -1469, -1715, -2055, -2322, -2395, -1659, -886, -935, -1579, -1731, -1024, -1130, -1045, -251, -23, -638, -1851, -2477, -2679, -2204, -1397, -1111, -1041, -934, -286, 1082, 2186, 2472, 2039, 660, -908, -1784, -2778, -3309, -3012, -1773, 195, 2176, 2676, 2172, 2259, 2723, 2450, 1635, 1216, 1619, 1645, 1616, 2187, 2958, 3656, 2973, 1457, 900, 383, 474, 1014, 449, -617, -1371, -1974, -2446, -2931, -3830, -4759, -4244]
14027d244M02p4P53K81j237j009L18Q79J602J636R95n58j024R59J908K213J199
14010D999q67k300j198k7n31p06k40N8K05K79m5n59n6L83L13L26r25j420m89j17
13990b917J89R02L20r31m25K76K83L20Qo45q10k7N4n1M44O06R09R84Q79K08n96
13969b0j255q84n95p14l72M45M31p22j605j601m58J343J248j21j11l44j182m30
13951f947J305K126K483J335J78J77M69q03j405j261j342j176k2J080J987K116
13935C00P19j042j303o61l36o17q2j9k02M85J467Q63o89j248m25J62j17k0N26
13916b239J132M67n05q60n06j8L59n7o75o78r94o33o45k22K64L06N59J291R85
13897b669p1m63r04m02J529K523J651q2n77m21l86j102r37n55q56K57J197J348
$$ y = [-4244, -3842, -3916, -3163, -2882, -4119, -5128, -4810, -3931, -2329, -693, 302, -256, -1280, -321, 1587, 3800, 4999, 4132, 1832, 634, 607, 76, -630, -870, -812, -607, -328, -373, -932, -988, -605, -292, 34, -891, -2311, -2800, -2917, -2728, -1826, -1506, -2437, -2862, -2586, -2303, -1983, -1975, -2620, -3430, -3457, -3403, -3454, -3010, -2404, -1495, -511, 368, 576, -20, -1275, -2159, -2754, -3468, -3840, -3395, -2964, -3686, -5291, -6892, -7350, -6007, -4759, -4880, -4991, -5335, -6517, -6947, -5642, -3516, -1033, 302, 480, 657, 1126, 323, -1082, -2343, -3685, -4861, -4883, -3803, -1816, 300, 1019, -23, -1326, -1987, -2323, -2940, -3022, -3041, -3243, -2758, -1291, -428, -1117, -2365, -2790, -2628, -2745, -2765, -2239, -1107, -640, -1145, -2005, -2511, -2529, -2170, -2227, -2902, -3580, -4574, -5207, -5852, -6074, -5810, -5504, -4945, -3654, -2669, -2740, -3203, -4107, -4509, -2980, -457, 1194, 1112, 535, 114, -272, -1374, -2311, -2866, -3722, -3465, -2268, -920]
13879i20J158m39r26M71J209R9n94j170j604j638j528j058M65J366J902K003J555
13862C51R34Q68r3o31M04J078R34N1K51J005K054K719K240L143N230N757M794
13845C1089J213k889m842m858m974m393k786j184j169r59q20j037r01r90%O78
13829A178M25j12m16j242j549j467q48j28N16J225M84k16j015r43j79J19M40J060
13811b668M19j63n39m3O63P5q41O72J862P46R4R16P36K16m33J38P02Q65L20q00
13791B937j125n90M38J189M76n41j361j579l91L29K53O7j382j716l0K42p04j134
13773d622k91Q32J321J365J246R75K4L64J209K00j309o73M12R75N3J45J54j020
13755A360p65n32n79n04N87M47l80k09J11N13R38q20j645p53J50P92L82k14K36
$$ y = [-920, 238, -201, -1127, -656, 553, 652, 58, -1112, -2716, -4354, -5882, -6940, -6475, -5109, -3207, -1204, 351, 1285, 2153, 2060, 1429, 1833, 2911, 3845, 3896, 4147, 5152, 7206, 9925, 12165, 15308, 20538, 26295, 31089, 32302, 29413, 24571, 19713, 14739, 10346, 7560, 6376, 5207, 4248, 3428, 2391, 1490, 500, 500, 1178, 1603, 1491, 1075, -167, -1716, -3183, -4031, -4159, -3643, -2418, -1934, -2150, -3165, -4108, -4287, -4168, -3728, -2668, -2249, -2412, -2951, -2994, -2331, -2256, -3097, -2425, -563, 183, 277, 1193, 1929, 2145, 1712, 1850, 2552, 3417, 3737, 2937, 1812, 1222, 1660, 2849, 3325, 2784, 1423, -156, -547, -218, 35, 102, -1280, -2996, -3026, -2784, -3488, -4622, -4913, -4081, -2760, -1395, -149, 826, 850, 1214, 2423, 2623, 1314, 641, 1053, 2028, 2081, 2226, 2380, 1360, 595, 63, -516, -1020, -433, 14, -366, -575, -464, 49, 987, 167, -1478, -2231, -2081, -1289, -907, -1121, -885]
13736h85M89n27j330j284l64O52J788J448J60o38j380j219k46k24q33j486j367
13719g246n71N6J431J276j04J29J027J291J428J626Q26j58o89r20M47R72P94J051
13701B666O70M34m25j540j697j452r94J33M66K25K69j44j85o2J79K80J35J11j56
13682a087l26L4L35k44j036q44m85q57r68K36J224J578J209R92l3m72N0p4O0j89
13662h97q19L84P70j57l34q98q39q4L25M30N82L03Q6K30N82P71P30N10K07m00
13642A482j132r30n08J01M62J00L7L55L2M8l66o0M01J368Q26m01m80k14p37p02
13622c18jR2J08J134J333L93N29P91o45j710j298j649j507q0M71l4k93J63J144
13603a377K28j303o65p15M7N25p3P50Q94j19j431j112M27J437J282O9j003j494
$$ y = [-885, -396, -923, -2253, -3537, -3901, -3249, -1461, -13, 147, -491, -1871, -3090, -3336, -3560, -4393, -5879, -7246, -7817, -7761, -6330, -5054, -5158, -5029, -4002, -2711, -1283, 343, 1169, 1011, 322, -598, -151, 821, 1615, 2666, 3336, 3770, 3345, 1805, 108, -1344, -2338, -2205, -1739, -1514, -1245, -1389, -1574, -1636, -1457, -1177, -1042, -931, -1087, -1413, -1379, -1044, -1288, -2324, -3168, -3653, -4510, -5478, -5242, -4018, -2440, -1231, -239, -272, -744, -694, -768, -708, -897, -1716, -1332, -562, -719, -1053, -1951, -2790, -2874, -2549, -2119, -1537, -1234, -1148, -918, -336, 435, 1165, 1675, 1882, 1482, 350, -580, -1088, -987, -525, -425, -388, -33, -1, 47, -319, -379, 22, 1390, 2216, 1815, 1335, 1121, 384, -318, -319, -227, -119, 1015, 2348, 2741, 3270, 4061, 3416, 1706, 408, -1241, -2748, -2828, -2357, -2391, -2684, -2521, -1377, -1149, -2452, -3117, -3832, -3785, -3260, -3333, -2583, -1689, -1808, -3239, -4351, -3924, -2487, -1205, -1136, -2139, -3633]
13585c633n69p1p90q55q81J67J861K174J178Q22O93m70q43J20N91O41j8j073j226
13566b182l31j30l40j139r47N06J123L72n94m73l99J91J216J013R07K89m22M92
13548h48R82O0n73n99j39l60M84J680R15p84n87N25J37l60l58k5o32q85j392r59
13528c718N50O30P42L39q20j56J129J079K53j335k410j799n24M23P38N08j51q73
13510e395j700j481j97N24P52N99L41J11R04J215J321Q86r9j453q69m31k53J64
13492e061N72O34N33Q93R9J70m7L03J139N16l07q13o19K46O04m1r16j519j424
13473e038r84L09J215J043J29l14N55J518K33o47r9l63l68J013O99k12o5O42R76
13454B42Q66J269L79r58q44J06L47m69q55k61L54R59J021l53r71j28O08L97p57
$$ y = [-3633, -4202, -4273, -5063, -5918, -6799, -6632, -4771, -2597, -1419, -597, 96, -374, -1217, -1097, -506, 135, 117, -956, -2182, -2513, -2643, -2983, -4122, -5069, -4563, -3440, -3068, -3662, -4135, -4534, -4343, -3127, -2114, -1207, -918, -1340, -848, 134, 194, -379, -978, -1117, -1477, -993, 687, 1602, 818, 231, 756, 893, 533, 175, 150, -482, -1367, -2759, -3718, -3168, -2538, -1796, -1457, -2277, -2433, -1304, -225, 28, -1307, -3717, -5516, -6040, -5617, -4879, -4371, -4522, -5395, -7095, -8576, -8773, -8249, -7497, -6898, -6557, -6446, -5542, -4327, -3006, -2120, -2219, -3672, -4541, -4972, -5225, -5061, -4489, -3855, -3322, -2429, -2330, -2160, -2207, -1904, -765, -249, -556, -1369, -1988, -1742, -1138, -1179, -2095, -3614, -5038, -6022, -5713, -4498, -3455, -3326, -3640, -3085, -1567, -1334, -1981, -2080, -2443, -2811, -1798, -1099, -1311, -1376, -734, 242, 1108, 2377, 2756, 1798, 954, 1060, 1407, 938, 83, -178, 176, 1135, 2156, 1803, 832, 704, 1312, 1709, 952]
13435I52l50o79m89r3k63J54j039m94J547J067j73j070p00P8p9K73Q58R05L34
13416G39k72n63j066q87j14M34O59M53L59P79L71q03n90P54R90Q13l46m25j56
13397A129m53k40L4N30P71M42p52o83k25p48m77J009J310K81P0j38J85Kn9k5n33
13376A430j501j541k15P88O45p75j236o00N75Q89L28L64J23m13l70m47n38P93
13358a701J563P62l18j578j963n42R79J558K025J740J061L46J43K25P23J273j9
13341F277n78j43r99j715q34l72L42P28P4k003k150n90l36n44l08K85J050J261
13323e55J199M46l76n35J47P12J296K190J295J89N68j66r58m70r0K52O99M69k73
13304F039j050j253j028J163L483M473M020J886r32l882m736l234k458j764j182
$$ y = [952, 602, -77, -566, -659, -922, -768, -1807, -2301, -754, 313, 140, -930, -1630, -1552, -1631, -1358, -500, 405, 739, 467, -96, -1162, -2049, -2163, -1729, -1070, -617, -258, 521, 892, 89, -501, 253, 1243, 2056, 1710, 1285, 1129, 676, 436, 470, 1000, 1771, 2213, 1461, 778, 553, -195, -672, 337, 1647, 1928, 1998, 1860, 2045, 2047, 1988, 1963, 1430, -71, -1612, -1827, -1039, -394, -1169, -2405, -3005, -2430, -1541, -1213, -849, -726, -1139, -1509, -1956, -2494, -1701, -138, 624, 306, -1272, -3235, -3777, -2798, -1240, 785, 2525, 3586, 3932, 4075, 4300, 5023, 6296, 6277, 5699, 5556, 4557, 2842, 2008, 1636, 1978, 2706, 2780, 777, -1373, -1963, -2299, -2843, -3151, -2866, -1816, -555, 644, 1090, 714, 179, 326, 1038, 2334, 4524, 5819, 6008, 6576, 6410, 5452, 4982, 4892, 5144, 5843, 6312, 6039, 4989, 3736, 2708, 3871, 7354, 11827, 15847, 17733, 16801, 12919, 8183, 4949, 2491, 727, -455]
13289d55m89Q04Q57k11K64J232J212P47m62j494j025o30j034p24M07J329J045
13272A373P97j108j724q10J64J149P1j036m16M08L39N78P11J77k55J21J072O23
13254B234j102j865l98J41L78Q86O47m23m56j67j42Lpq62m34K38J21m92l74L85
13234a689M81n95p98N8L79n39l27l89n2Q65R32M57K64N50r6j372o78J056J351
13215a42O85K97k50j46k01q28q18KQ94J067Q07M48j190k503j901p93L48J004P95
13196b425M62n98q51j53R2K02J263J865R00M04L91j53j60N53k39j075m30L01P16
13177A065J314R23P68P42n56k453k365j144N46Q95P49N95n62j056j734j431p6
13160c780L78j4j95J54J250K224K109Q5j375o83k31r33j73J326K111J109j072
$$ y = [-455, -944, -140, 717, 506, 770, 2002, 3214, 3961, 3499, 2005, 980, 350, -684, -1408, -1001, 328, 1373, 2170, 1062, -662, -1472, -1308, -159, -88, -1124, -1540, -1132, -793, -215, 496, 673, 418, 539, 1611, 2234, 1132, -733, -1131, -990, -612, 274, 921, 498, 42, -125, -267, -264, -271, -1133, -1567, -1329, -1208, -1700, -2074, -1689, -1208, -1803, -2601, -2543, -2164, -2703, -3030, -3419, -3471, -2606, -1674, -1217, -953, -403, -499, -1871, -2549, -1493, -142, 543, 840, 590, 444, 243, -585, -1403, -1401, -507, 560, 1367, 1815, 625, -1878, -3779, -4572, -4224, -3220, -2425, -1963, -2561, -3412, -3565, -3473, -3271, -2008, -143, 757, 1161, 1552, 1399, 1239, 1792, 1553, 478, 48, 349, 1065, 2379, 3302, 4070, 4812, 4256, 1803, -562, -1706, -1160, -265, 484, 1079, 517, -539, -2273, -3704, -3780, -3402, -3416, -3611, -3457, -2207, 17, 2126, 2211, 836, 153, -78, -1011, -1184, 142, 2253, 3362, 2290]
13143B290k063j947j074K79J150J524J425J249L54j74j24q8p41r86j243j070P68
13126d71J637Q64L06P51l82p98j100o35J85o9L97P24m27k00m28p42m26K85J75
13107c54Q90R06r92k119j491j075o0Q50J135J164P62N98o1r90o13J59L89q3M51
13088e34J197J727Q44q43j531o53L75L27m5l0j14l86n13Q77J885J72j216j182
13070C57o29P49J594Q33j2m79q73k79k5J042J650M59j973k225o47j33p15j258
13052b564j183n6Q28J38l20J62N31Q23P12q3n54k62l41j05k66j150m13Km09q86
13032e396n27R95J181m28m66k46R8O24R69P02k8p51q34k91P85Q28J214P09k36
13013a098j37P15O11j522k454j125m92L43J212J460J231J016P13N84Q83J192J016
$$ y = [2290, 227, -1720, -2794, -2515, -1365, 159, 1584, 2833, 3187, 3013, 2889, 2801, 2060, 1074, -169, -1239, -471, 1166, 2030, 2336, 3087, 2705, 1907, 807, 172, 357, 288, 685, 1409, 982, 782, 354, -388, -814, -529, -354, 536, 1442, 450, -1669, -3160, -4235, -4295, -3445, -2310, -1146, -384, 214, 153, -837, -1450, -1291, -902, -985, -534, 663, 2390, 3234, 2391, 860, 207, 582, 909, 864, 834, 720, 334, -179, 698, 2583, 2755, 1539, 357, -272, 477, 2071, 2904, 2892, 2413, 1540, 1261, 1236, 2278, 3928, 4387, 2414, 189, -458, -591, -1306, -2564, -3747, -3803, -2975, -2837, -3157, -2995, -2464, -1641, -929, -1012, -1566, -1828, -2169, -2274, -2540, -3690, -4103, -4101, -4510, -5396, -5923, -4928, -3747, -4175, -4641, -4887, -4789, -4165, -3196, -2494, -2522, -3273, -4107, -4398, -3613, -2785, -1571, -862, -1098, -1235, -520, 91, -1431, -3885, -5010, -5502, -5159, -3947, -2487, -1256, -240, 473, 1057, 1940, 3132, 4148]
12996D148J041Q38P82R83L59j54j293j495o00J6R01N02J90o08j802j915j982r34
12978a023J68K50J71K86k4L1O54J190J026k42j192k023j984j670q9J746K033O87
12960eO7J062J021Q85J014m39j127k26Q6k61M1K61O11J189P59j221k155k094r36
12941a468j37P07N07J77M33J52l14k09P09M26p48r74j57L01m83j535j438l63m76
12922d890j0M99Q6R7P36M82M37L47j16j63O70R49J81j65k90l48l80j33k10o29
12902b850o86n97k39Q13J005P04O55M60R2n22j387j215q4K13k07o49k15J031O85
12883b993j39r5j12k89J8O35N75Q54Q33L96k79q69m16M08J16j485q24k82l00m38
12863d686n14J46P48O35J172J530J328J09o58n9J003M80o27j106M48M66M06P85
$$ y = [4148, 5189, 6027, 6809, 7792, 8151, 7997, 6704, 5209, 4609, 4625, 5526, 6028, 6218, 5610, 3808, 1893, -89, -1023, -855, -605, -434, -148, -172, -141, 513, 1703, 2729, 2487, 1295, -728, -2712, -4382, -4471, -2725, -692, -5, 62, 1124, 2145, 3030, 4044, 3605, 2478, 2252, 2338, 2077, 2118, 2379, 2990, 4179, 4938, 3717, 1562, -532, -1468, -1605, -898, -391, -214, 219, 371, 57, -152, 557, 983, 235, -739, -896, -595, -1078, -2613, -4051, -4414, -4890, -4900, -4401, -4315, -4218, -3482, -3000, -2563, -2216, -2332, -2495, -1825, -876, -695, -860, -1150, -1498, -1878, -2011, -2221, -2850, -3536, -4133, -4372, -3559, -2554, -1850, -1195, -735, -643, -1165, -2552, -3767, -3851, -3638, -3845, -4494, -4709, -3678, -2993, -3132, -3227, -3339, -3628, -3610, -2975, -2400, -1546, -713, -317, -596, -1465, -1881, -1473, -1357, -2842, -3666, -3948, -4248, -4686, -5200, -5054, -4306, -3671, -2499, -969, 359, 468, -190, -249, 754, 1234, 607, -499, -51, 415, 821, 1606]
12845A606K37r87j384j0J494L03n33j051o38P27J080J379Q99n69j419r96k52Q54
12827G40J047J34K73J31l84n1J571J505J234R10n92r67m95k36r62j243o59j108
12809H48j027J198J485j54j032p61k12j41R44J119P82r2j067j369o93LQ9M05j31
12790A94m16m45m66q4L93J065J545K775L579K297k53j436k038l037k808j614L82
12773c67J478R17p99j509j355q81p72o59k05j39l90p02N60J840J249Q60J139R53
12755A218R1j260k259k16J204J056R17J199Q18R20J108J118L56j293j780j152
12739B045j618j115r07j379l39J214J884J670J09n9Q31M73l0n01m88m55k00J67
12721A302O23K69m78p73n31J67j21o66K5R66Q86j41j157p47N74Q14Q13L31p63
$$ y = [1606, 1843, 856, -528, -538, 956, 1259, 726, -325, -963, -236, 844, 2223, 3122, 2553, 1134, 138, -114, 740, 1787, 1921, 2194, 2325, 1941, 1890, 3461, 4966, 6200, 7110, 6518, 5551, 5056, 4820, 3858, 2615, 1956, 848, -179, 1019, 2504, 2350, 1318, 557, 345, 204, 1148, 2267, 3049, 2957, 1890, 521, -172, -169, -80, 325, 194, -222, -667, -1133, -1217, -824, 241, 1786, 4561, 8140, 10437, 10184, 8748, 6710, 3673, 865, -749, -367, 1111, 2028, 1229, -280, -1635, -2516, -3288, -3947, -4152, -4291, -4681, -5383, -4823, -2983, -1734, -874, 265, 1218, 1309, 49, -2210, -2426, -1222, -166, 751, 1950, 2768, 3688, 4796, 5914, 6270, 4977, 3197, 2045, 427, -688, -1595, -2974, -3313, -2099, -215, 1455, 1564, 1505, 2336, 2809, 2779, 2278, 1790, 1335, 1135, 1302, 1925, 2194, 1716, 943, 412, 579, 458, -208, -183, 783, 1669, 1528, 371, -376, 198, 1012, 1825, 2156, 1393]
12702A393n66p78q56l52O04O37Q82M53j301j833J79J143N48P34R66p3p85p67p43
12683e15m02k70O58J152p5n47l53m36o29m65kL20m71q00N26K197J406k54q99l44
12663b03J287J385K45J50N24M8n95J71J139P51m56q78l12j84m01O9R16J529O96
12644E881j37J63L95l29m85j038j275m94Q44R83L91M49K64J76j66k58k97m01K12
12625D878J124K41q25KR37r2j581k128j304P3Q2o47q92J07J326P20r1r1M81L67
12605B687o36j153q87m06J235J977N58m27L51J080J022L99n61j467k308k503p61
12588a800R79P63k36j89P60J624J484L01j188j097q14m92J55l69j705rJ908J441
12570A516K5m13m83r0P48R64Q39R25k02J22P50K7j021j170p78p81j259P6R57J558
$$ y = [1393, 827, 49, -807, -1159, -555, 82, 964, 1417, 116, -1717, -1538, -395, 153, 887, 1853, 1780, 995, 228, -515, -917, -1187, -529, 623, 548, 1, -352, -788, -1417, -1882, -1884, -1564, -2035, -2835, -2309, -112, 1294, 1040, 141, -203, 1084, 2469, 2714, 2864, 3388, 3436, 2841, 3012, 4151, 4902, 4446, 3568, 3256, 3072, 2671, 2740, 3656, 5185, 5881, 5744, 5907, 6302, 5973, 5488, 4450, 3175, 2681, 3525, 4508, 4899, 5348, 5612, 5788, 5622, 5364, 5067, 4666, 4878, 6002, 6243, 5418, 5420, 6357, 6265, 4684, 2556, 1252, 1325, 1407, 760, -132, -25, 1301, 2021, 1930, 1839, 2320, 2687, 2051, 898, 11, -395, 840, 2817, 3375, 2948, 3299, 4379, 5401, 5800, 5239, 3772, 1464, -1039, -1800, -821, -58, -294, -483, 277, 1901, 3385, 3686, 2498, 1401, 587, 95, 250, -119, -1824, -1833, 75, 1516, 1541, 1128, 645, 555, 1303, 2267, 3106, 4031, 3829, 3951, 4701, 4728, 3707, 2537, 1759, 978, -281, -205, 752, 2310]
12550B310J288P62L49o7j114l86O26O53M74M35Q75N05L52m94j250o07n64p28J26
12531C545J354J072N56k81q51p63n98l77O2j0q96p93l84l88q31o97o7P84Q69O96
12511B002Q46N68m24m60J460J569l57j180j837p66O44J125m8p14J87K09K20N02
12493C546K48K5J01O66J047J079m85k87P83n44j476j094R4J356J394J360n56j317
12475E940M28O18m83j067j035o62j369o03J347K185J717Q60m03n68n32j59J64
12458F378J92l92q04M70P92M3k17Q1K88n68j834j867p6J012l57r35K66Q90K10
12439C572l1Rq02r31l43P13O11r7K23L34NN75M79J01l3K82J105K93k43K48l66
12418E704j87p0j37n88N04R87P06Q47L1r96m98M50O42J96o07j326j699j442n47
$$ y = [2310, 3598, 4360, 4709, 4642, 3528, 3142, 3768, 4421, 4895, 5330, 6205, 6710, 7062, 6568, 5318, 4711, 4147, 3419, 3545, 4899, 5971, 6527, 6246, 5395, 4632, 4034, 3657, 3719, 3709, 2813, 2020, 1636, 1248, 417, -280, -347, 437, 1306, 2002, 2848, 3416, 2992, 2532, 3992, 5561, 5204, 4024, 2187, 1421, 2065, 3190, 3142, 2428, 2615, 2824, 3044, 3546, 3794, 3819, 3920, 4586, 5633, 6712, 6227, 5940, 6723, 6179, 4703, 3609, 3703, 5059, 6453, 7813, 7257, 5940, 6368, 6986, 6503, 5436, 4401, 3739, 2370, 1767, 3114, 5299, 7016, 7876, 7473, 6905, 6373, 6214, 6378, 6570, 6178, 5374, 5844, 6636, 6679, 6462, 6543, 6831, 6263, 4429, 2562, 2486, 3498, 3141, 2206, 2472, 3362, 3572, 3541, 3550, 2748, 1817, 1474, 2187, 2798, 2701, 2924, 3258, 3263, 3838, 4317, 4418, 4385, 4667, 5772, 6065, 5822, 6070, 5704, 5517, 5447, 5310, 4722, 5226, 6213, 6919, 7766, 7797, 6801, 6303, 6753, 7395, 7591, 6984, 5658, 3959, 2517, 1970]
12399A970j34j46l24o6O19Q84N54j45Q7J001J000J043Q08J110J206p7n35q07q88
12380G160J09k26o16m04l45R96P52q58j630j077l64J017K609R71j356r21J219
12363G036K364K347J817K07r84q68m48l82m36o9K97k23o05q08j321j113q4O44
12345G371J431O98r67k125k012j042L96R92L50n26L81J198O20K74M8O94R78l0
12327H729p15k6J24q15m76j4n13l79J51L06M30J038R50r71j859r84l80p5J329
12308E850J238M25q79j377m08N00j80q1J67P98N42m5N63J703J563L99n91m01q8
12289I698r78q94r41m85L75O86P32l21n91L20O44K73L78K01j35j067p89M41K132
12270I679K576P70j511j827p86J53Q85r6j512o26j92J009J461J27j453n12L84
$$ y = [1970, 1836, 1690, 1366, 1300, 1919, 2803, 3357, 3212, 3299, 4300, 5300, 6343, 7151, 8261, 9467, 9390, 8855, 8048, 7160, 7269, 7043, 6427, 6023, 5678, 6674, 7426, 6568, 4938, 3861, 3497, 4514, 7123, 8094, 6738, 5817, 7036, 9400, 11747, 13564, 13771, 12787, 11919, 11471, 11089, 10653, 10584, 10881, 10658, 10053, 9245, 7924, 6811, 6727, 7371, 8802, 9500, 8533, 6408, 4396, 3354, 3750, 4742, 5092, 4566, 4947, 6145, 6765, 7039, 7087, 7781, 8759, 8729, 8014, 7988, 8112, 7297, 6821, 6807, 6294, 5915, 6066, 6372, 6802, 7840, 8790, 7819, 5960, 4976, 4596, 4521, 5850, 7088, 7513, 6634, 5257, 4849, 5349, 5169, 5088, 5255, 6053, 6595, 6550, 7113, 8816, 10379, 10778, 10187, 9786, 9698, 8720, 7826, 6885, 6400, 6775, 7461, 8193, 7872, 7281, 7601, 8245, 8518, 8896, 9097, 8962, 7895, 7106, 7547, 9679, 12255, 13025, 11514, 9687, 8901, 9054, 9939, 9843, 8331, 7705, 7513, 8522, 9983, 10110, 8657, 8145, 8529]
12253H529J42N16Q50J91o17r78m20O02J281K62J77J217J7j246j769k296j305N86
12235E739J592J572P14J8M21R99N39l06j090o09P17M39J23o53j234J0M09J079
12217A0479R55M85J04m28r96m08o17l76q64k76o0n41k30k90j86O0K88M0Q7J152
12197H378J368J516J433J077L35k2m25o43P28J510N80n50j311j014m82L10k34
12180A2554j30M41Qp50j370j68K413L204J598k56N2J255J850J230J7j736j736
12163A8476m90N80P65r07l215l166j668p33r46q30Lk68j513j252P90K501K436
12146A0563J228M00J140J512Q12p48j653j626P5R62N70j536k868k392n78J611
12130G472J921P4r17j97R76J172J210J899J645J095L77p33j96M54K8K93Q18m08
$$ y = [8529, 8671, 9187, 10037, 10228, 9611, 8633, 8213, 8815, 10096, 10358, 10535, 11752, 11769, 10523, 8754, 6458, 5153, 5739, 7331, 8903, 9617, 9635, 10056, 11055, 11594, 11288, 10198, 9589, 10306, 10745, 10868, 10215, 8981, 8991, 9400, 10479, 11434, 11919, 12023, 11595, 10599, 10191, 9574, 9198, 8334, 8058, 7998, 7457, 7227, 6937, 6751, 6811, 7099, 7139, 7226, 8378, 9746, 11262, 12695, 13772, 14107, 14085, 13660, 13017, 13745, 15255, 15835, 15285, 13974, 12960, 12478, 12788, 12554, 12424, 12865, 12873, 12123, 10753, 10585, 12998, 16202, 17800, 17544, 17596, 18851, 20701, 21931, 21948, 20212, 18476, 17986, 18566, 19331, 18424, 15209, 12043, 10375, 9642, 8696, 7866, 7869, 7601, 6088, 4836, 5626, 8127, 10563, 11791, 12191, 13331, 14843, 15655, 14907, 13254, 11628, 11703, 12665, 13235, 11699, 8831, 6439, 5861, 7472, 9393, 9467, 8550, 8353, 9329, 10501, 11711, 13610, 15255, 16350, 16727, 15994, 15798, 16252, 16280, 16573, 17391, 16983]
12112A6983p34J056J758J145n59k031r20N37J359J925N97j120j295j864k641j126
12096A3070M59R96J145J088M01r69j256p06p51L71Q73N00m31j049m37M63j37j050
12078A2580j274j017N77K266J781K78J29K89o88m2Q52N59m63o49l42N83O44L17
12060A6380O27R2l91R78J030Q26J478J492K32j184q66j52o17j55j31J58n47j062
12042A8188q87M00J712J504m3r92j626j438o76q2p7N98R14L22j297j549r33o42
12024A3396k12M58J573J846Q64K27O34Q4%N05M33M23q4Q5k3j1j6o60j054j048
12004A7420m8jL14Q46j48J40N23O75M94L68n9J8J40Q85J195k32j705k040j301
11985A7484j97K25m85p45K57R11J049J421J921J544O16n30j084j561j117q75j92
$$ y = [16983, 16249, 17305, 19063, 20208, 19649, 17618, 16698, 17235, 18594, 20519, 21116, 19996, 18701, 16837, 14196, 13070, 13529, 14525, 15670, 16758, 17159, 16190, 14934, 14228, 13477, 13848, 14721, 15221, 14790, 13741, 13304, 13767, 13630, 12580, 11306, 10289, 10866, 13132, 14913, 15191, 15320, 15609, 14921, 14879, 15731, 16290, 15827, 15178, 14836, 15419, 16063, 16380, 17007, 17099, 16708, 17686, 18716, 19542, 21020, 22512, 22744, 21560, 20694, 20542, 19925, 19770, 19639, 19797, 19250, 18188, 17301, 17701, 19413, 20917, 20874, 19882, 18256, 16818, 16142, 16060, 15983, 16581, 17495, 17817, 16520, 14971, 14038, 13396, 13184, 13642, 15215, 17061, 17925, 18152, 18786, 18870, 18870, 19375, 19808, 20231, 20147, 20232, 20209, 20198, 20182, 19522, 18468, 17420, 17372, 17371, 17685, 18531, 18383, 18523, 19046, 19721, 20215, 20583, 20524, 20542, 20682, 21567, 22762, 22530, 20825, 18785, 17484, 17287, 17512, 17027, 16282, 16539, 17450, 18499, 19920, 21841, 23385, 24001, 23471, 22387, 20826, 19709, 18834, 18642]
11968A8642Q50J306J419P13K51L76Q1l12k03K87O36r7r28k613l400k099J17K244
11950A7270L471K631J874O92q65r04L3r21j774k355k660j903j764j627k69M24
11934A1353j623l135q47J175L441O204O043M044M557N105L400J86j490l215l750
11919C1448k682l09J169J521l44j521j075l65K6J041P83l27j202k110k597j807
11903B1649j419j247p42q12j422j836o78J151J559K121J671k0j79J438K800J835
11887B5869q80k099q40R07P84M02L66J176J764J567R41P27J259J076m31j191j682
11870B9715j947o38J364R38n90j517j527J13R88O08L41J40N34M76P63j80j114
11853B8467q51n03Q4J42j167j231l39n69m9R80P20p9N37J555M92m28M40J406J282
$$ y = [18642, 19492, 20798, 22217, 22930, 23181, 23557, 23638, 23326, 23123, 23410, 24046, 23949, 23021, 20408, 17008, 14909, 15026, 17270, 20741, 23372, 25246, 25938, 25073, 24169, 24202, 23281, 21507, 19152, 16492, 14589, 12825, 11198, 10929, 11353, 9730, 6595, 5748, 6923, 10364, 16568, 22611, 26655, 31212, 36317, 39717, 39903, 38413, 35198, 31448, 28766, 28457, 29626, 31147, 30803, 29282, 28207, 27842, 27868, 28909, 29692, 29365, 28163, 26053, 23456, 21649, 20230, 18983, 18241, 17429, 16007, 14171, 13493, 14644, 16203, 18324, 19995, 19975, 19796, 21234, 24034, 25869, 24989, 22890, 22050, 22957, 23741, 24143, 24509, 25685, 27449, 29016, 29957, 30684, 31943, 33019, 32588, 31397, 29715, 27768, 27130, 28494, 29432, 28842, 27325, 25798, 25911, 26899, 27507, 27848, 27988, 28522, 28998, 29761, 29581, 28467, 27616, 27113, 27197, 27339, 26172, 24941, 24602, 24033, 23984, 24964, 25684, 25605, 26142, 27697, 28189, 27761, 28201, 29607, 30889]
11834C0889l97q43q33l15K95J81j129k246j811N9J045N38M82o10j510P93J324
11817B5912K8o40m47n52q41j92Q69J098J75m53K52Q11Q03L60O4J422J809L53j9
11798C0812P2K9j70L56J142J556O03j160k127p78J077J055k44p50k05O42k01m28
11780C1281l42k72K8R26m62p37r9J8L69J162M85l47k88j16J396J133l40J38J074
11761C5007N75j145j629o56J225J908J872m93j917n68J839K144J405M46r0q37
11745C9086j210j467j824j361j38j006j393N9j20q08k15n63l79Q44J985J219p55
11728C1954q22j96p40j35K218L673L651K100j352m303l837j173J329L256K723
11713C8346M91j579k409k44J662J395Q43J212J158q52l041k825p98R10O42j19
$$ y = [30889, 30492, 29649, 28816, 28501, 28796, 28977, 27848, 25602, 23791, 23850, 24895, 25433, 25915, 25305, 23795, 24588, 25912, 25940, 25300, 24853, 24301, 23460, 23268, 24137, 25235, 25410, 24957, 25209, 26020, 26823, 27183, 27247, 28669, 30478, 30831, 30812, 30884, 30913, 30743, 31099, 32241, 33797, 34400, 33240, 31113, 30335, 31412, 32467, 32223, 31473, 31268, 31910, 31709, 31281, 30939, 30667, 30695, 31621, 31159, 30422, 30323, 30341, 30710, 31872, 32357, 32010, 31722, 31606, 33002, 34135, 33795, 33933, 35007, 35582, 34437, 32808, 32152, 33377, 35285, 37157, 36664, 34747, 34179, 36018, 38162, 39567, 40013, 39923, 39086, 37876, 36409, 34585, 33224, 33086, 32080, 30687, 30746, 30626, 29818, 29603, 29040, 28661, 29505, 31490, 32709, 31954, 31132, 30936, 30196, 30061, 32279, 35952, 39603, 41703, 40351, 36048, 32211, 31038, 32367, 35623, 38346, 38837, 37258, 34849, 34605, 36267, 37662, 38505, 39717, 40875, 40023, 36982, 34157, 33359, 34269, 34911, 34792]
11697C4792M28K12r96j205L82L052L084R36k057l330j930j45J607K935K530J415
11681D1710M27nJ092K807O03j483k197k264o63R39J73l05o56N1N08q1k39M82J348
11662D2247J648R31p18j255q08k48N30J64r64q47J535J687l16r39k81k31p2Mo2
11643D2005p83j080K4P48O6j10o4M38J132J377R02k81j278k97R79K280J625P15
11625D8398j149j777o55J044P30l18l11J26k78q0l41j032o75J398J866L95j033
11608D6308o74N91K91p2J042J962J383P3p08j504j457q39QM34P53J516J423R65
11590E1495O32n83r59j037Q09K177K060J778Q52l17j341j229p81l28O8k06m28
11573E2662N2l5m05M0J158J480L16q45Q6J676R86k20k6lm74o48L8O88P94L70K95
$$ y = [34792, 35220, 35432, 34436, 33231, 33613, 36665, 39749, 40685, 38628, 35298, 33368, 33223, 34830, 37765, 40295, 41710, 42137, 42132, 43224, 46031, 46634, 45151, 42954, 40690, 40027, 40966, 41139, 40834, 40178, 40229, 40737, 40656, 40417, 40899, 42247, 43895, 44826, 44108, 42853, 42045, 41797, 42327, 42491, 41527, 40680, 42215, 43902, 43586, 42647, 42366, 42135, 42063, 42067, 42005, 41222, 40142, 40166, 40914, 40980, 40870, 40806, 41244, 42376, 43753, 44655, 44374, 43096, 42799, 43778, 46058, 47683, 48398, 47249, 45472, 44817, 45861, 46591, 46273, 45962, 46088, 45810, 45730, 45389, 44357, 43682, 45080, 46946, 47341, 46308, 45634, 46225, 46516, 46444, 47486, 49448, 50831, 50904, 50196, 48692, 47235, 46396, 46404, 46838, 47591, 49107, 50530, 51495, 52127, 51544, 50585, 49548, 50357, 52534, 54594, 56372, 57224, 56907, 55566, 54337, 53556, 53228, 53296, 53090, 52662, 52714, 52679, 52274, 52314, 53472, 54952, 55268, 54423, 54509, 56185, 57171, 56951, 56925, 56922, 56448, 55800, 55838, 56526, 57320, 57690, 57985]
11552E7985m52o31n37m21r02l96l72j292j489j065o46Q78J552J356O32J023J028
11535E6251J002P42P74R58O80K6q7L06P04P75P04J98J93L94M18N39N12o46j552
11516F2891j360l79M94J130O68J80O82J454J021J336J764J402J67J8J59N49R%
11498G2185K73J08n02j078j770j007n12N73R50O2q91l53M53P98J31n16j009K33
11480F8128J07m32L80J147J902K617J449k43q81k13R5P28J969K117K750L742M360
11463H9722L227J702L027N956P913P423O546M858K084o60j896j693j027o79j196
11448A25307j920k472k994l468k924j989k39R18J178J521J530K107M157O776P513
11433A35001O283L202J114Q14J96j292m281o402o326n076n178n611m689l058k095
$$ y = [57985, 57533, 56902, 56365, 55944, 55042, 54646, 54274, 52982, 51493, 50428, 49782, 50660, 52212, 53568, 54200, 55223, 56251, 57253, 57995, 58769, 59727, 60407, 60433, 60346, 60652, 61356, 62131, 62835, 63033, 63226, 63620, 64038, 64577, 65089, 64443, 62891, 61531, 61152, 61646, 62776, 63444, 63624, 64306, 65760, 66781, 68117, 69881, 71283, 71450, 71468, 71627, 72176, 72185, 72185, 72458, 72566, 72064, 70986, 69216, 68209, 67697, 68270, 69220, 69282, 68391, 68038, 68491, 69289, 69420, 68904, 67895, 68128, 68235, 67803, 68183, 69330, 71232, 73849, 75298, 75055, 74174, 73961, 74056, 74784, 76753, 78870, 81620, 85362, 89722, 92949, 94651, 97678, 103634, 111547, 118970, 125516, 130374, 132458, 131798, 129902, 128209, 127182, 126503, 125307, 123387, 120915, 117921, 114453, 111529, 109540, 109301, 110219, 111397, 112918, 114448, 116555, 120712, 127488, 135001, 141284, 144486, 145600, 146414, 146610, 145318, 141037, 134635, 128309, 123233, 118055, 112444, 107755, 104697, 102602]
11418A02602k182k205k121k662p66O96J65o53l86K10J081Q90J433J167K13r5R40
11401I8327J927K243K498K086N85k78r77k171k594k053k247j360j257j626o72
11386I2431O43n59j911k024n27O26O09K86O83Q22N82M02M38p6N10J271K203K398
11368I8807K477J001K71k0n93p52L15K55m26o94n1J158K707L698M279N467O073
11351A23972M257J944j571l559j870j019j790j809j329J40J304J307L65j007k247
11336A17088j865j595j114j147j222J48Q85N18P95p8j87o4k71l26o9J089J681
11319A14266J798J040K24m12j801j944o87p83j544j749j749j332p21M44Q17M75
11303A06342L67N67K41P91J570P09r30k207j632L8P17J315K02r23j37L29O06k34
$$ y = [102602, 100420, 98215, 96094, 93432, 92666, 93362, 93527, 92874, 92488, 92698, 93779, 94669, 96102, 97269, 97482, 97387, 98327, 100254, 102497, 104995, 107081, 107666, 107388, 106411, 104240, 101646, 99593, 97346, 95986, 94729, 93103, 92431, 93074, 92515, 90604, 88580, 88053, 88679, 89288, 89574, 90257, 91079, 91661, 92063, 92501, 92425, 92935, 94206, 96409, 98807, 101284, 102285, 102556, 102536, 101943, 101191, 101506, 101761, 101335, 100641, 100590, 101748, 104455, 108153, 112432, 117899, 123972, 128229, 130173, 128602, 125043, 123173, 122154, 120364, 118555, 117226, 117366, 118670, 119977, 120342, 119335, 117088, 115223, 113628, 112514, 111367, 110145, 110293, 111178, 111696, 112491, 112413, 112226, 112162, 111891, 111565, 111496, 112585, 114266, 116064, 117104, 117328, 116916, 115115, 113171, 112484, 111701, 110157, 108408, 106659, 105327, 104606, 105050, 105867, 106342, 106709, 107276, 107517, 108308, 109878, 110587, 109657, 107450, 105818, 105856, 106573, 107888, 108090, 107167, 107030, 107359, 107965, 107731]
11285A07731l32j2k57K5L35J446K030P73P00R02J249J416J158M5o63j207p41J56
11267A14754P80J46l13J39Q94J485J860M88m62J08J230P39J279K616K428J446
11251A29617K411L095L770L821M001M509N535O194N193K856J827k41k050k303
11237A68235j187q85l19OQ45N71M52j049j569k064l331l962l689j844Q76J034
11221A52120K203L661N372N589M867L195J558P49kJ07J45n93N09J281J287P67
11205A82815O75o41k850n638p606p833n826m302m235l915j512j013o58M28J442
11190A39331K690L303K548J922J102M86J081J372J493J782K840M050M096L972
11176A72068M051L934L194J883l49k459l229l779n163m978l317j092J387K138
$$ y = [107731, 107399, 107387, 107130, 107155, 107490, 108936, 110966, 111739, 112439, 113341, 114590, 116006, 117164, 117209, 116546, 115339, 114598, 114754, 115534, 115680, 115367, 115506, 116400, 117885, 119745, 120233, 119771, 119879, 121109, 121848, 123127, 125743, 128171, 129617, 132028, 135123, 138893, 142714, 146715, 151224, 156759, 162953, 168146, 171002, 172829, 172588, 170538, 168235, 167048, 166163, 165844, 165850, 166695, 167266, 167718, 166669, 165100, 163036, 159705, 155743, 152054, 150210, 151086, 152120, 154323, 157984, 163356, 168945, 173812, 177007, 178565, 179314, 179312, 179419, 179564, 178971, 179480, 180761, 182048, 182815, 183490, 182849, 179999, 174361, 166755, 158922, 153096, 148794, 144559, 140644, 139132, 138119, 137461, 137889, 139331, 142021, 145324, 147872, 149794, 150896, 151382, 152463, 153835, 155328, 157110, 159950, 164000, 168096, 172068, 176119, 180053, 183247, 185130, 184781, 182322, 179093, 175314, 170151, 165173, 161856, 160764, 162151, 164289]
11162A64289J213l95J46R22J143L17k26j043m48K460M804N030N430M499J724j360
11146A88505k420l225m400n179o560q302q066n577k823j340k18n8L70r87q25L22
11130A39217P72N81R77N09Mq60p87m22P74J058R25L71O6j238j828j266J640J940
11112A42433J559J403P49j266q37Q34J732J456N47p41q8L92J587J166P37J263
11096A52926M86n52M34P51M90K79J270J929L352M768O867O634L088j084k919n013
11080A73706o476m781k302k104r51L85J73m05j79m46K21R45P17n72QR56K38l17
11062A58816R49J553J377J397J055J15n64l45M23R25J128R32K21L96R75O65Q26
11045A70844O36m85m39J116J671J306O61n4J029J771J223Q57O37K10m63n67K17
$$ y = [164289, 165502, 165107, 165253, 166175, 167318, 167635, 167409, 166366, 165918, 168378, 173182, 178212, 183642, 188141, 189865, 188505, 186085, 182860, 178460, 173281, 166721, 158419, 150353, 144776, 141953, 140613, 140395, 140337, 140707, 139720, 138895, 139217, 139989, 140570, 141547, 142056, 142060, 141200, 140413, 139991, 140765, 141823, 142748, 143119, 143185, 141947, 140119, 138853, 140493, 142433, 143992, 145395, 146144, 144878, 144041, 144875, 146607, 148063, 148610, 147869, 147781, 148173, 149760, 150926, 151663, 152926, 153412, 152860, 153294, 154045, 154535, 154814, 156084, 158013, 161365, 166133, 173000, 179634, 182722, 181638, 178719, 173706, 167230, 162449, 160147, 158043, 157092, 157477, 157650, 157245, 157066, 156620, 156841, 157786, 158503, 157931, 157939, 158895, 159133, 158816, 159765, 161318, 162695, 164092, 165147, 165262, 164698, 164353, 164776, 165701, 166829, 167761, 167982, 168378, 169353, 170018, 170844, 171480, 170995, 170556, 171672, 173343, 174649, 175310, 175256, 176285, 178056, 179279, 180136, 180773, 180983, 180520, 179953, 180170]
11028A80170Q29R43O4M27J143K239J576n6J62R40J56M37R47R59L58L24J673L253
11010A96544L462K843J775J274J138K561K530K528K620K331K425L302K484L151
10996B30968M689O389N970O864R024J1642J3736J7565K0345K2692K3994K7629
10984D01507L5597M8226O2401P4542P9529P8326O5877M5291M1849O7713R8724
10973A099582J03802P2409L4343J2549K087j6974m4266n9543o2467o8070o7832
10962A005620n2484l3190k5679k1944r991J1743L7897O8422R2553R9987R7378
10951A270312R4374Q3545N8323P111n5587q2173p1452o4911p0472q7077j11642
10940I70351j19301j06327q7374o7393n0284l7398k9955k4910k1364j8201j5310
$$ y = [180170, 180999, 181942, 182006, 182433, 183576, 185815, 187391, 187335, 187497, 188437, 188593, 189030, 189977, 190936, 191294, 191618, 193291, 196544, 200006, 202849, 204624, 205898, 207036, 209597, 212127, 214655, 217275, 219606, 222031, 225333, 227817, 230968, 235657, 242046, 248016, 254880, 263904, 275546, 289282, 306847, 327192, 349884, 373878, 401507, 437104, 485330, 547731, 622273, 701802, 780128, 846005, 891296, 933145, 1000858, 1099582, 1203384, 1275793, 1310136, 1322685, 1324772, 1307798, 1263532, 1203989, 1141522, 1073452, 1005620, 953136, 919946, 894267, 872323, 862332, 874075, 911972, 980394, 1072947, 1172934, 1270312, 1364686, 1448231, 1506554, 1513665, 1458078, 1375905, 1304453, 1239542, 1169070, 1081993, 970351, 851050, 744723, 657349, 589956, 539672, 502274, 472319, 447409, 426045, 407844, 392534]
10929C92534j1872q770p860q990q969q058p126p044n099l600l070j896n33J26
10915C09773k36m84j159j609j369r75j202j370j090l51J123J216K73M09k20j59
10899C02570P90J088J150J895J730K39j223l48J00R37J255J421J049L95K68R09
10883C14225J097K127L006L531L091L034K022J698J747L266M191N117M064L224
10869C55440K080J793J490K063J679J488J164J912J562K099L242M437L291L329
10855C87069L720M165M379N611N140M607M266M635M969M775K499J789J729L804
10841D43157M354M493L983M506M442N277N152O482O018O074O178P680P906Q054
10827E23756P558P626P433O937O645P675P149O856P098Q758R161R216R632J0920
$$ y = [392534, 380662, 371892, 364032, 355042, 346073, 338015, 330889, 323845, 318746, 315146, 312076, 310180, 309647, 309773, 309537, 309053, 307894, 306285, 304916, 303941, 302739, 301369, 300279, 299928, 301051, 302267, 302540, 302949, 302729, 302570, 303360, 304448, 305598, 307493, 309223, 309462, 308239, 307891, 307991, 308928, 310183, 311604, 312653, 313048, 313316, 314225, 315322, 317449, 320455, 323986, 327077, 330111, 332133, 333831, 335578, 338844, 343035, 348152, 352216, 355440, 357520, 359313, 360803, 362866, 364545, 366033, 367197, 369109, 370671, 372770, 376012, 380449, 383740, 387069, 390789, 394954, 399333, 404944, 410084, 414691, 418957, 423592, 428561, 433336, 435835, 437624, 439353, 443157, 447511, 452004, 455987, 460493, 464935, 470212, 475364, 481846, 487864, 493938, 500116, 507796, 515702, 523756, 531314, 538940, 546373, 553310, 559955, 567630, 574779, 581635, 588733, 597491, 606652, 615868, 625500, 636420]
10813F36420J1505J2997J2305J0918J0335J1415J2286J4294J6034J6960J6682
10802G82151J7020J7254J9013K0753K1071K1772K3336K3903K4447K6086K8786
10791A025592L1646L4033L5020L4723L5621L7725M2033N0024O1524P1957P4093
10780A533991O8886O8683P6503P5216N5982L9819M0144M5654M3180M1666M8937
10769B138661N9161P1465Q7474J05270J22971J36783J47084J53983J62655J77019
10759C362526K04332K36449K73798L16054L53585L71891L49048L06880K93799
10750F068362K81415K59859K59678L09625L81639M55165N41516O64111Q19992
10741A0041362R93707J202655J491542J859349K291125K833484L571851M382175
$$ y = [636420, 647925, 660922, 673227, 684145, 694480, 705895, 718181, 732475, 748509, 765469, 782151, 799171, 816425, 835438, 856191, 877262, 899034, 922370, 946273, 970720, 996806, 1025592, 1057238, 1091271, 1126291, 1161014, 1196635, 1234360, 1276393, 1326417, 1387941, 1459898, 1533991, 1602877, 1671560, 1748063, 1823279, 1879261, 1919080, 1959224, 2004878, 2048058, 2089724, 2138661, 2197822, 2269287, 2356761, 2462031, 2585002, 2721785, 2868869, 3022852, 3185507, 3362526, 3566858, 3803307, 4077105, 4393159, 4746744, 5118635, 5467683, 5774563, 6068362, 6349777, 6609636, 6869314, 7178939, 7560578, 8015743, 8557259, 9221370, 10041362, 11035069, 12237724, 13729266, 15588615, 17879740, 20713224, 24285075, 28667250]
10733B8667250M676046M145238L729062M394337O325265R458512J3680279J8352144
10725I3428133K0454541J5544555O581964L032837O176749R445001O564363j503466
10717A59724677p615861r175381p938450o429897n516253m731391m458477l687261
10709A10171706j177019J653540K961657L497729O215596J1380197J5693387J5308796
10701A65705589J0004154K226918m479939n715177j449241M857330P042720n3539
10693A78138815j2214248k0158321k2261718k1481738j8534963j4507783j0930055
10686E8049989q274129o417336n150566m237890l562501l024671k521481k024360
10678B2837055j640588j508529j568688j539745j384278j164395q93865o39742
$$ y = [28667250, 33343296, 37488534, 41217596, 45611933, 51937198, 61395710, 75075989, 93428133, 113882674, 129427229, 136009193, 139042030, 145218779, 154663780, 161228143, 159724677, 152108816, 142933435, 134994985, 128565088, 123048835, 118317444, 113858967, 110171706, 108994687, 110648227, 113609884, 117107613, 123323209, 134703406, 150396793, 165705589, 175709743, 177936661, 173456722, 167741545, 166292304, 171149634, 178192354, 178138815, 165924567, 145766246, 123504528, 102022790, 83487827, 68980044, 58049989, 49775860, 43358524, 38207958, 33970068, 30407567, 27382896, 24861415, 22837055, 21196467, 19687938, 18119250, 16579505, 15195227, 14030832, 13136967, 12497225]
10670A2497225n33279o50706q09892q20088p47566o39716n40906m71152m01157
10661F882763l23202k69119k56482k80652l12170l37546l46975l30769k91776
10652D134072k52297k15055j88195j69600j57224j43120j30227j16402j04078
10643B657874r4664q7887p8040o8597o0217n6995n4825n6106n9297o1271n7566
10632A922409n3653n1310n0522m8312m6450m3065l7051l0937k6006k1588j8770
10621A494745j6625j2837o956j948j193k842l793m070p426j1335j3424j5207k0644
10608A376445k5728k7248k3799k0298j5638j1663p232m174j153L0M125P427J0143
10595A261237J0319J1272J2539J5325J5085J6168J4987J5273J1626Q398K816M14
$$ y = [12497225, 11963946, 11313240, 10503348, 9683260, 8935694, 8295978, 7755072, 7283920, 6882763, 6559561, 6290442, 6033960, 5753308, 5441138, 5103592, 4756617, 4425848, 4134072, 3881775, 3666720, 3478525, 3308925, 3151701, 3008581, 2878354, 2761952, 2657874, 2563210, 2475323, 2397283, 2328686, 2268469, 2211474, 2156649, 2100543, 2041246, 1979975, 1922409, 1868756, 1817446, 1766924, 1718612, 1672162, 1629097, 1592046, 1561109, 1535103, 1513515, 1494745, 1478120, 1465283, 1458327, 1456379, 1455186, 1452344, 1448551, 1444481, 1437055, 1425720, 1412296, 1397089, 1376445, 1350717, 1323469, 1299670, 1279372, 1263734, 1252071, 1244839, 1240665, 1239512, 1239542, 1243667, 1251094, 1261237, 1271556, 1282828, 1295367, 1310692, 1325777, 1341945, 1356932, 1372205, 1383831, 1392229, 1395045, 1395459]
10583A395459k341J01L283Q591J2089J7186J7964J9427J8001K1304K4097K9355
10571A564516L1752L6846L8153M0998M2303M5870M5663M9009N0166N4728N7887
10560B057891O5369O9463P6189Q1767R1581R8214J09483J21242J40747J63148
10550C075094J94512K26275K58911K85379L19759L65688M35259N23662O33346
10541F317885P71320R73810J176502J196082J043927J114116J512081J822590
10533A5928313J375072L28133j80759J38208P74940J067125N14372l83098q51954
10524A8710352p11781k37943L58267R04757J305336J674926K202690K920425L812263
10515C0939292M838788O133481P728811Q228638O408132M972696N278594L847773
$$ y = [1395459, 1393118, 1393219, 1396502, 1405093, 1417182, 1434368, 1452332, 1471759, 1489760, 1511064, 1535161, 1564516, 1596268, 1633114, 1671267, 1712265, 1754568, 1800438, 1846101, 1895110, 1945276, 2000004, 2057891, 2123260, 2192723, 2268912, 2350679, 2442260, 2540474, 2649957, 2771199, 2911946, 3075094, 3269606, 3495881, 3754792, 4040171, 4359930, 4725618, 5160877, 5684539, 6317885, 7089205, 8063015, 9239517, 10435599, 11479526, 12593642, 14105723, 15928313, 17303385, 17631518, 17450759, 17588967, 18363907, 19431032, 19945404, 19562306, 18710352, 17998571, 17760628, 18118895, 19023652, 20328988, 22003914, 24206604, 27127029, 30939292, 35778080, 41911561, 49640372, 57869010, 64277142, 69249838, 74528432, 78376205]
10507G8376205k9783k709032k638682q90417K134268O272815J1060351J5175775
10499A06751500J7184046J7866025J7633921J4414181J0191456J2406431K3301172
10492B19748732L8433905M6304976L0810162l97275k2047879k7995641k6010356
10485B58846624j8304547j0838335j4102786k1595510k2609754j8515124j1966765
10478A40913803n934193l854251l260925n42992L760221P981000R137988P460517
10470A55661168Q463222J1409052J0621757O413973j132263j2016349k1966694
10463A57453866k4368387k0452459j4881970r757125o593566n253150n163157
10456G0984052m540699l041150j837624j810217j827171m64882J508920J869232
$$ y = [78376205, 78346422, 75637390, 72998708, 72108291, 74242559, 80515374, 91575725, 106751500, 123935546, 141801571, 159435492, 173849673, 184041129, 196447560, 219748732, 258182637, 304487613, 335297775, 334900500, 312852621, 284856980, 258846624, 240542077, 229703742, 215600956, 194005446, 171395692, 152880568, 140913803, 134979610, 131125359, 127864434, 127321442, 131081663, 139062663, 148200651, 155661168, 164124390, 175533442, 186155199, 192569172, 191436909, 179420560, 157453866, 133085479, 112633020, 97751050, 87993925, 81400359, 76147209, 70984052, 66443353, 63402203, 61564579, 59754362, 57927191, 57462309, 58971229, 60840461]
10448F0840461o61078l482927m357977l831038l263414l200986k397113q34030
10440C8811898M62441k216k513112m584945m899972m364690l441412k550291j910506
10431A5007195j507140j223836j037256q97780p91913o82785n76413m65648m08039
10422G416385m15257m64052m71902m47568l98079l51386l01156k65885k34033
10413D067067k15557j95561j83427j64339j48775j26342j09604r1506q7839r0718
10403B653399j04632j08854j08760r8500q8646p5438o9743o3447o3796o2151o2535
10392A746897n7657n4536m6275m1424l5253l2695k8056k6356k1839j9979j4672
10381A368155j0195k619K286J1437K0730L5684N2350P6666J06720J44077J63120
$$ y = [60840461, 60179383, 56696456, 52338479, 48507441, 45244027, 42043041, 39645928, 38811898, 39274339, 39272123, 36759011, 32174066, 27274094, 22909404, 19467992, 16917701, 15007195, 13500055, 12276219, 11238963, 10341183, 9549270, 8866485, 8290072, 7824424, 7416385, 7001128, 6537076, 6065174, 5617606, 5219527, 4868141, 4566985, 4301100, 4067067, 3851510, 3655949, 3472522, 3308183, 3159408, 3033066, 2923462, 2831956, 2744117, 2653399, 2548767, 2439913, 2331153, 2232653, 2144007, 2068569, 1998826, 1935379, 1871583, 1809432, 1746897, 1689240, 1634704, 1588429, 1547005, 1511752, 1479057, 1451001, 1424645, 1402806, 1382827, 1368155, 1357960, 1355341, 1357627, 1369064, 1389794, 1425478, 1477828, 1554494, 1661214, 1805291, 1968411]
10370A968411J52268J34733J53067K20438L51605N58560Q90024J342304J534060
10361G305470O90290o81617j285445j297419j051219p11913m65481l21227k35660
10352A945779j87006j59938j36447j12408r4444p9321o9303o1475n5169m8094
10342I42174m2946l7398l4785l2697l0921k6863k4865k2111k0810j8563j8410
10331F31805j6476j5586j3335j3385j1144j1052j0461j1321j0675j1192r655r281
10319D88242r165j0681q345p708o155n625m889o254n556n632l623l993m271o707
10305C99638m718l866l472m128l097m776n135n284l343k597j070j792r46k813
10291C52601k874j075L206M687N919N747N980N753R409J3565K0436K6310L3054
$$ y = [1968411, 2120679, 2255412, 2408479, 2628917, 2980522, 3539082, 4429106, 5771410, 7305470, 7995760, 7314143, 6028698, 4731279, 3680060, 2968147, 2502666, 2181439, 1945779, 1758773, 1598835, 1462388, 1349980, 1255536, 1176215, 1106912, 1045437, 990268, 942174, 899228, 861830, 827045, 794348, 763427, 736564, 711699, 689588, 668778, 650215, 631805, 615329, 599743, 586408, 573023, 561879, 550827, 540366, 529045, 518370, 507178, 497523, 488242, 479077, 468396, 460051, 452343, 446188, 440563, 435674, 429420, 423864, 418232, 414609, 410616, 406345, 399638, 394920, 391054, 387582, 383454, 380357, 375581, 370446, 365162, 361819, 359222, 358152, 356360, 355414, 352601, 349727, 348652, 351858, 356545, 362464, 368211, 374191, 379944, 389353, 402918, 423354, 449664, 482718]
10278D82718M0250M6350M0330L3003L6193M0336K1583j0329k8229k8331l2222
10267F41652m0025m1006l2077k3060j4776p724p0Q282J8849K7336L6212M8867
10255F22460O3792P2216P3636P6858Q7241J00983R6420N6486J9135J1995J3747
10244A294969J508j3021j7109k4735k2099j0240l9023r0527j07215r4479o8382
10233H09647l5679l688K3901M0956M0869L6943M9898P3759Q7521R1875R6387Q6852
10221A399241N9576L7277L4560J6314k4430o3567q8585p2673o1638r0735j18075
10210A027265j12097r7415q2357o5025m6560l2423j6218Q89K0088L7795M1753
10199F75695K5868J3259J0146P346r684k3915j3959Q926J9818q899o0304q1535
$$ y = [482718, 522968, 569318, 609648, 642651, 678844, 719180, 740763, 730434, 702205, 673874, 641652, 601627, 560621, 528544, 505484, 490708, 482984, 482914, 491196, 510045, 537381, 573593, 622460, 686252, 758468, 832104, 908962, 996203, 1097186, 1193606, 1250092, 1269227, 1281222, 1294969, 1296477, 1283456, 1266347, 1241612, 1219513, 1209273, 1170250, 1079723, 972508, 878029, 809647, 773968, 770280, 794181, 835137, 876006, 912949, 962847, 1036606, 1124127, 1216002, 1312389, 1399241, 1458817, 1496094, 1530654, 1546968, 1522538, 1458971, 1370386, 1297713, 1236075, 1145340, 1027265, 915168, 817753, 735396, 670371, 623811, 591388, 575170, 576059, 596147, 633942, 675695, 701563, 714822, 724968, 732314, 722630, 698715, 684756, 693682, 713500, 704601, 644297, 562762]
10187E62762q0036o7230m9866l4362k5251j9146j6727j4800j3813j2230j0948
10176B18353q531p920p029o685n250n071m017l097j913l006l177m204l363l791
10162A51299l342l055k258j409o43j411j710k264k148k541k582k994k326k516
10148A20100k083j596m24q16j703l120k627j811m6N26J799J872M70k432k786k360
10132A02963q04j009P1q1j207j359j088o38J11j106j438j822k569j477Q34K040
10116I1421J472k65j721j458r30n11j39m49o60q95j087o78j8m00p88m76k35j48
10098H2035m96l41l29k82q21j448j527n07r2Q5N69J419J342j56j528q90q82j22
10080G6029O62Q89j23m85r59l70q0J1n24j107j756j111q76N07R81J968J469J784
$$ y = [562762, 482726, 415496, 365630, 331268, 306017, 286871, 270144, 255344, 241531, 229301, 218353, 209822, 201902, 194873, 188188, 182938, 177867, 173850, 170753, 168840, 165834, 162657, 158453, 155090, 151299, 147957, 144902, 142644, 141235, 140592, 139181, 137471, 135207, 133059, 130518, 127936, 124942, 122616, 120100, 118017, 116421, 115997, 115181, 113478, 110358, 107731, 105920, 105874, 106400, 108199, 110071, 110541, 108109, 105323, 102963, 102159, 101150, 101221, 101140, 99933, 98574, 97486, 96848, 96959, 95853, 94415, 92593, 90024, 88547, 89381, 91421, 92893, 92628, 90907, 89449, 88519, 88008, 87869, 87420, 86760, 85865, 84778, 84100, 84082, 83682, 82894, 82418, 82183, 82035, 81539, 81198, 80869, 80587, 79766, 78318, 76791, 76284, 76192, 76277, 76846, 78265, 79607, 79451, 77923, 77033, 76151, 76029, 76691, 77580, 77457, 76972, 76013, 75643, 75563, 75574, 75050, 73943, 72187, 71076, 70200, 70707, 71688, 73656, 75125, 76909]
10062G6909N64l92j391r44j42J686J565j69k302j874j691j339j921j185j341j578
10046F4455j879j2M73Q70M36L21r96j291q86k32L70L426M841O236Q012P099j610
10029H9633p461q264p048n513l229j776j021j938j331j137j016j043L65L44Jn
10013D9561o24j385r04j227j238j098o65J7O30j44n62j385p56n8J49q2R9m76n3
9994C9799L03K59j50p12q28K7L40N69J02q9r7n58j354r80J13P22L66J02N62K27
9974C8723n85j176j146j104j510r15l58K75J085M20j44o79j59l15j22Q8P93N41
9956C3712k05m66m61n79j697k580j084Q9J040J203Q84j12q12r87q3N73K33k85
9938B8383LR79J117r75j322l0R81K6L73L28R89m1o80q64j350j531K88Q63J707
$$ y = [76909, 77473, 77081, 75690, 74746, 74604, 76290, 77855, 77686, 75384, 73510, 71819, 70480, 68559, 67374, 66033, 64455, 62576, 62564, 63037, 63907, 64343, 64664, 63668, 62377, 61491, 61259, 61629, 65055, 69896, 76132, 84144, 91243, 89633, 82172, 73908, 66860, 61347, 58118, 56342, 55321, 53383, 52052, 50915, 49899, 48856, 49221, 49565, 49566, 49561, 48937, 47552, 46648, 45421, 44183, 43085, 42420, 42437, 43067, 42923, 42361, 40976, 40220, 40162, 40311, 40229, 40328, 39852, 39799, 40102, 40361, 40211, 39499, 38671, 38698, 39038, 39607, 39709, 39620, 39523, 38965, 37611, 36631, 36744, 37466, 37832, 37934, 38496, 38723, 38138, 36962, 35816, 34712, 33202, 32287, 31929, 32204, 33289, 33709, 33565, 32886, 32727, 32412, 32290, 32378, 33171, 33712, 33507, 33041, 32580, 32001, 30304, 27724, 26640, 26729, 27769, 28972, 29856, 29744, 28932, 27945, 27862, 28435, 28668, 28383, 28386, 29365, 30482, 29507, 28185, 28155, 29136, 29162, 29535, 29863, 30852, 30811, 30131, 29267, 27917, 26386, 26674, 27537, 29244]
9919B9244J099J48P40J202l18j32P06J966J943J525j005k071k132j832k086j270
9903B7727p55N4m81q62k158k160j270Q14K222J882K98k40M26R37k80j018j393
9886B3743M47K94L7r81n45j89m31p92K4n41p26n13o34k55K12p34q1J076J127j72
9866B0366K45J014P11K71J71P5j10n9O49J543Q80r04j290j102j258j068o4l71
9848A9699m61JJ00Mr9k00m90k3k34j328j995j314P89J535L66N86J052J95n64l15
9828A7304N54O55m51o99k19K05o11r34M8J106J051k55q42o34j442j170n27k14
9810A2925lQ02M77O96L54n25j516j101r33j317j536m69N0J169J231Q41R4L85R6
9791A1720K31J076K038J744K371J925L020L839M502M635L179r47m573n828n644
$$ y = [29244, 30343, 30491, 31231, 32433, 32115, 31983, 32689, 34655, 36598, 38123, 37118, 35047, 32915, 31083, 28997, 27727, 26972, 27026, 26545, 25683, 23525, 21365, 20095, 20909, 23131, 25013, 25311, 25071, 25497, 26434, 26154, 25136, 23743, 24190, 24484, 24521, 23540, 22995, 22806, 22375, 21583, 21607, 21066, 20340, 19827, 19193, 18938, 19150, 18416, 18335, 19411, 20538, 20366, 20611, 21625, 22336, 22607, 22778, 22853, 22743, 22684, 23333, 24876, 25756, 24852, 23562, 22460, 21202, 20134, 20070, 19699, 19238, 19239, 19339, 19343, 19244, 19044, 18554, 18531, 18297, 16969, 14974, 13660, 14449, 15984, 16350, 16936, 17988, 18183, 17619, 17304, 17858, 18513, 18062, 17363, 17144, 17349, 16738, 15804, 15852, 16958, 18009, 17754, 16912, 16278, 14836, 13666, 13139, 12925, 12922, 13724, 14201, 14897, 15251, 14726, 13210, 12109, 11176, 9859, 8323, 7854, 7904, 9073, 10304, 11145, 11239, 11624, 11720, 11951, 13027, 15065, 16809, 19180, 21105, 24125, 27964, 32466, 37101, 40280, 39333, 34760, 28932, 23288]
9776B3288m688k450o55K70n37n26j604k613j653J203J485K02j660q89K59N55N82
9759A0569J056j92M05Q92N79N14J607J877K956L980M459M036K513n32k742l827
9743B8150l294l169k564j572m50r0K55m81r10P0J326J697J011J031K191L464N144
9726C1809M085O82k510l914l207k885l352l507k799j715n99j21j230j811j386
9711G540k18J47N49K71r87j390j123N96J600R44J617J986J359K179M206N530N636
9694C0442N906L812N62j712k575m068n647n313k491m08l7K7J782K337J228j500
9678B2345l117k726j834k120j008J67j36r9j54r06j387j923j651j341M30J906
9662F446J828N05J007Q19K90q99j384j920j589O40J976O78n2j73O21J977K244
$$ y = [23288, 18600, 16150, 15495, 15765, 15228, 14702, 13098, 10485, 8832, 10035, 11520, 11722, 10062, 9173, 9432, 9987, 10569, 11625, 11433, 11838, 12730, 13309, 13823, 15430, 17307, 20263, 24243, 28702, 32738, 35251, 34719, 31977, 28150, 24856, 21687, 19123, 17551, 17101, 17011, 17266, 16785, 15875, 15945, 17271, 18968, 19979, 21010, 23201, 26665, 31809, 35894, 36576, 34066, 30152, 26945, 24060, 20708, 17201, 14402, 12687, 12088, 11967, 10737, 8926, 7540, 7322, 7469, 8018, 8289, 7302, 5912, 4789, 5385, 6985, 7929, 9546, 11532, 12891, 15070, 19276, 24806, 30442, 36348, 40160, 40722, 39010, 36435, 32367, 26720, 21407, 18916, 18508, 18471, 18498, 20280, 22617, 23845, 22345, 19228, 16502, 14668, 12548, 11540, 11707, 11571, 11472, 11318, 10412, 9025, 7102, 5451, 4110, 4540, 6446, 8274, 8779, 9786, 10605, 10895, 9996, 8612, 6692, 5103, 5743, 7719, 8397, 8345, 8172, 8793, 10770, 13014]
9645A3014O19Q06J247K322J751Q08L73K69l41j036k297j661j551j830k391j916
9629H186j557m30P94J621J447R70J69l99p59j9J418J944L65n13k58M84q11k027
9611A0625k327k633k339J67J669Q59o18r87r31o5k82M32J322J229L97p39j479
9594D300j551j050k0J03K06Q16M87n60j227j205j361q44R8J66J080R34n57j459
9576a644j354K49J484K291J375n76j606j083o67r58j599n07Q48J342J618N84p44
9559i47r54j40O20K80j219k463q29M90J302R14MN8N97N22O03k06n05K49J137J877
9539A390J458k79p78n33Q84R06J72j026j486r78K98J63o51n55J322J994J454L40
9521D095l39j535j296o21P37P92J62l50q20j222m67l77j99J16L14J35j00p16j302
$$ y = [13014, 13633, 14439, 15686, 18008, 19759, 20567, 20940, 21209, 20868, 19832, 17535, 15874, 14323, 12493, 10102, 8186, 6629, 6199, 6993, 8614, 10061, 11031, 11200, 10801, 10042, 10023, 11441, 13385, 13750, 13237, 12979, 13463, 12652, 10625, 8298, 5665, 3326, 3493, 5162, 6021, 5403, 4416, 3485, 3420, 3138, 3570, 4892, 6121, 6518, 5779, 4300, 2749, 1699, 1679, 1782, 1988, 2804, 3291, 2731, 1504, 299, -1062, -1906, -1808, -1642, -562, 372, -185, -1644, -2998, -2749, -1265, 1026, 2401, 1825, 219, -864, -1531, -2489, -4088, -4595, -3747, -2405, -787, -203, -947, -1901, -2041, -1421, -1141, -2360, -4823, -5652, -5162, -3860, -2946, -2942, -2884, -2287, -1765, -1162, -1368, -1873, -1624, -487, 1390, 2848, 2569, 1791, 1258, 2142, 3048, 3220, 2194, 708, -270, 28, 191, -460, -1015, 307, 2301, 3755, 4095, 3756, 2221, 925, 304, 1041, 1833, 1995, 1645, 825, -397, -864, -1241, -1440, -1324, -1010, -875, -975, -1691, -2993]
9502b993j042k53N8j15o14r27l21j7q39n27O76J658J993K214J211k04j799k003
9484c844j426N95O72J206J525M42j209j606o80m21r65m38Q9k26m59m2r7K28J94
9465f462q46q04L67Q38R11J534J987J172N84Q47J170j68r81j396j763r15N18O62
9447b745k74j361q60P0N41k4j325j752j817j094K15J137J734J711Q30J37l37r81
9429f195q24N03O11J012P84K67p26o76K66l55q15j110q61L34Q06O41J34L07M29
9410e468R39Q17K31l89N9K07J91N13P58p91j376l33J37p56j207J36Q98P10J655
9391c069O74n25j521j926j834n0Q21M61j5m25m25J49J236J281L55P27M83k28m90
9372d321N80J089L25l58L12L80N58J97k9M01J21m63l28m11J32N52Q89k57j296
$$ y = [-2993, -4035, -4288, -4230, -4345, -4959, -5886, -6207, -6224, -7063, -7590, -6914, -5256, -3263, -1049, 162, -42, -1841, -3844, -5270, -4675, -4003, -2797, -1272, -830, -2039, -3645, -4325, -4746, -5711, -6149, -6060, -6286, -6745, -6787, -6884, -6656, -6462, -7308, -8112, -7745, -6907, -5996, -4462, -2475, -1303, -719, 128, 1298, 1130, 149, -1247, -3010, -3925, -3407, -2745, -3019, -4380, -5240, -5170, -4629, -4653, -5978, -7730, -9547, -10641, -10426, -9289, -7555, -5844, -5014, -4877, -5214, -6195, -7019, -6516, -5905, -4893, -4109, -3842, -4568, -5244, -4978, -5333, -6148, -7258, -8119, -7785, -6979, -6338, -6204, -5897, -5468, -4529, -3712, -3481, -3870, -3811, -3604, -3413, -2900, -2142, -2933, -4309, -4642, -4505, -5261, -6468, -6332, -5434, -4724, -3069, -2395, -2920, -4441, -6367, -8201, -8251, -7430, -6969, -6984, -7409, -7834, -7685, -6449, -5168, -4813, -4086, -3603, -3831, -4321, -3741, -2652, -2327, -2685, -2373, -1993, -1435, -1238, -1267, -866, -745, -1208, -1536, -1947, -1815, -1263, -374, -631, -1927]
9353a927j215k46j59l63j054j004O3J229Q03P8N25R92k98r43n13l76j062j142
9335f612m34J198P70Q6oJ28k64m17n16q24q65N3j69j086k84J321K051J506P88
9316c576O83k41j50m42k64Q17J236L5kJ038l08l87m09m94L30K38k23O1O54L51
9296a053j358k321j159N45R09J509J620K20j705j706j223O22J141j87o42M38K68
9279d082n6N18P9k209l172p22P17K15j103j997j387P66K319J438q39l072l074
9262a5661j315K203M205L919K511O86L86J594K656L497K202m27k434j515r66K62
9246A803R09P37j50K24R77N63j297j992k133k003j256J401K119J915J229k79j634
9229A133j698j412j65J46j006j334q98q60O56J526J238Q84N66K39K57J98K90K28
$$ y = [-1927, -3142, -3388, -3547, -3910, -4964, -5968, -5905, -4676, -3873, -3795, -3270, -2278, -2576, -3519, -4032, -4408, -5470, -6612, -7046, -5848, -5078, -4992, -4998, -4870, -5134, -5551, -6067, -6891, -7756, -7703, -7872, -8958, -9242, -7921, -5870, -4364, -3576, -2893, -3134, -3284, -3726, -3990, -3173, -1937, -1902, -1904, -866, -1174, -1561, -1970, -2464, -2134, -1896, -2119, -2058, -1404, -1053, -2411, -4732, -5891, -5346, -4437, -2928, -1308, -1088, -2793, -4499, -5722, -5100, -3959, -4146, -4788, -4350, -4082, -4138, -3620, -3541, -5750, -8922, -9644, -8927, -8712, -9815, -11812, -13199, -12433, -10114, -8676, -9515, -12587, -15661, -16976, -14773, -10568, -6649, -4138, -3452, -3066, -1472, 1184, 4681, 6883, 6456, 4022, 2507, 1541, 1803, 2712, 3449, 3299, 3523, 4500, 5063, 3766, 1774, -359, -2362, -3618, -2217, -98, 1817, 3046, 2767, 1133, -565, -1977, -2142, -1996, -3002, -4336, -5234, -6094, -5438, -3912, -2674, -1790, -1224, -985, -728, -530, -240, -12]
9211a2l91j658j615j661l79J066J335K154J438m32j136j223r1O58J824J780R5
9194A752j263j844j478j083n72Q32J362M18k00m29j32k28j359r18k33Ll2O4P27
9175d613R42L56j72q39j326p40l93O99P19j24M54J371J056J42j59M77j67j087
9157c404p72k6K87q15j505p15m50k05o25J81P46K86L70J640J590q35j808K8J238
9138d794P38k47k05k30O69O94M23O71M46p29n51N05N33n71p15n02N63J031P37
9119a534J93j67K25M05n24k189j208M94M25J16m07q91j424l65P58L32q60j273
9101g894r34J96J866K264Q72Q46O37q23j429r34J53Q53m09q91j144l27O95K002
9083d401K451J617K25m06o21k29K8J88p13j022j281j272p31J270K591O49j868
$$ y = [-12, -403, -2061, -3676, -5337, -5716, -4650, -3315, -1161, 277, -155, -1291, -2514, -2605, -1947, -123, 1657, 1752, 489, -1355, -2833, -3916, -4488, -3656, -2294, -1876, -2076, -2505, -2637, -2865, -4224, -5142, -5375, -5372, -5404, -5340, -4613, -3671, -3315, -3487, -4326, -5652, -6392, -6785, -6086, -5367, -5491, -5037, -3666, -2610, -2468, -2627, -2150, -2317, -3404, -4176, -4202, -3915, -4730, -6235, -6950, -7400, -7605, -8230, -8049, -7303, -7017, -6647, -5007, -3417, -4252, -6060, -6032, -4794, -4056, -4303, -4508, -4738, -4069, -3375, -2952, -2281, -1835, -2564, -3115, -2610, -2077, -2648, -3363, -3865, -3302, -2271, -1534, -1341, -1508, -1283, -878, -1402, -3591, -4799, -4305, -3880, -3764, -4171, -5062, -6486, -6851, -6093, -5761, -6621, -7894, -8828, -8632, -6766, -4502, -3630, -2784, -2147, -2970, -4399, -5333, -5180, -4327, -4736, -5627, -6771, -7098, -6403, -4401, -1950, -333, -108, -514, -1135, -1364, -1336, -1148, -1861, -2883, -4164, -5436, -6167, -4897, -2306, -1657, -3525]
9066c525j432R55K581P42r72j194j273j963k45J725J281j53k176k898j275M33
9050i389J952K665J553L03n96l61N14O56O68N81j79j469q17Q74J043j64j208r45
9032d319l97k03m22j253j080N41R20M46J198J774M93L6n0j603k079j333p72Q91
9014g212J358J192N70j52L53Q7J8Q42P5j06O89j18j322j539j565o19j69p93q35
8995i246L34J74j36m2K85n42j82J94R1j60k74O93R49K40K32J039K217J850J032
8976a252l50l24O05p57k552p85O27J443L65o06K38Q14P7m93m26o52j003J33J049
8957c849L00j207j070l34M85R15O74N60O94m6N31R91K38m95j547j912p19r82k42
8938g015L39Q69J088M35m51j162j307M77J535J335L91M5O20J336P67n99k406j747
$$ y = [-3525, -4957, -4002, -1421, -679, -1651, -2845, -4118, -6081, -6326, -4601, -3320, -3473, -5649, -8547, -9822, -9389, -7437, -4772, -3219, -2916, -3512, -3873, -3359, -2703, -2035, -1454, -1633, -3102, -3919, -3045, -2002, -2166, -3374, -4319, -4716, -4919, -5341, -6594, -7674, -7133, -6213, -5767, -4569, -2795, -2302, -2266, -2316, -3919, -5998, -7331, -8103, -7212, -5854, -4662, -4092, -4244, -3891, -3804, -3786, -2944, -2869, -2975, -2286, -2404, -3726, -5265, -6830, -7449, -7618, -8411, -9246, -8912, -8738, -8874, -8916, -8631, -9173, -9355, -9161, -9070, -9230, -9504, -8811, -7862, -7622, -7390, -6351, -4134, -2284, -1252, -1602, -1926, -1321, -2078, -4630, -5415, -4788, -3345, -2980, -3586, -3348, -2534, -2457, -2950, -3376, -4028, -5031, -4898, -3849, -3549, -4756, -5826, -6160, -5675, -4760, -4086, -3526, -2832, -2878, -2347, -1356, -1118, -1613, -3160, -5072, -5791, -6773, -7015, -6676, -5807, -4719, -4284, -4735, -5897, -7204, -6727, -5192, -3857, -3466, -3421, -2801, -1465, -698, -1297, -3703, -5450]
8920e450l94n2R0m40n46J1k69k75K7p05r21K76k74n57J277J679O67l21p89j306
8900h272j142o96m6Q97J364K095K002Q36N12K01m53j562j527o64J61N79P95N26
8882d394K88p02q20r94l09N21O01O27J162N1j026j174J45M98M43M46n65k12P15
8863d699N87Q17J145N43p53j348o26j5n17p90m82M51j29m12P71K701K476J061
8845G81o49j404j537J4J934J741j066k072o51J62p08r22o71j08P24J120L16kj90
8826c188Q41K007K309R02j08r57k085j222n3L62N68m61o85n89j148r26L31Q97
8808c205R10K59p82p77j22k99L93N06L25J530K130M25r06j196k49l28r38o04j19
8789c047J69N97R59j46o92j73M95J173N54p90j166j265j188q71P82J950O01O5
$$ y = [-5450, -5844, -5896, -5806, -6246, -6792, -6781, -7050, -7325, -7298, -8003, -8924, -8648, -8922, -9479, -8202, -6523, -5856, -6177, -6966, -8272, -9414, -10110, -10156, -9259, -7895, -5800, -3798, -2962, -2450, -2249, -2702, -4264, -5791, -6455, -6294, -5715, -4920, -4394, -4106, -4808, -5628, -6622, -6931, -6410, -5809, -5182, -4020, -3969, -4995, -6169, -6024, -5526, -5083, -4637, -5202, -5414, -4699, -4112, -3295, -2150, -1607, -2360, -3708, -4334, -4349, -4866, -5656, -6138, -5687, -5816, -6228, -5457, -2756, -280, 781, 132, -1272, -2809, -2795, -861, 880, -186, -2258, -2909, -2747, -3455, -4377, -5048, -5156, -4432, -3312, -2996, -2998, -3188, -2347, -340, 1969, 2871, 2763, 1806, -279, -1501, -1554, -1192, -624, -1085, -1770, -2359, -3507, -4433, -4102, -3205, -2295, -2036, -2818, -3595, -3717, -4016, -3623, -3117, -2792, -1262, 868, 1293, 387, -809, -1058, -1386, -2324, -2928, -3047, -2878, -2281, -1322, -1468, -2160, -2333, -1838, -665, -111, -901, -2067, -3332, -4520, -5391, -4609, -2659, -2058, -1993]
8771a993J00n15o5R75j4m92L44M39P25M98O56J281J351n37j369k038k411o66J212
8752b519Q77L43P59J255J176J866K173Q88r03k129k010j447j017r57m58N87P22
8735g94Q54m6o39r54j068q81q56n27N9L36Q3j88L29n83j050j57J851J440j18j151
8715d060p44O21O24n9j264j736p84n91j12k84j99J21J066J981K204J837N50P74
8697e5J473Q30j94j236r29N87R14O6p56j464o95n77r40q91L59J338J473J285J264
8678A852J248J040J098K24j251j262o70r03j226K55j16j10M1L98j348j767p14
8661c211J369M412L599K228J740O36o77j854k292j233j59l5O33R48Q73J107P27
8644H811m07j924k436j785p27k97M13M65K36K48l71j746j605K50J884K416K799
$$ y = [-1993, -1893, -2408, -2473, -1498, -1512, -2004, -1660, -1221, -496, 2, 658, 1939, 3290, 2753, 1384, -654, -3065, -3731, -2519, -1642, -1299, -540, 715, 1891, 3757, 5930, 6818, 5915, 3786, 1776, 329, -688, -1645, -2103, -1516, -794, 60, 14, -625, -1579, -2647, -3528, -4384, -4911, -4852, -4516, -4433, -4621, -4292, -4875, -5925, -6082, -4231, -2791, -2909, -4060, -4804, -4183, -3559, -3618, -4882, -6618, -7402, -7993, -8105, -8389, -8588, -8467, -7401, -5420, -3216, -1379, -829, -55, 1418, 2248, 2054, 818, -111, 476, 1390, 1456, 700, -764, -1459, -2036, -2976, -3867, -3508, -2170, -697, 588, 1852, 3100, 4140, 5238, 5462, 4211, 2949, 2279, 1376, 150, 405, 289, 179, 220, 618, -730, -2497, -3211, -1842, 2570, 6169, 8397, 10137, 10773, 10096, 8242, 5950, 4717, 4558, 4523, 5156, 6104, 6977, 8084, 8811, 8404, 6480, 4044, 2259, 1532, 1235, 1648, 2113, 2349, 2597, 2226, 480, -1125, -875, 1009, 3425, 6224]
8627F224L199K772J719J335O21q09j896k724k398j305j198r71o61n95p26m6J220
8610C761J543J369K307L367L528K888J853N11j041k099l263m306l472k038j160
8595C748m58Q87J678J179J25p73m06J2K12Q66J232J497K683L230J389j14j303
8578A5684k243j967j691j927L78K163J631M52j313k817k404j801j50J309J283
8563F587J859K636K720L342K825K299L110O657J1083J3206J1298P122L231l715
8549G4260j1386j3256j2407r846o408l206k186j845k246k466k209j843j078j024
8535B854j324q95m09J84l62m10o26k33k35j37N14K98j78o57o36O8J36J99K71k32
8515a810J10J524N93l33l07L97J403K085K138O08NJ210L200M568O825J0388J3105
$$ y = [6224, 9423, 12195, 13914, 15249, 15870, 15061, 13165, 10441, 8043, 6738, 5540, 4569, 3908, 3313, 2587, 2541, 3761, 5304, 6673, 8980, 12347, 15875, 18763, 20616, 21127, 20086, 17987, 14724, 10418, 6946, 4908, 3748, 3290, 4177, 5855, 7034, 7159, 6386, 5980, 5992, 6204, 7070, 8302, 9799, 12482, 15712, 17101, 16987, 15684, 13441, 11474, 9783, 7856, 8234, 10397, 12028, 12480, 11167, 8350, 5946, 4145, 3995, 5304, 6587, 8446, 11082, 13802, 17144, 19969, 22268, 25378, 32035, 43118, 56324, 67622, 74744, 77975, 74260, 62874, 49618, 37211, 27365, 20957, 17751, 15565, 13720, 11474, 9008, 6799, 4956, 3878, 2854, 1530, 635, 226, 410, 48, -362, -988, -1221, -1456, -1593, -1079, -781, -959, -1616, -2252, -2184, -2048, -1849, -1578, -1810, -1700, -176, 417, 84, -223, 174, 1577, 3662, 5800, 6408, 6413, 7623, 10823, 15391, 22216, 32604, 45709]
8498D5709J1745N920J360m078j0000j1535r814p557n659l483k952l420l216k043
8484I77q75j026o81K20Q21Q51l57j348j512o61M37J35o25n80J25J082Q39P72M0
8465a366o55P8N51P23Q53k04l4k06r7o48k021k023l94j28j382j717l13L14k11
8446h880k37J51P01J579Q43J352J762M56l73K35pn52q70L34J213J676P05N86m24
8427B50j408j720j902o56N70J135J424%q29m64j82K8R62j85j324j123k98Q80K677
8408b165K420J090Q87J482J050N56K19j26j020k469k734q34P53j02q62n92L59
8391b088J040N23j117m73M68J00J09M30N27k03j420k19R45P58K027K347J786J318
8373F858N47j330k189k033j919j250p88P81K044K269J462l64k242j900r23q63
$$ y = [45709, 57454, 63374, 64734, 60656, 50656, 39121, 29307, 21750, 16091, 12608, 9656, 6236, 3020, 977, 102, -924, -1605, -1385, -564, 287, -70, -1418, -2930, -3591, -3154, -3019, -3644, -4224, -4099, -3017, -2178, -1406, -1366, -2021, -1943, -1392, -669, 184, -20, -54, -260, -357, -1005, -3026, -5049, -5443, -5571, -6953, -8670, -8983, -8669, -8880, -9117, -8966, -8265, -6686, -5843, -4491, -2729, -2273, -2646, -2411, -2418, -2970, -3840, -3506, -2293, -617, 88, 674, 250, -1158, -2878, -4780, -5436, -4866, -3731, -2307, -2307, -3136, -3600, -3782, -3754, -2792, -2977, -4301, -5424, -5722, -4842, -2165, 255, 1345, 2232, 3714, 4764, 5320, 5539, 5413, 4393, 1924, -810, -1644, -891, -993, -1855, -2447, -2088, -1048, -525, -1642, -2115, -1647, -1547, -1438, -1008, -481, -684, -2104, -2323, -1378, -620, 1407, 3754, 5540, 6858, 7405, 6075, 3886, 1853, -66, -1316, -2104, -1323, 721, 2990, 4452, 4088, 1846, -54, -977, -1840]
8357a840j143o27R90J424J00k83m33p79K26P71K60P50J208Q42O15k7j99q70j332
8338c47l69r6K30M79q7m32N3K87o99j731n17j317k084j202n76j099r1J82K08J199
8318h009J650J069J67j74Q05M16q57m99L77J028O14k96o19n33o07p5N99M81j65
8299d628j386m46P1L67K98L89L44N71P57K38J120J636Q18N38J90L26L8j083k851
8280b693j936l27J56J048J213J602Q4j744r71K0L58k05M49J294K23q78r53j392
8262d652j986j973m60o4m53p12k279k312M54K775J834J108J035J214J630J211
8246c630J070M54p41j388q37l7N59j68l23J125K213J258j784k955k047r16L49
8229g798N32j98j338j539r34j166j783o30O30J581J916P45j78j845j845Q98K367
$$ y = [-1840, -2983, -3610, -2620, -1196, -1096, -1379, -1812, -2591, -2365, -1594, -1334, -584, 624, 1466, 2081, 2054, 1855, 985, -347, -716, -812, -582, -103, -190, -622, -569, -282, -981, -2712, -3229, -4546, -6630, -7832, -8408, -9507, -9598, -9416, -9208, -8009, -6359, -5290, -5123, -5297, -4492, -4076, -4933, -5432, -5055, -4027, -3413, -3709, -4328, -4861, -5468, -5543, -4944, -4463, -4628, -6014, -6460, -6389, -6022, -5724, -5335, -4991, -4420, -3663, -3425, -2305, -669, 149, 687, 877, 1203, 1241, 158, -2693, -4629, -4956, -4800, -3752, -2539, -937, -853, -2597, -3568, -3548, -3190, -3395, -2946, -1652, -1429, -2307, -3260, -4652, -6638, -8611, -9071, -9135, -9588, -10300, -12579, -14891, -14437, -11662, -9828, -8720, -7685, -6471, -4841, -3630, -2560, -2106, -2847, -4235, -5072, -5109, -4550, -4718, -5041, -3916, -1703, -445, -2229, -5184, -7231, -8147, -7798, -7266, -7464, -8802, -10341, -11275, -12441, -14224, -14854, -14224, -12643, -10727, -9982, -10160, -12005, -13850, -12952, -10585]
8212a0585K584K224J319O29j457l612k652R7l28r21K399M573J081Q19K190k387
8196d027p403o604m360K789J9973J6589K588K34j531l177l349j836M94Q45j887
8181I338n259n753k319R68K923K833m36k532j549k79J82k53p72j162n59n34j34
8164e297j2K003J684J96K012K839J461P65K84J095Q65o11o75k0j577j769Q7P74
8146D104o33k294k381l97M57O59k9o18j165O30Q10k21r5J14N35L83Q44J209k49
8127A663k17J185J918J606K37q85m93p70o68p12j206j373n61K80j49n87k48R35
8109d5J761M11q5q2o37j262L09K454K113P38l65p08M08Q54j48M00R96j27j0M57
8089G432p6q86p18n19j322r68L01Q13l48k11J26K79l42L49O13n22j346r85q20
$$ y = [-10585, -8001, -5777, -4458, -3829, -5286, -8898, -11550, -11453, -11781, -12702, -10303, -5730, -4649, -3830, -1640, -4027, -11430, -18034, -22394, -19605, 368, 16957, 19545, 19779, 18248, 15071, 11722, 9886, 10380, 11225, 9338, 4079, -1674, -3993, -3025, -102, 2731, 2295, -237, -1786, -2065, -1883, -2136, -2908, -4070, -4629, -5163, -5297, -5309, -3306, -1622, -1426, 586, 3425, 4886, 5651, 5935, 7030, 7895, 7284, 6609, 6589, 5012, 3243, 3330, 4104, 3471, 1177, -1204, -1601, -1144, -485, -514, -1132, -2297, -1667, -857, -1078, -1173, -1059, -524, -141, 703, 1912, 1663, 1446, 2631, 4549, 6155, 6392, 5507, 5014, 4244, 3576, 2864, 1658, 285, -276, 4, -145, -732, -980, -45, 1716, 2127, 2042, 1960, 1323, 61, 370, 2824, 4937, 5675, 5310, 4602, 5010, 5864, 5716, 6116, 7112, 6985, 6975, 7432, 7356, 6470, 5752, 5233, 3911, 2943, 3244, 4057, 3709, 3498, 3624, 3903, 3561, 3910, 4523, 4001, 2655, 1670, 850]
8070H50o11m53R16J674Q34j74j170j562j296m77N09Q59J690K140R11K70J4j713
8052C211j603J45J142Q80P47K61m01j831k014j472n73l15J54N90Q05J39q23j983
8034b941j788q84L77J54j22R91J617J238j18o17R1L25N73K4k95N97J215m2q52
8015d57p25r82p15O64J461J621J445k05j306q37n71q80k21J769J523L12j77o05
7997A114j643p24P9R7L3n97o70J278K202K114J482r51k892j371J026J713N56l52
7979B494m5j1j06o01q95j183j307q40l90M13O35J018L82n78n3O21n96j059j17
7960b218M22R41J346J787P60l12k58R63J338L35n57p47m75N18K32k15k28J23L97
7941D152O43J50j22R06K007J869J672R20j45q70k93R95J257K048K840K698K070
$$ y = [850, 239, -214, 702, 2376, 3210, 3036, 1866, 304, -992, -1469, -960, -101, 1589, 3729, 4640, 4910, 4924, 3211, 1608, 1753, 2895, 3775, 4522, 4783, 4382, 2551, 537, -935, -1508, -1823, -1669, -1079, -274, -135, -958, -2941, -4729, -5613, -5236, -5082, -5204, -4213, -2596, -1358, -1476, -2093, -2002, -1677, -1104, -1080, -1375, -778, 437, 395, -457, -1182, -2164, -2879, -2215, -754, 867, 2312, 2107, 801, -36, -607, -1487, -1708, 61, 1584, 1896, 1719, 1114, -529, -1253, -1174, -1077, -1044, -1641, -2311, -1033, 1169, 3283, 4765, 3814, 922, -449, 577, 2290, 2846, 2494, 2449, 2438, 2332, 1731, 836, -347, -1654, -2494, -2884, -2471, -1836, -818, -436, -1014, -1067, -446, -1042, -2101, -2218, -1796, -855, 491, 2278, 3038, 2726, 2468, 3431, 4769, 5104, 4547, 3800, 3325, 3843, 4075, 3860, 3632, 3755, 4152, 4795, 4945, 4823, 5729, 7736, 9605, 11277, 12197, 12052, 11182, 10889, 11884, 13141, 15189, 18029, 20727, 22797]
7924B2797L140N121N215L424K675N044N715N463M972N405O512N865K968L291N823
7909I3430Q986R457O609M126J893j164o097r267q854n431r19K230L592L962N323
7894A07876O975N734K354L256O124O060K88m804l953j848m145o990o802n219m407
7879A00499m314l876j517K188O759J0513J1408Q051N123K072l129q598r186o182
7865A09811m034n614p615n778l408m020n966n857n196n179n481o264o454o151
7851C2794m784l112k680k798j915j780k018j939j331J61Q64R97R94N29n63j505
7835A1914o51J233K179J925M19j065j819j720j3J101K5q29q95j534j922j044n18
7818F786J97M60k6l97q85j511j312J89J553P15p83j622o69R70J106J712J033l06
$$ y = [22797, 25937, 31058, 36273, 39697, 42372, 47416, 53131, 58594, 63566, 68971, 75483, 81348, 84316, 87607, 93430, 102416, 111873, 118482, 122608, 124501, 123337, 117240, 107973, 99119, 93688, 92769, 94999, 98591, 102553, 107876, 114851, 120585, 122939, 126195, 132319, 138379, 138667, 133863, 129910, 128062, 123917, 116927, 110125, 104906, 100499, 96185, 92309, 90792, 92980, 99739, 110252, 121660, 129711, 134834, 136906, 133777, 125179, 115993, 109811, 105777, 100163, 92548, 86770, 83362, 79342, 73376, 67519, 62323, 57144, 51663, 45399, 38945, 32794, 28010, 24898, 22218, 19420, 17505, 15725, 13707, 11768, 10437, 10598, 11462, 12459, 13453, 13982, 13419, 11914, 11263, 12496, 14675, 16600, 17019, 15954, 14135, 12415, 12402, 13503, 13528, 12699, 11804, 10270, 8348, 7304, 6786, 6983, 7443, 7417, 7020, 6135, 4624, 3312, 3501, 5054, 5769, 4986, 3364, 2695, 3665, 4771, 6483, 7516, 7210]
7800G210M84K14q91j549k093j444o40r17m86j97l93J02O50P14N37q42k118k457
7782d116J39J373J97n92j73O44J113J277N69j138q24N76J174J047J40j554j361
7765a509P1J190R01Q76P79O47qm68l61k51j032j815q20R27Q83L55o20k27l39k97
7745a118j19J43K043K124J077J175l3n92m53l43j172j174k50M35Q97O86n69o29
7727B128m54M26Q14n19l873k835N89M35J17k16J64J423K826K661P20q15j473j779
7709C39P1J258m0j399j293N89K40j493j391m21j56m34j64R89O14L13J295J492
7691D09K282K470J910J987K695L077L093K635L468N124P472R309R507J0064J0605
7676G6107Q139O328L617j499n108p338q135q524r527r810q501n928l721k292j070
$$ y = [7210, 7694, 7908, 7017, 5468, 3375, 1931, 1291, 374, -112, -309, -702, -600, 50, 764, 1301, 459, -1659, -4116, -3977, -2604, -2407, -2999, -3172, -2528, -1415, -138, 431, -707, -1531, -955, 219, 1266, 1406, -148, -1509, -1438, -248, 653, 1529, 2308, 2955, 2947, 2479, 2118, 1867, 835, -980, -1800, -873, 10, 365, -255, -482, -821, -1118, -1237, -1094, 949, 3073, 4150, 5325, 5292, 4700, 4247, 3904, 2732, 1558, 1308, 1743, 2640, 3326, 2757, 2128, 1674, 2100, 2914, 2395, -1478, -4313, -3724, -3289, -3172, -3388, -3224, -1801, 1025, 3686, 4406, 3591, 2118, 339, 410, 1668, 1628, 229, -1064, -475, -235, -1728, -3119, -3540, -3696, -4130, -4294, -3305, -2691, -2378, -1083, 409, 2691, 5161, 7071, 9058, 11753, 14830, 17923, 20558, 24026, 29150, 36622, 45931, 55438, 65502, 76107, 84246, 90574, 94191, 92692, 87584, 80246, 72111, 63587, 54060, 44250, 35749, 29821, 26100, 23808, 22738]
7661B2738r23j935k106j341p94q97j236q94L83J580J167k17j513j349K60J377
7645A4300K361J600Q56M47J28q15j118o77M41O83k1r53j417j785p05O75K030K905
7627A8935K997K043L117M362N664N710M577L170K787K759K074J193j0k096l607
7612E3675l771m366m743m045m811m944m550k523j279k230k887j304r34o66r22
7597I700j038j944k443p76L92m21j350j471o42p36r85l75M59K011J954N67j026
7580A876q73P9Q94K443L433K901J966J832J679J874K793L518L658J489r11o69
7564B7982Q58J991K670J004j543l292l669k779k908l795l879l359l385k783r20
7549B193k84J13Q48R41Q43K211K101J474P2R0J759L413L522L194K628K959K826
$$ y = [22738, 21815, 19880, 17774, 16433, 15639, 14742, 13506, 12612, 12995, 14575, 15742, 15525, 14012, 12663, 12923, 14300, 16661, 18261, 19117, 19564, 19692, 18877, 17759, 17082, 17523, 18206, 18185, 17232, 15815, 14030, 13325, 14000, 16030, 18935, 21932, 23975, 27092, 31454, 37118, 42828, 47405, 50575, 53362, 56121, 58195, 59388, 59378, 57282, 53675, 49904, 45538, 40795, 36750, 31939, 26995, 22445, 19922, 18643, 16413, 13526, 12222, 11288, 10622, 9700, 8662, 6718, 4275, 3499, 3891, 3470, 2120, 649, 7, -729, -1714, -2089, -1630, 381, 2335, 2902, 1876, 1003, 1082, 1976, 4419, 7852, 10753, 12719, 14551, 16230, 18104, 20897, 24415, 28073, 29562, 28651, 27982, 28840, 30831, 33501, 34505, 32962, 29670, 26001, 23222, 20314, 16519, 12640, 9281, 5896, 3113, 2193, 1909, 2022, 2870, 3811, 4654, 6865, 8966, 10440, 10512, 10602, 12361, 15774, 19296, 22490, 25118, 28077, 30903]
7532C0903K393K051J205j68n31j092o44k58k294m433l543k724j846j866k973l062
7516A1118k577j844p6J507J484N08j73n04N55J822K044K153L052L846M289M213
7500C1417L943J958N16K91n48j493j516j669k408l024l330l093k435k355k489
7485A3765k233j843q62j21k43q94k023j968j705p69N21J047R61J341J682J103
7469G759J189J257J045K231J397K11j151j006J317K966L369L905M672N384N849
7454D0394O358O886P304O574L500J673K785M120J280l699n537m563l848m927n735
7439E2565o014o331n612n353n524m913l714k733j814j367j005l74P53P33J96K81
7423I774L4m59j49l14N8N47P82M29j19k55m1m14j20j00m03m02k79L63j03j449
$$ y = [30903, 33296, 35347, 36552, 36384, 35853, 34761, 34117, 33859, 31565, 27132, 23589, 20865, 19019, 17153, 14180, 11118, 8541, 6697, 6621, 8128, 9612, 10120, 9947, 9443, 9998, 11820, 13864, 16017, 19069, 22915, 27204, 31417, 35360, 37318, 37834, 38125, 37577, 36084, 34568, 32899, 30491, 27467, 24137, 21044, 18609, 16254, 13765, 11532, 9689, 8827, 8706, 8463, 7569, 5546, 3578, 1873, 1104, 1625, 2672, 3633, 4974, 6656, 7759, 8948, 10205, 11250, 13481, 14878, 15089, 13938, 12932, 14249, 17215, 20584, 24489, 29161, 34545, 40394, 46752, 53638, 60942, 67516, 71016, 72689, 75474, 79594, 80874, 77175, 71638, 67075, 63227, 58300, 52565, 46551, 40220, 34608, 29255, 23731, 18818, 15104, 12371, 10557, 9190, 8185, 7811, 8564, 9297, 9493, 9774, 9808, 9349, 9200, 8886, 8944, 9491, 10273, 10702, 10583, 10328, 10287, 9873, 9753, 9653, 9250, 8848, 8569, 8932, 8829, 7380]
7403G380j972j999j572p47k58K33M56k96n59q1N05M43m53l63P48q49k180j831
7385c395oK068K125Q60r48k283j202l09m28j4J483K427J807J72o21r58j398j266
7367a886n14M87M11j02q38j157r8J021P27k07l27j403q14M37R88J016J50oJ153
7348i62J339J013P59J086J015O89J007Q29L02M18L19O15J265J385J14o77p45j697
7330H074k329k401j766k57N38J169Q09n09n73j84j5L57J46j025k146j573m69J088
7312a066P67p29j524j599n80j09J21Q64K50l48l3Pl43n91q20j724j546J86R7M32
7292h288J665O91o70j76Q20J069O57J056J382j03m13l0j17M19R22M90o71m79J51
7273a625M81n63m07K55n86L25J012O05p2%O39J113J889J989J285J955M011O589
$$ y = [7380, 5408, 3409, 1837, 1090, 832, 1065, 1521, 1225, 666, 585, 1090, 1533, 1080, 717, 1465, 616, -1564, -3395, -3401, -1333, 792, 1652, 704, -1579, -2781, -3090, -3518, -3532, -2049, 378, 2185, 2357, 1736, 778, -620, -1886, -2400, -1913, -1502, -1604, -2442, -3599, -3697, -2676, -1949, -2156, -2483, -3886, -4700, -4263, -3275, -2259, -2109, -2115, -962, 377, 1390, 2149, 3235, 4250, 4939, 5946, 6775, 7077, 7495, 7814, 8429, 9694, 11079, 11193, 10516, 9771, 8074, 5745, 3344, 1578, 1321, 1859, 3028, 3837, 3328, 2755, 2571, 2556, 2913, 3059, 2034, -112, -1685, -2154, -1066, -299, -1028, -2552, -4151, -4731, -4840, -4719, -3855, -3605, -3953, -3986, -3979, -4322, -4913, -5733, -7457, -9003, -8817, -8720, -8288, -6623, -5932, -6602, -6778, -5958, -4889, -4232, -3176, -1794, -1897, -2310, -2340, -2457, -2038, -1116, -626, -1297, -1776, -1625, -1144, -1707, -2114, -1859, -2445, -2120, -1108, -503, -575, -575, 64, 1177, 3066, 5055, 6340, 8295, 12306, 18895]
7255A8895O264N465L519L27k130k841k781k127p50M63L07O74J047J303K047J345
7239C1027j2K058M160N561N171K606O59N27K47j312k190k377m166m443l004j778
7223C2734j154M60J944L199K955K332J816K179L090L989M055L778K203j473n527
7208E6580p042o551m782l150k418k090l330n229m626l711l013k008j441q20k25
7193F144l72j377k321j089L88M08L00J66M11N1p42r16j257q88M89J245O43J76
7175A459J347K179J439J606K583J819k86j878k475j650j206j851j790p37p22l13
7159d76m77j207j168r24l06O27Q83k44r14r13L42j71j003M68K281J381q96j537
7141d254o68o99j229j255p03J66J369J459R59Q29J113K41j129j881l71L41J094
$$ y = [18895, 25159, 30624, 34143, 34470, 32340, 29499, 26718, 24591, 23841, 24304, 24611, 25285, 26332, 27635, 29682, 31027, 31015, 33073, 37233, 42794, 47965, 50571, 51230, 51757, 52004, 50692, 48502, 46125, 41959, 37516, 34512, 32734, 31580, 32040, 33984, 37183, 40138, 42470, 44286, 46465, 49555, 53544, 57599, 61377, 63580, 62107, 56580, 49538, 42987, 38205, 35055, 32637, 30547, 27217, 21988, 17362, 13651, 10638, 8630, 7189, 6369, 6144, 5772, 4395, 2074, 985, 1373, 1781, 2081, 2247, 2658, 2709, 1967, 1051, -206, -1094, -605, 640, 1283, 1459, 2806, 4985, 6424, 8030, 10613, 12432, 12146, 10268, 7793, 6143, 4937, 3086, 1296, 559, -163, -476, -953, -2160, -3328, -4252, -4558, -3931, -3048, -3292, -4206, -5119, -4777, -4948, -5951, -5483, -3202, -1821, -2717, -4254, -4922, -5621, -6850, -8105, -8808, -8642, -7273, -5814, -4855, -4026, -2913, -2672, -3801, -5682, -6053, -5712, -4618]
7124d618J312K99m87m10k56k69p29J26P81l4j207j477k58R09O03M96l57j078p80
7105g434K61O03k62o69j052q1J891K443J668o42k025j165k95n45l13J30J130J618
7087d739J566J752Q24j195j244j348j686m14J061J678J218L69M63N46Q77q3m63
7070h18q77q68L98J878J163j81l27o27K5J281P76n57m79Q47J358J447R42j41j712
7051C528k094j289J83O09p61j817j636q84j22K01k9M6N27M32J116Q84L76L69J804
7032A443J979k5p82p09l14J25Q23M95j9j219j190p92o68J78O62r05k171j519j37
7013d745J86l34n46n93n15K12J77J036O81m72k96Q22N63m52o15M74J054P82O4
6994b517J26n29j022k34N59O03M02J37M50P53Q5j813j169K84m75j054j039k43
$$ y = [-4618, -3306, -3007, -3494, -3904, -4160, -4429, -5158, -5032, -4251, -4285, -5492, -6969, -7227, -6318, -5715, -5219, -5576, -6654, -7434, -7173, -6570, -6832, -7501, -8553, -8634, -6743, -4300, -2632, -3274, -5299, -6464, -6759, -7304, -7617, -7487, -6357, -4739, -3173, -1421, -597, -1792, -3036, -4384, -6070, -6484, -5423, -3745, -2527, -2158, -1695, -1149, -272, -355, -818, -1695, -2563, -2165, -287, 876, 695, 368, -259, -234, 1047, 1823, 1266, 787, 1634, 2992, 4439, 5381, 5240, 3528, 1434, 145, 328, 937, 176, -1641, -3277, -4161, -4283, -4082, -4111, -4065, -3538, -3106, -1990, -1106, -730, -361, 1443, 3422, 3397, 2615, 1906, 1592, 1717, 2540, 3035, 3016, 1797, 607, -185, -853, -675, -13, -918, -3089, -4608, -4745, -4559, -4893, -5439, -6032, -6547, -6335, -6158, -5122, -4441, -4913, -5209, -4387, -3824, -4276, -4891, -4417, -3363, -2581, -2517, -2391, -2920, -3942, -4176, -3617, -3014, -2612, -2475, -2025, -1272, -1187, -3000, -4169, -3885, -4360, -5414, -6453, -6696]
6976f696J426Q39p10q83o61l85Q94J014Q15n74j382q96J547L724K915P67m42j041
6958B71j183j036j17k34j248j215m56l4O56N88M93R09J419K71j415j512k267j330
6940g440J486K631J078n50j18K86J90m83j141j357m06N78J253P38K27l7m25Q4
6922c406L09k56j510j848O81K511J819J30n34l77j31M1M21N52l9r43l77O38R74
6903a345R49N49o92j713q39m67m03p04l90m7k4J65m13l58N56N27O48J95m43o35
6883d884K32k52j143k31J203K361K258O79Ll19k91j36J47q01p97j109j22J523
6865a679J634L91m07j30J055K794K869J067j425k279j192P25J035l75k032j674
6849C77P7Q78J357J59k769m148j817K8N17j082k208j329J362K719L085L539K290
$$ y = [-6696, -5270, -4431, -5141, -6024, -6685, -7070, -6176, -5162, -4347, -4921, -6303, -7199, -5652, -1928, 987, 1754, 1312, 271, -912, -1948, -2065, -2299, -3547, -4762, -5218, -5252, -4596, -4008, -3515, -2606, -1187, -916, -2331, -3843, -6110, -7440, -5954, -3323, -2245, -2795, -2913, -2627, -2437, -2920, -4061, -5418, -5824, -5246, -3993, -3255, -3028, -3065, -3490, -3406, -3097, -3353, -4863, -6711, -6030, -3519, -1700, -1570, -2104, -2481, -2612, -2571, -2150, -1598, -1637, -2580, -2957, -2319, -1345, -396, 153, -539, -2252, -3091, -3558, -3961, -4665, -5055, -5102, -5126, -4961, -5374, -5732, -5176, -4649, -4001, -3806, -4249, -4884, -4652, -4904, -6047, -6278, -5075, -2714, -456, 223, 226, -93, -384, -520, -373, -1174, -1971, -3080, -3202, -1679, -45, 346, -61, -191, 864, 3658, 6527, 7594, 6169, 3890, 2698, 3423, 4458, 4083, 2051, 377, 454, 1332, 2689, 2848, 79, -4069, -5886, -5858, -5341, -6423, -8631, -9960, -8598, -5879, -2794, 745, 3035]
6832C035K06j024n44N81J187J961K11j524m67K72j240j853j846j434j590j227
6816e296N6j25m72L32J126Q38O31J275P49k18j50m21n16O60P01m64j009j280j319
6797d902L42J958K027J111J181J406J14j90N0L93L76o79r57N5Q50J313J022Q27
6779F297R54J237J580Q48K60J045J388J355J566P35O05J275J461J299R41J162
6763B4008J139N08m29j093j10J031J981J521K2n04j73l45n54j109o49J015J227
6746B7486R02L49k25p24p32n79P1O5k09j384j067M52K34j519k829k083j118j93
6728A6897L40J57r48j609r11k32L60l91q48j090r18r03j219j624q38M13R38k16
6710G358q88p51n3O98Q46M67k29p05j440j070J73q72j535j096l3J003O99k14j200
$$ y = [3035, 3241, 2217, 1673, 2254, 3441, 5402, 5613, 4089, 3622, 3894, 2654, 801, -1045, -2479, -4069, -5296, -5240, -5365, -5837, -5505, -4379, -3541, -2910, -1635, -886, -1104, -1254, -1675, -2191, -1531, -830, -1294, -2303, -3583, -4902, -4560, -2602, -575, 536, 1717, 3123, 3237, 3047, 3097, 3490, 3866, 3187, 2230, 2285, 3135, 4448, 5470, 6297, 7251, 8488, 10068, 10916, 11176, 12221, 13609, 14964, 16530, 17265, 17870, 19145, 20606, 21905, 22846, 24008, 25147, 25655, 25226, 24133, 24023, 25054, 27035, 28556, 28578, 28074, 27901, 27556, 27002, 25893, 25244, 26259, 27486, 28388, 28737, 28512, 27788, 27056, 26477, 26548, 26613, 26404, 25020, 23953, 24405, 24639, 23120, 20291, 18208, 17090, 16897, 17237, 17394, 16446, 14837, 13926, 13694, 14054, 13663, 12815, 11725, 10807, 9904, 8685, 7061, 6223, 6636, 7574, 7358, 6470, 5719, 5666, 6364, 7210, 7677, 7448, 6743, 5303, 4233, 4406, 3534, 1999, 903, 870, 1873, 2572, 2358, 1158]
6691A158r64Q50J548J126n93j224k77L9K22L66m95n12m29M87L29M08O97J144J498
6672E378J604P60q90k072j182o50p78j552j392n4J433J526R51J262M62P18J605
6655G129J401J090J49lj11n43q19k66r21k414l385l356j961l097l950l92L328
6638h121L675M933N233L136J786Q92j642l213j353R23M29r35k488l864m469l672
6622h750j229Q77j53j239Q01L647N576O794M289K22P69K500L39j429j869k416
6606H729j464P6M26O55L16j214l340l362j134L12N20J067J696J509p06k249j263
6589E74p09j483j941j870j111o00m73l4K141J595M37J671L384K873J119j90p38
6572D645o03R69K362L089J775o29j996j970j721j801j556j265j26Q14M25L21L01
$$ y = [1158, 194, 1044, 2592, 3718, 3125, 1901, 1624, 1663, 1885, 2251, 1756, 1244, 815, 1302, 1631, 2039, 2736, 3880, 5378, 6982, 7742, 6852, 4780, 3598, 2948, 2170, 618, -774, -828, 605, 2131, 3082, 4344, 4806, 5524, 7129, 8530, 9620, 9769, 9766, 9655, 9112, 8293, 8027, 7106, 4692, 1307, -2049, -4010, -7107, -11057, -11449, -8121, -4446, 487, 5720, 8856, 10642, 11534, 9892, 6679, 5326, 6249, 6678, 5743, 3255, -609, -5078, -8750, -9979, -9102, -9255, -10494, -9693, -6046, -470, 6324, 10613, 10835, 11604, 14104, 14443, 13014, 11145, 8729, 7265, 7341, 7767, 8422, 8738, 7524, 4184, 822, -312, 0, 520, 1587, 3283, 4792, 4086, 1837, 574, -135, -1618, -3559, -5429, -6540, -7140, -7613, -7647, -5506, -3911, -3474, -1803, 1581, 4454, 5573, 5383, 4645, 4042, 5011, 7373, 10462, 12237, 11608, 9612, 7642, 5921, 4120, 2564, 1299, 1173, 1987, 2412, 2733, 3034]
6555C034N33J322L77j489j318j280j649o14K20N78J004P93L41m07q43j111q66
6538a375Q6R43O33k60j183k30O66M00j88p43q11m52M90J190P49J19m71o85L34
6519g88J044Q87k15n76J231J558O15j28K37p41k609j972m94k86J87N45M51N88
6501d66Q38J00l18p17k67O9j70J19R19Q53j58o70o01o87j570r83R15R90L59P62
6481f83K36J157K186K240J593J705K684L587L331L341L686L129K019K328K979
6466C5518L983L090j149o447q252o482m177k740k356k476j088o09o28K65K15m68
6450F199M67L030M199L383M851Q261J0400N533j968m869m101j445J400L699M551
6435D3590K543k555n089n463n432n327n600m306k494K12J248l60j451m2J064J072
$$ y = [3034, 3567, 4889, 5266, 3777, 2459, 1179, -470, -1084, -864, -286, 718, 1511, 1852, 1445, 602, -509, -1375, -1289, -346, 287, 27, -1156, -1386, -720, -320, -508, -1251, -2062, -2514, -2024, -834, -85, 34, -437, -1122, -788, 256, 1143, 928, 352, 1583, 3141, 3756, 3628, 3865, 3124, 515, -1457, -1951, -2237, -2050, -1505, -1054, -466, 372, 472, 154, -563, -830, -761, -931, -812, 107, 960, 802, 132, -469, -1156, -2726, -3709, -2794, -1804, -1445, -683, -447, 710, 2896, 5136, 6729, 8434, 11118, 14705, 18036, 21377, 25063, 28192, 30211, 32539, 35518, 39501, 42591, 41442, 34995, 26743, 20261, 16084, 13344, 10988, 8512, 7424, 6815, 6187, 6452, 6667, 6199, 6666, 9696, 13895, 17278, 22129, 30390, 40790, 46323, 44355, 39486, 35385, 33940, 35340, 39039, 43590, 46133, 43578, 38489, 33026, 27594, 22267, 16667, 12361, 9867, 10079, 11327, 10967, 9516, 9474, 10538, 11610]
6419A1610n37j414q80J252M400N562J063l448k402j033r15m18k83N98J072K396
6403A6623L008L120K622K173J391j199o043p830m954j851n4N14M48j79j094r67
6387E728r05N52J262M67J418K998K719N92j273j81J040j278l171j880p57j165
6371F166r22l44o24q89j189o38l80n49p35j551j486n71m63p01j769k461l20J862
6353g564J700K43l53o73M96O52R16P35K68P97J775J316P60O15N34k15l73L50L2
6334B011J25J881K228j74j932j367l38L5M10J23j167j579j553m93M54O36l47j105
6316b152l39O37m75p67j60M5m78r04M7O49P76J137R06Q34J1o91n20L62K47O42
6296a93P04J007L36j271k286j968j195K57Q82Q0o84j495j268m01O03J317Q29J383
$$ y = [11610, 11073, 9659, 8779, 10031, 14431, 19993, 21056, 17608, 15206, 14173, 13258, 12840, 12557, 13155, 14227, 16623, 19631, 22751, 25373, 27546, 28937, 27738, 21695, 13865, 8911, 7060, 7006, 7520, 7968, 7789, 6695, 5728, 4823, 5375, 6637, 7104, 8522, 11520, 14239, 14831, 13558, 13377, 14417, 13139, 9968, 8088, 7331, 6166, 5244, 4900, 4276, 3387, 2198, 1560, 1180, 631, -104, -1655, -3141, -3712, -4175, -4876, -6645, -9106, -9426, -7564, -5864, -5621, -5974, -6647, -6151, -5499, -4583, -3848, -3580, -2783, -1008, 308, 1068, 1683, 2217, 2002, 1629, 1979, 2011, 2136, 4017, 6245, 6071, 4139, 2772, 2434, 2469, 2879, 3002, 1835, 256, -1297, -1790, -1336, -700, -1047, -2152, -2491, -1854, -2329, -3096, -3256, -3211, -3689, -4593, -4546, -3897, -3121, -1984, -1078, -244, -233, -924, -1444, -1082, -835, -193, 511, 1518, 1854, 583, -1703, -3671, -4866, -4609, -3727, -3647, -4331, -5826, -7094, -7495, -6892, -5575, -4746, -3363]
6278c363O64L02J85p29j141m29R05J275P55k57j262j310j418j193j090p24L43
6261h487L54N02P01K16m84o34P15Q62M60N85L39l19L48R19P82O55L94M06J36M1
6241a509p88j913r10K85O22R85P16J83J37K7j049p09R35J438m71j693j279k73
6223e266J126K140K510K297O83p76j840j210K88J182J934K167K451L087P12k678
6207H807l489k939j057J185J701l07k553k617j191P60J457O10j528j263j55O7
6191b512n11q90r67oK78J13k27o43j085j93P61P74J257J722o08k219n75J155J380
6172b996J476N11q64r02Q4N68n96j677r44J95L78K04O47P78J072L77j102j607
6154d398j432j454j219p35J68R21O14o91j743m3J114M30O79R78J130O64j71m10
$$ y = [-3363, -2699, -2397, -2212, -2941, -4082, -4511, -3606, -2331, -1576, -1833, -3095, -4405, -5823, -7016, -8106, -8830, -8487, -8133, -7631, -6930, -6714, -7198, -7832, -7117, -6255, -5795, -5210, -4871, -5190, -4842, -3923, -3141, -2486, -2092, -1686, -1550, -1509, -2297, -4210, -5120, -4835, -4213, -3228, -2512, -2329, -2192, -2165, -3214, -3923, -2988, -1550, -2021, -3714, -4993, -5266, -4140, -2000, 510, 2807, 3490, 2714, 874, -336, -48, 1134, 3068, 5235, 7686, 10773, 11485, 8807, 5318, 2379, 1322, 2507, 4208, 3901, 1348, -1269, -2460, -1700, -243, 367, -1161, -2424, -2579, -2512, -3023, -3913, -4880, -4886, -4608, -4495, -4722, -5365, -6450, -6643, -5882, -5108, -3851, -2129, -2737, -4956, -5531, -4376, -2996, -1520, -1009, -1873, -2775, -2691, -2123, -2719, -4396, -5340, -5145, -4767, -4563, -3916, -3138, -2066, -1689, -2791, -4398, -5830, -7284, -8503, -9238, -9070, -8149, -7535, -8226, -9969, -10012, -8898, -8468, -7789, -6811, -5681, -5017, -5188, -5598]
6136e598o2m01n01r04l98O41J303J038L3p91j4K249R49o45L43R68N24m60p32j148
6116c606p43P65J539Q36L74n93p87k11m88j012n51O85R13M29l98j403j265p48
6098f264O68J66p87j44K6J350J450P59N7n44l09M4R50O57M41M5r59q15p86n91
6078d586r00j304N9J369J416Q98O16J7P61N12m94o20o73K26Q45R20m90o07k72
6059b307K70P73J301r4j374k041j087Q26J369J207O72J41J3j83L43n24j619j349
6041c663j84Q44J521J391P18j094j885j481j54P23K92n63j045p86j0O25j37p42
6023e630k75m14k34l46j85J25j28K38J306J903K201J048L15o76j436j782o51k5
6005d646P03J133L65N99J285K32j341j232J578L280K329Q14K41r36j500o20K79
$$ y = [-5598, -5660, -6061, -6562, -7466, -7864, -7223, -5920, -4882, -4849, -5640, -5654, -3405, -2456, -3101, -2758, -1790, -1266, -1726, -2458, -3606, -4349, -3584, -2045, -1209, -835, -1428, -2215, -2426, -2914, -3926, -4477, -3792, -2879, -2450, -2848, -4251, -5516, -6264, -5596, -5430, -6217, -6361, -6335, -4985, -3535, -2776, -2719, -3263, -3572, -3528, -2578, -1921, -1480, -1435, -2394, -3209, -3995, -4586, -5486, -6790, -6731, -5362, -3946, -3048, -2432, -2415, -1654, -1142, -1636, -2256, -2929, -2703, -1858, -938, -1428, -2035, -2307, -2037, -1264, 37, -57, -1431, -3472, -4559, -3733, -2364, -1157, -485, -344, -331, -514, -171, -695, -2314, -3663, -3847, -3003, -1482, -91, 627, -467, -2352, -3833, -3987, -3264, -2972, -3535, -4580, -5366, -5376, -4751, -4888, -5630, -5905, -6319, -6553, -6899, -7084, -6959, -7087, -6849, -5543, -3640, -1439, -391, -76, -752, -2188, -3970, -4621, -4646, -3943, -2810, -2445, -1846, -561, -329, -1670, -2902, -1324, 1956, 4285, 5099, 5340, 4404, 2904, 2284, 2563]
5988B563K54M48O68Q07O97m00j036q91o37l74r79o86q22j702j975j372L81Q47
5970d209J369K569K565J647J115J257K181L804M757M660K361k041m141m545m330
5955I019l004j629j226p57o08m73K59j93l76J282J559J552K085K584L723N148
5939A8945M196J14l875m446m217k611k053k139r14N4J29J92q82j728j625p54k01
5922a815k04O06J559J580J755J124L85p36k063k112r29n53r66j342J78J676J674
5905a83R63K29J019K913K741J632j70j46J025J293J813M339O675Q079J0382J1659
5889E4263Q678K674m043p991q771q650p211m492k354j787j438o66j106j972k111
5874A3023j619K48J981J374P98m71j367j527j682j265o18m04K21J016R10m91j764
$$ y = [2563, 2817, 3265, 3933, 4740, 5437, 5037, 4001, 3110, 2473, 2099, 1120, 434, -388, -2090, -4065, -5437, -5056, -4209, -2840, -271, 2294, 3941, 5056, 6313, 8494, 12298, 17055, 21715, 24076, 22035, 17894, 13349, 9019, 6015, 4386, 3160, 2403, 1795, 1322, 1581, 1388, 1012, 2294, 3853, 5405, 7490, 10074, 13797, 18945, 23141, 23255, 19380, 14934, 10717, 8106, 6053, 3914, 3000, 3054, 3183, 3375, 2493, 765, -860, -1614, -1815, -2019, -1413, 146, 1726, 3481, 4605, 4990, 4254, 2191, 79, -850, -1403, -2369, -3711, -3533, -1857, -183, 780, 1009, 2028, 4941, 7682, 9314, 9144, 8998, 10023, 11316, 13129, 17468, 24143, 32222, 42604, 54263, 62941, 65615, 61572, 53581, 44810, 36160, 28949, 24457, 22103, 20316, 18878, 18212, 17106, 15134, 13023, 11404, 11652, 13633, 15007, 15805, 15334, 13967, 12440, 10758, 9493, 8875, 8471, 8692, 9708, 10618, 10127, 8363]
5857H363j911q46O9Q68jn76J58K053K734J562l34j881j441P46J664O20p35j872
5839I240k065j237o20o57j43j49n30m89l3L39o6r81p12l67j92J51M4m22J29M39
5819A679n20n25J460J777J190R01k02j482j681q79M16J420J812J127N62M6n01
5802F600M0M34P7p99j16K76r25k68J387J851O78N29m96j616j344m24O2M79J29
5783F554j83k8K81m95k67l87k55M26L26l38l43l73Q61J430N36m66p64k67l14K7
5763E961J136K378K542O36o54j143o30k58R86K173R69M07k9k067j668q97q6O16
5745A0372O32Q54O80m08o35K04K50K89J315J196K44j253k067r54K99j66l81j98
5727A0273k86j061p57L01O91n03r5Kj74P86R16l7p11j192p67K53Q5n97j83M93
$$ y = [8363, 6452, 5606, 5675, 6543, 6542, 5966, 6124, 8177, 10911, 12473, 12139, 10258, 8817, 9563, 11227, 11847, 11112, 9240, 7175, 5938, 5318, 4661, 4518, 4369, 3839, 3350, 3317, 3656, 3590, 2609, 1897, 1530, 1338, 1489, 1533, 1111, 1240, 1679, 1159, 634, 2094, 3871, 5061, 5962, 5760, 4278, 2597, 1718, 2134, 3554, 5366, 6493, 7055, 7101, 6600, 6640, 7074, 7151, 6352, 6236, 6512, 5587, 5319, 6706, 8557, 9235, 9764, 9268, 7652, 6308, 5884, 5946, 6425, 6554, 6371, 6343, 6624, 6129, 5862, 5475, 5220, 5646, 5972, 5634, 5291, 4918, 5779, 7209, 7745, 7279, 6515, 6248, 5934, 5961, 7097, 9475, 12017, 12653, 11999, 10856, 10226, 9968, 10954, 13127, 14096, 14503, 14474, 12407, 10739, 9842, 9756, 10372, 11004, 11858, 12538, 12130, 11495, 11699, 11949, 12238, 13553, 14749, 14993, 13740, 11673, 10719, 11018, 10852, 10471, 10273, 9987, 8926, 8169, 8470, 9161, 8658, 8563, 8565, 8391, 9177, 10093, 10056, 9345, 8153, 7386, 7639, 7724, 7127, 6944, 7437]
5707G437l02n88n56j54M72P9o79m58o66m71J04L46L91J079J176N98n6p00j284
5688E768j204j126p77m15Q90J495K17P54J304J46r63m79N69l3l00o06j233j824
5670B183o86J233J736J212O13J123J347J061J145J012K038K874K215J430J015
5655B1551K366N174R098J3859J5169O994n582j0607j0860q486m693j739p66q76
5641C0602k942m474n003n275l728r55P52Q41J38n57L84J768P84l62j302j521j488
5624G662k0J076N08o40j408k491j755j08O00L94o50n32N37O17J944K163J899J277
5606A1073R65J362K028K117J745J355J875J500J394P02O32K67J310J907J846L398
5590C5476L242K011K019L582N236N777O826Q859J0975J3860J7019K1017K8308
$$ y = [7437, 7135, 6547, 5991, 5837, 6309, 6388, 5709, 5251, 4585, 4114, 4218, 4564, 4955, 6034, 7210, 7808, 7752, 7052, 5768, 4564, 3438, 2661, 2246, 3136, 4631, 4848, 5602, 6906, 7052, 6089, 5610, 6179, 6146, 5846, 5240, 4007, 2183, 1497, 2730, 4466, 5678, 6291, 7414, 8761, 9822, 10967, 11979, 14017, 16891, 19106, 20536, 21551, 23917, 29091, 38189, 52048, 67217, 74211, 68629, 58022, 47162, 38676, 33983, 32244, 31478, 30602, 27660, 23186, 18183, 12908, 9180, 8225, 8977, 9818, 9956, 9399, 9783, 11551, 12335, 11973, 10671, 9150, 7662, 7642, 8718, 9226, 8586, 7178, 4687, 2932, 2824, 3424, 3818, 3168, 2636, 3173, 3790, 5734, 7897, 9796, 11073, 12038, 13400, 15428, 17545, 19290, 20645, 22520, 24020, 25414, 26116, 26748, 27015, 28325, 30232, 32078, 35476, 38718, 40729, 42748, 46330, 51566, 57343, 64169, 73028, 84003, 97863, 114882, 135899, 164207]
5577A64207L8012M6965N3269N5887O0248P5384J10954J75714K68267L58079L58115
5566A765101J81730q7619k69997l22918k96120k29189j58524j07239p7562o0368
5556C37295m8291m0288l3554k7567k3478k0291j7059j3935j1650j0256r385q874
5544G2667q097p115n912m518m297n385n336l919l352j558j175k203l652m100l964
5529H084l235j507K49N92K93j301j937j891j921p69M34M0m44K08Q16j17m07p45
5511c558j065j177n19Q64J256M2j7P4k5L51L05o63p57n37n65l66Q5K22k37m92
5491f779n05n83k00R9J180R75J69p32n09L8J223J436J264J672J582O77p00j704
5473a397q69l94r17k090j591m51L29R6M85L19j38n11k87o75o12l54p12j454j154
$$ y = [164207, 202219, 249184, 302453, 358340, 418588, 493972, 604926, 780640, 1048907, 1406986, 1765101, 1946831, 1859212, 1589215, 1266297, 970177, 740988, 582464, 475225, 397663, 337295, 289004, 248716, 215162, 187595, 164117, 143826, 126767, 112832, 101182, 90926, 81541, 72667, 64570, 57455, 51543, 47025, 42728, 37343, 32007, 28088, 24736, 23178, 22003, 19800, 16148, 12048, 8084, 4849, 3342, 3591, 4183, 4476, 3175, 1238, -653, -2574, -3343, -2909, -2869, -3313, -3105, -2289, -2406, -2813, -3558, -4623, -5800, -6319, -5455, -4199, -4157, -4174, -4100, -4125, -3774, -3469, -4132, -4889, -5426, -5991, -6357, -6272, -6050, -6287, -6779, -7284, -7867, -8067, -7968, -6788, -5813, -5644, -6376, -6885, -6847, -5624, -4188, -2924, -1252, 330, 1007, 307, -1397, -2266, -2660, -3577, -5667, -7258, -7709, -7380, -7284, -6799, -6480, -6618, -7129, -7416, -8091, -8703, -9057, -9769, -11223, -12377]
5454a2377p74m64j847j523j55O3P38Q74J55m84l69R98Q21j078m039m340j594N71
5436b4824j14r90j186o77n36o44k27J39j603j918n23n84j106j134l98j27q2j260
5418c7794k148k231l52K649M267K814J876K649L291J672L32l1N19R5r32k396k387
5401b8107l020n003l789o58K21m31j670j659j99J951L719L648K848K148Q56K05
5385b8940n18j236k247m30J787P68l090m906m620m260l766l412l120n06J432J104
5369e5960q89j354j382o65r8J204Q26K53M43N17Q61K568J504k33q53J087K991
5352d9180M004K376O09M36o2j097M74J135m23j254n56k252m044m174j666J252
5336e4422L113J487j521j992jN00N17R74J635R29J361L202K767j74j498k113k321
$$ y = [-12377, -13151, -13615, -15462, -16985, -17140, -17077, -16339, -15465, -15310, -15794, -16163, -15165, -14344, -15422, -19461, -23801, -25395, -24824, -24938, -25928, -27114, -27791, -28327, -28971, -29198, -29059, -30662, -32580, -33103, -33687, -34793, -35927, -36325, -36452, -36534, -37794, -39942, -42173, -42525, -39876, -35609, -32795, -30919, -28270, -24979, -23307, -22975, -23006, -22487, -22392, -23324, -25720, -28107, -31127, -36130, -39919, -40577, -40356, -40787, -42457, -44116, -44315, -42364, -38645, -34997, -32149, -30001, -29145, -28940, -29458, -30694, -32941, -33371, -31584, -30816, -33906, -38812, -43432, -47692, -51458, -54870, -57990, -58496, -57064, -55960, -56849, -58203, -59585, -60250, -60348, -59144, -58318, -58065, -57622, -57105, -56244, -53676, -52172, -52405, -53258, -52171, -49180, -45176, -42800, -42191, -41755, -41817, -42914, -42440, -41305, -41728, -42982, -43538, -45790, -49834, -54008, -55674, -54422, -51309, -49822, -51343, -53335, -53336, -52836, -52319, -51345, -49710, -48781, -47420, -44218, -41451, -41625, -43123, -45236, -47557]
5319d7557j257N56J638J819Q79k26j208j00O89K89O77J330M35M30O99Q24R57L77
5301c8749r2j17K3j51K31O03N05J241J504J013J548J914J958L015L898L015J140
5284a7501L78R37K353M485N452N353M201M079N093O152N623N818O195O130P810
5269E2558J1601J4095J6909K0478K5177L1440L8978M3905M6468M8395N6667P7054
5257D83725J17736J82375K55932K81897J87355m703j61933k23047k16345j71750
5247G31242j16334p4839m8553l3417k3155j6531j0684n913j325K218N701P654
5235D16064R761J2249J5552J6118J6475J5314J7781K3145K8635L1480L5196L8418
5223F76188M2993M6663N0473N4937O0461O2420O5375O8254P5327Q4031R2618R9123
$$ y = [-47557, -48814, -48258, -46620, -44801, -43922, -44148, -45356, -45456, -44767, -44478, -43801, -42471, -42036, -41606, -40907, -40083, -39126, -38749, -38841, -38958, -38935, -39086, -38855, -38252, -37747, -36506, -35002, -33989, -32441, -30527, -28569, -25554, -21656, -18641, -17501, -17123, -16186, -13833, -9348, -3896, 1457, 5658, 9737, 14830, 20982, 26605, 32423, 38618, 44748, 52558, 64159, 78254, 95163, 115641, 140818, 172258, 211236, 255141, 301609, 350004, 406671, 483725, 601461, 783836, 1039768, 1321665, 1509020, 1504317, 1342384, 1119337, 902992, 731242, 614908, 540069, 491516, 458099, 434944, 418413, 407729, 401816, 400491, 402709, 408410, 416064, 425825, 438074, 453626, 469744, 486219, 501533, 519314, 542459, 571094, 602574, 637770, 676188, 719181, 765844, 816317, 871254, 931715, 994135, 1059510, 1127764, 1203091, 1287122, 1379740, 1478863]
5211A478863J08432J18222J29147J40085J56273J74257J96843K21673K52585K85631
5201C262011L21723L62240M17143M80930N61921O67081Q07435R84607J217911
5192I083002J522505J911809K404864L074712M018783N319052O773218P755658
5184D1863603P943348Q183775R911291J4442469K2892177L5480710M8177400M8484823
5176B37379596K4524127j2018705l6485120m3378073l9701473l0654829k1085373
5169G8580150j4211326j0158348p871407o426108n293030m336022l556760k943135
5161B3784014k471221k106786j816507j586391j400101j246386j117967j003249
5153A1035406q96614q04453p28852o60416n89921n25107m67477m16793l74116
$$ y = [1478863, 1587295, 1705517, 1834664, 1974749, 2131022, 2305279, 2502122, 2723795, 2976380, 3262011, 3583734, 3945974, 4363117, 4844047, 5405968, 6073049, 6880484, 7865091, 9083002, 10605507, 12517316, 14922180, 17996892, 22015675, 27334727, 34107945, 41863603, 49806951, 57990726, 67902017, 82344486, 105236663, 140717373, 188894773, 237379596, 261903723, 249885018, 213399898, 170021825, 130320352, 99665523, 78580150, 64368824, 54210476, 46339069, 39912961, 34619931, 30283909, 26727149, 23784014, 21312793, 19206007, 17389500, 15803109, 14403008, 13156622, 12038655, 11035406, 10138792, 9334339, 8605487, 7945071, 7355150, 6830043, 6362566, 5945773, 5571657]
5144E571657l41293l12803k86862k63077k42615k24154k10812j98284j84193j69129
5134C138435j56177j46492j38890j31129j24290j16683j10306j03396r6179q7526
5124A927367p9856p3691p2188p1121o7562o0333n2506m6306m2826m0991m0383
5113A279604l6712l1593k4868j6969p237L286J2077J3671J4594K1061M1020Q1665
5101A349599J45873K18469K46292J53303l4414j85858k41126k32406j88850j37893
5091A092989r8394p3388n7587m8877m2751l7825l1373k7106k5438k4019k2127
5080F04104j9573j6688j6313j5188j3708j2018j0449r938r760r108r284q825q862
5067D44390r233r803q679p470n389m357m064n283o482o630o985p673o321m801
$$ y = [5571657, 5230364, 4917561, 4630699, 4367622, 4125007, 3900853, 3690041, 3491757, 3307564, 3138435, 2982258, 2835766, 2696876, 2565747, 2441457, 2324774, 2214468, 2111072, 2014893, 1927367, 1847511, 1773820, 1701632, 1630511, 1562949, 1502616, 1450110, 1403804, 1360978, 1319987, 1279604, 1242892, 1211299, 1186431, 1169462, 1162225, 1165511, 1177588, 1191259, 1205853, 1226914, 1267934, 1349599, 1495472, 1713941, 1960233, 2113536, 2079122, 1893264, 1652138, 1419732, 1230882, 1092989, 994595, 921207, 863620, 814743, 771992, 734167, 702794, 675688, 650250, 626231, 604104, 584531, 567843, 551530, 536342, 522634, 510616, 500167, 490229, 480469, 471361, 462077, 453252, 444390, 435157, 425354, 416675, 409205, 403816, 399459, 395395, 390112, 383630, 377000, 370015, 362342, 356021, 351220]
5053C51220n119n753n127m824m900m833m790n671n603m734l992k701k279k093
5039B88801k553l682m363m000m121l945l465l549k905k642k289k055k453j278
5025B45501k60J37J276P54k79j096k073l254l589m023l504j092M3k480l781l351
5009B18929l370k190j057j86n01j797k345k318l423m043l319k326j249j048k219
4994A87538l411k670j170j055q29m23j140q19M09j5j000j834k036k038k041k683
4978A64783k573o65J024K412M152M403L68k611j527j145k388j724M38O30r93k214
4962A62370k389l372n234n740l190l56k57j933j215J717M048L637K537K244K009
4947A54876N08j364j712j080k298m342m526k100k169m175n291l827o88O20j116
$$ y = [351220, 346101, 340348, 335221, 330397, 325497, 320664, 315874, 310203, 304600, 299866, 295874, 293173, 290894, 288801, 286248, 282566, 278203, 274203, 270082, 266137, 262672, 259123, 256218, 253576, 251287, 249232, 246779, 245501, 245241, 245378, 246654, 247408, 247129, 246033, 243960, 240706, 237117, 233094, 229590, 228498, 228541, 226061, 222280, 218929, 215559, 213369, 212312, 212126, 211625, 209828, 207483, 205165, 201742, 197699, 194380, 192054, 190805, 189757, 187538, 184127, 181457, 180287, 179232, 178403, 177980, 176840, 176021, 176430, 176415, 175415, 173581, 171545, 169507, 167466, 164783, 162210, 161545, 162569, 164981, 169133, 173536, 173904, 171293, 169766, 168621, 166233, 164509, 164947, 165577, 164584, 162370, 159981, 156609, 151375, 145635, 142445, 142089, 141832, 139899, 138684, 140401, 144449, 148086, 150623, 152867, 154876, 155384, 154020, 152308, 151228, 148930, 144588, 140062, 137962, 135793, 131618, 126327, 122500, 121812, 122432, 121316]
4932A21316k482j996j190o23j116j255K76J445J517J097o61j624j280o19O48N49
4916A14002q35k351k813j296P31K116K018M7p87l61k95j002j236j126q95j135
4900A04782J27J148j28j359n52n66m69o39q39r16j57Q70P20J51l45q19r48j62
4882I9899P37K10o08q39p40l41m01r13N85J582J417J607J126Q6p48j744k150j188
4864I7577k46l91p35q52j573j844j475n71j65j09p0n07n52k29m25j188n24L41
4846H6462L96r55j199n75j121j798j793o37l09n18m40o5R2O09J020J157J103M19
4828H1848O89Q88j3o54m0j51r26j614m70J099R94Q37J355J488O71N44j46K79J444
4809H8122R30J69k11Q33K830L679L129L089L570M309O582Q658J0283J2217J5847
$$ y = [121316, 118834, 116838, 115648, 115025, 113909, 112654, 112930, 114375, 115892, 116989, 116328, 114704, 113424, 112805, 113453, 114002, 113167, 110816, 108003, 106707, 107438, 109554, 111572, 111619, 110832, 110471, 110176, 109174, 107938, 106812, 105917, 104782, 104909, 106057, 105929, 104570, 104018, 103452, 102983, 102344, 101505, 100589, 100432, 101302, 102022, 102173, 101828, 101009, 100061, 99899, 100636, 100846, 100238, 99399, 98659, 98318, 97917, 97004, 97589, 99171, 100588, 102195, 103321, 103407, 102659, 100915, 98765, 97577, 97331, 96940, 96205, 95353, 93780, 91936, 90461, 89890, 89725, 89616, 89546, 89039, 88487, 88258, 87833, 86645, 86121, 86462, 86858, 85903, 84704, 84129, 83008, 81210, 79417, 78780, 78471, 77953, 77513, 77448, 77540, 78149, 79169, 80326, 81429, 81848, 82537, 83425, 83412, 82758, 82718, 82567, 81641, 80027, 79557, 80656, 81650, 82487, 83842, 85330, 86001, 86545, 86399, 86678, 88122, 89052, 89221, 89010, 89843, 92673, 96352, 99481, 102570, 106140, 110449, 117031, 125689, 135972, 148189, 164036]
4794A64036K1218K7464L6051M6496N4662N8060O1356P5080J07008J67425K59130
4783A077986L60760L89136K41025l6440k53260l30330l16169k54163j79400j21550
4773E77595q6242o5822n2770m2508l4089k8574k3725k0249j7321j4311j2039j1094
4761A68851j0463q811q065p883p880o871m021k747l498l510k358k350l227k576
4747I4591k042k920k961k438k024k942m229m100j561R32L23k081k633j361n80
4732F3974j95Q58M58j551k334n43K224K673l4k729k710j173J69K35k07m99L95
4715E9011J319J834K340K081K053K583L798M209K549R37J058J595N90j942l051
4700H0964l177m215l376j818r98n26p12j779j280N3J302J854J529Q18R42J504
$$ y = [164036, 185254, 212718, 248769, 295265, 349927, 407987, 469343, 544423, 651431, 818856, 1077986, 1438746, 1827882, 2068907, 2032467, 1779207, 1448877, 1132708, 878545, 699145, 577595, 491353, 425531, 372761, 330253, 296164, 267590, 243865, 223616, 206295, 191984, 179945, 168851, 158388, 149577, 141512, 133629, 125749, 118878, 114857, 112110, 108612, 105102, 102744, 100394, 97167, 94591, 92549, 89629, 86668, 84230, 82206, 79264, 75035, 70935, 69374, 70306, 70629, 68548, 65915, 64554, 63974, 63779, 64637, 65095, 63544, 61210, 60667, 62891, 65564, 65530, 62801, 60091, 58918, 59087, 59322, 59115, 58616, 59011, 60330, 62164, 64504, 66585, 68638, 71221, 75019, 79228, 81777, 82714, 83772, 85367, 85957, 84015, 80964, 77787, 73572, 70196, 68378, 67380, 66854, 66142, 64363, 63083, 63136, 64438, 66292, 67821, 68639, 69581, 71085]
4684G1085J147l63j504k70P54q0j575k281k174k073j697j471j820k089r35o24
4668E4030j435j035j032q41j41N00R71Q90N12L98P71J582J355N97j94j084j707
4651E4137j919j639j553r00o80n34n83n42M63M05l09k95j19K69Q84J793K633L397
4633E4908L661L127J078j051k587l721m324l637j587j01K11o26o48n77r83r95
4617D2148m86J09m81l97N03Q44R00J106J157O41O67K86n60l93p08r82j00m03j044
4598D2807j547k260j355O02K138K130Q64p07j002k60p0o78j83k42L1P32M71o24
4580D0847K30R69J100P82P11O87O04J156J224J588K137K850M300N091L978j121
4564F7133m584m920m586l176q73k5p76j512j570j408o38K46J29J46J268J726L82
$$ y = [71085, 72232, 71869, 70365, 70095, 70849, 70769, 69194, 66913, 64739, 62666, 60969, 59498, 57678, 55589, 54654, 54030, 52595, 51560, 50528, 49687, 49546, 50046, 51017, 51907, 52419, 52817, 53588, 55170, 56525, 57122, 56928, 55844, 54137, 52218, 50579, 49026, 48126, 47446, 46912, 46329, 45787, 46250, 46655, 46346, 46051, 45932, 46201, 47085, 48878, 51511, 54908, 58569, 61696, 62774, 61723, 59136, 55415, 51091, 47454, 45867, 45766, 45977, 45351, 44703, 44126, 43143, 42148, 41662, 41771, 41290, 40893, 41396, 42240, 43140, 44246, 45403, 46044, 46711, 46997, 46437, 46044, 45336, 44354, 44254, 43851, 42807, 41260, 39000, 37645, 38247, 40385, 42515, 43379, 42672, 41670, 41410, 41340, 40662, 40479, 40237, 40268, 41000, 41471, 40847, 41077, 42046, 43146, 43928, 44639, 45326, 45930, 47086, 48310, 49898, 52035, 54885, 59185, 64276, 68254, 67133, 62549, 57629, 53043, 49867, 48994, 48969, 48193, 46681, 45111, 43703, 43065, 43311, 43440, 43586, 44854, 46580, 46962]
4547D6962l04K77J138J768J677J306K287K638K429K644L204K025J85j652k583
4532F4001k818j704K3N71k96j797k344j504j031j026j150j076j29L75K67O42J183
4515E2187N29N68n4p28j311k382k104r76j97K34J059M71l73n85M46J464J053p97
4497D8504j702j485q47j70Jk95j020j203n23K95N98K90l81j69j088j424J36q1
4479C9436p1P01J93q51j266j242j61J16k61k49l70M2M40l78r42j086j613q94M6
4460C1590Q64J150M71p34j396n68Q66J835O57m29j058m37N38O23J4l24o08j136
4442C1918m02Q36K53m78r51L4J094J208O12J18l0j18j88O37J056j35m1J077K110
4423C8610K415J212K95O13J183J214l09j587j451p00Q17K037O44r8P55R39M80
$$ y = [46962, 46658, 46935, 48073, 49841, 51518, 52824, 55111, 57749, 60178, 62822, 66026, 68051, 68236, 66584, 64001, 61183, 59479, 59502, 60073, 59777, 57980, 55636, 54132, 53101, 52075, 50925, 49849, 49720, 50095, 50362, 51004, 52187, 52716, 53284, 53230, 52502, 51191, 48809, 46705, 45729, 45532, 45766, 46825, 47296, 46923, 46338, 46784, 48248, 49301, 48504, 46802, 45317, 44470, 44300, 44301, 44006, 42986, 41783, 41260, 41555, 42153, 42443, 42062, 41893, 40805, 39381, 39517, 39436, 39365, 40066, 40259, 39408, 38142, 36900, 36739, 36855, 36594, 36345, 35975, 36017, 36457, 36079, 35137, 34051, 32438, 31544, 31590, 32454, 33604, 34075, 33341, 31945, 31377, 32243, 34078, 34735, 34306, 33248, 32811, 33349, 33972, 33986, 33662, 33054, 31918, 31516, 32352, 32605, 32127, 31176, 31210, 32304, 33512, 34124, 34242, 34212, 34094, 33906, 34543, 35599, 35464, 35423, 36500, 38610, 41025, 42237, 42532, 43145, 44328, 45542, 45233, 43646, 42195, 41495, 42312, 44349, 44993, 44895, 45650, 46589, 47069]
4406D7069O38R01J58K28R66P26J97N65K03j266j250n18j1O33N1K65Q98l12k283
4387D7858j823k27n56q98o62k18P75K97j17J92J89MJ36Q17Q38Q0l05l99n96m53
4367D4932l94P3O72K0r13j220j225j454j463j083m33m0M20K98k97l20K98L73o7
4348C8177p33n83o01j167r36r02j388j379l09o9k0j51J005J767J037K83K54n72
4330C3713j796k162j434r26l35L97L85p25j026l33o65q77p50l02J36K52J482J286
4312B6320j22j237m77l34o4R42L39o96r40n18J35J267K001J135J203J298J168
4295C1420J520K433L147K814K360L742M674N333M371J05m484o494o544n232k641
4280C6524j248j753r00O04P72P93K179K120J581J352K008M024N493O390O738L127
$$ y = [47069, 47707, 48608, 48766, 48994, 49960, 50686, 50883, 51448, 51651, 50385, 49135, 48617, 48606, 49239, 49290, 49555, 50453, 50141, 47858, 46035, 45808, 45252, 44354, 43692, 43474, 44249, 44546, 44429, 44621, 44810, 44814, 44950, 45767, 46605, 46685, 46380, 45981, 45385, 44932, 44538, 44611, 45283, 45303, 44390, 43170, 41945, 40491, 39028, 37945, 37512, 37472, 37892, 38190, 37893, 37573, 37871, 38244, 38177, 37444, 36861, 36260, 35093, 34157, 33255, 31867, 30488, 30179, 30110, 30090, 29939, 30944, 32711, 33748, 34031, 34285, 33713, 31917, 29755, 28321, 27395, 27060, 27457, 27842, 27117, 26091, 25758, 25093, 24216, 23466, 23164, 23300, 23552, 25034, 26320, 26198, 24961, 24484, 24150, 24086, 25028, 25367, 24671, 23731, 23213, 23348, 24615, 26616, 27751, 28954, 30252, 31420, 32940, 35373, 38520, 41334, 43694, 47436, 52110, 57443, 61814, 61919, 57435, 50941, 44397, 39165, 36524, 35276, 33523, 32623, 33227, 33999, 34792, 36971, 39091, 40672, 42024, 44032, 48056, 53549, 59939, 66677, 69804]
4264F9804k849o123o131m313k199j241j645k079j091P43J646J550K248M183O203
4249E8706Q523R275N882j180o937r407q863n725k971l205k930j144l55q2j6j14
4233C9457N87J425K515K441K640N857Q580Q878M967j555o551p780o930o186m641
4218D3704m088l022j459j47J40n70p41k44q09j314n70j00m51j094j223q4O91k66
4200B8353q21j99N12J001J2j200j647n66P43Q32L97M93L29L31Q09Q43N55Q14K67
4181C1858j141k235j293M26J416K20j165j761r03l36r9K49R31N75n11j217r41
4164B4073P55L095L890K527M7q99j397j692q63J032R41K6N2j203k257k522k080
4147B3525p11Q06J736J221J4j057j142j48J126J135Q28M1l90k59k19K67L18l3
$$ y = [69804, 66955, 60832, 54701, 50388, 48189, 46948, 45303, 43224, 42133, 42876, 44522, 46072, 48320, 52503, 58706, 67229, 76504, 82386, 81206, 74269, 64862, 55999, 50274, 47303, 44098, 41168, 40024, 39669, 39587, 39571, 39457, 40044, 41469, 43984, 46425, 49065, 54922, 63502, 72380, 77347, 75792, 69241, 61461, 54531, 48345, 43704, 39616, 36594, 35135, 34988, 35128, 34558, 33817, 33573, 32764, 31450, 30880, 30780, 30329, 29235, 28012, 27928, 28619, 28353, 27532, 27333, 27845, 28846, 28858, 27658, 26011, 25445, 26188, 27020, 27417, 27910, 28239, 28570, 29379, 30222, 30777, 31591, 31858, 30717, 28482, 27189, 27615, 29031, 29251, 28086, 26325, 25422, 25086, 24987, 25236, 26167, 26742, 26231, 25014, 24073, 24828, 27923, 31813, 34340, 34387, 33488, 32091, 30399, 29536, 30568, 31509, 31535, 31587, 30384, 28127, 25605, 23525, 22814, 23620, 25356, 26577, 26591, 25534, 24392, 24244, 25370, 26505, 27333, 27374, 26984, 26725, 26506, 26773, 27091, 27058]
4129B7058k70k05P81J040J409J226Q02J038J180P97k93j096j415p28K5O5j49n99
4111C0666O94J408J725J767J118n45k219j970p4J214J491J607J552R13K65J0j81
4094C9441l61q00m47J94J615J769J518O12M23R69K574L751L802M345N683O729
4078G1817Q706J0849J2533J5813K0363K3972K8631L4664L9548M3025M5193M1907
4066C97021L3007J9488M115j0811k2334l0352l4459l5247l4459l0829k5621k0146
4054B09373j3262p955l396J117O610J2349J9036K5012K9802L3702L5835L3836
4042C82059K9300K1827J2440K975n732j4123k3552l3164l8018l7167l2340k5566
4030B38939j9228j4934j0960q304p804r005j1612j2810j0805q244m257j646L09
$$ y = [27058, 26788, 26583, 27364, 28404, 29813, 31039, 31841, 32879, 34059, 34856, 34563, 33467, 32052, 31324, 31349, 31414, 31265, 30666, 31360, 32768, 34493, 36260, 37378, 36833, 34614, 32644, 32570, 33784, 35275, 36882, 38434, 39347, 39612, 39622, 39441, 39080, 38280, 37833, 38027, 39642, 41411, 42929, 43541, 43964, 44933, 47507, 51258, 55060, 59405, 65088, 71817, 80523, 91372, 103905, 119718, 140081, 164053, 192684, 227348, 266896, 309921, 355114, 397021, 430028, 449516, 453631, 442820, 420486, 390134, 355675, 320428, 285969, 255140, 229519, 209373, 196111, 188156, 184760, 185877, 192487, 204836, 223872, 248884, 278686, 312388, 348223, 382059, 411359, 433186, 445626, 448601, 442869, 428746, 405194, 372030, 334012, 296845, 264505, 238939, 219711, 204777, 193817, 185513, 177709, 168704, 157092, 144282, 133477, 125233, 120976, 119330, 119639]
4017A19639K076M580P379J0326J4900K1205K3611K0933J6255J6944K4998M2517
4005C25363P0877J16023J74623J85589N8784r7790j48987j42362j08153p1348
3995C62619m7682l5788k8756k3013j9166j5925j1657q563q593j0067r560q344
3983A35505p496o583n591m621l569k954k288j706J2R16J022O49Q64J401J847M267
3967A11675P392Q621P429J423n828r007q571o403m250l287k249j646j042M19J213
3952I5889R84O80J085L071L721L284M143N627P114R196R857O092o84n167n934
3937A38958n119m769l009p39M45R31R80J603L095M482N063N583P483Q321Q541
3922A71849R255J0485J0951P740J324m071n796m941k983J166N333R275J3992K1858
$$ y = [119639, 121715, 126295, 133674, 144000, 158900, 180105, 203716, 224649, 240904, 257848, 282846, 325363, 396240, 512263, 686886, 872475, 931259, 833469, 684482, 542120, 433967, 362619, 314937, 279149, 250393, 227380, 208214, 192289, 180632, 172069, 163476, 153409, 143849, 135505, 128009, 121426, 115835, 111214, 107645, 104691, 102403, 100697, 100709, 101625, 102647, 103296, 104160, 105561, 107408, 111675, 119067, 127688, 135117, 136540, 130712, 121705, 113134, 106731, 102481, 99194, 96945, 95299, 94257, 94676, 95889, 96873, 97553, 98638, 101709, 105430, 108714, 112857, 118484, 125598, 134794, 144651, 150743, 150059, 144892, 138958, 133839, 129070, 126061, 125322, 125767, 126698, 127678, 129281, 132376, 136858, 141921, 147504, 154987, 163308, 171849, 181104, 191589, 202540, 210280, 211604, 207533, 201737, 196796, 193813, 194979, 200312, 209587, 223579, 245437]
3908B45437L2456L6004J8182l878r343n233J972M027p09p237j1257j1739j0475
3895B78207j0568r791q386n660k294l28J308K663M590P187R381J0566J1135J0986
3881B98996J1203J1338R750P231N609M118L130J677p01k692m806n771l801q23
3867C34458J524L050M816O648P779R194J0275J1182J1135J1350J3047J3468J3271
3854D51197J0785P557O690O217O592P573R859J2492J3235J4213J5736J6825J7716
3841E96687J8840K0936K2268K2266K2515K3619K3276K2719K2488K3713K6760K9970
3829H76057L2289L3379L5207L7442L8811M0111M2280M4413M6655M8607N0209N3499
3817A378959N6857N8084N7367N4749N1617N0319N1585N3039N3715N3439N3433
$$ y = [245437, 277893, 313897, 332079, 328201, 318858, 313625, 315597, 319624, 318915, 311678, 300421, 288682, 278207, 267639, 257848, 249462, 243802, 241508, 241180, 242488, 245151, 249741, 256928, 266309, 276875, 288010, 298996, 310199, 321537, 331287, 338518, 344127, 348245, 351375, 353052, 352351, 349659, 344853, 339082, 335281, 334458, 335982, 339032, 343848, 350496, 358275, 367469, 377744, 388926, 400061, 411411, 424458, 437926, 451197, 461982, 469539, 476229, 482446, 489038, 496611, 506470, 518962, 532197, 546410, 562146, 578971, 596687, 615527, 636463, 658731, 680997, 703512, 727131, 750407, 773126, 795614, 819327, 846087, 876057, 908346, 941725, 976932, 1014374, 1053185, 1093296, 1135576, 1179989, 1226644, 1275251, 1325460, 1378959, 1435816, 1493900, 1551267, 1606016, 1657633, 1707952, 1759537, 1812576, 1866291, 1919730, 1973163]
3806A973163N4536N4774N5240N5331N3195N0791M9202M8106M6831M4521M1967
3795B527657L8760L6910L5415L3460L0149K5498K0527J6856J5494J4286J3581
3784B808593J2588J0944J0654R251Q578Q079P100M459J353o55k193m463o890r760
3770B857638j1696j4835j8618k2393k6100k9797l3197l6043m0392m6994n1937
3759B525636n3842n4558n6206n8458o0492o3484o4754o3993o3544o2024o1293
3748A862988o2009o2533o2276o0684n6798n2129m9433m9394n0002m8893m6845
3737A261992m4191m0429l7483l6084l5540l4967l2055k9732k9612k9181k9023
3726H83695k9001k7632k4923k3361k1847k0191k0043k0627k0062j9112j8069j5991
$$ y = [1973163, 2027699, 2082473, 2137713, 2193044, 2246239, 2297030, 2346232, 2394338, 2441169, 2485690, 2527657, 2566417, 2603327, 2638742, 2672202, 2702351, 2727849, 2748376, 2765232, 2780726, 2795012, 2808593, 2821181, 2832125, 2842779, 2852030, 2860608, 2868687, 2875787, 2880246, 2881599, 2880944, 2878751, 2874288, 2867398, 2857638, 2845942, 2831107, 2812489, 2790096, 2763996, 2734199, 2701002, 2664959, 2624567, 2577573, 2525636, 2471794, 2417236, 2361030, 2302572, 2242080, 2178596, 2113842, 2049849, 1986305, 1924281, 1862988, 1800979, 1738446, 1676170, 1615486, 1558688, 1506559, 1457126, 1407732, 1357730, 1308837, 1261992, 1217801, 1177372, 1139889, 1103805, 1068265, 1033298, 1001243, 971511, 941899, 912718, 883695, 854694, 827062, 802139, 778778, 756931, 736740, 716697, 696070, 676008, 656896, 638827, 622836]
3714F22836j4816j3363j2472j2443j1955j1090r622q534q035q057q453r324r352
3701D85320q863r996j0548j0905j1331j0914r211q309q100p593o874o585o334
3688C69757n708p240q329o624m181l197k290o76O6k83r91j520j456j151p53R8
3672C25522J186L165N963P509Q811J0458J1653J4013K0116L0842L9901L9707L1369
3659E50215K4891J6745O009l921j4397k3617l4935l8637l3325k6485j9237j2893
3647C90413p119k364J526L615M758N936P435Q896J0136J1230J4107J6905K0502
3634D85976K6002L2979M1708N4036O8224Q5686J07771J36800J75932K30636L03823
3623A749573L86464M47618M73058N05658O18914Q74440J334120K045405K936283
$$ y = [622836, 608020, 594657, 582185, 569742, 557787, 546697, 537075, 528541, 520506, 512449, 503996, 494672, 485320, 476457, 466461, 455913, 445008, 433677, 422763, 413552, 405243, 397143, 389550, 382676, 376091, 369757, 364049, 356809, 348480, 341856, 337675, 334478, 332188, 331512, 331578, 331295, 330304, 328784, 327328, 326177, 325424, 325522, 326708, 329873, 335836, 343345, 352156, 362614, 374267, 388280, 408396, 439238, 479139, 518846, 550215, 575106, 591851, 597860, 593939, 579542, 555925, 520990, 482353, 449028, 422543, 403306, 390413, 383294, 380930, 382456, 386071, 390829, 396765, 404200, 413096, 423232, 434462, 448569, 465474, 485976, 511978, 544957, 586665, 640701, 708925, 794611, 902382, 1039182, 1215114, 1445750, 1749573, 2136037, 2583655, 3056713, 3562371, 4181285, 5055725, 6389845, 8435250, 11371533]
3614A1371533L452271K531945J27961k016326k864936k809259k269691j612938
3606E910560j106668p85864n90671m72874l89209l18912k60676k14073j77538
3597A594075j51489j32090j16754j03813r3132q2414p2147o2583n4820m8264m3433
3586F33136l8503l3567k8560k4354k1761k1352k1317k0187j6468j3966j2534j2106
3574C68461j0216o361k635l445m899n448n470o324r334j1648j2150j0808o689
3561B73034m825m795m413l159j915o34J85J268L858P258R547R990J0684J2351
3547C08434J4103J3356R718N806N300P620J0829J5227K0173L0307M5810O3805
3535E50488Q0852R4684J04384J10979J11036R6904P0385M0500J0470k3860o1028
$$ y = [11371533, 14823804, 17355749, 17483710, 15467384, 12602448, 9793189, 7523498, 5910560, 4803892, 4018028, 3427357, 2954483, 2565274, 2246362, 1985686, 1771613, 1594075, 1442586, 1310496, 1193742, 1089929, 996797, 914383, 842236, 779653, 724833, 676569, 633136, 594633, 561066, 532506, 508152, 486391, 465039, 443722, 423535, 407067, 393101, 380567, 368461, 358245, 351884, 349249, 345804, 340905, 335457, 329987, 323663, 314329, 302681, 290531, 279723, 273034, 268209, 263414, 259001, 255842, 253927, 253293, 253478, 254746, 258604, 265862, 275409, 285399, 296083, 308434, 322537, 335893, 345611, 351417, 356717, 364337, 375166, 390393, 410566, 440873, 486683, 550488, 631340, 726024, 830408, 941387, 1052423, 1149327, 1219712, 1260212, 1270682, 1246822, 1185794]
3524A185794q7688j01215j07840j06791r6765q1038o4436n0733l8092k7163j7275
3513D06758o682K774P598J17j6456k6844k8703k4905j7928j1104o942n629o534
3500B65520p240o985o789o794o697n904l784n41L635O975P034M209J829J649K568
3485B48685%n964j2121j5141j5118j4561j3604j3096j1910r976p425m502l080
3472A22187k073j670r91j226r05l77j808k277k278k321j603o48r8r93j482j429
3456A00008O24M458O833N554k15n218p234p281o495m260j866j245j576n69j43
3441H1375j52Q1L69J018M86R1P5q13r0L119M796N530N293K566P4k431m925m982
3423I1480m182l232j165J26Q96J063j88j428p37K08P91K033M336O198P832Q379
$$ y = [1185794, 1098106, 996891, 889051, 782260, 685495, 604457, 540021, 489288, 451196, 424033, 406758, 400076, 402850, 410448, 410565, 394109, 367265, 338562, 313657, 295729, 284625, 277683, 272054, 265520, 258280, 251295, 244506, 237712, 231015, 225111, 221327, 220786, 224421, 231396, 238430, 242639, 244468, 246117, 248685, 248685, 242721, 230600, 215459, 200341, 185780, 172176, 159080, 147170, 137194, 129769, 125267, 122187, 120114, 118444, 117453, 116227, 115322, 114945, 113137, 110860, 108582, 106261, 104658, 104010, 103912, 102919, 101437, 100008, 100632, 105090, 111923, 117477, 117262, 112044, 104810, 97529, 91034, 86774, 84908, 83663, 82087, 81518, 81375, 81223, 81304, 81673, 82691, 83177, 83268, 83343, 82530, 82440, 85559, 90355, 95885, 101178, 103744, 103818, 101387, 96462, 91480, 87298, 84066, 82901, 83027, 83923, 84986, 84798, 83370, 82633, 82841, 83632, 85665, 90001, 96199, 104031, 112410]
3407A12410R004P847N688K935k17j69L116O957J1654J5916K0617K4861L0638L9337
3393B90594N1641O8041Q9373J09403J19939J16755J00157P4048M3740R598k7665
3382A045624o3885r3576j11953j14925j05269q8037o7697m9226l5940k6339j9372
3371B69405j4178j0848q222o933o226n789o495p881r065j0833j1730j2578j3627
3358A45000j2053r163o423l981l042j967j169O0J634J965M16k786n692o310n611
3343I0878m498l239j691q45m75j287k600l118k000m31M63On46o36o07p68j82J414
3325F9838O45j686k606j470J34P63J530L790N238L487j525n976p122n479l478
3310E6083l364l516k902k490j367J47L57k56j286j628j223o67P47J117J567J364
$$ y = [112410, 121414, 129261, 134949, 137884, 137667, 137498, 140614, 147571, 159225, 175141, 195758, 220619, 251257, 290594, 342235, 410276, 499649, 609052, 728991, 845746, 945903, 1019951, 1063691, 1073289, 1045624, 981739, 888163, 776210, 661285, 556016, 467979, 400282, 351056, 315116, 288777, 269405, 255227, 244379, 236157, 229224, 222998, 217209, 210714, 202833, 193768, 182935, 171205, 158627, 145000, 132947, 123784, 117361, 113380, 110338, 108371, 107202, 107262, 108896, 110861, 111277, 108491, 102799, 96489, 90878, 86380, 83141, 81450, 80605, 80130, 78843, 76243, 73125, 71125, 70694, 71157, 71163, 70617, 69981, 69374, 68606, 68424, 69838, 70483, 68797, 66191, 64721, 64855, 65618, 67148, 70938, 76176, 79663, 78138, 72162, 65040, 59561, 56083, 52719, 49203, 46301, 43811, 42444, 42591, 42948, 42692, 41406, 39778, 38555, 37888, 38635, 39752, 41319, 42683]
3294D2683J263J562K011K109J002q80n20J377K135J395P3N44J731K120M096P218
3278F9919J1521J5565J3991L848o904j1334j1181r605p788o823n362l943k617
3265D9287j308nk96o15j71q33j570m02m4p20j716j262l68j53k47L98j48p1R84
3246D0740J632J282J069R26J716J808J694J165J417J375J493J242J972K328J644
3231F3503J374J245R01J801K729K848L018L622M526N093N282P264R684J1038J0841
3216A34769J1274J1337J3245J4282J6189J9978K2955K4635K6626K8650L0952L3232
3204C88124L4969L6580L6208L3614K9830K3255J5766P950J227m352j0285j5334
3192E77552j8389k0050k1398k1547k1535k1565k0110j7772j7112j8060j8505j8066
$$ y = [42683, 43946, 45508, 47519, 49628, 50630, 49750, 49230, 50607, 52742, 54137, 54210, 54754, 56485, 58605, 62701, 69919, 81440, 97005, 110996, 114844, 107940, 96606, 85425, 75820, 68032, 61209, 55847, 51904, 49287, 47979, 47974, 47678, 47063, 46892, 46059, 44489, 44087, 44043, 43323, 41607, 40345, 39977, 39824, 39577, 39975, 39827, 39756, 40740, 42372, 43654, 44723, 45649, 47365, 49173, 50867, 52032, 53449, 54824, 56317, 57559, 59531, 61859, 63503, 64877, 66122, 67023, 68824, 71553, 74401, 77419, 81041, 85567, 90660, 95942, 103206, 112890, 123928, 134769, 146043, 157380, 170625, 184907, 201096, 221074, 244029, 268664, 295290, 323940, 354892, 388124, 423093, 459673, 495881, 529495, 559325, 582580, 598346, 606296, 607523, 603171, 592886, 577552, 559163, 539113, 517715, 496168, 474633, 453068, 432958, 415186, 398074, 380014, 361509, 343443]
3180C43443j7175j5248j2824j1903j1445j0358r483p973o456n754n851o056n534
3167B17383n051m672l576j978j279j247q83q33j711l364m709o239o030n216l628
3152A66967k310j669j485j158k326l116k342l57N74J147J282K018K727N336P821
3137A73109R977J2687J5713J6902J9785K5048L5318N1204O9028P5467N7106J0423
3125E71767l6836o0014o4902o0480n0059l9731l0440k5047k2057j8355j4677j1961
3113A37208q623n206k819k604j350R41K344P94k798p654q766p155n315l919k906
3098H2172j458R67J475l94j295N71J954L668M873N430N988Q566J0549J3302J8310
3083A54678K5416L5659M7735N3257M4721K1436q460l3330m5123m5093l7621k8022
$$ y = [343443, 326268, 311020, 298196, 286293, 274848, 264490, 255007, 247034, 240578, 234824, 228973, 222917, 217383, 212332, 207660, 204084, 202106, 200827, 199580, 198697, 197864, 196153, 192789, 188080, 181841, 175811, 170595, 166967, 164657, 162988, 161503, 160345, 158019, 154903, 152561, 152204, 152778, 153925, 155207, 157225, 159952, 165288, 173109, 183086, 195773, 211486, 228388, 248173, 273221, 308539, 359743, 428771, 504238, 561344, 571767, 534931, 474917, 410015, 349535, 299476, 259745, 229305, 204258, 182201, 163846, 149169, 137208, 128585, 123379, 120560, 117956, 116606, 117547, 119891, 120685, 117887, 110233, 101467, 94312, 88997, 85078, 82172, 80714, 81681, 83156, 82762, 81467, 82038, 83992, 87660, 92533, 97963, 103951, 112517, 123066, 136368, 154678, 180094, 215753, 263488, 316745, 361466, 382902, 374442, 341112, 295989, 250896, 213275, 185253]
3071A85253j9163j3034j0221r264p101m072k089p40l47r2Q35l29k091k252j234
3056A14059n6Q72R86R40k41l260m857m320k552q76j103k052r60R68K747M239N819
3039A10353O807Q708J0028J0147J0261P881L689Q82K460P513J2464J7086K2052
3026B30331K7479L5115M8037O5339Q1891Q5455O2884J6190l7114p4219q4797p6808
3014C79783n9143m3562l2670k5633j9234j4864j0424o890l592k410K86M006P286
3001A72939Q372P867O092M766Q46j872j603K013O295J0188J0848P519L238L375
2987B40883O178J2080J9139K8663L8301N0401O1607O9139P3581P6980O5197L4123
2975G76272j0418n0679p3437p4561o3774m9339l5749k4104j8813j5478j2355q209
$$ y = [185253, 166090, 153056, 142835, 133571, 126470, 122398, 120309, 119569, 119222, 119130, 119965, 119636, 117545, 115293, 114059, 114003, 114875, 115861, 116801, 116560, 113300, 108443, 104123, 101571, 100695, 99592, 97540, 96580, 97548, 100295, 104534, 110353, 117160, 125868, 135896, 146043, 156304, 164185, 167874, 168756, 171216, 178729, 191193, 208279, 230331, 257810, 292925, 340962, 406301, 488192, 573647, 636531, 652721, 615607, 541388, 456591, 379783, 320640, 277078, 244408, 218775, 199541, 184677, 174253, 167363, 163771, 161361, 161647, 165653, 172939, 181311, 189178, 195270, 200036, 200882, 199010, 197407, 199420, 205715, 215903, 226751, 234270, 237508, 240883, 247061, 259141, 278280, 306943, 345244, 395645, 457252, 526391, 599972, 676952, 742149, 776272, 765854, 715175, 641738, 567177, 503403, 454064, 418315, 394211, 375398, 359920, 347565, 339356]
2963C39356m550P84N537R592R884Q342N319L783L352N388O903J0016J2852J5872
2949D32430J7872K1047K4358K9814L5100M2566N1959O8839Q8666J05448J07373
2938A025472R1505O1533L1290J2982J3448L0100O0549R9290J43765J79620J88621
2927A938175J56356R3592K8056k1451n9234q7275r2952q2399p1590o3988o3123
2916A674167o4629o5442o1736n3787m2326k8772j4287P22J8028L8010N9279Q1670
2904A540897J08083J42595J88517K50109L27137M21922N44451P19995R70851J298234
2894F512791J607828J779050J901073K221629L006561M599782P283877J0719360
2886C9631951J2585428Q561704q95517p986060j0081125r618731p563897n175846
$$ y = [339356, 334806, 335590, 341127, 350719, 360603, 368945, 374264, 378047, 381399, 386787, 393690, 403706, 416558, 432430, 450302, 471349, 495707, 525521, 560621, 603187, 655146, 723985, 812651, 918099, 1025472, 1116977, 1178510, 1209800, 1222782, 1236230, 1266330, 1326879, 1426169, 1569934, 1749554, 1938175, 2094531, 2188123, 2216179, 2194728, 2135494, 2048219, 1955267, 1872868, 1801278, 1737290, 1674167, 1609538, 1544096, 1482360, 1428573, 1386247, 1357475, 1343188, 1343910, 1361938, 1399948, 1459227, 1540897, 1648980, 1791575, 1980092, 2230201, 2557338, 2979260, 3523711, 4243706, 5214557, 6512791, 8120619, 9899669, 11800742, 14022371, 17028932, 21628714, 28912591, 39631951, 52217379, 60779083, 59883566, 51897506, 41816381, 32197650, 24633753, 19457907]
2878A9457907l486523k531184j987125j644705j354737j094834q71620p00676
2870E786503n67063m73706m00374l40984k79172k24001j82490j69598j74318j91698
2860B783099k05234k08686j88400j58049j20403q3156m3467j0454J7175L3323
2850A815748N0135P9078J40354K47907M19790O20138O99785M36869r5690n07122
2840C906992o40405o04707m78752l40745k37687j75124j38307j16253r8394q9864
2830I86754q3601p4997o3989n4809m6365l9958l3620k9770k6121k4577k0937j7743
2818D70267j4503j1475q156p663p928r878j1981j3422j3603j5043j5348j4785
2806C26482j3203j1583r726p937n468n334n866p018n624k979m07J867K102j815
$$ y = [19457907, 15971384, 13440200, 11453075, 9808370, 8453633, 7358799, 6487179, 5786503, 5219440, 4745734, 4345360, 4004376, 3725204, 3501203, 3318713, 3149115, 2974797, 2783099, 2577865, 2369179, 2180779, 2022730, 1902327, 1819171, 1775704, 1765250, 1782425, 1815748, 1865883, 1944961, 2085315, 2333222, 2753012, 3373150, 4072935, 4509804, 4414114, 3906992, 3266587, 2661880, 2183128, 1842383, 1604696, 1429572, 1291265, 1175012, 1076618, 986754, 903153, 828156, 764167, 709358, 662993, 623035, 589415, 559645, 533524, 508947, 488010, 470267, 455764, 444289, 436133, 428470, 420542, 410664, 398683, 385261, 371658, 356615, 341267, 326482, 313279, 301696, 291970, 284033, 278565, 273231, 267365, 260347, 254723, 251744, 251337, 253204, 255306, 253491]
2792B53491n784p519o592n973m803m101k992j215L4L01k18m27j172l012l686l856
2776B02476m751n019m990n017n278o357n218l117k487j986j994l131l306k773
2762A47052k839k152j918j186j076q22l82p55m84l87j301q94j618j396j402j888
2746A26552p85O67J457K472K521L091M503L932J98k579m479m786m262k899j483
2731A24120N71l6L20m2q29r03j366k908l009k257j272j447j153p10N22J268J775
2714A12644L75n51j387j780j449j122k746k935j496l60PJ125J850K281J762L302
2698A09520N112O432P345R402J1686J6206K2866L1961M1907M7409M2576K4010
2686C76432m473k9557m3298m4296l8621k9783k1575j6248j2788r575p476n470
$$ y = [253491, 247707, 240188, 233596, 227623, 222820, 218719, 215727, 214512, 214546, 214847, 214629, 214202, 213030, 210018, 206332, 202476, 197725, 192706, 187716, 182699, 177421, 171064, 165846, 162729, 160242, 158256, 156262, 153131, 149825, 147052, 144213, 142061, 140143, 138957, 137881, 137059, 136677, 135922, 135438, 135051, 133750, 132856, 131238, 129842, 128440, 126552, 125767, 126434, 127891, 130363, 132884, 135975, 140478, 144410, 144608, 142029, 137550, 132764, 128502, 125603, 124120, 124691, 124655, 124975, 124933, 124104, 123201, 121835, 118927, 115918, 113661, 112389, 110942, 109789, 109079, 109601, 110869, 112644, 113019, 112468, 111081, 109301, 107852, 106730, 103984, 101049, 99553, 99193, 99200, 100325, 102175, 104456, 106218, 109520, 114632, 121064, 128409, 137811, 149497, 165703, 188569, 220530, 262437, 309846, 352422, 376432, 371959, 342402, 299104, 254808, 216187, 186404, 164829, 148581, 135793, 126218, 118742, 113272]
2674A13272m143l322l055k851l150k414k381k156o90J49m67j196k160k096j397
2659H1943l77q73j164j452j073r89m82N06O14P55J457J910K702L271K035N06j099
2642H8190j414j263j311j183k541m215l837k427j705q52k51j173j364k17Q15J711
2626F6963K698K684R92q81j723j672q41p79r15j298j291k842l608l133j498j058
2610E1798q58J03J425J148M64O10J305J498P65q2m81j026j881l012j935J33Q58
2593E0832K77j664k410j396j501j482n74O89K72k1k16k38K75R07O71J86J24P90
2575D5521J542J785N72J449J560R20P12J209J954L467N266N934M057N58m037o400
2559F6069n478l758j635J4j068k352j727k26J186K406J241Q7R44K327L437M322
$$ y = [113272, 109129, 105807, 102752, 99901, 96751, 94337, 91956, 89800, 89110, 89259, 88792, 87596, 85436, 83340, 81943, 81566, 80693, 79529, 78077, 77004, 76015, 75533, 76039, 76653, 77408, 78865, 80775, 83477, 86748, 88783, 89289, 88190, 86776, 85513, 84202, 83019, 80478, 76263, 72426, 69999, 68294, 67442, 67191, 66018, 64654, 64437, 65252, 66963, 69661, 72345, 73337, 72456, 70733, 69061, 68220, 67441, 66526, 65228, 63937, 61095, 57487, 54354, 52856, 51798, 50940, 51043, 52468, 53616, 54080, 54690, 55995, 57493, 58258, 58176, 57695, 56669, 54788, 51776, 49841, 49974, 50832, 51109, 49445, 47035, 45639, 44138, 42656, 42082, 42771, 43043, 43022, 42806, 42568, 42843, 43750, 44421, 44607, 44731, 45521, 47063, 48848, 49420, 50869, 52429, 53349, 54061, 55270, 57224, 60691, 65957, 71891, 75948, 76506, 72469, 66069, 60591, 56833, 55198, 55212, 54144, 51792, 50065, 49839, 51025, 53431, 54672, 54759, 55703, 58030, 61467, 65789]
2543F5789M415K239k267m279m130m913n463m316k110k15O95R97Q29J927J804J302
2527E2304J609J271k24r06j009K08J832K574K770K218p0k049j966j172o51J09
2511E6848J8J18J059J677K587L415K662J564J022P49N7J586M542O255O480M106
2495I4745K61j824k091k486j668M41K172L808M120K968K000J685K745L394N283
2480A15553Q027R409J0437J1480J3357J5755J8098K1032K4092K7511K7732K3288
2468C25771J5019O908P39m166q353r475r012q048o185j803L756P714Q834R910
2454C31609J2897K1387L5781N3062O8086O8487M4779M345l5822n8224o0961n2615
2442D32811m1567l1352k3540j7951j4235j2099r368m710k174k034r86L867J0853
$$ y = [65789, 70204, 72443, 70176, 65897, 61767, 56854, 51391, 47075, 44965, 44750, 45445, 46442, 47271, 49198, 51002, 52304, 53913, 55184, 54960, 54054, 53045, 53253, 55085, 57659, 60429, 62647, 62577, 60528, 58562, 57390, 56739, 56848, 56866, 56984, 58043, 59720, 62307, 65722, 68384, 69948, 70970, 71719, 71776, 73362, 77904, 84159, 90639, 94745, 95006, 93182, 91091, 88605, 86937, 87378, 89550, 93358, 97478, 100446, 102446, 104131, 106876, 110270, 115553, 123580, 132989, 143426, 154906, 168263, 184018, 202116, 223148, 247240, 274751, 302483, 325771, 340790, 347698, 348437, 344271, 335918, 326443, 317431, 309383, 303198, 301395, 305151, 312865, 321699, 331609, 344506, 365893, 401674, 454736, 522822, 591309, 636088, 640433, 604611, 546387, 485426, 432811, 391244, 359892, 336352, 318401, 304166, 292067, 282699, 277989, 275815, 273781, 272795, 276662, 287515]
2429B87515J7683K3132K3272J6488K073j6857k9148l1580k7101k0101j3055p692
2417B24629m972n356p118j0322j3794j5569j5215j2997r191o376o916q179p451
2404A01173n973l778k532j072K79O65J609J93k091k494k829j978j551j239k35
2389G8147L53r5j882l623l331l813m846m471l602k141j422k394l377l175k050
2374C8278j027o70k19j22p55j258k21j09j145j065p3l97j746k063q29J32Q16J202
2356B8729Q46k25j047j121j143j200j321j391m92K70q77j374q10j62P21P13J096
2339B1212O60o78j237l79L96n30q31k87r72n63K56k86k399k366p82O32K155K161
2321A6162l02n24M67R26J525J479J13r70j161n77J12o05j087l47p03n24j08q63
$$ y = [287515, 305198, 328330, 351602, 368090, 370163, 353306, 324158, 292578, 265477, 245376, 232321, 224629, 219657, 214301, 207183, 196861, 183067, 167498, 152283, 139286, 130095, 123719, 116803, 108624, 101173, 95200, 91422, 88890, 87818, 88097, 88762, 90371, 90564, 88473, 85979, 83150, 81172, 79621, 78382, 78147, 78500, 78405, 76523, 72900, 69569, 65756, 60910, 56439, 52837, 50696, 49274, 46880, 43503, 40328, 38278, 37251, 36581, 36362, 36240, 35485, 34227, 34006, 33897, 32752, 31687, 31614, 31217, 29471, 27408, 26579, 26711, 27527, 28729, 29575, 29350, 28303, 27182, 26039, 24839, 23518, 22127, 21635, 21905, 21028, 19654, 18844, 18682, 19403, 20116, 21212, 21872, 21194, 19957, 19578, 19974, 19444, 18613, 18326, 17354, 16791, 17047, 16761, 14362, 11996, 11214, 11846, 14001, 16162, 15860, 15336, 15803, 16729, 18254, 19733, 19846, 18876, 17715, 17138, 17250, 16645, 15558, 15211, 14508, 13984, 13876, 13013]
2303A3013j880j399m1J159J824J447Q31K48J57l58o5J697K639J737q68j630p5
2286A8436j12j053k83j21m51r98k78L92j96q43k87k4M38O03K4K69N67N85j13r48
$$ y = [13013, 11133, 9734, 9693, 10852, 12676, 14123, 14954, 15202, 15359, 15001, 14936, 16633, 19272, 21009, 20141, 18511, 18436, 18324, 17271, 16988, 16867, 16416, 15418, 15140, 15532, 15336, 14493, 14206, 14182, 14620, 15223, 15247, 15516, 16083, 16668, 16555, 15607]
$$ [...]
##END NTUPLES=NMR SPECTRUM
##END=
