##TITLE=Analysis number 320282
Compound Code cc 08601
Project Code adrs
Chemist Name stores
##JCAMPDX= 6.0         $$ Bruker NMR JCAMP-DX V2.0
##DATA TYPE= NMR SPECTRUM
##DATA CLASS= NTUPLES
##ORIGIN= Bruker BioSpin GmbH
##OWNER= nmr
$$ XWIN-NMR		Version 3.5
$$ Wed Jun 21 08:38:49 2006 GMT Daylight Time (UT+1h)  MAYBRIDGE\nmr@NMR_250MHZ
##.OBSERVE FREQUENCY= 250.131544655141
##.OBSERVE NUCLEUS= ^1H
##.ACQUISITION MODE= SIMULTANEOUS (DQD)
##.ACQUISITION SCHEME= undefined
##.AVERAGES= 16
##.DIGITISER RES= 18
##SPECTROMETER/DATA SYSTEM= dpx250
##.PULSE SEQUENCE= zg30
##.SOLVENT NAME= DMSO
##.SHIFT REFERENCE= (INTERNAL, DMSO, 0, 16.522)
##AUDIT TRAIL= $$ (NUMBER, WHEN, WHO, WHERE, WHAT)
$$ ##TITLE= Audit trail, XWIN-NMR		Version 3.5
$$ ##JCAMPDX= 5.01
$$ ##ORIGIN= Bruker BioSpin GmbH
$$ ##OWNER= nmr
$$ C:\u/data/dgb/nmr/ADRS/1130/pdata/1/auditp.txt
$$ ##AUDIT TRAIL=  $$ (NUMBER, WHEN, WHO, WHERE, WHAT)
(   1,<2006-06-21 08:38:10.38 +100>,<MAYBRIDGE\nmr>,<NMR_250MHZ>,
      <created by zg, POWCHK disabled, PULCHK disabled
       configuration hash MD5:
       E2 DF 36 D8 04 B2 41 60 5A D7 A3 38 5A 4B D0 FE
       data hash MD5: 64K
       CF 39 F4 DD 26 4F A8 E7 54 60 B1 FD F5 0A B3 00>)
(   2,<2006-06-21 08:38:29.80 +100>,<MAYBRIDGE\nmr>,<NMR_250MHZ>,
      <Start of raw data processing
       ef LB = 0.3 FT_mod = 6 PKNL = 1 SI = 32K 
       data hash MD5: 32K
       7C 4A ED 18 5E BC CD C5 BC CE DB BC 47 AF CA 7D>)
(   3,<2006-06-21 08:38:34.41 +100>,<MAYBRIDGE\nmr>,<NMR_250MHZ>,
      <apk 
       data hash MD5: 32K
       8D 28 DA 15 71 F2 B4 37 73 7A B4 04 50 33 7E EB>)
(   4,<2006-06-21 08:38:36.10 +100>,<MAYBRIDGE\nmr>,<NMR_250MHZ>,
      <abs ABSG = 5 
       data hash MD5: 32K
       2D 86 46 63 D3 93 8B 29 A2 2B DE CE 3C FC 79 36>)
$$ ##END=
$$ 
$$ hash MD5
$$ 43 13 50 BD B3 08 C7 9B E9 41 9A 7A 66 CE 14 A3
##$RELAX= 
##$RELAX= 
##$RELAX= 
##$RELAX= 
##$RELAX= 
##$RELAX= 
##$RELAX= 
$$ Bruker specific parameters
$$ --------------------------
##$DU= <C:\u>
##$EXPNO= 1130
##$NAME= <ADRS>
##$PROCNO= 1
##$TYPE= <nmr>
##$USER= <dgb>
##$AMP= (0..31)
100 100 100 100 100 100 100 100 100 100 100 100 100 100 100 100 100 100 
100 100 100 100 100 100 100 100 100 100 100 100 100 100 
##$AQSEQ= 0
##$AQ_mod= 3
##$AUNM= <au_zg>
##$AUTOPOS= <3 >
##$BF1= 250.13
##$BF2= 250.13
##$BF3= 250.13
##$BF4= 250.13
##$BF5= 500.13
##$BF6= 500.13
##$BF7= 500.13
##$BF8= 500.13
##$BYTORDA= 1
##$CFDGTYP= 0
##$CFRGTYP= 5
##$CHEMSTR= <none>
##$CNST= (0..31)
1 1 145 1 1 1 1 1 1 1 1 1 1 1 1 1 1 1 1 1 1 1 1 1 1 1 1 1 1 1 1 1 
##$CPDPRG= <>
##$CPDPRG1= <>
##$CPDPRG2= <>
##$CPDPRG3= <>
##$CPDPRG4= <mlev>
##$CPDPRG5= <mlev>
##$CPDPRG6= <mlev>
##$CPDPRG7= <mlev>
##$CPDPRG8= <mlev>
##$CPDPRGB= <>
##$CPDPRGT= <>
##$D= (0..31)
0 1 0 0 0 0 0 0 0 0.06 0 0 0 0 0 0 0.0002 0 0 0 0 0 0 0 0 0 0 0 0 0 0 
0 
##$DATE= 1150875489
##$DBL= (0..7)
120 120 120 120 120 120 120 120 
##$DBP= (0..7)
150 150 150 150 150 150 150 150 
##$DBP07= 0
##$DBPNAM0= <>
##$DBPNAM1= <>
##$DBPNAM2= <>
##$DBPNAM3= <>
$$ [...]
##$SUBNAM6= <"">
##$SUBNAM7= <"">
##$SUBNAM8= <"">
##$SUBNAM9= <"">
##$SW= 20.6930455092707
##$SWIBOX= (0..15)
0 0 3 0 0 0 0 0 0 0 0 0 0 0 0 0 
##$SW_h= 5175.983436853
##$TD= 65536
##$TD0= 1
##$TE= 294.16
##$TE2= 300
##$TE3= 300
##$TEG= 300
##$TL= (0..7)
0 120 120 120 120 120 120 120 
##$TP= (0..7)
150 150 150 150 150 150 150 150 
##$TP07= 0
##$TPNAME0= <>
##$TPNAME1= <>
##$TPNAME2= <>
##$TPNAME3= <>
##$TPNAME4= <>
##$TPNAME5= <>
##$TPNAME6= <>
##$TPNAME7= <>
##$TPOAL= (0..7)
0.5 0.5 0.5 0.5 0.5 0.5 0.5 0.5 
##$TPOFFS= (0..7)
0 0 0 0 0 0 0 0 
##$TUNHIN= 0
##$TUNHOUT= 0
##$TUNXOUT= 0
##$USERA1= <user>
##$USERA2= <user>
##$USERA3= <user>
##$USERA4= <user>
##$USERA5= <user>
##$V9= 5
##$VALIST= <valist>
##$VCLIST= <CCCCCCCCCCCCCCC>
##$VD= 0
##$VDLIST= <DDDDDDDDDDDDDDD>
##$VPLIST= <PPPPPPPPPPPPPPP>
##$VTLIST= <TTTTTTTTTTTTTTT>
##$WBST= 1024
##$WBSW= 4
##$XGAIN= (0..3)
0 0 0 0 
##$XL= 0
##$YL= 0
##$YMAX_a= 504523
##$YMIN_a= -535234
##$ZGOPTNS= <>
##$ZL1= 120
##$ZL2= 120
##$ZL3= 120
##$ZL4= 120
##$ABSF1= 16.522
##$ABSF2= -4.171173
##$ABSG= 5
##$ABSL= 3
##$ALPHA= 0
##$AQORDER= 0
##$ASSFAC= 0
##$ASSFACI= 0
##$ASSFACX= 0
##$ASSWID= 0
##$AUNMP= <proc_1d>
##$AZFE= 0.1
##$AZFW= 0.1
##$BCFW= 0
##$BC_mod= 0
##$BYTORDP= 0
##$COROFFS= 0
##$CY= 12.5
##$DATMOD= 1
##$DC= 0
##$DFILT= <>
##$DTYPP= 0
##$F1P= 14.0000005364418
##$F2P= -0.99999901652339
##$FCOR= 0.5
##$FTSIZE= 32768
##$FT_mod= 6
##$GAMMA= 0
##$GB= 0
##$INTBC= 1
##$INTSCL= 1
##$ISEN= 128
##$LB= 0.3
##$LEV0= 0
##$LPBIN= 0
##$MAXI= 10000
##$MC2= 0
##$MEAN= 0
##$ME_mod= 0
##$MI= 0
##$NCOEF= 0
##$NC_proc= -4
##$NLEV= 6
##$NOISF1= 0
##$NOISF2= 0
##$NSP= 0
##$NTH_PI= 0
##$NZP= 0
##$OFFSET= 16.522
##$PC= 1
##$PHC0= 166.136
##$PHC1= 5.947692
##$PH_mod= 1
##$PKNL= yes
##$PPARMOD= 0
##$PSCAL= 4
##$PSIGN= 0
##$REVERSE= no
##$SF= 250.13
##$SI= 32768
##$SIGF1= 0
##$SIGF2= 0
##$SINO= 400
##$SIOLD= 32768
##$SREGLST= <1H.DMSO>
##$SSB= 0
##$STSI= 32768
##$STSR= 0
##$SW_p= 5175.98343685301
##$SYMM= 0
##$S_DEV= 0
##$TDeff= 65536
##$TDoff= 0
##$TI= <Analysis number 999999
Compound Code 99
Book Reference 9
Project Code 9>
##$TILT= no
##$TM1= 0
##$TM2= 0
##$TOPLEV= 0
##$USERP1= <user>
##$USERP2= <user>
##$USERP3= <user>
##$USERP4= <user>
##$USERP5= <user>
##$WDW= 1
##$XDIM= 32768
##$YMAX_p= 449220687
##$YMIN_p= -162038
$$ End of Bruker specific parameters
$$ ---------------------------------
##NTUPLES= NMR SPECTRUM
##VAR_NAME=  FREQUENCY,     SPECTRUM/REAL,   SPECTRUM/IMAG
##SYMBOL=    X,             R,               I
##VAR_TYPE=  INDEPENDENT,   DEPENDENT,       DEPENDENT
##VAR_FORM=  AFFN,          ASDF,            ASDF
##VAR_DIM=   32768,         32768,           32768
##UNITS=     HZ,            ARBITRARY UNITS, ARBITRARY UNITS
##FACTOR=    0.157963299565203, 1,           1
##FIRST=     4132.6476996994, 0,             0
##LAST=      -1043.33573715361, 0,           0
##MIN=       -1043.33573715361, -162038,     0
##MAX=       4132.6476996994, 449220687,     0
$$ Real data points
##PAGE= N=1
##DATA TABLE= (X++(R..R)), XYDATA
$$ [...]
$$ plain form
17549 -9620 -35044 -47045 -65158 -54062 -25204 17860 42213 35717 25099 36840 26365 -30246
17537 -30246 -75155 -80692 -39610 6554 27514 48447 25466 -18822 2858 27290 49938 44093
17525 44093 18980 10532 7445 13809 2804 -2260 2638 14281 44735 44865 -7509 -18273 -14347
17512 -14347 -5973 29776 87196 113941 95618 88070 40664 -2416 -33910 -33571 -15660 -9261 -46176
17499 -46176 -76640 -97045 -85411 -58421 -56660 -79415 -48968 -50708 -23547 31208 -9096 -21890
17487 -21890 -46252 -82614 -63849 -16225 3975 -18593 1483 -32168 -19698 -7457 484 -13152
17475 -13152 -26975 -42618 -37310 -55890 -38764 -38993 -9946 28202 13685 -40862 -67630 -82546
17463 -82546 -30408 -25066 -5046 -13454 -23769 -39803 -49608 -48764 -18382 -29226 -66617 -18141 -20842
$$ packed form
17549i620k5424j2001j8113J1096K8858M3064K4353o496j0618J1741j0475n6611
17537c0246m4909n537M1082M6164K0960K0933k2981m4288K1680K4432K2648n845
17525D4093k5113q448l087O364j1005n064M898J1643L0454J30n2374j0764L926
17512a4347Q374L5749N7420K6745j8323p548m7406m3080l1494L39J7911O399l6915
17499d6176l0464k0405J1634K6990J761k2755L0447j740K7161N4755m0304j2794
17487b1890k4362l6362J8765M7624K0200k2568K0076l3651J2470J2241P941j3636
17475a3152j3823j5643N308j8580J7126k29K9047L8148j4517n4547k6768j4916
17463h2546N2138N342K0020q408j0315j6034r805Q44L0382j0844l7391M8476k701
$$ plain form
17450 -20842 -33465 -8442 -665 -6711 -12800 -24123 -6763 -38537 -44906 -30487 -54183 -109214
17438 -109214 -111438 -88172 -68456 -28470 -41801 -47002 -25950 -7537 -11861 -21199 -40782 -56735
17426 -56735 -39861 -43538 -15238 5435 22111 -9473 -44985 -7215 -241 -29492 -29276 -55518
17414 -55518 -96711 -109367 -102197 -24835 2708 -51008 -54187 -53414 -50838 -15304 -22912 -13954 -6118
17401 -6118 1131 18359 8613 49080 45760 30426 13484 -11103 -24053 -25094 -15694 28775 35754
17388 35754 10066 19706 19356 12139 -14038 -31688 5169 25762 22505 56049 73551 46409 -7104
17375 -7104 -29209 19763 19782 -9510 17125 21924 64876 45259 31850 -924 -10623 4947 12043
17362 12043 1713 -3348 -35038 -60069 -5611 13264 -7992 -31453 -10641 7643 -7289 -6873
$$ packed form
17450b0842j2623K5023P777o046o089j1323J7360l1774o369J4419k3696n5031
17438a09214k224K3266J9716L9986j3331n201K1052J8413m324r338j9583j5953
17426e6735J6874l677K8300K0673J6676l1584l5512L7770O974k9251K16k6242
17414e5518m1193j2656P170P7362K7543n3716l179P73K576L5534p608Q958P836
17401f118P249J7228r746M0467l320j5334j6942k4587j2950j041R400M4469O979
17388C5754k5688R640l50p217k6177j7650L6857K0593l257L3544J7502k7142n3513
17375g104k2105M8972J9k9292K6635M799M2952j9617j3409l2774r699J5570P096
17362A2043j0330n061l1690k5031N4458J8875k1256k3461K0812J8284j4932M16
$$ plain form
17350 -6873 -4991 -16879 -23263 -15566 -30821 -18277 22988 5629 -34393 30914 52588 56136 86984
17337 86984 42720 2607 -13095 -1995 12715 17989 8824 26441 69392 62309 23002 11968
17325 11968 2156 20293 16270 31783 16258 9367 -17542 -19145 -43617 -67041 -37935 -42844 -50705
17312 -50705 -21201 -32517 -16652 -14347 1059 11679 22569 20696 37057 55377 79549 64617
17300 64617 18356 14644 7436 -1947 -13195 7438 45423 44754 91093 74306 43405 35759 19858
17287 19858 -14745 -51672 -39721 -17343 -21511 -12864 2051 -10170 -6814 -10579 -1010 18267 17098
17274 17098 -9574 -20434 -27674 -22033 -31981 -44166 -67960 -22335 33001 35941 52719 56614 18833
17261 18833 27293 18515 18609 15465 12942 57136 62016 3296 -21080 -32173 -4491 -3953 18180 -14997
$$ packed form
17350f873J882j1888o384P697j5255J2544M1265j7359m0022O5307K1674L548L0848
17337H6984m4264m0113j5702J1100J4710N274r165J7617M2951p083l9307j1034
17325A1968r812J8137m023J5513j5525o891k6909j603k4472k3424K9106m909p861
17312e0705K9504j1316J5865K305J5406J0620J0890j873J6361J8320K4172j4932
17300F4617m6261l712p208r383j1248K0633L7985o69M6339j6787l0901p646j5901
17287A9858l4603l6927J1951K2378m168Q647J4915j2221L356l765R569J9277j169
17274A7098k6672j0860p240N641r948j2185k3794M5625N5336K940J6778L895l7781
17261A8833Q460q778R4l144k523M4194M880n8720k4376j1093K7682N38K2133l3177
$$ plain form
17247 -14997 -70119 -60994 -30862 -48644 -42551 -24724 -12349 -12758 -37499 -49813 5518 157 -14639
17234 -14639 -3037 -17655 -16028 14838 43383 8217 23355 20900 6785 -27765 -42642 -37394
17222 -37394 -33463 16129 36081 45427 60616 27729 -7834 -11044 -22009 -33823 -52473 -64999
17210 -64999 -37948 -21926 -9805 27136 26359 37048 -1168 -3596 7772 -38600 -42211 -57882
17198 -57882 -63562 -61868 -55066 -49432 -67438 -116703 -65101 -36953 -37093 -50803 -55912 -65813 -59978
17185 -59978 -50225 -31938 -16043 6988 11745 -17549 -36977 8344 25107 -2037 -53901 -72892
17173 -72892 -86495 -53788 -22928 5153 -12043 -28720 -20565 7395 -19238 -8180 -187 -1564
17161 -1564 6622 -35784 -15368 -12058 81 31089 44498 42823 2074 -54 1718 -16737 -41447
$$ packed form
17247a4997n5122R125L0132j7782O093J7827J2375m09k4741j2314N5331n361j4796
17234a4639J1602j4618J627L0866K8545l5166J5138k455j4115l4550j4877N248
17222c7394L931M9592J9952R346J5189l2887l5563l210j0965j1814j8650j2526
17210f4999K7051J6022J2121L6941p77J0689l8216k428J1368m6372l611j5671
17198e7882n680J694O802N634j8006m9265N1602K8148j40j3710n109r901N835
17185e9978R753J8287J5895K3031M757k9294j9428M5321J6763k7144n1864j8991
17173g2892j3603L2707L0860K8081j7196j6677Q155K7960k6633J1058P993j377
17161a564Q186m2406K0416L310J2139L1008J3409j675m0749k128J772j8455k4710
$$ plain form
17148 -41447 -39495 -19251 -35714 -28943 -25339 -16720 18803 25704 35111 30159 51486 50605 50988 41410
17134 41410 33656 54410 36127 33901 27452 14036 34323 13187 -10862 -6075 19745 4443
17122 4443 17749 31870 73573 63320 49828 23264 22409 41586 80225 62732 -300 -58267
17110 -58267 -608 51751 59480 29997 -436 24962 43552 43610 16536 -15431 -14349 28132 28393
17097 28393 30954 37406 -17998 -58489 -46603 -26556 5023 3181 -26304 -52847 -57560 25684
17085 25684 40931 29800 1993 5266 47367 63789 38330 52882 27654 -31784 -49957 -39757
17073 -39757 -21807 -31221 -18154 -7665 -11361 -8981 -15556 -6464 -10967 -24193 -9208 4026 13614
17060 13614 -9783 -23085 39057 64097 55903 16588 -19194 -13763 -2477 -9151 17597 27795
$$ packed form
17148d1447J952K0244j6463O771L604Q619L5523O901R407m952K1327q81L83r578
17134D1410p754K0754j8283k226o449j3416K0287k1136k4049M787K5820j5302
17122D443J3306J4121M1703j0253j3492k6564q55J9177L8639j7493o3032n7967
17110e8267N7659N2359P729k9483l0433K5398J8590N8k7074l1967J082M2481K61
17097B8393K561O452n5404m0491J1886K0047L1579j842k9485k6543m713Q3244
17085B5684J5247j1131k7807L273M2101J6422k5459J4552k5228n9438j8173J0200
17073c9757J7950r414J3067J0489l696K380o575R092m503j3226J4985J3234R588
17060A3614k3397j3302O2142K5040q194l9315l5782N431J1286o674K6748J0198
$$ plain form
17048 27795 -20875 -36496 11837 46910 11314 7815 2250 26530 1542 2702 -17474 -11943
17036 -11943 -25832 -22437 -12634 14320 44012 32722 5924 -11482 -51140 -65167 -44856 -29702
17024 -29702 -3628 -20660 -35032 -42468 -36190 -39735 -35571 -8340 7522 12660 23167 24429 6400
17011 6400 1043 -5970 -15165 -18952 34426 54068 24128 28272 54822 39081 12952 3173 -862
16998 -862 42919 31726 -14514 12117 69639 73792 85672 91073 74027 94056 69036 53008
16986 53008 20872 -2458 36601 56101 71544 86421 59622 6183 13051 31443 55454 89370
16974 89370 106242 57496 41114 63292 73312 109338 92538 72483 81478 99948 72191 37831
16962 37831 30581 54822 84107 104711 60729 58876 60089 52352 12411 -6845 -5188 2745 35549
$$ packed form
17048B7795m8670j5621M8333L5073l5596l499n565K4280k4988J160k0176N531
17036a1943j3889L395R803K6954K9692j1290k6798j7406l9658j4027K0311J5154
17024b9702K6074j7032j4372p436O278l545M164K7231J5862N138J0507J262j8029
17011F400n357p013r195l787N3378J9642k9940M144K6550j5741k6129r779m035
16998h62M3781j1193m6240K6631N7522M153J1880N401j7046K0029k5020j6028
16986E3008l2136k3330L9059J9500J5443J4877k6799n3439O868J8392K4011L3916
16974H9370J6872m8746j6382K2178J0020L6026j6800k0055Q995J8470k7757l4360
16962C7831p250K4241K9285K0604m3982j853J213p737l9941j9256J657P933L2804
$$ plain form
16949 35549 58380 102136 92894 69935 58218 11310 -18324 15478 28726 27329 12530 4402
16937 4402 -14112 -1504 -6294 17387 39019 46939 25234 -13790 8345 3099 38698 66860
16925 66860 25626 10009 22753 25678 20331 72107 111977 99228 49372 16214 18825 16535
16913 16535 19646 5556 -39933 -34124 30868 25644 1638 36401 43804 6854 40976 55027
16901 55027 19585 2850 1729 34677 85964 75250 30008 23600 60951 75081 38797 47834
16889 47834 33884 -4354 15920 24029 44900 33892 64237 77269 73418 69604 71422 62825 67343
16876 67343 70108 91333 76644 112527 128758 104424 78566 111745 153312 214534 249772 223126
16864 223126 251526 239739 267523 347619 402190 414789 445890 477786 505797 536081 552830
$$ packed form
16949C5549K2831M3756r242k2959j1717m6908k9634L3802J3248j397j4799q128
16937D402j8514J2608m790K3681K1632P920k1705l9024K2135n246L5599K8162
16925F6860m1234j5617J2744K925n347N1776L9870j2749m9856l3158K611k290
16913A6535L111j4090m5489N809O4992n224k4006L4763P403l6950L4122J4051
16901E5027l5442j6735j121L2948N1287j0714m5242o408L7351J4130l6284R037
16889D7834j3950l8238K0274Q109K0871j1008L0345J3032l851l814J818q597M518
16876F7343K765K1225j4689L5883J6231k4334k5858L3179M1567O1222L5238k6646
16864B23126K8400j1787K7784Q0096N4571J2599L1101L1896K8011L0284J6749
$$ plain form
16853 552830 564879 561847 587849 571565 551389 524035 517851 494184 455832 427502 402810 339264
16841 339264 297704 273736 231015 210904 219554 209536 236122 237683 234897 231283 222918 195924
16829 195924 185861 194208 161972 126299 140134 163627 133923 160492 161268 167858 192707 217231
16817 217231 179353 172451 234416 248082 228682 260086 241317 254408 288067 331562 341049 325535
16805 325535 377427 447061 488974 558593 645629 699263 781405 841558 853606 919692 965310
16794 965310 984819 955297 904039 874924 851353 813071 763518 703413 660741 611470 541204
16783 541204 472343 424548 413003 379703 317961 265784 199196 164823 168091 169839 159936 145180
16771 145180 103212 117187 136190 156594 144507 158202 147566 122261 120875 148603 192965 189552
$$ packed form
16853E52830J2049l032K6002j6284k0176k7354o184k3667l8352k8330k4692o3546
16841C39264m1560k3968m2721k0111Q650j0018K6586J561k786l614q365k6994
16829A95924j0063Q347l2236l5673J3835K3493k9704K6569P76O590K4849K4524
16817B17231l7878o902O1965J3666j9400L1404j8769J3091L3659M3495R487j5514
16805C25535N1892O9634M1913O9619Q7036N3634Q2142O0153J2048O6086M5618
16794I65310J9509k9522n1258k9115k3571l8282m9553o0105m2672m9271p0266
16783E41204o8861m7795j1545l3300o1742n2177o6588l4373L268J748r903j4756
16771A45180m1968J3975J9003K0404j2087J3695j0636k5305j386K7728M4362l413
$$ plain form
16759 189552 219754 263649 262999 289032 304315 318911 304795 364061 440203 487614 507465 552188
16747 552188 585056 602361 612939 629110 640274 645296 636577 627158 600739 593098 545492 475424
16735 475424 435418 392699 380849 341390 295012 245443 222928 229374 223117 203604 177034 138206
16723 138206 116786 128912 162979 171129 150677 173763 180734 156605 164090 144142 140255 100788
16711 100788 83986 106413 115481 92922 108504 99356 119763 90877 78700 93638 121366 142476
16699 142476 155764 172845 160155 176183 150433 90191 54774 57152 57121 57256 39213 33547 41295
16686 41295 27698 -3511 36132 75305 70170 80041 97261 90351 64518 26753 11320 4816
16674 4816 43486 41764 27158 43255 56636 56927 42137 59789 98905 91448 50366 49417 48781
$$ packed form
16759A89552L0202M3895o50K6033J5283J4596j4116N9266P6142M7411J9851M4723
16747E52188L2868J7305J0578J6171J1164N022q719r419k6419p641m7606p0068
16735D75424m0006m2719j1850l9459m6378m9569k2515O446o257j9513k6570l8828
16723A38206k1420J2126L4067Q150k0452K3086O971k4129P485j9948l887l9467
16711A00788j6802K2427R068k2559J5582r148K0407k8886j2177J4938K7728K1110
16699A42476J3288J7081j2690J6028k5750o0242l5417K378l1J35j8043n666P748
16686D1295j3597l1209L9643L9173n135R871J7220o910k5833l7765j5433o504
16674D816L8670j722j4606J6097J3381K91j4790J7652L9116p457m1082r49o36
$$ plain form
16661 48781 94033 95192 71646 24641 772 44021 45305 26168 -5245 -3033 -3068 17745 75058
16648 75058 51689 32779 78883 87784 18885 -24124 6740 41393 57640 34662 24794 44617
16636 44617 33859 15831 -2774 -34652 -22086 -26646 -12317 43518 51334 28853 22865 -10790
16624 -10790 -26793 -24860 1551 -2698 -8191 18609 44920 90293 70338 30866 27198 54917
16612 54917 69377 80971 104372 123384 129065 127906 150552 151603 159018 233086 300673 304579 299311
16599 299311 329740 343265 356579 326565 298754 279538 281611 252728 250935 278261 214611 109189
16587 109189 101433 144862 116799 99285 103019 101043 116277 149731 132401 106229 54317 50908
16575 50908 34951 58263 31652 13855 27374 32300 40518 50386 67316 59919 50837 14868 -38929
$$ packed form
16661D8781M5252J159k3546m7005k3869M3249J284j9137l1413K212l5K0813N7313
16648G5058k3369j8910M6104Q901o8899m3009L0864L4653J6247k2978r868J9823
16636D4617j0758j8028j8605l1878J2566m560J4329N5835P816k2481n988l3655
16624a0790j6003J933K6411m249n493K6800K6311M5373j9955l9472l668K7719
16612E4917J4460J1594K3401J9012N681j159K2646J051P415P4068O7587L906n268
16599B99311L0429J3525J3314l0014k7811j9216K073k8883j793K7326o3650j05422
16587A09189p756M3429k8063j7514L734j976J5234L3454j7330k6172n1912l409
16575E0908j5957K3312k6611j7797J3519M926Q218R868J6930p397r082l5969n3797
$$ plain form
16562 -38929 -79500 -121488 -79805 -24831 -10260 -19477 -12677 4912 18252 35221 22384 29436
16550 29436 45538 34314 47439 41114 20083 -17686 -55638 -66187 -40725 -9509 -3193 30491
16538 30491 72309 66141 29186 -780 -35104 -41074 -24726 7729 60 -32969 -55251 -57076
16526 -57076 -43102 -43829 -41386 -35885 -24263 19584 37159 26362 29042 364 -1478 22604 35816
16513 35816 26670 38620 26751 37997 28833 12648 27066 43804 20463 -20931 -30648 -15175
16501 -15175 -23989 -3036 -1565 -5921 11848 50276 61021 53139 32612 16611 48906 66733
16489 66733 40582 -3964 -24104 -30864 33613 53922 41157 25517 67054 100750 108065 69259
16477 69259 44143 37576 6811 19915 15796 30429 60350 72806 62373 34053 24075 24829 6311
$$ packed form
16562c8929m0571m1988M1683N4974J4571r217O800J7589J3340J6969j2837P052
16550B9436J6102j1224J3125o325k1031l7769l7952j0549K5462L1216O316L3684
16538C0491M1818o168l6955k9966l4324n970J6348L2455p669l3029k2282j825
16526e7076J3974p27K443N501J1622M3847J7575j0797K680k8678j842K4082J3212
16513C5816r146J1950j1869J1246r164j6185J4418J6738k3341m1394r717J5473
16501a5175q814K0953J471m356J7769L8428J0745p882k0527j6001L2295J7827
16489F6733k6151m4546k0140o760O4477K0309j2765j5640M1537L3696P315l8806
16477F9259k5116o567l0765J3104m119J4633K9921J2456j0433k8320r978P54j8518
$$ plain form
16464 6311 18181 70166 61377 65563 76558 78095 89024 128327 144751 92545 51622 16085
16452 16085 -11029 3697 37749 68628 56283 16776 2460 29346 40908 58425 38750 3513
16440 3513 -16069 -7785 5250 14175 27136 13795 10281 -6048 -8196 -34356 -48187 -37958 2002
16427 2002 23727 -23214 -5849 4043 -5744 -20920 -525 26712 39203 13023 2735 11756
16415 11756 -1861 -40152 -40489 -38568 -48617 -77161 -60098 -60402 -50048 -39299 -10436 606 -3344
16402 -3344 -30503 -38408 -38523 -25379 -47139 -57780 -15803 -26376 -2611 -10854 -1323 -10762 -32228
16389 -32228 7941 16094 25484 51927 113938 113849 114798 115461 101734 85575 66469 63259 70635 75919
16375 75919 34052 47480 35248 8689 1871 -10115 -42549 -95822 -98593 -84638 -72301 -51679
$$ packed form
16464F311J1870N1985q789M186J0995J537J0929L9303J6424n2206m0923l5537
16452A6085k7114J4726L4052L0879j2345l9507j4316K6886J1562J7517j9675l5237
16440C513j9582Q284J3035Q925J2961j3341l514j6329k148k6160j3831J0229L9960
16427B002K1725m6941J7365R892r787j5176K0395K7237J2491k6180j0288R021
16415A1756j3617l8291l37J921j0049k8544J7063l04J0354J0749K8863J1042l950
16402c344k7159p905j15J3144k1760j0641M1977j0573K3765q243R531r439k1466
16389c2228M0169Q153R390K6443O2011q9R49O63j3727j6159j9106l210P376N284
16375G5919m1867J3428j2232k6559o818j1986l2434n3273k771J3955J2337K0622
$$ plain form
16363 -51679 -64634 -91368 -81334 -42648 -38012 -54919 -65549 -62291 -56412 -26323 -12911 -39771
16351 -39771 -72559 -60500 -21580 -13974 -60464 -42736 -39963 -81783 -53183 -11918 33394 51565
16339 51565 52264 49854 9635 -7753 41653 78128 130416 131147 113612 114921 130614 135436 123039
16326 123039 119230 119960 96388 94495 49296 39914 73762 96941 128531 180385 228173 204638
16314 204638 111796 115420 143063 168744 182001 151669 93628 72825 53803 37021 95735 124402
16302 124402 100552 97781 103337 85439 69152 74591 98568 99020 137744 105819 53035 15847
16290 15847 54288 85123 79747 82205 97936 99122 85782 80370 88089 75683 33356 5116 -32594
16277 -32594 5244 5046 35994 62642 32692 39959 57217 73860 94375 101868 144151 160586
$$ packed form
16363e1679j2955k6734J0034L8686M636j6907j0630L258N879L0089J3412k6860
16351c9771l2788J2059L8920P606m6490J7728K773m1820K8600M1265M5312J8171
16339E1565O99k410m0219j7388M9406L6475N2288P31j7535J309J5693M822j2397
16326A23039l809P30k3572j893m5199r382L3848K3179L1590N1854M7788k3535
16314B04638r2842L624K7643K5681J3257l0332n8041k0803j9022j6782N8714K8667
16302A24402k3850k771N556j7898j6287N439K3977M52L8724l1925n2784l7188
16290A5847L8441L0835n376K458J5731J186j3340n412P719j2406m2327k8240l7710
16277c2594L7838j98L0948K6648k9950P267J7258J6643K0515P493M2283J6435
$$ plain form
16265 160586 157479 153020 134321 165256 197973 169068 165383 147644 142186 119444 131047 149072
16253 149072 155962 171048 176340 212192 229891 251967 291926 309899 337539 297245 324972 375153
16241 375153 399976 483392 578068 662727 770464 894541 1023807 1201993 1421120 1635340
16231 1635340 1872794 2165730 2486744 2846437 3253338 3710280 4272690 4928915 5721618
16222 5721618 6728088 8071396 9903833 12317344 15416866 19205501 23500058 28319513
16214 28319513 33956269 41026553 50107904 60896678 71170756 78267247 82878411 87390184
16206 87390184 93397546 101707506 110552574 113851786 108390505 100145966 94318101 91305259
16198 91305259 90038042 87255372 78667219 66388634 55929675 48530117 43063538 38355023
$$ packed form
16265A60586l107m459j8699L0935L2717k8905l685j7739n458k2742J1603J8025
16253A49072O890J5086N292L5852J7699K2076L9959J7973K7640m0294K7727N0181
16241C75153K4823Q3416R4676Q4659J07737J24077J29266J78186K19127K14220
16231A635340K37454K92936L21014L59693M06901M56942N62410O56225P92703
16222E721618J006470J343308J832437K413511L099522L788635M294557M819455
16214B8319513N636756P070284R081351J0788774J0274078P096491M611164M511773
16206H7390184O007362Q309960Q845068L299212n461281q244539n827865l012842
16198I1305259j267217k782670q588153j2278585j0458959p399558n466579m708515
$$ plain form
16190 38355023 33774207 29376368 25552842 22579838 20322075 18552383 17080899 15824524
16182 15824524 14765131 13916098 13205495 12557364 11933675 11308677 10659279 10113759 9663330
16173 9663330 9250767 8888058 8498949 8060561 7705575 7364764 7047405 6739197 6472082
16164 6472082 6234998 6022262 5814510 5614427 5415170 5267425 5080296 4881187 4738445
16155 4738445 4613018 4492454 4355896 4215148 4082771 3948043 3846887 3713332 3583408
16146 3583408 3456047 3363203 3270352 3188187 3115212 3019313 2945281 2898930 2837937 2751708 2667476
16135 2667476 2581869 2499979 2437573 2389795 2303372 2259918 2222442 2141072 2097268 2045475 2004482
16124 2004482 1962644 1885302 1807579 1754244 1710206 1663987 1620334 1620715 1605142 1542747 1462803 1443400
$$ packed form
16190C8355023m580816m397839l823526k973004k257763j769692j471484j256375
16182A5824524j059393q49033p10603o48131o23689o24998o49398n45520m50429
16173I663330m12563l62709l89109m38388l54986l40811l17359l08208k67115
16164F472082k37084k12736k07752k00083j99257j47745j87129j99109j42742
16155D738445j25427j20564j36558j40748j32377j34728j01156j33555j29924
16146C583408j27361r2844r2851q2165p2975r5899p4032m6351o0993q6229q4232
16135B667476q5607q1890o2406m7778q6423m3454l7476q1370m3804n1793m0993
16124B004482m1838p7342p7723n3335m4038m6219m3653L81j5573o2395p9944j9403
$$ plain form
16112 1443400 1427649 1386299 1400909 1402412 1329303 1264546 1255812 1235533 1209462 1174682 1153368 1160994
16100 1160994 1137553 1136007 1115957 1087889 1075038 1042953 992730 969648 982658 969158 980980
16089 980980 988442 1006921 988839 948177 943521 914627 891006 912600 942510 977242 999867 955258
16077 955258 922979 942940 947794 966767 947181 886913 869632 846956 819484 834978 818827 792743
16065 792743 768416 766325 768046 764362 726666 669680 649686 622147 603080 583573 579326 562751
16053 562751 570015 579982 612968 612543 613436 587058 550207 565190 585961 574109 557639 542545 500260
16040 500260 494218 485801 453283 471007 473479 477446 467987 477940 475184 460740 430561 431334 429057
16027 429057 434486 462887 489907 456071 409843 419446 369721 371730 429993 454216 409256 356682
$$ packed form
16112A443400j5751m1350J4610J503p3109o4757q734k0279k6071l4780k1314P626
16100A160994k3441j546k0050k8068j2851l2085n0223k3082J3010j3500J1822
16089I80980P462J8479j8082m0662m656k8894k3621K1594K9910L4732K2625m4609
16077I55258l2279J9961M854J8973j9586o0268j7281k2676k7472J5494j6151k6084
16065G92743k4327k091J721l684l7696n6986j9994k7539j9067j9507m247j6575
16053E62751P264R967L2986m25Q93k6378l6851J4983K0771j1852j6470j5094m2285
16040E00260o042q417l2518J7724K472L967r459R953k756j4444l0179P73k277
16027D29057N429K8401K7020l3836m6228R603m9725K009N8263K4223m4960n2574
$$ plain form
16015 356682 356240 368828 371820 367380 363808 341081 339687 361869 363629 396459 417861 424192 377415
16002 377415 382895 383886 370893 366402 365877 355834 351376 317854 273671 237939 273162 328892 343708
15989 343708 350797 361864 323007 278042 234673 252885 288240 312852 317501 298011 260644 225531
15977 225531 237705 295037 316570 305428 278362 288379 339719 346993 325072 315903 298864 266269
15965 266269 234015 244396 283771 293058 293384 306990 328296 301860 237339 241861 232353 210180
15953 210180 217538 230505 296848 268354 222803 184819 166499 205906 215403 227594 260392 311095
15941 311095 337572 311148 283871 254625 232692 236545 212723 211463 241698 251985 225019 187390
15929 187390 174871 167444 198752 229264 224476 235042 235592 236554 211442 197201 182840 194957 252712
$$ packed form
16015C56682m42J2588K992m440l572k2727j394K2182J760L2830K1402O331m6777
16002C77415N480R91j2993m491n25j0043m458l3522m4183l5732L5223N5730J4816
15989C43708P089J1067l8857m4965m3369J8212L5355K4612M649j9490l7367l5113
15977B25531J2174N7332K1533j1142k7066J0017N1340P274k1921r169j7039l2595
15965B66269l2254J0381L9375R287L26J3606K1306k6436o4521M522r508k2173
15953B10180P358J2967O6343k8494m5551l7984j8320L9407R497J2191L2798N0703
15941C11095K6477k6424k7277k9246k1933L853k3822j260L0235J0287k6966l7629
15929A87390j2519p427L1308L0512m788J0566N50R62k5112j4241j4361J2117N7755
$$ plain form
15916 252712 275096 265701 215307 189755 218209 196549 167316 160280 165713 186354 208770 214636
15904 214636 198669 205175 185739 190605 191382 186473 185056 152236 148436 166788 186158 198003 212916
15891 212916 172656 162114 166654 163705 193131 167271 91047 82446 117119 130517 130791 134363 143139
15878 143139 118336 110031 123653 150318 146189 139065 114389 120242 157133 178626 169390 133782
15866 133782 104142 114103 152406 169511 178025 134278 126545 149330 167593 175447 165891 148882
15854 148882 145886 142508 147620 138235 157202 185673 168714 128276 131345 140130 137034 170669 166238
15841 166238 130301 130275 156580 188616 197929 220393 232514 207421 182200 161222 135809 100413
15829 100413 108150 110574 130149 142310 167384 214899 199304 182016 139096 111053 145804 190785
$$ packed form
15916B52712K2384r395n0394k5552K8454k1660k9233p036N433K0641K2416N866
15904B14636j5967O506j9436M866P77m909j417l2820l800J8352J9370J1845J4913
15891B12916m0260j0542M540k949K9426k5860p6224q601L4673J3398K74L572Q776
15878A43139k4803q305J3622K6665m129p124k4676N853L6891K1493r236l5608
15866A33782k9640R961L8303J7105Q514m3747p733K2785J8263P854r556j7009
15854A48882k996l378N112r385J8967K8471j6959m0438L069Q785l096L3635m431
15841A66238l5937k6K6305L2036R313K2464J2121k5093k5221k0978k5413l5396
15829A00413P737K424J9575J2161K5074M7515j5595j7288m2920k8043L4751M4981
$$ plain form
15817 190785 184425 159016 136042 138120 168954 160558 128846 150688 163508 153110 154841 140781
15805 140781 152526 138986 139049 121053 108130 110654 143344 145375 131955 133153 119258 152405 175365
15792 175365 181433 162430 169445 156792 115489 126810 161429 167624 143468 127292 137944 148586
15780 148586 132840 98968 43462 40235 73929 108530 124913 102369 120338 120432 174799 161095
15768 161095 102870 66838 67535 77172 68062 110234 150786 175862 169194 163399 146706 138706 98559
15755 98559 74452 74942 93313 120886 150825 166501 168517 141419 124498 123104 81535 70970
15743 70970 101053 101351 56888 38725 89897 145910 147766 133241 139702 144324 152874 114978 71222
15730 71222 68703 67557 95138 137492 146595 125411 105236 123401 111172 99983 102276 103260 84537
$$ packed form
15817A90785o360k5409k2974K078L0834q396l1712K1842J2820j0398J731j4060
15805A40781J1745j3540O3j7996j2923K524L2690K031j3420J198j3895L3147K2960
15792A75365O068j9003P015j2653m1303J1321L4619O195k4156j6176J0652J0642
15780A48586j5746l3872n5506l227L3694L4601J6383k2544J7969R4N4367j3704
15768A61095n8225l6032O97R637r110M2172M0552K5076o668n795j6693q000m0147
15755I8559k4107M90J8371K7573K9939J5676K016k7098j6921j394m1569j0565
15743G0970L0083K98m4463j8163N1172N6013J856j4525O461M622Q550l7896m3756
15730G1222k519j146K7581M2354R103k1184k0175J8165j2229j1189K293R84j8723
$$ plain form
15717 84537 82814 113535 118272 126948 132628 125339 154127 163871 118040 98190 107547 123734 146522
15704 146522 152388 144000 122464 125648 144351 112558 104213 101832 87586 102614 126476 142415
15692 142415 152434 154240 192638 172930 163146 181785 165968 142462 128671 128071 138334 139076 122178
15679 122178 102091 112078 87131 69691 94828 101223 108372 109597 149210 187842 214385 269280
15667 269280 365307 423459 425605 443662 534628 600361 594270 610924 630368 646404 687162 693057
15655 693057 600547 546911 538061 510046 494829 478509 458998 394824 337533 320905 329332 332766
15643 332766 306427 253998 274774 234230 170112 177440 206659 215041 205820 210623 200768 135969
15631 135969 127912 144801 104958 118152 111849 125044 109126 104113 114474 114247 91213 82931 72841
$$ packed form
15717H4537j723L0721M737Q676N680p289K8788R744m5831j9850R357J6187K2788
15704A46522N866q388k1536L184J8703l1793q345k381j4246J5028K3862J5939
15692A42415J0019J806L8398j9708r784J8639j5817k3506j3791o00J0263P42j6898
15679A22178k0087R987k4947j7440K5137O395P149J225L9613L8632K6543N4895
15667B69280R6027N8152K146J8057R0966O5733o091J6654J9444J6036M0758N895
15655F93057r2510n3636q850k8015j5217j6320j9511o4174n7291j6628Q427L434
15643C32766k6339n2429K0776m0544o4118P328K9219Q382r221M803r855o4799
15631A35969q057J6889l9843J3194o303J3195j5918n013J0361k27k3034q282j0090
$$ plain form
15618 72841 66148 63997 54808 70626 108454 134348 167382 147471 98017 110117 172844 203781
15606 203781 161743 92946 32677 59021 110157 144950 135355 106562 91014 83470 55502 92022
15594 92022 121440 159575 143123 132431 132362 122566 98581 72192 111790 145319 164194 143194
15582 143194 121323 128861 139957 147656 146513 136596 165234 161013 139371 161786 153121 142619 111867
15569 111867 120905 148004 121616 124201 118099 112427 129856 137050 138453 137730 134844 75721 99823
15556 99823 112762 130814 116694 91248 97362 94592 75358 81771 86983 94869 96700 82480 60318
15543 60318 80107 96006 126476 164676 154872 138506 170838 176012 175472 147999 123467 75719
15531 75719 19562 42662 59910 81202 123694 122097 161799 148850 153761 151931 133631 114582
$$ packed form
15618G2841o693k151r189J5818L7828K5894L3034j9911m9454J2100O2727L0937
15606B03781m2038o8797o0269K6344N1136L4793r595k8793j5548p544k7968L6520
15594I2022K9418L8135j6452j0692o9r796k3985k6389L9598L3529J8875k1000
15582A43194k1871P538J1096P699j143r917K8638m221k1642K2415q665j0502l0752
15569A11867R038K7099k6388K585o102n672J7429P194J403p23k886n9123K4102
15556I9823J2939J8052j4120k5446O114k770j9234O413N212P886J831j4220k2162
15543F0318J9789J5899L0470L8200r804j6366L2332N174n40k7473k4532m7748
15531G5719n6157K3100J7248K1292M2492j597L9702j2949M911j830j8300j9049
$$ plain form
15519 114582 88317 89656 86009 79063 95791 83358 62816 56078 120217 131351 117012 131774
15507 131774 108739 61092 95068 103466 101525 87685 144747 145510 120645 115367 123236 117972 79286
15494 79286 46577 49543 66274 71204 77383 84506 72722 53710 56472 56415 60008 73635 60726
15481 60726 30128 -1204 7982 30136 72941 83738 81042 55913 73051 92517 118912 108240
15469 108240 115966 129228 124279 163860 170935 168794 162351 170224 171931 150683 135222 123907 98820
15456 98820 52355 58662 82316 98826 79415 75713 54553 10167 -721 28656 56956 82968
15444 82968 111445 136322 128989 133699 128431 130850 144087 158013 107383 85380 97743 149891
15432 149891 142798 117950 86266 80395 77352 95646 122895 110704 91204 91538 126384 139035
$$ packed form
15519A14582k6265J339l647o946J6728j2433k0542o738O4139J1134j4339J4762
15507A31774k3035m7647L3976Q398j941j3840N7062P63k4865n278P869n264l8686
15494G9286l2709K966J6731M930O179P123j1784j9012K762n7L593J3627j2909
15481F0726l0598l1332R186K2154M2805J0797k696k5129J7138J9466K6395j0672
15469A08240P726J3262m949L9581P075k141o443P873J707k1248j5461j1315k5087
15456I8820m6465O307K3654J6510j9411l702k1160m4386j0888K9377K8300K6012
15444H2968K8477K4877p333M710n268K419J3237J3926n0630k2003J2363N2148
15432A49891p093k4848l1684n871l043J8294K7249j2191j9500L34L4846J2651
$$ plain form
15420 139035 123120 108260 95127 89453 136380 100076 96265 96659 99258 103163 82766 94630 109200
15407 109200 118199 112709 134916 189288 199228 146940 76657 77234 81051 81196 121594 162641 190689
15394 190689 210254 182553 170737 96164 96370 134777 132759 100551 91079 67957 106772 134742
15382 134742 119959 117690 125782 119980 99298 80823 48720 -6091 -27577 4008 18226 -11559
15370 -11559 -27323 8719 32709 23580 14052 71206 77786 87629 104572 80581 80962 98300 98055
15357 98055 75576 54318 2155 -10273 17442 66841 42724 47451 24369 5715 20077 33102
15345 33102 28201 -18854 -14149 13968 38427 51341 56442 61499 42251 28586 31744 31530 17616
15332 17616 54288 107839 104400 87940 89473 41672 26166 16588 43010 38428 17224 8269 14387
$$ packed form
15420A39035j5915j4860j3133n674M6927l6304l811L94K599L905k0397J1864J4570
15407A09200Q999n490K2207N4372R940n2288p0283N77L817J45M0398M1047K8048
15394A90689J9565k7701j1816p4573K06L8407k018l2208r472k3122L8815K7970
15382A34742j4783k269Q092n802k0682j8475l2103n4811k1486L1585J4218k9785
15370a1559j5764L6042K3990r129r528N7154O580R843J6943k3991L81J7338k45
15357I8055k2479k1258n2163j2428K7715M9399k4117M727k3082j8654J4362J3025
15345C3102m901m7055M705K8117K4459J2914N101N057j9248j3665L158k14j3914
15332A7616L6672N3551l439j6460J533m7801j5506r578K6422m582k1204q955O118
$$ plain form
15319 14387 17249 28918 49183 43420 61040 91355 103546 86222 101530 86585 85564 62753
15307 62753 48076 38324 27238 35374 84228 106373 69469 39334 38801 80923 88771 37594 40510
15294 40510 50625 39453 87313 91424 9275 2724 -9008 -17654 -47985 -36049 -27226 -18797 -34401
15281 -34401 -46829 -58270 -34898 -16345 5327 -22794 -10060 40257 44309 25563 -10830 -28478
15269 -28478 -9661 16447 12142 18509 36783 22225 3411 -21261 -29498 -74238 -127635 -104281
15257 -104281 4710 51689 65896 38893 35442 46283 42951 49842 23657 21581 27002 15643
15245 15643 23001 64630 55777 60607 72562 58772 49902 38810 79982 96792 77769 101965
15233 101965 117082 86357 93721 79841 39085 18625 5622 -14675 -34587 -22955 37650 62413
$$ packed form
15319A4387K862J1669K0265n763J7620L0315J2191j7324J5308j4945j021k2811
15307F2753j4677r752j1086Q136M8854K2145l6904l0135n33M2122P848n1177K916
15294D0510J0115j1172M7860M111q2149o551j1732q646l0331J1936Q823Q429j5604
15281c4401j2428j1441K3372J8553K1672k8121J2734N0317M052j8746l6393j7648
15269b8478J8817K6108m305O367J8274j4558j8814k4672q237m4740n3397K3354
15257a04281J08991M6979J4207k7003l451J0841l332O891k6185k076N421j1359
15245A5643P358M1629q853M830J1955j3790q870j1092M1172J6810j9023K4196
15233A01965J5117l0725P364j3880m0756k0460j3003k0297j9912J1632O0605K4763
$$ plain form
15221 62413 95320 71632 57524 35336 12930 27630 5340 7172 18181 37005 16339 1429
15209 1429 5954 51665 44569 53257 60397 42435 43836 42841 46651 67330 35453 -3021 -26540
15196 -26540 -33023 -8448 -2408 -6956 -3611 3878 -4999 -816 47019 92304 106001 72820 54613
15183 54613 11524 -14498 -45567 -17852 -288 -1221 8396 -37584 -47754 -50448 -8435 14491
15171 14491 5084 40449 58848 29165 22623 55886 57109 14834 -5717 -35831 -35669 -18777 -18238
15158 -18238 -2523 -11680 8874 9890 17272 3774 15249 7890 17086 34834 47914 19261 19555
15145 19555 9652 8607 13544 26044 52888 39598 -838 -14311 -5239 -6005 -20467 -34252 -35583
15132 -35583 -31309 -43806 -17643 9471 21425 17773 10323 6703 11620 -18167 -26833 -30106 -24313
$$ packed form
15221F2413L2907k3688j4108k2188k2406J4700k2290J832J1009J8824k0666j4910
15209A429M525M5711p096Q688P140j7962J401r95L810K0679l1877l8474k3519
15196b6540o483K4575O040m548L345P489q877M183M7835M5285J3697l3181j8207
15183E4613m3089k6022l1069K7715J7564r33R617m5980j0170k694M2013K2926
15171A4491r407L5365J8399k9683o542L3263J223m2275k0551l0114J62J6892N39
15158a8238J5715r157K0554J016P382j3498J1475p359R196J7748J3080k8653K94
15145A9555r903j045M937J2500K6844j3290m0436j3473R072p66j4462j3785j331
15132c5583M274j2497K6163K7114J1954l652p450l620M917k9787q666l273N793
$$ plain form
15119 -24313 1942 -2733 -19830 23708 32638 29215 20925 28769 12281 -5644 -19805 -20756 -55658
15106 -55658 -44490 -20547 17606 38685 -6962 -39361 861 3360 11472 3499 7387 -3192
15094 -3192 -4667 -25459 -14716 1710 -26012 -36686 -34753 -27853 -14587 3597 -686 -29331 -21882
15081 -21882 -1231 -4548 -282 -6716 -15598 6766 -9439 -22971 -36247 -51014 -23119 -10920
15069 -10920 -23560 -26533 13929 -24070 -23190 -21107 -4083 -4457 -40177 -54574 -15804 9849 9010
15056 9010 21453 9227 -34621 -53530 -91439 -54167 -17689 7024 -17267 -60525 -53662 -24485
15044 -24485 -10176 -32051 -16671 2198 -5395 -29901 -10966 -1898 -493 3078 7998 -49236 -47110
15031 -47110 -45303 -47425 -31748 -21047 -32845 -24197 24101 72945 19964 -21845 -16831 -19114 -20182
$$ packed form
15119b4313K6255m675j7097M3538Q930l423q290P844j6488j7925j4161r51l4902
15106e5658J1168K3943L8153K1079m5647l2399M0222K499Q112p973L888j0579
15094c192j475k0792J0743J6426k7722j0674J933O900J3266J8184m283k8645P449
15081b1882K0651l317M266o434q882K2364j6205j3532j3276j4767K7895J2199
15069a0920j2640k973M0462l7999Q80K083J7024l74l5720j4397L8770K5653q39
15056I010J2443j2226m3848j8909l7909L7272L6478K4713k4291m3258O863K9177
15044b4485J4309k1875J5380J8869p593k4506J8935R068J405L571M920n7234K126
15031d7110J807k122J5677J0701j1798Q648M8298M8844n2981m1809N014k283j068
$$ plain form
15018 -20182 -45389 -28980 -5144 11729 7017 21855 49400 18394 -19000 -55693 -65559 -63346
15006 -63346 -32640 3128 3913 -10408 10873 33045 46069 61768 55069 46861 56650 19864 6035
14993 6035 1655 -42232 -60444 -40967 -38129 -33457 -14326 -5206 7346 26522 24603 63226 67238
14980 67238 14449 -11407 -21730 -39282 -52223 -34106 -9599 2478 15431 26668 25386 10347
14968 10347 2983 5058 7723 5661 -51304 -59739 -50649 -34156 -13135 8315 9888 12947 6190
14955 6190 40551 30705 18311 -8579 -17875 -19496 -13838 -6425 -8250 -19862 -8187 14457 10514
14942 10514 43086 59171 42405 7899 -9221 -25985 -55560 -60854 -7481 42150 33966 20249
14930 20249 2082 -25372 -42712 -34740 -16093 -23776 -991 -11349 -48593 -47392 15248 1221
$$ packed form
15018b0182k5207J6409K3836J6873m712J4838K7545l1006l7394l6693r866K213
15006f3346L0706L5768P85j4321K1281K2172J3024J5699o699q208R789l6786j3829
14993F035m380m3887j8212J9477K838M672J9131R120J2552J9176j919L8623M012
14980F7238n2789k5856j0323j7552j2941J8117K4507J2077J2953J1237j282j5039
14968A0347p364K075K665k062n6965q435R090J6493K1021K1450J573L059o757
14955F190L4361r846j2394k6890r296j621N658P413j825j1612J1675K2644l943
14942A0514L2572J6085j6766l4506j7120j6764k9575n294N3373M9631q184j3717
14930B0249j8167k7454j7340P972J8647p683K2785j0358l7244J201O2640j4027
$$ plain form
14918 1221 -12281 -21328 -63008 -46970 -21541 -24305 -2714 -19265 -36724 -41855 -56062 -38189
14906 -38189 24553 38095 28573 -20353 -32065 -55909 -63962 -34242 -40387 -63407 -65461 -40499
14894 -40499 -56192 -25883 -27066 -38666 -32968 -20919 -37876 -25578 -16547 -15116 -8866 -21669 -19162
14881 -19162 4507 -3031 -1760 -16483 -8715 -10344 -3999 -2042 3788 13740 25576 34623 31828 18263
14867 18263 11990 24781 44248 12749 -25666 -27099 -19246 7309 -7626 -34401 -54866 -77032
14855 -77032 -47680 -83508 -78143 -42870 -13213 15195 11732 -6562 -23487 -40698 -17451 -3266
14843 -3266 -17242 -13007 -13933 -46487 -17188 33813 3496 17690 2830 -8598 2023 -30727
14831 -30727 -16032 -4882 -5873 26436 284 -40419 -30353 6769 -11824 -34339 -23229 28083
$$ packed form
14918A221j3502r047m1680J6038K5429k764K1591j6551j7459n131j4207J7873
14906c8189O2742J3542r522m8926j1712k3844q053K9720o145k3020k054K4962
14894d0499j5693L0309j183j1600N698J2049j6957J2298R031J431O250j2803K507
14881a9162K3669p538J271j4723P768j629O345J957N830R952J1836R047k795j3565
14867A8263o273J2791J9467l1499l8415j433P853K6555j4935k6775k0465k2166
14855g7032K9352l5828N365L5273K9657K8408l463j8294j6925j7211K3247J4185
14843c266j3976M235r26l2554K9299N1001l0317J4194j4860j1428J0621l2750
14831c0727J4695J1150r91L2309k6152m0703J0066L7122j8593k2515J1110N1312
$$ plain form
14819 28083 8931 -36867 -49629 -27909 -40974 -54605 -42328 -20675 2153 25531 41162 36067
14807 36067 -4243 20603 57779 34066 28687 729 -31241 -75192 -77469 -77478 -59044 -62408 -71095
14794 -71095 -22030 -381 27405 26989 -5329 16976 3565 -17152 -21167 -19924 -31962 4899
14782 4899 1837 -2929 23099 21660 5937 -46856 -29892 -34360 -21467 26961 57311 83102 73349
14769 73349 16982 -422 46729 46539 41460 15954 -24660 -23717 -640 8352 1881 -10544 -36049
14756 -36049 -34804 -42312 -89587 -98707 -73279 -28713 -9886 -28674 -8344 6963 -17027 -23966
14744 -23966 -21479 -14162 28633 21213 5444 -15540 -9779 -117 42930 64337 79264 53310 49820
14731 49820 53065 57067 54071 32956 44027 47753 72606 112627 140238 148026 152687 97079 42096
$$ packed form
14819B8083j9152m5798j2762K1720j3065j3631J2277K1653K2828K3378J5631n095
14807C6067m0310K4846L7176k3713n379k7958l1970m3951k277rJ8434l364q687
14794g1095M9065K1649K7786m16l2318K2305j3411k0717m015J243j2038L6861
14782D899l062m766K6028j439j5723n2793J6964m468J2893M8428L0350K5791r753
14769G3349n6367j7404M7151j90n079k5506m0614R43K3077Q992o471j2425k5505
14756c6049J245p508m7275r120K5428M4566J8827j8788K0330J5307k3990o939
14744b3966K487P317M2795p420j5769k0984N761R662M3047K1407J4927k5954l490
14731D9820L245M002k996k1115J1071L726K4853M0021K7611P788M661n5608n4983
$$ plain form
14718 42096 23371 33347 30408 42278 60788 87033 26574 7328 35609 57869 59690 49590
14706 49590 59229 87880 83586 77891 19908 -27804 -9204 -11983 -44206 -38090 -46797 -21266 -16434
14693 -16434 6380 638 31829 33380 -27280 -33090 -20211 -26362 13716 61411 16695 -30052
14681 -30052 -15630 -9389 -35768 -38119 -20443 -30207 -36434 -25543 -49405 -110150 -119596 -94294 -68592
14668 -68592 -60325 -48083 -35705 -39140 -44097 -47585 -44052 -28923 -31329 -57752 -64165 -61520 -51925
14655 -51925 -41812 -49353 -22236 3616 29813 48969 63769 68806 55631 117898 115082 87667
14643 87667 102627 73801 86671 111396 56487 -15690 -11148 -3428 -22590 -15295 -26399 4857
14631 4857 47362 64710 55606 63104 39658 36549 56107 55813 27120 32816 5007 -8406 -24221
$$ packed form
14718D2096j8725R976k939J1870J8510K6245o0459j9246K8281K2260J821j0100
14706D9590R639K8651m294n695n7983m7712J8600k779l2223O116q707K5531M832
14693a6434K2814n742L1191J551o0660n810J2879o151M0078M7695m4716m6747
14681c0052J4422O241k6379k351J7676r764o227J0891k3862o0745r446K5302K5702
14668f8592Q267J2242J2378l435m957l488L533J5129k406k6423o413K645R595
14655e1925J0113p541K7117K5852K6197J9156J4800N037j3175O2267k816k7415
14643H7667J4960k8826J2870K4725n4909p2177M542P720j9162P295j1104L1256
14631D857M2505J7348r104P498k3446l109J9558k94k8693N696k7809j3413j5815
$$ plain form
14618 -24221 -35787 -64875 -82081 -53077 -34339 18653 -2405 -33582 -40372 -34201 -36085 -31711
14606 -31711 -31896 -17139 -19517 -22034 -33370 -38621 -46257 -42031 -75250 -69050 -36445 -10913 -39248
14593 -39248 -27282 -14543 3654 37098 46762 13906 -24016 -7363 6799 -6762 11783 -6487
14581 -6487 -20929 -25548 38 -6117 -14313 -35176 -13972 -24404 -50058 -65420 -32546 -33508 -24617
14568 -24617 -18611 -5621 -31039 -89841 -86079 -43192 -30867 13869 5090 -11155 -33256 -27724
14556 -27724 -34702 -17140 -22186 -7387 -801 -16399 -30798 -30883 -43008 -70729 -96872 -120793 -162038
14543 -162038 -137109 -87001 -28083 -32200 -37840 -47281 -22472 25855 43350 15737 11011 -2131
14531 -2131 -12182 -23712 -9101 -38377 -23133 9465 8794 15370 -317 -37466 -8961 6810
$$ packed form
14618b4221j1566k9088j7206K9004J8738N2992k1058l1177o790O171j884M374
14606c1711j85J4757k378k517j1336n251p636M226l3219O200L2605K5532k8335
14593c9248J1966J2739J8197L3444R664l2856l7922J6653J4162j3561J8545j8270
14581f487j4442m619K5586o155q196k0863K1204j0432k5654j5362L2874r62Q891
14568b4617O006J2990k5418n8802L762M2887J2325M4736q779j6245k2101N532
14556b7724o978J7562n046J4799O586j5598j4399q5j2125k7721k6143k3921m1245
14543a62038K4929N0108N8918m117n640r441K4809M8327J7495k7613m726j3142
14531b131j0051j1530J4611k9276J5244L2598o71O576j5687l7149K8505J5771
$$ plain form
14519 6810 -15550 -9691 5969 -18466 -11915 -7598 -18246 -9131 -5257 25323 20143 8070 24683
14506 24683 25347 1114 -28898 8080 23383 -17477 -39436 -43877 -55195 -52819 -33409 -45059
14494 -45059 -91443 -124655 -104892 -69642 -55299 -49182 -21615 28879 -11503 -42754 -29516 -32467
14482 -32467 -75719 -16060 8883 -33540 -71253 -52964 -62217 -46699 -59260 -54825 -43652 -44749
14470 -44749 -16481 -8637 3172 -8425 -12775 19776 28846 -4168 -6219 20802 17811 25857 10063
14457 10063 -950 -13301 4307 15970 20105 -16785 -35763 -37660 -2327 33519 13675 -15941
14445 -15941 -17227 -28111 -39487 -18186 9622 -14803 -49941 -72705 -73346 -50208 -42679 -29154
14433 -29154 -53907 -67623 -45714 -20446 -40446 -55545 -33633 -6202 37487 31547 17934 -16221
$$ packed form
14519F810k2360N859J5660k4435O551M317j0648R115L874L0580n180j2073J6613
14506B4683O64k4233l0012L6978J5303m0860k1959m441j1318K376J9410j1650
14494d5059m6384l3212J9763L5250J4343O117K7567N0494m0382l1251J3238k951
14482c2467m3252N9659K4943m2423l7713J8289r253J5518j2561M435J1173j097
14470d4749K8268P844J1809j1597m350L2551R070l3014k051K7021k991Q046j5794
14457A0063j1013j2351J7608J1663M135l6890j8978j897L5333L5846j9844k9616
14445a5941j286j0884j1376K1301K7808k4425l5138k2764o41K3138P529J3525
14433b9154k4753j3716K1909K5268k0000j5099K1912K7431M3689n940j3613l4155
$$ plain form
14421 -16221 -7027 29796 15196 6160 12956 9265 -25775 -75169 -38105 -66569 -25335 -4215
14409 -4215 38018 23862 5197 -17710 -38248 -27620 -25208 -33289 -15169 -11541 -39148 -78685
14397 -78685 -69976 -65155 -29400 6407 4057 -1367 -12783 4873 13136 8920 -6038 -9291 -19402
14384 -19402 -16813 -5121 -10882 -5546 -4801 -9381 14294 929 -12591 -29118 -39146 -32710 6738
14371 6738 2080 14946 6273 12507 21090 -14106 -33589 -102449 -124404 -66357 -30310 -56015 -64663
14358 -64663 -102999 -153282 -130846 -110485 -83153 -54206 -32685 -17766 -10164 -42908 -75929 -116009
14346 -116009 -102443 -51219 -36788 -24879 -36665 -36445 -58960 -49985 -937 3881 -36281 -28124
14334 -28124 -20925 -42297 -27475 -46492 -45540 -40048 -35469 -12972 2662 -2355 3283 -4140 -43553
$$ packed form
14421a6221R194L6823j4600r036O796l691l5040m9394L7064k8464M1234K1120
14409d215M2233j4156j8665k2907k0538J0628K412q081J8120L628k7607l9537
14397g8685Q709M821L5755L5807k350n424j1416J7656Q263m216j4958l253j0111
14384a9402K589J1692n761N336P45m580K3675j3365j3520j6527j0028O436L9448
14371F738m658J2866q673O234Q583l5196j9483o8860k1955N8047L6047k5705q648
14358f4663l8336n0283K2436K0361K7332K8947K1521J4919P602l2744l3021m0080
14346a16009J3566N1224J4431J1909j1786K20k2515Q975M9048M818m0162Q157
14334b8124P199k1372J4822j9017R52N492M579K2497J5634n017N638p423l9413
$$ plain form
14321 -43553 -41038 -38212 -50022 -15221 -5197 9259 17400 -483 -2131 -609 -42694 -29997 -16395
14308 -16395 -37989 -37665 -14166 44184 67877 31706 2960 23960 33016 46781 49898 18689
14296 18689 36006 46739 51993 20006 -3456 2641 11537 -20656 -44466 -58147 -53360 -39422
14284 -39422 -32495 -11368 10434 17095 25266 -10658 -23332 18087 5477 -25670 1429 -18687
14272 -18687 -61504 -60551 -43952 -37766 -13010 -40563 -45491 -40053 -53377 -48747 -37500 -23361 -18973
14259 -18973 -22338 -8550 -8371 -13280 10362 31541 -8591 -56541 -39488 -46547 -47501 -60280 -78632
14246 -78632 -96215 -53056 -20396 1067 39 -14755 -60157 -61715 -37414 -46171 -44500 -11030
14234 -11030 3054 12157 23065 33645 6339 -39427 -41885 -44227 -12919 -7883 10187 12904 -11391
$$ packed form
14321d3553K515K826j1810L4801J0024J4456Q141j7883j648J522m2085J2697J3602
14308a6395k1594L24K3499N8350K3693l6171k8746K1000R056J3765L117l1209
14296A8689J7317J0733N254l1987k3462O097Q896l2193k3810j3681M787J3938
14284c9422O927K1127K1802O661Q171l5924j2674M1419j2610l1147K7099k0116
14272a8687m2817R53J6599O186K4756k7553m928N438j3324M630J1247J4139M388
14259a8973l365J3788J79m909K3642K1179m0132m7950J7053p059r54j2779j8352
14246g8632j7583M3159L2660K1463j028j4794m5402j558K4301q757J671L3470
14234a1030J4084R103J0908J0580k7306m5766k458k342L1308N036J8070K717k4295
$$ plain form
14221 -11391 -61589 -97559 -40439 -9608 19821 36968 21029 7054 -7771 -59305 -51729 -56847
14209 -56847 -57771 -31504 -3 -11238 -9279 -30453 -30023 -10119 5568 59451 56802 51790 69242
14196 69242 37384 31368 45369 38987 10959 -25824 -28353 -31316 -10798 -2253 -19557 -19480 -31620
14183 -31620 -20998 -18611 -1163 27939 23840 52836 19940 -2543 -4976 -14146 -23026 -4449 18208
14170 18208 -23232 -71063 -80025 -16189 84275 89366 51544 19585 21959 -36145 -31423 -16438
14158 -16438 -6259 11190 14978 2870 10101 -4630 -26876 -59221 -56927 -35032 -71923 -91219
14146 -91219 -72379 -47533 -17890 19282 65 -41014 -33633 -17890 -13920 1877 2260 -14660
14134 -14660 -28945 -4601 -10560 -21031 -36190 -46174 -37405 -32063 -18123 -21020 -36544 -29971 -26407
$$ packed form
14221a1391n0198l5970N7120L0831K9429J7147j5939j3975j4825n1534P576n118
14209e6847r24K6267L1501j1235J959k1174M30J9904J5687N3883k649n012J7452
14196F9242l1858o016J4001o382k8028l6783k529k963K0518Q545j7304P7j2140
14183c1620J0622K387J7448K9102m099K8996l2896k2483k433r170q880J8577K2657
14170A8208m1440m7831q962O3836J00464N091l7822l1959K374n8104M722J4985
14158a6438J0179J7449L788j2108P231j4731k2246l2345K294K1895l6891j9296
14146i1219J8840K4846K9643L7172j9217m1079P381J5743L970J5797L83j6920
14134a4660j4285K4344n959j0471j5159r984Q769N342J3940k897j5524O573L564
$$ plain form
14121 -26407 -49083 -84096 -78807 -43863 -10833 -28520 -31523 -42956 -65147 -65375 -26128 -26431 -14073
14108 -14073 -10900 -28682 -45465 -76138 -80771 -63650 -73391 -68464 -75300 -67120 -55980 -33521 -25100
14095 -25100 -66898 -88994 -74844 -33777 -18292 -15165 15677 40119 5784 -41645 -39208 -36111
14083 -36111 -62882 -69263 -40716 -32166 -43579 -53795 -37173 -68490 -98700 -89521 -55501 -41268
14071 -41268 -34186 -13389 8053 -34715 -61084 -33674 -2806 -4799 -3257 14806 8447 -6404
14059 -6404 -8331 8381 -9074 -18209 9985 35035 -7359 -34789 -59128 -24630 -20461 -50774
14047 -50774 -47633 -72264 -43134 -45300 -51841 -58970 -51328 -33165 -12280 -32260 -94963 -95059 -70486
14034 -70486 -40881 -14492 -19351 -72282 -101220 -89285 -106760 -77166 -34603 -43250 -28416 -26358
$$ packed form
14121b6407k2676l5013N289L4944L3030j7687l003j1433k2191k28L9247l03J2358
14108a4073L173j7782j6783l0673m633J7121r741M927o836Q180J1140K2459Q421
14095b5100m1798k2096J4150M1067J5485L127L0842K4442l4335m7429K437L097
14083c6111k6771o381K8547Q550j1413j0216J6622l1317l0210R179L4020J4233
14071d1268P082K0797K1442m2768k6369K7410L0868j993J542J8063o359j4851
14059f404j927J6712j7455r135K8194K5050m2394k7430k4339L4498M169l0313
14047e0774L141k4631K9130k166o541p129P642J8163K0885j9980o2703r6K4573
14034g0486K9605K6389m859n2931k8938J1935j7475K9594M2563q647J4834K058
$$ plain form
14022 -26358 -23457 -53765 -11244 -16535 -55384 -44418 -67644 -52647 -36184 -41803 -61437 -34137
14010 -34137 3567 82178 76963 40175 -15999 -22959 8469 -26890 -43459 -54453 -57004 -59781
13998 -59781 -28969 -46149 -36182 -6519 -33745 -55607 -27710 -26118 -33386 -56886 -70154 -81599
13986 -81599 -24983 -9483 -10643 -27979 -56887 -90414 -51300 -65164 -54834 -17201 -1551 20329
13974 20329 -2782 -21043 -49865 -53049 -78775 -70579 -62238 -68470 -68596 -63483 -56692 -38405 -6361
13961 -6361 -13830 -8638 -4150 -10879 -19499 -9892 9145 6148 9491 -5871 -8595 24605 38297 -3951
13947 -3951 -4303 -31471 -42398 -34573 6979 -9228 -52147 -44066 -37849 -42168 -52400 -89842 -109782
13934 -109782 -82330 -68732 -81592 -53721 -42263 -56930 -74175 -71849 -36669 -42276 -33895 -49384
$$ packed form
14022b6358K901l0308M2521n291l8849J0966k3226J4997J6463n619j9634K7300
14010c4137L7704P8611n215l6788n6174o960L1428l5359j6569j0994k551k777
13998e9781L0812j7180R967K9663k7226k1862K7897J592p268k3500j3268j1445
13986h1599N6616J5500j160j7336k8908l3527L9114j3864J0330L7633J5650K1880
13974B0329k3111j8261k8822l184k5726Q196Q341o232j26N113O791J8287L2044
13961f361p469N192M488o729q620R607J9037k997L343j5362k724L3200J3692m2248
13947c951l52k7168j0927P825M1552j6207m2919Q081O217m319j0232l7442j9940
13934a09782K7452J3598j2860K7871J1458j4667j7245K326L5180n607Q381j5489
$$ plain form
13922 -49384 -53520 -61265 -48539 -34588 -405 10145 23434 13616 1505 -30848 -23023 -35238
13910 -35238 -59471 -86073 -103113 -118560 -64512 -40788 -48876 -56540 -69289 -88906 -121625 -102724
13898 -102724 -20687 -54512 -68617 -25137 -38647 -78342 -99946 -47135 -1400 158 -24167 -66595
13886 -66595 -98728 -47975 -33811 -34723 -34267 -21165 -2876 13580 -23205 -32357 -35416 -9342 17703
13873 17703 -16472 -3944 42087 46939 -3627 -80678 -130921 -103317 -75615 -79077 -73144 -34450
13861 -34450 -31638 -57558 -51427 -18980 -19558 -67506 -44954 -31559 -53164 -42517 -25936 11884
13849 11884 -6547 -24994 -7443 32401 2226 -55996 -83212 -72744 -71661 -41844 -58974 -73047
13837 -73047 -33367 11312 9239 27870 41630 -11614 -3350 15621 32962 46066 14274 -11593
$$ packed form
13922d9384m136p745J2726J3951L4183J0550J3289r818j2111l2353P825j2215
13910c5238k4233k6602j7040j5447N4048K3724q088p664j2749j9617l2719J8901
13898a02724Q2037l3825j4105M3480j3510l9695k1604N2811M5735J558k4325m2428
13886f6595l2133N0753J4164r12M56J3102J8289J6456l6785r152l059K6074K7045
13873A7703l4175J2528M6031M852n0566p7051n0243K7604K7702l462N933L8694
13861c4450K812k5920O131L2447n78m7948K2552J3395k1605J0647J6581L7820
13849A1884j8431j8447J7551L9844l0175n8222k7216J0468J083K9817j7130j4073
13837g3047L9680M4679k073J8631J3760n3244Q264J8971J7341J3104l1792k5867
$$ plain form
13825 -11593 -21600 -28912 -31181 -23332 -6707 -1764 -16617 -15598 -40655 -53391 -69960 -36510 -11860
13812 -11860 8686 75530 101634 51238 19686 1727 -51189 -32011 -20839 -20569 -5683 -20136
13800 -20136 -65218 -71153 -59931 -62344 -43462 -1675 34806 56194 49160 22037 871 -36359
13788 -36359 -43430 -58932 -97909 -74262 -16498 -15038 -74150 -78540 -109946 -96669 -78079 -60177
13776 -60177 1159 -10035 -15165 -6250 -22631 -58353 -55870 -17460 -9139 -6395 -17738 -52242 -44512
13763 -44512 -52695 -62938 -69547 -60197 -99053 -113169 -115619 -106244 -94949 -110901 -113223 -101877 -124096
13750 -124096 -112673 -83942 -74232 -65799 -33276 24827 8284 -4542 -1890 10487 31741 15140
13738 15140 12644 -12230 -32682 -26024 -13669 -27364 -52604 -39804 -2557 -30417 -54000 -62091
$$ packed form
13825a1593j0007p312k269P849J6625M943j4853J019k5057j2736j6569L3450K4650
13812a1860K0546O6844K6104n0396l1552j7959n2916J9178J1172K70J4886j4453
13800b0136m5082n935J1222k413J8882M1787L6481K1388p034k7123k1166l7230
13788c6359p071j5502l8977K3647N7764J460n9112m390l1406J3277J8590J7902
13776f0177O1336j1194n130Q915j6381l5722K483L8410Q321K744j1343l4504P730
13763d4512q183j0243o609R350l8856j4116k450R375J1295j5952k322J1346k2219
13750a24096J1423K8731R710Q433L2523N8103j6543j2826K652J2377K1254j6601
13738A5140k496k4874k0452O658J2355j3695k5240J2800L7247k7860k3583q091
$$ plain form
13726 -62091 -60002 -26073 1422 30584 15439 -1526 -1157 16589 33184 -3010 -300 38339
13714 38339 30928 -6618 -16934 -2651 -8090 -30018 -25812 -21504 -30118 -38716 -17499 2845 -7131
13701 -7131 -46925 -53010 -50482 -10551 -2551 -25645 -23934 -33747 -69457 -76416 -37535 -15963 8110
13688 8110 -15188 -67558 -59681 -21589 -13528 -28504 -33976 -27860 -21156 -13014 -15405 -14881 -1877 -1544
13674 -1544 -2831 -61966 -70841 -40457 -60026 -86619 -59691 -47653 -34773 -21532 -9877 48820
13662 48820 83563 30437 -12608 -35916 -40159 -29845 -60 45428 64294 40192 24340 16501
13650 16501 10867 30779 25462 34280 39821 55628 51435 49375 8957 -3792 11899 6663 -9121
13637 -9121 -16196 10107 -13068 26757 30006 -15100 -39158 -47029 -34537 -4187 -7930 -1362 16566
$$ packed form
13726f2091K089L3929K7495K9162j5145j6965L69J7746J6595l6194K710L8639
13714C8339p411l7546j0316J4283n439k1928M206M308q614q598K1217K0344r976
13701g131l9794o085K528L9931Q000k3094J711r813l5710o959L8881K1572K4073
13688H110k3298n2370P877L8092Q061j4976n472O116O704Q142k391N24J3004L33
13674a544j287n9135q875L0384j9569k6593K6928J2038J2880J3241J1655N8697
13662D8820L4743n3126m3045k3308m243J0314K9785M5488J8866k4102j5852p839
13650A6501n634J9912n317Q818N541J5807m193k060m0418j2749J5691n236j5784
13637i121p075K6303k3175L9825L249m5106k4058p871J2492L0350l743O568J7928
$$ plain form
13624 16566 26413 15294 -4776 -20244 -3537 31119 50207 29677 7482 7688 4982 19254
13612 19254 3443 20457 33779 66348 58427 59948 5093 -22961 -25816 -23524 -16980 8554 46618
13599 46618 56031 8851 27727 65040 57505 36881 20661 40721 83528 85685 31544 -17925
13587 -17925 -46438 -19395 34629 50955 30638 4923 4900 25624 46862 80224 94690 74634
13575 74634 75947 78201 43871 48192 26326 50710 82390 87803 92864 72938 101634 140333 140659
13562 140659 104570 81841 45098 38181 28491 50348 28819 -5636 9547 26105 48317 39115
13550 39115 32088 19447 25189 26300 49469 42919 65766 107928 154759 168282 119825 107428
13538 107428 74887 35136 25761 24352 29819 66289 81581 63518 68876 69816 51202 100162 114299
$$ packed form
13624A6566R847j1119k0070j5468J6707L4656J9088k0530k2195K06k706J4272
13612A9254j5811J7014J3322L2569p921J521n4855k8054k855K292O544K5534L8064
13599D6618R413m7180J8876L7313p535k0624j6220K0060M2807K157n4141m9469
13587a7925k8513K7043N4024J6326k0317k5715k3K0724K1238L3362J4466k0056
13575G4634J313K254l4330M321k1866K4384L1680N413N061j9926K8696L8699L26
13562A40659l6089k2729l6743o917r690K1857k1529l4455J5183J6558K2212r202
13550C9115p027j2641N742J111K3169o550K2847M2162M6831J3523m8457j2397
13538A07428l2541l9751r375j409N467L6470J5292j8063N358R40j8614M8960J4137
$$ plain form
13525 114299 78597 61017 95724 105693 97228 110980 118201 117176 90218 80005 64338 22657
13513 22657 52983 94937 34582 21477 61939 76216 58208 50346 69314 53805 67746 76770
13501 76770 91750 92771 78553 69107 55839 57474 69128 75490 -782 -18727 9758 -590
13489 -590 -17591 3737 31191 58009 110724 144032 130483 98885 82305 40747 34052 43573
13477 43573 76189 63011 48543 53437 71920 43730 22134 36542 41480 7161 -10408 9344
13465 9344 36733 38010 52524 67735 90170 111539 107706 53267 1021 -52370 -38221 13231
13453 13231 6331 -11267 -18799 -49910 -52724 -17579 20115 8061 28789 86843 133639 126271
13441 126271 113638 107804 89442 76836 52276 31469 38644 30587 -36173 -66527 -49901 -42035
$$ packed form
13525A14299l5702j7580L4707R969q465J3752P221j025k6958j0213j5667m1681
13513B2657L0326M1954o0355j3105M0462J4277j8008p862J8968j5509J3941R024
13501G6770J4980J021j4218r446j3268J635J1654O362p6272j7945K8485j0348
13489e90j7001K1328K7454K6818N2715L3308j3549l1598j6580m1558o695R521
13477D3573L2616j3178j4468M894J8483k8190k1596J4408M938l4319j7569J9752
13465I344K7389J277J4514J5211K2435K1369l833n4439n2246n3391J4149N1452
13453A3231o900j7598p532l1111k814L5145L7694j2054K0728N8054M6796p368
13441A26271j2633n834j8362j2606k4560k0807P175q057o6760l0354J6626P866
$$ plain form
13429 -42035 7450 25697 72072 76813 86605 51224 39230 38093 59967 60819 40128 -13635 -24732
13416 -24732 -37823 -1352 45910 47220 34369 31962 50875 39209 25270 11567 34209 80738
13404 80738 117502 104801 60147 70908 54131 74494 117575 74738 20587 -17894 -17307 -6604
13392 -6604 -14658 -704 21680 20791 38678 32564 21756 -20034 -36256 -5028 -44712 -44546 -41107
13379 -41107 43508 73321 52598 44321 37238 -23673 -39230 4475 47066 53315 67354 52877
13367 52877 86714 102657 81174 75254 66132 60025 37323 19458 -522 -5616 35131 63006
13355 63006 78375 98583 95400 112093 112067 45172 22669 14156 42489 91174 108314 55737 5505
13342 5505 9246 20597 18730 25334 43733 18096 5248 -11 2591 8228 27204 34896 31151
$$ packed form
13429d2035M9485J8247M6375M741R792l5381j1994j137K1874Q52k0691n3763j1097
13416b4732j3091L6471M7262J310j2851k407J8913j1666j3939j3703K2642M6529
13404H0738L6764j2701m4654J0761j6777K0363M3081m2837n4151l8481N87J0703
13392f604q054J3954K2384q89J7887o114j0808m1790j6222L1228l9684J66L439
13379d1107Q4615K9813k0723q277p083o0911j5557M3705M2591O249J4039j4477
13367E2877L3837J5943k1483n920r122o107k2702j7865j9980n094M0747K7875
13355F3006J5369K0208l183J6693k6o6895k2503q513K8333M8685J7140n2577n0232
13342E505L741J1351j867O604J8399k5637j2848n259K602N637J8976P692l745
$$ plain form
13329 31151 59941 61882 55159 63720 104282 146316 122574 73846 92732 46182 31263 62110
13317 62110 68124 59585 50385 58162 42212 26830 48570 64070 76211 95256 112970 105435 132454
13304 132454 123463 101660 88646 122720 136911 117452 90599 106202 101014 84646 76752 83927
13292 83927 89727 85925 83750 74062 41808 105577 140769 196109 194088 174654 153116 114734 73298
13279 73298 58582 32225 -6853 34363 43541 58231 63588 38816 -5794 3436 67555 87122
13267 87122 101736 88774 78424 86167 79218 56440 49415 67329 59707 79693 72575 71274 105711
13254 105711 105807 104943 113039 116326 116731 123418 113727 131066 145352 124092 101369 107513 98653 96914
13240 96914 100616 127885 96856 71118 123435 153060 139712 132576 167490 164181 155714 150345 132600
$$ packed form
13329C1151K8790J941o723Q561M0562M2034k3742m8728J8886m6550j4919L0847
13317F2110O014q539r200P777j5950j5382K1740J5500J2141J9045J7714p535K7019
13304A32454q991k1803j3014L4074J4191j9459k6853J5603n188j6368p894P175
13292H3927N800l802k175r688l2254O3769L5192N5340k021j9434k1538l8382m1436
13279G3298j4716k6357l9078M1216R178J4690N357k4772m4610R230O4119J9567
13267H7122J4614j2962j0350P743o949k2778p025J7914p622J9986p118j301L4437
13254A05711R6q64Q096L287M05O687r691J7339J4286k1260k2723O144q860j739
13240I6914L702K7269l1029k5738N2317K9625j3348p136L4914l309q467n369j7745
$$ plain form
13227 132600 143842 140673 145470 142889 156598 167143 151226 103536 113864 143312 122591 116676
13215 116676 140086 141770 120096 128112 108468 101212 126786 150169 135858 143225 129999 115228
13203 115228 128462 121412 137761 171889 163846 173365 231915 226018 207579 218230 235120 250758
13191 250758 231701 237596 233083 225085 225702 221778 230948 244469 197266 194924 226756 262131 262667
13178 262667 248622 213216 203776 160443 163610 199605 207557 183451 188181 186645 188160 175569 227089
13165 227089 225978 200697 198612 204985 231184 269200 276808 266574 278322 322800 307291 272493
13153 272493 257122 248217 257670 304857 314345 323369 348897 327362 282514 277077 276335 266164 263141
13140 263141 234910 225088 196944 209319 200848 173779 172413 165747 176236 231037 270846 244618
$$ packed form
13227A32600J1242l169M797k581J3709J0545j5917m7690J0328K9448k0721n915
13215A16676K3410J684k1674Q016j9644p256K5574K3383j4311P367j3226j4771
13203A15228J3234p050J6349L4128q043R519N8550n897j8439J0651J6890J5638
13191B50758j9057N895m513p998O17l924R170J3521m7203k342L1832L5375N36
13178B62667j4045l5406r440m3333L167L5995P952k4106M730j536J515j2591N1520
13165B27089j111k5281k085O373K6199L8016P608j0234J1748M4478j5509l4798
13153B72493j5371q905R453M7187R488R024K5528k1535m4848n437p42j0171l023
13140B63141k8231r822k8144J2375q471k7069j366o666J0489N4801L9809k6228
$$ plain form
13128 244618 246048 236795 250962 262894 268252 245416 251158 250534 260482 274041 273790 228387 212587
13115 212587 224398 215330 159331 152347 176012 203848 173458 198692 230420 223954 160485 131242
13103 131242 196959 208452 212919 269971 282538 238343 234859 230026 240332 237493 232895 221991
13091 221991 239580 266564 262769 247108 182062 165675 174816 152248 178950 158704 142272 165142
13079 165142 203023 229850 232856 195686 146212 164955 149287 157776 140191 138800 118904 87318
13067 87318 83949 71337 91557 148207 160813 151516 124235 125036 123373 120784 125933 164989 235904
13054 235904 250075 232996 252234 257036 247222 231668 215860 242043 298980 318160 292894 268022
13042 268022 250292 245335 222250 184650 172775 175134 204328 216587 237760 225831 199993 149745
$$ packed form
13128B44618J430r253J4167J1932N358k2836N742o24R948J3559k51m5403j5800
13115B12587J1811r068n5999o984K3665K7836l0390K5234L1728o466o3469k9243
13103A31242O5717J1493M467N7052J2567m4195l484m833J0306k839m598j0904
13091B21991J7589K6984l795j5661o5046j6387R141k2568K6702k0246j6432K2870
13079A65142L7881K6827L006l7170m9474J8743j5668Q489j7585j391j9896l1586
13067H7318l369j2612K0220N6650J2606r297k7281Q01j663k589N149L9056P0915
13054B35904J4171j7079J9238M802r814j5554j5808K6183N6937J9180k5266k4872
13042B68022j7730m957k3085l7600j1875K359K9194J2259K1173j1929k5838n0248
$$ plain form
13030 149745 155113 122881 145555 152525 125310 152945 126220 103726 88029 86953 109841 109888 101773
13017 101773 96013 118143 136214 160287 166386 162155 145353 164026 183801 210396 192522 205352
13005 205352 244238 229584 222954 261497 267214 235200 233575 190555 169686 184198 197503 176192
12993 176192 154911 117016 102033 118868 115402 88098 72385 66888 61346 55957 68283 94892
12981 94892 129697 126768 97706 99711 128393 156007 178111 177888 203079 191751 166512 155353
12969 155353 139922 197799 226122 223923 235280 248107 196720 170225 158528 188224 185150 166312
12957 166312 170540 227134 228206 184633 168647 145984 145192 152766 150420 137858 118442 102520 76491
12944 76491 61830 91919 135661 154050 112529 78856 100751 129135 160749 164152 164219 140553
$$ packed form
13030A49745N368l2232K2674O970k7215K7635k6725k2494j5697j076K2888M7q115
13017A01773n760K2130J8071K4073O099m231j6802J8673J9775K6595j7874J2830
13005B05352L8886j4654o630L8543N717l2014j625m3020k0869J4512J3305k1311
12993A76192k1281l7895j4983J6835l466k7304j5713n497n542n389J2326K6609
12981I4892L4805k929k9062K005K8682K7614K2104k23K5191j1328k5239j1159
12969A55353j5431N7877K8323k199J1357J2827n1387k6495j1697K9696l074j8838
12957A66312M228N6594J072m3573j5986k2663p92P574k346j2562j9416j5922k6029
12944G6491j4661L0089M3742J8389m1521l3673K1895K8384L1614L403O7k3666
$$ plain form
12932 140553 104570 112545 85754 116178 143124 147337 158833 125489 105250 94727 98749 116559
12920 116559 108993 88890 85369 75999 102311 128780 133443 152213 175244 122885 110234 134342
12908 134342 114981 107228 53971 57402 69362 116268 65861 53225 75148 55536 92431 138818
12896 138818 141440 110248 65464 72124 76317 65051 83629 98008 97928 92122 79763 52428 39758
12883 39758 56536 33732 67666 90618 83389 123533 135117 154972 207613 213683 215570 232434
12871 232434 261086 288383 267981 236056 153591 147856 158277 150155 102021 89452 125640 128435
12859 128435 113751 98823 91488 102796 88745 109981 160995 171902 190194 194616 170045 178224
12847 178224 171172 162112 181399 173165 162345 150181 127750 110026 94864 116849 131572 109839
$$ packed form
12932A40553l5983P975k6791L0424K6946M213J1496l3344k0239j0523M022J7810
12920A16559p566k0103l521r370K6312K6469M663J8770K3031n2359j2651K4108
12908A34342j9361p753n3257L431J1960M6906n0407j2636K1923j9612L6895M6387
12896A38818K622l1192m4784O660M193j1266J8578J4379q0n806j2359k7335j2670
12883C9758J6778k2804L3934K2952p229M0144J1584J9855N2641O070J887J6864
12871B32434K8652K7297k0402l1925q2465n735J0421q122m8134j2569L6188K795
12859A28435j4684j4928p335J1308j4051K1236N1014J0907J8292M422k4571Q179
12847A78224p052r060J9287q234j0820j2164k2431j7724j5162K1985J4723k1733
$$ plain form
12835 109839 105504 121904 129051 167300 175306 148488 122929 87423 118010 142264 123206 133828
12823 133828 124732 143500 173758 168797 196946 174899 121870 115742 150243 174812 173990 171621 162116
12810 162116 187822 208929 231424 168142 144642 197503 184352 194381 202295 152857 162665 161000
12798 161000 141605 128376 115109 127675 186977 206503 197381 186630 150876 136165 152012 181252
12786 181252 195334 214171 206078 152138 164654 177057 167941 157673 177794 203849 196407 178319
12774 178319 188500 179593 202955 174751 139965 165130 198817 242760 271236 259347 253352 223289
12762 223289 210284 194018 204302 230462 241822 208754 184587 184604 191213 180847 214467 226480
12750 226480 198677 224490 229715 221424 220043 243067 291539 290978 296577 307103 319047 322633 288531
$$ packed form
12835A09839m335J6400P147L8249Q006k6818k5559l5506L0587K4254j9058J0622
12823A33828r096J8768L0258m961K8149k2047n3029o128L4501K4569q22k369r505
12810A62116K5706K1107K2495o3282k3500N2861j3151J0029P914m9438R808j665
12798A61000j9395j3229j3267J2566N9302J9526r122j0751l5754j4711J5847K9240
12786A81252J4082J8837q093n3940J2516J2403r116j0268K0121K6055p442j8088
12774A78319J0181q907K3362k8204l4786K5165L3687M3943K8476j1889n995l0063
12762B23289j3005j6266J0284K6160J1360l3068k4167J7O609j0366L3620J2013
12750B26480k7803K5813N225q291j381K3024M8472n61N599J0526J1944L586l4102
$$ plain form
12737 288531 262793 266300 265235 274093 247615 245868 259023 294078 295572 305391 307474 317934 319765
12724 319765 324929 351489 374894 390749 381588 337766 321217 357551 399901 399118 388181 349943
12712 349943 388408 446102 440506 443770 454849 471726 518111 614219 690415 741703 744456 713972
12700 713972 716822 726554 757268 750899 700658 657584 612959 626865 627653 636983 700357 690818 682361
12687 682361 688217 679540 660444 668863 654864 672497 686757 655173 620390 583999 548842 513894
12675 513894 497091 508887 488929 468240 464482 454429 451145 436555 469706 474823 482079 480060
12663 480060 500764 523554 549314 596701 599263 585768 595705 643480 642380 616365 611262 608066
12651 608066 611250 635033 619391 638415 655944 687270 727570 785379 895323 972246 1060904
$$ packed form
12737B88531k5738L507j065Q858k6478j747J3155L5055J494R819K083J0460J831
12724C19765N164K6560K3405J5855r161m3822j6549L6334M2350p83j0937l8238
12712C49943L8465N7694n596L264J1079J6877M6385R6108P6196N1288K753l0484
12700G13972K850R732L0714o369n0241m3074m4625J3906P88R330O3374r539q457
12687F82361N856q677j9096Q419j3999J7633J4260l1584l4783l6391l5157l4948
12675E13894j6803J1796j9958k0689l758j0053l284j4590L3151N117P256k019
12663D80060K0704K2790K5760M7387K562j3495R937M7775j100k6015n103l196
12651F08066L184K3783j5642J9024J7529L1326M0300N7809J09944P6923Q8658
$$ plain form
12640 1060904 1206011 1277958 1336271 1372093 1382358 1426713 1419594 1351644 1299387 1207816 1069138
12629 1069138 937746 824484 791518 789358 763692 792149 742623 697850 705511 703503 690999
12618 690999 632658 631393 619616 593806 588573 564551 535647 515228 512156 519532 558534 549181
12606 549181 579133 586062 520693 487060 492749 514571 542436 512282 485317 488839 481214 500286
12594 500286 514178 501424 461065 483265 511777 566369 553251 555175 573734 558574 555002 556200
12582 556200 521292 515409 515591 473774 463671 496731 526579 520653 511467 528637 576282 546924
12570 546924 480809 469619 517390 535935 510501 517658 492428 469771 474039 504239 517103 516730
12558 516730 480672 442975 442908 481961 523973 514053 481254 443773 445969 486631 488285 502290 508664
$$ packed form
12640A060904J45107P1947N8313L5822J0265M4355p119o7950n2257r1571j38678
12629A069138j31392j13262l2966k160k5666K8457m9526m4773P661k008j2504
12618F90999n8341j265j1777k5810n233k4022k8904k0419l072P376L9002r353
12606E49181K9952O929o5369l3633N689K1822K7865l0154k6965L522p625J9072
12594E00286J3892j2754m0359K2200K8512N4592j3118J924J8559j5160l572J198
12582E56200l4908n883J82m1817j0103L3060K9848n926r186J7170M7645k9358
12570E46924o6115j1190M7771J8545k5434P157k5230k2657M268L0200J2864l73
12558E16730l6058l7697o7L9053M2012r920l2799l7481K196M0662J654J4005O374
$$ plain form
12545 508664 500204 494850 483807 485284 479139 443601 430980 438466 390196 407230 439344 434082 455287
12532 455287 412524 412654 435684 446223 470409 478297 492793 498194 483582 485582 500085 498818 489415
12519 489415 491393 483756 455094 466215 441394 409697 400051 425627 407299 388290 408368 437781
12507 437781 449292 463801 442513 462822 448831 420919 450973 469154 486857 513229 503084
12496 503084 461522 428752 440704 440969 465674 504852 531350 543654 502570 451735 447113 473723
12484 473723 504245 519529 494719 544456 558039 538328 542437 576461 563547 548669 508459 455485
12472 455485 425760 426367 418852 391687 414716 470405 446274 460490 462653 430357 420179 411525
12460 411525 395564 389583 403730 391837 427705 441538 421608 425331 442274 481311 504321 500392
$$ packed form
12545E08664q460n354j1043J477o145l5538j2621P486m8270J7034L2114n262K1205
12532D55287m2763J30K3030J0539K4186P888J4496N401j4612K000J4503j267r403
12519D89415J978p637k8662J1121k4821l1697r646K5576j8328j9009K0078K9413
12507D37781J1511J4509k1288K0309j3991k7912L0054J8181J7703K6372j0145
12496E03084m1562l2770J1952K65K4705L9178K6498J2304m1084n0835m622K6610
12484D73723L0522J5284k4810M9737J3583j9711M109L4024j2914j4878m0210n2974
12472D55485k9725O07p515k7165K3029N5689k4131J4216K163l2296j0178q654
12460D11525j5961n981J4147j1893L5868J3833j9930L723J6943L9037K3010l929
$$ plain form
12448 500392 481345 496039 518038 527814 512601 478008 498243 494316 489172 489581 518444 548202
12436 548202 554381 566939 562915 551325 548778 524901 517205 523196 487596 484341 471686 454228 498256
12423 498256 520063 478840 456426 494232 471616 472701 472660 475049 488168 446331 429486 441767
12411 441767 482176 489282 506551 529451 563899 623324 661254 652445 650000 638036 634060 631130
12399 631130 624855 627210 666095 675839 695871 684531 655845 675259 736512 808609 912076 1016617
12387 1016617 1154625 1341495 1594100 1914674 2212915 2441660 2560480 2571093 2616443 2658051
12377 2658051 2652328 2516161 2234098 1869334 1536757 1305933 1145005 1046482 968912 928857
12367 928857 909525 906931 851965 796655 767019 757313 715883 683628 675936 666155 669907 649197
$$ packed form
12448E00392j9047J4694K1999R776j5213l4593K0235l927n144M09K8863K9758
12436E48202O179J2558m024j1590k547k3877p696N991l5600l255j2655j7458M4028
12423D98256K1807m1223k2414L7806k2616J085m1K389J3119m1837j6845J2281
12411D41767M0409P106J7269K2900L4448N9425L7930q809k445j1964l976k930
12399F31130o275K355L8885R744K0032j1340k8686J9414O1253P2097J03467J04541
12387A016617J38008J86870K52605L20574K98241K28745J18820J0613M5350M1608
12377B658051n723j36167k82063l64764l32577k30824j60928r8523p7570m0055
12367I28857j9332k594n4966n5310k9636r706m1430l2255p692r781L752k0710
$$ plain form
12355 649197 629341 589895 540454 549557 551259 540357 535281 498965 462572 492821 494457 489982
12343 489982 505113 505897 517282 504129 503134 497562 521343 549145 557906 590608 611691 606118 609509
12330 609509 577300 540239 530806 541317 545419 509117 504803 493912 514923 544599 522250 486434
12318 486434 475409 494864 520871 507284 441977 451469 440954 475671 476678 508586 548381 580622
12306 580622 593134 601259 606567 597050 540132 523558 535247 556613 561879 543142 567091 582818
12294 582818 612615 635643 634970 668507 735000 728937 705080 670195 666614 652598 603339 612131
12282 612131 642926 635476 600301 541682 542593 584123 594215 602466 555746 553029 562063 589989 572542
12269 572542 542823 563700 569826 583333 612959 613945 611561 600265 586768 590141 592795 578358 612285
$$ packed form
12355F49197j9856l9446m9441R103J702j0902n076l6316l6393L0249J636m475
12343D89982J5131P84J1385j3153r95n572K3781K7802Q761L2702K1083n573L391
12330F09509l2209l7061r433J0511M102l6302m314j0891K1011K9676k2349l5816
12318D86434j1025J9455K6007j3587o5307R492j0515L4717J007L1908L9795L2241
12306E80622J2512Q125N308r517n6918j6574J1689K1366N266j8737K3949J5727
12294E82818K9797K3028o73L3537O6493o063k3857l4885l581j4016m9259Q792
12282F12131L0795p450l5175n8619R11M1530J0092Q251m6720k717R034K7926j7447
12269E72542k9719K0877O126J3507K9626R86k384j1296j3497L373K654j4437L3927
$$ plain form
12256 612285 619602 607242 553674 521042 572075 582094 604767 645908 686374 726120 746157 754620
12244 754620 782317 816174 810889 805942 857974 895045 834339 803871 786517 787403 793006 787834 781752
12231 781752 785834 789871 777020 789043 782546 771359 734001 758249 721263 673038 651180 642627
12219 642627 633843 687134 732153 743093 773285 815735 844815 828258 814021 792041 791117 831166
12207 831166 829507 879099 927547 987686 1019113 1065466 1073143 1062324 1081140 1067141 1048132 1023039
12195 1023039 1006896 1002642 983343 962313 976748 959653 966393 999633 945766 934431 984361 1013977
12183 1013977 1015796 997347 986245 993493 1056036 1117776 1129017 1116903 1076328 1052537 1048500 1030194
12171 1030194 975980 996242 1020949 1050832 1047495 1043348 1051676 1049806 1048446 1070177 1044098 1005879
$$ packed form
12256F12285P317j2360n3568l2632N1033J0019K2673M1141M0466L9746K0037Q463
12244G54620K7697L3857n285m947N2032L7071o0706l0468j7354Q86N603n172o082
12231G81752M082M037j2851J2023o497j1187l7358K4248l6986m8225k1858q553
12219F42627q784N3291M5019J0940L0192M2450K9080j6557j4237k1980r24M0049
12207H31166j659M9592M8448O0139L1427M6353P677j0819J8816j3999j9009k5093
12195A023039j6143m254j9299k1030J4435j7095O740L3240n3867j1335M9930K9616
12183A013977J819j8449j1102P248O2543O1740J1241j2114m0575k3791m037j8306
12171A030194n4214K0262K4707K9883l337m147Q328j870j360K1731k6079l8219
$$ plain form
12159 1005879 987460 981335 976881 1013631 1015133 1033655 1086970 1075819 1098455 1142728 1133955 1137211
12147 1137211 1134881 1200384 1279838 1293220 1261962 1256150 1268837 1239344 1221693 1245567 1236035 1229633
12135 1229633 1261817 1270489 1278127 1321441 1368448 1410979 1448462 1493717 1580599 1632128 1696598 1820645
12123 1820645 1959466 2121366 2220440 2259964 2279751 2319286 2344254 2350396 2365891 2264210 2141190
12112 2141190 2061182 1996061 1975228 2020159 2097661 2126608 2154544 2222775 2272789 2299490 2353937
12101 2353937 2365535 2372517 2418860 2425699 2389948 2335637 2288943 2256001 2193807 2166624 2136238 2130700
12089 2130700 2146875 2143099 2168779 2167342 2184292 2230358 2252351 2302518 2372835 2430873 2511818 2620485
12077 2620485 2712417 2846645 3002085 3157969 3322752 3454715 3590998 3726148 3799851 3906627
$$ packed form
12159A005879j8419o125m454L6750J502J8522N3315j1151K2636M4273q773L256
12147A137211k330O5503P9454J3382l1258n812J2687k9493j7651K3874r532o402
12135A229633L2184Q672P638M3314M7007M2531L7483M5255Q6882N1529O4470J24047
12123A820645J38821J61900R9074L9524J9787L9535K4968O142J5495j01681j23020
12112B141190q0008o5121k0833M4931P7502K8947K7936O8231N0014K6701N4447
12101B353937J1598O982M6343O839l5751n4311m6694l2942o2194k7183l0386n538
12089B130700J6175l776K5680j437J6950M6066K1993N0167P0317N8038Q0945J08667
12077B620485R1932J34228J55440J55884J64783J31963J36283J35150P3703J06776
$$ plain form
12067 3906627 4048371 4270732 4609875 5033200 5548628 6148074 6658273 7096175 7465737
12058 7465737 7712398 7886030 8130883 8323666 8408331 8294309 8076077 7835455 7625444 7399600
12048 7399600 7254631 7233020 7163624 6912217 6521928 6009124 5603464 5325938 5117582 5019963
12038 5019963 4947839 4892430 4874515 4848965 4827596 4838984 4859376 4884516 4913603 4897330 4903625
12027 4903625 4922893 4947610 5013150 5041290 5120727 5190955 5242822 5334870 5424497 5489109 5567133
12016 5567133 5686477 5820784 5960988 6115043 6240147 6384545 6529619 6612271 6701521 6850558
12006 6850558 6966711 7052015 7153439 7283092 7466367 7604101 7736668 7937381 8165643 8366070
11996 8366070 8586626 8829583 9130173 9347369 9573644 9853132 10170336 10518728 10856839
$$ packed form
12067C906627J41744K22361L39143M23325N15428N99446N10199M37902L69562
12058G465737K46661J73632K44853J92783Q4665j14022k18232k40622k10011k25844
12048G399600j44969k1611o9396k51407l90289n12804m05660k77526k08356r7619
12038E019963p2124n5409j7915k5550k1369J1388K0392K5140K9087j6273O295
12027D903625J9268K4717O5540K8140P9437P0228N1867R2048Q9627O4612P8024
12016E567133J19344J34307J40204J54055J25104J44398J45074Q2652Q9250J49037
12006F850558J16153Q5304J01424J29653J83275J37734J32567K00713K28262K00427
11996H366070K20556K42957L00590K17196K26275K79488L17204L48392L38111
$$ plain form
11987 10856839 11206785 11568396 11962082 12371995 12846022 13330200 13847550 14342622 14833449
11978 14833449 15362562 15897419 16504286 17157735 17820000 18480563 19196251 20009916 20968411
11969 20968411 22017138 23145760 24388802 25786154 27345529 29117493 31094895 33400650
11961 33400650 36087219 39217858 43052078 47692386 53328369 60169053 68553912 79329985
11953 79329985 93739115 113656256 141820432 181284577 234018399 296832548 357378305
11946 357378305 399698397 422670842 435605788 443232324 448241200 449220687 429837981
11939 429837981 372094748 296397867 233259750 189001443 158952283 137966147 122653794
11932 122653794 111092511 101939392 94169887 87282845 81242481 76118348 71774542 68005843
$$ packed form
11987A0856839L49946L61611L93686M09913M74027M84178N17350M95072M90827
11978A4833449N29113N34857O06867O53449O62265O60563P15688Q13665R58495
11969B0968411J048727J128622J243042J397352J559375J771964J977402K305755
11961C3400650K686569L130639L834220M640308N635983O840684Q384859J0776073
11953G9329985J4409130J9917141K8164176L9464145N2733822O2814149O0545757
11946C57378305M2320092K2972445J2934946P626536N008876R79487j9382706
11939D29837981n7743233p5696881o3138117m4258307l0049160k0986136j5312353
11932A22653794j1561283r153119p769505o887042o040364n124133m343806l768699
$$ plain form
11924 68005843 64573115 61502457 58650662 56009082 53553313 51270617 49185086 47293499
11916 47293499 45514361 43866657 42335466 40939102 39591281 38235574 36979496 35808189
11908 35808189 34710788 33703029 32668533 31678697 30774092 29794293 28832360 27952020 27102001
11899 27102001 26253396 25472784 24787833 24126652 23502247 22880172 22309987 21749253 21161926
11890 21161926 20649332 20167693 19696628 19217401 18775780 18345595 17833854 17425460 17029654
11881 17029654 16630646 16227116 15847101 15512177 15179408 14845021 14547710 14301642 14068486
11872 14068486 13833037 13581288 13337354 13068164 12736070 12440923 12148552 11894616 11578931
11863 11578931 11278290 11016162 10743412 10497760 10282809 10095416 9920428 9725343 9550768
$$ packed form
11924F8005843l432728l070658k851795k641580k455769k282696k085531j891587
11916D7293499j779138j647704j531191j396364j347821j355707j256078j171307
11908C5808189j097401j007759j034496r89836r04605r79799r61933q80340q50019
11899B7102001q48605p80612o84951o61181o24405o22075n70185n60734n87327
11890B1161926n12594m81639m71065m79227m41621m30185n11741m08394l95806
11881A7029654l99008m03530l80015l34924l32769l34387k97311k46068k33156
11872A4068486k35449k51749k43934k69190l32094k95147k92371k53936l15685
11863A1578931l00641k62128k72750k45652k14951j87393j74988j95085j74575
$$ plain form
11854 9550768 9353785 9165338 9034970 8856645 8678929 8495196 8389923 8257705 8129430
11845 8129430 8001704 7866094 7744223 7681376 7591898 7471260 7368435 7272595 7163738 7033037
11835 7033037 6928904 6828475 6728701 6627971 6536885 6479285 6437619 6324264 6231313 6210079
11825 6210079 6201953 6160377 6106602 6084216 6061182 6033357 5995912 5999296 5973677 5928819 5843850 5757258
11813 5757258 5663488 5567788 5436178 5334567 5242905 5133234 5012479 4921252 4849486 4743982
11803 4743982 4625224 4562877 4539639 4525526 4463602 4376354 4288425 4258137 4242672 4223173 4223960
11792 4223960 4190295 4132473 4078503 4054806 4008584 3966617 3941505 3868749 3813031 3753570 3695868
11781 3695868 3658286 3611422 3561810 3511319 3463618 3392307 3364446 3332657 3327015 3284554 3235826
$$ packed form
11854I550768j96983j88447j30368j78325j77716j83733j05273j32218j28275
11845H129430j27726j35610j21871o2847q9478j20638j02825r5840j08857j30701
11835G033037j04133j00429r9774j00730r1086n7600m1666j13355r2951k1234
11825F210079q126m1576n3775k2386k3034k7825l7445L384k5619m4858q4969q6592
11813E757258r3770r5700j31610j01611r1662j09671j20755r1227p1766j05504
11803D743982j18758o2347k3238j4113o1924q7248q7929l0288j5465j9499P87
11792D223960l3665n7822n3970k3697m6222m1967k5112p2756n5718n9461n7702
11781C695868l7582m6864m9612n0491m7701p1311k7861l1789n642m2461m8728
$$ plain form
11770 3235826 3235476 3188884 3165299 3136075 3115652 3073629 3019627 3022856 3015237 2979654 2948999 2928401
11758 2928401 2939329 2903305 2870012 2874849 2928827 2931932 2924722 2926900 2937074 2937754 2867072 2851217
11746 2851217 2829400 2800693 2777935 2709470 2690860 2677182 2654191 2608746 2606692 2636915 2640512 2630404
11734 2630404 2618425 2618302 2556925 2499708 2455930 2437310 2402402 2384410 2387554 2430351 2435724 2385012
11722 2385012 2356366 2345742 2331463 2283291 2288187 2309636 2314446 2267897 2214253 2213050 2224354 2156876
11710 2156876 2144040 2148584 2148464 2139261 2113410 2083725 2055828 2086239 2108769 2151929 2155516 2109321
11698 2109321 2117022 2131786 2154217 2171256 2159916 2099867 2026537 2006019 2001114 1984336 2034418 2049358
11686 2049358 2055634 2033287 2005748 2022444 2005820 1935713 1902057 1911355 1945214 1948714 1922206 1907450
$$ packed form
11770C235826l50m6592k3585k9224k0423m2023n4002L229p619l5583l0655k0598
11758B928401J0928l6024l3293M837N3978L105p210K178J0174O80p0682j5855
11746B851217k1817k8707k2758o8465j8610j3678k2991m5445k054L0223L597j0108
11734B630404j1979j23o1377n7217m3778j8620l4908j7992L144M2797N373n0712
11722B385012k8646j0624j4279m8172M896K1449M810m6549n3644j203J1304o7478
11710B156876j2836M544j20r203k5851k9685k7897L0411K2530M3160L587m6195
11698B109321P701J4764K2431J7039j1340o0049p3330k0518m905j6778N0082J4940
11686B049358O276k2347k7539J6696j6624p0107l3656R298L3859L500k6508j4756
$$ plain form
11674 1907450 1916673 1927433 1869626 1859393 1860633 1826678 1794730 1795030 1778314 1770865 1795372 1753197
11662 1753197 1720685 1771264 1763622 1703033 1643651 1643438 1650976 1619622 1614483 1600302 1576515 1588270
11650 1588270 1588192 1566451 1558948 1553040 1561988 1578745 1592158 1579439 1579982 1611769 1633183 1641757 1670815
11637 1670815 1621085 1586145 1604487 1627558 1610116 1580566 1593955 1616934 1580354 1530403 1536142
11626 1536142 1586890 1613889 1543310 1512926 1496081 1466277 1480824 1495601 1507063 1499871 1489877 1467990
11614 1467990 1429356 1418003 1442662 1455787 1459867 1434639 1397291 1355007 1362170 1384050 1411560 1415377
11602 1415377 1419532 1384783 1339140 1308332 1320573 1356480 1367480 1358904 1331453 1326349 1346669 1389921
11590 1389921 1414641 1434886 1404141 1346037 1357430 1376387 1370791 1341439 1289868 1290078 1276799 1250725
$$ packed form
11674A907450R223J0760n7807j0233J240l3955l1948L00j6716p449K4507m2175
11662A753197l2512N0579p642o0589n9382k13P538l1354n139j4181k3787J1755
11650A588270p8k1741p503n908Q948J6757J3413j2719N43L1787K1414Q574K9058
11637A670815m9730l4940J8342K3071j7442k9550J3389K2979l6580m9951N739
11626A536142N0748K6999p0579l0384j6845k9804J4547J4777J1462p192r994k1887
11614A467990l8634j1353K4659J3125M080k5228l7348m2284P163K1880K7510L817
11602A415377M155l4749m5643l0808J2241L5907J1000q576k7451n104K0320M3252
11590A389921K4720K0245l0745n8104J1393J8957n596k9352n1571K10j3279k6074
$$ plain form
11578 1250725 1261642 1295080 1315863 1323696 1305772 1304184 1312908 1295205 1272233 1248424 1236912 1271934
11566 1271934 1304052 1314064 1328577 1353236 1340470 1301498 1299332 1277670 1258205 1246605 1275695
11555 1275695 1331547 1320868 1266472 1231614 1241470 1233216 1219497 1230937 1220091 1217903 1239867 1266828
11543 1266828 1285881 1265979 1281769 1321452 1293249 1272319 1282095 1303187 1319450 1318912 1311323 1302968
11531 1302968 1338883 1320705 1277799 1276112 1245575 1244759 1257296 1275250 1240041 1221369 1203007 1195231
11519 1195231 1230606 1287654 1333487 1370584 1381941 1397231 1394916 1404402 1448071 1543233 1677507
11508 1677507 1854204 2075857 2319820 2583459 2849464 3080348 3205042 3242171 3279354 3273847
11498 3273847 3210168 3043945 2778435 2446369 2203071 2005328 1855589 1711865 1610364 1556020
$$ packed form
11578A250725J0917L3438K0783P833j7924j588Q724j7703k2972k3809j1512L5022
11566A271934L2118J0012J4513K4659j2766l8972k166k1662j9465j1600K9090
11555A275695N5852j0679n4396l4858R856q254j3719J1440j0846k188K1964K6961
11543A266828J9053j9902J5790L9683k8203k0930R776K1092J6263n38p589q355
11531A302968L5915j8178m2906j687l0537q16J2537J7954l5209j8672j8362p776
11519A195231L5375N7048M5833L7097J1357J5290k315R486M3669R5162J34274
11508A677507J76697K21653K43963K63639K66005K30884J24694L7129L7183n507
11498C273847o3679j66223k65510l32066k43298j97743j49739j43724j01501n4344
$$ plain form
11488 1556020 1538682 1516395 1483108 1471634 1417150 1375505 1376854 1353651 1342404 1324752 1282892
11477 1282892 1273675 1237838 1207472 1233148 1269471 1307243 1408082 1512623 1563173 1570151 1584613
11466 1584613 1607636 1584439 1567861 1515586 1417809 1324851 1265694 1234423 1207056 1207565 1146006 1097606
11454 1097606 1130221 1137347 1139965 1105708 1087678 1073156 1067095 1075810 1085572 1073114 1053292 1049103
11442 1049103 1018311 1000884 1020932 1024245 1005022 998183 984508 968072 1010614 1032165 1031623 1054826
11430 1054826 1096912 1049744 1059608 1075668 1083983 1058916 1042185 1064106 1057638 1034722 1029613 1024703
11418 1024703 1026946 1051436 1082190 1062179 1040173 1037332 1036211 1038137 1081085 1059904 1042621 1052820
11406 1052820 1017205 1017442 1022825 1030942 992614 966635 982588 998464 995667 999167 986245 982633 967276
$$ packed form
11488A556020j7338k2287l3287j1474n4484m1645J349k3203j1247j7652m1860
11477A282892r217l5837l0366K5676L6323L7772J00839J04541N0550O978J4462
11466A584613K3023k3197j6578n2275r7777r2958n9157l1271k7367N09o1559m8400
11454A097606L2615P126K618l4257j8030j4522o061Q715R762j2458j9822m189
11442A049103l0792j7427K0048L313j9223o839j3675j6436M2542K1551n42K3203
11430A054826M2086m7168R864J6060Q315k5067j6731K1921o468k2916n109m910
11418A024703K243K4490L0754k0011k2006k841j121J926M2948k1181j7283J0199
11406A052820l5615K37N383Q117l8328k5979J5953J5876k797L500j2922l612j5357
$$ plain form
11393 967276 954398 957962 949773 916744 924457 962441 970935 980303 1009271 1007007 1000587 1030423 1022193
11380 1022193 1035175 1057295 1025459 1026272 1003335 976135 965731 996298 970313 947843 976519 985314
11368 985314 977515 991509 996582 953184 929166 957511 997507 1022993 1054862 1100719 1060361 1034752
11356 1034752 1027625 1048507 1102481 1140042 1104084 1091522 1105159 1093417 1076193 1047938 1072837
11345 1072837 1144722 1158312 1171679 1139099 1168991 1207207 1269031 1336018 1411988 1443945 1481267
11334 1481267 1501426 1540376 1532589 1510789 1462677 1469362 1434732 1343121 1251623 1194112 1142298 1119648
11322 1119648 1068890 1038584 1054043 1062968 1060052 1072719 1071059 1071013 1058704 1049294 1057106 1093591 1081786
11309 1081786 1060817 1042836 1047002 1055065 1033922 1023500 995429 976083 953044 938229 916205 900151
$$ packed form
11393I67276j2878L564q189l3029P713L7984Q494R368K8968k264o420K9836q230
11380A022193J2982K2120l1836Q13k2937k7200j0404L0567k5985k2470K8676Q795
11368I85314p799J3994N073m3398k4018K8345L9996K5486L1869M5857m0358k5609
11356A034752p127K0882N3974L7561l5958j2562J3637j1742j7224k8255K4899
11345A072837P1885J3590J3367l2580K9892L8216O1824O6987P5970L1957L7322
11334A481267K0159L8950p787k1800m8112O685l4630r1611r1498n7511n1814k2650
11322A119648n0758l0306J5459Q925k916J2667j660m6j2309r410P812L6485j1805
11309A081786k0969j7981M166Q063k1143j0422k8071j9346k3039j4815k2024j6054
$$ plain form
11297 900151 903751 943819 937234 962871 980268 977553 944697 909536 914904 915189 916015 925650 919853
11284 919853 962718 982453 983623 996545 1016136 1008638 1006228 1023547 1014867 1007001 1008682 1031608 1052275
11271 1052275 1036967 1015119 990535 993342 1042423 1031030 1012629 1000951 1025001 1010954 1019502 1064534
11259 1064534 1077724 1067003 1064565 1041396 1036447 1073441 1064753 988532 946930 956472 1007638 1019206
11247 1019206 1040425 1017675 1007730 1001224 1022307 1025249 1009193 1017473 1018328 1034664 1053305 1059155 1101475
11234 1101475 1115486 1121322 1163436 1241237 1306633 1323758 1345091 1360628 1361807 1352166 1323210 1269975
11222 1269975 1184625 1103953 1085539 1030699 1024547 1033531 1018510 1025318 1030801 1034512 1023607 1049979
11210 1049979 1074473 1059149 1098597 1112645 1119282 1093997 1056458 1064007 1095546 1150968 1127649 1070431
$$ packed form
11297I00151L600M0068o585K5637J7397k715l2856l5161N368K85Q26R635n797
11284I19853M2865J9735J170J2922J9591p498k410J7319q680p866J681K2926K0667
11271A052275j5308k1848k4584K807M9081j1393j8401j1678K4050j4047Q548M5032
11259A064534J3190j0721k438k3169m949L6994q688p6221m1602R542N1166J1568
11247A019206K1219k2750r945o506K1083K942j6056Q280Q55J6336J8641N850M2320
11234A101475J4011N836M2114P7801O5396J7125K1333J5537J179r641k8956n3235
11222A269975q5350q0672j8414n4840o152Q984j5021O808N483L711j0905K6372
11210A049979K4494j5324L9448J4048O637k5285l7539P549L1539N5422k3319n7218
$$ plain form
11198 1070431 1075801 1118657 1089812 1082300 1063035 1023416 1014549 1041605 1063763 1068720 1061855 1035726
11186 1035726 1044211 1057679 1087520 1079800 1077485 1047255 1023849 998775 995102 1020909 1050001 1045613
11174 1045613 1021593 992354 981224 1018536 1016340 1013879 997572 1006434 1002285 1039211 1109607 1157250
11162 1157250 1223407 1322508 1489574 1664795 1809670 1926770 2014549 2085289 2138148 2217958
11152 2217958 2208264 2128641 1991424 1866498 1756940 1590619 1437652 1333611 1326875 1306943
11142 1306943 1285425 1271751 1242891 1245036 1248400 1216220 1199786 1138897 1109992 1096603 1107846 1131470
11130 1131470 1170613 1166478 1129757 1153153 1161172 1205958 1227639 1204461 1214243 1219800 1198646 1159942
11118 1159942 1144222 1164868 1178146 1170266 1173735 1203148 1157874 1134700 1145216 1133678 1114225 1117771
$$ packed form
11198A070431N370M2856k8845p512j9265l9619q867K7056K2158M957o865k6129
11186A035726Q485J3468K9841p720k315l0230k3406k5074l673K5807K9092m388
11174A045613k4020k9239j1130L7312k196k461j6307Q862m149L6926P0396M7643
11162A157250O6157R9101J67066J75221J44875J17100Q7779P0740N2859P9810
11152B217958r694p9623j37217j24926j09558j66321j52967j04041o736j9932
11142A306943k1518j3674k8860K145L364l2180j6434o0889k8905j3389J1243K3624
11130A131470L9143m135l6721K3396Q019M4786K1681k3178R782N557k1154l8704
11118A159942j5720K0646J3278p880L469K9413m5274k3174J0516j1538j9453L546
$$ plain form
11106 1117771 1112053 1131975 1132733 1163446 1206682 1206543 1205126 1173499 1155407 1089218 1110498 1128340
11094 1128340 1154869 1154587 1177490 1194640 1177914 1153888 1083226 1080590 1125942 1111915 1086399 1098357
11082 1098357 1107229 1140743 1130470 1168982 1185865 1169467 1187401 1167481 1183769 1173253 1140549
11071 1140549 1144976 1189090 1249880 1256865 1233432 1227354 1258071 1214503 1194838 1166925 1165584 1150009
11059 1150009 1130829 1118939 1108570 1113637 1106932 1127458 1139705 1165986 1189159 1210567 1208423 1171797
11047 1171797 1151883 1195041 1214718 1232635 1272380 1281614 1245393 1248700 1287157 1337427 1360142 1347395
11035 1347395 1342483 1352463 1348650 1304037 1280332 1315388 1356073 1374648 1392119 1405229 1423135 1417958
11023 1417958 1458978 1481137 1464917 1450645 1505409 1535385 1542003 1585022 1632244 1654115 1674259
$$ packed form
11106A117771n718J9922P58L0713M3236j39j417l1627j8092o6189K1280J7842
11094A128340K6529k82K2903J7150j6726k4026p0662k636M5352j4027k5516J1958
11082A098357Q872L3514j0273L8512J6883j6398J7934j9920J6288j0516l2704
11071A140549M427M4114O0790O985k3433o078L0717m3568j9665k7913j341j5575
11059A150009j9180j1890j0369N067o705K0526J2247K6281K3173K1408k144l6626
11047A171797j9914M3158J9677J7917L9745R234l6221L307L8457N0270K2715j2747
11035A347395m912R980l813m4613k3705L5056M0685J8575J7471J3110J7906n177
11023A417958M1020K2159j6220j4272N4764K9976O618M3019M7222K1871K0144
$$ plain form
11012 1674259 1720065 1825916 1971217 2212230 2472571 2751508 2905141 2919651 2931483 2932590
11002 2932590 2984805 3058664 3048222 2782656 2402425 2152715 1987305 1855805 1806087 1799097
10992 1799097 1775641 1741963 1742247 1715375 1668242 1615065 1594630 1560633 1510765 1486032 1478737 1459551
10980 1459551 1418584 1405313 1378880 1342334 1373436 1406140 1401014 1383495 1377696 1404520 1441507 1461672
10968 1461672 1452643 1420244 1427264 1453309 1458897 1460812 1449099 1467524 1487740 1516872 1489792 1489518
10956 1489518 1465412 1445547 1441305 1462173 1472556 1456604 1489035 1492186 1489063 1476560 1502462 1537802
10944 1537802 1530717 1512123 1491821 1437969 1430143 1472442 1487495 1527145 1579104 1563900 1533461 1496208
10932 1496208 1492851 1442532 1439173 1470615 1465944 1453838 1481519 1464369 1434169 1400254 1391442 1377668
$$ packed form
11012A674259M5806J05851J45301K41013K60341K78937J53633J4510J1832J107
11002B932590N2215P3859j0442k65566l80231k49710j65410j31500m9718o990
10992A799097k3456l3678K84k6872m7133n3177k0435l3997m9868k4733p295j9186
10980A459551m0967j3271k6433l6546L1102L2704n126j7519n799K6824L6987K0165
10968A461672r029l2399P020K6045N588J915j1713J8425K0216K9132k7080k74
10956A489518k4106j9865m242K0868J0383j5952L2431L151l123j2503K5902L5340
10944A537802p085j8594k0302n3852p826M2299J5053L9650N1959j5204l0439l7253
10932A496208l357n0319l359L1442m671j2106K7681j7150l0200l3915q812j3774
$$ plain form
10920 1377668 1383148 1354421 1333793 1318745 1323433 1336619 1364887 1367232 1398327 1480008 1554396 1574266
10908 1574266 1602105 1637901 1676070 1743998 1749799 1755719 1692033 1606913 1585092 1573676 1556813 1523984
10896 1523984 1490509 1481742 1458354 1435344 1419235 1373212 1396868 1436949 1454339 1470139 1492124
10885 1492124 1514392 1512741 1490702 1472049 1472706 1480498 1451935 1456631 1425931 1397167 1344422 1377624
10873 1377624 1394142 1406814 1425395 1455771 1456622 1475473 1487772 1503956 1492367 1523243 1589936 1646068
10861 1646068 1704136 1749040 1828214 1918777 1999328 2154550 2381361 2637749 2949555 3317832
10851 3317832 3606555 3853509 4126584 4313136 4363233 4338503 4237738 4032802 3724326 3405267
10841 3405267 3071181 2720804 2452258 2215974 2076755 1969268 1877986 1824953 1799827 1755010
$$ packed form
10920A377668N480k8727k0628j5048M688J3186K8268K345L1095Q1681P4388J9870
10908A574266K7839L5796L8169O7928N801N920o3686q5120k1821j1416j6863l2829
10896A523984l3475q767k3388k3010j6109m6023K3656M0081J7390J5800K1985
10885A492124K2268j651k2039j8653O57P792k8563M696l0700k8764n2745L3202
10873A377624J6518J2672J8581L0376Q51J8851J2299J6184j1589L0876O6693N6132
10861A646068N8068M4904P9174R0563Q0551J55222K26811K56388L11806L68277
10851C317832K88723K46954K73075J86552N0097k4730j00765k04936l08476l19059
10841C405267l34086l50377k68546k36284j39219j07487r1282n3033k5126m4817
$$ plain form
10831 1755010 1670730 1581335 1550667 1568439 1550203 1528615 1489866 1459549 1433188 1425576 1465899
10820 1465899 1458534 1410752 1393113 1367467 1344017 1335260 1336946 1328940 1328749 1304179 1284705 1235461
10808 1235461 1273512 1276806 1232348 1190857 1172516 1185682 1194488 1180697 1144053 1150323 1179929 1191294
10796 1191294 1176783 1157019 1139564 1150452 1166110 1160610 1161791 1122085 1127465 1161559 1196830 1176172
10784 1176172 1191198 1217451 1247155 1240765 1202838 1169646 1149887 1156472 1170637 1144787 1083110 1029235
10772 1029235 1032808 1010109 994972 984359 1005351 1020205 986174 969650 991624 976366 968239 934228
10760 934228 880826 875005 894714 926774 940452 981839 961610 975079 999830 1029285 1013189 996886
10748 996886 1023739 1070719 1087738 1067764 1077499 1070161 1028385 1019732 1035529 1027553 999423 966857
$$ packed form
10831A755010q4280q9395l0668J7772j8236k1588l8749l0317k6361p612M0323
10820A465899p365m7782j7639k5646k3450q757J686q006j91k4570j9474m9244
10808A235461L8051L294m4458m1491j8341J3166Q806j3791l6644O270K9606J1365
10796A191294j4511j9764j7455J0888J5658n500J181l9706N380L4094L5271k0658
10784A176172J5026K6253K9704o390l7927l3192j9759O585J4165k5850o1677n3875
10772A029235L573k2699j5137j0613K0992J4854l4031j6524K1974j5258q127l4011
10760I34228n3402n821J9709L2060J3678M1387k0229J3469K4751K9455j6096j6303
10748I96886K6853M6980J7019j9974R735p338m1776q653J5797p976k8130l2566
$$ plain form
10736 966857 962422 930307 883261 873989 907404 925381 914331 934132 980899 983037 951392 880744
10724 880744 868197 931514 961214 959514 947012 954218 983195 991118 975632 991616 1021423 1016524
10712 1016524 988026 962530 976575 1000922 1036729 1105460 1131330 1175401 1164670 1184879 1182315
10701 1182315 1166055 1181213 1137680 1070222 1021137 1010542 1017322 984257 980026 986207 979606 933337
10689 933337 914453 904038 902212 920467 967380 963847 951918 920370 898886 888424 889761 911996
10677 911996 911193 910456 875714 848897 888210 905127 913222 955628 969678 955853 976940 999653
10665 999653 1004873 1016114 1000033 977371 966501 961267 996080 1028992 1032186 1005852 985169 973171
10653 973171 994477 1005770 995025 956529 969962 987000 973646 1006764 1023149 1001978 984668
$$ packed form
10736I66857m435l2115m7046r272L3415J7977j1050J9801M6767K138l1645p0648
10724H80744j2547O3317K9700j700j2502P206K8977P923j5486J5984K9807m899
10712A016524k8498k5496J4045K4347L5807O8731K5870M4071j0731K0209k564
10701A182315j6260J5158m3533o7458m9085j0595O780l3065m231O181o601m6269
10689I33337j8884j0415j826J8255M6913l533j1929l1548k1484j0462J337K2235
10677I11996q03p37l4742k6817L9313J6917Q095M2406J4050j3825K1087K2713
10665I99653N220J1241j6081k2662j0870n234L4813L2912L194k6334k0683j1998
10653I73171K1306J1293j0745l8496J3433J7038j3354L3118J6385k1171j7310
$$ plain form
10642 984668 1002952 1048095 1085676 1177935 1267673 1366009 1501492 1601628 1719397 1848643 1987516
10631 1987516 2120655 2273816 2430749 2631470 2928008 3334537 3838575 4575084 5567446
10622 5567446 6829865 8269215 9806197 11346389 12767223 14012077 15145899 16255905
10614 16255905 17410809 18566488 19651734 20794459 22312379 24346865 26716341 29005880
10606 29005880 30923218 32425712 33719419 34944731 36086783 37002707 37462445 37675887
10598 37675887 38400422 40092045 42442451 44729384 46451122 47678372 48600996 49250416
10590 49250416 49475157 48879634 47109094 44602371 42517647 41423178 40957045 40592778 40123961
10581 40123961 39523162 38859104 38081274 37137107 35669666 33409687 30725225 28291484 26606575
$$ packed form
10642I84668J8284M5143L7581R2259Q9738R8336J35483J00136J17769J29246J38873
10631A987516J33139J53161J56933K00721K96538M06529N04038P36509R92362
10622E567446J262419J439350J536982J540192J420834J244854J133822J110006
10614A6255905J154904J155679J085246J142725J517920K034486K369476K289539
10606B9005880J917338J502494J293707J225312J142052R15924M59738K13442
10598C7675887P24535J691623K350406K286933J721738J227250R22624O49420
10590D9250416K24741n95523j770540k506723k084724j094469m66133l64267m68817
10581D0123961o00799o64058p77830r44167j467441k259979k684462k433741j684909
$$ plain form
10572 26606575 25496962 24605649 23747091 22886068 22023323 21084562 19970731 18581295 16918671
10563 16918671 15098848 13409688 11985978 10878187 10059083 9395910 8820431 8380143 8007348
10554 8007348 7644759 7326470 7063554 6879720 6672222 6495600 6329711 6141547 5944657
10545 5944657 5787354 5696075 5645503 5518274 5398586 5289643 5194433 5114196 5031713 4959544
10535 4959544 4842553 4723527 4618553 4497651 4381926 4250079 4113210 3985817 3896889 3895166
10525 3895166 3806752 3694273 3617143 3574005 3514271 3498209 3419412 3368110 3301218 3274210 3270947
10514 3270947 3311086 3373470 3430903 3442914 3409668 3393343 3380942 3380698 3376838 3332129 3310761 3304808
10502 3304808 3297756 3311633 3311545 3341425 3412319 3470503 3509040 3598910 3672925 3696958 3732713 3806778
$$ packed form
10572B6606575j109613q91313q58558q61023q62745r38761j113831j389436j662624
10563A6918671j819823j689160j423710j107791q19104o63173n75479m40288l72795
10554H007348l62589l18289k62916j83834k07498j76622j65889j88164j96890
10545E944657j57303r1279n0572j27229j19688j08943r5210q0237q2483p2169
10535D959544j16991j19026j04974j20902j15725j31847j36869j27393q8928j723
10525C895166q8414j12479p7130m3138n9734j6062p8797n1302o6892k7008l263
10514C270947M0139O2384N7433J2011l3246j6325j2401k44l860m4709k1368n953
10502C304808p052J3877q8K9880P0894N8184L8537Q9870P4015K4033L5755P4065
$$ plain form
10490 3806778 3918041 4013048 4115474 4220037 4335422 4490207 4706226 4926932 5106203 5284983
10480 5284983 5491855 5723620 5976098 6286832 6653946 7136687 7697274 8349941 9117252
10471 9117252 10001468 10976863 12001789 13080797 14238267 15534912 17023482 18722194
10463 18722194 20706714 23079154 26032346 29753569 34556697 40806489 49185481 60651359
10455 60651359 76511254 98583000 128716056 168053047 215577283 267223556 316893879
10448 316893879 359827278 392679505 414244469 426117298 428686635 418506345 392247106
10441 392247106 351989605 301729112 247656188 198812052 160214353 131782449 111375963
10434 111375963 96672693 85813512 77471419 70809663 65294687 60695380 56833349 53542351
$$ packed form
10490C806778J11263R5007J02426J04563J15385J54785K16019K20706J79271J78780
10480E284983K06872K31765K52478L10734L67114M82741N60587O52667P67311
10471I117252Q84216R75395J024926J079008J157470J296645J488570J698712
10463A8722194J984520K372440K953192L721223M803128O249792Q378992J1465878
10455F0651359J5859895K2071746L0133056L9336991M7524236N1646273M9670323
10448C16893879M2933399L2852227K1564964J1872829K569337j0180290k6259239
10441C92247106m0257501n0260493n4072924m8844136l8597699k8431904k0406486
10434A11375963j4703270j0859181q342093o661756n514976m599307l862031l290998
$$ plain form
10426 53542351 50646021 48050848 45655693 43437191 41380830 39417204 37564531 35773256
10418 35773256 34078361 32445464 30959589 29602956 28395615 27309136 26349704 25451656
10410 25451656 24635399 23910737 23280794 22657386 22061284 21543029 21038601 20540370 20095319
10401 20095319 19733454 19458151 19305081 19310463 19457201 19640755 19721888 19663212 19535783 19398143
10391 19398143 19215793 18943360 18454180 17585729 16628834 15726284 14958773 14287448 13724861
10382 13724861 13210417 12702257 12219018 11748526 11346172 10957766 10636726 10355339 10096495
10373 10096495 9855725 9666076 9476984 9272357 9164168 9011990 8797914 8551879 8336335
10364 8336335 8137902 7943234 7704260 7503150 7270926 7058811 6879982 6738595 6577712
$$ packed form
10426E3542351k896330k595173k395155k218502k056361j963626j852673j791275
10418C5773256j694895j632897j485875j356633j207341j086479r59432q98048
10410B5451656q16257p24662o29943o23408n96102n18255n04428m98231m45051
10401B0095319l61865k75303j53070N382J46738J83554Q1133n8676j27429j37640
10391A9398143j82350k72433m89180q68451r56895r02550p67511o71325n62587
10382A3724861n14444n08160m83239m70492m02354l88406l21040k81387k58844
10373A0096495k40770j89649j89092k04627j08189j52178k14076k46035k15544
10364H336335j98433j94668k38974k01110k32224k12115j78829j41387j60883
$$ plain form
10355 6577712 6396830 6214333 6043826 5899108 5752452 5604622 5486539 5361297 5253110
10346 5253110 5198665 5145386 5078633 4996184 4898577 4775999 4695713 4636554 4545339 4466986 4399420
10335 4399420 4346833 4300544 4262831 4207230 4183199 4137332 4114701 4098120 4074212 4061078 4047430
10324 4047430 4053862 4024267 4040623 4081147 4048865 3990743 3921272 3866070 3828542 3770601 3697728
10313 3697728 3667141 3591237 3497520 3384654 3286249 3191382 3107508 3043181 2988473 2949099 2940607
10302 2940607 2903892 2859747 2798419 2741905 2694853 2705541 2662472 2608868 2608209 2592766 2541183 2531002
10290 2531002 2513978 2527930 2527287 2501425 2488485 2458878 2432859 2388881 2359850 2340119 2301098 2255203
10278 2255203 2201526 2215270 2173001 2171467 2167470 2139297 2117095 2075861 2088575 2068130 2048485 2035872
$$ packed form
10355F577712j80882j82497j70507j44718j46656j47830j18083j25242j08187
10346E253110n4445n3279o6753q2449r7607j22578q0286n9159r1215p8353o7566
10335D399420n2587m6289l7713n5601k4031m5867k2631j6581k3908j3134j3648
10324D047430O432k9595J6356M0524l2282n8122o9471n5202l7528n7941p2873
10313C697728l0587p5904r3717j12866r8405r4867q3874o4327n4708l9374q492
10302B940607l6715m4145o1328n6514m7052J0688m3069n3604o59j5443n1583j0181
10290B531002j7024J3952o43k5862j2940k9607k6019m3978k9031j9731l9021m5895
10278B255203n3677J3744m2269j534l997k8173k2202m1234J2714k0445j9645j2613
$$ plain form
10266 2035872 2045165 2044695 2061679 2001776 1962636 1971348 1970073 1975435 1963003 1951925 1957260 2001599 2076151
10253 2076151 2106076 2090911 2111346 2167882 2198303 2152620 2087855 2078022 2079497 2067193 2057780 2034798
10241 2034798 2039670 2065250 2083176 2038218 2043564 2024844 1982425 1931091 1920160 1900061 1877902 1841433
10229 1841433 1807658 1780212 1744541 1784811 1820637 1792495 1796990 1760896 1740780 1727478 1722564 1748129
10217 1748129 1724915 1690697 1679889 1716869 1717842 1744480 1753459 1743047 1736610 1724191 1734499 1720502
10205 1720502 1676623 1675953 1682868 1706884 1698020 1681951 1673073 1729752 1733679 1743111 1770294 1830319 1849196
10192 1849196 1890450 1897481 1882596 1889651 1878512 1873705 1883809 1914179 1887896 1877739 1865473 1817821
10180 1817821 1768323 1743563 1742748 1721292 1718371 1775335 1804306 1823123 1844661 1860882 1974987 2101191
$$ packed form
10266B035872R293m70J6984n9903l9140Q712j275N362j2432j1078N335M4339P4552
10253B076151K9925j5165K0435N6536L0421m5683o4765r833J475j2304r413k2982
10241B034798M872K5580J7926m4958N346j8720m2419n1334j0931k0099k2159l6469
10229A841433l3775k7446l5671M0270L5826k8142M495l6094k0116j3302m914K5565
10217A748129k3214l4218j0808L6980R73K6638Q979j0412o437j2419J0308j3997
10205A720502m3879o70O915K4016q864j6069q878N6679L927R432K7183O0025J8877
10192A849196M1254P031j4885P055j1139m807J0104L0370k6283j0157j2266m7652
10180A817821m9498k4760q15k1456k921N6964K8971J8817K1538J6221J14105J26204
$$ plain form
10168 2101191 2209420 2296393 2352548 2374979 2368318 2384761 2422266 2418713 2382914 2298713 2210143
10157 2210143 2137808 2045251 1966199 1898708 1877803 1824644 1780606 1703097 1629987 1612611 1589110
10146 1589110 1535726 1492128 1483815 1491096 1472207 1466722 1496995 1533328 1624253 1732946 1845366
10135 1845366 1922173 1988573 2040099 2058028 2062170 2073215 2011572 1913736 1814896 1728553 1687469
10124 1687469 1607255 1553229 1540807 1500216 1514195 1573891 1627813 1625971 1617923 1658384 1693586 1728823
10112 1728823 1775370 1828775 1810807 1811799 1812689 1803944 1782948 1800223 1820674 1815827 1804729 1795993 1780228
10099 1780228 1796187 1790968 1792515 1776940 1759896 1714152 1762515 1793629 1813617 1836800 1852417 1821095
10087 1821095 1812034 1792683 1806166 1829677 1831754 1836626 1850062 1811696 1818435 1863044 1865917 1884361
$$ packed form
10168B101191J08229Q6973N6155K2431o661J6443L7505l553l5799q4201q8570
10157B210143p2335r2557p9052o7491k0905n3159m4038p7509p3110j7376k3501
10146A589110n3384m3598q313P281j8889n485L0273L6333R0925J08693J12420
10135A845366P6807O6400N1526J7929M142J1045o1643r7836r8840q6343m1084
10124A687469q0214n4026j2422m0591J3979N9696N3922j842q048M0461L5202L5237
10112A728823M6547N3405j7968R92Q90q745k0996J7275K0451m847j1098q736j5765
10099A780228J5959n219J547j5575j7044m5744M8363L1114J9988K3183J5617l1322
10087A821095r061j9351J3483K3511K077M872J3436l8366O739M4609K873J8444
$$ plain form
10075 1884361 1854657 1881156 1918195 1953934 2029698 2094670 2123406 2123480 2132680 2153470 2128321 2121278
10063 2121278 2115376 2075449 2025028 1983534 1932465 1952551 1946758 1955664 1980039 1979116 1983364 1997388
10051 1997388 2055760 2106226 2177767 2210934 2306254 2488488 2700820 2881814 3110067 3441551
10041 3441551 3782294 4078181 4343008 4556334 4714555 4869878 4951619 4927075 4867939 4753508
10031 4753508 4618775 4507118 4402058 4377511 4429100 4517565 4627729 4801209 5021909 5291858
10021 5291858 5624784 5982553 6375209 6877103 7420134 8051663 8811004 9652567 10570104
10012 10570104 11663460 12893374 14341930 15962227 17821980 19951396 22452043 25474570
10004 25474570 29267781 34091367 40361514 48639171 59692050 74401279 93635975 117580320
$$ packed form
10075A884361k9704K6499L7039L5739P5764O4972K8736P4R200K0790k5149p043
10063B121278n902l9927n0421m1494n1069K0086n793Q906K4375r23M248J4024
10051A997388N8372N0466P1541L3167R5320J82234K12332J80994K28253L31484
10041C441551L40743K95887K64827K13326J58221J55323Q1741k4544n9136j14431
10031D753508j34733j11657j05060k4547N1589Q8465J10164J73480K20700K69949
10021E291858L32926L57769L92656N01894N43031O31529P59341Q41563R17537
10012A0570104J093356J229914J448556J620297J859753K129416K500647L022527
10004B5474570L793211M823586O270147Q277657J1052879J4709229J9234696K3944345
$$ plain form
9996 117580320 145382102 175207651 205368595 235182855 263789879 291113238 316756649
9989 316756649 338137424 351152977 354339910 348576963 334283651 315231633 294416693
9982 294416693 271415709 245167092 216994973 187506664 158493195 133240581 113064912
9975 113064912 97636127 86090569 77282434 70410962 64849417 60188534 56226034 52754288
9967 52754288 49663439 46881853 44360575 42021455 39855365 37833454 36003904 34316549
9959 34316549 32705118 31227179 29845559 28528274 27361078 26303547 25311271 24378159
9951 24378159 23506848 22683642 21909010 21191889 20521891 19880383 19262129 18684948 18207045
9942 18207045 17788038 17369714 17047975 16816498 16630289 16566388 16599780 16756165 16949388 16985118
$$ packed form
9996A17580320K7801782K9825549L0160944K9814260K8607024K7323359K5643411
9989C16756649K1380775J3015553L186933n762947j4293312j9052018k0814940
9982B94416693k3000984k6248617k8172119k9488309k9013469k5252614k0175669
9975A13064912j5428785j1545558q808135o871472n561545m660883l962500l471746
9967E2754288l090849k781586k521278k339120k166090k021911j829550j687355
9959C4316549j611431j477939j381620j317285j167196j057531r92276r33112
9951B4378159q71311q23206p74632p17121o69998o41508o18254n77181m77903
9942A8207045m19007m18324l21739k31477j86209o3901L3392J56385J93223L5730
$$ plain form
9932 16985118 16879161 16638962 16387130 16208927 16085934 15817545 15419323 14946722 14417638
9923 14417638 13965215 13675758 13526374 13490017 13522565 13542954 13306703 12864072 12327738 11895044
9913 11895044 11606235 11253880 10830390 10317640 9737625 9223674 8810032 8478687 8186802
9904 8186802 7950111 7759264 7557365 7343424 7178626 7037951 6868963 6700079 6537545 6424354
9894 6424354 6300171 6187399 6070545 5990813 5866682 5764073 5682792 5632703 5623156 5599438 5519905
9883 5519905 5432201 5361952 5327340 5287689 5201746 5100396 5030668 4953487 4842513 4748354 4756727
9872 4756727 4747881 4688536 4586949 4524051 4520233 4484237 4455190 4414553 4368452 4358879 4383805 4394827
9860 4394827 4390026 4362693 4304546 4190920 4109466 4070371 4035304 3965863 3904512 3814372 3769983
$$ packed form
9932A6985118j05957k40199k51832j78203j22993k68389l98222m72601n29084
9923A4417638m52423k89457j49384l6357L2548K0389k36251m42631n36334m32694
9913A1895044k88809l52355m23490n12750n80015n13951m13642l31345k91885
9904H186802k36691j90847k01899k13941j64798j40675j68988j68884j62534j13191
9894F424354j24183j12772j16854p9732j24131j02609q1281n0089r547k3718p9533
9883E519905q7704p0249l4612l9651q5943j01350o9728p7181j10974r4159Q373
9872D756727q846n9345j01587o2898l818l5996k9047m0637m6101r573K4926J1022
9860D394827m801k7333n8147j13626q1454l9095l5067o9441o1351r0140m4389
$$ plain form
9849 3769983 3766310 3733382 3674344 3601031 3540273 3513368 3486836 3425779 3378671 3381665 3360565 3316001
9837 3316001 3253475 3166066 3127141 3103429 3115972 3085683 3049548 3034962 3025086 2989397 2942608 2927734
9825 2927734 2922161 2870345 2824071 2748135 2754336 2761180 2733666 2745072 2705814 2648447 2599724 2570578
9813 2570578 2523004 2505987 2489599 2479272 2460914 2448900 2456638 2451009 2409931 2391768 2397980 2435399
9801 2435399 2417178 2426561 2441759 2470218 2496974 2500754 2482721 2430262 2387738 2396884 2383659 2373134
9789 2373134 2386944 2347824 2316608 2305534 2301372 2264597 2266982 2292352 2307998 2277734 2219074 2200400
9777 2200400 2199086 2264383 2257864 2248280 2206078 2173421 2139747 2151020 2149871 2104471 2072993 2035979
9765 2035979 2002648 1984861 1994984 2033590 2059997 2063849 2084615 2088747 2102588 2083739 2036284 2042291
$$ packed form
9849C769983l673l2928n9038p3313o0758k6905k6532o1057m7108K994k1100m4564
9837C316001o2526q7409l8925k3712J2543l0289l6135j4586r876l5689m6789j4874
9825B927734n573n1816m6274p5936O201O844k7514J1406l9258n7367m8723k9146
9813B570578m7574j7017j6388j0327j8358j2014P738n629m1078j8163O212L7419
9801B435399j8221R383J5198K8459K6756L780j8033n2459m2524R146j3225j0525
9789B373134J3810l9120l1216j1074m162l6775K385K5370J5646l0264n8660j8674
9777B200400j314O5297o519r584m2202l2657l3674J1273j149m5400l1478l7014
9765B035979l3331j7787J0123L8606K6407L852K0766M132J3841j8849m7455O007
$$ plain form
9753 2042291 2098017 2114101 2158066 2248796 2312621 2342236 2360418 2359336 2336146 2346781 2353277 2313478
9741 2313478 2222057 2087785 2004525 1972834 1970963 1971115 1963317 2002816 1989913 1915208 1890309 1848694
9729 1848694 1851655 1868565 1866688 1860638 1852427 1824995 1772667 1791279 1779647 1730466 1738186 1763806
9717 1763806 1752472 1770948 1774648 1729962 1723503 1718437 1689387 1709815 1697010 1690720 1677635 1676094
9705 1676094 1665269 1654856 1649378 1655170 1645629 1612921 1570406 1561497 1553647 1535307 1503027 1513649
9693 1513649 1524679 1510230 1510554 1484952 1471950 1508065 1540120 1527453 1493214 1507401 1530318 1557827
9681 1557827 1566206 1593303 1576008 1569684 1590237 1606377 1601510 1596694 1603178 1606612 1628707 1602995 1596200
9668 1596200 1611108 1633220 1681225 1723603 1732013 1769355 1844263 1962757 2154044 2424323 2754872
$$ packed form
9753B042291N5726J6084M3965R0730O3825K9615J8182j082k3190J0635O496l9799
9741B313478r1421j34272q3260l1691j871J52p798L9499j2903p4705k4899m1615
9729A848694K961J6910j877o050q211k7432n2328J8612j1632m9181P720K5620
9717A763806j1334J8476L700m4686o459n066k9050K0428j2805o290j3085j541
9705A676094j0825j0413n478N792r541l2708m2515q909p850j8340l2280J0622
9693A513649J1030j4449L24k5602j3002L6115L2055j2667l4239J4187K2917K7509
9681A557827Q379K7097j7295o324K0553J6140m867m816O484L434K2095k5712o795
9668A596200J4908K2112M8005M2378Q410L7342P4908J18494J91287K70279L30549
$$ plain form
9657 2754872 2983658 3077715 3091270 3116751 3125748 3188053 3279008 3093272 2614785 2263858 2070531
9646 2070531 1945162 1878511 1871540 1868939 1885956 1886294 1874401 1863703 1889127 1901930 1910403 1915608
9634 1915608 1917119 1985658 2091616 2268095 2499434 2768248 2986810 3104731 3251408 3507694
9624 3507694 3779176 4015982 4110422 3991533 3708294 3441452 3299664 3234261 3130935 2919883
9614 2919883 2624022 2373222 2239941 2190086 2152264 2163556 2191642 2200765 2244099 2284612 2294816
9603 2294816 2317899 2319950 2344297 2311834 2283291 2285466 2286561 2265780 2304705 2298062 2317315 2371714
9591 2371714 2489354 2653176 2744976 2887683 3038920 3182000 3242933 3329840 3473931 3570450
9581 3570450 3569459 3505381 3417126 3298006 3199350 3057085 2894373 2761160 2640256 2476266 2337034
$$ packed form
9657B754872K28786R4057J3555K5481Q997O2305R0955j85736m78487l50927j93327
9646B070531j25369o6651o971k601J7017L38j1893j0698K5424J2803Q473N205
9634A915608J511O8539J05958J76479K31339K68814K18562J17921J46677K56286
9624C507694K71482K36806R4440j18889k83239k66842j41788o5403j03326k11052
9614B919883k95861k50800j33281m9855l7822J1292K8086R123M3334M0513J0204
9603B294816K3083K051K4347l2463k8543K175J095k0781L8925o643J9253N4399
9591B371714J17640J63822R1800J42707J51237J43080O0933Q6907J44091R6519
9581C570450r91o4078q8255j19120r8656j42265j62712j33213j20904j63990j39232
$$ plain form
9570 2337034 2231546 2149801 2087952 2069365 2025542 2002731 1993763 1986073 1997055 1990790 1958805 1910248
9558 1910248 1874060 1860495 1845630 1817327 1785679 1785932 1754682 1715028 1673500 1658325 1691224 1681985
9546 1681985 1692492 1685429 1693978 1685519 1699261 1737558 1763411 1798916 1886718 2006165 2076882 2127810
9534 2127810 2189227 2191044 2204952 2277387 2323552 2230124 2130673 2040021 1982848 1923299 1863019 1820209
9522 1820209 1777155 1755207 1718719 1714710 1704270 1666495 1615295 1595646 1610216 1577336 1573586 1577116
9510 1577116 1555928 1541521 1518967 1524177 1520674 1540318 1538623 1493198 1499687 1510338 1544222 1554226
9498 1554226 1558742 1569563 1620456 1689090 1725533 1752609 1789460 1842335 1894683 1962226 1978683 1979715
9486 1979715 1936769 1891111 1876883 1854157 1761923 1729179 1682953 1629239 1598923 1577140 1578250 1602858
$$ packed form
9570B337034j05488q1745o1849j8587m3823k2811q968p690J0982o265l1985m8557
9558A910248l6188j3565j4865k8303l1648K53l1250l9654m1528j5175L2899r239
9546A681985J0507p063Q549q459J3742L8297K5853L5505Q7802J19447P0717N0928
9534B127810O1417J817J3908P2435M6165r3428r9451r0652n7173n9549o0280m2810
9522A820209m3054k1948l6488m009j0440l7775n1200j9649J4570l2880l750L530
9510A577116k1188j4407k2554N210l503J9644j695m5425O489J0651L3884J0004
9498A554226M516J0821N0893O8634L6443K7076L6851N2875N2348O7543J6457J032
9486A979715m2946m5658j4228k2726r2234l2744m6226n3714l0316k1783J110K4608
$$ plain form
9474 1602858 1566319 1534755 1567758 1592068 1632914 1631252 1579849 1528134 1537239 1546083 1515805 1573002
9462 1573002 1623170 1635136 1612423 1588778 1569154 1612699 1615968 1557676 1555850 1601562 1651073 1665743
9450 1665743 1727801 1766171 1782004 1831360 1860084 1891434 1902219 1899312 1904741 1912020 1941725 1924298
9438 1924298 1843753 1775938 1708935 1678363 1637383 1620416 1664059 1645581 1625148 1634562 1649845 1665901
9426 1665901 1701218 1728408 1740776 1768437 1801649 1855430 1913225 1946284 2022481 2102519 2180899
9415 2180899 2293906 2418317 2608261 2869786 3205443 3577579 3827776 3976817 4037924 4023873
9405 4023873 4000506 4058802 4007992 3719695 3282798 2909771 2727573 2686490 2638847 2588462 2549673
9394 2549673 2518601 2495366 2480911 2415835 2322397 2182319 2045364 1943663 1921652 1927825 1928549
$$ packed form
9474A602858l6539l1564L3003K4310M0846j662n1403n1715R105Q844l0278N7197
9462A573002N0168J1966k2713k3645j9624M3545L269n8292j826M5712M9511J4670
9450A665743O2058L8370J5833M9356K8724L1350J0785k907N429P279K9705j7427
9438A924298q0545o7815o7003l0572m0980j6967M3643j8478k0433R414J5283J6056
9426A665901L5317K7190J2368K7661L3212N3781N7795L3059P6197Q0038P8380
9415B180899J13007J24411J89944K61525L35657L72136K50197J49041O1107j4051
9405D023873k3367N8296n0810k88297m36897l73027j82198m1083m7643n0385l8789
9394B549673l1072k3235j4455o5076r3438j40078j36955j01701k2011O173P24
$$ plain form
9383 1928549 1912793 1906858 1863793 1821161 1803540 1754467 1697453 1634469 1658165 1651064 1595104 1583739
9371 1583739 1606252 1602061 1550016 1525271 1524488 1553177 1524560 1501839 1510646 1545937 1526846 1464718
9359 1464718 1457833 1477974 1459403 1467497 1434050 1404064 1426026 1430545 1425919 1394477 1326277 1316420
9347 1316420 1295455 1292763 1316042 1358263 1364714 1336278 1342211 1332971 1284256 1260182 1302683 1340719
9335 1340719 1336737 1348360 1373054 1397235 1391258 1355242 1330932 1324463 1380019 1374163 1323871 1314757
9323 1314757 1322203 1334675 1366321 1396876 1375804 1336862 1277881 1269889 1246371 1231322 1261327 1307895
9311 1307895 1340537 1320026 1274202 1211950 1222777 1267837 1242062 1194216 1227924 1212024 1186530
9300 1186530 1186287 1194756 1186851 1176957 1172322 1171694 1165729 1181785 1182360 1185863 1227630 1220085 1207194 1208637
$$ packed form
9383A928549j5756n935m3065m2632j7621m9073n7014o2984K3696p101n5960j1365
9371A583739K2513m191n2045k4745p83K8689k8617k2721Q807L5291j9091o2128
9359A464718o885K0141j8571Q094l3447k9986K1962M519m626l1442o8200r857
9347A316420k0965k692K3279M2221O451k8436N933r240m8715k4074M2501L8036
9335A340719l982J1623K4694K4181n977l6016k4310o469N5556n856n0292r114
9323A314757P446J2472L1646L0555k1072l8942n8981p992k3518j5049L0005M6568
9311A307895L2642k0511m5824o2252J0827M5060k5775m7846L3708j5900k5494
9300A186530k43Q469p905r894m635o28n965J6056N75L503M1767p545j2891J443
$$ plain form
9286 1208637 1214694 1216676 1232756 1190864 1220866 1246347 1225414 1206617 1189869 1169080 1157646 1160384
9274 1160384 1134229 1128512 1130103 1169931 1169397 1189776 1185384 1178735 1143351 1160115 1145833 1135139 1152188
9261 1152188 1183224 1189554 1174838 1182815 1180741 1171871 1153086 1120209 1148484 1167942 1170706 1197512
9249 1197512 1219678 1199889 1150233 1112136 1128281 1168854 1161204 1145986 1095923 1078168 1076779 1071340
9237 1071340 1075293 1063428 1064672 1080215 1073030 1131016 1170641 1119256 1079149 1045348 1052369 1089021
9225 1089021 1092016 1078147 1089328 1095316 1078440 1077407 1057409 1027615 1034289 1055701 1050132 1063474
9213 1063474 1064057 1032404 1023681 1022637 1046401 1060422 1048466 1057307 1028369 1016311 1036013 1062880
9201 1062880 1043197 1059143 1078600 1059704 1048396 1034966 1029329 1004116 987592 978407 995028 984462
$$ packed form
9286A208637O057J982J6080m1892L0002K5481k0933j8797j6748k0789j1434K738
9274A160384k6155n717J591L9828n34K0379m392o649l5384J6764j4282j0694J7049
9261A152188L1036O330j4716P977k074q870j8785l2877K8275J9458K764K6806
9249A197512K2166j9789m9656l8097J6145M0573p650j5218n0063j7755j389n439
9237A071340L953j1865J244J5543p185N7986L9625n1385m0107l3801P021L6652
9225A089021K995j3869J1181N988j6876j033j9998k9794O674K1412n569J3342
9213A063474N83l1653q723j044K3764J4021j1956Q841k8938j2058J9702K6867
9201A062880j9683J5946J9457j8896j1308j3430n637k5213j6524r185J6621j0566
$$ plain form
9189 984462 993690 1009867 1020577 1013816 1007587 1016831 1006391 988651 993703 994774 1031314 1038743 1023363
9176 1023363 1010983 1023321 1016208 1045984 1078240 1122163 1130282 1136067 1073159 1030910 1040543 1069975
9164 1069975 1067561 1079268 1098187 1064712 1054994 1025772 996085 1026927 1023738 967538 991111 1027876
9152 1027876 1033874 1031169 1032225 1025771 1006389 961975 932835 930094 954513 1013890 1043354 1068285
9140 1068285 1076555 1056718 1072159 1087948 1130397 1101437 1056732 1090502 1111133 1108827 1116539 1126495
9128 1126495 1123628 1105260 1107354 1084289 1056753 1069934 1101766 1109729 1119667 1153139 1167206 1160060
9116 1160060 1163783 1189187 1193230 1218747 1274859 1297531 1308191 1308856 1281203 1282635 1259506 1216459
9104 1216459 1195095 1156982 1124609 1105447 1091960 1046937 1025039 1041546 1062595 1084749 1081671 1064929
$$ packed form
9189I84462R228J6177J0710o761o229R244j0440j7740N052J071L6540P429j5380
9176A023363j2380J2338p113K9776L2256M3923Q119N785o2908m2249R633K9432
9164A069975k414J1707J8919l3475r718k9222k9687L0842l189n6200K3573L6765
9152A027876N998k705J056o454j9382m4414k9140k741K4419N9377K9464K4931
9140A068285Q270j9837J5441J5789M2449k8960m4705L3770K0631k306P712R956
9128A126495k867j8368K094k3065k7536J3181L1832P963R938L3472J4067p146
9116A160060L723K5404M043K5517N6112K2672J0660O65k7653J432k3129m3047
9104A216459k1364l8113l2373j9162j3487m5023k1898J6507K1049K2154l078j6742
$$ plain form
9092 1064929 1076019 1080183 1062836 1082317 1070565 1084181 1079688 1063972 1081232 1087596 1084948 1087876
9080 1087876 1087836 1064141 1065880 1108324 1100604 1112780 1166704 1159318 1165703 1166691 1138514 1188574 1202574
9067 1202574 1185236 1210188 1206356 1171899 1165597 1184163 1213012 1203311 1205841 1194032 1162167 1146876
9055 1146876 1168234 1153597 1136702 1158187 1167146 1167314 1174695 1160765 1165453 1152756 1128004 1109474
9043 1109474 1086828 1073417 1091004 1089702 1099320 1106056 1068174 1074007 1078601 1071950 1096124 1100989 1100884
9030 1100884 1128297 1151421 1177392 1163425 1162653 1222470 1232943 1241026 1250052 1240445 1191074 1173354
9018 1173354 1204780 1203475 1189259 1148689 1127163 1098954 1064641 1052254 1070086 1064102 1034298 1057925
9006 1057925 1086652 1124867 1156880 1120348 1111879 1116776 1128713 1124928 1117153 1101172 1088355 1064962
$$ packed form
9092A064929J1090M164j7347J9481j1752J3616m493j5716J7260O364k648K928
9080A087876m0k3695J739M2444p720J2176N3924p386O385R88k8177N0060J4000
9067A202574j7338K4952l832l4457o302J8566K8849r701K530j1809l1865j5291
9055A146876K1358j4637j6895K1485Q959J68P381j3930M688j2697k4752j8530
9043A109474k2646j3411J7587j302R618O736l7882N833M594o651K4174M865j05
9030A100884K7413K3124K5971j3967p72N9817J0473Q083R026r607m9371j7720
9018A173354L1426j305j4216m0570k1526k8209l4313j2387J7832n984k9804K3627
9006A057925K8727L8215L2013l6532q469M897J1937l785p775j5981j2817k3393
$$ plain form
8994 1064962 1092770 1071365 1073527 1111874 1067699 1024832 1043992 1050600 1091549 1100467 1084216 1092097
8982 1092097 1073107 1047401 1023144 1052258 1084958 1090523 1111228 1147933 1113135 1103505 1114437 1102250
8970 1102250 1084102 1112169 1109469 1087196 1070007 1073024 1088173 1076541 1051727 1001545 989483 1012322
8958 1012322 1018995 1007789 983306 991633 1002616 1024193 1020394 1041760 1092811 1114291 1128825 1127316
8946 1127316 1104368 1085225 1042250 1014676 1022059 1024436 1004925 994271 1016556 961525 959626 978169
8934 978169 987279 1011907 1051372 1096648 1061120 1048397 1065542 1055981 1044518 1028753 1043146 1028519
8922 1028519 1002546 1026132 1028951 1010183 1036794 1028496 992317 984838 1001200 1000890 981567 977938 957296
8909 957296 969824 957163 949653 982191 979826 997199 1005410 1025658 984969 942168 933369 911356
$$ packed form
8994A064962K7808k1405K162L8347m4175m2867J9160O608M0949Q918j6251P881
8982A092097j8990k5706k4257K9114L2700N565K0705L6705l4798r630J0932j2187
8970A102250j8148K8067k700k2273j7189L017J5149j1632k4814n0182j2062K2839
8958A012322O673j1206k4483Q327J0983K1577l799K1366N1051K1480J4534j509
8946A127316k2948j9143m2975k7574P383K377j9511j0654K2285n5031j899J8543
8934I78169R110K4628L9465M5276l5528j2723J7145r561j1463j5765J4393j4627
8922A028519k5973K3586K819j8768K6611q298l6179p479J6362l10j9323l629k0642
8909I57296J2528j2661p510L2538k365J7373Q211K0248m0689m2801q799k2013
$$ plain form
8897 911356 900482 899674 942587 995080 994215 940050 923410 923899 951655 994866 1015083 997232 978793
8884 978793 947932 919743 901493 924729 955458 969660 951784 936324 974498 1017415 964616 964569
8872 964569 970443 1004237 1026843 1073643 1093907 1061281 1023677 974364 959972 984717 984508 984571 1008182
8859 1008182 1013273 998079 1012779 1010807 1031619 997500 966383 988363 1015596 967054 957358 1031547
8847 1031547 1064611 1022760 988155 991128 1034313 1102109 1170836 1230779 1271461 1325586 1337941 1353296
8835 1353296 1335339 1331102 1339934 1337420 1287477 1266817 1237056 1229195 1159175 1127003 1098635 1095363
8823 1095363 1117642 1132508 1128792 1132886 1110689 1084508 1056886 1082095 1070680 1117656 1140317 1177571
8811 1177571 1215595 1243508 1275560 1328811 1439987 1584603 1706107 1837791 1985945 2098244
$$ packed form
8897I11356j0874q08M2913N2493q65n4165j6640M89K7756M3211K0217j7851j8439
8884I78793l0861k8189j8250K3236L0729J4202j7876j5460L8174M2917n2799m7
8872I64569N874L3794K2606M6800K0264l2626l7604m9313j4392K4745k09O3K3611
8859A008182N091j5194J4700j972K0812l4119l1117K1980K7233m8542r696P4189
8847A031547L3064m1851l4605K973M3185O7796O8727N9943M0682N4125J2355J5355
8835A353296j7957m237Q832k514m9943k0660k9761p861p0020l2172k8368l272
8823A095363K2279J4866l716M094k2197k6181k7622K5209j1415M6976K2661L7254
8811A177571L8024K7913L2052N3251J11176J44616J21504J31684J48154J12299
$$ plain form
8801 2098244 2195209 2295226 2397581 2407479 2379967 2345954 2270958 2135922 1961348 1773069 1582357
8790 1582357 1472609 1419928 1375821 1367411 1319251 1319315 1275537 1244276 1229547 1170419 1126378 1114040
8778 1114040 1086616 1124382 1108358 1127658 1149909 1155521 1105615 1084822 1091764 1065762 1053432 1069774
8766 1069774 1110676 1122381 1104277 1061341 1063317 1064112 1045617 1056076 1033615 1017849 1037089 1043114
8754 1043114 1034732 1034187 1025623 1001156 998873 1002455 1021899 1071182 1062415 1010503 1002639 961386 979361
8741 979361 1062540 1079810 1075120 1065215 1120334 1177047 1202509 1235007 1270203 1307558 1293218 1291646
8729 1291646 1313805 1283665 1271907 1246243 1231706 1211028 1152680 1125056 1110539 1094530 1099448 1039462
8717 1039462 1022382 1026619 1044961 1037099 1100506 1156389 1135820 1136568 1161658 1150539 1160401 1193346
$$ packed form
8801B098244R6965J00017J02355R898k7512l4013p4996j35036j74574j88279j90712
8790A582357j09748n2681m4107q410m8160O4m3778l1261j4729n9128m4041j2338
8778A114040k7424L7766j6024J9300K2251N612m9906k0793O942k6002j2330J6342
8766A069774M0902J1705j8104m2936J976P95j8495J0459k2461j5766J9240O025
8754A043114q382n45q564k4467k283L582J9444M9283q767n1912p864m1253J7975
8741I79361Q3179J7270m690r905N5119N6713K5462L2498L5196L7355j4340j572
8729A291646K2159l0140j1758k5664j4537k0678n8348k7624j4517j6009M918n9986
8717A039462j7080M237J8342p862O3407N5883k0569P48K5090j1119R862L2945
$$ plain form
8705 1193346 1224019 1216967 1197314 1247892 1257159 1230801 1210612 1189130 1195837 1263522 1270665 1243414
8693 1243414 1206169 1209036 1191659 1183620 1216314 1232089 1250057 1259981 1262904 1252082 1220346 1254725
8681 1254725 1274611 1255854 1232590 1230970 1250315 1272297 1283418 1311224 1287071 1344648 1449338
8670 1449338 1522913 1626446 1764005 1856084 1891141 1922091 1949689 1956445 1965660 1907420 1847214
8659 1847214 1768758 1658299 1580323 1511505 1483447 1496444 1495340 1496947 1522328 1564216 1574618 1558013
8647 1558013 1580126 1564657 1554396 1510162 1497861 1533835 1547522 1522823 1513170 1553096 1565256 1561171
8635 1561171 1558603 1558212 1600059 1645057 1643369 1646287 1722548 1832215 1903684 2003043 2055007 2113437
8623 2113437 2154756 2238611 2324704 2375770 2401276 2386492 2294508 2195457 2129718 2101447 2123752
$$ packed form
8705A193346L0673p052j9653N0578R267k6358k0189k1482O707O7685P143k7251
8693A243414l7245K867j7377q039L2694J5775J7968R924K923j0822l1736L4379
8681A254725J9886j8757k3264j620J9345K1982J1121K7806k4153N7577J04690
8670A449338P3575J03533J37559R2079L5057L0950K7598O756R215n8240o0206
8659A847214p8456j10459p7976o8818k8058J2997j104J607K5381M1888J0402j6605
8647A558013K2113j5469j0261m4234j2301L5974J3687k4699r653L9926J2160m085
8635A561171k568l91M1847M4998j688K918P6261J09667P1469R9359N1964N8430
8623B113437M1319Q3855Q6093N1066K5506j4784r1984r9051o5739k8271K2305
$$ plain form
8612 2123752 2160225 2164448 2142656 2159544 2205158 2230977 2284353 2314232 2312502 2305894 2333709 2322892
8600 2322892 2310786 2289166 2287103 2302688 2317111 2361806 2336859 2320738 2311205 2327392 2399403 2452041
8588 2452041 2482474 2558168 2647155 2692002 2738200 2770253 2801899 2837082 2792387 2738497 2686125
8577 2686125 2650779 2576994 2503276 2396891 2318869 2217759 2157091 2163130 2138636 2060306 1956662
8566 1956662 1886200 1853577 1869424 1881314 1872073 1845807 1760708 1729917 1672294 1650917 1672764 1635419
8554 1635419 1612754 1582749 1544584 1532473 1499150 1470588 1473192 1494678 1522904 1525342 1527834 1530096
8542 1530096 1501923 1434980 1393238 1372606 1374716 1428456 1474260 1430618 1387750 1373767 1358583 1400706
8530 1400706 1427322 1419644 1417468 1397976 1382740 1397618 1390875 1338973 1346805 1366433 1315965 1290480
$$ packed form
8612B123752L6473M223k1792J6888M5614K5819N3376K9879j730o608K7815j0817
8600B322892j2106k1620k063J5585J4423M4695k4947j6121r533J6187P2011N2638
8588B452041L0433P5694Q8987M4847M6198L2053L1646L5183m4695n3890n2372
8577B686125l5346p3785p3718j06385p8022j01110o0668O039k4494p8330j03644
8566A956662p0462l2623J5847J1890r241k6266q5099l0791n7623k1377K1847l7345
8554A635419k2665l0005l8165j2111l3323k8562K604K1486K8226K438K492K262
8542A530096k8173o6943m1742k0632K110N3740M5804m3642m2868j3983j5184M2123
8530A400706K6616p678k176j9492j5236J4878o743n1902P832J9628n0468k5485
$$ plain form
8518 1290480 1277592 1254623 1266564 1270887 1244893 1178727 1099741 1060270 1091966 1158934 1168827 1173238
8506 1173238 1140888 1104476 1141691 1155302 1165966 1177516 1213716 1195172 1157641 1183218 1229527
8495 1229527 1221288 1207935 1245899 1252704 1234721 1274913 1264094 1235364 1255263 1261071 1279212 1324888
8483 1324888 1340873 1361397 1342894 1391262 1404498 1369483 1333219 1306997 1257648 1270486 1230478
8472 1230478 1198368 1170944 1141086 1109853 1080519 1064543 1033074 1046163 1031855 1009818 998402
8461 998402 1022758 1045361 1049913 1054047 1110773 1133257 1114600 1119689 1169197 1256126 1316760 1330528
8449 1330528 1333150 1298831 1289569 1334526 1377493 1380112 1348088 1321474 1316388 1305091 1297611 1272552
8437 1272552 1228065 1167379 1196177 1234909 1269028 1265039 1214334 1171321 1155969 1147419 1128086 1067986
$$ packed form
8518A290480j2888k2969J1941M323k5994o6166p8986l9471L1696O6968R893M411
8506A173238l2350l6412L7215J3611J0664J1550L6200j8544l7531K5577M6309
8495A229527q239j3353L7964O805j7983M0192j0819k8730J9899N808J8141M5676
8483A324888J5985K0524j8503M8368J3236l5015l6264k6222m9349J2838m0008
8472A230478l2110k7424k9858l1233k9334j5976l1469J3089j4308k2037j1416
8461I98402K4356K2603M552M134N6726K2484j8657N089M9508Q6929O0634J3768
8449A330528K622l4319r262M4957M2967K619l2024k6614n086j1297p480k5059
8437A272552m4487o0686K8798L8732L4119l989n0705m3013j5352q550j9333o0100
$$ plain form
8425 1067986 1039356 1024963 951266 909724 943980 980064 1000026 1023710 1009039 989686 1001571
8414 1001571 1032078 1066418 1098608 1125765 1132790 1190037 1266874 1274540 1286688 1302185 1333995 1344826
8402 1344826 1349203 1342555 1343267 1324027 1280534 1192238 1102544 1079187 1073532 1007480 1002003 1017768 1079728
8389 1079728 1054289 1032575 1050226 1042064 1021459 1033813 1016017 998781 974040 960017 951399 966737
8377 966737 965577 918578 883411 947446 997222 986981 982311 979086 971316 1007714 1029408 1023073 1030292
8364 1030292 1073128 1102924 1120125 1093830 1067708 1079956 1071627 1059126 1080431 1108461 1118056 1164012
8352 1164012 1227767 1389340 1544818 1648479 1678210 1683086 1702882 1737295 1816434 1854628 1712639
8341 1712639 1454680 1296596 1197260 1147934 1113515 1069041 1031777 995164 980327 1008894 982284
$$ packed form
8425A067986k8630j4393p3697m1542L4256L6084J9962K3684j4671j9353J1885
8414A001571L0507L4340L2190K7157P025N7247P6837P666J2148J5497L1810J0831
8402A344826M377o648P12j9240m3493q8296q9694k3357n655o6052n477J5765O1960
8389A079728k5439k1714J7651q162k0605J2354j7796j7236k4741j4023q618J5338
8377I66737j160m6999l5167O4035M9776j0241m670l225p770L6398K1694o335P219
8364A030292M2836K9796J7201k6295k6122J2248q329j2501K1305K8030R595M5956
8352A164012O3755J61573J55478J03661K9731M876J9796L4413P9139L8194j41989
8341A712639k57959j58084r9336m9326l4419m4474l7264l6613j4837K8567k6610
$$ plain form
8330 982284 964367 942985 913639 925805 926465 922655 928718 887134 863919 895773 875920 937227
8318 937227 965678 949292 911271 887596 881095 922632 950060 961936 1026707 1142524 1306158
8307 1306158 1540439 1891733 2143033 2218604 2263384 2268339 2278482 2354136 2453628 2255720 1793797
8296 1793797 1478848 1303220 1187388 1056826 979289 971392 954615 960915 905328 931808 957971
8285 957971 935025 935228 953203 912916 831696 813668 845658 807760 783796 788685 790388 781109 784753
8272 784753 766767 747107 742617 691331 660673 690164 738004 815257 914211 1019179 1220265
8261 1220265 1362335 1393526 1444444 1437365 1450583 1484993 1525288 1469557 1249175 1050845 961770
8250 961770 894633 819589 759501 748568 724762 694043 717872 723037 730225 713024 680740 661927
$$ packed form
8330I82284j7917k1382k9346J2166O60l810O063m1584k3215L1854j9853O1307
8318I37227K8451j6386l8021k3675o501M1537K7428J1876O4771J15817J63634
8307A306158K34281L51294K51300P5571M4780M955J0143P5654R9492j97908m61923
8296A793797l14949j75628j15832j30562p7537p897j6777O300n5587K6480K6163
8285I57971k2946K03J7975m0287q1220j8028L1990l7898k3964M889J703r279L644
8272G84753j7986j9660m490n1286l0658K9491M7840P7253R8954J04968K01086
8261A220265J42070L1191N0918p079J3218L4410M0295n5731k20382j98330q9075
8250I61770o7137p5044o0088j0933k3806l0719K3829N165P188j7201l2284j8813
$$ plain form
8238 661927 690032 693660 693353 703282 662983 617720 626729 601521 580429 626707 638081 594146 562959
8225 562959 604635 620225 605103 608803 624321 610565 592350 561527 552041 572349 562961 545970
8213 545970 570211 567423 545298 567966 585862 570380 597936 624576 599256 591946 612455 577137
8201 577137 534862 522610 535635 557790 553457 556128 544245 530944 530959 514912 499022 531136 557815
8188 557815 555163 517342 474177 495668 526991 521106 548901 510207 506336 528094 519001 527741 511636
8175 511636 516221 506798 512970 486597 466166 455075 478481 485367 479102 468417 427858 425174 407151
8162 407151 411781 417343 433019 469687 479835 466526 428488 416561 434365 408859 385008 380714
8150 380714 411916 422121 424642 436069 440626 450253 458759 466847 436091 403707 427571 448237 449396
$$ packed form
8238F61927K8105L628l07R929m0299m5263R009k5208k1092M6278J1374m3935l1187
8225E62959M1676J5590j5122L700J5518j3756j8215l0823r486K0308r388j6991
8213E45970K4241k788k2125K2668J7896j5482K7556K6640k5320p310K0509l5318
8201E77137m2275j2252J3025K2155m333K671j1883j3301J5j6047j5890L2114K6679
8188E57815k652l7821m3165K1491L1323n885K7795l8694l871K1758r093Q740j6105
8175E11636M585r423O172k6373k0431j1091K3406O886o265j0685m0559k684j8023
8162D07151M630N562J5676L6668J0148j3309l8038j1927J7804k5506k3851m294
8150C80714L1202J0205K521J1427M557R627Q506Q088l0756l2384K3864K0666J159
$$ plain form
8137 449396 474794 494428 476393 496228 488739 486086 484028 463311 392181 408303 428792 446044
8125 446044 457683 427195 441705 440526 411414 393025 403055 372586 381580 410363 393619 385184
8113 385184 399783 380046 401232 396608 375786 423779 427169 430681 473036 468106 466147 436892 425920
8100 425920 417228 418381 404358 391129 409057 454744 447198 480423 483924 432284 407178 393893
8088 393893 388149 403555 405449 399731 397190 404272 380075 356763 334405 324479 314260 303177 309808
8075 309808 326353 340174 356105 342182 349360 349090 353417 366353 418803 415842 386430 385036 400832
8062 400832 409503 412350 416735 421029 378863 367596 405854 416901 412671 345683 282432 257898 298027
8049 298027 354065 332166 331541 387578 404165 391299 392786 371725 401041 401832 389330 374216 361462
$$ packed form
8137D49396K5398J9634j8035J9835p489k653k058k0717p1130J6122K0489J7252
8125D46044J1639l0488J4510j179k9112j8389J0030l0469Q994K8783j6744q435
8113C85184J4599j9737K1186m624k0822M7993L390L512M2355m930j959k9255j0972
8100D25920q692J153j4023j3229J7928M5687p546L3225L501n1640k5106j3285
8088C93893n744J5406J894n718k541P082k4197k3312k2358r926j0219j1083O631
8075C09808J6545J3821J5931j3923P178k70M327J2936N2450k961k9412j394J5796
8062D00832Q671K847M385M294m2166j1267L8258J1047m230o6988o3251k4534M0129
8049B98027N6038k1899o25N6037J6587j2866J487k1061K9316P91j2502j5114j2754
$$ plain form
8036 361462 356999 381864 464050 490144 454816 435022 411786 394253 397609 420838 435308 459992
8024 459992 490448 479199 463563 477213 495875 496303 501751 498747 460232 467165 527600 544325 530689
8011 530689 532739 523768 486600 473462 474168 465347 463306 435837 441288 462827 493977 545540 533936
7998 533936 508175 507488 511848 523897 533483 515008 549818 575058 516809 526971 553520 556904 567213
7985 567213 574218 569955 581440 569293 551122 537030 538433 545178 548597 543666 528032 517635 489230
7972 489230 470672 465324 462634 429172 412863 436632 439851 457320 478576 471702 437531 371908
7960 371908 385530 398070 369357 363580 403227 412822 423399 442812 465286 462883 437382 443407
7948 443407 458923 444845 464517 416937 351952 370161 400589 428872 450628 437524 435547 429942
$$ packed form
8036C61462m463K4865Q2186K6094l5328j9794k3236j7533L356K3229J4470K4684
8024D59992L0456j1249j5636J3650J8662M28N448l004l8515O933O0435J6725j3636
8011E30689K050q971l7168j3138P06q821k041k7469N451K1539L1150N1563j1604
7998E33936k5761o87M360J2049R586j8475L4810K5240n8249J0162K6549L384J0309
7985E67213P005m263J1485j2147j8171j4092J403O745L419m931j5634j0397k8405
7972D89230j8558n348k690l3462j6309K3769L219J7469K1256o874l4171o5623
7960C71908J3622J2540k8713n777L9647R595J0577J9413K2474k403k5501O025
7948D43407J5516j4078J9672m7580o4985J8209L0428K8283K1756j3104j977n605
$$ plain form
7936 429942 415616 415543 386534 368174 389945 392497 395749 369190 339999 327751 329942 332589 374851
7923 374851 373886 319701 326615 337515 345784 304940 306390 338361 343945 327334 340507 366257 348034
7910 348034 320620 329706 333159 347641 366982 382845 370732 352468 301752 271361 289571 284865
7898 284865 258425 276591 295608 347168 309480 259994 247455 209423 195747 234677 217856 258543
7886 258543 262383 239013 274816 281581 259216 261736 262782 260320 281614 282127 258044 233358 241280
7873 241280 264724 290821 304234 316793 320463 301424 268380 257217 264127 281496 295980 277111
7861 277111 260394 269678 311396 334073 311791 276540 220956 173634 173991 232602 243874 216082
7849 216082 214469 225229 243889 250396 268283 252255 227977 222448 236086 251418 272628 327078
$$ packed form
7936D29942j4326p3k9009j8360K1771K552L252k6559k9191j2248K191K647M2262
7923C74851r65n4185O914J0900Q269m0844J450L1971N584j6611J3173K5750j8223
7910C48034k7414R086L453J4482J9341J5863j2113j8264n0716l0391J8210m706
7898B84865k6440J8166J9017N1560l7688m9486j2539l8032j3676L8930j6821M0687
7886B58543L840k3370L5803O765k2365K520J046k462K1294N13k4083k4686P922
7873B41280K3444K6097J3413J2559L670j9039l3044j1163O910J7369J4484j8869
7861B77111j6717R284M1718K2677k2282l5251n5584m7322L57N8611J1272k7792
7849B16082j613J0760J8660O507J7887j6028k4278n529J3638J5332K1210N4450
$$ plain form
7837 327078 337822 337450 336842 296154 249186 190791 162105 180187 192082 188180 202404 219200 191865
7824 191865 185833 204986 223828 254777 272028 242526 234801 201769 187511 183243 222399 260604
7812 260604 260878 200795 155101 179298 195450 229536 249578 195809 162646 163273 158117 166367 182107
7799 182107 219333 196673 197964 208547 181005 179776 182318 176108 211756 250471 237274 210777
7787 210777 213260 200528 200091 207268 223511 228169 214461 187994 160877 192455 222860 207080 183569
7774 183569 185869 182830 184305 191998 198280 209526 234236 268056 284096 268719 222262 217200 227255
7761 227255 242880 185514 142519 162512 192838 158492 115876 145845 183091 217608 218188 211761
7749 211761 239384 206863 171419 150060 191779 174131 162059 199665 191439 210620 220855 211120
$$ packed form
7837C27078J0744l72o08m0688m6968n8395k8686J8082J1895l902J4224J6796k7335
7824A91865o032J9153J8842L0949J7251k9502p725l3032j4258m268L9156L8205
7812B60604K74o0083m5694K4197J6152L4086K0042n3769l3163O27n156Q250J5740
7799A82107L7226k2660J291J0583k7542j229K542o210L5648L8715j3197k6497
7787B10777K483j2732m37P177J6243M658j3708k6467k7117L1578L0405j5780k3511
7774A83569K300l039J475P693O282J1246K4710L3820J6040j5377m6457n062J0055
7761B27255J5625n7366m2995J9993L0326l4346m2616K9969L7246L4517N80o427
7749B11761K7623l2521l5444k1359M1719j7648j2072L7606q226J9181J0235r735
$$ plain form
7737 211120 184467 169839 159509 140339 125370 139777 161723 226119 204458 177466 215220 266912
7725 266912 208491 142764 116925 115464 139327 191369 188557 158785 180872 157729 170402 192891
7713 192891 189472 185678 164909 172370 173803 150984 130973 96290 106295 111397 108036 127958 130025
7700 130025 133904 179950 217460 195015 144499 124064 135871 206535 232445 214541 210636 196652
7688 196652 211023 239237 227249 205018 190381 185529 180038 191249 201385 190194 154622 165866
7676 165866 198212 223559 191472 172178 184144 175999 199462 226414 237491 217845 184839 184972
7664 184972 161487 121392 133970 127096 143188 155767 162874 194624 204400 232272 193960 191361
7652 191361 204139 196008 190284 172922 137690 139094 167475 191983 190196 186547 177815 147969 126758
$$ packed form
7737B11120k6653j4628j0330j9170j4969J4407K1946O4396k1661k6992L7754N1692
7725B66912n8421o5727k5839j461K3863N2042k812k9772K2087k3143J2673K2489
7713A92891l419l794k0769P461J433k2819k0011l4683J0005N102l361J9922K067
7700A30025L879M6046L7510k2445n0516k0435J1807P0664K5910j7904l905j3984
7688A96652J4371K8214j1988k2231j4637m852n491J1211J0136j1191l5572J1244
7676A65866L2346K5347l2087j9294J1966q145K3463K6952J1077j9646l3006J33
7664A84972k3485m0095J2578o874J6092J2579P107L1750R776K7872l8312k599
7652A91361J2778q131n724j7362l5232J404K8381K4508j787l649q732k9846k1211
$$ plain form
7639 126758 119051 94016 105108 78940 90345 122793 123893 140082 169502 163163 163527 150910 157379
7626 157379 105888 69164 121810 120052 106530 104391 152236 159230 134636 151125 174289 195067
7614 195067 188075 182756 160713 145596 152203 135597 132419 111807 139896 109547 102621 83494 85741
7601 85741 114029 144095 168111 145655 127367 104980 82883 108793 129805 190302 190974 157611
7589 157611 136635 125060 141168 164195 147718 139529 154679 167515 138041 84853 64286 82745
7577 82745 75105 101847 153400 140547 98603 110862 149904 155544 124106 106735 114554 104418
7565 104418 133695 145204 146569 138165 131362 129550 115976 130921 154026 153235 109589 91368 125518
7552 125518 150330 157782 128450 110213 128136 155474 170854 197832 194944 161323 139820 106897
$$ packed form
7639A26758p707k5035J1092k6168J1405L2448J100J6189K9420o339L64j2617O469
7626A57379n1491l6724N2646j758j3522k139M7845O994k4594J6489K3164K0778
7614A95067o992n319k2043j5117O607j6606l178k0612K8089l0349o926j9127K247
7601H5741K8288L0066K4016k2456j8288k2387k2097K5910K1012O0497O72l3363
7589A57611k0976j1575J6108K3027j6477q189J5150J2836k9474n3188k0567J8459
7577H2745p640K6742N1553j2853m1944J2259L9042N640l1438j7371P819j0136
7565A04418K9277J1509J365q404o803j812j3574J4945K3105p91m3646j8221L4150
7552A25518K4812P452k9332j8237J7923K7338J5380K6978k888l3621k1503l2923
$$ plain form
7540 106897 102318 138154 131515 107251 100807 127104 155977 159329 148985 127423 126667 113071 128292
7527 128292 136047 155408 178923 166730 155851 141567 92709 108801 111344 83741 61676 44487
7515 44487 51968 81893 116324 127202 113492 110703 107538 142516 172983 139833 124804 104773
7503 104773 115105 149042 158464 172812 181610 156318 151042 115531 117822 101899 99053 127399 128347
7490 128347 110007 128941 137532 80808 118688 135011 126906 130757 123414 83874 76479 105725 94562
7477 94562 48939 54825 107552 167483 186424 181371 124537 137583 165777 164322 150335 126055
7465 126055 157784 170502 127135 82282 46879 41013 26218 38436 101604 126562 149550 157456
7453 157456 128515 99177 54422 82098 96710 62142 35566 19020 13071 57519 57939 81648
$$ packed form
7540A06897m579L5836o639k4264o444K6297K8873L352j0344k1562p56j3596J5221
7527A28292P755J9361K3515j2193j0879j4284m8858J6092K543k7603k2065j7189
7515D4487P481K9925L4431J0878j3710k789l165L4978L0467l3150j5029k0031
7503A04773J0332L3937R422J4348Q798k5292n276l5511K291j5923k846K8346R48
7490A28347j8340J8934Q591n6724L7880J6323q105L851p343l9540p395K9246j1163
7477I4562m5623N886N2727N9931J8941n053n6834J3046K8194j455j3987k4280
7465A26055L1729J2718m3367m4853l5403n866j4795J2218O3168K4958K2988P906
7453A57456k8941k9338m4755K7676J4612l4568k6576j6546n949M4448M20K3709
$$ plain form
7441 81648 125051 140911 156311 165595 126550 99901 111321 104157 76650 61590 11851 53659
7429 53659 100423 134048 149838 145132 98417 118684 164536 162364 154267 119001 99058 92216 76528
7416 76528 74799 102385 132647 151273 195051 175016 111494 69491 50032 39305 71609 112811
7404 112811 138539 120040 112156 120522 106669 102021 130191 139131 126517 146748 135824 128051 116244
7391 116244 87797 91106 98595 110511 127647 120018 122622 156707 159366 159383 148946 146720 153209 158478
7377 158478 112135 65114 17051 28092 71699 118966 115553 108155 123207 131071 120346 87850
7365 87850 90280 97601 84627 65323 46482 67222 101199 102244 75672 55028 79774 122345
7353 122345 138792 98691 70069 48695 65024 87244 70158 67072 70302 36948 52932 105803
$$ packed form
7441H1648M3403J5860J5400R284l9045k6649J1420p164k7507j5060m9739M1808
7429E3659M6764L3625J5790m706m6715K0267M5852k172q097l5266j9943o842j5688
7416G6528j729K7586L0262J8626M3778k0035o3522m2003j9459j0727L2304M1202
7404A12811K5728j8499p884Q366j3853m648K8170Q940j2614K0231j0924p773j1807
7391A16244k8447L309P489J1916J7136p629K604L4085K659J7j0437k226O489N269
7377A58478m6343m7021m8063J1041M3607M7267l413p398J5052P864j0725l2496
7365H7850K430P321j2974j9304j8841K0740L3977J045k6572k0644K4746M2571
7353A22345J6447m0101k8622k1374J6329K2220j7086l086L230l3354J5984N2871
$$ plain form
7341 105803 141369 133319 114840 121045 105584 64485 45770 49546 65587 81220 106825 106490 82642
7328 82642 67544 73414 76467 43577 40699 38641 50313 95587 93574 119147 119404 94902 113235
7315 113235 78360 67061 53491 72510 81541 49552 35785 15360 10890 30652 50600 21920
7303 21920 52919 76129 58448 40124 33726 57457 86280 102344 140059 133173 119855 109530
7291 109530 80267 70947 80428 88822 130455 143513 127182 126750 118751 126826 118254 110624 93194
7278 93194 100559 101566 104592 114845 138287 114727 114811 76194 46780 74480 88252 95236 91499
7265 91499 75902 89508 84159 79312 107936 81807 54566 52453 76175 111383 76735 49616
7253 49616 49277 45719 74118 103725 105849 87683 133179 167506 175859 170051 130036 100378 120267
$$ packed form
7341A05803L5566q050j8479O205j5461m1099j8715L776J6041J5633K5605l35k3848
7328H2642j5098N870L053l2890k878k058J1672M5274k013K5573K57k4502J8333
7315A13235l4875j1299j3570J9019R031l1989j3767k0425m470J9762J9948k8680
7303B1920L0999K3210j7681j8324o398K3731K8823J6064L7715o886j3318j0325
7291A09530k9263r320R481Q394M1633J3058j6331m32p999Q075q572p630j7430
7278I3194P365J007L026J0253K3442k3560Q4l8617k9414K7700J3772O984l737
7265I1499j5597J3606n349m847K8624k6129k7241k113K3722L5208l4648k7119
7253D9616l39l558K8399K9607K124j8166M5496L4327Q353n808m0015k9658J9889
$$ plain form
7240 120267 155275 182683 181047 159733 119507 114074 95011 57658 33258 24064 10323 30973
7228 30973 100134 136693 131433 93409 89773 74506 76250 78705 78409 77525 55195 53081 61382 63316
7214 63316 62168 78838 48313 42231 45483 64627 57592 42778 10000 36190 74039 89413 81398
7201 81398 59817 70498 118315 119267 142124 149287 115133 90636 59221 80326 70183 58352
7189 58352 74433 97942 117361 130342 139228 135126 68990 69071 91699 121541 131635 129571 113379
7176 113379 114147 64134 19841 37549 63677 64741 81368 44660 35960 41650 53998 60061 25095
7163 25095 8015 5725 36744 77593 94541 91950 110303 164869 179058 136829 116446 75718
7151 75718 86820 91822 136752 163211 140237 127980 123508 122256 99278 59467 61697 69039 63684
$$ packed form
7240A20267L5008K7408j636k1314m0226n433j9063l7353k4400r194j3741K0650
7228C0973O9161L6559n260l8024l636j5267J744K455k96q84k2330k114Q301J934
7214F3316j148J6670l0525o082L252J9144p035j4814l2778K6190L7849J5374q015
7201H1398k1581J0681M7817R52K2857P163l4154k4497l1415K1105j0143j1831
7189E8352J6081K3509J9419J2981Q886m102o6136Q1K2628K9842J0094k064j6192
7176A13379P68n0013m4293J7708K6128J064J6627l6708q700N690J2348O063l4966
7163B5095j7080k290L1019M0849J6948k591J8353N4566J4189m2229k0383m0728
7151G5718J1102N002M4930K6459k2974j2257m472j252k2978l9811K230P342n355
$$ plain form
7138 63684 57650 95139 101545 92765 93865 55574 58042 73595 99546 108116 74420 77187 87314
7125 87314 111638 115156 104596 85827 81735 42351 32961 46007 86769 128454 127251 102121 94736
7112 94736 89912 95685 82128 113537 98872 90621 95347 97684 80185 86788 98571 88285 56182
7099 56182 52238 33628 62976 66511 52621 30803 46066 40104 32440 46752 65706 42960 55782
7086 55782 88170 94286 76517 13483 -17155 -4014 34321 46337 48898 55421 85802 109371
7074 109371 85834 76626 70590 79383 100638 108064 88499 85016 48376 66028 54837 50222 67191
7061 67191 62285 44173 48830 66561 64734 37743 54879 79332 84375 60201 30814 43162 59509
7048 59509 70853 82365 114376 171473 144428 145291 157299 131019 123820 80549 74776 66362 51497
$$ packed form
7138F3684o034L7489O406q780J100l8291K468J5553K5951Q570l3696K767J0127
7125H7314K4324L518j0560j8769m092l9384r390J3046M0762M1685j203k5130p385
7112I4736m824N773j3557L1409j4665q251M726K337j7499O603J1783j0286l2103
7099E6182l944j8610K9348L535j3890k1818J5263n962p664J4312J8954k2746J2822
7086E5782L2388O116j7769o3034l0638J3141L8335J2016K561O523L0381K3569
7074A09371k3537r208o036Q793K1255P426j9565l483l6640J7652j1191m615J6969
7061F7191m906j8112M657J7731j827k6991J7136K4453N043k4174k9387J2348J6347
7048E9509J1344J1512L2011N7097k7045Q63J2008k6280p199m3271n773q414j4865
$$ plain form
7035 51497 88855 78711 36986 46661 52240 79860 99812 71163 54092 55040 73512 86457 73593
7022 73593 83973 66850 53677 54163 76892 82218 103298 103878 60567 26166 -3888 16617 4554
7009 4554 15872 66312 113419 91526 98135 97178 71339 46246 57496 91516 73409 71905 87072
6996 87072 73601 76087 35902 44219 27563 33808 65908 58364 48011 31463 32480 32597 34695
6983 34695 43568 44723 81894 123229 77974 40165 20117 29084 14552 50273 95683 82955
6971 82955 46151 22701 3486 -24195 -34324 -30930 37148 73426 29523 -3237 -14433 18145
6959 18145 57553 61969 12508 1033 62218 115931 76984 22836 32259 48855 62577 55987
6947 55987 59629 54442 34828 -971 -23142 -11640 8373 59834 52016 55897 77568 47907 27270
$$ packed form
7035E1497L7358j0144m1725R675N579K7620J9952k8649j7071R48J8472J2945j2864
7022G3593J0380j7123j3173M86K2729N326K1080N80m3311l4401l0054K0505j2063
7009D554J1318N0440M7107k1893O609r57k5839k5093J1250L4020j8107j504J5167
6996H7072j3471K486m0185Q317j6656O245L2100p544j0353j6548J017J17K098
6983C4695Q873J155L7171M1335m5255l7809k0048Q967j4532L5721M5410j2728
6971H2955l6804k3450j9215k7681j0129L394O8078L6278m3903l2760j1196L2578
6959A8145L9408M416m9461j1475O1185N3713l8947n4148R423J6596J3722o590
6947E5987L642n187j9614l5799k2171J1502K0013N1461p818L881K1671k9661k0637
$$ plain form
6934 27270 -7115 -26898 4288 58716 65145 41641 69867 93006 94047 69665 71608 38565
6922 38565 64028 81151 71199 111181 140459 102793 78997 61332 56389 79700 96055 46012
6910 46012 42947 32472 8807 555 48499 61589 39016 69204 101297 97727 55712 -2230
6898 -2230 -1173 38314 509 -16687 241 -5474 54913 99175 100509 74829 67833 63325 41632
6885 41632 31137 2763 3079 16411 53420 58433 18733 17339 79761 92374 64559 26755 50657
6872 50657 74970 90418 84662 47947 58403 66621 46327 52868 68029 52015 57501 71005 73394
6859 73394 67591 74568 76096 13172 18363 33974 35560 15115 24902 69989 85567 48818 23129
6846 23129 18492 57118 83927 135911 145000 109783 92034 41192 -15983 -38200 22096 92301
$$ packed form
6934B7270l4385j9783L1186N4428O429k3504K8226K3139J041k4382J943l3043
6922C8565K5463J7123r952L9982K9278l7666k3796j7665m943K3311J6355n0043
6910D6012l065j0475k3665q252M7944J3090k2573L0188L2093l570m2015n7942
6898b230J057L9487l7805j7196J6928n715O0387M4262J334k5680o996m508k1693
6885D1632j0495k8374L16J3332L7009N013l9700j394O2422J2613k7815l7804K3902
6872E0657K4313J5448n756l6715J0456Q218k0294O541J5161j6014N486J3504K389
6859G3394n803O977J528o2924N191J5611J586k0445R787M5087J5578l6749k5689
6846B3129m637L8626K6809N1984R089l5217j7749n0842n7175k2217O0296P0205
$$ plain form
6834 92301 118244 55880 16476 -4621 -407 6433 23885 41182 33604 20497 15400 11896 35901
6821 35901 80581 85567 87217 49240 60098 53993 50303 45871 23309 4062 4987 1335 27615
6808 27615 62489 72406 59393 81411 103829 100952 90438 67292 42581 33509 42100 65493 63462
6795 63462 70519 75795 38977 11336 14403 64181 45317 30099 31705 35910 51192 37978 37706
6782 37706 36219 20046 16059 55126 74392 79215 93836 51469 47740 60519 58743 30004 21157
6769 21157 37830 55112 60320 70228 73792 53832 59284 42695 43295 55990 63651 24656 -3740
6756 -3740 4567 26267 58420 80920 62586 66930 34161 15522 31985 76759 84279 66022 66995
6743 66995 22656 25552 11512 -38892 -32370 39377 92986 68696 42257 14918 4049 46387
$$ packed form
6834I2301K5943o2364l9404k1097M214O840J7452J7297p578j3107n097l504K4005
6821C5901M4680M986J650l7977J0858o105l690m432k2562j9247R25l652K6280
6808B7615L4874R917j3013K2018K2418k877j0514k3146k4711r072Q591K3393k031
6795F3462P057N276l6818k7641L067M9778j8864j5218J606M205J5282j3214k72
6782C7706j487j6173l987L9067J9266M823J4621m2367l729J2779j776k8739q847
6769B1157J6673J7282N208R908L564j9960N452j6589O00J2695P661l8995k8396
6756c740Q307K1700L2153K2500j8334M344l2769j8639J6463M4774P520j8257R73
6743F6995m4339K896j4040n0404O522P1747N3609k4290k6439k7339j0869M2338
$$ plain form
6731 46387 47806 14810 -30979 -33607 17253 22411 38387 79425 69925 53782 63495 41781 26111
6718 26111 42503 41706 44593 34167 14823 15911 35127 49980 12286 15669 52959 62489 55251
6705 55251 31961 22409 7637 7816 -6083 17038 20665 11678 11169 1027 29610 34746 79245
6692 79245 103632 117828 86796 50141 9505 31971 21646 27389 15378 -9701 -24993 -40761
6680 -40761 12607 -9275 5641 39149 34129 22774 21485 -12225 -34437 -19867 1615 -82
6668 -82 8936 18904 17563 39021 37313 59526 49402 20013 27438 35704 59722 74391 86462 63238
6654 63238 25419 -32849 472 20988 28908 24576 -5800 5999 15037 -19987 -4543 16918
6642 16918 72100 127034 97083 73207 53071 89157 86747 66775 66534 76289 20685 32500 38283
$$ packed form
6731D6387J419l2996m5789k628N0860N158J5976M1038r500j6143R713k1714j5670
6718B6111J6392p97K887j0426j9344J088J9216J4853l7694L383L7290R530p238
6705E5251k3290r552j4772J79j3899K3121L627q987n09j0142K8583N136M4499
6692G9245K4387J4196l1032l6655m0636K2466j0325N743j2011k5079j5292j5768
6680d0761N3368k1882J4916L3508n020j1355j289l3710k2212J4570K1482j697
6668h2R018R968j341K1458j708K2213j0124k9389P425Q266K4018J4669J2071k3224
6654F3238l7819n8268L3321K0516P920m332l0376J1799R038l5024J5444K1461
6642A6918N5182N4934k9951k3876k0136L6086k410j9972k41R755n5604J1815N783
$$ plain form
6629 38283 61714 84265 82512 64683 46549 41309 33647 29296 19181 30815 34175 74157 100410
6616 100410 91823 34795 13632 32471 96328 77906 38949 20921 16634 42574 63342 81846
6604 81846 63208 57805 42904 28938 29091 43458 47022 24957 19740 43230 46038 75041 50545
6591 50545 21949 50606 70580 97955 109511 88953 87326 129729 161744 105723 59236 25606
6579 25606 12888 21456 39337 24790 6732 3170 59375 106898 117494 84229 46838 37928
6567 37928 54002 77848 53630 48841 43694 26063 48416 78246 104623 96724 59167 50071 87184
$$ packed form
6629C8283K3431K2551j753j7829j8134n240p662m351j0115J1634L360L9982K6253
6616A00410q587n7028k1163J8839O3857j8422l8957j8028m287K5940K0768J8504
6604H1846j8638n403j4901j3966J53J4367L564k2065n217K3490K808K9003k4496
6591E0545k8596K8657J9974K7375J1556k0558j627M2403L2015n6021m6487l3630
6579B5606j2718Q568J7881j4547j8058l562N6205M7523J0596l3265l7391q910
6567C7928J6074K3846k4218m789n147j7631K2353K9830K6377p899l7557r096L7113
$$ [...]
##END NTUPLES=NMR SPECTRUM
##END=
