##TITLE=Analysis number 315159
Compound Code cc 07504
Book Reference 444/48
Project Code adrs
Chemist Name howarde
##JCAMPDX= 6.0         $$ Bruker NMR JCAMP-DX V2.0
##DATA TYPE= NMR SPECTRUM
##DATA CLASS= NTUPLES
##ORIGIN= Bruker BioSpin GmbH
##OWNER= NMR
$$ XWIN-NMR		Version 3.5
$$ Wed Nov  9 14:05:59 2005 GMT Standard Time (UT+0h)  MAYBRIDGE\NMR@NMR_250MHZ
##.OBSERVE FREQUENCY= 250.131544655141
##.OBSERVE NUCLEUS= ^1H
##.ACQUISITION MODE= SIMULTANEOUS (DQD)
##.ACQUISITION SCHEME= undefined
##.AVERAGES= 16
##.DIGITISER RES= 18
##SPECTROMETER/DATA SYSTEM= dpx250
##.PULSE SEQUENCE= zg30
##.SOLVENT NAME= CDCl3
##.SHIFT REFERENCE= (INTERNAL, CDCl3, 0, 16.522)
##AUDIT TRAIL= $$ (NUMBER, WHEN, WHO, WHERE, WHAT)
$$ ##TITLE= Audit trail, XWIN-NMR		Version 3.5
$$ ##JCAMPDX= 5.01
$$ ##ORIGIN= Bruker BioSpin GmbH
$$ ##OWNER= NMR
$$ C:\u/data/dgb/nmr/ADRS/12120/pdata/1/auditp.txt
$$ ##AUDIT TRAIL=  $$ (NUMBER, WHEN, WHO, WHERE, WHAT)
(   1,<2005-11-09 14:05:29.99 +000>,<MAYBRIDGE\NMR>,<NMR_250MHZ>,
      <created by zg, POWCHK disabled, PULCHK disabled
       configuration hash MD5:
       62 19 C7 07 E1 42 D1 B7 37 6C 3D D0 77 39 F9 E6
       data hash MD5: 64K
       C3 3D 84 3C C6 E4 50 C8 4E 4A 45 CE 1F CC B3 E9>)
(   2,<2005-11-09 14:05:44.30 +000>,<MAYBRIDGE\NMR>,<NMR_250MHZ>,
      <Start of raw data processing
       ef LB = 0.3 FT_mod = 6 PKNL = 1 SI = 32K 
       data hash MD5: 32K
       E5 29 EA B6 DA 7C 4B 85 55 A4 F4 02 29 D4 0C 2B>)
(   3,<2005-11-09 14:05:46.36 +000>,<MAYBRIDGE\NMR>,<NMR_250MHZ>,
      <apk 
       data hash MD5: 32K
       69 7F D8 FC D0 F3 3A B4 94 E4 2B DA 9D 6E B7 CE>)
(   4,<2005-11-09 14:05:47.21 +000>,<MAYBRIDGE\NMR>,<NMR_250MHZ>,
      <abs ABSG = 5 
       data hash MD5: 32K
       96 D8 08 B0 CB A1 86 8B 29 E1 17 73 EB 76 06 1E>)
$$ ##END=
$$ 
$$ hash MD5
$$ 75 DE EF BA B8 6A AA A6 02 4E 69 A6 AB 75 85 95
##$RELAX= 
##$RELAX= 
##$RELAX= 
##$RELAX= 
##$RELAX= 
##$RELAX= 
##$RELAX= 
$$ Bruker specific parameters
$$ --------------------------
##$DU= <C:\u>
##$EXPNO= 12120
##$NAME= <ADRS>
##$PROCNO= 1
##$TYPE= <nmr>
##$USER= <dgb>
##$AMP= (0..31)
100 100 100 100 100 100 100 100 100 100 100 100 100 100 100 100 100 100 
100 100 100 100 100 100 100 100 100 100 100 100 100 100 
##$AQSEQ= 0
##$AQ_mod= 3
##$AUNM= <au_zg>
##$AUTOPOS= <39 >
##$BF1= 250.13
##$BF2= 250.13
##$BF3= 250.13
##$BF4= 250.13
##$BF5= 500.13
##$BF6= 500.13
##$BF7= 500.13
##$BF8= 500.13
##$BYTORDA= 1
##$CFDGTYP= 0
##$CFRGTYP= 5
##$CHEMSTR= <none>
##$CNST= (0..31)
1 1 145 1 1 1 1 1 1 1 1 1 1 1 1 1 1 1 1 1 1 1 1 1 1 1 1 1 1 1 1 1 
##$CPDPRG= <>
##$CPDPRG1= <>
##$CPDPRG2= <>
##$CPDPRG3= <>
##$CPDPRG4= <mlev>
##$CPDPRG5= <mlev>
##$CPDPRG6= <mlev>
##$CPDPRG7= <mlev>
##$CPDPRG8= <mlev>
##$CPDPRGB= <>
##$CPDPRGT= <>
##$D= (0..31)
0 1 0 0 0 0 0 0 0 0.06 0 0 0 0 0 0 0.0002 0 0 0 0 0 0 0 0 0 0 0 0 0 0 
0 
##$DATE= 1131545128
##$DBL= (0..7)
120 120 120 120 120 120 120 120 
##$DBP= (0..7)
150 150 150 150 150 150 150 150 
##$DBP07= 0
##$DBPNAM0= <>
##$DBPNAM1= <>
$$ [...]
##$SUBNAM7= <"">
##$SUBNAM8= <"">
##$SUBNAM9= <"">
##$SW= 20.6930455092707
##$SWIBOX= (0..15)
0 0 3 0 0 0 0 0 0 0 0 0 0 0 0 0 
##$SW_h= 5175.983436853
##$TD= 65536
##$TD0= 1
##$TE= 295.16
##$TE2= 300
##$TE3= 300
##$TEG= 300
##$TL= (0..7)
0 120 120 120 120 120 120 120 
##$TP= (0..7)
150 150 150 150 150 150 150 150 
##$TP07= 0
##$TPNAME0= <>
##$TPNAME1= <>
##$TPNAME2= <>
##$TPNAME3= <>
##$TPNAME4= <>
##$TPNAME5= <>
##$TPNAME6= <>
##$TPNAME7= <>
##$TPOAL= (0..7)
0.5 0.5 0.5 0.5 0.5 0.5 0.5 0.5 
##$TPOFFS= (0..7)
0 0 0 0 0 0 0 0 
##$TUNHIN= 0
##$TUNHOUT= 0
##$TUNXOUT= 0
##$USERA1= <user>
##$USERA2= <user>
##$USERA3= <user>
##$USERA4= <user>
##$USERA5= <user>
##$V9= 5
##$VALIST= <valist>
##$VCLIST= <CCCCCCCCCCCCCCC>
##$VD= 0
##$VDLIST= <DDDDDDDDDDDDDDD>
##$VPLIST= <PPPPPPPPPPPPPPP>
##$VTLIST= <TTTTTTTTTTTTTTT>
##$WBST= 1024
##$WBSW= 4
##$XGAIN= (0..3)
0 0 0 0 
##$XL= 0
##$YL= 0
##$YMAX_a= 576815
##$YMIN_a= -365614
##$ZGOPTNS= <>
##$ZL1= 120
##$ZL2= 120
##$ZL3= 120
##$ZL4= 120
##$ABSF1= 16.522
##$ABSF2= -4.171173
##$ABSG= 5
##$ABSL= 3
##$ALPHA= 0
##$AQORDER= 0
##$ASSFAC= 0
##$ASSFACI= 0
##$ASSFACX= 0
##$ASSWID= 0
##$AUNMP= <proc_1d>
##$AZFE= 0.1
##$AZFW= 0.1
##$BCFW= 0
##$BC_mod= 0
##$BYTORDP= 0
##$COROFFS= 0
##$CY= 12.5
##$DATMOD= 1
##$DC= 0
##$DFILT= <>
##$DTYPP= 0
##$F1P= 14.0000005364418
##$F2P= -0.99999901652339
##$FCOR= 0.5
##$FTSIZE= 32768
##$FT_mod= 6
##$GAMMA= 0
##$GB= 0
##$INTBC= 1
##$INTSCL= 1
##$ISEN= 128
##$LB= 0.3
##$LEV0= 0
##$LPBIN= 0
##$MAXI= 10000
##$MC2= 0
##$MEAN= 0
##$ME_mod= 0
##$MI= 0
##$NCOEF= 0
##$NC_proc= -4
##$NLEV= 6
##$NOISF1= 0
##$NOISF2= 0
##$NSP= 0
##$NTH_PI= 0
##$NZP= 0
##$OFFSET= 16.522
##$PC= 1
##$PHC0= 75.15681
##$PHC1= 11.57686
##$PH_mod= 1
##$PKNL= yes
##$PPARMOD= 0
##$PSCAL= 4
##$PSIGN= 0
##$REVERSE= no
##$SF= 250.13
##$SI= 32768
##$SIGF1= 0
##$SIGF2= 0
##$SINO= 400
##$SIOLD= 32768
##$SREGLST= <1H.CDCl3>
##$SSB= 0
##$STSI= 32768
##$STSR= 0
##$SW_p= 5175.98343685301
##$SYMM= 0
##$S_DEV= 0
##$TDeff= 65536
##$TDoff= 0
##$TI= <Analysis number 999999
Compound Code 99
Book Reference 9
Project Code 9>
##$TILT= no
##$TM1= 0
##$TM2= 0
##$TOPLEV= 0
##$USERP1= <user>
##$USERP2= <user>
##$USERP3= <user>
##$USERP4= <user>
##$USERP5= <user>
##$WDW= 1
##$XDIM= 32768
##$YMAX_p= 508848824
##$YMIN_p= -282903
$$ End of Bruker specific parameters
$$ ---------------------------------
##NTUPLES= NMR SPECTRUM
##VAR_NAME=  FREQUENCY,     SPECTRUM/REAL,   SPECTRUM/IMAG
##SYMBOL=    X,             R,               I
##VAR_TYPE=  INDEPENDENT,   DEPENDENT,       DEPENDENT
##VAR_FORM=  AFFN,          ASDF,            ASDF
##VAR_DIM=   32768,         32768,           32768
##UNITS=     HZ,            ARBITRARY UNITS, ARBITRARY UNITS
##FACTOR=    0.157963299565203, 1,           1
##FIRST=     4132.6476996994, 0,             0
##LAST=      -1043.33573715361, 0,           0
##MIN=       -1043.33573715361, -282903,     0
##MAX=       4132.6476996994, 508848824,     0
$$ Real data points
##PAGE= N=1
##DATA TABLE= (X++(R..R)), XYDATA
$$ [...]
28385 -31464 -29922 -1452 23862 5054 -37359 -48424 -28768 -33039 -44345 -12862 19241 1393
28373 1393 -24773 -41968 -43721 -28946 -920 1335 14833 30472 66805 33621 12482 10758
28361 10758 -3340 -12482 13738 15098 31019 41083 14604 -41090 -56379 -46883 -46582 -10352 -1630
28348 -1630 -2 6243 8362 6160 23409 37330 63655 36369 -7162 -5300 -5463 -24283 -22377
28335 -22377 -40139 -65822 -87417 -59481 -51480 -20030 -24816 -31868 -28205 -1060 5308 5440 43701
28322 43701 64119 54333 53974 13408 -20492 -37901 -5103 7038 2896 -12712 -15616 12479 29518
28309 29518 34427 9599 16616 36904 34649 27406 18217 19125 -11447 -56718 -54407 -53185 -23230
28296 -23230 -9404 21367 22960 5909 -1260 -23813 -6937 -2269 7605 -7908 -25097 210
28284 210 16005 19482 18792 17884 40453 72339 51744 3168 -40636 -28572 17555 53152 62288
28271 62288 73198 48406 18896 32545 30561 7689 -19899 -34843 -15996 -7868 6755 -15830
28259 -15830 -35752 -27084 -67633 -100754 -82865 -44446 8086 -227 25105 17350 15765 -3596
28247 -3596 6321 34106 37979 19474 -25631 -9267 14707 -3062 5345 -8375 13427 48103
28235 48103 46158 53874 37879 3905 -31717 -79586 -49459 10026 32932 33911 10783 -22939
28223 -22939 6716 32941 15227 -3455 33973 24917 35422 15588 18144 37571 37304 38482 49384
28210 49384 44639 48938 57691 60678 26241 6590 38734 48186 44094 30948 45776 56774 78885
28197 78885 66371 31877 15773 25134 49211 78814 72830 35793 45788 56074 50917 55263 22741
28184 22741 429 16806 32797 22575 4488 -26735 -4110 -4610 -15499 15998 54663 95094
28172 95094 71463 64121 48549 47508 41219 31303 60023 64886 32132 224 17488 1822 -10167
28159 -10167 31680 80514 67980 31503 6499 14671 20294 23738 22895 -32466 -46568 -34807 -46783
28146 -46783 -21758 1922 5212 8699 11997 -4393 -20006 -32440 -19818 -35071 -25711 -20598 -4965
28133 -4965 5599 -19116 -25767 -34527 -29965 -42789 -42038 -15123 -8382 -15066 3280 -42862 -58692
28120 -58692 -65485 -49628 -10803 -591 31981 61183 49409 21075 11445 -11483 -907 23472
28108 23472 36519 -6041 -4266 -11048 1577 35310 42049 33887 13376 6501 7209 33447 16168
28095 16168 -800 9888 8894 -25529 -6567 -21970 -20818 1671 -5 9482 37017 25758 7824
28082 7824 25691 50545 48906 46929 48836 49952 47515 25324 53246 73395 102467 116420 85630
28069 85630 28373 -30998 -45916 -23329 -3790 38637 12486 12153 6889 58038 48878 32746
28057 32746 16454 -30059 -52338 -33543 -12007 -32767 -6643 36726 48912 36482 12911 -5078
28045 -5078 -12352 -22670 -1483 13553 -9758 -2513 46475 63844 26297 9418 30032 51393
28033 51393 22384 -1869 11087 -12533 -10745 -20578 -35658 -39387 -32825 8263 10184 -13528 -1030
28020 -1030 40082 18775 -20257 -43984 -40841 -2121 -32802 -61113 1546 -903 -47921 -59443
28008 -59443 -16926 43469 65722 45380 12679 8373 22988 3700 -9017 -23509 -21761 -10219
27996 -10219 -14816 -56956 -70182 -62797 -51962 -35753 -16907 -436 -19693 -40068 -38757 -31374
27984 -31374 -7283 26002 74717 77058 38254 21575 -12882 -27272 -13960 12551 -29678 -29053
27972 -29053 -10736 -1340 -33386 -31824 -33849 -22702 -25844 13885 23599 22996 25844 -14646 -9545
27959 -9545 15182 36515 19807 383 2794 23206 56459 40494 45397 53154 43856 21018 4349
27946 4349 -37375 -27369 -11714 -24296 68253 86218 67806 59700 50993 46703 27260 8211
27934 8211 25504 30225 40366 34840 32526 40933 33766 23949 -14295 -55076 -42132 -40545 -50807
27921 -50807 -9776 17846 10783 3742 31348 30715 60690 52583 28870 35032 3031 -18014 -7999
27908 -7999 -15456 -46874 -33233 -3610 12094 12753 -7934 -5925 22165 11816 6475 28282 25318
27895 25318 -574 -4604 -36396 -63318 -12194 7898 -32869 -47907 -27179 -19145 -29843 -25932
27883 -25932 -22994 -27396 -23277 -3078 -10953 -48573 -48405 -7762 22568 15700 6446 9367 -9051
27870 -9051 -5742 8771 8969 9989 5524 -10382 50 41912 50614 53055 11744 -25881 -19684
27857 -19684 4072 -2539 -6770 17657 -29193 -39169 19804 25541 17318 23658 14303 -11556 -8767
27844 -8767 28244 36804 30620 33147 -3973 -11039 -14773 -13281 14968 35122 12639 -15306 -20904
27831 -20904 -12839 14823 73474 94322 33366 -20373 -28897 -29292 -23430 -38683 -17747 -10026 1215
27818 1215 11593 37603 29950 27299 5437 -8356 -6148 658 29967 35955 14595 6440 10761
27805 10761 22312 39992 9377 -21674 3119 31583 66954 86936 52758 25234 -24332 -14666
27793 -14666 -8334 -897 8519 1644 -23752 -28029 -33524 3120 17288 15697 -2652 -2487 -12488
27780 -12488 -61191 -52433 -20673 -27215 -21582 -456 17783 20588 23242 -22809 -12958 -24064 -21220
27767 -21220 13455 6352 14273 14802 11677 6802 9623 -11061 173 13637 30572 -12834 -71413
27754 -71413 -59681 -59373 5066 26326 6025 -17799 -17032 7322 57430 43578 20214 19400 -21270
27741 -21270 -52175 -23597 -22058 -22328 20646 19308 28642 13675 -26071 -37259 725 16931 17535
27728 17535 -6074 7875 27382 26808 19639 644 23742 11939 17495 25305 8418 -11125 13929
27715 13929 62065 61268 41469 17275 11261 -8807 -27785 -30852 -47558 -59146 -73254 -45067
27703 -45067 -20976 -11314 -21255 -40854 -8543 4049 3524 10318 8409 -12022 2522 16207 3086
27690 3086 29726 22121 2891 -23162 -13168 -5690 -13662 -14213 -6744 1386 -12012 186 -8600 3540
27676 3540 43902 19741 -1755 -11440 -57805 -40186 5644 29249 37578 10691 -13359 9667
27664 9667 22124 14517 -11650 -27427 -12461 23754 32780 2410 -17807 -25259 -17879 -3848 8102
27651 8102 5884 15584 27837 11917 -2252 -5347 -7301 25945 24795 8805 14457 -11198 -38437
27638 -38437 -60301 -66251 -58376 -62274 -69436 -6691 31427 18161 -27874 -42549 -41562 -43915 -23626
27625 -23626 -26146 -27382 -12205 24348 11338 6371 -11747 24261 44185 41537 23689 -1656
27613 -1656 -24186 -393 -11458 -22858 -26776 -20038 -33885 -413 47181 25317 -6064 -19594
27601 -19594 -42499 -70772 -50201 -44436 -50070 -46129 1373 42405 60079 70797 63762 10385
27589 10385 -42192 -38148 4637 33982 15717 -2657 -30216 -38466 5314 58582 47503 -23674
27577 -23674 -21943 1402 -15838 -40293 -39440 -19471 -63174 -97720 -74343 -43074 -63587 -55716
27565 -55716 -30920 -18998 -29832 -8523 -9804 12759 15062 9588 16114 58989 7486 -13512
27553 -13512 -806 -9498 -7052 744 5003 -5304 19154 44761 -2912 -14309 -19493 -19963 -896
27540 -896 34103 36845 38426 9695 -45777 -86853 -70404 -39009 -9288 -28829 -27547 -17957 -24878
27527 -24878 -21062 -16009 -10737 -5944 -5541 15700 25858 -4460 -17214 -9081 -894 -21513 -25748
27514 -25748 -1507 34186 15942 -23985 -1541 -13070 -32859 -9399 -37588 -42811 -27379 -22231
27502 -22231 -40102 -45119 -42782 -22531 -16443 -17125 14264 37857 7140 -7930 48386 44325 38454
27489 38454 33204 4536 -19967 -63932 -48503 -40748 -55292 -23342 -4817 15362 18872 -8675
27477 -8675 -36612 -13563 -28564 -19917 -29005 -7890 56613 50370 22072 9144 23047 57584
27465 57584 49317 35053 20925 -22806 -28535 -7446 -29732 -24090 3205 -38675 -63775 -22040
27453 -22040 36854 53656 21244 -13865 12331 8792 -2240 -26589 7111 4851 -7200 -5690
27441 -5690 -33043 -21659 -17505 -10989 6244 -6845 -13485 -31069 -45757 -66954 -35618 -13681
27429 -13681 -12230 -15060 -4644 2488 -9008 -19408 37996 48077 14722 -6220 7054 35620
27417 35620 37719 68511 92383 54780 38831 32811 31337 24759 9566 -14468 -3559 25169
27405 25169 27086 35596 69034 40446 40141 41792 -23844 -6043 21393 22693 52835 58494 45053
27392 45053 45022 16231 -7813 2339 -5738 -16949 -29042 36 -10962 -34652 -24407 -28722 -15941
27379 -15941 532 11357 33130 6852 2503 10391 -302 -27214 -57467 -66556 -76424 -64343
27367 -64343 -38928 -4062 -8307 -5964 -22370 5800 32178 10245 -1779 -20219 2004 26253
27355 26253 -3325 -46228 -21951 3386 -29598 -34945 -36484 -1609 11552 23744 54780 43973
27343 43973 48481 68893 66509 62451 33135 12727 24731 31770 6022 -38997 -35533 2726 -15841
27330 -15841 3076 -3731 -24148 -27078 -3764 6413 -10394 -16122 -9517 5996 40803 31472 25904
27317 25904 11999 -5116 -10752 -8162 1845 -9750 -32736 -7446 26014 26962 -5277 -17291
27305 -17291 -15330 4206 8790 -3504 23281 29846 31625 31399 24670 37412 17634 2697 26158
27292 26158 36426 -12596 -54134 -90294 -123051 -94793 -70127 -47525 -29871 7011 50107 29510
27280 29510 15321 24460 5561 -48249 -23755 7134 15389 51231 46089 37079 50831 72247
27268 72247 55403 38805 48113 59016 51651 54780 33108 5298 28149 69724 26295 -19693
27256 -19693 -8483 -3670 -3814 6853 -16701 -61962 -36881 -31760 -22978 -28185 -26155 -47145 -16732
27243 -16732 20882 71664 59671 44438 61052 27526 8890 -32913 -5840 -17846 -28797 -39458
27231 -39458 -33320 14176 16619 19949 32003 48018 46038 49020 36269 19274 27203 27351 2738
27218 2738 -27795 -13794 13967 29518 2975 -37307 -100520 -87597 830 45242 12372 -88609
27206 -88609 -101564 -106294 -117089 -95050 -11471 34294 4756 -13257 -7303 -4009 4615 -19158
27194 -19158 -43677 -51909 -54299 -53466 -44486 -21261 22763 16187 -19162 -41654 -29640 -20333 -26000
27181 -26000 -48423 -11647 -38693 -62580 -36625 17744 39067 13397 -39500 -24315 32001 37253
27169 37253 1250 -40870 -32670 -9221 18319 38198 17433 31913 27144 -3026 33058 55871
27157 55871 48599 14208 6675 -141 -24780 -33293 -2523 3525 -25931 -47432 -31884 -10867 9239
27144 9239 30938 49324 38670 40291 24604 28610 39628 53033 84612 96287 95078 85907 76779
27131 76779 50926 47576 52004 85911 51682 30470 46753 19598 3855 5692 -1777 -51912
27119 -51912 -54545 45740 65502 8548 -6916 -2341 -11596 -16398 -26238 -32464 -42015 -36966 -16232
27106 -16232 -17359 -3507 5428 -8538 -11241 -36727 -37434 -34438 -50238 -12391 -32971 -22119 31146
27093 31146 50300 32941 51138 52691 54698 39601 18718 -7204 -18531 5800 -8853 13239
27081 13239 32099 -23878 -31059 2644 46788 43538 10494 -23640 10948 35442 24675 24894
27069 24894 37123 13340 9448 37749 42041 14564 6546 16811 29625 -4316 6481 15593
27057 15593 1906 15853 38658 58620 32762 -5437 -11238 18637 65392 100513 38097 2600
27045 2600 -5184 10443 9755 -5525 -28158 -14595 -11447 -4276 -15558 -5727 -12463 -8135 -12061 -13080
27031 -13080 15282 22281 6869 -13345 -35071 -56087 -59186 -45632 -39368 -60254 -44620 -14233
27019 -14233 -8706 -9255 24334 12392 2395 -5476 1267 23230 27932 51806 53119 25889 -9754
27006 -9754 -5588 10455 -5829 7562 15998 13115 -9960 14744 39749 -961 -58133 -50797 -36963
26993 -36963 -45499 -14775 23145 28216 47562 30658 16721 -4583 18279 37671 17494 8528
26981 8528 7845 -17756 -46329 -57922 -33178 -4592 12896 -297 -57353 -84182 -79471 -39304
26969 -39304 18015 13434 -13353 -15108 -29404 -37155 -20544 -23846 -7907 -24916 -36592 -23192
26957 -23192 -7823 16650 45591 87341 69176 59374 30273 55681 53919 33696 13754 9635
26945 9635 3744 -8932 9384 -8926 10099 5591 -34123 -37345 -9566 9179 -20030 3240
26933 3240 25684 52143 18979 -22578 -73658 -75007 -15288 6526 19090 60432 62733 32169
26921 32169 46900 26676 -7531 2488 -20570 -32224 -13522 -16789 -42103 -106276 -103623 -67074
26909 -67074 -32525 -24640 -16133 25331 25364 -6406 -19718 9645 20356 -8993 6964 2786 26524
26896 26524 47675 15476 -5064 32734 32527 20669 14138 13554 46621 28512 30262 29107 -11108
26883 -11108 -2401 32366 42270 54923 53390 32814 7359 -13744 -35113 -5424 50556 59347
26871 59347 68510 65437 24885 10523 10093 -23225 -26560 11928 13598 -15766 3288 23136 -19163
26858 -19163 -15451 -16093 -68206 -77588 -54571 -13035 -12065 -29069 -14842 -15206 -52246 -72892 -30172
26845 -30172 9502 17147 20841 20847 20285 18191 35350 76866 38403 15612 23925 10075 -24974 -2851
26831 -2851 -42756 -56747 -75707 -47715 -16998 -7286 18199 45812 27077 5827 30440 30319
26819 30319 20081 19796 22185 41991 46542 15367 15867 23841 28752 14755 -60772 -72971 -70960
26806 -70960 -52809 -13721 15355 35175 28975 54040 61731 24967 -18369 -73569 -50893 220
26794 220 14530 5429 -20346 -57021 -65866 -27179 3473 25324 41150 31152 14063 -13700 -30387
26781 -30387 -34501 -49006 -42837 -46021 -35940 -16910 -30942 -63091 -55130 -13711 2299 -31844
26769 -31844 -33530 -33549 -29947 -49615 -27224 -10072 5781 23903 40095 47253 46112 25084 26132
26756 26132 34093 16829 -6620 -46117 -41211 12030 38311 -9152 -22591 -24604 -4834 -28770
26744 -28770 -36303 -22634 -34639 -36752 -14867 22471 52053 54826 18902 4489 -19315 -23387
26732 -23387 -8484 -23870 -6633 -2937 1783 -42350 -28194 -12453 -4800 -25839 -20516 9438
26720 9438 36234 34399 -2431 -6354 29511 30599 11893 -8961 11290 25749 35291 10622 7556
26707 7556 1816 -7682 7676 12143 -12945 -18556 -38032 -38717 -27252 -50634 -40991 -21926 -12877
26694 -12877 -21277 -17083 -31643 -65394 -50794 -21199 10035 29845 58130 44507 3715 -34890
26682 -34890 -27482 -20501 28157 37654 2725 11250 41732 64379 13133 -14154 18005 21359 12534
26669 12534 5713 27515 43209 19467 16135 15258 33479 35991 37158 9924 31214 47473 35557
26656 35557 53310 51007 47314 4684 -7607 22771 17760 9830 384 -16762 -18534 -46585 -63534
26643 -63534 -46994 -49202 -71743 -42242 -30581 -51069 -85335 -70370 -32851 -36156 -23679 -13812
26631 -13812 -29121 -33193 -51982 -31212 -44180 -58794 -29869 -31251 -58115 -48178 -17138 -38862
26619 -38862 -84154 -97049 -61923 -52313 -43212 -2656 19160 42760 41589 25061 -5078 -19683
26607 -19683 -4530 -27748 -13067 5141 25690 -1089 -2341 1667 16097 9952 32895 38634
26595 38634 1069 7525 2020 6181 -3499 -3065 13446 41725 32337 14499 18428 30052 29427 -11
26581 -11 2252 2479 -21692 -34728 -53236 -3592 3095 -19061 39532 79261 84319 69703 22031
26568 22031 7356 8041 1449 -12199 9405 17234 6910 10861 24239 43505 61872 33442 -3260
26555 -3260 -11275 12700 34410 38928 20846 15267 24313 68306 41738 -28367 -34501 -32111 -55656
26542 -55656 -61556 -38218 -33606 -34517 2462 -21556 -63857 -76568 -58367 -17736 6265 3890 5185
26529 5185 -7879 -24680 -2161 -7180 -8757 14391 12769 -1932 -14741 3432 -17170 -9505 18567
26516 18567 -10032 -12081 -36450 -49485 -49113 -36178 -61771 -77656 -70438 -48507 -39861 -42962 -70093
26503 -70093 -39575 -42994 -54302 -45433 -2136 -13376 -47501 -24567 7844 4942 -24041 -34985
26491 -34985 -37045 5004 27513 27214 16037 -23159 -29837 -20563 2536 3240 21283 25314 56583
26478 56583 106277 109730 110190 77353 49827 68292 47442 46383 40799 -882 11915 33402 -12095
26465 -12095 -47325 -28706 -24040 -21900 3464 4464 -10642 -8844 -3840 24274 63085 80614 58549
26452 58549 10909 -15419 -12 20688 39552 61015 42418 5449 -32135 -10045 -27111 -78400
26440 -78400 -75934 -42800 -57262 -83655 -54751 -45165 -53524 -37290 -28074 343 712 6301 4417
26427 4417 13411 -1138 -18163 -21078 -7323 11176 10554 34193 58739 47646 8505 -5507 2213
26414 2213 463 -5124 -1175 -42719 -84272 -54563 2139 -1213 3006 15147 -15464 -23736 -27630
26401 -27630 -33194 11841 33236 41551 25715 39344 30349 12108 3983 37752 29487 43823 5251
26388 5251 -32125 -7356 -34672 -47970 -14524 19102 -7471 -15404 -38315 -39206 -39192 -60806 -22918
26375 -22918 23961 49771 13433 -15565 -21894 -31798 -8302 4974 29461 14826 4358 -29969
26363 -29969 -37227 538 21179 26174 10870 -16200 -29098 -7571 2474 -23541 -50309 -34837
26351 -34837 -29906 -985 11766 19243 -5317 -31890 -17232 27303 48729 29359 33379 -6002
26339 -6002 -45388 -34283 -32227 -30512 -30680 -42446 -35782 -27994 -25179 -19976 -12334 -14052 4080 46061
26325 46061 29747 -3528 11381 8996 23044 44655 75792 56352 29171 29066 43128 46586
26313 46586 21741 -12325 -22216 -27940 -1081 11562 10581 28742 32621 23441 19491 20282 16830 22147
26299 22147 18166 16451 22504 16293 47297 38949 9365 21222 -4789 -1629 18228 36981 29107
26286 29107 18776 -3765 -22526 -40318 -43940 -47676 -11320 27659 22664 75 -11804 -11525 2569
26273 2569 1237 -19524 -15128 -13954 19028 48029 54898 24031 11547 -18216 -27748 -12986 -48363
26260 -48363 -66013 -38888 -44629 -71302 -31545 -45243 -72299 -37270 -7840 -23488 -27625 13893
26248 13893 23785 -2012 -56801 -103836 -84340 -67131 -20586 3766 28371 50088 56982 40210
26236 40210 50896 26274 -19406 -34891 -35543 -38541 -27242 122 9919 20442 -5668 -39242
26224 -39242 -31170 -27604 -35619 -45079 -41360 -55268 -49186 -21644 -3201 -23356 -37271 -40620 -24926
26211 -24926 -13806 -7635 -16432 -4122 1166 -7597 3862 -41179 -57801 -58814 -85595 -55991 -37702
26198 -37702 -35459 -38724 -27055 -15843 -19533 -12528 22529 38478 32469 31722 27765 -7014 -13565
26185 -13565 12133 26619 20263 15649 -32368 -26179 22432 30782 27472 34273 9992 -23045 -44439
26172 -44439 -30070 -6698 2767 -17156 -58115 -81136 -47036 -16305 -12126 5413 -5180 -42147
26160 -42147 -25371 -31751 -64060 -52471 -40037 -21743 32727 12039 -10463 -19795 -47482 -50810
26148 -50810 -35981 -42272 -25067 3102 36243 65244 43169 -30021 -59700 -48309 -61420 -87097
26136 -87097 -79186 -36886 20577 43596 19685 7775 16116 17427 24238 652 -2147 7883 11916
26123 11916 14872 -14559 -4345 7816 -2968 -18264 -10346 15603 18597 8046 1280 -11705
26111 -11705 -5780 -5932 33132 65605 61034 26043 -20473 -42274 -4908 44222 32768 10308
26099 10308 -22880 -41113 -25755 -23014 -6954 -8289 -31530 -36945 -23633 5619 -1371 -32023
26087 -32023 -21998 -16060 16676 32322 29121 27486 48673 50482 42738 68686 101243 92787 76825
26074 76825 23671 20360 29842 23795 29081 21551 -14585 -60212 -47248 -21890 -26946 -16879 1511
26061 1511 25144 29408 -7892 -10182 25960 31609 38055 35908 11352 4996 20375 9949 -29945
26048 -29945 -24478 10731 -17915 -31144 -19827 -74267 -87148 -86098 -47266 -28666 -25864 1080
26036 1080 33902 2188 -17842 -28241 4366 7896 7831 7634 -11662 2314 22534 12632 4758
26023 4758 5672 -6503 12280 30333 43285 22751 -6209 32632 42752 106840 155368 115494
26011 115494 57061 18003 -3738 28110 26202 2670 -28919 -59494 -53260 -18284 -11184 1930
25999 1930 50696 102572 77342 29680 14810 29090 21006 -2626 -9504 -18959 -4285 2400 -24242
25986 -24242 -55920 -34979 -44518 -46828 -60374 -58982 -34007 -38864 -44193 -1697 11216 -17038 -23535
25973 -23535 -22776 21593 15898 27027 65441 59402 37656 57036 66177 20485 -10156 -1984 -40688
25960 -40688 -13664 35919 57652 45319 23646 47110 25622 28230 12269 -35220 -58520 -45147
25948 -45147 -52448 -44124 -22690 -1508 29101 15448 -9867 -28557 -56541 -41825 -54729 -52490
25936 -52490 -43691 -13446 -5729 8220 25460 17458 12235 524 -10052 -39204 -18792 -4270
25924 -4270 -2859 6759 1779 -33125 -45679 -40785 -25926 5049 31934 89059 76381 15855 -7117
25911 -7117 -4774 629 6731 24176 9486 -2089 24709 16346 34743 40975 39405 56551 75716
25898 75716 67413 16421 -27258 -54578 -65052 -75943 -93272 -48633 -1878 -25748 -24415 -29011
25886 -29011 -16782 -8936 -17451 -2758 24490 40518 28384 32990 40563 77208 103516 71090
25874 71090 29024 14972 -10370 -24629 32613 46735 41837 30139 29503 -4993 -7605 7372
25862 7372 9561 23074 -14118 -26522 -13234 13263 27129 31989 39904 67043 49467 31447
25850 31447 10020 -6981 -19616 -8785 10473 23490 10566 -20409 -17002 6663 6094 24013
25838 24013 -17823 -68371 -44519 -38484 -71182 -46993 -52397 -42670 -27815 -17973 5886 -22907
25826 -22907 -30766 1645 23154 47395 77649 56908 22462 -6555 8589 6308 26062 6178
25814 6178 -9349 -35884 -54870 -43408 -23178 12305 54596 55388 41500 -1757 20621 43200
25802 43200 15059 -6620 -8521 -31215 -9288 14893 33085 -3006 -46192 -13620 26838 14928
25790 14928 -36645 -29752 12163 36243 50352 41477 -15283 -69437 -37176 4573 34117 58626
25778 58626 77030 31897 10974 -4683 4660 37915 71591 35043 325 -23596 -17635 -45766
25766 -45766 -28647 -29126 -26039 -30997 -42692 -26575 -32047 -38032 11605 -10551 -41279 -65791 -74277
25753 -74277 -82202 -65398 -40212 1679 -22424 -7875 35930 38082 13840 -6957 14690 22019
25741 22019 -127 1615 8249 4770 9694 36401 27310 73630 69255 37874 14014 10056 7128
25728 7128 18595 -27827 -41718 -9515 -38084 -53301 -26911 179 -1766 -35277 -44190 -43862 -43213
25715 -43213 -38256 -4518 45159 50951 14996 29607 52729 72026 67480 57572 38929 49023
25703 49023 25078 -5299 4733 10296 37676 -21419 -34306 19845 17283 -19731 -32638 -6179
25691 -6179 37592 49729 58272 54069 24136 -13580 -21780 -27894 -19302 -1272 18721 24245 30258
25678 30258 55933 47701 7212 5115 16274 -9291 11066 31510 -17761 -27195 -13334 -25064
25666 -25064 -35502 -49879 -63534 -60499 -68405 -70691 -29588 -34470 -74555 -40920 -704 -36509
25654 -36509 -11229 1066 -23770 -5724 -4826 9497 -10599 -24717 -821 2112 -7881 -13214 -10921
25641 -10921 8606 43077 8680 -29350 -5494 -4277 -2873 -247 -21515 -54702 -71151 -59436
25629 -59436 -46851 -57548 -49286 4976 61541 99823 66774 23107 26679 69249 66521 16223
25617 16223 -11034 -9837 -20643 -35647 -41525 -37536 -2393 -17593 -49398 -4549 38787 40822
25605 40822 23706 15652 -15933 -7837 28382 26292 22335 -17696 -44789 -47471 -49631 -43628 -59541
25592 -59541 -7340 28035 30761 19142 34132 47987 68910 57749 49264 33262 28048 22951
25580 22951 38059 8140 -12153 -2718 -6411 35231 64455 44993 12819 42475 37523 35940
25568 35940 44492 33742 5059 -9826 -13623 -14739 3758 -13811 -8541 16173 15056 26232 49371
25555 49371 35634 2869 -18346 23008 74714 89606 81082 56771 20271 -9634 9313 29334
25543 29334 21372 -21590 -28296 8118 22368 4564 3167 27691 30619 18950 24870 27953 -16812
25530 -16812 -31628 -38875 -35938 -60388 -29959 452 -39553 -84879 -58411 -34041 -27796 -55474
25518 -55474 -44241 -33017 -36790 -6959 -10817 -23988 -6836 13443 38127 33580 22940 14735
25506 14735 25255 28693 33676 40122 32641 2806 -6580 -15397 16710 14467 7642 -5794 -25457
25493 -25457 -57053 -34112 -576 -8888 -32855 -54206 -39972 -34096 2098 48581 75835 45354
25481 45354 11413 4769 12717 36271 64980 62813 52435 -5811 -46741 -42718 -45786 -44778 -28421
25468 -28421 14026 33692 24891 -21062 -6223 17342 27086 16507 -19251 -22957 -54341 -48595
25456 -48595 -76562 -62066 -19768 13514 20698 7066 -27984 -40035 -21182 -20144 -42713 -80317
25444 -80317 -79674 -45967 -33297 -19010 -22417 11817 -17571 -71469 -56404 -47074 -70927 -75565 -57832
25431 -57832 -52009 1765 60390 94424 121410 81684 33736 9192 20627 33367 26119 31766
25419 31766 21878 -21037 -26657 -31117 -49275 -58189 -45892 -37727 3182 5234 6185 -2499 -589 15135
25405 15135 18822 19857 44016 67282 68894 14222 -12579 2228 11547 -2253 -20346 11988
25393 11988 23260 19713 12820 3487 -17896 -39200 -33932 -39800 -29440 -14089 -9769 -24270 -34170
25380 -34170 -25164 -8049 -8229 -2074 3834 30622 24163 -23903 -15857 -29989 -96121 -108162 -20230
25367 -20230 -9640 -43912 -55920 -64302 -70618 -53861 -50726 -51440 -80078 -86584 -87302 -80558 -37373
25354 -37373 -29355 -21644 -5055 14380 73804 38546 13519 38173 55108 68842 49133 35678
25342 35678 4596 -38248 -15215 -10150 -11724 -26728 -26911 2920 28587 37950 32545 6154 -41518
25329 -41518 -49086 -16086 6085 18261 20655 32342 32411 18079 65401 102197 80754 38303 20564
25316 20564 -6030 9209 845 8720 35002 4874 -24609 -18838 -13890 -266 53985 39488
25304 39488 9481 43624 65665 52769 25481 30449 -11234 -21189 16717 29389 21888 -8153
25292 -8153 -38590 -51848 -85690 -75048 -8761 45209 71011 52185 46757 30934 38721 25991
25280 25991 -2680 -6550 15793 -400 14517 33796 24252 22629 18086 45880 67575 57335
25268 57335 40454 23599 4737 2946 3518 -12191 -43182 -19034 32476 -23067 -80826 -83249
25256 -83249 -76482 -109866 -112243 -69024 -48389 -26014 -12343 24932 44675 29526 33840 43254
25244 43254 46308 66099 57155 26018 -19305 8886 31572 -8832 -10963 -23012 -56835 -85273
25232 -85273 -65411 -35453 -44784 -45981 956 -17634 -5646 -7194 10690 59644 46811 26248
25220 26248 -13378 -44548 -642 1074 -13562 -24024 -16674 -33332 15739 37314 1896 -13756
25208 -13756 -5457 -14765 -18788 5343 41559 44642 -14311 -13679 -3866 -28217 -27660 -3869 31445
25195 31445 46412 25084 11066 3711 -3251 -26644 -18102 -25091 -56270 -37757 -8043 -15318 1996
25182 1996 -16888 -45063 -57200 -81042 -80757 -67315 -66807 -62847 -59193 -52995 -106417 -113960 -64507
25169 -64507 -50419 -30451 -24830 -14480 -17801 -8928 8261 14502 9233 24027 51495 34622 -24979
25156 -24979 -33314 -6276 18299 8794 -8708 -25368 2825 25136 25661 21041 -17473 -38426 -47013
25143 -47013 -84682 -65105 -39648 -65745 -80234 -48672 -54357 -31221 -79984 -82182 -54451 -53200
25131 -53200 -23239 -27500 -5165 14631 5613 -73748 -83397 -36229 -18092 -34614 -19418 9680
25119 9680 30347 56078 46080 43675 27792 3482 -23026 -1926 -9607 9262 27910 8572
25107 8572 1795 46153 52686 21532 4564 14033 10968 -8950 20425 38292 56864 68551 -9330
25094 -9330 -62884 -35276 -30695 -61155 -54280 -49820 -47905 -39836 -16665 -10090 -82 -10259 -7967
25081 -7967 -20839 9064 -18472 -22353 -23232 -1842 29272 18903 910 -7111 20897 15148 26494
25068 26494 27761 20802 25940 54137 26691 648 21275 23777 3120 12016 -2759 -13288 -28423
25055 -28423 -35824 -68620 -33289 -22164 -48313 -17315 12175 29819 27866 5866 -24537 -42387
25043 -42387 -31883 -5013 12338 23681 1997 -24805 -53431 -60720 -53740 -45286 -21292 1850
25031 1850 42021 61801 7994 -919 -7463 -28609 -41836 -62497 -67091 -12851 -17295 -6250 -28297
25018 -28297 -18984 8467 39438 45246 68515 59421 23277 34674 42130 53944 22788 -11710
25006 -11710 -41732 -44005 -45624 -36884 542 -1082 -20357 -24352 -5450 -23980 -1375 42607 38629
24993 38629 38229 37523 49244 53205 55045 43452 27493 6784 -12760 20930 54979 42876 12045
24980 12045 -14766 -17455 -572 10957 28218 -12599 -4691 7895 -35223 -45079 -38053 -31267 -9244
24967 -9244 6669 13240 -10937 -36492 -23106 1167 -12070 44156 90003 58528 16909 -8111
24955 -8111 -18538 -8031 -14869 -59637 -58643 -39877 -41211 -14812 11811 10690 8309 -15034 -50288
24942 -50288 -21662 9492 25938 4610 2040 -23901 -20854 -7693 -8791 -24113 -23531 -13249 -27435
24929 -27435 -3801 -3660 49383 70909 72186 65662 14315 2899 25903 38063 18906 -23826
24917 -23826 -39882 25708 36057 37013 38251 34127 46117 21999 -9759 -31793 9251 13328 -16629
24904 -16629 -43243 -59650 -21311 37236 79640 31786 -35462 -46383 -19425 5517 -24198 -24413
24892 -24413 -15564 -21518 -12153 -12462 -6461 -24267 -30995 -7772 -498 -50469 -86588 -45015 988
24879 988 22239 21241 9919 17826 11907 43547 45001 38130 14543 2473 -19750 3631 -25787
24866 -25787 -49007 -9167 10007 -17598 -34566 -53654 -66093 -72046 -49906 -39971 -35966 -26829
24854 -26829 -24261 -28327 -24325 -16656 -15550 -5625 5877 14417 25561 8083 30703 48169 16991
24841 16991 26396 40932 21131 23691 32756 50006 30900 -1387 5509 -7961 9293 36699
24829 36699 27304 11584 -30256 -32328 -29994 -6511 34294 24917 -6517 -13544 -13250 -9933 -1609
24816 -1609 29244 37660 26214 22742 24663 13074 -2197 2453 38725 53714 2682 -42190 -59654
24803 -59654 -63346 -51919 -25573 -13233 -24980 -15161 18593 23480 45427 16447 -28620 -53886
24791 -53886 -26514 -14601 -18947 22432 41461 60947 51820 33385 -15828 -19017 -5126 -9275
24779 -9275 -20043 -29220 -31145 -33078 -48727 -11611 54270 69188 69489 59575 35181 18945 19514
24766 19514 14383 20289 41886 35421 11764 13892 -22424 -33588 -24904 -25598 -14123 -105 409
24753 409 -16023 2470 6162 6724 -4168 -27386 -43997 -24655 -37467 -9156 -25011 -24501 -21387
24740 -21387 -25444 -28720 -39116 -29317 5721 -13124 -10532 29184 92903 58983 26286 30953 14941
24727 14941 1492 20502 15259 10028 21538 -27276 -47502 -23734 -47950 -27830 -12518 16787
24715 16787 21389 -13265 -30923 -28396 -29833 -35544 -3852 30594 41141 21090 44018 32755
24703 32755 13606 31823 29392 7322 -23271 -34879 -40369 -41172 -34099 -3057 14727 28189 23617
24690 23617 2924 -7985 -53061 -71414 -58965 -10548 -8234 -27410 -51547 -45924 -33279 -57585
24678 -57585 -47390 -12705 22299 -10515 28641 24723 29638 24921 3981 -377 8599 19322 882
24665 882 43270 59816 68276 45648 19413 13201 2045 3086 -18555 -11452 29562 28492 -5449
24652 -5449 -30379 -41224 -27559 2222 45284 39588 29871 26905 23474 26240 -2173 -14546 -16808
24639 -16808 -15341 -15398 11384 13255 20437 34347 19870 -10208 22562 55081 39689 13862 6159
24626 6159 -26824 -43374 -19356 20701 22603 -15594 -37184 -30507 -7220 -11018 -16425 7065 13967
24613 13967 -3614 -33169 -40380 -37460 -30661 -16579 -6693 -9518 8105 10310 31604 24733 -8132
24600 -8132 -31926 4887 -620 -60 -8844 -42239 -55513 -9731 25479 30037 5974 -17322 -18786
24587 -18786 1450 5858 18485 36580 46122 44455 51534 55659 43003 -322 -39743 -42420 -28880
24574 -28880 -40587 -40870 -13295 12737 933 -3951 21540 16566 -1661 64139 75517 42615
24562 42615 18169 29714 37759 18415 5208 2646 -38054 -37203 -10465 -32333 -34934 -63880 -44123
24549 -44123 -17790 -5126 -7351 -23439 -44108 -37753 -26099 -37029 -12926 -27873 -8229 19785
24537 19785 8032 -2552 -11266 -3363 -28944 -16938 -9925 -28949 -4514 2959 503 -23684 -42851
24524 -42851 -42143 -22829 39891 28873 10148 11948 63757 91364 51531 24397 5105 38225
24512 38225 11152 12136 38655 47845 16367 -32376 -53951 -32620 61025 76453 54245 20279
24500 20279 18841 41205 51440 10049 597 -812 8262 2631 6934 26465 50681 46080 26313
24487 26313 8900 -778 -13341 -8872 -15824 -27054 -38629 -73091 -60387 -27664 7474 37092
24475 37092 57878 42351 34967 64339 51453 28191 20078 12992 9179 -42674 -43436 -50858 -14544
24462 -14544 -32548 -26784 33422 49971 15320 40558 59586 29170 12937 -7848 -8839 -17406
24450 -17406 -11916 -5861 -18127 7325 65208 66634 21558 19005 61497 66843 51055 46774 41071
24437 41071 17005 38318 60693 97394 86382 52592 33309 56287 42834 10861 -23434 -12746
24425 -12746 -4715 4598 -5795 12685 12071 -14303 -21799 1554 7609 -42602 -61996 -53493 -23495
24412 -23495 -11591 -15638 -22909 -38303 -52035 -43718 -20309 -46947 -50010 -71531 -23153 -2946
24400 -2946 8790 -21171 -46327 -56064 -30746 -26282 -26984 -13681 -25288 -6361 44883 53938 38577
24387 38577 25344 16852 21242 6348 13666 11063 -23734 13505 59323 68403 45740 17996 45933
24374 45933 32452 9427 14189 47099 40814 38146 3147 -12443 2711 17857 3368 563
24362 563 -4856 52842 67767 14939 -46738 -59949 -30037 -13717 8980 -5218 38889 55007
24350 55007 -4661 -5963 2066 -4366 8279 12831 4603 15087 35550 15493 -12953 19481 25983
24337 25983 33866 48577 54423 24127 13774 18100 21311 28488 53696 72890 74323 35850 26773
24324 26773 9451 17614 27145 5265 -34998 -12636 -5856 -22281 -14122 15665 12276 1050 -13133
24311 -13133 -28337 -42704 -46536 -31529 -52216 -60769 -36255 9533 12995 -12573 11127 35900
24299 35900 14936 -45526 -71056 -52623 -24590 -30709 -55292 -34739 14726 23239 34835 37637
24287 37637 47079 50362 64594 73351 62427 41393 17031 27695 58053 28732 -48894 -38156
24275 -38156 -36141 -42756 2064 8747 -12580 -20242 -38573 -25025 -18422 -4533 -39473 -24972 -17242
24262 -17242 24366 45082 52897 26243 -7971 -4438 -15465 -8933 -7679 -6648 10639 5797 -7906
24249 -7906 -41791 -63141 -34847 -27882 -22744 -67630 -50009 -22996 22003 -875 -36767 -60614
24237 -60614 -70559 -57553 -4644 3179 30175 34025 21018 -492 -37327 -45035 -33691 -34312 -47415
24224 -47415 -65228 -60256 -50379 -49326 -34478 -29858 -28964 20365 20551 14878 33563 24774 597 -22417
24210 -22417 -17031 -26563 -3090 11301 27333 10560 14563 28041 34542 24439 -36763 -55345
24198 -55345 -27644 48092 46930 34988 13034 28160 22736 -20398 -29255 -40666 -35423 -27246 -21826
24185 -21826 -5311 14782 9980 -10597 325 34184 36276 20693 -8527 -21703 -31977 -27384
24173 -27384 -26908 -13287 35925 35591 26230 41927 26774 -22753 -33258 -53643 -71780 -44606 -71256
24160 -71256 -66067 -40608 -42890 -38002 -35232 -6821 2240 2940 -16955 -14607 -5309 -16671 -50563
24147 -50563 -79200 -43866 -17609 -33645 -4073 -2583 -3806 -23926 -79587 -20771 18515 42320
24135 42320 69181 52010 40658 28191 13576 38256 12735 -314 8338 1339 -4453 4782
24123 4782 39189 26886 -27258 -40916 -32316 -8325 -22609 -33063 -25843 -1732 708 23721
24111 23721 52430 46266 40381 5555 -24443 -24808 -29051 -11888 -8213 -56790 -46885 -53114 -72119
24098 -72119 -23757 -12350 496 -36963 -79480 -43667 -6588 -11410 -8273 -11281 -2356 21301
24086 21301 46688 46046 23453 33397 57600 36652 20080 5503 -32969 -33738 -43071 -34627 12462
24073 12462 24092 41442 40036 35847 34021 18839 5593 -12757 422 -19338 -26850 -15042
24061 -15042 -1822 23588 -21156 -29888 27641 15504 8925 30253 -6893 -50913 -70819 -85838
24049 -85838 -96564 -60501 -40271 -61912 -51476 -11186 53036 83306 54413 10155 -11370 4479
24037 4479 -11108 -35840 -20270 -47985 -39715 -49109 -58635 -71831 -68596 -75489 -54492 -46943 -68433
24024 -68433 -100872 -104417 -60904 -20303 -13109 -15363 13999 6070 -16893 -37318 -32616 -25369 17358
24011 17358 50577 62125 42613 5176 -13214 -8271 -7642 -20520 -18690 -1878 -38718 -52426
23999 -52426 -29147 -13602 -24022 -849 21359 39344 67765 10883 -19649 -29803 -18525 -8443
23987 -8443 -30866 -65899 -69159 -39124 -19633 -35213 -21558 1461 1146 -7144 14307 15934 -18759
23974 -18759 -41200 -36036 -8376 4298 24390 -14190 -34209 -1425 15346 -20312 -12510 2664
23962 2664 -6047 -7909 -3434 -8295 -10842 7675 3500 -2797 8712 22260 31898 31487 49171 43555
23948 43555 -18045 -60804 -35180 -19607 -8329 -613 -16210 -29689 -23232 -16768 -43171 -12730
23936 -12730 -46381 -94271 -83349 -62234 -83436 -37893 -23804 -37204 -2795 5387 35593 38724
23924 38724 27912 195 -11627 -6234 3142 15782 13028 35177 28406 -14606 -55737 -81687
23912 -81687 -71765 -61599 -32025 -17632 -23930 -5657 28129 26191 3324 2839 -11351 -31951 -18076
23899 -18076 13152 16100 -9522 -19023 -7380 17368 -7493 10274 32588 14559 -1354 -21286
23887 -21286 -31045 -51438 -45436 -13958 8036 -3959 -20605 -5962 1587 1138 29534 14857 -7154
23874 -7154 -36707 -52883 -18409 8674 -4859 -6648 -23800 -409 11666 13923 -15139 -42370
23862 -42370 -35896 -528 43779 61635 52267 33486 24490 21673 41478 41861 61152 90615 89828
23849 89828 90366 65613 30982 23578 37143 43090 7813 -19002 -31290 -62648 -63810 -21323 32113
23836 32113 11267 -22301 -22714 -16522 19966 47086 28984 5463 -24323 -74109 -91634 -50619
23824 -50619 -3886 4092 19343 8996 -7315 2617 17638 -3530 25026 33564 28958 10953
23812 10953 -20538 -10177 -37621 -57059 -78259 -58353 -25109 8897 27267 -7704 -10867 18699
23800 18699 35237 25185 -25649 -34068 -2231 -587 27945 34399 36600 18769 -611 -20978
23788 -20978 -17483 -4977 -20338 9856 37850 502 2544 1204 10993 4211 -13866 3388 -15075
23775 -15075 -17969 -32366 -40684 -13987 9431 -13229 -4398 -19235 3100 18624 -2887 -21600
23763 -21600 4877 29673 -15605 -2571 15052 10943 6184 -5844 14288 15554 7675 850 -51336
23750 -51336 -59535 -38315 -18579 -10679 -16144 -10143 19063 7233 -5017 -10945 -9095 6465 863
23737 863 -8215 6978 24429 6367 3582 17607 42577 35415 18247 7776 -28409 -13515 34274
23724 34274 48230 40544 21487 -2036 10444 4072 23728 45143 72713 62593 91400 53969
23712 53969 29272 6287 -9864 7534 17042 10708 4636 5156 -19653 -49349 -45290 -54729 -49068
23699 -49068 -44494 -31048 -39897 -32050 -34719 -29827 -12243 4648 13713 12941 10676 5900 7579 36269
23685 36269 9841 -6160 -26625 -5498 -18069 -46860 -35349 -8265 -23442 -31474 -32088 -16228
23673 -16228 36075 51763 -15796 -25381 -6100 -16047 11111 -3935 17879 45973 46947 40614 16364
23660 16364 16333 46717 65255 92646 106066 73939 27799 19062 12579 25225 23375 -3959 4179
23647 4179 12619 19343 14220 20201 14807 2101 9976 17246 -2095 -25469 -30325 -33663 -24726 4787
23633 4787 25976 7839 6249 5417 8551 12031 6179 1205 34695 24422 -6686 -26709 -21934
23620 -21934 5241 -18206 -4658 -9451 7954 13026 25777 9295 -14653 -10197 49618 66813
23608 66813 65345 49439 20179 2220 43478 33991 -13434 -36294 -41622 -35687 -38371 -45562 -11475
23595 -11475 -3927 -14271 -57586 -73996 -54685 -44691 -71830 -85848 -80518 -67489 -86517 -61893
23583 -61893 -23582 -14573 -21569 -40468 -43783 -20234 -10716 -63650 -47419 -24746 -58610 -71668
23571 -71668 -4824 3910 -25975 -52841 -44928 -38386 -30391 3677 37178 -1083 -18634 -16021 -13008
23558 -13008 -38785 -26197 -5007 -20821 -34583 -37009 -23234 -25065 -31772 -23322 -31763 -18721 6608
23545 6608 15124 10866 7652 24493 7481 33000 39553 27676 37401 24139 31703 43199 68604
23532 68604 38464 31090 47840 13069 31258 26706 16309 -3978 -12399 -25182 -22962 -22329 3296
23519 3296 -5820 -16573 -19220 -54485 -50528 -53228 -38174 2101 14096 -53362 -63151 -31414 64
23506 64 -12736 -5654 -17838 -31046 -37468 -55407 -56587 -13956 -10988 -41145 -37323 -24645 22795
23493 22795 35017 21276 -11952 772 20786 41775 40560 42671 50447 27588 9 -21201
23481 -21201 -9685 -40362 -48893 -66979 -60631 -46415 -41102 -15782 7314 10281 -12417 -16801 -2128
23468 -2128 12745 15589 33720 17084 -14871 -33563 -47573 -47768 -57637 -42856 -22739 -36125 -33021
23455 -33021 -14720 -21323 -7361 -31603 -58735 -11742 17823 -8721 -36642 5258 26354 21311
23443 21311 15136 2340 -6294 35366 42214 26033 16190 35052 2851 19216 12159 -7032 -9683
23430 -9683 -9657 19907 39870 139 -8576 13019 40776 100817 106983 74448 14054 41750 39395
23417 39395 34206 6162 22991 34545 36806 30516 39566 18810 -5681 -31335 -37030 -72139 -46804
23404 -46804 -580 4300 -14644 -1678 35 731 -16071 -8585 33955 54906 63447 50225 52357
23391 52357 42776 15187 -60510 -38918 -1220 35200 64974 35210 49544 96214 114387 84049
23379 84049 9650 -16391 -9225 -26508 -19547 -42595 -19972 8689 721 21701 10048 -30656
23367 -30656 -50769 -22653 7024 -6863 -1610 -9834 -14805 2609 -11384 -19901 -44127 -56591
23355 -56591 -65671 -70619 -67214 -48426 -40641 -32242 -21072 -21477 -26510 1682 15958 1756 -12929
23342 -12929 12714 33593 36119 61171 54778 49164 -4049 -11373 -3496 14267 25485 28694 6878
23329 6878 2831 -21641 -46578 -40767 -23554 -20910 -23059 -10529 -33375 -44873 -38200 -18160 -4075
23316 -4075 4088 -42539 -61234 -26953 4379 -33453 -63656 -51215 -21483 -45685 -53789 -45293
23304 -45293 -50065 -53726 -60307 -36738 -40236 -40607 -52532 -58575 -47497 -62051 -46239 -20719 -4395
23291 -4395 -38422 -65883 -49000 -26726 -23833 -45595 -10290 -2960 -3904 2854 21832 15585 29389
23278 29389 28976 9918 -973 15517 36792 -1653 -16719 -6805 -45460 -47959 -51994 -54407 -19174
23265 -19174 23406 -9904 -32991 -34163 -22995 -23795 -30620 -41529 -29365 1227 27695 -25110
23253 -25110 -53642 -30685 -23259 -16073 -41710 -16025 -25313 4262 27190 11608 -2524 -23091
23241 -23091 -52673 -62006 -35162 -25377 -38168 -3201 22325 476 -19092 11447 17958 14829
23229 14829 -6735 7100 -6037 -21491 -4234 -27537 -9242 -14229 -62833 -84305 -63653 -14442
23217 -14442 -25344 9376 12651 -20085 -17239 19365 31423 35258 33346 56155 59802 -37776 -50806
23204 -50806 3182 15891 40888 39958 23052 24738 -35706 -63623 -59166 -35277 14050 22448 33247
23191 33247 21322 30204 15773 -9336 -23713 -7578 16179 -6738 -19729 29797 24824 -16988
23179 -16988 -28407 -35276 7349 45042 85392 77272 26370 23622 44426 15868 15767 49945 74617
23166 74617 99993 94868 37267 -9385 13251 4933 -10284 -29518 7035 20842 39266 81650
23154 81650 101613 110306 79770 67882 16793 12846 22931 63110 109093 96724 73122 46570
23142 46570 26846 32774 14677 15824 27515 18672 -9243 13291 26482 16048 -6559 5460
23130 5460 33263 36802 -10960 -37710 -28170 -28395 -7289 -9042 -29758 -10562 -25892 -37899 -21322
23117 -21322 -43022 -82150 -54831 -19667 -30321 -13680 -26392 -4922 12192 -5295 -59700 -73855
23105 -73855 -53707 -49961 -39419 -20677 7086 6483 -41638 -65551 -78064 -69979 -55774 -43315
23093 -43315 -29586 11594 -3344 12619 12917 30980 36111 -15106 -26324 -16633 -11570 -15483 11332
23080 11332 1883 -10016 -8852 -11445 -21893 5045 6926 -12079 -16910 -17658 5604 -4852 -948
23067 -948 1611 15155 57063 60132 43645 44962 29196 21632 11546 9900 -28610 -44577 -82380
23054 -82380 -69319 -59727 -67632 -105240 -89760 -52372 -33343 -46888 -49816 -49530 -49375 -60124 -39667
23041 -39667 -16472 10755 -15005 -48155 -77555 -60375 -43121 -20848 -32461 -53531 -50092 -53897
23029 -53897 -44602 -20950 -21500 -34986 -20271 487 -18779 -7612 2049 -23331 -73097 -52548
23017 -52548 -10568 5387 13010 1945 -4670 21921 18993 15701 4196 -19598 -49224 -58138 -20794
23004 -20794 -24765 10750 16749 23945 32654 29833 -12213 -25296 -10803 -18040 -15535 -6386 23357
22991 23357 53523 39396 -2806 -15855 -12327 -8622 -35029 -57333 -20435 -20247 -52436 -41502
22979 -41502 3979 1214 -6898 25379 44651 19097 -33010 -47316 -47433 -32489 -1602 19253
22967 19253 -3903 -17603 -20496 26242 47504 39200 24192 45152 43235 51049 38893 59442
22955 59442 84951 23966 -1739 -8723 -14752 -32177 -43456 -48765 4109 17360 -5114 -22462
22943 -22462 -30425 -2519 26242 -5253 -14489 -10588 -11419 -28228 -20207 -29729 9749 3390 -27096
22930 -27096 -22117 -21734 -24880 -12051 -1577 -38956 -15881 5357 -31013 -53193 -34694 -12881
22918 -12881 3082 -8060 -9846 14905 27463 986 -23027 -36912 -8374 28688 40765 22111
22906 22111 -32012 -49563 -41569 -26792 -21631 -24092 -2941 15967 17216 47435 60931 62298 80622
22893 80622 93163 58881 15755 -4058 -14697 -42072 -37121 -33359 -35631 -10007 -362 10529
22881 10529 15181 -3645 2469 19901 10912 -12789 -44594 -64991 -39615 -19591 21549 34618
22869 34618 16663 -33644 -12622 11308 14692 26054 -3109 -45338 -35135 -31303 -13394 28154
22857 28154 32086 36194 -3105 12117 7671 -10639 -29405 14205 28627 42652 -2450 -19773
22845 -19773 -43983 -52228 -56106 -44715 -35053 -21868 -627 -23280 -56980 -86632 -114361 -92809
22833 -92809 -45135 -29709 -12146 -56 23718 26452 -3335 -23377 -1238 -21578 -5839 20834
22821 20834 357 10076 14833 28141 16520 -20310 2240 43297 51766 51173 55168 31144 36698
22808 36698 40517 50001 38432 50968 44104 6715 6953 25738 35321 15039 23646 63969 73545
22795 73545 25873 4945 9088 13287 5980 20578 20533 -19134 -23849 -16701 9331 8748 -6219 -20722
22781 -20722 -16582 -33314 -36440 6234 34195 26976 23067 10063 15092 32412 16860 795 15250
22768 15250 12247 14987 19168 -12116 -50284 -71271 -58488 -53752 638 6318 26496 78136 87578
22755 87578 53151 39127 58788 54827 42153 46964 48416 44326 11464 -17013 3994 1997 -1172
22742 -1172 32107 29074 12652 -13657 -20776 -13011 -12649 -23652 -51188 -50849 -41693 -30110 -18681
22729 -18681 8094 2273 8276 31307 8164 12352 3334 -14115 11740 42661 38885 26870 24410
22716 24410 69229 79781 93066 38149 -21363 -32650 -23293 28257 24974 15313 -18445 6868
22704 6868 54999 95485 103244 119899 80069 32197 14734 39863 58049 59179 47839 33520
22692 33520 5001 26843 41152 66422 48145 32721 28094 4614 -37158 -32730 -21809 13463
22680 13463 61353 42700 26845 -7496 -18288 -25784 -11074 32294 23106 -545 18001 45175
22668 45175 36612 10726 746 11634 10811 -401 25987 25645 61767 35055 63670 65780 75999
22655 75999 74418 92379 75303 34036 9140 -10510 -22608 -17023 -45380 -37275 -51649 -57540
22643 -57540 -42734 724 -8368 21122 18273 23686 51748 55356 761 -13003 -24712 -6705
22631 -6705 25324 36509 11483 -11819 -8397 32050 26167 30036 60246 58643 40757 54703 46719
22618 46719 -10548 -21804 -5838 -34313 10963 32620 23922 -22134 -51521 -19239 12693 15978
22606 15978 31310 29278 41695 48078 27796 24556 2408 -8185 -1630 2629 4016 20531 8907
22593 8907 -10604 9943 51383 47188 5228 -20066 11294 55657 69789 28237 42401 63915
22581 63915 59904 43317 13491 5195 -11617 -11124 4480 10585 -28869 -27334 -9724 -26041 -34154
22568 -34154 -14850 -14460 -27736 12797 23478 -38418 -64538 -65535 -13326 32701 7563 -10749
22556 -10749 4510 14948 48875 35353 24936 23455 35213 3572 -28018 -34457 -31634 -43942
22544 -43942 -39547 -17061 -9985 -11511 -39246 -25925 19208 45813 35979 19513 29663 24093 40299
22531 40299 48564 62490 89330 49490 32404 39486 40577 26116 10431 -1626 15487 29104
22519 29104 39065 60745 83383 104240 112017 103131 104061 68934 58796 74811 43498 37868 25509
22506 25509 -4751 -34970 -13800 37319 90532 96889 78578 76704 97562 132698 150801 127146
22494 127146 156625 202450 268014 309820 369894 524680 742119 954405 1196526 1450503
22484 1450503 1565139 1520848 1381610 1188245 922666 701247 551773 369750 241642 153877
22474 153877 90504 71650 88144 111416 81148 87323 88649 43433 24829 34652 9249 12178
22462 12178 31621 47442 51204 66181 56686 47040 34605 77581 64140 40556 28020 53813
22450 53813 60725 64691 46318 89198 151695 188068 320303 446496 544262 605362 657336 711613
22438 711613 709762 705007 699412 636285 585267 540455 500029 420375 330555 222409 138576 122565
22426 122565 72326 46454 44706 35963 33400 26832 49576 55903 49845 31734 4728 -6495 17179
22413 17179 39676 67889 100470 88699 86608 96752 69660 26285 17719 21392 63170 89633
22401 89633 50032 42712 41105 32765 37830 30559 42099 67306 57827 20283 22336 9806 -15354
22388 -15354 -13545 -25659 257 29874 46095 47398 70403 64386 57912 84401 66440 8869
22376 8869 3433 13424 42334 63952 94320 101136 100321 119747 76721 32172 31507 76831 110928
22363 110928 117488 99066 111817 99368 87680 49840 34487 60909 42370 -4144 -44135 -17932
22351 -17932 11249 23496 32332 41423 62569 82621 43113 26952 6646 -18681 -18392 12318
22339 12318 25242 2112 8584 43616 51763 58783 39502 42190 41608 54269 83123 80078 89119
22326 89119 68136 100924 91627 81409 96928 101301 90755 44540 -838 3037 51258 78727
22314 78727 67194 47721 24139 12315 8772 20884 64699 77395 56371 102733 92419 67112
22302 67112 65539 78165 63722 63105 47762 48001 79668 106090 112676 99023 93821 119924 144378
22289 144378 181556 218154 241522 299119 388164 423456 496154 545663 551982 491021 402209 304804
22277 304804 265616 214290 164635 111067 107766 115619 106489 77972 46453 31646 18319 16374
22265 16374 30762 1632 -18869 -18997 9901 29102 1338 22773 66717 72382 22575 11000
22253 11000 26194 46208 39284 45134 29717 1555 33103 55457 46507 53496 20026 -7728
22241 -7728 -9435 1086 -1122 -35427 -490 4970 6251 18822 37514 13266 3313 -27873 -19394
22228 -19394 -20490 -14873 12737 15089 13686 3278 -1582 12780 -9188 -8135 26272 40945 48796
22215 48796 68170 81389 81337 71129 47729 33404 25140 30998 41134 34916 42573 66405 77139
22202 77139 106427 119788 97552 72563 93979 97796 60949 4808 8694 16347 35775 56258
22190 56258 53772 69654 58503 38954 16297 56096 66148 37990 44345 54901 63991 56467
22178 56467 46355 80525 58822 41932 59432 68077 111094 122979 112300 100554 126879 111789
22166 111789 71318 78526 99011 147705 145607 122513 123441 118294 102204 118527 131792 156861
22154 156861 165860 175186 162857 122679 83132 88259 131549 158944 148381 85482 95251 114884
22142 114884 108229 84099 95109 110859 138302 146578 118059 80204 123605 141983 172987 184446
22130 184446 174014 190417 219578 247158 250794 294718 359423 425477 507981 643313 718488
22119 718488 781238 836680 883707 891079 848741 806729 799326 748931 633551 515212 450590
22108 450590 371637 309295 284762 281702 250380 222741 232317 249294 263311 244483 269181 321611
22096 321611 316303 322523 322835 292417 261243 218400 190135 182511 177409 158432 97332 72871 72227
22083 72227 66805 56054 63914 41356 32037 20170 30256 82066 84349 72264 60185 35215
22071 35215 8953 -5212 -6885 39590 64999 58127 77638 82082 98542 124060 138014 119312
22059 119312 146615 134439 84526 65041 89555 98615 97508 82340 79261 102334 140277 131098
22047 131098 125609 128288 76213 87501 68699 32010 46803 77968 72051 77287 44743 42257
22035 42257 79390 121620 108781 85690 84510 88580 77439 74123 81266 100528 161332 200500
22023 200500 192797 143859 154912 172028 176816 175185 144899 118182 122453 136141 108894 117962
22011 117962 132609 163446 157426 135528 142593 124303 156240 186605 176244 179465 188931 179659
21999 179659 168791 177133 202249 222543 248328 255994 292658 275849 259508 226257 256141 291596
21987 291596 263570 309496 364722 370839 432164 481494 557715 649851 710007 741840 771478 801961
21975 801961 819660 819559 859275 891603 864928 840029 748900 642896 561802 529816 540522 527779
21963 527779 485296 485699 487354 470123 482169 472728 466779 513028 519949 509600 518521 500927 508383
21950 508383 539099 598444 605587 631621 695852 728573 764324 781997 812710 847996 879183 920144
21938 920144 987135 1055672 1090186 1159898 1213245 1289761 1394109 1482695 1545906 1679780 1848727
21927 1848727 2013314 2205687 2416706 2710824 3067725 3474123 3957623 4523855 5232435
21918 5232435 6127362 7210747 8556928 10292544 12610925 15836036 20387382 27063444
21910 27063444 36682081 49582683 64992661 80860015 94646351 104644469 110822831
21903 110822831 114462959 116866530 118199863 117406734 112929552 104034996 91525045 76935834
21895 76935834 61897036 47877366 35848152 26233784 19018607 13937442 10508241 8179905
21887 8179905 6552916 5346078 4395439 3736309 3244810 2828048 2501675 2213465 2026749
21878 2026749 1879422 1708147 1530422 1367887 1239315 1125265 1062418 947684 870822 836031
21868 836031 811206 755590 700713 639413 566234 472631 396334 393624 413523 403473 405090 407409
21856 407409 409978 430300 468522 414842 377750 374005 363115 335207 317843 315440 294226 306442
21844 306442 351943 310259 267217 253306 284120 289487 321779 353541 402609 415745 456945 469992
21832 469992 542156 632676 711948 742622 776407 777328 768642 758778 746179 660039 575617 458897
21820 458897 336149 236827 210463 190956 163903 114424 58483 47779 41992 53360 69996
21809 69996 57565 43067 94005 79051 41358 40383 81668 93059 61726 59200 48547 31779
21797 31779 17941 57473 67166 58104 55078 21873 9653 -12479 -23626 -5109 26422 12080
21785 12080 18410 21858 15077 -1230 7873 1171 24914 55462 71998 110062 127487 134882 203388
21772 203388 189656 172511 163188 149817 171754 169715 130667 92364 75006 76229 62399 81619
21760 81619 114709 134202 152666 151214 111640 50494 19404 15747 38806 31131 19626 -3545
21748 -3545 -23435 7099 24915 -17131 -10729 8689 35178 47574 2901 -21654 -27228 -12324
21736 -12324 12620 60714 70795 72241 103825 100549 90897 78425 43209 69574 43889 13011
21724 13011 2023 -277 27935 75090 60849 20188 2997 -16256 -36326 -55569 -76581 -98497
21712 -98497 -129289 -149375 -181381 -164739 -182509 -204097 -208895 -184786 -161138 -124496 -120640 -99220
21700 -99220 -47920 -32063 -48583 -66130 -68116 -63943 -78420 -10422 -25664 -71242 -49729 -57273
21688 -57273 -51403 -51363 -65000 -39662 -42308 -57719 -32366 8769 10763 -6524 1656 9101 -9098
21675 -9098 8561 27176 23613 34626 67934 58710 18932 -19681 -37604 -46255 -18825 31713
21663 31713 12973 3704 750 -2599 -34961 -49329 -49565 -48638 -9075 -1345 -11279 -13022 -20845 -30622
21649 -30622 -53556 -32565 -19402 -23799 1757 17701 16332 28759 24401 -9710 -30674 -38513
21637 -38513 -23892 -14259 -41459 -15685 -14685 -28009 -24567 -54854 -35567 -909 45033 56342
21625 56342 32277 3259 12856 23390 53289 65138 37040 -21664 -66780 -84249 -63737 -55459
21613 -55459 -27744 -36317 -79606 -67345 -43039 -45513 -41379 -38825 -9187 -822 -27222 -45999 -9566
21600 -9566 49768 44129 -1264 -35479 -77269 -107216 -88507 -48593 -27476 -13135 -14541 3375
21588 3375 36357 62797 58609 21135 -20253 -90071 -106820 -82999 -87023 -72965 -5508 40196
21576 40196 46806 28704 -6229 -25850 -24534 -18566 14296 2104 3838 2472 21521 2553 -64317
21563 -64317 -102661 -117861 -115893 -76536 -43638 -8724 21914 58980 83349 81612 123376 152015
21551 152015 90638 55447 27475 21204 23803 23425 22463 36868 40758 36168 9830 -10362 -12781
21538 -12781 -13278 -38642 -50989 -72446 -57573 -28446 -11532 -30859 -57893 -47540 -17545 770
21526 770 -16280 -32894 -43152 -37238 -17908 1580 19172 52478 29417 -28563 -22721 303
21514 303 -20219 -31257 -22886 7221 21214 58997 87803 75019 30964 8795 -36144 -42713
21502 -42713 -56871 -16838 -25133 -29285 -17076 52 16724 25842 8988 4167 -33432 -50215
21490 -50215 -30368 9802 53307 95438 159482 256678 253182 256040 249088 264206 227470 176903
21478 176903 137016 117568 123808 86483 53999 16426 544 -1394 -29678 6739 15411 24837
21466 24837 31867 -9985 -32196 -26990 -21074 -41970 -20810 1946 -31531 -67364 -38818 -4421
21454 -4421 -442 3470 16312 14039 6 -12361 -21924 -40749 -23562 -12806 -13034 -25418 -26746
21441 -26746 -1930 -1370 11951 20185 31753 604 -11247 -20164 -51944 -21866 22096 6057
21429 6057 -10269 -29285 -41262 -38800 -15656 1115 -16053 -17586 -46413 -48328 -65236 -50744
21417 -50744 -29833 -19176 -62029 -61901 -38504 -16433 -2524 13706 27735 2662 13348 -9118
21405 -9118 3924 45492 9480 -51216 -48615 -18929 -3931 1813 -29714 -6853 36530 39642
21393 39642 15953 46845 33406 10303 33172 77077 58722 17865 -53730 -97850 -96668 -60926
21381 -60926 -26640 -19101 -22230 -20950 -25441 -29433 -39951 -33189 -22669 26721 50901 29228 34891
21368 34891 87944 128128 131361 166198 205110 253895 319844 433749 538397 599234 614575
21357 614575 632578 669286 690217 661143 639147 584653 447630 349256 296299 256446 201629
21346 201629 126617 49341 46264 88168 75118 38048 39794 34906 53679 71346 53837 63373
21334 63373 35515 -27214 -61312 -80487 -61044 -60373 -54541 -28264 -31199 -32785 -50252 -98969 -72503
21321 -72503 -84997 -96287 -49447 6365 1992 -19874 -36342 355 7480 -654 20018 2540
21309 2540 -21906 -16772 3195 28870 25088 -18186 -32456 -25739 -41108 -49387 -25982 -2540 9773
21296 9773 -10913 -30339 -11946 15072 48027 72105 17289 -24270 -25816 -237 20851 23149
21284 23149 33766 9981 -15273 -18342 -22560 -15631 24033 36966 -2742 -60078 -106950 -115537
21272 -115537 -100495 -74120 -32979 -31001 -29668 -46725 -37488 -24127 6894 41927 28917 -4119
21260 -4119 -24805 -12896 2370 36834 80835 72757 19681 -13070 -19520 17390 15646 -9891
21248 -9891 4714 15678 20681 34158 30731 15775 -10133 -50899 -72471 -38277 -35640 -16578
21236 -16578 -2577 14609 63056 42580 -9142 4777 3408 -18872 -55415 -51349 -24476 16752
21224 16752 43301 9145 -21043 -24728 -34282 -34591 -72827 -41704 2133 9256 -34956 -55867 -48718
21211 -48718 -71762 -50556 -29745 -21410 -15425 17659 4444 -814 -16548 -10063 -5372 -37336 -56254
21198 -56254 -45654 -56101 -67706 -69828 -32746 -31980 -42869 -38545 -30706 -50022 -46266 -39504 -28103
21185 -28103 -25245 8145 45508 52145 44452 48340 41346 15479 -8205 -37907 -5808 -5438 -49624
21172 -49624 -36468 -11763 -15263 -19836 -52505 -58160 -77295 -57389 -21142 30803 49789 24190
21160 24190 -22913 -31260 -42343 -37123 -23461 -7711 -32131 -39958 -60540 -43892 -26896 18702
21148 18702 47269 64681 816 -33623 -32071 -14839 -54268 -60900 -40360 -56043 -62881 -42365
21136 -42365 -35815 -34985 -47818 -56317 -65096 -39821 -29830 -36438 -16819 15512 14726 6553 -21730 -25533
21122 -25533 -12797 -16822 -4600 -2810 -8691 18383 34501 63154 48955 -29320 -79807 -58531
21110 -58531 -81064 -66186 -53104 -52221 -58097 -53948 -41234 -55168 -29313 -16185 59 38376
21098 38376 49348 41994 28711 -1569 -20390 -8310 -6492 -22598 -27643 -55592 -90596 -76778
21086 -76778 -59732 -26606 -5641 -8206 -24893 -54045 -35513 32750 39754 -3992 -16417 -47356
21074 -47356 -38995 -13276 10162 7349 -501 -27395 -44671 -72263 -61772 -21725 7953 10414
21062 10414 3784 33332 37928 46751 21721 3879 -38354 -73229 -32403 -8796 2622 38053
21050 38053 23032 4257 552 43836 57013 50703 21232 -5509 -11007 -1678 -35103 -49525
21038 -49525 -50966 -71605 -59229 -41757 -31014 -9713 -27611 -6237 545 383 13642 -3703
21026 -3703 -13880 -4646 -1048 15228 27561 35010 19341 5137 26251 11812 5372 20001 -15742
21013 -15742 -38331 -43695 -54816 -62417 -28929 -5349 -6512 -8006 -8479 -42815 -73910 -38403 -17000
21000 -17000 2246 24645 -6051 -17392 -20652 -8483 -14753 -10738 -19047 -17106 -7087 1418 5042
20987 5042 3627 -11218 -18592 -18159 -5761 -4540 -37723 -32416 -44688 -25987 -2676 -20181 -22544
20974 -22544 -24918 1237 31543 -7143 -23168 -25222 -37036 -21679 11057 -7706 -48254 -57793
20962 -57793 -50409 -28395 7873 8277 11058 25255 -5618 -14241 -11566 -16136 18416 32665 37835
20949 37835 38111 16971 20938 4751 7947 -3395 -25 -499 -6408 10847 13251 7577 22081 27013
20935 27013 25723 18219 22610 29586 40803 35534 985 -15139 -38512 -57915 -47264 -23117 -15597
20922 -15597 -21443 -46541 -27088 2169 25417 51769 55771 45983 11403 -35362 -19379 5142
20910 5142 -1207 18966 10900 3059 14402 58661 33763 17184 783 20019 29795 9545 -18499
20897 -18499 -14300 -22197 -19894 15083 17591 15350 44306 57149 13976 14590 48874 23699 -8286
20884 -8286 -16228 -25456 -17051 -26673 -33497 -6181 -15738 -49162 -65281 -89401 -66714 -43081 3669
20871 3669 -2428 -13429 -6607 33297 -10412 -49948 -13972 -8842 19545 5669 22490 38092
20859 38092 26274 4037 -11534 18090 50954 54908 62872 59249 23317 -22560 -16120 23316
20847 23316 -7117 -17717 -25467 -38785 -45602 -20000 -2253 2261 11598 -17927 -32065 -46306
20835 -46306 -67655 -99414 -74653 -23820 -19639 -53528 -47771 -11729 -22463 -58497 -93669 -70389
20823 -70389 -23017 10671 40095 35566 10343 7767 14826 18011 -4023 15969 37993 15097
20811 15097 -10558 -10617 -21010 -22269 -39934 -56744 -62612 -42315 -65743 -85354 -45875 -10117 22504
20798 22504 23423 17034 29696 26971 2812 442 15103 23449 40667 31471 -1560 2773 -4279
20785 -4279 -7639 32806 35990 32493 15317 -11816 -28103 -14982 -31279 -43198 -37065 -30812 -34806
20772 -34806 -64451 -88901 -111997 -77540 -70723 -69822 -54502 -68993 -63612 -95062 -46455 -23479
20760 -23479 -18161 -21734 -10349 -3745 -15786 -12000 1169 -6628 -39219 -22260 -2415 -6782 7750
20747 7750 26625 51580 51500 17157 -37206 -82893 -91179 -92767 -72126 -53532 -41082 -6502 -7560
20734 -7560 -10703 27857 53550 56773 44534 21680 2152 -41039 -59747 -53739 -42842 -10245
20722 -10245 -10811 -7627 3974 -10196 4436 11272 9343 24913 22908 15250 42593 51104 5755
20709 5755 12638 43680 8200 3536 -24496 -46802 -41663 -2786 13055 13780 -34221 -49582 -35645
20696 -35645 -1319 -2735 -24423 2757 -4765 -16242 -31288 -48136 -68808 -65448 -64576 -43594 -26184
20683 -26184 -37407 -46645 -18757 18078 -5153 -41923 -67743 -29856 -37201 -11586 23292 29952
20671 29952 2450 -25198 -41673 -25296 -39777 -20614 -1820 -4518 8288 40774 38812 37735
20659 37735 55683 27819 -112 3815 -4410 -56264 -94286 -89582 -90642 -115344 -77587 -50913
20647 -50913 -32408 -38320 -59271 -74774 -61241 -35030 -34504 -57442 -39137 -15981 -19986 -8068
20635 -8068 -30034 -60572 -31230 -6501 13098 22737 20082 3677 9 -23309 -33627 -11208
20623 -11208 -12923 -6728 1674 16690 11258 9381 -3252 -15588 -2813 2662 -20609 -31014 -48784
20610 -48784 -81145 -58409 -40847 -29230 907 -25420 -32117 -30638 7331 34277 42471 28264
20598 28264 30922 29691 -16306 -32418 16791 37337 59678 53790 11147 -31448 -46668 -52640
20586 -52640 -49131 -13600 -22565 5324 21844 -21815 -43498 -42452 -14468 27336 76974 57406
20574 57406 24497 -20848 -11347 16796 30016 22037 2268 -10633 -13788 -27759 -4047 -23783
20562 -23783 -28717 3531 -16314 -50141 -49595 -5263 35516 22114 21773 32734 50019 51744 54640
20549 54640 60671 63313 34343 -17288 -34165 -23331 -38221 -50569 -33999 3687 24674 36827
20537 36827 52965 83368 60981 21139 15316 -7666 -27599 -35029 25464 62559 54773 28337
20525 28337 -33779 -80562 -75611 -59244 -16007 11633 -37228 -57213 -54253 -61131 -34106 -10207
20513 -10207 -52829 -55177 -45788 -35025 -37076 -55593 -50368 -32591 -10519 -36316 -46253 -14852 -3562
20500 -3562 2425 11221 20033 20751 8112 -26546 -49728 -16114 -15742 17826 49731 30435 22042
20487 22042 -12767 494 10389 33049 41979 27966 14244 7259 18019 -12011 -59709 -63126
20475 -63126 -9467 24987 11874 -35060 -48092 -39946 -15403 -7359 -10706 -45365 -66286 -50671
20463 -50671 -61437 -36621 -1604 21211 43121 35931 21584 27400 15605 2232 -22755 -39442
20451 -39442 -18058 20268 54932 85170 14550 -58528 -82457 -68590 -34377 -53314 -78397 -40442
20439 -40442 -24344 9487 5875 13744 21198 -23379 -25645 -4350 -4317 -32695 -8850 -313 14846
20426 14846 26479 37727 35957 19347 20321 -7345 554 42631 12631 2639 -3112 -3414 15320
20413 15320 11008 24559 58279 79007 47646 4597 -10633 -36642 -34661 -19937 -307 54514
20401 54514 72155 41091 56035 58594 11072 23545 21249 -13864 -18182 -41944 -47587 -65099
20389 -65099 -89664 -71274 -64326 -68047 -45718 -25071 45138 30246 -28985 -36044 -18614 -7558
20377 -7558 -14821 12673 26312 -3294 -20640 -14064 -28025 -5518 -20056 -34914 -13960 -440
20365 -440 -576 16199 -15881 -48921 -33259 -29027 -35458 -24704 -14284 -19671 -48513 -24543 -5290
20352 -5290 -1580 -4980 -1503 -51805 -62308 -70052 -72841 -54774 -40787 -7661 28031 -1796 -11458
20339 -11458 -22693 -50585 -35332 -23531 -10747 32216 25845 17696 6974 -2684 -32638 -41189
20327 -41189 -24104 -11882 5961 27229 29402 7680 12502 -2158 -26169 -11777 -435 -31431
20315 -31431 -61214 -75116 -61364 -6431 32670 28516 6343 -7479 -28018 -21991 -45971 -74107
20303 -74107 -76400 -57854 -30373 11685 14954 -3783 6154 45655 16199 2373 -10471 -756
20291 -756 12788 15133 40747 29433 18869 10820 -17633 -24394 -46940 -71403 -73698 -58891 -18113
20278 -18113 -17391 -46291 -15802 34182 56404 44154 31235 -9196 -20265 -20227 -24635 -42331 -38472
20265 -38472 -32435 -12563 -10630 2236 -9201 -36184 -40085 -37730 4791 49103 37086 2846
20253 2846 15607 20059 18782 27418 18195 7963 3159 -9704 -12361 1075 23375 36761 36663 23207
20239 23207 -2978 -5574 -5286 -15459 -23512 18029 59932 -19376 -42970 1683 1527 -3018 -43491
20226 -43491 -17919 5496 18543 12706 8581 7250 -4542 -12685 19121 15434 -16109 -12151 -11436
20213 -11436 11931 -7596 -45803 -38442 -48181 -71769 -22949 14913 20821 28579 12681 11653 21670
20200 21670 3149 -45941 -25852 33436 48261 19681 -15479 -1279 -5555 -36815 -76801 -69929
20188 -69929 -27221 -20607 -25564 -68134 -73943 -50845 -34029 8133 20250 -4125 4105 -8072
20176 -8072 -42169 -68192 -77873 -79794 -60803 -32249 -22743 -9603 30977 28222 18262 46633 -1406
20163 -1406 -16290 -37974 -24928 -21400 -28529 -22590 14863 38886 32515 18515 53421 76214 3473
20150 3473 -7822 -16671 -4096 -18908 11037 33301 30147 34143 33749 69637 44623 3486 25642
20137 25642 60844 35670 16188 10902 -1894 4603 38392 35909 44286 19965 3346 3034 -281
20124 -281 4855 33057 30794 -6617 -30698 -25734 -7826 -26613 -66503 -35951 -8893 5975 2874
20111 2874 -29049 -103294 -121596 -92777 -48629 -24586 -43790 -41418 -42042 -62686 -52267 -8989
20099 -8989 55983 45787 -3491 -38272 -45715 -48610 -44716 -64773 -55164 -20229 -9680 -3689 18540
20086 18540 61635 59808 31782 7914 -10759 -45979 -52518 -20377 12077 39580 36339 23603
20074 23603 -13996 -27908 -19836 -3122 -24109 -16817 -14127 -1460 -11046 -1886 47649 30771 29522
20061 29522 26912 4019 -15564 -14733 -849 31109 44176 26239 47239 23023 -22642 -44961
20049 -44961 -38161 -16034 -6442 -14377 -1953 -8256 3585 4148 53227 72235 65228 41773 -93
20036 -93 27176 5618 1041 5606 15269 6657 9264 20457 30292 36145 34629 11358 -663 7679
20022 7679 16800 -13591 -30073 -14392 -48100 -49382 -23079 1889 -40525 -55185 -31174 -721
20010 -721 -16523 -16336 31055 59406 50077 32221 51951 40471 7891 12822 15324 -4338 -18475
19997 -18475 -14972 -2974 553 -5849 26061 49969 29895 45091 40440 31218 58293 41460 37186
19984 37186 24954 -27248 -32498 -12370 144 -27780 -10730 -34516 -44120 -10295 2808 585
19972 585 6398 14576 15925 2243 -28153 -796 21992 30091 31110 18228 27414 31193 8611
19959 8611 -26574 -39016 -31729 -33384 -50065 -16073 21029 13578 -32154 1925 23492 8355
19947 8355 -35279 -56331 -63491 -82135 -68606 -37650 -31974 1631 13693 36795 28447 9359
19935 9359 -40966 -34811 -23477 -21685 -4684 6966 22441 72604 37156 18679 -10738 -43410
19923 -43410 -58444 -24670 33847 49135 47182 20201 12275 49122 18183 -8438 -21394 1298
19911 1298 -18830 -10179 54 -10892 -13237 -1743 -3248 -10304 -35458 -3763 27074 -22571 -44469
19898 -44469 -57122 -3180 32307 15491 -16364 -3318 14363 17474 13243 43917 13080 -4779
19886 -4779 -24516 -18465 16097 6392 -9293 -4165 51908 30285 -13255 -39205 -23773 -1425
19874 -1425 -50574 -98756 -103664 -68723 -38072 -44410 -32457 14372 46360 56855 32011 3625
19862 3625 -26299 -34826 2222 11121 -32908 -25177 -21774 -54040 -85397 -69826 -64924 -62267 -19389
19849 -19389 -13892 -41471 -18217 -11635 -2097 30484 56333 23169 7983 36704 20098 6908
19837 6908 -6524 -16489 -28787 -62090 -32405 -1967 -3371 27861 10015 21722 18518 24723 32030
19824 32030 36284 17431 13232 -16994 -55488 -43986 -10843 -2540 9512 19343 29053 26226 -8500
19811 -8500 -2949 35211 62954 76976 75872 30702 -38718 -59911 -37440 -14626 24755 20444
19799 20444 5974 -28926 -43915 -24693 2525 10852 26030 8271 -7686 -11942 -28716 -28841
19787 -28841 -43340 -34922 -53942 -27232 23951 30271 18145 -638 -22420 -20872 -13593 15665
19775 15665 39600 45166 54377 67229 33735 31902 14081 -22650 -22168 -4583 4450 38808 69328
19762 69328 59189 31666 952 -13708 -28957 3555 1329 -13203 -28160 -8146 -33367 -19197
19750 -19197 -30636 -6899 14161 17375 12580 17262 -13808 -287 9265 -12437 -834 16351
19738 16351 20937 20082 4990 17758 35736 32929 36104 33219 12604 -35679 -13974 13674 31937
19725 31937 22438 -5287 -14141 -8899 -60191 -61175 -50971 -33752 -54936 -63248 -36006 -6826 -39695
19712 -39695 -67910 -74403 -82840 -70847 -27396 6670 17310 -3728 -303 -22903 -68193 -73629
19700 -73629 -41297 -38218 -30167 5237 18186 -14130 -15084 -31324 -52689 -45808 -33542 -21554 22572
19687 22572 17669 17366 16320 13888 30275 33503 24415 23099 -14491 -12778 -23701 -42546 -7972
19674 -7972 -10520 -3021 13934 -5179 -26867 -6973 4247 -39208 -19690 22720 8184 1014
19662 1014 -2840 -47599 -16408 -2932 -25652 -47234 -31335 1138 -11690 -22509 -4818 12837
19650 12837 6898 -7923 16960 -2928 -30918 -4778 4241 -27470 -34910 -11198 11033 232
19638 232 -16532 -33977 -22216 -16650 -10483 -41630 -34859 -7388 3131 35773 32051 29795 32650
19625 32650 -9631 -10807 -6 5343 -9227 -29723 -55322 -43987 -25312 -2057 24374 -2768
19613 -2768 -25985 -19177 -41071 -44744 -21738 -10339 15963 18203 18878 10236 4406 31979 61284
19600 61284 73250 68535 63048 58313 34154 -4778 -34457 -30429 3432 19489 -2765 12040
19588 12040 8037 16737 71484 61702 32773 955 733 -15734 -39899 -42358 -45995 -52635 -23255
19575 -23255 8597 -4137 -35893 -39231 -36463 8880 -3464 -45029 -36242 -22892 -15126 40638
19563 40638 18880 -32060 -55683 -46596 -60244 -29564 -2268 44666 49883 44812 38634 3694
19551 3694 7755 -16415 -14663 -3804 28748 36243 22121 27710 18950 29462 54660 46976 5110
19538 5110 2127 -11497 -18430 3424 33108 68480 41959 13030 1211 31944 72279 89012
19526 89012 91732 64722 27335 1343 5413 -8631 5250 11815 -23915 18211 23838 1312
19514 1312 50731 69786 61797 57204 72074 47266 -2447 -48932 775 9305 12053 9228 -25450
19501 -25450 -66015 -49068 12274 43338 35985 8690 -12107 5409 2275 -42401 -58153 -62140
19489 -62140 -34071 -1449 4953 10201 23960 22834 23381 46429 16194 26191 27369 36315 59923
19476 59923 64244 32366 30699 29096 35785 10706 -37730 -13096 -31672 -26124 -9050 -32584 -13815
19463 -13815 -8271 -45238 -40543 -14253 7527 7072 10907 18544 28799 47667 12719 5840 8207
19450 8207 657 10211 23122 32551 41687 19830 -13117 2638 22581 49201 20307 -2098 -8001
19437 -8001 -1101 -9427 10876 9720 -21523 -12316 14930 13578 5767 34183 25889 -33881 -45999
19424 -45999 -45118 -18371 -19618 -25106 11853 18462 15235 35745 65966 84351 41631 27335 52589
19411 52589 92415 99489 86054 53160 44675 23221 9675 9102 37505 45031 27269 14877 -7183
19398 -7183 -542 30134 16511 25241 20678 3102 -9967 -4278 850 -9575 -27733 -45475 -29231
19385 -29231 -22167 -50606 -34138 -27324 -245 46443 63566 64823 25485 8428 33629 1070
19373 1070 5253 24057 -4129 -54866 -55830 -76444 -83049 -45517 -9018 -51718 -68850 -7281 -230
19360 -230 -24062 -7629 75435 132565 88814 80622 78768 63377 37694 49871 61034 63974 51427
19347 51427 43092 34454 30652 41566 48406 54253 43539 68610 65052 44282 26090 35634 23032
19334 23032 50138 49848 21784 -39534 -74869 -36135 -16728 -10932 5391 22161 14151 33852
19322 33852 31389 35502 30376 22612 25298 26802 36556 23448 8975 4346 -1695 -27011 -27162 5565
19308 5565 7446 47104 65906 66990 52157 47603 28863 1202 -31117 -39393 -26577 -28395 19352
19295 19352 -8243 -35534 -60909 -50994 -40405 -17088 10997 5176 -23785 -46763 -38404 -22799
19283 -22799 -10290 -13596 -31592 2728 20987 9160 26836 9505 37475 41554 17554 16545
19271 16545 45891 67536 72562 46307 -11263 -31552 -51538 -33680 40525 59837 54576 77108
19259 77108 95214 83894 74115 38224 35214 13068 -15458 -52336 -32987 -11054 -40832 -55309
19247 -55309 -71344 -19921 -2171 14188 1076 36188 22827 -24250 -57704 -33045 -20674 -35944
19235 -35944 -41114 -11701 1493 -656 13625 21480 51443 54366 44833 25708 61242 52112 37483
19222 37483 -7697 -15416 11347 38309 19954 9878 3765 4039 9294 -34723 -31240 -5943 42959
19209 42959 23623 -1541 2394 21288 50988 62679 74261 72914 58565 54374 25866 -4833
19197 -4833 -31935 -24887 -17995 -30497 -4470 16628 -21602 -37633 -17901 -565 -27826 -56017
19185 -56017 -47191 -40526 -39313 -16228 12241 2592 606 6534 -5794 22246 17440 22520 44017
19172 44017 67587 81661 35106 39847 72614 46564 9899 10110 46532 38354 21214 16667 21702
19159 21702 27930 794 -7504 -29329 -37896 25864 59921 66094 70693 88640 109654 85874 95532
19146 95532 78133 43881 70196 90852 96208 101737 126965 123489 136191 156861 188444 182953
19134 182953 234961 380851 527272 570134 551410 551508 579550 614971 606185 627438 704527 782268
19122 782268 802669 740878 673038 639508 547367 414845 333463 308322 312936 303813 312462 313161
19110 313161 277589 250614 211357 139059 106517 112755 110384 78164 51074 46223 61435 44694
19098 44694 56263 115742 127361 184183 256537 298405 284088 270674 272970 264038 253099 254138
19086 254138 307961 380066 474052 513244 644381 861219 1023741 1012850 884966 774924
19076 774924 674599 603674 503046 425295 483609 628710 787637 826119 781773 696198 566706
19065 566706 459319 312795 209493 192382 190352 158770 109868 90915 97567 116624 126450
19054 126450 102979 68906 72768 76980 87652 110984 83902 70954 43109 47456 12730 -7280
19042 -7280 9660 46135 71364 69405 75839 82545 66423 58604 44975 36156 37502 40406 42872
19029 42872 -7491 -21088 -10496 15560 49638 64372 15561 7357 14486 24748 18011 20325
19017 20325 4079 -11078 10370 17710 19284 9456 -8472 -24948 -18777 3714 22196 55945
19005 55945 48753 74838 49992 21257 13266 -4754 -1204 2107 18263 26203 4749 -48714 -78929
18992 -78929 -47348 -24434 -2418 9520 -5442 13971 21534 -4628 -28222 9407 39984 30103
18980 30103 38416 23683 19363 44139 18969 12227 20278 38822 53781 44961 30365 -2679 -9068
18967 -9068 -15908 -32350 -13224 -20406 22778 47892 75552 45620 7056 17771 24775 -4218
18955 -4218 -357 3126 -9255 -18675 -3791 -8143 -31261 -43770 -14028 -27884 -27601 17616 47024
18942 47024 80756 96230 91324 64706 51566 21653 -359 10622 48856 35641 -6649 -41233
18930 -41233 -54051 927 32871 40958 30387 17557 -21838 -30667 -4916 18444 24970 794
18918 794 -47196 -12537 -24019 -24057 16891 28631 63854 63499 74450 54554 56530 26457 25615 74998
18904 74998 83646 48692 47975 30876 50832 68712 67395 66907 45239 47931 54600 18895 2570
18891 2570 7854 22934 40092 42287 32023 65140 44276 49099 82506 48057 21126 5743
18879 5743 -7739 283 46078 62917 26559 -11120 24191 38647 38372 92740 140366 110044
18867 110044 83321 100073 90184 46164 49848 81902 66841 56051 51570 58317 40615 54235
18855 54235 77119 83847 49735 10417 50035 87268 101917 142131 145879 144950 120176 100328
18843 100328 73179 78765 122970 129689 117270 122790 111097 127132 126760 108889 134522 121727
18831 121727 114098 105102 88898 98371 113312 89317 69132 107422 200803 244979 247727 296448
18819 296448 297106 273230 260878 248656 236814 230877 259788 278452 283729 271089 264355 241584
18807 241584 229552 240839 221962 237206 248274 259250 234751 203565 191085 200130 193800 163923
18795 163923 189775 197019 178227 232678 282399 302629 279178 279733 303957 332042 408673 468374
18783 468374 476274 534653 576854 579747 597566 618971 618160 615500 616019 609344 657870 687009 717955
18770 717955 836487 949855 998206 1052303 1109513 1114628 1134770 1143230 1061207 945679 855591
18759 855591 870979 897311 857472 824838 789683 709117 670321 682310 674648 655557 697883 714971
18747 714971 697835 675603 652579 583912 525949 475654 464948 489261 501054 521095 535508
18736 535508 547759 551961 568442 592959 605413 661364 707368 759904 805619 816169 811992 813313
18724 813313 811501 821201 863442 870405 829952 813870 812873 807748 846005 896532 962470 1007485 1075527
18711 1075527 1094404 1037184 1015344 952207 854059 766516 660026 603449 541417 516055 523314
18700 523314 547389 503086 474671 451458 456398 463934 423072 370275 383283 348043 307479 286986
18688 286986 214594 214786 236404 234611 227224 241114 276978 269544 302529 325038 348874 397604
18676 397604 474284 573396 589295 541667 532937 539593 509438 477508 477417 476882 529831 596903 596699
18663 596699 516114 466395 465575 386430 299323 272212 289296 355970 395529 370278 336836 316713
18651 316713 284547 246661 223668 250645 269784 279682 251842 209658 195107 200402 189595 177352
18639 177352 174893 188898 172660 181431 151332 88090 84769 105964 112497 159271 203813 197979
18627 197979 180801 148171 116070 66829 52759 84080 138756 121881 111496 123689 138093
18616 138093 145935 161783 186547 181274 150488 126109 137411 115061 141762 205173 228297 235276
18604 235276 241761 293226 311006 259590 259800 334678 438641 493862 534706 605508 658496 690198
18592 690198 737591 793974 815007 769071 652703 557080 517445 481362 461424 473165 463776
18581 463776 439703 425856 357639 304121 270190 225404 177061 172311 194531 194079 207236 230774
18569 230774 218699 219767 198824 167145 224665 230674 233453 256593 300583 298613 307586 336852
18557 336852 383359 460364 564584 659023 740686 758580 698803 664863 654201 676796 743310
18546 743310 846528 939530 982031 1016412 1014270 947669 904101 836004 739055 649223 550319
18535 550319 510466 469486 440270 434306 441757 410127 372184 341604 322280 339440 315666 274893
18523 274893 260002 275436 296690 320401 316819 330689 335839 359797 366192 311522 309452 344546
18511 344546 378659 380653 386858 435076 505555 516016 540171 620996 731046 796078 835329 873484
18499 873484 829168 753164 699274 682855 648842 606692 596213 582840 556034 530919 531412 519680
18487 519680 482153 488224 438648 405585 391664 377257 380501 366606 351474 348600 336382 317661
18475 317661 322177 336703 396248 439833 477510 502229 510822 496078 488723 495444 507402 512800
18463 512800 506554 496447 494021 500737 500849 517242 525896 524944 535159 496413 481476 498087 524802
18450 524802 564444 599526 610160 628459 628055 671034 738439 825906 907808 1004591 1060413 1061575
18438 1061575 982226 865905 688958 528909 383631 289148 204019 194613 215569 198418 204027
18427 204027 226098 227393 243580 263644 312054 324126 311879 299240 281710 257112 286310 263703
18415 263703 285444 295791 262007 299525 319861 320437 283539 260070 295072 327309 307207 289981
18403 289981 287150 265835 261733 242415 240883 268510 314560 301500 289651 284957 251917 225727
18391 225727 221490 223276 193357 212601 204254 224254 238696 243009 283279 316951 330187 411418
18379 411418 411191 433035 508774 544826 576620 656413 718625 762389 777052 772920 765498 756050
18367 756050 730657 730837 730240 733804 754483 763330 810001 872720 910172 943369 961169 986778 1018521
18354 1018521 1025711 1111481 1210391 1308645 1396331 1474351 1568528 1635580 1664592 1724597 1787361
18343 1787361 1903218 2077023 2296981 2734410 3461208 4078620 4256420 4126629 4006795
18334 4006795 4053469 4228410 4411344 4345619 4206175 4235327 4381426 4641094 5041445 5292461
18324 5292461 5158594 4961471 4912661 4862523 4822579 4840302 4938642 5146557 5462388 5707826
18314 5707826 5748075 5711760 5783421 5884674 5972314 6115491 6262461 6372327 6435082 6526533
18304 6526533 6726357 7042835 7487441 8022702 8555144 9167045 9979191 10961773 12144748
18295 12144748 13695638 15919164 18522202 20379172 21238274 22046618 23403933 25143867
18287 25143867 26564967 27661092 29400186 32606314 37708811 44570233 52621508 60677622
18279 60677622 67923341 74310388 79356807 80809244 78835971 76578595 76563287 79251912
18271 79251912 81824466 81134705 78992931 77614164 76754801 75506569 74092237 73614026
18263 73614026 74868661 78388213 84441184 93150360 104115684 116029519 128971894 142793722
18255 142793722 158240759 179902017 213926541 266460720 342620061 429595724 490920610
18248 490920610 508848824 496362149 463522989 410698188 344760178 280172593 225712840
18241 225712840 182916032 151763119 131194144 119172923 113421445 112390536 114530477
18234 114530477 118333810 123309885 127229724 125751751 119051356 110178113 100265617 89784363
18226 89784363 80334476 73317825 68815271 66911161 67399192 68760493 69020689 67154376
18218 67154376 63543766 58651975 53042618 47936872 44133984 41793147 40639450 40009625
18210 40009625 39066930 37755216 36339048 35179036 34079624 32394447 30518487 28948482
18202 28948482 27678711 26678637 25691614 24301356 22784512 21605120 20842361 20155656
18194 20155656 19467439 18974176 18830360 18702611 18513859 18450294 18284544 17728487 16881952
18185 16881952 16011692 15365322 15148989 15658822 16960700 18779417 20377215 21096440 21040917
18176 21040917 20709799 20200041 19478569 18746436 17704039 16136439 14464180 12982668 11676497
18167 11676497 10371804 9294485 8561219 8169787 7888512 7587359 7316005 7147404 7212097
18158 7212097 7407932 7654320 7846609 7964140 8085845 8315066 8326244 8114129 8028797 8169873
18148 8169873 8286801 8111883 7810574 7662195 7604721 7425848 7050587 6574205 6085600 5678325
18138 5678325 5349558 5100903 4922870 4714320 4566947 4414415 4341803 4353580 4509309 4781181
18128 4781181 5084733 5219888 5139082 4914759 4546789 4227132 3974476 3848891 3815493 3908328
18118 3908328 4107283 4373244 4679819 5060802 5561638 6298955 7288241 8601279 10512596
18109 10512596 13471042 18498889 28162133 46369637 65430031 66223245 55251487 45988994
18101 45988994 39442590 30353581 19828288 12793046 8963116 6770211 5411409 4415442
18093 4415442 3645702 3108259 2734390 2443964 2175408 1974539 1814434 1686958 1529235
18084 1529235 1430007 1300880 1149177 1085738 1015858 964330 914654 855779 818990 793757 768210
18073 768210 773353 729014 701443 685235 662129 639324 659870 682277 628335 590682 549200 459504
18061 459504 344131 190756 5779 -144967 -256199 -282903 -268141 -240591 -205984 -106998
18051 -106998 -50449 10019 54106 106078 148244 124508 104834 118355 89473 21207 13687 36237
18039 36237 35650 20539 55626 94460 104215 90792 83023 99026 87944 86794 82920 65176 84416
18026 84416 141346 157158 153612 155660 166894 183092 170005 173646 150718 138592 152370 147179
18014 147179 144105 117362 107790 116060 160518 203144 217521 206266 226299 227695 185061 204488
18002 204488 192863 187787 209188 218775 214020 214527 217843 177996 177092 235950 247013 236066 245074
17989 245074 218499 157544 140604 118055 89702 67103 51702 79605 106004 118588 123475 112210
17977 112210 96985 119410 167368 163105 138649 158674 160847 121957 108109 109200 79434 40620
17965 40620 71378 140837 191613 197439 175210 171968 165298 175536 170244 140816 106026 44009
17953 44009 53303 55207 88111 113693 121374 107395 90021 87209 99327 113883 67809 59700 54995
17940 54995 36178 9307 18480 64780 133662 128947 106428 65294 82226 85297 66172 88366
17928 88366 69464 63517 78580 85078 56794 69673 110804 136133 112674 108325 102137 88487
17916 88487 117829 91291 30844 21904 -13645 -20521 -34768 -46262 -504 18059 27364 14611
17904 14611 -8254 -7843 30139 31131 30385 29595 28436 83467 71945 50259 23795 -6184 11822
17891 11822 -4009 -36690 9929 48706 61317 52207 55596 52745 83353 49716 18935 45403
17879 45403 55609 35961 49142 75768 88806 80799 50715 19440 47188 78948 102304 93863
17867 93863 40737 17054 51437 61142 63304 62006 63675 42522 35665 43677 17194 4673 21969
17854 21969 20243 1843 -701 -2002 -13945 25645 71288 25599 -38343 -43267 -32334 -6118
17842 -6118 15710 7608 -526 -9414 -9131 -22427 -2542 -38250 -23394 7537 7620 23217 39741
17829 39741 42811 44131 56593 58766 32307 51661 72128 75120 44532 31515 66415 28176
17817 28176 -14644 18536 29798 36116 29379 52807 113750 175578 213964 213558 215964 199835 209791
17804 209791 240458 253681 323067 341546 324505 296130 237689 166382 125345 97563 111245
17793 111245 128563 144148 151077 147254 157327 151801 122253 136568 165140 236187 277351 297005
17781 297005 342864 379488 430419 491835 514038 495174 515977 570001 581684 579936 617400 641798
17769 641798 705381 750679 813062 881327 907849 872170 774077 718186 666619 631680 601805
17758 601805 556844 539890 541124 534858 554428 558142 545757 537160 510653 483078 470584 438594
17746 438594 408939 420914 411437 395216 407809 399127 419220 432776 458531 492053 492094 516803
17734 516803 550656 580617 582605 588244 597528 585432 556575 533453 562148 553540 590516 643196
17722 643196 676498 649870 604373 615309 617144 587625 553110 534823 527739 506784 461638 426655
17710 426655 396352 403685 412309 387221 355804 379432 455225 475655 443222 431166 457481 435385
17698 435385 443692 412788 358485 281870 226770 252000 230901 172394 139051 192345 217744 217504
17686 217504 199337 235185 246869 244357 254531 250547 229561 209177 176386 129484 94883 97675
17674 97675 119706 142680 167156 165178 144760 107024 103139 159860 158487 155474 160213 124399 119983
17661 119983 120977 66580 23367 46976 83411 67062 86080 71013 68611 103171 123479 112372
17649 112372 105909 125171 112363 110299 109299 97971 130433 82072 91049 94369 48178 37768
17637 37768 50878 44924 -9598 -23052 -8617 -4862 -3075 -9310 32406 19936 16931 45614 53802
17624 53802 77513 39881 12539 39277 33854 18912 8388 38074 62682 56332 55190 57701
17612 57701 84558 84264 15829 -2088 -19235 -6126 38298 65194 63269 57411 29142 16198
17600 16198 4774 -9029 -55951 -39597 -9765 28067 52942 53768 34530 22690 32641 36434
17588 36434 1087 -8420 -24403 -61378 -70081 -96920 -96331 -40217 -33846 13086 2154 -6616 -15854
17575 -15854 -46311 -50089 -22655 -8318 -20225 -46728 -36629 -21657 -4563 -8021 -20056 -9537
17563 -9537 31102 37071 -7885 -15161 14441 50666 44804 34161 48573 7420 1745 11614 32590
17550 32590 20275 -13786 -26006 2723 46576 24219 -30548 -47427 -20968 12862 41950 8139
17538 8139 -11144 -10823 -73440 -85301 -66675 -59484 -65883 -51461 -28547 -16243 -11451 15372 40544
17525 40544 3904 -525 37038 7879 2247 23280 -172 -16713 -34432 -19885 -15716 9658
17513 9658 20322 37397 13043 -21563 -27546 -29414 -25036 -41160 -28858 5596 17321 -31632
17501 -31632 -4064 49164 15726 -9218 -19401 -27137 -64513 -67773 -43649 26398 52727 55073
17489 55073 28718 14307 -15328 -44480 -38075 18810 32060 7605 23757 16492 14232 8711
17477 8711 16511 53332 51429 7159 -1657 -30096 -40919 -50070 -59937 -81243 -40644 -28263 -30668
17464 -30668 -7210 13049 25897 32857 4303 532 3159 19518 49061 57500 16990 -45945
17452 -45945 -54676 -10742 -19857 -13476 -18455 -19739 -21296 -31374 -18851 24979 109624 133100 197942
17439 197942 307299 388176 347366 274146 247296 212467 128962 81875 57388 23270 34505
17428 34505 48976 29361 -6993 -14438 -5294 5488 -14195 -34951 3000 5064 20069 50901
17416 50901 10822 -6462 302 4909 -11187 4210 27458 5614 -37010 -19988 7505 53185
17404 53185 56266 40854 19900 24955 51382 20642 4878 -14723 -4646 -16941 -41823 -26065
17392 -26065 16522 10596 5842 -3590 -2358 -10839 -12006 2435 1112 -13736 -20136 -19066 -44467
17379 -44467 -51230 -51738 -34997 -27429 -22825 -11805 -11858 -72631 -59311 -59056 -50431 -4224 25822 39160
17365 39160 49836 51150 23172 16032 3535 -23914 -61209 -30974 -6653 -3826 36665 79836
17353 79836 49160 16172 -2099 -15405 1927 4357 6064 54342 68696 37871 15247 17633
17341 17633 -8167 -18853 -10444 -10765 7235 -28188 -69113 -82875 -79307 -77864 -89510 -56714 -37443
17328 -37443 -21566 11674 20588 27577 -327 -48553 -49417 -18998 -8212 -15821 -3414 -3688 -9180
17315 -9180 12079 -26949 -53360 -49113 -50584 -31112 -26941 -8160 -9539 -36512 -41708 -48686 3937
17302 3937 30944 9684 -38892 -40328 -33590 -39845 -55459 -39127 -39121 -56071 -50135 -52277 -32400 8039
17288 8039 39850 27419 55814 85214 58869 16911 24662 40596 35780 51447 36499 3511
17276 3511 -19474 18396 51626 28528 -35695 -55200 -10367 -3811 9813 32343 55018 -1791
17264 -1791 -880 15512 -6190 8798 23076 10827 -24417 -22992 -1325 -10702 -23838 -32768 -57481
17251 -57481 -56488 -43568 -46749 -81694 -44472 6535 -7200 -26086 -19590 -35050 -41945 -17216 15080
17238 15080 23367 26472 7346 -3473 23517 29108 2415 -17446 -32593 -26410 18887 -18537
17226 -18537 -28540 -9489 -9281 9353 27964 23667 38339 42971 47799 55451 64074 60188 38410
17213 38410 -14969 -39958 -19525 956 27098 -25814 -32003 -24998 -53321 -44149 -43581 -23752 -61005
17200 -61005 -56920 15529 40984 42131 15300 -3282 -4441 32482 50497 36318 17941 28626
17188 28626 64024 31002 10680 20332 8308 -9725 -14090 -17918 163 25135 32472 38961 27849
17175 27849 28693 25590 12039 15986 55541 41917 22863 31547 37747 2971 -5433 11695 15334
17162 15334 4992 28010 83692 74326 42263 38312 47627 45562 57031 69929 63556 81223 62859
17149 62859 54606 67779 52186 17697 23838 -10538 -28857 -779 -11835 17859 45922 18623
17137 18623 10185 -2927 10048 5958 -29769 -33658 16814 53915 59522 37146 48282 71892
17125 71892 58298 39316 -12674 -13091 13628 24482 25826 -6451 -8842 12356 36306 4597
17113 4597 -43412 -13874 9302 38549 98524 109267 60181 53449 33528 23302 27066 -9623
17101 -9623 -15366 -52737 5854 4516 28591 48155 14145 9535 19118 47887 55237 62265 54488
17088 54488 33625 25917 -39270 -39712 17404 19625 1520 53798 95872 114274 97032 68328
17076 68328 67879 89777 62218 40051 67984 36752 27299 29987 29001 63896 90393 87822 69274
17063 69274 56634 30386 10916 10607 14753 23786 12278 15270 43082 33919 26038 -15332 -31959
17050 -31959 -14582 -4061 -11989 -16587 11251 -777 -13044 3672 -6660 -11421 -8630 9885
17038 9885 39723 21359 -8968 10548 -30065 -60606 -98136 -67290 -50804 -59449 -25916 18401
17026 18401 7722 19616 20449 11380 -1823 35517 49380 36706 7804 -7259 -3672 -8959 -21982
17013 -21982 65 -14396 -77515 -74235 -19592 -21285 -39956 -43524 -13532 29650 25177 5138
17001 5138 -18781 -18668 -39580 -5954 1555 -21148 -42999 -10076 27777 5134 -38692 -41285 -37359
16988 -37359 -32100 -25198 -10471 23971 58649 107574 89327 80511 70452 20466 7045 43047
16976 43047 53466 52073 15060 52980 53036 52515 -3423 -15106 -14515 -10825 18083 16722 24150 16371
16962 16371 -33478 -43263 -38709 -12744 -28609 -9793 20206 20275 -9198 -44038 -4674 -21692 -59781
16949 -59781 -36038 -9886 -7978 -36896 -31866 -14863 4753 33513 -8598 -61089 -74648 -48206
16937 -48206 -40134 -17105 26371 46265 39510 58996 75672 63775 44607 31533 -2110 -41336
16925 -41336 -47567 -53845 -36998 -26957 18665 38596 -5173 -60736 -49468 -24571 4915 27505
16913 27505 17466 41721 99371 104365 97671 87324 52951 17793 19995 33001 43726 53798
16901 53798 68257 87696 62113 43182 13286 -17663 -13019 -35667 -1091 14260 -20698 -19062
16889 -19062 -29828 -24185 -18833 14074 47322 4873 -32642 -62718 -49056 -46482 -20255 -7210
16877 -7210 -8453 -18850 640 -22093 -34522 -50897 -47762 -18931 -9267 21215 32020 55858
16865 55858 93401 72720 50971 56734 44533 36454 18124 21307 42053 32406 -5129 -26147
16853 -26147 -40325 -16205 -6775 -33130 -64313 -56836 -34033 -31439 -26580 2143 34312 27293 7986
16840 7986 -6960 -16978 -19278 22050 23769 572 -9895 -21272 -29587 -19437 -28216 -75488 -65519
16827 -65519 -8622 -30124 -48059 -67071 -57866 -24546 -12728 -51498 -44237 -25180 -29967 -32384
16815 -32384 -64805 -53920 -46444 -55993 -71690 -23181 -1043 -14796 -540 11411 10450 17666 -18904
16802 -18904 -21922 18914 39028 14583 9098 -24755 -49029 -26645 -8501 -31109 -41638 -37313
16790 -37313 -38774 -29629 -20207 -25125 -30669 -22652 3931 37992 47778 7002 13679 18592 16041 54492
16776 54492 55862 1579 -45053 -17138 18371 39009 27007 10827 8511 -20107 -28972 15123
16764 15123 16925 -15182 -29621 -17280 -20309 1999 30974 17580 12253 23248 16457 20539 24938
16751 24938 -23810 -1984 -8476 -11868 -14517 -21891 -15719 -28275 -9693 -42895 -40639 -20018 -28995
16738 -28995 -59186 -59757 -59538 -40935 -57147 -77098 -52815 -18360 -10315 -27125 -24924 -14884 -20595
16725 -20595 -9799 -16379 -2024 16284 2419 11492 -5781 -39613 -38721 -24353 -13987 -7636 -15572
16712 -15572 -7915 -9102 17313 48797 27269 21193 40892 36125 39935 56222 36861 32119 47540
16699 47540 67371 50759 40653 35446 38029 13828 -9098 -38094 -19639 3675 10391 48370
16687 48370 97709 67114 44396 40689 29273 44829 45387 7126 -1445 -571 28525 32546 20866
16674 20866 2418 34158 53321 62045 13134 -23912 -30075 -25863 -32648 -470 24775 38763
16662 38763 34811 -7753 4658 45678 62021 61478 74984 47200 29298 69439 105836 64602
16650 64602 47129 89231 107914 122331 135015 147797 170235 150931 126263 102453 89111 89775
16638 89775 84530 74093 71698 42628 27656 59674 58987 69272 46358 41507 58341 53321 42673
16625 42673 36408 29526 43603 38665 16584 15522 5930 2691 -4173 23529 8005 -14743 -18699
16612 -18699 -16180 30660 62659 23126 2373 5565 30994 34001 18212 35588 53007 44634
16600 44634 30062 37445 49624 42323 42134 50738 31332 -26993 -39119 -14077 6214 -3718 -30482
16587 -30482 -16506 -15052 -6644 27449 22787 56280 55980 74074 52528 4998 -3368 28656 26544
16574 26544 30326 37568 41050 39632 37713 10945 -6427 40241 59672 16923 -36519 -35536 11749
16561 11749 5071 1601 3067 -15350 9092 11658 20418 26865 -3252 10931 9041 -3915 -9971
16548 -9971 -45 17011 -216 -11422 7056 46352 57654 60836 31091 1286 -13472 -20309
16536 -20309 -20720 -16570 -39617 -40266 -47869 -10530 7879 -20416 12046 19372 35172 34825 11297
16523 11297 118 -13181 -29955 -42213 -30782 -3359 6254 14889 9108 3654 2587 22482 -2439
16510 -2439 -7285 23465 39831 27887 5352 -1849 -26923 -52444 -43793 -29701 -4201 -18521
16498 -18521 -3528 10716 -13280 -10262 -4897 -21006 -16213 -31117 -30018 -29918 -36108 -13086 -15582
16485 -15582 -16393 -23986 -16924 9943 -19133 -33876 -8117 25968 23736 -7060 -11856 18664 -3950
16472 -3950 -19983 -28319 -13513 -10332 -24920 -17075 -14495 -27075 -43295 -28421 -27602 -63403 -59052
16459 -59052 -66025 -20425 -1447 -5386 -1214 -26633 -12178 -1078 -11680 -19031 -23484 -27716 -20008
16446 -20008 -41328 -33927 -10819 -26397 -24255 -37330 -61876 -59941 -93290 -50531 -14751 4782
16434 4782 -9241 21345 19985 17980 8199 -11468 7405 -1806 7583 20039 11733 73 18474
16421 18474 8854 36937 23431 -28582 -54958 -63568 -56768 -71444 -55161 -70097 -51121 -23540
16409 -23540 -26369 -40226 -25645 -40707 -45520 -64129 -66430 -62073 -47748 -59729 -62104 -69635 -86291
16396 -86291 -109786 -80036 -16523 8258 12569 14008 21655 985 -32660 -22377 -773 -21852
16384 -21852 -35760 -19381 -22591 -2039 18798 -11085 -65063 -95831 -71510 -32871 -18742 -5736
16372 -5736 -20248 -29170 -40074 -43073 -46979 -83190 -103155 -91844 -81538 -56718 -58492 -16747 -8212
16359 -8212 -41753 -47849 -39931 821 -15450 -23295 -47195 -21634 30570 56136 41202 14937
16347 14937 13232 -21127 -19749 -7891 -6167 -17752 31816 9921 -43179 -41183 -16957 -16038 19233
16334 19233 29685 -5211 -481 3204 -23102 -24714 17799 14803 -6815 11187 11210 -32099 -7446
16321 -7446 -3606 -12311 -33743 -44997 -17392 -21219 -4241 2919 45618 20375 -17920 3054 -8053
16308 -8053 -24260 5179 44027 19859 7425 -998 -3214 30408 26921 -18476 -36808 -6222
16296 -6222 20997 1034 -61707 -60685 -63661 -55771 -57211 -56243 -53825 -70503 -61559 -35255 -46125
16283 -46125 -30148 -4626 3564 9347 11618 5421 -6656 -42202 -96430 -65268 -39263 -59944
16271 -59944 -78291 -71551 -67105 -61616 -39500 -12219 4991 -4822 -7369 4217 6789 -70 4982
16258 4982 38463 -3211 -3238 46221 71471 19803 5566 -3109 -43879 -36066 -37075 -13681 -14669
16245 -14669 -55599 -72114 -45036 -22944 -6060 -13200 -49415 -67225 -25666 10114 -11801 -15801
16233 -15801 -19442 -4137 -42583 -74896 -95923 -94573 -53606 -33044 -36190 -36574 -36097 -14980 -29285
16220 -29285 -34561 -24538 -24573 1967 23166 25177 32495 46974 11074 -27466 -14816 -20972 -70633
16207 -70633 -61605 -53706 -42297 -30357 -31328 -25146 -17256 212 32340 41962 42341 51787 43146 38792
16193 38792 15278 -366 -11490 -32863 -59998 -61095 -47916 -44412 -50146 -36884 -19461 -25063
16181 -25063 -41600 -57570 -34398 -24142 -21194 -13369 -19948 -21403 -10973 -9950 -10057 -38593 -49427
16168 -49427 -43912 -80460 -63475 -63933 -53495 -5722 4303 -21995 -49084 4518 47818 39355
16156 39355 11191 -54483 -94744 -72076 -56546 -56916 -48572 -25128 -9651 26211 6332 -1108
16144 -1108 -6863 -7121 -33447 -61240 -56157 -26273 -56434 -57188 -17675 -49029 -41915 4638 -23075
16131 -23075 -32301 -60187 -21381 -10071 3812 -10807 -5923 16807 37472 31643 -11049 -8011
16119 -8011 25275 24069 -22162 -9440 -8151 -46129 -51155 -37773 25174 40784 66939 76097 54827
16106 54827 14838 6496 -15654 -43433 -60104 -32756 -15311 -14548 -55891 -70756 -93201 -100358
16094 -100358 -60696 -29521 -47177 -42169 -13629 -915 -11170 -69427 -69000 -56289 -66286 -70993
16082 -70993 -17970 -7593 -42507 -44949 -38709 -50189 -51578 -51088 -63670 -48367 -57678 -50029 2178
16069 2178 19819 10340 30588 19265 23330 20130 6261 -22933 -36385 -18428 4188 31582
16057 31582 422 2635 -4693 -1254 22576 38967 46544 17479 10541 -22030 -10484 15312 71672
16044 71672 108396 71669 29843 46840 57726 42385 51946 48924 50177 10443 -11602 -28947
16032 -28947 -6954 -6750 -48660 -88092 -98730 -75541 -14766 2356 -20481 -6790 92 -3936
16020 -3936 32232 24257 2731 -2538 -19277 -51425 -52631 -30538 262 -5294 -26766 -49248 -15628
16007 -15628 -12497 -7986 12044 23750 46192 62998 32781 14046 28180 21340 27389 60313
15995 60313 27664 -5569 -43027 -64072 -43726 -32361 -30033 -20080 7609 26242 16481 -25514
15983 -25514 -40559 -35571 -28236 -33380 -21185 -44486 -36931 -18937 -12033 -2625 37660 15187 -4231
15970 -4231 14106 17781 43735 52686 85283 81231 41639 -14363 -28821 7121 79558 72207 97691
15957 97691 78873 38634 -15509 -22445 -28770 -50826 -53956 -16284 3995 3928 12675 45824 47118
15944 47118 31645 27815 30781 29285 94 21785 5029 -27134 -48944 -52042 -54550 -25684 -5628
15931 -5628 8491 12390 22649 18995 1302 -8007 8950 29576 29311 63963 35747 6082 8664
15918 8664 2170 -17430 -42802 -5164 -4334 -7272 29507 41967 -9145 -7869 -23479 -35097 -41251
15905 -41251 -32242 -16583 -15626 -13680 -2451 5581 -5712 -34167 -14769 26583 39735 31626 -4131
15892 -4131 -41121 -30124 19702 -18377 -25145 -33828 -30161 -14597 -40451 -49102 -42891 -3791 7180
15879 7180 36128 61886 62700 45629 2209 -24702 1223 627 -10568 2134 46108 51580 54928
15866 54928 40519 -5220 -55185 -66957 -92314 -88429 -56110 -20180 -21679 -35062 -10756 -12563
15854 -12563 -44180 -57327 -23159 -19168 -32716 -742 31625 33968 9020 -30418 -48443 -50881
15842 -50881 -29340 -24658 4715 31092 20961 19541 31468 14956 6904 29432 29545 3795 1048
15829 1048 -14 11371 -7738 -2339 3393 10303 12039 17803 41748 64418 43315 39024 -13541
15816 -13541 -34898 -12420 -18310 1161 42081 48740 18708 -6302 -29562 -19160 2149 -10294
15804 -10294 -2599 1035 -32560 -54779 -36505 -31956 -77854 -88919 -54673 -8793 21544 15658
15792 15658 46491 35278 11967 -10869 2216 -27425 -2506 16496 40745 43373 39194 21964
15780 21964 24299 13930 -27170 -57016 -72688 -50615 -15530 -4342 -6185 -7995 -10871 -28655
15768 -28655 -50576 -30595 -38582 -49813 -73967 -30871 -6787 19729 6922 -34640 -24308 4879
15756 4879 4043 -5749 17103 51540 32232 33315 9567 -16550 -7021 16402 45939 31199 3142
15743 3142 5937 2215 -5802 -40536 5671 62279 73449 69405 40824 33558 18319 14160 11578
15730 11578 22798 22575 -22437 -35110 -53107 -98032 -71553 -55105 -75548 -91272 -91377 -88146 -64601
15717 -64601 -52692 -49399 -39627 -38881 -43832 -58421 -55995 -47375 -19768 -4481 -34295 -37295 -19549
15704 -19549 20912 43818 21658 32505 29158 23355 -24466 -64119 -47161 -41416 -16723 -28329
15692 -28329 -36769 -40593 -46954 -8195 -9590 -34711 -66097 -61507 -58856 -52313 -57234 -39182 -68660
15679 -68660 -79126 -32981 25578 54336 59037 83757 65718 60590 35215 8601 11862 17873
15667 17873 -16848 -37440 -16398 -8074 10499 -21318 -85549 -72502 -71394 -72799 -53144 -43239
15655 -43239 -9995 17134 38741 29089 -10000 -10829 19519 7918 -2763 -23552 -66984 -48993
15643 -48993 -10271 4252 1386 -42959 -88706 -97312 -58403 4580 -1476 -24261 -8549 26142
15631 26142 40186 44748 69731 55473 34164 48406 52319 29624 -3790 -23016 4135 8104
15619 8104 26669 3892 -28759 -36583 -49025 -14492 10283 -23703 -24340 -25765 -36255 1158 20243
15606 20243 20392 34941 29008 -9189 -6400 54503 59300 40133 26659 17019 9950 18512 -299
15593 -299 -24287 -26222 -23357 -5391 12251 28359 32451 32097 975 -2777 30400 31817 16956
15580 16956 30867 33844 36139 23330 38921 33160 -20607 -13552 -6698 -50323 -69124 -61177 -17657
15567 -17657 -24875 -70241 -78071 -35827 -414 19432 28270 58741 47258 51194 36684 49479
15555 49479 43931 36650 31078 39024 59158 73020 53790 79874 49814 8897 30523 45959
15543 45959 27755 1522 20757 -2271 -25689 -65811 -45566 12492 27763 6706 19009 -20113
15531 -20113 -50788 -80032 -48330 -35226 -58997 -37212 -20014 -13435 -8243 -926 -19416 -22780
15519 -22780 16580 40395 26626 57998 53594 54332 27321 14392 -2207 -31396 -24405 -12183
15507 -12183 2532 -9183 -12650 -27931 -15207 7742 7252 7449 -36080 -40362 -25686 -13017 -4181
15494 -4181 19042 38504 36856 -9223 21216 69812 71082 25190 -8199 -22282 -45053 -61319
15482 -61319 -53772 -25861 -17740 -41115 -73882 -52651 -47174 -52574 -40171 12838 43245 46059 -19021
15469 -19021 -59418 -63445 -53918 -49777 -14017 4635 14473 18924 56271 52887 61615 22791 3094
15456 3094 -29159 -45956 -39447 3945 27034 23286 31476 29404 30899 8512 13535 4977 -25592
15443 -25592 -20702 -669 51349 67710 70500 59257 41173 59544 44670 8064 -33247 -25838
15431 -25838 -5521 -6858 14552 5348 -3480 35308 43136 33950 15983 14214 30589 23824 -7923
15418 -7923 -2417 -3556 -7615 -15637 -36954 19190 28588 16715 -16245 -36905 -28393 28341 71572
15405 71572 42051 47902 46519 18807 20570 -1225 -29562 10653 44944 9331 -9312 -19735
15393 -19735 -17782 -2854 -24877 -40576 -47691 -58131 -53880 -29348 -16405 -335 51339 70810
15381 70810 68203 47157 51081 41089 22250 6861 41896 39578 2075 1397 4475 3589 16790
15368 16790 -26546 -48976 -7434 3836 36068 46162 161 -28570 -29768 -15610 1502 13306
15356 13306 6897 5503 10778 23791 15943 -8514 -41276 -47782 -54553 -51752 -33734 -7756 -12502
15343 -12502 -41026 -18989 -5636 7925 31736 22105 -15240 -36676 -16242 -18320 -6314 6479
15331 6479 -14579 -21046 -23070 7142 59889 82452 69604 55349 59149 38659 12442 16167 11496
15318 11496 -13468 -23723 -18492 5544 -8305 -50444 -32624 -12773 -18669 -11871 -1111 13724
15306 13724 7841 -7956 27437 44147 8349 -20699 -56763 -23935 789 -11032 -4704 1633
15294 1633 14459 -1631 -31548 12962 51172 48737 38031 34451 22784 28616 41227 59797
15282 59797 87965 49640 33006 4169 -13224 25081 94044 125717 134203 127111 113637 84700
15270 84700 47227 52827 50494 61632 85168 106650 87135 92421 112793 117338 122778 132919 156136
15257 156136 149453 163171 224953 270981 296576 338906 370641 441976 522997 546460 593606 682044
15245 682044 667920 610403 585897 570563 570427 515634 484632 485727 479018 464796 459531 439719
15233 439719 473383 508463 542726 533864 532646 515088 489093 485311 451223 401870 342314 335989
15221 335989 337114 345422 297954 207754 199703 193724 200071 191075 156765 172690 213158 202781 175522
15208 175522 159389 204993 265937 242787 256790 263543 236179 244486 283019 301479 304565 335475
15196 335475 415793 512258 641880 768434 859955 975531 1129756 1271839 1336182 1299079
15186 1299079 1210658 1113460 996823 868197 778425 697387 577410 483317 406194 366137 328978
15175 328978 259137 165317 147704 120615 124511 117783 119823 160280 146891 130318 126356 108209
15163 108209 83678 107867 118757 117933 121007 143283 130361 87426 73548 113694 124544 97732
15151 97732 81187 61791 69357 83071 68858 38418 31420 42698 49651 51672 40660 71558
15139 71558 52243 25889 -12711 -33136 -9429 -10549 -1252 -7905 -9545 -111 -2648 25048 54014
15126 54014 43525 3006 -22172 -48804 -47027 -25713 -9818 17314 8454 20358 25483 9871
15114 9871 8794 -17441 -22770 992 -8543 21271 41557 25669 69388 63391 64081 61306 64977
15101 64977 61569 46660 73809 40920 -3928 -7302 -10895 23812 -27764 -44390 -20780 -28838
15089 -28838 8201 10737 2330 38174 48722 44481 33939 52262 49979 38265 29409 -5447 -9107
15076 -9107 723 1375 -20713 8587 19950 13385 30642 35553 8433 -13168 16979 57074 66729
15063 66729 51700 51254 66143 78932 48395 45251 51675 46245 65629 59315 54839 58916 88652
15050 88652 82061 41963 31654 25348 24405 32037 15970 37789 58099 50183 50213 54999 45021 67441
15036 67441 56371 31650 12691 53813 92353 89671 119194 137866 124795 89654 108222 150845
15024 150845 148363 139558 154393 120808 115978 82408 52281 89016 98024 68889 61971 76249
15012 76249 131022 119687 103457 120520 156038 159269 119571 124180 130570 105187 76135 93302
15000 93302 86184 106479 178152 217008 264205 330272 391829 509443 832107 1169143 1180130
14989 1180130 997455 890751 771751 621887 475696 395818 306442 281557 263724 269679
14979 269679 285557 327992 299997 239161 225191 245522 232232 196755 164535 137721 135984 104027
14967 104027 87642 112420 119042 121369 113258 81538 73490 91042 95863 88145 75821 98432 122616
14954 122616 112702 138774 138399 125550 129109 113728 125769 166794 172877 153316 162651 197418 213518
14941 213518 191694 153830 154033 158312 150738 148125 158988 191280 204066 204795 212959 207602 188039
14928 188039 218995 258840 255633 259975 241858 292766 348256 395520 441489 465620 482518 524289
14916 524289 521303 474180 413384 371639 296511 214911 143467 126117 118168 80010 55912 32689
14904 32689 35571 71054 73434 70595 85922 85744 120019 98852 93160 88918 68519 18012 27368
14891 27368 89574 141037 123118 119150 140400 128045 154419 192729 191007 179541 123381 147866
14879 147866 142548 149459 134488 118513 132730 176885 202158 189098 150740 176550 198360 182083
14867 182083 204735 204204 186549 161038 170174 199117 223066 204226 163349 205418 228130 203611
14855 203611 231686 266962 264651 284010 351398 412306 456824 504845 496308 505859 508539 524184
14843 524184 525934 509966 529190 536414 592713 604262 594724 623577 685445 688320 670415 620718
14831 620718 661148 743944 791652 834557 888468 961615 1005867 1074674 1198655 1306875 1405380
14820 1405380 1461836 1549494 1692825 1842141 2033207 2308701 2772310 3520247 4685587 6315429
14810 6315429 8152884 9563482 10108021 9915909 9202113 8154043 6873852 5514453 4405309
14801 4405309 3587450 2956336 2508794 2183721 2007317 1881408 1809500 1776540 1745425 1722637
14791 1722637 1716449 1745252 1813281 1868864 1910062 1932676 1958623 1978931 1989734 2043049 2067728
14780 2067728 2068488 2115862 2159232 2212419 2238121 2271690 2356634 2425510 2538857 2677768 2761584
14769 2761584 2877024 3011090 3170423 3360658 3531998 3660366 3820066 4018577 4287945
14760 4287945 4567484 4842266 5131549 5477161 5897120 6358747 6835676 7414829 8047656
14751 8047656 8717834 9525010 10419591 11367091 12448433 13675112 15108154 16801873 18758750
14742 18758750 21056832 23732059 26810511 30350310 34454854 39297444 44935529 51780996
14734 51780996 60384313 71437279 85966586 105090947 129608268 158949321 190408829
14727 190408829 219398270 240913688 251445637 250266796 238782523 219556882 195434632
14720 195434632 169258285 143768786 120962650 101753416 86206632 73960040 64482273
14713 64482273 57136145 51341374 46666465 42721759 39332569 36414255 33833816 31499162
14705 31499162 29379922 27373473 25490845 23655951 21914874 20283703 18751345 17355986
14697 17355986 16051047 14894441 13898420 13056146 12327273 11704183 11156385 10646426 10211272
14688 10211272 9874254 9486179 9081662 8679148 8264833 7855742 7463537 7070843 6684224
14679 6684224 6305893 5958738 5635912 5303534 5017976 4798616 4593392 4412448 4184515
14670 4184515 3958017 3779866 3630587 3496003 3350086 3251669 3120210 2980635 2948323 2882204
14660 2882204 2736751 2645572 2586661 2522453 2428133 2346695 2264258 2195236 2138691 2075282 2021367
14649 2021367 1947026 1872134 1814410 1784674 1733786 1683642 1602711 1536201 1531404 1519925 1484009
14638 1484009 1411463 1339508 1326049 1332983 1345859 1311789 1304721 1305005 1274262 1251188 1210962 1149678
14626 1149678 1135100 1134862 1118563 1129679 1138558 1120783 1110019 1068107 989914 997647 963364 955676
14614 955676 956306 962238 969488 930702 954595 946394 942275 915262 875755 819741 816541 806362 797884
14601 797884 788587 767177 784264 782057 803330 879961 927166 959037 950130 919850 872412 823506
14589 823506 795563 795197 769593 761497 772038 805348 789300 752116 726670 746419 730935 689169
14577 689169 674862 679931 678508 672010 643076 646154 653282 643333 618192 614571 586300 547994 568441
14564 568441 549722 524087 513432 506400 559115 563307 564071 554723 593902 619643 579301 530065
14552 530065 468067 456217 483363 485012 468979 459520 450364 432247 466593 481574 472167 447916
14540 447916 399605 317814 269568 215620 160450 97876 14341 3594 -13942 -36735 -19565
14529 -19565 -3692 -1502 14511 28939 68672 90802 121361 171413 207032 209314 205914 201747
14517 201747 169143 165292 175757 164921 167524 154031 159297 140698 139423 154561 198016 209538
14505 209538 259793 289223 308986 292065 275258 283066 292971 246717 225657 216580 248792 263855
14493 263855 264407 258458 251450 252870 246150 264515 265851 305065 320555 286117 249776 227034 223458
14480 223458 246962 221287 207170 200152 198206 211075 238641 286108 297906 267256 248095 235445
14468 235445 230445 231397 229135 232329 228501 252075 274910 253884 251816 256455 250262 267369 291974
14455 291974 286716 282831 315356 331042 333599 325560 269053 256652 255490 212929 216265 208591 207666
14442 207666 219423 211013 230240 244435 265556 266286 273336 258747 231857 191709 190662 201025
14430 201025 189704 177048 182423 212783 238499 231334 231726 213591 200557 229862 248622 241970
14418 241970 234517 239912 253801 280438 280679 260128 267602 254072 254058 309759 331198 346585 334880
14405 334880 357105 389704 424494 435534 424978 394992 368389 350927 356594 360729 386081 401060
14393 401060 430749 413801 374877 381608 359428 325660 312601 315089 337957 350833 304228 300724
14381 300724 309570 332323 378053 427625 426738 435470 472369 475152 477958 430600 376775 415397 444148
14368 444148 418469 435531 410918 388542 388144 373951 382525 398048 421860 409041 359245 355953
14356 355953 346319 324031 280762 246605 270677 256311 248024 260671 285175 269012 277835 295562
14344 295562 289616 270326 283111 304345 319989 308492 336506 328758 287209 263894 308329 288761
14332 288761 252844 255104 268013 269475 238676 217342 183852 185364 207559 201736 148614 108398
14320 108398 124082 143693 151305 120958 125019 147242 161750 130857 123586 82100 78963 99815
14308 99815 126918 152312 154624 125773 109439 92879 114951 110215 110138 119048 110914 72270 59327
14295 59327 86502 95746 101368 107011 107280 123305 127939 129657 103559 93232 95425 98920 79327
14282 79327 70367 105690 125348 175140 212706 211807 186650 176803 212440 244530 240644 236864 237108
14269 237108 264923 292017 274405 294463 365637 416290 448201 545979 651217 752942 889218
14258 889218 1042198 1175521 1303954 1376666 1404663 1370247 1326444 1232914 1093358 963897
14248 963897 835053 746898 678650 615714 552108 459814 388958 365668 351556 316351 292056
14237 292056 288998 250377 224960 194481 170041 158466 168289 167060 145720 131770 155477 173157
14225 173157 168232 147294 113409 110593 136905 108143 54730 37718 38529 58620 39422 54127
14213 54127 91116 98505 79986 106123 127017 138211 118927 126408 102471 78724 106316 124625
14201 124625 105561 98844 68274 70587 89883 70206 46740 42914 51009 57714 73196 118049
14189 118049 133017 131196 122874 93959 84097 106299 100484 99832 126249 135089 140499 88718 69068
14176 69068 54596 79723 101281 91188 94520 102501 112804 121564 100132 93087 88710 74044 66828
14163 66828 77511 86314 95806 105824 98976 99360 87547 99056 89364 80457 60649 79420 119233
14150 119233 113038 120045 131243 99390 70045 60988 81380 115342 133306 152642 172806 194779
14138 194779 173288 134198 106450 94133 76819 33787 46839 40910 51534 80711 103363 121322
14126 121322 75366 92630 76024 75212 62971 61613 65988 100373 135557 122461 103778 111231
14114 111231 120319 55123 45640 91647 121086 75150 53581 80384 104727 138424 112509 118899
14102 118899 131426 132098 136953 107797 117176 138406 86284 73561 109118 105786 137017 142470 167866
14089 167866 154002 148050 160117 208133 216211 218920 194618 173643 167441 154126 154171 187502 200942
14076 200942 230973 236021 244847 212592 189697 210641 203339 172612 183641 205158 240388 240352 265620
14063 265620 298201 316341 307695 305710 350763 402990 434350 505369 654879 855474 1041041
14052 1041041 1241421 1428403 1562994 1637736 1564783 1409519 1205762 974455 826458 685429
14042 685429 561142 457792 412279 426153 456662 448285 396240 346791 320371 294031 294613 306627
14030 306627 330770 379487 408580 422026 371615 312167 298519 296264 325884 385167 376935 324218
14018 324218 362217 430657 436044 374289 330321 328886 356755 374135 383236 361893 404105 384946
14006 384946 368791 370980 340039 299319 287336 273079 300425 300408 294753 313861 266811 269109 279534
13993 279534 249673 238464 273996 237529 211421 249230 261285 213814 189017 179401 186404 167752
13981 167752 145800 175466 178441 151361 188692 230944 240632 222107 221733 177436 184120 194775
13969 194775 216036 231974 235786 196007 194250 216750 239210 241245 250590 244688 246406 234086 260393
13956 260393 252302 248646 228274 224481 185800 168157 173147 174702 156913 183775 212065 223476
13944 223476 249381 228376 193718 212610 230081 241524 246280 281722 320727 329516 344777 336411
13932 336411 323923 280050 269070 323876 342957 335670 339219 335381 324032 286117 284925 307183
13920 307183 286021 254432 251316 254818 282462 261642 235783 240515 248868 245325 253623 250984 260162
13907 260162 264679 246329 265911 282789 268307 269431 304732 322211 305392 262788 243636 247299
13895 247299 238161 219835 198321 171773 211210 228123 217411 204697 205704 190221 175355 168515
13883 168515 131666 162204 160754 151394 147832 101348 45953 48522 57351 67035 102850 104085 96531
13870 96531 106231 118122 141831 162838 153395 140421 114650 94704 73547 86707 96955 116219
13858 116219 151245 107274 88756 76848 89785 93950 85421 70619 31232 12934 -3337 35047
13846 35047 56991 46492 52476 50683 44544 65959 56406 81746 96566 64334 87557 86685 73579
13833 73579 16841 7680 11557 63454 137489 155253 156129 152407 117469 118469 132410 148289 143172
13820 143172 132235 102543 125790 147000 167636 180552 164837 124005 98730 111721 130275
13809 130275 141998 127288 99088 133284 138817 110412 94927 105594 114951 107254 77548 62349
13797 62349 102574 93482 105393 126267 122386 106304 73936 46938 90460 94949 91222 114046
13785 114046 117230 113115 150912 149660 131893 103569 92641 109261 89920 42021 31229 20506
13773 20506 43133 31587 46596 41848 12840 5219 6364 41293 43207 63330 51464 64927
13761 64927 72291 94883 102815 101179 77953 56779 76309 89615 108891 85866 55532 58743
13749 58743 56745 53063 64499 106360 98397 94064 109808 94681 67528 57222 52903 71862 93298
13736 93298 72642 65446 71074 105700 110705 88579 62768 38713 62630 90607 75124 47389
13724 47389 24965 43626 24171 48547 49148 40620 66993 101467 99409 80504 66588 90309
13712 90309 80258 58478 61188 67118 86121 80915 67435 94761 94613 83555 102687 93684 100119
13699 100119 91674 99646 97397 59790 42364 66718 76132 97135 80284 66313 47750 37752
13687 37752 14024 53411 98763 120154 88805 90995 119696 115804 109438 89970 109905 93988
13675 93988 69453 53452 84637 123445 90532 57893 54766 58042 86138 65393 87226 124867
13663 124867 139339 169832 170890 192477 167809 137735 126480 138989 149672 164870 174936 198333
13651 198333 197030 141486 106107 123804 162848 173454 161091 169257 182736 103904 74431 80674
13639 80674 93247 107686 103272 104444 116922 123538 136256 146135 147404 126281 146354 165496 119706
13626 119706 77577 67184 82641 125672 104810 80083 111795 150254 167653 137002 121651
13615 121651 131028 158871 177182 172930 154504 152103 141433 134430 150070 138087 124382 120928
13603 120928 126397 117931 95126 100081 122812 123415 120564 107863 125997 120658 126901 142155 119139
13590 119139 108439 135290 158226 134201 112774 101521 109960 127870 97369 89963 103543 87114
13578 87114 100703 110501 67819 68331 69537 109239 142340 171446 170305 113913 78854 107092 153997
13565 153997 200450 180165 154703 153861 152539 134483 138042 167825 181383 212510 245208 224668
13553 224668 158459 127494 120621 156937 191757 225581 247600 237647 213992 209396 219506 231673
13541 231673 231457 230787 236157 238122 280580 295325 292875 276815 224596 210019 220473 209434 218393
13528 218393 216309 201551 229255 233644 224357 269393 296132 295701 287661 287445 290601 253474 269702
13515 269702 286315 281743 265725 211769 192109 220401 255241 277754 300653 317287 299729 267881
13503 267881 259350 258936 284139 298176 335335 303629 273355 277983 297358 330744 353446 351716
13491 351716 344748 352268 364452 319908 296804 297275 266866 259863 254287 246320 226095 252598 279851
13478 279851 299300 353396 393861 387515 353636 330766 348462 354112 328858 295855 318050 373779
13466 373779 374362 355510 315980 303467 328821 326543 364483 403764 382925 355005 339717 341361
13454 341361 363878 392845 376306 381546 405031 413690 455518 480854 465529 456564 470539 464686
13442 464686 483913 486813 490839 488449 506612 487537 497984 531079 543641 556330 581792 604057
13430 604057 600764 597651 629758 640366 657583 666092 688895 691496 681097 630977 623348 653186
13418 653186 645057 641326 674147 712895 699430 693330 715544 729726 737210 714046 724136 724985 694887
13405 694887 750465 801985 816810 819098 813592 808712 817873 793585 820663 868612 899093 880163
13393 880163 888448 908969 951921 945037 933543 936715 912208 902051 916810 924775 965818 976087
13381 976087 997604 1024809 1078488 1090983 1093480 1120915 1121292 1136315 1129001 1141351 1143453 1147460 1129262
13368 1129262 1142159 1143224 1174122 1201907 1213983 1254018 1264316 1269343 1299881 1316816 1321054 1325525
13356 1325525 1346700 1371420 1383530 1386893 1377025 1396635 1421934 1448494 1487681 1530254 1533478 1562251
13344 1562251 1540104 1527433 1556497 1591559 1617792 1623056 1666178 1708213 1733123 1729074 1770623 1793477
13332 1793477 1778576 1810912 1839693 1887510 1927971 1948961 1932567 1924741 1950237 1955634 1939236 1937634
13320 1937634 1931153 1942201 1978949 1968661 1963280 2010151 2045912 2039122 2058692 2079510 2079719 2051386
13308 2051386 2034758 2044347 2080571 2081038 2066322 2073553 2078547 2110263 2106528 2093303 2082249 2071683
13296 2071683 2110587 2117484 2133512 2149189 2148916 2148360 2151932 2139026 2154157 2185918 2166957 2165560 2185742
13283 2185742 2188590 2201536 2196105 2236523 2232600 2257970 2260031 2246373 2250789 2262719 2250072 2274781
13271 2274781 2300493 2288818 2284313 2297094 2295306 2326679 2351345 2343930 2369081 2385739 2358312 2322822
13259 2322822 2311251 2303571 2333685 2349228 2318977 2295334 2313477 2294173 2269322 2289998 2308745
13248 2308745 2333428 2315534 2298952 2255901 2278663 2303699 2307796 2315668 2336441 2335732 2336796 2314152
13236 2314152 2305573 2323444 2347829 2354268 2314078 2310668 2327811 2352244 2369776 2356845 2377611 2411785
13224 2411785 2389447 2379355 2397084 2376733 2402885 2389255 2364646 2352076 2339602 2352833 2362476
13213 2362476 2342307 2360054 2369181 2372006 2390022 2349202 2353947 2386274 2352559 2348119 2337076 2309422
13201 2309422 2314738 2318696 2341878 2370757 2451363 2500064 2489841 2483998 2511131 2514029 2512455 2558413
13189 2558413 2570314 2557019 2530999 2510382 2544249 2557403 2585428 2554451 2511804 2539398 2541091
13178 2541091 2565555 2561030 2583068 2617606 2660781 2663491 2711150 2740429 2766675 2767893 2787215 2822362
13166 2822362 2858691 2868845 2862658 2875038 2903554 2946641 3009067 3067280 3089287 3147860 3193890
13155 3193890 3288676 3360247 3393940 3456319 3513246 3575176 3628371 3641857 3700905 3766370 3797571
13144 3797571 3861551 3894700 3940539 4027333 4099200 4184319 4321830 4476687 4602753 4713151
13134 4713151 4806155 4917058 5022558 5155019 5285155 5413927 5579664 5779569 5992027 6181327
13124 6181327 6386338 6600073 6852495 7043821 7254555 7469605 7772905 8046428 8301519
13115 8301519 8568926 8855495 9170147 9520947 9898048 10264374 10654345 11033548 11404388
13106 11404388 11790786 12137960 12531174 12930241 13332924 13719556 14086580 14449480 14809378
13097 14809378 15149514 15493771 15865608 16236026 16600742 16949531 17261402 17552160 17864527
13088 17864527 18174229 18468538 18755096 19057191 19381278 19721833 20066204 20438588 20769408
13079 20769408 21078085 21366231 21682686 22043012 22348613 22612237 22841022 23043648 23268914
13070 23268914 23487659 23595071 23667778 23748794 23777702 23793894 23819053 23790944 23719347 23608319
13060 23608319 23464618 23304030 23153406 22997211 22789184 22575112 22409093 22232313 22043955
13051 22043955 21917623 21765597 21625844 21500876 21328016 21173630 21078388 20928616 20774910
13042 20774910 20646945 20521117 20372120 20251644 20136340 20047662 19927170 19783652 19674022
13033 19674022 19588075 19516873 19402736 19317545 19248046 19184343 19195273 19207236 19237022 19288462 19299684
13022 19299684 19339179 19426388 19555047 19666416 19766940 19896754 20046027 20195176 20298721 20472369
13012 20472369 20651937 20824640 21009116 21157040 21321968 21511126 21682363 21863196 22048937
13003 22048937 22203397 22327714 22467382 22693981 22943497 23118462 23313942 23578615 23788358
12994 23788358 23978437 24192686 24425010 24620978 24839244 25034089 25136803 25224882 25309740 25420984
12984 25420984 25422106 25375604 25374051 25345861 25265169 25130888 24937270 24693319 24471502 24190716
12974 24190716 23883920 23588814 23283098 22961712 22610827 22275154 21968477 21635167 21340301
12965 21340301 21032417 20688772 20341087 20012782 19617601 19275594 18956094 18632310 18249418
12956 18249418 17852523 17471019 17064411 16660684 16244179 15834262 15401702 14973414 14523323
12947 14523323 14092416 13677438 13236455 12800365 12376815 11972171 11557248 11131028 10735764
12938 10735764 10372569 10015725 9640742 9324583 8976960 8600701 8241532 7967294 7706994
12929 7706994 7428578 7192960 6928530 6701077 6507923 6259975 6035470 5868971 5679791
12920 5679791 5494560 5337136 5177585 5033215 4876901 4716955 4562340 4399737 4248491
12911 4248491 4139339 4024564 3930033 3824882 3726534 3639709 3540437 3433317 3347315 3250000
12901 3250000 3166757 3088994 2986537 2919642 2885738 2814324 2715928 2673475 2616119 2553464 2493787
12890 2493787 2434902 2379840 2317390 2267916 2214127 2193204 2133188 2086525 2020569 1976218 1967952
12879 1967952 1949805 1940419 1898108 1878049 1870738 1811977 1761624 1711085 1681188 1640839 1605558 1569937
12867 1569937 1546443 1534406 1510315 1479659 1478192 1477558 1438580 1408190 1404908 1389943 1371899 1358380
12855 1358380 1319193 1292736 1297098 1273986 1254286 1252617 1214843 1195634 1177467 1198773 1200488 1159492
12843 1159492 1188733 1204917 1213356 1195837 1146751 1119169 1082682 1041403 1048577 1087707 1057601 1056696
12831 1056696 1016885 982655 948994 921022 909628 888888 839463 837036 822823 841134 855763
12820 855763 848703 829051 834807 845634 850389 848952 846136 806067 786589 764479 746570 755831 760264
12807 760264 741533 752339 720244 659127 686359 684697 687534 699947 658913 661579 642840 628056
12795 628056 627777 650410 648991 648471 644516 627212 620570 625874 648582 657285 673611 660195 642419
12782 642419 616710 584524 583291 560443 555703 594473 588897 572876 569141 553796 538767 526539
12770 526539 512945 510222 484256 471255 501913 496495 484698 506499 508739 492337 477028 459414
12758 459414 440081 483704 500552 494836 533586 495402 463457 465492 498359 505939 511090 511517 506699
12745 506699 500684 477673 478017 465770 451755 449037 438472 447915 413324 443883 456086 444399
12733 444399 450343 486735 457361 441205 474285 500127 497730 513214 486680 481765 485801 460224
12721 460224 420773 418741 423851 389620 398476 401817 415184 433920 418725 390563 391978 386317 364865
12708 364865 362943 392100 436109 467442 450868 442897 433535 417423 410792 378464 365841 359731
12696 359731 362784 374535 376045 390425 403068 426983 421054 425260 457985 440752 400900 438896
12684 438896 466240 474927 474436 487502 514575 560712 594955 618778 668745 747298 793071 832776
12672 832776 894033 1014529 1168663 1318219 1458000 1611733 1839212 2046463 2273252 2521873
12662 2521873 2740306 2899717 2968785 2979788 2877926 2665646 2453638 2275697 2071319 1882096
12652 1882096 1726939 1579835 1446381 1343869 1266829 1219978 1183554 1153119 1156940 1140623 1140771
12641 1140771 1150080 1188840 1216429 1278429 1355484 1454057 1522684 1665797 1779457 1938777 2145137
12630 2145137 2357451 2616683 2891561 3207941 3598617 3984629 4328048 4618337 4865477
12621 4865477 5045945 5104647 5044092 4844492 4573753 4258907 3879120 3541069 3241182 2920073
12611 2920073 2639996 2404369 2223907 1996230 1825982 1707581 1585802 1497790 1422536 1387271
12601 1387271 1351614 1317830 1274643 1243059 1193561 1181390 1228483 1273475 1309264 1376209 1472029
12590 1472029 1609081 1772614 1951466 2144992 2342626 2580979 2791806 2954927 3087526
12581 3087526 3160372 3194318 3124864 2991886 2773474 2524542 2290629 2031844 1813591 1630210
12571 1630210 1452148 1277580 1132138 1018719 931912 892255 867407 829562 774121 761866
12561 761866 760529 700603 662954 645118 665856 649608 567980 493894 481246 476689 440906 454470
12549 454470 465488 492113 512556 487566 475864 479454 448289 434551 463785 478586 455567 461233
12537 461233 470924 442750 426354 448947 457012 445913 415090 426199 441153 460231 431119 402067
12525 402067 433933 486502 512004 493163 512244 494827 473052 465571 480795 439472 419220 459835
12513 459835 492566 485765 462668 468897 465873 444735 403587 399056 378678 376352 394863 372068
12501 372068 325384 274230 255982 253745 273796 309299 292764 240164 245285 277746 272083 265815
12489 265815 250884 249712 231810 230115 208109 189912 180858 174830 196554 193378 215014 246157
12477 246157 262812 285568 280327 295497 271470 241742 236687 249102 270687 264325 279996 257905
12465 257905 234817 205016 215362 226708 250735 268473 268065 268796 264132 225254 183485 160522
12453 160522 137841 117306 135793 182316 197756 189106 177340 199873 221889 288264 303631 271958
12441 271958 262519 259859 261956 264247 237723 216934 235296 231105 238515 215284 209353 228519 227049
12428 227049 236794 279526 269795 227902 225491 246899 241435 194776 236464 277322 260294 275324
12416 275324 262028 274810 297218 284461 268298 243570 225686 242257 286221 293851 258029 310462
12404 310462 364225 396112 440497 486264 512110 471648 401700 351911 351621 331156 291002 268533
12392 268533 249471 229623 183347 161746 185034 199753 209060 161813 155521 155821 128777 133379
12380 133379 193138 271943 255589 215037 212387 198461 208979 227139 252318 242918 229607 206589
12368 206589 208498 224831 222990 240012 259154 276814 291845 285208 321590 326630 313929 306002
12356 306002 319120 312918 311977 314966 266668 239762 232424 219389 236599 260340 286080 296977
12344 296977 310518 340324 347551 355872 347836 354618 347102 333623 360963 344004 346698 345853 369870
12331 369870 375115 358444 374761 369175 348237 370364 362096 332453 331684 355931 391545 398916 353966
12318 353966 346412 325155 325254 289518 250309 258995 253833 283427 315607 289928 206457 143052 125632
12305 125632 130680 152547 161925 153253 175318 196970 218482 227899 233042 215734 210336 217679 207033
12292 207033 191850 199122 201088 193713 171348 175445 152047 162493 191082 201187 214105 215820
12280 215820 183284 174299 172647 196559 211717 199787 175653 186161 232204 210448 173264 155055
12268 155055 150890 168094 176949 194081 195191 171382 224693 227797 223108 258629 262195 234216 234839
12255 234839 233790 219153 202123 193184 203440 188800 177422 115146 124695 140689 164464 170561
12243 170561 125409 130655 194692 237803 230266 205117 179517 165312 137530 145635 173504 139420
12231 139420 141058 181341 202929 200180 201715 204990 187760 187473 185305 164081 188155 206661 180001
12218 180001 200713 215264 198330 184234 201206 188520 190858 194869 174942 148667 124632 100625
12206 100625 117040 155832 152852 120716 129097 122531 151139 154955 121709 108259 103105 95864 102786
12193 102786 137556 161430 139534 145074 178323 186134 179185 161660 136575 93783 76711 141168
12181 141168 202370 210823 217907 257489 292608 323022 326823 354816 378332 398198 440858 505637
12169 505637 562682 651814 724982 782995 791161 774833 769071 743957 692480 631501 531443 466969
12157 466969 464559 449637 432596 433234 447811 389663 343638 337785 351030 383806 381236 348789
12145 348789 335227 318781 290565 319034 340500 381832 424251 463174 473649 492339 475672
12134 475672 475172 513667 580872 652746 709499 779368 866914 932403 953895 947874 915761 864900
12122 864900 822950 765358 714782 657214 627821 561255 535101 493111 462813 447675 447345 442213
12110 442213 421768 405477 411513 421681 463590 490396 505054 498463 481120 519651 535194 575333
12098 575333 600905 603140 581076 570318 563860 556273 542104 532027 512759 552402 572420 566105
12086 566105 517369 540294 610817 632173 604123 605396 609406 589932 592074 556919 545033 548956
12074 548956 543860 584818 604829 614290 595223 619297 635638 614826 637766 664711 726737 736329
12062 736329 685699 674280 672392 686543 686725 647614 563268 504386 524677 574502 644458 668172
12050 668172 622681 637216 661337 678953 678162 707629 708851 706677 714042 648742 628241 618869 585162
12037 585162 540979 523674 520135 510592 476768 439859 387829 371422 400159 416835 409278 401561
12025 401561 383927 376877 349199 328647 327908 368602 381727 349996 319528 304707 289161 247341
12013 247341 248144 257740 278309 285227 267195 237254 221354 215176 205889 218682 225196 201570 180551
12000 180551 186689 215859 243094 240596 224171 222233 227525 270849 257110 228464 211053 202596
11988 202596 207291 234915 262219 285441 299242 300717 292634 266254 252797 226589 237252 269826
11976 269826 232069 178689 194299 188876 157331 198066 215624 221987 215298 226423 242397 244727
11964 244727 253988 224470 232813 239858 195095 172559 183593 188222 154880 168605 189533 192945
11952 192945 227161 220803 235980 216031 212347 179844 149366 180790 223672 195073 185451 221195
11940 221195 236844 242773 217819 197812 173728 160400 161688 202496 213912 216406 195045 190194
11928 190194 232893 287425 304817 323727 307795 288638 255435 252173 278143 274083 285989 271186
11916 271186 302658 307509 334073 350673 317151 312444 313602 297992 299873 307131 313271 313293 333785
11903 333785 316547 315281 323744 290194 305364 289833 276285 260288 269203 282052 280409 291865
11891 291865 317111 332195 327429 315552 331113 325450 341230 313210 272554 278866 249477 271093
11879 271093 287113 263047 231838 232727 276046 286323 250329 233684 245940 249778 240110 268497
11867 268497 287899 270016 228857 222187 221940 223597 240863 239296 209551 210958 234896 258814 277440
11854 277440 279325 290414 298155 280962 269219 305482 334755 334200 355970 339497 336650 362427
11842 362427 363898 351935 364140 380907 326830 316238 351128 368482 375717 374046 401226 389944
11830 389944 403689 407970 393626 386915 402439 417434 407955 382667 358707 359718 350600 353711 347407
11817 347407 368338 387525 365717 381641 379296 375504 371357 344824 324762 340292 329708 300786
11805 300786 320724 348459 341363 327365 329644 315086 287692 305690 304906 300472 255415 257369 248697
11792 248697 226029 252600 305851 311158 309952 297108 323805 336143 313357 284364 306283 315993
11780 315993 302284 290372 285015 288069 309080 324916 340195 287028 256306 284711 314316 333935
11768 333935 320070 299097 343606 357770 316980 296024 284814 282802 302174 312833 308017 311306
11756 311306 284298 238317 232831 283249 325383 322452 289677 298710 292236 276946 259888 288184
11744 288184 322738 289063 257433 265993 282969 272700 263605 318880 375872 386056 384632 418202
11732 418202 411641 389053 360318 321514 298120 289642 274032 251468 270794 268578 229997 209258
11720 209258 231676 265879 243396 272714 253951 226914 196325 202830 200988 173149 158013 163130
11708 163130 158570 197328 219665 237166 253145 249032 245143 221241 182119 152241 180883 207780
11696 207780 227970 238587 195334 161037 168831 219464 243948 245671 229423 187535 169282 140778
11684 140778 123702 164900 220255 219520 234297 264312 271187 291063 280605 217888 184221 169769
11672 169769 175703 219276 238596 228230 225548 235746 214490 192240 229034 246178 252845 288602
11660 288602 262205 247949 236750 247018 201786 229877 259222 266674 263394 244920 243962 249325
11648 249325 220822 180888 159292 169468 181802 177111 160855 173319 175894 163166 201814 222647
11636 222647 225239 204346 229256 256038 258338 262023 250959 236832 216611 210681 229006 211506
11624 211506 215670 196401 221663 239989 229004 245095 253448 237686 235014 233448 244575 266007
11612 266007 310275 329160 293964 302643 315764 314364 312583 274997 246524 220321 249709 267553
11600 267553 295312 315619 277606 212353 206399 214222 249065 264493 283072 309017 291950 274564
11588 274564 294617 310804 336542 363037 358273 373193 372910 365271 339329 334923 336033 344564 371467
11575 371467 391674 389815 415220 448267 424067 381924 387200 374655 350121 345168 374337 388508
11563 388508 400047 450767 489448 494858 513040 517362 508637 498556 484224 511956 534857 538683
11551 538683 543505 559036 578643 535328 537571 536742 568191 615952 622968 612986 591828 620896 669317
11538 669317 711282 752969 745733 776810 799312 849681 903447 916444 925510 990344 1005827 1009921
11526 1009921 1030000 1080646 1132434 1179593 1213023 1237358 1296797 1332312 1400907 1485308 1555178
11515 1555178 1630593 1696050 1790029 1891346 1983192 2065358 2169220 2298776 2484647 2692501
11505 2692501 2863680 3015975 3213047 3420679 3648460 3955483 4326667 4746424 5176524
11496 5176524 5647263 6156325 6759671 7438968 8203672 9061245 10045591 11179399 12374460
11487 12374460 13693542 15084224 16490647 17888513 19215784 20333317 21120296 21543155
11479 21543155 21656762 21477837 21023042 20381592 19721193 19107677 18600144 18263658 18080454
11470 18080454 18044302 18175055 18531709 19090459 19819872 20699174 21595593 22401916 23046794
11461 23046794 23460286 23549683 23222100 22515998 21489624 20269063 18902870 17484259 16128009
11452 16128009 14798643 13561900 12456952 11529661 10714795 9977724 9337804 8819522 8408588
11443 8408588 8051665 7718377 7422928 7176572 7011187 6947407 6941024 6940878 6976316 7088208 7262072
11432 7262072 7465581 7677557 7956716 8298869 8702715 9207259 9774844 10451423 11234705
11423 11234705 12086844 13130931 14297876 15608401 17098192 18687486 20378576 22172166
11415 22172166 23902295 25502842 26840447 27880432 28530016 28856676 28943844 28905935 28808020
11406 28808020 28700986 28756154 29046672 29640503 30544602 31721595 33198442 34903074 36756062
11397 36756062 38608629 40295046 41715410 42745687 43213835 43094320 42386969 41177115
11389 41177115 39620189 37822985 35977302 34161950 32453253 30974843 29747122 28843435
11381 28843435 28208463 27841444 27704942 27665678 27636719 27524042 27242520 26705371 25794024 24578711
11371 24578711 23168019 21642981 20124138 18546082 17044919 15675324 14484539 13399416
11363 13399416 12432849 11542018 10787604 10146970 9589968 9115116 8688153 8336130 8016512
11354 8016512 7730899 7502612 7342768 7237363 7197012 7161717 7156766 7186423 7295432 7479115
11344 7479115 7685668 7942909 8253321 8610931 9050988 9570188 10204257 10926352 11737300
11335 11737300 12702112 13825416 15066502 16422029 17837262 19291342 20693109 21867563
11327 21867563 22723698 23171298 23235456 22963860 22406361 21616575 20734559 19904565 19208193
11318 19208193 18627653 18175137 17925475 17918208 18128091 18555370 19102366 19733447 20467179 21165673
11308 21165673 21778965 22158839 22205229 21930660 21299772 20362130 19177901 17872749 16521091
11299 16521091 15138848 13791479 12514951 11350217 10360123 9521158 8759230 8078800 7475439
11290 7475439 6908078 6420301 6005643 5648764 5287609 4989572 4705452 4431713 4206271
11281 4206271 4019548 3816224 3625331 3513836 3397153 3273928 3180163 3080391 2936376 2801274
11271 2801274 2708246 2633245 2542239 2474505 2393439 2332629 2276951 2203585 2126013 2066003 2012811
11260 2012811 1968854 1922089 1867158 1820729 1765291 1695024 1688810 1687097 1678919 1635687 1607332 1589223
11248 1589223 1543872 1522803 1527871 1524242 1468929 1438438 1396791 1388393 1374044 1384546 1364634 1307597
11236 1307597 1300599 1291019 1250233 1227661 1233944 1247223 1243750 1248725 1272329 1271806 1269758 1244820 1239440
11223 1239440 1205292 1190035 1190073 1208886 1248974 1215013 1182719 1181216 1167769 1177853 1191211 1196590
11211 1196590 1206416 1182417 1136688 1118974 1144905 1130946 1126438 1116720 1106162 1114178 1114173 1095593 1057975
11198 1057975 1071278 1120215 1122490 1107142 1074561 1091727 1090301 1071277 1032322 1000471 968705 927540
11186 927540 911663 883840 850072 888060 890847 860336 863925 853547 861795 862427 807817 839307
11174 839307 868945 918185 902726 865702 874417 927873 893209 852640 831262 874819 857030 856063
11162 856063 857811 831202 835801 857578 853337 822989 855306 865406 867293 879494 900639 888224
11150 888224 837356 805192 829733 824407 806265 781058 790202 803842 820560 808331 825338 821707
11138 821707 815739 823833 827698 813269 765656 754864 778891 801892 819354 810724 835646 824194
11126 824194 805267 795201 788107 782775 815811 846622 826293 798806 788409 814994 847025 820557
11114 820557 767341 755425 779472 803424 808863 779856 771320 798062 812949 823551 839317 827707
11102 827707 788598 831677 875371 915383 896792 867339 880112 875303 913531 920723 882422 877614
11090 877614 887340 892472 887094 862963 856082 840783 865641 941150 964271 956173 994240 1039516
11078 1039516 1061066 1059882 1017090 1008487 1032032 1028864 1058873 1088184 1091772 1062432 1066726 1105111
11066 1105111 1127017 1133144 1112032 1130981 1128891 1139678 1156295 1156030 1140876 1151651 1162919 1163458
11054 1163458 1197343 1198562 1220245 1242579 1270762 1300054 1338573 1300527 1321911 1369629 1423699
11043 1423699 1478167 1452696 1435594 1465300 1480035 1471732 1460492 1455413 1475295 1493212 1509770 1525968
11031 1525968 1553949 1570290 1597071 1642557 1641004 1631310 1625310 1625369 1647226 1715043 1757442 1741332
11019 1741332 1751938 1698435 1690866 1707837 1724911 1762872 1785436 1778851 1780860 1753155 1726423 1738113
11007 1738113 1739796 1753390 1738588 1719277 1756757 1784519 1803380 1829525 1840458 1828784 1819775 1828204
10995 1828204 1859407 1882170 1878039 1837402 1825771 1831501 1863788 1895564 1884723 1864460 1859279 1848049
10983 1848049 1905995 1940124 1943357 1976182 1994544 1975300 2000842 2017297 2028027 2042033 2079732
10972 2079732 2050642 2035158 2046261 2050973 2081334 2116162 2100965 2132670 2178308 2193120 2165701
10961 2165701 2144739 2177401 2271645 2272387 2244743 2270972 2315083 2304985 2282588 2299963 2329258 2353920
10949 2353920 2354335 2354774 2374810 2356996 2357592 2353007 2342798 2317558 2303797 2294099 2331112 2362386 2386139
10936 2386139 2353555 2361301 2383985 2341749 2336947 2379143 2371922 2322418 2334991 2331914 2354824 2338566
10924 2338566 2301012 2282009 2264834 2272558 2279484 2263104 2263449 2272037 2235061 2210144 2217065 2232161
10912 2232161 2191204 2171471 2178214 2180211 2164945 2163462 2170898 2149633 2147089 2138648 2124984 2115669 2099549
10899 2099549 2098457 2095344 2101149 2122261 2111098 2088393 2080442 2070872 2100845 2115649 2049063 2054834
10887 2054834 2077751 2071952 2057415 2062678 2068100 2076208 2099784 2085989 2046088 2020006 2052980 2030914
10875 2030914 2003243 2008248 2000100 1970782 1970095 1927592 1896581 1895005 1903815 1876683 1854448 1844385
10863 1844385 1841478 1851651 1862109 1893446 1867224 1863907 1893250 1870648 1857465 1813542 1754839 1731174
10851 1731174 1708549 1660800 1637010 1609398 1600313 1634431 1620561 1590263 1536708 1488826 1480654 1521510
10839 1521510 1524329 1491526 1498024 1518855 1520107 1504115 1481777 1466667 1490501 1463953 1418713 1395521
10827 1395521 1391552 1396400 1355544 1313056 1288785 1305087 1293022 1285071 1299659 1306540 1287378 1270507
10815 1270507 1291520 1280108 1273296 1315901 1323909 1298212 1229336 1199273 1187092 1209126 1183094 1126844
10803 1126844 1102074 1092518 1081850 1030350 997002 1015406 1032353 1064897 1084901 1053958 1046931 1064461
10791 1064461 1051152 1008333 991912 937129 964754 967413 903793 833854 808344 796095 805696 776025
10779 776025 723600 719897 698187 688691 683983 651318 637180 672222 740994 771417 737764 688091
10767 688091 674046 682271 725211 698645 671709 671215 662920 677420 670983 660800 646414 592964
10755 592964 557369 592113 620353 592480 558505 550987 560643 546585 505898 548433 576883 572116
10743 572116 530637 561820 543757 534378 516802 500292 509403 515701 505837 467819 445181 465198
10731 465198 457023 458211 471216 444471 454782 460513 471305 464551 450550 425382 408688 409116 381102
10718 381102 371067 399905 425345 422830 408006 417463 428250 410231 415793 413600 398333 380287
10706 380287 404385 429165 418722 396480 393513 383810 394441 390410 408718 435059 420574 417026
10694 417026 432407 447094 428443 422608 426427 403269 380792 378685 380400 364534 357581 327840
10682 327840 345590 364664 390332 401005 417848 404226 382422 393232 376700 345358 357073
10671 357073 391211 401903 398524 456747 470998 482582 510946 529060 522369 553409 595908 617421
10659 617421 599214 612265 589876 615170 621007 616188 573134 548282 534842 479043 441991 443263
10647 443263 430621 421085 444998 427950 416960 467849 475542 487655 494329 507016 532201 517307
10635 517307 527801 528939 565381 579820 544990 476795 441791 448298 461843 451019 484253 515653
10623 515653 524080 533937 512123 493843 463450 462001 452511 443814 461747 489349 516219 511156 513263
10610 513263 484116 454850 450385 434266 419366 435049 452234 452727 466408 499985 525663 567719
10598 567719 591062 609989 604031 642061 632061 681070 732611 737406 719413 651188 648395 658515
10586 658515 648564 624747 585466 577407 628626 680167 704744 754601 837258 888310 976582 1021612
10574 1021612 1111305 1224496 1312579 1444875 1583843 1666926 1806822 2008723 2271391 2587287
10564 2587287 3028864 3587082 4201728 4861466 5472577 5943321 6265909 6485145 6688706
10555 6688706 6844205 6915175 6848163 6641845 6297757 5893697 5440478 5093182 4866179 4721042
10545 4721042 4645414 4638695 4715832 4882719 5186515 5686331 6369667 7289836 8509256 9925291
10535 9925291 11291670 12408123 13171506 13631251 13856454 14044951 14162251 14070269 13617547
10526 13617547 12808753 11656850 10366010 9099922 7943087 6983482 6225607 5679265 5352415
10517 5352415 5172141 5104954 5238005 5484776 5848461 6471264 7248382 8105126 8951064 9652054
10507 9652054 10184279 10611305 10981956 11341073 11676374 11876210 11938203 11885322 11790125 11820305
10497 11820305 12185437 12868193 13787643 14751003 15502828 15935599 16120172 16233516 16329137
10488 16329137 16335421 16121678 15519157 14597146 13424879 12119293 10853200 9746700 8903642
10479 8903642 8330622 8020479 7987034 8151686 8597176 9310992 10495407 12244204 14617848
10470 14617848 17563395 20711895 23604027 25755981 27113397 27956875 28583153 29006982
10462 29006982 29099094 28567191 27169901 25012306 22347887 19420354 16608855 14107336
10454 14107336 12040877 10426700 9285335 8568412 8197342 8026706 8093749 8453757 9196124
10445 9196124 10298457 11633738 13080111 14377628 15298863 15806965 16099384 16301413 16461377
10436 16461377 16463740 16145645 15406389 14352111 13203358 12110988 11297711 10829204 10591563
10427 10591563 10478143 10378717 10229027 10056752 9951743 9824467 9667484 9383515 8905913
10418 8905913 8229594 7411046 6602178 5857996 5204089 4717793 4453573 4376676 4387402 4539797
10408 4539797 4835422 5303469 6043682 7114816 8583013 10312807 11994317 13430290 14383769
10399 14383769 14964394 15324580 15571856 15709126 15594752 15087186 14094881 12704057 11098136
10390 11098136 9480633 7976001 6661489 5661135 4941547 4434068 4140323 4004570 4016733
10381 4016733 4164257 4440881 4915319 5593914 6382464 7132735 7727816 8101681 8350229
10372 8350229 8479541 8566491 8532703 8376591 7983664 7391046 6638723 5745189 4838673 4025504
10362 4025504 3339570 2782515 2391552 2032826 1745660 1555893 1382883 1265942 1150431
10353 1150431 1089340 1027142 955563 881977 853068 837158 836882 816658 773375 768398 734967 668824
10341 668824 621977 578921 538916 518171 576001 579174 537783 479682 476870 495380 512488 516217
10329 516217 479242 465139 470600 487149 512127 498264 491451 487795 495179 470372 477492 475153 517085
10316 517085 483852 451586 408267 370278 332681 330156 339252 379998 385893 386398 409722 433543
10304 433543 417670 393681 410287 427347 428908 401242 358767 314471 312376 292265 269549 256474
10292 256474 263744 276477 315512 373279 389859 341201 333714 321555 346368 383429 379444 383859
10280 383859 377878 366235 340496 344512 309830 290373 322251 359233 361103 319011 267149 261258
10268 261258 250982 224531 231279 255677 281953 299685 275379 254016 249070 232023 287702 338236
10256 338236 356023 324613 313963 300417 264189 221366 200363 208767 246159 280719 295558 266989
10244 266989 287540 285128 270444 245544 260807 303757 274909 247125 234552 267310 283430 290340
10232 290340 274354 315775 327524 306951 346067 393523 383158 379488 393030 354484 279295 243061
10220 243061 263235 245276 306859 333367 316034 319559 293733 297284 302018 285237 280048 327911
10208 327911 318851 316022 296971 292539 307790 300019 321289 327853 304795 290657 320257 307956
10196 307956 301932 286291 281946 339092 346310 344232 355764 366682 358342 337467 333888 343319 359493
10183 359493 360106 333524 320268 326029 334912 346042 351083 365290 353994 295595 295688 345551 328477
10170 328477 339140 364056 367969 333081 340091 354565 343345 334703 337221 360254 373639 409291
10158 409291 403694 371493 337097 323151 328220 312708 331088 369395 360268 369345 356899 356319 378212
10145 378212 404251 408032 389025 392018 334008 321849 339439 347279 381582 397754 436388 446113
10133 446113 450140 482536 499285 476476 437078 465018 506337 489168 476272 475302 460417 471477
10121 471477 493309 472357 475155 502491 483811 494532 502454 491891 487980 489602 524953 549946
10109 549946 560393 551716 509453 493381 498863 542918 537858 517696 495712 495357 547263 558338
10097 558338 569061 538923 536166 565274 563882 562974 584984 585757 596785 573305 587505 584185 623967
10084 623967 635023 660090 620584 575780 572694 591641 604559 600400 569207 522628 510555 504288
10072 504288 522005 498412 524271 550101 523324 528640 529287 565536 606521 634636 618135 548279
10060 548279 537706 527493 545658 529808 518381 498914 490705 515317 499143 453979 421177 422958
10048 422958 434511 441515 453288 519998 569992 539065 523572 504325 495439 509683 514477 496155
10036 496155 506747 505834 512032 485626 482374 453450 427164 402788 382639 413142 441954 446763
10024 446763 435732 443483 476729 473638 449805 440974 429286 380699 377945 399543 403388 394182 377941
10011 377941 381300 376703 359250 369798 359080 367598 390023 399558 428398 439528 435665 424691
9999 424691 428926 421486 447097 502444 478262 445648 436621 463471 451734 442131 429959 393884
9987 393884 371762 320464 266051 246822 279163 296328 322879 354696 362951 369710 347876 353346
9975 353346 357941 386839 361409 359344 365600 329269 325813 329201 309868 329089 285784 271488 309174
9962 309174 343060 364529 347508 308786 303809 293064 270872 266263 277543 283823 283199 281731 273882
9949 273882 229185 259643 275170 259270 265233 278353 269397 301077 291610 252592 253943 261001 228716
9936 228716 233919 257651 299655 329526 313173 307840 305235 266971 247168 239923 236363 248624 245279
9923 245279 233012 235730 234372 256233 286625 318835 346705 324281 314350 308787 325895 301675
9911 301675 273986 259442 262766 289395 318926 273162 266489 283942 305491 360117 380321 383748
9899 383748 380431 393492 438766 444838 476634 511358 522825 551091 520083 453171 447901 414107
9887 414107 377656 392616 431600 427227 400660 418966 447553 450109 429772 411049 403071 401422
9875 401422 367509 341535 366283 384662 362803 384598 398705 408415 443380 443335 439713 435643 451733
9862 451733 471707 440544 439393 431636 448394 471860 475462 485041 491792 472792 486150 510890 519003
9849 519003 556983 638794 699328 760285 837817 975579 1054348 1040724 997390 915707 822729
9838 822729 745732 737442 692281 677465 656095 666355 665838 708117 756188 762640 761208 750462 769400
9825 769400 771671 788624 822130 834153 806476 803232 825592 844152 848736 897516 912052 920313
9813 920313 936476 959158 991349 1015227 1010722 1018136 1021492 1025176 1060566 1092167 1124953 1101143
9801 1101143 1128324 1209396 1223062 1261269 1286512 1265027 1288053 1346295 1364932 1357080 1385178 1404428
9789 1404428 1477396 1558286 1571219 1627254 1695726 1731228 1715568 1702796 1736953 1754737 1818241
9778 1818241 1892928 1924800 1976458 2001390 2035724 2118767 2159232 2197944 2275498 2297444 2318286
9767 2318286 2398279 2460610 2499666 2537524 2670553 2759472 2848944 2960840 3039044 3110567 3206913
9756 3206913 3301742 3373587 3481085 3589466 3736572 3889292 4009579 4132440 4269216 4424435
9746 4424435 4591682 4780272 4995128 5180302 5359472 5515840 5719716 5958794 6180859 6398774
9736 6398774 6614273 6872589 7154987 7434198 7669267 7946976 8219963 8503913 8812107 9117112
9726 9117112 9410433 9746141 10060104 10350058 10654941 10961930 11282874 11583741 11861601 12155452
9716 12155452 12537018 12895333 13189513 13506900 13845407 14173467 14484581 14765951 15110748
9707 15110748 15475991 15782966 16073267 16393119 16725652 17056540 17331755 17604677 17852330
9698 17852330 18108701 18347485 18541132 18712731 18873309 19022323 19213045 19351632 19502397
9689 19502397 19648614 19771260 19841195 19954464 20050496 20135341 20183178 20234173 20289970 20332934 20340210
9678 20340210 20337618 20370372 20412725 20407944 20402651 20390122 20320657 20260426 20262373 20214077 20105426 19989456
9666 19989456 19864307 19780076 19721273 19692997 19645666 19567831 19509952 19454255 19397527 19356095 19284844
9655 19284844 19266190 19263076 19245192 19251425 19301189 19368362 19409840 19432255 19505355 19576973 19647765 19770847
9643 19770847 19863202 19965397 20065810 20199648 20350421 20506023 20633771 20761743 20943098 21087832
9633 21087832 21233713 21411332 21593546 21818056 22037839 22213959 22425472 22662573 22881256
9624 22881256 23158045 23457229 23667927 23880492 24138790 24423737 24673088 24899041 25097623
9615 25097623 25282013 25415883 25596096 25782886 25944441 26091044 26174411 26246818 26340415 26382035
9605 26382035 26426340 26454509 26417132 26358499 26299142 26213857 26125305 26057622 25987258 25925634 25849542
9594 25849542 25725877 25585738 25407870 25169443 24958227 24777234 24530695 24280999 24026387
9585 24026387 23759221 23497653 23195612 22866692 22494480 22121470 21710530 21277715 20849724
9576 20849724 20428081 20012078 19622328 19247859 18829193 18357410 17928555 17519091 17107948
9567 17107948 16686241 16283983 15889532 15499550 15076433 14662293 14249143 13875943 13469913
9558 13469913 13069943 12683943 12287651 11949820 11618513 11276458 10903323 10544400 10204633
9549 10204633 9882845 9532524 9219561 8953602 8693225 8375846 8063814 7799016 7540296
9540 7540296 7281187 7044215 6827962 6610731 6372912 6219598 6059009 5855472 5674393 5492261
9530 5492261 5340245 5186750 5005019 4817328 4672720 4540047 4424178 4324519 4214568 4114564
9520 4114564 4042298 3930315 3825383 3733476 3608152 3534650 3491525 3416045 3365807 3271720 3208077
9509 3208077 3163562 3114111 3051108 3003539 2941384 2857492 2773222 2696612 2647492 2656213 2650074 2608441
9497 2608441 2587162 2567018 2514074 2470026 2418356 2370254 2345305 2346745 2350304 2350182 2314167 2244205
9485 2244205 2203143 2184920 2158645 2131902 2118782 2116438 2144402 2117917 2116412 2104580 2083501 2085587
9473 2085587 2063650 2065507 2044566 2004289 2013554 2001778 1926891 1922763 1905906 1879784 1873009 1851245
9461 1851245 1848764 1826152 1814889 1802005 1820575 1842624 1862717 1881503 1876583 1858655 1816951 1786744
9449 1786744 1758338 1755162 1741258 1738526 1729665 1775339 1785285 1803531 1781193 1757329 1765957 1746280
9437 1746280 1746299 1719623 1730871 1721680 1737765 1783421 1805422 1798223 1788424 1793735 1790697 1803444 1783474
9424 1783474 1787535 1823447 1842063 1860694 1857083 1877502 1884342 1898650 1914202 1912412 1933947 1941941
9412 1941941 1953688 1942776 1915057 1939200 1921940 1924260 1946331 1987208 2025377 2045171 2055988 2041042
9400 2041042 2071748 2083600 2061247 2043990 2065641 2102588 2096664 2095323 2119983 2145481 2164114 2206394
9388 2206394 2243497 2242578 2263213 2285865 2288898 2307131 2336000 2368728 2372949 2409369 2430798 2428043
9376 2428043 2441195 2456603 2432927 2409983 2413672 2415550 2418056 2400009 2400371 2415046 2408671 2443030 2507219
9363 2507219 2551255 2568785 2613762 2633921 2632553 2624567 2607402 2631034 2635851 2665297 2648445 2630902
9351 2630902 2641006 2645388 2647350 2663782 2670920 2695928 2737053 2749211 2785143 2832516 2828084 2801345
9339 2801345 2766073 2778017 2807651 2810137 2844424 2880987 2937410 2975345 2981292 2980009 2999179 3063118
9327 3063118 3112942 3137377 3160010 3167005 3212783 3271395 3289707 3271920 3261497 3257911 3272927 3341608
9315 3341608 3381686 3370068 3375873 3418700 3457086 3454932 3473910 3484688 3513911 3497097 3509884 3502490
9303 3502490 3450061 3440514 3442108 3431669 3406834 3371120 3383602 3399890 3399940 3402655 3413082 3407217 3428697
9290 3428697 3433865 3466357 3465120 3459998 3475018 3453327 3483144 3522228 3481072 3482227 3506177 3549927
9278 3549927 3575647 3575669 3565291 3558291 3569238 3563328 3539732 3563704 3562820 3574638 3632210 3642959 3631711
9265 3631711 3609840 3639248 3698842 3755844 3803859 3867235 3928750 4000184 4089325 4154456 4193456
9254 4193456 4284079 4406522 4557179 4655998 4799071 4951436 5100773 5306197 5583404 5889337
9244 5889337 6206285 6546245 6943347 7432532 7953542 8557289 9262978 10061978 10908657 11824488
9234 11824488 12829620 13811356 14695452 15432543 15919417 16136802 16144644 15877222 15358607 14716587
9224 14716587 14055793 13358785 12681412 12079793 11614437 11195745 10918034 10736673 10637013 10610063
9214 10610063 10704061 10869363 11185032 11597880 12101388 12735839 13463335 14251177 15102811 15918729
9204 15918729 16516073 16902209 17033148 16871550 16440870 15760928 14962179 14094813 13208625
9195 13208625 12378432 11611978 10895622 10241031 9707144 9292566 8950834 8688237 8468290
9186 8468290 8319441 8245490 8248412 8298953 8401532 8523027 8724206 9005595 9341804 9805249
9176 9805249 10361546 10996466 11742610 12666048 13652085 14759886 16089118 17618433 19266317
9167 19266317 21021401 22777751 24486422 25995897 27190107 27982896 28305402 28161665 27589440
9158 27589440 26751730 25817076 24825330 23872597 23105394 22512030 22139104 21994289 22113528
9149 22113528 22415906 22966209 23696325 24558771 25445600 26382555 27355237 28306089 29236672
9140 29236672 30177057 31075701 31899260 32537371 32875938 32822254 32373391 31492117 30238176
9131 30238176 28760957 27197345 25579689 24046541 22661042 21442081 20461611 19703621
9123 19703621 19149759 18793653 18576733 18493549 18473458 18369104 18180544 17915029 17495833 16924089
9113 16924089 16246647 15538917 14883344 14251394 13739028 13290237 12972963 12838320 12792560 12858836
9103 12858836 13139177 13524367 14002216 14632389 15339795 16101735 16836093 17470206 17976435
9094 17976435 18284332 18377933 18324207 18116975 17871700 17728131 17669255 17735430 17916649 18305688
9084 18305688 18892888 19696444 20704326 21826222 23008329 24202878 25324003 26288975 26964921
9075 26964921 27381511 27534094 27428754 27193708 26879286 26437767 25889874 25266250 24558337
9066 24558337 23777441 22926187 22037935 21194210 20416371 19721739 19166276 18785053 18655223
9057 18655223 18676641 18911273 19317813 19828160 20456509 21044592 21503133 21828989 21793197 21413572
9047 21413572 20735871 19740736 18523314 17219029 15911623 14596987 13360668 12243358
9039 12243358 11263331 10390539 9588957 8911855 8400014 7925054 7563531 7241592 6919640
9030 6919640 6621078 6382478 6254801 6163404 6103593 6066728 6066600 6115626 6167164 6300542 6524708
9019 6524708 6804862 7080631 7441735 7878460 8395482 8926132 9486646 10007413 10536520 10948277
9009 10948277 11130391 11161226 10989784 10649084 10204009 9730062 9237384 8726159 8253277 7825806
8999 7825806 7485128 7234314 7053922 6901330 6805180 6812873 6876710 6985252 7170135 7440127
8989 7440127 7766989 8168109 8601227 9006313 9435105 9839857 10156370 10318681 10317223 10134747
8979 10134747 9760850 9241937 8679884 8058802 7424775 6808962 6257479 5812512 5380558
8970 5380558 4992772 4675488 4403502 4182556 3987303 3781247 3589492 3419902 3324836 3219741
8960 3219741 3099851 3023330 2930948 2818562 2725183 2661706 2628253 2608116 2568140 2500747 2443494
8949 2443494 2441078 2406230 2323153 2296758 2259081 2228043 2172056 2170531 2194169 2223693 2197593 2198512
8937 2198512 2229862 2227447 2195796 2173467 2109812 2120784 2089323 2048595 2044417 2024974 1967813 1942358
8925 1942358 1925004 1937510 1939171 1915311 1896105 1922988 1918105 1910742 1906172 1928411 1916730 1882089
8913 1882089 1849902 1856195 1832773 1834111 1854067 1796421 1755464 1731560 1743849 1752313 1749952 1750227 1724244
8900 1724244 1720374 1726632 1736914 1741131 1714844 1719190 1684472 1698742 1753197 1748511 1721981 1680433
8888 1680433 1659139 1689570 1714652 1659827 1644507 1661147 1704818 1725254 1714287 1688733 1674042
8877 1674042 1696671 1701185 1677265 1693179 1757488 1747136 1742927 1744926 1723835 1703610 1734504 1785214
8865 1785214 1848089 1858165 1824910 1807289 1790855 1764287 1734389 1694931 1683932 1694223 1715265
8854 1715265 1703162 1684315 1654774 1648982 1641253 1615289 1616912 1596828 1572057 1547742 1522492 1509910
8842 1509910 1482891 1477136 1454543 1427308 1460239 1474704 1489099 1481905 1505870 1511048 1494149 1458271
8830 1458271 1440531 1416430 1395037 1433658 1482803 1494588 1483817 1511391 1514203 1525230 1516964 1465822
8818 1465822 1431550 1416604 1434316 1487595 1510493 1496077 1470306 1456224 1468403 1473790 1482614 1474221
8806 1474221 1453217 1473289 1487827 1468197 1461352 1466002 1462752 1487301 1503561 1462819 1399311 1391643
8794 1391643 1388714 1367812 1387927 1410741 1402634 1404148 1403578 1405543 1399378 1415008 1420746 1463515 1450960
8781 1450960 1420315 1421418 1410260 1403894 1395666 1380370 1352754 1355545 1378612 1385692 1410098 1435182
8769 1435182 1445837 1417122 1377755 1352081 1333876 1309450 1336647 1348860 1324965 1358861 1335191
8758 1335191 1359248 1424348 1456183 1469133 1456594 1440062 1426851 1428540 1483117 1499492 1469915 1465755
8746 1465755 1454808 1440568 1471834 1503920 1462880 1441356 1408692 1400535 1430065 1460587 1440856 1439963
8734 1439963 1468492 1484465 1485388 1481513 1518242 1546139 1573628 1589392 1557485 1534710 1546210 1571494
$$ [...]
##END NTUPLES=NMR SPECTRUM
##END=
