##TITLE=Analysis number 317279
Compound Code cc 07546
Book Reference 445/166/2
Project Code adrs
Chemist Name laurenf
##JCAMPDX= 6.0         $$ Bruker NMR JCAMP-DX V2.0
##DATA TYPE= NMR SPECTRUM
##DATA CLASS= NTUPLES
##ORIGIN= Bruker BioSpin GmbH
##OWNER= nmr
$$ XWIN-NMR		Version 3.5
$$ Wed Feb 15 09:22:08 2006 GMT Standard Time (UT+0h)  MAYBRIDGE\nmr@NMR_250MHZ
##.OBSERVE FREQUENCY= 250.131544655141
##.OBSERVE NUCLEUS= ^1H
##.ACQUISITION MODE= SIMULTANEOUS (DQD)
##.ACQUISITION SCHEME= undefined
##.AVERAGES= 16
##.DIGITISER RES= 18
##SPECTROMETER/DATA SYSTEM= dpx250
##.PULSE SEQUENCE= zg30
##.SOLVENT NAME= CDCl3
##.SHIFT REFERENCE= (INTERNAL, CDCl3, 0, 16.522)
##AUDIT TRAIL= $$ (NUMBER, WHEN, WHO, WHERE, WHAT)
$$ ##TITLE= Audit trail, XWIN-NMR		Version 3.5
$$ ##JCAMPDX= 5.01
$$ ##ORIGIN= Bruker BioSpin GmbH
$$ ##OWNER= nmr
$$ C:\u/data/dgb/nmr/ADRS/16050/pdata/1/auditp.txt
$$ ##AUDIT TRAIL=  $$ (NUMBER, WHEN, WHO, WHERE, WHAT)
(   1,<2006-02-15 09:21:40.72 +000>,<MAYBRIDGE\nmr>,<NMR_250MHZ>,
      <created by zg, POWCHK disabled, PULCHK disabled
       configuration hash MD5:
       84 BC 41 DB A1 6E 1D 46 DA 25 12 A5 C1 ED C5 3A
       data hash MD5: 64K
       01 6E 9D 74 CD A5 2A 79 E3 98 E3 B5 0B 6C 7F 88>)
(   2,<2006-02-15 09:21:58.31 +000>,<MAYBRIDGE\nmr>,<NMR_250MHZ>,
      <Start of raw data processing
       ef LB = 0.3 FT_mod = 6 PKNL = 1 SI = 32K 
       data hash MD5: 32K
       0A 4B 00 4A 24 84 74 32 B7 17 2D 9A F2 DD A8 40>)
(   3,<2006-02-15 09:22:00.17 +000>,<MAYBRIDGE\nmr>,<NMR_250MHZ>,
      <apk 
       data hash MD5: 32K
       38 E0 5E FA F0 B7 27 80 86 61 AC AF 7E F0 8C 7E>)
(   4,<2006-02-15 09:22:00.92 +000>,<MAYBRIDGE\nmr>,<NMR_250MHZ>,
      <abs ABSG = 5 
       data hash MD5: 32K
       ED D4 08 F3 DC 58 C8 8B 4A 3A 76 DE B7 6D F2 38>)
$$ ##END=
$$ 
$$ hash MD5
$$ 1F EA 64 90 92 8A 44 69 96 B0 D4 CB 73 7C CB 34
##$RELAX= 
##$RELAX= 
##$RELAX= 
##$RELAX= 
##$RELAX= 
##$RELAX= 
##$RELAX= 
$$ Bruker specific parameters
$$ --------------------------
##$DU= <C:\u>
##$EXPNO= 16050
##$NAME= <ADRS>
##$PROCNO= 1
##$TYPE= <nmr>
##$USER= <dgb>
##$AMP= (0..31)
100 100 100 100 100 100 100 100 100 100 100 100 100 100 100 100 100 100 
100 100 100 100 100 100 100 100 100 100 100 100 100 100 
##$AQSEQ= 0
##$AQ_mod= 3
##$AUNM= <au_zg>
##$AUTOPOS= <5 >
##$BF1= 250.13
##$BF2= 250.13
##$BF3= 250.13
##$BF4= 250.13
##$BF5= 500.13
##$BF6= 500.13
##$BF7= 500.13
##$BF8= 500.13
##$BYTORDA= 1
##$CFDGTYP= 0
##$CFRGTYP= 5
##$CHEMSTR= <none>
##$CNST= (0..31)
1 1 145 1 1 1 1 1 1 1 1 1 1 1 1 1 1 1 1 1 1 1 1 1 1 1 1 1 1 1 1 1 
##$CPDPRG= <>
##$CPDPRG1= <>
##$CPDPRG2= <>
##$CPDPRG3= <>
##$CPDPRG4= <mlev>
##$CPDPRG5= <mlev>
##$CPDPRG6= <mlev>
##$CPDPRG7= <mlev>
##$CPDPRG8= <mlev>
##$CPDPRGB= <>
##$CPDPRGT= <>
##$D= (0..31)
0 1 0 0 0 0 0 0 0 0.06 0 0 0 0 0 0 0.0002 0 0 0 0 0 0 0 0 0 0 0 0 0 0 
0 
##$DATE= 1139995298
##$DBL= (0..7)
120 120 120 120 120 120 120 120 
##$DBP= (0..7)
150 150 150 150 150 150 150 150 
##$DBP07= 0
##$DBPNAM0= <>
##$DBPNAM1= <>
$$ [...]
##$SUBNAM7= <"">
##$SUBNAM8= <"">
##$SUBNAM9= <"">
##$SW= 20.6930455092707
##$SWIBOX= (0..15)
0 0 3 0 0 0 0 0 0 0 0 0 0 0 0 0 
##$SW_h= 5175.983436853
##$TD= 65536
##$TD0= 1
##$TE= 294.16
##$TE2= 300
##$TE3= 300
##$TEG= 300
##$TL= (0..7)
0 120 120 120 120 120 120 120 
##$TP= (0..7)
150 150 150 150 150 150 150 150 
##$TP07= 0
##$TPNAME0= <>
##$TPNAME1= <>
##$TPNAME2= <>
##$TPNAME3= <>
##$TPNAME4= <>
##$TPNAME5= <>
##$TPNAME6= <>
##$TPNAME7= <>
##$TPOAL= (0..7)
0.5 0.5 0.5 0.5 0.5 0.5 0.5 0.5 
##$TPOFFS= (0..7)
0 0 0 0 0 0 0 0 
##$TUNHIN= 0
##$TUNHOUT= 0
##$TUNXOUT= 0
##$USERA1= <user>
##$USERA2= <user>
##$USERA3= <user>
##$USERA4= <user>
##$USERA5= <user>
##$V9= 5
##$VALIST= <valist>
##$VCLIST= <CCCCCCCCCCCCCCC>
##$VD= 0
##$VDLIST= <DDDDDDDDDDDDDDD>
##$VPLIST= <PPPPPPPPPPPPPPP>
##$VTLIST= <TTTTTTTTTTTTTTT>
##$WBST= 1024
##$WBSW= 4
##$XGAIN= (0..3)
0 0 0 0 
##$XL= 0
##$YL= 0
##$YMAX_a= 642916
##$YMIN_a= -333079
##$ZGOPTNS= <>
##$ZL1= 120
##$ZL2= 120
##$ZL3= 120
##$ZL4= 120
##$ABSF1= 16.522
##$ABSF2= -4.171173
##$ABSG= 5
##$ABSL= 3
##$ALPHA= 0
##$AQORDER= 0
##$ASSFAC= 0
##$ASSFACI= 0
##$ASSFACX= 0
##$ASSWID= 0
##$AUNMP= <proc_1d>
##$AZFE= 0.1
##$AZFW= 0.1
##$BCFW= 0
##$BC_mod= 0
##$BYTORDP= 0
##$COROFFS= 0
##$CY= 12.5
##$DATMOD= 1
##$DC= 0
##$DFILT= <>
##$DTYPP= 0
##$F1P= 14.0000005364418
##$F2P= -0.99999901652339
##$FCOR= 0.5
##$FTSIZE= 32768
##$FT_mod= 6
##$GAMMA= 0
##$GB= 0
##$INTBC= 1
##$INTSCL= 1
##$ISEN= 128
##$LB= 0.3
##$LEV0= 0
##$LPBIN= 0
##$MAXI= 10000
##$MC2= 0
##$MEAN= 0
##$ME_mod= 0
##$MI= 0
##$NCOEF= 0
##$NC_proc= -3
##$NLEV= 6
##$NOISF1= 0
##$NOISF2= 0
##$NSP= 0
##$NTH_PI= 0
##$NZP= 0
##$OFFSET= 16.522
##$PC= 1
##$PHC0= 97.42621
##$PHC1= 6.616815
##$PH_mod= 1
##$PKNL= yes
##$PPARMOD= 0
##$PSCAL= 4
##$PSIGN= 0
##$REVERSE= no
##$SF= 250.13
##$SI= 32768
##$SIGF1= 0
##$SIGF2= 0
##$SINO= 400
##$SIOLD= 32768
##$SREGLST= <1H.CDCl3>
##$SSB= 0
##$STSI= 32768
##$STSR= 0
##$SW_p= 5175.98343685301
##$SYMM= 0
##$S_DEV= 0
##$TDeff= 65536
##$TDoff= 0
##$TI= <Analysis number 999999
Compound Code 99
Book Reference 9
Project Code 9>
##$TILT= no
##$TM1= 0
##$TM2= 0
##$TOPLEV= 0
##$USERP1= <user>
##$USERP2= <user>
##$USERP3= <user>
##$USERP4= <user>
##$USERP5= <user>
##$WDW= 1
##$XDIM= 32768
##$YMAX_p= 324912137
##$YMIN_p= -56466
$$ End of Bruker specific parameters
$$ ---------------------------------
##NTUPLES= NMR SPECTRUM
##VAR_NAME=  FREQUENCY,     SPECTRUM/REAL,   SPECTRUM/IMAG
##SYMBOL=    X,             R,               I
##VAR_TYPE=  INDEPENDENT,   DEPENDENT,       DEPENDENT
##VAR_FORM=  AFFN,          ASDF,            ASDF
##VAR_DIM=   32768,         32768,           32768
##UNITS=     HZ,            ARBITRARY UNITS, ARBITRARY UNITS
##FACTOR=    0.157963299565203, 1,           1
##FIRST=     4132.6476996994, 0,             0
##LAST=      -1043.33573715361, 0,           0
##MIN=       -1043.33573715361, -56466,      0
##MAX=       4132.6476996994, 324912137,     0
$$ Real data points
##PAGE= N=1
##DATA TABLE= (X++(R..R)), XYDATA
$$ [...]
16414b9807N156J4703K345j870j844L736O701n045o589O353P287n913n3N718Q388
16399I266j8653p473J013J0651o089l831Q03K890P039j7939K946j1676J029N474
16385b4550P882J0170l111l093j395p025M173k130p660r63K944J501P109l171
16371a9319M733Q904J1401M059q092Q61L599n942N02j2202l611J80P237K121n437
16356a1006j3568J1993J2668J4731o115k2444o164K347K018N309O322K428j706
16343c187q525J203j450o789r936J328l678j0052J1542M889N258Q000J247L672
16329f478J4629j1883j2330P448M764p83l882L422j5213r045M748J7355J3888
16316F640M117q213j2382l397R643J567J947O982O747l428k1425j3846q764j838
$$ y = [-29807, -24651, -9948, -7603, -9473, -11317, -7581, -880, -5925, -12514, -6161, 1126, -4787, -4840, 878, 9266, -9387, -16860, -15847, -5196, -11285, -15116, -14313, -11423, -4384, -22323, -19377, -31053, -30024, -24550, -16668, -6498, -9609, -12702, -14097, -21122, -16949, -19079, -26739, -27702, -24758, -23257, -16148, -19319, -14586, -5682, 5719, 9778, 1686, 2547, 6146, 204, 706, -11496, -15107, -14927, -7690, -5569, -11006, -24574, -12581, 87, 14818, 8703, -13741, -19905, -17558, -15540, -10231, -3909, -1481, -3187, -11712, -10509, -11959, -18748, -28684, -27356, -31034, -41086, -29544, -24655, -19397, -11397, -10150, -6478, 8151, -3732, -16062, -8614, -3850, -4633, -8515, -5093, -20306, -29351, -24603, -7248, 6640, 10757, 2544, -9838, -13235, -3592, -2025, -78, 6904, 13651, 10223, -11202, -25048, -33812, -35650]
16302c5650J3912N91r868j005p65j1416R258R385M17O289O491P242M774r564J628
16287h281k769p272j991Q555p304p200k141j0688J722J8588O262K454j5176j0324
16273c5565M667J1698l345j4290J990J5802N205j1473m343O059K578K1554J406
16260A943m035q513o186J1356k672J0464J4546k890j1402k0640n407o345L070
16247b6711P667Q015J0585J1556J214R703l706o82l751j4089j5112j0505L908
16234b1908J1664P068m766O318j1444q545J2072J4442M275J826o056j3049r851
16221a7954j3106M217O759J0003J88q727j1854n443J6583P591r564J1345J6672
16208F710q36p59j1833K933M674L478N238k0788n235L267J2825p017l727J5144
$$ y = [-35650, -21738, -21147, -31015, -32020, -32785, -44201, -34943, -25558, -25141, -18852, -12361, -5119, -345, -9909, -8281, -11050, -18322, -20313, -11758, -19062, -26262, -28403, -39091, -37369, -18781, -12519, -10065, -25241, -35565, -30898, -19200, -22545, -36835, -34845, -19043, -13838, -25311, -29654, -23595, -21017, 537, 1943, -2092, -10605, -16791, -5435, -8107, 2357, 16903, 14013, 2611, -18029, -23436, -29781, -26711, -19044, -11029, -444, 11112, 12326, 22029, 18323, 17641, 13890, -199, -15311, -25816, -21908, -10244, -3176, -7942, -1624, -13068, -21613, -9541, 4901, 9176, 11002, 4946, -8103, -17954, -31060, -26843, -20084, -10081, -9893, -18620, -30474, -35917, -19334, -11743, -21307, -9962, 6710, 5874, 5115, -6718, -3785, 889, 4367, 9605, -11183, -16418, -13151, -326, -7343, -11070, 4074]
16194D074J0676j3822j4142j0376J3665J7588n836k463J449m86l964k4148o726
16181c4511M769o401L953J3830J4550K372l805k327j1649j1269M627m351O284
16168b3928J7092j200K696j0655j0386P50Q766K168L088J0680j193q874q085K479
16154a6602J399q342r46l974L130Q805j3798m386J7310J321j0731N741J3073J13
16140g887N273N058j0189J0701J1928j5034n474M075J0357q572l414L081n531
16127e628o359q193j86N03l942n552q997R90J4807J1464P030M350K0224K876l79
16112B3008p750m500p589j9674K109k074J1074p129r04R544N763o158n749J2286
16098B257L562j4555R898J4942r21l529p082m881J203N878O071J678O747k0231
$$ y = [4074, 14750, 928, -13214, -23590, -9925, 7663, 1827, -636, 813, 327, -3637, -27785, -34511, -29742, -36143, -32190, -18360, -3810, -1438, -5243, -7570, -19219, -30488, -25861, -30212, -23928, -6836, -8036, -5340, -15995, -26381, -25631, -16865, -14697, -11609, -929, -2122, -10996, -19081, -16602, -15203, -23545, -24491, -28465, -25335, -16530, -30328, -34714, -17404, -16083, -26814, -21073, -8000, -7887, -2614, 2444, -7745, 2956, 14884, -150, -5624, -1549, 8808, 236, -3178, -97, -5628, -11987, -20180, -20366, -19863, -23805, -29357, -38354, -37364, -22557, -11093, -4063, 287, 20511, 23387, 23008, 15258, 10758, 3169, -16505, -14396, -16470, -5396, -12525, -13429, -3885, 1878, -4280, -10029, 2257, 5819, -8736, 1162, 16104, 15183, 11654, 4572, -309, 894, 6772, 12843, 14521, 21268, 1037]
16084A037k41j707M720r31O419P59p480R70n538J720p235P71L730J3598r880k4111
16068b3399p164N681J1474L172j98r63M037j0318q657O20K498j530M963J2830
16054f954J4720j2311j8954n655k144m157q0J871K1183k581K403N577O700P365
16040F983k419k420L896N063N988M05j0770j6549j2015Q665Q245j859N944L658
16026B815m484J0913j2040j2070p323P20r039P645P887M243O007j0604l641o880
16012b5851P583O658r266m276K202K3091L548j5970j1507n273m16J8153L291J44
15998g889r029j1223J2186Q046P115J0218p737j3987Q048P567k175n63K342r988
15984g069O237r240k2016O176O91j815M805J5395K556q817J0463K470j2549k858
$$ y = [1037, 796, -911, 3809, 2878, 9297, 10056, 2576, 3546, -1992, -272, -7507, -6736, -3006, 10592, 712, -23399, -30563, -24882, -13408, -10236, -10434, -11397, -7360, -17678, -26335, -25715, -23217, -24747, -19784, -6954, 7766, -4545, -23499, -29154, -31298, -35455, -35535, -33664, -12481, -15062, -12659, -7082, -382, 6983, 4564, 2144, 6040, 11103, 17091, 17496, 6726, -9823, -21838, -13173, -4928, -6787, -843, 2815, -1669, 9244, -2796, -14866, -22189, -21469, -30508, -22863, -14976, -10733, -4726, -15330, -18971, -25851, -18268, -11610, -20876, -25152, -22950, 141, 3689, -12281, -23788, -29061, -29477, -11324, -8033, -7889, -16918, -28141, -15955, -7909, -794, 9424, 1687, -12300, -4252, 3315, 1140, 577, 2919, -7069, -832, -10072, -32088, -25912, -25221, -27036, -22231, -6836, -4280, -13097, -2634, -164, -12713, -15571]
15970a5571J0573R93N620j7949j121l321p768R588Q646n112j3673J1083P770j707
15956a1949n022J650j2926N521R518J769q079m29j4388l471J1765M076J5837p808
15942a3936R012J4759k717p358l510K443K487K841j7229j0282k980J212K01J708
15928b3349J7183m324j906p522Q062P507J0407R409m179j3779P956j1864J989
15915d410J5826j636j8740J1135J087j1454J136j898j213J5863o484j512l667
15902e967k832N840L509j5129l953M787N259k915m432R093J2982L921K420o137
15888F446k796p467q786q53N879o26L083k603O604j2467q157J8306P007k218n770
15873d418j5041l275K228m43k579m15N798P102k675M716L15j0933n50k606R641
$$ y = [-15571, -4998, -4005, 1615, -16334, -17455, -20776, -28544, -18956, -10310, -15422, -29095, -18012, -10242, -11949, -16971, -15321, -28247, -22726, -13208, -11439, -19518, -19947, -34335, -37806, -26041, -21965, -6128, -13936, -4924, 9835, 7118, -240, -3750, -1307, 1180, 4021, -13208, -23490, -26470, -25258, -25057, -23349, -6166, -10490, -12396, -19918, -11856, -4349, 6058, 15467, 11288, -2491, 5465, -6399, -4410, 11416, 9780, -8960, 2175, 3262, -8192, -7056, -8954, -10167, 5696, -788, -2300, -5967, -8799, -2959, 550, -14579, -18532, -13745, -8486, -11401, -15833, -6740, 6242, 10163, 12583, 6446, 3650, -3817, -12603, -13456, -7577, -8203, -5120, -7723, -1119, -13586, -21743, -3437, 3570, 1352, -4418, -19459, -22734, -20506, -20949, -23528, -23943, -18145, -11043, -13718, -9002, -8687, -19620, -20170, -22776, -13135]
15858a3135L147j0520J37R280l577O410R398Q088O82l422R431k162N300L619q200
15843A4476o04n030j3809l377j670k231K779K554O848O579J048j2767L640l029
15829d593l777K301R847j1564m933Q58m460J221n132J8346L315n425m613j2108
15815b0717J2227K1954p150o292L312Q155k447o337M370J1099n462j0794r243
15802g325j3088j5847Q97j674J3770R048O423m298L938R35j306r74M129k266Q61
15787f777Q289K517q590n117M675P204P4M958k002P733r287j4722J7949J0725
15773A7629p189o484P502L392l30J1266m507j457p671j0386M930R956K71r10m438
15758A1574o283k334r29n306J769k110l05m734l030O849q17n466O745m732j310
$$ y = [-13135, -9988, -20508, -20371, -11091, -14668, -8258, 1140, 9228, 9910, 6488, 15919, 13757, 19057, 22676, 14476, 13872, 8842, -4967, -8344, -10014, -12245, -9466, -6912, -64, 6515, 7563, -5204, -1564, -4593, -8370, -6069, 3778, -7786, -12719, -11861, -16321, -15100, -20232, -1886, 1429, -3996, -8609, -20717, -8490, 13464, 6314, 22, 3334, 11489, 9042, 2705, 7075, 18174, 12712, 1918, -7325, -20413, -36260, -35363, -37037, -23267, -14219, -7796, -12094, -8156, -7221, -8527, -9501, -5372, -7638, -6777, 1512, 4029, -4561, -9678, -5003, 2201, 2275, 7233, 5231, 12964, 3677, -11045, 6904, 17629, 10440, 3956, 11458, 14850, 14520, 25786, 21279, 19822, 12151, 1765, 6695, 16651, 16922, 16012, 11574, 5291, 2957, 2028, -3278, -1509, -3619, -3924, -8658, -11688, -4839, -5656, -11122, -4377, -9109, -10419]
15743a0419q360j2303J6079J0689j389r214o714L391l948N724p692n357N34J1876
15729a7103k484M11k102J0902K6057o399q053P741m118j4793K241n243M910p101
15715a5134m019J484Q937Q072P533j3108p128q40K935M584r79Q51k257M457K4442
15700A9830l388j9765j2282p588J947J5356J883p686k595K502o293L566M007K570
15686g936j2506l589R797L073j90m918p18J9994L009n808o260j3636j548Q72K368
15671a7996Q253Q825L298k811K099J103J659p399q542l69R098j117n375R083j213
15656a404j3722j8551O698J941P888J6616m166j417M647J4653j700q075k042m857
15642c491j5397K654J5290L430l599m540n269m076j862o013k359L412O055p868
$$ y = [-10419, -18779, -31082, -15003, -4314, -5703, -14917, -21631, -18240, -22188, -16464, -24156, -29513, -28979, -17103, -19587, -19176, -21278, -10376, 15681, 9282, 1229, 8970, 4852, -9941, -7700, -12943, -8033, -15134, -19153, -17669, -8732, -660, 6873, -6235, -13363, -14203, -11268, -6684, -7663, -6812, -9069, -4612, 19830, 16442, -3323, -15605, -23193, -21246, -5890, -4007, -11693, -14288, -11786, -18079, -14513, -10506, -7936, -20442, -24031, -14234, -11161, -11351, -16269, -16987, 3007, 6016, 208, -6052, -19688, -21236, -20364, -17996, -9743, -918, 2380, -431, 1668, 2771, 4430, -2969, -11511, -11880, -2782, -3899, -9274, -191, -1404, -15126, -33677, -26979, -25038, -17150, -534, -4700, -6117, -1470, 13183, 11483, 3408, 1366, -3491, -18888, -16234, -944, 2486, -1113, -5653, -10922, -14998, -16860, -22873, -25232, -21820, -15765, -23633]
15628b3633N213J353Q596N700m892J6460O353l771j9948j0880J674J588j5953
15615c2140m443q871P264J8138Q948R334O859O142o003q130R97o53j0839j2792
15601b6189Q430J52j3743K189o762o111R748j827Q937Q526o389N354J0964J3083
15587F362J544n399R685m622N1K728j05m148o295m926j3298l512J1766Q846N716
15572D393j4193j972J0174r495p250J2778K459j5096P494N755j1401p864J679
15559b2539m777K423p027o063P456J8684J4924l073P36k005q026j8225k025J900
15545b7637J5534K302Q64O999m14M904n407r623Q757M616P269K638O748N641k882
15530B0309j8988r950N859p186J455Q599p713M860J1298r208q791Q8N055j3687
$$ y = [-23633, -18420, -17067, -8471, -2771, -7663, 8797, 15150, 11379, -8569, -19449, -17775, -16187, -32140, -36583, -45454, -38190, -20052, -11104, -1770, 5089, 11231, 5228, -2902, -1905, -2558, -13397, -26189, -17759, -17607, -31350, -29161, -35923, -42034, -32286, -34113, -25176, -16650, -23039, -17685, -6721, 6362, 7906, 2507, 12192, 7570, 7621, 10349, 10244, 6096, -199, -5125, -18423, -21935, -10169, -1323, 4393, -9800, -11772, -1598, -11093, -18343, -5565, -3106, -18202, -10708, -4953, -16354, -24218, -22539, -27316, -24893, -31920, -37983, -30527, -11843, 3081, 8, 744, -1261, -9287, -27512, -29537, -27637, -12103, -9801, -8937, -1938, -2352, 2552, -2855, -12478, -3721, 895, 8164, 10802, 17550, 23191, 20309, 1321, -8629, -2770, -9956, -8501, 98, -7615, -2755, 8543, -665, -9456, -9368, -4313, -18000]
15516a8000O631K568k216j678l409Q988k590k068n585L923J8542M700L145l902
15502I049j237k941r315Q357R852J2128j506p069j687j1752o632j6318j3084j637
15488c3792R897Q71o981L238L748J3430Q287p09p446l049O524l817J1219J8366
15474A9786J288j2716J111M257K939J1942p568j8622m113J0259m18k125J6756
15461B2776J2020m538j3817j1565j1196j259j2332l282J4568O562m51J5292j2101
15448F77j1483J1271m810j1594J849Q436M14O883R953j8073p223J2885O442q671
15434c044l508P399Q701l750n209j1380l293L274M762j2152Q482M144J1290K345
15420H061j4310M770J503o252M81J0971m561p005Q536J677J866Q223j195k058
$$ y = [-18000, -11369, -8801, -11017, -12695, -16104, -7116, -9706, -11774, -17359, -13436, 5106, 9806, 12951, 9049, 7812, 4871, -4444, 3913, 13765, 25893, 24387, 17318, 15631, 3879, -2753, -19071, -32155, -33792, -23895, -23024, -30005, -26767, -23019, -9589, -1302, -2011, -9457, -12506, -5982, -9799, 1420, 19786, 21074, 8358, 9469, 13726, 16665, 28607, 21039, 2417, -1696, 8563, 8145, 6020, 22776, 34796, 30258, 16441, 4876, -6320, -7579, -19911, -23193, -8625, -2063, -2514, 12778, 677, -10806, 465, -4345, -15939, -14090, -5654, -5240, 1643, 11596, -6477, -13700, -815, 5627, -3044, -6552, 847, 9548, 5798, 589, -10791, -14084, -10810, -6048, -18200, -9718, -5574, 5716, 8061, -6249, -1479, 24, -6228, -5747, 5224, 663, -6342, 2194, 3871, 5737, 13960, 12765, 10707]
15406A0707O941M52l865j4931o17Q235P615n021j24j305o095q697P34j3099P435
15391a1635m586k956O939J3551R722M29o383j0523j2529r714J5996J1873N74r60
15377b02o024o122J382K376o267J46J1319K93j1845j125J72J555R049K818l529
15362f004J2464k47q912j975N320r50p141j0700n631j0565J3058J1167P226k2201
15348b5091r467O587J4431P886J51r098J0976P264K378J3799M515o751l557m886
15334I137j9737o545N073j030J9458J900N73j1109n420R620J0638k655q421J194
15320B676P452j1056l947j569j1155r036q993O158K5987J1121r510j7333q105
15307b7310J1183J7768n0m393N211q457q525n542O67P581J7609M424k805j2544
$$ y = [10707, 17648, 18100, 14235, -696, -1313, 6922, 14537, 9516, 9392, 8087, 1992, -6705, -5971, -19070, -11635, -16221, -19177, -12238, 1313, 11035, 11464, 5081, -5442, -17971, -27685, -11689, 184, 758, -202, -6226, -12348, -10966, -8590, -14857, -14711, -3392, -3099, -14944, -16069, -15897, -14342, -5293, -2475, -6004, 6460, 6213, -2699, -4674, 646, -304, -7445, -18145, -23776, -34341, -21283, -10116, -2890, -25091, -34558, -27971, -13540, -5654, -5503, -14601, -3625, 3639, 6017, 19816, 24331, 17580, 14023, 9137, -10600, -17145, -12072, -13102, 6356, 8256, 8829, -2280, -7700, 1920, 12558, 9903, 1482, 2676, 10128, -928, -4875, -6444, -17599, -26635, -35628, -29470, -3483, 7638, -1872, -19205, -27310, -16127, 1641, 1591, -2802, 2409, -6048, -14573, -20115, -19448, -11867, 5742, 10166, 7361, -5183]
15293e183m044M757o711J1839J2236K698J34K060m586J476Q631r619r635j0813
15279f760m515N966p748r081M700j667L660M604J2264J6237Q975j2820L336p417
15265I734j1006Q716J767n075o520J5631L405r72k734K720J1359k009m751o588
15251A3677k857K883p383q774j2563p08J3758P508N685J1638K661j4205K115j352
15237A2083q487j5957l27J1803L130J1546L889p882k802M899l686m575j2452k92
15223i110J4623J4712k300n618K373j7114j7956L416J2322J8594R231k0199j1168
15210h194O744J2753k380n316O249J0983O833O674o073j3487r830L512R284J6370
15196C4122M904L123p515m264J552r454J1233O158M250O828J7079R382J6944N728
$$ y = [-5183, -9227, -4470, -11181, 658, 12894, 15592, 15726, 17786, 13200, 14676, 23307, 13688, 4053, -6760, -11275, -5309, -13057, -22138, -17438, -19105, -15445, -10841, 1423, 17660, 26635, 13815, 17151, 9734, -1272, 7444, 9211, 4136, -2384, 13247, 16652, 15680, 12946, 15666, 27025, 25016, 20265, 13677, 10820, 13703, 6320, -2454, -15017, -15725, -1967, 5541, 11226, 22864, 25525, 11320, 13435, 12083, 3596, -12361, -12688, -885, 2245, 13791, 17680, 9798, 6996, 11895, 8209, 3634, -8818, -9110, 5513, 20225, 17925, 12307, 14680, -2434, -20390, -16974, -4652, 13942, 23173, 2974, -8194, -1450, 11303, 8923, 3607, 9856, 20839, 27672, 34346, 28273, 14786, 4956, 8468, 17752, 34122, 39026, 42149, 34634, 30370, 31922, 22468, 33701, 39859, 44109, 50937, 68016, 77398, 94342, 100070]
15182A00070k328J1255K0577K1399M5268L2188L0734M2336L6442L9680M1321K3433
15170D42375K2684L3280J8403l904k5832l9947m0905n1864n3257m3936l5016k6966
15158A95115k8506k2765j4711q184j6411k2063m021j1867k313L47M991j422j7617
15145E0573p790l440m940p9p217L62m143k10l675j2773j0355J2475Q917j466O072
15130B2311j1411R034N74l891J798n083k256l636l824M275J8778l388r524r709
15116D048R04m178j2189J6927K0144N631K930j677K514j2123j3495J3834O174
15103B9444k712o562r287K100J1414n645J160N900J945o704j9141k92J032K3649
15089B6301R496j252o601q478m953k316N560J1740M841o932l757r505m056j4454
$$ y = [100070, 97742, 108997, 129574, 150973, 196241, 228429, 259163, 301499, 337941, 377621, 418942, 442375, 465059, 498339, 516742, 512838, 487006, 447059, 406154, 354290, 301033, 257097, 222081, 195115, 166609, 143844, 129133, 120949, 104538, 82475, 78454, 66587, 64274, 64621, 69612, 68190, 50573, 42783, 39343, 34403, 34324, 27107, 27469, 23326, 23116, 19441, 6668, -3687, 8788, 17705, 16239, 22311, 10900, 19934, 20508, 16617, 18415, 13332, 11076, 7440, 3616, 7891, 26669, 23281, 13757, 4048, 4952, 774, -11415, 5512, 25656, 31287, 34217, 32540, 35054, 22931, 9436, 23270, 29444, 26732, 20170, 10883, 12983, 24397, 18752, 19912, 25812, 27757, 21053, 1912, 1620, 2652, 26301, 35797, 34545, 27944, 19466, 14513, 12197, 17757, 29497, 34338, 27406, 23649, 14144, 10088, -4366]
15075d366j3537Q3Q213J0383O242p250j4705O522L486Q719J6026O473Q67j962
15061B5194n37k801j2634j2358P337J1882N177j2745j507J002l130J513k817N083
15047H659K316j088l551J0104p120M976P85q35j324N497N725n254m042K184j7431
15032c99p347O752J1130L440n403O284N464N67q45N339P958K058J836K2O517l886
15016C9487p650k2913q975K490p105N088R670q659L954J0021J712j308J9705N737
15002D1254q125m210j1717j0704L822J2067J5768j0033l2754l062R916r846L656
14989c968J0016O685Q186j962o848N669R375j931j2061L681J4196K106o315R484
14975C6313N761J806P969K270p496o072K685J6214J9260J8526O968l482O11l908
$$ y = [-4366, -17903, -17820, -9607, 776, 7018, -232, -14937, -8415, -4929, 3790, 19816, 26289, 27156, 25194, 24657, 21856, 9222, -3136, 4201, 16083, 21260, 8515, 7008, 8010, 4880, 6393, 3576, 8659, 10975, 9887, 6336, 16440, 9320, 14296, 15081, 14246, 12922, 18419, 24144, 18890, 14848, 17032, -399, -7746, -994, 10136, 13576, 8173, 14457, 19921, 20488, 19643, 24982, 32940, 34998, 36834, 36856, 43373, 39487, 31837, 8924, -51, 2439, -4666, 422, 10092, 1433, 5387, 15408, 17120, 15812, 35517, 41254, 33129, 28919, 17202, 6498, 10320, 22387, 38155, 28122, -4632, -7694, 2222, -7624, -3968, 6048, 12733, 20919, 18957, 12109, 17778, 27153, 25222, 13161, 16842, 31038, 33144, 26829, 36313, 42074, 43880, 51849, 54119, 46623, 40551, 43236, 59450, 78710, 97236, 104204, 100722, 101333, 97425]
14961I7425L804j2505j3781J1280j0215J535j3688j073J235J0042l072R09o000
14948F5896j4143q915k2500Q36N059n12J6J3102K73j0130j1826N704m824l606
14934A4430j2420J093N933Q869J6619J595l473K632J5573Q107m070o573j2046
14921C6269j010L831j065J933Q175J1201L820p75j1011K198M385J578P550J495
14907F8574R000m228j1178j490K6680J5160p277J597j924K734m301j7880j785
14894G3682R380J8503R40n366L244j8202j873O925J5550J3017N333n878p134q350
14880I9771j2136K544J1746J5826p107n995l280J800p046j2222k221m314K789
14867H0155K32J735J3783J1133j920L195K0923j0211j2801L388Q952L670L903
$$ y = [97425, 101229, 88724, 74943, 86223, 76008, 77543, 63855, 62782, 64017, 74059, 70987, 71896, 65896, 51753, 42838, 20338, 21174, 26233, 25721, 25737, 38839, 39112, 28982, 17156, 22860, 18036, 14430, 2010, 3103, 9036, 17905, 34524, 36119, 32646, 35278, 50851, 58958, 54888, 48315, 36269, 35259, 39090, 38025, 39958, 48133, 59334, 63154, 62379, 51368, 53566, 57951, 59529, 67079, 68574, 77574, 73346, 62168, 60678, 87358, 102518, 95241, 96838, 94914, 97648, 93347, 75467, 73682, 83062, 101565, 102505, 97139, 100383, 82181, 80308, 87233, 102783, 115800, 121133, 115255, 108121, 99771, 87635, 90179, 101925, 117751, 110644, 104649, 101369, 103169, 96123, 83901, 81680, 77366, 80155, 80387, 82122, 95905, 107038, 105118, 108313, 129236, 119025, 106224, 109612, 118564, 122234, 126137]
14854A26137P043j819J302L778k615n685J3439J4037k062J6179J751r427Q572
14841A70630M016l340L62r097Q602N755J2384J4529P53J934j644N670M411l488
14827B11477r427J6706L0048M269j217N91r412P610J1492J701J7153L0855J2790
14814C24636o757r204j9176M700K2428J0026O252o611L307J7485J4641J0962p418
14801C65271O471J6555J7747J5515J1877L3304J9187Q393J282J5805J3829J4457
14789E39693J2109j2643j0219j0744Q620K6210K6540O479J8372K2083K2060K8752
14777F77312R204K6270K1879J9351L5400K4044R500J7695K8759L5418L8097K6523
14765I69452K4021K6764M0497M6656N3944N4483O4053N8708M6483N1687M8192
$$ y = [126137, 133180, 131361, 132663, 136441, 133826, 128141, 141580, 155617, 153555, 169734, 171485, 162058, 170630, 174646, 171306, 171668, 162571, 171173, 176928, 189312, 203841, 204594, 206528, 204884, 210554, 214965, 211477, 202050, 218756, 248804, 253073, 251856, 252447, 243035, 250645, 262137, 263838, 280991, 311846, 324636, 317879, 308675, 289499, 294199, 316627, 326653, 332905, 326294, 329601, 347086, 361727, 372689, 365271, 371742, 388297, 406044, 421559, 433436, 466740, 485927, 494320, 495602, 511407, 525236, 539693, 551802, 539159, 528940, 518196, 526816, 553026, 579566, 586045, 604417, 626500, 648560, 677312, 686516, 712786, 734665, 754016, 789416, 813460, 822960, 840655, 869414, 904832, 942929, 969452, 993473, 1020237, 1060734, 1107390, 1161334, 1215817, 1279870, 1338578, 1385061, 1436748, 1484940]
14754A484940L8720O7654P3202P3200O9254Q2180Q8827Q6633R8421J17617J08917
14743B389565J42779J52108J62114J55430J80294K03816K07487K18696K30245
14734D042534K61607L04307L40978L87521M48453N07537N76519O85764Q08881
14725H364101R42444J093466J247777J471531J727945K030823K426126K926397
14717B2230610L592143M454703N536236O787803Q065846R039576R389551Q950128
14709G8046596P672948N777068L476865R31797j678483m116623o151088p527655
14701G6431425q186793q165576p654347o857330n923630n014605m226000l547435
14693B6855709k991405k554324k196935j918922j679274j476887j320316j174564
$$ y = [1484940, 1523660, 1591314, 1664516, 1737716, 1806970, 1889150, 1977977, 2064610, 2163031, 2280648, 2389565, 2532344, 2684452, 2846566, 3001996, 3182290, 3386106, 3593593, 3812289, 4042534, 4304141, 4608448, 4949426, 5336947, 5785400, 6292937, 6869456, 7555220, 8364101, 9306545, 10400011, 11647788, 13119319, 14847264, 16878087, 19304213, 22230610, 25822753, 30277456, 35813692, 42601495, 50667341, 59706917, 69096468, 78046596, 85719544, 91496612, 94973477, 95905274, 94226791, 90110168, 83959080, 76431425, 68244632, 60079056, 52424709, 45567379, 39643749, 34629144, 30403144, 26855709, 23864304, 21309980, 19113045, 17194123, 15514849, 14037962, 12717646, 11543082]
14685A1543082j039403r25755q07515p14309o30698n65046n04693m49928m00641
14676E505094l68940l52007l04506k61517k45907k16910k15031j86875j67385
14667C186016j51910j40434j37567j29943j03833j05762j10588q0164p2123p1885
14657B081807p0271o8452n1302o9096o1241n9901o0132p5556o5648p3998p1224
14646A354986m9163m9857o2419l9742j9991m3000m8590n2786m6890l7519k8136
14635H76893k8245l2849l4939l1920k5820p856j8226l4176k0060l3115k6262j6849
14623E66576r301k7479k3279j0822k3037k0450j8048j1374r154k071r350n240
14611C96971l780p932k0201j4160j3570l044j907p684q64n268o040j5585j8068
$$ y = [11543082, 10503679, 9577924, 8770409, 8056100, 7425402, 6860356, 6355663, 5905735, 5505094, 5136154, 4784147, 4479641, 4218124, 3972217, 3755307, 3540276, 3353401, 3186016, 3034106, 2893672, 2756105, 2626162, 2522329, 2416567, 2305979, 2225815, 2153692, 2081807, 2011536, 1943084, 1891782, 1822686, 1761445, 1701544, 1641412, 1565856, 1500208, 1426210, 1354986, 1305823, 1255966, 1193547, 1153805, 1133814, 1090814, 1042224, 989438, 942548, 905029, 876893, 848648, 815799, 780860, 748940, 723120, 715264, 697038, 662862, 642802, 609687, 583425, 566576, 557275, 529796, 506517, 495695, 472658, 452208, 434160, 422786, 413632, 411561, 402211, 396971, 393191, 385259, 365058, 350898, 337328, 334284, 332377, 324693, 323829, 318561, 312521, 296936, 278868]
14598B78868j3772O766P469j3356j5688m898J66j4771q6J0179r538j7620j5453
14585A98266O338R297M183k46j244m286o185p513m393p73M28Q921j4730j0320
14571A77743P426J1407j4018o198m397j4295l15j356k636J771J1981k465j4827
14558A49821j5974r173j2418p664R657l389n763N747L399j0697j233J3595J6836
14545A32744O868k1410j1916p547j5755k055l416q773j4304L331R249J8863J032
14532H6911l309p241o590j35R27j5138j2131J2445P3m514k362O112J4507j409
14518F8146n333j0648j3383Q715J0535r996j5321k860O426J3399o847j8935k57
14505B3641l567k33J4497J0370R001Q02N830j0823k0906n501R468J0745Q656M614
$$ y = [278868, 265096, 271862, 279331, 265975, 250287, 245389, 245555, 230784, 230698, 240877, 231339, 213719, 198266, 204604, 213901, 218084, 217838, 216594, 212308, 206123, 198610, 194217, 193444, 193872, 202793, 188063, 177743, 185169, 196576, 182558, 176360, 171963, 157668, 157353, 155997, 153361, 155132, 167113, 164648, 149821, 133847, 124674, 112256, 104592, 114249, 110860, 105097, 110844, 114243, 103546, 102313, 115908, 132744, 139612, 118202, 106286, 98739, 82984, 80929, 77513, 68740, 54436, 57767, 67016, 85879, 86911, 83602, 76361, 69771, 69636, 70563, 55425, 43294, 55739, 55812, 51298, 48936, 55048, 69555, 68146, 62813, 52165, 38782, 47497, 58032, 48036, 32715, 29855, 36281, 49680, 42833, 23898, 23641, 20074, 19841, 34338, 44708, 53709, 54511, 60341, 49518, 28612, 23111, 32579, 43324, 51980, 56594]
14491E6594P288O891K892q061Q29K251q394j0257n637o377L155L848J993O124
14477E3139r352p29j440J235J4520Q032p585j2346r656J0092K368P150M76q113
14463D7791q851J3549R334j895L639J0216J284J3558k187j6740j6897q864r184
14450C4753P338O686j2786q098J1026k59p370K881k091j5510M346m355Q260P711
14436C2532n23J0207K99j6489p943J547K717J1762J21q182j579k617j1403K424
14422A2873K226n550p118J4290J1458q537P350p317j0516l606J2600M868J624
14409B4645J7358p250k829M319p93r667L628j0443n676J49l924J897j730K0600
14395C0284K025j9841P723L863p087R770Q335n623j7979k931R026J0771J2228
$$ y = [56594, 63882, 70773, 73665, 65604, 66433, 68684, 60290, 50033, 44396, 38019, 41174, 45022, 47015, 53139, 43787, 43058, 41618, 42853, 57373, 65405, 57820, 45474, 35818, 45910, 48278, 55428, 55904, 47791, 38940, 52489, 61823, 59928, 63567, 73783, 75067, 88625, 86438, 69698, 52801, 43937, 34753, 42091, 48777, 35991, 27893, 38919, 38660, 31290, 34171, 32080, 16570, 20916, 16561, 24821, 32532, 32009, 42216, 42515, 26026, 18083, 19630, 22347, 34109, 34230, 26048, 24469, 21852, 10449, 12873, 15099, 9549, 2431, 16721, 28179, 19642, 26992, 19675, 9159, 5553, 18153, 23021, 24645, 42003, 34753, 31924, 36243, 35450, 25783, 29411, 18968, 13292, 13441, 9517, 11414, 9684, 30284, 32309, 12468, 20191, 24054, 16967, 26737, 35072, 29449, 11470, 8539, 17565, 28336, 40564]
14382D0564j212j976r174N221M56j3346J927K73o138N746J0617q279j0734J1694
14368B5639R813o022j91j4980l919M911Q269j2916P648k136K458j5660j384L916
14354E446J1749O139k161n483l264M334M620O249j907q471k097j008n826j6824
14340h504j8677K086J5685Q252k1M065J1354o878j2242P285L174r674o551l441
14326a4087k119M485j2163o56J8551J1561J1730P582M944l136j2134m524o941
14313C093q980M428n079N185q904p51J8950M772q901j0188J3321J7507q948o591
14299H914N304O86J450P290m539J0641J3774q06j8826l395j9227p372l02n406
14285a1814J8022Q338j154l612j060k648R696l292o38o702j251K6257J410k3114
$$ y = [40564, 39352, 37376, 28202, 33423, 33879, 20533, 22460, 22733, 16595, 22341, 32958, 24679, 13945, 25639, 35452, 29430, 29239, 14259, 10340, 15251, 23520, 10604, 18252, 16116, 18574, 2914, 1530, 5446, 17195, 23334, 21173, 15690, 12426, 16760, 21380, 27629, 25722, 17251, 15154, 14146, 8320, -8504, -27181, -25095, -9410, -1158, -1179, 2886, 14240, 7362, -4880, 2405, 5579, -4095, -10646, -14087, -16206, -11721, -23884, -24540, -5989, 5572, 17302, 24884, 29828, 26692, 14558, 10034, 3093, -5887, -1459, -6538, -1353, -10257, -11008, 7942, 12714, 3813, -6375, 6946, 24453, 15505, 8914, 14218, 14904, 16354, 23644, 19105, 29746, 43520, 42714, 23888, 20493, 1266, -6106, -6408, -11814, 6208, 14546, 13392, 9780, 8720, 6072, 15768, 12476, 11838, 5136, 3885, 30142, 31552, 8438]
14271H438J31k529n658o848P135J8940J0824J931j228k4295n105J2212P239J1269
14257C2456J3231j854R362R908M576J5337m79P729J6606J5459R613K1564K8620
14244A82128L2953L7350M4043O0366N2145K4560K7214K8312M184j0708k9670m5565
14232D07312l8503k7652k1266k9412l3483l7169j9325j8498k0606p473k1511j3775
14220A18639k0980k3835o32J857j3369r630R378O623j179q571l837J380o48q655
14206D6541j2318m613o704j8753j1374K267k75Q437J0377j0339m724q011o166
14193a5655Q723M571R35j2603m13J2656j502N050M894J1932J3987k0795l905p92
14179G083l198p840Q934O951l013j2446k216j942L99Q017m741J416M421n22l481
$$ y = [8438, 8569, 6040, 382, -6466, 669, 19609, 30433, 32364, 31136, 6841, 1736, 13948, 21187, 32456, 45687, 43833, 53195, 63103, 67679, 83016, 82537, 90266, 106872, 122331, 131944, 153508, 182128, 215081, 252431, 296474, 356840, 408985, 433545, 460759, 489071, 493255, 482547, 452877, 407312, 368809, 341157, 319891, 290479, 256996, 219827, 200502, 182004, 161398, 153925, 132414, 118639, 97659, 73824, 73192, 75049, 61680, 52050, 61428, 68051, 66872, 58301, 54464, 55844, 55196, 46541, 34223, 29610, 22906, 4153, -7221, -4954, -5229, 3208, 13585, 3246, -1478, -9489, -15655, -6932, -2361, -1426, -14029, -14442, -1786, -3288, 1762, 6656, 18588, 32575, 11780, 7875, 7083, 3885, -3955, 4979, 11930, 8917, -3529, -5745, -7687, -7288, 729, -4012, -2596, 1825, 1303, -2178]
14164b178M240J1864l741L066l078j546j4480q335R14O149J816L877L484r809
14150g757l431j985r569J2691J2349n53j7296j0645m077K380J5832J7018l985
14137I72P011l13l561q527M098q26r085j8663K491M385M521M618j5797j7758k602
14122d9036J6451J6612J5182j146j0400J982j0513r713j2150J2286J1581q30M438
14109a5256M425J1151J2984l485r958K446J0975q858l919j0227L248O278r654
14096i850k696Q20k345P760N549n869k620K095j0397M194j2490j040M814J1645
14082a0430j297O858J0723k941l475P274j530n324r182j1583l397L873Q709J0323
14068a399j847n215N895L207j225o002J627M325k153M867K126j0548l383R85N509
$$ y = [-2178, 2062, 13926, 10185, 13251, 10173, 8627, -5853, -14188, -13274, -7125, -5309, -1432, 2052, -7757, -11188, -13173, -22742, -10051, 2298, 1745, -15551, -26196, -30273, -27893, -12061, 4957, 972, 7983, 7670, 4109, -4418, -320, -1146, -10231, -28894, -26403, -22018, -17497, -12879, -28676, -46434, -49036, -32585, -15973, -791, -1937, -12337, -10355, -20868, -30581, -42731, -30445, -18864, -19694, -15256, -10831, 320, 13304, 9819, -139, 2307, 13282, 4424, 505, -9722, -6474, -196, -9850, -12546, -11726, -14071, -6311, -762, -6631, -9251, -7156, -17553, -13359, -25849, -26889, -22075, -10430, -11727, -4869, 5854, 2913, -562, 6712, 5182, -142, -9324, -20907, -24304, -20431, -11722, -1399, -3246, -8461, -2566, 641, -584, -6586, -4959, -634, -2787, 2080, 4206, -6342, -9725, -8740, -3231]
14053c231k675J377k623k880r88N903l83K987M567j424p731L838L237j8698j1376
14038c0100J3600P165j0733k625J9546K1268K93N973j4226q575J3131J5119j183
14025B8653j0459n822j4740l746J0887L47k553J697j168M28M13M04j0167n521
14011a1347R19n955M454J7372N296N990J963J5039J1511j5531j9264m044M244
13998A0647j7118j6134J801r619m261J1572J6897J2372m902P28L392n205m963
13985d793M033m719j1505L801O829J1493K40o959l356O951O850O187O52O298k907
13970A9095l717l904J562j734J235J428L304L095q848l190j6662m166J0354N196
13956C048O292P52o018J0618N673l498M867j1059M560m281k6355j2644P509K094
$$ y = [-3231, -5906, -4529, -7152, -10032, -11020, -5117, -5500, -2513, 2054, 630, -7101, -3263, -26, -18724, -30100, -16500, -9335, -20068, -22693, -3147, 18121, 18414, 24387, 10161, 1586, 14717, 29836, 28653, 18194, 12372, -2368, -6114, 4773, 5120, 2567, 4264, 3096, 3524, 3937, 4341, -5826, -11347, -10428, -16383, -11929, 5443, 10739, 16729, 18692, 33731, 45242, 29711, 10447, 6403, 10647, -6471, -22605, -20804, -30423, -34684, -23112, -6215, 6157, 1255, 1983, 5375, 170, -4793, -760, -5479, -16984, -13183, -6354, 5139, 5379, -1580, -4936, 2015, 8865, 15052, 15704, 22002, 19095, 15378, 11474, 13036, 11302, 12537, 13965, 17269, 20364, 11516, 8326, -8336, -12502, -2148, 3048, 9340, 10092, 4074, 14692, 20365, 16867, 21734, 10675, 15235, 10954, -15401, -28045, -20536, -18442]
13942a8442J7090J220M914m49p15k232j5836m715N861m930r573J028J0248l477
13928b0008q142M899J4450M71N517L316P088Q749M277M971p291j4436J443m299
13914A005k222n397J9535j677j6010n872J308J0868P514q75P897J462j0068j0720
13900c252r182M069J1868n168K461K331j855J805N136n557n649o52k940J752J1657
13885F824N185r849l290l771M89K472m327Q400N722M234l062m439p150O682j3405
13870i285j258J8682J1894K439l443m245o867J644R57j8076m933p70j392J4319
13856c34k192n24l192L134M157K677Q834K35j3741k654r872K872m849R067k785
13841i167L120J5797N791l209O20o386j1534q028j2720J3733J0299R25j166L801
$$ y = [-18442, -1352, -132, 4782, 4333, 3618, 1386, -14450, -19165, -13304, -18234, -27807, -26779, -16531, -20008, -28150, -23251, -8801, -8330, -2813, 503, 7591, 16340, 20617, 25588, 18297, 3861, 5304, 1005, -1217, -6614, 12921, 11244, -4766, -10638, -9330, 1538, 9052, 8177, 16074, 17536, 7468, -3252, -12434, -8365, 3503, -1665, 796, 3127, 1272, 3077, 8213, 2656, -2993, -3645, -6585, -4833, 6824, 12009, 2160, -1130, -4901, -4412, -1940, -6267, 2133, 7855, 12089, 9027, 4588, -2562, 4120, -9285, -10543, 8139, 20033, 22472, 19029, 14784, 7917, 9561, 10518, -7558, -12491, -13261, -14653, -334, -2526, -3050, -6242, -3108, 1049, 3726, 12560, 12795, -946, -3600, -13472, -10600, -15449, -6382, -9167, -6047, 9750, 15541, 12332, 12952, 6566, -4968, -12996, -25716, -11983, -1684, -759, -1925, 1876]
13827A876k611J987j804j4394P924J784J7476M650o325Q37m698p014O305J3046
13813A9039k213j440j170K804j539l238J617N863j350O835o798j2815j1226N644
13799A3J7485J7793j918r082J560M939j25j4400r054J6106P809j4064q580J3280
13785B1762R146L018j792M806k51l992o026J780q190J4560l733l1766J534J256
13771B112K891J4662K394M922r393J5772P194R931q311k519J4977m822n554j811
13757D2445K158o222j4430j051K7415l39m462J0355J1974n023l133n312j2956
13744D1419r417L818L00M733J0037J1189O82j6583J585j269M687L144p14L985
13730E7596q689l066n015P661M5R102m322j4701M550J2603J4386j1326k595O388
$$ y = [1876, -735, 1252, -552, -14946, -7022, -5238, 12238, 16888, 10563, 11400, 6702, -312, 5993, 19039, 16826, 15386, 14216, 17020, 15481, 12243, 13860, 19723, 18373, 25208, 18410, 5595, -5631, 13, 17498, 35291, 33373, 24291, 25851, 30790, 30665, 16265, 7211, 23317, 31126, 17062, 8482, 21762, 30908, 33926, 32134, 36940, 36689, 32697, 26671, 28451, 20261, 34821, 31088, -678, 856, 2112, 5003, 19665, 22059, 26981, 17588, 33360, 40554, 50485, 42174, 39655, 54632, 49810, 44256, 42445, 44603, 38381, 23951, 22900, 50315, 49976, 45514, 55869, 67843, 62820, 59687, 54375, 41419, 32002, 35820, 36120, 40853, 50890, 62079, 62761, 46178, 47763, 46494, 51181, 54325, 53611, 57596, 48907, 45841, 40826, 48487, 48532, 57634, 53312, 38611, 43161, 55764, 70150, 58824, 56229, 62617]
13716F2617P096k862o744O081p131L173L901j432l977J0772M426o438J3846M303
13702H7631N47n114j3760j099k505N324q219n593o015m096J4020J044k224k0777
13688C9164Q13M700n217J0410P066J4255N09l11R228l626j0238k585j0899l895
13674D9374J3700J5900O222j0728p327m464K336q92j1257L939K345n915O222J4957
13660G4412n024j202K667j073N269J4320j200k1207O476P350r227m624K105P204
13646G6246M400J577J233k512n210P38o785q276N470K3429L143Q59O596j706o853
13631I2349j2308p427J800L679J826j451o706O2Q36J248p777M409j0610j0087
13617D9843J5662O730J4789j1030k2447j424J0001R494O644j4937K628J4505n809
$$ y = [62617, 69713, 66851, 60107, 66188, 59057, 62230, 66131, 64699, 60722, 71494, 75920, 69482, 83328, 87631, 88178, 83064, 69304, 68205, 65700, 71024, 62805, 57212, 51197, 47101, 61121, 62165, 59941, 39164, 39977, 44677, 39460, 49870, 56936, 71191, 71700, 71389, 80617, 76991, 66753, 64168, 53269, 49374, 63074, 78974, 85196, 74468, 67141, 62677, 65013, 64121, 52864, 56803, 59148, 53233, 59455, 74412, 69388, 68186, 70853, 69780, 75049, 89369, 88169, 66962, 73438, 80788, 71561, 66937, 69042, 76246, 80646, 82223, 83456, 80944, 75734, 76472, 69687, 61411, 66881, 90310, 93453, 94312, 100908, 99202, 92349, 80041, 72614, 74414, 78093, 79919, 78468, 71762, 71824, 72660, 73908, 66131, 70540, 59930, 49843, 65505, 72235, 87024, 75994, 53547, 52123, 62124, 71618, 78262, 63325, 65953, 80458, 74649]
13604G4649j0904k310P425P159L34k702p558J6369q7l0885k075Q245n02o357p465
13589D3336N83J1261Q674q044j2172K709P714m577R727J2002p450k428J347J302
13575F3984J057N780k030O292J1030n941j6914J0930j046o980n293k998K111L413
13561F3395J1204R852p498P76n308k7O456J163l500n066j6091j2323N710P648
13547E6391j2544k897P168J0303J4543k373l955j567n647J6578J865j1675j1878
13534E4312m01m974o157N440J5638N921J2483m122o069P052P581N346n149k210
13520H4691O479L017j7726j0623Q264K3478J2982R303k0636j302l879J2019R493
13507A15560m793M191m062p514j1434L658J1501K855j3732P755J1205J367O193
$$ y = [74649, 63745, 61435, 68860, 76019, 76353, 73651, 66093, 82462, 82375, 51490, 49415, 57660, 57158, 50801, 43336, 43919, 55180, 63854, 55810, 43638, 46347, 54061, 49484, 59211, 71213, 63763, 61335, 62682, 63984, 65041, 70821, 68791, 75083, 86113, 80172, 63258, 74188, 73142, 66162, 60869, 57871, 59982, 63395, 74599, 84451, 76953, 77729, 72421, 72394, 78850, 80013, 76513, 71447, 55356, 43033, 48743, 56391, 43847, 40950, 48118, 58421, 72964, 70591, 66636, 65069, 59422, 76000, 77865, 66190, 54312, 53911, 48937, 42780, 48220, 63858, 69779, 82262, 78140, 72071, 79123, 86704, 92050, 86901, 84691, 91170, 94187, 76461, 65838, 74102, 97580, 110562, 119865, 99229, 97927, 94048, 106067, 115560, 110767, 114958, 110896, 103382, 91948, 95606, 107107, 109962, 96230, 103985, 115190, 116557, 122750]
13494A22750M487j898J2783M718k432j4835k673n40j732R898n921j1385J1913
13481A25133J8767R130Q658j4812k2314k581M055Q789K2382J2569R578m997j030
13468A73327l925j0555l246J5194J4270J2821p389m584K6981J439k413o639J1516
13455B16797J5035m411n5M433J3926r140j0043p13J2261R2J1094N222Q422J7074
13441B79994Q342K690j962O146R855J1773J77l814l556Q934N19N92J1279P328
13427C38297J2385J4312J9177K0811M179p877R104k253M253J1763J570J5646K1406
13414D62773K6666R240N355J3244J7466J8556J851J2290J7441J1145J8693K8105
13402F42825J7133j4003N515K2468J3731K7483K9699J4447Q804K1249J3755K8067
$$ y = [122750, 127237, 125339, 138122, 142840, 140408, 125573, 122900, 122360, 120628, 130526, 124605, 113220, 125133, 143900, 153030, 161688, 146876, 124562, 121981, 126036, 134825, 157207, 169776, 179354, 174357, 173327, 169402, 158847, 155601, 170795, 185065, 197886, 190497, 185913, 212894, 214333, 211920, 205281, 216797, 231832, 227421, 227366, 231799, 245725, 236585, 226542, 225829, 238090, 238182, 249276, 254498, 262920, 279994, 288336, 291026, 289064, 295210, 305065, 316838, 317015, 313201, 309645, 318579, 319098, 319690, 330969, 338297, 350682, 364994, 384171, 404982, 409161, 401284, 410388, 408135, 412388, 424151, 425721, 441367, 462773, 489439, 498679, 504034, 517278, 534744, 553300, 555151, 567441, 584882, 596027, 614720, 642825, 659958, 645955, 651470, 673938, 687669, 715152, 744851, 759298, 768102, 789351, 803106, 831173]
13390H31173K2409L6955K3738R798K1263J0826K3648L7311J5884J6803L9117J0951
13378A099876J4009M1087L5247L0978L0874L5386K9368L0257L3534M0868L1139
13367A452623K6798L8841N9166N4467M1717M1279M3932K9798M5680M3237O1626
13356A939164P5383O1007N4288N5615O0701N6993N9430N8434N9024P7468P4418
13345B631925P3174O3795O5245P6867O6641Q0845R6078Q6649P9487Q6177Q5082
13334C491965P5358Q4474J03610J08703J11632R5383R1426Q5185J01214J07222
13324D456172R6868J11116J15953J05105R6226R6937J10072J27292J13768R3806
13314E523315J15005J17678J17512J04360J11730J33721J27554J11255J15363
$$ y = [831173, 853582, 890537, 914275, 924073, 945336, 956162, 979810, 1017121, 1033005, 1049808, 1088925, 1099876, 1113885, 1154972, 1190219, 1221197, 1252071, 1287457, 1316825, 1347082, 1380616, 1421484, 1452623, 1479421, 1518262, 1577428, 1631895, 1673612, 1714891, 1758823, 1788621, 1834301, 1877538, 1939164, 2014547, 2075554, 2129842, 2185457, 2246158, 2303151, 2362581, 2421015, 2480039, 2557507, 2631925, 2705099, 2768894, 2834139, 2911006, 2977647, 3058492, 3154570, 3241219, 3320706, 3406883, 3491965, 3567323, 3651797, 3755407, 3864110, 3975742, 4071125, 4162551, 4247736, 4348950, 4456172, 4553040, 4664156, 4780109, 4885214, 4981440, 5078377, 5188449, 5315741, 5429509, 5523315, 5638320, 5755998, 5873510, 5977870, 6089600, 6223321, 6350875, 6462130, 6577493]
13305F577493R1604R3933J03924J14940J15479J07812J09697R9346J05397J22049
13295G641674J06879R5558R8002J13525J10332Q6292P7001O9586Q4804R8991Q6081
13284H668725Q2979Q8629P2783P2188Q4129O2492N2903O4349O0863N2082O1063
13273I423185L9498M7325O0391M8969N1664L5998L4220J4082K8950L4796K6550
13262I845628J6787J7650M0647L0886K0604J4635J9463K0253J4877j135J9718
13251A0060013J3524J0303J4313J7727K541P024L271L892M598P608N678J340J2321
13238A0164153K7387J3370J7325J4366K396M760k20k3031K0245J4209O372K4303
13226A0285635J8751J8124Q854j93M804J1677J0698J7229O656j203m279L875N928
$$ y = [6577493, 6669097, 6763030, 6866954, 6981894, 7097373, 7205185, 7314882, 7414228, 7519625, 7641674, 7748553, 7844111, 7942113, 8055638, 8165970, 8252262, 8329263, 8398849, 8483653, 8582644, 8668725, 8751704, 8840333, 8913116, 8985304, 9069433, 9131925, 9184828, 9249177, 9310040, 9362122, 9423185, 9462683, 9510008, 9570399, 9619368, 9671032, 9707030, 9741250, 9755332, 9784282, 9819078, 9845628, 9862415, 9880065, 9920712, 9951598, 9972202, 9986837, 10006300, 10026553, 10041430, 10040295, 10060013, 10073537, 10083840, 10098153, 10115880, 10118421, 10125445, 10128716, 10132608, 10137206, 10144814, 10150492, 10151832, 10164153, 10191540, 10204910, 10222235, 10236601, 10238997, 10243757, 10243537, 10220506, 10240751, 10254960, 10261332, 10285635, 10304386, 10322510, 10331364, 10331171, 10335975, 10347652, 10358350, 10375579, 10382235, 10381032, 10376753, 10380628, 10386556]
13213A0386556Q658J5380J1748Q711q385k1083k655j753m592l917j7772m363K131
13200A0368664o461j2058j9937k6755j8726k0745l3448l0823k3027j4981J640
13189A0163343J7159L3407J9971j9944p3905j28505j43461j25089j06003r2014
13179I544959q9203q4545p7074q8090q3800r3683r6148r3758j01929r6374j05208
13168H535147j16824j07850j02273j05113j04489j05858r4547j08258j15197j14874
13158G459864j06453j18134j26169j06137j13729r8815j15052j13814j04754j08157
13148F348650q3167o2936o3526l4173N6981J36564J31382K3521j36219k84467
13138F032610l47065l15365k29346j81071j50280j20219j10502j12153j08441
$$ y = [10386556, 10395214, 10410594, 10422342, 10431053, 10422668, 10401585, 10398930, 10397177, 10392585, 10388668, 10370896, 10366533, 10368664, 10362203, 10350145, 10330208, 10303453, 10284727, 10263982, 10230534, 10199711, 10176684, 10161703, 10163343, 10180502, 10213909, 10233880, 10213936, 10140031, 10011526, 9868065, 9742976, 9636973, 9544959, 9455756, 9371211, 9294137, 9206047, 9122247, 9028564, 8932416, 8838658, 8736729, 8640355, 8535147, 8418323, 8310473, 8208200, 8103087, 7998598, 7892740, 7798193, 7689935, 7574738, 7459864, 7353411, 7235277, 7109108, 7002971, 6889242, 6790427, 6675375, 6561561, 6456807, 6348650, 6265483, 6202547, 6139021, 6104848, 6161829, 6298393, 6429775, 6453296, 6317077, 6032610, 5685545, 5370180, 5140834, 4959763, 4809483, 4689264, 4578762, 4466609, 4358168]
13129D358168j10636r9284r8563j05870j03575r8686q5532q3355o7545p5463p4319
13118C355340q6412p9161o8899o6332p1210q2769p6764n4644o9507p3290m9819
13107B576533l6254l2210l6493m5751l9184k0406M062L7984R9167J75018K06762
13096B889228J31385k0289j84111k77049k53688j88671j28937j02063o8489o1378
13086A735938m6620l8264m9381l3223m7175l3508j8717j8563l5087l0710k5388
13075A359302k3920l0395k5399k4630l8252k5885k2512k7894j9098r729j5274
13064A096314k4921k1275j4086j8695k0373k92j4636o943M493Q856L3752N8236
13052A080430O4922M3179R297m4807q7293r1279q2869m8231m3910l9678k2971
$$ y = [4358168, 4247532, 4148248, 4049685, 3943815, 3840240, 3741554, 3656022, 3572667, 3505122, 3429659, 3355340, 3268928, 3189767, 3120868, 3054536, 2983326, 2900557, 2823793, 2769149, 2699642, 2626352, 2576533, 2540279, 2508069, 2471576, 2425825, 2386641, 2366235, 2370297, 2408281, 2507448, 2682466, 2889228, 3020613, 3000324, 2816213, 2539164, 2285476, 2096805, 1967868, 1865805, 1797316, 1735938, 1689318, 1651054, 1601673, 1568450, 1521275, 1487767, 1469050, 1450487, 1415400, 1384690, 1359302, 1335382, 1304987, 1279588, 1254958, 1216706, 1190821, 1168309, 1140415, 1121317, 1111588, 1096314, 1071393, 1050118, 1036032, 1017337, 996964, 996672, 982036, 975093, 979586, 988442, 1022194, 1080430, 1145352, 1188531, 1197828, 1153021, 1065728, 974449, 891580, 843349, 799439, 759761, 736790]
13041G36790l2269j5335j8512j3827q245j1848j9384n636j1885k7128j7615j7345
13029E37761j7274j1065O044k96k9100j3290m888p693j4677j5350j4234n278l810
13016D06850k2296j5548k0867j0725j007L585O963J5104p6j0489p791m435j999
13003C37269m965q785K445j3539o845k488k2900o873j0195n797N185J882r1k1045
12989B43258p751O231N265m198j9210j0806k4217j4447K098R461J1822j2979L656
12976A88183k715k162K717j1940l62r274o739N176L730P914L460j7847j9061l268
12962A37812J6294K1044P55j4849n729l23M999J518j409l225L322O237M889k8233
12948A43102j8135n46M687j421R608J572r875l213k3107l556J4718N657J152M107
$$ y = [736790, 704521, 689186, 670674, 656847, 648602, 636754, 617370, 611734, 599849, 572721, 555106, 537761, 520487, 509422, 515466, 515170, 486070, 472780, 467892, 460199, 445522, 430172, 415938, 410660, 406850, 384554, 369006, 348139, 337414, 336407, 339992, 346955, 362059, 361983, 351494, 343703, 339268, 337269, 332304, 323519, 325964, 312425, 305580, 303092, 280192, 273319, 263124, 257327, 262512, 264394, 264303, 243258, 235507, 241738, 247003, 242805, 223595, 212789, 188572, 174125, 176223, 185684, 197506, 184527, 188183, 185468, 183306, 186023, 174083, 173721, 164447, 157708, 162884, 166614, 174528, 177988, 160141, 141080, 137812, 154106, 175150, 175905, 161056, 155327, 155004, 160003, 161521, 160112, 156887, 160209, 166446, 171335, 143102, 124967, 124421, 129108, 127687, 137295, 138867, 128992, 125779, 102672, 99116, 113834, 119491, 120643, 124750]
12934A24750j0012m989l610m193L804J8734J1949K416p80p355j0849l181k07j268
12920A15209l364q369j6996O988J5339J659J0656M354n410N261p823r931J7116
12907A24689K2492Q270j3239j5585j1205j0342n523J3817K466n997o938n824k197
12894I4884P364J745J7995O783j286o140l14j3287n058K849P48J1661J0613j0311
12880A18246j4421L436k423j2082r716N631J4632O410O725Q595q235j5377N653
12867A07074P959M191n381N286p332j2701Q408K276M641m012m376q357k518l914
12853I1244J0062P082o533J832J6138k350k4224j4260Q237R045P502J4766N166
12840A23707j1444L710K230m338k981j0783n360p175n263j120L033J20J3337J0284
$$ y = [124750, 114738, 109749, 106139, 101946, 105750, 124484, 136433, 138849, 138069, 130714, 119865, 116684, 116477, 115209, 111845, 103476, 86480, 93468, 108807, 110466, 121122, 125476, 120066, 125327, 117504, 107573, 124689, 147181, 155451, 142212, 126627, 115422, 105080, 99557, 113374, 115840, 109843, 102905, 97081, 94884, 102248, 103993, 121988, 128771, 127485, 121345, 121031, 107744, 102686, 105535, 106283, 117944, 128557, 118246, 103825, 107261, 104838, 92756, 83040, 88671, 103303, 109713, 116438, 125033, 116798, 101421, 107074, 115033, 119224, 113843, 119129, 111797, 99096, 107504, 109780, 114421, 110409, 106033, 97676, 95158, 91244, 101306, 108388, 101855, 103687, 119825, 117475, 93251, 78991, 87228, 96273, 103775, 118541, 123707, 112263, 115973, 118203, 113865, 110884, 100101, 94741, 87566, 82303, 81183, 84216, 84336, 97673, 107957]
12826A07957q319j0478J0069J3129J113M489k091o645p805m482O29J0083j1701
12813I5948J854K42K342l141N55L839J5757j696k0804j0534l819M879J2397N180
12799A02999l368l172l354j2499J1572J4921K403Q245Q88M517Q692j7897r327
12786A04620j1018K664j2908j2642l073J0066J4826O844J1215r93j16j2804j0005
12773H6676n525N574N392K143m378j0576J97O759O354n490M044R279q778j0507
12759H1164M759q96J003j2750q753J321K539k762K2759L335k487m462n490j6739
12745F2541J228r147K75R508J540j4021O192N659J5049j2831N022l819j4082J8944
12731G2058N133q552o529l81Q131o81p334J530r998l398n176P960j28P86M954
$$ y = [107957, 99638, 89160, 99229, 112358, 113471, 117960, 115869, 109224, 101419, 96937, 97566, 107649, 95948, 97802, 98044, 100386, 97245, 97800, 101639, 117396, 115700, 94896, 84362, 80543, 85422, 97819, 102999, 99631, 96459, 93105, 80606, 92178, 107099, 109502, 117747, 118635, 123152, 131844, 113947, 104620, 93602, 96266, 83358, 70716, 67643, 77709, 92535, 99379, 110594, 109601, 109485, 96681, 86676, 81151, 86725, 92117, 94260, 89882, 79306, 79503, 86262, 92616, 87126, 91170, 100449, 91671, 81164, 85923, 85027, 86030, 73280, 64527, 65848, 68387, 65625, 88384, 91719, 89232, 84770, 79280, 62541, 63769, 54622, 54897, 64405, 65945, 51924, 58116, 63775, 78824, 65993, 71015, 67196, 53114, 72058, 77191, 68639, 62110, 61729, 69860, 69179, 61845, 63375, 53377, 49979, 44803, 52763, 52635, 53421, 58375]
12716E8375m926J569K942N169p819J956k61M605K795j3588j178J056q534M165
12702D6326Q237r965L422R167O436p973O866m182k7329L502R131Q471M253r07
12688E5455o953o124m417m734R992j800j268n572P768P526n546o708R703n428
12674D1894p366P969o057j6502J0276k147J1347K190n547J2828j308j7200p037
12661B3340J8272K616o997N384k105j7266k277o7n213J0658j560N368K575M126
12647C6854L782o435j6580k120M227J2566J6335j2729j0374R172J6625q398j0232
12634C2693p830n170J227J464m90o747r11R493J273m717m817o992j2225Q47K1527
12619A8625N626j6635j3393k962L549P630Q595K352K898L436N24k0241j4438R813
$$ y = [58375, 53449, 55018, 57960, 63129, 55310, 57266, 57005, 61610, 64405, 50817, 49639, 50695, 42161, 46326, 54563, 44598, 48020, 57187, 63623, 55650, 62516, 58334, 31005, 34507, 43638, 52109, 56362, 55455, 48502, 42378, 37961, 33227, 43219, 41419, 40151, 34579, 42347, 49873, 44327, 37619, 47322, 41894, 34528, 42497, 36440, 19938, 30214, 28067, 39414, 41604, 36057, 48885, 47577, 30377, 23340, 41612, 44228, 37231, 42615, 40510, 23244, 20967, 20900, 15687, 26345, 24785, 30153, 32728, 36854, 40636, 34201, 17621, 15501, 19728, 32294, 48629, 35900, 25526, 34698, 51323, 42925, 32693, 24863, 19693, 20920, 22384, 21894, 15147, 14236, 23729, 25002, 20285, 15468, 8476, -3749, -2902, 18625, 24251, 7616, -5777, -8739, -5190, 2440, 11035, 13387, 16285, 19721, 20245, 4, -14434, -4621]
12605d621J9313J2108q941l576O070J132L231M42k673L058j1858l343M63J1667
12591B2472Q987n716K303m595j4823m071k30P971R677j0957j1119O040J0281n852
12577A0368N656K0914q389o590P865p479j7269r942N957Q812J4963J3517J0981
12564D9364j9494j4777k741J0261K0491p777j3151k0569r240J8130K0271J6655
12552D7423J297l483N772K652M278J1241J8803R319j761k739K4817O7192J08786
12539B93597J48707J70641J86031J42060K9835o4185j10483j22646j18663j29229
12529D25665j06837o4288m6767m5899k6477j1902j0486j8900l2402j411O95l177
12517E7814l810r65p497k960j0579k359j0690j0925L269O262J983P421r33r672
$$ y = [-4621, 14692, 26800, 17859, 14283, 20353, 21485, 24716, 25158, 22485, 25543, 13685, 10342, 10805, 22472, 31459, 25743, 28046, 23451, 8628, 4557, 4327, 12298, 21975, 11018, -101, 5939, 16220, 10368, 16024, 36938, 28549, 21959, 29824, 22345, 5076, -4866, 1091, 9903, 24866, 38383, 49364, 29870, 15093, 12352, 22613, 43104, 35327, 22176, 1607, -7633, 10497, 30768, 47423, 48720, 45237, 51009, 53661, 57939, 69180, 87983, 97302, 95541, 92802, 117619, 184811, 293597, 442304, 612945, 798976, 941036, 970871, 906686, 796203, 673557, 554894, 425665, 318828, 254540, 207773, 161874, 135397, 123495, 113009, 94109, 61707, 60296, 60991, 57814, 54004, 53039, 45542, 42582, 32003, 29644, 18954, 8029, 11298, 17560, 19543, 26964, 26031, 16359]
12503A6359j3688m672J617k305m64J1959J144O339O970J988J2664Q386k1714k1583
12489C000l878N212n959P833L74M802O173L569O45j565p822j2657j1326Q703J7625
12474A4729K8488j4555j4099J8383k641n896l468P085l037l071j449L674l965
12461B0178J626l568j2560P048J984l888m312m150j4626K0140M081J197M961p797
12447A0314K725k320L586R301o685j533n203r138P181J1008N571L932m117j3695
12433A0927J3320K1934p987K663N104M881K906j0961j8164j2563K326m685P872
12420A7573M128J45j700j861K418Q476L369j0503q884J1158M14o782p981R921
12406A9891q152J217N669M692J277j0968J2142J2787m766q767o114j1336j5489
$$ y = [16359, 2671, -2001, -384, -2689, -3153, 8806, 9950, 16289, 23259, 25247, 37911, 46297, 24583, 3000, -878, 4334, -1625, 6208, 6582, 11384, 17557, 21126, 21771, 20206, 12384, -273, -11599, -2896, 14729, 43217, 28662, 14563, 32946, 30305, 24409, 20941, 28026, 24989, 21918, 20469, 24143, 20178, 21804, 18236, 5676, 12724, 14708, 10820, 6508, 2358, -12268, 7872, 11953, 13150, 18111, 10314, 13039, 10719, 14305, 23606, 16921, 15388, 10185, 1047, 8228, 19236, 24807, 28739, 24622, 10927, 24247, 46181, 38194, 40857, 45961, 50842, 53748, 42787, 24623, 12060, 14386, 9701, 17573, 21701, 21846, 20146, 18285, 20703, 29179, 32548, 22045, 13161, 24319, 24733, 17951, 9970, 19891, 11739, 12956, 18625, 23317, 24594, 13626, 25768, 38555, 33789, 25022, 18908, 7572, -7917]
12393g917r94l412L809j381o522k291Q067N897L021J104Q400k095j600l00L086
12378F872n495J627O789J9036K219j3199P26M914R200L48J053J9j5964j1155L93
12363G383Q934K2148J0257o416j4856p675j3497p710r986K186J3703Q431K443
12350A5345Q35j992o629M346R234K1349l846j2602M514p034q602L88r354l420
12336B532N723K1629R753j9542K988p560r726n948j1660n233j771j264N347J0263
12322d469q896J8333J1226l691m588Q995J0009R995N463L711j6689r617lP483
12308B7262j237o185j0621p39J0923M442l121M076J2303J0751J4225J9802J890
12295H3771n256j1312r534j6853K734m935j1694L922p21l881O943M462N339R99
$$ y = [-7917, -8911, -12323, -8514, -9895, -16417, -18708, -10641, -4744, -1723, -619, 7781, 5686, 4086, 3786, 6872, 1377, 3004, 9793, 28829, 31048, 17849, 18575, 23489, 32689, 33037, 34090, 34109, 18145, 6990, 7383, 16317, 38465, 48722, 42306, 27450, 19775, 6278, -1432, -11418, -9232, 4471, 12902, 15345, 16180, 14188, 7559, 11905, 21139, 42488, 38642, 26040, 30554, 23520, 14918, 15306, 5952, 2532, 8255, 29884, 39637, 20095, 23083, 15523, 5797, -151, -11811, -17044, -18815, -20079, -14732, -4469, -13365, 4968, 16194, 12503, 7915, 16910, 26919, 36914, 42377, 46088, 29399, 19782, 19779, 27262, 26025, 19840, 9219, 8480, 19403, 23845, 20724, 24800, 37103, 47854, 62079, 81881, 83771, 78515, 67203, 57669, 40816, 43550, 38615, 26921, 30843, 30122, 26241, 33184, 37646, 42985, 43984]
12281D3984k221j2136M00M181K482L608L253r507J587k654J5658M514J023J0826
12267F4998N141m21R266J863P723J4468K379j6451j2676j4946j5926L13J541m626
12253D2646j878o717k678O859j732l440Q29J746K254r526L774M904r87j9926j4492
12238A636N939J902o227J8063K4363K3705J3072j609O420r039J11q387k5995j8214
12224B5740J5891J2895m160j4876l573k1716r752J2675Q935j3098Q2o778k5844
12211b3579O974K6689J2178Q231j6625K136n68j26j2773R142k8q861o141N789
12197B438J79l2P211j0208J91l272q32M068l707L632N163N380N781O914j721O022
12181B7207r536p536n788J0891J864j0347p333L3274J1558r911p819j4805j3662
$$ y = [43984, 41763, 29627, 30027, 34208, 36690, 40298, 43551, 34044, 35631, 32977, 48635, 53149, 54172, 64998, 70139, 69718, 78984, 80847, 88570, 103038, 105417, 88966, 76290, 61344, 45418, 45731, 47272, 42646, 40768, 34051, 31373, 38232, 36500, 33060, 33889, 35635, 37889, 28363, 32137, 37041, 36054, 16128, 1636, 7575, 9477, 3250, 21313, 45676, 69381, 82453, 80844, 87264, 78225, 78336, 69949, 43954, 25740, 41631, 54526, 50366, 35490, 31917, 10201, 449, 13124, 22059, 8961, 9043, 2265, -23579, -16605, 10084, 22262, 30493, 13868, 16004, 15436, 15310, 2537, 11679, 11651, 2790, -3351, 2438, 2617, 2585, 9796, -412, -221, -3493, -4325, -257, -3964, -332, 4831, 10211, 15992, 22906, 21185, 27207, 17671, 10135, 4347, 15238, 17102, 6755, -578, 32696, 44254, 34343, 26524, 11719, -1943]
12168a943q843j1271O498R626J7493m322j7270j637J2755N081j7582j507J6673
12155C751J5206J1207r731J0363L21j2912l185J416n876k57K642j1207J058O830
12141I626J7249m6j6769q45j934J946n991O503L862q245M381Q12m823P18P775
12126A4219p593j832P659J8220r069m436K074N620J1033K275Q822P032J8665J5852
12112H8541J1210k981j6760o146M891j9010r970N624m241o681N614j2043j1841
12099B6207N145J317n112J693k82R58K78L81j956O473j4923p934L416k010N642
12084A9293J6984J1646k215p525k105J7194O243J5192J2142P208o310j226J1482
12071I8003J3963j0802m393M713k1681l802j1844p190n991o063J4408l358j6125
$$ y = [-1943, -10786, -22057, -15559, -5933, 11560, 7238, -10032, -11669, 1086, 6167, -11415, -12922, 3751, 18957, 30164, 20433, 30796, 31117, 18205, 15020, 16436, 10560, 10303, 12945, 1738, 2796, 9626, 26875, 26829, 10060, 9215, 7281, 9227, 3236, 9739, 13601, 5356, 9737, 10549, 5726, 6444, 14219, 6626, 4794, 12453, 30673, 21604, 17168, 19242, 24862, 35895, 38170, 46992, 54024, 72689, 88541, 99751, 96770, 80010, 73864, 78755, 59745, 49775, 55399, 51158, 44477, 50091, 38048, 26207, 31352, 32669, 27557, 29250, 28968, 29926, 30204, 30585, 28629, 35102, 20179, 12245, 15661, 13651, 19293, 36277, 47923, 45708, 38183, 36078, 53272, 59515, 74707, 86849, 94057, 87747, 86521, 98003, 111966, 101164, 96771, 101484, 79803, 76001, 64157, 56967, 50976, 44913, 59321, 55963, 39838]
12058C9838j896O563j785o374m465n262j2275o885O400R120o05j104N115J2688
12044C9073j2046k379l769L687n268J543k733m489j0868R074J2152N651j724l477
12030B4427K1654J2583O137M007J455R13k27k986n27q154o930J423M644l325J154
12015E6248m616l542M582m516O084j803P205O574J2506p804j0212j0081j2738
12002C7887n978j0614q877n985J1J7735O883M221n754O097k25R284O875Q716O007
11987F6283N797J9834J1007L056k6515j8103k291n293l952m01o117L98m771j2138
11973B6794k988Q779N451p713p045O51p103M50N999l762r023Q311J1189o279O46
11958B4357j7930m333q089J4290Q640P192N192r158K343J8584q108j06R723J2689
$$ y = [39838, 37942, 44505, 42720, 36346, 31881, 26619, 14344, 7459, 13859, 22979, 22374, 21270, 26385, 39073, 27027, 24648, 20879, 24566, 19298, 20841, 18108, 13619, 2751, 11825, 23977, 29628, 27904, 24427, 46081, 58664, 64801, 68808, 70263, 71176, 70949, 67963, 67436, 59282, 52352, 53775, 58419, 55094, 56248, 51632, 48090, 52672, 48156, 54240, 52437, 59642, 66216, 78722, 70918, 60706, 50625, 37887, 31909, 21295, 12418, 6433, 6444, 24179, 31062, 35283, 29529, 35626, 35401, 44685, 51560, 60276, 66283, 72080, 91914, 102921, 105977, 79462, 61359, 59068, 53775, 49823, 49422, 43305, 43703, 38932, 26794, 23806, 32585, 38036, 30323, 23278, 23929, 16826, 17276, 23275, 19513, 10490, 18801, 29990, 23711, 24357, 6427, 2094, -5995, 8295, 16935, 24127, 29319, 20161, 22504, 41088, 32980, 32874, 42597, 55286]
11944E5286J1560J1496n655j6672j4500j156K902J2557J151o317M616J1113j0932
11931E5449k4517j7435M58l260m431k407J7295J0112j666m80j1710j670M43j1033
11917E148q062K3724M534o87r353n418J5728o275m025L20K883j769O330J6252
11903C9330j0152o350j2930o207l220J194q442K335J2370J0249O8j0100j0831
11890b686L702P495J997K18l614r847k453J0467K854j0129N276J2144J3868l846
11876B5446o176k947L366n187m241q690P96J4774L377q161j2739K642q38J1478
11862A2900M826K49L919r09Q238o484p040L532J1329K91m619m605o893j426j0246
11847C062o645N145J3484j740k0304o043Q409K696j044n097Q627J842K835n50
$$ y = [55286, 66846, 78342, 72687, 56015, 41515, 40359, 43261, 55818, 56969, 50652, 55268, 66381, 55449, 30932, 13497, 13955, 10695, 6264, 3857, 21152, 31264, 29598, 29118, 17408, 15738, 16181, 5148, -2914, 20810, 25344, 24657, 15304, 9886, 25614, 19339, 15314, 15634, 18517, 16748, 23078, 39330, 29178, 22828, 9898, 3691, 471, 1665, -6777, -4442, 7928, 18177, 18245, 8145, -2686, 1016, 8511, 10508, 10726, 7112, -2735, -5188, 5279, 8133, -1996, 3280, 15424, 29292, 25446, 19270, 16323, 19689, 14502, 10261, 1571, 2367, 17141, 20518, 12357, -382, 2260, 1422, 12900, 17726, 17975, 21894, 20985, 29223, 22739, 15699, 19231, 30560, 30851, 26232, 21627, 14734, 13308, 3062, -3583, 1562, 15046, 13306, -6998, -13041, -4632, -1936, -2980, -8077, 550, 2392, 5227, 4677]
11833D677O217m973J1044L214o511j4696m442K9R842J4680N075o754Q799L812
11819C0013j1441j0081N943O240m840k550o789o520J2019N707P370l527n146j824
11805A4574o808M092k75k235k581O142M435m0Q045P5r873j3067o49J1478R803
11790B3116j2169m030P504J5777R574j1956j6752m759j718J2567m46J641l680
11777A4669j3291l120K176J4401Q179l219j7133K862O139o180j0252k006Q099
11764A324P275R454K678l232j4048O405R436L292j0451j0492J1022N985M429l109
11750A9968L494P749q759m512n810O47Q113R961j242j0113n705k140L618J159
11736A6428j195N366J1244Q033K639j1000m905k768L19o86L309O505M06j1965
$$ y = [4677, 10894, 5921, 16965, 20179, 13668, -1028, -5470, -5441, 4401, 19081, 24156, 17402, 26201, 30013, 18572, 8491, 14434, 20674, 15834, 13284, 6495, -25, 11994, 17701, 25071, 21544, 16398, 14574, 7766, 11858, 11583, 9348, 6767, 12909, 17344, 17304, 25349, 25424, 15551, 2484, 1835, 13313, 23116, 10947, 6917, 14421, 30198, 39772, 27816, 11064, 6305, 4587, 17154, 16708, 18349, 14669, 1378, -1742, 434, 14835, 23014, 19795, 2662, 5524, 11663, 5483, -4769, -6775, 1324, 8599, 18053, 20731, 17499, 3451, 9856, 19292, 22584, 12133, 1641, 12663, 18648, 23077, 19968, 23462, 31211, 22452, 17940, 12130, 12777, 20890, 30851, 29609, 19496, 13791, 11651, 15269, 16428, 15233, 20599, 31843, 39876, 42515, 31515, 26610, 23842, 24161, 23475, 26784, 33289, 33695, 21730]
11722B1730r10K13l602J2077M647j1020k503O914J8461Q746j0285j9557J2787
11709C7698J765k330J0841O513m907p766L029J0141l905j2160j4067N311J2343
11696D2506j3844P964J6466j3362j000P24L658N691J848l07o698N033n221l378
11682D0080j2337Q702J3592q38j6914r074M885j0169J5428O981m615J5031O01
11669E1353k484L201o3K276K868L212m077n27L30o117R448N582o457n528Q476
11654F1493k976k496l999n42J528Q770O186j320l434k0277o030M914r549K434
11640C4702R687Q354J0089p139j1763K186J1179q242K199M270q093m120N747k646
11626D6410J642J539J919k528J883j2392O643K740k1640K553O563M020k230l217
$$ y = [21730, 20820, 21033, 17431, 29508, 34155, 23135, 20632, 27546, 46007, 54753, 44468, 24911, 37698, 39463, 37133, 47974, 54487, 49580, 41814, 44843, 54984, 51079, 38919, 24852, 30163, 42506, 28662, 36626, 53092, 39730, 38730, 39454, 43112, 48803, 50651, 50344, 43646, 48679, 43458, 40080, 27743, 36445, 50037, 49199, 32285, 23211, 28096, 17927, 33355, 40336, 35721, 50752, 51353, 48869, 52070, 52007, 54283, 57151, 60363, 56286, 55759, 56089, 49972, 59420, 65002, 58545, 53017, 61493, 58517, 56021, 52022, 51480, 53008, 61778, 67964, 66644, 63210, 42933, 36903, 41817, 32268, 34702, 44389, 52743, 62832, 55693, 43930, 46116, 57295, 49053, 51252, 55522, 47429, 43309, 49056, 46410, 48052, 49591, 51510, 48982, 50865, 38473, 45116, 47856, 26216, 28769, 35332, 39352, 37122, 33905]
11612C3905N456k746K244K721R419p679Q20K430m895l128L998k241J1313j2634
11598C8983k711O628J4493j1729j4332J0446O533k2082O067K0317J4113K948p541
11585F2133k428J3022j7242j2614L597m06K99J2289k374q632J315J4678j5031
11572D8606M215J1904k0K967O295j951R735q341j0539m194N858J5442p26q212
11558G1039j6539m294P789N28j5489m03j877P468o489J484O95l532N202K1337
11544F6919N7p078l527p107J336M313n190k430J3406o983r61R856O251M739J019
11529G4620K045J05N060L474q360K616J0326J3861l304N115j1030k0260j2324
11516F1944P796J3281o829o616m924K0694q235J372R772N791q661k766J5091q966
$$ y = [33905, 39361, 36615, 38859, 41580, 50999, 43320, 44140, 46570, 41675, 38547, 42545, 40304, 51617, 38983, 36272, 42900, 57393, 45664, 31332, 41778, 48311, 26229, 32296, 52613, 66726, 69674, 62133, 59705, 72727, 55485, 42871, 46468, 46062, 46361, 58650, 56276, 47644, 48959, 63637, 48606, 52821, 64725, 64705, 67672, 73967, 72016, 81751, 73410, 62871, 58677, 64535, 79977, 79251, 71039, 54500, 50206, 57995, 58523, 43034, 42631, 40754, 48222, 41733, 43217, 43912, 40380, 45582, 66919, 66976, 59898, 56371, 49264, 50600, 54913, 49723, 47293, 60699, 53716, 52755, 62611, 68862, 73601, 74620, 76665, 76770, 81830, 85304, 76944, 79560, 89886, 103747, 100443, 105558, 94528, 74268, 61944, 69740, 83021, 76192, 69576, 64652, 85346, 77111, 78483, 88255, 94046, 85385, 82619, 97710, 88744]
11502H8744m866Q171j0739j7730K308O432o693K15J1903J0102J060o165N855O43
11488H9240j3197r557j15n65M504R456l883m098j2802o547l212J1553P35j2160
11474D9352R395J5677O888o035r677k716q634n302l85n508m919L642R812l266
11460D8324p139R073J7373j2323m712K960L450J4130J0546l018j1871J0142J5448
11447I2383l122L121J6109J8949J2379K7442M2392K6227K9977J8440J5590Q504
11435C08391J0043j457k3463k9691m3581l8204r423j663j798j2621j3566j7330
11423A25637j1983l965J025J3544n243K735p864l459p650J417P861R179Q871J017
11409A31122m432j4027p326q565P23K875k116K648p272m884K587O751M555R061
$$ y = [88744, 83878, 92049, 81310, 63580, 65888, 72320, 65627, 65842, 77745, 87847, 88907, 82742, 88597, 89240, 76043, 66486, 66371, 65806, 70310, 79766, 75883, 71785, 58983, 52436, 49224, 60777, 61512, 49352, 58747, 74424, 81312, 75277, 65600, 62884, 54250, 48948, 48563, 43055, 38136, 41778, 51590, 48324, 41185, 50258, 67631, 55308, 50596, 53556, 57006, 71136, 81682, 78664, 66793, 76935, 92383, 89261, 92382, 108491, 127440, 139819, 167261, 209653, 235880, 265857, 284297, 299887, 308391, 318434, 316977, 293514, 263823, 220242, 182038, 172615, 170952, 169154, 156533, 142967, 125637, 113654, 109689, 110714, 124258, 119015, 121750, 113886, 110427, 102777, 104194, 112055, 121234, 130105, 131122, 126690, 112663, 105337, 96772, 97495, 100370, 98254, 100902, 93630, 88746, 91333, 98084, 102639, 111700]
11395A11700Q99M327q825j1388J931K0193n470j3072K252r226j8799l490J4944
11382H5976R059p05l408j516j440O366n331j2451K88J278K774Q273N587q50p442
11367H6458j167J0331m424j3621J1450J953q149M300O044J0580M789r221q405
11354I0918j6564j7672R36J9163J2223O397N19j0232K183Q164l546j020J3141
11341A04610R005j5613m206O230k861N27K411O942R527j1967J316K0354l775p810
11327A14690k255N009r594j3266J8126N038j6733P178J078P109R303J173j8240
11314A08616K182J6511J0996k825j4558k57N568J7481l471l266o308K172J39J1263
11300A44243m638o171O291J2252J7111K183k626m675l926J0351J7880N453j1436
$$ y = [111700, 112599, 116926, 108101, 96713, 98644, 118837, 113367, 100295, 102547, 93321, 74522, 71032, 85976, 95035, 94330, 90922, 89406, 87966, 94332, 89001, 76550, 76838, 78116, 80890, 89163, 94750, 93900, 86458, 85291, 95622, 91198, 77577, 89027, 90980, 82831, 87131, 93175, 103755, 108544, 99323, 90918, 74354, 56682, 57618, 76781, 89004, 95401, 95920, 85688, 87871, 96035, 92489, 91469, 104610, 113615, 98002, 93796, 100026, 97165, 97692, 100103, 107045, 116572, 104605, 105921, 126275, 122500, 114690, 112435, 117444, 107850, 94584, 112710, 117748, 101015, 108193, 109271, 116380, 125683, 126856, 108616, 110798, 127309, 138305, 135480, 120922, 120665, 126233, 143714, 140243, 136977, 130669, 132841, 132980, 144243, 139605, 133434, 139725, 151977, 169088, 171271, 168645, 163970, 160044, 170395, 188275, 193728, 182292]
11287A82292j0145R507J600L298K383J2491J5997K6813K4983J0253J4215N716
11275B99403J2159k612N999J6510J1340j92P096J3350N149j3022L297J4592J0037
11262C83106J662J0706p282j0736j2754O614P018K752L93J185L671j757l813K736
11248C83501j424k338j6795k296N796P676l301j4412k5200j3125Q01M556n735
11235C17704m92M136Q138o523k043j1292j2010M730J1291q030p65L636o688J337
11221C03129J4085L199J7113P881n456J6375K1581P808R651J4764J9014J8511
11209D47655J6100K6187J2490J0022L560J1160J7754J9846K2793K0133Q977P963
11197F24640J8025K4608J3789J626J4122K3140P749J6231J9771J3849P335n821
$$ y = [182292, 172147, 181654, 183254, 186552, 188935, 201426, 217423, 244236, 269219, 279472, 293687, 299403, 311562, 308950, 314949, 331459, 342799, 342607, 349703, 363053, 368202, 355180, 358477, 373069, 383106, 384768, 395474, 388192, 377456, 364702, 371316, 378334, 381086, 381479, 382664, 386335, 384578, 380765, 383501, 382077, 379739, 362944, 360648, 366444, 374120, 370819, 356407, 331207, 318082, 318883, 323439, 317704, 317212, 321348, 329486, 322963, 320920, 309628, 297618, 302348, 313639, 305609, 304844, 308480, 301792, 303129, 317214, 320413, 337526, 345407, 339951, 356326, 377907, 385715, 395366, 410130, 429144, 447655, 463755, 489942, 502432, 512454, 516014, 527174, 544928, 564774, 587567, 607700, 616677, 624640, 642665, 667273, 681062, 682688, 696810, 719950, 727699, 743930, 763701, 777550, 784885, 779064]
11185G79064k613o073P435J7372J3136J9935R353J5942N520J1219J128q637N447
11172H68228k475l211j5239k0284M283Q188l471k461J4496J1144P630j3700j9579
11159H33549q347J6114J0785n122j38l309R142O283J2830O399j585L3152K8905
11146I38658J5958L1293L4066L7613M6553L1494J8773J2236R156K5654j288J2161
11134A212327K1231J9466J9913J2077K4261L6247M5384M2333K0513L9180M4490
11123A537422M9229O2077O1151N4545O1200O6138P3015P6243P5201Q2403P8119
11112B276743Q0287Q6295P6736P7013Q8745J05223J00984J16661J00463R9440
11102C208590J20980J32152J36576J25387J43816J63521J47470J47567J45721
$$ y = [779064, 776451, 770378, 777813, 795185, 808321, 828256, 837609, 853551, 859071, 870290, 871418, 862781, 868228, 865753, 862542, 847303, 827019, 831302, 839490, 836019, 833558, 848054, 859198, 866828, 853128, 833549, 825202, 841316, 852101, 846979, 846841, 843532, 852674, 858957, 871787, 878186, 876601, 909753, 938658, 954616, 985909, 1019975, 1057588, 1104141, 1135635, 1154408, 1166644, 1175800, 1201454, 1200166, 1212327, 1233558, 1253024, 1272937, 1285014, 1309275, 1345522, 1390906, 1433239, 1453752, 1492932, 1537422, 1586651, 1648728, 1709879, 1764424, 1825624, 1891762, 1964777, 2041020, 2116221, 2198624, 2276743, 2357030, 2443325, 2520061, 2597074, 2685819, 2791042, 2892026, 3008687, 3109150, 3208590, 3329570, 3461722, 3598298, 3723685, 3867501, 4031022, 4178492, 4326059, 4471780]
11093D471780J57103J66296J66562J74068J77977J78839J60370J77809J72727
11084F003531J69864J66795J70018J50067J45123J52841J41956J39303J31736
11075G371234J23782J20231R0232P1968O4702O2847L6225M4285J9748P465P802
11064H020521l4044l7214k3525m3302o8454o4523p6244q2563p1783p7644o8218
11053G373007m4888o7035r8421j13104j26279j24410j26565j03045q3161o4527
11043F421572o0048p2584o0428k8482l3122n749k213J0991K701J2888K7858K9822
11031F243206L4835M1989N6413O3840Q5534J04752J17300J48292J55189J52885
11021G204235J78905J74736J83802J83450J98943K05609K24745K26195K54419
$$ y = [4471780, 4628883, 4795179, 4961741, 5135809, 5313786, 5492625, 5652995, 5830804, 6003531, 6173395, 6340190, 6510208, 6660275, 6805398, 6958239, 7100195, 7239498, 7371234, 7495016, 7615247, 7705479, 7777447, 7842149, 7904996, 7941221, 7985506, 8005254, 8012719, 8020521, 7986477, 7949263, 7925738, 7882436, 7813982, 7749459, 7673215, 7590652, 7518869, 7441225, 7373007, 7328119, 7261084, 7162663, 7049559, 6923280, 6798870, 6672305, 6569260, 6486099, 6421572, 6361524, 6288940, 6228512, 6200030, 6166908, 6161159, 6158946, 6169937, 6172638, 6185526, 6213384, 6243206, 6278041, 6320030, 6376443, 6440283, 6525817, 6630569, 6747869, 6896161, 7051350, 7204235, 7383140, 7557876, 7741678, 7925128, 8124071, 8329680, 8554425, 8780620, 9035039]
11012I035039K69437K72184K70944K84282L03837L00220L02201K95327L05252
11003A1638723K81607K64082K57790K55588K45346K28906K09588K11485J92414
10994A3785529J63575J48249J25297J12752P6330N0696L6228J2398j4426m6422
10984A4450206q1537r1870r6310j28462j57151j81019j98419k04440k15461k32622
10974A2862915k46202k60280k68490k81452k79560k65239k91027k90129k81018
10965A0399518k89049k73612k84424k78644k65746k46347k49431k43967k29886
10956H038412k07676k10811j89364j49422j59766j47053j44644j30686r8188r6109
10946F504693r4551o9424n7423n9568m3906l7963l1428j8788k5838J4191K9933
$$ y = [9035039, 9304476, 9576660, 9847604, 10131886, 10435723, 10735943, 11038144, 11333471, 11638723, 11920330, 12184412, 12442202, 12697790, 12943136, 13172042, 13381630, 13593115, 13785529, 13949104, 14097353, 14222650, 14335402, 14411732, 14462428, 14498656, 14511054, 14496628, 14450206, 14368669, 14276799, 14180489, 14052027, 13894876, 13713857, 13515438, 13310998, 13095537, 12862915, 12616713, 12356433, 12087943, 11806491, 11526931, 11261692, 10970665, 10680536, 10399518, 10110469, 9836857, 9552433, 9273789, 9008043, 8761696, 8512265, 8268298, 8038412, 7830736, 7619925, 7430561, 7281139, 7121373, 6974320, 6829676, 6698990, 6600802, 6504693, 6410142, 6340718, 6283295, 6223727, 6179821, 6141858, 6110430, 6091642, 6065804, 6079995, 6109928]
10935F109928L5960N0641O2928P4664J06538R1756J14011J29156J28427J20697
10925G024706R8484R2966Q8533P1747O4843M9973N6486P1868O2323O0867O2522
10914G805318N2715L9993L2523L3178J5862L527j6574l9388m2435k5358l8082
10903G821279o7248o7792n8167j09123j19396j09333r5599j24963j26697j36447
10893F806514j53113j38841j45811j58581j40778j19682j07330j19260j54683
10884E568435j51509j93393j95611k06857k15531k05526j80631j65048j71369
10875C882960j49121j43271j23170j24234j34292j14762j26064j14555q0889q1750
10865B690852r5283p5363o0184l2135k6868K312P6768J91328L21942K92619P5917
$$ y = [6109928, 6145888, 6196529, 6259457, 6334121, 6440659, 6532415, 6646426, 6775582, 6904009, 7024706, 7123190, 7216156, 7304689, 7376436, 7441279, 7491252, 7547738, 7619606, 7681929, 7742796, 7805318, 7858033, 7898026, 7930549, 7963727, 7979589, 7983116, 7966542, 7927154, 7884719, 7859361, 7821279, 7754031, 7686239, 7628072, 7518949, 7399553, 7290220, 7194621, 7069658, 6942961, 6806514, 6653401, 6514560, 6368749, 6210168, 6069390, 5949708, 5842378, 5723118, 5568435, 5416926, 5223533, 5027922, 4821065, 4605534, 4400008, 4219377, 4054329, 3882960, 3733839, 3590568, 3467398, 3343164, 3208872, 3094110, 2968046, 2853491, 2772602, 2690852, 2595569, 2520206, 2460022, 2427887, 2401019, 2403331, 2480099, 2671427, 2993369, 3285988, 3361905]
10854C361905j81520l75989l78558k78983k19987j67639j24561q2700o5630o2884
10844A423454o6136n7109n9297n1183m0634k3603l5244m9096m2572l9950l2064
10833I26566k1675k4078j8007k8026m2248k1294j8415k2964j7228k6326r118j2082
10821F65105k9315j1989p068k4143j1435j1711r006k2764j3101j0937k2522j4522
10809D76592l179j1974k4619L636L796q338k2680o765j4060j491j219l424j9885
10796C66390j8196K265R546J4492O401p400j6081j6566J346k4199k6234N39J3626
10783C05929o703r655j4824q210P521Q63j3475R970J5063O414L71N678l332q816
10769B86794J68o584j6592n942l84k966j2430r107j99N213R693p977j0430p625
$$ y = [3361905, 3180385, 2804396, 2425838, 2146855, 1926868, 1759229, 1634668, 1551968, 1486338, 1423454, 1357318, 1300209, 1240912, 1189729, 1149095, 1125492, 1090248, 1041152, 998580, 958630, 926566, 904891, 880813, 862806, 834780, 792532, 771238, 752823, 729859, 712631, 686305, 677187, 665105, 635790, 623801, 616733, 592590, 581155, 569444, 560438, 537674, 524573, 513636, 491114, 476592, 473413, 461439, 436820, 440456, 444252, 435914, 413234, 406469, 392409, 390918, 389699, 386275, 366390, 348194, 350459, 360005, 374497, 380898, 373498, 357417, 340851, 342197, 317998, 291764, 292303, 305929, 299226, 289571, 274747, 266537, 274058, 274921, 261446, 271416, 286479, 292893, 293264, 298942, 295610, 286794, 286962, 280378, 263786, 257844, 257460, 254494, 242064, 232957, 232758, 237971, 247664, 239687, 229257, 221632]
10755B21632p120Q434J2995R38J4053k1369j4463J147j2467l2522j5566J0179
10743A65871J2640l35J2564M265j2232K927R395m760L34K8344j217J1638J4039
10730B43473P18K70O809n843j7347k0725J687J2129J1573l604j772j0486q406
10717B08476m667m716j183q814J0783m745j4724O413J4346P756P852M049Q4k840
10703B18070j5596j0450k854M926K5102M652o3L2329L5031K7040J3107R915R676
10690C50885j4120k5920q675j5207k3227j4676M822P163J6602J0849J6406K9505
10678C34407K0220o364l2473j1571j7022j4527j5354m952K91M987J3467P85O717
10665B78611j5461j6653J992O740K3045J2048K502K0635L3054M3001M8188K7583
$$ y = [221632, 214512, 222946, 235941, 236879, 250932, 229563, 215100, 216247, 203780, 171258, 155692, 165871, 178511, 178176, 190740, 195005, 182773, 185700, 195095, 190335, 190669, 219013, 217796, 229434, 243473, 244191, 244461, 251270, 245427, 228080, 207355, 209042, 221171, 232744, 229140, 227368, 216882, 208476, 203809, 199093, 197910, 189096, 199879, 195134, 180410, 186823, 201169, 208925, 216777, 220826, 220910, 218070, 202474, 192024, 189170, 194096, 219198, 223850, 223787, 256116, 291147, 318187, 331294, 341209, 350885, 336765, 310845, 302170, 286963, 263736, 249060, 253882, 261045, 277647, 288496, 304902, 334407, 354627, 348263, 315790, 304219, 287197, 272670, 257316, 252364, 252655, 257642, 271109, 271894, 278611, 263150, 246497, 248489, 255229, 278274, 290322, 292824, 313459, 346513, 389514, 437702, 465285]
10653D65285J8448o44o879k6363m2487l3007k5144j7958q845p734M802L704K4075
10640C47253J6446R185n782N284O703Q406N671O097J4348K3829K8601J4735K1280
10627E02056J1673j7347m4598m2650j0674K9569M0712L1534K6852J9012J5115
10616E61254L3275J9260J6662Q963l950j3571j5013k6088k9382k6553k9293j7038
10604D78526j4370k1397j1402j2008p809j3155M310L7729M2408N0807P0236J06994
10592G10869J02070P4872N5390L7064J3424j2212n5907o2442n3213m6250l4300
10581G29365k5916k2483j6205k1493p613o053r969l298P322J0451K3008L3882
10569F90998N6054Q2078Q2010N9127M4523M6186L2612L1552J6361j1312j4894
$$ y = [465285, 483733, 483089, 476210, 449847, 407360, 374353, 349209, 331251, 322406, 314672, 319474, 323178, 347253, 363699, 372884, 367102, 372386, 379089, 387495, 393166, 399263, 413611, 437440, 466041, 480776, 502056, 513729, 496382, 451784, 409134, 398460, 428029, 468741, 500275, 527127, 546139, 561254, 594529, 613789, 630451, 639414, 635464, 621893, 606880, 580792, 551410, 524857, 495564, 478526, 464156, 442759, 431357, 419349, 411540, 398385, 402695, 440424, 482832, 533639, 603875, 710869, 812939, 887811, 943201, 980265, 993689, 981477, 925570, 863128, 809915, 763665, 729365, 703449, 680966, 664761, 643268, 635655, 629602, 619633, 616335, 623657, 634108, 657116, 690998, 747052, 829130, 911140, 970267, 1014790, 1060976, 1093588, 1125140, 1141501, 1130189, 1115295]
10558A115295k1997k5750P743K6576J7706L9525N5477N5556O0518P6093M6760
10547A453502M9672M3132K6666L8998N5243P0538Q8749J13284R7904J16961J43287
10536B297936J75938J64562J62171K09634K25066K54935L11748L95905M94882
10527D692777O03002O95594P94894R10799J067646J263316J577210K129798L009220
10518A6744256M262399N751193P219150Q191411P999462O223890L030546p71545
10510E8650762m084460o154942o817265o408087n459922m346568l323765k496526
10502A9559227j912970j487106j218256j037969r16556q00652o58538m96481l32152
10493A0698547r5549J92150M23305L48571K4416k55247l08751j17282J77265M50906
$$ y = [1115295, 1093298, 1067548, 1075291, 1101867, 1119573, 1159098, 1214575, 1270131, 1330649, 1406742, 1453502, 1503174, 1546306, 1572972, 1611970, 1667213, 1737751, 1826500, 1939784, 2037688, 2154649, 2297936, 2473874, 2638436, 2800607, 3010241, 3235307, 3490242, 3801990, 4197895, 4692777, 5295779, 5991373, 6786267, 7697066, 8764712, 10028028, 11605238, 13735036, 16744256, 21006655, 26757848, 33976998, 42168409, 50167871, 56391761, 59422307, 58650762, 54566302, 48411360, 41594095, 35186008, 29726086, 25379518, 22055753, 19559227, 17646257, 16159151, 14940895, 13902926, 12986370, 12185718, 11527180, 11030699, 10698547, 10602998, 10795148, 11218453, 11567024, 11591440, 11336193, 11027442, 10910160, 11087425, 11538331]
10483A1538331O55476Q33844J013356J286646J770527K515299L575234N068061
10475B8256774P010568R144844J0630601J0124504O636042P92412n186615r131280
10467E8277850j0227970r165652p235969n299438l759552k604471j738951j063659
10459A7182188n29938L05P38201J831876K876847K224792P6526j627920k195256
10450B0577621j383959r2532R95927J934588L042847M673623P296399J1591004
10442D8635518J8718743L1299556N3186366P9414010P3579871K0078073l2937836
10435B91974301o6224944o6780589m7622448l0129829j9057133j2614769q774583
10428D0770006o405493m848959l708800k875240k319940j942839j606776j304992
$$ y = [11538331, 12193807, 13027651, 14041007, 15327653, 17098180, 19613479, 23188713, 28256774, 35267342, 44412186, 55042787, 65167291, 71803333, 72595745, 67409130, 58277850, 48049880, 38884228, 31648259, 26348821, 22589269, 19984798, 18245847, 17182188, 16652250, 16652555, 17390756, 19222632, 22099479, 24324271, 24400797, 22772877, 20577621, 19193662, 19101130, 20097057, 22031645, 25074492, 29748115, 37044514, 48635518, 67354261, 98653817, 151840183, 231254193, 304834064, 324912137, 291974301, 225749357, 158968768, 111346320, 81216491, 62159358, 49544589, 40770006, 34364513, 29515554, 25806754, 22931514, 20611574, 18668735, 17061959, 15756967]
10420A5756967j223332j274716j317255j241509j082420r26633p80725o70820
10412G239557n77506m92300m40067m07281l56631l09917k70860k65651k61508
10403C857836k48588k09647j74739j60048j57845j29395r3437j04285j08870j19313
10393B351669j18473j14701j11145q1195p2363o9163o5043n3561o2815m9881k6632
10382A526697k4218l8256m8969n5802o3374n9063n4023m5261l9500m1721k8409
10371A028101J124n716j6434j5930k6456k8374k7356j5203j2782k5694m5522k8432
10359G81326j2243k3072j3944L541j1623j7003j331J1185k561j3862J838L8968
10347G41219P2560J02745J10221L0555o1916j14692j10061p7957m7055l6182l1169
$$ y = [15756967, 14533635, 13258919, 11941664, 10700155, 9617735, 8691102, 7910377, 7239557, 6662051, 6169751, 5729684, 5322403, 4965772, 4655855, 4384995, 4119344, 3857836, 3609248, 3399601, 3224862, 3064814, 2906969, 2777574, 2684137, 2579852, 2470982, 2351669, 2233196, 2118495, 2007350, 1926155, 1853792, 1784629, 1719586, 1666025, 1603210, 1553329, 1526697, 1502479, 1464223, 1415254, 1359452, 1296078, 1237015, 1182992, 1137731, 1098231, 1056510, 1028101, 1029225, 1023509, 1007075, 991145, 964689, 936315, 908959, 893756, 880974, 855280, 809758, 781326, 769083, 746011, 732067, 735608, 723985, 706982, 705651, 716836, 714275, 700413, 702251, 741219, 813779, 916524, 1026745, 1057300, 995384, 880692, 770631, 692674, 645619, 609437, 578268]
10336E78268j4355j981j9915k4176k5669l5937j3540j0521k9342k4692n38o484
10324C71118r461j6116k2560k2681j3421R464o516k7932j6722q992J8736M8251
10312C03168N8194L2024k0871k9981j286J9999k681l999n103p158k829J556j1743
10299C29290k7707k0940r844r818O072O859K0258J4266j885m333j4198p06J5129
10286C02443N043J8861K0821J5227L7936Q0437R1587O5033M1487K5493M92k5596
10274F79264p1908o1762p9095p1034m0387l9906k5757k5785j5726j2417j4063
10263B21424j0968J4892o437k3423j2293j0421n920l0491k1750k556K5034M4216
10251A81307K0123k5686k1709k6493L392K664K163L4260K4825K756P376j153o806
$$ y = [578268, 563913, 561932, 542017, 517841, 492172, 456235, 442695, 432174, 402832, 378140, 377602, 371118, 361657, 345541, 322981, 300300, 286879, 296343, 289827, 261895, 245173, 236181, 254917, 303168, 361362, 393386, 372515, 342534, 341248, 361247, 358566, 354567, 349464, 342306, 339477, 341033, 329290, 301583, 280643, 270799, 260981, 267053, 273912, 294170, 308436, 306551, 302218, 288020, 287314, 302443, 307486, 326347, 347168, 362395, 400331, 480768, 572355, 637388, 678875, 704368, 704860, 679264, 607356, 545594, 466499, 395465, 355078, 315172, 289415, 263630, 247904, 235487, 221424, 210456, 225348, 218911, 195488, 183195, 172774, 166854, 136363, 114613, 112057, 137091, 181307, 201430, 175744, 154035, 127542, 130934, 133598, 135761, 170021, 194846, 197602, 204978, 203825, 197019]
10238A97019k563r545j5755k660N4K060j3635j234M337P819j238L550M064r984
10224A62289k2578r153k748J7424J4200L293J0771P65l927N256p982N968J601
10211A75179j1623j8051m541O031N428j071J7745L3094O46j7277M422O95o705
10198A83972q570M077J5764N482Q07j95j0585o592J0096n854j0112l224M963j669
10184A78360j8630j3065K740J1118l658n81j3104M708J5335K909N165q470j9845
10171A42982r652o650J2571M741O956n917J2742q30o990L9M228m85j9537m981
10157A29217N500K679l85n245J900o897L935J1373P718r643j4626J3859K0247
10144A59632Q079K0186K5004r85l14j7175k1618j6345j2692j6898J1340K0299
$$ y = [197019, 194456, 184911, 169156, 166496, 166550, 168610, 154975, 153741, 158078, 165897, 164659, 168209, 172273, 162289, 139711, 130558, 127810, 145234, 159434, 162727, 173498, 174263, 170336, 175592, 167610, 173578, 175179, 163556, 145505, 140964, 146995, 152423, 151352, 169097, 202191, 202837, 185560, 189982, 190677, 183972, 175402, 179479, 195243, 200725, 201532, 201337, 190752, 184160, 194256, 188402, 178290, 175066, 180029, 178360, 159730, 146665, 149405, 160523, 156865, 156284, 143180, 147888, 163223, 166132, 171297, 162827, 142982, 133330, 126680, 139251, 143992, 150948, 145031, 157773, 156943, 149953, 149992, 154220, 153735, 134198, 129217, 134717, 137396, 137011, 131766, 133666, 126769, 130704, 142077, 149795, 140152, 125526, 139385, 159632, 167711, 187897, 212901, 211916, 211602, 194427, 172809, 156464, 143772, 126874, 138214, 158513]
10132A58513K7509M1640R094K0353R601k9069k1928j6280j938N110o492o902K729
10119A91940j1868r854k040o454q661J2067R826J1755r4j644J3479J7198M96J588
10105B17734J5798J0655J0558L816Q033N723J2235K1736L1866L6600M3520L1430
10093D49704L9780J6191L0610J8018J2236j9M587M711J572J4586L8863L4270O0196
10080G25305Q7170J13501J72239K44386L88261O01321R29854J423586J900362
10071F585985J855818R12120m31080j437603j740851j504499j087552p20353m71880
10062A960105l29395k46391j74815j22758q1013n3309n5111l3106j1546J8528
10052H71189Q472j7090m1300p1765r1482o7001m8327m4284m2345j3468k4540k6902
$$ y = [158513, 186022, 227662, 236756, 257109, 266710, 237641, 215713, 199433, 197495, 202605, 196113, 189211, 191940, 180072, 170218, 168178, 161724, 153063, 165130, 174956, 186711, 186617, 184973, 198452, 215650, 216146, 217734, 233532, 244187, 254745, 258561, 266594, 272317, 284552, 306288, 338154, 374754, 418274, 449704, 489484, 505675, 536285, 554303, 566539, 566520, 571107, 575818, 577390, 591976, 630839, 665109, 725305, 812475, 925976, 1098215, 1342601, 1730862, 2332183, 3262037, 4685623, 6585985, 8441803, 9353923, 8922843, 7485240, 5744389, 4239890, 3152338, 2431985, 1960105, 1630710, 1384319, 1209504, 1086746, 1005733, 952424, 897313, 864207, 852661, 871189, 879661, 862571, 821271, 749506, 658024, 591023, 542696, 498412, 456067, 442599, 418059, 391157]
10040C91157j9894j3349j1663o988p281K521J2550J0520J7015J9000N108O830
10028D05526J0444q707j6312m911Q59j1971l232J8152M2996N6377Q0225J48971
10016G18417K52018L57230L64146J61070j06929k98638l37554k67059j93006j01140
10006E48555n7757n4269l3864k7630j7754o164q547j646k999J9450L5465M5990
9994D38830L3390L6848P8335R5703J19799J86826K27995K51950K55724J63029
9984A888429K2782j23985k20631k36290k08334j86161j29987r5915p5898p5210
9974E58800o3492l3513j9961j9845j5419m824n806j6237j0163k1078j4760Q955
9962C42657k411l461J0646L148J9266J8296J7439J9547L1694M4336M3446P2548
$$ y = [391157, 371263, 357914, 346251, 339263, 331982, 334503, 347053, 357573, 374588, 393588, 398696, 405526, 415970, 407263, 390951, 386040, 386899, 374928, 371696, 389848, 432844, 489221, 569446, 718417, 970435, 1327665, 1691811, 1852881, 1745952, 1447314, 1109760, 842701, 649695, 548555, 490798, 436529, 402665, 375035, 357281, 351117, 342570, 340924, 337925, 357375, 392840, 438830, 472220, 509068, 587403, 683106, 802905, 989731, 1217726, 1469676, 1725400, 1888429, 1911211, 1787226, 1566595, 1330305, 1121971, 935810, 805823, 709908, 634010, 558800, 495308, 461795, 441834, 421989, 406570, 401746, 395940, 379703, 369540, 348462, 333702, 342657, 340246, 336785, 347431, 350579, 369845, 388141, 405580, 425127, 456821, 501157, 544603, 617151]
9950F17151P4296R1761J04450J08367J02369Q9107J04400J01976R8413P4333K8462
9939A595085m2512r4785j21233j52254j70087j48300j25599r5130p7557m4799
9929E22829k7592l7061k3124j1483k3762l0623r377j4458j6693k1342O05P416
9917C15335n100P938J5314K2119K3950K6529J5963K1522L1477O0450P1493P5737
9905F82727R4248J01824R5403J10338J17301J24122J18846J18960J31177J00513
9895A795459M8050n5318j52185k03475k09258k04732j89363j19581j05698p3935
9885E29964n5167m2648m1202k6724k2709k9143l5481k7814j5442j4168j4910r934
9873A94622j9127k3160P302J0904j0243j0310m866J685n930L796o743j2718N079
$$ y = [617151, 691447, 783208, 887658, 996025, 1098394, 1187501, 1291901, 1393877, 1492290, 1566623, 1595085, 1552573, 1457788, 1336555, 1184301, 1014214, 865914, 740315, 645185, 567628, 522829, 495237, 458176, 435052, 423569, 399807, 369184, 359807, 345349, 328656, 307314, 307919, 315335, 310235, 318173, 333487, 355606, 379556, 406085, 422048, 443570, 475047, 535497, 606990, 682727, 776975, 878799, 974202, 1084540, 1201841, 1325963, 1444809, 1563769, 1694946, 1795459, 1843509, 1788191, 1636006, 1432531, 1223273, 1018541, 829178, 709597, 603899, 529964, 474797, 432149, 390947, 364223, 341514, 312371, 276890, 249076, 233634, 219466, 204556, 194622, 175495, 152335, 159637, 170541, 160298, 149988, 145122, 146807, 140877, 144673, 137930, 125212, 130291]
9860A30291M687l914Q4n404O4J859J4492J3645J8008j1391j8882j8352j5198N40
9846A10529N799K3778K4004L4814N2586N0343M7983R3027J74325L32343O63485
9835A613016J180226J401019Q91299j05425r52582j223359r96131o01614l25425
9826H81024j92358j24237j02444p0095m6588m4787k5436j4866k7779k4889r639
9815A97906J568p461j9467j5882j136q47n914P95j9960k1472j4432k78P297n928
9801I4789l011J020O477J8400Q627J639j3446j1015K897m027j286R113m500o450
9787I9227J984n433J2072M151Q345n602N484n405o638O960l722n149J0645P399
9773A24318R073j6109j1702j832J4631J4057N311j394N685q770p433k325J2385
$$ y = [130291, 134978, 131064, 131148, 125744, 125808, 127667, 142159, 155804, 173812, 162421, 143539, 125187, 109989, 110529, 116328, 140106, 164110, 198924, 251510, 301853, 349836, 442863, 617188, 949531, 1613016, 2793242, 4194261, 5085560, 4980135, 4027553, 2804194, 1808063, 1206449, 881024, 688666, 564429, 461985, 391890, 345302, 300515, 275079, 260213, 232434, 207545, 197906, 199474, 192013, 172546, 156664, 155528, 154681, 148767, 149562, 129602, 108130, 93698, 93420, 100717, 94789, 91778, 92798, 99275, 117675, 126302, 127941, 114495, 103480, 106377, 102350, 101064, 110177, 105677, 99227, 101211, 95778, 107850, 112001, 120346, 114744, 120228, 114823, 108185, 115145, 111423, 106274, 116919, 124318, 133391, 117282, 105580, 103748, 118379, 132436, 137747, 136353, 142038, 133268, 125835, 123510, 135895]
9760A35895j1248j0326N294J3600n338m265p55n976m355l269R623K634Q469L358
9746A33341o71J331p471N253J0978K81p276j3890q883J1999j870p947k330k847
9732A09998j685J277j0600R75l504J1613q97q103r894j0243o714N364J0253J4531
9718A02371J895N215O150j427L247q272p04O416J3782P907r120j0107R755J4540
9704A41648R151J6222K8898K1440L891j609n729r512j0046q593r111M087l42j0822
9690A69573j4932J385r269j725J5985K378l973J6261R699m046l379q928r781r002
9676A50246Q824K2822P056N047L395J2110J776r252q543k746j2487k882O939N958
9662A88263j2027J653N805Q574o389N841J1696K0882r35l025J0822j2107O949
$$ y = [135895, 124647, 114321, 119615, 133215, 127877, 123612, 122857, 116881, 112526, 109257, 118880, 121514, 129983, 133341, 132670, 134001, 126530, 131783, 142761, 143042, 135766, 121876, 112993, 124992, 123122, 115175, 112845, 109998, 108313, 109590, 98990, 99965, 96461, 108074, 107177, 99074, 89180, 78937, 72223, 77587, 87840, 102371, 104266, 109481, 115631, 114204, 117451, 109179, 108475, 114891, 128673, 136580, 127460, 117353, 127108, 141648, 150799, 167021, 195919, 217359, 221250, 219641, 213912, 204400, 194354, 185761, 176650, 180737, 180395, 169573, 154641, 156026, 146757, 145032, 161017, 163395, 159422, 175683, 185382, 181336, 177957, 169029, 159248, 150246, 159070, 181892, 188948, 193995, 197390, 209500, 211276, 202024, 193481, 190735, 178248, 175366, 182305, 188263, 176236, 177889, 183694, 192268, 185879, 191720, 203416, 224298, 223363, 220338, 231160, 219053, 226002]
9649B26002J5380J2402j0035m760j0819N045J0930O555m659k690L154o412R49
9636B41042j254O775l944J7148J5656J3194R582j0815j821K2816K6205O773p786
9623C33571m727K1497K0814O02l60m611j3810K456J9703K7219K1180J2678L630
9610D39842q870P5J6811R673N349J0379L922J1784J7170J673K515O779P14j6854
9596E00962j5103n737K63q836r812M378P875J0590j5913m986J1249o640M194J2442
9582D84926j68r341j170o234M374O095R72j5214l526j0315j1396K275L922l437
9568D41763J0145J3363K642q260rj5926j2683J4982J2757N847N085P18p258l115
9554D60051K754j535j147J2874O812J037k701P107J0451j2925L424J4248O716
$$ y = [226002, 241382, 253784, 243749, 238989, 228170, 233215, 244145, 250700, 246041, 243351, 246505, 240093, 241042, 239788, 246563, 242619, 259767, 275423, 288617, 298199, 287384, 285563, 308379, 334584, 341357, 333571, 328844, 350341, 371155, 371757, 371397, 366786, 352976, 355432, 375135, 402354, 423534, 436212, 439842, 430972, 431047, 447858, 457531, 462880, 473259, 477181, 488965, 506135, 507808, 510323, 517102, 517816, 500962, 485859, 480122, 480385, 471549, 461737, 466115, 473990, 484580, 468667, 463681, 474930, 468290, 472484, 484926, 484758, 475417, 474247, 468013, 472387, 478482, 479454, 464240, 460714, 450399, 439003, 441278, 445200, 441763, 451908, 465271, 467913, 459653, 459644, 443718, 431035, 446017, 458774, 464621, 469706, 470424, 463166, 460051, 462805, 461270, 460123, 472997, 479809, 480846, 478145, 485252, 495703, 482778, 486202, 500450, 507166]
9541E07166P322K1032P897o258j1869K267K0093K0445m039R469J3083k807R997
9528E93798J7502q971l99j021N871J0749M970P85j2343N234Q828p81p971O935
9514F23186J6626p285M821j1740j3965J0495R028n71n272K580q053j1416o860
9501F01574k1664l433k744o192N461l996P023P929j456j3558K96j3123j8663j1836
9487E25618k466L608k33j3271o25j1581r513O794n227o647m609k609j3240n477
9473D60522n273K963r226j5691m158J5138j0100j2468k291M261R3Q266R049J3741
9459D54826m361o389j0597K208K0977O238j1202J0540M838O762J179J4377K6984
9446E16380J7082J426M568N579J0920J0837K1441K5864K6911J2347N960J3433
$$ y = [507166, 514488, 535520, 543417, 537159, 525290, 527557, 547650, 568095, 564056, 573525, 586608, 583801, 593798, 611300, 602329, 601930, 600909, 606780, 617529, 622499, 623284, 610941, 616175, 625003, 624222, 616251, 623186, 639812, 632527, 637348, 625608, 611643, 622138, 631166, 630595, 625323, 627903, 619850, 608434, 601574, 579910, 576477, 573733, 567541, 573002, 569006, 576029, 583958, 582502, 568944, 569240, 556117, 537454, 525618, 523152, 526760, 526527, 513256, 512631, 501050, 491537, 498331, 493104, 486457, 481848, 479239, 465999, 460522, 455249, 458212, 448986, 433295, 429137, 444275, 434175, 421707, 419416, 423677, 423770, 432036, 441085, 454826, 450465, 444076, 433479, 435687, 456664, 462902, 451700, 462240, 467078, 473840, 475019, 489396, 516380, 533462, 534888, 539456, 545035, 555955, 566792, 588233, 614097, 641008, 653355, 659315, 672748]
9434F72748K4643K3159J9220J8719L4725K4972K0347K9061L2489M1990N5055N5861
9422A052989N1407L9293L2887L1564L3033M6900O3208N7357O3847P3714R0915
9411A637114Q2299Q9633J04136J21872J22654J22616J41482J36156J42854J87120
9401B887936J89147J91620K19140K29238K36226K52926K45202K44389K46008K63725
9391E205557K64315K70775K83263K77400K92176L08528L36538L50653L54512L58894
9381H302611L65760L60071L62461L73519L83433L69373L38993L28239L05109K97854
9371A1787423K70541K56702K37202K06181K09257K07865J80809J61734J55738
9362A3673452J34189J01368R2567P5199M7027L6762K7368J4624j2197l0228l6531
$$ y = [672748, 697391, 720550, 739770, 758489, 793214, 818186, 838533, 867594, 900083, 942073, 997128, 1052989, 1104396, 1143689, 1176576, 1208140, 1241173, 1288073, 1351281, 1408638, 1472485, 1546199, 1637114, 1719413, 1809046, 1913182, 2035054, 2157708, 2280324, 2421806, 2557962, 2700816, 2887936, 3077083, 3268703, 3487843, 3717081, 3953307, 4206233, 4451435, 4695824, 4941832, 5205557, 5469872, 5740647, 6023910, 6301310, 6593486, 6902014, 7238552, 7589205, 7943717, 8302611, 8668371, 9028442, 9390903, 9764422, 10147855, 10517228, 10856221, 11184460, 11489569, 11787423, 12057964, 12314666, 12551868, 12758049, 12967306, 13175171, 13355980, 13517714, 13673452, 13807641, 13909009, 14001576, 14076775, 14123802, 14160564, 14187932, 14202556, 14190359, 14160131, 14123600]
9351A4123600m8398q0185r2293j14196j49608j67834j71960j89456k18367k59311
9341A2631992k69524k93834l09098l13827l30572l23461l10269k91858k86618
9332I902931k64910k58377k43075k21674k10995j88885j62708j60648j35601j17434
9322G938624j12076r4470o2440m6089k9804k3257n356J1040M5244M9588N0522
9311G721526O2003Q5846J07838J54451J81799K32257K65601L08220L30131L62607
9301I812279L81907L87579L81864L80376L70040L51754L58479L53502L50784L72368
9291A3500932L81266M20001M60964N09721N41280N65574O11007O19597N81886
9282A8192228N28977M49377L73980K62850J66068P6364j6462q3910j23583j39681
$$ y = [14123600, 14075202, 13995017, 13902724, 13788528, 13638920, 13471086, 13299126, 13109670, 12891303, 12631992, 12362468, 12068634, 11759536, 11445709, 11115137, 10791676, 10481407, 10189549, 9902931, 9638021, 9379644, 9136569, 8914895, 8703900, 8515015, 8352307, 8191659, 8056058, 7938624, 7826548, 7732078, 7669638, 7623549, 7593745, 7570488, 7565132, 7576172, 7621416, 7671004, 7721526, 7783529, 7869375, 7977213, 8131664, 8313463, 8545720, 8811321, 9119541, 9449672, 9812279, 10194186, 10581765, 10963629, 11344005, 11714045, 12065799, 12424278, 12777780, 13128564, 13500932, 13882198, 14302199, 14763163, 15272884, 15814164, 16379738, 16990745, 17610342, 18192228, 18721205, 19170582, 19544562, 19807412, 19973480, 20049844, 20033382, 19949472, 19825889, 19686208]
9272A9686208j55810j91288k02323k31499k60328k52507k46792k58379k64008
9263A7623274k34271k17293k07466j78767j57556j32335p3851m4081m1639j12784
9253A6223231k45304m10756n87342p35778q27019q32221p68730p10452o47265
9244A0458364n93813n16354m36049l95618l45059l05506k41378j79216j05913
9235G339458j9666O1804J45031J74265J36634M4014j29650l08446m58343n02406
9225F482695m80324m25559l25221k33025j43312p8310j5851M2850N7168O0156
9215D941267L5775J8502M6441Q5041J40072K28313K40720J76375P1675o3335k14283
9204E706563l08949l46729l26270k65800j68564m7836M7311J15887K16588L46706
$$ y = [19686208, 19530398, 19339110, 19136787, 18905288, 18644960, 18392453, 18145661, 17887282, 17623274, 17389003, 17171710, 16964244, 16785477, 16627921, 16495586, 16421735, 16377654, 16336015, 16223231, 15977927, 15567171, 14979829, 14244051, 13417032, 12584811, 11816081, 11105629, 10458364, 9864551, 9348197, 8912148, 8516530, 8171471, 7865965, 7624587, 7445371, 7339458, 7319792, 7381596, 7526627, 7700892, 7837526, 7881540, 7751890, 7443444, 6985101, 6482695, 6002371, 5576812, 5251591, 5018566, 4875254, 4796944, 4781093, 4823943, 4881111, 4941267, 4977042, 4995544, 5041985, 5127026, 5267098, 5495411, 5736131, 5912506, 5984181, 5920846, 5706563, 5397614, 5050885, 4724615, 4458815, 4290251, 4242415, 4289726, 4405613, 4622201, 4968907]
9194D968907M32612N12188N88946N98243N35892L57883P6002k17107m22962n39875
9184F890729n68002n53861n16319m45871l65282k60735j95154j04681p78Q8214
9174C968260J87619L10496M22269N68027P06270Q18638Q32524P26356M78035J29699
9164I148193k14362m69229o01829o38572n91547n26055m64300m27126l57874k77209
9154D580090j94384p4265L3129J41425K42676L35165L57041L53996L26600K48162
9144F349635J35606L2346q1669j47666j84466j76734j62570j61086j80512k19823
9134E203061k36371k46219k30498j54062m5073P8806J89347K83338L34257L24661
9124E501247K81072J82841Q9520N4709K2382J5937j027o9799j68709k70276l55244
$$ y = [4968907, 5401519, 5913707, 6502653, 7100896, 7636788, 7994671, 8070673, 7853566, 7430604, 6890729, 6322727, 5768866, 5252547, 4806676, 4441394, 4180659, 3985505, 3880824, 3880046, 3968260, 4155879, 4466375, 4888644, 5456671, 6162941, 6981579, 7814103, 8540459, 9018494, 9148193, 8933831, 8464602, 7862773, 7224201, 6632654, 6106599, 5642299, 5215173, 4857299, 4580090, 4385706, 4311441, 4344570, 4485995, 4728671, 5063836, 5420877, 5774873, 6101473, 6349635, 6485241, 6517587, 6435918, 6288252, 6103786, 5927052, 5764482, 5603396, 5422884, 5203061, 4966690, 4720471, 4489973, 4335911, 4290838, 4369644, 4558991, 4842329, 5176586, 5501247, 5782319, 5965160, 6054680, 6109389, 6131771, 6147708, 6146681, 6076882, 5908173, 5637897, 5282653]
9113E282653m01090l91510l66422l10753k48769j90374r9314j7614M3944J13762
9103C414513J83403K30761K45029K59178K88093L39672L93830L79512K84851R2426
9093F111268j53755l81405n22467n80963n45492m52038l82352k90474k13346j53065
9083B435911r6992l3879J8685Q5469J25665J85741K39413K80670K68937K32054
9073C741674J58515M7165j01084k11783k80254l19601l24670k99799k33972j73925
9063B002266j29072r6278n1223j4252J5849O5913J00361J68250K17173K28608
9053B507595K07097J19431K8058j01620k00483k42197k67016k49992k22800j87632
9043A390441j30518q8411p0320m7510j5908j2917k0394J0695M1149N7808P0903
$$ y = [5282653, 4881563, 4490053, 4123631, 3812878, 3564109, 3373735, 3274421, 3256807, 3300751, 3414513, 3597916, 3828677, 4073706, 4332884, 4620977, 4960649, 5354479, 5733991, 6018842, 6111268, 5957513, 5576108, 5053641, 4472678, 3927186, 3475148, 3092796, 2802322, 2588976, 2435911, 2338919, 2305040, 2323725, 2409194, 2534859, 2720600, 2960013, 3240683, 3509620, 3741674, 3900189, 3947354, 3846270, 3634487, 3354233, 3034632, 2709962, 2410163, 2176191, 2002266, 1873194, 1776916, 1725693, 1711441, 1727290, 1793203, 1893564, 2061814, 2278987, 2507595, 2714692, 2834123, 2862181, 2760561, 2560078, 2317881, 2050865, 1800873, 1578073, 1390441, 1259923, 1171512, 1101192, 1053682, 1037774, 1024857, 1004463, 1015158, 1056307, 1114115, 1185018]
9032A185018Q1884R3039O8733M7610K582n4320j08403j14034j29284j16494r9047
9021H57284r3353o5374m6378m6334m2628m3158m1032k5112r744q646j5431r605
9009D10489j1568o116j725m574n587j5596k892j1153j4332N331J3043j952j7255
8996C36113j9160j3440L018J617J1336J2206m664j4218p707m480m802J536k215
8983B95140j6321j446J2605k191j984J0393m106J311R890J036j2555p877j0956
8970B72939p289J3055J1486M202J271J0442R196k1277O74R82R675M263L047m72
8956C12194J0698o598j3009m263K435J402p189M17M049q971j0338l418O5R543
8942B87017K919O443Q329M788j2130j5405p520k100m12o756J409J5659O20n442
$$ y = [1185018, 1266902, 1359941, 1428674, 1476284, 1478866, 1424546, 1316143, 1202109, 1072825, 956331, 857284, 763931, 698557, 652179, 605845, 563217, 520059, 479027, 453915, 444171, 435525, 420094, 410489, 398921, 392805, 391080, 386506, 380919, 365323, 362431, 351278, 336946, 342277, 355320, 353368, 336113, 316953, 303513, 306531, 308148, 319484, 331690, 327026, 312808, 305101, 300621, 295819, 297355, 295140, 278819, 277373, 289978, 287787, 285803, 296196, 292090, 293401, 303291, 304327, 291772, 283895, 272939, 265650, 278705, 290191, 294393, 295664, 306106, 315302, 294025, 294699, 295681, 305356, 309619, 312666, 312194, 322892, 316294, 303285, 299022, 301457, 302859, 295670, 296087, 300136, 291165, 280827, 277409, 277474, 287017, 289936, 296379, 304708, 309496, 297366, 281961, 274441, 272341, 271929, 265173, 266582, 282241, 282861, 277419]
8928B77419l498K46j5170j2248O31K2517K0471j2488j8174J368K473n334J845
8915B60058J6179J211j671j5846j3679M661R840R178q383n189J601K188K419k9
8901B62538M557J664n349m384N776O121J0074K442J0580Q018R609r941j0935l834
8887B86936J5288O214J64J708k304M56J147n114J419K202j688m175J2481L005
8873C17739m050j6067O508Q177n993L363R268J874j417q038j276r64m292j386
8859C03446L475l725P489K2178J77R526J7754J2167j2754j0118k94M815M313m409
8845C54040j4702k810n14j1122m02J2861l154J874L427l449j2156m703J8770m540
8831C33420j6226j8294j0640k955M400J6989J6346Q056j165k382J920j6694j3318
$$ y = [277419, 273921, 274167, 258997, 246749, 247380, 269897, 290368, 277880, 259706, 261074, 263547, 258213, 260058, 276237, 277448, 275777, 259931, 246252, 250913, 260753, 269931, 261548, 256359, 257960, 260148, 262567, 262538, 267095, 268759, 263410, 259026, 264802, 270923, 280997, 283439, 294019, 302037, 311646, 301705, 290770, 286936, 302224, 308438, 308602, 310310, 308006, 308462, 309609, 304495, 305914, 308116, 306428, 302253, 314734, 317739, 313689, 297622, 304130, 312307, 306314, 309677, 318945, 320819, 319402, 311364, 310088, 309124, 304832, 303446, 306921, 303196, 310685, 332863, 333040, 342566, 360320, 372487, 359733, 349615, 349321, 354136, 358449, 354040, 339338, 336528, 336014, 324892, 324490, 337351, 334197, 336071, 339498, 336049, 323893, 319190, 337960, 333420, 317194, 298900, 288260, 285305, 289705, 306694, 323040, 331096, 329931, 327549, 329469, 312775, 299457]
8818B99457k64M066M926L717n7P538J391p157K866j2519j336N62j039l284L420
8803C02287m430k9907M129j9617j1047Q769L17J3532J1251j1981j0128J1552R673
8790B74400N536m311j1613k301o20j24J5477J0615k011J656J1242J7556J9839
8777C35341l353q122o305O392k056p226L167J1143m573o111J1047r413q521k513
8763C08897n051m245q44K244J4031O773L130j454j2738j4942O142O024J304J6541
8749C25812j564o578r427k619n935j0329R915K863P731n826r809O660J7188N899
8735C23981o953j525K2943M486j3300j0461j5819m286N584O541r460K418N283
8722C09432q545K759J759J442P33l859M065K685L088J649n739J2176J1564J0404
$$ y = [299457, 299193, 303259, 308185, 311902, 311845, 319383, 320774, 313617, 316483, 303964, 302628, 303190, 302151, 298867, 302287, 297857, 267950, 272079, 252462, 241415, 250184, 250501, 264033, 275284, 263303, 253175, 264727, 274400, 279936, 275625, 264012, 261711, 261091, 260967, 276444, 287059, 285048, 286704, 297946, 315502, 335341, 331988, 323866, 317561, 323953, 321897, 314671, 317838, 328981, 324408, 318297, 329344, 319931, 311410, 308897, 303846, 299601, 298757, 301001, 315032, 321805, 324935, 323481, 310743, 295801, 301943, 307967, 309271, 325812, 324248, 317670, 308243, 305624, 299689, 289360, 299275, 302138, 309869, 304043, 294234, 300894, 318082, 323981, 317028, 315503, 338446, 342932, 329632, 319171, 303352, 299066, 304650, 311191, 301731, 304149, 309432, 300887, 303646, 305405, 306847, 307580, 303721, 307786, 310471, 313559, 315208, 309469, 321645, 333209, 343613]
8708C43613J3411N873Q351K2147J5367J1629k679p920j99o54M060m416O578K2862
8694D38023L868m022J009n774P106L048Q844K079O247K877J2788j1525j7549M118
8680D51137J5794N474R912K296j1756j6M475K165J1213P079R6p201j125Q056n492
8665D92107l330K380q063o268j2549n35R629J6854M212j6588j6841j0511l544
8652D46953O122P524q552l489K1072J8493J0748J0081J7380J3245J4783K0653
8640E75013J6209L8245M8814P3946J14226K22701L81478L73810R1157j47501l01005
8629A487093k83885j76429r1892n1533l0105k4548j0385N031l257M312N298M687
8617H34387L064r896N488R242l537P952q166r376J0124O019J8006l065k066N73
$$ y = [343613, 357024, 362897, 371248, 393395, 408762, 420391, 417712, 409792, 409593, 408939, 412999, 408583, 415161, 438023, 441891, 437869, 438878, 433104, 440210, 443258, 452102, 454181, 460428, 463305, 476093, 464568, 447019, 451137, 466931, 472405, 482317, 484613, 472857, 472841, 477316, 479481, 490694, 497773, 497869, 490668, 489543, 497599, 492107, 488777, 491157, 483094, 476826, 464277, 463742, 473371, 490225, 494437, 477849, 461008, 450497, 446953, 453075, 460599, 452047, 448558, 469630, 488123, 498871, 508952, 526332, 539577, 554360, 575013, 591222, 629467, 678281, 752227, 866453, 1089154, 1470632, 1844442, 1935599, 1788098, 1487093, 1203208, 1026779, 934887, 883354, 853249, 828701, 818316, 823347, 820090, 824402, 829700, 834387, 837451, 827555, 833043, 842285, 838748, 846700, 838534, 829158, 839282, 845301, 863307, 860242, 858176, 858749]
8603H58749J4494J8093K2290K1034R195J9746O172K4298M3364M3553M9263R5233
8591A225484J79985L59938O67071Q20970K82086k47462o18615o14934l95106k28835
8581A430582j23474q0200l9389j5878j5516k0400m829j2783r021j769K5871Q580
8569A141774L213J1980K4441K5792K8063K5412K7447L8142L0528L3125M4643M6475
8557A481035L8023M4099O3315N3454O5879N1210O0464Q2157J02867J19499J45029
8546B307031J81207K45656L75037N19580L45098O6528r2858j17429k3054N1740
8536C858536J36753J73785J86199J86743J91306J91451J72009J48015J08445O9444
8526E422686L9830J0160n057m0988p0060o6768o1370n1022n8940o7112n0836m0645
$$ y = [858749, 873243, 891336, 913626, 934660, 943855, 963601, 969773, 994071, 1037435, 1080988, 1130251, 1225484, 1405469, 1765407, 2432478, 3253448, 3535534, 3288072, 2669457, 2054523, 1659417, 1430582, 1307108, 1226908, 1187519, 1171641, 1156125, 1135725, 1130896, 1118113, 1109092, 1107323, 1133194, 1141774, 1144987, 1156967, 1181408, 1207200, 1235263, 1260675, 1288122, 1326264, 1356792, 1389917, 1434560, 1481035, 1519058, 1563157, 1626472, 1679926, 1745805, 1797015, 1857479, 1939636, 2042503, 2162002, 2307031, 2488238, 2733894, 3108931, 3628511, 3973609, 4040137, 3947279, 3829850, 3806796, 3858536, 3995289, 4169074, 4355273, 4542016, 4733322, 4924773, 5096782, 5244797, 5353242, 5422686, 5462516, 5472676, 5467619, 5426631, 5356571, 5289803, 5228433, 5177411, 5118471, 5051359, 5000523, 4959878]
8514D959878k2424r564P010L3530N1167O3016Q2668J04414J03043R7269R6270
8503E566277Q1448Q4917Q0127N7191K4835k2161l8729n1660p5829j05622j08050
8492E492744j04222j21884j41891j35810j31669j05896p8142p6253n8256m6637
8482D492084l4946k0204j4926K347L4192L3423M3133Q4301R9842J13379J26483
8471D959108J42973J81655J97143K20042K69971K78960K99370L30809L64310M01953
8461G646294M04743M08354M15683M16995M06826L87782L69069L38583L06900L02318
8451A1403547K94741K60621K16819J61777J16214P8904J7763k9751n9207p9645
8441A2381783r1661j24806j08845q3644p2903m5109j6339J7901O1853Q2735R7988
$$ y = [4959878, 4937454, 4927890, 4934900, 4968430, 5019597, 5082613, 5165281, 5269695, 5372738, 5470007, 5566277, 5647725, 5732642, 5812769, 5869960, 5894795, 5872634, 5833905, 5782245, 5706416, 5600794, 5492744, 5388522, 5266638, 5124747, 4988937, 4857268, 4751372, 4673230, 4596977, 4538721, 4492084, 4457138, 4436934, 4422008, 4424355, 4458547, 4491970, 4535103, 4619404, 4719246, 4832625, 4959108, 5102081, 5283736, 5480879, 5700921, 5970892, 6249852, 6549222, 6880031, 7244341, 7646294, 8051037, 8459391, 8875074, 9292069, 9698895, 10086677, 10455746, 10794329, 11101229, 11403547, 11698288, 11958909, 12175728, 12337505, 12453719, 12532623, 12550386, 12520635, 12461428, 12381783, 12290122, 12165316, 12056471, 11972827, 11899924, 11854815, 11838476, 11856377, 11918230, 12000965, 12098953]
8430A2098953R3715J15636J15409R8206J07761J18757R2118O6940K0301k4945
8420A2902851n0893q6173j35612j87945k48542k89194l34421l64210l76637l71790
8410A0457434l86777l68201l56752l34046k99585k56553k42646k12917j78942
8401G821015j53312j18197j00573o0699l4734l207N0363P5383R6556J28865J63995
8390G865455J98885K18996K50190K72128L13409L22351L44784L48156L54264L59921
8380A0848539L52362L36174L20123K99040K65088K35184K21665J86750J58792
8371A3223717J22051Q9189P9162M5089K5161r4k3947m8235m4481m5351j5849p412
8359A3399000K4410O4945R3814J35250J43652J64179J76438J82628K03999J91947
$$ y = [12098953, 12192668, 12308304, 12423713, 12521919, 12629680, 12748437, 12840555, 12907495, 12927796, 12902851, 12851958, 12765785, 12630173, 12442228, 12193686, 11904492, 11570071, 11205861, 10829224, 10457434, 10070657, 9702456, 9345704, 9011658, 8712073, 8455520, 8212874, 7999957, 7821015, 7667703, 7549506, 7448933, 7388234, 7353500, 7350293, 7400656, 7476039, 7572595, 7701460, 7865455, 8064340, 8283336, 8533526, 8805654, 9119063, 9441414, 9786198, 10134354, 10488618, 10848539, 11200901, 11537075, 11857198, 12156238, 12421326, 12656510, 12878175, 13064925, 13223717, 13345768, 13434957, 13514119, 13559208, 13584369, 13584275, 13560328, 13512093, 13467612, 13422261, 13406412, 13399000, 13423410, 13488355, 13582169, 13717419, 13861071, 14025250, 14201688, 14384316, 14588315, 14780262]
8349A4780262J78197J43417J30966J07139N9162K6762j3478m7866p3115r4674
8339A5196772j29389j58908j90067k17294k39559k23859k24639k14750k18969
8330A3379338j90873j86874j64256j61154j56312j37465j01896q4666o9394n6688
8320A2069760m3784k9596l0209k5764j5489L199k4620k888J5794J8289R786k368
8308A1942110R400J8556l856q135j025r956j1971p195j8037l1631m6232q5066
8296A1746962j08897j31944j41389j52408j64136j79947k01282k15837k03341
8287A0247781k09166j92861j93309j64435j49622j56408j39561j32283j24417
8278H785719j08757q3036j06999r8577r1661q2539p5523q0422j16451j24900j29305
$$ y = [14780262, 14958459, 15101876, 15232842, 15339981, 15399143, 15425905, 15412427, 15364561, 15291446, 15196772, 15067383, 14908475, 14718408, 14501114, 14261555, 14037696, 13813057, 13598307, 13379338, 13188465, 13001591, 12837335, 12676181, 12519869, 12382404, 12280508, 12195842, 12126448, 12069760, 12025976, 11996380, 11966171, 11940407, 11924918, 11928117, 11903497, 11900609, 11916403, 11934692, 11944478, 11942110, 11951510, 11970066, 11966210, 11958075, 11957050, 11947094, 11935123, 11927928, 11909891, 11878260, 11832028, 11746962, 11638065, 11506121, 11364732, 11212324, 11048188, 10868241, 10666959, 10451122, 10247781, 10038615, 9845754, 9652445, 9488010, 9338388, 9181980, 9042419, 8910136, 8785719, 8676962, 8593926, 8486927, 8388350, 8296689, 8214150, 8138627, 8058205, 7941754, 7816854, 7687549]
8267G687549j37889j43534j82496k07735k13431k06450k16926j99220j92758j98397
8257E788713k00707j85735j70666j77676j72708j51770j45928j39598j25656j09198
8247D209071j19097j09959j12992j07855r1368r9596r5940q7592j03801q0647
8237C200224o9820p8015q5505p1126p0497n9231o8273o1769p1347n7359m5017
8226B462265m0114n7105n3446n9626m3349k6138j6945l3802m5935l7476l6780
8215B011549l7513l0846k7162k8757l9849n3434l0271k6005l1419j6534k2131
8204A667628k8203j9471q295k1401k8649k2681k2713j4160l8971m0215k4408k3041
8192A375420k0112k0144j7695n690j2795k6195j8186j8571k0957k9142k2452j1391
$$ y = [7687549, 7549660, 7406126, 7223630, 7015895, 6802464, 6596014, 6379088, 6179868, 5987110, 5788713, 5588006, 5402271, 5231605, 5053929, 4881221, 4729451, 4583523, 4443925, 4318269, 4209071, 4089974, 3980015, 3867023, 3759168, 3667800, 3568204, 3472264, 3384672, 3280871, 3200224, 3130404, 3052389, 2966884, 2895758, 2825261, 2766030, 2697757, 2635988, 2564641, 2507282, 2462265, 2422151, 2365046, 2311600, 2251974, 2208625, 2182487, 2165542, 2131740, 2085805, 2048329, 2011549, 1974036, 1943190, 1916028, 1887271, 1847422, 1793988, 1763717, 1737712, 1706293, 1689759, 1667628, 1639425, 1619954, 1611659, 1590258, 1561609, 1538928, 1516215, 1502055, 1463084, 1422869, 1398461, 1375420, 1355308, 1335164, 1317469, 1311779, 1298984, 1272789, 1254603, 1236032, 1215075, 1185933, 1163481, 1152090]
8180A152090j1333j0320k5302j7197r038k2177k6878q850l568k0679l1072j9192
8168I46484j9063j0504p698k2588l699j3931j4678j4684q067j2612r725j8154
8156G91081o994O30j3593o240k0974j1558n760j5389l734j3472j5376j4027k752
8143F61842j0115M492L267j9162N395M290m051l135q289k0641k300j3112q104
8130E90377J2183R827j8599j0068k517L506k2131j0904R723q65M960n12j1172
8117E53808j1410r595n291p171K111j3433n183N697o99m970q172k668j6561J166
8103D77629J137m224J300m418K086R052M81j3742o464J2319k45k2160K867J834
8089D57452p569r507k874Q400P4j9366n079J7036m237k0624j3390j9483j1157
$$ y = [1152090, 1140757, 1130437, 1105135, 1087938, 1078900, 1056723, 1029845, 1020995, 1017427, 996748, 965676, 946484, 927421, 916917, 909219, 886631, 882932, 869001, 854323, 839639, 831572, 818960, 809235, 791081, 784087, 784717, 771124, 764884, 743910, 732352, 726592, 711203, 707469, 693997, 678621, 664594, 661842, 651727, 656219, 659486, 640324, 645719, 650009, 645958, 642823, 634534, 613893, 611593, 598481, 590377, 602560, 612387, 593788, 583720, 581203, 584709, 562578, 551674, 561397, 560532, 565492, 564980, 553808, 542398, 532803, 527512, 520341, 522452, 509019, 503836, 509533, 508834, 503864, 495692, 493024, 476463, 477629, 478766, 474542, 475842, 471424, 473510, 482562, 483043, 469301, 462837, 475156, 474911, 452751, 455618, 457452, 449883, 440376, 437502, 445902, 445976, 426610, 421531, 438567, 434330, 413706, 400316, 380833, 369676]
8076C69676j1171j1256n346R240J7149j3149o400N056P521K725o567o606j3185
8063C37687j817o015k27K585P853N632n313o192Q040N868j1362p24J0455m558
8049C41912Q495J8242O548J8745l811N16O287l643o109P341p447j5951j2451j1404
8035C47270j0215m720L142j2988j7617J069K207J566j2529j4864o248J1105J3891
8022C01069P32k9893j251J0902O980J4599K858n207j4643q276j0024q614L507
8009B62739O137m650j0432N013J1544L902r253l292K855p923O599L016J946m031
7995B64170m714j1345j4339M882l437m135M25J1315m709o081n831n56k281J1597
7981B34961Q17J5423L412r96o314K120O907j1036m495Q262q567j0454p952O384
$$ y = [369676, 358505, 347249, 341903, 351143, 368292, 355143, 348743, 353799, 361320, 364045, 357478, 350872, 337687, 335870, 329855, 329628, 332213, 340066, 345698, 340385, 334193, 342233, 348101, 336739, 336015, 346470, 341912, 350407, 368649, 375197, 393942, 390131, 390647, 396934, 393291, 387182, 394523, 387076, 371125, 358674, 347270, 337055, 332335, 335477, 322489, 304872, 305941, 308148, 309714, 297185, 282321, 276073, 287178, 301069, 301801, 271908, 270657, 281559, 288539, 303138, 305996, 300789, 286146, 277870, 267846, 259232, 262739, 268876, 264226, 253794, 258807, 270351, 274253, 265000, 261708, 264563, 256640, 263239, 266255, 268201, 264170, 259456, 248111, 233772, 238654, 235217, 231082, 231507, 242822, 238113, 232032, 226201, 225645, 223364, 234961, 235778, 251201, 254613, 253617, 247303, 249423, 256330, 245294, 240799, 249061, 240494, 230040, 222088, 228472]
7967B28472q342l073l653K495j3255J7171J7132O229N195M30o339j011M820n494
7953B40777j3879p901L455J45L112J48o095k803j2897j709p939m272n262p880
7939A77000M650J183J2004K398j0545l108p037K600j7575k1977J3453M724L687
7926A61457k0874Q905R955j0481j72p694Q27Q730j6908l143n625k50Q540L542
7912A36809j2858j578P074K016J843m317m209m033m054J1739J1957J4316p140
7899A47565k355J5190L154n646k2603q963m828Q342M57Q653J0l427L536j271L52
7884A38166L133K525p758m482j7709o090R745q506K655J561J0850q82J000L751
7870A27959k225R168j140j5675R98K748p315o886j6443N830N948m598K685J9834
$$ y = [228472, 220130, 217057, 213404, 215899, 202644, 219815, 236947, 243176, 248371, 248801, 242462, 241451, 246271, 240777, 226898, 218997, 222452, 222597, 225709, 225857, 219762, 216959, 204062, 202353, 194414, 190142, 184880, 177000, 181650, 182833, 194837, 197235, 186690, 183582, 176545, 179145, 161570, 139593, 153046, 157770, 161457, 140583, 149488, 159443, 148962, 148790, 141096, 141923, 150653, 133745, 130602, 124977, 124727, 133267, 136809, 123951, 122373, 129447, 131463, 133306, 128989, 124780, 120747, 116693, 128432, 140389, 154705, 147565, 145210, 160400, 163554, 157908, 135305, 126342, 121514, 129856, 130313, 138966, 138976, 135549, 139085, 137814, 138166, 141299, 143824, 136066, 131584, 113875, 107785, 117530, 109024, 111679, 113240, 124090, 123208, 124208, 127959, 125734, 134902, 133762, 118087, 119085, 121833, 114518, 107632, 91189, 97019, 102967, 98369, 101054, 120888]
7856A20888R504j8389k0931j5473j2052K205K613m83J4918k088O126j221k861
7843H2756J0543P440k017N721o36p406l469J2552j597j8082L936M760l961j1036
7829G9504r141k30l723o54J4561R807p912j6891J1546N233k359r770j690m994
7815F3287K538K74n429N607N994m37l810q262l565J0798Q913J0565L019r980q037
7800G1475o397O677M124n77M23o377J868j073n620j0530l898P854P791Q805K970
7785G7515k050M312q178K067O819o469j2448n997j0472Q142J2078J0475q104N825
7771G3515j1077j5707j6073m27J9665Q650p300k2672o042j285O569M217J73O713
7757C8919J1213O372J0256L946J792k4734j8788q11M821O132J1215N448m062K047
$$ y = [120888, 130392, 112003, 91072, 75599, 63547, 65752, 68365, 67882, 82800, 80712, 86838, 85617, 82756, 93299, 100739, 98722, 104443, 103807, 96401, 92932, 105484, 103887, 85805, 89741, 94501, 90540, 79504, 70363, 70133, 66410, 65756, 80317, 90124, 82212, 65321, 76867, 82100, 79741, 69971, 68281, 63287, 65825, 66099, 60670, 66277, 72271, 71834, 68024, 59762, 56197, 66995, 75908, 86473, 89492, 79512, 71475, 65078, 71755, 75879, 75302, 75725, 69348, 71216, 70143, 64523, 53993, 50095, 57949, 65740, 74545, 77515, 75465, 79777, 71599, 73666, 80485, 74016, 61568, 55571, 45099, 53241, 65319, 75794, 67690, 73515, 62438, 46731, 30658, 30231, 49896, 58546, 51246, 28574, 22532, 21247, 27816, 32033, 32206, 38919, 50132, 56504, 66760, 70706, 72498, 47764, 28976, 28165, 32986, 39118, 50333, 55781, 51719, 53766]
7743E3766J551M915j4654k1775L780M799Q967J04K728K233j2000j6510o649J4612
7729B5867J7339M880J1038m664j443J6260l941j562j052p477j2926l952J6995
7716E5362m761p921o200j2094K426p176o772L451r67K034N448R019J8215Q595
7702E8659j5234o616n623K360J813R380J1273q635j9418q726k17N372J901j713
7688B4576j900j1387K602J7289J0391L341J373q507j0128q418N93k930m005j750
7674A1140p84N824J4089P920q598n310M439J0734J3966p198j1801j84J4146L708
7660E2091l834l108m260J480L524j1599j0972j8383k640J3459J9230J3789L383
7647E2160j3495j2167p363O126j2698J6048M179o413J1496J0967p849p355O537
$$ y = [53766, 55317, 60232, 45578, 23803, 27583, 32382, 41349, 41453, 44181, 46414, 34414, 17904, 11255, 25867, 43206, 48086, 59124, 54460, 53017, 69277, 65336, 63774, 62722, 55245, 42319, 38367, 55362, 50601, 42680, 36480, 24386, 26812, 19636, 12864, 16315, 15348, 17382, 22830, 31849, 50064, 58659, 43425, 36809, 31186, 33546, 35359, 44739, 56012, 47377, 27959, 19233, 19016, 24388, 26289, 24576, 22676, 11289, 13891, 31180, 41571, 44912, 46285, 37778, 27650, 19232, 19825, 16895, 12890, 11140, 10356, 16180, 30269, 38189, 29591, 24281, 28720, 39454, 53420, 46222, 34421, 34237, 48383, 52091, 48257, 45149, 40889, 42369, 45893, 34294, 23322, 4939, 2299, 15758, 34988, 48777, 52160, 38665, 26498, 19135, 25261, 12563, 28611, 32790, 26377, 37873, 48840, 40991, 33636, 40173]
7634D0173N120k030O62M464N96o867m609K798l641J36q136l388J7612N910m721
7619D4079j8376j0776J807N287j0137Q118M767N4j1336J0769R999j2789j3899
7606G567L492L437j1768n308J8686L237n741n300Q82J3938P453J803k316M478
7592C4540K704n735N31P029j715k2036o094M131J0320P870L576r815r857J378
7578A6827Q729N240k404l39q155l6m75J2244q919k3930N930J5729P357J5507J609
7563D4914r748q229j3611k3453K24J2437J0047p281q045L10J4447P206O143j6219
7549I142L6P090L619q443o321o030J7962J2523j827m812j4986N801r97r341N233
7534H649j0972j2643O151K0382J5192K815K115j3274L956J2353j5204k612M735
$$ y = [40173, 45293, 43263, 43925, 48389, 48985, 42118, 37509, 40307, 36666, 36802, 28666, 25278, 42890, 48800, 44079, 25703, 14927, 16734, 22021, 11884, 20002, 24769, 24823, 13487, 24256, 34255, 21466, 7567, 11059, 14496, 2728, -2580, 16106, 19343, 13602, 8302, 9184, 23122, 30575, 32378, 30062, 34540, 37244, 31509, 32040, 39069, 37354, 15318, 9224, 13355, 23675, 31545, 35121, 25306, 15449, 16827, 25556, 30796, 28392, 28053, 19898, 19862, 19387, 31631, 22712, -1218, 4712, 20441, 27798, 43305, 44914, 35166, 26937, 13326, -10127, -9903, 2534, 12581, 5300, -2745, -2435, 12012, 19218, 25361, 9142, 9178, 16268, 19887, 11444, 5123, -907, 17055, 29578, 27751, 22939, 7953, 13754, 12757, 3416, 8649, -2323, -14966, -8815, 11567, 26759, 29574, 31689, 18415, 22371, 34724, 19520, 16908, 21643]
7521B1643J7551P062j0574n843n962j5031n941L718p556o795K514k378K0113J9236
7507C1757Q57K527M135o472m329l631j0635j2281l627R932J527J037J2957J1288
7493C5042o951n209J0928m664j7654l563l431M928J6376l320J27q70j2117m807
7479D815k647K465P927J644r64K469n603j597P885n37P176P909r989o262q06k899
7463A0986n881J5648m770p45R238Q859p274j2823N324n223l622N566k370J090
7449A4003o237m209M231L932j241N742j296m661n24j574j747J1846J177k822l560
7434A3060Q751J6143K172k971j0943k4483k377J9202R275p839j4759p411j7188
7421a9368l45J3484J3436K382M079j0474R49L053l873K244O2J2598o591j0528
$$ y = [21643, 39194, 46256, 35682, 29839, 23877, 8846, 2905, 6623, -933, -7728, -5214, -7592, 12521, 31757, 32614, 35141, 39276, 32804, 28475, 24844, 14209, 1928, -1699, 8233, 9760, 10797, 23754, 35042, 28091, 22882, 33810, 29146, 11492, 7929, 4498, 9426, 25802, 22482, 22609, 21739, 9622, 4815, 2168, 4633, 12560, 14204, 13240, 15709, 10106, 8509, 16394, 15857, 23033, 30942, 20953, 14691, 13885, 10986, 5105, 20753, 15983, 15238, 24476, 33335, 26061, 13238, 18562, 13339, 9717, 15283, 12913, 14003, 7766, 3557, 7788, 11720, 10479, 16221, 14925, 10264, 9740, 8166, 6419, 18265, 19442, 16620, 13060, 21811, 37954, 40126, 37155, 26212, 1729, -648, 18554, 27829, 19990, 5231, -2180, -19368, -19713, -6229, 7207, 9589, 13668, 3194, 4143, 7196, 3323, 5567, 5629, 18227, 11636, 1108]
7407A108L59J0357j005r883K904j660J1211J5780j1626m156o300j1686J791p672
7393a0478o219M352P265P302K990J1761J7708j0804j2771q375K535Q027M37q515
7379E215Q106J0396K733J131M318L12j680n543L650j4724j351n408o01J3678J6296
7364C6528m894n105k2367j803P599P700o96m448j474O670o89j1765n67M901m966
7349D624k211l147O486K556M755J1282m426l730Q438k241p021j2445M136j3014
7335e958M532J3955M594m980l231L855m405q69m819r509K716O689j2036k0461
7321b9927o402J0583J8960J6845P552r918k73P244N058J128J3450o81K839R70
7307C7428o578r230j1518j0668j004J2715K664o70N225j0160O85n262j006l856
$$ y = [1108, 1467, 11824, 10819, 936, 3840, 2180, 13391, 29171, 17545, 13389, 7089, -4597, -2806, -10478, -16697, -12345, -5080, 2222, 5212, 16973, 34681, 23877, 11106, 2731, 5266, 13293, 13730, 5215, 13321, 23717, 26450, 27581, 31899, 32211, 30531, 24988, 28638, 13914, 12563, 7155, 6554, 20232, 36528, 31634, 26529, 4162, 2359, 9958, 17658, 16962, 12514, 11040, 17710, 17021, 5256, 4689, 9590, 4624, 2413, -734, 5752, 8308, 13063, 24345, 19919, 16189, 24627, 22386, 15365, 2920, 7056, -5958, -1426, 12529, 17123, 12143, 8912, 12767, 8362, 7493, 2674, -6835, -4119, 2570, -9466, -29927, -36329, -25746, -6786, 10059, 17611, 7693, 7420, 14664, 19722, 20850, 34300, 33619, 36458, 37428, 30850, 21620, 10102, -566, -1570, 11145, 13809, 13139, 18364, 8204, 8889, 3627, 2621, -1235]
7293a235P755P717j4129k60K184J1357J200R10M732j8946n546K079p160Q60R390
7278I08O467L071Q546l085r100O114K37o981r06q187M296Q774J758k350m61J1715
7262B0816L284l361r025q117j2463k418J450K833R344L110M624R517r43j5559
7248C092k3968m98J4116J1564k767r898k152j900J2804P269J637n452o09L710
7234F948k062J911M100P171j0111k526O861j0118J1099L498k050m223p111j0724
7220g337l168m758Q233Q964j1466k870O902J5286Q651r029p121l924J3305R135
7206B0803K69Q36j9300k5144R082K5725J0739N343k545j8777j4057L507J4016
7193A0497o590l436M687J513J761N366j3462k1661j85J1879o416P184M783J2761
$$ y = [-1235, 6520, 14237, 108, -152, 2032, 13389, 14589, 15499, 20231, 1285, -4261, -2182, -9342, -8482, 908, 7375, 10446, 18992, 15907, 6807, 12921, 13158, 6177, 5271, -2916, 1380, 10154, 11912, 9562, 9101, 20816, 24100, 20739, 11714, 3597, -8866, -11284, -9834, -7001, 2343, 5453, 10077, 19594, 18651, 3092, -20876, -21374, -7258, 4306, 1539, -8359, -10511, -12411, 393, 7662, 9299, 3847, 3238, 6948, 4886, 6797, 10897, 18068, 7957, 5431, 12292, 2174, 13273, 16771, 14721, 10498, 3387, -7337, -10505, -15263, -7030, 1934, -9532, -12402, -5500, 9786, 18437, 9408, 2287, -1637, 11668, 20803, 21072, 21908, 2608, -22536, -13454, 12271, 23010, 28353, 25808, 7031, -7026, -3519, 10497, 3907, 471, 5158, 6671, 8432, 13798, 336, -21325, -21510, -9631, -16047, -8863, -4080, 8681]
7179H681J9343j142n264j1313p25j4554j3266P243R433n53L881J7614J2774j469
7165C0683L341n141j8904m653j292j1756r617k485R229N264q768J1132J4187J867
7151A3087j2280l041j949J337K8j0334p371Q943O525k671J4286P119J975k801
7137A2853j933k258q450O885N60j0103k239j743P027o496J7369M422j2535K44
7123C603K057J7559m715j1320N781N074J312j5237J745J7338L197j0503n272K890
7109A3509Q249l10k103K549r355k2166r176R455P313n508l549o716o952M972K5810
7094F022J281k284q012K288J781r718k169P270N735Q418n641j3389j772M020r164
7079a5334P756R628j218q938J082J7947J0529q812P467R405j0874q204j854q230
$$ y = [8681, 28024, 26882, 21618, 10305, 9580, -4974, -18240, -10997, -1564, -2117, 1764, 19378, 32152, 30683, 34024, 28883, 9979, 5326, 4034, -7722, -17339, -19824, -10595, -5331, -14099, -2967, 11220, 13087, 807, -2234, -4183, -2846, -2818, -13152, -20523, -11580, -5055, -7726, 6560, 13679, 15654, 12853, 10920, 8662, 212, 7097, 7657, -2446, -4685, -6428, 599, -5897, 11472, 15894, 3359, 3603, 5660, 23219, 18504, 7184, 12965, 18039, 19351, 4114, 5859, 23197, 26394, 15891, 10619, 13509, 21758, 21448, 19345, 21894, 12539, -9627, -18803, -9348, -2035, -7543, -11092, -17808, -24760, -19788, 6022, 7303, 5019, -2993, -705, 1076, -8642, -10811, -3541, 2194, 10612, 4971, -8418, -10190, -6170, -15334, -7578, 2050, 832, -8106, -7024, 10923, 21452, 12640, 20107, 29512, 18638, 10434, 8580, 350]
7065C50N795k272j298P896q354q310j452J1091J7000P769j9144r660Q994J988
7051A0393j8923j4395p364J2150K0713m563k338J315M918Q415k647j5168j2309
7038a9803O070K2656R381p229j0832M418J3955k016p125Q043j1073j1101J2603
7025G947L381l700n841l967j0021j4115n865p882J3881K7922J1663k990j3806
7012c393k003J5835N120N907J4435o614j4439k38R796q117N519j459j0506o505
6998C338J404n349l063o080O669N084J0120j0574J601J2847l319n294j3033n665
6984a1314K055Q302J0116J7217m525k7248j2991J1236k644k346j1006J1454K1065
6971I371j0683j7089j7926J1691K9714K609j7728J4080J0516q80Q750l412J470
$$ y = [350, 6145, 3873, 2575, 10471, 2117, -6193, -7645, 3446, 20446, 28215, 9071, -589, 8405, 10393, -8530, -22925, -30289, -18139, 2574, -1989, -4327, -3012, 1906, 10321, 7674, -7494, -19803, -13733, 8923, 18304, 11075, 243, 4661, 18616, 16600, 9475, 17518, 6445, -4656, 7947, 11328, 7628, 1787, -2180, -12201, -26316, -32181, -40063, -26182, 1740, 13403, 10413, -3393, -5396, 10439, 15559, 21466, 35901, 29287, 14848, 14610, 24406, 16289, 21808, 20349, 9843, 3338, 4742, -607, -3670, -9750, -3081, 2003, 12123, 1549, 3150, 15997, 12678, 7384, -5649, -11314, -9259, -957, 9159, 26376, 21851, -5397, -18388, -7152, -9796, -12142, -23148, -11694, 9371, -1312, -18401, -36327, -24636, 5078, 7687, -10041, 4039, 14555, 13675, 22425, 19013, 20483]
6958B0483J1044n599n659k675O244L127K360j1728r911L119j827p283J161M538
6944G394j0343O214M47j196K616o902J6319R39k5698M373Q581J8740K059j7406
6930F137k5955L99Q273P232J4378j61N129J975N139j2990L685J1500R992j1306
6916B3427j0002P418M514Q593L50P271p55K82j0427K562L681R26r130p741j2775
6901H194j286l241j543k089j2221L708J2757J0366O07O27j024j8398j8763r734
6887c2040K1684K3149J8599j2391k0635o563N879O224m847n144m80J766K857N421
6873C479L837K795j830l041j047K492l592n001n739L60M111q284J3328R441q044
6858C265j0282J779R997m77N146O829k759L692j6709j3010Q0J5959R678j5486
$$ y = [20483, 31527, 25928, 20269, 17594, 23838, 26965, 29325, 17597, 7686, 10805, 8978, 1695, 2856, 7394, -2949, 3265, 3712, 2516, 5132, -1770, 14549, 15488, -10210, -5837, 2744, 21484, 23543, 6137, -19818, -19419, -11146, -3914, 10464, 10303, 15432, 17407, 22546, 9556, 13241, 24741, 34733, 23427, 13425, 20843, 25357, 33950, 34300, 41571, 40816, 41098, 30671, 33233, 36914, 37840, 28710, 20969, 8194, 6908, 3667, 2124, 35, -12186, -8478, 4279, 14645, 15252, 15879, 14855, -3543, -22306, -32040, -10356, 12793, 31392, 19001, -1634, -8197, -2318, 3906, -941, -6085, -6565, -4799, -1942, 3479, 7316, 10111, 8281, 5240, 4193, 6685, 3093, -1908, -7647, -7287, -3176, -11460, 1868, 11309, 3265, -7017, -5238, 4759, 4282, 9428, 16257, 13498, 17190, 481, -12529, -12449, 3510, 13188, -2298]
6844b298m909n173O772J310l727J7176O807j5157j3174J724R440j935o460L680
6830e924O948N445o137j1949n109q28Q897J3069J2507q197j5894m337J1016Q220
6816G727l461m201M914l04j7632p7Q511Q10q476P844N174M325R260j1674j3806
6801a1066n214Q106J9463j94j3932J0463K483q769J863j694r313N265P755j2411
6787g195J0696R145J0319Q29j8143j3543M172n850O649P432Q811J7475L124j878
6773C2043m737j0460J310L160q408r103k613j543O46n239k926P623N12Q090q354
6758Aq581o222N371P715L661J2795P705q369j5160p140l86J0401K161o92P885
6743A1145m905r976O941r500m52J4736l551j1332K431J123J4977%j7462m856O637
$$ y = [-2298, -7207, -12380, -5608, -4298, -8025, 9151, 15958, 801, -12373, -10649, -1209, -3144, -9604, -5924, 1024, 6469, 332, -11617, -16726, -17554, -8657, 4412, 16919, 8722, -7172, -11509, -493, 7727, 4266, 65, 4979, 4675, -12957, -13034, -4523, -3713, -12189, -4345, 829, 5154, 14414, 2740, -11066, -16280, -8174, 11289, 11095, -2837, 7626, 10109, 1340, 3203, 1509, -7804, -2539, 5216, -7195, 3501, 12646, 22965, 23794, 5651, -7892, -3720, -9570, -2921, 4511, 13322, 30797, 33921, 32043, 27306, 16846, 18156, 21316, 12908, 3805, 1192, -351, 295, -4944, -7870, -247, 265, 8355, 1, -8580, -14802, -9431, -1716, 1945, 14740, 22445, 14076, -1084, -8224, -8610, 1791, 3952, 3260, 11145, 6240, -3736, 3205, -6295, -6747, 7989, 4438, -6894, -4463, -3340, 11637, 11637, -5825, -10681, -4044]
6728d044J1714M759M579J532q729M89m538m735p077K488J0761L831j23L658n85
6713A3980r97R073J0432Q748j536J1906p422j4506j7893J028k888J737m54J476
6699A2684R149j760j2698j840R693j5889j9038J862J4869P582m406j1066k0554
6686c1412N353J7820J5104P439j1108k869N382O854n9j4298m857m969j608O307
6672f921J7848J3921j3575j0013K074J442q166O671J8973p149r729J0919J4821
6659C1116P968n844p461J268j990j5844J167J1851p558j0388L415L145q73p775
6645B197q428M251J592L140l777Q231R660n075j4430J157L928m782j401o503j1061
6630b1301J7178q784l408K428J1456K857p067J437J0443q241N879N982l522K441
$$ y = [-4044, 7670, 12429, 17008, 18540, 9811, 10300, 5762, 1027, -6050, -3562, 7199, 11030, 10907, 14565, 13980, 12983, 22056, 32488, 41236, 39700, 51606, 44184, 29678, 11785, 12813, 9925, 11662, 11208, 12684, 21833, 20073, 7375, 5535, 15228, -661, -19699, -17837, -2968, 4614, 208, -10858, -31412, -26059, -8239, 6865, 14304, 3196, 327, 5709, 12563, 12504, -1794, -6651, -11620, -13228, -6921, 10927, 24848, 11273, 1260, 3334, 4776, -3390, 3281, 22254, 15105, 5376, 16295, 31116, 39084, 33240, 25779, 27047, 25057, 9213, 10380, 22231, 14673, 4285, 7700, 10845, 9972, 2197, -6231, -1980, -388, 2752, -1025, 7206, 16866, 11791, -2639, -1482, 2446, -2336, -3737, -10240, -21301, -4123, -12907, -16315, -13887, -2431, 426, -6641, -5204, 5239, -3002, 2877, 8859, 5337, 7778]
6616G778o373M681J2607J0763o033q477q971q683l65j3546q681r910J1032m289
6602b8467j2119O327O983J4926J3185p937L046J3989J146o11j5085N0N847P62
6588B042K845J2230O770j511j1463n171J258J83j691P662P125q309j2005o268
6574f303j1444j938M873P50K728N679J1118P918L493j2013k049L066j4184l899
6560a2205J4003j075O475J5638O642k0155j3137p014q64J0441J2522j279j0840
6547h48j0258N783M977J03q498L518N312O132K259j0714j2041m107P592p358K135
6532a6013J3778O296J912j2833Q00M84K366l329o848m7N475l00o121j2676J0701
6517a6355J8100j128j1289K565M946O042J69L11p913n408M111P183k970k066r149
$$ y = [7778, 1405, 6086, 18693, 29456, 23423, 14946, 5975, -2708, -3073, -16619, -25300, -35210, -24178, -28467, -40586, -34259, -27276, -12350, 835, -7102, -4056, 9933, 11079, 10468, -4617, -4567, 1280, 2042, 4887, 17117, 23887, 22376, 10913, 5742, 7000, 7183, 5492, 13154, 20279, 11970, -35, -6303, -17747, -19685, -14812, -14062, -11334, -5655, 5463, 13381, 16874, 4861, 2812, 5878, -8306, -12205, 1798, 723, 7198, 22836, 29478, 9323, -3814, -10828, -11692, -1251, 11271, 9992, -848, -11106, -5323, -346, -243, -8741, -5223, 89, 6221, 8480, -2234, -14275, -18382, -10790, -18148, -16013, -2235, 4061, 5973, -6860, -6060, -5576, -3210, -6539, -13387, -13434, -7959, -8259, -14380, -27056, -16355, 1745, 617, -10672, -8107, -3161, 2881, 3050, 3361, -4552, -9960, -5849, 1334, -1636, -3702, -12851]
6502a2851j1763J1654Q294o94K226O236P260o619m969j0097j403J1321K623q75
6488C43j6231o5M556m364J1884J966p016l291k511O080J5839N102R484k63n013
6473A6500m970p196k621r86L015p544r4Q52o99j0088l278n246j464N835L097J985
6457a2902M302P300M934L503k110o905r53l338L240J2674K199O390p375j0620
6443C39o345O95m408O077J0305n570O099j0848j7793O80J0832O560r475j1718
6429b4570M844J675Q963P893j1402n79Q58p529j3999J985R194Q221L709n021K184
6414a3574m104K761J155R885P258l581n496L686R031K570j248K801J0682N135
6400B6961j864j4854j0763j1516N918M873Q624n193Q241N585j1430k925j761J4489
$$ y = [-12851, -24614, -12960, -4666, -5360, -3134, 3102, 10362, 3743, -1226, -11323, -12726, -1405, 1218, 343, -15888, -15953, -11397, -15761, -3877, -1911, -8927, -12218, -14729, -8649, 7190, 12292, 21776, 21513, 16500, 11530, 4334, 1713, 727, 3742, -3802, -3896, -3044, -3743, -13831, -17109, -22355, -23819, -17984, -14887, -12902, -8600, -1300, 3634, 7137, 5027, -1878, -2831, -6169, -2929, 9745, 11944, 18334, 10959, 339, -6006, -5311, -9719, -3642, 6663, 1093, 7192, -3656, -21449, -20769, -9937, -3377, -12852, -24570, -19726, -18051, -9088, -1195, -12597, -13176, -12318, -19847, -33846, -31861, -22667, -14446, -10737, -15758, -13574, -17678, -14917, -13762, -3877, 3381, -200, -5696, -2010, 7021, 9591, 8343, 11144, 21826, 26961, 25097, 10243, -520, -12036, -6118, -1245, 7379, 2186, 10427, 16012, 4582, 1657, -104, 14385]
6386A4385l286j3304O311M92r479K447q050j902K675k956j1588J4411K3971J5058
6372B9185j4238j5520J572J75r649n723J017M049r05k733Q920K961o211P996M204
6357E100l879l537o393M053P149j369M809o786j5534k254J0496J0141n754K680
6343a078K998Q389Q048j825J1731J0968o383k778m592j5421j0051Q512Q291j9852
6329c043j1724j251J446L072q584l837L911J6003Q627n680J1026j5481r338j2035
6315b6888l865J6052L517m263R283Q538J0907n485q722r070L651R715j776k464
6301h70j493k271J892k0439O352K1853j033K011O05n896k0594O595J5005P471
6287I188j6740j1299N145J1112Q743l143j6992j2315o924J7355k420j346J4615
$$ y = [14385, 11099, -2205, 4106, 4598, -4881, -2434, -10484, -12386, -9711, -12667, -24255, -9844, 14127, 29185, 14947, -573, 999, 1174, -8475, -14198, -13181, -9132, -10037, -12770, -3850, -889, -7100, 896, 5100, 1221, -2316, -8709, -4656, 2493, 1124, 5933, -853, -16387, -18641, -8145, 1996, -3758, -1078, 1920, 10309, 18357, 16532, 28263, 39231, 32848, 30070, 25478, 10057, 6, 8518, 16809, -3043, -14767, -16018, -14572, -11500, -20084, -23921, -20010, -4007, 4620, -1060, 9966, -5515, -14853, -26888, -30753, -14701, -11184, -15447, -6164, 2374, 13281, 7796, -926, -9996, -6345, 3370, 1594, -870, -2363, -4634, -2742, -23181, -16829, 5024, 3991, 6002, 6607, 711, -19883, -13288, 1717, 9188, -7552, -18851, -13706, -2594, 6149, 3006, -13986, -26301, -33225, -15870, -18290, -19636, -5021]
6274e021n111O44J8194j8345o711J3688J7513m534n655L069M030O629l897k689
6260A1804p838k424o861M56M811q220n618l772J4689R928k195M315j5499r018
6246a5442M966n990Q048l762j0797J051J6698J4586Q825N789j5764k718OM420
6232I916q341J772J6924L873o88o093R705j0169p095j0854j5398k787Q464N346
6218e425J432M029K260m351j1139l358O956N978j105J375r77j4577J379n37M78
6203a7582j0295Q929J0614p870j2705j922m712j871m014J5913Q138m903m033J5809
6189a0504N086o751j0655m87k76O561J5487q35Q118R450K753m410p644j7397q026
6174a9530K285j049m170O249R364J4742j311M72R879j2003k9995p82L462J4361
$$ y = [-5021, -10132, -9488, 8706, -9639, -16350, -2662, 14851, 10317, 4662, 7731, 11761, 18390, 14493, 11804, 3966, 1542, -5319, -4863, -52, -8272, -13890, -17662, -2973, 6955, 4760, 9075, -6424, -15442, -10476, -16466, -8418, -12180, -22977, -21926, -5228, 9358, 18183, 23972, 8208, 5490, 5496, 9916, 1575, 3347, 20271, 24144, 23456, 17363, 27068, 16899, 9804, -1050, -16448, -19235, -10771, -5425, -3993, 36, 2296, -2055, -13194, -16552, -9596, -3618, -4723, -3348, -4325, -18902, -17523, -18060, -17582, -27877, -18948, -8334, -16204, -28909, -30831, -35543, -37414, -41428, -25515, -17377, -22280, -26313, -10504, -5418, -12169, -22824, -23311, -23587, -17026, -1539, -2374, 5744, 15194, 17947, 13537, 5893, -11504, -19530, -17245, -18294, -22464, -16215, -6851, 7891, 6580, 7052, 16931, 4928, -25067, -25849, -22387, -8026]
6160h026O074o290M321J475J2272P556j1833j0635k986P245o335k1011N608J5390
6146g175K1864N332q783k0596Q64J3684p49r64r245P798J4502r615q197p445p307
6131a6032J471J0597j0159j2066P733k896o765M083J7977J5040m853j4719n770
6118a6359P98J0952R771m66l148m267O283Q940N001M815J0967j681k1438k0631
6104a0463J3911R575p12m024l81r14j2755j0027N529M868L98R940j0173j312l546
6089a0086M661L070O647J1621k670r265P824n176j8523q214l244L173J788J2733
6075e661q612o936J8381J4481p469K120K410l743j5033q384J5205o652m486o856
6061b1235N048K1988Q929l196K654J177K791j2931p780L271k517o012M92Q116
$$ y = [-8026, -1952, -8242, -3921, -2446, 9826, 17382, 5549, -5086, -8072, -827, -7162, -28173, -22565, -7175, 14689, 20021, 11238, -9358, -8494, 5190, 4441, 3477, -5768, 2030, 16532, 6917, -1280, -8725, -16032, -14561, -3964, -14123, -26189, -18456, -21352, -28117, -24034, -6057, 8983, 4130, -10589, -16359, -15561, -4609, 5162, 4696, 1548, -2719, 3564, 12504, 17505, 22320, 33287, 31606, 10168, -10463, 3448, 13023, 12311, 8287, 7906, 6992, -5763, -15790, -10261, -5393, -4995, 4945, -5228, -6540, -10086, -5425, -2355, 4292, 15913, 13243, 3978, 11802, 6626, -11897, -20111, -23355, -20182, -18394, -5661, -14273, -21209, -2828, 11653, 4184, 6304, 8714, 4971, -10062, -18446, -3241, -9893, -14379, -21235, -16187, 5801, 14730, 11534, 14188, 15365, 18156, 5225, -2555, 716, -1801, -7813, -7321, 795]
6047G95J181m218r809K688k875Q181O093j2011J0347j306r506J3110R751j1355
6033A066j5265n150K0505P630n379m686j0946j1272J009L89P901l328q554N205
6019b0875M376l74p39J2383m373j1752L555P839L314k752O903J3332m000j056
6005E781O896j1863p309O792o326j2697j005K165n233M203J9197Q167j4047o18
5991e897J2375n223m131N562q516J111R4j2307Q449K0938J110q315l773j0742
5977i265n020m909j1405r46j410N683J3715j1939J998J7222R562m562o505P77
5963g004p236J575N611J9715P567j4791j7482O510K560o056o24q585R725O260
5949b255N44R805j229j0852l916j81j777j020o156j365J229O484N428M364P837
$$ y = [795, 1976, -2242, -12051, -9363, -12238, -4057, 2036, -9975, 372, -934, -10440, 2670, 12421, 1066, -14199, -19349, 1156, 8786, 3407, -1279, -12225, -23497, -22488, -22099, -14198, -17526, -26080, -20875, -16499, -16873, -17612, -5229, -9602, -21354, -17799, -9960, -6646, -9398, -2495, 10837, 6837, 5781, 12677, 814, -6495, 297, -6029, -18726, -19731, -17566, -22799, -18596, 601, 8768, -5279, -5897, 6478, 1255, -2876, 2686, -5830, -4719, -4625, -16932, -8483, 12455, 13565, 5250, 1477, -9265, -14285, -19194, -30599, -31545, -32955, -27272, -13557, -25496, -23498, -6276, 3286, -1276, -7781, -7004, -14240, -12665, -7054, 12661, 20228, 5437, -12045, -5535, -2975, -9031, -9655, -18240, -8515, -2255, -1711, 8094, 6865, -3987, -7903, -8084, -9861, -10881, -17037, -18402, -17173, -10689, -5261, -897, 6940]
5934F940k766m909J0974j537k529L123J6170j146m213j2635n088k0360q737L574
5920b3139J3519K131j647j0586o973R799J4873j102j9052K109J567K33P361K962
5906g945R739m428j1686M608q564k786Q475P230l027M176j3339L047K916J424
5892a0160J221o614M712N41j779m111J1557O336l956K637Q489r102j4085p183
5878b1497O652m720j588p636K794K348Q770Q240l299R361p23l549q829j4508j4
5863b8198M031Q65M723P442J8245N053p665j0735q259J1768K847N409Q776j2877
5849A425m432q600j466K293N286J2289l545p607Q03j81Q578P946o009j1980J0395
5834E195L545l363L38M979k278q964j2935J847P950M255O147K990L275J910n389
$$ y = [6940, 4174, -735, 10239, 8702, 6173, 9296, 25466, 24320, 20107, 7472, 2384, -17976, -26713, -23139, -9620, -7489, -9136, -19722, -26695, -16896, -2023, -3125, -22177, -20068, -18501, -18268, -10907, -7945, 1794, -2634, -14320, -9712, -18276, -21062, -12587, -5357, -8384, -4208, -17547, -14500, -11584, -10160, -8939, -15553, -10841, -10300, -12079, -16190, -4633, 1703, -2253, 384, 8873, -229, -14314, -21497, -14845, -19565, -21153, -28789, -25995, -23647, -14877, -6637, -9936, -575, -1298, -4847, -13676, -28184, -28198, -24167, -23302, -18579, -11137, 7108, 12161, 4496, -6239, -14498, -2730, 117, 5526, 14302, 1425, -3007, -11607, -13073, -10780, -5494, 6795, 3250, -4357, -3554, -3735, 4843, 12789, 6780, -5200, 5195, 8740, 5377, 5715, 10694, 8416, -548, -13483, -11636, -3686, 569, 6716, 9706, 12981, 14891, 9502]
5819I502M09j2232j9241j2958M078K1110L094L529q869J6193P00j0117j383j4558
5805b0743J052J2227L290j86r172J2439Q677k0980o629J1100K336J9275q464k4781
5791b0559R349J4956R15j3038p623j0071R65P140P233M375M150R887m82P675N7
5776A4929o262k84j4901j4555L77J3043J6205q843j1553N797m907j2983J295k32
5762b2874j0190M891K0752J1054l492J7187K487j5127j2021j3433p189M342J1572
5749a2041P769Q901l458m042m338J0211j9082j5527P386K0596J2849q735n179
5736d690K797P91L089j599P417M55k0802j2596J3833J8372J1180J39j3235N753
5722A0904l694j1744j651l927j9244j4027k825J2727P118J0622K0264o128j0465
$$ y = [9502, 9911, -2321, -21562, -34520, -30442, -9332, -6238, -2709, -11578, 4615, 5315, -4802, -6185, -20743, -19691, -7464, -4174, -4360, -13532, -1093, 7584, -13396, -20025, -8925, -6589, 12686, 4222, -20559, -11210, 3746, 4661, -8377, -16000, -26071, -25106, -17966, -10733, -6358, -2208, 7679, 7197, 14872, 14929, 8667, 8383, -6518, -21073, -20696, -7653, 8552, -291, -11844, -6047, -10954, -23937, -22642, -22874, -33064, -28173, -7421, 3633, 141, 17328, 19815, 4688, -7333, -20766, -27955, -23613, -12041, -4272, 4629, 1171, -2871, -7209, 3002, -16080, -31607, -24221, -3625, 9224, 489, -4690, -1893, -1102, 1987, 388, 7805, 8260, -12542, -25138, -11305, 7067, 18247, 18386, 5151, 10904, 7210, -4534, -6185, -10112, -29356, -43383, -46208, -33481, -26363, -15741, 4523, -1605, -12070]
5709a2070K510r481p188p586R548O136J6415N741j0243n390J452J051Q332r801
5695a0574j5702k0792Q232Q530m049J9611k944o391q602J5210K0560N464m062
5682D491k116p650r061P634l14L046L516q36n332J47m924j072q382J0007L637
5667g209Q830j0330J067J463k873P265l134j3983q17J1129j821L068R447K702
5653D804o087J911J2857l619m377l374R12n774p434k814Q248J5450l180j1050
5639c527J1715J1642j640O227r997k006m88j1296L601J9480M333j206P77j3882
5625A3733k0320o38o212k320p542k377k777Q096J6557j866O706N876r103r676
5611a1863j0597j1595R930O722n773j551J0142N685n65j1021j188l399M850J7360
$$ y = [-12070, -9560, -19041, -26229, -33815, -24267, -18131, -1716, 4025, -6218, -11608, -10156, -9105, -773, -10574, -26276, -47068, -38836, -30306, -34355, -14744, -17688, -24079, -32681, -17471, 3089, 8553, 4491, 2375, -5275, -14336, -6702, -7016, -3970, -454, -1290, -6622, -6475, -11399, -12471, -20853, -10846, -7209, 1621, -8709, -7642, -6179, -9052, -1787, -4921, -18904, -19721, -8592, -10413, -7345, 2102, 4804, -1283, 628, 13485, 9866, 5489, 2115, 3027, -2747, -10181, -12995, -4747, 10703, 7523, -3527, 8188, 19830, 18190, 24417, 14420, 12414, 11926, 630, 4231, 23711, 28044, 26838, 27615, 13733, -6587, -7225, -13437, -15757, -23299, -25676, -28453, -20357, -3800, -5666, 1040, 6916, -2187, -11863, -22460, -34055, -24125, -17403, -23176, -24727, -14585, -8900, -9465, -20486, -21674, -25073, -20223, -2863]
5597b863Q524K480n455k245k290o863P090J7171J0149K989j1382k2344j1312M216
5583a2135P068N209J13m699n234m20l705L384O718o629n812R809O466k04J989
5568A918o347Q877l015K218N150L118L83j1889l860J0065j559j230J0977q598
5554F208j7935j512j76J038O334R457R874K79R37p315o546J907j1232J17J2734
5539D169r224p935p149j0724j6159J3154K5110L50m166J4851J8980j120j3937
5526F200q135k06J623J0232j898o563Q48j0255p65n34m168R563M687r386R54j0323
5510a8126k705J8612R838m566q583m11o193o563J2942K719j2379q590n948L493
5496b6460K299q034J4420J3243r013j4611l014J0906M541k198J8285N234j1386
$$ y = [-2863, 5661, 8141, 2686, 441, -1849, -8712, -1622, 15549, 25698, 28687, 17305, -5039, -16351, -12135, -5067, 142, 255, -4444, -9678, -10098, -13803, -10419, -3701, -10330, -16142, -6333, 133, -71, 1918, -4429, 4448, 1433, 3651, 8801, 11919, 12302, 413, -3447, 6618, 5059, 3829, 14806, 6208, -11727, -13239, -13415, -12377, -6043, 3414, 13288, 13567, 14504, 7189, 643, 2550, -8682, -8565, 4169, -5055, -12990, -20139, -30863, -47022, -33868, -8758, -8408, -12574, 2277, 21257, 20137, 6200, -1935, -2141, -518, 9714, 7816, 1253, 2101, -8154, -8919, -9453, -13621, -4058, 629, -8757, -7803, -18126, -20831, -2219, 7619, 3053, -5530, -5941, -12134, -18697, -5755, -3036, -15415, -24005, -29953, -26460, -24161, -32195, -17775, -4532, -13545, -28156, -31170, -20264, -15723, -17921, 364, 5598, -5788]
5483e788J577k16j1111l696R027K416j1395j0156P905R013N195j9532J1832P115
5469g814j2106J2405L049j0069p491J7616R466k952r083M162j4204j572M428j6583
5455c0748L831L448K171K250J7423N13N714P115N972N493N405n098j3866k663
5441F960M707o971m16m592o442K117Q203q587m908R740m052m764j7635l23J1531
5426a5432J475J8748o625m328o353j5607O638R111J1630J946P084J449L351m853
5412H234O640n156j418j4121o499o426p587P211J1444L573O833j2645k542p241
5398a9700r867n066R466J527J0130J5058J843k858j2884j477M039q97o543L080
5384a4149J3276R577j2038O70M370j606r483L353M017o123l599k124O272m758
$$ y = [-5788, -4211, -4427, -15538, -19234, -10207, -7791, -19186, -29342, -21437, -12424, -7229, -26761, -14929, -7814, -19920, -7515, -4466, -14535, -22026, -4410, 5056, 2104, -6979, -2817, -17021, -18593, -14165, -30748, -26917, -23469, -21298, -19048, -1625, -1112, 4602, 11717, 17689, 23182, 28587, 23489, 9623, 6960, 11667, 4696, 4280, -312, -6754, -4637, 3566, -5021, -9929, -189, -4241, -9005, -26640, -26963, -15432, -13957, 4791, -1834, -6162, -12515, -28122, -21484, -12373, -743, 1203, 8287, 9736, 13087, 8234, 14874, 9718, 8300, -5821, -12320, -18746, -26333, -19122, -7678, -4105, 2728, -9917, -12459, -19700, -29567, -34633, -25167, -23640, -13510, 1548, 3391, 533, -12351, -13828, -9789, -10686, -17229, -14149, -873, 8704, -3334, -2664, 1706, 100, -9383, -6030, -2013, -8136, -11735, -13859, -7587, -12345]
5370a2345o00L192P867L85q296j1836J7275O941M063j7489l319J4113q082n534
5356a3665k096J4985Q715o890L885J477n751j2271q855k446k413l486j1494J0133
5342c0172K2297K2589J643K095j02k0831q59j3056n266m77o828M779m070J1140
5328a7118J5572M109j1031p54n071J6071J0167n506N301n200j5790J1087J2918
5315A4755o419J327j4880r105q73J979J3643n38P73Q351q853p850j142q17p30
5300a0379j858K857n941m895M852M593M382n62J23P141n557j3415K377m419N234
5285a5467Q126m739j1513P704K426q584j1O901J090k339J4996p795j1941K569
5271a8577q359M885J2414o01J2717L420p096Q599J5138j930j5660j4703J6423
$$ y = [-12345, -12945, -9753, -1886, -1501, -9797, -21633, -4358, 2583, 6646, -10843, -14162, -49, -8131, -13665, -15761, -776, 7939, 1049, 4934, 6411, 660, -11611, -20466, -22912, -25325, -28811, -40305, -30172, -7875, 14714, 16357, 18452, 18350, -2481, -3340, -16396, -21662, -22139, -28967, -24188, -28258, -17118, -1546, 2563, -8468, -9222, -14293, 1778, 11945, 6439, 11740, 6540, -9250, 1837, 14755, 8336, 9663, -5217, -14322, -15195, -13216, 427, -111, 662, 9013, 160, -7690, -8832, -9649, -10379, -12237, -9380, -15321, -20216, -15364, -10771, -6389, -6951, -6828, 313, -5244, -18659, -16282, -20701, -15467, -7341, -12080, -23593, -15889, -13463, -22047, -22058, -15157, -14067, -16406, -1410, -9205, -21146, -18577, -26936, -22051, -9637, -10238, 2479, 5899, -1197, 7402, 22540, 20610, 4950, -9753, 6670]
5258F670k792j3536N778k621j7897k895M717J6272k155J0720K636j4870j1080
5245b1053K005l49J6875k676p551q290n565o245M330L1918J1814N390q447L073
5231A5229o579n457K132o843r254L193L313j3829M133k202J0349Q630o941l570
5217g696Q033P827j308k215m205L234R22l606Q817N296q901j3425N195K683p112
5202f461J768J4688J3676j644k0229j492Q866j0974N975J2903l114m838o845j2126
5188i847l061j4703L854K756P3K301J0369l581J2490P740l506l430L087M530j2553
5173c481M372k192n887K524P641Q866L63r75j157K111l007j2308L28K2930R540
5158B9668m780J904k1359m774K995K762j1354r755O311O052r239l519J3049o635
$$ y = [6670, 3878, -9658, -3880, -6501, -24398, -27293, -22576, -6304, -8459, 2261, 4897, -9973, -21053, -19048, -19397, -2522, -5198, -12749, -21039, -26604, -32849, -28519, 3399, 15213, 20603, 12156, 15229, 8650, 3193, 5325, -1518, -10772, -7579, -4266, -18095, -13962, -16164, -5815, 2815, -4126, -7696, 337, 8164, 6856, 4641, 436, 3670, 4592, 986, 9803, 15099, 6198, -7227, -2032, 651, -6461, -4693, 9995, 23671, 22027, 1798, 306, 9172, -1802, 4173, 17076, 13962, 9124, 2279, -9847, -12908, -27611, -23757, -21001, -20928, -18627, -8258, -11839, 651, 8391, 4885, 1455, 4542, 9072, -3481, 891, -1301, -7188, -4664, 2977, 11843, 12206, 11231, 10074, 12185, 9178, -3130, -2802, 20128, 29668, 24888, 26792, 5433, 659, 3654, 6416, -4938, -14693, -8382, -2330, -11569, -15088, -2039, -8674]
5144h674j0704n652K482N191k828r800Q520J5028m572K105L237o186N918j283
5130g218n688j1433m38R743N309k445L714J1809k872l685M575N69j2018r976J019
5115a9035J0521m802M256J4897L056q110J0575L398n424r349k058P672j3105J506
5101f002L918k274m464n755J1673j2015M802j3688q040L477P790k544K360O812
5087a3950n224l923J174R061j345p155o334J9967P635j0097r542j75j787P243
5073a4452R048o433r786J1827J374Q162j283k54J0903M142k9j5714P48Q423j0596
5058c920n763j1933k067O144Q347J2787l119j4045J471O33N75n603P982J1885
5044C374l799L838l768j534N129J5189j464j4805J876k772k93K429K961p209N178
$$ y = [-8674, -19378, -25030, -22548, -17357, -20185, -29985, -21465, -6437, -11009, -8904, -5667, -11853, -5935, -7218, -12906, -24339, -24777, -15034, -9725, -12170, -8456, 3353, 481, -3204, 1371, 1940, -10078, -20054, -19035, -8514, -13316, -9060, 5837, 8893, 783, 11358, 14756, 9332, -17, -2075, 5597, -7508, -6002, -2084, -4358, -8822, -14577, -2904, -14919, -10117, -23805, -31845, -28368, -20578, -23122, -20762, -13950, -19174, -23097, -21923, -12862, -14207, -21362, -27696, -7729, -94, -10191, -19733, -19908, -21695, -14452, -5404, -11837, -21623, -9796, -8422, -260, -1543, -1797, 9106, 13248, 13219, -2495, -1747, 6676, -3920, -9683, -21616, -23683, -17539, -9192, 3595, 476, -13569, -12098, -11465, -10890, -16493, -8511, 3374, -425, 3413, -355, -1889, 3240, 18429, 16965, 2160, 4036, 1264, 971, 3400, 6361, -848, 4330]
5029D330N311j1963j225o287j3734N097J1013j466m239J582r22N58R246n86l624
5014f909L211o684n723Q615n867m138J1927N629k732N632P969L349L143o762o562
4999D098r015j1881M095O694J1499q5q274j727j197k1396j0342Q889J3929K044
4985a2669q818k561o63r36J0330j0573N031K194P412q962L005j871m623j550O802
4970a8452O108J7603L660o538q549r442P714P533j1068k937q84M206j0177j0427
4956c1650R470Q955J774l567J250K929m602K00j606J375o820k786N751L866n115
4941b0576L132P232R533M250o59L108O795o957O985p251j6142l45o144J8694J1614
4926A3269R52k23n29m961j1691p07m262j0849n37M658q34O564Q639j7942n112
$$ y = [4330, 9641, -2322, -3547, -9834, -23568, -18471, -7458, -8924, -13163, -11581, -12503, -11945, -2699, -3285, -6909, -3698, -10382, -16105, -7490, -13357, -17495, -5568, 61, -2671, 2961, 10930, 14279, 17422, 10660, 4098, -4917, -16798, -12703, -6009, 5490, 5405, -2869, -4596, -5793, -27189, -37531, -28642, -14713, -12669, -21487, -24048, -24711, -25647, -15317, -25890, -20859, -18665, -11253, -20215, -17210, -19081, -23704, -25254, -18452, -12344, 5259, 8919, 2381, -6168, -15610, -7896, -363, -11431, -14368, -15252, -11046, -21223, -31650, -22180, -13225, -11451, -15018, -13768, -10839, -15441, -15241, -16847, -15472, -22292, -25078, -19327, -15461, -20576, -17444, -10212, -679, 3571, 2912, 6020, 12815, 5858, 12843, 5592, -10550, -10895, -17039, 1655, 13269, 14221, 13998, 13469, 8508, -3183, -3890, -8152, -19001, -19538, -14880, -15714, -9150, -511, -18453, -23565]
4911b3565k350R920J3250l855o287R993J2000r985j0622J097J0473l184n571K640
4897f046p47K120j719J324p027J224k153P578r994p971K3318J4595n736j1864
4883c098j7999K541O909j7974q115R264Q701K992m638m739J6089j0983p127J0437
4869a7740J2622L262L895l679p191j0776o501R817J254J2151L307j3449n603l509
4855b2140J2300n305n835o348k214N845J1561J1021j0483o341Q377K645J2546
4842E629L90j5670j629q637m61j209n38R675J9104J651j5389j3066n604n73j3987
4827d0314p234Q129J5554Q815N365K662K245Q198N632P01K901m735J6056K778
4813B6753M951j1235k361L637m42J085o584k640N865p75j5027j2070p01L206k892
$$ y = [-23565, -25915, -15995, -2745, -6600, -12887, -2894, 9106, -879, -11501, -10404, 69, -3115, -8686, -6046, -6793, -4673, -6392, -5068, -12095, -10871, -13024, -5446, -15440, -23411, -93, 14502, 8766, -3098, -21097, -18556, -11647, -29621, -37736, -28472, -19771, -16779, -21417, -26156, -10067, -21050, -28177, -17740, -5118, -1856, 2039, -1640, -8831, -19607, -26108, -16291, -15037, -2886, 421, -13028, -18631, -22140, -9840, -15145, -20980, -27328, -29542, -23697, -12136, -1115, -11598, -17939, -9562, -6917, 5629, 6019, -9651, -11280, -19917, -20378, -21587, -22125, -12450, 6654, 8305, -7084, -20150, -25754, -26327, -40314, -47548, -39419, -23865, -15050, -9685, -7023, -4778, 3420, 9052, 9753, 12654, 7919, 23975, 26753, 31704, 20469, 18108, 21745, 21303, 22388, 15804, 13164, 19029, 18254, 3227, -8843, -9544, -6338, -9230]
4798i230m818j0401p232J0544M167L392j2223L772J1387Q31m342k427M100J057
4784a1423Q03K931n891J1034J0602p260j4289k750k149O361J2062Q091L783j0648
4770A257j3299N924J0110l83K978J593O809K4k849n24o752l467j473j622Q258
4755F584J3430n924j887n803n169n624K021J3791L265O310r082J3733N407k4616
4741F436l062J716q617k0489P298M379j580r234n510J0200M230j984q012L87q981
4726c2823L123Q33L671R474J7072O182L120n702J864O176q610j6111j7100l806
4712c2637J4743R218k683p395J5542O851n344l195k927l617k592q333N703J3630
4698c036j4496j3627N498K712O301n53n402j2168o60j906j360N260o35R435J6665
$$ y = [-9230, -14048, -24449, -31681, -21137, -16970, -13578, -25801, -22029, -10642, -9811, -14153, -16580, -12480, -11423, -10620, -7689, -13580, -2546, 8056, 796, -13493, -16243, -18392, -12031, 31, 8122, 11905, 1257, -12042, -6118, 3992, 3609, 6587, 8180, 14989, 15013, 12164, 11640, 4888, 1421, -52, -1674, 6584, 20014, 14090, 12203, 6400, 1231, -4393, -2372, 11419, 14684, 20994, 11912, 25645, 31052, 6436, 3374, 5090, -3527, -24016, -16718, -12339, -13919, -23153, -28663, -18463, -14233, -16217, -24229, -23842, -32823, -29700, -28867, -25196, -15722, 1350, 7532, 10652, 4950, 6814, 12990, 4380, -11731, -28831, -32637, -17894, -8676, -11359, -18754, -3212, 3639, -1705, -4900, -7827, -11444, -14036, -22369, -16666, -3036, -17532, -31159, -25661, -22949, -16648, -17201, -22603, -34771, -35431, -37337, -38697, -33437, -34072, -24637, -7972]
4683g972J4940k031o535M667L821N527k704M813l871j0421j964m851j3382p949
4669b7912R883J652r740P838J179M518O480J0683O39K756j1151k501n246j1735
4655b2657M086J512l096J3577R344m890p555J232J1575J314p848N507Q304n682
4641D723j650J0569o98j4358n744p074Q107k802l908j749O864r692o152J1832
4627a1732N323J2706j1455p532K494l239J1095J0743M152j4653j7311j057J0323
4614a0143o251Q514Q135J71L544m991l00n495K978Q24j0400P398l879J5412J1533
4599A7050p793k8319k2375l481J2216L946K2021J2298Q207k4364j7027m11J5213
4586a2819J2682o844j4971L45K0621R189p957k176j3756m041n828K70r257r517
$$ y = [-7972, 6968, 4937, -1598, 3069, 6890, 12417, 9713, 14526, 10655, 234, -1730, -6581, -19963, -27912, -18029, -16377, -26117, -18279, -17100, -12582, -6102, 4581, 5220, 7976, -3175, -5676, -10922, -22657, -18571, -17059, -20155, -6578, 2766, -2124, -9679, -8447, 3128, 4442, -3406, 2101, 10405, 4723, 3073, 13642, 12944, -1414, -7158, -14232, -6125, -8927, -12835, -14584, -7720, -17412, -23564, -11732, -6409, 6297, -5158, -12690, -10196, -13435, -2340, 8403, 12555, -2098, -19409, -20466, -10143, -16394, -7880, 255, 426, 3970, -1021, -1321, -6816, -3838, -3014, -13414, -6016, -9895, 5517, 17050, 9257, -19062, -41437, -44918, -32702, -28756, -6735, 5563, 13770, -10594, -27621, -28032, -12819, -137, -6981, -21952, -21607, -986, 8203, 246, -1930, -15686, -19727, -25555, -25285, -34542, -44059]
4572d4059N173J3150p898K884J2769K2514M810j1512j3932j2951N791N362P932
4559i967J1944J1677j1646j2907r164q908N944M896R154l258j2446L633R559J1746
4545B57j730j0417P117o751M694J5079K389L328n407k939k1812p137J0827j53
4531a2655M105J5697j0499m653J3210N786p825j3809j28R961p80p372r483J925
4517a6520K690j2903q202L436N673N507P209J852N821qo886O095P237L086K251
4502F338p496j0255R310L00j6423o65J3712q388Q0P618J6035J1005j5955q670
4488c454n263L016J1069J7445k4165j7835M57N256o152J0226J1198k928o701R792
4474A961Q510k980j4750r898K915J285r721k739K150l306J0532O729L187j077
$$ y = [-44059, -38886, -25736, -33634, -30750, -17981, 4533, 9343, -2169, -16101, -29052, -23261, -17899, -9967, 1977, 13654, 2008, -10899, -20063, -28971, -23027, -18131, -8977, -12235, -24681, -21048, -11489, 257, -1473, -11890, -4773, -11524, -6830, 8249, 10638, 13966, 8559, 5620, -16192, -23329, -12502, -12655, -8550, 7147, -3352, -8005, 5205, 10991, 3166, -10643, -10771, -810, -1590, -8962, -18445, -16520, -13830, -26733, -34935, -31499, -25826, -20319, -13110, -11258, -5437, -5445, -12331, -6236, 1001, 4087, 6338, -1158, -11413, -2103, -1803, -18226, -18891, -5179, -13567, -13487, -5869, 10166, 21171, 5216, -3454, -8717, -5701, 5368, 22813, -1352, -19187, -18730, -13474, -19626, -9400, 1798, -1130, -7831, 1961, 10471, 7491, -7259, -17157, -14242, -12957, -22678, -25417, -23267, -26573, -16041, -9312, -6125, -7202]
4460g202k637o733N347J8277P182L494j1661q174j2556L026q121K002M455L528
4446i773q62J1021n366j2612K997j536R39j155p884k414J5043p193p209N542J1205
4431i257K4133q198q394Q820M367j175r39j5092j2601M239J2398j3185m624L901
4417a5607J4896o890q76j1962N87J1271J8956r240j272L134m634J110j861L943
4403A555P165O108m228k580n973n977k56r123o321l948K793Q064J497j2026P232
$$ y = [-7202, -9839, -16572, -11225, 7052, 14234, 17728, 6067, -2107, -14663, -11637, -19758, -17756, -13301, -9773, -10635, 386, -4980, -17592, -14595, -16131, -15192, -16347, -24231, -26645, -11602, -18795, -26004, -20462, -9257, 14876, 6678, -1716, 7104, 11471, 10296, 9357, -5735, -18336, -14097, -1699, -14884, -19508, -15607, -711, -7601, -8477, -20439, -19852, -8581, 10375, 1135, -137, 2997, -1637, -527, -2388, 1555, 8720, 14828, 10600, 8020, 2047, -3930, -4186, -13309, -19630, -23578, -20785, -12721, -11224, -23250, -16018]
$$ [...]
##END NTUPLES=NMR SPECTRUM
##END=
