##TITLE=Analysis number 320000
Compound Code cc 13401
Project Code adrs
Chemist Name stores
##JCAMPDX= 6.0         $$ Bruker NMR JCAMP-DX V2.0
##DATA TYPE= NMR SPECTRUM
##DATA CLASS= NTUPLES
##ORIGIN= Bruker BioSpin GmbH
##OWNER= nmr
$$ XWIN-NMR		Version 3.5
$$ Wed Jun  7 12:17:29 2006 GMT Daylight Time (UT+1h)  MAYBRIDGE\nmr@NMR_250MHZ
##.OBSERVE FREQUENCY= 250.131544655141
##.OBSERVE NUCLEUS= ^1H
##.ACQUISITION MODE= SIMULTANEOUS (DQD)
##.ACQUISITION SCHEME= undefined
##.AVERAGES= 16
##.DIGITISER RES= 18
##SPECTROMETER/DATA SYSTEM= dpx250
##.PULSE SEQUENCE= zg30
##.SOLVENT NAME= CDCl3
##.SHIFT REFERENCE= (INTERNAL, CDCl3, 0, 16.522)
##AUDIT TRAIL= $$ (NUMBER, WHEN, WHO, WHERE, WHAT)
$$ ##TITLE= Audit trail, XWIN-NMR		Version 3.5
$$ ##JCAMPDX= 5.01
$$ ##ORIGIN= Bruker BioSpin GmbH
$$ ##OWNER= nmr
$$ C:\u/data/dgb/nmr/ADRS/380/pdata/1/auditp.txt
$$ ##AUDIT TRAIL=  $$ (NUMBER, WHEN, WHO, WHERE, WHAT)
(   1,<2006-06-07 12:17:04.79 +100>,<MAYBRIDGE\nmr>,<NMR_250MHZ>,
      <created by zg, POWCHK disabled, PULCHK disabled
       configuration hash MD5:
       E2 DF 36 D8 04 B2 41 60 5A D7 A3 38 5A 4B D0 FE
       data hash MD5: 64K
       12 2D CF 28 C8 77 43 45 43 6B A6 E7 7A 11 11 B9>)
(   2,<2006-06-07 12:17:18.42 +100>,<MAYBRIDGE\nmr>,<NMR_250MHZ>,
      <Start of raw data processing
       ef LB = 0.3 FT_mod = 6 PKNL = 1 SI = 32K 
       data hash MD5: 32K
       40 64 E6 78 8D E9 59 A8 78 1E 21 44 F8 E3 35 92>)
(   3,<2006-06-07 12:17:20.17 +100>,<MAYBRIDGE\nmr>,<NMR_250MHZ>,
      <apk 
       data hash MD5: 32K
       31 66 2E 00 4F F9 D3 77 47 FC 95 A5 3B 73 EC 2B>)
(   4,<2006-06-07 12:17:20.98 +100>,<MAYBRIDGE\nmr>,<NMR_250MHZ>,
      <abs ABSG = 5 
       data hash MD5: 32K
       64 DD 2B 80 E9 DC 7F BE C8 A5 CC A1 2E 37 2C 32>)
$$ ##END=
$$ 
$$ hash MD5
$$ 61 27 A4 40 71 1B 7B 21 7B B8 3D F7 71 54 CB AF
##$RELAX= 
##$RELAX= 
##$RELAX= 
##$RELAX= 
##$RELAX= 
##$RELAX= 
##$RELAX= 
$$ Bruker specific parameters
$$ --------------------------
##$DU= <C:\u>
##$EXPNO= 380
##$NAME= <ADRS>
##$PROCNO= 1
##$TYPE= <nmr>
##$USER= <dgb>
##$AMP= (0..31)
100 100 100 100 100 100 100 100 100 100 100 100 100 100 100 100 100 100 
100 100 100 100 100 100 100 100 100 100 100 100 100 100 
##$AQSEQ= 0
##$AQ_mod= 3
##$AUNM= <au_zg>
##$AUTOPOS= <27 >
##$BF1= 250.13
##$BF2= 250.13
##$BF3= 250.13
##$BF4= 250.13
##$BF5= 500.13
##$BF6= 500.13
##$BF7= 500.13
##$BF8= 500.13
##$BYTORDA= 1
##$CFDGTYP= 0
##$CFRGTYP= 5
##$CHEMSTR= <none>
##$CNST= (0..31)
1 1 145 1 1 1 1 1 1 1 1 1 1 1 1 1 1 1 1 1 1 1 1 1 1 1 1 1 1 1 1 1 
##$CPDPRG= <>
##$CPDPRG1= <>
##$CPDPRG2= <>
##$CPDPRG3= <>
##$CPDPRG4= <mlev>
##$CPDPRG5= <mlev>
##$CPDPRG6= <mlev>
##$CPDPRG7= <mlev>
##$CPDPRG8= <mlev>
##$CPDPRGB= <>
##$CPDPRGT= <>
##$D= (0..31)
0 1 0 0 0 0 0 0 0 0.06 0 0 0 0 0 0 0.0002 0 0 0 0 0 0 0 0 0 0 0 0 0 0 
0 
##$DATE= 1149679023
##$DBL= (0..7)
120 120 120 120 120 120 120 120 
##$DBP= (0..7)
150 150 150 150 150 150 150 150 
##$DBP07= 0
##$DBPNAM0= <>
##$DBPNAM1= <>
##$DBPNAM2= <>
##$DBPNAM3= <>
$$ [...]
##$SUBNAM7= <"">
##$SUBNAM8= <"">
##$SUBNAM9= <"">
##$SW= 20.6930455092707
##$SWIBOX= (0..15)
0 0 3 0 0 0 0 0 0 0 0 0 0 0 0 0 
##$SW_h= 5175.983436853
##$TD= 65536
##$TD0= 1
##$TE= 296.16
##$TE2= 300
##$TE3= 300
##$TEG= 300
##$TL= (0..7)
0 120 120 120 120 120 120 120 
##$TP= (0..7)
150 150 150 150 150 150 150 150 
##$TP07= 0
##$TPNAME0= <>
##$TPNAME1= <>
##$TPNAME2= <>
##$TPNAME3= <>
##$TPNAME4= <>
##$TPNAME5= <>
##$TPNAME6= <>
##$TPNAME7= <>
##$TPOAL= (0..7)
0.5 0.5 0.5 0.5 0.5 0.5 0.5 0.5 
##$TPOFFS= (0..7)
0 0 0 0 0 0 0 0 
##$TUNHIN= 0
##$TUNHOUT= 0
##$TUNXOUT= 0
##$USERA1= <user>
##$USERA2= <user>
##$USERA3= <user>
##$USERA4= <user>
##$USERA5= <user>
##$V9= 5
##$VALIST= <valist>
##$VCLIST= <CCCCCCCCCCCCCCC>
##$VD= 0
##$VDLIST= <DDDDDDDDDDDDDDD>
##$VPLIST= <PPPPPPPPPPPPPPP>
##$VTLIST= <TTTTTTTTTTTTTTT>
##$WBST= 1024
##$WBSW= 4
##$XGAIN= (0..3)
0 0 0 0 
##$XL= 0
##$YL= 0
##$YMAX_a= 365546
##$YMIN_a= -530335
##$ZGOPTNS= <>
##$ZL1= 120
##$ZL2= 120
##$ZL3= 120
##$ZL4= 120
##$ABSF1= 16.522
##$ABSF2= -4.171173
##$ABSG= 5
##$ABSL= 3
##$ALPHA= 0
##$AQORDER= 0
##$ASSFAC= 0
##$ASSFACI= 0
##$ASSFACX= 0
##$ASSWID= 0
##$AUNMP= <proc_1d>
##$AZFE= 0.1
##$AZFW= 0.1
##$BCFW= 0
##$BC_mod= 0
##$BYTORDP= 0
##$COROFFS= 0
##$CY= 12.5
##$DATMOD= 1
##$DC= 0
##$DFILT= <>
##$DTYPP= 0
##$F1P= 14.0000005364418
##$F2P= -0.99999901652339
##$FCOR= 0.5
##$FTSIZE= 32768
##$FT_mod= 6
##$GAMMA= 0
##$GB= 0
##$INTBC= 1
##$INTSCL= 1
##$ISEN= 128
##$LB= 0.3
##$LEV0= 0
##$LPBIN= 0
##$MAXI= 10000
##$MC2= 0
##$MEAN= 0
##$ME_mod= 0
##$MI= 0
##$NCOEF= 0
##$NC_proc= -6
##$NLEV= 6
##$NOISF1= 0
##$NOISF2= 0
##$NSP= 0
##$NTH_PI= 0
##$NZP= 0
##$OFFSET= 16.522
##$PC= 1
##$PHC0= 169.5159
##$PHC1= 6.940719
##$PH_mod= 1
##$PKNL= yes
##$PPARMOD= 0
##$PSCAL= 4
##$PSIGN= 0
##$REVERSE= no
##$SF= 250.13
##$SI= 32768
##$SIGF1= 0
##$SIGF2= 0
##$SINO= 400
##$SIOLD= 32768
##$SREGLST= <1H.CDCl3>
##$SSB= 0
##$STSI= 32768
##$STSR= 0
##$SW_p= 5175.98343685301
##$SYMM= 0
##$S_DEV= 0
##$TDeff= 65536
##$TDoff= 0
##$TI= <Analysis number 999999
Compound Code 99
Book Reference 9
Project Code 9>
##$TILT= no
##$TM1= 0
##$TM2= 0
##$TOPLEV= 0
##$USERP1= <user>
##$USERP2= <user>
##$USERP3= <user>
##$USERP4= <user>
##$USERP5= <user>
##$WDW= 1
##$XDIM= 32768
##$YMAX_p= 355743766
##$YMIN_p= -1068978
$$ End of Bruker specific parameters
$$ ---------------------------------
##NTUPLES= NMR SPECTRUM
##VAR_NAME=  FREQUENCY,     SPECTRUM/REAL,   SPECTRUM/IMAG
##SYMBOL=    X,             R,               I
##VAR_TYPE=  INDEPENDENT,   DEPENDENT,       DEPENDENT
##VAR_FORM=  AFFN,          ASDF,            ASDF
##VAR_DIM=   32768,         32768,           32768
##UNITS=     HZ,            ARBITRARY UNITS, ARBITRARY UNITS
##FACTOR=    0.157963299565203, 1,           1
##FIRST=     4132.6476996994, 0,             0
##LAST=      -1043.33573715361, 0,           0
##MIN=       -1043.33573715361, -1068978,    0
##MAX=       4132.6476996994, 355743766,     0
$$ Real data points
##PAGE= N=1
##DATA TABLE= (X++(R..R)), XYDATA
$$ [...]
22903e08975n6253K00838l0480q8186K52813J07243k08103P4738K34797K32371
$$ -508975 -565228 -364390 -394870 -483056 -230243 -123000 -331103 -256365 -21568 210803
22893B10803r9083k02572M3270L2731J24445J52330j37221O9573l4580k70522
$$ 210803 111720 -90852 -47582 -14851 109594 261924 124703 194276 159696 -110826
22883a10826q0026J11173r35K66905P8664k43646k64171K38335m7719j23487K7368
$$ -110826 -190852 -79679 -80614 186291 264955 21309 -242862 -4527 -52246 -175733 -148365
22872a48365P207J9673Q6209k49025k6351L05184K1978J7231j12355L5566J9904
$$ -148365 -141158 -121485 -35276 -284301 -310652 -5468 16510 33741 -78614 -43048 -23144
22861b3144J81002K24978J27140p1880k85100j97911k09160K0936P9116K40010
$$ -23144 157858 382836 509976 438096 152996 -44915 -254075 -233139 -154023 85987
22851H5987K12331j14078j4982Q6656k07912J35121m1927J01905K27292R1387
$$ 85987 298318 184240 169258 255914 48002 183123 141196 243101 470393 561780
22841E61780r9842L3341j05098k83348K58372K69881J69068l7838k16870K03184
$$ 561780 461938 495279 390181 106833 365205 635086 804154 766316 549446 752630
22831G52630L38987j57422J55114Q8492J28532q6024j62838k0743K2290j45476
$$ 752630 1091617 934195 1089309 1177801 1306333 1220309 1057471 1036728 1059018 913542
22821I13542j03368j21375J7085q3149l26830N5864J1133K00367j4915j30909
$$ 913542 810174 688799 705884 622735 295905 351769 362902 563269 548354 417445
22811D17445l09581J552k55684K7276J25764j24242o1609J32531J79051o1583
$$ 417445 107864 109416 -146268 -118992 6772 -117470 -179079 -46548 132503 70920
22801G0920k3713J44849K5767k22632j83731K57059L25375M6080j75487j41887
$$ 70920 47207 192056 217823 -4809 -188540 68519 393894 439974 264487 122600
22791A22600K04751p8236j31003J20580L0526j89933N4259L6242J21477n5010
$$ 122600 327351 249115 118112 238692 269218 79285 133544 169786 291263 236253
22781B36253o170j6351J06716O4159M2857l0971K6246q6601j76021J86515K46617
$$ 236253 230083 213732 320448 384607 427464 396493 422739 336138 160117 346632 593249
22770E93249K53040l98764r7551j76055N8744L27437l9414k48778J18593j5975
$$ 593249 846289 447525 349974 173919 232663 560100 520686 271908 390501 374526
22760C74526k15749j38846j26948m8260m351J35785J25098j87803M6826j8325
$$ 374526 158777 19931 -107017 -155277 -159628 -23843 101255 -86548 -39722 -58047
22750e8047j42429J6287J48621P0610M6497m4893k15025N7755J93347Q2439R1994
$$ -58047 -200476 -184189 -35568 35042 81539 36646 -178379 -120624 72723 155162 247156
22739B47156J14940j90136m27556k66940J88832K22690K15517r0402l22357j26607
$$ 247156 362096 171960 -255596 -522536 -333704 -111014 104503 14101 -308256 -434863
22729d34863M0602o7748j1928J25707J84002J71007j53096j44877K0695J17619
$$ -434863 -394261 -462009 -473937 -348230 -164228 6779 -146317 -291194 -270499 -152880
22719a52880K53336O4281j66853m6010J14082j76361j57122K34789L46961o9087
$$ -152880 100456 164737 -2116 -48126 65956 -110405 -267527 -32738 314223 245136
22709B45136l19808J44822l6121M1622J41907Q812M5552j51358J40978K09543
$$ 245136 -74672 70150 34029 75651 217558 226370 271922 120564 261542 471085
22699D71085l05144M5828J7883L939j50551l3328m5617J86918K5133K00031o2430
$$ 471085 165941 211769 229652 233591 83040 49712 4095 191013 216146 416177 353747
22688C53747m9547J3408n4078m57854o8373L8021k39569J92067J71591Q3331j50967
$$ 353747 304200 317608 263530 -194324 -262697 -224676 -464245 -272178 -100587 -17256 -168223
22677a68223Q5851p4776p1322L73209M7922p7161j56529k50184j81357K69081
$$ -168223 -82372 -157148 -228470 144739 192661 115500 -41029 -291213 -472570 -203489
22667b03489K56889K40645J81489O6366k9035j65245k48868j43530R9698J70985
$$ -203489 53400 294045 475534 541900 512865 347620 98752 -44778 54920 225905
22657B25905J20117p0130K1888o1070k7754J3456K73992J29019P2599k24696m44305
$$ 225905 346022 275892 297780 236710 208956 222412 496404 625423 698022 473326 29021
22646B9021k22109j24236J15870J29497j59905J21061n1529J20537N9518m1546
$$ 29021 -193088 -317324 -201454 -71957 -231862 -110801 -162330 -41793 17725 -23821
22636b3821J27295o1477k52261j8829J35381J76996p133j74807j6093K91196L33716
$$ -23821 103474 41997 -210264 -229093 -93712 83284 76151 -98656 -114749 176447 510163
22625E10163l5318j02482k65235J43448J16785K4656K36872j04834j78739p6420
$$ 510163 474845 372363 107128 250576 367361 392017 628889 524055 345316 268896
22615B68896J03578K46379J26248l07350j36659l7560N0613p6725q427K71749
$$ 268896 372474 618853 745101 437751 301092 263532 314145 237420 228993 500742
22605E00742J13558j96737o5594k0480J23325l60586m28029k40808j3957K7831
$$ 500742 614300 417563 351969 331489 454814 94228 -333801 -574609 -588566 -560735
22595e60735K84822O1031j40025J19260L0810J17735J74888j38386j22468J32039
$$ -560735 -275913 -214882 -354907 -235647 -204837 -87102 87786 -50600 -173068 -41029
22585d1029M4855L4805k27290j80207L62011J22646j49338K41258m9853k13181
$$ -41029 3826 38631 -188659 -368866 -6855 115791 -33547 207711 157858 -55323
22575e5323q959K25957J60789k05551j28524l9271j3046j55342L525P5196q8189
$$ -55323 -64282 161675 322464 116913 -11611 -50882 -63928 -219270 -215745 -140549 -228738
22564b28738j71417J09709L05582N7834k840j70365N5678J43658k18181k24864
$$ -228738 -400155 -290446 15136 72970 70130 -100235 -44557 99101 -119080 -343944
22554c43944R2542m1442q2770N1477J15467K43527M1827K8167m7706k1979j03592
$$ -343944 -251402 -292844 -375614 -324137 -208670 34857 76684 104851 57145 35166 -68426
22543f8426L1771J58757K55923J70634m3330l03477l08436n6757R7479K2721m8262
$$ -68426 -36655 122102 378025 548659 505329 201852 -106584 -163341 -65862 -43141 -91403
22532i1403j4750R4950L5656J05441j8425M9553J52821O5842n6974R0848p0283
$$ -91403 -106153 -11203 24453 129894 111469 161022 313843 379685 322711 413559 343276
22521C43276K7081j54744m2475N2310J05701n4051n2316j00413N4667K06561J74938
$$ 343276 370357 215613 173138 225448 331149 277098 224782 124369 179036 385597 560535
22510E60535l2299j72199k44963L71682m8708j71489Q1823M34251K31200K04395
$$ 560535 528236 356037 111074 482756 434048 262559 344382 778633 1009833 1214228
22500A214228K49381k49590J23903P1818J68771L01844L65936p9705k01521l85136
$$ 1214228 1463609 1214019 1337922 1409740 1578511 1880355 2246291 2166586 1965065 1579929
22490A579929k67563l86353j77950J52986j70192p1134k7273Q3172k33412k87916
$$ 1579929 1312366 926013 748063 901049 730857 659723 632450 715622 482210 194294
22480A94294J0853N1505K44365J22641J716K5070j8527j48966R6716j9676l81744
$$ 194294 205147 256652 501017 623658 625374 650444 631917 482951 579667 559991 178247
22469A78247p7587O0799m8886j8591q7829l397J48091l4202k10301J1845J37755
$$ 178247 100660 161459 112573 93982 6153 2756 150847 116645 -93656 -81811 55944
22458E5944J68481J41666K26421p6836k95599o6001K98535K2621j75585l26031
$$ 55944 224425 366091 592512 515676 220077 154076 452611 475232 299647 -26384
22448b6384j20334j06811j02744J67193K25623K93542n8899j31424n3191P6578
$$ -26384 -146718 -253529 -356273 -189080 36543 330085 271186 139762 86571 163149
22438A63149K82679R5203j47211l97698J78600J16817O2285k150r5783j8812K05722
$$ 163149 445828 541031 393820 -3878 174722 291539 353824 351674 255891 237079 442801
22427D42801M669O8726j74477J22269L7574k34650j13706J51278J22622o4144
$$ 442801 447470 516196 341719 463988 501562 266912 153206 304484 427106 362962
22417C62962l59708l24885R3459r4702J9826L06501o029J92588L7814J19785J79877
$$ 362962 3254 -321631 -228172 -322874 -303048 3453 -2576 190012 227826 347611 527488
22406E27488n2766r0017j82733k73341K16204L2908k42345J88392J89957M7066
$$ 527488 474722 384705 201972 -71369 144835 177743 -64602 123790 313747 360813
22396C60813j13187p5375R0773O4008L29045j16104k4289q7151J87259l4941l75856
$$ 360813 247626 172251 263024 327032 656077 539973 515684 428533 615792 580851 204995
22385B04995l42899J94186K24275L01922R9912l8294k52772j63649j30319j14167
$$ 204995 -137904 56282 280557 582479 682391 644097 391325 227676 97357 -16810
22375a6810J97281k5593J63200Q462N4773R9314j50851o2199j3500j76078K12414
$$ -16810 180471 154878 318078 326540 381313 480627 329776 267577 254077 77999 290413
22364B90413R3875j10039K7144K08588J16699j83956n75015k12457J70022p0565
$$ 290413 384288 274249 301393 509981 626680 442724 -132291 -344748 -174726 -245291
22354b45291k1177M32948L06588j1906k3163R1827k2949j45181L4981k70725j50417
$$ -245291 -266468 166480 473068 461162 437999 529826 506877 361696 396677 125952 -24465
22343b4465R2672j67146M6460L86516N7645R5451j27614r8383L3515M9546N566
$$ -24465 68207 -98939 -52479 334037 391682 487133 359519 261136 294651 344197 349763
22332C49763N1832l3359p4851K7859j84287K01787K34568l4380M157j59070r0674
$$ 349763 401595 368236 293385 321244 136957 338744 573312 538932 543089 384019 293345
22321B93345L74775J14529j02479j59227Q7599m7374j83882o7984J48788p0226
$$ 293345 668120 782649 680170 520943 608542 561168 377286 309302 458090 387864
22311C87864r724j06229j3754J08148M10313J19402j77966j52630O5216j41582
$$ 387864 378140 271911 258157 366305 776618 896020 718054 565424 630640 489058
22301D89058M1020K07952K37143L16318r2878l1368p2543k08605p5489j02039
$$ 489058 530078 738030 975173 1291491 1198613 1167245 1094702 886097 810608 708569
22291G08569k96733j84487P1566J3026K01357M617p7519n2502r8220J94843J55795
$$ 708569 411836 227349 298915 311941 513298 517915 440396 387894 289674 484517 640312
22280F40312j08126k6734L6007J23349k4124m0794P5147k44054j65023m0915k2819
$$ 640312 532186 505452 541459 664808 640684 599890 675037 430983 265960 225045 202226
22269B02226p741l9358K05082K55685r5244j95328P7009M0935J90287m8852l04398
$$ 202226 194485 155127 360209 615894 520650 325322 402331 443266 633553 584701 280303
22258B80303j07635K00040J24097j82703j88708J86418J81751j80258j32197j03108
$$ 280303 172668 372708 496805 314102 125394 311812 493563 313305 181108 78000
22248G8000j55861O4328M13471P5132j86154j21577Q3468j28128j6309j17434
$$ 78000 -77861 -13533 399938 475070 288916 167339 250807 122679 106370 -11064
22238a1064L70540K26347N6777j4494p0575m6485Q0549N5575K9636k08683m34206
$$ -11064 359476 585823 642600 628106 557531 511046 591595 647170 676806 468123 33917
22227C3917m3964K82732k62846m5949L23396J46129q7090O7557J76262M7563J46184
$$ 33917 -10047 272685 9839 -36110 287286 433415 346325 413882 590144 637707 783891
22216G83891l04947p728k02158l80227J42752L05916K20281l4810k26684J27582
$$ 783891 478944 471216 269058 -111169 31583 337499 557780 522970 296286 423868
22206D23868N9291K03892k26512k0090L26093R2960k78620l81825r1837J09956
$$ 423868 483159 687051 460539 440449 766542 859502 580882 199057 107220 217176
22196B17176K51868M6873K40566j3371j58279o7873j02135O8215j7739j29585
$$ 217176 469044 515917 756483 743112 584833 516960 414825 483040 465301 335716
22186C35716j37197J11782J57171N6762k25739j69487K31804J52156n478j3886
$$ 335716 198519 310301 467472 524234 298495 129008 360812 512968 507490 493604
22176D93604J87607o6523l86406j39479L9105K83484J35673n7476r2171j18016
$$ 493604 681211 614688 228282 88803 127908 411392 547065 489589 397418 279402
22166B79402J13808M70128l4193j96555j43795r4654j54305J67685K79678J9469
$$ 279402 393210 863338 829145 632590 488795 394141 239836 407521 687199 706668
22156G06668k01564j01110K05288K37970m0964k60165k54348j60798p618J97583
$$ 706668 505104 403994 609282 847252 806288 546123 291775 130977 123359 320942
22146C20942p2301p5689M55484Q2439k69063p4113O6881m5947m7196N4467R9149
$$ 320942 248641 172952 628436 710875 441812 367699 434580 388633 341437 395904 495053
22135D95053J31852J14317r7209r257j46967m0923k8731j43614N1173K7359l34634
$$ 495053 626905 741222 644013 634756 487789 446866 418135 274521 325694 353053 18419
22124A8419j66875J90787O1414J11164p8330M6172Q2452M4474r7612M7430N1832
$$ 18419 -148456 42331 103745 214909 136579 182751 265203 309677 212065 259495 311327
22113C11327K0396l81875j47738J54995K67325J02449J19167L43086J33452k81709
$$ 311327 331723 -50152 -197890 -42895 224430 326879 446046 789132 922584 640875
22103F40875l8807k03792n1422K31722K48961P8295l58245j26834m4338j2724
$$ 640875 602068 398276 346854 578576 827537 905832 547587 420753 376415 363691
22093C63691R1101M3590j65115l6262J47626j61321l3725J78550j18586l10213
$$ 363691 454792 498382 333267 297005 444631 283310 249585 428135 309549 -664
22083f64j88151K33634L94807q9310j5541J23470J71480j15620O2522k06767p9703
$$ -664 -188815 44819 439626 350316 334775 458245 629725 514105 576627 369860 290157
22072B90157O2038l12121j03337J6218K2452J32466K29211o5315j33938p6901
$$ 290157 352195 40074 -63263 -47045 -24593 107873 337084 271769 137831 60930
22062F0930J69916K07185J2683k97000N1L89948k52360k65499J03899L18242L15477
$$ 60930 230846 438031 450714 153714 153765 543713 291353 25854 129753 447995 763472
22051G63472J83557q8952j00274j24875J32069k43264n3815R5858j38574Q8788
$$ 763472 947029 858077 757803 632928 764997 521733 467918 563776 425202 513990
22041E13990j09449j10863k577L0048L6679R1770j07678j13092k61648j03155
$$ 513990 404541 293678 291101 321149 357828 449598 341920 228828 -32820 -135975
22031a35975J22132K52813P7411m002l2776M1626R3188J5311k53387L13378L58673
$$ -135975 -13843 238970 316381 312379 279603 321229 414417 429728 176341 489719 848392
22020H48392R7790n830j88342Q4593k66949Q32N982n0654j27333R8427J09845
$$ 848392 946182 940352 752010 836603 569654 570486 576468 525814 398481 496908 606753
22009F06753q4251J71222J83648J86614l13441j43699M2285j5514j37488j16989
$$ 606753 522502 693724 877372 1063986 750545 606846 649131 633617 496129 379140
21999C79140K42661p1199k05495J93427Q4795j33740Q5175J77448K20721j44552
$$ 379140 621801 550602 345107 538534 623329 489589 574764 752212 972933 828381
21989H28381k50166o4435n2248K44095K4842L9795K26915M4642J65599j81225
$$ 828381 578215 513780 461532 705627 730469 770264 997179 1041821 1207420 1026195
21979A026195j82076o982N5638N9337n5568o9587j40082k5519j5522j45359K7015
$$ 1026195 844119 837137 892775 952112 896544 826957 686875 661356 645834 500475 527490
21968E27490K8075j77416j32802j99130K73213L97008N9277r676n8924J91274
$$ 527490 555565 378149 245347 46217 319430 716438 775715 766039 707115 898389
21958H98389J05492n7002k05041j50020K17591J25955j1393q1903L9621K5943
$$ 898389 1003881 946879 741838 591818 809409 935364 923971 842068 881689 907632
21948I07632j12470j8713r6977l9191N1528q0104L60595L16467j31996l97777
$$ 907632 795162 776449 679472 640281 691809 611705 972300 1288767 1156771 758994
21938G58994J36844Q3274l7908M6855q9613j10344K31420J25283k10121q7080
$$ 758994 895838 979112 941204 988059 898446 788102 1019522 1144805 934684 847604
21928H47604k35527Q8885K60516J84942j14917m18510J98592J33630l23912L0607
$$ 847604 612077 700962 961478 1146420 1031503 612993 811585 945215 621303 651910
21918F51910L55236J87460o8609O0935l1452r5384n1584k20605R9456J54722j31628
$$ 651910 1007146 1194606 1125997 1186932 1155480 1060096 1008512 787907 887363 1042085 910457
21907I10457J5176J43114M3461j38194l00355Q3077K05969J21123O0109j12221
$$ 910457 925633 1068747 1112208 974014 673659 756736 962705 1083828 1143937 1031716
21897A031716n8573J15157l29856j03644k1739O6301L14439K18797J17796q5423
$$ 1031716 973143 1088300 758444 654800 633061 699362 1013801 1232598 1350394 1264971
21887A264971l40549j48166j57155J87757Q1632P8951K66573p5520j36225J48877
$$ 1264971 924422 776256 619101 806858 888490 967441 1234014 1158494 1022269 1171146
21877A171146Q3702j37595j8770J06522j47276Q697P5695k09141n9028N5829L24974
$$ 1171146 1254848 1117253 1098483 1205005 1057729 1066426 1142121 932980 873952 929781 1254755
21866A254755k6593J70654j36351K0893j00654q3602J2138j60297j85125J46861
$$ 1254755 1228162 1398816 1262465 1283358 1182704 1099102 1111240 950943 765818 912679
21856I12679J59969R905j29357n6661M8692J96605j61912k42374j46100J09991
$$ 912679 1072648 1082553 953196 896535 945227 1141832 979920 737546 591446 701437
21846G01437L30790L7320M39183J12865k72984P1012K26833l57469k67366N1077
$$ 701437 1032227 1069547 1508730 1621595 1348611 1419623 1646456 1288987 1021621 1072698
21836A072698K28191K85632L289j44139p9337L43549K16541n7294j63691k82613
$$ 1072698 1300889 1586521 1589810 1445671 1366334 1709883 1926424 1869130 1705439 1422826
21826A422826n5776M25791L9261j59488q1656q4832J38071m4641r4554K08366
$$ 1422826 1367050 1792841 1832102 1672614 1590958 1506126 1644197 1599556 1505002 1713368
21816A713368N8566K21136J22490j2768o3479l02458l59024j14954j20161k18382
$$ 1713368 1771934 1993070 2115560 2102792 2039313 1736855 1377831 1262877 1142716 924334
21806I24334L8668J81852O5351j41436R9972J72776j98699n4349K326J9035l1964
$$ 924334 963002 1144854 1210205 1068769 1168741 1341517 1142818 1088469 1090795 1109830 1077866
21795A077866j6603n8241M93687J57122j66441j18755j02006k81831n7093L07442
$$ 1077866 1061263 1003022 1496709 1653831 1487390 1368635 1266629 984798 927705 1235147
21785A235147L18820L24407R7205M9938j87568k16805k24974m63717K78738L2231
$$ 1235147 1553967 1878374 1975579 2025517 1837949 1621144 1396170 932453 1211191 1243422
21775A243422j11755Q3719L40195L63598J94408j44049l81752j27237r3973k6617
$$ 1243422 1131667 1215386 1555581 1919179 2113587 1969538 1587786 1460549 1366576 1339959
21765A339959J06805R741M0003n3234l7369K70446J83132j67913r2585K8910O104
$$ 1339959 1446764 1456505 1496508 1443274 1405905 1676351 1859483 1691570 1598985 1627895 1633999
21754A633999N121j69833L3475J53501J00644k08699l49715o3372k42215j30515
$$ 1633999 1639120 1469287 1502762 1656263 1756907 1548208 1198493 1135121 892906 762391
21744G62391J50891j7689O24K14884L42332J52463k12059L3679j22897j63321
$$ 762391 913282 895593 896217 1111101 1453433 1605896 1393837 1427516 1304619 1141298
21734A141298J85440M7223j10318j53401m752J1098J18637K04003k24906J7660
$$ 1141298 1326738 1373961 1263643 1110242 1105490 1116588 1235225 1439228 1214322 1231982
21724A231982J14549L552m5838L5036J26082K54549N7165k22951m58445N9641
$$ 1231982 1346531 1350083 1304245 1339281 1465363 1719912 1777077 1554126 1095681 1155322
21714A155322L5827j17653J71807M47278M2642q2195J94615j00689k25037n3622
$$ 1155322 1191149 1073496 1245303 1692581 1735223 1653028 1847643 1746954 1521917 1468295
21704A468295k05716K01858K24925J163j04994M6477L12956j25070k56887M0183
$$ 1468295 1262579 1464437 1689362 1690525 1585531 1632008 1944964 1819894 1563007 1603190
21694A603190J76426J67547r0263O320J67125m0099K3889j83812P7412j45774
$$ 1603190 1779616 1947163 1856900 1863220 2030345 1990246 2014135 1830323 1907735 1761961
21684A761961l00084K90530L24574q0902j73744k84068K45740L68881j47333p7086
$$ 1761961 1461877 1752407 2076981 1996079 1822335 1538267 1784007 2152888 2005555 1928469
21674A928469J04761n57n9000p4602J39404J95528O6041J1453J3926k17582j25730
$$ 1928469 2033230 2032673 1973673 1899071 2038475 2234003 2300044 2311497 2325423 2107841 1982111
21663A982111J68718N4927K3125M7954J58227k09395l01700j07308n8813n2588
$$ 1982111 2150829 2205756 2228881 2276835 2435062 2225667 1923967 1816659 1757846 1705258
21653A705258L10005J13526j19603O9353J23101o6565j44938l14547j80630M76191
$$ 1705258 2015263 2128789 2009186 2078539 2201640 2135075 1990137 1675590 1494960 1971151
21643A971151J64736k05465M0771L46620k45898p097J56423O870n944j73290j3562
$$ 1971151 2135887 1930422 1971193 2317813 2071915 2064818 2221241 2228111 2222167 2048877 2035315
21632B035315K76841j4137k9889k57961L3900k6653Q8129O9391K05152O5560J38349
$$ 2035315 2312156 2298019 2268130 2010169 2044069 2017416 2105545 2174936 2380088 2445648 2583997
21621B583997p1003j09085J14862K43458p0098m44953k41036J00997R8905K61115
$$ 2583997 2512994 2403909 2518771 2762229 2692131 2247178 2006142 2107139 2206044 2467159
21611B467159k28290k11597J42786L1653l8270J18344J00866L57000R9259N0620
$$ 2467159 2238869 2027272 2170058 2201711 2163441 2281785 2382651 2739651 2838910 2889530
21601B889530j62048q996l6114J03586l19460k13212R5051O0220J7848Q7702J6157
$$ 2889530 2727482 2718486 2682372 2785958 2466498 2253286 2348337 2408557 2426405 2514107 2530264
21590B530264p3R7934K65629J2121j08639m1979n167J2514l1702K48936j9528
$$ 2530264 2530191 2628125 2893754 2905875 2797236 2755257 2750090 2762604 2730902 2979838 2960310
21579B960310j48121O7013J2621j88730q8523J45064Q2697k07565j08516J87749
$$ 2960310 2812189 2879202 2891823 2703093 2614570 2759634 2842331 2634766 2526250 2713999
21569B713999q2700n1951J33743J31518J34906J59270J13081J38451K32749j48134
$$ 2713999 2631299 2579348 2713091 2844609 2979515 3138785 3251866 3390317 3623066 3474932
21559C474932k18048N5610k69932j82232j83908j52411r700K72062J97842J81139
$$ 3474932 3256884 3312494 3042562 2860330 2676422 2524011 2514311 2786373 2984215 3165354
21549C165354J98633j1199l0399J87515O4866k18425m1279j67505j1450P1794
$$ 3165354 3363987 3352788 3322389 3509904 3574770 3356345 3315066 3147561 3136111 3207905
21539C207905j82583m1360K11833R9299N1376K55315k67604n29449J11994L540
$$ 3207905 3025322 2983962 3195795 3295094 3346470 3601785 3334181 2804732 2916726 2920266
21529B920266J59670K14765l95458p7809L44784K00811J49631K30454M9111J59437
$$ 2920266 3079936 3294701 2899243 2821434 3166218 3367029 3516660 3747114 3796225 3955662
21519C955662r1214l1706j39595K3991n4318j0489L8634j77425J62653l2323j3972
$$ 3955662 3864448 3832742 3693147 3717138 3662820 3652331 3690965 3513540 3676193 3643870 3629898
21508C629898O6180k00973l10471k37867N196K69055J42118M04909k56483k19841
$$ 3629898 3696078 3495105 3184634 2946767 2951963 3221018 3363136 3768045 3511562 3291721
21498C291721M53966J44399n1339p6167q7326L8015K7941m0660n2698l6756L6456
$$ 3291721 3745687 3890086 3838747 3762580 3675254 3713269 3741210 3700550 3647852 3611096 3647552
21487C647552j87563M7144J66858M9681m8814K34388O8805k57073k90878K12741
$$ 3647552 3459989 3507133 3673991 3723672 3674858 3909246 3978051 3720978 3430100 3642841
21477C642841J44233J80448R6982k15180r4012J17484J7785k65318m7558L12534
$$ 3642841 3787074 3967522 4064504 3849324 3755312 3872796 3890581 3625263 3577705 3890239
21467C890239K11548k8444j11940j85979j36233K02429J30942k827k53330R9274
$$ 3890239 4101787 4073343 3961403 3775424 3639191 3841620 3972562 3969735 3716405 3815679
21457C815679K04489m6661q9008K75054R5126l67254r6086K40743m1712k73080
$$ 3815679 4020168 3973507 3884499 4159553 4254679 3887425 3791339 4032082 3990370 3717290
21447C717290r9744J07253j16659J59970J30031K36676Q779P562l5307J06978
$$ 3717290 3617546 3724799 3608140 3768110 3898141 4134817 4143596 4151158 4115851 4222829
21437D222829Q8780r3321P0009J37481J75328L06534k96157k54796j30149k37210
$$ 4222829 4311609 4218288 4288297 4425778 4601106 4907640 4611483 4356687 4226538 3989328
21427C989328J92983l7443j55952K48529K32227J14007j38325j9869Q3118J22300
$$ 3989328 4182311 4144868 3988916 4237445 4469672 4583679 4445354 4425485 4508603 4630903
21417D630903J09577O5463N5883j42430l31922J23570K26356M20738n2941l06641
$$ 4630903 4740480 4805943 4861826 4719396 4387474 4511044 4737400 5158138 5105197 4798556
21407D798556K18849K6294r3701M6213k248K90722j30497j85759J57205K17970
$$ 4798556 5017405 5043699 4949998 4996211 4993963 5284685 5154188 4968429 5125634 5343604
21397E343604r244k13712J4458O7542k76022M8390M2354l17513M7991K80193O0518
$$ 5343604 5334360 5120648 5135106 5202648 4926626 4975016 5017370 4699857 4747848 5028041 5088559
21386E088559j1073l1522j86470K05930l9690k3447o565J42887l9358L79976J13146
$$ 5088559 5077486 5045964 4859494 5065424 5025734 5002287 4995722 5138609 5099251 5479227 5592373
21375E592373l05320q3540L03902L53490q9025j09854o839j70286j33396k64442
$$ 5592373 5287053 5203513 5507415 5860905 5771880 5662026 5655187 5484901 5351505 5087063
21365E087063O8149p8562J9695K69101K11452J12619N5521j33523M5182P0239
$$ 5087063 5155212 5076650 5096345 5365446 5576898 5689517 5745038 5611515 5656697 5726936
21355E726936k8856q1789Q8823K07867K81053j80800l43184k17189K65995O4663
$$ 5726936 5698080 5616291 5705114 5912981 6194034 6013234 5670050 5452861 5718856 5783519
21345E783519K39954M4213R562k51300j12999j09803O3694K56652R7925j01739
$$ 5783519 6023473 6067686 6077248 5825948 5712949 5603146 5666840 5923492 6021417 5919678
21335E919678j34823J10299K65994j03967K27550J86165P104j82152j3956l4588
$$ 5919678 5784855 5895154 6161148 6057181 6284731 6470896 6478000 6295848 6281892 6247304
21325F247304q2361K23117K56131o5423o3401m1353j86273M0361j15547K0580
$$ 6247304 6164943 6388060 6644191 6578768 6515367 6474014 6287741 6328102 6212555 6233135
21315F233135J44059m1984L06059L16483K8512o6252L0362n4942K01651r5913
$$ 6233135 6377194 6335210 6641269 6957752 6986264 6920012 6950374 6895432 7097083 7001170
21305G001170j93725l7227O4847p1028r9192J07303Q7031J27176q7558J67599
$$ 7001170 6807445 6770218 6835065 6764037 6664845 6772148 6859179 6986355 6898797 7066396
21295G066396J00352j28276l12079K39976J27926R1456J04715J20188K5077O4898
$$ 7066396 7166748 7038472 6726393 6966369 7094295 7185751 7290466 7410654 7435731 7500629
21285G500629j12532l51649l2998L02255J47404j67294j86082J32451L62055P3175
$$ 7500629 7388097 7036448 7003450 7305705 7453109 7285815 7099733 7232184 7594239 7667414
21275G667414k47329q2045J40578j00079k6208K19258J44127K15135J98888P3686
$$ 7667414 7420085 7338040 7478618 7378539 7352331 7571589 7715716 7930851 8129739 8203425
21265H203425K70k91741m0958J18735L766q1305k1352N6225J4143r894L01j27126
$$ 8203425 8203695 7911954 7870996 7989731 7993497 7912192 7890840 7947065 7961208 7951314 7951615 7824489
21253G824489K55269J39552l21545j5147J09353j25364M1172K17716K02728j27318
$$ 7824489 8079758 8219310 7897765 7882618 7991971 7866607 7907779 8125495 8328223 8200905
21243H200905J18659L05312o7274Q9401L8737K75051k53195r8131K04303j39416
$$ 8200905 8319564 8624876 8557602 8647003 8685740 8960791 8707596 8609465 8813768 8674352
21233H674352p0621p6175K65413k40323l30479r7647L62290J73969j08623K14819
$$ 8674352 8603731 8527556 8792969 8552646 8222167 8124520 8486810 8660779 8552156 8766975
21223H766975K12809J61122n2465K1198N7295N0419j76172O5746K92541M9692
$$ 8766975 8979784 9140906 9088441 9109639 9166934 9217353 9041181 9106927 9399468 9449160
21213I449160k43014n0818j85008M0273M75370M7052l05605j33327L24493J59658
$$ 9449160 9206146 9155328 8970320 9010593 9485963 9533015 9227410 9094083 9418576 9578234
21203I578234o3464P9685K06688p0095k38569q2442m5713Q6466K24702j24801
$$ 9578234 9514770 9594455 9801143 9731048 9492479 9410037 9364324 9450790 9675492 9550691
21193I550691M9241J23314J80434q3261N7557l9618o9958J80574j14854m7213
$$ 9550691 9599932 9723246 9903680 9820419 9877976 9838358 9768400 9948974 9834120 9786907
21183I786907m8478n9368R9663L69310R8765l90481m3678J9479L1451L1613j23604
$$ 9786907 9738429 9679061 9778724 10148034 10246799 9856318 9812640 9832119 9863570 9895183 9771579
21172I771579L65644J01471k64462K28968L78022P6775l5838J12454q0529l64380
$$ 9771579 10137223 10238694 9974232 10203200 10581222 10657997 10622159 10734613 10654084 10289704
21162A0289704p2133J30830M9350L73884M33683j29491l53914J22480J64423J30662
$$ 10289704 10217571 10348401 10397751 10771635 11205318 11075827 10721913 10844393 11008816 11139478
21152A1139478o3067J33631o959j24541j00398q5856J88393Q3609j50545n9862
$$ 11139478 11076411 11210042 11203083 11078542 10978144 10892288 11080681 11164290 11013745 10953883
21142A0953883J20936J98831j11830K11090J63937J61940r1078j24976J04228
$$ 10953883 11074819 11273650 11161820 11372910 11536847 11698787 11607709 11482733 11586961
21133A1586961J32114p244k77596p0631J73107R6158j50225l06024K1915K51472
$$ 11586961 11719075 11711831 11434235 11363604 11536711 11632869 11482644 11176620 11198535 11450007
21123A1450007J86245o930p9934O439m4033j63115R2184l0222K31310m3385P6999
$$ 11450007 11636252 11629322 11549388 11555827 11511794 11348679 11440863 11410641 11641951 11598566 11675565
21112A1675565O8191j51330L50642K03519J63098k43490p9840o7973J93120J07742
$$ 11675565 11743756 11592426 11943068 12146587 12309685 12066195 11986355 11918382 12111502 12219244
21102A2219244k71431J49333R3486k36039L4767k81536q8613Q6198n7273J1550
$$ 12219244 11947813 12097146 12190632 11954593 11989360 11707824 11619211 11705409 11648136 11659686
21092A1659686J39684J78159L29878k11044q080r9947j13635Q6430K39666J56659
$$ 11659686 11799370 11977529 12307407 12096363 12088283 11988336 11874701 11961131 12200797 12357456
21082A2357456n5757J42776J22676j76393l77641J8974j37116J8866K00233J37229
$$ 12357456 12301699 12444475 12567151 12390758 12013117 12032091 11894975 11913841 12114074 12251303
21072A2251303l04239k30788K13535k12157n868K98614l37213j6639J19614L1632
$$ 12251303 11947064 11716276 11929811 11717654 11711786 12010400 11673187 11656548 11776162 11807794
21062A1807794P2137K63339O3014j66222j5580k61385J00746L54711K027m7209
$$ 11807794 11879931 12143270 12206284 12040062 12024482 11763097 11863843 12218554 12220581 12173372
21052A2173372N2072K96223N3698J85328M5295k43115J36261k63099k32328k06919
$$ 12173372 12225444 12521667 12575365 12760693 12805988 12562873 12699134 12436035 12203707 11996788
21042A1996788J1593L49046M3844k32596K16941Q2184j68799k57452j29633M24245
$$ 11996788 12008381 12357427 12401271 12168675 12385616 12467800 12299001 12041549 11911916 12336161
21032A2336161K15878K497j81357k99606p702J33731l8436j26184K10701k15878
$$ 12336161 12552039 12554536 12373179 12073573 12065871 12199602 12161166 12034982 12245683 12029805
21022A2029805k23394l2304L65329M4670j5386p1793l46395K4767P9963J37967
$$ 12029805 11806411 11774107 12139436 12184106 12168720 12096927 11750532 11775299 11855262 11993229
21012A1993229J18318J04651J78229K72561j15116l27370k54533R4639l03717
$$ 11993229 12111547 12216198 12394427 12666988 12551872 12224502 11969969 12064608 11760891
21003A1760891l94639j80698K86228J10173L3925J70831j89422j75057M10196
$$ 11760891 11366252 11185554 11471782 11581955 11615880 11786711 11597289 11422232 11832428
20994A1832428K02814j59956j47330R536p6035K18214J61057j90596l89315k85072
$$ 11832428 12035242 11875286 11727956 11737492 11661457 11879671 12040728 11850132 11460817 11175745
20984A1175745m2371J26256J72632R2713j41129J40622J34952m3985q0264l34694
$$ 11175745 11133374 11259630 11432262 11524975 11383846 11524468 11659420 11615435 11535171 11200477
20974A1200477k800L53645Q077n1959J6379n5466q909J57783k1135j3078J60876
$$ 11200477 11197677 11551322 11559399 11507440 11523819 11468353 11459444 11617227 11596092 11583014 11743890
20963A1743890J84044k33515l78965p5638n9282J07456P4225q2482k40564j86701
$$ 11743890 11927934 11694419 11315454 11239816 11180534 11287990 11362215 11279733 11039169 10852468
20953A0852468n0500n9307r8248j57104L00954L52328k18732N090o1800J09253
$$ 10852468 10801968 10742661 10644413 10487309 10788263 11140591 10921859 10926949 10865149 10974402
20943A0974402j02421k40027j31845n0844K12614J07579j10122Q3554J14980j24106
$$ 10974402 10871981 10631954 10500109 10449265 10661879 10769458 10659336 10742890 10857870 10733764
20933A0733764J10699J8170J18958O7316K0877j53296j49063n9796m8109l41525
$$ 10733764 10844463 10862633 10981591 11048907 11069784 10916488 10767425 10707629 10659520 10317995
20923A0317995j0602K62301K42907k67237j28284j07440k6690m8709k0787k15838
$$ 10317995 10307393 10569694 10812601 10545364 10417080 10309640 10282950 10234241 10213454 9997616
20913I997616J70338P0723J15559J57277K8110k27532P1456K17749n9768k36907
$$ 9997616 10167954 10238677 10354236 10511513 10539623 10312091 10383547 10601296 10541528 10304621
20903A0304621o822J86180q250k14853j05878J95564O4290j56529m20775j0235
$$ 10304621 10297799 10483979 10475729 10260876 10154998 10350562 10414852 10258323 9837548 9827313
20893I827313L02339j36115l2347P9435J06147M085m2321M6916R9303l37136l07568
$$ 9827313 10129652 9993537 9961190 10040625 10146772 10150857 10108536 10155452 10254755 9917619 9610051
20882I610051J37504J11634l2925J33066l7797q5182j28938m4134K23546m2604
$$ 9610051 9747555 9859189 9826264 9959330 9921533 9836351 9707413 9663279 9886825 9844221
20872I844221j78895p0599l5129l49999j35737j15337o2846J22752p4661K24874
$$ 9844221 9665326 9594727 9559598 9209599 9073862 8958525 8895679 9018431 8943770 9168644
20862I168644J06892J40113M898l7868l09421q0290j79610o2005j65863L496L09912
$$ 9168644 9275536 9415649 9420547 9382679 9073258 8992968 8813358 8751353 8585490 8588986 8898898
20851H898898M5021q6576O113L3192j16806O0201j33786j39346K21609K0230J31706
$$ 8898898 8943919 8857343 8863456 8896648 8779842 8840043 8706257 8566911 8788520 8808750 8940456
20840H940456J59476M5110P425l14735l35073j93727o2505J31126J72921K12152
$$ 8940456 9099932 9145042 9152467 8837732 8502659 8308932 8246427 8377553 8550474 8762626
20830H762626M20534P1787k0313l72343j66810k74567p9338j33572j9641J17953
$$ 8762626 9183160 9254947 9234634 8862291 8695481 8420914 8341576 8208004 8188363 8306316
20820H306316L7426j91638j96123m8948R5246K32200K06472j26697j49734j52340
$$ 8306316 8343742 8152104 7955981 7907033 8002279 8234479 8440951 8314254 8164520 8012180
20810H012180j36294K19464J26484j3594j53877k77479N4856n858j1244k034j77218
$$ 8012180 7875886 8095350 8221834 8208240 8054363 7776884 7831740 7825882 7814638 7812604 7635386
20799G635386j96308p1048k4074J62501J01905j01908k65219k2604J45568j79994
$$ 7635386 7439078 7368030 7343956 7506457 7608362 7506454 7241235 7218631 7364199 7184205
20789G184205j31910K59880R3066j43481k13848l2051N7239K4878q6936L0088
$$ 7184205 7052295 7312175 7405241 7261760 7047912 7015861 7073100 7097978 7011042 7041130
20779G041130R3023Q5171j13532L030J47866j65118k16141J37061p4238l74013
$$ 7041130 7134153 7219324 7105792 7108822 7256688 7091570 6875429 7012490 6938252 6564239
20769F564239J12240J52222K07644j5509M3090r4545j21428r1527k91416o3072
$$ 6564239 6676479 6828701 7036345 7020836 7063926 6969381 6847953 6756426 6465010 6401938
20759F401938j8875j29834j05075J02733L3073P1279J89618k0949O0387q1273
$$ 6401938 6383063 6253229 6148154 6250887 6283960 6355239 6544857 6523908 6584295 6503022
20749F503022j49458J01846J57490P3042R2993k47613k65688j50285K45386R78
$$ 6503022 6353564 6455410 6612900 6685942 6778935 6531322 6265634 6115349 6360735 6361713
20739F361713K38102q082k0778M284j77114K07849J71524m1438j12275q5350n8550
$$ 6361713 6599815 6591733 6570955 6575239 6398125 6605974 6777498 6736060 6623785 6538435 6479885
20728F479885j03088j86259J3588J93168j37961j75079k7775l3664j1758J30n0401
$$ 6479885 6376797 6190538 6204126 6397294 6259333 6084254 6056479 6022815 6011057 6011187 5960786
20717E960786Q7275J23238l00351M901M1861m5953k41415K316k6641Q4578J07382
$$ 5960786 6048061 6171299 5870948 5875849 5917710 5871757 5630342 5632658 5606017 5690595 5797977
20706E797977l88261P4286J51695L8619n8421j97749j50715k77791n6374M57780
$$ 5797977 5409716 5484002 5635697 5674316 5615895 5418146 5267431 4989640 4933266 5391046
20696E391046L0960j19922j75912M2219J17255J35695J55575K00443k76321m68174
$$ 5391046 5422006 5302084 5126172 5168391 5285646 5421341 5576916 5777359 5501038 5032864
20686E032864p0468K04342J06426k4753m14240o7549M19831J85660j30912Q9000
$$ 5032864 4962396 5166738 5273164 5248411 4834171 4766622 5186453 5372113 5241201 5330201
20676E330201j38918o4632n0687j37721j36079j0311J02209J60403j88038j00211
$$ 5330201 5191283 5126651 5075964 4938243 4802164 4791853 4894062 5054465 4866427 4766216
20666D766216k77061J43305P9133l03764k9181q6979k07950j27989o4065L85603
$$ 4766216 4489155 4632460 4711593 4407829 4378648 4291669 4083719 3955730 3891665 4277268
20656D277268J41603J21951L6118j4960R3266j22254P8708L10737M2190O0458
$$ 4277268 4418871 4540822 4576940 4561980 4655246 4532992 4611700 4922437 4964627 5025085
20646E025085j70156p9206l6583k11828j12723j97333j7835P7099O6615j43177
$$ 5025085 4854929 4775723 4739140 4527312 4414589 4217256 4199421 4276520 4343135 4199958
20636D199958J98794L36756J06635J564m04706j47133L08744R6894m85200l75159
$$ 4199958 4398752 4735508 4842143 4843707 4439001 4291868 4600612 4697506 4212306 3837147
20626C837147K5520L46251K74660j54287k74911J69657R2154N9209j6471J70154
$$ 3837147 3862667 4208918 4483578 4329291 4054380 4224037 4316191 4375400 4358929 4529083
20616D529083M331l37055k02249k21926j72123P8110J35740p1296N8734j14779
$$ 4529083 4533414 4196359 3994110 3772184 3600061 3678171 3813911 3742615 3801349 3686570
20606C686570k7130K51279K18453j56513j10526P4663J08520J18840j9723k27798
$$ 3686570 3659440 3910719 4129172 3972659 3862133 3936796 4045316 4164156 4144433 3916635
20596C916635p8670k13609j03771O6251J49769l7651L71623k09105l26275p9132
$$ 3916635 3837965 3624356 3520585 3586836 3736605 3698954 4070577 3861472 3535197 3456065
20586C456065J86598Q2908K6655k41217n1225j21152q4295L6814M56892p0636
$$ 3456065 3642663 3725571 3752226 3511009 3459784 3338632 3254337 3291151 3748043 3677407
20576C677407J1195k9272j28899j55725l15031Q8319L71286L3264j18660J3453
$$ 3677407 3688602 3659330 3530431 3374706 3059675 3147994 3519280 3552544 3433884 3447337
20566C447337J90725m1915k3710j07422K7775j62466K9038L2896J70781l3482
$$ 3447337 3638062 3596147 3572437 3465015 3492790 3330324 3359362 3392258 3563039 3529557
20556C529557K9556j56991l27336l72817Q0566n2173n5139q5890K22610J63744
$$ 3529557 3559113 3402122 3074786 2701969 2782535 2730362 2675223 2589333 2811943 2975687
20546B975687J70378r7049l09385J17100J67507M260k37424J60900K74391N4448
$$ 2975687 3146065 3049016 2739631 2856731 3024238 3028498 2791074 2951974 3226365 3280813
20536C280813n7399p5159l77555L2222J85983J28255q2384j56682J47132M6799
$$ 3280813 3223414 3148255 2770700 2802922 2988905 3117160 3034776 2878094 3025226 3072025
20526C072025m92896j58964R5331J84274p2093j33065K26410j1070J42036K17990
$$ 3072025 2579129 2420165 2515496 2699770 2627677 2494612 2721022 2709952 2851988 3069978
20516C069978l02268j32547p1845J01187Q8311K9676J20862J17705l46865q2476
$$ 3069978 2767710 2635163 2563318 2664505 2752816 2782492 2903354 3021059 2674194 2591718
20506B591718J62966K95508J23270n250j75205l94976j96224N5923o2985j18033
$$ 2591718 2754684 3050192 3173462 3168212 2993007 2598031 2401807 2457730 2394745 2276712
20496B276712o3767P8950J85404L6128j49621P2270L10335r8970J71758j03433
$$ 2276712 2212945 2291895 2477299 2513427 2363806 2436076 2746411 2647441 2819199 2715766
20486B715766j08232O6993P2664J20174K9547P1213k35904j73558k547O2743L854
$$ 2715766 2607534 2674527 2747191 2867365 2896912 2968125 2732221 2558663 2556116 2618859 2622713
20475B622713k06388j26523j89353R947K80837M61496k27165l07139M7905J68797
$$ 2622713 2416325 2289802 2100449 2110396 2391233 2852729 2625564 2318425 2366330 2535127
20465B535127K27331r6476j43436J56302J47490k06638j15148k54159j57394M6053
$$ 2535127 2762458 2665982 2522546 2678848 2826338 2619700 2504552 2250393 2092999 2139052
20455B139052K00366P5394k7604J51823R0701k20445j04725J7001n1459m10857
$$ 2139052 2339418 2414812 2387208 2539031 2629732 2409287 2304562 2321563 2270104 1859247
20445A859247R9484K32510K07934j46282j35230j2536P404P2412J45833L5885
$$ 1859247 1958731 2191241 2399175 2252893 2117663 2105127 2112531 2184943 2330776 2366661
20435B366661l04650L4781R2862R4620J20040j15937J09390O5466l47371j79932
$$ 2366661 2062011 2096792 2189654 2284274 2404314 2288377 2397767 2463233 2115862 1935930
20425A935930q7236N0564L24561J71541j15260j97404L1587k22269j80631J75276
$$ 1935930 1848694 1899258 2223819 2395360 2280100 2082696 2114283 1892014 1711383 1886659
20415A886659J69088j33656p5463J05511J4601j54737j07712R7939P5221M36807
$$ 1886659 2055747 1922091 1846628 1952139 1966740 1812003 1704291 1802230 1877451 2314258
20405B314258L7109k2779j70309j39291k64208K26205J69380k5301r5988P693
$$ 2314258 2351367 2328588 2158279 2018988 1754780 1980985 2150365 2125064 2029076 2036769
20395B036769P8921k80668j90244K68198J33149J73496J68268k578j93728l52852
$$ 2036769 2115690 1835022 1644778 1912976 2046125 2219621 2387889 2385311 2191583 1838731
20385A838731l36295J01484K25874j08354L088n7299J02399J78056L6149k08528
$$ 1838731 1502436 1603920 1829794 1721440 1724528 1667229 1769628 1947684 1983833 1775305
20375A775305l2536j46140n3497L15007N0550r0922L1909J5248K69049M7436j55019
$$ 1775305 1742769 1596629 1543132 1858139 1908689 1817767 1849676 1864924 2133973 2181409 2026390
20364B026390j19830k1638O5463J22891J80237k69564K5689J28261o2245o0352
$$ 2026390 1906560 1884922 1950385 2073276 2253513 1983949 2009638 2137899 2075654 2015302
20354B015302l05327m32480P9599J85461R7987K3962l4023J92259K18204o6777
$$ 2015302 1709975 1277495 1357094 1542555 1640542 1664504 1630481 1822740 2040944 1974167
20344A974167m0826R6385p3793r7576R4637k16231m29689J55342J92535L0163
$$ 1974167 1933341 2029726 1955933 1858357 1952994 1736763 1307074 1462416 1654951 1685114
20334A685114R818o9402j06788R6475J15642k28396j92246k54290r457J80028
$$ 1685114 1694932 1625530 1518742 1615217 1730859 1502463 1310217 1055927 1046470 1226498
20324A226498Q6377j7630J41250q2265o2566K3431P7753o2718l79000m4307L51646
$$ 1226498 1312875 1295245 1436495 1354230 1291664 1315095 1392848 1330130 951130 906823 1258469
20313A258469l7250N3340O6898m4169M3859L08655n5174j94535m4327o1209Q4216
$$ 1258469 1221219 1274559 1341457 1297288 1341147 1649802 1594628 1400093 1355766 1294557 1378773
20302A378773P84K478q50p2608K67570k20356k48915l8494L33688J05684n6253
$$ 1378773 1379557 1382035 1381185 1308577 1576147 1355791 1106876 1068382 1402070 1507754 1451501
20291A451501o4991o6726p3176n3374k52727j30320N4287J74233L6302J89421
$$ 1451501 1386510 1319784 1246608 1193234 940507 810187 864474 1038707 1075009 1264430
20281A264430K24788J21537k39122m88524J1498K1905K44810j78721L00087K92892
$$ 1264430 1489218 1610755 1371633 883109 894607 916512 1161322 982601 1282688 1575580
20271A575580k52307k53520j75700o0550J42254K6379R8979j17296R6617j74623
$$ 1575580 1323273 1069753 894053 833503 975757 1002136 1101115 983819 1080436 905813
20261I05813j81995N1052J32148L018L8468j36179k10588p0454R4830P650K11649
$$ 905813 723818 774870 907018 910036 948504 812325 601737 531283 626113 633763 845412
20250H45412O7347l5998r4700k7595m2718j16554R3946Q0817N637k1308M30128
$$ 845412 912759 876761 782061 754466 711748 595194 689140 769957 775594 754286 1184414
20239A184414J45093j38627l47702k09226J56658l2572j09757j92359J81194J22361
$$ 1184414 1329507 1190880 843178 633952 790610 758038 648281 455922 637116 759477
20229G59477J23903J89021O1568K24872o6885o6090J51990j48892J5734K50413
$$ 759477 883380 1072401 1133969 1358841 1291956 1225866 1377856 1228964 1244698 1495111
20219A495111j6882o2912J04694m7227j51549k8327k6700Q626m3625j55448j88780
$$ 1495111 1478229 1415317 1520011 1472784 1321235 1292908 1266208 1274834 1231209 1075761 886981
20208H86981j20943J81130l378k18095K69858N3921l59752J8702j9464j31811
$$ 886981 766038 947168 943790 725695 995553 1049474 689722 708424 688960 557149
20198E57149J31505M18283K52260j7717j43592n283j09882l41723k01335K11136
$$ 557149 688654 1106937 1359197 1341480 1197888 1192605 1082723 741000 539665 750801
20188G50801j65645L815J29380K52414L07106j76294l67967j71569K3747K71186
$$ 750801 585156 588971 718351 970765 1277871 1101577 733610 562041 585788 856974
20178H56974L00686k7794Q3787j25663k21373j56614j24560j56872M0903j9574
$$ 856974 1157660 1129866 1213653 1087990 866617 710003 585443 428571 469474 449900
20168D49900J12140l6412J19792K1729K88819K48016M0765k2201j76132j58460
$$ 449900 562040 525628 645420 667149 955968 1203984 1244749 1222548 1046416 887956
20158H87956j1483j14530j630n2770J78657M79033J99354j21990n00959k40325
$$ 887956 876473 761943 760313 707543 886200 1365233 1564587 1442597 941638 701313
20148G01313K33780n2771l15160K9733K21834J26479p1522R5449m6037L06612
$$ 701313 935093 882322 567162 596895 818729 945208 873686 969135 923098 1229710
20138A229710L35367k87078l90504q5748J49618j0954k01803M708K4077k40272
$$ 1229710 1565077 1277999 887495 801747 951365 940411 738608 743316 767393 527121
20128E27121l37489j31242Q508J46805L01703K9056n2058J02701R4366J84590
$$ 527121 189632 58390 66898 213703 515406 544462 492404 595105 689471 874061
20118H74061k62711n7784n5345J1261J4449J79320J51890l490p8172R2842j16384
$$ 874061 611350 553566 498221 509482 523931 703251 855141 851651 773479 866321 749937
20107G49937o9247M8607J4626o1282l37445k75566J78585L95561m2795O2442J50615
$$ 749937 680690 729297 743923 682641 345196 69630 248215 643776 600981 663423 814038
20096H14038o7143j41716l45520k31327J37063M07038K14697K2258j70204j41327
$$ 814038 746895 605179 259659 28332 165395 572433 787130 809388 639184 497857
20086D97857R3727j98178j47150O5328K15350J91345K79784L14886Q339j30208
$$ 497857 591584 393406 246256 311584 526934 718279 998063 1312949 1321288 1191080
20076A191080j44297J06285K12984r8281M5830j90549p2232J25630J78221O4767
$$ 1191080 1046783 1153068 1366052 1267771 1313601 1123052 1050820 1176450 1354671 1419438
20066A419438j02695K4214j38268l51732Q3903L63203j36872k88301o9464q8316
$$ 1419438 1316743 1340957 1202689 850957 934860 1298063 1161191 872890 803426 715110
20056G15110J30130j07042j91922q2140l16798j0989J79954j55972j26005l675
$$ 715110 845240 738198 546276 464136 147338 136349 316303 160331 34326 30651
20046C0651J07919J84340l8971l26639K46475K58304m1593K1708J36680J45133
$$ 30651 138570 322910 283939 -42700 203775 462079 420486 442194 578874 724007
20036G24007K83591q2205j00519o4361p5120q6910K36691j20366k6979J87899
$$ 724007 1007598 925393 824874 760513 685393 598483 835174 714808 687829 875728
20026H75728J21352j33167p6817K2077k24577L54105M76022J03303o7027J54493
$$ 875728 997080 863913 787096 809173 584596 938701 1414723 1518026 1450999 1605492
20016A605492k6900j42240k1085M7992K56721j31401q3237J68059J55532j68912
$$ 1605492 1578592 1436352 1415267 1463259 1719980 1588579 1505342 1673401 1828933 1660021
20006A660021j41192j27058j16316J65467l3020l00488J51512J53340N7379P1240
$$ 1660021 1518829 1391771 1275455 1440922 1407902 1107414 1258926 1412266 1469645 1540885
19996A540885k22777j73365j45844j13888J5773k51932r1409M9171J24038n751
$$ 1540885 1318108 1144743 998899 885011 900784 648852 557443 606614 730652 724901
19986G24901l56647l5108K66238j6901l13439k36324J28843J80381K21077J25949
$$ 724901 368254 333146 599384 582483 269044 32720 161563 341944 563021 688970
19976F88970J69704J39487k01064k5165q331j69377K0402n4845L91809K27089
$$ 688970 858674 998161 797097 771932 763601 594224 614626 559781 951590 1178679
19966A178679K99865j48921k35741l72375j18320K86950J91752K58489j7390q3172
$$ 1178679 1478544 1329623 1093882 721507 603187 890137 1081889 1340378 1322988 1239816
19956A239816m9471j21993j59960K36623j28143j13098M4500p747k40467j68198
$$ 1239816 1190345 1068352 908392 1145015 1016872 903774 948274 940527 700060 531862
19946E31862r3198J3060p1093j1207J24433K30125M2600m9758j16550j89132n2649
$$ 531862 438664 451724 380631 369424 493857 723982 766582 716824 600274 411142 358493
19935C58493N3283J14067K82549n1902l73676J29465J27462q5008K9946j86291
$$ 358493 411776 525843 808392 756490 382814 512279 639741 554733 584679 398388
19925C98388k03500j05704K33056P0077K4288R7069k05793k68574j11391k63o448
$$ 398388 194888 89184 322240 392317 416605 513674 307881 39307 -72084 -72347 -78795
19914g8795j45158r5259J34886J49727j41653j79539J40137K77861J49530p6857
$$ -78795 -223953 -319212 -184326 -34599 -176252 -355791 -215654 62207 211737 134880
19904A34880N1975J22501J34918K59546j66836k77472k10154j35383j42276L16031
$$ 134880 186855 309356 444274 703820 536984 259512 49358 -86025 -228301 87730
19894H7730J08470P4856L6940q2214J62485P3438j45213Q9049m7188Q3186j41129
$$ 87730 196200 271056 307996 225782 388267 461705 316492 405541 358353 441539 300410
19883C00410j47118p9966m1646k52185L31271J67976k94235o3015j18616J27494
$$ 300410 153292 73326 31680 -220505 110766 278742 -15493 -78508 -197124 -69630
19873f9630L97172l1988l10115j39469J79789N6263K69336J28329k75687l47379
$$ -69630 327542 295554 -14561 -154030 25759 82022 351358 479687 204000 -143379
19863a43379Q3661K53167K18974N7599J12029q3539l46873l02196J19819K63214
$$ -143379 -59718 193449 412423 470022 582051 498512 151639 -150557 -30738 232476
19853B32476L48365k43781j55555K32384R9705j54232k94507J68602k84826q7407
$$ 232476 580841 337060 181505 413889 513594 359362 64855 233457 -51369 -138776
19843a38776R9209Q3855J19738Q6655M05336q5768o3620j03R1322J63842O7555
$$ -138776 -39567 44288 164026 250681 656017 570249 506629 506526 597848 761690 829245
19832H29245r5003j90414M7961J06681N5103R9494J0632j88213k41263n3417M1560
$$ 829245 734242 543828 591789 698470 753573 853067 863699 675486 434223 380806 422366
19821D22366J79472k36147l76450j12675j6307J31428j9572k39445q9942K65408
$$ 422366 601838 365691 -10759 -123434 -139741 -8313 -27885 -267330 -357272 -91864
19811i1864J12581o4048m0770M6904J18135l62271k25015Q6041J35899J41260
$$ -91864 20717 -43331 -84101 -37197 80938 -281333 -506348 -420307 -284408 -143148
19801a43148j11973K07066J29823p2067Q0832K7331j20057k1030O9906K12357
$$ -143148 -255121 -48055 81768 9701 90533 117864 -2193 -23223 46683 259040
19791B59040r1421M2439M74j69496K23746K78473m3649J21826j7433k54936p1154
$$ 259040 167619 210058 210532 41036 264782 543255 499606 621432 603999 349063 277909
19780B77909J19286j7948p3246J84141j20401j91920n784J01419P7939l20300
$$ 277909 397195 379247 306001 490142 369741 177821 172037 273456 351395 31095
19770C1095m243K64413Q2345l4203m3027k2749j31718J20724M5194o5439j35791
$$ 31095 26852 291265 373610 339407 296380 273631 141913 262637 307831 242392 106601
19759A06601j3729k51868J24775J80314J59287L0135j81785J9484L25778R1460
$$ 106601 92872 -158996 -34221 146093 305380 335515 153730 173214 498992 590452
19749E90452k06891k40099k19763k63686Q7593J79417q9838k47167k46647L26959
$$ 590452 383561 143462 -76301 -339987 -252394 -72977 -162815 -409982 -656629 -329670
19739c29670J19492K56576K94770j81400k34824k94315J22231K66141K17422l22143
$$ -329670 -210178 46398 341168 159768 -75056 -369371 -247140 19001 236423 -85720
19729h5720P9387K63582k46383j18534j9661J23463N2781k43620o5829J02318
$$ -85720 -6333 257249 10866 -107668 -127329 -3866 48915 -194705 -260534 -158216
19719a58216K49318m3982M5259l16849j11565L47905J77540k38064K49700K7310
$$ -158216 91102 47120 92379 -224470 -336035 11870 189410 -48654 201046 228356
19709B28356o4877j6786M0338r0871k2104N8794J57551m9851R0781l75842l9545
$$ 228356 163479 146693 187031 96160 74056 132850 290401 240550 331331 -44511 -84056
19698h4056M8836L620J03052K00684j499l6783q5729l0767k47466j62401K89578
$$ -84056 -35220 -31600 71452 272136 270637 233854 148125 117358 -130108 -292509 -2931
19687b931l3937l35k5520Q4971L13093J55675m10188l55339J12583J40677J57456
$$ -2931 -36868 -37203 -62723 22248 335341 491016 80828 -274511 -161928 -21251 136205
19676A36205k7117r5374J8307p7379O1157K72139j20220L44j03215j52399P928
$$ 136205 109088 13714 32021 -45358 15799 287938 167718 168062 64847 -87552 -79624
19665g9624k49073P8181L79545K61639j91512j97751l55559P0097J50606N5327
$$ -79624 -328697 -250516 129029 390668 199156 1405 -354154 -284057 -133451 -78124
19655g8124k06756o4860n8837J00977J91753J90828M00649O7657j66561J567K10454
$$ -78124 -284880 -349740 -408577 -307600 -115847 74981 475630 543287 376726 378293 588747
19644E88747m0146j10667J03107k72660Q4381J98473m1123J9097k30369K82523
$$ 588747 548601 437934 541041 268381 352762 551235 510112 529209 298840 581363
19634E81363J77167j50220j55595k42161j18948j38413q6082J81139M22953J1710
$$ 581363 758530 608310 452715 210554 91606 -46807 -132889 48250 471203 482913
19624D82913j3248k34151K0461J05354K03753p8126k18678r0695J89321R6078
$$ 482913 469665 235514 255975 361329 565082 486956 268278 177583 366904 462982
19614D62982K83616J86797m50567o3415n2980J23368j40222o9090j49341K35766
$$ 462982 746598 933395 482828 419413 366433 489801 349579 280489 131148 366914
19604C66914O6880o8043l5516m2574O0307K53076K03536j43733k73066O0212N4841
$$ 366914 433794 365751 330235 287661 347968 601044 804580 660847 387781 447993 502834
19593E02834K6896k23728k04074J42702M7994j93479m58967k01352K48455k655
$$ 502834 529730 306002 101928 244630 292624 99145 -359822 -561174 -312719 -315374
19583c15374J45785L75015K38484K2682j59039p5460L3703m0132Q6008p580K71156
$$ -315374 -169589 205426 443910 466592 307553 232093 265796 225664 311672 304092 575248
19572E75248l5424k82224r8149j28110p3496J48375K16032p7288J34229J24519
$$ 575248 539824 257600 159451 31341 -42155 106220 322252 244964 379193 503712
19562E03712J04806L4650J35442j38634k35606k8652j0457k62307j38315L35755
$$ 503712 608518 643168 778610 639976 404370 375718 365261 102954 -35361 300394
19552C00394J86733q1334k05745l21235P4243m7520J53426K69128J35458Q2515
$$ 300394 487127 405793 200048 -121187 -46944 -94464 58962 328090 463548 546063
19542E46063K782n8241J77646J12816L98761k01485j58566j22367k32378j40402
$$ 546063 548845 490604 668250 781066 1179827 978342 819776 697409 465031 324629
19532C24629j72899q1146J66947J76289j14665l25395L18087J07071j47548J17008
$$ 324629 151730 70584 237531 413820 299155 -26240 291847 398918 251370 368378
19522C68378O2686j0235k2241l80570j85738K04606j1295k45242l78747K46222
$$ 368378 431064 420829 398588 18018 -167720 36886 25591 -219651 -598398 -352176
19512c52176L99067K24087K16410n41759j49678J11377l9679J72678L9995J1216
$$ -352176 46891 270978 487388 -54371 -204049 -92672 -132351 40327 80322 91538
19502I1538k8625k38328L2832J21112K33438l40375j26082K818j41517K0893o3885
$$ 91538 62913 -175415 -142583 -21471 211967 -128408 -254490 -251672 -393189 -372296 -436181
19491d36181N4289K39546J74557j16473J45897J23479l1125k5181k56118M5930
$$ -436181 -381892 -142346 32211 -84262 61635 185114 153989 128808 -127310 -81380
19481h1380J1891P6664J14058J69486m612k5360J17981j46695n9735q9114k43296
$$ -81380 -69489 7175 121233 290719 286107 260747 378728 232033 172298 83184 -160112
19470a60112N0464J92430p9075K40066p4704k47786J84882L66686r6852j92468
$$ -160112 -109648 82782 3707 243773 169069 -78717 106165 472851 375999 183531
19460A83531k10097j96646k43464N1208J98393L02212m6550j00576j13704O3138
$$ 183531 -26566 -223212 -466676 -415468 -217075 85137 38587 -61989 -175693 -112555
19450a12555J17344j41102k7686N02354J31222p5352K1431M1825o9648K44389
$$ -112555 4789 -136313 -163999 338355 469577 394225 415656 457481 387833 632222
19440F32222K99364O4035l10761l12938P0372M7600j46387j06833j94036j58349
$$ 632222 931586 995621 684860 371922 442294 489894 343507 236674 42638 -115711
19430a15711q0752J02148J23560J13142J9735J03187Q0529J56265L9700j6721
$$ -115711 -196463 -94315 29245 142387 162122 265309 345838 502103 541803 525082
19420E25082K15174L07364J5403K49996K32457j2553J10605M30419J40552o1563
$$ 525082 740256 1047620 1063023 1313019 1545476 1532923 1643528 2073947 2214499 2152936
19410B152936O800L1495n790q9645K44144J29771l02419L0064J0931J25632L39966
$$ 2152936 2159736 2191231 2185441 2095796 2339940 2469711 2167292 2197356 2208287 2333919 2673885
19399B673885J14950p9627l71619k50176o5071n0351K07122m1384l38357j76715
$$ 2673885 2788835 2709208 2337589 2087413 2022342 1971991 2179113 2137729 1799372 1622657
19389A622657o2858k84678K13208O8421r3090p4501O4280R0872k14266o1244n495
$$ 1622657 1559799 1275121 1488329 1556750 1463660 1389159 1453439 1544311 1330045 1268801 1263306
19378A263306L5370l1917J89581N8325P1346j97200j46581K24883K87978L77124
$$ 1263306 1298676 1266759 1456340 1514665 1586011 1388811 1242230 1467113 1755091 2132215
19368B132215L66182j10086k46776J30445m1927M4246L18762M94563Q5509j83731
$$ 2132215 2498397 2388311 2141535 2271980 2230053 2274299 2593061 3087624 3173133 2989402
19358B989402J60185J0127k95079k52932N8919K91188J44400o8447j28988k46960
$$ 2989402 3149587 3159714 2864635 2611703 2670622 2961810 3106210 3037763 2908775 2661815
19348B661815K2280j81518l9695K36188k97864j72320j20110k79816j30831o76
$$ 2661815 2684095 2502577 2462882 2699070 2401206 2228886 2108776 1828960 1698129 1697453
19338A697453o4449L6072L9202j9929l05529J18762K74182P9989j3184j67272
$$ 1697453 1633004 1669076 1708278 1688349 1382820 1501582 1775764 1855753 1842569 1675297
19328A675297N5300n7349j94592m670J44368J56675J91076k89490k69118m7921
$$ 1675297 1730597 1673248 1478656 1473986 1618354 1775029 1966105 1676615 1407497 1359576
19318A359576J64951j39959K0710j21394k54078o6679J74096J97727k3194J24902
$$ 1359576 1524527 1384568 1405278 1283884 1029806 963127 1137223 1334950 1311756 1436658
19308A436658M08197J50199J00393j20055j98348L7975m7702p820o2375J24747
$$ 1436658 1844855 1995054 2095447 1975392 1777044 1815019 1767317 1759497 1697122 1821869
19298A821869K93971J17126j48071K04333Q2591q6481j21566J41772J40139o2623
$$ 1821869 2115840 2232966 2084895 2289228 2371819 2285338 2163772 2305544 2445683 2383060
19288B383060j78393J86466J05392K5910L8970J3390K65007L67986L19122r8171
$$ 2383060 2204667 2391133 2496525 2522435 2561405 2574795 2839802 3207788 3526910 3428739
19278C428739j38989l04962j02253o0221J39137J76567K43308J14140M2373J38328
$$ 3428739 3289750 2984788 2882535 2822314 2961451 3138018 3381326 3495466 3537839 3676167
19268C676167J92734k06345J77796M20917m0715l31669M0225P2517l312L69287
$$ 3676167 3868901 3662556 3840352 4261269 4220554 3888885 3929110 4001627 3998315 4367602
19258D367602m0629J31685N94964L06912j90180K49197N48040M54971N9916J48723
$$ 4367602 4326973 4458658 5053622 5360534 5170354 5419551 5967591 6422562 6482478 6631201
19248F631201J89674N19865N67462K40201N7583L15015R3174L29818L16935K78162
$$ 6631201 6820875 7340740 7908202 8148403 8205986 8521001 8614175 8943993 9260928 9539090
19238I539090L94789L18601M44628M16627M08541J81681J58458L95150N87648
$$ 9539090 9933879 10252480 10697108 11113735 11522276 11703957 11862415 12257565 12845213
19229A2845213L51756M77898M64833P53963J014256M50950K43769O36618R85346
$$ 12845213 13196969 13674867 14139700 14893663 15907919 16358869 16602638 17239256 18224602
19220A8224602Q13239R04193N81670N60261P63278Q28012P01167O76113R14761
$$ 18224602 19037841 19942034 20523704 21083965 21847243 22675255 23376422 24052535 24967296
19211B4967296O49914P23147O94268M30479P96586R00873N59236P37065P15150
$$ 24967296 25617210 26340357 27034625 27465104 28261690 29162563 29721799 30458864 31174014
19202C1174014O31188N95469M95872N83995N15752K32933J22285J41776J8483
$$ 31174014 31805202 32400671 32896543 33480538 33996290 34229223 34351508 34493284 34511767
19193C4511767K07507L81952j47637n04405k78546J58949M7301l79372k55352
$$ 34511767 34719274 35101226 34953589 34449184 34170638 34329587 34376888 33997516 33742164
19184C3742164J77373J59779j48863j84552k37241j70551j39186K81648q3753
$$ 33742164 33919537 34079316 33930453 33745901 33508660 33338109 33198923 33480571 33396818
19175C3396818j77183K58470P10j75911N4198J52105J89837L50405N44001N13270
$$ 33396818 33219635 33478105 33478815 33302904 33357102 33509207 33699044 34049449 34593450 35106720
19165C5106720L00189K32226M97329N42761K12081M72581J24608J97246M66637
$$ 35106720 35406909 35639135 36136464 36679225 36891306 37363887 37488495 37685741 38152378
19156C8152378M60024L74412N11471J32151j65825J62819L19782J94671J05770
$$ 38152378 38612402 38986814 39498285 39630436 39464611 39627430 39947212 40141883 40247653
19147D0247653K81445J14852j84188l46555m23481n67089l88166j90965l74773
$$ 40247653 40529098 40643950 40459762 40113207 39689726 39122637 38734471 38543506 38168733
19138C8168733m67606n07984n08743q53073p33195o51569q28257r61257m51615
$$ 38168733 37701127 37193143 36684400 35831327 35098132 34446563 33618306 32657049 32205434
19129C2205434r12665r64089q24058p14209p23214o05984q63692o45618m54336
$$ 32205434 31292769 30328680 29504622 28790413 28067199 27461215 26597523 25951905 25497569
19120B5497569p19975o40638q68570o02342o13666p70730n52631m50110m25772
$$ 25497569 24777594 24136956 23268386 22666044 22052378 21281648 20729017 20278907 19853135
19111A9853135n60812k56270m99327l54720l02135k60984o79015o53413m5391
$$ 19853135 19292323 19036053 18536726 18182006 17879871 17618887 16939872 16286459 16241068
19102A6241068j53237k56959k77652m41273k11306l43730m86220j83162k24070
$$ 16241068 16087831 15830872 15553220 15111947 14900641 14556911 14070691 13887529 13663459
19093A3663459k56942n22702l86936n4122J80900j98870l77203k56924p49536
$$ 13663459 13406517 12883815 12496879 12442757 12623657 12424787 12047584 11790660 11041124
19084A1041124n41822M9269j68487l24006m01557m03946j97054M8649j05695j36044
$$ 11041124 10499302 10548571 10380084 10056078 9654521 9250575 9053521 9102170 8996475 8860431
19074H860431l34735l6270r0556k34917n34630l29976J12722p216k96868l46931
$$ 8860431 8525696 8489426 8398870 8163953 7629323 7299347 7412069 7404853 7107985 6761054
19064F761054j24963l9349r728R2722j9680J14624J883q5512k06960p9297j27665
$$ 6761054 6636091 6596742 6587014 6679736 6660056 6774680 6776563 6691051 6484091 6404794 6277129
19053F277129j32758k34291k27482j54189L1189o2190k29091l14691N0433K5392
$$ 6277129 6144371 5910080 5682598 5528409 5559598 5497408 5268317 4953626 5004059 5029451
19043E029451k55812q8992k82577k9304M75563k30015k35519l829J83591M36060
$$ 5029451 4773639 4684647 4402070 4372766 4848329 4618314 4382795 4378966 4562557 4998617
19033D998617K827m03893m15942k09154j8875K48202K19301q8629l7025k73597
$$ 4998617 5001444 4597551 4181609 3972455 3953580 4201782 4421083 4332454 4295429 4021832
19023D021832j39334J06803R2572m20636p5908k7804p5983j80101p247j21317
$$ 4021832 3882498 3989301 4081873 3661237 3585329 3557525 3481542 3301441 3294194 3172877
19013C172877M7137r1429j19991k24183n930J10688J02298J60667N439m5160k29828
$$ 3172877 3220014 3128585 3008594 2784411 2778481 2889169 2991467 3152134 3157573 3112413 2882585
19002B882585k94008j36983k5382L02718K07636m28448j2182J66978j78894j57898
$$ 2882585 2588577 2451594 2426212 2728930 2936566 2508118 2495936 2662914 2484020 2326122
18992B326122J40235J2308J47864l0537k7001j00410k80250j51564K69675m409
$$ 2326122 2466357 2478665 2626529 2595992 2568991 2468581 2188331 2036767 2306442 2302033
18982B302033j17977J27997l4048r396l86792k2239J21279J87907k8711p7116
$$ 2302033 2184056 2312053 2278005 2268609 1881817 1859578 1980857 2168764 2140053 2062937
18972B062937P0685J03216J32670j82749m9245M4901p7021R8499K7934k01497
$$ 2062937 2133622 2236838 2369508 2186759 2137514 2182415 2105394 2203893 2231827 2030330
18962B030330q9763R8744J66324j41827o65R9668r3977m3938j0780J41612j49223
$$ 2030330 1940567 2039311 2205635 2063808 2063143 2162811 2068834 2024896 2014116 2155728 2006505
18951B006505l12203J58932n3869J50437L66095o3170l55681l16469k10450j33894
$$ 2006505 1694302 1853234 1799365 1949802 2315897 2252727 1897046 1580577 1370127 1236233
18941A236233J50040M60361L51239p1171l15415l0341K32807J35525o747o6482
$$ 1236233 1386273 1846634 2197873 2126702 1811287 1780946 2013753 2149278 2142531 2076049
18931B076049R1543q775k10931o9619J47018N8769j39225k42598Q8548j17136
$$ 2076049 2167592 2158817 1947886 1878267 2025285 2084054 1944829 1702231 1790779 1673643
18921A673643j93266k6837K26593Q3966j01358L5000N0959j96164k32028j01388
$$ 1673643 1480377 1453540 1680133 1764099 1662741 1697741 1748700 1552536 1320508 1219120
18911A219120j9456j63987L63328J6366m1913K48776j5566j30374j06067O3723
$$ 1219120 1199664 1035677 1399005 1415371 1373458 1622234 1606668 1476294 1370227 1433950
18901A433950K05654R378o8797J19522K0631k16203q8001q7039p5192O5100R3809
$$ 1433950 1639604 1648982 1580185 1699707 1720338 1504135 1416134 1329095 1253903 1319003 1412812
18890A412812P3587j13853j38023J0882K11783L48894Q6108Q2440j4633p4743
$$ 1412812 1486399 1372546 1234523 1245405 1457188 1806082 1892190 1974630 1959997 1885254
18880A885254k73215j71995l2512O2058q6512r4627J39451K6980n7866q5559j23335
$$ 1885254 1612039 1440044 1407532 1469590 1383078 1288451 1427902 1454882 1397016 1311457 1188122
18869A188122R833J96559J84976k77645q148L34891O6868k05175J08104K5893
$$ 1188122 1197955 1394514 1579490 1301845 1293697 1628588 1695456 1490281 1598385 1624278
18859A624278l10652m7073k28854j11944J69596L92168j84011R6351J3561M5219
$$ 1624278 1313626 1266553 1037699 925755 1095351 1487519 1303508 1399859 1413420 1458639
18849A458639M1937j37720J514k15526r6952R7418L504J08663L68106N3066J41330
$$ 1458639 1500576 1362856 1364370 1148844 1051892 1149310 1152814 1261477 1629583 1682649 1823979
18838A823979Q890l5160k74820K1501L02555K88606J64308O7361n5488L2774k3776
$$ 1823979 1832869 1797709 1522889 1544390 1846945 2135551 2299859 2367220 2311732 2344506 2320730
18827B320730k68705m28887j5499j1788J6972J68192o8410K52697n0197J06073
$$ 2320730 2052025 1623138 1607639 1595851 1612823 1781015 1712605 1965302 1915105 2021178
18817B021178p7830j79899j17550r3420Q9802o1628m44934l72940J75978K60400
$$ 2021178 1943348 1763449 1645899 1552479 1642281 1580653 1135719 762779 938757 1199157
18807A199157J20718l9322L8821N9384J81327J01002p9107J9969j65289K80934
$$ 1199157 1319875 1280553 1319374 1378758 1560085 1661087 1581980 1601949 1436660 1717594
18797A717594M1738n8806j58763j34R6697l6823j5892K26342K20176l46897p2295
$$ 1717594 1759332 1700526 1541763 1541629 1638326 1601503 1585611 1811953 2032129 1685232 1612937
18786A612937K45289J94282N9251L9644K70929K39633K68125n1065J27709K20414
$$ 1612937 1858226 2052508 2111759 2151403 2422332 2661965 2930090 2879025 3006734 3227148
18776C227148o5139l68211j13288P8778J20636j09868J2256K29463J52174j36335
$$ 3227148 3162009 2793798 2680510 2759288 2879924 2770056 2782312 3011775 3163949 3027614
18766C027614n250n4577j19507j86072O8266l48834n26548N4634J03181q2977
$$ 3027614 3022364 2967787 2848280 2662208 2730474 2381640 1855092 1909726 2012907 1929930
18756A929930J2723R8031Q6203q844q4409K67506L11827k46646k06743j00742
$$ 1929930 1942653 2040684 2126887 2118043 2033634 2301140 2612967 2366321 2159578 2058836
18746B058836j8268O5098L5751J61331K85684k43278j77623J27317L25368J45998
$$ 2058836 2040568 2105666 2141417 2302748 2588432 2345154 2167531 2294848 2620216 2766214
18736B766214j39905K9025L17691K38223J25315k63447J81005L36608J73726K64386
$$ 2766214 2626309 2655334 2973025 3211248 3336563 3073116 3254121 3590729 3764455 4028841
18726D028841K05223R3380j47714r3297L64907K84042q5092k87409o075o6349
$$ 4028841 4234064 4327444 4179730 4086433 4451340 4735382 4650290 4362881 4356806 4290457
18716D290457O7739l45543l33958k16434k85037K1106O59065L4626p7508O1566
$$ 4290457 4358196 4012653 3678695 3462261 3177224 3198330 3857395 3892021 3814513 3876079
18706C876079q5833j35518j94338P4634M66919J45564J95723J3692N1720L58796
$$ 3876079 3790246 3654728 3460390 3535024 4001943 4147507 4343230 4356922 4408642 4767438
18696D767438m4009J76242J76590J53177p0984k63088k64318k65416q4983J39040
$$ 4767438 4723429 4899671 5076261 5229438 5158454 4895366 4631048 4365632 4280649 4419689
18686D419689M0566j05975K09279J63927P8855J87678p1650r8273n5434L2854
$$ 4419689 4460255 4354280 4563559 4727486 4806341 4994019 4922369 4824096 4768662 4801516
18676D801516J79772Q0757j89698n31847m29589p1928j34054J96435K38736M5565
$$ 4801516 4981288 5062045 4872347 4340500 3910911 3838983 3704929 3901364 4140100 4185665
18666D185665j5935l13081j62287k33576j14994k52K52883J24294j16778r6193
$$ 4185665 4169730 3856649 3694362 3460786 3345792 3345540 3598423 3722717 3605939 3509746
18656C509746j49847O2910J22535n8408j97220q2716K33371L60833m3742j90015
$$ 3509746 3359899 3422809 3545344 3486936 3289716 3207000 3440371 3801204 3757462 3567447
18646C567447k29558j10003q0552K40744J94709M00634J25438J91862k05683L25235
$$ 3567447 3337889 3227886 3147334 3388078 3582787 3983421 4108859 4300721 4095038 4420273
18636D420273Q2196j33660j0696L38675K48644J09536J37836m660J30377J28137
$$ 4420273 4502469 4368809 4358113 4696788 4945432 5054968 5192804 5188144 5318521 5446658
18626E446658J80598q4456o1909J04626J50272l8148J9934j8342K08971j06027
$$ 5446658 5627256 5542800 5480891 5585517 5735789 5697641 5717575 5699233 5908204 5802177
18616E802177j67965J67408m4021j69239R3203K0417M1970J09886k38756k47626
$$ 5802177 5634212 5801620 5757599 5588360 5681563 5701980 5743950 5853836 5615080 5367454
18606E367454M0773j60848O710m4709N6552m3647k38788k70929m0181l3871l30995
$$ 5367454 5408227 5247379 5254089 5209380 5265932 5222285 4983497 4712568 4672387 4638516 4307521
18595D307521K56581L84876r273Q0353o5847j99967k17813J01734K37071J89447
$$ 4307521 4564102 4948978 4939705 5020058 4954211 4754244 4536431 4638165 4875236 5064683
18585E064683K18945j49884K63322K74617K41356K02758M63043n0272p7349K23801
$$ 5064683 5283628 5133744 5397066 5671683 5913039 6115797 6578840 6528568 6451219 6675020
18575F675020p2985j07347N2970J52602J90371J78999l389k2300N11250L17246
$$ 6675020 6602035 6494688 6547658 6700260 6890631 7069630 7066241 7043941 7555191 7872437
18565G872437j07979l23802j49820k09770j37973L07493L93342J06100R4930K58381
$$ 7872437 7764458 7440656 7290836 7081066 6943093 7250586 7643928 7750028 7844958 8103339
18555H103339R3150l8652j25035K8954n1923j57503j08716J30547Q7721J14380
$$ 8103339 8196489 8157837 8032802 8061756 8009833 7852330 7743614 7874161 7961882 8076262
18545H076262k06032n8828q7610k7279N90403K00039k12386J78958K9503L8954
$$ 8076262 7870230 7811402 7723792 7696513 8286916 8486955 8274569 8453527 8483030 8521984
18535H521984L39660L69894J07335J298K15365J23456M84610J80399P2419M45956
$$ 8521984 8861644 9231538 9338873 9340171 9555536 9678992 10163602 10344001 10416420 10862376
18525A0862376K31810K05338j1426K09406K90055K90110L85369N70992N27134
$$ 10862376 11094186 11299524 11288098 11497504 11787559 12077669 12463038 13034030 13561164
18516A3561164N36687L87233K98713J15613j38533L46191M17568M07070M03696
$$ 13561164 14097851 14485084 14783797 14899410 14760877 15107068 15524636 15931706 16335402
18507A6335402l2710K16226M65054M70248M61119K81535K67570N46116j06973
$$ 16335402 16302692 16518918 16983972 17454220 17915339 18196874 18464444 19010560 18903587
18498A8903587J41856K56625M98571O68439L07723N78152K83665L25914L49709
$$ 18903587 19045443 19302068 19800639 20469078 20776801 21354953 21638618 21964532 22314241
18489B2314241M19187J67027J58456K18197K17703L35876K79391K36972M31366
$$ 22314241 22733428 22900455 23058911 23277108 23494811 23830687 24110078 24347050 24778416
18480B4778416L00603K44240M548j11676j1226L77088L09734k7709L16235J50020
$$ 24778416 25079019 25323259 25327807 25216131 25204905 25581993 25891727 25864018 26180253 26330273
18470B6330273j90209J2980L56436K08666K79871L42447J27876L9301J07246K31133
$$ 26330273 26140064 26153044 26509480 26718146 26998017 27340464 27468340 27507641 27614887 27846020
18460B7846020Q6003M66783L61634N5077J0307R7878M9268K94705L61288J22661
$$ 27846020 27932023 28398806 28760440 28815517 28825824 28923702 28972970 29267675 29628963 29751624
18450B9751624N16129L79516J72127J6336j3811P2044L67974L07855K24290K15747
$$ 29751624 30267753 30647269 30819396 30835732 30821921 30893965 31261939 31569794 31794084 32009831
18440C2009831M28509N41462K05812J53543K70786J58200J35603R3250J04025
$$ 32009831 32438340 32979802 33185614 33339157 33609943 33768143 33903746 33996996 34101021
18431C4101021P1694R107k26218l80107K6487N9478J6050R904k19887J09777J34032
$$ 34101021 34172715 34181822 33955604 33575497 33601984 33661462 33677512 33687416 33467529 33577306 33711338
18420C3711338l10096Q2084n6188n7937o6060K94256L49323O0481M31676J21394
$$ 33711338 33401242 33483326 33427138 33369201 33303141 33597397 33946720 34007201 34438877 34560271
18410C4560271K07272J97705J33416J61163J85300Q1381J63503M29034M26481
$$ 34560271 34767543 34965248 35098664 35259827 35445127 35526508 35690011 36119045 36545526
18401C6545526M90336L96350K86090J83027O82843O57891M42508M73107P17577
$$ 36545526 37035862 37432212 37718302 37901329 38584172 39242063 39684571 40157678 40875255
18392D0875255Q11118L41791N79219P44552M75846Q84799P65070K33236M17374
$$ 40875255 41686373 42028164 42607383 43351935 43827781 44712580 45477650 45710886 46128260
18383D6128260P95641Q47802R11969R24039R47305R91510Q47294R17141R53269
$$ 46128260 46923901 47771703 48683672 49607711 50555016 51546526 52393820 53310961 54264230
18374E4264230J013819N79348L80356P37222R57897R85639Q61953P23846Q65358
$$ 54264230 55278049 55857397 56237753 56974975 57932872 58918511 59780464 60504310 61369668
18365F1369668P45322O89169Q44351Q07372J040607P51319O16445R35696J200685
$$ 61369668 62114990 62804159 63648510 64455882 65496489 66247808 66864253 67799949 69000634
18356F9000634R18522P77863J005410J186718J225620P86818Q26318J479118J312077
$$ 69000634 69919156 70697019 71702429 72889147 74114767 74901585 75727903 77207021 78519098
18347G8519098R39888J021792J055461J121692R55852J056205J344213J372742
$$ 78519098 79458986 80480778 81536239 82657931 83613783 84669988 86014201 87386943
18339H7386943R98610J100410P55969O57141R37233R15871O11780Q47923P34175
$$ 87386943 88385553 89485963 90241932 90899073 91836306 92752177 93363957 94211880 94946055
18330I4946055M94536N16489N24387Q26739P17946P15679N68682M89287N67811
$$ 94946055 95440591 95957080 96481467 97308206 98026152 98741831 99310513 99799800 100367611
18321A00367611M04881N33613K72684O75262N88403K17510L09463Q55656M52082
$$ 100367611 100772492 101306105 101578789 102254051 102842454 103059964 103369427 104225083 104677165
18312A04677165L52965M91616J011140J230891O20167P49723R68178O79676P00484
$$ 104677165 105030130 105521746 106532886 107763777 108383944 109133667 110101845 110781521 111482005
18303A11482005P93053R14715Q95881J328717R95419P73990P86146J072785P12437
$$ 111482005 112275058 113189773 114085654 115414371 116409790 117183780 117969926 119042711 119755148
18294A19755148O56904M02529L87886O13493P72752P67707N00743N10490M56214
$$ 119755148 120412052 120814581 121202467 121815960 122588712 123356419 123857162 124367652 124823866
18285A24823866N72491Q45316P65826J116913J063179J243394J117618J163955
$$ 124823866 125396357 126241673 127007499 128124412 129187591 130430985 131548603 132712558
18277A32712558J280620J257145J190203J195412J427186J457442J306025R77357
$$ 132712558 133993178 135250323 136440526 137635938 139063124 140520566 141826591 142803948
18269A42803948J229628J138982R04074P82753M70852K64192M43279O84181P34788
$$ 142803948 144033576 145172558 146076632 146859385 147330237 147594429 148037708 148721889 149456677
18260A49456677Q71910J072032Q11338R13881J135987Q58618Q59611J154933J376234
$$ 149456677 150328587 151400619 152211957 153125838 154261825 155120443 155980054 157134987 158511221
18251A58511221J252841J282235J173579R91485R59319J087061J304099J099967
$$ 158511221 159764062 161046297 162219876 163211361 164170680 165257741 166561840 167661807
18243A67661807Q94079R76263R78819J212536J272367P06660O92622J087384J219464
$$ 167661807 168555886 169532149 170510968 171723504 172995871 173702531 174395153 175482537 176702001
18234A76702001R51500P54531Q83627J179376J084439J320033J345734J315848
$$ 176702001 177653501 178408032 179291659 180471035 181555474 182875507 184221241 185537089
18226A85537089J124174J101840J089757J354595J390451J195893J435795J566219
$$ 185537089 186661263 187763103 188852860 190207455 191597906 192793799 194229594 195795813
18218A95795813J490151J119039J394989R59734J270304J725903J408287J363597
$$ 195795813 197285964 198405003 199799992 200759726 202030030 203755933 205164220 206527817
18210B06527817J520075J280496J258579J385577J359815J337458J215892J193774
$$ 206527817 208047892 209328388 210586967 211972544 213332359 214669817 215885709 217079483
18202B17079483O65105J005075J524543R08295Q84295R63825N96338K37258N4092
$$ 217079483 217744588 218749663 220274206 221182501 222066796 223030621 223626959 223864217 223918309
18193B23918309L55785K73952J75051k49007m00103n64404n38043n71651q17544
$$ 223918309 224274094 224548046 224723097 224474090 224073987 223509583 222971540 222399889 221582345
18184B21582345j093038j044919q43344j048715j433332j326366j688952j640813
$$ 221582345 220489307 219444388 218601044 217552329 216118997 214792631 213103679 211462866
18176B11462866j580091j523542j637089j544221j547250j549110j207714j381923
$$ 211462866 209882775 208359233 206722144 205177923 203630673 202081563 200873849 199491926
18168A99491926j691930j319942j271916j635072j414729j183582j521229j360674
$$ 199491926 197799996 196480054 195208138 193573066 192158337 190974755 189453526 188092852
18160A88092852j087549q44322o47890q74983j161411j167633o94248o92532r97757
$$ 188092852 187005303 186160981 185513091 184638108 183476697 182309064 181614816 180922284 179924527
18151A79924527j182164r37461q93769q46926j093396j073064j163115j036625
$$ 179924527 178742363 177804902 176911133 176064207 174970811 173897747 172734632 171698007
18143A71698007p47244q33401r66381j234716j037750j098289r78914q14809q63605
$$ 171698007 170950763 170117362 169150981 167916265 166878515 165780226 164801312 163986503 163122898
18134A63122898q93588p45843q12727p52445l65957q3448J11296M73862J017620
$$ 163122898 162229310 161483467 160670740 159918295 159552338 159468890 159580186 160054048 161071668
18125A61071668K030413L644207O235467J0125347J3830151J6376962J5968941
$$ 161071668 163102081 166746288 172981755 183107102 196937253 213314215 229283156
18118B29283156J2816633Q966780N633944M533389Q313015J5759696K5121961
$$ 229283156 242099789 251066569 256700513 261233902 269546917 285306613 310428574
18111C10428574K7217177J8098015r428729m2950373l8343557k7512222j9897750
$$ 310428574 337645751 355743766 346315037 303364664 265021107 237508885 217611135
18104B17611135j4281594j0467126q189022o474549n302773m657923l662094l287678
$$ 217611135 203329541 192862415 184673393 178198844 172896071 168238148 164576054 161288376
18096A61288376l078831k787959k558849k833733k376017k084040k029430k104280
$$ 161288376 158209545 155421586 152862737 150029004 147652987 145568947 143539517 141435237
18088A41435237j703975j857666j797532j714192j569338j749836j564416j478509
$$ 141435237 139731262 137873596 136076064 134361872 132792534 131042698 129478282 127999773
18080A27999773j214964j259792j563485j071277j181701j085629j395625j170708
$$ 127999773 126784809 125525017 123961532 122890255 121708554 120622925 119227300 118056592
18072A18056592j347284j098826o21168p95263o12211p99074q57205q13825j023128
$$ 118056592 116709308 115610482 114989314 114194051 113581840 112782766 111925561 111111736 110088608
18063A10088608j406776p45445o20492j085936r82586r40671j289914j164305
$$ 110088608 108681832 107936387 107315895 106229959 105247373 104306702 103016788 101852483
18055A01852483q91117j232569j006634j263564j217991j077806j422170j077394
$$ 101852483 100961366 99728797 98722163 97458599 96240608 95162802 93740632 92663238
18047I2663238j271297j107919j135583j177095j151409j010958p22276r23263
$$ 92663238 91391941 90284022 89148439 87971344 86819935 85808977 85086701 84163438
18039H4163438o30139r69909j044522j103407o98209p30878n54319l70932n60177
$$ 84163438 83533299 82563390 81518868 80415461 79717252 78986374 78432055 78061123 77500946
18030G7500946n59997n55442o56521p26616p18250n18008n21835l65620j32365
$$ 77500946 76940949 76385507 75728986 75002370 74284120 73766112 73244277 72878657 72746292
18021G2746292m12005j55072j65323n01784o56271m04692k31571l99055p53883
$$ 72746292 72334287 72179215 72013892 71512108 70855837 70451145 70219574 69820519 69066636
18012F9066636j86627k79437n86654m02525n78209l66108l61242o61873p18544
$$ 69066636 68880009 68600572 68013918 67611393 67033184 66667076 66305834 65643961 64925417
18003F4925417n75611n64285q57613q41419o36643o04923m61209m12464o31129
$$ 64925417 64349806 63785521 62927908 62086489 61449846 60844923 60383714 59971250 59340121
17994E9340121o92213o71939p01383o82657m26471k67083m25356n34056n32136
$$ 59340121 58647908 57975969 57274586 56591929 56165458 55898375 55473019 54938963 54406827
17985E4406827l22375n56778l67396m39427o13342m68653j57259k19813l32806
$$ 54406827 54084452 53527674 53160278 52720851 52107509 51638856 51481597 51261784 50928978
17976E0928978l49544m90095l00382j77744j42134j41208P554l51835m53908m7791
$$ 50928978 50579434 50089339 49788957 49611213 49469079 49327871 49335425 48983590 48529682 48481891
17966D8481891M265K29828K22156Q4230k65872K12034M34323O61186N80576J081712
$$ 48481891 48486156 48715984 48938140 49022370 48756498 48968532 49402855 50064041 50644617 51726329
17956E1726329J021792J349019J956113K076879K623636L212204L603681M170482
$$ 51726329 52748121 54097140 56053253 58130132 60753768 63965972 67569653 71740135
17948G1740135M874421N332795N582195O149858O184327O140497O431665O604445
$$ 71740135 76614556 81947351 87529546 93679404 99863731 106004228 112435893 119040338
17940A19040338O558004O030335N695165M862805L775137K793268J808107M35747
$$ 119040338 125598342 131628677 137323842 142186647 145961784 148755052 150563159 150998906
17932A50998906j00407j266230k234479k873702l516916m717008n456202n798775
$$ 150998906 150898499 149632269 147397790 144524088 141007172 136290164 130833962 125035187
17924A25035187o103775o334014o236230n984843n816145n430607m944671m256729
$$ 125035187 118931412 112597398 106361168 100376325 94560180 89129573 84184902 79928173
17916G9928173l994710l313797k503980j855231j458396j065862k41357L84086
$$ 79928173 75933463 72619666 70115686 68260455 66802059 65736197 65494840 65878926
17908F5878926J099876J706714K008229K978239L782042M835489N578638O457510
$$ 65878926 66978802 68685516 70693745 73671984 77454026 82289515 87868153 94325663
17900I4325663P291586Q553734Q980732R004408Q916706R350554R532897R543980
$$ 94325663 101617249 110170983 119151715 128156123 137072829 146423383 155956280 165500260
17892A65500260Q972692Q061669O765029N114497L163627J801734k58547j393589
$$ 165500260 174472952 182534621 189299650 194414147 197577774 199379508 199120961 197727372
17884A97727372k876582m294534n460152o442567p759304q710988r237740r731237
$$ 197727372 194850790 190556256 185096104 178653537 170894233 162183245 152945505 143214268
17876A43214268r797230r554338r342799r157569q419363p679359p208751o154253
$$ 143214268 133417038 123862700 114519901 105362332 96942969 89263610 82054859 75900606
17868G5900606n205939m881423m665009l975724l591121k894645k516391k577587
$$ 75900606 70694667 65813244 61148235 57172511 53581390 50686745 48170354 45592767
17860D5592767k083634j873106k133479j447534j322786j449049j552950j375577
$$ 45592767 43509133 41636027 39502548 38055014 36732228 35283179 33730229 32354652
17852C2354652j065520j135295j193709r71196q40847p16733o75983p39974n90659
$$ 32354652 31289132 30153837 28960128 27988932 27148085 26431352 25755369 25015395 24424736
17843B4424736n73374n09709r00469l77305k22359p26855r26670m76915m44830
$$ 24424736 23851362 23341653 22441184 22063879 21841520 21114665 20187995 19711080 19266250
17834A9266250k97265m57878n60218n53694n18967k16954j18939r8532n51429
$$ 19266250 18968985 18511107 17950889 17397195 16878228 16661274 16542335 16443803 15892374
17825A5892374l41989n00167l24159q3990l03525m93927j40316r7110r4382o8521
$$ 15892374 15550385 15050218 14726059 14642069 14338544 13844617 13704301 13607191 13512809 13444288
17815A3444288m20386n80046N4115K1554k90244j08290j9323k45080k07300k34299
$$ 13444288 13023902 12443856 12497971 12519525 12229281 12120991 12101668 11856588 11649288 11414989
17805A1414989k49679P3349r1192k78264j32658j39091k46412K4916J7157J88188
$$ 11414989 11165310 11238659 11147467 10869203 10736545 10597454 10351042 10375958 10393115 10581303
17795A0581303M74943J27772l5946j38401j66578j3255j05345k41549k72025j12667
$$ 10581303 11056246 11184018 11148072 11009671 10843093 10829838 10724493 10482944 10210919 10098252
17785A0098252j54702k58683l39367j09844K0655P7231q2917j89048l2393J42052
$$ 10098252 9943550 9684867 9345500 9235656 9256311 9333542 9250625 9061577 9029184 9171236
17775I171236j37357M3102r3967r4136L88195R9234L1847J1934J17358M338j6033
$$ 9171236 9033879 9076981 8983014 8888878 9277073 9376307 9408154 9420088 9537446 9541784 9525751
17764I525751J97107J18512q7702J44132L84873M70266K18987K84170K92921K62534
$$ 9525751 9722858 9841370 9753668 9897800 10282673 10752939 10971926 11256096 11549017 11811551
17754A1811551L21585K98632L46035N96571M93193P47665N28691M34311P77959
$$ 11811551 12133136 12431768 12777803 13374374 13867567 14615232 15143923 15578234 16356193
17745A6356193O81756J134567J717551J663146J658088J652996J976081K245843
$$ 16356193 17037949 18172516 19890067 21553213 23211301 24864297 26840378 29086221
17737B9086221K725373K690164L061787L626184L860676L823626M266949M872607
$$ 29086221 31811594 34501758 37563545 41189729 45050405 48874031 53140980 58013587
17729E8013587M879920M762241N158276M951997M155880L645790L231705K467221
$$ 58013587 62893507 67655748 72814024 77766021 81921901 85567691 88799396 91266617
17721I1266617J877507J000213L19521o26965r93798j624418k468899l175095
$$ 91266617 93144124 94144337 94463858 93836893 92843095 91218677 88749778 85574683
17713H5574683l428013l744462m006698l591199l610332l439513l349487k936716
$$ 85574683 82146670 78402208 74395510 70804311 67193979 63754466 60404979 57468263
17705E7468263k432300k154802j951517j694089j077175q02527q59425l81486
$$ 57468263 55035963 52881161 50929644 49235555 48158380 47355853 46496428 46114942
17697D6114942J12092J44518Q04588J135242J421746J791322K022459K821042
$$ 46114942 46227034 46371552 47176140 48311382 49733128 51524450 53546909 56367951
17689E6367951L498264L533882M001879M735365N087399N476729N435197N634621
$$ 56367951 59866215 63400097 67401976 72137341 77224740 82701469 88136666 93771287
17681I3771287N859929O083229O171753N839261M929789M010942L144794J618827
$$ 93771287 99631216 105714445 111886198 117725459 122655248 126666190 129810984 131429811
17673A31429811P04351j61568j368760k747653l649862m338572m515194n137373
$$ 131429811 132134162 131972594 130603834 127856181 124206319 119867747 115352553 110215180
17665A10215180n673168o323093o209691n675586n131839n018643m704761m436208
$$ 110215180 104542012 98218919 92009228 86333642 81201803 76183160 71478399 67042191
17657F7042191l781933l429825l215443k347895k361498k139814j651066j565149
$$ 67042191 63260258 59830433 56614990 54267095 51905597 49765783 48114717 46549568
17649D6549568j422742j271690j081283p04088m95466k56593m7863L81268M46292
$$ 46549568 45126826 43855136 42773853 42069765 41574299 41317706 41269843 41651111 42097403
17640D2097403M72685R84621J285421J524391J617892J641520J409231J687993
$$ 42097403 42570088 43554709 44840130 46364521 47982413 49623933 51033164 52721157
17632E2721157J697308J803453J295231Q54386N60559J23671J64839l70424j183276
$$ 52721157 54418465 56221918 57517149 58371535 58932094 59055765 59220604 58850180 57666904
17623E7666904j350106j540263j724146j753690k073241k316780k798282k655441
$$ 57666904 56316798 54776535 53052389 51298699 49225458 46908678 44110396 41454955
17615D1454955k441701k326724k056235j784446j844152j656405j720730j591899
$$ 41454955 39013254 36686530 34630295 32845849 31001697 29345292 27624562 26032663
17607B6032663j347490j178598j001325j042729q97620j010989p98357q23603
$$ 26032663 24685173 23506575 22505250 21462521 20564901 19553912 18755555 17931952
17599A7931952n68888l86529n06267p93493p21990m51163q4569l34667m61400
$$ 17931952 17363064 16976535 16470268 15676775 14954785 14503622 14419053 14084386 13622986
17590A3622986q20652l63585k81640k60391j97225m75009m62511k28044p7366
$$ 13622986 12802334 12438749 12157109 11896718 11699493 11224484 10761973 10533929 10456563
17581A0456563k62843r4250l65835l14136j94433j77333l85532j67668k02989
$$ 10456563 10193720 10099470 9733635 9419499 9225066 9047733 8662201 8494533 8291544
17572H291544L2574L7816l81869n30647k71572r9041N2111J68295k53807k33429
$$ 8291544 8324118 8361934 7980065 7449418 7177846 7078805 7130916 7299211 7045404 6811975
17562F811975n0135j61449j04496J28720O7646k877m1315j07177j87418k03375
$$ 6811975 6761840 6600391 6495895 6624615 6692261 6689384 6648069 6540892 6353474 6150099
17552F150099j13037n6200n6561k40991j84407K3529R1608l10913k72470k03566
$$ 6150099 6037062 5980862 5924301 5683310 5498903 5522432 5614040 5303127 5030657 4827091
17542D827091n3873j70051l6791j37751m6999K94967q0582k36663l48808J00103
$$ 4827091 4773218 4603167 4566376 4428625 4381626 4676593 4596011 4359348 4010540 4110643
17532D110643K05656j4747j9933J27903j45677j08205l62383n614P2926L09732
$$ 4110643 4316299 4301552 4281619 4409522 4263845 4155640 3793257 3787643 3860569 4170301
17522D170301K0430n7343j83957j59526J3665l23376r59M20165l9937k8924m7625
$$ 4170301 4190731 4133388 3949431 3789905 3803570 3480194 3479235 3899400 3859463 3830539 3782914
17511C782914n5147k4021J55249O6137j46172j79790J53614K01163j36717l01113
$$ 3782914 3727767 3703746 3858995 3925132 3778960 3599170 3752784 3953947 3817230 3516117
17501C516117L7964J19418p4239K7871O1348j36566k62478k25019L71l4892j65733
$$ 3516117 3554081 3673499 3599260 3627131 3688479 3551913 3289435 3064416 3064787 3029895 2864162
17490B864162k22172j8847K33471J82089p6924j91539q2700J20878M6774j28771
$$ 2864162 2641990 2623143 2856614 3038703 2961779 2770240 2687540 2808418 2855192 2726421
17480B726421P0826O7033k74764Q512l7512J38852J04993o316J38533M1519J77562
$$ 2726421 2797247 2864280 2589516 2598028 2560516 2699368 2804361 2798045 2936578 2978097 3155659
17469C155659n8962m308r8063l63137r9357K2245P7648J9353J35257K7357k1618
$$ 3155659 3096697 3092389 2994326 2631189 2531832 2554077 2631725 2651078 2786335 2813692 2792074
17458B792074r0931K33394j53301j04642K7874J15692K37253K270m3533L16927
$$ 2792074 2701143 2934537 2781236 2676594 2704468 2820160 3057413 3059683 3016150 3333077
17448C333077K22835Q6563j59493l61574K56477L53605l97362l76916J7218O5415
$$ 3333077 3555912 3642475 3482982 3121408 3377885 3731490 3334128 2957212 2974430 3039845
17438C039845r9900K01471J68305j91084l80084k6956N0316k78081m3921L42817
$$ 3039845 2939945 3141416 3309721 3118637 2738553 2711597 2761913 2483832 2439911 2782728
17428B782728P3515j38577J47678l681l747k230j03336j78268o2378P8906J9951
$$ 2782728 2856243 2717666 2865344 2861663 2857916 2855686 2752350 2574082 2511704 2590610 2610561
17417B610561j8929K0950N7626K73049j09472r0045k36073k26020K56947P5468
$$ 2610561 2591632 2612582 2670208 2943257 2833785 2743740 2507667 2281647 2538594 2614062
17407B614062k09189j58063j57156M166r7783j02910j18531j11284k22339k79874
$$ 2614062 2404873 2246810 2089654 2093820 1996037 1893127 1774596 1663312 1440973 1161099
17397A161099J87887K08079J25535K01917p7576J47756J7596j26580J63072R6801
$$ 1161099 1348986 1557065 1682600 1884517 1806941 1954697 1972293 1845713 2008785 2105586
17387B105586J13338O2243j53788L2451K51050j09488j89870r7295k62987J66927
$$ 2105586 2218924 2281167 2127379 2159830 2410880 2301392 2111522 2014227 1751240 1918167
17377A918167M70847j30122j09909K75154R0505m17347l04679j70509k2710Q1657
$$ 1918167 2389014 2258892 2148983 2424137 2514642 2097295 1792616 1622107 1599397 1681054
17367A681054K45315J81986j17859j02977j50804k43546l9873M1184J18766r3755
$$ 1681054 1926369 2108355 1990496 1887519 1736715 1493169 1453296 1494480 1613246 1519491
17357A519491j91687J63304r9085j44306K06069M80054R2682j32466j76619k42748
$$ 1519491 1327804 1491108 1392023 1247717 1453786 1933840 2026522 1894056 1717437 1474689
17347A474689j91379Q3525j34050j09709K15131L06617J00895j52850k53167l0535
$$ 1474689 1283310 1366835 1232785 1123076 1338207 1644824 1745719 1592869 1339702 1309167
17337A309167J5975j66862m9804m2910L27177K79897L54366k06184j88064j82985
$$ 1309167 1325142 1158280 1108476 1065566 1392743 1672640 2027006 1820822 1632758 1449773
17327A449773n0295j66263n6844R4916k02649l8578L55194K05802q8594j20359
$$ 1449773 1399478 1233215 1176371 1271287 1068638 1030060 1385254 1591056 1502462 1382103
17317A382103k36721J03963J2167R5260P8090R5729K7464j04442K48952j44896
$$ 1382103 1145382 1249345 1261512 1356772 1434862 1530591 1558055 1453613 1702565 1557669
17307A557669k82506K4124o6849j32425k1813J40834K22450l1066j91933M0031
$$ 1557669 1275163 1299287 1232438 1100013 1078200 1219034 1441484 1410418 1218485 1258516
17297A258516j87607J12312L8550Q5373j86702J39036K4128j21090P9844J16277
$$ 1258516 1070909 1183221 1221771 1307144 1120442 1259478 1283606 1162516 1242360 1358637
17287A358637J13623J89862M0118J21832j6739l42914m12231O2075R2286J4487
$$ 1358637 1472260 1662122 1702240 1824072 1807333 1464419 1052188 1114263 1206549 1221036
17277A221036r1358n1732n8921M24154j33239l99159J48418J64199j31016P8043
$$ 1221036 1129678 1077946 1019025 1443179 1309940 910781 1059199 1223398 1092382 1170425
17267A170425k7964R827J63549R6423j13518k25905l38355L4371K67049O6925
$$ 1170425 1142461 1152288 1315837 1412260 1298742 1072837 734482 768853 1035902 1102827
17257A102827k03923Q5383j1735R4979j06830m55813J38266J63628R1615L20707
$$ 1102827 898904 984287 972552 1067531 960701 504888 643154 806782 898397 1219104
17247A219104o1252L13563J84093k10740k85534N3949J68267k9J00043j85525
$$ 1219104 1157852 1471415 1655508 1444768 1159234 1213183 1381450 1381421 1481464 1295939
17237A295939k30446J89680K34172O3520J77540j63542m88758j22138o5128J7513
$$ 1295939 1065493 1255173 1489345 1552865 1730405 1566863 1078105 955967 890839 908352
17227I08352J7980L4774P2663J21504K29098j46320j96618L3099j29405o7292
$$ 908352 926332 961106 1033769 1155273 1384371 1238051 1041433 1074532 945127 877835
17217H77835M05130j8320j16576M9577j79415J6117J17133o1602k3367Q2979L71049
$$ 877835 1282965 1264645 1148069 1197646 1018231 1034348 1151481 1089879 1066512 1149491 1520540
17206A520540p2529l21847M6818J47414j49423k08938J6784j11126k24560M04865
$$ 1520540 1448011 1126164 1172982 1320396 1170973 962035 978819 867693 643133 1047998
17196A047998L18133P047K20040j11523m53329l00581k38318q3501R2091L77004
$$ 1047998 1366131 1373178 1593218 1481695 1028366 727785 489467 405966 498057 875061
17186H75061L72649j17430K1105J72427j32275j84344l2784o7025O83428P8328
$$ 875061 1247710 1130280 1151385 1323812 1191537 1007193 974409 907384 1590812 1669140
17176A669140l64757m43537j81636J09452J05535p2461J94810L10132Q2065o9894
$$ 1669140 1304383 860846 679210 788662 894197 821736 1016546 1326678 1408743 1338849
17166A338849N8602n597m2993p371r4142Q2821L1825m5944N5187K9958J02714
$$ 1338849 1397451 1391854 1348861 1341490 1247348 1330169 1361994 1316050 1371237 1401195 1503909
17155A503909M1131j64821k6997K09317O0927j49439j46266Q1030k38960j60918
$$ 1503909 1545040 1380219 1353222 1562539 1623466 1474027 1327761 1408791 1169831 1008913
17145A008913N9526l8080L6029K66871r9165l54654R2273m3263j53672J51509
$$ 1008913 1068439 1030359 1066388 1333259 1234094 879440 971713 928450 774778 926287
17135I26287Q0011K434R82o4349M1037R7208j24168j50558j24037m7413J58930
$$ 926287 1006298 1008732 1009714 945365 986402 1083610 959442 808884 684847 637434 796364
17124G96364K89732L66974P9711k07711p8668j50896O0472J97798J82572J48670
$$ 796364 1086096 1453070 1532781 1325070 1246402 1095506 1155978 1353776 1536348 1685018
17114A685018j07703k33197k99620J4421l10489l24863R4213J98106Q7048M2532
$$ 1685018 1577315 1344118 1044498 1058919 748430 423567 517780 715886 802934 845466
17104H45466R0813O8989J6384j33049j6351J058J6202m7551q7217k27961J17068
$$ 845466 936279 1005268 1021652 888603 872252 873310 889512 841961 754744 526783 643851
17093F43851L66581K00389K05907Q8532o4609k77391M0865O94519L70013R7478
$$ 643851 1010432 1210821 1416728 1505260 1440651 1163260 1204125 1898644 2268657 2366135
17083B366135K07439q7046j00112J74692M0045m3651J11974N1490k24070k98585
$$ 2366135 2573574 2486528 2386416 2561108 2601153 2557502 2669476 2720966 2496896 2198311
17073B198311k16088j28781j85815k92411J21191J11026J55699L27169M471J02635
$$ 2198311 1982223 1853442 1667627 1375216 1496407 1607433 1763132 2090301 2094772 2197407
17063B197407J3512k20708L11048K24287J7341P094O4072J74213J22619m11287
$$ 2197407 2210919 1990211 2301259 2525546 2542887 2549981 2614053 2788266 2910885 2499598
17053B499598p17k40856m74553j30611j96800Q2141K73898k60k18930j78021k9034
$$ 2499598 2498881 2258025 1783472 1652861 1456061 1538202 1812100 1811840 1592910 1414889 1385855
17042A385855K0155j12695j34299j71231l12206m34071J14558L88825J68614o7734
$$ 1385855 1406010 1293315 1159016 987785 675579 241508 356066 744891 913505 845771
17032H45771n4508k00794m8632k7771K41280J27845l8060J36399N2161k33244
$$ 845771 791263 590469 541837 514066 755346 883191 845131 981530 1033691 800447
17022H00447j54906J63090L0883m276k35568J4123l9790j15465N7043k42704j60141
$$ 800447 645541 808631 839514 835238 599670 613793 574003 458538 515581 272877 112736
17011A12736K33709n1369l372J51729J71991j78147j61802J82677J48042K8422
$$ 112736 346445 295076 291704 443433 615424 437277 275475 458152 606194 634616
17001F34616L2387j42787r9621m7473k0996n5552j08433P1489N7662k66948K07298
$$ 634616 667003 524216 424595 377122 356126 300574 192141 263630 321292 54344 261642
16990B61642K26480k42047j14389k2183L24950N3086O7803J5574j25183J27129
$$ 261642 488122 246075 131686 109503 434453 487539 555342 570916 445733 572862
16980E72862n8265J5411j7035J10077j70331l506J65339j00447J2628k52640K92739
$$ 572862 514597 530008 512973 623050 452719 449213 614552 514105 526733 274093 566832
16969E66832K08442j2743l72839J763O7916M91J90925J05178M4906p7617j60453
$$ 566832 775274 762531 389692 391455 459371 459862 650787 755965 800871 723254 562801
16958E62801k20496l55539j23395M14112K02318J55554j26796m8838N9505j53192
$$ 562801 342305 -13234 -136629 277483 479801 635355 508559 459721 519226 366034
16948C66034J32004k5203m7573j07871j9160q5712Q8569J91870J99246K05406
$$ 366034 498038 472835 425262 317391 298231 212519 301088 492958 692204 897610
16938H97610k06317q2651K56145j55575j58825k01604j42156N2128O7290Q9129
$$ 897610 691293 608642 864787 709212 550387 348783 206627 258755 326045 415174
16928D15174l4450j48645K34825M14241J42726k57061k06381j15624K17005J54605
$$ 415174 380724 232079 466904 881145 1023871 766810 560429 444805 661810 816415
16918H16415j35765j23054j44390k58200k33054K15163J07619J52058k16193K50855
$$ 816415 680650 557596 413206 155006 -78048 137115 244734 396792 180599 431454
16908D31454K1582K44763j49853l12136k22148K9029L1106K20707K04073K23818
$$ 431454 453036 697799 547946 235810 13662 42691 73797 294504 498577 722395
16898G22395j49986O0832j25729l57185P942J70242M2733J60799R8559k58585
$$ 722395 572409 633241 507512 150327 158269 328511 371244 532043 630602 372017
16888C72017K6991L08675p7047o3728k14330k06243p0855J51491O7654J88301
$$ 372017 399008 707683 630636 566908 352578 146335 75480 226971 294625 482926
16878D82926K35408k2063p7572k42613j08183p4324J7852J35238P9975j24154
$$ 482926 718334 696271 618699 376086 267903 193579 211431 346669 426644 302490
16868C02490j64296K15623K91421L084o0566l66376K96449K30623M9166L811o798
$$ 302490 138194 353817 645238 648322 587756 221380 517829 748452 797618 801429 794631
16857G94631M1786r1838l12636o86r794j71749K26014L622k76786j66392k79664
$$ 794631 836417 744579 431943 431257 421463 249714 475728 479350 202564 36172 -243492
16846b43492j88580K7953M19577L94787n2535K6768N2748J2278l8667m1512j62362
$$ -243492 -432072 -404119 15458 410245 357710 384478 437226 449504 410837 369325 206963
16835B06963j47991M2029m43j28897K97934J39608M02400R196l01143j16302J27522
$$ 206963 58972 101001 100558 -28339 269595 409203 811603 820799 519656 403354 530876
16824E30876q0611r6952N9142j10246j98672K481j24098J35844J82080J33659
$$ 530876 450265 353313 412455 302209 103537 106018 -18080 117764 299844 433503
16814D33503J08743p4342r3336q4255K6419j47827P7758O6836p0959K3317j5865
$$ 433503 542246 467904 374568 290313 316732 168905 246663 313499 242540 265857 249992
16803B49992M7799q8568r935j95117k8328Q2661J99552K15078j34743n0483Q2392
$$ 249992 297791 209223 199288 4171 -24157 58504 258056 473134 338391 287908 370300
16792C70300K21049P8853j47035J21816J19690k59328r6095j30101r4872n5360
$$ 370300 591349 670202 523167 644983 764673 505345 409250 279149 184277 128917
16782A28917K53828J25793o8865O0337p1805L5680q1689R1039k00985q6856J07168
$$ 128917 382745 508538 439673 500010 428205 463885 382196 473235 272250 185394 292562
16771B92562L18481K88977K8519k65k05800l52928k43720L7648n6762r545J85261
$$ 292562 611043 900020 928539 928274 722474 369546 125826 163474 106712 97167 282428
16760B82428K1824P8586r120k73510j01831j57489l771J95119J74367J14001k4735
$$ 282428 304252 382838 373718 100208 -1623 -159112 -162883 32236 206603 320604 295869
16749B95869j75273R7098r1207K19837K58479k42465q4354K85427K12586o4347
$$ 295869 120596 217694 126487 346324 604803 362338 277984 563411 775997 711650
16739G11650l02669n201k3464L3878j52591J228J24607k49976J15454M47152j78011
$$ 711650 408981 403780 380316 414194 261603 262831 387438 137462 252916 700068 522057
16728E22057j98643j60750r0182J59225K38463n8923l20692j80017l20861K1983
$$ 522057 323414 162664 72482 231707 470170 411247 90555 -89462 -410323 -388340
16718c88340L01480K83625j77396o0757j40449J89646J7152J00910M9343m0009
$$ -388340 -86860 196765 19369 -41388 -181837 7809 24961 125871 175214 135205
16708A35205l3911N1610K01914L02322n1911j56227n7747j61424k41550k49703
$$ 135205 101294 152904 354818 657140 605229 449002 391255 229831 -11719 -261422
16698b61422k11699J00590L37117K78634M35440K08385l03364k52937j21417m7977
$$ -261422 -473121 -372531 -35414 243220 678660 887045 583681 330744 209327 161350
16688A61350J08951o3804m8822K16646p4527j16644j98113J53742J23326j51820
$$ 161350 270301 206497 157675 374321 299794 183150 -14963 138779 262105 110285
16678A10285j52138L6270J75220n8102n4342m5213j2942O7760k8406k67297m29947
$$ 110285 -41853 -5583 169637 111535 57193 11980 -962 66798 38392 -228905 -658852
16667f58852L25389K94716M3911K0195n4063k42138p437K17858M3449L64083J09787
$$ -658852 -333463 -38747 5164 25359 -28704 -270842 -278279 -60421 -16972 347111 456898
16656D56898K54994k58922l35056k07412J47003k6249K52359K09035K8647j45101
$$ 456898 711892 452970 117914 -89498 57505 31256 283615 492650 521297 376196
16646C76196m0746P4859O632n4568k82001L8088P5111l5720J71520m1461k59977
$$ 376196 335450 410309 416941 362373 80372 118460 193571 157851 329371 287910 27933
16635B7933M3626L983Q5279J67442p782R0959N18j66851j71623K8450Q7731k8536
$$ 27933 71559 75542 160821 328263 320481 411440 411958 245107 73484 101934 189665 161129
16623A61129K62466N5393k5372n0438p2816J5329M25617K23216k94496l59626
$$ 161129 423595 478988 453616 403178 330362 345691 771308 994524 700028 340402
16613C40402k41471j29634J72638P2907O8346j42544o8793J45540j67845p6470
$$ 340402 98931 -30703 141935 214842 283188 140644 71851 217391 49546 -26924
16603b6924J04645J38194j20096j48985J147M2334l29749J66012K52927k27722
$$ -26924 77721 215915 95819 -53166 -52019 -9685 -339434 -173422 79505 -148217
16593a48217N7448K52349Q8261J75301J24928N7537L0207j02443J58994j43532
$$ -148217 -90769 161580 249841 425142 550070 607607 637814 535371 694365 550833
16583E50833o9575j17512m20084J4515P57J67248K25325k03271j63066P4881J01932
$$ 550833 481258 363746 -56338 -41823 -41066 126182 351507 148236 -14830 60051 161983
16572A61983m302o6126o6470k41523o803M15629n6340j95523j82699L0753J83445
$$ 161983 157681 91555 25085 -216438 -223241 192388 136048 -59475 -242174 -211421 -27976
16561b7976J77254O3542K07700j43666k32973p9302k33286j20605O1605M6859
$$ -27976 149278 212820 420520 276854 43881 -35421 -268707 -389312 -327707 -280848
16551b80848o2049R1236M8257K73845Q6159P9836l40715J09867J53804m3519J4939
$$ -280848 -342897 -251661 -203404 70441 156600 236436 -104279 5588 159392 115873 130812
16540A30812K80517P5854j09174j35953j41592j10202O8390R5708l2961j28039
$$ 130812 411329 487183 378009 242056 100464 -9738 58652 154360 121399 -6640
16530f640k93180M6122K27057j07963N0454J74437Q281p9337O675J18872Q1531
$$ -6640 -299820 -253698 -26641 -134604 -84150 90287 98568 19231 25906 144778 226309
16519B26309J05035J26771k42654j07184J72100K69059m5261j60377k06041j75721
$$ 226309 331344 458115 215461 108277 280377 549436 504175 343798 137757 -37964
16509c7964m0295L43184J15172j95620R2216k76847j8989L30978n7106J25051
$$ -37964 -78259 264925 380097 184477 276693 -154 -19143 311835 254729 379780
16499C79780J47575q7518k23520O7842p6910j14746p0800j11328o8715P9732j76081
$$ 379780 527355 439837 216317 284159 207249 92503 21703 -89625 -158340 -78608 -254689
16488b54689J00539R1145l1440M8505j50430k987J95080l6465L3592j77714n7171
$$ -254689 -154150 -63005 -94445 -45940 -196370 -199357 -4277 -40742 -7150 -184864 -242035
16477b42035L93243J23560j56439N7607l1704m7524n1374J00968J99228Q7925
$$ -242035 151208 274768 118329 175936 144232 96708 45334 146302 345530 433455
16467D33455l6714k66583j42256M9663N2764l9210l34564m8401P0457O698J03519
$$ 433455 396741 130158 -12098 37565 90329 51119 -283445 -331846 -261389 -254691 -151172
16456a51172P5334J05548O8943M7565k03766L6812P9454L9317j14954m7316J12564
$$ -151172 -75838 29710 98653 146218 -57548 -20736 58718 98035 -16919 -64235 48329
16445D8329K84223k93627j66844L06062j08016O7276K94242j87345k88284K5532
$$ 48329 332552 38925 -127919 178143 70127 137403 431645 244300 -43984 -18452
16435a8452Q1109K73318r0600J95330o8307k94612k56189r8605J85250L7710r1316
$$ -18452 62657 335975 245375 440705 372398 77786 -178403 -277008 -91758 -54048 -145364
16424a45364J28281l4773k4552k82435J81773K69784m3483l6030Q0967M4218J45940
$$ -145364 -17083 -51856 -76408 -358843 -177070 92714 49231 13201 94168 138386 284326
16413B84326n2474k19864j16203m3503J15974J53993M19653K08831j054k27312
$$ 284326 231852 11988 -104215 -147718 -31744 122249 541902 750733 749679 522367
16403E22367l54490n58195K06351J15279l38318n9126K66937R3014J74341Q5117
$$ 522367 167877 -390318 -183967 -68688 -407006 -466132 -199195 -106181 68160 153277
16393A53277l5302j19495j13772K31668j4578J53765J11885L9122j60088k74709
$$ 153277 117975 -1520 -115292 116376 101798 255563 367448 406570 246482 -28227
16383b8227m91789n6418J89172K22846K41777j0727l26313l31566J69247O4245
$$ -28227 -520016 -576434 -387262 -164416 77361 66634 -259679 -591245 -421998 -357753
16373c57753J56172K29894k5777q7701j0655M5119M66044L49229k27673n13799
$$ -357753 -201581 28313 2536 -85165 -95820 -50701 415343 764572 536899 23100
16363B3100j17406J06140K9000O649k19863K8997j25081j1928k53429j067k5732
$$ 23100 -94306 11834 40834 47483 -172380 -143383 -268464 -280392 -533821 -534888 -560620
16352e60620K00083K20293j22883j8017K26770m7882j35599k30269K14597K04176
$$ -560620 -360537 -140244 -263127 -281144 -54374 -102256 -237855 -468124 -253527 -49351
16342d9351O1185n2652k99049j43769q1359O6965J78335M40862J8933l16019O3999
$$ -49351 11834 -40818 -339867 -483636 -564995 -498030 -319695 121167 140100 -175919 -111920
16331a11920k4044r6054K3273P0792J04301j40398o9918J66133R1399J16683k58718
$$ -111920 -135964 -232018 -208745 -137953 -33652 -174050 -243968 -77835 13564 130247 -128471
16320a28471m8154J84879j0091l98625j40971K24974K48977K07795r5258R1344
$$ -128471 -176625 8254 -1837 -400462 -541433 -316459 -67482 140313 45055 136399
16310A36399r3003j19767q0873j21266q9276K02548j78570O5882j5946j8532O5807
$$ 136399 43396 -76371 -157244 -278510 -367786 -165238 -343808 -277926 -293872 -312404 -246597
16299b46597J16181K18943j44518j22145L56477J11716q1520j63252o6441q1083
$$ -246597 -130416 88527 -55991 -178136 178341 290057 208537 45285 -21156 -102239
16289a02239O9394P4291K71313j54727j2829P1884j57155j169J33971m4727m99836
$$ -102239 -32845 41446 312759 158032 145203 217087 59932 58763 192734 148007 -351829
16278c51829O6514n6479K29499J77349J33911j65909l62946m3835j6719K70667
$$ -351829 -285315 -341794 -112295 65054 198965 33056 -329890 -373725 -390444 -119777
16268a19777m7019n8775K1036J98403J40516N6860k24772p2945R0506j51803j8636
$$ -119777 -166796 -225571 -204535 -6132 134384 191244 -33528 -106473 -15967 -167770 -186406
16257a86406K27250J01422R7915j09354k87895p3892J48253j06997M2139q7603
$$ -186406 40844 142266 240181 130827 -157068 -230960 -82707 -189704 -147565 -235168
16247b35168K21486J06601l5536J75624O700k02550j72599p3397p2544J81493
$$ -235168 -13682 92919 57383 233007 239707 37157 -135442 -208839 -281383 -99890
16237i9890J88792O630j92142j19423K79839K12685m8332l9285j3407j65436R103
$$ -99890 88902 95532 -96610 -216033 63806 276491 228159 188874 175467 10031 19134
16226A9134r7886l31073Q3501J4747O1115J35625J74760J30056k13773j60857
$$ 19134 -78752 -409825 -326324 -311577 -250462 -114837 59923 189979 -23794 -184651
16216a84651j77968n8760K85028j91105j38247L46346L8397j44311J23462L36002
$$ -184651 -362619 -421379 -136351 -327456 -465703 -119357 -80960 -225271 -101809 234193
16206B34193Q0159l34782k06012J55791K13060j5632O2139K38332j14305j80297
$$ 234193 314352 -20430 -226442 -70651 142409 126777 188916 427248 312943 132646
16196A32646j91730m7790K8772K67949M3795K2295m43510n1K27141J08715l75898
$$ 132646 -59084 -106874 -78102 189847 233642 255937 -187573 -187624 39517 148232 -227666
16185b27666k6885K43935j23439k37113J13882K14081J5329j60757m4516n1535
$$ -227666 -254551 -10616 -134055 -371168 -257286 -43205 -27876 -188633 -233149 -284684
16175b84684k78053J5435L74587O2904j40792J01596K59685Q2132J57919j78808
$$ -284684 -562737 -547302 -172715 -109811 -250603 -149007 110678 192810 350729 171921
16165A71921k05118L00105n8315j06402r2074M5046P4139l3432k9915l438J6411
$$ 171921 -33197 266908 208593 102191 10117 55163 129302 95870 65955 62517 78928
16154G8928l434j55934o7319p829j08378j90748k38862J83413L07438Q7060k07683
$$ 78928 75494 -80440 -147759 -155588 -263966 -454714 -693576 -510163 -202725 -115665 -323348
16143c23348r3446L33442M2852Q5318j20268j53458L2823J83391p1123q0997j83886
$$ -323348 -416794 -83352 -40500 44818 -75450 -228908 -196085 -12694 -83817 -164814 -348700
16132c48700l8549P7934J26791j72280K42982m6274l7580m6339n4357J74819K2479
$$ -348700 -387249 -309315 -182524 -354804 -111822 -158096 -195676 -242015 -296372 -121553 -99074
16121i9074k57307N423J15507q4167p0766K10310j1926J10160K0417j32447J04056
$$ -99074 -356381 -350958 -235451 -319618 -390384 -180074 -192000 -81840 -61423 -193870 -89814
16110h9814k20550j79683J08900J89425J08102J03655j72112n3314J03588R4925
$$ -89814 -310364 -490047 -381147 -191722 -83620 20035 -152077 -205391 -101803 -6878
16100f878J05520p3842p1127K9834L1999l06520m20363J48253N4632j62300K32529
$$ -6878 98642 24800 -46327 -16493 15506 -291014 -711377 -563124 -508492 -670792 -438263
16089d38263N11044K06087j34024k78636p9140K25559K47209R3147j63716k54702
$$ -438263 72781 278868 144844 -133792 -212932 12627 259836 352983 189267 -65435
16079f5435o6026j36699m8390J99040n3510K39812K81743j93041P6165j79507
$$ -65435 -131461 -268160 -316550 -117510 -171020 68792 350535 157494 233659 54152
16069E4152j70694k30739R0144j00299J03193J74969J4160q0939l1008n8565M6562
$$ 54152 -116542 -347281 -257137 -357436 -254243 -79274 -65114 -146053 -177061 -235626 -189064
16058a89064J06769j75606j27924J24684n3885k60053q7651K51798K45592q046
$$ -189064 -82295 -257901 -385825 -261141 -315026 -575079 -662730 -410932 -165340 -173386
16048a73386K9577J05138Q2884J36820R8206k60170m70407K0023M4504J24815
$$ -173386 -143809 -38671 44213 181033 279239 19069 -451338 -431315 -386811 -261996
16038b61996L14258J071L2202j61153r9987j48015K7303p0171J55070j10084o5798
$$ -261996 52262 53333 85535 -75618 -175605 -323620 -296317 -366488 -211418 -321502 -387300
16027c87300J32272Q2985K19286K81483o9370l16220j27693K92698J77006J49757
$$ -387300 -255028 -172043 47243 328726 259356 -56864 -184557 108141 285147 434904
16017D34904j8865l12607L8509K50929O3571k91934q5675k26372p0111J13929
$$ 434904 416039 103432 141941 392870 456441 164507 78832 -147540 -217651 -103722
16007a03722o1494p8190j83945J34755J67316J47022J59468J45638j27997j27219
$$ -103722 -165216 -243406 -427351 -292596 -125280 21742 181210 326848 198851 71632
15997G1632j15052j0911l5983K21095K09654j94547j85082j11410J05337J56231
$$ 71632 -43420 -54331 -90314 130781 340435 145888 -39194 -150604 -45267 110964
15987A10964M9463p3166J9743m7515o6121m18386j32942K89402J50434j3815q9062
$$ 110964 160427 87261 107004 59489 -6632 -425018 -557960 -268558 -118124 -131939 -221001
15976b21001J63296J22575j64345J08602J70770M5327p6545k16261j36860M9189
$$ -221001 -57705 64870 -99475 9127 179897 225224 148679 -67582 -204442 -155253
15966a55253j56555Q3825p779j73315j3172J55368P3190J37326Q1183k37132k2060
$$ -155253 -311808 -227983 -235762 -409077 -422249 -266881 -193691 -56365 24818 -212314 -234374
15955b34374j65576j81231Q3562L53406k9441p4054j50830k43344J02312J7157
$$ -234374 -399950 -581181 -497619 -144213 -173654 -247708 -398538 -641882 -539570 -522413
15945e22413K05074j10257L0489K88761K89491K9440k25185k30766N9047K15593
$$ -522413 -317339 -427596 -397107 -108346 181145 210585 -14600 -245366 -186319 29274
15935B9274J43783j93280o5276k74522R2743K61301j8217j89607K408J07837k19499
$$ 29274 173057 -20223 -85499 -360021 -267278 -5977 -24194 -213801 -211393 -103556 -323055
15924c23055J4493M412j14160o0889M8115R9139Q2626K08892J01175j90724p1251
$$ -323055 -308562 -304150 -418310 -479199 -431084 -331945 -249319 -40427 60748 -129976 -201227
15913b01227J16368q9772j3725J11046r3762k93584L01777K69309q4156j24550
$$ -201227 -84859 -174631 -188356 -77310 -171072 -464656 -162879 106430 22274 -102276
15903a02276l50341k13075L62359M03362M7819j52446j1011J29745j88353l5347
$$ -102276 -452617 -665692 -303333 100029 147848 -4598 -15609 114136 -74217 -109564
15893a09564J16137k91727K0312l4964r6042J436j64000J08171J40491J89860
$$ -109564 6573 -285154 -264842 -299806 -395848 -394412 -558412 -450241 -309750 -119890
15883a19890J45161j24823k14685L7635K03757J75170M7463j37090j0045n8808
$$ -119890 25271 -99552 -314237 -276602 -72845 102325 149788 12698 2653 -56155
15873e6155k40343j11820k7293K110p6298J04510K95458p9466j40360k01354J12703
$$ -56155 -296498 -408318 -435611 -433501 -509799 -405289 -109831 -189297 -329657 -531011 -418308
15862d18308J15527J65923L43133J13802j37736P6808n8658l1808J52711m3197
$$ -418308 -302781 -136858 206275 320077 182341 259149 200491 168683 321394 278197
15852B78197j2472j11560j92210N802n8364j09990R3841J38080j59788j19500
$$ 278197 265725 154165 -38045 -32243 -90607 -200597 -106756 31324 -128464 -247964
15842b47964j10154j77116P2111p9424L0793K09990J81031m8902j97011j32997
$$ -247964 -358118 -535234 -463123 -542547 -511754 -301764 -120733 -169635 -366646 -499643
15832d99643K56360k13525R8687K44162j77691j08602k02586j37926J46521K23336
$$ -499643 -243283 -456808 -358121 -113959 -291650 -400252 -602838 -740764 -594243 -370907
15822c70907q5086Q6006K67353k3613j51817L8689K67279N1832j76758j62448
$$ -370907 -455993 -369987 -102634 -126247 -278064 -239375 27904 79736 -97022 -259470
15812b59470L57136L23244K3230p1113m02167l45021j31583M19277K15065J41423
$$ -259470 97666 420910 444140 373027 -29140 -374161 -505744 -86467 128598 270021
15802B70021l2403k89763k14252p8043P624J09244J54491r7908j73287J36237
$$ 270021 237618 -52145 -266397 -344440 -336816 -227572 -73081 -170989 -344276 -208039
15792b08039q1671q9518K15256M48951j507k58191k25136K97921k0160j03075
$$ -208039 -289710 -379228 -163972 284979 283472 25281 -199855 98066 77906 -25169
15782b5169j17620m354P5984J5802O206j17403L008K45226j14612J8416M134j00870
$$ -25169 -142789 -147143 -71159 -55357 -49151 -166554 -163546 81680 -32932 -14516 -10382 -111252
15770a11252k27491J44525L35705J70714j33818j85789k64578K00312L3498l3985
$$ -111252 -338743 -194218 141487 312201 178383 -7406 -271984 -71672 -38174 -72159
15760g2159K06144J37719k78144J41748m29173j87688J076J27007J51065p015
$$ -72159 133985 271704 -6440 135308 -293865 -481553 -480477 -353470 -202405 -209420
15750b09420J21224J7767p4204l60673k10578K01519K33378N6976N4240j02173
$$ -209420 -88196 -70429 -144633 -505306 -715884 -514365 -280987 -224011 -169771 -271944
15740b71944L3611J55852q9104k06712J99201M8626k3545N25438J77878M3153
$$ -271944 -238333 -82481 -171585 -378297 -179096 -130470 -154015 371423 549301 592454
15730E92454j71211k1899j81327m48632J17240J50978p6866J5060P2142p8054
$$ 592454 421243 399344 218017 -230615 -113375 37603 -39263 -24203 47939 -30115
15720c0115K330j9851j1628J39052r8288j59737P6679o766P6306K26601r0647
$$ -30115 -27785 -47636 -59264 79788 -18500 -178237 -101558 -108324 -32018 194583 103936
15709A03936l26260r1200K25894K58391Q8272l34374J03482p7720j40447J31955
$$ 103936 -222324 -313524 -87630 170761 259033 -75341 28141 -49579 -190026 -58071
15699e8071J05177K17846l9138j33614j40427j52589j28228K17868J11359j24354
$$ -58071 47106 264952 225814 92200 -48227 -200816 -329044 -111176 183 -124171
15689a24171K24062k11945m8189J54319j98925m28271l0988L49626q0831J78510
$$ -124171 99891 -112054 -160243 -5924 -204849 -633120 -664108 -314482 -395313 -216803
15679b16803N6706N8925m4565Q2621O5234o9792j986j62865m0410k2639N3741
$$ -216803 -160097 -101172 -145737 -63116 2118 -67674 -69660 -232525 -272935 -295574 -241833
15668b41833n9409j47456J14723l2829j01353N8128Q1206p718K46214r1482k73055
$$ -241833 -301242 -448698 -333975 -366804 -468157 -410029 -328823 -336541 -90327 -181809 -454864
15657d54864M5260J03128K62506J06610k35740l19428L07651L21456K2015m3281
$$ -454864 -409604 -306476 -43970 62640 -173100 -492528 -184877 136579 158594 115313
15647A15313o1126M222p575M523j27223k85743m3733j26597K32717J86589O6340
$$ 115313 54187 58409 50834 55357 -71866 -357609 -401342 -527939 -295222 -108633 -42293
15636d2293k7246N0170k03272j20085J69433j15760j7887n3815j5869J07677J32725
$$ -42293 -69539 -19369 -222641 -342726 -173293 -289053 -306940 -360755 -376624 -268947 -136222
15625a36222k00286m6569J54879m7989j81554q5383K13084L42082J93880j04752
$$ -136222 -336508 -383077 -228198 -276187 -457741 -543124 -330040 12042 205922 101170
15615A01170j70684j30185j99112j06919J00961L3897l2419Q7342J06968Q0557
$$ 101170 -69514 -199699 -398811 -505730 -404769 -370872 -403291 -315949 -208981 -128424
15605a28424Q9721k4944J952j2197J62999J24999j15583j25435r2517L86080O5839
$$ -128424 -38703 -63647 -61695 -73892 89107 214106 98523 -26912 -119429 266651 332490
15594C32490k77107j87908J5278n547J51147j12483O147N4143o9350N0975K23869
$$ 332490 55383 -132525 -117247 -122794 28353 -84130 -77983 -23840 -93190 -42215 181654
15583A81654q9553M9069k51686k5445J15992J70954J63761l4964j49168n94940
$$ 181654 92101 141170 -110516 -135961 -19969 150985 314746 279782 130614 -464326
15573d64326k57720J21461N14157Q4354n7773m204r9401k31571j35738j16673
$$ -464326 -722046 -600585 -86428 -2074 -59847 -64051 -163452 -395023 -530761 -647434
15563f47434L05161M51116Q3642l10068L3055M0479n2519J23202R9324l20582
$$ -647434 -342273 108843 192485 -117583 -84528 -44049 -96568 26634 125958 -194624
15553a94624L2469J1941J51606m9703k39723J01997Q5838J99932J58354l30266
$$ -194624 -162155 -150214 1392 -48311 -288034 -186037 -100199 99733 258087 -72179
15543g2179k21451m1055j41098O9258N4515N085N3154n7389M1321o7002J35980
$$ -72179 -293630 -334685 -475783 -406525 -352010 -346925 -293771 -351160 -309839 -376841 -240861
15532b40861K12560J66053n5983k07458j62702j65070J16339L43671J05528P6710
$$ -240861 -28301 137752 81769 -125689 -288391 -453461 -337122 6549 112077 188787
15522A88787J83511j70942k84840L88759K09524K1014k96447J33406j21012j53858
$$ 188787 372298 201356 -83484 305275 514799 535813 239366 372772 251760 97902
15512I7902l33757q9714p1324p4941L16105K88122r03J66851J5260J60635P5703
$$ 97902 -235855 -325569 -396893 -471834 -155729 132393 131490 298341 313601 474236 549939
15501E49939K6077j26470j83723k80165j35362q8476m0848n793R8921n9031K03900
$$ 549939 576016 449546 265823 -14342 -149704 -238180 -279028 -284821 -185900 -244931 -41031
15490d1031J65357j65708O2043J39060Q3503J05336j68643K1128n1155k23119
$$ -41031 124326 -41382 20661 159721 243224 348560 179917 201045 149890 -73229
15480g3229l15985l3224M80576K88147O8432q4613k96478j43203L18497j35668
$$ -73229 -389214 -422438 58138 346285 414717 330104 33626 -109577 208920 73252
15470G3252P7044Q3476k3736J71897r430j69760J39422k91365j78757K43508k02606
$$ 73252 150296 233772 210036 381933 372503 202743 342165 50800 -127957 115551 -87055
15459h7055j71584J63132K58973K2713j16800r1179k29515j55060l2164K06207
$$ -87055 -258639 -95507 163466 186179 69379 -21800 -251315 -406375 -438539 -232332
15449b32332q5919P7539J25506K8713M028O8476R8356J22544J8881r6620J0429
$$ -232332 -318251 -240712 -115206 -86493 -82465 -13989 84367 206911 225792 129172 139601
15438A39601O5906k4750j81790J9481J96544R7251Q9937k47339j49713m5216K39095
$$ 139601 205507 180757 -1033 18448 214992 312243 402180 154841 5128 -40088 199007
15427A99007q0669j44985J53973n4925n5590o1938k36272K8036J82155K21741
$$ 199007 118338 -26647 127326 72401 16811 -45127 -281399 -253363 -71208 150533
15417A50533j39428r2151j26430k4979j89967P1720J47776L02405j15504J72777
$$ 150533 11105 -81046 -207476 -232455 -422422 -350702 -202926 99479 -16025 156752
15407A56752M3699J4299p8650j03766o9565m11758p2962K3675L56537L99471K40692
$$ 156752 200451 214750 136100 32334 -37231 -448989 -521951 -498276 -141739 257732 498424
15396D98424J6971n1501j46009k36958l02500J0752K17131N4435L9316j01774
$$ 498424 515395 463894 317885 80927 -221573 -210821 6310 60745 100061 -1713
15386a713j66526R8563L13008n3402Q5315P6049J01163M5948p7735l3784J28553
$$ -1713 -168239 -69676 243332 189930 275245 351294 452457 498405 420670 386886 515439
15375E15439Q8237Q2866O3855j78167j7977o3387q7453k50824q8168J46061J24453
$$ 515439 603676 686542 750397 572230 554253 490866 403413 152589 64421 210482 334935
15364C34935J22129J47713j80474J9821M4577k22271J70545n3745k7806J29553
$$ 334935 457064 604777 424303 444124 488701 266430 436975 383230 355424 484977
15354D84977J66010m89515k42467J65648M37465J43690q3461J06710J55755j05395
$$ 484977 650987 161472 -80995 84653 522118 665808 582347 689057 844812 739417
15344G39417k06794P504O4232J9517K72246L6622k0849j90449l59890K15977O8690
$$ 739417 532623 540127 604359 623876 896122 932744 911895 721446 361556 577533 646223
15333F46223l58679J5175j2594r7243j06756n8671J67672o9432j49513k49531
$$ 646223 287544 302719 290125 192882 86126 27455 195127 125695 -23818 -273349
15323b73349L66483K26615k36052K9285n5146j2198L7118K50656L75299j21219
$$ -273349 93134 319749 83697 112982 57836 45638 82756 333412 708711 587492
15313E87492k92659K08912K64612j47454l17578K04995K79070j26986j89694l32813
$$ 587492 294833 503745 768357 620903 303325 508320 787390 660404 470710 137897
15303A37897p4456K28449j0705J86254o9615j8927J96050j51323N1160k1110J22162
$$ 137897 63441 291890 281185 467439 397824 378897 574947 423624 474784 453674 575836
15292E75836k75054m50692K59348K41393l9159k26792R5766J18900j22961J29224
$$ 575836 300782 -149910 109438 350831 311672 84880 180646 299546 176585 305809
15282C05809n143J52214K50993O41540K73931M16459N96818N05420M53374N54749
$$ 305809 300666 452880 703873 1345413 1619344 2035803 2632621 3138041 3591415 4146164
15272D146164M74974K42170L87543O98132P24176M72045J52994O8077J08497o6175
$$ 4146164 4621138 4863308 5250851 5948983 6673159 7145204 7298198 7366275 7474772 7408597
15262G408597m90808o58675q88899q15755n71601m79882n75511n40499j50524
$$ 7408597 6917789 6259114 5370215 4554460 3982859 3502977 2927466 2386967 2236443
15253B236443j07478R4983k2103j81973j11950o8856j21263k08603j24677J38247
$$ 2236443 2128965 2223948 2201845 2019872 1907922 1839066 1717803 1509200 1384523 1522770
15243A522770L79069p931o0994j48937k46925P2134j4954P9860k19480L0565J13622
$$ 1522770 1901839 1893908 1832914 1683977 1437052 1509186 1494232 1574092 1354612 1385177 1498799
15232A498799J197j23332K20561K35666j08570p0235l41903n3857l4890L1062
$$ 1498799 1499996 1376664 1597225 1832891 1724321 1654086 1312183 1258326 1223436 1254498
15222A254498J28564J04997q3416k99387j65254K36534O80208M53323l10526j3173
$$ 1254498 1383062 1488059 1404643 1105256 940002 1176536 1856744 2310067 1999541 1986368
15212A986368o9722j14852R6349J56774n7436j29442n9456k36238P6938L00737
$$ 1986368 1916646 1801794 1898143 2054917 1997481 1868039 1808583 1572345 1649283 1950020
15202A950020P270K95229K42182j55508n1087q9614J2442J11668K57439k16464
$$ 1950020 1957290 2252519 2494701 2339193 2288106 2198492 2210934 2322602 2580041 2363577
15192B363577L6436K60804J36162J11142K65027J904k36716K64525K14930L41966
$$ 2363577 2400013 2660817 2796979 2908121 3173148 3175052 2938336 3202861 3417791 3759757
15182C759757J03078j95932k91465M0225J56372K53763J12722R6235K48174l621
$$ 3759757 3862835 3666903 3375438 3415663 3572035 3825798 3938520 4034755 4282929 4279308
15172D279308J20154L23610L96464r5509Q8989K30851O7190m1952L4896K09905
$$ 4279308 4399462 4723072 5119536 5024027 5113016 5343867 5411057 5369105 5404001 5613906
15162E613906K96527j96298K18403K22976J67548J79277K00457K51065K34855
$$ 5613906 5910433 5714135 5932538 6155514 6323062 6502339 6702796 6953861 7188716
15153G188716J67643L05674L0154P7740K03571K04543K75440R6463K7511K21934
$$ 7188716 7356359 7662033 7692187 7769927 7973498 8178041 8453481 8549944 8577455 8799389
15143H799389P4432k49842p992K47845J7461P5938L80386K39312q0342M06899
$$ 8799389 8873821 8623979 8615987 8863832 8881293 8957231 9337617 9576929 9496587 9903486
15133I903486J95462J47498K46233J16956J00595k49890J93956L13385J11426
$$ 9903486 10098948 10246446 10492679 10609635 10710230 10460340 10654296 10967681 11079107
15124A1079107J65614J45081J04664K98617o0213K8100L21816K48226Q1680J94785
$$ 11079107 11244721 11389802 11494466 11793083 11732870 11760970 12082786 12331012 12412692 12607477
15114A2607477N8763K36794L36919J79017J64004K52708K65375K45378J16304
$$ 12607477 12666240 12903034 13239953 13418970 13582974 13835682 14101057 14346435 14462739
15105A4462739J57255L30389L63130N34225N56784L8064J14082J51543M34213
$$ 14462739 14619994 14950383 15313513 15847738 16404522 16442586 16556668 16708211 17142424
15096A7142424P79301P72143M34905N83302L40100N77938J34281M50055N07548
$$ 17142424 17921725 18693868 19128773 19712075 20052175 20630113 20764394 21214449 21721997
15087B1721997N03322M99806M59136O51063N72971O98010O24848O98058N18256
$$ 21721997 22225319 22725125 23184261 23835324 24408295 25106305 25731153 26429211 26947467
15078B6947467N07122J97020L94055O04018Q12962Q56027N53723L95665M92442
$$ 26947467 27454589 27651609 28045664 28649682 29462644 30318671 30872394 31268059 31760501
15069C1760501O86037K97814M76497M62903L88878O05932M88620L97943L50767
$$ 31760501 32446538 32744352 33220849 33683752 34072630 34678562 35167182 35565125 35915892
15060C5915892L00537L06149L55786M55376M44232L02070K34474L01642J74903
$$ 35915892 36216429 36522578 36878364 37333740 37777972 38080042 38314516 38616158 38791061
15051C8791061o0787J51591K10608M59893L75743L03613N83330L57780J3976K62629
$$ 38791061 38730274 38881865 39092473 39552366 39928109 40231722 40815052 41172832 41186808 41449437
15041D1449437L47046N74721J49192J46388J21791J74978L38287K32365L64666
$$ 41449437 41796483 42371204 42520396 42666784 42788575 42963553 43301840 43534205 43898871
15032D3898871L44577L38792M4938J61330M20541K63883L15516K03175L5568L57709
$$ 43898871 44243448 44582240 44627178 44788508 45209049 45472932 45788448 45991623 46027191 46384900
15022D6384900L70933n1469L04568L23532M3597J55935K59032O5121Q0031k9899
$$ 46384900 46755833 46704364 47008932 47332464 47376061 47531996 47791028 47856149 47936180 47906281
15012D7906281L9992l969J96380K96717j17348o8064P5444l08257k35322L11016
$$ 47906281 47946273 47942304 48138684 48435401 48318053 48249989 48325433 48017176 47781854 48092870
15002D8092870R0544k4409J12550j18266q0141m76523k71782M1621k80718l68404
$$ 48092870 48183414 48159005 48271555 48153289 48073148 47596625 47324843 47366464 47085746 46717342
14992D6717342J19848j46774j26398O2502j00184k83654j17159m1327j24119j58708
$$ 46717342 46837190 46690416 46564018 46626520 46526336 46242682 46125523 46084196 45960077 45801369
14982D5801369r6236j25572j94840Q8625P9031J00681J828j9670o9059J4396j37736
$$ 45801369 45705133 45579561 45384721 45473346 45552377 45653058 45654886 45635216 45566157 45580553 45442817
14971D5442817M0918J33963J06750K56272J38407Q2047K2020M12971K60025k33873
$$ 45442817 45483735 45617698 45724448 45980720 46119127 46201174 46223194 46636165 46896190 46662317
14961D6662317j04949M03504K52659K88962J17969K56407M76734L67011N04666
$$ 46662317 46557368 46960872 47213531 47502493 47620462 47876869 48353603 48720614 49225280
14952D9225280P27005L67176L49041P31341O45480N71189N15159Q24066Q05046
$$ 49225280 49952285 50319461 50668502 51399843 52045323 52616512 53131671 53955737 54760783
14943E4760783Q33184P85159Q18476P65740P71994N63487P82331R59196J152225
$$ 54760783 55593967 56379126 57197602 57963342 58735336 59298823 60081154 61040350 62192575
14934F2192575J063846J111806R18279Q41770J049190J179639J497479J508337
$$ 62192575 63256421 64368227 65286506 66128276 67177466 68357105 69854584 71362921
14926G1362921J189738J463956J396497J513780J517045J733500J389656J566480
$$ 71362921 72552659 74016615 75413112 76926892 78443937 80177437 81567093 83133573
14918H3133573J968587K001763K021764K010519K041179J989500K400667K285113
$$ 83133573 85102160 87103923 89125687 91136206 93177385 95166885 97567552 99852665
14910I9852665K378140K501197K416354K793336K488645K464452K528376K613130
$$ 99852665 102230805 104732002 107148356 109941692 112430337 114894789 117423165 120036295
14902A20036295K217099J997194K602051K447612K248177J940207J805472J663956
$$ 120036295 122253394 124250588 126852639 129300251 131548428 133488635 135294107 136958063
14894A36958063J726306J327688J194317R62686O71764N21444M2402k32909n06469
$$ 136958063 138684369 140012057 141206374 142169060 142840824 143362268 143404670 143171761 142665292
14885A42665292o24431q48560j463886j665835j822912j913111k634323k856919
$$ 142665292 142040861 141192301 139728415 138062580 136239668 134326557 131692234 128835315
14877A28835315k613503k290074k573488l002143k901734l078862l128596l197518
$$ 128835315 126221812 123931738 121358250 118356107 115454373 112375511 109246915 106049397
14869A06049397k775952k908318k987607k828480k786942k944571k845504l013752
$$ 106049397 103273445 100365127 97377520 94549040 91762098 88817527 85972023 82958271
14861H2958271k602906k680559k739759k615636k601918k728180k897202k453793
$$ 82958271 80355365 77674806 74935047 72319411 69717493 66989313 64092111 61638318
14853F1638318k291253k431234k089891k020477j594601j704575j826143j594065
$$ 61638318 59347065 56915831 54825940 52805463 51210862 49506287 47680144 46086079
14845D6086079j585054j639745j611928j296230j180262j230204j270426j181307
$$ 46086079 44501025 42861280 41249352 39953122 38772860 37542656 36272230 35090923
14837C5090923r00074j124138j149099r93149j011424p02524p00965q39819j071508
$$ 35090923 34190849 33066711 31917612 30924463 29913039 29210515 28509550 27669731 26598223
14828B6598223p14176n98630q01332o30058p16711l89996o55807n77952o67549
$$ 26598223 25884047 25285417 24484085 23854027 23137316 22747320 22091513 21513561 20846012
14819B0846012m20513k41370m46467o87777m29534k92831n71941n90349m44246
$$ 20846012 20425499 20184129 19737662 19049885 18620351 18327520 17755579 17165230 16720984
14810A6720984l54321k41694k68512k33862j34713l54822m00771m42584j57733
$$ 16720984 16366663 16124969 15856457 15622595 15487882 15133060 14732289 14289705 14131972
14801A4131972j27028j58536j15175m3044l18793l1118J35561j16394n09730m47929
$$ 14131972 14004944 13846408 13731233 13688189 13369396 13338278 13473839 13357445 12847715 12399786
14791A2399786j98121l51824j50044j05248J15264j0337l94697m28997m23744
$$ 12399786 12201665 11849841 11699797 11594549 11709813 11699476 11304779 10875782 10452038
14782A0452038n49492l00255K7048J64994k45493m20836l47172l40871m49394
$$ 10452038 9902546 9602291 9629339 9794333 9548840 9128004 8780832 8439961 7990567
14773G990567m16565l84678l29950J3042k00988Q4958R4498p5126k02207K1162
$$ 7990567 7574002 7189324 6859374 6872416 6671428 6756386 6850884 6775758 6573551 6594713
14763F594713j94407k30041r3585J91297O3296j75925j55242j50392k58787o4271
$$ 6594713 6400306 6170265 6076680 6267977 6331273 6155348 6000106 5849714 5590927 5526656
14753E526656q3559j56137j26455J1354K6899j74579m40053j53291J29088K62776
$$ 5526656 5443097 5286960 5160505 5171859 5198758 5024179 4584126 4430835 4559923 4822699
14743D822699O0916l24636j49097J13464j63739J45069j14119l83745k90813o7941
$$ 4822699 4883615 4558979 4409882 4523346 4359607 4504676 4390557 4006812 3715999 3648058
14733C648058J02687K4614O6038R8925k1924k22869J56715K2838k00278J00021
$$ 3648058 3750745 3775359 3841397 3940322 3918398 3695529 3852244 3875082 3674804 3774825
14723C774825k07559o6856N7901j22611o4638k23655K3963j07563P5391J00737
$$ 3774825 3567266 3500410 3558311 3435700 3371062 3147407 3171370 3063807 3139198 3239935
14713C239935L6564k02972R4460J328p3321K12040J98403k3130j79826k90547
$$ 3239935 3276499 3073527 3167987 3169315 3095994 3308034 3506437 3483307 3303481 3012934
14703C012934m56993J16317j13014J22880K46290Q1294j20687j75259K4288L5795
$$ 3012934 2555941 2672258 2559244 2682124 2928414 3009708 2889021 2713762 2738050 2773845
14693B773845p10l60122o4187K82802K70645j04842p8925J381j27336j00185q5461
$$ 2773845 2773135 2413013 2348826 2631628 2902273 2797431 2718506 2719887 2592551 2492366 2406905
14682B406905k16609l14980Q3277J86759L24308j12980o5006Q6259k8127l10749
$$ 2406905 2190296 1875316 1958593 2145352 2469660 2356680 2291674 2377933 2349806 2039057
14672B039057k4378J72308P4707R6215k3277j63381N9941p3492N893J39919j83
$$ 2039057 2014679 2186987 2261694 2357909 2334632 2171251 2231192 2157700 2163593 2303512 2303329
14661B303329l431K97824J90755j84248k64748k19533J15686k41999j29776K76756
$$ 2303329 2299898 2597722 2788477 2604229 2339481 2119948 2235634 1993635 1863859 2140615
14651B140615r9326j40976J25770Q365k05254k888l4955K15774J99344K47663
$$ 2140615 2041289 1900313 2026083 2034448 1829194 1826306 1791351 2007125 2206469 2454132
14641B454132J33766N6636j34028l3167L4515j3196L0763K87074J6759M3700j57884
$$ 2454132 2587898 2644534 2510506 2477339 2511854 2498658 2529421 2816495 2833254 2876954 2719070
14630B719070L2233J06160j06201j89863j69339o450J35587J81553p0348m9429
$$ 2719070 2751303 2857463 2751262 2561399 2392060 2385610 2521197 2702750 2632402 2582973
14620B582973J31021P6325J35612M7956k55858J27200J29575J45806L3188p4746
$$ 2582973 2713994 2790319 2925931 2973887 2718029 2845229 2974804 3120610 3153798 3079052
14610C079052O1881J53214J30141J31675J30230j79430J92010Q9133O8140L059
$$ 3079052 3140933 3294147 3424288 3555963 3686193 3506763 3698773 3787906 3856046 3859105
14600C859105R7844j6376O5800K06986J59846J96702K90344K81128K18370M44727
$$ 3859105 3956949 3940573 4006373 4213359 4373205 4569907 4860251 5141379 5359749 5804476
14590E804476K31457J21668M78045L17728Q1144K86120K71209J9582M34353O05557
$$ 5804476 6035933 6157601 6635646 6953374 7034518 7320638 7591847 7611429 8045782 8651339
14580H651339J97718L73478N10207O17041M60224N36845O91417N52997R09290
$$ 8651339 8849057 9222535 9732742 10349783 10810007 11346852 12038269 12591266 13500556
14571A3500556P35971P90753R58674P32032J016168J452524J275785J223154J593292
$$ 13500556 14236527 15027280 15985954 16717986 17734154 19186678 20462463 21685617 23278909
14562B3278909J617027J459987J409070J490007J723175J919883K205542K450596
$$ 23278909 24895936 26355923 27764993 29255000 30978175 32898058 35103600 37554196
14554C7554196K244888K206237K039080K155696K080758K219983J800515J950459
$$ 37554196 39799084 42005321 44044401 46200097 48280855 50500838 52301353 54251812
14546E4251812J938614J643242J173470J273252J311068N64773L82120O91548
$$ 54251812 56190426 57833668 59007138 60280390 61591458 62156231 62538351 63229899
14538F3229899N70127K35727K33789J53860L05894M22928M65446M13300L72819
$$ 63229899 63800026 64035753 64269542 64423402 64729296 65152224 65617670 66030970 66403789
14529F6403789M10134L99098O61121R24479J018215Q08381M26226L42002L85862
$$ 66403789 66813923 67213021 67874142 68798621 69816836 70625217 71051443 71393445 71779307
14520G1779307K92833k82960n34922p44189j132699j295673j254656j627087k091746
$$ 71779307 72072140 71789180 71254258 70510069 69377370 68081697 66827041 65199954 63108208
14511F3108208k057012j999439j837629k129955j972078j656330j826555j421148
$$ 63108208 61051196 59051757 57214128 55084173 53112095 51455765 49629210 48208062
14503D8208062j420377j055095q48972j033550q74007m80721m62745o01376j76947
$$ 48208062 46787685 45732590 44883618 43850068 42976061 42495340 42032595 41431219 41254272
14494D1254272K15076K84793K90395O28077P59069Q80893Q59893R57932J368377
$$ 41254272 41469348 41754141 42044536 42672613 43431682 44312575 45172468 46130400 47498777
14485D7498777J395666J799463J648882J931932J817727J603118J826548K144617
$$ 47498777 48894443 50693906 52342788 54274720 56092447 57695565 59522113 61666730
14477F1666730K245316J649619J319594J408176J430366J408062J307137Q10389
$$ 61666730 63912046 65561665 66881259 68289435 69719801 71127863 72435000 73245389
14469G3245389N67889K98557K55369j79489m35989l18892k82138l42990o46438
$$ 73245389 73813278 74111835 74367204 74187715 73751726 73432834 73150696 72807706 72161268
14460G2161268j97470J78157k15627P6615n8266n8752R4363J07470L95624r7548
$$ 72161268 71963798 72141955 71926328 72002943 71944677 71885925 71980288 72087758 72483382 72385834
14450G2385834q7055n9373l90753p49169o74558r99818j333511j351690j559361
$$ 72385834 72298779 72239406 71848653 71099484 70424926 69425108 68091597 66739907 65180546
14441F5180546k300747k393388k171921k465956k416833k367872k474334k185192
$$ 65180546 62879799 60486411 58314490 55848534 53431701 51063829 48589495 46404303
14433D6404303k280234k514836k101210j732867j782287j851867j844140j739567
$$ 46404303 44124069 41609233 39508023 37775156 35992869 34141002 32296862 30557295
14425C0557295j577863j294086r34109j217381j061290r72520j018492j099180
$$ 30557295 28979432 27685346 26751237 25533856 24472566 23500046 22481554 21382374
14417B1382374j409238q24518p83144p65789o84970p75021q58205n73362l52483
$$ 21382374 19973136 19148618 18365474 17599685 16914715 16139694 15281489 14708127 14355644
14408A4355644k26286m26652m64515n93626l97190l16855o55761n79876j30020
$$ 14355644 14129358 13702706 13238191 12644565 12247375 11930520 11274759 10694883 10564863
14399A0564863p1509K9195l91946k84404n29080k43755k04565l06377k96983k84701
$$ 10564863 10493354 10522549 10130603 9846199 9317119 9073364 8868799 8562422 8265439 7980738
14389G980738k81279j42782k78206j8317r4479p549j99733l20362r8606q3397
$$ 7980738 7699459 7556677 7278471 7260154 7165675 7158126 6958393 6638031 6539425 6456028
14379F456028k6613j71370k10152j57133q1489p5791k85648k13817l91135K7585
$$ 6456028 6429415 6258045 6047893 5890760 5809271 5733480 5447832 5234015 4842880 4870465
14369D870465j30542k53425j10393J5457J7387j77875k01821n2871J41532P4538
$$ 4870465 4739923 4486498 4376105 4391562 4408949 4231074 4029253 3976382 4117914 4192452
14359D192452r7830l06402j87098J26819p0145k13558k62121J36476k5040K8866
$$ 4192452 4094622 3788220 3601122 3727941 3657796 3444238 3182117 3318593 3293553 3322419
14349C322419k29327k50485m668K05821J56375j25241j25298l46067j37025r3486
$$ 3322419 3093092 2842607 2837939 3043760 3200135 3074894 2949596 2603529 2466504 2373018
14339B373018N4512K45606K55878J4447j02571l8489k33758j52471k01368N865
$$ 2373018 2427530 2673136 2929014 2943461 2840890 2802401 2568643 2416172 2214804 2220669
14329B220669J84885r6722j81592N3029L14965j33481j73682k45338m6577L3564
$$ 2220669 2405554 2308832 2127240 2180269 2495234 2361753 2188071 1942733 1896156 1929720
14319A929720J82597j53314l9001J29549J72647n7565k29194K57001r2106k36343
$$ 1929720 2112317 1959003 1920002 2049551 2222198 2164633 1935439 2192440 2100334 1863991
14309A863991j99483J42135n0272l4827K38445Q0121l8730j3893j8226J97553
$$ 1863991 1664508 1806643 1756371 1721544 1959989 2040110 2001380 1987487 1969261 2166814
14299B166814n6157J51189m29169k37700n6609J65065K70372L44M0406J29683
$$ 2166814 2110657 2261846 1832677 1594977 1538368 1703433 1973805 1974149 2014555 2144238
14289B144238O7234k12377q9956K06174J96473l0556L7806M8038q8737l7780n1244
$$ 2144238 2211472 1999095 1909139 2115313 2311786 2281230 2319036 2367074 2278337 2240557 2189313
14278B189313j61910K6375J03622p5851m13678j15264K13407L49602r7866m69599
$$ 2189313 2027403 2053778 2157400 2081549 1667871 1552607 1766014 2115616 2017750 1548151
14268A548151n6916K15835j46352j40014J62018J25307j06254l9394J08230n082
$$ 1548151 1491235 1707070 1560718 1420704 1582722 1708029 1601775 1562381 1670611 1665529
14258A665529K25209l5792n12431k91730O8387J9368K51824J4922j17870j12228
$$ 1665529 1890738 1854946 1342515 1050785 1119172 1138540 1390364 1405286 1287416 1175188
14248A175188r5474J55146Q6505j36869m8170k03258J69617l722j03906j04254
$$ 1175188 1079714 1234860 1321365 1184496 1136326 933068 1102685 1098963 995057 890803
14238H90803J26353j08564r9514l6756l0109J50365L77612j43524q6374J17372
$$ 890803 1017156 908592 809078 772322 742213 892578 1270190 1126666 1040292 1157664
14228A157664k73035j26193K89418R8826J2434K39711o229k49173n2540K17126
$$ 1157664 884629 758436 1047854 1146680 1159114 1398825 1392596 1143423 1090883 1308009
14218A308009j21525o6009J8392J1512l49714J11314K12258J67963j27021k80982
$$ 1308009 1186484 1120475 1138867 1150379 800665 911979 1124237 1292200 1165179 884197
14208H84197n7183j28204l97J1523r3485K40295k967j58378n0526j12371Q1691
$$ 884197 827014 698810 698413 709936 616451 856746 853779 695401 644875 532504 614195
14197F14195J01329K21456O6756m84183r9894J69240p2694J53830J4067o2872
$$ 614195 715524 936980 1003736 519553 419659 588899 516205 670035 684102 621230
14187F21230j51878j45731j72907m8332N5260K87054J0853m7718P0687L5802r719
$$ 621230 469352 323621 150714 102382 157642 444696 455549 407831 478518 514320 504601
14176E04601P7260k03236l6480L89528K62302Q7635p5266n9832K0063k34874J71726
$$ 504601 581861 378625 342145 731673 993975 1081610 1006344 946512 966575 731701 903427
14165I03427J65366n7501J23575j17608k45490j83857K56064M139l76011j75432
$$ 903427 1068793 1011292 1134867 1017259 771769 587912 843976 848115 472104 296672
14155B96672M27435L61539m7497k18958j51896q4477j48273J05615J67550K09611
$$ 296672 724107 1085646 1038149 819191 667295 582818 434545 540160 707710 917321
14145I17321k06392j82615j11049K74059J9318k61660r8230J37064K27231M5212
$$ 917321 710929 528314 417265 691324 710642 448982 350752 487816 715047 760259
14135G60259j34517p4506R5542j32448n09737j2063K4518K14068L13405K2814
$$ 760259 625742 551236 646778 514330 4593 -7470 17048 231116 544521 567335
14125E67335P8874O6578j36359J58269J86654J42684j59733k86546M3196k16624
$$ 567335 646209 712787 576428 734697 921351 1064035 904302 617756 660952 444328
14115D44328O8904J60776M7036q2234j42274p7595P7060J65683r8717k66893k1170
$$ 444328 513232 674008 721044 638810 496536 418941 496001 661684 562967 296074 274904
14104B74904J47992R4121m1875k5719N6077p8036P9038j87954O2020K49043R2078
$$ 274904 422896 517017 475142 449423 505500 427464 506502 318548 380568 629611 721689
14093G21689j35291P1623P2263Q3542j2901j2927j68942l6771q1044r4490N439
$$ 721689 586398 658021 730284 813826 800925 787998 619056 582285 501241 406751 412190
14082D12190L33696J75218J13177J21180M7043J42994l2437M3338r9842J28624
$$ 412190 745886 921104 1034281 1155461 1202504 1345498 1313061 1356399 1256557 1385181
14072A385181L9764M68043O28497M58500K48289M19050K57898L43497K71183R0607
$$ 1385181 1424945 1892988 2521485 2979985 3228274 3647324 3905222 4248719 4519902 4610509
14062D610509K64631L46249Q0401m2535k62868m86664p34347p61401p25379j89744
$$ 4610509 4875140 5221389 5301790 5259255 4996387 4509723 3775376 3013975 2288596 2098852
14052B098852k53435l41649m3585P3262O0878j28399k90067J03339K21881k04738
$$ 2098852 1845417 1503768 1460183 1533445 1594323 1465924 1175857 1279196 1501077 1296339
14042A296339j55438K8726J35542j66609j76343J2088j90154J44445j5600p0052
$$ 1296339 1140901 1169627 1305169 1138560 962217 974305 784151 928596 912996 842944
14032H42944j65357k22406m4007L08254P9947Q6075J24240J96758K5369O9902
$$ 842944 677587 455181 411174 719428 799375 885450 1009690 1206448 1231817 1301719
14022A301719l07412j56681R1109N6852p160k29437l0262l13151Q7187Q7214j4835
$$ 1301719 994307 837626 928735 985587 978427 748990 718728 405577 492764 579978 565143
14011E65143j42625j61169J47206q4624K00307J41518j55415K0032L72865j01810
$$ 565143 422518 261349 408555 323931 524238 665756 510341 530373 903238 801428
14001H01428j1151Q3689k77229K4941Q8921J28144K11389O3169j40079p2292J1036
$$ 801428 790277 873966 596737 621678 710599 838743 1050132 1113301 973222 900930 911966
13990I11966o2732n04867J5702L60160J21343l5291K8277o1139k48194k36483
$$ 911966 849234 344367 360069 720229 841572 806281 834558 773419 525225 288742
13980B88742J84613K83988k69851k72053O4354K96029m2257q4705n6713j20931
$$ 288742 473355 757343 487492 215439 279793 575822 533565 448860 392147 271216
13970B71216J77645p3522q9754J81508J57365L6946O9771K34662m03661J9631
$$ 271216 448861 375339 285585 467093 624458 661404 731175 965837 562176 581807
13960E81807Q4360J24152L378K6766j28180J06352j65148J1970J70794J02901
$$ 581807 666167 790319 793697 820463 692283 798635 633487 645457 816251 919152
13950I19152k29390j29133j1425o4226K91439l6477j8089k65263k60737k11463
$$ 919152 689762 560629 549204 484978 776417 739940 721851 456588 195851 -15612
13940a5612J25285j26998k13946K82622K39712l9291K6848l6235j1919J28535
$$ -15612 109673 -17325 -231271 51351 291063 251772 278620 242385 230466 359001
13930C59001o3662J27646j21694j64721M4595l6401N3073J68789r5469k39526
$$ 359001 295339 422985 301291 136570 181165 144764 197837 366626 271157 31631
13920C1631L8619L06066J66613K0662k55578k00105J06557j70432N2993J133P8037
$$ 31631 70250 376316 542929 563591 308013 107908 214465 44033 97026 98159 176196
13909A76196j2943q2114o8736M76898N9061p8075j43876j66080J22172N3381K64424
$$ 176196 163253 81139 12403 489301 548362 470287 326411 160331 282503 335884 600308
13898F00308L3949L3534O7925O5627o8859j83030J007L6992j36871m10897p0483
$$ 600308 634257 667791 735716 801343 732484 549454 550461 587453 450582 39685 -30798
13887c0798p5408M8997K77778P5839n2963n3067q8775J28404J45779j82366J57284
$$ -30798 -106206 -57209 220569 296408 243445 190378 101603 230007 375786 193420 350704
13876C50704J49457j10474j03727K21383j5450k39285n36591j26382K52914K09393
$$ 350704 500161 389687 285960 507343 491893 252608 -283983 -410365 -157451 51942
13866E1942J65767K25231J2851J56817O1850k55337p25n7017L4483j12090j55897
$$ 51942 217709 442940 455791 612608 674458 419121 418396 361379 395862 283772 127875
13855A27875L20975l4064k65154J27681J66240L2182n0617n4868j07506j47111
$$ 127875 448850 414786 149632 277313 443553 475735 425118 370250 262744 115633
13845A15633j23147L01226J22630p1269J64113j17727k98841o9049j3877m099
$$ 115633 -7514 293712 416342 345073 509186 391459 92618 23569 9692 5593
13835E593K40455J39845l76397k78945Q2200J86541k27940K2027K72300Q7672
$$ 5593 246048 385893 9496 -269449 -187249 -708 -228648 -206621 65679 153351
13825A53351J06535P1075l313k16825k80516K5149K6167J56326l47267q4656J29720
$$ 153351 259886 330961 327648 110823 -169693 -144544 -118377 37949 -309318 -393974 -264254
13814b64254K14577P5583L5022j81055K4083j30274M8793J07712p7577M2665J61928
$$ -264254 -49677 25906 60928 -120127 -96044 -226318 -177525 -69813 -147390 -104725 57203
13803E7203J6181j55853j39071l8019N699L40039K82045J4058J780l4129J24628
$$ 57203 73384 -82469 -221540 -259559 -253860 86179 368224 382282 384062 349933 474561
13792D74561J17649n6517j54143r3582Q9094R8567N3612k48724l15220P5772J34947
$$ 474561 592210 535693 381550 287968 377062 475629 529241 280517 -34703 41069 176016
13781A76016k51352J93812L22941k14347j23724J17852K22313K7965q0572j10659
$$ 176016 -75336 118476 441417 227070 103346 221198 443511 471476 390904 280245
13771B80245j7667j00587j39787K02399j64552k83010K18620K82021O9741j97205
$$ 280245 262578 161991 22204 224603 60051 -222959 -4339 277682 347423 150218
13761A50218j74325K14050J54369k38602k64583J5225J78030k3544m8588k5414
$$ 150218 -24107 189943 344312 105710 -158873 -143648 34382 10838 -37750 -63164
13751f3164J89998n8860o3543j75259N8487k04164j49058J53448K5452K8731Q8693
$$ -63164 126834 67974 4431 -170828 -112341 -316505 -465563 -312115 -286663 -257932 -169239
13740a69239J93577J21931J330N6259L3101L58007P6071l4305k39464K71800o2279
$$ -169239 24338 146269 147599 203858 236959 594966 671037 636732 397268 669068 606789
13729F06789l38893k0689K79176J88796j19197j77345n1M0713l76133k75843K37180
$$ 606789 267896 247207 526383 715179 595982 418637 418586 459299 83166 -192677 44503
13718D4503M26198K48626j32287l7911j77941P1698o5931l95186j1690P7992j77037
$$ 44503 470701 719327 587040 549129 371188 442886 376955 -18231 -29921 48071 -128966
13707a28966J74661J31358m0871j98576q2612J73111J96730O0813M3275j48030
$$ -128966 45695 177053 136182 -62394 -145006 28105 224835 285648 328923 180893
13697A80893j93172p815J00649k8443L2072j0159j15414N7473q5290P4030N4451
$$ 180893 -12279 -20094 80555 52112 84184 74025 -41389 16084 -69206 4824 59275
13686E9275j54464J55093J64292n7083l8757k32398n8675P9696K00530J42931
$$ 59275 -95189 59904 224196 167113 128356 -104042 -162717 -83021 117509 260440
13676B60440L5480j78009m6164k19573j05754J20208n489J610J30332m400J30470
$$ 260440 295920 117911 71747 -147826 -253580 -133372 -138861 -137251 -6919 -11319 119151
13665A19151J02709J44557k19650j02474m5257M2736M48266p3414j75383k7930
$$ 119151 221860 366417 146767 44293 -964 41772 490038 416624 241241 213311
13655B13311j07171J21919j09094n3924L2508J69256j14219k12838o7969K15190
$$ 213311 106140 228059 118965 65041 97549 266805 152586 -60252 -128221 86969
13645H6969L0350l7431J3700K94738L3792k96372j52117n8783j24714j09255N7222
$$ 86969 117319 79888 93588 388326 422118 125746 -26371 -85154 -209868 -319123 -261901
13634b61901k68289J48603L44053J02321k8412k74405p1729k8945J52479n9772
$$ -261901 -530190 -381587 -37534 64787 36375 -238030 -309759 -338704 -186225 -245997
13624b45997J39189L11984j04340j3709J06900k58484k26925k442l209J32242
$$ -245997 -106808 205176 100836 87127 194027 -64457 -291382 -293824 -297033 -164791
13614a64791K93522J07245j65891N1793J61351P3786k9259j52722J5776k83976
$$ -164791 128731 235976 70085 121878 283229 357015 327756 175034 190810 -93166
13604i3166j66259j61552p2436M57842L78830J73639K33465l14963j98294k41585
$$ -93166 -259425 -420977 -493413 -35571 343259 516898 750363 435400 237106 -4479
13594d479j12907j80435r9731j3648Q75k99971J44658K56524M20024k44918l39425
$$ -4479 -117386 -297821 -397552 -411200 -410325 -710296 -565638 -309114 110910 -134008 -473433
13583d73433j16906P0819k2438J14234J11724K92189L36952j39729J03750n4393
$$ -473433 -590339 -519520 -541958 -427724 -316000 -23811 313141 173412 277162 222769
13573B22769j60122j44500J72331K63301p6613k23001M8244J30592k2890k62318
$$ 222769 62647 -81853 90478 353779 277166 54165 102409 233001 210111 -52207
13563e2207J8867P2119K6874N0751O5230J29865L09985j71225j84945q5101M0369
$$ -52207 -33340 38779 65653 116404 181634 311499 621484 450259 265314 180213 220582
13552B20582r800k04309j50186n4509J25862L07640j90653q8969J61831R2763
$$ 220582 210782 6473 -143713 -198222 -72360 235280 44627 -44342 117489 210252
13542B10252N7864k43894j95502K06324J71548J70764J06648p9500k30317l16560
$$ 210252 268116 24222 -171280 35044 206592 377356 484004 404504 174187 -142373
13532a42373K81453N7493j15331j1936q6308q4312J64893j39159J82375J10883
$$ -142373 139080 196573 81242 69306 -17002 -101314 63579 -75580 106795 217678
13522B17678P5897k46658L1665K47373l30799m2659J85062J3449j86456Q4177
$$ 217678 293575 46917 78582 325955 -4844 -47503 137559 151008 -35448 48729
13512D8729J75904j35826J4729k96513J35052O4599j31279n7420j4945q5667J95121
$$ 48729 224633 88807 103536 -192977 -57925 6674 -124605 -182025 -196970 -282637 -87516
13501h7516N1654L41054q1289j19934O2472K27470k69263j38571j49047n7298
$$ -87516 -35862 305192 223903 103969 166441 393911 124648 -13923 -162970 -220268
13491b20268J65668K79855R4066j77812j60297j6432J1122m0536j6352j85062
$$ -220268 -54600 225255 319321 141509 -18788 -35220 -24098 -64634 -80986 -266048
13481b66048k19309l6692l1014Q9874k41585j454N30232K68125J52634J06915
$$ -266048 -485357 -522049 -553063 -463189 -704774 -706228 -175996 92129 244763 351678
13471C51678j76764n2815j28065J58831J91923J66461J44665p8493j37679l04856
$$ 351678 174914 122099 -5966 152865 344788 511249 655914 577421 439742 134886
13461A34886Q6761j83772m4123l01483K8256L33202J78410j74552m93720Q4884
$$ 134886 221647 37875 -6248 -307731 -279475 53727 232137 57585 -436135 -351251
13451c51251J10164J81093p0059o8000J14131K58723r4801j69652j13775L7027
$$ -351251 -241087 -59994 -130053 -198053 -83922 174801 80000 -89652 -203427 -166400
13441a66400M26043R4550O4622j50875j68398J43233k9759j65127L1917J48009
$$ -166400 259643 354193 418815 267940 99542 242775 213016 47889 79806 227815
13431B27815J40080o0825J28866M6346j52352j31950k87449m11970j3943K69444
$$ 227815 367895 307070 435936 482282 329930 197980 -89469 -501439 -515382 -245938
13421b45938K43370Q2403L61411K55055m2002j42314j24324j71204k15602j71029
$$ -245938 -2568 79835 441246 696301 654299 511985 387661 216457 855 -170174
13411a70174J48806L83725J21149l79600r4174K09266J24060L7555k1933j39410
$$ -170174 -21368 362357 483506 103906 9732 218998 343058 380613 358680 219270
13401B19270L4180j77129J59680N2822p6558j93146j130O9356j74759r2500O5537
$$ 219270 253450 76321 236001 288823 212265 19119 17989 87345 -87414 -179914 -114377
13390a14377k30022J1342J15448J80934Q1839j56817l04780q993K13662L35942
$$ -114377 -344399 -333057 -217609 -36675 45164 -111653 -416433 -425426 -211764 124178
13380A24178M5248n1191j53647m7101j07944j84580l29055L6925K44005j3880
$$ 124178 169426 118235 -35412 -82513 -190457 -375037 -704092 -667167 -423162 -437042
$$ [...]
##END NTUPLES=NMR SPECTRUM
##END=
