##TITLE=Analysis number 318100
Compound Code cc 08801
Project Code adrs
Chemist Name molekula
##JCAMPDX= 6.0         $$ Bruker NMR JCAMP-DX V2.0
##DATA TYPE= NMR SPECTRUM
##DATA CLASS= NTUPLES
##ORIGIN= Bruker BioSpin GmbH
##OWNER= nmr
$$ XWIN-NMR		Version 3.5
$$ Wed Mar 15 11:36:53 2006 GMT Standard Time (UT+0h)  MAYBRIDGE\nmr@NMR_250MHZ
##.OBSERVE FREQUENCY= 250.131544655141
##.OBSERVE NUCLEUS= ^1H
##.ACQUISITION MODE= SIMULTANEOUS (DQD)
##.ACQUISITION SCHEME= undefined
##.AVERAGES= 16
##.DIGITISER RES= 18
##SPECTROMETER/DATA SYSTEM= dpx250
##.PULSE SEQUENCE= zg30
##.SOLVENT NAME= DMSO
##.SHIFT REFERENCE= (INTERNAL, DMSO, 0, 16.522)
##AUDIT TRAIL= $$ (NUMBER, WHEN, WHO, WHERE, WHAT)
$$ ##TITLE= Audit trail, XWIN-NMR		Version 3.5
$$ ##JCAMPDX= 5.01
$$ ##ORIGIN= Bruker BioSpin GmbH
$$ ##OWNER= nmr
$$ C:\u/data/dgb/nmr/ADRS/750/pdata/1/auditp.txt
$$ ##AUDIT TRAIL=  $$ (NUMBER, WHEN, WHO, WHERE, WHAT)
(   1,<2006-03-15 11:36:29.77 +000>,<MAYBRIDGE\nmr>,<NMR_250MHZ>,
      <created by zg, POWCHK disabled, PULCHK disabled
       configuration hash MD5:
       84 BC 41 DB A1 6E 1D 46 DA 25 12 A5 C1 ED C5 3A
       data hash MD5: 64K
       DC F2 51 B5 E8 E8 41 DA CC 31 A4 24 03 25 03 16>)
(   2,<2006-03-15 11:36:43.34 +000>,<MAYBRIDGE\nmr>,<NMR_250MHZ>,
      <Start of raw data processing
       ef LB = 0.3 FT_mod = 6 PKNL = 1 SI = 32K 
       data hash MD5: 32K
       4E 4C 00 93 11 B7 2A 62 11 0B A2 78 F2 72 88 12>)
(   3,<2006-03-15 11:36:45.55 +000>,<MAYBRIDGE\nmr>,<NMR_250MHZ>,
      <apk 
       data hash MD5: 32K
       9F 5C 3C 9E 70 7A 13 B9 F9 6A 56 9B BD 8F 00 F8>)
(   4,<2006-03-15 11:36:46.34 +000>,<MAYBRIDGE\nmr>,<NMR_250MHZ>,
      <abs ABSG = 5 
       data hash MD5: 32K
       5D 58 AE 3A BE 4C F6 EB B2 8E 77 F7 0E 21 53 BF>)
$$ ##END=
$$ 
$$ hash MD5
$$ 5A 25 0F 27 51 F5 DD 6D 89 F3 65 9C 75 DE 85 30
##$RELAX= 
##$RELAX= 
##$RELAX= 
##$RELAX= 
##$RELAX= 
##$RELAX= 
##$RELAX= 
$$ Bruker specific parameters
$$ --------------------------
##$DU= <C:\u>
##$EXPNO= 750
##$NAME= <ADRS>
##$PROCNO= 1
##$TYPE= <nmr>
##$USER= <dgb>
##$AMP= (0..31)
100 100 100 100 100 100 100 100 100 100 100 100 100 100 100 100 100 100 
100 100 100 100 100 100 100 100 100 100 100 100 100 100 
##$AQSEQ= 0
##$AQ_mod= 3
##$AUNM= <au_zg>
##$AUTOPOS= <20 >
##$BF1= 250.13
##$BF2= 250.13
##$BF3= 250.13
##$BF4= 250.13
##$BF5= 500.13
##$BF6= 500.13
##$BF7= 500.13
##$BF8= 500.13
##$BYTORDA= 1
##$CFDGTYP= 0
##$CFRGTYP= 5
##$CHEMSTR= <none>
##$CNST= (0..31)
1 1 145 1 1 1 1 1 1 1 1 1 1 1 1 1 1 1 1 1 1 1 1 1 1 1 1 1 1 1 1 1 
##$CPDPRG= <>
##$CPDPRG1= <>
##$CPDPRG2= <>
##$CPDPRG3= <>
##$CPDPRG4= <mlev>
##$CPDPRG5= <mlev>
##$CPDPRG6= <mlev>
##$CPDPRG7= <mlev>
##$CPDPRG8= <mlev>
##$CPDPRGB= <>
##$CPDPRGT= <>
##$D= (0..31)
0 1 0 0 0 0 0 0 0 0.06 0 0 0 0 0 0 0.0002 0 0 0 0 0 0 0 0 0 0 0 0 0 0 
0 
##$DATE= 1142422588
##$DBL= (0..7)
120 120 120 120 120 120 120 120 
##$DBP= (0..7)
150 150 150 150 150 150 150 150 
##$DBP07= 0
##$DBPNAM0= <>
##$DBPNAM1= <>
##$DBPNAM2= <>
##$DBPNAM3= <>
$$ [...]
##$SUBNAM6= <"">
##$SUBNAM7= <"">
##$SUBNAM8= <"">
##$SUBNAM9= <"">
##$SW= 20.6930455092707
##$SWIBOX= (0..15)
0 0 3 0 0 0 0 0 0 0 0 0 0 0 0 0 
##$SW_h= 5175.983436853
##$TD= 65536
##$TD0= 1
##$TE= 294.16
##$TE2= 300
##$TE3= 300
##$TEG= 300
##$TL= (0..7)
0 120 120 120 120 120 120 120 
##$TP= (0..7)
150 150 150 150 150 150 150 150 
##$TP07= 0
##$TPNAME0= <>
##$TPNAME1= <>
##$TPNAME2= <>
##$TPNAME3= <>
##$TPNAME4= <>
##$TPNAME5= <>
##$TPNAME6= <>
##$TPNAME7= <>
##$TPOAL= (0..7)
0.5 0.5 0.5 0.5 0.5 0.5 0.5 0.5 
##$TPOFFS= (0..7)
0 0 0 0 0 0 0 0 
##$TUNHIN= 0
##$TUNHOUT= 0
##$TUNXOUT= 0
##$USERA1= <user>
##$USERA2= <user>
##$USERA3= <user>
##$USERA4= <user>
##$USERA5= <user>
##$V9= 5
##$VALIST= <valist>
##$VCLIST= <CCCCCCCCCCCCCCC>
##$VD= 0
##$VDLIST= <DDDDDDDDDDDDDDD>
##$VPLIST= <PPPPPPPPPPPPPPP>
##$VTLIST= <TTTTTTTTTTTTTTT>
##$WBST= 1024
##$WBSW= 4
##$XGAIN= (0..3)
0 0 0 0 
##$XL= 0
##$YL= 0
##$YMAX_a= 219509
##$YMIN_a= -309874
##$ZGOPTNS= <>
##$ZL1= 120
##$ZL2= 120
##$ZL3= 120
##$ZL4= 120
##$ABSF1= 16.522
##$ABSF2= -4.171173
##$ABSG= 5
##$ABSL= 3
##$ALPHA= 0
##$AQORDER= 0
##$ASSFAC= 0
##$ASSFACI= 0
##$ASSFACX= 0
##$ASSWID= 0
##$AUNMP= <proc_1d>
##$AZFE= 0.1
##$AZFW= 0.1
##$BCFW= 0
##$BC_mod= 0
##$BYTORDP= 0
##$COROFFS= 0
##$CY= 12.5
##$DATMOD= 1
##$DC= 0
##$DFILT= <>
##$DTYPP= 0
##$F1P= 14.0000005364418
##$F2P= -0.99999901652339
##$FCOR= 0.5
##$FTSIZE= 32768
##$FT_mod= 6
##$GAMMA= 0
##$GB= 0
##$INTBC= 1
##$INTSCL= 1
##$ISEN= 128
##$LB= 0.3
##$LEV0= 0
##$LPBIN= 0
##$MAXI= 10000
##$MC2= 0
##$MEAN= 0
##$ME_mod= 0
##$MI= 0
##$NCOEF= 0
##$NC_proc= -5
##$NLEV= 6
##$NOISF1= 0
##$NOISF2= 0
##$NSP= 0
##$NTH_PI= 0
##$NZP= 0
##$OFFSET= 16.522
##$PC= 1
##$PHC0= 163.5488
##$PHC1= 11.7982
##$PH_mod= 1
##$PKNL= yes
##$PPARMOD= 0
##$PSCAL= 4
##$PSIGN= 0
##$REVERSE= no
##$SF= 250.13
##$SI= 32768
##$SIGF1= 0
##$SIGF2= 0
##$SINO= 400
##$SIOLD= 32768
##$SREGLST= <1H.DMSO>
##$SSB= 0
##$STSI= 32768
##$STSR= 0
##$SW_p= 5175.98343685301
##$SYMM= 0
##$S_DEV= 0
##$TDeff= 65536
##$TDoff= 0
##$TI= <Analysis number 999999
Compound Code 99
Book Reference 9
Project Code 9>
##$TILT= no
##$TM1= 0
##$TM2= 0
##$TOPLEV= 0
##$USERP1= <user>
##$USERP2= <user>
##$USERP3= <user>
##$USERP4= <user>
##$USERP5= <user>
##$WDW= 1
##$XDIM= 32768
##$YMAX_p= 502405300
##$YMIN_p= -868728
$$ End of Bruker specific parameters
$$ ---------------------------------
##NTUPLES= NMR SPECTRUM
##VAR_NAME=  FREQUENCY,     SPECTRUM/REAL,   SPECTRUM/IMAG
##SYMBOL=    X,             R,               I
##VAR_TYPE=  INDEPENDENT,   DEPENDENT,       DEPENDENT
##VAR_FORM=  AFFN,          ASDF,            ASDF
##VAR_DIM=   32768,         32768,           32768
##UNITS=     HZ,            ARBITRARY UNITS, ARBITRARY UNITS
##FACTOR=    0.157963299565203, 1,           1
##FIRST=     4132.6476996994, 0,             0
##LAST=      -1043.33573715361, 0,           0
##MIN=       -1043.33573715361, -868728,     0
##MAX=       4132.6476996994, 502405300,     0
$$ Real data points
##PAGE= N=1
##DATA TABLE= (X++(R..R)), XYDATA
$$ [...]
24092B42149J66760N5510j06830j84364O3396L93955j07480o8397j60182N6041
$$ 242149 408909 464419 357589 173225 236621 630576 523096 454699 294517 350558
24082C50558P4406R4995j19892k96205k2420J57820N8322M7821Q9386o1546j43935
$$ 350558 424964 519959 400067 103862 81442 239262 297584 345405 434791 373245 229310
24071B29310m6732p1473p2184Q1715R9175L45047j44770j50268m4760N3324r0989
$$ 229310 182578 111105 38921 120636 219811 564858 420088 269820 225060 278384 187395
24060A87395q279O3741k51637J22097Q3479K04655J84220j11718q8185l0370m7242
$$ 187395 179116 242857 -8780 113317 196796 401451 585671 473953 385768 355398 308156
24049C08156j35646P1755K39820K6109q7119k26329J43632j23398K25573J73440
$$ 308156 172510 244265 484085 510194 423075 196746 340378 216980 442553 615993
24039F15993j85668O3052K9809M2501N6948J88905j3282j14482j42176q7092j94042
$$ 615993 430325 493377 523186 565687 622635 811540 798258 683776 541600 454508 260466
24028B60466k10538O2402J35543Q2268J89820K61875K3230k7452N0072n9114k24637
$$ 260466 49928 112330 247873 330141 519961 781836 805066 777614 827686 768572 543935
24017E43935k84526P549L789n3717n0990J20811O8124m650K4465J46133K7121
$$ 543935 259409 266958 270747 217030 166040 286851 354975 350325 374790 520923 548044
24006E48044j00178k45231j5004N8365M1419r8555K00461M2549k57816k35319
$$ 548044 447866 202635 187631 245996 287415 188860 389321 431870 174054 -61265
23996f1265K13428K02169O8285m2194M2668N7282L7548j85249j4569m5675L4j6012
$$ -61265 152163 354332 422617 380423 423091 480373 517921 332672 318103 272428 272462 256450
23984B56450M3108M2768J30885j8177r3414N4739J40625l7694r8651j47582K4663
$$ 256450 299558 342326 473211 455034 361620 416359 556984 519290 420639 273057 297720
23973B97720o8943j60808K09441O8555L5584p7902j77535o3000K16863J95234
$$ 297720 228777 67969 277410 345965 381549 303647 126112 63112 279975 475209
23963D75209K1030o8765N2941N6400k6566M4846j11752p4631K76549P459k22317
$$ 475209 496239 427474 480415 536815 510249 555095 443343 368712 645261 652720 430403
23952D30403j68173J79748J24074J29254n3389l36493j9373l074p7308k1566J51878
$$ 430403 262230 441978 566052 695306 641917 305424 286051 282977 205669 184103 335981
23941C35981K47209l7266j66251p6584K42234j68354L2766J31474M5691p4484
$$ 335981 583190 545924 379673 303089 545323 376969 409735 541209 586900 512416
23931E12416q3235l37655j56308Q5747K67408j30812q8000R476j13319K55786
$$ 512416 429181 91526 -64782 20965 288373 157561 69561 79037 -34282 221504
23921B21504L57488L0315K692p4777j51939L7758q4725j42682N816N1292k67473
$$ 221504 578992 609307 611999 537222 385283 423041 338316 195634 201450 252742 -14731
23910a4731K5731K39515J98228J32709L18092r7154k17052j98825k0323n7090
$$ -14731 11000 250515 448743 581452 899544 802390 585338 386513 366190 309100
23900C09100j42694k77347J80105L33362r0827r8493j2256K02790N9925j09973
$$ 309100 166406 -110941 69164 402526 311699 213206 200950 403740 463665 353692
23890C53692j76909k4358J33832K25823j08222j24289J83013k14542j77011j1022
$$ 353692 176783 152425 286257 512080 403858 279569 462582 248040 71029 60007
23880F0007R8900K66115N3853j930j05154q4177J24903N403R3545Q3304l3688
$$ 60007 158907 425022 478875 476945 371791 287614 412517 417920 511465 594769 561081
23869E61081P125M6361n0745P2650j21043L6678n0521J3363M8084M2967q1036
$$ 561081 568206 614567 563822 636472 515429 552107 501586 514949 563033 606000 524964
23858E24964j81793m2927q1039O253l6448p596K97249J05716k44045j60958r5960
$$ 524964 343171 300244 219205 225458 189010 181414 478663 584379 340334 179376 83416
23847H3416J42910J32478m009k02361k7938R8488J4240J04679J74432k8257p4881
$$ 83416 226326 358804 354795 152434 124496 222984 237224 341903 516335 488078 413197
23836D13197l3109o0010r5865j4031j3117l984n602R1807k2337j06878L3865J89318
$$ 413197 380088 320078 224213 210182 197065 193081 187479 279286 256949 150071 183936 373254
23824C73254o8250k9354j54588o4904K34894R3728o9333q8328j04593K60009L3986
$$ 373254 305004 275650 121062 56158 291052 384780 315447 227119 122526 382535 416521
23813D16521j40726j27469L2070K42790p940k6569p954j48969j340j6599K00252
$$ 416521 275795 148326 180396 423186 415246 388677 380723 231754 230414 213815 414067
23802D14067O5886P8120p9015o5946j10010p7722O0186q4621J3916P7192J01149
$$ 414067 479953 558073 479058 413112 303102 225380 285566 200945 214861 292053 393202
23791C93202j22060o413p3420k09756P8292p4023K7781J72477o312J88839R0896
$$ 393202 271142 264729 191309 -18447 59845 -14178 13603 186080 179768 368607 459503
23780D59503N3866j06003N7366K14050n8563m4448Q4050k76471j698O9353Q9682
$$ 459503 513369 407366 464732 678782 620219 575771 659821 383350 381652 451005 540687
23769E40687m8770k39017j59960M8674L2828m0857J05151J44851J0089k6678O5913
$$ 540687 491917 252900 92940 141614 174442 133585 238736 383587 393676 366998 432911
23758D32911p7635p1347j50277j59798k1675q1302J08194q5698O0022Q408M6401
$$ 432911 355276 283929 133652 -26146 -47821 -129123 -20929 -106627 -46605 -38197 8204
23747H204r8320O7306L32219J31957q2747m4626j15334K5505K06348N8807k72211
$$ 8204 -90116 -22810 309409 441366 358619 313993 198659 224164 430512 489319 217108
23736B17108p1678J38194j12669L2338M9309O6096j6704J91237K1377j24559k34538
$$ 217108 145430 283624 170955 203293 252602 318698 301994 493231 514608 390049 155511
23725A55511k6629J48967p1508o1034q4439J00183K20940K9557j86090k86386
$$ 155511 128882 277849 206341 145307 60868 161051 381991 411548 225458 -60928
23715f0928q6782K18325J38926K02841r4898n5027m1563r2053O067P4509J67986
$$ -60928 -147710 70615 209541 412382 317484 262457 220894 128841 134908 209417 377403
23704C77403J05600L3192l23344J18744J56172O9801j3772R4863o5856K5158l1900
$$ 377403 483003 516195 192851 311595 467767 537568 523796 618659 552803 577961 546061
23693E46061l466Q900k85505k96405j61612O7591K31477L0808k4622L5167N9661
$$ 546061 542595 551495 265990 -30415 -192027 -124436 107041 137849 113227 148394 208055
23682B08055j34595o6615J2956J39942r2265J39593J28350l5808q7623J35949
$$ 208055 73460 6845 19801 159743 67478 207071 335421 299613 211990 347939
23672C47939J86634m4184j19695j74996j83453P4127m1196p6270q2859o4639Q6794
$$ 347939 534573 490389 370694 195698 12245 86372 45176 -31094 -113953 -178592 -91798
23661i1798J41009O1892j30359m1053O0456R9683j07312l18257J62237J2008J12318
$$ -91798 49211 111103 -19256 -60309 147 99830 -7482 -325739 -163502 -151494 -39176
23650c9176M4696l7920L0165J10926K85441J36949P6378K0848k92593m50027M5166
$$ -39176 5520 -32400 -2235 108691 394132 531081 607459 628307 335714 -114313 -69147
23639f9147K42655K87277J31053j32484j59923k04345o0361j37061k0685l0941
$$ -69147 173508 460785 591838 459354 299431 95086 34725 -102336 -123021 -153962
23629a53962O9703O1195o7130R5958j17479J29992K41360M6019k7521j44609j53959
$$ -153962 -84259 -23064 -90194 5764 -111715 18277 259637 305656 278135 133526 -20433
23618b0433N5696K46897L0492J51399p414l6730j58443L7970P3769N6880j41069
$$ -20433 35263 282160 312652 464051 456637 419907 261464 299434 373203 430083 289014
23607B89014l2059K3735r3040j56477J12370j8394o3370J90140O4576J04194K58430
$$ 289014 256955 280690 187650 31173 143543 125149 61779 251919 316495 420689 679119
23596F79119J51464J7793k34304j78113K0199l8050j23703q0161Q0213J05868
$$ 679119 830583 848376 614072 435959 456158 418108 294405 214244 294457 400325
23586D00325j49140r7056N8267P6739o6978M473n4429K3910L9418j32016l4051
$$ 400325 251185 154129 212396 289135 222157 226630 172201 196111 235529 103513 69462
23575F9462J24930K38207k3505N6939j94423k03994J02936J98959j733j25825
$$ 69462 194392 432599 409094 466033 271610 67616 170552 369511 367778 241953
23565B41953K58147j89430k23552m0746o8367k57650L3925L9438J5856j3277R9304
$$ 241953 500100 310670 87118 46372 -21995 -279645 -245720 -206282 -190426 -203703 -104399
23554a04399P9189J63704J49174p3040j31871q4485Q8110M0252P5560O662m1214
$$ -104399 -25210 138494 287668 214628 82757 -1728 86382 126634 202194 208856 167642
23543A67642j77252M34k0327O4475N7367K2840n0171j0165M2774J6992J01362
$$ 167642 -9610 -9176 -29503 34972 92339 115179 65008 54843 97617 114609 215971
23532B15971j35176j59489J20127K01378P6198O8898j72055M4992K44257j386
$$ 215971 80795 -78694 41433 242811 319009 387907 215852 260844 505101 503715
23522E03715Q3421M6263p5324j01346K811j0459j69640r6234L4556k86281M5090
$$ 503715 587136 633399 558075 456729 459540 449081 279441 183207 217763 -68518 -23428
23511b3428K46905K26068q1956l3052P422j72184P7563N6P26j37499o7764p3750
$$ -23428 223477 449545 367589 334537 341959 169775 247338 247394 248120 110621 42857 -30893
23499c0893P2641o1660J5279J25647P8797j24604r7536J22266K6461l1265L3363
$$ -30893 41748 -19912 -4633 121014 199811 75207 -22329 99937 126398 95133 128496
23488A28496j81280P176J2982J52991L902J32958Q7974J78932q7835k97546q9944
$$ 128496 -52784 -45608 -32626 120365 124267 257225 345199 524131 436296 138750 48806
23477D8806J44843K8767j96364j17228J22528N9650L9477N2267o9923L6524j34873
$$ 48806 193649 222416 26052 -91176 31352 91002 130479 182746 112823 149347 14474
23466A4474q0281n9755J34841K38443O1199J17765o2864N3381J18183l5011j82069
$$ 14474 -65807 -125562 9279 247722 308921 426686 363822 417203 535386 500375 318306
23455C18306q3572l03627j52850j98819r0259N1789K09793k0368J26250J69218
$$ 318306 234734 -68893 -221743 -420562 -510821 -459032 -249239 -269607 -143357 25861
23445B5861j41340L0906J01443P0170J50830q7872M9876k0542n4625j07062O5621
$$ 25861 -115479 -84573 16870 87040 237870 149998 199874 179332 124707 17645 83266
23434H3266J71108k0073k11205j01147N4287K1712O4249l4623J91348J29079j28779
$$ 83266 254374 234301 23096 -78051 -23764 -2052 62197 27574 218922 348001 219222
23423B19222j00126K22673J39868j60319j09848J00138P8776q2510l6621M6549
$$ 219222 119096 341769 481637 321318 211470 311608 390384 307874 271253 317802
23413C17802n7197q2142n8118j13942J71512L6335L5301j2911P4620r936l0097
$$ 317802 260605 178463 120345 6403 177915 214250 249551 236640 311260 301324 271227
23402B71227k4907k04763j37812K21718K56288j4428j35317j59231k06432p4286
$$ 271227 246320 41557 -96255 125463 381751 367323 232006 72775 -133657 -207943
23392b07943J34684R5304L5223j2166n2018J72458J93400J28939n7187j12478
$$ -207943 -73259 22045 57268 45102 -6916 165542 358942 487881 430694 318216
23382C18216p2164J01390j10944r7566J85858J30726k27667k23400l7424J36054
$$ 318216 246052 347442 236498 138932 324790 455516 227849 4449 -32975 103079
23372A03079J08613J65688o0576O8182N317q1980l6276P1007o9556j87132j75162
$$ 103079 211692 377380 316804 384986 390303 308323 272047 343054 273498 86366 -88796
23361h8796N5590R9166R4919j12513K4633q4994k08467j8028j44276n9574J91976
$$ -88796 -33206 65960 160879 48366 72999 -11995 -220462 -238490 -382766 -442340 -250364
23350b50364K17370K5623M7279Q6591P2726p1272j62355q4589J48212K35683J11620
$$ -250364 -32994 -7371 39908 126499 199225 127953 -34402 -118991 29221 264904 376524
23339C76524K4640N6495k82831j77552Q1016j57582l8612o1677K39673Q8583n4762
$$ 376524 401164 457659 174828 -2724 78292 -79290 -117902 -179579 60094 148677 93915
23328I3915L0297j3899j57053j1181k015K4051n6180j5401m5229n9815K15855
$$ 93915 124212 110313 -46740 -57921 -59936 -35885 -92065 -107466 -152695 -212510 3345
23317C345J38721p433Q5007p1061l5161j32952J6921K1963K70227N4034k2411
$$ 3345 142066 134633 219640 148579 113418 -19534 -2613 19350 289577 343611 321200
23306C21200k67851j04726O5590j6779j7337J42404k3729k38833R997J05227k7985
$$ 321200 53349 -51377 14213 -2566 -19903 122501 98772 -140061 -130064 -24837 -52822
23295e2822r9410m9249r712N0700K59294O0641O1885J36067j34537M3990q0289
$$ -52822 -152232 -201481 -211193 -160493 98801 159442 221327 357394 222857 266847 186558
23284A86558R5606P5237j47286K9595k5046L70J15069j6810j11837n6988j52743
$$ 186558 282164 357401 210115 239710 214664 215034 330103 313293 201456 144468 -8275
23273h275P1346J34885J6440p8457k23859j76941Q9498J37296J53984L7475n2826
$$ -8275 63071 197956 214396 135939 -87920 -264861 -175363 -38067 115917 153392 100566
23262A00566J94127N2520r4005k4976K06279p0137j47998j93434p1219j51600
$$ 100566 294693 347213 253208 228232 434511 364374 216376 22942 -48277 -199877
23252a99877J5359L54990J79953J28295J03282j09668k27041j58234j30169R3607
$$ -199877 -184518 170472 350425 478720 582002 472334 245293 87059 -43110 50497
23242E0497p5725l7074L3991K32226J21858N0323j23781k11688l5253M3207O4157
$$ 50497 -25228 -62302 -28311 203915 325773 376096 252315 40627 5374 48581 112738
23231A12738L7693M6212L8128n5475j14627L9968Q4619j9943k22572N2410O8936
$$ 112738 150431 196643 234771 179296 64669 104637 189256 169313 -53259 -849 68087
23220F8087j51477j07471j95525J69557J94394j01578J15045R3828p8268m439
$$ 68087 -83390 -190861 -386386 -216829 -22435 -124013 -8968 84860 6592 2153
23210B153l6486J69585j687J665N1721K52993J806j81640k50178j42364j74443
$$ 2153 -34333 135252 133565 135230 186951 439944 441750 260110 9932 -132432 -306875
23199c06875J80631J52845P744J22589R3622q2096Q1053J25399K5089J4995p7661
$$ -306875 -126244 26601 34345 156934 250556 168460 249513 374912 400001 414996 337335
23188C37335l91107j41493J66979J46350k10374k29009j71880J74474K17765p762
$$ 337335 -53772 -195265 -28286 118064 -92310 -321319 -493199 -318725 -100960 -108722
23178a08722M6619J01452K9473R3208J90022O0715k03045N4553j03633j83920
$$ -108722 -62103 39349 68822 162030 352052 412767 209722 264275 160642 -23278
23168b3278L3157J39499l0911j64264j45J31397j63545p7047J24425J73557j10273
$$ -23278 9879 149378 118467 -45797 -45942 85455 -78090 -155137 -30712 142845 32572
23157C2572j55630k57322O1929K35272L02435q2741j93348N8218K37763J25414
$$ 32572 -123058 -380380 -318451 -83179 219256 136515 -56833 1385 239148 364562
23147C64562j26662j99301o8034r0653L7344K11881P9701j01902j1200J46607
$$ 364562 237900 38599 -29435 -120088 -82744 129137 208838 106936 95736 242343
23137B42343M4937O0910p0746j62987m3623L8454K2175k6211j66654j08969O8435
$$ 242343 287280 348190 277444 114457 70834 109288 131463 105252 -61402 -170371 -101936
23126a01936K53823L0867k22055k09255J83715r5866R084n9584J52058M75701
$$ -101936 151887 182754 -39301 -248556 -64841 -160707 -151623 -211207 -59149 416552
23116D16552L6438j70754k95070R9870p4865O8814J02049o1114J45663J57530
$$ 416552 452990 282236 -12834 87036 12171 80985 183034 121920 267583 425113
23106D25113o8670J03079n3383j13151P2232N1466o4931r2290n5593n8791j08277
$$ 425113 356443 459522 406139 292988 365220 416686 351755 259465 203872 145081 36804
23095C6804k22699k9980R1696K6921M3551l9733J14063M2915j63256J79886L6588
$$ 36804 -185895 -215875 -124179 -97258 -53707 -93440 20623 63538 -99718 80168 116756
23084A16756L3815p2361M0622K42858R0217k05764L9656n4239J28376n3697K8010
$$ 116756 150571 78210 118832 361690 451907 246143 285799 231560 359936 306239 334249
23073C34249j95467M4016J11970J60815n8275k18654P7498m207j86465L233Q8924
$$ 334249 138782 182798 294768 455583 397308 178654 256152 251945 65480 68713 157637
23062A57637k5761M190N2330j28117p992J1352o1863j40326o3570k73844j028
$$ 157637 131876 136066 188396 60279 52287 63639 1776 -138550 -202120 -475964 -476992
23051d76992J85556L1427o9956P3242P6242k1815P2391K47605l7309j68594J57420
$$ -476992 -291436 -260009 -329965 -256723 -180481 -202296 -129905 117700 80391 -88203 69217
23040F9217k43332q7218j8094J9915Q7112N9862m818Q8340J67804K31073Q5067
$$ 69217 -174115 -261333 -279427 -259512 -172400 -112538 -117356 -29016 138788 369861 454928
23029D54928p7490k88876j95346r6308J8657L2392j28469Q0288K53392l1666J22368
$$ 454928 377438 88562 -106784 -203092 -184435 -152043 -280512 -200224 53168 21502 143870
23018A43870J1246r1281L8814K22450N3225q3340q4237j16505j2585m4536J51042
$$ 143870 155116 63835 102649 325099 378324 294984 210747 94242 81657 37121 188163
23007A88163j2248l5677N9962j37634N1695J34262k31391j96722r7427p0846J33384
$$ 188163 175915 140238 200200 62566 114261 248523 17132 -179590 -277017 -347863 -214479
22996b14479J60383j72614J5760Q180k02916P3876j18656J36586J07648k17645
$$ -214479 -54096 -226710 -210950 -202770 -405686 -331810 -450466 -313880 -206232 -423877
22986d23877j82450K07692j186J20110J31694N3417K4586Q2825K64835M0422k09133
$$ -423877 -606327 -398635 -399821 -279711 -148017 -94600 -70014 12811 277646 318068 108935
22975A08935o8310L9797J1072k01733j27838J14827J12644R3502j10675n1251
$$ 108935 40625 80422 91494 -110239 -238077 -123250 -10606 82896 -27779 -79030
22965g9030J10019J34062K13780J20075k15079J42540K7359j31641j01498j18843
$$ -79030 30989 165051 378831 498906 283827 426367 453726 322085 220587 101744
22955A01744j97043m3154o1311J15588n9995j50283j9757K6355K00017J59817
$$ 101744 -95299 -138453 -199764 -84176 -144171 -294454 -314211 -287856 -87839 71978
22945G1978j62161j22587j10378p4379J7186l8990J35203J26839j79985K58709
$$ 71978 -90183 -212770 -323148 -397527 -380341 -419331 -284128 -157289 -337274 -78565
22935g8565K57947N0524j52041J41348L7980R490K0957n7816J03194j06993j4290
$$ -78565 179382 229906 77865 219213 257193 266683 287640 229824 333018 226025 211735
22924B11735j6712j26726K8359J3214J04171K2734N0175J03489j30753j03330
$$ 211735 195023 68297 96656 109870 214041 236775 286950 390439 259686 156356
22914A56356j26320j7794J01542O924j65033j22019R711M5686J75796J36822j9147
$$ 156356 30036 12242 113784 120708 -44325 -166344 -156633 -110947 64849 201671 182524
22903A82524L1234R4318j81841j92802Q5818q4544N2609j38790m8326K2233P302
$$ 182524 213758 308076 126235 -66567 19251 -65293 -12684 -151474 -199800 -177567 -170265
22892a70265k4896J8988P4924L2979K8960L7730l8345K00138J00486n1127p7290
$$ -170265 -195161 -176173 -101249 -68270 -39310 -1580 -39925 160213 260699 209572 132282
22881A32282K7147N43p9289j07886o9631J70866J60229n2286j66296q7664q4425
$$ 132282 159429 159972 80683 -27203 -96834 74032 234261 181975 15679 -71985 -156410
22870a56410Q3276R5182j03081J14318K3742N0392Q962J35437j07673r016p6037
$$ -156410 -73134 22048 -81033 33285 57027 107419 116381 251818 144145 135129 59092
22859E9092k16734l8547K40571Q4928j64018j51700K9295R0967L93581J13540
$$ 59092 -157642 -196189 44382 129310 -34708 -186408 -157113 -66146 327435 440975
22849D40975p6910J7847J40279m3395p5516k8461n3290m6034k26590k65484O0402
$$ 440975 364065 381912 522191 478796 403280 374819 321529 275495 48905 -216579 -156177
22838a56177j5493Q4666j6338m3804k3200J62607m1538r9134O1499J18482m5516
$$ -156177 -171670 -87004 -103342 -147146 -170346 -7739 -49277 -148411 -86912 31570 -13946
22827a3946J6439r1403r7696m3282m7781j12297L24628J74085n9424j1227k03806
$$ -13946 2493 -88910 -186606 -229888 -277669 -389966 -65338 108747 49323 38096 -165710
22816a65710k3297Q9742j67834m0732p8492J17235J87285K1854n1270J6401n4558
$$ -165710 -189007 -99265 -267099 -307831 -386323 -269088 -81803 -59949 -111219 -94818 -149376
22805a49376Q2466P9131q804p3129j43583J59707J64980j69812n1185j15210l18569
$$ -149376 -66910 12221 3417 -69712 -213295 -53588 111392 -58420 -109605 -224815 -543384
22794e43384k1900K76883K33875Q8846o7477j32398J31548P5561M2559J05040
$$ -543384 -565284 -288401 -54526 34320 -33157 -165555 -34007 41554 84113 189153
22784A89153k21525k9433J27484j4981J54155l0021j51739n4494J39675R9835
$$ 189153 -32372 -61805 65679 50698 204853 174832 23093 -31401 108274 208109
22774B08109K7985L659L473P0244n679J43625o5067m7933k59892k05478j2529
$$ 208109 236094 239753 243226 313470 307791 451416 386349 338416 78524 -126954 -139483
22763a39483k4447L0113J61129K32782j10411p6470R4133j60015P557J26167p4048
$$ -139483 -163930 -133817 27312 260094 149683 73213 167346 7331 14888 141055 67007
22752F7007m3815k3650L0228r2082k1534J07708L2852P7549P4794j610J08547
$$ 67007 23192 -458 29770 -62312 -83846 23862 56714 134263 209057 207447 315994
22741C15994j9877P5803p5088j03094p5973j41572k2782j61229k33754j14741
$$ 315994 296117 371920 296832 193738 117765 -23807 -46589 -207818 -441572 -556313
22731e56313J35877K60770K35859P9407J8234n1939j17l8221K2192k56571r4983
$$ -556313 -420436 -159666 76193 155600 173834 121895 121778 83557 105749 -150822 -245805
22720b45805N0273J86005K1920p9977J7670J62888N7041q4911M9780M7091K9481
$$ -245805 -195532 -9527 12393 -67584 -49914 112974 170015 85104 134884 181975 211456
22709B11456k3520J6651j26085q9894R4452l16236J026J44053L18099j18364Q72
$$ 211456 187936 204587 78502 -11392 83060 -233176 -232150 -88097 230002 111638 112510
22698A12510J71526p254l2251J79554j8148l6120j45644L7489m5578p3806k93445
$$ 112510 284036 276782 244531 424085 405937 369817 224173 261662 216084 142278 -151167
22687a51167n0065k14180J13265K4885l9854o4103P1695R1679J04260k8202p7563
$$ -151167 -201232 -415412 -302147 -277262 -317116 -381219 -309524 -217845 -113585 -141787 -219350
22676b19350M0034L0402P8442L2083K31089K10053k14913k94840j86896P5069
$$ -219350 -179316 -148914 -70472 -38389 192700 402753 187840 -107000 -293896 -218827
22666b18827j9224J34761N3245j63472J73990J33526J18614J94241N2259k67943
$$ -218827 -238051 -103290 -50045 -213517 -39527 93999 212613 406854 459113 191170
22656A91170k08016L5413K07015K25022q3629j71445O7762J8321j75513j3394
$$ 191170 -16846 18567 225582 450604 366975 195530 263292 281613 106100 92706
22646I2706q5295l4685M8923n4795J1139J3136J52728J07831m3012k77755k5907
$$ 92706 7411 -27274 21649 -33146 -22007 -8871 143857 251688 208676 -69079 -94986
22635i4986k6777p0897J46309l3146m6207K84961K02591n8886j7636m0832k19038
$$ -94986 -121763 -192660 -46351 -79497 -125704 159257 361848 302962 285326 244494 25456
22624B5456k60192O4150N2892l4511K20453J2422k74470j18100M8503O6532K5139
$$ 25456 -234736 -170586 -117694 -152205 68248 80670 -193800 -311900 -263397 -196865 -171726
22613a71726Q8043n7289j62306P5821J39928j60251K4207J3801R0389J32078P7289
$$ -171726 -83683 -140972 -303278 -227457 -87529 -247780 -223573 -209772 -119383 12695 89984
22602H9984j82727j42501P9302n2336M8481J3276J01454O6882K105p5838O7980
$$ 89984 -92743 -235244 -155942 -208278 -159797 -146521 -45067 21815 23920 -51918 16062
22591A6062o5488j2901K57099j33251Q2091J09502K4660P5910r9795m6750o7529
$$ 16062 -49426 -62327 194772 61521 143612 253114 277774 353684 253889 207139 139610
22580A39610j36409k39186J22257J34507j38431l67319j30551O5814j37128J75627
$$ 139610 3201 -235985 -113728 20779 -117652 -484971 -615522 -549708 -686836 -511209
22570e11209K37321R5531P1184J27213J44172p374j79227L0971r3746p6277P7416
$$ -511209 -273888 -178357 -107173 20040 164212 156838 -22389 8582 -85164 -161441 -84025
22559h4025J10462J9866j47094j07845M4466J20624K7267k29381j23148K2106
$$ -84025 26437 46303 -100791 -208636 -164170 -43546 -16279 -245660 -368808 -346702
22549c46702o2246n7344J74215K5554J93790J79404q6885n9492Q6934K8316k18458
$$ -346702 -408948 -466292 -292077 -266523 -72733 106671 19786 -39706 47228 75544 -142914
22538a42914J06995K16136J92734j25941M9285L6994k2122r4340j02868j49712
$$ -142914 -35919 180217 372951 247010 296295 333289 311167 216827 113959 -35753
22528c5753m9994N1534N7840P8139j38276j94710L8546K10992j57073K746M4120
$$ -35753 -85747 -34213 23627 101766 -36510 -231220 -192674 18318 -138755 -136009 -91889
22517i1889m046N597j08462R4414p4886j36726o3170N5882Q2102Q2654K11353
$$ -91889 -95935 -90338 -198800 -104386 -179272 -315998 -379168 -323286 -241184 -158530 52823
22506E2823Q2873L6282M5891r2564j34824O4114n3215j29801r1396J06297O0988
$$ 52823 135696 171978 217869 125305 -9519 54595 1380 -128421 -219817 -113520 -52532
22495e2532J02332k3876j94885j10541o9099k08275L0472M8882O8380P7666n6540
$$ -52532 49800 25924 -168961 -279502 -348601 -556876 -526404 -477522 -409142 -331476 -388016
22484c88016J2323K00066j0297j0369J41339j78923j04711O6448j49406P2873
$$ -388016 -375693 -175627 -185924 -196293 -54954 -233877 -338588 -272140 -421546 -348673
22474c48673J78372j48401o2400L606j07440P3130K64232j46570j77288K76835
$$ -348673 -170301 -318702 -381102 -377496 -484936 -411806 -147574 -294144 -471432 -194597
22464a94597L78220J34348k15761j82222p3436j13937j06847O8940K15479O3614
$$ -194597 183623 317971 102210 -80012 -153448 -267385 -374232 -305292 -89813 -26199
22454b6199q3017j6107n0990M4576R2102m3374j5403p9518j04666J53421J9156
$$ -26199 -109216 -125323 -176313 -131737 -39635 -83009 -98412 -177930 -282596 -129175 -110019
22443a10019M4964J59529Q1860j66228K3292J44848q7765J23969n1101q3697p4817
$$ -110019 -65055 94474 176334 10106 33398 178246 90481 214450 163349 79652 4835
22432D835l115J68073J91919j9983j02836J63087O3531k28838o7960n0677j16947
$$ 4835 1720 169793 361712 341729 238893 401980 465511 236673 168713 118036 1089
22421A089o9494J5604J20481j30426Q4845R7531J01319j00187k40036J58463p271
$$ 1089 -68405 -52801 67680 -62746 22099 119630 220949 120762 -119274 39189 31918
22410C1918J5196J32346L9950R0743r0093n9594P9233J79571J6241j76944l2751
$$ 31918 47114 179460 219410 310153 220060 160466 239699 419270 435511 258567 225816
22399B25816R7802N7704K3962k29139j82913j8059J5960j73290Q9682J73234q417
$$ 225816 323618 381322 405284 176145 -6768 -24827 -8867 -182157 -92475 80759 72342
22388G2342p5785p3146J66878K08905k5349j34331j10577k05483k5143J57136
$$ 72342 -3443 -76589 90289 299194 273845 139514 28937 -176546 -201689 -44553
22378d4553J35480k4084j23146N049J27680K62342o9735q9806j8216k6199j61183
$$ -44553 90927 66843 -56303 -51254 76426 338768 269033 179227 161011 134812 -26371
22367b6371m7387P704R3283R4757M8323o9784j18705k017j4343k3312J87711L12726
$$ -26371 -73758 -66054 27229 121986 170309 100525 -18180 -20197 -34540 -57852 129859 442585
22355D42585K66653M8488j85818j70279j8282J9128O9792M6525J35379j91873
$$ 442585 709238 757726 571908 401629 383347 402475 472267 518792 654171 462298
22345D62298l00517p2300n8360J57857L2893J0526m3306j1942J8628K684j85136
$$ 462298 161781 89481 31121 188978 221871 232397 189091 177149 195777 198461 13325
22334A3325j44006q1015q7179q063K7784J85041J9828o9660j99423j62104j36887
$$ 13325 -130681 -211696 -298875 -306938 -279154 -94113 -74285 -143945 -343368 -505472 -642359
22323f42359K13408K87266N9881j90757j37575O4823O9270R0072P1705J9136p355
$$ -642359 -428951 -141685 -81804 -272561 -410136 -345313 -276043 -185971 -114266 -95130 -102485
22312a02485J41599k3572j77407J25029M9638j80552O8405J3396o6371l04701
$$ -102485 39114 15542 -161865 -36836 12802 -167750 -99345 -85949 -152320 -457021
22302d57021j12927K90015J17244k861p4374J46667J88433j48840j47942K4854
$$ -457021 -569948 -279933 -162689 -165550 -239924 -93257 95176 -53664 -201606 -176752
22292a76752K42358J81435J01093k2920k10022j87296K6599m1115j27072K3093
$$ -176752 65606 247041 348134 325214 115192 -72104 -45505 -86620 -213692 -190599
22282a90599p4819K5306j28763K6294L56926P1496j30594n5086J30146j20896
$$ -190599 -265418 -240112 -368875 -342581 14345 85841 -44753 -99839 30307 -90589
22272i0589j28035l8288r1105j27440J53104R63M2252R5263m8006n3659q6128
$$ -90589 -218624 -256912 -348017 -475457 -322353 -321390 -279138 -183875 -231881 -285540 -371668
22261c71668j07558Q5388L3990K3971P7401R8304N1678j8249m1824J09452M3866
$$ -371668 -479226 -393838 -359848 -335877 -258476 -160172 -108494 -126743 -168567 -59115 -15249
22250a5249j37399M8734P1362j11282j60865j83891J47628J96498K89942K36576
$$ -15249 -152648 -103914 -32552 -143834 -304699 -488590 -340962 -144464 145478 382054
22240C82054L9538j34767j30707j17238n7741j3647j52307K844K14851J98542
$$ 382054 421592 286825 156118 38880 -18861 -32508 -184815 -181971 32880 231422
22230B31422j51644m9180J19432k58488j55315R8278L4904k1278J25375R213Q3997
$$ 231422 79778 30598 150030 -108458 -263773 -165495 -130591 -151869 -26494 -17281 66716
22219F6716q3120J4508j90285M6898J23514J6205L18181j60983m7174J22210Q3478
$$ 66716 -16404 -1896 -192181 -145283 -21769 -5564 312617 151634 104460 226670 310148
22208C10148j81606o7492O4028p6296j06949M5883J117J94549K18729P0586j83777
$$ 310148 128542 61050 125078 48782 -58167 -12284 -11167 183382 402111 472697 288920
22197B88920j42035j26428l9903k12477l9775J50394R1564l9789r4512j02292
$$ 288920 146885 20457 -19446 -231923 -271698 -121304 -29740 -69529 -164041 -266333
22187b66333J41424l4511J10554J7468k8813o3326K9694o8337R2807J79338J04578
$$ -266333 -124909 -159420 -48866 -31398 -60211 -123537 -93843 -162180 -69373 109965 214543
22176B14543o1221q3217J89712j08580j89656J0036J25391K24088R9202j30701
$$ 214543 153322 70105 259817 151237 -38419 -28383 97008 321096 420298 289597
22166B89597j14778j23459p4413k0836J02793o084J77427m03j20755q7939m6571
$$ 289597 174819 51360 -23053 -43889 58904 52820 230247 229844 109089 21150 -25421
22155b5421J06612j6557R4915J15324P8965m4545Q8053k35364k70458l23072l44306
$$ -25421 81191 64634 159549 274873 353838 309293 397346 161982 -108476 -431548 -775854
22144g75854J5458P7385J21373q089P4714Q7529K83046N8190R5897J04188k81236
$$ -775854 -760396 -683011 -561638 -569727 -495013 -407484 -124438 -66248 29649 133837 -147399
22133a47399o5720P9437j99730l5382K66255R7277n5175k76834n295J82918J15149
$$ -147399 -213119 -133682 -333412 -368794 -102539 -5262 -60437 -337271 -342566 -159648 -44499
22122d4499Q2792r0526j30653j14024Q7708J09869J70776n554j96969j62546N0179
$$ -44499 38293 -52233 -182886 -296910 -209202 -99333 71443 65889 -131080 -293626 -243447
22111b43447J15662n6264K8031N2067Q0853L2270J3416J02082n6997j80313k23823
$$ -243447 -127785 -184049 -156018 -103951 -23098 9172 22588 124670 67673 -112640 -336463
22100c36463P626k5207K84713K33820o0007l8551M5458r7535p2267M196P7328
$$ -336463 -328837 -354044 -69331 164489 104482 65931 111389 13854 -58413 -54217 23111
22089B3111N4162J97865J45835J3027j92165k8373n3830r8490L0924P1048K021
$$ 23111 77273 275138 420973 434000 241835 213462 159632 61142 92066 163114 165135
22078A65135j83180j25746j53612M9556j243j9372R5217R646j19289K42743Q9642
$$ 165135 -18045 -143791 -297403 -247847 -249090 -268462 -173245 -163599 -282888 -40145 49497
22067D9497r7073M9543m3644p868N672k66391k05393Q4008L8545J22116L5304
$$ 49497 -47576 1967 -41677 -49545 -43873 -310264 -515657 -431649 -393104 -270988 -235684
22056b35684R7493J80j64013J27024Q0633j0842O9411N1849L4232j97151k33868
$$ -235684 -138191 -138011 -302024 -175000 -94367 -105209 -35798 16051 50283 -146868 -380736
22045c80736n4414K02312J21253o0577J61611m6890j94674O0455K12754M1576
$$ -380736 -435150 -232838 -111585 -172162 -10551 -57441 -252115 -191660 21094 62670
22035F2670q8967j6727R1235q6919l5680Q0720M8650N844P5100p9220m478k6047
$$ 62670 -26297 -43024 48211 -38708 -74388 6332 54982 60826 135926 56706 52228 26181
22023B6181J8434N5020k30279j6099P8924j36811J10695K13552K23539M146j54006
$$ 26181 44615 99635 -130644 -146743 -67819 -204630 -93935 119617 343156 347302 193296
22012A93296m782O6392j4994j76925p3516K04430J25039k35853k37928m1452R3359
$$ 193296 188514 254906 239912 62987 -10529 193901 318940 83087 -154841 -196293 -102934
22001a02934N866r7924L5990J91883O399N2923P7713k06249l8681o3341j27905
$$ -102934 -97068 -194992 -159002 32881 39280 92203 169916 -36333 -75014 -138355 -266260
21990b66260J46997j895j77679M3933j3044r6567K0619L9264k2942P7191J44559
$$ -266260 -119263 -121158 -298837 -254904 -267948 -364515 -343896 -304632 -327574 -250383 -105824
21979a05824k11291J28863O7788q9787R6394Q3710M7928q4878r1600q6765J49160
$$ -105824 -317115 -188252 -120464 -210251 -113857 -30147 17781 -67097 -158697 -245462 -96302
21968i6302m2689j8341M5786j0908M1083m4770j1919j04518P1242J06516J02835
$$ -96302 -138991 -157332 -111546 -122454 -81371 -126141 -138060 -242578 -171336 -64820 38015
21957C8015K6516j47546R1648r4876j85866l9224N1571K4600J73598L3839o9528
$$ 38015 64531 -83015 8633 -86243 -272109 -311333 -259762 -235162 -61564 -27725 -97253
21946i7253l2048J56186R9654n6295j02300n029r2137k9685J0165J12526K57947
$$ -97253 -129301 26885 126539 70244 -32056 -37085 -129222 -158907 -148742 -36216 221731
21935B21731K2803q1139k1276P0368r0978l70189O5579R6925n4398j42430j57300
$$ 221731 244534 163395 142119 212487 121509 -248680 -183101 -86176 -140574 -283004 -440304
21924d40304o5965J54823J41223K43376K7249j17516K285J2035j09004K670m0244
$$ -440304 -506269 -351446 -210223 33153 60402 -57114 -54829 -42794 -151798 -149128 -189372
21913a89372m5811m115P3479K316K5296P5172J43921j04440j87670R9280N6053
$$ -189372 -235183 -239298 -165819 -163503 -138207 -63035 80886 -23554 -211224 -111944 -55891
21902e5891K30615n1605j11548Q8877q5922r9401P6583J12911J15861L5089N9815
$$ -55891 174724 123119 11571 100448 14526 -84875 -8292 104619 220480 255569 315384
21891C15384j55821j48318n321m1477p494n0018m1879J69837M5952r955n8074
$$ 315384 159563 11245 5924 -35553 -43047 -93065 -134944 34893 80845 70890 12816
21880A2816j40049j06377P8836L2937N4022N1647J54829J09j06165P2283K21765
$$ 12816 -127233 -233610 -154774 -121837 -67815 -16168 138661 138770 32605 104888 326653
21869C26653n5460j98126l18105j97758k5311m5046K19181J43989P9924j08474
$$ 326653 271193 73067 -245038 -442796 -468107 -513153 -293972 -149983 -70059 -178533
21859a78533Q5474o7376o7577q0248j65333l5573j36760P6790L3302o7688L02771
$$ -178533 -93059 -160435 -228012 -308260 -473593 -509166 -645926 -569136 -535834 -603522 -300751
21848c00751J27955N8431Q6225r4754K21774k4850k81469m1852O4073Q425j58558
$$ -300751 -172796 -114365 -28140 -122894 98880 74030 -207439 -249291 -185218 -176793 -335351
21837c35351k0253J86541J37645n7759N5097k50972P7057J19656j75075l05239
$$ -335351 -355604 -169063 -31418 -89177 -34080 -285052 -207995 -88339 -263414 -568653
21827e68653l123R7605P3145k1460N9332K9880O8906J02809n1930J66042R3091
$$ -568653 -571776 -474171 -401026 -422486 -363154 -333274 -264368 -161559 -213489 -47447 45644
21816D5644j58702j11744R9453j3054P1160J48719q0294j32970n1985J30629j55374
$$ 45644 -113058 -224802 -125349 -138403 -67243 81476 1182 -131788 -183773 -53144 -208518
21805b08518J72254J61122p9759j52634k1382Q3283N7233R9128K007L5506k61007
$$ -208518 -36264 124858 45099 -107535 -128917 -45634 11599 110727 112734 148240 -112767
21794a12767k92857P5702q0226O0187L7379J20599J05857M1310j25746o230K15448
$$ -112767 -405624 -329922 -410148 -349961 -312582 -191983 -86126 -44816 -170562 -176792 38656
21783C8656N9230j61122j85569k3254j7935J56096J52211o1489r4231J04202R8223
$$ 38656 97886 -63236 -248805 -272059 -289994 -133898 18313 -43176 -137407 -33205 65018
21772F5018k5538o5250p8511q9306j81640M2147K37944K37385P1468M7186o1614
$$ 65018 39480 -25770 -104281 -193587 -375227 -333080 -95136 142249 213717 260903 199289
21761A99289M681j91965j1105j1775K2333k360l0508J12331j21137j26919k0263
$$ 199289 203970 12005 900 -10875 11458 9098 -21410 90921 -30216 -157135 -177398
21750a77398k062k329j5183q5998J02688O9267J05175J4474j50565J4024K74443
$$ -177398 -179460 -181789 -196972 -282970 -180282 -111015 -5840 8634 -141931 -127907 146536
21739A46536J9822j55785r0016m4413l6353J11377m3940J02047k2717q6119P9794
$$ 146536 166358 10573 -79443 -123856 -160209 -48832 -92772 9275 -13442 -99561 -19767
21728a9767J8208K7344J1224O7547j2951l6435J13991J11259j55359j62253l8949
$$ -19767 -1559 25785 37009 104556 91605 55170 169161 280420 125061 -37192 -76141
21717g6141J9404O457n0380J13374J45049k6108q6728O6370j13355k09171P3118
$$ -76141 -56737 -50280 -100660 12714 157763 131655 44927 111297 -2058 -211229 -138111
21706a38111J85594J16414k23490o5553j57586J06627p8228N5321J22772j295
$$ -138111 47483 163897 -59593 -125146 -282732 -176105 -254333 -199012 -76240 -77535
21696g7535q9443k11803Q8878J39712j04277k04439l8787R9429L45333M2670k02456
$$ -77535 -166978 -378781 -289903 -150191 -254468 -458907 -497694 -398265 -52932 -10262 -212718
21685b12718j60468N6639J54634O4140J08992k8270j1624q640m5718O4830P9849
$$ -212718 -373186 -316547 -161913 -97773 11219 -17051 -28675 -37315 -83033 -18203 61646
21674F1646k04062m7146K13810N989k0425r8013k13620J53540K35034q2531p0500
$$ 61646 -142416 -189562 24248 30237 9812 -88201 -301821 -148281 86753 4222 -66278
21663f6278r6404l20132Q0899k8407j9176N7135O9570R4819Q3573L5720J82032
$$ -66278 -162682 -482814 -401915 -430322 -449498 -392363 -322793 -227974 -144401 -108681 73351
21652G3351K8489j57196j67086K3273J83094q6278q332K07011O5151Q522j55350
$$ 73351 101840 -55356 -222442 -199169 -16075 -102353 -110685 96326 161477 169999 14649
21641A4649M8366R614j48008j33486j26545l1499j5428K69169J68603M0196j5025
$$ 14649 63015 72629 -75379 -208865 -335410 -366909 -382337 -113168 55435 95631 80606
21630H0606j96060n6156o6367L9158K46885m2943l22935j15471J8351J88509p6645
$$ 80606 -115454 -171610 -237977 -198819 48066 5123 -317812 -433283 -414932 -226423 -303068
21619c03068p9684P4395L9363j18721O2760J7276j4363l551J36434P0962J11509
$$ -303068 -382752 -308357 -268994 -387715 -324955 -307679 -322042 -325593 -189159 -118197 -6688
21608f688j4672j27764k42557n0276J93765k1554j21599M7308K53102R1972m5417
$$ -6688 -21360 -149124 -391681 -441957 -248192 -269746 -391345 -344037 -90935 1037 -44380
21597d4380K4213o4816N6530k01640j12367J20780J61779P3929p5380J02550n5033
$$ -44380 -20167 -84983 -28453 -230093 -342460 -221680 -59901 14028 -61352 41198 -13835
21586a3835p4899r3879j03420q3601j3289l6371O1296J4077N9358r3640k02397
$$ -13835 -88734 -182613 -286033 -369634 -382923 -419294 -357998 -343921 -284563 -378203 -580600
21575e80600L2432R8280K27731j14647J2344P4563Q1307K3643j34553j5075o5890
$$ -580600 -548168 -449888 -222157 -336804 -324460 -249897 -168590 -144947 -279500 -294575 -360465
21564c60465l0171Q0255J72031j4604j84068K26875r5586j38225n334o682O7588
$$ -360465 -390636 -310381 -138350 -152954 -337022 -110147 -205733 -343958 -349292 -355974 -288386
21553b88386O1465J82132M9928k89779M5310J17418k3539j88950J98827K02313
$$ -288386 -226921 -44789 5139 -284640 -239330 -121912 -145451 -334401 -135574 66739
21543F6739k5753R8955K08250l0730k14496k69593m7196m8797J84677J11954j27082
$$ 66739 40986 139941 348191 317461 102965 -166628 -213824 -262621 -77944 34010 -93072
21532i3072M5307j95154j18993K1126J10693M5269L5016K7704j69140l8592j50516
$$ -93072 -47765 -242919 -361912 -340786 -230093 -184824 -149808 -122104 -291244 -329836 -480352
21521d80352j3758J27913J67443p7750J49691M1646q4801j70745k11524J38615
$$ -480352 -494110 -366197 -198754 -276504 -126813 -85167 -169968 -340713 -552237 -413622
21511d13622K11594Q9403m6884m7845j3429M9164p9435j39133Q6775o2831n0234
$$ -413622 -202028 -112625 -159509 -207354 -220783 -171619 -251054 -390187 -303412 -366243 -416477
21500d16477M845l1971M1109P8968l9020P2141R8508j16048j327O5723J39105
$$ -416477 -411632 -443603 -402494 -323526 -362546 -290405 -191897 -307945 -309272 -243549 -104444
21489a04444j6885M6267K27376O738j29079o0916J1028k09485o2801j9071O0869
$$ -104444 -121329 -75062 152314 159052 29973 -30943 -19915 -229400 -292201 -311272 -250403
21478b50403N14J0303r663j09465j8026J1655J81887P1758k2803J8747J40626
$$ -250403 -249889 -239586 -249249 -358714 -376740 -365085 -183198 -111440 -134243 -115496 25130
21467B5130n7953j13776j30478Q5208k06120k11655J09431J73609K4100q4535
$$ 25130 -32823 -146599 -277077 -191869 -397989 -609644 -500213 -326604 -302504 -387039
21457c87039K65031J74092o0529J00539J40986J11386r8027q0637k15757j4053
$$ -387039 -122008 52084 -8445 92094 233080 344466 246439 165802 -49955 -64008
21447f4008M633J61392L2099J27799p5450o8711K7250k36522j52814J23648J31502
$$ -64008 -59375 102017 134116 261915 186465 117754 145004 -91518 -244332 -120684 10818
21436A0818K928k16732p3714j03789J43704J89911M9580k2860r2809M7234J80059
$$ 10818 13746 -202986 -276700 -380489 -236785 -46874 2706 -20154 -112963 -65729 114330
21425A14330J25273j50598L496j87469j17363J41049j7424p3256j10543j79867
$$ 114330 239603 89005 92501 -94968 -212331 -71282 -88706 -161962 -272505 -452372
21415d52372m8639O4709J48960O6249L44407O4973k87180j22649Q7744K25329
$$ -452372 -501011 -436302 -287342 -221093 123314 188287 -98893 -221542 -133798 91531
21405I1531Q0818k31584K1319j38465p3151o3004K32462M1893K41212J57392q4833
$$ 91531 172349 -59235 -37916 -176381 -249532 -312536 -80074 -38181 203031 360423 275590
21394B75590j58527k9906j54679O0002K1009k1277k6420l00015L3054J28237N392
$$ 275590 117063 87157 -67522 -7520 13489 -7788 -34208 -334223 -301169 -172932 -167540
21383a67540L0651R4918L04614m3051j27428j07116p0226l1198o3623J14913R5059
$$ -167540 -136889 -41971 262643 219592 92164 -14952 -85178 -116376 -179999 -65086 29973
21372B9973r3227k17266n3564J11056J71446n645p2432R7706j00796q5713R6106
$$ 29973 -63254 -280520 -334084 -223028 -51582 -57227 -129659 -31953 -132749 -218462 -122356
21361a22356J0133p9549j17475K24730J83j06817j11350J66422q9746K02164P5027
$$ -122356 -112223 -191772 -309247 -84517 -84334 -191151 -302501 -136079 -225825 -23661 51366
21350E1366k4909r0287O5633j2190j45319j73753R9497j23070j81865k3079J27106
$$ 51366 26457 -63830 1803 -10387 -155706 -329459 -229962 -353032 -534897 -557976 -430870
21339d30870J82807L0208j45870L5570o4061J47440J95847k1456p8086q2598J11752
$$ -430870 -248063 -217855 -363725 -328155 -392216 -244776 -48929 -70385 -148471 -231069 -119317
21328a19317J1330p2528J11565K833k4490j37313o2274K04048J84812n7075l79618
$$ -119317 -107987 -180515 -68950 -66117 -90607 -227920 -290194 -86146 98666 41591 -338027
21317c38027j59604Q5440R5660R1358K04368k3872P5939J75618J70238r9650l21965
$$ -338027 -497631 -412191 -316531 -225173 -20805 -44677 31262 206880 377118 277468 -44497
21306d4497l0576M5022j3163j77704J24504O5089J51852j1556P2266o2182j69434
$$ -44497 -75073 -30051 -43214 -220918 -96414 -31325 120527 108971 181237 119055 -50379
21295e0379j86100l7242J53250J94136l6356q8182k8956j06274j56930J52337
$$ -50379 -236479 -273721 -120471 73665 37309 -50873 -79829 -186103 -343033 -190696
21285a90696K42243R0254q4788K2117k5452j8446j26678j14835n1166P6665O9047
$$ -190696 51547 141801 57013 79130 53678 35232 -91446 -206281 -257447 -180782 -111735
21274a11735J78834J24242j5277l08834q4256o0469j76375j50740Q3753J76785
$$ -111735 67099 191341 176064 -132770 -217026 -277495 -453870 -604610 -520857 -344072
21264c44072N3048J16641j08224J58826K49060K6157j58369k15234k16065j8462
$$ -344072 -291024 -174383 -282607 -123781 125279 151436 -6933 -222167 -438232 -456694
21254d56694K19164J32213J04204l4187J3456n8198j03349k30311J75130N6621
$$ -456694 -237530 -105317 -1113 -35300 -21844 -80042 -183391 -413702 -238572 -181951
21244a81951K69675K9675j69218j65305j20202q8309L7852l4895O5065J36461
$$ -181951 87724 117399 -51819 -217124 -337326 -425635 -387783 -422678 -357613 -221152
21234b21152J62089j71763m8394j0520Q0041J61637n4195L6928L4303k078k3326
$$ -221152 -59063 -230826 -279220 -289740 -209699 -48062 -102257 -65329 -31026 -33104 -56430
21223e6430o3380m6240l6023l8499O204K35683o8242J8454R9935j6920r1944L6264
$$ -56430 -119810 -166050 -202073 -240572 -234368 1315 -66927 -48473 51462 34542 -57402 -21138
21211b1138j02788Q7305J25627j5709L7794k2733p3321m9908m8506o316p3161
$$ -21138 -123926 -36621 89006 73297 111091 88358 15037 -34871 -83377 -89693 -162854
21200a62854j21336o7220J87670K01488O0074K7155j16027l5876J47495K0204
$$ -162854 -284190 -351410 -163740 37748 97822 124977 8950 -26926 120569 140773
21190A40773l8971j49650k77239j73522K02481K56574J3269q8987K0332p2392
$$ 140773 101802 -47848 -325087 -498609 -296128 -39554 -26285 -115272 -94940 -167332
21180a67332q178J40433j19548o1945P2005j39920j36887O7217M727k5417N6616
$$ -167332 -175510 -35077 -154625 -216570 -144565 -284485 -421372 -354155 -349428 -374845 -318229
21169c18229k0425r6464J13434J90722J31578L2188j24020k45273n3877J39191
$$ -318229 -338654 -435118 -321684 -130962 616 32804 -91216 -336489 -390366 -251175
21159b51175Q7670j89370K29592M1376O338K73364J15697o3450k51934j60109
$$ -251175 -163505 -352875 -123283 -81907 -75569 197795 313492 250042 -1892 -162001
21149a62001J13608J31366j81780o9547J06468k109K8740r3554q4967K5641M0796
$$ -162001 -48393 82973 -98807 -168354 -61886 -63995 -35255 -128809 -213776 -188135 -147339
21138a47339L71O3995Q0867j15408j33137o4148J3552o6546m2477l1114J47544
$$ -147339 -146968 -82973 -2106 -117514 -250651 -314799 -301247 -367793 -410270 -441384 -293840
21127b93840J48871n7784j62173J87438J55053j37489o8681j06436n3161J56825
$$ -293840 -144969 -202753 -364926 -177488 -22435 -159924 -228605 -335041 -388202 -231377
21117b31377J90542J84241J28290L3296j75365k35654P516O1803n8644j70989
$$ -231377 -40835 143406 271696 304992 129627 -106027 -98511 -36708 -95352 -266341
21107b66341k4987o2387J22830k0533j85947P0681J7337m0002J18283M5462Q1809
$$ -266341 -291328 -353715 -230885 -251418 -437365 -366684 -349347 -389349 -271066 -225604 -143795
21096a43795J17783J79530K1642l52564o1444Q4012O7855j09338j01215J29757
$$ -143795 -26012 153518 175160 -177404 -238848 -154836 -86981 -196319 -297534 -167777
21086a67777K68655R2507j51726O4876J8881L9544k23837j41292M5944O4666j49916
$$ -167777 100878 193385 41659 106535 125416 164960 -58877 -200169 -154225 -89559 -239475
21075b39475l8701M4068r8329R8598J68760j01791P7730J615N216j97525j43729
$$ -239475 -278176 -234108 -332437 -233839 -65079 -166870 -89140 -87525 -82309 -279834 -423563
21064d23563J75874J09382Q6837Q1665p18K468j50514k59183l9174J64019k8777
$$ -423563 -247689 -138307 -51470 30195 29477 31945 -118569 -377752 -416926 -252907 -281684
21053b81684n835k15325j01654J64609K74695l9214K31856o7054j33917j72963
$$ -281684 -287519 -502844 -604498 -439889 -165194 -204408 27448 -39606 -173523 -346486
21043c46486J19243Q4418p0795k38492l8263J24929L7386j97719J22159J40349
$$ -346486 -227243 -142825 -213620 -452112 -490375 -365446 -328060 -525779 -403620 -263271
21033b63271J91203J0358j11831J44344K1505k56464o5910j0062l913q5528P5445
$$ -263271 -72068 -61710 -173541 -29197 -7692 -264156 -330066 -340128 -344041 -429569 -354124
21022c54124R520q585J53597M372j33680l06611J89042K86132J22133q3337j14986
$$ -354124 -344604 -353189 -199592 -195220 -328900 -635511 -446469 -160337 -38204 -121541 -236527
21011b36527Q1739J7919o1120r5443K99683J43396N1812l40419k53785Q1515L4509
$$ -236527 -154788 -136869 -197989 -293432 6251 149647 201459 -138960 -392745 -311230 -276721
21000b76721q6115K84869L2573m6554m0584q2776o5388q1273J41816J16643k40839
$$ -276721 -362836 -77967 -45394 -91948 -132532 -215308 -280696 -361969 -220153 -103510 -344349
20989c44349n9012P8505o3074R1346K3122j35595J62621J71240O6394j04654p0471
$$ -344349 -403361 -324856 -387930 -296584 -273462 -409057 -246436 -75196 -8802 -113456 -183927
20978a83927j39688n6500M8551j3600J32062J61195p7401l3435j66537m7550m1335
$$ -183927 -323615 -380115 -331564 -345164 -213102 -51907 -129308 -162743 -329280 -376830 -418165
20967d18165N7126K5464r6149K26887Q2087j50540l3405N2701O0303M3797R7009
$$ -418165 -361039 -335575 -431724 -204837 -122750 -273290 -306695 -253994 -193691 -149894 -52885
20956e2885j2070J90160n0033q2148P539K5880j1101r3060k32105k637K15793
$$ -52885 -64955 125205 75172 -6976 563 26443 15342 -77718 -309823 -312460 -96667
20945i6667J15832Q7948j41867k78009q3073Q4123n3641J16859J76163K0323q8437
$$ -96667 19165 107113 -34754 -312763 -395836 -311713 -365354 -248495 -72332 -52009 -140446
20934a40446P1746K06430P3546k28674j15531n5881n5071K3543N4753n2643k16594
$$ -140446 -68700 137730 211276 -17398 -132929 -188810 -243881 -220338 -165585 -218228 -434822
20923d34822j31510J37612J95041N6006m0812O7528J66752m3961j80589R9112
$$ -434822 -566332 -428720 -233679 -177673 -218485 -150957 15795 -28166 -208755 -109643
20913a09643J07976M6760l6855k28771j94807k44859o480J64582j10015K3064
$$ -109643 -1667 45093 8238 -220533 -415340 -660199 -666679 -502097 -612112 -589048
20903e89048J07642O8220K6757o5465j46555J74836J06206j12565O371K5965j33380
$$ -589048 -481406 -413186 -386429 -451894 -598449 -423613 -317407 -429972 -423601 -397636 -531016
20892e31016j0188J1138J48854N5588m2997L0806J56339M3145J21546L9319P609
$$ -531016 -541204 -530066 -381212 -325624 -368621 -337815 -181476 -138331 -16785 22534 30143
20881C0143J4439Q335R0415j39232k58427j22397j07564j2901L04309J90130p6928
$$ 30143 44582 52917 143332 4100 -254327 -376724 -484288 -497189 -192880 -2750 -79678
20870g9678j51603L2017L5889N5709o7462o2173r590J27843m6831q2402J4491
$$ -79678 -231281 -199264 -163375 -107666 -175128 -237301 -246891 -119048 -165879 -248281 -233790
20859b33790J23948o4166j56769N4106j43374J64239M4842j04612J6859J880j30066
$$ -233790 -109842 -174008 -330777 -276671 -420045 -255806 -210964 -315576 -298717 -296837 -426903
20848d26903q144p240L13482J17212q7409O4124k2597k2922J31281j31691j79812
$$ -426903 -435047 -442287 -128805 -11593 -99002 -34878 -57475 -80397 50884 -80807 -260619
20837b60619j902K47467j09697j71301O9279R0276q5230K02021N4052J63889j49072
$$ -260619 -262521 -15054 -124751 -296052 -226773 -136497 -221727 -19706 34346 198235 49163
20826D9163k78878J20242o0922L157K7118n4704k9005J23592R3094j09463J45986
$$ 49163 -229715 -109473 -170395 -167238 -140120 -194824 -223829 -100237 -7143 -116606 29380
20815B9380J92169J04869R6030L6463k60786j89841j83236K4629J85317K2276
$$ 29380 221549 326418 422448 458911 198125 8284 -174952 -150323 34994 57270
20805E7270m3477m8906p2861m80J53780k700j56249K00l06228r237J37745J88050
$$ 57270 13793 -35113 -107974 -108454 45326 42626 -113623 -113423 -419651 -428888 -291143 -103093
20793a03093J37875j21953j02312r4665N508J44864J92992k1784k04147j09238
$$ -103093 34782 -87171 -189483 -284148 -278640 -133776 59216 37432 -166715 -275953
20783b75953o0821J26979J99764R9677j03290j33850p9509K3695l04331L6771
$$ -275953 -336774 -209795 -10031 89646 -13644 -147494 -227003 -203308 -507639 -470868
20773d70868K67796J71551K4133n101k44376k1443J26981K07452k9110j79739
$$ -470868 -203072 -31521 -7388 -12489 -256865 -278308 -151327 56125 27015 -152724
20763a52724j85336P9040n5085L1121J23684L10343O227j69979p222R1146r2254
$$ -152724 -338060 -259020 -314105 -282984 -159300 151043 157270 -12709 -19931 71215 -21039
20752b1039j71327M282l3288O9170O8272m5427k16222R3649J43100o0131N3982
$$ -21039 -192366 -188084 -221372 -152202 -83930 -129357 -345579 -251930 -108830 -168961 -114979
20741a14979O7517l4583N1263j13216m5942P5892j11269J72091R9062m0259l4241
$$ -114979 -47462 -82045 -30782 -143998 -189940 -114048 -225317 -53226 45836 5577 -28664
20730b8664J5357j13276m8544k46915j65406K34150M4576P9081J44493J0855q2737
$$ -28664 -13307 -126583 -175127 -422042 -587448 -353298 -308722 -229641 -85148 -74293 -157030
20719a57030M7906J9599J13367K8315O6949k52299q4970K8692j56107N3909Q5667
$$ -157030 -109124 -89525 23842 52157 119106 -133193 -218163 -189471 -345578 -291669 -206002
20708b06002l4546L0842L17630J28534N1225K18304j8246m21708j51104o2240
$$ -206002 -240548 -209706 107924 236458 287683 505987 487741 66033 -85071 -147311
20698a47311J10151N9372j05687j77392k3813R374m1686J68974Q6991r9405Q7204
$$ -147311 -37160 22212 -83475 -260867 -284680 -275306 -316992 -148018 -61027 -160432 -73228
20687g3228r146l7132K02325k1414r2218p1418o7025n4130N977K9235J02807r0418
$$ -73228 -82374 -119506 82819 61405 -30813 -102231 -169256 -223386 -217409 -188174 -85367 -175785
20675a75785j27177j08067R9649j1547Q5642O8788Q3257O4283r2018j53463J44410
$$ -175785 -302962 -411029 -311380 -322927 -237285 -168497 -85240 -20957 -112975 -266438 -122028
20664a22028N0042j38704r0200Q0500J97723J62698l097o4986k9687J8641j56588
$$ -122028 -71986 -210690 -300890 -220390 -22667 140031 136934 71948 42261 60902 -95686
20653i5686m0402J76901j39393j51081k5564J45573j5488J44161K28556m4454
$$ -95686 -136088 40813 -98580 -249661 -275225 -129652 -145140 -979 227577 183123
20643A83123l64850j34297J5311J65672J42558P290J8188J23133J09983k25130
$$ 183123 -181727 -316024 -300713 -135041 7517 14807 32995 156128 266111 40981
20633D0981j23562j02011n6864k02483Q2531j31494J31741N3107P0640J67001
$$ 40981 -82581 -184592 -241456 -443939 -361408 -492902 -361161 -308054 -237414 -70413
20623g0413R3309p0677j95428q922J57595L9203P7555j60642l76444K89913K83646
$$ -70413 22896 -47781 -243209 -252131 -94536 -55333 22222 -138420 -514864 -224951 58695
20612E8695P6515q9399N7075P0184L1565j10964j69370q9790p9537J50121K5214
$$ 58695 135210 45811 102886 173070 204635 93671 -75699 -165489 -245026 -94905 -69691
20601f9691j36128j56856p442J14766l4607o573M6760J01256N4775m3683m6702
$$ -69691 -205819 -362675 -370117 -255351 -289958 -296531 -249771 -148515 -93740 -137423 -184125
20590a84125J78827K05369K0376j21853R3058K983j96684j46935K5749p3830q0765
$$ -184125 -5298 200071 220447 98594 191652 194635 -2049 -148984 -123235 -197065 -277830
20579b77830K0806j33922O920J02724q7695j69541J02281Q2199m4904M5974J09723
$$ -277830 -257024 -390946 -384026 -281302 -368997 -538538 -436257 -354058 -398962 -352988 -243265
20568b43265K44822J32618j2287p7600M4215p2817r6045n1981l6207J4893J6259
$$ -243265 1557 134175 121888 44288 88503 15686 -80359 -132340 -168547 -153654 -137395
20557a37395J27416M8946o2052l5203j1479p0747o5214k11926o9787m1497K647
$$ -137395 -9979 38967 -23085 -58288 -69767 -140514 -205728 -417654 -487441 -528938 -526291
20546e26291L24030J67873k44735p0312O1024O2543j05116M832K40044j55202
$$ -526291 -202261 -34388 -279123 -349435 -288411 -225868 -330984 -326152 -86108 -241310
20536b41310r4349O6321O8720K51046L6538j08061l8346j4634O850m6186j8628
$$ -241310 -335659 -269338 -200618 50428 86966 -21095 -59441 -74075 -67225 -113411 -132039
20525a32039j07840Q937K26658J0609k4694l7984j13169o2860J6625J55474R4286
$$ -132039 -239879 -230942 -4284 6325 -18369 -56353 -169522 -232382 -215757 -60283 34003
20514C4003j5752n9584k01245J4709l9705K4599P6356J4070J6078k3227Q7678
$$ 34003 18251 -41333 -242578 -227869 -267574 -242975 -166619 -152549 -136471 -159698 -72020
20503g2020J98623J25921l9249n7529l5642P4507k33076K1017J95320n6984r5293
$$ -72020 126603 252524 213275 155746 120104 194611 -38465 -17448 177872 120888 25595
20492B5595J2721o9870q7329o0877n2552m8701m1621j9903l4637j47040J14539
$$ 25595 38316 -31554 -118883 -179760 -232312 -281013 -322634 -342537 -377174 -524214 -409675
20481d09675J46132j08587R7526J19712k1592n2690J84867k6820q7167j5076K16539
$$ -409675 -263543 -372130 -274604 -154892 -176484 -229174 -44307 -71127 -158294 -173370 43169
20470D3169K64746k02697p7263K9195J04731N2151p3963j21177j50261j2994L0659
$$ 43169 307915 105218 27955 57150 161881 214032 140069 18892 -131369 -144363 -113704
20459a13704m3279l1248K32117J69610K113j0893j12887K2898L584k6682l8022
$$ -113704 -156983 -188231 43886 213496 215609 204716 91829 114727 118311 91629 53607
20448E3607k42638n9759j6357K1897M2160j02606J0406K03295K09449n2887j06576
$$ 53607 -189031 -248790 -265147 -243250 -201090 -303696 -293290 -89995 119454 66567 -40009
20437d0009m0151J56571o0457q2964j12493J41440J09953j09402k20119J16321
$$ -40009 -80160 76411 15954 -67010 -179503 -38063 71890 -37512 -257631 -141310
20427a41310Q7389k8898l4972j0189O467J03811J80812K5919k51143n8839o3171
$$ -141310 -53921 -82819 -117791 -127980 -121513 -17702 163110 189029 -62114 -120953 -184124
20416a84124J1550r5300P4941k15828j99740j50444P2290K66286j18098L2125
$$ -184124 -172574 -267874 -192933 -408761 -608501 -758945 -686655 -420369 -538467 -506342
20406e06342J80157J93272J7160N1871R0167Q6648j07803l76417O605M11479J40810
$$ -506342 -326185 -132913 -115753 -63882 26285 112933 5130 -371287 -364682 46797 187607
20395A87607j73800k24318p2740l1745M4688j80428Q8927J13899Q3026J27679
$$ 187607 13807 -210511 -283251 -314996 -270308 -450736 -361809 -247910 -164884 -37205
20385c7205m6433o076J33188J61064j06523k1269n3488J7104q2940R0010r699
$$ -37205 -83638 -89714 43474 204538 98015 76746 23258 40362 -42578 47432 37733
20374C7733j64586o1629J2572M9886m1161Q1678J0684k6789J01358k45812p3989
$$ 37733 -126853 -188482 -175910 -126024 -167185 -85507 -74823 -101612 -254 -246066 -320055
20363c20055j07311K9417J44729L0339Q5669n2532q5260Q7003j39390o8822J48362
$$ -320055 -427366 -397949 -253220 -222881 -137212 -189744 -275004 -188001 -327391 -396213 -247851
20352b47851J89636k19424j99068J11957J20771J23336K9486j68635m6073J53166
$$ -247851 -58215 -277639 -476707 -364750 -243979 -120643 -91157 -259792 -305865 -152699
20342a52699J01344O0827m0240k4046p705N3024k17333p2499J05223M26j63871
$$ -152699 -51355 9472 -30768 -54814 -62519 -9495 -226828 -299327 -194104 -193678 -357549
20331c57549j12104J7311O9995O6015j02643m3246j1373j8466P6985L1790J35708
$$ -357549 -469653 -452342 -382347 -316332 -418975 -462221 -473594 -492060 -415075 -383285 -247577
20320b47577J49241K6928N9206j55701L5144J68819N9925l9791j10546k9532n5905
$$ -247577 -98336 -71408 -12202 -167903 -132759 36060 95985 56194 -54352 -83884 -139789
20309a39789o3677l5667J16505J44858j80487j06215K19766k28098j34426j3947
$$ -139789 -203466 -239133 -122628 22230 -158257 -264472 -44706 -272804 -407230 -421177
20299d21177R5615O8434M1660o0104o9044k9472M8615J16467K67047N7657o695
$$ -421177 -325562 -257128 -215468 -275572 -344616 -374088 -325473 -209006 58041 115698 109003
20288A09003l07609J63702j76880j55514J54504k750P7860K18711k3954n943J7242
$$ 109003 -198606 -34904 -211784 -367298 -212794 -215544 -137684 81027 57073 51130 68372
20277F8372R9519O9373j48276K938l6331j19245r0649K76801J75240q4504j98399
$$ 68372 167891 237264 88988 91926 55595 -63650 -154299 122502 297742 213238 14839
20266A4839k23240j60132J7744J08852K75714J46k56022j16842O2556J29630J472
$$ 14839 -208401 -368533 -350789 -241937 33777 33923 -222099 -338941 -276385 -146755 -145283
20255a45283p1750j45757J8913N5841o810K14384r9574l9281P3498R4832k1550
$$ -145283 -217033 -362790 -343877 -288036 -294846 -80462 -180036 -219317 -145819 -50987 -72537
20244g2537K45511J0374l30996O8318K76612J71787j62581k39361k0620K6897
$$ -72537 172974 183348 -147648 -79330 197282 369069 206488 -32873 -53493 -26596
20234b6596j0124k87028j86586L1783N8999L7209Q3522K04927J33089j31697j88224
$$ -26596 -36720 -323748 -510334 -478551 -419552 -382343 -298821 -93894 39195 -92502 -280726
20223b80726j68278L2965Q2844Q1065M0641K26791Q1245j47090j82185l7554J16796
$$ -280726 -449004 -416039 -333195 -252130 -211489 15302 96547 -50543 -232728 -270282 -153486
20212a53486J44182Q1209k7855k95444N2859o4405j20160p1528R7164M0335K8752
$$ -153486 -9304 71905 44050 -251394 -198535 -262940 -383100 -454628 -357464 -317129 -288377
20201b88377P5195K7865k8818J32344J18L1266M8043o5018j47185m5516Q0416
$$ -288377 -213182 -185317 -214135 -81791 -81673 -50407 -2364 -67382 -214567 -260083 -179667
20190a79667R4277l2951j48992j36219n2489q4541O5835l1260K25684K00010j6497
$$ -179667 -85390 -118341 -267333 -403552 -456041 -540582 -474747 -506007 -280323 -80313 -96810
20179i6810O7618j12504j97364J7173n6097P2707K95232L52885k05171k25704
$$ -96810 -29192 -141696 -339060 -321887 -377984 -305277 -10045 342840 137669 -88035
20169h8035K14723O9460l34048p4649N5304j00393K583j07320J33672l7842j18822
$$ -88035 126688 196148 -137900 -212549 -157245 -257638 -255055 -362375 -228703 -266545 -385367
20158c85367N7190K4528R0714J65750J47238j27636q3566K448n3730q9345J36378
$$ -385367 -328177 -303649 -212935 -47185 100053 -27583 -111149 -108701 -162431 -251776 -115398
20147a15398P7999q0638m652l4170O2717J7477N2226J19490K9785j14111p6142
$$ -115398 -37399 -118037 -122689 -156859 -94142 -76665 -24439 95051 124836 10725 -65417
20136f5417l1629j38524j50074J1081J27004R2211J48153J09298k13680o8903
$$ -65417 -97046 -235570 -385644 -374563 -247559 -155348 -7195 102103 -111577 -180480
20126a80480o3467K6831j30070M0457K32345Q6122r1379l6821M0416k4297j11819
$$ -180480 -243947 -217116 -347186 -306729 -74384 11738 -79641 -116462 -76046 -100343 -212162
20115b12162J77467o2410L1513J04717p842p0130J12960j9160K490n0264k59482
$$ -212162 -34695 -97105 -65592 39125 31283 -38847 74113 54953 57443 7179 -252303
20104b52303k62360J73373L15943j8822j66757K9339R7273K09561J6447P586j58884
$$ -252303 -514663 -341290 -25347 -44169 -210926 -181587 -84314 125247 141694 149280 -9604
20093i604r367q9600r7228l0828l8978r7112N4067K77063k00092j68574R3660
$$ -9604 -18971 -108571 -205799 -236627 -275605 -372717 -318650 -41587 -241679 -410253 -316593
20082c16593M8592Q2214J48519K47291j40538p3533J52182P2033p8957j16022
$$ -316593 -268001 -185787 -37268 210023 69485 -4048 148134 220167 141210 25188
20072B5188J21313j8230k48616j87757K5389J52350r5055k8663p0216K40672J41238
$$ 25188 146501 128271 -120345 -308102 -282713 -130363 -225418 -254081 -324297 -83625 57613
20061E7613p9211J83942l6440p9361j22135J32157J38484q5799J80550m6605k44590
$$ 57613 -21598 162344 125904 46543 -75592 56565 195049 109250 289800 243195 -1395
20050a395N4203j6049o2250o8776j66873j2417N2041j38870j15869J91655K24394
$$ -1395 52808 36759 -25491 -94267 -261140 -273557 -221516 -360386 -476255 -284600 -60206
20039f0206j39528Q3722M2764j13063j6295Q3426m8321j40119J09225K8715J6134
$$ -60206 -199734 -116012 -73248 -186311 -202606 -119180 -167501 -307620 -198395 -169680 -153546
20028a53546j65284K6557J68619j6769Q761j96581j59166L1248J44977K22597
$$ -153546 -318830 -292273 -123654 -140423 -131662 -328243 -487409 -456161 -311184 -88587
20018h8587M4802J6885o4833N1585n7213o3347k07486j099P6539j1454Q1717J10704
$$ -88587 -43785 -26900 -91733 -40148 -97361 -160708 -368194 -369293 -292754 -304208 -222491 -111787
20006a11787J61395l3931N0640j61660j34297K39028J28833l307k03251j38073
$$ -111787 49608 15677 66317 -95343 -229640 9388 138221 134914 -68337 -206410
19996b06410q0928p0857o3226J33426O151m7174K05045J60077r1968R5449J20344
$$ -206410 -287338 -358195 -421421 -287995 -281844 -329018 -123973 36104 -55864 39585 159929
19985A59929j61590l4037j7423l0025l3410n5774j1765j6924P4120o8612p7478
$$ 159929 -1661 -35698 -53121 -83146 -116556 -172330 -184095 -201019 -126899 -195511 -272989
19974b72989l4839r4311Q9285k9788m4139J82325j97970j1198J6313J78626k4172
$$ -272989 -307828 -402139 -312854 -342642 -386781 -204456 -402426 -413624 -397311 -218685 -242857
19963b42857r8605j18997J76181O5182n9952p4225Q0814J44449J18781N5466K7841
$$ -242857 -341462 -460459 -284278 -219096 -279048 -353273 -272459 -128010 -9229 46237 74078
19952G4078l6254r4532j51214k56941J08078P6109K8061p1685j9444J42192j06980
$$ 74078 37824 -56708 -207922 -464863 -356785 -280676 -252615 -324300 -343744 -201552 -308532
19941c08532J31493K15167R1285J2779q0714j12268j96706M3403J02876J51643
$$ -308532 -177039 38128 129413 142192 61478 -50790 -247496 -204093 -101217 50426
19931E0426J86886M5823j80000m6190j28414J55775K44230J9485j58590j76906
$$ 50426 237312 283135 103135 56945 -71469 84306 328536 348021 189431 12525
19921A2525q2020O5036j66200j61612o8122J05805P7293K54020K54843J0919j37483
$$ 12525 -69495 -4459 -170659 -332271 -400393 -294588 -217295 36725 291568 302487 165004
19910A65004j9363n4023m9355m8818K9048j48163J66598L28358j33482k10413
$$ 165004 145641 91618 42263 -6555 22493 -125670 40928 369286 235804 25391
19900B5391Q7400L0946j46427j30283K64104R7588j43501L2721j45248r3620P4748
$$ 25391 112791 143737 -2690 -132973 131131 228719 85218 117939 -27309 -120929 -46181
19889d6181q2000j48779n2030J28231j6597O6191J0338r4616K17876K04351M572
$$ -46181 -128181 -276960 -328990 -200759 -217356 -151165 -140827 -235443 -17567 186784 191356
19878A91356j21970j10881P2460R5332N1945n6476o0515j73350o9433J42143j32702
$$ 191356 69386 -41495 30965 126297 178242 121766 61251 -112099 -181532 -39389 -172091
19867a72091k4191J67982J68817P442k2364m9917n8940q824j75566J5301J96517
$$ -172091 -196282 -28300 140517 147959 125595 75678 16738 7914 -167652 -152351 44166
19856D4166K79096r0853j46238j16512j56833M4234m564L9006J13807M2795j71831
$$ 44166 323262 232409 86171 -30341 -187174 -142940 -147504 -108498 5309 48104 -123727
19845a23727K8385N1359p5202r4301J35338N5723j7461N6457j23159j48846Q6480
$$ -123727 -95342 -43983 -119185 -213486 -78148 -22425 -39886 16571 -106588 -255434 -168954
19834a68954R4826r4430P3406m5092J20520k6893K429l1107l8442N4881Q1290
$$ -168954 -74128 -168558 -95152 -140244 -19724 -46617 -44188 -75295 -113737 -58856 22434
19823B2434o0278O1267k4715j33734J09892L226k5547L07045n749j38430k68031
$$ 22434 -37844 23423 -1292 -135026 -25134 -21908 -47455 259590 253841 115411 -152620
19812a52620j64055n5836L62153J04957l75306K5066J78557N1337N6620k2097
$$ -152620 -316675 -372511 -10358 94599 -280707 -255641 -77084 -25747 30873 8776
19802H776j44143L5813k3167K72677Q1758k15844L4877J54640Q0671k06938O8129
$$ 8776 -135367 -99554 -122721 149956 231714 15870 50747 205387 286058 79120 147249
19791A47249J38763j14815l4307J35551J13766k02988k29890P6194j07036k1194
$$ 147249 286012 171197 136890 272441 386207 183219 -46671 29523 -77513 -98707
19781i8707L09417k6213j84411j79368j51611J47173m155J62313K14261q1183
$$ -98707 210710 184497 86 -179282 -330893 -183720 -187875 -25562 188699 107516
19771A07516n2214o4523J9265J69796j80460l13966j13205j47003N385p2380J73024
$$ 107516 55302 -9221 10044 179840 -620 -314586 -427791 -574794 -569409 -641789 -468765
19760d68765K27649Q2578J96920J17943L7111M7142P5510J51884p4848p4190j8384
$$ -468765 -241116 -158538 38382 156325 193436 240578 316088 467972 393124 318934 300550
19749C00550j78513o8664j33024j22881P862m620L4300o9924j09499J46289J87260
$$ 300550 122037 53373 -79651 -202532 -194670 -199290 -164990 -234914 -344413 -198124 -10864
19738a0864j52709r4357j3662j7751r0085J24074K33969K1856O86P3139j06844
$$ -10864 -163573 -257930 -271592 -289343 -379428 -255354 -21385 471 1157 74296 -32548
19727c2548j37815m5129r9613J79530K66464K93591P2127k84392m9240o6449Q3801
$$ -32548 -170363 -215492 -315105 -135575 130889 424480 496607 212215 162975 96526 180327
19716A80327n648J6045P3781r6407m7797j01386p17n1577J01034J27152j10746
$$ 180327 174679 190724 264505 168098 120301 18915 18198 -33379 67655 194807 84061
19705H4061l06489Q5190p4759r8031J4968O234j04658K35782L2056j29928O5118
$$ 84061 -222428 -137238 -211997 -310028 -295060 -288826 -393484 -157702 -125646 -255574 -190456
19694a90456L3544K35185K34975O6929j36165l9893j02427K43602L4078k5965
$$ -190456 -156912 78273 313248 380177 244012 204119 101692 345294 379372 353407
19684C53407j86431m8137L443j06884J11988R828k48194p5245k7869P5128J52774
$$ 353407 166976 118839 122282 15398 127386 137214 -110980 -186225 -214094 -138966 13808
19673A3808o934l980r1176P7328J92152L4247L65999P5069j92193q3552q3J27781
$$ 13808 6874 2894 -88282 -10954 181198 215445 581444 656513 464320 380768 380685 508466
19661E08466m9410m8570n4421j83216k36506L3602K0650j10623L9065P6625K59709
$$ 508466 459056 410486 356065 172849 -63657 -30055 -9405 -120028 -80963 -4338 255371
19650B55371K0293p9845p8975k60673L9795j4470j66501k9717J73520K06576n6330
$$ 255371 275664 195819 116844 -143829 -104034 -118504 -285005 -314722 -141202 65374 9044
19639I044J21848L2064j51066O7134O4725J05369N9396J55406J8699j19122j39186
$$ 9044 130892 162956 11890 79024 143749 249118 308514 463920 482619 363497 224311
19628B24311O6977J72569j6866J79908M7961n3982q3596j73924j38428R736j39495
$$ 224311 291288 463857 446991 626899 674860 620878 537282 363358 224930 234666 95171
19617I5171n4080R8996j8295J35367J11764k0648N1834j27260j45506m4418j8116
$$ 95171 41091 140087 121792 257159 368923 348275 400109 272849 127343 82925 64809
19606F4809M0285J54201p0470J79069J11601j14897J53002K46912P1729K46350
$$ 64809 105094 259295 188825 367894 479495 364598 517600 764512 836241 1082591
19596A082591L90229J54409J37375J04847K03672J68021O132l2611Q9995O950
$$ 1082591 1472820 1627229 1764604 1869451 2073123 2241144 2247276 2214665 2304660 2311610
19586B311610j58086j75062o1157n2198k57971n0118o1351k98873k22465O2968
$$ 2311610 2153524 1978462 1917305 1865107 1607136 1557018 1495667 1196794 974329 1037297
19576A037297j30366l95304q0827n1737j73395l8756O2172L0701q9308O6462o5612
$$ 1037297 906931 511627 430800 379063 205668 166912 229084 259785 170477 236939 171327
19565A71327j80m2170j01089P9541J4518O4345k21815N1229l7797n3228J00228
$$ 171327 171147 128977 27888 107429 121947 186292 -35523 15706 -22091 -75319 24909
19554B4909L18594J38647k41947k05620q2879J85862J76598K7959j34800j50649
$$ 24909 343503 482150 240203 34583 -48296 137566 314164 342123 207323 56674
19544E6674P489O5331l5741K53452L7326j49014p6286j79708k87334j01449K31814
$$ 56674 64163 129494 93753 347205 384531 235517 159231 -20477 -307811 -409260 -177446
19533a77446K39008J16923J8056j60925K8285K27378J47064K76359L37004N08386
$$ -177446 61562 178485 196541 35616 63901 291279 438343 714702 1051706 1560092
19523A560092P33228J067118L69634m61965o68714p31002p73269n43905l65585
$$ 1560092 2293320 3360438 3730072 3268107 2599393 1868391 1095122 551217 185632
19514A85632k18499J15960K18768K14137m2499j78534r8565K659j5213L3125k0655
$$ 185632 -32867 83093 301861 515998 473499 294965 196400 199059 183846 216971 196316
19503A96316K1774j37697O1364P7329q9568j01863J4980j0576j62622J0638J14223
$$ 196316 218090 80393 141757 219086 129518 27655 42635 32059 -130563 -119925 -5702
19492e702P4866l6192o4494J66314J97298k28609k1606M9622J38628N555r4443
$$ -5702 69164 32972 -31522 134792 332090 103481 81875 131497 270125 275680 181237
19481A81237j16685p9495J55427R7379j3196m8731o2837K4979q7942j77728O0636
$$ 181237 64552 -14943 140484 237863 224667 175936 113099 138078 50136 -127592 -66956
19470f6956P3601P9889j27919p956J66936o0896o2936K6946J93567m0822r5773
$$ -66956 6645 86534 -41385 -49341 117595 56699 -6237 20709 214276 173454 77681
19459G7681j05598K18581J97414j54347p4909l6576j07105j24864j4803Q6175
$$ 77681 -27917 190664 388078 233731 158822 122246 15141 -109723 -124526 -38351
19449c8351l8968N7933J01280N8441o5886K3153K25804L0981J4065j52595j07659
$$ -38351 -77319 -19386 81894 140335 74449 97602 323406 354387 368452 215857 108198
19438A08198M4209Q7477J0213J27436J08307j34417K2956K14621j5465p1241n7474
$$ 108198 152407 239884 250097 377533 485840 351423 374379 589000 573535 502294 444820
19427D44820j2995q4936K8404J7831J14000k4q8666L9188N0731L36031P6944k17263
$$ 444820 431825 346889 375293 393124 507124 507100 418434 457622 508353 844384 921328 704065
19415G04065p2310R6886K44219N1441j15110K941J10584P0901q6010J17402O2185
$$ 704065 631755 728641 972860 1024301 909191 912132 1022716 1093617 1007607 1125009 1187194
19404A187194J99607k08814R108L16504J99139j2706J06488P8779k35175q4563
$$ 1187194 1386801 1177987 1187095 1503599 1702738 1690032 1796520 1875299 1640124 1555561
19394A555561k42549j13573k5763q8643N77M3018J5996o6950j56171J515k24037
$$ 1555561 1313012 1199439 1173676 1085033 1085610 1128628 1144624 1077674 921503 923018 698981
19383F98981j79674l5479K56708Q3987j68709j10616p7766k3559l1556j25345
$$ 698981 519307 483828 740536 824523 655814 545198 467432 443873 412317 286972
19373B86972P9225K83190J64503k24624j53938k43785o3949k5360Q2676j86014
$$ 286972 366197 649387 813890 589266 435328 191543 127594 102234 184910 -1104
19363a104j78688L01134K86617k52996j5479J69312J24014R3807j94106J24554
$$ -1104 -179792 121342 407959 154963 139484 308796 432810 526617 332511 457065
19353D57065L9912J51758j03030n592m1461R3830r5205k2566j91139m5072Q0126
$$ 457065 496977 648735 545705 540113 498652 592482 497277 474711 283572 238500 318626
19342C18626p5635r204L70560k5107n1627m0915j53541j57276l4367n0917p2751
$$ 318626 242991 233787 604347 579240 527613 486698 333157 175881 141514 90597 17846
19331A7846k3158l8907J46157K01604N8801j56890J62837R8123q5747j63766O9218
$$ 17846 -5312 -44219 101938 303542 362343 205453 368290 466413 380666 216900 286118
19320B86118L12261K60823J6465P0582r917j64507j71168m5659j7762l15176j5162
$$ 286118 598379 859202 875667 946249 936332 771825 600657 554998 537236 222060 206898
19309B06898J07406l3676q1219K32616P9896j03282o0033j21019M7218j23502
$$ 206898 314304 280628 199409 432025 511921 408639 348606 227587 274805 151303
19299A51303J39394K69268l5061r0011j28464m7717r8338J79123J21488r2358
$$ 151303 290697 559965 524904 434893 306429 258712 160374 339497 460985 368627
19289C68627n298O4713j15686K17044J25372R2391Q3736J4198j02662N627L6182
$$ 368627 363329 428042 312356 529400 654772 747163 830899 845097 742435 748062 784244
19278G84244j55789j21941n8161Q655r7110k01656J35442m6863l0538m3555J23589
$$ 784244 628455 506514 448353 457008 359898 158242 293684 246821 216283 172728 296317
19267B96317L09495R4293L0634M0764j44614q3115K28403o6220j90446j31554
$$ 296317 605812 700105 730739 771503 626889 543774 772177 705957 515511 383957
19257C83957K5639r5460q6812J9253J7257j13044K8406p0667J85607J95516L1677
$$ 383957 409596 314136 227324 246577 263834 150790 179196 108529 294136 489652 521329
19246E21329q5047j3189k3873l4755N7127M0136O6121J59681j96728k7418O0750
$$ 521329 436282 423093 399220 364465 421592 461728 527849 687530 490802 463384 524134
19235E24134N2186r8947P2835O0541M4697q3648p8779J68384L6628n1051J20788
$$ 524134 576320 477373 550208 610749 655446 571798 493019 661403 698031 646980 767768
19224G67768J24551j2844j80618o1917j17838M2339J65410o0234j78580l33614
$$ 767768 892319 879475 698857 636940 519102 561441 726851 666617 488037 154423
19214A54423O9777K84923r038r5852K22124N8868N8779q6532J36434j24865q6497
$$ 154423 224200 509123 500085 404233 626357 685225 744004 657472 793906 669041 582544
19203E82544l5761j79238N59j02748K8396J45231J12291j3997q182j8246P7940
$$ 582544 546783 367545 368104 265356 293752 438983 551274 537277 529095 510849 588789
19192E88789P7054j01284O9419K46659k4009j28162Q2107K07351K58245j11712
$$ 588789 665843 564559 633978 880637 856628 728466 810573 1017924 1276169 1164457
19182A164457m9517N2202J96261q6516o3840p5346j5027J9501k73420j40077r1430
$$ 1164457 1114940 1167142 1363403 1276887 1213047 1137701 1122674 1142175 868755 728678 637248
19171F37248Q1098j0169n6419Q7724Q5481q8838o3654P6255J50340j1158j0802
$$ 637248 718346 708177 651758 739482 824963 736125 672471 748726 899066 887908 877106
19160H77106m6675o550O5922M3859J752J12628k21130j15764Q1103J7090L3619
$$ 877106 830431 823881 889803 933662 935414 1048042 826912 711148 792251 809341 842960
19149H42960n6624j4888J13067M283N0584K3116l813k81782k9582K43630m7809
$$ 842960 786336 771448 884515 888798 939382 962498 958685 676903 647321 890951 843142
19138H43142j34216k4963P0259Q3739j5163j2072j3105J31598p2187j59695k1609
$$ 843142 708926 683963 754222 837961 822798 810726 797621 929219 857032 697337 675728
19127F75728J26801K630J76511J17693M4041n3847o824M8349R128j01434k20668
$$ 675728 802529 805159 981670 1099363 1143404 1089557 1082733 1131082 1140210 1038776 818108
19116H18108J19106J46272j2787n8212J69070J88103L05920L34259R2924j74973
$$ 818108 937214 1083486 1070699 1012487 1181557 1369660 1675580 2009839 2102763 1927790
19106A927790j778j56755l5661K14817J02853J21210L68875J32660j3035N4353
$$ 1927790 1926012 1769257 1733596 1948413 2051266 2172476 2541351 2674011 2660976 2715329
19096B715329J14248K24428L41343J84136K52463K31126J24863L33635L07083
$$ 2715329 2829577 3054005 3395348 3579484 3831947 4063073 4187936 4521571 4828654
19087D828654K02250j12658m56344l47914o7052J50240o6380k49556m0449m5607
$$ 4828654 5030904 4918246 4461902 4113988 4046936 4197176 4130796 3881240 3840791 3795184
19077C795184o2990k17714l77337l25320j15823L01814j3992k98749k45013l6268
$$ 3795184 3732194 3514480 3137143 2811823 2696000 2997814 2983822 2685073 2440060 2403792
19067B403792O5039L3715M823j2350n9500k52135j24219m1877j04045j05908o7358
$$ 2403792 2468831 2502546 2507369 2495019 2435519 2183384 2059165 2017288 1913243 1807335 1739977
19056A739977K30907k2750j37123J86708J9245R3315q6755J62070N909M1379M6347
$$ 1739977 1970884 1948134 1811011 1997719 2016964 2110279 2023524 2185594 2191503 2232882 2279229
19045B279229P7089q9299j05004j79181J42493K10837p7754k07905N5499K47410
$$ 2279229 2356318 2267019 2162015 1982834 2125327 2336164 2258410 2050505 2106004 2353414
19035B353414L27413R4155j33606m572J99637J75008J18304o4263n9448n2415
$$ 2353414 2680827 2774982 2641376 2636804 2836441 3011449 3129753 3065490 3006042 2953627
19025B953627P0507J62588o8327J25005r3514j05971K6548n4509J65196K73451
$$ 2953627 3024134 3186722 3118395 3243400 3149886 3043915 3070463 3015954 3181150 3454601
19015C454601J16616M5036L8833o3255k7271J44753K97114J32566k6666r4828
$$ 3454601 3571217 3616253 3655086 3591831 3564560 3709313 4006427 4138993 4112327 4017499
19005D017499j55661J58493P0173J8368J52117J34140J4196J20684j43954N2732
$$ 4017499 3861838 4020331 4090504 4108872 4260989 4395129 4409325 4530009 4386055 4438787
18995D438787N8879N6518O510J340K60089K09559j03811q9682J51303K07661K02882
$$ 4438787 4497666 4554184 4560694 4562034 4822123 5031682 4927871 4838189 4989492 5197153 5400035
18984E400035K36802M39339P8901K10512N1046J69619J98797L00970K84242K65132
$$ 5400035 5636837 6076176 6155077 6365589 6416635 6586254 6785051 7086021 7370263 7635395
18974G635395K74408M29764M92818N22846O89843P71421R57208J023699J023981
$$ 7635395 7909803 8339567 8832385 9355231 10045074 10816495 11773703 12797402 13821383
18965A3821383J097265J144332O81530O50261R05102Q29574J077479J472044J628599
$$ 13821383 14918648 16062980 16744510 17394771 18299873 19129447 20206926 21678970 23307569
18956B3307569J584796J250441J376483J848219K228296K592407L442650M162712
$$ 23307569 24892365 26142806 27519289 29367508 31595804 34188211 37630861 41793573
18948D1793573N026945N708585P051195R498110J2576259J6619038K2670096L1662112
$$ 41793573 46820518 52529103 59580298 69078408 81654667 98273705 120943801 152605913
18940A52605913M4289183N9806217P2755714P0397554M5078848J2781358m808003
$$ 152605913 196895096 256701313 329457027 399854581 444933429 457714787 452906784
18933D52906784m284891P967060K2859384K2956963k802862l7643363n9844496
$$ 452906784 448621893 456588953 479448337 502405300 499602438 461959075 402114579
18926D02114579o6869950o5060645n6238302m4285897l3347656k4975055j8589859
$$ 402114579 335244629 270183984 213945682 169659785 136312129 111337074 92747215
18919I2747215j3902475j0622780q477016o956350n365572m418945m009290k995634
$$ 92747215 78844740 68221960 59744944 52788594 47423022 43004077 38994787 35999153
18911C5999153k303859k120407k127909j941296j664958j493251j097209j040880
$$ 35999153 33695294 31574887 29446978 27505682 25840724 24347473 23250264 22209384
18903B2209384q01919q32880j071723j213933r26007p31961n50756n06711o37393
$$ 22209384 21407465 20574585 19502862 18288929 17362922 16630961 16080205 15573494 14936101
18894A4936101r14303r34830p17002o11805m88576l48564l52749n44919m91086
$$ 14936101 14021798 13086968 12369966 11758161 11269585 10921021 10568272 10023353 9532267
18885I532267k59727j27155j26179R1385J6340k08451l19395j49812l06398j10639
$$ 9532267 9272540 9145385 9019206 9110591 9126931 8918480 8599085 8449273 8142875 8032236
18875H032236j46357q377j18785J5769J80737J1596M0298P7270J75985K10315
$$ 8032236 7885879 7877502 7758717 7774486 7955223 7966819 8007117 8084387 8260372 8470687
18865H470687J39874L5285l7758J34473P6984m1325J24199K59996M59886J89884
$$ 8470687 8610561 8645846 8608088 8742561 8819545 8778220 8902419 9162415 9622301 9812185
18855I812185J49096J60979K08151K85553N40574O13879M33828K91047M23423
$$ 9812185 9961281 10122260 10330411 10615964 11156538 11770417 12204245 12495292 12918715
18846A2918715M27784M54985O02962P53970N24992M36875P22330J034027J023518
$$ 12918715 13346499 13801484 14404446 15158416 15683408 16120283 16842613 17876640 18900158
18837A8900158R73319R44700R35984J058493J181720J282103J277835J257523
$$ 18900158 19873477 20818177 21754161 22812654 23994374 25276477 26554312 27811835
18829B7811835J285059J502851J759704K015821J959493J990910K235119K630397
$$ 27811835 29096894 30599745 32359449 34375270 36334763 38325673 40560792 43191189
18821D3191189K949750L377927L905304M076174M623286N211383N833108O752949
$$ 43191189 46140939 49518866 53424170 57500344 62123630 67335013 73168121 79921070
18813G9921070P693429Q802858R669143J0817917J2202937J3694650J4960089
$$ 79921070 87614499 96417357 106086500 116904417 129107354 142802004 157762093
18806A57762093J5695895J6747808J6704940J5848921J4802315J2917592J0277689
$$ 157762093 173457988 190205796 206910736 222759657 237561972 250479564 260757253
18799B60757253P139085M100273J478498j361533m479440p480073j0112675j2674441
$$ 260757253 267896338 271996611 273475109 272113576 267634136 260154063 250041388 237366947
18791B37366947j4673302j5790826j6211050j6249450j5532230j4422465j3328639
$$ 237366947 222693645 206902819 190691769 174442319 158910089 144487624 131158985
18784A31158985j2169825j1168148r761262q686144p706430o768425o044134n469318
$$ 131158985 118989160 107821012 98059750 89373606 81667176 74898751 68854617 63385299
18776F3385299m978823m313072l936842l386292k913969k663868k389657k304417
$$ 63385299 58406476 54093404 50156562 46770270 43856301 41192433 38802776 36498359
18768C6498359k132228j959256j800938j696817j453428j311875j168082j105912
$$ 36498359 34366131 32406875 30605937 28909120 27455692 26143817 24975735 23869823
18760B3869823j120291j082293j155299j025874q76895q46605p09593q83753p84843
$$ 23869823 22749532 21667239 20511940 19486066 18609171 17762566 17052973 16169220 15384377
18751A5384377q13494p75913o46942o11400o14040l77050m56609m80741n05324
$$ 15384377 14570883 13794970 13148028 12536628 11922588 11545538 11088929 10608188 10102864
18742A0102864k94859m20469m47081n38213l31811j22967j85829j93824n29014
$$ 10102864 9808005 9387536 8940455 8402242 8070431 7947464 7761635 7567811 7038797
18733G038797l49571j13475j86883j53179k49576k91989j56288r3351j63721l95660
$$ 7038797 6689226 6575751 6388868 6235689 5986113 5694124 5537836 5444485 5280764 4885104
18723D885104j76666j73638j41808k36520o0467k359l9484k6054q8689r4977j41314
$$ 4885104 4708438 4534800 4392992 4156472 4096005 4093646 4054162 4028108 3939419 3844442 3703128
18712C703128l11078k57953k50363K7642K16371p0218k46351J4865k2355l52759
$$ 3703128 3392050 3134097 2883734 2911376 3127747 3057529 2811178 2826043 2803688 2450929
18702B450929j87230P6339J68945o990j10586j21064n6019Q3081o683M1201j74028
$$ 2450929 2263699 2340038 2508983 2501993 2391407 2270343 2214324 2297405 2290722 2331923 2157895
18691B157895j77520j52121k36736K9486L9672j04635J32077J45096J29071K365
$$ 2157895 1980375 1828254 1591518 1621004 1660676 1556041 1688118 1833214 1962285 1964650
18681A964650j06459q6668j26129j77378k13982l5580K9707j39501P615N0719
$$ 1964650 1858191 1771523 1645394 1468016 1254034 1218454 1248161 1108660 1116275 1166994
18671A166994M4220q8671J04990M6179j54950j30629J928J01448m9837l196l1519
$$ 1166994 1211214 1122543 1227533 1273712 1118762 988133 990061 1091509 1041672 1038476 1006957
18660A006957r6677j6556k5991Q335J79794P1985m4104K312l7393m8312o5295
$$ 1006957 910280 893724 867733 876068 1055862 1127847 1083743 1086055 1048662 1000350 935055
18649I35055j8527M4287M6116J51955K87165r1077k45881K965j69288k0281K39384
$$ 935055 916528 960815 1006931 1158886 1446051 1354974 1109093 1112058 942770 922489 1161873
18638A161873R0633k06883l10496p0676j5100j01620l6519O088L00516M68141
$$ 1161873 1252506 1045623 735127 664451 649351 547731 511212 517300 817816 1285957
18628A285957q088J25450o9313L8685N09888N70235l8544l79597l15112j77755
$$ 1285957 1277869 1403319 1334006 1372691 1882579 2452814 2414270 2034673 1719561 1541806
18618A541806l63980j36106l04369j64121j94805K24622l412K5381K09789r3800
$$ 1541806 1177826 1041720 737351 573230 378425 603047 599635 625016 834805 741005
18608G41005k34384J09214K0964m9911M5758j85450q6461j07173K05388N1082
$$ 741005 506621 615835 636799 586888 632646 447196 360735 253562 458950 510032
18598E10032q5175M3640j74653p5555r9589j03112J63962J11894o0262J35574
$$ 510032 424857 468497 293844 218289 118700 15588 179550 291444 231182 366756
18588C66756O3377n0998m0885J6674q1359l9715k08109j49005N57545K48747l19596
$$ 366756 430133 379135 338250 354924 273565 233850 25741 -123264 434281 683028 363432
18577C63432k07467j33710j24762p280j62531J57497J53048L6159K9673l1225
$$ 363432 155965 22255 -102507 -109787 -272318 -114821 38227 74386 104059 72834
18567G2834K4617l9768P6150J68646j782M1347M7966k12388l23849J45970O2136
$$ 72834 97451 57683 133833 302479 300697 342044 390010 177622 -146227 -257 61879
18556F1879J41633Q7187n1558j02760M5196k05542j23803J2265M4339K67160J12418
$$ 61879 203512 290699 239141 136381 181577 -23965 -147768 -135503 -91164 175996 288414
18545B88414j63451q425M2539q956k15816j64562m5186J90637K38827K07073K1377
$$ 288414 124963 116538 159077 150121 -65695 -230257 -275443 -84806 154021 361094 382471
18534C82471r9108k14959k95701K27858J35710k86297k08521J63161R0242J9326
$$ 382471 283363 68404 -227297 561 136271 -150026 -358547 -195386 -105144 -85818
18524h5818M0545n2589q2875L8488k8778L0710J68149Q1311k16478n0591K8588
$$ -85818 -45273 -97862 -180737 -142249 -171027 -140317 27832 109143 -107335 -157926 -129338
18513a29338J1358l3392m1164l1184L0944J00515L3653l8285R8497L4610j92840
$$ -129338 -117980 -151372 -192536 -223720 -192776 -92261 -58608 -96893 1604 36214 -156626
18502a56626k4929J5617J33796r1978l52050q8207J95892K35722j8273j28774
$$ -156626 -181555 -165938 -32142 -124120 -476170 -564377 -368485 -132763 -151036 -279810
18492b79810k6584Q1590n9681K9243o0498j42067P4530J23387J11289J19196K1163
$$ -279810 -306394 -224804 -284485 -255242 -315740 -457807 -383277 -259890 -148601 -29405 -8242
18481h242k13946O2838M6820j53206Q0107K4004L4627k2950k90959J54747J89529
$$ -8242 -222188 -159350 -112530 -265736 -185629 -161625 -126998 -149948 -440907 -286160 -96631
18470i6631O6116J39938k48726j84919J6884M2751j74123n5901p717J56064M2567
$$ -96631 -30515 109423 -139303 -324222 -307338 -264587 -438710 -494611 -502328 -346264 -303697
18459c03697j531Q365m3534J39870L04495J44968j50820k5319k59031N977j67639
$$ -303697 -305228 -296863 -340397 -200527 103968 248936 98116 72797 -186234 -180257 -347896
18448c47896Q5207J22669m5811r1560j22281m2662K61067K68531p1844j45544
$$ -347896 -262689 -140020 -185831 -277391 -399672 -442334 -181267 87264 15420 -130124
18438a30124P6816M0367j5178J5549J26650n9412L184q673j09058j74338j03232
$$ -130124 -53308 -12941 -28119 -12570 114080 54668 57852 49179 -59879 -234217 -337449
18427c37449J8186J6944J711K17420p224J14690N7061O0850r9233j61036L9020
$$ -337449 -319263 -302319 -300608 -83188 -90412 24278 81339 142189 42956 -118080 -79060
18416g9060J1449j96150j32626K47842K10425j48105O5204j09757r3161j47236
$$ -79060 -67611 -263761 -396387 -148545 61880 -86225 -21021 -130778 -223939 -371175
18406c71175m1854j46952L150J96129J76580K05270n4178n6131p0447j00756N6442
$$ -371175 -413029 -559981 -556831 -360702 -184122 21148 -33030 -89161 -159608 -260364 -203922
18395b03922R7683k8320q7741j13725l5324k21P2605R5134m2115L0232J59108
$$ -203922 -106239 -134559 -222300 -336025 -371349 -371570 -298965 -203831 -245946 -215714 -56606
18384e6606l32821k76991j1003P4689J51544J58958J19314M14601J5534l77159
$$ -56606 -389427 -666418 -677421 -602732 -451188 -292230 -172916 241685 257219 -119940
18374a19940l56712m014L57051k7026j11843l2524J23773k3899k73480P213J9525
$$ -119940 -476652 -480666 -123615 -150641 -262484 -295008 -171235 -195134 -468614 -461401 -441876
18363d41876J12441j05282R5798Q2435l7855J63979R6913j1887P2415j5435l63538
$$ -441876 -329435 -434717 -338919 -256484 -294339 -130360 -33447 -45334 27081 11646 -351892
18352c51892m2061J24214j30780O3226J97800J34667p2206j2120P4845K8820R8291
$$ -351892 -393953 -269739 -400519 -337293 -139493 -4826 -77032 -89152 -14307 14513 112804
18341A12804n6726k10316m9397J64453J5550j75087l22347L2113Q3079q0028R1223
$$ 112804 56078 -154238 -203635 -39182 -23632 -198719 -521066 -488953 -405874 -485902 -394679
18330c94679l9693J39243L1329l1116Q0463J71785K2027K2192N0670j8344J6874
$$ -394679 -434372 -295129 -263800 -294916 -214453 -42668 -20641 1551 52221 33877 50751
18319E0751j27517j38979k7077J24781R2019J7894o7830N1147R4739l7899j35706
$$ 50751 -76766 -215745 -242822 -118041 -26022 -8128 -75958 -24811 69928 32029 -103677
18308a03677K17687J47788j10907l22536l11001O027L66459L98678P7257r6895
$$ -103677 114010 261798 150891 -171645 -482646 -476619 -110160 288518 365775 268880
18298B68880k21236k01668J44332J59294j0657o9568j97901J39160Q7117J33575
$$ 268880 47644 -154024 -9692 149602 138945 69377 -128524 10636 97753 231328
18288B31328K4650n4765J31469J79576j45766q7764k4608J23402J22107J86843
$$ 231328 255978 201213 332682 512258 366492 278728 254120 377522 499629 686472
18278F86472k1960j30390K60048K21096J78924L97357K61892J34278J45026J52685
$$ 686472 664512 534122 794170 1015266 1194190 1591547 1853439 1987717 2132743 2285428
18268B285428J1490j30558m7889P3043m5461j61238k55652m75908l83845o136
$$ 2285428 2296918 2166360 2118471 2191514 2146053 1984815 1729163 1253255 869410 863274
18258H63274q7373j48876j9954o2364K4596L7119n9197j49050o138J58202j5357
$$ 863274 775901 627025 607071 544707 569303 606422 547225 398175 392037 550239 534882
18247E34882m4575K3495m3116k92357j6351k1663j76174j27789K04066M2722r4490
$$ 534882 490307 513802 470686 178329 161978 140315 -35859 -163648 40418 83140 -11350
18236a1350n7970J27004K45154R1089R7439j41175k50687o1225J67558j54916
$$ -11350 -69320 57684 302838 393927 491366 350191 99504 38279 205837 50921
18226E0921j98631J52025L593J23703N6458k49577p7561J19514j6752j38453Q3972
$$ 50921 -147710 4315 7908 131611 188069 -61508 -139069 -19555 -36307 -174760 -90788
18215i0788M9882J17230Q2876N6840r9943j987J30157j82384m3296R6122Q7286
$$ -90788 -40906 76324 159200 216040 116097 114110 244267 61883 18587 114709 201995
18204B01995j3498J32427J25250K29496m8712n5024N3110L0461K63795J8431M004
$$ 201995 188497 320924 446174 675670 626958 571934 625044 655505 919300 937731 941735
18193I41735M813m3869P6526J13609M9505L02878R7477J3164l04762j89302l14063
$$ 941735 946548 902679 979205 1092814 1142319 1445197 1542674 1555838 1251076 1061774 747711
18182G47711q9014l7807N6736J37658Q6256j91742l15487m3581j00K07165J6081
$$ 747711 658697 620890 677626 815284 901540 709798 394311 350730 350630 557795 573876
18171E73876j76869k1279J9902j19012j00157m5805l4507R0654Q4666N2394m2085
$$ 573876 397007 375728 395630 276618 176461 130656 96149 186803 271469 323863 281778
18160B81778m05057m3853P9789o3317q7273J37005Q8645j08853J751O9367J39878
$$ 281778 -123279 -167132 -87343 -150660 -237933 -100928 -12283 -121136 -119385 -50018 89860
18149H9860j26021p8446N7916J02653p9493j85090k02625J1651R7715K49285K92384
$$ 89860 -36161 -114607 -56691 45962 -33531 -218621 -421246 -409595 -311880 -62595 229789
18138B29789k2613l74806k51809m1930R0637J98914M5518j5457J4276n5675K29148
$$ 229789 207176 -167630 -419439 -461369 -370732 -171818 -126300 -141757 -127481 -183156 45992
18127D5992O8888q2575L2235K09237j66515q932J64m6663r5983k63835j57895
$$ 45992 114880 32305 64540 273777 107262 98330 98494 51831 -44152 -307987 -465882
18116d65882j54872M00172M70143K0410j91717O8674O2476M0691n4881j37674
$$ -465882 -620754 -220582 249561 269971 78254 146928 209404 250095 195214 57540
18106E7540j72029M6332J61138K5946o8346p0982J39693J49610r4365k80590k82459
$$ 57540 -114489 -68157 92981 118927 50581 -20401 119292 268902 174537 -106053 -388512
18095c88512j24845P458J74838Q1799r718j21350o286l497K22736K23499k9595
$$ -388512 -513357 -505899 -331061 -249262 -258980 -380330 -386616 -390113 -167377 56122 26527
18084B6527p3103P63R8591k3025k14316J69248L582k26369j42157k2066J55338
$$ 26527 -46576 -45813 52778 29753 -184563 -15315 -11733 -238102 -380259 -402325 -246987
18073b46987p1553k2757K5285l2655j47781P6077J57955r147j48442L6607N8960
$$ -246987 -318540 -341297 -316012 -348667 -496448 -420371 -262416 -271563 -420005 -383398 -324438
18062c24438J37724J07700J7442k70334j29385O5008l1793m8550O9464k5935K56619
$$ -324438 -186714 -79014 -61572 -331906 -461291 -396283 -428076 -476626 -407162 -433097 -176478
18051a76478q6884l12995j33345p8987J25014R2163K23604l415N777J45527K11102
$$ -176478 -263362 -576357 -709702 -788689 -663675 -571512 -347908 -351323 -345546 -200019 11083
18040A1083j55959j41847J13595o1354J29820P8226Q2694j67967O0681K6985k26067
$$ 11083 -144876 -286723 -173128 -234482 -104662 -26436 56258 -111709 -51028 -24043 -250110
18029b50110m5240J36252P4227M9323J44774o9735o8036l8987j4132j82846k13254
$$ -250110 -295350 -159098 -84871 -35548 109226 39491 -28545 -67532 -81664 -264510 -477764
18018d77764R1725J51415J24151M9757k38386l1799J32890M8825j96061l6319
$$ -477764 -386039 -234624 -110473 -60716 -299102 -330901 -198011 -149186 -345247 -381566
18008c81566J42418O4767M9084K07599j28584j35998J71255L7507p1372J57074
$$ -381566 -239148 -174381 -125297 82302 -46282 -182280 -11025 26482 -44890 112184
17998A12184N0056q5516j95010q4779J40247n1847j34354K11006P7737j2658o7567
$$ 112184 162240 76724 -118286 -203065 -62818 -114665 -249019 -38013 39724 27066 -40501
17987d0501o5244J16690o7235p1849j8572M6962q2715n1022m584J03982R4435
$$ -40501 -105745 10945 -56290 -128139 -146711 -99749 -182464 -233486 -238070 -134088 -39653
17976c9653j22556j4483M1857o2954j54780J0899P0913K14052j4953j09989m8552
$$ -39653 -162209 -176692 -134835 -197789 -352569 -341670 -270757 -56705 -71658 -181647 -230199
17965b30199o3618N3001O9487M2601J81716R3587o828j10903k00738j26701k8389
$$ -230199 -293817 -240816 -171329 -128728 52988 146575 139747 28844 -171894 -298595 -326984
17954c26984j53576R6868K06906J26383j61248N717l929j40327J289N9351J3654
$$ -326984 -480560 -383692 -176786 -50403 -211651 -205934 -209863 -350190 -348901 -289550 -275896
17943b75896J21929R3303K54640K7549j68283J15344r3395M6459l0889j2717K7732
$$ -275896 -153967 -60664 193976 221525 53242 168586 75191 121650 90761 78044 105776
17932A05776O5219Q0646j25994J18877J85442J45947P9741N7300R8883M4647j05793
$$ 105776 170995 251641 125647 244524 429966 575913 655654 712954 811837 856484 750691
17921G50691j67695L1358K33058K77767K43409L53414L67175O25874N67356J187096
$$ 750691 582996 614354 847412 1125179 1368588 1722002 2089177 2715051 3282407 4469503
17911D469503J687530J745720J096141P3713j31543j90345J31264N73352M10161
$$ 4469503 6157033 7902753 8998894 9072607 8941064 8750719 8881983 9455335 9865496
17902I865496k63116j400479j489942j217042j380582j093747q70838p53683k94504
$$ 9865496 9602380 8201901 6711959 5494917 4114335 3020588 2149750 1396067 1101563
17893A101563o5543l7914j56758j12059j0592j77968k30397K8862J47462r3957
$$ 1101563 1036020 998106 841348 729289 718697 540729 310332 339194 486656 392699
17883C92699j09230J4448J57809m2823l8184J7136j01004j98387J12954J23801
$$ 392699 283469 297917 455726 412903 374719 391855 290851 92464 205418 329219
17873C29219n5649P7692J5921Q0499k0331m5397r4749O8051j21063l1300j5264
$$ 329219 273570 351262 367183 447682 427351 381954 287205 355256 234193 202893 187629
17862A87629p0643j32132j14018J33957l5294n8642j7386R8065o5855k57432R9123
$$ 187629 116986 -15146 -129164 4793 -30501 -89143 -106529 -8464 -74319 -331751 -232628
17851b32628P6319M4561l3307k8684J00468O6254Q6425j07939j53586j13146j17065
$$ -232628 -156309 -111748 -145055 -173739 -73271 -7017 79408 -28531 -182117 -295263 -412328
17840d12328J75037L20123O9979N8907l13612k96185M2914n8809M5523J11103
$$ -412328 -237291 82832 152811 211718 -101894 -398079 -355165 -413974 -368451 -257348
17830b57348N9018j01321j62728j119N8634J62585J09251k5293P9426q2113O977
$$ -257348 -198330 -299651 -462379 -463498 -404864 -242279 -133028 -158321 -78895 -161008 -154031
17819a54031Q9260m1418L4928J37053R5090K76M1646J8266j07501j33647r5236
$$ -154031 -64771 -106189 -71261 65792 160882 161158 202804 221070 113569 -20078 -115314
17808a15314j97989J05704J16456j46410q4608J09888K62481J25370l4361k866
$$ -115314 -313303 -207599 -91143 -237553 -322161 -212273 50208 175578 141217 138351
17798A38351q560M908l4406J57834K1885m7063n3809j59539n1421R3269Q086J40913
$$ 138351 129791 134699 100293 258127 280012 232949 179140 19601 -31820 61449 69535 210448
17786B10448j5797J18155k8173k68871j19021J15434N5256r5586l1329j34322
$$ 210448 194651 312806 284633 15762 -103259 12175 67431 -28155 -59484 -193806
17776a93806P6722J34629j17476j89887K22005Q650Q1559J13228l4744k30759
$$ -193806 -117084 17545 -99931 -289818 -67813 -59163 22396 135624 100880 -129879
17766a29879N9705n8914j11885Q5177J36084n8024L9667j34974M5830Q7074Q2904
$$ -129879 -70174 -129088 -240973 -155796 -19712 -77736 -38069 -173043 -127213 -40139 42765
17755D2765J88696r6533j07791j41919p5400Q0350q011l6032M5979K002P3711
$$ 42765 231461 134928 27137 -114782 -190182 -109832 -117843 -153875 -107896 -105894 -32183
17744c2183M2867n2664R4922J03669k1132j82425R3277M2645J30348L9178j07147
$$ -32183 10684 -41980 52942 156611 135479 -46946 46331 88976 219324 258502 151355
17733A51355j22912l4462J25139P6832J6985k30960j10426Q4591k38055J6858
$$ 151355 28443 -6019 119120 195952 212937 -18023 -128449 -43858 -281913 -265055
17723b65055j05593P3568J42932K3763p9737K2853r3767r5077l5606k17156j5382
$$ -265055 -370648 -297080 -154148 -130385 -210122 -187269 -281036 -376113 -411719 -628875 -644257
17712f44257J55229R7844N8244N3354J18309M9214j02331J81715K87327n6153
$$ -644257 -489028 -391184 -332940 -279586 -161277 -112063 -214394 -32679 254648 198495
17702A98495j49721k34801M0967P2594j02859j01292r8620j43814r2579P2407
$$ 198495 48774 -186027 -145060 -72466 -175325 -276617 -375237 -519051 -611630 -539223
17692e39223J56719K12489R9761k12641M5572K8350J63430K28783j8049k4656
$$ -539223 -382504 -170015 -70254 -282895 -237323 -208973 -45543 183240 165191 140535
17682A40535k82513j16109Q2452J4260j07473l4195J03424N9628J380P1862L34731
$$ 140535 -141978 -258087 -175635 -161375 -268848 -303043 -199619 -139991 -138611 -66749 267982
17671B67982M3113j47636j38239K5231j2369j7986J08031j7288p6824M0229k4594
$$ 267982 311095 163459 25220 50451 38082 20096 128127 110839 34015 74244 49650
17660D9650J6345M9697l00094j74757J39139q2265j63431J36861l4888j19020
$$ 49650 65995 115692 -184402 -359159 -220020 -302285 -465716 -328855 -363743 -482763
17650d82763J31582J91756J51615J01215l1670k0840J09801l3346k59302j11723
$$ -482763 -351181 -159425 -7810 93405 61735 40895 150696 117350 -141952 -253675
17640b53675J63893J43662j3335j56702k58975l5546k8025J47147J85700M2411
$$ -253675 -89782 53880 40545 -116157 -375132 -410678 -438703 -291556 -105856 -63445
17630f3445O69m8073j2173k0853k462J57388j70190l37614R7031Q1794m8953J03649
$$ -63445 -62776 -110849 -123022 -143875 -146337 11051 -159139 -496753 -399722 -317928 -366881 -263232
17618b63232J1386m5543O6358O8845J13400J38454m7703q5928J28174J506j79481
$$ -263232 -251846 -297389 -231031 -162186 -48786 89668 41965 -43963 84211 85717 -93764
17607i3764m1078J23510q7266j32347M145k8537J29557j62517o3776J25529j39277
$$ -93764 -134842 -11332 -98598 -230945 -226800 -255337 -125780 -288297 -352073 -226544 -365821
17596c65821r2437K44661L28566O8260j23837j06962L9148l5995k491j56466k5168
$$ -365821 -458258 -213597 114969 183229 59392 -47570 -8422 -44417 -46908 -203374 -228542
17585b28542k18M4703J71107K46629j59226l05091O4862l7091o3872n9099Q6197
$$ -228542 -228760 -184057 -12950 233679 74453 -230638 -165776 -202867 -266739 -325838 -239641
17574b39641M4868N5407M7783J23056n3170j44070j08202K1680P4066K1301n1203
$$ -239641 -194773 -139366 -91583 31473 -21697 -165767 -273969 -252289 -178223 -156922 -208125
17563b08125P6395m3823j48158m8564J2343R4087N0167j28920j94679j45876J16804
$$ -208125 -131730 -175553 -323711 -372275 -359932 -265845 -215678 -344598 -539277 -685153 -568349
17552e68349J96225N5298q9082j4678K11675l9446j4519m1759l8526R0700K5696
$$ -568349 -372124 -316826 -405908 -420586 -208911 -248357 -262876 -304635 -343161 -252461 -226765
17541b26765J778K77380o9946k92210m2849K38041O3149j96797j37304O3988K42961
$$ -226765 -224987 52393 -17553 -309763 -352612 -114571 -51422 -248219 -385523 -321535 -78574
17530g8574L10626k8627j52637k09723j9987M7468p4277j01207K2416P8406R4022
$$ -78574 232052 203425 50788 -158935 -178922 -131454 -205731 -306938 -284522 -206116 -112094
17519a12094J21103j54130j32886j14710p9654P62M6258p5413P4874K54865J05554
$$ -112094 9009 -145121 -278007 -392717 -472371 -471609 -425351 -500764 -425890 -171025 -65471
17508f5471J43021J05039k27820l20216k42164R8567K22024J01277M802r6274
$$ -65471 77550 182589 -45231 -365447 -607611 -509044 -287020 -185743 -180941 -277215
17498b77215j27777K43410r2645J06836j80127n1462n2425K47614K67847r5863
$$ -277215 -404992 -161582 -254227 -147391 -327518 -378980 -431405 -183791 84056 -11807
17488a1807j12250J54518O6535J21283J9279q0841o3432j33587r5638Q9596N5289
$$ -11807 -124057 30461 96996 218279 237558 156717 93285 -40302 -135940 -46344 8945
17477H945n560j82302k71798L854J75906L740j21010J05343l5506j12048Q372
$$ 8945 3385 -178917 -450715 -446861 -270955 -267215 -388225 -282882 -318388 -430436 -422064
17466d22064m9631r7940M6420K06387J71154j95126k07146j69527K29990J26605
$$ -422064 -471695 -569635 -523215 -316828 -145674 -340800 -547946 -717473 -487483 -360878
17456c60878q6478J9338J14984J22339K10680N73j06144j60418j23884K0038q425
$$ -360878 -447356 -428018 -313034 -190695 19985 20558 -85586 -246004 -369888 -349850 -358275
17445c58275l218J16707J7576Q8009j18746k13018J78910J42624K09270J85158
$$ -358275 -361493 -244786 -227210 -139201 -257947 -470965 -292055 -149431 59839 244997
17435B44997k01194q6744k3486N2904j77433j22692l0062J33907l7801o4678j7908
$$ 244997 43803 -42941 -66427 -13523 -190956 -313648 -343710 -209803 -247604 -312282 -330190
17424c30190O0290R44j7873L7008q437J04952J03619j59587j46244M9473k8757
$$ -330190 -269900 -268956 -286829 -249821 -258258 -153306 -49687 -209274 -355518 -306045 -334802
17413c34802J15037L0502q9700j01508j05029j39232M11446K47264j88407l8476
$$ -334802 -219765 -189263 -278963 -380471 -485500 -624732 -213286 33978 -154429 -192905
17403a92905j5526J08596j10133j06886K08678J97041j42228l21756K5967M6388
$$ -192905 -208431 -99835 -209968 -316854 -108176 88865 -53363 -375119 -349152 -302764
17393c02764r3189Q1703r1127j0995j34843J4238J5255Q3454P2695J56330Q2582
$$ -302764 -395953 -314250 -405377 -416372 -551215 -536977 -521722 -438268 -365573 -209243 -126661
17382a26661L4480j2402J78373M9994q6822N5526L3532j52191j34795O1905J34206
$$ -126661 -92181 -104583 73790 123784 36962 92488 126020 -26171 -160966 -99061 35145
17371C5145J61696j31547k31724j89520J0278J09882Q8059l4852O2735J17901
$$ 35145 196841 65294 -166430 -355950 -345672 -235790 -147731 -182583 -119848 -1947
17361a947m0216Q9381O2289l77417r3854J29586p7726q2345O2312K95738p299
$$ -1947 -42163 47218 109507 -267910 -361764 -232178 -309904 -392249 -329937 -34199 -41498
17350d1498k41665j58711L8488j7799j7293J0364J18594n1708j55841K16292J96429
$$ -41498 -283163 -441874 -403386 -421185 -438478 -428114 -309520 -361228 -517069 -300777 -104348
17339a04348P4265M6336n2756j15749K9538j19078Q3930J77548p7727n7151R5632
$$ -104348 -30083 16253 -36503 -152252 -122714 -241792 -157862 19686 -58041 -115192 -19560
17328a9560M6076l7629m792L2111j5037M2031l7130N1769N3066n8209q7134q7021
$$ -19560 26516 -11113 -15905 16206 1169 43200 6070 57839 110905 52696 -34438 -121459
17316a21459p7545j33605K9561L2595K5822J43453P3251o1401O9427J45625n3080
$$ -121459 -199004 -332609 -303048 -270453 -244631 -101178 -27927 -89328 -19901 125724 72644
17305G2644n4954J5200k24159m0364K6291j01442L3675P1640J01347j697k75200
$$ 72644 17690 32890 -191269 -231633 -205342 -306784 -273109 -201469 -100122 -101819 -377019
17294c77019J7883J96616L8108K19238j3326k27994n6011Q5954j33216j13229
$$ -377019 -359136 -162520 -124412 94826 81500 -146494 -202505 -116551 -249767 -362996
17284c62996K990n9796L07714Q7377k76201j54715Q5845J17314J83235L13777
$$ -362996 -360006 -419802 -112088 -24711 -300912 -455627 -369782 -252468 -69233 244544
17274B44544j91230j44351j9582m4604J36658K04567r1683q1833r5899k34068
$$ 244544 53314 -91037 -110619 -155223 -18565 186002 94319 12486 -83413 -317481
17264c17481L1718K32869J16260q603j9962J89048J564q6272J31694m5262l7820
$$ -317481 -285763 -52894 63366 54763 34801 223849 225413 139141 270835 225573 187753
17253A87753J18910l8126J01998J6349J66141j34166k20561n3932j38125j01473
$$ 187753 306663 268537 370535 386884 553025 418859 198298 144366 6241 -95232
17243i5232j35704K27138n4265M0411J59758N5817M5290O2393m9933k18991p9835
$$ -95232 -230936 -3798 -58063 -17652 142106 197923 243213 305606 255673 36682 -43153
17232d3153J22426J39472K56203l9298j04026k26634p4775J77226J5539j31762
$$ -43153 79273 218745 474948 435650 331624 104990 30215 207441 222980 91218
17222I1218K3669J63102J55154P4109Q8352l5386l1964J55019n1188n7323L6220
$$ 91218 114887 277989 433143 507252 595604 560218 528254 683273 632085 574762 610982
17211F10982k77091J04394K41765K01757m0803J2476K37791J76389L09938K30122
$$ 610982 333891 438285 680050 881807 841004 853480 1091271 1267660 1577598 1807720
17201A807720j834P4190N68578P37281Q77393Q83047J040084R29553Q65218L57635
$$ 1807720 1805886 1880076 2448654 3185935 4063328 4946375 5986459 6916012 7781230 8138865
17191H138865L7997p40117q27120q76704r10369p42230o90094q02827m18483l21302
$$ 8138865 8176862 7436745 6609625 5732921 4822552 4080322 3390228 2587401 2168918 1847616
17181A847616l20730l45264l45935j41863j35440N1033J02987j62817l51379j03865
$$ 1847616 1526886 1181622 835687 693824 558384 609417 712404 549587 198208 94343
17171I4343J47057J45553J65087j90318k04452j84352R5742R2110k1413l8511
$$ 94343 241400 386953 552040 361722 157270 -27082 68660 160770 139357 100846
17161A00846L4152J8866j14577l8005J39871k47276j75286J22784r291J26704
$$ 100846 134998 153864 39287 1282 141153 -106123 -281409 -158625 -167916 -41212
17151d1212M7453K2989j09111J71278p9882R0601j90666k37174J27527J07127
$$ -41212 6241 29230 -79881 91397 11515 102116 -88550 -325724 -198197 -91070
17141i1070j89447k18168m1917K77743J78382q6195O1023r2708N0595J26988p8420
$$ -91070 -280517 -498685 -540602 -262859 -84477 -170672 -109649 -202357 -151762 -24774 -103194
17130a03194m1623L91613L13827j92328k69981K3103j26488K0442l8830J24948
$$ -103194 -144817 246796 560623 368295 98314 121417 -5071 15371 -23459 101489
17120A01489n5824j19073r251j03041K3680J64392J02004p2937l9438O7279N1881
$$ 101489 45665 -73408 -82659 -185700 -162020 2372 104376 31439 -7999 59280 111161
17109A11161j12703k22353K4039J5764P8765J26744k7666l6323O9332J24319j23900
$$ 111161 -1542 -223895 -199856 -184092 -105327 21417 -6249 -42572 26760 151079 27179
17098B7179j62702p203K14043j12353Q8096p6954j37895J61565J31813p855K14089
$$ 27179 -135523 -142726 71317 -41036 47060 -29894 -167789 -6224 125589 117734 331823
17087C31823P784p3698j48970j8652J80641k26066j60689k24387j7494N5683N9111
$$ 331823 339607 265909 116939 98287 278928 52862 -107827 -332214 -349708 -294025 -234914
17076b34914N6510Q3631J15Q8852j44484L1648J68627l3827N798R4485p5099J35876
$$ -234914 -178404 -94773 -94658 -5806 -150290 -118642 49985 16158 21956 116441 41342 177218
17064A77218M668j65108j21369j66013j76693l6450O1830J80056K96410P7604
$$ 177218 181886 16778 -104591 -270604 -447297 -483747 -421917 -241861 54549 132153
17054A32153o8372k6175J22860j5629k14307j8112J7386r0812j26549l355l7223
$$ 132153 63781 37606 160466 144837 -69470 -87582 -70196 -161008 -287557 -290912 -328135
17043c28135j1166O7521Q7146J39736M2710j79134j69260N4452N7476k8588J02387
$$ -328135 -339301 -271780 -184634 -44898 -2188 -181322 -350582 -296130 -238654 -267242 -164855
17032a64855K0348r8552J58599R7037j05565j07008K0781K25356M0052r3812k17362
$$ -164855 -144507 -243059 -84460 12577 -92988 -199996 -179215 46141 86193 -7619 -224981
17021b24981J00385K14222J40656p9726j66810j85390m5330O1261l4634j62524
$$ -224981 -124596 89626 230282 150556 -16254 -201644 -246974 -185713 -220347 -382871
17011c82871K4024N6800M044m9793j10678J93068K13152l9342j38725k0168K18528
$$ -382871 -358847 -302047 -298003 -347796 -458474 -265406 -52254 -91596 -230321 -250489 -31961
17000c1961m4717j09306q4430l8810n7388l635N8014K1035K9854o4417j6574N8716
$$ -31961 -76678 -185984 -270414 -309224 -366612 -370247 -312233 -291198 -261344 -325761 -342335 -283619
16988b83619r9370O1946J91122L2283k12237l9321O1846L8280P4286o6547L6072
$$ -283619 -382989 -321043 -129921 -97638 -309875 -349196 -287350 -249070 -174784 -241331 -205259
16977b05259J70687m725m097l53831j52155L5938R8273j25594M559j3915K31229
$$ -205259 -34572 -39297 -43394 -397225 -549380 -513442 -415169 -540763 -536204 -550119 -318890
16966c18890O6812l7907Q0313m2645O7224L0777m6932j47841m7541j21637J30494
$$ -318890 -252078 -289985 -209672 -252317 -185093 -154316 -201248 -349089 -396630 -518267 -387773
16955c87773J13903J87790J17896M1663O0341k31188k4426j24005j11796J69317
$$ -387773 -273870 -86080 31816 73479 133820 -97368 -121794 -245799 -357595 -188278
16945a88278N7251J1107J8978j4887j20767o5870j18016J57821P1967R4358N4804
$$ -188278 -131027 -119920 -100942 -115829 -236596 -302466 -420482 -262661 -190694 -96336 -41532
16934d1532l6955p2426O866O0957l56955r285J27865r8224R1231k6189m1491k34202
$$ -41532 -78487 -150913 -144047 -83090 -440045 -449330 -321465 -419689 -328458 -354647 -396138 -630340
16922f30340l2958K39531L6079q5423k905L72679N3940j61484j65867j10061k32843
$$ -630340 -663298 -423767 -387688 -473111 -476016 -103337 -49397 -210881 -376748 -486809 -719652
16911g19652j49076J13003K12748q9041O6518J36195j3982K05882k1423O7632
$$ -719652 -868728 -755725 -542977 -632018 -565500 -429305 -443287 -237405 -258828 -191196
16901a91196Q5790j14498l9351R7174M561k49772q0103J08993L6811r0766K4493
$$ -191196 -105406 -219904 -259255 -162081 -157520 -407292 -487395 -378402 -341591 -432357 -407864
16890d07864k7501M6331Q0864N2135K8012K01448J59267j9481J5303l9924O7937
$$ -407864 -435365 -389034 -308170 -256035 -228023 -26575 132692 113211 128514 88590 156527
16879A56527r1874j99263j50873K06882J69378N6414p8387O2143J72384l4480
$$ 156527 64653 -134610 -285483 -78601 90777 147191 68804 130947 303331 268851
16869B68851j60487j26146q5771k16076j58806j01904K66651M9040J40587J8748
$$ 268851 108364 -17782 -103553 -319629 -478435 -580339 -313688 -264648 -124061 -105313
16859a05313J64698o7860k22669p5587n1691P7092J62960J36438L9673p2454j32443
$$ -105313 59385 -8475 -231144 -306731 -358422 -281330 -118370 18068 57741 -14713 -147156
16848a47156l5101J0104L9741J488K10659j00102j77809J7046L5688M0683k0645
$$ -147156 -182257 -172153 -132412 -130924 79735 -20367 -198176 -181130 -145442 -104759 -125404
16837a25404l5285k52171K8933J95144N7489J41281K2968j51702n7541J5435r5122
$$ -125404 -160689 -412860 -383927 -188783 -131294 9987 32955 -118747 -176288 -160853 -255975
16826b55975j22571k0961K07360J38727r2695k7232M722j58092k2926J8969m4436
$$ -255975 -378546 -399507 -192147 -53420 -146115 -173347 -168625 -326717 -349643 -330674 -375110
16815c75110m8917k237R0316J43856k7486J01974o1040m0788P6591N3872p9888
$$ -375110 -424027 -426264 -335948 -192092 -219578 -117604 -178644 -219432 -142841 -88969 -168857
16804a68857J16696J01088K7914k00118j89693j09475l7904O7742J66963j7987
$$ -168857 -52161 48927 76841 -123277 -312970 -422445 -460349 -392607 -225644 -243631
16794b43631p3765J57193r4322j6090J23116K05956Q8913J75625l11799j47418
$$ -243631 -317396 -160203 -254525 -270615 -147499 58457 147370 322995 11196 -136222
16784a36222J62786J20796K3467j44872p1640p0077j18688J46567j36650j11700
$$ -136222 26564 147360 170827 25955 -45685 -115762 -234450 -87883 -224533 -336233
16774c36233K7538N716l4756Q4399k14918L3470r4387j38792K46493L05990R0860
$$ -336233 -308695 -302979 -337735 -253336 -468254 -434784 -529171 -667963 -421470 -115480 -24620
16763b4620o3743J45308j64980O1836J79535J20484m29048k82056j66472J91155
$$ -24620 -88363 56945 -108035 -46199 133336 253820 -175228 -457284 -623756 -432601
16753d32601J63800J53691j58341k35519M5823K76116k28213o0488J60974J0937
$$ -432601 -268801 -115110 -273451 -508970 -463147 -187031 -415244 -475732 -314758 -303821
16743c03821L5939j4413p9130l2333J10322Q5499J15906l0566j21083J17287L8107
$$ -303821 -267882 -282295 -361425 -393758 -283436 -197937 -82031 -112597 -233680 -116393 -78286
16732g8286J6555L3603j13973l356L582j1116j18308N4628J23603j5125q8164
$$ -78286 -61731 -28128 -142101 -145457 -141875 -152991 -271299 -216671 -93068 -108193 -196357
16721a96357l4486j3876r6987j08538J29900K07664J06586q8405j39548Q8618
$$ -196357 -230843 -244719 -341706 -450244 -320344 -112680 -6094 -94499 -234047 -145429
16711a45429l5931j05563K17316J05141j30127k17168J80707M8234r9581p1514
$$ -145429 -181360 -286923 -69607 35534 -94593 -311761 -131054 -82820 -182401 -253915
16701b53915L7578M2379M6804j80131k7255J2576o0871J34317K6083J42580J15704
$$ -253915 -216337 -173958 -127154 -307285 -334540 -321964 -382835 -248518 -222435 -79855 35849
16690C5849r786n2104r7212J52815n2260L883k5288j59554J24550J15152j31644
$$ 35849 26063 -26041 -123253 29562 -22698 -18815 -44103 -203657 -79107 36045 -95599
16679i5599k8599j21866Q8209K72870j34432L0216q0336P474K4102M0413O5066
$$ -95599 -124198 -246064 -157855 115015 -19417 10799 -69537 -62063 -37961 2452 67518
16668F7518J40533n5084j04753J11678P3243j68145K17783K0280j10377o8276
$$ 67518 208051 152967 48214 159892 233135 64990 282773 303053 192676 124400
16658A24400k47404k61434M3333J91612L14999q8407M220M065M3076O6742L0406
$$ 124400 -123004 -384438 -341105 -149493 165506 77099 81319 85384 128460 195202 225608
16647B25608q9390j55727J55938l0255j75705K6824Q7963m4404L6754q6732l27222
$$ 225608 136218 -19509 136429 106174 -69531 -42707 45256 852 37606 -49126 -376348
16636c76348R8954J43714J05716J20636j30648j35048K00223K49439j53611m4829
$$ -376348 -277394 -133680 -27964 92672 -37976 -173024 27199 276638 123027 78198
16626G8198K0313O2533M0139J405l3248N8568o053r5068k08594j54396j6895N4714
$$ 78198 98511 161044 201183 202588 169340 227908 221855 126787 -81807 -236203 -253098 -198384
16614a98384J93580K11683r5072L318O4842J9512j17386P404P864m9697N130R3099
$$ -198384 -4804 206879 111807 115125 179967 199479 82093 89497 97361 47664 52794 145893
16602A45893j53185j96314j05668r3519J09870q4240J73671J36774K91009M9383
$$ 145893 -7292 -203606 -309274 -402793 -292923 -377163 -203492 -66718 224291 273674
16592B73674j73890k38924l6290O1681j82840j51747R4957M2439K10941Q7869
$$ 273674 99784 -139140 -175430 -113749 -296589 -448336 -353379 -310940 -99999 -12130
16582a2130J19385J5129o6863n9854j41116p782j28447J03438J64290k5567O591
$$ -12130 107255 122384 55521 -4333 -145449 -153231 -281678 -178240 -13950 -39517 -32926
16571c2926J95137J8031k44228n0375k4833j80607J44258L08819N6181j42693
$$ -32926 162211 180242 -63986 -114361 -139194 -319801 -175543 133276 189457 46764
16561D6764j37703j70549R8468J12708J06760J37124J24490q3598j49913j8246
$$ 46764 -90939 -261488 -163020 -50312 56448 193572 318062 234464 84551 66305
16551F6305J9559O5438L9380j18008j20043L5713k40814L2058M8242P5330j20249
$$ 66305 85864 151302 190682 72674 -47369 -11656 -252470 -220412 -172170 -96840 -217089
16540b17089j46290J63656J33210j56492J6061J51029J7234r4345J08763j22915
$$ -217089 -363379 -199723 -66513 -223005 -206944 -55915 -38681 -133026 -24263 -147178
16530a47178m8893J18265n1468j4844J5463K4476j27992j27883J39903k8529j2833
$$ -147178 -196071 -77806 -129274 -144118 -128655 -104179 -232171 -360054 -220151 -248680 -261513
16519b61513K32m9462m9430J59513K59267j24172J769O8835L6380j97604j66191
$$ -261513 -261281 -310743 -360173 -200660 58607 -65565 -63796 5039 41419 -156185 -322376
16508c22376l5890l6496J87210N0684j0210J34068J98885m9368o9684r8805j25839
$$ -322376 -358266 -394762 -207552 -156868 -167078 -33010 165875 116507 46823 -51982 -177821
16497a77821K30491J10391j21455k33905K6864q9369J27961L4926j24167n4627
$$ -177821 52670 163061 41606 -192299 -165435 -254804 -126843 -91917 -216084 -270711
16487b70711m1820J84844J10832j805j37778P17k5365k05669k05948l2270J50008
$$ -270711 -312531 -127687 -16855 -18660 -156438 -155721 -181086 -386755 -592703 -624973 -474965
16476d74965L14864J53728J5526j03790o6907J42770l0778n9132J27200R3657
$$ -474965 -160101 -6373 9153 -94637 -161544 -18774 -49552 -108684 18516 112173
16466A12173j44932J4864R9211J3795j50751n7459L0075p5851k8377k44452k9356
$$ 112173 -32759 -17895 81316 95111 -55640 -113099 -83024 -158875 -187252 -431704 -461060
16455d61060O0524k3078Q8376J48584J2074M3186J94089j8732o8422m2491J0918
$$ -461060 -400536 -423614 -335238 -186654 -174580 -131394 62695 43963 -24459 -66950 -56032
16444e6032J23223l3135J74705J27486j31949l03723l7748M678K5868n5799J63772
$$ -56032 67191 34056 208761 336247 204298 -99425 -137173 -132495 -106627 -162426 1346
16433A346J62032k5732k08973j58704J61556J55797P214n1352J1875R0368j93133
$$ 1346 163378 137646 -71327 -230031 -68475 87322 94536 43184 55059 145427 -47706
16422d7706p1364q9140K28241L09743j20900m84l6302j35484j11352m3425K1260
$$ -47706 -119070 -208210 20031 329774 208874 208390 172088 36604 -74748 -118173 -96913
16411i6913o813p3383o5646R2485Q5465O6871K19491L6005k51481j33140J4158
$$ -96913 -103726 -177109 -242755 -150270 -64805 2066 221557 257562 6081 -127059 -112901
16400a12901j4062J9251j01230p4779o338o9756M2581L01447K07383N3522l5286
$$ -112901 -126963 -107712 -208942 -283721 -290059 -359815 -317234 -15787 191596 245118 209832
16389B09832j12233o6287M4186m7073P2693j6695k17416o2002K56064r1836l12290
$$ 209832 97599 31312 75498 28425 101118 84423 -132993 -194995 61069 -30767 -343057
16378c43057J02085M7479l7658n493J27812K7785n9930O4494j00891j29456P9857
$$ -343057 -240972 -193493 -231151 -236644 -108832 -81047 -140977 -76483 -177374 -306830 -226973
16367b26973J7414K15093J02576l0925k9793K86596n1741q9039M1471j1912j31252
$$ -226973 -209559 5534 108110 77185 47392 333988 282247 193208 234679 222767 91515
16356I1515j07651Q9803K31158K7665O7782K98498j1639K29488P3228o9503j56133
$$ 91515 -16136 73667 304825 332490 400272 698770 687131 916619 989847 920344 764211
16345G64211m76129j19792Q7183J68171K56055j37045k46178n0981j2526N6706
$$ 764211 288082 168290 255473 423644 679699 542654 296476 245495 232969 289675
16335B89675k1949p5736P6260m1607J77078J23676Q4464K38984L39186Q1084n6666
$$ 289675 267726 191990 268250 226643 403721 527397 611861 850845 1190031 1271115 1214449
16324A214449J50980j3471J31760J93386p0423j33490j92031j94172j84680k89774
$$ 1214449 1365429 1351958 1483718 1677104 1606681 1473191 1281160 1086988 902308 612534
16314F12534j42634l3694K24171n4187J0238p9080l46433m2658l5871J91707Q4161
$$ 612534 469900 436206 660377 606190 616428 537348 190915 148257 112386 304093 388254
16303C88254J74288Q8315J60455K46245k895j08771j512j61404j45853k26627
$$ 388254 562542 650857 811312 1057557 1054662 945891 944379 782975 637122 410495
16293D10495J28717r6480j12674P1504J12253J2747k40923j18554n9153j29749
$$ 410495 539212 442732 330058 401562 513815 526562 285639 167085 107932 -21817
16283b1817m1914J76100p9498n6853k9165J13450j86999J01865J62383J3565M4950
$$ -21817 -63731 112369 32871 -23982 -53147 60303 -126696 -24831 137552 151117 196067
16272A96067j2575j43133l1461J6796m4898j62968o4103R7707m3689j23392m4196
$$ 196067 183492 40359 8898 25694 -19204 -182172 -246275 -148568 -192257 -315649 -359845
16261c59845J18459O1075L18299L55094k93771l57195j57372K22446L643k72544
$$ -359845 -241386 -180311 137988 493082 199311 -157884 -315256 -92810 -89167 -361711
16251c61711J17380J55610r9747m6878J10028p8639k0119j96367j21529K210J52343
$$ -361711 -244331 -88721 -188468 -235346 -125318 -203957 -224076 -420443 -541972 -539762 -387419
16240c87419J44379j03503j75637J82902R4966p3923j08659Q8419P6804J22358
$$ -387419 -243040 -346543 -522180 -339278 -244312 -318235 -426894 -338475 -261671 -139313
16230a39313K40701P5618k45301k95757q0409J44860J62261K2731o5236K3288
$$ -139313 101388 177006 -68295 -364052 -444461 -299601 -137340 -114609 -179845 -156557
16220a56557P4634j97256l6455M2623M7559k2814n0606P9177J94644O4157p1823
$$ -156557 -81923 -279179 -315634 -273011 -225452 -248266 -298872 -219695 -25051 39106 -32717
16209c2717m8585j47931R5497M1039N3137K34660R092j64299k19994L1366L1362
$$ -32717 -81302 -229233 -133736 -92697 -39560 195100 204192 39893 -180101 -148735 -117373
16198a17373j08532l3922R3127N7467j970j59291N074J61938k3308n3906J43199
$$ -117373 -225905 -259827 -166700 -109233 -111203 -270494 -265420 -103482 -126790 -180696 -37497
16187c7497N1797j7357j0701M6750J36811N5713k27094N1243j55350k60196j28002
$$ -37497 14300 -3057 -13758 32992 169803 225516 -1578 49665 -105685 -365881 -493883
16176d93883J42288K79154J50988j2599k78048J05186Q8593j13340k9563J45100
$$ -493883 -351595 -72441 78547 65948 -212100 -106914 -18321 -131661 -161224 -16124
16166a6124j00535j68707L7576J38300K1895l7813n5783P9249k17397r9774J6521
$$ -16124 -116659 -285366 -247790 -109490 -87595 -125408 -181191 -101942 -319339 -419113 -402592
16155d02592J9916k4673K36515K46414p6056K2861J86122j3720n9921o7777N3474
$$ -402592 -382676 -407349 -170834 75580 -476 22385 208507 194787 134866 67089 120563
16144A20563O7343O522J94950R9703M3984Q2033j05747m7088M4409m7119Q599
$$ 120563 187906 194428 389378 489081 533065 615098 509351 462263 506672 459553 468152
16133D68152O6307k82264k42199j96683k75587j51690O5408O3145K08225k3065
$$ 468152 534459 252195 9996 -186687 -462274 -613964 -548556 -485411 -277186 -300251
16123c00251q9992p377K9708r6526R913J95836j9511Q9934J12469q290l1881R0049
$$ -300251 -390243 -397620 -367912 -464438 -454525 -258689 -278200 -188266 -75797 -84087 -115968 -25919
16111b5919j6207q3418L4640q0033j67686L1320N7399R7857L20604R0612M1477
$$ -25919 -42126 -125544 -90904 -170937 -338623 -307303 -249904 -152047 168557 259169 300646
16100C00646N6217r2933N4042n5691r8205J06797j30932j20322J32196j809j11860
$$ 300646 356863 263930 317972 262281 164076 270873 139941 19619 151815 150006 38146
16089C8146m7909K3229J70856N6122j8354j61295j24553l2015j61021q5766J83972
$$ 38146 -9763 13466 184322 240444 222090 60795 -63758 -95773 -256794 -342560 -158588
16078a58588L86369L7735j92788j70386j01675k2658l3471K38809J34806K29370
$$ -158588 227781 265516 72728 -97658 -199333 -221991 -255462 -16653 118153 347523
16068C47523k27828j57489r0124J08299n80j36551j95787n3711J54392N3315j7452
$$ 347523 119695 -37794 -127918 -19619 -20199 -156750 -352537 -406248 -251856 -198541 -215993
16057b15993q6291j60404j0645J58946J17891j40183L15424K17189j2741J9268
$$ -215993 -302284 -462688 -473333 -314387 -196496 -336679 -21255 195934 183193 202461
16047B02461j42992k56715J71324J34948k1192j68747l6947J1426j62163K2487
$$ 202461 59469 -197246 -25922 109026 87834 -80913 -117860 -106434 -268597 -246110
16037b46110O0718j4177m867n0624J8824Q0416P7162J32966p5565k18210p8610
$$ -246110 -185392 -199569 -204436 -255060 -236236 -155820 -78658 54308 -21257 -239467 -318077
16026c18077n3320R2968K12887J12214j21141P114O3884l0414N7722l0853j20596
$$ -318077 -371397 -278429 -65542 46672 -74469 -67355 -3471 -33885 23837 -7016 -127612
16015a27612m1940Q9984L9441j885k06131j73395M9259K31847K05207J89849j06606
$$ -127612 -169552 -79568 -40127 -42012 -248143 -421538 -372279 -140432 64775 254624 148018
16004A48018k63143q7837K53420P3863k12177J39533J15854k56963j34021R5248
$$ 148018 -115125 -202962 50458 124321 -87856 51677 167531 -89432 -223453 -128205
15994a28205J53463l857l5345k29659L9035L23551J27865j88352q1543M4949r8665
$$ -128205 25258 21401 -13944 -243603 -204568 118983 246848 58496 -23047 21902 -76763
15983g6763o7980p6935P4287O7777Q6388J833K4328j61850J02660J92945p6132
$$ -76763 -144743 -221678 -147391 -79614 6774 8607 32935 -128915 -26255 166690 90558
15972I0558n1521J76754J59335j72643j01697j6555P6379m1339k98182j15501
$$ 90558 39037 215791 375126 202483 100786 84231 160610 119271 -178911 -294412
15962b94412o407J61171J11771J8519J50422m5408l0515N5173j86651j26538J4011
$$ -294412 -300819 -139648 -27877 -9358 141064 95656 65141 120314 -66337 -192875 -178864
15951a78864Q168k2391N7242J54942L990O2392k9533k9401j92092k05711q5721
$$ -178864 -170696 -193087 -135845 19097 23087 85479 55946 26545 -165547 -371258 -456979
15940d56979J22609m335k141R1753J24092J05379J20605j3552r2940k43621q9972
$$ -456979 -334370 -338705 -340846 -249093 -125001 -19622 100983 87431 -5509 -249130 -339102
15929c39102M3557L3953Q1701J59427K0082q2993Q431P7688N4499k9901l2657
$$ -339102 -295545 -261592 -179891 -20464 -382 -83375 -74944 2744 57243 27342 -5315
15918e315J62314q9083l41837J00595J05064k1182M3860q0695l4345J87293J35861
$$ -5315 156999 67916 -273921 -173326 -68262 -89444 -45584 -126279 -160624 26669 162530
15907A62530r9799q2516j15414m9505r6837Q5046L18710L6116j40574Q9559K0221
$$ 162530 62731 -19785 -135199 -184704 -281541 -196495 122215 158331 17757 107316 127537
15896A27537J3714J15551k84608j1791R607k58935J2547J48889Q2139l068q4937
$$ 127537 141251 256802 -27806 -39597 -29990 -288925 -276378 -127489 -45350 -48418 -133355
15885a33355o3442K12703R6648j08431M6204J96301j14013j42860N5762p6728
$$ -133355 -196797 15906 112554 4123 50327 246628 132615 -10245 45517 -31211
15875c1211m4508n1486p3783j25115J06362K12631O4050j32937p5371l5955K15769
$$ -31211 -75719 -127205 -200988 -326103 -219741 -7110 56940 -75997 -151368 -187323 28446
15864B8446M3026j53913j65896j44859N0867J21539Q2551P7256m805J50121J65275
$$ 28446 71472 -82441 -248337 -393196 -342329 -220790 -138239 -60983 -65788 84333 249608
15853B49608J11245j16273k53883q4274K47869J1328j63088j22255P8018n8785
$$ 249608 360853 244580 -9303 -93577 154292 165620 2532 -119723 -41705 -100490
15843a00490m0470J12632j13162p2666K35566P7840j16843J23695k3324j95120
$$ -100490 -140960 -28328 -141490 -214156 21410 99250 -17593 106102 82778 -112342
15833a12342l01858J29467R9335J45467M3201k8974j9668k3366O5751P2609j32728
$$ -112342 -414200 -284733 -185398 -39931 3270 -25704 -45372 -68738 -2987 69622 -63106
15822f3106r777O93K98900J36868k29481j30425L46736R4528k66374j17890n4466
$$ -63106 -72883 -72190 226710 363578 134097 3672 350408 444936 178562 60672 6206
15811F206n1454L9775J0949k4140k32204P5044J2493l4009q5086J23912K08343
$$ 6206 -45248 -5473 5476 -18664 -250868 -175824 -163331 -197340 -282426 -158514 49829
15800D9829j1191q7757L9024j01356J61886J08511J2832M1481M5467r8335l6820
$$ 49829 38638 -49119 -10095 -111451 50435 158946 171778 213259 258726 160391 123571
15789A23571k30412J66831J43726n3265j03189j84625p2058K3865N7879N286m7537
$$ 123571 -106841 59990 203716 150451 47262 -137363 -209421 -185556 -127677 -122391 -169928
15778a69928j4103K27432J0581k53057n4953P4521M7485K20934j2472q4959R607
$$ -169928 -184031 43401 53982 -199075 -254028 -179507 -132022 88912 76440 -8519 1088
15767A088o961M3811N0713j20191j00178Q6629K9865J9389N6891M5944j23034
$$ 1088 -5873 37938 88651 -31540 -131718 -45089 -15224 4165 61056 107000 -16034
15756a6034o2692Q3349j32525p3749l8287J08027J61846n6866j12556K59229l0448
$$ -16034 -78726 4623 -127902 -201651 -239938 -131911 29935 -26931 -139487 119742 89294
15745H9294o0351K26003J59299M3697n3908n106L2951j38705j51125N3899O3791
$$ 89294 28943 254946 414245 457942 404034 398928 431879 293174 142049 195948 259739
15734B59739k5019j23592j31161M5636m3245j56471o7731J42758P9223p1976L6786
$$ 259739 234720 111128 -20033 25603 -17642 -174113 -241844 -99086 -19863 -91839 -55053
15723e5053R3515n7462J95232K41405n2517o0747L9667j54668j08544J82197j18982
$$ -55053 38462 -19000 176232 417637 365120 304373 344040 189372 80828 263025 144043
15712A44043R7463K15305r7931j39360k05518J5654l1674m6186j59829l7979N5479
$$ 144043 241506 456811 358880 219520 14002 29656 -2018 -48204 -208033 -246012 -190533
15701a90533k1517l8813J09034K39324J34048j15961o9222j20155P3681J52832
$$ -190533 -212050 -250863 -141829 97495 231543 115582 46360 -73795 -114 152718
15691A52718k0479l4607M198n6823j9556l2431J10514K58859o8225r3754R2140
$$ 152718 132239 97632 101830 45007 25451 -6980 103534 362393 294168 200414 292554
15680B92554L020J29478j40358k29035J12314J02832m9896j19585o4440k43523
$$ 292554 295574 425052 284694 55659 167973 270805 220909 101324 36884 -206639
15670b06639J8195j18223J8070M4050J9612K26542R2500j9908K5620r4488N7941
$$ -206639 -188444 -306667 -288597 -244547 -224935 1607 94107 74199 99819 5331 63272
15659F3272J11661J67363j48678k11684K9111p7441R7703j8326p8784Q1538J1955
$$ 63272 174933 342296 193618 -18066 11045 -66396 31307 12981 -65803 15735 27690
15648B7690j33610j79321J75223L9326l6371n4358J71017K57302O4705k10405
$$ 27690 -105920 -285241 -110018 -70692 -107063 -161421 9596 266898 331603 121198
15638A21198n4650k7901q897j44401q6946n3278l4448K37128K9947r6272n2340
$$ 121198 66548 38647 29750 -114651 -201597 -254875 -289323 -52195 -22248 -118520 -170860
15627a70860n7357l5863J32224J7096J230r8602j0976q472J0473K29336j86535
$$ -170860 -228217 -264080 -131856 -114760 -113530 -212132 -223108 -231580 -221107 8229 -178306
15616a78306J80540j9438j63189j33283p9598m6039R7628L5375J27709J40128
$$ -178306 2234 -17204 -180393 -313676 -393274 -439313 -341685 -306310 -178601 -38473
15606c8473o9537l7891M2689K8144k4205J45335O7567m189J21417q3800n3354
$$ -38473 -108010 -145901 -103212 -75068 -99273 46062 113629 109440 230857 147057 93703
15595I3703k3379k23925P071J93267k7752n7790k1420k8598Q5008K10990P4077
$$ 93703 70324 -153601 -146530 46737 18985 -38805 -60225 -88823 -3815 207175 281252
15584B81252O8473j03119n630j8575P6813l4058m3347P6577J63329R8067J4443
$$ 281252 349725 246606 240976 222401 299214 265156 221809 298386 461715 559782 574225
15573E74225j62130k13992J895J54223J18731n2308J410k89238j78168J95017
$$ 574225 412095 198103 199998 354221 472952 420644 422054 132816 -45352 149665
15563A49665m9913n4332M6190O9398J35317m1485K4918r9299p9773L7378j48700
$$ 149665 99752 45420 91610 161008 296325 254840 279758 180459 100686 138064 -10636
15552a0636m9276O2579Q4725j32011k3900J9436j05030J44533J26865N6474n4578
$$ -10636 -59912 2667 87392 -44619 -68519 -49083 -154113 -9580 117285 173759 119181
15541A19181n0785j08010j28660J86292J41572l5382k3887n6589N0664k6427j66089
$$ 119181 68396 -39614 -168274 18018 159590 124208 100321 43732 94396 67969 -98120
15530i8120m2637J8151j80678N05J11678j308J87942J42156J34508J09561j09723
$$ -98120 -140757 -122606 -303284 -302779 -191101 -192409 -4467 137689 272197 381758 272035
15519B72035j05294j76343k39665j28468m5441L24K55199L33742o9028o2160M9832
$$ 272035 166741 -9602 -249267 -377735 -423176 -422852 -167653 166089 97061 34901 84733
15508H4733n3078j05340m2381J04559K5941j09739J52724M9031O1668J01219k8014
$$ 84733 31655 -73685 -116066 -11507 14434 -95305 57419 106450 168118 269337 241323
15497B41323o1201n4117j791m1412N8410j00035k2069m0649n7154j27185K00904
$$ 241323 180122 126005 124214 82802 141212 41177 19108 -21541 -78695 -205880 -4976
15486d976O4817n2373k21914k17101J15216K920j13182Q2650J72103K5477P0764
$$ -4976 59841 7468 -214446 -431547 -316331 -313411 -426593 -343943 -171840 -146363 -75599
15475g5599N046J41230J66559p0122j34908j98110Q3076n2494j45476J01065J82454
$$ -75599 -70553 70677 237236 167114 32206 -165904 -82828 -135322 -280798 -179733 2721
15464B721M55j25923r1224K5412J14417K49404l1104P5048j28200M6374O0206
$$ 2721 3176 -122747 -213971 -188559 -74142 175262 144158 219206 91006 137380 197586
15453A97586k48017m4003j365j34521P1149J33234J37474J82940q6120k41983
$$ 197586 -50431 -94434 -95799 -230320 -159171 -25937 111537 294477 208357 -33626
15443c3626K550J82546J74543j08632J69007p2380j72846P3927J75226L2065m5729
$$ -33626 -31076 151470 326013 217381 386388 314008 141162 215089 390315 422380 376651
15432C76651k7451M1816j43079k33527p2684J02398N8787l5597j22467L9630M4419
$$ 376651 349200 391016 247937 14410 -58274 44124 102911 67314 -55153 -15523 28896
15421B8896j49844j3472O6534K30062J18523o8054K0581Q8794O4359j32082j25391
$$ 28896 -120948 -134420 -67886 162176 280699 212645 233226 322020 386379 254297 128906
15410A28906J9791M7812P9087q5518j76878j57570J0265J36856J64033J2253j93977
$$ 128906 148697 196509 275596 190078 13200 -144370 -134105 2751 166784 179037 -14940
15399a4940P5102J33617R4952K12844R0868k78300k948O1271j69337j62840k5304
$$ -14940 60162 193779 288731 501575 592443 314143 311195 372466 203129 40289 14985
15388A4985J04453J46207N3617k02406k556J05818j09517n0407O4094p725j12806
$$ 14985 119438 265645 319262 116856 114300 220118 110601 60194 124288 116563 3757
15377C757J24625J46793J68457k2146o1173n5772j09438j85355r6243l0387J36817
$$ 3757 128382 275175 443632 421486 360313 304541 195103 9748 -86495 -116882 19935
15366A9935O4457j83427k5921J31253j34929j42831j66067K5300J54135P1591
$$ 19935 84392 -99035 -124956 6297 -128632 -271463 -437530 -412230 -258095 -186504
15356a86504m5895l2693j4289J46396K83775J65324p2987j73202j02705j45961
$$ -186504 -232399 -265092 -279381 -132985 150790 316114 243127 69925 -32780 -178741
15346a78741k295J19616O1886K8900M28J8829L20357K2004l9502j19401j47188
$$ -178741 -181036 -61420 466 29366 29794 48623 368980 390984 351482 232081 84893
15335H4893p3596P7296Q5759R6798j1332j18173j78831K38822J12666r4483l2773
$$ 84893 11297 88593 174352 271150 259818 141645 -37186 201636 314302 219819 187046
15324A87046K59541k163j42280k52062p3505k47892j21679Q0205J02315L20104
$$ 187046 446587 444424 302144 50082 -23423 -271315 -392994 -312789 -210474 109630
15314A09630R6132K7983J51390k9260k4803j4354j70421l7327Q8841l7055p0784
$$ 109630 205762 233745 385135 355875 331072 316718 146297 108970 197811 160756 89972
15303H9972L5183L3215p7715q2303n7958N0247M9240n1391j06442j25585N8515
$$ 89972 125155 158370 80655 -1648 -59606 -9359 39881 -11510 -117952 -243537 -185022
15292a85022K03125J39377j97073P7589K05420k14746j55272m569j46940J33762
$$ -185022 18103 157480 -39593 37996 243416 28670 -126602 -131171 -278111 -144349
15282a44349J4136j28954Q4961J47018L9542L1497Q7414J46407k1941O8469j00782
$$ -144349 -130213 -259167 -174206 -27188 12354 43851 131265 277672 255731 324200 223418
15271B23418M1830p8938r3727j26011P7785q3614k67735K01391J27433J06898
$$ 223418 265248 186310 92583 -33428 44357 -39257 -306992 -105601 21832 128730
15261A28730J49486J38637R5395k26326j83291R884J96773j74482M4348K12026
$$ 128730 278216 416853 512248 285922 102631 112515 309288 134806 179154 391180
15251C91180R7583r3625o2917N1583k86720j76387K26467J60264k568r038K9127
$$ 391180 488763 395138 332221 383804 97084 -79303 147164 307428 304860 295822 324949
15240C24949M6879j97671k93177Q0826J60374j06757m2176J16419l4868N072R4241
$$ 324949 371828 174157 -119020 -38194 122180 15423 -26753 89666 54798 59870 154111
15229A54111p3550j06538Q9873P4152L5513R468p7258j60271k7884Q6718N053
$$ 154111 80561 -25977 63896 138048 173561 183029 105771 -54500 -82384 4334 9387
15218I387j10044l9275P607m2742q2892J08296l0697p9563q1937J78957J9553
$$ 9387 -100657 -139932 -132325 -175067 -257959 -149663 -180360 -259923 -341860 -162903 -143350
15207a43350o7567J85458J06322j38951l7852Q1651j71420J25939J38924k0775
$$ -143350 -210917 -25459 80863 -58088 -95940 -14289 -185709 -59770 79154 58379
15197E8379j0261R5655M0768J8775j46181j24157k1110M8385L1764r6093P117
$$ 58379 48118 143773 184541 203316 57135 -67022 -88132 -39747 -7983 -104076 -96959
15186i6959R9418J3577J59735R657j4517r3237R1176J1199q8705j68525k27425
$$ -96959 2459 16036 175771 185428 170911 77674 168850 180049 91344 -77181 -304606
15175c04606J22168K82049J13919j26800j81913n0316J46677J26471j04222N551
$$ -304606 -182438 99611 213530 86730 -95183 -145499 1178 127649 23427 28978
15165B8978j28577j49068K7226J56523o6738p370K8625J65965o9640Q118L4286
$$ 28978 -99599 -248667 -221441 -64918 -131656 -139026 -110401 55564 -14076 -5958 28328
15154B8328J17045J18997j18088K0585O8360L6807j54579k63971P1J84464J34939
$$ 28328 145373 264370 146282 166867 235227 272034 117455 -146516 -146445 38019 172958
15143A72958J10690O158j98531k8964q1932J08767O3598j12790K7731j50046p9487
$$ 172958 283648 289806 91275 62311 -19621 89146 152744 39954 67685 -82361 -161848
15132a61848j84300k9388R5721J04464J5409J80701j69574k20735o0423K88233
$$ -161848 -346148 -375536 -279815 -175351 -159942 20759 -148815 -369550 -429973 -141740
15122a41740K41090L9103k8157L7335m5978k3547l7951q2886R2338J39732J1378
$$ -141740 99350 138453 110296 147631 101653 78106 40155 -42731 49607 189339 200717
15111B00717M0820r4767j50255m8670J1155l9891k0856J42506J40575J24705l4518
$$ 200717 241537 146770 -3485 -52155 -41000 -80891 -101747 40759 181334 306039 271521
15100B71521k59530P860j5199k72606p9766J96474K85845k9780P5106J62031k15973
$$ 271521 11991 19851 4652 -267954 -347720 -151246 134599 104819 179925 341956 125983
15089A25983j05985N3645J9242j35207m0486q2783p4138N4213k8557q0088L0818
$$ 125983 19998 73643 92885 -42322 -82808 -165591 -239729 -185516 -214073 -294161 -263343
15078b63343l0069K10117J47436J85876J24767o383m5011j15533j40999q1840
$$ -263343 -293412 -83295 64141 250017 374784 368401 323390 207857 66858 -14982
15068a4982q6627j79049Q455L1792O2337L26248J97199k01203k13125J76318J49281
$$ -14982 -101609 -280658 -272203 -240411 -178074 148174 345373 144170 -68955 107363 256644
15057B56644m4877k5569N1487J27171m1477j61110j12751m783p8113k0419k361
$$ 256644 211767 186198 237685 364856 323379 162269 49518 44735 -33378 -53797 -56158
15046e6158j40120K6025J03032p9004j04495l1113O2406J58394L2571J2795n362
$$ -56158 -196278 -170253 -67221 -146225 -250720 -281833 -219427 -61033 -28462 -15667 -21029
15035b1029O0439o474K9786J27893J9851l9332j03022m0752O796j14343j21863
$$ -21029 39410 32936 62722 190615 210466 171134 68112 27360 34156 -80187 -202050
15024b02050R6813K97369J25870m06385k7184k7682j5331N1456P579k921L1392
$$ -202050 -105237 192132 318002 -88383 -115567 -143249 -158580 -107124 -99545 -102466 -71074
15013g1074Q4232K3177K06243R6304q5759j79990j37677K53052L1227p6742n5870
$$ -71074 13158 36335 242578 338882 253123 73133 -64544 188508 219735 142993 87123
15002H7123n539k65073O9822k8029j7518m3779k010J55491Q4350j33611n886J68554
$$ 87123 81584 -183489 -113667 -141696 -159214 -202993 -205003 -49512 34838 -98773 -104659 63895
14990F3895J36304j26635j28357j63872l7399J91904j8832K2849K172N2688o4394
$$ 63895 200199 73564 -54793 -218665 -256064 -64160 -82992 -60143 -57971 -5283 -69677
14979f9677R7017l9676k21682P1537J10447J24835J08183j4887P593N2152j34845
$$ -69677 27340 -12336 -234018 -162481 -52034 72801 180984 166097 173690 225842 90997
14968I0997K13907Q3712m31661j74551m068j25682o9131J15813p0954J25909K9508
$$ 90997 304904 388616 -43045 -217596 -221664 -347346 -416477 -300664 -371618 -245709 -216201
14957b16201N7821J37793R1449j2681j11274M0956Q6618j4919J56215K49785j31042
$$ -216201 -158380 -20587 70862 58181 -53093 -12137 74481 59562 215777 465562 334520
14946C34520k10061P0213l7381M6720r874j73536L2214J52154k2982K04278L24296
$$ 334520 124459 194672 157291 204011 194137 20601 52815 204969 181987 386265 710561
14935G10561K29571K4988l801m9706m9842j48352k87149J65327j32569o9720Q6347
$$ 710561 940132 965120 961319 911613 861771 713419 426270 591597 459028 389308 475655
14924D75655q6927o141P9281m8613j86784M3063J06201j86756j91054J37274J94356
$$ 475655 388728 382587 461868 413255 226471 269534 375735 188979 -2075 135199 329555
14913C29555O6266k33621j40915j2597J16593p1489L9463l8468l9703k49594J94640
$$ 329555 395821 162200 21285 8688 125281 53792 93255 54787 15084 -234510 -39870
14902c9870L17174j69689j34691K28813O2317q0662j46682j46536L1428R4386
$$ -39870 277304 107615 -27076 201737 264054 183392 36710 -109826 -78398 15988
14892A5988M0067K66096M1184j48269k49082o3688J27031J33193K72560J43608
$$ 15988 56055 322151 363335 215066 -34016 -97704 29327 162520 435080 578688
14882E78688j60572j07360j61698Q6673p3791j00089q3994p3669K10882N4313
$$ 578688 418116 310756 149058 235731 161940 61851 -22143 -95812 115070 169383
14872A69383o7672j31609N3103L34480J10363J6497j01612L2651k01242n9898
$$ 169383 101711 -29898 23205 357685 468048 484545 382933 415584 214342 154444
14862A54444J27504p3816k9815k89649K3313J47724J00912J00022Q9008j4640
$$ 154444 281948 208132 178317 -111332 -88019 59705 160617 260639 349647 335007
14852C35007j80755q2592J08006J1311j29078M0078J67205q9798j17559J21415
$$ 335007 154252 71660 179666 190977 61899 101977 269182 179384 61825 183240
14842A83240j25196j5359K17789J64080l997J38234J40923J26637R6466r9925
$$ 183240 58044 42685 260474 424554 420557 558791 699714 826351 922817 822892
14832H22892k78303j41403J15858J901p0779J1511j04937j28178j06811j01866
$$ 822892 544589 403186 519044 520945 450166 461677 356740 228562 121751 19885
14822A9885j8225L16693Q982q8145Q7505j13410p8580j78226m5400J75582K3481
$$ 19885 1660 318353 327335 239190 326695 213285 134705 -43521 -88921 86661 110142
14811A10142q3348l02503L7264K10485M3539J25805N0594j10554j08079J7389
$$ 110142 26794 -275709 -238445 -27960 15579 141384 191978 81424 -26655 -9266
14801i266L0813l7289j99329m2148M8830J78746l3843r4724J67383K14890L2349
$$ -9266 21547 -15742 -215071 -257219 -208389 -29643 -63486 -158210 9173 224063 256412
14790B56412P0476l8587j46744j86641K7638j32193J00574P2792m3811P7853j4212
$$ 256412 326888 288301 141557 -45084 -17446 -149639 -49065 23727 -20084 57769 43557
14779D3557J10536J28255O6699Q9901j0230Q1326j31770j46282j06609j24660
$$ 43557 154093 282348 349047 438948 428718 510044 378274 231992 125383 723
14769G23K16215O264j39277r8506j31006J17588N1787J1071k488k03631J45644
$$ 723 216938 223202 83925 -14581 -145587 -27999 23788 34859 32371 -171260 -25616
14758b5616N7515k15595L4791M2089j8457M1342J33266k9762M6605J0730R691
$$ -25616 31899 -183696 -148905 -106816 -125273 -83931 49335 19573 66178 76908 86599
14747H6599J58126o23j59357p6978O3244L9704j33203r8474k8574l443J79472
$$ 86599 244725 244102 84745 7767 71011 110715 -22488 -120962 -149536 -152979 26493
14736B6493j1712j46932k51154M8287J09757K12192K56605m522k31850j3470L1612
$$ 26493 14781 -132151 -383305 -335018 -225261 -13069 243536 239014 7164 -6306 25306
14725B5306L3204J68539k9509j16807p6322J7003j6576j57846L9572J0405R6345
$$ 25306 58510 227049 197540 80733 4411 21414 4838 -153008 -113436 -103031 -6686
14714f686J13062J07716n4924r4164P9343j62567o3276J62394L8620K42516j04111
$$ -6686 106376 214092 159168 65004 144347 -18220 -81496 80898 119518 362034 257923
14703B57923j87050J40955J55568q4353o327l384K3470j32538r5004k587O3623
$$ 257923 70873 211828 367396 283043 276716 273332 296802 164264 69260 66673 130296
14692A30296Q9710j05552J38046K34694j95701k41973L5857j2447l9454o1182
$$ 130296 220006 114454 252500 487194 291493 49520 85377 72930 33476 -27706
14682b7706P7147j33069J10224J83141J1273k32293j02270R5829p2558J29274
$$ -27706 49441 -83628 26596 209737 221010 -11283 -113553 -17724 -90282 38992
14672C8992j16741J54016J18539Q9849k44201N8283P1489p2229J32550k13869
$$ 38992 -77749 76267 194806 284655 40454 98737 170226 97997 230547 16678
14662A6678r7597M7565K05751K6522j81302q5962k8958K17891K26388J81968n8652
$$ 16678 -80919 -33354 172397 198919 17617 -68345 -97303 120588 346976 528944 470292
14651D70292q1580J3972M8611k00281m08857L7141K30196l7330n6407j16397J70092
$$ 470292 388712 402684 451295 251014 -157843 -120702 109494 72164 15757 -100640 69452
14640F9452P1462n9632J01669j36379P132J34020J22628J30210j4973k12858l2240
$$ 69452 140914 81282 182951 46572 53704 187724 310352 440562 425589 212731 180491
14629A80491p0492l0498J82789O0905k7534j23000R182j50936j02827Q6078J89927
$$ 180491 109999 79501 262290 323195 295661 172661 181843 30907 -71920 14158 204085
14618B04085k0214r1433K5486j5226J6079J52448K26587k60909j07501J15158
$$ 204085 183871 92438 117924 102698 118777 271225 497812 236903 129402 244560
14608B44560l7351j36151m511j49961q3655m8956N0838K41222Q0623p1963k18187
$$ 244560 207209 71058 66547 -83414 -167069 -216025 -165187 76035 156658 84695 -133492
14597a33492N2248l9256J41761K52478K14652k38814k18225m8970K1347J21061
$$ -133492 -81244 -120500 21261 273739 488391 249577 31352 -17618 3729 124790
14587A24790r6062q2610J00009j33755O662N0783L0607P5078J525K8398P1175
$$ 124790 28728 -53882 46127 -87628 -80966 -30183 424 75502 77027 105425 176600
14576A76600P640l0904L964Q7691L7808p8227R4226n0545p9722J35052l3654j35577
$$ 176600 184240 153336 157300 244991 282799 204572 298798 248253 168531 303583 269929 134352
14564A34352j7544k4389k9325J070J85205O6459o3011j0193P9785Q6675N1305
$$ 134352 116808 92419 63094 64164 249369 315828 252817 242624 322409 409084 460389
14553D60389n430q9545m8992k6488R3365K7357j22728k18538p2500J46660J54670
$$ 460389 454959 365414 316422 289934 383299 410656 287928 69390 -3110 143550 298220
14542B98220m9192j03257n0755K6708P5121n3201k32166k3349j41275j12651K52644
$$ 298220 249028 145771 95016 121724 196845 143644 -88522 -111871 -253146 -365797 -113153
14531a13153L67717J96990l01568k81369j20776L0338J20589K3697j78532P6249
$$ -113153 254564 451554 149986 -131383 -252159 -221821 -101232 -77535 -256067 -179818
14521a79818M7041l1693R6583j13748o9720Q9465N9000r2063J9808J96836M479
$$ -179818 -132777 -164470 -67887 -181635 -251355 -161890 -102890 -194953 -175145 21691 26170
14510B6170Q9556j77879J017L6711k07751k9872J48480K26965n8784j35568J46437
$$ 26170 115726 -62153 -61136 -24425 -232176 -262048 -113568 113397 54613 -80955 65482
14499F5482o4942L9068J74058j84039O703p7792q637J99935J66349j06743m2478
$$ 65482 540 39608 213666 29627 36330 -41462 -50099 149836 316185 209442 166964
14488A66964J24874o0562m1125n2069J08720j01414j40401k23385J05289K1567
$$ 166964 291838 231276 190151 138082 246802 145388 4987 -218398 -113109 -91542
14478i1542o5810j57286j45591J3609J83876J18383j15879M3196Q2718M0121m3607
$$ -91542 -157352 -314638 -460229 -446620 -262744 -144361 -260240 -217044 -134326 -94205 -137812
14467a37812k38019l2407J52937M6086N50J7407j94021J52185R7124N5902j50420
$$ -137812 -375831 -408238 -255301 -209215 -208665 -191258 -385279 -233094 -135970 -80068 -230488
14456b30488m2436L59683J74758p9309l3951L9845j82020J30q0847Q786K1171
$$ -230488 -272924 86759 261517 182208 148257 188102 6082 6212 -74635 -65849 -44678
14445d4678N6519j0109m365J46888J18531k04904p2200J46528K3019L931J34649
$$ -44678 11841 1732 -2633 144255 262786 57882 -14318 132210 155229 159160 293809
14434B93809P2964p6125j21247j7890n8962l727j58539J00218J23006M219J11996
$$ 293809 366773 290648 169401 151511 92549 88822 -69717 30501 153507 157726 269722
14423B69722k9940k26858m6457K15555P4213j94347r7030L20493K29242n6570
$$ 269722 239782 12924 -33533 182022 256235 61888 -35142 285351 514593 458023
14413D58023j05051j01290j77846m2540J18470l49577O013N2030l6819m4599O8595
$$ 458023 352972 251682 73836 31296 149766 -199811 -193798 -141768 -178587 -223186 -154591
14402a54591j8310M7773N2113J41037j32345K07028N8569j5447k72971j24257
$$ -154591 -172901 -125128 -73015 68022 -64323 142705 201274 185827 -87144 -211401
14392b11401Q7299J05478J72108n7172M6267l9508k7871m2219o369J28408j7874
$$ -211401 -124102 -18624 153484 96312 142579 103071 75200 32981 26612 155020 137146
14381A37146k0595L2460R3038J37424k26905j27572J76053p0095k24568P7405
$$ 137146 116551 149011 242049 379473 152568 24996 201049 130954 -93614 -16209
14371a6209O1204m9332j16272m2927J17125J00894K37464K02787j2837j87869
$$ -16209 44995 -4337 -120609 -163536 -46411 54483 291947 494734 481897 294028
14361B94028r1696p2749j55067l7741L17572m4625j12695k2686r351l1200J9118
$$ 294028 202332 129583 -25484 -63225 254347 209722 97027 74341 64990 33790 52908
14350E2908m2822j61283K38566K36932j30844k1349M4999j05730j47966J49565
$$ 52908 10086 -151197 87369 324301 193457 172108 217107 111377 -36589 112976
14340A12976J14523j18563p4542N3742j56618O9589j99780j62402J86082J74739
$$ 112976 227499 108936 34394 88136 -68482 1107 -198673 -361075 -174993 -254
14330b54M613r6841Q5346J18818k4571j66083l06644k727L27598J53559K9070
$$ -254 4359 -92482 -7136 111682 87111 -78972 -385616 -388343 -60745 92814 121884
14319A21884M4067k5082q0391j5740K9481O768j32148O5757M7006J72345K45413
$$ 121884 165951 140869 60478 44738 74219 80987 -51161 14596 61602 233947 479360
14308D79360r8581k36010l9274j07447N1924L0367K25007J48863j22032j19516
$$ 479360 380779 144769 105495 -1952 49972 80339 305346 454209 332177 212661
14298B12661R8646M0899K8778j16576n270r0370J64223O6096l0862J58595k9111
$$ 212661 311307 352206 380984 264408 259138 168768 332991 399087 368225 526820 497709
14287D97709j05657k1448j85125j10734o5731k8758j95994p5456J44607J27459
$$ 497709 392052 370604 185479 74745 9014 -19744 -215738 -291194 -146587 -19128
14277a9128p8655j28515j39489J02177M28438J10172l1908k2354R4863P1016j52210
$$ -19128 -97783 -226298 -365787 -263610 164828 275000 243092 220738 315601 386617 234407
14266B34407k12330L03488J73390k58152m3358O9979j85201R2654P5649j28501
$$ 234407 22077 325565 498955 240803 197445 267424 82223 174877 250526 122025
14256A22025J23790p4684M1794K2331j07703P5836p4944k90704O9525J48039k1159
$$ 122025 245815 171131 212925 235256 127553 203389 128445 -162259 -92734 55305 34146
14245C4146J8176m3359K51573q6980k93637L7966J49438P6951K10310j26171k04540
$$ 34146 52322 8963 260536 173556 -120081 -82115 67323 144274 354584 228413 23873
14234B3873j00828J81620K29419j0784j24847j35918N9120j8426r2758R2911L17741
$$ 23873 -76955 104665 334084 323300 198453 62535 121655 103229 10471 103382 421123
14223D21123J80251l49500l94182l5912R3647j8174P3819p2967L8769N025J01633
$$ 421123 601374 251874 -142308 -178220 -84573 -102747 -28928 -101895 -63126 -58101 43532
14212D3532J83502J9310q4367k4978n0224j21257K791o3490L5449J64917K24457
$$ 43532 227034 246344 161977 136999 86775 -34482 -31691 -95181 -59732 105185 329642
14201C29642j58628k22118k08451P9781J59997K5292J05173J18528M2432N0518
$$ 329642 171014 -51104 -259555 -179774 -19777 5515 110688 229216 271648 322166
14191C22166L410k45072L3401J05353j09531J49079J15090q5778p5680J8869K1405
$$ 322166 325576 80504 113905 219258 109727 258806 373896 288118 212438 231307 252712
14180B52712r8757M3803Q1289J62110r7544j56443L03428j44163k72108P7659
$$ 252712 153955 197758 279047 441157 343613 187170 490598 346435 74327 151986
14170A51986m1470j66525J97149J8053q3594l11618j45471J46534O3472K58770
$$ 151986 110516 -56009 141140 159193 75599 -236019 -381490 -234956 -171484 87286
14160H7286M3218j77365l9626N7585K4969J56779K0109k01538j24386J530o8894
$$ 87286 130504 -46861 -86487 -28902 -3933 152846 172955 -28583 -152969 -151439 -220333
14149b20333l10472J90852J00465n5121J68014Q3882J17586j35272m8341J12559
$$ -220333 -530805 -339953 -239488 -294609 -126595 -42713 74873 -60399 -108740 3819
14139C819J60416j26180r7284J34840Q1828J09335K891k13687j0258O3735o899
$$ 3819 164235 38055 -59229 75611 157439 266774 269665 55978 45720 109455 102556
14128A02556L06400m1242o6142j31366j83733J28287K9113J32014p7030k09777
$$ 102556 408956 367714 301572 170206 -13527 114760 143873 275887 198857 -10920
14118a0920J63910J32553j26636j77003k9922L1651K22205L8039r9654m6279k1097
$$ -10920 152990 285543 158907 -18096 -48018 -16367 205838 243877 144223 97944 76847
14107G6847O7187p2194q7144j7776j04236j06172j16941Q4758L29300J54254k3460
$$ 76847 144034 71840 -15304 -33080 -137316 -243488 -360429 -275671 53629 207883 184423
14096A84423j30811n3418p5996J9972N6594K04413j37277p2160q038j15749j37009
$$ 184423 53612 194 -75802 -55830 764 205177 67900 -4260 -12298 -128047 -265056
14085b65056n3715N1362O3932L20778J1179j0542J00808Q5172j09379R154P5688
$$ -265056 -318771 -267409 -203477 117301 128480 117938 218746 303918 194539 203693 279381
14074B79381k3664M4888j6281j51452j7179l9892K6762K08554N4001l8668l2569
$$ 279381 255717 300605 284324 132872 115693 75801 102563 311117 365118 326450 293881
14063B93881j06094r3710Q6783l9061Q1008j80923n1004K19459j13282m0146k653
$$ 293881 187787 94077 180860 141799 222807 41884 -9120 210339 97057 56911 54258
14052E4258m1920n4688O4472J27254j26755k28907M8869J78836o0217R6634J63677
$$ 54258 12338 -42350 22122 149376 22621 -206286 -157417 21419 -38798 57836 221513
14041B21513q94k14350j03575N6214N8768L5467J5190j8930m7344J04485L7331
$$ 221513 220619 6269 -97306 -41092 17676 53143 68333 49403 2059 106544 143875
14030A43875J51791N8696K2901l4012k389k27828N575o167j27512l4349O2784
$$ 143875 295666 354362 377263 343251 340862 113034 118609 112442 -15070 -49419 13365
14019A3365k2620k0106K56810q1422j33768M7659J72233j2552k8388m1319J59723
$$ 13365 -9255 -29361 227449 146027 12259 59918 232151 219599 191211 149892 309615
14008C09615K79348p0091k70509p5997N3890J18389O9959j39018q7606m5837k56609
$$ 309615 588963 518872 248363 172366 226256 344645 414604 275586 187980 142143 -114466
13997a14466P8066Q1878l0254q5841p1203J84423L2966M5322K075p0079j1929
$$ -114466 -36400 45478 15224 -70617 -141820 42603 75569 120891 122966 52887 40958
13986D0958n6920K10330R0365j34148j06597k5851l9447m2183k401J29695j01564
$$ 40958 -15962 194368 284733 150585 43988 18137 -21310 -63493 -65894 63801 -37763
13975c7763o8971O2318J16082J34416p0995j63875k54070k56284J95922K33162
$$ -37763 -106734 -44416 71666 206082 135087 -28788 -282858 -539142 -343220 -110058
13965a10058J8327o4000K257P0118K12623o5038m9595J66319l47917k31016n4064
$$ -110058 -91731 -155731 -153474 -83356 129267 64229 14634 180953 -166964 -397980 -452044
13954d52044Q8441P0336J83987J13698O8478R6781Q4420j30479k56684j8005j3175
$$ -452044 -363603 -293267 -109280 4418 72896 169677 254097 123618 -133066 -151071 -164246
13943a64246j20332m3131O5024K8741K08536O2574r43p146K9578L1963M3498j15517
$$ -164246 -284578 -327709 -262685 -233944 -25408 37166 36223 29077 58655 90618 134116 18599
13931A8599j7352Q1403K63086k986l3959O6051p5595k24250L7998M7307J4264
$$ 18599 1247 82650 345736 342750 308791 374842 299247 74997 112995 160302 174566
13920A74566m180q6362P5761J66137L5087l9070P4767j9632k14254l4656p0846
$$ 174566 170386 84024 159785 325922 361009 321939 396706 377074 162820 128164 57318
13909E7318j87155k8283n6856P4833K08848P0374Q7410O9837j94174j2540J15356
$$ 57318 -129837 -158120 -214976 -140143 68705 139079 226489 296326 102152 89612 204968
13898B04968l10553j63811p4604o935L36482L52439M6757p7004n8900R3366K22126
$$ 204968 -105585 -269396 -344000 -350935 -14453 337986 384743 307739 248839 342205 564331
13887E64331J240k47493k02322j0864J09916K7713p0977L7550j78961l1453J66199
$$ 564331 565571 318078 115756 104892 214808 242521 171544 209094 30133 -1320 164879
13876A64879K7624O292J42062J93622J03370R3707j66406j77555j93601k9188
$$ 164879 192503 198795 340857 534479 637849 731556 565150 387595 193994 164806
13866A64806j19542j79617j75765O4761J45096J8852J23793J69210K3841n6879
$$ 164806 45264 -134353 -310118 -245357 -100261 -81409 42384 211594 235435 178556
13856A78556o5803M9347j14705m6480K34744J38444J5828k33808K8084r2812l1994
$$ 178556 112753 162100 47395 915 235659 374103 389931 156123 184207 91395 59401
13845E9401P204J92848J92413j03446j43150R304j49201o5236J8593O0857O6558
$$ 59401 66605 259453 451866 348420 205270 214574 65373 137 18730 79587 146145
13834A46145j46252k01302k3718Q1530J57146L5278J49055l5049j5330j59425
$$ 146145 -107 -201409 -225127 -143597 13549 48827 197882 162833 147503 -11922
$$ [...]
##END NTUPLES=NMR SPECTRUM
##END=
