##TITLE=Analysis number 320415
Compound Code cc 14710
Project Code adrs
Chemist Name toronto res
##JCAMPDX= 6.0         $$ Bruker NMR JCAMP-DX V2.0
##DATA TYPE= NMR SPECTRUM
##DATA CLASS= NTUPLES
##ORIGIN= Bruker BioSpin GmbH
##OWNER= nmr
$$ XWIN-NMR		Version 3.5
$$ Fri Jun 23 10:59:48 2006 GMT Daylight Time (UT+1h)  MAYBRIDGE\nmr@NMR_250MHZ
##.OBSERVE FREQUENCY= 250.131544655141
##.OBSERVE NUCLEUS= ^1H
##.ACQUISITION MODE= SIMULTANEOUS (DQD)
##.ACQUISITION SCHEME= undefined
##.AVERAGES= 16
##.DIGITISER RES= 18
##SPECTROMETER/DATA SYSTEM= dpx250
##.PULSE SEQUENCE= zg30
##.SOLVENT NAME= CDCl3
##.SHIFT REFERENCE= (INTERNAL, CDCl3, 0, 16.522)
##AUDIT TRAIL= $$ (NUMBER, WHEN, WHO, WHERE, WHAT)
$$ ##TITLE= Audit trail, XWIN-NMR		Version 3.5
$$ ##JCAMPDX= 5.01
$$ ##ORIGIN= Bruker BioSpin GmbH
$$ ##OWNER= nmr
$$ C:\u/data/dgb/nmr/ADRS/1330/pdata/1/auditp.txt
$$ ##AUDIT TRAIL=  $$ (NUMBER, WHEN, WHO, WHERE, WHAT)
(   1,<2006-06-23 10:59:22.83 +100>,<MAYBRIDGE\nmr>,<NMR_250MHZ>,
      <created by zg, POWCHK disabled, PULCHK disabled
       configuration hash MD5:
       E2 DF 36 D8 04 B2 41 60 5A D7 A3 38 5A 4B D0 FE
       data hash MD5: 64K
       AC EB 84 65 08 14 CC 5B 2D B0 8A 11 16 72 A0 F6>)
(   2,<2006-06-23 10:59:36.03 +100>,<MAYBRIDGE\nmr>,<NMR_250MHZ>,
      <Start of raw data processing
       ef LB = 0.3 FT_mod = 6 PKNL = 1 SI = 32K 
       data hash MD5: 32K
       BA 7A 62 29 9C 09 75 B9 35 38 D3 18 DE 04 CE 5D>)
(   3,<2006-06-23 10:59:38.44 +100>,<MAYBRIDGE\nmr>,<NMR_250MHZ>,
      <apk 
       data hash MD5: 32K
       55 31 FC 24 E0 C2 D6 90 3B E8 D9 D4 9C 1E BC C8>)
(   4,<2006-06-23 10:59:39.61 +100>,<MAYBRIDGE\nmr>,<NMR_250MHZ>,
      <abs ABSG = 5 
       data hash MD5: 32K
       92 AE 08 B4 40 19 B2 7F AA EA 44 67 C6 3B 70 DA>)
$$ ##END=
$$ 
$$ hash MD5
$$ F9 20 4B 4F 84 87 65 19 B7 70 5A 97 78 52 3C 1F
##$RELAX= 
##$RELAX= 
##$RELAX= 
##$RELAX= 
##$RELAX= 
##$RELAX= 
##$RELAX= 
$$ Bruker specific parameters
$$ --------------------------
##$DU= <C:\u>
##$EXPNO= 1330
##$NAME= <ADRS>
##$PROCNO= 1
##$TYPE= <nmr>
##$USER= <dgb>
##$AMP= (0..31)
100 100 100 100 100 100 100 100 100 100 100 100 100 100 100 100 100 100 
100 100 100 100 100 100 100 100 100 100 100 100 100 100 
##$AQSEQ= 0
##$AQ_mod= 3
##$AUNM= <au_zg>
##$AUTOPOS= <19 >
##$BF1= 250.13
##$BF2= 250.13
##$BF3= 250.13
##$BF4= 250.13
##$BF5= 500.13
##$BF6= 500.13
##$BF7= 500.13
##$BF8= 500.13
##$BYTORDA= 1
##$CFDGTYP= 0
##$CFRGTYP= 5
##$CHEMSTR= <none>
##$CNST= (0..31)
1 1 145 1 1 1 1 1 1 1 1 1 1 1 1 1 1 1 1 1 1 1 1 1 1 1 1 1 1 1 1 1 
##$CPDPRG= <>
##$CPDPRG1= <>
##$CPDPRG2= <>
##$CPDPRG3= <>
##$CPDPRG4= <mlev>
##$CPDPRG5= <mlev>
##$CPDPRG6= <mlev>
##$CPDPRG7= <mlev>
##$CPDPRG8= <mlev>
##$CPDPRGB= <>
##$CPDPRGT= <>
##$D= (0..31)
0 1 0 0 0 0 0 0 0 0.06 0 0 0 0 0 0 0.0002 0 0 0 0 0 0 0 0 0 0 0 0 0 0 
0 
##$DATE= 1151056762
##$DBL= (0..7)
120 120 120 120 120 120 120 120 
##$DBP= (0..7)
150 150 150 150 150 150 150 150 
##$DBP07= 0
##$DBPNAM0= <>
##$DBPNAM1= <>
##$DBPNAM2= <>
$$ [...]
##$SUBNAM7= <"">
##$SUBNAM8= <"">
##$SUBNAM9= <"">
##$SW= 20.6930455092707
##$SWIBOX= (0..15)
0 0 3 0 0 0 0 0 0 0 0 0 0 0 0 0 
##$SW_h= 5175.983436853
##$TD= 65536
##$TD0= 1
##$TE= 295.16
##$TE2= 300
##$TE3= 300
##$TEG= 300
##$TL= (0..7)
0 120 120 120 120 120 120 120 
##$TP= (0..7)
150 150 150 150 150 150 150 150 
##$TP07= 0
##$TPNAME0= <>
##$TPNAME1= <>
##$TPNAME2= <>
##$TPNAME3= <>
##$TPNAME4= <>
##$TPNAME5= <>
##$TPNAME6= <>
##$TPNAME7= <>
##$TPOAL= (0..7)
0.5 0.5 0.5 0.5 0.5 0.5 0.5 0.5 
##$TPOFFS= (0..7)
0 0 0 0 0 0 0 0 
##$TUNHIN= 0
##$TUNHOUT= 0
##$TUNXOUT= 0
##$USERA1= <user>
##$USERA2= <user>
##$USERA3= <user>
##$USERA4= <user>
##$USERA5= <user>
##$V9= 5
##$VALIST= <valist>
##$VCLIST= <CCCCCCCCCCCCCCC>
##$VD= 0
##$VDLIST= <DDDDDDDDDDDDDDD>
##$VPLIST= <PPPPPPPPPPPPPPP>
##$VTLIST= <TTTTTTTTTTTTTTT>
##$WBST= 1024
##$WBSW= 4
##$XGAIN= (0..3)
0 0 0 0 
##$XL= 0
##$YL= 0
##$YMAX_a= 536363
##$YMIN_a= -549792
##$ZGOPTNS= <>
##$ZL1= 120
##$ZL2= 120
##$ZL3= 120
##$ZL4= 120
##$ABSF1= 16.522
##$ABSF2= -4.171173
##$ABSG= 5
##$ABSL= 3
##$ALPHA= 0
##$AQORDER= 0
##$ASSFAC= 0
##$ASSFACI= 0
##$ASSFACX= 0
##$ASSWID= 0
##$AUNMP= <proc_1d>
##$AZFE= 0.1
##$AZFW= 0.1
##$BCFW= 0
##$BC_mod= 0
##$BYTORDP= 0
##$COROFFS= 0
##$CY= 12.5
##$DATMOD= 1
##$DC= 0
##$DFILT= <>
##$DTYPP= 0
##$F1P= 14.0000005364418
##$F2P= -0.99999901652339
##$FCOR= 0.5
##$FTSIZE= 32768
##$FT_mod= 6
##$GAMMA= 0
##$GB= 0
##$INTBC= 1
##$INTSCL= 1
##$ISEN= 128
##$LB= 0.3
##$LEV0= 0
##$LPBIN= 0
##$MAXI= 10000
##$MC2= 0
##$MEAN= 0
##$ME_mod= 0
##$MI= 0
##$NCOEF= 0
##$NC_proc= -3
##$NLEV= 6
##$NOISF1= 0
##$NOISF2= 0
##$NSP= 0
##$NTH_PI= 0
##$NZP= 0
##$OFFSET= 16.522
##$PC= 1
##$PHC0= 197.8459
##$PHC1= -35.18405
##$PH_mod= 1
##$PKNL= yes
##$PPARMOD= 0
##$PSCAL= 4
##$PSIGN= 0
##$REVERSE= no
##$SF= 250.13
##$SI= 32768
##$SIGF1= 0
##$SIGF2= 0
##$SINO= 400
##$SIOLD= 32768
##$SREGLST= <1H.CDCl3>
##$SSB= 0
##$STSI= 32768
##$STSR= 0
##$SW_p= 5175.98343685301
##$SYMM= 0
##$S_DEV= 0
##$TDeff= 65536
##$TDoff= 0
##$TI= <Analysis number 999999
Compound Code 99
Book Reference 9
Project Code 9>
##$TILT= no
##$TM1= 0
##$TM2= 0
##$TOPLEV= 0
##$USERP1= <user>
##$USERP2= <user>
##$USERP3= <user>
##$USERP4= <user>
##$USERP5= <user>
##$WDW= 1
##$XDIM= 32768
##$YMAX_p= 444046103
##$YMIN_p= -605136
$$ End of Bruker specific parameters
$$ ---------------------------------
##NTUPLES= NMR SPECTRUM
##VAR_NAME=  FREQUENCY,     SPECTRUM/REAL,   SPECTRUM/IMAG
##SYMBOL=    X,             R,               I
##VAR_TYPE=  INDEPENDENT,   DEPENDENT,       DEPENDENT
##VAR_FORM=  AFFN,          ASDF,            ASDF
##VAR_DIM=   32768,         32768,           32768
##UNITS=     HZ,            ARBITRARY UNITS, ARBITRARY UNITS
##FACTOR=    0.157963299565203, 1,           1
##FIRST=     4132.6476996994, 0,             0
##LAST=      -1043.33573715361, 0,           0
##MIN=       -1043.33573715361, -605136,     0
##MAX=       4132.6476996994, 444046103,     0
$$ Real data points
##PAGE= N=1
##DATA TABLE= (X++(R..R)), XYDATA
$$ [...]
$$ plain form
15979 2116 14071 22134 -1167 13015 9379 -10700 -10258 -10607 4842 17728 16276 9839 24789
15966 24789 22510 5269 1851 -2318 -15078 -22403 -24883 -41021 -43924 -35584 -31863 -19701 -14324
15953 -14324 -4934 -3591 -12938 -3300 -2371 -4686 -1599 7563 15978 31407 33038 23198 18109 22909
15939 22909 30257 38721 23132 -2453 -8806 -6898 -2460 -21528 -32835 -37056 -33573 -38652 -46462
15926 -46462 -41076 -24993 -2433 -9444 5254 14633 32483 52309 32335 23215 22235 -4552 -13605
15913 -13605 -19176 -12662 -10722 -7394 -31816 -35266 -15894 -24587 -20660 639 29438 36837 32276
15900 32276 15708 11580 13366 10050 -1406 7857 -561 -4965 150 -6772 -1384 9996 14357 592
15886 592 -652 3891 -11078 -19080 6832 13657 -9716 -13724 -2103 -5607 -6179 -8005 10993 15321
$$ packed form
15979B116J1955Q063k3301J4182l636k0079M42l49J5449J2886j452o437J4950
15966B4789k279j7241l418m169j2760p325k480j6138k903Q340L721J2162N377
15953a4324R390J343r347R638R29k315L087R162Q415J5429J631r840n089M800
15939B2909P348Q464j5589k5585o353J908M438j9068j1307m221L483n079p810
15926d6462N386J6083K2560p011J4698R379J7850J9826j9974r120r80k6787r053
15913a3605n571O514J940L328k4422l450J9372q693L927K1299K8799P399m561
15900C2276j6568m128J786l316j1456R263q418m404N115o922N388J1380M361j3765
15886E92j244M543j4969q002K5912O825k3373m008J1621l504n72j826J8998M328
$$ plain form
15872 15321 6259 -4524 -3193 4480 16723 -11095 -14010 -4544 -6237 -10912 -9108 -9792 -4578 3224
15858 3224 12851 13753 23038 42352 30551 18849 22038 44545 53347 49226 39658 48366 32301 7108
15844 7108 5583 8603 16046 16537 9251 -3251 410 4040 8206 14840 19780 9893 27939 26187
15830 26187 22322 34197 42298 40134 37766 72136 85339 99417 120970 160495 224274 283909
15818 283909 350876 402306 472735 529038 575881 619647 647828 658973 644269 630826 626605 625063
15806 625063 593045 520209 438803 399494 369925 350985 322197 292292 251732 212383 179739
15795 179739 165508 162378 155385 143428 152281 138867 121428 113017 98838 106974 111538 117818 115669
15782 115669 116469 113660 102080 85419 86107 76819 56915 65360 71072 76295 78484 87236 85503 61292
$$ packed form
15872A5321r062j0783J331P673J2243k7818k915R466j693m675J804o84N214P802
15858C224R627R02R285J9314j1801j1702L189K2507Q802m121r568Q708j6065k5193
15844G108j525L020P443M91p286j2502L661L630M166O634M940r887J8046j752
15830B6187l865J1875Q101k164k368L4370J3203J4078K1553L9525O3779N9635
15818B83909O6967N1430P0429N6303M6843M3766K8181J1145j4704j3443m221j542
15806F25063l2018p2836q1406l9309k9569j8940k8788k9905m0560l9349l2644
15795A79739j4231l130o993j1957Q853j3414j7439q411j4179Q136M564O280k149
15782A15669Q00k809j1580j6661O88r288j9904Q445N712N223K189Q752j733k4211
$$ plain form
15768 61292 77595 85650 57999 57923 40938 34248 37622 43031 58601 65406 67681 53510 44907 31076
15754 31076 49947 42672 31637 24372 36984 50428 45449 31917 41903 48254 46976 23740 23322
15741 23322 19032 8012 -8640 7101 21252 41784 28147 11007 20542 29890 32271 23888 26845
15728 26845 31088 29026 28562 18606 10356 -5340 -9023 9859 31492 18151 149 -302 5941 14996
15714 14996 32323 30078 18738 12287 18373 12409 -12852 -21748 -31307 -12002 10135 29117 30009
15701 30009 20269 -11 4778 24212 28420 20641 25514 19260 17238 35205 59412 69407 55166
15688 55166 51851 42292 21463 11074 -507 -5671 -16648 -12019 2908 3845 -6146 -1581 229
15675 229 -7758 -1250 11479 38807 42708 38250 29195 24454 16953 4977 18211 38861 27652
$$ packed form
15768F1292J6303Q055k7651p6j6985o690L374N409J5570O805K275j4171q603j3831
15754C1076J8871p275j1035p265J2612J3444m979j3532R986O351j278k3236m18
15741B3322m290j1020j6652J5741J4151K0532j3637j7140R535R348K381q383K957
15728B6845M243k062m64r956q250j5696l683J8882K1633j3341j8002m51O243R055
15714A4996J7327k245j1340o451O086n964k5261q896r559J9305K2137J8982Q92
15701C0009r740k0280M789J9434M208p779M873o254k022J7967K4207R995j4241
15688E5166l315r559k0829j0389j1581n164j0977M629J4927R37r991M565J810
15675B29p987O508J2729K7328L901m458r055m741p501j1976J3234K0650j1209
$$ plain form
15662 27652 27728 28996 20835 24014 24183 17823 25643 6874 7871 -6393 -8953 -15720 -18046 -2091 23431
15647 23431 26726 20433 39674 36891 29863 33521 25379 5196 -3742 14396 16478 5223 4159
15634 4159 -11510 -16876 5419 17832 2886 -20374 -28156 -19790 -6828 12003 3889 -21066 -7530
15621 -7530 -1208 9978 25244 27294 17810 -3485 -10825 -11987 9223 18371 4844 -1147 5421
15608 5421 10755 26013 21582 18431 3477 -11532 1525 20998 32794 31580 33550 17011 7138
15595 7138 16875 12331 -745 -2069 763 10541 8036 19148 5885 -15943 -29260 -11044 -2651
15582 -2651 -9881 -6722 6358 -5209 -3581 -1407 2611 6594 13 -5359 -12939 -7664 -6629 -14032
15568 -14032 -12990 -8254 -12757 -19002 -43834 -19712 5242 -4994 -3398 2250 5881 17075 8251
$$ packed form
15662B7652P6J268q161L179J69o360P820j8769R97j4264k560o767k326J5955K5522
15647B3431L295o293J9241k783p028L658q142k0183q938J8138K082j1255j064
15634D159j5669n366K2295J2413j4946k3260p782Q366J2962J8831q114k4955J3536
15621g530O322J1186J5266K050r484k1295p340j162K1210R148j3527n991O568
15608E421N334J5258m431l151j4954j5009J3057J9473J1796j214J970j6539r873
15595G138R737m544j3076j324K832R778k505J1112j3263k1828j3317J8216Q393
15582b651p230L159J3080j1567J628K174M018L983o581n372p580N275J035p403
15568a4032J042M736m503o245k4832K4122K4954j0236J596N648L631J1194q824
$$ plain form
15555 8251 -5255 -8285 -16629 -9659 13500 26649 29161 15123 6757 3138 445 -5906 -4343 16155
15541 16155 5915 -29792 -8981 6891 24801 9612 6918 4528 6320 36020 39358 39976 27919
15528 27919 28601 25400 13104 24 -7309 -469 -11228 -28678 -31917 -15581 -3638 -8444 -4519
15515 -4519 -7159 5713 9531 3108 -21968 -22000 -8180 -3215 -18194 -28420 -14970 -3151 -761
15502 -761 1029 10929 -2455 -14929 -18386 -17059 -17740 -6395 -4765 -26483 -34513 -16241 625 4310
15488 4310 13454 11870 28384 43909 31856 8877 -6795 -3227 -4082 -275 9610 13707 -10518
15475 -10518 -22184 -16538 -11031 -5198 -23085 -26393 -23375 -8468 -6625 -5215 4367 594 1252 10477
15461 10477 12683 16606 3431 -6408 -11241 -32440 -28301 -11464 1202 -3939 -19312 -28737 -35775
$$ packed form
15555H251j3506l030q344O970K3159J3149K512j4038q366l619k693o351J563K0498
15541A6155j0240l5707K0811J5872J7910j5189k694k390J792K9700L338O18j2057
15528B7919O82l201j2296j3080p333O840j0759j7450l239J6336J1943m806L925
15515d519k640J2872L818o423k5076l2J3820M965j4979j0226J3450J1819K390
15502g61J790R900j3384j2474l457J327o81J1345J630k1718q030J8272J6866L685
15488D310R144j584J6514J5525j2053k2979j5672L568q55L807R885M097k4225
15475a0518j1666N646N507N833j7887l308L018J4907J843J410R582l773O58R225
15461A0477K206L923j3175r839m833k1199M139J6837J2666n141j5373r425p038
$$ plain form
15448 -35775 -46265 -31062 -2027 -4130 -5586 -4530 672 8480 -5028 4661 -3549 6099 11454
15435 11454 13942 24278 28067 17608 19892 14242 12062 26366 37261 11727 7174 4454 -10888
15422 -10888 -10875 7143 20277 36210 21388 12763 10594 26375 33225 28706 12297 -590 -7625
15409 -7625 -22627 -13353 -8735 13429 30182 22848 12609 17970 39094 36996 26927 24770 40267
15396 40267 51370 50500 29063 -12683 -35039 -28401 -2817 26362 30166 9621 1690 9073 10539
15383 10539 20767 4972 -4793 -1433 -1167 7606 5637 19116 23657 32897 22061 11952 11519 5786
15369 5786 3141 -18935 -42798 -42337 -14811 -5468 -14641 -12657 -534 -448 -3615 -11007 -15444 -18325
15355 -18325 -16376 -5445 714 -4105 9795 2139 -12647 -5688 -2717 -8393 -13215 -9722 511
$$ packed form
15448c5775j0490J5203K9035k103j456J056N202P808j3508R689q210R648N355
15435A1454K488J0336L789j0459K284n650k180J4304J0895k5534m553k720j5342
15422a0888J3J8018J3134J5933j4822q625k169J5781O850m519j6409j2887p035
15409g625j5002R274M618K2164J6753p334j0239N361K1124k098j0069k157J5497
15396D0267J1103q70k1437m1746k2356O638K5584K9179L804k0545p931P383J466
15383A0539J0228j5795r765L360K66Q773j969J3479M541R240j0836j0109m33n733
15369E786k645k2076k3863M61K7526R343r173J984J2123Q6l167p392m437k881
15355a8325J949J0931O159m819J3900p656j4786O959K971n676m822L493J0233
$$ plain form
15342 511 -9986 -22774 -14062 -8897 8350 15624 18616 18019 16643 11205 -3427 -7235 -7704 5094
15328 5094 18610 30108 21959 8406 12191 18255 26534 40021 34576 31598 32544 21583 24353 24878
15314 24878 11475 -6377 -13422 -9810 5526 17721 13206 23468 6407 -20605 -24358 -13174
15302 -13174 -7954 5683 29629 30303 31001 31240 12188 7756 18440 29094 21012 29107 25132 6897
15288 6897 -3833 5386 11378 17351 36027 29981 -1942 -4975 11689 18635 8470 15329 19830
15275 19830 8266 -15105 -32220 -5374 3010 -527 -1205 -2026 -6730 -7873 -7269 7537 12981 20962
15261 20962 14909 5654 -5955 -9952 13628 17055 6757 10543 24492 25967 18201 12358 -3326
15248 -3326 -15790 -17280 -11133 -10990 -9270 -12081 -25254 -25796 -21485 -12490 -12443 -589 -15678 -30622
$$ packed form
15342E11j0497j2788Q712N165J7247P274K992n97j376n438j4632l808m69J2798
15328E094J3516J1498q149j3553L785O064Q279J3487n445k978R46j0961K770N25
15314B4878j3403j7852p045L612J5336J2195m515J0262j7061k7012l753J1184
15302a3174N220J3637K3946O74O98K39j9052m432J0684J0654q082Q095l975j8235
15288F897j0730R219N992N973J8676o046l1923l033J6664O946j0165O859M501
15275A9830j1564k3371j7115K6846Q384l537o78q21m704j143O04J4806N444P981
15261B0962o053r255j1609l997K3580L427j0298L786J3949J475p766n843j5684
15248c326j2464j490O147J43J720k811j3173n42M311Q995M7J1854j5089j4944
$$ plain form
15234 -30622 -37582 -23933 -11368 -1931 9659 11588 2399 -3927 662 5866 1067 3474 15584
15221 15584 4980 -3845 1415 8246 -7786 -9125 -21367 -28543 -26909 -12746 -16012 -12328 -13635
15208 -13635 -15374 -15160 -5898 1685 17260 23117 8280 -405 -9726 -18711 -13587 -21105 -18094 -19345
15194 -19345 -28189 -27188 -7563 3284 1890 5284 -2733 -1000 15950 32183 36995 26761 7683
15181 7683 3029 -8168 -4840 -2147 12721 2992 -15358 -22362 -13986 -14161 -4674 883 -5266 -16560
15167 -16560 -20856 -13924 -13214 -17044 -30055 -17728 -19957 -26677 -27029 -25671 -24024 -26644 -6619 7293
15153 7293 2941 -612 -13184 -14065 -3868 22000 16393 87 122 -11286 -23332 -31924 -26231 -6346
15139 -6346 -2003 11126 3076 101 10199 8966 12889 15636 25665 20003 -1307 -21136 738
$$ packed form
15234c0622o960J3649J2565R437J1590J929r189o326M589N204m799K407J2110
15221A5584j0604q825N260O831j6032j339j2242p176J634J4163l266L684j307
15208a3635j739K14R262P583J5575N857j4837q685r321q985N124p518L011j251
15194a9345q844J001J9625J0847j394L394q017J733J6950J6233M812j0234j9078
15181G683m654j1197L328K693J4868r729j8350p004Q376j75R487N557o149j1294
15167a6560m296O932P10l830j3011J2327k229o720l52J358J647k620K0025J3912
15153G293m352l553j2572q81J0197K5868n607j6306L5j1408j2046q592N693J9885
15139f346M343J3129q050k975J0098j233L923K747J0029n662k1310j9829K1874
$$ plain form
15126 738 10889 9817 2650 -18350 -19842 -8371 -14097 -6550 -13349 -9995 -11690 -16557 1063 18200
15112 18200 16612 5447 -17384 -20503 -20818 -26386 -15200 -8126 -4358 21659 19007 17379 18122 2673
15098 2673 -12786 -15992 -9281 177 9830 -1974 -4881 -9291 -25055 -24487 -30599 -23161 -17868 -22240
15084 -22240 -35270 -36036 -12973 -7975 -5219 -21105 -38278 -60707 -59174 -30214 -13831 -15555 -6134
15071 -6134 -14483 -14197 -21234 -23224 -11418 -13439 -14523 1966 -5113 11323 18875 9037 9926 8071
15057 8071 12691 5127 -17989 -14965 -8447 -1498 1275 -1644 -4534 -8991 -15708 -5628 5509 -160
15043 -160 8099 8937 15219 13170 2309 2666 -4250 -8197 -10217 -21288 -15312 -18678 2279 -4355 689
15028 689 11687 5519 11592 5976 -2250 -17629 -17108 -20653 -26826 -36051 -17631 -11306 -15254 -10740
$$ packed form
15126G38J0151j072p167k1000j492J1471n726P547o799L354j695m867J7620J7137
15112A8200j588j1165k2831l119l15n568J1186P074L768K6017k652j628P43j5449
15098B673j5459l206O711R458R653j1804k907m410j5764N68o112P438N293m372
15084b2240j3030p66K3063M998K756j5886j7173k2429J533K8960J6383j724R421
15071f134q349K86p037j990J1806k021j084J6489p079J6436P552r838Q89j855
15057H071M620p564k3116L024O518O949K773k919k890m457o717J0080J1137n669
15043a60Q259Q38O282k049j0861L57o916l947k020j1071N976l366K0957o634N044
15028F89J0998o168O073n616q226j5379N21l545o173r225J8420O325l948M514
$$ plain form
15014 -10740 -8367 -10263 -14688 1028 6174 11761 -14506 -15133 -24324 -32638 -28058 -14288 -28581 -24335
15000 -24335 -19216 -28926 -17076 -23894 -28482 -26012 -21881 -23900 -11240 2583 1493 -6114 -9386 -16320
14986 -16320 -16979 -17064 -3069 -50 6177 12513 28221 11853 -14261 -23157 -18549 -4467 -1164 -15963
14972 -15963 -15025 -11105 -9952 11443 32618 15893 13862 12011 22781 24904 20975 33241 37875
14959 37875 17398 -8061 -4083 -6807 8992 22400 23466 14215 4098 2916 11346 20633 -932
14946 -932 -7843 -14898 -3910 -6022 -16965 -16386 -27085 -15034 -14800 2809 18413 11972 16941 2979
14932 2979 -14879 -8345 -13186 -520 10322 1584 -15862 -22532 -24473 -19372 -10792 -4600 -4295 50
14918 50 -6735 1995 15149 -7474 -26712 -30807 -27717 -32619 -19400 -28094 -32137 -33271 -34451 -36477
$$ packed form
15014a0740K373j896m425J5716N146N587k6267o27r191q314M580J3770j4293M246
15000b4335N119r710J1850o818m588K470M131k019J2660J3823j090p607l272o934
14986a6320o59q5J3995L019O227O336J5708j6368k6114q896M608J4082L303j4799
14972a5963R38L920J153K1395K1175j6725k031j851J0770K123l929J2266M634
14959C7875k0477k5459L978k724J5799J3408J066r251j0117j182Q430R287k1565
14946i32o911p055J0988k112j0943N79j0699J2051K34J7609J5604o441M969j3962
14932B979j7858O534m841J2666J0842q738j7446o670j941N101Q580O192L05M345
14918E0o785Q730J3154k2623j9238m095L090m902J3219q694m043j134j180k026
$$ plain form
14904 -36477 -38687 -28978 -20015 -10683 -34667 -31098 -19214 -21621 -14807 -13755 -20732 -25445 -23827 2363
14890 2363 13463 258 11660 21369 10607 -5164 -6494 -2587 3667 -9004 -24875 -7672 3267
14877 3267 -4303 -15387 -15906 -35114 -67722 -66147 -61340 -53469 -43542 -33785 -16299 -7859 -3647 499
14863 499 -9137 -21824 -12183 507 13678 15479 19825 21926 15706 529 -8110 -11635 -4151 -677
14849 -677 -13008 -42004 -53737 -51332 -42255 -17496 -5661 -9501 -7818 -19195 -30137 -27461 -27213
14836 -27213 -22901 -20833 14233 10423 -13887 327 20289 15383 11085 18729 7468 -13516 -15319
14823 -15319 -879 4726 9634 9443 11034 5561 -1541 -16398 -9247 -12495 -2351 -10840 -4306 21578
14809 21578 17663 5308 1564 -11442 -14518 -17653 -15771 -13054 -30480 -45141 -36661 -30123 -27962
$$ packed form
14904c6477k210R709Q963R332k3984L569J1884k407O814J052o977m713J618K6190
14890B363J1100j3205J1402R709j0762j5771j330L907O254j2671j5871J7203J0939
14877C267p570j1084n19j9208l2608J575M807P871R927R757J7486Q440M212M146
14863D99r636j2687R641J2690J3171J801M346K101o220j5177q639l525P484L474
14849f77j2331k8996j1733K405R077K4759J1835l840J683j1377j0942K676K48
14836b7213M312K068L5066l810k4310J4214J9962m906m298P644j1261k0984j803
14823a5319J4440N605M908j91J591n473p102j4857P151l248J0144q489O534K5884
14809B1578l915j2355l744j3006l076l135J882K717j7426j4661Q480O538K161
$$ plain form
14796 -27962 -16643 -8461 -8468 -21705 -28285 -18450 -19127 -9999 -12530 -23138 -25778 -14129 -14489 1873
14782 1873 11765 8586 -19066 -22737 -1835 9433 161 -2197 -14828 -21026 -9689 -6395 8133
14769 8133 -464 -10024 -19943 -6118 3009 -11682 -17879 -21211 -12269 -10430 -3675 -9567 -2128 1215
14755 1215 1570 -3053 -8300 -6876 -8123 10462 41650 31704 6163 14118 13660 2343 -3930 2505
14741 2505 10140 12316 15010 5786 -25555 -16890 274 -23473 -30019 -23959 -18838 -27184 -41509 -31032
14727 -31032 -422 -11644 -18438 -35940 -43114 -33749 -33388 -29031 -32730 -25821 -8922 609 -4190 -3837
14713 -3837 9212 18485 10234 1195 600 -113 -1954 4871 13226 -1632 1606 13390 -216 -15286
14699 -15286 -32733 -61551 -52283 -14190 13068 12095 -4722 -8381 -25879 -21717 -3142 18189 25527
$$ packed form
14796b7962J1319Q182pj3237o580R835o77R128k531j0608k640J1649l60J6362
14782A873R892l179k7652l671K0902J1268r272k358j2631o198J1337L294J4528
14769H133q597r560r919J3825R127j4691o197l332Q942J839O755n892P439L343
14755A215L55m623n247J424j247J8585L1188r946k5541P955m58j1317o273O435
14741B505P635K176K694r224l1341Q665J7164k3747o546O060N121q346j4325J0477
14727c1032L0610j1222o794j7502p174R365L61M357l699O909J6899R531m799L53
14713c837J3049R273q251r039n95p13j841O825Q355j4858L238J1784j3606j5070
14699a5286j7447k8818R268L8093K7258r73j6817l659j7498M162J8575K1331P338
$$ plain form
14686 25527 1352 -12949 -26711 -28201 -9739 413 -1951 -9774 -16186 -13624 -18173 -21250 -27484
14673 -27484 -32872 -32161 -29708 -20324 -6397 -12237 -19068 -35431 -31140 -38257 -37520 -36111 -42930 -43094 -36978
14658 -36978 -23942 -9321 -17454 -37106 -36521 -27409 -36875 -53129 -48339 -25540 -12513 -7940 -13567
14645 -13567 -11877 -12575 -3730 4557 -11765 -9453 -14756 -1863 11760 9848 -2834 -25621 -26704
14632 -26704 -46731 -43061 -19513 2538 13666 13783 -15602 -32668 -13547 -11265 -1739 -6704 -11285
14619 -11285 -13008 -26200 -13862 -8051 -138 14228 -3709 -14 12022 33404 14480 130
14607 130 -5972 -7476 -7201 -4221 -13239 -11137 -24010 -50796 -40277 -28039 -23828 -25418 -17331 -3966
14593 -3966 4393 -6804 -24229 -28425 -18916 -26579 -16419 -16484 -25336 -2712 -5314 -31016 -39098 -37183
$$ packed form
14686B5527k4175j4301j3762j490J8462J0152k364p823o412K562m549l077o234
14673b7484n388P11K453R384J3927n840o831j6363M291p117P37J409o819j64O116
14658c6978J3036J4621q133j9652N85R112r466j6254M790K2799J3027M573n627
14645a3567J690o98Q845Q287j6322K312n303J2893J3623j912j2682k2787j083
14632b6704k0027L670K3548K2051J1128J17k9385j7066J9121K282R526m965m581
14619a1285j723j3192J2338N811P913J4366j7937L695J2036K1382j8924j4350
14607A30o102j504K75K980r018K102j2873k6786J0519J2238M211j590Q087J3365
14593c966Q359j1197j7425m196R509p663J0160o5q852K2624k602k5702q082J915
$$ plain form
14579 -37183 -32822 -19577 -17362 -26135 -24125 -9626 -3973 -9640 -10465 -18894 -35198 -33377 -15232 4607
14565 4607 18216 8138 8943 -1390 -4041 -16073 -20224 -23454 -26296 -16090 -1423 922 7784
14552 7784 4396 2116 -15099 -6141 -12935 -10694 -16258 -17635 -36484 -27439 -3076 16014 7404 -9875
14538 -9875 -17476 -10138 -16308 -38110 -16771 11060 7222 4602 -8480 5720 5370 -2135 1388 -5571
14524 -5571 398 7039 -13188 -27495 -18667 -39806 -47753 -38894 -16338 -15885 -27245 -35092 -39350 -51358
14510 -51358 -29546 -5524 2717 13064 2715 -3246 -7297 -8695 -19493 -6280 -3661 -23119 -13648
14497 -13648 19171 23899 -1185 -21595 -16238 -29104 -42022 -33698 -10961 -9509 -17746 -36500 -46354
14484 -46354 -39349 -31976 -32191 -17382 1080 -2486 -11705 -14045 -1826 -13383 -23854 -11621 -11626 -44472
$$ packed form
14579c7183M361J3245K215q773K010J4499N653n667q25q429j6304J821J8145J9839
14565D607J3609j0078Q05j0333k651j2032m151l230k842J0206J4667K345O862
14552G784l388k280j7215Q958o794K241n564j377j8849R045K4363J9090q610j7279
14538i875p601P338o170k1802K1339K7831l838k620j3082J4200l50p505L523o959
14524e571N969O641k0227j4307Q828k1139p947Q859K2556M53j1360p847m258j2008
14510e1358K1812K4022Q241J0347j0349n961m051j398j0798J3213K619j9458R471
14497a3648L2819M728k5084k0410N357j2866j2918Q324K2737J452q237j8754r854
14484d6354P005P373k15J4809J8462l566r219k340J2219j1557j0471J2233nl2846
$$ plain form
14470 -44472 -62757 -38008 -25582 -24418 -9812 900 -6393 -7878 6571 9128 7318 -8232 -19348
14457 -19348 -29168 848 5866 -6540 -5908 -9314 -2081 4098 -10079 -29595 -40386 -36176 -39124
14444 -39124 -31276 -4994 11225 26134 19977 3294 -4566 875 -915 -16867 -17926 -3164 5
14431 5 -7013 -26923 -35179 -31174 -36287 -24306 -14012 -24082 -31201 -29268 -27016 -27947 -30614 -23879 -13681
14416 -13681 -1518 4377 -4292 -6529 -18706 -34309 -41121 -46863 -35856 -11475 -5111 -10576 -10609 -13157
14402 -13157 -10516 -27474 -26646 -15484 -17680 -19505 -24610 -18067 -24234 -32697 -6548 2639 -935 -8240
14388 -8240 15149 20154 5342 -15736 -16372 -8399 685 -9825 -14081 4304 13219 -1464 7918
14375 7918 4177 -15800 -16448 -23365 -18796 -23433 -22237 -21002 -14783 -26235 -8800 6033 5150 -9051
$$ packed form
14470d4472j8285K4749J2426J164J4606J0712p293j485J4449K557j810j5550j1116
14457a9348r820L0016N018j2406O32l406P233O179j4177j9516j0791M210k948
14444c9124P848K6282J6219J4909o157j6683p860N441j790j5952j059J4762L169
14431Ep018j9910q256M005n113J1981J0294j0070p119J933K252r31k667O735J0198
14416a3681J2163N895q669k237j2177j5603o812n742J1007K4381O364n465l3k548
14402a3157K641j6958Q28J1162k196j825n105O543o167q463K6149R187l574p305
14388h240K3389N005j4812k1078o36P973R084j0510m256J8385Q915j4683R382
14375G918l741j9977o48o917M569m637J196J235O219j1452J7435J4833q83j4201
$$ plain form
14361 -9051 -11371 -17582 -24657 -24672 -38198 -39838 -37630 -37178 -42840 -31340 -34144 -43748 -28960 -11420
14347 -11420 4894 10251 9004 10258 3453 -13510 -6010 -2315 -5646 -5898 -11008 -8233 -12167 -26387
14333 -26387 -34680 -37885 -24344 -12700 -9486 20299 14308 -3348 -18644 -17943 -43461 -37813 -22293
14320 -22293 -15492 -22364 -20954 -17938 -24232 -17173 -30197 -46320 -41984 -33002 -18168 -10167 -18923 -37573
14306 -37573 -44116 -34753 -24584 -35373 -32531 -21975 -22219 -14096 -20455 -30762 -37041 -36679 -34315 -21104
14292 -21104 -20932 -23823 -8252 -3186 6915 10575 -8323 -28290 -53025 -46309 -40317 -34086 -31224
14279 -31224 -21365 -13401 -20604 -10513 -4137 -27824 -45441 -54136 -49613 -64208 -57072 -43692 -29882
14266 -29882 -25649 -36290 -41680 -27470 -13562 -6283 -15955 -22937 -9617 -9158 -28593 -18471 -6617
$$ packed form
14361i051k320o211p075j5j3526j640K208M52n662J1500k804r604J4788J7540
14347a1420J6314N357j247J254o805j6963P500L695l331k52n110K775l934j4220
14333b6387q293l205J3541J1644L214K9785n991j7656j5296P01k5518N648J5520
14320b2293O801o872J410L016o294P059j3024j6123M336Q982J4834Q001q756j8650
14306c7573o543R363J0169j0789K842J0556k44Q123o359j0307o279L62K364J3211
14292b1104J72k891J5571N066J0101L660j8898j9967k4735O716N992O231K862
14279c1224R859P964p203J0091O376k3687j7617q695M523j4595P136J3380J3810
14266b9882M233j0641n390J4210J3908P279r672o982J3320M59j9435J0122J1854
$$ plain form
14253 -6617 -20121 -16395 -21983 -38209 -33631 -17915 -7755 -13426 -39685 -31354 -16784 -2469 -317
14240 -317 -2379 -17407 -4274 1166 -13436 -27179 -24393 -20566 -19591 -24722 -43359 -26339 -1101
14227 -1101 8768 160 5353 11668 4043 -16049 -29809 -28495 -31629 -14133 -16641 -17211 -23367 -8748
14213 -8748 -11661 1461 -17760 -26210 -22874 -33444 -33659 -31478 -7176 6898 -2209 -14159 -13629 -12525
14199 -12525 -8612 3809 48 -20004 -17038 -23947 -32031 -35749 -29054 -35971 -29066 -19050 -2128
14186 -2128 27569 17053 2950 2721 -8480 -25283 -32162 -14232 -209 -17550 -26885 -23838 -30918
14173 -30918 -41696 -56295 -54891 -34222 -17110 -13168 -7439 -23124 -10228 29040 27782 -1056
14161 -1056 -17555 -22717 -31519 -29857 -28697 -44451 -44213 -30931 -9273 -16956 -23264 -10877 -6879 -4026
$$ packed form
14253f617j3504L726n588j6226M578J5716J0160n671k6259Q331J4570J4315K152
14240c17k062j5028J3133N440j4602j3743K786L827R75n131j8637J7020K5238
14227a101R869q608N193O315p625k0092j3760J314l134J7496k508n70o156J4619
14213h748k913J3122j9221q450L336j0570k15K181K4302J4074r107j1950N30J104
14199a2525L913J2421l761k0052K966o909q084l718O695o917O905J0016J6922
14186b128K9697j0516j4103k29j1201j6803o879J7930J4023j7341r335L047p080
14173c0918j0778j4599J404K0669J7112L942N729j5685J2896L9268j258k8838
14161a056j6499n162q802J662J160j5754K38J3282K1658p683o308J2387L998K853
$$ plain form
14147 -4026 -11802 -18639 -13392 -25990 -37269 -44514 -26801 -20328 -31130 -23961 -30861 -29959 -18658 -13931
14133 -13931 -10363 -23111 -41756 -36100 -30830 -25993 -18238 -10690 -9743 -3070 -3566 -20490 -27790 -8327
14119 -8327 8397 -7526 -861 -11499 -12429 -8723 -11490 -19443 -18495 414 153 -13900 -4569 9296
14105 9296 -127 3845 -5452 -14474 -9672 2885 9936 9412 2848 -290 11005 25584 20469 1968
14091 1968 -10982 -2946 548 12774 1351 -15247 -7050 -22212 -30982 -17509 -17130 -16904 -13194 9188
14077 9188 21106 6619 38 -7888 -517 -15901 -27099 -31813 -23150 -12332 -12203 -22606 -35326
14064 -35326 -14643 -308 -15312 -29513 -26757 -24859 -25939 -15035 -11552 -14776 -28715 -15965 -31110
14051 -31110 -32295 -25350 -8592 -14540 -15393 -26735 -33077 -24765 -14005 -17163 -4201 5712 -4588
$$ packed form
14147d026p776o837N247j2598j1279p245J7713O473j0802P169o900R02J1301M727
14133a3931L568j2748j8645N656N270M837P755P548R47O673m96j6924p300J9463
14119h327J6724j5923O665j0638r30L706k767p953R48J8909k61j4053R331J3865
14105I296r423L972r297r022M802J2557P051n24o564l138J1295J4579n115j8501
14091A968j2950Q036L494J2226j1423j6598Q197j5162q770J3473L79K26L710K2382
14077I188J1918j4487o581p926P371j5384j1198m714Q663J0818J29j0403j2720
14064c5326K0683J4335j5004j4201K756J898j080J0904L483l224j3939J2750j5145
14051c1110j185O945J6758n948q53j1342o342Q312J0760l158J2962R913j0300
$$ plain form
14038 -4588 -31649 -48055 -47507 -34029 -22641 -15732 -12010 -36119 -44314 -39540 -35001 -40093 -44095 -41318
14024 -41318 -34709 -29386 -29913 -27512 -4958 -5492 2485 486 -10283 -15796 -1493 -15859 -22212 -6130
14010 -6130 -13342 -25423 -8786 -7339 6839 2954 -7269 -6065 -6224 -2560 -14163 -24799 -29384
13997 -29384 -35019 -28391 -30130 -26323 -27863 -20269 -12914 -5578 -9380 -2277 -6543 -31340 -39964 -29097
13983 -29097 -4272 3149 -39588 -41405 -24928 -19193 -7451 -8011 -19824 -45461 -56374 -43318 -34265
13970 -34265 -40568 -25496 -15576 -3542 -9972 -28055 -45211 -40484 -28985 -28917 -42342 -39390 -31698
13957 -31698 -8181 -11652 -13602 568 15976 10923 5530 26123 35440 20455 4533 13398 14935
13944 14935 15343 11125 2593 3179 -14406 -33870 -20784 -23500 -16870 -7793 -5965 3933 16514 16462
$$ packed form
14038d588k7061j6406N48J3478J1388O909L722k4109q195M774M539n092m002K777
14024d1318O609N323n27K401K2554n34P977j999j0769n513J4303j4366o353J6082
14010f130p212j2081J6637J447J4178l885j0223J204j59L664j1603j0636m585
13997b9384n635O628j739L807j540P594P355P336l802P103m266k4797q624J0867
13983b9097K4825P421m2737j817J6477N735J1742n60j1813k5637j0913J3056R053
13970c4265o303J5072R920J2034o430j8083j7156M727J1499O8j3425K952P692
13957c1698K3517l471j950J4170J5408n053n393K0593R317j4985j5922Q865J537
13944A4935M08m218q532N86j7585j9464J3086k716O630R077J828R898J2581n2
$$ plain form
13930 16462 19993 6654 21886 33527 10967 -12414 -7188 -3090 -10178 9926 16226 11659 7028
13917 7028 -4021 -12319 -28753 -23829 -9098 -6395 -17704 -13249 -4552 -10551 352 -6573 -12597
13904 -12597 -14029 -6505 -4405 -4111 -19643 -37614 -40848 -46558 -47693 -50522 -65209 -45420 -33199
13891 -33199 -18865 -9388 -6443 -4382 -5502 -6726 7644 9602 -11970 -29395 -23501 -13264 -2111
13878 -2111 -3368 3392 -3264 -15493 -25662 -25900 -10971 -34902 -33835 -18643 -7247 -16840 -18732
13865 -18732 -18507 -19366 -26073 -23534 -25200 -26317 -32083 -39915 -45744 -65552 -72426 -55857 -29991 -34893
13851 -34893 -42480 -40559 -33448 -27070 -15724 844 1863 -1259 -14162 -34903 -41792 -34490 -29675
13838 -29675 -33221 -31885 -39269 -41100 -30852 -16393 3295 10127 18882 14636 -10058 -22276 -25708
$$ packed form
13930A6462L531j3339J5232J1641k2560k3381N226M098p088K0104O300m567m631
13917G028j1049q298j6434M924J4731K703j1309M455Q697n999J0903o925o024
13904a2597j432P524K100K94j5532j7971l234n710j135k829j4687J9789J2221
13891c3199J4334R477K945K061j120j224J4370J958k1572j7425N894J0237J1153
13878b111j257O760o656j2229j0169k38J4929k3931J067J5192J1396r593j892
13865a8732K25q59o707K539j666j117n766p832n829j9808o874J6569K5866m902
13851c4893p587J921P111O378J1346J6568J019l122j2903k0741o889P302M815
13838b9675l546J336p384j831J0248J4459J9688O832Q755m246k4694j2218l432
$$ plain form
13825 -25708 -31048 -28532 -34419 -39182 -39592 -37062 -52093 -63717 -47896 -31111 -45797 -44850 -32636
13812 -32636 -18166 -14171 -2220 -2968 -23215 -23325 -42901 -61739 -74473 -80217 -56955 -30161 -20121
13799 -20121 -20086 -32126 -27676 -6374 16591 11524 7485 -4416 -18478 -19526 -1062 10005 3601
13786 3601 -4213 -15702 -21497 -23950 -28159 -34481 -18545 -6428 3061 7393 -13644 -32243 -57513
13773 -57513 -51789 -39462 -41764 -50757 -62674 -54955 -38558 -28909 -12202 -22693 -28428 -19885 -9553
13760 -9553 -24284 -45737 -42022 -41188 -17302 -25089 -38895 -25880 -25199 -11931 -4510 1700 4145 7324
13746 7324 -21665 -26118 -29054 -38261 -27989 -33106 -25741 -24964 -20303 -13073 -21172 -13266 1220 -3180
13732 -3180 -27279 -41276 -36755 -40529 -55948 -52214 -39944 -34632 -16206 -7788 -14550 -7321 -29026
$$ packed form
13825b5708n340K516n887m763m10K530j5031j1624J5821J6785j4686R47J2214
13812c2636J4470L995J1951p48k0247j10j9576j8838j2734n744K3262K6794J0040
13799b0121L5j2040M450K1302K2965n067m039j1901j4062j048J8464J1067o404
13786C601p814j1489n795k453m209o322J5936J2117R489M332k1037j8599k5270
13773e7513N724J2327k302q993j1917P719J6397R649J6707j0491n735Q543J0332
13760i553j4731k1453L715Q34K3886p787j3806J3015O81J3268P421O210K445L179
13746G324k8989m453k936r207J0272n117P365P77M661P230q099P906J4486m400
13732c180k4099j3997M521l774j5419L734J2270N312J8426Q418o762P229k1705
$$ plain form
13719 -29026 -43251 -32136 -35762 -47310 -44688 -31727 -25993 -33538 -35216 -34753 -26566 -28416 -36119 -45558
13705 -45558 -43425 -49893 -54922 -51847 -50991 -37613 -16902 -16788 -13785 -31299 -49304 -36420 -24725
13692 -24725 -8730 -603 4731 4052 -6958 -13733 -30536 -35743 -18235 -22920 -30101 -32701 -16279
13679 -16279 -40799 -55955 -59747 -49909 -57250 -70988 -45759 -33082 -26044 -23331 -33779 -45610 -50297
13666 -50297 -63970 -41181 -35446 -34208 -26015 -28730 -36057 -54168 -52993 -50326 -29036 -12658 3243
13653 3243 2875 -8004 -35711 -58684 -53057 -44377 -40194 -33696 -24834 -35515 -29821 -13528 -20690 -41460
13639 -41460 -41617 -13836 -5365 -14457 -19744 -12043 -4067 -15066 -15434 -29715 -32585 -33435 -23886 -14560
13625 -14560 -15152 -22167 -26070 -35399 -30255 -21722 -20077 -38760 -26819 -17626 -34409 -65804 -54604
$$ packed form
13719b9026j4225J1115l626j1548K622J2961N734p545j678M63Q187j850p703r439
13705d5558K133o468n029L075Q56J3378K0711J14L003j7514j8005J2884J1695
13692b4725J5995Q127N334o79j1010o775j6803n207J7508m685p181k600J6422
13679a6279k4520j5156l792R838p341j3738K5229J2677P038K713j0448j1831m687
13666e0297j3673K2789N735J238Q193k715p327j8111J175K667K1290J6378J5901
13653C243l68j0879k7707k2973N627Q680M183O498Q862j0681N694J6293p162k0770
13639d1460j57K7781Q471r092n287P701P976j0999l68j4281k870q50R549R326
13625a4560n92p015l903r329N144Q533J645j8683J1941R193j6783l1395J1200
$$ plain form
13612 -54604 -36721 -35200 -53179 -52605 -41391 -52750 -45114 -26202 -18819 -21138 -23064 -30460 -30633 -21392
13598 -21392 -15707 -30722 -36531 -56823 -58970 -40785 -37801 -39272 -49225 -50789 -46967 -28951 -35708
13585 -35708 -42855 -47666 -46324 -53582 -67712 -50525 -35113 -23732 -39069 -41374 -40294 -42360 -51715
13572 -51715 -44727 -41634 -39839 -46945 -33586 -29192 -46865 -55061 -24376 -24471 -41564 -56550 -50548 -51452
13558 -51452 -38709 -34858 -41907 -44403 -45575 -30195 -46355 -52099 -41571 -37203 -39074 -47111 -40918
13545 -40918 -22842 -16649 -5782 -16672 -2287 -15776 -40716 -30682 -19757 -12143 -7128 -37474
13533 -37474 -42701 -62947 -56264 -31001 -13533 -8383 -7369 -39212 -49617 -37730 -10955 13693
13521 13693 41487 58104 73123 145367 226880 301385 388838 490475 610730 745119 859505
$$ packed form
13612e4604J7883J521j7979N74J1214j1359P636J8912P383k319j926p396j73R241
13598b1392N685j5015n809k0292k147J8185K984j471r953j564L822J8016o757
13585c5708p147m811J342p258j4130J7187J5412J1381j5337k305J080k066r355
13572e1715O988L093J795p106J3359M394j7673q196L0685r5j7093j4986O002r04
13558e1452J2743L851p049k496j172J5380j6160n744J0528M368j871q037O193
13545d0918J8076O193J0867j0890J4385j3489k4940J0034J0925P614N015l0346
13533c7474n227k0246O683K5263J7468N150J014l1843j0405J1887K6775K4648
13521A3693K7794J6617J5019P2244Q1513P4505Q7453J01637J20255J34389J14386
$$ plain form
13510 859505 912996 941907 925740 860277 784948 680010 564399 461128 353362 291114 234597
13499 234597 183843 143108 124642 107570 88195 75280 79534 77901 77590 93110 82088 67566
13487 67566 53441 40837 42628 58110 53411 35790 32202 40523 33126 13384 2459 2165 12657
13474 12657 16810 15290 -778 -87 14440 27207 27891 37375 43430 33751 8278 5439 5799 10253
13460 10253 10795 -5792 -12063 7312 7901 -7815 -8896 -22177 -20482 -25098 -44891 -60225 -46609
13447 -46609 -40308 -37437 -53141 -59271 -33745 7047 -337 -17450 -17588 -12746 -8818 -12417 -34655
13434 -34655 -42620 -32854 -15285 -14503 -10039 -4472 810 10242 7623 -140 1413 19352 17602 4288
13420 4288 9636 -6574 -28053 -26000 -5256 -1695 -26601 -59127 -60747 -35019 -24988 -6249 -16722
$$ packed form
13510H59505N3491K8911j6167o5463p5329j04938j15611j03271j07766o2248n6517
13499B34597n0754m0735j8466j7072j9375j2915M254j633l11J5520j1022j4522
13487F7566j4125j2604J791J5482m699j7621l588Q321p397j9742j0925k94J0492
13474A2657M153j520j6068O91J4527J2767O84R484O055r679k5473k839L60M454
13460A0253N42j6587o271J9375N89j5716j081j3281J695m616j9793j5334J3616
13447d6609O301K871j5704o130K5526M0792p384j7113j38M842L928l599k2238
13434c4655p965R766J7569P82M464N567N282R432k619p763J553J7939j750j3314
13420D288N348j6210k1479K053K0744L561k4906l2526j620K5728J0031J8739j0473
$$ plain form
13407 -16722 -38695 -44050 -45373 -31506 -30962 -26607 -25487 -2126 9522 -2056 -28712 -26144 -44040
13394 -44040 -55140 -43324 -38570 -48829 -35437 -36078 -33131 -32593 -33711 -41419 -30897 -8897 -3935
13381 -3935 -11216 2233 27870 14435 -1682 -34685 -64603 -66599 -51568 -47120 -48913 -27330 -29601
13368 -29601 -38208 -29124 -19585 -29597 -50640 -56845 -47106 -34632 -2247 8720 -25690 -33505 -4273
13355 -4273 23633 27833 43178 63294 69603 60727 89028 136964 196500 295092 417052 586647
13343 586647 838073 1150207 1536473 2018743 2540405 3055690 3538516 3888347 4068397 4098857
13333 4098857 3945823 3598463 3166481 2699849 2245551 1834425 1499916 1229248 1000521
13324 1000521 844425 751635 685966 628007 566687 517109 476943 463368 442062 418839 397187
$$ packed form
13407a6722k1973n355j323J3867N44M355J120K3361J1648j1578k6656K568j7896
13394d4040j1100J1816M754j0259J3392o41K947N38j118p708J0522K2000M962
13381c935p281J3449K5637j3435j6117l3003k9918j996J5031M448j793K1583k271
13368b9601q607R084R539j0012k1043o205R739J2474L2385J0967l4410p815K9232
13355d273K7906M200J5345K0116O309q876K8301M7936N9536R8592J21960J69595
13343E86647K51426L12134L86266M82270N21662N15285M82826L49831J80050L0460
13333D098857j53034l47360m31982m66632m54298m11126l34509k70668k28727
13324A000521j56096r2790o5669n7959o1320m9578m0166j3575k1306k3223k1652
$$ plain form
13313 397187 387341 378014 377377 368587 362558 361085 352260 350285 338147 328810 328385 313249 305221 298598
13299 298598 281074 243036 208152 191310 189948 177797 172137 158532 162232 156285 163909 163402 163257
13286 163257 155651 141992 129689 128794 114931 103007 109092 109944 94614 86444 99095 116243 112633
13273 112633 104056 112067 115841 79504 65372 74751 63510 59961 51828 54378 61637 75387 85278
13260 85278 93641 93099 113918 135591 162788 183239 179255 164222 136409 119781 100135 76964
13248 76964 44179 53452 50258 61155 65646 70167 72499 84439 71460 48547 18435 19725 -1499
13235 -1499 -2218 7042 13989 33389 37087 45045 64894 50804 30304 39056 55496 51014 56009 80423
13221 80423 98818 147065 214893 318047 443678 619284 815887 1008180 1167981 1278861
$$ packed form
13313C97187r846r327o37q790o029j473q825j975j2138r337m25j5136q028o623
13299B98598j7524l8038l4884j6842j362j2151n660j3605L700n947P624n07j45
13286A63257p606j3659j2303q95j3863j1924O085Q52j5330q170J2651J7148l610
13273A12633q577Q011L774l6337j4132R379j1241l549q133K550P259J3750R891
13260H5278Q363n42K0819K1673K7197K0451l984j5033k7813j6628j9646k3171
13248G6964l2785R273l194J0897M491M521K332J1940j2979k2913l0112J290k1224
13235a499p19R260O947J9400L698P958J9849j4090k0500Q752J6440m482M995K4414
13221H0423J8395M8247O7828J03154J25631J75606J96603J92293J59801J10880
$$ plain form
13211 1278861 1314660 1260941 1113284 897715 717787 573159 456198 385304 325378 247094
13201 247094 213809 203627 181273 181950 188595 169625 136245 124555 150851 150856 131441 134110 112338
13188 112338 87973 69273 75810 72434 76667 80277 64154 43648 25531 13940 7298 2624 7893
13175 7893 10960 14697 -4428 -5718 15711 31199 47644 37156 12701 -5369 -6994 -11973 -21682
13162 -21682 -11154 8805 12003 9213 13199 15275 18787 2401 -17873 -14905 809 -125 -3286
13149 -3286 -3189 -6535 -3121 14546 12484 8965 4289 18033 27879 16895 -6478 -17268 -13993 -10224
13135 -10224 -2970 2170 19091 9133 2877 8926 18925 5516 -28409 -38219 -21304 -7883 20133
13122 20133 22094 19504 9935 13255 40729 56972 107611 169082 233941 291561 357261 460114
$$ packed form
13211A278861L5799n3719j47657k15569j79928j44628j16961p0894n9926p8284
13201B47094l3285j0182k2354O77O645j8970l3380j1690K6296Nj9415K669k1772
13188A12338k4365j8700O537l376M233L610j6123k0506j8117j1591o642m674N269
13175G893L067L737j9125j290K1429J5488J6445j0488k4455j8070j625m979r709
13162b1682J0528J9959L198k790L986K076L512j6386k0274K968J5714r34l161
13149c286R7l346L414J7667k062l519m676J3744R846j0984k3373j0790L275L769
13135a0224P254N140J6921r958o256O049R999j3409l3925r810J6915J3421K8016
13122B0133J961k590r569L320K7474J6243N0639O1471O4859N7620O5700J02853
$$ plain form
13110 460114 573050 685590 788217 873391 926081 942618 916511 848165 751572 644922 529257
13099 529257 432718 364118 306620 257425 212682 176796 143398 139631 124478 106435 96872 97793
13087 97793 94566 82407 75721 66336 45778 42786 59359 58985 51063 33499 26336 36216 36209 16316
13073 16316 6918 15882 21727 11366 2908 4875 25889 16631 -5741 -10970 -23689 -14330 -16001
13060 -16001 -10291 -16554 -25544 -19491 -23946 -27369 -24466 -34779 -41169 -46273 -38702 -35112 -41957 -47308
13046 -47308 -44997 -21722 -23320 -22553 -26971 -37233 -33699 -37078 -43214 -35765 -41658 -58177 -58265 -46549
13032 -46549 -49726 -54553 -51773 -45471 -30485 -39743 -51523 -37682 -27503 -30707 -30176 -31776 -44169
13019 -44169 -46182 -31732 -17524 -12554 -29526 -37352 -34316 -32550 -33487 -42469 -43016 -40418 -55046 -53215
$$ packed form
13110D60114J12936J12540J02627Q5174N2690J6537k6107o8346r6593j06650j15665
13099E29257r6539o8600n7498m9195m4743l5886l3398l767j5153j8043r563R21
13087I7793l227j2159o686r385k0558k992J6573l74p922j7564p163R880pj9893
13073A6316r398Q964N845j0361q458J967K1014r258k2372n229j2719R359j671
13060a6001N710o263q990O053m455l423K903j0313o390n104P571L590o845n351
13046d7308K311K3275j598P67m418j0262L534l379o136P449n893j6519q8J1716
13032d6549l177m827K780O302J4986r258j1780J3841J0179l204N31j600j2393
13019d4169k013J4450J4208M970j6972p826L036J766r37q982n47K598j4628J831
$$ plain form
13005 -53215 -41502 -49323 -40798 -48534 -55078 -68347 -64221 -75554 -77819 -71130 -70568 -90873 -97659 -101371
12991 -101371 -110830 -104998 -108025 -113593 -96966 -90639 -85681 -67435 -97330 -88821 -49246 -40197 -38878
12978 -38878 -49817 -53109 -37929 -34292 -34349 -49906 -43786 -24032 -23149 -33634 -29947 -40691 -37645 -11838
12964 -11838 2551 21822 40961 80219 149468 230492 334466 527032 809456 1134751 1491606
12953 1491606 1822466 2055183 2171354 2127472 1930582 1604349 1258773 963499 714550 546219
12943 546219 455641 385197 315851 272278 238075 211931 175341 136546 120962 118222 98158 93337
12931 93337 107345 111594 92155 86852 85626 78384 62452 53440 36680 30335 16485 22712 37835
12918 37835 25113 5671 5156 29046 36447 24296 -138 -6164 12589 -9864 -33537 -47321
$$ packed form
13005e3215J1713p821Q525p736o544j3269M126j1333k265O689N62k0305o786l712
12991a01371r459N832l027n568J6627O327M958J8246k9895Q509L9575R049J319
12978c8878j0939l292J5180L637n7j5557O120J9754Q83j0485L687j0744L046K5807
12964a1838J4389J9271J9139L9258O9249Q1024J03974J92566K82424L25295L56855
12953A491606L30860K32717J16171m3882j96890l26233l45576k95274k48949j68331
12943E46219r0578p0444o9346m3573l4203k6144l6590l8795j5584k740k0064m821
12931I3337J4008M249j9439n303j226p242j5932r012j6760o345j3850O227J5123
12918C7835j2722j9442n15K3890P401j2151k4434o026J8753k2453k3673j3784
$$ plain form
12906 -47321 -59208 -56979 -42110 -39588 -32597 -35497 -35149 -27227 -23572 -35996 -47903 -49362 -49646 -46813
12892 -46813 -57393 -65892 -68546 -63396 -49149 -46618 -53488 -44676 -40171 -35406 -22662 -36851 -30235
12879 -30235 -42731 -56483 -57249 -59348 -59566 -52850 -46213 -59040 -72285 -69577 -55494 -55237 -71814 -72315
12865 -72315 -77617 -65544 -76658 -90812 -101753 -108784 -106575 -98495 -98979 -96074 -91430 -66122 -74616
12852 -74616 -90983 -104542 -85975 -72920 -62667 -80314 -70290 -72809 -74517 -90417 -88728 -92881
12840 -92881 -114826 -118922 -123281 -137757 -150957 -145555 -140381 -146315 -143841 -142294 -142792 -156355 -158091 -143866
12826 -143866 -136066 -143653 -120114 -103367 -109217 -117006 -111553 -106096 -108924 -99307 -100342 -111651 -121152
12813 -121152 -121751 -123753 -133133 -132208 -120070 -111374 -130342 -131601 -130648 -134044 -122566 -134111 -141948 -116682
$$ packed form
12906d7321j1887K229J4869K522O991k900L48P922L655j2424j1907j459k84K833
12892d6813j0580q499k654N150J4247K531o870Q812M505M765J2744j4189O616
12879c0235j2496j3752p66k099k18O716O637j2827j3245K708J4083K57j6577n01
12865g2315n302J2073j1114j4154j0941p031K209Q080m84K905M644K5308q494
12852g4616j6367j3559J8567J3055J0253j7647J0024k519j708j5900J689m153
12840i2881k1945m096m359j4476j3200N402N174n934K474J547m98j3563j736J4225
12826a43866P800p587K3539J6747n850p789N453N457k828R617j035j1309r501
12813a21152n99k002r380R25J2138Q696j8968j259R53l396J1478j1545p837K5266
$$ plain form
12799 -116682 -129404 -144471 -140977 -131328 -126932 -119917 -107653 -87896 -89088 -94830 -97218 -89377 -80256
12786 -80256 -62775 -66355 -63205 -52996 -50408 -46196 -42492 -47819 -62775 -52402 -24794 -5997 2797
12773 2797 12594 31722 38255 67016 101584 118440 120792 134934 148640 134720 102547 80972
12761 80972 54276 32191 16182 6297 -3527 -31932 -46042 -58399 -90607 -101273 -108772 -103987
12749 -103987 -94252 -102581 -112509 -121995 -159287 -172450 -160976 -152400 -145594 -153331 -147343 -151759 -165414
12736 -165414 -172299 -170911 -183290 -196966 -206596 -190141 -179783 -188717 -190286 -197176 -203076 -179407 -166523
12723 -166523 -183879 -204403 -235727 -239866 -243028 -256835 -258121 -262887 -253849 -249407 -263526 -264065 -269601
12710 -269601 -269006 -307325 -334439 -360847 -388052 -396412 -414027 -395097 -336956 -293236 -260894 -237204
$$ packed form
12799a16682j2722j5067L494R649M396P015J2264J9757j192n742k388P841R121
12786h0256J7481l580L150J0209K588M212L704n327j4956J0373K7608J8797Q794
12773B797R797J9128O533K8761L4568J6856K352J4142J3706j3920l2173k1575
12761H0972k6696k2085j6009r885r824k8405j4110j2357l2208j0666p499M785
12749a03987R735q329r928r486l7292j3163J1474Q576O806p737N988m416j3655
12736a65414o885J388j2379j3676r630J6455J0358q934j569o890n900K3669J2884
12723a66523j7356k0524l1324m139l162j3807j286m766R038M442j4119n39n536
12710b69601N95l8319k7114k6408k7205q360j7615J8930N8141M3720L2342K3690
$$ plain form
12698 -237204 -238856 -243034 -265811 -295089 -339005 -354654 -363571 -389338 -377461 -374592 -372298 -368243 -375686
12685 -375686 -353815 -332636 -321355 -331906 -350047 -342827 -337910 -333085 -301610 -279646 -277238 -302496
12673 -302496 -310796 -301231 -302046 -329649 -356017 -379799 -419728 -452232 -469695 -495119 -511413 -517988
12661 -517988 -491036 -476737 -459315 -437038 -440068 -437719 -457188 -462268 -467267 -463724 -477161 -483530 -495603
12648 -495603 -492999 -507520 -530906 -561049 -594623 -605136 -593910 -565779 -518209 -428519 -292595
12637 -292595 -157583 -57359 -7564 -6459 -44467 -89741 -101023 -104831 -113905 -126017 -122598 -136343
12625 -136343 -133107 -117830 -109559 -109125 -104738 -109327 -117230 -117313 -134035 -163775 -188198 -202139 -209752 -235414
12611 -235414 -256503 -241007 -235207 -226942 -212056 -219271 -225751 -197200 -195625 -205561 -182753 -171179 -152261
$$ packed form
12698b37204j652m178k2777k9278m3916j5649q917k5767J1877K869K294M055p443
12685c75686K1871K1179J1281j0551j8141P220M917M825L1475K1964K408k5258
12673c02496q300R565q15k7603k6368k3782l9929l2504j7463k5424j6294o575
12661e17988K6952J4299J7422K2277l030K349j9469n080m999L543j3437o369j2073
12648d95603K604j4521k3386l0143l3574j0513J1226K8131M7570Q9690J35924
12637b92595J35012J00224M9795J105l8008m5274j1282l808r074j2112L419j3745
12625a36343L236J5277Q271M34M387m589p903q3j6722k9740k4423j3941p613k5662
12611b35414k1089J5496N800Q265J4886p215o480K8551J575r936K2808J1574J8918
$$ plain form
12598 -152261 -163311 -171985 -169296 -152925 -140072 -134610 -126864 -120848 -117790 -96605 -100801 -97248 -96021
12585 -96021 -120170 -121404 -121373 -135319 -163390 -181593 -195186 -201069 -197540 -182392 -199411 -223989 -241979
12572 -241979 -245378 -231556 -207271 -174766 -154157 -150172 -151215 -175424 -202905 -192533 -194049 -164563
12560 -164563 -107067 -1013 105033 187002 280513 348122 400814 453034 491473 539500 592630
12549 592630 669894 728969 780833 843731 915991 1014911 1158229 1379111 1633591 1956308 2334619
12538 2334619 2730960 3211742 3770329 4417494 5174818 6055012 7038753 8127567 9358287
12529 9358287 10744672 12351308 14312058 16804635 20135438 24755127 31301824 41019695
12521 41019695 55937042 79123141 114100936 162820911 223509757 289597713 351362048
$$ packed form
12598a52261j1050q674K689J6371J2853N462P746O016L058K1185m196L553J227
12585i6021k4149j234L1j3946k8071j8203j3593n883L529J5148j7019k4578j7990
12572b41979l399J3822K4285L2505K0609L985j043k4209k7481J0372j516K9486
12560a64563N7496J06054J06046Q1969R3511O7609N2692N2220L8439M8027N3130
12549E92630P7264N9075N1864O2898P2260R8920J43318K20882K54480L22717L78311
12538B334619L96341M80782N58587O47165P57324Q80194R83741J088814J230720
12529I358287J386385J606636J960750K492577L330803M619689O546697R717871
12521D1019695J4917347K3186099L4977795M8719975O0688846O6087956O1764335
$$ plain form
12514 351362048 398943414 423961017 420554983 388046140 332634497 266783919 204725541
12507 204725541 155758297 121602539 98963644 83669774 72735820 64477601 58097668
12500 58097668 53123985 49202475 46057648 43510057 41386645 39511859 37807486 36200633
12492 36200633 34636789 33118336 31679905 30318884 29022120 27776426 26577754 25421608
12484 25421608 24348010 23335193 22371294 21449936 20560280 19727764 18944997 18206307 17500654
12475 17500654 16855816 16277637 15721485 15183922 14664882 14179404 13725124 13278281 12861935
12466 12861935 12461435 12044862 11643146 11260337 10888509 10545902 10212761 9891443 9601919
12457 9601919 9321220 9063249 8817576 8576915 8348367 8099658 7844287 7611889 7378754
$$ packed form
12514C51362048M7581366K5017603l406034l2508843n5411643o5850578o2058378
12507B04725541m8967244l4155758k2638895j5293870j0933954q258219o379933
12500E8097668m973683l921510l144827k547591k123412j874786j704373j606853
12492C6200633j563844j518453j438431j361021j296764j245694j198672j156146
12484B5421608j073598j012817r63899r21358q89656q32516p82767p38690p05653
12475A7500654o44838n78179n56152n37563n19040m85478m54280m46843m16346
12466A2861935m00500m16573m01716l82809l71828l42607l33141l21318k89524
12457I601919k80699k57971k45673k40661k28548k48709k55371k32398k33135
$$ plain form
12448 7378754 7147844 6949936 6768333 6595541 6417715 6253329 6076686 5910633 5777334
12439 5777334 5649158 5516374 5375367 5250269 5145269 5048851 4966590 4862746 4745779 4632288
12429 4632288 4538275 4434281 4326537 4220047 4129491 4060201 3974646 3899913 3842555 3747984 3678468
12418 3678468 3613880 3556159 3495281 3430877 3400205 3373105 3317836 3263876 3180087 3063558 2953221
12407 2953221 2833018 2716411 2595820 2486829 2384018 2290016 2201225 2133066 2054945 1972925
12397 1972925 1886646 1823609 1748401 1678026 1654562 1661909 1687834 1716425 1737798 1756006 1737320
12386 1737320 1689920 1639641 1614923 1589236 1542992 1496704 1419864 1336614 1293830 1249495 1205380
12375 1205380 1184579 1167649 1159756 1177268 1175974 1177911 1183100 1186249 1195173 1194358 1180487 1184232 1223114
$$ packed form
12448G378754k30910j97908j81603j72792j77826j64386j76643j66053j33299
12439E777334j28176j32784j41007j25098j05000r6418q2261j03844j16967j13491
12429D632288r4013j03994j07744j06490r0556o9290q5555p4733n7358r4571o9516
12418C678468o4588n7721o0878o4404l0672k7100n5269n3960q3789j16529j10337
12407B953221j20203j16607j20591j08991j02811r4002q8791o8159p8121q2020
12397A972925q6279o3037p5208p0375k3464P347K5925K8591K1373J8208j8686
12386A737320m7400n0279k4718k5687m6244m6288p6840q3250m2784m4335m4115
12375A205380k0801j6930p893J7512j294J937N189L149Q924q15j3871L745L8882
$$ plain form
12362 1223114 1220850 1194232 1167903 1145888 1109957 1058835 1018440 994947 964104 931043 916686
12351 916686 924350 933174 943813 957431 955485 963827 974748 944199 940268 929393 949012 966661
12339 966661 955851 963433 975193 992962 972982 959682 947729 933513 905282 852854 809609 795491
12327 795491 792237 805981 858589 918276 973643 982790 991694 951983 903949 873669 846840 841864
12315 841864 826152 823523 820578 812626 790182 785292 790204 779887 778805 773723 770756 763824 725101
12302 725101 704882 690334 675877 662004 672792 684863 694322 691968 670148 662583 665955 672260
12290 672260 683695 672710 655887 648602 682340 701479 689778 687684 674389 648135 651701 675230
12278 675230 660925 649844 656671 653793 630411 604175 582464 572715 571552 556593 553143 533527
$$ packed form
12362A223114k264k6618k6329k2015l5931n1122m0395k3493l0843l3061j4357
12351I16686P664Q824J0639J3618j946Q342J0921l0549l931j0875J9619J7649
12339I66661j0810P582J1760J7769j9980j3300j1953j4216k8231n2428m3245j4118
12327G95491l254J3744N2608N9687N5367R147Q904l9711m8034l0280k6829m976
12315H41864j5712k629k945p952k2444m890M912j0317j082n082k967o932l8723
12302G25101k0219j4548j4457j3873J0788J2071R459k354k1820p565L372O305
12290F72260J1435j0985j6823p285L3738J9139j1701k094j3295k6254L566K3529
12278F75230j4305j1081O827k878k3382k6236k1711r749j163j4959l450j9616
$$ plain form
12266 533527 511323 505383 519873 535136 515421 493798 497262 509122 487066 451192 432848 432983
12254 432983 433143 429016 435423 419380 398763 383000 362484 359795 354358 353371 348897 341506 338760 344591
12240 344591 337040 326643 316223 327235 330113 341201 341850 332801 343270 328786 318586 341096
12228 341096 334283 333837 356796 367530 347800 337231 340611 335546 334567 333955 326549 327480 335727 342815
12214 342815 333313 315669 304702 308137 313908 304127 287578 285416 288584 294315 284092 291651 307029
12201 307029 310480 294231 290545 296536 308058 307113 293013 292492 319749 336535 353566 345912 325350
12188 325350 303685 285488 293173 299394 306951 309245 312756 316025 306178 302043 295571 325495 320360
12175 320360 309632 306461 279840 271279 282326 284324 267437 283537 287655 310486 306593 282058
$$ packed form
12266E33527k2204n940J4490J5263j9715k1623L464J1860k2056l5874j8344J35
12254D32983J60m127O407j6043k0617j5763k0516k689n437r87m474p391k746N831
12240C44591p551j0397j0420J1012K878J1088O49r049J0469j4484j0200K2510
12228C41096o813m46K2959J0734j9730j0569L380n065r79o12p406R31Q247P088
12214C42815r502j7644j0967L435N771r781j6549k162L168N731j0223P559J5378
12201C07029L451j6249l686N991J1522r45j4100n21K7257J6786J7031p654k0562
12188C25350k1665j8197P685O221P557K294L511L269r847m135o472K9924n135
12175C20360j0728l171k6621q561J1047J998j6887J6100M118K2831l893k4535
$$ plain form
12163 282058 262046 252341 260464 254057 251433 260515 258401 258596 270320 285149 279677 270602 254335
12150 254335 241302 248827 259473 264487 258540 254003 257729 251762 241703 249983 269205 286082 282115
12137 282115 277349 304505 301973 287946 276265 246074 244806 258827 250116 246923 250917 245777 258930
12124 258930 289837 273718 266110 277716 282029 272276 263067 271880 264229 255491 249539 240345 229690
12111 229690 220490 212935 202873 213963 230208 246528 256479 275807 279205 260510 243644 253246
12099 253246 268395 261542 253022 243246 235574 237616 234803 239430 238249 228611 218110 226482 241160
12086 241160 242675 243281 255430 282217 306006 335116 348870 374029 405751 455658 537349 653578
12074 653578 828547 1082531 1392519 1738183 2076672 2344541 2485636 2483467 2334963 2034397
$$ packed form
12163B82058k0012r705Q123o407k624R082k114J95J1724J4829n472r075j6267
12150B54335j3033P525J0646N014n947m537L726n967j0059Q280J9222J6877l967
12137B82115m766K7156k532j4027j1681l0191j268J4021q711l193L994n140J3153
12124B58930L0907j6119p608J1606M313r753r209Q813p651q738n952r194j0655
12111B29690r200p555j0062J1090J6245J6320R951J9328L398j8695j6866R602
12099B53246J5149o853q520r776p672K042k813M627j181r638j0501Q372J4678
12086B41160J515O06J2149K6787K3789K9110J3754K5159L1722M9907Q1691J16229
12074F53578J74969K53984L09988L45664L38489K67869J41095k169j48504l00566
$$ plain form
12064 2034397 1663688 1307978 1048991 873238 733612 644189 566980 526571 498215 454098
12054 454098 437098 432000 431040 424042 430036 422475 416570 404763 395282 387833 389838 382218 370875 356185
12040 356185 356010 354137 347310 343165 334327 323217 319739 310860 323378 319534 305322 300293 304208 293328
12026 293328 286431 263662 276779 299537 306111 287815 278028 268969 268087 249415 256951 268245 262638
12013 262638 261266 261234 245489 239265 235871 242021 264071 244915 238036 238500 239634 247937 240567 217963
11999 217963 219509 219889 225956 233843 223753 217150 217451 205497 205026 206178 204219 206130 218376 228870
11985 228870 209512 195862 195717 215349 236215 236252 218604 217489 219276 215171 205631 188305 203424
11972 203424 229159 230829 221182 214384 223978 227778 226374 231398 222955 216106 225777 231650 235632 221165
$$ packed form
12064B034397l70709l55710k58987j75753j39626q9423p7209m0409k8356m4117
12054D54098j7000n098r60o998N994p561n905j1807r481p449K005p620j1343j4690
12040C56185j75j873o827m145q838j1110l478q879J2518l844j4212n029L915j0880
12026B93328o897k2769J3117K2758O574j8296r787r059q82j8672P536J1294n607
12013B62638j372l2j5745o224l394O150K2050j9156o879M64J134Q303p370k2604
11999B17963J546L80O067P887j0090o603L01j1954m71J152j959J911J2246J0494
11985B28870j9358j3650j45J9632K0866L7j7648j115J787m105r540j7326J5119
11972B03424K5735J670r647o798R594L800j404N024q443o849R671N873L982j4467
$$ plain form
11958 221165 198500 197741 203110 191993 186105 187024 189141 190651 186909 178078 177939 195607 208903 220464
11944 220464 211193 200438 189577 192408 189725 194510 210545 230735 218878 192710 205176 191048
11932 191048 183199 185306 186940 180239 181953 184575 173638 175288 176712 176054 182082 171542 168181 177366
11918 177366 171206 175590 170259 173342 169573 172845 173001 175655 191893 178326 173920 186022 191188 192080
11904 192080 190797 181371 179696 207762 211354 187212 171508 169188 169299 171379 175783 185094 187364 188092
11890 188092 195580 193248 186102 171249 158655 170169 182354 174910 169429 173476 186803 186368 175262
11877 175262 184432 173509 164648 171331 188907 190568 185735 186262 192209 196568 179289 195699 211455
11864 211455 219373 193853 159001 158263 169077 179117 189966 180378 154129 162060 157037 162439 172631
$$ packed form
11958B21165k2665p59N369j1117n888R19K117J510l742q831j39J7668J3296J1561
11944B20464r271j0755j0861K831k683M785J6035K0190j1857k6168J2466j4128
11932A91048p849K107J634o701J714K622j0937J650J424o58O028j0540l361R185
11918A77366o160M384n331L083l769L272J56K654J6238j3567m406J2102N166Q92
11904A92080j283r426j675K8066L592k4142j5704k320J11K080M404R311K270P28
11890A88092P488k332p146j4853j2594J1514J2185p444n481M047J3327m35j1106
11877A75262R170j0923q861O683J7576J661m833N27N947M359j7279J6410J5756
11864B11455P918k5520l4852p38J0814J0040J0849r588k6249P931n023N402J0192
$$ plain form
11851 172631 158550 155724 160872 181221 187719 160266 155251 145300 139106 150709 163764 172442 163493
11838 163493 173915 176004 180083 185961 188295 174615 177005 177366 169722 179386 166561 157889 185974
11825 185974 196417 178097 158548 168861 162789 160550 159354 170041 159621 165563 147263 134045
11813 134045 154368 146005 149455 151971 146518 155321 156203 153493 157447 164584 165331 150179 136228 161624
11799 161624 164896 166518 193750 194376 175923 171389 161895 158958 165672 164184 155592 159855 166759 175627
11785 175627 193465 206448 193606 178356 180139 178669 165257 175544 168899 151461 157442 173180
11773 173180 167876 160942 159441 161090 151574 146363 162142 157659 133679 123221 124261 133832 150693
11760 150693 151888 159185 155576 159133 157261 156383 157635 143608 137377 136177 149676 170475 173824 163632
$$ packed form
11851A72631j4081k826N148K0349O498k7453n015r951o194J1603J3055Q678q949
11838A63493J0422K089M079N878K334j3680K390L61p644R664j2825q672K8085
11825A85974J0443j8320j9549J0313o072k239j196J0687j0420N942j8300j3218
11813A34045K0323q363L450K516n453Q803Q82k710L954P137P47j5152j3951K5396
11799A61624L272J622K7232O26j8453m534r494k937O714j488q592M263O904Q868
11785A75627J7838J2983j2842j5250J783j470j3412J0287o645j7438N981J5738
11773A73180n304o934j501J649r516n211J5779m483k3980j0458J040R571J6861
11760A50693J195P297l609L557j872q78J252j4027o231j200J3499K0799L349j0192
$$ plain form
11746 163632 174989 180623 172356 177526 176716 167690 147615 139405 136208 134091 124702 114356 131644
11733 131644 149880 163198 165887 136374 111671 105972 130153 140917 133200 133698 155441 159845 152536
11720 152536 143267 149292 139839 128055 141242 146054 134595 142081 160139 150618 127191 113397 120519
11707 120519 120101 116634 130359 115632 112269 113529 125730 142028 153623 155426 132540 128313 132171
11694 132171 133068 141110 147843 137867 121712 121795 133579 135415 138471 132653 120917 122784 122364 141308
11680 141308 155758 140306 132008 117844 133339 128537 120447 132174 138930 132224 142373 132602 132422
11667 132422 147338 150804 168090 173935 160792 170705 172178 170897 166907 157075 147323 152704 159592
11654 159592 155913 150798 137139 134118 137778 129860 109412 114569 141778 142099 136341 147506 164125
$$ packed form
11746A63632J1357N634q267N170q10r026k0075q210l197k117r389j0346J7288
11733A31644J8236J3318K689k9513k4703n699K4181J0764p717M98K1743M404p309
11720A52536r269O025r453j1784J3187M812j1459P486J8058r521k3427j3794P122
11707A20519m18l467J3725j4727l363J260J2201J6298J1595J803k2886m227L858
11694A32171Q97Q042O733r976j6155Q3J1784J836L056n818j1736J867m20J8944
11680A41308J4450j5452q298j4164J5495m802q090J1727O756o706J0149r771j80
11667A32422J4916L466J7286N845j3143R913J473j281l990r832r752N381O888
11654A59592l679n115j3659l021L660p918k0448N157K7209L21n758J1165J6619
$$ plain form
11641 164125 149534 128781 138669 133107 137121 138327 134164 125886 120506 137982 153661 165772 148269
11628 148269 132977 135706 159514 164293 150637 143623 144555 131323 137583 143632 133742 131343 132065 136495
11614 136495 152026 156521 151009 135652 123103 131954 162697 198323 184481 149194 144619 143086
11602 143086 135472 115873 142592 162397 160225 158519 137067 137431 142065 117343 112448 117711 148663
11589 148663 153461 148116 145470 143664 137512 138743 146247 137427 130352 121010 132114 132743 143410 130787
11575 130787 118488 112130 101762 111251 120914 146954 153118 151883 162078 156878 140983 133248 144173
11562 144173 144945 140639 135551 138206 172335 162791 165800 145017 153371 153614 128317 131019 126969 122239
11548 122239 135108 154942 145261 134620 133146 149814 150851 152519 158416 161287 146296 132982 133072
$$ packed form
11641A64125j4591k0753R888n562M014J206m163q278n380J7476J5679J2111j7503
11628A48269j5292K729K3808M779j3656p014R32j3232O260O049r890k399P22M430
11614A36495J5531M495n512j5357j2549Q851L0743L5626j3842l5287m575j533
11602A43086p614j9599K6719J9805k172j706k1452L64M634k4722m895N263L0952
11589A48663M798n345k646j806o152J231P504q820p075r342J1104O29J0667j2623
11575A30787j2299o358j0368R489R663K6040O164j235J0195n200j5895p735J0925
11562A44173P72m306n088K655L4129r544L009k0783Q354K43k5297K702m050m730
11548A22239J2869J9834r681j0641j474J6668J037J668N897K871j4991j3314R0
$$ plain form
11535 133072 123529 113491 137558 150450 150475 144330 146404 152613 163680 145911 148325 147520 139878 131596
11521 131596 129002 151532 147299 141904 126400 130650 119797 106003 110940 120790 129748 122767 120778
11508 120778 123443 121407 132720 130937 125439 131155 129229 121110 119215 109372 98159 101951 95913 104579
11494 104579 102578 99649 105630 101465 100870 104408 110621 127290 108117 102341 122110 138153 150464
11481 150464 147512 140805 148522 155138 143794 137217 136869 124977 123336 136756 164060 167331 149928
11468 149928 138182 136131 149973 160916 135493 125603 136661 148356 144239 136231 116199 98888
11456 98888 101217 109767 112922 132323 128232 134636 151346 138191 120436 118723 121635 125321 131855
11443 131855 116102 104071 101930 124261 119354 113852 115548 118761 122747 123067 124667 128421 122614 131500
$$ packed form
11535A33072r543j0038K4067J2892K5o145K074O209J1067j7769K414q05p642q282
11521A31596k594K2530m233n395j5504M250j0853j3794M937R850Q958o981j989
11508A20778K665k036J1313j783n498N716j926q119j895r843j1213L792o038Q666
11494A04579k001k929N981m165n95L538O213J6669j9173n776J9769J6043J2311
11481A50464k952o707P717O616j1344o577l48j1892j641J3420K7304L271j7403
11468A49928j1746k051J3842J0943k5423r890J1058J1695m117q008k0032j7311
11456I8888K329Q550L155J9401m091O404J6710j3155j7755j713K912L686O534
11443A31855j5753j2031k141K2331m907n502J696L213L986L20J600L754n807Q886
$$ plain form
11429 131500 125816 115285 111768 123519 118975 127507 140034 136951 128297 144049 162963 142560 130587
11416 130587 127172 135112 141061 147729 144503 126435 113915 112781 126614 126944 112977 115312 142532
11403 142532 145673 125903 126677 129202 142544 151763 165466 168443 153375 136172 122199 121600 121586 121156
11389 121156 117125 120592 128452 131405 133181 146990 157030 162053 153965 140282 146585 148656 135022
11376 135022 131645 126938 106385 105694 120195 124380 119720 117077 132559 147060 165374 170727 170833
11363 170833 156083 142800 128351 125047 124312 121780 139573 147125 145314 162949 165852 149077 146807
11350 146807 147320 154093 131386 117952 138429 133578 112080 119561 132404 124929 109406 112936 118043
11337 118043 117257 126715 124695 99034 89822 95094 107923 113508 95661 105236 119324 123350 132592
$$ packed form
11429A31500n684j0531l517J1751m544Q532J2527l083q654J5752J8914k0403j1973
11416A30587l415P940N949O668l226j8068j2520j134J3833L30j3967K335K7220
11403A42532L141j9770P74K525J3342R219J3703K977j5068j7203j3973n99j4m30
11389A21156m031L467P860K953J776J3809J0040N023q088j3683O303K071j3634
11376A35022l377m707k0553o91J4501M185m660k643J5482J4501J8314N353J06
11363A70833j4750j3283j4449l304p35k532J7793P552j811J7635K903j6775k270
11350A46807N13O773k2707j3434K0477m851k1498P481J2843p475j5523L530N107
11337A18043p86R458k020k5661r212N272J2829N585j7847R575J4088M026R242
$$ plain form
11324 132592 128612 137386 150675 140612 138138 132975 127521 112304 116612 130411 140559 145460 156195
11311 156195 150916 157288 144920 125009 126783 112098 112537 120502 129148 126036 123873 123889 136148 137663
11297 137663 133524 116063 116959 116072 117345 119054 106185 110272 108168 129342 142525 145026 119482
11284 119482 110693 112351 112733 138494 145106 141015 155726 135866 122231 119520 130661 130209 137317
11271 137317 148751 153632 162739 172474 159877 152866 155828 140226 136051 139187 138437 133207 132003 144929
11257 144929 163047 175916 162426 142648 137978 131103 144204 153121 154628 144352 139041 141882 140312
11244 140312 143438 140342 122743 146828 159701 150637 146596 135135 138964 125831 136510 147024
11232 147024 165226 163939 148922 142942 136409 139953 146705 146692 137791 129439 136347 137388 127705 111038
$$ packed form
11324A32592l980Q774J3289j0063k474n163n454j5217M308J3799J0148M901J0735
11311A56195n279O372j2368j9911J774j4685M39P965Q646l112k163J6J2259J515
11297A37663m139j7461Q96q87J273J709j2869M087k104K1174J3183K501k5544
11284A19482q789J658L82K5761O612m091J4711j9860j3635k711J1141m52P108
11271A37317J1434M881R107R735j2597p011K962j5602m175L136p50n230j204J2926
11257A44929J8118J2869j3490j9778m670o875J3101Q917J507j0276n311K841j570
11244A40312L126l096j7599K4085J2873r064m041j1461L829j3133J0679J0514
11232A47024J8202j287j5017n980o533L544O752j3q901q352O908J041r683j6667
$$ plain form
11218 111038 134805 138784 135654 114961 113717 129251 143342 131273 115267 108244 101991 97606 86503
11205 86503 101138 123117 132468 139772 134902 120075 109318 110470 112870 107740 103045 101014 106832
11192 106832 130837 133786 135107 140117 135316 123318 129380 137499 141113 146778 139689 128557 118091
11179 118091 117197 134868 114975 115368 128197 141000 147846 134925 145155 140636 142373 149926 159249
11166 159249 142690 133382 129699 142962 145813 151359 145804 137372 133004 142573 151314 150363 143652 131669
11152 131669 125124 136867 127931 140226 141642 131977 136667 151113 138084 148108 154934 153568 144444
11139 144444 149451 159654 162709 149103 148481 148839 135847 134482 139609 141100 145524 128336 108781
11126 108781 101690 103213 123608 120113 122437 119850 116459 118575 144516 159416 143844 129713 128950
$$ packed form
11218A11038K3767L979l130k0693j244J5534J4091j2069j6006p023o253m385j1103
11205H6503J4635K1979R351P304m870j4827j0757J152K400n130m695k031N818
11192A06832K4005K949J321N010m801j1998O062Q119L614N665p089j1132j0466
11179A18091q94J7671j9893L93J2829J2803O846j2921J0230m519J737P553R323
11166A59249j6559r308l683J3263K851N546n555q432m368R569Q741r51o711j1983
11152A31669o545J1743q936J2295J416r665M690J4446j3029J0024O826j366r124
11139A44444N007J0203L055j3606o22L58j2992j365N127J491M424j7188j9555
11126A08781p091J523K0395l495K324k587l391K116K5941J4900j5572j4131p63
$$ plain form
11113 128950 134476 131815 114745 125326 148336 142360 141230 129538 119669 110067 125060 149021 158791
11100 158791 162185 133083 113954 112355 107302 102812 108385 93464 80203 106221 124789 122318 121297
11087 121297 134563 140962 132633 138144 147698 143091 117451 107510 111163 115139 113802 110206 132132
11074 132132 143905 155465 152914 148301 128405 136935 150951 155991 146506 146768 140023 138382 148612
11061 148612 132685 125030 118201 138031 153149 172891 188709 179212 176885 175843 180394 196604 186130
11048 186130 179204 177270 153306 152238 159531 176414 171044 151424 161896 156006 159591 156742 140832
11035 140832 134146 130665 133282 131139 136760 159712 174877 180340 178995 161059 152349 143380 146453
11022 146453 155313 174968 159829 154287 158973 164999 173174 170905 150924 158162 167822 179981 178388
$$ packed form
11113A28950N526k661j7070J0581K3010n976j130j1692r869r602J4993K3961R770
11100A58791L394k9102j9129j599n053m490N573j4921j3261K6018J8568k471j021
11087A21297J3266O399q329N511R554m607k5640r941L653L976j337l596K1926
11074A32132J1773J1560k551m613j9896Q530J4016N040r485K62o745j641J0230
11061A48612j5927p655o829J9830J5118J9742J5818r497k327j042M551J6210j0474
11048A86130o926j934k3964j068P293J6883n370j9620J0472n890L585k849j5910
11035A40832o686l481K617k143N621K2952J5165N463j345j7936q710q969L073
11022A46453Q860J9655j5139n542M686O026Q175k269j9981P238R660J2159j593
$$ plain form
11009 178388 165357 143990 117569 114463 145572 157696 153678 151152 144223 154558 155251 161458 157163
10996 157163 150267 159988 169188 180469 173886 193660 174622 146619 148573 148543 149765 139416 142481
10983 142481 158537 158248 140212 127516 122496 118887 135669 169497 188729 188445 182722 184350 175240
10970 175240 170688 173909 177721 179444 175510 184419 169331 161374 152620 160092 170658 168049 172982 173167
10956 173167 153788 145153 150830 160936 160640 162103 154637 148711 163385 187411 186151 184591 182698
10943 182698 184317 192033 190459 166091 145473 141876 147267 153177 144571 153353 170608 177300 179990
10930 179990 177659 176890 172339 167256 159694 157346 160478 150070 147636 146378 166614 190268 204167
10917 204167 193929 204259 192309 189541 193572 172518 184142 188974 191478 196749 200362 205174 199652
$$ packed form
11009A78388j3031k1367k6421l106L1109J2124m018k526o929J0335O93O207m295
10996A57163o896R721R200J1281o583J9774j9038k8003J954l0J222j0349L065
10983A42481J6056k89j8036j2696n020l609J6782L3828J9232k84n723J628r110
10970A75240m552L221L812J723l934Q909j5088p957q754P472J0566k609M933J85
10956A73167j9379q635N677J0106k96J463p466n926J4674K4026j260j560j893
10943A82698J619P716j574k4368k0618l597N391N910q606Q782J7255O692K690
10930A79990k331p69m551n083p562k348L132j0408k434j258K0236K3654J3899
10917B04167j0238J0330j1950k768M031k1054J1624M832K504N271L613M812n522
$$ plain form
10904 199652 194475 198739 204995 190402 207350 202977 195257 181530 190113 191558 184918 193264 199033
10891 199033 212563 217171 214276 199800 199072 200205 200789 202243 208370 197856 190318 189616 181365 176148
10877 176148 183348 188786 183914 166429 160239 175825 186415 180341 175451 164897 156431 154375 174666
10864 174666 185680 186651 178918 165826 172878 178709 162722 157501 163795 186416 211043 216458 209373
10851 209373 209855 201924 193869 198637 203008 195997 194692 187237 203094 212383 207358 185802 188165 195335
10837 195335 204777 218345 204812 193306 190897 194303 193210 200055 203317 199051 180666 174832 208766
10824 208766 197969 199296 189953 190601 191249 190877 183672 195845 226130 214747 221057 234588 232852 223947
10810 223947 224678 218154 211613 209588 206141 213801 225892 235841 225905 233448 242310 233513 219866 219244
$$ packed form
10904A99652n177M264O256j4593J6948m373p720j3727Q583J445o640Q346N769
10891A99033J3530M608k895j4476p28J133N84J454O127j0514p538p02q251n217
10877A76148P200N438m872j7485o190J5586J0590o074m890j0554q466k056K0291
10864A74666J1014R71p733j3092P052N831j5987n221O294K2621K4627N415p085
10851B09373M82p931q055M768M371p011j305p455J5857R289n025k1556K363P170
10837A95335R442J3568j3533j1506k409L406j093O845L262m266j8385n834L3934
10824B08766j0797J327r343O48O48l72p205J2173L0285j1383O310J3531j736q905
10810B23947P31o524o541k025l447P660J2091R949r936P543Q862q797j3647o22
$$ plain form
10796 219244 235840 234282 219498 230324 235766 220689 213098 223163 222223 215808 216974 192477 166734
10783 166734 185801 192525 203215 196049 175967 169833 184854 185387 191447 190487 181686 195331 207670
10770 207670 202124 208984 220460 206456 215396 223374 216907 206929 210920 228712 227562 217898 231733
10757 231733 245191 230715 212120 221750 219639 230639 235732 227442 218201 233843 243103 255125 243259
10744 243259 246676 252939 242191 225329 227953 217406 212754 199909 193729 200947 189522 189080 184908
10731 184908 182665 215749 222744 212793 215141 215046 205767 205831 235194 234966 217302 204675 188029 204950
10717 204950 220094 227190 225645 225656 217828 212051 201206 205302 212814 223801 238119 251790 255351
10704 255351 247160 252922 256869 261513 262387 268739 266557 271353 269876 279650 264497 246045 254740 256786
$$ packed form
10796B19244J6596j558j4784J0826N442j5077p591J0065r40o415J166k4497k5743
10783A66734J9067O724J0690p166k0082o134J5021N33O060r60q801J3645J2339
10770B07670n546O860J1476j4004Q940P978o467r978L991J7792j150r664J3835
10757B31733J3458j4476j8595R630k111J1000N093q290r241J5642R260J2022j1866
10744B43259L417O263j0748j6862K624j0547m652j2845o180P218j1425m42m172
10731A84908k243L3084O995r951K348r5r279O4K9363k28j7664j2627j6646J6921
10717B04950J5144P096j545J1p828n777j0845M096P512J0987J4318J3671L561
10704B55351q191N762L947M644Q74O352k182M796j477R774j5153j8452Q695K046
$$ plain form
10690 256786 244601 239627 232551 245403 256139 254074 245140 238888 216816 208957 208523 229028 274618
10677 274618 290637 307959 310881 307326 328118 339888 342401 352263 363326 373788 359647 351187
10665 351187 340366 306305 287782 274404 278504 274632 262872 251826 233048 233261 243347 257093
10653 257093 263832 258891 268396 279403 294409 291634 271540 267901 276771 263168 268050 262772 264541
10640 264541 290890 316011 299661 288960 292020 290799 295112 299870 294632 271959 268050 259301 264688
10627 264688 292173 303862 299204 278319 264432 270105 275128 288831 290216 289908 287956 289672 287660
10614 287660 307410 298666 286493 280817 320188 341353 365349 424370 479545 538756 635557 719769
10602 719769 820859 912560 1008109 1076452 1121279 1163507 1164273 1119747 1068401 1006325 937592 856222
$$ packed form
10690B56786j2185m974p076J2852J0736k065q934o252k2072p859m34K0505M5590
10677B74618J6019J7322K922l555K0792J1770K513R862J1063J0462j4141q460
10665C51187j0821l4061j8523j3378M100l872j1760j1046j8778K13J0086J3746
10653B57093O739m941R505J1007J5006k775k0094l639Q870j3603M882n278J769
10640B64541K6349K5121j6350j0701L060j221M313M758n238k2673l909q749N387
10627B64688K7485J1689m658k0885j3887N673N023J3703J385l08j952J716k012
10614B87660J9750q744j2173n676L9371K1165K3996N9021N5175N9211R6801Q4212
10602G19769J01090R1701R5549O8343M4827M2228P66m4526n1346o2076o8733q1370
$$ plain form
10590 856222 767219 685320 613845 549561 528998 512242 487777 494140 501851 486825 451196 449946
10578 449946 464227 471221 465491 446926 431007 444777 459118 463222 477680 510358 546253 621045
10566 621045 734273 852622 975685 1103226 1232877 1349201 1444216 1470627 1444360 1393131
10556 1393131 1305603 1174867 1050600 933474 822900 726112 636678 582785 541338 518405
10546 518405 497681 474655 480453 522118 540319 534386 513003 499122 517582 530915 536058 533420
10534 533420 538554 549705 559017 561651 580125 590368 607140 627496 675931 763168 892682 1079962
10522 1079962 1387067 1769689 2201816 2588879 2852641 2999778 2951285 2696249 2320540 1920613
10512 1920613 1575562 1324484 1183176 1114364 1101783 1158218 1237082 1339958 1518431 1754361
$$ packed form
10590H56222q9003q1899p1475o4284k0563j6756k4465O363P711j5026l5629j250
10578D49946J4281O994n730j8565j5919J3770J4341M104J4458L2678L5895P4792
10566F21045J13228J18349J23063J27541J29651J16324R5015K6411k6267n1229
10556A393131q7528j30736j24267j17126j10574r6788q9434n3893m1447k2933
10546E18405k0724k3026N798M1665J8201n933k1383j3881J8460J3333N143k638
10534E33420N134J1151R312K634J8474J0243J6772K0356M8435Q7237J29514J87280
10522A079962L07105L82622M32127L87063K63762J47137m8493k55036l75709l99927
10512A920613l45051k51078j41308o8812j2581N6435P8864J02876J78473K35930
$$ plain form
10502 1754361 2064647 2408835 2801225 3225637 3646830 4022080 4333481 4539259 4630465 4633779
10492 4633779 4528708 4318764 4052688 3775058 3467758 3167508 2881132 2603621 2339182
10483 2339182 2111288 1936184 1776184 1658766 1600671 1606816 1698711 1873364 2121202 2419103
10473 2419103 2725316 2989129 3167669 3207312 3077294 2818288 2465312 2070210 1741792 1490039
10463 1490039 1314112 1196371 1143529 1095152 1031173 990626 973351 965885 933761 899151 869113
10452 869113 846595 828173 799023 767278 758746 731808 700028 700545 706886 705109 669982 628344
10440 628344 618253 621280 639416 626118 596754 589065 565412 562475 550397 539223 554010 572344
10428 572344 574334 569715 548752 529980 501378 488433 489072 509230 509878 510360 509882 515299 522623 526351
$$ packed form
10502A754361L10286L44188L92390M24412M21193L75250L11401K05778R1206L314
10492D633779j05071k09944k66076k77630l07300l00250k86376k77511k64439
10483B339182k27894j75104j60000j17418n8095O145R1895J74653K47838K97901
10473B419103L06213K63813J78540L9643j30018k59006l52976l95102l28418k51753
10463A490039j75927j17741n2842m8377o3979m0547j7275p466l2124l4610l0038
10452H69113k2518j8422k9150l1745q532k6938l1780N17O341j777l5127m1638
10440F28344j0091L027J8136j3298k9364p689k3653k937j2078j1174J4787J8334
10428E72344J990m619k0963j8772k8602j2945O39K0158O48M82m78N417P324L728
$$ plain form
10414 526351 532972 519427 504588 493469 492429 505138 504870 485120 495033 497359 479948 453342 451290
10401 451290 452158 431656 436933 446480 441024 437818 444513 455548 471257 471549 463010 466794 454526 433671
10387 433671 444798 459522 439391 437625 458237 492922 516671 519977 503273 495481 517913 550325
10375 550325 566360 573106 605549 626334 626508 638060 669043 696531 705700 718089 727934 696830
10363 696830 683337 656746 635141 615609 600879 550260 534421 536192 553524 561930 580328 559445
10351 559445 551561 560266 571586 577955 577192 570396 550138 542438 551687 553007 539092 516719 526282
10338 526282 531787 528261 528208 544328 556742 580420 588403 598336 609142 648488 699796 718512 726428
10325 726428 739045 761375 774109 768836 756164 729866 678673 627286 577114 554636 530300 528167
$$ packed form
10414E26351O621j3545j4839j1119j040J2709k68j9750R913K326j7411k6606k052
10401D51290Q68k0502N277R547n456l206O695J1035J5709K92q539L784j2268k0855
10387D33671J1127J4724k0131j766K0612L4685K3749L306j6704p792K2432L2412
10375E50325J6035O746L2443K0785J74J1552L0983K7488R169J2389R845l1104
10363F96830j3493k6591k1605j9532j4730n0619j5839J771J7332Q406J8398k0883
10351E59445p884Q705J1320O369p63o796k0258p700R249J320j3915k2373R563
10338E26282N505l526n3J6120J2414K3678P983R933J0806L9346N1308J8716P916
10325G26428J2617K2330J2734n273j2672k6298n1193n1387n0172k2478k4336k133
$$ plain form
10313 528167 531121 551431 542874 513815 517277 507241 475288 425937 384939 366509 371486 410937
10301 410937 461991 511959 554629 569179 583171 570018 532510 491695 459017 449543 436093 437686
10289 437686 439501 439122 449179 483471 514273 526111 522773 527467 509452 501463 489767 486490 467644
10276 467644 493566 532390 540026 534334 534283 541212 552155 543073 522106 489893 434615 375256 337205
10263 337205 287205 272880 290569 326016 368003 404730 453839 499252 531825 557738 578110
10252 578110 542645 500247 454452 447917 434298 422643 440366 413755 368520 322410 306401 334900
10240 334900 401333 452526 485736 577534 737071 923567 1057140 1097315 1078264 1058428 1044952
10229 1044952 1021993 994328 993895 1014502 1030227 1035507 1005678 993486 992131 980339 967913 978550
$$ packed form
10313E28167K954K0310q557k9059L462j0036l1953m9351m0998j8430M977L9451
10301D10937N1054M9968M2670J4550J3992j3153l7508m0815l2678r474j3450J593
10289D37686J815l79J0057L4292L0802J1838l338M694j8015p989j1696l277j8846
10276D67644K5922L8824P636n692n1O929J0943r082k0967l2213n5278n9359l8051
10263C37205n0000j4325J7689L5447M1987L6727M9109M5413L2573K5913K0372
10252E78110l5465m2398m5795o535j3619j1655J7723k6611m5235m6110j6009K8499
10240C34900O6433N1193L3210R1798J59537J86496J33573M0175j9051j9836j3476
10229A044952k2959k7665m33K0607J5725N280k9829j2192j355j1792j2426J0637
$$ plain form
10217 978550 986825 992954 1015203 1028422 1015408 1021217 1023645 1023045 1036955 1039754 1073219 1106887 1113586
10204 1113586 1115228 1106031 1078810 1059980 1057899 1085444 1139524 1201807 1280733 1374861 1471341 1588209
10192 1588209 1721678 1823776 1892384 1933734 1949662 1963863 1970904 1972547 1963590 1973515 2013833 2044311
10180 2044311 2066853 2096746 2132597 2147103 2153276 2162722 2175480 2196734 2190347 2183105 2199726 2255577
10168 2255577 2298137 2367678 2462317 2530291 2560448 2590010 2618593 2654868 2737575 2872169 3022886
10157 3022886 3172541 3343389 3522070 3688235 3835995 3972174 4131337 4314029 4520572
10148 4520572 4753189 5048553 5398846 5829945 6351182 6929053 7541794 8193815 8830010
10139 8830010 9471928 10081552 10709072 11380509 12103077 12824957 13569912 14418233 15365479
$$ packed form
10217I78550Q275O129K2249J3219j3014N809K428o00J3910K799L3465L3668O699
10204A113586J642r197k7221j8830k081K7545N4080O2283P8926R4128R6480J16868
10192A588209J33469J02098O8608M1350J5928J4201P041J643q957R925M0318L0478
10180B044311K2542K9893L5851J4506O173R446J2758K1254o387p242J6621N5851
10168B255577M2560O9541R4639O7974L0157K9562K8583L6275Q2707J34594J50717
10157C022886J49655J70848J78681J66165J47760J36179J59163J82692K06543
10148D520572K32617K95364L50293M31099N21237N77871O12741O52021O36195
10139H830010O41918O09624O27520O71437P22568P21880P44955Q48321R47246
$$ plain form
10130 15365479 16417061 17629628 19180513 21160709 23557350 26347863 29550657 33417728
10122 33417728 38397985 45261788 55491434 71685008 97789143 138267567 195288779
10115 195288779 264947048 336048073 395023407 432757003 444046103 422939159 367695964
10108 367695964 290906703 215263140 157256440 119259365 95617867 80502546 70280460
10101 70280460 63010019 57684275 53651942 50494226 47992322 45984723 44447042 43385549
10093 43385549 42748411 42360995 42042819 41650454 41133136 40472553 39756361 39157203 38883741
10084 38883741 39172385 40091501 41713485 44108877 47438448 52158445 59173026 70030490
10076 70030490 87245669 114093074 153365042 205400479 266396257 328543772 382195144
$$ packed form
10130A5365479J051582J212567J550885J980196K396641K790513L202794L867071
10122C3417728M980257O863803J0229646J6193574K6104135M0478424N7021212
10115A95288779O9658269P1101025N8975334L7733596J1289100k1106944n5243195
10108C67695964p6789261p5643563n8006700l7997075k3641498j5115321j0222086
10101G0280460p270441n325744m032333l157716k501904k007599j537681j061493
10093D3385549o37138l87416l18176l92365n17318o60583p16192n99158k73462
10084C8883741K88644R19116J621984K395392L329571M719997P014581J0857464
10076G0030490J7215179K6847405L9271968N2035437O0995778O2147515N3651372
$$ plain form
10069 382195144 418193534 429407889 412302250 369023309 308295742 243025321 185387565
10062 185387565 141783650 112169286 92887130 80100443 71177000 64573794 59446777
10055 59446777 55286656 51812888 48867461 46377215 44298493 42549851 41010949 39588960
10047 39588960 38193813 36734725 35168268 33557173 31905175 30250356 28678516 27226819
10039 27226819 25932162 24780370 23736885 22774248 21910594 21127595 20425666 19777075 19152653
10030 19152653 18613558 18130831 17655702 17166131 16659575 16150304 15605172 15001461 14372350
10021 14372350 13762270 13196996 12669391 12199343 11748866 11347625 10970993 10622618 10316337
10012 10316337 10027849 9751479 9473681 9181062 8885467 8564592 8244942 7922080 7612060
$$ packed form
10069C82195144L5998390J1214355j7105639m3278941o0727567o5270421n7637756
10062A85387565m3603915k9614364j9282156j2786687q923443o603206n127017
10055E9446777m160121l473768k945427k490246k078722j748642j538902j421989
10047C9588960j395147j459088j566457j611095j651998j654819j571840j451697
10039B7226819j294657j151792j043485r62637q63654p82999p01929o48591o24422
10030A9152653n39095m82727m75129m89571n06556n09271n45132o03711o29111
10021A4372350o10080n65274n27605m70048m50477m01241l76632l48375l06281
10012A0316337k88488k76370k77798k92619k95595l20875l19650l22862l10020
$$ plain form
10003 7612060 7317224 7060617 6806903 6560453 6319185 6076640 5857836 5657060 5450305
9994 5450305 5252162 5078879 4935707 4841426 4803271 4765909 4722992 4642127 4523485 4403658
9984 4403658 4271835 4143589 4031383 3925242 3816453 3690890 3555851 3421056 3299582 3196486
9974 3196486 3105226 3043808 3000301 2967753 2944532 2902848 2857739 2810214 2772163 2732096 2666833
9963 2666833 2584291 2478604 2374644 2268116 2148669 2022883 1918473 1805811 1708121 1621293
9953 1621293 1537542 1469239 1408198 1363884 1325486 1323944 1349134 1402590 1458254 1484506 1484122 1459786
9941 1459786 1417198 1380174 1353729 1330190 1304155 1266024 1209626 1174785 1157638 1129641 1092398
9930 1092398 1056778 1013146 967535 927538 903994 896443 944211 1011811 1082379 1143452 1177502 1191500
$$ packed form
10003G612060k94836k56607k53714k46450k41268k42545k18804k00776k06755
9994E450305j98143j73283j43172r4281l8155l7362m2917q0865j18642j19827
9984D403658j31823j28246j12206j06141j08789j25563j35039j34795j21474j03096
9974C196486r1260o1418m3507l2548k3221m1684m5109m7525l8051m0067o5263
9963B666833q2542j05687j03960j06528j19447j25786j04410j12662r7690q6828
9953A621293q3751o8303o1041m4314l8398j542K5190N3456N5664K6252l84k4336
9941A459786m2588l7024k6445k3539k6035l8131n6398l4841j7147k7997l7243
9930A092398l5620m3632m5611l9997k3544p551M7768O7600P0568O1073L4050J3998
$$ plain form
9918 1191500 1147366 1098811 1038271 994808 971594 938881 896478 869948 865122 851311 832734 825925
9906 825925 814295 821964 835188 855999 852682 822666 793468 811518 824269 829684 844801 844313 871126
9893 871126 898116 917004 915372 916512 904967 883942 848823 824222 806241 782716 759403 771046
9881 771046 797031 847143 904547 932715 947658 938678 910317 892514 843416 797215 769689 755297
9869 755297 730948 732661 721995 714580 692293 686436 697014 687435 648918 626279 597053 557123
9857 557123 548001 534080 525409 523981 526744 533706 536009 539289 522333 496098 489460 482408 456015
9844 456015 452840 466428 456542 468740 468526 491207 504959 505505 490524 500081 509280 491619 477774
9831 477774 462811 443954 425710 427433 429951 425619 423650 415954 413282 402797 396568 384555 365543
$$ packed form
9918A191500m4134m8555o0540m3463k3214l2713m2403k6530m826j3811j8577o809
9906H25925j1630P669J3224K0811l317l0016k9198J8050J2751N415J5117m88K6813
9893H71126K6990J8888j632J140j1545k1025l5119k4601j7981k3525k3313J1643
9881G71046K5985N0112N7404K8168J4943q980k8361j7803m9098m6201k7526j4392
9869G55297k4349J713j0666p415k2287n857J0578r579l8517k2639k9226l9930
9857E57123r122j3921q671j428K763O962K303L280j6956k6235o638p052k6393
9844D56015l175J3588r886J2198k14K2681J3752N46j4981R557R199j7661j3845
9831D77774j4963j8857j8244J723K518m332j969p696k672j0485o229j2013j9012
$$ plain form
9818 365543 339778 325461 313208 308956 309998 310573 265548 214316 222469 232758 214693 202938 216697
9805 216697 231797 231801 223038 218712 209395 198761 189314 179637 192080 204234 197597 200870 210334 209443
9791 209443 201792 177907 173642 177649 178956 193694 199327 200372 201526 193090 183628 189058 204428 206392
9777 206392 200802 187443 163112 152947 153615 142668 143490 152069 143726 141893 122301 122516 133084 133607
9763 133607 135814 137594 149479 158582 181625 178339 168674 160092 151286 163502 181513 162881 147920
9750 147920 159903 159803 147082 139698 143299 139566 145048 138523 154427 148586 157165 175095 160720
9737 160720 151608 169447 175246 164667 169175 169400 153422 149472 127958 134085 150775 164472 161781
9724 161781 173841 177902 176104 158834 154284 155766 169623 186247 191312 198423 221003 240284 269468
$$ packed form
9818C65543k5765j4317j2253m252J042N75m5025n1232Q153J0289j8065j1755J3759
9805B16697J5100Mq763m326r317j0634r447r677J2443J2154o637L273R464q91
9791B09443p651k3885m265M007J307J4738N633J045J154q436r462N430J5370J964
9777B06392n590j3359k4331j0165O68j0947Q22Q579q343j833j9592K15J0568N23
9763A33607K207J780J1885R103K3043l286r665q582q806J2216J8011j8632j4961
9750A47920J1983j00j2721p384L601l733N482o525J5904n841Q579J7930j4375
9737A60720r112J7839N799j0579M508K25j5978l950k1514O127J6690J3697k691
9724A61781J2060M061j798j7270m550J482J3857J6624N065P111K2580J9281K9184
$$ plain form
9711 269468 293103 315708 342818 407552 522864 708748 1006833 1356714 1741189 2103316
9701 2103316 2380396 2521903 2479549 2231064 1827840 1406380 1045647 801415 628631 536408
9691 536408 466248 420095 400549 389807 358500 318463 303915 313178 305935 299091 304559 308819 316260
9678 316260 325642 336278 338341 330075 336345 360321 382382 395483 437734 510712 599294 746826
9666 746826 985785 1272157 1601306 1931282 2198812 2366263 2397317 2253560 1988322 1654076
9656 1654076 1307694 1014423 798656 651802 543294 447267 391994 361531 325348 325944 310168
9645 310168 301862 288951 267322 252277 252815 264895 257322 230312 225565 238842 243550 240081 222795
9632 222795 191119 158958 150950 157051 162563 145269 140486 139530 138679 160331 179025 175007 151695
$$ packed form
9711B69468K3635K2605K7110O4734J15312J85884K98085L49881L84475L62127
9701B103316K77080J41507m2354k48485m03224m21460l60733k44232j72784r2223
9691E36408p0160m6153j9546j0742l1307m0037j4548R263p243o844N468M260P441
9678C16260R382J0636K063q266O270K3976K2061J3101M2251P2978Q8582J47532
9666G46826K38959K86372L29149L29976K67530J67451L1054j43757k65238l34246
9656A654076l46382k93271k15767j46854j08508r6027n5273l0463l6183N96j5776
9645C10168q306j2911k1629j5045N38J2080p573k7010m747J3277M708l469j7286
9632B22795l1676l2161q008O101N512j7294m783r56q51K1652J8694m018k3312
$$ plain form
9619 151695 111338 97151 101980 104588 117803 136134 134667 112708 101375 99904 105723 101582 95188
9606 95188 75136 74139 73069 53116 53715 44053 28509 27194 34764 54466 53298 26868 29955 55084
9592 55084 76167 84875 87885 78859 61030 54661 51455 58505 62991 64318 40630 31552 28078 30699
9578 30699 30264 35840 39652 41777 45526 51358 57153 61839 52274 55224 70386 70170 72220 77253 77833
9563 77833 53453 55211 44948 8334 4194 11558 6911 -8457 54 27366 50102 42021 44005
9550 44005 45064 39197 37105 22861 24730 20611 -1703 -4141 2334 -2036 13507 13934 -6390 -2080
9536 -2080 1939 -1333 4985 348 -3926 17495 19799 18433 19972 13741 5717 5378 -1421 -15060 -21176
9521 -21176 -29258 -21763 138 11966 5786 2457 -1288 17078 29368 29288 21216 25080 21752 1054
$$ packed form
9619A51695m0357j4187M829K608J3215J8331j467k1959j1333j471N819m141o394
9606I5188k0052r97j070j9953N99r662j5544j315P570J9702j168k6430L087K5129
9592E5084K1083Q708L010r026j7829o369l206P050M486J327k3688r078l474K621
9578C0699m35N576L812K125L749N832N795M686r565K950J5162k16K050N033N80
9563G7833k4380J758j0263l6614m140P364m647j5368Q511K7312K2736q081J984
9550D4005J059n867k092j4244J869m119k2314k438O475m370J5543M27k0324M310
9536b080M019l272O318m637m274K1421K304j366J539o231q024l39o799j3639o116
9521b1176q082P495K1901J1828o180l329l745J8366J2290q0q072L864l328k0698
$$ plain form
9507 1054 -3756 -16729 -15413 -7970 -11890 -44233 -39139 -20429 -13042 1147 8575 9642 -11959 -24494
9493 -24494 -38728 -35407 -21190 -14708 -12136 10848 3788 -7300 -11598 -12449 6092 -1847 -25897
9480 -25897 -49787 -52534 -40069 -49741 -62071 -38957 -26348 -49907 -41137 -10343 703 -3438 15711
9467 15711 27360 16798 -956 -13753 9145 16690 13460 12211 9515 -467 -1079 -1532 -17782 -14059
9453 -14059 -14031 -3544 -2563 -15198 -26294 364 12527 14060 12788 -16041 -17921 -3398 -7273 -184
9439 -184 15082 13575 6438 -11355 -30142 -33582 -41236 -17372 -8594 -470 11087 -6467 -22785
9426 -22785 -14085 -3950 2336 -2480 -32946 -44860 -29839 -16929 -5493 -6694 -6556 -22933 -19497
9413 -19497 -42656 -41125 -34391 -19449 -5039 6380 21441 12266 17501 19175 -21596 -35936 -31202
$$ packed form
9507A054m810j2973J316P443l920l2343N094J8710P387J4189P428J067k1601j2535
9493b4494j4234L321J4217O482K572K2984p060j1088m298q51J8541p939k4050
9480b5897k3890k747J2465r672j2330K3114J2609k3559Q770L0794J1046m141J9149
9467A5711J1649j0562j7754j2797K2898P545l230j249k696r982o12m53j6250L723
9453a4059K8J0487R81j2635j1096K6658J2163J533j272k8829j880J4523l875P089
9439a84J5266j507p137j7793j8787l440p654K3864Q778Q124J1557j7554j6318
9426b2785Q700J0135O286m816l0466j1914J5021J2910J1436j201J38j6377L436
9413a9497k3159J531O734J4942J4410J1419J5061r175N235J674m0771j4340M734
$$ plain form
9400 -31202 -22316 -9549 -16382 -17423 -38818 -37462 -21093 -18709 -16560 -8352 -9159 -30004 -35732 -7268
9386 -7268 6645 -5284 -4830 -20067 -41720 -50370 -31823 -35939 -42332 -35872 -51822 -63466 -64393 -59381
9372 -59381 -45309 -21519 5495 16753 21 -24077 -29503 -21128 -30906 -48693 -30352 -11578
9360 -11578 -9324 -36086 -26412 -897 -39 -22151 -33407 -30127 -31934 -36262 -32129 -28182 -17942 -10396
9346 -10396 -17130 -34867 -40597 -28454 -5378 2410 7911 10729 14862 -10664 -21078 -33015 -29044
9333 -29044 -18146 -775 2661 -14103 -3601 468 6177 4513 4166 1350 -9571 -17879 -22758 -18021
9319 -18021 -11907 246 -8771 -16156 -30316 -17347 18 -2056 -9699 -13205 -14354 -4460 -6395 -19961
9305 -19961 -11582 -17767 -9218 -8408 -23909 -13812 -9201 -25176 -13788 -10221 -7555 -22837 -38768
$$ packed form
9400c1202Q886J2767o833j041k1395J356J6369K384K149Q208q07k0845n728K8464
9386g268J3913j1929M54j5237k1653q650J8547m116o393O460j5950j1644r27N012
9372e9381J4072K3790K7014J1258j6732k4098n426Q375r778j7787J8341J8774
9360a1578K254k6762R674K5515Q58k2112j1256L280j807m328M133L947J0240P546
9346a0396o734j7737n730J2143K3076P788N501K818M133k5526j0414j1937L971
9333b9044J0898J7371L436j6764J0502M069N709j664l47k816j0921q308m879M737
9319a8021O114J2153r017p385j4160J2969J7365k074p643l506j149R894j935j3566
9305a9961Q379o185Q549Q10j5501J0097M611j5975J1388L567K666j5282j5931
$$ plain form
9292 -38768 -26607 -14116 -15739 -28868 -37674 -44380 -8078 -3801 -24574 -29566 -3258 19803 4107
9279 4107 -16063 -30455 -29631 -26476 -32434 -36178 -43622 -46369 -34669 -22130 -19409 -30894 -37791 -48173
9265 -48173 -33727 -39626 -36350 -39876 -26204 -34680 -42317 -43978 -42826 -41286 -33402 -30462 -22301 -21568
9251 -21568 -19516 -20057 -22981 -25639 -31255 -33588 -49837 -23795 2082 -1608 -9911 -29513 -54884 -63302
9237 -63302 -69366 -48352 -31258 -40510 -45677 -43205 -30398 -24405 -23137 -26869 -24040 -27323 -33096 -31723
9223 -31723 -36973 -19080 -9389 -14162 -16245 -8022 -21532 -41158 -41651 -23809 -21443 -40278 -42141 -44812
9209 -44812 -45453 -41875 -38191 -34759 -34989 -32724 -26269 -23206 -12694 -17470 -33704 -70122 -95464 -71550
9195 -71550 -73413 -63566 -51340 -42304 -26195 -12447 -21165 -24637 -1243 1349 -3298 -16652 -40021
$$ packed form
9292c8768J2161J2491j623j3129q806o706L6302M277k0773m992K6308K3061j5696
9279D107k0170j4392Q24L155n958l744p444k747J1700J2539K721j1485o897j0382
9265d8173J4446n899L276l526J3672q476p637j661J152J540P884K940Q161P33
9251b1568K052n41k924k658n616k333j6249K6042K5877l690q303j9602k5371q418
9237f3302o064K1014J7094r252n167K472J2807N993J268l732K829l283n773J373
9223c1723n250J7893R691m773k083Q223j3510j9626m93J7842K366j8835j863k671
9209d4812o41L578L684L432k30K265O455L063J0512m776j6234l6418k5342K3914
9195g1550j863R847J2226R036J6109J3748q718l472K3394K592m647j3354k3369
$$ plain form
9182 -40021 -39095 -41699 -10123 -9483 -857 -7397 -32953 -41217 -23302 -18825 -18561 -29686 -34715 -31309
9168 -31309 -35889 -8406 7382 -17209 -34606 -27817 -42032 -34710 -8149 -5436 6487 -330 -14149
9155 -14149 -29830 -49309 -27668 4571 25289 9225 -15854 -15298 -23817 -21972 -10963 -28875 -36187
9142 -36187 -40993 -35079 -30262 -34907 -47348 -31288 -21549 -29654 -48978 -40080 -25589 -28173 -45975
9129 -45975 -43429 -39164 -35866 -30382 -34050 -50399 -21363 -29431 -26609 -36179 -37881 -41030 -19810 -8651
9115 -8651 6559 19746 27767 5045 592 4746 -4743 -2670 8744 4210 -5689 -10501 -17009 -16639
9101 -16639 -20178 -29438 -7410 5013 -22417 -25174 -23748 -39248 -43625 -49170 -37466 -41661 -39019
9088 -39019 -36136 -27924 -34250 -27440 -30602 -39584 -38184 -25136 -23236 -41664 -33102 -34864 -31619 -19183
$$ packed form
9182d0021R26k604L1576O40Q626o540k5556q264J7915M477K64j1125n029L406
9168c1309m580K7483J5788k4591j7397O789j4215P322K6561K713J1923o817j3819
9155a4149j5681j9479K1641L2239K0718j6064k5079N56q519J845J1009j7912p312
9142c6187m806N914M817m645j2441J6060R739q105j9324Q898J4491k584j7802
9129d5975K546M265L298N484l668j6349K9036q068K822r570j702l149K1220J1159
9115h651J5210J3187Q021k2722m453M154r489K073J1414m534r899m812o508L70
9101a6639l539r260K2028J2423k7430k757J426j5500m377n545J1704m195K642
9088c9019K883Q212o326O810l162q982J400J3048J900j8428Q562j762L245J2436
$$ plain form
9074 -19183 -30543 -32946 -19965 -5100 -25552 -39151 -57149 -47154 -2192 18599 13658 3446
9062 3446 -1057 1705 -15215 -23632 -24315 -25453 -19395 -22001 -9729 607 -15065 -16240 -31486 -26885
9048 -26885 -329 -3132 -19586 -36738 -28626 -17861 8757 17338 -4773 -10617 -2573 -13852 -30318
9035 -30318 -30213 -13254 -2175 -12447 -39115 -44336 -49333 -52557 -35393 -15892 -15696 -8528 19799
9022 19799 13059 10622 3534 -4867 -8679 2895 9384 10125 -6619 3916 20672 19706 10829 4994
9008 4994 5533 -1418 9718 25278 19603 -1330 -24792 -21701 -18633 -9996 -9935 -26111 -37717 -18139
8994 -18139 18819 25239 2839 -14667 -21190 -18388 -1677 -2496 -6378 -24527 -21771 -28770 -34904 -31892
8980 -31892 -13335 -961 11752 15205 6399 -9031 -25852 -26136 -24088 -21589 3683 8878 8264 29295
$$ packed form
9074a9183j1360k403J2981J4865k0452j3599j7998R995M4962K0791m941j0212
9062C446m503K762j6920q417o83j138O058k606J2272J0336j5672j175j5246M601
9048b6885K6556k803j6454j7152Q112J0765K6618Q581k2111n844Q044j1279j6466
9035c0318J05J6959J1079j0272k6668n221m997l224J7164J9501J96P168K8327
9022A9799o740k437p088q401l812J1574O489P41j6744J0535J6756r66q877n835
9008D994N39o951J1136J5560n675k0933k3462L091L068Q637O1j6176j1606J9578
8994a8139L6958O420k2400j7506o523K802J6711q19l882j8149K756o999o134L012
8980c1892J8557J2374J2713L453q806j5430j6821k84K048K499K5272N195o14K1031
$$ plain form
8966 29295 30028 7558 4688 4462 4314 6540 1833 -19976 -21689 -8569 -3357 -17868 -12171 9631
8952 9631 3330 -7132 2401 2854 302 -6509 -2669 -2814 -8834 -5785 -13626 -27953 -41764 -44906 -22845
8937 -22845 -3631 -12057 -19407 -12485 -22907 -28328 -10469 4143 -8993 -23117 -17578 -28806 -19152
8924 -19152 -8301 -12876 -14231 -1187 -9602 -20707 -17138 -23104 -27062 -41677 -18614 -4707 -16468
8911 -16468 -19037 -17929 -11878 -2216 -19151 -15324 9778 24014 19285 13323 9342 -4058 8136
8898 8136 -9754 -21806 -33009 -30669 -34282 -21947 -22264 -12773 -3929 -8449 -23923 -15776 -14296 -21441
8884 -21441 -33805 -35002 -33088 -25121 -29503 -43724 -34775 -13842 -4335 14938 28066 20676 14229
8871 14229 13014 3438 10924 30439 21863 3458 -3239 -9374 -4584 12642 10321 20064 20517 5525
$$ packed form
8966B9295P33k2470k870k26j48K226m707k1809j713J3120N212j4511N697K1802
8952I631o301j0462R533M53k552o811L840j45o020L049p841j4327j3811l142K2061
8937b2845J9214q426p350O922j0422n421J7859J4612j3136j4124N539j1228R654
8924a9152J0851m575j355J3044q415j1105L569n966l958j4615K3063J3907j1761
8911a6468k569J108O051R662j6935L827K5102J4236m729n962l981j3400J2194
8898H136j7890j2052j1203K340l613J2335l17R491Q844m520j5474Q147J480p145
8884b1441j2364j197J914P967m382j4221Q949K0933R507J9273J3128p390o447
8871A4229j215r576P486J9515q576j8405o697o135M790J7226k321R743M53j4992
$$ plain form
8857 5525 -3669 -18285 -11574 5266 11129 -3725 -16893 -13336 -15422 -17506 -16323 -36942 -29654 -20129
8843 -20129 -14172 -1441 -1670 -14333 -23048 -19770 -25503 -28739 -45333 -42135 -30011 -23765 -3572 16991
8829 16991 7765 10212 23302 21503 4892 18257 24250 3345 8794 23965 43380 37163 4805
8816 4805 -6153 3079 13511 12997 6109 1075 10353 6581 7293 -13421 -36420 -32183 -32614 -30097 -17001
8801 -17001 -1993 19944 16333 27387 14439 -6229 -1813 -502 -4397 -3192 14153 14762 3397
8788 3397 6264 33146 31596 31797 23482 15820 24068 35961 31803 22169 23340 22442 14239 2994 6862
8773 6862 18783 27570 25593 23278 12738 2630 5153 2863 -6368 9920 23892 27946 30965 45157
8759 45157 45990 43693 38504 26361 4401 9800 24363 30991 34245 28465 8068 -7273 -7982 292
$$ packed form
8857E525r194j4616O711J6840N863j4854j3168L557k086k084J183k0619P288R525
8843b0129N957J2731k29j2663q715L278n733l236j6594L198J2124O246K0193K0563
8829A6991r226K447J3090j799j6611J3365N993k0905N449J5171J9415o217l2358
8816D805j0958R232J0432n14o888n034R278l772P12k0714k2999M237m31K517J3096
8801a7001J5008K1937l611J1054j2948k0668M416J311l895J205J7345O09j1365
8788C397K867K6882j550K01q315p662Q248J1893m158r634J171q98q203j1245L868
8773F862J1921Q787j977k315j0540j0108K523k290r231J6288J3972M054L019J4192
8759D5157Q33k297n189j2143k1960N399J4563O628L254n780k0397j5341p09Q274
$$ plain form
8745 292 24013 33463 32013 29946 38586 33934 24812 31606 35199 38012 39200 57822 75335 85762
8731 85762 84450 89677 91484 68800 41942 37107 34604 10946 2209 8684 40987 40400 46457 56941
8717 56941 47372 31891 32149 25594 10740 13877 26873 16920 16206 44159 52184 46925 27560 13840
8703 13840 19193 20439 11793 2155 14285 20119 17783 9463 7455 8816 3615 -21427 -9375 -1947
8689 -1947 1905 23016 25638 18665 15967 22465 32548 34509 23476 3606 5610 21868 37760
8676 37760 37744 23432 20236 34510 29649 5238 -234 9327 16743 26994 24759 9445 -17703 -18070
8662 -18070 -16594 -17439 -609 7937 14885 7736 14954 33408 59771 42997 14821 3415 -5310
8649 -5310 -20815 -11097 -12935 -17816 -9765 3703 -10021 -20635 -7100 -8789 1427 16694 26112
$$ packed form
8745B92K3721R450j450k067Q640m652r122O794L593K813J188J8622J7513J0427
8731H5762j312N227J807k2684k6858m835k503k3658q737O475L2303n87O057J0484
8717E6941r569j5481K58o555j4854L137J2996r953p14K7953Q025n259j9365j3720
8703A3840N353J246q646r638J2130N834k336q320k008J361n201k5042J2052P428
8689a947L852K1111K622o973k698O498J0083J961j1033j9870K004J6258J5892
8676C7760j6j4312l196J4274m861k4411n472R561P416J0251k235j5314k7148l67
8662a8070J476q45J6830Q546O948p149P218J8454K6363j6774k8176j1406q725
8649e310j5505R718j838m881Q051J3468j3724j0614J3535j689J0216J5267R418
$$ plain form
8636 26112 7460 -5133 -21465 -15556 -4328 62 13000 10574 21408 41321 47022 43040 26787
8623 26787 11818 19734 19174 16225 3683 4849 22246 6824 -9559 -15709 -3487 11062 15813
8610 15813 34773 63528 61561 52497 41194 48578 39081 30216 10175 -976 9152 31271 19022
8597 19022 4618 7563 15646 32078 34727 29293 19413 19538 8685 -8896 4842 30398 33422
8584 33422 26215 23394 24570 28388 25714 39502 41404 31948 37693 36765 22074 14672 -2729 -12139
8570 -12139 12060 15921 31239 22511 12587 20316 18989 26710 15500 9266 16473 14306 23020 26520
8556 26520 21410 7099 -16432 -20283 -8439 -1991 3481 14564 7695 -10988 -18564 -11462 -7169
8543 -7169 -5075 8761 18157 19889 28528 22603 15874 7431 6927 6633 -4918 4914 33902 31735 25287
$$ packed form
8636B6112j8652j2593j6332N909J1228M390J2938k426J0834J9913N701l982j6253
8623B6787j4969P916n60k949j2542J166J7397j5422j6383o150J2222J4549M751
8610A5813J8960K8755j967r064j1303P384r497q865k0041j1151J0128K2119j2249
8597A9022j4404K945Q083J6432K649n434r880J25j0853j7581J3738K5556L024
8584C3422p207k821J176L818k674J3788J902r456N745r28j4691p402j7401r410
8570a2139K4199L861J5318q728r924P729j327P721j1210o234P207k167Q714L500
8556B6520n110j4311k3531l851J1844O448N472J1083o869j8683p576P102M293
8543g169K094J3836R396J732Q639n925o729q443n04k94j1551R832K8988k167o448
$$ plain form
8528 25287 24771 34371 34146 20574 17366 -2140 -7951 -6517 -4537 -14251 -17244 -8757 -6311 -621 4654
8513 4654 -6100 -1865 1383 -20828 -31590 -24884 -14031 5707 5368 -7703 -13930 -6002 2531 -15053
8499 -15053 -21295 3510 21246 20016 14403 -10017 -30452 -18045 -5183 10341 15776 11259 8461
8486 8461 10696 -5247 -16701 -15 16246 28071 45219 47660 37105 40926 52788 56684 57473
8473 57473 43639 40025 55853 60616 45619 24979 7032 -6784 -6459 -10497 -19895 -15559 -92
8460 -92 4829 10469 10075 1368 3389 18946 -1364 -3684 -10813 -19478 -36248 -53989 -44804 -31382
8446 -31382 -17404 -14497 -12596 10068 12042 -9187 -27329 -22434 -13803 20956 26658 21363 23151
8433 23151 33975 46247 49245 64652 66974 81820 91705 61387 46665 37422 33143 23225 10595
$$ packed form
8528B5287n16R600k25j3572l208j9506n811J434J980r714k993Q487K446N690N275
8513D654j0754M235L248k2211j0762O706J0853J9738l39j3071o227P928Q533j7584
8499a5053o242K4805J7736j230n613k4420k0435J2407J2862J5524N435m517k798
8486H461K235j5943j1454J6686J6261J1825J7148K441j0555L821J1862L896P89
8473E7473j3834l614J5828M763j4997k0640j7947j3816L25m038r398M336J5467
8460i2M921N640l94q707K021J5557k0310k320p129q665j6770j7741R185J3422
8446c1382J3978K907J901K2664J974k1229j8142M895Q631L4759N702n295J788
8433B3151J0824J2272K998J5407K322J4846R885l0318j4722r243m279r918j2630
$$ plain form
8420 10595 4890 9744 3713 -3387 -10357 -28401 -13560 -6857 -2786 -8888 811 6185 -9806 -16063
8406 -16063 15923 17107 7821 -8380 8297 35184 36861 18437 -7035 -14447 -17763 -18673 -24151
8393 -24151 -21093 -14273 -15233 -23567 -19146 -18373 -4329 -11737 -1555 21109 34337 45647 33564 14783
8379 14783 1951 2811 -7071 -6479 -2822 -2006 5567 -3664 5137 245 6747 6230 -11292 -20157 -21285
8364 -21285 -13021 -19542 -24141 -30452 -22359 -16698 -30690 -13303 12005 -8307 -21606 -32393 -34203
8351 -34203 -8845 -11128 -15436 -31157 -20025 -10774 -20724 -22677 -22096 -26155 -15888 -553 -1883 -16093
8337 -16093 -22831 -18502 -36146 -24148 -11326 -9991 -16125 -30014 -29973 -16520 8184 13078 26078
8324 26078 32992 15832 10525 -26554 -27347 -8351 -120 10464 5193 -15723 -23814 -8610 -13424
$$ packed form
8420A0595n705M854o031p100o970j8044J4841O703M071o102R699N374j5991o257
8406a6063L1986J184r286j6201J6677K6887J677j8424k5472p412l316r10n478
8393b4151L058O820r60q334M421P73J4044p408J0182K2664J3228J1310j2083j8781
8379A4783j2832Q60r882N92L657Q16P573r231Q801m892O502n17j7522q865j128
8364b1285Q264o521m599o311Q093N661j3992J7387K5308k0312j3299j0787j810
8351c4203K5358k283m308j5721J1132R251r950j953N81m059J0267J5335j330j4210
8337a6093o738M329j7644J1998J2822J335o134j3889M1J3453K4704M894J3000
8324B6078O914j7160n307l7079p93J8996Q231J0584n271k0916q091J5204m814
$$ plain form
8311 -13424 -17849 -9266 -5935 -8354 -21224 -2498 -16386 -12655 -7146 -2288 8481 -9928 -4294
8298 -4294 -11114 -11745 -18004 -7148 -2525 10742 -785 -15623 -11553 -2774 22959 35109 30847 29422
8284 29422 25040 11057 -5973 10986 17426 -578 -9334 -20168 -30744 -31622 -13838 -1022 -18337
8271 -18337 -19546 -23327 -17841 -21961 -25944 -16930 -2267 23228 18491 15845 22870 16120 8435 15873
8257 15873 14217 -6752 -36227 -35555 -23075 -28770 -43427 -50190 -46248 -31216 -10986 -3600 -22754
8244 -22754 -21193 -20581 -9351 4140 -11379 -4374 9797 10647 6827 11482 -9105 -25937 -12868
8231 -12868 -5822 -10654 -27979 -39277 -46392 -27979 -3337 4221 -4094 -25304 -9643 17666 6221
8218 6221 2748 -1539 -24855 -11815 8021 31569 38634 34128 33209 22826 3785 -16743 -19597
$$ packed form
8311a3424m425Q583L331k419j2870J8726j3888L731N509M858J0769j8409N634
8298d294o820o31o259J0856M623J3267j1527j4838M070Q779K5733J2150m262j425
8284B9422m382j3983j7030J6959O440j8004q756j0834j0576q78J7784J2816j7315
8271a8337j209l781N486m120l983R014J4663K5495m737k646P025o750p685P438
8257A5873j656k0969k9475O72J2480n695j4657o763L942J5032K0230P386j9154
8244b2754J561O12J1230J3491j5519P005J4171Q50l820M655k0587j6832J3069
8231a2868P046m832j7325j1298p115J8413K4642P558q315k1210J5661K7309j1445
8218F221l473m287k3316J3040J9836K3548P065m506r19j0383j9041k0528k854
$$ plain form
8205 -19597 -19733 -13980 -15425 -5649 18964 9703 -12080 -13145 779 22504 25730 20905 10173 5952
8191 5952 9195 17232 15991 7809 -7372 794 10666 11261 15753 22096 20153 14731 3260 -13714
8177 -13714 -20840 -34973 -34484 -32878 -37929 -29985 -27655 -29387 -25939 -53957 -56285 -48720 -47106 -32842
8163 -32842 -13614 -7472 -3303 1320 10898 19533 16532 31026 30431 32890 25481 5914 -7189 -7409
8149 -7409 -11453 -17228 -5653 -4200 -14466 -24761 -4264 5271 -18709 -31682 -25473 -14985 -1586
8136 -1586 -7389 -10823 -19885 -44088 -40678 -24933 -3945 3590 4082 10439 6087 4145 -5142 -10085
8122 -10085 -17777 -17834 -8938 -2286 -7785 -21139 -16271 -15569 -3196 -3896 -19294 -23921 -28412 -30059 -23513
8107 -23513 1531 2017 -410 -883 909 -5542 -24115 -45958 -57431 -39738 -1964 -1088 -25738 -23174
$$ packed form
8205a9597j36N753j445R776K4613r261k1783j065J3924K1725L226m825j0732m221
8191E952L243Q037j241q182j5181Q166R872N95M492O343j943n422j1471j6974
8177a3714p126j4133M89J606n051P944K330j732L448k8018k328P565J614J4264
8163c2842J9228O142M169M623R578Q635l001J4494n95K459p409j9567j3103k20
8149g409m044n775J1575J453j0266j0295K0497R535k3980j2973O209J0488J3399
8136a586n803l434r062k4203L410J5745K0988P535M92O357m352j942r287m943
8122a0085p692n7Q896O652n499j3354M868P02J2373p00j5398m627m491j647O546
8107b3513K5044M86k427m73J792o451j8573k1843j1473J7693L7774Q76k4650K564
$$ plain form
8093 -23174 -18712 -14612 217 247 -2902 11248 6841 -7020 -2913 7310 10633 8752 -14484 -23993
8079 -23993 -11022 -16604 -23767 -16756 -8236 -20313 -17175 -19012 610 7702 7680 2088 -9810 -8017
8065 -8017 -293 16794 -1292 -5399 -11876 -29092 -35886 -26173 -13322 -4064 -12330 -24621 -21138 -9654
8051 -9654 14594 16339 13043 7151 -9670 -1982 1335 -7445 -13060 -19720 -10187 -18284 -12903 -20963
8037 -20963 -5888 13652 23850 23645 17721 10679 18455 27470 2012 8046 3474 3873 -9391 -8981
8023 -8981 -8490 -13933 -26362 -16557 -21817 -32215 -21527 -23088 -6849 8439 -15790 -44148 -41877
8010 -41877 -30283 -22399 -25997 -26056 -26648 -21091 -13362 -15700 -33321 -21903 3906 10361 7042 5463
7996 5463 10851 26 -1195 -2886 -15505 -13085 -15642 -21463 -9836 17107 43866 25548 11215
$$ packed form
8093b3174M462M100J4829L0l149J4150m407j3861M107J0223L323j881k3236r509
8079b3993J2971n582p163P011Q520j2077L138j837J9622P092k2n592j1898J793
8065h017P724J7087j8086m107o477j7216o794R713J2851R258q266j2291L483J1484
8051i654K4248J745l296n892j6821P688L317q780n615o660R533q097N381q060
8037b0963J5075J9540J0198k05n924p042P776R015k5458O034m572L99j3264M10
8023h981M91n443j2429R805n260j0398J0688j561J6239J5288k4229k8358K271
8010d1877J1594P884l598n9n92N557P729k338j7621J1418K5809O455l319j579
7996E463N388j0825j221j691j2619K420k557n821J1627K6943K6759j8318j4333
$$ plain form
7983 11215 2860 3337 4481 16380 24412 32454 54919 58002 36282 22596 7908 -3939 -9598
7970 -9598 -32528 -41744 -38197 -28788 -13772 9567 8639 -6049 -7699 11324 11013 6931 18627 27609
7956 27609 25418 29516 48320 32918 -6187 -11602 -4300 10218 26131 24012 16780 11366 32502
7943 32502 43080 28446 10021 2297 13829 33836 30386 29432 22592 21271 12902 10405 9588 6840
7929 6840 2578 -2106 4703 24384 34288 25522 12011 -10550 -9060 -4326 878 5513 2500 13409
7915 13409 30816 31646 28330 27154 23717 11411 15704 27595 28236 17194 5857 -7130 -12614 -20238
7901 -20238 -1450 7807 5695 2734 -11049 -9263 -6056 7091 13539 11489 -1592 -25121 -26326
7888 -26326 -36116 -29774 -13378 -14853 -8790 -15009 -34999 -39084 -24355 -24313 4392 472 -6420 -5496
$$ packed form
7983A1215q355M77J144J1899Q032Q042K2465L083k1720j3686j4688j1847n659
7970i598k2930r216L547R409J5016K3339r28j4688j650J9023l11m082J1696Q982
7956B7609k191M098J8804j5402l9105n415P302J4518J5913k119p232n414K1136
7943C2502J0578j4634j8425p724J1532K0007l450r54o840j321q369k497q17k748
7929F840m262m684O809J9681R904q766j3511k2561J490M734N204M635l013J0909
7915A3409J7407Q30l316j176l437j2306M293J1891O41j1042j1337j2987n484p624
7901b0238J8788R257k112k961j3783J786L207J3147O448k050j3081k3529j205
7888b6326r790O342J6396j475O063o219j9990m085J4729M2K8705l920o892R24
$$ plain form
7874 -5496 -5966 -2808 2594 15703 11038 8696 -4434 -6245 -5830 -8915 -28968 -45633 -39200 -6756
7860 -6756 14783 4401 2010 -8507 -11122 -2261 -8722 -13620 -3265 -2032 -7256 -17966 -11912 -10847
7846 -10847 -10878 2966 -6906 2150 348 19171 26586 22653 23403 30949 26336 29179 18935 12472 12013
7831 12013 23799 42092 49758 41190 43623 38402 32346 41185 50762 40265 29985 22954 18062 9311
7817 9311 17555 -4220 -24963 -7770 -2135 -906 -2292 -5021 5736 7321 -2521 -96 2964 3361
7803 3361 5701 536 -7272 -15366 -4959 -11159 -11991 -905 -8594 -14541 4518 6056 -5993 -2718
7789 -2718 5764 -8344 -1297 13383 18769 16662 14499 5322 -4271 -9172 -24703 -16296 -26080 -17978
7775 -17978 -4939 2888 1650 9066 5616 6573 7496 -6850 -2202 10451 14907 -486 1012 1882
$$ packed form
7874e496m70L158N402J3109m665k342j3130j811M15l085k0053j6665O433L2444
7860f756K1539j0382k391j0517k615Q861o461m898J0355J233n224j0710O054J065
7846a0847l1J3844r872R056j802J8823P415l933P50P546m613K843j0244o463m59
7831A2013J1786J8293P666q568K433n221o056Q839R577j0497j0280p031m892q751
7817I311Q244k1775k0743J7193N635J229j386k729J0757J585r842K425L060L97
7803C361K340n165p808q094J0407o200q32J1086p689n947J9059J538j2049L275
7789b718Q482j4108P047J4680N386k107k163r177r593m901j5531Q407r784Q102
7775a7978J3039P827j238P416l450R57R23j4346M648J2653M456j5393J498Q70
$$ plain form
7761 1882 -8833 -19343 464 11217 25910 11236 -15787 -33918 -33808 -25620 -4689 11669 35124
7748 35124 28311 6232 -6376 -3335 -9010 -15634 6966 4491 327 10928 17301 6211 -2552
7735 -2552 -11535 -13529 -2611 -4813 -27846 -18790 5097 17650 15484 15784 9810 -316 30484 11588
7721 11588 -11354 1318 14993 8979 7688 -11633 -6903 8013 20818 31469 33908 26103 4819
7708 4819 7011 -10574 -25278 -17077 -4500 -9438 -36929 -49537 -37408 -20622 -16431 3494 2106
7695 2106 -7030 7655 16594 14086 -11257 -129 2827 -5186 -2510 -8910 -1177 4246 13877 18972
7681 18972 16176 10555 -8964 -7302 9542 -1770 -3526 2040 2419 2157 15814 30744 37200 42542
7667 42542 42972 18796 4115 -12795 -27989 -35961 -41167 -40457 -24634 4233 14596 22679 23557 31876
$$ packed form
7761A882j0715j0510J9807J0753J4693j4674k7023j8131J10Q188K0931J6358K3455
7748C5124o813k2079j2608L041n675o624K2600k475m164J0601O373j1090q763
7735b552q983j994J0918k202k3033R056K3887J2553k166L00n974j0126L0800j8896
7721A1588k2942J2672J3675o014j291j9321M730J4916J2805J0651K439p805k1284
7708D819K192j7585j4704Q201J2577m938k7491j2608J2129J6786M191J9925j388
7695B106r136J4685Q939k508k5343J1128K956q013K676o400P733N423R631N095
7681A8972k796n621j9519J662J6844j1312j756N566L79k62J3657J4930O456N342
7667D2542M30k4176j4681j6910j5194p972n206P10J5823K8867J0363Q083Q78Q319
$$ plain form
7653 31876 16212 -12932 -12102 305 13956 3910 -13817 -31155 -37839 -37721 -38577 -10087 -7518
7640 -7518 -10332 -17342 -36863 -23996 10221 10906 1032 -1969 -7284 -9920 140 18255 16477 11600
7626 11600 2485 -16679 -19712 -15846 -30818 -46101 -25760 -16203 -16291 -11822 -18893 -22924 -16345 -6798
7612 -6798 9850 4749 8994 15060 10847 7550 8888 -8951 -12761 4414 5192 -15601 -8136 9172
7598 9172 -403 -24038 -40059 -35233 -22636 -27371 -22932 -24445 -31555 -23271 -16133 -17930 -5847 -1789
7584 -1789 3112 -6790 -20233 -19869 -26636 -31475 -17563 -8178 -5089 -19525 -28005 -22105 -23399 -26351
7570 -26351 -24507 -32058 -38339 -30175 -39673 -38956 -25909 -29362 -25804 -21703 -21387 -17307 -4032 -3336 -2973
7555 -2973 6642 15563 33999 32393 9247 6337 14071 13629 3923 -2698 -5711 3412 -1870 -6119 -1454
$$ packed form
7653C1876j5664k9144Q30J2407J3651j0046j7727j7338o684J18q56K8490K569
7640g518k814p010j9521J2867L4217O85r874l001n315k636J0060J8115j778m877
7626A1600r115j9164l033L866j4972j5283K0341R557q8M469p071m031O579R547
7612f798J6648n101M245O066m213l297J338j7839l810J7175P78k0793P465J7308
7598I172r575k3635j6021M826J2597m735M439j513p110Q284P138j797J2083M058
7584a789M901r902j3443L64o767m839J3912R385L089j4436q480N900j294k952
7570b6351J844p551o281Q164r498P17J3047l453L558M101L16M080J3275O96L63
7555b973R615Q921J8436j606k3146k910P734m42r706o621l013R123n282m249M665
$$ plain form
7540 -1454 5419 -3713 -3734 9500 -16185 -30980 -758 10892 2623 -10846 -18390 -3714 -1457 12615
7526 12615 32392 7616 -3999 3029 6969 10360 10206 3642 -6058 -2328 229 10806 20018 21014
7512 21014 20514 2972 -8491 -6545 1520 4992 -3356 -18380 -24156 -20643 -25551 -608 27699 35650
7498 35650 16420 10997 17749 11039 2650 12460 10477 10252 13473 12142 -5579 -17756 -18407 -4693
7484 -4693 5943 1622 -2066 -4711 -5691 -10911 -21610 -29929 -24227 -20886 -26996 -22360 -23991 -12096
7470 -12096 -15173 -9258 -5335 10326 9973 9636 11566 7511 -8097 -9661 325 842 -611 -15511 -12898
7455 -12898 -22588 -8268 16639 -487 -13341 -10607 -7229 -13841 -17668 -4976 4363 22107 19961
7442 19961 10818 -8874 -19351 -20328 -33245 -42691 -42986 -27821 -14290 9713 1042 -10820 6312
$$ packed form
7540a454O873r132k1J3234k5685j4795L0222J1650q269j3469p544J4676K257J4072
7526A2615J9777k4776j1615P028L940L391j54o564r700L730K557J0577R212R96
7512B1014n00j7542j1463J946Q065L472q348j5024n776L513m908K4943K8307P951
7498C5650j9230n423O752o710q389R810j983k25L221j331j7721j2177o51J3714
7484d693J0636m321l688k645r80n220j0699q319N702L341o110M636j631J1895
7470a2096l077N915L923J5661l53l37J930m055j5608j564R986N17j453j4900K613
7455a2898r690J4320K4907j7126j2854K734L378o612l827J2692R339J7744k146
7442A9961r143j9692j0477r77j2917r446k95J5165J3531K4003q671j1862J7132
$$ plain form
7429 6312 6683 -6843 -6347 -22042 -35586 -28702 -5980 5889 7076 3637 -8594 -7009 24917 45970
7415 45970 43520 19158 8100 3202 1302 17401 23899 1995 -17297 -10599 -5946 1754 2715 -3590
7401 -3590 6843 -922 -33847 -60674 -45318 -12075 9168 22001 5442 -8451 -11161 3512
7389 3512 13919 3676 -13933 -7454 8805 15950 9995 7491 5298 2344 1861 2343 14236 16598
7375 16598 8111 18915 1384 -13851 -11152 12326 16902 -4649 -16001 -17098 -13760 660 11523
7362 11523 28215 30626 -5727 -54697 -48436 -21047 -10553 -23325 -35886 -20169 -5515 -1376
7350 -1376 4882 2216 -5416 -18250 -3502 8701 15600 12213 -19034 -26952 -5172 -4259 -25280 -54029
7336 -54029 -30171 -21397 -20105 -16729 2164 2114 -3979 17528 27474 13478 19704 18377 10579 9135
$$ packed form
7429F312L71j3526M96j5695j3544O884K2722J1869J187l439j2231J585L1926K1053
7415D5970k450k4362j1058m898j900J6099O498k1904j9292O698M653P700R61o305
7401c590J0433p765l2925k6827J5356L3243K1243J2833j6559j3893k710J4673
7389C512J0407j0243j7609O479J6259P145n955k504k193k954m83M82J1893K362
7375A6598q487J0804j7531j5235K699K3478M576k1551j1352j097L338J4420J0863
7362A1523J6692K411l6353m8970O261K7389J0494j2772j2561J5717J4654M139
7350a376O258k666p632j2834J4748J2203O899l387l1247p918K1780R13k1021k8749
7336e4029K3858Q774J292L376J8893n0o093K1507R946j3996O226j327p798j444
$$ plain form
7322 9135 18024 10872 4554 9436 8269 18459 -1383 -33601 -27005 -26663 -20638 -15950 -687 -4663
7308 -4663 -13262 -4727 -8782 -19634 -21515 -31743 -21070 -8625 -7262 -10883 -25238 -18404 -602
7295 -602 6447 4307 3656 -2430 -12555 -12935 -5150 -6614 -15926 -13995 9199 22090 41038 22214
7281 22214 162 2490 -7730 5071 -5844 -21075 -21323 -13991 -4424 -702 14411 9981 -1695
7268 -1695 -13236 -6774 6624 19365 12512 11927 2796 1817 17588 23333 18034 5029 -28272 -31003
7254 -31003 -11721 -6698 -23691 -32387 -15663 -261 6962 -4773 -24723 -30397 -41797 -45112 -35793
7241 -35793 6629 13188 -3594 -9748 -8785 -26831 -35710 -7652 -11529 -20529 -29051 -22521 -2208 2586
7227 2586 14307 4805 -3433 -16253 -15378 1474 17032 7029 -10853 -16702 3891 5332 -6041
$$ packed form
7322I135Q889p152o318M882j167J0190j9842l2218O596L42O025M688J5263l976
7308d663q599Q535m055j0852j881j0228J0673J2445J363l621j4355O834J7802
7295f02P049k140o51o086j0125l80P785j464r312J931K3194J2891J8948j8824
7281B2214k2052K328j0220J2801j0915j5231k48P332R567L722J5113m430j1676
7268a695j1541O462J3398J2741o853n85r131r79J5771N745n299j3005l3301k731
7254c1003J9282N023j6993q696J6724J5402P223j1735j9950n674j1400l315R319
7241c5793M2422O559j6782o154R63j8046q879K8058l877r000q522O530K0313M794
7227B586J1721r502q238j2820Q75J6852J5558j0003j7882n849K0593J441j1373
$$ plain form
7214 -6041 -29318 -23132 -8488 8194 19649 2382 -7400 -5288 -5640 -14510 -17731 -21287 -9378 11760
7200 11760 -10676 -7089 -6253 -13864 -24330 -45502 -48213 -45031 -25213 -20391 -11575 -11390 -15821 -14465
7186 -14465 -23986 -41307 -36893 -21674 -18646 -12465 -17111 -20584 -5534 11660 23098 18664 29722
7173 29722 25458 37337 36342 17896 3542 -4720 -21931 -33118 -31618 -5935 20842 18777 22076
7160 22076 13102 -18148 -20799 1642 5993 -7028 -3173 1192 8779 19551 8357 -9359 -12131
7147 -12131 -10935 1632 8748 7835 2110 20586 17927 2776 8595 30029 18540 8817 -1384
7134 -1384 -2498 3551 5131 5210 -5354 -25989 -36852 -32272 -29797 -18345 -6248 -2773 4620 -6162
7120 -6162 -21254 -25294 -18221 -19697 -25738 -4521 30633 32160 19758 2714 737 15871 13314
$$ packed form
7214f041k3277O186J4644J6682J1455j7267r782K112l52q870l221l556J1909K1138
7200A1760k2436L587Q36p611j0466k1172k711L182J9818M822Q816J85m431J356
7186a4465r521j7321M414J5219L028O181m646l473J5050J7194J1438m434J1058
7173B9722m264J1879r95j8446j4354q262j7211j1187J500K5683K6777k065L299
7160B2076q974l1250k651K2441M351j3021L855M365P587J0772j1194j7716k772
7147a2131J196J2567P116r13n725J8476k659j5151N819K1434j1489r723j0201
7134a384j114O049J580P9j0564k0635j0863M580K475J1452J2097L475P393j0782
7120f162j5092m040P073j476o041K1217L5154J527j2402j7044j977J5134k557
$$ plain form
7107 13314 16464 28362 30441 18533 25417 22777 24849 24978 11750 11506 14996 26019 11783 6635
7093 6635 12363 9221 23332 15709 -9701 1406 -3014 -22518 -26659 -20244 -8655 -21053 -28501
7080 -28501 -23018 -19165 -34713 -29849 -23614 -23198 -35981 -21018 8859 8038 1544 -1418 -79 -9702
7066 -9702 -5153 -1243 -17129 -24606 -18548 -3377 3273 -8851 -2831 1168 -7078 -8718 -6722 -25851
7052 -25851 -38507 -27945 -26873 -8312 -665 -2692 15077 -3656 -6308 924 6432 6947 -12537
7039 -12537 -3895 3114 1639 6382 11161 20661 14233 11673 -5817 12916 28585 15380 14018 12628
7025 12628 3214 7994 -6877 -12519 -4094 6478 4533 -6330 -10688 -10210 -9912 -1888 5901 17093
7011 17093 28948 18945 -8723 -9191 3668 14813 -1784 -7664 -4265 2808 10782 13096 10896
$$ packed form
7107A3314L150J1898K079j1908O884k640K072J29j3228k44L490J1023j4236n148
7093F635N728l142J4111p623k5410J1107m420j9504m141O415J1589j2398p448
7080b8501N483L853j5548M864O235M16j2783J4963K9877q21o494k962J339r623
7066i702M549L910j5886p477O058J5171O650j2124O020L999q246j640J996j9129
7052b5851j2656J0562J072J8561P647k027J7769j8733k652P232N508N15j9484
7039a2537Q642P009j475M743M779R500o428k560j7490J8733J5669j3205j362j390
7025A2628r414M780j4871n642Q425J0572j945j0863m358M78K98Q024P789J1192
7011A7093J1855j0003k7668m68J2859J1145j6597n880L399P073P974K314k200
$$ plain form
6998 10896 7337 -8142 -28981 -25169 -3990 9386 8074 -4971 -6088 -17322 -67 22293 34309
6985 34309 22392 20581 18360 11826 -894 -16234 -12910 312 5853 4694 788 -19886 8229
6972 8229 15478 -11277 -5277 231 7416 17694 32032 36359 17752 2402 11877 26122 15790
6959 15790 -5671 -14142 -7488 5209 5913 7432 5284 16162 12883 6738 469 -6563 -18384 -24733
6945 -24733 -6316 240 16001 19912 27235 20135 758 1380 2051 19275 14622 28539 41264 24264
6931 24264 16664 9518 4701 8977 405 -2386 4848 -2338 -1351 4499 29956 34762 24242 28553
6917 28553 16685 24472 27406 10349 29193 30062 20249 18227 15319 -4465 -26112 -26009 -22878 -15514
6903 -15514 -1015 19063 9818 -7365 394 24237 27101 6451 -4256 -6917 8979 -4578 4118
$$ packed form
6998A0896l559j5479k0839L812K1179J3376j312j3045j117j1234J7255K2360J2016
6985C4309j1917j811k221o534j2720j5340L324J3222N541j159l906k0674K8115
6972H229P249k6755O000N508P185J0278J4338M327j8607j5350R475J4245j0332
6959A5790k1461q471O654J2697P04J519k148J0878l279o145o269p032j1821o349
6945b4733J8417O556J5761L911P323p100j9377O22O71J7224m653J3917J2725j7000
6931B4264p600p146m817M276q572k791P234p186R87N850K5457M806j0520M311
6917B8553j1868P787K934j7057J8844Q69r813k022k908j9784k1647J03L131P364
6903a5514J4499K0078r245j7183P759K3843K864k0650j0707k661J5896j3557Q696
$$ plain form
6890 4118 8239 10593 28338 19265 13182 9015 24465 24965 20456 -839 -19988 -8651 2235 -11770
6876 -11770 -25514 -17089 7829 -440 -12791 -32392 -32233 -26664 3685 -5904 -31519 -33025 -21750
6863 -21750 587 4751 3540 3749 17180 39500 37960 32833 36012 21832 2619 -2585 660 5362
6849 5362 6999 10627 24610 18224 29998 49059 34546 4379 -6511 141 -19371 -11077 -19087
6836 -19087 -23167 -34082 -25121 -8525 -9522 3247 813 7057 6051 -5852 3697 2059 4493 -11253
6822 -11253 255 16733 16819 18997 17624 -843 -2712 12727 18336 832 2638 -5604 -1586 -3500
6808 -3500 -2204 -6531 -8856 -13207 3410 29534 28835 -2159 -21148 -34224 -13674 5687 30699
6795 30699 39248 23523 26725 32573 24185 31523 16479 1377 -4631 -822 11034 15930 -1991
$$ packed form
6890D118M121K354J7745r073o083m167J5450N00m509k1295j9149J1337J0886j4005
6876a1770j3744Q425K4918q269j2351j9601J59N569L0349r589k5615j506J1275
6863b1750K2337M164j211K09J3431K2320j540n127L179j4180j9213n204L245M702
6849E362J637L628J3983o386J1774J9061j4513l0167j0890O652j9512Q294q010
6836a9087m080j0915Q961J6596r97J2769k434O244j006j1903R549j638K434j5746
6822a1253J1508J6478Q6K178j373j8467j869J5439N609j7504J806q242M018j914
6808c500J296m327k325m351J6617K6124o99l0994j8989j3076K0550J9361K5012
6795C0699Q549j5725L202N848q388P338j5044j5102o008L809J1856M896j7921
$$ plain form
6782 -1991 -14946 -11272 -290 9955 9852 5465 9908 3926 1593 4073 678 -401 -3968 5592
6768 5592 -9999 -11591 -22939 -22275 -6286 -9868 8691 9914 15147 26699 18295 19923 -1068 -12296
6754 -12296 -11654 -12185 -23375 -24712 -12573 -20351 -26023 -23345 -8426 -3420 -7563 -2056 9199 3638
6740 3638 8326 37095 26489 15715 12724 13337 16633 10780 10388 6820 -5927 -5851 7476 19422
6726 19422 10980 5029 11593 14653 17379 14052 19230 17483 19042 5480 -2926 8160 21866 23845
6712 23845 19805 20911 26295 27785 18079 16116 28614 31871 30671 10538 4853 1240 -9944 -17109
6698 -17109 -16198 -2819 -8774 -30938 -26694 -21076 -23362 -43754 -34458 -19233 -736 29843 39206
6685 39206 27644 16500 -5992 -13567 -24702 -26677 -25815 -23760 -20201 -27541 -17727 -28446 -37135 -3949
$$ packed form
6782a991j2955L674J0982J0245j03m387M443n982k333K480l395j079l567R560
6768E592j5591j592j1348O64J5989l582J8559J223N233J1552q404J628k0991j1228
6754a2296O42n31j1190j337J2139p778n672K678J4919N006m143N507J1255n561
6740C638M688K8769j0606j0774k991O13L296n853l92l568j2747P6J3327J1946
6726A9422q442n951O564L060K726l327N178j747J559j3562q406J1086J3706J979
6712B3845m040J106N384J490r706j963J2498L257j200k0133n685l613j1184p165
6698a7109R11J3379n955k2164M244N618k286k0392R296J5225J8497L0579R363
6685C9206j1562j1144k2492p575j1135j975Q62K055L559p340R814j0719q689L3186
$$ plain form
6671 -3949 8209 15565 14875 5922 -4385 -13168 10087 14108 -13293 -20080 -20491 -29032 -8378 5001
6657 5001 8841 8336 6680 7847 16025 14399 22756 10793 16315 26747 19175 12089 17941 8167 -1444
6642 -1444 -11632 -20617 -26274 -22012 -4651 6365 31 -16106 -13813 9383 40337 54055 23895
6629 23895 2616 16427 -4345 -16722 -8290 -11790 -10685 -6212 -8270 -2708 2716 -9639 -2723
6616 -2723 -1248 17751 26939 14429 8242 -21271 -23818 -16071 -23627 -9802 21541 19406 5504
6603 5504 -10317 -14108 5388 13098 879 5825 -7613 -10665 -2238 22681 10709 7722 13908
6590 13908 9329 14615 1159 -10964 -2105 -85 -13374 -22804 -17816 3375 16182 23520 10121
6577 10121 2393 -2184 -11106 -11124 -14978 -14750 -9468 12131 5552 15915 4821 2880 19359 15623
$$ packed form
6671c949J2158P356o90q953j0307q783K3255M021k7401o787m11q541K0654J3379
6657E001L840n05j656J167Q178j626Q357j1963N522J0432p572p086N852r774r611
6642a444j0188q985n657M262J7361J1016o334j6137K293K3196L0954J3718l0160
6629B3895k1279J3811k0772j2377Q432l500J105M473k058N562N424j2355O916
6616b723J475J8999R188j2510o187k9513k547P747p556J3825L1343k135j3902
6603E504j5821l791J9496P710j2219M946j3438l052Q427K4919j1972k987O186
6590A3908m579N286j3456j2123Q859K020j3289r430M988K1191J2807P338j3399
6577A0121p728m577q922j8l854K28N282K1599o579J0363j1094j941J6479l736
$$ plain form
6563 15623 10470 9164 17388 9529 8458 -1085 -3578 -17840 -18536 1997 12609 5831 5695 -5173
6549 -5173 -31210 -28978 -5947 -10915 -35647 -23127 -5954 -9647 -17461 -22067 -19286 -5355 28507
6536 28507 34729 23792 24946 30018 13230 1921 -575 -5125 21592 30809 21110 15919 9603 5345
6522 5345 -8903 -3467 7292 23772 30940 36762 31712 21543 24504 6477 3976 -2429 -20690
6509 -20690 -16993 -510 6367 1085 -11659 -22491 -18892 -17715 -35727 -36822 -20637 4811 16817
6496 16817 18253 16130 25682 12293 -3708 1533 28776 46812 50233 33474 10209 -561 -17742
6483 -17742 -5488 2508 -9092 1675 18187 27551 19268 15480 3591 9111 13250 -3274 -7598
6470 -7598 10631 30604 23951 -1589 -6573 1945 10013 -1405 -27469 -28294 -20284 -26760 -37516 -30749
$$ packed form
6563A5623n153j306Q224p859j071r543k493j4262o96K0533J0612o778j36j0868
6549e173k6037K232K3031m968k4732J2520J7173l693p814m606K781J3931L3862
6536B8507O222j0937J154N072j6788j1309k496m550K6717R217r699n191o316m258
6522E345j4248N436J0759J6480P168N822n050j0169K961j8027k501o405j8261
6509b0690L697J6483O877n282j2744j0832L599J177j8012j095J6185K5448J2006
6496A6817J436k123R552j3389j6001N241K7243J8036L421j6759k3265j0770j7181
6483a7742J2254P996j1600J0767J6512R364q283l788j1889N520M139j6524m324
6470g598J8229J9973o653k5540m984Q518Q068j1418k6064q25Q010o476j0756O767
$$ plain form
6456 -30749 -33044 -40268 -10320 8138 9171 28598 20788 2461 7179 17521 10792 -12428 -8996
6443 -8996 10861 6483 -17538 -9795 3929 10256 18978 29581 19481 270 -2504 11474 7697
6430 7697 -4404 -10022 54 3330 1477 -776 -2765 662 5384 -2860 -15271 2266 20329 18995
6416 18995 20801 17546 -7104 -3638 5331 -267 -917 -10159 -15137 14422 21770 4275 6728 7653
6402 7653 6589 1248 3088 460 -19056 -24096 15175 29862 6074 -22034 -14026 5122 -2369
6389 -2369 760 19048 9659 -3318 -10284 5463 14217 21590 25475 477 -26840 -39473 -40517
6376 -40517 -14663 13521 16128 19556 11257 6018 -157 -3251 -3703 -7039 -19909 -11708 -10440 -9310
6362 -9310 -15995 -11840 -5588 -9599 -11404 -1007 -925 -5749 -8596 -15354 -23596 -17195 -9721 -9596 -18970
$$ packed form
6456c0749k295p224K9948J8458J033J9427p810j8327M718J0342o729k3220L432
6443h996J9857m378k4021P743J3724O327Q722J0603j0100j9211k774J3978l777
6430G697j2101n618J0076L276j853k253j989L427M722q244j2411J7537J8063j334
6416A8995J806l255k4650L466Q969n598o50r242m978K9559P348j7495K453R25
6402G653j064n341J840k628j9516n040L9271J4687k3788k8108Q008J9148p491
6389b369L129J8288r389j2977o966J5747Q754P373L885k4998k7317j2633j044
6376d0517K5854K8184K607L428q299n239o175l094m52l336j2870Q201J268J130
6362i310o685M155O252m011j805J0397Q2m824k847o758q242O401P474J25r374
$$ plain form
6347 -18970 -15208 -30863 -35201 -36698 -28213 -21533 -45415 -54711 -35426 -16962 185 16997 26805
6334 26805 14083 2112 5106 -2722 1154 -15119 -13425 -21698 -13039 1988 11811 32901 34202
6321 34202 8339 7307 21586 35593 43323 47623 22273 5302 -221 26813 39061 41071 38286
6308 38286 32390 20842 4338 9999 9010 14993 20359 7058 1582 4053 153 4919 3634 474
6294 474 -19376 -26425 -10756 -12991 -20722 -23141 -35818 -17960 -15451 -22729 -16199 -14888 -21995 -15509
6280 -15509 -11383 -11162 -5343 6903 14992 32450 34079 19393 24025 28133 17053 -4724 -2923 21205
6266 21205 13542 10284 19990 27544 12890 -33 6687 -6443 -11728 -16168 -20689 -12348 -16408 -9045
6252 -9045 1706 17208 22981 18852 11498 13553 10469 8674 12051 7983 666 -8842 -10664 -1919
$$ packed form
6347a8970L762j5655m338j497Q485O680k3882r296J9285J8464J7147J6812R808
6334B6805j2722j1971K994p828L876j6273J694q273Q659J5027R823K1090J301
6321C4202k5863j032J4279J4007P730M300k5350j6971n523K7034J2248K010k785
6308C8286n896j1548j6504N661r89N983N366j3301n476K471l900M766j285l160
6294D74j9850p049J5669k235p731k419j2677J7858K509p278O530J311p107O486
6280a5509M126K21N819J2246Q089J7458J629j4686M632M108j1080k1777J801K4128
6266B1205p663l258R706P554j4654j2923O720j3130n285m440m521Q341m060P363
6252i045J0751J5502N773m129p354K055l084j795L377m068p317r508j822Q745
$$ plain form
6238 -1919 7244 13634 20149 16571 4930 2933 11769 -1440 -26914 -24180 -2538 -8195 -14561 -16145
6224 -16145 -8927 9455 14618 2827 2972 -966 187 -9301 -10358 3100 10936 -4742 -29392 -16128
6210 -16128 5459 22411 11298 7049 22509 23242 6458 -15488 -13024 -18827 -17000 -29746 -50508
6197 -50508 -62709 -29240 -12307 -17922 -21083 -18275 -23550 -24766 -4195 2465 9239 9512 25089 17749
6183 17749 -2804 -10814 306 12760 20344 17188 4392 -10360 -3098 19006 11940 2258 -11239
6170 -11239 -22537 -18194 -14624 -15507 -11822 -19390 -32555 -20710 -8789 12698 16205 4264 3970 -5382
6156 -5382 -12458 -22842 -19204 -22048 -27677 -9428 -2103 -6202 -9396 -25517 -22270 -6776 -18644 12563
6142 12563 10267 -5362 -2051 1312 -9075 -25376 -29407 -21794 -9867 -6753 -5659 -1280 -1694 2361
$$ packed form
6238a919R163O390O515l578j1641j997Q836j3209k5474K734K1642n657o366j584
6224a6145P218J8382N163j1791J45l938J153r488j057J3458P836j5678k4650J3264
6210a6128K1587J6952j1113m249J5460P33j6784k1946K464n803J827j2746k0762
6197e0508j2201L3469J6933n615l161K808n275j216K0571O660O774K73J5577p340
6183A7749k0553q010J1120J2454P584l156j2796j4752P262K2104p066r682j3497
6170a1239j1298M343L570q83L685p568j3165J1845J1921K1487L507j1941k94r352
6156e382p076j0384L638k844n629J8249P325m099l194j6121L247J5494j1868L1207
6142A2563k296j5629L311L363j0387j6301m031P613J1927L114J094M379m14M055
$$ plain form
6128 2361 9703 8368 -2959 10281 22718 -640 -2656 11544 1792 -15824 -17043 -26648 -34123
6115 -34123 -20038 -18920 -4202 1074 -6869 14335 17520 2037 10863 24014 35254 9245 3002
6102 3002 -1635 -2781 2913 -55 -1223 -412 1379 -252 4773 -2484 -2100 2977 20656 19853 2258
6087 2258 -14322 -36647 -40686 -30132 -29842 -22676 -13687 4432 1511 -6919 1322 18150 21067 20399
6073 20399 29206 8153 -84 -3920 3740 16316 22888 17242 -4524 4528 -7282 -9204 20041
6060 20041 19780 964 13781 18115 6207 -28962 -29271 -28073 -10730 -10040 -23608 -18175 -14118 -9033
6046 -9033 -13053 3228 8983 17824 13276 -9918 -6780 1711 15033 20821 19024 2582 -6161 82
6032 82 12249 17008 11376 13217 12009 8584 6781 8288 6931 5853 14323 -538 -12304 -5448 -22118
$$ packed form
6128B361P342j335j1327J3240J2437k3358k016J4200r752j7616j219r605p475
6115c4123J4085J118J4718N276p943K1204L185j5483Q826J3151J1240k6009o243
6102C002m637j146N694k968j168Q11J791j631N025p257L84N077J7679q03j7595
6087B258j6580k2325m039J0554K90P166Q989J8119k921q430Q241J6828K917o68
6073B0399Q807k1053q237l836P660J2576O572n646k1766R052j1810j922K9245
6060B0041k61j8816J2817M334j1908l5169l09J198J7343O90j3568N433M057N085
6046i033m020J6281N755Q841m548k3194L138Q491J3322N788j797j6442q743O243
6032H2J2167M759n632J841j208l425j803J507j357j078Q470j4861j1766O856j6670
$$ plain form
6017 -22118 -29461 -7452 -10745 -21899 -12392 5815 -8591 -14037 -5697 1234 -135 5346 986 3890
6003 3890 5321 -19608 -18119 -15683 -29470 -29599 -34099 -42785 -32407 -2614 -1081 10418 15071 11447
5989 11447 5795 7679 -4077 -30519 -19118 827 3572 -7746 -6936 8627 21580 20266 5696
5976 5696 12611 13925 9249 17013 4034 -548 -3760 127 1961 -13039 -28865 -38348 -38752 -54054
5962 -54054 -45742 -16993 6307 1496 -5852 -21709 -27225 -30092 -11495 -1805 5125 2872 -20633
5949 -20633 -16433 -2688 -844 -4457 -15698 -10847 -5027 -10024 -29691 -30568 -18557 -13198 -17559 -4460
5935 -4460 8202 2109 -5373 -9237 -29051 -30000 -8224 -2320 -4959 -9606 -2775 11365 10346 22767
5921 22767 29507 16694 10086 -5550 -595 6614 12780 20357 7958 1392 -6778 -9844 -16305 -749
$$ packed form
6017b2118p343K2009l293j1154R507J8207j4406n446Q340O931j369N481m360K904
6003C890J431k4929J489K436j3787j29m500q686J0378K9793J533J1499M653l624
5989A1447n652J884j1756k6442J1401J9945K745j1318Q10J5563J2953j314j4570
5976E696O915J314m676P764j2979m582l212L887J834j5000j5826r483m04j5302
5962e4054Q312K8749K3300m811p348j5857n516k867J8597R690O930k253k3505
5949b0633M200J3745J844l613j1241M851N820m997j9667q77J2011N359m361J3099
5935d460J2662o093p482l864j9814r49K1776N904k639m647O831J4140j019J2421
5921B2767O740j2813o608j5636M955P209O166P577j2399o566q170l066o461J5556
$$ plain form
5907 -749 2732 11167 9066 7573 -184 3505 5916 -6372 -7398 -26777 -33660 -12752 25035 28518
5893 28518 5497 2408 15781 18531 31377 37809 21242 11489 -8365 3269 26207 40927 18212
5880 18212 21844 13729 -2836 13505 4055 -22271 -31310 -36029 -28332 -27396 -28011 1429 22513 19302
5866 19302 -3768 276 10843 11924 8728 10804 7190 22955 37538 21107 -5764 -24497 -12726
5853 -12726 -10965 -3896 7159 1736 -2901 -10771 -22423 -25441 -32223 -25567 5635 19006 -802
5840 -802 -6518 -22944 -22636 -15082 -13770 14688 33950 36578 29713 29036 23430 27872 20943 14834 -3846
5825 -3846 -21746 -29615 -16649 -9226 -16813 -7632 1514 14806 5488 4197 34436 37758 22548 7389
5811 7389 7585 -5433 -26024 -15052 9978 36846 32938 11919 8055 -1037 -11524 -21391 -17763
$$ packed form
5907g49L481Q435k101j493p757L689K411j2288j026j9379o883K0908L7787L483
5893B8518k3021l089J3373K750J2846O432j6567r753j9854J1634K2938J4720k2715
5880A8212L632q115j6565J6341r450k6326r039m719P697R36o15K9440K1084l211
5866A9302k3070M044J0567J081l196K076l614J5765J4583j6431k6871j8733J1771
5853a2726J761P069J1055n423m637p870j1652l018o782O656L1202J3371j9808
5840h02n716j6426L08P554J312K8458J9262K628o865o77n606M442o929o109j8680
5825c846j7900p869J2966P423p587R181R146J3292r318j291L0239L322j5210j5159
5811G389J96j3018k0591J0972K5030K6868l908k1019l864r092j0487r867L628
$$ plain form
5798 -17763 -19330 -25286 -26165 -37112 -17197 5824 -14299 -14661 -11338 -16791 -32313 -43782 -30465
5785 -30465 -27761 -7792 -6518 1078 -13294 -666 20015 1013 -5837 5428 -617 -1186 2796
5772 2796 4557 4244 -1644 9836 30553 54904 42186 24280 -1777 -21603 -39856 -33909 -6239
5759 -6239 11811 16403 10723 9155 10992 11532 12626 4209 -10778 -7614 -12102 -462 645 3915
5745 3915 3505 -10946 -3412 7240 23840 17932 19428 26586 5403 -5921 -4343 -4987 1645 12137
5731 12137 22747 12416 30282 35849 31592 29677 9285 -4387 1464 7727 5927 18268 23882
5718 23882 17549 5990 18597 28551 33148 32615 18672 12235 12128 6377 -7686 1018 21566 10297
5704 10297 -252 7607 9867 6591 16604 10882 12398 16375 13822 -5641 -254 -486 6978 2175
$$ packed form
5798a7763j567n956q79j0947J9915K3021k0123l62L323n453j5522j1469J3317
5785c0465K704J9969J274P596j4372J2628K0681j9002o850J1265o045n69L982
5772B796J761l13n888J1480K0717K4351j2718j7906k6057j9826j8253N947K7670
5759f239J8050M592n680j568J837N40J094q417j4987L164m488J1640J107L270
5745C915m10j4451P534J0652J6600n908J496P158k1183j1324J578o44O632J0492
5731A2137J0610j0331J7866N567m257j915k0392j3672N851O263j800J2341N614
5718B3882o333j1559J2607R954M597n33j3943o437j07n751j4063Q704K0548j1269
5704A0297j0549P859K260l276J0013n722J516L977k553j9463N387k32P464m803
$$ plain form
5690 2175 12071 19517 14572 12252 15196 -472 -20992 -4448 22360 27003 17638 9569 7155 22983
5676 22983 31602 21340 10041 21043 11623 15757 6782 2109 6682 7170 1407 -246 7973 2038
5662 2038 -7928 -822 10280 -12285 -17279 -17593 -22023 -24559 -22312 -5932 -16709 -36081 -15604 -15289
5648 -15289 6570 -9419 -7012 3721 34671 29598 3567 11471 10642 13041 21274 30119 14229
5635 14229 4576 -4390 -9761 2016 18536 29319 25035 20288 13124 2217 -16108 -30307 -28715
5622 -28715 -13769 -9896 -12680 -28055 -38026 -32885 -20573 -13869 479 23746 12833 6441 6678
5609 6678 -3236 5076 7661 9139 5839 -2182 911 7679 8677 11835 18556 5394 -4052 -1743 -2384
5594 -2384 -3886 -3322 -11038 10138 1550 1419 15512 6834 7276 -4814 -19661 -31737 -38667 -25618
$$ packed form
5690B175R896P446m945k320K944j5668k0520J6544K6808M643r365q069k414J5828
5676B2983Q619j0262j1299J1002r420M134q975m673M573M88n763j653Q219n935
5662B038r966P106J1102k2565m994l14m430k536K247J6380j0777j9372K0477L15
5648a5289K1859j5989K407J0733L0950n073k6031P904q29K399Q233Q845j5890
5635A4229r653q966n371J1777J6520J0783m284m747p164j0907j8325j4199J592
5622b8715J4946L873k784j5375r971N141J2312O704J4348K3267j0913o392K37
5609F678r914Q312K585J478l300q021L093O768R98L158O721j3162r446K309o41
5594b384j502N64p716K1176q588j31J4093q678M42j2090j4847j2076o930J3049
$$ plain form
5580 -25618 -11688 -13869 -16384 -7931 -12063 -8326 20763 39139 21653 4972 9019 2220 -12291
5567 -12291 -1420 2724 -3100 -10515 -16390 -18552 -9948 -16436 -3222 1839 -23748 -19610 -4783 6122
5553 6122 5517 26295 37776 11003 5095 19336 16727 -4038 -24929 -10898 17240 44500 26149
5540 26149 -2364 -9155 1528 -4373 2154 25699 34615 20191 14816 -11400 -19070 -4787 -13733
5527 -13733 -17617 -16527 -26901 -43509 -30877 -23107 -7126 3354 -6698 -23489 -31206 -12998 2814
5514 2814 -11167 -5454 -13746 -7496 2806 -14240 -28496 -21327 -4736 17052 20662 10463 9766
5501 9766 15879 6983 4849 -4352 6343 27973 28778 -850 -231 13216 7972 13426 21153 14184
5487 14184 -4147 -24733 -18803 -1834 -1665 -4186 -1486 130 -6677 -2723 -8848 -7840 10983 11715
$$ packed form
5580b5618J3930k181k515Q453m132L737K9089J8376j7486j6681M047o799j4511
5567a2291J0871M144n824p415n875k162Q604o488J3214N061k5587M138J4827J0905
5553F122o05K0778J1481k6773n908J4241k609k0765k0891J4031K8138K7260j8351
5540B6149k8513o791J0683n901O527K3545Q916j4424n375k6216p670J4283q946
5527a3733l884J090j0374j6608J2632P770J5981J0480j0052j6791p717J8208J5812
5514B814j3981N713q292O250J0302j7046j4256P169J6591K1788L610j0199o97
5501I766O113q896k134r201J0695K1630Q05k9628O19J3447n244N454P727o969
5487A4184j8331k0586N930J6969J69k521K700J616o807L954o125J008J8823P32
$$ plain form
5473 11715 23429 28204 13219 24214 28340 28796 38507 13068 2647 -462 -3424 -1622 2802 -33
5459 -33 -838 -12641 -22745 -18374 9643 24531 31377 24875 18892 13218 8280 12145 25044 10567
5445 10567 17107 -4418 -18490 -6082 -3172 -9178 -4412 -2393 4119 3968 1113 -1701 6057 12336
5431 12336 6921 15046 2612 6328 6744 -7453 1603 22878 31282 26318 16988 13945 1187 -3762
5417 -3762 16724 27418 30305 11583 -712 1372 -5843 -1617 3193 -9582 -5722 228 -19064
5404 -19064 -37038 -41395 -31879 -28604 -11302 13753 7962 -14126 -10257 19301 24773 17503 19893
5391 19893 11203 3505 -15329 -11932 7718 -9032 -21512 -14636 -15285 -12525 -942 1598 5911 -13584
5377 -13584 -45992 -47077 -33678 -14557 -5083 -1012 8438 25617 23663 31835 37293 22851 23559 28811
$$ packed form
5473A1715J1714M775j4985J0995M126M56R711k5439j0421l109k962J802M424k835
5459c3q05j1803j0104M371K8017J4888O846o502n983n674m938L865J2899j4477
5445A0567O540k1525j4072J2408K910o006M766K019O512j51k855k814P758O279
5431A2336n415Q125j2434L716M16j4197R056K1275Q404m964r330l043j2758m949
5417c762K0486J0694K887j8722j2295K084p215M226M810j2775L860N950j9292
5404a9064j7974m357R516L275J7302K5055n791k2088L869K9558N472p270K390
5391A9893q690p698j8834L397J9650j6750j2480O876o49K760J1583K540M313j9495
5377a3584l2408j085J3399J9121R474M071R450J7179j954Q172N458j4442P08N252
$$ plain form
5363 28811 15248 11119 28795 12761 -10712 -17284 -18267 -10954 1626 14651 21984 30346 38455
5350 38455 23233 23591 32823 39942 24570 14437 19510 26013 24872 26308 15821 12247 16168 23667
5336 23667 16583 -18705 -20436 3128 18148 26822 34583 16726 17418 25182 16799 10665 24673 25067
5322 25067 18466 -9061 -27330 -7561 18371 35330 25337 -11221 -14130 5498 -5715 -28886
5310 -28886 -16093 -380 1508 1619 5638 34641 23642 8434 6731 19134 6535 2030 -717
5297 -717 12789 36774 37826 10462 -4654 3133 4981 -1857 -1217 3949 8647 2677 -5080 -14211
5283 -14211 -9582 -3190 23349 34501 34575 33300 39582 33620 21401 4984 16976 25258 16739 16789
5269 16789 5092 -10746 -5811 -18794 -9530 -4400 -12369 -519 20796 40088 52560 53587 34119
$$ packed form
5363B8811j3563m129J7676j6034k3473o572r83P313J2580J3025P333Q362Q109
5350C8455j5222L58R232P119j5372j0133N073O503j141J436j0487l574L921P499
5336B3667p084l5288j731K3564J5020Q674P761j7857O92P764q383o134J4008L94
5322B5067o601k7527j8269J9769K5932J6959r993l6558k909J9628j1213k3171
5310b8886J2793J5713J888J11M019K9003j0999j5208j703J2403j2599m505k747
5297g17J3506K3985J052k7364j5116P787J848o838O40N166M698n970p757r131
5283a4211M629O392K6539J1152P4j275O282n962j2219j6417J1992Q282q519N0
5269A6789j1697j5838M935j2983R264N130p969J1850K1315J9292J2472J027j9468
$$ plain form
5256 34119 19832 3501 5032 8918 17808 -12128 -7883 9446 961 -8711 1521 3304 17763
5243 17763 31330 19643 15251 11107 10374 10 -14870 -19727 -17039 -28870 -19920 7213 24038
5230 24038 34753 38751 14436 393 -8030 -8153 -14127 -35986 -38222 -28596 2273 10699 -1205
5217 -1205 -2910 310 13199 55542 58262 50059 18376 5684 15288 18330 27908 24622 16390 19516
5203 19516 34182 27183 47258 35654 24019 11840 9491 10304 12309 16310 16272 7190 1899 13749
5189 13749 21109 14172 5822 12921 33778 35332 13601 2801 9496 11298 19814 26014 16589 27622
5175 27622 34504 29230 17133 3274 -21205 -21525 -15469 3350 18146 34614 28100 21860 5726
5162 5726 10571 19734 16856 13181 -10138 -26660 -26721 -21993 -20674 -14722 -14818 -24210 -33776 -16431 -3874
$$ packed form
5256C4119j4287j6331J531L886Q890k9936M245J7329q485r672J0232J783J4459
5243A7763J3567j1687m392m144p33j0364j4880m857K688j1831Q950K7133J6825
5230B4038J0715L998k4315j4043q423j23n974k1859k236R626L0869Q426j1904
5217a205j705L220J2889M2343K720q203l1683j2692R604L042R578l286q232L126
5203A9516J4666o999K0075j1604j1635j2179k349Q13K005M001l8r082n291J1850
5189A3749P360o937q350P099K0857J554k1731j0800O695J802Q516O200r425J1033
5175B7622O882n274j2097j3859k4479l20O056J8819J4796J6468o514o240j6134
5162E726M845R163k878l675k3319j6522o1M728J319N952r6r392r566J7345J2557
$$ plain form
5147 -3874 -16150 -9748 6582 -12259 -16816 11161 32120 17331 12521 26930 25566 22447 21987
5134 21987 8824 4430 3443 10852 18651 20816 15415 35440 19570 269 -1829 -19853 -16585 4832
5120 4832 31681 35584 41696 21719 9814 20870 -5400 3141 14122 -6032 -32968 -27217 -8646
5107 -8646 -17333 -9210 11992 25772 23559 15171 2671 -11692 -13728 5829 -2849 -16549 -34833
5094 -34833 -32081 -23972 -14703 -4490 14912 7563 -2631 -11969 1549 19935 18697 24561 15567
5081 15567 11327 6052 -2068 -5939 -4282 -9478 -2702 4945 9755 12775 12010 1933 -7651 -21313
5067 -21313 -25315 -12500 5386 -6543 -8221 4616 15668 19538 15550 15032 51562 48982 32002
5054 32002 16142 1516 -3952 -2975 -17062 -4229 2577 5105 16738 22963 21552 33054 16017
$$ packed form
5147c874j2276O402J6330j8841m557K7977K0959j4789m810J4409j364l119m60
5134B1987j3163m394r87P409P799K165n401K0025j5870j9301k098j8024L268K1417
5120D832K6849L903O112j9977j1905J1056k6270Q541J0981k0154k6936N751J8571
5107h646q687Q123K1202J3780k213q388j2500j4363k036J9557q678j3700j8284
5094c4833K752Q109R269J0213J9402p349j0194r338J3518J8386j238N864q994
5081A5567m240n275q120l871J657n196O776P647M810L020p65j0077r584j3662
5067b1313m002J2815J7886j1929j678J2837J1052L870l988n18L6530k580j6980
5054C2002j5860j4626n468R77j4087J2833O806K528J1633O225j411J1502j7037
$$ plain form
5041 16017 7171 -8550 629 -5429 -16439 -13222 -10858 -2981 3268 -2367 -12533 -35538 -27586 -9469
5027 -9469 -10149 -16064 -7009 -22722 -20306 -10328 -9383 -3348 27842 30173 28756 28314 33642 24701 18426
5012 18426 17957 8449 -7294 3058 17328 18081 10387 2639 29847 17429 9434 11041 -7698 -23431
4998 -23431 -37390 -41216 -26227 -16310 -24807 -17748 10772 20549 26319 27947 45060 33197 4212
4985 4212 -15438 -16227 -8880 -20667 -20413 -8801 -3975 -9476 1019 10617 3445 15692 29603 -286
4971 -286 3825 24483 19402 6103 -3522 -10928 -5235 21386 12539 -25630 -25825 -15332 -12282 -7481
4957 -7481 24810 19637 -2707 -17494 -28826 -35689 -18470 1326 9283 8354 5427 -4578 -6112
4944 -6112 -12811 -7424 -6882 -14576 -17491 -9539 -7405 1455 -1769 -6990 1415 9025 25036 42441 33108
$$ packed form
5041A6017q846j5721R179o058j1010L217K364P877O249n635j0166k3005P952J8117
5027i469o80n915R055j5713K416R978R45O035L1190K331j417m42N328q941o275
5012A8426m69r508j5743J0352J4270P53p694p748K7208j2418p995J607j8739j5733
4998b3431j3959l826J4989R917q497P059K8520R777N770J628J7113j1863k8985
4985D212j9650p89P347j1787K54J1612M826n501J0495R598p172J2247J3911k9889
4971b86M111K0658n081j3299r625p406N693K6621q847l8169j95J0493L050M801
4957g481L2291n173k2344j4787j1332o863J7219J9796P957r29k927j0005j534
4944f112o699N387N42p694k915P952K134Q860l224n221Q405P610J6011J7405r333
$$ plain form
4929 33108 10340 1423 2702 1297 1948 6883 4857 3151 10366 22167 30232 31068 15517 -4795
4915 -4795 -16402 -11603 13952 9657 6426 -7085 2764 743 12166 7056 13138 14849 14275 4693
4901 4693 18989 8125 -2415 -5300 -17778 -13396 -17747 -11079 -14457 -13402 -32734 -30942 -31748 -33568
4887 -33568 -31289 -17311 -7369 -15902 2149 6380 -8996 -7080 -10836 -2162 -5833 -7148 4119 10985
4873 10985 -6746 -30658 -19828 -11637 11911 17149 5048 -15903 -15741 -2143 -8454 5924 32248
4860 32248 25867 17065 25536 16440 3448 -359 -17052 -19211 -20540 -40384 -40293 -24150 -11961 5236
4846 5236 18934 11857 12410 9227 12133 15742 10651 26420 41527 44436 41511 28381 18113 9290
4832 9290 6100 -5298 -31887 -30289 -4565 3547 15674 -6586 -26150 -9789 5198 12202 5392
$$ packed form
4929C3108k2768q917J279j405O51M935k026j706P215J1801Q065Q36j5551k0312
4915d795j1607M799K5555m295l231j3511R849k021J1423n110O082J711n74r582
4901D693J4296j0864j0540k885j2478M382m351O668l378J055j9332J792q06j820
4887c3568K279J3978R942q533J8051M231j5376J916l756Q674l671j315J1267O866
4873A0985j7731k3912J0830Q191K3548N238j2101k0951J62J3598o311J4378K6324
4860C2248o381q802Q471r096j2992l807j6693k159j329j9844R1J6143J2189J7197
4846E236J3698p077N53l183K906L609n091J5769J5107K909k925j3130j0268q823
4832I290l190j1398k6589J598K5724Q112J2127k2260j9564J6361J4987P004o810
$$ plain form
4819 5392 408 8216 4299 13606 21103 8941 -5658 9950 1931 357 10207 21747 7213 488
4805 488 2803 -10910 -5930 -4336 -402 9526 4392 5229 7271 4107 14084 42 -15219 -5128
4791 -5128 3287 12407 12108 856 -4960 -21307 -9476 3033 -2481 8442 4348 4322 18850 16468
4777 16468 23582 10198 12632 14861 23151 27847 8488 -4836 -12587 -4533 561 -3632 -8644 -10890
4763 -10890 -22524 -6174 3805 -9918 -21191 -21543 -23436 -11346 -4373 -22846 -31977 -12544 8501
4750 8501 17896 26328 27678 26331 12726 7931 -10210 -16470 -1502 -10432 -9871 -10233 1979 16690
4736 16690 17512 26744 20970 25344 8306 20199 6122 -11878 -30929 -21711 -2419 -5459 1325
4723 1325 5709 -6128 4550 12038 6560 19323 27424 5754 -602 -10920 -14899 -25109 -2290
$$ packed form
4819E392m984P808l917R307P497j2162j4599J5608q019j574R850J1540j4534o725
4805D88K315j3713M980J594L934R928n134Q37K042l164R977j4042j5261J0091
4791e128Q415R120k99j1252n816j6347J1831J2509n514J0923m094k6J4528k382
4777A6468P114j3384K434K229Q290M696j9359j3324p751Q054N094m193n012k246
4763a0890j1634J6350R979j3723j1273l52j893J2090O973j8473r131J9433K1045
4750H501R395Q432J350j347j3605m795j8141o260J4968q930N61l62J2212J4711
4736A6690Q22R232n774M374j7038J1893j4077j8000j9051R218J9292l040O784
4723A325M384j1837J0678P488n478J2763Q101k1670o356j0318l979j0210K2819
$$ plain form
4710 -2290 17871 21373 14728 10489 21405 25453 13177 13080 27087 38163 42722 42484 30213 28578
4696 28578 25774 21468 25249 35685 38790 40907 46580 30400 8017 -4453 -6810 -14747 -12354 -8414
4682 -8414 14301 44106 45954 33528 13657 -5310 4696 -10107 -21659 -9251 15834 8961
4670 8961 -9008 -22808 -20676 -3800 1164 -60 21909 36188 16221 1595 4263 -2783 215
4657 215 -7704 -3483 5816 20260 17428 4872 1398 -5243 -15223 -13598 -23213 -30509 -21424 -6000
4643 -6000 2950 -10552 -12204 -12205 1365 21597 24337 -7413 -7635 3349 13477 8476 18054 24296
4629 24296 28261 38171 6598 20806 31751 29059 42136 17348 -8711 -11439 -3254 8940 19211
4616 19211 17073 18738 8607 8233 5908 5165 -9169 -6876 -2429 -4353 20132 28598 8832 -14194
$$ packed form
4710b290K0161L502o645m239J0916M048j2276r7J4007J1076M559k38j2271j635
4696B8578k804m306L781J0436L105K117N673j6180k2383j2470k357p937K393L940
4682h414K2715K9805J848j2426j9871j8967J0006j4803j1552J2408K5085o873
4670H961j7969j3800K132J6876M964j224K1969J4279j9967j4626K668p046K998
4657B15p919M221R299J4444k832j2556l474o641r980J625r615p296R085J5424
4643f000Q950j3502j652jJ3570K0232K740l1750k22J0984J0128n001R578O242
4629B4296L965R910l1573J4208J0945k692J3077k4788k6059k728Q185J2194J0271
4616A9211k138J665j0131l74k325p43j4334K293M447j924K4485Q466j9766k3026
$$ plain form
4602 -14194 -4926 16721 9086 -4014 -836 26534 17208 4332 -15603 -36858 -24340 -32734 -39656
4589 -39656 -23923 -16470 -30997 -17647 -6156 -1169 722 6464 12354 675 -6155 -17132 -26232
4576 -26232 -14844 15655 34132 19919 18922 11007 7363 4070 -8423 -10361 -4869 4498 -1532 9488
4562 9488 15896 23723 27641 -2894 2252 13449 14934 5139 1826 -11055 -15840 -19207 -21185 -17852
4548 -17852 -1562 4835 5926 20878 27592 13303 9152 17922 15783 11088 9742 -6168 -12191 -19445
4534 -19445 -23118 -7633 12526 13477 2070 -2101 8828 24825 23939 6690 21209 6920 5251
4521 5251 23299 28438 5544 677 10262 11401 25255 4397 -2374 6222 3615 1325 1079 -7415
4507 -7415 1251 1804 671 -5109 -9859 -9195 -27246 -36417 -2143 15328 15119 17283 5731 4458 -8209
$$ packed form
4602a4194R268K1647p635j3100L178K7370r326j2876j9935k1255J2518q394o922
4589c9656J5733P453j4527J3350J1491M987J891N742N890j1679o830j0977r100
4576b6232J1388L0499J8477j4213r97p915l644l293j2493j938N492R367o030J1020
4562I488O408P827L918l0535N146J1197J485r795l313j2881m785l367j978L333
4548a7852J6290O397J091J4952O714j4289m151Q770k139m695j346j5910o023p254
4534a9445l673J5485K0159R51j1407m171J0929J5997q86j7249J4519j4289j669
4521E251J8048N139k2894m867R585J139J3854k0858o771Q596k607k290k46q494
4507g415Q666N53j133n780m750O64j8051r171L4274J7471k09K164j1552j273j2667
$$ plain form
4492 -8209 4100 -1473 -7447 9750 17442 17147 23100 23233 2780 -2454 3040 7666 12657 24633
4478 24633 33604 19332 8356 14009 10589 6046 20154 6096 -10074 133 17365 21253 15558
4465 15558 33903 38957 30939 23999 660 7204 24024 10343 4017 -6030 -40479 -41459 -21351
4452 -21351 -21428 -19242 -9787 676 -6050 -23302 -33710 -8989 -5191 8244 5768 35125 37240 24568
4438 24568 12915 12356 -8073 -23420 -8999 -16148 -22571 -29895 -42324 -36344 -14159 -2906 2119
4425 2119 4290 -5819 -4020 -3399 8341 6739 6176 15289 21639 8183 11198 28616 22900 17665
4411 17665 24581 28550 21091 6049 9429 11419 19410 8472 1432 -4258 8744 18120 10182 -7654
4397 -7654 -20599 -1975 9447 4607 959 -14894 6417 17334 16401 4326 -30574 -29535 2332
$$ packed form
4492h209J2309n573n974J7197P692k95N953J33k0453n234N494M626M991J1976
4478B4633Q971j4272j0976N653l420m543J4108j4058j6170J0207J7232L888n695
4465A5558J8345N054q018o940k3339O544J6820j3681o326j0047l4449r80K0108
4452b1351p7K186R455J0463o726j7252j0408K4721L798J3435k476K9357K115j2672
4438B4568j1653n59k0429j5347J4421p149o423p324j2429N980K2185J1253N025
4425B119K171j0109J799O21J1740j602n63R113O350j3456L015J7418n716n235
4411A7665O916L969p459j5042L380J990P991j0938p040n690J3002R376p938j7836
4397g654j2945J8624J1422m840l648j5853K1311J0917r33j2075l4900J039L1867
$$ plain form
4384 2332 10241 2926 16592 18596 6136 -5217 -8051 1339 3846 3805 -6851 -4745 4515 -7053
4370 -7053 -15496 -11903 7430 6554 3458 4584 24 -2334 -1030 4476 -8281 -20039 -14346 -8688
4356 -8688 -598 3133 -10045 -7594 17489 11688 -19543 -28832 -15597 25495 31069 25216 19465 22446
4342 22446 12155 2089 2993 557 -22675 -26814 -11061 -10871 -7275 -732 2565 -7222 -21990 -13453
4328 -13453 4524 756 560 -1096 5938 15444 28205 34128 28031 15275 -2605 -32708 -36517 -15865
4314 -15865 -9896 -3335 4915 -3643 -9178 -9816 -25136 -24256 -17805 -5355 12591 27959 30048 23320
4300 23320 18501 10454 9218 534 -18478 -33868 -27853 -6616 1052 15091 7453 -13381 -25821
4287 -25821 -6871 19645 19051 17313 20175 6418 7332 -13855 -22124 -27676 -22647 -29607 -12749 -21213
$$ packed form
4384B332P909p315J3666K004j2460j1353k834R390K507m1j0656K106R260j1568
4370g053q443L593J9333q76l096J126m560k358J304N506j2757j1758N693N658
4356h688Q090L731j3178K451K5083n801l1231r289J3235M1092N574n853n751K981
4342B2446j0291j0066R04k436k3232m139J5753J90L596O543L297r787j4768Q537
4328a3453J7977l768j96j656P034R506J2761N923o097j2756j7880l0103l809K0652
4314a5865N969O561Q250q558n535o38j5320Q80O451J2450J7946J5368K089o728
4300B3320m819q047j236q684j9012j5390O015K1237P668J4039p638k0834j2440
4287b5821J8950K6516n94j738K862j3757R14k1187q269n552N029o960J6858q464
$$ plain form
4273 -21213 -35690 -14073 1358 2166 5276 -6142 -6023 6750 -2631 -4881 4371 9029 6531 15953
4259 15953 20019 -1177 -19292 -23811 -34627 -31997 -15197 -7646 -6685 -125 -12038 -6509 12749
4246 12749 22532 21383 33924 65442 40984 46414 47585 49710 31526 24263 24538 19975 36476 34747
4232 34747 23943 9689 -6492 -1387 19211 31101 24454 11222 -4991 -11567 -24710 -21099 -10738
4219 -10738 9317 34109 21666 21342 11650 2169 -838 778 -3229 -12239 -17157 -8487 21916 27712
4205 27712 18074 7623 5052 -5535 -22017 -33503 -39883 -29210 -15866 13755 31747 36907 16728
4192 16728 6122 -5544 -12152 -31323 -39851 -39959 -28491 -7792 -3766 -7936 -957 -9484 -17399 -30462
4178 -30462 -16447 7180 20319 21111 691 63 -6721 -15060 62 28846 63839 79391 62547
$$ packed form
4273b1213j4477K1617J5431Q08L110j1418J19J2773r381k250R252M658k498R422
4259A5953M066k1196j8115m519j0816K630J6800P551R61O560j1913N529J9258
4246A2749R783j149J2541L1518k4458N430J171K125j8184p263K75m563J6501j729
4232C4747j0804j4254j6181N105K0598J1890o647j3232j6213o576j3143L611J0361
4219a0738K0055K4792j2443l24r692r481l007J616m007r010m918Q670L0403N796
4205B7712r638j0451k571j0587j6482j1486o380J0673J3344K9621J7992N160k0179
4192A6728j0606j1666o608j9171q528j08J1468K0699M026m170O979q527p915j3063
4178c0462J4015K3627J3139P92k0420o28o784q339J5122K8784L4993J5552j6844
$$ plain form
4165 62547 48739 21666 12192 29424 29201 20543 17840 18588 20160 2686 -930 -2024 -6188 -10989
4151 -10989 1492 -9755 -6337 -21529 -15654 -10353 -14404 -36374 -38923 -20805 -3535 10193 8278
4138 8278 16084 6697 9166 5826 22361 29798 6735 -8759 -641 13585 27599 27071 13553 7399
4124 7399 -11884 -22607 -7062 -55 2473 -886 -229 3369 -8879 5302 30857 28496 23694 18698
4110 18698 20382 5663 8402 11089 -9230 -7778 13127 21576 26768 23334 -949 -12542 -37267
4097 -37267 -40793 -45630 -53196 -32773 -32435 -23228 -21436 -30848 -7955 -7625 -8086 -15152 -8910 -14644 -25300
4082 -25300 -25564 -29366 -48010 -30570 -4870 -4136 -3641 -6098 -18904 -20364 -25445 -15155 11115 6401
4068 6401 2043 6751 15257 37333 54288 33309 26825 39474 34256 39488 37845 17498 8942 8649
$$ packed form
4165F2547j3808k7073r474J7232k23q658k703P48J572j7474l616j094m164m801
4151a0989J2481j1247L418j5192N875N301m051k1970k549J8118J7270J3728j915
4138H278P806r387K469l340J6535P437k3063j5494Q118J4226J4014n28j3518o154
4124G399j9283j0723J5545P007K528l359O57L598j2248J4181K5555k361m802m996
4110A8698J684j4719K739K687k0319J452K0905Q449N192l434k4283j1593k4725
4097c7267l526m837p566K0423L38R207J792r412K2893L30m61p066O242n734j0656
4082b5300k64l802j8644J7440K5700P34M95k457j2806j460n081J0290K6270m714
4068F401m358M708Q506K2076J6955k0979o484J2649n218N232j643k0347q556k93
$$ plain form
4054 8649 -12036 -20421 -17605 -9840 -43263 -64424 -40425 -27370 -2392 -1740 -19112 -15355 -2334
4041 -2334 -877 2393 -5236 -19688 -19639 -7066 -3250 -14522 -388 -6359 -25768 -26443 -26747 -20272 372
4026 372 -7841 -24699 -1816 7958 8442 24813 10540 940 -8578 -8507 -15403 -24124 -27980 -11048 4851
4011 4851 8733 -20503 -30175 -34996 -14000 21101 19252 19610 16533 23246 12952 -12861 -22754 -8915
3997 -8915 8785 31076 30118 31680 38772 44904 20174 9667 -4474 -34442 -38750 -18081 -3717
3984 -3717 5018 4130 13325 19305 25965 19846 -8414 -1517 5826 -1451 -856 -16661 -29060 -13061
3970 -13061 7608 26292 7500 -23110 -18021 762 -6387 -8966 3283 -8324 -2753 -1401 9256
3957 9256 8560 3603 3108 24240 12440 -2544 2590 13232 -631 516 15397 26269 13897
$$ packed form
4054H649k0685q385K816P765l3423k1161K3999J3055K4978O52j7372L757J3021
4041b334J457L270p629j4452M9J2573L816j1272J4134n971j9409o75l04O475K0644
4026C72q213j6858K2883R774M84J6371j4273r600r518P1o896q721l856J6932J5899
4011D851L882k9236r672m821K0996L5101j849L58l077O713j0294k5813r893J3839
3997h915J7700K2291r58J562P092O132k4730j0507j4141k9968m308K0669J4364
3984c717Q735q88R195N980O660o119k8260O897P343p277N95j5805j2399J5999
3970a3061K0669J8684j8792l0610N089J8783p149k579J2249j1607N571J352J0657
3957I256o96m957m95K1132j1800j4984N134J0642j3863J147J4881J0872j2372
$$ plain form
3944 13897 12154 7234 6036 16929 19175 -722 -8185 -18425 -6047 10858 28675 12590 15309
3931 15309 5422 -3082 -19001 -34843 -29894 -409 5382 5536 8885 18193 -13506 -33182 -36448 -25783
3917 -25783 -8467 1007 -5401 -14576 -12747 -14447 4056 4859 9338 24281 13141 26782 33791 15299
3903 15299 -3850 -8868 -4084 -14484 -3541 -46 7664 5721 5164 -4338 -18781 -1269 10716
3890 10716 12631 2826 -3614 4805 14304 1146 -27028 -45435 -24744 -4753 -2256 2212 4362
3877 4362 10194 10767 -92 3459 -755 1900 -14923 -25855 -29462 -12366 10540 23980 39624
3864 39624 21374 9270 20989 13777 4383 3965 13737 -6828 -24193 -30718 -19232 3261 15759
3851 15759 21171 4997 17585 16542 21771 5231 -11194 -20898 -17249 10883 8711 6803 7241 9698
$$ packed form
3944A3897j743m920j198J0893K246j9897p463j0240J2378J6905J7817j6085K719
3931A5309r887q504j5919j5842M949K9485N791J54L349R308l1699j9676l266J0665
3917b5783J7316R474o408r175J829j700J8503Q03M479J4943j1140J3641P009j8492
3903A5299j9149n018M784j0400J0943L495P710j943n57r502j4443J7512J1985
3890A0716J915r805o440Q419R499j3158k8174j8407K0691J9991K497M468K150
3877D362N832N73j0859L551m214K655j6823j0932l607J7096K2906J3440J5644
3864C9624j8250j2104J1719p212r394m18R772k0565j7365o525J1486K2493J2498
3851A5759N412j6174J2588j043N229j6540j6425r704L649K8132k172j908M38K457
$$ plain form
3837 9698 14219 7194 5358 11007 16671 8698 -12670 -13616 -3540 26859 31574 18455 7675 1474
3823 1474 5710 13876 -11517 -21077 -18591 -4122 18343 12107 11318 17521 24903 25771 21678 17194 22489
$$ packed form
3837I698M521p025j836N649N664p973k1368r46J0076L0399M715j3119j0780o201
3823A474M236Q166k5393r560K486J4469K2465o236p89O203P382Q68m093m484N295
$$ [...]
##END NTUPLES=NMR SPECTRUM
##END=
