##TITLE=Analysis number 315003
Compound Code cc 09110
Project Code adrs
Chemist Name synnovation
##JCAMPDX= 6.0         $$ Bruker NMR JCAMP-DX V2.0
##DATA TYPE= NMR SPECTRUM
##DATA CLASS= NTUPLES
##ORIGIN= Bruker BioSpin GmbH
##OWNER= NMR
$$ XWIN-NMR		Version 3.5
$$ Wed Nov  2 15:09:52 2005 GMT Standard Time (UT+0h)  MAYBRIDGE\NMR@NMR_250MHZ
##.OBSERVE FREQUENCY= 250.131544655141
##.OBSERVE NUCLEUS= ^1H
##.ACQUISITION MODE= SIMULTANEOUS (DQD)
##.ACQUISITION SCHEME= undefined
##.AVERAGES= 16
##.DIGITISER RES= 18
##SPECTROMETER/DATA SYSTEM= dpx250
##.PULSE SEQUENCE= zg30
##.SOLVENT NAME= CDCl3
##.SHIFT REFERENCE= (INTERNAL, CDCl3, 0, 16.522)
##AUDIT TRAIL= $$ (NUMBER, WHEN, WHO, WHERE, WHAT)
$$ ##TITLE= Audit trail, XWIN-NMR		Version 3.5
$$ ##JCAMPDX= 5.01
$$ ##ORIGIN= Bruker BioSpin GmbH
$$ ##OWNER= NMR
$$ C:\u/data/dgb/nmr/ADRS/11830/pdata/1/auditp.txt
$$ ##AUDIT TRAIL=  $$ (NUMBER, WHEN, WHO, WHERE, WHAT)
(   1,<2005-11-02 15:09:17.78 +000>,<MAYBRIDGE\NMR>,<NMR_250MHZ>,
      <created by zg, POWCHK disabled, PULCHK disabled
       configuration hash MD5:
       62 19 C7 07 E1 42 D1 B7 37 6C 3D D0 77 39 F9 E6
       data hash MD5: 64K
       8B F7 B4 2C DE C7 A3 57 EC 0D 2C 40 06 93 70 B9>)
(   2,<2005-11-02 15:09:35.18 +000>,<MAYBRIDGE\NMR>,<NMR_250MHZ>,
      <Start of raw data processing
       ef LB = 0.3 FT_mod = 6 PKNL = 1 SI = 32K 
       data hash MD5: 32K
       15 75 FA B4 02 8C 93 99 5E DA 1A 3B 22 E6 5E 16>)
(   3,<2005-11-02 15:09:37.14 +000>,<MAYBRIDGE\NMR>,<NMR_250MHZ>,
      <apk 
       data hash MD5: 32K
       56 37 1F 30 10 37 DD 89 EA 13 DA 20 7B F8 FD BE>)
(   4,<2005-11-02 15:09:38.36 +000>,<MAYBRIDGE\NMR>,<NMR_250MHZ>,
      <abs ABSG = 5 
       data hash MD5: 32K
       F7 5F 62 C2 26 71 A5 0B 64 02 80 0C FB 9B 9D 7A>)
$$ ##END=
$$ 
$$ hash MD5
$$ 29 24 44 B4 CE AB 50 C7 B7 14 C8 DA F5 0A AA 5C
##$RELAX= 
##$RELAX= 
##$RELAX= 
##$RELAX= 
##$RELAX= 
##$RELAX= 
##$RELAX= 
$$ Bruker specific parameters
$$ --------------------------
##$DU= <C:\u>
##$EXPNO= 11830
##$NAME= <ADRS>
##$PROCNO= 1
##$TYPE= <nmr>
##$USER= <dgb>
##$AMP= (0..31)
100 100 100 100 100 100 100 100 100 100 100 100 100 100 100 100 100 100 
100 100 100 100 100 100 100 100 100 100 100 100 100 100 
##$AQSEQ= 0
##$AQ_mod= 3
##$AUNM= <au_zg>
##$AUTOPOS= <35 >
##$BF1= 250.13
##$BF2= 250.13
##$BF3= 250.13
##$BF4= 250.13
##$BF5= 500.13
##$BF6= 500.13
##$BF7= 500.13
##$BF8= 500.13
##$BYTORDA= 1
##$CFDGTYP= 0
##$CFRGTYP= 5
##$CHEMSTR= <none>
##$CNST= (0..31)
1 1 145 1 1 1 1 1 1 1 1 1 1 1 1 1 1 1 1 1 1 1 1 1 1 1 1 1 1 1 1 1 
##$CPDPRG= <>
##$CPDPRG1= <>
##$CPDPRG2= <>
##$CPDPRG3= <>
##$CPDPRG4= <mlev>
##$CPDPRG5= <mlev>
##$CPDPRG6= <mlev>
##$CPDPRG7= <mlev>
##$CPDPRG8= <mlev>
##$CPDPRGB= <>
##$CPDPRGT= <>
##$D= (0..31)
0 1 0 0 0 0 0 0 0 0.06 0 0 0 0 0 0 0.0002 0 0 0 0 0 0 0 0 0 0 0 0 0 0 
0 
##$DATE= 1130944156
##$DBL= (0..7)
120 120 120 120 120 120 120 120 
##$DBP= (0..7)
150 150 150 150 150 150 150 150 
##$DBP07= 0
##$DBPNAM0= <>
##$DBPNAM1= <>
##$DBPNAM2= <>
$$ [...]
##$SUBNAM7= <"">
##$SUBNAM8= <"">
##$SUBNAM9= <"">
##$SW= 20.6930455092707
##$SWIBOX= (0..15)
0 0 3 0 0 0 0 0 0 0 0 0 0 0 0 0 
##$SW_h= 5175.983436853
##$TD= 65536
##$TD0= 1
##$TE= 296.16
##$TE2= 300
##$TE3= 300
##$TEG= 300
##$TL= (0..7)
0 120 120 120 120 120 120 120 
##$TP= (0..7)
150 150 150 150 150 150 150 150 
##$TP07= 0
##$TPNAME0= <>
##$TPNAME1= <>
##$TPNAME2= <>
##$TPNAME3= <>
##$TPNAME4= <>
##$TPNAME5= <>
##$TPNAME6= <>
##$TPNAME7= <>
##$TPOAL= (0..7)
0.5 0.5 0.5 0.5 0.5 0.5 0.5 0.5 
##$TPOFFS= (0..7)
0 0 0 0 0 0 0 0 
##$TUNHIN= 0
##$TUNHOUT= 0
##$TUNXOUT= 0
##$USERA1= <user>
##$USERA2= <user>
##$USERA3= <user>
##$USERA4= <user>
##$USERA5= <user>
##$V9= 5
##$VALIST= <valist>
##$VCLIST= <CCCCCCCCCCCCCCC>
##$VD= 0
##$VDLIST= <DDDDDDDDDDDDDDD>
##$VPLIST= <PPPPPPPPPPPPPPP>
##$VTLIST= <TTTTTTTTTTTTTTT>
##$WBST= 1024
##$WBSW= 4
##$XGAIN= (0..3)
0 0 0 0 
##$XL= 0
##$YL= 0
##$YMAX_a= 515593
##$YMIN_a= -587184
##$ZGOPTNS= <>
##$ZL1= 120
##$ZL2= 120
##$ZL3= 120
##$ZL4= 120
##$ABSF1= 16.522
##$ABSF2= -4.171173
##$ABSG= 5
##$ABSL= 3
##$ALPHA= 0
##$AQORDER= 0
##$ASSFAC= 0
##$ASSFACI= 0
##$ASSFACX= 0
##$ASSWID= 0
##$AUNMP= <proc_1d>
##$AZFE= 0.1
##$AZFW= 0.1
##$BCFW= 0
##$BC_mod= 0
##$BYTORDP= 0
##$COROFFS= 0
##$CY= 12.5
##$DATMOD= 1
##$DC= 0
##$DFILT= <>
##$DTYPP= 0
##$F1P= 14.0000005364418
##$F2P= -0.99999901652339
##$FCOR= 0.5
##$FTSIZE= 32768
##$FT_mod= 6
##$GAMMA= 0
##$GB= 0
##$INTBC= 1
##$INTSCL= 1
##$ISEN= 128
##$LB= 0.3
##$LEV0= 0
##$LPBIN= 0
##$MAXI= 10000
##$MC2= 0
##$MEAN= 0
##$ME_mod= 0
##$MI= 0
##$NCOEF= 0
##$NC_proc= -4
##$NLEV= 6
##$NOISF1= 0
##$NOISF2= 0
##$NSP= 0
##$NTH_PI= 0
##$NZP= 0
##$OFFSET= 16.522
##$PC= 1
##$PHC0= 78.99113
##$PHC1= 1.063238
##$PH_mod= 1
##$PKNL= yes
##$PPARMOD= 0
##$PSCAL= 4
##$PSIGN= 0
##$REVERSE= no
##$SF= 250.13
##$SI= 32768
##$SIGF1= 0
##$SIGF2= 0
##$SINO= 400
##$SIOLD= 32768
##$SREGLST= <1H.CDCl3>
##$SSB= 0
##$STSI= 32768
##$STSR= 0
##$SW_p= 5175.98343685301
##$SYMM= 0
##$S_DEV= 0
##$TDeff= 65536
##$TDoff= 0
##$TI= <Analysis number 999999
Compound Code 99
Book Reference 9
Project Code 9>
##$TILT= no
##$TM1= 0
##$TM2= 0
##$TOPLEV= 0
##$USERP1= <user>
##$USERP2= <user>
##$USERP3= <user>
##$USERP4= <user>
##$USERP5= <user>
##$WDW= 1
##$XDIM= 32768
##$YMAX_p= 467149882
##$YMIN_p= -305924
$$ End of Bruker specific parameters
$$ ---------------------------------
##NTUPLES= NMR SPECTRUM
##VAR_NAME=  FREQUENCY,     SPECTRUM/REAL,   SPECTRUM/IMAG
##SYMBOL=    X,             R,               I
##VAR_TYPE=  INDEPENDENT,   DEPENDENT,       DEPENDENT
##VAR_FORM=  AFFN,          ASDF,            ASDF
##VAR_DIM=   32768,         32768,           32768
##UNITS=     HZ,            ARBITRARY UNITS, ARBITRARY UNITS
##FACTOR=    0.157963299565203, 1,           1
##FIRST=     4132.6476996994, 0,             0
##LAST=      -1043.33573715361, 0,           0
##MIN=       -1043.33573715361, -305924,     0
##MAX=       4132.6476996994, 467149882,     0
$$ Real data points
##PAGE= N=1
##DATA TABLE= (X++(R..R)), XYDATA
$$ [...]
24779H1124j56320o1225P0251J35130O3179l0418o0473o8808o215Q644k7560L5376
24767a7315R1294q270p0273J6471N4743L3904q4738n0753n3925k6896l5413R1897
24755e9274R8075m4324m8464O8036Q839r7026Q728n1993m5066J8592m42N3417
24743i0902K1572k973n1802J4240Q2303O5164J0405k4354L3824l8979r4358J148
24731g4712l5171O9069Q6440R843m866j6358O3105M4409p3457M11l767r5624o5635
24718i6313r911L1111L9151K9453q5496L4405L8374N099L3357M7819l398r7004
24706c3353q493P0138N6639J5916l0969o6336l4630R0904L9698m2178m7631J1549
24694B1254P345j1785k3640p6338o7910J5782P3844n601j6614J01514R3475K5684
$$ plain form
24779 81124 -75196 -136421 -66170 68960 132139 101721 41248 -27560 -33775 -25131 -52691 -17315
24767 -17315 73979 65709 -4564 11907 66650 100554 15816 -34937 -88862 -115758 -151171 -59274
24755 -59274 38801 -5523 -53987 14049 22888 -74138 -65410 -117403 -162469 -143877 -144319 -90902
24743 -90902 -69330 -72303 -124105 -109865 -27562 37602 48007 23653 57477 18498 -75860 -74712
24731 -74712 -109883 -40814 45626 55469 50603 34245 97350 141759 68302 68713 64946 -30678 -96313
24718 -96313 -106224 -75113 -35962 -6509 -92005 -57600 -19226 -14127 19230 67049 63651 -33353
24706 -33353 -41846 28292 84931 100847 69878 3542 -31088 59816 99514 57336 9705 21254
24694 21254 28599 16814 -6826 -83164 -151074 -135292 -61448 -67049 -83663 17851 111326 137010
24682A37010l9479n9776j4878O4679m0355o4359O4182K9011o3698j8769M0994
24671C4562M3595o2246m8767k7150o5288q45N0499Q3206l1797p4391k0688J6395
24659a02915P8323M5911j1782m3991j3395M5202M0311J4402j23356p1092q9504
24648b31886K3858q48P0646N3830m796l4963L2979j1389L6864L081N4707K9301
24636B1384l7966j11598M7604M9970l4210j7505L2117j6763o647O3709L7711O5445
24624I3251P50o5456J2708M3996K0533q412q3767m3572k2609M2744L9852n9755
24612b9737m0768J0137J07854K048k5918J7365k7179l5041n9381m7814j3037m9564
24600a91035R3559Q5098J7403j0093k617q1205R443Q8540L0010N1847r1409o6820
$$ plain form
24682 137010 97531 37755 22877 87556 47201 -17158 47024 76035 12337 -6432 34562
24671 34562 78157 15911 -32856 -60006 -125294 -126139 -75640 7566 -24231 -98622 -119310 -102915
24659 -102915 -24592 21319 9537 -34454 -47849 -2647 37664 52066 -71290 -142382 -231886
24648 -231886 -208028 -208876 -138230 -84400 -89196 -124159 -91180 -102569 -65705 -62624 -7917 21384
24636 21384 -16582 -128180 -80576 -30606 -64816 -82321 -50204 -66967 -73614 -9905 27806 93251
24624 93251 94001 28545 41253 85249 105782 97370 13603 -29969 -52578 -9834 30018 -29737
24612 -29737 -70505 -60368 47486 49534 23616 40981 13802 -21239 -80620 -128434 -141471 -191035
24600 -191035 -97476 -12378 5025 -5068 -7685 -88890 -79447 9093 39103 90950 -459 -67279
24588f7279O5347J08528k5919J5375l5235m1660m9332N0498Q3425m2035o1222
24577D91j4475J4753k2494J9998R015m8684K1548K8550m7033n5218o8497K9367
24565a32679O0464P4644L255n9980N9101j03898o43J01700n688J0706p0622l4915
24553i8555N6568K0185l3068J0021M8604J7017m5962M8059P7223L0745j0501P6373
24541A96709n1451q9096o6566o8190l584L5032O6750l1335M6829J4668m5526L9722
24529D3962l8173N911K4582n27l8120k3884K6763K9430l3964j0962N2697k2109
24517A5606j2950Q2026K4423j09412n0561O9366J0070n6377n8285j7532N0957
24506e2669N7021P0449o4806r9757m9517j0180J2809l0455l4846M5136Q5462O9984
$$ plain form
24588 -67279 -1932 106596 80677 96052 60817 19157 -30175 20323 103748 61713 491
24577 491 -13984 769 -21725 -1727 7288 -41396 -19848 8702 -38331 -93549 -162046 -132679
24565 -132679 -72215 2429 5684 -54296 4805 -99093 -99736 1964 -3724 6982 -63640 -98555
24553 -98555 -41987 -21802 -54870 -44849 3755 20772 -25190 22869 100092 130837 120336 196709
24541 196709 145258 56162 -10404 -78594 -82178 -47146 19604 -11731 35098 49766 4240 43962
24529 43962 5789 11700 36282 35755 -2365 -26249 514 29944 -4020 -14982 37715 15606
24517 15606 2656 84682 109105 -307 -50868 18498 28568 -27809 -86094 -103626 -52669
24506 -52669 4352 74801 9995 -89762 -139279 -149459 -136650 -167105 -201951 -156815 -71353 -1369
24494a369P0400K0727o7326p4851K794P3136K3791j8016k199m1396J0342o2824
24482f6791O2517N0898J6871q9519J9873J6729j7154o4885o54J07800n9589o9516
24470i3420j048L0511n5264l4245m5765Q7359O1868j1850M9425L5205l873k7893
24458h990O1576N4913l8982k0909l765o8324l0274L2049J0781n9711K714R1035
24446B2113j8448K2227j2374n3996k9689l755J2425k2652O9465M280m4819N9763
24434D540p145o8834M7679j4639m0351K4784Q5077N1615m2215j02185k8235L6600
24422e3309l3777K2753m200q278Q1215l0297j12279L4071J09275p5027k3047j2510
24410a05410O2561K7605n4109k6957j621M147N7030M3831M0758r1857m6071O0427
$$ plain form
24494 -1369 69031 89758 22432 -52419 -49625 23511 47302 29286 27087 -14309 -3967 -66791
24482 -66791 -4274 46624 63495 -26024 -6151 10578 -6576 -71461 -72115 35685 -23904 -93420
24470 -93420 -94468 -63957 -119221 -153466 -199231 -111872 -50004 -61854 -12429 22776 18903 -8990
24458 -8990 52586 107499 68517 47608 43843 -24481 -54755 -22706 -11925 -71636 -68922 22113
24446 22113 3665 25892 13518 -40478 -70167 -73922 -61497 -84149 -14684 -10404 -55223 4540
24434 4540 -2605 -71439 -23760 -38399 -78750 -53966 31111 82726 40511 -61674 -89909 -53309
24422 -53309 -87086 -64333 -68533 -76811 4404 -25893 -138172 -104101 5174 -69853 -92900 -105410
24410 -105410 -42849 -15244 -69353 -96310 -97931 -93784 -36754 7077 47835 -44022 -90093 -29666
24398b9666K5122N814j5623p2704m8475l0642n185Q3724J2780p679j7616J2978
24386h7172N5494n7162P454J667l0900k744n8503n6844j1239P1366O1996P3627
24374c2960k7350j01016J9299J12859K5238p3005p3779L2777Q3034j7595Q178
24363d4320Q432l9754M4477L8217R684N4139j276o8201l0135P625O2806L7988
24351G9682m5673n9602R452O2155j7107j41149K9178M1128k3716l7395j5044O8598
24339d9493P3598M89l6320j7274m2393N4572Q9426p6912j11532N741N185J26458
24327B1545j2818o1455j6386R1054P0041p7034l3683M8464M2071K0503j5254n6555
24315B0493J1862M7745J2366j9312k8569M2130n6942P622O0688O2281m0323n3984
$$ plain form
24398 -29666 -4544 1270 -14353 -87057 -135532 -166174 -171359 -87635 -74855 -82534 -100150 -87172
24386 -87172 -31678 -88840 -81386 -79719 -110619 -113363 -171866 -228710 -239949 -168583 -106587 -32960
24374 -32960 -60310 -161326 -142027 -29168 -3930 -76935 -150714 -117937 -34903 -52498 -44320
24363 -44320 -35888 -75642 -31165 7052 16736 70875 69599 1398 -28737 -21112 41694 79682
24351 79682 34009 -25593 -16141 46014 28907 -112242 -83064 -41936 -65652 -103047 -118091 -49493
24339 -49493 24105 24594 -11726 -29000 -71393 -16821 72605 -4307 -115839 -110098 -104913 21545
24327 21545 8727 -52728 -69114 21940 91981 14947 -18736 29728 71799 92302 77048 20493
24315 20493 32355 80100 92466 73154 44585 86715 29773 37395 98083 160364 120041 66057
24303F6057k8050J0923R8434O1787j20878n3253K7445o5017K2837P5132n5651
24292C9766j05266j9329k6234O9166Q3035m1344j3675P7556N3858p7091m5284
24281d842o083L8753K8416R2230p0919m7690M2230K765k8845Q032J9048n0837
24269B2258q79M5979l413j09568P885Q555R5022J9118p913O8320l8063J0999j8852
24256I9448o6657l5598m1471N0832L4250L957j15546p0122n4179L8718K06523
24245E0155J10588M7483p9347q9080j9452L8460K3427m8355j7086j9563l1902
24234c4672m1944J41928k144m2552k5169m975k1912J34432Q0686K3153l7619p3412
24222I5800o1501j1967J8553j6810J680n3838j08192L4726M205K6838K8086L5745
$$ plain form
24303 66057 38007 48930 147364 209151 88273 35020 62465 -2552 20285 95417 39766
24292 39766 -65500 -84829 -111063 -41897 41138 -206 -13881 63675 117533 40442 -4842
24281 -4842 -10925 27828 56244 148474 77555 29865 72095 74860 46015 54047 73095 22258
24269 22258 21379 67358 63945 -45623 -37738 -29183 65839 84957 77044 145364 107301 118300 99448
24256 99448 32791 -2807 -44278 6554 40804 44761 -70785 -140907 -195086 -156368 50155
24245 50155 160743 208226 128879 39799 20347 58807 82234 33879 16793 -2770 -34672
24234 -34672 -76616 65312 63168 20616 -4553 -9528 -31440 102992 183678 206831 169212 95800
24222 95800 34299 22332 40885 24075 25755 -28083 -136275 -101549 -97344 -70506 -42420 -6675
24210f675M6059L1443k258j07007k7735O4556J08540L0950j26146o7201J0161
24199d5313j1665j2315M3523q591K498K0889k4498K2907j9946m6517O8683L1650
24187B1305M027J3366q4205j9191N4024N6481J5096j352k0086k9691j657K3516
24175C1633J0857o9605m7198J0532J9487n3339J07295K1839o2319J763o302K4959
24163a0398R362m7004p1231J205K7268Q3310M092k7787k4536K702J1079n2521
24151i4459j5436j3218j8655M9978K3604M7471l066k6468N0963J3778m479o8857
24139e8844j4810K4181M1956K3824p191m5679k786L7580J02079M7757L0623J7825
24127A96515L2500L8131n6976r9006j14290j6856K2207L3717N374l6253L6960
$$ plain form
24210 -6675 39384 70827 68569 -38438 -66173 -1617 106923 137873 11727 -55474 -45313
24199 -45313 -56978 -69293 -25770 -34361 -31863 -10974 -35472 -12565 -32511 -79028 -10345 21305
24187 21305 25332 38698 -45507 -64698 -10674 45807 60903 59551 39465 9774 8117 31633
24175 31633 42490 -27115 -74313 -63781 -44294 -97633 9662 31501 -30818 -29055 -35357 -10398
24163 -10398 -1036 -48040 -119271 -118066 -90798 -7488 -3396 -31183 -55719 -53017 -41938 -94459
24151 -94459 -109895 -123113 -141768 -91790 -68186 -20715 -23781 -50249 714 14492 10013 -58844
24139 -58844 -73654 -49473 -7517 16307 9116 -36563 -39349 -1769 100310 148067 178690 196515
24127 196515 229015 267146 210170 111164 -3126 -19982 2225 35942 41316 5063 42023
24116D2023p92p2469o9404k2024l2359L2091Q1592L007p0970L3900k6500J3235
24104h8670P4899L6379o506O1177n0913j8135P2949n9956J4715O8542n8320k2218
24092B3943j32927M038Q0816l2890M4170Q7750O6231r7883q4446L271P2553N2713
24080H7339p278p28N2781j6195j4268k3815N1223n523j23519q5994K9871K679
24068e3427P3926L0531m0542q521o3279j5188N4482J6489p1976k5563k9123n562
24056a37753R0236J06316P2190m6230L6896J7780l7313l2563o113j2034p6084
24045b4672M2778P8728j9483l1847l6838J9680J2546J4896m7395k960K726L3457
24033D1616M22q0174n5639M8114J9825J459O281N4740o9555j8396M3015j6561
$$ plain form
24116 42023 41231 -31238 -100642 -122666 -155025 -122934 -41342 -38335 -109305 -75405 -101905 -88670
24104 -88670 -13771 22608 16102 77279 26366 8231 81180 21224 35939 104481 46161 23943
24092 23943 -108984 -104946 -24130 -57020 -12850 74900 141131 43248 -41198 -37927 34626 87339
24080 87339 80061 79333 132114 115919 101651 77836 129059 123536 17 -85977 -56106 -53427
24068 -53427 20499 51030 10488 1967 -61312 -76500 -22018 -5529 -77505 -103068 -132191 -137753
24056 -137753 -47517 58799 130989 84759 121655 139435 102122 69559 63446 51412 -24672
24045 -24672 18106 96834 77351 45504 8666 28346 40892 55788 8393 5433 8159 41616
24033 41616 42038 -38136 -93775 -45661 -25836 -24377 -18096 36644 -32911 -51307 -8292 -24853
24021b4853J0956K2938m8728l6186l9106K0462o478J6324M2950o934L0946m4030
24009f1739M820J4167O6580J7783j7544k7704R97j4246k3672l5976L444O0005
23997a3085m4807L2213K0295N0518k9177M4369M3098p1224J7535l3508p91J2043
23985B7479q592P6245M6390K5637j05288j36068j0379J33889Q7065M1194j9574
23974A57998j06086o8212j1167m6472m3009N4327O8042K0400m6142J6771L0590
23963B7040K5399j8764P748L6130k0238l8549M4618K5965m1338J344J8957j20550
23951e2238p4046l491J05586M3468r0890q0704Q9351O1739k376N018k5033l2330
23939e5946l720N4513k1416L1613N5635m9711l7524K413J7155K0586j2409n6971
$$ plain form
24021 -24853 -13897 9041 -39687 -75873 -114979 -94517 -100995 -84671 -41721 -48655 -17709 -61739
24009 -61739 -56919 -42752 23828 41611 24067 -3637 -2640 -16886 -40558 -76534 -73090 -13085
23997 -13085 -57892 -25679 -5384 45134 15957 60326 103424 32200 49735 16227 15436 27479
23985 27479 18887 95132 141522 167159 61871 -74197 -84576 49313 136378 177572 157998
23974 157998 51912 -16300 -27467 -73939 -116948 -62621 5421 25821 -20321 -3550 27040
23963 27040 52439 33675 41423 77553 57315 18766 63384 89349 48011 49355 68312 -52238
23951 -52238 -126284 -129775 -24189 19279 -71611 -152315 -62964 -1225 -3601 1417 -23616 -55946
23939 -55946 -59666 -5153 -26569 5044 60679 10968 -26556 -24143 -6988 13598 1189 -55782
23927e5782n4842N0822K3706j6978j5421L5008P3581j3844l0925n1244M4682Q7371
23915G6134l8332P363N8764n4980k8206k9998k0559L5680o225p3627N9113M4966
23903C0093J3479o7699J1565O7163j7758r1198m1180L2870l8598M5026J14211
23892E7974P730m1910J70249j9897k7997m4881j12727l3327n4706L3132q343q011
23880h2714R7270K1511M0499K0305p3054o0418l5777j0136N7267Q0513Q0410N5837
23868A91513j04159r4948o2038N0460J27252K2288j3196l0730J9059k2693n6360
23857B6448L0213O671l2589k9804j0240K7283J8165k8596N8068N2597l780n7626
23845E6810m6197L618O776o7416N196o4823l7970j9737l1048P3972P4481m7426
$$ plain form
23927 -55782 -110624 -59802 -36096 -53074 -68495 -33487 40094 26250 -4675 -55919 -11237 76134
23915 76134 37802 45165 103929 48949 20743 -9255 -29814 5866 -359 -73986 -14873 30093
23903 30093 43572 -24127 -12562 54601 36843 -54355 -95535 -62665 -101263 -56237 57974
23892 57974 65704 23794 194043 174146 146149 101268 -11459 -44786 -99492 -66360 -74703 -82714
23880 -82714 14556 36067 76566 96871 23817 -36601 -72378 -82514 -25247 55266 135676 191513
23868 191513 87354 -7594 -69632 -19172 108080 130368 117172 86442 105501 82808 26448
23857 26448 56661 63332 30743 939 -9301 17982 36147 7551 65619 118216 114436 56810
23845 56810 10613 14231 21007 -46409 -41213 -106036 -144006 -163743 -194791 -120819 -46338 -93764
23833i3764K4669P2481n7983O1793L1896O8158N4573m4732k4841k5774j4092O987
23821E9371l5131l098j3191L3380N181j05751K523L7378l5669j2108Q208n8025
23809a16932M9413M8720l4466J06161K4433n1583m2729m8611l4839P1224J15025
23798H5816k3958n7557o4176m0094j9663N801J03213L3380J0299K4821k5920J1256
23786D3218J06846K2901k7306k4557j32712R675Q1821J8126k7439k4619l281p3151
23774c0478p0003p1461Q2536L1232j5558M1998l0565l5264O4772M2721L6509K506
23762D8945j02764o9622L5309P5259j5448p2580L0645R7382p3137m9191O5847
23751b9355K4556n591J7647k6021l6007L9431n4721m1788L1095P578N7924N7356
$$ plain form
23833 -93764 -69095 3386 -54597 7196 39092 107250 161823 117091 92250 66476 52384 59371
23821 59371 24240 21142 7951 41331 46512 -59239 -56716 -19338 -55007 -67115 -58907 -116932
23809 -116932 -67519 -18799 -53265 52896 77329 25746 -16983 -65594 -100433 -29209 85816
23798 85816 61858 4301 -59875 -99969 -119632 -113831 -10618 22762 33061 57882 31962 43218
23786 43218 150064 172965 145659 121102 -11610 -1935 79886 98012 70573 45954 42673 -30478
23774 -30478 -100481 -171942 -89406 -58174 -73732 -31734 -62299 -97563 -32791 9930 46439 48945
23762 48945 -53819 -123441 -88132 -12873 -28321 -100901 -70256 27126 -46011 -95202 -29355
23751 -29355 -4799 -10390 7257 -18764 -54771 -15340 -70061 -111849 -80754 -73176 -15252 42104
23739D2104l6685P0182k7775j1840j3967M1224k5453O7413j0482r1779j0744L0020
23727B2218j6707K9736N8161j2854m5998j06853J4402R1295j5835k8668m2145
23716e3248n0389L8851J4848P7193M8370k0297l4046n0013j082k6635k4283L9076
23704d1655J05777L4810M935k8138K2369M9056K3575l3134l870O274j21275N3332
23692G2056O5785L292j4069o2503q1951p4962j0119J1146O4160m1982n3642k8747
23680a51536J08244N1513n0882N1593q15L4632K1837q6046j9776M7094K0486k5355
23668I89n8600k7282Q137p798K6886O5493O4010p939n2544J3835O7686j3149n3110
23655B6614M5915K3907Q1310q0108j2976O7139R32k6089o3152p4340O2089J4544
$$ plain form
23739 42104 5419 75601 47826 35986 22019 63243 37790 105203 94721 2942 -7802 22218
23727 22218 5511 35247 93408 80554 34556 -72297 -57895 33400 17565 -11103 -53248
23716 -53248 -103637 -64786 -49938 27255 75625 55328 21282 -28731 -29813 -56448 -80731 -41655
23704 -41655 64122 98932 103867 75729 98098 147154 170729 137595 133725 139999 18724 72056
23692 72056 137841 141133 127064 64561 -17390 -92352 -102471 -91325 -27165 -69147 -122789 -151536
23680 -151536 -43292 8221 -42661 8932 8117 42749 64586 -21460 -41236 5858 26344 989
23668 989 -57611 -84893 -76756 -84554 -57668 7825 71835 63896 11352 25187 92873 79724 26614
23655 26614 72529 96436 177746 97638 84662 151801 152733 126644 63492 -10848 51241 65785
23643F5785n0526o0187j6313q4701l8617R1184O8543M440m578J2612j6411L2470
23631C701l6024K1493n8020n2439j8621n1463K8680P1002N033j3438N8626m0847
23619h2317l60K2253J9420J4623o4894J13990m1492O9558j0039n8428j10096K067
23607a25715N9498J8031K6857p447k5639M5199L5940j6874l4058n2739l3974L6693
23595g4228N8772P1865n961n0191N1678N4856n6915L1310K7026l2057L7036j7841
23583I5350K5701M436j7571K5178l440o6463m4885l4609m6457K1716N4376j1552
23571A780J9153J4025K914K0242m6881m0228j1198m1738j9760P6371K8447k4190
23559b1063K8536O2124N928m8688K6232M595j09401m0946N267o2996k0530J656
$$ plain form
23643 65785 15259 -44928 -61241 -145942 -184559 -93375 -24832 -20392 -24970 -12358 -28769 3701
23631 3701 -32323 -10830 -68850 -121289 -139910 -191373 -162693 -91691 -86658 -100096 -41470 -82317
23619 -82317 -82677 -60424 -41004 -26381 -91275 22715 -18777 50781 40742 -17686 -127782 -125715
23607 -125715 -66217 -48186 -21329 -28776 -54415 -9216 26724 9850 -24208 -76947 -110921 -74228
23595 -74228 -15456 56409 50448 257 51935 106791 49876 81186 108212 76155 113191 95350
23583 95350 121051 125487 107916 133094 129654 63191 18306 -16303 -62760 -41044 13332 1780
23571 1780 20933 34958 37872 58114 11233 -28995 -40193 -81931 -101691 -25320 3127 -21063
23559 -21063 7473 69597 75525 26837 53069 57664 -51737 -92683 -87416 -150412 -170942 -169286
23547a69286L0230O7434m65k6503N754P691J18177J06704K488n5473n8674J5762
23535D3839J3759l6101j06334k6793N3442M5798O2467l248J3926L036n0100n9534
23523d5843J5795l0009R322M8321J8335n2054J6178l353j05107j4956M3338P2676
23511b7357l9575l4127M6867Q1529R9273J5360m3706p5676l0304M5120Q6410j281
23499A22533l5997J0348j8152n6676J4254q8484n849N8784J1706k6439o513M9374
23487B8889n9039l2251L9468n4546j18228k2364R6450K9043R738J3114K5875K0821
23475b3030m6898R6335O9459K0394q0632n5228j2264Q063R081Q3231O6147r484
23463A25174j20513Q065O9596O8377l9553l7876j12369J6581L3358M3692N2706
$$ plain form
23547 -169286 -139056 -71622 -72087 -98590 -92836 -85145 33032 139736 142224 86751 28077 43839
23535 43839 57598 21497 -84837 -111630 -58188 -12390 50077 46829 60755 63791 13691 -45843
23523 -45843 -30048 -60057 -50735 -2414 15921 -36133 -19955 -23308 -128415 -143371 -100033 -27357
23511 -27357 -66932 -101059 -54192 27337 126610 141970 98264 22588 -7716 37404 123814 122533
23499 122533 86536 96884 78732 22056 36310 -52174 -58023 761 12467 -13972 -20485 28889
23487 28889 -30150 -62401 -22933 -77479 -195707 -218071 -121621 -92578 -82840 -69726 -43851 -23030
23475 -23030 -69928 26407 95866 116260 35628 -19600 -31864 -23801 -14720 68511 134658 125174
23463 125174 4661 12726 82322 150699 111146 73270 -39099 -22518 10840 54532 107238
23452A07238K5240p518j01788q636N9200M0504p6365n2266j0588l9825j7099k233
23440h4136K7106j7902Q944l556k0893l1810L1318L04p7358j05502L8359L6363
23428a98763J7188k8117J04065L7022n711P412Q7231j7180m3789J0300N1914K8214
23416D9786K4822k1160p6273m4326j7997L5775m1139J45860R4769J5040q0062
23405H5095j62570P8667K0875o5497J2563P8437K9630m1687o6740o3015L6223
23394e8019R4815K6141O9850q005j11257l063Q2261j3016o4637r0498m2273K1153
23382i6548j8292Q9602M9087K9672q861J0005l406p4167o407O1526J7071l270
23370D6012j5356M6512j8039q324q9071k6228P9820L3511n4808o3367K5843Q3497
$$ plain form
23452 107238 132478 124960 23172 14536 73736 114240 37875 -14391 -24979 -64804 -81903 -84136
23440 -84136 -57030 -74932 -65988 -69544 -90437 -122247 -90929 -90625 -167983 -273485 -235126 -198763
23428 -198763 -181575 -209692 -105627 -68605 -74316 -66904 20327 3147 -40642 -30342 21572 49786
23416 49786 74608 53448 -22825 -67151 -85148 -49373 -90512 55348 150117 165157 85095
23405 85095 -77475 1192 22067 -43430 -30867 47570 77200 35513 -31227 -94242 -58019
23394 -58019 36796 62937 132787 124782 13525 10462 92723 79707 15070 -75428 -117701 -96548
23382 -96548 -114840 -25238 23849 53521 44660 54665 51259 -22908 -29315 32211 49282 46012
23370 46012 30656 77168 59129 50805 -38266 -64494 15326 48837 -5971 -69338 -43495 40002
23358D0002o3956j1004J07059J83n6627m9729k0417M8140k8946n0254K4605Q258
23346e2686N7722N4396m0220j3508j1771J5520k6807K3232J02056m283o9115o4932
23334c0396o6048K7557N1371M5847N121p9909n4230L7355o143n508M0202j6180
23322e0961m6424L1584P0296P8437n3682o945j1078k8995m6311L2115j0970K2549
23310b0385K9234p620l7481n168K3484P8532l3238j30285j5690r061l2410N5235
23298a04853J37437L4050M6657L9142j23976l9245J5085k1281p221k0705k6847
23287g1757m2390J499j0882J07769P6580M4176p6087r1638m929P6315j732q9674
23275h2750L5498N7666r5685n2637J7794Q4928L9588k966j6910r29J8091M5770
$$ plain form
23358 40002 -23954 -34958 72101 72284 15657 -34072 -54489 -6349 -35295 -85549 -60944 -52686
23346 -52686 5036 59432 19212 5704 -6067 9453 -17354 5878 107934 103651 34536 -30396
23334 -30396 -96444 -68887 -17516 28331 33452 -46457 -100687 -63332 -69475 -74983 -34781 -50961
23322 -50961 -97385 -65801 4495 82932 29250 22305 11227 -17768 -64079 -31964 -42934 -20385
23310 -20385 8849 1229 -36252 -41420 -17936 60596 27358 -102927 -118617 -127678 -160088 -104853
23298 -104853 32584 66634 113291 152433 28457 -10788 4297 -16984 -24205 -44910 -71757
23287 -71757 -114147 -112648 -123530 -15761 60819 104995 28908 -62730 -67659 8656 6924 -82750
23275 -82750 -47252 10414 -85271 -137908 -120114 -35186 4402 1436 -15474 -16403 1688 47458
23263D7458o0134k2237L9181R142p1302J2916M2641M8415r7077L4109N0786P6939
23251A10837m6052n1280K050R867m3550M6411o4793r8036O838N8877P9932Q8593
23239I9694m3501k065M155l9626n4085J8781K2985o8R0054m6479o7012k6275N9733
23226A6291k9153J0731j6808j16323K2388L5728L0507l9335q602j2659L5195N4406
23214a7634k7055M1636r511j7984L9052j1684O319O766k9815j10503O8466K1945
23202d0002J5161K0076J082O5342K6597n5564l0214k9567j5394P6439J264p1948
23190c6728K1902m7690k3209J08295N7264p7880p7124j9844L0676J20912J06268
23179A62842q4040q2289K4474j6624N43n1330K7463k1680m7224Q4375N804k7210
$$ plain form
23263 47458 -12676 -34913 4268 13410 -57892 -44976 -2335 46080 -50997 -16888 33898 110837
23251 110837 64785 13505 15555 25422 -18128 28283 -36510 -134546 -127708 -68831 11101 99694
23239 99694 56193 54128 58283 18657 -35428 -16647 6338 6270 96324 49845 -17167 -43442 16291
23226 16291 -12862 -2131 -18939 -135262 -112874 -77146 -46639 -85974 -94576 -107235 -72040 -17634
23214 -17634 -44689 -3053 -12564 -30548 8504 -3180 3139 9905 -19910 -130413 -61947 -40002
23202 -40002 -24841 -4765 -3683 61659 88256 32692 2478 -27089 -42483 33956 35220 -36728
23190 -36728 -14826 -62516 -85725 22570 79834 1954 -75170 -95014 -64338 56574 162842
23179 162842 78802 -3487 20987 4363 4906 -46424 -18961 -40641 -87865 -3490 2314 -24896
23167b4896m9123N4152K2262Q3636k119L6100l0093r8058q8058k6115M7149M1443
23155c3720J7873o786J4907m7583p5607j226N598K8844J3045l4740p196l4028
23143a60619k0123P7697L7614K1118O9129l1940m8618m295N2731p034J5025Q5340
23131H6025P8127N4264J3270l0951o6639j13723o0179j17735K2267J09480M8427
23120B2633P6116K7640j6497n2673n9305l4833l1580o7483j5606R5446p810r3399
23108a57351J3036R3371L2650k968q333N8942M9807j0167K8081k9792j6749k3804
23096B6723j4870k9019L3807L5800Q131j8258p4457m9103J18128Q4343k6270r1924
23084C031k3347l2546R718O8756M4778j3739j941p5331O248M2560j6147K0730
$$ plain form
23167 -24896 -74019 -19867 2395 86031 83912 120012 89919 -8139 -96197 -122312 -75163 -33720
23155 -33720 -15847 -22633 -7726 -55309 -130916 -132142 -126544 -97700 -84655 -119395 -126591 -160619
23143 -160619 -180742 -103045 -65431 -44313 24816 -7124 -55742 -60037 -7306 -14340 685 86025
23131 86025 164152 218416 231686 200735 134096 20373 -39806 -157541 -135274 -25794 22633
23120 22633 98749 126389 109892 57219 -2086 -36919 -68499 -135982 -151588 -56142 -63952 -157351
23108 -157351 -144315 -50944 -18294 -21262 -29595 29347 79154 68987 97068 67276 50527 26723
23096 26723 11853 -17166 16641 52441 60572 42314 -32143 -81246 36882 121225 94955 3031
23084 3031 -20316 -52862 -43144 25612 70390 56651 54710 -20621 -14373 28187 12040 32770
23072C2770J7085K030j5220N4187j2120j03066P854K5715M5717k2519j21724j5205
23060a04496l8903O4085J63879M9384q9745K4587K511j1205n2856o5261P657l888
23048e4251p6170l6438k5100N2835k4461j8731M5168p430R2794K2531N027l0867
23036e5093q1148K1R9332J3157Q3021L2137J6161j8961L9234K6820l2995m4513
23024G7173n0313o2660m3658N2097J10175M5840k8353l8219m3558J3479m8770
23013a6767j2187m9627l7726M268J19885Q1742R0039l1993N877j02684j62662
23002a11835j17404Q0231P2631P311p2739M3633J9627k9634o2272P0612R4928
22991d911M995J3394l2432K1986Q2429K0212p3101n1409k4627M2315L454m7819
$$ plain form
23072 32770 49855 51885 36665 90852 78732 -24334 -16480 9235 54952 32433 -89291 -104496
23060 -104496 -143399 -79314 84565 133949 44204 68791 71302 60097 7241 -58020 -50363 -54251
23048 -54251 -130421 -166859 -191959 -139124 -163585 -182316 -137148 -144578 -51784 -29253 -24226 -55093
23036 -55093 -136241 -136220 -36888 -23731 59290 91427 107588 88627 127861 154681 121686 77173
23024 77173 26860 -35800 -79458 -27361 82814 128654 100301 62082 18524 32003 -16767
23013 -16767 -28954 -78581 -116307 -112039 7846 89588 179627 147634 153511 50827 -111835
23002 -111835 -229239 -149008 -76377 -69066 -141805 -98172 -78545 -108179 -170451 -99839 -4911
22991 -4911 84 13478 -18954 3032 85461 105673 32572 -18837 -43464 -1149 2305 -45514
22979d5514p2655P5713P2019M815k8432k2256M6673R48J840n0561Q968l787O4133
22966E1904N4410m1580O011J3345l18O8041n1112L3299N8418k0664p6948j60583
22954f5777q1570J08348R5867O4718J624M0941J3716j18326q6790m5603p9166
22943a52018p494J03727K7238N1377J2939m0515k1097J7693l8595K7458M090P8832
22931F3635L9366m0251M0659L4931K998p222J401n348o4513k2394m1901p6963
22919g5602m8418L9569O1267P595J4577j4824M2918L289K4208k2296k4510N374
22907A3147m4388q0207Q8261N7766m8688j06077n918N2311N4791m0929K5249k5536
22895f0218M0555K6113J6359j43086K9418M3052N8509J6888p2808l9486o191N8074
$$ plain form
22979 -45514 -118169 -42456 29563 34378 5946 -16310 30363 31311 33151 -17410 -8442 -12229 51904
22966 51904 106314 64734 70745 84090 83772 151813 100701 134000 192418 171754 94806 -65777
22954 -65777 -147347 -38999 56868 121586 123210 164151 177867 59541 -27249 -72852 -152018
22943 -152018 -159512 -55785 -28547 22830 35769 -4746 -25843 -8150 -46745 -19287 -15197 63635
22931 63635 103001 62750 103409 138340 141338 134116 135517 130169 65656 43262 1361 -75602
22919 -75602 -124020 -84451 -23184 -15589 -1012 -15836 27082 30371 54579 32283 7773 13147
22907 13147 -31241 -111448 -23187 34579 -14109 -120186 -126104 -73793 -19002 -59931 -34682 -60218
22895 -60218 -19663 6450 22809 -120277 -90859 -47807 10702 27590 -45218 -84704 -90895 -32821
22883c2821k3851L2154P0159m963j2833L9080J8375k8801k8382n4984N343Q4538
22871F3014K5744K7980M2429j0711j9838n2992j02197J3540O2563j5908k019Q335
22859C9940k8802J1462O6751K6936k1094j26465m2137m1552n8009M7958J05432
22848a9580M977l965m9865M2070L2103n836q742n5120J6792M947k4274M2737k116
22835b5872P129o0562n476n9541N8829R6010j04992P26L3863M6945q5367Q385
22823h9923J52578j5123j5367J7265J0325K2876n0560l9113P644m8225L0477L2561
22811A5415n1466m5086M7320l4842o7881j8845J17416J40658o6396k7810J2987
22800B1470L6416M7515o986p8479l5836o956K3328k5317L4406P3158r965j6238
$$ plain form
22883 -32821 -56672 -24518 45641 40678 27845 66925 85300 56499 28117 -26867 -21524 63014
22871 63014 88758 116738 159167 148456 128618 75626 -26571 -13031 49532 33624 31605 39940
22859 39940 11138 22600 89351 116287 95193 -31272 -73409 -114961 -172970 -125012 -19580
22848 -19580 -14603 -18568 -68433 -26363 5740 -96 -8838 -63958 -47166 -42219 -66493 -23756 -25872
22835 -25872 -18743 -79305 -84781 -144322 -85493 10517 -94475 -93749 -59886 -12941 -98308 -89923
22823 -89923 62655 47532 32165 49430 59755 82631 32071 -7042 602 -47623 -17146 15415
22811 15415 -36051 -81137 -33817 -68659 -136540 -155385 -37969 102689 36293 8483 21470
22800 21470 57886 105401 98415 19936 -15900 -22856 472 -24845 9561 82719 72754 56516
22788E6516P4295P8277k4164j13771J231r263m0260J2264M1204q4365j02476l727
22776a14239m3330P3320J3716N8834m5246K2879j4213r1420j1123q515k1080j4432
22764a94849J3201l2835K9561j561O0891R3891Q1519R2552J4000q3318k5995K0410
22752F7467j4326L4579j6099o8835q0967O3760J06581l8781j4453J6544q9635
22741c4165m4250m2801K7490M0584Q7066P2496j4225Q4385L4166m0555q9063q3446
22729b318J5213m2918J181L4292N3804o7561k8535P7787P6752O2997j8777m8585
22717A13332m256n1867n0755Q5997L2082J1511o608k1675m8315l9141M8087K7778
22705I6170J9961J131j9997Q031n2731n0061L453Q5530l3735l9467m3676O272
$$ plain form
22788 56516 130811 209088 184924 71153 72384 63121 22861 35125 76329 -8036 -110512 -114239
22776 -114239 -157569 -84249 -70533 -11699 -56945 -34066 -48279 -139699 -150822 -159337 -180417 -194849
22764 -194849 -181648 -214483 -184922 -186483 -125592 -31701 49818 142370 156370 73052 47057 67467
22752 67467 53141 87720 71621 2786 -78181 -14421 92160 53379 38926 55470 -34165
22741 -34165 -78415 -121216 -93726 -53142 33924 106420 92195 176580 210746 170191 81128 -2318
22729 -2318 12895 -30023 -28842 5450 59254 -8307 -36842 40945 117697 180694 161917 113332
22717 113332 109076 57209 6454 92451 124533 136044 129436 107761 59446 20305 68392 96170
22705 96170 116131 117262 97265 105296 52565 2504 5957 91487 57752 18285 -25391 -19119
22693a9119J8912R8385j05683j75507j2445N2274J01328J8266K69o6923K4324
22682f5919J4922N6487K2367L6224M0434l2051L5217k4407r3056o7371m4366J2019
22670a09500O317O6062R7743K0647O6747R410P273q6374p3630L4783P8265M1622
22658A59365o885m8826r6011m7957L7679K6677J6431k1734M8600o9303p3179Q1618
22646F475Q054l6966r359m8315m1530k0817O0575L4180J0156L960O0701k344o1322
22633c6552k3729J8253J6392p524o60j7039j24920r0976Q3380J08136N7103M8566
22621C0430M278O14N9452o5801l9163N1432k6174j9107Q4184O9152k9675j2204
22609A07418J8990k0825K9599l5640n7293R078n0880N510L2725K2442o483M9582
$$ plain form
22693 -19119 -207 98178 -7505 -183012 -195457 -143183 -41855 -23589 -23320 -90243 -65919
22682 -65919 -50997 5490 27857 64081 104515 72464 107681 83274 -9782 -77153 -121519 -109500
22670 -109500 -103183 -37121 60622 81269 148016 157426 164699 78325 4695 39478 117743 159365
22658 159365 152480 103654 7643 -40314 -2635 24042 40473 18739 67339 -1964 -75143 6475
22646 6475 14529 -22437 -31796 -80111 -121641 -142458 -81883 -47703 -37547 -33587 27114 24770 -36552
22633 -36552 -60281 -42028 -25636 -33160 -33820 -50859 -175779 -266755 -183375 -75239 -18136 30430
22621 30430 34708 35322 94774 28973 -10190 41242 15068 -4039 80145 149297 119622 107418
22609 107418 126408 105583 135182 99542 42249 51327 447 5957 38682 61124 54641 104223
22597A04223L8116l1613J0371L8141n7659o2015L1545N3949l8800L9283j4677
22586A10864n4444j06086q968J10621k6704o4655k6609J757n9902L5518Q4838
22575c770N9372j8150o3543q117j8432j1929N5689j5569k4833Q504o2926N3831
22563d9873J557k9132k6795N7407m9748k9671Q5235O9759N7121K1816J2215j5553
22551A04338j11287k2277P8749J3704k2642L3028J5606o3172p9379k2698K7142
22540d8888J6125k9354l5177k5635j8628J12536P2523l2780o2678m7506K1668
22529g7794K4649N9914k9468k5605Q19k8831L5253j5634Q290k1473L5567K3028
22517a1285p9554R890J8683k5118m7696K4997M2935J6382Q527K231j5451K0110
$$ plain form
22597 104223 142339 110726 121097 159238 101579 39564 71109 125058 86258 125541 110864
22586 110864 56420 -49666 -58634 51987 25283 -39372 -65981 -64224 -124126 -88608 -3770
22575 -3770 55602 37452 -26091 -34208 -52640 -64569 -8880 -24449 -49282 -40778 -103704 -49873
22563 -49873 -48316 -77448 -104243 -46836 -96584 -126255 -41020 28739 85860 107676 119891 104338
22551 104338 -6949 -29226 49523 63227 40585 73613 89219 26047 -53332 -76030 -48888
22540 -48888 -32763 -62117 -97294 -122929 -141557 -29021 43502 10722 -51956 -99462 -77794
22529 -77794 -53145 6769 -22699 -48304 -47485 -76316 -41063 -56697 -48407 -69880 -34313 -11285
22517 -11285 -90839 -80949 -62266 -87384 -135080 -110083 -67148 -50766 -42239 -40008 -55459 -35349
22505c5349l0513M8103O4506J0016l7012r8756k4625M1034J10077J05560M8915
22494B01956o8132p5200O5113n6558n5971o3476l3924M4541j235j7856q3172k740
22482a46654m0951R0481N6446m5983j9315P5239J77r390N8798n1869L5675L3597
22470C6251O3568j24995j04253N362n0478P4657N6034m9296k6428L1886k5925
22459a13617M1792j6122J9181L8605M1300N6937p5547n9036k3264K7211j0152
22448g2712l6306L6910k388N8119O709k7932Q675K6865K1842P3465k966j04392
22436a4111J4812Q3664O266P787o9932o6843Q221k082j4953j7434J05812O0630
22424A01837m1053o9490m9743p045k6237l814J6441O838r996o6429k4576P7000
$$ plain form
22505 -35349 -65862 -17759 46747 56763 19751 -79005 -103630 -62596 47481 153041 201956
22494 201956 133824 58624 123737 67179 11208 -52268 -86192 -41651 -42886 -60742 -143914 -146654
22482 -146654 -187605 -97124 -40678 -86661 -105976 -30737 -30560 -39950 18848 -33021 2654 36251
22470 36251 99819 -25176 -129429 -124067 -174545 -99888 -43854 -93150 -119578 -87692 -113617
22459 -113617 -71825 -87947 -68766 -30161 11139 68076 -7471 -66507 -89771 -62560 -72712
22448 -72712 -109018 -72108 -74496 -16377 -9668 -37600 -28925 -2060 19782 93247 90281 -14111
22436 -14111 701 84365 90631 98418 28486 -38357 -30136 -32218 -47171 -64605 41207 101837
22424 101837 60784 -8706 -58449 -65494 -91731 -95545 -79104 -72266 -82262 -148691 -173267 -96267
22412i6267P9668M9589J3217m3921n0259j4904M7060L4917N3146j5583k029J7329
22400G1963n369O386l4094K9659Q9603Q811q4004R168j5975k9757j01683m9885
22388a05177J12714L0772q2090O6181J1327J5275R548m762j1319N5885N2562J2171
22376A63087j00379p0699k1174l8482M8674j6059k1921M2246n394k4295K436O7014
22364B5054M7919n406k7342n2611r6125Q5411o2837N138Q8621O471j02644O2174
22352b6177N5963O7014j7721m8727M5418J899m666O015n8947j11527J821M1794
22340d7841N4815Q8037R982j2176l7132q2634K8389m926N1526R326p5718n3756
22328g2108m1667n6431J0091R852K8286j2702J07670P6467j1755N7660j350N1848
$$ plain form
22412 -96267 -16599 32990 46207 2286 -47973 -62877 -15817 19100 72246 56663 54634 71963
22400 71963 66594 72980 38886 68545 158148 166959 82955 92123 76148 46391 -55292 -105177
22388 -105177 7537 38309 -43781 22400 33727 49002 58550 53788 42469 98354 150916 163087
22376 163087 62708 -7991 -29165 -67647 -18973 -35032 -56953 -14707 -20101 -44396 -41960 25054
22364 25054 72973 67567 40225 -12386 -108511 -23100 -85937 -80799 7822 14293 -88351 -26177
22352 -26177 29786 96800 79079 30352 75770 77669 73003 79018 20071 -91456 -89635 -47841
22340 -47841 6974 95011 104993 92817 55685 -26949 1440 -3486 48040 57366 -18352 -72108
22328 -72108 -113775 -170206 -160115 -150263 -121977 -134679 -27009 49458 37703 95363 94013 145861
22316A45861j9657M2582j6563m5279p105n3817M5719L0105l0939n2938l4817M0236
22304D3388M5114r7760l4583O5985R3733p8084p9631N3317K7716N8713l0182l3253
22292C4473K3350R9949K6672j43083j15418m8129M9189m969j09755P651N7591
22281a22479O7768Q3204L9497n2920l1075O5720K4719N5214K9522n7748j18140
22270a6718n054j6826p8696J14335K2474n9102l1841O615Q605J15645N7741r1629
22258B5549j7482P2545N1988n6352p8164o8777o46Q0743K1577K8590l1088m5908
22246a7425K5977q313j9711l6123P415j9137l0529m4903K2734l2217j0638J6O3336
22233i9518K8665K1721M710L944M8753M9067m8230k3681J1911L1700o9000j0023
$$ plain form
22316 145861 126204 168786 152223 106944 99839 46022 91741 121846 90907 37969 3152 43388
22304 43388 88502 -9258 -43841 22144 115877 37793 -41838 11479 39195 97908 67726 34473
22292 34473 57823 157772 184444 41361 -74057 -122186 -72997 -77966 -187721 -180070 -122479
22281 -122479 -54711 28493 67990 15070 -16005 49715 74434 129648 159170 101422 -16718
22270 -16718 -21772 -38598 -117294 -2959 19515 -39587 -71428 -64813 -56208 59437 117178 25549
22258 25549 8067 80612 132600 76248 -1916 -70693 -71339 9404 30981 59571 28483 -17425
22246 -17425 8552 239 -19472 -55595 -48180 -67317 -97846 -142749 -120015 -152232 -162870 -162854 -99518
22233 -99518 -70853 -49132 -44422 -40478 8275 57342 9112 -14569 -2658 29042 -39958 -49981
22221d9981J1568o105q930m149N0950J6965j0318O399o4040J5115k223k270k6865
22208g3884m9246P3438R4953p939p0287J6533P3487p814n2186m1197r2152K0354
22196a15940N3493L2193n1013p8255J7300K1028N2979K5882l856N2818o672R090
22184I047J17762P5386k470j03286q7181L0198q246n6277K6613k7012l6121l7500
22172i9087O949l2236O3387O6852L5963l4433L2938L0330K1193j3262j7746l8396
22160B2452J9293Q5050n7816n6210p0325L3150j5164M1030J16598J9136n6619
22149H0575n5149k4392j0237p1679k8124R0413M0005k546r136j6596l1109O9513
22137C1538p1534r829j40m0600j4636Q0702L3470m1247n4258J1831L5863R358
$$ plain form
22221 -49981 -38413 -44518 -53448 -57597 -6647 10318 0 6399 -57641 -42526 -44749 -47019 -73884
22208 -73884 -123130 -49692 45261 37322 -32965 -16432 57055 49241 -2945 -44142 -136294 -115940
22196 -115940 -62447 -30254 -81267 -159522 -142222 -121194 -68215 -42333 -46189 6629 -43 9047
22184 9047 126809 202195 199725 96439 9258 39456 31210 -25067 1546 -25466 -61587 -99087
22172 -99087 -92138 -124374 -60987 5865 41828 7395 40333 70663 91856 78594 60848 22452
22160 22452 41745 126795 68979 12769 -57556 -24406 -39570 1460 118058 137194 80575
22149 80575 25426 1034 -9203 -80882 -109006 -18593 21412 18866 9730 -6866 -37975 31538
22137 31538 -39996 -49825 -49965 -90565 -105201 -24499 8971 -32276 -86534 -74703 -38840 -29482
22125b9482m952J8287M0629K8027K1109Q8307o4206o1360J34600o406l6579m9978
22113G7996l6569j4458N5945J5117j0045m0340p7474o9509J3654M6933K7786P747
22101c217K2337m5885k011Q74M7968J9311K1024m2938N0227j468n4412j09931
22089i8121l3898O1057L595q8596K7249O0968M5159k5310j5462O511p0909M761
22077a22996P5116L6185M3264P2492p4893o6840N280M9147N1566J2767j7247M8114
22065A11955l289P4469K4370k1675L576j45258k6645J6784Q394J6110k0536l0232
22053H023p8055k2187M6453J4370K4708j2477m5716j269P2455K4432Q0340l4045
22041G7032j4937o5343j09942l1987K9318J34169M4894l1650j9271j3117p5767
$$ plain form
22125 -29482 -34434 -16147 24482 52509 73618 161925 97719 36359 170959 164553 127974 77996
22113 77996 41427 26969 82914 98031 87986 47646 -29828 -99337 -85683 -38750 -10964 -3217
22101 -3217 19120 -26765 -28776 -27902 20066 39377 60401 17463 67690 66222 11810 -98121
22089 -98121 -132019 -70962 -67367 -155963 -128714 -67746 -22587 -47897 -63359 -56848 -127757 -122996
22077 -122996 -47880 -11695 31569 104061 29168 -37672 -32392 16755 68321 81088 63841 111955
22065 111955 108666 183135 207505 185830 189406 44148 17503 34287 42681 58791 38255 8023
22053 8023 -70032 -92219 -45766 -31396 -6688 -19165 -64881 -66150 6305 30737 111077 77032
22041 77032 62095 -3248 -113190 -145177 -115859 18310 63204 31554 12283 -834 -76601
22030g6601l3111l6837n2818O6080J23918k2280l4451O1459L8017m3459n5661
22019f5744k6092j9136J6963M8486L7332J9163M0159M0399r571l4266m8326j1992
22007a2625l0910l6848j0178M3736l7313K6123J28010P828p5106m1692k687O7731
21995B6069N680l0725l1150M5718n5795K4319J0830k6575n130j9469K2971J9083
21983a4174N3919L0401k4239q9531n0392J3765P0423M365m1631n9543J0220J4114
21971h2303L3573L9132K2572R1117R555j38351M660R3068M4230j1025k8062o2589
21959A5577j6303m6640M252K5399K4483j3506k9097N300j3960k3252k5969L2799
21947f0917J02018J8891J0524R225p6309J6836k2944r2250J643n6159J9161Q8908
$$ plain form
22030 -76601 -109712 -146549 -199367 -133287 -9369 -31649 -66100 -4641 33376 -10083 -65744
22019 -65744 -91836 -110972 -94009 -45523 -8191 10972 51131 91530 81959 47693 -633 -12625
22007 -12625 -43535 -80383 -90561 -46825 -84138 -58015 69995 77823 2717 -38975 -41662 26069
21995 26069 31749 1024 -30126 15592 -40203 -15884 -5054 -31629 -36759 -56228 -33257 -14174
21983 -14174 39745 70146 45907 -43624 -94016 -80251 -9828 -5463 -47094 -106637 -96417 -82303
21971 -82303 -48730 -9598 12974 104091 113646 -24705 -20045 73023 117253 106228 78166 15577
21959 15577 -726 -47366 -43114 -17715 6768 -6738 -35835 -30535 -44495 -67747 -93716 -60917
21947 -60917 41101 59992 70516 79741 3432 20268 -2676 -94926 -93283 -149442 -130281 -41373
21935d1373M1958m1038o4210m6878L7290K7337N7554r151p0566J1370j615l8562
21923a37884J1060M5941M4420q0272J2033L0788Q4171l9686l2811l222J5660J321
21911d8481N1280Q298M468J3911j7357m3001k6188o895k19N303L8098M9437j234
21898B7420j6865L2197L1005l2454p661M8038K2977j08042K4542K1477k9510m4586
21886c1462j06047M9580N2954K2540q840Q594l853M920O4811n3890q0470m022
21874h5185Q7841M9183m3532L3371K8390j6425n8855q99q6009m8940L0290P023
21862a03747J39039K0836Q8509L9646p5405j32390k1452P421q699n5806J04317
21851B269j9479q2929J6610M6497R2246M2966k0779r5115j39119K5500M005N472
$$ plain form
21935 -41373 585 -40453 -104663 -151541 -114251 -86914 -29360 -38511 -109077 -97707 -99322 -137884
21923 -137884 -126824 -80883 -36463 -116735 -104702 -73914 10257 -29429 -62240 -65462 -49802 -48481
21911 -48481 2799 11097 15565 29476 12119 -30882 -57070 -63965 -64184 -58881 -20783 28654 27420
21898 27420 10555 42752 73757 41303 33642 81680 104657 -3385 21157 42634 13124 -31462
21886 -31462 -137509 -87929 -34975 -12435 -21275 -12681 -16534 -11614 53197 -693 -81163 -85185
21874 -85185 2656 51839 8307 41678 70068 53643 -5212 -6111 -92120 -141060 -110770 -103747
21862 -103747 35292 56128 144637 184283 108878 -23512 -44964 -37543 -46242 -102048 2269
21851 2269 -17210 -100139 -83529 -37032 55214 98180 77401 -17714 -156833 -131333 -127328 -121856
21839a21856l6029n775O0961J10743n728K0856K3572m3195n1131k0144L3721P6985
21827D2980M6292j9560Q4672J6897r6311m851P6194J2981l3735k9996N438j3139
21815H7862k0981k0395R7426l7537p8423p0194k0978K0175O3624N2062N0661j6005
21803A07297p0818o8315J947L1496J7522o595o053K122K3522j1700k0832j2728
21791a3135L620p6993k0609O1843m7205N8996P115m6616P512O7264O7030k3618
21779D5204o2988k423Q4998k9223p7468m6270L9466l989M8701n4975l9504q709
21767a07180q9768N8420j202j8108P6027O0842J04993N6552k9311k3692k703m7990
21755C6880k5602Q6347R903p2379J4260J0156l6336j5282J6163J6033r043o3532
$$ plain form
21839 -121856 -157885 -163660 -102699 8044 2316 23172 46744 3549 -47582 -67726 -34005 42980
21827 42980 89272 69712 154384 171281 74970 70119 146313 159294 125559 95563 101001 87862
21815 87862 66881 46486 143912 106375 27952 -42242 -63220 -43045 20579 72641 123302 107297
21803 107297 36479 -31836 -29889 1607 19129 12534 6481 8603 32125 20425 -407 -13135
21791 -13135 -9515 -86508 -107117 -45274 -92479 -33483 -26368 -72984 -65472 1792 68822 45204
21779 45204 -17784 -20207 64791 35568 -41900 -88170 -48704 -52693 -3992 -58967 -98471 -107180
21767 -107180 -196948 -138528 -139730 -157838 -81811 -20969 84024 140576 111265 87573 84870 36880
21755 36880 11278 97625 107528 35149 49409 59565 23229 7947 24110 40143 31100 -32432
21743c2432k1896O4465N0336L7595K2561K0042o007l2580K628l7166l512n9386
21731D648q6794l1542j4980K790L6028Q1354n0691O2257M4588o8844j24727k2495
21719a68408N01L519K6797J04287l567P276k2656P9217J1577j2091j6639K0434
21707C0247K0454L7622j5167k6270r9936k4558P3342L6981P754P474n907k5446
21695A6590q3377o9384K3665K8757P7514L0405j9495K2089k4020j0403j2589K3558
21683C310K8321M3405j8665K5481o156k8530n5914K0183K1818M348L2635O4185
21671A34421n3850j14593l9081r233Q968o2888J7623M9479K8539M9071J25743
21660A34199l2573l0285J5533K2498l3190k8938M9504m6489N5697p8402j20700
$$ plain form
21743 -32432 -54328 10137 60473 98068 120629 140671 134664 102084 104712 67546 64034 4648
21731 4648 -82146 -113688 -128668 -125878 -89850 -8496 -59187 3070 47658 -21186 -145913 -168408
21719 -168408 -167907 -164388 -137591 -33304 -36871 -29595 -52251 26966 38543 26452 9813 30247
21707 30247 50701 88323 73156 46886 -53050 -77608 -4266 32715 40469 47943 42036 16590
21695 16590 -66787 -136171 -112506 -83749 -6235 24170 4675 26764 2744 -7659 -20248 3310
21683 3310 31631 75036 56371 81852 75696 47166 -8748 11435 33253 37601 70236 134421
21671 134421 80571 -34022 -73103 -82336 -73368 -136256 -118633 -69154 -40615 8456 134199
21660 134199 101626 71341 86874 109372 76182 47244 96748 50259 105956 27554 -93146
21649i3146j2250L0048M0219M6519N4870q418K6046m2812l937k066j05501m4207
21637a14635p2974K5405Q6250L0336P0223K9336m638L751l7672q238K2248k0043
21625I349l1292L6184N7628m0671m4968m9234k7494N614j5707K9530N1529N7359
21613C7827K1816k937j015j6020j1518m9344j0491K6271N801K7886m247k0163
21601C866r003j9796M8354L4043m3913N1914L7917q3716m1131Q4237M8125l1907
21589G8990m9487m9664J5570k4797o8349o4916J6513j0790m175M2030J4566j0005
21577a14514O519M9155O8551P3048k5541j22790n2020r282j0320l1742M4390L5351
21565h9195m3104Q6544j9465J0119J0369M1993K3643j3960M2939J3002p534q0565
$$ plain form
21649 -93146 -105396 -75348 -35129 11390 66260 57842 83888 41076 37139 35073 -70428 -114635
21637 -114635 -187609 -162204 -75954 -45618 24605 53941 49303 53054 15382 7144 29392 9349
21625 9349 -21943 14241 71869 31198 -13770 -63004 -90498 -84884 -100591 -71061 -19532 37827
21613 37827 59643 56706 55691 39671 28153 -21191 -31682 -5411 390 28276 24029 3866
21601 3866 -5137 -24933 23421 57464 13551 65465 103382 19666 -21465 62772 110897 78990
21589 78990 29503 -20161 -4591 -29388 -97737 -162653 -146140 -156930 -161105 -119075 -104509 -114514
21577 -114514 -107995 -58840 9711 82759 57218 -65572 -117592 -126874 -137194 -168936 -124546 -89195
21565 -89195 -132299 -45755 -65220 -55101 -44732 -2739 20904 6944 49883 62885 55351 -25214
21553b5214m1190P5494Q9436l0248k4374l0235m0531k1546p359m9402R6360O1055
21541E2246k4264m9529j915L9621k8100n2587M8553O3562K0508p4554o4657M2328
21529b8788P9546o67N3534l291n2726L0080O8111M1696l5974q2159q1766j1890
21517b4294J3030n5580m3856K7136k9062n5451q1243P90K9222M2784P7969J02184
21505C629o0647K7669n1450k2931L9744j1194M4435L3994L9529K074Q171l5192
21493A7831j4481o1026q7775r028L2560P0519K4208l5624j9484j281r8679M5022
21481a37238J03804j3049k3642n1875K635r724k5977Q6546O1207K7003j2527j96179
21469a89016K3626Q6924J00462M9638o5215j4224J7447m8128P1173J333l4178
$$ plain form
21553 -25214 -66404 9090 98526 68278 43904 13669 -26862 -48408 -55767 -105169 -8809 52246
21541 52246 27982 -21547 -23462 16159 -11941 -64528 -15975 47587 68095 -6459 -71116 -28788
21529 -28788 50758 50091 103625 100334 47608 77688 145799 187495 151521 69362 -12404 -24294
21517 -24294 -11264 -66844 -110700 -83564 -112626 -168077 -249320 -248530 -219308 -176524 -98555 3629
21505 3629 -57018 -29349 -80799 -103730 -63986 -75180 -30745 3249 42778 44852 53023 17831
21493 17831 3350 -57676 -145451 -154479 -121919 -51400 -27192 -62816 -82300 -83581 -182260 -137238
21481 -137238 -33434 -46483 -70125 -122000 -119365 -129089 -155066 -68520 -7313 19690 7163 -189016
21469 -189016 -165390 -78466 21996 71634 6419 -7805 9642 -38486 32687 34020 -158
21458a58l6459K5355L3904m4339P725M8228l6825k1277j22340r9775P8805J43316
21446b3840J00784r975J4655o9866n2155r0798m9424P781L7099O5883K2763M6433
21434f60K2412m728M7710k1927o412j07796j3137O6791l3897J0296M0489l3340
21422c4199q6085R1385R6347l9437r575m9711K4840J46138j05536r5263K5573
21411c5523J15970K561Q226p8510m3342N2571K2766J2660m2356J9431Q6363j5320
21399A05497n8270J7042M5395M6674J6117j0277k6694m1427k3443J8517N2960
21388A42091l7693k0962P6010J9478m3712o2995r2967q43J0703N6875k5070k1469
21376e54J04640o8541N231k9387M3419o7152L2449J7765L5934k0180l0167m4424
$$ plain form
21458 -158 -36617 -11262 22642 -21697 -13972 34256 -2569 -23846 -146186 -245961 -167156 -23840
21446 -23840 76944 66969 81624 11758 -40397 -131195 -180619 -172838 -135739 -69856 -47093 -660
21434 -660 21752 17024 64734 42807 36395 -71401 -84538 -17747 -51644 -41348 -859 -34199
21422 -34199 -120284 -28899 67448 28011 18436 -31275 -6435 139703 34167 -61096 -35523
21411 -35523 80447 83008 91234 12724 -30618 21953 44719 57379 15023 34454 120817 105497
21399 105497 47227 64269 109664 156338 172455 162178 135484 94057 70614 89131 142091
21388 142091 104398 83436 159446 178924 135212 72217 -20750 -21593 -10890 45985 20915 -554
21376 -554 104086 35545 40776 11389 54808 -12344 20105 37870 73804 53624 23457 -20967
21364b0967K0958J5090k7022l6589K5038l2024j5689J0909N0770J2928N3194K7054
21352H3650q5820n0895J7966j9817o0474p1572P2331J00522o222r0354K9675R7790
21340A6780l2583j9261L3115R3099J8652l8100l9073l7089n392K4995P3015O3788
21328A51946j2912j2805o5086l8546o155O1803L8332p0624L4703M6487J938p3680
21316E5401l7701N7712O9176L0722j00700o3889n2957j8072L1455K4973K1686
21305A7806J2851M7096n0773L0510K2174K92o4731m0488K0495l1435l5087M5618
21293b5672K1855l3273l8599j875K8254J0415M3952J550Q7247N1316l0369m6524
21281F8277M8342L1446j0397p7326K3984n6210m9710N3657n6797R430L1829k4146
$$ plain form
21364 -20967 -9 15081 -11941 -48530 -23492 -55516 -71205 -60296 -9526 3402 56596 83650
21352 83650 -2170 -53065 -35099 -54916 -115390 -186962 -114631 -14109 -20331 -110685 -81010 16780
21340 16780 -15803 -35064 -1949 91150 109802 71702 32629 -4460 -9852 15143 88158 151946
21328 151946 139034 126229 61143 22597 16442 78245 116577 45953 80656 127143 129081 55401
21316 55401 17700 75412 144588 175310 74610 10721 -42236 -60308 -28853 -3880 17806
21305 17806 30657 77753 26980 57490 79664 79956 15225 -25263 -4768 -36203 -71290 -25672
21293 -25672 -3817 -37090 -75689 -77564 -49310 -38895 5057 6607 93854 145170 114801 68277
21281 68277 116619 148065 137668 60342 84326 28116 -21594 32063 -24734 -15304 16525 -7621
21269g621M0962M7750j3973M0049K4353m372l8566j55926k4637R0777n4051m0790
21257i6045M5835n186N8907J46366K4531q3293O1601M1713k7413j14443o9551
21246a6978R497O2500q203l5536m1515L9788P6661L1109R328p6834p6272M6641
21234B0186K7940N707l9497O8600P2980k6865o6910n695r230l0709r4970m301
21222h2764K7840n2490q9506N7939J8331J10626K3128k991L3335L1821o7221m5764
21210c7716J7265O7481k0170j8114m8619R2406m9110J9165j0065Q8866N0182o1536
21198I0035p6320J0968m6558l5348j5116N0623J7302J9976n2516l6013K0027j9659
21186g2599p0241n194J22703M6093M5963j03361k7841N1102R3121r68l3489k5339
$$ plain form
21269 -7621 33341 81091 67118 107167 131520 127148 88582 -67344 -91981 -1204 -55255 -96045
21257 -96045 -50210 -55396 3511 149877 174408 91115 152716 194429 167016 52573 -16978
21246 -16978 -7481 55019 46816 11280 -30235 9553 86214 117323 126651 49817 -26455 20186
21234 20186 48126 53833 14336 82936 155916 129051 62141 56446 47216 16507 -78463 -82764
21222 -82764 -54924 -107414 -196920 -138981 -120650 -10024 13104 10113 43448 75269 8048 -37716
21210 -37716 -20451 47030 26860 8746 -39873 52533 3423 22588 12523 101389 151571 90035
21198 90035 13715 24683 -21875 -57223 -72339 -21716 -4414 15562 -36954 -72967 -52940 -72599
21186 -72599 -142840 -148034 -25331 20762 66725 -36636 -64477 -13375 79746 78778 45289 19950
21174A9950K4382L3641l203k7608l2236l8274L0891J3246l2713k7925r5003R746
21162a25106O4744P4859K8085L6675k3106m6120l2454L5605L4890K287o2530p9677
21150i1848o7797K3904O3557M0079M2732n1559j5077R8393O5151k3723k6926m578
21138E2308N0512k866n5482j5474K6586l9522q4861j2007q764j6075k6710Q1500
21126e0855j7326m0444Q267O0103P0254k3902p2766l5967M1819K3389J2507l6291
21114f1212J5145M397L0541O0377L0607n355M4264k7721k1385K6398M6091K9710
21102A71857n2821q9763p2809n86p3511L6792K0585M302N0257J673O5734j7806
21090D3904m0800j35K4336k983m4295j3199l027L4058N0281N0396k0558k5610
$$ plain form
21174 19950 44332 77973 74770 47162 14926 -23348 7543 20789 -11924 -39849 -134852 -125106
21162 -125106 -60362 14497 42582 79257 56151 10031 -22423 13182 48072 50359 -12171 -91848
21150 -91848 -159645 -135741 -72184 -32105 10627 -40932 -56009 42384 107535 83812 56886 52308
21138 52308 102820 99954 44472 28998 55584 16062 -68799 -80806 -89570 -105645 -132355 -50855
21126 -50855 -68181 -108625 -100358 -40255 29999 6097 -66669 -102636 -60817 -37428 -24921 -61212
21114 -61212 -46067 -41670 -11129 49248 79855 74500 118764 91043 69658 96056 142147 171857
21102 171857 119036 29273 -43536 -44122 -117633 -80841 -60256 -55954 -5697 -4024 61710 43904
21090 43904 3104 2969 27305 24322 -19973 -33172 -36199 -2141 48140 98536 77978 52368
21078E2368p4255j2237K2717L8768m0118o0534L4213n999J4327o627l0639l0870
21066i8886M5573J75958P9670p3002j7484j3706q8082p4324o9559J3180M0801
21055g9861P8344J22323L7716j7602j07376j04039r6086k2409l4988M2275R6694
21044h5009R8767L0374l8780j5748J5653j2004N3492l5608J7921Q0761n9972j37357
21032h7510L3361R1447J9351n3493J800L3040O923l8446m965o0141K0023Q8508
21020D9898L8537k3442o2278p6536k1028M1146Q5397Q6400Q962o8987q6015l7307
21008f5253J4805Q5521O7104n1409n0445k0515L2482n7445o2739L8050R8474J34192
20996A62822j0308q7997p8760j2791k616K8641L3808r2699m4042M1496L3705O7348
$$ plain form
21078 52368 -21887 -34124 -11407 27361 -12757 -73291 -39078 -45077 -30750 -37377 -68016 -98886
21066 -98886 -53313 122645 202315 129313 111829 98123 10041 -64283 -133842 -120662 -79861
21055 -79861 -1517 120806 158522 140920 33544 -70495 -166581 -188990 -223978 -181703 -85009
21044 -85009 13758 44132 5352 -10396 5257 -6747 46745 11137 29058 109819 49847 -87510
21032 -87510 -54149 37298 56649 3156 4956 37996 44919 6473 1508 -58633 -38610 49898
21020 49898 88435 64993 2715 -73821 -94849 -53703 31694 118094 127056 58069 -27946 -65253
21008 -65253 -50448 35073 102177 50768 323 -20192 12290 -45155 -107894 -69844 28630 162822
20996 162822 152514 64517 -14243 -27034 -29650 -1009 32799 -59900 -103942 -62446 -28741 38607
20984C8607J1076K2712j783L5101o2541J6494K9731k0049j13536J4918J13116
20973H3846K907M2413k3196p1504M5992J7718p9035j34965o8998j916L0160M8262
20961a08316J1769M5161M6902k4998r4740n2848J6257k8257J8452l177J6251o5266
20949b22810L4095J54133K0372q069K8842J8341l9834M2823J02039K6187r1931
20938F4188j36154l4576j6029j7553P2956J17186n0784N8983M4471j9666n070
20927G7952k1333L5527q8996r7646l7850J26246M5697J7825n2775J0635J60218
20916A75500O472p7403J1748P2489q1194o7307L6692j1252n4082m2812J9787l608
20904a4970k4322q1823p851j8390m4442M7712L3925M3824L835k7385r036j45679
$$ plain form
20984 38607 49683 72395 70612 105713 43172 59666 89397 69348 -44188 -29270 83846
20973 83846 86753 129166 105970 34466 80458 98176 19141 -115824 -184822 -186738 -156578 -108316
20961 -108316 -96547 -51386 -4484 -29482 -124222 -177070 -160813 -189070 -170618 -173795 -157544 -222810
20949 -222810 -188715 -34582 -14210 -22279 6563 24904 -14930 27893 129932 156119 64188
20938 64188 -71966 -106542 -122571 -140124 -67168 50018 -766 58217 102688 83022 77952
20927 77952 56619 92146 3150 -94496 -132346 -6100 39597 57422 4647 15282 175500
20916 175500 181972 104569 116317 188806 107612 40305 76997 65745 11663 -31149 -11362 -14970
20904 -14970 -39292 -121115 -128966 -147356 -191798 -144086 -110161 -66337 -62502 -89887 -98923 -244602
20892b44602m9010J1765J02019J26310J4448J5006N5790n4326k4981K5359k7383
20881d9605r316Q8917J21900M419p2924M4262n5204n9368j1465J1098j387q564
20869B763O8844P1546n2028r8247m0402P5178L780l5929L9712k2980k9753k5020
20857d2536L8528k6638m432M6424J0999K7351o2671l3659J2238O231J1329l8927
20845e5763N2367M2690k995k3305M0523j1456l017K569l7143Q365M4475l5599
20833B1711p3181j00104m3347K622J03542N2124q4802j1800J10013j0989j6922
20822e1133n8687l3445J1470R41K9489Q3861j4774O0665k6283k3855J5819M0029
20810C4097J3392o3717j7714O4609J3697j3358k7767L3383M7940L755o6234n1251
$$ plain form
20892 -244602 -293612 -281847 -179828 -53518 -39070 -24064 31726 -22600 -47581 -22222 -49605
20881 -49605 -58921 29996 151896 156315 83391 127653 72449 13081 1616 12714 11327 2763
20869 2763 71607 143153 91125 -7122 -47524 27654 31434 -4495 35217 12237 -17516 -42536
20857 -42536 -4008 -30646 -35078 11346 22345 49696 -12975 -46634 -34396 -28165 -16836 -55763
20845 -55763 -3396 39294 36299 12994 53517 42061 39044 41613 4470 12835 57310 21711
20833 21711 -51470 -151574 -194921 -192299 -88757 -36633 -121435 -133235 -23222 -34211 -51133
20822 -51133 -109820 -143265 -131795 -130854 -101365 -17504 -32278 28387 2104 -21751 -5932 34097
20810 34097 47489 -16228 -33942 30667 44364 31006 3239 36622 84562 88317 22083 -29168
20798b9168p4770J1426N5966K6131o2258m0652o335R442J0155m8320M145N8461
20786h5777O4265R156L6305M5465m4441R1238M1889r0590l8848k2547k0299l6443
20774e0627j8276p9336L8787M1451j3853P2496J33895k5860j70381L0872l0296
20763g1128o2750n5853K1539P08Q0894P9176l0500j3167O5901P5716m5654k2423
20751B2459M5746k7492n2735L1233J4839l9708q6004J4719L6656l0687P1315P823
20739H164k7182n9965K2101O004K9810R3239j29m0407M664r7549O9069J4025k509
20726A9335j0869n0175K6402K1837K9491N4868L4325L7210o7833p5171o451J2270
20714B5239J9429M9078K7456r256J0992l5626m9126j13403p7380L9298K6570O4887
$$ plain form
20798 -29168 -103938 -92512 -36546 -10415 -72673 -113325 -119660 -110218 -100063 -148383 -144238 -85777
20786 -85777 -21512 -12356 23949 69414 24973 116211 158100 67510 28662 6115 -14184 -50627
20774 -50627 -68903 -148239 -109452 -68001 -81854 -9358 124537 98677 -71704 -40832 -71128
20763 -71128 -133878 -189731 -168192 -167484 -86590 -7414 -37914 -51081 14820 90536 44882 22459
20751 22459 68205 40713 -12022 19211 34050 -5658 -91662 -76943 -40287 -70974 341 8164
20739 8164 -19018 -78983 -56882 -50878 -21068 72171 72042 31635 36299 -61250 7819 21844 19335
20726 19335 8466 -41709 -15307 6530 36021 90889 125214 162424 94591 19420 12969 25239
20714 25239 44668 93746 121202 111946 122938 87312 38186 -75217 -152597 -113299 -86729 -21842
20702b1842K3022L1476m7724J7364P7343j5043o4342n2682M260N1108m4882k2690
20690f4632P8732P328n3083N6401j8920K3488P4253P3844N5898l3050j33755n8330
20678H174n5137k2628J11149O1087J4107L0156J7594K3796L4870O058j28266l3592
20666F7368O25N281j4041Q6842M4071m8713o7978k5301l9216K6369Q6529J1453
20654A33289m2829j6055L457J850J5014J4732K5416l7012k3948J13769l985q8800
20642I4898p7009L3388O4284M2512p022j18977o5612l6567P7941O5278l9096k7293
20630F725L8592J7294n8310J4283Q8807N7268J1042m2542q4311n2600j6471P0113
20618D9890K687q1016r3612L4393o219o087O338m2115o7226P5387M4337K1016
$$ plain form
20702 -21842 1180 32656 -15068 2296 79639 64596 254 -52428 -48168 2940 -41942 -64632
20690 -64632 14100 21428 -31655 24746 5826 29314 103567 177411 233309 200259 66504 8174
20678 8174 -46963 -69591 41558 102645 116752 146908 164502 188298 223168 229226 100960 67368
20666 67368 67993 73274 59233 146075 190146 141433 73455 48154 8938 35307 121836 133289
20654 133289 90460 74405 77862 79712 94726 109458 134874 97862 73914 187683 183698 94898
20642 94898 17889 51277 115561 158073 151051 32074 -33538 -70105 7836 73114 34018 6725
20630 6725 45317 62611 4301 18584 107391 164659 175701 133159 48848 -3752 -20223 49890
20618 49890 52577 -28439 -122051 -87658 -93877 -99964 -93626 -135741 -202967 -127580 -83243 -62227
20606f2227p990n667J2864j0445N2245p6097m7656J29347P7685J4281O2700j6348
20594A22692m7339j7488J2382K4450L375j8491L1611j4762k7615J4484q951m868
20582F9480k1844J3022q1033r3513j2582j4315P9562L7953L3434K9651o080j4083
20570A9652M8674k6432o8380k5295M937J35200K3952M218M083r0955k6472L2312
20558C5494p457j0445P9029k0594K1100p155m8239j0110M7086J17486j1068l3264
20546A51863l2471q4778p526J5964J6734m6906L5629J0771Q1749j3181j3307K6872
20534A41413j7053m5184p231p2902j4003J15094M8337k789q965j04972j5213L7421
20522E3953m9775o7325J094M5135K0408l556M7420L9467n6783o4443P8390K6576
$$ plain form
20606 -62227 -70217 -75884 -63020 -73465 -21220 -97317 -144973 -15626 62059 76340 139040 122692
20594 122692 75353 57865 70247 94697 98072 79581 111192 96430 68815 83299 74348 69480
20582 69480 47636 60658 -20375 -113888 -126470 -140785 -61223 -23270 10164 39815 33735 19652
20570 19652 68326 41894 -26486 -51781 -46844 88356 112308 116526 120609 29654 3182 35494
20558 35494 28037 17592 96621 76027 97127 89972 41733 31623 78709 196195 185127 151863
20546 151863 119392 34614 27088 43052 59786 12880 48509 59280 141029 127848 114541 141413
20534 141413 124360 79176 71945 -957 -14960 100134 148471 145682 136717 31745 16532 53953
20522 53953 4178 -63147 -62053 -16918 3490 -66 47354 86821 30038 -34405 43985 70561
20510G0561k8472L6900J6962j5787k0669j0290j3957n1259J16J4796l1712j8396
20498e1207N2758O6549l8321p4740l4294J5979J22346J4968q8849n0922L522R9682
20486C7471J5138L4017K3272m1388R0417o3L4416Q0523o8383l7843J8176j1091
20474A74662m9287n007K7070p4613q3925J0114J0664L1101J6075K4747j0365P0324
20462A41560l8918m8036L3873o8295p6185K9153Q1621J0176m187l8086K6345P8562
20450A27583M1086j30294j4843P4557N1499M5956L7693j2341k6716p5815n431
20439A12934n6467r9565n3007J6484Q1131N3125P7520j8307o2951j8687p3634
20428d1424j21230R0643J06494R9227n764p6482p5604O7491K5232m43n3469O637
$$ plain form
20510 70561 42089 78989 95951 80164 59495 49205 35248 -16011 -15895 -1099 -32811 -51207
20498 -51207 1551 68100 29779 -44961 -79255 -63276 59070 74038 -14811 -65733 -62211 37471
20486 37471 52609 86626 109898 68510 158927 158864 193280 273803 205420 167577 185753 174662
20474 174662 125375 120368 147438 72825 -11100 -986 9678 40779 56854 81601 71236 141560
20462 141560 102642 54606 88479 20184 -56001 -26848 54773 64949 60762 22676 49021 127583
20450 127583 168669 38375 23532 98089 149588 195544 233237 220896 194180 118365 112934
20439 112934 56467 -43098 -96105 -79621 1510 54635 132155 113848 50897 32210 -41424
20428 -41424 -162654 -72011 34483 133710 127946 51464 -24140 43351 68583 68140 14671 21308
20416B1308r389J3222O1420k1740n5779K7329k376l1063L2412N7497O0691R796
20404A63328o3399m4557L4776R2468l5947j08242n2884P9662M3154L6061K5961
20393A70381r4115j32043J1597J00485p4256p8303J6495K4209J02309M7137K6502
20382A20398j06005m9967j09468k4469J25939R1429K4325L6040j9638j01594p7162
20371i0172m014Q1368L3523L9507n6595Q641L357o068M0312r387k4166J12432
20359A28738q145j25667n0008l3071K2180R4880J7237l4548J6786J1417K976k0028
20347B2747P0507R0235l9943m4428j37831k0475K2035p795N4127K3651M457L8027
20335G5314J979L5016K6136K388p5662j5366j0443j7250J03985m7952j3466Q8762
$$ plain form
20416 21308 11919 25141 86561 64821 9042 36371 33995 2932 35344 92841 153532 163328
20404 163328 99929 55372 90148 182616 146669 38427 -14457 65205 108359 144420 170381
20393 170381 76266 -55777 -44180 56305 -17951 -96254 -79759 -55550 46759 93896 120398
20382 120398 14393 -35574 -145042 -169511 -43572 47857 72182 108222 88584 -13010 -90172
20371 -90172 -94186 -12818 20705 60212 3617 12258 15615 9547 49859 40472 16306 128738
20359 128738 120593 -5074 -55082 -88153 -65973 28907 46144 11596 28382 39799 42775 22747
20347 22747 93254 183489 143546 99118 -38713 -59188 -37153 -44948 9179 32830 37287 75314
20335 75314 77293 112309 138445 140833 65171 49805 39362 22112 126097 78145 64679 153441
20323A53441p4485N0O6723o635j5556j04783r0520O326j4971J27671l0104k447
20311A4710m8478J2218q241J4077P5142J31870L2521n6635j06892K7057M4050
20300A31399L805P894L0600M218l6146o861o2442k3103l321R6951k1089o7174
20288E4731M1910N5719L2865L8929q954r6457m6143j1493O3125l2692j2620r9771
20276b0851j25217N1523J00420M513M4228J21408K377k3306l0077k7658p4858
20265B2502Q6109Q2215M003l8017n9395m9497J8816K0890k2731k6096j4086N0201
20253G4914M0456l8814o5745j183M0506J1206L2311J4714K8834p1399j38168L2601
20241c9767M5286J7401M376r484j7437n2506p415l37J12318O7624r587l3922r3237
$$ plain form
20323 153441 78956 79006 145729 139094 123538 18755 -71765 -65439 -80410 47261 17157 14710
20311 14710 -33768 -21550 -29791 -15714 59428 191298 223819 167184 60292 87349 131399
20300 131399 135204 143098 173698 177916 141770 134909 72467 49364 46043 142994 121905 54731
20288 54731 96641 152360 185225 224154 215200 118743 72600 61107 124232 91540 78920 -20851
20276 -20851 -146068 -94545 5875 10388 54616 176024 178401 155095 125018 97360 22502
20265 22502 108611 190826 194829 156812 97417 47920 66736 87626 64895 38799 24713 74914
20253 74914 115370 76556 10811 9628 50134 61340 93651 108365 137199 65800 -72368 -39767
20241 -39767 5519 22920 27296 17812 375 -52131 -59546 -59883 52435 120059 110472 76550 -16687
20228a6687k3266J3766O4193P2196K2144j140j5585K2165p6288j03186K2601N7855
20216C8768N7872j0248j2871l8095o2509K1233n4751P651M8177N4760J18o2543
20204a2438k4673L441P473k1085R3434L7693R396m3282K9303j4209l1457m4626
20192a1030j8280R0489J06584L5476n9591j38605K402k4214o4269M0940K3642
20181a6456P1855o5671M685l8090R7031J42425N8049p3417r7380L6497N8514N9608
20169B37650M3787o0563L989o2852q0398j1697o963K5809J23512M3240L2932r6151
20157A92295o2400l7537p3364j7890k0879J5671R0975o2688m1297r677K7862l6942
20145c5871k384m8681M9903O6119m5185n3872N854L4632o9932j975R0593l1523
$$ plain form
20228 -16687 -39953 -26187 38006 110202 132346 131206 115621 137786 61498 -41688 -19087 38768
20216 38768 96640 86392 73521 35426 -27083 -5850 -60601 -52950 -4773 49987 50105 -12438
20204 -12438 -37111 -33670 -26197 -47282 46152 83845 93241 49959 79262 65053 33596 -11030
20192 -11030 -29310 61179 167763 203239 143648 5043 7445 -16769 -81038 -40098 -16456
20181 -16456 55399 -10272 -5587 -43677 53354 195779 253828 180411 83031 119528 178042 237650
20169 237650 281437 220874 224863 162011 81613 69916 62953 88762 212274 255514 288446 192295
20157 192295 129895 92358 18994 1104 -19775 -4104 86871 24183 -17114 -26791 1071 -35871
20145 -35871 -38255 -86936 -37033 29086 -16099 -69971 -64117 -29485 -99417 -101392 -10799 -42322
20133d2322l4965N3541Q3987M2145K0254j14616o3887O6114J4452m2402J03711
20122H6012m0281o5740l4596N5538N0900N6826n0984j5617J8078Q0102m668n8548
20110G7022L1823K1914O4704O9257o8223m6672l7271R572P7796o1167m3008J2745
20098A08492L7161L944J8523n1237O1546J1050p1951n6472j7652o5817L4702J8187
20086C0476p3810k3453N2856N8116N0056k8624m8354K3609M3448L5644m6396k1314
20074E2254J36816K8148r4908p1680j0458R750K9935R76K5333n0764n8250l100
20062e948n1605J17632K3906o7976N2965L1535k1581J411M7794J0031J6713j4803
20050A40074m3405m3567j1343N5472k9550p6023l7645L1806o5081n308M799L8824
$$ plain form
20133 -42322 -77287 -23746 60241 102386 122640 8024 -55863 10251 24703 -17699 86012
20122 86012 45731 -20009 -54605 933 51833 108659 57675 42058 60136 140238 135570 77022
20110 77022 108845 130759 195463 264720 196497 149825 112554 122126 199922 138755 95747 108492
20098 108492 145653 149597 168120 116883 178429 189479 117528 61056 43404 -22413 12289 30476
20086 30476 -43334 -66787 -13931 44185 94241 65617 17263 40872 84320 119964 73568 52254
20074 52254 189070 217218 122310 50630 40172 49922 79857 80833 106166 55402 -2848 -5948
20062 -5948 -57553 60079 83985 16009 68974 100509 78928 80339 128133 138164 154877 140074
20050 140074 96669 53102 41759 97231 67681 -8342 -45987 -14181 -79262 -84570 -79771 -40947
20038d0947L7634j2313K4170J00130r600N9988N0349q8261m9546r5830n9305Q8398
20026D867P5555k4993k437L5579O1840m6915m1007l1647l6560L1128N2537j4139
20014F3808M8788N3309j4451J08956O2537m6583l3495j1906r602k9290p6607n0887
20002F4577J2665l3610J6862J180p1284N2791K8702k3859M2880L0613l7184M0198
19990A24531q755o7945n847m5547O069L1922l3391q3376K4403M1048O5365k6023
19978B2454P0651N1032J1883Q2217O5065j7505j57622j23681p5426K8970P4862
19967C2900Q4129O0849l1969k2197j09731M0087Q1878K3960m0254N675p4028Q660
19955E9959L3152k5130N7497P2742j4252M7567l421m6089j517O9998J3079M616
$$ plain form
20038 -40947 -3313 -15626 8544 108674 99074 159062 209411 121150 71604 -24226 -83531 4867
20026 4867 80422 55429 52992 88571 150411 103496 62489 30842 -5718 25410 77947 63808
20014 63808 112596 165905 151454 260410 322947 276364 242869 230963 221361 192071 115464 64577
20002 64577 77242 43632 60494 61674 -9610 43181 71883 48024 90904 121517 84333 124531
19990 124531 115776 47831 41984 -3563 2506 34428 1037 -82339 -57936 -16888 48477 22454
19978 22454 93105 144137 156020 238237 303302 285797 128175 4494 -70932 -41962 32900
19967 32900 117029 177878 145909 123712 13981 54068 135946 159906 119652 125327 51299 59959
19955 59959 93111 67981 125478 198220 183968 231535 228114 182025 180508 250506 263585 268201
19943B68201j8079q0292k1963l8685n7934J3365R4592M877n5915o4938N570j06390
19931e7591K3991M5285K6907Q2158K1650j0018j0764l0749j03385L4834P9104
19920A01422N260N7224K0847m1311k7457J743P2730j0518j8137j477L0047n268
19908A85105n0222O7278K8809l3636j12806O2445J18843l7512k1816J3996j2866
19897B07618q0567k6117M9455M7986m1390m715J3461m227n3066m1232N1457m4297
19885G4366L8344k4590m6336n9962j1477J12782L2087k3315J5698R7234Q7905
19874B92736j00465n701J5914j1441j0714n2910N6787L296l5394k0020j134K5116
19862A56070M6200Q1881m8802q9979n9201O5229n4235k2394J21003J2851o6022
$$ plain form
19943 268201 250122 169830 147867 109182 51248 64613 159205 164082 108167 43229 48799 -57591
19931 -57591 -33600 11685 38592 120750 142400 132382 121618 90869 -12516 22318 101422
19920 101422 106682 163906 184753 143442 115985 117728 190458 179940 161803 160326 190373 185105
19908 185105 134883 202161 230970 197334 84528 146973 265816 228304 206488 220484 207618
19897 207618 127051 100934 150389 198375 156985 152270 165731 161504 108438 67206 118663 74366
19885 74366 112710 88120 41784 -18178 -29655 83127 115214 91899 107597 204831 292736
19874 292736 192271 186570 202484 191043 180329 127419 184206 187502 152108 132088 130954 156070
19862 156070 202270 284151 235349 145370 86169 151398 97163 74769 195772 208623 142601
19851A42601l3966L3519Q5883q301q637l7292r5487l2982J7280O5521J8473M4127
19839A90739m8964K397N316Q569M3959Q8053J4439q7611j4031N8194o0432J782
19827B02410j8873r6119K1314M8815Q7224k6390n1735o8487L2974N1151q136N5304
19815B29452M4499l5750p8720m319J4454K8078J2678o778J3445P8060j0927j10002
19803A74170m5691q114l5670N5536J095n9988k6616N6702M9097J9398J2228o0403
19791A31744p391R0468N6315M9555k2099j15174l5423K8403j65451r5032P4981
19780i104J16295O8905L1252K2904M307n1090k1913P35K1509j0128K983P2686
19768B49341R5715J15791Q9288j55024l6285P7958Q5283J90825J24321O1212K27822
$$ plain form
19851 142601 108635 142154 228037 219736 211099 173807 78320 45338 62618 128139 146612 190739
19839 190739 141775 144172 149488 158057 202016 290069 304508 216897 202866 261060 200628 202410
19827 202410 183537 87418 108732 157547 244771 218381 166646 98159 131133 182284 174148 229452
19815 229452 273951 238201 159481 155162 169616 197694 210372 203594 217039 295099 284172 174170
19803 174170 128479 120365 84695 140231 141326 81338 54722 111424 160521 179919 192147 131744
19791 131744 124353 214821 271136 320691 298592 183418 147995 176398 10947 -84085 -9104
19780 -9104 107191 176096 207348 230252 234559 183469 161556 162291 183800 173672 176655 249341
19768 249341 345056 460847 550135 395111 358826 436784 522067 712892 837213 898425 1126247
19757A126247L72824L79914K34422j7606j10053p5457J46912K96713O8438l04021
19747B118333n15272m48744k90371k10362j58405K108j7068m8409o5234m5048
19737C21528j4660L9807l4717q2867l9543K9021L7925M1729J4243J35942L854
19726D52262j45297m5995K2761l9088l3642R311O3631O7270j12336o8292J503
19715A72088n2610J3790O2819P9848L3451j2221L9774R9602J01414J00978M5178
19704F84111Q4005L41356K83328L74181M46063L02324j9566k01421J3858M5163
19694B353402J90235j18172m19413n95530m90799l25638j13732p3286O804J2511
19684D26382k4155o3517m6013m3035j0492M5328L3891l1128r9329l590m742k3602
$$ plain form
19757 1126247 1499071 1878985 2113407 2095801 1985748 1910291 2057203 2353916 2422354 2118333
19747 2118333 1603061 1154317 863946 653584 495179 497287 480219 431810 366576 321528
19737 321528 306868 346675 311958 229091 189548 218569 256494 298223 312466 448408 452262
19726 452262 306965 260970 283731 244643 211001 220312 283943 351213 238877 170585 172088
19715 172088 119478 133268 196087 275935 309386 297165 336939 436541 537955 638933 684111
19704 684111 768116 1109472 1392800 1766981 2213044 2515368 2495802 2294381 2308239 2353402
19694 2353402 2543637 2425465 2006052 1410522 919723 594085 480353 407067 413871 426382
19684 426382 402227 338710 292697 249662 239170 284498 318389 287261 187932 184342 179600 155998
19672A55998r098M7193j9290J651K2152N2761M576L0877m308n9225o8053k5260
19660A29974k7535P5703R9970K9661o0471k6272j01735J5861P1225P4617j3531
19649B67467k788n3771j9174K1725j15669P5551J9026N6571k19n52R537k3248
19637B34456J4295J22147K1260m5159r5853l0370M3344r032n1177p8547K73R2543
19625B18180Q3316l3170k8809P3283j286l9363k3381O5562Q3519Q2690m8157q1013
19613C51371r4805N5960J0108O5037J9395J7830P3882K1351j44001r8251k2172
19602B55705O654K9707j506N5355j1002j30352K5860L027K440k561L722j9751
19590B17298m7374K9804M9283j9008K471R4537K6282r180m7993o3027m995M1829
$$ plain form
19672 155998 146900 194093 174803 176454 198606 251367 255943 286820 282512 223287 155234 129974
19660 129974 102439 178142 278112 307773 247302 221030 119295 135156 206381 280998 267467
19649 267467 264679 210908 191734 213459 97790 173341 192367 248938 248719 248167 257704 234456
19637 234456 248751 370898 392158 346999 251146 220776 264120 255088 203911 125364 125637 218180
19625 218180 301496 268326 239517 312800 311514 272151 248770 314332 397851 480541 432384 351371
19613 351371 256566 312526 322634 387671 407066 424896 498778 520129 376128 277877 255705
19602 255705 262359 292066 290560 345915 334913 204561 230421 233448 235888 233327 237049 217298
19590 217298 169924 199728 249011 230003 232474 327011 353293 344113 296120 233093 228098 269927
19578B69927P0029L5944p679q744n1826p2547j0026J23738P1729m7581J6864L349
19566C93177n8084N294M0902M5151P2188o4172J3434N4513M336q5566m0221j4983
19554C65969J5824M0910l6531l848L7425p725K5654P4396j9395M2364J84159K79295
19542I98497M14060N04382L60175J09941j01239j20901l778J41256J79440j04115
19532B377718l74672m79928m70107k61050j80577j54109j19579k5233j3152l142
19522B96169l789N5255K864K9823K4055o6457j3308P8304J27979J4169l5110k631
19510E07323k5197k4648L8170k9548l5497L5444O7179K6851P6790M3244O5549
19499G45660J68785K05812K77471M11343N21196L39811k8003k17959j95058P3562
$$ plain form
19578 269927 339956 375900 368221 359477 307651 235104 225078 348816 420545 372964 389828 393177
19566 393177 335093 340387 381289 426440 498628 434456 447890 502403 506739 421173 380952 365969
19554 365969 381793 422703 386172 382324 419749 412024 437678 512074 492679 535043 719202 998497
19542 998497 1412557 1916939 2277114 2387055 2285816 2164915 2161137 2302393 2481833 2377718
19532 2377718 2003046 1523118 1053011 791961 611384 457275 337696 312463 299311 296169
19522 296169 292380 347635 350499 380322 404377 337920 324612 402916 530895 545064 509954 507323
19510 507323 482126 457478 495648 466100 430603 466047 533226 560077 636867 680111 745660
19499 745660 914445 1120257 1397728 1809071 2330267 2670078 2642075 2424116 2229058 2302620
19489B302620K28348J91265j46348m23100m81480l88686k76086r6207m0432m5415
19479H24479k9237j56510K2804J2132N3462l3138j31805j51843N2673K7881J0161
19468E01059N0182n2814o7445p5010j4990J0783r54j13479p428J6986j1404M7576
19456B83062N4974j7358j2394O008J8157L7724J24951n1318o2505J8368M4977
19445D44646q370k1454P2515P9142K5947m5951r1225o9257j4694j8586R4012M2463
19433D89188j4847l9896p9231k7214J7454P0835M8393K2306m457R9606Q2822J6293
19421F81252n43J4307P74j27044l3628o0847m8743n0025Q6678Q039j05322N889
19409C70787L5994K5592j2433Q0373r323r5074L7488k2327k7256j9930j8477p9691
$$ plain form
19489 2302620 2530968 2722233 2575885 2152785 1671305 1282619 1006533 910326 869894 824479
19479 824479 795242 638732 661536 673668 727130 693992 562187 410344 463017 490898 501059
19468 501059 551241 498427 430982 355972 340982 351765 350811 237332 229904 246890 235486 283062
19456 283062 338036 320678 308284 314292 332449 370173 495124 443806 381301 399669 444646
19445 444646 436276 414822 487337 566479 592426 546475 455250 385993 371299 352713 446725 489188
19433 489188 474341 434445 355214 328000 345454 416289 464682 486988 482531 582137 664959 681252
19421 681252 680709 695016 695790 568746 535118 474271 425528 375503 462181 470220 364898 370787
19409 370787 406781 432373 419940 500313 490990 395916 433404 411077 383821 363891 345414 265723
19397B65723M1486J9857J9173O8269m3570L174k9493M7384O1378N4344n809J9749
19385E21665P0211K0466M8522j7012m0474o9825j42339n5174k2122M9933N0840
19374D14691o2500j18494j15629j1562J29903M1441q832K0879K1878O0367p9305
19363B92837M036J19240K1329j516K4057K7J6072J7043j67940j31673m8628m1640
19351A03244j71324J8028J51014P9164Q1488O4785o2516J3162J35179K69321K24803
19340I06348J38668J3356n7842n0958r2953k5424J9264J47655J16313m9398p4427
19329I90602j11263q8467j7430N1900J07752k7633j07853J3005n2232n1757j30576
19318E76048j13895l2047P084K6542J62458J22410J54268J19760R5973Q7358J15109
$$ plain form
19397 265723 307209 327066 346239 414508 370938 374112 344619 392003 453381 507725 501916 521665
19385 521665 591876 612342 660864 643852 603378 533553 391214 336040 313918 363851 414691
19374 414691 352191 233697 118068 106506 236409 277850 269018 289897 311775 372142 292837
19363 292837 296873 416113 437442 435926 459983 460010 476082 493125 325185 193512 144884 103244
19351 103244 -68080 -50052 100962 180126 261614 326399 263883 277045 412224 681545 906348
19340 906348 1045016 1058372 1000530 949572 856619 831195 850459 998114 1114427 1065029 990602
19329 990602 879339 790872 773442 825342 933094 905461 797608 810613 758381 706624 576048
19318 576048 462153 430106 437190 463732 626190 748600 902868 1022628 1118601 1205959 1321068
19307A321068n404p1504r6163M496M2559K3700l220m311M4223M1189m377J45946
19295A438202L57176L25464J74938j35862k56897j73064j36836p2244J22559K50675
19285A894111J82743J13261j7224p2811N957Q1611J22663P7388J54330K59282
19275B801311K81934K19932J49247p2051r7921o9772K2799N0856M8259K8494J3539
19264C376627J53446J48298M8305J51747K31229K14871K10817L75262L96172M90571
19254E797345O51366Q94193Q35965M91663K33283J36189L24120N09323N65889
19245A0439336L71309K98409N79908R99412J230067J237305J005547J292958J878823
19236A9333074K333989K840244L290439M113333N541015P390925R586122J2795169
$$ plain form
19307 1321068 1315664 1244160 1147997 1152493 1195052 1218752 1215532 1211221 1255444 1296633 1292256 1438202
19295 1438202 1795378 2120842 2295780 2159918 1903021 1729957 1593121 1520877 1643436 1894111
19285 1894111 2076854 2190115 2172891 2100080 2106037 2187648 2310311 2387699 2542029 2801311
19275 2801311 3083245 3303177 3452424 3380373 3282452 3212680 3235479 3286335 3334594 3363088 3376627
19264 3376627 3530073 3678371 3726676 3878423 4109652 4324523 4535340 4910602 5306774 5797345
19254 5797345 6448711 7342904 8178869 8670532 8903815 9040004 9364124 9873447 10439336
19245 10439336 10810645 11109054 11688962 12688374 13918441 15155746 16161293 17454251 19333074
19236 19333074 21667063 24507307 27797746 31911079 37452094 44843019 54429141 67224310
19228F7224310J8757878K9300477M6752395O9757007Q4011716O0790686K857240
19221C79451709l9158960k7140216J5345779M4140664K0486577m2442033q7208175
19214B63475345q2505005n6846315l4849926k1733830j4409823j0077437p034165
19207C6018844m868421l481089k638266k294347k017708j640639r42295m06439
19199A7729640r1096J601k3995m2181j43432k57243l20935k27335J6337J99689
19189A6841050J64477J46677M66731J026285J377054J335399J381472J864999
19181B4604144K341273K632207K971049L629877M895228O783909Q927239J1645256
19173F8430182J6389805K4791052L9426869O2270780Q8160351R2980865M7793523
$$ plain form
19228 67224310 85982188 115282665 162035060 231792067 315803783 376594469 379451709
19221 379451709 340292749 313152533 328498312 372638976 393125553 350683520 263475345
19214 263475345 180970340 124124025 89274099 67540269 53130446 43053009 36018844
19207 36018844 31150423 27669334 25031068 22736721 20719013 19078374 18136079 17729640
19199 17729640 17638544 17640145 17616150 17573969 17430537 17173294 16852359 16625024 16641361 16841050
19189 16841050 17005527 17152204 17618935 18645220 20022274 21357673 22739145 24604144
19181 24604144 26945417 29577624 32548673 36178550 41073778 47857687 56784926 68430182
19173 68430182 84819987 109611039 149037908 211308688 299469039 392449904 440243427
19166D40243427j8793415m5358724j3280705L4663140M8015549k002906p3865097
19159C69621269j04555769q5866134n5640591l3834275k1542187j4482479j0114524
19152D3585310p042651m990235l689093l138260k790130k102604j557184j339942
19144A6935211j274987j376487j451799j450309j177890q74352p52453n98900
19136G978034k46830l624K51340J31200k74756n79634p54949o31917m95951m49088
19126D923825m55170l62052k24530j26624l0300j25822q9924j28750j46959q5840
19116C147854K9797J1973J9044J3515j32887j54863j38052j54532L3905L843k9336
19105B650261r5526j13370j24859j62758m5090n2309q937o4544o2067o1521R2694
$$ plain form
19166 440243427 421450012 376091288 362810583 397473723 445489272 443486366 369621269
19159 369621269 265065500 179199366 123558775 89724500 68182313 53699834 43585310
19152 43585310 36542659 31552424 27863331 24725071 21934941 19832337 18275153 16935211
19144 16935211 15660224 14283737 12831938 11381629 10203739 9329387 8576934 7978034
19136 7978034 7731204 7727580 7978920 8110120 7835364 7255730 6500781 5868864 5372913 4923825
19126 4923825 4468655 4106603 3882073 3755449 3725149 3599327 3509403 3380653 3233694 3147854
19116 3147854 3177651 3189624 3208668 3222183 3089296 2934433 2796381 2641849 2675754 2679597 2650261
19105 2650261 2554735 2441365 2316506 2153748 2108658 2056349 2047412 1982868 1920801 1859280 1951974
19094A951974J98074J83391O2064J1293J05890J92696J69494N1658O582j32672
19084B800444k10504j01499P0702K8140O774N4281l3642K6668J2911Q6554J4919
19073B755748R7313Q4344P1049J53717R3149N746j27631M1221J45207L6657P8598
19062C435118J3863n8602l2557L0097J56598J66319R5946J85448J47900J00158
19052D240288K18940K33868K32353K68799L43779M02943M49554O75477P86326
19043G852327Q69811R07306P70750N65605O45826P69732O57757L97439M72286
19034A3908839P36264Q33319Q75741J063492J462290J785534K064866K302961
19026B5033306K897714M085049N382510P043476R368382J2904964J9152646K9560638
$$ plain form
19094 1951974 2150048 2333439 2395503 2406796 2512686 2705382 2874876 2926534 2933116 2800444
19084 2800444 2589940 2488441 2559143 2587283 2594057 2648338 2614696 2641364 2654275 2740829 2755748
19073 2755748 2853061 2937405 3008454 3162171 3255320 3261066 3133435 3174656 3319863 3356520 3435118
19062 3435118 3448981 3390379 3357822 3387919 3544517 3710836 3806782 3992230 4140130 4240288
19052 4240288 4459228 4693096 4925449 5194248 5538027 5940970 6390524 7066001 7852327
19043 7852327 8722138 9629444 10400194 10965799 11611625 12381357 13039114 13436553 13908839
19034 13908839 14645103 15478422 16354163 17417655 18879945 20665479 22730345 25033306
19026 25033306 27931020 32016069 37398579 44442055 53810437 66715401 85868047 115428685
19018A15428685M6429560O9170497Q4497522O2909300M636622m0143473l1250551
19011C11678162R314598L8550337J8628945l9768165q2705583p8980061n4746046
19004A21972187l3712197k1145908j3849724q996830n705689l609863k461732
18997C2490244k074021j676051j067239m23048r0413n0884r1543J48J11553K60977
18987B7389723L80756P28669J368367K122980K580892K434486K152024K373006
18979D1530903L523779N766652Q361904J1563780J6770997K5478654L9896177
18972A52892846O2571986R0329680J01097648O0257722j3980951n6014604l2823779
18965C64330548J5832181L9473023L806178o1819834r7059812q3660677n5817949
$$ plain form
19018 115428685 161858245 231028742 315526264 378435564 383072186 342928713 311678162
19011 311678162 320992760 359543097 378172042 338403877 255698294 176718233 121972187
19004 121972187 88259990 67114082 53264358 44267528 38561839 34951976 32490244
18997 32490244 30416223 28740172 27672933 27249885 27159472 27108588 27017045 27017193 27128746 27389723
18987 27389723 27770479 28499148 29867515 31990495 34571387 37005873 39157897 41530903
18979 41530903 45054682 50821334 59183238 70747018 87518015 112996669 152892846
18972 152892846 215464832 305794512 406892160 467149882 453168931 397154327 364330548
18965 364330548 380162729 419635752 423441930 361622096 264562284 180901607 125083658
18958A25083658l4635393k2230348j4850529r924792o718486m897657l895410
18951B7931043l427175k784237k016031j302956q60687q04653o99876p64203q04940
18942A4466285p05222p06711o86315n87356o38666o69260o93052r33127j003846
18933G842730r30202p89083m88592l31895l26788k56689j27717O3700J45440R9379
18923D900283R9104M5265Q7189L39379K45856k23770n91491o62880m92305l53505
18913C393125k37955k52753k45315j85212r7445J1899k2407j43656j92975j26991
18903A900315j47187q2323m308M9406R244p8554j16730o5754o4386J6541Q969
18892A425233m4743j6328J0669J75033J45824N3625l0833o3557L7614M2200O785
$$ plain form
18958 125083658 90448265 68217917 53367388 43442596 36724110 31826453 27931043
18951 27931043 24503868 21719631 19703600 18400644 17539957 16735304 16035428 15271225 14466285
18942 14466285 13761063 13054352 12368037 11780681 11142015 10472755 9779703 8846576 7842730
18933 7842730 6912528 6123445 5634853 5302958 4976170 4719481 4591764 4655464 4800904 4900283
18923 4900283 4999387 5044652 5131841 5471220 5717076 5493306 4901815 4238935 3746630 3393125
18913 3393125 3155170 2902417 2657102 2471890 2374445 2386344 2363937 2220281 2027306 1900315
18903 1900315 1753128 1670805 1666497 1715903 1725147 1646593 1529863 1464109 1399723 1416264 1425233
18892 1425233 1380490 1364162 1374831 1549864 1695688 1749313 1718480 1654923 1692537 1734737 1741522
18881A741522R7667N4046k4312r9092L4628P4227J64006J66666M3936j02144k02046
18870A949104j81036k00116j09224j51542p6014N0408P0331O4506J6927M9911
18860A483255K5755n8626K9656M8589m6810j29895j63978j24936n1804o314k3393
18849I81499J0181K0334n8244Q541J71576J66273J29014J27599O2730j7109j5173
18838A587221J1680J87009N9039k4725j8963n6292l2819O3170K6792k0199J41360
18827A923273J15531Q3499Q4042J16227K41518K40344K62725K30434J01771N0471
18817C449835P8655J08580K40803K94615K34481L27215N59475R18875J140410
18808G352944J445224J961322K900717M441557P532359J2350258J8487459K1172075
$$ plain form
18881 1741522 1839189 1893235 1868923 1769831 1804459 1878686 2042692 2209358 2253294 2151150 1949104
18870 1949104 1768068 1567952 1458728 1307186 1231172 1281580 1351911 1416417 1433344 1483255
18860 1483255 1509010 1450384 1480040 1528629 1481819 1351924 1187946 1063010 1011206 1004892 981499
18849 981499 991680 1012014 953770 962311 1133887 1300160 1429174 1556773 1619503 1602394 1587221
18838 1587221 1598901 1785910 1844949 1820224 1801261 1744969 1712150 1775320 1802112 1781913 1923273
18827 1923273 2038804 2122303 2206345 2322572 2564090 2804434 3067159 3297593 3399364 3449835
18817 3449835 3528490 3637070 3877873 4172488 4406969 4734184 5293659 6212534 7352944
18808 7352944 8798168 10759490 13660207 18101764 25634123 37984381 56471840 77643915
18800G7643915J0937020q523693k1678217k0265925j3376369p647165m624310
18793A2465256k929318j914760j435295j055145o83529o56264n17176m00987j50469
18784B722313L3640O1221J0188j3772j30857k05676k44718j82531j64026j22819
18774A762963L3555n0456j15605p0184j65573j33583p9705j06248k2587J12103
18764A164680J08370J03387J43186n9190k48828k65952j75101j22668N9791O3254
18754G70929J1265K2043L628k6807J0747n0174l8272l5759m4537p8666N7552l7938
18742E64011r3858k2014J18235N8122j10O9305l3558m4766k7622m5353j25657
18731D16735l5945K5192L0062O8834M8949o5783J31788M8240j19213q0450q284
$$ plain form
18800 77643915 88580935 80057242 58379025 38113100 24736731 17089566 12465256
18793 12465256 9535938 7621178 6185883 5130738 4447209 3790945 3273769 2872782 2722313
18784 2722313 2755953 2817174 2827362 2813590 2682733 2477057 2232339 2049808 1885782 1762963
18774 1762963 1796518 1746062 1630457 1560273 1394700 1261117 1181412 1075164 1052577 1164680
18764 1164680 1273050 1376437 1519623 1460433 1211605 945653 770552 647884 707675 770929
18754 770929 782194 804237 807865 781058 791805 741631 703359 667600 623063 544397 601949 564011
18742 564011 470153 448139 566374 624496 624386 693691 660133 615367 587745 542392 416735
18731 416735 380790 405982 436044 504878 553827 488044 619832 668072 548859 468409 460125
18720D60125M8274M6014j3096O6820M0367q2180o6421k1601L5029k6541l7682
18709D49108N0737N373P7563m514k0094N8981p9217p2565P7299M8593N0632M8539
18697F90435J1262m3596j6039N4848L4213j495J10118K94926L58557L26972K27362
18686B047563j1660j59980o6405J00918J58921Q7205o6182k27376k81666j98591
18676A382747j52176j84443n2467k5178q1102n7672k9981n417J3029n3619k6692
18665G27029r485O4128q404j4448Q6953J08329N1770j02828j50552n7043l3410
18654F62039N1388R4914N2636O2950o9759r9567k4341K3450N3571p0975K4057
18643G60363P6026P7530k2086J4804J54559K62847L84424N39903N85006N33399
$$ plain form
18720 460125 508399 554413 541317 608137 648504 566324 499903 478302 513331 486790 449108
18709 449108 499845 505218 582781 578267 558173 617154 537937 465372 542671 591264 641896 690435
18697 690435 701697 658101 642062 696910 731123 729628 839746 1134672 1493229 1820201 2047563
18686 2047563 2035903 1875923 1809518 1910436 2069357 2156562 2090380 1863004 1581338 1382747
18676 1382747 1230571 1046128 993661 968483 887381 829709 799728 794311 807340 753721 727029
18665 727029 717544 781672 773268 758820 845773 954102 1005872 903044 752492 695449 662039
18654 662039 713427 808341 860977 923927 854168 754601 730260 753710 807281 736306 760363
18643 760363 836389 913919 891833 906637 1061196 1324043 1708467 2248370 2833376 3366775
18633C366775L50136K35783k9144l15217m72921j92696M3140J92976J06179k78345
18623C006666n36168n88097m68000l30476q0503J56551K39961J89673M5496l1198
18613A603905j42481k32921k20972k21059j74683j6894k4884q4519j6621P9894
18603E48765o5903q1919P7916M6608q9745j1882Q6132K5675R6322J4036J15011
18592G61016J85987J69798Q5750m594p4188n4298o4060l3511J5980M5647j4017
18581A019510l6090q731J6790q49o0014o6908q5683J20385L66822M38056K67553
18570A970841o0903l22824l63169j82274k26594j75501r0927j7579Q5705K9529
18560F46304P519J0653J8815J01344L2319l4771o3767P1055K4631r1537r8545
$$ plain form
18633 3366775 3716911 3952694 3923550 3608333 3135412 2942716 2985856 3178832 3285011 3006666
18623 3006666 2470498 1882401 1414401 1083925 1003422 1159973 1399934 1589607 1635103 1603905
18613 1603905 1461424 1228503 1007531 786472 611789 594895 570011 485492 468871 548765
18603 548765 482862 400943 478859 525467 435722 423840 509972 535647 631969 646005 761016
18592 761016 947003 1116801 1202551 1197957 1123769 1069471 1005411 971900 987880 1033527 1019510
18581 1019510 983420 974689 991479 990630 930616 863708 778025 898410 1265232 1703288 1970841
18570 1970841 1909938 1587114 1223945 1041671 815077 639576 548649 531070 616775 646304
18560 646304 653823 664476 683291 784635 816954 782183 718416 789471 814102 722565 624020
18549F24020j79190k2626L1749K9087J51062L00037J20328R558q3579r0073l9460
18538H50913j04202l1255P7487J33616K68839J56812L5826L8545J0157p257P834
18527A437315J12899J37678J8723R422P3742l6840p4972l8496n6911n8606J24987
18516A648941J58024J31883J17973M5188J08202J65113K75365K08613K37348L18393
18506C415043L17375N29860Q23238J116195J030764L19161n23899q85421p34636
18497E407680l86229j85892o7190k6346q18J48840K67947M06192N79107P56531
18487F899822O18360O54076P54791R23724R84171R68309J095588J346956J671696
18478A5917493J893133K260325L081587M217154N750516Q046094J0792453J4931477
$$ plain form
18549 624020 444830 422204 453953 483040 634102 934139 1054467 1064025 980446 890373 850913
18538 850913 746711 715456 792943 926559 1195398 1352210 1388036 1426581 1436738 1429481 1437315
18527 1437315 1550214 1687892 1706615 1716037 1789779 1752939 1677967 1639471 1582560 1523954 1648941
18516 1648941 1806965 1938848 2056821 2102009 2210211 2375324 2650689 2859302 3096650 3415043
18506 3415043 3732418 4262278 5085516 6201711 7232475 7551636 7027737 6142316 5407680
18497 5407680 5021451 4835559 4768369 4742023 4741205 4890045 5157992 5564184 6143291 6899822
18487 6899822 7518182 8172258 8927049 9850773 10834944 11803253 12898841 14245797 15917493
18478 15917493 17810626 20070951 23152538 27369692 33120208 41166302 51958755 66890232
18470F6890232K1870669L3605573N2948659P9051494R4323676O1605128j9201013
18463C91094418q7214196r5089765o8599509m1818546k5315327j6185576j0549529
18456D6321970p134018n253824m135662l156396k284553j633799j346100j090996
18448B0286622m78729L40934O66755J40245q33898j376088j282789p75979p069
18439A6680004N55253O42526N37164L64729O64776J160058J537680K204276K916943
18430B7263409L949334N102927O010516P333284R796519J4063897K1085496L2756675
18422A27362057N1427246P4068270Q0981223M1368170k9010866p3976004o6714368
18415B05505728l7709731r923159J4129104M0222986O6597673P1613320K6157653
$$ plain form
18470 66890232 88760901 122366474 175315133 254366627 348690303 410295431 391094418
18463 391094418 303880222 208790457 140190948 98372402 73057075 56871499 46321970
18456 46321970 39187952 33934128 29798466 26642070 24357517 22723718 21377618 20286622
18448 20286622 19807893 20148827 20815582 20955827 20121929 18745841 17463052 16687073 16680004
18439 16680004 17235257 17877783 18414947 18779676 19444452 20604510 22142190 24346466 27263409
18430 27263409 31212743 36315670 42326186 49659470 59455989 73519886 94605382 127362057
18422 127362057 178789303 252857573 333838796 375206966 346196100 272220096 205505728
18415 205505728 167795997 157872838 172001942 212224928 278822601 350435921 376593574
18408C76593574m5940925q7211445p7932847n1962833l1267204j9237648j2373709
18401E0666963q221644n837389m666177l919854l337908k643073k197599k071149
18393A7772170j699595j266578r20615n88313m49421l04438j16752J67409O07649
18384A3201516Q23686P37923L37166j13573j07905J94243P09910J186109J690767
18375A8659842K475172L413582M205955M976587O191815Q657559J2937280K0234025
18367H1751817L2368848N0711855O8315170O1275567J0578210n0905799p4958954
18360A79136714o0656110l8605640k3252887j4679125r746437o579616m560576
18353B1056323l398707k570637k109890j680300j431166j146222r70709q15950
$$ plain form
18408 376593574 330652649 243441204 165508357 113545524 82278320 63040672 50666963
18401 50666963 42445319 36607930 31941753 28021899 24683991 22040918 19843319 17772170
18393 17772170 16072575 14805997 13885382 13297069 12847648 12543210 12426458 12593867 13201516
18384 13201516 14025202 14763125 15100291 14986718 14878813 15073056 15782966 16969075 18659842
18375 18659842 21135014 24548596 28754551 33731138 39922953 48580512 61517792 81751817
18367 81751817 114120665 164832520 233147690 294423257 305001467 254095668 179136714
18360 179136714 118480604 79874964 56622077 41942952 32196515 25616899 21056323
18353 21056323 17657616 15086979 12977089 11296789 9865623 8719401 7748692 6932742
18345F932742n36907m91141n10215l89382k07792k60940k82214q1772o5921k02607
18335C903851j62406j56969q3585L6260J55738L26959O62574N84979K39747l79152
18325E127996r02035q69900o67628m12464j68282l5138j45683j16484l5585q1980
18315A692817j14363l9383K1845J16588N6325m2212j01127j38509j29693j17783
18305A204505q4875j38798p6024n0993j9582m0668L9257J6425p5754O2151L2974
18294H68618O8033O1924J9407P1849P7422l8456r7185j01523K4432J36839J33884
18283A225244M3937k9723J4964q8142j51099r2860j6706j1816N8640L3839J0081
18272I96359J6047K4241k8185j25647m0735M3935L6042O6769m4429j56064j59263
$$ plain form
18345 6932742 6395835 5904694 5394479 5005097 4797305 4536365 4254151 4172379 4106458 3903851
18335 3903851 3741445 3584476 3500891 3537151 3692889 4019848 4682422 5267401 5507148 5127996
18325 5127996 4225961 3356061 2688433 2275969 2107687 2072549 1926866 1810382 1774797 1692817
18315 1692817 1578454 1539071 1560916 1677504 1733829 1691617 1590490 1451981 1322288 1204505
18305 1204505 1119630 980832 904808 853815 834233 793565 832822 849247 773493 835644 868618
18294 868618 936651 998575 1017982 1089831 1167253 1128797 1031612 930089 954521 1091360 1225244
18283 1225244 1269181 1239458 1254422 1166280 1015181 922321 905615 893799 952439 986278 996359
18272 996359 1012406 1036647 1008462 882815 842080 886015 922057 988826 944397 788333 629070
18261F29070n6139n7807k1883Q7573J3760M1290L7748l3083r9633j22870n8920
18250C59106p6955r9264M0490J21634J0972k3594m8233k5976P2155j6200k2758
18239B91377O4853J26303K43075N1615q6771n4616r4910j34830k7132P7105R4198
18228E50267k67O5873j3683p9548J1836q2492j3287M122O0155M7812l3777N4580
18216E71591o7403Q011J23423N4693l2901q5403p4821N3237p3056j79462q2751
18205B15158j1512K3814N1246o2163q7209l9657l0250M8246M9146N6463O010m8664
18193A70628J3650L8363j3281Q715k0127Q1130J89280p5963j8724k0988J4372
18182C67055n6752p6427k24R3990j4802M5841M8593K8366J21436O8680j01892
$$ plain form
18261 629070 572931 515124 493241 580814 594574 635864 673612 640529 540896 418026 359106
18250 359106 282151 182887 223377 345011 355983 332389 284156 258180 330335 314135 291377
18239 291377 356230 482533 725608 777223 690452 635836 540926 406096 378964 456069 550267
18228 550267 550000 615873 602190 522642 534478 451986 438699 442821 502976 550788 517011 571591
18216 571591 504188 512199 635622 690315 657414 572011 497190 550427 477371 297909 215158
18205 215158 203646 227460 278706 216543 129334 89677 59427 107673 156819 213282 219292 170628
18193 170628 184278 222641 209360 218075 197948 279078 468358 392395 373671 352683 367055
18182 367055 310303 233876 233652 327642 312840 358681 407274 435640 557076 625756 523864
18171E23864j4681m4660j12599q3347M3892J21796r118k5541j12962R7775R3040
18160D77459R59j5903k816N9571j8251L0352Q7484k2881K3310Q8459k9090l6181
18148F42472L1292j7583m4880m65K9304L0055m3379M3184N8700N4910J32963K7833
18136I44406o7283Q1004J4564N710L0044K13940J97637K28341J48618J71930J78074
18125B146985K63316P7488M5554K61200K84587M19798N63427N72604N97967O93224
18115E926150Q93693J274369J719411K293180L338668M755721P001963J1048302
18107C8251457J8080636K8368658L6343771K7027834l842912l2748114l7536058
18100G3945272k6930235j5895351r260645n767612l776349k542269j886624j348947
$$ plain form
18171 523864 509183 464523 351924 268577 312469 434265 425147 399606 286644 384419 477459
18160 477459 478418 462515 459699 519270 501019 531371 618855 595974 619284 707743 678653 642472
18148 642472 673764 656181 611301 610836 640140 670195 626816 670000 728700 783610 916573 944406
18136 944406 877123 958127 972691 978401 1008445 1222385 1420022 1648363 1796981 1968911 2146985
18125 2146985 2410301 2487789 2533343 2794543 3079130 3498928 4062355 4634959 5232926 5926150
18115 5926150 6819843 8094212 9813623 12106803 15445471 20201192 27203155 38251457
18107 38251457 56332093 84700751 121044522 148072356 144229444 111481330 73945272
18100 73945272 47015037 31119686 21859041 16091429 12315080 9772811 7886187 6537240
18092F537240j022496q95602o99063n40515l48579l44995k39399j91492j75226
18083B079873j68880k43874k45437k01163j20673o5622n5309K225r115n9918m5725
18072H66382j10368k4524l2112p3357L0222m6694r2271j4185k171N2210N3735
18061F06867m6921j00649n8386O6623L1061o2843r1950n6789P0187K4720k4321
18050C57599K6469K4660R884q8131p4497j09169j3833j790j4233N0635j6284j5685
18038A35625J07668P7736m4384j17667j834k2919j1449m1824L8719N1160k3285
18027A47546p3099q52r368k0539K386N3071o8304j9667r854L1881P6163K6530
18015A35894M5212j62448o0953K0309j2035l3644N6483J61163K0784q6750o4216
$$ plain form
18092 6537240 5514744 4619142 3920079 3379564 3030985 2685990 2446591 2255099 2079873
18083 2079873 1910993 1667119 1421682 1220519 1099846 1034224 978915 981140 972025 912107 866382
18072 866382 756014 731490 699378 626021 656243 609549 517278 503093 500922 553132 606867
18061 606867 559946 459297 400911 467534 498595 435752 343802 287013 357200 381920 357599
18050 357599 384068 408728 418612 330481 255984 146815 132982 131192 116959 167594 151310 135625
18038 135625 243293 321029 276645 158978 157144 134225 122776 80952 119671 170831 147546
18027 147546 74447 73595 64227 43688 46074 99145 30841 11174 1320 33201 109364 135894
18015 135894 181106 18658 -42295 -21986 -34021 -67665 -11182 149981 170765 84015 19799
18004A9799p8022m1163N1485O5562O6212L0184o3991j17581J0427R3271p7384
17993d1201m1706R9339K0630L0917k2004m3791P810o3376M5779L6524n0668j5262
17981c7009L1375p170R8975L0227N595N2705M2754L1537M250k1607m0190k0604
17969A70838K0931q642M250P0945j3119o267p6475l5371m0181k8304K7374L6767
17957A22746k1186p157N5334Q0018L2705J4612k0874J44969Q3141Q2122J58111
17946G24541K41073L46271L86479J28546k11043l86045l48735l15275j66396r2464
17936C06952j6533L6693J3344k8041j62090m1096l0896k7677M7082l6489M598
17925F5847Q2798m4538l3830m448j2334K0378M2682k9805k2943J1910m4433l1918
$$ plain form
18004 19799 -58223 -99386 -47901 17661 83873 114057 50066 -67515 -57088 36183 -41201
17993 -41201 -82907 16432 37062 67979 45975 2184 9994 -53382 -7603 28921 -21747 -37009
17981 -37009 -5634 -12804 86171 116398 121993 174698 217452 248989 253239 231632 191442 170838
17969 170838 191769 183127 187377 258322 245203 238936 162461 127090 86909 58605 85979 122746
17957 122746 101560 94403 149737 229755 262460 277072 256198 401167 484308 566430 724541
17946 724541 965614 1311885 1698364 1826910 1615867 1229822 881087 565812 399416 306952
17936 306952 290419 327112 340456 312415 150325 109229 78333 50656 97738 61249 65847
17925 65847 148645 104107 70277 65829 53495 73873 116555 86750 63807 75717 31284 -634
17913f34N1456O9525R418k3631K9274K1609j2055K5984R2692m672m1634J04953
17901C22285K28108K34936M17435M89007J91385j77623l37660l23474j58503m427
17891H81469J56008K23927L08253K77877R1125l29751n15186m32280k26106j55324
17881B80012l3883L3456m9259K662j144m5604j18161P402J4797J2102j3410M26
17869H9396p268k6342Q0913N1012j0163r5104j14226j8163M748l482J9731O7235
17857C8287k6629l8905P8695R1620J3043M737M8808k1272n0464L0290N1751J87958
17845D07919K56224K56547L19524L59825P8873k36529m42567l12067k38308o9649
17835C79792m7797l5249l5224p1625j5631m9791l0506l9648q8853j2591k0147
$$ plain form
17913 -634 50822 120347 129765 106134 135408 157017 144962 170946 263638 258966 217332 322285
17901 322285 550393 785329 1202764 1691771 1883156 1705533 1367873 1044399 885896 881469
17891 881469 1037477 1261404 1569657 1847534 1938659 1608908 1093722 661442 435336 280012
17881 280012 246129 279585 230326 232988 231844 186240 68079 75481 90278 102380 88970 89396
17869 89396 82128 55786 136699 187711 177548 82444 -31782 -49945 -45197 -48679 -28948 38287
17857 38287 11658 -27247 51448 143068 156111 160848 209656 188384 137920 168210 219961 407919
17845 407919 664143 920690 1240214 1600039 1678912 1442383 999816 687749 449441 379792
17835 379792 331995 296746 261522 189897 174266 124475 93969 54321 -34532 -47123 -67270
17824f7270Q982j4096L9041Q3707l9892l7423M9321k154p6512k8568K0035J3401
17812e1428N2715L4388j33261o3721Q788L4294Q0494N3351J5321r213l2807K884
17800h195M7073k5581J7527M3084p2235o4165N9656K0139Q376m9194K2876o6362
17788f7001m5082O8284K0618m950Q6793M776j8129k2168o7625o0261L5723l6659
17776a05681K6789J50322P5354k6845j1763k6272L1792k4877m0336o5154l9927
17765e6598J4514M4857k8372L9768l2427q191K5533j173O581J6829j28545k9046
17753a36270l1212l469N9760L8193K2986O9065o893j2286L7481N1979K1061l4678
17741G5717J3567m5010M904n1012o2678j0958J49798Q5155l236m6692n0915n9352
$$ plain form
17824 -67270 -58288 -72384 -33343 50364 10472 -26951 22370 20216 -56296 -84864 -64829 -51428
17812 -51428 1287 35675 -97586 -161307 -152519 -118225 -37731 15620 30941 21728 -11079 -8195
17800 -8195 38878 13297 30824 73908 1673 -62492 -2836 17303 25679 -23515 -639 -67001
17788 -67001 -112083 -43799 -23181 -28131 58662 63438 45309 23141 -44484 -104745 -69022 -105681
17776 -105681 -78892 71430 146784 119939 108176 81904 113696 88819 48483 -16671 -56598
17765 -56598 -42084 2773 -25599 14169 -18258 -26449 -916 -2089 4492 21321 -107224 -136270
17753 -136270 -167482 -170951 -111191 -72998 -50012 19053 12160 -126 37355 89334 110395 75717
17741 75717 89284 44274 49178 -1834 -64512 -75470 74328 159483 156247 109555 58640 -712
17729g12r5216l8468Q4364K8013k8117n6181m6215k4531O3177k7842J06084O6560
17717C0916K7922J124l6761l9697j1908j1645l4418m0402J1885J29264n1085J9850
17705d955M1602P337j6656K6982J5362l2654r9326k2444m1612j9896j0828P1823
17693h5265N8634j5872j3241o3449l4264N0034J30011K4595l071l6427n2126j2930
17681e3371P4629j6069R281K6189l5658J2332k0953J733l2184j1533L4079L7910
17669B6385K1513j0580k401l8307o5225J7947n750j5380N0581L4897j02517n0389
17657a39226m3497J8226M0241M24M9462M1220m4130O8505m8950k9611R106k3289
17645a01519N5447q046r1736p2887J6075P380J4695J00024J03390J08740k947
$$ plain form
17729 -712 -95928 -134396 -50032 -22019 -50136 -106317 -152532 -177063 -113886 -141728 -35644 30916
17717 30916 58838 59962 23201 -16496 -28404 -40049 -74467 -114869 -102984 26280 -24805 -4955
17705 -4955 36647 43984 27328 54310 69672 37018 -62308 -84752 -126364 -146260 -157088 -85265
17693 -85265 -26631 -42503 -55744 -119193 -153457 -103423 26588 51183 48112 11685 -40441 -53371
17681 -53371 21258 5189 14470 40659 5001 17333 -3620 -1887 -34071 -45604 -11525 26385
17669 26385 47898 37318 34917 -3390 -68615 -50668 -56418 -71798 -21217 13680 -88837 -139226
17657 -139226 -182723 -164497 -124256 -123832 -74370 -33150 -77280 -8775 -57725 -87336 -78230 -101519
17645 -101519 -46072 -54118 -145854 -218741 -202666 -195286 -180591 -80567 22823 131563 128616
17634A28616k4867o6111k7700K2196k754K8719Q793r6216o2807J1679J2892k1041
17622h8601M6016n1821r961K5040R4488L2328m7405l7187J319n1348j05371Q277
17610a84226n3145L6462M5306P1230R3228m2224M5305J0868J9759o2712N8931
17599C8782r22L337r9153M5645J2607M8912N5505k7249o6264k5484M1864m3157
17587a5577J8786k3203m8735m1003j4354J4189m315k2413j5522K6257N7175K5106
17575d3609Q0445P4076q5409j23722O3462P1502j4393n3662j8893j1660q4675
17564a46538q636Q4367N0168l2255J321j5045L9496J21684O8081m6830o8478K3114
17552G0449P3321k9227k9919j06934p4165P3871q4958j16671K6033L2535o054
$$ plain form
17634 128616 103749 37638 9938 32134 29380 58099 66892 -29324 -92131 -80452 -67560 -88601
17622 -88601 -42585 -94406 -104367 -79327 15161 47489 84 -37103 -35784 -87132 -192503 -184226
17610 -184226 -237371 -200909 -155603 -84373 8855 -33369 11936 22804 42563 -20149 38782
17599 38782 37860 41197 -57956 -12311 296 49208 104713 77464 11200 -14284 27580 -15577
17587 -15577 3209 -19994 -68729 -109732 -124086 -109897 -114212 -136625 -152147 -125890 -68715 -43609
17575 -43609 36836 110912 25503 -98219 -34757 36745 22352 -31310 -50203 -61863 -146538
17564 -146538 -155174 -70807 -20639 -52894 -51573 -66618 -27122 94562 162643 115813 47335 70449
17552 70449 143770 114543 84624 -22310 -96475 -22604 -107562 -224233 -198200 -165665 -171719
17541a71719J1593K1754J6148O5728L3602n7103P2639L0875k4849M86J3534M525
17529A7213m5094n2336J2994K3563L8382l2708n8913M3574N1199l5450L3246N788
17517A458o6931p753j789Q0056P282l2780J5739n8699l8012J71505M6963J0172
17505A27211m5801j50239o8141P1056J1489n5837O6682r080J5854n552k2066J0566
17493e3858Q4172M8459k4139p0955m2190J0897K1549L796M7320K1079l8119n3802
17481d5791J7243L3058m3892l8177P6790P2628j7941o6816J719M0366J366l7422
17469f869o3375j1984j7545L1178j7593k1470J24L3640L0720J5505Q9958J4345
17457G6634r7353K5498j4444n7185l4575J7506P9171L3416m2335m4889o1094j1069
$$ plain form
17541 -171719 -160126 -138372 -122224 -56496 -22894 -79997 -7358 23517 -1332 -846 12688 17213
17529 17213 -27881 -80217 -67223 -43660 -5278 -37986 -96899 -53325 -2126 -37576 -4330 1458
17517 1458 -65473 -73226 -75015 5041 12323 -20457 -4718 -63417 -101429 70076 117039 127211
17505 127211 81410 -68829 -136970 -65914 -54425 -110262 -43580 -52660 -36806 -42358 -64424 -53858
17493 -53858 30314 78773 54634 -16321 -58511 -47614 -26065 -22269 25051 46130 8011 -45791
17481 -45791 -28548 4510 -39382 -77559 -769 71859 53918 -12898 -11179 29187 30553 -6869
17469 -6869 -70244 -82228 -99773 -68595 -86188 -107658 -107534 -73894 -43174 -27669 62289 76634
17457 76634 -20719 4779 -9665 -66850 -101425 -83919 -4748 28668 -13667 -58556 -119650 -130719
17445a30719J2172N1204R7602R4009M6037J9827J59121K14919J05573j3481j49137
17434E07127j67775j35094k1684m4258k4428o0699o2382l6826o601K2608J8798
17423a1214K9433k615k2861k9026n385m7740m2817m0588l27M4316L8602n7675
17411a47897l3627m762k0281J15890R5179J0333m0199N8358o7721j28381K5912
17400a37196J2433L4045L4011q7549K7637Q5445L438p1820j8052N1762k703j772
17388g0321m5922m2160N4719R6547N0647J7162o5183n0308m7261Q2314Q6870l9355
17376B7749q2685k0103P684M0099J0315k0283k0349o4303k845K3593M6314N3274
17364a540L6596n0952K7825J9275m0215q3354p4838k4504Q0029O1709k4102q4868
$$ plain form
17445 -130719 -118547 -67343 30259 124268 170305 190132 349253 564172 669745 656264 507127
17434 507127 339352 204258 182574 138316 113888 53189 -9193 -46019 -52620 -30012 -11214
17423 -11214 18219 15604 -7257 -36283 -41668 -89408 -132225 -172813 -173140 -128824 -90222 -147897
17411 -147897 -181524 -186286 -206567 -90677 4502 14835 -25364 32994 -34727 -163108 -137196
17400 -137196 -124763 -90718 -56707 -144256 -116619 -31174 -27736 -99556 -117608 -65846 -68549 -70321
17388 -70321 -116243 -158403 -103684 -7137 43510 60672 -4511 -54819 -102080 -19766 67104 27749
17376 27749 -54936 -75039 -67355 -27256 -16941 -37224 -57573 -121876 -124721 -101128 -54814 -1540
17364 -1540 35056 -15896 11929 31204 -9011 -92365 -167203 -191707 -111678 -49969 -74071 -158939
17352a58939l1884J0691O1859K5956O250l2777O5117J7253r820M9506j7900K0280
17340E592L766L728j11780N2170J14147j6227p5328j38278m920J41690O1133J5407
17328E1100k0923K3817q3262l193K7185o2062L2674K3920N5021k8066p1867O584
17316d9072M3886L2471q212L8389m4308j24988Q165l4778J9728J9337J9803P0012
17304i567k4487J6942R0982N646k1926n2415o0628n7193J9493k6915j3827j6381
17292a50276L2396J2872Q0540Q0697j0292l5800j6090R353m453K8548j8876M7018
17280E5637K7266n0943o5791L95l6457J9150K7928P260J9392N5648O467p635j00292
17267d1975n9135L8333O9142M4351K5302k2036j6717j0557J8110p1695m9810O8481
$$ plain form
17352 -158939 -190823 -180132 -118273 -92317 -86067 -118844 -53727 -36474 -46294 3212 -14688 5592
17340 5592 9358 13086 -98694 -46524 67623 51396 -23932 -162210 -167130 -25440 35693 51100
17328 51100 30177 53994 -29268 -32461 -5276 -67338 -34664 -10744 44277 16211 -55656 -49072
17316 -49072 -5186 27285 19073 57462 13154 -111834 -103669 -138447 -118719 -99382 -79579 -9567
17304 -9567 -34054 -17112 73870 79516 57590 5175 -55453 -112646 -93153 -120068 -133895 -150276
17292 -150276 -117880 -105008 -24468 56229 45937 10137 -5953 3400 -1053 27495 8619 55637
17280 55637 82903 31960 -33831 -33436 -69893 -50743 -22815 -15555 3837 59485 65952 58317 -41975
17267 -41975 -101110 -62777 6365 50716 76018 53982 37265 26708 44818 -26877 -76687 -8206
17255h206L5718K1162j10383j08930k89L9728M9176M3138J03465p7655q4048L4987
17243f2137n1372M7661J35244j8397m4921L6738m759j20465k4473N762m5620N1904
17231i4835N629q5046p8124N0110R9382O3310L7980M0980o751J1838j11500m6920
17219a13947M5920O287Q2323n1304n1647o4006p1570J3967M6922L2810J3868K9226
17207h1151J25310P2515l4645M6249L850q5716J0016L7195p7596m0445J7459L0545
17195B3586O1273M5100k6432l2058K3496n4397k816j4456J3140N0173K3179r0610
17183A9178r2402l2763P169K6481k3339l2027M7522k4311P5478K0562L7303K567
17171C1418k6743l5325M221K4518o0560K3078n6995M8483J8171M9347K3453o9984
$$ plain form
17255 -8206 27512 48674 -61709 -170639 -170928 -131200 -82024 -38886 64579 -13076 -97124 -62137
17243 -62137 -113509 -65848 69396 50999 6078 42816 38057 -82408 -106881 -101119 -146739 -94835
17231 -94835 -89206 -174252 -252376 -202266 -102884 -39574 -1594 39386 32635 44473 -67027 -113947
17219 -113947 -68027 -61740 20583 -30721 -82368 -146374 -217944 -203977 -157055 -124245 -110377 -81151
17207 -81151 44159 116674 82029 128278 132128 46412 56428 93623 16027 -24418 -6959 23586
17195 23586 84859 129959 103527 71469 94965 40568 37752 23296 36436 86609 109788 19178
17183 19178 -73224 -105987 -98818 -72337 -95676 -127703 -80181 -104492 -29014 -8452 28851 31418
17171 31418 4675 -30650 -26429 -1911 -62471 -39393 -96388 -47905 -29734 19613 43066 -26918
17159b6918m3958l5230K3567O471r4971O5475R4042J2837L8754J7004p4718j0608
17147b8253Q522j3640j9523m7458J2589j2560N485K6455N0180m0450m4375M3617
17135e9411K7886Q5592N9075j9503p9140Q103N7956k9065p1642L8182K348O1072
17123H1453L1117r9714q842J1366n1233l7124o1492k0452J31820M9302j9997J1065
17111A7269J5925j06379j9614P1726n96o026k8399L7581m9705R06Q5105n1296
17099c3503m7843m9319K7314J19932l8679M4794M3226m8906o672l9335J4299O4960
17087E0268L1560o4887k0942K828K2172J9402K898p4382O315r798k2635M2414
17075a4787L5033L3095j045O2456k8172j12464q8928p2962q441J2589l5514J5390
$$ plain form
17159 -26918 -70876 -106106 -82539 -76068 -171039 -105564 -11522 1315 40069 57073 -17645 -28253
17147 -28253 -19731 -33371 -52894 -100352 -87763 -100323 -94838 -68383 -18203 -58653 -103028 -59411
17135 -59411 -31525 54067 113142 93639 14499 22602 80558 51493 -20149 18033 20381 81453
17123 81453 112570 12856 4014 15380 -35853 -72977 -134469 -154921 -23101 26201 6204 17269
17111 17269 33194 -73185 -92799 -21073 -21669 -27695 -56094 -18513 -68218 -67312 17793 -33503
17099 -33503 -81346 -130665 -103351 16581 -22098 22696 65922 17016 10344 -28991 -14692 50268
17087 50268 81828 16941 -4001 -1173 20999 40401 43299 -31083 -24768 -34566 -57201 -14787
17075 -14787 20246 53341 52296 114752 86580 -25884 -114812 -187774 -196215 -183626 -219140 -203750
17063b03750Q6814O1244K5346q6623J0260N4779q6216Q273N9031o008K5604o42
17051e1888o922j9796N702N5908O992j9364j14770K5277P2264N4050L4766l3976
17039H243K5239M6671K9162o7178m2740k2286r5016m5374N9550J24636J7936m1022
17027b179L4454j0062M5810q92q4332N269Q1120l7068k2853N7377K8192o633l8377
17014D9826l5738R077K2355j28763L430R556M7130L262k0192l7632k0589o8234
17002a66512n3909O9123N1241q1793J8520M3089Q1357L9473O2836j8188n9144
16991a3907r0908P577L2787N7618O824m7287m3975l0007L623r5108j9858O0370
16979a72251J09721J09144P8007l407j1662n3673n5439p4444j6437Q3100M6255
$$ plain form
17063 -203750 -116936 -55692 -30346 -116969 -106709 -51930 -138146 -129873 -70842 -76850 -51246 -51888
17051 -51888 -58810 -78606 -72904 -16996 -10004 -29368 -144138 -118861 -46597 7453 42219 8243
17039 8243 33482 80153 109315 42137 -603 -22889 -117905 -163279 -103729 20907 38843 -2179
17027 -2179 32275 22213 68023 67131 -17201 -11932 69188 32120 9267 66644 94836 88203 49826
17014 49826 14088 23165 45520 -83243 -79813 -70257 -23127 -19865 -40057 -77689 -98278 -166512
17002 -166512 -220421 -151298 -100057 -181850 -163330 -120241 -38884 589 63425 45237 -13907
16991 -13907 -104815 -97238 -64451 -6833 -9 -47296 -91271 -121278 -117655 -212763 -232621 -172251
16979 -172251 -62530 46614 124621 121214 109552 55879 440 -74004 -90441 -7341 38914
16968C8914m4514M0237r83J5137q2703j4408Q7401m9584j6902P2979l320N337
16956D7591n3912N5591L1381j0118p0489k2687j8057o5347j3017j6838J981M0341
16944i3580O4280N080Q0039L5596M8135m1273o5614l6148R9975M2543o2691p9401
16932c059l2555M1165M3406P516J19316o827p9329m0687n3176r5454q8653r6907
16920b85244m219P1431J27715J04725o2960m5761J02438L7749K445P0265k5001
16909I3583l8138j8868l0119l9694K6978L9363N3063p3076m6082n5772N1257L6000
16897a505l1048N3824J1636j7819l0034n6952m3268k717L1395Q6574O581K7948
16885C4615n060m2467n9539n5512M1801Q4741n3603j8196N2188K2575j219k4831
$$ plain form
16968 38914 -5600 34637 33654 48791 -33912 -48320 39081 -10503 -27405 45574 42254 47591
16956 47591 -6321 49270 80651 70533 44 -22643 -40700 -106047 -119064 -135902 -133921 -93580
16944 -93580 -29300 -24220 55819 91415 139550 98277 32663 -3485 96490 139033 76342 -3059
16932 -3059 -35614 5551 48957 56473 175789 168962 89633 48946 -4230 -99684 -188337 -285244
16920 -285244 -289463 -218032 -90317 14408 -48552 -94313 8125 45874 48319 118584 93583
16909 93583 55445 36577 6458 -33236 -6258 33105 86168 13092 -32990 -88762 -37505 -1505
16897 -1505 -32553 21271 32907 15088 -14946 -71898 -115166 -117883 -86488 86 6667 34615
16885 34615 29555 -12912 -72451 -127963 -86162 -1421 -55024 -73220 -21032 1543 324 -24507
16873b4507k4927j5591L6003O0590K2191n2032l4865k9740R0573L2643q204m6567
16861E567Q1795L8151j0456J64O091j4184M8393N2305o6056j0913l9787p9295
16849A1775l4436j4943k3958M8287m8015k5286M2397L3097L3896k2555K454r3685
16837i0972q8573J9959M6430m3828N7832R8699N2503k8958p3159L4122K6595j1843
16825a193n7924m2464N5320Q6055L837j05082K0807M0838j3165M7225O8758p7721
16813B5291j02857J7189J0741j0783j6239k7417J8661m5393j1155J3067j2623
16802a41518P2173J00717m3726r871O9200N6391l8256m0502o9351m9917p764Q843
16790i3581J5098p044L7796K5922P6555q447n453m1966Q8947k21j1518M6454l4047
$$ plain form
16873 -24507 -49434 -65025 -29022 31568 53759 1727 -33138 -62878 27695 60338 52134 5567
16861 5567 87362 125513 115057 115221 121312 107128 155521 207826 141770 130857 91070 11775
16849 11775 -22661 -37604 -61562 -13275 -61290 -86576 -44179 -11082 22814 259 2713 -90972
16837 -90972 -179545 -159586 -113156 -156984 -99152 -453 52050 23092 -50067 -15945 10650 -1193
16825 -1193 -59117 -101581 -46261 39794 43631 -61451 -40644 194 -12971 34254 103012 25291
16813 25291 -77566 -60377 -49636 -60419 -76658 -104075 -85414 -130807 -141962 -128895 -141518
16802 -141518 -69345 31372 -12354 -22225 46975 103366 65110 24608 -44743 -94660 -102424 -93581
16790 -93581 -78483 -85527 -47731 -21809 54746 46299 40846 -1120 87827 87606 76088 122542 88495
16777H8495l1341J7664l6722j1893q0345o3346n256M0411N9950M5267N5585M7393
16765A25862k7469n6317n5235r8194J8707O8004O9082P6421n0878o550m6690p516
16753I227M8174l1351j8549L1005P9263j377m151J6593m9858p1608k5455N6030
16741C7943P8312j0188N2761k5234o7837k6902n0096k8284M4822K2167n8941m4234
16729g5711k1520n3999k8874j9504R5721O2187K0766R843Q809J0616o410L409
16717E333J2727K4643q5671k7798L4038Q3745Q1934K2582r4144m5289L9774Q0860
16705A32734K1696M2180J3090q9333l4126J6047r6671o5671J3290L2552J00609
16694H6397K3971p6172l827L927n5668J8933M3986J2256n9004p3842J4703n5089
$$ plain form
16777 88495 57154 74818 38096 26203 -54142 -117488 -122744 -82333 -22383 22884 78469 125862
16765 125862 98393 42076 -13159 -111353 -92646 -24642 44440 120861 69983 63433 16743 9227
16753 9227 57401 26050 7501 38506 117769 116392 112241 128834 78976 7368 -18087 37943
16741 37943 116255 106067 158828 133594 65757 38855 -11241 -39525 5297 27464 -31477 -75711
16729 -75711 -97231 -151230 -180104 -199608 -103887 -41700 -20934 -11091 -2282 8334 1924 5333
16717 5333 18060 42703 -42968 -70766 -36728 47017 128951 151533 57389 12100 51874 132734
16705 132734 154430 196610 209700 120367 86241 102288 5617 -60054 -46764 -14212 86397
16694 86397 110368 34196 30369 34296 -21372 -2439 41547 53803 -5201 -79043 -64340 -119429
16682a19429l1556K2692K8221N5027J4362L1570K5680M8594k6143N0432J3973
16671A13423P44p2443n4031k6213K1650O5035J7547j399k8386j7712k3635j5162
16659b0582J5013L936l799Q037J4622K2426k911p908q5046n8018Q4284L4239P334
16646A1627o5495k9587k3668q0521P9870N6689N9709Lk5865J8483p7181J8075
16634e7861P6721K3069m2663P0308K6572k4933k4573l8271m3101J288L8597p851
16622b698n2043M8560q1772j9504N2325L7789l8387m5423K440J0414J2706j8511
16610i4104k5099K5264K7496m5516K3059J1124o2117k3961M3989J126J5956J12225
16598I442P3132j7052j2011o4458k1687N6388J04413n4643l8723j0021P6496L299
$$ plain form
16682 -119429 -150985 -128293 -100072 -45045 -30683 887 26567 75161 49018 99450 113423
16671 113423 114167 41724 -12307 -38520 -16870 48165 65712 64313 35927 18215 -5420 -20582
16659 -20582 -5569 -1633 -5432 2605 17227 39653 36742 28834 -56212 -114230 -29946 4293 11627
16646 11627 -53868 -83455 -107123 -187644 -107774 -51085 8624 8627 -17238 1245 -75936 -57861
16634 -57861 18860 41929 -734 69574 96146 71213 46640 8369 -34732 -33444 5153 -2698
16622 -2698 -54741 -6181 -87953 -107457 -55132 -17343 -55730 -101153 -98713 -88299 -75593 -94104
16610 -94104 -119203 -93939 -66443 -111959 -88900 -77776 -139893 -163854 -119865 -118739 -102783 9442
16598 9442 82574 65522 53511 -10947 -32634 23754 128167 73524 34801 24780 101276 104575
16586A04575k7286n9553q3456n388r26M2764L1390k6405k4725j0735j0915l1401
16574a02061k3336K331J2533R4495J7074m9762j02653P395O8977N2289j7555J1269
16562b9004N1988J0366m7007k8180l3560L343R266O3525O664n4195k4144n3604
16550a24542P1357J7041M8150M3991m4681j38155N330J2210J5849P4717R8312
16539G9579j2782m8140O551R530Q366J05198m2242j14026n6497M0884K6743k9681
16527b6517L9656P0303R916Q237k2197M602K2830l2563j12741k8823l5494L7621
16515f5170J03541K0395q2897L2993P6501P088l2036k4424n8113L0663N0110J00888
16503A59539J3799k6990j35891q4092o5758Q3756M6769l3584k5852m2747j8488
$$ plain form
16586 104575 77289 17736 -65720 -71108 -72034 -29270 2120 -24285 -49010 -59745 -70660 -102061
16574 -102061 -125397 -123066 -110533 -16038 1036 -48726 -151379 -143984 -75007 -22718 -40273 -29004
16562 -29004 22984 33350 -13657 -41837 -75397 -72054 -62788 737 7401 -46794 -70938 -124542
16550 -124542 -53185 -36144 12006 55997 11316 -126839 -121509 -109299 -93450 -18733 79579
16539 79579 66797 18657 25208 34738 43104 148302 106060 -7966 -64463 -23579 3164 -26517
16527 -26517 13139 83442 93358 101595 79398 84000 106830 74267 -38474 -67297 -102791 -65170
16515 -65170 38371 58766 -24131 8862 85363 92451 60415 35991 -22122 8541 58651 159539
16503 159539 173338 146348 10457 -73635 -139393 -55637 -8868 -42452 -68304 -111051 -129539
16492a29539K1740J2003Q8713m089L5231r6658R529R2963j2794N299l7787l5119
16480e0508R051M1368O0862j0053j3092R061k4822k2968L5383k0991o0002R0373
16468D3662J027n9608N033J6924J4762q2117j4067J5181K8675k2930r6052m5757
16456a95267J24529Q4067Q359Q111J3731P82m7835n0754N2466K0576N3249l8312
16444C3702N1082k8199N8747Q8643r3665q8205Q8216j8295M0492j6713J1939o2390
16432F5354j15142q390M3646L161J1811n9781p363O6688J7471M1968O462k9516
16420C6369K4927j9009o1004m0399O3805L5467L3122K9587k936J6973m430j14014
16408a542n6279l1401K4155j6125O5678j0849p1954L6348N4635k4012R794L8162
$$ plain form
16492 -129539 -107799 -95796 -7083 -11172 24059 -72599 -63070 29893 17099 22398 -15389 -50508
16480 -50508 -41457 -89 60773 50720 37628 46689 21867 -1101 34282 13291 -46711 43662
16468 43662 44689 -14919 -9886 7038 21800 -60317 -74384 -59203 -30528 -53458 -149510 -195267
16456 -195267 -70738 13329 21688 29799 43530 44312 -3523 -54277 -1811 18765 72014 33702
16444 33702 84784 56585 115332 203975 110310 22105 110321 92026 132518 115805 127744 65354
16432 65354 -49788 -58178 -14532 -11371 440 -59341 -66704 -16 17455 59423 65885 36369
16420 36369 61296 42287 -18717 -59116 4689 40156 73278 102865 99929 116902 112472 -1542
16408 -1542 -57821 -89222 -65067 -81192 -15514 -26363 -98317 -61969 -7334 -31346 -21552 16610
16396A6610q3446K6333J5996K9845N1782q119q7652p9030R537K3331O2432l7677
16384f0058M9335K4062j4175j5136K2947r890q5134N0578M8471j0079k2624r804
16372c1507m348o4690K6993k1261J1837M3361O6246m5001m7965J9523O0014K4552
16360C7754k4151P7095L3688j42767n2032M9675J8418k9236m7707L5839k7078
16349g0502J8623M479k5037N601p2353l224J9450N7775N0126n1384k6014n0871
16337a43331O933J7942L0025J11400P4375L4249n3090p9181O23K4714O3932L6330
16325A24921o4695l2718j9413m1232L1193M0815P4360o6026q4737k2166o1549
16314a21247R3554L507J9436K8648j1896N4159k1638O5487j9722j2228k4175N7011
$$ plain form
16396 16610 -66836 -40503 -24507 5338 57120 49001 -38651 -117681 -108144 -84813 -22381 -60058
16384 -60058 -10723 13339 -836 -15972 6975 -2915 -88049 -37471 11000 921 -21703 -31507
16372 -31507 -35855 -100545 -73552 -94813 -82976 -39615 26631 -18370 -66335 -46812 13202 37754
16360 37754 13603 90698 124386 -18381 -70413 -20738 -2320 -31556 -79263 -43424 -70502
16349 -70502 -51879 -47400 -72437 -66836 -139189 -142413 -122963 -65188 -15062 -66446 -92460 -143331
16337 -143331 -136398 -118456 -88431 22969 97344 131593 78503 -678 -55 24659 88591 124921
16325 124921 60226 27508 8095 -33137 -1944 38871 113231 47205 -37532 -59698 -121247
16314 -121247 -27693 -24186 -4750 23898 12002 66161 44523 110010 90288 78060 53885 110896
16302A10896q4874K7253K2410p8566l0631j093J9019M4755j852l138n1543K1062
16290f302j7221k8213Q8167M2435N3371P184m531o6233k4903J7260n1614p0100
16278f0700l0278m5352K605J3468J3176L99n2467J4241n6865k0113J50898R8248
16266B7260j094k5677l9171P4924N3510m8450k3844M4522M2481l575m4165O824
16254F3545o3543j3105N6994m4091q5544k6965l147o0395Q2536J4179j04798J45208
16242c9126J82011n0157l9510j17881N058Q4200J0134L0425L7823p270l2579j3371
16230D9757o9748l6906j9414R6877J0941j19524n8245P1464j214K81P3050k9824
16218c2505O805P07K5818k8409j4094L2981L889K2985N0209l1498j09928q7900
$$ plain form
16302 110896 26022 53275 75685 -2881 -33512 -34605 -15586 29169 27317 24179 -27364 -6302
16290 -6302 -23523 -51736 36431 78866 132237 139421 134890 68657 43754 61014 9400 -60700
16278 -60700 -90978 -136330 -133725 -120257 -107081 -106682 -159149 -144908 -201773 -221886 -70988 27260
16266 27260 26166 489 -38682 36242 89752 41302 17458 61980 104461 100886 56721 63545
16254 63545 2 -13103 43891 -200 -85744 -112709 -115856 -176251 -93715 -79536 -184334 -39126
16242 -39126 142885 92728 53218 -64663 -59605 24595 34729 65154 102977 95707 63128 49757
16230 49757 -19991 -56897 -76311 20566 31507 -88017 -146262 -74798 -76012 -75731 -2681 -32505
16218 -32505 -25700 -24993 825 -27584 -41678 -8697 -4808 18177 68386 36888 -73040 -160940
16206a60940N8810J05059K8488M7203j9241K1396K5589j715p8118p0910M7305
16195B926N6467p2218j2939N6065L5685l2867n5916J2728O6753j6151r807p2861
16183d2135O703J38966J5520p9089j21781j02057o9688Q9199J59823P3623j13267
16172d4183l0419L8895k3802n4831P2407Q8727K3233j9313J8470p9012n8624Q030
16160f0422M0938R8629J03557o4598k7603m1362n0283k7179k8481Q155Q3664J3039
16148D8054n281J8408j8393m2740l9404K8926n619N2447L3220l4110L4111K871
16136G2490k9862N5941M7168J0383j70914q527K6176O832M5225N4032j6998j0657
16124H1289l225j39071k9948R95j0423R7260P0901J5780r487n2026q7751K6186
$$ plain form
16206 -160940 -102130 2929 31417 78620 59379 80775 106364 104649 26531 -44379 2926
16195 2926 59393 -12825 -25764 30301 65986 33119 -22797 -10069 56684 40533 30726 -42135
16183 -42135 -35432 103534 119054 39965 -81816 -183873 -253561 -164362 -4539 69084 -44183
16172 -44183 -74602 -35707 -59509 -114340 -41933 46794 70027 50714 69184 -9828 -68452 -60422
16160 -60422 -19484 79145 182702 118104 90501 49139 -1144 -28323 -56804 -48649 35015 48054
16148 48054 42773 61181 42788 48 -39356 -10430 -16049 36398 69618 35508 69619 72490
16136 72490 42628 98569 145737 156120 -14794 -23321 2855 9687 54912 108944 91946 81289
16124 81289 78064 -61007 -90955 -89960 -100383 -3123 67778 83558 74071 22045 -65706 -39520
16112c9520O1888K5607m5233m3065M3366K8260k0634p6031L0827K8767L9764L0701
16100F4697j01699j4461P3260r044M7187K5480n1264j105l3442m1945j4766n2261
16088a09363q67K0331L3282J09383K7359L3089M86o139o0773l5421n1455l2281
16076g2369j607P1948Q7167l3459j01181m5080J45917O2191k7831j11445q1693
16065a07442M4255K6329m7323k4504L9447M7081L9216K1837o8034m9118J07226
16054B8970J6750j1353p5387J8518N3314L6522m7953k8710J8686O320o0676N221
16042c9778K7933Q748l1648M629R783M8765m5248n9542M1525m5971M3286r779
16030d7297L4892J4611L9008L5928q8989j26462n086J7482M9946P0476P2946k8418
$$ plain form
16112 -39520 22368 47975 2742 -40323 3043 31303 10669 -65362 -34535 -5768 33996 64697
16100 64697 -37002 -51463 21797 12753 59940 85420 34156 33051 -391 -42336 -57102 -109363
16088 -109363 -110230 -89899 -56617 52766 80125 113214 113700 107561 46788 11367 -40088 -72369
16076 -72369 -73976 -2028 85139 51680 -49501 -94581 51336 113527 85696 -25749 -107442
16065 -107442 -63187 -36858 -84181 -108685 -69238 -22157 17059 38896 -29138 -78256 28970
16054 28970 45720 34367 -41020 -22502 30812 67334 19381 -9329 9357 15677 -44999 -39778
16042 -39778 -11845 -3097 -34745 -30116 -20333 28432 -16816 -76358 -34833 -80804 -37518 -47297
16030 -47297 -12405 2206 41214 77142 -11847 -138309 -143395 -125913 -75967 -5491 67455 39037
16018C9037P33L0864K925J6203j5948m8718k1899K4155J6808P3513m520m3713
16006F9440J9261J2043L909L3638M2819k476n7952p8176n3715k3198l4669k3541
15994i2617L6151Q1053R5941K4869l3580j6059L763o4546l2958L8374N2760m0908
15982E2243n1738m5263m469J17356m6836j5663M7085j0625m6860q53J7429n9620
15970d7814L5079N5893O387j8033M5683k0441j08598L9422P5326l6447q1852j1165
15958f6560M6686J7296n5483J38563M7509N5076M2204q3749k8358k803n8372k2601
15946B9408O6968J418l0493j5201j8985n5175M4654J9379N1918n547k5862K1050
15934H3532l5985M407l3689L5475j2328k63K2575J3902O2170L7886J0955p9339
$$ plain form
16018 39037 39770 70634 73559 89762 73814 25096 3197 27352 44160 117673 113153 69440
16006 69440 88701 100744 104653 138291 181110 178634 120682 42506 -11209 -34407 -69076 -92617
15994 -92617 -56466 24587 120528 145397 111817 95758 99521 34975 2017 40391 93151 52243
15982 52243 505 -44758 -49227 68129 21293 5630 52715 42090 -4770 -5623 11806 -47814
15970 -47814 -12735 43158 49545 31512 77195 56754 -51844 -12422 62904 26457 -55395 -66560
15958 -66560 -19874 -2578 -58061 80502 128011 183087 225291 141542 113184 110381 52009 29408
15946 29408 96376 97794 67301 52100 33115 -22060 22594 41973 93891 88344 62482 83532
15934 83532 47547 51954 18265 53740 41412 41149 63724 77626 139796 177682 188637 109298
15922A09298j17248p1943K2906r83O6593J12174M2798j0894n911o5185l375n2845
15910B5385j05122m442M1846O7018j2249o5294l7419P3362J3823l896l3283K889
15898c7382O4203m0856j01265J5061l8924N535M9763R603k9697J0913K7256Q9369
15886B3579j116o6003o9928J4580J21646N8241j52842j09337k7255M4040K7298
15875a37097L2868P9262Q5986l9974o6978k8087l0234Q656M0973O1451q14P917
15863A3929k413j143p4490M664R4190l9784j00377j6877r575m1030m6628J3404
15851b06130K1806J7973M8425K2965o5842P0648Q9352J4981J521L2462N607l0532
15839B3236p6527k3882N2894L0233Q1543J3679o4324J0324p485r30J17225M1038
$$ plain form
15922 109298 -7950 -79893 -56987 -57970 8623 120797 163595 152701 146790 81605 78230 25385
15910 25385 -79737 -84179 -42333 24685 12436 -52858 -90277 -16915 -3092 -6988 -40271 -37382
15898 -37382 26821 -14035 -115300 -100239 -139163 -133628 -83865 -74262 -103959 -93046 -65790 23579
15886 23579 22463 -43540 -113468 -98888 22758 80999 -71843 -181180 -208435 -164395 -137097
15875 -137097 -104229 -24967 61019 21045 -45933 -74020 -104254 -95598 -54625 6826 6012 13929
15863 13929 11516 10373 -64117 -59453 34737 -5047 -105424 -122301 -131876 -172906 -219534 -206130
15851 -206130 -184324 -166351 -117926 -94961 -160803 -90155 -803 14178 15699 48161 53768 23236
15839 23236 -53291 -77173 -24279 5954 87497 101176 36852 47176 39691 38761 155986 197024
15827A97024j07090K0096L4715K9444j9731q8439o7542p3888l0373P8848J10333
15816H3397m305O7338N1607j3758m9431k1816k6540o2855o3604o877R5466O4397
15804A13019k7647n7365j07398j2477N9820N6117l513k8379J404K9690j9678L1630
15792C5223J8200J2061l7650j5824P7265Q2332o4430J4356K0153L6884j7819n8394
15780A02357r5535j175P1043K3213k3973N1500l8428j01579o6813k1966l3401
15769a34757p03Q0448Q2135j330j637j603K440m3340J8776J0704j8845L6851J959
15756C1098n3352R977k0371J8443K3881N898k6674n2197l9439L2281K6814P1407
15744B7766K35j05310K675L9079K9512l3553O6346m8729j8613J6999K640o384
$$ plain form
15827 197024 89934 110030 144745 174189 154458 66019 -1523 -75411 -105784 -26936 83397
15816 83397 79092 146430 198037 184279 134848 113032 86492 23637 -39967 -46844 48622 113019
15804 113019 85372 28007 -79391 -91868 -32048 24069 20556 -7823 -6419 23271 3593 35223
15792 35223 53423 65484 27834 12010 89275 171607 107177 121533 141686 178570 160751 102357
15780 102357 6822 5647 76690 99903 75930 127430 89002 -12577 -79390 -101356 -134757
15769 -134757 -135460 -55012 27123 25793 24156 22553 24993 -18347 429 11133 -7712 29139 31098
15756 31098 -22254 -12277 -32648 -14205 9676 15574 -11100 -63297 -102736 -70455 -43641 27766
15744 27766 28001 -77309 -74634 -35555 -6043 -39596 26750 -21979 -40592 -23593 -20953 -27337
15732b7337J7227k3934P4975L9438R549j1790l5796m3845n4743J7616Q3019O0273
15720A04652o4952j0315K2550L446M4755K3067o4937l1496o197j7606j5071n8676
15708g0780K8468m1813K5381L6287O7535k2794r4563J4449J29006j8979l8880
15697A3317K6300o2427l464O0055J592L7221m4220J4565N8617P433n5302r2159
15685c8472k4680L0626J32287J5733L7885K8076j5028j02541j13791j4506O6963
15674B552l3142j5724M1920j7452l3279M3035P6507q065M2841m1435j42343J2040
15662g2545Q1166J0282n9523k0264P1674Q560l479j2051j00891K4075Q1931M905
15650A3840k9713O517l571N2546J2488p3341k1814o3505J0327M1524l1498P2231
$$ plain form
15732 -27337 -10110 -34044 40931 80369 89918 78128 42332 -1513 -56256 -38640 44379 104652
15720 104652 39700 29385 51935 55381 100136 123203 58266 26770 20573 2967 -12104 -70780
15708 -70780 -42312 -84125 -58744 -22457 45078 22284 -72279 -57830 71176 52197 13317
15697 13317 39617 -22810 -26274 33781 35373 72594 28374 42939 101556 108989 53687 -38472
15685 -38472 -63152 -32526 99761 115494 153379 181455 166427 63886 -49905 -64411 2552
15674 2552 -30590 -46314 -4394 -21846 -55125 -12090 64417 56352 99193 57758 -84585 -72545
15662 -72545 8621 18903 -40620 -60884 10790 19350 15871 3820 -97071 -72996 8935 13840
15650 13840 -15873 -9356 -12927 39619 52107 -21234 -43048 -106553 -96226 -54702 -86200 -13969
15638a3969m3107q4420M557J11919M8193L2008j5600k8123l9679L4313k4008r2270
15626a10186j5572P4864r535j0215o5785l8492O4221M4773k483O1235L7634M223
15614C4682l2710k3874r89K9160L0907K2293m2715o1936K3362j2107K7582L1709
15602B5364m4301m1551N5773L7887j2931o6412l5174M9450Q7566K871N702m6075
15590A8169j17620j8118L2770M7506M8505j4032l1321J0982j4940o6123L7489
15579f6733l7680K7947R1133j1508M0485j3783J854m0826k8909j6591K559k7045
15567g9097k360Q1803K6632J4098m2628j07526k4439N2560Q1591N9996K4231n136
15555G9725J7167L661L0044l0584o4582j28493k1070O0509J1973J9863L832n3523
$$ plain form
15638 -13969 -57076 -141496 -136939 -25020 23173 55181 39581 11458 -28221 6092 -17916 -110186
15626 -110186 -125758 -50894 -60429 -70644 -136429 -174921 -110700 -65927 -68410 -7175 30459 34682
15614 34682 1972 -21902 -22891 6269 37176 59469 16754 -45182 -21820 -33927 -6345 25364
15602 25364 -18937 -60488 -4715 33172 20241 -46171 -81345 -31895 55671 58542 64244 18169
15590 18169 -99451 -117569 -84799 -37293 11212 -2820 -34141 -23159 -38099 -104222 -66733
15579 -66733 -104413 -76466 14667 3159 43644 29861 31715 -9111 -38020 -54611 -52052 -79097
15567 -79097 -81457 346 26978 41076 -1552 -109078 -133517 -80957 634 60630 84861 79725
15555 79725 96892 100553 130597 100013 35431 -93062 -114132 -53623 -41650 -21787 -17955 -71478
15543g1478J8441N745p761M8880K5659J2726n6611q685K6949L3436n6824m0785
15531g0308L8177R7613K7048q5000n0491K2198K5401l6255N9572j3347n3847M2960
15519C721J51856Q2322J4690k8542q0551p3532M2001M0673L3021L9711l7601l9223
15507A48546N9590n236j22969k1765p8353n9128J2227K810Q313M378o863R0721
15495C2271j0796j7588O2669j550n0775J9491N4389j2295r4873J1365J34753j272
15483A25789j39367o803J0488q710n097j0462l3474M5340J8696l8342j7561m0034
15471i9537n6805J5176J57092O4607q5889J7939K7310O9808M641p5329n0475j520
15459a2982k8498P2247k9706k7256O384J4365m4633m6019j675J3112Q4349M5818
$$ plain form
15543 -71478 -53037 -47292 -55053 -6173 19486 32212 -24399 -33084 -6135 27301 -29523 -70308
15531 -70308 -32131 65482 92530 7530 -42961 -20763 4638 -31617 27955 14608 -39239 3721
15519 3721 155577 237899 252589 224047 143496 69964 111965 152638 185659 225370 187769 148546
15507 148546 208136 202900 79931 58166 -20187 -79315 -67088 -64278 -55965 -51587 -58450 32271
15495 32271 21475 3887 66556 65006 14231 33722 88111 75816 -19057 -7692 127061 125789
15483 125789 -13578 -20381 -9893 -18603 -23700 -34162 -67636 -22296 -3600 -41942 -59503 -99537
15471 -99537 -156342 -141166 15926 80533 -5356 12583 39893 109701 114342 39013 -11462 -12982
15459 -12982 -41480 30767 1061 -26195 -19811 -5446 -50079 -96098 -97773 -84661 -312 45506
15447D5506j6487l9963M1646l2122r7930m4878N9566J17916J5081r4185Q691J39313
15435A02154j3703r7347q8574L6840k874J5563K2311j7509K4089k1646l0771J9419
15423e2048L2533L7990L9947L2964O9816j03389l9141J5805Q9615o0342r0153
15412b6403K8828K0349n959j4001k1700O3545K1432L1992M8921M7325k2181m8260
15400A23888m7166P2396o6522n061q3876r4410J2819l5987P386L874R8537P9858
15388F5736m7304J8729Q3282L9687l3424o981j5007l0567m3529j0223L2287j2317
15376D0369n8409n6563J1848K3051l2442J5384J18789K9245j1809q1444n664J7603
15364I958k8781k8437l6363k1973L7653J0645N0146P7242R799M2511m9088j02229
$$ plain form
15447 45506 29019 -10944 30702 -1420 -99350 -144228 -84662 33254 48335 -45850 -37159 102154
15435 102154 88451 -8896 -97470 -60630 -63504 -47941 -25630 -43139 -19050 -40696 -71467 -52048
15423 -52048 -19515 18475 58422 91386 161202 57813 18672 34477 124092 63750 -26403
15412 -26403 2425 22774 16815 2814 -18886 44659 66091 98083 147004 194329 172148 123888
15400 123888 76722 149118 82596 77535 -6341 -100751 -87932 -123919 -116533 -112659 -14122 65736
15388 65736 18432 37161 120443 160130 126706 119725 104718 74151 30622 20399 52686 40369
15376 40369 -18040 -74603 -62755 -39704 -72146 -56762 62027 91272 79463 -1981 -7645 9958
15364 9958 -18823 -47260 -83623 -105596 -67943 -57298 -7152 70090 79889 122400 73312 -28917
15352b8917j1389r4K4061m2205j1643k9304J3517J08049M3534K1814O5508P8140
15340B31071K1054O091m0117o8402l2067n8886p5299p3457j2053J4878J23323
15329C6136P7025j5565K4575L0533j05954n4944M2719J28092P685j4672n2787
15318A02843o6426r1587j30357L3879N3283J9050M2045Q1876J2677J8205N64K66
15306G6318n9091J7858m944p6190k9691m3600L274R3406Q3535K7689j5803m1920
15294C0841M6945j4986o7255m2116K3410L1837L5547k9811p9745k0305J0424J34868
15282E9654M2268m6082p7210j5600L2622M2627n8821j27265o503L3864N1118M0336
15270b8992j837o546K3469K6076J4755k5032o4157J5223j575K8471m307J4263
$$ plain form
15352 -28917 -40306 -40400 -16339 -58544 -70187 -99491 -85974 22075 65609 87423 152931 231071
15340 231071 252125 258216 218099 149697 117630 58744 -16555 -90012 -102065 -87187 36136
15329 36136 113161 97596 122171 152704 46750 -8194 34525 162617 170302 155630 102843
15318 102843 36417 -55170 -185527 -151648 -98365 -79315 -37270 44606 57283 75488 76052 76318
15306 76318 17227 35085 30141 -46049 -75740 -119340 -116066 -22660 60875 88564 72761 30841
15294 30841 77786 62800 -4455 -46571 -23161 8676 44223 14412 -65333 -85638 -75214 59654
15282 59654 101922 55840 -21370 -36970 -4348 38279 -20542 -147807 -154310 -120446 -69328 -28992
15270 -28992 -30829 -37375 -13906 12170 26925 1893 -62264 -47041 -48616 -20145 -24452 -10189
15258a0189m0908l6676P8309m7089l6094k375l4737N1623N5734k8178q2271R6441
15246c6410Q9241k2025n7359j3520n995L8862o276O3410R7114R942p2165m3167
15234D1652L0851r2103j57421Q7485J34612p3091l781J2342m2680l7575k0945
15223a20654j8483n267J9495l5257O3048J18705M2941j922k416j0283m0489m1120
15211c1702O6237l7474M4880P1091n1264n3092K9473l0809l8175m7997j8681M1906
15199e5607P5118l7577k6507N5160k012l5909L54L3245O67L7735J8260J2941l6316
15186C9552j08437P0710J2772K1625j3551M7159J5702M731J5106k3051J4548K9565
15174A26431J7888m5088k2864k3311J6384o6142k6597j0027L2436l8618p4207
$$ plain form
15258 -10189 -51097 -87773 -9464 -56553 -92647 -95022 -129759 -78136 -22402 -50580 -132851 -36410
15246 -36410 52831 30806 -26553 -40073 -46068 -7206 -13482 49928 147042 156984 84819 41652
15234 41652 72503 -19600 -177021 -89536 45076 -28015 -31796 -19454 -62134 -99709 -120654
15223 -120654 -139137 -144404 -124909 -160166 -97118 21587 64528 62606 60190 49907 9418 -31702
15211 -31702 34535 -2939 41941 113032 61768 8676 38149 7340 -30835 -78832 -97513 -55607
15199 -55607 19511 -18066 -44573 10587 8575 -27334 -26980 6265 6932 44667 62927 75868 39552
15186 39552 -68885 1825 14597 36222 22671 69830 85532 90263 105369 82318 96866 126431
15174 126431 144319 99231 76367 53056 69440 3298 -23299 -33326 -890 -39508 -113715
15163a13715K4434N4335O2567J62759M0086p3833o6850p87M4317m5708l3887n5018
15151a300L7163J1020j08164J552Q3179K4596j3085m8904l4005K7598Q4006M1925
15139A05581m1840o1588q4058Q471k1145M0081R3182R6186O087m2213n6251l3977
15127H516l868j0791L442j2713l3245m1763N602K3765L4162j8843L351l9813O4407
15114a7791R8910O2822k8702r3382r625k1676j4264N5613Q5457l0958p3223q820
15102D361N5526r4192q287R1422M0372p1399r6605n2498l3917J07244j138n6419
15090a15530J8446J26062N0450n8497M111l3476q8839k8662l6408J19160J33433
15079I0250K3764l9483m4472n5152j4738P8142O4053j8958l9467R461k5749l5920
$$ plain form
15163 -113715 -89281 -34946 27621 190380 230466 156633 89783 88996 133313 87605 53718 -1300
15151 -1300 35863 46883 -61281 -59729 23450 48046 34961 -13943 -47948 -20350 63656 105581
15139 105581 63741 2153 -81905 -73434 -94579 -54498 38684 134870 140957 98744 42493 8516
15127 8516 4648 -6143 -2701 -15414 -48659 -90422 -84820 -61055 -26893 -45736 -42385 -82198 -17791
15114 -17791 81119 143941 115239 21857 12232 -9444 -23708 31905 117362 86404 13181 4361
15102 4361 59887 -34305 -42592 48830 89202 17803 -78802 -131300 -165217 -57973 -59111 -115530
15090 -115530 -97084 28978 79428 20931 25042 -8434 -97273 -125935 -162343 -43183 90250
15079 90250 114014 74531 30059 -25093 -39831 38311 102364 83406 43939 53400 27651 -8269
15067h269K44L3288Q6873J8971r861l8192L8218K5797o1000o9297J3797j7581
15055A2988m6731l5123j1514P6526J294J6508L3771j06090m222M2407L371K5049
15043H234J288r659Q0874l8391p6774J02106R1129l2472p6323l1172j1888P07
15031G659k0560O380K2663J219p2776q982Q8784Q739r2792J4668K7079R786m746
15018a2879m2049o4191M2696k4505J9810L5698K7952K8546M9312j9520n7323j512
15006a7965L662n4889Q998m031p1180N156K0339j1874k0052k7596p4235J21567
14994a22100J2238n7504K4944L2264N1522k0388K1105R4462K2975o8375k0893
14983b9750J3979R4564K2859k5115o6636m7434n4814m0202k4431Q0612M2898J2246
$$ plain form
15067 -8269 -8025 25263 112136 131107 121246 83054 121272 147069 86069 16772 30569 12988
15055 12988 -33743 -68866 -80380 -3854 -2560 13948 47719 -58371 -62593 -20186 -16815 8234
15043 8234 9522 -137 80737 42346 -34428 67678 158807 126335 50012 18840 6952 7659
15031 7659 -12901 -6521 16142 17361 -55415 -64397 24387 33126 -59666 -44998 -17919 -8133 -12879
15018 -12879 -54928 -119119 -76423 -100928 -81118 -45420 -17468 11078 60390 40870 -16453 -17965
15006 -17965 -14303 -69192 -60194 -64225 -135405 -130249 -109910 -121784 -141836 -169432 -243667 -122100
14994 -122100 -109862 -167366 -142422 -110158 -58636 -79024 -57919 36543 59518 -8857 -29750
14983 -29750 -15771 78793 101652 76537 9901 -37533 -92347 -132549 -156980 -76368 -33470 -21224
14971b1224K4252k1543k4009o727N5014l5738K36n0288M7428Q8426o6824r9452
14959a10449l1896M2807J35898Q5178N160n5804n6084m8275j06322K9059Q3197
14948b7531l0521j2574P0756r678M439M8764p7334l5526M4911N0687Q2412O760
14936A15565M876O155k381o8239l6230K2530q178J13148q8250o8499j1833J8310
14924c026K3917j8405J585O8367j680L417j11558p5779j9257P2406j8367j5941
14912i4321Q0557J09675K7312m1328j20427m2632O6399J12969p7214N474N4104
14901H0568q2445o6415k3226N425K232K5945K3194Q197P1655p9663n2720o306
14889i3559K1279M3148o017l9231O6955P3482M3348L723j3083q798J3574n5727
$$ plain form
14971 -21224 3028 -18515 -42524 -49251 5763 -29975 -29739 -80027 -32599 55827 -10997 -110449
14959 -110449 -142345 -99538 36360 121538 126698 70894 14810 -33465 -139787 -110728 -27531
14948 -27531 -58052 -70626 130 -9548 -5109 43655 -33679 -69205 -24294 26393 108805 115565
14936 115565 120441 126596 124215 55976 19746 42276 34098 147246 58996 -9503 -21336 -3026
14924 -3026 20891 2486 4071 72438 70758 74175 -37383 -113162 -132419 -60013 -78380 -94321
14912 -94321 -13764 95911 123223 81895 -38532 -81164 -14765 98204 20990 26464 80568
14901 80568 -1877 -68292 -91518 -86093 -83861 -57916 -34722 -26525 45130 -34533 -87253 -93559
14889 -93559 -72280 -29132 -35149 -74380 -7425 66057 109405 113128 100045 91247 104821 49094
14877D9094N3453J6373j2056p2070p1032J8367P1389J3218Q668l508j27603n1340
14865a07047j7089j2575k8123o336J2745J19436O4153N3558L5816n6618j3869
14854D4051k0109j7166o819K4753l4147Q573K9203p505k9803l5630R0445P814
14842E3660j4337O1292P3475n2727P150L4161Q684J1568J4718l1956j383k9486
14830A34819j16596n2893K2875P194L0808r2255K4996O1968o441L8564l2394m7766
14818b7121J4225P109m5679o078J6292O0275R4900j1951j5389Q95n1242m7240
14806a1004N645l4150K921j4334j8663M1697J065n308O3929j8015M8360L1928
14794I4071K0250K5218P544o3977j3771l5729l1393M690k7341P8201K4024p5388
$$ plain form
14877 49094 102547 118920 106864 34794 -36238 -17871 53518 66736 75404 71896 -55707 -107047
14865 -107047 -124136 -136711 -164834 -171170 -158425 -38989 25164 78722 114538 57920 44051
14854 44051 23942 6776 -43 24710 -9437 -864 28339 20834 -8969 -44599 45846 53660
14842 53660 39323 100615 174090 121363 128513 162674 171358 182926 197644 165688 164305 134819
14830 134819 18223 -34670 -11795 -4601 26207 -66048 -41052 20916 14475 53039 20645 -27121
14818 -27121 -12896 -5787 -51466 -57544 -41252 19023 113923 101972 86583 87478 36236 -11004
14806 -11004 -5359 -39509 -36588 -50922 -69585 -27888 -26823 -32131 31798 13783 62143 94071
14794 94071 114321 139539 147083 83106 69335 33606 2213 6903 -20438 57763 81787 6399
14782F399j4630J0898O314J0187n6114j30270J2625R129J1580J6254N3413L6365
14770b7850l4651K003R685J6232K9692K1745J01535P0366r7563m7399q571L8270
14758G3494L1560K1329l718o8498j43602l4547K7309q8741N7438R9964N245l9346
14746f2113J103M9132J8436O3697L7791J2117J4993l7283j48044o0517P123M6562
14734e7003M9799m211N9369J32178l2765j0107Q9o0115j02439n0774M2179l0849
14722f4649n2609L832M5730P8817N5045N2146L0914N2747o0435j15165j28326
14711a01953n3504J2199M7323L3809M1450M6127n183P6051M9426n6944k3826M1687
14699A06662m3541M9882k3821K2469l855k4665p3218m8113O980N529j5141O4485
$$ plain form
14782 6399 -8231 2667 8981 19168 -36946 -167216 -154591 -145462 -133882 -117628 -64215 -27850
14770 -27850 -62501 -60498 -50813 -34581 -4889 16856 118391 188757 91194 43795 35224 73494
14758 73494 105054 126383 122665 54167 -89435 -123982 -96673 -185414 -127976 -28012 -22767 -62113
14746 -62113 -61010 -11878 6558 70255 108046 120163 135156 97873 -50171 -110688 -103565 -57003
14734 -57003 -7204 -11415 47954 180132 147367 137260 137349 77234 -25205 -75979 -33800 -64649
14722 -64649 -117258 -113426 -67696 11121 66166 118312 149226 201973 141538 26373 -101953
14711 -101953 -155457 -143258 -95935 -62126 -20676 25451 20268 96319 145745 88801 64975 106662
14699 106662 63121 113003 89182 111651 107796 83131 9913 -38200 -31220 -25691 -40832 23653
14687B3653L6017q4107j05736j3611Q2243M7590L6677n5947L390R0694n064k0988
14675C4811K4460o4250m1537R2419J1956P8758N2683n5922k5643o047q4568r9667
14663h2547L0970P7540j1154j3583l5587N067O5360k9343M1134O4788O6823o0692
14651A18776O898o535j8350l9789m9406j9938l0230L922O2434j2096J6012M322
14639C6020P3825M5340K0850k1005k493p7145q0084j0252p252o3243L7773o3293
14627a10959j27960R5204N1571N1173J21226P0717O2608J2104p9238r4330J5523
14616F7639m154N6901O4964k2551K2637k6627k5579q5754m7751L4836j2366o3323
14604d1128O4016K5J09499J1633m7941j4208q905r565N038K6377N4882j71Q490
$$ plain form
14687 23653 59670 -24437 -130173 -143784 -61541 -13951 22726 -33221 -29831 60863 55799 34811
14675 34811 59271 -4979 -46516 45903 57859 136617 189300 133378 107735 101688 17120 -82547
14663 -82547 -51577 25963 14809 1226 -34361 -29294 36066 6723 47857 112645 179468 118776
14651 118776 125674 119139 100789 61000 11594 -8344 -38574 -34652 27782 15686 31698 36020
14639 36020 109845 155185 176035 155030 152537 75392 -4692 -14944 -22196 -85439 -47666 -110959
14627 -110959 -238919 -143715 -92144 -40971 80255 150972 213580 225684 146446 52116 67639
14616 67639 63485 120386 185350 162799 185436 158809 133230 47476 -275 34561 22195 -41128
14604 -41128 22888 22913 132412 144045 96104 81896 72991 63426 68464 94841 149723 149552 158042
14591A58042j7565k5230k8817j2488j9271j2709L8306J6727m2783j16524K6633
14580c5679M5359M1590J2334k0348l0210l7730k1961p66q667J880J01414Q7861
14568A35077m335n2580L462J166L8443n4794j20696J5678P3809K223L0535k473
14556F5515m8039J1053m8514p7752M1849N7808O7729q5652m0707J02913m1611
14545D592p1237J9267Q6264K5151P2954P645K1620K2081K2463n5731n8524p7670
14533A8875p7930m1634k2603N7086J14349m6943n7746O4004l4922K0643Q3923
14522G7102L240j846j5699m6472k274J8809N7347R4152L5046k1592m9703m2254
14510A05856L822J9960j1047o9646l1902K9855N0197N727j20270n3260L1722J30480
$$ plain form
14591 158042 140477 115247 86430 73942 54671 41962 80268 96995 54212 -62312 -35679
14580 -35679 9680 51270 63604 43256 13046 -24684 -46645 -47411 -56078 -54198 47216 135077
14568 135077 130742 78162 81624 82790 121233 66439 -54257 -38579 35230 37453 67988 65515
14556 65515 17476 28529 -19985 -97737 -55888 1920 69649 -16003 -56710 46203 4592
14545 4592 -66645 -47378 38886 64037 136991 144636 166256 188337 210800 155069 96545 18875
14533 18875 -59055 -100689 -123292 -66206 48143 1200 -56546 7458 -27464 -6821 77102
14522 77102 80342 78496 62797 16325 14051 32860 90207 184359 219405 197813 148110 105856
14510 105856 109678 129638 118591 48945 17043 46898 97095 102822 -17448 -70708 -38986 91494
14498I1494K4280n3616j5361m2429l7848j4400N39R5315K647j6710m330l9719
14486a0138k582K5712o8268K9259M1944L2669N755p1405j3117J06754K5456P2184
14474A74223N649o4444l7262m5706J6965L4948q8470o5220J8693P4097k0413M4120
14462D7180M7945n9071O984K7237j1882M0941O4165N8167j2437j00027p8074k9686
14450A442L128p542N2123M7096j1605M2730M7118R469o8021j6423J9258k1036
14438I7737o5832o6039l4981J2035P2290k0452j1439L4296r397j1207j8395r6602
14426a17986n7733j8960Q3249Q9879J2408J2341J20825o174j71101m5261O1087
14415c7426Q706O084j3810m3846m8290l1693O6443M3598k764k9535N5755R4693
$$ plain form
14498 91494 115774 62158 46797 4368 -33480 -47880 -47341 47974 50621 33911 29581 -10138
14486 -10138 -12720 12992 -55276 -26017 15927 48596 54351 -17054 -30171 76583 102039 174223
14474 174223 179872 115428 78166 32460 49425 84373 -4097 -69317 -50624 23473 3060 47180
14462 47180 95125 36054 43038 70275 58393 99334 163499 221666 209229 109202 31128 1442
14450 1442 4570 -2972 49151 96247 84642 127372 174490 183959 115938 99515 118773 97737
14438 97737 31905 -34134 -69115 -57080 15210 -5242 -16681 17615 8218 -2989 -21384 -117986
14426 -117986 -175719 -194679 -111430 -21551 -9143 3198 124023 117849 -53252 -98513 -37426
14415 -37426 -28720 -22636 -36446 -80292 -128582 -160275 -93832 -50234 -52998 -82533 -26778 67915
14403F7915K2995J391l7962j7248N6061M9303N1464k4879m5594j04131n9501r5973
14391a36159K8339N4762R0571N1190q496r0346l9207K6647m3796l2164n5718p6441
14379b30818M1379k339K6259N5078L3352P0863J8185J7205P1198O172l6734n4169
14367A5631P247M5653q0492m6339n9504M919N1789K6508L2182m224J6735r697
14355D08P7256M6275m6059l5203M796q0283m727L1822L6396J9772o435P7360J160
14342A22538p1508j07254l0542J4572O2911j2386k909k7797O5969O8m1774j5909
14330d4021J6441k7561r5021L5162J02515L5467j1476j8900m1110L2788j7556
14319c3272J1195N4316J7961J0305J7373n968K7047N5643L2548m0393m6636o6591
$$ plain form
14403 67915 90910 92301 54339 37091 93152 142455 193919 169040 123446 19315 -40186 -136159
14391 -136159 -107820 -53058 37513 88703 80207 -10139 -49346 -22699 -66495 -98659 -154377 -230818
14379 -230818 -189439 -191778 -165519 -110441 -77089 -6226 11959 29164 100362 106534 69800 15631
14367 15631 22878 68531 -11961 -58300 -117804 -112885 -61096 -34588 -2406 -6630 10105 408
14355 408 77664 123939 77880 42677 47473 -32810 -37537 -5715 30681 50453 44018 121378 122538
14342 122538 51030 -56224 -86766 -72194 -9283 -21669 -24578 -52375 13594 13662 -28112 -44021
14330 -44021 -27580 -55141 -150162 -115000 -12485 22982 11506 -7394 -48504 -15716 -33272
14319 -33272 -22077 32239 50200 60505 77878 71910 98957 154600 187148 146755 100119 33528
14307C3528m0737j8868n7600M7880K5595N2993R1865m885K2132r2316P814M4654
14295A12055n6774r6351j5008l7169P821O202J5690j6496O5720J497r729k6211
14283d8753R303O0172l113J25780L637o4284j3905K2367m435o1465j0645q8858
14271g4199l7271R2165M9647o2750l7603M493J01818Q3090l2970r0755N1133R6854
14259A43652l1163l0962J3423j2086K6615m1245l3306m9555l2296J4967K5950
14248f006M1644J9171J5142m9924k7357M7850l6093k6195j00025o0571J44303
14237c8061P1762j7783L9665K8916p5851R475L5169j8140m8149P4774j9142l8811
14225C824K653J4567l7003o0317j2136L7212L0679P947r1564n7841J4591Q199
$$ plain form
14307 33528 -7209 -26077 -83677 -35797 -10202 42791 134656 129771 151903 59587 67401 112055
14295 112055 55281 -41070 -56078 -93247 -85426 -79224 -63534 -80030 -14310 -12813 -22542 -48753
14283 -48753 -39450 20722 17609 143389 147026 82742 68837 91204 86769 25304 14659 -74199
14271 -74199 -111470 -19305 30342 -32408 -70011 -65518 36300 119390 86420 -4335 46798 143652
14259 143652 112489 81527 94950 82864 109479 68234 34928 -14627 -46923 -31956 -6006
14248 -6006 35638 54809 69951 20027 -7330 40520 4427 -21768 -121793 -182364 -38061
14237 -38061 33701 15918 55583 84499 8648 18123 53292 35152 -12997 61777 42635 3824
14225 3824 6477 21044 -15959 -76276 -88412 -51200 -20521 -12574 -104138 -161979 -147388 -139189
14213a39189j6271O915k5377M0623J13339n595m9412j2539N3209N719N2380R910
14201C3712n3242R8292N144n5921J9848r544j30591k9970Q9768L4188j6057q1931
14189i6304n1433K1580j3347K7723P2196J6852l299k7405N3280O1627j6621L5030
14177G9879k7933K3526Q153J4295J3442r9456k2738M4252J0384k6466m0339n985
14165b8986L9519J8138k2167O7641J02474m6402k5116R8691n0036K9532L5079
14154B18367j76400l8996j3994R2003J0285p9579o6539J475M7884l1976m8481
14143h5951k3441L0112J376l9437k2955L6087J69835Q0428J7987N093n5298m7435
14131F6401j7504j8492K842k5755m1849l2335L5144K8759J0600J29781M9337r8758
$$ plain form
14213 -139189 -155460 -148545 -173922 -133299 -19960 -25555 -74967 -87506 -34297 -28578 23802 33712
14201 33712 -19530 78762 83906 27985 47833 38289 -92302 -122272 -32504 1684 -14373 -96304
14189 -96304 -147737 -126157 -139504 -111781 -39585 -22733 -26032 -53437 -157 61470 44849 79879
14177 79879 51946 75472 83625 97920 111362 11906 -10832 33420 43804 17338 -23001 -28986
14165 -28986 10533 28671 6504 74145 176619 130217 105101 203792 153756 183288 218367
14154 218367 41967 2971 -11023 80980 91265 11686 -54853 -53378 -5494 -37470 -85951
14143 -85951 -109392 -79280 -77904 -117341 -140296 -104209 65626 146054 164041 169134 113836 66401
14131 66401 48897 30405 33247 7492 -34357 -66692 -31548 -2789 7811 137592 186929 88171
14119H8171j7061n731r340n0699n6169J9221p168K2541j3401J1384m5481L4494
14107b9239K8411o8779k0942Q5632K6146K5660k5225L0195q2564O8734K4669J6616
14095G9314J8932j15551J1848N3967j382m2002m2147J5271J8992O153L1939n9814
14083b4480n1353N6928n7335J7931J9140K6672n1287k5056R0052O6317j7685k5607
14071B4237l1941K2496o6561L8057R8227K6546J7496k9693o9086l863j02697J0583
14059f6199J1317k408l19k8459j1404L7899j9488K8478M4534K6934j8977r415
14047g507J6238p750O6589o2132p6977M2292O3712J6341P1224j0368K1082m2204
14035I0540r5247p4711L3478O6207K4967P3696k0270l3587m4940l9685q505K2547
$$ plain form
14119 88171 71110 65379 56039 5340 -50829 -31608 -38776 -16235 -29636 -18252 -63733 -29239
14107 -29239 -828 -69607 -90549 -4917 21229 46889 21664 51859 -30705 38029 62698 79314
14095 79314 98246 -17305 -5457 48510 47128 5126 -37021 -21750 -2758 3395 35334 -24480
14083 -24480 -75833 -18905 -76240 -58309 -39169 -12497 -63784 -88840 1212 67529 49844 24237
14071 24237 -7704 14792 -51769 -13712 84515 111061 128557 98864 29778 25915 -76782 -66199
14059 -66199 -54882 -57290 -57609 -86068 -97472 -59573 -79061 -50583 -6049 20885 1908 -7507
14047 -7507 8731 981 67570 5438 -71539 -29247 34465 50806 122030 111662 132744 90540
14035 90540 -4707 -79418 -45940 20267 45234 118930 98660 65073 20133 -19552 -28057 -5510
14023e510N3620K3960j1685o98J840M4228m4734q7803L0880q4808l1115O8878
14011d2947L6115j7644k027L305k4532j02868n6501Q966P0177P0557p0N1375J3458
13998G364j992J43m6033R1778o3832k0346J8625N9946N7675J20808o6128l4391
13986A23617J878n6137q5466m0431M9195Q9875k6898l8371k014o310l425o2151
13974e6638n1865J568J1657M1959M6274l0878n9774N5511Q4125M2544r1395k1837
13962b8749L2536L2267q743m2822j8838M5054P040m490J6215r4137N74L8306M3742
13949A7955Q0632N945K9820r3906j0611j1347l0337M9109K6767o5354r3438O7812
13937b6953O2551k212o8577j7903L4375j0264l1185k920k57N0189L6635k5523
$$ plain form
14023 -5510 48110 72070 60385 59687 61527 105755 61021 -26782 4098 -80710 -111825 -42947
14011 -42947 -6832 -24476 -26503 -23198 -47730 -150598 -207099 -198133 -127956 -57399 -57469 -6094 7364
13998 7364 5372 5515 -40518 51260 -12572 -32918 -14293 45653 103328 224136 158008 123617
13986 123617 125495 69358 -16108 -56539 -7344 82531 55633 17262 15248 8938 5513 -56638
13974 -56638 -108503 -106935 -95278 -53319 -7045 -37923 -97697 -42186 41939 84483 -6912 -28749
13962 -28749 3787 36054 27311 -15511 -34349 10705 17745 13255 29470 -64667 -64093 -25787 17955
13949 17955 98587 104532 134352 40446 29835 18488 -11849 37260 64027 -1327 -94765 -26953
13937 -26953 35598 33386 -35191 -53094 -18719 -28983 -60168 -63088 -63345 -13156 23479 -2044
13925b044l1957k3498M0461l1633O6968M9589l9411o9148j0812O923o1424l423
13913a09409K7664O8611L3530K6681n1739J6021O887o5342m8059k5315p669K0847
13901a07292o272M5050M7652n4579k9811J3300K0683j465j7492k7116L0772m532
13889i1102m6574O5246J01039m6639o8250j0910N9780Q746p5765n093Q4822N36
13877b4164K7970Q1764l5965n9214N6220K5238o2504o6384M4172l5015j7791R509
13865e6164k2373J37360Q6770K5746q388j23545n2130l1133o7873N1655J27105
13854F7030l716J9187N8977K015m377O5541l6540j19473j14092j9255p282L658
13842h8327N8141l5373l8216q215L722J7222N2198M5311q046l2194K4651L6442
$$ plain form
13925 -2044 -34001 -57499 -17038 -48671 18297 67886 28475 -40673 -51485 -44562 -105986 -109409
13913 -109409 -81745 -13134 20396 47077 -4662 11359 18246 -47096 -95155 -120470 -128139 -107292
13901 -107292 -113564 -68514 -20862 -75441 -105252 -91952 -71269 -72734 -90226 -117342 -86570 -91102
13889 -91102 -137676 -72430 28609 -18030 -86280 -97190 -37410 -28664 -104429 -109522 -24700 -24164
13877 -24164 3806 85570 49605 -9609 46611 71849 9345 -57039 -12867 -47882 -65673 -56164
13865 -56164 -78537 58823 145593 171339 162951 39406 -12724 -43857 -111730 -60075 67030
13854 67030 63314 82501 141478 143493 139116 204657 168117 48644 -65448 -84703 -91985 -88327
13842 -88327 -30186 -65559 -103775 -111990 -108268 -91046 -38848 6463 -1583 -33777 -9126 27316
13830B7316j6758N6577l3653q4676L2271J10712p036m7307n235L3222k6163j7221
13818B2049N4633K4299j524m7978O489N8319l8020k9917o0873l3434k3900k7995
13806i7852p5952M7612O4228o004m1101K225L5791Q867K6869K2901R6951Q9310
13794A73845p7743k2686m123M9689j3661r6632K000K1422K5055o0697o2379N2958
13782a2952K5324J3242j6795m4120l1192n962K2104L8139O329L1511L7468n3704
13770I392j2424j8599J5194k8595J5417m6338L2332m3439j3741L3332L2006Q2749
13758E7286n998K0841k5050L8986j33624m3472k3295M3256N2022Q3309k6937J7498
13746E4822K0058N163K6980R5083r5053o8756N0773k9691r157J49279p9983j36884
$$ plain form
13830 27316 10558 67135 33482 -51194 -18923 91789 84753 37446 32211 65433 39270 22049
13818 22049 76682 100981 99457 51479 57968 116287 78267 48350 -12523 -45957 -69857 -97852
13806 -97852 -173804 -126192 -61964 -67968 -109069 -106844 -71053 -62186 -35317 -12416 84535 173845
13794 173845 96102 73416 69293 118982 105321 8689 10689 32111 57166 -3531 -65910 -12952
13782 -12952 12372 25614 8819 -35301 -66493 -72455 -50351 -12212 -5883 25628 63096 9392
13770 9392 -3032 -21631 -6437 -35032 -19615 -65953 -33621 -77060 -90801 -57469 -25463 57286
13758 57286 51288 72129 47079 86065 -47559 -91031 -114326 -71070 -19048 64261 37324 54822
13746 54822 74880 80043 107023 202106 107053 38297 89070 59379 50222 199501 119518 -17366
13734a7366m4998L2199j0688K4084L1556J3181L6819k5565j7759P1603k7324o0714
$$ plain form
13734 -17366 -62364 -30165 -40853 -16769 14787 27968 64787 39222 21463 93066 65742 5028
$$ [...]
##END NTUPLES=NMR SPECTRUM
##END=
