##TITLE=Analysis number 320506
Compound Code cc 23509
Project Code adrs
Chemist Name fudan
##JCAMPDX= 6.0         $$ Bruker NMR JCAMP-DX V2.0
##DATA TYPE= NMR SPECTRUM
##DATA CLASS= NTUPLES
##ORIGIN= Bruker BioSpin GmbH
##OWNER= nmr
$$ XWIN-NMR		Version 3.5
$$ Wed Jun 28 09:57:40 2006 GMT Daylight Time (UT+1h)  MAYBRIDGE\nmr@NMR_250MHZ
##.OBSERVE FREQUENCY= 250.131544655141
##.OBSERVE NUCLEUS= ^1H
##.ACQUISITION MODE= SIMULTANEOUS (DQD)
##.ACQUISITION SCHEME= undefined
##.AVERAGES= 16
##.DIGITISER RES= 18
##SPECTROMETER/DATA SYSTEM= dpx250
##.PULSE SEQUENCE= zg30
##.SOLVENT NAME= CDCl3
##.SHIFT REFERENCE= (INTERNAL, CDCl3, 0, 16.4552)
##AUDIT TRAIL= $$ (NUMBER, WHEN, WHO, WHERE, WHAT)
$$ ##TITLE= Audit trail, XWIN-NMR		Version 3.5
$$ ##JCAMPDX= 5.01
$$ ##ORIGIN= Bruker BioSpin GmbH
$$ ##OWNER= nmr
$$ C:\u/data/dgb/nmr/ADRS/1670/pdata/1/auditp.txt
$$ ##AUDIT TRAIL=  $$ (NUMBER, WHEN, WHO, WHERE, WHAT)
(   1,<2006-06-28 09:57:00.30 +100>,<MAYBRIDGE\nmr>,<NMR_250MHZ>,
      <created by zg, POWCHK disabled, PULCHK disabled
       configuration hash MD5:
       E2 DF 36 D8 04 B2 41 60 5A D7 A3 38 5A 4B D0 FE
       data hash MD5: 64K
       D4 DA 31 B5 84 BB AB C3 06 D6 75 0E 6A D4 3E DE>)
(   2,<2006-06-28 09:57:28.91 +100>,<MAYBRIDGE\nmr>,<NMR_250MHZ>,
      <Start of raw data processing
       ef LB = 0.3 FT_mod = 6 PKNL = 1 SI = 32K 
       data hash MD5: 32K
       A0 9C EE D6 02 02 3F AE 40 72 03 AD 04 34 83 C9>)
(   3,<2006-06-28 09:57:31.03 +100>,<MAYBRIDGE\nmr>,<NMR_250MHZ>,
      <apk 
       data hash MD5: 32K
       A0 6B B7 FE 51 13 43 6C D6 7B 54 D7 E7 9D 16 20>)
(   4,<2006-06-28 09:57:32.02 +100>,<MAYBRIDGE\nmr>,<NMR_250MHZ>,
      <abs ABSG = 5 
       data hash MD5: 32K
       00 21 73 1D AF DF 57 45 AE 73 13 9E 63 CA 35 BB>)
$$ ##END=
$$ 
$$ hash MD5
$$ E5 1A 02 DC 39 82 53 51 93 C1 4F FE E1 0A 92 FD
##$RELAX= 
##$RELAX= 
##$RELAX= 
##$RELAX= 
##$RELAX= 
##$RELAX= 
##$RELAX= 
$$ Bruker specific parameters
$$ --------------------------
##$DU= <C:\u>
##$EXPNO= 1670
##$NAME= <ADRS>
##$PROCNO= 1
##$TYPE= <nmr>
##$USER= <dgb>
##$AMP= (0..31)
100 100 100 100 100 100 100 100 100 100 100 100 100 100 100 100 100 100 
100 100 100 100 100 100 100 100 100 100 100 100 100 100 
##$AQSEQ= 0
##$AQ_mod= 3
##$AUNM= <au_zg>
##$AUTOPOS= <9 >
##$BF1= 250.13
##$BF2= 250.13
##$BF3= 250.13
##$BF4= 250.13
##$BF5= 500.13
##$BF6= 500.13
##$BF7= 500.13
##$BF8= 500.13
##$BYTORDA= 1
##$CFDGTYP= 0
##$CFRGTYP= 5
##$CHEMSTR= <none>
##$CNST= (0..31)
1 1 145 1 1 1 1 1 1 1 1 1 1 1 1 1 1 1 1 1 1 1 1 1 1 1 1 1 1 1 1 1 
##$CPDPRG= <>
##$CPDPRG1= <>
##$CPDPRG2= <>
##$CPDPRG3= <>
##$CPDPRG4= <mlev>
##$CPDPRG5= <mlev>
##$CPDPRG6= <mlev>
##$CPDPRG7= <mlev>
##$CPDPRG8= <mlev>
##$CPDPRGB= <>
##$CPDPRGT= <>
##$D= (0..31)
0 1 0 0 0 0 0 0 0 0.06 0 0 0 0 0 0 0.0002 0 0 0 0 0 0 0 0 0 0 0 0 0 0 
0 
##$DATE= 1151485017
##$DBL= (0..7)
120 120 120 120 120 120 120 120 
##$DBP= (0..7)
150 150 150 150 150 150 150 150 
##$DBP07= 0
##$DBPNAM0= <>
##$DBPNAM1= <>
##$DBPNAM2= <>
$$ [...]
##$SUBNAM7= <"">
##$SUBNAM8= <"">
##$SUBNAM9= <"">
##$SW= 20.6930455092707
##$SWIBOX= (0..15)
0 0 3 0 0 0 0 0 0 0 0 0 0 0 0 0 
##$SW_h= 5175.983436853
##$TD= 65536
##$TD0= 1
##$TE= 295.16
##$TE2= 300
##$TE3= 300
##$TEG= 300
##$TL= (0..7)
0 120 120 120 120 120 120 120 
##$TP= (0..7)
150 150 150 150 150 150 150 150 
##$TP07= 0
##$TPNAME0= <>
##$TPNAME1= <>
##$TPNAME2= <>
##$TPNAME3= <>
##$TPNAME4= <>
##$TPNAME5= <>
##$TPNAME6= <>
##$TPNAME7= <>
##$TPOAL= (0..7)
0.5 0.5 0.5 0.5 0.5 0.5 0.5 0.5 
##$TPOFFS= (0..7)
0 0 0 0 0 0 0 0 
##$TUNHIN= 0
##$TUNHOUT= 0
##$TUNXOUT= 0
##$USERA1= <user>
##$USERA2= <user>
##$USERA3= <user>
##$USERA4= <user>
##$USERA5= <user>
##$V9= 5
##$VALIST= <valist>
##$VCLIST= <CCCCCCCCCCCCCCC>
##$VD= 0
##$VDLIST= <DDDDDDDDDDDDDDD>
##$VPLIST= <PPPPPPPPPPPPPPP>
##$VTLIST= <TTTTTTTTTTTTTTT>
##$WBST= 1024
##$WBSW= 4
##$XGAIN= (0..3)
0 0 0 0 
##$XL= 0
##$YL= 0
##$YMAX_a= 325079
##$YMIN_a= -468094
##$ZGOPTNS= <>
##$ZL1= 120
##$ZL2= 120
##$ZL3= 120
##$ZL4= 120
##$ABSF1= 16.4552
##$ABSF2= -4.237972
##$ABSG= 5
##$ABSL= 3
##$ALPHA= 0
##$AQORDER= 0
##$ASSFAC= 0
##$ASSFACI= 0
##$ASSFACX= 0
##$ASSWID= 0
##$AUNMP= <proc_1d>
##$AZFE= 0.1
##$AZFW= 0.1
##$BCFW= 0
##$BC_mod= 0
##$BYTORDP= 0
##$COROFFS= 0
##$CY= 12.5
##$DATMOD= 1
##$DC= 0
##$DFILT= <>
##$DTYPP= 0
##$F1P= 14.0000005364418
##$F2P= -0.99999901652339
##$FCOR= 0.5
##$FTSIZE= 32768
##$FT_mod= 6
##$GAMMA= 0
##$GB= 0
##$INTBC= 1
##$INTSCL= 1
##$ISEN= 128
##$LB= 0.3
##$LEV0= 0
##$LPBIN= 0
##$MAXI= 10000
##$MC2= 0
##$MEAN= 0
##$ME_mod= 0
##$MI= 0
##$NCOEF= 0
##$NC_proc= -3
##$NLEV= 6
##$NOISF1= 0
##$NOISF2= 0
##$NSP= 0
##$NTH_PI= 0
##$NZP= 0
##$OFFSET= 16.4552
##$PC= 1
##$PHC0= 171.9752
##$PHC1= 6.878891
##$PH_mod= 1
##$PKNL= yes
##$PPARMOD= 0
##$PSCAL= 4
##$PSIGN= 0
##$REVERSE= no
##$SF= 250.130016707235
##$SI= 32768
##$SIGF1= 0
##$SIGF2= 0
##$SINO= 400
##$SIOLD= 32768
##$SREGLST= <1H.CDCl3>
##$SSB= 0
##$STSI= 32768
##$STSR= 0
##$SW_p= 5175.98343685301
##$SYMM= 0
##$S_DEV= 0
##$TDeff= 65536
##$TDoff= 0
##$TI= <Analysis number 999999
Compound Code 99
Book Reference 9
Project Code 9>
##$TILT= no
##$TM1= 0
##$TM2= 0
##$TOPLEV= 0
##$USERP1= <user>
##$USERP2= <user>
##$USERP3= <user>
##$USERP4= <user>
##$USERP5= <user>
##$WDW= 1
##$XDIM= 32768
##$YMAX_p= 376614638
##$YMIN_p= -156524
$$ End of Bruker specific parameters
$$ ---------------------------------
##NTUPLES= NMR SPECTRUM
##VAR_NAME=  FREQUENCY,     SPECTRUM/REAL,   SPECTRUM/IMAG
##SYMBOL=    X,             R,               I
##VAR_TYPE=  INDEPENDENT,   DEPENDENT,       DEPENDENT
##VAR_FORM=  AFFN,          ASDF,            ASDF
##VAR_DIM=   32768,         32768,           32768
##UNITS=     HZ,            ARBITRARY UNITS, ARBITRARY UNITS
##FACTOR=    0.157963299565203, 1,           1
##FIRST=     4115.93949977441, 0,            0
##LAST=      -1060.0439370786, 0,            0
##MIN=       -1060.0439370786, -156524,      0
##MAX=       4115.93949977441, 376614638,    0
$$ Real data points
##PAGE= N=1
##DATA TABLE= (X++(R..R)), XYDATA
$$ [...]
23663 32552 17354 4874 -6090 -17659 16842 37251 30602 5171 -8151 -7637 9264 27966
23651 27966 48921 57152 50281 38098 36149 10816 4973 7497 15577 53312 46455 3891 -18452
23638 -18452 230 12606 17783 12455 789 -32085 -24242 -15532 -17379 -2560 16976 30465 -2365
23625 -2365 2960 10127 -2807 -15451 4982 22832 5265 9806 13043 24236 30652 -25140 -30950
23612 -30950 -27451 -28307 5724 2655 -5588 -6079 -4507 -16203 5591 1567 54 1017 -28333 -26784
23598 -26784 -14462 4353 13771 20473 33881 27895 35345 25525 16384 10663 -2517 -18515 -22947
23585 -22947 -6838 -21973 -6674 10917 17938 14242 28258 39199 2665 -28361 -38991 -21208
23573 -21208 -6943 -3296 7143 16191 8253 -9829 11833 -7991 -52801 -65935 -49303 -21014
23561 -21014 1647 14634 11381 -14418 -37791 -27015 9664 10083 -8860 16760 25182 -7046
23549 -7046 -9560 -599 3304 3588 -5888 -22606 -28348 -10851 -29591 -30420 -23814 -27252 -17923 43825
23535 43825 38898 8078 -1919 -4879 30405 34639 42284 59644 35039 41901 34452 10292 -17290
23522 -17290 -25977 21444 15318 10864 25658 33050 13920 6876 13484 26274 -10290 -44461 -40291
23509 -40291 -6716 -17304 -46070 -7995 -11761 -8532 -19048 -23100 -5475 -2911 -21301 -35367
23497 -35367 -40112 -53165 -36540 -27497 -15698 21157 8872 10044 16219 -3614 -46806 -82015
23485 -82015 -68152 -58124 -42479 -5407 10791 5408 -37740 -30802 -37338 -62808 -51913 -32354
23473 -32354 -7048 -18776 7262 18917 6890 10971 15764 6778 4854 18421 -9059 -16655 26990
23460 26990 43837 30994 426 -12000 -2881 -18292 -68219 -39477 -8019 28431 49267 34603
23448 34603 -24943 -45191 -39251 -31940 -27265 -28821 -34209 -21633 -31582 -18601 -1785 -9739 -40319
23435 -40319 -17680 -14690 4180 4 -6161 -37673 -55085 -35331 -13805 -7231 22399 27982 17233
23422 17233 34553 30132 15939 -7422 -53504 -71677 -60724 -62259 -75267 -43932 -43997 -42124 -59770
23409 -59770 -75433 -44806 -33447 -11394 15402 26802 35943 -5915 -26205 380 862 705 -19960
23396 -19960 -10024 30965 42193 -4411 -24858 -7635 17238 9 -4124 15199 31338 31255 30722
23383 30722 28200 66700 55045 -18633 -31823 25512 26830 29240 5281 -44980 -48613 -43940 -40648
23370 -40648 -48393 -55495 -23341 -4143 11649 -3307 2616 -4185 -17395 2323 8049 3268 2373
23357 2373 -10215 -24661 -28078 -10763 -3829 11321 -224 -478 -21018 -64914 -70050 -41864 -56966
23344 -56966 -82741 -96213 -73589 -32934 -36606 -46896 -25810 -34693 -18074 -5751 -42333 -54679
23332 -54679 -17000 -7928 -7602 17611 25728 53025 51040 32101 -2356 -19500 -8927 -48743 -83010
23319 -83010 -49037 6954 17978 24070 24869 -7574 -25625 -42440 -23801 -4013 725 -6480 9238
23306 9238 50119 52464 1821 3332 -1874 -30284 -44928 -7048 -17398 -5683 9425 3655 14119
23293 14119 14937 -5905 -44386 -57243 -39968 -31170 5195 21557 -8355 -4344 13912 17103 10675
23280 10675 -7147 -14441 -21074 442 10407 24470 2532 -10937 1095 12768 -950 -6919
23268 -6919 12588 17237 -29798 -63124 -21086 -25427 -44637 -21447 -18107 -6714 18998 17592 15809
23255 15809 27643 23760 -6821 25663 45800 23856 -25936 -34721 -4126 21896 28267 39975
23243 39975 18431 -6920 -23736 1706 11610 24389 3592 -9072 -23846 -18168 2261 -30562
23231 -30562 -29173 5069 13189 22522 7400 9728 -1827 -26486 -28652 -8844 16054 52393 55698
23218 55698 14911 17754 13719 -3019 -12159 -21599 -36713 -67523 -37159 -29541 413 36287 32459
23205 32459 28142 20271 -39231 -31375 -48692 -60289 -65222 -46489 -37778 -29094 -21039 9884 45491
23192 45491 20206 8158 15131 -5148 985 7531 -228 -29117 -39932 -30868 -45900 -44913 -13765
23179 -13765 -12579 -31813 -72344 -80660 -63008 -33659 -14755 -11235 -17918 -43364 -49345 -45182 -36173
23166 -36173 -48340 -38318 -38368 -26428 -15343 -65277 -95140 -103354 -115282 -87436 -69960 -46513
23154 -46513 -38168 1848 26395 1492 -14876 -27211 -37364 -47960 -54510 -49275 -28575 -45959
23142 -45959 -60228 -39525 -2923 3577 8929 -208 -6576 -11483 -29207 -30709 -45878 -64196 -28884
23129 -28884 -23544 -11346 -22015 -1905 -23352 -33721 -41277 -20709 -9503 32558 31334 835
23117 835 -14542 -3186 4930 -12003 -5456 -45130 -55705 -23169 16159 -7383 -54178 -64139 -44966
23104 -44966 -24459 -10520 15988 10949 7373 16023 591 -2525 29471 28563 7315 -29066 -32814
23091 -32814 -21506 22031 82036 63944 23634 17616 -7346 -17226 -7167 -10006 184 38248
23079 38248 28762 -375 -11534 -12732 -17566 11875 19583 19776 24299 20677 21010 17756 -33732 -65900
23065 -65900 -18282 8156 -23008 -33059 -14788 11998 -824 -3464 -24391 -13072 8050 30089
23053 30089 24908 -10132 -69309 -44551 -18218 -17350 -20628 -11299 -3519 -33049 -14970 -4950 -3153
23040 -3153 9748 28207 58309 48485 25909 3641 20355 29563 3603 12845 -4014 -15295
23028 -15295 12457 -7446 -42303 -63824 -39944 7272 5774 -11151 -57878 -63779 -53980 -10640
23016 -10640 -9681 -27285 -13518 -16975 -12360 3022 -9244 2409 -24658 -53823 -26834 -9504
23004 -9504 16096 30322 16110 -17123 -15510 -11402 -20894 -15667 -22637 -7641 13365 -9812 -23379
22991 -23379 -9165 7715 12709 36914 18189 33286 28155 37536 25271 8177 9570 14535 20536
22978 20536 -1936 -19714 -49871 -49399 -51077 -55508 -17387 -3501 -13862 -30259 -30954 -31800 -37029
22965 -37029 -14210 9902 16845 -1081 -21561 -12417 -11186 -10222 -7072 -11927 -20937 -21021 15986 16214
22951 16214 -20015 -44708 14923 45062 21719 -7702 11855 37331 41066 28001 15487 3312
22939 3312 45463 23590 -20570 -47973 -43010 -36492 -46633 -46246 -58926 -38728 -26080 -19543 -18634
22926 -18634 -29096 -6513 11397 6505 9069 33364 8653 -30120 -49387 -13449 -15177 -41578
22914 -41578 -49941 -52103 -62278 -48270 -28079 24214 45387 67263 48992 30904 16307 741
22902 741 -7866 -6014 -14722 9804 3561 -18382 1531 698 -8499 -15627 34341 53694 31106 49543
22888 49543 47744 32683 1268 -12869 -3965 -9674 39592 55239 4071 -3321 -6331 16543 9359
22875 9359 19326 34348 14016 15168 11774 5223 50344 34781 3586 29459 38686 28247 -664
22862 -664 -35645 -47582 -45899 -58089 -34279 -28838 -48725 -32356 -20786 -11539 -14128 -15563 -6736
22849 -6736 7229 19824 -31726 -58596 -19248 242 19630 45482 61863 41960 38502 44787
22837 44787 22879 10675 5342 3961 -4011 25703 -979 -21717 -10670 -11753 -33841 -5263
22825 -5263 -5387 -20176 -23825 -26078 15060 30842 24636 17054 -12721 -31849 -2616 -2292 8022
22812 8022 -6804 -28720 -27166 -29154 -57086 -48721 9168 19584 19052 6242 -17944 -46919 -28390
22799 -28390 -31878 -34695 -31783 -16171 -14048 3880 45504 40630 36249 1650 -31356 -27439 -46301
22786 -46301 -57146 -52711 -55546 -69095 -57949 -17220 6809 -12058 -39706 -16371 -10892 -35831
22774 -35831 -9167 426 9935 17443 31480 49764 37562 -121 -39 42516 34711 -2015 -22589
22761 -22589 -28266 -27492 -23603 7802 4534 -26701 -27911 -20832 -34036 -14516 -7697 -40920 -43889
22748 -43889 -33256 -35751 -56589 -32021 5681 3793 -27672 -23726 -12632 -18118 -28774 -50561
22736 -50561 -58563 -21925 -22177 -18994 173 951 12336 14603 -7677 -3433 25013 27497 16314
22723 16314 21399 39267 34541 11389 24909 8031 1890 -13260 -30458 -23334 -3099 -13513
22711 -13513 -44977 -39622 -12566 284 -51135 -29617 32966 24747 -2062 -7191 -24284 -22016
22699 -22016 -19165 -49356 -57807 -41874 -35852 -11787 23270 20115 8538 20842 22021 33320 41058
22686 41058 56413 22815 19889 -24588 -57194 -42171 -17304 29514 36999 46189 57073 55868
22674 55868 57900 29787 24261 10275 -37356 -15188 -10057 -22662 -29728 -36162 -13899 -22771 -3441
22661 -3441 53986 52478 14993 -14793 -24913 -31765 -18822 -6240 -8784 24052 24120 -26855 -25617
22648 -25617 -11332 7096 -4520 -21353 -22343 -3193 12633 25847 17685 -9470 -18303 14375
22636 14375 35131 39937 38621 2674 -43938 -79465 -55512 -3105 9094 9232 13806 30457 42596
22623 42596 4159 -32768 -55712 -26923 3289 6772 -29321 -76410 -75926 -41544 -32203 -9662
22611 -9662 8839 6873 2198 -855 -22891 -17020 19073 51747 52245 28765 18890 23605 12587
22598 12587 18408 23777 20506 17768 8542 6417 4969 -24508 -30213 -55149 -57332 -19919 9503
22585 9503 30399 16324 -5533 -12155 -18621 -16341 -42190 -49299 -41141 -43390 -27306 -33952 -24544
22572 -24544 -29578 -23718 166 -5486 -24017 -16766 -23286 -17207 -46716 -28896 -15220 -11453 2886
22559 2886 37930 3496 -47863 -11957 33198 47882 41804 19860 20619 12400 -23741 -42408 -16284
22546 -16284 17175 34264 18496 -19668 -26277 -4504 8821 -8508 -79 -16492 31954 34191
22534 34191 -4958 -53286 -55106 -22461 -8616 -19576 -12370 -6357 -10646 -5174 -13180 -37437 5679
22521 5679 14641 -14421 -39772 -18228 31427 35890 16364 26801 34746 51243 22649 -14942
22509 -14942 -26576 -37289 -30940 -32251 -25773 -15897 -25204 -25548 4830 -13708 -17206 12471 65578
22496 65578 55846 39670 18985 39848 49221 42569 54417 53753 39701 22169 30874 44859 58296
22483 58296 35839 5183 2906 9220 16484 20859 -430 -9137 -39972 -38949 -10229 -24089 -17141
22470 -17141 -6907 -13897 -21173 -214 39804 33378 -18149 -24814 -13013 438 14142 -22638
22458 -22638 -47727 -29840 -2009 1822 -34721 -45694 -44710 -34216 21247 27661 -12640 -10523 -2271
22445 -2271 -6567 -22756 -17503 -3385 22637 40191 10077 214 -23478 -12971 22168 16710 49939
22432 49939 24881 4401 16204 46220 41234 48092 44320 27007 31508 24125 13479 17774 -9435
22419 -9435 1377 -35382 -37319 -7943 3252 -11943 1006 20969 7801 -15570 -3177 -17780
22407 -17780 9721 28485 7397 41576 20616 -17405 -48156 -48986 -14439 -15028 -8129 -2699 -26421
22394 -26421 -13864 5934 16315 59081 59309 52101 34560 36871 30464 62813 31967 15432 29193
22381 29193 36893 22302 -1004 -9781 18237 10994 -25868 -28733 -29989 -26425 -49348 -31164 -28297
22368 -28297 -33619 -44860 -23154 -20972 -7518 -5513 -2324 -6119 10894 27290 8094 20250 48367
22355 48367 39833 17446 -10271 6872 8507 11003 33047 28129 3045 22422 8351 -29967
22343 -29967 -30168 -22821 -28688 -40193 -43544 -37399 -37180 -33038 -31251 -8001 -29274 2233 34147 -5784
22329 -5784 -17244 12155 2589 3664 4194 24621 22370 177 -20261 -5624 -19395 -28869 -23821
22316 -23821 -44804 -860 13675 -32417 -44746 -71743 -66609 -45335 -15870 -6005 -14011 -3775
22304 -3775 -9489 -8388 11789 9354 3100 -1055 -11583 -1951 -28573 -26782 2871 5945 16942
22291 16942 32794 17982 -17014 -8548 -11827 -15210 872 4787 13366 8110 23738 41032 42932
22278 42932 44335 20178 -3231 -13906 -3553 -13044 -20710 -10246 1454 8650 -24317 -27713 -19260
22265 -19260 -27286 -27284 -3148 32361 20344 -2159 -8426 -22934 -16795 -11895 -33857 -60064 -69085
22252 -69085 -50611 -51787 -59991 -23483 -22592 -6080 -6085 -26884 -9620 -11950 -19246 13360 23437 20109
22238 20109 -2487 -10723 -13665 -34118 -38419 -16830 -23379 -349 9907 5657 -23046 -32455 -31224
22225 -31224 -5259 1433 10311 29569 30783 22168 -3892 32339 39147 20473 27796 11514 6888
22212 6888 -2685 -52069 -39915 -41586 -59991 -67408 -51331 -20156 -8164 -12701 -8618 17289 55685
22199 55685 29065 3706 14747 -8781 -13098 7729 28767 32605 20032 -1683 -48977 -55274
22187 -55274 -50507 -25705 -42295 -65493 -48119 -37407 -31532 -26427 -53954 -37620 -7085 3760
22175 3760 25863 39819 55918 45185 -29651 -46084 -9084 -7960 -12130 15793 39428 62025
22163 62025 64315 40319 16553 39686 57391 60629 50457 26262 -31926 -32526 16171 32031
22151 32031 -2753 -30198 -41250 -10431 -17636 -5684 4939 41853 54691 14498 8473 32852
22139 32852 26430 11274 -25553 -10822 -16361 -35585 5105 34432 -36262 -71755 -41002 -28145
22127 -28145 -18698 -5231 -8565 -35504 -47725 -25834 -26059 -42062 -28288 -13459 9876 6543 -12289
22114 -12289 -10935 -33057 -53723 -29678 -26933 7183 26975 36145 32741 458 17554 10448 14729
22101 14729 33050 51503 63214 35879 8425 6787 846 -8008 4485 -23012 -12933 -11114
22089 -11114 13744 55204 72373 69095 45344 37509 24060 5356 14895 20136 30237 14159
22077 14159 -7763 -14567 -8520 31293 37787 14769 6185 5993 11719 5026 21023 33586 83103
22064 83103 95306 95128 70503 43178 24070 10839 3799 213 4648 -25326 -11356 7188 27628
22051 27628 32373 -9295 -33071 -34800 -61729 -76488 -74192 -59497 -21317 19711 28289 -14274
22039 -14274 -41680 -29025 -248 -9816 -5162 -6419 1117 -77 -9558 -1204 55019 47524 -1343
22026 -1343 -3064 -14146 -31653 -43675 -21150 22703 -8973 -23643 -23498 -39938 -33921 -35399 -177
22013 -177 29989 9246 -12138 -22429 -7574 -2609 17799 -34914 -47472 -22974 40624 82521
22001 82521 61832 50467 47010 14209 -56458 -83735 -48444 4154 8313 134 6242 -7208
21989 -7208 15172 -21728 15714 26754 31601 12845 24195 12478 -16147 -50708 -59887 -45068
21977 -45068 -44876 -17321 17214 10754 5436 -1601 -27018 -37338 -33612 -26495 -24500 -11792 -15762
21964 -15762 -7265 -12687 -30624 3477 40456 52851 45560 36930 55311 64401 36110 6972 -11500
21951 -11500 -908 11205 -4115 -20687 29359 49157 -7001 -5867 6720 18884 -1591 7943
21939 7943 18160 -12378 -24833 -10588 2483 -18300 -27040 -449 15846 58603 82463 45517
21927 45517 30501 4325 -3818 -4487 6037 3704 32859 29592 17551 12652 6675 5841 -6377
21914 -6377 -1855 -8318 23712 43312 39170 14435 -11767 -14423 9063 12427 22023 7517 -13469
21901 -13469 25134 33506 51837 44825 1114 -23963 -42718 -66409 -60995 -69634 -83434 -67098
21889 -67098 -39339 -53066 -110466 -104425 -42355 -15140 -16621 -282 5200 23871 36397 9359
21877 9359 -22599 -47621 -71792 -38853 -20436 -7937 -4487 -16566 -47063 -56048 -47072 -17703
21865 -17703 -14177 -10419 -28364 -20372 -34590 -47112 -51686 -37368 -60289 -35222 -21211 -39070
21853 -39070 -33658 -23070 3235 -3093 5397 10553 14188 -913 -24046 -33927 -33944 -15330 -32840
21840 -32840 -9310 14739 -3667 -12898 -22180 -4938 16579 47767 48785 30365 -2266 -3102 -4667
21827 -4667 -19933 -11323 -12774 -43613 -41357 -37563 -39824 -52748 -36313 -26889 15409 27947 32450
21814 32450 937 -9090 -28325 -47955 -38383 -38535 -29373 -20875 -25404 -58279 -56129 -61888 -66015
21801 -66015 -51885 -30643 -29749 -18788 -2044 10240 24916 34749 10565 -13294 -7312 -456 -6766
21788 -6766 13870 10965 -17885 -50491 832 22 -8056 -7359 9637 -726 10988 -13817 -50844
21775 -50844 -34368 -44991 -26209 16314 34009 -6960 -20493 -38894 -38075 -24279 4305 -17603
21763 -17603 1507 -4975 -17077 34112 81195 59422 23603 2474 2655 -16624 -28641 -26174
21751 -26174 -38542 -24546 -34815 -47952 -50279 -31010 -38847 -27225 -27796 -55547 -66343 -60268 -36840
21738 -36840 -41974 -16360 38843 34134 42255 51037 68291 73377 65015 24827 -8513 -10113 -9868
21725 -9868 -4870 -810 6272 -5652 16236 37835 34877 60902 30520 39612 20933 -12539 27770
21712 27770 40960 29118 34800 17632 7384 4422 8309 31754 51642 52943 29498 3591
21700 3591 7050 -8186 -26873 -31053 26357 41161 19027 -19832 -46398 -60596 -41541 -29442
21688 -29442 -25995 -17437 -1914 -12951 25674 74675 77687 62394 36050 20098 41000 15963
21676 15963 -38768 -10779 -21149 -19320 -2284 30594 28245 21766 12075 -2110 31668 49849
21664 49849 62364 42283 4997 -37993 -25775 -16844 -49894 -40727 -14748 31247 44371 21237
21652 21237 6593 18541 29865 26700 11697 -14079 -35375 -24889 -11876 -8147 12083 8207
21640 8207 -17783 -8435 3384 12378 37802 45234 75727 69935 12702 -23298 -15556 -7500 -13925
21627 -13925 -23353 -21245 -16876 -17698 -992 6471 36343 16268 -11646 -10983 -37286 -46740 -28400
21614 -28400 -9879 17745 42741 34353 11609 10991 9338 10467 2866 -24001 -2561 3057 16386
21601 16386 28495 40046 -5412 -38074 -19930 -30519 -25525 2718 -3022 17502 24342 -2560
21589 -2560 -37804 -38568 8686 53028 101147 43899 12951 55525 70775 60406 51430 28115
21577 28115 29286 48393 50367 41422 35333 -2454 -32094 -15784 20504 5100 -19126 6082
21565 6082 -16235 -40224 -15433 -17688 10905 25292 9680 -9663 18959 14081 1 15825
21553 15825 23245 2725 1278 13321 12130 7774 -4796 -357 -29064 -28839 -31334 -48446 -36521
21540 -36521 -30603 -48275 -46141 -26474 -20130 -20157 -17292 6034 16847 27494 55315 87491 64672
21527 64672 30382 14977 24733 12639 2822 13433 28436 6368 -17949 -38863 -17682 1914
21515 1914 13501 8804 2568 26699 46045 52821 70300 51972 45105 53341 42855 34588 11221
21502 11221 12115 31998 26162 42491 69427 51633 36884 8684 -6919 -43 21072 19105 -22035
21489 -22035 -31364 -31712 -29387 -6939 11595 9034 -20213 -45716 -54912 -49005 -42692 -13844 19515
21476 19515 -14178 9 2372 9465 26829 23569 11677 15718 925 10214 -1091 10417 48786
21463 48786 56561 15300 12669 11437 -18004 7951 30944 26727 5067 -5810 -11128 5192 23257
21450 23257 25935 5605 4085 27124 27474 -2254 6644 4098 29920 56586 58563 32078 36019
21437 36019 49812 45436 26573 -129 -20378 -11751 -20298 -30956 -46832 -11725 34573 47723
21425 47723 47800 34027 9465 10772 -11800 -38245 -22364 -18088 -31515 -11118 9878 9941 373
21412 373 -10721 -22817 -20189 -8977 3161 782 22345 36753 66136 51784 24864 7159
21400 7159 8903 9682 18591 27842 20884 12606 7634 27017 8054 3344 -13377 -17028 10383 50127
21386 50127 68933 25793 -2782 2053 -15726 -34303 -21503 7463 22759 -11160 -12345 -7846
21374 -7846 -19769 -59545 -58373 -13309 10091 11761 2585 17389 23811 -31419 -38461 -27210 -10846
21361 -10846 -22899 -35475 -68140 -23958 9712 8332 -12411 -26630 -2866 346 -36574 -58671
21349 -58671 -48186 -58061 -56221 -51093 -38593 -32664 -34050 -22264 -44361 615 34818 48754 640
21336 640 -40516 -65882 -38339 14288 21585 7439 5681 14448 24058 9596 -3148 -20017 -41213
21323 -41213 -13618 2881 16719 28871 30162 48013 42320 28082 11434 -10934 -32331 -9038
21311 -9038 -14719 -38775 -53287 -25665 -17458 -14758 -11251 5048 -1084 -6814 9899 27259 41700
21298 41700 64732 40702 -33141 -34325 -5567 -13600 -18079 -19333 -26695 -19034 -11956 -13809 10818
21285 10818 38396 36285 4484 -13101 -25936 -29278 -39499 -42105 -43271 -44468 -13227 16739 9684
21272 9684 16308 30147 24682 17759 34639 46701 62439 78994 47504 32453 38634 17938 -25132
21259 -25132 -43105 -17938 6245 -4009 -37483 -32342 -57528 -75827 -62881 -58084 -29176 -6596
21247 -6596 -27654 -26060 -12117 3182 -8558 -18904 -16922 -18959 -14064 -18426 -36451 -28537 4817
21234 4817 51293 26121 -16660 -27113 -8976 6878 12352 9502 14676 -12787 -24406 -9272
21222 -9272 -18219 -26448 1924 -29571 -46990 -30018 1493 26391 26446 16348 29618 290 -11902
21209 -11902 45987 78294 41968 -3656 -33617 -27150 -4703 810 10034 3332 -18417 -48552
21197 -48552 -24496 -35832 -20979 -10753 -26346 -19528 -748 -2376 -3782 -16438 -30555 -57311
21185 -57311 -52822 -50614 -11391 7555 20059 4235 1764 13042 37796 32197 17518 27964
21173 27964 -5164 -36302 -25419 -16973 -13270 1315 26242 27112 23179 9349 11029 10099 -5582
21160 -5582 -3244 -17382 -31469 -36835 -41392 -32176 -10384 -29938 -22490 -29469 -46946 -50994 -58548
21147 -58548 -51752 -58511 -27823 -31416 -37547 -13090 -1394 -5900 -7705 -21835 -74361 -68282 -67852
21134 -67852 -85893 -82535 -81696 -59860 -32662 -5308 -33502 -33191 -1233 -15184 -34192 -58338 -64495
21121 -64495 -60480 -66682 -70198 -64128 -68102 -34904 378 23722 -4311 -7014 -829 32659 19177
21108 19177 -17181 -13892 16092 6947 -444 -26439 -47807 -45294 -67629 -39486 1092 12729
21096 12729 -12711 16160 -26315 -47562 -41329 -16747 -4526 11673 40643 29915 9648 -15745
21084 -15745 -26024 3029 29976 38629 19033 14299 26242 24730 -245 5621 25969 49579
21072 49579 45083 39380 32805 -16767 -22162 -48937 -51348 -26611 1052 -250 -27859 -3299 -6828
21059 -6828 -22959 29581 72274 55616 16275 29541 25394 16257 28594 59886 51844 28294
21047 28294 32410 66895 71313 51343 36334 18766 34945 52938 26591 13900 -30201 -32951
21035 -32951 5146 28055 31232 34505 -54 1055 9426 -499 -6701 -16291 -4620 36214 41846
21022 41846 34311 38895 28013 -15768 -30079 -3070 -19141 -18308 -18711 -9724 -26332 -35565 -6772
21009 -6772 17491 12016 17 18884 -5794 -16644 -10689 1178 -22283 -55152 -64183 -10310
20997 -10310 2165 -7547 -46484 -35187 14291 3840 -20362 -35475 -1943 15331 -9769 -51961
20985 -51961 -12817 27314 22310 15138 -19595 -24194 -15265 -17996 -42349 -39250 4755 15429 34792
20972 34792 37713 40476 33389 18486 -21321 -23491 -17036 -3181 34161 39028 35498 63974 34400
20959 34400 -589 -40681 -51747 -32546 -14143 -8894 -7797 3563 2785 5512 9812 -1039 31046
20946 31046 25083 -6789 10437 29055 51572 28259 -13413 -17057 -22911 -2607 13583 5442
20934 5442 -9964 28839 27759 13778 929 11763 36878 25601 8037 17354 4381 -11139
20922 -11139 -7097 -26275 -33810 -5264 2782 -3757 -7015 31550 49469 58776 57235 40980 15693
20909 15693 17503 30439 2497 -16251 -8843 -2746 -4866 -20853 -5140 11012 17402 21688 41201
20896 41201 34883 52308 47831 48495 45297 39746 53010 51233 8147 -200 14135 5446 -1112 -6671
20882 -6671 3717 -11623 -9916 -13712 -14936 -29093 -40846 -35861 -20887 -27682 32332 36481 17547
20869 17547 7326 -7649 -15279 -11158 -25069 -4204 8446 -16714 -43429 -28138 8858 31109
20857 31109 23616 33510 24255 9589 34790 61764 78542 65019 7876 -13284 -9192 -7793 -58213
20844 -58213 -74878 -24982 31237 39995 -10913 -70063 -85285 -55673 -25184 5181 -8768 1801
20832 1801 16501 27399 -14547 -25643 -31909 -21518 -5270 -14386 -32650 -59205 -47277 -14669
20820 -14669 297 -39849 -31555 -1329 -23809 -35325 -52131 -56000 16115 43028 23755 20953
20808 20953 33630 40410 55016 56161 54028 -7942 -9145 18149 42039 48336 62671 67211 49158
20795 49158 53051 33516 47563 60958 28179 4612 -13508 11253 22775 5383 -3960 -3763
20783 -3763 7299 -8650 15700 29877 -7202 -17014 -12615 -2418 -10771 -15877 -27040 -22174 -22379
20770 -22379 18614 38439 39422 9349 -7432 -25867 -39544 -16137 -19531 -54195 -86924 -90675
20758 -90675 -63104 -60408 -27711 -8140 9358 -21480 -33729 -19811 -4747 -27164 -31252 -30706
20746 -30706 -13223 -458 12901 20789 11529 38709 32979 18020 -4882 5217 10750 10600 15016
20733 15016 11937 -12617 2571 -6440 -5908 -10228 5745 24168 -5389 -29330 -21084 -5258 -30249
20720 -30249 -46797 -34242 -46797 -66340 -54801 -29580 -29329 -2629 -2651 -13946 -16370 -146 -1955
20707 -1955 -20701 4358 17694 -1979 -24424 -4196 41156 76356 63303 27801 16736 31919
20695 31919 30658 -9207 -47714 -57233 -43811 -14852 -33773 -26290 -23873 -35564 -59362 -16603
20683 -16603 20043 19038 3290 -13899 9673 -4533 11776 -7984 -7417 10620 13856 39227
20671 39227 24684 2951 -19917 -31397 -24671 -46083 -5861 10115 -1388 4138 33195 35334
20659 35334 -11892 -13556 -15366 -36374 -77817 -55691 -23542 -29317 -28910 16118 43895 22549 -19773
20646 -19773 -42745 -27068 -31954 -6576 4598 -31178 -13766 8105 7690 -742 -22906 -54011
20634 -54011 -66744 -76492 -72271 -33633 -26006 -32694 -33090 -36115 17475 38155 44168 60983 70948
20621 70948 65596 72984 41282 -887 -8462 16070 29454 19895 -8284 -27681 -17809 2587 -1611
20608 -1611 -31452 -13905 -4017 1032 35478 45251 21652 16705 26482 22619 1030 -21312 -26856
20595 -26856 -27461 5056 -5259 16606 24632 24799 -17070 -31972 15837 40183 -21134 -65610 -22031
20582 -22031 12994 -3969 -7314 -23187 -7162 4766 -12391 -16535 -13332 -16263 -24466 19843 78063
20569 78063 85544 76164 97977 62941 34558 19610 20276 23144 7485 -29801 -20111 13315 20634
20556 20634 26904 22767 2897 10714 3022 4061 2968 -19702 -11811 -39935 -71471 -75391 -80414
20543 -80414 -60211 -46010 -81797 -98693 -85884 -50385 -57063 -40498 -33098 -18140 -10760 -11957
20531 -11957 13161 29583 23162 -9394 -44025 -40436 15540 34645 17802 1605 22090 47903
20519 47903 11596 -3954 -2722 26302 16711 3981 3901 -12884 -24874 -38473 -24925 21312 45477
20506 45477 36204 -11745 -11859 -104 -7415 -15527 4585 -7645 20952 7111 -3575 -19199 -32144
20493 -32144 -15485 26187 66266 51310 15660 31561 26340 -2245 -3752 21085 8169 -16673
20481 -16673 -24330 -3437 -6069 18301 15872 -16661 -3935 -20001 -44960 -33940 -17039 9606
20469 9606 31186 17354 -613 21823 35444 35686 68569 68216 59063 47359 30227 40617 24090
20456 24090 15667 15130 -16483 6492 15918 30845 17252 -16786 -13736 2258 42067 29746 3654
20443 3654 -20439 -21537 -11062 10561 15625 3247 11959 927 -21034 -48382 -24783 -29905 -25803
20430 -25803 -19542 -38256 -65881 -49628 2163 -16629 -24749 -17759 -11773 -14199 -33873 -4001 22936
20417 22936 9105 13163 6318 -5967 -30442 -48102 -30168 -2254 5082 -31705 -65901 -49260
20405 -49260 -19405 -10783 -39009 -28388 -29928 -22874 -36359 -39949 -25357 -52207 -66244 -44671
20393 -44671 -7743 -17798 -37676 -35045 -16059 -6180 27285 16382 50707 68553 40268 38829
20381 38829 48489 16631 2865 23148 52803 37597 34078 26838 11461 -11317 79 -31597
20369 -31597 -42934 -42724 -31887 -24982 -2838 -2597 -24267 -23262 2275 12896 38112 28673 42137
20356 42137 74570 64408 34154 48689 63447 28256 7932 3181 18038 33922 42580 25337
20344 25337 -1354 -20825 -43331 -36387 -35000 -19322 -11710 -25630 -29178 -27945 -41062 -52642 -38190
20331 -38190 -6594 3866 -7220 15976 60348 71381 50383 50456 49038 39981 36852 71989 49956
20318 49956 37268 -21613 -14022 26114 7593 -34423 -69886 -52984 -35401 -35526 -42747 -33300 -20456
20305 -20456 5525 15757 -13417 -50372 -74053 -57550 -29854 -36784 -23393 -22008 -28496 -49459
20293 -49459 -40254 -47898 -32352 -36036 -62223 -57063 -20230 16926 10130 9223 12605 54354 57676
20280 57676 45071 13526 -9464 -16519 -10374 -11228 -15292 -31098 -40760 -17706 -28433 -41642 -28518
20267 -28518 22390 33952 1426 -3331 25503 46752 9856 -1316 2095 5452 -22270 -42360
20255 -42360 -37207 -18051 -15583 -17028 -22551 -48012 -55719 -6915 32099 40664 34383 1987 11790
20242 11790 24498 -9938 -41185 -64687 -48964 -33980 -60132 -46406 -51717 -38823 -15897 -7830
20230 -7830 -10633 -13398 -5902 -6187 -40417 -70653 -82216 -65567 -42625 -38492 1 -686 -13112
20217 -13112 -19064 -9178 8620 -7197 -9804 -9093 -3226 4972 36157 39275 17970 40323 43062
20204 43062 10975 3344 -12520 -26643 -13344 -33934 -40910 -60438 -53285 -34709 -26938 3420
20192 3420 8383 -26472 -28668 -11474 -2430 -15343 6060 15892 -2087 -1957 -16996 -17662 -6097
20179 -6097 -13500 1351 7161 -2071 13573 26177 38005 8596 -26333 -37338 -13477 18696
20167 18696 45587 34573 49691 60619 66109 40793 14318 11432 49977 36438 20299 28143
20155 28143 -4655 935 22952 59884 81968 54410 632 -26996 -11572 -22462 -7662 11817
20143 11817 -43490 -60375 -59639 -42500 -10015 -16537 9520 18049 18882 -14965 -25888 -21080 -31283
20130 -31283 -11063 1459 7360 -3893 -34204 -19902 -7253 -1557 12988 15549 -16363 -59924
20118 -59924 -33625 104 16469 11816 -6367 -64813 -66446 -22524 38888 54244 32315 23379
20106 23379 47604 73388 60169 15220 14778 24551 34458 60598 33359 1301 -1666 10031 6995
20093 6995 -18913 -39372 13904 51890 22300 -22371 -41813 -24795 -24787 -44826 -31996 -7495 -6241
20080 -6241 11514 34488 14054 15157 17303 41245 49627 15459 6276 -23956 -76130 -25690 -26632
20067 -26632 -39861 -24145 -14360 -88 16780 12652 3471 -887 13595 9175 21450 43498 30988
20054 30988 5160 19718 28496 12851 655 -12958 -28121 -35042 -24826 -3693 11264 13939
20042 13939 32882 44358 51249 27908 -19410 -42083 -31568 -10398 10973 16073 1442 -12645
20030 -12645 2052 36835 30423 14288 -11936 -5837 13853 13442 -29098 -9621 32559 24438 28133
20017 28133 2527 12775 24109 28177 -2355 9247 10575 1804 9616 18634 -10259 -23472 -59707
20004 -59707 -47808 -11394 -13596 -33548 -17637 -11535 -1499 -1108 6450 13583 -873 -2920 22300
19991 22300 23178 12297 -424 11772 9693 -274 17096 54715 66164 46605 29167 29094 20638
19978 20638 6130 6928 -5241 -24049 -22479 12307 9320 4578 -3560 4136 16313 251 -20397
19965 -20397 -16174 -27063 -9074 5401 31840 24025 17571 55606 63515 31063 43737 64544
19953 64544 54183 22670 17947 18022 19892 -6373 826 -2690 -23186 -33416 -15869 1434 16194
19940 16194 2656 262 9645 -8969 -28395 -14361 16267 -12964 12423 5199 5578 11534 -8122
19927 -8122 339 32381 32847 34350 8663 11518 -4042 -7409 -4538 27406 54543 64381 40964
19914 40964 28628 8445 29881 38568 -3501 -2892 22334 31303 67104 66470 60327 49786 37848
19901 37848 17561 -4961 -13898 -631 37375 59416 31509 3421 -12776 -15080 -28166 -21551
19889 -21551 -1321 9850 24862 23379 -4704 -15517 1125 -4173 2233 21948 24871 19948 -9780
19876 -9780 19224 58593 48312 20238 -4290 -13116 -15312 -7158 -4497 13068 1872 22324 69033
19863 69033 70828 62365 77499 77669 47917 35688 39004 56483 77028 67514 24823 46770 51973
19850 51973 38543 16568 14263 21708 10988 -15528 -15720 3934 -1979 23575 8047 -4562 -1597
19837 -1597 21035 25698 28967 30269 43131 37079 25612 6445 21549 21421 22433 43203 50711
19824 50711 32232 -16702 -30754 11232 -14372 -26270 -37545 -24742 4850 30693 22874 8011
19812 8011 -956 26386 71455 84676 65431 29047 25173 33418 -22702 -35580 -4341 19043
19800 19043 20533 10627 35857 22035 10882 24867 33552 9475 -19231 -2092 24292 43476
19788 43476 6487 11561 50095 87010 88739 45299 30271 41961 47426 45960 29846 36100 -14974
19775 -14974 -33785 -43486 -53047 -16180 2837 -8638 -15869 -16530 -5919 6753 5096 28413 44137
19762 44137 62454 86848 96188 105478 104275 115186 131351 150576 177313 198187 200480 202610 246712
19749 246712 282270 307293 301987 296074 290682 314805 339986 341510 335296 297779 275827 241073
19737 241073 215002 220994 289587 296888 232026 197414 175401 159520 165975 164189 115303 73279
19725 73279 49129 10762 -9771 -1530 44788 90845 59133 15908 23032 11629 -10835 -19560
19713 -19560 10291 22705 5686 13965 20076 40694 42733 4123 12110 62939 85234 68914
19701 68914 67606 70984 19988 52 136 8098 43514 18972 -13309 -17521 38333 87728 62062
19688 62062 20350 47687 40455 61890 72833 76231 44094 35037 62823 56615 13149 -20942
19676 -20942 -13953 7796 33343 23945 -8172 3842 36776 23401 5747 -29298 7955 11562
19664 11562 143 19802 39667 43532 73647 89967 79796 63839 31132 29111 48081 58600
19652 58600 59301 65488 63928 21176 16289 54522 69755 53878 38125 38098 86928 113493 105300
19639 105300 75198 44906 16834 -13812 14142 23547 448 28331 52239 61422 48908 27903
19627 27903 -8233 -27984 19034 49387 26864 40256 28234 792 4561 45685 67159 69648
19615 69648 50976 67798 62271 22261 -24960 -37745 -33730 -37507 -10977 26560 60134 72797
19603 72797 82100 52748 29125 13787 20103 30642 26422 23613 45941 53710 37773 18558 6738
19590 6738 -5036 429 8261 6856 24503 3402 -11359 -38484 -17147 -21802 -29735 -33499 -31623
19577 -31623 -3357 31379 35868 26890 6040 8851 450 31277 74900 92517 81097 43852
19565 43852 -749 -38617 -48001 -39216 -9716 -5301 17686 36153 56639 84295 68547 53564
19553 53564 55077 40681 22142 -4554 2821 22544 22881 32958 44464 40344 35825 52089 45462
19540 45462 44580 70292 74201 82320 26632 -18153 5599 32691 22802 -8311 -16672 -23861 -3820
19527 -3820 -3557 -11383 -3796 33587 54595 85192 104344 79265 83224 92285 60847 13877 33106
19514 33106 87415 127324 103863 55404 1396 18188 40052 24769 4923 19174 31467 137
19502 137 23280 27629 28214 4150 10508 37615 24482 8527 43413 52451 55411 56308 57240 54178
19488 54178 60408 77823 98027 71635 40142 49312 66170 85356 63842 51226 52298 63712
19476 63712 75480 82526 79137 83513 82303 82593 77541 59743 54259 65597 54906 55661 60725 86921
19462 86921 102273 109073 102809 69822 70667 85185 77520 41643 12236 52795 84097 50953 49676
19449 49676 57529 83928 79673 33696 20228 9998 29110 46946 55705 78019 80317 82315 65338
19436 65338 61793 49565 81618 121110 140514 130042 129446 98002 64688 39669 71405 89798
19424 89798 105136 91152 84417 127950 118175 132928 138341 159057 146024 107191 64400 68678
19412 68678 57217 49566 52721 67220 66420 65378 52992 66041 50086 66997 60070 30982 31087
19399 31087 56344 82465 105298 96687 60850 71245 81467 45703 36562 71784 119275 138582
19387 138582 118288 75438 60464 60880 62558 99081 90557 79376 68361 33056 55630 87386
19375 87386 103329 97058 88364 82704 84314 120357 144787 120867 131251 150670 110728 99674
19363 99674 131957 167769 157530 182914 203550 219235 210292 190741 175358 196946 227644 250721
19351 250721 229351 213056 208706 242297 233208 245107 246615 263955 263600 254339 240045 248309 276603
19338 276603 269038 269688 292123 242630 231308 212567 177837 186505 198733 242223 254766 254911 270901
19325 270901 298010 301349 260594 202341 209614 230825 236745 250858 269045 261317 242684 219492
19313 219492 207142 211778 217310 223414 233135 238731 208894 218437 250080 242354 248278 246092 237052
19300 237052 223616 203646 215612 255444 298479 285993 234124 220919 229964 296652 333052 342166
19288 342166 337441 301769 303148 335219 374812 393029 407705 453682 454598 470665 491929 543223
19276 543223 572311 576507 570628 602115 628950 653315 672359 673651 738172 799479 830609 930113
19264 930113 1054648 1167814 1309248 1430451 1555028 1749335 1935457 2119479 2309470 2559986
19254 2559986 2868240 3170969 3505289 3849440 4239591 4696413 5275020 6040729 7107012
19245 7107012 8590318 10643869 12950888 15155413 17661261 20916223 25125276 29579819
19237 29579819 33340258 36841971 41169987 45991149 49626057 51532679 53387715 56328474
19229 56328474 59431006 60686369 59369261 57573896 56850078 55378777 52306165 48595328
19221 48595328 45223107 42570934 39375735 34216448 29099082 25386013 22789265 20612816
19213 20612816 18124818 15407953 13226886 11721329 10602499 9756130 9032782 8423032
19205 8423032 7890935 7437023 7012836 6591769 6215998 5889510 5564376 5260756 5000658
19196 5000658 4721690 4502196 4287351 4089100 3919750 3716201 3523346 3346867 3171497
19187 3171497 3040947 2924909 2793267 2634987 2500491 2392948 2324537 2250473 2158357 2095211
19177 2095211 1982250 1900488 1836458 1795749 1727481 1654166 1571670 1555143 1496178 1450000 1412652
19166 1412652 1382697 1320265 1264496 1221155 1177588 1163623 1112525 1088242 1071437 1006270 926507
19155 926507 887737 906476 880203 858449 863564 835562 823069 791496 757071 739181 691514 662992
19143 662992 657124 617869 583998 572332 593289 556111 492025 438394 402893 364030 348190 343913
19131 343913 325911 278620 250355 240682 251645 242022 242526 230946 192758 183105 167584 180881
19119 180881 172805 175451 148945 134389 146586 149046 125262 120672 101333 104310 107698 96148 125997
19106 125997 137950 145478 173046 190003 200822 194474 175606 149693 104846 98503 85500 130508
19094 130508 181863 175039 143584 143225 145255 166075 155467 133258 136673 155370 132629 101441
19082 101441 132340 121627 95181 88917 80276 114223 108530 100901 125837 161446 156885 155944 154403
19069 154403 198202 212774 221641 241026 265682 283479 294685 266060 247590 208057 216528 245248
19057 245248 244021 243774 261952 249133 222842 197457 178609 146087 142917 168306 174708 141063
19045 141063 100068 100352 122372 84722 71214 102267 103665 120267 100544 97768 131983 111302
19033 111302 89977 106852 111988 108974 68437 52994 82570 100280 116657 134963 144079 139861
19021 139861 160295 172931 163272 168284 201781 238979 287623 293900 347596 422176 470772 519328
19009 519328 525241 464239 451416 464879 462330 425012 377682 329545 307437 291127 253589 206972
18997 206972 142811 132104 151922 142193 123181 107252 157102 156668 137793 177312 206831 189629
18985 189629 187936 183929 116514 44243 32798 24142 21374 10394 -1057 -1027 35461 60774 66806
18972 66806 60878 76836 100881 89043 88111 96767 92169 92219 101891 125323 149595 152294 187687 243134
18958 243134 263255 271154 278733 315619 353535 344310 311437 273220 246784 205782 195682 168911
18946 168911 138294 92981 70859 91147 90628 76678 49332 22173 16269 29701 55616 75770
18934 75770 78218 76715 71424 86812 106924 75332 17796 31985 94770 107094 57283 47016
18922 47016 56959 64886 88752 62403 50512 18469 21170 68549 58865 68003 72351 39401 28810
18909 28810 20908 -8396 24241 70253 72156 76073 50225 46458 55330 36931 50298 45398 60283
18896 60283 59362 60987 94634 99017 63447 44675 28565 2228 1176 22629 30397 28378 2112
18883 2112 4949 21864 32229 23822 26378 52292 57256 38510 27415 41510 58799 55994 57042
18870 57042 73004 45410 23315 12340 41321 51732 52516 86657 93331 103420 91076 62929
18858 62929 71133 30627 22424 19877 55065 56111 29197 42157 72016 78372 69627 65758 48735
18845 48735 31167 23717 23846 16856 39523 70189 51809 49798 53920 62686 41217 -2657 5024
18832 5024 40146 26693 8576 32608 57976 73743 73640 34545 32783 36185 31217 46440 48157
18819 48157 27284 5003 -9801 5423 19642 45249 41447 17679 5774 40429 25319 39294
18807 39294 60782 69555 56326 61132 46034 60637 88978 89615 87856 74003 81788 84138 60785
18794 60785 55339 33241 31655 67826 71042 60304 66153 98247 102408 64191 42527 11147 5590
18781 5590 44476 16507 -20326 -2614 22996 60782 77109 87044 116673 145664 180952 231086
18769 231086 274206 283919 290524 319993 325907 286463 218298 193593 172524 160319 157355 129297
18757 129297 107907 88165 85343 119459 157549 118743 81029 78731 89756 101186 103502 111031
18745 111031 138922 148715 147587 165999 186466 173544 139720 117094 114135 134166 147715 119519
18733 119519 71524 57473 107256 136370 133170 125667 140033 167158 186711 198300 201922 197170
18721 197170 193296 170320 173577 188531 209686 227867 280149 305314 343841 377281 398139 377725
18709 377725 393981 412222 436505 465870 457704 421970 401126 387014 369429 365948 345386 373617
18697 373617 377372 338235 310958 262953 238272 242729 249900 270672 265411 245076 217939 206712
18685 206712 183962 192029 211648 206243 180247 161818 161649 181674 206766 205414 182575 169792
18673 169792 184579 186861 206307 216919 200852 149552 133300 168850 202366 218836 228173 249863
18661 249863 253727 231711 195112 178042 213704 208805 192816 187037 188024 175319 176265 168315 165381
18648 165381 160509 183379 192183 228951 253167 240431 247607 222099 202859 219661 249042 243045
18636 243045 237831 281005 342722 343027 326894 311496 305971 296262 310118 279434 273979 289512 345612
18623 345612 359762 341221 338767 372835 373807 383556 365688 341448 353602 378604 398716 422236
18611 422236 435944 434983 457294 465719 481572 500107 551845 604540 647592 649326 668523 696223
18599 696223 725507 728700 759212 808818 856960 913251 940728 993271 1036388 1069090 1128875 1210938
18587 1210938 1269431 1324841 1423966 1541944 1679866 1849175 2061008 2370585 2808622 3456200
18577 3456200 4436859 5816258 7496365 9409666 11271926 12677462 13520519 13724778 13496310
18568 13496310 12850194 12430131 12424787 12877565 13461557 13832868 13757613 13094743 11808498 9954495
18558 9954495 8272660 6804164 5652358 4913565 4435766 4116579 3903829 3733185 3572878
18549 3572878 3458144 3356709 3248741 3157169 3088658 3059004 3098265 3148363 3228471 3375296
18539 3375296 3539173 3677320 3836457 3951730 4123729 4357547 4627519 4907819 5265440
18530 5265440 5651778 6148098 6777356 7602400 8701981 10245574 12576398 16118679 21140113
18521 21140113 27406227 34581033 41751645 47431176 51228000 52743560 52501481 50503889
18513 50503889 48921964 48872483 50468514 53024152 54906697 55091393 52917836 48431412
18505 48431412 41506247 34409113 28008924 22920754 19586280 17481285 16092616 15143156
18497 15143156 14456979 13946577 13584901 13356198 13262757 13298078 13512311 13979552 14769614 16020097
18487 16020097 18022300 21261942 26364442 33687677 42523912 51209873 58549573 64782294
18479 64782294 69993325 73400573 73853588 71873100 68833437 65532115 60865318 53358509
18471 53358509 43524218 34073254 26864543 22097876 18930595 16706019 14948943 13547443
18463 13547443 12451382 11562487 10798836 10108978 9482389 8930094 8425738 7981917 7595497
18454 7595497 7244418 6915808 6618040 6365856 6146634 5927589 5725385 5523821 5362188
18445 5362188 5231759 5134781 5043963 4931849 4845269 4786663 4777914 4790843 4835173 4931068 5080946
18434 5080946 5342694 5797191 6540532 7723872 9500761 11721577 13988947 15848823 17377556
18425 17377556 18652161 19528631 19591168 18959563 18040543 17175418 16121214 14369420 11915292
18416 11915292 9473149 7557370 6280139 5454383 4862677 4402264 4044182 3762020 3513321
18407 3513321 3300674 3076218 2869588 2732416 2575397 2430118 2289426 2186158 2108439 2023872
18397 2023872 1926628 1858178 1781891 1682717 1614328 1579188 1545505 1517135 1441841 1369384 1304284
18386 1304284 1243867 1220772 1171257 1101285 1040135 1005308 934542 904983 841348 789099 775508
18375 775508 775395 736807 658401 587890 552486 538212 538081 527423 537975 546198 509480 482217
18363 482217 470303 488769 485151 468283 453817 433494 420898 396654 390424 424315 425994 399771
18351 399771 373930 349305 357802 386113 397177 399912 381279 375766 385741 372131 352407 353626
18339 353626 332826 313746 295400 308343 289044 274657 287633 272990 255402 239074 253100
18328 253100 265877 256220 229648 224634 217215 198077 198156 193816 205481 210847 184205 167811 158819
18315 158819 173770 185244 186920 206902 181069 172321 181457 145151 135450 135179 145305 139901 124669
18302 124669 80259 59167 106379 139102 122747 98941 121922 101879 114775 131839 122785 125100
18290 125100 154738 145621 116878 91095 97079 97180 89016 85975 86421 95536 74874 46529 51975
18277 51975 71709 75216 68902 80474 78298 76638 83893 61410 92550 112721 112788 111085 135783
18264 135783 128504 99464 66968 107147 121768 141473 148048 131235 90566 73160 96388 115606
18252 115606 104634 100664 117820 89998 56362 65426 104143 101451 83874 64490 73672 130113
18240 130113 151613 148469 136748 115833 103723 105031 77814 48736 46830 93098 88774 99225
18228 99225 122593 111909 104864 104795 124085 99480 55956 41511 2395 32743 60689 76154
18216 76154 116136 111164 87708 104631 99088 87231 130469 126163 106962 93715 82139 65381
18204 65381 19611 7183 18800 45838 74926 86662 73596 74262 73016 92256 121743 147474
18192 147474 112076 50868 -3887 -37565 -20021 23517 63078 80491 90078 88289 98060 86804
18180 86804 66631 60967 78196 68068 73552 82491 112437 109604 104582 97414 91683 77559 58635
18167 58635 7345 1205 35960 60735 58456 73652 146668 198550 184263 150536 173719 169363
18155 169363 184849 207711 193487 179010 173608 174230 168821 172357 175203 188639 199024 207982 215631
18142 215631 232730 268316 280373 324373 362977 416045 456117 481453 549874 589047 647834
18131 647834 764995 842201 913076 963121 1084266 1250313 1383226 1503694 1614527 1770226
18121 1770226 1972068 2197428 2517257 2953566 3582866 4538699 5961730 8290734 12417473
18112 12417473 19347666 27606902 32403726 34470768 36168307 36600562 30835892 20771070
18104 20771070 13968515 10221727 8058369 6717431 5749819 5058160 4522587 4119951 3784004
18095 3784004 3484418 3179054 2915936 2690572 2453065 2253449 2069362 1954755 1877812 1815213
18085 1815213 1714000 1655793 1562219 1470065 1460527 1456097 1413672 1347207 1284710 1210497 1158010
18074 1158010 1120679 1044329 968090 941952 929172 885958 817790 784113 761658 718202 656128
18063 656128 668089 670870 662056 668979 690354 679006 656251 648550 662471 658575 664018 638432 621552
18050 621552 622263 614051 591990 545334 529285 531948 497902 476698 445471 414653 405687 405118 371910
18037 371910 315233 305550 301813 304191 284660 300304 306783 259523 221664 212713 219777 222428 219632
18024 219632 214595 235343 260573 245970 222406 187027 160648 137180 130995 133120 149038 140476
18012 140476 97012 53185 60286 100648 107821 80210 88426 101859 107253 114518 154231 186854
18000 186854 180696 183733 200753 187879 173699 159935 137991 154782 152030 146711 184822 199918
17988 199918 210606 187383 155748 130463 117315 132471 134605 106786 117604 104888 126853 125660
17976 125660 105475 110509 89503 75574 58240 71116 98519 73001 62071 106406 157904 191819
17964 191819 190249 239956 275331 284016 296803 283442 294069 304896 314697 303572 286960 245626
17952 245626 194441 147128 125551 114365 105328 84368 56802 39858 20541 -12186 -34349 -46478
17940 -46478 -54833 -11431 32338 57999 67103 49806 49839 45062 36613 59135 49413 9716 -7025
17927 -7025 -21538 -15021 -31981 -45901 -38214 -1016 -6167 8041 -9966 -18083 -40880 -44550 -29976
17914 -29976 26879 75753 102495 112228 140120 130199 135805 157719 208799 231637 238307 240808 210480
17901 210480 186883 184210 201494 178291 128680 110234 102675 78296 105660 112327 81885 64429
17889 64429 48927 10740 -18219 17450 24076 23146 11258 -6729 7794 28260 45119 72743
17877 72743 40583 19920 10529 -20069 -26706 11629 33802 33772 38131 23643 19883 27202 36349
17864 36349 27808 20429 -38205 -31788 -13763 -14155 -26282 -44043 -53025 -81412 -104933 -62313 -49265
17851 -49265 -67175 -63459 -44390 -38028 -19910 -28328 -11854 -18327 -54346 -51752 -15662 -437 16258
17838 16258 18489 -9800 -44834 -51562 -24542 -1798 1241 -8072 -24469 -12039 -24858 -43313
17826 -43313 -69738 -77304 -44257 -21675 -17875 -60418 -82799 -49600 -48856 -39933 -39416 -26266 37568
17813 37568 50260 854 -19825 -29489 -17049 -18871 -19168 -20114 -26437 -24379 -24451 -31876 -26255 -11020
17799 -11020 -13814 818 19474 12548 15725 38061 13459 -3133 -23300 -38726 -27909 13956
17787 13956 19213 20247 53473 66231 33990 23811 35654 4757 -26651 -48789 -37894 -25231
17775 -25231 -48008 -51749 -57598 -46101 -43081 -9785 11884 -452 4769 852 24727 48321 35149
17762 35149 27110 -8280 -31606 -50627 -26950 8952 25604 47121 80579 93257 80998 52092
17750 52092 34825 41233 21682 44345 40364 13182 31102 43276 45610 13899 11107 2318 -10235
17737 -10235 -37044 -20780 -16840 -15313 -14520 -14333 -22176 -25335 -14603 -14834 -12450 -24989 -15971 -13060
17723 -13060 -44131 -92980 -56932 -20671 -42807 -32320 844 18786 -8246 -10093 8355 -17752
17711 -17752 -42797 -87897 -71731 -47364 -34793 -18344 7717 30268 20079 9925 -14855 -35967
17699 -35967 -40671 -60258 -72042 -60794 -73817 -33912 2806 21190 10463 15949 17591 16774 38788
17686 38788 8443 -53338 -73536 -41077 -28187 -38527 -28001 -16457 -17350 -35663 -27759 -38710
17674 -38710 -54056 -77969 -23520 -13764 -24805 -8894 -19070 -27898 -16465 -14776 -31784 -49792
17662 -49792 -69551 -71963 -28363 8895 14333 31944 -6278 -35527 -41106 -49393 -26561 -21078 -20885
17649 -20885 -27800 -22660 -17534 2786 28065 6748 -16126 30953 22093 38200 46003 20980 16899
17636 16899 14532 -2687 5930 13612 39471 11583 -33049 -41259 -3760 24518 -5085 -46526
17624 -46526 -50227 -8527 947 -15458 -53287 -68357 -52696 -15024 -24299 -50051 -67798 -46004
17612 -46004 -24765 -39611 -44120 -84085 -92920 -58296 8295 27154 19069 -20432 -46974 -43477
17600 -43477 -19830 20473 18594 6772 1632 270 14584 25500 4555 -19585 -16963 -9963 -16308
17587 -16308 -15151 8187 11716 24041 55918 41616 29303 18268 12871 8248 5261 -23174 -37065
17574 -37065 -22850 -15177 -38058 29654 48372 5531 -747 -4159 -22368 -20410 60344 74309
17562 74309 19459 -44208 -104306 -156524 -131969 -81176 -38126 -9908 12766 29869 47891 44146
17550 44146 57290 55044 54249 21431 -7888 -4487 -7519 299 20901 36221 33356 50824 13409
17537 13409 -38257 -37372 -3139 42181 68737 47238 8234 -11428 -24320 -10732 16571 -2738
17525 -2738 -7760 -1959 -5373 12823 -1734 -8929 -13754 1271 -13848 -35584 -31917 -6212 24022
17512 24022 50525 56370 44076 39137 26471 14346 32554 24785 -24564 -44874 -51757 -46999 -2336
17499 -2336 16836 16152 6241 -19361 -50923 -46435 -42843 -22361 10919 17775 3096 8906 -3216
17486 -3216 14131 40785 60863 36506 -9980 -22275 -41783 -65647 -44578 -16758 -13203 -15112
17474 -15112 -1838 18229 10443 20772 30130 -885 -8505 -7705 -13664 -31054 -35071 -23146 12680
17461 12680 42766 13612 -12314 -43219 -52639 -35129 -13901 727 6243 9538 25361 22704
17449 22704 26432 39422 67567 69760 82983 110094 164700 218028 226968 168911 104319 81227
17437 81227 66399 61036 72472 70809 57914 22100 -21361 2127 36132 57007 51074 9802
17425 9802 828 417 2052 -12446 -5434 1479 593 -5842 -11954 -28616 -53243 -35457 -20074 -52178
17411 -52178 -56949 -42077 -46710 -49516 -21133 -19227 -18589 -13322 -34901 -30797 -43248 20956 78119
17398 78119 52796 13227 -45501 -60861 -57880 -23524 -6362 -9255 -21645 -28002 -1553 -11907
17386 -11907 -22417 -10659 -9070 -8933 -14092 -38296 -62303 -46937 -28047 -11712 -35755 -52899
17374 -52899 -27591 -1588 -7708 -25816 -29544 -40309 -50062 -65470 -34037 -456 -22655 -40295
17362 -40295 -13331 7398 -24504 -2969 30530 9255 -32311 -37865 4651 55880 62954 35419
17350 35419 -19210 -39984 -25890 -7643 -17673 -29504 -29633 -57282 -30765 -14255 7415 11373
17338 11373 6226 -8302 -12972 -50990 -84564 -76742 -39450 -45374 -21930 10648 16033 21580 15032
17325 15032 -19054 -40710 -57769 -34145 8531 33668 5278 -2085 28842 53500 64725 21302
17313 21302 -22262 -21300 -13218 -35742 -65500 -54218 -58173 -22060 -28036 -31621 -18368 -15358 -16181
17300 -16181 15448 15096 31201 33918 30305 9232 3869 13368 17702 -9515 -17704 5174 16423
17287 16423 27777 3917 -15882 -19960 -34984 -36688 -37036 -30080 -12060 -37254 -34250 -2557 6180
17274 6180 795 -23376 -7572 -4218 -34076 -31818 -21503 -9925 -8257 -17600 1912 -12130 -13190
17261 -13190 -32578 -20745 -1855 -4529 -29979 -28259 -23902 -44576 -55636 -19368 -23270 -3369
17249 -3369 25127 7031 2631 10769 -4502 -8949 26391 41531 12564 2874 27820 28353 -11139
17236 -11139 -18329 -43319 -46803 -17969 -6262 -10075 -5977 4234 17854 15703 -13722 -28225 -12263
17223 -12263 -17163 -30303 -34766 -35715 -7527 -15048 -3524 -3258 -22248 -52154 -40795 -8904 -5735
17210 -5735 -21714 -3017 -29637 -57133 -51129 -36707 -24481 -10073 -20471 -43998 -38341 -76035
17198 -76035 -88062 -59809 -55006 -58324 -13289 -10173 -848 -16060 -29500 -19526 -10328 -14849 -10749
17185 -10749 1527 5989 3836 -3906 -32645 -94035 -119193 -96212 -69671 -47520 -38448 -35148 -60601
17172 -60601 -58642 -34357 -39037 -28962 18720 20744 -21484 -76462 -72871 -47631 -13806 -32156
17160 -32156 -40954 -32318 4593 -15864 -32135 -60127 -34967 21255 61756 41568 -21818 -29493
17148 -29493 -51445 -45161 -43456 -9007 30792 3553 -16848 16725 6157 -4782 -30069 -34213
17136 -34213 -1459 2184 -15430 -10860 -3146 -9820 -23145 -18323 -3453 -16573 -46986 -107276 -96539
17123 -96539 -105976 -80264 -61705 -38401 -13015 -30529 -26975 -25843 -29739 -21704 -3019 10034 31850
17110 31850 23788 -14500 15681 24011 5993 -8961 -21405 -30775 -40821 -39561 -38463 -34311 -5230
17097 -5230 36560 11386 -24634 -16697 -6852 2797 5309 7324 32943 15885 3865 1445 -32128
17084 -32128 -61165 -57796 -27708 -39655 -14051 1315 -22368 -28760 -45011 -77684 -79289 -88551
17072 -88551 -53369 5747 13920 1193 8202 10474 -8820 -7278 3591 22716 47233 38402 -8406
17059 -8406 -39890 -40994 -35095 -57132 -59913 -57707 -53373 -58558 -61776 -47991 -37825 -6855 2355
17046 2355 14319 6958 -2529 -16020 -18859 -23552 -44463 -44812 -66242 -54210 -42589 -21101 -32780
17033 -32780 -22343 13891 31699 6210 3981 -7422 -4475 5433 4697 28743 41246 31700 21722
17020 21722 -6395 -18803 -38966 -63397 -83011 -69600 -22345 -24418 -16816 -16019 9509 5373 25844
17007 25844 8181 -25646 -10439 2342 9465 -28224 -41204 -17078 -10946 -46335 -67736 -55561
16995 -55561 -34498 -20145 -12878 -38144 -47030 -64574 -58049 -5639 -3978 -5502 -31025 -22397 7057
16982 7057 458 -12047 -5053 3205 -26854 -29007 -41268 -41081 -30635 -47025 -34099 -29578 -1574
16969 -1574 -10379 -53008 -47523 -20304 4106 6914 -5970 -5837 -16769 -3959 -16730 -51276 -35580
16956 -35580 -12175 -15782 -43051 -67204 -91978 -74767 -45241 -24735 -39604 -37749 -20633 2365
16944 2365 -2141 8948 17835 1592 -10643 -38767 -50257 -22054 -25759 720 -2741 -22934 4992
16931 4992 22807 21675 12671 -15661 8816 1542 -20 -20147 -27443 -17722 -46361 -30351 -19591
16918 -19591 -40358 -69670 -45324 -25394 -27338 -4654 -9546 -23722 -19959 -14513 -41132 -39845 -14447
16905 -14447 -11251 -9345 6969 -3845 -36059 -44143 -35453 -14761 15774 12187 15801 20082 13203
16892 13203 20358 47683 27438 -4059 -22134 -12499 1352 -14544 -39738 -29140 -44321 -36240
16880 -36240 -27474 -15040 -29754 -51604 -39056 -27541 -30920 8101 30299 2064 -20614 -6705
16868 -6705 -5850 -35917 -41417 -27234 -9546 -3174 -20389 -6811 -13046 -25797 -17298 17225 6795
16855 6795 6798 13200 4371 -14189 105 3628 -34115 -29397 4262 13578 -20486 -33558 -15227 -12824
16841 -12824 138 -6316 -5126 32819 31709 10305 17806 -4029 -29812 -7419 34696 50239
16829 50239 -5531 -49064 -38849 -5004 16848 -4193 9390 7232 -18255 -14438 -13449 -43934
16817 -43934 -33838 -41602 -25245 -26586 -7130 13155 15760 23077 28589 20933 -43736 -57639 -78960
16804 -78960 -61553 -37899 -37650 -25277 -11036 4601 -9171 -30079 -22397 -29591 -33506 22786 47280
16791 47280 -26961 -27378 4926 34305 31369 22476 28893 17791 5259 -4805 9736 16949 5380
16778 5380 38389 37011 17543 33637 31712 -1951 23180 41487 -16434 -64737 -46078 -42647
16766 -42647 -36346 -42846 -65034 -47147 -22516 -28455 -955 49624 44717 39301 47173 79796 65612
16753 65612 -7594 -7206 11567 11176 -28033 -52177 -57316 -31694 -12665 -16779 -35805 -46623 -40435
16740 -40435 -23057 -57358 -63264 -69726 -68258 -35189 -6796 15928 10414 2451 -11435 -39417 -26755
16727 -26755 917 9345 8842 17870 4910 -25053 -48290 -65716 -50486 13734 29246 44057
16715 44057 67485 56936 36090 6063 15815 34603 53981 26113 -2071 -30760 -30996 -16353
16703 -16353 -13545 -378 -11646 -15961 -10614 -5520 -1551 12732 33248 22851 -11206 -23821 -10691
16690 -10691 -6059 -22672 -27839 -58272 -63751 -35412 -769 10570 -10357 -12785 -24370 -42413
16678 -42413 -54276 -38323 -41764 -35794 -17259 -33471 -41376 -20357 -1277 -11905 -16021 -33911
16666 -33911 -49090 -58683 -40752 -66535 -68789 -61478 -30068 -16300 -11899 -29181 -46560 -49984 -70367
16653 -70367 -71306 -48462 12067 45427 81446 41655 6464 -9212 -32204 -44599 -70136 -54592
16641 -54592 -12879 14261 -16742 -30236 -9244 -37730 -76019 -80231 -62568 -20493 -1473 26784
16629 26784 26553 29066 -16599 -35416 -62759 -57556 -66140 -74197 -33405 28785 33227 -4866 -58454
16616 -58454 -83802 -41688 -41061 -50920 -60410 -45257 -24519 -23157 -26155 -22703 -23123 -56567 -57673 -32246
16602 -32246 1699 47374 49481 62925 50280 29121 6716 -11454 4780 40938 1465 -51013
16590 -51013 -72788 -63559 -65221 -41221 -49782 -50493 -41225 -33089 -53410 -43251 -40908 -57518 -7278
16577 -7278 20005 -11340 -26201 -32821 -2585 41058 70871 64171 44358 9389 -9794 -22950
16565 -22950 -6706 3977 23894 40449 23775 -24482 -16573 -9115 -34638 -40101 -29780 -8601
16553 -8601 -3335 -18867 -24866 -24880 -44642 -71922 -41396 1343 9460 4544 -8126 -1025 -1746 -4219
16539 -4219 -18357 -34273 -37299 -14576 -15754 -12550 -58967 -58952 -28872 -55388 -13913 896 -6923
16526 -6923 -17069 11275 18519 27564 -3405 -18213 -28682 -17187 -28108 -34003 -21092 -31760
16514 -31760 331 -8297 -4848 -2682 14047 19891 8521 -34125 -14916 -22612 -16057 4059 2637
16501 2637 9296 16687 -11820 -34314 -38650 -8716 18167 -4724 -28599 -47743 -63445 -40259
16489 -40259 -4246 -3189 -9921 -42093 -91171 -96310 -69888 -60307 -56840 -40886 -61148 -63610 -27314
16476 -27314 -7106 -2342 -38839 -63624 -64132 -15982 3062 7466 -12092 -28710 -29616 -46610 -39060
16463 -39060 -39119 -37498 -12075 -1717 -1351 21090 6993 2773 -7865 -12541 -10707 -28464 -40655
16450 -40655 -24300 -43547 -36100 10741 8167 -22087 -22921 -28737 -23611 -14560 -34752 -39054 -31489
16437 -31489 -14164 7522 2614 -24743 8958 31193 59451 63100 38569 8198 -24401 -21217
16425 -21217 -22408 -44101 -55614 -56676 -63482 -58719 -56158 -61150 -74191 -58783 -40126 -47165 -62713
16412 -62713 -71793 -31880 -11457 1111 4131 6152 1470 -19961 -34060 -27769 -9081 -6244 11339
16399 11339 -3104 -13218 -24276 -46195 -47977 -43826 -53445 -51224 -15180 14437 25913 23689 -25114
16386 -25114 -50334 -20038 -9116 -13128 -1472 -21073 -25775 -29879 5687 -7117 -19064 -35317
16374 -35317 -2331 -24513 -12877 -26043 -32539 -30414 16016 25973 2391 -12189 -16136 -25340 -47871
16361 -47871 -39545 -38748 -46303 -77034 -104339 -107857 -78877 -27719 -16178 -12433 -25276 -42643 -29272
16348 -29272 -46427 -34281 -24786 -31324 1865 22119 16636 -11327 -35525 -30160 -28611 -17155 -34810
16335 -34810 -62277 -41123 -16118 -31980 -57099 -53048 -18902 -638 -2315 -16525 -36404 -32560
16323 -32560 -13375 -2898 -5489 -32134 -41462 -34321 -3512 9395 -7740 -41655 -56165 -75801
16311 -75801 -96063 -99935 -92883 -68799 -24072 -28943 -18920 -27014 -43595 -45964 -30542 11028 31562
16298 31562 13889 -35692 -67965 -60409 -70394 -25163 -2039 -8207 -6194 12220 -4925 -25709
16286 -25709 1756 15873 10045 -41465 -14916 5107 -751 8718 35862 6935 7670 -4484 -24272
16273 -24272 13513 23436 -7831 -5723 -861 -10799 -33607 -14541 796 525 -21832 -34322 -9045
16260 -9045 14695 8096 8122 9589 -5776 -23179 -7218 3484 51973 79752 61657 38260 -5979
16247 -5979 -30995 14111 35922 41128 11703 13508 46104 54323 29553 36864 25013 7023 -1998
16234 -1998 -17299 -65197 -28655 -31888 -25125 -23521 -19862 -13543 2759 -12722 -21417 -15239 -26819
16221 -26819 -30002 -34130 -28516 -28959 -18754 -46531 -32360 9839 -3712 -25710 -60610 -72943 -78015
16208 -78015 -64791 -58398 -29190 11926 16277 1742 -50895 -69463 -53451 -48160 -15689 -3354
16196 -3354 -25407 -57091 -58119 -36456 -46759 -86625 -81913 -64154 -61120 -32292 -4347 4592 46835
16183 46835 16209 -42710 -70134 -83063 -91980 -94818 -124143 -103593 -59068 -43922 -36506 -41575
16171 -41575 -55698 -29665 -10316 -26342 -8643 -6858 -21102 -24770 -40624 -16357 -8150 -32685
16159 -32685 -18148 10376 8171 -13558 -22009 -13684 3469 43850 43846 15977 4489 16847 11895
16146 11895 26633 22181 14578 -24324 -30501 -10661 3148 23314 33610 34736 -12317 -1688
16134 -1688 20248 22158 7454 -8488 -16814 -17051 -2905 10663 -4147 587 41321 27111 -12252
16121 -12252 -37421 -37460 -14405 -31111 -22553 7045 -17271 -29466 -18780 -14108 -14070 -17927 -12243 -36315
16107 -36315 -49331 -61965 -74643 -79793 -65220 -70896 -72318 -55568 -52398 -86364 -91061 -86307 -68076
16094 -68076 -58020 -54540 -38994 444 12401 21479 2912 4297 -12683 -54694 -61033 -18651
16082 -18651 27826 27452 9841 -5419 -14328 -16704 -46581 -39305 -29539 1208 7404 2873 -2890
16069 -2890 3919 -26993 -37883 -14520 17366 13428 20133 45139 54796 39833 32290 5932 -14742
16056 -14742 -26041 -3291 -3053 -1024 -7719 7248 6313 -2189 -26006 -41857 -25408 6779 2087
16043 2087 6523 27320 53867 86420 70282 6795 -42547 -42193 -31428 -30955 -4924 5974 7151
16030 7151 1028 -15895 -35929 -28950 -8634 109 4700 14472 28705 29459 2527 9039 46726
16017 46726 45806 9801 27042 29180 -24466 -31370 -22730 11020 4554 -37500 -40842 -29671 -39557
16004 -39557 -17223 -8258 2843 4236 -45844 -62563 -66654 -29995 8842 20633 -19283 -56078
15992 -56078 -22171 -21780 -51334 -36780 -48526 -57005 -46304 -20777 14926 24778 4565 6748 -7510
15979 -7510 5044 18113 -666 -42424 -24957 -10718 5195 -2615 -50158 -50953 -9772 -11278 5764
15966 5764 1613 19780 8847 -3115 -34144 -41774 -46383 -48773 -27321 -29355 -19061 -19867 -18671
15953 -18671 11091 18509 1851 2549 595 -14288 -19840 -13910 11340 -3523 14318 29050 20867
15940 20867 -8458 -34690 -44044 -30357 -41620 4739 43379 47044 35817 23148 -4161 5161
15928 5161 -41756 -75638 -19429 -7034 -38465 -33157 -15947 22878 18443 38981 36909 1929
15916 1929 -10267 1410 -7322 -8587 -22596 -54087 -30173 -60551 -72119 -26407 9954 12451
15904 12451 -5262 -29268 -39218 -37093 -6977 -8016 -33868 -40225 -22942 -5809 -29262 -42989
15892 -42989 -12327 21591 23115 28039 37897 22109 -8039 -22663 -41802 -8834 50861 34729
15880 34729 2850 -12644 9155 -25013 -10976 13496 10773 -44008 -77509 -72017 -71929 -74465 -75173
15867 -75173 -68117 -49843 -47130 -18312 -34052 -4788 -7007 -28834 -56053 -18941 14501 34362
15855 34362 32281 10185 -8385 -21372 -26707 -41421 -46736 -65535 -61477 -32112 -16864 -18439 -57194
15842 -57194 -47940 -33378 -33348 -46183 -9561 1244 -22364 -5872 32146 24328 -7570 -10072 27570
15829 27570 22890 -2807 -588 -1845 -8841 -20425 -26519 -16919 -11747 -27929 -22895 -265 4240
15816 4240 -6133 -8445 -15490 -17670 -35172 -39404 -38340 -32856 -6525 15345 -10385 -17960 -18573 -41344
15802 -41344 -26581 -4185 -10364 -5018 -7402 -26071 -13058 -9643 -933 9608 5161 -18799 -48825
15789 -48825 -25495 -16621 -39937 -24963 4392 5766 -8076 -47160 -30888 3692 -3843 -33428
15777 -33428 -61869 -52692 -23408 -38126 -56860 -33334 -50295 -61917 -39056 -34606 -25899 -34293
15765 -34293 -55395 -67543 -37570 12430 36688 36992 27460 -8412 -631 3126 -6894 -29645 -42974
15752 -42974 -59806 -36520 -10513 -28634 -31303 -20143 -38746 2798 -657 2481 -4271 -36500
15740 -36500 -88903 -82304 -23438 -11686 -27403 -34263 -33301 -19139 -7398 8439 9482 -6160 -8046
15727 -8046 -22233 -20199 -63963 -63408 -55515 -56636 -70140 -39166 -21801 -32711 -16069 -801 3658
15714 3658 -1263 -17722 -55975 -66764 -36694 -39470 -45147 -52097 -61478 -51937 -39665 2607 16882
15701 16882 25580 9751 -6951 -10844 -1456 5736 -5867 -16889 -11607 -45336 -48394 -19756 -4118
15688 -4118 -13697 -32423 -42534 -46786 -45217 -58872 -71236 -66509 -24655 -17658 -12818 2961 16795
15675 16795 -26871 -54207 -59842 -61906 -32596 -36296 -30738 -39822 -40696 -45760 -61023 -45824 -19130
15662 -19130 14943 23230 21056 28270 30594 -18379 -61943 -56262 -50579 -20624 2513 -3690 12740
15649 12740 16559 27781 13889 -4836 -14752 -32322 -45909 -51047 -37377 -12826 16058 1805
15637 1805 14449 41947 18122 3836 -36044 -9473 18790 45163 53232 61246 52282 12008
15625 12008 -7669 -41298 -58316 -52730 -40436 -6896 -7711 13968 18551 25761 -483 11997 23709
15612 23709 12340 2725 -7404 -8377 -13791 -26640 18411 14529 6164 33820 28761 3516 3106
15599 3106 1087 18019 5503 -13501 -26322 -29003 -11048 8926 -4946 160 -5943 17654 53269
15586 53269 50744 52750 30328 18387 24283 19075 -25543 -45800 -61432 -27470 3767 -6483
15574 -6483 -30475 -11003 11320 37880 56328 53216 12584 -15509 -57045 -74810 -71616 -93181
15562 -93181 -60410 -43257 -12277 35525 25435 -6729 -22935 -43023 -41973 -53013 -69097 -72792
15550 -72792 -73792 -48594 -3774 -22300 -24235 -6660 -24407 7680 15479 22758 21346 5633 -10525
15537 -10525 -45021 -38831 -23524 9599 16161 -9498 -25705 -34694 -52150 -48450 -44633 -48298 -9361
15524 -9361 30577 46112 40357 35306 32676 27007 1016 -29231 -767 28749 20091 59767 29603
15511 29603 15155 135 -310 16464 27501 4974 -23417 -25682 -39899 -61587 -15995 5147
15499 5147 22468 13436 20385 -13872 -68859 -77057 -38341 -32294 -27001 -14039 -6252 -9356 -1494
15486 -1494 -428 -791 14158 26527 14408 8570 -15456 -21970 -7730 -25961 -33449 -54450 -28812
15473 -28812 -34844 -60038 -36559 3040 36848 -7718 -15567 1543 23905 21475 23481 17276 -27774
15460 -27774 -28870 -55161 -43607 -5675 4208 171 -19962 -19870 -43494 -27841 -8168 -26577 -30881
15447 -30881 -19592 19019 18697 -9460 -25233 -4218 -6076 42123 37247 4604 9354 25971 18192
15434 18192 19415 -6767 15961 29264 7663 -3329 9622 -7057 -32964 -19278 -45075 -54438
15422 -54438 -95034 -86778 -70286 -31808 -38389 -69124 -79403 -12720 2179 11815 -18864 -35880
15410 -35880 -12670 14756 1310 -10517 -30151 -20852 6729 9505 -3537 -913 22692 15451
15398 15451 15526 19988 9417 16739 12405 25993 12995 -22555 -21132 -7057 -11707 10905 24360
15385 24360 33189 43194 38622 44085 12720 7250 -10519 6211 -1004 -12991 16911 28884 7253
15372 7253 -7516 -21136 -24762 -16683 27591 11151 605 46978 60293 49033 20517 27443
15360 27443 27024 18887 36270 13613 2195 10047 -13878 -50886 -60673 -17515 2596 283 -22586
15347 -22586 -27095 -1767 2082 18836 34655 35964 14090 11715 -20647 -13845 -13735 2217 22703
15334 22703 94672 113518 48498 24846 20207 24005 39335 12649 -4382 -14522 -19486 6864
15322 6864 5304 -20574 -18274 -17796 -21427 -40088 -39564 -51191 -49740 -35971 -35090 -19115 -37859 -39264
15308 -39264 -25450 -374 6191 16951 15672 9797 13549 21532 23084 -28860 -37302 -34478 -35399 -52414
15294 -52414 -30433 -23566 -937 7567 -357 -11117 -31034 5230 10768 23930 19296 -12090 -15229
15281 -15229 12579 -2862 -11447 -30483 -10080 23395 14323 16458 18609 -6853 -33192 -34213 -61390
15268 -61390 -57076 -8751 1515 11697 14133 17308 -14027 -16610 -25617 -51537 1110 -1562 -7860
15255 -7860 14260 43978 17142 -30281 -30068 -33340 -46857 -38530 -54576 -42119 -15487 -19140 -9084
15242 -9084 6596 22031 13721 9296 -13851 -17989 6370 -10504 -15089 98 2578 2833 34089
15229 34089 49526 52811 1028 -24488 -39305 -29202 -32449 3663 34207 13153 -30701 -24881
15217 -24881 -47443 -53132 -26020 -25161 -3725 -15280 -25813 12085 37613 62068 56940 20386
15205 20386 -19984 -58606 -71841 -53267 -45953 -85057 -77463 -55661 -65151 -38541 -47660 -40836 -33429
15192 -33429 -13068 -11972 -19611 -35541 -45202 -212 43704 69201 80648 54135 26600 24219
15180 24219 47570 30881 -3218 9243 1438 23305 27164 4153 14524 14304 2725 -3338 -21319
15167 -21319 -63343 -41585 -24393 -33588 -14090 39848 47757 9193 2838 14769 -620 -27900
15155 -27900 -33839 -23874 -37789 -45074 -54180 -70122 -51912 -38221 21851 20939 12575 19248 37133
15142 37133 53415 50774 896 -37052 -10523 -9993 -7005 -8518 -17979 -19556 -30367 -41602 -67075
15129 -67075 -59835 -17121 10305 41664 35388 2036 19390 33461 21989 17889 38413 17185
15117 17185 11207 -6972 -24557 7740 10261 18801 34147 20272 16361 3072 -16634 -1326
15105 -1326 48967 38660 25561 21380 21993 24014 5001 -42990 -17019 -7921 3840 14732 20843
15092 20843 12 -13672 -18844 -11282 -28797 -16348 -1342 6519 31369 36783 42189 29003 39804
15079 39804 21657 3478 4552 5340 15243 -3556 -8230 -46184 -58073 -30175 -6157 -2926 -26444
15066 -26444 -37994 -26220 -33201 -45001 -31413 -30688 -27657 -17515 -30344 -50344 -28630 -22273 -29628
15053 -29628 -2366 -9366 -22098 -47316 -48019 -5327 -6428 7486 -2987 -13486 -13231 -5290 -14008
15040 -14008 -12033 3191 43829 49223 46089 12985 -22003 -41922 -2973 21347 29808 31782 1644
15027 1644 -24284 -10585 31979 51590 43576 41814 36302 22202 27685 -8913 -58849 -48515 -2327
15014 -2327 38949 70444 98357 71751 -6948 -57740 -52083 -1385 16724 3330 2902 -5763 -5495
15001 -5495 11150 6637 5697 29072 83340 86407 98644 123471 153051 198939 236248 242441 245115
14988 245115 202784 167774 109400 55457 23394 43532 23865 -6060 -1295 10949 22674 45082
14976 45082 33747 26607 42331 45915 16736 5073 19113 28682 27105 -39136 -61627 -30685
14964 -30685 -1881 22691 31146 37961 41127 44685 13608 21702 7877 -6800 10010 -19934 -52732
14951 -52732 -52874 -50794 -22693 16448 42947 57541 49959 1152 -5350 38010 53354 52435 40766
14938 40766 50431 38453 31028 49235 34499 26235 51368 44296 29062 9706 -16729 5016
14926 5016 22672 17689 20098 16825 38131 35070 55351 65266 69420 69739 57020 33127 12319
14913 12319 23256 8585 2329 32126 63243 16099 -24814 4635 15722 -11711 -31338 -23245
14901 -23245 -14972 -16607 -9140 3930 12419 23624 22299 40095 17655 20881 45560 26448 1432
14888 1432 -17015 -7415 1229 -16370 -7690 24752 48590 19535 -13537 -20929 -23234 -32909 -20622
14875 -20622 8819 27715 40978 52305 56543 41300 32568 26975 7275 30735 66570 51058
14863 51058 36427 29197 37992 13566 -11569 -26618 -12742 -1996 5430 13305 2696 -9717
14851 -9717 -18731 -1382 -24033 -21205 19662 35412 12535 -8985 17158 19482 -1093 9702
14839 9702 41932 29810 -18724 -21308 -35515 -62443 -35210 -4553 -5900 -30507 -30311 -29186 9345
14826 9345 -14274 -54990 -74658 -64175 -42956 -16509 38213 40022 35409 24360 32311 -7715
14814 -7715 2907 21771 28995 27972 27238 13289 15579 26670 443 -31526 -8607 14059 15994
14801 15994 34057 19415 -5687 -47639 -23691 8050 14804 -5325 18870 75853 68116 45021
14789 45021 27132 3666 -12969 17284 14737 24198 27130 13688 -20586 -15300 21504 20186 28187
14776 28187 41225 25869 -2289 18152 28505 28893 58334 77365 18240 33606 81939 42877
14764 42877 23218 48542 72007 57341 67645 125377 134081 96179 119827 150327 216838 265872
14752 265872 308860 320140 291548 263154 276992 288395 319268 345093 360769 350005 336167
14741 336167 299025 253395 225503 242403 291985 272173 250102 289624 331191 339719 315812 289824
14729 289824 262765 228887 256685 285262 270477 268900 268784 283894 337427 330052 332340 340222 360048
14716 360048 331336 286364 302391 331926 313442 289008 268215 242272 274237 265437 229595 193567
14704 193567 175025 189286 185794 174622 154472 132933 127906 148603 139057 120797 112081 120327
14692 120327 113337 131551 115191 112614 107069 108114 116160 110292 65940 35639 38076 42653 64666
14679 64666 11594 -11228 16511 14530 27820 58096 81521 83761 58958 37581 58991 67232
14667 67232 76547 69271 63300 51024 10492 -19357 -23467 2954 47005 57867 76940 112360
14655 112360 119875 99062 79900 61688 56187 43935 38802 57409 62239 92114 102798 88863
14643 88863 50847 50838 51769 51374 40254 52736 48469 88254 75957 46633 1940 12174 20773 58666
14629 58666 101441 91652 51139 49338 73654 65421 31180 21084 52740 64142 30499 -24272
14617 -24272 -36526 -1227 31007 62220 50182 24189 6367 -862 -35242 -21644 11239 35233
14605 35233 38813 26260 18567 30864 20570 -8805 -17217 -43197 -40624 15853 36875 40724 74651
14592 74651 54893 35020 57072 57447 54713 50520 52899 64418 19753 -10902 -23171 -8900 1997
14579 1997 24633 44073 64821 24443 18568 20187 32583 28533 34859 36260 20803 17011 34881
14566 34881 44041 61064 59019 55152 15167 34116 60322 79626 76411 76707 81165 71988 64086
14553 64086 57804 64261 53450 69630 84743 79501 72425 90270 129072 141809 115801 106027 96077
14540 96077 61556 51763 97600 121612 100842 104042 103854 95082 101597 106529 114101 82468 67128
14527 67128 64243 117254 138383 124368 120545 107173 88351 76188 103175 103180 79410 76038 91355
14514 91355 111236 123655 124418 101830 76069 81223 74879 68815 61241 61208 54708 43258 27228 45837
14500 45837 72070 98625 127529 142373 123644 116572 112422 135207 127661 118041 156862 151075 139971
14487 139971 149113 160937 155367 185058 194348 172773 127840 104537 105285 97308 105711 106344 127176
14474 127176 163397 171796 128450 109659 106883 116709 119908 96223 120470 110333 111334 139030
14462 139030 134590 139622 130826 126941 136475 139416 121389 110788 148078 168597 210077 198882 158803
14449 158803 137271 121132 142560 143624 143947 130835 141760 149000 162881 184458 195893 162957
14437 162957 132465 130561 154414 179047 160941 171710 211213 231897 247783 247258 241682 233214
14425 233214 245412 289585 321668 306252 300713 307514 312441 305802 298353 319186 343730 318482
14413 318482 270495 266133 311697 348146 338785 362884 379244 365595 351447 356290 327411 325976
14401 325976 328984 371339 381686 361004 359324 370631 388348 433752 440357 392032 375852 388004
14389 388004 423719 461116 489935 492160 511207 551907 542316 533533 551321 557189 540130 487758
14377 487758 482198 509839 500309 509030 535142 552927 551965 546781 564010 592072 617355 642953 653077
14364 653077 658820 661458 682304 683284 684899 722157 765367 773946 764766 771698 838064 836486 822181
14351 822181 853820 884780 924059 978763 1020045 1005192 1030451 1146036 1237494 1284400 1324220
14340 1324220 1378872 1473682 1574672 1682784 1805835 1915754 2024399 2142675 2283769 2459042
14330 2459042 2633780 2825923 3061005 3320320 3616569 3929489 4269976 4672827 5149558
14321 5149558 5616533 6190000 6866489 7599655 8449424 9363452 10412884 11651298 13060426
14312 13060426 14644017 16476760 18565916 20951598 23571890 26408316 29479247 32720474
14304 32720474 36040586 39377261 42571701 45491330 48059606 50141598 51730329 52791149
14296 52791149 53299298 53338496 52967107 52190878 51149756 49935085 48680049 47434250 46257550
14287 46257550 45218759 44345514 43591928 43022628 42652670 42513361 42561495 42771597 43217080
14278 43217080 43878368 44728120 45751306 47017909 48432547 49994549 51631709 53259211
14270 53259211 54774447 56086062 57067787 57637873 57700475 57181393 56132635 54499551 52398323
14261 52398323 49897106 47027658 43960188 40818822 37619452 34472191 31513676 28793368
14253 28793368 26354911 24091928 22044463 20236916 18609631 17196891 15942496 14813701
14245 14813701 13798258 12882676 12029766 11316791 10646642 10038627 9480465 8969489 8478065
14236 8478065 8043584 7605706 7254829 6917444 6583936 6263090 6017784 5769896 5494166
14227 5494166 5227139 5012649 4759401 4535602 4373484 4216609 4078422 3894740 3739900
14218 3739900 3579037 3405418 3305350 3228287 3111025 2978121 2867637 2751422 2659484 2571504
14208 2571504 2482189 2387278 2313554 2236560 2142640 2066258 2001720 1950292 1847640 1776587 1731638
14197 1731638 1664344 1615070 1560693 1498666 1432883 1382526 1330718 1290448 1259525 1214338 1167087
14186 1167087 1125962 1072875 1031469 983549 962034 907644 867026 855850 841107 820960 804513
14175 804513 744195 704272 685639 678784 649529 613012 571229 551392 564334 594138 574240 544594
14163 544594 515832 497773 486065 480852 464796 414616 398175 420498 446861 406894 334976 311883
14151 311883 301272 333905 350610 358362 353858 311534 333420 328082 321032 303381 279591 286540
14139 286540 302760 284308 238413 239508 242067 249216 273146 275233 281814 257506 287922 306424
14127 306424 297688 272190 254795 253862 219175 240025 246467 259660 260188 257765 245130 252514 242721
14114 242721 234032 200763 184674 178154 186346 184054 197272 190347 208990 235377 233457 204100 157949
14101 157949 154723 183160 201476 208641 173859 163577 124404 146450 168369 166543 168161 185264
14089 185264 186732 139713 95026 113644 102442 85325 99072 139600 167658 143421 118303 89824
14077 89824 125372 106796 91829 76134 87431 104793 128837 121793 105207 97887 108392 116605
14065 116605 107706 121544 123799 127488 135065 152634 153071 149778 129123 135080 134406 131696 130690 143101
14051 143101 182146 176181 143291 126987 130373 119658 133894 143683 134291 104602 72944 63053
14039 63053 68128 75753 70930 68960 90272 85418 87417 89148 68723 82791 74741 71516 30533
14026 30533 11812 45843 68296 76212 67061 109176 138142 168162 157951 97131 77380 88126
14014 88126 93855 102066 125062 98471 60708 46024 79452 104602 108704 109413 76911 42572 39439
14001 39439 34099 10857 52527 74824 87359 66212 68749 95976 100035 50904 10778 26470
13989 26470 49433 30308 34511 45653 73922 52451 29885 -2198 -32721 -49687 -16454 3739
13977 3739 5618 6665 3486 -54 42056 69652 63568 64460 67929 69778 88938 109428 91453 77544
13963 77544 84274 75479 65983 65969 46849 66094 104930 101079 97659 96567 64195 75318 121583
13950 121583 125697 100583 132280 107589 75727 89089 87805 73738 42823 18124 43133 46549
13938 46549 52203 100244 120797 85730 65261 77194 91801 86651 105938 113159 110022 83153
13926 83153 78017 92082 94011 67495 64235 72499 102093 129077 107080 96167 124488 119688 78933
13913 78933 51044 58701 82206 87065 53210 28424 78024 118540 106254 73272 46610 70665
13901 70665 94009 68942 52561 39843 64033 84743 92754 81276 86462 88098 59987 46098
13889 46098 58094 82585 69371 64529 38418 50309 57718 82644 69621 82971 93893 63347
13877 63347 45244 45979 47540 73634 97989 79686 53995 53564 82284 96165 107426 117958 123312
13864 123312 126040 108569 121653 170367 189676 191751 241969 262124 260065 271599 266434 271773
13852 271773 300923 309907 349268 392154 399857 447542 507663 573070 644787 766341 951360
13841 951360 1215240 1594654 1980987 2175036 2287491 2342500 2285935 1900070 1433655 1114759
13831 1114759 928207 798735 680998 631401 596717 538780 486793 466460 456775 471893 447931
13820 447931 440607 455585 478448 516901 497216 458649 454513 465803 484450 489689 461205 422509
13808 422509 404076 404391 396466 392225 382133 368463 358021 369467 363074 341977 307424 284451
13796 284451 258654 213923 202448 253634 226767 220721 203286 204185 193057 197053 194291 160375
13784 160375 153868 152783 114605 92908 113868 132071 124239 111782 95198 105465 105473 67905 69121
13771 69121 59088 88741 69525 23356 -4748 48184 92572 95550 101652 97927 56308 16459
13759 16459 21905 57911 77873 69968 72206 68222 70443 60644 50602 73303 90600 79880 82707
13746 82707 88753 75497 89864 70416 31794 53837 96557 75636 60019 52562 48165 56872
13734 56872 79519 105683 106766 74619 69421 75233 75288 89791 92471 57226 43686 37423 48768
13721 48768 69121 64221 50360 84019 72325 47547 46244 46523 50182 72908 81512 94681 79929
13708 79929 46962 69059 95109 99979 108177 103218 133747 119457 89539 82965 78682 75764 71229
13695 71229 39003 17160 36170 84157 71767 76439 112000 140397 130049 85507 20271 19493
13683 19493 6814 4021 8951 19262 78735 104004 84513 80126 91908 75637 69692 75611 83009
13670 83009 39975 35014 51779 68848 49362 10515 22179 11878 9600 24926 42508 80495
13658 80495 121062 144178 182669 185667 191009 188788 184752 192393 230906 247344 222341 201250 210476
13645 210476 205185 172082 155552 183058 214416 223593 209103 184503 169453 166124 173708 157585
13633 157585 176525 164124 159193 164427 211825 232141 219983 193935 205772 195101 157744 121966
13621 121966 147788 132959 120880 120350 125214 149525 155414 147209 143898 144374 111700 130055 150179
13608 150179 124008 135149 133221 130488 133426 124813 131318 120277 141482 174485 193793 179019
13596 179019 185773 162859 171996 155185 144272 166731 200174 208012 243518 255410 253016 270716
13584 270716 282668 276722 257686 240746 238717 245371 250716 269755 325457 355420 343696 282215
13572 282215 256675 236340 188388 156720 108160 97503 134166 152640 151041 164164 167082 131544
13560 131544 134030 111676 102761 105741 128817 144205 170835 175598 172620 182250 202489 211041 233707
13547 233707 254869 252277 250867 263312 255503 232005 215965 185496 153651 139032 152771 205010
13535 205010 245290 280937 254751 200693 171113 175162 165589 181908 224030 269661 349264 401865
13523 401865 421084 489998 576453 618016 633489 618395 630361 678353 689493 682479 658440 616489
13511 616489 610583 625444 671415 699292 711673 747769 765685 731645 714817 706565 670900 613395
13499 613395 604188 586411 611795 624684 648439 661533 660693 665577 676797 669423 684751 701960
13487 701960 720672 751127 762955 734748 685285 668213 667125 673284 662772 649976 603361 590237
13475 590237 622734 658504 679446 727808 715848 688384 707668 708428 705036 697036 693094 698036 719759
13462 719759 708192 720721 752144 788116 818811 838371 867073 903164 893218 904130 942749 1010093
13450 1010093 1008207 1043104 1126566 1210787 1270417 1304283 1328519 1361030 1447505 1543726 1647033
13439 1647033 1761781 1848794 1899902 1939415 1972596 2043950 2125608 2204347 2317851 2434286 2541343
13428 2541343 2682170 2886503 3123146 3394995 3711177 4087699 4456001 4859401 5379225
13419 5379225 5953508 6586921 7289267 8039246 8893459 9878860 11019191 12305060 13695128
13410 13695128 15223938 16776133 18507618 20514178 22896510 25884402 29816469 35120525
13402 35120525 42365555 52482646 67548779 91438007 130648641 192723395 270758056
13395 270758056 328230532 354913555 371634549 376614638 338568590 250406219 174764661
13388 174764661 128755857 101561789 84377047 72283315 62819056 55214723 49382985
13381 49382985 44767697 40788313 37156552 33879683 31061914 28627329 26501869 24671099
13373 24671099 23124622 21763613 20586273 19607657 18781571 17998455 17217865 16507380 15897476
13364 15897476 15328373 14728172 14149356 13559311 12917369 12315579 11752369 11196913 10649056
13355 10649056 10092254 9621175 9164239 8743234 8337796 7930817 7537371 7167119 6880450
13346 6880450 6644699 6446429 6252909 6106932 5914216 5662473 5447381 5276824 5135722
13337 5135722 5000210 4876093 4801833 4646929 4499166 4384600 4229665 4084649 3931035 3800233
13327 3800233 3679577 3552564 3417916 3280582 3175372 3062321 2944771 2876233 2791133 2685056
13317 2685056 2598357 2492846 2437354 2401039 2373289 2330840 2262990 2162594 2103757 2109529 2067992
13306 2067992 1984569 1934836 1877936 1754480 1650383 1535147 1445029 1310066 1215559 1150344
13296 1150344 1090618 1046904 973686 913505 834655 737484 667990 608814 600821 577280 523563
13285 523563 480130 445548 424594 408644 382717 351335 314500 315106 322059 302712 295893 293516
13273 293516 285131 278360 345884 433673 430020 415179 409189 410709 434218 450336 435043 407105
13261 407105 431193 442681 402688 383770 363620 360388 404290 418943 397598 362377 348310 381106
13249 381106 383695 387220 400335 354273 305062 294851 288869 294845 261543 249025 288778 315897
13237 315897 337367 303902 291756 296486 296638 308776 306385 275482 246839 287567 295231 255021
13225 255021 238895 240925 234813 266360 282215 270408 311393 319509 325500 265809 206055 146570
13213 146570 99208 77478 73273 80245 72710 96850 151385 124171 121276 97280 57640 69698
13201 69698 99275 126866 150207 163179 162337 146271 153056 134594 121621 135552 110814 128469
13189 128469 130788 132812 156810 176537 152632 170660 224863 235267 228191 208930 197006 179895
13177 179895 163506 179115 167731 184491 196672 196957 212216 232252 239314 196957 183520 178779
13165 178779 172681 159981 151249 103757 88464 103139 75389 87843 89064 109861 146202 143526
13153 143526 92895 87204 89746 78060 93674 60545 22755 21028 61132 54007 38894 14061
13141 14061 28595 53050 32844 41495 52515 54614 45295 62384 64208 65332 55474 46820 50817
13128 50817 43856 28554 25764 38732 49524 66069 66012 48361 54879 62426 49416 53388 56500
13115 56500 91635 85642 74051 44319 35067 66946 69479 51395 33302 48124 96935 81922
13103 81922 30709 6697 5684 20774 36366 30763 8416 23962 30439 27035 48572 85302
13091 85302 91172 89866 85371 51494 12032 18220 24678 13425 -2697 -16236 -5195 5207 4705
13078 4705 -5098 -20568 -40405 -56231 -36190 -4077 46577 49272 74171 69044 71616 44999 10352
13065 10352 -19941 5620 52910 42831 30053 45773 32056 23862 33296 65461 57045 39686
13053 39686 29287 61204 28557 25596 -8821 -15423 23627 43217 81006 86050 41066 19343
13041 19343 -5982 14539 29308 48747 101823 110425 81424 52626 33319 12042 256 -16902
13029 -16902 1650 10716 32090 -8583 -38278 -39406 -33357 -7715 7465 26106 29601 43616
13017 43616 42167 15824 -5155 12988 36128 22707 57679 76104 78943 65198 42769 50788
13005 50788 52038 32110 32363 28888 31292 35875 61282 68946 55017 8420 -3764 1803 16501
12992 16501 36543 30915 -5791 12665 40420 20720 17514 30477 -9810 -26144 -31600 -232
12980 -232 12404 51232 82254 53692 31643 47439 30964 20249 16805 24917 20774 24426 68206
12967 68206 72732 27555 18554 2723 9548 64092 106308 85217 43980 61639 114529 150614
12955 150614 164199 193694 208426 186442 233584 318894 416414 606461 881139 1249808 1619207
12944 1619207 1807358 1925240 2020173 1938045 1543778 1123841 817297 586785 478711 398990
12934 398990 326721 303043 274400 249228 205262 216832 208122 130309 85974 75316 108065 131797
12922 131797 102348 77995 56618 81850 128932 144301 154582 110890 96287 105319 83210 62241
12910 62241 80660 66324 63828 65462 51759 21258 22121 33315 28840 34862 27741 35674 22329
12897 22329 37446 54099 44814 64289 57742 57351 53582 47462 73028 71673 68917 31783 14334
12884 14334 29679 44106 56964 42746 31813 35206 16508 23447 17740 -1357 -5508 4497
12872 4497 8968 1687 1360 32892 18326 20891 15319 1958 -225 -36878 -31796 -24051 -44827 -37545
12858 -37545 8262 54580 8622 5346 32673 48867 51966 23020 -3538 -21476 -12458 25643
12846 25643 43691 24452 48280 87132 97161 50366 -14320 -11059 3968 6029 -9999 5111
12834 5111 -3514 -44027 -36893 -24759 -29546 -16356 -15729 21804 24103 51289 37372 14508 -10024
12821 -10024 -36540 -42282 -64689 -62752 -60234 799 18174 24158 16357 11023 23549 27172 53007
12808 53007 79094 39708 6549 2180 38162 8398 -62689 -59453 -51929 -63719 -10542 19612
12796 19612 30998 18208 -2282 -15779 -12146 16916 8162 6260 3133 -9032 24327 39595
12784 39595 12842 -5632 -9254 -19361 -27780 -22934 -14172 -25077 -21684 -37733 -76532 -72841 -22239
12771 -22239 -7635 -15482 -23526 -8495 -28699 -33496 -31524 -47981 -39150 -44032 -51730 -45336 -14748
12758 -14748 -34486 -59669 -49885 -22991 -26194 -46583 -35760 -27322 -45242 -54340 -35816 -30011 -7107
12745 -7107 10985 5390 -16753 -25483 -30449 -13342 18053 30624 55972 35178 5874 -7939
12733 -7939 20946 15053 1174 -2527 20675 11802 -11538 -9781 56184 68149 50854 48617 42131
12720 42131 57905 78630 51481 31984 33326 8102 -11663 -26697 -12067 -21441 -15178 -10021
12708 -10021 11293 25131 9925 22378 -10488 -40141 -14543 12177 43789 69484 51842 52141
12696 52141 59821 51929 22148 -16845 -3149 3578 8292 -2965 38187 32622 25233 -2719 3968
12683 3968 15001 2663 18145 7544 11551 19631 17949 8876 15750 56615 58261 37174 16728
12670 16728 -35461 -25977 -7388 10812 -17262 -32987 -17049 -12181 -14572 -6316 -22954 -4494
12658 -4494 23327 26280 16583 -5458 -8057 -7383 -22852 -37421 -30895 -21504 -33074 -53495 -48457
12645 -48457 -27598 17534 37995 17026 6313 32806 20973 16652 3503 6463 8721 10948
12633 10948 25715 17248 9038 -8669 -11480 -2658 12244 19319 12065 20644 9656 51441 58257
12620 58257 47347 66395 34864 -18172 -21905 -13817 18851 30320 38246 33911 57846 69653
12608 69653 49398 42225 14802 -10369 10964 8291 -3057 1880 11653 11755 27089 19772 22723
12595 22723 42100 50878 14786 18614 16384 6509 22734 541 -15622 406 -14301 -12335 -1181
12582 -1181 792 7294 37916 46118 -10019 -14318 -15861 -20470 12417 -3901 -14805 -32838 4363
12569 4363 14452 34478 40968 38679 -11457 -44184 -45960 -1730 5318 -21379 -26576 -27444 -9484
12556 -9484 27677 29403 -4786 -15684 4960 18133 3823 22259 37950 38540 31685 12246 10784
12543 10784 34140 18249 -12184 -37308 -55643 -43939 -29653 -40143 -18414 43517 53707 29906
12531 29906 2192 -8809 11932 16446 36266 50406 65785 77739 63135 13820 14034 34345
12519 34345 40844 28404 31465 -919 -31966 -57844 -31496 -4855 19346 26091 -8239 -36555
12507 -36555 -6773 32816 13412 38510 70947 84153 69671 53631 25728 5372 -16244 -33205
12495 -33205 23272 10863 -15253 -3359 1811 18318 43883 27834 22469 25668 8605 6755
12483 6755 39924 35729 -427 8846 26668 53733 72052 54643 51158 -6559 -39933 -44133 -48797
12470 -48797 -59192 -45591 -3681 40062 11299 -14514 -25939 -44846 -44505 -18047 28508 23856
12458 23856 41650 47603 47442 32911 -9551 -45443 -49799 -18337 27855 56969 80668 84452 50196
12445 50196 8318 1634 40642 43283 13896 -18797 -21810 -23150 -53810 -17590 14609 35615
12433 35615 16171 -38298 -57099 -53102 -3591 23235 28394 -6812 -22646 -22200 -11192 -3072 14447
12420 14447 47613 44998 -2960 -13478 5252 8793 -5610 -12272 -5095 22825 2535 -12934
12408 -12934 -16802 -17124 -22896 -62896 -63890 -32749 -21530 -2442 -8348 -33433 -21901 2898 -16437
12395 -16437 -22907 6179 -7813 -17389 -19072 -24693 -28021 -25652 -32550 -50469 -45654 -52004 -44799 -47375
12381 -47375 -26671 -4885 20347 4853 8953 17766 29222 35772 422 9641 36711 44527 11425
12368 11425 -9876 -7037 -8114 -15897 -27752 -27697 -18844 -27689 -14334 23158 52935 28882 1807
12355 1807 -19461 6933 460 -35308 -41881 -23010 -19058 -33440 -31218 -5704 -13624 -31104 -2439
12342 -2439 545 10788 128 15913 -5250 -27470 -28876 -42245 7210 -2694 -43575 -74216
12330 -74216 -63599 -34507 -39480 -72206 -56997 -43479 -31922 -40053 -27215 -20101 -13859 -21891 -31535
12317 -31535 -12623 -7537 -18615 -25569 -7037 4782 24692 19593 21202 27202 27836 16498 -10273
12304 -10273 -22741 -37992 -33109 -45215 -52435 -1908 49349 33963 -7027 3908 6439 -15483
12292 -15483 -5605 17886 14722 490 -16291 -40474 -28209 9621 20023 5754 20794 32056
12280 32056 14984 4555 6268 4574 -27867 -47053 -52667 -43463 -24931 -35252 -7478 2482 9371
12267 9371 -11901 -17424 -14163 -7574 3082 -4331 -20818 -26066 -16149 14885 36898 66327 48583
12254 48583 20511 -8471 847 -20143 -14748 -12266 -2992 17117 -6599 -42194 -40240 -10088 23612
12241 23612 -20666 -47064 -48251 -49804 -20901 4258 4183 -21823 -29216 -24686 -43824 -60090 -27426
12228 -27426 1081 27196 43465 28292 4541 -26155 -28496 -35451 -7774 20290 8372 -22456
12216 -22456 -25914 -26789 -9677 4404 -20845 -26714 -65070 -40188 -13880 -15858 -33827 -25054 -9067
12203 -9067 -3221 -5693 -8511 23943 37782 24888 -25032 -50459 -21666 -7833 8525 -13113
12191 -13113 -29089 -14953 21693 30955 57781 52893 23345 -7838 -36396 -34645 -57473 -66147
12179 -66147 -49143 -40960 -64584 -65102 -50234 -53975 -31142 -15156 -21591 -24591 -22016 13585 9211
12166 9211 -8347 -14987 -1013 27841 30019 -12925 -37581 -24339 -12463 -2245 -19819 -21510
12154 -21510 -13963 -44159 -7723 -19857 -27224 -28696 -18317 -4353 -25166 -47398 -19599 2593
12142 2593 28859 16051 -17687 -46234 -51527 -3297 -3538 -17034 -9700 13130 -7583 -19373 7868
12129 7868 -12896 -52072 -84875 -72544 -48907 -42441 19113 47022 29219 4732 21837 57106
12117 57106 43512 3486 -9528 -43730 -29978 -17722 -30954 -31760 12107 28496 44383 17813
12105 17813 10753 8260 3992 -3228 -11831 -27816 -51596 -56529 -12367 29736 37994 33097 12991
12092 12991 7570 54754 8833 -12302 5469 11500 -7204 -4094 6947 -7636 -19874 -2105
12080 -2105 19816 7892 -6632 -22974 -19870 -3781 13093 9120 -15862 -3667 -60 37372
12068 37372 66675 68522 58478 27644 29062 20183 15759 24316 3279 20568 28855 36608 49799
12055 49799 53201 58815 26761 16253 37853 43503 31328 21910 34457 55215 22986 18600 14932
12042 14932 22726 22073 -10007 14637 45482 48982 24234 10873 14500 -6971 -52245 -48859 -29201
12029 -29201 -5029 13243 14907 2620 11628 3374 19058 18080 18844 7882 32917 29954 23389
12016 23389 -9640 -23449 -44458 -28500 -14648 18455 18692 -19612 -48912 -17689 -27165 -32276
12004 -32276 -36387 -17815 -10799 -27978 3250 6210 -26583 -30870 -12248 -36034 -20922 10198
11992 10198 39788 29027 51375 42720 3703 725 -14944 -31100 -37065 -35732 -51432 -47546 -39957
11979 -39957 -21774 -32423 -14641 -19616 -26033 14128 17754 3338 -6412 -12164 -56355 -53064 -40239
11966 -40239 -13645 8760 18798 8485 5 6062 15642 10572 863 -4130 -16543 -5158 18957
11953 18957 23987 10611 -26586 -20748 -4360 -22371 -23194 1664 26251 -1467 -4651 -11896 -10488
11940 -10488 3612 19688 14229 -40249 -64343 -64318 -31580 -18967 479 35694 69833 53255
11928 53255 48721 45367 62505 36283 24317 33927 30298 30294 -4971 -23325 -11446 21265 41152
11915 41152 3544 -21903 -59531 -56094 -39609 -34107 -29877 -8010 14127 15038 1885 7977 6541
11902 6541 -15660 13152 28330 35677 34706 11218 -1156 3781 765 13451 20935 20255 -26990
11889 -26990 -40643 -42069 -19737 -40205 -43150 3814 57877 63912 33792 -8100 -13780 -7020 -11640
11876 -11640 -31106 -53760 -73753 -71131 -42704 -10870 -4399 8617 45554 53046 19091 24561
11864 24561 35198 -3697 -18750 -8565 -43289 -47137 -52745 -10664 -5046 28864 37391 12053
11852 12053 27882 42912 14134 -571 14837 15342 22506 37785 26885 16333 34271 69065
11840 69065 33061 16847 -9649 -26541 -30287 -18466 975 -15463 -16877 -3731 -28664 -39008
11828 -39008 -41428 -48332 -69266 -60635 -60476 -78861 -102601 -129591 -80239 -63489 -36629 -25329 -34273
11815 -34273 -14937 -25682 -24760 -67856 -90525 -42786 -7010 -460 -26327 -63183 -42571 -31978
11803 -31978 -17163 10927 21428 18056 36881 64064 32447 -27643 -35923 -19149 -8852 7355
11791 7355 5268 2757 -8690 -26543 -48494 -26625 150 11017 10843 -1019 8204 13518 1777
11778 1777 2037 8826 2370 -226 17677 1637 9295 -2557 66964 77992 44296 30459 -6165
11765 -6165 -9887 4377 38624 47878 39982 33454 20230 8513 -9641 -20434 -28942 6664 43412
11752 43412 19708 3554 31926 15588 -14918 -23813 -14321 -8191 9121 -19792 -32767 14874
11740 14874 26905 18236 28074 16916 38894 40412 57852 48164 65245 61500 36545 24447 -2740
11727 -2740 -33301 -30688 -5120 11366 12686 33082 21558 39213 51851 23251 2755 46616
11715 46616 79121 47030 7776 -39987 -55824 -33684 -18036 -38543 -25827 -12470 -20288 -27288
11703 -27288 -26204 34029 59587 34428 18141 8811 -24634 -18945 -23426 -44203 -50050 -28443 -42582
11690 -42582 -50471 -14921 -7868 -1891 -49038 -69820 -71841 -75914 -74240 -47184 -32530 -30437 -34301
11677 -34301 -55215 -57574 -73744 -69272 -56897 -38982 1590 -3033 -1532 -29834 -19314 31214
11665 31214 48835 53755 41929 36860 57971 61178 29690 -4327 -8621 -14705 6533 15819 5447
11652 5447 25767 3518 -20127 -14680 25618 43208 15396 -22627 -15279 -11900 -13924 30628 20974
11639 20974 1847 -9973 -12228 1341 51177 52135 6923 -39205 -28014 -33889 -59394 -48938
11627 -48938 -20997 26945 40360 6408 -8337 -7553 -2638 3781 -8498 12989 20889 -3260 -14375
11614 -14375 -29798 19479 31614 32122 42269 40445 14141 -2704 18058 16548 -639 -16899
11602 -16899 -21733 -21171 -51513 -41180 -50140 -29638 -19870 -39944 -30491 5592 42835 11154 23537
11589 23537 12340 21522 31281 29173 9277 4541 -9568 3956 26022 12802 5400 -11579 -27471
11576 -27471 -35152 -27693 -50746 -54086 -20584 -21844 -14185 -5559 -12935 10151 13871 -1668 -7321
11563 -7321 -22998 -30508 -15432 -20161 -6536 1982 -266 -29025 -51470 -27970 -6681 -329 11293
11550 11293 16163 -17005 -39313 -14527 -12168 -29443 -26263 -19328 -26245 -22234 -46003 -76363 -73042
11537 -73042 -39686 -5288 6873 3354 -16069 -24538 6558 17927 43025 43269 47277 80742 89790
11524 89790 55397 21669 -10476 -3681 12925 15608 -29604 -56259 -78757 -59089 -10987 -7625
11512 -7625 -6023 -6280 12484 -9261 -9970 -17117 2797 -4057 -29041 -64976 -66831 -43386 -21016
11499 -21016 -6501 -8205 -39242 -59182 -4781 33661 2304 -17654 -27251 -44225 -33832 -17253
11487 -17253 21688 5562 -11105 -50182 -102346 -111089 -84136 -32459 -1059 11854 18640 21439
11475 21439 21574 14959 2059 -24509 -12658 2059 12278 32078 18399 -11327 -10484 -24602 10922
11462 10922 -821 -42559 -36001 -35545 -51752 -46353 -46265 -46004 5513 37375 53165 18198 22360 12826
11448 12826 2022 -5048 11914 -2672 -35411 -49175 -35687 -30422 -23791 -784 -27692 -46251
11436 -46251 -53570 -52366 -31305 -17580 502 24469 2431 11678 -2098 -57030 -43934 -8685
11424 -8685 14796 13563 21446 -10296 -59996 -29982 31987 19211 24626 39994 16884 -9346
11412 -9346 -5837 11795 32940 24302 3032 -19913 -11822 1831 6295 19527 11600 -23209 -115
11399 -115 -12857 -57847 -26722 16999 25905 27063 18069 8458 -2789 -12895 -33556 -34708 -15667
11386 -15667 17303 7240 1310 42389 41680 15504 16041 40232 25192 -8175 -19271 28928 27309
11373 27309 15101 18353 36460 16462 16423 10784 -15577 -8702 -20114 -22177 -45931 -29356 5751
11360 5751 16158 -5532 -30287 -26357 1498 -18550 -10680 -7048 14980 8928 -24188 -11942 -4247
11347 -4247 2097 31607 42969 22820 -13171 -40736 -15625 -15954 -21387 -54877 -63434 -59465 -18372
11334 -18372 -1699 -1553 -4344 33927 34177 11357 7103 -14436 382 5827 25268 19338 -3550
11321 -3550 -37831 -37672 -33471 -33114 -11573 1420 44934 17047 -16649 -33246 -8735 -381 10435
11308 10435 6741 15161 37824 54369 79659 95285 102304 115888 124107 89253 84969 82616 74473
11295 74473 81640 32993 -17589 -8551 -6569 35841 55661 51385 53883 24430 -2875 -45128 -53347
11282 -53347 -67955 -58921 -38326 -5772 -672 34814 56788 37623 10539 -11626 2863 19396
11270 19396 8619 -10496 -22642 -28644 17575 26735 45433 58961 80798 18892 -14006 25217
11258 25217 27003 11578 -6313 -10165 17969 37276 14232 5811 -11240 -21319 -24720 5042
11246 5042 30559 21349 -9097 -18065 -22441 -223 45528 23063 -9903 26941 42487 34986 22562
11233 22562 9361 21142 28580 7938 1136 19718 34423 27057 8319 -18886 -14129 14281
11221 14281 25244 -12580 -36451 -21696 -24469 -14713 29310 21195 -4691 -16172 7548 7628 5943
11208 5943 4567 4369 2229 52870 59682 50003 48914 37082 19683 24662 77334 90283 55590
11195 55590 50257 46996 -7373 -33007 -33880 -19802 -8806 17329 31819 12318 6720 34456 13018
11182 13018 -37981 -45741 -11407 16160 45722 51676 46634 19801 731 -13975 -16503 -2444
11170 -2444 33979 25107 -1903 -9325 -40827 -40438 -35477 -13837 18826 -5372 -732 27594 36013
11157 36013 22982 37814 8081 -27994 -6550 43254 25231 -19971 -34415 -10519 25099 55627
11145 55627 34819 27123 33413 31203 30541 52474 13356 7863 -5427 26278 23163 37236 52568
11132 52568 69336 73554 69359 82757 57246 52628 61073 58555 27182 10049 -30418 -21813 -40237
11119 -40237 -36971 -33568 8380 14581 29488 66527 75751 40471 27250 25595 33700 36742 6153
11106 6153 1853 10610 30379 37095 7638 1692 14706 16018 -19726 -12136 18968 15788 10846
11093 10846 -3718 26657 49310 41294 30735 16195 42285 91802 114510 99703 82389 97640
11081 97640 95203 81602 70497 77755 80467 91573 92289 56385 31524 28810 30049 9080 -26511
11068 -26511 -43886 -13699 15939 43454 11811 7032 27053 31916 33667 43500 30061 -6210
11056 -6210 -26479 -16703 -12319 42612 63027 48548 25959 46696 72389 84870 64367 39159
11044 39159 15552 8515 6884 48930 65537 62280 30178 58667 67472 48454 49016 14720 5250
11031 5250 31712 42518 67910 51830 12961 13096 51198 59793 31999 29634 56091 75029 73526
11018 73526 69607 23203 31921 41638 42105 39298 15900 43147 27505 17287 -19380 -22094 1350
11005 1350 17025 24179 11350 14671 38491 74339 72899 43444 19370 34722 74006 68427 8215
10992 8215 -13179 11791 19775 3921 -4374 1606 -3624 312 16186 26350 22954 46207 32872
10979 32872 31675 33805 15266 -7477 -16453 -5198 -1674 10835 18938 43237 37935 48225 17874
10966 17874 2272 24100 28306 -8210 -21407 -22764 -820 22255 26534 6030 -521 8121 45033
10953 45033 53102 26213 30121 39209 38391 42526 49480 43401 -4122 -26318 -30928 13482 37801
10940 37801 56320 64832 19565 -21087 -5318 15920 30017 38806 61621 47909 15382 6630
10928 6630 29776 46462 16592 3961 42762 30681 37293 55169 61556 34596 26395 10405
10916 10405 -18543 -39449 -26252 20928 47648 61437 38220 23200 -1585 17672 33763 47373
10904 47373 45623 35686 33084 13560 16060 32349 46736 74478 52699 36016 35502 32468 39438
10891 39438 36021 47596 13292 1654 21260 49373 49054 13963 22185 42296 32544 24815 23240
10878 23240 15302 13496 5731 -17786 3282 52764 57825 33088 22026 27707 5114 31752 53347
10865 53347 65016 59848 15781 18122 3311 835 14515 29603 50238 23639 3598 20852
10853 20852 44476 48079 49236 50048 57139 55788 63991 36911 36906 16481 -41451 -48649 -49568 -35881
10839 -35881 -19520 -8452 8708 25541 53262 75700 53631 57618 70850 82154 91065 69332
10827 69332 67481 83139 30345 -17077 5644 28493 23556 38278 37173 57751 69717 51535
10815 51535 35943 49186 60884 30930 39723 52644 33086 30248 18073 7742 14124 23111
10803 23111 52973 56926 80465 63991 39774 31434 31095 9869 20075 14120 63822 105753 93284
10790 93284 76566 103200 72078 78921 89075 74218 71938 80106 55791 66789 44895 58951
10778 58951 77691 69782 79106 80904 52952 47799 40948 35466 55603 31084 29564 49803 44119
10765 44119 16374 34717 59156 45562 49879 49380 39876 31434 33464 57617 65004 80482 64539
10752 64539 64127 58397 20322 22403 51464 65018 88361 88320 92519 93828 89929 109932 94733 101303
10738 101303 138045 129196 104738 73337 60109 65669 67306 66010 82031 70594 79071 69355 27849
10725 27849 40170 51844 52756 92566 78128 92095 89153 79296 85967 113961 119770 111170 73005
10712 73005 69424 97053 115202 99469 92436 114303 130308 132283 134991 90571 103628 152997
10700 152997 145177 146508 166455 154676 136641 119452 115476 115883 134517 141590 137651 136886 168851
10687 168851 183524 172720 150387 167191 189027 197617 169076 151797 121667 90062 101952 154335
10675 154335 181698 151581 146750 139765 139965 163360 208324 226784 241496 227209 217593 205254
10663 205254 186629 199600 200230 186321 214559 214393 242775 276384 280987 286970 277787 296994 273765
10650 273765 280955 262439 217338 257249 320068 345451 382608 392590 367850 375206 332628 279310
10638 279310 278997 292336 315253 346788 321917 331332 352712 345891 364366 377755 395806 433041
10626 433041 490626 494854 491120 507973 517801 529778 575814 609291 626886 597146 584420 639344
10614 639344 713522 761881 803997 821288 832194 853903 925453 986709 1050753 1112420 1128679
10603 1128679 1162182 1218498 1306929 1405181 1507993 1597727 1695008 1787517 1949394 2082681 2196835
10592 2196835 2367032 2566836 2743835 2995292 3313774 3638609 3973847 4346649 4739002
10583 4739002 5124955 5582380 6063380 6563644 7101082 7581091 8121143 8721536 9292548
10574 9292548 9777442 10231666 10641207 10981578 11241198 11432332 11601188 11654523 11652940 11651774
10564 11651774 11576187 11531623 11497615 11458607 11426787 11400155 11441141 11535566 11645681 11792678 11984505
10553 11984505 12230273 12563589 12988154 13458612 14017516 14691386 15451129 16274248 17208428
10544 17208428 18261789 19431105 20685474 21940706 23201893 24405412 25525331 26422121
10536 26422121 27021305 27322948 27316618 27001430 26373464 25493664 24471856 23320408 22132087
10527 22132087 20959326 19846425 18822826 17857292 16958373 16185255 15503515 14886412 14318882
10518 14318882 13825905 13412143 13060122 12795910 12616941 12456711 12361713 12292170 12244923 12239823
10508 12239823 12274998 12263568 12298091 12346977 12396332 12431692 12438935 12378818 12257148 12117879 11913606
10497 11913606 11628674 11258212 10874034 10420873 9900281 9391854 8869758 8327438 7814667
10488 7814667 7382510 6969410 6533940 6106899 5713490 5392106 5087943 4780493 4536121
10479 4536121 4287767 4066750 3820467 3574500 3396603 3234795 3097400 2966502 2822746
10470 2822746 2695412 2571406 2483802 2374148 2246176 2131443 2069911 2032944 1956786 1874990
10460 1874990 1776250 1724523 1640199 1571748 1491624 1463178 1454363 1365402 1311230 1263046 1199164
10449 1199164 1171808 1100192 1079132 1084912 1052322 1005617 983471 1000165 968523 900586 853321
10438 853321 843815 832936 790389 768143 748167 750195 730678 660162 648812 622568 622921 640251
10426 640251 614306 586188 535713 493135 482881 490972 470446 451763 429386 417607 418938 423056
10414 423056 423480 411836 384057 355954 344756 349922 345112 307106 298496 298638 268663 244181 234076
10401 234076 250806 240879 218208 198644 204579 201265 237924 241253 237675 216726 165210 146984
10389 146984 160503 169062 178498 169420 193755 194138 185996 172967 167086 181215 173037 161336 179604
10376 179604 167062 131453 131901 157050 183510 213545 180973 173545 186137 219293 237217 214053
10364 214053 172954 146497 112742 85327 89709 87112 99073 107277 108656 121862 111464 70409
10352 70409 63184 82135 100516 88001 86503 112581 75883 77731 105244 114815 123843 125230 151198
10339 151198 146531 135346 137577 124317 142706 138034 137032 132418 126965 109235 107795 84869 89798
10326 89798 77609 49454 58588 36177 32344 40724 39134 60106 77818 50492 13557 30419
10314 30419 68499 70271 75919 104288 108248 100609 99815 110858 105927 100486 101919 83458 47073
10301 47073 35288 64106 84842 102107 117955 112587 70212 44821 14622 3818 24892 28102
10289 28102 53686 63562 35777 36092 91310 124325 132237 89408 58956 84137 76190 75747 89432
10276 89432 119057 111193 64460 42595 83485 81749 55146 67680 64524 43294 16146 25889
10264 25889 22418 5100 -11017 -13713 -9901 20049 21680 27271 41559 24755 22213 16769 9150
10251 9150 33315 38900 73459 74733 42431 51823 38736 3365 13526 18739 13168 12898 28531
10238 28531 51311 41147 36486 39626 45817 57944 53381 29132 -1021 1619 17236 22966 61053
10225 61053 68665 97937 82311 43919 15911 3658 19964 39203 54867 46934 55083 107149
10213 107149 104010 70906 71026 60302 33557 25491 54603 62638 80272 92781 52027 17601
10201 17601 8124 14331 24261 42117 37527 49527 33532 14317 -2278 4651 16763 10218 10752
10188 10752 7067 24598 24099 5160 19143 47426 21601 15225 24873 -7152 -32887 -40535 -38515
10175 -38515 -20474 5206 11118 17515 49523 35855 29038 34711 42678 49229 58167 50056 43605
10162 43605 7598 15348 -2611 13582 9592 17868 8407 -6957 -38713 -18722 -2480 6530 35761
10149 35761 47388 42409 39085 9447 -7358 -22800 -41366 -21059 17844 14225 -6351 8626
10137 8626 21339 24860 -11194 -2654 24500 20264 50628 60208 34904 32145 5301 18402 18244
10124 18244 -13525 -3810 14782 31128 29250 23609 6133 34934 49030 61304 62348 42504
10112 42504 41422 8836 -41773 -39326 9309 -10673 -16885 -1867 20789 20442 11551 10771 4860
10099 4860 -3698 15250 17243 33246 37896 10620 10653 44736 47619 23097 13992 26447 -15783
10086 -15783 -42314 -48769 -56261 -32487 -39298 -10734 35954 21884 4304 11201 7295 -7126 -26236
10073 -26236 -7458 6402 -11041 -38249 -36059 -19821 11221 25894 18594 13721 20465 31233
10061 31233 58488 48175 39867 40926 51861 54078 48513 19037 57890 68162 111451 119269 115957
10048 115957 122436 146410 167277 198026 229459 254223 298456 370132 449175 574473 761190
10037 761190 1151461 1800846 2589345 3039066 3241613 3429940 3465912 2910577 1969719 1318164
10027 1318164 954141 770126 660558 597906 547401 449372 372722 336397 327456 311006 291254
10016 291254 292498 269598 238236 215365 229446 258648 244259 261823 263486 227031 191159 138668
10004 138668 128629 93603 59553 41596 68905 88384 88200 102357 113336 124987 139635 102086
9992 102086 57283 82243 102149 105806 92211 86976 78115 74958 59411 74685 64542 26888
9980 26888 26104 20373 16734 9704 43507 63607 63343 81914 75959 49379 48086 68525 48794 8326
9966 8326 12108 -761 21071 21829 -12435 -4783 43049 97275 69052 51277 25871 22207 34042
9953 34042 26974 31894 30076 56079 65616 58171 53420 68599 87314 59379 33057 30343 33699
9940 33699 32790 15611 13756 2695 935 -2268 -4053 41139 23275 -29575 -19760 -15344 -13290 21228
9926 21228 6860 8427 40470 24545 -13759 -72919 -65816 -20669 -6115 -2173 -11380 -17042 -32055
9913 -32055 6382 36467 35829 8774 -16675 734 -9075 -4640 -23954 -12982 -9374 7381 -9596
9900 -9596 -35746 -40785 -44621 -46265 -18497 -7575 12689 -4346 -39399 -59471 -72408 -36777 -17812
9887 -17812 7407 31075 51709 74398 45098 41337 30974 30136 9909 -16556 -15868 -37605 10232
9874 10232 63322 69342 37074 21060 7199 -15871 -46491 -35345 -13012 -743 -1017 7642 1306
9861 1306 3462 14278 14825 -2929 -27295 8718 25377 20139 3658 28854 24197 39712 40441
9848 40441 34747 12248 47631 78924 46076 -1383 -16365 9918 46957 72917 51293 37535
9836 37535 36898 22885 29293 23291 27985 63890 87984 88422 76344 84324 107126 103570 87089 66072
9822 66072 68128 40316 56302 43665 32630 31259 35191 20840 -24636 -65774 -59262 -17751 -35088
9809 -35088 -22935 -4610 -28784 -68 25904 29292 10194 20954 31634 49729 48582 33014
9797 33014 693 -12585 -26446 -8536 19458 48679 49012 2134 11006 36441 38448 14122 15467
9784 15467 40102 20482 -17174 -25822 -31408 -38387 -22892 -16317 11303 12954 -19420 -18840 7509
9771 7509 6787 4404 227 -10227 15183 41838 45329 50904 15996 -4796 1794 35698 56412
9758 56412 68495 55792 8074 -12209 -25421 -16562 -30595 -21381 18487 9328 -12161 -33759
9746 -33759 -11272 -15254 -10099 31063 40680 15627 18659 17660 -4061 -25271 17756 -2667 -22491
9733 -22491 -44757 -45674 -40692 -11760 55452 70398 72072 64093 51405 40567 46508 38960 23623
9720 23623 36334 55085 40426 42547 35921 11699 -1907 -18985 -4784 20954 40893 65353
9708 65353 68581 53124 58189 44534 29572 12994 22503 41172 55469 48447 63829 9381 -6549
9695 -6549 63 3951 -757 37970 13147 -8429 20858 77939 51951 12676 -8755 -56717 -79070
9682 -79070 -60538 -21459 31689 39102 32708 28377 49909 95015 43643 -18911 -31 7926 5751
9669 5751 -1717 19827 63394 55878 7745 13749 13904 5734 -21630 -56787 -37123 -12221 -1944
9656 -1944 41972 61144 63916 40897 25687 17685 49422 69326 11926 -11523 -8226 3303 -18069
9643 -18069 -61647 -91265 -91222 -75749 -53251 1930 -6054 -12763 27681 48573 31673 31758 63222
9630 63222 50632 54540 65737 79202 58649 51191 54261 77849 68149 25881 13450 6138 45545
9617 45545 67618 79736 48476 30184 23549 21160 48683 67035 34497 11161 12805 16305 23335
9604 23335 50209 32820 422 4649 46926 70729 51174 43334 31145 24897 45077 44488 31218
9591 31218 4649 -27268 -41803 -20996 15256 18391 1264 1971 23152 9564 -14906 27515
9579 27515 36619 67210 92371 92715 55834 30545 9316 -908 -2919 7658 13059 29922 36303
9566 36303 25468 20502 37589 22828 23853 75638 89019 37589 7210 19488 63849 96920
9554 96920 98025 78997 39333 46414 51459 52964 49212 71717 87193 130441 170151 179050 135774
9541 135774 88081 61522 47084 65589 91397 103551 127068 130669 101357 113689 147617 132570
9529 132570 122408 78975 73170 93645 97805 110244 112090 88549 112678 120433 120210 127953 136604
9516 136604 131125 143143 161209 171930 184461 136238 98542 77550 102984 128601 122431 115363
9504 115363 119828 93184 88841 111927 110188 128244 138703 146003 155066 158428 173767 196230 204294
9491 204294 193844 197340 191951 192855 206683 205641 187317 172450 176842 180002 191633 197227 176302
9478 176302 237392 297191 335782 302303 270187 241992 251673 256400 252629 260716 269563 262666 295658
9465 295658 309803 287911 332525 347470 336170 311018 332525 373193 364691 372165 375179 402515
9453 402515 440504 476088 452673 424868 460944 517809 540875 573638 593044 610455 632376 709478
9441 709478 795233 828330 850376 899287 928649 979739 1024915 1081114 1153109 1252305 1341176 1471022
9429 1471022 1605724 1715083 1868648 1996169 2133884 2299358 2513707 2761761 2990058 3242940
9419 3242940 3545617 3857717 4215415 4661022 5175782 5687860 6249146 6854850 7475509 8028753
9409 8028753 8488085 8874858 9158410 9323854 9330768 9148979 8851145 8462859 7990596 7477005
9399 7477005 6923988 6381834 5926326 5515572 5075614 4611324 4245697 3980979 3704474 3444349
9389 3444349 3215503 3004584 2845403 2682521 2503282 2351472 2197157 2069989 1937317 1810015
9379 1810015 1707244 1640283 1553713 1478489 1407963 1335190 1273092 1250668 1187552 1155761 1122921
9368 1122921 1056261 1017937 991664 919552 885575 841217 827408 773211 764796 764780 739915 683376
9356 683376 642208 623247 628057 593868 563122 550399 524766 512680 520218 547769 539160 502405
9344 502405 502618 488366 468463 439775 412862 369622 384164 362441 359033 358858 318298 313057 310470
9331 310470 305018 304357 322023 282918 242775 254443 258933 238478 214333 230741 214799 210451 236414
9318 236414 221876 246872 217223 195154 173945 164997 145958 160083 171066 181440 156736 116724
9306 116724 112300 110277 108377 103163 95358 79983 82530 89407 90435 52084 21006 -928 22026
9293 22026 63878 60641 79746 121568 124656 117593 88224 81637 73825 68171 78460 82822 76324
9280 76324 55524 79561 81308 48698 24896 66953 62934 43772 34983 36318 35010 11540 -8055
9267 -8055 -4930 5802 14585 19963 109 7084 5964 -18135 -39532 -24001 4921 23963 4845
9254 4845 2761 7482 22662 33504 72235 85512 86371 87928 86676 63230 35618 20348 34366
9241 34366 59227 28169 36893 44193 29056 59610 64763 58788 36797 39468 41309 25221 -17764
9228 -17764 -58096 -79429 -34988 -14721 8153 -7244 -4881 26883 63106 66720 75896 71739 34915
9215 34915 55420 46235 39773 41403 36941 29738 18054 28930 18769 11679 20347 18423 -673
9202 -673 12562 35010 39168 32193 55193 48121 25496 38116 40209 13296 -10230 7930 2136
9189 2136 -25487 -32893 -31847 -33769 -23801 9323 33171 10034 24468 7971 -3934 -3992 17606
9176 17606 27438 22727 27291 18026 13124 21128 36644 26351 14275 8330 14707 31974 37219 29404
9162 29404 39132 29807 25359 19998 -9999 -14253 12517 41813 47562 47089 40503 31786 25270 -7174
9148 -7174 -30705 -19122 5701 52310 61247 72475 62586 44631 17781 12723 38985 18816 6649
9135 6649 30429 57364 74980 62666 42433 13035 4659 20083 -2602 -23423 11472 65258
9123 65258 50132 39386 32500 34461 15476 29517 69658 88716 76946 41493 -16700 -9465
9111 -9465 -17286 -10135 -11570 -12978 9965 527 2839 42584 45775 33777 23688 18835 20626 32136
9097 32136 19261 -19939 -12751 12471 3802 4278 -17812 -19689 -22862 -21069 -33939 -25117 17175
9084 17175 15416 -17621 -21185 -4292 37178 44848 56372 39938 17564 22954 -17599 -22887 -1679
9071 -1679 18045 55143 51718 80765 60490 22932 -8587 -2417 -6863 12950 30377 29842 108
9058 108 7372 -15552 -35417 -36553 -9797 18766 50324 56090 36663 14780 16442 27405 47696
9045 47696 20258 11498 53894 43835 -4251 -47868 -45432 -11738 -15325 -20278 -21948 -27361 -4458
9032 -4458 -3031 10551 24083 50964 50385 14402 4016 24640 34658 7263 -21870 -37045 -60077
9019 -60077 -21113 -347 -26751 -22195 -35310 -42420 -28087 -14192 21869 20995 13590 13316 46705
9006 46705 43185 38395 51966 13796 -1720 17728 27641 10684 11058 27700 12215 2724 3857
8993 3857 -27865 -54640 -43855 -52929 -63638 -76068 -57085 -19041 1861 -8751 -447 21413
8981 21413 34824 790 -27250 -21704 -5236 28502 50152 47504 34831 1844 -11858 -11903 532
8968 532 39307 60661 41230 7268 -26976 -29091 -21847 -12715 5701 30465 31500 27496 11846
8955 11846 967 15952 -1353 -34584 -12049 13846 28071 19315 8667 7919 9838 12001 30218
8942 30218 38813 21243 40465 39611 17005 14992 1073 1067 -33096 -43980 -29617 -40618 -24085
8929 -24085 4944 4366 -13063 -2944 19837 25564 10220 7284 30652 21395 4811 17765 -2407
8916 -2407 -28634 -16900 -16853 -32417 -3013 1635 46809 44399 -6403 -23340 -27545 -10656 -8604
8903 -8604 1253 17426 9082 18778 32732 17853 5513 24078 24103 29473 -3263 -35852 -2538
8890 -2538 38755 44696 8136 6885 35200 57399 22248 24544 906 -10589 -10366 11085 -12904
8877 -12904 -38743 -39170 -16862 5871 -4982 1327 -225 2907 21634 26416 2398 -19695 -22530
8864 -22530 -6637 14520 43161 61223 53518 45253 46968 58438 52854 58674 61160 24793 16004
8851 16004 -3272 17550 47275 49929 40492 -1143 -32206 -41836 -36988 -45855 -10238 -609 -14071
8838 -14071 -2649 20682 25748 -677 -1402 596 -31837 -68611 -52486 -33327 -12672 6287 23705
8825 23705 18755 -1784 -30049 -40196 -55680 -23701 8507 -13796 -12077 20338 51779 61951
8813 61951 53176 6267 -14730 -4564 -3353 19366 -2409 -14358 22392 44003 41094 40493 52269
8800 52269 41689 50430 41531 33935 45119 14370 -18962 -22634 -17123 10102 18524 14859 22185
8787 22185 29180 8362 -24108 -9671 20170 43358 31709 37020 20052 27163 36187 3389 -37507
8774 -37507 -17306 -34465 -33990 -17273 -25165 -4931 36515 41284 14563 2418 -18522 -14574 9300
8761 9300 36677 53602 57172 67374 52344 53751 43494 77342 78243 80911 46975 13940 -5591
8748 -5591 10620 18848 19897 9495 50364 31405 10637 3014 4955 3435 -28802 -57555 -38308
8735 -38308 -32004 -30764 -3820 -29564 -2476 -1987 -13489 -15148 -11999 -24204 -20097 7154 -11081
8722 -11081 19806 19005 20529 29955 30938 48132 75382 24041 5582 22799 16269 -17585 -20680
8709 -20680 -1755 530 17465 27786 35667 67985 106881 128733 91977 49370 35601 50582
8697 50582 69601 53947 39603 20952 10678 43365 49592 50675 30937 2493 -1163 -9392 -7685
8684 -7685 4960 50708 85979 46023 27783 56054 45851 15673 -505 20893 37381 31582
8672 31582 23348 41830 56500 73457 101008 105217 85964 63523 42616 70843 79626 64288
8660 64288 40416 43018 71320 88785 54926 48482 36528 11497 4510 9247 14073 22543 19904
8647 19904 -14257 14762 64597 90976 86457 96609 76997 64056 77039 103310 90426 51307
8635 51307 39904 72579 94481 92871 98457 105368 117873 94758 67706 79549 70226 95930 71879
8622 71879 42319 37727 39222 42921 73587 73528 46812 51623 70763 89293 86774 72530 21657
8609 21657 35082 44827 58520 64623 18052 34836 62850 95906 84772 96361 161362 205426
8597 205426 162490 139511 173887 191092 203278 224320 258762 281024 314046 348664 395315 455520
8585 455520 510229 529031 505341 484064 477408 450870 385378 341674 350813 310604 244153 239072
8573 239072 244540 211503 163577 151333 148507 119109 113215 133454 176938 211715 189703 153911
8561 153911 138796 150629 113220 75148 70629 121550 151002 162491 144622 141158 122952 118999
8549 118999 107487 91177 81242 59785 74845 74364 69993 45862 48347 24629 37207 21009 62823
8536 62823 87654 106544 83129 55634 45952 33526 51417 83022 73338 73549 88296 76208 89511
8523 89511 73435 65916 48099 46969 37152 12743 35625 57921 18676 29811 57866 64168 74262
8510 74262 52169 67401 55256 38664 51839 40769 32919 34806 56059 38425 28050 42442
8498 42442 70628 83587 77484 47176 37383 48043 44478 58329 86164 78976 77442 68211 41338
8485 41338 14930 -3614 30686 50424 65583 43526 -9074 -11856 -3759 9850 24386 28334
8473 28334 15108 64443 77762 92775 113983 95022 62290 34087 11403 6983 15573 22446
8461 22446 27790 21644 3621 -34102 -22013 18825 34803 21723 1461 -23970 -19233 -19076 -22210
8448 -22210 -17589 -13481 -17293 1275 -8476 1230 33412 28537 29851 25582 40302 24843 17407 3342
8434 3342 6201 22301 17699 8381 2768 21247 42064 34735 3242 17198 50415 76396 63313
8421 63313 3328 -38123 -29499 -18276 8353 24263 244 -43553 -45414 -25090 -45857 -51258
8409 -51258 -47281 -23595 11077 6009 6935 5382 -28211 -49064 -43616 -19662 -12994 -16354 -34115
8396 -34115 -51620 -43607 -14895 -1541 -7755 -18674 -22569 -14111 -17789 13634 48540 74826 53457
8383 53457 30910 14572 1821 14134 26902 54281 61582 25640 -33207 -43724 -39383 -45801
8371 -45801 -46127 -56373 -35969 -36459 -41575 -57200 -39958 -12653 10352 -6739 -47651 -50601 -41525
8358 -41525 -30040 -49854 -45151 -45617 -35095 -13966 3687 10610 36261 -3512 -1057 30879 57147
8345 57147 47086 46301 4288 -11950 -25754 -16724 4297 20578 17773 -15704 -32681 -24422 -43894
8332 -43894 -54684 -34876 -18020 842 15186 -19902 -54750 -58236 -45384 -26851 -21867 -51885
8320 -51885 -48414 -62283 -31295 -8490 11489 40561 40936 34019 40148 12171 -13335 -18002 -27477
8307 -27477 -18675 -1785 -32389 13054 18113 7298 -7640 -19770 1362 16419 32702 45340
8295 45340 -4177 -29979 -19549 -6011 -15965 -31051 -5740 -5122 -15304 10306 29226 17310
8283 17310 4972 -14917 20724 77941 82707 63048 63465 44228 36121 31134 3716 10723 30415
8270 30415 25094 71433 75218 35101 -2615 -13034 1138 24216 29524 9512 -28897 -47896
8258 -47896 -35218 16182 12906 19494 33491 18500 16561 17104 -20342 -29462 20145 18532 -6409
8245 -6409 7686 -27142 -27697 -32890 -16601 -14578 9168 20244 19697 2620 -19446 -21404 -11970 9906
8231 9906 27582 20525 13903 35799 39818 6985 -45408 -41160 -28219 -24032 -10605 -8840 6421
8218 6421 40391 36284 -4785 26032 16741 21977 14959 45080 37981 34901 11351 -21605 -13085
8205 -13085 -670 -3546 21867 31723 31439 6321 9913 7830 -767 7293 -71 4816 16932 -13461
8191 -13461 -3988 7915 -3538 -46243 -33314 -45219 -29612 9543 11569 17868 53102 33525
8179 33525 51452 12453 6857 -17295 10573 16278 -11522 -36413 -26786 -10661 -16965 -14648 5201
8166 5201 1102 -27703 -39790 -9507 -2857 -30458 -33812 -8912 13094 -12325 5704 9537 18224
8153 18224 -6370 -5573 5993 20305 6466 -13416 -24068 -28120 -22964 -15831 -9338 20841 51483
8140 51483 38088 60188 79897 76320 22220 992 27970 44459 -2322 -16203 423 -13871
8128 -13871 -27004 -13404 28924 34325 21969 9087 -10135 -2878 -6077 -7440 1493 -10054 -17440
8115 -17440 -5271 14544 30287 39314 58387 26296 -10029 -30201 -25734 -22015 -12518 -3845 -5765
8102 -5765 11145 45502 48300 24373 9489 21898 19885 17734 10826 210 -7111 -11233 6258
8089 6258 24216 11822 3353 29664 18179 -31927 -35401 -17136 -11987 -28811 -13046 -38724 -53805
8076 -53805 -40605 -30102 -26912 -11751 -36808 -46455 1023 23000 -30970 -68928 -82994 -23095
8064 -23095 -3960 -13291 -19056 -28771 -16208 424 10439 17472 39716 28189 8959 -16061 -1911
8051 -1911 13828 18580 37696 48246 13207 18285 31688 18316 4674 -5036 -3253 -15561 -17127
8038 -17127 7502 44161 32258 34045 43060 39102 45594 30199 6780 -10560 -25617 13343 43755
8025 43755 17631 12203 15496 20858 43606 49010 38390 40634 42073 59689 61305 42910 22465
8012 22465 45530 41137 51426 71318 15297 -24376 -14520 27940 25945 8354 30410 18253
8000 18253 14540 43597 87807 75696 76865 68926 62216 40471 5380 -21262 -14730 17346 21034
7987 21034 9070 14396 27588 33359 8544 -3245 676 30175 29020 29250 33855 9933 -12741
7974 -12741 240 28455 42775 46181 4831 -3779 26337 21490 29670 48435 63121 69612 43425
7961 43425 40489 21777 1732 -20827 -59712 -22870 -7221 -4275 12779 -5378 -1221 12231
7949 12231 20512 27309 50702 62722 52931 41601 24513 -18548 -45535 -20182 26986 25386 2419
7936 2419 -13884 -25794 -50028 -22885 26919 -13278 -3239 11213 -24020 -34211 -31928 -49784
7924 -49784 -64337 -53208 -60079 -24881 20485 45286 22023 24398 47234 50601 32276 1530
7912 1530 -27971 -8205 -189 -2746 13499 24734 53598 55967 56369 38172 30023 25187 36995
7899 36995 45695 42372 940 -19349 -4675 18733 51086 56484 55401 39294 45366 46026 31900
7886 31900 19606 23932 3992 7231 5365 1357 2589 43777 39992 39559 74354 62606 35581
7873 35581 24803 19421 28660 22898 -7333 -33058 -31033 -19394 -46547 -38602 -29792 -27270 -26747 -48719
7859 -48719 -51947 -8430 26695 16024 -6460 7599 39981 27989 5033 5026 -12059 -13636 -6545
7846 -6545 -1295 -3238 35694 38486 13479 19622 26598 42526 53040 58525 58953 59351 19878 -13776
7832 -13776 1624 27397 37998 1928 -1159 -18908 -48770 -47582 -59635 -92130 -59075 -44465
7820 -44465 -43108 -34623 -15613 -35999 -38175 -28770 -9562 -1776 606 39869 39039 17132 -11868
7807 -11868 -13597 -10199 -19150 -2832 74 -27970 -33421 -23700 11573 -372 -1367 -6258 20885 61977
7793 61977 61919 73534 59914 30439 -5149 -26807 -35288 -31300 -27019 8495 49459 39717 17115
7780 17115 -18532 -54905 -60947 -3800 20378 1213 -20701 -2534 34804 35048 14457 13425 -43964
7767 -43964 -79719 -54258 -6210 37762 21837 -35605 -56911 -46195 -36287 -40472 -50797 -51779 -14664
7754 -14664 -15423 -31462 -22680 -29921 -23154 -18731 -26264 -46267 -50487 -31162 -29476 -13119 -5271 11230
7740 11230 -9451 -39853 -41935 -17987 -19664 -20105 -3832 -26985 -41327 -43729 -42488 -48070 -81281
7727 -81281 -78546 -45786 8787 16862 -11636 -16340 -11778 -2219 -14148 -15640 -7610 -403 -36055
7714 -36055 -44627 19002 58921 49971 35774 -7486 -38906 -22888 -16979 -10918 -12708 -41979 -44155
7701 -44155 -8694 -6682 -12610 -18237 -12461 -28322 -30581 8476 28761 51964 38613 34843 34826 16799
7687 16799 18551 26038 26593 20208 39779 48833 28737 -696 -6238 4425 1757 -5736 3602 39258
7673 39258 68357 31690 -14608 -23638 -18600 -59918 -78565 -44894 -7387 -239 11369 13157 27637
7660 27637 40695 -8062 -34488 -3230 10146 27589 55593 42588 25817 26673 16740 60050
7648 60050 89605 86555 72535 39577 49705 32582 26191 46395 27588 -3674 -13651 10305
7636 10305 1432 -29951 -64451 -88508 -85690 -78838 -44342 3700 -26149 -22504 -37115 -32202 -39128
7623 -39128 -29510 -17721 -46324 -60080 -41618 -69128 -75384 -35701 -6775 4681 5183 -26538 -25546
7610 -25546 6069 44323 6152 -38975 -9848 35541 33203 36468 59170 50084 -1289 24330
7598 24330 58998 47125 2932 -3114 20856 43568 2344 -34441 -18012 25994 48153 28878
7586 28878 25458 27651 2819 -8740 -20132 32489 46253 15550 11458 12249 20858 17319 20718
7573 20718 37606 44911 43902 18925 -5724 -43714 -59925 -36673 -31449 -30699 1571 32621 42596
7560 42596 27883 -22131 -41696 -31421 -62679 -40933 20460 2685 -45036 -44406 -49865 -35093
7548 -35093 -78730 -88821 -67711 -61610 -60479 -77398 -42089 -18613 -16903 -13621 11725 -21900 -61535
7535 -61535 -49952 -40756 -51233 -34205 -33657 -31628 -37051 -62518 -68511 -28149 5068 24687 35563
7522 35563 13237 -30006 -78982 -59748 -67560 -47807 -26918 -57530 -68942 -42141 -28820 -6360
7510 -6360 13206 5850 -13935 -52930 -67016 -47358 -38063 -42595 -46909 -34097 -56513 -31879 -27652
7497 -27652 -52868 -53315 -18742 -18283 -6768 17557 23822 1194 16828 18034 -18126 -24269 -15852
7484 -15852 -51871 -33679 -43958 -32837 -7742 -5016 -48610 -95050 -93964 -77371 -39779 -31009
7472 -31009 -30366 -11197 -10302 4669 22309 32976 38865 13767 16278 26609 50236 14496 15857
7459 15857 19534 11499 -4347 -27194 -42883 -57789 -44071 -41936 -46665 -36088 -42900 -19966 7078
7446 7078 -7340 -31207 -19970 -6718 -53549 -49562 -5122 24406 38128 54872 63727 48532
7434 48532 325 -1580 20337 59596 62779 4087 -27444 -20181 3551 -24249 -77022 -62556
7422 -62556 -27907 -32039 -22603 -14445 -8495 -11060 2102 11919 2022 967 17792 11373 7447 -5308
7408 -5308 -23537 -21958 -40442 -56308 -50491 -48002 -33772 -15411 29098 62667 59219 24966 16279
7395 16279 19813 -25419 -45697 -81062 -55539 -27853 -20844 -490 -6223 -35424 -19137 -18361 -28238
7382 -28238 -22936 -19636 -36548 -31279 -28496 -39867 -10359 22825 18397 8323 -8410 -20003 -47040
7369 -47040 -50298 -30779 -4783 23881 22980 -2858 11037 -12728 -51442 -31797 -28766 -52770 -9596
7356 -9596 5060 26237 22165 27644 17759 -8036 -31923 16085 14321 -26279 -40182 -13014 18946
7343 18946 14770 -17921 -57115 -48989 -7559 13789 9523 25365 18034 -6975 -489 -8838 -9676
7330 -9676 -13027 -42973 -43178 -12216 23917 -715 -28554 -55112 -53199 -33172 -48583 -39636 -37592
7317 -37592 -51456 -44565 -44873 -22758 2738 21982 7740 -40633 -35560 -28826 -46013 -29710 -26313
7304 -26313 -35552 -56125 -33893 -52217 -58510 -67210 -98059 -87135 -68683 -59117 -8268 24720 11044
7291 11044 -16371 -52701 -63727 -28972 -24039 -50001 -61869 -64878 -39763 -42107 -37958 -50191 -61397
7278 -61397 -51822 -14319 37633 25226 12743 23325 32108 -13544 -28848 -42577 -71760 -47678
7266 -47678 -10604 -1600 -148 -23363 -22385 -14291 -8401 11497 9022 -19649 -61316 -96204 -84705
7253 -84705 -23369 -10021 28028 49666 12175 5917 -3548 -18610 -21524 -26751 -19186 -17430 -30704
7240 -30704 -50368 -88724 -91831 -70703 -55693 -51280 -20014 -22485 -29467 -9791 -437 12102 -17801
7227 -17801 -50841 -60958 -36073 -35957 -38647 -45904 -48013 -30530 -26152 -43229 -22203 -25583 -17662
7214 -17662 4774 -15789 -53186 -75393 -56031 -7380 -1633 -20205 -8308 -5283 -40594 -84484
7202 -84484 -87916 -76776 -75053 -68120 -63773 -59842 -91748 -110166 -119748 -109133 -68497 -14491 261
7189 261 -11295 -32731 -32584 -96766 -72541 -12027 22417 -5771 -57245 -87348 -80068 -72875 -105052
7176 -105052 -129817 -125004 -88839 -49001 -41399 -46137 -42352 -32245 -4873 5578 12145 5539 1671
7163 1671 47224 57660 25526 -20756 -58525 -53542 -10704 -7642 -37138 -22166 -3193 -11561 26278
7150 26278 53488 -8067 -38074 -27564 -21188 -38210 -33603 -41120 -19379 -27075 -21672 -4768 -6005
7137 -6005 -12614 -16994 12691 17482 -21063 -45408 -48655 -52777 -62574 -16199 29420 32448 12421
7124 12421 9065 -12845 -9564 -26777 -74623 -82309 -65445 -43524 -6747 -12853 -35676 -42030 -19306
7111 -19306 -43889 -47084 -29548 3775 -9336 -31477 -25094 -38135 -24364 12690 24702 30906
7099 30906 18906 -1862 -3806 -24228 -34076 -17238 5478 -17455 -30351 -42203 -29177 -4973
7087 -4973 -9599 -18135 -10075 -2879 -10725 -4212 -14822 -33706 -8644 14759 -9722 -38105 -19247
7074 -19247 -5764 -2431 4855 14650 -16128 -45224 -67687 -75241 -51808 -26384 -19017 -16780 6072
7061 6072 -30327 -44985 -49193 -50757 -12132 3987 19680 26769 -9899 785 13040 27286 47349
7048 47349 16627 -9032 -46449 -104617 -91215 -47408 -7199 22683 9513 4794 6835 -21192
7036 -21192 -33463 -8077 -16279 -15921 -4699 -6390 -21012 -39348 -48749 -24332 9266 -33366 -11076
7023 -11076 17829 -2838 -16488 -9962 -28917 -23832 -8211 -4540 7896 26445 19729 17154 -27238
7010 -27238 -64707 -62255 -52500 -30961 -2295 30615 23161 54712 19014 -37097 -41983 -8039 15239
6997 15239 20446 18354 -28315 -35869 -11136 -41281 -61430 -40724 -35609 -28085 -8917 -12334 -17496
6984 -17496 -11519 -147 -2702 -5169 -7500 -7355 -11262 4422 34901 29483 17627 15867 27396 38286
6970 38286 37379 18524 1087 7593 -23702 -40565 -21635 -22794 -2324 9479 -2814 -33307 -55908
6957 -55908 -53954 -63822 -68192 -42220 -64353 -106362 -90320 -79003 -76390 -52219 -16998 -8258 -5399
6944 -5399 -35202 -46123 -45497 -19559 -20687 -21880 29668 27309 2575 -17321 -16899 -33020 -8457
6931 -8457 30748 48278 30161 42055 7247 8269 6127 -2855 -34401 -30692 -17300 7518 6305
6918 6305 13941 -13875 -26306 -18700 -34280 -48395 -25112 -23552 -12097 -6539 -27844 -62321 -35183
6905 -35183 1010 21370 1267 -10584 -10626 -3940 23048 48132 57520 25857 26944 -11538 -85045
6892 -85045 -62143 -40796 -27595 6860 26529 6239 -13451 -5780 29398 10718 9935 42798
6880 42798 -7420 -17273 -44844 -21302 -36014 -35852 -18778 -35387 -29419 -21615 -18201 -35285 -52666
6867 -52666 -53068 1501 14606 23141 -8245 -50598 -44024 -60749 -66102 -34791 -19359 -18685 -9579
6854 -9579 -12389 -11890 7226 32234 19789 16989 40404 252 -14163 6350 -10131 -22769 3082
6841 3082 -4719 -13001 -21588 -16241 -48964 -44130 -26924 -26330 -27719 -45204 -49216 -41387 -32253 -22426
6827 -22426 -58077 -65504 -16921 -14684 16959 15991 881 -26285 -69729 -55175 -59186 -8087 -24590
6814 -24590 -55344 -62550 -69516 -27210 -8532 -31481 -30381 -8941 -10511 -20567 -18411 -18412 -51535 -30254
6800 -30254 -43973 -63372 -53550 -12129 -14512 -19109 -4367 -7080 -38510 -46983 -49788 -45058 -38876
6787 -38876 1560 26999 20329 38849 50713 4077 -32984 -64281 -49837 -3802 5278 -11858
6775 -11858 -1242 -26259 -32290 -42518 -48802 -74129 -38055 7053 -12491 -18689 19732 20508 32495
6762 32495 27235 4746 -6624 -36727 -38412 -38675 -15048 9283 19719 -2010 -22190 -27216 -33168
6749 -33168 -22755 -15409 11879 29393 -5299 -38758 -4455 10182 7292 36008 86680 126602
6737 126602 142714 117202 64082 45465 80401 88379 93322 85734 80807 95744 76208 65798
6725 65798 74547 89075 87590 113203 166073 227163 293439 383731 547090 744415 967267 1243412
6713 1243412 1415803 1508101 1565295 1526799 1348384 1014162 742633 569622 465108 374812
6703 374812 325728 267359 189807 140918 151329 180004 196140 182062 167641 139517 138110 144310
6691 144310 133353 102020 97749 107426 125388 116163 88731 93424 78854 97214 124243 95997
6679 95997 82503 85762 77082 77393 72746 38425 53085 77172 82724 67486 71668 61483 41480
6666 41480 41248 12524 -17213 805 -31952 -15997 10920 25709 18018 46473 83442 66196
6654 66196 40914 24535 12470 33553 35559 37763 27770 9234 3126 -3128 -30528 -34325 8271
6641 8271 13792 21558 45817 42363 19001 3068 -3806 20097 1562 -1537 3568 -657 1537 -4473
6627 -4473 -1451 23814 38607 42133 36643 23675 11190 40123 50713 80595 78247 38292 -17888
6614 -17888 -61928 -56864 -64398 -20158 -13496 -41476 -46329 -66556 -67967 -49711 -19750 -7958 -40208
6601 -40208 -35004 -14337 10041 -671 -33325 -86684 -30061 -26906 -48669 -40631 -14051 -14683 -35336
6588 -35336 -43823 -35305 -53683 -58595 -53666 4089 26766 -1545 5442 -7652 -3875 15736 -14829
6575 -14829 -27256 6262 19480 3226 818 -4398 12164 42194 25450 28246 -1553 -14400
6563 -14400 486 -11492 -15083 25551 7665 -1904 -3545 7555 -30651 -48739 -89618 -109139
6551 -109139 -81725 -83569 -80598 -63328 -61269 -44268 -15767 -7467 -29955 -39893 -20520 -19756 -8197
6538 -8197 35523 51157 27539 854 32480 26549 8257 3654 -1039 11215 5278 -8849 -28812
6525 -28812 1512 39797 21901 -9377 -29487 -61804 -36189 69 27930 28938 3422 1851
6513 1851 15332 10826 21600 22153 56129 51365 57339 38151 -3566 -23199 12612 23076 11933
6500 11933 39052 920 39981 72327 56132 37613 5470 -26166 -31017 -16482 29248 9158
6488 9158 -6639 -385 -12576 -19653 -22784 4668 27362 42491 50092 14133 -12270 -18368 -28833
6475 -28833 -14670 6096 -34526 -75766 -66020 -23888 -3254 -27183 -24020 800 34741 57251
6463 57251 41881 21436 -3414 24354 -6544 -7322 -14400 -42353 -42022 -40471 -70721 -38717 -16766
6450 -16766 24113 32648 18653 13694 5453 -20269 -5677 -12414 -48282 -62413 -48767 -49240 -46325
6437 -46325 -52331 -32781 -24369 -30686 -28494 -16971 -34020 -59567 -59171 -60291 -43155 -28038 -32585
6424 -32585 -52284 -15815 -6371 -7283 -14944 2208 3042 -41899 -25761 -33061 -53500 -35043 -15589
6411 -15589 -2171 20157 10612 20810 -34030 -86941 -82889 -39435 -16251 -7311 27490 3236
6399 3236 -25224 6402 23979 -4033 -3104 31660 38922 -21224 -36606 -14005 -25163 -3310 -16741
6386 -16741 4287 34574 -3915 -4651 -18370 -8494 4758 20355 16678 -21531 -35071 -51808 -47882
6373 -47882 -37142 -46836 -63851 -50449 -47197 -26701 -26273 -27810 -65006 -78974 -60687 -39895 -6805
6360 -6805 -45810 -80665 -79521 -85798 -81880 -39305 1709 21651 25633 17916 -15638 -24364 -42916
6347 -42916 -60358 -50339 -7816 -14552 -662 -13146 -43391 -45004 -834 -7264 -16062 53 4784
6334 4784 24157 10502 -5729 -40443 -17001 49382 35539 42261 3547 -6632 6163 2281
6322 2281 -23977 -47022 -39982 -9372 -7990 26490 62032 49007 36555 46537 4878 -31730 -17577
6309 -17577 5763 2235 16406 34509 24420 -20249 -53030 -57185 -14746 7024 -29724 -41699
6297 -41699 -54613 -44407 -38057 -42658 -45581 -42081 -43340 -10204 30047 1358 -26851 -26784 -15707
6284 -15707 -5865 -7369 -31510 -41507 -35947 -43328 -58138 -43513 -36633 -29315 -27415 12327 33325
6271 33325 -8759 -32454 -46743 -36654 -23223 -39497 -27172 -24262 -40101 -64876 -87499 -62182
6259 -62182 -20384 29296 15398 12459 22908 39926 41406 9699 -25229 -24196 -9432 -18791 -16941
6246 -16941 -51443 -39435 16460 18461 10392 -10664 -6207 -3888 11799 -7017 -16194 -3366 11392
6233 11392 1628 -5677 -23118 -41007 -47036 -18911 3101 4165 -8385 -20081 -24617 11418 21268
6220 21268 28736 10312 -21594 -17343 -3565 -12841 2411 -8726 -34784 -17270 9467 -6608
6208 -6608 -23905 -29982 -59636 -53284 -11057 837 -24208 -10393 7605 -10125 -23863 -16972 -12162
6195 -12162 9930 55584 77749 63773 27304 45957 53104 17971 3319 11721 -17464 -22060
6183 -22060 -15674 18218 10609 -27091 -16002 -8203 -20812 -18461 -47343 -48720 -44137 -25136 34146
6170 34146 -1404 -18975 -14774 -27777 -53345 -65752 -37209 -54005 -37616 -40138 -32109 -13905
6158 -13905 -22160 -38215 -43001 -41880 -51715 -55134 -35285 -2848 9963 -14308 -29547 -37076 -27708
6145 -27708 -19502 -14706 14143 2840 -31687 -29213 -11037 -15645 -8294 -25722 -18480 -38111 -48864
6132 -48864 -19614 -1158 -13456 -45015 -48892 -49463 -13019 -55155 -71558 -66823 -20945 -8917 -32724
6119 -32724 -20424 -118 23102 8237 2273 -19515 -45299 -28656 -23912 -35431 -43251 -42635 -8313
6106 -8313 -6599 -4321 -1496 7564 -7624 -28891 -31566 -39315 -50934 -50094 -4598 10889 2547 -27952
6092 -27952 -46899 -40518 -14882 -22298 7978 25552 26725 42688 17582 26957 32359 19504 26744
6079 26744 19413 14270 -10045 -52298 -70902 -73026 -18078 19899 9554 -1044 33391 16022
6067 16022 -18168 -18234 1503 -9541 -4724 8871 -3494 8970 36577 41198 36846 35749 17462
6054 17462 -1251 8568 20737 -29459 -34470 -4600 8 3864 -7964 -26713 -20073 -13001 -25940
6041 -25940 -35622 -29760 -36267 -27068 -18254 -52547 -50874 -17679 -10490 -48241 -52070 -47393 -41815 -8236
6027 -8236 -29918 -8170 4871 12420 14422 -4367 -3513 -9902 5935 41766 73148 70682 57562
6014 57562 34955 -3113 -11339 42308 55450 37836 18409 22241 -8636 -20322 -17182 -9403 816
6001 816 -23105 -31721 4069 18319 4482 -22184 -34617 -9182 3327 -22465 -23699 3608 22301
5988 22301 36506 57285 70710 58310 39377 10219 -4273 -17384 -41786 -58352 -61827 -31280
5976 -31280 -24259 -18257 -16255 -22791 -43932 -32856 3239 4565 11531 17420 435 -11197 30170
5963 30170 38498 21551 -27968 -37905 -41129 -47253 -44928 -33934 -23032 -7531 -4558 -13125 -7435
5950 -7435 -17080 -25167 -23411 -49591 -59002 -49830 -71922 -63093 -74799 -51974 -55027 -26286 -20370 -33552
5936 -33552 -55408 -60876 -49006 -33135 -23624 -35813 -41258 -22468 -38089 -42840 -50175 -16812 15782
5923 15782 46200 25609 6829 -20199 -51427 -48270 -30492 -22136 810 21747 19151 8614
5911 8614 -24877 -16131 13936 30088 21894 14451 17605 -14746 -10805 5764 9792 2306 -45801
5898 -45801 -58249 -37477 -33925 -53165 -40407 -21775 -6470 3534 25431 15612 -3233 4655
5886 4655 -3013 -30697 -58863 -49350 -29327 2561 -3616 -16721 -31589 -56618 -38141 -20904 -46628
5873 -46628 -38736 -25717 -26642 4989 49141 47805 54694 62543 59004 -1755 -23570 -16344 36979
5860 36979 18522 -26392 -27380 -39116 -30294 -24596 -11559 -28295 -65287 -103157 -91862 -69121 -54109
5847 -54109 -33956 -23273 -6169 10148 3380 -11371 -45212 -38347 -25605 -9476 -9650 -42570 -36727
5834 -36727 -24550 -11414 -854 -33202 -38063 -23572 -27591 -27860 -12330 22062 4966 30267 47477
5821 47477 8688 18435 -274 -5670 -25929 -40000 180 34304 19536 10419 -4325 -25094
5809 -25094 -16275 820 -10779 -165 -15424 -13847 -26999 -50297 -49165 -16261 11942 28341
5797 28341 38265 22914 236 -5032 28343 41284 39808 42541 42941 34326 26764 5257 -8401
5784 -8401 28506 33656 30711 64867 54607 17799 20443 13727 34849 31839 29433 24270 30023 2388
5770 2388 -22961 -41951 -16218 16276 -3074 -38874 -40791 -34877 -7507 10849 28896 42550
5758 42550 -1409 10230 27700 12469 1911 2317 -15850 -38896 -70400 -77150 -60309 -58616 -14738
5745 -14738 23949 52340 30823 -3937 4332 -3507 -2280 22588 45748 46304 18538 -20183 -16264
5732 -16264 13199 10248 10668 457 -18521 -41668 -47336 -34610 -29149 -1901 24300 23847 942
5719 942 -866 -4306 5029 -38603 -59276 -37913 -7206 -16485 -23054 -1957 -20086 -31728 -16113
5706 -16113 -31308 -29027 -9274 10078 -9696 -52995 -24412 6975 24934 38695 24412 19112
5694 19112 31301 5004 -7194 10833 44436 38838 -12211 -44623 -51698 -36997 -46994 -48974 -12343
5681 -12343 -14698 -59789 -83899 -49719 -25041 -5026 -12320 -12230 -10657 5308 -8507 9816 15109
5668 15109 27958 31233 28992 -8388 -11772 -35642 -29795 -531 38868 11341 -21727 -53588 -67943
5655 -67943 -74571 -48218 -5946 -18375 -13454 -3754 -28744 -14439 11739 51001 47663 14142 -40271
5642 -40271 -20833 -25776 -26994 9033 29776 24860 22925 -635 -998 -4708 2677 -24274 -26494 -31418
5628 -31418 -21159 7896 30561 40167 17306 14859 8795 10729 -25538 -26297 -27119 -24050 -5573 -31502
5614 -31502 -34779 -31509 -27143 -40710 -54498 -41708 -46400 -24538 568 20337 19575 17559 -2154
5601 -2154 -23915 -31605 -7904 11373 2846 2013 696 12061 24495 9851 7874 9274 5992 9443
5587 9443 -8847 -20157 -39354 -20015 36439 54480 14716 7589 -945 1860 6157 -10268 13997
5574 13997 15367 -1693 -11968 -18863 -20193 6449 -8723 -13511 -8586 -18308 -9591 -20425 -3890
5561 -3890 -2996 -6453 -10476 2808 1529 511 4695 15662 49501 62317 63306 42717 71365 85369
5547 85369 55818 50930 36847 20509 16003 6006 14441 -2860 -2075 -2500 2232 -11199 -9890 7952
5533 7952 -4358 -23627 -33022 -23713 10830 27080 25172 31506 15286 -11767 1415 8569 -26811
5520 -26811 -34444 -47722 -27285 24681 28131 44946 31522 -4418 -57672 -62489 -79565 -42722
5508 -42722 -2812 1083 -19961 -48357 -59907 -54087 -41613 -55291 -39475 -35220 -6219 404 -12863
5495 -12863 -19176 -14131 9235 8711 -27991 -50431 -63907 -62851 -46203 -15173 15049 64735 66875
5482 66875 38338 41436 42419 28766 62562 62507 61175 53094 25818 2008 -20042 -15022 -6796 -409
5468 -409 526 -12289 -15879 -12342 -11764 -12836 30685 51072 60623 30460 2077 -10899 -4095 21155
5454 21155 36351 37456 10494 -3724 28808 37316 26062 5585 14507 -4482 -16776 -25985 -21059
5441 -21059 -18540 2248 13882 28455 21179 -214 -12129 -4751 5465 34908 53049 42235
5429 42235 38657 9863 15390 -5696 -14161 -13279 -18731 -21862 -16854 -29982 -20742 -13576 -11992 -12352
5415 -12352 -38614 -41393 -12774 -15134 170 11723 -15620 -31169 -13466 -35343 -54009 -48935
5403 -48935 -45090 7669 49617 42525 2991 -39060 -32757 -15118 -45074 -59829 -67413 -66449 -23611
5390 -23611 13558 -8805 3688 -15498 -49841 -48854 -2452 -8130 -26445 -50966 -65063 -31574
5378 -31574 -8271 -32358 -11781 2318 18169 8940 5148 28300 9774 -690 3 9466 -6141
5365 -6141 -26399 -35730 -54898 -43485 -26046 -38203 -41795 -21460 -12419 -7797 -9926 -37161 -26085
5352 -26085 -38744 -30990 -21279 -47213 -12964 -5904 -33487 -44935 -86277 -94867 -77407 -70945 -67074
5339 -67074 -42886 -66158 -108499 -119698 -101564 -75697 -39516 -11301 -15860 -18883 -48325 -48912 -7558
5326 -7558 18474 -10648 -40617 -49738 -37013 -24738 -44696 -56491 -62303 -53972 -21447 13159 52375
5313 52375 54557 19632 -17993 -34906 -16331 5316 2464 -41501 6935 51384 49863 38985
5301 38985 19164 -6859 -11548 1633 -30345 -51129 -21457 -27194 -45101 -57654 -36012 -40947
5289 -40947 -10397 -5511 -35963 -51414 -15039 12330 -4628 -5248 -7816 3921 -13280 -20239 5441
5276 5441 36481 39916 45624 59894 41170 -14075 -54900 -88218 -69628 -30190 -11931 -23074
5264 -23074 -41409 -43399 -45485 -15049 -449 5203 -5825 -7553 -207 9859 14219 -10151 -10902
5251 -10902 18191 43365 75291 74382 39876 27591 10068 -1818 -1669 21620 24440 5524 -6707
5238 -6707 -13464 -16280 -3541 5 -6073 -21868 -8638 -27456 -68595 -73479 -52304 -50400 -50463 -25135
5224 -25135 40 14247 -12086 -59735 -55144 -44840 -23667 -20990 12810 39670 20465 -7897
5212 -7897 -1673 -6089 -27107 -52426 -36403 -48063 -51203 -47299 -31509 -15393 -40088 10059 32992
5199 32992 31924 16955 19948 -3595 27703 5524 -31847 -49991 -44620 -26871 -10020 9471
5187 9471 15842 33766 16441 22452 44774 44781 23019 -13240 -1302 -5484 -43829 -53985 -51892 -39966
5173 -39966 -35144 -29676 1903 6281 -2403 591 -9488 -13583 2194 -13925 -39833 -11894 18903
5160 18903 16481 22057 -22450 2206 32529 31733 274 -39990 -51813 -51711 -20630 5823 35764
5147 35764 14400 12701 -20165 -21525 -8035 6106 -17340 -42636 -41758 -26993 -6579 -3058 -18844
5134 -18844 -38024 -28766 577 19292 49845 49138 19653 59486 63898 50633 39458 -6438 -5588
5121 -5588 -29617 -36999 -2644 2119 15767 43264 61662 42924 50054 34767 2227 -15528 -6540
5108 -6540 11831 10119 5638 10229 7801 -21917 -35411 -27372 -25076 -23694 -4067 11436 -13956
5095 -13956 -28028 -44151 -52843 -33194 -30219 8387 40781 53499 22852 19779 21493 24129 -14210
5082 -14210 -36702 -19636 1082 1673 -8598 -26627 4352 55168 45816 12573 -5955 -13709 -16353
5069 -16353 1313 13687 -29325 -37638 -3761 -19596 -48459 -25210 2846 22801 15312 30496
5057 30496 56514 50839 7774 -5993 3829 6762 39751 43005 16864 11341 -9847 16777 63268
5044 63268 77694 64112 34801 20026 19834 43464 55604 46554 39692 -2885 -24095 -48049 -30977
5031 -30977 -12867 10211 6286 2893 13486 12341 -5238 -43578 -15282 -24143 -40641 -29074 -30888
5018 -30888 -12808 -27455 -56652 -73143 -69161 -54909 -22472 25500 25370 -4311 -11309 -7527 -11568
5005 -11568 429 4889 -27537 4132 50749 81145 56309 597 -52433 -58218 -22910 -5216
4993 -5216 267 -5900 -8977 -9014 15656 21221 27095 29410 19977 18764 10261 3334 -14256 -7439 -21112
4978 -21112 -28940 -1770 36977 33417 18597 3928 -18062 8102 8665 15976 37684 12298 -37746
4965 -37746 -53131 -39150 -19490 -10551 -35880 -64226 -39421 10575 18689 22405 -9137 -14615 -32228
4952 -32228 -26137 44704 74419 40069 3317 -1441 -24227 6757 29942 43438 72165 80679
4940 80679 33366 -26604 -70474 -86138 -53394 -19133 -22290 -24564 -28728 -9165 4960 -2080 -13411
4927 -13411 -10263 24202 6903 -22961 -13519 6970 1092 -1737 -12528 -4949 13288 24423 8002
4914 8002 -12086 -36002 -43656 -37703 -11220 -4208 -9942 -30572 -37263 -22828 -5795 21629 11060
4901 11060 -19084 -15102 14136 8361 -21391 -7452 17862 28707 45329 60679 36613 -1961
4889 -1961 -6441 -7549 1883 36328 46905 33359 20628 4309 -27803 -6193 30463 35657 48528
4876 48528 23558 6322 -2528 -58303 -74505 -55757 -34320 -48810 -56266 -1258 -22772 -40323
4864 -40323 -18468 15725 11791 -7212 4226 6120 1821 -6213 -14394 -12766 30826 14132 -21660
4851 -21660 -69478 -51230 7222 10796 9917 -17871 -4336 -3733 -33849 -46048 -33325 3341 31969
4838 31969 26639 25874 31303 4412 -39422 -50184 -62358 -70628 -21864 -44639 -67433 -30780 -28156
4825 -28156 -39380 -41763 -63566 -50178 -43233 -29504 -16214 8332 -3939 -7540 -4891 8451 -21941
4812 -21941 -31506 -12619 5780 -9201 4960 -4772 -9174 9004 -3318 -20960 -21969 -17011 -13016
4799 -13016 -28468 9622 27678 -12819 -50220 -6789 22101 13220 14373 -17428 -29622 -7860
4787 -7860 6041 -11622 -5170 -18788 -9377 40353 5784 -7403 34051 39681 31360 24420 8127
4774 8127 26826 9483 -9833 -2746 -10732 -16142 7002 17396 9898 12211 -13048 -55526 -68307
4761 -68307 -71910 -62203 -42930 -76017 -80087 -66414 -38678 -6600 19544 25933 -1193 -22602 -26925
4748 -26925 -21235 -43277 -50004 11177 32222 79965 88061 26958 6251 -10212 8911 13293 9540
4735 9540 -34647 -27353 75 -23667 -43824 -56481 -29014 -22871 -30894 -44891 -44418 -25804 -8951
4722 -8951 43867 62916 73653 39572 3459 -1903 -9389 -8231 -42781 -41646 -21504 6370 908
4709 908 -3004 -23408 -14199 -29010 -26530 -21535 -45284 -85925 -53106 3554 49364 49907 79440
4696 79440 99104 92463 74513 65676 42379 34185 34308 41174 57567 53678 17868 2772 11640
4683 11640 30562 47044 25208 -17814 -29386 16682 30594 28469 40187 11927 -9430 -43601
4671 -43601 -33197 -33039 -25006 -14281 -1659 1114 -13789 -29102 -7367 -12562 -27139 -18456 -29317
4658 -29317 -33813 -44080 -34311 -27873 -25570 -18908 -13290 14790 -3447 -7786 -7455 -34800 -60617 -52174
4644 -52174 -20512 2699 10775 30315 28339 30456 13616 31754 41459 31254 28379 45563 23731
4631 23731 37081 33370 17042 -2607 -25972 -11783 -16323 -20662 3887 -24368 -4945 31290
4619 31290 64005 34577 -5219 -11752 -3746 -6785 -23364 -32757 -31169 -13798 12021 -4000 3938
4606 3938 12606 -17071 -12566 1110 -5043 2463 5336 11373 6635 12863 30289 31621 20003 2232
4592 2232 -11750 -4635 2749 -20615 -8052 -44531 -67612 -39848 -11778 -31047 -27381 -21436 -3984
4579 -3984 17657 -2841 -37605 -81420 -71243 -40758 -34786 -29034 -28859 -36857 -16228 -15673 7162
4566 7162 -272 -24265 -36842 -33774 -58938 -74019 -36662 -3584 -14208 -5621 23927 59539 55683
4553 55683 28737 40252 19137 -271 -15628 -9515 -17216 -5486 30131 34107 24624 5518 -7140
4540 -7140 1227 -17667 -24446 -8691 10409 44280 7745 -3011 -7241 -10275 -5094 -11067 -8432
4527 -8432 10299 -6560 -5625 16235 27707 -7517 219 34010 19776 39464 69695 27008 -16833
4514 -16833 -17548 -28248 -30270 -61368 -69462 -41104 -26018 -40351 -55397 -57171 -39307 34275 35329
4501 35329 23865 1906 732 2864 17078 35447 6994 -26408 -26099 -44174 -55035 -31337 -48375
4488 -48375 -52927 -32814 -12036 12630 6941 16285 39591 40313 30692 -19519 -33317 -42887 -42252 -53270
4474 -53270 -52917 -26076 -25083 -35031 -11880 -5208 20671 18644 -4762 -601 -25404 -45472 -64363
4461 -64363 -53447 -8970 -26483 -48918 -51874 -40217 -16152 -21213 -1739 4976 -3887 -16876 -23206
4448 -23206 -20884 -1433 11927 22314 -6043 3322 32360 28573 48320 5477 -2334 22153 9827
4435 9827 -30368 -47569 -9068 11543 50741 26227 -95 -13986 -27384 -53696 -89696 -86465
4423 -86465 -53099 -17642 -16988 -41688 -55832 -69374 -69408 -52635 -25195 -31746 -51741 -72050 -81063
4410 -81063 -76101 -34416 -14307 -34844 -15946 -5143 18398 18176 16583 15137 -33500 -37622 11214
4397 11214 4825 -34412 -43365 4120 2706 -23855 -32903 -8885 -29503 -69173 -68097 -36024 -25162
4384 -25162 -9252 -9059 -36577 -43082 -34138 -38353 -632 15563 -4559 142 41013 44596 42862
4371 42862 30592 27815 14989 4846 -1970 2245 5843 30543 48982 28456 3238 8901 26512
4358 26512 50457 57715 29057 12774 848 -22544 -28292 -34864 -48252 -54851 -3673 -746 9836
4345 9836 -9959 -21730 -22850 -3607 1286 -15822 -25682 -19026 26 -9189 -18409 -14971 4948
4332 4948 -46545 -61172 -52318 -43619 -17066 -10681 14878 34143 35017 59912 57324 66708 61476 44469
4318 44469 53207 32774 33697 12419 -16891 -30200 -56378 -52358 -49652 -37803 -36770 -62516 -54267
4305 -54267 -42584 -28927 -42049 -53413 -63086 -61350 -6411 53706 9164 -33852 -21386 24823
4293 24823 71454 69438 58417 29617 908 6608 36309 22654 -22882 -31092 -12430 25281
4281 25281 30603 22993 27671 23480 21036 -5484 -19097 13036 21527 6203 -482 -6249 9846
4268 9846 8425 25390 29353 13431 -5044 -26405 -20645 -9394 -22504 -12646 -22942 -46345 -27169
4255 -27169 -16539 -19578 -5217 3758 5149 -8255 19318 23347 -3759 -5487 -2427 -1688 5144 -6719
4241 -6719 -17729 -9207 7072 3577 -922 44433 96793 101255 81534 39128 11572 -6698 386
4228 386 -12329 -314 13052 28445 -16680 -21286 -7007 5148 -580 -46554 -56051 -41057 -35700
4215 -35700 -56798 -41336 -5821 -13865 -22564 -40731 -31960 -1253 -3700 12688 44571 74461 70295
4202 70295 67123 31414 -21336 -30230 -2647 -26050 -69620 -54854 -5784 50750 56358 32411
4190 32411 27172 -3216 9090 32938 19361 12101 5150 32054 49149 54173 30630 -14360 -36516
4177 -36516 -42574 -67023 -69831 -66584 -18550 -1686 10565 14423 936 838 -1124 -12841 -13743 -13468
4163 -13468 724 -13333 -49198 -81173 -83604 -71892 -75058 -33538 -27073 -29270 -7389 1128 18783
4150 18783 47348 35939 31474 31615 41563 44923 17285 -5395 17460 31373 49393 68859 63128
4137 63128 40822 31594 23917 9480 44669 98319 95518 32325 5647 19224 20982 101 -30856
4124 -30856 -41861 -464 14841 7414 21446 28256 26946 48175 40123 34013 36053 25662 39246
4111 39246 62235 69970 54054 35637 -16378 4810 30461 8829 -33518 -57470 -73299 -43662
4099 -43662 -22508 -9644 924 -11136 -5938 -28738 -45669 -63055 -43752 -2251 26112 -2310
4087 -2310 10150 17865 -6694 2628 36360 50450 74566 69629 15928 -21553 -52247 -57219 -28755
4074 -28755 -43728 -65771 -50982 -54467 -40170 -12993 -15425 -111 -22315 27270 78718 56775
4062 56775 -15426 -8994 475 -6397 17028 74167 56395 52070 64137 59600 6852 7445 -16069
4049 -16069 -55049 -41886 -7209 2839 -38665 -43634 -4019 35231 45087 69028 61825 66317 46173
4036 46173 52967 55506 47443 67502 73001 39388 21027 19261 -9877 -28322 -34028 -21165 -11256
4023 -11256 -20887 -36705 -37910 -31713 -41432 -50553 -31903 -24551 -33597 -55759 -56968 -68228 -58192
4010 -58192 -52615 -64741 -27723 11745 32362 36146 18922 -9834 -15048 12138 45868 20472
3998 20472 15518 -1444 -30291 -23543 -63966 -68541 -44077 -41221 -41946 -49774 -64475 -82337 -80346
3985 -80346 -63179 -47574 -31787 -64837 -42482 7537 23862 14657 -21049 -27001 -2835 1575
3973 1575 -26084 -37579 -53858 -59956 -43166 -29889 -21238 36798 42236 23473 -14406 -31690 -63564
3960 -63564 -73031 -20414 32714 48454 43108 49058 60496 16127 -41664 -55081 -47420 -54300 -46899
3947 -46899 -17217 -28975 -30084 11890 52281 64554 71245 72119 60351 72255 52146 39411 7354
3934 7354 18966 38097 5578 -37559 -50568 -32371 -39685 -34824 -22784 -39 13866 38247
3922 38247 44989 50751 52283 47582 7792 -13491 3036 9466 -3466 7146 -11154 18184 36983
3909 36983 8976 7132 29881 29624 23718 21082 -8431 -22963 5769 -495 -9022 -53921 -53990 -20577
3895 -20577 8013 13758 6629 -20555 -2207 11826 22151 32505 3493 -9927 -23605 -4248
3883 -4248 21881 52361 31085 5358 9144 -1794 -21267 -23820 856 -8839 -36312 -40816 -37631
3870 -37631 -7968 -12599 -30925 -3621 -7819 15371 16673 22526 34940 79095 58545 22383 -16886
3857 -16886 -42001 -41734 -27878 -16491 -17819 -17970 -7760 -18042 -26167 10968 10322 -5037 3637 -3208
3843 -3208 -14185 -27525 -24796 -965 -22222 -42340 -37684 -40169 -24672 -38639 -36159 -41294 12398
3830 12398 36273 14210 -11538 -20650 -14361 -11948 -10113 -15707 -41046 -17902 19170 36930 17069
3817 17069 11566 8310 25619 21126 34423 72962 65273 31140 12243 34393 33829 7759 -22049
3804 -22049 -21056 -39508 -39812 -16333 6569 -4686 -19535 -10428 -31079 -18724 -4740 1127 -13089
3791 -13089 -23652 -19073 -4133 -14069 -25233 -51688 -60475 -41582 -17936 8659 16490 -13957 -43832
3778 -43832 -34591 -29089 -44006 -33636 2293 -3771 3656 10092 -6820 2759 15509 29110 2911
3765 2911 -10789 -28683 -15042 4869 2297 -2374 8857 45293 10954 18210 14663 2044 -10729
3752 -10729 -6716 4231 12183 14232 8319 9441 10292 -15157 -24058 -11176 3568 -10554 587
3739 587 1701 4077 28501 9392 -27898 -37966 9699 36672 10554 -28538 -22519 36119 75362
3726 75362 51502 22813 24108 27557 -1460 -27617 -32654 -32053 -40723 -29078 -48370 -9720 26501
3713 26501 -10063 1643 -5767 18394 -2464 -1199 1213 -18863 -44070 -38255 -4912 14476 43924
3700 43924 72137 46249 37444 22456 17384 13 -5682 10785 10494 -16867 17126 29264 -1707
3687 -1707 -15431 -1501 14419 46981 48010 29781 8508 -18778 -40593 -40543 -78448 -74665 -59693
3674 -59693 -58900 -13619 -2552 -226 37753 72379 51949 24231 -2763 -20371 -48589 -51196 -40415
3661 -40415 -40990 -33619 -33138 -38955 -17512 6642 -33268 -30502 -14822 -22222 -17310 -3058 -5150 1831
3647 1831 8005 42500 40451 34284 32689 13417 27333 20555 14091 -1280 6834 20062 17115 26501
3633 26501 34936 44087 34088 43921 41913 60131 79998 45673 57 -19864 -6796 -18574 -13953
3620 -13953 -14889 -45585 -19274 24935 38745 39442 31625 19821 8135 25020 22494 40296 19722
3607 19722 -23758 -28915 18035 20261 -8828 -16819 -7039 -16585 -11298 28957 34618 18027 -1527
3594 -1527 37479 49986 52189 61601 41334 9316 -40955 -50320 -57556 -48044 2332 13398 10749
3581 10749 7379 -2019 -12823 -5738 20675 28041 17859 192 -50948 -40701 10475 26429 35379
3568 35379 41196 51130 53132 39642 24246 6199 -26981 -18350 -20939 -24845 -10606 16795 50736
3555 50736 50049 11744 -21175 -10083 18849 40447 14101 6047 -9948 -33038 -49936 -69695
3543 -69695 -48823 -17551 -14053 -22004 -9321 5154 -8951 -12298 3272 -23366 -50523 -35970
3531 -35970 10018 -1212 -32931 -52493 -43207 40530 57549 53222 50059 9297 -17231 -8119 25222
3518 25222 11742 -35922 -32968 7281 23702 39070 35647 36122 36964 -5382 4571 45371 39377
3505 39377 40452 60144 79024 69316 54031 69417 37141 19190 22009 45788 22796 9428
3493 9428 -10258 -6365 -13260 -11280 10409 19645 35100 21309 22670 -22794 -33564 -67512 -62915
3480 -62915 -22591 -10077 21471 59520 12587 -38775 -65777 -54919 -49437 -34448 -34114 -74558
3468 -74558 -59176 -27862 6820 9834 -8205 13134 28921 11439 2538 20300 10396 -16028
3456 -16028 -66221 -47224 -6950 9850 34468 29648 35906 33026 39781 35404 29413 36253 15614
3443 15614 19438 -1025 24814 25188 28001 52932 8450 -19751 -40719 -57380 -70496 -41764 -43261
3430 -43261 -20352 8432 8123 17717 34319 49668 27338 -5383 -6783 -22056 -36154 -3448 38317
3417 38317 17500 5557 47178 83303 82139 40511 979 -2770 -18779 -17492 -5930 40356
3405 40356 30869 18438 6823 5306 -20995 -45157 -65654 -55445 -16697 14667 18045 1101
3393 1101 1962 -3501 12284 20141 14965 6014 10924 -1632 -12002 7322 -22795 -28080 -21923 -6447
3379 -6447 17722 -33655 -69623 -54382 -37527 -22018 -2955 16942 28704 17786 21523 23944
3367 23944 6327 -25259 -59447 -24801 -2529 1592 24960 17855 2666 -6552 14461 47727
3355 47727 80105 57101 26147 -1310 -37344 -47446 -69702 -57902 -1785 28076 31399 39970
3343 39970 53093 42058 16601 3900 -10557 -28483 -23979 -10084 23107 46947 22585 6510
3331 6510 11741 29196 13550 20222 24459 13367 18183 9084 25969 28521 -4124 5505 -20669
3318 -20669 -40054 -69568 -55792 -27674 -5800 -1903 8147 38855 64582 74941 45024 727
3306 727 -14406 -2086 -820 -6980 -2347 -15405 -5975 4644 48984 72801 38540 23117 12729
3293 12729 5567 -7495 5137 22795 47041 57391 3345 -19450 -20477 -20467 -7023 6272 14979
3280 14979 6634 -13697 -9990 21748 34312 34056 21361 -8820 2987 26916 8471 -43823 -36334
3267 -36334 -14433 -39499 -21137 1576 13353 51829 38661 36001 28818 -5144 -6200 -9767 8936
3254 8936 24409 6166 -2014 -5989 16753 22671 26859 24141 3162 22256 54424 52382 34728
3241 34728 26940 -18726 -17966 -16226 -3992 20012 27509 -13495 -13085 10301 12082 5824 -27673 -57471
3227 -57471 -67151 -37999 -22137 -24891 -58604 -52310 -60446 -92754 -60555 -7743 17556 3472 -27376
3214 -27376 -49390 -57325 -46506 -14442 -11699 -20250 -11296 24488 25497 5118 30152 14617 4014
3201 4014 10993 22380 -5258 -16719 -4699 -1556 25292 9167 -6682 -772 31574 47806 61264
3188 61264 56187 3042 -26679 -20431 -31344 -27323 -3627 4302 5028 -3235 -5590 14121 6562 17504
3174 17504 23143 -1822 6791 28152 21635 11843 -937 3775 -6949 -13361 -14501 -35306 -36424
3161 -36424 13361 46593 51801 53780 56836 38303 4650 -5168 5711 14355 11950 -15003 -10964
3148 -10964 -1690 50285 59567 33191 4894 -18584 -1436 39097 58436 37239 9633 1514
3136 1514 -7908 -16102 -36538 -18742 27388 12092 -9985 -33994 -2308 23030 48109 41528 17072
3123 17072 19762 14750 28936 57851 94895 66019 29998 54837 41841 13647 3816 -6717
3111 -6717 1252 16062 27595 2433 -4328 -18210 -48680 -58403 -49635 -43453 -62663 -71938 -69446
3098 -69446 -49499 -25135 -8467 -3033 1604 29105 55283 24534 445 38032 37275 30082 36365
3085 36365 39718 31798 37656 68712 84892 53284 19374 23924 22838 4610 -35744 11863 20444
3072 20444 13070 -4783 -31195 -21113 -4159 -28274 -32258 -27542 -9309 -5272 -32986 -14004 11074
3059 11074 28862 25678 31532 64684 49631 13053 4616 6237 7028 -6469 -36069 -26520 46458
3046 46458 87292 20487 -54549 -55903 -44414 -66179 -50520 18959 28908 1080 -13786 -20042
3034 -20042 -3560 16438 179 -5261 -14232 -22402 -15103 -53639 -67475 -32096 -27079 -2582 -18733
3021 -18733 7584 19957 -26438 -75472 -105435 -69379 -51055 -30280 -41224 -36027 268 1629
3009 1629 -24432 -50950 -63336 -50098 -22229 19484 29190 -9584 -23281 -32039 -41916 -47505 -33405
2996 -33405 -50341 -75954 -63924 -44534 -24133 -42891 -55195 -52192 -51831 -19942 353 -29255
2984 -29255 -47552 -64339 -93924 -62818 -3419 22468 27437 27555 61042 43167 -2650 -19908
2972 -19908 -41921 -63651 -13605 3523 -9587 -12434 -19259 15638 49527 80218 86530 43627
2960 43627 38235 34158 30849 30919 17468 -3582 -47032 -32510 -10655 16493 11948 -10383 10263
2947 10263 43885 28283 30066 43016 4526 -31357 -22291 -12226 -17 1121 11223 57000
2935 57000 61762 36740 17176 23468 48967 8536 -36438 -29808 -23213 -39973 -71050 -69193 -43277
2922 -43277 -36037 -39829 -60955 -49498 989 -20547 -63989 -56926 -30434 -21014 -19065 -25282 -51529
2909 -51529 -45678 -4201 -8405 -25298 -21534 12146 54138 44853 51113 57942 70684 76470 67848
2896 67848 42758 37969 43389 28636 37704 20839 29614 -3199 -25984 -13198 -878 -25735 -27374
2883 -27374 7410 -15365 -36431 -32598 -7418 27116 64622 64137 42765 36782 67350 43585 12578
2870 12578 3505 30300 37759 13709 -32863 -22044 -1237 3980 -20908 -14067 -20026 -22790 -15658
$$ [...]
##END NTUPLES=NMR SPECTRUM
##END=
