##TITLE=Analysis number 320028
Compound Code cc 29314
Book Reference 479/78
Project Code adrs
Chemist Name roba
##JCAMPDX= 6.0         $$ Bruker NMR JCAMP-DX V2.0
##DATA TYPE= NMR SPECTRUM
##DATA CLASS= NTUPLES
##ORIGIN= Bruker BioSpin GmbH
##OWNER= nmr
$$ XWIN-NMR		Version 3.5
$$ Fri Jun  9 09:34:56 2006 GMT Daylight Time (UT+1h)  MAYBRIDGE\nmr@NMR_250MHZ
##.OBSERVE FREQUENCY= 250.131544655141
##.OBSERVE NUCLEUS= ^1H
##.ACQUISITION MODE= SIMULTANEOUS (DQD)
##.ACQUISITION SCHEME= undefined
##.AVERAGES= 16
##.DIGITISER RES= 18
##SPECTROMETER/DATA SYSTEM= dpx250
##.PULSE SEQUENCE= zg30
##.SOLVENT NAME= CDCl3
##.SHIFT REFERENCE= (INTERNAL, CDCl3, 0, 16.4446)
##AUDIT TRAIL= $$ (NUMBER, WHEN, WHO, WHERE, WHAT)
$$ ##TITLE= Audit trail, XWIN-NMR		Version 3.5
$$ ##JCAMPDX= 5.01
$$ ##ORIGIN= Bruker BioSpin GmbH
$$ ##OWNER= nmr
$$ C:\u/data/dgb/nmr/ADRS/480/pdata/1/auditp.txt
$$ ##AUDIT TRAIL=  $$ (NUMBER, WHEN, WHO, WHERE, WHAT)
(   1,<2006-06-09 09:34:33.39 +100>,<MAYBRIDGE\nmr>,<NMR_250MHZ>,
      <created by zg, POWCHK disabled, PULCHK disabled
       configuration hash MD5:
       E2 DF 36 D8 04 B2 41 60 5A D7 A3 38 5A 4B D0 FE
       data hash MD5: 64K
       47 D2 A4 64 2E 3F 10 A2 7C FA 63 10 A5 5B 87 0F>)
(   2,<2006-06-09 09:34:45.18 +100>,<MAYBRIDGE\nmr>,<NMR_250MHZ>,
      <Start of raw data processing
       ef LB = 0.3 FT_mod = 6 PKNL = 1 SI = 32K 
       data hash MD5: 32K
       F5 DC 35 00 8C EF CB 9D 52 4C B2 64 04 C0 24 C0>)
(   3,<2006-06-09 09:34:46.81 +100>,<MAYBRIDGE\nmr>,<NMR_250MHZ>,
      <apk 
       data hash MD5: 32K
       E6 06 9A 77 85 48 7F 62 CE 81 40 AD C8 A0 6B 55>)
(   4,<2006-06-09 09:34:47.53 +100>,<MAYBRIDGE\nmr>,<NMR_250MHZ>,
      <abs ABSG = 5 
       data hash MD5: 32K
       1F C6 C6 2D 1E D5 3D 43 A9 38 61 DD 06 B1 BF FB>)
$$ ##END=
$$ 
$$ hash MD5
$$ 7D 0E 97 EB 50 96 67 47 64 C3 8A 3C AD 01 0C D2
##$RELAX= 
##$RELAX= 
##$RELAX= 
##$RELAX= 
##$RELAX= 
##$RELAX= 
##$RELAX= 
$$ Bruker specific parameters
$$ --------------------------
##$DU= <C:\u>
##$EXPNO= 480
##$NAME= <ADRS>
##$PROCNO= 1
##$TYPE= <nmr>
##$USER= <dgb>
##$AMP= (0..31)
100 100 100 100 100 100 100 100 100 100 100 100 100 100 100 100 100 100 
100 100 100 100 100 100 100 100 100 100 100 100 100 100 
##$AQSEQ= 0
##$AQ_mod= 3
##$AUNM= <au_zg>
##$AUTOPOS= <21 >
##$BF1= 250.13
##$BF2= 250.13
##$BF3= 250.13
##$BF4= 250.13
##$BF5= 500.13
##$BF6= 500.13
##$BF7= 500.13
##$BF8= 500.13
##$BYTORDA= 1
##$CFDGTYP= 0
##$CFRGTYP= 5
##$CHEMSTR= <none>
##$CNST= (0..31)
1 1 145 1 1 1 1 1 1 1 1 1 1 1 1 1 1 1 1 1 1 1 1 1 1 1 1 1 1 1 1 1 
##$CPDPRG= <>
##$CPDPRG1= <>
##$CPDPRG2= <>
##$CPDPRG3= <>
##$CPDPRG4= <mlev>
##$CPDPRG5= <mlev>
##$CPDPRG6= <mlev>
##$CPDPRG7= <mlev>
##$CPDPRG8= <mlev>
##$CPDPRGB= <>
##$CPDPRGT= <>
##$D= (0..31)
0 1 0 0 0 0 0 0 0 0.06 0 0 0 0 0 0 0.0002 0 0 0 0 0 0 0 0 0 0 0 0 0 0 
0 
##$DATE= 1149842071
##$DBL= (0..7)
120 120 120 120 120 120 120 120 
##$DBP= (0..7)
150 150 150 150 150 150 150 150 
##$DBP07= 0
##$DBPNAM0= <>
##$DBPNAM1= <>
$$ [...]
##$SUBNAM7= <"">
##$SUBNAM8= <"">
##$SUBNAM9= <"">
##$SW= 20.6930455092707
##$SWIBOX= (0..15)
0 0 3 0 0 0 0 0 0 0 0 0 0 0 0 0 
##$SW_h= 5175.983436853
##$TD= 65536
##$TD0= 1
##$TE= 296.16
##$TE2= 300
##$TE3= 300
##$TEG= 300
##$TL= (0..7)
0 120 120 120 120 120 120 120 
##$TP= (0..7)
150 150 150 150 150 150 150 150 
##$TP07= 0
##$TPNAME0= <>
##$TPNAME1= <>
##$TPNAME2= <>
##$TPNAME3= <>
##$TPNAME4= <>
##$TPNAME5= <>
##$TPNAME6= <>
##$TPNAME7= <>
##$TPOAL= (0..7)
0.5 0.5 0.5 0.5 0.5 0.5 0.5 0.5 
##$TPOFFS= (0..7)
0 0 0 0 0 0 0 0 
##$TUNHIN= 0
##$TUNHOUT= 0
##$TUNXOUT= 0
##$USERA1= <user>
##$USERA2= <user>
##$USERA3= <user>
##$USERA4= <user>
##$USERA5= <user>
##$V9= 5
##$VALIST= <valist>
##$VCLIST= <CCCCCCCCCCCCCCC>
##$VD= 0
##$VDLIST= <DDDDDDDDDDDDDDD>
##$VPLIST= <PPPPPPPPPPPPPPP>
##$VTLIST= <TTTTTTTTTTTTTTT>
##$WBST= 1024
##$WBSW= 4
##$XGAIN= (0..3)
0 0 0 0 
##$XL= 0
##$YL= 0
##$YMAX_a= 396659
##$YMIN_a= -647999
##$ZGOPTNS= <>
##$ZL1= 120
##$ZL2= 120
##$ZL3= 120
##$ZL4= 120
##$ABSF1= 16.44458
##$ABSF2= -4.248592
##$ABSG= 5
##$ABSL= 3
##$ALPHA= 0
##$AQORDER= 0
##$ASSFAC= 0
##$ASSFACI= 0
##$ASSFACX= 0
##$ASSWID= 0
##$AUNMP= <proc_1d>
##$AZFE= 0.1
##$AZFW= 0.1
##$BCFW= 0
##$BC_mod= 0
##$BYTORDP= 0
##$COROFFS= 0
##$CY= 12.5
##$DATMOD= 1
##$DC= 0
##$DFILT= <>
##$DTYPP= 0
##$F1P= 14.0000005364418
##$F2P= -0.99999901652339
##$FCOR= 0.5
##$FTSIZE= 32768
##$FT_mod= 6
##$GAMMA= 0
##$GB= 0
##$INTBC= 1
##$INTSCL= 1
##$ISEN= 128
##$LB= 0.3
##$LEV0= 0
##$LPBIN= 0
##$MAXI= 10000
##$MC2= 0
##$MEAN= 0
##$ME_mod= 0
##$MI= 0
##$NCOEF= 0
##$NC_proc= -4
##$NLEV= 6
##$NOISF1= 0
##$NOISF2= 0
##$NSP= 0
##$NTH_PI= 0
##$NZP= 0
##$OFFSET= 16.44458
##$PC= 1
##$PHC0= 167.2128
##$PHC1= 7.248177
##$PH_mod= 1
##$PKNL= yes
##$PPARMOD= 0
##$PSCAL= 4
##$PSIGN= 0
##$REVERSE= no
##$SF= 250.130019362603
##$SI= 32768
##$SIGF1= 0
##$SIGF2= 0
##$SINO= 400
##$SIOLD= 32768
##$SREGLST= <1H.CDCl3>
##$SSB= 0
##$STSI= 32768
##$STSR= 0
##$SW_p= 5175.98343685301
##$SYMM= 0
##$S_DEV= 0
##$TDeff= 65536
##$TDoff= 0
##$TI= <Analysis number 999999
Compound Code 99
Book Reference 9
Project Code 9>
##$TILT= no
##$TM1= 0
##$TM2= 0
##$TOPLEV= 0
##$USERP1= <user>
##$USERP2= <user>
##$USERP3= <user>
##$USERP4= <user>
##$USERP5= <user>
##$WDW= 1
##$XDIM= 32768
##$YMAX_p= 291022762
##$YMIN_p= -148577
$$ End of Bruker specific parameters
$$ ---------------------------------
##NTUPLES= NMR SPECTRUM
##VAR_NAME=  FREQUENCY,     SPECTRUM/REAL,   SPECTRUM/IMAG
##SYMBOL=    X,             R,               I
##VAR_TYPE=  INDEPENDENT,   DEPENDENT,       DEPENDENT
##VAR_FORM=  AFFN,          ASDF,            ASDF
##VAR_DIM=   32768,         32768,           32768
##UNITS=     HZ,            ARBITRARY UNITS, ARBITRARY UNITS
##FACTOR=    0.157963299565203, 1,           1
##FIRST=     4113.28313335128, 0,            0
##LAST=      -1062.70030350173, 0,           0
##MIN=       -1062.70030350173, -148577,     0
##MAX=       4113.28313335128, 291022762,    0
$$ Real data points
##PAGE= N=1
##DATA TABLE= (X++(R..R)), XYDATA
$$ [...]
17533A14391l8154N16L0223L3009k4019m4119J3502O878J7789K0233l0887p970
17521I1392o363K4907R536l7893k6322j6961n362J6244K5511J4212q493K908j1319
17508G1997J5887K4989K1977j8298l8358J1805L2992K9763k7915n2351l627R991
17496G8852K929j1962l2592k1129N1234J3895j3947n6602K5877K6925J9408M2215
17484A25103j9002n2041l9185J0312k7872k8963M0036M8796j8636l5960J7226
17473A9814K0424K590K5015j7708q828L6238J0414K1209M58k5374k5171j2875
17461D6206L303L9734J2341J7408k2323o683r84L8178K0459m199J667p835K9337
17448A66609K2818M5484L6775k8678l5518p934q471k6245J0674l2061O751K8763
$$ y = [114391, 76237, 76753, 106976, 139985, 115966, 71847, 85349, 92227, 110016, 130249, 99362, 91392, 85029, 109936, 119472, 81579, 55257, 38296, 32934, 49178, 74689, 88901, 80408, 83316, 71997, 87884, 112873, 134850, 116552, 78194, 89999, 122991, 152754, 124839, 72488, 68861, 78852, 81781, 69819, 37227, 16098, 67332, 81227, 67280, 10678, 36555, 63480, 82888, 125103, 106101, 54060, 14875, 25187, -2685, -31648, 8388, 57184, 38548, 2588, 19814, 40238, 42828, 67843, 50135, 41307, 77545, 87959, 109168, 109626, 84252, 59081, 46206, 49509, 89243, 101584, 118992, 96669, 89986, 89002, 127180, 147639, 143440, 145107, 137272, 166609, 189427, 234911, 271686, 243008, 207490, 199556, 191085, 164840, 175514, 143453, 150204, 178967]
17436A78967m1685m9267K049K4679J1846K8678M282k796j7127l9709l8723J411
17424F2605L2725L0611K4742L8226j1009j4294j8494Q895K0367k763p114p334
17412A57163K3076L3854l8583j4150r31M896K1319J6423J5172J9336j5346j0197
17400B12032k0180m0602J6577K1039J4904J754l0759k9768L331K4684R045j3306
17388A68751q68K2767M1927K6778M1021P0841M4644M3734Q627k1158J3789l5483
17376D25370j536R794P908K8444K6103K0172n649N589l3424j4347k6423k5464
17364D16537m1965l1875l952j205K0537L5256M0896k3255j6278m6073k294O321
17352C52650j8882j7631k0963m1041K1648P645j3694K4560J3551J0054j115L3097
$$ y = [178967, 137282, 88015, 90064, 114743, 126589, 155267, 159549, 156753, 139626, 99917, 61194, 62605, 95330, 125941, 150683, 188909, 177900, 163606, 145112, 154007, 174374, 171611, 164497, 157163, 180239, 214093, 175510, 161360, 160429, 165325, 186644, 203067, 218239, 237575, 222229, 212032, 191852, 151250, 167827, 188866, 203770, 205524, 174765, 144997, 148328, 173012, 182057, 168751, 167883, 190650, 232577, 259355, 300376, 371217, 415861, 459595, 468222, 447064, 460853, 425370, 423834, 433628, 441536, 469980, 496083, 516255, 510606, 516195, 482771, 468424, 442001, 416537, 374572, 342697, 338745, 337540, 358077, 393333, 434229, 410974, 394696, 348623, 346329, 352650, 333768, 316137, 295174, 254133, 275781, 283426, 269732, 294292, 307843, 317897, 316782, 349879]
17340C49879R670j746M3760M3522O294m482L7480O6380J16060R4144J1295j9017
17328G53239M251m0073o3956m0978j3107q0513l6134M8239K408J6897n513N8623
17316F03383N5592K0170L601M0468J8071p2497l6815j959o4012l0329j5637n4778
17304D65258m1537l8275k7295j2381P757J8019J4239j4101n989k972M20k5123
17292C38020k5229L51K5277N8527J4619k9969m069J6208J3272M3221P0811J8451
17280E39490J5949j1075k9391L6042J4832P584l9766n2993l393O2642L2229l7952
17268E34198k3678L0501P317r667l7197k4421K8238K1255L3117R612J7430m460
17256E82245k7060j4779j8755r082l4668r472k1499J7706O088L8339L3684K3577
$$ y = [349879, 359549, 357803, 401563, 445085, 451379, 446897, 484377, 550757, 666817, 760961, 772256, 753239, 757490, 717417, 653461, 612483, 599376, 518863, 482729, 530968, 533376, 550273, 544760, 603383, 658975, 679145, 682746, 723214, 741285, 668788, 631973, 630014, 566002, 535673, 520036, 465258, 423721, 385446, 358151, 345770, 353527, 371546, 385785, 371684, 365695, 362723, 363143, 338020, 312791, 313142, 338419, 396946, 411565, 381596, 377527, 393735, 407007, 450228, 521039, 539490, 555439, 544364, 514973, 551015, 565847, 573431, 533665, 480672, 477279, 539921, 572150, 534198, 510520, 541021, 548338, 538671, 501474, 477053, 505291, 526546, 559663, 569275, 586705, 582245, 555185, 540406, 521651, 512569, 477901, 468429, 446930, 464636, 470724, 509063, 542747, 566324]
17244E66324k2557l5394L34M7093M7898L6630k260J5190J8112K2869M628K2953
17232G21820M9049N1798M4129M9744K7832L3769K273M257j5971k5792K1216k0537
17220I43587l1043J0248M8926J5419N193N342K0892J4501J5130k558K7980O016
17208A079633K1894M7450O5345N0002J3250N4487J04092Q7008M4139L8533L3258
17197A639091P2174R6043P4384N2297J04472J91410L02293L49931L77016L87934
17187C647045L88698K89736K16087J44585P9364Q5901J34234K01490L28449M94293
17177F009882O25416Q28913J211780J659358K057305K270298J953165J181013
17169A7797130N98551K48806j22345n63589n60691j4543J047755K270903L768898
$$ y = [566324, 543767, 508373, 508707, 555800, 603698, 640328, 638068, 653258, 671370, 694239, 698867, 721820, 770869, 822667, 866796, 916540, 944372, 978141, 980414, 984671, 968700, 942908, 964124, 943587, 912544, 922792, 971718, 987137, 992330, 997672, 1018564, 1033065, 1048195, 1045637, 1073617, 1079633, 1101527, 1148977, 1214322, 1264324, 1277574, 1332061, 1436153, 1523161, 1567300, 1605833, 1639091, 1711265, 1807308, 1881692, 1933989, 2038461, 2229871, 2532164, 2882095, 3259111, 3647045, 4035743, 4325479, 4541566, 4686151, 4765515, 4851416, 4985650, 5187140, 5515589, 6009882, 6635298, 7464211, 8675991, 10335349, 12392654, 14662952, 16616117, 17797130, 18395681, 18644487, 18522142, 17958553, 17397862, 17383319, 18431074, 20701977, 24470875]
17160B4470875O105903R792084J4952907K0220456K2663270J9681815J2970769
17153A30858079O833279J481069n560042j4001802j8302444j7255867j3418401
17146G0633871r726881o172470k541733L08374J383759N78454r01360k121810
17138E1440204l235137m660342n731996n531039m322942l077547k160748j571162
17130B1149291j159514r16941q19508o47799m22983k55251j47929J4591K55463
17121A7049420O17642J081184J825755K931125M238821N316507N465221M315919
17113D2841594K667892J426356N48728k45581n61238Q05921L607408O816672R916449
17104F7824201J3122313J5828146J5526611J0448509K356759l971081q183190
$$ y = [24470875, 30576778, 40368862, 55321769, 75542225, 98205495, 117887310, 130858079, 137691358, 139172427, 133612385, 119610583, 101308139, 84052272, 70633871, 60906990, 54734520, 52192787, 52501161, 53884920, 54463374, 53562014, 51440204, 48205067, 43544725, 37812729, 32281690, 27958748, 24881201, 22720453, 21149291, 19989777, 19072836, 18253328, 17605529, 17182546, 16927295, 16779366, 16793957, 17049420, 17667062, 18748246, 20574001, 23505126, 27743947, 33060454, 38525675, 42841594, 45509486, 46935842, 47484570, 47238989, 46677751, 47483672, 51091080, 57907752, 67824201, 80946514, 96774660, 112301271, 122749780, 125106539, 121135458, 112952268]
17097A12952268j2290289j6782304j7991414j5089965j0666790o836281m267969
17090B9027256k738162j635771p56552j2677L44442K59389k50544o92686r82715
17081B2561980j313524j690320j838604j599292j235460r30246p18922o22825
17073A2612787o08592n72791n90188n92589n50850m98113m05692l34136l09254
17064H150582l14300k80967k32452k02264k18250k40297k44657k43762k09628
17055E964005k39578k07022j17752j83262k16060j57923j84903j73499j37087
17046D346919j52513j51059j07382q6871j32127r7345o4021o3856l5096j02774
17036C353875n1451l980m0272j09136o5566p8705m7986k4975M113j5816l0497
$$ y = [112952268, 100661979, 83879675, 65888261, 50798296, 40131506, 33295225, 29027256, 26289094, 24653323, 23896771, 23884094, 24228536, 24487925, 24237381, 23544695, 22561980, 21248456, 19558136, 17719532, 16120240, 14884780, 13954534, 13235612, 12612787, 12004195, 11431404, 10841216, 10248627, 9697777, 9199664, 8793972, 8459836, 8150582, 7836282, 7555315, 7322863, 7120599, 6902349, 6662052, 6417395, 6173633, 5964005, 5724427, 5517405, 5399653, 5216391, 5000331, 4842408, 4657505, 4484006, 4346919, 4194406, 4043347, 3935965, 3849094, 3716967, 3619622, 3555601, 3491745, 3456649, 3353875, 3302424, 3298444, 3258172, 3149036, 3083470, 3004765, 2956779, 2931804, 2935917, 2920101, 2889604]
17025B889604J704R4759R5750J06874K8223j9638n3342j23864j41176k00195j84129
17014B494570j73751j54148r8009r6498q6864r2261j19883m3120p2396o1947k3421
17003A472272k684k2767o6660o7032o8791n9972r5112o6754l7646j3363l5312
16992I36179j7593L0285J2964j8740j9342l0480k7785n9297k5022m2246l5803
16981G03120L3972k621l579k982n5856k7670K9460J9152L767j9404o5124o5005
16969E47230k2554k2764l1270O392N0686N086k7675q993q577m6668j4854R87j0452
16956D16574J7182J2339k0911k6415m1146l8732m6144l2979L8503n015k3773m6250
16944B03233M889R202k1999k256J3415K0000J4830k1516k3887m1874k1167n635
$$ y = [2889604, 2891308, 2986067, 3081817, 3188691, 3216914, 3197276, 3143934, 3020070, 2878894, 2678699, 2494570, 2320819, 2166671, 2068662, 1972164, 1885300, 1793039, 1673156, 1630036, 1557640, 1495693, 1472272, 1469588, 1446821, 1380161, 1313129, 1244338, 1184366, 1089254, 1022500, 984854, 971491, 936179, 918586, 948871, 961835, 943095, 923753, 893273, 865488, 806191, 781169, 738923, 703120, 737092, 734471, 730892, 727910, 672054, 644384, 673844, 692996, 696763, 677359, 612235, 547230, 524676, 501912, 470642, 477034, 527720, 532806, 505131, 496138, 487561, 440893, 426039, 427026, 416574, 433756, 446095, 425184, 398769, 357623, 318891, 272747, 239768, 278271, 273256, 249483, 203233, 208122, 217324, 195325, 193069, 206484, 226484, 241314, 219798, 195911, 154037, 132870, 127235]
16932A27235o3841n701K0268N3274r37n523l7783k995L5251M2195J3817j8595
16920A56665p4333j8280j7267L8138J4519O0950M6481l8512k7501P311J9317j7991
16908A49497l0260K0686L0624M088p407k2725l2169R274R168L5571M785l0124
16896A41008k4786Q840k1107j3245J1335j1110M6923O8197l0097m1731J8779R818
16884A62824m667q202J3378J7291p176n2821k5908M3810J9850l6068K246Q069
16872A32626o798o922O64m4777k1515J6056L8192N3386k4041l1847k6633j8382
16860F0009k656k564n23R644o059K8469j4029J1086k4018k3909K3084J2989P69
16847G2292J7787K0037P421l0309m3012k9618k2198P7526j6869j1173K2988k1375
$$ y = [127235, 63394, 57693, 77961, 131235, 130298, 124775, 86992, 83997, 119248, 161443, 175260, 156665, 82332, 64052, 46785, 84923, 99442, 160392, 206873, 168361, 140860, 148171, 167488, 149497, 119237, 139923, 170547, 174635, 167228, 144503, 112334, 121608, 130776, 166347, 171132, 141008, 116222, 125062, 103955, 90710, 102045, 90935, 137858, 206055, 175958, 134227, 153006, 162824, 158157, 149955, 163333, 180624, 173448, 120627, 94719, 138529, 158379, 122311, 124557, 132626, 125828, 118906, 119570, 74793, 53278, 69334, 107526, 160912, 136871, 105024, 78391, 60009, 57353, 54789, 54266, 63910, 57851, 86320, 72291, 83377, 59359, 35450, 58534, 71523, 72292, 90079, 110116, 117537, 87228, 44216, 14598, -7600, 69926, 53057, 41884, 64872, 43497]
16835D3497J055M6243j8046k2537J1732J3322K468l9847l597K2675J0179N216
16823G2360K532j5232m382N77k8608L339L7146J9275k0107j0931j4546J1500q566
16810D4357j4446J5202K1323J2330K434k9134j7737p350q097k6199j9273M366
16798b2224K8942J468j6647l6910J0463K7478j2612J6126M7762J3687q177k8817
16786B0539l2768k5697L4530O748n049K7651k5250k4719j3347j6394k4794k6397
16774a04947J8051J1354j6927J1178N2866K6531R498m9923N316Q660L9210L3791
16762D4658l7624l1001j9062j3007L5275K7381m904k7146k5813J3398N2718K3078
16750C7951J1486m400l9216j9174k4575J1685n790k3614k825K3519J0626M536
$$ y = [43497, 44552, 90795, 72749, 50212, 61944, 75266, 77734, 37887, 34290, 56965, 67144, 72360, 74892, 59660, 55278, 55855, 27247, 30586, 67732, 87007, 66900, 55969, 41423, 52923, 44357, 29911, 45113, 66436, 78766, 81200, 52066, 34329, 26979, 18882, -7317, -26590, -22224, 6718, 8186, -8461, -45371, -34908, -7430, -20042, -3916, 43846, 57533, 49356, 20539, -12229, -37926, -3396, 3352, -1697, 25954, 704, -24015, -37362, -53756, -78550, -104947, -86896, -75542, -92469, -81291, -28425, -1894, 7604, -42319, -37003, -28343, 10867, 44658, 7034, -23967, -43029, -56036, -20761, 6620, 1716, -25430, -51243, -37845, 14873, 37951, 49437, 45037, 5821, -13353, -37928, -26243, -32033, -55647, -58472, -34953, -24327, -19791]
16738a9791K406r60j402K1254L7658o227l2661n9490l5325R395K5306L6441M8378
16725B4982J649m3382J7305j2226m2888j3413j516m985J7247K2127J0505P056
16713a7539J5795P31j043j9526m7168J418J3605j0224j9440r740r345K9914K917
16700f9645q76L9033M2175m3751j2562l098k0595K5754K0436J7423N707J8725
16688A8726l1730o4076j6729K5089J1623L3049K6969K7744j648o759J569M504
16676B8331K8410M438N536l8369n069j6918J8272N9154O0051P0216O4607L1091
16664C09750M393J7947K3660l684l5608k4169L1832J4060k6339N35M4136L5650
16652C92163J6089p794l697k866m726m7410o3913m3156o0572l6697k3960J5607
$$ y = [-19791, -17385, -18345, -19747, 1507, 39165, 32938, 277, -59213, -94538, -85143, -59837, -23396, 24982, 26631, -16751, 554, -11672, -54560, -67973, -69489, -74474, -57227, -35100, -24595, -17539, -1744, -1013, -2056, -21582, -68750, -67332, -53727, -63951, -83391, -93131, -102476, -72562, -69645, -70521, -31488, 10687, -33064, -45626, -48724, -69319, -43565, -23129, -5706, 1, 18726, -13004, -77080, -93809, -68720, -57097, -24048, 2921, 30665, 29017, 22258, 23827, 28331, 56741, 61179, 66715, 28346, 23277, 6359, 24631, 83785, 143836, 214052, 278659, 309750, 314143, 332090, 355750, 352066, 316458, 292289, 324121, 338181, 311842, 312377, 356513, 392163, 408252, 400458, 396761, 393895, 389169, 341759, 277846, 234690, 174118, 137421, 113461, 129068]
16640A29068O800L3847m8031j2831J1222K5631k3015o048j1807j6890K7695k392
16628A13249l8675J1494J0953o057J958o275J6181N633L9038O0167O3353M6385
16616C17404O1505L3435k4461o054K3210J213j261k0046q2653q1778l3231k5077
16604A62206J0026J738J5441J3124k0026M8830M9297N6615N2290O24k220n3483
16592C34462m8532M424l6904r4963o8675k7424K2385J1860p067l1630K574K1477
16580H1987q306m4878n143j9023L379j901K843r892M047J933o770j0336K0819
16567H759J1219m3634o89M8359L387m0603o140k774j666M827L036K3448j4585
16554g056k5886k3614J9712J8298l4731l4261L933M0447K9814J0617l8641J872
$$ y = [129068, 135868, 169715, 121684, 108853, 120075, 145706, 122691, 116643, 104836, 87946, 115641, 113249, 74574, 86068, 97021, 90964, 92922, 86647, 102828, 108461, 147499, 207666, 271019, 317404, 378909, 412344, 387883, 381829, 405039, 406252, 404991, 384945, 302292, 220514, 187283, 162206, 172232, 173970, 189411, 202535, 182509, 231339, 280636, 337251, 389541, 390165, 387945, 334462, 285930, 290354, 253450, 158487, 89812, 62388, 84773, 96633, 89566, 57936, 60510, 81987, 73681, 28803, 23660, 4637, 8016, 6115, 8958, -934, 3113, 5046, -1724, -12060, 8759, 19978, -23656, -24345, 24014, 27401, -13202, -19342, -22116, -23782, -18955, -15919, 7529, -7056, -32942, -56556, -36844, -18546, -53277, -87538, -83605, -43158, -13344, -2727, -41368, -39496]
16542c9496j7235k0422M3391L8764o3080k637J2599n4051j1857M8901M3959k821
16530b3985R343k1894q1776J0295P748L5672K1351k4230J3159L1195J6034k3062
16518c0150q328Q196N1171j4853m8804n0211P787J7496Q96O538J1998j6631k2322
16505h7217j8021k5434L1916L7962l781R063J4432K0451J8092P896k5972l6505
16493e7118j6202J0358L8137l1446l0856J0023o676O138J3567o043l958l7786
16481a11862j0235M4000P6164J9144k5084K3536j2637k4686N729k3771n3724j7797
16469a11223K2499M6339Q781k624K054m0191o1969M617K4971M4476O945k5853
16457h1178Q329J3222L2089p098l5918j8460j3879j1155J2338N6937P890j1308
$$ y = [-39496, -56731, -77153, -33762, 5002, -58078, -60715, -48116, -102167, -114024, -65123, -21164, -23985, -14642, -36536, -118312, -108017, -100269, -64597, -43246, -67476, -54317, -23122, -7088, -30150, -38478, -30282, 20889, 6036, -42768, -92979, -85192, -67696, -66800, -60262, -48264, -64895, -87217, -105238, -130672, -98756, -60794, -64575, -55512, -41080, -20629, -2537, 5359, -20613, -57118, -73320, -62962, -24825, -56271, -87127, -77104, -83780, -77642, -64075, -70118, -74076, -111862, -122097, -78097, -1933, 17211, -7873, 15663, 3026, -21660, -15931, -39702, -93426, -111223, -88724, -42385, -33604, -36228, -34174, -74365, -136334, -131717, -106746, -62270, -55325, -81178, -72849, -59627, -27538, -34636, -70554, -89014, -102893, -114048, -101710, -44773, -36883, -48191]
16445d8191j8556k6842L1514L4444J6404j8652M293j2165m781O016m201K4384
16433a6333J809q325q462J482l0357P69k3748k6361k3170J2345N3546L9878o00
16420b7527p097L5120r73l1633k2376J6246j7596L855N1355O948j2864P856J9661
16407B0975J5419n886l7539j0049k5174K0113j6294j3406m670J176J3925j0640
16395e2050m730j5328J9397K2952l0628m3792J7222M3222J9355k6767j6763J497
16383f6413n822L357K0138j4255k9386M824J3208j6025l1682N208J2691O073k6240
16370a24324k4253J1789M6270L0904N692J3357k950j0794r172k1621j6756p831
16358a09689J1105K111M6911j8470K529K6915j3474l2814J3521K8726J4960j4350
$$ y = [-48191, -66747, -93589, -62075, -27631, -11227, -29879, -25586, -37751, -42532, -36516, -40717, -16333, -14524, -22849, -31311, -29829, -60186, -59417, -83165, -109526, -132696, -120351, -66805, -26927, -27527, -34624, 496, -477, -32110, -54486, -38240, -55836, -51981, -626, 6322, -6542, 1314, 20975, 36394, 30508, -7031, -17080, -42254, -22141, -38435, -51841, -56511, -55335, -41410, -52050, -56780, -72108, -52711, -29759, -60387, -104179, -86957, -43735, -24380, -51147, -67910, -66413, -72235, -68878, -48740, -62995, -92381, -87557, -74349, -90374, -122056, -116848, -104157, -98084, -124324, -148577, -136788, -90518, -59614, -53922, -40565, -43515, -54309, -63481, -85102, -101858, -109689, -98584, -96473, -49562, -68032, -65503, -38588, -52062, -84876, -71355, -42629, -27669, -42019]
16346d2019l3843j152L2211n842m544L1133l2954l0270k7086J9616M7276J8515
16334b8959J4967k1229k3243p953J7937J4881J6707M9883K4789p602m912l2221
16322A3045j7847M8931j2220k7096j6150K2511q439j3854k9011K0108n943m4063
16310g0028j1080M04l623J5307m773k6019K5203K9275p621m4842k1285J9101J9647
16297h0334K9952n925J5179k4331M71N636K1219Q948k0017m6542q948q398j3460
16284a26550L1161K822K5847L5416j2449j4754l0324Q679L9376L0241j7379p934
16272c5848K0253K1216r851j350j4859K156j0322j5717j5878J3860J6126J2666
16260a7548P289p256l9333j6815P510K1215l1968k2657K0718L0878Q547K3785
$$ y = [-42019, -75862, -77014, -44803, -50645, -55189, -24056, -57010, -87280, -114366, -94750, -47474, -28959, -13992, -35221, -58464, -66417, -48480, -33599, -16892, 32991, 57780, 50178, 45266, 13045, -4802, 44129, 31909, 4813, -11337, 11174, 2735, -11119, -40130, -20022, -25965, -70028, -81108, -80704, -84327, -69020, -73793, -99812, -74609, -45334, -52955, -97797, -119082, -99981, -80334, -50382, -56307, -41128, -65459, -64988, -59352, -38133, -29185, -49202, -95744, -104692, -113090, -126550, -95389, -92567, -66720, -31304, -43753, -58507, -88831, -80152, -40776, -10535, -27914, -35848, -15595, 5621, -4230, -5580, -20439, -18283, -28605, -44322, -60200, -46340, -30214, -17548, -10259, -17515, -56848, -73663, -66153, -44938, -76906, -99563, -78845, -47967, -39420, -15635]
16248a5635K3087k1006j6288r576l2156k6010K0102M1012O817q145k6664J8946
16236d5516j401O985L6971l7342j3892J4567p293j3601m833M5529J4879j5219
16224b0166m7204j8311L0419J9590L7566M7968N962k4633j1785j8304m4391M513
16212c8776M84K5275L517p466j318j8950o175J879L5418N717j496J6774r655L3636
16198C8864L617m4635k1322q305J6009r057k3058j3015K1859K3669m462j3594
16186c3430K9246J1960k5757j2953j3971P167m915L8182M6098K085k25k5790k6132
16173h435K9799J7571o48j1528n3491k1478L4502K0022k7892P689k0505J3738
16161b0656J0419k6250j7427n109K1778j0237J4449L758L012J5828j7480r846
$$ y = [-15635, 7452, -13554, -29842, -39418, -71574, -97584, -77482, -36470, -29653, -37798, -64462, -45516, -46917, -39932, -2961, -40303, -54195, -39628, -46921, -60522, -65355, -19826, -4947, -20166, -67370, -85681, -55262, -35672, 1894, 49862, 55824, 31191, 19406, 1102, -43289, -38776, -38292, -13017, -9500, -16966, -18284, -37234, -43409, -41530, -6112, -395, -1891, 14883, 5228, 38864, 42481, -2154, -23476, -31781, -15772, -24829, -47887, -60902, -39043, -15374, -19836, -33430, -4184, 7776, -17981, -30934, -44905, -37738, -42653, -4471, 41627, 43712, 43487, 17697, -8435, 21364, 38935, 38287, 26759, -26732, -48210, -13708, 6314, -21578, -13889, -34394, -20656, -10237, -36487, -53914, -59023, -37245, -47482, -33033, -29275, -26263, -10435, -27915, -37761]
16149c7761k1682l5468J1673J9654P946m313k6640j0182O183k0675N35L0956p654
16136h7428j6764J5434j8424M1734o04K2260J8854J0077L4115j9239j5437j5571
16124c0993j8496J6048o361J7574l0274M55j1324l0899j7552N683K0058K0722
16112f5359J317J8172Q312j9525n22p508J897M234o653j8283K0756L7104J6488
16099i570K5663j9380k3284l5550J1056q410j7698P085K6125j0269K396J9270
16087c2566K8659J6951n8234L3018L5418j9698k1361k0925j3292L469j3784K1925
16075d0420p058J3972L9382Q480k6056L4651L3784j4630m3377l5918k9762P930
16063e9022r4M209n40L6738k731K632K1027K672m2834R887M3891j5922O024L7714
$$ y = [-37761, -59443, -94911, -83238, -63584, -55638, -59951, -86591, -96773, -90590, -111265, -110730, -79774, -87428, -104192, -88758, -107182, -65448, -66052, -43792, -24938, -14861, 19254, 15, -15422, -30993, -49489, -33441, -39802, -22228, -52502, -52047, -63371, -94270, -111822, -106139, -86081, -65359, -64042, -45870, -37558, -57083, -57605, -65113, -63216, -58982, -65635, -83918, -63162, -26058, -9570, 16093, -3287, -26571, -62121, -51065, -59475, -77173, -70088, -43963, -54232, -51836, -32566, -3907, 13044, -45190, -12172, 23246, 3548, -17813, -38738, -52030, -48561, -62345, -40420, -47478, -33506, 5876, 14356, -11700, 22951, 56735, 42105, -1272, -37190, -66952, -59022, -59116, -54907, -55447, -18709, -21440, -18808, 2219, 4891, -37943, -28056, 15835, -87, 5937, 43651]
16049D3651l711k0106j8114m1552k4491j3645K5864J9010l5494q450K1077K1150
16037c4811K2918K640r915k0002j1347K1342K0100m193P811m0449m1019K602K5692
16024e8631N2906l5079p137K5686K393m32Q931R073J1199K174l9398o1928N189
16011h5054N9321J748k1382j3220n232n442N180M0165K7104j5162l5954J6237
15999c1691n269n0374j5203N6066j0448k3411j9687K3589K3995M6590J1535q789
15987c097l8844n5657R851j3638M2510N0278k7670j0050O679k8979k1689L5079
15975e5227N2399m1454j8569k0316K8972M528N9769k695m9914j3561m794J5022
15963d5840p396j4177L1966j7787m7681j5731O671K79k2814J3507L6157N5713
$$ y = [43651, 39940, 19834, 1720, -39832, -64323, -77968, -52104, -33094, -68588, -77038, -55961, -34811, -11893, -9253, -19168, -39170, -50517, -29175, -9075, -13268, -5457, -45906, -86925, -84323, -58631, -5725, -40804, -47941, -22255, -19862, -20294, -11363, -2290, 8909, 11083, -28315, -90243, -85054, -25733, -23985, -45367, -58587, -63819, -69261, -64081, -23916, 3188, -11974, -47928, -31691, -36960, -87334, -102537, -46471, -56919, -80330, -100017, -76428, -52433, -5843, 5692, -3097, -41941, -97598, -87747, -101385, -58875, -8597, -36267, -46317, -39638, -68617, -90306, -55227, -2828, -44282, -62851, -83167, -54195, -49667, 10102, 7407, -42507, -56068, -60862, -45840, -53236, -67413, -35447, -53234, -100915, -116646, -109975, -109696, -132510, -119003, -82846, -27133]
15951b7133j331P499j4551n361l4257o2881K8552L7444K9131j3032k295k1692
15939g9907j942N726J3441J5115O919q898L7068J8805k9451p729r788K5720j6237
15926c1158k1246L4497j7907o0705k8901O1084K307L817J3315J7278R758J1114
15914f747K393j1646o228j9515J2337L711J1350J3113q193L6217J6784K0638J5381
15901G9595n7088j3846r589k9798j5011j8373k517K3233K4244J0718J3425k7524
15889b2531l3665j8373R753j1103N217L2448K4058J5301k854k2796P255j3008
15877c0298k7763j0618K956j2590J8862j1567K3725J2631O215M436j2514k5966
15865f2491P552J9544j6280J4070j684k1852j4444l640L843p704J3787K9524m155
$$ y = [-27133, -28464, -20965, -35516, -40877, -75134, -138015, -109463, -72019, -42888, -55920, -58215, -79907, -81849, -76123, -62682, -47567, -40648, -49546, -12478, 6327, -23124, -30853, -40641, -14921, -31158, -52404, -17907, -35814, -96519, -125420, -64336, -62029, -58212, -44897, -27619, -17861, -6747, -4354, -16000, -22228, -41743, -29406, -25695, -14345, -1232, -9425, 26792, 43576, 64214, 79595, 22507, 8661, -928, -30726, -45737, -64110, -66627, -43394, -19150, -8432, 4993, -22531, -56196, -74569, -64816, -75919, -70702, -38254, -14196, 1105, -1749, -24545, -17290, -30298, -58061, -68679, -65723, -78313, -59451, -71018, -47293, -34662, -28447, -24011, -36525, -62491, -54939, -35395, -51675, -37605, -39289, -61141, -75585, -79225, -75382, -83086, -69299, -39775, -43930]
15852d3930O283j4877J6411j5110M987M1448k5313j5824k7652P584K4249q204
15840d9948j0376K9211j9556k7099q059K0945K1386R195j4976p716P426q746l561
15827f1874M359R149M4956j0617n7478j4557J3465J899L1071j2497j9451J4890
15815e6685l5299k1559J4050J9977K2013J9918K174k4726L5184J4624l2686o343
15803d9358J1716j1227l8411J4164K4025J1740j519o795K8952J6067l9326l883
15791d3855K7731K5092o3171l0617P392P38M4980L358K6948j0937j8136J4195
15779a6282J47o13n839l547L0317J9668l4472j7211J8584K385j1474m9343J1192
15766e6488j9188J0341j908k0442K2856L2037N5680l169j3276q703J4294L2527
$$ y = [-43930, -37647, -52524, -36113, -51223, -46236, -4788, -30101, -45925, -73577, -65993, -41744, -49948, -60324, -31113, -50669, -77768, -85827, -64882, -43496, -34301, -49277, -56993, -49567, -58313, -61874, -57515, -48366, -3410, -14027, -71505, -86062, -72597, -70698, -39627, -52124, -71575, -56685, -91984, -113543, -99493, -79516, -57503, -37585, -35411, -60137, -24953, -10329, -43015, -49358, -37642, -48869, -87280, -73116, -49091, -37351, -38870, -45665, -16713, -646, -39972, -43855, -16124, 8968, -54203, -84820, -77428, -76690, -31710, -28352, -1404, -12341, -30477, -16282, -16135, -16748, -22587, -26134, 4183, 23851, -10621, -27832, -9248, -6863, -18337, -67680, -56488, -75676, -65335, -67243, -87685, -64829, -32792, 22888, 19719, 6443, -2260, 12034, 44561]
15754D4561J726m9874k398l0934l5877j0410K158M8247J2064j2829j0435k078
15742d6079j0839K1205J7986r882J8471L128j0010j8938J5111Q826j2284L1279
15730G974L025j3495K6485k4238n9259k3648j385N1942K0592n034J8678k7101
15718b5464N565q173Q884l633K405M4627k316o289j7022j6159K486K7469R296
15705B1676j0516j3371l0951m7067J4902J0672O636L923J9356K2856j7801l8555
15693e8240l233J016j852J4822l044M678O167J1360p332p826k5768J3165L1976
15680b4111r750n613M533N092L0989p868k7227j0179j99K0292L3757J5261o896
15667A8081K8072j703m1295Q751k8681O364J9410j3664m546J6187J7294k1002
$$ y = [44561, 46287, -3587, -5985, -36919, -72796, -83206, -81048, -32801, -20737, -33566, -44001, -46079, -56918, -35713, -17727, -27609, -9138, -6010, -16020, -34958, -19847, -11021, -23305, 7974, 10999, -2496, 23989, -249, -59508, -83156, -84541, -32599, -12007, -17041, 1637, -25464, -19899, -28072, -19188, -22821, -20416, 24211, 21895, 15606, -1416, -17575, -15089, 12380, 21676, 11160, -2211, -33162, -80229, -65327, -54655, -48019, -44096, -24740, -1884, -19685, -58240, -61473, -60457, -62309, -47487, -50531, -45853, -39686, -28326, -35658, -43484, -69252, -56087, -24111, -33861, -39474, -34941, -29849, 1140, -6728, -33955, -44134, -44333, -24041, 9716, 24977, 18081, 46153, 44450, 3155, 11906, -16775, -10411, 8999, -4665, -9211, 6976, 24270, 3268]
15655C268l3779O265M2290O519q116q75o476r516K1946l344J2538J2304j110j5390
15641B6524j3321r738r86K5446j7867k5603K193j3289r157J860k7302l1834K22
15628i2852M2092K1963m433l0430M487L592k034K0415P579m3477l642L482J0764
15615f2494j2815l0994k8894P8217M7305M521J4025j1912N9j6923l2262L358K4468
15602b4341K4414J9440J5565k5733l0982j5122j3170k5349K1800K1858q901m767
15590d5288J9335j1543K4848Q374p48J5946k104j6959O765J5978k4804J5532k2187
15577a6855n087M0977j8838j1866j6558k7270j5083j577K8545K0957K6351K499
15565F195j0237J9690j1179j9982K0792r820j1189r529K736J7839J6491K0593
$$ y = [3268, -30511, -24246, 18044, 24563, 16447, 15572, 9096, -420, 21526, 18182, 30720, 43024, 41914, 26524, 13203, 3465, 2479, 27925, 10058, -15545, -13352, -26641, -35798, -33938, -61240, -93074, -92852, -50760, -28797, -33230, -63660, -59173, -55581, -57615, -37200, -29621, -73098, -76740, -73258, -62494, -75309, -106303, -135197, -56980, -9675, -5154, 8871, -3041, -2982, -19905, -52167, -48809, -24341, 73, 19513, 35078, 9345, -21637, -36759, -49929, -75278, -53478, -31620, -40521, -45288, -25953, -37496, -12648, -4274, -5022, 10924, 8820, -8139, -1374, 14604, -10200, 5332, -16855, -21942, 19035, 197, -11669, -28227, -55497, -70580, -72157, -43612, -22655, 3696, 6195, -4042, 15648, 4469, -15513, 5279, -4541, -15730, -25259, -22523, -4684, 11807, 32400]
15553C2400L0284r094l1902m8092l0883P066J7388k2585k5733p792j5603N7367
15541d7179J0051m342K4388L744p322m425j2054J4270J9891r800l5756K8028J5252
15528e254k3861J4950K8187K3517k3128l8157k7608l736L3119J897M615K0958
15516E499L766k1904K1803k8785N723K8302p500J2680j7643l6372J3881M0162
15504A9612l91K1281P072m6798n0905l1622J2526L6224M0489l0607k6540K9021
15492b0638N778k4334K6944K2960j8209K6700j3947l6024j1156J4420j2372K25
15480c9653K2769K5112K099P67k66J0510n927m0603K8409K5679l5925n4725k0119
15467h1873K6319k4253j0149J7820J7373J1611K2568p110L1406l0494N048J6422
$$ y = [32400, 62684, 53590, 21688, -26404, -57287, -50221, -32833, -55418, -81151, -88943, -104546, -47179, -37128, -41470, -17082, -13338, -20660, -25085, -37139, -22869, -2978, -12778, -48534, -20506, -5254, -29115, -14165, 14022, 37539, 14411, -23746, -51354, -55090, -21971, -20074, -15459, 5499, 9265, -12639, 9164, -19621, -13898, 14404, 6904, 19584, 1941, -34431, -20550, 19612, 19221, 40502, 47574, 776, -50129, -81751, -69225, -33001, 7488, -23119, -49659, -20638, -14860, -39194, -12250, 10710, -7499, 19201, 5254, -30770, -41926, -27506, -39878, -39653, -16884, 8228, 10327, 11094, 10828, 21338, 15411, -25192, 3217, 28896, -7029, -61754, -81873, -55554, -79807, -89956, -72136, -54763, -43152, -20584, -27694, 3712, -26782, -21734, -5312]
15455e312N688q64J9221j9653k8252J3972l813K4648M4774r081k4803r663J8026
15442B4888k0632P240J0986k0833P041K1252m508m0051R76j030J8596j4806j1275
15429b2156J640m608k4879L0426j614j6923L4143L0454J7406k1437j0069K0418
15417C2801j3404m8526l9354r54L8880R228M1992K1946l426n8671l5498K0614
15405c4372p483K217Q661j7980R249J593r691K3124J2505j2676m2402k9896J3767
15392h3384L0535L5223J3785q449N771L6905j7640m6788l6033K8933J0449K0692
15380a0001J1730J8719l8969l3685k210R357J0974L1626K418O422k9156l5324
15368e8099M8118R910l8164k497J0832K129M39k108r595J6469j1491K8217L490
$$ y = [-5312, 376, -488, 18733, -920, -29172, -15200, -19013, 5635, 50409, 41328, 16525, 6862, 24888, 4256, 11496, 22482, 1649, 8690, 29942, 25434, -14617, -13641, -14671, 3925, -10881, -22156, -20516, -25124, -50003, -19577, -21191, -38114, -3971, 26483, 43889, 22452, 12383, 32801, 19397, -29129, -68483, -69437, -30557, -21329, 20663, 42609, 39183, -19488, -54986, -34372, -41855, -39638, -30977, -48957, -39708, -38115, -47806, -24682, -12177, -24853, -67255, -97151, -83384, -52849, -17626, -3841, -12290, -6519, 30386, 12746, -34042, -70075, -41142, -30693, -10001, 1729, 20448, -18521, -52206, -54416, -45059, -34085, -2459, -41, 6381, -22775, -58099, -9981, -71, -38235, -40732, -29900, -27771, -27332, -29440, -39035, -22566, -34057, -5840, -2350]
15355b350p054k1599J2571k440k9301J7929J3671J5425J7474j8302j3598L7179
15343A9605K1843J959k3857N429J1343j0184j438j645j8224l7340m5831J5278
15331f3062M4348L3015j1409o626k0358J340j4837L7751K1405P689k8728l7786
15319c7258K597j565j269J6545j1183l592j165j0640j3749K0325R95J580J3522
15306b4857M1379K4506m5815K758K3921n640k7660k2018N086M655K0696M7431
15294D4442k4483o3326l7981J5644M9852R970J6177K3885j7898n5004o4186l9448
15282a42356L3611O4995O268l484L4961k7151m1207L4452M2570j3408J3049l7760
15270c5460o821q139l6524k6247N809M2171j7221j6048M1038K6921J9382n370
$$ y = [-2350, -9404, -31003, -18432, -20872, -50173, -32244, -18573, -3148, 14326, -3976, -17574, 19605, 41448, 43407, 19550, 24979, 36322, 26138, 24700, 23055, 4831, -32509, -78340, -63062, -18714, 14301, 2892, -3734, -24092, -22752, -37589, 162, 21567, 29256, 528, -37258, -34661, -36226, -37495, -20950, -32133, -35725, -36890, -47530, -61279, -40954, -39959, -38379, -24857, 16522, 41028, -4787, -2029, 21892, 16252, -11408, -33426, -28340, -23685, -2989, 44442, 19959, -43367, -81348, -65704, -15852, -5882, 10295, 34180, 16282, -38722, -102908, -142356, -108745, -43750, -37482, -40966, -6005, -33156, -74363, -39911, 2659, -10749, 2300, -35460, -42281, -50420, -86944, -113191, -107382, -65211, -82432, -98480, -57442, -30521, -11139, -16509]
15258a6509o520M2847o240j080J3959M559o604p812j803r062r121k9476k0834
15245e3696J0352q497J5412K6879o710j5300n455J547K8275K8482J3231Q765l2817
15232A0468J9714p461j5833p711K3772P140j0416m4374j3908K3354r000j3586
15220c7841J6995j2659m255j7138k162j8146L2989K2920L3199j2418k8703j1712
15208c8931j3164J7701k457J5290j3395j3382p392R564K5979J6906Q106K7579
15196C2404r908k6040p466J6081q528K9597L2585l6777k7487R865n2344J641M5074
15183a303J4144p120k288k0233l1996M051Q805J0641K5865q320j0466k1592m5989
15170h5801p539L1678L2162K8679J4242k5550L2374l29r65N410k7803j7542k413
$$ y = [-16509, -23029, 19818, 13578, 12498, 26457, 31016, 24412, 16600, 14797, 5735, -3386, -32862, -53696, -43344, -51841, -36429, -9550, -16260, -31560, -37015, -35468, -7193, 21289, 34520, 43285, 10468, 30182, 22721, 6888, -823, 22949, 30089, 19673, -24701, -38609, -15255, -24255, -37841, -20846, -33505, -37760, -54898, -57060, -75206, -42217, -19297, 13902, 1484, -27219, -38931, -52095, -34394, -36851, -21561, -34956, -48338, -55730, -46166, -20187, -3281, 4825, 32404, 22496, -3544, -11010, 5071, -3457, 26140, 58725, 21948, -5539, 4326, -48018, -46377, -1303, 12841, 5721, 3433, -16800, -48796, -44745, -35940, -25299, 566, -7754, -18220, -39812, -85801, -93340, -61662, -29500, -821, 13421, -12129, 20245, 19916, 18951, 24361, -3442, -20984, -23397]
15157b3397J3317l8061k8138J567J2167K9252K5322j3993L539N071L1093k0863
15145c124n783K6695N596j1824l327j9840O790j0518p054J8114J5168O159O151
15132B3203J9851O767O699P972P997j3066o1793Q510N1253n160j7177k0540j5724
15119a208J6338L5601M1527O022l4202k4674j5517P862j4565j8795n727J6399
15107I061m110k0660K0218J8995l9402J0254K0520j666k3835k5662K1669j2983
15095b7601J6563K9616j9833R403K7304k3255j332N924k4485r072K4834j2936
15083d870n0378k0979J5905j4654J7574l158K9087l946j4241m5205M7734N3449
15071F318n430r147K0446k2161K7555M1758L712o206O317K0059l7438l9674r775
$$ y = [-23397, -10080, -48141, -76279, -74712, -62545, -33293, -7971, -21964, -18425, -13354, 17739, -3124, -8907, 17788, 23384, 11560, 8233, -11607, -4817, -15335, -22389, -4275, 10893, 17052, 23203, 43054, 49821, 56520, 64492, 72489, 59423, -2370, 6140, 57393, 52233, 35056, 14516, -1208, 15130, 50731, 92258, 98280, 64078, 39404, 23887, 31749, 17184, -1611, -7338, 9061, 4951, -15709, 4509, 23504, -15898, -5644, 14876, 13210, -10625, -36287, -14618, -27601, -11038, 18578, -1255, 8148, 35452, 12197, 10865, 16789, -7696, -16768, 8066, -4870, -55248, -76227, -60322, -74976, -57402, -60560, -31473, -35419, -49660, -94865, -47131, 6318, 888, -8259, 12187, -9974, 17581, 59339, 63051, 56845, 63162, 83221, 45783, 6109, -3666]
15058c666l4691o19R166j0733j2673j2972Q550M0054Q706j5639K449K8318K4475
15045C0725K5927N283n6404n9455J3924J3980K7442n652j2295M489J3318j9662
15033a8380K0063l359J5275k1950k2224K1887J5615k4021p171K1862K615m516
15021d304L2979j0533k8867N63j368O441K2333K9379K19l0311j0631J5264L2372
15008E3536K5121N1345Q8364P2234P8565J27201K90512O22405P77326L12697j69151
14997B330155p3187J23595k22927p80242n26021k58056r9127o2168o6298m0690
14987C25034m2560p2175m1027N489N5634j8405l8087r751m3069j924O945r480
14975A16624l990J4538j6285j6599L863j6543j7755K0877J697N251k7306j1487
$$ y = [-3666, -38357, -38976, -29810, -40543, -53216, -66188, -57638, -17584, -8878, -24517, -22068, 6250, 30725, 56652, 61935, 5531, -53924, -40000, -26020, 1422, -4230, -16525, -12036, 1282, -18380, 1683, -1676, 13599, -8351, -30575, -8688, 6927, -17094, -24265, -2403, 212, -4304, 28675, 18142, -10725, -10162, -11530, -5089, 17244, 46623, 46842, 16531, 5900, 21164, 53536, 78657, 130002, 218366, 290600, 369165, 496366, 786878, 1409283, 2186609, 2499306, 2330155, 2256968, 2380563, 2157636, 1377394, 851373, 593317, 494190, 432022, 365724, 325034, 282474, 210299, 169272, 174761, 230395, 211990, 173903, 164152, 121083, 119159, 126104, 116624, 112634, 127172, 110887, 94288, 98151, 81608, 63853, 84730, 86427, 91678, 64372, 52885]
14963E2885R234k491L550r708K3354j0012k4086P731K9276L0528m2400l5355j6546
14950A5960L93J8549K5499R581K1713j6814m3960k4027K2235Q903L007m2589o71
14937b221J3540J7226J3382k924j245k2599J157O304k141j0621K5347J5903j5398
14924C5710m0464J4639J5109P93l6317k9804M3880J7910P032j510O97k1503j6233
14911a0061J2655M640J8009K9273o039n4337j5128k416k2755L8317N9658K5081
14899G6897m869L916m6618M57K4073P292k8383J2282J2990k7381J534J5670o809
14886D1051J528K8143Q265k5222k9763o182K7285J3280M804l6099l6606J6832
14874G316J130J3445L2267q967l4170J0045L5557j808l6530L071Q191l5446j205
$$ y = [52885, 62119, 59628, 63178, 53470, 76824, 66812, 42726, 50457, 79733, 110261, 67861, 32506, 15960, 16353, 34902, 60401, 69982, 91695, 74881, 30921, 6894, 29129, 38032, 41039, -1550, -2221, 11319, 28545, 41927, 39003, 37758, 15159, 16316, 22620, 20479, 9858, 35205, 51108, 35710, -4754, 9885, 24994, 25787, -10530, -40334, 3546, 21456, 28488, 26978, 27675, 6172, -10061, 2594, 7234, 25243, 54516, 48477, -5860, -20988, -23404, -46159, -7842, 51816, 76897, 72028, 75944, 29326, 29783, 53856, 61148, 32765, 45047, 58037, 30656, 32190, 47860, 41051, 42579, 70722, 78987, 53765, 24002, 17820, 45105, 58385, 63189, 27090, -9516, 7316, 8446, 21891, 54158, 45191, 11021, 21066, 56623, 54815, 18285, 21356, 29547, -5899, -7104]
14861g104l516j4857K5903J0873j454k8132J0471L7107Q264l8421M622o220j9336
14848b1800J5705j1500k3158j1733M6483O3650p9m919j0534k257l370J0439J882
14835D8809k4749k3415K9209r275k3901m39j4748k0022k561O513K1477K9681O827
14822B3406J5198j1621K9197L4776m4743o0336J2476K0054o317M842K452j2130
14810G254k8780l0611k6887K8596K5502N034N7416m365k0703K0806K2633l612
14798E2283j7630l7119J9778j8775j4115K4182k5618N23K7984J6164L6749j8597
14786D5809K1966K6288j3278n2135l4044k7699m177L908K5254r500l0866K3297
14774b5177L8338M493j8041l503l906j4113J267k9683J5481M4385J2356q02l0143
$$ y = [-7104, -10620, -25477, 426, 11299, 9845, -18287, -7816, 29291, 37555, -866, 3756, -2464, -21800, -6095, -17595, -40753, -52486, -6003, 57647, 57568, 52649, 42115, 39858, 36488, 46927, 48809, 24060, 645, 29854, 20579, -3322, -3761, -18509, -38531, -41092, -34579, -13102, 16579, 23406, 38604, 26983, 56180, 90956, 46213, -14123, -1647, 18407, 12090, 16932, 19384, 7254, -21526, -52137, -79024, -50428, -24926, -19892, 37524, 33159, 12456, 33262, 55895, 52283, 34653, -2466, 17312, -1463, -15578, 8604, -17014, -16491, 11493, 27657, 64406, 45809, 67775, 94063, 80785, 28650, -5394, -33093, -37270, -33362, -8108, -17608, -48474, -25177, 13161, 17654, -387, -3890, -7796, -21909, -20642, -50325, -34844, 9541, 21897, 21095, -9048]
14761i048K199K5171j5996j9180L3940n278L95j5336j147L6552L427j83J0997
14748D6513N149J401J7472k624m1935r889K0889J4331k8866k7302n112J6288n822
14735D93l0841J2204J9958R085l8588j4475J1967k5328k2492L4082K6790J8501
14723A356L4228l130l9380J6652l3817m1281n753N1939N9030K3470J4672k4697
14711E3289Q1k6369o981J7520M15l2092l1075R339K3794j0766R147q990k3553
14698b6241k2742k0591l8199J9550j2424Q206N2857O5682J237m1165k1460K720
14686c2570L0271k1064j3274K4183k3170n6691k9834L2273L1954J6246J3665N3408
14674B5397J7025K45j3179K7281L4616k0660k1279j1317m8266J3780L6450K680
$$ y = [-9048, -6849, 18322, 2326, -16854, 17086, 11808, 12203, -3133, -4280, 32272, 35699, 35516, 46513, 51662, 53063, 70535, 67911, 25976, 16087, 36976, 51307, 22441, -4861, -9973, 6315, 493, -30348, -18144, 1814, 10899, -27689, -42164, -30197, -55525, -78017, -43935, -17145, 1356, 35584, 32454, -6926, 9726, -24091, -65372, -71125, -19186, 39844, 63314, 77986, 53289, 53370, 27001, 20020, 37540, 37955, 5863, -25212, -15873, 7921, -2845, 6302, -2688, -26241, -48983, -69574, -107773, -88223, -100647, -92441, -39584, 26098, 27335, -13830, -35290, -32570, -2299, -23363, -36637, -12454, -35624, -92315, -122149, -89876, -57922, -41676, -28011, 25397, 42422, 42667, 29488, 56769, 91385, 70725, 49446, 38129, -10137, 3643, 40093, 42773]
14662D2773O620K4857J1609j8385n1095J1059N3234k0311k7090k459k017J941
14650C0736l3787k482J2221M7042p751q790L411J0000l7728l0133k4476j329N284
14637c7782L3493r406k8343J4107K5005j939j3391j3270j9342K0241K0804o554
14625a6377l980P64J075k7348M883J4505J7594J7179j0577J591L800K1480M957
14612B9546M617o143m6567m3025r176k2360J9146L7716N0184J6184p64j4287l0003
14599a4932k0057P288j8750J4488J9133L1427K7649P26k1009j8167r032m4042
14587d5278o758K0643j5051j5049k4949N75L719K5554N2632O9566K0206r149k7479
14574D9182m3740J182M0730J1453j9226n6274n1873k9137J6418L1638J9256M349
$$ y = [42773, 49393, 74250, 85859, 67474, 16379, 27438, 80672, 60361, 33271, 30812, 28795, 30736, -3051, -5533, 6688, 53730, 45979, 37189, 40600, 50600, 12872, -17261, -41737, -43066, -37782, -4289, -13695, -42038, -27931, -2926, -4865, -18256, -31526, -50868, -30627, -9823, -16377, -20357, -19593, -18518, -45866, -40983, -26478, -8884, 8295, -2282, -691, 3109, 24589, 29546, 34163, 28020, -18547, -61572, -70748, -93108, -73962, -36246, 13938, 30122, 29358, 15071, -14932, -34989, -27701, -46451, -31963, -12830, 18597, 46246, 46972, 25963, 7796, -1236, -45278, -52036, -31393, -46444, -61493, -86442, -85867, -82148, -56594, -3962, 65604, 85810, 76661, 49182, 5442, 6624, 47354, 58807, 39581, -16693, -68566, -97703, -81285, -49647, -30391, -26042]
14562b6042k73K2025J5538K2635l3147l5196k1686j3268J2102j971M987j4054
14550f8350Q028M0019r160L1689J6745n415l265l744j6247l0293j9943K5387J5449
14537a9100K0441J5795q595j7046n541O862q863r542J7508L7010l228l1567j6506
14524b2372r380M6853K1846J931K3282j4620q48M749l1681k881M5692k5921m0239
14511c589K733N224J5856K9714N959K23j9842m701J1584j214K579M884O224m0
14497E5594m0597k3502k6766J1744P0154J034P114k2234j9653j7764j9088Q252
14485a5712k4334P609L7988K8799R489O526l1693m928k5946J598j9117K145O53
14472b6923j3654K5150Q700j3609l0308K3247N4424L8088j6762j6877l9733n9789
$$ y = [-26042, -26315, -4290, 11248, 33883, 736, -34460, -56146, -69414, -57312, -59283, -54296, -68350, -60322, -20303, -29463, 2226, 18971, 13556, 10291, 6547, -9700, -39993, -59936, -34549, -19100, 1341, 17136, 8541, -8505, -14046, -7184, -16047, -25589, -8081, 28929, 25701, -5866, -22372, -31752, 15101, 36947, 38878, 62160, 47540, 46692, 51441, 19760, 16879, 62571, 36650, -3589, -856, 4368, 20224, 49938, 55897, 56120, 36278, 31577, 43161, 41947, 44526, 49410, 55634, 55594, 14997, -8505, -35271, -23527, 46627, 47661, 54775, 32541, 12888, -4876, -23964, -15712, -40046, -32437, 5551, 34350, 43839, 50365, 18672, 13744, -12202, -10604, -29721, -27576, -26923, -40577, -15427, -6727, -20336, -50644, -27397, 27027, 65115, 48353, 31476, -8257, -68046]
14460f8046p318J9140j6901M987Q5532K7551l0573L97N851K790L057j0554j5867
14447D6j1213M114L090l9607k7246j5817K1106M3970K8130M8550l621o2393P462
14434c429L6521K2348J5931l3601r61m9559k9423J0322K8547j3397Q828K3815
14422A5942k4539o585r99J7540O428j7462j8463j7643L0963j4943Q13K4933j6226
14409b0241J1098j2518J3255J7072j8948j5120J7288m674J0729K5227J7605j3367
14397B7406J766J0132j372m2630j1433N0307l13k3802L769J1280r663j585n0026
14384c6164n517K2205k3145J9560M0427L732j7320P831p819K4429J1773K1461
14372F1453K5530k1186o477o678j4965J6521j9504j1475k168J2188k393m4193
$$ y = [-68046, -75364, -56224, -73125, -68138, 17394, 44945, 14372, 14769, 20620, 23410, 26467, 15913, 46, -11167, -7053, -3963, -43570, -70816, -86633, -65527, -21557, 6573, 55123, 51502, -10891, -3429, 33092, 55440, 71371, 37770, 36809, -12750, -42173, -31851, -3304, -16701, -7873, 15942, -8597, -15182, -16181, 1359, 7787, -9675, -28138, -45781, -14818, -29761, -28948, -4015, -20241, -9143, -21661, -8406, 8666, -10282, -25402, -8114, -12788, -2059, 23168, 40773, 27406, 29172, 39304, 37932, -4698, -16131, 34176, 33863, 10061, 13830, 25110, 15447, 13862, -36164, -41681, -19476, -42621, -23061, 17366, 21098, 3778, 11609, 3790, 28219, 39992, 61453, 86983, 65797, 59320, 52642, 37677, 54198, 34694, 23219, 21051, 33239, 30846, -13347]
14360a3347Q445R54J1655J5405K3865J7211m498m613k921k1774k3963r246p926
14347a0753j0429k3208l399P54M2262K148J1578J3311K0086j459J2234L4639j2392
14334G5372j6833K4399k325m0758j3291K5478j3969l3372J1788K3201J105p147
14322C3648J1150l6748K0280L0493j5299l4040N286J8252N7588K5637l9169l8118
14310C8960l7995O080Q387J0746J3784q836k0634K252j506m539p05K0509J8884
14297D5387J3734l8390J3428M506o626n0079K1359J9150k1559j6382J5209J162
14285H99R092j2549O0864J937n894k3470k7920p347k405P915M468L8973J5024
14272E9587j9364K0449k9909k1169j5807k271K7339J4820j2720j0913L0953O058
$$ y = [-13347, -4902, -3948, 7707, 23112, 46977, 64188, 59690, 55077, 52156, 30382, 6419, -2827, -10753, -21182, -44390, -47789, -47035, -4773, -2625, 8953, 22264, 42350, 40891, 53125, 87764, 75372, 58539, 82938, 80613, 39855, 26564, 52042, 38073, 4701, 16489, 39690, 40795, 33648, 44798, 8050, 28330, 58823, 43524, 9484, 14770, 33022, 90610, 116247, 77078, 38960, 965, 7045, 15432, 26178, 39962, 31126, 10492, 12744, 11238, 6699, 5994, 26503, 45387, 59121, 20731, 34159, 38665, 32039, -18040, 3319, 22469, 910, -15472, -263, 899, 9991, -2558, 58306, 60243, 54349, 30879, 2959, -4388, -6793, 1122, 5590, 44563, 59587, 40223, 60672, 30763, 9594, -6213, -8484, 18855, 33675, 20955, 10042, 40995, 47053]
14260D7053k2543j0238O36j0630K794j9633j9822l965Q027J4400K2746L5810R127
14247E3762k865N886R679M282J7541l8223Q636K2470J8246p484l3249k1156M945
14234D2470j7339j4670J1852K885j3615J1926J4159J6021J0585L0530J2297n0583
14222E6518j8786J5861k0984k0256K2297Q122o109j5230j3813L2722n374m4819
14210i851L0402N6864K6503m4460k7620J7887p768j2418k1209j2672L431K2269
14198B1358j8114j3777J4722J8469j2689l2328q105k3621K5374N2262N6509j7535
14186F2525o807l8968j5582J6158o064J469l6907l4003L8114K6396K3854J0121
14174D0306K031J2701O700O869R521k0865O899N102l2348j9737L9682K7837l9173
$$ y = [47053, 24510, 14272, 14908, 4278, 7072, -12561, -32383, -36348, -28321, -13921, 8825, 44635, 53762, 50897, 56783, 66462, 70744, 88285, 50062, 58698, 81168, 99414, 91930, 58681, 37525, 42470, 25131, 10461, 22313, 25198, 11583, 23509, 37668, 53689, 64274, 94804, 107101, 56518, 37732, 53593, 32609, 12353, 34650, 42772, 36663, 21433, 7620, 40342, 34968, -9851, 20551, 77415, 103918, 59458, 31838, 49725, 41957, 29539, 8330, -4342, -911, 21358, 3244, -10533, 4189, 22658, 9969, -22359, -30464, -54085, -28711, 23551, 80060, 62525, 55718, 16750, 1168, 17326, 11262, 12731, -24176, -58179, -20065, 6331, 30185, 40306, 42337, 55038, 61738, 68607, 78128, 57263, 64162, 69264, 36916, 17179, 56861, 84698, 45525]
14161D5525m5800r030J4863K5716R828j2362L5052L4041k3376k521l0924o1518
14149b0506m378J4297M0520L9547P201l312q952j8794m034J353p038q466M236
14136C1674L3096k1403n4845q32K7604K0167J3864J4587K0335j3926k4651n216
14124D0454j675n2462l9656K4238m26J1585J9049J1681p473J7543J5407k3866
14112A4399J8965o571l162j1506K269K8957K4415k0353m21n3340l1648M4561K1569
14099B8134N9735O741n4234q494m948J4523N1423m2817p8116m475L4408M5826
14087D7706O119J4525q74k3029k1375J8573j5248k0760k4670J217J3555k1366
14075b5627Q153J6422j3861L8616N1484k8092J018M518l2814j7248J5462N542
$$ y = [45525, -275, -9305, 5558, 31274, 41102, 28740, 63792, 97833, 74457, 71936, 41012, -20506, -24884, -10587, 29933, 69480, 76681, 73369, 64417, 45623, 41589, 42942, 35904, 27438, 31674, 64770, 43367, -11478, -12310, 15294, 35461, 49325, 63912, 84247, 70321, 45670, 40454, 38779, -13683, -53339, -29101, -29527, -17942, 1107, 12788, 5315, 22858, 38265, 14399, 33364, 26793, 23631, 12125, 14394, 43351, 67766, 47413, 46992, -6348, -37996, 6565, 28134, 87869, 94610, 40376, 31882, 26934, 41457, 92880, 50063, -28053, -32528, 1880, 47706, 53825, 68350, 67476, 44447, 23072, 41645, 26397, 5637, -19033, -17816, -4261, -25627, -17474, -1052, -14913, 23703, 75187, 47095, 48113, 52631, 19817, 2569, 18031, 23573]
14063B3573M501Q965r530M1076K9587n0074k9399J5619j052J3246K9997K0136
14051I6645m9880p103J5300j9163k0234l8580j2674l4346K0056J8993j700M7520
14039A4834K0727P37l1352J1127K0181j5435l860L2320j8696J5972M9066L300
14027I8921q165j752j0747j5698k99l7269r871l4154J0736K5746J6205K9713R416
14014G2782k2215R359m7225J3612K5195m6990k0175L7352L6624k1656j7741j5952
14002B970j8277m523J2834K0401J2303L6837q44J446L65J675J1465J3546L164
13989I3362p848l2661k4717k8045L8068K2867J4449l7462k5045L5756R595k514
13977E5805J6332K4813j5090j4618K0353K3869r05k2381m1664k197J2512M1516
$$ y = [23573, 28074, 37039, 27509, 68585, 98172, 48098, 18699, 34318, 33266, 46512, 76509, 96645, 46765, 39662, 54962, 35799, 15565, -23015, -35689, -70035, -49979, -30986, -32686, 14834, 35561, 36298, 4946, 16073, 36254, 20819, 16959, 49279, 30583, 46555, 95621, 98921, 90756, 89004, 78257, 62559, 62260, 24991, 15120, -19034, -8298, 17448, 33653, 63366, 72782, 50567, 59926, 12701, 26313, 51508, 4518, -15657, 21695, 58319, 36663, 18922, 2970, -15307, -19830, -6996, 13405, 25708, 62545, 61701, 63147, 63512, 65187, 76652, 90198, 93362, 85514, 52853, 28136, 91, 38159, 61026, 75475, 38013, 12968, 48724, 58319, 55805, 72137, 96950, 81860, 67242, 87595, 111464, 110559, 88178, 46514, 44317, 56829, 98345]
13965I8345L565r191l1723K9814n324l1951k2066m5451P419L1995M333k920K1393
13952D8238j1062k1763k3344K8505L5690p080l8135P989O380l25k7857L6750J1004
13939D4990K1820K3091K6269j2101J7873O302k0614j6784l4995o0300k1827O9866
13927D3590k591j465q533k793l3902q334j6080K6209O4618M9562J3335p1734l1335
13914B0547q397M6265j4246K6996Q185l6113k817r873K1808K8416o000j677N343
13901G8437K6213L5221j7443k2965k6116k3828K3712j692k5916K1589J5072K2899
13889A05183j2804J9606j5838j7144k4258k4902k820K7114J7177M94J9679o495
13877H4992l2421K8911M319L404j9406K3329J2120L766j5997o149j4620k1415
$$ y = [98345, 101910, 92719, 60996, 90810, 85486, 53535, 31469, -13982, -6563, 25432, 29765, 26845, 48238, 37176, 15413, -7931, 20574, 56264, 49184, 11049, 19038, 25418, 25093, -2764, 33986, 44990, 66810, 89901, 116170, 104069, 121942, 128244, 107630, 90846, 55851, -4449, -26276, 43590, 40999, 39534, 31001, 28208, -5694, -14028, -30108, -3899, 60719, 110281, 123616, 51882, 20547, 12150, 58415, 44169, 71165, 79350, 43237, 40420, 30547, 52355, 80771, 74771, 73094, 78437, 104650, 139871, 122428, 99463, 73347, 49519, 73231, 71539, 45623, 67212, 82284, 105183, 92379, 111985, 96147, 79003, 54745, 29843, 27023, 54137, 71314, 71808, 91487, 84992, 52571, 81482, 85801, 89205, 69799, 93128, 105248, 109014, 93017, 86868, 72248, 50833]
13865E0833j5902P442p080j2539j4208j3334K2063Q098K456J9602K2099k355m2930
13852B4245l570R1566r458p2529k1469L1863M2218J1620j5966J4795j452n0061
13840D1802K447J1505L3268j981m8865Q36K9185N4514L6145l2475m0275n185P310
13827H8231r811o604M1520M7210R686l0086r402L2770K4889J7395M1835P503J1928
13814B67064N7606L3207l1840m8691j4090K5522j6053j8740l8036l8412k1158
13803A56379L786K0276l3106o681K3946o111j9602J152k0032K0500l396n040L6634
13790A68705j807m4215k0993K0450n951l9556j333j9711q34j707N1450J6978k2607
13777I8869k1503j775J3453K5238J9071K9940J32q274j6082l0914M429l382n430
$$ y = [50833, 34931, 42373, 35293, 22754, 8546, -4788, 17275, 25373, 27829, 47431, 69530, 67175, 24245, 20675, 112241, 102783, 30254, 8785, 40648, 82866, 94486, 78520, 93315, 91863, 41802, 44249, 55754, 89022, 87041, 38176, 39012, 68197, 122711, 158856, 126381, 86106, 80921, 88231, 78420, 71816, 113336, 160546, 170232, 140146, 130744, 163514, 188403, 205798, 247633, 255136, 267064, 324670, 357877, 326037, 277346, 263256, 288778, 272725, 253985, 215949, 177537, 156379, 160165, 180441, 147335, 140654, 164600, 158489, 138887, 140039, 120007, 140507, 137111, 132071, 168705, 166898, 122683, 101690, 122140, 116189, 76633, 75300, 55589, 54755, 53048, 104498, 121476, 98869, 77366, 75591, 89044, 114282, 133353, 163293, 163425, 155151, 139069, 108155, 112584, 109202, 103772]
13764A03772K0626J3519q86j8597m278M19k9414N293L0260k3512m099P715j0539
13751I0279l5053j8772M4736K3526j7808m031J7685Q345J4448O55j8879k834j1050
13738I1247l4644L199M3868R984m1258k5858j9072K7668J7263K5995K12Q221J3078
13725A19903m9891k3995N568J1992j7469K5773J4884j77j2807k7161j0884J3315
13713D9051J0506J1997k0377N991j1005j5644J6757k8000J8118N028J3086K8568
13701H4076J0703K678q610k0256j6419j2021j3400L1580J8383L350k4956k2686
13689C2422o943k8996j5419K6867M4581N5363K6021l0240k4027l1525l8771J3885
13677B3218K7829J3688k0034n958J7547M418J4632J5487m308j5638p414J6547
$$ y = [103772, 124398, 137917, 137031, 118434, 114156, 114575, 85161, 90454, 120714, 97202, 93103, 100818, 90279, 55226, 36454, 81190, 104716, 86908, 82877, 100562, 108907, 123355, 124010, 105131, 102297, 91247, 56603, 59802, 103670, 113654, 72396, 46538, 27466, 55134, 72397, 98392, 98604, 106825, 119903, 70012, 46017, 51585, 63577, 46108, 71881, 86765, 86588, 73781, 46620, 35736, 49051, 59557, 71554, 51177, 57168, 46163, 30519, 47276, 19276, 37394, 42422, 55508, 84076, 94779, 97457, 88847, 68591, 52172, 40151, 26751, 58331, 76714, 80064, 55108, 32422, 25479, -3517, -18936, 7931, 52512, 107875, 133896, 103656, 79629, 48104, 9333, 23218, 51047, 64735, 44701, 38743, 56290, 60708, 75340, 90827, 86519, 70881, 63467, 80014]
13665H0014R425j9698N858j0719l6159M519J4820K8916j2236k8564J7724K8179
13653H2079J1078J8332P362l5507n413K3643j7434Q077j973k7933L630k587j449
13640F1905P272M549j6639K4528M1039l2353l037L5380Q972l1663j6656l9131
13628D4166R510M9315n127j9610k0913j9812N933l3547J6709J1655n298K0981
13616E3962N35J6528L60m827j2314k1954O089j2998N190J1897L3842M2068O700
13603A25078k6830l0365m330l6746l443O0846j0604l3665k2840J9111J3760L0403
13591H0375n28p646L6202j3033m859J9384p722J3062l885k7252O820K1440j9532
13578I2826j7763j0041k0671K2124J3706L8037M0748k2056j8286M359K0181M0159
$$ y = [80014, 89439, 69741, 75599, 64880, 28721, 33240, 48060, 76976, 64740, 36176, 53900, 82079, 93157, 111489, 118851, 83344, 77931, 101574, 84140, 92217, 90244, 62311, 65941, 63354, 61905, 69177, 73726, 57087, 81615, 122654, 90301, 87264, 122644, 131616, 99953, 83297, 44166, 53676, 102991, 97864, 78254, 57341, 37529, 43462, 9915, 26624, 38279, 32981, 53962, 54497, 71025, 71385, 66558, 54244, 32290, 38379, 25381, 30571, 42468, 76310, 118378, 125078, 98248, 67883, 63553, 26807, 23364, 84210, 73606, 39941, 17101, 36212, 49972, 80375, 79847, 72201, 108403, 95370, 90511, 109895, 102173, 115235, 111350, 84098, 90918, 112358, 92826, 75063, 65022, 44351, 66475, 80181, 118218, 158966, 136910, 118624, 122983, 143164, 183323]
13566A83323l6503j7219k3571m1809m8050Q324M2963L0055J634j6678J383k954
13554H0898K6867L7743Q376j0506J6967r804j5089n634j2657J559K4391K2496
13542A65607J4288J0872j0180Q017O194m3419j8808L010k1066p451j1115r909
13530H6040J4204J3241o507k0283K464k8896j4259K9291L0486K5157J6340k9596
13518A17682K231j3730l1289m5385J5154J1833L6277J1270j8889J6209J5016J9634
13506A36013l930J0376J5805k0072M672K8892k427l3149n379j7032l6206L9032
13494A16595M1966k2061m970L5671N750O310M0151K3588k5473J8062L9574J4266
13482B89429l1965m9510j1987k5794p6546k030K1988J4272j6599k1574j2837M1036
$$ y = [183323, 146820, 129601, 106030, 64221, 16171, 24495, 67458, 97513, 99147, 82469, 83852, 80898, 107765, 145508, 153884, 143378, 160345, 150541, 135452, 129818, 117161, 118720, 143111, 165607, 179895, 190767, 180587, 188604, 194798, 151379, 132571, 135581, 114515, 107064, 95949, 86040, 100244, 113485, 106978, 86695, 89159, 60263, 46004, 75295, 105781, 130938, 147278, 117682, 119913, 106183, 74894, 29509, 44663, 56496, 92773, 104043, 85154, 101363, 116379, 136013, 132083, 142459, 158264, 138192, 142864, 171756, 169329, 136180, 130801, 113769, 77563, 116595, 158561, 136500, 131530, 167201, 172951, 179261, 219412, 243000, 217527, 235589, 275163, 289429, 257464, 207954, 195967, 170173, 93627, 91597, 113585, 127857, 111258, 89684, 76847, 117883]
13470A17883K7764K0364p45j9855o176J8267j2829m480J8990k5198j4322q326
13458A11337k239l1281L042J5619K6237J809K4206J0793l4003l8840M8403M6077
13446A81160j4430m3459j1877j920J4938K9427J297K2725j8094j1091J735j8380
13434A32031K11L9674J9813k1117o5341k6650j1324J631M2799R972M438N0404
13422A76541j967j314j6339n7962n7771J5709k153J0777K1653J2455j1557L4015
13410A22087J6660K0805K2338r758k7251k1616j1749L151J3110n397K3467P943
13398A53790m1432j8703J6618N097J7627J5163K6270p064r704N381L2839K0186
13386B16068j9176k1187k314L4531j794j7861L262N608J104j4236q263n908l1609
$$ y = [117883, 145647, 166011, 165266, 145411, 139235, 157502, 144673, 140193, 159183, 133985, 119663, 111337, 109098, 77817, 80859, 96478, 122715, 124524, 148730, 159523, 125520, 86680, 135083, 181160, 166730, 123271, 111394, 109474, 124412, 153839, 155136, 177861, 159767, 148676, 150411, 132031, 132242, 171916, 191729, 170612, 105271, 78621, 67297, 68928, 111727, 121699, 126137, 176541, 174574, 173260, 156921, 98959, 41188, 56897, 54744, 65521, 87174, 99629, 88072, 122087, 138747, 159552, 181890, 172132, 144881, 123265, 111516, 114667, 127777, 122380, 145847, 153790, 112358, 93655, 110273, 115370, 132997, 148160, 174430, 167366, 157662, 163043, 195882, 216068, 196892, 175705, 173391, 207922, 206128, 188267, 191529, 197137, 198241, 184005, 175742, 169834, 138225]
13373A38225k5465k1615j2683l084K3188m480J5599K6174l1784j1020K5388L3203
13361A51646L0400K9072J2659l8902m1635k3764n748N3358L6176J9488Q706k2776
13349B08680j1138j8613q005L159J6476j752K1111K650m3572m7254j1568n840
13337A04334Q758K438q533R699N8572j6422p390q687J723r64j3053j020j915L1684
13323A59224p864q356M548J506j6166N934l4448L766L5053p3r055p900J8543K0967
13309A65679q334K1871j1884j2481k950N0868J5342Q960j2983m790k1655j6587
13297A71056j0346j6334k8006K1928L5557j574k0645L0550J5932j7228k4563l3287
13285A23040k536K2496N514l796l452J5439o415N082l986K042N5345J3106k962
$$ y = [138225, 112760, 91145, 78462, 75378, 98566, 94086, 109685, 135859, 104075, 93055, 118443, 151646, 182046, 211118, 223777, 184875, 143240, 119476, 113728, 167086, 203262, 222750, 231456, 208680, 197542, 178929, 170924, 174083, 190559, 188807, 209918, 212568, 168996, 121742, 110174, 104334, 113092, 115530, 106997, 116696, 175268, 158846, 151456, 142769, 144492, 143528, 130475, 129455, 127540, 159224, 151360, 143004, 147552, 149058, 132892, 138826, 104378, 108144, 143197, 143124, 134069, 126169, 144712, 165679, 157345, 179216, 167332, 154851, 151901, 202769, 218111, 227071, 214088, 209298, 187643, 171056, 160710, 144376, 116370, 138298, 173855, 172281, 151636, 182186, 198118, 180890, 156327, 123040, 120504, 143000, 148514, 144718, 141266, 156705, 150290, 155372, 151386, 153428, 208773, 221879, 218917]
13272B18917J5174K9168j9180l6059j7399L377L529L6756m664j5349j1488K1857
13260B24639N522R746M3141M5107K60M891j0387j1763J6367K8868j0296M0084
13248C86179M7564L2102O9289P6313M0967O5502P3649M9455M0866O5636L4648
13237I82170J4642M7278O4198J5965K8486J2036j7467l7898o8850l7856k2305
13226I80399Q416J026l0205j1514P980J4577k981k3180K1887j072J1198R49j3905
13213I63575j5487M7703O6245L3339M1795M6355M6163N5388N1115l670O018j3198
13201A325341k3956q0446n3343k9897o5006p8575m2734n1938m5554n2785o8007
13190G33100m2202n8455n7833p8913l3997k3103j5783l9429m8267M7899M5378
$$ y = [218917, 234091, 263259, 244079, 208020, 190621, 193998, 197527, 234283, 229619, 214270, 202782, 224639, 230161, 239907, 283048, 328155, 328415, 333306, 322919, 311156, 327523, 356391, 346095, 386179, 433743, 465845, 535134, 611447, 652414, 717916, 791565, 841020, 881886, 947522, 982170, 996812, 1044090, 1108288, 1124253, 1152739, 1164775, 1147308, 1109410, 1040560, 1002704, 980399, 988815, 989841, 959636, 948122, 956102, 970679, 967698, 944518, 966405, 965333, 976531, 977480, 963575, 948088, 995791, 1062036, 1095375, 1137170, 1183525, 1229688, 1285076, 1336191, 1332521, 1338539, 1325341, 1301385, 1220939, 1167596, 1137699, 1072693, 994118, 951384, 899446, 853892, 801107, 733100, 690898, 632443, 574610, 495697, 461700, 438597, 422814, 383385, 335118, 383017, 428395]
13179D28395M275L0613J70j7881j5094J1615l2347o1082j0102O044p924j23L817
13166C40376l4642Q32L0199l860n719m845R640p366J2651n03J3637k2997n1999
13153B75404k8425M818L9554o935L6526K3721j3718J392k3402N596Q904Q221l4940
13140B96716k8072K7168j7268J1730l4989k4098M548L2430j6792K671R448l6699
13128B26793O064M3886K9528N8962j0094j7129l5418k8704j3579N02j5866j5339
13116B29606O627M6495J9895l3737m9355K3592K6301m999n107J5097m351Q851
13104B78915M080J964o429J3873N93j2561j6605k7423j622K3675L9504J6755K2259
13091C36978o753J4887j0453k9254l121k0309j174k446k0928N773L9921J9310
$$ y = [428395, 432670, 463283, 463453, 445572, 430478, 442093, 409746, 348664, 338562, 344606, 336682, 336559, 340376, 305734, 306566, 336765, 332905, 327186, 322341, 331981, 324615, 337266, 336763, 350400, 327403, 275404, 246979, 251797, 291351, 284416, 320942, 344663, 330945, 332337, 308935, 314531, 323435, 331656, 296716, 268644, 295812, 278544, 290274, 255285, 231187, 235735, 268165, 251373, 254044, 263492, 226793, 232857, 276743, 306271, 365233, 355139, 338010, 302592, 273888, 260309, 260811, 244945, 229606, 236233, 282728, 302623, 268886, 219531, 243123, 269424, 264425, 259318, 274415, 270064, 278915, 282995, 284959, 278530, 292403, 292996, 280435, 263830, 236407, 234785, 258460, 297964, 314719, 336978, 330225, 345112, 334659, 305405, 302284, 281975, 280801, 278355, 257427, 263200, 303121, 322431]
13079C22431q247l4043k5705l639L8572J4647q873R338o817J6721K0509j9932
13067C14962o4434l5211K3949K5718L9772J1773j5451K9641j2228j0779k867J0373
13055C15218J147j6875k6572k4617R868M0641K2982J0607r114k7572j6351K5485
13043C04847K8830k2895r923N4029r334j0758j6609J197k4599l2611p146O4717
13031C19745J9340p594m2959j680K173N645k9329m009J6971j0624j385P583l886
13018B69991L0491K2309k8007l144k156o910L7106k0393J9495K4500j8470j2835
13006C11977K8932K3214l0787k6076k4994L280r127J2292P209J4452K3456K4688
12994C58516j2715l4969M976N8360J3970n3594j081K6459P7742k4360k531J1337
$$ y = [322431, 314184, 280141, 254436, 250797, 289369, 304016, 295143, 304481, 297664, 314385, 334894, 314962, 250528, 215317, 239266, 264984, 304756, 316529, 301078, 330719, 318491, 307712, 304845, 315218, 316365, 299490, 272918, 248301, 258169, 298810, 321792, 332399, 323285, 295713, 279362, 304847, 333677, 310782, 300859, 354888, 345554, 334796, 318187, 319384, 294785, 262174, 255028, 319745, 339085, 331491, 288532, 286852, 289025, 294670, 265341, 261332, 278303, 267679, 266294, 273877, 269991, 300482, 322791, 294784, 291640, 289484, 282574, 319680, 299287, 318782, 343282, 324812, 311977, 340909, 364123, 333336, 307260, 282266, 285546, 276419, 288711, 295920, 310372, 333828, 358516, 345801, 310832, 315808, 374168, 388138, 334544, 333463, 359922, 437664, 413304, 410773, 422110]
12982D22110j4829L8836j8585P873j2386L1216k574k0782r8908l1932L6972M1289
12970C78300M4240R317k7502J69k3109k8713K6376L0939L4180J5288P2015p944
12958E23556l8086O883L9052K3194o330j4241j0121N4473K7387J551J21L5854
12946F43293M5910M3134R4267R9124O0705Q0878P7038p862m4212o4587k8252o7569
12934I31867n2499n9611n4366l7515J5270L6800L9794J4067K0400r69J0648M230
12922H68116J6762M5444M8901K2036O2296M4953N3720L3438N780O5127O5909J0080
12910A342562q385j9931n6274j1673l0098J0449n660l363l2292n2862n9732n0437
12898A022304n6508n7084l307k2731n964j0345l3777j5576K7047J6109k302r457
$$ y = [422110, 407281, 446117, 427532, 435405, 423019, 454235, 451661, 430879, 331971, 300039, 337011, 378300, 422540, 431857, 404355, 404524, 381415, 352702, 379078, 410017, 444197, 459485, 531500, 523556, 485470, 492353, 531405, 554599, 548269, 534028, 523907, 578380, 605767, 607318, 607439, 643293, 689203, 732337, 826604, 925728, 986433, 1067311, 1144349, 1136487, 1092275, 1027688, 999436, 931867, 879368, 819757, 765391, 727876, 743146, 779946, 819740, 833807, 854207, 853238, 863886, 868116, 884878, 930322, 979223, 1001259, 1063555, 1108508, 1162228, 1195666, 1201446, 1266573, 1332482, 1342562, 1334177, 1314246, 1257972, 1246299, 1216201, 1226650, 1220990, 1217627, 1185335, 1132473, 1072741, 1022304, 965796, 908712, 905405, 882674, 876710, 866365, 832588, 817012, 844059, 860168, 857866, 848409]
12886H48409K7724O7762J22561J13620O9242R006k082J0536k7819j16939r4434
12875A027586j07880l8062l9467k3129l6989n4774j9143k7995j6330M662q278
12864F60201k0238n0454l2248j6652J8478J0559J4785P08j4201R746J188P865
12852E89737J9457k435n9396m468k41J6046M022k291P959j4551p976m081L0297
12839E72079O695j1824k9015K623M3019j4603j3194J5306j6093k8914J0511K8062
12827E64652l532J6155q183p391K292J4263J4079l3979j3286K8999J8668J1748
12815F04485J7221k4119m048L5120L18r729j4331N4619L2151M189o392J9730J4725
12802G23939L4474R786J6108J8430k5114j0020j4986k5605j885M4118J8567R120
$$ y = [848409, 876133, 943895, 1066456, 1180076, 1249318, 1258324, 1256242, 1266778, 1238959, 1122020, 1027586, 919706, 881644, 842177, 819048, 782059, 727285, 708142, 680147, 663817, 668479, 660201, 639963, 589509, 557261, 540609, 559087, 569646, 584431, 585139, 570938, 580684, 581872, 589737, 609194, 606759, 547363, 542895, 542654, 558700, 562722, 560431, 568390, 553839, 545863, 541782, 572079, 578774, 566950, 537935, 540558, 583577, 568974, 555780, 571086, 554993, 526079, 536590, 564652, 561120, 577275, 569092, 561701, 563993, 578256, 592335, 558356, 545070, 574069, 592737, 604485, 621706, 597587, 593539, 628659, 628977, 619248, 604917, 659536, 691687, 695876, 689484, 709214, 723939, 758413, 768199, 784307, 802737, 777623, 767603, 752617, 727012, 725127, 769245, 787812, 796932]
12790G96932Q354m3674k4149m7165J1627L2558L5626j7808n312J1666K3874L617
12778G86146L0954n0476j8850J8251K4448M8277J9207K0638k950k360j3821j4979
12766H44485l6747K4352O2419M2799r330M960J254k9726o482K6230k1315m446
12754H98453M933L4523j1425j7412K6565L0094K8220J5444J4856k8170k4893J5501
12742I86689J8172o832N706n011j8364n6502l1849p012J0481j002j6196j1178
12730H67102o624N317J3797K9743L4727L3049l471m5184l5272k3061L1475M4767
12718I46365j329J9446M6296J5681p157r384j8674n599R869j1930N896k380J1375
12705I98475l2481q567J0102l130n090M995Q335Q176K0517K2810J9257p072M368
$$ y = [796932, 805286, 761612, 737463, 690298, 701925, 734483, 770109, 752301, 746989, 758655, 782529, 786146, 817100, 766624, 747774, 766025, 790473, 838750, 857957, 878595, 875645, 873285, 859464, 844485, 807738, 832090, 894509, 937308, 927978, 932938, 934192, 904466, 897984, 924214, 902899, 898453, 903386, 937909, 926484, 909072, 935637, 965731, 993951, 1009395, 1024251, 996081, 971188, 986689, 1004861, 998029, 1003735, 998724, 980360, 923858, 892009, 884997, 895478, 894476, 878280, 867102, 860478, 865795, 879592, 909335, 944062, 977111, 973640, 928456, 893184, 870123, 901598, 946365, 945036, 964482, 1010778, 1026459, 1019302, 1009918, 991244, 985645, 995514, 983584, 989480, 987100, 998475, 965994, 957427, 967529, 964399, 959309, 964304, 972639, 980815, 1001332, 1024142, 1043399, 1036327, 1040695]
12692A040695K5805J5207M1295O562L680j184P659j3716m199J6213J3949Q349
12680A160315j9877M868j5309k2524J468J9429r954k4728J723k0990J2506O4066
12668A150993L1752o4735l7226r512m457M1376M8713j5870l3743K332L3070K5611
12656A168304p820j3421K4192K9693j1523Q357M6529J9711p966K1730J5479K3463
12644A316728J2542L7178J2544l755J376l1330K0588K5597K1450j8713k9410k2958
12632A341837k0949l3584j1312M4900L4168L3108M2680N2174L9576K0999O1302
12621A604899R2955J36478J26528Q5644M1091K7240K0430K8831L8820Q010L4631
12610B245557M6335J4939M8889J1108P445k2846j8875j3796Q44n6430l9386K4994
$$ y = [1040695, 1066500, 1081707, 1123002, 1129564, 1133244, 1132060, 1139719, 1126003, 1121804, 1138017, 1151966, 1160315, 1140438, 1145306, 1129997, 1107473, 1108941, 1128370, 1118416, 1093688, 1095411, 1074421, 1086927, 1150993, 1182745, 1118010, 1080784, 1071272, 1066815, 1108191, 1156904, 1141034, 1107291, 1109623, 1142693, 1168304, 1160484, 1147063, 1171255, 1200948, 1189425, 1197782, 1244311, 1264022, 1256056, 1277786, 1293265, 1316728, 1329270, 1366448, 1378992, 1375237, 1376613, 1345283, 1365871, 1391468, 1412918, 1394205, 1364795, 1341837, 1320888, 1287304, 1275992, 1320892, 1355060, 1388168, 1430848, 1483022, 1522598, 1543597, 1604899, 1697854, 1834332, 1960860, 2046504, 2087595, 2114835, 2135265, 2164096, 2202916, 2210926, 2245557, 2291892, 2306831, 2355720, 2366828, 2374273, 2351427, 2332552, 2318756, 2319600, 2263170, 2223784, 2248778]
12598B248778p525k4089k3018k849L8899N0064L4337K6563L3405R286R592K3943
12586B417386K3351L6693K5125r205K9040j5046p863K3347j8720Q922J7926K5836
12574B556792J3578M6311N934N5528M6809N5075L5078p900j0458M9877L361M8816
12562B898801O7427Q1432P0481Q4955M9345K7146L3304M1146J12014M5266O9249
12551C580566Q1600O5987N3691N6773O3708R7338J15674J14209R2283O3527P3740
12540D459096J09272P4384L0722L2384J9605P7835J14527N8226O9888J01016N4767
12529E201722J27125J79836J59180J51320J33663J77245J73933K00988J95728
12520F700740K20621K88668K76969K71267L42580M33199M99804N18086O42227
$$ y = [2248778, 2241253, 2217164, 2194146, 2191297, 2230196, 2280260, 2314597, 2341160, 2374565, 2383851, 2393443, 2417386, 2440737, 2477430, 2502555, 2493350, 2522390, 2507344, 2499481, 2522828, 2504108, 2513030, 2530956, 2556792, 2570370, 2616681, 2622615, 2678143, 2724952, 2780027, 2815105, 2807205, 2796747, 2846624, 2849985, 2898801, 2966228, 3047660, 3118141, 3203096, 3252441, 3279587, 3312891, 3354037, 3466051, 3511317, 3580566, 3662166, 3728153, 3781844, 3838617, 3902325, 3999663, 4115337, 4229546, 4321829, 4385356, 4459096, 4568368, 4642752, 4673474, 4705858, 4725463, 4803298, 4917825, 4976051, 5045939, 5146955, 5201722, 5328847, 5508683, 5667863, 5819183, 5952846, 6130091, 6304024, 6505012, 6700740, 6921361, 7210029, 7486998, 7758265, 8100845, 8534044, 9033848, 9551934, 10194161]
12511A0194161P33712Q02912R28150J041453J175207J395274J640657J946656
12503A9858182K416040L058844L911279N109690O779648R087280J2083361J5726456
12495G8030780J9145592K0473543J7847091J1876550N382023m38712o556905j2617281
12487A33142681j6024672j5643598j2979257r632789o483060l924232j781687
12480F6673386r4605J376570K625723L732896M668249N490013O278826O863374
12472I7614432P485481Q047320Q555314Q976744R203800R134446Q799967P926418
12464A65743922O564785M834037K892159P84129j390147l350124m932210o183292
12456A64963259o993660p459940p667831p598881p449975p158717o752154o335622
$$ y = [10194161, 10927873, 11730785, 12658935, 13700388, 14875595, 16270869, 17911526, 19858182, 22274222, 25333066, 29244345, 34354035, 41133683, 50220963, 62304324, 78030780, 97176372, 117649915, 135497006, 147373556, 152755579, 152316867, 145759962, 133142681, 117118009, 101474411, 88495154, 78862365, 72379305, 68455073, 66673386, 66578781, 67955351, 70581074, 74313970, 78982219, 84472232, 90751058, 97614432, 105099913, 113147233, 121702547, 130679291, 139883091, 149017537, 157817504, 165743922, 172308707, 177142744, 180034903, 180819032, 179428885, 176078761, 171146551, 164963259, 157969599, 150509659, 142841828, 135242947, 127792972, 120634255, 113882101, 107546479]
12448A07546479n839780n314770m710110l878975k979977j923744o21297R23189
12440H3201015K843016N206382Q160978J1589644J4899557J7021406J6412112
12433A59334110J2289028N702548j028048o844987j2396718j7165672j9062915
12426A20827346j7520849j4332084j1166921q496890o488780m939273l832328
12419E4050221k969315k375823k047287j810196j587033j418130j269827j124321
12411C9448289j009282q23807o61716n46850m90119l39646k28185k06209j45977
12402C4996498m8258n0110P4881J25888J60655K76496L54600M02992M47439N55792
12392C7296873O51747O85686P64719P84960Q13136Q53267Q72970Q70104Q70779
$$ y = [107546479, 101706699, 96391929, 91681819, 87802844, 84822867, 82899123, 82277826, 83201015, 86044031, 91250413, 99411391, 111001035, 125900592, 142921998, 159334110, 171623138, 177325686, 176297638, 169452651, 157055933, 139890261, 120827346, 103306497, 88974413, 77807492, 69310602, 62821822, 57882549, 54050221, 51080906, 48705083, 46657796, 44847600, 43260567, 41842437, 40572610, 39448289, 38439007, 37615200, 36953484, 36406634, 35916515, 35576869, 35348684, 35142475, 34996498, 34948240, 34898130, 34973011, 35098899, 35259554, 35536050, 35890650, 36293642, 36741081, 37296873, 37948620, 38634306, 39399025, 40183985, 40997121, 41850388, 42723358, 43593462, 44464241]
12383D4464241Q74523Q79918Q94499R15171R59422J045987J036743J107559J143364
12374E3321427J155321J125423J125180J080528J006607R27634Q66420P19572
12366F1328112O13047N35949L99711K69713J07260j3267j65433l18226m88382
12357F2268484o25172p31967q44277r14856j004195j065563j215060j259061j271188
12348E3337145j286072j276502j284597j345261j353008j339012j305608j271066
12340D2876019j279509j233747j225247j165123j105836j085347r82114j006193
12332C3792903j021128r46563r37479r07276q25712p83047p29675p20314p64292
12323B6157417p32017p10204o81705o47597o23624n92424o00072n90656n92303
$$ y = [44464241, 45338764, 46218682, 47113181, 48028352, 48987774, 50033761, 51070504, 52178063, 53321427, 54476748, 55602171, 56727351, 57807879, 58814486, 59742120, 60608540, 61328112, 61941159, 62477108, 62876819, 63146532, 63253792, 63240525, 63075092, 62756866, 62268484, 61643312, 60911345, 60067068, 59152212, 58148017, 57082454, 55867394, 54608333, 53337145, 52051073, 50774571, 49489974, 48144713, 46791705, 45452693, 44147085, 42876019, 41596510, 40362763, 39137516, 37972393, 36866557, 35781210, 34799096, 33792903, 32771775, 31825212, 30887733, 29980457, 29154745, 28371698, 27642023, 26921709, 26157417, 25425400, 24715196, 24033491, 23385894, 22762270, 22169846, 21569774, 20979118, 20386815]
12314B0386815n88114n59982n27408m72646m89432m80679m70993m42478m32066
12305A5923017l91598l42947l70584l78867l29614k89375l08557l37248l08482
12296A2865745k83363l03213l00031k85479k82293k24789k43563k61033k20950
12287A0461031k20934k26019k39842k33620j85263j86750j94826j94404k28896
12278H550477k25102j72460j59076j35559j40376j73219j59688j38397j00154
12269G146446j16998j46126j03113r4373j19910j82085j25868r5624j25018j41635
12259E895696r2609j01989p0795q0307q8308j27437j14757q8313q8402q2817q7394
12248D872568p5920q0136q1943j03347q0419l3774m2845p2429o4842n2063l6706
$$ y = [20386815, 19798701, 19238719, 18711311, 18238665, 17749233, 17268554, 16797561, 16355083, 15923017, 15531419, 15188472, 14817888, 14439021, 14109407, 13820032, 13511475, 13174227, 12865745, 12582382, 12279169, 11979138, 11693659, 11411366, 11186577, 10943014, 10681981, 10461031, 10240097, 10014078, 9774236, 9540616, 9355353, 9168603, 8973777, 8779373, 8550477, 8325375, 8152915, 7993839, 7858280, 7717904, 7544685, 7384997, 7246600, 7146446, 7029448, 6883322, 6780209, 6685836, 6565926, 6383841, 6257973, 6162349, 6037331, 5895696, 5803087, 5701098, 5630303, 5549996, 5461688, 5334251, 5219494, 5131181, 5042779, 4959962, 4872568, 4796648, 4716512, 4634569, 4531222, 4450803, 4417029, 4374184, 4301755, 4236913, 4184850, 4148144]
12237D148144p653o7527q3016p9601m5649m9016m3618l6308j3254o7679l1247
12226C623576j1000n8679k9640l1367k4338k0474n8933l8234o9523o9135o6756
12215C145497m3242m0459j05644p2276l5955l7807l2403o5049n1095J5000k6478
12204B650089q8503n1019j6137m530R656l78l8626l7019k5266l9094j3880m5612
12192B299681j5684m9097j6896j3361l1620r995m7741j2415l1116k7676j5776
12181B028304l3223l7902l8095K2471J5685j4509k2642k4342j5127o785k2573
12170A851262p7603m9711l2880j9975k2283k5274M1883K0839j5136j7472L4264
12159A687914M331j936k6787j0625j3894j2641Q386m2778m6152o942n025M638
$$ y = [4148144, 4140491, 4072964, 3989948, 3910347, 3864698, 3815682, 3772064, 3735756, 3722502, 3654823, 3623576, 3612576, 3553897, 3524257, 3492890, 3468552, 3448078, 3389145, 3350911, 3281388, 3212253, 3145497, 3102255, 3061796, 2956152, 2883876, 2847921, 2810114, 2777711, 2712662, 2661567, 2676567, 2650089, 2561586, 2510567, 2494430, 2489900, 2499556, 2499178, 2460552, 2423533, 2398267, 2359173, 2345293, 2299681, 2283997, 2234900, 2218004, 2204643, 2173023, 2163028, 2115287, 2102872, 2071756, 2044080, 2028304, 1995081, 1957179, 1919084, 1941555, 1957240, 1942731, 1920089, 1895747, 1880620, 1873835, 1851262, 1773659, 1723948, 1691068, 1671093, 1648810, 1623536, 1665419, 1686258, 1671122, 1653650, 1687914, 1692245, 1690309, 1663522, 1652897, 1639003, 1626362, 1634748, 1591970, 1545818, 1538876, 1533851, 1538489]
12147A538489r733j4149m1372m7413K0294k0946j9095l2794j4090J3620r401l5156
12135A328254j1924J6001K8461K6103L9256M5628L2532N40p401Q595j575m0371
12123A464099r489m439o685J7758M7252M5441M748K2653Q773k612p362P451k8056
12110A559532k8491k9593o3857j0999k4197r17J55J2652L2092P8241O6515O6263
12098A657396R9086O6302j2377L6J7635P281k0501n2279o6377l209k0179n0183
12086A622631l5471k3379p279K913n3882o3820j8833j0955l0486r349L1668l422
12074A400336k3249l7019m1362M475m46K5894N703J9285O279m1566Q917p939j3566
12061A305742k0034k1376j0926j6230L5040L4060O8285L3000j0594p726K5772
$$ y = [1538489, 1528756, 1514607, 1473235, 1425822, 1446116, 1425170, 1406075, 1373281, 1359191, 1372811, 1363410, 1328254, 1316330, 1332331, 1360792, 1386895, 1426151, 1471779, 1504311, 1504851, 1497450, 1506045, 1504470, 1464099, 1454610, 1450171, 1443486, 1461244, 1508496, 1553937, 1558685, 1581338, 1590111, 1587499, 1580137, 1587588, 1559532, 1531041, 1501448, 1437591, 1426592, 1402395, 1401478, 1401633, 1414285, 1446377, 1524618, 1591133, 1657396, 1756482, 1822784, 1810407, 1810443, 1828078, 1835359, 1814858, 1762579, 1696202, 1692993, 1672814, 1622631, 1587160, 1563781, 1556502, 1559415, 1505533, 1441713, 1422880, 1411925, 1381439, 1372090, 1403758, 1400336, 1377087, 1340068, 1298706, 1303181, 1302735, 1328629, 1334332, 1353617, 1359896, 1318330, 1327247, 1319308, 1305742, 1285708, 1264332, 1253406, 1237176, 1272216, 1306276, 1374561, 1407561, 1396967, 1389241, 1415013]
12050A415013K3874j0533M5789M3170Q07K1535M2582L7648L1694P6671J05588
12039A833838J13914J01583J25930Q1537O8872o933k5943n9676r0788j1859N043
12028B135518n4917m0964k0112K3100M5277L9129O7636N4894L3478N4977J18602
12017B456618J07282J55886J55943J35478J45058J38130J64333J85600J97283
12008C841611K03493K13070K39250K38351K40042K35040K48276K40605K52924
11999E952662L00147L57850M04401M63560N49343P21855R84994J256747J423717
11990A2415276J644763J906444K117917K271092K447677K632917K943265L585952
11982C1965303M629792O488189R737764J4544354K0490084K6379712L1152446
$$ y = [1415013, 1438887, 1428354, 1474143, 1517313, 1518120, 1539655, 1582237, 1619885, 1651579, 1728250, 1833838, 1947752, 2049335, 2175265, 2256802, 2325674, 2318741, 2292798, 2233122, 2142334, 2130475, 2135518, 2080601, 2039637, 2019525, 2042625, 2087902, 2127031, 2194667, 2249561, 2283039, 2338016, 2456618, 2563900, 2719786, 2875729, 3011207, 3156265, 3294395, 3458728, 3644328, 3841611, 4045104, 4258174, 4497424, 4735775, 4975817, 5210857, 5459133, 5699738, 5952662, 6252809, 6610659, 7015060, 7478620, 8027963, 8749818, 9734812, 10991559, 12415276, 14060039, 15966483, 18084400, 20355492, 22803169, 25436086, 28379351, 31965303, 36595095, 43083284, 52821048, 67365402, 87855486, 114235198, 145387644]
11975A45387644L4687510L6149409L3359198K5269106J3892067K277828r079871
11968B81942891k0244171k9513259l3912584l3459129l0271813k5965054k0820122
11961H7756759j5208522j0204357o797581m735579l633587l074149k763648k637415
11953C8701921k586537k571489k484549k295910k043732j840231j586549j346512
11945B1946412j155463r93090q98919q23940p52694o73878o08888o10990n59328
11936A4869222n53162m83893m72061m65285m65486m66926m52299n01407m23669
11927A0585034l25325l33757l41866l15945k78303k91408l00302k62733k35694
11918G899701k62654k47617k20588k13758k01021k11084j92216j71610j63798
$$ y = [145387644, 180075154, 216224563, 249583761, 274852867, 288744934, 291022762, 281942891, 261698720, 232185461, 198272877, 164813748, 134541935, 108576881, 87756759, 72548237, 62343880, 55546299, 50810720, 47177133, 44102984, 41339336, 38701921, 36115384, 33543895, 31059346, 28763436, 26719704, 24879473, 23292924, 21946412, 20790949, 19797859, 18898940, 18075000, 17322306, 16648428, 16039540, 15428550, 14869222, 14316060, 13832167, 13360106, 12894821, 12429335, 11962409, 11510110, 11008703, 10585034, 10259709, 9925952, 9584086, 9268141, 8989838, 8698430, 8398128, 8135395, 7899701, 7637047, 7389430, 7168842, 6955084, 6754063, 6542979, 6350763, 6179153, 6015355]
11909F015355j61174j45937j13321j22653j63358j51499j18047j43068j48240
11900D748058j20321j09436j89114j21952j01886j01985j27126j14981j14757
11891C646500r0642r8141q4439n3017o6395p1487o2413o6916o4358r4965q0994
11880B812733m7724n2680p3929q1257j04283j4342m3992q0581o9296p4159r4619
11869B075871q9038m7468l5812m4547m5958l8912n4876o2431q402j7502m2510
11858A588415m3649k9996k4957l4984l7608j5466j3079l0187k5993k8680m3934
11847A259882j197R74l272m1464J5723M3736j5974k2579J1992k6621j501k9539
11835A190160j5851k4541k9471j0510k6067n7984o0196l8637p3845p1818l6677
$$ y = [6015355, 5854181, 5708244, 5594923, 5472270, 5308912, 5157413, 5039366, 4896298, 4748058, 4627737, 4518301, 4329187, 4207235, 4105349, 4003364, 3876238, 3761257, 3646500, 3555858, 3457717, 3373278, 3320261, 3253866, 3182379, 3119966, 3053050, 2988692, 2893727, 2812733, 2765009, 2712329, 2638400, 2557143, 2452860, 2438518, 2394526, 2313945, 2244649, 2170490, 2075871, 1986833, 1939365, 1903553, 1859006, 1813048, 1774136, 1719260, 1656829, 1648427, 1630925, 1588415, 1544766, 1514770, 1489813, 1454829, 1417221, 1401755, 1388676, 1358489, 1332496, 1303816, 1259882, 1258685, 1259659, 1256387, 1214923, 1230646, 1274382, 1258408, 1235829, 1247821, 1221200, 1219699, 1190160, 1174309, 1149768, 1120297, 1109787, 1083720, 1025736, 965540, 926903, 853058, 781240, 744563]
11824G44563l4641r293j6975r149o4224k8713l5171L167p18k6035l9191J444j0940
11811D74124K7667k7643j7207k4376k0615n807O198l0102J7660J661M407J4395
11799D20362o881K3958J4342N264j8496n7080m0082n6947J7919M9965O09j7105
11787C35828k5598k0429k5210P842J3389K0815J0026k5770L1954K6634r947K1365
11775C60899k93l2118k8451j5949j3577j8082m2584Q454J6528k1757P272K1431
11763B41773k8975n003o440P782R652K0250J9000J1344m0779R099Q470j5156J6947
11750B47964k1534k3001J6247L0483j3910J2245l5837L680M1963j9105k0364P305
11738B26136j8209j020l4K138M0491K525k6940j8696N282M3363N566j8447n2293
$$ y = [744563, 709922, 700629, 683654, 674505, 610281, 581568, 546397, 549564, 548846, 522811, 483620, 485064, 474124, 501791, 474148, 456941, 432565, 411950, 406143, 412341, 382239, 399899, 401560, 405967, 420362, 413481, 437439, 451781, 457045, 438549, 381469, 341387, 284440, 302359, 352324, 352933, 335828, 310230, 289801, 264591, 272433, 285822, 306637, 316663, 290893, 322847, 349481, 339534, 360899, 360606, 328488, 300037, 284088, 270511, 252429, 209845, 218299, 234827, 213070, 220342, 241773, 212798, 207795, 201355, 209137, 218789, 239039, 258039, 269383, 228604, 237703, 246173, 231017, 247964, 226430, 203429, 219676, 250159, 236249, 248494, 212657, 216337, 258300, 239195, 218831, 226136, 207927, 206907, 206873, 209011, 249502, 252027, 225087, 206391, 211673, 255036, 260602, 242155, 189862]
11725A89862k708j4078R129k4193P734J3809L2852L7247O697K639K9698L7660
11713C26348j1802l7009l2371j0546R008k290j2275p23k3709k2844N127K7902
11701B14816m878P840J9432j0513m647o987J5629J4233j8387o3733k5674J19J5972
11688A53222n745K5150J7282M193k8584l4208k0890K6615J5689n609p542k1093
11676A18480l0601L077K9121K7541j6940l1566j4587M055j2009J4566l917J8488
11664A05708K622o854K5554K731q917m1073K0882P167j061o704K3212j3238k7965
11651H2064J2513J7867K0411K9096J1822M599o0428l7236J7776Q991j0642k3620
11639G3213K675m2133j4591J0280K9880J4051J6678M059j8608j253o837k0822
$$ y = [189862, 187154, 173076, 182205, 158012, 165746, 179555, 212407, 249654, 256351, 258990, 288688, 326348, 314546, 277537, 245166, 234620, 243628, 241338, 229063, 228340, 204631, 181787, 186914, 214816, 209938, 217778, 237210, 226697, 222050, 215063, 230692, 244925, 226538, 162805, 137131, 137250, 153222, 147477, 172627, 189909, 194102, 165518, 131310, 110420, 137035, 152724, 147115, 139573, 118480, 87879, 90956, 120077, 147618, 130678, 99112, 84525, 88580, 76571, 91137, 87220, 105708, 108330, 101476, 127030, 129761, 120844, 79771, 100653, 107820, 106759, 100055, 123267, 110029, 82064, 94577, 112444, 132855, 161951, 173773, 178372, 117944, 80708, 98484, 107475, 96833, 73213, 75888, 33755, 19164, 29444, 59324, 73375, 90053, 94112, 75504, 74251, 67414, 46592]
11627D6592k4985Q761K3424L5072j3782J8600j7138k6972K8L7391o303L099j3716
11614G0071k3392o316N0566N00M209J5624K1344m5057n4545L9682M927q303q611
11601F0699K7641J0732k3586m858Q571l802K9027o698k8838J5191l726R07k746
11588G8514j4212Q7n1126j4l8503j0091M4680M2116K5391J1376J4095l3953j18
11575F8242K3918K8380R650k4472R156K2716N4284j6427Q259J1200J5590M3407
11563B53903L1213j2592j5337m384P3855R4047O4224N2761J41979J65716J76289
11552A021674J87288J74201J29233M6114p836o1037j18025j55655j55302j54079
11542I06576j42555j15667j27187p9298l3709K2407k8624n6028l7727j8118m7255
$$ y = [46592, 21607, 30368, 53792, 88864, 75082, 93682, 76544, 49572, 49600, 86991, 80688, 83787, 70071, 46679, 40363, 90929, 91429, 95638, 111262, 132606, 87549, 33004, 72686, 77613, 69310, 60699, 88340, 99072, 75486, 70628, 79199, 75397, 104424, 97726, 68888, 84079, 80353, 81260, 78514, 64302, 64389, 13263, 13249, -25254, -35345, 9335, 51451, 76842, 88218, 102313, 68360, 68242, 92160, 120540, 130190, 105718, 114874, 137590, 191874, 175447, 183706, 194906, 210496, 253903, 285116, 272524, 257187, 252803, 326658, 420705, 484929, 537690, 679669, 845385, 1021674, 1208962, 1383163, 1512396, 1558510, 1550674, 1489637, 1371612, 1215957, 1060655, 906576, 764021, 648354, 521167, 441869, 408160, 430567, 401943, 345915, 308188, 290070, 242815]
11531B42815l1202k1090j1366J5713o48Q325k7610m4467l2540L641J8210R007
11519A28788j0677l5759R88j3315J2313N996l3458k0275J5354O9421L9178q167
11507A50387j4337m8995n0398k7250J8109L0238J9323j1107k4158j187K6013L8398
11495A05036L0255l3594k6165l340k3927k0086M4170L9200M1059l0104P709N90
11483A30803m3321J3692K9895K5687l2534N949M486K234Q102k7207J8093Q343
11471A44222k2655k4858j7583k027q765o414l3709o544k5975L1854o051k9547
11459h052J8824L981m7195J0559K954K8446O0074l0644q592K6631k654K1128K2120
11446I7580j4059l032l5489j4105m825j2365K6629Q960L5407J4043k830m4644
$$ y = [242815, 211613, 190523, 179157, 194870, 194222, 202547, 174937, 130470, 97930, 101571, 119781, 128788, 118111, 82352, 83340, 70025, 82338, 88334, 54876, 34601, 49955, 119376, 158554, 150387, 136050, 87055, 36657, 9407, 27516, 57754, 77077, 65970, 41812, 40625, 66638, 105036, 135291, 101697, 75532, 72192, 48265, 28179, 72349, 111549, 152608, 122504, 130213, 130803, 87482, 101174, 131069, 156756, 124222, 130171, 134657, 136891, 144993, 117786, 135879, 144222, 121567, 96709, 79126, 77099, 68334, 61920, 28211, 21667, -4308, 27546, 21495, -8052, 10772, 14753, -32442, -21883, -18929, 9517, 69591, 38947, 30355, 56986, 54332, 75460, 97580, 83521, 80489, 45000, 30895, 26070, 13705, 40334, 49294, 84701, 98744, 95914, 51270]
11434E1270k8565k9834Q924Q940l8904q898J3637K9888K8087j6329J4572N701
11422C8489n684O770q270k7833j5132k2725o439j5638P862j333K4035L6270J6197
11409B6569J3353R677L1942q433l8312M2711m2902m1169j0197k2463K2841N0241
11397C3858L2521k5322K9164J5118k6434J2786o404j5343M632J5458M896l5552
11385C9378j8984K1272L3120Q053m8589m078M0809J2836J7484N34J5380L558k2590
11372I8183n001J1864k112j5089N367j4038k3905J170K4588M885m1641k7639K3588
11359D0220N1883J1124l4837k1546o581k3566l4351k0499j5241O331O3970J5733
11347C2640L2492J4438K1917l6543j7866K3455P618j6166j5946m186M102p91J2017
$$ y = [51270, 22705, -7129, 1795, 10735, -28169, -37067, -23430, 6458, 34545, 18216, 32788, 38489, 32805, 39575, 31305, 3472, -11660, -34385, -40824, -56462, -48600, -49933, -25898, 10372, 26569, 39922, 49599, 81541, 73108, 34796, 77507, 34605, -6564, -16761, -39224, -16383, 33858, 66379, 41057, 70221, 85339, 58905, 71691, 65287, 49944, 54576, 70034, 74930, 39378, 20394, 41666, 74786, 82839, 34250, 30172, 70981, 83817, 101301, 101835, 117215, 120773, 98183, 93182, 105046, 102934, 87845, 93212, 79174, 55269, 56439, 81027, 85912, 44271, 16632, 40220, 92103, 103227, 68390, 46844, 40263, 16697, -17654, -38153, -53394, -47063, 16907, 32640, 65132, 79570, 101487, 64944, 47078, 70533, 78151, 61985, 46039, 41853, 45955, 45164, 57181]
11334E7181L7839m388j7376j7137r404K9267K3719k7998k2796K5099P679j6007
11322F5678l6975J0890J2930L0093m6683P223M0932L1419j2334k0913l0386n5770
11310c896J0120k1305p905j038j7554M1619M6574J4520o771j0037K3540J078k650
11297F6295L3938m196L730J5780L9226l832k0116K243p660J0222J757k1744j4658
11284A00985l0649j8734k451Q204P250J5277j8408l213J0036j6478J2359J7692
11272H1870j4977L2894M0045N093l3673p70l1699j0722K0820q513N24p352q376
11259F5164K5099K9820k863l3229j0130K2830L1190M877r593J8297J3537O415
11247A61414k2292m3476l9832p330j0534j3014n10l0836l8987r345J8769J3814
$$ y = [57181, 95020, 90632, 73256, 56119, 46715, 75982, 99701, 71703, 48907, 74006, 81685, 65678, 28703, 39593, 52523, 82616, 35933, 43156, 84088, 115507, 103173, 82260, 51874, -3896, 6224, -15081, -22986, -24024, -41578, 41, 46615, 61135, 54364, 44327, 67867, 68945, 66295, 100233, 96037, 99767, 115547, 154773, 150941, 130825, 133068, 125408, 135630, 137387, 115643, 100985, 70336, 51602, 49151, 57355, 64605, 79882, 61474, 58261, 68297, 51819, 64178, 81870, 66893, 99787, 139832, 144925, 111252, 110482, 78783, 68061, 88881, 80368, 80892, 73540, 65164, 90263, 120083, 117220, 83991, 73861, 96691, 127881, 132758, 123165, 141462, 154999, 161414, 139122, 95646, 55814, 48484, 37950, 24936, 24426, -6410, -45397, -54742, -35973, -22159]
11235b2159N9810L2288l721k2885k5743n439K1846L4556j4657N47K1735j0774
11223F5404k431J3369k0046j3681L6356L9607M5855J3168n34L6152o271j3094
11211A93854j4517J634j0599j9514J1709P461N2820P9562M1916L7252Q3539J35765
11199F00882J71705J08914J7310O781l7554r8216j17778q9030p1367j08260m4573
11188C38814l327J7430L7228l353R013Q7871N1427P895J3993N0221j1863p282
11176E88067M2534q469J6318K5507M3140P9670O9843K1408L7321K1660R897j19
11164I46777j3159p8684p3211l6327p0301m1964k762K1934k4575p4121k7688r457
11152E16462k6169k0891k0095j6974q412j3250Q039L601K3470K3351L0304J06534
$$ y = [-22159, 37651, 69939, 66218, 43333, 17590, 12151, 33997, 68553, 53896, 54443, 76178, 65404, 62973, 76342, 56296, 42615, 78971, 118578, 164433, 177601, 177067, 213219, 206948, 193854, 179337, 180971, 170372, 150858, 162567, 170028, 222848, 302410, 344326, 381578, 465117, 600882, 772587, 881501, 898811, 905592, 868038, 769822, 652044, 563014, 491647, 383387, 338814, 335487, 352917, 390145, 386792, 395805, 483676, 535103, 542998, 556991, 607212, 595349, 588067, 630601, 622132, 638450, 663957, 707097, 786767, 856610, 878018, 915339, 936999, 946896, 946777, 933618, 854934, 781723, 745396, 675095, 633131, 630369, 652303, 627728, 553607, 525919, 516462, 490293, 469402, 449307, 432333, 423921, 410671, 418710, 422311, 445781, 469132, 499436, 605970]
11140F05970J32090Q1223P9595N3252l4468l2375j06874j61756j04810n1698m6162
11129D13987k4407l7805m6561m4929j9393j6085J045k6458j5116l680N219N567
11117A91384n3658j5160N6941O730J0371l1198k5928J0427L8395K1867L599l3561
11105A80209l5644O846J6917n127k4380L5848K4386k2298j9492k3271O109K9438
11093A69541K4780p761o4572l0986K7482L2980L2750R74k9359j2131l18K4522
11081A67902j4759j4862J2639J6599j3289m4766R681l193k4449j0343L774K9929
11069A14863L8623m287n0463l736q481J935K9649J7002j0157k3717l5102J5422
11057H1551K0113K0490K7717j5509k0321j4170R45P828K4204K8662J8238l2996
$$ y = [605970, 738060, 819283, 898878, 952130, 917662, 885287, 778413, 616657, 511847, 460149, 413987, 389580, 351775, 305214, 260285, 240892, 224807, 225852, 199394, 184278, 180598, 185817, 191384, 137726, 122566, 179507, 186237, 196608, 165410, 139482, 149909, 188304, 210171, 213770, 180209, 144565, 151411, 168328, 163201, 138821, 174669, 199055, 176757, 157265, 133994, 140103, 169541, 194321, 186560, 121988, 91002, 118484, 151464, 184214, 185188, 155829, 143698, 143380, 167902, 153143, 138281, 150920, 167519, 154230, 109464, 119145, 115952, 91503, 81160, 84934, 114863, 153486, 149199, 98736, 95000, 86519, 88454, 118103, 135105, 124948, 101231, 66129, 81551, 101664, 122154, 149871, 134362, 114041, 99871, 100816, 108644, 132848, 161510, 179748, 146752]
11045A46752p693j4217r996L1292J5763l513j4649o556j1981K7673j9007J4029
11033A47897M5811L490m069n761k3975j8747J5579K3330O627k5416j1049k020
11021A51697l464n871l9362Q865M9240Q726m2111J2425J2807j3401l5833r113
11009I4605M2803N4451J5644k1742m3557J938l276K4511k0994j0903J2186J8102
10997A63768J9627l0041J794J2912m3358o7465P026K3090R077P2978N1222J3465
10985B34095r750n481J294l7406j9239m4258p655O5420N7835j290l5428N951M97
10972B04585j5250L750k0172O080n549j7158K7580j3289J515J3635n997P442J3347
10959B00519k2741k4986L9579q875m0074K8005K1200j4319J5159J7920l278k9298
$$ y = [146752, 139059, 124842, 114846, 146138, 161901, 158388, 143739, 137183, 125202, 152875, 133868, 147897, 193708, 197198, 193129, 187368, 163393, 144646, 160225, 183555, 190182, 164766, 153717, 151697, 148233, 142362, 103000, 111865, 161105, 169831, 127720, 140145, 152952, 139551, 103718, 94605, 137408, 191859, 207503, 185761, 142204, 144142, 140866, 165377, 144383, 133480, 145666, 163768, 183395, 153354, 155148, 168060, 124702, 57237, 64263, 87353, 96430, 169408, 220630, 234095, 224345, 218864, 220158, 182752, 163513, 119255, 111600, 177020, 234855, 233565, 198137, 204088, 204585, 189335, 193085, 172913, 178993, 173444, 156286, 183866, 170577, 172092, 185727, 179730, 187172, 200519, 177778, 152792, 192371, 183496, 143422, 171427, 192627, 178308, 193467, 211387, 208109, 178811]
10947A78811l7984m885M1298N1954l2972j135j8450m627L83r838M6356J1411j2982
10934B07340j9027m928j4967K9142J3952J7442l4348m352L3133M50J9564j9213
10922B24188J5177n381l40r723j08j8169k2335k0072k9093J0356K0310K1957K3942
10909B10709L7537k3485l0062K1754K3652L138q972L7686j4036l7990M260L537
10897B27728O287L3786M9026K7605l202J8314O5530K5944K5138M2484K3227Q796
10885E50663O4350Q2719M0615m087k264r13j3292L9189j1234k2198m3332l6023
10873F44193K3960k749J4264k4669j860J6877J2781M7911J7459q596m231J7943
10861G53283K5831J5888J39L1356Q236k2748Q395L3052M3823K8245K5448J7987
$$ y = [178811, 140827, 135942, 177240, 229194, 196222, 195087, 176637, 172010, 172393, 162555, 208911, 220322, 207340, 188313, 183385, 168418, 197560, 211512, 228954, 194606, 190254, 223387, 223837, 243401, 224188, 239365, 233984, 233644, 223921, 223813, 205644, 183309, 163237, 134144, 144500, 164810, 186767, 210709, 248246, 224761, 194699, 216453, 240105, 243243, 234271, 271957, 257921, 219931, 224191, 227728, 234015, 267801, 316827, 344432, 341230, 359544, 425074, 451018, 476156, 518640, 541867, 550663, 615013, 697732, 738347, 734260, 731996, 731083, 717791, 756980, 745746, 723548, 680216, 644193, 668153, 665404, 679668, 654999, 653139, 670016, 682797, 730708, 748167, 739571, 735340, 753283, 779114, 795002, 795141, 826497, 834733, 811985, 820380, 853432, 897255, 925500, 950948, 968935]
10849I68935J3011j0003m0024j1656j5910k0081k5535l15k6174k3876k196l172
10837H03004j9568n1211l3888l3566j5370K823L8206M5404j9455K632O7289P185
10825G93485j6477N3944M5139l8783o726n189J033j8732k8100m9482o0719l0204
10813F39189k7607k6888n2109j9815m6702k1675L4239r759o1173q831M3879n861
10801D36887j5153l4212j3611k2887p548J7364m869O914P565J2484l8526o1888
10789B82520k7206J6725L5389j9490J7982K6429J3900J229p728J4805r734j1345
10777C33476Q065m0061J3277L2891K0894l6936l7997j7152n535K0425j131j6072
10765B74144M569j2754r945J326J4059J7720j5284m263M13M1561K7742k1654L804
$$ y = [968935, 981946, 971943, 931919, 920263, 904353, 884272, 858737, 858422, 832248, 808372, 806176, 803004, 783436, 732225, 698337, 664771, 649401, 652224, 690430, 735834, 716379, 719011, 786300, 793485, 777008, 830952, 876091, 837308, 830582, 825393, 826426, 807694, 779594, 730112, 669393, 639189, 611582, 584694, 532585, 512770, 466068, 444393, 478632, 468873, 407700, 398869, 442748, 436887, 421734, 387522, 373911, 351024, 343476, 360840, 355971, 362885, 370450, 382934, 344408, 282520, 255314, 272039, 307428, 287938, 305920, 332349, 346249, 347478, 339750, 354555, 344821, 333476, 341541, 301480, 314757, 347648, 368542, 331606, 293609, 276457, 270922, 291347, 290216, 274144, 278713, 265959, 256014, 257340, 271399, 289119, 273835, 269572, 269985, 311546, 339288, 317634, 321438]
10752C21438L2926J2157q269j895k0512J1762n6992k6039L6238L1107k8418n620
10740B97883q675J2505k4800J1633q6J4479o149k7895K9953M6567L6657k819p307
10727C71946l6522j5604K5063K2668N117K987m426n05L5520K6310K0643p751j1052
10714D34394L6480L849J0650p524k9595l142p98n736l2113J2246J0467K7064K8915
10701D85157J4581l3911k0952K001k0697n710k0230P275N1623J9139K8837J4627
10689E21740J130P528K1646k420r605j2604k0680l5588P809L2077q670l5736J3735
10676D80362L8795j3986m982N8496L8474l791k317p412K7813o500k9442J6228
10664E91738K0768N895j2022Q96L7866Q96p397j9073Q638l8794J7157K5517k0279
$$ y = [321438, 354364, 366521, 358252, 356357, 335845, 347607, 290615, 264576, 300814, 331921, 303503, 297883, 289208, 301713, 276913, 288546, 288460, 302939, 296790, 268895, 298848, 345415, 382072, 379253, 371946, 335424, 319820, 344883, 367551, 372668, 375655, 371229, 370724, 406244, 432554, 453197, 445446, 434394, 470874, 474723, 485373, 477849, 448254, 445112, 444314, 438578, 406465, 418711, 429178, 456242, 485157, 499738, 465827, 444875, 446876, 426179, 420469, 400239, 407514, 459137, 478276, 507113, 521740, 522870, 530398, 552044, 549624, 540019, 527415, 506735, 471147, 478956, 511033, 502363, 466627, 480362, 519157, 505171, 500189, 558685, 597159, 593368, 591051, 583639, 611452, 604952, 575510, 591738, 612506, 618401, 606379, 607275, 645141, 646037, 638640, 619567, 628205, 589411, 606568, 632085, 611806]
10651F11806Q044k512L898J3633m4331m1254Q00M1530L0650K0844K3019k59q676
10638F57192K2268R80K7326k7981o943k9426L002L9370j70J4438N9109K1008M385
10625G84558J2946J9953K445J3824L5725O270k7594K490K3922M096P728J4085
10613I00448J2379j8802j2290j3296N10L9200O462l5559k4044K2051O2045M7585
10601I86689l2380J0972M1969N6457J4465p789N5038O8784N1703L0503N4233N7094
10589A387738N7034K329j1632J9488M5859M0223Q1371K9625K5809M0467L1103
10578A749414K4669k7836l0647L6473M412k9010j235M2169J0784j1035j6332J5736
10566A767562J6456K0343N1739O3387K083n439L5056J9485K5241j8249j412M8199
$$ y = [611806, 619850, 617338, 621236, 634869, 590538, 549284, 550084, 591614, 622264, 643108, 666127, 665868, 657192, 679460, 680440, 707766, 679785, 672842, 643416, 646418, 685788, 685618, 700056, 759165, 780173, 784558, 797504, 817457, 819902, 833726, 869451, 875721, 848127, 850617, 874539, 878635, 886363, 900448, 912827, 894025, 881735, 868439, 868949, 908149, 914611, 879052, 855008, 877059, 939104, 986689, 954309, 965281, 1007250, 1063707, 1078172, 1070383, 1125421, 1194205, 1245908, 1276411, 1330644, 1387738, 1444772, 1447101, 1435469, 1454957, 1500816, 1541039, 1622410, 1652035, 1677844, 1718311, 1749414, 1774083, 1746247, 1715600, 1752073, 1756485, 1727475, 1726240, 1768409, 1779193, 1768158, 1751826, 1767562, 1784018, 1804361, 1856100, 1919487, 1921570, 1916131, 1951187, 1970672, 1995913, 1977664, 1976252, 2024451]
10554B024451K7315K1811Q012r704M4869J3135K6693j09P003M2672N0356N8288
10542B314792M0797R122Q97J3295L4463L7843O1970P0498O9475O0008N4797O0380
10530B828337N5627R0598L4048q518K0730Q3233J14909O3050N4835O4261O2106
10519C463216r477Q7001J13516J01016R7093J11161Q7761J16805J01062J15850
10509D385004J25886J19690J46047J40498J36770J57939J93496J89846K26813
10500E821989K58999K29987K98067K61784L08042L61409L98039M08647M09060
10491H756023M85216N35439N88449O74089P04000Q02771R27867J021895J166970
10482A5662719J333698J526863J689248J985597K311400K745293L177871L816333
$$ y = [2024451, 2051766, 2073577, 2081589, 2071885, 2116754, 2129889, 2156582, 2156473, 2163476, 2206148, 2256504, 2314792, 2355589, 2364711, 2365608, 2378903, 2413366, 2451209, 2513179, 2583677, 2653152, 2713160, 2767957, 2828337, 2883964, 2974562, 3008610, 3000092, 3020822, 3104055, 3218964, 3282014, 3336849, 3401110, 3463216, 3453739, 3540740, 3654256, 3755272, 3852365, 3963526, 4051287, 4168092, 4269154, 4385004, 4510890, 4630580, 4776627, 4917125, 5053895, 5211834, 5405330, 5595176, 5821989, 6080988, 6310975, 6609042, 6870826, 7178868, 7540277, 7938316, 8346963, 8756023, 9241239, 9776678, 10365127, 11039216, 11743216, 12545987, 13473854, 14495749, 15662719, 16996417, 18523280, 20212528, 22198125, 24509525, 27254818, 30432689, 34249022]
10474C4249022M489623N317338O313127P452498Q602881R596999J0144269R969455
10466I6135212Q932423O987244M368711J516401j317080l706145n436417o254010
10458A01226339o159395n411444m276528k908200j444021n1794J295433K450251
10450H4720641L401554L946440M081239L868102L403146K811140K429944K270351
10442A10932557K418910L033634L971300M898183N538998N619531N063054L668877
10434A45145044J783363k23056k234897l836195m779670n067283m711180l944307
10426A22131819l092703k522042k274338k343021k685302l125202l572995l784865
10418I8731351l668117l256046k473243j476130l20763R38585K156078L288523
$$ y = [34249022, 38738645, 44055983, 50369110, 57821608, 66424489, 76021488, 86165757, 96135212, 105067635, 112054879, 116423590, 117939991, 116622911, 112916766, 107480349, 101226339, 95066944, 89655500, 85378972, 82470772, 81026751, 80974957, 82270390, 84720641, 88122195, 92068635, 96149874, 100017976, 103421122, 106232262, 108662206, 110932557, 113351467, 116385101, 120356401, 125254584, 130793582, 136413113, 141476167, 145145044, 146928407, 146705351, 144470454, 140634259, 135854589, 130787306, 126076126, 122131819, 119039116, 116517074, 114242736, 111899715, 109214413, 106089211, 102516216, 98731351, 95063234, 91807188, 89333945, 87857815, 87537052, 88475637, 90631715, 93920238]
10410I3920238M324287N075760N266996M816315L686948J911446k67120k518973
10402A16215897m624502o376520p586198q086973q004283p490978o764094n933576
10394F1348773n194061m513750l857215l388483k987220k612506k343157k087138
10386C4365243j885706j642546j518156j400224j311432j220022j058515r90679
10378B3337963r80195r03454q81408p76398p22860p22101o73980n79824n58558
10369A6539185n53871n13697m77680m74174m97271m45567m23834l83241l97199
10360A2372651l98256l69761l66908l25355l01066l03345k42103k48358k60779
10351I556720k79703k79672k65476k50541k22640k34770k41280k20486j93711
$$ y = [93920238, 98244525, 103320285, 108587281, 113403596, 117090544, 119001990, 118734870, 116215897, 111591395, 105214875, 97628677, 89541704, 81537421, 74046443, 67282349, 61348773, 56154712, 51640962, 47783747, 44395264, 41408044, 38795538, 36452381, 34365243, 32479537, 30836991, 29318835, 27918611, 26607179, 25387157, 24328642, 23337963, 22357768, 21454314, 20572906, 19796508, 19073648, 18351547, 17677567, 17097743, 16539185, 15985314, 15471617, 14993937, 14519763, 14022492, 13576925, 13153091, 12769850, 12372651, 11974395, 11604634, 11237726, 10912371, 10611305, 10307960, 10065857, 9817499, 9556720, 9277017, 8997345, 8731869, 8481328, 8258688, 8023918, 7782638, 7562152, 7368441]
10342G368441j84013j44905j64058j90643j64309j29291j63797j22258j61047
10333E944120r4140r8284j12979j51174j50912j09018j36914j94906j73659q4415
10323D637719j30429j20053r5086m6423l3814j11719j36303r8439r3201q6411
10313C685841o5346p5273p3668q7140p5069p5505m8789n3199p8211n1635o8790
10302B933216n8410q1717l9015k3503n1869m7653n3653m5915n9337k1690l6078
10291B414376k4701k4678J726m7906r2951o8319o1183m6387n8255o5571p8627
10280A847524m6669m1166o3107m8341k3217j9276p88O375m5715m6903j3343j6236
10268A489138J3574n7358o0582q034k2965n1130n355l6750l8693k6449n5477n6268
$$ y = [7368441, 7184428, 7039523, 6875465, 6684822, 6520513, 6391222, 6227425, 6105167, 5944120, 5849980, 5751696, 5638717, 5487543, 5336631, 5227613, 5090699, 4895793, 4722134, 4637719, 4507290, 4387237, 4292151, 4245728, 4211914, 4100195, 3963892, 3865453, 3772252, 3685841, 3620495, 3545222, 3471554, 3384414, 3309345, 3233840, 3185051, 3131852, 3053641, 3002006, 2933216, 2874806, 2793089, 2754074, 2730571, 2678702, 2631049, 2577396, 2531481, 2472144, 2450454, 2414376, 2389675, 2364997, 2366723, 2318817, 2225866, 2157547, 2096364, 2049977, 1991722, 1926151, 1847524, 1800855, 1759689, 1696582, 1648241, 1625024, 1605748, 1604960, 1611335, 1565620, 1518717, 1505374, 1489138, 1502712, 1445354, 1384772, 1376738, 1353773, 1302643, 1297288, 1260538, 1221845, 1195396, 1139919, 1083651]
10256A083651l9382l0286L1982l3192l9160j6814l1819r034j8547m5914k5364
10245H26121j9211l255K4148J3504n044k5196k8262n2747o0007j428K0178N3134
10233G41935J476l7684m200N592L235p325p52j8821k9175J2265k0899l3845o1959
10220E49843j6419M3979J3460p615Q368l05M425P097J0243j9801p9090m3936M2466
10207E12715N2725J381N110k9684n870J1900M052R077p223J2018L6870q777n9501
10194E34793k2471k699O007j8928n9046j7540P941q254q391N2590P899k3635l2918
10181D15348q719M9759j724k0460r220k2916Q080j2029M3495N554n360l5407l0182
10168C76219J8545j4769J9302L2020j5541k4703l229j5591M2745K3153J5755j0678
$$ y = [1083651, 1044269, 1013983, 1045965, 1012773, 973613, 956799, 924980, 915946, 897399, 851485, 826121, 806910, 803655, 827803, 841307, 836263, 811067, 782805, 730058, 670051, 668623, 688801, 741935, 743411, 705727, 701527, 707119, 710354, 703029, 702277, 683456, 654281, 666546, 645647, 611802, 549843, 533424, 577403, 590863, 583248, 591616, 591311, 595736, 602833, 613076, 593275, 514185, 470249, 512715, 565440, 566821, 571931, 542247, 536377, 548277, 552329, 561406, 554183, 566201, 603071, 594294, 534793, 512322, 509623, 515630, 496702, 437656, 420116, 428057, 419803, 411412, 464002, 471901, 448266, 415348, 406629, 456388, 454664, 434204, 424984, 402068, 410148, 398119, 441614, 447168, 441808, 406401, 376219, 394764, 379995, 399297, 431317, 415776, 391073, 387844, 372253, 414998, 438151, 453906, 443228]
10156D43228l3979m0237K0551M4834j7026k8814k8552m9432K5461L8098r659N567
10144C70040M260J0524k3781o4440j1442N8347L6751l4808k3833K8701n492K649
10132C47476k3537J5930L326J7030O1916m8384n7342K2678L0914j3957m2434m811
10120C08805j1765R729j9557m1621m0218j5612K1356M874K3720K6690k6833K3604
10108B63172L666l0157j1412M091K5813l0570l4256K9204N1436M694o183l4881
10096B34617l7507J3812L8208J3927j3566J509M5928J4188m7673k0310M7906j1974
10084B79065r428L9721l3197j5682M2005K0162J8514J3425j0168J0461M7629M5192
10072D47699K7332K4603N7266Q3259N3443J4341L2443L7173K2504M0489P9263
$$ y = [443228, 409249, 369012, 389563, 434397, 417371, 388557, 360005, 310573, 336034, 374132, 364473, 370040, 374300, 384824, 361043, 296603, 285161, 343508, 380259, 345451, 321618, 350319, 344827, 347476, 323939, 339869, 343195, 360225, 422141, 373757, 316415, 339093, 370007, 356050, 313616, 308805, 297040, 306769, 287212, 245591, 205373, 189761, 211117, 215991, 239711, 266401, 239568, 263172, 266838, 236681, 225269, 229360, 255173, 224603, 190347, 219551, 270987, 275681, 269498, 234617, 197110, 210922, 249130, 263057, 249491, 251000, 296928, 311116, 263443, 243133, 291039, 279065, 269637, 309358, 276161, 260479, 302484, 322646, 341160, 354585, 344417, 354878, 402507, 447699, 475031, 499634, 556900, 640159, 693602, 707943, 740386, 777559, 800063, 840552, 919815]
10061I19815P3839P3791M6733J7991K7610M0768J83479L54403P24422J147732
10051C610583O01580k34583j36734K08330j45217j111704p85900l40569j14837
10042A550949o4544l5408o4569o4835n3995m0112j6296n0198o6839o9024q5005
10031I40124o1418m3904K9921J553Q81J8723J2978J2203r374J0737L1650K5736
10019I69810j8688l470k148J3483L7461M2024Q0713m943m1654n110j3635k9188
10007A024655k7722n62j7867l8283k1024N058m25j6548m6909l8363O169j9828
9995H08351l6849J4145L6067n0195r4807m4507K2487L6116J9962J6228N791K4638
9983G57427J3496q907j7036m720J3689j1218L488j1301q566l3781n8381o7817
$$ y = [919815, 993654, 1067445, 1114178, 1132169, 1159779, 1200547, 1384026, 1738429, 2462851, 3610583, 4212163, 3977580, 3840846, 4049176, 3903959, 2792255, 2006355, 1665786, 1550949, 1486405, 1450997, 1386428, 1321593, 1267598, 1227486, 1211190, 1160992, 1094153, 1025129, 940124, 878706, 834802, 864723, 866276, 867157, 885880, 898858, 911061, 901687, 912424, 944074, 969810, 951122, 947652, 945504, 958987, 996448, 1038472, 1119185, 1114242, 1072588, 1067478, 1053843, 1024655, 996933, 996371, 978504, 940221, 919197, 924255, 923830, 907282, 860373, 822010, 828179, 808351, 771502, 785647, 821714, 771519, 676712, 632205, 654692, 690808, 710770, 726998, 732789, 757427, 770923, 762016, 744980, 740260, 753949, 742731, 746219, 734918, 726352, 692571, 634190, 566373]
9971E66373l0326n0792n3737l4893n7395l1055K8811M1007K2362m8292m9202k1778
9959B81083j6006o503N750j7404m9864K2695L9247j1097m412l4439p080L7664
9947B39634L5007p002k0120J1394l577k7477n2971K7414o033J905j7907k7446
9935A52821m1690P278K2995O3770P1075R849j3531l4069J6413K427k6321k540
9923B28477m195j1744K38k5421L8470n695j3312q917j3335J970j140K0495L2914
9910B38805J5486K3018k825k9243l2645N57j121J3160Q413K2758j6583m2097J4965
9897B12648O2050L2358k4614j5785K4004Q352j5418m073L2863l1152J8477L6603
9885C36313K4367M144k1896k0457k3630N676l8272K5825K6005M186k577j6192
$$ y = [566373, 536047, 485255, 431518, 396625, 339230, 308175, 336986, 377993, 400355, 352063, 302861, 281083, 265077, 258574, 264324, 246920, 197056, 219751, 258998, 247901, 243489, 209050, 201970, 239634, 274641, 267639, 247519, 258913, 255336, 227859, 174888, 202302, 196269, 198174, 180267, 152821, 111131, 118409, 141404, 205174, 276249, 286098, 272567, 238498, 254911, 257338, 231017, 228477, 224282, 212538, 212776, 187355, 225825, 220130, 206818, 197901, 184566, 186536, 185396, 205891, 238805, 254291, 277309, 274484, 245241, 212596, 213153, 212032, 225192, 233605, 256363, 239780, 197683, 212648, 274698, 307056, 282442, 266657, 290661, 299013, 283595, 279522, 312385, 281233, 299710, 336313, 360680, 364824, 342928, 322471, 298841, 304517, 266245, 292070, 318075, 322261, 319684, 303492]
9873C03492j933k1371l0925r060J8518l1239j9756K7492J2529j4814J1499K1962
9861B66394l715J0455k145J7286P483l034J0077N5430j9753l6704K5820j0092
9849C17502m0378p721p03J1045o05k3650P942K6104r249j7186Q044P005r949q692
9835B59509j7231m4K5223N525R515j3106J0334R476n976J3024k467J6272o463
9822C03591k6363k976j0204k1854n0836rJ0046K3878M5955L1047j0430k5958j6663
9809B49224m811J2092P434N5824m671l5663R314q393J6364K2284J7361k451k2573
9796C11335P893L2376J4346k2176k7269q921r701r542J4041J0620J0206j1469
9784C11739K5390K2216J6629j2200k4528k0943K27L7198J5132K6541q381o13L868
$$ y = [303492, 301559, 280188, 249263, 240203, 258721, 227482, 207726, 235218, 247747, 232933, 244432, 266394, 262679, 273134, 270989, 288275, 295758, 292724, 302801, 358231, 338478, 301774, 327594, 317502, 277124, 269403, 268700, 279745, 279140, 255490, 263432, 289536, 280287, 263101, 271145, 278150, 268201, 259509, 242278, 242234, 267457, 272982, 282497, 269391, 279725, 289201, 283225, 296249, 293782, 310054, 303591, 277228, 274252, 264048, 242194, 191358, 191349, 201395, 225273, 271228, 302275, 291845, 265887, 249224, 244413, 256505, 263939, 319763, 315092, 279429, 288743, 280350, 296714, 318998, 336359, 333908, 311335, 319228, 351604, 365950, 343774, 316505, 307584, 297883, 288341, 302382, 313002, 323208, 311739, 337129, 359345, 375974, 363774, 339246, 318303, 318530, 355728, 370860, 397401, 389020, 388407, 392275]
9771C92275M2877p407K0934J1532J1461J4210m0092l3608L5488j1307P60l4124
9759D02999j5322l571Q627L9060K3662j4822K6218J237N908l398l2862j0460J1719
9746D38995n544l015J0561l696J2885k8358L7130J0514Q867K1305J3760J9120
9734E32524k2811k1452k4998r05K5891K5086L2321j8220j6286M9538O2700k363
9722F21025j879k1812j8533J7178q273j4076p154Q148M5723J8965n5729j4415
9710E69168K9528J771k6020J5466L4746R085n129n396j3967Q731L3488j5955m1197
9697E94319J1167R411K3664J9269L299o4950n039N231K5104J6330j9492K307l188
9684F17432l4958l0894K6079L6027N3227K4956q341j5467j9652N915K5379k5861
$$ y = [392275, 435152, 427745, 448679, 460211, 471672, 485882, 445790, 412182, 447670, 436363, 437123, 402999, 387677, 384106, 392733, 431793, 455455, 440633, 466851, 468088, 473996, 470598, 437736, 427276, 438995, 433451, 430436, 440997, 437301, 450186, 421828, 458958, 469472, 478339, 499644, 513404, 532524, 509713, 488261, 463263, 462358, 488249, 513335, 545656, 527436, 511150, 560688, 623388, 621025, 619146, 597334, 578801, 595979, 587706, 573630, 566476, 574624, 620347, 639312, 583583, 569168, 598696, 600467, 574447, 589913, 624659, 633744, 628615, 623219, 609252, 617983, 651471, 635516, 594319, 605486, 614897, 638561, 657830, 661129, 596179, 591140, 596371, 621475, 637805, 618313, 620620, 617432, 582474, 551580, 577659, 613686, 666913, 691869, 683528, 668061, 648409, 654324, 679703, 653842]
9672F53842N610M0528K5190J054p155m2179J3230j0305m533P645N1880J3732K4585
9659G73124O529l7313K2483R048J1138K773L3816j9233j0748K7155J0881l8375
9647G91278p3844m7405K4879L8297M859J81k5857L924l782m9925k301J6091L9
9634F76434J4985k3630K276J1732J4807r824m4049m3747k5927R317j1319L4950
9622F06005O7137p785R997J025m9734l2499R090r135p601J2863m7899l0091J2751
9609E34124M3478p962m5537k3952K4885M2954q797j2332K2034M1336n6039k6444
9597E27748j8712J4255J3887K7747K1398J5098K548O249j9179n0539j8169o802
9585E15529p634l4040k7151j552J8371Q389m7689r34M653j6020j0233J8341R673
$$ y = [653842, 659452, 699980, 725170, 726224, 719069, 676890, 690120, 679815, 675282, 682927, 734807, 748539, 773124, 779653, 742340, 764823, 773871, 785009, 787782, 821598, 802365, 791617, 818772, 829653, 791278, 717434, 670029, 694908, 733205, 738064, 738245, 712388, 716312, 712530, 662605, 660304, 676395, 676434, 691419, 667789, 670065, 681797, 696604, 686780, 642731, 598984, 573057, 582374, 571055, 606005, 673142, 665357, 675354, 676379, 626645, 594146, 603236, 594101, 586500, 599363, 551464, 521373, 534124, 577602, 569640, 524103, 500151, 525036, 567990, 559193, 546861, 568895, 610231, 554192, 527748, 509036, 523291, 537178, 564925, 586323, 601421, 603969, 610218, 591039, 540500, 522331, 515529, 507895, 473855, 446704, 445152, 463523, 471912, 424223, 423289, 427942, 411922, 401689, 420030, 429703]
9572D29703J5697J2923j2554n0307k3434l77K2447l981J607r933j092Q024J7771
9559D06494o608J3297L3283k441m1635n696j3911k4032L879J0404l1442k4860
9547C16732K398J2756m748j8965L5719k4943J0850J7038J4466k525l3252K8196
9535C53722L5011l7857K214m4976k4824R160K9717M682j0695l672q886l958j8419
9522B81219k493J3688l7584l5325l461k3122L1106K1771K129p702K741K5859j5479
9509B53347j145L3304p76R622j0315l7982P063J1868k9202J9772j1416q90q10
9496B42440k0686m861Q544m852l1811K9273M8475M980N416J0178j1888J6206j640
9483B89774M0092P7868R7348Q3990J2663p615L251L582p5214j03507m4687k040
$$ y = [429703, 445400, 458323, 445769, 395462, 372028, 371651, 394098, 390117, 391724, 381791, 380699, 388723, 406494, 399886, 413183, 446466, 444025, 402390, 396694, 382783, 358751, 362630, 373034, 341592, 316732, 319130, 331886, 327138, 308173, 343892, 318949, 329799, 346837, 361303, 358778, 325526, 353722, 388733, 350876, 353090, 308114, 283290, 292450, 322167, 326849, 316154, 312482, 303596, 299638, 281219, 278726, 292414, 254830, 219505, 216044, 192922, 224028, 245799, 247928, 240226, 242967, 268826, 253347, 252202, 285506, 284730, 294352, 284037, 246055, 253118, 264986, 235784, 255556, 244140, 243250, 242440, 221754, 216893, 225437, 220585, 188774, 218047, 266522, 271502, 276918, 287096, 275208, 291414, 289774, 329866, 407734, 505082, 589072, 601735, 594120, 597371, 600953, 525739, 422232, 377545, 375505]
9471C75505k452K3616J27057J60391M2606l9172n9396m3159o9264q0983m0941
9460C93808k1457n7839o8530o4302Q085K7102m3046k2182j1658M2605K1872j0493
9448A93965m668k21Q572k8333k6219L3025L1015K5787j3419L9016K2656l7099
9436B44077l4964k2276p118P975q890m2887P418J6563K7730l1450p777l5200l585
9423A09616J0584k2127j2307M048J9981K8605j2995j2706j9568N1614q762r148
9411A26835j9166p211J8675k0J1152j3896q106j3417j6744q420j2355J8908K3744
9398I9979m728j5106k306n8079N284j3798L5821K6595J213j9492L7156K9610k0535
9385A01614O446M4933K00l8810r043J934l7859M8225K0465k0291k4759k4190K040
$$ y = [375505, 373053, 396669, 523726, 684117, 726723, 687551, 628155, 584996, 515732, 434749, 393808, 372351, 314512, 245982, 181680, 189765, 216867, 173821, 151639, 139981, 182586, 204458, 193965, 189297, 189076, 197648, 169315, 143096, 176121, 207136, 232923, 219504, 258520, 281176, 244077, 209113, 186837, 179719, 187694, 178804, 135917, 143335, 159898, 187628, 156178, 148401, 113201, 109616, 120200, 98073, 85766, 89814, 109795, 138400, 125405, 112699, 93131, 144745, 135983, 126835, 107669, 100458, 119133, 119113, 130265, 116369, 108263, 94846, 78102, 69682, 57327, 76235, 99979, 95251, 80145, 77839, 19760, 25044, 11246, 47067, 73662, 74875, 55383, 92539, 122149, 101614, 108060, 152993, 153193, 114383, 105340, 107274, 69415, 117640, 138105, 117814, 93055, 68865, 70905]
9372G0905k6745l2130N968L3114K3771k738K8688o484j9846J0343k7918J2326
9360F9254J8121l451N069J3654J0990l2304L455K8350L4665K1478j5785m2007
9348A11489O082L0927O03J508j6343k6934o264j1964n531L2094q044l5208K774
9335G5189K5526p721j9396l1067n4605K7227J2872K3770M9241k9265L198J432
9323G6401j1696k7917k5754j2508r390K0066K3435M15P346R215K4884J2714k0358
9310F6853p155K156Q402q483m5102o472M2271J5657P692l4825l3876K0579M0697
9297F8394R891K2803j1396k2027P363J037P70o3362K203J8999J7897K218L4771
9284H9561Q402l3547k4281L6764K4298o3771m1680K8921O8781J7096p701l7379
$$ y = [70905, 44160, 12030, 17998, 51112, 74883, 72145, 100833, 94349, 74503, 84846, 56928, 69254, 87375, 83924, 88993, 102647, 113637, 81333, 84788, 113138, 147803, 169281, 153496, 111489, 117571, 148498, 149101, 150609, 134266, 107332, 101068, 89104, 83573, 115667, 107623, 72415, 75189, 100715, 92994, 73598, 42531, -12074, 15153, 28025, 51795, 101036, 71771, 74969, 76401, 64705, 36788, 11034, -1474, -10864, 9202, 32637, 33052, 40398, 49613, 74497, 87211, 66853, 59698, 61854, 70256, 61773, 16671, 10199, 52470, 68127, 75819, 40994, 7118, 27697, 68394, 78285, 101088, 89692, 67665, 75028, 76065, 76835, 13473, 15676, 34675, 52572, 54790, 89561, 97963, 64416, 40135, 76899, 101197, 37426, -4254, 24667, 93448, 110544, 102843, 65464]
9272F5464k4223l0231L0695L8949l0681l442J4496Q790J4056J763k4405n236J3886
9259F9881K1675K886j9571k6067K4250o28m2341K41m782J5179Q305j4246k4272
9246A0510K0151j5799l4519k2991J8554L5725P041m806L9821q76K8254J444q68
9233H1641j7052L6585K5541p989k5912l1515n7579L04j6281J2936K0718M9065
9221G0462O1623j5929o4877o330k0662l564K7061P293j3585j0270M29J8128J5547
9208F5326J9459k14p824L670m8275j5720R774K0137K1308k12j4595J759o449n851
9194D2293J782P013j3037J453Q432k388K0454K7813n5345m2268M2332L2768o517
9181F4785j6508O3547N6857j6594p2565l6624l633J2748k4507m424M0940Q6539
$$ y = [65464, 41241, 11010, 41705, 80654, 49973, 46531, 61027, 69817, 83873, 85636, 61231, 55995, 69881, 91556, 94442, 74871, 48804, 73054, 72426, 30085, 30326, 25544, 40723, 49028, 34782, 10510, 30661, 14862, -19657, -42648, -24094, 11631, 18672, 13866, 53687, 52811, 81065, 82509, 81641, 64589, 101174, 126715, 118726, 92814, 61299, 3720, 4024, -12257, 679, 21397, 70462, 132085, 116156, 51279, 44949, 24287, 20723, 47784, 55077, 41492, 31222, 31651, 49779, 65326, 84785, 84571, 76747, 80417, 32142, 16422, 26196, 46333, 67641, 67429, 52834, 54593, 48144, 42293, 44075, 51088, 38051, 39504, 47936, 45548, 66002, 93815, 38470, -3798, 38534, 71302, 64785, 48277, 111824, 168681, 152087, 79522, 42898, 39265, 52013, 27506, 23082, 64022, 150561]
9169A50561L3094q181l2601k2208l8338l4008k1100k293P352J3053K109r726J4583
9156E2297K8427j4608K6715J5853J1804j6523l7174k8203k444k753L7674M7886
9144A18951j1217j039k3573k4499p975o175r319J8718J9022j7179Q642k6492o487
9131C1378n268j4346l0051J4630M1784J8630J9316o960K940K0065L836n0551n2611
9118g208L9707L7716p747n2493l5024J0205J0626j7362k5355P382K7190L9572
9106B7209p844J2686l4530K1945L5047j702M434j3770J3171L0492j5358n3884
9094A7896J7023N1243n39k8798m0022j5764j3958K0027L7326L5990j0153k1663
9082D8608l305J0181k218j6851j4170L3473m61J2816L0219l1269m1378K9327O4261
$$ y = [150561, 183655, 175474, 142873, 120665, 82327, 48319, 27219, 24926, 32278, 45331, 47440, 37714, 52297, 80724, 66116, 92831, 108684, 120488, 103965, 66791, 38588, 36144, 33391, 71065, 118951, 107734, 106695, 83122, 58623, 50648, 44473, 35154, 53872, 72894, 55715, 64357, 37865, 31378, 26110, 11764, -18287, -3657, 38127, 56757, 76073, 69113, 72053, 92118, 95954, 45403, -7208, 32499, 70215, 62468, 9975, -25049, -14844, -4218, -21580, -46935, -39553, -12363, 27209, 19365, 32051, -2479, 19466, 54513, 52811, 57245, 43475, 56646, 87138, 71780, 17896, 34919, 86162, 85623, 56825, 16803, 1039, -12919, 7108, 44434, 80424, 70271, 48608, 45303, 55484, 53266, 36415, 22245, 55718, 55257, 68073, 98292, 67023, 25645, 54972, 119233]
9069A19233M66k1492J8571k432l0401M918l5136j0296K9132p069J606K0904N2275
9056A40279j61q7649n3073M1784j4601l1112j3609N464K4708L3728J8794m0822
9044B3730k597O904j451k6907L73M5283K3608j5586l5437L2105M9344K8422m3303
9031H4488j9834l741j9862L3903M0790m3890Q74l4962J5656l1745M220j4156M7399
9018E9140J3726j7349K8293N7k9923q280J488j4521N170J6584K9662K0712M001
9005A08760m5574K290R717N703k0242j5514P413j9371m9694Q20J2834M6425J8038
8992F1605m2596P621J9581j1948J8038M6534K3819j6996j9212K3668q974r861
8980I1279K2068j6864k7223j5229j704N252M07K7760k8172n8433j6927j0579K2342
$$ y = [119233, 119699, 98207, 116778, 114346, 83945, 88863, 53727, 43431, 72563, 65494, 67100, 88004, 140279, 140118, 52469, -604, 41180, 26579, -4533, -18142, -12678, 12030, 45758, 64552, 23730, 21133, 28037, 26586, -321, 52, 45335, 68943, 53357, 17920, 50025, 99369, 127791, 84488, 64654, 60913, 41051, 74954, 115744, 71854, 72728, 37766, 53422, 21677, 25897, 11741, 59140, 72866, 55517, 83810, 83867, 53944, 45664, 47152, 32631, 37801, 54385, 84047, 104759, 108760, 63186, 65476, 75193, 80896, 60654, 45140, 52553, 33182, -16512, -15692, -2858, 43567, 61605, 19009, 26630, 46211, 34263, 52301, 98835, 122654, 105658, 86446, 110114, 101140, 91279, 113347, 96483, 69260, 54031, 52327, 57579, 57986, 85746, 57574, -859, -17786, -28365, -6023]
8967f023L6155n184j0032Q896Q973O032L7468Q654l3759Q414O760k9860k6229
8954A0265J3585j6702j9276p915J7265n377J6756j8099k7989K2990J7132P816
8942A0451J921p261j2400Q15R439J4844J7498K2607K3875o262k2981j2676p247
8929C2623l0433j2710J8321j5996k9614J3082M1513k163K7389K6535O453N099
8917H0099j0426p576N321K5422j6319O998n781M920k9190o880O039P492J3476
8904G3595l8675j7031p246j4070o467l049N816M4348K2530l497P9o207k9859n307
8890A4960Q150K0192O750l901k1330l6956K831K3285M2067K9839j0669p1166j0017
8877e965L7008L0312l073j7158k0911m1762o130K130q011K4227J0068Q708J3687
$$ y = [-6023, 30132, 24948, 14916, 23812, 32785, 38817, 76285, 84939, 51180, 59594, 66354, 36494, 10265, 23850, 7148, -12128, -20043, -2778, -8155, 8601, -9498, -37487, -14497, 2635, 10451, 12372, 5111, -7289, -6474, 2965, 17809, 35307, 57914, 81789, 75527, 52546, 39870, 32623, 2190, -10520, 7801, -8195, -37809, -24727, 16786, 14623, 42012, 68547, 75000, 80099, 69673, 62097, 67418, 92840, 76521, 83519, 77738, 82658, 53468, 46588, 52627, 60119, 73595, 34920, 17889, 10643, -3427, -9894, -12943, -7127, 37221, 59751, 56254, 56333, 50126, 20267, 14960, 23110, 43302, 50052, 46151, 24821, -12135, -9304, 13981, 56048, 85887, 75218, 4052, -5965, 31043, 61355, 58282, 41124, 20213, -21549, -27679, -25549, -33560, -9333, 735, 9443, 23130]
8864B3130K4151j1802k7825j1963k6141J6774K0783l040j1932L4455K4202l9103
8852A1689k7524k1956R166J5500J2676J4934M8336J8072o374k9370m5772j4118
8840a4741K5978j4330L8671K935k485K1509Q1j0307l5367k6174j2382L1964J9965
8827B5317j0075q936l1746K2185l1979J0899K1602K6253M380R819L0381l5741
8815C2359p106J1781J0015j5664J7535l625k961k5289J966O0772p397m729K0233
8802H7890K388k0604j8829j236n9355k7649J0600M28M929K1055K4179r673J3887
8789B8010M2171K8844o5J0829n788J7846n408l7372m299l18J2402K3221k9707
8776H0366l2254m2628r888M3905L5249l1263j7397L788Q901j8150l3158k2136
$$ y = [23130, 47281, 35479, 7654, -4309, -30450, -13676, 7107, 4067, -7865, 26590, 50792, 11689, -15835, -37791, -28625, -13125, -449, 14485, 62821, 80893, 74519, 45149, -623, -14741, 11237, -3093, 35578, 38513, 36028, 57537, 57618, 47311, 11944, -14230, -26612, 5352, 25317, 15242, 6306, -25440, -3255, -35234, -24335, -2733, 23520, 27900, 37719, 68100, 32359, 25253, 37034, 47049, 31385, 48920, 45295, 42334, 17045, 19011, 79783, 72386, 67657, 87890, 90278, 69674, 50845, 49609, -9746, -37395, -26795, -26367, -21438, -383, 23796, 14123, 28010, 70181, 99025, 98960, 109789, 104001, 121847, 116439, 79067, 74768, 74450, 86852, 110073, 80366, 48112, 5484, -4404, 39501, 74750, 43487, 26090, 29878, 38779, 20629, -12529, -34665]
8764c4665M5788L4723Q545k563j1622J5278l4925J4850J8248j4419r091m2175
8752a2028l596J1364k217R064K6122k095j8043o267R694o331M570j4410M2761
8739C8588M785j2311K0416P754k7551m2747o769m594J259M8035j0245o451k7686
8726a7517N771M584K8351L5839q395j4607k5352l1479k4199L5409O3920M2724
8714I5049P049r356m1240j6280k9069j9347Q271p138J7785K3257j0338j892J7959
8701C4710O1044L351m3467J7834r352J2574O722r270j1852L074M2744k7935n3692
8688B6485j4910J8061l752J1198J1898l2876p298Q70M3708K1003j8285j1147j9742
8675B5213j3984l5329M915N3314O1435j9977n495L877l5468r258j3477q898R452
$$ y = [-34665, 11123, 45846, 54391, 51828, 40206, 55484, 20559, 35409, 53657, 39238, 30147, -12028, -15624, -4260, -6477, 2587, 28709, 26614, 8571, 2304, 11998, 5667, 10237, -4173, 38588, 43373, 31062, 51478, 59232, 31681, -11066, -17835, -22429, -21170, 26865, 16620, 10169, -17517, -11746, -7162, 21189, 57028, 48633, 34026, 8674, -22805, -47004, -11595, 52325, 95049, 102098, 92742, 51502, 35222, 6153, -13194, -4923, -12061, 5724, 28981, 18643, 16751, 34710, 95754, 99105, 55638, 73472, 64120, 76694, 83416, 74146, 62294, 65368, 108112, 80177, 26485, 11575, 29636, 25884, 37082, 48980, 16104, 8806, 9676, 53384, 74387, 56102, 44955, 25213, 11229, -24100, -19185, 34129, 95564, 75587, 70092, 73969, 38501, 29243, 15766, 6868, 16320]
8662A6320J3023L1259j64j5224r970P74J5785o719j0892L862K3997K9675k3852
8649F7874m8139k8936Q62m0126R967K0779N5847M9190k6325m1845P684N4646P560
8636H9038k9908k9426O374K7531J8837J3980m682J0655L8987J5269k0063l1743
8624A04849K0626L1055J0394N121J4808K2005L9466K9355O5621R0876L3237j1194
8612D56219J173j997K3723m4271o5924j7677k9689J202l6875K5924Q940J744J0386
8599C32878l2320R000l56k3476m7215l3070k4861M2255o282l2367j6170L691j2367
8586A59340k6232K7303k0839K1348K6231J3212L2737N359j5139l5474K2893K739
8574B13478N0657L8764N7236J62401J37731L1243J5788j0711K5294n6443j44419
$$ y = [16320, 29343, 60602, 60438, 45214, 35244, 36018, 51803, 45084, 34192, 38054, 62051, 91726, 67874, 19735, -9201, -8339, -48465, -38498, -17719, 38128, 87318, 60993, 19148, 26832, 81478, 89038, 59130, 29704, 36078, 63609, 82446, 96426, 91744, 102399, 141386, 156655, 136592, 104849, 125475, 156530, 166924, 172045, 186853, 208858, 248324, 277679, 343300, 434176, 467413, 456219, 457392, 455395, 479118, 434847, 368923, 351246, 321557, 322759, 285884, 311808, 320748, 322492, 332878, 300558, 309558, 309202, 285726, 238511, 205441, 180580, 222835, 216553, 184186, 168016, 171707, 159340, 133108, 160411, 139572, 160920, 187151, 200363, 233100, 238459, 223320, 187846, 210739, 213478, 264135, 302899, 360135, 522536, 660267, 691510, 707298, 696587, 721881, 665438, 521019]
8563E21019j27927j01703m7661J9378K7660q98j9843k3946J800M0631J8371L5585
8551C42466K0085J0519l2360k9695k143M3832J8428j689k422O144k8947L711l2932
8538C14997n2623j6790o289o914K2513J3398o0482l8743J5868O436j1148N5778
8526B36001Q8781M3894J4084K2855n806o071o9425l4636n3512j5410j1399J0870
8514B20226M7742N1991j2035j1062J2596L201j9923J4405J0154m5893m0817n1529
8502A79056L08J1185M525K5541j3452m1881N836J4609J8289k7006k7860M79R082
8489A58711L1585m5868k3564J8965p738k5258J1823J912k1228K3495K884k6225
8477I9494o0385R203J95J1269p25Q794J1841j2541L962J0764P894m459J9140J8582
$$ y = [521019, 393092, 291389, 243728, 263106, 290766, 289868, 270025, 246079, 247879, 288510, 306881, 342466, 362551, 373070, 340710, 311015, 308872, 352704, 371132, 369443, 367021, 373165, 344218, 347929, 314997, 262374, 245584, 239295, 232381, 254894, 268292, 207810, 169067, 184935, 191371, 180223, 236001, 324782, 368676, 382760, 405615, 399809, 393738, 324313, 289677, 236165, 220755, 209356, 220226, 267968, 319959, 307924, 296862, 309458, 312659, 292736, 307141, 317295, 271402, 230585, 179056, 179364, 190549, 195074, 220615, 207163, 165282, 171118, 185727, 204016, 177010, 149150, 149629, 158711, 190296, 144428, 120864, 139829, 132091, 106833, 118656, 120568, 99340, 122835, 125719, 99494, 39109, 48312, 48507, 59776, 59051, 67845, 79686, 67145, 71107, 81871, 89765, 85306, 104446, 123028]
8463A23028J014J6116k7569m4693n2642J0240M6355M0424m2658m1997K4168j680
8451E0106M25L968j5675j1090K7483k4122J792L0438N8914R397n3199M891L9619
8438A22947N2701Q16k7485j1800K0265K7121n273L50K4928M6043L5084K7217k4834
8425B88080m9243l6379n1517l0605N962J6435l0426j593J3384N0878j9056j4565
8413A41355P975l2445K880M236J7347m199k1957l7810l0775J5441J8999l905k8056
8400D9086l6860l1019J098K3341K5878j1743J6023K4175l466k7775j4566Q3K2335
8387C6590j469J2495K5835J5031J5767L555K7833M489k1403l7817J3237j0811
8375H3332p4784R370L4178j0088L34J3362L071J246n593k3184j285Q350M357J4203
$$ y = [123028, 124042, 140158, 112589, 67896, 15254, 25494, 71849, 112273, 69615, 27618, 51786, 50106, 50531, 54499, 38824, 27734, 55217, 31095, 32887, 63325, 122239, 131636, 78437, 83328, 122947, 175648, 176464, 148979, 137179, 157444, 184565, 179292, 179642, 204570, 250613, 285697, 312914, 288080, 238837, 202458, 150941, 120336, 126298, 142733, 112307, 110714, 124098, 174976, 155920, 141355, 149330, 116885, 119765, 124001, 141348, 137149, 115192, 77382, 46607, 62048, 81047, 77142, 49086, 12226, -18793, -17695, 5646, 31524, 19781, 35804, 59979, 56513, 28738, 14172, 14255, 36590, 35121, 47616, 73451, 88482, 104249, 107804, 135637, 140126, 118723, 80906, 94143, 83332, 8548, 17918, 52096, 42008, 42342, 55704, 58775, 60021, 54428, 31244, 29959, 38309, 42666, 56869]
8361E6869L947m3188j2661J3129K951M114q144J8146K0635Q58J782l3674m4646
8348a9882K9493M8833r534o168P737m2090L9061L3064J893k1226q285k3329J7597
8335D7164j5691k831J4046Q067j0797J459J5871K078j6996Q417K65J8974K978
8322G3004n8365n497L4153o641q582P410J6645J328M28k6036j5993j0264q884
8309g294r053p841J6009K7503K5934K4084k9373k0780j167Q392N605m1535Q155
8296a361N2860N238l7040k4452J4208k3572k1269M435L5786K0685j225J2092N134
8283D1519J0871j2986j843N925j4841J2791k4097M24L9516K884n397Q207M197
8270F7170Q47k647q127l8103J9478k4017j422k817K9081L4664J6639r144j7595
$$ y = [56869, 60816, 17628, 4967, 18096, 21047, 25161, 17017, 35163, 55798, 56656, 58438, 24764, -19882, 9611, 58444, 48910, 42742, 50479, 8389, 47450, 80514, 82407, 61181, 52896, 29567, 47164, 31473, 28642, 42688, 50755, 39958, 41417, 57288, 59366, 42370, 50787, 51052, 70026, 73004, 14639, 9142, 43295, 36654, 28072, 35482, 52127, 53455, 53883, 27847, 11854, 1590, -7294, -16347, -24188, -8179, 19324, 45258, 69342, 39969, 19189, 18022, 26414, 32019, -9516, -1361, 51499, 56737, 19697, -4755, 9453, -14119, -35388, -30953, 4833, 25518, 24293, 36385, 41519, 52390, 39404, 37561, 43486, 28645, 41436, 17339, 17763, 57279, 60163, 54766, 62973, 67170, 68017, 65370, 57243, 19140, 38618, 14601, 13179, 10362, 39443, 74107, 90746, 81602, 64007]
8257F4007q778j833k045j7325O93J5278n577o844J8663J9744j26m147m2721k7123
8243A866O512l397K5702K9387l5236p890K6006K4637m6044l6053k6165n610L4383
8230a1902J6256M351J9965k9826k5496N1042R377J0432j408k4400j3738K9701
8218C4354r570j3775M827J9921j0367J9150k1112k8185k8669J2924J2177K3018
8206A4693p377o804J3057J7644M7360L0068J8245r766k8748j6842k8927l168J2942
8193E2377N142k8235j2638j0033L2981n450p18M07l4275k7199K2707K0049j156
8180A3959j7974J4441q488K6489K1479r701P556j5452J6358K0737l3763j3205
8168B2436J6889K7562j4016n5407J2531J4890J6554R648j320j2945J8499J6009
$$ y = [64007, 55229, 53396, 51351, 34026, 34719, 49997, 44420, 37576, 56239, 75983, 75857, 71710, 28989, 1866, 8378, 4981, 30683, 60070, 24834, 16944, 42950, 67587, 21543, -14510, -40675, -46285, -11902, 4354, 8705, 28670, -1156, -26652, 24390, 33767, 44199, 42791, 18391, 4653, 34354, 24784, 11009, 15836, 35757, 25390, 44540, 23428, -4757, -33426, -20502, -8325, 14693, 7316, 512, 13569, 31213, 78573, 108641, 126886, 117120, 88372, 71530, 42603, 39435, 52377, 57519, 29284, 16646, 6613, 39594, 34144, 33426, 33833, -442, -27641, -4934, 15115, 13959, -4015, 10426, 1938, 28427, 49906, 40205, 47761, 32309, 48667, 69404, 35641, 22436, 39325, 66887, 52871, -2536, 9995, 24885, 41439, 51087, 49767, 36822, 55321, 71330]
8156G1330l4333K807K1272k4644l6303m204j5099J7364N1444o023j077j0778l6664
8143d908k8309k2089K1670J9250J9211K6301q195K369L1083J2063j2514j6047
8131C9885L375k0257l4071j5628J1955l120M623K7628K595N62n384l1363j9879
8118c9079M2885K6938J4136J552p139K7321m0993l8839k3004j9403L9450L5455
8106A9280q60j5653K2079j1300l8893K995K86J5565n241j2362l1579r417n424
8093g0524L9208M5169k3240l5657J4522L1043P51K4242r886l2744m625j9145R650
8080c1236P625M064o698L0300J6258K1379q117P96N2069J8836Q524j3219p946
8067I2635K2111k6123j9412Q836J9503n0516o6212j9572L1630M5902M8203J1267
$$ y = [71330, 36997, 39804, 61076, 36432, 129, -4075, -19174, -1810, 49634, 43611, 42534, 31756, -4908, -33217, -55306, -33636, -14386, 4825, 31126, 22931, 25300, 56383, 68446, 55932, 39885, 43260, 23003, -11068, -26696, -14741, -17861, -13238, 14390, 16985, 17547, 12163, -19200, -39079, 3806, 30744, 44880, 46432, 39293, 66614, 25621, -13218, -36222, -55625, -16175, 19280, 18420, 2767, 24846, 13546, -25347, -22352, -22066, -6501, -11742, -24104, -55683, -65100, -70524, -31316, 13853, -9387, -45044, -30522, 521, 1272, 25514, 15628, -17116, -21741, -40886, -31236, -23611, -19547, -26245, 4055, 20313, 41692, 33575, 34371, 86440, 105276, 113800, 100581, 92635, 114746, 88623, 69211, 78047, 97550, 47034, -19178, -38750, -7120, 38782, 86985, 98252]
8055I8252l977j5484l5877k0366j2961J3058J9412J6208l567J7324m166j5238
8043E2618k7323j6725j3635K6290L2197P072m6940j5153K1060K0607P671o911
8031D0828j726J3129j724n3615m551M878M0171o439J340J2272L515J9878J2842
8018H0798k0557k3224J2797K0561j8992J70M1439k0692k0597k196k3129M5K8583
8005E5006Q677Q759k5052Q935l5169j0850J0499J6416L9241m3481o4151k3698
7993e4868k9959K5185P3192m174m7543q668k7448O4M1725K7176m0972j015N2701
7980E396M7379Q338p157j8546n8152l0580L0779L1020J3476J5261j6858J2652
7968C3008M1256L7732k2088o3495K1345L6185J1334p033k417l213k5951n9103
$$ y = [98252, 94275, 78791, 42914, 22548, 9587, 22645, 42057, 58265, 54698, 72022, 67856, 52618, 25295, 8570, -5065, 21225, 53422, 60494, 13554, -1599, 19461, 40068, 47739, 40828, 39102, 52231, 50507, -3108, -7659, -2781, 37390, 30951, 32291, 44563, 48078, 67956, 80798, 60241, 37017, 49814, 70375, 51383, 51553, 92992, 72300, 51703, 49507, 26378, 26423, 55006, 63683, 72442, 47390, 56325, 21156, 10306, 20805, 37221, 76462, 32981, -31170, -54868, -84827, -59642, 13550, 9376, -38167, -46835, -74283, -74219, -32494, -5318, -46290, -47305, 5396, 52775, 61113, 53956, 35410, -22742, -53322, -22543, 8477, 21953, 37214, 20356, 33008, 74264, 111996, 89908, 26413, 47758, 83943, 95277, 88244, 85827, 82614, 56663, -2440]
7956b440k7141J0941J1968l8067l4127J9980L765M6462K7897k05O123o87K1732
7943D6201K2998k3170Q562J9783O982l2169o5569l2856O922R091K3671K371L059
7930d124J8761R021k809P562J7289k1628l6651L684j3623l0522J5327M0174K8070
7917C0531N1867j3557p215J294M50o827J023J494J9349l2214l9623M425j3538
7904b541m9761J024N9704J2332m38Q690j5599l6975j5981J9880M9117k2856m9029
7891d2433J6096O854K2085K691O431m122O215K4716l6276k9352L1150L1136K33
7878C5424o160M108L458j8638K4918K1624q329m2789k2932l2825l876K9627M1945
7865B5555J9586j0240R646J8996l887J6982j2015J2622k0132n5424q240L2209
$$ y = [-2440, -29581, -18640, -6672, -44739, -78866, -58886, -55121, -8659, 19238, 19033, 25156, 24469, 46201, 69199, 46029, 54591, 74374, 81356, 49187, -16382, -49238, -42316, -33225, -9554, -7183, -4124, 14637, 23658, 20849, 28411, 45700, 24072, -12579, -8895, -22518, -53040, -37713, 2461, 30531, 82398, 68841, 61626, 62920, 63370, 56543, 57566, 59060, 78409, 46195, 6572, 10997, -2541, -52302, -51278, 8426, 20758, 20320, 29010, 13411, -23564, -39545, -19665, 29452, 6596, -42433, -26337, -19483, 2602, 5293, 11724, 7602, 13817, 38533, 2257, -27095, 4055, 35191, 35424, 29264, 33372, 36830, 18192, 43110, 64734, 56405, 13616, -9316, -42141, -46017, -16390, 25555, 45141, 34901, 44547, 63543, 59656, 76638, 64623, 77245, 57113, 1689, -6551, 25658]
7853B5658J3300j2229n157j4585l2694J3433L6608Q543L0692k0595j6687j8312
7841G975k9452n3134K224L4977K233j2244m2224o79J1737M4562N256Q659K8265
7828H155k4527l669j1430L0200L3715k5889l2932K3430j9381K3338K3160j7520
7816F650m1055n111j7253L9752L5345J5827N162m2212m3650k1114L3327Q172o877
7803c3037M199P185J0642j4077j8896k476Q480l736r359N187K3260K7703J312
7790F387l882Q364m739J746j4908L7968j3563l1719j7909M5542j036R725J5919
7777C7895j2112l3460N031J1740k1316p203k0426K1301L8155L1254m1304J421
7765A0976J2164o321p140Q987J4793o061j1230k0422j4817k6293o3297K0211J5312
$$ y = [25658, 38958, 26729, 21572, 6987, -25707, -12274, 24334, 32877, 63569, 42974, 26287, 7975, -21477, -74611, -72387, -37410, -35177, -47421, -89645, -90324, -78587, -34025, -28769, -20110, 8155, -16372, -20041, -31471, -1271, 32444, 6555, -26377, -2947, -22328, 1010, 24170, 6650, -34405, -39516, -56769, -17017, 18328, 34155, 39317, -2895, -46545, -67659, -34332, -26160, -33037, -28838, -21653, -11011, -25088, -43984, -46460, -37980, -41716, -51075, -45888, -22628, 5075, 6387, 2505, 10869, 6130, 7876, -7032, 30936, 17373, -14346, -32255, 13287, 12251, 21976, 37895, 25783, -7677, -2646, 9094, -12222, -19425, -39851, -18550, 19605, 50859, 9555, 10976, 23140, 16819, 9679, 18666, 33459, 27398, 16168, -4254, -19071, -45364, -108661, -88450, -73138]
7752g3138K1128M3461K4847O20j6903J2938j2359k0787j6776K3333J7996l0044
7740b5684L5346P362l9989l556k14J2101j3401J6869M57j2700l8647n5553K6439
7727i1170L3919R260M135K5157N1849j6808n297j147Q5j4061O559j6965j4338
7714b8822k1348K4711K0827l622l1424k5672J0899N645K9441K7305k3084j6184
7702c1328O030j8403p014M5039j753j0824L9129K3725k2951l0233K4073j3114
7690B376J1672L122j1692k4516j9267l0626J3439Q472j7482K437N2975O137P728
7677D775J3267j0705k951j0407k74J4521K165j5192J1372q829k6157l980J3033
7664a9362J4330Q270J4523J145l1917j6236K508L7061J275K6691k180j8967j6220
$$ y = [-73138, -52010, -8549, 16298, 16918, 15, 12953, 594, -20193, -36969, -13636, 4360, -25684, 9662, 17024, -22965, -26521, -26735, -14634, -28035, -11166, -10709, -23409, -62056, -117609, -91170, -57251, -47991, -43856, -18699, 33150, 16342, 11045, 9898, 9983, -4078, 2481, -14484, -28822, -50170, -25459, -4632, -8254, -39678, -65350, -54451, -48806, -19365, 7940, -15144, -31328, -25298, -43701, -50715, -5676, -7429, -18253, 20876, 44601, 21650, -8583, 15490, 2376, 14048, 17170, 5478, -19038, -38305, -68931, -55492, -47020, -64502, -62065, -9090, -2953, 4775, 18042, 7337, 4386, -6021, -6295, 8226, 10391, -4801, 6571, -2258, -28415, -32395, -19362, -5032, 3238, 17761, 18906, -13011, -29247, -26739, 10322, 11597, 38288, 36108, 17141, 921]
7651I21m1614k7210J6936K7704J6198N659o375l411J9631N064p047Q763K9796
7638D5015k9268l9005J0963L012P821k4590p443o316k7985k461M46K5879J0586
7625c3346k0645o193M0909j8880m119l681K9889J9490k3849m6527k1367O3726
7613b4593L3135j8099l340J2682L0193k508j2872n502N054m5697k8545K1017J7458
7600b1617L006K8098j2368j1229J8300p974m266O800k1954J1376L1825k0735j7378
7587a8116P495J0343j0015m6859l7541N6713K695k533j220k0803k756K395J732
7574e8470J860K0240K1042J4060J9350l639l1567k9628O046j9581M4016r432j7826
7561d3529J594j2061m5558k812N568K9715j0014o142L3025j0677L6175J0104n470
$$ y = [921, -40693, -67903, -50967, -23263, -7065, -1406, -7781, -11192, 8439, 13503, 6456, 15219, 45015, 15747, -23258, -12295, -9283, -1462, -26052, -33495, -39811, -67796, -70257, -69811, -43932, -33346, -53991, -60184, -19275, -38155, -42274, -45955, -16066, 3424, -20425, -66952, -88319, -24593, 8542, -9557, -12897, -215, 29978, 27470, 14598, 9096, 14150, -31547, -60092, -39075, -21617, -18611, 9487, -2881, -14110, 4190, -3784, -8050, -1250, -23204, -11828, 19997, -738, -18116, -10621, -278, -10293, -57152, -94693, -37980, -35285, -37818, -39038, -59841, -62597, -60202, -58470, -56610, -36370, -15328, -1268, 18082, 14443, -17124, -46752, -40706, -60287, -16271, -25703, -43529, -41935, -53996, -99554, -102366, -96798, -67083, -77097, -83239, -50214, -60891, -24716, -14612, -20082]
7548b0082Q196O06J8476j9330r76l9862m163J8082K1659J6553l0795K8990K0535
7535A7889K62k2085l9014q571M0083L2436r276Q189j2034m357J8231J4960o561
7522C0152k8943o906L4712o93l2392m4140L70j0495K5357J4286q104r478J684
7509c4590P008k5965j0067M079J5191n097J6105Q926K6732o932n2931j6208L0711
7496d3038q146J671L4980k8130L636o432o918L206n983j3500j4115O9668L2817
7483A9716K1768k0233j4083j7736m2885k0233K3440J4295n950K7172L1860o257
7471A0874O368n512L676m077l5052j958m675k7043L0186J5084j1205n634Q721
7458b0247k4090r899J8292M0530J2388j0651J1660J984j8548n005K2070j8909
$$ y = [-20082, -11886, -11280, 7196, -12134, -13110, -52972, -57135, -39053, -17394, -841, -31636, -2646, 17889, 18151, -3934, -42948, -51519, -11436, 21000, 11724, 19913, 7879, 3522, 21753, 36713, 30152, 1209, -5697, 29015, 28322, -4070, -48210, -47840, -58335, -32978, -18692, -26796, -36274, -34590, -27582, -53547, -63614, -59535, -44344, -49441, -33336, -24410, 2322, -4610, -57541, -73749, -43038, -51184, -49513, -14533, -42663, -39027, -45459, -52377, -49171, -55154, -68654, -82769, -13101, 19716, 41484, 21251, 7168, -10568, -53453, -73686, -50246, -35951, -41901, -14729, 17131, 10874, 17242, 11730, 15406, 11329, -23723, -25681, -30356, -57399, -27213, -12129, -23334, -28968, -20247, -44337, -54236, -35944, 4586, 16974, 6323, 17983, 19967, 1419, -3586, 18484, -425]
7446d25K1302j3455p9014l0854M0763L9636k6739J041J114J1010K0410L4673J7159
7433C6621n7952m1982K3014N86l7778P889N738Q638J6540J4221J9208k5338K1529
7420i066J2445j7702n3477p130J4576K7398j1735O412K3431J6079p047R627k7038
7407b3227m1595J4990J6251J1605J2111m42q357j0799J9721Q903j8213K5942J8274
7394B5164k2240j1679J2203Q729m3576k0596j0853J1418P355m732k1540r750j3793
7381i3890N1886M8774L8140k414k9557j4977n800J5101L5029j900m2704j4101
7369a6413k7090j7809j1451J9769L3576L7096K2151r939O72K4675j5102k5205
7357A4930n6840m6047L0505K1672M255j6140K545K483K6638J888K9993K3958k7795
$$ y = [-425, 20877, 7422, -71592, -102446, -61683, -22047, -48786, -47745, -46631, -35621, -15211, 19462, 36621, -21331, -63313, -40299, -39713, -77491, -69602, -63864, -55226, -38686, -24465, -5257, -30595, -9066, 3379, -14323, -67800, -74930, -60354, -32956, -44691, -38279, -14848, 1231, -5816, 3811, -23227, -64822, -49832, -33581, -21976, -9865, -10307, -18664, -29463, -9742, -839, -19052, 6890, 25164, 2924, -8755, 3448, 12177, -31399, -51995, -62848, -51430, -44075, -48807, -70347, -80097, -93890, -42004, 6770, 44910, 42496, 12939, -2038, -7838, 7263, 42292, 40392, -2312, -16413, -43503, -61312, -72763, -52994, -19418, 17678, 39829, 29890, 30562, 55237, 40135, 14930, -41910, -87957, -57452, -35780, -31525, -47665, -45120, -42637, -15999, -14111, 15882, 39840, 12045]
7344A2045k0878j6329K6458K933k7099K7136N260j4776p875J31l6813k04L6149
7331a3862N371k6282K0600J5258j9205J374j3100q723K3656l80j5420j6956l8886
7318h6555r030K9847J9111M38J8741L7272j8187R256J8538J0377L5260j0222o6230
7305a1384k9025l4801J9945M2572J1049Q866O227N922P198q439l0818J1283K7785
7292B6380k5740k7150j7183j1067K7915r505Q973J268J0771J8834k7901l4633
7280e9038K0171L1509l099J6687j3288j0995q883K10j2809K5445K1334P454k8818
7267a4120l9613J7000K1582M597J4876j6778j9770o6j1550j4570J7451K1377k9539
7254d9123m209K0973N572j7878L5951L6450K8253j2464q865j8562J4477j3352
$$ y = [12045, -8833, -25162, 1296, 4229, -22870, 4266, 9526, -5250, -13125, -12994, -49807, -50011, -13862, -8491, -34773, -14173, 1085, -18120, -16746, -29846, -38569, -14913, -15293, -30713, -47669, -86555, -95585, -65738, -46627, -46189, -27448, 9824, -8363, 893, 19431, 29808, 65068, 54846, -11384, -40409, -75210, -55265, -12693, -1644, 7222, 13449, 19371, 26569, 18130, -12688, -1405, 26380, 640, -26510, -43693, -54760, -26845, -36350, -27377, -26109, -15338, 3496, -24405, -59038, -38867, -7358, -10457, 6230, -7058, -18053, -26936, -26726, -39535, -14090, 7244, 14698, -14120, -53733, -36733, -15151, -10554, 4322, -12456, -32226, -32292, -43842, -58412, -40961, -19584, -49123, -53332, -32359, -26787, -44665, -8714, 27736, 55989, 43525, 34660, 16098, 30575, 17223]
7242A7223l4186L777j4050k281J2560L0309J300m3622j9711k5753K9330L9622
7230e482k596k0404o2609l2241M2884K8267L2137K6088k3215m37j4915l4529M371
7217f2681J2643n582l2053J6831K5666j7473P6K7488j3734n526J2109N5171P33
7204A3668L1837k750J9178j0262k1817J0946K6343k1643j1522j6088L651p55k1645
7191h59L0277K0589l1706o806K4574l881j4445m6951J2102J4810j5554j3550k6911
7178e8311k3004K3677n739n638M506R140O093K2721J2855q31J5776r796O057K052
7164d42J9198K5335j3506m1241j9335K797P920K4414L1001q679K559K7819o1482
7151c642l5629L4534l6190M9668J1860j6824l6115k7846P874L808l965K2065j9655
$$ y = [17223, -16963, -13186, -27236, -29517, -16957, 13352, 14652, -28970, -48681, -74434, -45104, -5482, -8078, -28482, -91091, -123332, -80448, -52181, -20044, 6044, -17171, -17608, -32523, -67052, -62681, -50038, -55620, -87673, -70842, -45176, -62649, -62573, -35085, -48819, -54345, -42236, 12935, 13668, 45505, 42755, 61933, 51671, 29854, 40800, 67143, 45500, 33978, 17890, 21541, 20786, -859, 29418, 50007, 18301, 11495, 36069, 32188, 17743, -29208, -17106, -2296, -17850, -31400, -58311, -81315, -57638, -63377, -69015, -64509, -55369, -49276, -26555, -13700, -14531, 1245, -8551, -2494, -442, 18756, 44091, 30585, -10656, -29991, -27194, -19274, 5140, 36141, 27462, 30021, 57840, -3642, -39271, -4737, -40927, 8741, 20601, 3777, -32338, -60184, -52310, -48502, -52467, -30402, -50057]
7138e0057j4631P72N6703J0759l0962l8080K9788K2591J5306J8700j3576l749
7126C564j4417n6161L7627N1838j6574J5581R624N208J33m2132j7444l3093k522
7113e8768J8513K8015q151j7843j5027k2015k5879L1151N3091L6211L5063J563
7101E5924K1322k622l5933J0485L0778k1397k7248J1418m072m083K0258l2039
7089B2791l4282m7982j3430J8531L8100J5721k0795k6811J1544K9334o612m34
7077a4325k3763P311L4835j8745k8484M925M7498P346m7976k1143o384L963M7091
7064g851M1465J4078m0271J2336l0361j7340k735M3495r930l0767P482L7993j8135
7051e41l159j7621p107j1969k6822L0675J7631m779J6767L7135J0148m8674l4078
$$ y = [-50057, -64688, -63916, -7213, 3546, -27416, -65496, -35708, -13117, 2189, 20889, 7313, 3564, -10853, -67014, -29387, 22451, 5877, 21458, 31082, 36290, 36423, -5709, -23153, -56246, -58768, -40255, -12240, -20391, -38234, -53261, -75276, -101155, -70004, -16913, 19298, 54361, 55924, 77246, 74624, 38691, 49176, 79954, 58557, 31309, 42727, 38655, 34572, 54830, 22791, -11491, -59473, -72903, -54372, -16272, -551, -21346, -48157, -36613, -7279, -13891, -14325, -38088, -30777, 4058, -14687, -43171, -38246, 9252, 16598, -31378, -52521, -58905, -54942, -7851, 33614, 47692, 7421, 19757, -10604, -27944, -30679, 12816, 2886, -27881, -20399, 17594, -541, -3700, -21321, -28428, -40397, -67219, -36544, -18913, -23692, -6925, 30210, 40358, -8316, -42394]
7038d2394n121j1352L9455J4674j6436J731L950P7L8550j5283O939K2360j0527
7025B6623l8829k5300M0637J3797l1550j5131l0576l0627J6910Q058L4797m542
7013c5733j6511M0945L2178L1986J1466l1110L9700r407m34Q981r110j8967N2453
7000I6437J3059j6413k1880n815r272m2058j7186j6052l5014m632L2433j4403
6988d0796K4227P425K145P876N993j2777L651k9964m3883o9272L8133K2108K5796
6975e9338M7487L5931M368J5766j7348j2688l4126L53M2373K2607K2028j6274
6963E1139r189j1030j269j3005k2906j240K6229L2016j3685l4816j1256J1652
6951B640l652k8420k8205n40j649L6314J2274k5109K3019L5300k6401M018K2604
$$ y = [-42394, -47515, -58867, -19412, -4738, -21174, -19443, -15493, -15416, 23134, 7851, 14790, 37150, 26623, -12206, -37506, 3131, 16928, -14622, -29753, -60329, -90956, -74046, -65988, -31191, -35733, -52244, -11299, 20879, 52865, 64331, 33221, 72921, 63514, 63080, 72061, 62951, 43984, 96437, 109496, 93083, 71203, 65388, 56116, 14058, -3128, -19180, -54194, -58826, -26393, -40796, -16569, -9144, -6999, 877, 6870, -5907, -2256, -32220, -76103, -145375, -107242, -85134, -59338, -11851, 24080, 28448, 44214, 26866, 14178, -19948, -19595, 22778, 45385, 67413, 51139, 41950, 30920, 29651, 16646, -6260, -7500, 18729, 50745, 37060, 2244, -9012, 2640, -1012, -29432, -57637, -58177, -59826, -23512, -11238, -36347, -13328, 21972, -4429, -411, 22193]
6938B2193J329k508l7519L1358K7967k3885m431j2704J6843L3112l0018r716L7376
6925D9397k5385l4949L1049J3449J2386l1138l0709q818o082k530k614o138P951
6912c4131Q708J8936K5074k9980o155N693l4636K5257J3250L0150k1842m019l6777
6899d0472j2653N742j5670q349K9153L2971K5136j0670l2332k8088R413L1273
6887a4546J5772j3388j1707k3758J183q55M226j294j2136M1778K0640Q420J4049
6874B8384P543r473k7391k1300J1377N7077n6982k1250J3293q098o473J9953M587
6861h753k3052P971K1267M947M148q715l0023l752M115n60m167l1078k0218L4925
6847e2945M3894K3172P633n2102j3159K3128J2097k80J1547j3587k2974l1455
$$ y = [22193, 23522, 21014, -16505, 14853, 42820, 18935, 14504, 1800, 18643, 51755, 21737, 12021, 49397, 24012, -10937, 20112, 33561, 45947, 14809, -15900, -24718, -30800, -33330, -35944, -42082, -34131, -25423, -6487, 18587, -11393, -17548, -11855, -46491, -21234, -7984, 22166, 324, -3695, -40472, -53125, -47383, -63053, -71402, -42249, -9278, 15858, 5188, -27144, -55232, -45819, -14546, 1226, -12162, -23869, -47627, -46444, -47299, -43073, -44367, -56503, -14725, 5915, 14335, 28384, 35927, 26454, -937, -22237, -10860, 46217, -10765, -32015, -18722, -26820, -33293, -13340, -8753, -31805, -23834, -2567, 2380, 6528, -2187, -32210, -35962, -31847, -32407, -36574, -67652, -87870, -52945, -9051, 14121, 21754, -30348, -43507, -20379, -8282, -8562, 2985, -10602, -33576, -65031]
6835f5031m250K047n755k8204L335M5146M2136J8489M0438J8369l3830l5451l6033
6822c8594o346Q0139J6355k8004m744J2896J1957r984l3724k1328l0669J29J7873
6809c4044j5428J2591K2328J8997N071j0500N064J4962N46j2023k0176k6602j5213
6796e4427K5933L8925N7942P070o2146q171j1118L6004k7280k1267j9148r373
6784d7056J0475J3303K4454R067o383n6765k264L0461q932r604J7865K3620K460
6771G01m999L0974k936k6016j6625O764L1845J6076k4190j4758J6678m506k986
6758F022j804p169M949K7283L0020J0348N660q638j4632R936k694m1539j4433
6745C309P5275N7523Q602r82J0148O583N56J2141J3079j0108J2882N8306J31759
$$ y = [-65031, -69281, -67234, -72989, -101193, -97858, -52712, -10576, 7913, 48351, 66720, 32890, -2561, -38594, -44940, 35199, 51554, 23550, 18806, 31702, 43659, 33675, -49, -21377, -52046, -51917, -34044, -49472, -36881, -14553, 4444, 9515, -985, 4079, 19041, 19587, 7564, -12612, -39214, -54427, -28494, 10431, 68373, 75443, 13297, 5126, -5992, 30012, 2732, -18535, -37683, -47056, -36581, -23278, 1176, 10243, 3860, -52905, -55169, -24708, -33640, -43244, -25379, -1759, 701, -4298, 26676, 23740, -2276, -18901, -12137, 19708, 35784, 11594, -3164, 13514, 9008, 6022, 4218, -2951, 1998, 29281, 59301, 69649, 75309, 66671, 52039, 61975, 59281, 17742, 3309, 78584, 136107, 144709, 143727, 153875, 160458, 161014, 173155, 186234, 176126, 189008, 247314, 379073]
6732C79073J54471K08842K37325K52633J48078l9842p0018l0626j73305k80941
6722G85690k46679j62948o5395m4980k6149K3728m0776k2196j7501m2273l9383
6711A01138j916J9610q684j5813j7971m136R379J5818M342K257Q402p739m1650
6698F3037o3103O379K8856J4985j3180m312j0459K950K7364j0112J5154j0247
6686D7312R441K0113R782p7144K756J3471l1005J883J155o01L632J6120j8105
6673a190M1376j1220m5802N374n34j1483J0885K4911L8899L0319l1565l6235K299
6660A6034K8784j6919l5355p388J0289j0222l7774p340J8193k4320l997J6445
6648e3570k0821K2022M8294K3350P350p400J9301k1849K8212m304k7764m2459
$$ y = [379073, 533544, 742386, 979711, 1232344, 1380422, 1340580, 1270562, 1239936, 1066631, 785690, 539011, 376063, 310668, 265688, 239539, 263267, 222491, 200295, 182794, 140521, 101138, 99222, 118832, 110148, 94335, 76364, 72228, 81607, 97425, 101767, 104024, 112426, 104687, 63037, -66, 6313, 35169, 50154, 36974, 32662, 22203, 25153, 52517, 42405, 57559, 47312, 56753, 76866, 86648, 9504, 12260, 25731, -5274, -3391, -2236, -2837, 795, 16915, -1190, 40186, 28966, -16836, -11462, -11996, -23479, -12594, 12317, 51216, 81535, 49970, 13735, 16034, 44818, 27899, -7456, -14844, -4555, -14777, -52551, -59891, -41698, -66018, -70015, -53570, -74391, -52369, -4075, 19275, 26625, 19225, 38526, 16677, 44889, 40585, 12821, -29638]
6636b9638j895k054N240J2406J047J8759L847P402p323l0792l3743k5869K5720
6623e6893L5634L0333L7496j0423l2705l57m0452l3505L8372K5821J9034n277
6611G078m0334k9788K3174M3682L756o120q16j8071p117k5343J7571J1033j8088
6598c9383m2330J2809K0644K9330k292K4110j8975J7658J0551J2305K1042K4449
6586F9918j5765m4790k9515j2695K5871L3255K7479o075k7205j4167J7808N454
6574B9573n389r238k1928j936j7022j0984J4561k0106L4831J1032M860J7072l593
6561B1733q111j0367j4601l5833l5723j5127K5182m058L7346J9042j7968J396
6549c7089R91M944L8418q855j4804k8692J845Q184J1672M38P63P014j0570J5861
$$ y = [-29638, -31533, -33587, -28347, -15941, -14894, 3865, 7712, 15114, 7791, -23001, -56744, -82613, -56893, -21259, 9074, 46570, 36147, 3442, 3085, -37367, -70872, -32500, -6679, 12355, 7078, -33256, -63044, -39870, 3812, 7568, 1448, 632, -17439, -24556, -49899, -32328, -21295, -39383, -81713, -68904, -48260, -18930, -21222, 2888, -16087, 1571, 12122, 24427, 45469, 69918, 54153, 9363, -20152, -32847, -6976, 26279, 53758, 47683, 20478, 6311, 24119, 29573, 24184, 14946, -6982, -8918, -25940, -36924, -22363, -42469, -7638, 3394, 8254, 25326, 21733, 13622, 3255, -11346, -47179, -82902, -98029, -72847, -76905, -39559, -20517, -38485, -37089, -36098, -31154, 7264, -1591, -16395, -45087, -43242, -35058, -23386, -22948, -22185, -15171, -25741, -9880]
6535i880J2684J0638q136m963j7740l1339j7153K5039n927p236L90M1437J7199
6522E013j3398l3242J5871L5949j080j5938R759O95j1005k8102L89l015J1857
6509b6247O234L6232J4130K1630j7999l9554O262l197j0294M510N237j6776j2143
6496c1975o777p731o139R505J2187J0127J8699J7190n2469j9274K7236J8586l771
6483a4606L179L1483j3376j0998J1055K1328j126k3094j9340J0754J990P823p83
6470D289j3932L112J6627k4406m7610J7217L6031L7361r183J0033O099J052k5589
6457A1101m3908k9391L550J9132K7836K6903J7938l9672k1241N446P08Q321K5616
6444A2339J5799j1143J378l1390k5451r11k9382N417J727M5920j9362k5574K0655
$$ y = [-9880, 2804, 13442, 5306, 343, -17397, -48736, -65889, -40850, -46777, -54013, -53623, -12186, 5013, -8385, -41627, -25756, 10193, 9113, -6825, 2934, 3629, -7376, -35478, -35089, -38104, -26247, -20013, 16219, 30349, 51979, 33980, -5574, 688, -2509, -12803, -8293, -3056, -19832, -31975, -38752, -46483, -52622, -43117, -30930, -20803, -2104, 15086, -37383, -56657, -29421, -10835, -14606, -11427, 20056, 6680, -4318, 6737, 28065, 26939, 3845, -15495, -4741, -2751, 5072, 4289, -9643, -6531, 10096, -14310, -61920, -44703, -8672, 28689, 19506, 29539, 35638, 36690, 11101, -32807, -62198, -58648, -39516, -11680, 15223, 33161, -6511, -27752, -22306, -21598, -13277, 12339, 28138, 16995, 18373, -13017, -38468, -39379, -68761, -63344, -61617, -15697, -35059, -60633, -39978]
6431c9978j6253L085p324M3045K6095m5602k5509J7469N5920P51j5270k87j5185
6418a9043K3914M983j6593q038k3201J000J1527J1084j5085j3359j1372j8667
6406g2850N178L2456r011K3972R18l6356n240L4311J5910l753k180K0124O827
6393A0306j8951K047n975n5584k3437N711K2006K2027J0087j6424l2149r253K6834
6380f2755L8176k682J9702J1998n860J2061J2212K272j5354l1923O929J0417R46
6367c861J9250o954l597l0273O021L9835n119J927K5527L430P757l747j8513L508
6353C5191J3131J5066R197l0272l4443J1891j5896q058k1053J4649L6665J1708
6341C7776k4302L519o237j4954k435L7939N467k8586j9740m261k0341l285M7879
$$ y = [-39978, -56231, -53146, -60470, -17425, 8670, -36932, -62441, -44972, 10948, 11699, -3571, -3858, -19043, 4871, 9854, -6739, -14777, -37978, -36978, -25451, -14367, -29452, -42811, -54183, -72850, -67672, -35216, -44227, -20255, -19337, -55693, -60933, -26622, -10712, -14465, -16645, 3479, 10306, -8645, -6598, -12573, -68157, -91594, -85883, -63877, -41850, -31763, -48187, -80336, -89589, -62755, -24579, -27261, -7559, 4439, -1421, 10640, 22852, 25124, 9770, -22153, -15224, -4807, -3861, 15389, 8435, 4838, -25435, -19414, 20421, 15302, 17229, 42756, 46186, 53943, 50196, 31683, 35191, 48322, 63388, 72585, 42313, 7870, 19761, 3865, -4193, -25246, -10597, 26068, 37776, 13474, 16993, 10756, -4198, -6633, 31306, 36773, 8187, -11553, -15814, -36155, -39440, 8439]
6328H439j8170k3596j9137K071J0034J7007k771K8416n094N018j1478j5463O016
6315a8708N771L8218Q438J3193k6551k6800k9704J9717J1333q350K0928k1596
6303a4111p757J3719J2351j0775K2063R252j3044j6911r357l576q332k369O033
6290b2814j6750k5586K6297K1690j7948j4446m1273k329J5939J8457j1734o377
6278g6874r11L1637M6594J9838k3480l8491j8206k048K1554m269n361L464p757
6265e4310j7601j1242L677M999J6286J4657j0274K9309J5044R609j0078j3853
6253b3777j1817j7520j9433J6104K9725J9522j9452J8887M4337m154J2806K6823
6241G2051j1408m6610k6761j7490m244o455K2884j4551R860J4919L6211J2697
$$ y = [8439, -9731, -33327, -52464, -50393, -40359, -23352, -26123, 2293, -2801, 2217, -9261, -24724, -18708, -12937, 25281, 33719, 46912, 20361, -6439, -36143, -16426, -5093, -13443, 7485, -14111, -21868, -8149, 4202, -6573, 15490, 24742, 11698, -5213, -14570, -18146, -26478, -28847, -22814, -39564, -65150, -38853, -17163, -35111, -49557, -90830, -93159, -77220, -58763, -70497, -76874, -77785, -46148, 446, 20284, -3196, -41687, -59893, -61941, -40387, -44656, -50017, -46553, -54310, -71911, -83153, -79476, -74477, -58191, -43534, -53808, -24499, -9455, 154, -9924, -23777, -35594, -53114, -72547, -56443, -26718, -7196, -26648, -7761, 36576, 32422, 45228, 72051, 60643, 14033, -12728, -30218, -34462, -40917, -18033, -32584, -22724, -7805, 28406, 41103]
6229D1103J4231l6575k5685K0843k0709j5299J5357P305J026j854J1870L000q887
6216E726j9419R55M2503O2059k731l4407j7483l0621K108j960k5569J3819j0158
6203a5178J3327J0678L319k7501k3328N810k897P643l2632l058K5944j1380j4384
$$ y = [41103, 55334, 18759, -6926, 13917, -6792, -22091, -6734, 571, 1597, -257, 11613, 14613, 5726, -13693, -12738, 29765, 91824, 89093, 54686, 37203, 6582, 8690, 6730, -18839, -5020, -15178, -1851, 8827, 12146, -15355, -38683, -32873, -35770, -28127, -60759, -63817, -37873, -49253, -63637]
$$ [...]
##END NTUPLES=NMR SPECTRUM
##END=
