##TITLE=Analysis number 315126
Compound Code cc 09204
Project Code adrs
Chemist Name fudan
##JCAMPDX= 6.0         $$ Bruker NMR JCAMP-DX V2.0
##DATA TYPE= NMR SPECTRUM
##DATA CLASS= NTUPLES
##ORIGIN= Bruker BioSpin GmbH
##OWNER= NMR
$$ XWIN-NMR		Version 3.5
$$ Tue Nov  8 10:45:14 2005 GMT Standard Time (UT+0h)  MAYBRIDGE\NMR@NMR_250MHZ
##.OBSERVE FREQUENCY= 250.131544655141
##.OBSERVE NUCLEUS= ^1H
##.ACQUISITION MODE= SIMULTANEOUS (DQD)
##.ACQUISITION SCHEME= undefined
##.AVERAGES= 16
##.DIGITISER RES= 18
##SPECTROMETER/DATA SYSTEM= dpx250
##.PULSE SEQUENCE= zg30
##.SOLVENT NAME= CDCl3
##.SHIFT REFERENCE= (INTERNAL, CDCl3, 0, 16.4572)
##AUDIT TRAIL= $$ (NUMBER, WHEN, WHO, WHERE, WHAT)
$$ ##TITLE= Audit trail, XWIN-NMR		Version 3.5
$$ ##JCAMPDX= 5.01
$$ ##ORIGIN= Bruker BioSpin GmbH
$$ ##OWNER= NMR
$$ C:\u/data/dgb/nmr/ADRS/12010/pdata/1/auditp.txt
$$ ##AUDIT TRAIL=  $$ (NUMBER, WHEN, WHO, WHERE, WHAT)
(   1,<2005-11-08 10:43:48.77 +000>,<MAYBRIDGE\NMR>,<NMR_250MHZ>,
      <created by zg, POWCHK disabled, PULCHK disabled
       configuration hash MD5:
       62 19 C7 07 E1 42 D1 B7 37 6C 3D D0 77 39 F9 E6
       data hash MD5: 64K
       1D CB 74 AD 70 99 63 9B A9 CE B2 9D 4A 41 2F 8F>)
(   2,<2005-11-08 10:44:19.66 +000>,<MAYBRIDGE\NMR>,<NMR_250MHZ>,
      <Start of raw data processing
       ef LB = 0.3 FT_mod = 6 PKNL = 1 SI = 32K 
       data hash MD5: 32K
       14 7E C8 78 80 B8 27 8F 89 83 1C EC 62 5E 4A 0F>)
(   3,<2005-11-08 10:44:23.97 +000>,<MAYBRIDGE\NMR>,<NMR_250MHZ>,
      <apk 
       data hash MD5: 32K
       1B C5 3C A7 84 2F 11 78 30 2D 99 67 B3 19 7F E2>)
(   4,<2005-11-08 10:44:25.71 +000>,<MAYBRIDGE\NMR>,<NMR_250MHZ>,
      <abs ABSG = 5 
       data hash MD5: 32K
       22 2B 4F C7 9D 16 25 99 E7 26 A8 7D 90 09 F2 4F>)
$$ ##END=
$$ 
$$ hash MD5
$$ 7C A4 5A DA 01 5E 05 2B 7B 66 7B 56 28 F3 DA EA
##$RELAX= 
##$RELAX= 
##$RELAX= 
##$RELAX= 
##$RELAX= 
##$RELAX= 
##$RELAX= 
$$ Bruker specific parameters
$$ --------------------------
##$DU= <C:\u>
##$EXPNO= 12010
##$NAME= <ADRS>
##$PROCNO= 1
##$TYPE= <nmr>
##$USER= <dgb>
##$AMP= (0..31)
100 100 100 100 100 100 100 100 100 100 100 100 100 100 100 100 100 100 
100 100 100 100 100 100 100 100 100 100 100 100 100 100 
##$AQSEQ= 0
##$AQ_mod= 3
##$AUNM= <au_zg>
##$AUTOPOS= <12 >
##$BF1= 250.13
##$BF2= 250.13
##$BF3= 250.13
##$BF4= 250.13
##$BF5= 500.13
##$BF6= 500.13
##$BF7= 500.13
##$BF8= 500.13
##$BYTORDA= 1
##$CFDGTYP= 0
##$CFRGTYP= 5
##$CHEMSTR= <none>
##$CNST= (0..31)
1 1 145 1 1 1 1 1 1 1 1 1 1 1 1 1 1 1 1 1 1 1 1 1 1 1 1 1 1 1 1 1 
##$CPDPRG= <>
##$CPDPRG1= <>
##$CPDPRG2= <>
##$CPDPRG3= <>
##$CPDPRG4= <mlev>
##$CPDPRG5= <mlev>
##$CPDPRG6= <mlev>
##$CPDPRG7= <mlev>
##$CPDPRG8= <mlev>
##$CPDPRGB= <>
##$CPDPRGT= <>
##$D= (0..31)
0 1 0 0 0 0 0 0 0 0.06 0 0 0 0 0 0 0.0002 0 0 0 0 0 0 0 0 0 0 0 0 0 0 
0 
##$DATE= 1131446625
##$DBL= (0..7)
120 120 120 120 120 120 120 120 
##$DBP= (0..7)
150 150 150 150 150 150 150 150 
##$DBP07= 0
##$DBPNAM0= <>
##$DBPNAM1= <>
##$DBPNAM2= <>
$$ [...]
##$SUBNAM7= <"">
##$SUBNAM8= <"">
##$SUBNAM9= <"">
##$SW= 20.6930455092707
##$SWIBOX= (0..15)
0 0 3 0 0 0 0 0 0 0 0 0 0 0 0 0 
##$SW_h= 5175.983436853
##$TD= 65536
##$TD0= 1
##$TE= 300
##$TE2= 300
##$TE3= 300
##$TEG= 300
##$TL= (0..7)
0 120 120 120 120 120 120 120 
##$TP= (0..7)
150 150 150 150 150 150 150 150 
##$TP07= 0
##$TPNAME0= <>
##$TPNAME1= <>
##$TPNAME2= <>
##$TPNAME3= <>
##$TPNAME4= <>
##$TPNAME5= <>
##$TPNAME6= <>
##$TPNAME7= <>
##$TPOAL= (0..7)
0.5 0.5 0.5 0.5 0.5 0.5 0.5 0.5 
##$TPOFFS= (0..7)
0 0 0 0 0 0 0 0 
##$TUNHIN= 0
##$TUNHOUT= 0
##$TUNXOUT= 0
##$USERA1= <user>
##$USERA2= <user>
##$USERA3= <user>
##$USERA4= <user>
##$USERA5= <user>
##$V9= 5
##$VALIST= <valist>
##$VCLIST= <CCCCCCCCCCCCCCC>
##$VD= 0
##$VDLIST= <DDDDDDDDDDDDDDD>
##$VPLIST= <PPPPPPPPPPPPPPP>
##$VTLIST= <TTTTTTTTTTTTTTT>
##$WBST= 1024
##$WBSW= 4
##$XGAIN= (0..3)
0 0 0 0 
##$XL= 0
##$YL= 0
##$YMAX_a= 367541
##$YMIN_a= -380128
##$ZGOPTNS= <>
##$ZL1= 120
##$ZL2= 120
##$ZL3= 120
##$ZL4= 120
##$ABSF1= 16.4572
##$ABSF2= -4.235973
##$ABSG= 5
##$ABSL= 3
##$ALPHA= 0
##$AQORDER= 0
##$ASSFAC= 0
##$ASSFACI= 0
##$ASSFACX= 0
##$ASSWID= 0
##$AUNMP= <proc_1d>
##$AZFE= 0.1
##$AZFW= 0.1
##$BCFW= 0
##$BC_mod= 0
##$BYTORDP= 0
##$COROFFS= 0
##$CY= 12.5
##$DATMOD= 1
##$DC= 0
##$DFILT= <>
##$DTYPP= 0
##$F1P= 14.0000005364418
##$F2P= -0.99999901652339
##$FCOR= 0.5
##$FTSIZE= 32768
##$FT_mod= 6
##$GAMMA= 0
##$GB= 0
##$INTBC= 1
##$INTSCL= 1
##$ISEN= 128
##$LB= 0.3
##$LEV0= 0
##$LPBIN= 0
##$MAXI= 10000
##$MC2= 0
##$MEAN= 0
##$ME_mod= 0
##$MI= 0
##$NCOEF= 0
##$NC_proc= -3
##$NLEV= 6
##$NOISF1= 0
##$NOISF2= 0
##$NSP= 0
##$NTH_PI= 0
##$NZP= 0
##$OFFSET= 16.4572
##$PC= 1
##$PHC0= 82.25691
##$PHC1= 2.514095
##$PH_mod= 1
##$PKNL= yes
##$PPARMOD= 0
##$PSCAL= 4
##$PSIGN= 0
##$REVERSE= no
##$SF= 250.130016206827
##$SI= 32768
##$SIGF1= 0
##$SIGF2= 0
##$SINO= 400
##$SIOLD= 32768
##$SREGLST= <1H.CDCl3>
##$SSB= 0
##$STSI= 32768
##$STSR= 0
##$SW_p= 5175.98343685301
##$SYMM= 0
##$S_DEV= 0
##$TDeff= 65536
##$TDoff= 0
##$TI= <Analysis number 999999
Compound Code 99
Book Reference 9
Project Code 9>
##$TILT= no
##$TM1= 0
##$TM2= 0
##$TOPLEV= 0
##$USERP1= <user>
##$USERP2= <user>
##$USERP3= <user>
##$USERP4= <user>
##$USERP5= <user>
##$WDW= 1
##$XDIM= 32768
##$YMAX_p= 370199752
##$YMIN_p= -979506
$$ End of Bruker specific parameters
$$ ---------------------------------
##NTUPLES= NMR SPECTRUM
##VAR_NAME=  FREQUENCY,     SPECTRUM/REAL,   SPECTRUM/IMAG
##SYMBOL=    X,             R,               I
##VAR_TYPE=  INDEPENDENT,   DEPENDENT,       DEPENDENT
##VAR_FORM=  AFFN,          ASDF,            ASDF
##VAR_DIM=   32768,         32768,           32768
##UNITS=     HZ,            ARBITRARY UNITS, ARBITRARY UNITS
##FACTOR=    0.157963299565203, 1,           1
##FIRST=     4116.43947677147, 0,            0
##LAST=      -1059.54396008154, 0,           0
##MIN=       -1059.54396008154, -979506,     0
##MAX=       4116.43947677147, 370199752,    0
$$ Real data points
##PAGE= N=1
##DATA TABLE= (X++(R..R)), XYDATA
$$ [...]
29681 81341 42302 6626 26346 29538 3355 19565 67331 67084 21828 11896 7630 15581 2841
29668 2841 -37830 -25131 20115 51318 18929 -57565 -75453 -23280 28375 706 -42090 -697
29656 -697 28319 -59249 -114974 -106247 -98870 -106179 -42882 20350 76356 43202 -9068 -59835 -74040
29643 -74040 -111735 -120774 -62413 -30468 -18242 -32870 -35822 12211 22062 5036 46019 90341
29631 90341 45155 7932 -16297 -9886 43003 66357 61162 45123 41781 22482 -3898 -17405
29619 -17405 -7556 3236 4052 -4698 -779 -6795 -15045 -8425 -17265 -98819 -61056 -43131 -4723
29606 -4723 -118 -30078 19687 62623 64082 16131 -4188 -15926 -22723 648 34058 3702
29594 3702 -11760 -24166 -13259 48902 46109 -5247 -47969 -55266 -17331 32115 -459 -15564
29582 -15564 7073 31925 2387 -15130 10140 54359 82930 36654 -10635 1381 -12545 -56299
29570 -56299 -95567 -59598 -24450 -63410 -102553 -102605 -87658 -43826 -9363 -25177 -37453 8648
29558 8648 47297 12704 -52905 -99146 -73866 -42961 -30897 -43897 -50576 -47665 -30469 12986
29546 12986 5206 -61357 -62195 -21725 3844 26102 3569 -15503 4639 -8197 -6307 -2904 12177
29533 12177 -10744 -23713 34076 25560 -13316 -3139 39093 15863 31188 58658 70549 54591
29521 54591 17659 -8863 -24322 2301 550 -4611 -34032 -43079 -67580 -19894 -12177 -20309 -40017
29508 -40017 -3115 -7566 25004 35330 -1016 -18200 32550 29253 -14126 10680 -60392 -167081
29496 -167081 -136505 -51301 -46109 -94171 -85844 -6470 43549 23999 -37665 -74759 -56428 -32640
29484 -32640 -29854 -2615 -23100 -11776 -21000 -18022 -24247 -65690 -74891 -71117 -74069 -66031 -35114
29471 -35114 3355 15139 -4407 -17107 873 17307 30872 18426 1655 -46376 -83327 -52534
29459 -52534 1141 75071 98066 86413 33470 -323 5984 -14268 5736 21207 19835 -7532
29447 -7532 9895 80193 40573 24794 -60647 -95615 -65379 -21399 -23154 -43395 -57234 -66756
29435 -66756 -49473 -69601 -45858 -16170 -44866 -63276 16054 21440 39611 76626 57032 41010
29423 41010 17760 -29455 -37975 -10619 17309 21283 -15899 -22404 -36482 -64380 -42839 -32396
29411 -32396 -10600 -212 7004 -26030 -66050 -77390 -44404 -48171 -50863 7557 48487 60797
29399 60797 -16898 -70295 -78213 -59747 -65894 -68059 -27838 -27726 -26111 -50644 -19022 -27531 -13400
29386 -13400 -5884 42914 23996 -1069 -27216 -74438 -85544 -23958 7759 69106 77351 19711
29374 19711 -21773 -64748 -53733 -1195 37096 6301 19964 -822 -9000 9416 39417 81044
29362 81044 100237 58155 36661 79692 74125 63065 77850 54298 24059 4108 -57749 -99092
29350 -99092 -89384 -26667 -26629 -48243 -53577 -20969 -30723 -42264 -26080 -4277 -4061 1786 32332
29337 32332 2672 -17447 -24124 19230 54949 59288 73221 109353 60353 3616 -42370 -64346
29325 -64346 -53793 -48241 -79744 -58585 13155 42351 7244 6388 -23218 16633 38481 47746
29313 47746 8265 -14049 29433 -12893 -43348 -50226 -49607 -29875 -25322 -11002 -6065 -11477 -34064
29300 -34064 1373 28920 24635 37002 47797 74143 70233 67797 40079 68198 61128 26792
29288 26792 -17671 -15740 -41785 -84387 -14333 57488 39612 -9036 -35385 -38883 -10298 21751
29276 21751 24396 57801 34052 -11199 -29373 -18770 3555 -4640 -35151 -12418 -21186 24041
29264 24041 24845 858 -2959 -31287 -33749 -31157 -20466 -27625 -16770 805 21045 25398 13669
29251 13669 14400 20358 12644 14415 30106 18827 -8575 -30132 -17093 -12100 -7452 -11541 -75203
29238 -75203 -72880 -62635 -38364 -20105 -35468 -18909 -52850 -10837 29243 28456 37481 97089
29226 97089 106434 85323 52676 56568 45697 -14610 -45751 -36741 -38295 -38174 -44548 -50474 -64384
29213 -64384 -100049 -105708 -110001 -110783 -84895 -49569 -53405 -78243 -62023 -42401 -47325 -9406 20805
29200 20805 10819 19565 24760 -27910 -14206 43988 73437 84902 61144 32150 32746 64663 44149
29187 44149 -13275 -76817 -110408 -111383 -42331 -21953 -29905 54510 83512 77991 58944 24172
29175 24172 -6032 8874 81970 79791 83469 63003 88833 108852 121121 82412 59484 51972
29163 51972 5444 5314 -19080 -48388 -44892 -26854 -38783 -113807 -73900 -8594 -14225 -18848 -29313
29150 -29313 15021 38991 66094 85280 21968 -10114 52813 39444 10510 -6535 24311 55385
29138 55385 50127 25637 -32796 -47876 -52443 -33195 -31899 -33828 -55212 -42897 -37080 -77243 -105483
29125 -105483 -65957 -41252 -6652 25999 45358 55983 47362 55434 62891 8618 -17979 -15282
29113 -15282 35486 44022 -24964 -36105 -34385 -69388 -86203 -26216 60959 59129 9410 36491
29101 36491 53223 43836 29313 17845 32276 52791 43734 17597 -28154 -11998 14496 -9813
29089 -9813 8543 61966 121581 94423 66513 67100 40060 -27819 -32757 5459 -7259 -15317 20483
29076 20483 14205 -17575 -38279 -63386 -77529 -110673 -98930 -35250 -16015 -11375 -52858 -95084
29064 -95084 -76237 -35514 -62588 -69615 -26010 -14423 -7499 12006 21697 8385 42303 127471
29052 127471 139415 117969 56300 21111 28629 20731 3425 -24007 -29660 -37525 -52110 -32970
29040 -32970 -948 14267 11014 47638 40970 20797 20518 21044 186 -19793 19101 5996 4666
29027 4666 -27475 -60678 -36510 16309 41833 22892 15926 46787 63423 61745 50097 40956
29015 40956 -2594 -60925 -44792 7945 -15280 -56221 -78088 -68135 -83595 -62903 -28573 22916
29003 22916 92105 92842 66176 80856 26413 38053 99031 96367 65811 60317 19874 -19958
28991 -19958 5839 -220 -20787 -43541 -75246 -72096 -47906 17353 7977 17986 61756 77469
28979 77469 69206 -8676 -78731 -49083 -39792 -22081 31934 30284 -13965 42660 66654 51468
28967 51468 -28739 -50932 -16527 -17921 -24668 11979 -8632 -29663 -58058 -51192 -50885 -32111 -4573
28954 -4573 52830 84278 40479 -1662 -14955 -33287 -8216 18302 53508 6309 -57066 -73282
28942 -73282 -34174 -45030 -49907 -9836 5378 10733 -24213 -30308 -8560 -22454 -29926 -27969 1819
28929 1819 19843 30538 32555 22162 -10677 -63776 -62820 -32761 -67203 -49554 -4487 -16707
28917 -16707 -17243 -46499 -122386 -93804 -33890 6857 -17187 -52335 -27973 -47433 -56654 -13783
28905 -13783 -6745 -4340 41650 -6958 -7862 35289 84273 52902 44745 62237 101660 51710 -8366
28892 -8366 5693 4643 -4706 -8085 -1691 14155 31912 33486 28598 659 -13363 -20938 16173
28879 16173 34563 3337 -27628 2120 42389 51769 62400 37929 -3463 -25095 -31999 -37848
28867 -37848 -17467 48807 30825 17475 63130 26263 22044 55623 27298 11242 -4576 -37796
28855 -37796 -65814 -24433 263 893 20506 43207 31995 -23 -25024 1128 34572 55307
28843 55307 52561 18850 51402 12947 -22828 -70284 -68584 -76833 -100311 -60651 14918 74677
28831 74677 61986 6099 -39804 -74939 -69170 -54630 -46726 -16736 31532 50567 38568 -15033
28819 -15033 -40765 -11842 -1440 -29566 -65839 -88358 -108785 -57396 -48617 -67676 -78052 -58021
28807 -58021 -47226 -37945 -10156 38003 56421 15216 -25533 128 -7390 -36901 6833 43718
28795 43718 51697 41440 41515 28804 25406 3758 1323 -3720 -39400 -74161 -77339 -3463 28275
28782 28275 -2100 -51466 -85022 -132929 -78263 -89398 -161305 -135618 -78273 -61802 -109558 -38310
28770 -38310 5816 -23051 16406 19534 39792 34358 35911 24637 -35874 -24294 -24965 -33 3953
28757 3953 14623 6083 4443 -2610 -42261 -58735 -5529 19592 -42444 -95994 -86437 -33774 13555
28744 13555 -16626 -59901 -60387 -47472 -3292 44306 77170 73361 62344 27676 36832 65110
28732 65110 34247 16876 52488 16660 -70081 -85688 -30415 28318 22973 -11162 -30923 -4018
28720 -4018 6329 45857 30736 61901 49532 34223 -7227 51960 49026 -17006 -32960 -17739
28708 -17739 3998 44976 60560 48202 -812 -1486 14163 9908 11073 19307 -7272 304 20713
28695 20713 45952 15578 -47029 -71407 -93591 -71874 -47171 -63994 -45473 2692 42794 41715
28683 41715 23323 -10617 -66237 -38907 -34872 -41771 -55410 -54243 -72023 -92158 -71024 -9746
28671 -9746 2135 -20116 -33665 -48396 -51363 7227 11056 25486 77159 76672 67409 28512 -14597
28658 -14597 8886 -1704 13987 17209 -6049 -63287 -124625 -90065 -49194 -3513 -9593 -6562
28646 -6562 -33598 -44486 -29507 -42443 -31847 7526 16913 13423 54455 39622 -45272 -89469
28634 -89469 -48889 -50613 -63929 -19511 -21143 -41626 -53356 -37943 -34575 -78906 -17504 -22076
28622 -22076 -49403 -83167 -67089 -27070 -15848 -31514 -52017 -77204 -73143 -21421 -29069 759
28610 759 25472 43187 88473 71937 63166 57445 1595 -5355 -6748 22721 39078 56946 55118
28597 55118 22218 -14164 -38142 -6393 16338 36709 33748 -14274 -60778 -54740 -24852 56560
28585 56560 114626 78590 90697 104988 77894 54008 59951 18514 -1013 27240 24084 4109
28573 4109 25076 67646 36814 504 40597 55620 -22065 -60416 -42174 -37204 -18735 -2467
28561 -2467 22762 57470 42977 16466 15567 12052 30955 13751 34921 -4719 -39914 -65335
28549 -65335 -58918 -73761 -78160 -51629 -10185 -5815 -35801 -45283 -29543 11361 32071 48431
28537 48431 28928 18408 27316 20210 -19916 -16847 -51196 -10696 29200 -608 7144 23380
28525 23380 31937 17687 -2714 18062 76008 103104 95676 91178 30639 -1892 -5609 12624
28513 12624 385 6093 -820 -27130 -52459 -25296 -21400 -2632 11121 40269 30404 57074
28501 57074 55139 2163 -3864 6437 -2936 5363 44666 73569 38518 47225 48149 26801 1666
28488 1666 -6915 -13473 -26716 -3055 510 6332 23922 23829 32971 101341 129707 89035 55395
28475 55395 37719 63898 49312 67157 17336 -30385 -20560 9628 -799 -12224 -7001 8493
28463 8493 31437 64532 79498 49503 28008 71207 108429 107540 64566 77412 62888 -9370
28451 -9370 -9847 27540 62773 132361 126759 96826 57059 16411 5599 -6133 -33512 -24558 -16855
28438 -16855 -5245 25173 96529 52942 -46006 -48143 -48997 -24944 -42534 -14095 44489 25199
28426 25199 -4536 -45566 -104334 -127929 -68550 20667 94458 46676 -4734 -24755 -35879 127
28414 127 515 -25351 -70326 -33940 2896 28119 4527 -8955 7616 -1365 -19983 -61271 -81256
28401 -81256 -80451 -9375 35855 -11094 -43056 -12370 -7943 -37473 -45562 6737 20530 9489
28389 9489 -34891 -11583 16984 -3724 -30904 9834 10539 4922 17045 14402 -10556 3333 16789
28376 16789 9900 -2039 -7092 -22452 3606 26355 21826 44605 45871 31551 30637 11506 13381
28363 13381 -19023 -13395 -27526 -20978 -5112 28265 53966 42640 11694 -16761 -34120 -818
28351 -818 25281 -23558 -59260 -80145 -100102 -64606 58 22978 19015 37356 43049 -29165
28339 -29165 -43467 1852 25864 27985 40219 20327 3542 -468 -50505 -53635 -43257 -65049
28327 -65049 -49558 -42528 -38142 -25539 40304 52234 38327 34537 2326 -26912 -13487 -45813
28315 -45813 -50928 -21453 14231 20466 10712 56331 72818 86554 110106 134836 123529 29187
28303 29187 -16955 50268 85018 126293 146491 93328 50699 102860 125264 106660 57297 83297
28291 83297 34009 -46585 -64340 -22264 10404 28857 -20616 -32685 -30969 -50224 1602 78501
28279 78501 53396 -3485 -27409 198 15386 -29664 -19876 -884 49927 104530 128061 136275
28267 136275 93139 30029 -37684 -53266 -62951 -58990 -54052 -23284 22669 36463 61451 47728
28255 47728 36004 36359 -22401 -62787 -68110 -53371 -35100 -27460 -3081 -30332 -18644 -14195 -15733
28242 -15733 -23458 -41735 -12003 54326 27156 12627 -8233 -17209 -44348 -27078 -41841 -14187
28230 -14187 -8670 61 -11619 -30218 -32065 4207 19869 -18789 -60384 -45432 -29992 -7815
28218 -7815 35625 60027 63830 23561 131 -12610 27401 36881 22603 25042 4196 2650 -32509
28205 -32509 -13586 25903 42398 58282 16534 -52610 -63499 -10835 -30688 -23065 4431 32984
28193 32984 43631 42046 85540 87352 137278 117706 50890 106208 85855 9327 2241 83393
28181 83393 112892 89582 67280 73778 57132 78462 51396 56532 64406 96080 96857 79585 62130
28168 62130 57399 46951 57006 47235 30118 11540 4592 15714 -21670 -16445 -11370 25111 31541
28155 31541 19199 9602 19032 7507 2270 5009 1417 37313 38116 25409 6222 -32220 -31702
28142 -31702 -73586 -62362 -4167 -3901 -5950 -41076 -69857 -61952 -72500 -71396 -3556 7209 -16690
28129 -16690 -16686 -27646 -19956 -36462 -30930 -2144 34907 35007 17547 -32097 -57240 -30011 -53359
28116 -53359 -54877 -12178 14318 97777 176054 124608 45968 23184 19955 32843 10561 58143
28104 58143 102779 55283 43268 33012 36465 51406 39491 7632 28875 62185 62796 74842
28092 74842 3238 17354 58164 56748 -12500 -58093 -31775 4617 27363 58116 45145 30373
28080 30373 46165 -1886 -22997 8174 11215 14583 -334 -30007 -13551 -4365 -5307 32529 30559
28067 30559 -27467 -42751 8623 37653 45202 74937 88925 -538 -30078 -11317 33347 16243
28055 16243 24979 -12969 -89452 -39084 -32050 -20767 42431 21856 64573 70715 11979 -22999
28043 -22999 -8668 20286 44765 52028 36042 35772 42569 -7286 -71551 -52187 -17821 35288
28031 35288 52288 84448 74108 18250 6138 47746 54301 -6992 -79359 -102909 -53762 -33391
28019 -33391 26525 -10225 22350 52250 57264 71143 72365 51291 22784 -11630 -569 -17075
28007 -17075 -49964 -103600 -79242 -7617 14102 18008 45912 56016 72848 78291 -9300 -74290
27995 -74290 -102952 -99113 -114947 -101611 -14208 5038 18522 8108 -5408 -8820 13006 49834
27983 49834 63636 12932 -20449 -8323 22031 7360 12302 4661 1673 -10459 -73739 -104043
27971 -104043 -21043 41793 70 -36947 -39816 -40833 -23562 26783 54500 68331 23402 -5638
27959 -5638 14457 51650 18012 -6346 -6612 -4140 -5860 -35864 -36208 12304 32678 28131 46827
27946 46827 45276 33306 22181 5285 33054 67622 50250 39923 51649 56953 35768 -16720
27934 -16720 -2281 -39983 17138 16336 -880 -61304 -69040 -77367 -55788 -22561 -6933 42955
27922 42955 100324 91820 66197 40966 -50 -21918 -24605 -30685 -18936 -20651 -14704 -29401 -29616
27909 -29616 -28096 -87725 -78726 -64889 1953 1134 -27711 -49808 -7707 84185 125915 80898
27897 80898 57045 15423 32004 23423 20812 17571 -73619 -104158 -10536 20037 -3824 -15416
27885 -15416 3746 -18873 -11295 -40428 -26410 22221 50086 45547 26126 37867 -2667 -16776
27873 -16776 -22346 -30566 -34713 -35551 -18335 1253 28521 42741 50645 15537 -8843 -19076 31306
27860 31306 22014 -39265 -62481 33333 74699 71426 54923 33092 11306 11131 -24647 -26770 6076
27847 6076 -1393 -59733 -60277 -15522 19329 -13489 -14066 -19599 42158 42426 41318 58193 57626 71830
27833 71830 98769 86468 97213 61538 35414 38740 -10663 -33097 2634 8501 10209 15205
27821 15205 -476 -21179 -26084 -44688 -21113 17882 -17226 -49676 -30928 8982 18033 37618
27809 37618 31521 -20815 -22495 -44446 -10394 21247 10887 46 -10689 18044 15608 27457
27797 27457 21655 -15437 21318 9753 -22813 -55640 -42769 -68536 -89149 -39885 -5247 4802
27785 4802 8333 3173 11304 39940 29490 16401 18068 30014 14492 -56133 -43848 7556 4748
27772 4748 18617 53033 48790 -12374 -68627 -78804 -81350 -68407 -69929 -31162 49443 15709
27760 15709 6564 -21087 -58025 -55889 -43461 -6927 30390 10739 5672 16759 18476 23090 36580
27747 36580 51520 81932 117821 169908 139709 107840 67383 40951 75538 65639 4844 -8673
27735 -8673 29308 19011 23111 61408 70147 36598 26744 30725 52343 22320 53251 56821 44511
27722 44511 29201 13594 -39125 -40808 886 45496 40951 8840 -9517 29910 76933 80480
27710 80480 95712 86137 47637 -17925 -37392 -59824 -66362 -88585 -51571 -62403 -67819 -98875
27698 -98875 -49439 -52433 -35974 -32241 -68635 -28048 -43142 -58259 -9786 33946 -17358 -29776
27686 -29776 7855 23948 13234 37059 4679 -7797 -11699 1214 33343 56122 60060 30608
27674 30608 -29469 -48268 -40821 -55762 -116820 -105472 -83908 -83134 -84478 -93574 -104271 -95751 -100054
27661 -100054 -60776 -33390 -80135 -72413 -16131 -4871 -58970 -6809 -4765 5039 29752 54381
27649 54381 44210 23862 -6109 -36901 -5357 -2152 -16591 -46771 -57314 -65911 -48622 -49121
27637 -49121 -58469 26851 99374 27797 29051 29853 -26497 -60821 -51317 -37374 -95459 -103629 -51080
27624 -51080 34684 48392 35803 5491 -19914 -30441 9355 -20825 -45481 -40055 -52667 -468
27612 -468 -35397 -42764 8589 51793 54871 25260 -14491 -54300 -25432 -2232 -22945 -60683
27600 -60683 -31330 -31315 -10597 29754 -30518 -46158 -71610 -99593 -43425 -44861 13670 33521
27588 33521 -16232 -54900 -48948 -59335 -32654 -25736 -37518 -20438 -18490 14723 37607 56395
27576 56395 27188 59920 94237 73341 96404 77763 76309 92628 42235 9111 31499 29708
27564 29708 25944 19586 45291 18578 -1732 651 57710 81526 99081 55381 -42335 -89914
27552 -89914 -86848 -52850 9185 27141 16198 -18102 -56682 -51222 -51444 -42270 -28941 -58695 -26346
27539 -26346 -32339 -1371 -13112 -20905 -6351 -59802 -82154 -35386 -41351 -35329 -4161 18661
27527 18661 30036 76756 117508 116695 46238 -3146 3076 -14975 -25922 25721 31847 -14513
27515 -14513 -25768 46421 28381 -7903 21757 50344 62967 36544 35428 33003 57463 30356
27503 30356 -11956 -13031 -6067 30816 45300 32114 14887 56274 70986 81196 30855 -19955
27491 -19955 -54617 -37029 25427 84228 84657 67746 28206 -12499 -9950 39902 30299 -30602
27479 -30602 -12884 -39843 -87689 -54835 15553 45120 43518 62206 33519 51463 33187 8032
27467 8032 -6497 12299 24380 30529 7928 12100 -31806 -75457 -55414 -43902 -80822 -66507
27455 -66507 -74651 -73291 -29234 5834 -6299 -51558 -56222 23832 44709 12211 61176 38427
27443 38427 366 -6057 -2352 8724 -6677 3819 -15624 -8827 -57680 -64569 -64193 -20738 27950
27430 27950 27381 9244 -12023 -31793 -5995 68125 100879 25763 -33209 -39055 -55770 -82979
27418 -82979 -69482 -29714 -17627 -3689 31508 -10637 -7071 11282 23675 17629 -38490 -64974
27406 -64974 -50190 -61497 -61472 -33480 32413 24672 3140 -2780 -59572 -70416 -83069 -103766 -94157
27393 -94157 -46630 -35185 2855 -23312 -66249 -79735 -59986 -45886 -27986 -4392 2730 8596
27381 8596 -29963 -31743 44211 84338 60962 51823 53135 40975 -20326 -22173 -41435 -57645 -34438
27368 -34438 -26330 -38002 20 36208 7320 -35026 -18592 -739 -13856 54240 82739 28440
27356 28440 -15354 -23865 -19135 -48030 -69220 -69822 -94908 -118325 -76019 -27250 -3379 -71088
27344 -71088 -91567 -94933 -87358 -70608 -64868 -61474 -66641 -42120 17654 24579 12257 21349 8
27331 8 -372 -47123 -91706 -54560 -5817 26280 49929 33225 37569 9481 -20928 -73185 -50436
27318 -50436 -36021 -37851 -28018 -24198 -68819 -82588 -41930 -34589 -58735 -102100 -129044 -125270 -95413
27305 -95413 -65680 -12469 -6325 -10494 30843 46938 67800 84465 32087 38319 52518 33596
27293 33596 15643 67387 130628 122232 62751 25360 -18781 -41958 -16620 -36107 -28385 -11365
27281 -11365 -34730 -61453 -77453 -78561 -89518 -50971 16265 -31047 -12301 17651 60890 52841
27269 52841 22562 -27144 -91681 -65099 66111 107040 105714 63168 -7201 -7916 6468 17479
27257 17479 -991 -17744 -81128 -86530 -74144 -37488 -5609 -38271 -100903 -119838 -106050 -31132
27245 -31132 -14444 -35396 -6256 27431 -61938 -52445 -26140 -41090 -11098 11613 1361 -9913
27233 -9913 24994 34186 35789 69832 84501 32801 5984 1967 43766 129238 94134 23632
27221 23632 26767 7015 3727 44594 58029 45884 109562 107293 38455 -9612 -35462 -27097
27209 -27097 8103 24807 32126 -31834 -44184 -11047 -12594 -29502 -50184 -44483 -21863 14243
27197 14243 225 -1974 -3398 38999 27706 28044 8846 17724 25830 53719 33786 -11602 -38178
27184 -38178 4745 36039 24486 16292 17003 21846 64800 67628 39288 17373 -27338 -53456 -40526
27171 -40526 -60344 -32358 -20059 -25817 -25370 -47944 -42111 16195 54708 18818 -4678 23127
27159 23127 -9138 -1132 -49538 -83892 -82658 -38031 -30262 29214 77176 97637 41220 1110
27147 1110 22663 -13952 -35685 -6791 -8481 -78505 -82807 -24822 27637 83385 52706 -24930
27135 -24930 -57558 -76842 -47506 -26963 -15753 20393 20743 -2060 -38940 -42719 -45574 -42977 -40817
27122 -40817 -26326 -29327 22295 23559 -3007 -11937 -60942 -75853 -97915 -120188 -62673 13440
27110 13440 69619 47003 207 -36932 -49655 -26185 48774 22727 29786 -3957 6027 47084
27098 47084 38468 29768 -21164 -32561 -13532 20152 69745 75917 83950 46415 33226 33405 21438
27085 21438 25207 36198 31848 19668 39024 22666 -23736 -58098 -45370 22008 51787 17900
27073 17900 5120 18058 53904 -8194 42141 83807 46782 23451 38054 45326 44828 -113
27061 -113 30768 47236 72612 45240 25936 53307 31651 45567 47040 7384 24997 17263
27049 17263 -2144 -21981 2749 22102 26306 -2671 -22891 -2925 29631 112552 153072 84048
27037 84048 37864 63777 66192 51264 57734 50468 62008 48038 14184 4764 -39832 -42317 -20361
27024 -20361 -24606 25220 87247 91835 16149 6991 9775 36333 46604 31720 -5608 -64213
27012 -64213 -82889 -26429 -11267 17523 18911 15466 1934 -41436 -104499 -85588 -80552 -3183
27000 -3183 41019 49193 25323 46023 64453 59380 37436 17795 9647 -10886 -34111 2182
26988 2182 3011 -27409 -6701 -26169 -67087 -50764 20888 25742 -26545 -22682 764 -11100 12345
26975 12345 41069 26074 49062 -176 -58395 -1808 16748 -26794 -47390 -23369 -39307 -20405
26963 -20405 -45459 -38042 -47066 -75908 -75400 -50032 -44785 -17622 -6692 14756 21984 -6477 1122
26950 1122 19980 -9170 -35417 -8511 3473 28444 44773 54715 93088 87466 16504 29847
26938 29847 76696 83243 29083 -18666 5774 48960 80268 39753 23000 12305 -36295 -59596
26926 -59596 -20512 23061 -41691 -74646 -24371 54011 81981 77380 61212 22512 -14096 -2528
26914 -2528 549 -8326 -2409 8653 -8871 -29208 -53396 -58101 -67824 -57955 -8840 24811 -39809
26901 -39809 -5808 -15654 16931 34123 28860 19180 13385 -35385 -19873 3945 -28326 -46970
26889 -46970 -30708 -21875 -33210 -30651 -36121 -30100 -36799 -46095 -65201 -11752 17123 49908 55856
26876 55856 51421 42084 19915 -14469 -25437 -30814 -10983 -4406 27527 31427 8251 -3054 -19781
26863 -19781 -51848 -8201 36546 39397 24315 20804 9297 10353 -27172 -15667 39989 30847
26851 30847 9612 -21747 18945 17303 58306 104974 56124 35993 41239 38686 43445 15481
26839 15481 18278 48255 62856 71445 56848 65836 32033 4194 28669 21300 -7128 5581
26827 5581 2187 -11820 -34351 -3387 -14888 -31504 -37297 -25179 -7248 -673 -9091 -37235 -61869
26814 -61869 -63489 -44050 10403 6643 21541 39313 35399 52331 64423 43914 26249 -419
26802 -419 -61464 -80385 -72743 -42542 31829 58669 39318 -25217 -35967 -39839 -74292 -10535
26790 -10535 7238 -21037 -40862 -96753 -66543 -3942 -19561 -80128 -62491 17776 86587 83938
26778 83938 79645 24188 -20532 -20844 4914 -9778 19313 48447 13043 -3351 -13920 -20132
26766 -20132 5320 10194 -26999 -17367 13109 56743 61329 44451 22776 66467 111807 77088
26754 77088 61130 61100 15212 95088 131485 117971 103795 120067 115833 104574 61349 27848
26742 27848 3966 18580 16737 1029 28450 -701 -21214 -13151 51504 30681 6979 31079
26730 31079 62882 79952 48847 -32235 -112819 -140056 -126753 -122016 -112619 -51350 -36906 -80794
26718 -80794 -63064 -42892 -7730 -16914 -4608 -56464 -47715 -37006 -13927 -13041 4970 56258
26706 56258 59334 -19311 -60046 1541 10046 -36365 4361 69989 129680 141818 110463 104745
26694 104745 56908 4540 23085 57561 50325 39635 5056 -9643 6377 82075 95390 65009
26682 65009 38155 13348 29584 40409 -28170 -97901 -70836 -36309 -45197 -14847 -23223 -21169
26670 -21169 -44704 2137 54058 78849 80018 5019 -30435 -27521 -60598 -23383 33822 3240
26658 3240 5506 18655 30803 31448 53887 68856 42312 38622 32690 35370 14520 34439 60035
26645 60035 -919 -10530 33942 45505 65726 97062 111732 75600 40611 6631 18346 34521
26633 34521 62127 53428 52206 46949 24410 32118 94374 75543 22984 14999 4946 16575 -57815
26620 -57815 -98971 -114765 -84232 -67853 -12119 31851 -4251 -38853 -36422 12308 -13549 -22601
26608 -22601 -47049 -23810 -44659 -70248 -91681 -38600 3323 11830 42657 14478 -2857 18146
26596 18146 13138 37688 36211 35535 63357 38330 -12728 9091 41780 49366 22719 12691 68307
26583 68307 36340 -13761 -33677 -74573 -73518 -27023 -11283 -48366 -67181 -51830 -41968 -37573
26571 -37573 5963 31743 -14479 -8590 24652 -9240 -47525 -1696 16363 -15264 -30241 -55919
26559 -55919 -74751 -41359 40718 88906 62004 8103 -22741 12384 52163 64621 76818 75467
26547 75467 29579 53362 48645 24026 -11277 -2992 -6412 -748 10153 63300 73709 33196
26535 33196 6315 15855 21003 62791 46933 -45684 -20402 -24550 -16962 -51521 -85669 -83824 11488
26522 11488 67028 85222 60699 58424 32127 36639 74215 71211 -18280 -47051 -22284 -637
26510 -637 12707 7268 32714 53081 72605 35365 -12437 -25509 -22981 -20519 -21698 -41377 -38373
26497 -38373 -46871 -48884 -66842 -52929 -19775 -29734 -24271 -16773 216 -56817 -97446 -51326 -18983
26484 -18983 6644 20147 -2478 -46408 -123388 -109465 -116507 -57100 -9000 -29406 -39628 -24030
26472 -24030 -1563 9226 -27652 -66156 -118103 -141409 -177879 -148163 -96347 -77172 -31873 8007
26460 8007 -9068 -20628 -41946 -44983 -24796 -7986 -4059 -614 33258 9207 15683 3901 18114
26447 18114 7652 13886 32687 28396 -4822 -29074 -25422 14353 56249 34182 23254 34249
26435 34249 30911 11215 48628 44985 33366 46690 -5789 -50906 -23279 -27251 -62581 -69281
26423 -69281 -30843 11038 15571 -47982 -74334 -85539 -105907 -88296 -29103 -2823 -51663 -78372
26411 -78372 -4078 34403 3371 -27770 11135 -248 2286 360 -39229 -100403 -85142 -31052
26399 -31052 -21019 -9784 36781 18706 6848 -16528 -41872 -10714 25507 80101 45150 -28825
26387 -28825 -90270 -69681 -18654 3714 -37635 -79196 -54566 -15800 -27085 -22186 -15620 28063
26375 28063 34196 43321 72787 44438 27629 41628 34480 25024 39875 71454 43140 41285 11926
26362 11926 -41080 -53381 -62945 -86134 -41444 -20542 -24937 3522 -920 9346 49149 25417
26350 25417 41550 85632 43662 28171 40346 30669 64823 18582 29947 636 -8129 -8709
26338 -8709 -3185 -29643 -42169 -60336 -80717 -60616 -7604 10833 -4969 -1270 32269 26498
26326 26498 -25899 -47012 -16999 45912 53910 31950 18564 -12620 -14167 64 26543 16270
26314 16270 23186 24642 -29053 -79965 -89460 -47439 -47938 -28626 8230 22278 -975 14861 51557
26301 51557 42666 40555 87368 116746 102639 102857 82165 82241 55115 6477 28083 60949 8241
26288 8241 18229 -3151 37336 13952 22886 91580 74004 30758 39264 78084 82785 51703 44357
26275 44357 -1458 28311 2167 10058 38799 -7027 -64310 -80329 -17036 -26544 -35087 -37145
26263 -37145 -36684 -28674 -56268 -29887 -63032 -15907 37541 73584 2063 10965 52386 92586
26251 92586 77099 110836 78869 85145 59519 14180 29907 57853 68005 55552 36115 72720
26239 72720 96906 84427 64566 63092 59642 44937 47564 19289 54538 11389 22542 72502
26227 72502 39614 2419 -33022 22013 22194 74190 75535 57109 -8267 25166 17541 6898
26215 6898 25354 -1352 -39525 -35189 -33318 -9205 7934 5061 20131 6159 6645 60822 96003
26202 96003 77209 74753 90974 79405 63362 31387 -60025 -102773 -148738 -109142 -36402 -537
26190 -537 11924 14594 -2277 3597 32694 35775 34879 2885 3182 25896 50011 71132 51040
26177 51040 56208 -5504 2864 64201 16937 -23380 -11976 -38394 -51842 -54727 -159 9848
26165 9848 -19892 -26364 17732 45243 470 -39677 -36937 -66546 -63508 -31455 10207 20170 29363
26152 29363 -42356 -33949 -14695 -42044 -55504 -43076 -26637 -10428 18685 29764 34037 -5532
26140 -5532 -50532 -45585 19497 38668 44165 72943 74611 39974 -41808 -67275 -69155 -20371 11455
26127 11455 13534 23655 13053 -6410 -18953 344 1923 -10379 14179 22641 15649 8616 -77100
26114 -77100 -146319 -125602 -87831 -57264 -30339 -42932 355 9042 33342 65170 75490 71670
26102 71670 41599 17402 12856 26517 81882 59512 21809 14728 -18170 1714 61663 46461
26090 46461 38221 78935 47248 -2713 4138 17715 1980 29988 29273 21237 8552 -806 -10493
26077 -10493 -14383 12847 -22425 5113 74975 57218 14193 17823 34273 28568 10917 11509 3728
26064 3728 -13788 -24092 -25960 -5050 23784 -20048 -59366 -37944 1864 -35645 -24691 20228
26052 20228 79770 67944 30792 41471 47954 62738 78047 -3547 -36274 -78295 -83539 -87036
26040 -87036 -58854 -15337 19692 35218 -5560 -23184 -6833 4249 65652 87376 86850 98629
26028 98629 131666 123847 81884 70359 69578 61758 27590 -32395 -59975 -40112 -51007 -58739 -111043
26015 -111043 -141902 -123469 -58756 -12934 -19067 -14792 -27388 -22534 23282 30970 -24213 -53673
26003 -53673 -72752 -73522 -117992 -109057 -97882 -107714 -73675 -5886 -744 -57752 -85233 -83543 -70392
25990 -70392 -25661 -1795 -7339 39739 47355 70895 80797 32592 8901 32358 44291 32723
25978 32723 -25560 -86511 -96075 -58382 -39139 -28495 -17753 -36082 -62008 -74417 -41883 26699
25966 26699 -9945 -20229 -9500 37449 71114 24379 46972 52958 56274 8037 16638 -23151
25954 -23151 -69471 -39438 -46608 -80839 -91795 -102939 -98837 -66216 -41771 -13452 -6326 -26093
25942 -26093 22297 43303 10458 -12852 6423 3480 -41729 -47326 -58525 -23546 -28787 -46358
25930 -46358 -54088 -31223 -60566 -87413 -87392 -60417 -25280 -53731 -62838 -56479 -35503 -61041 -44964
25917 -44964 -41198 -65183 -71128 -30616 42853 55583 28884 25043 25261 45350 45032 27850 73492
25904 73492 97650 72514 67690 56845 28701 31419 19005 -15095 -64529 -71802 -51826 -61329
25892 -61329 -57195 -65856 -21319 19034 28568 -22387 -74624 -81246 -37841 10918 -9735 -50408
25880 -50408 -57248 -5695 37442 49245 13296 -14509 -23170 -42120 -72073 -73947 -36346 46485
25868 46485 40373 24539 24678 80459 85568 83836 52964 44430 30687 -8118 -51581 -35604 -36361
25855 -36361 -84677 -126241 -149072 -135247 -124878 -90862 -29479 -15475 5195 -23470 -6617 38276
25843 38276 23096 -8316 18626 11212 54446 61297 67370 22744 -24183 -13543 -27197 -59338
25831 -59338 -92628 -134675 -142389 -82299 -84321 -48941 -27803 -1649 44450 83314 19312 8631
25819 8631 12006 12984 8780 32589 25429 -61763 -80391 -19496 16973 34284 20187 -29541 -22263
25806 -22263 -5849 -35680 -31702 -20938 -19194 8946 9802 43539 42841 49362 19107 13560 26093
25793 26093 -43238 -138642 -100516 -68046 -32516 -86659 -53577 29118 43667 14171 -53190 -79063
25781 -79063 -40018 8057 2702 -18624 -35552 -94742 -55952 -10822 13496 16935 22573 88133
25769 88133 77164 3007 24657 65848 49068 11992 -7223 -20100 20715 12609 24659 51797
25757 51797 37257 75581 75773 22218 53139 86159 87488 59801 -12574 -81392 -73954 -64561 -34748
25744 -34748 -17980 -7375 9457 13426 18403 2672 -32950 10971 25040 4635 -47193 -70894
25732 -70894 -45376 12699 13920 9639 -21931 -27987 -25011 -63012 -30755 14181 85453 106815
25720 106815 63442 -34250 -102778 -98556 -123365 -159130 -148137 -107715 -54144 -2398 -4103 -7177
25708 -7177 -2184 5735 -11199 -39176 -54034 -32519 -7234 -28357 -72480 -26717 -17161 -47100
25696 -47100 -24667 -25445 -21618 40259 62704 9777 -1111 10489 59629 63764 100127 84915
25684 84915 31995 26542 23058 8297 21715 27606 19389 1744 -24210 22832 22069 -43970 -30256
25671 -30256 -3686 10635 -16144 -50421 -86123 -79155 -18199 -41390 -21046 75711 85996 111197
25659 111197 112196 134834 83514 33594 33190 29745 36271 16266 13680 11311 -3476 -3682 -22016
25646 -22016 -18803 -10559 -22595 -38837 -40024 -46960 -71751 -47114 -15565 12841 43282 47245 39685
25633 39685 15118 -8249 12813 34279 48055 62154 51392 43885 36271 42748 -10020 -45534
25621 -45534 -59068 -20996 -36462 -16553 -9761 -6807 -27013 -19088 -25386 -31066 -29999 -69417 -79927
25608 -79927 -59667 -22569 19235 62663 24851 -10990 -31257 -5272 3962 -34030 -3405 61412
25596 61412 84822 73819 50771 41849 5331 -2740 187 -52430 -93662 -107265 -56383 -60342
25584 -60342 -76117 -40357 -13266 -32557 -68030 -30178 41574 54225 37228 24690 9500 12128
25572 12128 25449 29539 52717 76382 91597 58713 34736 43539 20997 -26332 -91098 -108750
25560 -108750 -45663 -30366 -31617 -2520 18541 -35865 -49327 -42696 -34232 -7009 -6814 -32044
25548 -32044 -19096 -15981 -3472 -22299 -19896 -12902 -4359 15900 27175 28288 51692 84208 91590
25535 91590 50710 22054 50226 12357 -24656 -42329 2488 11197 44686 63606 114893 113626
25523 113626 73810 -156 -31876 -52927 -79566 -42980 -51743 -98841 -76702 -51154 -48527 -55179
25511 -55179 -47122 -28127 -16442 33876 11929 -1572 21374 52331 55142 37178 -23808 -65752
25499 -65752 -7437 31895 44653 20902 -50279 -95774 -50215 15701 2533 -47425 -49663 -52888
25487 -52888 -83766 -63266 -28994 23126 22502 -7577 1599 -32451 -51517 -92486 -110963 -84855
25475 -84855 -5848 9594 -16563 -28777 -73549 -97732 -97542 -97853 -111040 -78633 -15410 23737
25463 23737 6772 -9001 -31721 -50198 -46483 -10638 -35285 -45603 -8818 4709 22176 38680
25451 38680 49048 56255 27492 28759 42601 31519 16921 55272 69168 31120 42565 12752
25439 12752 -35569 -50198 -16153 8148 37039 54627 8227 -13105 -22192 -51334 -73776 -97320
25427 -97320 -105970 -97477 -66375 -44422 -42600 1961 20618 9724 -35431 -10216 5113 -5251
25415 -5251 -101 23182 23154 16139 25861 -19759 -26299 13285 -19000 -35203 -41186 14807 -30082
25402 -30082 -71476 -68926 -59416 -70311 -61989 5292 42525 60527 77143 52857 46613 19468
25390 19468 -8423 17309 -33787 -63547 -49980 -49127 -2336 21247 35764 41960 -22844 -27877
25378 -27877 -35520 -22262 -28771 -22143 -6808 -38303 -61076 -31317 -24532 -17760 -13237 -7422 7248
25365 7248 17531 -15111 -30197 19384 5983 -31271 -20734 -8044 35129 46573 70821 52849
25353 52849 16195 -3285 41661 57090 31113 12351 -10078 15675 -28495 -86632 -61467 -53450
25341 -53450 -22644 15166 93743 87355 32739 -20126 -36610 3905 48690 61478 16359 -38894
25329 -38894 25294 37009 42014 42633 26471 26563 40962 57092 16484 -3307 -15054 -62491 -60482
25316 -60482 8725 20620 -40316 -85243 -80479 -38508 -59648 -121928 -128323 -100350 -50965 -83764
25304 -83764 -117036 -63062 -49339 -16958 -24923 -19128 13207 49975 10680 29256 71660 41072
25292 41072 2324 36845 30830 -37191 18254 -8398 -64114 -62152 -65203 -68571 -95837 -110633
25280 -110633 -49886 -23196 4493 -3691 -34232 -33012 -8257 13668 25364 4729 22568 22021
25268 22021 -27659 -43406 -31257 -7917 4049 30970 8799 -35405 -82286 -73110 -68271 -78591
25256 -78591 -45453 -22890 9745 -14613 2073 16641 -7311 -14080 -61613 -29916 -39094 -11756
25244 -11756 4560 -50739 -48050 -52412 -50172 -28253 -40338 3387 22518 -5653 -6951 -30828
25232 -30828 -69783 -26437 22372 32971 26540 91256 110684 97045 61542 17378 -33547 15165
25220 15165 167 -75873 -70357 -53711 -32815 -34471 -5624 -21709 -2184 9707 -10862 -16327
25208 -16327 -41938 -30236 7326 59893 117358 106168 7739 -29046 -5885 6240 -21331 -11622
25196 -11622 27321 3892 -2650 -10440 -1086 28670 74942 77805 93529 69319 16417 -32420
25184 -32420 2076 237 -51681 -54832 -27887 -3682 995 -24725 -19287 6941 -29855 -56479
25172 -56479 -5123 -5630 -16858 -5252 24943 67219 41957 -18552 -21501 13590 -15604 13896
25160 13896 15852 -35450 -41995 4707 24884 51712 22622 -24084 -8060 63861 58914 31753
25148 31753 -33004 -30447 -11221 23571 -25598 -84512 -51703 -10030 49089 -596 -28386 6757
25136 6757 -47068 -80926 -39401 25073 49278 21555 -65620 -40350 28240 88337 116845 78637
25124 78637 64887 44624 -6014 -47600 -73922 -67522 -46164 1634 -2415 -5745 12918 10829
25112 10829 -46623 -111106 -121540 -71319 -59749 -8019 44297 31879 -19946 -40766 -51683 -54708
25100 -54708 -43467 -47880 -73643 -61768 -87442 -108899 -60929 -33621 -6788 41646 20812 -54282
25088 -54282 -78991 -27112 -6763 -66658 -63194 -11371 55204 46758 20511 38321 1 23099
25076 23099 50538 -22065 -44476 -56793 -81824 -97477 -87135 -95935 -116166 -100811 -46618 -34800
25064 -34800 11519 -12386 -21437 8549 41476 11582 10863 21543 26007 34483 5223 -67131 -88100
25051 -88100 -83575 -99858 -80798 -25765 16053 53246 56892 39312 33667 15568 -21040 -35590
25039 -35590 -27326 -8025 -114 7145 -6719 8178 -35829 -69981 -18814 -12270 10890 2493 -3049
25026 -3049 -40364 -46668 -67243 -89674 -98166 -26109 27128 44590 47685 41977 -1542 12650 65943
25013 65943 60358 21037 19856 35305 29131 46385 48813 23114 4881 -40542 -36134 -36708 -25674
25000 -25674 10705 -10973 9892 17891 77405 38643 47870 92254 86609 49877 36716 25929
24988 25929 -1377 6578 -8934 -37378 33927 43032 5170 22227 40732 24745 35015 69593
24976 69593 87874 28116 -18674 -20730 -35201 -22293 -7284 11193 9290 2968 -32068 -21669
24964 -21669 -5956 -33577 -98744 -99580 -107716 -42499 22080 37944 45572 19765 -66106 -97778
24952 -97778 -52699 -15894 -1939 -7542 -7218 32471 18620 2709 18709 4460 -28295 -37480
24940 -37480 -70404 -55922 -54367 -71131 -89221 -70228 -54068 -21068 3506 33762 64757 82461
24928 82461 85584 60848 1650 -60573 -71623 -52358 -36545 -32226 -16453 24516 43975 39987
24916 39987 47728 63795 34861 -3965 11535 12549 16131 45016 4624 -31914 -5445 19978
24904 19978 37472 71329 44732 695 -30645 -7309 14574 35056 70358 67179 70829 40074
24892 40074 -11724 -14379 831 26369 83771 63856 11129 -46059 -48718 -37976 -38738 -29279 -49287
24879 -49287 -59868 -290 47347 9790 -57814 -11034 -8142 2303 1766 43419 44374 42986 44301
24866 44301 29830 8289 -36875 12529 26769 78079 89317 60410 37197 13110 25497 3049
24854 3049 -76808 -103872 -85727 -75892 -78136 -118464 -99223 -9709 -94 -44445 -73819 -62490
24842 -62490 -49650 -53014 -56240 -63428 -107442 -50104 -5892 29384 83074 60824 42869 -1051
24830 -1051 -56583 -57196 -39281 -1934 3912 58895 75563 40656 36299 3087 -11106 6528 15164
24817 15164 -1964 1359 9901 8679 21832 12081 20497 -22757 -13215 35102 26389 28315 40450
24804 40450 29289 7356 -5324 -3051 -17146 -29868 9739 38913 31584 32350 76253 68912 -4406
24791 -4406 -33035 38915 86240 86183 47368 41658 -43923 -104731 -91643 -111012 -148249 -135680 -69046
24778 -69046 -48664 -16933 -39905 -49220 -33907 -32332 -14556 -12254 -25113 -38856 -24458 480
24766 480 -10400 6348 13229 -6169 9171 65759 91913 103887 81024 73149 48315 56388 62848
24753 62848 20607 -33381 -45705 -26057 -34165 -21798 -62979 -144914 -168254 -185552 -152789 -120218
24741 -120218 -108664 -60167 -26209 -14272 -23376 -59554 -65330 -37438 -22972 -57181 -61177 -85511
24729 -85511 -48288 -56758 -56825 -44189 -25292 -29931 9905 52199 39852 -13104 -16294 -729 12183
24716 12183 9666 -18663 -61964 -46806 -54800 -7269 -24356 -26598 1974 9505 -23874 -79779
24704 -79779 -37422 -30849 -17624 124 4135 -420 16832 -24532 -83716 -64923 -50514 -79144
24692 -79144 -81390 -37987 12829 -17725 -31000 -13255 -20434 -443 -20410 -40764 -46411 -20049
24680 -20049 2082 -34273 -82995 -86320 -25954 -7445 1577 25812 41935 24546 21994 15291
24668 15291 -5660 -12520 -2718 -52641 -41521 5723 25716 7089 -17775 -14928 -10146 -51357
24656 -51357 -77229 -47064 -72638 -64467 -32898 -10853 7018 27814 47862 53262 4954 -48963
24644 -48963 -45580 -13897 39164 61136 39153 -13352 -74243 -94063 -21555 -2864 -27056 -26913
24632 -26913 2113 -21399 -76338 -54423 1025 15260 41433 15111 3654 9570 -35845 -30457
24620 -30457 18550 15564 2532 2573 -32713 -37660 -46454 -58807 -76645 -47690 -13480 5183 4692
24607 4692 52828 -1696 -10443 63517 49218 1390 -8938 26023 1190 50168 39712 -23616
24595 -23616 -13548 -4616 21754 57199 69908 66953 85051 64267 36340 16701 -44932 -48283
24583 -48283 8015 -7772 3251 -1454 -68479 -107210 -89881 -54986 -84787 -85797 -39621 9511
24571 9511 7867 26920 18148 -6886 17165 -25135 -44866 -14934 7375 8835 16663 -9328 -18447
24558 -18447 23308 7579 9364 3589 13022 25809 12798 -13027 21210 92855 125927 90759
24546 90759 88282 125358 70808 -48490 2857 11794 -9201 14885 44430 29203 37120 89396
24534 89396 16193 15464 51070 18152 17388 -5221 -13510 43650 57309 72309 94939 120554 118069
24521 118069 56598 35536 68083 79592 49508 76206 87862 48332 6043 2812 -43305 -80866
24509 -80866 -58912 -73536 -97421 -109255 -56675 3984 -6460 13224 280 -92930 -80961 -72449
24497 -72449 -61159 23145 -10220 -27754 2756 58657 86123 88622 82026 32311 -23384 -176
24485 -176 57305 28683 17896 -1589 -34001 -29128 -48871 -46099 998 -10522 -67529 -61497 -37130
24472 -37130 -39058 -49363 -60929 -83180 -60048 -19785 6551 -11523 25704 66789 62429 61084
24460 61084 68829 39892 -14793 22345 54093 10889 14521 -8483 -77076 -103477 -114991 -65671
24448 -65671 -47561 -26628 19635 17247 -13234 28731 41510 61310 16582 10368 9729 -8538
24436 -8538 -32759 -70348 -51822 -66768 -30721 -2423 6813 20257 17218 -6562 8471 8777 41389
24423 41389 57328 83638 70738 76471 53529 -38145 -56199 -97338 -114664 -108191 -64373 -12835
24411 -12835 -4554 -6367 5464 40027 25940 5730 -11207 641 17782 -7887 -58787 -62159
24399 -62159 -46067 -23581 -6708 17494 5113 -6854 -22409 -13305 -19589 -62283 -50564 -34161
24387 -34161 -9758 -43322 -111401 -91283 -52938 -33581 -9917 -9854 -7828 -46970 -46946 -3999 3066
24374 3066 16036 24093 -15240 -27847 -17349 7970 19205 9539 54635 29494 19007 22724
24362 22724 2869 -7426 -1960 -56056 -99883 -123774 -97887 -14272 18448 -12337 5169 9705
24350 9705 -30532 -34883 -36563 -74759 -120818 -70852 -63154 -40644 -15785 -42103 -40023 -46944 -103442
24337 -103442 -142048 -122837 -70811 -33472 -19708 -1663 -11821 101 15016 56154 73551
24326 73551 80603 90453 21760 -65407 -53972 -43212 -43366 -42526 -36733 -30435 -2998 -2372 -12444 -6361
24312 -6361 41563 78166 57583 17388 16919 33073 8536 -11325 -7842 33369 50625 37598
24300 37598 -20908 -53406 -25695 22865 21329 17637 -31704 3488 31772 56910 55680 61547
24288 61547 35004 11334 11426 13728 -24306 -32547 41527 33555 17009 46767 45687 -39364 -94431
24275 -94431 -105082 -32653 26660 20197 17897 34778 12562 18877 7107 -18008 9595 23831
24263 23831 21505 -32608 -51547 -80701 -74771 683 21616 49850 31229 28545 38585 90793
24251 90793 55985 39879 38997 31749 16184 16310 45748 21754 -53357 -65342 -40513 2468 11192
24238 11192 11041 -50040 -87335 -86775 -81412 -42428 -61857 -75566 -81129 -52987 -2313 -44400 -77737
24225 -77737 -36233 -1664 34092 13151 14022 73618 47438 27405 14527 -7016 -34005 -22883
24213 -22883 14276 8797 31089 23480 -30465 -39387 -32242 -18471 -20039 -2889 35295 39972 25894
24200 25894 11906 7044 -7132 4718 17547 -9082 -19295 -43002 -70497 -80000 -22707 20071
24188 20071 16777 1187 22888 70812 48822 62184 99801 73858 52910 33817 19990 -1559
24176 -1559 -8077 -22835 1968 -16072 1611 12861 -5770 20385 20962 -1806 4233 -3269 -11507
24163 -11507 48 1971 37195 75931 67550 2947 -574 -37764 -72553 -54519 15503 484
24151 484 -61768 -45181 -58999 -81863 -49142 -36325 -24272 31961 9909 -44753 -22050 -11464
24139 -11464 59983 24784 -23054 -68456 -66103 17858 66102 11055 1308 -1356 -15565 -26688
24127 -26688 -27681 -10687 2487 -51387 -24977 -18468 7814 31891 13427 2590 -7402 -30684
24115 -30684 -11753 22802 48091 37094 32574 18985 41716 32404 7572 -29670 -34628 -51847
24103 -51847 -60083 -84764 -65451 26463 54327 56021 48149 -5027 -20965 22150 24407 1217
24091 1217 7790 7122 73673 100723 96344 66213 20890 4100 -43434 -44916 -76510 -40352 -24585
24078 -24585 -65560 -52503 -13143 31850 58384 -17974 -75755 -87385 -38072 -29966 6637 -3915
24066 -3915 -43620 -45593 -25544 -61673 -68433 -53151 -29933 -21295 21471 93004 51578 25062
24054 25062 -13472 -23231 -22 -59047 -69259 -61866 -14872 -21891 -6405 14915 4872 12666
24042 12666 25226 31492 41877 47556 19652 12769 31365 5852 -9865 10121 31350 39652
24030 39652 28352 48699 32034 -10742 -12858 -26606 -9915 -24966 -53947 -47838 -43883 -34789
24018 -34789 -36685 -125 49268 42742 47381 -6324 -61792 -9827 12278 -2861 -8888 10746
24006 10746 26010 28703 71817 43753 41558 38783 -47730 -72152 -90397 -75436 -74193 -43238
23994 -43238 -3799 -13259 27745 56295 52230 46240 22180 -30919 -36596 -33069 -47611 1073 -1215
23981 -1215 -20986 -14642 16061 -16785 -52841 -42887 -35053 -5390 -11855 -60320 -21780 -26681 8712
23968 8712 1668 -16407 -25347 -53467 -20169 57226 44554 22363 -36356 5485 52202 52072 6653
23955 6653 -45759 -44421 -66718 -101952 -44969 -58202 -83337 -58086 -47320 -39689 -46711 -52245 -3982
23942 -3982 17680 12817 -16003 -19754 -34818 -78447 -127580 -88982 -46072 -51482 -30176 -31208 -7741
23929 -7741 -6648 -23077 -41284 -29250 -20401 27871 54106 32356 -10847 -18093 -16632 3755 24370
23916 24370 52882 60142 43986 14411 14856 -25054 -31165 7144 -18358 -38950 -59400 -91343
23904 -91343 -122991 -118781 -71777 -62742 -73638 -72030 -39593 -45541 -35205 1181 40472 29605
23892 29605 10844 -4148 9117 21343 11855 21858 31854 963 14423 23655 37867 56314
23880 56314 68529 18345 34739 64194 57687 38495 -14721 5546 52744 57332 40091 -27809
23868 -27809 -93631 -72573 -64588 -55046 34310 55947 42266 3190 3232 52262 74595 55091 -6789
23855 -6789 -48595 -24713 -11724 4161 -8372 -24934 -29465 -10405 1106 -21895 -50380 -77352
23843 -77352 -41959 -13912 910 27035 -21443 -2157 49163 14237 -25191 -2014 35734 91525
23831 91525 101922 94560 83574 68488 -2786 -13533 26990 84481 67085 -18831 -42547 7469
23819 7469 -7000 -33394 -23379 13154 46529 -661 -59438 -24416 -3028 -15252 -41833 -59664
23807 -59664 -44253 -28812 -42382 -75588 -71026 -78148 -77286 -60671 -85099 -112344 -89277 -46569
23795 -46569 -20354 -81228 -99652 -36876 16688 24533 -3716 -43028 1253 23251 35695 60978
23783 60978 40816 -28123 -57259 -49806 -40553 7844 -5920 5848 53953 72463 8198 -10023
23771 -10023 -29841 -10492 6809 9562 -3524 -48841 -38755 -13980 -22396 -17883 -8229 2285
23759 2285 -39951 -56435 -67187 -28916 10775 15182 45212 67749 57837 92355 106713 57727
23747 57727 35348 99799 87752 84529 102933 58910 -15963 -26587 -33908 -47483 -55695 -84553
23735 -84553 -52177 4189 27227 17 7916 26064 53402 49604 59801 40293 16466 50487
23723 50487 63561 72854 70353 23595 32608 28510 13636 22010 -21967 -10288 -24930 -49468 -14279
23710 -14279 16446 17102 37067 37361 28388 46398 76784 76016 48792 22758 20338 -7391 -2632
23697 -2632 24664 74766 59551 95166 75212 49674 783 -68969 -107113 -92378 -86901 -42759
23685 -42759 -19830 -17124 -23216 -5657 -8089 22482 37934 30578 28155 5114 23189 33322 27532
23672 27532 83515 106715 95279 14511 -20953 21344 66795 60701 34820 -6475 -32042 -10328
23660 -10328 -39792 -16589 50365 51887 8811 11775 35798 61743 83494 73583 49733 15886
23648 15886 42066 29550 697 -13019 -3780 -2165 -20360 -54397 -59198 -55916 -68022 -20532
23636 -20532 23271 33959 55110 22338 -48111 -50877 -77891 -70257 -63447 -96561 -71855 -64820
23624 -64820 -46134 -4143 -18175 -75759 -86205 -64947 -31933 -21924 -33338 -75297 -62763 -265
23612 -265 -8637 20948 9017 22634 12404 3628 -18142 -49369 -56023 -26812 -35645 -8128 63652
23599 63652 70118 26442 73314 125166 117923 61929 -2216 -36891 1422 32991 11381 36930
23587 36930 15754 26951 44103 4225 -23236 3489 3341 -16732 54407 51402 41455 13522
23575 13522 -185 -7825 -44473 10751 88322 89729 524 21477 -17872 -63728 -88779 -107938
23563 -107938 -82925 -32115 13690 27534 33049 32295 35718 39975 22729 -9705 -7161 10159 11059
23550 11059 10867 31259 33424 -5322 -27746 -39216 -57047 -51559 2405 33923 27120 -565 29985
23537 29985 67852 41005 24245 9410 -25996 -22805 17533 74526 76326 38937 17352 9169
23525 9169 2796 56417 95343 77251 55207 59873 55188 53242 20875 -25053 -71825 -83280 -68466
23512 -68466 -36764 -22914 20096 80675 80281 30473 768 12765 -5090 -12643 -36413 -53288
23500 -53288 -21067 -411 1888 -37172 -66305 -26188 -51337 -69965 -65023 -93080 -54430 -3641
23488 -3641 12632 2000 7676 13525 16677 11030 -35433 -85509 -108218 -106751 -64722 -79094 -69577
23475 -69577 -30758 34036 55269 60934 63236 45370 83250 62730 61377 77654 66032 65555 82137
23462 82137 80862 61558 34050 -20894 -49207 -61243 -22137 17549 -22235 -8499 -19638 -54048
23450 -54048 -67645 -49227 -44271 -54744 -42900 -71133 -79674 -25886 -77425 -22234 -11087 23285
23438 23285 4605 9773 8387 8887 46871 71118 31738 22435 4935 -28248 -55013 -22551 -2229
23425 -2229 -2448 -26265 -15942 4356 21104 11337 6800 21032 26414 25150 25819 -10329 33246
23412 33246 59718 43576 1857 -12945 23364 53527 82609 85469 61879 35846 39491 22386
23400 22386 23490 65479 69539 50749 41002 1006 -21844 13701 41456 23399 -27998 -42743
23388 -42743 -35127 -29734 27210 66099 133198 92096 76465 130157 90620 45940 53657 83096
23376 83096 51052 14883 47695 62435 46670 34802 51680 16775 49049 51555 37150 75158
23364 75158 90808 86194 55157 36240 66605 108948 142969 91023 38535 4994 -14351 44446
23352 44446 80305 125433 172881 210492 255796 310633 370157 458969 641930 876539 1147878
23341 1147878 1383416 1510545 1550790 1440378 1159178 828799 517455 344838 248618 182046
23331 182046 146003 126253 125704 88637 63908 68262 76421 59452 46820 53577 105528 81397
23319 81397 21138 9842 -1177 10238 -26633 -11535 27404 42621 25061 32306 29245 23976
23307 23976 -23278 -66678 -1717 39167 90973 72920 -4540 -25603 -4963 -17302 -28551 -58626
23295 -58626 -15701 59715 107612 85000 40971 -809 57656 45606 10162 13382 -17301 -28761
23283 -28761 -24776 -8320 -32742 -49285 -80479 -76489 -42514 -39423 -25079 -9328 28735 -35291
23271 -35291 -113193 -70831 23650 28510 -9700 -6180 5376 40337 -380 17497 47524 41363
23259 41363 18514 -23915 -1961 -17088 -42243 -22164 -7801 -3350 17093 1600 -41463 -58179
23247 -58179 -6983 685 -6559 47939 35289 12403 34779 66563 48364 45181 18080 -13021
23235 -13021 -4251 -10312 -35092 -85706 -98728 -125193 -100398 -26106 -9175 -10787 -52564 -71070
23223 -71070 -60344 -35543 -62903 -32179 -42549 -83873 -71466 -80978 -58546 -4150 -25408 5369
23211 5369 29086 -5117 -24826 -39221 -47931 6605 42651 35718 -260 -21579 -28917 10024
23199 10024 -5026 -12058 4253 6335 -18681 3443 -10332 3387 27618 50181 38361 54694
23187 54694 39250 36541 30116 33967 25297 27892 45256 27516 65598 68055 32606 -3008 -27243
23174 -27243 -34647 -14469 61403 79648 66114 44266 54647 96176 96787 56947 -10267 -39340
23162 -39340 -66171 -27826 -5314 -24129 8989 -19073 -4518 1503 -2340 -2657 13482 -42127
23150 -42127 -72380 -54002 -34165 -30092 24185 33557 19637 -10423 11674 52648 14349 -34478
23138 -34478 -8290 -17015 -21435 -23869 -29735 -23889 43803 85338 90289 104140 58994 7660 -1131
23125 -1131 -4593 -9786 -20061 -34979 -38767 -64501 -24519 36132 41954 -5871 -21830 -30101 1304
23112 1304 20863 9023 -3792 -7544 34680 69136 57789 22685 -5954 -12019 -29075 -21592
23100 -21592 -67062 -58401 -59399 -30623 17528 41657 104690 174549 146677 110211 94771 68289
23088 68289 89548 135939 121906 85885 44058 -3405 30308 64833 55979 20799 72139 84227
23076 84227 70900 35156 31038 8924 16405 37781 88669 83028 63114 28068 -1167 37585
23064 37585 46673 35921 14170 18006 -21551 1066 3664 -12032 -5527 -10818 42147 24846 -11302
23051 -11302 20534 32522 24205 -18116 -37569 -22671 -24193 3949 15654 6521 55157 118505
23039 118505 137140 144520 146604 147105 179029 198956 235838 259404 253040 228060 200932 185716
23027 185716 153878 144290 109491 47118 45190 82381 82626 43275 -18568 -5403 39027 63111
23015 63111 81952 92816 65502 52647 28087 70201 118262 119774 108204 74056 18433 29200
23003 29200 -5036 -9761 25533 27941 54722 60542 71189 112017 157850 180377 158599 103296
22991 103296 85584 111067 198405 216080 218718 274536 267667 311252 342790 360306 408414 427189
22979 427189 482659 607169 661686 788288 878910 942187 952973 881101 644376 303189 -52009
22968 -52009 -295688 -381778 -349455 -303105 -298440 -256740 -195574 -142975 -133175 -169728 -217970 -225741
22956 -225741 -249827 -258699 -232673 -211180 -192758 -128122 -132045 -135354 -120953 -98145 -51333 19779
22944 19779 56416 45879 14307 -48913 -94516 -65957 -51752 -55987 -37279 -17575 20956 5464
22932 5464 -9234 -3260 33676 25129 37872 23317 37555 36689 23064 14048 9164 10263 -10366
22919 -10366 -90350 -72264 -42759 -2809 56201 105806 142500 125670 72175 9757 -26244 -37887
22907 -37887 -55728 9918 112603 124196 87628 77539 97102 88251 87819 112092 65498 34560
22895 34560 114801 173271 157466 122418 127635 178486 211364 256553 275018 230768 210840 205027
22883 205027 241112 261031 232400 203587 136493 141706 166738 222021 222177 263887 325810 342313
22871 342313 402585 422273 420160 435751 485280 584203 688608 934470 1260479 1521587 1654886
22860 1654886 1770320 1711183 1422476 1113166 850467 642736 530951 507203 455267 406502
22850 406502 400128 397992 399215 410035 420407 405073 420238 475570 526021 604180 639551 640379
22838 640379 685512 691074 707276 707935 731357 783751 881391 927770 929784 964717 946769 949202
22826 949202 979647 1040296 1141497 1243020 1335802 1392670 1428469 1537410 1582428 1658208 1793091
22815 1793091 1991313 2186172 2359697 2563710 2736025 2899227 3108613 3356975 3563298
22806 3563298 3804616 4139764 4534568 5014796 5535271 6090912 6876237 7812939 8936815
22797 8936815 10366439 12076342 14278952 16987712 20297874 24461558 29741160 36579752
22789 36579752 45572282 57769750 75141119 100861073 139317540 193925108 255270355
22782 255270355 303643377 318018591 293935783 240878626 177027518 122621525 81924914
22775 81924914 55191881 39038634 29039707 22567786 18188058 15145418 12842022 11013005
22767 11013005 9529221 8295561 7281323 6534414 5907951 5341637 4903945 4487807 4089722
22758 4089722 3750016 3476616 3240143 2996506 2770172 2596155 2428575 2247124 2119686
22749 2119686 1990447 1891726 1808589 1769401 1718479 1668808 1564260 1472764 1404501 1392269 1391650
22738 1391650 1328720 1296559 1290310 1224178 1148833 1119249 1054488 1001973 935774 906442 932712
22727 932712 947701 977210 1073188 1130051 1132166 1116603 1066162 937820 880568 842427 820561
22716 820561 803214 783508 773646 760869 741802 776952 824569 868945 882408 933996 1072710
22705 1072710 1235757 1473255 1787495 2054727 2083143 2050856 2032177 1762829 1442962 1128875
22695 1128875 848340 667468 533555 431363 372464 362951 367064 364617 307419 241598 167445
22684 167445 157666 199665 182136 252190 256923 207686 214015 230376 270562 257523 247171 280950
22672 280950 282051 284910 246375 211312 207792 219601 183583 165515 144599 158262 196222 215174
22660 215174 233972 238086 273915 324311 287978 273007 318990 378809 390757 367877 277029 258949
22648 258949 173709 197577 250959 250780 197950 146565 109938 132328 160638 171161 177589 174339
22636 174339 142344 164160 184202 216189 256376 293659 270734 194938 199134 193572 188713 186352
22624 186352 223907 195334 164158 129554 144204 160611 192039 183321 184589 208602 218950 225604
22612 225604 284670 265709 264877 274782 309183 364413 387069 360498 352586 351732 352816 363887 379329
22599 379329 350837 345522 392046 428248 389479 266173 33557 -262744 -538678 -735141 -837609
22588 -837609 -833057 -793886 -649451 -461013 -352602 -237368 -158219 -164141 -144737 -151571 -188217
22577 -188217 -214912 -177848 -124292 -130453 -152884 -131928 -149693 -134044 -88879 -109844 -89915 -35025
22565 -35025 -27356 -5783 -5709 -25540 -32275 -7727 -5135 23752 17393 16368 42447 77036 40615
22552 40615 36959 22283 30499 24182 21926 -20834 -50205 -44086 -39942 -34194 -15841 -8849 26133
22539 26133 48298 51765 44685 32864 50493 56364 99937 114975 91830 85407 88067 35849 10771
22526 10771 14605 28075 27615 27038 74558 116813 120759 146973 133292 97328 40393 28967 66230
22513 66230 85839 27399 261 1075 -13948 -14625 29978 30606 3508 -11053 -5742 16014 14764
22500 14764 -15818 -26560 -11311 19873 63042 80152 34236 39797 99585 97311 101249 133121
22488 133121 111462 74108 53495 72587 69732 72662 39050 7061 19040 35134 22489 37852
22476 37852 -6024 -104011 -116676 -88938 -41955 20942 16302 -30735 -4268 -22197 -107161 -132397
22464 -132397 -53952 3986 -54354 -92114 -60785 -47775 -48448 -70118 -41129 -45522 -24631 -24023
22452 -24023 -46023 -7995 21533 20933 -38174 -37476 -394 12309 63494 72037 39275 -6571 -25177
22439 -25177 -18419 14232 16578 40093 61942 64435 64974 43520 44605 8649 16619 26683 -6342
22426 -6342 -42130 18008 56790 34532 48622 28032 -5377 27406 50401 40167 27671 13675
22414 13675 -7874 -8517 36264 82911 135856 91672 -13921 -34057 -25307 19827 18206 -20398
22402 -20398 -38774 -57679 -23962 -303 -6020 1570 23768 22889 54004 71010 55223 10545
22390 10545 -42308 -61291 -55104 -26525 -51771 -71771 -52863 -25575 5324 48829 114048 77452
22378 77452 37352 30160 -3704 3604 10329 -9412 -33666 -64781 -52931 -22722 10315 46778
22366 46778 43185 -843 8805 21055 21408 45677 85987 55719 31622 8585 27883 49804
22354 49804 23872 -3330 8189 33968 11788 -31587 -38491 -42476 9633 21051 -8089 -18227
22342 -18227 -27503 304 44187 45555 51894 18245 -4798 -49461 -62165 -55089 1292 1430 31787
22329 31787 87028 69197 -7270 -42758 -44387 -26720 -15901 1448 44712 33341 -13817 13588
22317 13588 45069 55989 24822 36365 85900 33587 -32789 -21960 -35831 2521 29200 2269
22305 2269 -1254 -45671 -20474 -40978 -51034 -41346 -1186 -2574 -39006 -22559 -17981 -32239 -23651
22292 -23651 -29689 -47210 -45344 -7281 -15034 -5516 9936 47372 74393 37953 27222 31179 2613
22279 2613 22853 28644 11053 4694 23221 35697 -5705 24991 65908 24193 58743 56976
22267 56976 47442 40967 30128 5278 10262 -15 -73297 -81519 17230 59015 -10666 -27546
22255 -27546 4607 9837 28007 -10580 5064 16567 39601 56487 56562 13968 -7917 -5305 120
22242 120 -9061 4215 19231 36704 53058 29472 1111 2190 8325 24220 41707 81436 130622
22229 130622 113385 75692 26272 46846 95437 87841 116350 181496 282959 386093 483755
22218 483755 594448 788436 1155701 1491178 1668274 1697888 1527537 1222843 943452 691854
22208 691854 446563 266494 191296 213380 179415 116394 99474 91059 46457 46522 -6199 -13956
22196 -13956 4652 35344 76011 100583 46203 -15356 -1439 65239 44833 40250 20447 20599
22184 20599 22674 52437 103040 65497 56873 78260 52273 -25619 -100817 -150098 -118849 -84964
22172 -84964 -44120 -52138 -50203 -54578 -55210 -34236 3390 -12092 -42022 -17433 30233 57497 13027
22159 13027 -1700 -39208 -31506 22359 69229 26064 2820 -14256 -610 21209 26571 2416
22147 2416 49123 51764 67139 111934 75806 58627 36482 58590 58501 39168 1868 13052 28503
22134 28503 58445 95208 30935 -8877 -46115 -62822 -12577 9670 43988 26029 18728 12107
22122 12107 29157 45535 10933 -5979 -3221 -41524 -57839 -53746 -61855 -30010 -32430 -7241
22110 -7241 -46974 20258 84848 48621 -7418 -12988 -3375 -15473 274 36881 60029 76061
22098 76061 81006 103714 131205 138671 71867 46474 29619 33757 47270 62230 21165 20312 16241
22085 16241 39449 39955 40946 44891 37694 10717 -58792 -63372 -73926 -54575 -18904 -20879 -11185
22072 -11185 -32254 1658 -11478 -47109 -15511 -1362 14834 19598 -12040 -19152 15761 -9778
22060 -9778 -25466 -23456 -55899 -26448 -27108 -6381 -7433 1622 42108 43578 47844 74091 70092
22047 70092 48399 5006 -4523 48096 61663 46563 -4185 -29771 -20947 -6967 9288 1556
22035 1556 14660 27642 3305 -21044 -4238 -16791 -29247 -19556 -41593 -22911 -14925 -3393
22023 -3393 1310 -20974 -47323 -19999 -36769 -57129 -68238 -51621 -43045 15258 35428 47093
22011 47093 -3117 -72475 -93106 -52724 -59068 -59842 -22465 -18663 -5829 9428 -35390 -58465
21999 -58465 -69846 -69565 -27439 11853 33434 71588 61501 48241 39373 44275 63920 32580
21987 32580 45438 50676 51487 50095 40607 1982 33967 22382 25072 30317 49132 16534 29600
21974 29600 49813 56730 56861 103828 82209 12596 -23429 -28151 -4805 -15927 -25571 -34556 4580
21961 4580 17725 -2011 -50358 -85768 -59875 -40558 -10269 75411 56683 50734 62411 38177
21949 38177 3709 9995 -6722 59912 35838 -15791 -32635 -21104 2295 19906 -58633 -49457
21937 -49457 -9265 10392 23685 75999 74392 55709 29243 -48399 -52161 -18540 2997 -13297
21925 -13297 -58852 -34197 -23368 -63679 -40565 -11670 -21269 -69834 -30362 -14497 -11963 -38755
21913 -38755 -40998 -58315 -46610 532 34016 6767 -19701 -64618 -72909 -72529 -41156 18035
21901 18035 58941 20275 67113 50013 30721 57303 34813 -5727 -45490 -50079 -53938 -39423
21889 -39423 -60165 -35788 24525 18348 27530 10041 -7411 4255 43201 32090 -10881 21691
21877 21691 26838 -5614 583 20015 50897 47492 33812 58336 119159 102533 49521 68281
21865 68281 49055 32824 32810 -11399 -32444 -5299 -43428 -63382 -54889 -59486 -52291 -40888 -16833
21852 -16833 -13653 5021 -20119 -47285 -52937 -7975 3223 10052 9993 -3496 -31473 -7838 -28695
21839 -28695 18320 29520 3502 10917 -8100 -9676 -21761 -64382 -96629 -89335 -68714 -3905
21827 -3905 44650 38186 10684 4374 14378 11361 -311 -2010 -10880 38060 93285 67945 44737
21814 44737 44889 22315 7931 -19145 -78641 -95246 -82376 -68285 -64136 -63222 -37429 9881 27546
21801 27546 -33954 -26389 -12213 36852 14329 597 17705 55911 37264 -234 -31834 -43991
21789 -43991 -33185 -12127 -3553 -11936 -41400 -3974 25268 32756 -44810 -104478 -138739 -147691
21777 -147691 -145733 -125592 -57823 31884 7664 -9681 -19882 -65002 -98242 -59745 13147 23960
21765 23960 10264 -37315 -25852 -38658 -58548 -48906 31206 30147 -11605 7495 -11398 5746
21753 5746 37702 45568 35243 26548 14080 -15374 -9592 13584 -14188 7003 14798 -10849 -37234
21740 -37234 -27043 -13825 14916 3072 -10273 -18660 -58102 -59225 -21586 -8718 24130 23771
21728 23771 23723 1411 -10237 -18213 -38376 -20392 56957 73956 43666 18898 11775 -33312 -42018
21715 -42018 -16722 12930 48500 25844 -38010 -90257 -52927 -12356 39883 18590 -16930 -15550
21703 -15550 -33236 -61237 -27708 2567 26442 28152 -17215 -17664 11611 -20398 -43281 -9573
21691 -9573 40215 94238 66239 21846 26471 29480 49527 46788 34596 50828 7640 -42444
21679 -42444 -23226 -17416 -11431 6395 10357 42591 18384 -8901 23196 9143 -69039 -62817
21667 -62817 -46906 -87556 -79726 -60226 -63713 -23025 -2832 -23450 21844 55105 34184 12876
21655 12876 75955 100750 58919 35430 44167 15983 10622 -14874 -2200 33526 40 574
21643 574 -61954 -78890 -52322 -18562 7671 12021 5924 -9265 -14859 -46041 -43957 -94282 -65464
21630 -65464 -28915 -40841 10380 74178 62470 22585 11265 43842 81220 42089 -40910 -86096
21618 -86096 -70221 -33359 27490 32025 40493 79054 80258 100518 58849 12240 38765 8187
21606 8187 -52150 -59826 -12138 26206 42969 62994 36301 13370 -38571 -73264 -109924 -89024
21594 -89024 -69908 -100785 -90239 -85087 -24153 -7928 -59537 -43907 25267 39853 48248 38904
21582 38904 34009 21972 -46695 -72129 -65450 -70923 -49235 -24225 -20410 -72615 -91166 -43157
21570 -43157 -6594 20623 8212 -26884 11724 34511 25222 29296 54678 44923 37389 35695 -3652
21557 -3652 -76238 -57603 -10018 41006 38053 987 -42138 -67519 -75456 -66438 -55986 -67273
21545 -67273 -48725 -16608 -11006 1232 11693 22200 76318 104753 46381 -456 -35637 -31972
21533 -31972 -22467 13172 67894 29498 -18329 -89176 -101648 -87016 -88618 -33259 31218 37522
21521 37522 -16109 -38414 -30608 14304 55381 10174 -18168 -21199 -6446 -13243 -20600 33423
21509 33423 88118 23616 -11925 -59119 -52541 -66892 -96518 -60653 -30207 -18566 -860 27835
21497 27835 54082 30433 58105 47287 27954 43413 58147 63264 61371 47547 56819 78830
21485 78830 91136 34597 -52515 -71161 -43027 -24992 -39525 -20276 -19275 777 49186 30178
21473 30178 23178 17151 1311 20117 5297 -47233 -48046 -41521 -52423 -70599 -48464 -31991 -33497
21460 -33497 -52786 -27039 -16522 5577 -17573 -22977 -1574 15766 34325 8432 -107509 -119226
21448 -119226 -70626 -76878 -108137 -112389 -131265 -152053 -103029 -20605 -21313 -80663 -75478 -35193
21436 -35193 1879 51452 19524 -3086 -1299 -27421 36988 25645 15548 -4132 -44420 -40946
21424 -40946 27406 53945 13841 47539 29894 61436 60472 6389 14365 -10255 -6164 -98 336
21411 336 -22406 -35513 15496 -46408 -25622 2468 32886 1184 29467 83021 96841 95045
21399 95045 28065 -41563 -51257 -112849 -116589 -37462 -46657 -60198 -20403 20261 23155 26868 55210
21386 55210 75405 39648 -3665 -21636 16144 18078 -18592 -27086 -987 -41647 -82029 -61557
21374 -61557 5626 15362 -40029 -65783 -34829 -10597 5592 736 -25946 -34588 -46494 -39478
21362 -39478 -84994 -24190 26269 1724 -48577 -25434 19115 9023 -41452 3069 57890 18694
21350 18694 -11615 -28395 -35897 -54030 -38506 -2427 -4252 -21790 -21704 23552 5382 -30279 -49119
21337 -49119 -52753 -23130 8934 10182 20405 16377 567 -11455 -12102 -15210 -23845 -48907 -46110
21324 -46110 -101774 -124011 -102331 -70308 -48489 -47689 -7733 16162 -6933 -17476 -31866 -48137
21312 -48137 -51385 -4075 29512 14433 6546 44556 28783 3345 21712 8681 -19720 -5444
21300 -5444 4909 -37508 -28886 -29183 -12046 79197 79805 50238 57575 23602 -13610 -44814 -38341
21287 -38341 -389 35272 31332 55774 66469 7408 -39860 -35456 -56027 -29671 -41964 -27375
21275 -27375 -48635 -55045 -25871 -55889 -91577 -123300 -81567 -55135 15124 63489 10233 -2398
21263 -2398 37090 42719 11812 -28735 -35392 -30414 2640 21369 19350 76100 48913 15804 -10307
21250 -10307 -2951 59021 83482 51513 55390 49667 -33636 -30490 -56209 -4704 31515 15372
21238 15372 -19273 19322 3582 -4137 981 -27503 -76182 -59034 -20700 -16709 -20222 -22014 16656
21225 16656 49223 15040 -15930 -28186 -22420 -69673 -8660 34070 -19429 -87312 -107343 -88791
21213 -88791 -71870 -87402 -99456 -101612 -69500 -84086 -60433 -53032 -45859 9059 5271 29945
21201 29945 62754 30697 -66099 -96579 -81283 -45891 -41391 -37817 -57554 -77296 -74154 -76381
21189 -76381 -46982 -29193 9025 -26353 -33819 -9339 -23311 -25224 -71895 -49715 2850 -8517
21177 -8517 -27484 -49236 -60364 -7346 79882 56628 1255 -38485 -35543 -90823 -79092 -606
21165 -606 48181 64148 31191 -48613 -62248 -48984 -78469 -91284 -94054 -77031 -27651 -3942
21153 -3942 -67607 -134420 -135626 -82721 -26313 -23149 -74962 -38676 -21744 24069 -3199 -313
21141 -313 25285 49955 11577 -14780 -20487 31842 54254 49989 73173 64703 68722 69746 56108
21128 56108 8688 -8193 3086 -23259 -15398 -4367 9912 29770 18406 35947 86521 93623
21116 93623 45112 -3943 3792 48558 41911 45610 83558 77337 54725 -832 -21390 -13766 7883
21103 7883 -10973 -58710 -19902 31109 38780 52951 68699 53842 -10338 -40194 -16828 -8305
21091 -8305 -30488 -18147 -41566 -27924 -30855 -12346 -33989 -16797 -38453 -56302 -34644 -37874
21079 -37874 -68383 -29676 8628 129181 171610 114539 43265 14909 59668 77941 83721 78062
21067 78062 35672 -2461 -20236 -35283 -41639 -35 11436 -13180 -34326 -6117 -8975 10577
21055 10577 18568 4598 12019 -20498 -67004 -62995 -51676 -38006 9867 39683 42306 14145
21043 14145 37490 -12476 -14221 -4727 57288 44719 12299 1265 2789 13589 -3413 -6105
21031 -6105 -41584 -61234 -1262 29273 -6198 -8495 -36279 -42410 -29979 -8028 -3898 -15353
21019 -15353 12713 20128 40076 26072 -9882 -43042 -46479 3580 -21118 -73336 -18267 30725
21007 30725 13799 10303 -22832 -111413 -114689 -120635 -128639 -83508 -44829 -55766 -75376 -42248
20995 -42248 -31261 -20403 -339 -31030 -13053 -49696 -70901 -43410 2237 18815 -7393 -52836
20983 -52836 -66624 19298 42017 53219 17108 -26967 1043 24261 29437 43682 63774 66844
20971 66844 75966 55339 53588 38258 50087 66654 61253 42491 1204 35588 69822 95852
20959 95852 -7157 -61612 -26164 9884 76727 45399 -9274 18773 60719 73087 37369
20948 37369 42422 83626 73255 40849 19231 3995 -65300 -22388 17203 11357 10267 -26858
20936 -26858 18659 7399 12531 41008 -7578 -33783 -9198 -2734 25023 32394 -3637 17990
20924 17990 -7321 -15176 -565 16956 59251 42067 -14614 -40031 -28152 14773 35125 40492
20912 40492 31898 19430 13145 -37237 -40334 -47815 -26059 -42060 -36981 -17899 -27669 -15251 8725
20899 8725 40473 43821 -4580 -43389 -61529 -62006 -18815 -35668 -19743 -67329 -70673 -53974 -34846
20886 -34846 -14019 -30907 -4004 20938 -1833 -43907 -63358 -59238 -67607 -69438 7684 12021
20874 12021 -52406 -81595 -77723 -75564 -90133 -33959 -16245 -5903 33574 64342 54290 28720
20862 28720 10697 29210 -12569 37604 68018 39794 35086 -27473 -41262 -24750 20913 28689
20850 28689 -7427 -29031 -66814 -40005 -26537 -7011 41078 24223 -4746 -31453 -6294 29383
20838 29383 47840 17539 -28019 -67495 -38323 -53045 -12514 60350 47531 27837 7347 12750
20826 12750 -40879 -37868 -20645 -51030 -31107 3821 55933 64924 126487 142191 89650 42806
20814 42806 24868 -24510 -199 32664 60771 32910 41021 37761 11070 -12580 16515 54208
20802 54208 52752 59057 2437 -13847 14032 31861 30438 -6084 11523 7042 22777 54906
20790 54906 68392 53226 26822 12231 49190 97983 81317 29047 -36937 -64806 -51882 -42036
20778 -42036 9699 21314 -27753 -32741 -40093 -9584 -27637 -64860 -51749 -28865 -3232 8204
20766 8204 4698 23020 50732 2660 -6807 -22161 -35447 -44628 -51797 -67471 -21179 45379 51298
20753 51298 70198 41038 51136 54053 59785 77066 44846 7306 -8054 -3062 18121 53654
20741 53654 93409 54648 27653 5084 460 60787 116254 131489 115361 113558 60076 20795
20729 20795 -24422 -7166 7358 15238 -50 -31836 -43429 -1193 14931 28094 47078 59032
20717 59032 42343 -5399 51501 112635 132301 87199 71528 44848 -24272 -57965 -8128 49159
20705 49159 55133 4800 -9352 -9502 -6666 -13852 7922 6123 11166 25271 4802 9514 -50645
20692 -50645 -58178 -47388 -65797 -106914 -96902 -18349 34740 2229 -38534 -50816 -10705 21617
20680 21617 13586 11056 -15829 -88812 -67587 -31787 -16765 -42868 -65859 -30293 -54509 -119424
20668 -119424 -85622 2127 25196 25247 28913 28265 42239 33151 -25676 -63709 -63874 -101710 -93282
20655 -93282 -45746 -16675 -17636 -16304 -399 -6518 -62641 -87336 -52621 -23404 15705 32273
20643 32273 89068 101475 66900 19448 17064 52613 25135 23759 48130 77689 26589 -25876
20631 -25876 -35287 9365 -24671 -5002 10170 50963 112907 134063 119267 167871 310296 399904
20619 399904 551823 681466 687379 617165 585575 685446 799045 924764 1052384 1137979 1076387
20608 1076387 932546 791770 730595 749436 873650 985402 1017184 985086 922522 802717
20598 802717 755742 725539 656409 570763 550505 601439 671381 660646 584466 559343 536966
20587 536966 519226 539566 454688 353140 228716 192968 191138 139483 130784 118289 132953
20576 132953 130211 92893 91594 119715 127416 91194 31013 -1589 10430 36359 4037 -59773
20564 -59773 -22940 1481 13835 42957 17112 -21266 -46391 -36749 -31096 -36278 8669 32291
20552 32291 60075 55412 72764 62296 64656 26679 19784 -25856 -27919 10792 45380 6987
20540 6987 -16791 30438 72130 57734 42203 60532 66824 56222 49758 81918 125879 74264
20528 74264 71437 47358 31928 39306 46435 20401 13080 45799 19454 3415 5690 -20796 -6094
20515 -6094 421 9111 -12709 -10097 -50225 -77557 -62019 -52098 -33829 22400 95665 69969 33613
20502 33613 -41603 -35065 -4600 -9810 -813 6989 27656 96955 92414 91389 80599 38383 20178
20489 20178 16317 -17116 -22782 -18839 14771 52158 88821 105958 80985 75395 109688 127270
20477 127270 149564 134413 120999 160383 160242 178743 156525 176537 225165 233534 201565 239698
20465 239698 277800 391621 447340 504539 650385 827942 910341 909556 910554 884659 945910 1043834
20453 1043834 1027224 967356 963954 1034834 1040890 977725 898431 797654 780802 841525 731095
20442 731095 608432 488675 339973 240621 194630 193915 171429 87784 73520 59458 109625
20431 109625 126696 106644 142857 211175 206681 145083 139508 130704 157210 130499 99079 97315
20419 97315 76184 91189 92769 108313 92016 91855 117679 108211 111269 132891 154730 177940 187902
20406 187902 153782 119039 71869 33551 99797 95501 72421 56988 67489 94730 78206 73411
20394 73411 23340 -800 40376 20404 -1596 -36782 -49945 -2900 27053 21921 -18066 -2394
20382 -2394 -2711 5732 -7760 439 47357 67334 47151 20203 21432 66001 97546 99211 103831
20369 103831 99686 123864 105334 94566 87380 65437 103416 99037 62201 36378 61683 107654
20357 107654 154065 143410 148140 122440 88611 52787 84299 156648 193893 165085 146032 98117
20345 98117 76868 73845 88945 117993 161686 182676 132842 124231 130245 116399 122982 165228
20333 165228 142038 106679 103055 132365 108621 82945 55865 85221 91637 76487 70810 74793
20321 74793 64025 81437 144553 144386 131281 138407 159867 153298 188957 197396 218962 227640 195596
20308 195596 175616 167176 204357 231043 272341 279003 251151 195322 220720 218425 156363 180419
20296 180419 288962 307391 300978 289079 263900 242501 306218 348800 407030 455444 520209
20285 520209 535722 554525 499875 414847 377922 393106 483461 555499 589288 643551 625687
20274 625687 446067 265891 118629 66422 100636 80638 75625 43305 -20709 -101535 -174499
20263 -174499 -189948 -194272 -180987 -149769 -161380 -159076 -127871 -88382 -52947 -25906 -20629 -2035
20251 -2035 -18451 -28047 10873 43086 32968 21638 6375 25770 -60084 -38602 -34824 -33101
20239 -33101 24496 85663 41806 69295 66004 41583 55423 50325 42576 31431 11757 49498
20227 49498 56896 105821 153626 100847 100476 139391 104066 88913 72113 46203 23014 74654
20215 74654 111830 160200 140743 110208 116152 137920 90742 106563 118488 121331 79817 75156
20203 75156 40162 84961 155362 216334 225727 225169 140753 90292 135046 155806 137313 109392
20191 109392 93213 174208 239949 217280 186480 191120 216174 227032 246579 223138 246197 277303
20179 277303 257679 224151 235796 251843 261850 271537 302867 312129 263667 265582 269985 274397
20167 274397 230546 210434 251001 263778 289311 295522 325125 360359 405947 371898 372820 356574
20155 356574 369749 399002 407309 397961 453286 477873 447785 496357 538822 589745 638702 719048
20143 719048 778859 732234 700718 731976 770459 850357 883836 880275 889918 950189 1032252 1088891
20131 1088891 1168471 1235114 1290234 1379758 1455558 1493026 1574942 1692675 1808805 1933140 2069731
20120 2069731 2219739 2399957 2663269 3024341 3410252 3860502 4277907 4566717 4809727
20111 4809727 5166577 5688149 6361577 7061231 7862070 8754871 9551508 10375339 11519260
20102 11519260 13029516 15020215 17652790 20840146 24844640 30466810 38820215 51383412
20094 51383412 69378200 92578764 111126331 111106555 104807861 100505034 103497408 119497919
20086 119497919 149084131 184419486 194908099 171259983 142153018 114162681 96271280
20079 96271280 93218460 101818923 109709372 99045346 79931149 60201960 42107832
20072 42107832 29351002 21686464 17076587 14079213 11905634 10323202 9167832 8338494
20064 8338494 7756792 7136626 6542124 6001704 5526987 5033684 4580023 4253566 3997900
20055 3997900 3725866 3403334 3031623 2719182 2431422 2171305 1965622 1832063 1707429
20046 1707429 1596273 1536012 1502055 1440109 1402915 1327643 1285758 1299738 1208237 1077158 1086040
20035 1086040 1110072 1065735 1008315 1043775 1100155 1121442 1188384 1244396 1247616 1291860 1305063
20024 1305063 1359863 1334495 1319460 1445593 1502612 1470667 1397790 1330841 1238445 1154135 1053648
20013 1053648 989144 944600 906110 882732 908012 934805 873546 754816 691804 649173 623050
20002 623050 547026 530871 555103 514157 467658 450805 441290 392503 358318 356327 381180 355488
19990 355488 370629 345066 325775 319088 351171 372633 361823 311231 281900 321142 336748 322409
19978 322409 296378 315204 333056 408303 462184 513773 515915 555754 654876 761361 842436
19967 842436 850415 889783 959190 1113409 1252536 1337385 1373557 1316987 1186493 1078192 969195
19956 969195 888649 820998 762560 769815 776686 796942 783355 656123 572071 518684 476917 406307
19944 406307 366679 350968 348663 382162 385406 367091 313694 273968 235917 207395 229369 208305
19932 208305 175670 147584 90811 62915 88038 171959 195443 200120 244851 252674 250770 257285
19920 257285 299210 298627 263368 238938 250634 264532 294388 313257 292424 300621 368471 368197
19908 368197 348538 383294 366075 342931 306675 230394 119774 110870 116750 84671 99103 141377
19896 141377 60121 -117333 -315764 -457652 -468663 -469375 -347247 -291771 -291862 -372184 -425686 -411339
19884 -411339 -371757 -343489 -286988 -179211 -89218 -110676 -131132 -108735 -96155 -121537 -112511
19873 -112511 -84288 -52578 -9903 13687 -45099 -72541 -57778 -51628 -31135 -79458 -50733 5738
19861 5738 24748 4765 -59847 -58641 -46816 -47369 -25221 8007 35695 54836 72817 65206 66601
19848 66601 106835 119132 82383 55605 45760 23586 10922 85488 126756 109928 75321 59383
19836 59383 101735 131870 138189 121349 114342 113276 87024 87005 76541 87982 130014 124155 100184
19823 100184 86044 84480 100886 36470 -7724 67175 117006 100710 100572 127320 80721 59839
19811 59839 68015 67345 109030 121768 124087 98226 72426 85273 65341 63518 105125 154528 175303
19798 175303 153328 149504 149568 219890 211972 167763 114361 82192 73964 41991 48452 67606 99694
19785 99694 123540 154321 173776 158699 152822 163601 170774 185365 167219 148302 140760 145175
19773 145175 167574 186079 193993 205108 147979 150869 128957 113720 150004 166364 145001 180168
19761 180168 185042 145643 98041 85864 36905 18086 14299 30948 39512 105527 114493 69777
19749 69777 26984 -1079 -44829 -43341 -10936 27144 71218 92743 105265 89869 163841 161889
19737 161889 125672 108581 61879 66021 18662 61732 93933 92947 112225 154242 160020 88980
19725 88980 103594 141967 156970 243794 309474 382034 519451 664703 707338 683744 634643
19714 634643 589579 540733 472692 441763 478478 530057 633788 660570 597826 565056 478036
19703 478036 373714 314091 275696 190445 160427 183827 242492 275909 256654 293363 271907
19692 271907 275056 253030 306325 308249 299723 276703 299505 331017 311322 307369 326991 379090
19680 379090 385806 402865 416450 385032 352157 363070 373774 395861 461476 468063 491434 570370
19668 570370 628967 641524 630849 699702 764247 889203 1081913 1347032 1516682 1659940
19658 1659940 1762396 1846807 1873716 1777510 1527173 1230225 1012966 948705 1035101 1181941
19648 1181941 1230343 1098278 798347 391988 -3403 -263231 -373756 -335833 -220527 -90247
19638 -90247 -11817 -6736 35426 135671 260184 351686 353868 364056 306744 250927 251504 271190
19626 271190 333345 414319 543111 624202 595396 511224 433008 369202 268889 186441 184480
19615 184480 197954 227450 255287 286249 278633 238201 192430 183097 189254 221917 202449 145610
19603 145610 103690 137305 156970 172174 197173 223057 251708 265337 213131 211629 230099 218458
19591 218458 262524 242910 251692 261672 358420 384800 414223 485682 498362 533045 580057 592976
19579 592976 712364 848767 933139 1104170 1247783 1234853 1158035 1040575 906231 839050
19569 839050 851680 912752 1042120 1166794 1282604 1378760 1302709 1220789 1188125 1144930 1139153
19558 1139153 1168782 1126027 1133808 1227378 1445462 1574452 1546290 1428187 1367521 1278851 1226435
19547 1226435 1251642 1240752 1196428 1062928 947530 861146 817134 826356 844210 856362 835247
19536 835247 820251 791166 785359 826401 911125 976731 1069738 1107999 1132619 1205250 1319639
19525 1319639 1461722 1618687 1874642 2099797 2152176 2084614 2067823 1971895 1917739 1931148
19515 1931148 1956906 2000750 2056782 2121432 2226586 2305229 2405122 2537436 2600898 2637046 2727998
19504 2727998 2910068 3118481 3299369 3459892 3722556 4057229 4407449 4829379 5294960
19495 5294960 5753629 6126255 6433369 6803771 7344946 8041233 8773400 9548511 10306755
19486 10306755 11137345 11921543 12645422 13554189 14864674 16560572 18548380 20773709 23358604
19477 23358604 26295689 29771934 34231058 40040129 47598492 57365495 69884618 86712435
19469 86712435 110679921 146346128 198389703 269249504 338999896 370199752 363716641
19462 363716641 326312273 287264296 269416508 282481536 323507299 352487998 346934286
19455 346934286 299677240 230158101 165714967 113696777 78509591 57273340 44218324
19448 44218324 35729069 29965879 25849002 22769597 20353596 18179948 16173684 14505703
19440 14505703 13132728 12027217 11190876 10470556 9744500 9056583 8343513 7721360 7212043
19431 7212043 6775553 6537063 6553836 6623376 6437900 5953734 5429958 4977085 4693100 4489819
19421 4489819 4212181 3777470 3425562 3132153 2877656 2716552 2678078 2588435 2493757 2426349
19411 2426349 2363662 2297308 2300233 2384364 2476235 2592729 2617530 2445757 2249132 2120640 2023151
19400 2023151 2001904 2040726 2081082 2091955 2094348 2087707 2009664 1990807 2049444 2114451 2176931 2292414
19388 2292414 2457403 2440829 2300355 2174764 2097384 2063994 2023679 1864132 1670211 1460685
19378 1460685 1311576 1219402 1171579 1150916 1061718 982815 1006344 1086853 1145018 1120931 1088850
19367 1088850 1004669 921015 893381 913074 959339 898590 780703 692813 625448 588999 561421
19356 561421 557986 587784 578287 575043 590431 551845 542469 555980 551760 559533 527057 473423 525999
19343 525999 631676 713031 801682 928600 1007005 1077266 1127962 1168434 1194580 1188304 1178246
19332 1178246 1227696 1282909 1365210 1401241 1356387 1260626 1169159 1153383 1130239 1023975 903218
19321 903218 798515 669273 574191 568059 561900 574200 510570 411366 405641 468201 480352 449950
19309 449950 419310 397228 373166 393150 451242 439531 394359 338737 343848 328775 292109 311551
19297 311551 381929 417029 418345 451260 443938 439375 487779 495819 566066 543985 531617 537248
19285 537248 525268 547407 589144 551026 572480 652599 696982 682216 617368 459474 136338
19274 136338 -182435 -445706 -502301 -416701 -304969 -271174 -395589 -603525 -867677 -979506
19264 -979506 -931095 -841266 -718168 -630525 -553221 -412769 -301042 -275056 -263783 -230314 -175626
19253 -175626 -110837 -73824 -68632 -71327 -81443 -80220 -70244 -25579 -1940 73216 93732 78328
19241 78328 105256 122621 138978 147287 123632 87111 99073 88462 88058 87779 88489 87629 91485 65040
19227 65040 42537 13689 17303 23373 13646 -4540 14756 84128 116508 130909 139285 146930 203382
19214 203382 246199 253432 268252 261274 199374 189994 217335 222917 238409 196624 92717 53475
19202 53475 48266 37260 -8933 -32994 -45955 -14891 12634 14044 26874 58851 62984 59890
19190 59890 74443 66195 42286 39847 70684 20443 -22331 -11781 17280 21273 67745 110454
19178 110454 124215 104185 134786 132148 73519 35412 29265 -18967 -24012 7528 -5684 -26720
19166 -26720 -14953 30855 126152 145206 86975 40528 36001 82147 55630 77197 110807 100596
19154 100596 61297 41648 9976 -43694 -74019 -57428 -69664 -79908 -82306 -99601 -90733 -64844
19142 -64844 -48882 -95226 -91931 -34324 -9236 17342 -9544 -40295 -30240 -44335 -27874 -50924
19130 -50924 -62669 -42986 -50357 -61363 -78746 -79204 -87832 -63727 -57353 -18371 -68377 -117144 -114509
19117 -114509 -117459 -116156 -108626 -62882 -45384 -60668 -57069 -37865 12207 18505 5198 6287 -6987
19104 -6987 -23328 -22219 -9509 34451 34612 2640 -20394 38367 21944 -16689 -19892 -17503 -20482
19091 -20482 -23778 519 -1347 -11203 -14208 33675 53474 66102 97139 99316 54642 9046 -62881
19078 -62881 -59585 -13261 -10291 -13532 -3116 23484 -1024 -26556 -29763 -48345 -43880 -52939 -5868
19065 -5868 76959 83350 4722 -18019 33573 74581 27543 11931 15579 -4724 315 29113
19053 29113 60615 66524 17126 -25574 -3951 30358 35313 17598 55292 61384 18424 -24978
19041 -24978 -25954 -67315 -26497 20243 28425 56561 55912 49820 67466 63256 60459 18717 -10026
19028 -10026 -10744 -26515 -24996 -22736 -17889 -22286 -27855 1351 13778 2756 -7874 -13447 49962
19015 49962 69145 11224 6225 -13251 38021 32017 -39553 -46213 -33926 -14647 -16409 22430
19003 22430 53947 79009 94367 99597 58200 47008 55812 89546 76286 77861 80511 87256 104279
18990 104279 122216 65759 39510 13995 45065 14749 609 65126 95703 50257 50709 102492
18978 102492 128270 104786 86268 84068 96437 128490 209120 352353 506650 563666 585899
18967 585899 562368 474533 354875 318113 292270 344767 383922 477979 548538 537776 513350
18956 513350 464704 406088 394817 392089 399346 449466 436408 486678 562934 654247 696490 577449
18944 577449 468733 423875 457379 439615 375761 300307 243968 191725 123947 82779 106378
18933 106378 155267 162009 117664 113736 112594 130791 117637 93082 112980 149172 88521 34826
18921 34826 48595 57395 69600 90707 160905 213384 169867 142545 244767 342365 407960 418178
18909 418178 328626 243069 159777 164128 192952 268234 388236 442176 482805 438167 349121
18898 349121 354734 338052 354880 392446 380312 375399 457713 489314 540075 565674 557250 493949
18886 493949 436037 395401 323289 276014 204437 133858 77926 64973 45783 1810 22490
18875 22490 6882 -14612 -3418 4144 52014 113123 109692 30346 -2599 -21244 -68647 -49814
18863 -49814 -49055 -74606 -53939 -31319 21589 35609 50602 67003 42414 -39622 -57065 2965
18851 2965 21319 27491 29477 64469 95504 46224 -14045 22 67585 70424 46437 17450
18839 17450 46182 54140 42880 77041 102943 145027 156040 175573 184171 186069 209617 208843 260224
18826 260224 300493 344146 408912 422693 379261 358494 269893 245432 257983 283345 320889
18815 320889 365692 425312 448214 374820 347798 354638 319380 322177 248891 105613 92160 97665
18803 97665 96008 115766 100954 64858 50554 -11940 533 9661 -7401 -11337 31637 13279
18791 13279 47446 67103 -21236 -47688 -21585 -18932 -20524 -15037 4771 33523 37441 29949 32745
18778 32745 81740 103450 49900 58992 85508 151793 200081 170221 164398 240347 362168 456675
18766 456675 555890 588384 641444 673014 695223 625805 552202 484357 403362 318345 353792
18755 353792 389298 348352 270411 198396 136719 113734 74869 51531 45167 86117 73904 39727
18743 39727 10830 13868 24060 13080 -56068 -102805 -33865 31473 82603 114541 88060 15162
18731 15162 8881 -16012 -3455 -37260 -26908 -4197 53846 67732 36160 17941 36283 40766
18719 40766 5106 -42601 -65691 -30877 2018 -33756 -36511 -14581 10283 51811 79197 50498
18707 50498 94644 100731 49501 17504 -8457 -46190 -85380 -49498 6045 7674 19733 26889
18695 26889 -6484 -18736 -21731 -6079 -26777 -114876 -130085 -77192 -33983 -49020 -64490 -50391
18683 -50391 -42781 18037 3147 30741 68727 61602 114803 87690 60939 49740 66110 6324
18671 6324 19208 11525 -26203 -26624 -4579 -36149 -46851 -25919 9045 33737 76783 149561
18659 149561 219827 216844 188653 158790 75369 57276 38522 -8407 21307 89556 134112 120908
18647 120908 110618 114338 117315 50925 59084 22700 42576 41085 74275 61411 6809 11214
18635 11214 -3279 -3132 4539 43225 4678 -27584 -4698 15506 31309 68715 80767 83722
18623 83722 66573 40545 23950 -19623 -21810 -9461 42702 56188 51883 63011 22237 24425
18611 24425 14204 29720 88644 48828 13379 23636 45251 45251 72885 72148 86219 72594 69536
18598 69536 53214 53609 63567 63865 140425 185133 101269 36624 41673 52994 50099 25653 68866
18585 68866 100685 48886 30276 47503 37187 -27076 -15133 -792 -1072 30930 12854 6059
18573 6059 6049 -23776 -41306 -17545 4076 -6308 20707 74312 67157 84848 59368 18007 34728
18560 34728 10992 11712 53904 91635 62129 32675 47353 69665 104175 72863 36560 11199
18548 11199 -44590 -67920 -86116 -46796 -35397 -31128 -15494 10889 892 -28169 -42566 1956
18536 1956 -19986 596 20933 -9804 -17426 39077 66739 48614 45659 94464 89508 48654
18524 48654 26731 -5647 -24656 -2759 -5377 4426 60407 32896 -9634 -57680 -31596 14981
18512 14981 49091 60562 92647 43794 34622 69059 48709 89941 101103 84464 118966 115639
18500 115639 90049 82085 63453 45750 36672 67878 69818 56712 87118 85022 49533 23293
18488 23293 -31476 -20073 -26874 -21379 20322 4404 -26731 -476 69893 75310 7607 -40153
18476 -40153 8825 33451 20843 -8234 45673 57927 -19753 -31675 15905 32270 70261 71401
18464 71401 14056 -17628 14773 -5827 -51112 -60553 -50453 -65735 -37247 -7432 -23316 -45904
18452 -45904 -12322 -5322 37400 84766 14134 18268 32258 60402 59093 39696 11722 28317
18440 28317 18893 48277 47426 45269 49844 24468 15058 6295 5424 42561 86906 87788 60692 6035
18426 6035 -7576 -42882 -47594 -22964 7138 -43843 -67518 -35354 -19615 7641 62224 83134
18414 83134 21354 35430 65000 50209 75954 75486 -14214 -48020 -2650 15278 27191 22884
18402 22884 5340 5442 -8895 -28881 -8242 42554 46248 39907 17622 -26978 -38390 -14790
18390 -14790 -21463 3415 769 -10977 -22429 -4574 11953 -4751 -41656 -27477 -6402 -58082
18378 -58082 -72277 -24777 45540 52292 13051 -13803 39083 80671 65984 58807 54233 45131
18366 45131 46244 67784 57570 18105 -16508 13351 66842 78018 118302 127888 119429 106347
18354 106347 81698 58105 63809 65730 91263 71970 11636 -27489 -4752 -39783 -62681 -67776
18342 -67776 -62557 -76868 -87924 -69396 -22043 34587 86877 123634 151518 150852 161854 158050
18330 158050 141327 94154 24197 -27704 -26812 13908 59179 51053 26625 43081 52413 55661
18318 55661 41212 804 -54082 -9283 62971 68195 34816 65247 97981 118007 62037 76603
18306 76603 105534 99005 68816 75905 74683 103250 150112 215941 248873 246226 277833 328362
18294 328362 319486 190797 46376 -81183 -201331 -252680 -234390 -153179 -104139 -100391 -90417
18283 -90417 -54730 -57764 -94151 -129237 -154907 -96709 -55208 -44691 -47478 -43876 -48179 -44846 -77638
18270 -77638 -65411 2035 62749 20301 10842 18442 33887 66614 46877 49386 45036 47476 64595
18257 64595 113187 132752 95210 95536 77071 74082 101160 137987 135345 160120 184352 138480
18245 138480 111233 82043 41488 58723 96431 106660 60230 -3337 -24617 -35159 -12023
18234 -12023 15128 8835 27547 17838 -24104 22110 22059 1873 13254 38353 48733 52632 10185
18221 10185 3044 4318 38610 71081 55987 954 -34361 -57220 -70408 -44552 -17650 -4467
18209 -4467 22338 23032 26997 82139 38114 -3040 20635 32873 50302 41652 1975 47997 69676
18196 69676 95861 95640 112614 97361 124233 145082 154404 106523 57864 21864 1587 -36785
18184 -36785 -44961 -29718 -16195 25793 55992 126642 93784 62881 77937 121236 158020 123412
18172 123412 89080 77108 127783 124154 100590 84185 106558 109441 113553 144037 171731 229211
18160 229211 266115 244627 249491 270084 211196 188560 210434 230162 247787 235057 290358 310303
18148 310303 313442 337921 349160 340659 357856 407469 428042 415464 430634 468594 518893 498356
18136 498356 533846 611138 678597 697718 731670 782570 814192 797741 855158 1015805 1132656
18125 1132656 1263985 1378859 1546874 1724623 1937826 2217960 2571616 2985433 3493766
18116 3493766 4224995 5066084 6034396 7287350 9005071 11269475 14173744 18318183 24777049
18107 24777049 34982570 50230616 71231685 90918080 86157665 69056805 50638336
18100 50638336 32727843 20234866 13155590 9209642 6791666 5203642 4147565 3411756
18092 3411756 2859867 2422854 2091487 1818087 1622993 1426947 1322903 1211236 1094483
18083 1094483 948623 837667 795043 792121 754199 689086 608570 519042 493242 425142 414875
18072 414875 421369 376594 366811 336964 324520 354845 351148 290541 265789 266192 269565 306160 271346
18059 271346 256045 272736 222789 173958 181732 227345 207992 146430 87958 68680 58793 98576
18047 98576 181936 140558 84612 87425 90149 54743 63452 71922 72476 108658 158492 159766 130425
18034 130425 133662 145774 157987 184588 201261 189309 135545 127543 42535 11932 -3909 2546
18022 2546 43685 71431 76128 89909 100230 133855 125705 103997 96666 88376 55971 47009 54646
18009 54646 71109 35658 -3465 -6492 -19323 9697 37885 79676 76028 100263 127395 117525
17997 117525 47562 42488 73196 84179 44849 46428 83562 101091 81786 29957 50452 66598
17985 66598 122073 153096 152601 87103 92459 68317 28155 14553 39210 27859 66211 92282
17973 92282 85790 73531 28854 12654 14447 43065 66859 94201 102294 63027 4770 -4638
17961 -4638 11953 44445 43698 49316 68248 97215 72435 41177 62307 80845 52386 34344
17949 34344 5125 24372 28700 30716 44765 70939 121836 112537 26161 24438 57841 127508
17937 127508 151623 134112 123459 128185 129050 127660 112379 138495 124273 104935 71106 26045
17925 26045 31065 64200 122820 111615 89162 104846 163984 161008 141038 97874 21898 -72892
17913 -72892 -175841 -189818 -155561 -130607 -149025 -128364 -79183 -56874 -82299 -25599 -9763
17902 -9763 -85395 -95547 -40691 26102 39896 -11879 -74256 -100804 -94797 -44013 21154 63303
17890 63303 59911 6604 -26686 -64543 -60908 -25669 -34610 -46807 -61810 -67638 -34311 -9761
17878 -9761 37180 53349 17650 16302 36147 47230 32485 48742 20204 -33339 -50113 -70748
17866 -70748 -107361 -156094 -135617 -59480 18167 36281 25386 56211 62229 1705 31501 72922
17854 72922 47543 14744 27113 26265 10586 18588 31327 49383 45530 11660 -7365 -8547 -26443
17841 -26443 -24692 -40700 -52257 -29669 -202 8145 -505 -57199 -52620 -20359 35827 7404
17829 7404 -7059 41056 74125 84327 73948 45776 9288 -13603 24507 -17751 -84735 -53079
17817 -53079 -28517 -13644 43064 65415 48990 11765 -17828 -57215 -16375 11058 18285 12276
17805 12276 76030 115867 92209 34852 26465 37064 39177 26510 -2310 -9503 22375 11747
17793 11747 10003 38327 53867 -12861 -49070 -26009 14109 20916 17702 4391 -40846 -38279
17781 -38279 -42672 11655 31693 197 37254 55871 25065 27558 -46466 -59894 -15473 19151
17769 19151 -19417 -19299 -14160 13143 16375 55507 1893 -16781 -7579 -29773 -37503 -65120 -25147
17756 -25147 -40806 -27498 -39723 -58818 -17102 -4383 -26199 -53383 -70777 -81597 -68762 -21986
17744 -21986 16713 -35489 -32456 13696 17629 17676 35069 -7901 -22078 -15232 -6855 -1779 -1996 17648
17730 17648 22629 25834 22272 64072 80312 70434 42300 -5259 -49198 -54933 -43831 -25347 851
17717 851 -9579 -23943 -36931 -6722 -18537 -61613 -79304 -138682 -128247 -120406 -56374 -3662
17705 -3662 13280 5796 -35347 -13469 44082 89189 52526 67759 48610 -440 17113 30620
17693 30620 -5790 -35856 -24908 5992 -2473 9924 29937 -3686 -41238 -44341 -55097 -48502
17681 -48502 -67734 -49447 -8332 32628 62267 63041 -10268 -23815 -50249 -42560 -12219 -11719 -13482
17668 -13482 -23375 162 68944 71953 9086 -36486 -37855 -69999 -42619 -36393 -61843 -45244
17656 -45244 -44231 -38809 -36184 -61905 -67057 5850 -11436 -37828 -16806 -35153 -41568 -35027 -19829
17643 -19829 -75627 -97838 -76540 -58279 -79528 -63440 -60451 -60665 -96116 -79481 -15549 10056
17631 10056 17958 15014 62451 100713 129162 104170 59146 7938 -6152 1160 16847 14450
17619 14450 2127 -20377 -50281 -34819 -44773 -32058 7465 26988 10738 -36844 -94199 -92327
17607 -92327 -32522 -26692 -30186 -22879 -14541 5468 -53239 -81753 -65269 -65428 -68098 -130456 -200592
17594 -200592 -183664 -125466 -61790 -30702 -35723 -40698 -7212 31196 48910 38485 -13995 -53595
17582 -53595 -55764 -49541 -25716 -7922 3327 39144 15163 22537 43650 20651 18706 -17941
17570 -17941 -48602 -56905 -88956 -38056 4375 -35737 -79880 -110209 -92342 -97668 -137187 -154685
17558 -154685 -101088 -39587 4739 12964 5672 43791 41154 14579 -28725 -74654 -88013 -79770
17546 -79770 -93931 -88070 -65267 2125 -17949 -15591 -19894 -45527 -65060 -97810 -96327 -76355
17534 -76355 -29340 2731 -59094 -87190 -60129 -28119 -6872 -32014 -49839 -43124 -7494 26203
17522 26203 59555 17267 11272 -31143 -60667 -60112 -33901 10397 33189 58193 48881 30878
17510 30878 62054 37298 -9866 -33937 -26880 26655 73012 55649 11683 -24539 -82946 -77042
17498 -77042 -5778 58833 11441 14076 36947 46400 63518 21206 -28131 -24459 21372 21226 -33505
17485 -33505 3189 27863 19831 31947 -7839 -28064 -37433 -14386 -33122 -63999 -31791 26486
17473 26486 22334 32307 54165 20050 -43790 -53324 -62592 -38205 -45769 -54540 -25705 -18710 16196
17460 16196 -14755 -78398 -61608 -19150 -6263 27836 37773 34895 42505 4825 -30741 -59207
17448 -59207 -45675 9553 14863 -12246 12473 81616 113546 135993 204683 303180 399086 417496
17436 417496 382679 322629 210906 156117 106458 79867 62457 111639 112697 88101 69678
17425 69678 102907 118642 82137 -9443 -55497 -70312 -18044 -4292 9569 18765 -33550 -61730
17413 -61730 -75256 -107949 -71212 -3460 -13311 -50806 -76768 -103241 -60088 -46504 -57171 -4374
17401 -4374 38478 44894 6524 5992 -3640 -4189 -6457 38236 51024 32316 20959 5309 94025
17388 94025 103168 13375 -7859 40580 68588 60445 -928 32081 82629 92893 33664 -21083
17376 -21083 -23609 -61312 -49288 -18574 -18991 -1076 88761 107025 63851 23883 -38943 -31108
17364 -31108 -13448 -6865 -2345 20945 27406 3593 22907 61304 84503 85234 104123 117367 110560
17351 110560 11194 -16369 6599 13063 -29138 -94685 -135742 -96042 -38524 -22990 -17100 -32707
17339 -32707 -54843 -63283 -113900 -171122 -149462 -34994 24014 25795 -27323 -63788 -35040 1998
17327 1998 -7516 -3217 -2417 -34144 -50544 -34769 -19980 22691 22117 -22226 -14118 -42832 -93718
17314 -93718 -180035 -150022 -91899 -28364 -41050 -49835 -18810 12571 42011 34371 -14702 -19375
17302 -19375 13548 18774 23868 10113 -53892 -77064 -84535 -129089 -182112 -114179 -70699 -90762
17290 -90762 -75050 -54997 -10217 -1304 8149 29995 -11675 -33093 -21180 -37315 -73359 -101430
17278 -101430 -71872 -49108 -51833 -58305 -83080 -86936 -76716 -68611 -64874 -59954 -60955 -42654 147
17265 147 23813 -2878 2466 26859 -8527 -2458 4410 -11017 -32151 -60962 -74027 -35155 -7526
17252 -7526 -19371 -16653 27281 32538 63329 77652 99355 12909 -41597 -49916 12880 60912
17240 60912 31544 2379 21160 -5171 -14097 3317 -18693 -6782 -39958 -27392 17841 7201
17228 7201 -4672 -52294 -69054 -74661 -123377 -155493 -130026 -110374 -43465 -14906 -28782 -10581
17216 -10581 42619 19338 -59504 -60507 -39247 -9019 -1647 5470 24405 2780 -3187 -3196 -21954
17203 -21954 -12791 -9883 -24096 -29328 -29811 -30060 18731 25298 40816 -12000 -51491 -59914 -25141
17190 -25141 -7638 -29181 14995 12707 29181 20640 -46260 -60921 -68584 -50447 -38588 -42039
17178 -42039 -67041 -8420 13922 -30251 -38223 -45627 -73929 -63942 -63400 -38536 -40729 -51472 -12600
17165 -12600 -7198 -23013 -17611 33876 -5466 -37787 -19922 4201 10665 21974 35941 7521
17153 7521 24915 14076 -4966 17594 29594 16027 1363 -26437 -26833 -9988 -64885 -87417
17141 -87417 -62061 -41293 -33993 -2362 10683 67885 132151 98858 132148 100593 68454 57300
17129 57300 66129 38801 -26368 -77776 -107077 -117293 -57763 -11985 1176 -265 -1284 -12533
17117 -12533 -3530 63542 86097 72192 29067 -34266 -41349 -56758 -37874 13118 29720 10571
17105 10571 -60546 -82210 -71454 -60661 -71901 -50126 -13777 -33730 -51454 -21236 13851 -23316
17093 -23316 -41013 -7787 -13319 -14499 -3543 32640 63412 29813 19593 -15847 -27715 19713
17081 19713 51295 78487 58786 -4175 -27291 -49404 -36230 -37584 -30012 -8506 -4861 39393
17069 39393 45383 15173 -39203 -80716 -103073 -73407 -24430 53699 29602 -25806 -59291 -75544
17057 -75544 -95591 -82298 -89587 -113382 -61685 -53011 -76117 -64962 -32709 -36983 -69220 -45061
17045 -45061 -30415 -16614 34591 20613 -4506 -32464 -9227 51782 31613 -31206 43591 64562
17033 64562 78232 23321 -84063 -113981 -100219 -122548 -98678 -45013 -22828 -37406 -13388
17022 -13388 -30752 -40693 -50208 -45938 -52578 -31707 4060 12325 5426 37832 80823 70189 9209
17009 9209 -31680 -28626 11255 25724 28780 7132 -18040 -13827 36717 89993 82954 28452 40942
16996 40942 -5011 3005 28792 22251 12944 -21472 -42768 -24084 -55703 -125613 -92270 -76251
16984 -76251 -32216 -21 16594 39870 18292 -6102 2248 -30742 -5525 39151 12716 -36300
16972 -36300 -18366 -33085 -26734 -5951 -8848 -33868 -28577 -18379 -15199 -12503 -16783 -3750 -55521
16959 -55521 -45326 -8600 17487 11978 8944 35887 114676 113089 28751 -12551 -47848 -73717
16947 -73717 -79540 -36358 18576 68574 57938 12729 -16026 -21917 -42365 8706 154 -23387
16935 -23387 -67067 -84176 -100277 -70123 -67620 -55652 -55635 7773 68377 40180 10575 39577
16923 39577 9113 36194 49048 19022 -18836 -22883 1814 -23186 -44344 -43824 -46192 -22106
16911 -22106 -2057 -22353 -28273 -15663 -173 -14431 -6773 -17700 -43563 -74985 -113915 -114025
16899 -114025 -118849 -83308 -67015 -85030 -41148 -11412 -33541 -56677 -92828 -101052 -71616 -69951
16887 -69951 -44373 -31962 -40449 -35873 -13500 9686 -21947 -23432 22844 20929 -37209 -29470 -10284
16874 -10284 45963 24827 -40219 -45598 -19356 -9671 -33957 -45613 -28996 -32416 664 11053
16862 11053 20422 -7453 -13336 -39197 -35071 -29600 -6664 -14996 24768 20208 -15973 -26871 -2905
16849 -2905 11497 52973 39498 -9344 -24687 -17730 -19108 -53015 -69407 -58540 -87672 -66134
16837 -66134 -17153 -9877 -18458 -12031 22691 62285 31761 -60332 -57703 -11137 -8228 12285 54695
16824 54695 16565 9478 12181 -18078 -25886 -31019 -38024 -38218 -32982 -8949 11918 19438 25703 24584
16810 24584 11088 -18843 -32678 -23188 2138 -26867 -21209 -263 7952 23808 39757 29438
16798 29438 37655 574 -15837 -13584 -13215 -27099 -57973 -43658 -55088 -29868 20249 36256
16786 36256 35469 -6040 -66890 -81132 -71814 -41307 -51503 -53016 -11126 6901 15818 43431 40401
16773 40401 14521 28214 67926 85493 12846 -9735 34996 55055 36654 -47229 -102713 -98559
16761 -98559 -25925 20662 77145 134992 82277 65468 51325 32689 -456 -17595 -62808 -75118
16749 -75118 -36466 28687 25247 5597 1462 -25817 -10236 44494 75964 82544 86953 81362 14281
16736 14281 -35251 -102034 -87844 -71067 -46842 -53186 -27484 -44816 -71496 -47494 -28714 -50127
16724 -50127 -68179 -98378 -80579 -106772 -91931 -47835 -44812 -60582 -6572 52597 61560 60699
16712 60699 31451 62749 66462 38202 41382 5672 19901 25120 42912 75079 60614 53513
16700 53513 32803 -31115 -70430 -67442 -37852 -4970 22530 16155 -13978 -15041 -50082 -16153
16688 -16153 -46244 -65193 -20708 -36342 12764 29235 -49065 -88652 -101605 -62959 -20117 -21230
16676 -21230 8839 44448 20696 -2945 -411 6695 46387 50925 34703 -7882 -28847 -57659
16664 -57659 -61433 -24887 12933 51153 58862 82694 63737 29567 18322 26244 17983 -5563
16652 -5563 -37473 -30092 -14704 -24585 -23833 41962 58863 61313 7051 -44 -15401 -30152 -4515
16639 -4515 7214 13568 -22087 -49341 -30536 -13643 -9928 -31415 -32012 -66969 -64921 -79998 -125466
16626 -125466 -142213 -92157 -50982 -25697 -37056 -80080 -23357 -15718 -84282 -109902 -80281 -44164
16614 -44164 -55959 -79667 -73268 12568 6477 -23960 -28087 1355 -25471 -47914 -48213 -16233 -3192
16601 -3192 7283 14111 -5208 21868 72489 16733 -47849 -13990 -7056 -44321 -5733 38616
16589 38616 66554 37536 761 14182 5130 -237 28585 40107 10298 -26281 -49179 -64902
16577 -64902 -47859 -35602 -22669 16656 -8621 -16514 6445 12454 7999 -624 -12254 10469
16565 10469 29252 39852 43295 55108 -26509 -85112 -82965 -72887 -49989 -64371 -67601 -64417
16553 -64417 -46387 -20457 -49135 -102744 -80995 -65921 -96346 -77055 -37657 -66208 -95222 -108123
16541 -108123 -88750 -88125 -78183 -110491 -93587 -96049 -103487 -62343 8591 18944 -21616 352
16529 352 8000 -19764 -21200 7131 -13672 -42318 -56860 -63549 -25482 -14869 -8034 -17345 -26371
16516 -26371 -40350 -11967 4298 22254 -8019 -2812 34223 10249 37806 55311 32478 -36582
16504 -36582 -47815 -105954 -79395 -45885 -84909 -67297 -10879 -12338 -15342 -51 -33849 -107266
16492 -107266 -117697 -35788 7345 13690 37612 18547 10427 -46821 -71704 -88468 -101843 -28771
16480 -28771 -9849 -43158 -37237 -24108 -43560 -115006 -141198 -126065 -124529 -138030 -130094 -123436
16468 -123436 -71654 -74736 -87406 -41557 -7080 17712 -6085 8114 -14970 -55860 -56929 -16006
16456 -16006 6581 -26237 -85969 -109565 -92348 -93597 -117801 -71591 -49771 -39702 -44871 -62644
16444 -62644 -59219 -58824 -14135 12813 -14357 -822 37763 62135 47829 -2373 -28538 31015
16432 31015 15959 -70490 -88377 -62694 -74368 -66715 -66393 -36236 -4825 -9087 -7583 -4484 1758
16419 1758 6662 6303 23157 11740 -47562 -60608 -49076 -37287 -14136 -32080 -35862 -67120 -85527
16406 -85527 -105453 -58487 -26459 -49552 -88894 -44877 -25842 -37211 -31006 -7807 -18173 -95229
16394 -95229 -80539 -59052 -45990 -61114 -56880 9850 31035 31137 12526 8826 8609 3010 -5462
16381 -5462 -16549 -18110 -52286 -37933 -20623 4524 3347 -43931 -28051 -14991 -19745 -11900 33199
16368 33199 25934 1491 -6463 13905 15860 -29356 -40040 -49364 -78149 -67337 -31478 -8501
16356 -8501 -18531 -44262 -50089 -50142 -46468 -42221 -35332 -60824 -44500 -7697 -46985 -75443 -61898
16343 -61898 -19816 12342 27723 22052 30207 12825 2616 158 16063 -34320 -49180 -23882
16331 -23882 1130 1189 -16468 -43578 -50046 -26685 72927 115025 59937 24227 48067 43129 6787
16318 6787 -11185 41538 15372 -7643 -21470 -48402 -42900 -31403 -1904 29245 40497 21551
16306 21551 8838 -2281 -75862 -71928 -13083 8640 23741 -3202 -9727 -15508 -29408 -6738
16294 -6738 19460 -6682 -1295 -15698 -50148 -67368 -20993 31271 33073 -299 -51164 -43402
16282 -43402 -62806 -106998 -84050 -75605 -15851 48049 36188 2591 -7882 -12921 -46002 -42550
16270 -42550 -46656 -31458 -45916 -9994 13467 51274 52840 7999 -16505 -25238 -7286 26615
16258 26615 53055 45493 10811 -10074 2705 4541 6444 44884 32491 6852 -51701 -19840
16246 -19840 19233 -2831 8398 52252 42752 20320 -18096 7586 27435 23069 6473 -12719
16234 -12719 19145 -4812 -49460 -43803 -35469 -46360 -21077 18565 52993 33699 -3583 2966
16222 2966 -26685 -89054 -120876 -104136 -70260 -23424 -13882 3207 43040 18833 -1286 9393
16210 9393 10547 -31250 -31280 -28561 4840 6769 -8038 -33810 -32603 -20948 -24819 -7813 28252
16197 28252 9224 6077 9772 44931 33458 4607 -33251 -88265 -69373 -50531 -65495 -57028
16185 -57028 -57389 -32824 -2945 -583 10662 959 17219 -3318 -36201 -18244 -28964 -108783
16173 -108783 -136698 -95170 -57181 -50290 -59058 -70075 -55528 -1047 20894 40878 83298 54520
16161 54520 57755 16618 -8468 -14096 -1613 -15472 -68796 -120066 -135697 -56855 2752 2911
16149 2911 -6456 8298 7266 23866 -3989 -20323 -10680 1790 -54191 -35769 4683 59129
16137 59129 71798 56989 80150 62774 40284 26133 23228 34828 24077 -28064 -73196 -96662
16125 -96662 -48109 -2019 -30567 -45224 -46365 -32796 -24429 -49214 -27955 -937 8798 -57428
16113 -57428 -106157 -26378 32320 27172 23796 6264 -8030 -74844 -51337 14881 56089 28197
16101 28197 39695 42416 59620 56628 62454 46015 24882 15905 8469 53405 41060 47444 50337
16088 50337 44969 33791 43297 66756 35346 -34676 -42905 -11362 -34298 -30638 -21645 -2938 -12367
16075 -12367 -7268 28481 62400 52725 14869 -32538 -71317 -72903 -50327 -22777 -26525 20970
16063 20970 30179 73482 43044 3238 6187 26374 28678 8137 17312 81556 39357 10152
16051 10152 16723 -1279 -24157 -41464 -5387 38548 37433 70631 67091 60380 42264 34813 18939
16038 18939 3212 17278 10510 34135 38457 73129 72641 87611 43502 -7315 6637 46081
16026 46081 69028 15054 -33030 -29191 -22043 -18291 -48931 -40410 -44474 -49315 -72235 -147821 -82758
16013 -82758 -12995 -19005 -44171 -24809 -29951 -60149 -35525 -8243 -484 21329 37360 58921
16001 58921 22960 22193 -4272 -48817 -66417 -72070 -78205 -84094 -66791 -11224 16737 36938 30200
15988 30200 41195 43824 18322 -1472 18935 54204 36328 12878 -18544 -31978 -16439 -6850
15976 -6850 -14358 -8190 -57532 -74899 -10303 45417 88045 56041 3404 40768 38001 -16654
15964 -16654 -52683 -10384 61055 68737 56012 74522 76858 29588 -21584 -10456 34259 -38851
15952 -38851 -64074 -59170 -70369 -73404 -74230 -22281 -50113 -85569 -84879 -42943 -31141 -24136 -43394
15939 -43394 -50662 -92592 -110251 -95734 -59948 -69410 -48228 -36252 -60952 -74587 -52455 -36951
15927 -36951 4061 8966 -35536 -18972 2972 -17539 -21534 -12614 -61807 -117282 -102472 -115953
15915 -115953 -77756 -36350 19535 -12652 -17239 -10695 -8850 -35511 -2900 20090 33732 37778
15903 37778 46677 23364 -29706 11178 41127 14420 -20715 -29208 -19138 -57117 -44020 -4830
15891 -4830 26170 19064 32567 -24593 -21328 -7139 -4331 -20331 -24933 49736 71123 59676 42203
15878 42203 38341 53586 9292 -12810 -12267 36563 14836 -50048 -98499 -94595 -24091 -4361
15866 -4361 -19995 -61596 -98485 -106098 -75330 -16410 20167 29435 -410 -16082 -46311 -48210
15854 -48210 -15841 11377 17632 20917 -10691 -19233 -4330 28760 46019 17472 -65268 -34278
15842 -34278 -7449 -25681 -42577 5844 -17319 -46922 -44763 13133 -3194 -16204 -5988 41376
15830 41376 56956 2420 9525 -40730 -93585 -126055 -97261 -81445 -97682 -128953 -63233 -32130
15818 -32130 -11706 -1619 251 -40408 -23447 -44979 -14262 29498 25095 30150 -2270 -45531
15806 -45531 -83865 -66936 -84449 -132343 -116287 -36710 -36453 -76881 -51394 -42760 -32346 -9108
15794 -9108 -20360 -6329 6606 9363 -10510 -22413 -7311 -18116 7731 60496 19126 -26437
15782 -26437 -46546 -41429 37189 83121 70879 47351 22667 5268 -49978 -40765 -32444 -41968
15770 -41968 -57987 -48347 1263 3649 -4488 -29004 -9666 9400 -5823 -468 30667 -2979
15758 -2979 9295 -26237 -30829 -25019 -35341 -31185 -44275 -55415 -18369 -14376 -31658 -25794 36755
15745 36755 33472 -34875 -55058 18149 10039 16624 47908 59930 26845 -6270 15531 73583
15733 73583 108581 60106 24114 -9290 10124 16693 1168 -65191 -71657 -53767 2029 25280
15721 25280 71768 105655 49406 55369 62861 38717 71365 84062 71618 95238 95812 40995
15709 40995 30672 48188 23017 27399 5623 -18739 -9475 -31010 -17345 -16022 -73274 -79972
15697 -79972 -49232 -16631 -3159 -53666 -77961 -112797 -105495 -83106 -28420 37821 124685 97367
15685 97367 42553 20778 47954 78011 66008 69224 76388 71521 23995 21944 28502 39740 47051
15672 47051 48840 10588 -15678 -19134 -40415 -39500 -10960 4184 29315 42285 82002 68934
15660 68934 15858 31185 33453 25387 14346 -46728 -72856 -80322 19338 74215 25329 6187
15648 6187 -11198 1933 6621 290 -8475 -44054 -43702 -22881 -19982 -48989 -33562 -70793 -136744
15635 -136744 -157083 -143114 -41552 18014 46851 61562 35940 -41398 -67665 -72494 -50917
15624 -50917 -52711 -87377 -125143 -128195 -72502 -30302 38845 41235 18903 -43213 -50484 -75849
15612 -75849 -127337 -103327 -39472 8335 -6979 -19995 -5570 -4459 -6912 29195 46456 49916
15600 49916 5140 -63919 -63486 -43157 -22529 709 36561 64944 -9114 -59013 -16738 -15316
15588 -15316 -24564 864 34828 -17297 -22467 -777 -14995 -32370 -51267 -21714 -16166 -2840
15576 -2840 -34388 -32790 -23395 -39294 -49464 24789 51935 18844 1682 -9295 -50943 -87810
15564 -87810 -30055 68633 109051 105118 37965 14476 -963 -48257 -61650 -71341 -47485 -2667
15552 -2667 11655 -27308 -18351 2000 -17207 -88942 -105446 -58729 -24793 -56805 -25553 3004
15540 3004 71212 92021 11739 -41570 16856 87411 63276 78052 84830 106431 122397 148858
15528 148858 199657 209059 202612 191655 175240 147052 203917 268207 325377 392531 560709 743021
15516 743021 978538 1206985 1461855 1660239 1750023 1727616 1707308 1640853 1622073 1543853 1464548
15505 1464548 1322382 1137072 904537 637485 412012 301181 242143 208419 190384 173214
15495 173214 120564 42323 -17854 -16926 -23930 26599 95007 95202 79323 121141 115293 101685 76963
15482 76963 15250 -28050 -17534 37721 21387 55598 83976 74406 91443 106719 91499 80194
15470 80194 50654 82831 51927 76884 61686 5428 -32753 -2933 26719 66139 48766 54849
15458 54849 6904 -64437 -109147 -88674 -56951 -29088 20215 29405 -24085 -36254 -39232 -42506
15446 -42506 -34824 -18670 -5386 6063 37369 64252 81243 72710 29308 -84799 -72804 3118
15434 3118 -2659 4641 -37925 -46883 -19189 4868 21588 30274 62075 10491 2427 3205 15383
15421 15383 47972 71577 98462 81890 65613 -1462 -13621 22799 33405 -25619 -38152 2129
15409 2129 16055 24126 9008 -13178 -23373 -41085 -41456 -38590 -22157 -6681 46665 65165 41480
15396 41480 659 27453 68149 50452 38286 61794 46320 -2691 -966 3750 -36665 -45591
15384 -45591 -31213 10863 -47502 -61547 -62841 -90130 -81461 -109085 -132552 -106495 -41686 12765
15372 12765 -12165 -49470 -66534 -52990 -72657 -49492 -26763 -28268 -11709 -22696 -45815 16733
15360 16733 63640 28483 20638 63452 51630 45947 52619 18373 19450 51292 59726 36266 445
15347 445 -11336 -49202 -48021 -76919 -98631 -95463 -68334 -74090 -51679 -49520 -66619 -57762 -36266
15334 -36266 5133 4712 31136 63687 91352 62786 20771 -10896 -12426 31903 53707 -14100
15322 -14100 -64163 -80096 -103505 -65693 -54459 -56370 -9193 3784 -29104 -32434 -15637 32306
15310 32306 62905 68719 89509 70293 53320 59377 39622 35640 -6239 -30749 -9249 5120
15298 5120 44583 48025 -3531 -56084 -55050 -86141 -83433 -67831 -102270 -132948 -91884 -51752
15286 -51752 -25334 -21439 15739 -8980 -7948 -16143 -73103 -33213 -61089 -47579 -23515 -35812
15274 -35812 -21518 33434 18025 -10117 -14510 34350 95021 78402 52902 -7976 -30868 13785
15262 13785 43003 42435 -7153 -38648 -50111 -72895 -95410 -85633 -26610 46228 59063 -18051
15250 -18051 -51047 -54078 -42957 -61089 -61205 -22898 -30890 22818 67072 77624 159589 187284
15238 187284 144687 85159 67203 22904 -6925 21302 15714 -9349 352 24785 37578 30914
15226 30914 6034 -11334 -4159 -8055 19113 -14835 -93975 -86338 -74149 -90306 -53071 -15384
15214 -15384 -41546 -24008 21123 16255 -51229 -38799 -45305 -68179 -46865 -27089 17146 25340
15202 25340 9492 28684 39433 38083 44321 62654 107098 72506 -5497 -28334 -719 -13231
15190 -13231 -47547 -52981 -67018 -70319 -29572 -14960 -34065 -24232 48772 35854 3877 -12940
15178 -12940 5278 2416 46476 68422 -3879 -30217 -74502 -65715 -15024 -11056 4247 14873
15166 14873 23637 30549 23696 26954 13344 -21059 -45030 -66635 -81497 -83592 -56343 -34716 -21459
15153 -21459 -7097 -11698 16464 -2712 -38176 -58684 -26735 -53357 -72013 -32653 -17387 46774
15141 46774 69218 39215 40887 43983 33771 44278 48837 38555 14529 47040 80124 94850
15129 94850 124906 153760 76803 -9962 -2223 -3766 -5528 12960 22184 13101 -2556 -15411 -4072
15116 -4072 -1320 -39753 12771 31923 -10986 -46213 -59972 -50884 -22669 -29048 -49239 -57191 -58548
15103 -58548 -98323 -113856 -97460 -38102 -15823 -42631 -13557 30855 25506 10159 19420 35201
15091 35201 39498 54571 39437 17616 6612 18775 34540 65006 97272 78346 90868 80877
15079 80877 58666 69210 37832 43820 64207 5267 -63639 -77445 -89254 -18438 45888 52107
15067 52107 33510 16135 58774 2879 -36356 -22493 -14546 26270 77674 60110 21542 -10988
15055 -10988 -19250 7510 -3154 -3831 2209 -6521 -3846 31589 86619 134429 124648 106278 85421
15042 85421 72328 75690 50498 32760 23085 3754 -4320 -24582 -14002 -2673 -16793 -17672 -38144
15029 -38144 -16133 20029 23914 23612 -3129 45179 15771 -1010 12069 16913 24901 34075 49612
15016 49612 13401 -11686 -23624 16905 8674 9659 33065 65615 80499 111107 118326 89205
15004 89205 55983 22642 32700 47614 119319 154932 189531 176438 232551 376347 646848
14993 646848 912506 956640 767332 571491 360670 253792 218836 166397 116894 73450
14983 73450 52954 47352 54244 66025 29011 -24869 -5921 40429 18756 25880 31839 62960
14971 62960 63028 105939 135836 116691 115570 153798 135468 125736 75739 55799 85775 66120 10337
14958 10337 19166 45364 48623 40182 21451 49425 30887 573 -19642 -9724 17607 46688
14946 46688 25745 9670 8995 -19432 -47446 -5063 -9871 -23876 6133 -3167 6493 28543 9344
14933 9344 63950 13146 -5475 -37481 -79615 -50292 -40553 17182 42903 60011 94968 105613
14921 105613 44585 -2569 3350 -21043 -32954 -24535 -12266 -44559 -85013 -111035 -52317 1821
14909 1821 15515 -3927 10314 20243 49513 36720 4709 -32669 -21160 -25037 -8196 -10893
14897 -10893 33282 26526 -27121 9476 31669 31782 5719 -11336 -10907 23759 43784 4444 -50424
14884 -50424 -56542 -28919 -10011 8576 12484 41309 65604 9176 -35074 -70079 -84766 -57845
14872 -57845 2153 -53283 -74045 -110741 -140470 -48076 34380 65800 26928 5022 3686 -25580
14860 -25580 -53654 -74652 -16637 4308 7397 -37704 -98437 -71085 -14615 -11741 -18067 -33576
14848 -33576 -65250 -86030 -59986 -17589 -63229 -84829 -39189 -59833 -22483 37209 18653 -9916
14836 -9916 19116 -7833 -12812 3582 41244 13470 34390 -13624 15489 -3573 -28231 42096
14824 42096 102404 83051 31291 -35520 -23066 18503 25618 17377 -35442 -55830 -43645 -8713
14812 -8713 -21872 6287 38654 41464 48657 77885 79860 34257 -17723 -47462 -36392 -14506
14800 -14506 -456 15661 6913 -655 -21736 -32418 -38756 -55562 11090 3546 -15067 -10139 14888
14787 14888 15357 -55349 -83742 -114517 -94020 -43061 1316 15098 18046 5229 -12186 -43646
14775 -43646 -43551 -9844 -8931 -24346 -10354 35047 23934 -28144 -34433 -36678 -61534 -76793 -44050
14762 -44050 13933 -8608 -31165 -21712 -12323 -4255 -14049 -7918 -18248 11825 50483 28153 7299
14749 7299 31321 11730 30632 7668 -40453 -47826 -65989 -86503 -89942 -71079 -57081 -58221
14737 -58221 -24718 -43698 -33570 -20293 -9418 -26221 -19070 -23392 -57023 -56793 -27067 -31605 -15386
14724 -15386 20440 -36118 -36481 31333 70867 21564 -33839 -19314 9102 27698 -15093 -21968
14712 -21968 -43265 -82030 -2612 57334 2134 -58748 -46009 -24367 9355 38783 32874 -18307
14700 -18307 -38778 -48245 -123081 -124024 -79227 -43532 -55825 -48941 -44700 -54043 -41283 -57359 -14358
14687 -14358 -18702 -30010 -47173 -58589 -35489 11745 40384 34446 -16501 -21195 -49038 -29089
14675 -29089 -7216 70 15248 22253 30788 2060 -44879 -33534 -460 3268 34781 41155 -13493
14662 -13493 -11300 37028 13349 4200 -5904 18697 49559 31082 -30271 -34568 -272 37161
14650 37161 12214 10821 -24962 -47341 -55506 -43440 -72075 -89205 -93545 -74566 -103382 -94644
14638 -94644 -73580 -97564 -47975 4688 21873 12235 18943 34154 36643 18537 -14190 58400
14626 58400 65794 38179 -1268 -36846 -47943 -64585 -38435 -11621 20403 17539 46492 84434
14614 84434 14415 -17462 33850 82811 82293 45191 9217 42577 76898 95042 93549 110682
14602 110682 89750 91366 53929 16207 -16549 -21608 -28456 -38072 -24127 6376 88040 83834
14590 83834 68894 71901 42564 -13188 -37297 4113 71974 63865 35341 30396 -9931 -9001 -2211
14577 -2211 -10065 -17527 -3981 -15622 -9013 -5451 -18663 -14077 -467 45660 81404 80814 50340
14564 50340 16188 -27079 -9258 19960 9994 20756 27811 17964 9038 22732 -47168 -54773 -15163
14551 -15163 -4718 -4284 10867 -20103 -16966 27928 76405 80292 47437 43311 4274 -75282 -82429
14538 -82429 -92169 -57999 -8505 28554 39638 10528 -22023 -18280 -9215 39683 76956 66540
14526 66540 40619 17772 -21545 8988 44476 42357 8519 8489 41947 22959 13797 21208 5075
14513 5075 44272 47735 -24942 -21048 47150 38339 22527 -2279 -113 15895 -31933 -46919 -51619
14500 -51619 -62551 -35793 -33826 -60368 -41976 -22829 -25638 -8860 11210 24567 25980 -34416
14488 -34416 -60280 -2838 11265 10630 -3857 -12269 -29654 10751 -3110 -26539 -41318 -77299
14476 -77299 -89891 -77103 -37547 -27217 -35111 -45287 -20937 -4203 10521 44268 -14631 -74936
14464 -74936 -125749 -137257 -113565 -83225 -29670 -5980 -9072 -5317 18501 6052 829 12870
14452 12870 36669 20840 -11727 -456 5791 -61119 -57153 -62522 -58017 4187 -24595 -67825
14440 -67825 -91050 -88888 -95725 -46407 -15392 38724 85768 81511 88934 68625 39649 21197
14428 21197 55519 104419 131477 93850 101738 76937 2127 -2748 36614 10193 21562 62302
14416 62302 25053 39232 36813 29682 21257 8517 29050 51646 119261 127058 86776 43575
14404 43575 50054 43755 30584 52446 58933 29702 49754 161168 233544 205013 197193 221896
14392 221896 248429 267383 280541 222721 169060 182802 210705 195810 198730 183450 140487 99562
14380 99562 44708 91690 126314 63235 9098 20477 32100 85607 111601 109074 71076 44152
14368 44152 70706 83535 99610 97625 52611 32746 83324 137706 168024 167910 141263 136582
14356 136582 153430 140268 172748 194553 165845 165492 136965 153755 232798 249345 210421 203117
14344 203117 138052 78453 43724 2990 -11925 8877 19679 1353 450 5751 5793 2017 -2961
14331 -2961 21294 18677 -34022 -71781 -45264 30843 92651 106541 80899 52552 40394 47278
14319 47278 -19194 -73819 -46326 14331 8017 -22884 -43137 -45394 4217 -48709 -60021 -26679
14307 -26679 -25209 -39288 -28734 -4560 -15961 -56361 -66839 -48920 -46892 -75357 -67664 -67050 -67780
14294 -67780 -65726 -61448 -44797 12700 13006 -24678 -23374 -44339 -18528 31068 107189 136432 39426
14281 39426 4863 1521 -31295 -32618 -26478 -18231 28144 40550 83661 83035 52864 27532 37429
14268 37429 7069 -57395 -99635 -144859 -124375 -33559 -61567 -77199 -86770 -37271 29236 28110
14256 28110 39755 2839 2599 22227 -27640 -83803 -80972 -88505 -97688 -69473 -48281 -78809 -84504
14243 -84504 -85719 -57650 -20989 -70188 -70709 -23877 15753 -46010 -83436 -83261 -73633 -73336 -44633
14230 -44633 -41425 -47012 -32290 -14500 7891 9284 -59175 -101699 -67153 4971 53541 26343
14218 26343 8900 24629 -19569 -49722 25330 44327 -15716 -26576 -52719 -48670 -19347 -9170
14206 -9170 -900 24434 23904 -20408 -32889 7057 16867 -17345 -5945 16801 1195 40570 65818
14193 65818 86517 88292 53863 97342 123089 135458 121994 3355 -82862 -72567 -57550 8495
14181 8495 5700 16200 62450 37247 24256 11188 -5160 4109 -13928 -250 -26545 -42276
14169 -42276 -27038 -8258 -20410 1047 25182 33369 7216 -25190 -47688 -20998 -10601 -54530
14157 -54530 -7205 20333 -63609 -67547 -40529 -36369 -32863 -46794 30578 -11999 -13903 8249
14145 8249 3724 1865 41943 26623 -35579 -68312 -77798 -32741 21437 11369 -13325 -40168
14133 -40168 -2644 42272 22405 25022 18411 -10893 -40215 -13647 32429 32326 44144 7426
14121 7426 960 42100 72786 46292 23338 16154 -15264 6829 30565 -8351 -33675 -27131
14109 -27131 2060 27481 -34015 -55437 11792 45478 56414 43791 58897 73571 83990 -37
14097 -37 -71212 -61703 -24818 -21786 -28542 -10420 6199 -29260 -34909 -36222 -25639 37185 34718
14084 34718 37657 42075 -9215 -10899 5139 -31035 -68841 -86435 -58361 -40088 -63428 -60981
14072 -60981 -58334 -64227 -32494 -45461 -96491 -105518 -97850 -80871 -83838 -93469 -96061 -42253 -31509
14059 -31509 -48606 -52771 -75335 -73110 -84461 -57213 -30513 -6822 4344 7553 5978 19892
14047 19892 -27500 -1068 11049 -19583 -40893 -31941 -25508 -5825 38195 90935 54455 81814
14035 81814 60791 90279 95540 86681 79647 51292 21942 -5408 -13235 6846 29801 16563
14023 16563 47545 42029 -32524 -38066 5675 57222 113050 102964 51774 47578 19322 19842 8811
14010 8811 20161 30562 53747 68559 51605 5047 -10186 21429 15833 -2483 17620 18937
13998 18937 49971 70249 73547 55573 45561 53631 32602 -50016 -87499 -72954 -32741 16378
13986 16378 29022 37531 49414 40957 53478 29821 -5429 27243 69055 35353 16144 16529
13974 16529 47779 26824 20635 20924 -18645 -16381 15131 39973 13940 -15493 -5956 -8471 23881
13961 23881 -40982 -62086 -27938 26103 38416 16169 -8513 -28127 -28454 -19898 -10116 -3911 -21130
13948 -21130 -39838 -3379 -11832 -47016 -62409 -41751 -30781 -45898 39471 18321 -5381 10480
13936 10480 -11069 -65342 -71184 -48048 13697 45028 74187 83744 32260 -47589 -97030 -60132
13924 -60132 -65135 -62871 -22204 11863 -6335 -7851 -44323 -28828 -13949 -41083 -60730 -48313
13912 -48313 -16316 3279 32058 20743 48185 66840 49515 58831 106522 69375 42764 20918
13900 20918 41309 31344 -13272 15965 -12636 -28494 28774 31721 2218 -14946 698 -32374
13888 -32374 -53252 -14891 -40822 -79737 -38406 24402 21149 23792 -11163 -43174 -25763 -165
13876 -165 -951 660 -11208 -63276 -93716 -68570 -48148 -44415 9 17767 23911 22820 18682
13863 18682 32878 40065 13028 -3201 -25254 -13970 5738 -8770 -56479 -63045 -78578 -98688
13851 -98688 -80344 -77598 -99459 -79200 -83415 -113990 -97518 -74332 -47336 11349 29594 -51983
13839 -51983 -125539 -133264 -82890 -72967 -102389 -113576 -84529 -81184 -37290 -2446 -46279 -78659
13827 -78659 -70608 1571 16699 -38903 -42800 -20419 9338 -17806 14012 44786 34120 -9166
13815 -9166 19869 35596 39421 42190 21087 43550 44661 25162 -6276 -21828 -1615 28470
13803 28470 -21497 -40402 -4332 11766 101324 95638 71671 25928 -30122 -37211 -932 924
13791 924 -1734 56070 52730 -3014 40615 31295 37808 54869 37135 16794 -8768 -19827 23036
13778 23036 53217 98678 58665 15231 8497 32623 27497 -12969 -84700 -62819 -9012 7735
13766 7735 -29312 -38180 -29824 -53986 -9088 17521 -4728 19112 28976 -34099 -12772 53135
13754 53135 63247 38267 65656 73010 64864 76580 66215 17902 54071 33646 -9479 22057
13742 22057 26705 28130 28252 40903 9809 -45911 -15984 -36002 -54395 -18768 51059 54433 26715
13729 26715 -3190 -18799 -17072 16934 44858 61941 88875 92519 87087 58774 682 32544
13717 32544 41230 6805 21735 77643 123716 130066 99874 68630 67037 61546 82902 83651 113593
13704 113593 99386 74872 104822 138322 103963 63682 81934 149131 137847 128682 187077 255784
13692 255784 327761 356061 446661 500851 502213 429662 375438 364282 377538 299134 239400 273546
13680 273546 311477 302227 332993 377054 388983 399600 390003 366776 368462 353815 344963 354059
13668 354059 400981 418392 432698 440749 448834 475375 521361 517384 525482 499436 490859 553797
13656 553797 642836 711720 797176 897251 1079415 1260205 1298613 1206399 1029451 858384
13646 858384 721020 579565 461388 461339 455905 395824 359986 367178 292990 286502 295954 328603
13634 328603 338965 343162 354145 380596 365519 353086 311041 257674 265457 257265 254202 295959
13622 295959 318722 299126 302852 311391 314085 347841 390754 423156 483059 518406 543691 540331
13610 540331 458755 349738 239563 195015 217778 234765 208272 137195 96668 116098 113940
13599 113940 101358 52421 57706 131920 112590 86622 39948 -41375 -59649 -40986 13675 59517
13587 59517 31555 44853 59255 64936 46454 34046 -13104 -67357 -64752 -70649 -21460 28847
13575 28847 16646 3967 12465 35369 5155 -14188 -32213 36875 71554 77880 73205 70491
13563 70491 71725 44954 14204 19564 76235 115192 108637 47424 -1061 -10472 4851 -4935 -22902
13550 -22902 -7014 22210 35627 47069 80816 65751 31427 24392 32222 22566 34267 9797
13538 9797 -2839 -20328 5667 33317 32544 51862 86716 56085 60094 64949 72669 31862 -8473
13525 -8473 18965 34313 33517 17661 43156 108994 120614 85074 89860 33235 -47705 -87387
13513 -87387 -61394 -45302 -27870 12017 -600 -5551 28283 68067 51751 9278 -28521 -40573
13501 -40573 -15568 28155 66240 79228 48238 -10393 -9932 8483 63245 40194 -4368 -31716
13489 -31716 -13115 50527 52479 52618 58986 48216 56841 66195 27125 70035 113140 104180 111900
13476 111900 90341 99115 78033 98850 105508 87535 59014 65685 56180 67807 63348 29998
13464 29998 -4920 -7988 -60151 -60134 -18494 -4254 12732 14211 52705 68450 94923 11362 -65579
13451 -65579 -100437 -86723 20318 39310 15160 -38197 -37744 -20468 38380 91373 75754 82504
13439 82504 41745 -47514 -61193 -5952 -1091 -35212 -29197 -67 38551 32380 -24954 -26959
13427 -26959 -24499 -54686 -66423 -68394 -52157 -38510 -6820 -5674 -12945 -26670 -45714 -2290
13415 -2290 12333 -18237 13937 3672 15820 17408 -501 -24879 -45193 -78039 -68096 -99089
13403 -99089 -103149 -52705 -5162 -4277 -26637 -36755 -4086 -31491 -53299 -33689 -15024 10579
13391 10579 24125 -8976 -101712 -107504 -52825 -21174 -22275 -7919 17861 51127 11947 4550
13379 4550 28782 -2861 -35399 9266 24906 -19939 -41546 -33523 -11543 -20191 -51029 -56160
13367 -56160 -55290 -52521 -303 4217 46043 85920 76187 22737 -17982 -41197 -31663 -5482 -20413
13354 -20413 -35832 -80234 -90262 -12727 23722 21949 32091 35846 17140 8816 -17458 -25695
13342 -25695 7467 2964 -50683 -27405 -8848 25472 88100 77469 49199 20667 45917 44505
13330 44505 -14231 -59481 -32845 -195 44459 34542 -69782 -82242 -20804 2086 15821 -10691
13318 -10691 2951 7863 35511 21021 -5832 12031 83 -39180 -65437 -34966 -34283 -20576
13306 -20576 -18358 13345 47530 50359 35147 17805 -12283 -41487 -46990 2193 48858 61156
13294 61156 101116 92688 26952 10808 22228 24749 18039 74922 96204 81202 10975 -6130
13282 -6130 -6832 7567 7520 31687 45509 23693 72596 118623 122428 -2727 -96466 -119624 -47374
13269 -47374 -18099 -32749 -25350 -24918 -69848 -50301 -1636 6126 16512 8884 15418 28106 -22992
13256 -22992 -44611 27786 87349 82556 49649 28278 42315 32389 23415 -44033 -65810 -61461
13244 -61461 -41133 -41237 12752 35393 39479 -12662 15244 32087 -9231 -52370 -76603 -84386
13232 -84386 -22711 21979 37709 35450 39600 2407 -24887 -27746 18399 14334 24982 28134 9003
13219 9003 -6774 -10662 27247 30857 11543 -23256 -23830 -17471 -40503 -48026 -33889 -34364 -817
13206 -817 22762 -4830 8388 20457 33123 48621 -11988 -8569 -28453 -48944 -72733 -78451
13194 -78451 -54535 -6344 14020 51982 75801 42809 -45913 -21607 5399 43287 46418 6914
13182 6914 -18629 -27783 7609 41170 17706 5724 19458 21503 31574 1691 -8367 39228
13170 39228 62830 2147 -21846 3040 24749 9872 -13367 -39008 -6012 -34276 -11451 -34045
13158 -34045 -89130 -145015 -124655 -38161 -26283 -46925 -24797 -26928 -672 -2237 36582 18438
13146 18438 36395 11779 -51448 -91800 -57470 -12905 -16977 -19989 -37010 -20414 3082 -64565
13134 -64565 -87617 -74927 -44708 11931 9184 -20869 -57586 -25031 -11109 -23294 -28049 -26000
13122 -26000 -11148 -33690 -7765 1300 -45703 -45094 -9806 21368 65990 92967 83868 41929
13110 41929 44132 6511 8401 3619 -26755 -44950 -63415 -68223 -65118 -74921 -89316 -62422 -24095
13097 -24095 -41486 -91021 -82806 -23518 -21600 -32737 -63011 -142616 -170000 -129911 -112462 -94808
13085 -94808 -117877 -109254 -65269 -70522 -84583 -88107 -55798 -59557 -2511 -19606 -42361 -13875
13073 -13875 -240 -15411 -18291 -6296 -20316 -68677 -79777 -51488 31180 -15955 -17598 -2401
13061 -2401 57179 99390 123638 100582 41156 -19799 -45354 -57931 -18420 34581 20776 7027
13049 7027 -104722 -119575 -102395 -89716 -59717 -90136 -65185 -28609 -6494 4312 5691 -56768
13037 -56768 -67757 -39872 -22808 -10467 1923 -10179 -62889 -40383 -31652 -73241 -56760 -52669
13025 -52669 -52746 -73002 -83177 -40816 9628 54631 40432 43254 9422 4883 39755 68999 66599
13012 66599 44339 25156 34578 -55189 -113743 -94916 -36090 -1448 5689 -14383 -8552 -20163
13000 -20163 -13678 4079 64933 102569 -18119 -84228 -93761 -100668 -56266 -18744 -1509 2503
12988 2503 -37329 -12161 33093 27326 16450 25678 -3802 -27827 4540 -13859 -30128 -13549
12976 -13549 -2606 11138 4138 -31629 -10749 -5175 -1282 -41513 -58278 -24963 -1850 8409
12964 8409 13566 57636 44449 30766 64123 106175 136033 191733 245310 317051 355233 303500
12952 303500 245145 169222 132325 109360 81029 67742 3376 15553 -21637 -28097 -51976 -46044
12940 -46044 -58080 -63525 -39986 -109 -11797 -42476 -39567 -52246 -45933 10190 17439 -5995
12928 -5995 5371 49665 -4352 -16572 16447 34110 31450 47662 77021 32692 -5289 -1724
12916 -1724 63640 58037 29181 8614 11193 29878 50051 82099 81969 7095 -32145 -35693 -11621
12903 -11621 12036 26866 30703 85865 84336 74854 80116 35648 17704 8514 2992 -4631 -28713
12890 -28713 -39622 -1152 4159 -60859 -104998 -112103 -38632 1585 -23338 -12278 -20119 -69065
12878 -69065 -58201 -60697 -30039 -41478 -45041 -36814 5707 7505 19360 20959 17771 -16155 -11747
12865 -11747 -6032 23132 3624 11075 -1598 -22223 24521 65882 69226 18087 6785 -12168
12853 -12168 -3450 10496 -7694 -6879 -26381 -3890 -5778 334 26004 39936 62336 88956 62257
12840 62257 43101 58687 71100 49924 39184 -3656 -44489 -17672 11067 37605 12007 17406
12828 17406 79670 115466 67680 36799 -4942 -16891 -9507 24283 34649 -29577 -56906 -29186
12816 -29186 -42319 -25008 -4638 -36900 -7980 -580 -48790 -61666 -58704 -84916 -99993 -46245
12804 -46245 -21314 38830 83026 68892 56652 34715 45451 35340 48321 86175 80366 71923
12792 71923 22289 -13198 -15397 -32582 -44830 -18332 -29215 -20687 -34605 -37723 -4979 -8518
12780 -8518 23380 31439 52185 7263 -66820 -69256 -33239 -29952 -49217 -46074 18858 59043 34094
12767 34094 18556 18308 -17722 -1261 64580 114129 104886 59841 8914 2718 24055 10954
12755 10954 33833 37675 7250 27434 5042 -28111 -32784 -30169 -43533 -45748 -13213 6632
12743 6632 42432 23821 -40187 -67654 -43335 3681 13276 17003 5412 26510 26104 12621 18603
12730 18603 8239 -9174 27850 55561 9564 -32123 -47066 4868 14439 21693 18628 -24560
12718 -24560 -41579 34395 70043 63807 42820 39931 77922 63789 12127 4081 -42379 -69490
12706 -69490 -58703 -5507 -3954 -22826 22993 17032 -15779 -44740 -50828 -45983 -24874 -33610 -8729
12693 -8729 -29957 18363 39106 60029 72463 35603 -10105 -49324 -33403 8141 30435 41361
12681 41361 57125 58883 7117 -26989 -14831 -972 -14201 9139 66137 18919 -2828 66286
12669 66286 71751 22902 -29274 -17184 -6104 -8778 44397 111698 65507 57797 33942 -10477
12657 -10477 -43244 -40455 -21403 -8505 18899 25891 4736 -17038 3170 -13544 -46295 10162
12645 10162 22222 10353 43265 28472 41222 89525 102194 135793 103895 81667 38183 76667
12633 76667 73120 83192 38698 -53956 -47017 1184 802 16902 22272 45145 69469 70614 40414
12620 40414 -6517 -13664 4452 12310 20466 28152 34601 23973 3368 -30966 -109137 -128823 -66357
12607 -66357 7611 4803 12991 70328 77935 17174 -35056 -8431 28835 13853 13977 -1138 -29801
12594 -29801 -70593 -58093 989 7544 11070 46792 56262 55894 71356 71222 37182 25825 681
12581 681 -11291 -947 1869 -30187 -14319 37691 8111 -36422 -7174 9464 3458 -13962
12569 -13962 -13714 14239 -8975 -32721 -10396 8364 5091 410 1074 -30735 -15893 11740 33317
12556 33317 40318 31117 -1262 -22741 -11849 4537 -28770 -30509 -61221 -73557 -98583 -61933
12544 -61933 -77942 -98174 -98833 -54492 -22244 29003 36258 18846 -17497 -10411 698 35713
12532 35713 78179 113545 54132 17720 -9710 -18866 -1497 40795 20622 17683 -1872 -8287
12520 -8287 -41507 -27603 -6100 -15739 -20507 -42717 -52348 -29508 -34873 -11581 62884 69354 42833
12507 42833 -10905 -47748 -9628 -23599 -49735 36871 66348 43563 7388 895 -16178 -9363
12495 -9363 -51166 -94612 -60051 -62035 -45529 8382 68826 100757 93249 122064 120375 107721
12483 107721 113100 79395 54340 26220 -46297 -18785 14502 18213 7013 -11849 -43182 -59683
12471 -59683 -42441 -22946 -10377 18025 39218 -1550 -45672 -59072 -57742 -16041 1066 2341
12459 2341 -21974 -47616 -3040 -9250 -13848 39722 48458 49127 30006 28687 36972 37683 78789 78564
12445 78564 88155 65793 34829 40477 8442 44092 37165 42291 80032 77777 63622 61284 50084
12432 50084 47346 46404 49849 34312 73910 105458 152676 145303 131512 125728 118006 116212 140577
12419 140577 135485 109758 125928 214525 326302 395942 449863 507508 536831 446363 329685
12408 329685 350441 336210 342002 364905 325221 302576 322179 370243 352283 326007 295258 250550
12396 250550 305235 360568 382263 382219 397642 360209 375547 396449 407065 411735 405863 373812
12384 373812 412202 436062 425574 447639 490155 514091 558298 669542 775035 909270 1094956
12373 1094956 1250966 1252669 1087257 885181 726435 632619 500770 374065 380154 394198
12363 394198 346493 336862 404121 495807 519837 559887 509253 495900 445134 423710 448421 385790
12351 385790 363541 331112 352587 412527 381808 331877 329576 307457 278810 290372 300710 375214
12339 375214 387735 360728 340588 354698 401012 442710 421329 340128 228383 197386 125756
12328 125756 101004 73360 63637 62446 46930 33395 63014 27614 16313 42774 28622 35756
12316 35756 25404 -18032 11 -27052 -34706 8258 62748 49540 7102 38160 10689 -27567
12304 -27567 -3159 -118 22158 99366 92633 114376 124847 97619 58786 21065 11778 -12546
12292 -12546 -23517 -20938 27815 76174 83047 64728 913 12421 -24552 -12888 48369 60424
12280 60424 60100 54604 70819 106494 80889 48229 43059 -1455 -22753 10010 54948 21280
12268 21280 -9932 -7322 -22443 -20780 -4696 -21797 -58629 -52555 -7525 31633 28781 37020 84493
12255 84493 96314 86696 12287 8637 12210 93665 136738 95111 69914 48163 13457 -3229
12243 -3229 -4203 27620 62845 90369 31532 -7286 -11839 -30905 -37187 47160 76132 13054 -28155
12230 -28155 -54263 -1086 23991 45563 56561 58571 31778 35923 5145 -25475 -14038 24701
12218 24701 5020 -12874 42639 37579 71378 76831 28560 41791 84093 107755 131000 127995
12206 127995 91290 87984 57049 15464 -16860 -29168 33559 53128 50484 14903 -2962 9529
12194 9529 31172 49620 36253 -49732 -88526 -68353 -71288 -23605 21883 28334 88501 104827
12182 104827 80729 74142 51725 -6059 -40240 -30866 -2031 -2496 -13043 -17858 -8866 -22165 -11058
12169 -11058 32033 26977 -27919 -32198 -53373 -5257 16866 -25341 -16354 22991 36296 61295
12157 61295 64965 65624 42395 -2438 20470 46584 33623 -27062 -37842 -32697 -17227 21913
12145 21913 67128 14154 -35782 -3976 50544 95658 131192 54437 22732 26710 -10479 -12563
12133 -12563 -21425 -21983 -11386 -1229 40028 46238 42040 54819 71747 67342 67307 65759 34848 -8103
12119 -8103 -3624 -3444 -47701 -39231 -33656 -36310 -21567 -47551 -72870 -54107 -7699 -28960 -57727
12106 -57727 -31029 12899 39794 15114 -12675 -36943 12828 71052 57224 55995 52544 19839
12094 19839 -28271 -47287 25782 83476 94334 87130 47351 59740 83805 72961 31953 -6784
12082 -6784 -10366 -3948 -56103 -97582 -95740 -68178 -36257 5173 -13253 -23409 14906 15903 -25781
12069 -25781 -74200 -37855 -25127 -11841 25773 -21091 -32784 -13080 34695 31151 49050 58245
12057 58245 -12893 -43765 -30330 29904 16869 15741 30792 50719 41700 73148 94230 90751
12045 90751 53487 8076 13119 22245 54826 16533 10244 -26326 19469 32757 17726 -4298
12033 -4298 36936 58516 46352 38002 -4238 -46686 -59390 -41792 2597 34253 35882 3520
12021 3520 -52212 -41635 -44991 -54410 -88352 -85543 -51928 -43092 -56879 -70376 -43803 -21434 -46059
12008 -46059 -4227 9711 -13567 -1517 -20785 -25710 5765 32697 29632 28069 -17390 -60903
11996 -60903 -71595 -45554 -68607 -92855 -76570 -25672 18037 31012 27010 -19510 -43422 -68734
11984 -68734 -82190 -95864 -58753 -10446 -47461 -49647 -13021 -8192 12620 -1427 -42443 -50399
11972 -50399 -34886 896 -29299 -104635 -103665 -67642 -78837 -98489 -121051 -122182 -89358 -57789
11960 -57789 -24861 -4627 -3959 -78770 -76017 -38721 1914 42105 36561 67369 49366 31213
11948 31213 61839 118371 110973 89115 17661 -32375 -86085 -81366 -49749 -22685 -24572 -15583
11936 -15583 -4188 1004 35847 10224 14340 69438 113802 85727 50368 20706 15274 29882
11924 29882 54455 26456 9991 -7629 1246 17633 42194 9225 -22967 -50016 -72478 -79081
11912 -79081 -84306 -82337 -37408 16879 2584 -27775 -83141 -76528 -95063 -154186 -109404 -59020
11900 -59020 13140 209 38 510 11931 -52632 -30255 -1393 21080 42066 35080 24236 23209
11887 23209 -4766 -24935 3283 53233 64651 37744 -23864 -10119 411 -19431 -30109 -3615
11875 -3615 11659 -4668 -5386 49477 37189 -33515 -93641 -79209 -27341 -1984 -1923 14395 -22926
11862 -22926 -47917 -78782 -100372 -123654 -142246 -108750 -65998 -36145 -21143 -10538 -35475 -3910
11850 -3910 -15019 -59340 -101057 -110439 -88960 -19202 26232 396 -8662 -24610 -17843 40064
11838 40064 51399 3479 -24282 -19964 -13494 -5257 -3995 58996 13507 11220 32248 35618 9795
11825 9795 -19836 -82364 -65917 -57400 -78283 -27464 13929 17227 19401 87697 83891 36355 -43657
11812 -43657 -59106 118 38706 8457 -5438 -1728 -19674 -35120 14555 -9120 -58993 -62859
11800 -62859 -71618 -73339 -47953 -6243 49403 63729 72266 81462 49192 21280 28024 658 -17068
11787 -17068 3446 24860 29222 43291 -2812 15883 73365 20989 13061 62642 82078 81447
11775 81447 71700 23769 260 -10376 -29157 -19854 -45300 -86255 -118383 -81591 -2815 -15929
11763 -15929 2989 38608 8311 -53754 -41460 -67618 -158213 -168743 -130597 -84447 -42307 2377
11751 2377 -28861 -54847 -69186 -61893 -44208 -1862 13003 -8622 -24687 -38428 -1728 66541
11739 66541 38552 -50304 -90679 -76731 -68080 -57524 -28770 -34421 -43714 -65626 -83412 -34783
11727 -34783 -6349 -32492 350 63643 103828 25286 -32297 -31184 -18326 -47054 -19780 -5524
11715 -5524 -24313 -813 -15229 -54790 -27244 -55310 -61963 -40411 -8179 -11535 -36311 -17112
11703 -17112 -11111 9879 2304 -3366 -19483 -20276 -42111 -26992 10293 -12738 -58343 -57869 -63700
11690 -63700 -31214 -34405 -81085 -64394 2231 48098 62866 68737 67447 68310 19943 24957 42422
11677 42422 109075 74053 -8956 20648 28223 -4395 -32920 -3653 -4729 -26030 -38079 -31683
11665 -31683 -15312 -40863 -30440 28827 48853 58574 32284 14991 4539 -4694 -79640 -91235
11653 -91235 -127220 -125910 -61348 4006 69428 115307 82390 -17472 -54786 -66672 -42702 6713
11641 6713 3263 -32111 -30163 -10801 2926 40412 21240 12399 -34572 -65112 -41900 -26680
11629 -26680 -29547 -38106 -49886 -34771 -30607 -3570 13191 7016 -9333 -30371 -15680 29198
11617 29198 40048 20031 17557 26469 24564 51247 126944 121583 89519 24359 -3573 -9378 -38309
11604 -38309 -86276 -81357 -50078 -62145 -27629 -42238 -29804 -17998 -32022 -93154 -123739 -121178
11592 -121178 -133586 -114716 -51035 12157 68092 92466 51886 26194 -43014 -59628 -2102
11581 -2102 36992 29321 -19145 -88143 -103276 -72862 -73556 -43958 121 28876 72561 93419
11569 93419 92816 28716 6595 19098 34455 28894 -15669 -55374 -22808 10397 -13797 -45714
11557 -45714 -23083 -23257 -14466 -20396 -38013 -4828 -10489 46021 124216 123788 101275 68973 56814
11544 56814 18811 12476 27866 13796 -7176 -33193 -16766 29858 57423 53083 12356 -17590
11532 -17590 -20548 -15986 -45838 -29989 -14690 -8412 -11869 -53204 -125858 -128187 -71615 -38014 -27922
11519 -27922 -23317 -24128 4571 15735 37450 59444 32723 -16166 -37457 -48466 -52817 -54938 -73523
11506 -73523 -36550 -28356 -30976 -31418 -3414 -20249 -76622 -100048 -132058 -110541 -115979 -81203 -59339
11493 -59339 -73191 -46832 -22207 -26492 6118 5780 43473 79499 55419 29071 65684 67764
11481 67764 9375 38330 15877 -21168 -2429 -3592 -13751 -30438 -32185 40637 89892 54526
11469 54526 25649 44187 34480 4216 35585 -14415 -76494 -59670 37830 41539 57571 134744
11457 134744 97119 10811 16851 23911 25832 24221 11669 -54824 -64433 -29742 19171 33993
11445 33993 22441 7225 29277 814 -41515 -23641 -16782 -37373 -20674 -4381 65866 93369
11433 93369 33182 -7767 29653 43260 22533 5102 40022 49131 40851 7237 -35602 -17040
11421 -17040 -4640 -36135 134 -20060 -37909 -59888 -33363 -10603 43567 99871 97955 53250
11409 53250 64330 30237 26963 1217 22206 36751 -7479 -29692 29483 22545 36978 64747
11397 64747 90316 54063 14826 50019 61467 41081 11856 87352 97308 40020 36855 -15723
11385 -15723 -89315 -83318 -54587 20051 31958 28526 48308 26920 -20155 -36666 -54014 -63998
11373 -63998 -49739 -54797 -36844 -81646 -98253 -78651 -22236 31625 31009 33020 10557 34412
11361 34412 -3777 -30683 -33154 -39601 -39330 -31875 17456 23390 4955 -43266 -93312 -70046 -87382
11348 -87382 -92405 -72332 -65320 -66003 -42373 -46811 -33489 -25331 27987 16579 12260 25744 2445
11335 2445 -30500 -5444 -11959 -27938 -21421 1883 29106 22616 32019 48631 47804 -14299 -22405
11322 -22405 24842 72707 76294 72646 -2081 -21702 4967 22112 5008 8356 39795 4448
11310 4448 -2529 -5088 3714 39992 22635 -23640 13150 -23474 -80159 -89922 -72706 -11072 -14297
11297 -14297 -15710 6475 -997 11627 4660 2489 38074 43525 93613 31851 -20704 -16575 -4451
11284 -4451 41692 75469 57331 51274 57333 40187 15444 -12901 -38950 -16447 9757 40152
11272 40152 36054 4260 -19605 -44042 -33019 -46103 -28647 -27612 -24950 -5036 -18360 -12567
11260 -12567 43371 40496 42517 11892 -26776 -52032 18940 38117 36619 17805 -26664 -20812
11248 -20812 -36948 -97372 -106694 -81175 -70204 -88397 -75818 -111213 -78734 -40652 -31094 -13968
11236 -13968 5595 27562 31355 38797 16967 36070 76174 88488 74096 15727 -38467 -16923
11224 -16923 -22440 -57902 -50326 -42724 -1571 17905 -48947 -34667 8556 39999 11181 8041
11212 8041 40085 54292 68471 70689 38478 35576 32824 -10441 -52258 -61622 -48102 -29361 -10499
11199 -10499 -14578 -35721 -15503 -58178 -46435 -76604 -87201 -89578 -95695 -74420 -71360 -64488 -70983
11186 -70983 -63832 -44799 -44902 -30339 -32419 -17685 8218 40006 29901 12811 8808 -62208 -75624
11173 -75624 -73219 -78832 -36732 11985 7875 -37276 -5443 13093 9080 -33543 -22907 6966
11161 6966 2019 -5816 -7531 -25340 23754 59304 6727 -84897 -71551 -83238 -120147 -98168
11149 -98168 -47066 -11990 -8586 9067 -8849 -41949 -43588 -116138 -145460 -106968 -84950 -67485
11137 -67485 -74810 -94264 -115688 -84713 -21821 4057 28625 32639 -16117 -64343 -25650 -20785
11125 -20785 -4913 -9224 -23650 3104 -15857 28661 99857 99610 68339 69595 67048 914 -27082
11112 -27082 -22385 -4975 -17084 -30203 -10151 8687 60426 26814 -30390 -7534 64416 98652
11100 98652 129443 107248 54759 -13541 2854 21048 18240 -7625 -50395 -39222 -21559 -30695
11088 -30695 8020 -29669 -66796 -13818 21339 13026 -59139 -108924 -83741 -35342 13753 33619
11076 33619 36569 14230 14127 -12837 -27226 16588 19519 4587 -5272 -14976 2421 -49941 -58477
11063 -58477 -48135 -4678 -6788 45479 23527 -28216 -72825 -85509 -46837 7036 -10271 -8273
11051 -8273 27114 25409 29232 40962 72702 92308 62181 15671 -14878 -55933 -92131 -106627
11039 -106627 -102302 -103359 -14298 24052 66394 14939 -89349 -112324 -60184 -39078 -18252 12076
11027 12076 89620 97761 22786 -10950 -28564 -16422 -30100 -47589 -11408 1741 -1918 6626
11015 6626 56315 57548 18795 32577 -872 -1242 30967 32459 -52025 -87358 -56902 -53439 -37936
11002 -37936 -22277 5083 57027 82654 41737 -11302 727 -4156 13364 36432 37693 42860
10990 42860 55701 39246 17408 7101 -14817 -30381 11213 -10833 -45083 10741 -17844 -32233
10978 -32233 -58369 -81342 -126167 -128019 -102448 -24802 -16529 -76811 -84309 -64650 -33261 -26625
10966 -26625 -38970 -51324 -41400 -44000 -17872 -1559 -42891 -105788 -49931 78155 81174 55509
10954 55509 27572 -45752 -93376 -79231 4941 -9340 42 7329 -22433 -23803 41264 68489
10942 68489 94598 73937 21528 3556 -29517 -66936 -43870 -71096 -56742 -46873 -14549 -8784
10930 -8784 -24802 -35294 -30508 -14619 -37694 -55702 -35336 -6142 36702 13029 15141 -805
10918 -805 17879 30793 6095 -10156 -17704 -51107 -65633 -67413 -76730 -53342 -8481 19003 47151
10905 47151 84272 27023 -12086 2113 -22582 -100957 -108191 -75741 -59275 -62290 -62572 -26012
10893 -26012 -15065 -17505 -35483 -50483 -58178 7062 31564 -26260 -90440 -76718 -25651 -8431
10881 -8431 -38792 -10423 -19582 -26758 -24470 -7660 14779 60000 100997 51994 8282 6188 -6631
10868 -6631 -14124 -14249 -44752 -108660 -138286 -119927 -76717 -44144 12589 2040 -61260 -45290
10856 -45290 12285 42197 25426 -35166 -104733 -125579 -125131 -48941 -314 24656 63907 97454
10844 97454 53361 30412 38918 50076 -11041 -59212 -22877 9645 42198 38374 -1539 -33403
10832 -33403 -653 34584 10773 -17573 -38533 -49124 -64064 -74779 -95409 -69005 -70783 -47092
10820 -47092 -60679 -74621 -86569 -73169 -87777 -61889 -49732 -82666 -72630 -58721 160 28801
10808 28801 -3988 -15204 -8730 12756 32064 -12062 -104238 -107561 -79564 -51444 -13241 15236
10796 15236 -41073 -25783 17294 40379 18057 -46194 -1964 6867 6073 -19636 -40070 -43162
10784 -43162 -48065 -19042 20123 13712 465 8566 28876 38536 25223 43808 8912 -6434
10772 -6434 -50756 -68145 -43528 -12262 16356 12713 27614 -39304 -67752 -38929 2394 46500
10760 46500 37417 9844 -18210 5217 -573 -22843 -38210 -36343 -35720 -9978 12509 -13801 -25106
10747 -25106 16017 38823 21120 14686 53734 28913 -35061 -83522 -72133 -37576 -9728 4782
10735 4782 30959 14971 19970 6710 16624 -1497 11145 11807 -11775 7215 34245 68976 77126
10722 77126 55884 47417 47778 19297 -52733 -38264 42999 33593 -8077 -2501 30434 31437 3377
10709 3377 -34051 -16707 2889 -23658 -41795 -67598 -66215 -52042 -37321 -26049 -36411 -42288
10697 -42288 -22492 38113 64871 20202 -18804 -23898 -34380 -46377 -4974 28354 15848 45222
10685 45222 19615 19204 21606 -10229 14600 18374 -1349 15941 39333 15647 -26624 -20696 63308
10672 63308 65504 39305 25016 -15342 -15957 19870 946 -35609 -24891 -36610 -33668 8188
10660 8188 59858 74882 63528 63937 24063 -7986 -25413 -42572 -80937 -66334 -25546 -41652
10648 -41652 -90840 -69226 -20475 6206 26548 18839 -3486 -50991 -56107 -65057 -76621 -69002
10636 -69002 -101349 -80123 -26061 -30821 -32715 -22636 -21657 8843 60375 79514 46316 36103
10624 36103 -945 -16824 -26701 -34964 -30162 -11238 -29883 -42701 -21274 -10255 24274 64572
10612 64572 21751 -15872 -4635 -20004 -41470 -50678 -39303 -12071 36670 40069 80480 117932
10600 117932 87468 48858 50526 51147 46594 75149 127188 110858 33441 2509 -23397 -61498
10588 -61498 -53915 -15102 -9452 4850 -35614 -42215 -28776 -34668 1046 6897 4906 -962 48528
10575 48528 94119 65917 60115 14925 19523 47845 2212 -4312 -30183 7157 56402 42557
10563 42557 -2770 -24671 -54451 -26709 -27168 -60577 -85724 -37695 -21764 -56090 -54062 -67540
10551 -67540 -92361 -92268 -108652 -95108 -68352 -54684 -7161 8415 1272 -15118 -19951 -59422 -59832
10538 -59832 -48943 -55749 -67679 -19931 -1677 -9889 -3377 9511 21217 31471 -2249 -37887
10526 -37887 -29239 -33789 -63460 -97860 -78871 -71860 -27636 -3154 15449 50066 37760 -10997
10514 -10997 -15888 -27232 -50856 -19866 9824 37996 15610 -31786 -4509 -20660 22550 -10302
10502 -10302 -24515 9537 -17922 -57112 -17535 -11245 7354 25410 -3652 -37874 -43852 -57595
10490 -57595 -32036 -50425 -63415 -31092 -36641 -74688 -106333 -60028 -3716 70117 94016 81593
10478 81593 42596 37323 17828 -38250 -55257 5963 -23071 -79622 -70445 -42419 -19529 21050
10466 21050 63112 73156 25486 11601 -10440 -16703 -514 -16866 -18094 2492 -24161 -26979
10454 -26979 -66641 -92892 -26486 5237 2147 17950 11132 26837 -24130 -95127 -123362 -130012
10442 -130012 -77119 19487 64740 45303 11355 -4531 -38356 -43242 -32731 -65342 -45743 -53054
10430 -53054 -67544 -48401 -65340 -5757 5710 -916 -4624 -3000 -4474 -11980 16417 20626 35783
10417 35783 37098 7698 31374 48125 27539 -28014 -18239 15812 -57827 -73466 -88784 -127825
10405 -127825 -129248 -87307 -37224 -30344 -17122 -10831 -39760 -58168 -29488 24847 21138 8447
10393 8447 17096 39261 69535 69162 -21383 -46558 -67952 -101978 -77205 -53004 -45899 -52922 -69428
10380 -69428 -95523 -101528 -66214 -52344 -57872 -62165 -81420 -81368 -60058 16833 41245 58753 35732
10367 35732 37835 40932 5451 -48818 -37621 1594 4326 4260 6651 67204 69218 49557 63405
10354 63405 35712 24847 11469 -49675 -80732 -88269 -85572 -64707 -105096 -74737 -58972 -12853
10342 -12853 -9810 1751 -313 -19415 -20746 -19788 -25839 -42889 -55155 -27444 -32637 -29486 -42946
10329 -42946 -18906 675 33758 63195 30663 26930 52771 29112 20278 46101 19906 64807
10317 64807 99027 83617 59983 21672 3997 -1355 -10087 23796 34451 34715 20195 56461
10305 56461 54851 41460 6493 3161 43869 15367 -27081 -44015 -60100 -70415 -87569 -69354
10293 -69354 -43579 -34903 14996 39303 45102 70192 55360 21207 24284 42939 44950 66013
10281 66013 78967 -18516 -80830 -65230 -1879 18720 -9144 7818 30031 36391 2962 -23122
10269 -23122 6679 -7603 -8694 -33989 970 28672 39570 68956 82247 112314 71078 14941
10257 14941 -21630 -1889 31928 67994 51324 22588 28687 35355 65699 62746 44182 3217
10245 3217 -21963 -11686 13094 12389 5707 -20303 -12436 1691 35051 45125 61593 -8854 -76083
10232 -76083 -62932 -28605 -29769 -5308 25579 26982 36840 12512 15431 30676 52359 19415
10220 19415 -6302 6013 18491 70537 102949 107859 108231 96535 66423 17879 -16306 -12673
10208 -12673 -2749 -28141 -52314 -81295 -90408 -16410 30932 -12225 -75208 -99287 -78179 -28026
10196 -28026 23229 12805 47965 38172 -12798 -2817 -50053 -40743 -40007 -42992 37408 56549 47949
10183 47949 23183 48340 49855 45796 92887 119097 115934 172522 180175 136681 73117 -5598
10171 -5598 -3718 2508 39784 88853 124916 82891 116204 128498 98161 68769 58913 30697
10159 30697 46103 6332 -46284 -52028 -38445 -25443 -23137 -15137 -932 -5772 1747 22816 29607
10146 29607 57512 88468 71440 84938 84888 53112 45696 75459 100028 70402 72777 15236 -1196
10133 -1196 72396 50709 -20288 -60785 -89848 -44976 13033 113221 171562 155078 76475 39489
10121 39489 48 -31815 -16069 36817 67822 42310 31725 11511 -40562 -67596 3020 44021
10109 44021 59894 7755 -41243 -15789 10101 42382 42909 32645 30496 -26533 -23701 -18176 -48213
10096 -48213 -52234 -32449 47828 86863 49188 43859 10296 -1406 4564 10357 24228 65889
10084 65889 62948 93678 57654 43985 27394 -3394 23180 19199 -6262 -8182 -20854 -16986
10072 -16986 -10966 6492 -25753 -26168 -29587 -3251 -8729 -4559 22917 74185 85224 43055 19522
10059 19522 -6877 34868 36302 5680 29398 64699 101031 152014 146772 90263 83597 72147
10047 72147 108045 118941 146722 163795 190156 176812 140387 215652 322429 356612 300150
10036 300150 198221 157582 154991 128393 85941 88564 97812 86827 52561 39914 31711 19863
10024 19863 -16725 -39562 -14118 8902 -5151 28989 46867 27841 26633 35013 48590 8669
10012 8669 29739 30200 -32965 -35960 -2390 31875 35161 18497 8453 34366 9405 26651 39684
9999 39684 63824 22813 33303 54428 83990 56927 40729 -1806 -34582 -22728 -5322 -19145
9987 -19145 -13121 -15942 -35526 -16441 -1875 -19038 -27782 28500 58266 -1847 -51529 -67585
9975 -67585 -107791 -84150 -56415 -51471 -14046 6981 -8871 -66561 -53227 -66869 -80484 -17560
9963 -17560 4978 16157 28412 10424 -50990 -91235 -68066 -27276 -39215 -74503 -111877 -129536
9951 -129536 -87112 -66022 -40360 -45068 -26845 -32871 -791 30905 21989 37416 -25510 -62671
9939 -62671 -67723 -41891 -759 35582 28704 -33351 -58291 -73787 -40159 -5651 -20043 -31837
9927 -31837 -15805 -30890 -41182 26643 53922 48446 57608 71170 79470 72271 41808 60073 49901
9914 49901 56464 36127 16744 31797 37946 47509 61481 56354 43317 10738 -32930 -62110 -68405
9901 -68405 -63187 -51649 -8657 -13974 -270 -1568 663 -915 39967 72986 43448 -9168 5946
9888 5946 22780 36321 13290 -10413 -1080 14450 39734 78700 131680 135085 113758 109862 61690
9875 61690 45690 56004 87541 93647 126899 196110 208764 183710 158739 162867 129902 68125
9863 68125 62075 46040 7993 4157 -21677 -12377 997 23600 53279 75798 61734 18771
9851 18771 26598 102296 136928 155339 170208 174697 157849 125470 121185 109696 69266 149823
9839 149823 219131 277981 281068 263463 245805 215751 310382 348751 337301 338709 309118 241273
9827 241273 271399 353373 348231 347523 305972 252447 207585 233486 267912 270055 307159 394844
9815 394844 451615 479375 457531 441181 478763 539297 540527 511229 491547 508705 510910 541907
9803 541907 568936 579446 602760 670154 716914 692085 719299 785292 824219 927508 993960
9792 993960 1032550 1099946 1184946 1285917 1334041 1306224 1160464 1014795 957687 858031 820224
9781 820224 819477 801908 855824 954293 1012492 1079554 1210647 1361630 1452413 1522631 1608773 1651325
9769 1651325 1704732 1688339 1577901 1505116 1393989 1300951 1211689 1110245 1014090 952487 932734
9758 932734 859292 779580 758298 809412 909240 1024994 1130591 1185336 1226128 1204282 1112402
9747 1112402 952223 791394 696739 667608 642600 603654 603199 586686 536167 495293 407714
9736 407714 373449 388469 437210 447582 421922 444750 428838 453883 518270 473319 447436 387409
9724 387409 341427 330586 299373 314675 298009 219724 203728 136203 109986 143031 162318 133843
9712 133843 125926 143152 155834 116691 87377 65402 96363 132562 161032 148515 156947 120178
9700 120178 102041 113283 179691 248197 196048 118162 86939 69378 58618 114378 132430 94228
9688 94228 96719 69795 12279 30860 24808 10929 -39205 -45192 23338 15344 41613 45663 68866
9675 68866 157986 161851 163675 163471 136473 107677 124752 131310 125459 142250 152259 147882 106792
9662 106792 119123 109138 106718 94031 46615 28849 75907 77583 59395 52263 -3581 15612
9650 15612 55893 81255 72003 91412 114641 150640 195265 166523 89061 43188 17454 -10808
9638 -10808 -32171 -7305 44139 80413 126868 109464 41627 -9560 16048 25254 219 39096
9626 39096 69357 4860 -31681 23825 24782 29622 13495 8205 24350 44704 10059 -29219 14230
9613 14230 26298 39676 75279 103452 134573 106353 66406 93434 64854 8084 -321 28491
9601 28491 62364 91163 78589 68187 36208 23412 60193 52221 54445 10235 50736 94291
9589 94291 55225 -70127 -94462 -73744 -50118 -60338 -80300 10628 80328 87849 74327 25964
9577 25964 6993 8706 -25797 -6527 40974 5633 -42106 -40697 18304 84443 82457 90998 115606
9564 115606 69046 78774 120786 111548 121147 145901 114683 33820 26350 41499 28251 9643
9552 9643 -20210 6255 16763 38373 71513 93112 97333 83036 116991 118599 111549 92698 59782
9539 59782 90328 71124 33018 6034 -9877 1044 11183 13170 24715 20007 -6080 13029
9527 13029 54248 1730 -16695 3822 -26183 -20408 2967 26987 77551 67145 52443 39127
9515 39127 38562 29013 3930 17536 125 -35126 -43898 -12882 -25583 -16612 26197 35086 25024
9502 25024 35955 60204 78924 59054 56432 61777 48762 36070 -6425 7504 45214 65076
9490 65076 37866 43480 9439 -37042 -57581 -70324 -48424 -18903 -29469 -37882 8542 26725
9478 26725 80073 83370 -2435 -35547 -53124 10363 37143 68117 77261 81666 91998 68103
9466 68103 44665 55544 34098 9623 11502 4352 -15482 -6335 -9418 26232 14624 7583 59958
9453 59958 79306 71363 107107 97658 82119 58424 20422 20801 52459 57691 35215 87694 128311
9440 128311 154104 156095 143650 108350 50394 30979 39803 23984 25210 13778 40966 90040
9428 90040 100364 91078 97561 70329 74135 96116 73350 82949 60347 10023 41228 79011 65835
9415 65835 -4161 3767 41011 89102 95981 61588 63918 88109 110679 67600 97695 136460
9403 136460 96627 52460 14935 25744 18373 24830 28785 62910 81826 56144 73961 78936
9391 78936 77033 83066 104361 87059 146775 143895 135954 154850 141015 104192 66202 59533 73659
9378 73659 48386 78995 128064 129204 89987 111764 106155 65827 18552 -34660 36855 107423
9366 107423 97231 96959 78064 110496 191543 251930 209446 203236 216642 196038 165710 133384
9354 133384 151865 150965 96983 102372 113423 101807 81205 88796 99213 94614 33801 -24502 -61276
9341 -61276 -24339 15819 25132 35784 95963 160429 170748 135496 104789 56164 87114 92917
9329 92917 116212 150362 134212 107386 90353 91164 87479 124526 85140 97097 70789 89167
9317 89167 56213 42626 75695 85367 76879 28806 10753 64774 104673 105787 119719 127507 150335
9304 150335 125232 69755 77945 113234 135767 135904 95940 55153 76971 85219 123274 160933
9292 160933 123914 94164 148328 193449 167136 124660 162554 157866 141618 153033 138274 132580
9280 132580 109976 120382 112128 85808 67531 39205 42999 45246 66943 42707 78813 101373
9268 101373 72294 97535 135206 143366 132901 156868 194433 203396 186297 188343 132071 140068
9256 140068 167904 170445 124640 83601 97590 122883 151682 170933 204415 171760 141491 121773
9244 121773 89192 75829 62659 114344 195872 198886 207979 239003 199619 196278 227546 171811
9232 171811 76090 58109 106563 103879 116355 157811 182695 225687 204333 226576 234272 259104
9220 259104 222081 208915 243293 290860 307177 346893 379648 336788 350014 390149 426471 455899
9208 455899 484962 498006 471144 435099 444827 500024 498815 543248 558552 549480 572671 677065
9196 677065 762798 784016 817901 929187 979184 985404 1046850 1118788 1204993 1293004 1393834
9185 1393834 1477059 1613504 1823999 1993427 2174731 2435849 2706179 3084033 3573538 4164541
9175 4164541 4816531 5642165 6694617 7918881 9512020 11634201 14438434 18069138 22706498
$$ [...]
##END NTUPLES=NMR SPECTRUM
##END=
