##TITLE=Analysis number 319823
Compound Code cc 09603
Book Reference a
Project Code adrs
Chemist Name melford
##JCAMPDX= 6.0         $$ Bruker NMR JCAMP-DX V2.0
##DATA TYPE= NMR SPECTRUM
##DATA CLASS= NTUPLES
##ORIGIN= Bruker BioSpin GmbH
##OWNER= nmr
$$ XWIN-NMR		Version 3.5
$$ Wed May 31 11:24:37 2006 GMT Daylight Time (UT+1h)  MAYBRIDGE\nmr@NMR_250MHZ
##.OBSERVE FREQUENCY= 250.131544655141
##.OBSERVE NUCLEUS= ^1H
##.ACQUISITION MODE= SIMULTANEOUS (DQD)
##.ACQUISITION SCHEME= undefined
##.AVERAGES= 16
##.DIGITISER RES= 18
##SPECTROMETER/DATA SYSTEM= dpx250
##.PULSE SEQUENCE= zg30
##.SOLVENT NAME= CDCl3
##.SHIFT REFERENCE= (INTERNAL, CDCl3, 0, 16.522)
##AUDIT TRAIL= $$ (NUMBER, WHEN, WHO, WHERE, WHAT)
$$ ##TITLE= Audit trail, XWIN-NMR		Version 3.5
$$ ##JCAMPDX= 5.01
$$ ##ORIGIN= Bruker BioSpin GmbH
$$ ##OWNER= nmr
$$ C:\u/data/dgb/nmr/ADRS/5450/pdata/1/auditp.txt
$$ ##AUDIT TRAIL=  $$ (NUMBER, WHEN, WHO, WHERE, WHAT)
(   1,<2006-05-31 11:24:16.93 +100>,<MAYBRIDGE\nmr>,<NMR_250MHZ>,
      <created by zg, POWCHK disabled, PULCHK disabled
       configuration hash MD5:
       E2 DF 36 D8 04 B2 41 60 5A D7 A3 38 5A 4B D0 FE
       data hash MD5: 64K
       A7 ED 5C 6A 49 62 D7 F0 09 67 A7 B6 93 1B 42 D4>)
(   2,<2006-05-31 11:24:29.18 +100>,<MAYBRIDGE\nmr>,<NMR_250MHZ>,
      <Start of raw data processing
       ef LB = 0.3 FT_mod = 6 PKNL = 1 SI = 32K 
       data hash MD5: 32K
       5F 93 13 1D 66 45 61 C8 75 4B 6B 17 3E 9E CD A7>)
(   3,<2006-05-31 11:24:30.65 +100>,<MAYBRIDGE\nmr>,<NMR_250MHZ>,
      <apk 
       data hash MD5: 32K
       42 58 10 ED 59 A4 82 D1 9B C6 F6 D8 0A 72 0F 61>)
(   4,<2006-05-31 11:24:31.45 +100>,<MAYBRIDGE\nmr>,<NMR_250MHZ>,
      <abs ABSG = 5 
       data hash MD5: 32K
       8D 8E 4F 09 97 BB 85 EC E7 B6 3E 71 03 D7 E9 75>)
$$ ##END=
$$ 
$$ hash MD5
$$ 30 94 F4 97 64 DF 4F F9 D0 FE 60 C4 98 36 A4 2E
##$RELAX= 
##$RELAX= 
##$RELAX= 
##$RELAX= 
##$RELAX= 
##$RELAX= 
##$RELAX= 
$$ Bruker specific parameters
$$ --------------------------
##$DU= <C:\u>
##$EXPNO= 5450
##$NAME= <ADRS>
##$PROCNO= 1
##$TYPE= <nmr>
##$USER= <dgb>
##$AMP= (0..31)
100 100 100 100 100 100 100 100 100 100 100 100 100 100 100 100 100 100 
100 100 100 100 100 100 100 100 100 100 100 100 100 100 
##$AQSEQ= 0
##$AQ_mod= 3
##$AUNM= <au_zg>
##$AUTOPOS= <8 >
##$BF1= 250.13
##$BF2= 250.13
##$BF3= 250.13
##$BF4= 250.13
##$BF5= 500.13
##$BF6= 500.13
##$BF7= 500.13
##$BF8= 500.13
##$BYTORDA= 1
##$CFDGTYP= 0
##$CFRGTYP= 5
##$CHEMSTR= <none>
##$CNST= (0..31)
1 1 145 1 1 1 1 1 1 1 1 1 1 1 1 1 1 1 1 1 1 1 1 1 1 1 1 1 1 1 1 1 
##$CPDPRG= <>
##$CPDPRG1= <>
##$CPDPRG2= <>
##$CPDPRG3= <>
##$CPDPRG4= <mlev>
##$CPDPRG5= <mlev>
##$CPDPRG6= <mlev>
##$CPDPRG7= <mlev>
##$CPDPRG8= <mlev>
##$CPDPRGB= <>
##$CPDPRGT= <>
##$D= (0..31)
0 1 0 0 0 0 0 0 0 0.06 0 0 0 0 0 0 0.0002 0 0 0 0 0 0 0 0 0 0 0 0 0 0 
0 
##$DATE= 1149071055
##$DBL= (0..7)
120 120 120 120 120 120 120 120 
##$DBP= (0..7)
150 150 150 150 150 150 150 150 
##$DBP07= 0
##$DBPNAM0= <>
##$DBPNAM1= <>
$$ [...]
##$SUBNAM7= <"">
##$SUBNAM8= <"">
##$SUBNAM9= <"">
##$SW= 20.6930455092707
##$SWIBOX= (0..15)
0 0 3 0 0 0 0 0 0 0 0 0 0 0 0 0 
##$SW_h= 5175.983436853
##$TD= 65536
##$TD0= 1
##$TE= 294.16
##$TE2= 300
##$TE3= 300
##$TEG= 300
##$TL= (0..7)
0 120 120 120 120 120 120 120 
##$TP= (0..7)
150 150 150 150 150 150 150 150 
##$TP07= 0
##$TPNAME0= <>
##$TPNAME1= <>
##$TPNAME2= <>
##$TPNAME3= <>
##$TPNAME4= <>
##$TPNAME5= <>
##$TPNAME6= <>
##$TPNAME7= <>
##$TPOAL= (0..7)
0.5 0.5 0.5 0.5 0.5 0.5 0.5 0.5 
##$TPOFFS= (0..7)
0 0 0 0 0 0 0 0 
##$TUNHIN= 0
##$TUNHOUT= 0
##$TUNXOUT= 0
##$USERA1= <user>
##$USERA2= <user>
##$USERA3= <user>
##$USERA4= <user>
##$USERA5= <user>
##$V9= 5
##$VALIST= <valist>
##$VCLIST= <CCCCCCCCCCCCCCC>
##$VD= 0
##$VDLIST= <DDDDDDDDDDDDDDD>
##$VPLIST= <PPPPPPPPPPPPPPP>
##$VTLIST= <TTTTTTTTTTTTTTT>
##$WBST= 1024
##$WBSW= 4
##$XGAIN= (0..3)
0 0 0 0 
##$XL= 0
##$YL= 0
##$YMAX_a= 278289
##$YMIN_a= -307767
##$ZGOPTNS= <>
##$ZL1= 120
##$ZL2= 120
##$ZL3= 120
##$ZL4= 120
##$ABSF1= 16.522
##$ABSF2= -4.171173
##$ABSG= 5
##$ABSL= 3
##$ALPHA= 0
##$AQORDER= 0
##$ASSFAC= 0
##$ASSFACI= 0
##$ASSFACX= 0
##$ASSWID= 0
##$AUNMP= <proc_1d>
##$AZFE= 0.1
##$AZFW= 0.1
##$BCFW= 0
##$BC_mod= 0
##$BYTORDP= 0
##$COROFFS= 0
##$CY= 12.5
##$DATMOD= 1
##$DC= 0
##$DFILT= <>
##$DTYPP= 0
##$F1P= 14.0000005364418
##$F2P= -0.99999901652339
##$FCOR= 0.5
##$FTSIZE= 32768
##$FT_mod= 6
##$GAMMA= 0
##$GB= 0
##$INTBC= 1
##$INTSCL= 1
##$ISEN= 128
##$LB= 0.3
##$LEV0= 0
##$LPBIN= 0
##$MAXI= 10000
##$MC2= 0
##$MEAN= 0
##$ME_mod= 0
##$MI= 0
##$NCOEF= 0
##$NC_proc= -5
##$NLEV= 6
##$NOISF1= 0
##$NOISF2= 0
##$NSP= 0
##$NTH_PI= 0
##$NZP= 0
##$OFFSET= 16.522
##$PC= 1
##$PHC0= 177.428
##$PHC1= 2.758917
##$PH_mod= 1
##$PKNL= yes
##$PPARMOD= 0
##$PSCAL= 4
##$PSIGN= 0
##$REVERSE= no
##$SF= 250.13
##$SI= 32768
##$SIGF1= 0
##$SIGF2= 0
##$SINO= 400
##$SIOLD= 32768
##$SREGLST= <1H.CDCl3>
##$SSB= 0
##$STSI= 32768
##$STSR= 0
##$SW_p= 5175.98343685301
##$SYMM= 0
##$S_DEV= 0
##$TDeff= 65536
##$TDoff= 0
##$TI= <Analysis number 999999
Compound Code 99
Book Reference 9
Project Code 9>
##$TILT= no
##$TM1= 0
##$TM2= 0
##$TOPLEV= 0
##$USERP1= <user>
##$USERP2= <user>
##$USERP3= <user>
##$USERP4= <user>
##$USERP5= <user>
##$WDW= 1
##$XDIM= 32768
##$YMAX_p= 481484074
##$YMIN_p= -875875
$$ End of Bruker specific parameters
$$ ---------------------------------
##NTUPLES= NMR SPECTRUM
##VAR_NAME=  FREQUENCY,     SPECTRUM/REAL,   SPECTRUM/IMAG
##SYMBOL=    X,             R,               I
##VAR_TYPE=  INDEPENDENT,   DEPENDENT,       DEPENDENT
##VAR_FORM=  AFFN,          ASDF,            ASDF
##VAR_DIM=   32768,         32768,           32768
##UNITS=     HZ,            ARBITRARY UNITS, ARBITRARY UNITS
##FACTOR=    0.157963299565203, 1,           1
##FIRST=     4132.6476996994, 0,             0
##LAST=      -1043.33573715361, 0,           0
##MIN=       -1043.33573715361, -875875,     0
##MAX=       4132.6476996994, 481484074,     0
$$ Real data points
##PAGE= N=1
##DATA TABLE= (X++(R..R)), XYDATA
$$ [...]
28809 -108791 -83094 -183482 -217651 -385476 -284840 -155643 -44207 26448 41181 60357
28799 60357 -57249 -237455 -309530 -267330 -306487 -162132 -42809 2225 96462 223937 74791
28788 74791 -26513 -109752 -78068 -260789 -314060 -486970 -452645 -260171 -90374 -91493 15218
28777 15218 176725 -26169 -29610 -62097 -189483 -148766 -57105 93624 108434 346915 231214
28766 231214 115509 256771 210384 105589 144139 256831 272191 171575 -4178 -102493
28756 -102493 89270 467577 481029 521577 440386 176545 204796 159820 49079 -100863
28746 -100863 98506 157053 -4662 116349 73911 -81004 -165953 186345 245180 202192
28736 202192 28865 -77376 -138611 48917 331965 337743 430474 341912 298341 42198 167563
28725 167563 -21505 180989 213867 180300 65737 205687 61006 118241 3496 -217448
28715 -217448 -197455 -180066 -238965 -158003 -29362 190795 558474 575130 354327 291701 149764
28704 149764 71228 -121343 -185452 -127206 69175 250370 484299 568545 409232 104953
28694 104953 -249150 -408655 -431814 -237750 -94099 -111831 10781 58475 1650 -20540
28684 -20540 -218369 -430390 -240877 918 10116 27776 99970 153817 -23303 -248758 -342827
28673 -342827 -444893 -513199 -597489 -452371 -371817 -128606 130275 152611 281915 244621
28663 244621 130641 -27884 34788 -122813 -234799 -300800 -258993 -43283 74678 172097
28653 172097 175073 -70463 47606 172757 -27695 -307240 -349953 -357581 -396009 -384918 -331475
28642 -331475 -176083 -116676 95104 145483 161825 152995 -8641 -274061 -224051 -278275 -380290
28631 -380290 -376517 -304802 -141918 -139806 -178352 -251523 -364433 -214169 -73574 -6233 97729
28620 97729 -65474 -41737 -21574 183073 92336 -113511 -80825 -109475 -200679 98154 164417
28609 164417 171090 198013 134467 135983 283287 312379 181418 333119 385379 330613 359425
28598 359425 272272 43647 93159 275391 272951 226627 544871 543129 392088 184695 -36242
28587 -36242 -141105 -297233 -232158 -815 -16214 -77496 66922 39335 74914 313505 311577
28576 311577 394231 472210 338416 155021 12469 239658 197615 -37036 10665 126530
28566 126530 133131 -19011 -167980 -131929 -299332 -349191 -278151 -280834 -156609 -17580 111746
28555 111746 144193 -16938 -334324 -485478 -484960 -533599 -342310 -39835 93262 194848
28545 194848 85217 -80473 43935 45701 115935 161618 103537 -193495 -346753 -386080 -276704
28534 -276704 33876 201210 297703 72899 -206670 -338463 -352970 -391526 -355137 -4016
28524 -4016 58722 64058 101889 158777 130374 174225 346562 224627 202160 336047 43886
28513 43886 63480 241796 -74308 -273092 -269874 -117817 -47916 -196077 -39902 237052
28503 237052 342715 319233 277579 -14115 -92698 2676 -68985 -18415 334758 227369 440909
28492 440909 398575 452316 456207 283681 214584 186998 151533 68345 61864 217095 173777
28481 173777 17018 -170357 -99407 259716 65969 -61680 -247555 -233370 -96164 117408
28471 117408 29625 89682 170272 111664 32707 221634 141579 79215 428446 436637 381351
28460 381351 333182 489384 458892 384651 227182 2869 -153191 -174413 -323521 -376996
28450 -376996 -286204 -295355 -198218 33820 -1239 -37364 -85656 -210343 -103434 167313 213489
28439 213489 169649 136543 -151939 -45662 -59103 -111207 84953 144863 85157 75241 -76060
28428 -76060 -275843 -25132 -55503 -4324 71716 174528 287076 303165 270221 166974 152277
28417 152277 96439 -92696 59270 58758 -79129 -23303 -177887 -15754 133443 -37146
28407 -37146 59515 123146 9384 -224891 -258739 11071 95670 -28566 87469 116064 212924
28396 212924 232339 431943 338079 -110660 -371201 -139992 -95314 -60031 56444 57478 170651
28385 170651 194075 227198 80727 130644 180077 90429 -15771 -54641 -73540 138109 236994
28374 236994 272699 123430 -39535 -2620 -92694 -10564 53937 -250280 -508588 -266445
28364 -266445 -50737 104024 152677 80831 108302 87500 -133969 -279909 -24812 60224
28354 60224 9837 -92724 -191349 -107035 -241020 -323583 -460030 -472921 -413948 -463128 -303315
28343 -303315 -88136 116659 351802 379009 168402 100942 -59558 -143613 -236593 -296339
28333 -296339 -46890 197990 330528 144912 346848 559537 481165 434129 419901 283888
28323 283888 75915 78160 201328 345119 180693 112250 153238 320298 315937 244150 -24280
28312 -24280 -68758 -62907 121241 128252 -15469 46057 66241 -44767 -234635 -466078 -604671
28301 -604671 -674707 -519596 -314510 -281025 -301118 -391780 -579247 -595531 -404165 -270796
28291 -270796 -262832 -132688 -239278 -54256 48007 -96879 -265695 -440059 -557587 -511124
28281 -511124 -208028 -130782 -94611 -43100 102242 108027 169263 174785 74072 73550 26249 -20440
28269 -20440 -141835 -677 98183 83415 320847 272772 101235 -18753 -144944 -329131
28259 -329131 -409749 3826 -66348 -273063 -116140 303005 493701 294853 195528 136277
28249 136277 277881 359740 360623 363321 108252 29126 225745 405873 157591 34692 116599
28238 116599 125042 94065 234144 105906 -89130 -149281 46891 175430 223255 420079
28228 420079 496286 589139 381132 282306 229149 334042 288461 334116 388766 206378 49922
28217 49922 144728 196808 263073 149778 52512 123059 57411 65622 74729 -73461 -163274 -36351
28205 -36351 73205 -23155 -3929 53628 -68433 -1502 25172 10132 10326 72486 -21084 -186620
28193 -186620 -413000 -622475 -521502 -111813 -134503 -111827 -3993 -70636 -205173 -17970
28183 -17970 -29509 -138247 -119497 -64265 8230 -57916 98352 264577 46498 -3552 -151930
28172 -151930 -18584 20645 -23504 -143933 -282671 -337597 -231874 -316138 -161901 -178168
28162 -178168 -185477 -225252 -107551 227878 287688 162260 269171 166466 1865 -34067
28152 -34067 32750 323381 519191 367491 131305 -64160 -42167 78194 4582 -252904
28142 -252904 -307268 -54907 56797 -157716 -256474 18226 305090 477627 603687 653855
28132 653855 274291 17478 -42594 62932 92641 5900 -109856 -67102 289988 190352
28122 190352 41079 58580 118513 73993 -14337 -16814 -10496 -113693 60981 69014 -118623
28111 -118623 -104038 -125664 8606 51160 112968 270156 100523 -116255 -101350 -56385 -107416
28100 -107416 -154316 67448 254492 14228 -259965 -117064 65165 -126477 -56363 115750
28090 115750 180582 353142 305073 42975 -231603 -110298 -114490 -156646 -239479 -111501 153994
28079 153994 225744 -118273 -259043 -48343 201271 308459 -43672 -458122 -398764 -258292
28069 -258292 25278 173797 -25444 -46987 280020 517607 445915 340313 90641 82968
28059 82968 267770 235638 73124 -59040 -216660 -313779 -14856 -23282 189623 105084 262792
28048 262792 -204177 -359463 52505 244613 206167 236918 214731 -341168 -359587 80422
28038 80422 109705 88024 72569 123773 149885 63621 34728 173981 72095 -25878 396722
28027 396722 304652 68922 71585 66848 156292 378435 225987 100249 -16850 -354570 -321829
28016 -321829 -184284 -54798 -63288 -224731 -116757 -168027 -45656 -194542 -170850 -254809
28006 -254809 -154970 -31973 -160461 -2582 -115228 -205782 -407236 -401846 237405 502662
27996 502662 410809 135138 -345095 -418555 -248715 -292101 -303731 11218 77709 173271 222940
27985 222940 177773 90485 -132818 -156458 -100048 -30224 110531 -31899 -220513 -594932
27975 -594932 -610531 -436204 5796 141571 54495 -152581 -113925 -23631 84993 111412
27965 111412 145741 115303 -19135 -468629 -543709 -298248 110730 281749 317038 459497
27955 459497 368997 404977 278172 192149 145200 224142 138378 105712 97329 124174 -232695
27944 -232695 -267533 5403 296202 198943 110916 -65416 -351747 -413677 41718 171641
27934 171641 -132500 -218274 59542 176339 370645 297201 249156 417433 298746 293748
27924 293748 282820 74635 -118503 -67505 200378 254125 225620 32470 168347 63781
27914 63781 -18707 22750 -39014 -176340 -160695 136724 77946 -312313 -312803 -230078 -9239
27903 -9239 35370 -45300 -56996 -168296 75791 115477 189129 221782 306011 255939 -26129
27892 -26129 -86059 276028 297790 170326 -178481 -200027 43920 87529 127859 -26025 -6883
27881 -6883 42658 152261 222041 137040 91925 2094 45863 222585 206265 -99018 -106218
27870 -106218 83654 421159 293933 -112741 -262297 -253156 39502 91628 206238 192730
27860 192730 -9808 -121013 -24644 248918 162782 18681 47041 -129422 -263048 -291829
27850 -291829 -337751 -252571 -494262 -458478 -284523 -45719 -81962 -47786 176567 168220 361507
27839 361507 373316 143984 -66680 21892 162748 260253 135775 -41048 -67709 -450447
27829 -450447 -371588 -153106 -361094 -402320 -356628 -392156 -400520 -105256 150225 325310 254513
27818 254513 -3167 -104345 -99195 -89244 -113686 93019 160239 143764 280969 175407 67471
27807 67471 -82052 -27220 33381 -105026 -191952 -121369 -142342 -167779 -194576 -182863 -104759
27796 -104759 138870 129786 83702 -129160 -304967 -10958 142545 103102 2026 -208066
27786 -208066 -203680 -118644 -15884 72870 -69459 -177108 -106361 -240179 -322817 -365733 -474256
27775 -474256 -257799 -43596 -185246 -306080 -138752 -208427 -490347 -440486 -309952 -133334
27765 -133334 166652 221334 -18342 -101297 -242415 -258702 -89702 26304 186539 -68470
27755 -68470 -193095 39951 172349 34824 -151783 -46802 235142 115258 -358540 -365338
27745 -365338 -304569 -169027 3378 -79673 -85237 23256 58709 -278564 -357153 -307595 -135023
27734 -135023 -103989 -30309 78580 77564 -24931 -189645 -89851 206313 519117 400792
27724 400792 369385 291922 305604 261066 155475 32060 -136209 -184598 18761 32288 -107810
27713 -107810 -178514 -213488 255022 429556 390550 372037 316214 161419 90445 -84647 -90302
27702 -90302 -33065 13196 176794 316924 423256 185989 115908 292369 474702 173389
27692 173389 144148 32759 -19289 38365 246185 134107 -13446 -27251 -18725 -143506 -81370
27681 -81370 -56414 -215076 -120462 91572 78035 -17906 57985 179459 -68757 -181848 -185386
27670 -185386 -196837 -178821 -191270 -131514 -96580 -7286 130085 -161252 -362062 -329486 -265435
27659 -265435 -202326 -152526 37088 8371 1873 93988 432939 571795 549471 418122 148973
27648 148973 192788 -16028 -335325 -107189 64045 -79588 -169355 -242587 -15748 208085
27638 208085 140193 245394 358864 83711 -365723 -190688 -28183 -105671 -106530 -179754 30816
27627 30816 167891 68578 -117467 -162331 -41829 -41519 16433 369449 396653 335656 320381
27616 320381 172303 299537 494403 338701 126774 -86649 37349 72766 228919 -21610
27606 -21610 -139438 -254038 106929 246554 295943 196222 299699 188371 392075 260262
27596 260262 67056 36687 -300240 -416451 -280644 -115588 -5132 18591 210598 85149
27586 85149 25783 -181787 -333095 -205399 -315930 -245636 -34104 -188416 -2789 375904
27576 375904 532913 278095 110794 103299 152435 72065 191858 88841 -130237 -104525
27566 -104525 -137681 -158980 106050 256708 228072 160642 4164 191016 70551 -140725
27556 -140725 -266163 4420 -101333 -140425 -94372 -119757 -176710 -230004 -135048 -171617 -102946
27545 -102946 50006 238325 285096 360884 97739 -88369 -98628 7845 118213 43416
27535 43416 -336581 -286517 -145276 -342262 -263101 69216 115449 -62518 -124543 -70893 -17329
27524 -17329 -113021 -254506 -116033 48852 288182 549508 240639 -97972 -48431 -49140 58005
27513 58005 111002 22730 -85183 119580 185625 213282 385146 495655 404716 323556 178963
27502 178963 182557 248454 243065 226390 96100 92555 -75872 -126118 212940 353606 60693
27491 60693 -89212 96501 280901 126478 -180909 -292866 -72140 4966 177143 150356
27481 150356 102335 -15530 -63010 -364299 -227571 -74407 -39700 106662 54111 -93148
27471 -93148 -69932 -179895 -280337 98174 334597 556334 329328 183441 188631 139585
27461 139585 -134085 -207483 -87432 42959 110317 242087 322521 143676 -123490 -178023
27451 -178023 -81857 2423 -41183 -163798 -291748 -347554 -210365 41619 11586 -90722
27441 -90722 24474 14988 -5366 276610 202693 -45140 -167999 -109168 -16297 140406 301216
27430 301216 499471 419517 119409 6840 -165593 -272285 -351544 40503 337712 409569
27420 409569 247847 464229 346878 158496 -255550 -468865 -309426 -207018 -200611 56794
27410 56794 -250999 -420061 -381112 -153107 -104851 72752 -97643 -54492 50141 56859 83408
27399 83408 211384 81320 33606 -58708 -280495 -505950 -442168 -183240 -94979 -50435 -107993
27388 -107993 -86777 -56475 -72412 242529 477746 237555 231702 270754 313638 30136 -165665
27377 -165665 -8768 68571 85061 217151 161156 39284 -6574 152545 161671 -91190 -305374
27366 -305374 -305329 -192645 -396075 -312778 -111579 254211 457798 398844 316833 367422 40302
27355 40302 -116437 -55239 152514 143453 214601 343253 129196 -113887 -228285 36492
27345 36492 238017 405064 445448 290293 324401 68181 -172017 -141561 -118795 -101762 -165379
27334 -165379 -175018 -130226 -30849 103403 -5559 71146 247554 -26528 -196896 -236611 -174287
27323 -174287 -209008 -210837 6254 -28063 -21548 -114616 -273155 -546830 -395397 -193691 -126993
27312 -126993 -77212 21473 -16960 -313534 -152949 -59700 110108 491878 393284 151240
27302 151240 150319 230743 230097 97646 -278215 -383284 -159146 13292 177150 360017 471309
27291 471309 418030 218245 39696 147778 -105981 -332880 -103524 -181670 -359283 -410776
27281 -410776 -255305 -203044 -355459 -303677 -301425 -405145 -505573 -295572 33726 30199 177370
27270 177370 167307 -73373 -6372 45382 384404 406554 262228 168653 132699 47901 -110400
27259 -110400 -186005 38692 106104 76995 103586 73757 36441 -163285 -385710 -378731 -241000
27248 -241000 -220252 -235493 -275165 7987 160012 -78142 -329874 -261710 -253787 -362605 -349874
27237 -349874 -303327 -193101 -147701 -143662 65606 4527 -79085 89348 254469 456088 180828
27226 180828 108317 79752 -104444 -89579 -83023 -172119 -389600 -413982 -232203 -161491 -31533
27215 -31533 92092 75037 133997 144008 372665 579890 542267 405581 162445 518303
27205 518303 556018 442321 567155 270175 93188 -30440 186129 312467 261878 235203
27195 235203 404552 303080 189950 -32868 -61239 -184161 -178611 -224946 -298724 -155564
27185 -155564 75111 269690 545486 398186 222911 254062 170986 315097 447038 230832
27175 230832 316943 332117 309275 393182 336646 314876 472087 416292 165150 268048 405465
27164 405465 308949 254673 178302 89297 148654 192715 58704 -3630 -81911 -373218 -376857
27153 -376857 -137153 -224126 -404695 -471955 -185392 116570 164378 -296053 -299955 -59419
27143 -59419 -105720 50674 205827 -39433 -266028 -82662 -47826 73240 19393 -128696
27133 -128696 -204903 -285315 -350985 -328380 -423412 -317776 -293862 -185324 -81165 -164605 -221021
27122 -221021 -59568 86756 135684 -29612 -83817 93191 359906 442805 523821 398201
27112 398201 439717 221232 -59509 -252428 -56703 75273 210550 422567 305720 292359
27102 292359 468083 485148 388274 344878 152700 67863 -378 120848 211776 90022 -17978
27091 -17978 -46360 -64698 -243094 -166916 -50490 223988 427794 351226 304431 334334 63651
27080 63651 -159028 -32055 -59201 -25257 59853 35356 -60649 -161583 -9554 23845 20590
27069 20590 40972 75431 -114591 76353 33033 -140580 -333542 -476639 -271949 -98316
27059 -98316 -42468 -214875 -307078 -423353 -473977 -295467 -111829 -205947 -153423 -9896 45426
27048 45426 -69819 -90377 43381 76456 37683 -10325 168874 325807 254283 -17078 -158483
27037 -158483 -101404 -140043 -266748 -165834 -184889 -143460 -220528 -263703 -107316 -144949 -266103
27026 -266103 -558335 -381669 80736 237545 145352 351031 469279 361117 293328 398589
27016 398589 202401 -47356 -59738 -75710 118322 310599 176249 165235 209423 41996
27006 41996 -68118 -112125 6157 118015 152720 225031 361171 223406 252481 249535 206372
26995 206372 349689 193577 -278047 -289962 99053 457480 215602 16519 173280 246556
26985 246556 94626 -357772 -550047 -396338 -393951 -352801 -262434 76440 16102 -143049
26975 -143049 -116784 60592 -141890 -90961 107786 84299 34744 -127901 -277110 -105068
26965 -105068 66233 -53437 -155029 -79996 26198 -50900 -47979 -43200 -173052 -167276 23859
26954 23859 70776 -3275 -151101 -80541 -121850 -241071 -235129 19086 304365 130338 78131
26943 78131 141349 146851 108516 211585 143594 194747 196496 333802 411674 325183 90878
26932 90878 261736 452981 288142 -117894 -240037 -145593 -124072 -128445 -87476 46108 -164439
26921 -164439 -394592 -264046 -21494 217456 274811 147091 227667 289010 113050 170794
26911 170794 104348 -67435 -83786 -120253 -405974 -551116 -382981 -369174 -347319 -286310 -289469
26900 -289469 -252475 -106189 58034 325425 414254 294501 215845 234273 162504 209897 246135
26889 246135 242196 290013 81239 320538 688253 636257 507941 407260 279975 -18836
26879 -18836 -83669 -354271 -377182 -254021 48034 -45332 -21482 79740 -33743 -71038 13432
26868 13432 347701 212998 107882 44771 -66281 -152339 -179361 -55881 -142543 -164907 -99150
26857 -99150 156022 341766 440613 315110 236657 177957 132075 295639 199184 58782 179490
26846 179490 -102852 -216034 -241161 -313409 -222085 -115611 -290773 -430077 -449538 -586452
26836 -586452 -774771 -600091 -257601 -269330 -302365 -235252 -240017 -186173 -56382 223045 472677
26825 472677 619652 419921 273562 151860 85582 -121524 -269911 -163990 76262 323267
26815 323267 99043 -192280 -300334 -409577 -317788 -317927 -182271 -176787 -133222 -313631 -213120
26804 -213120 -201790 -209094 -68649 -96521 112814 53080 -38685 -360071 -268399 5163 -86553
26793 -86553 -165470 -122271 208864 459165 438271 136528 31827 210277 236597 225383 149035
26782 149035 13339 20755 48280 -50133 17828 -86942 -263651 -412310 -288658 -222155 -426239
26771 -426239 -642098 -532750 -158421 342710 567632 464811 270639 96348 142443 99470
26761 99470 4076 36489 61474 -92763 -84681 -91615 -235537 -346839 -460877 -338129 -39028
26750 -39028 322002 318911 149026 14465 228339 106694 -100803 -59342 -58405 -51754 -128756
26739 -128756 -52107 80151 179446 357680 190386 -84907 -51927 7055 -7180 -413911
26729 -413911 -471401 -196111 -23868 292861 419253 271482 220938 366480 377946 163370
26719 163370 -2371 -155754 -176776 -24531 -104190 -162953 -94690 -64274 -85431 -357559 -397356
26708 -397356 -342780 -407073 -242256 -252358 35421 220954 181935 243601 274762 317149 249920
26697 249920 -42695 -312982 -91112 271283 308519 234459 188635 115044 106559 327408 244389
26686 244389 196634 225920 194305 213862 -87339 -425060 -405813 -131058 122028 21788
26676 21788 -37513 -151634 -197972 38064 288916 22020 -45090 -196748 -93078 7130
26666 7130 114293 232236 113011 162815 400358 274197 146037 57864 104957 -64729
26656 -64729 -208268 40999 7489 18014 27718 121585 225629 143496 -133940 -383348 -408559
26645 -408559 -49464 25800 38360 23771 170997 200774 102460 358660 417263 259925 206521
26634 206521 192522 67454 -64810 -87821 -59801 117976 -126277 -311592 -200152 -168003
26624 -168003 -122013 -121657 -81798 95270 -46593 -265310 -230823 -135084 -179712 -272036 -162190
26613 -162190 -109151 -148367 -96435 105761 124212 189530 175711 412033 327297 82699 -134166
26602 -134166 116047 164918 64895 -45487 -94406 148595 219409 327620 231624 -128701
26592 -128701 -192115 -164219 -178571 184 -36689 -26379 125279 179836 184729 353430 591884
26581 591884 633923 452189 463055 446849 -17775 -101932 137435 140709 143255 -134494 -93305
26570 -93305 -146500 170113 419256 409465 496639 435834 439285 300924 281586 153279 49878
26559 49878 115267 51070 114943 268344 238378 -216739 -263570 -63219 -210687 -72841 -28257
26548 -28257 12975 -164235 271335 193593 144671 333241 233484 213722 219076 54852 -224564
26537 -224564 -209178 -404143 -609512 -420767 -259477 -201229 -83478 -23974 -19704 -178014
26527 -178014 -3823 -182278 -205304 16791 78861 173027 207417 -203737 -248105 -221816 -306965
26516 -306965 -417561 -431499 -413161 -278224 -239024 -236186 -381278 -94520 27972 -102818
26506 -102818 -319889 -327502 -301881 -158019 17584 196273 155189 241795 256624 226925 229496
26495 229496 373776 300721 214950 138778 3940 -97902 212842 239574 99329 174085
26485 174085 68757 -298787 -399800 -290471 -256424 91954 57936 -139320 139961 380749
26475 380749 275654 90157 121511 153971 291119 419664 436910 385966 462429 403293 206833
26464 206833 -59492 -168648 99654 282943 313813 211215 167553 338549 283247 61927
26454 61927 -4217 -77054 -295087 -353702 -126486 56428 -28922 -227821 -459168 -557641 -543059
26443 -543059 -732466 -682808 -210431 281896 291004 -31774 -192571 -373138 -564338 -317967
26433 -317967 -10904 -138359 -75577 39931 162359 206121 279463 240822 204218 24782
26423 24782 -280158 -555690 -383701 -199306 -193758 55292 166564 136964 74534 -72112
26413 -72112 -109839 -355594 -419196 -389883 -478746 -327069 -307182 -296266 -36598 43075 -108420
26402 -108420 -99818 80617 214311 142063 139557 128517 252265 341781 135703 -123768 -406090
26391 -406090 -138432 339877 410345 181816 -20297 12508 7392 168531 245349 169661 260593
26380 260593 29059 -219728 -191177 -14304 -61988 -113872 255245 472622 320919 297094
26370 297094 246870 87671 -84177 -60010 217849 452523 396907 219193 -10113 20124
26360 20124 20277 -108566 97881 31558 -133164 -349566 -315663 -128177 -45752 6765 118503
26349 118503 115786 79517 -947 -376926 -454456 -212533 -73936 35206 43243 -145935 -274248
26338 -274248 -263109 -242187 -120964 15277 150276 -139697 -246868 -155869 52550 116239
26328 116239 -76047 -211927 -116700 319306 438995 396899 312527 296138 -19341 -170516
26318 -170516 -37443 40655 153626 290729 509588 610311 574903 568942 635067 746362
26308 746362 628905 167972 -114809 252868 126921 -78244 -37948 -1118 -191597 -170802
26298 -170802 -64561 170659 216266 274114 259019 194737 364857 252187 225762 173122 186230
26287 186230 40082 -138612 -104026 -210366 -420037 -294797 -139383 -217913 -466848 -484036
26277 -484036 -29347 51791 268963 148985 -116179 -93876 -279590 -439884 -200381 160967
26267 160967 235757 95726 -280450 -169442 -6547 46281 25506 -125400 -57153 -46112
26257 -46112 -142209 -297170 -124845 -8096 1471 55078 -159893 -119912 189573 175978 33180
26246 33180 57073 97660 58132 127920 -79606 110361 264386 3084 9985 -164022 -147941
26235 -147941 -78715 -88640 46127 204442 -51486 -439543 -381782 -224511 49408 111860
26225 111860 -41410 -196965 -156230 -298280 -123482 -97542 -170046 -105742 97136 1240
26215 1240 -99432 -86307 -82782 -147770 -20472 149625 173987 266851 428758 311780 144190
26204 144190 -9575 171202 156447 -61647 78172 320836 410973 252746 82708 -94951
26194 -94951 -414527 -333920 9305 185446 219113 4748 -45498 -225733 -376815 -186041
26184 -186041 170169 181764 164133 65017 -78284 -158254 -144356 -53226 126596 349721 226664
26173 226664 -247754 -389829 -475737 -346148 71477 78799 -78718 -150913 -79052 -178254 -195051
26162 -195051 -49125 -171287 -253700 -225473 -184254 -375596 -340428 -277062 -319545 -124483 -85293
26151 -85293 29024 -110762 -547306 -293536 -17778 -251534 -438132 -442699 -416431 -492459
26141 -492459 -383301 -303104 -51283 33932 -84646 178814 206884 61552 -101664 -258373
26131 -258373 -272288 -250927 -257615 -125096 -82485 -14584 71251 -43041 32609 74138 15485
26120 15485 242643 315934 171072 17216 120223 115314 166991 84506 15838 69979 -119724
26109 -119724 -182540 -292821 -241369 -226425 -255331 -558636 -569218 -508659 -435015 -201860 -380325
26098 -380325 -383514 -152928 98755 36431 -276459 -282487 -177318 -103713 -396650 -354810 -114707
26087 -114707 -113609 -342907 -261634 75953 -51336 112724 194373 252421 231145 52071 -32951
26076 -32951 -174006 -389222 -341250 -306320 -53667 163885 83930 -164761 -228858 -3791
26066 -3791 -3521 -61753 106586 142457 144542 120898 -205417 -102672 -96703 53548 96012 -101475
26054 -101475 20076 -66138 -192736 -106495 -137514 -55761 26021 210517 35967 51936 -30671
26043 -30671 49318 378887 519814 520610 293348 169316 137857 15130 70411 -103237 -195016
26032 -195016 -152620 -146654 -235700 -354184 -285742 -138758 -121610 -147349 -76346 193895 293011
26021 293011 134461 -4651 59084 -111787 -115518 96478 361292 274850 114433 116178 -78522
26010 -78522 -66079 -184600 -223602 -212526 -665343 -792368 -640658 -614551 -547953 -689068 -651330
25999 -651330 -380026 -6766 -107886 -91638 -17231 -74763 -25649 -2387 -63273 -61040 -3933
25988 -3933 256175 164838 151841 85623 129140 311604 277965 75172 -75331 61550 92864
25977 92864 163279 238351 146831 80686 184586 352329 258970 148608 -634 -65736 94388
25966 94388 86474 -18535 -134156 -317117 -245298 -11072 57064 1220 23347 -10758 -57039
25955 -57039 64819 -142287 -367776 -318906 -270858 -56360 -55663 -141084 -125672 4056 23752
25944 23752 -116409 -10601 136183 319088 337906 261007 233989 186396 -86129 -234481
25934 -234481 -149591 233091 478447 197964 -138222 -270527 -567195 -543346 -382626 -300854
25924 -300854 -264374 -278163 -252632 -100223 101556 170411 -92784 -155593 220170 150503 48542
25913 48542 126183 276921 233823 243877 393330 529452 316860 178289 396171 734021
25903 734021 688173 564379 364325 328269 477057 562062 506934 313411 234180 331705 427589
25892 427589 476584 423928 216298 214829 -29491 -185483 -248700 -125202 -52547 -58600 27389
25881 27389 -188164 -440704 -388407 -450832 -231590 -303599 -594562 -510246 -303499 -109270
25871 -109270 128521 150556 396717 473906 246425 220155 179544 222306 270634 15151 -117526
25860 -117526 80166 94408 240667 374072 534089 427010 306448 139640 48014 -2896
25850 -2896 -11202 88816 227771 305239 300891 88523 12937 -32805 117148 117405 280572 318685
25838 318685 443988 288658 89453 57738 72584 163369 -29828 121862 358267 93604
25828 93604 -50047 -187303 -347638 -235420 -230854 -236479 -322569 -226396 -249728 -189156 -106234
25817 -106234 -103628 -172929 -40944 23864 158851 62654 256377 390551 95697 -86461
25807 -86461 -35945 69243 129624 264926 195642 149267 396218 212501 -15837 147242
25797 147242 159828 -185754 -240567 -97688 -113221 -72962 -13969 -55433 26984 279899 230848
25786 230848 152228 192102 17390 -224327 -302878 -264643 -386863 -405660 -225022 -119090
25776 -119090 105219 353667 87058 28169 -37774 191231 131688 161856 330616 306966
25766 306966 24100 -190950 -172497 -81678 -159772 -143594 -124803 -34946 -53014 -211487 -249380
25755 -249380 -160765 -311769 -275762 -170726 -222696 -364117 -156565 223764 144628 59842
25745 59842 -42346 -257792 -316759 -72502 282758 474083 150258 -70152 -101088 77505
25735 77505 176136 240357 125979 171177 50192 -20569 -174667 -86184 89909 175386 338247
25724 338247 362440 259028 210860 183032 -142514 -236006 -236000 -416570 -220602 98290 136291
25713 136291 86070 -146590 -349325 -539105 -476743 -309441 -310666 -196073 76139 49148
25703 49148 -149640 -254824 -120177 -79949 71488 227244 62663 -182777 -378190 -343138
25693 -343138 -275819 -178435 -154309 -406157 -279716 -55211 40788 367306 261881 11103
25683 11103 91550 28028 19376 51967 86923 132604 178264 181236 29233 75184 234534 127421
25671 127421 -104329 44166 138755 406390 533515 291071 -119232 -50596 45266 -18810
25661 -18810 -147447 -356885 -250932 -132746 -399129 -529489 -484056 -572174 -320636 37077
25651 37077 -210686 -166335 -60590 157977 206928 191027 432884 414016 420992 190111 75756
25640 75756 114850 199529 -43671 158910 339626 332946 381334 252994 322823 461255 120727
25629 120727 -252284 -432940 -176463 -61998 59516 24228 124546 344502 264031 85144
25619 85144 -88544 -471424 -272081 -137063 -209907 -370949 -272977 -283397 -409593 -299754
25609 -299754 -208414 -105705 -25482 -116940 149561 198475 104875 111694 106444 192649 349282
25598 349282 279573 295248 470149 331350 276521 372351 328688 129719 -269450 -578435
25588 -578435 -443447 -192955 -183618 -278172 -230431 -178553 -230902 -10404 72939 760 79132
25577 79132 98568 -321 -8265 252912 32675 -296005 -163632 -130896 -196858 -121860 -31751
25566 -31751 163473 41330 73915 111947 -32077 -38008 186158 -22966 -67212 120833 259478
25555 259478 44916 -20113 164803 146987 139215 -9957 -106020 226655 91507 -76790
25545 -76790 -204206 -280907 -131179 -59973 23756 186045 161666 68294 -39793 53235 95720
25534 95720 -30874 66012 57095 -147964 -245236 -216070 -180405 -122063 -142339 -218813 -360453
25523 -360453 -575723 -359344 -206323 -334397 -158825 -98499 63115 221331 424987 28511
25513 28511 -297736 -333596 -391899 -534800 -747040 -321860 -64982 37505 181391 160879
25503 160879 141901 5365 70548 103971 137974 186991 -27533 -22242 747 -78754 -43877
25492 -43877 -235285 -337166 -150806 -225638 -176847 146492 140699 187212 32089 -190409 -63799
25481 -63799 26250 -130842 -106115 36778 498 58535 76059 131562 70711 -67262 -148076
25470 -148076 -98847 437463 588592 316193 86673 14601 -33256 72313 8368 -134279
25460 -134279 -64187 93261 -36376 -87385 102817 248503 203786 363739 278282 435119
25450 435119 365180 93339 -159327 -407491 -264833 -238258 -200187 236308 369652 255919
25440 255919 348761 406912 328633 345820 219278 15782 -26131 155147 284627 304789 286977
25429 286977 -38165 -217245 -55754 112476 -89029 -603652 -737508 -307404 100473 289944
25419 289944 566239 432169 22405 -153629 -178872 -44215 -96216 -302559 -365960 -423358
25409 -423358 -163591 323886 358055 244177 262624 110196 266438 335009 392477 405013
25399 405013 265383 225105 219721 144786 117006 318341 328487 254109 63531 54426 -143097
25388 -143097 -206698 -258960 -344962 -85007 110132 14507 -94466 -54985 -62350 -80828 -123073
25377 -123073 85762 -107535 -376770 -338532 -306838 -217337 -200408 -175883 -25082 -35479 -119370
25366 -119370 -47285 -71875 204337 435264 429988 486681 437522 170885 30816 -8016 77745
25355 77745 154283 322504 141280 -11487 184249 7640 -170337 146856 212277 47653
25345 47653 5395 -63736 -24298 -213905 -321454 -265078 32041 318492 525184 319872
25335 319872 -47283 -27893 -376503 -202818 49889 -38407 -60552 109549 118704 -47964
25325 -47964 -204375 -153262 -295540 -128771 -225186 -274642 -211499 -180657 -161986 -147049 -184934
25314 -184934 -258066 -250764 -321855 -366914 -298697 -175363 42353 -146317 -287262 -339609 -102267
25303 -102267 -72074 -56631 -251826 -481277 -269353 -160520 -169591 3935 -9003 -191747
25293 -191747 -103652 -44575 -29233 27143 109101 67036 108575 -28318 -271193 -292706 -457644
25282 -457644 -459221 -446955 -340594 -64295 -4729 -20022 150724 307749 330875 149186 -96020
25271 -96020 -89688 -140980 29058 219328 44348 70547 227588 72486 -138809 -201431 -196411
25260 -196411 -173925 -251850 -348624 -207197 -164244 -151882 -252449 -389708 -143177 -99229 -85789
25249 -85789 -72281 -90536 51254 379081 384291 359635 258814 -1296 -192651 -248507 -136942
25238 -136942 -175639 -17880 216666 134192 -111367 -140776 -65394 -70716 81034 44942 -187866
25227 -187866 -311837 -138059 121168 133247 142675 38962 -55197 150251 188835 41873
25217 41873 -81135 111662 213500 403538 434391 307149 269722 134844 -382982 -532323
25207 -532323 -668129 -425775 13640 207218 182304 -25280 -217645 -290255 -189956 12312
25197 12312 58427 -146379 -160688 -148522 -126544 -98464 107760 225986 280020 262907 191274
25186 191274 100256 -105250 -157346 -83207 -110222 -55731 -234647 22818 -137475 -444827
25176 -444827 -337321 7745 88331 189880 167761 -17742 -133051 -27339 -172414 -457436
25166 -457436 -307350 -46652 -19146 235303 318262 171833 -164324 -118276 92162 43894
25156 43894 22659 -136353 -18431 172332 83695 564 -103234 -218104 -41877 -101338
25146 -101338 -270531 -112643 -265564 -293014 -148425 -101394 33068 105275 62950 49872
25136 49872 -199261 -327370 -135810 -60596 -153573 167738 186338 175684 293380 224802 102355
25125 102355 221960 254959 1470 -234038 -285831 -287213 -109901 -10211 216214 222094 109521
25114 109521 -189390 -344542 -244080 -171244 122095 35528 -130824 -11418 447289 346583
25104 346583 84554 -119671 -344071 -65343 180200 192638 88586 190839 4143 94025
25094 94025 83581 -83757 35561 291332 519085 267446 35213 141021 277126 269933
25084 269933 136312 13193 229114 295167 157292 218011 360163 178223 204114 49409
25074 49409 2158 -124371 4593 -94739 -156458 -262672 -591311 -663260 -465057 -414281 -95801
25063 -95801 106075 -18045 -370958 -386348 -166759 171209 137023 57478 84408 81106 -9122
25052 -9122 -142498 -187880 -159878 69732 141336 205056 168000 187613 -37267 -157540 54182
25041 54182 288780 128513 50576 24033 -180425 -280020 -131109 145638 72057 -4636 742
25030 742 -62501 -51553 -136249 -69875 -40881 160978 282039 221058 139635 146136 16975 -163266
25018 -163266 -151707 -146994 -127499 -117939 18436 3039 -119334 -8606 -3946 -246906 -67280
25007 -67280 7500 1636 11183 19698 165461 460328 375650 94318 287851 242108 -113716
24996 -113716 -28616 150163 5205 -351980 -330652 -52188 -17881 -229763 -425624 -247981
24986 -247981 -31131 167583 210069 376004 494468 463694 182195 157723 161471 150802 -15725
24975 -15725 -187813 -177053 84744 447402 298353 243323 142656 258456 361743 237183
24965 237183 51505 56506 -15698 -137450 -158830 -174170 -105674 -34544 -228487 -350312 -239138
24954 -239138 -263125 -122345 -148942 -92419 201860 126733 -110055 -93595 -66209 -48925 14928
24943 14928 -14945 -99580 -81166 78612 267181 303393 253150 406777 418022 408458 377417
24932 377417 80391 -14963 38431 32526 120065 116225 -26892 53170 229082 223962 135464
24921 135464 -56806 -183426 -367890 -513729 -353577 -164560 -193583 -273260 -280506 -82861
24911 -82861 70846 180238 150760 -75333 -111992 -10501 -50994 -157285 -199352 -179113 -8383
24900 -8383 -47751 -165553 -249917 -179895 -32372 -158838 -77986 -6420 -95501 -178719 -223041
24889 -223041 -147502 -259138 -334310 -463497 -184921 -132948 -189812 -31218 -197332 -297137
24879 -297137 -14041 126993 199796 -22164 -133196 -181000 -320406 -112915 19030 -122872
24869 -122872 -220506 -18030 -16844 -31054 83569 123242 188168 223806 364762 451865 301938
24858 301938 -54379 -34183 124885 -44257 -84676 -186477 -213358 -154328 49685 108328
24848 108328 270257 132371 -32406 -65202 -172366 5566 52667 96112 -15868 -230579
24838 -230579 -180609 -21748 -93687 32948 2539 -155367 -195360 -109804 151873 160395 105448
24827 105448 95399 33677 69745 102315 -130554 -100394 -139839 140316 111257 81967 99722
24816 99722 141582 496529 326759 109293 156382 244557 126388 67994 -22954 -1401 82858
24805 82858 9460 4937 -43255 62190 -6633 254059 317699 406947 436090 387715 435825
24794 435825 271115 -65852 -91656 43811 114054 327963 400918 365254 368201 335290 302332
24783 302332 529238 398697 -27060 -235492 -171353 -86645 -49673 -75910 137112 193094
24773 193094 -23912 -378501 -501700 -304358 -18187 450339 669989 652346 285266 338341
24763 338341 377523 80358 110714 10730 81361 -17293 115305 110436 116329 20010 -100445
24752 -100445 77649 199797 113016 81433 -71317 -74279 -320351 -178973 254729 142752
24742 142752 239232 364164 364614 237042 379620 393285 299745 377176 266211 65755 -139827
24731 -139827 -135064 106263 118451 332052 267418 56416 142911 -44170 -81859 135940 190897
24720 190897 200656 -77617 -157423 -37690 321167 624569 570255 361961 194157 54207
24710 54207 53159 32447 -130188 78734 152092 338441 269666 183741 223100 247528 148601
24699 148601 214208 77144 94163 -119797 -551126 -663501 -407202 -307718 -14844 52481
24689 52481 -101706 -59194 -59165 -244296 -196696 -243993 -335183 -266667 -67747 -68 223857
24678 223857 182526 141914 229 -174019 -109047 82396 13680 -305217 -326201 -169976
24668 -169976 -107355 -286724 -388982 -215970 -161312 42015 159700 -13334 60630 -110596
24658 -110596 -30757 76205 -47290 -207513 -94429 -335085 -462535 -482151 -424912 -319922
24648 -319922 -291610 -161304 -67354 58067 30205 -107495 -96061 145112 70343 7730 -95873
24637 -95873 -145557 -409809 -304602 -103600 57969 83872 46622 258185 292610 139117
24627 139117 62762 85345 95617 128017 76514 72092 130836 245144 218384 354212 585038
24616 585038 460747 289727 95887 181833 310186 237993 264123 254537 151443 31389
24606 31389 119157 166507 416680 601964 724930 694285 522944 345189 249359 132716
24596 132716 207241 420601 275990 270212 147700 65573 118908 125865 131009 45286 231002
24585 231002 452231 372937 303296 156076 -8510 -274940 -140190 -73669 276193 256445
24575 256445 178479 126427 145459 160019 -197271 -409977 -318560 -216503 -176431 -263084 -176669
24564 -176669 -20126 195079 336070 342079 76591 268370 347758 112656 25058 324883
24554 324883 501039 58328 -349145 -73904 201522 -20877 -188114 139809 81432 69055
24544 69055 -107557 -108402 92081 70404 119624 -79998 -462217 -565042 -539780 -556443 -546292
24533 -546292 -29427 161180 147301 -97935 -96437 -7120 43048 159616 168201 91104 -14382
24522 -14382 -71726 -79568 -133083 -51696 186970 63511 88987 -201644 -107824 -68906 -359211
24511 -359211 -350193 -204938 -54919 -6669 -108332 -113709 -116119 -213482 -115905 163378 73189
24500 73189 -93671 -35057 360084 446732 205445 311100 348367 337777 218545 102958
24490 102958 -62744 -259349 -180670 -134030 19071 209969 298722 244237 -19716 -54298
24480 -54298 -10103 -1159 87621 71543 -180796 -301637 -67918 6483 -50718 -470013 -384586
24469 -384586 -14751 302390 362158 550864 373932 33280 65287 64407 -108822 -60642 -19680
24458 -19680 56962 -23359 -58098 136284 149249 61572 -166045 51543 157309 105390 -46206
24447 -46206 5917 -62565 -143836 -192370 -218609 99830 -96816 30595 55436 -99512 -63477
24436 -63477 226185 592744 374233 93088 -180565 -378978 -167233 -22649 145243 230608
24426 230608 269660 376709 265431 160813 204437 281402 202232 86010 -9291 -161921
24416 -161921 -170867 -53992 81379 146980 268341 178645 -46431 179921 100245 91615 229412
24405 229412 277052 300897 315066 270982 329444 262058 127712 128778 88910 153980 253912
24394 253912 3325 -188704 -60122 38320 146011 111006 -98535 -401579 -369482 -182975
24384 -182975 51335 108259 15411 -80822 -95404 45424 77578 66700 21641 -2043 56250
24373 56250 59707 262156 254825 111853 -79253 -305981 -296819 -385915 -291691 -138497 50617
24362 50617 147541 74407 123604 -3850 216425 286100 284851 264795 293351 98265 -163297
24351 -163297 -334666 -107068 79949 -89874 -226445 131670 287901 271406 276588 274848
24341 274848 202235 37186 -233804 -278958 -78675 158651 122107 32354 24187 80005 23756
24330 23756 170114 214723 101158 -183130 -241742 -252827 -129665 -325542 -220167 16867
24320 16867 33752 46647 -61022 26254 92778 245658 340943 481695 282525 78512 378376
24309 378376 396607 302755 252056 258396 215779 130987 168980 133266 35434 1932 279380
24298 279380 98467 -286378 -484544 -315402 -91576 -371762 -366221 -418438 -353522 -261626
24288 -261626 -110835 -53801 34975 25249 -4528 141942 276331 431598 259790 32817
24278 32817 -88538 -69401 -174470 -62960 -123944 -279627 -274691 -21067 81232 144852 187729
24267 187729 -159722 -161174 -107174 -74075 58784 57030 32887 -114602 -32691 -140052 -24115
24256 -24115 78770 -183669 -283612 -283170 -168767 -106071 -181770 -246795 -167409 -67987 27484
24245 27484 114095 24991 -92284 -112402 -304150 -447335 -587570 -474464 -234074 60775
24235 60775 65245 53369 369363 397051 180698 74451 -53842 -42853 39975 -94634 108804
24224 108804 348661 364833 329165 214709 51717 20790 54987 -95149 79025 199430
24214 199430 105242 89791 337132 246322 148301 289295 406115 320874 220975 11034 110177
24203 110177 74751 -133102 -277406 -306416 -157231 19133 86738 162141 164300 262979 97632
24192 97632 100804 14982 -5864 -200442 -16468 12672 -242223 -355562 -284244 -297435 -258422
24181 -258422 -275383 -164147 126275 238308 -145585 -238955 -205028 49821 150909 194548
24171 194548 159582 -47705 -193175 -160702 -101360 62494 114940 -27246 -25231 -106547 -424090
24160 -424090 -418471 -292717 -26188 -96071 -152445 80177 100667 29240 -130022 -247354 -242309
24149 -242309 -216074 -46423 101511 91065 -40756 -64133 -101101 -33433 107911 -83285
24139 -83285 -106523 -37842 50763 240840 89513 -417 98082 235513 136719 -121380 -229682
24128 -229682 -4572 170413 62189 -128027 -218900 -451450 -461277 -356413 -437374 -412534
24118 -412534 -183710 -77971 -26823 150197 145160 135575 121745 323981 297665 219583 163444
24107 163444 394365 359093 151004 -175085 -247048 -252897 -232371 -78330 -19634 102369 -30664
24096 -30664 23381 216201 303440 332969 258624 93001 43702 -47001 -151663 -98598 -77141
24085 -77141 -38751 146034 379208 317599 69792 -88173 -52406 -119433 146741 157362 7797
24074 7797 92729 -200235 -296540 48672 170170 -147128 -284008 -145958 -24214 252706
24064 252706 -94930 -410549 -320707 -81205 87687 -31343 72062 183297 116743 210616
24054 210616 414170 72069 -23851 -180281 -190553 -296214 -177170 -18216 148934 196510
24044 196510 157422 -86783 10352 247522 293053 350995 292336 339659 144573 52088 313730
24033 313730 203043 -17305 -368353 -322525 -163650 -118071 -290256 -457874 -195848 -66063
24023 -66063 -113160 4303 -195564 -114742 -216460 -439855 -480395 -377002 -283849 -309263 -281989
24012 -281989 -278761 16888 127379 266528 178061 150827 -135542 -334411 -259344 -166854 -154996
24001 -154996 -112708 -188622 -373343 -374336 -350791 -436355 -346313 -279842 -433401 -456352 -374221
23990 -374221 -255358 -45343 49697 14716 -227435 -557599 -191994 73017 25680 -204648
23980 -204648 -75872 -85567 15963 85643 2714 -51285 -151360 -319107 -111819 848
23970 848 174121 283168 332017 470568 502430 469673 236871 132849 -89142 -170888 -394397
23959 -394397 -338703 -35007 193797 216762 43825 -104981 -111816 -392404 -455129 -185066
23949 -185066 177511 137995 124427 581 -239995 -316575 -460071 -438239 -251924 -112413
23939 -112413 40801 47358 176648 180067 102936 -49684 -60480 -21667 -60543 -223720 -276427
23928 -276427 -328714 -310617 -317434 -142462 29453 39047 10426 64006 142367 95836 26866
23917 26866 43811 174512 187172 -65890 105525 134908 235806 173480 50366 167496
23907 167496 273207 347138 349217 46529 184830 447410 391474 418924 576703 500207 390794
23896 390794 326502 -91404 -63512 233738 223547 2035 -18721 59451 -54317 -129553 -183725
23885 -183725 -124329 272628 371743 264421 -12174 -204002 -285499 -102424 71168 -108197
23875 -108197 -268091 -289717 -265246 -180200 -86913 -141155 127232 235613 44247 -218642
23865 -218642 -482721 -433272 -374493 -186503 143213 143453 80479 146701 39652 -56246 -75100
23854 -75100 20585 31519 196786 -39135 -123784 -95920 -304457 -469414 -152865 -96474 73879
23843 73879 353343 267096 120446 36078 50406 -65146 -115799 -177029 -66202 -192580 -186141
23832 -186141 36390 16272 16808 45024 180100 37515 256983 421628 484853 460822 545899
23821 545899 243145 -242880 -457122 -263485 -159901 -37299 209375 137699 -138381 -71136
23811 -71136 198489 273925 388626 284920 72696 168759 87919 -106361 182583 455385
23801 455385 482887 423163 112782 40245 23246 25208 110695 123787 267461 250485 78861
23790 78861 -175651 -210590 21908 170520 104760 -52636 -430 74146 195881 230514 178689
23779 178689 78961 -102081 -37750 175212 3085 -111660 -166411 46771 131424 35914
23769 35914 -207976 -47467 207107 327403 146791 -145627 -104480 -145536 -243222 -172900
23759 -172900 -108616 -71564 -101659 105454 95633 -193132 -185938 -37088 -182731 -214778 -240396
23748 -240396 -426152 -406099 -65429 96914 -60874 -66781 -120460 -56742 -27596 -23358 59057
23737 59057 -21926 -30280 -108563 1602 -114416 -246799 -187832 -167385 -149074 -144119 -112591
23726 -112591 -109793 -175646 37883 -63691 -135595 27580 -146790 5529 95230 -60791
23716 -60791 140866 221822 32823 38227 -6675 -71598 -1748 -35068 -286827 -391493 12498
23705 12498 415974 243267 94257 83445 -101788 -173815 -251519 -382045 -227105 -133756
23695 -133756 185511 271876 621778 664904 168748 -66599 92768 113112 286283 253561
23685 253561 -109763 -241496 -89560 -403986 -369991 -181206 -239975 -259710 -68176 -57532
23675 -57532 -193131 -126019 -56163 -257293 -182672 24699 66985 99077 190338 276329 219641
23664 219641 -106787 -44242 84827 125167 24801 -131943 -211088 -359807 -239108 -269523
23654 -269523 -349210 -183386 -194999 -181480 -72572 -150440 -314607 -272135 -195698 -125524 -135602
23643 -135602 -149343 -141603 -254200 -197159 -160971 -150908 -238407 -84409 -226757 -392497 -241458
23632 -241458 102752 142292 -78291 168123 124958 -150240 -451687 -502594 -298255 -109314
23622 -109314 19127 24876 9305 68396 101381 304180 81691 -109651 -281208 -539804
23612 -539804 -875875 -775689 -447076 -303491 -75525 -103745 -222630 -88156 -191677 -171932
23602 -171932 174110 162563 230593 -81607 -66843 91673 -94569 -169824 -191739 -300883
23592 -300883 -166771 -173956 -238804 -259487 -339591 -316444 -211056 -462994 -539454 -244646 243488
23581 243488 517062 390809 254390 279308 233406 -110648 -162546 57663 52620 -75849
23571 -75849 -98153 162519 176257 133221 40864 55079 171045 75127 -292610 -282385 -238093
23560 -238093 -238147 -110517 26293 121518 154445 -66877 -208589 -142973 87909 267033 320881
23549 320881 436771 448380 333940 285013 226575 105981 38980 2654 57509 -83214 -401830
23538 -401830 -429551 -432986 -488452 -464490 -479116 -396920 -502435 -534408 -290540 193929 -28782
23527 -28782 -410227 -564951 -502803 -347763 -304271 -98510 -57757 -346320 -407444 -141510
23517 -141510 -137539 -260948 -350548 -330094 -3456 115231 84991 -168597 -282735 -371896 -305111
23506 -305111 -266518 -302162 -228503 -104985 226348 -23092 -171385 4340 3851 150935 313046
23495 313046 40938 -261778 -320639 -442980 -532081 -426986 -167725 314455 356094 170825
23485 170825 28022 -125577 44073 138968 96075 198369 153320 -4448 8626 136801
23475 136801 57601 -60473 138932 361319 576653 447589 98328 123997 110559 -39263
23465 -39263 -76807 160005 189561 264201 294943 298740 360000 442627 467431 452149 301425
23454 301425 259661 94482 84759 -263 -10261 4143 171649 297886 203160 122664 135042
23443 135042 113040 -32869 -250022 -255185 -156283 -325611 -182630 -100636 -254769 -540920
23433 -540920 -684436 -754788 -516088 -268328 -173339 -71057 -335768 -239637 -26244 -91422
23423 -91422 -55716 -19817 -109650 -224261 -258020 -186350 -391928 -190001 -28014 42065 263437
23412 263437 231792 64244 -231853 -253549 36628 224476 120337 141063 74281 -4095
23402 -4095 179810 223744 1531 -58986 30107 -121916 -308945 -54822 203498 86350
23392 86350 -422495 -362764 -153704 39648 39589 78912 28625 -127764 -54333 40663 -70769
23381 -70769 -119328 -358462 -292326 -71265 122241 96838 120677 49709 -54926 115862 333034
23370 333034 405733 553354 516896 339434 118307 143231 178698 33557 131019 120645 -201737
23359 -201737 -223285 89672 287954 264343 389529 436135 491387 324105 197043 257813
23349 257813 122514 -41753 -96831 -260352 -339682 -402941 -566694 -605389 -336361 -44707
23339 -44707 -35508 59753 177136 304409 196344 290322 314410 360635 107510 -124727 -377751
23328 -377751 -130275 59584 50540 -261747 -386777 -318544 -269820 -202512 -221093 -112097 -28769
23317 -28769 43209 -104748 -80935 107731 -65764 -120064 28287 235417 242136 43380 37361
23306 37361 102405 226785 93728 -263769 -240879 -154322 -150215 -394215 -514838 -360423 -373451
23295 -373451 -272154 25966 396087 323863 114755 -156239 -265711 -190884 -92695 158088
23285 158088 14660 -193949 -338025 -139214 -157052 -224051 46385 165642 65102 157789
23275 157789 252787 161990 168662 87656 77732 -119793 -227695 -232131 -238264 -256957 -139167 -48913
23263 -48913 -54432 -177635 -268987 -143157 -95022 -254999 -325177 -194312 38013 -174560 -278746
23252 -278746 -70062 -205492 -190430 -11974 221779 101465 -76096 -103350 -24102 212780
23242 212780 353451 165993 -10448 -178807 -229328 -179603 -130433 118775 52414 -77052
23232 -77052 -122279 -260402 -469710 -569847 -525526 -368793 -332366 -69511 157687 263824
23222 263824 256504 265188 444645 438218 190554 -152295 -5986 -92929 -198086 -166586 -137713
23211 -137713 -225612 -284243 -51861 117920 -115262 -5803 195262 163644 161296 185983 160483
23200 160483 217128 -46759 -55994 -112283 -154050 -209699 -65195 -189652 -299705 -471487 -714257
23189 -714257 -789035 -434009 -156295 3654 87488 266330 328358 513231 504058 406714 292567
23178 292567 194222 35861 100226 252546 346867 280004 169862 -151610 -68762 201190
23168 201190 269264 330326 147122 -61644 271860 322088 273369 150046 136045 192761 410888
23157 410888 340739 215403 84784 32199 -79566 -356440 -547123 -291679 -142134 -177684
23147 -177684 -48934 -115777 -219485 -261538 -284110 -154722 24543 -54186 3241 135415
23137 135415 124361 -27974 -27285 7871 -318519 -397595 -155519 -117846 -247207 -439960 -593260
23126 -593260 -485892 -277100 74291 131270 87293 169397 188746 221851 258548 259659 342136
23115 342136 114532 120612 125352 -158808 -290706 -344051 -271041 -45001 -161691 -422963 -355443
23104 -355443 -141003 -112056 796 -99844 -176367 109385 -1442 -234845 -236522 -38476
23094 -38476 -70538 -105060 -191556 155057 225438 92919 -92269 -151804 111589 30311 -77204
23083 -77204 -124595 -277786 -299386 -236270 -194391 -143396 -202661 -157845 -168515 -391937 -83445
23072 -83445 -196479 -622209 -752314 -698722 -567483 -132018 150602 -77129 -234243 -196086
23062 -196086 -310450 -326728 -194084 -167156 -157131 -51455 43108 -4531 -174686 97803
23052 97803 178062 245440 436573 396474 279367 365912 259075 22507 -120165 -304441
23042 -304441 -266258 -310556 -223976 -56277 110211 42484 -106686 -55246 -113743 -117648 -118343
23031 -118343 -104041 -181506 -138403 42676 252830 272122 501212 577698 354758 130243
23021 130243 10771 -69120 -110741 170588 475762 317287 188248 13023 172638 77416
23011 77416 223878 131870 -90882 21203 4028 123881 170252 115214 68595 -96371 -246583
23000 -246583 -175063 -1873 37913 -204194 -405191 -286003 -127506 -17478 -239085 -274179
22990 -274179 -165831 84183 -171947 -508801 -444377 -219771 -239166 -283211 97636 307481
22980 307481 237293 123483 130762 66535 119579 94652 -155371 -372259 -253374 -1716 151816
22969 151816 15353 -19410 -224697 -278104 -179549 310497 320078 -26543 -44195 -31427 108564
22958 108564 243568 103458 121354 64373 -189527 -273196 -376940 -74353 179991 60603
22948 60603 32483 27291 -101628 -82963 -25494 -19536 -224389 -393438 -296051 -340298 -258188
22937 -258188 -376106 -764981 -602128 -384743 -92927 86295 273998 20315 -39108 -184776
22927 -184776 -229944 -228898 -308045 -62992 -74202 -345712 -509199 -481563 -406502 -327034 -170768
22916 -170768 -243200 -317903 -226410 -223696 -305401 -372757 -386899 -340341 -234551 -76801 121807
22905 121807 330841 442614 174597 192636 77336 25439 18631 -172081 -186297 -62007
22895 -62007 168002 192656 188232 -103637 -67134 207670 53918 -240731 -289755 -240804 250103
22884 250103 214914 -68269 -127986 -335266 -351984 -253575 -257476 -255237 -444573 -460786 -399969
22873 -399969 -361443 -284188 -320733 -167037 -150972 -136450 -111290 -221718 -231253 -69851 -81348
22862 -81348 -213066 -253336 -235463 -213024 -150196 -98599 95559 2650 -152556 -55494 112040
22851 112040 329145 108966 36846 302481 517726 327333 332503 323282 200388 143110 -1363
22840 -1363 -129765 -105306 30070 301400 319279 236402 -12803 100740 288578 207731 84512
22829 84512 -78056 -328369 -298147 31145 266832 110934 -18046 123681 -100332 -40007
22819 -40007 -100430 -159591 -50180 -54640 -123567 174857 219046 251482 125327 135167 117435
22808 117435 165575 344519 250616 2056 -269032 -354455 -266940 -439707 -320482 -366141
22798 -366141 -418128 -340200 -302556 -136783 -205895 -352025 -304500 -245982 -285286 -330864 -6307
22787 -6307 450243 318850 247191 149859 -167925 89078 307802 381759 246396 -29679
22777 -29679 -147992 -139082 -257761 -392314 -196814 72591 194955 342123 167882 33689
22767 33689 158117 289675 40035 -221047 -298908 -208801 23951 156879 48962 -6120
22757 -6120 109771 -11837 -138447 -175058 -126144 -204483 -321743 -333059 -372115 -200391 -136456
22746 -136456 -171391 -123474 -136389 -17876 -4279 106055 60733 69823 59066 -66926 -5841
22735 -5841 -41021 57293 428552 303182 47246 126119 173251 121838 34562 173025 67472
22724 67472 141551 67750 -212289 -374817 -592362 -558725 -538325 -550172 -501890 -536513 -420695
22713 -420695 -47108 111906 -314515 -615778 -704338 -366104 -282204 -404053 -383034 -371804
22703 -371804 -294884 -380076 -364874 -242601 -169496 -61408 -48707 -116856 5890 94908 61809
22692 61809 4309 18970 52515 -69138 63226 -174114 -244391 -271886 -227586 -221576 -59956
22681 -59956 -204318 -290425 -161164 12101 14440 -108182 107738 312928 130117 10304
22671 10304 -342995 -304005 -98551 -43246 -32117 15072 -215496 -154997 -38653 -37957 -60054
22660 -60054 69693 47820 -62749 23232 112818 330610 315696 384930 444496 246760 -15628
22649 -15628 -184622 19047 215705 112989 91284 13055 24400 11644 74494 32356 -53809
22638 -53809 -101317 -68234 109063 144489 221574 314958 232504 24383 -26242 -224817 -186136
22627 -186136 -184379 -203167 -133996 -75296 -133868 -208290 -160013 -164303 -342966 -405444 -246058
22616 -246058 -355168 -110818 117437 116499 -272054 -468803 -260478 -128177 -189609 20500
22606 20500 -100534 86625 260556 342359 226296 192294 304299 37674 -241601 -120397
22596 -120397 -159843 -361344 -311957 -427597 -417685 -246398 -221197 -358021 -277201 -131967 -138360
22585 -138360 -276344 -160335 -202712 -475280 -480851 -263777 -224131 -376022 -396748 -442716 -251733
22574 -251733 -203251 -96430 -3990 170647 259768 47599 -46151 -75632 -272212 -144280
22564 -144280 -204585 -251690 -248340 -157102 96531 337708 229961 219712 158709 138492 192735
22553 192735 161803 -173162 -259425 -163049 -104188 -214980 -196213 -351557 -342202 -247931 -227250
22542 -227250 31345 121738 203057 336234 257142 -116023 -91324 4137 103852 -31207 -281086
22531 -281086 -322637 -341579 -101347 -112707 -12655 105133 28275 -100962 -435837 -312102
22521 -312102 -127360 -172106 -293972 -143405 32669 67010 30488 582 -262546 -362428
22511 -362428 37153 59798 -52772 -43540 182675 46582 -41597 373525 401238 -93718
22501 -93718 -132336 76675 218013 322687 208613 168842 257499 205426 375189 432635 234761
22490 234761 22766 66277 71246 130612 -163748 -228804 8938 -28800 -127059 -414849 -305517
22479 -305517 -139874 -230040 -355940 -566938 -351864 25534 43166 208019 333479 122594
22469 122594 -117153 -126857 -58747 148766 201312 113299 24381 -241876 -538259 -591208 -476942
22458 -476942 -260602 32198 104818 29071 -48628 -88396 141257 227346 153301 251126 88424
22447 88424 114093 119225 150591 172157 15636 -243452 -166339 -164220 -222704 -171286 -225801 -255992
22435 -255992 -386900 -285867 -146091 -209318 -3027 115793 316307 191974 24442 -196708
22425 -196708 -291808 -283141 -64957 188483 182093 261463 293615 172442 10861 -86176 126283
22414 126283 250089 184958 175526 294278 271276 112936 -149492 -312568 -473435 -392185
22404 -392185 -297133 90487 292458 150131 37467 -59606 -151820 -22125 -28265 134927
22394 134927 381506 61787 -42832 693 239696 637833 479164 406557 431047 242932
22384 242932 217895 167081 123238 192654 149859 26802 60481 165623 228175 119539 74479
22373 74479 248037 103110 -122394 -161876 -56749 -52782 -102611 -96519 3009 -58499 -60074
22362 -60074 12785 52317 111190 114053 56980 -79406 -329308 -474309 -359700 -138439 -86965
22351 -86965 22317 193168 202530 129493 332269 420907 149066 -43338 -103694 92723 55716
22340 55716 324539 373517 301617 276002 216183 151919 142206 -42070 -316497 -503883 -584257
22329 -584257 -514555 -337084 -233024 -100739 -70840 -155136 -101223 41997 -39139 -59499 -11401
22318 -11401 -131071 -46224 141796 319273 282054 -2844 -200041 -259733 -436276 -327233
22308 -327233 -223802 -131938 18694 -5768 -2010 -126669 -214136 70008 81773 195158 196325
22297 196325 113415 131015 279469 161873 -90987 -25037 -130544 -295893 -365369 -484928
22287 -484928 -334344 -120604 26774 139572 553424 705745 543738 298088 279066 604631
22277 604631 418916 278056 321169 166922 52075 177884 104439 103045 138695 -99910
22267 -99910 -278194 -203936 -104791 -83875 -169203 -231138 -353560 -355272 -186327 93001 208746
22256 208746 181438 130270 -61596 -12417 -38843 91258 288089 280586 6227 65406 -264326
22245 -264326 -334979 -569302 -547994 -202813 -150908 -150282 -305700 -528762 -715967 -655376 -407533
22234 -407533 -433969 -443597 -158879 161430 -14569 -86674 -110917 79890 143475 16172 -334164
22223 -334164 -402782 -308769 -372353 -277196 -198765 -23005 65073 27700 -37758 123503 382806
22212 382806 205225 4728 -77616 -17891 398 -76516 -149893 -75454 -103090 -138770 -100190
22201 -100190 208683 243317 346131 210059 98734 -188863 -89662 111846 27876 -14727
22191 -14727 -17869 5092 41532 60959 -3797 -219443 -320998 -363501 -346422 -119273 -97837
22180 -97837 9066 -150706 -259519 -10635 15133 -48783 -21830 57031 12692 60815 -24967
22169 -24967 -48458 -18943 -248072 -504278 -326589 -256 179998 -6018 -207 113500
22159 113500 193273 33644 -66172 -16732 59316 109615 8491 31141 6568 238600 81943
22148 81943 84942 416428 517874 279234 151083 256873 211266 151144 -14698 -123834
22138 -123834 37972 -309649 -314178 70597 123837 -75233 -297434 -209332 -32098 14783
22128 14783 -34495 -257010 -387560 -330446 -392674 -280431 -91113 -106177 46893 106530 -104908
22117 -104908 -269287 -188494 -280923 -23722 82898 169656 54136 -79448 -105454 239081
22107 239081 545082 542972 250136 405407 310349 363650 498406 407899 228118 91721
22097 91721 283381 531578 435616 241226 147055 160176 256556 365296 430756 256505 -83340
22086 -83340 -347714 -372357 -456516 -173710 -74824 -220149 21406 151735 50205 166030
22076 166030 229176 50809 -40727 -111806 148570 198516 166810 154194 118934 291376 566918
22065 566918 527648 299801 142939 -94973 -302950 -458179 -477004 -292844 -257953 -77776
22055 -77776 -130814 3165 152036 101089 132730 202137 -28028 -270366 -373051 -40744
22045 -40744 -190773 -118412 -713 -191179 -411414 -552185 -512488 -226854 -323753 -437764
22035 -437764 -697908 -762608 -626596 -323957 106909 182475 -67059 96166 320189 199036
22025 199036 22034 114664 164844 128678 -66193 -90505 -259805 -386571 -291228 -316815 -99447
22014 -99447 -94375 -34262 62055 134052 96387 -28102 -143773 -402449 -313483 -252750 -211049
22003 -211049 -37474 74636 27579 77235 58987 -28929 6336 -161686 12202 96633 104763
21992 104763 -54803 42883 13207 -89950 -150216 -121050 105772 389950 430824 458901 442864
21981 442864 374533 532668 653734 337349 101082 31752 -230542 -215861 -241844 61897
21971 61897 274497 155357 -38540 14236 255930 279524 48145 -157654 -132764 77669
21961 77669 -95322 -131228 62518 118630 -69726 11862 -227143 -367713 -127423 139944
21951 139944 184557 29189 -2847 -28925 51278 -15204 -219683 -210876 9861 375044 511285
21940 511285 28433 -192837 -459642 -558071 -416002 -235632 -293445 -253375 -479255 -490837
21930 -490837 -435805 -324325 -230733 8240 201574 75436 -18555 -48531 -24534 -108201 -158475
21919 -158475 -259677 -197848 -39280 -133765 -141084 148646 82825 199318 264591 93639 58034
21908 58034 -85423 -331304 -358792 -227747 -69939 135358 275696 270891 282226 232468 50670
21897 50670 -28484 57234 11853 -66603 -243139 -363784 -394861 -444173 -582710 -401778 -226842
21886 -226842 -135967 -262964 -229529 -38386 74996 271442 357349 351231 288320 72599 45243
21875 45243 -102267 -180698 -189601 -155051 -159343 -111073 -355005 -344683 -164235 -258207 -468317
21864 -468317 -236930 49502 52193 41668 105524 261859 159712 88562 146523 78712 29533
21853 29533 52326 -109770 -149440 -11283 130020 215036 203241 179412 141476 230520 338604
21842 338604 209588 -47343 -364686 -231482 -113811 -74939 145261 315943 306433 220311
21832 220311 7000 172141 115259 46385 17326 58961 -43819 -97188 -167810 -284956 -217909
21821 -217909 -107881 -223663 -352018 -390909 -48369 264999 -116358 -375434 -376017 -288392
21811 -288392 -77578 98550 11332 -147744 -247835 -144546 -23406 12 -83207 -271732
21801 -271732 -205940 -62556 -182522 -101934 192207 407681 359365 391196 363333 156135
21791 156135 -48745 6240 -77666 -20052 -67931 -2981 -38404 117393 180888 93901 -147038
21780 -147038 -240774 -276836 -129196 -305803 -272584 -134307 60445 117568 226139 261838
21770 261838 279305 132768 51596 -55187 4399 26080 80491 93568 -46192 -226499 -428362
21759 -428362 -168864 -52500 37308 185183 106735 134389 37540 73392 5096 -241688 -258046
21748 -258046 76696 194556 164103 235136 159474 222238 206324 -72488 -402460 -435525 -351535
21737 -351535 -428278 -534120 -411987 -289752 -220103 -91557 92870 -2363 -251595 -182528
21727 -182528 73792 -56348 -283019 -385868 67866 -278728 -543503 -210259 -178958 -185534
21717 -185534 23217 168377 51967 -121492 -199326 -141553 2328 93788 201636 221807
21707 221807 101222 3036 -27915 136249 272320 140920 24352 -45341 -31291 -158747
21697 -158747 -175202 -387724 -518948 -286122 -345476 -540707 -635428 -309369 -114415 -199188
21687 -199188 -276335 -124235 -224449 -96342 9338 176637 325502 186298 124377 -8076
21677 -8076 -21609 -169658 -432809 -340494 -240490 -138691 108884 57152 83721 -68180 -775
21666 -775 329437 287807 35287 -198267 -276489 -444700 -471373 -291130 -428754 -311587 -33974
21655 -33974 159706 37372 36953 -70050 -200620 32899 3499 -4025 100476 19925 260093
21644 260093 638264 545933 383583 357476 285851 47550 -109257 -40698 -3737 -10882 -101842
21633 -101842 -215054 -142810 -54562 -11652 -25299 -264043 -375591 -614272 -458804 -335472
21623 -335472 -204294 -107386 -26876 -134034 -26928 94006 14694 -96949 -175435 -168887 -4113
21612 -4113 -275298 -306552 -122682 -51223 -2837 115890 142764 82022 244061 289421 392329
21601 392329 230435 -46400 -59364 -132641 -171441 -224328 -468876 -383494 -393590 -69212 117324
21590 117324 307953 168007 126622 26150 -84776 -76178 12907 333571 205612 -322639
21580 -322639 -754232 -771640 -485682 -82384 107610 10406 -41059 -105310 126940 295619
21570 295619 406585 286610 95476 130294 209669 94479 6115 -170990 -196164 -48744
21560 -48744 17538 94933 -251565 -278303 -236781 -379235 -276871 -80085 222392 114039
21550 114039 124829 141898 -273836 -428749 -213405 -163956 -39640 -8883 -95343 -304637
21540 -304637 -402393 -337753 -49168 -180732 -207822 -275972 -426263 -422254 -251737 -184459 -254666
21529 -254666 -71972 -57689 -11072 204513 593922 383863 63077 -50789 -10509 66466
21519 66466 -85655 59844 382735 306494 125006 106659 -100092 -121425 120422 250995
21509 250995 282010 302963 319376 533066 532533 250094 77107 52052 94941 -24191 -274452
21498 -274452 -442565 -227003 -95724 -109980 -73008 114620 53432 -158686 31597 205994
21488 205994 293370 274895 102852 -140721 -36954 -125452 -271328 14146 211134 198704
21478 198704 109395 283149 397475 93641 -156300 -131481 17465 127486 171039 9087
21468 9087 -2753 -66640 -201150 -258217 -422683 -385676 -389180 -338646 -139422 119314 190102
21457 190102 213154 10267 -203978 39950 148721 97756 25386 60397 -114585 -245183
21447 -245183 -224524 -101782 88944 178724 37819 -66791 -196186 -54808 37334 -141484
21437 -141484 -284661 -292033 -417936 -319834 -359137 -162020 -250836 -171529 -292774 -328992 -264927
21426 -264927 -269960 -296983 -449370 -444864 -223481 -318727 -409445 -457565 -455926 -409013 -485867 -439460
21414 -439460 -295143 -154501 -52848 -193481 -402100 -176579 -328554 -454571 -407149 -53698
21404 -53698 59597 106213 152644 229220 29110 74149 26749 -1546 26772 68573 -157364
21393 -157364 -182669 -178103 -252529 -154045 77625 174169 -1901 -81381 -69496 -20729 8289
21382 8289 32112 227246 79250 -211141 -190435 59539 164689 154158 114770 260695 329035
21371 329035 179055 385288 580392 255829 37383 -92876 -56144 89125 96321 -29278
21361 -29278 -91975 53580 192134 321011 309871 164580 -212583 -281799 -70876 -116689
21351 -116689 12237 112193 368923 435777 355979 312816 271334 -89753 -135721 76408 135793
21340 135793 196018 223275 291956 225880 211592 234818 45204 -4087 -33373 -318322 -277902
21329 -277902 8196 80582 143128 288728 366748 127233 -955 167344 199070 71572
21319 71572 -41101 181333 177221 208296 310833 277370 241315 285997 167620 72971 18790
21308 18790 -165274 -347147 -198744 209444 123445 235435 507287 560497 240714 30825
21298 30825 -132794 -215821 -224103 -362017 -97286 134717 67474 -52515 15661 -7825 57552
21287 57552 -82810 -54802 -232694 -222710 -71976 -68975 -42973 -97127 -95872 -186939 -105911 -16753
21275 -16753 -93950 -23388 -14261 -59806 4425 -83699 -38522 158383 162981 18181 11692 8304
21263 8304 -246130 -388624 -406650 -376763 -211030 -229090 -198207 -268879 -140657 -314211 -471124
21252 -471124 -269737 -92569 -1 -13065 -61852 15302 124679 -38847 -71386 -156891 -161031
21241 -161031 -316544 -294228 -142942 -381571 -591506 -226801 -186829 -290317 -114843 -71621
21231 -71621 -160661 -34699 -47264 -112675 -299160 -462378 -152534 -91647 -105716 56815 213993
21220 213993 197822 104147 71474 -36614 -12977 -200458 -477853 -312422 -141476 -122593
21210 -122593 -200333 -218581 -329542 -474951 -541328 -574885 -533618 -320070 -157390 -253473 -175109
21199 -175109 -39650 -29704 127446 108080 32918 -96861 -168667 -109771 -125048 -176769 58756
21188 58756 93184 -93717 -21003 6942 -32018 106742 -13929 -26272 -146483 -361626 -210478
21177 -210478 -158736 -369841 -247832 979 21149 -73466 9593 211715 252705 307953 473921
21166 473921 439397 168249 14440 -32070 110668 47839 177062 87338 -37936 -7000
21156 -7000 47670 129430 158826 127377 154790 116572 -208474 -165466 -246601 -235309 -97396
21145 -97396 72231 210601 138638 99178 155308 145274 -108442 -308522 -175798 375123
21135 375123 554478 439779 344163 138364 -151080 -142631 175098 88668 99531 205231
21125 205231 76985 -6081 -128616 -267919 -218890 17676 155388 307720 487463 273025
21115 273025 234411 192330 341504 347506 386266 332268 212463 186230 274145 437100 366690
21104 366690 285209 241908 265423 439072 444686 218164 29071 -50709 -112534 -341179 -314664
21093 -314664 -261009 -295881 -114142 18637 34184 -217843 -173566 150110 241013 339512 430851
21082 430851 392168 377787 457728 465756 392206 156772 103033 257834 188393 196500 229481
21071 229481 -34238 -206331 -189085 -112367 -45493 -61009 123149 102701 -79921 -14093 262314
21060 262314 543397 235143 140450 120633 -182141 -117242 159025 247071 82654 46016
21050 46016 156391 34950 -182690 -9148 198918 219552 439008 496019 150838 139907
21040 139907 362664 460057 119868 178529 327826 273945 21540 -47259 -85766 -137431 -196583
21029 -196583 -43706 152372 224693 89696 28270 85089 256283 300319 29635 -231001
21019 -231001 -264913 -122256 -32344 -47970 -69046 -235955 -336421 -433261 -368457 -216991 173095
21008 173095 55471 -113599 -65564 -114456 -17433 -18134 -205786 -159553 -216818 -122248 -150649
20997 -150649 -142753 -202958 -72424 85871 325122 173441 -61053 82897 35228 -159305
20987 -159305 -351527 -523119 -427689 -61939 98830 103517 39141 34373 22783 238171 487998
20976 487998 270499 184985 136992 119044 42491 129724 239009 394929 353741 250691 344725
20965 344725 266097 115367 -20720 -111526 -190957 167099 58167 -83135 -45909 76061
20955 76061 159479 47801 99337 321328 408019 194824 -41444 -272825 -336353 -296208 -47025
20944 -47025 51309 2871 84598 128901 339710 374074 285832 37718 82753 179698 -207607
20933 -207607 -365926 -438563 -224740 196119 218861 153164 125676 -1945 -220574 -370694
20923 -370694 -153229 104638 200426 -118201 -296265 -253279 -111386 -97851 -313120 -151169
20913 -151169 -129556 -260734 -288404 -434803 -464203 -322010 -112104 138444 47362 -82787
20903 -82787 261345 355719 515987 506353 342144 293953 175520 142793 -111933 -1077 72699
20892 72699 -120743 48451 48912 -648 -103139 -223931 -244350 -143446 73692 175243 412604
20881 412604 573606 486510 565426 805116 916777 622262 281774 -203955 -344337 -189508
20871 -189508 -166393 -112872 -117036 -86354 -326301 -201624 17754 87716 257514 498970 276326
20860 276326 277005 235104 295435 444127 470086 357481 395127 474944 229141 85246 -124910
20849 -124910 -368805 -111564 -93822 -232269 -462961 -307048 -180778 -71008 -173596 -167989
20839 -167989 -123479 -81909 30251 -13930 -143796 -262349 -211947 -160928 -166120 214931 135234
20828 135234 -118835 -16658 93012 -215390 -274768 -312201 -331406 -5413 152966 74119
20818 74119 -144833 22687 86039 -5399 -195868 -228879 -135887 -423461 -355804 -175461 -202194
20807 -202194 -157451 -127583 46591 4804 -81879 -49285 -140656 -308580 -99414 103581 198476
20796 198476 78001 107094 335586 93757 10672 120947 16854 -15696 45987 44492 -251633
20785 -251633 -289767 -92014 249724 555935 635248 446052 250167 -95443 -367614 18872
20775 18872 109073 -4645 -125928 -179863 -298508 -468756 -508210 -415140 -328000 -252328 -164933
20764 -164933 -18698 53882 6255 -307086 -452926 -284576 -235757 -306382 -227894 -205028 -269378
20753 -269378 -292645 -45234 229838 261235 -140957 -289771 -170070 -91393 79924 -27794
20743 -27794 45120 118903 200563 -28169 -158798 119287 27565 46924 56963 146530 269628
20732 269628 314078 311916 53692 31476 125466 144282 -144987 -260445 -231857 -215784 -10517
20721 -10517 -5350 60815 -77600 -62882 -198477 38575 274634 381686 331816 130955 -172500
20710 -172500 -314752 -416108 -536323 -562208 -487652 -212650 -362101 -386627 -288319 -400539
20700 -400539 -365731 -206677 -221988 -191251 -196393 -75150 138646 263189 163790 150881 172818
20689 172818 153051 82133 220097 210795 225643 376473 344767 222187 84151 -23001 -42238
20678 -42238 60797 114491 162356 -213398 -247129 -72692 134501 271059 183505 132204 -135239
20667 -135239 -223796 -156602 -47738 -58469 35532 -57635 -177203 -156897 -123789 -32077 185394
20656 185394 274235 86084 227386 452439 451254 379837 420247 411894 332000 343244 307942
20645 307942 157103 -186370 -96241 114555 169262 -6846 97795 164001 27463 58559
20635 58559 98234 13039 177029 239990 184437 192706 459148 426103 229809 3148 -10570
20624 -10570 214077 392092 380958 255285 16091 231788 127375 -114192 -108489 18162
20614 18162 165443 250793 -53634 -212702 -175067 -183440 -270745 -282746 59819 112263 -131279
20603 -131279 -115414 -108670 31687 250905 303289 345997 412856 387499 180209 295123 382062
20592 382062 226465 213341 122493 -79676 -125512 -156921 -234895 -201139 -215146 -27843 113179
20581 113179 118819 89550 14798 -125664 -61008 193015 256594 158570 120880 64889 19465
20570 19465 -69466 -291046 -249090 -430895 -485393 -359412 -161702 -78790 39798 248987
20560 248987 575268 756846 714407 513378 382090 315988 323075 302541 68976 -30553 -299632
20549 -299632 -662767 -530166 -353786 -255962 -68933 60293 132199 32663 119313 45157
20539 45157 60103 -42510 -4629 70665 155618 9379 -289339 -423361 -520502 -540940 -482747
20528 -482747 -427783 -374515 -114589 203534 321401 191559 -77724 -85284 -134932 -141157 -59094
20517 -59094 -323563 -234897 106684 47057 1941 177691 -11699 -238971 -51490 -24641
20507 -24641 97822 236389 486691 486113 215662 244866 469594 425835 322196 218438 171375
20496 171375 243380 298625 298906 44790 -132702 -221431 -175066 121953 352611 295803 321724
20485 321724 -33722 -10722 219471 186877 -40507 -181168 19837 101646 63005 77071
20475 77071 198163 287080 104206 -51794 -22041 -149671 -298438 -417210 -340158 -89725
20465 -89725 -101066 -175523 -237683 -192818 -259505 -227978 -152879 -170555 -230776 -190336 90324
20454 90324 209771 87492 -213778 -48113 259626 126729 -110448 -19808 6089 134890
20444 134890 -17130 -206460 -116690 -243465 -278771 11267 88700 -13118 26797 119696
20434 119696 101155 -190114 -289620 -121840 -249044 -115559 216856 261631 120638 45721
20424 45721 99470 189176 -48724 -238414 -253090 -264472 -278027 -279457 -100741 -267603 -342509
20413 -342509 -254717 -204552 -8163 94379 150220 -11513 -165938 -46158 -11142 -52146
20403 -52146 -15995 -116780 11828 62879 -9228 -19365 91442 -184192 -28787 113152
20393 113152 -32050 -153861 -139311 -93653 -6799 -142289 -107680 345593 543593 266568
20383 266568 24035 -123223 284309 517653 376341 262359 277146 305126 315920 290061
20373 290061 425066 679731 963604 1622955 1601398 1850423 2190065 2352486 2520684 2306025
20363 2306025 1953135 1583758 1387904 1519382 1395316 1176432 1173785 965405 694356 725181
20353 725181 715451 708172 647228 563109 292501 101639 -55433 75981 -48048 -256717 -103026
20342 -103026 29016 126366 62823 -42347 150644 187423 242369 337685 -40418 -302700
20332 -302700 -194409 -89078 -129329 -16394 67653 200852 357538 317060 293535 338506
20322 338506 446981 565579 568447 341564 256891 369009 652789 788258 794677 1250347
20312 1250347 1856912 2205869 2074074 2305258 2816398 2908351 2371597 2062430 1940925 1749461
20302 1749461 1740689 1597255 1205489 846725 779382 735294 837815 605990 269617 441723
20292 441723 479515 313421 267060 461616 644689 945033 766091 426571 170151 154808
20282 154808 83567 71089 184290 169901 252363 628400 735577 328896 130669 254442
20272 254442 583198 676081 957140 716227 739646 890698 571069 270032 187152 375745
20262 375745 289525 123885 86062 16547 -191784 14376 240786 145208 79601 193252
20252 193252 350246 253160 247850 118999 -217638 77709 211696 448752 604129 629457
20242 629457 425469 534679 508756 476069 666379 736176 654274 837508 1096884 1324640
20232 1324640 1587068 1549886 1687863 1976373 2574047 2851537 2375137 1940684 1629301 1643716
20222 1643716 1455610 1271392 1162325 923237 857488 774238 316182 -6930 12609 70901
20212 70901 25776 358012 474712 461796 338946 476336 523004 564754 382818 177060
20202 177060 334877 58008 -108478 204231 273791 67244 112632 507284 976799 1145260
20192 1145260 1082647 1347520 1684602 1815444 1973585 1870817 1910050 2225487 2344274 2249534
20182 2249534 2059380 1623850 1489401 1751550 1470364 909664 490320 589901 760127 275283
20172 275283 -8562 228586 414798 282396 61880 -118192 -109089 -69747 33459 524856
20162 524856 691213 747382 628756 784559 933467 498351 84487 -111970 167727 273901
20152 273901 293276 303596 286791 314871 176525 234163 189061 284206 334618 115997 -85465
20141 -85465 -37207 -45460 20129 78574 -893 196015 20895 -153977 -143266 2176 363592
20130 363592 306950 329763 276098 169481 143275 257157 57788 50398 289625 303602 199397
20119 199397 230605 28824 138789 485610 605806 459204 176083 300060 505711 632658
20109 632658 577422 359585 211036 122839 202611 355531 481142 207328 213049 108832
20099 108832 15759 -157276 -233785 -153150 -244014 -58710 -45461 -37679 145592 181549 182566
20088 182566 15955 -43720 -129444 -205064 -24320 118157 109018 146678 38624 192942 229810
20077 229810 197420 153782 -18057 -110840 -197630 -61343 201565 185948 190025 198977 151654
20066 151654 254138 51540 -112349 22222 148753 54255 7767 -173508 -492528 -347685
20056 -347685 86949 402721 193761 134597 294627 453270 406919 212466 18277 -17057
20046 -17057 169942 279273 386339 454722 345278 172901 190102 126342 43155 116437 175061
20035 175061 146402 119854 24823 -122621 7954 34960 164892 325724 265736 213677 184638
20024 184638 194878 322733 340783 457577 735540 807459 709278 528948 284823 228326
20014 228326 626998 530323 622551 502117 698535 749998 521609 747224 807606 539135
20004 539135 333949 272467 290330 300568 454319 540652 630261 534679 279727 142710 340431
19993 340431 529321 534207 446316 558267 358956 170565 -34484 -120611 40035 322529
19983 322529 283920 305698 274889 446733 509739 445817 342502 260040 374504 391286 209404
19972 209404 307957 442239 432948 492239 518633 584293 474848 524636 525237 252626 -57058
19961 -57058 83735 450752 611468 700578 713822 378820 173698 293147 352108 439885
19951 439885 504291 566450 630381 608467 696560 1046257 1212142 979451 1166474 1178784 1050994
19940 1050994 906028 988804 1149618 1030835 945733 853177 1072038 1116069 1126934 1040592
19930 1040592 957158 885494 773675 817534 833442 1086073 1126312 1013326 919106 768369
19920 768369 839832 907868 701996 770593 1009475 1200228 1219815 1058852 890001 789319
19910 789319 1005489 1161228 1224505 1240377 1431566 1327680 1481961 1446155 1509193 1560151
19900 1560151 1532039 1302953 1132291 902144 905924 1071636 1157781 1272118 1359130 1130369
19890 1130369 1273624 1531149 1642094 1507143 1422591 1421854 1539005 1548815 1469409 1303418 1289989
19879 1289989 1445926 1537216 1682567 1977268 1997412 1847816 1904197 1897959 1618301 1823618
19869 1823618 2083936 1975859 1997490 1934874 2090806 2128853 2162502 2050453 2096598 2172810
19859 2172810 2092552 2017169 1986058 1996695 2402556 2528260 2477469 2762674 3175385 3901328
19849 3901328 4242056 4372173 4639149 4944358 5480424 6084654 6611682 6758779 6891251
19840 6891251 7260210 7905774 8665492 9454002 10318676 11152859 12147950 13211120 15012906
19831 15012906 17242189 19195749 21623732 25125348 30048890 37198990 47898542 64952708
19823 64952708 93962533 141135090 203648157 250957597 267384464 281766751 316993390
19816 316993390 378410024 428338105 408071714 334601426 280151264 259239092 258816770
19809 258816770 231090740 163307710 114244615 88219582 73502684 63983134 57242216
19802 57242216 52155031 48168699 45217366 42780873 40437689 38169499 36271034 34764516
19794 34764516 33767577 32683413 31514480 30580206 29498063 28765730 28532816 28766114 28598455
19785 28598455 27565541 26499947 25973504 25875594 25865636 26466275 26941489 27098884 27498575
19776 27498575 28624370 29795154 31341245 33224812 35599232 38855441 43510865 50449256
19768 50449256 60699008 77415680 106277184 153803130 220864019 279654830 301737973
19761 301737973 315522495 349730093 414550735 478122156 472984104 395649318 328404112
19754 328404112 298641682 295497859 274023468 201063414 140084347 107010092 88312570
19747 88312570 76639080 68487650 61934258 56833360 52888001 49967312 47445313 44869424
19739 44869424 42561657 40760914 39173045 37513591 35919458 34218336 32714024 31820058
19731 31820058 30741584 30035622 29391246 28332583 27505095 27171562 26630215 26227647 25545191
19722 25545191 24971484 24877454 25034553 24758759 23895206 23641544 23791881 24136053 24206001 23680804
19712 23680804 23449826 23611928 24223174 25036794 25941720 27929362 30924650 34307457 38613739
19703 38613739 45330561 56255609 73797416 102817313 149354838 213868055 266745124
19696 266745124 284860612 296096338 324744678 379735886 431195825 418011914 343701712
19689 343701712 284073649 258580547 255616626 232958819 168721714 119762865 94271896
19682 94271896 79706649 70381866 63573419 58583542 54955087 52741921 51217069 49530693
19674 49530693 47658837 46146730 45540857 45225060 44612588 43808993 43240178 43113944 43368436
19665 43368436 43716635 44245762 45527581 47390344 50592630 55736292 63457473 75925340
19657 75925340 97069686 132502548 188911698 262693448 314476490 328641294 340490558
19650 340490558 374076641 434221816 481484074 450733601 364256629 303629826 279472301
19643 279472301 274579736 239972380 171062706 123544523 98168791 83131926 73318876
19636 73318876 65866289 60378846 55747190 51801602 48738794 46383548 44315067 42344668
19628 42344668 40850615 39602044 38257513 37056202 35590769 33897188 32389617 31517056
19620 31517056 30354789 28812336 26981713 25676971 24458664 23421575 22329947 21182577
19612 21182577 20263147 19302915 18456605 17790287 17194037 16651835 15956810 15250367 14665878
19603 14665878 14214990 13939081 13692534 13515720 13094892 12579264 12106484 11468221 10843179
19594 10843179 10605346 10311042 10091831 9628386 9360259 8851285 8393153 8212228 8183063
19585 8183063 7733285 7481965 7128429 6762909 6482775 6369250 5854905 5552897 5347397
19576 5347397 5110120 4954646 5017376 4987719 4615207 4451278 4401586 3911538 3897898 4310376
19566 4310376 4448241 4429794 4478394 4604234 4494708 4183141 3996027 3588063 3419606 3369713
19556 3369713 3340567 3432245 3541075 3655951 3683856 3340291 2881936 2790160 2919758 3002146
19546 3002146 2865989 2570030 2516095 2463846 2281205 2224922 2117951 1815477 1655503 1615423
19536 1615423 1605760 1592068 1416952 1481053 1696193 1558536 1356403 1298371 1429753 1368404
19526 1368404 1068903 1043050 1075941 1037114 1341924 1691737 1713764 1458951 1313206 993208
19516 993208 1102838 1091097 1156317 1124450 1172180 1199525 1171199 1083983 1240201 1264644 1438533
19505 1438533 1513132 1297021 1421671 1328798 1194211 1100559 1096495 1085429 956909 1143745
19495 1143745 1461096 1730968 1618368 1606853 1564881 1483622 1450382 1297917 1070574 1013711
19485 1013711 1107040 996108 777094 920365 965565 1043000 928076 819870 993180 1143057
19475 1143057 1220022 1085118 982126 1206793 1149077 925072 732074 598627 504287 648388
19465 648388 928258 1055806 1084286 833601 821291 808208 855248 1018536 979671 1072924 1008280
19454 1008280 985395 938241 816491 685782 898728 1018018 709239 462545 28860 125756
19444 125756 202147 211386 255947 280365 534429 537950 388302 318217 318310 287741 276634 182912
19432 182912 217234 290260 276128 394043 483296 440329 347948 283109 310999 433718 413413
19421 413413 226375 190508 66018 378423 672787 658874 445055 278784 401063 426179
19411 426179 358860 468549 383604 312478 461517 740194 719076 589847 538610 413318
19401 413318 252656 114814 108439 -30378 133412 225068 -4307 55600 265950 230996
19391 230996 -10963 223873 480380 341120 185411 207364 242896 92885 248901 368327
19381 368327 260200 24102 160306 283890 292334 588045 587658 483129 529921 536550 560514
19370 560514 481510 208717 376301 495805 540722 327547 145499 174999 282083 270975
19360 270975 248100 241092 56284 -194342 -155589 -21812 124273 189569 -1031 454742
19350 454742 897198 1202012 1479305 1400385 1213139 1319533 1500594 1553573 1537887 1406249
19340 1406249 1284297 845647 402072 269578 462616 462642 271453 205344 489798 520881
19330 520881 464263 401680 315524 116803 103408 204921 162901 357777 342453 371643 331694
19319 331694 367422 182299 513824 467606 217035 97228 157984 161384 100270 297726 327926
19308 327926 479408 651144 897679 1178828 1453828 1432033 1373690 1277846 1202421 1096976
19298 1096976 1062205 1014521 1052432 1036250 1086537 1068588 1129280 1344366 1702035 1958675 1753493
19287 1753493 1697038 1713048 1850217 1655240 1222387 815931 592532 559958 769433 909622
19277 909622 733911 618251 525774 312647 486092 617825 649640 574107 635670 670386
19267 670386 846561 1150598 1347133 1337687 1475293 1729236 1980265 2372479 2492986 2180244
19257 2180244 1923900 1736711 1676594 1804134 1511774 1152240 953727 736286 1113902 1362897
19247 1362897 1358134 1356857 1643709 1565185 1475709 1210073 1195737 1152958 1143976 802506 645551
19236 645551 642428 650642 548631 633659 713240 745707 625084 470623 271942 194685 367328
19225 367328 429502 113660 10061 383065 380049 116498 -88095 100025 258443 383474
19215 383474 482764 560508 512983 461796 560378 862780 1106569 1418420 1722750 2092287
19205 2092287 2349961 2741619 3027794 3230377 2847498 2323125 2085453 1993821 1782478 1394328
19195 1394328 1018805 800616 517787 313463 489053 544278 257486 138323 158248 124677
19185 124677 217145 96362 172169 81057 7513 67276 184863 248875 320059 167363 30724
19174 30724 -53827 -39421 141849 -124746 -10002 149385 498282 630433 512456 524373
19164 524373 381269 405508 518209 651936 743007 507357 879318 1408178 1348879 1461148
19154 1461148 1522488 1569913 1791321 2055902 2145628 1924026 1573488 1387941 1265875 1069266
19144 1069266 826128 460358 125516 72709 203820 557455 568323 443661 613939 369276
19134 369276 112011 87459 393466 460057 400597 548229 538066 458869 472115 410828 460744
19123 460744 679951 686107 842043 907728 918521 956945 1082353 1140742 1117362 1244374 1430408
19112 1430408 1499116 1626720 1929978 2294882 2862500 3032881 2845375 2448012 2052224 1585326
19102 1585326 1237061 1084440 835327 595041 402907 60731 226154 387422 436537 247066
19092 247066 262418 518814 691692 773893 715051 668758 537373 487185 168138 46159
19082 46159 89451 248992 292370 460199 428218 428500 384453 174793 269341 417982 324438
19071 324438 115959 -2292 86257 617220 880308 626068 671671 816353 641243 379762
19061 379762 144556 54147 146518 212833 69507 110232 162748 -7524 -233549 -162563 195738
19050 195738 351451 232112 85864 -31629 -82545 136682 127127 53260 -10748 -173886
19040 -173886 -155809 -247893 -202119 195343 155360 44385 -68820 -74864 -55083 -150601 11384
19029 11384 -208323 -139843 135045 267541 297462 465607 342112 55110 -302439 -367736
19019 -367736 -379197 112049 534332 251646 -113666 87985 340830 385138 398906 285125
19009 285125 191275 174384 282283 458626 427423 205638 119720 112623 -11886 30717 243220
18998 243220 487656 509883 442557 431757 611812 789627 753084 463811 148619 236026
18988 236026 352895 310645 36674 -34252 -79536 9788 151 69706 101689 415415 366161
18977 366161 421236 621979 480703 365907 376629 294211 205186 193019 329752 335752 141827
18966 141827 277577 441205 599772 570704 518955 406641 395226 453900 494960 632403
18956 632403 805074 891640 610473 255243 153283 70849 152996 597317 923038 783128
18946 783128 389090 328040 289665 294970 542565 573353 869385 789259 983006 824111 598025
18935 598025 520705 670377 617990 382443 347022 617512 718834 715228 678570 711852 658464
18924 658464 481060 514663 397033 214852 143245 9544 67283 323846 433113 552638
18914 552638 547433 356126 232398 287972 272118 311405 385030 675848 632021 412702 474212
18903 474212 440256 389279 596751 681204 911671 914144 842843 1092582 1125114 893298 920224
18892 920224 893837 892123 830718 666181 728929 957118 930532 1044928 1277347 1498810 1492087
18881 1492087 1478860 1400364 1398511 1340491 1074909 1108979 1120329 1237197 1286260 1210550 1164780
18870 1164780 1339725 1265487 1074721 1019936 1101972 1179185 1245651 1346726 1274217 1299881 1403214
18859 1403214 1449173 1706243 2003087 2072882 1846466 1880680 2284156 2324506 2443760 2880601
18849 2880601 3407774 3392246 3418843 3592210 3868818 4181581 4571610 4883351 4567457 4528453
18839 4528453 4662389 4899676 5223056 5652467 5597235 5201240 5355693 5883202 6378103 6867095
18829 6867095 7585603 8425063 9582204 10975013 12595697 14948172 17467756 20513075
18821 20513075 25139635 32075214 42255359 58757111 86209546 132005771 197454941
18814 197454941 253176148 261549585 245158185 229123649 226489912 239506010 233290706
18807 233290706 169448667 110517588 79421821 63001655 52870916 45656898 40634468
18800 40634468 37306881 34941233 32738289 30805308 28948919 27375631 26425290 25933967
18792 25933967 25289707 24519433 23912222 23529215 23348125 23583217 24051409 24546156 24940877
18783 24940877 25439240 26348085 28000331 29791216 31898451 34454838 38149269 44197314
18775 44197314 54169813 70740676 98202690 142880521 204068096 248997635 251222681
18768 251222681 235954462 224290520 226287327 241130013 230136184 173467307 132287650
18761 132287650 119826925 128120455 156830691 206709328 257001610 268104465 251857703
18754 251857703 233770346 226626547 234539698 235093617 183557393 125302120 92902215
18747 92902215 75400404 64515924 57443981 52290796 48561717 45559452 43080083 40750220
18739 40750220 38684993 37059322 36033318 34780243 33195868 31589843 30329214 29385217
18731 29385217 28805642 28527672 28079939 27401955 27224461 27278892 27471452 28260231 29734347
18722 29734347 31187226 33076500 36045801 40496748 48066297 60986424 82775784 119160348
18714 119160348 171953258 217328118 223680766 209179803 194733694 191388188 201201323
18707 201201323 196263132 143777631 94559527 68377222 54590112 45962708 40051763
18700 40051763 35773339 32433396 29673305 27386282 25584098 23969214 22747330 21447199
18692 21447199 20211765 19378063 18617615 17670032 17022222 16713523 16321896 15879369 15304433
18683 15304433 14714485 14626419 14508374 14216596 13644118 13084327 12619198 11904254 11262897
18674 11262897 10798448 10557717 10131624 9323774 8823209 8441780 7876690 7491842 7281249
18665 7281249 6936323 6540831 6282510 6220392 5792284 5557314 5401415 5080347 4954482 5015762
18655 5015762 4600497 4281089 4128023 4111341 3938602 3733444 3553328 3659878 3846306 3742103
18645 3742103 3537171 3432819 3068097 2893932 2974050 2934786 2658983 2565028 2381701 2322759
18635 2322759 2250377 2355515 2203763 1912770 2002628 2192972 2229571 2072776 2159842 2257226
18625 2257226 2117866 2214715 2273920 2221599 2211850 2243662 2211727 2271221 2258884 2113742 2013568
18614 2013568 1828875 1669790 1615204 1488179 1088079 1170397 1222056 1005073 934250 747674
18604 747674 660680 762599 734661 710318 829924 955544 690502 615963 799103 741756
18594 741756 625582 755520 702288 698419 677452 436282 229014 264633 392608 555836
18584 555836 532608 547552 744820 749169 662013 615635 653694 553678 248777 412303 462017
18573 462017 427339 692247 763884 934484 1073787 1004358 961201 840771 710681 660918
18563 660918 660677 859354 724852 610766 713074 483421 564195 909593 1067317 750986
18553 750986 710103 642710 390304 219952 39102 -91084 154920 202045 291622 451194
18543 451194 759954 727163 527007 304530 92223 -38371 350786 449209 355841 262882
18533 262882 249608 365066 375891 310733 437685 662353 667084 524402 551053 384469 335242
18522 335242 282000 380704 201485 -110802 -37798 212772 197332 342925 146540 286368
18512 286368 463445 548223 543510 388428 131447 84258 1616 -48934 295905 535213 568873
18501 568873 288677 151468 231381 164364 227296 130032 80279 113655 110352 102153 210258
18490 210258 100510 386416 566137 441951 473886 553568 620957 851391 592837 651405
18480 651405 561254 312081 380726 571134 570820 274910 287267 27732 -132947 -57305 -96579
18469 -96579 62201 165239 390025 371912 233114 44818 33321 -99377 5978 431257
18459 431257 426574 302952 250235 147221 239333 316825 562268 563955 528921 566402 549802
18448 549802 547874 482311 396916 208214 -25712 -27210 -75277 -116191 27574 111020 82375
18437 82375 113586 211804 219863 165765 269211 348381 50550 1796 176797 212692 194276
18426 194276 -108000 -149268 101830 1292 -82778 162301 284107 135084 368305 414100
18416 414100 333481 222849 55466 -147691 -106984 41139 116259 69755 -2615 -144307
18406 -144307 -134499 -7914 10233 11189 -232942 -427490 -434380 -284603 -271357 -200638 67424
18395 67424 235778 -10040 175164 297536 229688 -42461 36324 87217 84107 19274 -161565
18384 -161565 -443455 -352899 -189893 -267793 -72801 33348 -150319 -274589 -196997 19625
18374 19625 228552 146511 174870 55733 61654 -57109 -96394 -95728 -60249 -24814 -38683 -38805
18362 -38805 232552 321486 230742 185216 134028 83228 139426 283741 410896 436213 33814
18351 33814 4425 81454 62635 -56978 24995 -88997 -46779 35078 -184825 -82591 -127462
18340 -127462 4331 115838 20970 -41248 -76675 -236664 -123567 -92935 -175744 -68297
18330 -68297 21531 98820 147279 126558 68222 60865 -69691 80249 214201 -86207 -130229
18319 -130229 92750 63621 -141155 -271171 -336589 -12919 216669 409846 157047 -148191
18309 -148191 -221052 -66212 -111028 -323073 -116417 315295 367301 476730 490257 175526
18299 175526 -52745 -114640 -126905 11062 82094 192083 144248 186208 185745 -25827 -189003
18288 -189003 -139979 -314540 -524033 -527813 -443582 -381020 -44355 198042 123335 227273 326119
18277 326119 578346 678661 839494 1074389 1452827 1756896 1568633 1354587 1223289 1057313
18267 1057313 997696 1060488 902280 717853 536866 352055 380887 203791 197067 166876
18257 166876 326046 405180 193198 -88815 -141096 -241867 -178344 10409 -97669 -169822
18247 -169822 79771 308037 603631 705526 826411 745247 422495 316258 380844 133542
18237 133542 -16292 -113721 28440 385227 643202 873268 1030479 1126109 1301461 1526697
18227 1526697 1732643 1595353 1488736 1627028 1490005 1207189 986634 922824 772751 831432
18217 831432 1213672 1497831 1376471 1222134 1283944 1361056 1384367 1269227 986318 685939
18207 685939 512277 271129 203725 217830 328663 511634 534561 695065 649669 739343
18197 739343 861807 876714 708949 804414 750061 537753 380124 474110 517952 368410
18187 368410 75954 214606 236191 128297 390462 575252 550062 442642 554141 798860
18177 798860 929970 1058276 1261156 1351159 1513517 1557178 1460233 1390614 1349022 1273229 1264718
18166 1264718 1689244 1308271 959120 728875 598554 568955 739172 626265 544187 667530
18156 667530 499161 402769 331813 507452 740669 947502 1055339 1076591 965900 1075725
18146 1075725 1377567 1514635 1583495 1729332 1627123 1375453 1263672 1079665 1058350 1265935
18136 1265935 1577407 1949115 2063205 1954697 1810374 1745246 2066374 2206702 2599502 2885127
18126 2885127 3077417 3407477 3881892 4382406 4548234 4886562 5714530 6571249 7625924
18117 7625924 8751290 10231386 12294593 14893243 18527165 24575772 33789531 49315315
18109 49315315 77009740 123096745 183520765 218215069 211262947 193315590 181544162
18102 181544162 185115991 199781796 176509194 113021062 71513172 51315715 40584497
18095 40584497 34158380 29681290 26606316 24303531 22118565 20448273 18939669 17895707
18087 17895707 17061460 16041731 15312666 14605025 13728680 12863500 12393220 11887433 11509596
18078 11509596 10946454 10509484 9991971 9332691 8874084 8419002 8023049 7642236 7299951
18069 7299951 7131688 7003715 6639778 6202734 6210507 6009914 5751994 5459706 5250931 5036552
18059 5036552 4700489 4477381 4468349 4258297 4042608 4020949 3944389 3813029 3714104 3898647
18049 3898647 4202593 4314555 4110360 3855558 3927475 3826985 3741407 3675987 3588580 3482928
18039 3482928 3222932 3183309 3004853 2700221 2510312 2401667 2241123 2371157 2302938 2106685
18029 2106685 2292669 2180246 1774270 1786692 1762727 1572612 1385900 1199902 1239362 1332120
18019 1332120 1405322 1648434 1673565 1673607 1578025 1539615 1509150 1423755 1282739 1395239 1543101
18008 1543101 1381481 1071654 790613 607403 628560 952779 851757 519941 699211 880411
17998 880411 989866 970518 827065 813511 1080248 1117915 1005317 881045 1059846 1207653
17988 1207653 1277734 1482439 1744099 1417837 1314568 1411228 1562512 1538355 1646109 2021202
17978 2021202 2054636 1742323 1780234 1926030 2012050 1880845 1703872 1420140 1239328 1093971
17968 1093971 710991 807401 818810 665450 642926 586518 447990 640790 646186 394204
17958 394204 203099 323581 517351 530689 460372 440789 537616 442180 324810 198968
17948 198968 210364 360964 693447 791085 845269 858907 672569 651573 726607 922702 904299
17937 904299 1103013 1222031 1287528 1237656 1216607 1244667 1486823 1539372 1291161 1338151 1373153
17926 1373153 1503958 1522709 1329358 1042463 811554 648892 299670 358302 483480 261568
17916 261568 66034 -106858 -177149 -103336 203699 104480 -23598 48640 153730 170578
17906 170578 346163 533572 249908 -122725 -40352 29770 32026 124156 387967 240578
17896 240578 89894 149739 18255 20031 -2027 111762 313119 348582 334474 217648 136989
17885 136989 306979 309597 227518 429602 390794 406216 276036 305235 193031 -75895 -299312
17874 -299312 -243322 -85558 72302 159151 -82983 -155742 179828 316165 103164 232286
17864 232286 450344 482322 362929 285819 389048 135306 -67336 55795 -85029 -314058
17854 -314058 -209440 -140273 24333 -32618 46064 -148617 -236960 -374149 -375916 -145520 -62388
17843 -62388 -42231 23036 254339 137305 -22510 -95982 26913 105052 -121335 -459271
17833 -459271 -474066 -217809 -246992 -206272 1658 -3619 -48114 99914 195201 286098 266966
17822 266966 106454 9237 -77540 134807 128094 21339 -170867 -39758 -20763 131963
17812 131963 53626 -33026 -76057 -107040 -250815 -228931 -120297 26153 71613 9232 -223165
17801 -223165 -196501 -133533 12870 86548 245145 -32297 -343104 -198395 73467 141758
17791 141758 101793 248035 120344 33149 63837 67146 35427 -133721 -94694 254468 413470
17780 413470 476395 405519 232695 23787 -40919 23780 48410 -173307 -281218 -309825 -213181
17769 -213181 -13574 -127224 -177119 75666 -114136 -150246 -113681 -62659 -190818 -134802
17759 -134802 12950 25113 197547 176058 -28747 -55289 -52795 -245946 -37342 84983
17749 84983 44124 -45019 -15742 382322 377234 132563 80926 326974 388295 117302 -226995
17738 -226995 -436602 -355636 -276274 -267903 -250552 -187699 -321439 -365305 -259821 -354355 -479462
17727 -479462 -453395 -160195 48851 -114543 -31055 2539 -219207 -282461 -342757 -276259 62858
17716 62858 204840 -6044 -168523 -95476 130575 120645 263652 330161 345706 118482 -167662
17705 -167662 -179631 -144263 -2006 11945 202737 353307 200515 151089 239252 216124 102766
17694 102766 355230 446246 549038 486063 133070 83706 23495 163145 145172 186992 206317
17683 206317 340808 207303 93359 63628 77564 138455 210039 61145 -54991 291452
17673 291452 352164 -185798 -273681 -165961 -332331 -384751 -422351 -85487 235308 183261
17663 183261 -236413 -218048 -128590 -194474 -161896 -158634 -256114 -207663 -40701 -136653 -209921
17652 -209921 -245873 -238573 -162573 12517 158984 90623 97337 -57364 -127198 -206413 -41428
17641 -41428 63233 -108288 -189593 -49211 -1150 -157626 -134276 -193868 -239316 -446912 -310070
17630 -310070 76744 91517 105260 64797 -32616 1461 34541 98713 170576 110535 -63791
17619 -63791 -234071 54624 205991 63858 -109920 -338119 -303867 -438372 -481352 -386921
17609 -386921 -438795 -161588 -59463 75768 162727 313548 513800 268965 -19769 -438190
17599 -438190 -424505 -265145 -382724 -327815 -262345 -100781 23119 476 -148526 -389115
17589 -389115 -336532 -60234 -89883 -102212 -181464 222803 333576 21435 109185 110793 -27648
17578 -27648 -360292 -178434 -95522 -234307 -157100 -95796 -206412 -195072 -74136 75889
17568 75889 61694 -150289 -254700 -286242 -307572 -314588 -231341 -235606 -266758 5925 110571
17557 110571 144434 16619 87920 332702 284146 277311 307594 205582 151242 168991 194810
17546 194810 100227 -90831 -79797 173305 321060 259838 26306 29274 178124 72910
17536 72910 -33713 -185793 -244846 -367751 -572495 -550932 -222353 196963 239266 109163
17526 109163 -33356 32411 127843 283792 -1090 -10133 -50860 18075 65153 181650 343734
17515 343734 301587 254693 275596 106299 -42843 178101 60914 -89804 41670 422328
17505 422328 299609 166876 64932 255481 519449 417607 265092 247214 80343 -316228
17495 -316228 -364470 -353204 -392692 -284972 -146652 -342729 -240992 -276378 -336647 -349107 -47332
17484 -47332 71128 -2937 105435 50389 68277 58224 -36318 -56764 -8099 305143 337253
17473 337253 367483 459763 405158 180560 50360 -41252 -119561 -121321 24233 193335 106353
17462 106353 173160 416160 373951 227158 321162 92001 -77865 -156272 -188912 -167440 -225150
17451 -225150 -130802 -74462 -79423 -50860 77378 144374 -151194 -103500 76610 374613 599659
17440 599659 980621 1184290 1028844 735257 740589 817099 885797 705738 296818 252875
17430 252875 466306 404207 423613 164429 -216870 -279681 -195298 -178386 -52088 -128044 147988
17419 147988 322790 386899 188953 59734 16832 -48689 -17436 -102344 -198720 -141063 -11815
17408 -11815 -31132 -223664 -237897 124243 199790 45828 -135641 -326970 -419502 -267411
17398 -267411 -236714 -174397 7325 47265 131953 98623 -267273 -94693 106313 103343 -22636
17387 -22636 -109570 -347249 -591599 -301797 -38836 -37743 890 19372 56602 205759 270187
17376 270187 32063 -368426 -372549 -156096 -83899 -133615 81983 156932 89120 80010 -5803
17365 -5803 -80616 -310569 -140704 89132 171569 293304 229879 299478 210786 -90875 -170963
17354 -170963 -110048 -110186 -51267 125977 245811 143698 277398 251205 -14959 104593 167509
17343 167509 291220 299483 423043 242417 454355 867110 650737 365290 362563 498196
17333 498196 304161 226765 150838 111793 148410 73599 145165 96765 54417 -34253 -58557
17322 -58557 -106200 53673 233120 287779 30226 -161560 -68460 225900 27460 -172529
17312 -172529 -1137 -9613 158244 126468 22884 -190774 -317214 -340171 -320186 -256380 -428685
17301 -428685 -415338 -318463 -144338 76738 2716 -148214 -157794 99504 190580 39108 -213534
17290 -213534 -464541 -222324 -201734 20774 106249 204530 1015 -319219 -355582 -59842
17280 -59842 -112434 -222762 -163745 -45054 -116892 -6058 114456 234090 413381 456730
17270 456730 506982 614895 889041 690167 -35257 -260759 -137955 28273 60054 -13192
17260 -13192 82097 -91660 -118080 16463 92398 42174 231052 281855 216496 303362 164435
17249 164435 125148 107081 205975 147856 93643 137191 85981 -240305 -243211 -20120 26133
17238 26133 112361 234355 113453 71138 56574 -79809 -237258 -212769 -68355 -52623 -975
17227 -975 -102066 -127670 124046 171578 75450 45501 125733 175763 -4728 277282 312152
17216 312152 295406 397461 209351 100108 111738 125934 143857 68109 85303 393600 430911
17205 430911 409011 67092 65673 114262 220799 509683 591202 560490 369973 141956 63726
17194 63726 -10416 105448 -111836 -128045 172342 -39656 -221351 -174922 -325419 -564838
17184 -564838 -568470 -415459 -94741 177280 178860 63521 -291077 -226351 -185636 -93888 82677
17173 82677 223266 85312 45424 95005 195782 142426 93533 120463 130048 -123203 -320418
17162 -320418 -421645 -422289 -191740 -153793 -185811 -195545 5197 213297 376153 519087 575901
17151 575901 490634 136313 18776 112242 176244 58335 172490 282645 224287 -43869
17141 -43869 -143636 -237511 30484 133964 398395 319874 201701 238304 307839 85367 -111706
17130 -111706 -193080 -300056 -259596 -287063 -231726 44720 89158 -106485 25137 232842
17120 232842 199653 196323 204328 165248 240239 -74519 -296543 41503 101513 160792 91110
17109 91110 62782 -3799 18930 -15681 -44087 89770 245268 165286 121561 -142011 -168722
17098 -168722 -214873 -170464 -54050 -112772 -111359 -180533 -384537 -350155 -131990 -63990 -144657
17087 -144657 92861 211105 276494 505964 486396 350681 158151 46302 53790 120231
17077 120231 131995 -78373 -162778 191517 160114 216041 51740 -4542 -88142 58247 128241
17066 128241 167475 161992 -57152 -80530 -247792 -188436 -16730 99273 228702 372739
17056 372739 157659 -117570 -223502 -92645 -98841 -333039 -375699 -322322 -144977 -65156
17046 -65156 -155258 171579 331974 164652 -59242 -194673 -56507 -172120 3572 64624
17036 64624 -79952 -177435 -35274 66010 -67387 -14040 94471 -145425 -163760 -83394
17026 -83394 -68466 -51057 -167861 -136735 -84951 -191364 -123839 38870 74631 80978 -31675
17015 -31675 -340772 -313668 -202339 -331522 -488417 -649547 -503300 -246283 -367729 -280837
17005 -280837 -57186 -259052 -357619 -358891 -120065 -108908 -281770 -93594 185791 110186
16995 110186 89524 -201258 -409079 -275792 -71735 -198606 -430761 -291928 -134124 -92051
16985 -92051 -252537 -224894 -269575 -585565 -582864 -406379 -566895 -691582 -609716 -309743 -61848
16974 -61848 -88159 -266697 -187809 -194515 -221777 -265234 -201577 -269785 -379507 -367655 -418678
16963 -418678 -322754 4856 142549 44054 90635 -14110 -278608 -330470 -144573 -247601
16953 -247601 -268414 -254611 -57435 -113794 -383202 -253171 -103238 -90921 -219273 -298972
16943 -298972 -150659 -698 -149538 -110833 87994 -44222 163961 396845 239921 -131719
16933 -131719 -95135 -36657 -91902 -147615 -69200 166389 239373 16148 -168034 -141222 -192586
16922 -192586 -199085 25694 -48478 -39505 56650 157796 246726 -92251 -243978 1152 75094
16911 75094 100126 28709 -68751 -71297 -46584 175028 174882 203645 -8553 -394343 -701274
16900 -701274 -704575 -447848 -162539 -47712 51146 62794 -128476 -328802 -317939 -237025 -104130
16889 -104130 -66002 -56287 67496 -40880 -306279 -560596 -290321 -213382 -292457 -91428
16879 -91428 28983 -166845 -165090 64563 97527 136288 86374 111864 -93123 -119228 -191125
16868 -191125 -187435 -386024 -294677 -45293 126975 143277 -308185 -257470 -142300 -116595 -140307
16857 -140307 -249988 -310790 -316202 36338 -24547 -208461 -52593 -195371 -101911 -144702 -349071
16846 -349071 -364894 -35373 48351 -217216 -371728 -294647 -214883 -141531 -66590 23773 189140
16835 189140 414432 268068 303823 119895 -186157 -73800 -26241 -213388 -420526 -220675
16825 -220675 -207503 92314 353779 487868 201907 88120 167897 251954 195584 412479
16815 412479 250291 69530 89030 57848 -63062 -108635 -176689 -133854 -154665 -171432 -43100
16804 -43100 68076 -101109 -63865 -239508 -159553 -193214 -260957 -348597 -223064 -138803 -73328
16793 -73328 -318095 -168011 187892 49316 -127159 -329964 -264091 -142783 -188736 -240473
16783 -240473 -198966 -16696 5393 12946 -25284 -13341 -119088 -254786 -366831 -218545 -226931
16772 -226931 -215448 -65325 -5526 -132402 25882 108705 19300 3906 191210 329079
16762 329079 228833 278475 33172 -45356 -155063 -242419 -292407 -318699 -325351 -185534 -53850
16751 -53850 7853 279013 247944 137597 63418 185171 221059 174389 -117726 -224617 -87068
16740 -87068 50795 -124778 -31568 -231293 -604898 -594005 -328345 -213258 -180152 -196981
16730 -196981 -115640 -143573 -274946 -270092 -410797 -407094 -309472 -83903 22460 37159 67935
16719 67935 -131 57076 -34271 83554 165576 312312 125473 51199 18115 -228045 -161533
16708 -161533 -32600 -58220 -24492 123406 382047 227502 83726 -192122 -249946 -197076
16698 -197076 -202603 18291 2496 -189911 -224151 -105462 44557 -261924 -617837 -391143
16688 -391143 -250047 -361968 -386755 -85981 -9566 -66113 -23393 11523 -3436 83285 79403
16677 79403 -131900 -261530 -205110 -73095 -185268 -35223 -28971 -291113 -579386 -620277
16667 -620277 -385653 -241744 -302877 -436585 -270759 5597 -63927 -235850 -11146 168981
16657 168981 324387 503079 479116 323375 7328 -230162 -246084 -178166 -82795 -155573
16647 -155573 -144209 -60258 5642 82678 68999 -190136 -360474 -437401 -395470 -479490 -487788
16636 -487788 -223191 36711 -29562 -85167 -278718 -106911 190392 214885 171417 -79019
16626 -79019 -48688 10582 121664 194549 98079 17856 -3960 -10154 -144743 -200901 -163272
16615 -163272 -130170 152690 321222 384327 244914 326183 415899 93684 -91149 -371940
16605 -371940 -218850 94003 74643 130359 345336 493648 580669 770962 628001 657776
16595 657776 413154 136774 143243 78548 -35899 291446 198629 78173 238553 130671
16585 130671 -30401 8690 -20050 -100156 -251337 -264631 -420126 -589028 -765289 -792976
16575 -792976 -496764 -236783 -174978 -183632 -223458 -128572 -138860 -71436 141345 75256 -62748
16564 -62748 -116412 -185360 -88124 -55160 -231617 -253713 -54992 -121537 -121259 -158021 -234591 -329950
16552 -329950 -93521 46931 -109761 -156659 -330049 -508680 -525480 -498900 -252798 -14224
16542 -14224 5448 -190023 -482199 -388826 -108919 -100453 -42157 219089 330902 272790 1613
16531 1613 -81874 201757 212913 -40660 -130699 -129538 -4175 94274 205826 -54371 -385862
16520 -385862 -488571 -174284 6765 -47694 -1795 -28672 2198 154761 -29024 -220318
16510 -220318 -166487 -171076 18454 -54700 -8400 -11593 -225070 -196265 -102557 -37375 -179190
16499 -179190 108232 271757 105988 124060 114585 133027 123302 65779 145304 152138 320657
16488 320657 477533 491563 198035 -150829 -231920 -448223 -387173 -229319 16109 287620
16478 287620 363812 255673 300104 207561 142900 114784 339138 207510 86749 209761
16468 209761 166432 -143021 -211401 -383043 -401261 -400292 -348232 -390345 -199477 -304181 -721023
16457 -721023 -730551 -556106 -486086 -489471 -300841 -220400 -92096 1541 38447 179705 85282
16446 85282 24228 -177976 -187872 190884 182863 83971 -87755 -250403 -468220 -108874 313395
16435 313395 443160 333593 287773 94446 -342685 -496602 -423830 -243355 44899 82713
16425 82713 164463 51376 -52745 113758 204531 113462 160383 303668 102751 114369 67970
16414 67970 -118633 -286690 85061 -22380 -350836 -402738 -162324 -26197 -17052 117665
16404 117665 300162 269804 242931 283715 194898 67644 25372 25477 -207851 -435118 -225083
16393 -225083 40494 118756 -45341 18984 -21155 -35494 -239617 -114595 29415 -89928
16383 -89928 181786 8277 235103 499476 461936 311563 162193 47777 -45172 -117166
16373 -117166 -117431 -157483 -477958 -626982 -517921 -358036 -293944 -305165 -514794 -503998 -202596
16362 -202596 -285062 -218666 -134592 -376161 -237649 -449466 -263206 -145018 94442 122757
16352 122757 63429 -128064 -257692 -355131 -112404 -36630 -98769 -340911 -467239 -442541
16342 -442541 -344818 -257917 -109053 -44764 36506 -76707 78874 336944 360272 279480 398555
16331 398555 340839 -235758 -298077 -192143 -15478 -36083 -24354 -64951 -79114 -266258 -166943
16320 -166943 1531 -76787 -95969 -156055 -416797 -564314 -395147 -161371 -154188 107141
16310 107141 12357 -303775 -81617 -14782 -216439 -572423 -553482 -317456 -227205 -67690
16300 -67690 93050 125457 97727 177980 193006 50236 63809 -49519 31880 -45557 -69300
16289 -69300 -299038 -129575 53229 248912 175064 180976 343061 340618 301644 113406 75597
16278 75597 7331 167339 292527 100291 -98395 644 98336 392023 212148 -16724
16268 -16724 -372907 -646018 -397256 -322364 -388799 -345256 -314765 -356186 -92866 26888 77643
16257 77643 147399 242212 271418 223884 63831 30457 -89311 -149180 -247118 -401577 -177237
16246 -177237 126033 174744 117547 212455 236216 163624 159688 17417 85924 58910 105977
16235 105977 315577 111076 -92296 -245032 -408868 -74300 93172 7155 -170734 -148387
16225 -148387 -103776 -152994 -59377 86467 -97815 -142111 -55050 64573 -250177 -242132 -117103
16214 -117103 86946 18586 -14054 130411 230993 202577 211601 70482 91072 130546 7587
16203 7587 680 -108544 -233450 -282369 -360583 -359781 -234273 -193824 -82381 -46922 -382974
16192 -382974 -192649 179939 67539 -123715 -237849 -494173 -434104 -260991 64404 348383
16182 348383 512332 393426 166083 -146486 -182763 -364076 -263363 31412 22570 85067
16172 85067 148591 170221 82543 -54131 -313303 -370178 -25496 322515 565758 695673
16162 695673 515961 400979 196673 -48574 -129153 -77227 -38480 -77411 -49101 -6079 70103
16151 70103 -12160 -306248 -327757 -253512 122182 255149 171581 422839 409474 55671 -237094
16140 -237094 -78797 -263872 -258849 -123195 -45933 23776 -147050 -162807 36142 22264 -66701
16129 -66701 -54839 -131375 -82067 33184 27945 83423 69556 153763 246844 156226 -114564
16118 -114564 -41524 -47117 105016 212085 150106 40804 -70041 78022 -79431 -94280
16108 -94280 22112 216873 270514 59255 35685 44321 244017 302570 375752 428177 250188
16097 250188 74872 367648 414691 305015 60976 -132135 -308106 -357592 -334570 -228867
16087 -228867 -552583 -441729 -77272 123495 128856 102091 -72150 56452 326478 281804
16077 281804 180615 49597 7053 72811 154242 64477 343701 528000 241987 -122127
16067 -122127 -347715 -465228 -186897 18389 158803 -47143 -3162 -123760 -173450 -270529
16057 -270529 -206575 -17590 -23137 -196972 -45571 3248 -132508 -202983 -217974 -98913 -179012
16046 -179012 -274455 -321959 -402771 -441429 -386627 -228122 -43765 32516 -128835 -145185 156824
16035 156824 231580 60437 -129763 -100555 -187447 -66700 15504 -24550 -180046 47999
16025 47999 -34901 42600 -143854 -147589 83134 104622 127356 81990 176765 176757 26395 -107878
16013 -107878 -154788 -140271 119976 297601 78269 -139627 -175951 -178375 -173445 -154115 -373207
16002 -373207 -407125 -252705 -41440 159348 102008 174733 19327 -87809 -21547 114753
15992 114753 101155 -129563 79714 61541 105683 -9686 39434 48290 65973 62705 -101943
15981 -101943 -52147 -53114 -225933 -337488 -419691 -481477 -188272 -235057 -232270 -180713 -319402
15970 -319402 -321383 -198018 -102323 -34889 244543 364163 210210 -59255 -170514 -155885
15960 -155885 50510 173655 224635 418086 510034 438131 360606 120142 -32190 -98569
15950 -98569 32197 46470 7779 -42471 -60302 -144649 -145827 -175429 -90911 25246 27959 -128116
15938 -128116 -137407 -18139 152923 327730 402427 252723 261248 161434 55369 49577 75619
15927 75619 390180 421397 225243 63041 111992 70641 -37100 -184501 -477433 -394605
15917 -394605 -143935 -256200 -131615 -1979 1456 -165101 13994 -25993 -156431 -244872
15907 -244872 -103999 1630 -71737 172747 219394 282318 240091 299477 79042 -155294
15897 -155294 -190574 -153645 -46695 -26112 81736 125400 255832 422125 234673 95659
15887 95659 -67978 120834 257916 86733 -134779 -207328 -265006 -332261 -400016 -211211
15877 -211211 47274 -62661 71278 274356 206966 112975 448 168955 55311 -122816
15867 -122816 988 53610 -159170 -111063 -24125 -125733 -164340 -86209 -152318 -126084 -96303
15856 -96303 -178711 -227990 -207954 -16422 143480 151580 121171 -86261 -177962 -388447 -307955
15845 -307955 -245075 -47488 288828 368584 305130 502719 384381 114602 214553 424667
15835 424667 504748 459556 462363 188708 14751 86643 196199 81042 155971 430296 514287
15824 514287 509831 225715 -141740 -223985 -300037 -400046 -140770 -28690 70667 298346
15814 298346 149120 180484 129295 -1897 51652 115178 154897 -82519 -96524 -128030 -107689
15803 -107689 25369 144986 143363 78537 54638 -94478 -33902 13320 -4606 174437 169621
15792 169621 198322 -28612 21448 67248 26408 68683 314224 267812 187973 177222 240285
15781 240285 183750 123593 369297 406976 271574 215791 159333 -28839 -112258 49400 -25746
15770 -25746 -170822 61369 436584 260151 10502 218006 197052 8415 -168516 -117216
15760 -117216 -335995 -297538 -125051 104978 368705 632694 576843 576695 642392 393255 120937
15749 120937 10411 312442 319045 303855 172355 140328 -70013 -193961 -249945 -191149 121310
15738 121310 243008 100072 123398 56643 49108 68644 -114766 -258289 -60922 292869
15728 292869 327149 129906 226657 275567 229391 465750 734176 809040 607097 503139
15718 503139 350157 129200 -89065 5028 102430 219552 253864 211871 -245241 -416241
15708 -416241 -104770 33711 -33465 -403253 -433878 -302679 -136547 -21427 57256 16526
15698 16526 -55773 -81915 -197182 -99286 -246 -58281 -180246 -204131 -25177 132633 131560
15687 131560 69098 236601 319327 249915 167052 387233 387081 335029 220878 221424 269774 247038
15675 247038 148800 -49176 151853 394776 369060 205440 41851 -238016 -585257 -487630
15665 -487630 -205749 -401960 -586862 -342823 -175778 -18879 389589 406451 80200 -83213
15655 -83213 180781 251058 29016 -219880 -363574 -339532 -182561 78371 -39372 -176635
15645 -176635 -121142 -47065 -137573 -46633 -11435 -249217 -360809 -67369 -78479 -225358 4168
15634 4168 64518 36634 -409199 -589151 -248016 -307741 -289448 -264206 -208904 -142156 -134889
15623 -134889 -318800 -350626 -368407 -231341 -353928 -129756 155467 181301 97166 88681 55757
15612 55757 -192885 -74797 203483 4165 -40857 -153039 -330931 -362031 -330239 -249667
15602 -249667 -245044 49742 -45698 -16218 -41385 -55259 8262 151427 188917 174814 254880
15591 254880 232927 105389 -5635 -156091 -297880 -247203 -204450 -52956 101560 197197
15581 197197 -46524 101790 -4658 -139839 -289720 -142388 235699 507284 525234 222620
15571 222620 57539 351923 256188 245458 271354 11555 -217606 -130710 -32279 112936
15561 112936 95791 88420 289497 369471 249972 202342 39079 24534 65801 163891 26292
15550 26292 77259 193252 239322 245018 127082 249930 333684 448687 239792 155502 152980
15539 152980 -43567 -282379 -418506 -291222 -37131 104829 35119 -189085 40247 -27646
15529 -27646 -374564 -483640 -382345 -292426 -27860 82383 33872 118339 263318 58350
15519 58350 174817 253670 273132 330574 271874 207235 58102 -44402 -63142 126259 237564
15508 237564 -29290 -136574 -127424 -166229 -272863 -251364 -109619 258571 447037 404310
15498 404310 164241 -14570 -137133 -223004 -94005 140336 168228 5349 -208738 -204671
15488 -204671 -137134 -327568 -413001 -308930 -66770 129560 -139942 -182602 -334406 -223571
15478 -223571 -114066 189816 153130 74879 -3714 -123011 47621 8913 -34467 54238 99404
15467 99404 41535 -110041 -423392 -626144 -508056 -131061 14116 147522 85026 135207
15457 135207 266467 163603 186748 -5544 -134586 -88621 88358 36615 16173 -88530
15447 -88530 -243002 -275509 -114837 -229341 -216946 -276846 -549491 -542978 -310187 -300430 -187840
15436 -187840 -242869 -337082 -429257 -364231 -447853 -526752 -261243 -2137 188002 -31793 -168844
15425 -168844 -181148 -87369 -47929 193183 350600 363991 148350 159693 212294 -2128 -74809
15414 -74809 257011 318521 202204 35352 -123359 -272176 -377621 -468718 -219846 -32446
15404 -32446 -23285 201826 226825 74099 -112352 -341419 -177689 93793 85094 -76669 -54715
15393 -54715 43926 105709 106989 -114120 -341379 -323882 -179377 -97582 -104027 -430006 -309459
15382 -309459 -272132 -425145 -467865 -425224 -214276 -88929 143202 45736 -133498 14886
15372 14886 70098 -108775 -35573 -74132 54663 241524 293792 271118 -32684 -195524 -283550
15361 -283550 -260550 -270014 -217628 -82066 -6386 -33805 -47255 16553 225896 68234 -204124
15350 -204124 -223032 -66144 -77169 -63420 194205 96736 -50577 -74128 -120901 -297964 -90600
15339 -90600 196411 305158 72685 -120887 -174678 -121555 166650 224123 270927 231732 149895
15328 149895 340414 276385 63884 -43701 -149825 -4279 221078 110737 109661 127646
15318 127646 -109208 -25206 1212 178570 163126 -2458 97608 181202 4185 216085
15308 216085 532542 521873 387283 276547 249619 287413 473131 518757 404999 315353
15298 315353 387307 254527 240676 280493 386117 174819 10305 7102 27034 -178579 -142457
15287 -142457 136974 147689 -134496 -268760 150458 262578 219262 123219 153150 135556
15277 135556 46820 106399 311864 221970 -135145 -80786 -9066 -171563 -186686 -101567 81482
15266 81482 137411 -144265 -345457 -251590 -129636 100436 20399 16582 -98873 -263581 -420577
15255 -420577 -430837 -365681 -18860 40908 57823 278671 493106 251959 52229 -80546
15245 -80546 112066 262472 325845 161578 166986 63528 -27354 -28535 -95118 -209335 -73204
15234 -73204 122415 271228 478472 352436 55631 -126732 -190827 -140342 -276256 -345236
15224 -345236 38305 137164 223004 129705 117582 136570 -123098 -525043 -667291 -464188
15214 -464188 -395224 -388337 -182299 69255 254302 295539 22232 -297422 -61506 39567
15204 39567 128099 363309 219764 -202160 132550 147037 171611 -54 -442900 -594280
15194 -594280 -464873 -130972 18621 16910 -109806 -110152 -373518 -376952 -208368 -170590 -172380
15183 -172380 -309343 -224026 -4280 -10880 64475 -34670 133857 121844 108104 124798 121392
15172 121392 -78768 -52296 153226 231926 202037 15034 32203 123515 304598 497980
15162 497980 649902 296949 75524 15421 -119040 42934 94228 289190 149602 199648
15152 199648 208929 202672 113426 79932 233603 395053 641219 500646 209408 194920 167481
15141 167481 3825 88593 189570 95353 30363 -58131 -219192 -108174 -103785 9445 242943
15130 242943 231791 92202 -59652 -284280 -486505 -274565 -87858 5769 145399 173346
15120 173346 137178 29277 -241544 -326983 -85811 -22502 30145 -80746 -206388 -238848
15110 -238848 -315264 -140511 -110221 193761 457249 518237 138870 -382904 -422466 -263262
15100 -263262 -282434 -225586 -44692 -75214 110083 14172 -118700 233290 331361 194864
15090 194864 -20177 -72528 -456760 -590284 -465306 -318572 -229735 -295422 -297283 19816
15080 19816 252555 30088 -340225 -342777 -220836 -102605 -25381 -243962 -322985 -109707
15070 -109707 -122586 -282974 -79576 26814 -48410 162188 42844 23973 110690 355776
15060 355776 175215 -6962 25263 7036 -322954 -379832 -301879 -455435 -250411 109799
15050 109799 359354 265088 225983 123836 235636 416792 375564 106972 -7572 -182535
15040 -182535 -142704 -165477 -75796 110231 -16504 38988 86207 -37551 -74223 -225667 -187235
15029 -187235 -212936 -202266 -161083 -274932 -51786 -55274 -25513 75416 90357 171582 294428
15018 294428 7036 13974 -14931 -244444 -135765 107514 55364 106575 -55797 98368
15008 98368 54755 -83702 -3325 171628 179399 255314 251839 221867 106729 57458 261674
14997 261674 366404 207584 96623 -60554 104890 147623 25085 -194391 -236435 -61178
14987 -61178 26827 218439 354319 277770 90461 193724 297281 387169 300971 -78376
14977 -78376 -179340 -159272 -106247 1376 -215303 -395442 -210513 -82536 -215330 -331004
14967 -331004 -360837 -254157 20945 348066 352013 455584 243841 133128 134832 196645 72247
14956 72247 -313 38942 227319 154703 14860 -266471 -412834 -122851 -68116 -50881 10601
14945 10601 77360 -92658 -29518 -3663 40827 45469 66955 24637 -46525 -56953 -153811 -84690
14933 -84690 32740 268321 191810 48372 49802 -67996 -84881 30830 -18326 -47581 -47827
14922 -47827 -95167 -155822 -305495 -228935 27634 -68705 -315828 -248892 -177572 -330680 -425499
14911 -425499 -261511 -339861 -194243 -58197 26969 -43867 -230173 -191446 -103137 202140
14901 202140 399292 310556 194334 331898 362898 270068 153819 10341 64936 168819
14891 168819 343874 392567 281002 -68134 -281847 -250876 66703 241838 17873 -51931
14881 -51931 108425 253630 -79857 -99719 226066 246370 155598 192311 354849 22086
14871 22086 -392858 -420377 -155224 -146759 -297011 -220385 39533 354777 277846 136670 -89515
14860 -89515 -214522 -230454 -256930 -137926 -212929 -267098 -147983 -163988 -61765 -119027 -317064
14849 -317064 -347604 -350589 -352688 -141271 -111994 51650 247166 124168 118264 70860 145187
14838 145187 4246 197797 382809 396611 434973 313258 79080 22621 20987 -201936
14828 -201936 -203965 -60539 34451 223897 280634 191492 158439 -128312 -135199 23606 -64967
14817 -64967 -211622 -14888 381796 399905 292870 59817 239071 384402 303645 168666
14807 168666 -32784 -191080 -116024 -182010 -308400 -424837 -145260 -196870 -206067 -366518
14797 -366518 -394289 -275521 -341974 -290915 -604474 -624967 -378622 -305626 -353064 -316718 -171852
14786 -171852 -59526 79228 79496 87916 -70186 -21112 4527 67844 128584 -135511 -338555
14775 -338555 -181390 43596 315256 474174 89013 86091 60672 217848 356227 118592
14765 118592 152207 163357 130255 103413 205326 359495 359810 97363 11980 -74994 -134693
14754 -134693 -20895 26943 -25412 241039 469814 299103 465334 553254 567849 607712
14744 607712 440175 192414 319302 347703 92793 -90092 -82230 -9943 42052 33542 -15507
14733 -15507 116743 93095 113064 -103549 -133809 -49955 -28104 140011 230058 -164528 -209314
14722 -209314 -137070 -104672 -6518 195080 272757 80428 132172 26043 -128624 -136184 173678
14711 173678 415977 359726 113118 -52659 -235743 -21541 -1042 118234 -168146 -362721
14701 -362721 -14804 141941 58034 294488 162269 -63942 -83270 48811 129510 150891
14691 150891 439058 337879 -65864 -154851 -410755 -500340 -338260 -208038 -209913 -145369
14681 -145369 -220272 -162318 3767 -17744 -93442 -5645 134425 459835 457037 322568 271740
14670 271740 362408 330543 347675 384388 196361 -160895 -218910 58908 136185 84880 103785
14659 103785 -25866 40001 149748 60801 -236987 -348049 -209764 -184937 34043 240407
14649 240407 257790 117292 -90605 -16170 -149125 -375762 -228686 -164324 -28277 189800
14639 189800 466857 320130 -48767 26069 284020 367103 505075 722258 395762 123458
14629 123458 -131597 -193342 15371 -18475 -114486 45880 162173 -18981 -111857 -80241
14619 -80241 -29416 -74910 -85689 205821 104399 -5938 76567 -210228 -348961 -10460
14609 -10460 -45340 -306711 -183702 10155 194253 264687 276909 321098 202811 122746 279869
14598 279869 90427 -90891 131153 249054 6978 -103515 -218094 -412763 -301719 -236698
14588 -236698 -202508 -16184 105196 -5580 -101669 -211455 -209645 -176371 -4507 98448
14578 98448 42683 194820 182894 291561 440396 71402 -290093 -224553 -237318 -16550
14568 -16550 169179 290607 255949 319519 313613 201156 -50517 -171167 -164877 -85225 124354
14557 124354 57071 28310 192584 350837 197057 -121747 -126540 -43913 82177 -56390
14547 -56390 -397622 -358753 -285836 -298649 -200554 -52324 -70199 -237070 -165016 -121880 -140656
14536 -140656 -229772 -85012 -275576 -243314 -63105 203692 5330 -392554 -561589 -677638
14526 -677638 -360315 -21468 -1921 -174743 -355041 -67454 319423 401464 283790 53768
14516 53768 -18959 17166 209299 250185 221203 231175 323002 225978 86722 223227 314987
14505 314987 307056 184537 235020 214871 216411 150693 -20009 41433 206232 406811 540941
14494 540941 378520 98143 -51425 -9695 335456 318412 272681 286772 169303 66102
14484 66102 256709 343580 396651 156334 -108034 -63660 104705 272623 428038 257848
14474 257848 242066 88351 2905 13730 -14897 103366 116261 310318 240128 -139871 -230294
14463 -230294 -231803 54651 76690 58776 -89736 -357640 -188193 -4561 134668 219399
14453 219399 152950 18830 52464 -39769 -147440 -238545 -239612 -273748 -199343 -217557 -268907
14442 -268907 -129749 -54214 240 95404 110710 115053 151742 260621 183689 167865 102427
14431 102427 117673 325219 435081 543089 359685 352984 334066 334271 128255 64539 -15408
14420 -15408 -47329 87566 273471 161289 115679 107559 203839 16888 -83597 -5293 -93213
14409 -93213 -256191 -328638 -285125 -335604 -78531 251925 231253 19267 -174799 -447470
14399 -447470 -481931 -265818 -11942 123943 268394 200529 -120579 -254772 -192617 71434
14389 71434 341651 409131 394476 137939 -45618 -7653 5695 -14253 -192000 -443982 -300856
14378 -300856 -186638 -250581 -138161 342782 529006 407465 177014 110333 296645 423152
14368 423152 263915 122596 -51006 135386 282317 97637 62455 178201 24660 -73928
14358 -73928 92469 180015 224492 332842 318723 371847 443838 426608 275946 372374 276316
14347 276316 98181 137117 -5864 62160 72435 -49490 -102835 -31452 98681 18802 -97140
14336 -97140 -144830 108704 -148470 -160569 -107756 196488 322351 120462 -157865 -198876
14326 -198876 -139814 78195 340159 318179 329475 200411 -72422 -173827 -299415 -287460
14316 -287460 -24983 168428 155001 48547 -60929 -11030 172449 63306 -119555 8796
14306 8796 279297 259208 3599 61929 -21776 42654 -112894 -194131 -144657 57112 351571
14295 351571 172913 97421 132531 106157 -19835 -163822 -43927 364347 249579 145249
14285 145249 -34926 -282052 -269683 -258683 -82908 -95317 -26621 48632 -178383 -283653
14275 -283653 -133587 23475 78563 83801 46572 62942 336257 331487 225982 121894 -135880
14264 -135880 -396676 -250798 -131456 -204188 -265045 -193616 -425237 -476997 -521900 -532791 -427906
14253 -427906 -230345 -45251 17685 161181 406019 273337 99352 -239957 -407899 -535752
14243 -535752 -420251 -142211 60748 -49933 97914 -11029 -192494 -111608 -325807 -330514
14233 -330514 -199857 -166583 -311960 -469655 -258777 58151 193045 76462 53446 -69707
14223 -69707 -135103 -133519 217495 143702 119032 50836 -149102 -351346 -246714 -49692 18451
14212 18451 273614 97556 -131766 -121710 -350378 -288929 -345568 -311645 -335715 -390247 -499418
14201 -499418 -260089 -109891 -154491 33268 127141 355877 296547 240577 186695 184362 16606
14190 16606 23968 29490 -56556 -112967 -24280 -112665 -80924 -33558 -83459 -99020 -320300 -470614
14178 -470614 -392723 -360830 -351734 -439401 -207780 -50526 -49106 -110435 -44357 22951 -102667
14167 -102667 57972 127450 29018 28598 188034 228952 10594 -198137 -172326 116057 200418
14156 200418 83715 -130983 -68298 78314 14495 -131822 -198308 -357086 -391807 -101551
14146 -101551 23469 89086 67733 -31713 34410 195731 326292 258366 51147 -70066
14136 -70066 -73026 -318319 -334007 -683720 -726367 -443165 -149073 22703 31841 115839 118983
14125 118983 399791 352582 118887 183851 181658 300094 158333 27737 -232815 -278973
14115 -278973 -419033 -501730 -536168 -318926 -86108 218132 271644 132781 265236 270328
14105 270328 173005 388716 482873 202659 -158661 -358965 -114175 -32436 -285108 -317785
14095 -317785 -6929 338348 499620 250592 -240505 -392586 -340896 -293971 -225326 -193011
14085 -193011 -181388 -61811 72457 67762 126504 88071 -30212 82835 78196 101936 -64890
14074 -64890 127759 207408 350625 401620 349903 196891 128334 -58791 -4480 124511 136763
14063 136763 187956 320545 326251 184478 8793 142629 234976 -126421 -173568 -204690 29860
14052 29860 157907 42877 -64177 94418 68207 62803 64669 187866 -3049 -234031 -232238
14041 -232238 -273177 -161586 34168 162934 155771 14634 -84539 -32497 -569 -71341 -112002
14030 -112002 -52388 -38397 212662 351156 28440 -377920 -511862 -396696 -129994 -86294
14020 -86294 -183134 -346344 -435534 -481723 -427358 -298405 -246154 -304323 -230024 -287372 -415903
14009 -415903 -217628 32079 37545 16686 -186438 -269047 -94555 204951 122736 -134303
13999 -134303 -107207 -41450 15821 153025 20577 -180791 -325812 -502042 -250651 -53433
13989 -53433 -193608 -394240 -412951 -381223 -208971 31747 -12995 19394 -69110 -71675 -289558
13978 -289558 -370359 -170441 -15456 -19326 -134004 -55250 -55900 -70339 -34312 189084 169493
13967 169493 97462 154547 -157048 -387183 -532978 -203459 169125 167765 149545 233759 258270
13956 258270 47769 -4340 76471 194712 304435 255808 234991 264213 180667 38115 17729
13945 17729 7812 128955 253433 148710 -174512 107226 371458 412070 178667 85541
13935 85541 84672 -160340 -465402 -307872 -175155 -206531 -48873 97787 707 -15136 -43049
13924 -43049 -123376 -253853 -323538 -283840 -81546 98377 277584 219359 -33299 -86421 -225085
13913 -225085 -376412 -243483 167958 49868 -197485 -39613 131574 19672 -96335 -115388
13903 -115388 -101311 -83040 -128543 127104 432387 700092 566765 253708 91087 168142
13893 168142 114112 -123019 -179658 103977 78736 -12536 71318 15089 -79945 68255 -131744
13882 -131744 -271038 -243223 -313195 -364572 -243895 -79548 -257535 -275387 -468531 -369262
13872 -369262 -184449 -122627 -231461 -427210 -401612 -385839 -543288 -418639 -255031 8209
13862 8209 68998 13319 -144598 -205464 -30370 125494 -35132 -71779 -92180 -47616 -43369
13851 -43369 70686 -6509 7314 127758 52075 313292 90517 68702 267200 361237 386318
13840 386318 814 5757 152742 38958 236426 94942 -32281 -138274 -183903 -261631
13830 -261631 -89350 -329572 -369260 -121150 -40549 60016 295179 269261 213853 -23371
13820 -23371 -372663 -462506 -488620 -195951 -40340 139665 232826 346988 277915 208496 180266
13809 180266 40474 39860 284884 140648 35651 -287950 -363375 -337558 -400252 -269197 -165062
13798 -165062 -153901 -102306 -272654 -387530 -274214 -198000 -160640 -292370 -407517 -106863
13788 -106863 69860 110384 14033 -98167 -210130 -265428 -179087 -116641 20752 -34119 -193560
13777 -193560 -125655 -137035 67312 150006 -163269 -257752 -45716 115561 35433 -245054
13767 -245054 -418889 -322377 -309196 -255022 -6041 -23680 -478835 -336464 -93280 -77866
13757 -77866 62121 278925 209454 38806 26717 -62249 -299271 -271501 -67823 -8568 155865
13746 155865 270646 397749 303712 383441 253800 298339 185695 108325 -198662 -167848
13736 -167848 127103 32719 -79706 56573 10973 68598 210767 92024 134953 168114
13726 168114 29964 -61932 14670 56959 -111746 -179752 -227390 -260042 -257080 -334552 -436864
13715 -436864 -474654 -264981 -101337 -32283 -305393 -259369 2981 -70610 -237322 -120422
13705 -120422 -34035 143960 -15332 -203075 -26190 84390 93472 93347 221951 323736 321168
13694 321168 225393 -37486 103347 388987 190783 -190046 -92793 76698 176138 227068
13684 227068 213657 70101 -207456 -323710 -223639 -77801 -25531 124431 125399 32619 -76867
13673 -76867 -173920 -292043 6187 3687 -214291 -201714 -312560 -440917 -209337 -92278
13663 -92278 -33281 72712 244909 247996 -215272 -421247 -232091 -1017 48523 273061
13653 273061 247115 -70631 -219514 -376111 -468793 -363663 -339313 -204306 29803 104444
13643 104444 147083 4620 15147 140244 -64323 -233857 -464503 -305919 -184735 -169921
13633 -169921 -93797 -95053 -132762 4601 220524 230574 346222 414562 307268 180322 183987
13622 183987 -94177 -266445 -277829 -209040 79515 278838 140809 36154 194546 238179
13612 238179 260552 305009 440478 357609 41990 -69185 -58057 237256 120459 -172580
13602 -172580 -216508 27537 200675 236125 334025 392257 436370 400272 272444 144378 227189
13591 227189 405491 216996 128642 -18231 142437 244231 69546 -114956 -411251 -490818
13581 -490818 -508461 -420325 -169023 -292258 -502091 -258675 -135813 -139137 -126524 -157481 -324394
13570 -324394 -177887 14694 178858 573698 600990 448971 107293 -72961 -145011 -68286
13560 -68286 -59319 -16014 81546 142861 -125766 -153869 -116019 1578 -261479 -370153 -336911
13549 -336911 -101943 188081 272694 260508 149075 31804 -51332 16518 114434 117436 128831
13538 128831 52188 96065 30310 -177431 -361694 -350488 -246063 -221661 -31555 149776
13528 149776 18703 -151151 -173585 -83508 -61341 -50531 129830 149364 214757 273135 390073
13517 390073 212540 -119116 -147765 -124180 -254634 -265376 -164428 -30691 65586 -217592
13507 -217592 -313481 -100881 80742 292000 307510 192983 258459 209016 -75242 73786
13497 73786 140311 -87170 -211678 -178979 -86898 -274052 -85577 90502 139369 96129 -70045
13486 -70045 -107687 -179331 -283707 -315289 -357370 -374852 -253277 179435 425664 424232 297013
13475 297013 -11618 -33782 -125977 -279243 -543744 -628137 -455557 -185023 -43022 -176107
13465 -176107 -274062 -176016 -276449 -131914 54485 -63305 -142743 -73547 -187044 -350794
13455 -350794 -428375 -574361 -397401 -253125 -191683 -40566 103928 71008 44787 -207633
13445 -207633 -278281 -104392 244604 222406 29761 -135498 -218 187793 152623 19716
13435 19716 -129959 -186360 21542 114651 27201 -230394 -151967 204306 449787 369664 74616
13424 74616 70809 121770 22527 -195608 -304371 -247139 -279763 -200349 -64922 -4391 170695
13413 170695 442178 381212 80088 62092 -22021 -63790 -92874 247174 411930 399614 281696
13402 281696 180859 -48282 -68095 170999 139949 159592 105905 62217 51201 125609 176325
13391 176325 -5635 -153134 -22262 64769 -137878 -206460 -277226 -262221 -237685 -188377 64699
13380 64699 189901 -133263 -171848 -257715 -240957 -225272 -10854 174705 316538 634156
13370 634156 837197 430437 147860 55984 -112997 38027 165337 187329 57298 -21589
13360 -21589 -29621 7733 -62011 101905 226562 87252 18404 212587 146175 66255 119939
13349 119939 132682 224951 336177 198116 309516 216193 58387 -44569 44072 193220
13339 193220 193420 309283 294359 115090 -165945 -27072 548730 572216 368078 114538
13329 114538 -34628 85113 191705 65056 -73196 90834 71167 -157369 -214968 94439
13319 94439 416486 410040 36159 -162059 -69321 -89962 -118817 -142716 49272 124015 18340
13308 18340 69298 223415 256027 183144 316340 293685 -33569 -100856 -14313 -51970 -174465
13297 -174465 -301213 -380521 -293072 -399497 -230242 -47173 73536 154970 252609 483884
13287 483884 445864 230945 222130 349601 328193 484288 446176 241182 30642 353588
13277 353588 467573 367002 303138 214822 216474 107408 -105677 -11501 217660 414650
13267 414650 363914 335554 382696 339164 150743 197671 255454 144676 -45555 59971 -164343
13256 -164343 -472592 -254367 -105433 -237829 -361174 -148534 -49832 7523 -104437 -320519
13246 -320519 -369929 -281324 -120454 -145879 -140818 -193118 -88341 -1031 -33004 -24879 -116401
13235 -116401 -451668 -451008 -119293 -28004 -344 -49440 -208166 -201373 179619 367753 115356
13224 115356 -195837 -43749 86767 24725 8750 145707 122926 102674 -1957 -99294
13214 -99294 195925 258610 -119548 -264365 -120713 -255194 -359786 -38984 -238978 -368168
13204 -368168 -50226 289868 109671 -122244 5244 232101 475429 477362 544085 457219
13194 457219 276719 198996 136656 137398 286964 517329 438547 352152 205657 19124 -57326
13183 -57326 -211915 -225521 -277865 -364408 -364766 -403050 -86545 114946 222984 172996 72003
13172 72003 57697 152265 190092 180060 76604 130213 161576 214280 383476 267440 102149
13161 102149 118408 185913 68751 -45425 -77795 17653 -5796 127863 179928 131453 -69726
13150 -69726 -241112 -53289 -59332 -15022 -28767 33086 79013 167976 382362 263871 285934
13139 285934 337926 162715 87347 36965 98437 -119889 -286078 -344297 -561041 -674524
13129 -674524 -676035 -414271 -110144 -98249 -91822 35167 -23233 -152604 7598 -149092 -338470
13118 -338470 -240566 -92241 84956 76682 125226 138446 152499 119852 20312 -254489 -577617
13107 -577617 -595095 -467483 -395475 -183232 -78658 52609 -222329 -324652 -368706 -319486
13097 -319486 -270347 -311261 -411546 -224782 166456 135188 108682 94936 -46759 146993
13087 146993 260185 -24277 11981 96310 277695 567632 335972 373556 192897 98953
13077 98953 175683 211651 23286 -35660 4859 -110411 -60294 -39952 -55634 88427 -21698
13066 -21698 -193447 -151593 -233690 -170301 125881 55097 -340585 -445840 -399484 -248502 -114955
13055 -114955 181680 378434 440378 421777 128564 306760 270094 246496 117247 154270
13045 154270 -84925 -315193 -255513 -266014 -62015 -9122 17176 94770 180123 64146 -64145
13034 -64145 -114664 -302093 -219967 -61181 -203223 -146700 -56741 69902 238660 379101
13024 379101 498621 346925 278937 146954 -154426 -367721 -366085 -386567 -251403 -104289
13014 -104289 121917 131443 114076 116355 74027 198479 320194 33474 -16581 -161250 -301080
13003 -301080 -177989 55829 64958 93346 -63255 -191497 -319280 -507417 -628596 -487915
12993 -487915 -417044 -578728 -700578 -563861 -482377 -313897 -190838 -127978 -54540 69248
12983 69248 164465 125258 92318 277403 109104 -3495 -48695 -80496 -70572 -103439 -163898
12972 -163898 -265136 -456194 -365828 -305755 -225614 -140097 -73560 13061 127856 235960 175079
12961 175079 199026 78540 155494 362315 288405 100465 88897 38099 104734 207864 88616
12950 88616 12147 62661 80318 -66337 -187800 -113050 -41444 -19118 116753 113895 43245
12939 43245 9439 -44652 82890 103079 -33298 -98434 -77237 -161985 27523 101020 -51179
12928 -51179 -99397 27032 183523 275769 416696 576039 134604 -245385 -199579 -191755 -57657
12917 -57657 79116 -167616 -206987 -255820 -226433 -155950 -174243 -246789 -374123 -274401 -177627
12906 -177627 -47825 -142307 -204502 80724 171619 -98622 -144944 -105588 -199918 15810 205718
12895 205718 376617 390330 357370 149036 23990 214081 363652 273363 75694 109871
12885 109871 183317 200471 84943 22584 18773 -9525 63333 256092 257057 387777 360890
12874 360890 522616 629345 426179 365129 208984 116147 122913 -55410 86907 54947
12864 54947 77107 210836 398978 356311 209215 61651 -51679 173141 149629 -297467
12854 -297467 -492872 -197371 32789 129297 -32148 -458066 -611146 -377012 -24115 321826
12844 321826 647070 291031 72282 -42383 16634 229446 422568 620934 691395 387238
12834 387238 255200 87318 -4094 61870 253307 189879 258114 389162 192690 230685
12824 230685 160930 -41915 -35447 -46851 -156155 23870 47515 105538 288696 120157 111336
12813 111336 400386 290002 213677 152295 3157 177711 325362 114707 68278 142310
12803 142310 167036 61791 -23992 103086 -8212 -182312 -234948 -238289 43781 -289630
12793 -289630 -495353 -690835 -511425 -280838 -53451 302004 164812 128411 167573 257989
12783 257989 241331 145099 -19357 -46150 -181361 -608624 -672665 -470874 -315199 -555316
12773 -555316 -457444 -360939 -246302 141895 194878 314425 437350 366894 217751 193902
12763 193902 101848 -137290 135998 523053 498316 251652 168912 171861 101583 112662 146244
12752 146244 277457 275334 142046 -60695 29890 111784 -48366 -60080 -46374 -9729 31602
12741 31602 15877 37534 87105 225458 147534 -27860 -47064 61193 219496 390265 589596
12730 589596 448257 229508 -96097 109110 112120 -146210 -199956 -5909 -61518 -46010
12720 -46010 -40923 32579 48373 82980 169677 388454 177902 141800 163759 -36247 -335228
12709 -335228 -488164 -757428 -526537 -116935 322974 611407 670371 417320 218797 424557
12699 424557 340237 152046 93202 -22871 -6956 101644 76909 -89799 198394 332306
12689 332306 288641 128434 -107235 -78721 29350 136078 -9029 111399 286288 148773
12679 148773 -86173 -32017 68318 -146233 -240695 -275415 -240137 -37363 -43393 -2633 -51365
12668 -51365 -144129 -97075 -5358 128560 211792 297101 228729 53305 -139342 -397173 -371650
12657 -371650 -227191 -129628 -91511 72790 8489 -127209 -33431 119170 93383 -53466
12647 -53466 61550 170067 88229 -113284 129570 243819 304633 356250 208317 -21040
12637 -21040 -41619 14249 84537 -8026 -53306 192795 286345 174613 36939 66234 -108016
12626 -108016 169328 111091 -52821 109002 75360 -54545 -341038 -679357 -701410 -426183
12616 -426183 -119881 -25198 86974 324030 515426 373596 362079 279404 189836 371885
12606 371885 446886 193970 51413 -120079 -13428 203482 203979 -8141 -74176 79169
12596 79169 79329 -303179 -222207 -233596 -281510 -101904 218486 130833 -91202 -52948 62114
12585 62114 271840 324797 240980 186566 5707 -180189 17891 462104 648461 674240
12575 674240 682324 485019 313631 63754 -175749 -325194 -399819 -163670 46700 193449
12565 193449 61604 -57119 -183160 -137003 -55979 64693 204496 200408 268255 332359 402936
12554 402936 436765 288193 -66919 -311866 -206925 -157566 -246511 -126646 -40910 -18976
12544 -18976 -275642 -92295 439979 532100 -78671 -354275 -266608 -112818 230321 171786
12534 171786 -14926 -68965 -11747 164420 344282 412277 581715 374096 242954 349158
12524 349158 518447 318158 47117 -67268 65694 94888 265647 68189 -142275 -78921
12514 -78921 -90896 21456 153910 31321 -180798 -496352 -416539 -195950 -359928 -69409
12504 -69409 68643 -98219 -51462 203081 94113 10681 230596 363780 198689 191364
12494 191364 295034 223376 156545 208017 112402 -24980 76595 19081 -115906 -456155
12484 -456155 -522387 -588834 -461138 -205371 161071 206091 188971 232585 272075 336016 89019
12473 89019 157856 309942 195784 192887 293016 82087 33467 119486 -93860 -186349 230762
12462 230762 294714 -74802 -363904 -266407 257 102154 109596 4525 85691 341949
12452 341949 341106 175508 -66299 -404356 -300402 -51319 -23606 -85485 -114244 88117 90574
12441 90574 29544 19519 67880 -248717 -80349 -73083 144795 203363 309324 58848 -154041
12430 -154041 -135154 -68102 -198061 -332968 -91852 -21426 -6065 31899 77944 -74481 -30206
12419 -30206 208543 317164 -53399 -226431 -205666 -93352 54669 -105005 -152262 -121830
12409 -121830 134224 265562 292741 454631 218258 97893 -93945 -171093 -27959 97993
12399 97993 148490 91307 136934 119605 27020 -252304 -456367 -223398 18271 18489 -33786
12388 -33786 -162875 -136769 -86888 -254299 -367575 -602818 -187007 103692 -135334 -295646
12378 -295646 -210154 -22189 185630 94489 53347 666 -320381 -244677 -202973 -264013 -133566
12367 -133566 -168301 148942 223769 71604 22854 64023 48865 -44670 13644 91711 112461
12356 112461 28428 -35463 -167761 -214616 -185972 6786 23567 28163 -63356 -120139 196621
12345 196621 275931 311772 275878 2119 -11830 -64704 -46550 116701 145219 -29194 -120243
12334 -120243 -130403 10967 108031 -8353 -31868 -27246 -3792 -123861 -288559 -358367 -437323
12323 -437323 -351370 -120566 46798 227188 206185 170527 126176 23423 395954 316028
12313 316028 383424 288643 104131 -109074 -207810 -98156 160224 313159 341164 365212
12303 365212 317389 177202 91754 -11170 101896 201061 281662 13709 -160242 13029
12293 13029 -45458 25851 -55516 -286742 -262939 16884 48546 -13035 -94360 130063 303974
12282 303974 430320 456212 429684 329239 -144078 -253033 -30528 -62933 -114859 -76047
12272 -76047 131286 247551 158401 146936 24194 -150323 -171224 -194494 15978 224103
12262 224103 163596 68235 -142180 -311343 -233917 -209548 -318163 -339927 -257051 33479 189021
12251 189021 143810 112239 179442 87399 116091 -131372 -196260 -205720 -385484 -247209 -202065
12240 -202065 -172307 -28921 93402 -16905 97670 142589 -26366 -28552 8577 89847 4531
12229 4531 -64487 -114974 -146376 -157728 11194 -4154 307783 468323 426567 464337 208129
12218 208129 -56677 100003 187148 180426 -75964 -23380 44670 -51638 -60092 32192 -37210
12207 -37210 -155219 -282108 -240459 -59172 -46890 -158830 -157922 -131303 -10024 -288360 -465762
12196 -465762 -295564 -110605 -23723 -205319 -369867 -390299 -245517 56412 111827 53173
12186 53173 80309 1509 59718 75806 59325 -78992 -44346 -119571 -68780 212358 365678
12175 365678 193514 23198 197365 250253 91121 -29296 -55039 -77978 -190240 -227951
12165 -227951 40164 75748 76685 111144 -129248 73831 309694 162909 123129 144409 198950
12154 198950 80413 -16010 10414 -58761 -47802 97101 110367 84367 73761 148849 259583
12143 259583 353820 153961 17478 7878 4920 -28471 -18145 374184 606874 465893 113132
12132 113132 3931 -37539 8586 122722 180351 130311 182660 190910 167953 224532 204339
12121 204339 245294 222227 -38423 -201230 -122562 -229058 -415784 -391220 -251265 -53476
12111 -53476 -135440 5657 74522 66462 83401 -62540 -116200 -387085 -308130 -95279 46475
12100 46475 -79943 -269481 -30829 133321 -110230 -204229 -149372 5751 257052 242253
12090 242253 363591 82056 -170145 -170206 -84340 32590 -47386 -26065 175580 101546 42225
12079 42225 -25835 106806 247898 131939 -264684 -384810 -294182 -47499 -11010 -138884
12069 -138884 9318 229474 107731 -73562 -138831 -147373 -238005 -130037 107141 372268
12059 372268 480398 397217 400250 285981 -30645 -126843 -166846 -44759 -97049 -362413 -270263
12048 -270263 -321679 -331083 -96916 -48797 -46933 5205 -47289 -125975 23751 -76326 -221797
12037 -221797 -225219 -96211 -50272 -232715 -364514 -321835 -364616 -303316 -201097 -71942 -144916
12026 -144916 91474 219218 66430 181955 176486 121246 181447 -96595 -175445 -46198
12016 -46198 -145211 -209396 -203314 114743 226400 275021 227266 335994 45909 -174129 -84326
12005 -84326 24685 250923 6829 -37022 -72109 -116314 -32695 -33491 24426 -112838 -62917
11994 -62917 68909 137387 77788 188253 433689 588682 554130 314339 192092 198319 -10390
11983 -10390 -254432 -251189 -314612 -154122 11930 121824 336138 444074 282831 136029
11973 136029 -150291 -117091 48507 -299385 -378125 -359669 -300365 -206655 -411720 -480446 -233557
11962 -233557 -213303 -39418 103522 53990 -109100 -142708 -92465 49213 116478 86232 251270
11951 251270 167180 14001 104573 3693 -19872 109714 209017 148914 53663 -168342 -128388
11940 -128388 -132009 -154233 -790 87137 176285 -2302 63017 -75503 -310361 -334654 -110375
11929 -110375 -82306 -190818 -372114 -399940 -252368 -204877 -243037 -198255 -323007 -139729
11919 -139729 36657 -112331 -230025 -261682 -189068 -250538 -191503 -46148 264624 -3183
11909 -3183 -376349 -122322 -40579 73378 184429 190211 279065 262135 139355 135820 118881
11898 118881 -47093 -33335 98895 305970 238981 185259 -21445 -313775 -365992 -95772
11888 -95772 69426 28916 -183159 -60683 285808 348063 159280 102827 -69020 -89398
11878 -89398 -118307 -346844 -759360 -628582 -257738 -62806 -6323 -105587 -18258 -51845 -179488
11867 -179488 -99966 -29518 -63695 -124521 -19489 175675 -33956 -186728 -138892 32454
11857 32454 -135373 -148021 -97135 -203347 -97400 139077 120690 20893 30684 62617 10416
11846 10416 -179323 -116383 2841 202857 353140 270735 233810 478622 269050 -28196
11836 -28196 -62337 -116332 -37168 85220 122553 -27555 -460379 -435918 -357738 -198665 -268979
11825 -268979 -337118 -505393 -768118 -715977 -578510 -212065 -233213 -313312 -488715 -426220
11815 -426220 -335117 -261900 -48387 -57266 -95539 -375018 -232359 -208894 -133253 25077 350587
11804 350587 216129 157179 302161 93891 63918 180544 104453 78790 31438 153427
11794 153427 422056 406029 491187 548610 410747 304861 -3072 -113712 -138203 -246601
11784 -246601 -99780 -22758 79729 -71946 -214110 -367699 -277626 -330580 -52751 81250
11774 81250 64473 61787 -140108 -229317 -269053 -278133 -92194 18109 -83957 -104365 -115935
11763 -115935 -8125 55374 49921 206164 20943 68767 31109 -273415 -184657 38209 175986
11752 175986 163437 279813 174447 -54732 241461 334106 452054 25081 -311792 -220896
11742 -220896 42301 91656 58322 186811 121060 138577 -3776 44378 101985 204226 134014
11731 134014 -24166 -200673 -185304 -95361 -116708 -217543 -122224 -228582 -204452 -349720
11721 -349720 -196165 -250000 -215654 32447 -7447 58912 174154 83471 172286 270369 296148
11710 296148 319876 257245 179161 59259 -2102 -158284 -420525 -190560 -96133 -11921 20301
11699 20301 157688 201586 88484 -140591 -195324 -47759 119426 -139515 -341854 -239130
11689 -239130 -40840 19041 85679 42980 -63972 136223 109253 28006 191311 355647
11679 355647 235935 232354 460523 499617 238059 -122486 -57827 -13113 161848 278408
11669 278408 328035 242250 33525 -66603 -98139 -210061 -225796 -317222 -280854 -191442 -297391
11658 -297391 -465582 -312608 125477 152018 175562 111774 210924 302553 547979 540344 358913
11647 358913 325737 218984 299934 393717 271095 -51368 -59553 189923 254344 338805 279125
11636 279125 98802 -120718 -346053 -386709 -192122 -95008 -140386 -130215 57055 -106176
11626 -106176 -219636 -216975 -152497 -263838 -279721 -236923 -89590 -73188 -57573 -56435 263653
11615 263653 290846 157563 -15963 -128492 -100139 -3320 -52274 4661 -189703 -362510
11605 -362510 -299952 97840 362853 504386 349076 97478 60291 -99407 -73084 10325
11595 10325 -1359 -16583 320824 428111 241172 96058 -264073 -162347 -9760 1548
11585 1548 39416 56581 138475 477930 342684 304437 25600 53353 323337 526904 291462
11574 291462 188467 117375 33120 232543 436146 260360 12871 223218 133697 -401189
11564 -401189 -446916 -385046 -310995 -268379 -405630 -251177 -181530 16791 53787 123000 168197
11553 168197 224922 270401 216058 134128 340467 558315 335375 54780 -40141 -141198
11543 -141198 -15938 -50415 -127679 -178086 -184834 -22088 -224831 -417873 -445963 -426401 -350707
11532 -350707 -349661 -176777 -116786 -126316 -219367 -143005 197618 155848 158130 271072 382269
11521 382269 375198 43187 51288 -128449 18176 258392 169251 2015 27907 208704 172370
11510 172370 310401 203253 209625 207631 -91954 -252641 -105810 -93687 -47688 121205 79186
11499 79186 -227837 -566832 -517223 -236574 -52010 47254 22948 109980 140420 176039 140447
11488 140447 88996 104542 50166 125611 185696 187325 -230458 -285778 -194433 -129888 -145269
11477 -145269 -247170 -334093 -319275 -313439 -263857 -155961 66983 145708 -757 43290 67813
11466 67813 -127583 -80544 -56954 216592 267722 5910 -424031 -333975 -3144 -15870 -63507
11455 -63507 -51913 2779 -62723 -63161 -160601 -297654 -389458 -204832 46403 288747 242779
11444 242779 51967 49147 -19704 -122979 -259712 -181283 26157 334884 283118 149153
11434 149153 245174 83694 -182817 -337209 -182743 -138597 -124787 -159677 -15026 -69977
11424 -69977 -136512 20641 174844 267943 232272 -27114 -52063 -198327 -132180 -64675 95665
11413 95665 349018 388563 424400 565554 676085 272001 27165 28782 41820 107138 6056
11402 6056 -28595 83140 99536 234537 213251 245295 154289 123264 225810 201815 164691
11391 164691 38095 -45000 -184679 -212940 -354774 -234892 -102297 -389740 -494550 -685746
11381 -685746 -513471 -176158 135598 99511 123157 -107876 -274005 -227527 97137 -7734
11371 -7734 -401267 -372302 -71858 -46798 -65085 68384 146931 150151 -233253 -618934 -543769
11360 -543769 -366518 -90178 7365 25180 19647 -45150 -293922 -358952 -189167 -72331 -96601
11349 -96601 -77554 173871 435888 628340 437327 436470 307318 225830 58252 -52554 17836
11338 17836 92528 49270 125034 302893 350664 79017 58504 99943 31193 204029 364649
11327 364649 367125 142035 -92402 -205233 -339202 -261595 -308416 -369185 -130492 -80229 29633
11316 29633 -91834 -178067 -19325 2102 158208 216087 113145 51284 -63346 60471
11306 60471 75575 173611 321293 166804 122268 357491 343619 187788 13690 59174 232819
11295 232819 224450 216212 88405 85164 204996 143540 106940 114384 31509 271849 462706
11284 462706 281927 -63401 -98831 102460 124747 319655 442974 513019 517496 214978
11274 214978 -157757 -256205 -475232 -450073 -396200 -169597 40607 18170 -35892 -133390 -38810
11263 -38810 -133926 41418 -115781 -103275 26418 80412 -66602 -388984 -193933 -291348
11253 -291348 -281636 -188058 -345017 -336929 -438709 -257053 -70123 197157 120568 -176245 -193956
11242 -193956 18856 53090 95465 87753 219710 99671 54343 -73523 -83624 -52593 41276
11231 41276 120606 -143767 -222653 3246 -43832 -127494 -304041 -137283 -199242 -246939 -451141
11220 -451141 -472363 -256475 -191962 -192277 -266167 -363625 -327504 -296175 -71236 102709 250402
11209 250402 206675 5538 1155 -164549 -204695 -137202 -52158 -62676 -286598 -371377 -561153
11198 -561153 -676833 -296079 -167577 -201501 -263907 -134515 46717 186335 152228 171593
11188 171593 197791 30275 -36770 2705 55323 -25247 -19920 178394 393064 429728 174923
11177 174923 36652 -48096 -25678 -51978 -46163 11157 157251 166984 152643 139906 233087
11166 233087 177477 169136 152055 -52284 7095 -62141 -109188 -245576 -207608 -137008 -196019
11155 -196019 32567 242183 150478 186547 219183 79581 161708 -76107 -305054 -427631
11145 -427631 -220747 -42402 -155896 -271067 -77880 236094 160604 -56555 -331288 -321421
11135 -321421 -290608 -206522 -81576 112931 163081 113644 -195209 -356199 -305946 -242815 -16552
11124 -16552 430514 329307 -149215 -359855 -287412 -414975 -341108 -374458 -412577 -246536
11114 -246536 -216437 -178188 -39959 128883 151319 329059 217960 68083 209059 281281
11104 281281 223925 272557 204396 223521 47455 84237 122622 314239 560886 535840 258925
11093 258925 77399 -204089 -242415 -117052 61534 99832 152534 129881 95185 214541
11083 214541 222746 163054 64818 -59824 -160130 -331979 -199570 -303055 -555657 -232118
11073 -232118 225037 272756 227072 365716 400354 340885 345871 262773 250406 395054 360362
11062 360362 150411 48120 92100 119572 123943 13797 -80855 -54640 -75690 -199606 7715
11051 7715 313142 439356 168448 160765 339966 -15975 -55668 -45025 73547 260129 323200
11040 323200 329787 347018 391309 385746 211926 208003 271012 264917 162251 16788 -4137 219987
11028 219987 4789 -195893 -259517 -435243 -74702 268269 261985 154253 -64195 -265727
11018 -265727 -201960 -325414 -200045 -124809 1389 90659 -297978 -408921 25121 371909
11008 371909 300827 -89817 -166653 -255290 -408208 -490192 -559510 -740268 -577443 -560590 -360661
10997 -360661 -179092 -167368 -187041 -333917 -59805 278597 104488 -53253 3308 -124404
10987 -124404 -3971 -61306 97325 258176 101833 124322 7812 85129 19390 -130584
10977 -130584 -62815 99120 222286 462676 505553 176318 62667 138300 61466 148309
10967 148309 402940 681574 488808 215029 -97748 -20695 -19589 -40767 47623 76776 -113772
10956 -113772 -82199 49614 56116 -78075 66024 156063 208393 324244 72136 44158 160847
10945 160847 350981 257056 189614 128480 -95273 38118 386508 370636 406465 236840
10935 236840 11384 -81 -195587 -312705 -183790 -154962 -63588 26751 -94805 -304418
10925 -304418 -591061 -647694 -371933 -405910 -609947 -537574 -243310 -143060 -71381 13533
10915 13533 -19547 88275 163786 208160 85863 31291 -95450 -160691 -95916 10986 -94141
10904 -94141 -200671 -357342 -294787 100787 24143 -102005 -302694 -218128 -9350 -81595
10894 -81595 -267329 -208535 80158 28123 -48106 -41133 -43918 135827 102273 -81225 72047
10883 72047 132022 163130 140175 108988 -80984 -993 33163 -73656 -63072 72036 113233
10872 113233 182583 353177 321763 98175 -101463 -115057 -53398 -17004 87101 228850
10862 228850 71438 70424 142775 278462 282263 278602 173773 341780 394271 235733 233991
10851 233991 94979 -60292 -101812 -180786 183820 208218 -17840 -176534 60396 156816
10841 156816 -189676 -212165 -416531 -586944 -361547 134622 270081 181339 19048 -1563
10831 -1563 74477 -5645 -122662 -311777 -122301 158663 75519 -8643 19655 132660 441803
10820 441803 412673 299189 223344 320808 137404 -231772 -209756 -57184 -160306 -412301
10810 -412301 -437914 -280772 -290120 -304954 -33619 199440 446461 277969 290317 198935 -39322
10799 -39322 27145 138618 37500 49200 27666 -161065 -31968 -8638 -294631 -186329
10789 -186329 -34177 60488 -164703 -322573 -357935 -384176 -155861 189272 259433 236013
10779 236013 198790 -20120 -168051 -317130 -193321 -55335 102428 202421 242116 110602
10769 110602 -11593 127949 202971 305574 353724 327347 492945 277573 -277002 -396628
10759 -396628 -506534 -612703 -440086 -210317 -45370 -307426 -211036 -174913 -109656 185087
10749 185087 407830 289602 228137 244095 58683 -287034 -134581 24054 -13379 -88376
10739 -88376 -31840 -128544 -46679 -35662 -15447 42090 -132545 -42347 168915 289428 388133
10728 388133 212032 -12060 -39121 -208549 -400596 -216478 -275068 -179393 -221389 -219776 -116169
10717 -116169 -128417 -97884 -127414 230306 254003 257325 108600 -68247 -30540 -58430 -127371
10706 -127371 42123 105658 -168290 -273384 -91906 -37941 21370 -1500 -245701 -150892
10696 -150892 -248550 -225878 -152116 -134595 -454398 -456660 -643451 -709426 -585563 -244153 -333645
10685 -333645 -530730 -599612 -756424 -692902 -498534 -478436 -376628 -73143 58144 163336
10675 163336 355501 128896 -205980 -156391 97541 223046 286375 171401 48017 -26138
10665 -26138 -113100 -179064 -433399 -282601 -11632 -81280 -121226 -226308 -92255 76448
$$ [...]
##END NTUPLES=NMR SPECTRUM
##END=
