##TITLE=Analysis number 320457
Compound Code cc 29911
Project Code adrs
Chemist Name stores
##JCAMPDX= 6.0         $$ Bruker NMR JCAMP-DX V2.0
##DATA TYPE= NMR SPECTRUM
##DATA CLASS= NTUPLES
##ORIGIN= Bruker BioSpin GmbH
##OWNER= nmr
$$ XWIN-NMR		Version 3.5
$$ Mon Jun 26 13:42:50 2006 GMT Daylight Time (UT+1h)  MAYBRIDGE\nmr@NMR_250MHZ
##.OBSERVE FREQUENCY= 250.131544655141
##.OBSERVE NUCLEUS= ^1H
##.ACQUISITION MODE= SIMULTANEOUS (DQD)
##.ACQUISITION SCHEME= undefined
##.AVERAGES= 16
##.DIGITISER RES= 18
##SPECTROMETER/DATA SYSTEM= dpx250
##.PULSE SEQUENCE= zg30
##.SOLVENT NAME= CDCl3
##.SHIFT REFERENCE= (INTERNAL, CDCl3, 0, 16.522)
##AUDIT TRAIL= $$ (NUMBER, WHEN, WHO, WHERE, WHAT)
$$ ##TITLE= Audit trail, XWIN-NMR		Version 3.5
$$ ##JCAMPDX= 5.01
$$ ##ORIGIN= Bruker BioSpin GmbH
$$ ##OWNER= nmr
$$ C:\u/data/dgb/nmr/ADRS/1480/pdata/1/auditp.txt
$$ ##AUDIT TRAIL=  $$ (NUMBER, WHEN, WHO, WHERE, WHAT)
(   1,<2006-06-26 13:41:56.24 +100>,<MAYBRIDGE\nmr>,<NMR_250MHZ>,
      <created by zg, POWCHK disabled, PULCHK disabled
       configuration hash MD5:
       E2 DF 36 D8 04 B2 41 60 5A D7 A3 38 5A 4B D0 FE
       data hash MD5: 64K
       DD DB A5 49 C3 D5 B8 55 E6 80 57 38 2C E6 B8 2C>)
(   2,<2006-06-26 13:42:16.22 +100>,<MAYBRIDGE\nmr>,<NMR_250MHZ>,
      <Start of raw data processing
       ef LB = 0.3 FT_mod = 6 PKNL = 1 SI = 32K 
       data hash MD5: 32K
       B9 34 67 B5 2D 1A 44 A7 96 B4 A7 3F 7E A4 F4 53>)
(   3,<2006-06-26 13:42:20.86 +100>,<MAYBRIDGE\nmr>,<NMR_250MHZ>,
      <apk 
       data hash MD5: 32K
       F0 F2 EC 81 79 66 EF A0 37 7B 99 79 76 F8 00 2B>)
(   4,<2006-06-26 13:42:22.83 +100>,<MAYBRIDGE\nmr>,<NMR_250MHZ>,
      <abs ABSG = 5 
       data hash MD5: 32K
       C8 F3 60 6F 8C C5 65 DF A6 66 2F 61 D9 9F 0A F2>)
$$ ##END=
$$ 
$$ hash MD5
$$ 49 31 85 7A 62 73 99 11 A5 62 B3 57 22 D8 76 76
##$RELAX= 
##$RELAX= 
##$RELAX= 
##$RELAX= 
##$RELAX= 
##$RELAX= 
##$RELAX= 
$$ Bruker specific parameters
$$ --------------------------
##$DU= <C:\u>
##$EXPNO= 1480
##$NAME= <ADRS>
##$PROCNO= 1
##$TYPE= <nmr>
##$USER= <dgb>
##$AMP= (0..31)
100 100 100 100 100 100 100 100 100 100 100 100 100 100 100 100 100 100 
100 100 100 100 100 100 100 100 100 100 100 100 100 100 
##$AQSEQ= 0
##$AQ_mod= 3
##$AUNM= <au_zg>
##$AUTOPOS= <31 >
##$BF1= 250.13
##$BF2= 250.13
##$BF3= 250.13
##$BF4= 250.13
##$BF5= 500.13
##$BF6= 500.13
##$BF7= 500.13
##$BF8= 500.13
##$BYTORDA= 1
##$CFDGTYP= 0
##$CFRGTYP= 5
##$CHEMSTR= <none>
##$CNST= (0..31)
1 1 145 1 1 1 1 1 1 1 1 1 1 1 1 1 1 1 1 1 1 1 1 1 1 1 1 1 1 1 1 1 
##$CPDPRG= <>
##$CPDPRG1= <>
##$CPDPRG2= <>
##$CPDPRG3= <>
##$CPDPRG4= <mlev>
##$CPDPRG5= <mlev>
##$CPDPRG6= <mlev>
##$CPDPRG7= <mlev>
##$CPDPRG8= <mlev>
##$CPDPRGB= <>
##$CPDPRGT= <>
##$D= (0..31)
0 1 0 0 0 0 0 0 0 0.06 0 0 0 0 0 0 0.0002 0 0 0 0 0 0 0 0 0 0 0 0 0 0 
0 
##$DATE= 1151325713
##$DBL= (0..7)
120 120 120 120 120 120 120 120 
##$DBP= (0..7)
150 150 150 150 150 150 150 150 
##$DBP07= 0
##$DBPNAM0= <>
##$DBPNAM1= <>
##$DBPNAM2= <>
$$ [...]
##$SUBNAM7= <"">
##$SUBNAM8= <"">
##$SUBNAM9= <"">
##$SW= 20.6930455092707
##$SWIBOX= (0..15)
0 0 3 0 0 0 0 0 0 0 0 0 0 0 0 0 
##$SW_h= 5175.983436853
##$TD= 65536
##$TD0= 1
##$TE= 295.16
##$TE2= 300
##$TE3= 300
##$TEG= 300
##$TL= (0..7)
0 120 120 120 120 120 120 120 
##$TP= (0..7)
150 150 150 150 150 150 150 150 
##$TP07= 0
##$TPNAME0= <>
##$TPNAME1= <>
##$TPNAME2= <>
##$TPNAME3= <>
##$TPNAME4= <>
##$TPNAME5= <>
##$TPNAME6= <>
##$TPNAME7= <>
##$TPOAL= (0..7)
0.5 0.5 0.5 0.5 0.5 0.5 0.5 0.5 
##$TPOFFS= (0..7)
0 0 0 0 0 0 0 0 
##$TUNHIN= 0
##$TUNHOUT= 0
##$TUNXOUT= 0
##$USERA1= <user>
##$USERA2= <user>
##$USERA3= <user>
##$USERA4= <user>
##$USERA5= <user>
##$V9= 5
##$VALIST= <valist>
##$VCLIST= <CCCCCCCCCCCCCCC>
##$VD= 0
##$VDLIST= <DDDDDDDDDDDDDDD>
##$VPLIST= <PPPPPPPPPPPPPPP>
##$VTLIST= <TTTTTTTTTTTTTTT>
##$WBST= 1024
##$WBSW= 4
##$XGAIN= (0..3)
0 0 0 0 
##$XL= 0
##$YL= 0
##$YMAX_a= 337158
##$YMIN_a= -440467
##$ZGOPTNS= <>
##$ZL1= 120
##$ZL2= 120
##$ZL3= 120
##$ZL4= 120
##$ABSF1= 16.522
##$ABSF2= -4.171173
##$ABSG= 5
##$ABSL= 3
##$ALPHA= 0
##$AQORDER= 0
##$ASSFAC= 0
##$ASSFACI= 0
##$ASSFACX= 0
##$ASSWID= 0
##$AUNMP= <proc_1d>
##$AZFE= 0.1
##$AZFW= 0.1
##$BCFW= 0
##$BC_mod= 0
##$BYTORDP= 0
##$COROFFS= 0
##$CY= 12.5
##$DATMOD= 1
##$DC= 0
##$DFILT= <>
##$DTYPP= 0
##$F1P= 14.0000005364418
##$F2P= -0.99999901652339
##$FCOR= 0.5
##$FTSIZE= 32768
##$FT_mod= 6
##$GAMMA= 0
##$GB= 0
##$INTBC= 1
##$INTSCL= 1
##$ISEN= 128
##$LB= 0.3
##$LEV0= 0
##$LPBIN= 0
##$MAXI= 10000
##$MC2= 0
##$MEAN= 0
##$ME_mod= 0
##$MI= 0
##$NCOEF= 0
##$NC_proc= -5
##$NLEV= 6
##$NOISF1= 0
##$NOISF2= 0
##$NSP= 0
##$NTH_PI= 0
##$NZP= 0
##$OFFSET= 16.522
##$PC= 1
##$PHC0= 173.6972
##$PHC1= 11.26155
##$PH_mod= 1
##$PKNL= yes
##$PPARMOD= 0
##$PSCAL= 4
##$PSIGN= 0
##$REVERSE= no
##$SF= 250.13
##$SI= 32768
##$SIGF1= 0
##$SIGF2= 0
##$SINO= 400
##$SIOLD= 32768
##$SREGLST= <1H.CDCl3>
##$SSB= 0
##$STSI= 32768
##$STSR= 0
##$SW_p= 5175.98343685301
##$SYMM= 0
##$S_DEV= 0
##$TDeff= 65536
##$TDoff= 0
##$TI= <Analysis number 999999
Compound Code 99
Book Reference 9
Project Code 9>
##$TILT= no
##$TM1= 0
##$TM2= 0
##$TOPLEV= 0
##$USERP1= <user>
##$USERP2= <user>
##$USERP3= <user>
##$USERP4= <user>
##$USERP5= <user>
##$WDW= 1
##$XDIM= 32768
##$YMAX_p= 368551607
##$YMIN_p= -685361
$$ End of Bruker specific parameters
$$ ---------------------------------
##NTUPLES= NMR SPECTRUM
##VAR_NAME=  FREQUENCY,     SPECTRUM/REAL,   SPECTRUM/IMAG
##SYMBOL=    X,             R,               I
##VAR_TYPE=  INDEPENDENT,   DEPENDENT,       DEPENDENT
##VAR_FORM=  AFFN,          ASDF,            ASDF
##VAR_DIM=   32768,         32768,           32768
##UNITS=     HZ,            ARBITRARY UNITS, ARBITRARY UNITS
##FACTOR=    0.157963299565203, 1,           1
##FIRST=     4132.6476996994, 0,             0
##LAST=      -1043.33573715361, 0,           0
##MIN=       -1043.33573715361, -685361,     0
##MAX=       4132.6476996994, 368551607,     0
$$ Real data points
##PAGE= N=1
##DATA TABLE= (X++(R..R)), XYDATA
$$ [...]
15025A44942j1506O2749j30582O2200N8365J13941j66384k83907J66304J97662
$$ 144942 133436 196185 65603 127803 186168 300109 133725 -150182 16122 213784
15015B13784J7721r4757q2158k9930K9867l15N4605N1792j28308p1798J39324
$$ 213784 231505 136748 54590 24660 54527 54212 108817 160609 32301 -39497 99827
15004I9827j4233N5506L8601J6680q9295p1615n4362J2272J9767J10086J57594
$$ 99827 85594 141100 179701 196381 107086 35471 -18891 -6619 13148 123234 280828
14993B80828m1627R1146J0068q7833j47322m6285k7934Q4927R6618J45310N2369
$$ 280828 239201 330347 340415 252582 105260 58975 31041 115968 212586 357896 410265
14982D10265n2071m2565j09888K2097j9312m4813k2409j46417j91029k0857Q3855
$$ 410265 358194 315629 205741 227838 208526 163713 141304 -5113 -196142 -216999 -133144
14971a33144K23709J53933J8687m4715k3194j09028o109j22854j20430J10924
$$ -133144 90565 244498 263185 218470 195276 86248 80139 -42715 -163145 -52221
14961e2221J32434J21611M0000j0979p18j15525j36487N9230q4473Q9753J06134
$$ -52221 80213 201824 241824 230845 230127 114602 -21885 37345 -47128 42625 148759
14950A48759l05911k1301o262l2068J10297p2925j07516J56231J18574n8423o0908
$$ 148759 -157152 -178453 -184715 -216783 -106486 -179411 -286927 -130696 -12122 -70545 -131453
14939a31453M3566L7735N107P2462J7255j40187j53330L5836O2876R9685N2277
$$ -131453 -87887 -50152 -45045 27417 44672 -95515 -248845 -213009 -150133 -50448 1829
14928A829J28309j19520j25233r3414p4045K12053L2229P343o395m2594n5674
$$ 1829 130138 10618 -114615 -208029 -282074 -70021 -37792 -30449 -36844 -79438 -135112
14917a35112M9816j34247r557K78496L1002N4471J29661J5689o4977J39813j42578
$$ -135112 -85296 -219543 -229100 49396 80398 134869 264530 280219 215242 355055 212477
14906B12477k05987P2762J34665N7353l3627r6760k17966l9522J25472K6981p1080
$$ 212477 6490 79252 213917 271270 237643 140883 -77083 -116605 8867 35848 -35232
14895c5232k05586M3076J17818J35708k9368L4085j3131L3890L1796p8912j47877
$$ -35232 -240818 -197742 -79924 55784 26416 60501 47370 81260 113056 34144 -113733
14884a13733j0509J02610J71561o2008k04807j73647m0686R1377J93267q10m5400
$$ -113733 -124242 -21632 149929 87921 -116886 -290533 -331219 -239842 -46575 -47385 -92785
14873i2785n1627l0644J07665K45614N5731k24657J83146J29839K8869k5396j68901
$$ -92785 -144412 -175056 -67391 178223 233954 9297 192443 322282 351151 325755 156854
14862A56854m4423M7454j04553k700J27853K72862K0932j07558j39151j56794
$$ 156854 112431 159885 55332 52632 180485 453347 474279 366721 227570 70776
14852G0776k7550k197r2411r7122r1498j1990R6296R0989q4631M2102m2084j75722
$$ 70776 43226 41029 -51382 -148504 -240002 -251992 -155696 -64707 -149338 -107236 -149320 -325042
14840c25042J14561K65655n1068p7701j22056j2911j2010l4467o4429J57071M4241
$$ -325042 -210481 55174 4106 -73595 -195651 -208562 -220572 -255039 -319468 -162397 -118156
14829a18156P8203r497j52727j14578R6048O5636L6273K48290L2343j68914n6230
$$ -118156 -39953 -49450 -202177 -316755 -220707 -155071 -118798 129492 161835 -7079 -63309
14818f3309J451n9016N0616J49914p6259q8756R8168L8802O7652q2612p920q4271
$$ -63309 -61858 -120874 -70258 79656 3397 -85359 12809 51611 119263 36651 28731 -55540
14806e5540n8729O7108n4935j35871j5015O9937Q8398q3455p5113N4995K8555
$$ -55540 -114269 -47161 -102096 -237967 -252982 -183045 -94647 -178102 -253215 -198220 -169665
14795a69665j7608J43910K71585r460j89567k23445m7923J11262J20221P7912
$$ -169665 -187273 -43363 228222 218762 29195 -194250 -242173 -130911 -10690 67222
14785F7222l9449q2863k4249j6275j13166k0403J27469M6593N6528J317l8772
$$ 67222 27773 -55090 -79339 -95614 -208780 -229183 -101714 -55121 1407 2724 -36048
14774c6048N8902n6537k1904j18972l4766R3839O9179k1121L043m7001j27140
$$ -36048 22854 -33683 -55587 -174559 -209325 -115486 -46307 -67428 -64385 -111386 -238526
14763b38526o9487k955J14019R2569l5355M8906K23644J39961m0219q9344M256
$$ -238526 -308013 -310968 -196949 -104380 -139735 -90829 132815 272776 232557 143213 147469
14752A47469o7055L3283j37003P5597J25291j05223k3809J32185L184j53313j13971
$$ 147469 80414 113697 -23306 52291 177582 72359 48550 180735 183919 30606 -83365
14741h3365j10860K37554K59758o9960K2884j34372r4701Q130k6256K888o3418
$$ -83365 -194225 43329 303087 233127 256011 121639 26938 35068 8812 11700 -51718
14730e1718j8081p3956j35646M2745J6782J9909J94837J91670O3937k4641k24869
$$ -51718 -69799 -143755 -279401 -236656 -219874 -199965 -5128 186542 250479 225838 969
14719I69j9255J78932j29955K8996n0052N7958Q5871j49119r6831N5672k7394
$$ 969 -18286 160646 30691 59687 9635 67593 153464 4345 -92486 -36814 -64208
14708f4208Q7961J3515n8005K2715M2088J56219q8491j25155q7915M3173J88347
$$ -64208 23753 37268 -20737 1978 44066 200285 111794 -13361 -101276 -58103 130244
14697A30244J27701j60237K0269r9773o2504J02666K1610P8348l1432j58296j77424
$$ 130244 257945 97708 117977 18204 -44300 58366 79976 158324 126892 -31404 -208828
14686b08828O4894J16315n831Q5110Q4341r489J5660J07727j1578j36306j95894
$$ -208828 -143934 -27619 -33450 51660 136001 126512 142172 249899 238321 102015 -93879
14675i3879p5480K1359K3701K33329J50481j43033j61398o2915o6709j00159N29
$$ -93879 -169359 -148000 -124299 109030 259511 116478 -44920 -107835 -174544 -274703 -274174
14664b74174N0092J30459L5699N1327j13179n5533O8193K18402P2847j87820K0404
$$ -274174 -224082 -93623 -57924 -6597 -119776 -175309 -107116 111286 184133 -3687 16717
14653A6717l7799O1188P2855P0332n5903k01874J05720R3961J5953j3771n8208
$$ 16717 -21082 40106 112961 183293 127390 -74484 31236 125197 141150 127379 69171
14642F9171o0633j22391n6759k15481Q5980J50013L7732J39203Q6587m5816N9351
$$ 69171 8538 -113853 -170612 -386093 -300113 -150100 -112368 26835 113422 67606 126957
14631A26957O7114k9703j48636n2625Q5582j60764j97075k14175N2509J81834
$$ 126957 194071 164368 15732 -36893 48689 -112075 -309150 -523325 -470816 -288982
14621b88982J3696J03359Q1796l3619J6585N137j43818M45P231K34287R9121M8925
$$ -288982 -275286 -171927 -90131 -123750 -107165 -102028 -245846 -245401 -238170 -3883 95238 144163
14609A44163k58397p6733J01689q7911O295J38664J71148J4779j13527M1763O5624
$$ 144163 -114234 -190967 -89278 -177189 -170894 -32230 138918 153697 40170 81933 147557
14598A47557J89623p6113r6089k2452j57010J2197j39009k2572L01460M7018M95
$$ 147557 337180 261067 164978 142526 -14484 -2287 -141296 -163868 137592 184610 185105
14587A85105J22422j25653j13351L1110l1120J05977o6669N2486J12395m6479
$$ 185105 307527 181874 68523 99633 68513 174490 107821 160307 272702 226223
14577B26223r1750j60348L109L4123j02676k77394Q9773L2296K6910J34427J06977
$$ 226223 134473 -25875 -22766 11357 -91319 -368713 -278940 -246644 -219734 -85307 21670
14566B1670M5092Q3137L4781n7194J37312j05755j70671o8607L1166N9694N8552
$$ 21670 66762 149899 184680 127486 264798 159043 -11628 -80235 -49069 10625 69177
14555F9177K1656m567O7861k107p8900k7183L7226O4682l6057L0682k8562l7144
$$ 69177 90833 86266 154127 152020 73120 45937 83163 147845 111788 142470 113908 76764
14543G6764j88448j27689r5691N9747K04190j294M3145N3343L613K8059P2874
$$ 76764 -111684 -239373 -335064 -275317 -71127 -72421 -29276 24067 27680 55739 128613
14532A28613J98836J17228j54434j01614j16754r8048O7011r0885J1208p4314
$$ 128613 327449 444677 290243 188629 71875 -26173 40838 -50047 -38839 -113153
14522a13153j15641L361K15521J11060Q5680n8980r43J26996l3752p1598p4141
$$ -113153 -228794 -225433 -9912 101148 186828 127848 126905 253901 220149 148551 74410
14511G4410o8019N679l5636R9457k3885k491J03868k5157O5456N416m8279N8773
$$ 74410 6391 12070 -23566 75891 52006 49515 153383 128226 193682 199098 150819 209592
14499B09592M0036r3192l04843R7125N8964N4589J22692o5121j3566m0694j35742
$$ 209592 249628 156436 -148407 -51282 7682 62271 184963 119842 106276 65582 -70160
14488g0160J08238J69301l9166r7637m7824L582Q7712j2628j85913P4945m1293
$$ -70160 38078 207379 168213 70576 22752 26334 114046 101418 -84495 -9550 -50843
14477e0843j45612k527P7980J78088Q7606k05963k12893J15765J85454n2603N7999
$$ -50843 -196455 -198982 -121002 57086 144692 -61271 -274164 -158399 27055 -25548 32451
14466C2451k2054q645l9422J33418J91411J35995j45552k59887l2269j64048o450
$$ 32451 10397 1752 -37670 95748 287159 423154 277602 17715 -14554 -178602 -185052
14455a85052L5101L0811L4749n3625R2989Q5460m091P4951K4844k2660m9906J08595
$$ -185052 -149951 -119140 -84391 -138016 -45027 40433 36342 111293 136137 113477 63571 172166
14443A72166R49j73538r5395J2312M089L893L2607L9742J05O0209J6457R3464
$$ 172166 173115 -423 -95818 -83506 -79417 -75524 -42917 -3175 -3070 57139 73596 167060
14431A67060l9721O9906p6335l2669r6366K0223J01947r3125k65973p8375K74799
$$ 167060 127339 197245 120910 88241 -8125 12098 114045 20920 -245053 -323428 -48629
14420d8629J94527O0672n2681R828L3329k060j44286L4951j27919r7275K39065
$$ -48629 145898 206570 153889 163717 197046 194986 50700 85651 -42268 -139543 99522
14409I9522Q7491j37809k59198N9216Q0064N5283K28964J13456r9243j87721M8745
$$ 99522 187013 49204 -209994 -150778 -70714 -15431 213533 326989 227746 40025 88770
14398H8770J56018j82195k14120J29871j3570j14481o5528P8912N5217N7910L4734
$$ 88770 244788 62593 -151527 -21656 -35226 -149707 -215235 -136323 -81106 -23196 11538
14387A1538L379P0880J01484N3791R1783k87605k20983J6004J19536J53270K5111
$$ 11538 14917 85797 187281 241072 332855 45250 -175733 -159729 -40193 113077 138188
14376A38188N6445P5579j17341k5429q8950j4805K46244j55124j13188j24601
$$ 138188 194633 270212 152871 127442 38492 23687 269931 114807 1619 -122982
14366a22982J04793k6675J8885R3189j4019m2762p5170n4742N0456j20542J42591
$$ -122982 -18189 -44864 -25979 67210 53191 10429 -64741 -119483 -69027 -189569 -46978
14355d6978K34079K171k07081j06382n5591K00847M8583K5154q6848k510r086
$$ -46978 187101 189272 -17809 -124191 -179782 21065 69648 94802 7954 5444 -3642
14344c642J85756K05138P8103j52429m4989M436K4977o7989l9247l8550L8647
$$ -3642 182114 387252 465355 312926 267937 272373 297350 229361 190114 151564 190211
14333A90211J32747J12200k49374k20145P6479J49898K2750Q9513k8576o4394
$$ 190211 322958 435158 185784 -34361 42118 192016 214766 304279 275703 211309
14323B11309j21730j14500l2879Q8008K3693n3560k05646O9647J73029J57656
$$ 211309 89579 -24921 -57800 30208 53901 341 -205305 -135658 37371 195027
14313A95027O6892L2294j26445n9176O1213N0757j1819m4784p7662n6462J27489
$$ 195027 261919 294213 167768 108592 169805 220562 208743 163959 86297 29835 157324
14302A57324j9370j09681p0861j34695J30283O0475K29545K80087J94265p6916
$$ 157324 137954 28273 -42588 -177283 -47000 13475 243020 523107 717372 640456
14292F40456k73248J852J06648l300j98858j7688K371j55324q9296k982J01507
$$ 640456 367208 369060 475708 472408 273550 255862 258233 102909 13613 10631 112138
14281A12138R2027n3238J73324R0830j61869l7187l1925l60138j26363N5681J41129
$$ 112138 204165 150927 324251 415081 253212 216025 184100 -176038 -302401 -246720 -105591
14270a05591K12641k1557L4903k9063j2478J69034O4322j14781p0728m8955N6817
$$ -105591 107050 85493 120396 91333 78855 247889 312211 197430 126702 77747 134564
14259A34564k184M6074N2972k6590N1405N0511K0571M3478o3563l1530k0304q5903
$$ 134564 132380 178454 231426 204836 256241 306752 327323 370801 307238 275708 255404 169501
14247A69501o5134n3268J1414L4614P4755j30962k2276k5427m0257j41774R0944
$$ 169501 104367 51099 62513 97127 171882 40920 18644 -6783 -47040 -188814 -97870
14236i7870R5720j00169J04467j02447L7088J5157N3688J19858M3222L4473M1366
$$ -97870 -2150 -102319 2148 -100299 -63211 -48054 5634 125492 168714 203187 244553
14225B44553j73083L0811J0008j56734R3107M5067q3091Q4682M5494m8861j01971
$$ 244553 71470 102281 112289 -44445 48662 93729 10638 95320 140814 91953 -10018
14214a0018O2018j00349p9780l8422k6127J21754K7217J07098N6412k15173L4199
$$ -10018 52000 -48349 -128129 -166551 -192678 -70924 -43707 63391 119803 -95370 -61171
14203f1171Q5159P5781K15047p1820J3404n968J32799p93j64834j26911J69972
$$ -61171 23988 99769 314816 242996 256400 250432 383231 382438 217604 90693 260665
14192B60665J10541j44911j37574M2385M5893J16488J65949R7664J25621O6253
$$ 260665 371206 226295 88721 131106 176999 293487 459436 557100 682721 748974
14182G48974j76243j21186M4307O166k4952o7861j00318k8930l7443N1305P6511
$$ 748974 572731 451545 495852 502018 477066 409205 308887 279957 242514 293819 370330
14171C70330N9161j73568k41355m4571j21576Q4561r75M6694l931J26549N753
$$ 370330 429491 255923 14568 -30003 -151579 -67018 -67993 -21299 -25230 101319 107072
14160A07072O8266J29445R814p126j45584k3919j66308o9824R6091N8042q2028
$$ 107072 175338 304783 314597 307471 161887 137968 -28340 -98164 -2073 55969 -26059
14149b6059p2000J33344J21984j9393m7169J3550J21024L5741J93424J3425K8008
$$ -26059 -98059 35285 157269 137876 90707 104257 225281 261022 454446 467871 495879
14138D95879O59m1250p2918l142m818j14566n0381r677j94114n545J58118n3736
$$ 495879 496538 455288 382370 379228 374410 259844 209463 199786 5672 127 158245 104509
14126A04509j62247L384J55338K36671O0229j52078j64222p8802M2748K8191Q6901
$$ 104509 -57738 -54354 100984 337655 397884 245806 81584 2782 45530 73721 160622
14115A60622j66529j00978N3922l3546J60736K1583J92358L6589p4197O4892R4727
$$ 160622 -5907 -106885 -52963 -86509 74227 95810 288168 324757 250560 315452 410179
14104D10179j2423j24413J49495J28723J01317J25445J32083r2671L1639j45337
$$ 410179 397756 273343 422838 551561 652878 778323 910406 817735 849374 704037
14094G04037p4552j05981j29013P0524L1617N9537k19792M0017J7075J30613p9063
$$ 704037 629485 523504 394491 465015 496632 556169 336377 376394 393469 524082 445019
14083D45019j83524r7542J15179m3564j05648K2320j35314J23908J07828M3937
$$ 445019 261495 163953 279132 235568 129920 152240 16926 140834 248662 292599
14073B92599o7810k0730q3207k02561J4869M42l3971J58525J77806J21639n1566
$$ 292599 224789 204059 120852 -81709 -66840 -66398 -100369 58156 235962 357601 306035
14062C06035q0956Q3564R309q9994k01387j86828o1706J53629K76431O4729q685
$$ 306035 225079 308643 317952 227958 26571 -160257 -221963 -68334 208097 272826 264141
14051B64141o2221j948J30629Q0700r3501J6103J78944l1399j40597k2482J64600
$$ 264141 201920 199972 330601 411301 317800 333903 512847 481448 340851 318369 482969
14040D82969J13850m0878r9837o5553j48293k9563o1165k15433j7568L500j4702
$$ 482969 596819 555941 456104 390551 242258 212695 151530 -63903 -81471 -77971 -92673
14029i2673j2634N3447M8603j60387K7838J8648j5261R0643J21109Q6948j89608
$$ -92673 -105307 -51860 -3257 -163644 -135806 -117158 -132419 -41776 79333 166281 -23327
14018b3327m6357K19390O9282k4974l7744o1896K35932J02198K1206l1941j15977
$$ -23327 -69684 149706 218988 194014 156270 94374 330306 432504 453710 421769 305792
14007C05792o7072r3514p6156L8959N6003O2347P4936j02935j1334J9922K2223
$$ 305792 238720 145206 69050 108009 164012 226359 301295 198360 187026 206948 229171
13996B29171o6154l5568j9861J2673J29323o478m9521m8943p9083P0629k4245
$$ 229171 163017 127449 107588 120261 249584 243106 193585 144642 65559 136188 111943
13985A11943j84010J4327j7884L9513P6003J49207L3649j37065K8659j6717l8547
$$ 111943 -72067 -57740 -75624 -36111 39892 189099 222748 85683 114342 97625 59078
13974E9078J4807q5379j46448j55124O192O9837J58611P3787P5417R8829K07600
$$ 59078 73885 -11494 -157942 -313066 -306874 -237037 -78426 -4639 70778 169607 377207
13963C77207j10530j62500j97754k31310R2384P4667J59436K06475L6177P9976
$$ 377207 266677 104177 -93577 -324887 -232503 -157836 1600 208075 244252 324228
13953C24228k8811j9193m4217K12506q1014r7725j21702q2494j4605p9593O9589
$$ 324228 295417 276224 232007 444513 363499 265774 144072 61578 46973 -32620 36969
13942C6969K21610J23435J4699q587n7212Q4809J397N2820P4911l5733j06782
$$ 36969 258579 382014 396713 388126 330914 415723 417120 469940 544851 509118 402336
13931D02336p7717r8170M2422L3369q4916k2409K0951N4498J06277q338R9420
$$ 402336 324619 226449 268871 302240 217324 194915 215866 270364 376641 368303 467723
13920D67723p253j76996j16752l922M7421q9271o6130l7636j10589j70823N6531
$$ 467723 460470 283474 166722 162800 210221 120950 54820 17184 -93405 -264228 -207697
13909b07697K7413N9878K4643J33673K36331K7297m3316r7483l7249N7642r0950
$$ -207697 -180284 -120406 -95763 37910 274241 301538 258222 160739 123490 181132 90182
13898I0182K04673k6352k8059r934Q7614Q6964p1501r4293j19138p7462j32050
$$ 90182 294855 268503 240444 230510 318124 405088 333587 239294 120156 42694 -89356
13887h9356p7698J36315L50257K0751j49105p5242o6381m078J33387J6788l5742
$$ -89356 -167054 -30739 319518 340269 191164 115922 49541 45463 178850 195638 159896
13876A59896K4715J97994J76197r6334n9015r0625M3741k0449j12185J3096K19358
$$ 159896 184611 382605 558802 462468 403453 312828 356569 336120 223935 237031 456389
13865D56389r68j85368j14583M4783J67752M6405k380q051l41807N4524l4682
$$ 456389 455421 270053 155470 200253 368005 414410 412030 403979 62172 116696 82014
13854H2014n143R8900J74259R278j7622J04996J4061N5168K1041K4006k5314k55699
$$ 82014 76871 175771 350030 359308 341686 446682 460743 515911 536952 560958 535644 279945
13842B79945j68667J718O5189J44127N5002J13654P1219K00778J6746k03697l98179
$$ 279945 111278 112996 178185 322312 377314 490968 562187 762965 779711 576014 177835
13831A77835p089P8848N8785J8247m4709j9800j76251M8807J44678Q4407J68114
$$ 177835 170746 249594 308379 326626 281917 262117 85866 134673 279351 363758 531872
13820E31872L0029j74594r9774K3390l0351M9499N5622J13042n8394N9069k0372
$$ 531872 561901 387307 287533 310923 280572 330071 385693 498735 440341 499410 479038
13809D79038l5040J19134K03464m0818k91R036K79120J86252j35401R1905J58203
$$ 479038 443998 563132 766596 725778 725487 734523 1013643 1199895 1064494 1156399 1314602
13798A314602l5256j53529J18460R1377Q3038n5288j11767q1796N2565l1208q6435
$$ 1314602 1279346 1125817 1244277 1335654 1418692 1363404 1251637 1169841 1222406 1191198 1104763
13787A104763R9685k564n5149p750j1696k5259n3000K3926J8070R6665j4356j56921
$$ 1104763 1204448 1201884 1146735 1138985 1127289 1102030 1049030 1072956 1091026 1187691 1173335 1016414
13775A016414P5428K15053J65993p0828m5752K74810L43961K011l9610J67251
$$ 1016414 1091842 1306895 1472888 1402060 1356308 1631118 1975079 1977090 1937480 2104731
13765B104731J53773J60641M6211J40172L26902M28059K68786L35182M24863P70710
$$ 2104731 2258504 2419145 2465356 2605528 2932430 3360489 3629275 3964457 4389320 5160030
13755E160030J035533J261720J343645J615462K053645K169384K121733J883357
$$ 5160030 6195563 7457283 8800928 10416390 12470035 14639419 16761152 18644509
13747A8644509J125311n2183q17045j435548k082458k243524j855776j729349
$$ 18644509 19769820 19717637 18900592 17465044 15382586 13139062 11283286 9553937
13739I553937j275719p99930q39303o21547k81148j82213j32547j80785r7615
$$ 9553937 8278218 7478288 6638985 6017438 5736290 5554077 5421530 5240745 5143130
13730E143130J43964J35173J76541Q0536L61383M60339M73246Q09538Q98286J108762
$$ 5143130 5287094 5422267 5598808 5679344 6040727 6501066 6974312 7783850 8682136 9790898
13720I790898J394236J738482K187803K458947K692693K881406K886470K737376
$$ 9790898 11185134 12923616 15111419 17570366 20263059 23144465 26030935 28768311
13712B8768311K796971K877498K900111K914194K760795K467928K309493K157122
$$ 28768311 31565282 34442780 37342891 40257085 43017880 45485808 47795301 49952423
13704D9952423J573746Q19881l02186j511713k733702l630052m049168m319304
$$ 49952423 51526169 52346050 52043864 50532151 47798449 44168397 40119229 35799925
13696C5799925m453551m124850l601278k740273j950553j461007j020941n44927
$$ 35799925 31346374 27221524 23620246 20879973 18929420 17468413 16447472 15902545
13688A5902545k55159m1637k13382L38281O64637N52229P01288J006191J385973
$$ 15902545 15647386 15605749 15392367 15730648 16395285 16947514 17648802 18654993 20040966
13679B0040966J340107J375833J457963J862972J871564K038355K555595L361958
$$ 20040966 21381073 22756906 24214869 26077841 27949405 29987760 32543355 35905313
13671C5905313M116564M585175N239893O280224O822188O339898N613813M082644
$$ 35905313 40021877 44607052 49846945 56127169 62949357 69289255 74903068 78985712
13663G8985712K144470j72460k234509l945088n305782n833780n864651n715360
$$ 78985712 81130182 80957722 78723213 74778125 69472343 63638563 57773912 52058552
13655E2058552m984774m400004l996243l674617l198952k833146k618439k040918
$$ 52058552 47073778 42673774 38677531 35002914 31803962 28970816 26352377 24311459
13647B4311459j711145j446671j092743p05110o74507k99460r0501J38153M40658
$$ 24311459 22600314 21153643 20060900 19355790 18681283 18381823 18291322 18429475 18870133
13638A8870133P81189J164121J601908J877793K321083K562306K566067K512999
$$ 18870133 19651322 20815443 22417351 24295144 26616227 29178533 31744600 34257599
13630C4257599K258144K056512J908702J398761J345779J418990J638036J747376
$$ 34257599 36515743 38572255 40480957 41879718 43225497 44644487 46282523 48029899
13622D8029899J954540J960179J516600O97703o2232j503309k975558m032877
$$ 48029899 49984439 51944618 53461218 54158921 54096689 52593380 49617822 45584945
13614D5584945m452770m579287m284115l601353l098881k978898k434340j809691
$$ 45584945 41132175 36552888 32268773 28667420 25568539 22589641 20155301 18345610
13606A8345610j326516j161995j104828j189038r00209m53584k44923l92945n25493
$$ 18345610 17019094 15857099 14752271 13563233 12663024 12209440 11964517 11571572 11046079
13597A1046079m81270j96097P2546R214L7944K53190J28272K41136M88684Q85738
$$ 11046079 10564809 10368712 10441258 10450472 10488416 10741606 10869878 11111014 11599698 12485436
13587A2485436J290574J710015J741344J960341K021506J698148J154377K85358
$$ 12485436 13776010 15486025 17227369 19187710 21209216 22907364 24061741 24347099
13579B4347099o65718j283517j921481k297939k117752k024407j951584j512897
$$ 24347099 23681381 22397864 20476383 18178444 16060692 14036285 12084701 10571804
13571A0571804j092050j057587o18476l23660j85239l64718l65419j84971j84050
$$ 10571804 9479754 8422167 7803691 7480031 7294792 6930074 6564655 6379684 6195634
13562F195634j41020k522k71461m05818k57581k37129k62428k92664q8309k50741
$$ 6195634 6054614 6052092 5780631 5374813 5117232 4880103 4617675 4325011 4236702 3985961
13552C985961j93858j31127r5267j50673j58571o1666l824j10612k11868m4345
$$ 3985961 3792103 3660976 3565709 3415036 3256465 3194799 3190975 3080363 2868495 2824150
13542B824150l1281l8469j46714n6593n3516Q2123O1926n0660M8614Q9922Q964
$$ 2824150 2792869 2754400 2607686 2551093 2497577 2579700 2641626 2590966 2639580 2729502 2738466
13531B738466r6275j18437q787n4437j54899k77536j40658O0640K3385K9285j72389
$$ 2738466 2642191 2523754 2514967 2460530 2305631 2028095 1887437 1948077 1971462 2000747 1828358
13520A828358j36644k06946k82153n8799K7957J76736K1440j66518k12465J43271
$$ 1828358 1691714 1484768 1202615 1143816 1171773 1348509 1369949 1203431 990966 1134237
13510A134237L1546k51271r7144j10646j2439M2538O2069N6564k7158n1451N8297
$$ 1134237 1165783 914512 817368 706722 694283 736821 798890 855454 828296 776845 835142
13499H35142p5534q7980J57236o9791k88455K9942R7265r013J11361k2289O8529
$$ 835142 759608 671628 828864 759073 470618 500560 597825 588812 700173 677884 746413
13488G46413m9766k69992r720K1246L8460q9253j00786j28996P313J25121J47760
$$ 746413 696647 426655 416935 438181 476641 387388 286602 157606 164919 290040 437800
13477D37800K9338q8923l6630K20435j3778j89736r5299K52135j0362m0964j86885
$$ 437800 467138 378215 341585 562020 548242 358506 263207 515342 504980 464016 277131
13466B77131j83339N3519p602j96451J74822M19295j881j52481o3748j6504l6824
$$ 277131 93792 147311 139709 -56742 118080 537375 535494 383013 319265 302761 265937
13455B65937j9575l2937Q4835R4391j12693K4126n6755J09791Q6276j24995N2963
$$ 265937 246362 213425 298260 392651 279958 304084 247329 357120 443396 318401 371364
13444C71364J01019J05295n4020p7127j06495O9383K24508m3878j40644j87521
$$ 371364 472383 577678 523658 446531 340036 409419 633927 590049 449405 261884
13434B61884j59670L5672o4855M4403P3116j08221j12912J2379k8649O8157Q7627
$$ 261884 102214 137886 73031 117434 190550 82329 -30583 -18204 -46853 21304 108931
13423A08931J31910K32776M1398j5990n7694r1769r7327o7641l5217j26623M4182
$$ 108931 240841 473617 515015 499025 441331 349562 252235 184594 149377 22754 66936
13412F6936K24288K0319J54377M6076J3657R3791k68410k40587p7362J8195J72215
$$ 66936 291224 311543 465920 511996 525653 619444 351034 110447 33085 51280 223495
13401B23495J15040p3748J43156M2133j47031o3799J50251m6287j22799j01341
$$ 223495 338535 264787 407943 450076 303045 239246 389497 343210 220411 119070
13391A19070q3889J41019J25707J54370k3948l2874L1215R7405o3394j45749o1800
$$ 119070 35181 176200 301907 456277 432329 399455 430670 528075 464681 318932 257132
13380B57132j3812J3024j60724m3177n5484J680Q3824Q5240K4105J34027K69984
$$ 257132 243320 256344 95620 52443 -3041 -1361 82463 167703 191808 325835 595819
13369E95819k04934j31001J98444k8209m1174Q7298m5204J0583j41074m2361K373
$$ 595819 390885 259884 458328 430119 388945 476243 431039 441622 300548 258187 260560
13358B60560k3981N5667r7753r0063J35887L2614L2436l0344R1245l3742R8051
$$ 260560 236579 292246 194493 104430 240317 272931 305367 275023 366268 332526 430577
13347D30577q2953l5562J12431j28461O6572J96100J66817j02443j18624J1756
$$ 430577 347624 312062 424493 296032 362604 558704 725521 623078 504454 516210
13337E16210K1454L4253k4028j36222K956j42800K1976o7027l356j15526L9333
$$ 516210 537664 571917 547889 411667 414623 271823 293799 226772 223416 107890 147223
13326A47223L13340K43436J02123o2371r4237R0877j82684L4476J00549K33347
$$ 147223 460563 703999 806122 743751 649514 740391 557707 592183 692732 926079
13316I26079J16520J36481K98484K28218J88239K4060j46238k34369k43153j08574
$$ 926079 1042599 1179080 1477564 1705782 1894021 1918081 1771843 1537474 1294321 1185747
13306A185747J4814o0409j65382j32772J55517K89389R6645J22675K24920J63337
$$ 1185747 1200561 1140152 974770 841998 997515 1286904 1383549 1506224 1731144 1894481
13296A894481Q1266q8709k42615j55502l0100j24819k35506k89587l1988m4511
$$ 1894481 1975747 1887038 1644423 1488921 1458821 1334002 1098496 808909 776921 732410
13286G32410j38552J0062P6593J11798K11176J68032J67056l9087J10953J17104
$$ 732410 593858 603920 680513 792311 1003487 1171519 1338575 1299488 1410441 1527545
13276A527545K40907K27484j29182k57763j00747o1067l4371o5440q6759j12899
$$ 1527545 1768452 1995936 1866754 1608991 1508244 1447177 1412806 1347366 1260607 1147708
13266A147708j17118J20366j3102L9652q704J48602K73448J90798l0583n3858
$$ 1147708 1030590 1150956 1137854 1177506 1168802 1317404 1590852 1781650 1751067 1697209
13256A697209j86922k07861m28835j29674k2851j39964l4241R5754R65r7029q4859
$$ 1697209 1510287 1302426 873591 743917 721066 581102 546861 642615 643580 546551 461692
13245D61692k8578k13718J6921J67732K1712L9743j25030j8804K00243k2159r030
$$ 461692 433114 219396 236317 404049 425761 465504 340474 321670 521913 499754 490724
13234D90724K0664M6730l4784j37093Q9937M2351J27581J32255j70431l2268Q1028
$$ 490724 511388 558118 523334 386241 476178 518529 646110 778365 607934 575666 656694
13223F56694O8883p6311r7270J2252L7899M9621l578J689M4935j21994K6415J9611
$$ 656694 725577 649266 551996 564248 602147 651768 648190 649879 694814 572820 599235 618846
13211F18846O4704j62739J22065o924l9641q7927K4973R5948K6183j14490j75993
$$ 618846 683550 520811 642876 635952 596311 508384 533357 629305 655488 540998 365005
13200C65005N7677K1351R6516j30136o7389k8708P0228K67436K12239J95238N8487
$$ 365005 422682 444033 540549 410413 343024 314316 384544 651980 864219 1059457 1117944
13189A117944j00515k23662J3224L9937j11580j1888Q7653J50577Q7905j30396
$$ 1117944 1017429 793767 806991 846928 735348 723460 811113 961690 1049595 919199
13179I19199L223M0930M0520n6j06737j89147m805j20429p8984r8250Q2952J12089
$$ 919199 922422 963352 1003872 1003816 897079 707932 703127 582698 503714 405464 488416 600505
13167F00505J29973N7674o1244j10714k1879Q7683J43590j2372j0486J68055N3946
$$ 600505 730478 788152 726908 616194 594315 681998 825588 813216 802730 970785 1024731
13156A024731q4793k01293k409l7209K829j52842j18384J1780L6840l9163p4128
$$ 1024731 939938 738645 736236 699027 701856 549014 430630 442410 479250 440087 365959
13145C65959O8165K64361J22255j6817o4729p5997j22004j63735j5362J21573
$$ 365959 434124 698485 820740 803923 739194 663197 541193 377458 362096 483669
13135D83669J06196r6282K819O751j5311r213J68653o597m5096P2341p6125J05110
$$ 483669 589865 493583 496402 503153 487842 478629 647282 640685 595589 667930 591805 696915
13123F96915k55540M0125J14460j80382N1707L21226K26095L06637O3275N6017
$$ 696915 441375 481500 595960 415578 467285 788511 1014606 1321243 1384518 1440535
13113A440535m3608J8697j05040N841m8835l3549j11486j10435j98232l1846J08187
$$ 1440535 1396927 1415624 1310584 1316425 1267590 1234041 1122555 1012120 813888 782042 890229
13102H90229N4919j22793j665q8113P7919J40200P4582R7632o6954k25852j14943
$$ 890229 945148 822355 820690 732577 810496 950696 1025278 1122910 1055956 830104 715161
13091G15161O6095o463K7582J1738J50442J21779k839J29199J80728J6794j79604
$$ 715161 781256 774793 802375 814113 964555 1086334 1083495 1212694 1393422 1410216 1230612
13080A230612j59205j01145j35050J22009j13737p9040p3400n8794r4631j56021
$$ 1230612 1071407 970262 835212 957221 843484 764444 691044 632250 537619 381598
13070C81598l5936J56451J11822M4524n4303R4057J26516M8884o7844K6590N3411
$$ 381598 345662 502113 613935 658459 604156 698213 824729 873613 805769 832359 885770
13059H85770m1812k4358o2732J99355J5323j76608j65686m0053j4568o4132m9098
$$ 885770 843958 819600 756868 956223 971546 794938 629252 589199 574631 510499 461401
13048D61401k33915o3044R1751k8131j33372P6099J33717j06206n9276K14502
$$ 461401 227486 164442 256193 228062 94690 170789 304506 198300 139024 353526
13038C53526J00898o7651j51748M9502P3516L8461k24614j11976J52457J25412
$$ 353526 454424 386773 235025 284527 358043 396504 171890 59914 212371 337783
13028C37783J16882L0258L2616J46851Q7352o0215k15249j45412o3520J02999
$$ 337783 454665 484923 517539 664390 751742 691527 476278 330866 267346 370345
13018C70345L1247k675j12481j12655N5441M5059j2552l18154m4016L6601J77944
$$ 370345 401592 398917 286436 173781 229222 274281 261729 -56425 -100441 -63840 114104
13007A14104J43597J67428k6446o8213l2629M5700k68878p490R5898J5797K30140
$$ 114104 257701 425129 398683 330470 297841 343541 74663 67173 163071 178868 409008
12996D09008k9900Q5338j33367J21535J36118j49213j21247j05496J31985m2652
$$ 409008 379108 464446 331079 452614 588732 439519 318272 212776 344761 302109
12986C02109k43100J9403K1873R292J43194l7730O1434J7503R8430J09742k030
$$ 302109 59009 78412 100285 109577 252771 215041 276475 293978 392408 502150 500120
12975E00120k05338p2263J70160K14546j57741k05846O8226L7729P7451Q494q5761
$$ 500120 294782 222519 392679 607225 449484 243638 311864 349593 427044 435538 349777
12964C49777p4742J02587J64370N3946p3526N3955K39251r4071j70805O6142m3787
$$ 349777 275035 377622 541992 595938 522412 576367 815618 721547 550742 616884 573097
12953E73097r1454j51302m6179l1781J74877J61553r8483k45096O1616P9007n4162
$$ 573097 481643 330341 284162 252381 427258 588811 490328 245232 306848 385855 331693
12942C31693M9298j30987r0244J26982R5747j6977j8067j6722O2148K17417K64199
$$ 331693 380991 250004 159760 286742 382489 365512 347445 330723 392871 610288 874487
12931H74487J07088q7783j00047q8900K9668J79908j1350j70920n2732m7969r4809
$$ 874487 981575 893792 793745 704845 734513 914421 903071 732151 679419 631450 536641
12920E36641N6776J24388N4697J07060j7285j84506j01666O4725Q0385l8503j17278
$$ 536641 593417 717805 772502 879562 862277 677771 576105 640830 721215 682712 565434
12909E65434j65811L8370K28288j0753j11432k02507n0758N8633K70407J44476
$$ 565434 399623 437993 666281 655528 544096 341589 290831 349464 619871 764347
12899G64347J59830j13992j97876P0308P9531k06394L0731r0074q1773k6047J6286
$$ 764347 924177 810185 612309 682617 762148 555754 586485 496411 414638 388591 404877
12888D04877r9913O5634N0723n7479J61042M2281O1882K13357J04686J5807j48423
$$ 404877 304964 370598 421321 363842 524884 567165 629047 842404 947090 962897 814474
12877H14474j7634R3801r0392o0161j39537K486n4536l7656R5603O1448j3111
$$ 814474 796840 890641 800249 740088 600551 603037 548501 510845 606448 667896 654785
12866F54785J43013m9951j37381j59319J69637K4419j4160R363l7682M4851J65523
$$ 654785 797798 747847 610466 451147 620784 645203 631043 640406 602724 647575 813098
12855H13098P4687K4686J904L2569k5226r0501P7274N8619j46024M8443J02260
$$ 813098 887785 912471 914375 946944 921718 831217 908491 967110 821086 869529 971789
12844I71789l2193l4353j73581J06382k0178n1646k1409r4195Q6188J72002j75324
$$ 971789 939596 905243 731662 838044 817866 766220 744811 650616 736804 908806 733482
12833G33482j31934J31313J06394R5118r049O1621J05457j08885L41k1511M9208
$$ 733482 601548 732861 839255 934373 925324 986945 1092402 983517 983858 962347 1011555
12822A011555N5878M4152j8395L8124J4366k4850l8666q7767k8152k10251l2140
$$ 1011555 1067433 1111585 1093190 1131314 1145680 1120830 1082164 994397 966245 755994 723854
12811G23854K01575K56082r960o1752j1125j1192q0219Q7333O3893j1232l05281
$$ 723854 925429 1181511 1171551 1109799 1098674 1087482 1007263 1094596 1158489 1147257 841976
12800H41976j20279J44831K45922O3948k7313j26692k6986j9341n252j61765n572
$$ 841976 721697 866528 1112450 1176398 1149085 1022393 995407 976066 970814 809049 803477
12789H03477M4706J22089J29158j50258K7161J04160Q2198r346L7118Q8100P8391
$$ 803477 848183 970272 1099430 949172 976333 1080493 1162691 1153345 1190463 1278563 1356954
12778A356954k4922K7503Q9255R4596J3660k9243k6233j38442K4974J78078q246
$$ 1356954 1332032 1359535 1448790 1543386 1557046 1527803 1501570 1363128 1388102 1566180 1557934
12767A557934P4101J73059n9290L287R2308O0352K27892j751K06794J59360J90992
$$ 1557934 1632035 1805094 1745804 1749091 1841399 1901751 2129643 2127892 2334686 2494046 2685038
12756B685038J42625n4799J53320J21434K35994L19901J50811K25976P3440L14705
$$ 2685038 2827663 2772864 2926184 3047618 3283612 3603513 3754324 3980300 4053740 4368445
12746D368445L67429M19134Q55638R48138J295877J912009K100358K738482L581006
$$ 4368445 4735874 5155008 6010646 6958784 8254661 10166670 12267028 15005510 18586516
12737A8586516N339346O216110P041830P762000P431848N474738K662214R03019
$$ 18586516 23925862 30141972 37183802 44945802 52377650 57852388 60514602 61417621
12729F1417621n19962k561328l416122l886489m538070n405444n689218m899766
$$ 61417621 60897659 58336331 54920209 51033720 46495650 41090206 35400988 30501222
12721C0501222l496003k706771k013415j353867o29609J05622Q61559J671795
$$ 30501222 27005219 24298448 22285033 20931166 20301557 20407179 21268738 22940533
12713B2940533K652119M103552O138294Q097918J0582944J3060388J4638566J4651599
$$ 22940533 25592652 29696204 35834498 43932416 54515360 67575748 82214314 96865913
12705I6865913J3379063J1179125P206048N17350l345447n452560p992896j1004007
$$ 96865913 110244976 121424101 128630149 129147499 125802052 120349492 112356596 101352589
12697A01352589j3439903j2756710j0849352q801872p208904o357482n238617
$$ 101352589 87912686 75155976 64306624 55504752 48295848 41938366 36699749
12690C6699749l500643k534363j653485q90637J58238J005191J945778K970127
$$ 36699749 33199106 30664743 29011258 28120621 28278859 29284050 31229828 34199955
12682C4199955M047498N172322N977245O403978O632406O235902N032160L197665
$$ 34199955 38247453 43419775 49397020 55800998 62433404 68669306 73701466 76899131
12674G6899131J704645m21586k681830m031621n650440o182133n537910m193167
$$ 76899131 78603776 78182190 75500360 71468739 65818299 59636166 54098256 49905089
12666D9905089k592880r98311J194098L570518N504661O702927P668483P966490
$$ 49905089 47312209 46313898 47507996 51078514 56583175 63286102 70954585 78921075
12658G8921075P156547N357317L360457J236789o40446k824849o193740p700268
$$ 78921075 86077622 91434939 94795396 96032185 95391739 92566890 86373150 78672882
12650G8672882p873254p998853p616029o675783n282293l614077k307883j481002
$$ 78672882 70799628 62800775 55184746 48508963 43226670 39612593 37304710 35823708
12642C5823708n37818N80749J765231L370735N614732Q289290J0917760J2771051
$$ 35823708 35285890 35866639 37631870 41002605 46617337 54906627 65824387 78595438
12634G8595438J4445121J5227134J4996611J3554724J2323122J1190124R411241
$$ 78595438 93040559 108267693 123264304 136819028 149142150 160332274 169743515
12627A69743515N752656k5998p632765j5638124j8945240j6439267j4182835j4394050
$$ 169743515 175496171 175470173 167837408 152199284 133254044 116814777 102631942 88237892
12619H8237892j3770535j0974092p912606n418004m117025l259384k006171j061942
$$ 88237892 74467357 63493265 55580659 50162655 46045630 42786246 40780075 39718133
12611C9718133O594J436197L333582N065569O470898P396584Q093006Q037690
$$ 39718133 39724727 41160924 44494506 49560075 56030973 63427557 71520563 79558253
12603G9558253O541772M566789M013231L743816K190899r5619l743778p351329
$$ 79558253 86100025 90666814 94680045 98423861 100614760 100519141 96775363 89424034
12595H9424034r228948j0849819j1322135r721814p241982m991224l790941l151884
$$ 89424034 80195086 69345267 58023132 48301318 41059336 36068112 32277171 29125287
12587B9125287k725621k167956j709605j372738j127031r78403p05748o37021
$$ 29125287 26399666 24231710 22522105 21149367 20022336 19043933 18338185 17701164
12579A7701164p92583o10904m75827l62220k04149l90937m76843l67678k70300
$$ 17701164 16908581 16297677 15821850 15459630 15255481 14864544 14387701 14020023 13749723
12570A3749723o35366p09732n05404m63326m09178m99208o46039m66619k78890
$$ 13749723 13114357 12404625 11899221 11435895 11026717 10527509 9881470 9414851 9135961
12561I135961k88045l90732l48184k17150l85241k27414j82215k81981k45711
$$ 9135961 8847916 8457184 8109000 7891850 7506609 7279195 7096980 6814999 6569288
12552F569288j55866k07957p7625j35231k42441j90047o6268j21231j76736Q9662
$$ 6569288 6413422 6205465 6127840 5992609 5750168 5560121 5493853 5372622 5195886 5285548
12542E285548k47248j64490m0894q7303l9245k54618j86265j63001j45794j98584
$$ 5285548 5038300 4873810 4832916 4745613 4706368 4451750 4265485 4102484 3956690 3758106
12532C758106k04603n5308l9800n7477r3230L1337M3288j7433j5660k19813K670
$$ 3758106 3553503 3498195 3458395 3400918 3307688 3339025 3382313 3364880 3349220 3129407 3132077
12521C132077p9984l21682j89579q4199J05823R1336j84794j53622j19042m2697
$$ 3132077 3052093 2730411 2540832 2456633 2562456 2653792 2468998 2315376 2196334 2153637
12511B153637M0756O436j29319j19857q6835N2595J53261l4271k34332k52214
$$ 2153637 2194393 2200829 2071510 1951653 1864818 1917413 2070674 2036403 1802071 1549857
12501A549857q3938K5116N7951N6948J0056n3117K8697r3606k4013j12070j58181
$$ 1549857 1465919 1491035 1548986 1605934 1615990 1562873 1591570 1497964 1473951 1361881 1203700
12490A203700p5972P4363j39175O2764J02380K06246l4589q4558k27349l35606
$$ 1203700 1127728 1202091 1062916 1125680 1228060 1434306 1399717 1315159 1087810 752204
12480G52204p5303N5015L3491m850P2272O048p2173m0623Q8136K9665q5343j08025
$$ 752204 676901 731916 765407 760557 832829 838877 766704 726081 814217 843882 758539 650514
12468F50514J18810M3746P8875J57698P6951j93053k3924K19220r1337k66456
$$ 650514 769324 813070 891945 1049643 1126594 933541 909617 1128837 1037500 771044
12458G71044j39406N9768J02908J14858l958j9915k4474k5585m0512j06277L923
$$ 771044 631638 691406 794314 909172 905214 885299 860825 835240 794728 688451 692374
12447F92374m6359j1102P991J10931o0061R4287J38639k54601k31943o3666k1770
$$ 692374 646015 634913 642904 753835 693774 788061 926700 672099 440156 376490 354720
12436C54720J10202L28737K34583j66827j83564J3759k5671K7755m7099J54226
$$ 354720 464922 793659 1028242 861415 677851 691610 665939 693694 646595 800821
12426H00821m084o2325m6787K1389k8004J36598P6483P097j25397k85662j50758
$$ 800821 796737 734412 687625 709014 681010 817608 894091 901188 775791 490129 339371
12415C39371J78239J96401o9161p2838N5392K5868o7635J49612M8789j04189l1013
$$ 339371 517610 714011 644850 572012 627404 653272 585637 735249 784038 679849 648836
12404F48836K03816J40869j58477j91740l6353J15856k4222n5059J7048j07893
$$ 648836 852652 993521 835044 643304 606951 722807 698585 643526 660574 552681
12394E52681j94355K4559O5225k0770R9728J26645L8603J18036K5517j43495m8613
$$ 552681 358326 382885 448110 427340 527068 653713 692316 810352 835869 692374 643761
12383F43761J1947p2676P1193J21419R3318q1224P3922j6015k9743J59746P6816
$$ 643761 655708 583032 654225 775644 868962 787738 861660 845645 815902 975648 1052464
12372A052464J1692r2844j02559J5418N6853J87446P5425m813j2766N9941l9490
$$ 1052464 1064156 971312 868753 884171 941024 1128470 1203895 1199082 1186316 1246257 1206767
12361A206767j2482Q2261j46048j74202n6479J09115K38956L6858o2932j52620
$$ 1206767 1194285 1276546 1130498 956296 899817 1008932 1247888 1284746 1221814 1069194
12351A069194l0224R7942K8276R7988J57385k014J97373J77649K1920O5553m7992
$$ 1069194 1038970 1136912 1165188 1263176 1420561 1418547 1615920 1793569 1815489 1881042 1833050
12340A833050L39557K13456n8488J13362K0447n7594j33406O2527J54713J98772
$$ 1833050 2172607 2386063 2327575 2440937 2461384 2403790 2270384 2332911 2487624 2686396
12330B686396J67083R5976O0539J56025J24288q3900k6141j35939k43401q1980
$$ 2686396 2853479 2949455 3009994 3166019 3290307 3206407 3180266 3044327 2800926 2718946
12320B718946l26931k20844J32137N5182m6737n6485J42234K9517j62114k18192
$$ 2718946 2392015 2171171 2303308 2358490 2311753 2255268 2397502 2427019 2264905 2046713
12310B046713k9047L14538j0591J9525J07175Q4327N0203L1425J95796J40736
$$ 2046713 2017666 2332204 2321613 2341138 2448313 2532640 2582843 2614268 2810064 2950800
12300B950800O3887K57087J57988J1016L45320K72013L87466N11726N38298M28693
$$ 2950800 3014687 3271774 3429762 3440778 3786098 4058111 4445577 4957303 5495601 5924294
12290E924294P37571P10494P61179R18617J173968J590117K057929K904570L786524
$$ 5924294 6661865 7372359 8133538 9052155 10226123 11816240 13874169 16778739 20565263
12281B0565263N037022O662763Q850364J0645617J1732638J1692142R915083O297691
$$ 20565263 25602285 32265048 41115412 51761029 63493667 75185809 85100892 91398583
12273I1398583J428506l928003q432360j0965634j1408091j0082488q011271n708941
$$ 91398583 92827089 88899086 80466726 69501092 58093001 48010513 39999242 34290301
12265C4290301m052577k900576j776835j092071p24400n56432j87554M8173L01468
$$ 34290301 30237724 27337148 25560313 24468242 23743842 23187410 22999856 23048029 23349497
12256B3349497R46497J872808K917988L717945M492462N545035O017867O155413
$$ 23349497 24295994 26168802 29086790 32804735 37297197 42842232 48860099 55015512
12248E5015512N738826M919729M252562L309450L179396L310929L143270L521720
$$ 55015512 60754338 65674067 69926629 73236079 76415475 79726404 82869674 86391394
12240H6391394M027513M816705N140852M741357L695821K306275J033723p08942
$$ 86391394 90418907 95235612 100376464 105117821 108813642 111119917 112153640 111444698
12232A11444698k150426l824530o209751q008142q382598p681548p449814p248397
$$ 111444698 109294272 105469742 99259991 91251849 82869251 75187703 67737889 60489492
12224F0489492o717130n747291m470687l587838k674296j989256j186485n96330
$$ 60489492 53772362 48025071 43554384 39966546 37292250 35302994 34116509 33520179
12216C3520179l42858l8285L60211O48711J255981K099854L150449M688605O581530
$$ 33520179 33177321 33139036 33499247 34147958 35403939 37503793 40654242 45342847 51924377
12207E1924377Q913146J1875389J4532878J6911545J8105665J7056846J3852444
$$ 51924377 60837523 72712912 87245790 104157335 122263000 139319846 153172290
12200A53172290Q497592J430330n404238j1692537j6211272j7871211j7224453
$$ 153172290 161669882 163100212 157695974 146003437 129792165 111920954 94696501
12193I4696501j5285162j2631548r463599p048594n029338l791192k773036k212308
$$ 94696501 79411339 66779791 57316192 50267598 45238260 41447068 38674032 36461724
12185C6461724j873351j325142j016121n67496j29463M73298R22299J408112K297742
$$ 36461724 34588373 33263231 32247110 31679614 31550151 32023449 32945748 34353860 36651602
12176C6651602K908497L457419L841541L958880L634029L425437L051565L190598
$$ 36651602 39560099 43017518 46859059 50817939 54451968 57877405 60928970 64119568
12168F4119568L322123L696873M346643N340608N633934N076146M022831K805639
$$ 64119568 67441691 71138564 75485207 80825815 86459749 91535895 95558726 98364365
12160I8364365Q64444j837890m154668n545534o531608p533367p715709o732484
$$ 98364365 99228809 97390919 93236251 87690717 81159109 73625742 65910033 59177549
12152E9177549o153521n579197m818452l897197l076832k391393k040737j734674
$$ 59177549 53024028 47444831 42626379 38729182 35652350 33260957 31220220 29485546
12144B9485546j213162q57376o24782m76647l05174k90450P754K94358M37675
$$ 29485546 28272384 27415008 26790226 26313579 26008405 25717955 25725709 26020067 26457742
12135B6457742J078432J796534K832461M259545N719521P131231Q301221Q543190
$$ 26457742 27536174 29332708 32165169 36424714 42144235 49275466 57576687 66119877
12127F6119877P304829M861771J427225k758429o196552q354967q892480q111577
$$ 66119877 73424706 78286477 79713702 76955273 70758721 62403754 53511274 45399697
12119D5399697p065994n692085m427978l430533k573383k181606j623234j232071
$$ 45399697 38333703 32641618 28213640 24783107 22209724 20028118 18404884 17172813
12111A7172813q69956j021582q65660o97897l36459o05036p01307m70048m36997
$$ 17172813 16302857 15281275 14415615 13717718 13381259 12776223 12074916 11604868 11167871
12102A1167871l38409m45703n31202l92825m04851l35949l02792k63722k68649
$$ 11167871 10829462 10383759 9852557 9459732 9054881 8718932 8416140 8152418 7883769
12093G883769k95203k50149m7470n7157l68535j80762k08267k56394j68482J1050
$$ 7883769 7588566 7338417 7290947 7233790 6865255 6684493 6476226 6219832 6051350 6062400
12083F062400o3820j95640j99033l2616j33350O5987J81936l1396M8682k9415
$$ 6062400 5998580 5802940 5603907 5571291 5437941 5503928 5685864 5654468 5703150 5673735
12073E673735O8683N9626l38124j70828L3515j55446j13017j00756l41679k15875
$$ 5673735 5742418 5802044 5463920 5293092 5326607 5171161 5058144 4957388 4615709 4399834
12063D399834k01882l55975j81942r6736j65168j16014k73321j24643l07500j05223
$$ 4399834 4197952 3841977 3660035 3563299 3398131 3282117 3008796 2884153 2576653 2471430
12053B471430J2505l6111m5131J0536p6280l0771j6566J12976r829j01337J4613
$$ 2471430 2483935 2447824 2402693 2413229 2336949 2306178 2289612 2402588 2392759 2291422 2306035
12042B306035q6612j83511n5683J6374k29316k01822j09668j61676J08991j53
$$ 2306035 2219423 2035912 1980229 1996603 1767287 1565465 1455797 1294121 1403112 1402959
12032A402959K3680m8464j75669M6672k06565p5883L06909M6230q2441k39917
$$ 1402959 1426639 1378175 1202506 1249178 1042613 966730 1273639 1319869 1237428 997511
12022I97511l928P1083j22140j09970L4137N3575O5889n5365j61004j38289K5140
$$ 997511 993583 1064666 942526 832556 866693 920268 986157 930792 769788 631499 656639
12011F56639J03064J1104M6311n2860J36457J02399j15461j03681k29470j74371
$$ 656639 759703 770807 817118 764258 900715 1003114 887653 783972 554502 380131
12001C80131r3448J69149Q3422p9127m9615Q6430k3540R4728m1502O7597R3601
$$ 380131 286683 455832 539254 460127 410512 496942 473402 568130 526628 594225 687826
11990F87826k75033k27291n0478O9267M5772k1381J32435J35294K09834J28768
$$ 687826 412793 185502 135024 204291 250063 228682 361117 496411 706245 835013
11980H35013K18155j11084k04458j2288K9440o4156p5794j13945j50308l9463
$$ 835013 1053168 942084 737626 725338 754778 690622 614828 500883 350575 311112
11970C11112q7139R0600l0192K8606j11987l1592k6577l1452p3554n3475Q3011
$$ 311112 223973 314573 284381 312987 201000 169408 142831 111379 37825 -15650 67361
11959F7361J07715R3961R1503R8839j32972P6033O3024L6497j02699q9867J63469
$$ 67361 175076 269037 360540 459379 326407 402440 465464 501961 399262 309395 472864
11948D72864j25353j55907L5857M3047R287j67222j8105J65446J08545r63O425
$$ 472864 347511 191604 227461 270508 279795 112573 94468 259914 368459 367496 373921
11937C73921j08620l4633j02568M6982K788o7940L9217j9483j57937L3457J0912
$$ 373921 265301 230668 128100 175082 177870 109930 149147 129664 -28273 5184 16096
11926A6096J7832L6278N7811O5065O059J34003j46895r4925p0437l6065l7524
$$ 16096 33928 70206 128017 193082 199141 333144 186249 91324 20887 -15178 -52702
11915e2702K37222M8769k23781O0762J78862r0301M2593J05380j62186o224J64804
$$ -52702 184520 233289 9508 70270 249132 158831 201424 306804 144618 138394 303198
11904C03198m3086k77118j1464k7642J54176j1276r9626M9561n5312k0142R0185
$$ 303198 260112 -17006 -28470 -56112 98064 86788 -12838 36723 -18589 -38731 51454
11893E1454O1531N9908L7016Q5698R2075j01247o6075l1760j07102n8830M924
$$ 51454 112985 172893 209909 295607 387682 286435 220360 188600 81498 22668 27592
11882B7592r7093L0310M5714n4730k4643j6954J68777J2201j24003J11479M1786
$$ 27592 -69501 -39191 6523 -48207 -72850 -89804 78973 91174 -32829 78650 120436
11871A20436l9718j26046k61741q0854J77439j1857L0588R1981Q6762Q9145n0210
$$ 120436 80718 -45328 -307069 -387923 -210484 -222341 -191753 -99772 -13010 76135 25925
11860B5925j1334r573J14359M4973K0329J784n4489j34938o6932J4980n9561J14221
$$ 25925 14591 5018 119377 164350 184679 186463 131974 -2964 -69896 -54916 -114477 -256
11848b56M6669p2064j01990k4405j2839J76986J22539K38250p5711j12943R783
$$ -256 46413 -25651 -127641 -152046 -164885 12101 134640 372890 297179 184236 194019
11837A94019L6611k27402J61133O0966p3761J2428o2797r7908j58142K49059J77080
$$ 194019 230630 3228 164361 225327 151566 163994 101197 3289 -154853 94206 271286
11826B71286m9012J33863Q4102K06458J93822r2372j42090q9341r3249m6364q9559
$$ 271286 222274 356137 440239 646697 840519 748147 606057 516716 423467 377103 287544
11815B87544J27596r3490j81350k9484r159R4050K10947l4051j02745l36621j05141
$$ 287544 415140 321650 140300 110816 101657 195707 406654 372603 269858 -66763 -171904
11804a71904K21459J74100P1328j59091j42154M3686P6384q989M9700O5716K8504
$$ -171904 49555 223655 294983 135892 -6262 37424 113808 104819 154519 220235 248739
11793B48739J65355J32096k9958J4983r0485R908l201j3874J02660l9335r5788
$$ 248739 414094 546190 516232 531215 440730 450638 447437 433563 536223 496888 401100
11782D01100m1350R5896q5042l3305k6564J34542J29362Q291j6921n1131j46477
$$ 401100 359750 455646 370604 337299 310735 445277 574639 582930 566009 514878 368401
11771C68401N7198k1693k7522o8940r852k30245r2417p7154o0717J33527M5734
$$ 368401 425599 403906 376384 307444 297592 67347 -25070 -102224 -162941 -29414 16320
11760A6320k9640L8250O8901L0635o1569J49749R4355O0391Q0010Q6168k0645
$$ 16320 -13320 24930 93831 124466 62897 212646 307001 367392 447402 533570 512925
11749E12925K7204J33499K86356J90418j04304j48369N322m4046k42087l50439
$$ 512925 540129 673628 959984 1150402 1046098 897729 903051 859005 616918 266479
11739B66479j17005o0775n0360O7835R2498o3811J19182m0729k87028j43858n073
$$ 266479 149474 88699 38339 106174 198672 134861 254043 213314 -73714 -217572 -222645
11728b22645J80176J95J58323l451q0828k0568p6944K13378J94711j2385k32837
$$ -222645 -42469 -42274 116049 112598 31770 11202 -65742 147636 342347 329962 97125
11717I7125n5017L3574J01464P2419J34733m5284M5933p0414N9611J07292O8070
$$ 97125 42108 75682 177146 249565 384298 339014 384947 314533 374144 481436 549506
11706E49506j79067N1784N1285o2885K0838j96661p174J67671m449j49936j23819
$$ 549506 370439 422223 473508 410623 431461 234800 227626 395297 390848 240912 117093
11695A17093K0249q8813k13094L3766J44615J39205O251k62751j86590J19803
$$ 117093 137342 48529 -164565 -130799 13816 153021 159272 -103479 -290069 -170266
11685a70266k1152R0408L23265N55j12503R3885j58044m6682K211J44744J79513
$$ -170266 -191418 -101010 222255 222810 110307 204192 46148 -534 1677 146421 325934
11674C25934J00380J0469j78627k98J04356J11393k55300r5521Q588k14103Q9366
$$ 325934 426314 436783 258156 257858 362214 473607 218307 122786 131374 -82729 6637
11663F637O7909N9881n0066q9947R9299R7961q5188p6550j8474j0553j90314O6231
$$ 6637 74546 134427 84361 -5586 93713 191674 106486 29936 11462 909 -189405 -123174
11651a23174J69863p975j02236k461N2002J09545K3431k47695j06309k5624m0616
$$ -123174 46689 38714 -63522 -65983 -13981 95564 118995 -128700 -235009 -260633 -301249
11640c01249n9378P1690p034J44958L71432J01682j29207j93312j18403K5070
$$ -301249 -360627 -288937 -295971 -151013 220419 322101 192894 -418 -118821 -93751
11630i3751k8830Q9970n5636Q9599P4011L4940p8456n9825r647m1916O4255L2555
$$ -93751 -122581 -32611 -88247 1352 75363 110303 31847 -27978 -37625 -79541 -15286 17269
11618A7269J44928K18891n708k03693k62960j61205n1484J74369J42850j38187
$$ 17269 162197 381088 375380 171687 -91273 -252478 -303962 -129593 13257 -124930
11608a24930j04966J98670J7261J9534o8760r9051j00521J20629R482P5088J2796
$$ -124930 -229896 -31226 -13965 5569 -63191 -162242 -262763 -142134 -132652 -57564 -44768
11597d4768R9370J36842r3594q1483l2678r7143j640m7426L3929N5891P2423O0664
$$ -44768 54602 191444 97850 16367 -16311 -113454 -115094 -162520 -128591 -72700 -277 60387
11585F0387k8693j00608K1058j41524J05553J43435j61110N4333L4611l9399P2485
$$ 60387 31694 -68914 -47856 -189380 -83827 59608 -101502 -47169 -12558 -51957 20528
11574B0528N5122L9479j00215p4425j05114k6893k6617M002j8747J74068L1420
$$ 20528 75650 115129 14914 -59511 -164625 -191518 -218135 -214133 -232880 -58812 -27392
11563b7392k7290m3609j31161r7423L7507N0615o9160J36461Q2359O2655Q4125
$$ -27392 -54682 -98291 -229452 -326875 -289368 -238753 -307913 -171452 -89093 -26438 57687
11552E7687q2681m8654p6303L4616l1042j05874J10968r1320j23212J84260J00001
$$ 57687 -24994 -73648 -149951 -115335 -146377 -252251 -141283 -232603 -355815 -171555 -71554
11541g1554o1037N3814k2462j04719m3612l7208J45495m8119q7143J25524K14313
$$ -71554 -132591 -78777 -101239 -205958 -249570 -286778 -141283 -189402 -276545 -151021 63292
11530F3292J16874Q915j22983j05735q6537q1687L6077m2709k53875N9136R0084
$$ 63292 180166 189081 66098 -39637 -126174 -207861 -171784 -214493 -468368 -409232 -319148
11519c19148R564J04670J95973J94411l0312j32403j02393J29176J87215j21304
$$ -319148 -309584 -204914 -8941 185470 155158 22755 -79638 49538 236753 115449
11509A15449l7400K0382K8780J616r2060r0404J08417l5801M3648o9385j61705
$$ 115449 78049 98431 127211 128827 36767 -53637 54780 18979 62627 -6758 -168463
11498a68463n4638J14742l7708O7519O7872o1545K1010j83314J14103N9223J26214
$$ -168463 -223101 -108359 -146067 -78548 -10676 -72221 -51211 -234525 -120422 -61199 65015
11487F5015M8041n0130J3509J4401o0367J12748o4999j11083r0311j74755j28134
$$ 65015 113056 62926 76435 90836 30469 143217 78218 -32865 -123176 -297931 -426065
11476d26065K4929J52724L6446J18458M7160j13720M4656J12066K4375m7932J0472
$$ -426065 -401136 -248412 -211966 -93508 -46348 -160068 -115412 -3346 21029 -26903 -16431
11465a6431R3536N9998q6059L6706j10995j29961J84070R311j01831J14012N6813
$$ -16431 77105 137103 51044 87750 -23245 -153206 30864 40175 -61656 52356 109169
11454A09169m3772j67293j05998J168R7091N4104L4150J7620j18821j67834K2209
$$ 109169 65397 -101896 -207894 -206726 -109635 -55531 -21381 -3761 -122582 -290416 -268207
11443b68207J19965j36917o4028L6404J71375M1975O5895m948J873l67937Q5401
$$ -268207 -148242 -285159 -349187 -312783 -141408 -99433 -33538 -38486 -36613 -404550 -319149
11432c19149J41657J56480J62527j05697l23384p9268J21658J77644K2740p1915
$$ -319149 -177492 -21012 141515 35818 -287566 -366834 -245176 -67532 -44792 -116707
11422a16707J13095n6674J4362J16951q2987k01660o1232J42626J5385j9633k1541
$$ -116707 -3612 -60286 -45924 71027 -11960 -213620 -274852 -132226 -116841 -136474 -158015
11411a58015J1385N5085j17549q6179Q7383q294J37372R3071M9893N5958j31018
$$ -158015 -146630 -91545 -209094 -295273 -207890 -216184 -78812 14259 64152 120110 -10908
11400a0908k34735K16222J59627M5267J37995P5420j99095j08035p3902q9667
$$ -10908 -245643 -29421 130206 175473 313468 388888 189793 81758 7856 -81811
11390h1811J70237M7677q6746k0408j25726Q9184J43299P6506j17956j40913n9236
$$ -81811 88426 136103 49357 28949 -96777 -7593 135706 212212 94256 -46657 -105893
11379a05893j18339Q0182K07746o5427o5047l8457Q9178R3755N9233M3572P3762
$$ -105893 -224232 -144050 63696 -1731 -66778 -105235 -16057 77698 136931 180503 254265
11368B54265l1319j73193K4425O1008j3684j51621p0979J2019M1882K1745M62
$$ 254265 222946 49753 74178 135186 121502 -30119 -101098 -89079 -47197 -25452 -24990
11357b4990r5852o0267j77786L827J48344L7063q0141j77647Q5889K07633J46365
$$ -24990 -120842 -181109 -358895 -355068 -206724 -169661 -249802 -427449 -341560 -133927 12438
11346A2438j54085j10239J02053o6637L5455J3090J13075J05522P7517J7787L9739
$$ 12438 -141647 -251886 -149833 -216470 -181015 -167925 -54850 50672 128189 145976 185715
11335A85715p3070q0010k0008Q7208M3991q3966j49851J1053J31658O6471m3932
$$ 185715 112645 32635 12627 99835 143826 59860 -89991 -78938 52720 119191 75259
11324G5259j95218o735J06947J17868M0711J8337J33802M4583j27925k02305j63678
$$ 75259 -119959 -126694 -19747 98121 138832 157169 290971 335554 207629 5324 -158354
11313a58354m1565l1910M5428j1914j15731J27745N6584j70308j19279J19257
$$ -158354 -199919 -231829 -186401 -198315 -314046 -186301 -129717 -300025 -419304 -300047
11303c00047O1991m8320l5556J16624K01653j11922j56635M830Q9700J57408J02835
$$ -300047 -238056 -286376 -321932 -205308 -3655 -115577 -272212 -267382 -177682 -20274 82561
11292H2561l4070l9779p8759k0237L8300O7456o7446j6925J6989P0848J16300
$$ 82561 48491 8712 -70047 -90284 -51984 15472 -51974 -68899 -51910 18938 135238
11281A35238m0854j37963k6596K23489j07423J5505L833j80717k3203N2202j23601
$$ 135238 94384 -43579 -70175 153314 45891 61396 65229 -115488 -138691 -86489 -210090
11270b10090m7843j04033J52409K09485J35068K2233j21158l7997J0624j58006
$$ -210090 -257933 -361966 -209557 -72 134996 157229 36071 -1926 8698 -149308
11260a49308l9779J8708p0783L8467Q3593J1186J16004R7325J09430J9370M549
$$ -149308 -189087 -170379 -241162 -202695 -119102 -107916 8088 105413 214843 234213 238762
11249B38762o5297j35579j47802L6191J16037J10768J409o0216L5070j36638N3392
$$ 238762 173465 37886 -109916 -73725 42312 153080 154489 94273 129343 -7295 46097
11238D6097l069j21379j40608J6335m7641J44593J94403p3179k14916n7256j1368
$$ 46097 43028 -78351 -218959 -202624 -250265 -105672 88731 15552 -199364 -256620 -267988
11227b67988J31098J14802k0208k1385k080p3004m6915P8906Q9413p777k02254
$$ -267988 -136890 -22088 -42296 -63681 -65761 -138765 -185680 -106774 -17361 -25138 -227392
11216b27392k0747Q341K04935K58497J7015q1048j10446j0638n5328j63524q8537
$$ -227392 -248139 -239798 -34863 223634 240649 159601 49155 38517 -16811 -180335 -268872
11205b68872K949j31481J96054O9005J29579P7916N9331Q0446K8550p2599j58135
$$ -268872 -265923 -397404 -201350 -132345 -2766 75150 134481 214927 243477 170878 12743
11194A2743K5931N025R038j92487j01993j2801M9772o6177l2150R83J3569P8420
$$ 12743 38674 43699 52737 -139750 -241743 -254544 -204772 -270949 -303099 -302116 -288547 -210127
11182b10127o5611l660J64064J32111O0833J15963J34425j23757k26658j07220
$$ -210127 -275738 -279398 -115334 16777 77610 193573 327998 204241 -22417 -129637
11172a29637L5103r4856Q3145K60243j02389j09035M9064M8557n0314K5976m6456
$$ -129637 -94534 -189390 -106245 153998 51609 -57426 -8362 40195 -10119 15857 -30599
11161c0599j53246Q0170P7270q3427N7868M3144m854m6966k1261j11964J0372
$$ -30599 -183845 -103675 -26405 -109832 -51964 -8820 -13674 -60640 -81901 -193865 -183493
11150a83493J1223l1283n7803n4409k7659n5538J07486J61791Q9694P621l3996
$$ -183493 -172270 -203553 -261356 -315765 -343424 -398962 -291476 -129685 -39991 -32370 -66366
11139f6366k26748L4258L05426M1241n4121n7782N8812j8208j4687J7799J50594
$$ -66366 -293114 -258856 46570 87811 33690 -24092 34720 16512 1825 19624 170218
11128A70218j51920p4197j6524n5924m5119q902q2491j24058J39665J10879O8113
$$ 170218 18298 -55899 -72423 -128347 -173466 -182368 -264859 -388917 -249252 -138373 -70260
11117g0260n032n5604j7340q5800k1534k5402j13433L8005J35620n7507J43382
$$ -70260 -75292 -130896 -148236 -234036 -255570 -280972 -394405 -356400 -220780 -278287 -134905
11106a34905K34058Q0330r1613p5052k20721K1917Q1576J06321K3067p3454R2942
$$ -134905 99153 179483 87870 12818 -207903 -185986 -104410 1911 24978 -48476 44466
11095D4466K4765l6681M6649n4772j10502J36211M8555p7010l7763j32028j21299
$$ 44466 69231 32550 79199 24427 -86075 50136 98691 21681 -16082 -148110 -269409
11084b69409j44017R6003K28307K64116o7121j93678j30142n642J41364j28929
$$ -269409 -413426 -317423 -89116 175000 107879 -85799 -215941 -221583 -80219 -209148
11074b09148k34926M3956L03502J79491O0457J53424R5046o5981j88729j86175
$$ -209148 -444074 -400118 -96616 82875 143332 296756 391802 325821 137092 -49083
11064d9083j33088p8502m0926q7296J53164N8560r0408N6897O3315O4082R6883
$$ -49083 -182171 -260673 -301599 -388895 -235731 -177171 -267579 -210682 -147367 -83285 13598
11053A3598r4272p0382j7141R1517R1949J27238j38144n3335p3046J72672J28842
$$ 13598 -80674 -151056 -168197 -76680 15269 142507 4363 -48972 -122018 50654 179496
11042A79496j05995j15341j49109Q5187M2528J19108j8541j30389l4171K41052
$$ 179496 73501 -41840 -190949 -105762 -63234 55874 37333 -93056 -127227 113825
11032A13825L13338j25762j72799j19565J06494m192k58553m2741N4827L1300
$$ 113825 427163 301401 128602 9037 115531 111339 -147214 -189955 -135128 -103828
11022a03828Q6325M1527j0747p8734j74837R3262L1495k1040N6259J2742J56256
$$ -103828 -17503 24024 13277 -65457 -240294 -147032 -115537 -136577 -80318 -67576 88680
11011H8680j22430K821j51817J53570L1813J5775j7873L0020K1916j62889m4275
$$ 88680 -33750 -30929 -182746 -29176 2637 18412 539 30559 52475 -110414 -154689
11000a54689O7177J3029q4337k9372j6691K8883M3813N3927j0870j06766O6771
$$ -154689 -87512 -74483 -158820 -188192 -204883 -176000 -132187 -78260 -89130 -195896 -129125
10989a29125P5344r9671r0953l5020J18380k5634l0500O59n8275k4531J28215
$$ -129125 -53781 -153452 -244405 -279425 -161045 -186679 -217179 -216520 -274795 -299326 -171111
10978a71111L1542L7763q9247m9285l3021O6115J39407N9669K4671l9157k06403
$$ -171111 -139569 -101806 -191053 -240338 -273359 -207244 -67837 -8168 16503 -22654 -229057
10967b29057k8620J97284N4734P3251k1905L2781m7295j25261j05164j18652J90964
$$ -229057 -257677 -60393 -5659 67592 45687 78468 31173 -94088 -199252 -317904 -126940
10956a26940L20087p3212j28174o7527k8646O6988j6278L1174P1745J36791o9738
$$ -126940 193147 119935 -8239 -75766 -104412 -37424 -53702 -22528 49217 186008 116270
10945A16270J25851J63283l9964P512J9938j48786j00345j10608K065j0881l8098
$$ 116270 242121 405404 365440 372952 392890 244104 143759 33151 35216 24335 -13763
10934a3763k5906J93642K06531k26497k28836j7520l4901P2142o6168j25071P1596
$$ -13763 -39669 153973 360504 134007 -94829 -112349 -147250 -75108 -141276 -266347 -194751
10923a94751P7079J25578K1997K7180K836M3673J9486j69302r2720o1920J25811
$$ -194751 -117672 7906 29903 57083 59919 103592 123078 -46224 -138944 -200864 -75053
10912g5053J71329k1584m0145p5267j24910q5977Q0208J62579k191p110K8220
$$ -75053 96276 74692 34547 -40720 -165630 -251607 -171399 -8820 -11011 -18121 10099
10901A0099o7865j10146m6474q6112Q3351P7909J03770J81578O8294j16251J36373
$$ 10099 -57766 -167912 -214386 -300498 -217147 -139238 -35468 146110 214404 98153 234526
10890B34526l5151l2521j18527r0584p3290l5462J73239Q8844m3634j2543q3557
$$ 234526 199375 166854 48327 -42257 -115547 -151009 22230 111074 67440 54897 -28660
10879b8660n56l1621p3640J09019K3686n1980j7626M9381P620j07985M2889Q5115
$$ -28660 -29216 -60837 -134477 -25458 -1772 -53752 -71378 -21997 -14377 -122362 -79473 5642
10867E642j4509k54550l2136K83293Q3709m979n0033J7857O5325m6760l0256k3222
$$ 5642 -8867 -263417 -295553 -12260 71449 66470 16437 34294 99619 52859 22603 -619
10855f19P0697M0063o5037K6747N942q5264n807R6022K10488n9171j54217j69626
$$ -619 70078 110141 45104 71851 77793 -7471 -13278 82744 293232 234061 79844 -89782
10843h9782K5141P3007O9686J01391k1398J5087j53636L0494L7449O9225L0623
$$ -89782 -64641 8366 78052 179443 158045 173132 19496 49990 87439 156664 187287
10832A87287l9167l2493k7120Q4695j02401q3742j24213L1280J14561O407n0820
$$ 187287 148120 115627 88507 173202 70801 -12941 -137154 -105874 8687 15094 -35726
10821c5726Q8867m768J28005o5675j03923Q846J03588q7681k0825J00059l0973
$$ -35726 53141 48373 176378 110703 6780 15626 119214 31533 10708 110767 79794
10810G9794j01891j19929k28461l0481R3944J16191L3862J47501P4830j21610
$$ 79794 -22097 -142026 -370487 -400968 -307024 -190833 -156971 -9470 65360 -56250
10800e6250n3193O4315L8215J76459k9475n5027l4668N3264R2044m3391k6969
$$ -56250 -109443 -45128 -6913 169546 140071 85044 50376 103640 195684 152293 125324
10789A25324O5367O971R3902m5292k68285l15299J81647J10434k7005r8765J52243
$$ 125324 190691 197662 291564 246272 -22013 -337312 -155665 -45231 -72236 -171001 -18758
10778a8758R6749R4951M3203P9378M2765J5950j04649M6183L6731j28408j40279
$$ -18758 77991 172942 216145 295523 338288 354238 249589 295772 332503 204095 63816
10767F3816M0172q8512j08416J91167R6945J7832j85482m4676J06458l4097n4915
$$ 63816 103988 15476 -92940 98227 195172 213004 27522 -17154 89304 55207 292
10756B92M8123Q0167J85618J88134j03832j67656L7414P737O4060k0411j04204
$$ 292 48415 128582 314200 502334 398502 230846 268260 275997 340057 319646 215442
10745B15442O5942J4090j36788m4748N3555p3898j51448p065J7544p7077k2171
$$ 215442 281384 295474 158686 113938 167493 93595 -57853 -64918 -47374 -124451 -146622
10734a46622Q8856K00800l6841Q4419Q4500r1489p6956j6165J25835L2254J44201
$$ -146622 -57766 143034 106193 190612 275112 183623 106667 90502 216337 248591 392792
10723C92792j57700r4219J94902R9685j54639r9387L1178J05412o4850r5920L10
$$ 392792 235092 140873 335775 435460 280821 181434 212612 318024 253174 157254 157564
10712A57564P8974k8819J30254m0369j08728J00052k0407M8735j19409k06143
$$ 157564 236538 207719 337973 297604 188876 288928 268521 317256 197847 -8296
10702h296P9599P5743J992l8299j78343r7171N2949J33428J52172k832o1559m4171
$$ -8296 71303 147046 149038 110739 -67604 -164775 -111826 21602 173774 170942 109383 65212
10690F5212j2161j29025J01781J10581J23996J3635P2819j6892j40692j49696
$$ 65212 53051 -75974 25807 136388 260384 274019 346838 329946 189254 39558
10680C9558m7170N3055J09345M6994J44160n9870j71324L9603O8900L5551J47966
$$ 39558 -7612 45443 154788 201782 345942 286072 114748 154351 223251 258802 406768
10669D06768k4104j60904L253R3265M969J53215j75922k79858j92752r0963P7974
$$ 406768 382664 221760 225013 318278 323247 476462 300540 20682 -172070 -263033 -185059
10658a85059l105J0661J55711J14636l0496K1254R0669K8073k3545n9367j1101
$$ -185059 -188164 -177503 -21792 92844 62348 83602 174271 202344 178799 119432 108331
10647A08331q6173N847J14966J34844Q1811Q2396j74210r6256J67006j8470J0545
$$ 108331 22158 28005 142971 277815 359626 442022 267812 171556 338562 320092 330637
10636C30637j1339K7124j3988R1532J14438j70663k01424J3540J9699N7963j3239
$$ 330637 319298 346422 332434 423966 538404 367741 166317 179857 199556 257519 244280
10625B44280o9536P2914n2396j04687M9699n6667r7060J34840J2650M4843l2691
$$ 244280 174744 247658 195262 90575 140274 83607 -13453 121387 134037 178880 146189
10614A46189L7049j42966j00598J83742J16611k00191N0767m6527J8996P870N6811
$$ 146189 183238 40272 -60326 123416 240027 39836 90603 44076 63072 70942 127753
10603A27753q3099j24368k5106Q2020J36481P3309N7356N8933j26691k70722k37179
$$ 127753 44654 -79714 -104820 -22800 113681 186990 244346 303279 176588 -94134 -331313
10592c31313j46537K33909R036J36604J33137O1476j8075N3999M1330J00147j81935
$$ -331313 -477850 -243941 -234905 -98301 34836 96312 78237 132236 173566 273713 91778
10581I1778p5889M6638l529q0493k33382O736J06413j26017Q9116K4863J16840
$$ 91778 15889 62527 58998 -21495 -254877 -248141 -141728 -267745 -178629 -153766 -36926
10570c6926P7257J57105l6031j62748K01931J07286n1831p1400m2540Q366O3374
$$ -36926 40331 197436 161405 -1343 200588 307874 256043 184643 142103 150469 213843
10559B13843P1173K4706q7827k43200M8869p5716j28016J22122L35913O9901j97304
$$ 213843 285016 309722 221895 -21305 27564 -48152 -176168 -54046 281867 351768 154464
10548A54464J05201J52411m0704j21122j60074l3523m9539P0434p1500j76061
$$ 154464 259665 412076 371372 250250 90176 56653 7114 77548 6048 -170013
10538a70013J27946P0933Q4955L9391j5039K6052r7958k7246p9162q0919l6774
$$ -170013 -42067 28866 113821 153212 138173 164225 66267 39021 -40141 -121060 -157834
10527a57834p998O1913M8584L9554p4316p8466j12856R0664J44807m1583K9925
$$ -157834 -165832 -103919 -55335 -15781 -90097 -168563 -281419 -190755 -45948 -87531 -57606
10516e7606J35922M2323n9548r081N4979K37840L8772j48874j36382K24038n276
$$ -57606 78316 120639 61091 52010 106989 344829 383601 234727 98345 322383 317107
10505C17107j69844J09351L34242L0254r6135q9713O8139N974j33285m2475L7978
$$ 317107 147263 256614 590856 621110 524975 435262 503401 509375 376090 333615 371593
10494C71593L9973n5047r875n7711j20216J3105j5517J62439J63356J21278p83
$$ 371593 411566 356519 346644 288933 168717 181822 166305 328744 492100 613378 612595
10483F12595K17852O9762j00185p7833j40478K25392J91410L511J9948q3867p2076
$$ 612595 830447 900209 800024 722191 581713 807105 998515 1002026 1021974 938107 866031
10472H66031r6448j0645p5995j47125j00859o0544k4039j2924J25900O3587K2673
$$ 866031 769583 758938 682943 535818 434959 374415 350376 337452 463352 526939 549612
10461E49612r6860K02896J65869K10195K07541K45755J90389Q00J15871J01321
$$ 549612 452752 655648 821517 1031712 1239253 1485008 1675397 1676197 1792068 1893389
10451A893389r7725O6701K3056q0035k56571r3800j04181j35411l3599j20511
$$ 1893389 1795664 1862365 1885421 1805386 1548815 1455015 1350834 1215423 1181824 1061313
10441A061313k20987j98838k860m0282J68512Q9651m9215J03460M1973m2123K3535
$$ 1061313 840326 641488 638628 598346 766858 856509 807294 910754 952727 910604 934139
10430I34139J37619L07321J38816O3102J012P5092M1783r3797j09620R6561o1338
$$ 934139 1071758 1379079 1517895 1580997 1582009 1657101 1698884 1605087 1495467 1592028 1530690
10419A530690O314k1958j0753K22272o8075N4241j5905j09394k40645J7239j10032
$$ 1530690 1537004 1515046 1504293 1726565 1658490 1712731 1696826 1587432 1346787 1364026 1253994
10408A253994j34059m4741k9467k6962j15314l2288p8791j32127j78580R8974
$$ 1253994 1119935 1075194 1045727 1018765 903451 871163 792372 660245 481665 580639
10398E80639N0285J16591l8809j26722k30745j49461J11684J31111J40398K30320
$$ 580639 630924 747515 708706 581984 351239 201778 313462 444573 584971 815291
10388H15291L12720J14270j02312J53k500o0905j4611j890q2055k63793j04103
$$ 815291 1128011 1242281 1139969 1140122 1137622 1076717 1062106 1060216 978161 714368 610265
10377F10265J9830N2220J7193j68141o3394o283j6383R9705Q8525o6286j22041
$$ 610265 630095 682315 699508 531367 467973 461690 445307 545012 633537 567251 445210
10366D45210j14814L080J98858J46781P8123l5376p5996j3529M884j9383N8755
$$ 445210 330396 333476 532334 679115 757238 721862 645866 632337 637221 617838 676593
10355F76593K7213J1420P9767J48938n4547j61433O5757l3331J40984J81376M8574
$$ 676593 703806 715226 794993 943931 889384 727951 793708 760377 901361 1082737 1131311
10344A131311K25768J47488J60567J36847n0584r7894J9052K8720j08097j73903
$$ 1131311 1357079 1504567 1665134 1801981 1751397 1653503 1672555 1701275 1593178 1419275
10334A419275j81264L1359j58736j85376r1480J13668L0477k08082k22537l2243
$$ 1419275 1238011 1269370 1110634 925258 833778 947446 977923 769841 547304 515061
10324E15061m3443J66709J20952K1066j10727r8258R7258M0648p1672r704l6811
$$ 515061 471618 638327 759279 780345 669618 571360 668618 709266 637594 627890 591079
10313E91079K3253L8797J08534J07138j65032J19991J28436l959o4003K7228Q4184
$$ 591079 614332 653129 761663 868801 703769 823760 952196 948237 884234 911462 995646
10302I95646J56802J31253j33831K5822J30854L9480n6071k29201l26146j25519
$$ 995646 1152448 1283701 1149870 1175692 1306546 1346026 1289955 1060754 734608 609089
10292F09089J97474O603J12751J68436K11268L0059Q4772P1368L4540Q1717J73922
$$ 609089 806563 813166 925917 1094353 1305621 1335680 1420452 1491820 1526360 1608077 1781999
10281A781999J33627K2535L3430L74131J42865j21865j64165n9850M7567j46843
$$ 1781999 1915626 1938161 1971591 2345722 2488587 2366722 2202557 2142707 2190274 2043431
10271B043431j46077P096o5429k52093j12862J59619K24348J17123L7407J21834
$$ 2043431 1897354 1904450 1839021 1586928 1474066 1633685 1858033 1975156 2012563 2134397
10261B134397r280j26011j44789K1663p6546j4359L8454J2973P4155o584j59580
$$ 2134397 2125117 1999106 1854317 1875980 1799434 1785075 1823529 1836502 1910657 1904073 1744493
10250A744493j58157k12729k38555j23978K050J99907l8760l3086J48990M5083
$$ 1744493 1586336 1373607 1135052 1011074 1013124 1213031 1174271 1141185 1290175 1335258
10240A335258p7360n1943Q1681j6997j26776K14938K96474Q4263P9977J73472
$$ 1335258 1257898 1205955 1287636 1270639 1143863 1358801 1655275 1739538 1819515 1992987
10230A992987J36612J8693P3954K0935Q1186J28784J95401l4367o1581j14160
$$ 1992987 2129599 2148292 2222246 2243181 2324367 2453151 2648552 2614185 2552604 2438444
10220B438444N5734l5265j86631p4582j1779O5937J33220j56269k62121R3549
$$ 2438444 2494178 2458913 2272282 2197700 2185921 2251858 2385078 2228809 1966688 2060237
10210B060237j60085K9923N3063j99237k2379j87578N0275r3884j63154q9770
$$ 2060237 1900152 1930075 1983138 1783901 1761522 1573944 1624219 1530335 1367181 1277411
10200A277411J94296K97672L01124L85635K44182J31481J2868J5599N4897l1919
$$ 1277411 1471707 1769379 2070503 2456138 2700320 2831801 2844669 2860268 2915165 2883246
10190B883246j40943j16829J6400O1190O0434J72039J8331M2501L29756N96575
$$ 2883246 2742303 2625474 2641874 2703064 2763498 2935537 2953868 2996369 3326125 3922700
10180C922700O10658R54477J169907J081536J118522O60223L1873n10080q39389
$$ 3922700 4533358 5487835 6657742 7739278 8857800 9518023 9549896 9039816 8200427
10171H200427j007225r85901n23624k34249l05909j24115j66554j36209p7980
$$ 8200427 7193202 6207301 5683677 5449428 5143519 5019404 4852850 4716641 4638661
10162D638661k35976l73141j08940L09839L91864M29640L79668O19295Q06774
$$ 4638661 4402685 4029544 3920604 4230443 4622307 5051947 5431615 6050910 6857684
10153F857684R52856J158333J043561O20399M17326J65808l91518j061883j112478
$$ 6857684 7810540 8968873 10012434 10632833 11050159 11215967 10824449 9762566 8650088
10144H650088r59797o55274o47829k49469j60514j13258o8950J39520P9315J01552
$$ 8650088 7690291 7035017 6387188 6137719 5977205 5863947 5794997 5934517 6013832 6115384
10134F115384J16737J50908J46809K62703K42527O6373Q9765L4604j28039k49181
$$ 6115384 6232121 6383029 6529838 6792541 7035068 7101441 7191206 7225810 7097771 6848590
10124F848590k12135k91906j90475K235k1120p6075O3291j04283P9731P0801J55135
$$ 6848590 6636455 6344549 6154074 6156309 6135189 6059114 6122405 6018122 6097853 6168654 6323789
10113F323789J31475Q7294J04686L20554O17579O55988P89293Q35176Q59444P66375
$$ 6323789 6455264 6542558 6647244 6967798 7585377 8241365 9030658 9865834 10725278 11491653
10103A1491653Q63175Q91277Q81886R93930J070927J253805J803821K637824M008373
$$ 11491653 12354828 13246105 14127991 15121921 16192848 17446653 19250474 21888298 25896671
10094B5896671N694081P941272R907173J1122121J1168228R582082O510511J883306
$$ 25896671 31590752 39532024 49439197 60561318 71729546 81311628 87822139 89705445
10086H9705445l026243p056890r449675r318927o935476m213709j709984J189743
$$ 89705445 86679202 79622312 70172637 60853710 53918234 49704525 47994541 49184284
10078D9184284L868111N967917P666241Q590303Q901455Q211190O360916M043420
$$ 49184284 53052395 59020312 66686553 75276856 84178311 92389501 98750417 102793837
10070A02793837J965056n7391j107765o65982O62971K224963K944800K361789
$$ 102793837 104758893 104701502 103593737 102927755 103590726 105815689 108760489 111122278
10062A11122278N17545k284051m976173o688526p361477o629389n361901l649828
$$ 111122278 111639823 109355772 104379599 97691073 90329596 83700207 78338306 74688478
10054G4688478j079106J654730M635347Q155436J2036514J7352206K3915654L0754033
$$ 74688478 73609372 75264102 79899449 88054885 100091399 117443605 141359259 172113292
10046A72113292L6984897M0729636M1017647L6384922K7430173J3891040k239109
$$ 172113292 209098189 249827825 290845472 327230394 354660567 368551607 366312498
10039C66312498j5379334k2281073k6633789l0728106l1663273k9327722k5837331
$$ 366312498 350933164 328652091 302018302 271290196 239626923 210299201 184461870
10032A84461870k2431021j9078548j5260307j0956753p442702m567231k174326
$$ 184461870 162030849 142952301 127691994 116735241 109292539 104725308 102550982
10025A02550982J47234L000892O209820R845198J4125723J8684749K2907598K5509973
$$ 102550982 102698216 105699108 111908928 121754126 135879849 154564598 177472196 202982169
10017B02982169K6264838K4842804K0540177J3797928N661401j650356o385005
$$ 202982169 229247007 254089811 274629988 288427916 294089317 292438961 286053956
10010B86053956q305922q585501p222730m002210R70591N087037N668566K765312
$$ 286053956 277748034 269162533 261939803 257937593 258908184 263995221 269663787 272429099
10002B72429099j119194o071798j4121433k3800839k8689341k6613823k1903188
$$ 272429099 271309905 265238107 251116674 227315835 198626494 172012671 150109483
9995A50109483j7772899j4165806j1257005q803738o506246m381781k779230k166774
$$ 150109483 132336584 118170778 106913773 98110035 91603789 87222008 84442778 82276004
9987H2276004j487596o45620j08658N99513J437932K890980M929006P643347J0706005
$$ 82276004 80788408 80142788 80034130 80633643 82071575 84962555 89891561 97534908 108240913
9978A08240913J4010181J6579005J8271015J7936233J3667225O095006k929919
$$ 108240913 122251094 138830099 157101114 175037347 188704572 194799578 191869659
9971A91869659j2029375k0558005k5133654k2709540j7234592j2650031r174609
$$ 191869659 179840284 159282279 134148625 111439085 94204493 81554462 72379853
9964G2379853o895683n226772l991192l141946k391388j784695j210636p52475
$$ 72379853 65484170 60257398 56266206 53124260 50732872 48948177 47737541 46985066
9956D6985066o95089q22874j026048j478824j700804j952693k064274k253562
$$ 46985066 46289977 45467103 44441055 42962231 41261427 39308734 37244460 34990898
9948C4990898k090646j655198j602640j462727j230596j345365r34377p77343
$$ 34990898 32900252 31245054 29642414 28179687 26949091 25603726 24669349 23892006
9940B3892006q83172r53616p22958n61460o48562o25172m76263n77084n13733
$$ 23892006 23008834 22055218 21332260 20770800 20122238 19497066 19020803 18443719 17929986
9931A7929986l13593k10766j07643j25929q9516j26546j91663k06278l38976n10025
$$ 17929986 17616393 17405627 17297984 17172055 17082539 16955993 16764330 16558052 16219076 15709051
9921A5709051m38692k36632m53869n79636o15725o53370o90351o36614n32628
$$ 15709051 15270359 15033727 14579858 14000222 13384497 12731127 12040776 11404162 10871534
9912A0871534n74450l87438j74964j86318j70316j82252l41286l84219l43929
$$ 10871534 10297084 9909646 9734682 9548364 9378048 9195796 8854510 8470291 8126362
9903H126362j39504j02961l34048m07580l22908j01525j80908q7026l08393k57914
$$ 8126362 7986858 7883897 7549849 7142269 6819361 6717836 6536928 6449902 6141509 5883595
9893E883595k12840j41758q0723r9771q9378l52828j86437N3821R6097j29088
$$ 5883595 5670755 5528997 5448274 5348503 5259125 4906297 4719860 4773681 4869778 4740690
9883D740690j36419o2886l11699j57710k7381j80974n1251j18970j84288k99249
$$ 4740690 4604271 4541385 4229686 4071976 4044595 3863621 3812370 3693400 3509112 3209863
9873C209863n8122O627j09243q0914q9853n9706J03038J2393k34684l3051n6408
$$ 3209863 3151741 3158368 3049125 2968211 2878358 2818652 2921690 2934083 2699399 2666348 2609940
9862B609940l6589J57444o0122j31261P5773j69192k14580J29822o3208j72101
$$ 2609940 2573351 2730795 2670673 2539412 2615185 2445993 2231413 2361235 2298027 2125926
9852B125926R3258q6645j12900r4518J5211m8249k13018j28844k3437R4847L1079
$$ 2125926 2219184 2132539 2019639 1925121 1940332 1892083 1679065 1550221 1526784 1621631 1652710
9841A652710k7845M6616J04327j09817r0609j5116J17640Q760j05221j40686m5614
$$ 1652710 1624865 1671481 1775808 1665991 1575382 1560266 1677906 1686666 1581445 1440759 1395145
9830A395145K8189R9529j05131m9408J17405l634J97210L4382j24917Q533P9485
$$ 1395145 1423334 1522863 1417732 1368324 1485729 1482095 1679305 1713687 1588770 1597303 1676788
9819A676788K5185K7686j13787n4386j0766j96360k18381j51260l4711J18390
$$ 1676788 1701973 1729659 1615872 1561486 1550720 1354360 1135979 984719 950008 1068398
9809A068398n0515L8579J5747K8913J51035q7601o6719L6595l0579p1290P3403
$$ 1068398 1017883 1056462 1072209 1101122 1252157 1164556 1097837 1134432 1103853 1032563 1105966
9798A105966m4094L4852N1365m2369j02660O5289L077n073j7661p750N0290K31406
$$ 1105966 1061872 1096724 1148089 1105720 1003060 1068349 1071426 1066353 1048692 1040942 1091232 1322638
9786A322638P8904j22164q2640k4956O4696j45867n6938j6953J6512r0044j17730
$$ 1322638 1401542 1279378 1196738 1171782 1236478 1090611 1033673 1016720 1033232 943188 825458
9775H25458k17217o9671q1937j1280J02621j59035Q1449J59732J01143k1886K2190
$$ 825458 608241 538570 456633 445353 547974 388939 470388 630120 731263 709377 731567
9764G31567L7367P846j09400q1091o5136n682l4972N2811L2300l9010p9809l4959
$$ 731567 768934 776780 667380 586289 521153 515471 480499 533310 565610 526600 446791 411832
9752D11832j46668P1902M2612N3460j39779j4942J26181M6158Q8467o7952J1013
$$ 411832 265164 337066 379678 433138 293359 278417 404598 450756 539223 471271 482284
9741D82284M4238N3912K7299o7986j7435k0747k0258l3039k4154k8580n6384r8627
$$ 482284 526522 580434 607733 539747 522312 501565 481307 448268 424114 395534 339150 240523
9729B40523J60322O3693j52318k9787P0954j0486m777M5573l6223q3715k8696
$$ 240523 400845 464538 312220 282433 353387 342901 338124 383697 347474 263759 235063
9718B35063J70478Q4150j48960j59481k17998R3860J40156R4945M0633J27394
$$ 235063 405541 489691 340731 181250 -36748 57112 197268 292213 332846 460240
9708D60240K9998p8981q308j18863j82024j11383J40816J34073l9378p5884o408
$$ 460240 490238 411257 402949 284086 102062 -9321 131495 265568 226190 150306 143898
9697A43898J28308N8072j24142Q8538J37540Q1076P7040j8271n2239j10581k36746
$$ 143898 272206 330278 206136 294674 432214 513290 590330 572059 519820 409239 172493
9686A72493J26706N9923L203o7721o4095j7950K04650P8153Q0848L7175r7564
$$ 172493 299199 359122 362325 294604 230509 212559 417209 495362 576210 613385 515821
9675E15821j0243q0511o1605N3770k4909J21361L26819Q7676R0331q5922j20376
$$ 515821 505578 425067 363462 417232 392323 513684 840503 928179 1018510 932588 812212
9664H12212n5107r512K51952J75736k7116N9287J46501l0915j93917j64020O4395
$$ 812212 757105 747593 999545 1175281 1148165 1207452 1353953 1323038 1129121 965101 1029496
9653A029496J95745r9784k71100k8145j41291P1511J83035M5414j0387j28005
$$ 1029496 1225241 1125457 854357 826212 684921 756432 939467 984881 974494 846489
9643H46489J07263J4875M3173J8989m3628P3389J0275N2896j0990m2273J59089
$$ 846489 953752 968627 1011800 1030789 987161 1060550 1070825 1123721 1112731 1070458 1229547
9632A229547J27256J55314Q7074L5750p2464J01456J90716J88287K04183k094
$$ 1229547 1356803 1512117 1599191 1634941 1562477 1663933 1854649 2042936 2247119 2245025
9622B245025r1325n8050j28972r1706r7676l773n3622j43852j27860k78727p3945
$$ 2245025 2153700 2095650 1966678 1874972 1777296 1773523 1719901 1576049 1448189 1169462 1095517
9611A095517j56155K0508J14666J29754l4069j428k4743J7786J23047L76433L93314
$$ 1095517 939362 959870 1074536 1204290 1170221 1168793 1144050 1161836 1284883 1661316 2054630
9600B054630N84458M58591K72309M88458M43210Q4482p8529k13449j11901l2663
$$ 2054630 2639088 3097679 3369988 3858446 4301656 4386138 4307609 4094160 3982259 3949596
9590C949596r3357q142j05873p9595j04903m6085j16479l58570l40906j13207
$$ 3949596 3856239 3848097 3742224 3662629 3557726 3511641 3395162 3036592 2695686 2582479
9580B582479j62792l43146l35015j63287l5180j41631L665j06490j34700m8420
$$ 2582479 2419687 2076541 1741526 1578239 1543059 1401428 1405093 1298603 1163903 1115483
9570A115483j64918J9595K07063N6251j47079j34317j38540K1245J83529N9779
$$ 1115483 950565 970160 1177223 1233474 1086395 952078 813538 834783 1018312 1078091
9560A078091M0405J54139K0852J77190J58611k6448q8746k33940j26997j00245
$$ 1078091 1118496 1272635 1293487 1470677 1629288 1602840 1514094 1280154 1153157 1052912
9550A052912n8812p3219j01293M7235k2327k21032m1756J96041K0558r0131J3279
$$ 1052912 994100 920881 819588 866823 844496 623464 581708 777749 798307 708176 721455
9539G21455o018k5001J14330j40577L4953P4195j59302j92343p603K35085J00951
$$ 721455 715437 690436 804766 664189 699142 773337 614035 421692 414089 649174 750125
9528G50125j5932j32601j56378L2539k4323k32444m804L1435n5017R2246P8263
$$ 750125 734193 601592 445214 477753 453430 220986 216182 247617 192600 284846 363109
9517C63109M2380K7723p0439O0564J10282k0304K8483j13220k61198O1698J50217
$$ 363109 405489 433212 362773 423337 533619 513315 541798 428578 167380 229078 379295
9506C79295j07521p8971L0456j2735J8250L6723L6018n5682j7000j18701p7423
$$ 379295 271774 192803 223259 210524 228774 265497 301515 245833 228833 110132 32709
9495C2709J26812j6034J17013O5955J09251J08380J2396j29221l1833J2402j12983
$$ 32709 159521 143487 260500 326455 435706 544086 556482 427261 395428 407830 294847
9484B94847q9297O4673n1692r9905j14357P8470q313j7205j24683O2391P4923
$$ 294847 205550 270223 218531 118626 4269 82739 74426 57221 -67462 -5071 69852
9473F9852J06182J5241P9937N5868k270L28o6569j35255L5486Q3156K9963O7368
$$ 69852 176034 191275 271212 327080 324810 325138 258569 123314 158800 241956 271919 339287
9461C39287q9222m8814P5374q1940K0577K72628p9024k8171J789j46228J2855
$$ 339287 250065 201251 276625 194685 215262 487890 408866 380695 382484 236256 249111
9450B49111J2153k4884n4190J60027q9351k1445j26378k5401j0396R7142M2467
$$ 249111 261264 236380 182190 342217 252866 231421 105043 79642 69246 166388 208855
9439B08855j61925l9925O595j65826N4160J42821J12889l5175K8122R5813n6839
$$ 208855 46930 7005 13600 -152226 -98066 44755 157644 122469 150591 246404 189565
9428A89565n631M0529P6548j82761J7663R7233M9701k66295p9475J3334m9376
$$ 189565 183934 224463 301011 118250 135913 233146 282847 16552 -62923 -49589 -98965
9417i8965L9105N8214J10066M3685p486M9266P2305K8661r6527p4556o3931N8853
$$ -98965 -59860 -1646 108420 152105 144619 193885 266190 294851 198324 123768 59837 118690
9405A18690J73405r3204J512o2945p3052p6593j37572P7647K0285q1728O7595
$$ 118690 292095 198891 200403 137458 64406 -12187 -149759 -72112 -51827 -133555 -65960
9394f5960J30959n8058N8945R0349o0612n1022O2601p6534o6715j65718j06353
$$ -65960 64999 6941 65886 156235 95623 44601 107202 30668 -36047 -201765 -308118
9383c08118q9640Q7619O2012J79378N4141j13458k1122J4301j39001J13088O6304
$$ -308118 -397758 -310139 -248127 -68749 -14608 -128066 -149188 -134887 -273888 -160800 -94496
9372i4496P9094J55638k062j87340r5576J07712k0680O5462J53881L0722k0238
$$ -94496 -15402 140236 138174 -49166 -144742 -37030 -57710 7752 161633 192355 172117
9361A72117K7999o0863Q7183M9729J00202N6080j04640K1917N9232j10207k3192
$$ 172117 200116 139253 226436 276165 376367 432447 327807 349724 408956 298749 275557
9350B75557m3823n7817j0259J75042J01261J50990O9531j42701m5790J46r4427
$$ 275557 231734 173917 163658 338700 439961 590951 660482 517781 471991 472137 377710
9339C77710j16558l0002m1273M3953J16257K03873K32716J66180k7546k67243
$$ 377710 261152 231150 189877 233830 350087 553960 786676 952856 925310 658067
9329F58067k49573r2384o7126q4421n518Q2013N1790J41123n0521q1794J06606
$$ 658067 408494 316110 248984 164563 159045 241058 292848 433971 383450 301656 408262
9318D08262K07011O4048j01036O5297q356j543j93723o5148J11710J5733j13897
$$ 408262 615273 679321 578285 643582 635226 633683 439960 374812 486522 502255 388358
9307C88358k1969j37869J76687J04706j2448Q2968k3644j52326q9650J6593N6695
$$ 388358 366389 228520 405207 509913 497465 580433 556789 404463 314813 331406 388101
9296C88101J15779K1469l6094j03465R737R6894J7235R8499j0330O3447Q0206
$$ 388101 503880 525349 489255 385790 395527 492421 509656 608155 597825 661272 741478
9285G41478j30121n3841k26341N4506J37852L6158J09150R3317J579l3448p5700
$$ 741478 611357 557516 331175 385681 523533 559691 668841 762158 763737 730289 654589
9274F54589j5000K4169K05625m479r8539k9773j57120Q9836Q392M0556K3080q3395
$$ 654589 639589 663758 869383 864904 766365 736592 579472 669308 677700 718256 741336 657941
9262F57941k43597k02561j13963J70977J08754J01487J6043n6323l0514o0234
$$ 657941 414344 211783 97820 268797 377551 479038 495081 438758 408244 348010
9252C48010o443K3172j17918P3233J37297j56519k4534m6961J09159J37119J5844
$$ 348010 341567 364739 246821 320054 457351 300832 276298 229337 338496 475615 491459
9241D91459L796P6938Q3996Q3173p5918j23892j7833n5087O3597P132J83139J70112
$$ 491459 495255 572193 656189 739362 663444 539552 521719 466632 530229 537361 720500 890612
9229H90612p15k32684j50661m2643k6385J7553J4139k7864J52995j15859Q1790
$$ 890612 889897 657213 506552 463909 437524 455077 469216 441352 594347 478488 560278
9218E60278n8395J2359m2339l6227k7900K4480J35657l4969J29524K6293j73877
$$ 560278 501883 514242 471903 435676 407776 432256 567913 532944 662468 688761 514884
9207E14884j62433j84818j36866J40480K81015K03521J23560j77748j24168m2032
$$ 514884 352451 167633 30767 171247 452262 655783 779343 601595 477427 435395
9197D35395l781j17355M6104J60812j66743M5942M3249N8214P3332p8288K0909
$$ 435395 431614 314259 360363 521175 354432 400374 443623 501837 575169 496881 517790
9186E17790N5567n7133k08773j90142J85899Q3713p4501R9444J31478m3436j76885
$$ 517790 573357 516224 307451 117309 303208 386921 312420 411864 543342 499906 323021
9175C23021P0075q7326J42471o3662L3113q7505l3544Q6560J84279L5409N6264
$$ 323021 393096 305770 448241 384579 417692 330187 296643 383203 567482 602891 659155
9164F59155L1675j12702n6425r7383j26709J9920p1289J32765n3516L1092j63572
$$ 659155 690830 578128 521703 424320 297611 317531 246242 379007 325491 356583 193011
9153A93011j68203j9720K9464L65339J45344M4109J11397K7438k46359j01754
$$ 193011 24808 5088 34552 399891 545235 589344 700741 728179 481820 380066
9143C80066J47435J4121Q8515J6618p904p624r7078J20122k5222J97522N3464
$$ 380066 527501 541622 630137 646755 638851 631227 534149 654271 629049 826571 880035
9132H80035j19758j67033J05858J52389K71867q6090N3662K9851m2564p5745r2122
$$ 880035 760277 593244 699102 851491 1123358 1037268 1090930 1120781 1078217 1002472 910350
9121I10350J12683K02366J42157L09975R5064Q2103J49167J23353J76107J09231
$$ 910350 1023033 1225399 1367556 1677531 1772595 1854698 2003865 2127218 2303325 2412556
9111B412556K28998K91259M00425N18552M09085P11346J103216J595631K303494
$$ 2412556 2641554 2932813 3333238 3851790 4260875 4972221 6075437 7671068 9974562
9102I974562L282839N328911R408699J8099674K6976178K3352223J6137563J5667358
$$ 9974562 13257401 18586312 27995011 46094685 73070863 96423086 112560649 128228007
9094A28228007J1081810j6140203m4942696k8632064j4124229p832857m897827
$$ 128228007 139309817 123169614 78226918 49594854 35470625 27637768 22739941
9087B2739941l434521k506307j805832j470376j236669r29469p39084m91257n07779
$$ 22739941 19305420 16799113 14993281 13522905 12286236 11356767 10617683 10126426 9618647
9078I618647n73519m81896l62985k92105j86226k49248k67866m7851j67166j34012
$$ 9618647 9045128 8563232 8200247 7908142 7721916 7472668 7204802 7156951 6989785 6855773
9068F855773l07724k75267j41307l6886l52623k43336j05462k20540l65679k53240
$$ 6855773 6548049 6272782 6131475 6094589 5741966 5498630 5393168 5172628 4806949 4553709
9058D553709k35045o8675k08933j05725j41906j80651j65196j84897k00279j31515
$$ 4553709 4318664 4249989 4041056 3935331 3793425 3612774 3447578 3262681 3062402 2930887
9048B930887o4876k6471J5861p1906k0981l204M488j40528m5221P442L2522k39545
$$ 2930887 2866011 2839540 2855401 2783495 2762514 2759310 2763798 2623270 2578049 2585491 2618013 2378468
9036B378468k00406M2096O8812j9628j46009k03217j03171j48182m1193j19703
$$ 2378468 2178062 2220158 2288970 2269342 2123333 1920116 1816945 1668763 1627570 1507867
9026A507867m5998K5718L8994j4735m9990K2543j14860P155N4888q9521p3464
$$ 1507867 1461869 1487587 1526581 1511846 1461856 1484399 1369539 1376694 1431582 1342061 1268597
9015A268597R6229P0011j1231m6131p2303r5426M695p125l3363j50236m777O5670
$$ 1268597 1364826 1434837 1423606 1377475 1305172 1209746 1214441 1207316 1173953 1023717 1018940 1084610
9003A084610K8837j97642j45053n644Q0903m594J39497J33273j15732K028M2084
$$ 1084610 1113447 915805 770752 765108 846011 841417 980914 1114187 998455 1000483 1042567
8992A042567r7249j89204j49055M8285q0133j19366o4070J5797r0767N9840L1473
$$ 1042567 945318 756114 607059 655344 575211 455845 391775 407572 316805 376645 408118
8981D08118L3276J88504J11187k04223j81403o3589r6974j3041N9950J56239J68227
$$ 408118 441394 629898 741085 536862 355459 291870 194896 181855 241805 398044 566271
8970E66271J38238j32776j84721o6008N4054J02641J03872q8355n9998J61654
$$ 566271 704509 571733 387012 321004 375058 477699 581571 493216 433218 594872
8960E94872r2908J9591j17667r4214N0541O2026j91525Q83K61454J62616J64170
$$ 594872 501964 521555 403888 309674 360215 422241 230716 231599 493053 655669 819839
8949H19839r1967j69898K1799q1223j91494J07499O7071j06208q961j33844K3661
$$ 819839 727872 557974 579773 498550 307056 414555 481626 375418 366457 232613 256274
8938B56274J03779L8259j38958K1380K01917M3483j30212j46084o1035R9512j59074
$$ 256274 360053 398312 259354 280734 482651 526134 395922 249838 188803 288315 129241
8927A29241P0807p811Q4101j41621o7958R3428j12892j09581J30774L26683R6088
$$ 129241 200048 192237 276338 134717 66759 160187 47295 -62286 68488 395171 491259
8916D91259k1498R4510j26566r2064J80969J85075j33978j8951j54395J8562K15065
$$ 491259 469761 564271 437705 345641 526610 711685 577707 558756 404361 422923 637988
8905F37988Q6588j4646j0278J45171J82166Q9359m4596r0318k56862k02045L3497
$$ 637988 724576 709930 699652 844823 1026989 1116348 1071752 981434 724572 522527 556024
8894E56024O5895K0247L3439j1010p200O8977Q8034l0919j06405Q776N1702J7863
$$ 556024 621919 642166 675605 664595 657395 726372 814406 783487 677082 685858 737560 755423
8882G55423j52501k35931j12985n3340Q4411J01583P1524J9563M2007R259J23077
$$ 755423 602922 366991 254006 200666 285077 386660 458184 477747 519754 529013 652090
8871F52090J08789N3798J37402J06115L2436N7857J30973j29796l9945j15092
$$ 652090 760879 814677 952079 1058194 1090630 1148487 1279460 1149664 1109719 994627
8861I94627n3760o1989L2014J8904p0326p095J49008j11376k8083J23313R8485
$$ 994627 940867 878878 910892 929796 859470 852375 1001383 890007 861924 985237 1083722
8850A083722Q9338k348N5631M828o510P773L7328o1478j9723K1981J07938O462
$$ 1083722 1173060 1170712 1226343 1231171 1224661 1232434 1269762 1208284 1188561 1210542 1318480 1324942
8838A324942j61869j16797j46448j52111J20155l0591p0008J46423J08759P3133
$$ 1324942 1163073 1046276 899828 747717 867872 837281 767273 913696 1022455 1095588
8828A095588j12404J1202m2807O3236q5545m6107r8607j92937J93402M2634j4349
$$ 1095588 983184 994386 951579 1014815 929270 883163 784556 591619 785021 827655 813306
8817H13306k3624o7877p824j5079J16898K67938q1760p2109N3242o6514P5304
$$ 813306 789682 721805 713981 698902 815800 1083738 1001978 929869 983111 916597 991901
8806I91901J94374J23198P6118N036L4300M736O9849k13767j24261P8773N4996
$$ 991901 1186275 1309473 1385591 1390627 1424927 1429663 1499512 1285745 1161484 1240257 1295253
8795A295253j3244l2451j88585k4886m5880K5874p4577J36610K06859J6669j25168
$$ 1295253 1282009 1249558 1060973 1036087 990207 1016081 941504 1078114 1284973 1301642 1176474
8784A176474j78076l9039J51479k627j35124j0828P3472L8695j0185J88888K274
$$ 1176474 998398 959359 1110838 1108211 973087 962259 1035731 1074426 1064241 1253129 1255403
8773A255403j27635j68394R6187J06589P0453N976p1990J3985J2102J07409l9731
$$ 1255403 1127768 959374 1055561 1162150 1232603 1238579 1166589 1180574 1192676 1300085 1260354
8762A260354O6454J3587Q4945J33804j08252j13005j04667j71849J28402J61431
$$ 1260354 1326808 1340395 1425340 1559144 1450892 1337887 1233220 1061371 1189773 1351204
8752A351204K05078Q1371n3542j6729M3143R1355l5938P3064o9489J0523n7073
$$ 1351204 1556282 1637653 1584111 1567382 1610525 1701880 1665942 1739006 1669517 1680040 1622967
8741A622967R7606O4148J02748k5194j03712j29071k8194K90007Q5198J29558
$$ 1622967 1720573 1784721 1887469 1862275 1758563 1629492 1601298 1891305 1976503 2106061
8731B106061J02305Q7419k01111j26628Q8455l1769M0547K38723K38048O6313
$$ 2106061 2208366 2295785 2094674 1968046 2056501 2024732 2065279 2304002 2542050 2608363
8721B608363J03485K79858K51229Q3255J52427J15492j37215j42983J13749K40140
$$ 2608363 2711848 2991706 3242935 3326190 3478617 3594109 3456894 3313911 3427660 3667800
8711C667800J36901J7690J5748M8172N9225L8083J79837K2293n6473P9509N1883
$$ 3667800 3804701 3822391 3838139 3886311 3945536 3983619 4163456 4185749 4129276 4208785 4260668
8700D260668q1150j88936k3794P0448L8451j27664k30842j89618j25237r5909
$$ 4260668 4179518 3990582 3966788 4037236 4075687 3948023 3717181 3527563 3402326 3306417
8690C306417P4691l2805n0350k20583j06589N3556M8548m86j91933j58214Q9369
$$ 3306417 3381108 3348303 3297953 3077370 2970781 3024337 3072885 3072399 2880466 2722252 2811621
8679B811621j1283J00968q0742l5143J45796Q8595j69773l6750J3047k4593j09377
$$ 2811621 2800338 2901306 2820564 2785421 2931217 3019812 2850039 2813289 2826336 2801743 2692366
8668B692366j789n9371Q5986j5296Q3501M2306q0621k11688k24476j8417M0951
$$ 2692366 2690577 2631206 2717192 2701896 2785397 2827703 2747082 2535394 2310918 2292501 2333452
8657B333452J0599J48889J22614l972j00150p4573l13K46528Q5302o2895o993
$$ 2333452 2344051 2492940 2615554 2611582 2511432 2436859 2436546 2683074 2768376 2705481 2698488
8646B698488O9188P8127Q2628K01490J73143L6250J33346r336j81125k62103k01065
$$ 2698488 2767676 2845803 2928431 3129921 3303064 3339314 3472660 3463324 3282199 3020096 2819031
8635B819031j07328J19432o6722k21065m8194J89035P193M5137J51777r7964O2484
$$ 2819031 2711703 2831135 2764413 2543348 2495154 2684189 2691382 2736519 2888296 2790332 2852816
8624B852816j68196j15917J45116K43086J52165J53229Q0923j8717l590K64778
$$ 2852816 2684620 2568703 2713819 2956905 3109070 3262299 3343222 3324505 3320915 3585693
8614C585693K53310R6280L6108L65248K03814L95571M33026K38782J38908M07295
$$ 3585693 3839003 3935283 3971391 4336639 4540453 4936024 5369050 5607832 5746740 6154035
8604F154035L98442J24309K16550J78253J5061L2797j17790m35937j73325j05839
$$ 6154035 6552477 6676786 6893336 7071589 7086650 7119447 7001657 6565720 6392395 6286556
8594F286556k10323k47152j47473n1794k51587l88401l92602k49997j36711k48160
$$ 6286556 6076233 5829081 5681608 5629814 5378227 4989826 4597224 4347227 4210516 3962356
8584C962356l66271j16914j58296j92642j95457J120j07255j62883m5493K1378
$$ 3962356 3596085 3479171 3320875 3128233 2932776 2933896 2826641 2663758 2618265 2639643
8574B639643p5278j13253k32904J79Q4151O2690j06726m2217n8208j55747m1751
$$ 2639643 2564365 2451112 2218208 2218387 2302538 2365228 2258502 2216285 2158077 2002330 1960579
8563A960579j57153m2252M8620k6940j1673j44188j42769o3975R9142J02792Q2213
$$ 1960579 1803426 1761174 1809794 1782854 1771181 1626993 1484224 1420249 1519391 1622183 1704396
8552A704396m8968M8593Q79K26372J20441o0898j23897r4977K26997N200p524
$$ 1704396 1655428 1704021 1704900 1931272 2051713 1990815 1866918 1771941 1998938 2004138 1996614
8541A996614k2876m7065q5293J62542L70751J51929L3043J16451J89485K06808
$$ 1996614 1973738 1926673 1841380 2003922 2374673 2526602 2559645 2676096 2865581 3072389
8531C072389j49475j47512R7665O3968k17808l02319o0207m2332K022J23180N0871
$$ 3072389 2922914 2775402 2873067 2937035 2719227 2416908 2356701 2314369 2316391 2439571 2490442
8520B490442M1488Q5450M4581J18810k13469j62J54410l00480j95378l856N3839
$$ 2490442 2531930 2617380 2661961 2780771 2567302 2567140 2721550 2421070 2225692 2221836 2275675
8509B275675q4026k30420O8029q0029j75583p0297Q9355j57516k05532r7929L1372
$$ 2275675 2191649 1961229 2029258 1949229 1773646 1703349 1792704 1635188 1429656 1331727 1363099
8498A363099N1614J19947K398k07906j90434M461m6009k7889O2851r0042K2113
$$ 1363099 1414713 1534660 1537058 1329152 1138718 1143179 1097170 1069281 1132132 1042090 1064203
8487A064203L5772N2393O7552L0372J58867o725m5478K1542n1186j62908q775
$$ 1064203 1099975 1152368 1219920 1250292 1409159 1402434 1356956 1378498 1327312 1164404 1155629
8476A155629J07636P3239J81818O2093j74201l29935j93284p2354j52855r0332
$$ 1155629 1263265 1336504 1518322 1580415 1406214 1076279 882995 810641 657786 567454
8466E67454L3400J26725L5415k3471j6953r9666k4364k398o852J02443o4002j41516
$$ 567454 600854 727579 762994 739523 722570 622904 598540 596142 589290 691733 627731 486215
8454D86215m9396L4799R9011J7473N1439J64590j0482N0292l6312j59858M9607
$$ 486215 436819 471618 570629 588102 639541 804131 793649 843941 807629 647771 697378
8443F97378K0388K2104Q7263p2526j23530P5753L86897J45975o484J02337O4746
$$ 697378 717766 739870 827133 754607 631077 706830 1093727 1239702 1233218 1335555 1400301
8432A400301k79168l74809j38930k9642r8490J34450J04776l5529j90081j99714
$$ 1400301 1121133 746324 607394 577752 479262 613712 718488 682959 492878 293164
8422B93164R7529K49644P6156l830n0036n4058n4930K702k3823J11261r081j48516
$$ 293164 390693 640337 716493 712663 662627 608569 553639 556341 532518 643779 634698 486182
8410D86182p8902O8418j04634j77459J12748r8287P9280J02648L5186O2825P681
$$ 486182 407280 475698 371064 193605 306353 208066 287346 389994 425180 488005 495686
8399D95686j80897l4408l2508O5013N2806P0419P1763k4434l15119J9067j11705
$$ 495686 314789 280381 247873 312886 365692 436111 507874 483440 168321 187388 75683
8388G5683o8853k9175j42636J31844J25309J67323J78746r1152j37797j37748
$$ 75683 6830 -22345 -164981 -33137 92172 259495 438241 347089 209292 71544
8378G1544p661n4130p3657p8418r3228P3395M6180J83488K0718O2208j16643O4070
$$ 71544 63883 9753 -63904 -142322 -235550 -162155 -115975 67513 88231 150439 33796 97866
8366I7866o1624j07375Q8362K32373K3453p7130j4331Q4762j07947j11463J67085
$$ 97866 36242 -71133 17229 249602 273055 195925 181594 266356 158409 46946 214031
8355B14031K33418R0448q1855L647j6370j5373l9522j11710L8861r2881J03670
$$ 214031 447449 537897 456042 459689 443319 427946 388424 276714 315575 222694 326364
8344C26364L3061p3148j1922J92825p3336l30194j94767J44908R009R0228J70231
$$ 326364 359425 286277 274355 467180 393844 63650 -131117 13791 22800 113028 283259
8333B83259P0816n8921J27874l1313l1509M8549L4907k02798j32698Q0939P7942
$$ 283259 354075 295154 423028 391715 360206 408755 443662 240864 108166 189105 267047
8322B67047N2123J8273J4715o160P6021j3062n9407j13481J260J35653O2193r7273
$$ 267047 319170 337443 352158 345998 422019 408957 349550 236069 237329 372982 435175 337902
8310C37902j55609j19782M3037j3967j1460k6368K70034J69186L0294o1247j61394
$$ 337902 182293 62511 105548 91581 80121 53753 323787 492973 523267 462020 300626
8299C00626p9894j24618j16118j7097R8234M7488p9011k1405K5485q3297r027
$$ 300626 220732 96114 -20004 -37101 61133 108621 29610 8205 33690 -49607 -58634
8288e8634n1948J14171k6148k5150M6956J97503M3369J06425M194N1823R6181
$$ -58634 -110582 3589 -22559 -47709 -753 196750 240119 346544 350738 402561 498742
8277D98742j35428r8043j08644J24578L1305l3155j87435j03242K16203K2060
$$ 498742 363314 265271 156627 281205 312510 279355 91920 -11322 204881 226941
8267B26941j97688k4729M2653M3242L415O0952M9064p3970j18089J15234O0400
$$ 226941 29253 4524 47177 90419 93834 154786 203850 129880 11791 127025 187425
8256A87425l6982j25512k588K6567J02867k5808j58219J295R2316J99581N3793
$$ 187425 150443 24931 22343 48910 151777 125969 -32250 -30955 61361 260942 314735
8245C14735M4664o1871j84056p9175m8709m3925L2947N3672o345M0617j6828R3227
$$ 314735 359399 297528 113472 34297 -14412 -58337 -25390 28282 21937 62554 45726 138953
8233A38953J27310J03778K4814K6963j77623j58809J02690K064n5778k7179K7285
$$ 138953 266263 370041 394855 421818 244195 85386 188076 190140 134362 107183 134468
8222A34468L3209m7827N5021o6852j37407J23469j8745P5451L09999Q2301j25246
$$ 134468 167677 119850 174871 108019 -29388 94081 75336 150787 460786 543087 417841
8211D17841j73330N1390P6295Q4899j3562o2197j97658m6014k27978j03697J63788
$$ 417841 244511 295901 372196 457095 443533 381336 183678 137664 -90314 -194011 -30223
8200c0223L0540K6111J4133q28L1238J8469k8005J6009j16199l0978O2723L1064
$$ -30223 317 26428 40561 39733 70971 89440 61435 77444 -38755 -69733 -7010 24054
8188B4054J70964J11868k362J13671j14383j17122J63821k8468j05910P8631K4374
$$ 24054 195018 306886 304524 418195 303812 186690 350511 322043 216133 294764 319138
8177C19138k8584j21366M1588L8363k246L4813O4790j53265j23244m6613J98459
$$ 319138 290554 169188 210776 249139 246893 281706 346496 193231 69987 23374 221833
8166B21833J88578k4402l1083K7838P2073J78821K34144j02083M1264j29009j30042
$$ 221833 410411 386009 354926 382764 454837 633658 867802 765719 806983 677974 547932
8155E47932J22872P9729P6995K1648j52659K7859l0339O347l8966j6056l8324
$$ 547932 670804 750533 827528 849176 696517 724376 694037 700384 661418 645362 607038
8144F07038j54700Q6527q8759r3012l3245O2392n1567O1366k8743j58332P7997
$$ 607038 452338 538865 450106 357094 323849 386241 334674 396040 367297 208965 286962
8133B86962J30607k020J4587k04166J897m6824K3911J32090j21436J03374Q7083
$$ 286962 417569 415549 430136 225970 227867 181043 204954 337044 215608 318982 406065
8122D06065K6453J73064J44013M8574J94973K49568K88635J72389J97469L74946
$$ 406065 432518 605582 749595 798169 993142 1242710 1531345 1703734 1901203 2276149
8112B276149K85755J81864J85597j18901j43804o8788k20322l09967k08912K2706
$$ 2276149 2561904 2743768 2929365 2810464 2666660 2597872 2377550 2067583 1858671 1881377
8102A881377j58710l83182k20750K4006P7058m005m826l7051L7010j05994j25836
$$ 1881377 1722667 1339485 1118735 1142741 1219799 1215794 1210968 1173917 1210927 1104933 979097
8091I79097k85836J30636L71765J48191n2794K8151L5656M9369p8127j43592n9363
$$ 979097 693261 823897 1195662 1343853 1291059 1319210 1354866 1404235 1326108 1182516 1123153
8080A123153j1562q2346l4648J78422J8236J2934J33617K94080K33593J71120
$$ 1123153 1111591 1029245 994597 1173019 1191255 1204189 1337806 1631886 1865479 2036599
8070B036599K71056O48408O16201N49628O58583O13055N15051J53013k19467o68203
$$ 2036599 2307655 2956063 3572264 4121892 4780475 5393530 5908581 6061594 5842127 5173924
8060E173924q27693n79062n35718l13110j48044q3284j23130l7095j8811N0628
$$ 5173924 4346231 3767169 3231451 2918341 2770297 2687013 2563883 2526788 2507977 2558605
8050B558605m1016M2685m1356K26919L28933K84635k1917n8951j3394J50556K38454
$$ 2558605 2517589 2560274 2518918 2745837 3074770 3359405 3337488 3278537 3265143 3415699 3654153
8039C654153J46199P9856O09976P66552M47166K71166M29145O1566l07021m30459
$$ 3654153 3800352 3880208 4490184 5256736 5703902 5975068 6404213 6465779 6158758 5728299
8029E728299j73402P7007j13397p8388P0470m5073q8688j97772j41796j26118
$$ 5728299 5554897 5631904 5518507 5440119 5510589 5465516 5376828 5179056 5037260 4911142
8019D911142P9151j6478k0321K13061j18274j66693k32875J7928l534k21299j65569
$$ 4911142 4990293 4973815 4953494 5166555 5048281 4881588 4648713 4666641 4663107 4441808 4276239
8008D276239k51318k63251J68162J11932J2158L10808K36582Q6240M7448k04306
$$ 4276239 4024921 3761670 3929832 4041764 4053922 4364730 4601312 4687552 4735000 4530694
7998D530694j75475k82711j97355l00626j16812k5164L665j49846j29269K5477
$$ 4530694 4355219 4072508 3875153 3574527 3457715 3432551 3436216 3286370 3157101 3182578
7988C182578j20402j91272m8703J70551J97547k37183k81876m8296P4858o2028
$$ 3182578 3062176 2870904 2822201 2992752 3190299 2953116 2671240 2622944 2697802 2635774
7978B635774j67743j6493n0276M291l8423o2903r352K0135J08854P1647j75241
$$ 2635774 2468031 2451538 2401262 2405553 2367130 2304227 2294875 2315010 2423864 2495511 2320270
7967B320270p1894M6021N0678K5014n0823J81086K18821J79730N5181m7174j04806
$$ 2320270 2248376 2294397 2345075 2370089 2319266 2500352 2719173 2898903 2954084 2906910 2802104
7956B802104J03245O3686j46528o8940K2936j40026j39573k02977j75595q7553
$$ 2802104 2905349 2969035 2822507 2753567 2776503 2636477 2496904 2293927 2118332 2030779
7946B030779j82033k01128o763L3847j47881k03104L9830j37420j63370k645N9037
$$ 2030779 1848746 1647618 1640855 1674702 1526821 1323717 1363547 1226127 1062757 1060112 1119149
7935A119149p5080J59241j04520k19770j2234N0091N7469J08522J0164N7082J37556
$$ 1119149 1044069 1203310 1098790 879020 866786 916877 974346 1082868 1093032 1150114 1287670
7924A287670K8730p8390p6634N794Q6150R0891J08609j45666j33932M1530K6271
$$ 1287670 1316400 1238010 1161376 1167170 1253320 1344211 1452820 1307154 1173222 1214752 1241023
7913A241023p5987M3744n8411J16782K7488j62116j00831N7158m0670k19683p6203
$$ 1241023 1165036 1208780 1150369 1267151 1294639 1132523 1031692 1088850 1048180 828497 752294
7902G52294l5980o0258j16952j3471J7994J66792r8566K7845O5274M1160P817
$$ 752294 716314 656056 539104 525633 543627 710419 611853 639698 704972 746132 753949
7891G53949n2882R030k5059j24788j82674o711J1653R9221J4646L47R8938M3410
$$ 753949 701067 710097 685038 560250 377576 370865 382518 481739 496385 496732 595670 639080
7879F39080j88389l4890J78304R0302M2228j10019k21638k3113J23110J35166
$$ 639080 450691 415801 594105 684407 726635 616616 394978 371865 494975 630141
7869F30141o841j36992j19838j7659n3846j17440q9843N9562N4347q2922O5940
$$ 630141 623300 486308 366470 348811 294965 177525 87682 147244 201591 118669 184609
7858A84609Q4976R0166j32896j06498k9646J69415q3289r3366M0251o9305p23
$$ 184609 269585 359751 226855 120357 90711 260126 176837 83471 123722 54417 53694
7847E3694M1485K08896M443o9603J94031N8940j43756p5183N5123J4670O6833
$$ 53694 95179 304075 308518 238915 432946 491886 348130 272947 328070 342740 409573
7836D09573J01218o797K2034o4106o4813m3177j17254j05563j08937j24245K35490
$$ 409573 510791 503994 526028 461922 397109 353932 236678 131115 22178 -102067 133423
7825A33423R8098P5666Q9153j37747r2943j65593K14599L8458K9715p288o9015
$$ 133423 231521 307187 396340 258593 165650 57 214656 253114 282829 275541 206526
7814B06526J48348P2826j47501j04184N0291j13048j84890j9970J11979R9481
$$ 206526 354874 427700 280199 176015 226306 113258 -71632 -91602 20377 119858
7804A19858j41925j75546j99037J68414J30881o6103r8856J07621J48287K13794
$$ 119858 -22067 -197613 -396650 -228236 -97355 -163458 -262314 -154693 -6406 207388
7794B07388n0074p5648j07574j2066o772J17521R7276J1720o3579j04316M5260
$$ 207388 157314 81666 -25908 -37974 -44746 72775 170051 181771 118192 13876 59136
7783E9136j963k2292J80911K55159M5424p4510P2741M6292n5441q4562o5909k11057
$$ 59136 57173 34881 215792 470951 516375 441865 514606 560898 505457 420895 354986 143929
7771A43929j82885J50451k7053k19697r3161J26041O2917J25898L6907K4490j38491
$$ 143929 -38956 111495 84442 -135255 -228416 -102375 -39458 86440 123347 147837 9346
7760I346l9396r2495r8063O4668K07577m4622j7562p6956J63367N8168k1480L5624
$$ 9346 -30050 -122545 -220608 -155940 51637 7015 -10547 -87503 75864 134032 112552 148176
7748A48176L4311q1952j22538j47282j9414P7485l0082n7763J17985K83720K03326
$$ 148176 182487 100535 -22003 -169285 -188699 -111214 -141296 -199059 -81074 202646 405972
7737D05972k5223m3894j11106q7048M8053M7221o4735j23590o2683q493O6411
$$ 405972 380749 336855 225749 138701 186754 233975 169240 45650 -17033 -25526 40885
7726D0885J33539J863j82156k1816K06131K7825j3384q438j88861k6017q051N7762
$$ 40885 174424 176287 -5869 -27685 178446 206271 192887 184449 -4412 -30429 -38480 19282
7714A9282m0400q4165Q6412J19535O9936J05744k1109j47969L0361K0062n0283
$$ 19282 -21118 -105283 -18871 100664 170600 276344 255235 107266 137627 157689 107406
7703A07406j17401J8844J27383J82020J4294p7212P4614J19259k54717j63549
$$ 107406 -9995 8849 136232 318252 332546 255334 329948 449207 194490 30941
7693C0941m1405N6240L4868r999k05448r1398J25159k6962N2293J21034M5270
$$ 30941 -10464 45776 80644 70645 -134803 -226201 -101042 -128004 -75711 45323 90593
7682I0593o619m6045j94793j5110J3123J34398P0774L3867M6447j7176k0399n2266
$$ 90593 83974 37929 -156864 -171974 -158851 -24453 46321 80188 126635 109459 89060 36794
7670C6794M1529O2821k36494K7189m2633p9554O6075l9252m0733l6667L8782P9445
$$ 36794 78323 141144 -95350 -68161 -110794 -190348 -124273 -163525 -204258 -240925 -202143 -122698
7658a22698J8841Q7435J71397J297j69303J18351k4078m4849L5487Q8373O1449
$$ -122698 -103857 -16422 154975 156272 -13031 105320 81242 36393 71880 160253 221702
7647B21702p0723j16568l7031K414r853K8903P2908K28437J18274j28616k27824
$$ 221702 150979 34411 -2620 -206 -10059 18844 91752 320189 438463 309847 82023
7636H2023j46848M6888Q5090J26208Q4039p0711m5112j18021Q118O4548R144j13094
$$ 82023 -64825 -17937 67153 193361 277400 206689 161577 43556 51674 116222 125366 12272
7624A2272J5144n9771j1318o2483j55411J50679J59142l7608J35627J73021j17356
$$ 12272 27416 -32355 -43673 -106156 -261567 -110888 48254 10646 146273 319294 201938
7613B01938j28793k31083J44474J12024k44761J15272J76415J39594j10353k20048
$$ 201938 73145 -157938 -13464 98560 -146201 -30929 145486 285080 174727 -45321
7603d5321M8991K944j92626M5075J03472N1647P9616k48199L2777j2985K2105
$$ -45321 3670 6614 -186012 -140937 -37465 14182 93798 -154401 -121624 -134609 -112504
7592a12504O9102J6p8192K3092J12778O652O0889R4689N8193m0708r6588k31807
$$ -112504 -43402 -43386 -121578 -98486 14292 20944 81833 176522 234715 194007 97419 -134388
7580a34388j89316N7937J71926l9920l1514P9241J73385K4700N1886m008j51476
$$ -134388 -323704 -265767 -93841 -133761 -165275 -86034 87351 112051 163937 159929 8453
7569H453j1183N2009J87785j14865j11429j12831Q8055J55656M662j56229J59455
$$ 8453 -2730 49279 237064 122199 10770 -102061 -14006 141650 146312 -9917 149538
7558A49538J7144k55377l5011J60291j410p058M7898m211l4049K7357n4928R3097
$$ 149538 166682 -88695 -123706 36585 35175 28117 76015 71804 37755 65112 10184 103281
7546A03281J33648k32545q7422K8091r5973J31471n6264j00782N9949R8821P0327
$$ 103281 236929 4384 -83038 -54947 -150920 -19449 -75713 -176495 -116546 -17725 52602
7535E2602L4714o6959O6558K13821m4526J2016O8299k63811j54174j06478J01608
$$ 52602 87316 20357 86915 300736 256210 268226 336525 72714 -81460 -187938 -86330
7524h6330k9392p6563J54103J11680j89540k90804J35749M3169j21489n2847L3783
$$ -86330 -115722 -192285 -38182 73498 -116042 -406846 -271097 -227928 -349417 -402264 -368481
7513c68481O0962O3437L9738J44573P4171J96289Q0503j56300j71560j49903N4140
$$ -368481 -307519 -244082 -204344 -59771 14400 210689 291192 134892 -36668 -186571 -132431
7502a32431J02199M1820j96059m7207r9485r126J51916K63394K00708j39605k05338
$$ -132431 -30232 11588 -184471 -231678 -331163 -340289 -188373 75021 275729 136124 -69214
7491f9214Q397M06861Q6388k23557j17026R7011n9897j16740o3429O6898J4096
$$ -69214 -60817 346044 432432 208875 91849 188860 128963 12223 -51206 15692 29788
7480B9788J5795m7130m6256j02578J9526K2397P5697R9247N8312P654p5151O5450
$$ 29788 45583 -1547 -47803 -150381 -130855 -108458 -32761 66486 124798 132452 57301 122751
7468A22751O8210M5603o2206j2555m000m0958J12102n2693k29878r7807R1854
$$ 122751 190961 236564 174358 161803 157803 116845 228947 176254 -53624 -151431 -59577
7457e9577K7430R342O7184q4720j04058K4208K0765q0128j34788Q5540m3057M9761
$$ -59577 -32147 -22805 44379 -40341 -144399 -120191 -99426 -179554 -314342 -228802 -271859 -222098
7445b22098J70737j6355j86728l2578K56866K81933J75245r3736m1908j09566
$$ -222098 -51361 -67716 -254444 -287022 -30156 251777 427022 333286 291378 181812
7435A81812J26955M8653j26490j75891j95052p3989p7807r2387J23315J18768
$$ 181812 308767 357420 230930 55039 -140013 -214002 -291809 -384196 -260881 -142113
7425a42113o520j19278j20018L5045L23127K8262o6304Q54p8039J0899J29364
$$ -142113 -148633 -267911 -387929 -352884 -29757 -1495 -67799 -66945 -144984 -134085 -4721
7414d721J23099J01744J2997j93283n8668K7438m756j52616j61449J01085J06572
$$ -4721 118378 220122 233119 39836 -18832 8606 3850 -148766 -310215 -209130 -102558
7403a02558J02165j94165o7098K1463J77940L19343j06163Q3588J32359k8067
$$ -102558 -393 -194558 -261656 -240193 -62253 257090 150927 234515 366874 338807
7393C38807j46736J21066M112k25173j83190j59156k5189J47179R5817M9912M0414
$$ 338807 192071 313137 317249 92076 -91114 -250270 -275459 -128280 -32463 17449 57863
7382E7863r7531m5255N3631K5694L3232j2971j25760q6720j05583M9536J84802
$$ 57863 -39668 -84923 -31292 -5598 27634 14663 -111097 -197817 -303400 -253864 -69062
7371f9062N2532J15129o8007j62583m9021J5121J67848N7551N5115K7083l4414
$$ -69062 -16530 98599 30592 -131991 -181012 -165891 1957 59508 114623 141706 107292
7360A07292K1525j71739M1846J01066j98094j17776R441J29352m3855j90330M0660
$$ 107292 128817 -42922 -1076 99990 -98104 -215880 -206439 -77087 -120942 -311272 -270612
7349b70612N2439L180K09735n7730M561l5209j25895P54P2841J44037K310j42313
$$ -270612 -218173 -214993 -5258 -62988 -58427 -93636 -219531 -218777 -145936 -1899 411 -141902
7337a41902L0031M3026J02754m6484p7861k15557j02367L4053L5242J99438J04330
$$ -141902 -111871 -68845 33909 -12575 -90436 -305993 -408360 -374307 -339065 -139627 -35297
7326c5297J4582j70421p4328J69487m1236N9054J22340l4636q2894K929N9560
$$ -35297 -20715 -191136 -265464 -95977 -137213 -78159 44181 9545 -73349 -70420 -10860
7315a0860N214m679O2300R414L396m6523n0787J0014M1420K06255j1727j80127
$$ -10860 -5646 -10325 51975 61389 64785 18262 -32525 -22511 18909 225164 213437 33310
7303C3310j14349J09149L4541p5264L3321l2742J68817J8361k6084j47088l8551
$$ 33310 -81039 28110 62651 -12613 20708 -12034 156783 175144 149060 1972 -36579
7292c6579j15233p9271J29236J45243j25094K7499Q6695J01282m98R554M2222
$$ -36579 -151812 -231083 -101847 43396 -81698 -54199 32496 133778 133280 142834 185056
7281A85056r1879o969k07541j58143K05587M1621q2675Q7529j02351m9729O8668
$$ 185056 93177 86208 -121333 -279476 -73889 -32268 -114943 -27414 -129765 -179494 -110826
7270a10826P917M43J69893J17965q8767L860m6249k32364L421J00505M6903j1451
$$ -110826 -102909 -102466 67427 185392 96625 100485 54236 -178128 -174707 -74202 -27299 -38750
7258c8750j18819L0449P0220O0274L0886K549l3001o2041J9847J29545R4829L957
$$ -38750 -157569 -127120 -56900 3374 34260 36809 3808 -58233 -38386 91159 185988 189945
7246A89945j57604k2250O8579K5098K3206k05470N8697j2820Q6555K06830j7439
$$ 189945 32341 10091 78670 103768 126974 -78496 -19799 -32619 53936 260766 243327
7235B43327L8046J24002J1499p1853k35176q3317K7482r6392m9087M6875M0858
$$ 243327 281373 405375 416874 345021 109845 26528 54010 -42382 -91469 -44594 -3736
7224c736j13617p3961l5149Q6751o5669L714R9280j2567J27148J97223j1628j85193
$$ -3736 -117353 -191314 -226463 -139712 -205381 -201667 -102387 -114954 12194 209417 197789 12596
7212A2596j37672O7985J05112k49618P1129J3495L3044N5734j70482j50455J31307
$$ 12596 -125076 -57091 48021 -201597 -130468 -116973 -83929 -28195 -198677 -349132 -217825
7201b17825J15321q5669N0876m2746k6546O2676J26233P3849l6306j16928r6620
$$ -217825 -102504 -188173 -137297 -180043 -206589 -143913 -17680 56169 19863 -97065 -193685
7190a93685J05717J65530r0736R0331n4392M553M5217m8271m6177l76Q022n6578
$$ -193685 -87968 77562 -13174 77157 22765 27318 72535 24264 -21913 -22289 -14267 -70845
7178g0845M5715J7746L4598r1543J15164R4789O4413l3433k26375Q0012O4246
$$ -70845 -25130 -7384 27214 -64329 50835 145624 210037 176604 -49771 30241 94487
7167I4487j3108O791l2585J18662l6052j00828K592J5403J1411r5008m5409j26069
$$ 94487 81379 88170 55585 174247 138195 37367 39959 55362 66773 -28235 -73644 -199713
7155a99713J12617J06618L9917L5453N1368m7454n8390p5840j09473N0449J33410
$$ -199713 -87096 19522 59439 94892 146260 98806 40416 -35424 -144897 -94448 38962
7144C8962j07174k7369J6589J5876J29164J07671m6142j28624o1928k5024j23678
$$ 38962 -68212 -95581 -78992 -63116 66048 173719 127577 -1047 -62975 -87999 -211677
7133b11677k3752J01166O6155j27027k06237O249k6650M1767p2431J70006J48384
$$ -211677 -235429 -134263 -68108 -195135 -401372 -395123 -421773 -380006 -452437 -282431 -134047
7122a34047j0372Q4697K09791j31182k70271j11905N3065p3121P5354J00748O4722
$$ -134047 -144419 -59722 150069 18887 -251384 -363289 -310224 -383345 -307991 -207243 -142521
7111a42521j705Q9244J14418m6561q4711j03771R2293J81281k17720j58978l4199
$$ -142521 -144226 -54982 59436 12875 -71836 -175607 -83314 97967 -119753 -278731 -312930
7100c12930R9632K76070J54734k18335j565J22386K6127j09911j67228M2396J89898
$$ -312930 -213298 62772 217506 -829 -2394 119992 146119 36208 -131020 -88624 101274
7089A01274l6639j46972J28005O0827l6895K8683m6529q7185j37812K5728J45542
$$ 101274 64635 -82337 45668 106495 69600 98283 51754 -35431 -173243 -147515 -1973
7078a973K9160r0646r5197j3887j07750l6879P6784j0929L0295K1129O751n796
$$ -1973 27187 -63459 -158656 -172543 -280293 -317172 -240388 -251317 -221022 -199893 -193142 -198938
7066a98938n9187Q0221J97122p4609o1242p3433j8693K5879P377R4139J85772
$$ -198938 -258125 -177904 19218 -55391 -116633 -190066 -208759 -182880 -175503 -81364 104408
7055A04408R9861M4964q6101q8540r7098l3052O8561J22124j18194j25942k0138
$$ 104408 204269 249233 163132 74592 -22506 -55558 13003 135127 16933 -109009 -129147
7044a29147k6938P2735j213n1392P3554q3213j3569K05437J21255N4210K7559
$$ -129147 -156085 -83350 -84563 -135955 -62401 -145614 -159183 46254 167509 221719 249278
7033B49278o9688j56116j22156M0151Q9925J00334l2959l5013P5270k1937n1531
$$ 249278 179590 23474 -98682 -58531 31394 131728 98769 63756 139026 117089 65558
7022F5558N7095O5481M5803j24174m5651k7549k41700k6821k0057n6820J15722
$$ 65558 122653 188134 233937 109763 64112 36563 -205137 -231958 -252015 -308835 -193113
7011a93113M4292n4677O5059l6766j48763J93708J90731n6265m6547q935O4399
$$ -193113 -148821 -203498 -138439 -175205 -323968 -130260 60471 4206 -42341 -51276 13123
7000A3123l2771M8610j37010l9024R4786O6255j7296n3293R6911j03502j71600
$$ 13123 -19648 28962 -108048 -147072 -52286 13969 -3327 -56620 40291 -63211 -234811
6989b34811P2253J08945J14853j75126J8766M4224p3330j28001O0736K04185J3482
$$ -234811 -162558 -53613 61240 -113886 -95120 -50896 -124226 -252227 -191491 12694 26176
6978B6176j27993o6070p0634r7941J22173J26231K3412P4991P8810R7931j3757
$$ 26176 -101817 -167887 -238521 -336462 -214289 -88058 -64646 10345 89155 187086 173329
6967A73329J27476m0844p1692j44264p3986M3518P3653j3960j56752l8944n7793
$$ 173329 300805 259961 188269 44005 -29981 13537 87190 73230 -83522 -122466 -180259
6956a80259J9704J1462K8573J75972J75999k12686j62310J50302J17431m6697
$$ -180259 -160555 -149093 -120520 55452 231451 18765 -143545 6757 124188 77491
6946G7491p9202Q9348o726m3964j9413j5802j28877L3527J16158O2334J17339
$$ 77491 -1711 87637 80911 36947 17534 1732 -127145 -93618 22540 84874 202213
6935B02213o775J46278O4079j03951j72707j7570k7513p8563j10877o8459j84183
$$ 202213 195438 341716 405795 301844 129137 111567 84054 5491 -105386 -173845 -358028
6924c58028l4787M9352J23604P763Q8152J09944J10514J08157K209m5855q9557
$$ -358028 -392815 -343463 -219859 -212096 -123944 -14000 96514 204671 206880 161025 71468
6913G1468P996K6052J66423j25823q2554j9101R8969k76437q1404J26406k2004
$$ 71468 79464 105516 271939 146116 63562 44461 143430 -133007 -214411 -88005 -110009
6902a10009J025j5870l1689P0557J60726K1197p8700l6225l1455l1494o2284J36485
$$ -110009 -108984 -124854 -156543 -85986 74740 95937 17237 -18988 -50443 -81937 -144221 -7736
6890g736J3543j94984o6676K8965K8332m2379Q6J72401J35279m3090l1892M4046
$$ -7736 5807 -189177 -255853 -226888 -198556 -240935 -240849 -68448 66831 23741 -8151 35895
6878C5895k9413j4040K00202m4972k5433j95389l1963j17901j09308K50689P5609
$$ 35895 6482 -7558 192644 147672 122239 -73150 -105113 -223014 -332322 -81633 -6024
6867f024P107j01232j7046j44764J9133L4449J17106J03906k4293J8817O1595
$$ -6024 1083 -100149 -117195 -261959 -242826 -208377 -91271 12635 -11658 7159 68754
6856F8754M1295p0202K3030J3248P5278j18959J4309K4389k9931n901J34841J63496
$$ 68754 110049 39847 62877 76125 151403 32444 46753 71142 41211 35310 170151 333647
6844C33647P426j86425p0848q540j698O6410o1978q8643j62266j18883J42869
$$ 333647 341073 154648 83800 75260 73562 139972 77994 -10649 -172915 -291798 -148929
6833a48929J20017l2158j18315j47250P7543J60304j09802k44929J0874P3843
$$ -148929 -28912 -61070 -179385 -326635 -249092 -88788 -198590 -443519 -432645 -358802
6823c58802j1179L8434M3487L5653J69420N2435j7481R6481o7291q6668L6972
$$ -358802 -369981 -331547 -288060 -252407 -82987 -30552 -48033 48448 -18843 -105511 -68539
6812f8539J6214r2629O1520j13452n3316K70536R4524L8016M7034j49062j98401
$$ -68539 -52325 -144954 -83434 -196886 -250202 20334 114858 152874 199908 50846 -147555
6801a47555o3647J25711J34644r9432j25846K1950J56863L7415n4009J5662K9046
$$ -147555 -211202 -85491 49153 -50279 -176125 -154175 2688 40103 -13906 1756 30802
6790C0802M413j20985q3850P5775k7267O5873O5337N0141j72129k57157k9170
$$ 30802 35215 -85770 -169620 -93845 -121112 -55239 10098 60239 -111890 -369047 -398217
6779c98217P5332J91909K19358O265m8867J36313p9449p2852L8093L5002M0870
$$ -398217 -322885 -130976 88382 94647 45780 182093 102644 29792 67885 102887 143757
6768A43757r1837r9706L6161P7820o3483q9064p8788j25320N4686l8274r4441
$$ 143757 51920 -47786 -11625 66195 2712 -86352 -165140 -290460 -235774 -274048 -368489
6757c68489K7584J97232P2856J66176M0874j34467q4734Q8711k2629m3775R4015
$$ -368489 -340905 -143673 -70817 95359 136233 1766 -82968 5743 -16886 -60661 33354
6746C3354q232K227o1983q9100q7521R2959J04620k1229N1157K6138J9727K2173
$$ 33354 25122 27349 -34634 -123734 -211255 -118296 -13676 -34905 16252 42390 62117 84290
6734H4290R0096r6926N0751k24844j90414J05408R5179J85465N6216m8292j46319
$$ 84290 174386 77460 128211 -96633 -287047 -181639 -86460 99005 155221 106929 -39390
6723c9390k5878O6768M3297n1766J45603Q0960o7517j0763l3534L8729K6150l4204
$$ -39390 -65268 1500 44797 -6969 138634 219594 152077 141314 107780 146509 172659 138455
6711A38455R9120k27n8584o8537L8769M6100K9553j18944j84912l7627J01598
$$ 138455 237575 237348 178764 110227 148996 195096 224649 105705 -79207 -116834 -15236
6700a5236P6038J6428K4660M0731K6067j61352r1220n596L0034O85P0160n2610
$$ -15236 60802 77230 101890 142621 168688 7336 -83884 -89480 -59446 -58761 11399 -41211
6688d1211n1611j17443j0140J33120m4982M690J42249O0484j39609Q227J200J4426
$$ -41211 -92822 -210265 -220405 -87285 -132267 -127577 14672 75156 -64453 -56226 -55026 -40600
6676d0600Q1959J21712K1893J16893J8958j05883j45456j71136Q3579K7834p7425
$$ -40600 41359 163071 184964 301857 320815 214932 69476 -101660 -18081 9753 -67672
6665f7672O0050J6785j17567l2058P6611J85258j46193k4387J12666m0903m0459
$$ -67672 -7622 9163 -108404 -140462 -63851 121407 -24786 -49173 63493 22590 -17869
6654a7869j23549N4160m1173J84792j8607l6658P037m5918P6912M2240j2705o1602
$$ -17869 -141418 -87258 -128431 56361 37754 1096 8133 -37785 39127 81367 68662 7060
6642G060L927J7136o7182r6204J01827K3343J6372R0611q6325p1682j8440l1937
$$ 7060 10987 28123 -39059 -135263 -33436 -10093 6279 96890 10565 -61117 -79557 -111494
6630a11494J12759Q6387j8164J2699N2571j58869r130J13389K3573M8030p6351
$$ -111494 1265 87652 69488 82187 134758 -24111 -33241 80148 103721 151751 75400
6619G5400P0629p178j04174R2546j1075J2851J0816p9778j29792k76516O2450
$$ 75400 146029 138851 34677 127223 116148 128999 139815 60037 -69755 -346271 -283821
6608b83821K53268N5687k03955k7412J39067J51036m0809K9039J33591j88819
$$ -283821 -30553 25134 -178821 -206233 -67166 83870 43061 72100 205691 16872
6598A6872j60367m01j38879j5883P7857J72878p8560n8974J69050R0866P5490
$$ 16872 -143495 -143896 -282775 -298658 -220801 -47923 -126483 -185457 -16407 74459 149949
6587A49949k2105O4397p1277m1260L4651O9177L0991j08776m4485j55424Q2160
$$ 149949 127844 192241 120964 79704 114355 183532 214523 105747 61262 -94162 -12002
6576a2002K40795n0526j07135O572j6713j84958n4073N0617J28745R4150k34912
$$ -12002 228793 178267 71132 77704 60991 -123967 -178040 -127423 1322 95472 -139440
6565a39440j16408J25009J50724P232O9698Q5097O2348n6711j89343k12271O4719
$$ -139440 -255848 -130839 19885 27117 96815 181912 244260 187549 -1794 -214065 -149346
6554a49346L2030R4394J60394r8011j26495p5764R2981Q9176q3698j6177L2969
$$ -149346 -117316 -22922 137472 39461 -87034 -162798 -69817 19359 -64339 -80516 -47547
6543d7547r5564r0459J56330O8694P071Q133o6224r5436J879m6558L6925J00958
$$ -47547 -143111 -233570 -77240 -8546 -1475 6658 -59566 -155002 -153123 -199681 -162756 -61798
6531f1798M4469j87544M78R0946m326O3062k0804O7788P1148J4069j70365Q0721
$$ -61798 -17329 -204873 -204395 -113449 -117775 -54713 -75517 -7729 63419 77488 -92877 -12156
6519a2156J08066n9041r2759P973L0993K355J00574P2130Q4585m9747p0490l8549
$$ -12156 95910 36869 -55890 -47917 -16924 -14569 86005 158135 242720 192973 122483 83934
6507H3934q3789M3047l5213j99675n3560J8054J08548n7753n345J65889j25364
$$ 83934 145 43192 7979 -191696 -245256 -227202 -118654 -176407 -181752 -15863 -141227
6496a41227L1828J18272p4776K6126J98247L4830j75635k9194L50J55377J81605
$$ -141227 -109399 8873 -65903 -39777 158470 193300 17665 -11529 -11179 144198 325803
6485C25803J079j58814J15556M1766n6454J1912r8319j08050J36037n9889R627
$$ 325803 326882 168068 283624 325390 268936 280848 182529 74479 210516 150627 160254
6474A60254j50897j17169k8455R5959q6112k20005P4465K87806J42586p4366l989
$$ 160254 9357 -107812 -136267 -40308 -126420 -346425 -271960 15846 158432 84066 80077
6463H0077j51362q5434N9396N4334J95445L7507k1001Q3474o6633r9130N6852
$$ 80077 -71285 -156719 -97323 -42989 152456 189963 168962 252436 185803 86673 143525
6452A43525o2889M0753r7587o688L7574O1313j87514j0431J74111Q2883q6420
$$ 143525 80636 121389 23802 17114 54688 116001 -71513 -81944 92167 175050 88630
6441H8630j15032l0259K7465P9622k01182j15169J13232K07012J54888j00661
$$ 88630 -26402 -56661 -29196 50426 -150756 -265925 -152693 54319 209207 108546
6431A08546k18274J24950Q7630r2972R7326j75075L434l2167o446N1021n9856
$$ 108546 -109728 15222 102852 9880 107206 -67869 -64435 -96602 -103048 -52027 -111883
6420a11883n9551l4081P2148K8369O4043J94059k1213o534k5088j78488J23686
$$ -111883 -171434 -205515 -133367 -104998 -40955 153104 131891 125357 100269 -78219 45467
6409D5467J38069m4554j59620k45988J46867J54539K7332l3270p6278Q1704P3320
$$ 45467 183536 138982 -20638 -266626 -119759 34780 62112 28842 -47436 34268 107588
6398A07588m8499N4055j36240p6547J157Q4396J47866K5822j03764m2288J5876
$$ 107588 59089 113144 -23096 -99643 -98486 -14090 133776 159598 55834 13546 29422
6387B9422L8025q4930j8618O1421l6196J46284Q0460M5800m47m9663k3694q6163
$$ 29422 67447 -17483 -36101 25320 -10876 135408 215868 261668 261221 211558 187864 101701
6375A01701j71598j61380r109J81337J24410j0400q8472j3431j64132O9978R3621
$$ 101701 -69897 -231277 -240386 -59049 65361 54961 -33511 -46942 -211074 -141096 -47475
6364d7475L5387o6676j96140j7920j22815j00566K27095J71319J79174J76880
$$ -47475 -12088 -78764 -274904 -292824 -415639 -516205 -289110 -117791 61383 238263
6354B38263j45497j46398K4680L7510j32580K3237J72803q1657M3783J30913L2438
$$ 238263 92766 -53632 -28952 8558 -124022 -100785 72018 -9639 34144 165057 197495
6343A97495R2248j11160j92939n7725O6303k1119K6876J26591j50878j19067j41293
$$ 197495 289743 178583 -14356 -72081 -5778 -26897 -21 126570 -24308 -143375 -284668
6332b84668J33834J37570J0697j02787j03445J02347o4670M0968p0990J67211
$$ -284668 -150834 -13264 -2567 -105354 -208799 -106452 -171122 -130154 -201144 -33933
6322c3933k1726M8172R3950l4631m5012r0962j6867P0636o2246l3635P4741r588
$$ -33933 -55659 -7487 86463 51832 6820 -84142 -101009 -30373 -92619 -126254 -51513 -61101
6310f1101N2749J37364R948K0244m92k0852m1493q0873j9546o2648L965P8326
$$ -61101 -8352 129012 138960 159204 158712 137860 96367 15494 -4052 -66700 -62735 15591
6298A5591L8029k9373J63510J54301j73697j17334n1310j31329o4793M4276K19729
$$ 15591 53620 24247 187757 342058 168361 51027 -283 -131612 -196405 -152129 67600
6287F7600J01985J180p546k23887j24993J85157q966L645p7412N0284j03005o7766
$$ 67600 169585 170765 163219 -60668 -185661 -504 -9470 -5825 -83237 -32953 -135958 -203724
6275b03724k15001R4484K59688J69612J2963O0266J95171m279k7357l6169J6362
$$ -203724 -418725 -324241 -64553 105059 118022 178288 373459 369180 341823 305654 322016
6264C22016n1772j85367m1188j44011j04457J47228n983j22865q2264O299J02957
$$ 322016 270244 84877 43689 -100322 -204779 -57551 -63534 -186399 -268663 -262364 -159407
6253a59407l3605j65866J25755P5648J28307J13040L3872j55558M45k1503Q2080
$$ -159407 -193012 -358878 -233123 -157475 -29168 83872 117744 -37814 -37369 -58872 23208
6242B3208L4121M0523k4643p2413j14644P8372L234k856N5838k9110q0269J37748
$$ 23208 57329 97852 73209 796 -113848 -35476 -32242 -35098 20740 -8370 -88639 49109
6230D9109K6982l6018r636j18477j52445j12618J83674J696j13054J13839J72968
$$ 49109 76091 40073 30437 -88040 -240485 -353103 -169429 -167733 -280787 -166948 6020
6219F020J48796R1620Q1054O9578j43715j10264r9839j0585N081P359k1661M0035
$$ 6020 154816 246436 327490 397068 253353 143089 43250 32665 37746 45105 23444 63479
6207F3479N6549l4852R4214J5681J1724j57149l0048k5823l0181P2593j12475
$$ 63479 120028 85176 179390 195071 206795 49646 19598 -6225 -36406 36187 -76288
6196g6288q299O7254k7161L8238o4664K1868J0895k1047p7217L0013P9183k3917
$$ -76288 -84587 -17333 -44494 -6256 -70920 -49052 -38157 -59204 -136421 -106408 -27225 -51142
6184e1142J4434o7712K8326j07223J83854J86218K243l11332j65802p5653J10072
$$ -51142 -36708 -104420 -76094 -183317 537 186755 188998 -122334 -288136 -363789 -253717
6173b53717J95780m0316o6083O081K00629M9955j93364P2143J44390j7875j26232
$$ -253717 -57937 -98253 -164336 -158255 42374 92329 -101035 -28892 115498 97623 -28609
6162b8609k90112R4869K07623n4214q9119j3133N3126p8549L4957J45180j9475
$$ -28609 -318721 -223852 -16229 -70443 -159562 -172695 -119569 -198118 -163161 -17981 -37456
6151c7456K6306P1495p6753o7378j9962p229j9294K6877k7891j44480q7749l1797
$$ -37456 -11150 60345 -16408 -83786 -103748 -110977 -130271 -103394 -131285 -275765 -363514 -395311
6139c95311R5158K43297M4707O8758J62693j31966Q4859J1596j82344j83522N3194
$$ -395311 -300153 -56856 -12149 56609 219302 87336 172195 183791 1447 -182075 -128881
6128a28881L9667j1062J23786q1105p7778l5606n820K9884N8540k1637L2895p1108
$$ -128881 -89214 -100276 23510 -57595 -135373 -170979 -176799 -146915 -88375 -110012 -77117 -148225
6116a48225l9012J0015N3690R5442L5195r2637j0452l7807P1989N9620M3668K5945
$$ -148225 -187237 -177222 -123532 -28090 7105 -85532 -95984 -133791 -61802 -2182 41486 67431
6104F7431r9771O6417j4611n5982Q7406P1847j7398n7846p5795m8564j37424O971
$$ 67431 -32340 34077 19466 -36516 50890 122737 105339 47493 -28302 -76866 -214290 -207319
6092b07319J06153J91061j16212K985J2467K2357K14803J15714j36554j7462n0105
$$ -207319 -101166 89895 -26317 -23332 -10865 11492 226295 342009 205455 187993 137888
6081A37888j9388R96j79050P5926M0559L7703J59931j60394k7206O0360q2976
$$ 137888 118500 119496 -59554 16372 56931 94634 254565 94171 66965 127325 44349
6070D4349J1272R1390M3731P8701J24317O4464P331p5804n6028J822j97023o4957
$$ 44349 55621 147011 190742 269443 393760 458224 465555 389751 333723 335545 138522 73565
6058G3565J1382q6994j22647r3479J30779K57038j41762j13844J01286j4552J30496
$$ 73565 84947 -2047 -124694 -218173 -87394 169644 27882 -85962 15324 772 131268
6047A31268k04617j03851K4894J21367r3771m5438J19278L8505N7108k258L6802
$$ 131268 -73349 -177200 -152306 -30939 -124710 -170148 -50870 -12365 44743 42485 79287
6036G9287k59731j78057N5914L2262K43114J15384r2564j586Q6946R7103J28611
$$ 79287 -180444 -358501 -302587 -270325 -27211 88173 -4391 -5977 80969 178072 306683
6025C06683r7530j19088q3065r0122R6766K3210j50328N0416k0179q979o1168
$$ 306683 209153 90065 7000 -83122 13644 36854 -113474 -63058 -83237 -92216 -153384
6014a53384N7574L4227N2812J01805o2m4608L5204k7931K0214J52649j19231k40347
$$ -153384 -95810 -61583 -8771 93034 92972 48364 83568 55637 75851 228500 109269 -131078
6002a31078J7883L8230J17931P6908Q6711P439q7531J40753j40546o8317q0951
$$ -131078 -113195 -74965 42966 119874 206585 214024 126493 267246 126700 58383 -22568
5991b2568j5725l8117R8069o2515k0069n3179m4553m0819N5536m6148j93649r889
$$ -22568 -38293 -76410 21659 -40856 -60925 -114104 -158657 -199476 -143940 -190088 -383737 -393626
5979c93626J61251K35628j03098q6599R7832K24366M6060j41995k65039K2243
$$ -393626 -232375 3253 -99845 -186444 -88612 135754 181814 39819 -225220 -202977
5969b02977J25423M2422N3002J15196K6990N7953m9332r7465o4642P3221j30568
$$ -202977 -77554 -35132 17870 133066 160056 218009 168677 71212 6570 79791 -50777
5958e0777K3875n576r8188K67167J12539j79652j54995J3158o8286j627M7487
$$ -50777 -26902 -32478 -130666 136501 249040 69388 -85607 -72449 -140735 -142362 -94875
5947i4875K15976R6219j17515j43157Q578Q5739P1476l7218o707m8860j27061
$$ -94875 121101 217320 99805 -43352 -34774 50965 122441 85223 78516 29656 -97405
5936i7405n7946j44538M315J87140P3591r515O2879j25133j01423J80R3598J57960
$$ -97405 -155351 -299889 -295574 -108434 -34843 -44358 18521 -106612 -208035 -207855 -114257 43703
5924D3703Q0821j17218r6620k2055K31833n554j43321k41152m6001Q9249l6244
$$ 43703 124524 7306 -89314 -111369 120464 114910 -28411 -269563 -315564 -226315 -262559
5913b62559l4350k4749J88605J00149n5232p0448n0289K1826J17186Q8041l2774
$$ -262559 -296909 -321658 -133053 -32904 -88136 -158584 -208873 -187047 -69861 18180 -14594
5902a4594R390l6467m2374P5264O8148J84363j17662L9430J2385k6545m3369O8255
$$ -14594 -5204 -41671 -84045 -8781 59367 243730 126068 165498 177883 151338 107969 176224
5890A76224O9176j26259j60724j46470P8809J28098M981k451k121n7359k23752
$$ 176224 245400 119141 -41583 -188053 -109244 18854 23835 21384 19263 -38096 -261848
5879b61848K0886m1221J0953L8588K3000j08032M2896K19816J25957K0774j33384
$$ -261848 -240962 -282183 -271230 -232642 -209642 -317674 -274778 -54962 70995 91769 -41615
5868d1615k3737k0966j0441j2359L4440k5127r7027K9240r0209K1001P4289J96738
$$ -41615 -65352 -86318 -96759 -109118 -74678 -99805 -196832 -167592 -257801 -236800 -162511 34227
5856C4227R7989J60840J01780j84451j18012O6995Q7336j36633j17473m0418M0914
$$ 34227 132216 293056 394836 210385 92373 159368 246704 110071 -7402 -47820 -6906
5845f906j5369m7320P9556j08152o2356j40980J86545J13587J51298P4080j56436
$$ -6906 -22275 -69595 9961 -98191 -160547 -301527 -114982 -1395 149903 223983 67547
5834F7547K1535k3616p2141K6306M2972j7838J1754K2179j19493K3044N1686j25216
$$ 67547 89082 65466 -6675 19631 62603 44765 56519 78698 -40795 -17751 33935 -91281
5822i1281j95943m7341P5762M1652q6062J9781K38640j236j01598O5937M8111
$$ -91281 -287224 -334565 -258803 -217151 -303213 -283432 -44792 -46028 -147626 -81689 -33578
5811c3578k2977k1004N1932J08507k910j11783l093J6735J14158N6417P1288j04356
$$ -33578 -56555 -77559 -25627 82880 79970 -31813 -34906 -18171 95987 152404 223692 119336
5799A19336j42116j98567J556J92572P8822N6907N9521o0058j29578k1236J17500
$$ 119336 -22780 -221347 -219791 -27219 51603 108510 168031 107973 -21605 -42841 74659
5788G4659k9161j36541q8059L9599N6209m125L3098j60782N3542L3466o2322l447
$$ 74659 45498 -91043 -179102 -139503 -83294 -87419 -54321 -215103 -161561 -128095 -190417 -193864
5776a93864j1700j05118J13857J55035p2301r1981o4599L2597K5461P3129J6475
$$ -193864 -205564 -310682 -196825 -41790 -114091 -206072 -270671 -238074 -212613 -139484 -123009
5765a23009M5454o4661J03706K3218q0617M5782K8504k9900m3041J60707K35820
$$ -123009 -77555 -142216 -38510 -15292 -95909 -50127 -21623 -51523 -94564 66143 301963
5754C01963j78773k56931K8404j7305r0827R5142N9947j46252m983r573J97833
$$ 301963 123190 -133741 -105337 -122642 -213469 -118327 -58380 -204632 -209615 -219188 -21355
5743b1355J10815k5654l9267j48165q8104K9465J25659k6140J30335r9298j30413
$$ -21355 89460 63806 24539 -123626 -211730 -182265 -56606 -82746 47589 -51709 -182122
5732a82122n0194k2776P7541j58855J3642J89802r07m9972J0625k3872N2451R4807
$$ -182122 -232316 -255092 -177551 -336406 -322764 -132962 -133869 -183841 -173216 -197088 -144637 -49830
5720d9830o1977N1431Q4509Q008q2723J99794n6511Q0278l8049m2964j96553q9093
$$ -49830 -111807 -60376 24133 32141 -50582 149212 92701 172979 134930 91966 -104587 -193680
5708a93680k263l1487M6984J33803Q7642k4961k2929p6848n8759M90r7508L0951
$$ -193680 -195943 -227430 -180446 -46643 40999 16038 -6891 -83739 -142498 -142008 -239516 -208565
5696b08565Q272Q3391P3443P3123m0445j2851L6440K3469k8241n4224J06696p7235
$$ -208565 -200293 -116902 -43459 29664 -10781 -23632 12808 36277 8036 -46188 60508 -16727
5684a6727J8238N7651Q7867J8577K4043j02603j65561j13946m0519K8738P7522
$$ -16727 1511 59162 147029 165606 189649 87046 -78515 -192461 -232980 -204242 -126720
5673a26720K2345O3296j6002r4333N9838L2799n9717j23343O9104K9394j41955
$$ -126720 -104375 -41079 -57081 -151414 -91576 -58777 -118494 -241837 -172733 -143339 -285294
5662b85294m1689J44367j9059P8415K32503N3021j7659j5957j19066k58472J07842
$$ -285294 -326983 -182616 -201675 -123260 109243 162264 144605 128648 9582 -248890 -141048
5651a41048q302o6773N0012P9314O6435P0398J93214J7950o8496r8624n0481j15549
$$ -141048 -149350 -216123 -166111 -86797 -20362 50036 243250 261200 192704 94080 43599 -71950
5639g1950K8319J1567K024O634J27389j27444l5639K0797L7401j8343j08131J10587
$$ -71950 -43631 -32064 -30040 -23406 103983 -23461 -59100 -38303 -902 -19245 -127376 -16789
5627a6789J51365m3954K5402p3963j79190k04266J32375K73647m6267N7506L3954
$$ -16789 134576 90622 116024 42061 -137129 -341395 -209020 64627 18360 75866 109820
5616A09820q8521q104q6710j36373O777q8245M7781o679N4825j25944q1834J32700
$$ 109820 21299 13195 -73515 -209888 -203111 -291356 -243575 -250254 -195429 -321373 -403207 -270507
5604b70507J12881J28213l8940q0679k18796j7725P5472J35487o7859j10129J9486
$$ -270507 -157626 -29413 -68353 -149032 -367828 -385553 -310081 -174594 -242453 -352582 -333096
5593c33096N8954Q0651N8477O2145M396Q5235k3462n5375k3063p2458j0870M8264
$$ -333096 -274142 -193491 -135014 -72869 -68473 16762 -6700 -62075 -85138 -157596 -168466 -120202
5581a20202R6951Q7152J41011M0295m0187M1556R3149r0527k00499k08728j09361
$$ -120202 -23251 63901 204912 245207 205020 246576 339725 249198 48699 -160029 -269390
5570b69390J00980J73054j3237j36954J01540L5075k1640K9017m6771j12174j26134
$$ -269390 -168410 4644 -8593 -145547 -44007 -8932 -30572 -1555 -48326 -160500 -286634
5559b86634j25881j57232J53769J44306J30141N9605J39812R0867J73919p6135
$$ -286634 -412515 -569747 -415978 -271672 -141531 -81926 57886 148753 322672 246537
5549B46537j70313m3486m4521l8557m6530j72919j0244J1271J28629R8982l8975
$$ 246537 76224 32738 -11783 -50340 -96870 -269789 -280033 -268762 -140133 -41151 -80126
5538h0126m1811k1563J79362J02493l2426O8500N3739q5371l7028o0643l8661
$$ -80126 -121937 -143500 35862 138355 105929 174429 228168 142797 105769 45126 6465
5527F465j66165j2634j5632k4567J26775R1283J10829q6653j51004j14706L6002
$$ 6465 -159700 -172334 -187966 -212533 -85758 5525 116354 29701 -121303 -236009 -200007
5516b00007J19549J11132k5043k9965M1373J53217p9718n7098q1691Q003J42883
$$ -200007 -80458 30674 5631 -24334 17039 170256 90538 33440 -48251 -40248 102635
5505A02635J36094M2295L676j09240j46709m8983J18699Q2448k9159J75624m2217
$$ 102635 238729 281024 284700 175460 28751 -20232 98467 180915 151756 327380 285163
5494B85163j73019l2131o5806J13059J1862K229J4180p304J1759m2343o071j6636
$$ 285163 112144 80013 14207 127266 139128 141357 155537 148233 159992 117649 111578 94942
5482I4942q9357r7266j40973J3655O1797J36010n1311o1423K36498J71118K774
$$ 94942 5585 -91681 -232654 -218999 -157202 -21192 -72503 -133926 102572 273690 276464
5471B76464j06379j17815O4627j12643j55879n977J29356L6857M8417n8654J01102
$$ 276464 170085 52270 116897 4254 -151625 -157602 -28246 8611 57028 -1626 99476
5460I9476q8703O9607K74059O7545n7609j70138j10755j01311N3038J57389n8632
$$ 99476 10773 80380 354439 421984 364375 194237 83482 -17829 35209 192598 133966
5449A33966k4177J68578m567j39693j45351k99725j58988K02189J90842P835P3763
$$ 133966 109789 278367 273800 134107 -11244 -310969 -469957 -267768 -76926 -69091 4672
5438D672J74043r5947R3429k84950j86260J15232J84786j9516n4892j3773l8960
$$ 4672 178715 82768 176197 -108753 -295013 -179781 5005 -14511 -69403 -83176 -122136
5427a22136K4179K10523k3639j90919o0535O7767J79968J92733M0253k36911j24581
$$ -122136 -97957 112566 88927 -101992 -162527 -94760 85208 277941 318194 81283 -43298
5416d3298K4205K7470J15025J35091o027j79562k04617j1988m6444N2190o5928
$$ -43298 -19093 8377 123402 258493 252466 72904 -131713 -143701 -190145 -137955 -203883
5405b03883J01337R1387Q1411p604k905m977n0123j15346k32157j2302K46714
$$ -203883 -102546 -11159 70252 62648 59743 54766 4643 -110703 -342860 -355162 -108448
5394a08448K97756j40196l43787J7087J27893J1769J6769q0380l3578M0830M7871
$$ -108448 189308 49112 -294675 -277588 -149695 -137926 -121157 -201537 -235115 -194285 -146414
5383a46414k5011J06029M9148m3535p2639k5114R6168N823p1586J8455m7453J65488
$$ -146414 -171425 -65396 -16248 -59783 -132422 -157536 -61368 -55545 -127131 -108676 -156129 9359
5371I359J35681j3805L6726k5184n3517P4560K0476j15404j58011k056L7286l8654
$$ 9359 145040 131235 167961 142777 89260 163820 184296 68892 -89119 -91175 -53889 -92543
5359i2543j37587q4797R3002L56150P6565k0223q6522K5534o1542n2531J62625
$$ -92543 -230130 -314927 -221925 134225 210790 190567 104045 129579 68037 15506 178131
5348A78131q4064r8966j31586J6233r1099j43087J56280J86980N8420L3301q1599
$$ 178131 94067 -4899 -136485 -120252 -211351 -354438 -198158 -11178 47242 80543 -1056
5337a056q8133K03025N0520j43595j56407l1942J00121n0161j1169q145r7523
$$ -1056 -89189 113836 164356 20761 -135646 -167588 -67467 -117628 -128797 -136942 -234465
5326b34465J29231J87394R882k09799J0845K02506j00304P4647J25429r9849o6682
$$ -234465 -105234 82160 92042 -117757 -106912 95594 -4710 69937 195366 95517 28835
5315B8835K2505N4443O0700n5256k4741K6384o7701M8677J32k00535r5923l0464
$$ 28835 51340 105783 166483 111227 86486 112870 45169 93846 93978 -106557 -202480 -232944
5303b32944P5862j9199J2083N5405K5312n6680L0044m0013j70123J0622N3560
$$ -232944 -157082 -176281 -164198 -108793 -83481 -140161 -110117 -150130 -320253 -309631 -256071
5292b56071O4391O3382l4223o2062k0994J91685L9843k6007j06035K3497O318
$$ -256071 -191680 -128298 -162521 -224583 -245577 -53892 -14049 -40056 -146091 -122594 -116276
5281a16276j34355N6676K7854O1709O4295J31728o6847k58383l991R8554Q0248
$$ -116276 -250631 -193955 -166101 -104392 -40097 91631 24784 -233599 -237590 -139036 -58788
5270e8788P7126o137o9457N5807L2225M1040Q998o6876n7916K21379J53323j52176
$$ -58788 18338 12201 -57256 -1449 30776 71816 80814 13938 -43978 177401 330724 178548
5258A78548j28109l129k5077p4079M1740L982o1611J45962K26307r3474j43414
$$ 178548 50439 47310 22233 -51846 -10106 -6124 -67735 78227 304534 211060 67646
5247F7646j60795j14787O1544J28888l7182j79935L3043J21309J59869m2250m0836
$$ 67646 -93149 -207936 -146392 -17504 -54686 -234621 -201578 -80269 79600 37350 -3486
5236c486j9230O5025J66119P2827J0826J3670m6507k02323p4282J54116j08789
$$ -3486 -22716 42309 208428 281255 292081 305751 259244 56921 -17361 136755 27966
5225B7966J10390K8442N1451J9984o045o6631K0642o4028j13363K7563N1368j99954
$$ 27966 138356 166798 218249 238233 232188 165557 186199 122171 8808 36371 87739 -112215
5213a12215j18027J53705L9863r0345o8785J2232O3846J22183p9939r7582p1606
$$ -112215 -230242 -76537 -36674 -127019 -195804 -183572 -119726 2457 -77482 -175064 -246670
5202b46670J88162J74248k7088r4999k16721j47618p501J4953R8134M9768k4396
$$ -246670 -58508 115740 88652 -6347 -223068 -370686 -378187 -363234 -265100 -215332 -239728
5191b39728l467l6367K29428O4889j17798R5578o3099K9163N8556K4802m8053
$$ -239728 -243195 -279562 -50134 14755 -103043 -7465 -70564 -41401 17155 41957 -6096
5180f096J9933K9860q089q1126M1945k8556k5273k7661K34779j31971J1594p0470
$$ -6096 13837 43697 35608 -45518 -3573 -32129 -57402 -85063 149716 17745 29339 -41131
5168d1131j38472O5344N5556J4516j31495J2483J73121J2736n4198m1966M6035
$$ -41131 -179603 -114259 -58703 -44187 -175682 -163199 9922 22658 -31540 -73506 -27471
5157b7471J68368p7806j1715J7695k43986j63438N9570j2439O1372J97869J56332
$$ -27471 140897 63091 51376 69071 -174915 -338353 -278783 -291222 -229850 -31981 124351
5146A24351N7476M9191m8061p2721q1639m7903m7584N0365j16933Q3884M6763
$$ 124351 181827 231018 182957 110236 28597 -19306 -66890 -16525 -133458 -49574 -2811
5135b811m3092J12809p8599k5269J16115M2078j33295l2293j12609Q6893J19287
$$ -2811 -45903 66906 -11693 -36962 79153 121231 -12064 -44357 -156966 -70073 49214
5124D9214J02993N9915P7247j20636k03431k8642N9925P5958j30265n4080J90973
$$ 49214 152207 212122 289369 168733 -34698 -63340 -3415 72543 -57722 -111802 79171
5113G9171Q5983n7372j07201o4601n1819k3080j5746j16662Q198J50583J05523
$$ 79171 165154 107782 581 -64020 -115839 -138919 -154665 -271327 -263129 -112546 -7023
5102g023J09002q1933K4774R4425K8817j50649j09640p2618j11958n5229K7002
$$ -7023 101979 20046 44820 139245 168062 17413 -92227 -164845 -276803 -332032 -305030
5091c05030O8091j4123n7846Q8133K95582K29164n5222j03602k33566q9356Q3660
$$ -305030 -236939 -251062 -308908 -220775 74807 303971 248749 145147 -88419 -177775 -94115
5080i4115P7652j0064J46892M6176o3374m257n4114k29884R0394J42908K30004
$$ -94115 -16463 -26527 120365 166541 103167 98910 44796 -185088 -94694 48214 278218
5069B78218J09505k3097j72381k0156j55374J027j26223n2682J22595m0794l4273
$$ 278218 387723 364626 192245 172089 16715 17742 -108481 -161163 -38568 -79362 -113635
5058a13635p1520J03287L8858j11872q7203j2461K5830N1905Q9474j099M6275
$$ -113635 -185155 -81868 -43010 -154882 -242085 -254546 -228716 -176811 -87337 -88436 -42161
5047d2161J0377J11574n6965J07522J53559n7910j55928j67722l7065O6863R9328
$$ -42161 -31784 79790 22825 130347 283906 225996 70068 -97654 -134719 -67856 31472
5036C1472Q7316j86j57011j76831m0094J49952K39249j12348j25700K7559q029
$$ 31472 118788 118602 -38409 -215240 -255334 -105382 133867 21519 -104181 -76622 -84651
5025h4651Q8222l5469l4790p8247j66843Q1950J18925Q7911J6120j26670Q8182
$$ -84651 3571 -31898 -66688 -144935 -311778 -229828 -110903 -22992 -6872 -133542 -45360
5014d5360J86106K60439o8288j22213o9573j19493n8292n3123n6506L6237j3416
$$ -45360 140746 401185 332897 210684 141111 21618 -36674 -89797 -146303 -110066 -123482
5003a23482j06238J27299N9310K1669P0694R9087O4776R9546l5487k0059j612
$$ -123482 -229720 -102421 -43111 -21442 49252 148339 213115 312661 277174 257115 255503
4992B55503R3391j21250j997n7743p9687l2928r8436p9494m3332J97645L3157
$$ 255503 348894 227644 225647 167904 88217 55289 -43147 -122641 -165973 31672 64829
4981F4829m9871j8024R925J16736j26456j78689j6323j29301J47810J00759J86142
$$ 64829 14958 -3066 6859 123595 -2861 -181550 -197873 -327174 -179364 -78605 107537
4970A07537J26984n687m4564j94154j14419p8271Q3363j09952O9640Q362j02630
$$ 107537 234521 228834 184270 -9884 -124303 -202574 -119211 -229163 -159523 -151161 -253791
4959b53791j31230L9961M1462o5830J20692P1636n1081M0172J67256J30549j70602
$$ -253791 -385021 -345060 -303598 -369428 -248736 -177100 -228181 -188009 -20753 109796 -60806
4948f0806r5470J25044m030J06126Q0575L1694j4375N40k0794p2541n2975K2957
$$ -60806 -156276 -31232 -35262 70864 151439 183133 168758 169298 148504 75963 22988 45945
4936D5945L1698K20574P312j92833l0350q1127k57591p5655L22603L8497j3075
$$ 45945 77643 298217 305529 112696 82346 1219 -256372 -332027 -9424 29073 15998
4925A5998M7363j7289l0148L1671k6114r1501q5810J98366J11614k07219l09943
$$ 15998 63361 46072 15924 47595 21481 -70020 -155830 42536 154150 -53069 -363012
4914c63012R3817J77946J8913P1778Q3630Q9189K0872M3185M1954P4708J7227
$$ -363012 -269195 -91249 -72336 -558 83072 172261 193133 236318 278272 352980 370207
4903C70207r0703j60825p7350O7607r6044j69522k5670L6663J06844Q3261K7196
$$ 370207 279504 118679 41329 108936 12892 -156630 -182300 -145637 -38793 44468 71664
4892G1664p3112K8598p0445j7726k1039J43234J55253k60309j58915P7574J09989
$$ 71664 -1448 27150 -43295 -61021 -82060 61174 216427 -43882 -202797 -125223 -15234
4881a5234P3115J65131O8111j86722q7749O0721q4390j60030j31116j06097Q029
$$ -15234 57881 223012 291123 104401 16652 77373 -7017 -167047 -298163 -404260 -396231
4870c96231L2701L34492Q8908M4616j10362p1053K12J00193J32460L4753m1829
$$ -396231 -363530 -29038 59870 104486 -5876 -76929 -76717 23476 155936 190689 148860
4859A48860P8479n9009j32619m2958m9003j90654o7552R4177J12843N157L8991
$$ 148860 227339 168330 35711 -7247 -56250 -246904 -314456 -220279 -107436 -102279 -63288
4848f3288J14835n7441j21958J38581j8730j0983j6097j37738k7066J09202J05120
$$ -63288 51547 -5894 -127852 10729 -8001 -18984 -35081 -172819 -199885 -90683 14437
4837A4437K3864o1933K2171J6568M9566K5208o94j25656r9142N7657Q6162j61160
$$ 14437 38301 -23632 -1461 15107 64673 89881 89187 -36469 -135611 -77954 8208 -152952
4825a52952k5611K00905K5031L5506J47195J13099j74996k23697J28791M0501
$$ -152952 -178563 22342 47373 82879 230074 343173 168177 -55520 73271 113772
4815A13772j46372j40771O0457L315l2686J64614N5386J09006o4698K8595J26040
$$ 113772 -32600 -173371 -112914 -109599 -142285 22329 77715 186721 122023 150618 276658
4804B76658o9561o0382r5089q0555O9803J18799n1080Q0727M1684j3354j13100
$$ 276658 207097 146715 51626 -28929 40874 159673 108593 189320 231004 217650 104550
4793A04550p1538l6469k15000M6544Q7746r169L9438Q3526q2156n5089r2833K5353
$$ 104550 33012 -3457 -218457 -171913 -84167 -93336 -53898 29628 -52528 -107617 -200450 -175097
4781a75097R877J56945n3252l4889q476j04095Q9699R7133K5797Q947j06965j17003
$$ -175097 -165220 -8275 -61527 -96416 -104892 -208987 -119288 -22155 3642 12589 -94376 -211379
$$ [...]
##END NTUPLES=NMR SPECTRUM
##END=
