##TITLE=Analysis number 318098
Compound Code cc 09710
Project Code adrs
Chemist Name fudan
##JCAMPDX= 6.0         $$ Bruker NMR JCAMP-DX V2.0
##DATA TYPE= NMR SPECTRUM
##DATA CLASS= NTUPLES
##ORIGIN= Bruker BioSpin GmbH
##OWNER= nmr
$$ XWIN-NMR		Version 3.5
$$ Wed Mar 15 11:22:18 2006 GMT Standard Time (UT+0h)  MAYBRIDGE\nmr@NMR_250MHZ
##.OBSERVE FREQUENCY= 250.131544655141
##.OBSERVE NUCLEUS= ^1H
##.ACQUISITION MODE= SIMULTANEOUS (DQD)
##.ACQUISITION SCHEME= undefined
##.AVERAGES= 16
##.DIGITISER RES= 18
##SPECTROMETER/DATA SYSTEM= dpx250
##.PULSE SEQUENCE= zg30
##.SOLVENT NAME= CDCl3
##.SHIFT REFERENCE= (INTERNAL, CDCl3, 0, 16.522)
##AUDIT TRAIL= $$ (NUMBER, WHEN, WHO, WHERE, WHAT)
$$ ##TITLE= Audit trail, XWIN-NMR		Version 3.5
$$ ##JCAMPDX= 5.01
$$ ##ORIGIN= Bruker BioSpin GmbH
$$ ##OWNER= nmr
$$ C:\u/data/dgb/nmr/ADRS/730/pdata/1/auditp.txt
$$ ##AUDIT TRAIL=  $$ (NUMBER, WHEN, WHO, WHERE, WHAT)
(   1,<2006-03-15 11:21:55.38 +000>,<MAYBRIDGE\nmr>,<NMR_250MHZ>,
      <created by zg, POWCHK disabled, PULCHK disabled
       configuration hash MD5:
       84 BC 41 DB A1 6E 1D 46 DA 25 12 A5 C1 ED C5 3A
       data hash MD5: 64K
       AE 61 3E 15 EF 09 A2 30 60 C0 B3 EB 55 F9 34 E1>)
(   2,<2006-03-15 11:22:08.63 +000>,<MAYBRIDGE\nmr>,<NMR_250MHZ>,
      <Start of raw data processing
       ef LB = 0.3 FT_mod = 6 PKNL = 1 SI = 32K 
       data hash MD5: 32K
       3B 64 12 0E A9 D6 10 34 F7 36 5E 90 CC 8F E7 88>)
(   3,<2006-03-15 11:22:10.16 +000>,<MAYBRIDGE\nmr>,<NMR_250MHZ>,
      <apk 
       data hash MD5: 32K
       70 F4 B4 80 2C 86 65 DF 5A 4E E1 9F E3 11 FB FD>)
(   4,<2006-03-15 11:22:10.96 +000>,<MAYBRIDGE\nmr>,<NMR_250MHZ>,
      <abs ABSG = 5 
       data hash MD5: 32K
       45 DF 51 1B 20 18 93 22 CA 98 BB DD CE EF 9A 59>)
$$ ##END=
$$ 
$$ hash MD5
$$ 81 87 E7 51 7E BF F2 29 7B 5C D2 1C A7 FF 5A 31
##$RELAX= 
##$RELAX= 
##$RELAX= 
##$RELAX= 
##$RELAX= 
##$RELAX= 
##$RELAX= 
$$ Bruker specific parameters
$$ --------------------------
##$DU= <C:\u>
##$EXPNO= 730
##$NAME= <ADRS>
##$PROCNO= 1
##$TYPE= <nmr>
##$USER= <dgb>
##$AMP= (0..31)
100 100 100 100 100 100 100 100 100 100 100 100 100 100 100 100 100 100 
100 100 100 100 100 100 100 100 100 100 100 100 100 100 
##$AQSEQ= 0
##$AQ_mod= 3
##$AUNM= <au_zg>
##$AUTOPOS= <18 >
##$BF1= 250.13
##$BF2= 250.13
##$BF3= 250.13
##$BF4= 250.13
##$BF5= 500.13
##$BF6= 500.13
##$BF7= 500.13
##$BF8= 500.13
##$BYTORDA= 1
##$CFDGTYP= 0
##$CFRGTYP= 5
##$CHEMSTR= <none>
##$CNST= (0..31)
1 1 145 1 1 1 1 1 1 1 1 1 1 1 1 1 1 1 1 1 1 1 1 1 1 1 1 1 1 1 1 1 
##$CPDPRG= <>
##$CPDPRG1= <>
##$CPDPRG2= <>
##$CPDPRG3= <>
##$CPDPRG4= <mlev>
##$CPDPRG5= <mlev>
##$CPDPRG6= <mlev>
##$CPDPRG7= <mlev>
##$CPDPRG8= <mlev>
##$CPDPRGB= <>
##$CPDPRGT= <>
##$D= (0..31)
0 1 0 0 0 0 0 0 0 0.06 0 0 0 0 0 0 0.0002 0 0 0 0 0 0 0 0 0 0 0 0 0 0 
0 
##$DATE= 1142421714
##$DBL= (0..7)
120 120 120 120 120 120 120 120 
##$DBP= (0..7)
150 150 150 150 150 150 150 150 
##$DBP07= 0
##$DBPNAM0= <>
##$DBPNAM1= <>
##$DBPNAM2= <>
##$DBPNAM3= <>
$$ [...]
##$SUBNAM7= <"">
##$SUBNAM8= <"">
##$SUBNAM9= <"">
##$SW= 20.6930455092707
##$SWIBOX= (0..15)
0 0 3 0 0 0 0 0 0 0 0 0 0 0 0 0 
##$SW_h= 5175.983436853
##$TD= 65536
##$TD0= 1
##$TE= 294.16
##$TE2= 300
##$TE3= 300
##$TEG= 300
##$TL= (0..7)
0 120 120 120 120 120 120 120 
##$TP= (0..7)
150 150 150 150 150 150 150 150 
##$TP07= 0
##$TPNAME0= <>
##$TPNAME1= <>
##$TPNAME2= <>
##$TPNAME3= <>
##$TPNAME4= <>
##$TPNAME5= <>
##$TPNAME6= <>
##$TPNAME7= <>
##$TPOAL= (0..7)
0.5 0.5 0.5 0.5 0.5 0.5 0.5 0.5 
##$TPOFFS= (0..7)
0 0 0 0 0 0 0 0 
##$TUNHIN= 0
##$TUNHOUT= 0
##$TUNXOUT= 0
##$USERA1= <user>
##$USERA2= <user>
##$USERA3= <user>
##$USERA4= <user>
##$USERA5= <user>
##$V9= 5
##$VALIST= <valist>
##$VCLIST= <CCCCCCCCCCCCCCC>
##$VD= 0
##$VDLIST= <DDDDDDDDDDDDDDD>
##$VPLIST= <PPPPPPPPPPPPPPP>
##$VTLIST= <TTTTTTTTTTTTTTT>
##$WBST= 1024
##$WBSW= 4
##$XGAIN= (0..3)
0 0 0 0 
##$XL= 0
##$YL= 0
##$YMAX_a= 205923
##$YMIN_a= -224796
##$ZGOPTNS= <>
##$ZL1= 120
##$ZL2= 120
##$ZL3= 120
##$ZL4= 120
##$ABSF1= 16.522
##$ABSF2= -4.171173
##$ABSG= 5
##$ABSL= 3
##$ALPHA= 0
##$AQORDER= 0
##$ASSFAC= 0
##$ASSFACI= 0
##$ASSFACX= 0
##$ASSWID= 0
##$AUNMP= <proc_1d>
##$AZFE= 0.1
##$AZFW= 0.1
##$BCFW= 0
##$BC_mod= 0
##$BYTORDP= 0
##$COROFFS= 0
##$CY= 12.5
##$DATMOD= 1
##$DC= 0
##$DFILT= <>
##$DTYPP= 0
##$F1P= 14.0000005364418
##$F2P= -0.99999901652339
##$FCOR= 0.5
##$FTSIZE= 32768
##$FT_mod= 6
##$GAMMA= 0
##$GB= 0
##$INTBC= 1
##$INTSCL= 1
##$ISEN= 128
##$LB= 0.3
##$LEV0= 0
##$LPBIN= 0
##$MAXI= 10000
##$MC2= 0
##$MEAN= 0
##$ME_mod= 0
##$MI= 0
##$NCOEF= 0
##$NC_proc= -5
##$NLEV= 6
##$NOISF1= 0
##$NOISF2= 0
##$NSP= 0
##$NTH_PI= 0
##$NZP= 0
##$OFFSET= 16.522
##$PC= 1
##$PHC0= 176.1561
##$PHC1= 8.698471
##$PH_mod= 1
##$PKNL= yes
##$PPARMOD= 0
##$PSCAL= 4
##$PSIGN= 0
##$REVERSE= no
##$SF= 250.13
##$SI= 32768
##$SIGF1= 0
##$SIGF2= 0
##$SINO= 400
##$SIOLD= 32768
##$SREGLST= <1H.CDCl3>
##$SSB= 0
##$STSI= 32768
##$STSR= 0
##$SW_p= 5175.98343685301
##$SYMM= 0
##$S_DEV= 0
##$TDeff= 65536
##$TDoff= 0
##$TI= <Analysis number 999999
Compound Code 99
Book Reference 9
Project Code 9>
##$TILT= no
##$TM1= 0
##$TM2= 0
##$TOPLEV= 0
##$USERP1= <user>
##$USERP2= <user>
##$USERP3= <user>
##$USERP4= <user>
##$USERP5= <user>
##$WDW= 1
##$XDIM= 32768
##$YMAX_p= 422450419
##$YMIN_p= -1370675
$$ End of Bruker specific parameters
$$ ---------------------------------
##NTUPLES= NMR SPECTRUM
##VAR_NAME=  FREQUENCY,     SPECTRUM/REAL,   SPECTRUM/IMAG
##SYMBOL=    X,             R,               I
##VAR_TYPE=  INDEPENDENT,   DEPENDENT,       DEPENDENT
##VAR_FORM=  AFFN,          ASDF,            ASDF
##VAR_DIM=   32768,         32768,           32768
##UNITS=     HZ,            ARBITRARY UNITS, ARBITRARY UNITS
##FACTOR=    0.157963299565203, 1,           1
##FIRST=     4132.6476996994, 0,             0
##LAST=      -1043.33573715361, 0,           0
##MIN=       -1043.33573715361, -1370675,    0
##MAX=       4132.6476996994, 422450419,     0
$$ Real data points
##PAGE= N=1
##DATA TABLE= (X++(R..R)), XYDATA
$$ [...]
28396 576855 525779 494741 328169 88647 -95664 -122133 93764 285350 13526 -121593
28386 -121593 -9648 95368 -36790 134139 381886 140578 -218183 -174167 -44167 -182878
28376 -182878 -240186 -271599 246634 470700 606032 361790 -168778 -287047 -236284 -313952
28366 -313952 -172712 235932 573583 612729 868121 929079 851007 483135 685421 428808
28356 428808 162713 -95121 -296639 -100403 215980 341654 85278 -127590 -49898 -227005
28346 -227005 -482680 -494581 -316466 -85022 169193 -101052 -195150 168389 165470 314654
28336 314654 616322 915542 912115 717704 733063 899180 888358 823258 481182 389309 345414
28325 345414 576507 756150 559429 826138 789994 698629 606622 359343 23306 -514953
28315 -514953 -295652 120814 409747 377462 46505 5590 97511 17481 267296 620723
28305 620723 536263 182685 226459 -11636 76608 -62713 -227901 -301852 -482269 -424229
28295 -424229 -13835 -263359 -201224 203146 144809 -78332 -210529 -117312 -222159 -322823
28285 -322823 -330309 -32630 250546 123116 -79964 -145726 -378471 -458169 -502476 -92288
28275 -92288 282571 225937 -52171 -265820 -87312 257401 386011 552556 658654 831938
28265 831938 561921 402889 502513 461572 80803 -309777 -353613 -111814 -47892 -182958
28255 -182958 14604 25719 -65161 62794 409536 574372 342527 427811 573211 608936
28245 608936 245019 116121 -227910 -295738 -203117 -234744 -110490 -247816 -212468 -405649
28235 -405649 -269064 -351956 -615682 -630535 -279215 -391426 -508775 -433681 -665270 -703821
28225 -703821 -724874 -482536 -640947 -876562 -722838 -583007 -518113 -553428 -383179 -3174
28215 -3174 97 -132843 131885 293674 347317 20907 -179258 -198520 -332142 87790 289373
28204 289373 431040 243140 32598 414552 506652 238237 474325 506043 137782 -27189
28194 -27189 47596 -87062 -281139 -170449 -204947 -230020 -154718 -263442 -184468 -2675 30535
28183 30535 270584 412826 322186 -143108 -828581 -873668 -366244 -197224 -204167 -483978
28173 -483978 -203623 38079 203859 449330 591353 559314 552294 455092 127214 -198665
28163 -198665 -298156 -556865 -624674 -250708 -48090 26316 236641 -10175 -376986 -550822
28153 -550822 -452913 -512490 -156004 255220 185240 221588 -10065 185285 203298 -96805
28143 -96805 -101253 183077 -323378 -342195 215427 443375 305715 282409 189666 -274114 -215186
28132 -215186 -212722 -47309 -172039 -33682 187068 240850 126758 196631 222086 56407
28122 56407 26866 106975 237031 622420 523532 296163 288843 182991 456491 634811 479291
28111 479291 286602 567772 838179 674899 682396 800622 470336 224919 82531 -241324
28101 -241324 -375384 -552396 -564742 -459884 -255350 -156414 -252490 -700983 -632656 -601965
28091 -601965 -71828 153144 154801 520219 232639 -190215 -250715 -116876 -20509 -83645
28081 -83645 -38649 83630 49629 -48302 -187853 -240590 -343706 45653 207099 243510 94308
28070 94308 -83997 -65456 -29702 71161 22725 400003 782600 558255 159136 -272648
28060 -272648 -417993 -570112 -77006 327470 277639 -218535 -706821 -655819 -507075 -527548
28050 -527548 -440574 -207294 -148914 -393175 -135193 -122050 -223359 -461260 -653272 -277489
28040 -277489 -47023 374183 623971 596564 536558 296926 204568 201693 423763 389909 412929
28029 412929 100697 -60433 156992 178965 164851 572050 421965 24769 -165806 -111831
28019 -111831 140627 524244 800331 979019 617602 452155 396650 130825 166873 516748
28009 516748 755216 445983 39803 -87689 -239753 -361372 -432048 -469735 -615184 -394816
27999 -394816 -178658 -216851 -479325 -231353 34969 -101437 -506187 -412257 -226502 -193240
27989 -193240 -515443 -378136 425026 666010 678733 666448 470627 423463 416346 150561
27979 150561 189003 145367 52799 139766 136845 -96691 -336219 -522436 -507437 -448179 -180093
27968 -180093 -180294 -387128 -487685 -238141 -160345 -142923 -21361 430627 441006 279849 -30024
27957 -30024 -478713 -312731 -66692 -119435 48479 130127 207512 258266 -288163 -302417 -52228
27946 -52228 -101503 -5479 206892 -67887 -181695 -281528 -199542 -163922 219596 356651 210747
27935 210747 52607 -104322 -186107 -540546 -360455 -274155 -159542 187681 333381 181445
27925 181445 -51827 -5977 -23143 165993 44848 270843 121154 -77521 -25750 74306
27915 74306 98814 283764 372765 395451 301612 504068 435319 328252 251663 193632 366732
27904 366732 235928 233641 192119 398501 592351 598880 644955 301084 357182 85128 -30641
27893 -30641 -12761 -96307 -318695 -393439 -435611 -36502 104825 85603 -195355 -432795 -534501
27882 -534501 -289073 -505840 -332697 -380204 -150550 -162606 251005 1033052 1423440 861331
27872 861331 608844 324831 117633 -20083 -457981 -152445 18016 109049 294395 449372
27862 449372 737217 536714 477959 92903 -199727 -189671 -36140 116080 90125 -301905
27852 -301905 -19907 502593 310237 18197 -54225 32778 209380 -196065 -213717 64157
27842 64157 127099 11419 -162172 67596 43492 76110 -167147 -338701 -415800 -325486 -49649
27831 -49649 60367 -371601 -378213 -393369 -465364 -516751 -400143 -581842 -991364 -732342 -614785
27820 -614785 -89500 106710 84813 -56658 251020 132742 75088 151404 484180 649717
27810 649717 499798 149824 29855 -165086 -510423 -442212 -343460 51071 216044 12087
27800 12087 -179666 -177143 -50989 178556 309012 437982 306286 165150 391849 274139
27790 274139 116631 171526 335704 303741 217316 -29862 82335 -96475 -319982 -318227
27780 -318227 -221191 -429399 -208204 -152648 -182337 -348651 -516597 -257764 -92902 40136
27770 40136 -174914 40895 282490 312325 347722 219838 390922 534669 95227 -156367
27760 -156367 -258263 -290784 -178647 -316105 -496649 -468985 -178533 -54484 165161 294583
27750 294583 145490 190988 -129946 -496950 -234515 145375 265160 161278 94738 88389
27740 88389 12392 -240527 -309279 -330927 -312238 -533799 -419872 -164543 53034 615030
27730 615030 207388 -47829 -92007 -353249 -510862 -641880 -786317 -703859 -244216 -92542
27720 -92542 -125762 324015 621601 596539 308290 -298052 -322838 -128992 -134268 154713 84798
27709 84798 48546 126406 298208 352125 84564 22906 -103593 151203 309544 147087
27699 147087 -132651 -647387 -579074 -615132 -530740 -804496 -772174 -210953 -159439 -160933 9932
27688 9932 -31567 178539 321639 -65640 -426944 -313414 -414412 -263018 -182072 -201569
27678 -201569 -324507 -144036 -46326 -76458 -281718 -329687 -51814 42691 82235 288194
27668 288194 559301 665787 472441 131803 210170 62411 121308 -105400 -125646 -65758
27658 -65758 339342 645040 663380 216820 193855 188789 28180 -314270 -380661 -397009 -379136
27647 -379136 -427414 -545959 -492623 -239916 -290662 -278378 -451406 -558295 -483241 -259421
27637 -259421 -164105 31870 -174726 -356943 -573376 -515320 -281183 -11825 293450 143500
27627 143500 -234031 -204975 -63774 -19613 480995 337278 -76192 -390391 -401857 -223424
27617 -223424 -1017 -23691 9078 284607 296169 183218 -66881 -333522 165969 816059
27607 816059 1406575 1161785 825678 699817 337763 139896 469048 254264 186495 111319
27597 111319 142618 221932 270658 103150 -40088 -425240 -552544 -585701 -550941 -351445
27587 -351445 -207520 -105069 197363 46000 -390300 -512699 -306170 -75951 126500 -70749
27577 -70749 30382 332942 325076 185972 -33960 47793 -128239 -258242 -27327 95555
27567 95555 298258 527295 488966 393992 202902 13665 193522 325680 447304 -43561
27557 -43561 -239565 62245 -149675 -174499 -14723 -165674 -458075 -219411 47400 282558
27547 282558 338279 408064 734865 664264 534069 546145 303092 171552 34570 -102704
27537 -102704 203498 488916 429578 385001 263055 448370 218082 -223883 33274 302009
27527 302009 346845 232885 172620 40820 -211570 -323030 -464956 -270953 -137498 -530269
27517 -530269 -339465 -167296 -157325 -23885 -92990 -192273 -315087 -130698 -41420 -126308 -271152
27506 -271152 -282620 -448368 -722288 -763857 -749896 -530070 -374894 -375315 -234536 -99864 -10754
27495 -10754 137556 378849 204162 288646 408932 502423 310546 186034 201564 -39323
27485 -39323 -179361 -130508 -355823 -313841 112534 499899 497904 412101 397013 400070 459113
27474 459113 530924 411659 65881 -612806 -557761 -446303 -331525 158442 587054 714258
27464 714258 697629 646137 609650 291890 137210 103732 238292 41787 72647 90352 -60464
27453 -60464 64017 129794 299765 276480 277269 170658 136493 122518 -37570 -88270 -179574
27442 -179574 -387277 -563103 -232558 164492 154040 -147854 -135003 69007 -62983 -61627
27432 -61627 32116 219578 327863 22884 -96631 3560 53295 -229011 -361170 219448
27422 219448 412476 208207 -175050 -125382 -27691 -112416 -202528 -113747 115002 -311207
27412 -311207 -340368 -74565 331118 402509 225932 -36118 -197088 -124466 -146265 -58217
27402 -58217 244452 607803 567310 245134 464572 644592 565639 260411 -14638 119525
27392 119525 270158 412524 286846 151245 -247417 -285709 -333830 -474727 -268198 -301331
27382 -301331 -256924 -295141 -353526 -142717 -15933 -153912 82326 524891 552247 80768
27372 80768 23407 262959 14742 -441109 -483888 -580975 -94519 382805 449543 633884
27362 633884 383746 2206 -23802 -39281 -263703 -139986 -12995 149752 226568 95644
27352 95644 -2278 -40806 -11008 228080 82845 178026 -97073 -418344 -264222 -248549 -146431
27341 -146431 -17997 204768 288810 458006 491623 227637 305922 160592 -34958 52165
27331 52165 379524 -117139 -632245 -778131 -370492 -65067 -54983 -333240 -257121 -202132
27321 -202132 163608 306582 124239 -142023 -190678 -412226 -489658 -500965 -619668 -272727
27311 -272727 87609 187289 268886 147837 160842 110468 153510 222248 321466 -43285 -157559
27300 -157559 13804 260036 396036 465132 666836 833896 523691 277765 122699 -8195
27290 -8195 -161707 5355 289744 282220 254624 292999 188339 103986 128513 102442 128213
27279 128213 239086 92864 -106027 -54885 -143141 -184398 -28419 -155975 31252 501922
27269 501922 386619 213263 391548 209643 183020 169085 -24526 -36695 325959 394064
27259 394064 500150 240837 399 185620 42368 -161707 -284234 -421855 -435431 -306201
27249 -306201 -199759 36038 289454 147864 21315 66610 96867 156837 283749 165408
27239 165408 -212775 -560334 -473980 15627 61315 104646 -340179 -443924 -386626 -307541
27229 -307541 -300045 -323619 -568041 -429271 -307850 -139204 -219374 -145610 350539 249663
27219 249663 -122724 -488289 -458959 -74748 99836 -28018 -166597 -283933 -442671 -441272
27209 -441272 -260400 8630 224009 282511 123613 7311 -208700 -219869 118235 255163
27199 255163 -60262 129063 -232506 -290013 252013 397464 106449 -55479 594780 505938
27189 505938 491802 511318 146551 177621 351704 79342 12711 -151581 -159562 -41784 -273537
27178 -273537 -406760 -364626 -173810 88861 -63045 -89672 104652 461527 260939 -32123
27168 -32123 -42586 28871 87321 176320 276970 21528 -189342 -346821 -32531 123648
27158 123648 -67925 -283030 -114343 47569 -187380 -518538 -273219 65292 -2113 93622
27148 93622 28628 -88474 149874 169926 51637 109549 377421 190036 73612 -150114
27138 -150114 144592 258154 210153 -43496 -326627 -410969 -97745 -74887 32401 34440
27128 34440 5295 -271911 -454338 -271333 -96877 -55248 -288463 -380916 -81845 352013
27118 352013 343963 331262 261786 221679 255316 79196 73697 -93510 -139580 -258739 -263424
27107 -263424 -221446 -137923 -340288 -457344 -519146 -444628 -356798 -349713 -348014 -201312 14710
27096 14710 372048 712117 370715 145393 310419 506643 150533 -29169 -97495 -445237
27086 -445237 -558755 -398136 -322221 -360194 -311551 -45052 -40606 -236190 -369110 -477255
27076 -477255 -454472 -240302 152100 31763 -136331 -37854 247108 -63499 -323123 -428616
27066 -428616 -321734 -255718 -80773 -170936 -502409 -566202 -657842 -468419 -512521 -440727 -345051
27055 -345051 -300892 -347555 -81382 -177000 16269 -175585 -327513 -134945 -32709 -160851
27045 -160851 -258642 -453022 -129100 -19930 -118629 -278603 8494 326162 343771 413164
27035 413164 516199 613969 492776 161214 265798 306465 578800 95362 58907 299732
27025 299732 324554 775017 806168 325665 254522 266196 94479 178467 280932 353214 162822
27014 162822 -94568 -206390 110749 300923 339203 270829 100099 -120651 -136081 68316
27004 68316 305622 421864 122418 -180661 -308504 -234590 -253668 -323105 -54667 133764
26994 133764 -139333 -549929 -451336 -448001 -378451 182197 433957 596471 194492 -80700
26984 -80700 -86171 -297861 62009 -95400 -148788 -143336 -72009 183300 467651 258925 349736
26973 349736 206938 -114548 -321595 -350458 -310923 27583 71944 140574 333832 450734
26963 450734 488442 351718 563972 750632 665701 426095 509606 383989 37859 -56149
26953 -56149 -96750 -19389 6193 -120302 -187310 -152185 412481 572384 492734 584862 800908
26942 800908 807204 348556 326047 388471 298559 69943 226482 556420 361902 -209846
26932 -209846 -353917 -159032 -126542 120081 -97797 -205284 -236102 23352 70537 78297
26922 78297 -45068 -78244 -151826 -26470 -141229 115605 -140031 -332489 10107 131605
26912 131605 406517 351399 246217 204860 259567 424947 94324 7345 -246286 -307944
26902 -307944 -381942 -160522 -249527 -72707 320679 304054 137019 -5030 5128 -36500
26892 -36500 -287862 -505740 -300110 -105150 -166279 -498764 -864927 -1018518 -625261 -78658
26882 -78658 204267 153788 19953 -273350 -529754 -440141 -497448 -217676 -195128 -442417
26872 -442417 -474054 -212584 -351439 -585256 -506431 -286489 -236841 180970 424328 369168
26862 369168 139715 187840 124961 519573 378587 -14814 -35108 26884 87218 187162 16672
26851 16672 -80291 -65408 -179897 -213711 -122245 45518 224120 110837 435669 471029 149780
26840 149780 93110 382479 362899 272837 318320 415421 283534 201568 301148 92087 -70792
26829 -70792 -6577 212570 58467 -48069 222398 325819 357113 594110 425028 424995 614546
26818 614546 777011 874687 279767 -165450 -386348 -170663 -71986 -186951 -42289 42670
26808 42670 125159 -24746 182246 502630 407440 613866 702260 516595 193564 337365
26798 337365 201888 -67273 -239144 -328346 -238457 -18617 -161289 -38980 -74008 31638
26788 31638 91599 207686 121823 -172279 -28991 -97001 -269870 148656 541824 331865
26778 331865 384937 176080 221398 -272394 -376506 -215581 -316232 -304550 42210 485852
26768 485852 502811 336002 311656 117943 83766 423299 507524 282107 5295 -52464
26758 -52464 -41879 170562 -206087 -353888 -121225 262814 382217 188101 -129717 -150259
26748 -150259 151276 208944 31763 -73155 -279186 -13417 315945 463575 523458 415161
26738 415161 340157 660519 695440 352168 -70633 -189207 -150504 -130896 4009 -16351
26728 -16351 -142508 -87417 -173242 -222025 38778 167383 53742 -20501 74675 -121459 -211323
26717 -211323 67814 2420 -436470 -658249 -426369 314270 575945 499924 387105 551247
26707 551247 725762 549371 328542 225146 259654 240528 242281 -343467 -481062 -331530
26697 -331530 -282314 -517705 -692322 -647427 -651885 27799 233746 121301 19662 268006
26687 268006 220202 165870 329454 285751 57178 65629 -99288 11228 305502 343974 176111
26676 176111 289970 208 4536 136627 -45982 -420539 -193423 415955 195512 98770
26666 98770 -331180 -375592 141424 -48403 -344111 -198327 -149528 52539 104867 80637
26656 80637 -29700 141767 48981 -119849 548920 1015158 771562 447715 339915 9546
26646 9546 -441899 -465221 -392808 -9307 258677 214479 18934 55389 -146714 14135 384393
26635 384393 291068 34436 -220495 -105643 -61534 210256 140610 250895 346613 398933
26625 398933 547109 670025 332936 103529 23054 -140836 134178 -110476 -265563 -141135
26615 -141135 100978 502451 193338 -116988 -14805 -251261 40337 134157 -219234 -243691
26605 -243691 -26435 50880 54979 -59495 -52884 -50272 151823 -121358 -347248 -153837 -131344
26594 -131344 26692 177969 474896 411696 -114697 -403097 -679267 -363121 395974 547406
26584 547406 190391 176921 378704 367254 139760 93913 201224 90826 39222 -205199
26574 -205199 99546 296680 192399 60929 54070 -130634 -67965 51248 154014 402598
26564 402598 230810 -14594 234463 511697 530050 540827 511973 195374 333392 449570
26554 449570 321266 79583 84722 89828 318508 346357 165187 42210 -29202 124312 -195710
26543 -195710 -144911 -67036 -103813 30519 -141684 -51492 -98506 -141856 -147554 49370 23490
26532 23490 -30419 176735 164409 -150765 -312702 -644931 -1194494 -773043 -207844 79676
26522 79676 521291 499019 688924 1035538 1097600 907408 526546 346185 433367 143091
26512 143091 -274758 -347148 -120212 68036 -264779 -260404 -329640 -222696 130368 177331
26502 177331 -2366 -4861 84011 -204352 10131 208222 151065 386217 165757 116238
26492 116238 424435 485353 385878 411247 280259 251515 164170 185764 298749 207264 81822
26481 81822 113127 -240161 -132038 -233131 -38723 248123 281409 356311 443290 403612 457613
26470 457613 239592 197345 263202 388837 225808 120430 134385 -243016 -587214 -583535
26460 -583535 -555979 -330028 -64056 143027 -82604 38382 139312 70707 23127 337262
26450 337262 575738 283451 -257346 -487237 -422568 -393179 -441249 -280072 -19548 171838
26440 171838 110546 -43444 -126318 -177722 -463183 -82974 79857 209228 63475 -19691
26430 -19691 -4647 201888 287366 183332 130945 27302 19276 105337 -116467 -117505 123674
26419 123674 101499 59922 -167931 -382964 -400556 -507540 -541089 -358099 -272669 -226985 7621
26408 7621 143475 316053 274236 -176759 -743846 -846749 -991763 -736981 -607644 -637537
26398 -637537 -640757 -307927 -86552 91773 157791 170117 71346 138298 524190 664954 279335
26387 279335 311152 -77379 -365058 -240648 -111465 48242 -34953 -238803 133120 217327
26377 217327 320807 -8089 -281962 -72004 112765 -18344 56799 373230 91877 97308
26367 97308 139171 94987 -195412 -429435 -689839 -891730 -791811 -499257 -324190 -27347
26357 -27347 66216 -234965 126126 -107641 -331438 -148957 -135443 4967 52998 -125266
26347 -125266 -182558 88299 222400 267929 290599 98342 -109975 124171 -87655 -162292
26337 -162292 -274559 -680129 -603548 -120430 392789 -62309 -360360 24233 624752 641715
26327 641715 241698 -245859 -301179 -111604 27389 247280 768136 480779 366381 45984
26317 45984 -19652 -280347 -624755 -434525 -303301 -86150 -24895 12451 -42656 -60395 255571
26306 255571 241316 -82904 -210073 -452054 14112 459312 652641 482259 68469 142516
26296 142516 243367 -10020 -62271 -223889 -258091 -191998 -84838 -48801 -479094 -544923
26286 -544923 -336056 -565414 -466944 -326303 -252723 -476959 -471474 -539632 -563481 -493688 -243610
26275 -243610 -195008 -203145 88182 -219020 -422919 -213782 174023 209790 -12095 47184
26265 47184 -329751 -447033 -42188 204119 532991 595233 221926 162526 -264373 -194842
26255 -194842 -260714 -367671 -177213 18559 135778 -1183 -50768 -475635 -266281 -251305
26245 -251305 -482097 -316841 -82381 -230773 -417481 -300425 -22353 241538 240234 311809
26235 311809 152516 407700 442725 324734 -184607 -324102 -176573 -302657 -531810 -428820
26225 -428820 -56202 229780 253749 -92895 -47786 346261 188992 -193414 -213771 -124940
26215 -124940 -246306 -255655 -408590 -875895 -985616 -589234 -171091 -245126 -506260 -419959
26205 -419959 -558531 -418752 -150456 296623 639990 665496 273128 -14253 186665 438887
26195 438887 477969 744714 342755 84573 92201 183568 58854 282723 446597 -17681
26185 -17681 -401930 -730814 -542066 -198244 -411676 -134174 -365343 -543461 -278789 85985
26175 85985 11203 -263987 -658551 -710731 -440772 46644 26159 -28370 180370 146739 5282
26164 5282 -305253 -479692 -468206 -453751 -201999 -52741 -171081 -178034 -167004 -131993 -147106
26153 -147106 -247488 -108711 90941 -65973 -423273 -406341 -175388 -35635 -146264 -379881
26143 -379881 -403460 -222260 -106701 213759 290155 -120524 -465720 -415448 -258561 -247942
26133 -247942 -540434 -177926 160258 112414 286114 48348 -441764 -605696 -803881 -836103
26123 -836103 -539141 -271877 -347222 -273029 -340694 -145854 -365198 -621943 -557475 -315662
26113 -315662 -515007 -637915 -602219 -282569 175589 107250 -80818 -147958 38241 -79116
26103 -79116 -371647 -415250 -249235 -460538 -392244 -382962 -275397 -63714 -252073 -504730
26093 -504730 -871217 -818215 -710522 -378475 -136275 -471006 -717919 -753676 -216074 -268532
26083 -268532 -450345 -541601 -587731 -280087 -113941 -117837 -145804 -266566 11663 166313
26073 166313 382666 618335 604085 558710 -172921 -430234 -344088 -243180 159563 185874
26063 185874 98532 -98582 -104807 -175272 -407537 -312600 -167525 -215401 -228987 36956 204334
26052 204334 -126560 -242908 11406 -33168 -73307 -349142 -351662 -282716 -219715 -458635 -436825
26041 -436825 -84794 -187215 -173058 181855 379768 182497 161180 237397 434613 792072
26031 792072 688365 747188 379732 237937 42927 82545 243316 22583 -298798 -194575
26021 -194575 199022 478631 653604 387547 447133 21603 -91064 -32043 126999 311056
26011 311056 411536 623203 380096 111668 192968 137769 67196 192788 157442 94657
26001 94657 282557 502267 -45046 -488065 -369758 -481355 -193659 63968 213661 -69155
25991 -69155 -220408 53781 211400 -155473 -187575 167016 375930 286439 143053 -154980
25981 -154980 -200607 182623 434786 308534 435123 376971 226349 357817 538092 347242
25971 347242 -62114 -142803 -267016 -244890 -114515 138578 153538 -28085 8584 94178
25961 94178 555863 868359 609916 236407 682980 869466 451584 -129034 -316623 -175454
25951 -175454 -190084 -166547 -243276 -146518 -37871 -144374 -221135 -212018 -481564 -702555 -260674
25940 -260674 -136658 -67796 130565 -12193 -125858 -230150 180250 241471 296927 112484
25930 112484 427151 641629 606707 562095 457194 -24343 -33172 221735 172084 510324
25920 510324 584231 556652 303407 81944 -174063 -53896 147512 200541 128475 252067
25910 252067 377043 448100 122331 97843 20070 -16750 -61265 -158180 -77964 15234 -86134
25899 -86134 -342747 -241958 -150174 -363978 22683 327373 525148 400183 163904 -421978
25889 -421978 -417331 -18368 165103 -42309 -185550 -8334 132071 370055 378413 678201
25879 678201 528709 251073 270659 42162 -190792 -109451 -215238 -417708 -23140 572884
25869 572884 567883 98358 444705 819665 295115 -104888 33470 -167619 29410 240333
25859 240333 571779 530416 230494 187043 62362 72299 247686 208993 -192452 6418
25849 6418 129853 401183 539015 -16239 -286456 -214331 -211961 -193629 -60522 385988 5298
25838 5298 22589 544546 608106 399034 428851 379536 434688 465805 455121 -6599 -56924
25827 -56924 114950 397710 572420 454511 548225 344282 165676 294910 167088 -211467
25817 -211467 -61011 55167 12019 -283982 -686395 -674424 -185052 -63348 144490 146556
25807 146556 72993 -74037 -266166 -211360 -364913 4132 126986 62556 52130 -357983
25797 -357983 -347606 -111651 -295951 -410228 -462774 -468017 -509462 -753251 -706613 -342485 -178190
25786 -178190 278393 428747 474200 738787 487294 241044 97471 -171212 -119679 -91736
25776 -91736 219416 358155 -64570 -54408 164094 786310 765515 280585 194913 495624
25766 495624 248684 154735 189203 525035 384969 164089 139955 229251 253284 -199210
25756 -199210 -170337 -79182 88477 371836 426344 214255 108841 497498 611840 735071
25746 735071 591506 354794 441731 350652 435610 683141 786582 551058 390943 110194
25736 110194 -266175 11781 214362 28873 -156359 -132109 -18602 76977 236076 426967
25726 426967 303821 247647 51732 234780 462678 229855 247299 497995 388826 -32699
25716 -32699 -346644 -367261 -85353 -158991 -401197 -166547 213816 205615 250249 105134 273634
25705 273634 361842 289635 -154462 -301179 66181 258813 371701 347831 398843 463746
25695 463746 694790 611236 311871 54908 -134593 126079 15657 -77092 -30859 36284
25685 36284 177916 81148 -18636 -127229 10535 203366 -36018 -313072 -271662 -11118
25675 -11118 181217 328307 231098 119718 168810 -128418 -414395 -145589 348002 158110
25665 158110 -63950 -152112 -340883 -127374 -139184 -98163 77635 -69458 -219520 106236
25655 106236 385867 455959 482611 372276 -100844 -121101 104851 179439 368651 449355
25645 449355 221656 -116009 121018 58437 -63351 -407153 -382914 -124000 -216944 -335817
25635 -335817 -215087 -466752 -233181 332052 356214 -90752 -398354 -465485 61481 436990
25625 436990 198859 313234 586388 335770 -150249 -247961 -135439 47548 -164442 71723
25615 71723 415177 444360 350767 128326 508138 292472 -122169 -22142 34505 -4578
25605 -4578 75541 -88049 -36233 172603 -136733 -103801 192056 313093 267897 -144871 47640
25594 47640 98175 121757 -176334 -287228 -79214 74117 210749 72281 102035 -494644
25584 -494644 -580477 -469699 -608739 -409656 -209103 -114348 139523 166891 239600 174103
25574 174103 -161573 -376720 -248335 -110607 -201611 -9161 -50172 96233 225091 51273
25564 51273 -26610 330414 550980 40179 -147960 32389 63108 71268 -130262 -128179 33786
25553 33786 263335 252547 187383 260548 337229 15905 -32831 175561 187984 164071 190626
25542 190626 132941 311449 303771 481026 644916 609859 654977 231925 486 102421
25532 102421 -389868 -321160 -18462 -160143 -302209 -197430 -181217 32206 364759 145534
25522 145534 -287112 -603778 -658555 -514329 -294814 -428164 -393684 -281595 89456 160435
25512 160435 -283472 -383357 -135146 310550 277486 143461 454163 375884 437588 378009
25502 378009 162614 308036 -95294 -484445 -637259 -143564 391829 352744 171515 381860
25492 381860 381485 431130 510839 758240 649170 138180 -102036 -5702 -170495 -129024 -238336
25481 -238336 -369734 -466374 -516690 -558257 -393493 -196330 -61038 -125222 -255838 -196805
25471 -196805 110727 233616 456377 476041 541669 637030 426404 90879 93457 143415 -138927
25460 -138927 -92880 -307713 -337537 -154241 -83903 -266071 -456752 -111115 125906 -140283
25450 -140283 -463599 -419487 -104587 2577 311808 138204 -92932 -184127 -46211 194437
25440 194437 358886 550525 366220 175618 -2065 42866 78158 149823 77520 186938
25430 186938 257383 -40367 -91399 -272498 -427168 -173593 -89789 -42862 -80927 140774
25420 140774 136313 -84567 29507 371087 92450 -50450 -344636 -137578 -11658 117726
25410 117726 117353 -121543 -59090 73465 -64527 -205310 -527629 -362076 -294570 -188367
25400 -188367 -204848 124423 -127842 -389649 -723612 -519427 -208085 111412 176720 -257296
25390 -257296 -640212 -950527 -673005 -243244 -469608 -638721 -306183 -286807 -150766 83491
25380 83491 -3606 -418353 -565022 -611091 -722342 -436802 -107001 146550 175095 -266131
25370 -266131 -482725 -455777 -197370 -168483 219561 388164 15298 -5986 -186855 -131467
25360 -131467 -253673 -336464 -495850 -527897 -319359 -336797 -572473 -503954 -326182 52569
25350 52569 523402 582311 585553 451804 362062 223054 353209 810483 810315 327578 -88291
25339 -88291 -229568 -85204 11724 170947 22987 -254834 -453172 -316139 271777 142512
25329 142512 -177268 -347910 -198461 -66214 149698 302943 -89131 -496723 -636063 -462477
25319 -462477 40766 307095 61181 -368646 -444945 -767965 -1145554 -1239255 -830111 -808356
25309 -808356 -641616 -315827 -85539 167223 148722 233077 96703 -522819 -649162 -318106
25299 -318106 -293250 -282338 -119235 34872 228557 81107 73320 221372 176057 178298 299937
25288 299937 476667 602807 493818 324496 225795 172703 125349 -117691 -292786 -571674
25278 -571674 -481605 -25565 84927 357944 573567 464049 630906 416769 -149518 -174084
25268 -174084 -359723 -392810 -68572 46443 -9723 -273938 -414994 -305210 -115634 220030
25258 220030 80923 -249094 -216963 -79353 124189 68626 -97204 -240377 -116722 -61980
25248 -61980 -350551 -274180 -228821 -40233 289779 154073 -67416 331333 149296 -130605
25238 -130605 -131455 -146446 -372823 -472772 -215804 -16668 112332 695936 430525 192150
25228 192150 62289 -187818 -323435 -168434 78225 169657 -144839 -266348 -414140 -428024
25218 -428024 -660491 -548900 -355355 -305472 -317114 -161514 -38490 196995 49149 -216306
25208 -216306 -231766 -182236 -254626 -170076 57408 161030 51164 -42033 31290 -21327 111912
25197 111912 -105743 -96027 -52075 -60097 8175 297491 468081 378018 58789 -31651 162554
25186 162554 389584 -13414 -101998 -258780 -499477 -411152 -99271 313119 579283 397891
25176 397891 320584 294606 -124946 -55015 -166528 -495916 -483771 -164589 108452 310720
25166 310720 245193 22046 91240 -28803 -123775 -56504 108519 340866 421961 134539
25156 134539 -43079 151727 185885 -73913 -161049 -133513 -4152 136835 -2140 -262519
25146 -262519 -54801 361252 820618 671850 362924 419955 133072 106841 139755 -144464
25136 -144464 -192621 -163257 -133097 -38481 -269773 -694985 -941989 -820479 -375642 -320072
25126 -320072 -134066 149453 14772 -41593 17307 -30813 -209275 -228089 -249153 -120221
25116 -120221 220805 388267 266836 99985 21371 318781 442894 -56368 -316019 -367224
25106 -367224 -86245 30129 -175826 -300903 -330374 -62921 -176465 -332521 -163778 -104495
25096 -104495 -182995 78675 378896 793375 613547 132365 -135738 -168528 -235018 -92455
25086 -92455 74835 -77677 -360491 -285759 -324138 -280140 -381207 -156078 -112082 48800
25076 48800 41483 -269814 -511686 -696351 -487730 108903 692071 647713 -36468 -393579
25066 -393579 163030 431327 234681 250947 438929 521838 110187 -87813 -134738 -248121
25056 -248121 -146824 -193023 -97218 1870 134534 292048 484712 412383 262681 -70627
25046 -70627 -190834 13276 344076 502177 420923 394986 -124007 -270156 -374538 -273805
25036 -273805 -160997 -599936 -455104 -278531 -127607 285382 212692 -40197 -388140 -531365
25026 -531365 -290625 -377817 -257478 -328491 -337468 -175016 -2364 199510 345013 504203
25016 504203 732734 668393 513892 296483 -130361 -295786 257062 173228 -314439 -508367
25006 -508367 -143299 166939 99652 169275 127461 59885 -36043 258806 256060 97111 49943
24995 49943 -76006 -393436 -448784 -448792 -231763 -173813 -99305 114101 296705 571161 109304
24984 109304 -32172 -173179 -87429 -290153 -309188 51958 189974 151245 -339501 -377277
24974 -377277 -314882 -15036 249209 440213 520298 346330 12516 -107298 -30140 193053
24964 193053 351141 437989 183618 24950 -31718 -41711 422854 297323 314482 104451
24954 104451 -50720 -161492 -231493 -460005 -658433 -166838 34097 186087 542145 622311
24944 622311 306122 293254 287034 154738 70085 -232597 -482215 -505934 -574569 -399610 -211559
24933 -211559 -120111 -26604 29248 -54731 -376282 -295194 -235781 -213264 -318918 -441434 -599473
24922 -599473 -455699 -278596 -199668 51026 -50362 -46717 -395083 -666506 -311946 -137161
24912 -137161 -337900 -386949 -249742 -98803 28375 -122820 -359223 75271 102488 -312305
24902 -312305 -622634 -267992 -318752 -315632 -381062 -331204 126758 262767 343868 -20689 8
24891 8 238613 307017 314040 247569 130985 236240 304089 336032 262509 -234757 -473607 -400025
24879 -400025 -223289 -174150 -382104 -282194 -159419 262372 213805 131355 200836 148678 176922
24868 176922 -18 -60487 158244 185424 -36631 -110130 -133298 137248 373637 341537
24858 341537 401929 141383 -398894 -385931 -57811 164574 148831 -294155 -76994 -148791
24848 -148791 -196711 -72606 -81961 148827 302738 227935 179654 269319 250404 427449 589674
24837 589674 376204 402620 388777 392917 217645 50112 -255071 -246555 -25575 129346 227814
24826 227814 112669 201450 128663 26656 62667 -200681 -431875 -809187 -636231 -461972
24816 -461972 -447707 -361036 -108029 8440 131945 -184197 -493814 -310703 -202718 -126150
24806 -126150 -24526 114628 -61756 -537513 -857901 -916148 -535301 -110538 -31287 -170500
24796 -170500 -192814 -195030 -78360 -30789 110538 120383 -125190 -248718 -337079 -688881 -701287
24785 -701287 -728983 -561516 -375867 -325569 -373070 -331507 -187138 -38422 9680 -215487
24775 -215487 12784 312582 320244 -79389 -124505 -153465 -113273 -112043 230144 456263 713751
24764 713751 1023496 701245 311300 228039 68423 -51050 -3962 93228 322846 289674
24754 289674 108789 525765 631211 535085 647344 706977 501445 409263 116737 165638
24744 165638 295131 -17677 -295574 21473 25984 -20017 311171 440928 71382 436259
24734 436259 544715 517248 460219 492848 513512 297856 207976 129807 45796 263967 252739
24723 252739 144321 134665 301461 321008 404063 162920 232718 241766 187185 -76383 -222043
24712 -222043 -83594 182088 362760 169268 114286 517134 786716 612947 325575 281100
24702 281100 451218 596875 267107 7775 -355977 -207280 63814 129703 147984 456140
24692 456140 471349 317460 208853 242801 117521 114831 281541 102661 -125694 -209058
24682 -209058 -54717 506812 437276 -41324 -657196 -484839 -424725 -390800 -231459 -21192
24672 -21192 213947 483549 363959 328491 414589 495501 623662 263029 -22603 76240
24662 76240 86294 129536 366654 748784 506088 159654 -69343 353247 567645 562366
24652 562366 326471 171564 262523 -96020 -233 558001 320316 162032 176461 4340
24642 4340 -162982 114370 329237 227296 324178 571181 541260 527430 552016 411360 -157377
24631 -157377 -685013 -319243 -127363 -109861 -293662 -260824 -183867 -144242 159023 307261
24621 307261 135967 -124652 -123827 386726 512504 428200 199563 454005 383231 308320 553615
24610 553615 793924 622187 124198 -178519 -669951 -617612 -310205 -312894 -73412 -89867
24600 -89867 123946 442077 239175 -384825 -499616 -281219 -296993 -458590 -220132 42111
24590 42111 31127 -23434 -53617 -475933 -417224 -243434 -184192 -381425 -192330 2076 193406
24579 193406 142946 -15440 -324250 355685 608952 -8728 -120984 -51827 74479 -99037
24569 -99037 -404495 -462103 -180386 86410 22857 -15957 -220579 -109627 54633 75708
24559 75708 197995 -51278 -643213 -620859 -470698 -305877 -339398 -304086 128587 157504
24549 157504 -201925 -373777 -93020 113090 542496 704362 300171 99142 -6058 -141931
24539 -141931 62768 238895 -100454 -102666 -7075 456999 465326 77631 -33680 -123459 -48721
24528 -48721 -29219 97596 171076 -146978 -15079 118033 86146 96376 -352480 -184318
24518 -184318 220340 34044 -149186 -358912 -283939 -156335 -60595 113173 -171359 -144194
24508 -144194 278664 367640 91834 240745 178530 149554 114543 -14687 138561 -1434
24498 -1434 -323664 -153662 -403124 -185032 38376 39936 13024 37784 100030 340675 57728
24487 57728 -134048 -317419 -274276 -120510 33958 -70946 -19770 25730 -200985 -439101
24477 -439101 -55205 305635 54427 -197514 -569756 -586486 -362093 -89563 106998 128610
24467 128610 383831 464872 505470 399217 360717 195597 -183050 -335874 -504539 -567955
24457 -567955 -269151 -273835 -325742 -303682 -271196 -116288 102595 -236511 -623084 -809373
24447 -809373 -569813 -296503 337276 348778 181229 -220485 -351467 -430434 -400000 -431309
24437 -431309 -521355 -472458 -63429 19377 -159989 -110253 232573 184558 50531 8254 62690
24426 62690 183639 331152 397493 324235 424849 314824 326032 600126 442353 366532
24416 366532 175079 306988 315960 207614 116582 22308 -35877 -16480 -217133 -367399 -198450
24405 -198450 -357945 -348318 -29880 -66427 -94705 -161633 -19990 -121472 -360473 -491390
24395 -491390 -290511 -238049 -186191 32885 90023 -121465 -84891 71162 315659 182586
24385 182586 -19482 -542012 -896896 -766188 -398217 -186367 338842 444322 199937 -210625
24375 -210625 -334665 -82926 78371 105458 106383 51687 -150495 -219005 -511114 -630414 -532703
24364 -532703 -276953 -251515 6885 116350 -165628 -7529 247898 508785 613411 383398
24354 383398 334749 169211 237807 231082 281803 119948 29300 292201 356605 279735 139781
24343 139781 -218871 -156539 82453 115621 47023 209776 233410 74947 100802 342871
24333 342871 507212 364525 62501 -188763 -528914 -418799 -217196 -38451 96878 155379
24323 155379 -35644 -279122 -159058 -54917 151395 287780 178086 -44341 -299205 -296964
24313 -296964 -156196 -359545 -190000 -332643 -258770 6671 225723 181044 -82055 -68279
24303 -68279 -173773 -485677 -536175 -366547 -295633 -323617 -373225 -383083 -332696 -157290 -222693
24292 -222693 -361682 -343394 -169788 -272166 -607646 -570452 -425724 -154073 -297346 -371963
24282 -371963 -370954 -459555 -734267 -657493 -576005 -385627 -178512 -495637 -1013782 -1071263 -343292
24271 -343292 198866 -121595 -226358 -189095 -286875 -460577 -576119 -483201 -237256 -123674
24261 -123674 148925 106429 75445 410772 681323 440772 63793 -94422 -276994 -447719
24251 -447719 -738329 -602125 -217119 126111 57795 145213 394196 -59376 -419339 -448447
24241 -448447 -130293 -106588 -159391 -465184 -598488 -543720 -643257 -670627 -629471 -788166 -264949
24230 -264949 61634 -210086 -644173 -684219 -748320 -449784 -55814 -100358 -175850 -491848
24220 -491848 -426311 -216035 -221745 -273232 -371110 -594373 -417463 -352161 -206653 -448819 -559160
24209 -559160 -315539 -71199 -79584 92858 464688 23264 -512215 -433200 -592391 -401017
24199 -401017 -451160 -391732 -567783 -132430 -97939 -383826 -66271 174123 204333 384073
24189 384073 218145 88592 -163415 -439667 -199107 112913 2762 47713 560685 666439
24179 666439 462690 392693 -65623 -112477 -108581 -74791 -89435 123670 229599 -97892 -305527
24168 -305527 -312938 -12407 201050 85006 39271 151404 100264 25424 -145301 -43290
24158 -43290 104085 177280 188900 -184901 -85478 -34571 -42817 -105184 19203 200992 382282
24147 382282 239885 264989 234012 23810 175084 263751 355962 462794 429826 198085
24137 198085 -519 89016 93009 -268289 -529750 -174549 -217965 -167237 -58408 45281
24127 45281 126688 314205 399768 579283 514212 160221 98226 -79796 -236540 -448822
24117 -448822 -535355 -403771 -455780 -280340 -75321 -219488 -311215 -306676 -354982 -781164 -1030831
24106 -1030831 -980437 -681213 -699314 -834605 -660065 -420217 -207537 121082 580536 646715
24096 646715 303652 379783 546652 326310 280979 428212 721667 664584 140253 -173417
24086 -173417 -275719 -9920 264937 265411 434142 650229 676112 633129 700291 507264 314538
24075 314538 474250 666026 487539 291500 181894 302456 486201 459181 418194 515666
24065 515666 996353 1061186 714088 707384 143566 -332485 -697341 -675762 -198728 278945
24055 278945 441912 300240 186885 116343 196957 574575 252926 720 -318835 -295637
24045 -295637 -62381 -8030 -192143 -143970 -245327 -312651 -224383 172909 51638 -95393
24035 -95393 132645 335965 355775 -127966 -704963 -390213 -422239 -624354 -371805 117765
24025 117765 106718 -189399 -401431 -348559 -279047 -687112 -535406 -406026 -537944 -373417
24015 -373417 -69005 246763 148975 173125 -127404 -175158 107037 -119686 -310354 -133603
24005 -133603 -208170 -693382 -514182 -286273 -175058 -17428 -146841 -1455 126210 227844
23995 227844 226204 401605 409507 298673 270555 293748 113040 -94843 59840 494372 601711
23984 601711 241737 103636 164503 478277 670922 788343 476032 87583 -20152 90883
23974 90883 12846 -6693 190608 440432 236616 -176332 -463728 -542871 -265700 -146857
23964 -146857 -12943 158238 151126 643 107351 121875 487887 630708 757139 450839
23954 450839 219113 307515 470972 232263 -169753 -365100 -217094 -170661 -57901 59116
23944 59116 199034 328432 7787 -9730 249258 245916 -62285 -593674 -484617 -526090
23934 -526090 -458268 230998 814163 905311 645506 520429 762856 726564 521447 350065
23924 350065 568662 797312 291979 287543 401843 6804 -192365 -417060 -261580 -180901
23914 -180901 -317986 -426091 -617620 -601877 -83281 251211 465272 234858 -31980 -9643
23904 -9643 -309723 -119058 214962 239202 39212 109354 263117 233963 313916 279120 34350
23893 34350 157247 115376 -102759 -14458 -187564 -109213 325381 485139 226182 -15912
23883 -15912 -507711 -831340 -492328 -9221 -43605 -136023 -40352 -112906 -97487 168995 71897
23872 71897 140889 155725 197275 254242 -281174 -46900 113017 135810 332378 154638 256556
23861 256556 11943 -390853 -248393 -314969 -508766 -598239 -391012 -55233 107992 317676
23851 317676 473381 568703 432213 267402 415553 253270 -121596 -387306 -93239 98439
23841 98439 216027 -167100 -290411 -290145 -159722 -175458 -129090 -193455 -136614 20653 -214984
23830 -214984 -585432 -367306 -286104 -231379 -231932 35141 267051 79198 -13438 -155346 -185063
23819 -185063 -322742 -415175 22507 476980 822143 486199 644680 657172 355044 361685
23809 361685 351358 90321 -45025 186276 449504 225369 268098 -16784 -374999 -199239
23799 -199239 -496052 -907807 -914278 -746504 -872991 -1079582 -607524 -438994 -365937 -563667
23789 -563667 -413093 -64653 -144203 -253968 121907 -282331 -544494 -633797 -347350 219073
23779 219073 232582 -131272 -189203 -234758 -389866 -391752 -552900 -479829 -601290 -714654 -751991
23768 -751991 -782848 -395344 -10582 160972 30672 -244340 -285436 -57525 -189932 -232967
23758 -232967 -239360 142754 206738 4598 -294455 -451183 -425905 -480645 -170816 -124102 280118
23747 280118 531603 557352 227029 -587356 -875559 -585026 -632250 -348475 -466344 -994809
23737 -994809 -859575 -571420 -409078 -413941 -417678 -386150 -188134 163300 59708 -5157 -106491
23726 -106491 -179035 -142423 -283631 95939 150921 -75521 32020 -18063 -56676 -39353 243473
23715 243473 441176 322886 -65007 26600 -103089 -165835 6392 -166885 -305549 -62328
23705 -62328 -131474 -213193 -91213 369446 628013 412936 -112127 -572499 19694 435505
23695 435505 422033 458314 148767 125727 260971 575617 634083 547526 347831 253076 7662
23684 7662 -17864 168490 234892 195004 -113243 -65408 -2663 -34482 326828 503043 125175
23673 125175 93281 195587 -24374 -19014 84358 -140434 -508302 -455772 -294775 -545680
23663 -545680 -352876 33800 -100514 -188883 -494698 -559658 -96680 587019 488851 -95158
23653 -95158 -522764 -524986 -449099 45644 -121836 -329603 -361145 -263297 -101805 -279716 -380289
23642 -380289 102968 292507 59941 127940 -150415 -360093 -152100 -152291 -220584 -495363
23632 -495363 -727943 -584033 -471143 -366465 -400698 -275598 -415488 -660718 -919512 -780401
23622 -780401 -535043 -398821 -530489 -452512 -236630 -219510 109069 243962 575499 594182
23612 594182 589474 239899 7744 435380 666092 417518 229970 415052 391211 268494
23602 268494 238536 137589 -278816 -341746 -500870 -824819 -748863 -897066 -742247 -652244
23592 -652244 -569840 -621948 -481230 -482472 -190832 -109126 -53475 380920 398306 160678 23743
23581 23743 242081 254262 263424 460966 473591 6091 -241373 -185710 95263 269249 137140
23570 137140 297886 384105 262542 -9305 -130856 75259 191683 14413 -87572 -176583
23560 -176583 -465850 -520639 -332510 -332228 -21134 75348 -54113 -81024 -149917 -402927 -748770
23549 -748770 -819068 -724985 -459884 -136721 -50654 -268256 -650783 -700117 -353861 59326
23539 59326 -176509 -403040 -331279 -294087 -412540 -544155 -555325 -674484 -796951 -748334
23529 -748334 -455714 -190223 -174082 -259137 -327388 -553118 -303628 -718 58075 92338
23519 92338 -54423 -275698 -306663 -283715 -588420 -401340 -215023 -162750 221272 400057
23509 400057 441798 403938 420602 494817 643309 418618 227295 353975 160144 246542
23499 246542 236812 123644 194802 273526 -155546 -284917 -150172 -186550 -232530 -12211 324059
23488 324059 354231 85258 -214646 -189184 30519 -158310 -164154 -132207 -77026 117023 -49777
23477 -49777 -533305 -260368 105196 18082 89127 175637 174339 -252777 -669249 -847749 -495093
23466 -495093 -432581 -475157 -248777 -268873 -11970 -41955 -41742 -62145 -204679 -55587 -28670
23455 -28670 184394 486020 601986 621392 685818 552529 413876 289466 27576 204671
23445 204671 314661 -149264 -172574 -374672 -292678 -12484 -107767 -481347 -419952 -394047
23435 -394047 -506738 -580261 -356160 -166180 -154209 -50529 -185742 59097 513526 170292
23425 170292 -460783 -426333 -460907 -313693 6673 95161 435157 581524 357214 211312
23415 211312 18752 -296232 -423120 -475705 -25817 374378 -47032 -23784 72902 64351
23405 64351 301221 425274 240141 -67786 143948 423145 292928 99892 -102974 -230364
23395 -230364 -481870 -308443 63110 151502 135045 327488 -183967 -567782 -637829 -402931
23385 -402931 -322108 -415064 -376558 -125817 -41362 -357003 -657139 -658952 -626427 -733402 -681680
23374 -681680 -558929 -395192 -162428 -161364 -94635 -182113 -414367 -641726 -828881 -661241
23364 -661241 -276743 -22266 -54775 -447122 -420853 -264293 -388007 -405605 -356338 -29746
23354 -29746 25309 -399220 -579244 -169232 320867 462853 15258 -307100 -407098 -406850 -633938
23343 -633938 -647624 -127247 -240695 -155262 80593 -10633 -210457 -272319 -128628 18974
23333 18974 -241054 -380651 -414849 -754420 -786753 -397018 -585817 -544251 -409787 -396897
23323 -396897 -278557 69181 186839 155095 -222287 -747240 -769020 -777282 -698544 -1068770
23313 -1068770 -1226298 -1123022 -537852 -125076 -327028 -111265 -52781 -86885 -276661 -203543
23303 -203543 -324343 -486651 -238434 -160729 30160 103665 -113876 -463413 -606800 -581236
23293 -581236 -598117 -331908 -62106 202123 -234962 -338717 -506668 -674921 -687020 -691005
23283 -691005 -453342 -220236 -109706 47761 174130 11560 -275119 -578081 -403913 -199665
23273 -199665 -134680 -55275 -34500 -248344 -147388 55416 129652 182781 -39783 144599
23263 144599 344847 340124 312244 65760 -94104 44733 132844 162378 93076 89181 40395
23252 40395 -128513 87177 53615 -24716 -111453 147819 176614 -35726 -152936 172640
23242 172640 13339 -31351 -111652 149747 499634 176985 -195562 -237494 -324637 -199502
23232 -199502 -184429 -160058 -193626 -48508 -56635 113669 120095 -104813 -66029 -370296 -296535
23221 -296535 -67396 -169347 -240914 -170376 -319405 -623330 -452779 -605685 -810891 -510111
23211 -510111 -474130 -500810 -527400 -257658 -174154 -53724 44301 -11710 -214869 -265421 -306491
23200 -306491 -350408 -189441 74666 182420 286987 91609 -117552 -213039 -309659 -107187
23190 -107187 234950 524333 555107 255217 -165313 -70536 -15086 27889 -259875 -376154
23180 -376154 -276714 44861 52740 -128987 -210062 73954 202358 -32461 18584 464435
23170 464435 418410 289015 426837 185212 59224 60032 -16682 -295916 -131740 69195
23160 69195 87076 127556 -2513 -43328 38161 -63523 -354703 -239128 -107674 137600
23150 137600 509646 204498 -182882 -231056 -40943 -92771 -172258 -265758 -468405 -243038
23140 -243038 -228881 121174 11274 -111251 -128670 50517 187120 320781 361291 175832
23130 175832 -154611 -521754 -578328 -238019 -141388 -408058 -351485 -499513 -539269 -79349
23120 -79349 210554 -9328 -78987 -150181 -103239 113746 279775 -32707 -41392 -247561 84171
23109 84171 273396 -124718 -188914 -418870 -423446 -205208 -7946 193681 26185 82136
23099 82136 76074 -125005 -155515 -91595 -204795 -316513 -282071 -47996 -161138 19935 11818
23088 11818 33621 180262 250258 183337 149451 76736 -296815 -520639 -578305 -260041 -182870
23077 -182870 -490207 -508918 -444064 -528802 -365307 -36128 -58563 -688637 -590724 -408241
23067 -408241 -666604 -455061 -193245 49657 142595 -55937 -69999 -151779 -161861 13959
23057 13959 119369 49551 -99414 13480 272537 213498 111198 173979 334976 553790
23047 553790 49013 -193443 -339975 -484236 -403689 -579931 -734697 -536482 -259858 100466
23037 100466 139819 -81139 -244800 -341718 -348428 -444589 -14642 354686 15060 -355262
23027 -355262 -217883 -35083 -240231 -51025 -116632 84912 -226703 -393415 -518705 -198058
23017 -198058 -76425 250001 316704 -14821 -157081 -144153 -297580 -238582 -699239 -330090
23007 -330090 -70095 -47363 65204 104983 -64126 -631732 -927022 -556231 7632 11011
22997 11011 28629 471862 512509 757888 679843 -147777 -441582 -226401 -63524 325879
22987 325879 121429 -171085 31663 -13271 -59022 310277 -47289 -199377 -91692 101173
22977 101173 6683 65875 31769 -321183 -290963 -156337 -125995 -294617 3507 285957
22967 285957 -106231 -378955 -273037 -165515 -17931 -6456 230628 249016 385601 453421
22957 453421 629187 431794 462254 329993 142240 234234 189357 -220021 -427631 -251744
22947 -251744 -6711 -367540 -488502 -653560 -349021 -139448 -48999 253533 290633 77908
22937 77908 103044 379607 395503 145881 183257 345962 400639 395609 295354 342016 -18982
22926 -18982 301044 352023 89997 -41059 -70268 -168477 -230408 -186723 -273828 -160541 -175904
22915 -175904 -246488 -122051 39707 -107532 -138817 -167550 -310388 -580786 -310547 31926
22905 31926 -14271 229566 389848 267311 284952 592530 436352 377056 633142 499673
22895 499673 337003 76291 -142238 -95363 -114813 -196857 3324 30515 118063 -61268
22885 -61268 -421869 -363710 -481489 -488033 -292479 -75288 36031 -135584 -325269 -301925
22875 -301925 -72708 88224 64037 33377 5036 -19938 134560 -133504 -344117 257493
22865 257493 823688 650983 411556 489 157668 331810 204732 15297 -24926 -116317
22855 -116317 -43670 -135685 -598769 -838677 -456199 -299292 -277225 -213926 -155550 -73639 -68888
22844 -68888 179953 71412 -11721 378760 694727 414526 327902 378677 462078 345197
22834 345197 366119 237662 72338 -129978 6957 43489 250396 552226 708850 340618
22824 340618 244802 -215512 -417881 -424952 -333154 -231964 -366177 -392398 -599971 -328710
22814 -328710 -318677 -62501 -41458 -55249 217474 429222 99550 -57617 -90027 -140958
22804 -140958 -153538 63879 97158 -191581 -258143 -268533 -141233 194484 343480 74023
22794 74023 -154861 -244500 -260447 -427468 -431146 -57463 300187 612226 542815 499162 713731
22783 713731 527686 314576 -169899 -225441 28178 95019 154258 -148136 -144285 275540
22773 275540 79168 315466 377963 338141 330291 412381 42466 -145649 82871 39109 227475
22762 227475 301000 210939 -180832 -245809 -218299 -124508 -129975 116824 -17605 -331633 -249403
22751 -249403 -74470 135303 109434 58329 -339833 -302605 -138247 -316195 -510130 -193904
22741 -193904 27644 -79599 -143645 -50707 -168830 -261543 -121264 54252 89984 87383 272966
22730 272966 324990 146786 162531 198097 134155 -56945 108559 142062 48457 -30534 344393
22719 344393 396054 115207 -132080 -470663 -555069 -22011 37737 -389198 -947361 -583155
22709 -583155 -343932 -488065 -457307 -429604 -527584 -779841 -607346 -386553 -383689 33013
22699 33013 244548 -72766 -235859 -433079 -286748 90651 306647 608418 635606 457251
22689 457251 -7504 -132077 -508416 -460239 -468592 -83059 -153361 -376684 -258064 -145167
22679 -145167 -4593 -2631 -245167 -300694 -166711 -128929 -247898 -524345 -831371 -621417
22669 -621417 -468456 -289601 -312173 -384214 -65997 72992 56805 61770 104802 382129 448541
22658 448541 357953 49477 -19798 90506 299280 375566 274948 34782 -74309 -116112
22648 -116112 -132138 -116832 -206959 -8541 5613 -40920 -82305 205978 253388 227301 129606
22637 129606 -112697 217850 -20073 -28954 -1789 14563 -137383 69206 1658 -132729
22627 -132729 95020 96106 -28399 -140314 -180465 -221017 -391667 -352719 -66968 67329
22617 67329 328838 197357 -96208 -138139 -309101 -163980 -179276 -404036 -294368 2682
22607 2682 -9481 -327302 -340067 -65661 119682 274599 351563 114966 -61379 -371538
22597 -371538 -477123 -438891 -383512 -122943 -28211 154546 264111 -63308 -170438 -3708
22587 -3708 180064 218695 96689 -188843 -5255 95854 -72756 -571914 -797581 -741705
22577 -741705 -496375 -104241 217842 114464 -529645 -578160 -67923 76389 -36594 103121
22567 103121 249973 286079 405455 293870 142659 -205493 -185269 82997 224976 134099
22557 134099 221949 283015 -192258 -230580 162379 128070 164025 242866 404426 73903 63195
22546 63195 98861 83866 -223719 -506903 -74760 203309 192643 549825 114025 -239167
22536 -239167 -226252 -398085 -24018 247000 264443 281262 295819 154979 -38798 -269882
22526 -269882 -493314 -94400 218113 145924 230155 212430 422139 482826 614287 546735
22516 546735 381031 292542 163254 153692 -182538 -32205 93330 27635 97929 226767
22506 226767 -271581 -512327 -505207 -736113 -507788 -106428 147524 141073 32677 -30212
22496 -30212 -97167 -114340 234752 460511 330296 505127 818943 824645 404053 -33519
22486 -33519 -81816 142522 142846 -246896 -506672 -657260 -515915 -441289 -702170 -724492 -785556
22475 -785556 -277593 52750 -171052 -47425 -62948 -218833 -427690 -452198 -432676 -316437
22465 -316437 -101466 -271553 -610098 -284417 -85061 -143657 -128056 154121 151335 -357267
22455 -357267 -409894 -480429 -742713 -494421 -354710 -363711 -8860 246390 232505 461589
22445 461589 252951 78853 24719 162487 73178 -50872 164750 161202 236623 210777 -220674
22434 -220674 -314348 -182843 -93826 -159418 338528 192311 -95628 -185297 -205749 -87743
22424 -87743 -98900 71331 64730 121185 493582 520199 29162 58030 -180191 -220941 -569876
22413 -569876 -733858 -565880 -435919 -442551 -389469 -176384 -206366 -311225 -217334 -544289
22403 -544289 -937073 -1221851 -819921 -675482 -766282 -535673 -528938 -378270 98193 247424
22393 247424 470387 689620 682125 645604 358566 8331 -284507 -344082 -184495 71460
22383 71460 162391 375116 48815 -93828 -7499 172831 -50609 -428964 -324428 -136178
22373 -136178 -219316 -489759 -249479 -123663 270681 215455 -304755 -687055 -333118 -146673
22363 -146673 -214108 -257194 -7018 37276 61343 98048 147699 247868 101290 43976 168195
22352 168195 -23604 50160 19974 68923 -188574 -322242 -87365 225758 135762 -137280
22342 -137280 430341 870734 773034 433844 173501 2767 101517 404973 430568 422891
22332 422891 387453 5021 102680 419357 367881 21953 -500853 -645494 -705601 -266801
22322 -266801 -149188 -679854 -737262 -457955 -404276 -192233 -166937 -171786 -344181 -501033
22312 -501033 -334678 -88874 -70183 -316775 -696726 -671430 -619988 -385091 -384471 -190115 -37023
22301 -37023 129169 -399369 -659674 -558822 -339012 -202404 -75990 83572 -6472 -365386
22291 -365386 -648856 -489169 -153629 -173976 -67172 -162487 -168006 -348676 -673246 -825512
22281 -825512 -301923 -2696 -109403 -356650 -338101 -169531 -178774 -295232 -426057 -592879
22271 -592879 -760602 -485702 -58501 139800 73669 -290038 -192995 -192062 -121026 26988 -4048
22260 -4048 137727 -147169 -635309 -713340 -698499 -494865 38369 378667 551281 513616
22250 513616 270157 242646 40257 -90775 231904 306826 690381 1045106 972927 466691
22240 466691 351045 348782 240156 205135 186089 76182 193953 179047 61279 197579
22230 197579 186505 -299937 -389595 -245544 -300894 -481094 15237 198617 -53026 -479353
22220 -479353 -614323 -653071 -514711 -320197 20063 11972 -275284 -340511 -320593 -85087
22210 -85087 -210094 -262010 -216830 -217336 -140381 -210972 -166543 -48610 152162 413487 277265
22199 277265 137543 94162 54017 237869 300478 57668 -180910 -83289 251138 244083 34142
22188 34142 -161428 -253649 -115139 214984 423401 301312 -1143 -413602 -589784 -868292
22178 -868292 -855064 -802097 -799097 -515854 -716800 -873726 -404650 -157587 -17057 85518
22168 85518 -7775 -70848 -121484 -262186 -725198 -996962 -988776 -662182 -472664 -563792 -535694
22157 -535694 -392890 -338391 -59154 -258963 -142864 3071 -96388 -11964 240483 -54453
22147 -54453 -114561 -166382 -132064 19648 -43663 -121125 -93885 -91817 -257299 -498606 -365955
22136 -365955 -16748 43514 259315 466409 235953 30516 211724 135301 299548 329945
22126 329945 -808 -50035 161250 455119 587997 594927 448892 66493 -21418 -237588
22116 -237588 -573281 -125403 93686 -107500 -176687 256044 -993 -249750 -429746 3154
22106 3154 278715 129735 205003 218519 -34967 -78677 181100 316910 504091 500884 225975
22095 225975 74301 115203 589 -112528 -169218 -224840 -431582 -672386 -848403 -592586
22085 -592586 -667555 -213744 12882 102191 340703 93631 -265226 -351394 -209728 -328005
22075 -328005 -358998 -411088 -130963 -41065 244552 663824 569857 388831 312941 176820
22065 176820 229035 305459 66052 100482 335917 479285 700677 754026 549998 389752
22055 389752 593799 509834 386612 129633 80435 -182605 -208562 59580 169888 178451
22045 178451 334619 113605 884 -315639 -428561 -64039 202270 -61082 -248789 -97290
22035 -97290 -179038 -380931 -407005 99681 572593 689106 326490 226031 462740 559777
22025 559777 548010 375624 114334 -9860 114564 -248520 -210959 -31496 73535 -80845
22015 -80845 -11152 -106638 119843 -76917 -141888 -288135 147626 138870 26902 158074 310656
22004 310656 354968 328008 110569 -142403 -368375 -472407 -355369 -229519 -74145 58672
21994 58672 164698 408652 237116 117040 -123858 48140 282831 299433 61277 -364267
21984 -364267 -327210 -119648 109235 46828 -193513 -240835 -306222 -42687 178748 375090
21974 375090 135897 -45158 -1830 -35439 -183513 -145980 -131299 -256629 -325130 -651452
21964 -651452 -462159 -370573 -555620 -403500 71103 279352 48260 189610 295340 728354
21954 728354 737313 573921 38053 -262436 -159366 -187947 -140635 -375584 -396076 -520438
21944 -520438 -421086 -279466 -312784 90857 371048 432949 353288 310468 362439 27860 -154034
21933 -154034 -79611 -178477 -574966 -768417 -664525 -676787 -418750 -105704 253567 56935
21923 56935 -156950 -502221 -861338 -765819 -622935 -600396 -292558 177442 76083 -299310
21913 -299310 -142117 -100508 7177 96171 -293953 -343602 -153688 -184479 -300226 43102
21903 43102 44611 -55080 -185112 134948 231636 433861 333598 338118 11020 -209266 -175802
21892 -175802 -337895 -287184 116904 215557 86413 125608 -165041 -313346 -479735 -428266
21882 -428266 -313600 -202956 -126232 202219 93280 195678 194697 35800 40817 23981 188929
21871 188929 245144 235826 63158 24546 42749 -409106 -505467 -735338 -712684 -531881 -315638
21860 -315638 -6059 -163699 -92590 27960 -121487 -73496 52185 335215 716530 333603
21850 333603 187693 348526 4501 -17810 158204 125890 -131422 43387 211734 237241
21840 237241 155197 -166063 -544851 -466315 -183348 79764 -135483 -468807 -587239 -292345
21830 -292345 -9421 53124 336667 449954 140616 -79492 -136943 74526 -475 -207918
21820 -207918 -554739 -156836 328426 395927 363212 204292 41155 483092 648293 302898
21810 302898 -69251 -103670 90572 57584 -82365 -76729 -13283 -19570 -392445 -305916 72853
21799 72853 77996 16534 -100645 -72366 230182 163449 157351 65445 -59506 -53112 275093
21788 275093 112806 -405232 -236080 33787 30365 334179 299086 336354 428126 286406
21778 286406 72686 -212200 -256105 -424125 -544553 -280774 -41096 202602 182088 284667
21768 284667 43624 4922 -182240 -29712 220440 446120 483983 323496 205876 -49162
21758 -49162 -148848 -211112 -415639 -430565 -450778 -275418 -158543 -205021 -107081 -77837 -89110
21747 -89110 -251287 -646516 -707878 -448322 -282431 168924 518420 782710 523614 680660
21737 680660 824076 698341 555008 452969 468370 564371 356002 259689 -179020 -140102
21727 -140102 143970 -131259 -422991 -585869 -352280 -98314 297760 271833 59778 -264857
21717 -264857 -324331 -45877 -21406 -393460 -653761 -142391 399716 319613 332513 311937
21707 311937 73682 174885 357980 116121 55986 -32822 -79139 -122642 4383 -4755 388848
21696 388848 526300 645108 493027 267909 450783 762389 751017 852226 698337 26228
21686 26228 36066 482081 557322 603626 546842 80030 -144487 -277594 -131263 -300987 -496052
21675 -496052 -552628 -415735 -400645 -552264 -294079 4052 -101737 4736 -352377 -458026
21665 -458026 -225383 -149346 -137125 -145798 -34424 40232 -283041 -225208 150619 312623 -17592
21654 -17592 87322 -356184 -510058 -420112 -95807 202621 435291 376725 77246 -146280
21644 -146280 -187327 -464921 -447005 -361636 -780433 -717583 -342635 -568223 -740913 -406557
21634 -406557 -432291 -243750 -121795 -74128 -329521 -291772 -48443 204108 62348 -99659
21624 -99659 -290627 -448293 -111153 265178 272338 111371 62433 34548 433756 340201 428145
21613 428145 236861 402841 416393 637982 372177 28132 131986 219775 401763 316033
21603 316033 358625 322168 772634 554885 64851 -15002 -54988 202423 329883 82534
21593 82534 155403 384070 508147 543888 130051 36679 302560 248704 195591 80738 219688
21582 219688 233750 79847 14774 285626 537825 334779 359122 100210 -131512 84721
21572 84721 78987 28069 312207 571442 569346 168507 -44447 -137569 -210980 160455 112792
21561 112792 -36500 -74557 269418 228022 -240800 -215591 241817 621524 705938 624077
21551 624077 386091 257623 201023 -74480 -341466 50435 454730 336310 -22859 16702
21541 16702 57670 230569 307250 -124257 -354516 -293724 -45965 -72201 -139402 -182233 -199387
21530 -199387 -75826 -52529 -224487 -65589 -48071 -86120 -199947 -407842 -465397 -18812
21520 -18812 -109297 -25564 -61765 -259766 -168605 -112503 -417556 -512299 -396045 294135 913236
21509 913236 799122 468279 -9720 -232880 -123864 -148957 -224235 -225465 -68611 -98655
21499 -98655 -53065 203780 376458 507655 533787 241317 191092 172935 81951 72094 21558
21488 21558 179735 96452 -284664 -450279 -331177 -148814 -114699 -170181 -258778 -265726 -145565
21477 -145565 -337857 -286015 -91298 141954 276574 176350 -22564 -97684 -154166 4189
21467 4189 327012 781439 835629 522727 91480 -67171 -516243 -261670 127963 339718
21457 339718 393599 333616 6858 128414 85200 77971 372698 626040 539810 406382 471613
21446 471613 685952 341015 -36162 -181951 -88728 207357 536560 801835 511615 195573
21436 195573 187518 516331 571016 333385 -95548 -450771 -845880 -519688 -320271 -537618
21426 -537618 -740868 -513176 -605450 -498209 -259080 -426811 -640771 -446908 -420551 -690317
21416 -690317 -651768 -577250 -222146 -234222 -319344 -489131 -329002 -263854 113826 149027 88828
21405 88828 178421 222043 130865 123353 169297 424475 363861 582898 892740 684524 104115
21394 104115 -270060 -435879 -407535 -85019 72728 118841 -79456 -453361 -300340 -156041
21384 -156041 -131330 -49497 125132 147780 -23920 -21549 -220408 -47896 -59709 227914 330844
21373 330844 295776 404187 286684 108926 120779 -167743 -48386 -277030 -213292 -241578
21363 -241578 113071 131254 -147760 -373811 -311306 -236864 -252797 -233155 -242775 -614381 -633389
21352 -633389 -362138 -357465 -416362 -388111 -474863 -288786 19764 366109 526287 604038 494597
21341 494597 150166 50125 536750 410240 367728 413902 445006 708279 293913 75127
21331 75127 198575 116238 117002 151617 92408 -87017 -528632 -187112 11505 -264847 -505984
21320 -505984 117115 160129 -31706 -268677 -470385 -183893 37437 -333807 -764556 -375374
21310 -375374 -80414 -167579 -442941 -404199 -77621 286991 27967 209958 313127 189422
21300 189422 -37301 -335600 -476094 -521992 -275040 66575 312336 378628 305775 190923
21290 190923 -5462 -10562 -539 -452660 -344435 -281974 -229685 27223 103874 215959 32489
21279 32489 -132468 -131828 -9873 -281137 -753587 -548084 -126628 11336 -88152 77047
21269 77047 32835 88649 143628 -297763 -455365 -462679 -288268 273668 479404 160141 3381
21258 3381 -77810 -187024 -462746 -370139 -138455 -91637 -52412 134052 -1195 -30780 -50174
21247 -50174 -127961 32315 -136342 -385655 57148 -61021 -249426 -20607 305257 72206
21237 72206 369678 260593 162018 377534 142669 193069 376795 118312 23360 -53975
21227 -53975 -146544 -144137 -77950 204637 335595 65063 256237 369931 533011 223072
21217 223072 -125860 -258695 -375 213678 -10405 -233099 -231883 35237 -222775 -524255
21207 -524255 -467324 -422731 -12150 -207691 -80723 -6094 12814 290960 381048 245611
21197 245611 362556 253859 125985 146094 -40484 -149221 -170103 -326964 -465420 -140045
21187 -140045 20787 -4128 216856 265188 428430 39849 35048 -107604 -233441 -543164
21177 -543164 -478305 -112166 75393 -191491 -569988 -449113 -208554 -197929 150967 157688
21167 157688 9408 -72969 -2920 -142187 -307921 -313445 -60022 -74050 -199575 -107811 -180930
21156 -180930 -156118 67371 221876 316620 144737 -167841 -292299 -74151 107765 56448
21146 56448 -81785 -299958 -145273 244267 641362 520132 -158268 -581426 -598368 -458450
21136 -458450 -144931 -169563 -214541 -460910 -455839 -476851 -818268 -544150 -467746 -149101 21694
21125 21694 -71377 -253494 -207769 -254357 -373445 -218310 -123751 -61661 -285580 -308647 -325909
21114 -325909 -696789 -1013405 -570684 -297027 1019 -452285 -417980 -344675 -371091 -301758
21104 -301758 -222598 145544 181544 382599 417342 -57262 -43594 -201370 -229786 -395838
21094 -395838 -59030 -68554 -157903 -465318 -496231 -533340 -599897 -349896 -166215 210827 208166
21083 208166 -5918 81020 350452 453226 331179 371176 338186 428985 -23273 -317923
21073 -317923 -169687 -264230 -511896 -234803 67710 75139 -54434 98768 110676 -18810
21063 -18810 75121 417017 306763 141115 73851 -55070 -25288 -189111 927 -29903
21053 -29903 32442 -173028 -188081 -216780 55839 362113 439253 286408 113776 273999
21043 273999 407194 518510 411204 -110355 -78766 295104 126465 410768 499432 258448
21033 258448 154747 -68184 -103776 37334 308377 243660 -12981 -234379 -212492 74825
21023 74825 186493 202766 227207 405099 351244 70144 205452 579037 703503 718103
21013 718103 381876 40004 -200185 -382841 -442553 -92923 -416165 -309955 358153 559978
21003 559978 598366 279061 335966 429717 321730 452810 174076 127979 368250 26024
20993 26024 229208 534266 373983 368783 347444 -19859 -207637 -280560 -271768 -96663 -18739
20982 -18739 -311195 -471269 -658426 -729470 -255147 -123265 -74107 -69898 -226606 -293588 -52395
20971 -52395 94220 342981 603165 466638 252393 80907 150841 268283 303960 251530
20961 251530 45154 223243 317824 17632 -51493 -274122 -81252 336701 431193 472794
20951 472794 540055 373189 -349884 -321179 240976 252105 -186101 -347201 -242742 -262460
20941 -262460 -251243 -687365 -766975 -682060 -604876 -316693 -520504 -481397 -596611 -96101
20931 -96101 194750 14914 -429039 -683729 -158534 6274 -239307 26764 -32992 -365451
20921 -365451 -331924 -226320 -513449 -743665 -705536 -126613 359542 48922 -282017 -524388
20911 -524388 -146030 -17308 42345 -41086 173153 112446 -194691 -161692 170066 283184
20901 283184 208130 -13139 -332960 12815 132270 -525494 -398430 -78650 54889 92548
20891 92548 -333577 -269170 -81266 -182987 -19649 -279632 -353546 -363737 -466325 -443153
20881 -443153 -419338 -234823 145731 123812 -261260 -213896 -15159 -38817 -180296 -444020
20871 -444020 -116084 314684 361488 411902 306594 -313860 -314070 276399 657531 315945
20861 315945 146305 261986 157912 160955 189627 -122206 -631743 -647979 -279142 54044
20851 54044 1944 -12806 102687 77718 40977 57392 -118105 -65239 51019 -15803 125786
20840 125786 80690 -199139 -357469 94233 443013 558554 233198 216720 216073 482721
20830 482721 438571 80693 -101254 -367275 -277082 -247943 -113683 -188777 -438144 -384814
20820 -384814 -9345 251004 371261 402733 402973 140193 -430709 -425399 -369051 66278 324450
20809 324450 8558 -148435 -365507 -374612 -381789 -207054 -330322 -279260 68155 -2299 -458584
20798 -458584 -338088 -139832 140347 225126 89570 -96688 23669 -112150 -8383 186347
20788 186347 271133 371850 217031 -150599 -216627 -127403 81045 28904 -353015 -353114 -162927
20777 -162927 228888 235258 16402 279167 -2956 -81885 71823 -192002 -251406 -230287
20767 -230287 -330036 -205348 272702 793135 650857 243959 -40086 165431 372630 361527
20757 361527 313549 443630 516608 503230 329407 504685 365043 12837 97775 413499
20747 413499 383675 339750 91527 276405 302457 90138 -156634 -139805 -6540 -16673
20737 -16673 -38316 154698 317803 512638 497770 452827 729774 658364 609976 319345 332084
20726 332084 573577 441575 184002 227316 100603 -17660 14165 9243 84494 400378
20716 400378 818166 990561 506996 -2485 52684 85388 -158635 -482475 -764832 -801778
20706 -801778 -585905 -128610 62260 -5292 -115424 -206447 -239317 -42836 424324 537190
20696 537190 522805 484885 320494 558888 157290 61996 -162104 -52740 210571 252897
20686 252897 -167488 -166196 33575 -44874 -104561 -160746 -230689 -120731 -148759 168318 409435
20675 409435 329121 61070 204019 226307 -155098 -96312 178709 -146095 -249520 256831
20665 256831 575533 116874 -121607 -103693 75498 206720 254232 247941 -54308 -295463
20655 -295463 -273271 24415 95799 59065 291523 712166 662044 55368 -44740 50031
20645 50031 -152047 -235853 -137288 385228 566202 422387 582513 308023 194982 113154
20635 113154 91228 24926 574 182707 330516 337183 394881 229812 19370 -201194 -109104
20624 -109104 220573 238117 274723 295086 350022 369112 598550 364543 451513 344441 331725
20613 331725 482729 493421 373263 133411 -22470 -485389 -588583 -581149 -186883 -12642
20603 -12642 -22681 150682 416088 565979 180527 -99206 -218315 -157881 -177510 36973
20593 36973 -146509 -139102 -76423 -90804 -330760 -350003 -234550 128078 380826 420414 616951
20582 616951 262164 -107336 -133059 8456 213016 107597 113474 -17658 -218982 -351621
20572 -351621 -167644 -19345 92770 317075 386416 495089 561185 506038 374906 198833
20562 198833 264233 406800 722603 517672 346455 194890 96627 -72181 -79279 80794
20552 80794 153908 222262 67072 -97362 277680 408502 408351 561811 251935 191868 229189
20541 229189 101523 -260505 -115295 -126746 -109362 188252 380950 463930 249194 353954
20531 353954 339019 225622 461541 558554 695939 515807 535609 284108 -250890 -28780
20521 -28780 66368 160471 555323 155519 -356709 -229834 -57076 -331183 -411015 279095
20511 279095 528709 154622 -48784 40544 -58998 -210113 -24347 365322 525245 379612
20501 379612 253153 116414 120089 214262 262424 87921 185437 68400 215353 364563
20491 364563 606249 369724 254047 298701 87615 -136083 64101 -167768 -439782 -86416
20481 -86416 191801 75045 -140429 -146308 -306073 -404563 -144929 285003 553517 498779
20471 498779 510727 330111 87246 -18662 255601 457741 -13215 -340623 -648148 -462240
20461 -462240 75858 129928 151037 283578 234462 348432 581729 757027 168577 -181623
20451 -181623 -101007 319075 683841 627733 531728 487474 123834 -81666 -220801 -478266
20441 -478266 -463584 -142771 95137 214021 302949 -93587 -320203 -197881 -186726 -300026
20431 -300026 -311156 -84491 202219 661386 835853 429134 453691 407196 -10222 255920
20421 255920 467413 286340 -85411 169665 339978 190331 63571 80731 -56426 -409505
20411 -409505 -475111 -628010 -299956 -387785 -584035 -652803 -152442 -329144 -361919 -226250
20401 -226250 -7635 128977 -148381 -66564 -34028 158159 416877 142812 422149 535616
20391 535616 418661 445112 423148 562127 880993 841716 55832 -245951 -260585 -582646
20381 -582646 -318242 62742 371172 471630 272201 266787 443425 264853 273824 547941
20371 547941 619865 625367 756551 305481 106059 256796 444536 642790 476142 -39557
20361 -39557 -293642 -154076 -5812 -67492 -66989 -238860 -178510 -25843 213655 331179 309719
20350 309719 46386 -148381 340446 546664 237774 140691 -334070 -271473 -161320 -113108
20340 -113108 -78613 80766 554396 473217 377413 8285 -211880 89125 249230 517966
20330 517966 694572 622471 81973 -387920 -252323 -149640 -52238 170532 377588 530566
20320 530566 239032 368692 553301 442078 -33528 -78165 -286004 -415373 -436886 -298429
20310 -298429 -723932 -659786 -476032 -540493 -17762 366290 405956 712211 338289 374352
20300 374352 495997 82676 -399432 -279920 -21803 58519 258589 323360 120478 -73713
20290 -73713 -288837 101561 288823 384924 76408 -69449 286073 578190 958210 532559
20280 532559 122840 -324335 -382735 -474911 -286772 190810 204040 -145822 -211871 -120528
20270 -120528 -113253 144863 425472 374612 -47511 56173 37609 -27819 175704 136503 195833
20259 195833 369721 450103 470577 711510 693642 402481 52682 -318082 -70590 -287475
20249 -287475 -305392 -365714 -571888 -728677 -586535 -30116 464311 401844 322837 252816
20239 252816 542668 706539 423042 461007 524778 317477 -219113 -578979 -130557 -64344
20229 -64344 -48857 113744 75114 295826 662904 242437 -158775 -180539 -580760 -802196
20219 -802196 -532195 -194400 -305182 -151708 -239785 -167564 -259282 57843 149910 -3604
20209 -3604 167591 433213 517368 637479 246062 125986 83630 -111528 101404 -46414
20199 -46414 94234 180880 355525 295725 216743 -268210 -336941 -126453 -138541 -268962 -189530
20188 -189530 -375458 -494258 140546 452547 290543 11233 -314267 -382887 -441766 -562753
20178 -562753 -305683 112964 360377 637838 1174233 1444782 827467 316683 415574 292440
20168 292440 -19972 -86086 -23661 146131 44155 -162672 -158017 -25782 -116592 73021
20158 73021 86206 74644 -140138 70096 266777 312911 359416 11706 -396919 -443979 -813296
20147 -813296 -890493 -592845 -450710 -212684 -201667 162822 301975 -94339 -403209 -543783
20137 -543783 -316903 -144601 -476913 -560250 -660029 -713508 -498193 -488792 -587443 -386032 -176292
20126 -176292 -153343 86165 74672 -477438 -461047 -149071 149402 443406 555869 326850
20116 326850 100706 -98033 357462 625243 389909 239196 301936 124976 103893 -287084
20106 -287084 -506491 -498261 -7363 83932 261255 7886 -72344 -217813 -474934 -601062
20096 -601062 -469812 -347044 -170135 280954 312369 110666 365460 411841 258173 -180173
20086 -180173 -490949 -165364 -67135 44735 119395 302006 525657 370466 117618 56769
20076 56769 -13688 60687 223147 138549 14318 71437 29986 -2063 -51916 -43925 -222690
20065 -222690 -570408 -635700 -295046 156140 267487 414723 100610 -7012 -318721 -463125
20055 -463125 -204382 -3653 106805 -344658 -406428 -152572 125654 49090 -145607 -254069
20045 -254069 -302340 -9658 113140 -108467 -753528 -372173 21703 -5793 6619 465729
20035 465729 -48554 -602575 -537130 -298486 -227215 -179429 324983 472243 347139 553500
20025 553500 221016 111007 24310 355169 498718 410696 272542 -262785 -177580 -364898
20015 -364898 -346340 -228732 73357 353111 506006 520012 296701 146326 194460 208711
20005 208711 90893 27601 358086 384130 404714 171964 229411 334256 231942 531682
19995 531682 1126182 1286532 1186699 968484 1397097 1578458 1740928 1877893 1934112 2172534
19985 2172534 2152232 2223051 2389162 2111955 2089367 2283722 2520682 2803371 2583879 1884367
19975 1884367 1609910 1948230 1873409 1860455 1695077 1320497 1477178 1611392 1424530 1333964
19965 1333964 1295749 942562 398944 488493 737132 624367 518765 377433 329555 133180
19955 133180 151253 273066 260680 249545 205618 399117 712944 440807 268735 355535
19945 355535 413634 438059 200221 -197034 122295 624323 588772 524950 650160 573006
19935 573006 371189 140581 278691 307047 303714 200366 -35937 189963 283287 458217
19925 458217 500370 340285 539290 980975 729178 291739 87951 -10834 72424 256072
19915 256072 130500 -109612 -308269 -130618 278595 404695 483355 520498 414780 241132
19905 241132 347620 422875 199860 -145930 52416 108110 -87597 -356048 -392370 -164627
19895 -164627 364939 357727 264057 460828 584962 494939 367631 285576 269392 416777 356093
19884 356093 -42918 -137593 241269 189507 19364 -61240 102874 212877 -56177 -121198
19874 -121198 335089 314427 6068 -117223 -98906 -198252 -165168 235138 80417 -248409
19864 -248409 -253956 -181617 -48965 967 -97351 -34699 -110643 -68352 267608 529901 346749
19853 346749 -109162 -691408 -821702 -566424 -155698 194628 203864 171461 278845 538138
19843 538138 492399 558604 285484 -111991 -166973 -463589 -503571 56277 480121 727716
19833 727716 886632 732360 563344 594432 784279 953443 756240 520404 311854 261620
19823 261620 -16866 -76948 27723 121444 -21100 37305 -76246 -68621 189141 288672 225593
19812 225593 154104 359854 273378 81039 213059 280940 429010 626673 763879 834474
19802 834474 408464 232175 770453 1008546 655020 535547 666462 660210 622724 351582
19792 351582 348558 437184 420781 286190 239216 275265 378801 767729 736180 529366 441825
19781 441825 330126 108361 382222 61707 -235209 -420267 -492063 146361 413064 433077
19771 433077 409520 263465 86168 95001 22735 280649 550482 595406 238731 323108 561186
19760 561186 898116 673086 254499 179995 294980 9084 79067 373619 657191 222437
19750 222437 -48732 5340 261317 738419 620902 225323 110460 249099 496464 628451
19740 628451 710862 556289 294163 71163 -84581 -62684 -95650 26715 41411 198779
19730 198779 39602 137019 357801 370126 369063 341648 650254 803039 603897 129523
19720 129523 319660 659979 469799 235148 515935 675435 681243 544148 467750 458151
19710 458151 263594 -136486 218039 761307 473849 439308 411970 346868 320248 890642
19700 890642 957678 671360 475418 371506 464971 773817 312432 -137501 -438460 18970
19690 18970 688604 810394 731184 541502 291080 572347 326156 395750 707661 732843
19680 732843 672307 573056 473956 552090 339504 153077 -26522 -12897 277820 431518
19670 431518 424165 519022 339028 -109144 -145748 -429729 -258665 -33058 -45275 420663
19660 420663 576621 865835 657630 621185 288965 68443 -8203 -5332 -109084 -72216
19650 -72216 62115 114923 234760 160807 227152 414340 502459 790058 759215 1182228 997633
19639 997633 588570 425202 702202 566206 228232 -2006 31776 364793 562196 646143
19629 646143 691851 783535 786783 883773 1120371 1349567 1239990 857030 706864 734086 633132
19618 633132 741840 547233 114225 445805 667128 780485 766127 563459 652210 906297
19608 906297 931542 1116645 853744 546623 463635 501548 580528 732856 711763 802809 813525
19597 813525 680371 555300 911912 715455 485698 564847 645815 1068550 1535928 1521177
19587 1521177 1104298 702519 357945 582173 919100 999371 944694 986368 1113862 1050358
19577 1050358 1125117 1199196 1387556 1087842 802340 698055 941538 1120362 1143523 1363319
19567 1363319 1438582 1269176 1162977 1265492 1405429 1530020 1377672 1320285 1331472 1423530
19557 1423530 1319227 1383957 1327223 1390127 1384197 1619955 1994035 1842797 1623625 1864866
19547 1864866 1851922 1904455 1789052 1320571 1247199 1569758 1701829 1874876 1583080 885429
19537 885429 833603 952898 1072158 850788 820267 827944 741821 813773 1143637 1499973 1535894
19526 1535894 1419185 1613493 1600513 1430756 1664368 1588045 1521217 1191291 1034320 817438
19516 817438 741993 1224038 1396979 1190763 1036257 1064431 1088665 1543467 1699651 2186415
19506 2186415 2250225 2294429 2116497 1684977 1601773 2010147 2096980 1646088 1152302 1510348
19496 1510348 1878396 2374220 2509702 2326771 2298944 2296417 2766638 2928934 2606534 2441222
19486 2441222 3067083 3465561 3966292 4495003 4830615 5066045 5208390 5227610 5461309 5885732
19476 5885732 5832441 5677105 5536832 5316249 5179108 5303006 5526158 5760285 6157524 6379122
19466 6379122 6508579 6702732 7301866 7706415 8103631 8304991 8466566 8847743 9437974
19457 9437974 10358208 10809864 11083874 11858127 12894199 14263701 15625472 16939645 18665684
19448 18665684 20326011 22314133 24469166 26899976 29082736 32410542 36293625 41034015
19440 41034015 46622956 53276309 62044248 74045294 90871903 116056882 152257930
19433 152257930 198615788 242609020 268644648 273172456 270322730 278069702 301904454
19426 301904454 329001861 343812760 347145248 348981837 349963994 340487064 318188133 294562047
19418 294562047 283273645 287465678 290883371 273998210 235352508 188054948 144970025
19411 144970025 112770466 90746147 75581517 64344470 55577301 48888217 43485247
19404 43485247 39013225 35098307 32169412 29231044 26499105 24012538 21773787 19836314
19396 19836314 18138811 16783149 15302984 13807240 12472652 11253855 10112506 9198630
19388 9198630 8414225 7859311 7097931 6913512 6408548 5963823 5591590 5378318 5055076
19379 5055076 4649454 4216764 3601755 3494181 3705715 3438208 3244796 3120652 3120821 2807003
19369 2807003 2769454 2803514 2387544 2477443 2433385 2334075 2490215 2442209 2178284 2413386
19359 2413386 2440306 2505882 2851029 2743884 2179126 1681129 1868388 2119353 1984519 1964639
19349 1964639 2320252 2211586 1902724 1724469 1635983 1612871 1491478 1097716 851353 663422
19339 663422 941376 1459734 1888687 1820258 1208364 995430 946184 944201 833058 1076309
19329 1076309 1099722 972441 907621 1138983 1002708 1242909 1488659 1128998 796480 844780
19319 844780 883239 682331 1011089 934485 888033 1050369 1097708 1187482 789846 618145
19309 618145 632161 719162 743968 700998 533885 633880 423510 340216 393586 532333 387038
19298 387038 -14501 21762 -89708 243760 189095 674996 558279 528399 448412 389981
19288 389981 456897 628632 470398 424258 524842 595134 514030 407776 471810 473125 547851
19277 547851 268258 196005 132797 471088 715092 741066 619953 381506 570708 938146
19267 938146 581354 311959 115759 341525 538862 644975 365107 305006 539304 354894
19257 354894 34363 -85416 235693 348738 297246 313390 173969 227062 316737 334494
19247 334494 441422 218208 45227 -15147 62807 254304 615624 474984 380666 415290
19237 415290 186487 105021 183700 470830 506788 585938 453269 242248 265992 314550 607888
19226 607888 895049 920611 755448 589556 437487 647150 835930 647966 924014 772081
19216 772081 443118 77982 -123544 -47470 -5180 51986 197814 -24451 -340105 -200988
19206 -200988 51026 460750 473434 382296 506814 655351 577338 462638 459898 398995 162157
19195 162157 112808 142437 560 110432 325101 504373 524342 28343 -10071 182636
19185 182636 278066 360986 354661 190403 297455 260416 473321 747605 1195517 1198571 1077627
19174 1077627 1088934 852976 558733 484079 332067 220804 455295 632412 367646 548650
19164 548650 575417 345279 621616 1195315 725846 662598 731088 401410 59676 45427
19154 45427 251943 414682 625419 829487 914570 847949 867093 579244 486413 884183
19144 884183 849094 848079 787527 445544 805528 938677 926440 718419 688556 743488 488696
19133 488696 422743 664398 632386 454091 544547 730871 647406 499411 904541 1136275
19123 1136275 1110728 1138918 1425859 1141430 632528 642337 463286 333933 654950 601306
19113 601306 617338 615998 602924 539548 736235 877851 941818 1091752 1102181 1011351 1062587
19102 1062587 841998 726348 455737 577051 510835 329302 445110 375289 244975 518477
19092 518477 728368 819907 980415 1052249 1280074 925222 670610 487664 498131 595703
19082 595703 713850 808712 864647 767903 932188 661733 574360 912334 881988 596701
19072 596701 425181 476111 256368 517465 1054180 1337890 1507076 1309556 920992 829323
19062 829323 945668 1149411 1148191 1222780 1397884 1490096 1332144 755574 732341 830666 1008788
19051 1008788 971117 782176 725363 1108986 898507 795490 1007020 1051893 1143677 1246374
19041 1246374 1491190 1441361 1537881 1293989 1456776 1682852 1594102 1445750 1128289 993901
19031 993901 1316886 1605813 1770198 1606452 1053050 1087437 1257953 1096364 929905 959350
19021 959350 451166 473071 310713 605474 1229439 1328229 1461943 1407357 1264362 1377973
19011 1377973 1487845 1612854 1548085 1480344 1628202 1711842 1555513 1765123 1688373 1725649
19001 1725649 1660259 1495610 1593227 1695929 1734408 1852044 1655707 1881611 1966084 2079284
18991 2079284 2617466 2555569 2302904 2414998 2833490 3047056 3295186 3889842 4300078 4556612
18981 4556612 4504237 4374224 4424693 4440079 4736834 4809431 5292961 5879019 6239673 6518457
18971 6518457 6553815 6376084 6296414 6328876 6215334 6450475 6595121 6504177 6043182 6067724
18961 6067724 6216959 6767022 7398882 7850645 8346245 8951216 9694129 10985635 11934390
18952 11934390 12819196 13894634 15469939 17096531 18689269 21113089 24249689 28092176
18944 28092176 32708648 38807992 46881575 58227561 75503403 101004452 136468116
18937 136468116 176707675 206837755 215959977 209433341 202050942 205777714 217035209
18930 217035209 218954850 199878482 165931253 129226959 99285248 77599390 62142957
18923 62142957 50652170 42438320 36872090 33136138 30210293 27390620 24416696 22256137
18915 22256137 21218418 20070772 19087810 17777878 16449799 15505106 15116620 14872640 14203073
18906 14203073 13686392 13104904 13117342 13225289 12938189 13100455 13232331 13433106 13891111
18897 13891111 14361207 15332736 16668731 17865383 19150880 20102125 21160609 22679208
18889 22679208 24431550 26626644 29831243 33950382 38841378 45355540 54248211 66273274
18881 66273274 83357301 109314937 147500296 197884762 247922464 277653981 280344736
18874 280344736 269198646 263674890 273452282 285612945 277898488 244319593 197030711
18867 197030711 151301184 115623390 90234616 73016605 60480268 51064663 43978247
18860 43978247 38769404 34627418 31013664 27703856 24779139 22465890 20501881 18751032
18852 18751032 17252981 15654244 13913492 12768002 11880736 11171450 9923921 9051777
18844 9051777 8163007 7389960 7113237 7000909 7057881 6905302 6624208 6473209 6334193 6132100
18834 6132100 5524587 4974741 4256512 3951559 3836136 3555069 3159331 2948326 2936198 2780814
18824 2780814 2524301 2621314 2481999 2467493 2672979 2531618 2551442 2392116 2133368 1880608
18814 1880608 1882668 1839826 1993210 1952507 1658595 1717561 1651264 1557855 1678136 1872553 1815975
18803 1815975 1515213 1648616 1501655 1698880 1570437 1460924 1796913 1535939 1243146
18794 1243146 1322495 1330900 971500 1023394 1088537 825873 898634 740908 504786 513335 475180
18783 475180 421737 134792 176045 724663 1099369 1013506 911711 961562 1142753 1255214
18773 1255214 1306174 1444929 1793031 2204281 2673531 3157531 3441221 3629076 3116204 2610296
18763 2610296 2110673 1403227 993281 1217927 1488226 1488445 1598948 1589448 1271914 949055
18753 949055 1206662 1335339 1123644 734116 577864 184964 190541 697605 815181 428350
18743 428350 564335 527067 347219 223745 180431 725 395656 497834 767519 830658
18733 830658 741876 212245 -102721 181573 242412 315407 299381 240605 -74112 -243892
18723 -243892 -280228 -226766 -389984 -316570 -223868 -347391 -266311 188289 249651 50679 252551
18712 252551 486061 434397 536808 768933 951626 1035339 936828 760117 797959 730089
18702 730089 315845 334891 662892 834706 554172 520553 528070 598145 693448 391944 323428
18691 323428 385180 416463 459692 -9889 -36350 109133 206002 588153 1130310 1069498 739515
18680 739515 444187 456005 589843 354334 50122 -76842 296125 417219 760597 843447
18670 843447 655488 361136 296108 636938 822322 932574 728590 81521 161921 446850
18660 446850 666002 714583 309200 133238 136676 337545 810668 1320529 1238099 959004
18650 959004 819838 777091 414189 286309 698098 799589 634926 716936 939092 661156
18640 661156 482083 199593 111943 151862 397899 792001 964740 1040470 995781 799440
18630 799440 910155 710212 518942 951789 1325386 1236321 1414675 1217099 1129082 1572537
18620 1572537 1644240 1270478 824096 641582 577100 685586 1084741 1152308 891579 706589
18610 706589 928079 1025979 599957 161557 502701 820391 1215200 1002204 720699 695001
18600 695001 775258 751335 729810 685316 653312 467971 244540 52163 500147 819200
18590 819200 1226119 1166073 1108979 1232461 1535630 1688864 1682313 1460891 1261614 960204
18580 960204 1292203 1275745 1185232 1069579 1230218 1078877 1260536 1497492 1767561 1641945
18570 1641945 1404441 1362582 1153299 737389 1031618 1334164 1228439 1209844 1682937 2273820
18560 2273820 2460336 2193892 1861008 1487811 1698111 1696180 1642796 1851393 2227952 2268445
18550 2268445 2146477 2173266 2007736 2277388 2318187 2344055 2796584 2884573 3052907 3503095
18540 3503095 3536115 3569909 3542240 3503864 3479419 3717735 3845268 4357080 4970407 5409298
18530 5409298 5606871 5664332 5746540 6131435 6380354 6728377 6896170 7031841 7524308 8062439
18520 8062439 8519586 9087593 9589710 9653273 9965565 10638687 11749413 13277040 14322360
18511 14322360 15516709 16887198 18308520 20136335 22635845 25972304 30438153 36275319
18503 36275319 43475379 52141049 64203885 81650055 107520767 145043211 192240924
18496 192240924 233646312 248381849 232494367 199286101 166656284 146108978 140300182
18489 140300182 150026843 175364041 211154385 240771801 244505761 218866825 176619798
18482 176619798 134644844 102370743 79913479 64081548 52848217 44852239 38687815
18475 38687815 33614887 29749714 27241032 25322116 23375549 21526150 20143105 18895096
18467 18895096 17725449 16780056 15938912 15373120 15056611 14664794 14775496 14516825 14413677
18458 14413677 14342696 14173330 14279448 14322907 14834298 15423304 16202347 17304850 18109585
18449 18109585 19198299 20276319 21714111 24069500 27337733 31979212 37814517 44968296
18441 44968296 54890152 70272281 93397744 125452018 161342265 186696489 189219829
18434 189219829 170828409 144072717 121467715 108960930 108413373 120454606 144157287
18427 144157287 171764742 188723337 182772675 156762418 122808277 92600252 70593815
18420 70593815 55331350 44623703 36714241 31180604 26644887 22823818 20042644 18063149
18412 18063149 16331018 15043706 13615690 12639231 11587619 10406971 9143282 8181434
18404 8181434 7889530 8021510 8104969 7717796 7263914 6619264 5822909 5475891 5142922 5335815
18394 5335815 5078009 4752725 4237952 4077360 4181941 3647321 3171835 2962638 3186816
18385 3186816 2983381 3016124 2958687 2703851 2403599 1968243 1872140 1858073 1813769 1877458
18375 1877458 2357080 2806683 3165514 3430088 3264582 3080773 2974995 2967410 2961109 2974888
18365 2974888 2992867 2373907 1827281 1938895 2256039 2334909 1942937 1532049 1382459 1493112
18355 1493112 1265055 1510083 1484802 1163235 1031841 877396 939799 1352610 1564470 1201645
18345 1201645 858784 929449 1088153 1493849 1670381 1275520 1142240 1101046 842104 429135
18335 429135 419520 670184 534859 73808 -161321 28923 216929 409888 827146 1209184
18325 1209184 1236189 868931 95590 -102469 193922 301241 225823 286334 558925 1269446
18315 1269446 1718230 1575113 1255984 998635 745942 573896 746469 925337 1207397
18306 1207397 1173540 991099 633214 332819 533929 409616 13017 288234 699883 865740
18296 865740 790734 570358 411485 434972 389890 235462 155118 301649 165604 -257599
18286 -257599 -51261 96616 1266 350145 542036 599992 598023 375263 205597 -101972
18276 -101972 -187499 -125713 -287089 -122975 -293033 -517634 -297542 -302732 -129403 372267
18266 372267 475106 391210 485509 297716 713458 685682 506204 523872 237500 212464
18256 212464 504591 610251 718474 803202 600163 389470 360633 417288 431894 797915
18246 797915 743425 529694 374831 507811 499566 396442 258884 63809 48235 125691
18236 125691 308532 190123 131000 281610 222882 337914 428449 197583 -119801 -104735
18226 -104735 105181 171610 312927 183490 161128 413731 666609 720110 591394 640242
18216 640242 572064 398870 227005 46345 27579 65286 11265 76343 608186 1059955
18206 1059955 1069877 1376880 1183531 890828 1165663 1253823 1059982 1211167 1359347 1230473
18196 1230473 987068 995500 822312 941140 780618 712774 738766 492115 1076093 1279129
18186 1279129 1172270 1337880 1581616 1667942 1052664 628881 816863 1294136 1317098 1128039
18176 1128039 1284525 1378802 1335857 1242588 1019111 1052383 895768 537371 442826 596864
18166 596864 907672 1107724 1525892 1502579 1872828 2329304 2303450 2485745 2773577 2575043
18156 2575043 2088703 2199538 2369917 1875758 1874394 2328364 2507955 2403277 2332049 2467275
18146 2467275 3050872 3501654 3265304 3711520 4228417 4246352 4172231 4513058 5442533 5916857
18136 5916857 6233954 6481443 6578698 7153725 7509936 8271868 9397076 10252281 11040994
18127 11040994 11723987 12844663 14683125 16375298 18438399 20680147 23564111 26706051
18119 26706051 30935302 36822864 45019296 54898251 67947123 87097381 116046976 161536556
18111 161536556 231082255 320932708 399331670 422450419 380190001 300653949 219526878
18104 219526878 158359942 116786914 89468613 71172947 57918140 47842683 40467837
18097 40467837 35036333 30298447 26313125 23490630 20929326 18019892 16220036 14790042
18089 14790042 13326369 12158543 11668516 10840193 9731528 8873797 7958551 7019136 6424889
18080 6424889 6228802 5998587 5742837 5250999 5088137 4543646 4251052 4290777 3826856 3272128
18070 3272128 2680311 2192602 2356319 2181916 2093865 1982839 1973993 1960660 1796743 1667478
18060 1667478 1500315 1570099 1493889 1226917 906852 574876 627744 661729 706365 1014034
18050 1014034 1585105 1514427 1661979 1789543 1557194 1325004 1229491 1152539 1276056 1442443
18040 1442443 1588691 1573902 1452080 959392 875649 634764 474114 792221 826114 376178
18030 376178 -116299 281588 581647 478607 595803 677855 308259 194395 504314 821904
18020 821904 719571 449508 297588 583867 411739 222326 57725 160415 -31893 -26728
18010 -26728 277056 308153 665766 578351 762050 643991 552427 359820 425997 788496
18000 788496 579178 425333 270680 168229 258613 412778 514893 575801 579010 586268 970083
17989 970083 936535 268606 182494 187511 261037 90491 -198529 -337403 -139674 19940
17979 19940 38373 -207682 -349340 -384500 -381685 -285597 39247 191691 344543 199251 221862
17968 221862 395364 448526 357176 212975 81037 214690 250766 133878 220901 411836
17958 411836 802325 990447 1114259 1071557 812690 726290 833937 1246278 1125939 887608
17948 887608 810840 606871 562164 728517 1034034 886851 537052 419213 492578 349278
17938 349278 415224 693251 526677 279227 275771 85423 -335226 -656920 -438248 -120061
17928 -120061 100414 469858 -54043 -453047 -395277 -580015 -827509 -601136 -431687 -412878
17918 -412878 -482978 -365153 -273692 285918 790800 683993 325952 171883 181343 73008
17908 73008 113023 69644 -76321 -128254 253366 219423 -2565 288742 603207 588679 330340
17897 330340 462552 886284 1086840 1268152 1379134 1161585 786216 621082 752117 860416
17887 860416 1279627 1555561 1341975 1105405 1000230 961099 679782 451019 42408 -271263
17877 -271263 -273983 -177965 -620396 -548228 -330303 12245 176915 108990 52197 -39395 147073
17866 147073 142359 493948 521996 210260 427956 279077 187920 -118341 -536538 -629788
17856 -629788 -438603 -494381 -350113 -72746 105494 -152653 -595808 -474835 -508676 -347074
17846 -347074 -241778 -193160 -405079 -251298 -29841 70023 -262973 -355113 -429894 -346213
17836 -346213 -394424 -315174 -166898 51110 -91183 -259024 -508859 -645167 -877667 -531876
17826 -531876 -425081 -309833 -656257 -474143 -339782 -368615 -210314 -146731 -96639 -70921
17816 -70921 -287397 -468673 -476198 -540918 -222959 103030 298985 624506 491054 431850
17806 431850 348700 286785 331166 31833 48021 141596 140890 -88735 -183121 -357830 -126587
17795 -126587 -24929 -66425 -164919 -415469 -371012 -298150 -501722 -864402 -668624 -330940
17785 -330940 -454791 -233421 178593 584438 481487 372952 336159 -10787 141584 207091
17775 207091 -121466 -295704 -321309 -495827 -649962 -562989 -245927 121305 16198 -309952
17765 -309952 -392884 -351470 -222267 335578 629997 628965 495105 -20261 -80463 -8473 -47247
17754 -47247 33800 113618 -152924 -480760 -472091 -25630 -235538 -538961 -195815 -4157
17744 -4157 123418 175514 113327 -89326 -95643 104871 133729 113915 -198329 -301543 -267888
17733 -267888 -112716 -493503 -486958 -528967 -464200 -361941 -160753 -124354 -6502 -61777 -46318
17722 -46318 99631 -20958 -325113 -212512 -130297 -248464 55722 114023 -140704 -149399
17712 -149399 -91962 47237 -95455 -139433 224056 252872 -167957 -454295 -727560 -533296
17702 -533296 -422388 -613314 -399397 -255542 -200988 -205727 -187386 -19156 -281048 13529
17692 13529 515623 516023 38464 -53944 19820 -295728 -799523 -925985 -701050 -365020 -126117
17681 -126117 261798 150233 -45772 -155615 -181736 -474182 -715642 -667609 -271048 339374
17671 339374 393044 -193708 44324 249641 295254 270860 53934 -184095 -338973 -628596
17661 -628596 -505116 -117668 290166 506414 592453 365721 -97214 -335962 -300608 -304375
17651 -304375 66392 -11687 -113156 41747 11308 243561 190932 25974 1502 -100511
17641 -100511 -250308 -110293 147546 304667 72732 97437 -172708 37748 134124 -188666
17631 -188666 -397335 -173204 -24891 -40491 185360 41311 -68748 -90578 79737 -14223
17621 -14223 -235066 -236586 8562 314796 370685 402406 729100 682300 419175 386186 519074
17610 519074 454642 316408 76182 109048 64151 -183144 -261961 -92772 53736 -266862
17600 -266862 -205621 88172 89820 183540 252475 220140 -210197 1705 5144 -94712 -341985
17589 -341985 -411597 -158494 57143 324414 611301 429752 117426 243390 294666 186502
17579 186502 475658 524691 352929 146894 334419 24324 -110457 278567 262330 60508
17569 60508 220297 181439 421234 39500 -419183 -472637 -520094 -107483 26088 94353
17559 94353 -35727 -216455 -285959 -471494 -331865 -213720 227027 331145 277109 130627
17549 130627 101984 36921 170912 199751 29939 -166358 -104370 -229846 -414483 -325985
17539 -325985 -256532 -311676 -156076 82426 -147650 -415390 -711248 -672901 -557104 -103377
17529 -103377 -56898 147071 171336 177954 71503 67995 -146807 -169651 -123826 -138851 50192
17518 50192 -181294 -403453 -220577 31636 137487 -11557 136809 74392 258313 290990
17508 290990 149919 412657 411456 293010 123776 -17279 29164 -19168 -95246 -318716
17498 -318716 -195340 -267923 29405 216619 55783 -295497 -214458 -139924 701 -114670
17488 -114670 -114722 -49975 52181 -316684 -490970 -186054 -35598 -472187 31582 138718
17478 138718 53590 22321 -182363 264169 9245 -452210 -483037 -337449 -457328 -401738
17468 -401738 -212260 125756 97791 283645 642270 825669 357942 222541 577299 591165
17458 591165 431069 517103 429008 219950 377302 546885 196110 -276806 -184126 -302430
17448 -302430 -91215 13096 511029 664627 1093690 1647196 1708237 1549469 1074637 749711
17438 749711 662451 299914 164170 688224 864154 855930 646927 516301 465631 511966
17428 511966 567263 230084 24978 212217 481436 328302 74057 -185344 -355405 -345918
17418 -345918 -243078 -265570 -397335 -656984 -552226 -192058 -313634 -432544 -312188 -199345
17408 -199345 205651 536232 513155 336892 283006 71701 -322621 -498364 -1549 210133
17398 210133 429527 560092 564932 208284 345123 -9967 -99337 90903 -57240 194530
17388 194530 418511 451834 108802 -298780 -420490 -511351 -496249 -137229 265651 368742
17378 368742 343456 193119 31709 168656 199753 223138 100489 64849 53786 248728
17368 248728 181916 304655 262854 -167753 -116626 -17877 -15807 146399 20873 -211263 -399403
17357 -399403 -341219 -204979 -230919 -306674 -149039 -25955 48180 -118760 107296 304640
17347 304640 402445 219776 -374391 -410726 -581047 -428498 176850 237623 230469 206897 -51786
17336 -51786 -39134 174333 105398 -77521 297069 951687 799404 509365 313277 551375
17326 551375 456688 261806 23922 92025 28013 -48932 6270 10057 54963 -85292 -688133
17315 -688133 -498516 259087 432611 48133 -147854 161257 121144 -204717 133869 387310
17305 387310 -181978 -615552 -497635 -226993 -10206 -61603 -261964 -205257 -72875 209280
17295 209280 33202 -197095 -263213 -134080 -55898 231903 -3171 -363362 -469059 -320125
17285 -320125 -47799 47038 135531 -5766 31200 67012 306457 728827 864862 1032432
17275 1032432 967138 560557 268968 191248 -97551 -29947 166426 377454 262805 -30650
17265 -30650 -351799 -494723 -306554 -238832 -101557 -74819 -84231 119517 167675 177120 20006
17254 20006 7473 -56228 -451422 -346762 159282 -221922 -422954 -368283 -204470 -87099
17244 -87099 -104604 188333 300072 47076 -206187 -291901 -108675 -208340 -316447 -457208
17234 -457208 -341917 -283158 -344923 -325306 -114684 105395 137265 -128225 -462807 -638474
17224 -638474 -663142 -783901 -800166 -932171 -483180 -406998 -123914 236374 249852 154657
17214 154657 313127 882671 765723 528158 744553 639128 314805 370121 133471 24221
17204 24221 -93179 -22151 57444 140562 -179377 -322118 -398674 -464701 -562153 -512756 -680538
17193 -680538 -487928 -122608 -103287 -350846 -161564 -112266 -159920 -143419 -118393 -86654 -231896
17182 -231896 -314003 -174551 -18835 -36132 350729 764349 713894 376663 -57219 -360377
17172 -360377 -570115 -616281 -809095 -685295 -492634 -402431 115111 162168 195954 85086
17162 85086 364304 172364 160242 181754 -74401 -413133 -449991 155489 750654 930479
17152 930479 699027 183157 -51162 -429405 -306769 -378964 -355627 -203791 24285 -307712
17142 -307712 -477372 -252619 99168 387738 195752 202393 67438 79207 -339521 -757944
17132 -757944 -986566 -861760 -572057 -101456 329308 151810 -310027 -277678 -363101 -506352
17122 -506352 -154186 18543 -122376 -265057 -397928 -198599 -163649 -151939 -13140 -18720
17112 -18720 158568 -64363 -236829 -475524 -699226 -986900 -1124076 -601011 -86629 304817
17102 304817 139615 -93040 -82432 -84264 134950 229182 -222608 -385358 -239206 -175032
17092 -175032 -195096 -166742 -61371 -195097 -17053 81229 66956 43301 23108 250471 326014
17081 326014 371071 305066 372368 709036 651206 72303 -289401 -221235 -555270 -714948
17071 -714948 -587575 -879474 -945134 -864005 -756869 -612034 -3896 -104815 -306385 51122
17061 51122 451587 304270 315040 257136 244559 -200936 -408255 -298674 -206780 -373753
17051 -373753 -487699 -380313 -251391 -464206 -689761 -499708 5326 132404 -16718 41968
17041 41968 238132 -16536 -210330 -172104 -54278 -284791 -368815 -32608 125633 -49260
17031 -49260 -13397 150134 -93534 183096 333471 195649 81554 220929 306958 553895
17021 553895 411778 378114 -249978 -639266 -274200 -38523 182876 77607 111779 188970
17011 188970 249685 144019 -151656 79332 314975 247138 144880 121825 -5027 100769
17001 100769 -337886 -385790 -484536 -538402 -415194 -385734 -53431 -136526 -132378 -250875 -48757
16990 -48757 16616 -28342 -106953 287443 641864 551346 372412 639186 731509 502558 148132
16979 148132 360035 451537 381888 -27141 21174 33931 9022 -50811 -68436 -116694 -31798
16968 -31798 9498 -113043 -104896 5144 217349 537930 183002 -407846 -552324 -114911
16958 -114911 -1597 -293180 -336998 -316348 -281749 -216507 -424983 -307600 -310903 -306761 -181693
16947 -181693 85263 232805 -29299 -257502 -601869 -892658 -623708 -346764 -428945 -254742
16937 -254742 -310480 -457697 -601699 -511948 -475013 -169803 252597 221202 7100 -63527
16927 -63527 -136259 -341396 -240605 -325713 -160235 201841 753781 920935 511358 429280
16917 429280 562041 379060 -4057 -145348 -238421 -466020 -444533 -643850 -586075 -409914
16907 -409914 -311456 -586079 -661805 -675722 -439356 -242168 -269704 -466875 -622720 -732134
16897 -732134 -382001 -206834 -395658 -423952 -334681 -374311 -313690 -255414 -255861 -584500 -174311
16886 -174311 89434 -88332 20556 20069 -65954 73346 -90203 -187831 -267719 -353305 -684383
16875 -684383 -624183 -536357 -542717 -190143 -203966 -249187 -106980 88965 299639 587593 -4329
16864 -4329 -266609 235552 196475 -239672 -448577 -344939 -200810 -142357 -196148 -413010
16854 -413010 -399357 -566677 -579710 -292838 -86338 76915 202156 211413 506526 278916
16844 278916 -163436 -111971 -357590 -211041 -56764 144592 378898 252941 178852 31026
16834 31026 -302270 -305842 -180877 73807 81504 -352750 -537000 -260343 -221557 -178052 247103
16823 247103 461510 755962 650459 613576 310770 145254 110463 586236 619009 49109
16813 49109 -97936 258047 519189 404998 157044 126003 343122 317666 493736 210790
16803 210790 240744 579167 158682 -418588 -456484 -456581 -253823 270598 349070 181983 91016
16792 91016 264637 438310 291597 -160754 -237258 -351106 -90515 122526 254256 331670
16782 331670 209099 300582 107181 -255445 -318217 -304703 -270830 -306793 -289913 -266814 -462899
16771 -462899 -606207 -880622 -1252196 -853783 -617999 -617235 -578597 -692319 -680334 -503362
16761 -503362 -621552 -376064 -314970 -369157 -424919 -526089 -232170 168660 70093 -229538
16751 -229538 -289704 -81731 -21510 -39568 -386685 -269678 -426934 -601162 -275702 410777
16741 410777 279636 26486 -300712 -198404 -322103 -418020 -617177 -498821 -94467 -234034
16731 -234034 -238482 -302889 -207603 111919 174187 -316579 -476313 -165722 -409622 -419627 -80039
16720 -80039 1421 20353 297024 872713 625908 486456 462263 261402 240162 240817 -3712
16709 -3712 -9532 -122417 -161818 -70500 -221465 -379724 -138011 -258430 -197248 -284672 -148876
16698 -148876 -17586 82544 -40631 -286704 -618132 -801007 -339917 -313808 -167341 176940
16688 176940 -198870 -537527 -723076 -906552 -292173 -36191 50185 -130572 -188379 175414
16678 175414 71346 -149716 -82230 33779 -46039 -135226 99754 -95756 135704 224938
16668 224938 303436 248013 196786 551488 576308 34237 -245449 -425409 -177684 -56874
16658 -56874 -215363 -81876 214404 92009 -125764 -386143 -336157 -260359 -437169 -169414
16648 -169414 -114836 73357 -158595 -151791 90162 126553 -53625 98753 -895 33845 24194
16637 24194 -349696 -212944 35684 57302 96932 288659 -37030 -117909 -247850 -125591
16627 -125591 -242809 -605847 -783890 -593992 -463951 -237960 -259253 -182684 6916 -201894
16617 -201894 -142074 234277 58355 -408748 -583732 -266673 284416 -206452 -253747 -447532
16607 -447532 -397953 -129509 -104375 159867 -136875 -661063 -664324 -394461 -369988 -257665
16597 -257665 -338053 -86848 131010 -215014 -583196 -400392 -426047 -522707 -491951 -414660
16587 -414660 -300597 -694620 -455234 -183464 -144295 -243589 -315345 -527907 -364116 -431780
16577 -431780 -1763 109013 14766 -71908 -247888 -462880 -271953 11263 -9044 -167246
16567 -167246 -220153 -27212 -197629 -301013 -185559 -309519 -220651 -87802 -260350 -172303
16557 -172303 -494238 -560418 -255353 172775 -135659 -366439 -141908 49724 55273 10638
16547 10638 32185 368391 502701 290457 117396 -37743 -152525 -217032 -176183 -243013
16537 -243013 -419461 -734276 -513080 -429711 -344089 -476639 -493801 -193227 -5762 -135716
16527 -135716 -305087 -364977 -116426 -201059 -247748 -121449 32266 119903 136259 -129137
16517 -129137 -40693 161642 442136 263587 -45125 -102741 132787 -151648 -406436 -556561
16507 -556561 -314340 -316719 72116 411411 466974 -185728 -798212 -886068 -535116 -322044
16497 -322044 -358271 -178913 -444686 -573837 -695462 -401001 -156652 23721 -94085 -146124
16487 -146124 -138205 -517683 -422836 -199734 -308572 -197940 98382 44878 -170765 -161249 -387257
16476 -387257 -344830 -451953 -710171 -685788 -571989 -235533 203052 -11393 -282104 -17074
16466 -17074 160725 -41674 -341151 -268503 -100974 34159 58450 -280919 -778568 -661041
16456 -661041 -538093 -223894 -43045 60528 -249314 -420194 -96560 45789 -16567 72945
16446 72945 164218 112253 -5342 132861 361577 193528 -99203 -277506 -144912 -366034
16436 -366034 -541969 -178787 -422816 -441230 -287788 -266553 -245359 -443973 -905338 -788722
16426 -788722 -344184 -414753 5488 377549 239281 -153022 16510 317529 216952 -146005
16416 -146005 -501738 -360591 100565 511398 200372 26402 492659 204488 -87903 -294582
16406 -294582 -147963 -134203 -281878 -314925 -471952 -402628 -215202 92167 203139 435693
16396 435693 568381 425837 -242239 -597471 -880403 -525190 -167289 -39986 -141977 -1851
16386 -1851 103363 -241624 -410785 -68473 -7334 140134 -140150 -216861 -114754 -255038
16376 -255038 -465373 -37611 162551 -152166 -193730 -309357 -245622 -592187 -875092 -414052
16366 -414052 36705 104771 -92306 -259625 -432209 -198919 -220881 -379033 -813896 -909767
16356 -909767 -597652 -190687 149603 208631 30060 120227 90507 -306167 -570611 -166703
16346 -166703 -57752 122538 18844 -191531 -413315 -205536 -109056 -429732 -686027 -520518
16336 -520518 -240958 -182376 -125607 8826 75144 -37492 -135651 -126930 -212921 -375562 -239050
16325 -239050 -52522 -82014 228599 370182 430582 360045 261489 88106 -130961 13982
16315 13982 316247 88707 60921 304139 362704 565672 561335 253880 56444 89306 432960
16304 432960 249002 -88256 -104 61480 187817 13139 -221950 -306626 -371709 -99087
16294 -99087 -18647 -29291 -67774 -125130 -2099 97709 235650 283694 385557 373110 58718
16283 58718 -81396 76592 -34678 -414886 -596568 -661138 -294493 51794 -168796 -394505
16273 -394505 -172522 -88969 -137765 -149822 180279 108693 -265469 -590679 -436570 -52557
16263 -52557 -25017 -202385 -134321 -29629 -131981 -442821 -626716 -640382 -554804 -311342
16253 -311342 -29729 -7172 30398 -79315 43186 514446 361699 213658 32972 245552
16243 245552 56408 -141933 63689 121420 -146073 -344960 -656755 -789228 -852992 -707662
16233 -707662 -560827 -459061 -238391 -485418 -711713 -565698 -411476 -553680 -631347 -271075
16223 -271075 -88977 14862 -316983 -179400 -93529 -266718 -269642 81922 273508 395950
16213 395950 516381 134672 -23215 -174717 247638 178422 133748 87063 -136378 -232999
16203 -232999 42983 466 -133196 -323917 -666548 -722004 -291298 54790 34882 235065
16193 235065 -128120 -185374 -220256 104633 480674 366358 340844 82325 234213 365918
16183 365918 331488 126175 50791 -191595 -38436 -294928 -420584 -217402 257651 225915
16173 225915 -243261 -198220 -60442 -299016 -642241 -417781 -14451 139056 24083 17893
16163 17893 -68377 -76447 -6422 316084 688379 420701 -297772 -247957 -293685 -299101 -209640
16152 -209640 -140957 -314738 -608210 -608904 -380485 -469221 -484100 -352313 -67070 -9383 -86676
16141 -86676 -304054 5700 147367 -501611 -626880 -420381 -127912 -32107 271232 149663
16131 149663 90309 218510 210466 33450 256983 374615 312282 120956 155331 241925 168995
16120 168995 63292 332005 431010 352138 241821 19576 -219097 -370381 -373032 -195340
16110 -195340 -322794 -412358 -486899 -615715 -357591 225734 36140 -68384 31905 48565
16100 48565 264632 103420 -54709 -99599 -288448 -394422 -387726 -366799 -250186 -190459 -374162
16089 -374162 -126567 -70121 219224 241311 -219213 -323347 -175539 -310641 -167093 127826
16079 127826 165433 176660 243788 246428 71168 58454 305240 253101 -129038 -112993 -333556
16068 -333556 -245381 -159984 111282 80078 16143 -244174 -433007 -382352 -481765 -430082 164399
16057 164399 185120 314791 173212 -347980 -333651 -171231 -694774 -656168 -510199 -431441
16047 -431441 -457101 -214114 -16915 68244 15794 161878 -41908 25526 -15094 -52075 -326033
16036 -326033 -524016 -598565 -565354 -282280 -307192 -23897 314504 209174 57044 -17623
16026 -17623 241247 628451 623497 528630 399735 108299 -41159 -317166 -678549 -724993
16016 -724993 -455513 -400420 -101291 214744 170474 -121143 -44626 -309487 -617505 -278275
16006 -278275 -133456 -71837 -250404 -116406 -91917 154600 127275 55025 -171623 -366025
15996 -366025 -99557 237822 100501 -324923 -315038 121708 -31028 -315101 46861 474503
15986 474503 805068 610275 397722 198827 101360 255966 -48194 -19639 255845 259309
15976 259309 52025 -77747 -79225 -7710 117513 -137769 104587 421565 305199 -37171
15966 -37171 138464 219038 232635 361228 165923 256449 324174 422227 485604 316917 -25897
15955 -25897 -521726 -598387 -461898 -126527 74997 41696 -144567 -371502 -404301 -266888
15945 -266888 -229990 -281658 -474802 -538186 -896065 -1110614 -640990 -572315 -206912 44278
15935 44278 76106 -6609 208715 361128 112448 507695 866287 701151 362433 185071
15925 185071 342080 242888 -18440 -200982 -518465 -108487 406485 294436 254075 113057
15915 113057 -254843 -401032 -666560 -426805 -97379 45251 146790 -77796 -312024 -132884
15905 -132884 202526 86368 -256221 -497705 -437202 58109 -31096 -386415 -395019 -215359
15895 -215359 -148200 -207809 -126496 -48351 95758 -46759 -84817 375385 596591 258169
15885 258169 -26349 -12180 -65431 -58237 -187024 -585494 -378717 -29182 355146 598020
15875 598020 436323 -2019 184153 171575 19253 -194063 184829 626193 252453 7657
15865 7657 173738 288543 163168 83400 307569 238899 185049 419478 464327 420539 271629
15854 271629 394355 -188623 -295230 -240973 -58914 450703 637938 193434 241993 341916
15844 341916 122746 -220558 -454246 -77325 30209 -249227 -270651 131386 49528 -108091
15834 -108091 -130541 29664 287207 211942 -13979 -183471 -298117 -68995 331480 404009
15824 404009 184349 -59494 71118 52603 -165667 -274071 -522685 -121173 203858 -59056
15814 -59056 -4087 22115 58583 277594 293100 145459 -199455 -164604 191862 381897 440181
15803 440181 407128 87030 -148222 -238689 -372566 -472199 80217 257171 -40577 -115673
15793 -115673 -249104 -387731 -306253 -13685 -7196 -145076 -356605 -508381 -667947 -512837
15783 -512837 -128533 -51779 -291396 -371067 -513901 -284402 -226362 -304733 -239031 -155518 12340
15772 12340 48885 -154446 -277108 -237119 -133917 -228861 -56273 225734 236070 145556 335923
15761 335923 312640 253883 348899 419322 273321 277290 272253 64639 67963 93337 -250410
15750 -250410 -474918 -328223 51337 290671 233807 94899 -153332 -511379 -797021 -595931
15740 -595931 -273911 -20942 213240 -5632 -208592 -152753 -337704 -220292 -110151 36477
15730 36477 -24420 -65628 -8695 43576 -33127 -34852 333567 458513 599774 808563 608340
15719 608340 639813 754505 660798 408138 192860 31538 -124192 -90671 -65505 120391
15709 120391 349395 -198690 -212453 -19765 228283 113187 -301861 -504128 -258682 -48839
15699 -48839 -134008 -88681 25961 37976 -158248 -250257 -324391 -224436 -174734 3956 -39679
15688 -39679 -154401 -77268 216392 182717 16264 -192359 -237280 -128164 91052 493098
15678 493098 343819 51970 -185339 -403490 -519497 -310040 -245475 147319 246649 101821
15668 101821 229833 501511 618686 568956 631135 398426 377241 426254 395060 -8856
15658 -8856 94387 52110 190487 259205 55702 56728 5230 -25102 103869 -118561 -262710
15647 -262710 -178606 102058 90464 67786 223815 208776 37420 -120256 -180236 -367304
15637 -367304 -447491 -617473 -395893 51570 40231 107950 -39877 -31167 -371432 -276314 237217
15626 237217 446833 417766 505887 4004 -141265 -288667 -293913 168406 -153441 -84727
15616 -84727 -143346 -649801 -711759 -775723 -443116 -21508 124184 77665 -120141 -201310 -248392
15605 -248392 -300735 -79540 108060 298188 375365 271580 58507 -207836 -469904 -540018
15595 -540018 -218902 128130 309540 330872 185064 14890 -259386 -136649 -234789 -400606
15585 -400606 -539463 -381507 -532016 -555406 -730110 -694674 -519037 -416374 -724181 -561638
15575 -561638 -336969 -427744 -243589 -146731 -260726 -494404 -610076 -450458 -118399 405656
15565 405656 617857 436449 609745 576292 343535 282978 520592 443206 282364 153824
15555 153824 195776 156344 127573 492702 438723 33427 -284190 -27163 -41315 -74834 86307
15544 86307 -130026 -139154 199683 -111661 -235931 2083 -226234 -443922 -570575 -622995
15534 -622995 -220311 -3296 -119592 288265 338898 80951 -6305 -118660 -252515 -60011
15524 -60011 -93827 -203699 -471060 -227404 84587 -102790 74999 149599 392608 516648
15514 516648 197716 47275 26833 -6403 -13743 -24730 -362997 -675361 -435017 208297
15504 208297 60734 -175820 -287685 -153687 -42958 -164041 -543356 -585172 -323410 -288704
15494 -288704 -535550 -459139 -267933 -179 -40129 18380 -220328 -97043 -290650 -501386
15484 -501386 -621577 -263066 259569 280364 229220 199298 371274 434603 316452 152080
15474 152080 580918 768077 610059 520124 418020 490709 463730 375536 517293 668299
15464 668299 732032 532614 381993 530376 323418 163015 91473 -193782 -432642 -304030
15454 -304030 -38785 -11372 220560 55701 90364 -77794 -366474 -321775 107682 -182268
15444 -182268 -252185 105223 463070 157675 39013 -165171 -45105 116095 413310 952617
15434 952617 651839 174035 28746 196622 7121 -290981 -272429 26178 -95066 -69434
15424 -69434 -40830 2149 -75317 -21106 194006 -91257 -144516 -166938 42652 -34838 135694
15413 135694 250882 314357 -122422 -290113 -211918 96673 184518 207252 469961 513513
15403 513513 397837 361032 125050 140955 243433 248441 26383 -209027 -490000 -434272
15393 -434272 164578 222754 -94424 -217959 -53768 192299 24685 184495 320118 281489
15383 281489 -54206 18694 -243920 -362751 89899 268013 209455 138926 421927 461770
15373 461770 256323 -8165 -74088 245679 473640 620661 774893 598477 207180 -58163
15363 -58163 78807 96502 307157 580877 727718 430909 242294 395848 82985 -48951
15353 -48951 -341992 -397831 -514944 -435288 -508396 -413432 -253743 -187715 -45308 -207588 -176351
15342 -176351 170075 79402 -104410 164119 245023 12120 -110043 -383259 -390036 -357511
15332 -357511 -28725 55076 174374 -104442 -125284 -177148 -276466 91301 121546 21453
15322 21453 -135516 -107175 -250239 -531356 -452008 -328506 -281361 -119720 -49306 44446 473629
15311 473629 501229 79680 69273 415792 497842 22179 -214182 -70662 -107109 -203374
15301 -203374 -111509 368111 268806 318110 358738 235122 348811 502208 459183 477130 16267
15290 16267 229385 393688 313361 -117224 -93042 -202462 -295010 -249585 -242172 60367 87130
15279 87130 -126672 -508682 -451652 -36060 304069 371099 173451 115851 -125578 -406415
15269 -406415 -500665 -221851 -364267 -390590 -404980 -297002 -197539 116270 190890 146415 -313752
15258 -313752 -556123 -274561 -165009 132166 186822 -44953 -6590 65471 -49480 221299
15248 221299 311326 95076 -6464 160621 312507 82268 10077 -109228 49822 422853
15238 422853 530108 336293 128188 97327 128702 -224951 -216186 -197699 -250529 27680 -188429
15227 -188429 -505773 -313616 -209885 -114738 -146293 -44951 -24015 -13660 -55193 80107
15217 80107 8455 -127028 -68199 -243951 -601048 -455882 -427017 -132269 -159659 18709
15207 18709 160550 26113 -55804 97616 236436 77161 -248455 -448309 -75892 -291123
15197 -291123 -731005 -1027131 -776207 -186883 -206940 -131855 -121495 -112554 -91035 -289299 -486247
15186 -486247 -520023 -272474 -342467 -289562 -76487 64237 443292 778062 868748 421361
15176 421361 325638 107304 -381860 -543810 -622130 -658985 -724110 -755859 -594320 -193206
15166 -193206 -127993 -141511 141809 392371 373136 233452 -15514 -53945 37252 -57226 -311785
15155 -311785 -99138 -271036 -541929 -713740 -239724 -163327 -171313 118620 22374 -72865
15145 -72865 -122563 119233 229739 -204066 -243714 -331328 -99743 9664 305535 458616
15135 458616 134182 -107645 346507 324593 229701 12484 -340005 -120043 -28186 5842
15125 5842 -71146 -325048 -462926 -376921 -165329 -106081 -161320 -56136 50488 258997 174949
15114 174949 97286 46279 143609 150786 255531 315323 -25376 -18746 30802 12181 -256401
15103 -256401 -322755 -234435 -363034 -323678 -59950 331096 -100967 -376039 -90038 164957
15093 164957 -76017 -227866 -120993 -22151 299328 410617 109623 -219366 -534023 -333822
15083 -333822 85821 108864 66987 217834 122083 247784 189609 139614 177876 -119789 114867
15072 114867 337231 168332 -139894 -581815 -498980 -145660 -258338 -349506 -517183 -374438
15062 -374438 -944566 -647230 -56120 -25837 -460689 -671974 -866448 -535923 -369343 -184323
15052 -184323 -53788 -3605 95214 -218428 -187916 -13116 -38511 23087 23260 57769 64482
15041 64482 200195 219522 -833 -185261 135028 224541 -172921 -360254 -246969 -325767
15031 -325767 -292956 81973 63350 -140450 -140435 -272732 -347520 -238852 -132280 -113573 -100416
15020 -100416 -148056 -326695 3536 238677 404275 500790 513127 634394 252413 369168
15010 369168 194711 -6511 -45206 4755 142867 97855 -192693 -465398 -503958 -76363
15000 -76363 71452 7197 30762 331977 216836 -63233 97469 295389 324844 505310
14990 505310 250952 205036 158046 -160959 -193083 -289234 -182937 -88506 -239961 -370459
14980 -370459 -816925 -781331 -448323 -474371 -284001 -33652 -135432 19051 -69937 -319937
14970 -319937 -512688 -143124 -282382 -261873 -370691 -773531 -575972 -496120 -558354 -91434
14960 -91434 353147 304804 69131 -119455 368750 641069 596094 470546 218608 59380
14950 59380 -24829 15045 165363 316655 141284 -21580 198891 26357 -162857 68691
14940 68691 314926 705039 513098 500818 147950 63688 156305 232613 372384 502145
14930 502145 201654 75880 146950 398140 477272 282874 -261816 -333029 -321376 -217864
14920 -217864 -51708 189363 179505 -147697 -517811 -450161 -289455 -53134 5570 -136982
14910 -136982 -21043 -32039 -133438 -28372 420344 384026 330335 9733 -356200 -349120
14900 -349120 -151572 -508271 -783035 -650769 -466883 -337575 -150987 -254787 -101231 -5410
14890 -5410 -128570 -67254 -376043 -421354 -21350 186965 609024 871764 875010 829571 461627
14879 461627 162459 -314698 -524253 -288206 -26482 37519 177394 231835 260394 326413
14869 326413 -5695 -49644 -21633 115071 8578 -94934 -117815 -134418 -34505 -217260
14859 -217260 -657155 -300457 -143890 -26698 330442 367040 130945 -199692 -666278 -341907
14849 -341907 -103830 -359991 -116448 112333 121314 -112974 -483239 -348864 -193410 -72189
14839 -72189 465007 255072 2683 -183699 -153555 102562 144947 -42023 -215430 -363303
14829 -363303 -219245 195609 667221 400948 182351 267584 299016 334600 697980 256067
14819 256067 -116889 -451888 -669414 -600616 -415544 -255670 -263956 -288792 -371853 -70519
14809 -70519 -290879 -376212 231439 389098 315539 95144 -81345 -86822 -220252 106096
14799 106096 430720 94726 89381 -199603 -341530 -364114 -70144 -129140 99489 88096
14789 88096 212267 111254 -258262 40123 84920 -60366 256757 389459 76413 -55034
14779 -55034 -225288 -175579 15387 169614 110338 14442 34438 -78370 -91971 86899 367402
14768 367402 720761 728784 189348 -266971 -175130 -97901 -10978 -11370 78087 391587 494276
14757 494276 440174 160506 -70221 90372 474660 644544 298809 -29843 -265800 -400879
14747 -400879 -270813 -541143 -162935 -117969 -129977 -31621 97046 281997 -4555 -367060
14737 -367060 -103575 -6400 -56749 -80608 -210822 -48597 58105 -134990 -148461 198392
14727 198392 327668 545860 685200 698019 651158 400640 -68996 -167781 204321 287540
14717 287540 615993 605562 202546 -179738 -283630 -62753 61119 63764 82356 475830
14707 475830 500012 -964 -223058 -305348 -423888 39617 562042 303897 101073 16857
14697 16857 115313 272282 205701 -193765 -267681 -131942 -347221 -353429 147495 288997 204989
14686 204989 411630 547346 470145 512303 223558 323513 303199 378372 432177 117262 -311574
14675 -311574 -903619 -848403 -433372 -427472 92767 243089 164426 140432 61768 -4963 48142
14664 48142 -71829 -514027 -409917 107983 283108 203172 80500 11545 -133663 -306787
14654 -306787 -434525 -227355 -132487 -184582 -174268 -151173 -119761 -218392 3914 252297 474825
14643 474825 629312 250448 -113829 -212022 114375 -44904 -368192 -134795 -66248 -103887
14633 -103887 5489 -95178 25225 -15800 -246006 -92964 46790 -105547 -226294 -444809
14623 -444809 -528529 -516419 -330211 -434075 -205943 -168203 -143186 -101298 58548 156113 207696
14612 207696 -9247 94573 -103782 -22603 241003 -254491 -656906 -522042 -238893 219029
14602 219029 354971 357682 43017 -411473 -453930 21074 -84623 -47728 266671 -37136
14592 -37136 238161 465779 103386 -172212 -302848 163594 40890 -74802 -174582 -243258
14582 -243258 -148236 161070 259278 17318 129924 298334 137196 44206 151243 111837
14572 111837 212836 444942 562564 464578 139539 341703 398267 -42323 -119297 92727
14562 92727 -71259 132520 140709 -254348 -232950 -91589 116086 -27664 -67134 127263
14552 127263 -183210 -613424 -208807 -262549 -308148 637 -54399 164290 465809 388683
14542 388683 161456 49494 -43014 -27961 57427 133886 386619 366067 306789 200889 366036
14531 366036 292005 59340 -145827 -22913 -132524 47508 75568 13993 -111499 23031
14521 23031 563999 726004 615361 547004 606345 530728 320903 223676 -137122 -154418 416316
14510 416316 404515 360087 297434 150410 186042 1559 -30994 -413913 -518737 -516840 -532903
14499 -532903 -278674 -114034 27912 94307 96917 108483 89531 -144526 375913 691204
14489 691204 490949 537464 570579 525390 443903 473437 356331 293250 221591 104761 149117
14478 149117 -80239 -429175 -828036 -912429 -696545 -871914 -820872 -635671 -723648 -352705
14468 -352705 -133466 -128768 -140061 166175 -51513 -372102 -415196 -434671 -417581 -498323 -218794
14457 -218794 234902 223639 172959 262159 160120 -452437 -385269 -223910 -48016 -216479
14447 -216479 31014 313245 146273 327609 210923 310213 191395 85810 -93342 -87561
14437 -87561 256893 240796 303664 306924 263488 262742 133889 -192583 -530981 -402548 -181134
14426 -181134 221363 229923 -140738 294521 530131 554699 122321 -89697 -111834 60621
14416 60621 439206 327884 243635 111161 136123 -45711 430649 235513 -110337 -425582
14406 -425582 -513390 -352343 -136884 -202573 -502272 -320702 -256477 59265 105303 295129
14396 295129 179832 -167442 -30927 351038 646233 704402 299618 -223636 -426335 -75828
14386 -75828 380786 517511 394546 481815 722063 650134 179639 164566 104796 -292930
14376 -292930 -227277 -510376 -434252 -161258 -96035 -86887 120606 184872 225973 44183 -1258
14365 -1258 250382 224719 58188 -79312 106305 179848 245979 89757 -380108 -347452 -80212
14354 -80212 -91549 -71964 -45391 83599 -10167 -116019 -206708 160661 271606 343310 318844
14343 318844 -60149 -135832 -275048 -520403 -249134 -28808 -20445 -268665 37288 26077
14333 26077 109687 229113 372657 419790 263006 267494 432609 38935 -177244 -382075
14323 -382075 -383110 -166432 74117 -154412 -295329 -315651 -292936 -284682 -84808 -83965 -441688
14312 -441688 -293701 122489 21039 -70404 -216787 -86137 -123129 -441507 -962423 -560134
14302 -560134 76459 76996 404580 423860 476083 455780 667910 575447 442490 490609 416738
14291 416738 182079 -138382 -195865 63948 154259 -75317 -320932 -338529 -449950 -196965
14281 -196965 -149197 -277057 -109657 -312641 -346484 -39336 217612 115632 -244116 -232693
14271 -232693 -12071 147796 50738 -516167 -741885 -383366 12136 550993 441888 298361
14261 298361 405164 506211 383793 -122376 -375961 -557140 -425749 -637388 -524764 -330561
14251 -330561 -408316 -134584 163271 546541 540200 169189 -106360 -24104 -60496 -65638 48374
14240 48374 36164 -109333 -186360 -227791 -1097 73181 -103939 -128120 -46663 -144132 -310571
14229 -310571 -406498 -34549 346821 348362 67527 -199854 -406287 -752769 -708350 -359042
14219 -359042 -280742 -36502 336201 159976 -110550 -28901 242715 309055 548279 378271
14209 378271 440451 685410 489250 455518 681081 610654 214793 62645 -14985 142806
14199 142806 130164 161833 -114832 121021 -3007 -6075 153177 -111922 -64065 123420
14189 123420 335213 490724 274680 76026 -67478 80456 123872 -164787 -253706 -211866
14179 -211866 -359576 -439147 -420564 -273015 10922 267336 224896 201961 406255 724767
14169 724767 784858 573884 487803 586494 458328 270302 598570 704829 233495 118453
14159 118453 -94508 -463773 -307885 -13108 -73034 -334852 45811 106527 74830 -19899
14149 -19899 -83915 -53465 196274 550266 315948 289561 465955 354519 425757 390988 229247
14138 229247 246070 337148 110560 522388 191796 272537 -24774 -460290 -302476 -127711
14128 -127711 -163147 -232894 209515 448120 403981 260688 -254233 -335427 -152155 -14562
14118 -14562 -105892 -275071 -160286 -280303 -182827 -103999 -50830 411337 484070 315674 317221
14107 317221 -70078 -212832 -145034 87663 -12542 -51338 -322152 -711941 -429886 -364498
14097 -364498 -434363 -260038 -1340 -292282 127185 260224 309633 -15626 -153239 -328089
14087 -328089 -219433 -114068 -277281 -298156 190669 484248 644446 117110 -126971 -282487
14077 -282487 -35357 49367 99406 164925 124877 184780 144663 -247424 -443211 -692115 -458711
14066 -458711 -56581 -63692 -84797 -210859 -201564 -396141 -230201 119311 -173393 -321037
14056 -321037 -496494 -468038 -343049 -428451 -191809 -119292 115098 207402 80815 43295
14046 43295 -30902 406647 451239 463316 702137 684961 290286 276353 70742 -192371 -265669
14035 -265669 -241567 188796 193941 172490 321255 91967 35335 240139 446970 311698
14025 311698 142520 243480 61757 168886 186399 337912 339139 145606 25378 326567
14015 326567 117185 38860 142021 490644 688513 486607 245486 -58925 -360242 -437357
14005 -437357 -263775 -107987 200774 163926 101460 303726 183669 59098 166062 278704
13995 278704 101707 175819 48629 -99579 -171899 -90182 -90385 66474 332111 729566 958703
13984 958703 590638 -168827 -562680 -201467 163159 -70830 -232542 -251361 -396141 -767407
13974 -767407 -823666 -607008 -283734 -419381 -407235 -510778 70764 521252 505683 380394
13964 380394 272496 218420 59879 -72946 110311 390828 197773 126519 -91820 -476894
13954 -476894 -431670 -150989 586078 696980 481788 246903 110521 58067 -190339 -260755
13944 -260755 -137252 123773 180218 -43508 15609 -25682 -143091 -142504 -36785 -259129 -226176
13933 -226176 114268 328141 421325 404190 311207 -92752 -23518 -122463 -104658 -91617 -297715
13922 -297715 -429237 -249106 -41699 -75071 -63217 -28321 -185739 -241394 -250020 37656 157175
13911 157175 20637 415316 681853 460840 172024 139697 -56427 -168954 -220303 7848
13901 7848 72672 -57622 -240459 -188299 -133948 -73108 246937 205922 121089 181847 -28193
13890 -28193 -60625 -13755 -343002 -392880 -216905 78159 484158 693338 495926 618100
13880 618100 306068 237711 469790 168461 59393 -150581 -162426 -193980 -148007 -151800 -212905
13869 -212905 -359026 -151690 163836 279649 279612 -23408 -335509 -442835 -335442 -129150
13859 -129150 9415 39925 251633 222740 35434 288551 306458 142680 130529 -11397
13849 -11397 -223619 -190904 101415 58680 106145 -91809 120119 330989 281114 12729
13839 12729 -292573 -374915 -362696 -387806 -347256 -277403 -571338 -538500 -182750 -258834 -179277
13828 -179277 148937 333259 394884 406699 12928 -372143 -440452 -435960 -158495 -93194 -125198
13817 -125198 182744 316579 241905 153834 211702 254693 139003 171602 402658 114629
13807 114629 -90440 -63529 -65242 74079 31846 103524 32214 -195156 -362647 -631709 -636611
13796 -636611 -725715 -567939 -213820 -396213 -278697 35781 293082 288177 -117915 -258483
13786 -258483 38995 -43654 -15738 -45628 188347 441681 202204 -58622 -457611 -198460
13776 -198460 -33381 -121752 -37164 212917 146218 -298214 -199687 103515 -98669 152573
13766 152573 396973 179588 179443 211729 -160884 -159488 423514 625718 654574 477047 49621
13755 49621 -100046 -158802 -564281 -1129917 -919511 -615509 -553259 -189516 287349 319114
13745 319114 315859 124800 -477496 -75884 319474 487602 330608 -207726 -403198 -202731
13735 -202731 -96067 314874 552114 550965 259028 313970 -89902 59241 157762 69812
13725 69812 -47914 -51811 26398 283188 223315 53561 30927 -282082 -337060 -169362 28972
13714 28972 -24574 215222 507848 411665 165721 290746 655131 760567 129301 -157091
13704 -157091 -76199 -21182 5604 -255872 -85918 604098 477638 -71226 -323534 -20678
13694 -20678 -451000 -834682 -788023 -635272 -300251 52826 89722 -146719 -92763 6429
13684 6429 45081 22052 153813 300267 391258 503145 259930 60410 24733 137681 485490
13673 485490 395604 -116928 -121718 -355834 -490807 -135444 35614 -110339 -236335 276994
13663 276994 174406 14267 255292 420422 211222 -96812 -299314 -113684 -267837 -461887
13653 -461887 -436920 -168027 -8824 282944 241619 -349023 -589980 -153389 328293 375936
13643 375936 347281 390256 281221 116144 136169 -88032 -420145 -592369 -653821 -337666
13633 -337666 -185460 -305630 -359855 -265760 -56858 -356616 -436530 -57538 22058 -298324
13623 -298324 -255132 -74556 -155058 -505725 -886001 -862682 -441429 -193415 -408561 -130536
13613 -130536 14263 -81592 -444856 -606069 -332563 192617 -30049 57620 -3895 -120730
13603 -120730 69927 338258 163944 -210400 -260796 -95405 -184275 52316 317373 777872
13593 777872 219452 -98816 -104176 166882 322590 313039 191722 82843 71081 186424
13583 186424 33358 -694201 -376526 196689 216448 245330 114867 -5468 -181647 -143643
13573 -143643 -56363 -49744 205942 39512 116692 60854 221073 230827 299411 443883 260835
13562 260835 18032 -160041 -213027 -390373 -462555 -220821 224728 332538 492506 577497
13552 577497 152808 -498 175135 467162 135662 -254334 -460851 -77112 74831 -81180
13542 -81180 -115959 126713 128420 15652 -34494 -10610 -96892 67692 -146850 -64196 -92418
13531 -92418 -36657 110961 -155210 -122085 -129319 -165408 -222053 -381441 32129 354685 125907
13520 125907 -186276 -206254 -106178 -30227 393180 323553 293083 576063 174172 -70140
13510 -70140 -178769 -293415 -327942 -310645 -439436 -353183 -422311 -330916 -174331 12334 63600
13499 63600 -233058 -170264 32517 -53131 300094 525990 473390 243006 -168803 -338922
13489 -338922 -192872 -138372 99449 -32675 493834 505797 607079 373647 21381 84350
13479 84350 68193 330021 491278 495407 407557 261308 160961 484567 659350 426443
13469 426443 190403 525784 867171 864583 482405 160503 21747 -19058 -97340 244980
13459 244980 -42470 -501310 -644802 -489082 -377627 -159952 169229 -31086 122019 433276
13449 433276 235655 346957 397739 544723 386737 189545 -61829 11079 560148 351716
13439 351716 442004 741782 597980 406645 174823 231048 -304269 -229202 -119561 -320534
13429 -320534 -150133 -55463 -323801 -545874 -599115 -500476 -417859 -316930 -339597 -100225
13419 -100225 -55638 -106763 -96900 131815 152519 -142596 -153790 -83445 59719 152026 -59478
13408 -59478 23357 -118176 -324531 -359593 -300326 -249761 -141720 52891 8208 11329 38969
13397 38969 -291805 -446098 -590291 -393276 -98007 88787 294499 80093 -185099 -146838
13387 -146838 -9058 -54751 -28864 -72020 -314561 -78860 -95689 -457533 -371774 96697
13377 96697 146089 87013 -116466 -368686 -394770 -190634 -115259 -137608 -352141 -342032 -435326
13366 -435326 -463456 -185823 -91557 -85254 -165379 -15518 276195 418616 671604 325988
13356 325988 42187 -185797 -348673 -124459 349409 301715 38194 -37116 -111722 -116419
13346 -116419 437007 531855 352442 247127 366834 30163 357750 354067 -361385 -503430
13336 -503430 -262775 -127268 74060 9696 -208533 -372709 -669577 -823879 -550598 -66661
13326 -66661 209775 168914 244139 208628 255019 273084 193682 235659 351230 -24366 -244242
13315 -244242 -300123 -255283 -38104 107728 80740 27356 -68717 -49261 162347 184306 -165271
13304 -165271 -165896 -130195 3845 196355 91187 659391 907288 662750 360592 57453
13294 57453 34177 113029 -83208 223249 297524 433933 540159 32245 -292538 -264467
13284 -264467 151084 136387 -143500 -71661 143346 63267 -150768 -86106 58055 -14061
13274 -14061 -313167 -303049 20442 -188963 -317839 -339665 -61376 -377127 -536281 -414717
13264 -414717 -426295 -318650 -386355 -124550 286724 236756 -8398 206436 507877 378350
13254 378350 292498 310530 169034 287099 359603 237532 46914 40799 14137 53187 161586
13243 161586 297925 336800 -206070 -479027 -475960 -175040 152040 125928 71999 33750 266172
13232 266172 350115 142413 252647 453993 413396 105734 -199597 -274150 -126280 -375094
13222 -375094 -489097 -82604 100159 24792 55776 164999 72675 199053 449317 456477
13212 456477 331044 450534 461615 115110 12296 -114447 -246583 -93951 -270646 -315379
13202 -315379 -87984 157024 -323996 -244454 -271473 -304653 -180874 -218734 154909 133997
13192 133997 488223 558059 210746 108425 -27329 190232 548345 318759 105897 421633
13182 421633 -69505 30919 211711 356200 645862 548722 438614 238773 -112230 -25391
13172 -25391 -7807 173329 75126 -160108 -144847 59948 200695 411844 188005 -54263
13162 -54263 -342845 -624296 -23710 380638 544985 287575 274019 54068 -14388 137712
13152 137712 174425 -51677 -252617 120765 268788 -70604 -121203 -161028 -350603 -270105
13142 -270105 -115607 224706 275566 267661 386019 554998 244749 108194 359081 105030
13132 105030 147743 58155 -109793 -258517 -404705 -198555 276359 130616 176440 472014
13122 472014 254289 55044 83755 83389 291111 193083 -13465 -144692 -15664 628536
13112 628536 540814 216637 428225 377541 220707 288571 323617 280693 235214 323046 510215
13101 510215 309284 22690 48695 26731 -138667 -81795 -65622 516263 248144 -3974
13091 -3974 -30079 -251620 -304298 -150534 42459 -376066 -450616 -511815 -371028 -170290 -100790
13080 -100790 -139200 -284815 -342922 -311839 -179320 80041 130691 -105275 -18738 -283240
13070 -283240 -470292 -191004 -230998 71807 97237 -64590 220120 212882 313591 182245
13060 182245 -76838 82233 -102861 -311582 -343582 -194945 -219385 -334426 -346087 -357521
13050 -357521 -304770 -194397 -16685 -41385 12666 -98167 -274987 -381650 -415506 -763047
13040 -763047 -760943 -252258 -192340 7674 26574 -115627 -315879 -284182 3266 146052
13030 146052 -159380 -116446 189729 359183 347332 -14061 -189649 -14802 -422789 -735629
13020 -735629 -615492 -683100 -548583 -243164 285505 495333 609381 600299 473143 196658
13010 196658 223668 55642 17480 -159148 -268858 -306131 -511968 -419808 -441524 -323968
13000 -323968 -253168 -361653 -465305 -586247 -26110 410202 -8344 -484823 -507616 -613867
12990 -613867 -523880 -34740 -67916 -314186 -166173 205523 -8811 -370425 -411515 -236026
12980 -236026 19542 -54556 -318381 -369075 -104025 -66328 -134944 -491348 -164437 268993
12970 268993 494828 236490 290800 31359 -293765 -155939 -217244 -3022 114733 110211
12960 110211 -63229 40909 198269 109063 -137612 -254166 -171255 -167004 -59856 147224
12950 147224 93426 106789 266777 126683 36676 129082 220435 448407 279190 9971
12940 9971 -25953 72631 120621 15080 -163100 184209 273249 24035 -57671 -197681 -151725
12929 -151725 -202408 -129719 57723 163287 -53093 -435586 -320941 82200 360038 430983
12919 430983 304132 120896 241717 391739 566626 152647 -27920 311227 268427 331281
12909 331281 882508 1135907 863387 481889 46906 -151088 -181428 -155277 -171275 297031
12899 297031 48136 -390750 -455182 -397763 -208452 137593 507921 376384 9214 100604
12889 100604 -316805 -212807 299793 503969 330057 -204089 -513230 -831492 -888701 -911662
12879 -911662 -751735 -509698 -485778 -219611 -173150 -174523 8942 27494 21737 74742 218886
12868 218886 595976 622457 652992 701980 764464 499010 402126 437206 -42108 24225 -35242
12857 -35242 -625585 -444140 -23296 -54860 3286 90026 240191 554233 488952 241095
12847 241095 -96053 112714 26815 -291601 -527385 -789952 -434123 2508 43802 35028
12837 35028 180527 -137440 -247330 -111766 -82636 -206389 -419567 -246897 -408520 -72612
12827 -72612 121113 263547 186509 170485 101039 54374 66901 -101151 -99479 -287951 -459605
12816 -459605 55479 375318 359247 767844 780432 617831 863327 887718 547572 295657
12806 295657 206811 306348 355308 384652 -332215 -452203 -300103 -495838 -327996 -339869
12796 -339869 -405514 -342219 -229388 -164132 99804 -79834 270928 631394 621075 292186
12786 292186 40031 -44939 6637 170225 -9083 102922 43825 -259880 -400469 -99065
12776 -99065 236825 149263 1099 -303614 -342343 -298799 73599 653299 462499 113813
12766 113813 25111 103456 49190 -164049 128841 465867 815874 641509 340023 372769
12756 372769 516817 253373 85375 384549 552483 223279 -66880 -56014 62794 188535
12746 188535 258863 174596 100152 -175231 19686 398659 169631 -125396 -204791 -40899
12736 -40899 308903 169519 -116821 -102694 28080 171070 140876 371316 236185 299071
12726 299071 168469 -42413 -458767 -184815 264477 388337 207568 -64384 -176314 -313598
12716 -313598 -201135 225038 178073 -112493 -336301 -453944 -312953 13540 184718 152479
12706 152479 350166 404946 13690 44766 210473 358414 268024 2497 -370153 -444949
12696 -444949 -156062 -292941 -494395 -552258 -579299 -228001 -149660 -288902 -26932 298408
12686 298408 312787 270336 321107 442596 253513 405784 469847 278517 125267 26033
12676 26033 169506 216902 103586 119259 287834 22432 -221774 -497827 -556899 -307864
12666 -307864 -6993 113215 -51688 -12025 70191 -61212 -291454 -75972 352093 318543
12656 318543 582239 659298 611519 826239 726776 357162 426463 425212 537007 594344 677655
12645 677655 728626 570041 348332 395458 546230 828215 747621 663687 768752 983786
12635 983786 1863313 3188605 3954323 3736834 2902769 2182213 1607668 1270230 1062041
12626 1062041 677509 278515 76982 108750 -9769 24264 -217531 -583455 -249363 348822
12616 348822 324107 286104 190979 188720 50095 182352 151535 3296 220333 167002 -49110
12605 -49110 154263 216793 152873 -274292 -551836 -481764 -291546 -216176 -131603 -1002 1828
12594 1828 35928 85479 -95239 -45799 171632 37181 106233 309542 452057 590167 -60717
12583 -60717 -415733 -147706 -174841 -143958 -225699 -195244 -207062 23487 496443 513810 238087
12572 238087 142469 135752 242235 598781 1169879 1578596 2049671 2624252 3291519 3373693
12562 3373693 3090044 2691672 2021634 1416018 973819 866576 821409 695671 560157 517858
12552 517858 450670 759687 829258 634401 695359 764125 705791 493103 215351 17308
12542 17308 21031 -27377 -133118 -78029 -314763 -134931 8683 -45678 242555 269370 207742
12531 207742 259175 349027 92436 -171631 -86236 -300146 -78286 202312 418430 286362
12521 286362 384456 289180 376462 377460 151323 154454 131950 183868 55180 184103 157178
12510 157178 1198 282903 261597 287448 331291 237964 233526 365466 95909 60883 365577
12499 365577 466643 10886 -289110 -383603 -82879 273598 436054 438726 541538 402672
12489 402672 -34130 -81612 138088 186676 109473 304830 376905 243495 92721 -142978
12479 -142978 -391548 -181791 -129020 -249452 1477 221583 295117 290296 409263 100577
12469 100577 217829 426137 505293 -38260 -151913 -153702 -424920 -500395 -364444 -111887
12459 -111887 216302 -5475 -323502 -302496 88084 267748 499528 394961 235278 -175630
12449 -175630 -317879 -359813 -508820 -194332 -98159 -248331 3932 134905 21323 -189759
12439 -189759 -308482 -252511 -163724 25083 114838 311379 190101 -217866 -224186 -42405
12429 -42405 -158635 -40892 267553 421096 404970 194289 181417 -14709 173365 449208
12419 449208 346006 -42060 -187419 172234 788375 660173 266223 437899 409015 252982
12409 252982 -31856 -285245 -414269 -180338 115195 201415 -124266 -46613 -135200 181402
12399 181402 551374 438963 450619 446055 480750 112977 -131915 -133652 -122011 -123409 241429
12388 241429 114671 -257861 -348954 -329342 -300192 -288298 -335594 -166920 -46575 174484
12378 174484 121095 53735 98537 -349019 -218361 -7604 66483 121765 202496 359614 565117
12367 565117 991518 846660 424001 372022 411679 292263 31761 -51325 4032 216358
12357 216358 179524 -122133 -317062 -256018 109689 464556 698903 568052 429485 432036
12347 432036 679998 761035 792377 921474 965865 808461 595368 857024 1114379 797603
12337 797603 816614 1060894 931381 556492 410015 624008 447201 249503 267546 305511
12327 305511 -136486 -461360 -349643 -102043 -368554 -399691 -305077 -68245 -198446 20179
12317 20179 246298 -29901 -118197 -157318 -69861 -122835 -107268 -63187 144885 124819 -239511
12306 -239511 -60595 -7034 -282430 -316419 -398622 -449626 -141428 -37159 -467304 -434961
12296 -434961 -349896 -432623 -405532 38243 17137 -33558 188272 158460 28613 -188826 -35886
12285 -35886 -63533 124609 -262612 -287027 23529 149505 55936 156851 145100 264807
12275 264807 415715 444649 167496 -13816 -88370 197019 307102 202048 -19948 -235099
12265 -235099 -178915 -61452 -78112 -383802 -777580 -692828 -228867 16529 -164170 -125755
12255 -125755 -158378 -322495 -285947 -269267 -101197 -68331 2613 291593 285739 -31408 336985
12244 336985 467282 514638 357335 392080 350924 331402 188646 -359700 -172395 347287
12234 347287 385462 -94579 -449730 -271895 79265 133119 204212 -52600 -78645 66119
12224 66119 170957 267238 259565 231112 299471 347166 -62390 -289458 -567824 -428385 36802
12213 36802 363564 39036 26081 -45822 -102658 -311139 -260716 -375009 -196317 -273421 -21273
12202 -21273 32426 439354 502068 -55782 -87140 138725 13246 -145016 -537980 -766861
12192 -766861 -229513 163914 439453 340235 148319 -73544 297085 808819 1102671 1003565
12182 1003565 970201 858927 551744 583638 340812 213675 35250 -158542 -176267 -113803
12172 -113803 62887 229084 190421 125705 119688 -78049 -125610 71366 140927 224234 -30434
12161 -30434 -115799 -114543 -224042 -223082 -243659 -67959 240652 314675 80916 163320 35840
12150 35840 103553 207627 223624 90935 -13711 -248354 -446762 -555555 -310478 -286370
12140 -286370 -339619 -112207 114282 -21467 118425 514361 375004 137990 38698 94419
12130 94419 369988 520538 167245 -334017 -471605 -454203 -474260 -87256 184707 205170
12120 205170 169295 151046 18823 -304408 -378143 -22025 193225 150136 80968 -131859
12110 -131859 -213881 -74658 -316800 -429720 -137311 141659 -10596 58626 -179143 -124406
12100 -124406 78566 -107419 -186869 256755 429648 535832 365562 107892 50534 -117901
12090 -117901 -39077 -89724 -351243 -276137 -75783 -33782 -138484 -298863 -147957 -99281
12080 -99281 -202614 -342383 -327593 242360 430547 393555 235540 197580 42938 -337674
12070 -337674 -132486 -223510 -443944 -429084 -123291 -73224 -73303 95874 498804 271639 175011
12059 175011 142043 412852 471800 192089 -37450 -53940 -191330 -41803 60428 -25999
12049 -25999 -146524 -189130 -86492 -509765 -547978 -76900 244 187801 519756 853392
12039 853392 425948 233959 -92224 -432094 -406840 -175311 -305582 -707360 -859320 -506996
12029 -506996 -568206 -592094 -454468 -370603 -451503 -368530 -405514 -392459 -240599 -17103 245867
12018 245867 141158 -353140 31004 455962 397252 425393 365 149425 290674 215720
12008 215720 165183 437506 382612 279424 246096 140631 30387 -275199 -344791 -388552
11998 -388552 -413449 -157141 -113010 -411601 -597582 -604864 -294538 -708808 -1160768 -1239257
11988 -1239257 -868498 -456092 -472261 -277883 -371494 -491175 -639585 -135334 41606 72777
11978 72777 330645 445314 25979 -183805 -366677 -457500 -255240 -199215 -235932 -52880
11968 -52880 27101 -28883 86975 -14557 -224265 -208819 -388094 -657837 -810246 -605833
11958 -605833 -234918 -27601 -124499 76264 -78226 -202216 -248522 -563437 -406890 -213382
11948 -213382 -3779 -11656 -6696 221595 -150718 -53354 9880 -80896 160353 334565 358594
11937 358594 -106081 -269519 -290740 -554392 -499313 -410719 -327953 -189666 -51124 -48500 83887
11926 83887 251069 100299 249358 308216 173197 105081 -102885 12009 202703 190552
11916 190552 -92715 -296576 -275528 -164445 -106698 -238412 -534901 -382522 -308833 -272609
11906 -272609 -337251 -100839 -247106 -128755 -77312 155159 25537 -275359 -42064 20698
11896 20698 93005 400360 369536 249517 531542 209404 57548 267058 123166 -175865
11886 -175865 -7453 -79381 70411 88893 -1202 -72400 -522656 -542472 -478445 -163001 148414
11875 148414 19340 98004 42285 264 326385 321527 122659 -224015 -531465 -246618
11865 -246618 -112069 312805 370693 55037 -85992 -70058 -28391 216841 177150 37202
11855 37202 42218 -36844 -219855 -422025 -569161 -320475 40545 512944 598992 272836
11845 272836 39554 -472024 -220939 -64742 -26875 -284599 -185575 76970 -170607 1584
11835 1584 145259 177427 493980 500225 194561 127666 434806 439862 68553 -241122 -645331
11824 -645331 -394261 -11180 -12372 251583 460471 207991 115588 101897 144493 339258
11814 339258 354849 283245 366821 614373 388478 449154 670226 491275 625699 625233 492729
11803 492729 394150 497634 647086 990889 670515 545916 462502 387534 447742 315739
11793 315739 205217 76169 -249690 -609057 -486713 -261302 -19529 -292735 -165559 154539
11783 154539 230813 63626 -306836 -720528 -769961 -167905 -83773 -214497 -143783 -37102
11773 -37102 -43289 390723 860452 707225 249497 47387 -111660 -69207 140541 276844
11763 276844 34174 -211199 -240429 -245179 -299099 -204226 -146842 79717 111303 143723 349717
11752 349717 229530 26973 -175815 -446611 -671598 -633201 -278216 -181425 -29346 -22613
11742 -22613 -320186 -467419 -294357 -86627 -72481 28023 -30735 -404348 -471167 -275874
11732 -275874 -337886 -423935 -483578 -311159 24567 -79900 -160048 126058 70230 -153715
11722 -153715 -283571 -308345 -394592 -279326 -339627 -284798 150975 339572 172832 -50780
11712 -50780 -313871 4963 280875 363339 590674 391714 71243 98092 536750 592328
11702 592328 457587 278447 418905 470832 391592 557660 629191 607903 434074 457376
11692 457376 117363 -463847 -176890 135756 96490 97316 109049 -5142 365676 503486
11682 503486 592312 401210 107484 -37385 23476 244433 134725 331544 167830 -228597
11672 -228597 -115924 220292 94512 179369 46121 -242332 -444846 -633121 -561157 -350841
11662 -350841 -92542 -68074 36802 -344949 -566458 -250999 49375 15187 -82147 -82082 -112509
11651 -112509 -13550 -33425 -267366 -287888 -17751 103406 -166981 -642844 -543857 -433429
11641 -433429 -389039 -120435 219032 435636 46504 51707 -26659 -55614 -303274 -258642 -66584
11630 -66584 -274773 -593850 -417712 -295111 -164617 291500 341647 16697 -123072 25082
11620 25082 -47040 -306835 -293954 -131274 -193266 -428307 -195884 -314107 -519945 -385078
11610 -385078 -268813 -205779 -14040 348758 525011 513520 401133 433991 436026 -141580
11600 -141580 -674096 -460489 -596263 -835901 -1020928 -1077050 -740793 -267487 262223 -284849
11590 -284849 -1001835 -1237047 -598339 -50909 250757 483475 -94808 -501117 -734743 -219465
11580 -219465 443188 241993 123000 19645 -130854 102632 301758 -8544 -231510 -110387
11570 -110387 22721 48762 -92464 -214258 -228594 -272010 -60230 386756 157503 -248019
11560 -248019 -422487 -42114 143564 264894 297842 243705 189820 101657 -277903 -558585
11550 -558585 -298179 -17806 521684 637120 483197 485727 181962 -175675 -204170 -287179
11540 -287179 -651219 -471024 -520295 -588115 -864226 -693101 -388665 -71501 202689 262009
11530 262009 512440 403940 272785 216971 11298 -365308 -439227 -101176 337037 498858
11520 498858 624421 384488 127902 192942 230335 -123716 -518435 -657909 -497927 -340960
11510 -340960 166059 251261 84616 91179 99959 116047 -126680 -157405 -53274 173515 325929
11499 325929 342903 272624 446794 146819 59277 118541 85937 -237808 -225102 -375725 -342383
11488 -342383 -130845 15542 -53462 -219158 -300641 -191642 -307547 -464026 -293005 102968
11478 102968 476811 669238 279143 -53099 116858 668598 955580 968316 267599 68285
11468 68285 190869 -307231 -606792 -553937 -145973 93530 -6092 -49589 -269101 -341896
11458 -341896 47235 85132 -92744 -105022 -17680 122312 -143672 -507852 -244500 -150245
11448 -150245 -335042 -284351 107743 120013 202162 298519 111617 -229410 -327344 -620204
11438 -620204 -730618 -706068 -815668 -887533 -522957 -311346 -169591 -28253 -117678 2854
11428 2854 -50989 -4352 -67468 -308388 -532811 -577656 -656955 -647315 -371001 -31684 437318
11417 437318 565600 213940 148164 165719 221003 370546 -73360 -423769 -221608 -231024
11407 -231024 -485700 -280007 -136385 304909 548586 447759 456605 281894 342756 666231
11397 666231 474211 -32950 -334428 -224352 -166389 21752 61661 103700 83717 212676
11387 212676 -11809 151849 226485 427099 426433 331759 651751 798788 285055 208437 -2756
11376 -2756 -84935 11166 17211 208549 171371 253308 701480 570919 358976 -93775 -84457
11365 -84457 264070 387800 423146 478605 130535 -55881 332691 363027 225429 208832
11355 208832 295721 319228 299645 410795 429417 390005 645294 473320 567314 355909 -170444
11344 -170444 -500640 -436053 -268692 -238611 -465806 -169550 63679 -182457 -160536 -82543
11334 -82543 -123158 -608353 -894720 -891479 -182858 221632 171083 113805 -361738 -667833 -615886
11323 -615886 -213774 -146621 -375734 -644106 -620701 -312870 -122235 -204057 -625060 -676600
11313 -676600 -550562 48770 323264 335457 54532 -100229 102076 223998 322715 468411
11303 468411 295099 145333 161745 108052 172805 418222 407381 280895 -63584 -127927
11293 -127927 -573787 -715949 -413109 -208769 112021 98200 306305 310436 376471 348398
11283 348398 154708 358592 296267 199720 -95765 -309326 -418209 -333991 -362995 -731034
11273 -731034 -591270 -254155 35135 10724 -266963 -186465 -63130 -115050 -294804 -547187
11263 -547187 -620870 -54546 499436 298299 -28894 -121367 -64523 271839 298674 301152 151772
11252 151772 33554 -99730 -362304 -490011 -275037 -306275 -367894 13854 497872 477249
11242 477249 148679 104077 166966 179301 41275 -176284 -286296 -172434 -66044 30336
11232 30336 -11308 -87712 -342445 -354080 -248969 57321 279465 344607 594415 715517
11222 715517 696480 641320 408745 48535 94676 419525 88591 -337990 -369958 -60178
11212 -60178 500650 662630 593473 401337 62621 -11120 214210 308278 152337 136599
11202 136599 -166302 -64315 63391 192711 126877 155361 162846 305407 417255 282013
11192 282013 198530 -84014 -296428 -546301 -804439 -336325 -216309 -278677 -157603 135288
11182 135288 214909 30277 142971 543676 436373 334680 -238699 -572527 -664517 -364196
11172 -364196 -151971 88138 -110285 -141601 -167521 -73284 -339010 -461727 -316290 -133955
11162 -133955 -73667 208602 24879 -102377 -207891 -64595 293963 83468 -344496 -213340
11152 -213340 388128 508698 451103 655282 768033 556580 234590 453419 831317 690624
11142 690624 277052 279727 217458 173567 213394 -84476 -275346 -166526 237051 66405
11132 66405 -217980 -32479 8606 -301237 -252699 -304227 -403250 -470116 -318268 22038 187830
11121 187830 202858 376011 439631 542790 789665 884019 556212 -86052 -444371 -222634
11111 -222634 -3261 -96757 -202329 -163361 -2597 -273714 -557644 -456847 -58839 10327
11101 10327 2185 260894 203836 -304423 -341552 -347924 -596669 -446436 -624581 -801498 -484467
11090 -484467 -401003 -512582 -511452 -344778 -352935 -473007 -569701 -641827 -402325 -167040 -114533
11079 -114533 199284 144031 278198 -90051 -106354 -25033 265720 205328 386771 260460
11069 260460 -168684 -165970 82025 340675 504709 414860 207333 -94708 -231514 -240132
11059 -240132 66616 36065 -205694 -207192 -221669 91193 339274 462179 447650 319576
11049 319576 448487 465439 474653 495309 -236692 -420724 -142017 -95447 -16790 -137090 -286524
11038 -286524 -375392 -209473 -156406 167773 331005 33830 -58785 -65171 -214247 -17882
11028 -17882 80186 430237 312193 71330 41150 -26179 -50496 15626 185727 188470 -24845
11017 -24845 69058 -88324 -4786 228682 43394 -243385 29112 -288214 -630628 -341238
11007 -341238 -82739 351622 352624 -58543 -33719 122724 -143682 -204990 10570 1638 -214368
10996 -214368 -132840 -328116 -587377 -669170 -469286 -265100 -200900 -280180 22315 274887
10986 274887 265321 208758 645819 968124 942761 475636 262225 250291 480171 242751
10976 242751 18221 234085 183355 46642 -128646 -61529 -147834 -51485 -10040 67054 228524
10965 228524 197291 37160 -230551 -415070 -654782 -519287 -461654 -570352 -555709 -416371
10955 -416371 -423518 -579677 -446102 -362743 -402921 -427488 -585192 -513483 -264945 -145725 61731
10944 61731 25151 -163738 -119248 273032 369422 152239 -63012 -131632 -102621 352533 350103
10933 350103 162994 48562 65093 -39897 388428 328662 96653 189388 168991 88059
10923 88059 77912 23749 109933 -227435 -455482 -380912 -71697 244536 106527 46485 90225
10912 90225 10425 -96801 -289404 -506744 -731731 -724227 -395025 -8094 183036 68912
10902 68912 166952 312678 197921 -173995 -200045 81735 468829 380874 251335 -124403
10892 -124403 -289560 -230129 -34883 -31311 -149410 -212370 63209 504810 783495 722088
10882 722088 529518 367726 -32355 -148735 397983 352666 -70638 -11581 100005 66912
10872 66912 -100748 24824 176539 217250 -198827 -375609 -337955 -236683 -188909 -379475
10862 -379475 -450123 -429812 -384248 -162097 180405 225636 -319251 -409129 -239861 -331665 -200484
10851 -200484 21892 377553 272594 135841 79171 -108898 -241944 -86587 25069 195219
10841 195219 8225 223330 650490 375296 216444 369366 474731 585560 368336 -233347
10831 -233347 -540721 -427101 -193551 -224768 -151842 -580784 -877554 -697737 -335695 -96239
10821 -96239 -550391 -787770 -602953 -228289 -40421 -23589 -263952 -313258 -258229 -336934
10811 -336934 -172429 -188348 183904 174521 2891 -20922 124367 275395 152088 121030
10801 121030 204360 171325 31864 -33202 233201 121726 -241244 -27031 124863 58537
10791 58537 83308 291182 59190 348309 167503 341928 442048 109963 142511 -134396
10781 -134396 -153313 262942 312514 19714 -33079 194193 203573 -218585 -103822 297958
10771 297958 308906 66787 -180662 -354914 -346565 -90890 39744 201153 264293 167781
10761 167781 343554 351668 229088 160791 166622 398028 94244 124682 136991 -109948 -362501
10750 -362501 -535189 -638760 -429446 9252 23916 -132991 63024 132380 211637 287826
10740 287826 438793 506016 607279 767110 618933 422616 218155 81941 -70380 -269521
10730 -269521 -330634 -204244 -461745 -655301 -441478 -140522 -288787 -551579 -625903 -644181
10720 -644181 -204399 94710 237720 144666 110415 423528 344581 155083 133496 92582
10710 92582 99418 68831 126503 321400 -109321 -743334 -658073 -598333 -357322 -140821 24886
10699 24886 -293115 -538196 -608490 -805709 -931720 -548875 -155638 -333866 -314278 -274885
10689 -274885 -149621 -258592 -24287 -66498 -159521 -145908 -2665 281539 443040 63365
10679 63365 -331269 -27575 384964 329635 154299 -152125 -158588 -245358 -448340 -537711 -391113
10668 -391113 -464575 -473526 -277930 193059 441916 575791 579307 330123 -195089 -272062 -48031
10657 -48031 -17152 116859 150614 184315 -191386 -293925 -85570 88865 -88076 278850
10647 278850 421788 350037 475129 475528 232957 142687 304405 321280 413373 501022 117911
10636 117911 -65847 65191 107363 -153662 -72249 52755 -7681 -333144 -112905 245994
10626 245994 390376 382662 397179 707414 443682 177544 -171027 135862 430438 306954
10616 306954 -51865 -268368 -425954 -700512 -744449 -1052912 -700599 -482852 -366172 -336900
10606 -336900 -365618 -127641 -254625 -173247 -155879 -276156 -238213 -325497 -118837 6289
10596 6289 -290404 -575649 -624587 -111294 -301950 -20529 293557 599598 456607 118433
10586 118433 78073 -160750 -364769 -328766 -177920 -46785 195589 326651 139445 -265376
10576 -265376 -288781 231990 346421 -150272 -645008 -640991 -376354 -323927 -452005 -576691
10566 -576691 -817861 -751869 -387000 -72838 -260057 -67531 -395030 -376007 -218918 -90674
10556 -90674 25415 -282089 -132739 375294 524248 479991 76509 54054 -186777 -306966
$$ [...]
##END NTUPLES=NMR SPECTRUM
##END=
