##TITLE=Analysis number 320017
Compound Code cc 36601
Book Reference 475/54/1
Project Code adrs
Chemist Name janep
##JCAMPDX= 6.0         $$ Bruker NMR JCAMP-DX V2.0
##DATA TYPE= NMR SPECTRUM
##DATA CLASS= NTUPLES
##ORIGIN= Bruker BioSpin GmbH
##OWNER= nmr
$$ XWIN-NMR		Version 3.5
$$ Thu Jun  8 13:20:57 2006 GMT Daylight Time (UT+1h)  MAYBRIDGE\nmr@NMR_250MHZ
##.OBSERVE FREQUENCY= 250.131544655141
##.OBSERVE NUCLEUS= ^1H
##.ACQUISITION MODE= SIMULTANEOUS (DQD)
##.ACQUISITION SCHEME= undefined
##.AVERAGES= 16
##.DIGITISER RES= 18
##SPECTROMETER/DATA SYSTEM= dpx250
##.PULSE SEQUENCE= zg30
##.SOLVENT NAME= DMSO
##.SHIFT REFERENCE= (INTERNAL, DMSO, 0, 16.522)
##AUDIT TRAIL= $$ (NUMBER, WHEN, WHO, WHERE, WHAT)
$$ ##TITLE= Audit trail, XWIN-NMR		Version 3.5
$$ ##JCAMPDX= 5.01
$$ ##ORIGIN= Bruker BioSpin GmbH
$$ ##OWNER= nmr
$$ C:\u/data/dgb/nmr/ADRS/450/pdata/1/auditp.txt
$$ ##AUDIT TRAIL=  $$ (NUMBER, WHEN, WHO, WHERE, WHAT)
(   1,<2006-06-08 13:20:20.99 +100>,<MAYBRIDGE\nmr>,<NMR_250MHZ>,
      <created by zg, POWCHK disabled, PULCHK disabled
       configuration hash MD5:
       E2 DF 36 D8 04 B2 41 60 5A D7 A3 38 5A 4B D0 FE
       data hash MD5: 64K
       41 D2 D5 28 67 A1 08 CD DD 7E 84 68 17 4E 76 DC>)
(   2,<2006-06-08 13:20:37.65 +100>,<MAYBRIDGE\nmr>,<NMR_250MHZ>,
      <Start of raw data processing
       ef LB = 0.3 FT_mod = 6 PKNL = 1 SI = 32K 
       data hash MD5: 32K
       2F D2 35 0C C9 48 9E F1 E0 4E 92 2C 06 4B 0C 6F>)
(   3,<2006-06-08 13:20:40.05 +100>,<MAYBRIDGE\nmr>,<NMR_250MHZ>,
      <apk 
       data hash MD5: 32K
       6E 78 1B 1B 04 EB 97 16 DB FA 1A 2B 55 84 C5 AA>)
(   4,<2006-06-08 13:20:41.85 +100>,<MAYBRIDGE\nmr>,<NMR_250MHZ>,
      <abs ABSG = 5 
       data hash MD5: 32K
       02 3F DC 9D 6C 3C EC 7C 96 4D AA E4 4F A4 D8 C0>)
$$ ##END=
$$ 
$$ hash MD5
$$ 1A 6A E0 5A 6B 43 6B 22 E1 DC A4 1A B0 FE 5D AA
##$RELAX= 
##$RELAX= 
##$RELAX= 
##$RELAX= 
##$RELAX= 
##$RELAX= 
##$RELAX= 
$$ Bruker specific parameters
$$ --------------------------
##$DU= <C:\u>
##$EXPNO= 450
##$NAME= <ADRS>
##$PROCNO= 1
##$TYPE= <nmr>
##$USER= <dgb>
##$AMP= (0..31)
100 100 100 100 100 100 100 100 100 100 100 100 100 100 100 100 100 100 
100 100 100 100 100 100 100 100 100 100 100 100 100 100 
##$AQSEQ= 0
##$AQ_mod= 3
##$AUNM= <au_zg>
##$AUTOPOS= <31 >
##$BF1= 250.13
##$BF2= 250.13
##$BF3= 250.13
##$BF4= 250.13
##$BF5= 500.13
##$BF6= 500.13
##$BF7= 500.13
##$BF8= 500.13
##$BYTORDA= 1
##$CFDGTYP= 0
##$CFRGTYP= 5
##$CHEMSTR= <none>
##$CNST= (0..31)
1 1 145 1 1 1 1 1 1 1 1 1 1 1 1 1 1 1 1 1 1 1 1 1 1 1 1 1 1 1 1 1 
##$CPDPRG= <>
##$CPDPRG1= <>
##$CPDPRG2= <>
##$CPDPRG3= <>
##$CPDPRG4= <mlev>
##$CPDPRG5= <mlev>
##$CPDPRG6= <mlev>
##$CPDPRG7= <mlev>
##$CPDPRG8= <mlev>
##$CPDPRGB= <>
##$CPDPRGT= <>
##$D= (0..31)
0 1 0 0 0 0 0 0 0 0.06 0 0 0 0 0 0 0.0002 0 0 0 0 0 0 0 0 0 0 0 0 0 0 
0 
##$DATE= 1149769219
##$DBL= (0..7)
120 120 120 120 120 120 120 120 
##$DBP= (0..7)
150 150 150 150 150 150 150 150 
##$DBP07= 0
##$DBPNAM0= <>
##$DBPNAM1= <>
$$ [...]
##$SUBNAM7= <"">
##$SUBNAM8= <"">
##$SUBNAM9= <"">
##$SW= 20.6930455092707
##$SWIBOX= (0..15)
0 0 3 0 0 0 0 0 0 0 0 0 0 0 0 0 
##$SW_h= 5175.983436853
##$TD= 65536
##$TD0= 1
##$TE= 296.16
##$TE2= 300
##$TE3= 300
##$TEG= 300
##$TL= (0..7)
0 120 120 120 120 120 120 120 
##$TP= (0..7)
150 150 150 150 150 150 150 150 
##$TP07= 0
##$TPNAME0= <>
##$TPNAME1= <>
##$TPNAME2= <>
##$TPNAME3= <>
##$TPNAME4= <>
##$TPNAME5= <>
##$TPNAME6= <>
##$TPNAME7= <>
##$TPOAL= (0..7)
0.5 0.5 0.5 0.5 0.5 0.5 0.5 0.5 
##$TPOFFS= (0..7)
0 0 0 0 0 0 0 0 
##$TUNHIN= 0
##$TUNHOUT= 0
##$TUNXOUT= 0
##$USERA1= <user>
##$USERA2= <user>
##$USERA3= <user>
##$USERA4= <user>
##$USERA5= <user>
##$V9= 5
##$VALIST= <valist>
##$VCLIST= <CCCCCCCCCCCCCCC>
##$VD= 0
##$VDLIST= <DDDDDDDDDDDDDDD>
##$VPLIST= <PPPPPPPPPPPPPPP>
##$VTLIST= <TTTTTTTTTTTTTTT>
##$WBST= 1024
##$WBSW= 4
##$XGAIN= (0..3)
0 0 0 0 
##$XL= 0
##$YL= 0
##$YMAX_a= 304480
##$YMIN_a= -406993
##$ZGOPTNS= <>
##$ZL1= 120
##$ZL2= 120
##$ZL3= 120
##$ZL4= 120
##$ABSF1= 16.522
##$ABSF2= -4.171173
##$ABSG= 5
##$ABSL= 3
##$ALPHA= 0
##$AQORDER= 0
##$ASSFAC= 0
##$ASSFACI= 0
##$ASSFACX= 0
##$ASSWID= 0
##$AUNMP= <proc_1d>
##$AZFE= 0.1
##$AZFW= 0.1
##$BCFW= 0
##$BC_mod= 0
##$BYTORDP= 0
##$COROFFS= 0
##$CY= 12.5
##$DATMOD= 1
##$DC= 0
##$DFILT= <>
##$DTYPP= 0
##$F1P= 14.0000005364418
##$F2P= -0.99999901652339
##$FCOR= 0.5
##$FTSIZE= 32768
##$FT_mod= 6
##$GAMMA= 0
##$GB= 0
##$INTBC= 1
##$INTSCL= 1
##$ISEN= 128
##$LB= 0.3
##$LEV0= 0
##$LPBIN= 0
##$MAXI= 10000
##$MC2= 0
##$MEAN= 0
##$ME_mod= 0
##$MI= 0
##$NCOEF= 0
##$NC_proc= -5
##$NLEV= 6
##$NOISF1= 0
##$NOISF2= 0
##$NSP= 0
##$NTH_PI= 0
##$NZP= 0
##$OFFSET= 16.522
##$PC= 1
##$PHC0= 162.7408
##$PHC1= 10.74433
##$PH_mod= 1
##$PKNL= yes
##$PPARMOD= 0
##$PSCAL= 4
##$PSIGN= 0
##$REVERSE= no
##$SF= 250.13
##$SI= 32768
##$SIGF1= 0
##$SIGF2= 0
##$SINO= 400
##$SIOLD= 32768
##$SREGLST= <1H.DMSO>
##$SSB= 0
##$STSI= 32768
##$STSR= 0
##$SW_p= 5175.98343685301
##$SYMM= 0
##$S_DEV= 0
##$TDeff= 65536
##$TDoff= 0
##$TI= <Analysis number 999999
Compound Code 99
Book Reference 9
Project Code 9>
##$TILT= no
##$TM1= 0
##$TM2= 0
##$TOPLEV= 0
##$USERP1= <user>
##$USERP2= <user>
##$USERP3= <user>
##$USERP4= <user>
##$USERP5= <user>
##$WDW= 1
##$XDIM= 32768
##$YMAX_p= 399149991
##$YMIN_p= -1387632
$$ End of Bruker specific parameters
$$ ---------------------------------
##NTUPLES= NMR SPECTRUM
##VAR_NAME=  FREQUENCY,     SPECTRUM/REAL,   SPECTRUM/IMAG
##SYMBOL=    X,             R,               I
##VAR_TYPE=  INDEPENDENT,   DEPENDENT,       DEPENDENT
##VAR_FORM=  AFFN,          ASDF,            ASDF
##VAR_DIM=   32768,         32768,           32768
##UNITS=     HZ,            ARBITRARY UNITS, ARBITRARY UNITS
##FACTOR=    0.157963299565203, 1,           1
##FIRST=     4132.6476996994, 0,             0
##LAST=      -1043.33573715361, 0,           0
##MIN=       -1043.33573715361, -1387632,    0
##MAX=       4132.6476996994, 399149991,     0
$$ Real data points
##PAGE= N=1
##DATA TABLE= (X++(R..R)), XYDATA
$$ [...]
$$ plain form
15513 81451 222912 274879 318486 420319 517148 545908 281524 357590 575374 382738 93577
15502 93577 -118368 -150109 -232982 -217243 -241016 -674049 -568928 -270202 -323355 -355201 -182252
15491 -182252 229617 324451 306466 213427 29529 196808 -22679 1724 179453 -53040
15481 -53040 -271511 -107960 -213316 -337636 -297486 17160 -156831 -339349 -382327 -417590
15471 -417590 -320948 -194730 99638 382368 139224 241427 275515 426286 515397 183115
15461 183115 138142 112455 -56003 22986 -111964 -480460 -550784 -313654 -463568 -677931
15451 -677931 -818514 -649461 -548318 -210929 -443080 -331135 12630 71550 -56788 -292872
15441 -292872 104705 35548 -83836 -360167 -476087 -233302 -156659 -298703 109057 88009
$$ packed form
15513H1451J41461N1967M3607J01833R6829K8760k64384P6066K17784j92636k89161
15502I3577k11945l1741q2873J5739k3773m33033J05121K98726n3153l1846J72949
15491a82252M11869R4834j7985r3039j83898J67279k19487K4403J77729k32493
15481e3040k18471J63551j05356j24320M0150L14646j73991j82518m2978l5263
15471d17590R6642J26218K94368K82730k43144J02203L4088J50771Q9111l32282
15461A83115m4973k5687j68458P8989j34950l68496p0324K37130j49914k14363
15451f77931j40583J69053J01143L37389k32151J11945L43765N8920j28338k36084
15441b92872L97577o9157j19384k76331j15920K42785P6643j42044M07760k1048
$$ plain form
15431 88009 96271 46773 -227740 -417198 -263815 -37991 19343 -162481 -274134 57335
15421 57335 161589 99405 193330 330498 192394 142250 -6060 -189588 -514274 -354405
15411 -354405 -294049 -349672 -346508 -213042 202066 247838 203174 201886 -156345 -403568 -314775
15400 -314775 -11882 -119316 -80578 275559 577282 603127 535888 163296 298027 178231
15390 178231 228062 152014 266406 234222 185233 113665 50971 298803 481417 459829 230899
15379 230899 -74221 70183 110102 -326485 -562092 -894603 -707766 -243449 -36768 -205660
15369 -205660 -231266 -102255 390518 525882 150210 -7055 -44814 65826 48307 55917
15359 55917 -240924 -549569 -532920 -255693 100733 145277 -15848 -24837 -51900 -444294 -521852
$$ packed form
15431H8009Q262m9498k74513j89458J53383K25824N7334j81824j11653L31469
15421E7335J04254o2184R3925J37168j38104n0144j48310j83528l24686J59869
15411c54405O0356n5623L164J33466M15108M5772m4664j288l58231k47223Q8793
15400c14775L02893j07434L8738L56137L01723K5845o7239l72592J34731j19796
15390A78231M9831p6048J14392l2184m8989p1568o2694K47832J82614k1588k28930
15379B30899l05120J44404L9919m36587k35607l32511J86837M64317K06681j68892
15369b05660k5606J29011M92773J35364l75672j57265l7759J10640j7519P610
15359E5917k96841l08645J6649K77227L56426M4544j61125q989k7063l92394p7558
$$ plain form
15348 -521852 -213617 -59443 -204348 -345983 -477824 -620615 -185345 30469 -87927 -238730
15338 -238730 -383611 -281884 -9850 -218681 -187712 -59470 -214411 -278270 -190159 -6600
15328 -6600 298504 187127 -107518 -95933 -89696 -49785 181201 137705 -447723 -584520 -289683
15317 -289683 -242788 -72055 266356 272415 130277 128171 -147656 35747 627712 560937 292482
15306 292482 346513 -63076 -405367 -376390 -306231 -385213 -28054 -38206 63072 378468
15296 378468 447144 359106 146816 139490 226268 188254 267364 203904 -30043 -65137 -348094
15285 -348094 -461806 -299301 -284429 -202496 -90699 -217212 -205265 -93322 -179742 -715674
15275 -715674 -709374 -578335 -730771 -763588 -543972 -364348 -59663 192051 -6503 92516
$$ packed form
15348e21852L08235J54174j44905j41635j31841j42791M35270K15814j18396j50803
15338b38730j44881J01727K72034k08831L0969J28242j54941o3859Q8111J83559
15328f600L05104j11377k94645J1585O237L9911K30986m3496n85428j36797K94837
15317b89683M6895J70733L38411O059j42138k106k75827J83403N91965o6775k68455
15306B92482N4031m09589l42291K8977P0159p8982L57159j0152J01278L15396
15296C78468O8676q8038k12290p326Q6778l8014P9110o3460k33947l5094k82957
15285c48094j13712J62505J4872Q1933J11797j26513J1947J11943q6420n35932
15275g15674O300J31039j52436l2817K19616J79624L04685K51714j98554R9019
$$ plain form
15265 92516 271090 181835 -117429 -211440 28641 30333 9962 570137 853859 672046 213023
15254 213023 239263 510844 550242 8522 -133700 -51458 -150227 -112140 -230015 -289395 -172325
15243 -172325 -5927 89613 41486 -182860 -240467 -141473 -2653 -33215 104266 -78328
15233 -78328 -26136 314379 -65929 -741194 -1007532 -656520 -608100 -390990 -447167 -276202
15223 -276202 -161871 -146889 273993 104060 -64219 -265427 -554569 -417754 -746548 -697785
15213 -697785 -25506 447565 570225 451730 102951 165279 250653 -129146 -384258 -310928
15203 -310928 -76796 -134926 -206052 -200981 -493347 -713582 -505088 -93476 -334029 -164657
15193 -164657 55210 -29093 186153 174761 102184 -33026 -71785 -275178 -134293 -148594
$$ packed form
15265I2516J78574q9255k99264r4011K40081J692k0371N60175K83722j81813m59023
15254B13023K6240K71581L9398n41720j42222Q2242r8769L8087j17875n9380J17070
15243a72325J66398R5540m8127k24346n7607R8994J38820l0562J37481j82594
15233g8328N2192L40515l80308o75265k66338L51012M8420K17110n6177J70965
15223b76202J14331J4982M20882j69933j68279k01208k89142J36815l28794M8763
15213f97785O72279M73071J22660j18495l48779O2328Q5374l79799k55112P3330
15203c10928K34132n8130p1126N071k92366k20235K08494M11612k40553J69372
15193a64657K19867q4303K15246j1392p2577j35210l8759k03393J40885j4301
$$ plain form
15183 -148594 -2111 -71465 3749 129917 163148 158364 -120248 -239363 -213595 -430956 -431272
15172 -431272 -120201 -185405 -445313 -315313 -474149 -614629 -203344 -242642 -499617 -272079
15162 -272079 -308012 -252119 -203650 -75253 -244614 -255410 61719 221671 1130 -144082
15152 -144082 -242548 -431644 -504978 -333765 -455931 -465492 -346957 23635 171887 -261753
15142 -261753 -525013 -709483 -1179678 -1163137 -997703 -728878 -793556 -429271 -48323 -100218
15132 -100218 -285435 54190 54739 -237177 -190941 -92389 -82857 -61324 192820 209688 385151
15121 385151 359390 561936 292293 -73674 -431912 -123355 150333 261384 -120010 -246141
15111 -246141 197276 323430 84743 62080 95460 -65295 -426450 -301503 -579280 -330521
$$ packed form
15183a48594J46483o9354P5214J26168L3231m784k78612j19115K5768k17361l16
15172d31272L11071o5204k59908J30000j58836j40480M11285l9298k56975K27538
15162b72079l5933N5893M8469J28397j69361j0796L17129J59952k20541j45212
15152a44082r8466j89096p3334J71213j22166r561J18535L70592J48252m33640
15142b61753k63260j84470m70195J6541J65434K68825o4678L64285L80948n1895
15132a00218j85217L39625N49k91916M6236R8552R532K1533K54144J6868J75463
15121C85151k5761K02546k69643l65967l58238L08557K73688J11051l81394j26131
15111b46141M43417J26154k38687k2663L3380j60755l61155J24947k77777K48759
$$ plain form
15101 -330521 -41164 -158665 2920 -45108 61895 266395 327134 347562 211743 27717
15091 27717 -113479 -131937 -48382 39878 228173 211985 285543 269983 238937 168029 53784
15080 53784 59104 319403 715781 463215 6461 16765 532500 537449 453460 471727 115819
15069 115819 316899 484773 137861 -244696 -254821 98675 315186 171866 137531 -186489
15059 -186489 -340365 -13190 232065 299444 144882 -411741 -651806 -612106 -211360 130337
15049 130337 222885 320599 98962 232493 312836 401811 515550 456381 -6242 -160706
15039 -160706 -54228 63090 257698 88881 -429714 -466386 43640 248387 313047 209432
15029 209432 -130859 -80018 -131997 17282 70272 -57085 -56610 -459418 -751739 -521038 -260127
$$ packed form
15101c30521K89357j17501J61585m8028J07003K04500O0739K0428j35819j84026
15091B7717j41196j8458Q3555Q8260J88295j6188P3558j5560l1046p0908j14245
15080E3784N320K60299L96378k52566m56754J0304N15735M949q3989J8267l55908
15069A15819K01080J67874l46912l82557j0125L53496K16511j43320l4335l24020
15059a86489j53876L27175K45255O7379j54562n56623k40065L9700M00746L41697
15049A30337R2548R7714k21637J33531Q0343Q8975J13739n9169m62623j54464
15039a60706J06478J17318J94608j68817n18595l6672N10026K04747O4660j03615
15029B09432l40291N0841n1979J49279N2990j27357M75m02808k92321K30701K60911
$$ plain form
15018 -260127 -543468 -541993 -290807 -686227 -749621 -443489 -200284 -164018 -326831 -323323 -325093
15007 -325093 -388196 -191589 -382408 -600674 -469448 -421331 -435353 -430095 -585068 -685560
14997 -685560 -258025 461646 387812 135076 463153 564899 630841 375297 276459 683300
14987 683300 606351 251253 -242958 -466500 -665647 -806798 -549491 -418453 -142332 -276268
14977 -276268 -307430 -287483 -9932 -245265 -451610 -271357 217159 208729 -193214 -444358
14967 -444358 -250325 -85440 -159480 -225224 -226022 -412148 -702913 -516074 -376613 -346180 -282766
14956 -282766 128409 -13202 170686 333662 257697 243339 87552 -106902 -175632 -42577
14946 -42577 76526 198065 565664 703541 725829 364723 -138534 -188380 -56695 83599
$$ packed form
15018b60127k83341J475K51186l95420o3394L06132K43205L6266j62813L508j770
15007c25093o3103J96607j90819k18266J31226M8117j4022N258j54973j00492
14997f85560M27535P19671p3834k52736L28077J01746O5942k55544r8838M06841
14987F83300p6949l55098m94211k23542j99147j41151K57307J31038K76121j33936
14977b76268l1162J9947K77551k35333k06345J80253M88516q430m01943k51144
14967d44358J94033J64885p4040o5744p98j86126k90765J86839J39461L0433O3414
14956b82766M11175j41611J83888J62976p5965j4358j55787j94454o8730J33055
14946d2577J19103J21539L67599J37877K2288l61106n03257m9846J31685J40294
$$ plain form
14936 83599 206048 50922 -178730 -96579 -215881 -58389 149157 -135844 -303611 -254897
14926 -254897 -417246 -751684 -377904 26948 -44812 -278154 -160968 -76034 -250414 -154615
14916 -154615 -166338 -362653 -413305 -511479 -282482 -51412 -201590 42738 219190 -186633
14906 -186633 -440237 -455650 -368684 80462 254811 -24290 -41762 108924 139780 219164
14896 219164 -75136 35759 -111408 -191517 -29583 38044 -213051 -476483 -222852 -88689
14886 -88689 350100 542500 508872 166291 133734 91389 -10916 -75095 69654 80791 49737
14875 49737 34852 275382 460948 260287 160398 -229249 -350368 -587151 -283529 14246
14865 14246 10427 -336540 -773968 -545284 -224177 -362969 -237789 -378199 -443272 -235673
$$ packed form
14936H3599J22449j55126k29652Q2151j19302J57492K07546k85001j67767M8714
14926b54897j62349l34438L73780M04852p1760k33342J17186Q4934j74380R5799
14916a54615j1723j96315n0652r8174K28997K31070j50178K44328J76452m05823
14906a86633k53604j5413Q6966M49146J74349k79101j7472J50686L0856P9384
14896B19164k94300J10895j47167q0109J61934O7627k51095k63432K53631J34163
14886h8689M38789J92400l3628l42581l2557m2345j02305o4179J44749J1137l1054
14875D9737j4885K40530J85566k00661r9889l89647j21119k36783L03622K97775
14865A4246l819l46967m37428K28684L21107j38792J25180j40410o5073K07599
$$ plain form
14855 -235673 -361193 -539388 -517099 -572168 -961614 -839263 -417735 -388931 -184596 -226504
14845 -226504 -415951 -178313 -87144 -221666 -315991 -137058 -73666 -171479 -454061 -492560
14835 -492560 -466297 -246375 45064 -293168 -339483 -285124 -63046 263283 100456 -141921
14825 -141921 -141826 -309618 -297092 -267488 -62865 -509281 -392947 -38024 -135513 -140508 92890
14814 92890 99243 -32606 -98322 -253336 -256810 11310 98360 -102929 -399273 -226206 42896
14803 42896 144111 253723 17389 -357537 -519220 -531872 -554400 -429324 -46298 201722
14793 201722 533375 609311 424480 194999 195 -677321 -586135 -231534 193223 -41
14783 -41 -289151 -196084 339852 -111973 -479741 -650254 -593358 -860439 -886544 -772657 -520363
$$ packed form
14855b35673j25520j78195K2289n5069l89446J22351M21528K8804K04335m1908
14845b26504j89447K37638R1169j34522r4325J78933O3392r7813k82582l8499
14835d92560K6263K19922K91439l38232m6315N4359K22078L26329j62827k42377
14825a41921R5j67792J2526K9604K04623m46416J16334L54923r7489m995K33398
14814I2890O353j31849o5716j55014l474K68120Q7050k01289k96344J73067K69102
14803D2896J01215J09612k36334l74926j61683j2652k2528J25076L83026K48020
14793B01722L31653P5936j84831k29481j94804o77516R1186L54601M24757j93264
14783d1k89110R3067N35936m51825l67768j70513N6896k67081k6105J13887K52294
$$ plain form
14772 -520363 -607789 -624171 -278808 85872 86202 101133 17373 408795 174135 -99368 -81506
14761 -81506 92701 157041 130528 148365 334229 404024 229692 -136630 -5819 -67023 -150241
14750 -150241 -237557 -74957 -125369 -534228 -325952 -293982 -685941 -530943 -302995 -158060
14740 -158060 -335995 -589596 -437589 -204378 -97412 136370 264985 57370 -63122 302932
14730 302932 301670 291860 285639 400147 278427 500595 22553 -293413 -444293 -203142 -176850
14719 -176850 -261617 -363552 44579 76674 -252692 -214667 -259455 -372312 -581723 -546598
14709 -546598 -608535 -256106 82407 73501 -13242 -1752 97864 397862 585825 654535 531114
14698 531114 417246 420612 843030 667523 268197 252354 -144170 -409513 -574931 -534949
$$ packed form
14772e20363q7426j6382L45363L64680L30J4931q3760L91422k34660k73503J7862
14761h1506J74207O4340k6513J7837J85864O9795j74332l66322J30811o1204q3218
14750a50241q7316J62600n0412m08859K08276L1970l91959J54998K27948J44935
14740a58060j77935k53601J52007K33211J06966K33782J28615k07615j20492L66054
14730C02932j262r810o221J14508j21720K22168m78042l15966j50880K41151K6292
14719a76850q4767j01935M08131L2095l29366L8025m4788j12857k09411L5125
14709e46598o1937L52429L38513q906q6743J1490R9616K99998J87963O8710j23421
14698E31114j13868L366M22418j75507l99326j5843l96524k65343j65418L9982
$$ plain form
14688 -534949 -684619 -597684 -503621 -296903 -183773 -198483 -84910 -79389 21988 397407
14678 397407 489639 73333 -241485 -107070 128086 321848 288856 -114630 -95190 -195200
14668 -195200 -128761 309800 647340 369169 48504 25542 25067 98934 531261 634588 402847
14657 402847 323575 324298 171650 -110400 -410164 -419650 -469564 -631616 -483701 -257468 369440
14646 369440 270979 -137015 199970 -83138 -655765 -869876 -738808 -699385 -741740 -704453
14636 -704453 -731830 -551481 -410050 -232309 -250868 -275342 -83451 64016 6477 239018
14626 239018 87936 -129485 -151190 -161376 94690 -379802 -702105 -569564 -321224 -417348
14616 -417348 -638124 -628132 -617690 -525815 172192 197696 162735 86305 -92356 -431733 48906
$$ packed form
14688e34949j49670Q6935R4063K06718J13130j4710J13573N521J01377L75419
14678C97407R2232m16306l14818J34415K35156J93762l2992m03486J9440j00010
14668a95200O6439M38561L37540k78171l20665k2962m75P3867M32327J03327k31741
14657D02847p9272P23j52648k82050k99764r486m9914j62052J47915K26233O26908
14646C69440r8461m07994L36985k83108n72627k14111J31068L9423m2355L7287
14636g04453k7377J80349J41431J77741j8559k4474J91891J47467n7539K32541
14626B39018j51082k17421k1705j0186K56066m74492l22303J32541K48340r6124
14616d17348k20776R992J0442R1875O98007K5504l4961p6430j78661l39377M80639
$$ plain form
14605 48906 453426 123513 129197 315956 59725 -168929 -241476 -183943 -351365 -518427
14595 -518427 -244102 31025 43498 194235 352871 313216 243295 263889 339953 157677
14585 157677 -128133 -122413 -38354 326328 159728 -223878 -408719 -34798 299117 284814
14575 284814 50699 -523275 -537864 -308459 -45968 84469 70898 -96143 -69901 -385371
14565 -385371 -507563 -477914 -607589 -650627 -310308 -96105 168874 168720 36177 -80185
14555 -80185 -256195 -211086 198401 358672 144489 -275972 -348544 -266021 -531141 -684632
14545 -684632 -698239 -329964 72906 -93409 -29058 -179422 70444 129519 89274 82087 95685
14534 95685 -237656 -267479 -6718 356891 451120 435244 517644 76460 -178055 -427681
$$ packed form
14605D8906M04520l29913N684J86759k56231k28654p2547N7533j67422j67062
14595e18427K74325K75127J2473J50737J58636l9655o9921K0594P6064j82276
14585A57677k85810N720Q4059L64682j66600l83606j84841L73921L33915j4303
14575B84814k34115n73974j4589K29405K62491J30437j3571j67041K6242l15470
14565c85371j22192K9649j29675m3038L40319K14203K64979j54j32543j16362
14555h0185j76010M5109M09487J60271k14183m20461p2572Q2523k65120j53491
14545f84632j3607L68275M02870j66315O4351j50364K49866N9075m0245p187J3598
14534I5685l33341k9823K60761L63609R4229j5876Q2400m41184k54515k49626
$$ plain form
14524 -427681 -447676 -591761 -304897 144502 469967 571595 40885 -217777 -492196 -506952
14514 -506952 -593111 -486264 -362030 -467538 -503393 -311135 -272504 -297565 -78224 392899
14504 392899 711561 578569 21579 -116500 -116741 91760 600330 416954 325180 354946
14494 354946 343855 314141 402894 211846 -73589 7681 -146542 -260947 -233097 -297400 -278102
14483 -278102 -124825 -215726 -361779 -640148 -718814 -976841 -999333 -623953 -315892 -298783
14473 -298783 -340470 -371466 -347787 -414373 -634846 -260056 52159 -90237 -81119 -264843 142617
14462 142617 389836 241627 141132 14018 33376 -327325 -869481 -713286 -414619 -348899
14452 -348899 -491554 -480042 -583927 -819408 -635025 -360896 -540636 -508274 -161734 -317861
$$ packed form
14524d27681j9995j44085K86864M49399L25465J01628n30710k58662k74419j4756
14514e06952q6159J06847J24234j05508l5855J92258L8631k5061K19341M71123
14504C92899L18662j32992n56990j38079k41K08501N08570j83376r1774K9766
14494C54946j1091k9714Q8753j91048k85435Q1270j54223j14405K7850o4303J9298
14483b78102J53277r0901j46053k78369p8666k58027k2492L75380L08061J7109
14473b98783m1687l0996K3679o6586k20473L74790L12215j42396R118j83724M07460
14462A42617K47219j48209j00495j27114J9358l60701n42156J56195K98667O5720
14452c48899j42655J1512j03885k35481J84383K74129j79740L2362L46540j56127
$$ plain form
14442 -317861 -411189 -258336 -141826 -115649 -143261 -107428 55675 30802 -284678 -648585
14432 -648585 -477265 -519443 -549281 -102369 -189717 -512401 -535186 -184764 -309359 -54424
14422 -54424 42409 122351 105430 -184250 -584009 -900439 -575572 -236987 -330573 -324430 -213563
14411 -213563 122582 -120993 -543509 -628964 -676043 -448267 -371255 -209108 -65198 211442
14401 211442 633099 633186 404351 140721 191539 448718 588737 517826 314947 -207099 -226550
14390 -226550 -303301 -419675 -274315 -8990 686789 770485 604751 147717 -107111 -62870
14380 -62870 -64447 -325291 145900 676790 627560 448737 484851 297558 -78871 -83756 -362451
14369 -362451 -455145 -365861 -59048 -359547 -468476 -569037 -359660 -108191 111945 -63637
$$ packed form
14442c17861r3328J52853J16510K6177k7612L5833J63103k4873l15480l63907
14432f48585J71320m2178k9838M46912q7348l22684k2785L50422j24595K54935
14422e4424R6833P9942j6921k89680l99759l16430L24867L38585r3586O143J10867
14411b13563L36145k43575m22516q5455m7079K27776P7012J62147J43910K76640
14401B11442M21657Q7k28835k63630N0818K57179J40019p0911k02879n22046j9451
14390b26550p6751j16374J45360K65325O95779Q3696j65734m57034k54828M4241
14380f2870j577k60844M71191N30890m9230j78823L6114j87293l76429m885k78695
14369c62451r2694Q9284L06813l00499j08929j00561K09377K51469K20136j75582
$$ plain form
14359 -63637 6949 233207 100472 -272800 -345626 -148638 -324029 -290307 -405547 -532568
14349 -532568 -293439 158904 220822 284833 154123 -42524 -416516 -484315 -358832 -433003
14339 -433003 -834507 -414341 615 76094 -105643 71812 52880 -62762 -258512 -181747
14329 -181747 -310530 -226958 -67230 -107413 -96009 131036 -203534 -456152 -716922 -818883
14319 -818883 -871864 -615848 -611057 -540602 -138288 184049 411708 -81521 -389239 -228902
14309 -228902 -274798 -306107 -387041 -601852 -190319 -76941 -329622 -183677 -164291 -307474
14299 -307474 -306546 -29134 27819 -238968 -123013 90110 325138 181617 -214222 -276995
14289 -276995 -267031 -599224 -612250 -685787 -784537 -660410 -557349 -509069 -542290 -556933 -442391
$$ packed form
14359f3637P0586K26258j32735l73272p2826J96988j75391L3722j15240j27021
14349e32568K39129M52343O1918O4011j30710j96647l73992o7799J25483p4171
14339d33003m01504M20166M14956P5479j81737J77455j8932j15642j95750P6765
14329a81747j28783Q3572J59728m0183J1404K27045l34570k52618k60770j01961
14319h18883n2981K56016M791P0455M02314L22337K27659m93229l07718J60337
14309b28902m5896l1309q0934k14811M11533J13378k52681J45945J9386j43183
14299c07474R28K77412N6953k66787J15955K13123K35028j43521l95839o2773
14289b76995R964l32193j3026p3537r8750J24127J03061M8280l3221j4643J14542
$$ plain form
14278 -442391 -39754 91002 260606 282686 -39749 -193020 -47172 -45897 49284 54056 -24592
14267 -24592 69591 179457 -152605 -387541 -215319 -141297 -120598 -47812 -19257 114214 -3439
14256 -3439 -435706 -398411 68731 189553 37708 -132572 -594376 -264544 -42026 -243362
14246 -243362 -172375 310682 209940 124298 219959 310062 -6370 -141934 -53327 -165125
14236 -165125 -29841 137817 -11846 -367612 -308547 -334073 -511154 -552754 -544936 -182407
14226 -182407 -142375 -307060 -272083 -166972 -141124 -356605 -300826 -177243 -286760 -327238
14216 -327238 -789522 -968530 -703586 -519878 -316809 83378 203084 167609 429075 77018
14206 77018 -95542 100292 -21936 106159 292770 199397 28618 -40411 -38910 -431694
$$ packed form
14278d42391M02637J30756J69604K2080l22435j53271J45848J275R5181M772p8648
14267b4592R4183J09866l32062k34936J72222P4022K0699P2786K8555J33471j17653
14256c439m32267L7295M67142J20822j51845j70280m61804L29832K22518k01336
14246b43362P0987M83057j00742q5642R5661R0103l16432j35564Q8607j11798
14236a65125J35284J67658j49663l55766N9065k5526j77081m1600P818L62529
14226a82407M0032j64685L4977J05111K5848k15481N5779J23583j09517m0478
14216c27238m62284j79008K64944J83708K03069M00187J19706l5475K61466l52057
14206G7018j72560J95834j22228J28095J86611r3373j70779o9029J501l92784
$$ plain form
14196 -431694 80464 322679 145464 -92350 -32082 76023 10670 58509 74215 -338202
14186 -338202 -376875 -96873 284206 405792 120190 437553 722747 594910 275553 104456
14176 104456 139881 188836 313032 164380 52054 -173463 -171542 20947 213936 36813
14166 36813 -25782 44517 182640 265326 188934 -197226 -181477 3567 149398 562391 677735
14155 677735 151322 111528 172319 398560 507931 335647 440344 287201 31454 -52668
14145 -52668 26520 43860 -121849 -102806 -285327 -340060 -205129 -265816 -266133 82993 108233
14134 108233 176281 -196389 -591139 -670512 -648249 -579082 -488652 -409487 -171239 85746 -134938
14123 -134938 -304895 -157500 -194755 -533510 -366438 -11417 195925 31962 -95196 -278311
$$ packed form
14196d31694N12158K42215j77215k37814O0268J08105o5353M7839J5706m12417
14186c38202l8673K80002L81079J21586k85602L17363K85194j27837l19357j71097
14176A04456L5425M8955J24196j48652j12326k25517J921J92489J92989j77123
14166C6813o2595P0299J38123Q2686p6392l86160J5749J85044J45831M12993J15344
14155F77735n26413l9794O0791K26241J09371j72284J04697j53143k55747q4122
14145e2668P9188J7340j65709J9043j82521n4733J34931o0687l17L49126K5240
14134A08233O8048l72670l94750p9373K2263O9167R0430P9165K38248K56985k20684
14123a34938j69957J47395l7255l38755J67072L55021K07342j63963j27158j83115
$$ plain form
14113 -278311 -276647 -308566 -256924 -407862 -261682 310905 632064 520258 230279 423074
14103 423074 492037 498068 185589 -26714 -47284 57776 -54116 22556 15315 6670 50803
14092 50803 516707 347947 276149 107680 -135645 141143 217364 144871 101051 -167372
14082 -167372 -331603 -139144 -1987 90882 16673 161640 -71683 -576878 -522740 -118046
14072 -118046 -41105 -197733 -131374 82593 173503 -89520 -226985 -113857 -129765 134490
14062 134490 354050 199008 260260 282857 338646 29239 -68462 56621 332522 352137
14052 352137 214574 215852 176000 26818 -149363 -233371 -167082 -398363 -167607 -117976 -100793
14041 -100793 -145410 -333428 -649035 -384214 244606 452148 215105 211766 269410 -66281
$$ packed form
14113b78311J664l1919N1642j50938J46180N72587L21159j11806k89979J92795
14103D23074O8963O031l12479k12303k0570J05060j11892P6672p241q645M4133
14092E0803M65904j68760p1798j68469k43325K76788P6221p2493m3820k68423
14082a67372j64231J92459J37157R2869p4209J44967k33323n05195N4138M04694
14072a18046P6941j56628O6359K13967R0910k63023j37465J13128j5908K64255
14062A34490K19560j55042O1252K2597N5789l09407r7701J25083K75901J9615
14052C52137j37563J278l9852j49182j76181q4008O6289k31281K30756M9631J7183
14041a00793m4617j88018l15607K64821O28820K07542k37043l339N7644l35691
$$ plain form
14031 -66281 -332184 -45326 64833 -361240 -308032 -140713 -34029 -517641 -381856 -200038
14021 -200038 -65530 275412 -15841 -448018 -360302 258528 265684 -73326 -92823 -19558
14011 -19558 -395499 -651330 -490328 -409499 -639435 -555025 -1257 668492 471421 274227
14001 274227 142067 -81848 1016 20052 298444 381227 289637 -191066 -222586 201578
13991 201578 75984 298945 104598 23436 127755 -31678 29631 2161 184855 -98853
13981 -98853 -437243 -556290 -378708 -355052 -352742 -202424 -33494 -123132 -404996 -296980
13971 -296980 -315401 -74811 340642 63525 -81969 -255294 -107508 195484 -167676 -57183
13961 -57183 164786 465519 328771 57922 79607 338004 -4289 -135301 -329095 -133122
$$ packed form
14031f6281k65903K86858J10159m26073N3208J67319J06684m83612J35785J81818
14021b00038J34508L40942k91253m32177Q7716O18830P156l39010j9497P3265
14011a9558l75941k55831J61002Q0829k29936Q4410N53768O69749j97071j97194
14001B74227j32160k23915Q2864J9036K78392Q2783r1590m80703l1520M24164
13991B01578j25594K22961j94347q1162J04319j59433O1309k7470J82694k83708
13981i8853l38390j19047J77582K3656K310J50318J68930q9638k81864J08016
13971b96980j8421K40590M15453k77117j45494j73325J47786L02992l63160J10493
13961e7183K21969L00733j36748k70849K1685K58397l42293j31012j93794J95973
$$ plain form
13951 -133122 129987 149728 81300 -52175 -110115 196172 181138 70816 122684 -14376
13941 -14376 -221840 -276950 -363176 -286162 -311839 -440807 -436320 -605546 -386007 18076 296940
13930 296940 326683 225008 493954 729091 661902 462044 373633 20752 -44848 3555
13920 3555 77071 196298 -134211 -196078 -20742 278503 468607 160946 -197657 -237860
13910 -237860 -574058 -679145 -170406 -130859 -269770 -450505 -632198 -546358 -75080 327256
13900 327256 717653 675420 311844 290554 370469 428534 105652 -269063 -269932 -310224 -619841
13889 -619841 -551474 -492993 -623540 -515874 -345627 -314752 -310713 -458724 -272716 -121197
13879 -121197 33180 231425 430660 191111 -149731 39542 43009 -54429 -208180 -344646
$$ packed form
13951a33122K63109J9741o8428j33475n7940L06287j5034j10322N1868j37060
13941a4376k07464n5110q6226P7014k5677j28968M487j69226K19539M04083K78864
13930B96940K9743j01675K68946K35137o7189j99858q8411l52881o5600M8403
13920C555P3516J19227l30509o1867J75336K99245J90104l07661l58603m0203
13910b37860l36198j05087N08739L9547j38911j80735j81693Q5840M71278M02336
13900C27256L90397m2233l63576k1290P9915N8065l22882l74715q69m0292l09617
13889f19841O8367N8481j30547J07666J70247L0875M039j48011J86008J51519
13879a21197J54377J98245J99235k39549l40842J89273L467r7438j53751j36466
$$ plain form
13869 -344646 -73702 -33854 -97856 -35281 -353215 -604300 -379289 -558441 -464393 -330825
13859 -330825 -337501 103463 143761 -62613 15910 -155227 -216887 42925 302451 378291 266185
13848 266185 -3083 -126364 -189958 162538 454974 329498 330599 135360 101663 196854
13838 196854 -127972 -332885 172308 534552 513546 594375 514136 580921 257341 299600
13828 299600 761302 824391 764656 642116 365994 98059 -134639 -192202 243995 277233
13818 277233 53218 62835 -22532 -301704 -270440 -269702 -301036 59393 63485 -2551 11588 -21846
13806 -21846 -154730 -243987 -216091 -385453 -236690 113801 5463 -24306 -15852 22663 111919
13795 111919 261045 123769 75652 -255942 -332439 -262578 -318881 -118963 148324 94984
$$ packed form
13869c44646K70944L9848o4002O2575l17934k51085K25011j79152R4048J33568
13859c30825o676M40964M0298k06374P8523j71137o1660K59812K59526P5840j12106
13848B66185k69268j23281o3594L52496K92436j25476J101j95239l3697R5191
13838A96854l24826k04913N05193L62244k1006Q0829q0239O6785l23580M2259
13828B99600M61702O3089n9735j22540k76122k67935k32698n7563M36197L3238
13818B77233k24015R617q5367k79172L1264P38l1334L60429M092o6036J4139l3434
13806b1846j32884q9257K7896j69362J48763L50491j08338k9769Q454L8515Q9256
13795A11919J49126j37276m8117l31594p6497O9861n6303J99918K67287n3340
$$ plain form
13785 94984 -159542 -274186 -216544 -218891 -281134 -309048 221053 510305 612404 720977 686981
13774 686981 369953 210241 1740 24731 478357 175122 -481491 -515844 -131889 -98527
13764 -98527 -213604 -4564 231167 170024 280205 169850 32944 266192 289783 437398
13754 437398 426947 153649 142228 51454 33305 53623 283266 406204 565313 501704 521829
13743 521829 541523 399476 277620 186481 279507 267207 231632 234787 -15457 -13983 321604
13732 321604 14422 -334318 -360554 -359245 -274860 -229306 -413029 -434907 -596334 -157848 185276
13721 185276 -111768 -389087 -297558 51742 172538 100178 111978 208949 198078 49175
13711 49175 99977 373011 117049 -241561 -491900 -647729 -255769 154539 272343 -47270
$$ packed form
13785I4984k54526j14644N7642k347o2243k7914N30101K89252J02099J08573l3996
13774F86981l17028j59712k08501K2991M53626l03235o56613l4353L83955L3362
13764i8527j15077K09040K35731o1143J10181j10355j36906K33248K3591J47615
13754D37398j0451k73298j1421r0774j8149K0318K29643J22938J59109o3609K0125
13743E21829J9694j42047j21856r1139R3026j2300l5575L155k50244J474L35587
13732C21604l07182l48740k6236J309Q4385M5554j83723k1878j61427M38486L43124
13721A85276k97044k77319R1529L49300J20796p2360J1800R6971j0871j48903
13711D9175N0802K73034k55962l58610k50339j55829L91960M10308J17804l19613
$$ plain form
13701 -47270 -11264 170330 297603 73515 -232855 -385335 -229449 -153659 135001 424649
13691 424649 420788 522940 271063 68748 290518 410918 223625 136436 -74999 -338073
13681 -338073 -166237 -25708 -114625 -137636 208109 300213 356047 736609 816055 769530 791268
13670 791268 331267 -147254 -400229 -242428 226575 126887 -126464 -313567 -413490 -183194
13660 -183194 555906 734441 331273 182294 19248 -97009 -513226 -572017 -533989 -534498
13650 -534498 -64517 251022 390781 81140 13233 25407 24073 302763 690646 470241
13640 470241 473372 662840 290417 168679 151345 32022 113533 342834 244571 222828 285892
13629 285892 287261 387632 458539 591529 930215 1093974 1073575 772365 658571 813730
$$ packed form
13701d7270L6006J81594J27273k24088l06370j52480J55886P5790K88660K89648
13691D24649l861J02152k51877k02315K21770J20400j87293q7189k11435k63074
13681c38073J71836J40529q8917k3011L45745R2104N5834L80562P9446m6525K1738
13670G91268m60001m78521k52975J57801M69003r9688k53351j87103r9923K30296
13660a83194P39100J78535m03168j48979j63046j16257m16217n8791L8028n09
13650e34498M69981L15539J39759l09641o7907J2174j334K78690L87883k20405
13640D70241L131J89468l72423j21738j7334j19323Q1511K29301r8263k1743O3064
13629B85892J369J00371P0907J32990L38686J63759k0399l01210j13794J55159
$$ plain form
13619 813730 843073 827436 420060 330858 268142 -5090 -174167 -302285 -178213 -273589
13609 -273589 -503429 -296261 46807 211049 28696 -175338 95745 345132 161055 -218891
13599 -218891 -422254 -657880 -880229 -339543 160010 45705 88819 -126385 -48639 159960
13589 159960 67485 -40379 -70262 -30143 66323 136263 105891 293773 28983 58729 10701
13578 10701 -256265 -182429 96755 230569 71739 79101 369268 428600 257006 133049
13568 133049 61270 140304 211654 254188 86447 72045 -56950 -74427 51367 -9431 55712
13557 55712 -88561 -132448 -312133 -59991 -188806 -260512 -116331 -253469 158503 172217
13547 172217 25318 -206257 -31691 207802 -50206 -270069 -116280 -198480 -236943 59407
$$ packed form
13619H13730K9343j5637m07376q9202o2716k73232j69077j28118J24072r5376
13609b73589k29840K07168L43068J64242j82353k04034K71083K49387j84077l79946
13599b18891k03363k35626k22349N40686M99553j14305M3114k15204P7746K08599
13589A59960r2475j07864k9883M0119R6466O9940l0372J87882k64790K9746m8028
13578A0701k66966P3836K79184J33814j58830P362K90167N9332j71594j23957
13568A33049p1779P9034P1350M2534j67741j4402j28995j7477J25794o0798O5143
13557E5712j44273m3887j79685K52142j28815p1706J44181j37138M11972J3714
13547A72217j46899k31575J74566K39493k58008k19863J53789q2200l8463K96350
$$ plain form
13537 59407 204752 241354 99725 -107884 -153862 -7743 33939 7128 99881 232833 524297
13526 524297 663519 228033 -49404 -291729 -28553 188182 -213154 -494986 -351700 -230250
13516 -230250 277806 2679 -423258 -45745 396814 67504 -247131 -341167 -228986 -302225
13506 -302225 -424927 23459 21608 -18190 -93590 -424109 -330181 -560023 -321595 1275
13496 1275 -24959 -76311 -204510 -449042 -174631 139262 444174 210098 -99541 74066
13486 74066 222796 267691 153574 -100139 -204354 -71663 -469725 -346944 -327392 -489690
13476 -489690 -472099 -405664 -528464 -524859 -158228 194848 -97890 -92366 346740 553827 169930
13465 169930 -238443 -380031 -342978 -256429 -154814 -228183 -482472 -428645 -86918 264285
$$ packed form
13537E9407J45345L6602j41629k07609m5978J46119M1682k6811R2753J32952K91464
13526E24297J39222m35486k77437k42325K63176K16735m01336k81832J43286J21450
13516b30250N08056k75127m25937L77513M42559l29310l14635r4036J12181p3239
13506c02225j22702M48386j851l9798p5400l30519R3928k29842K38428L22870
13496A275k6234n1352j28199k44532K74411L13893L04912k34076l09639J73607
13486G4066J48730M4895j14117k53713j04215J32691l98062J22781J9552j62298
13476d89690J7591O6435j22800L605L66631L53076k92738N524M39106K07087l83897
13465A69930m08373j41588L7053Q6549J01615p3369k54289N3827L41727L51203
$$ plain form
13455 264285 249221 -85132 -104688 176317 391192 172243 -168533 63378 659953 495859
13445 495859 -39258 -296384 60685 193210 345575 298044 76941 102648 267866 188330
13435 188330 402285 423665 217022 -36217 908 111986 272864 381734 297377 102467
13425 102467 -137452 -236345 -282107 64533 318896 317571 306154 414195 334394 121759 108098
13414 108098 -32758 130946 330767 585444 481798 614588 721755 798289 503872 176250
13404 176250 74705 -144776 -332246 -212921 -344257 -395672 8959 -150374 -42906 199652
13394 199652 758642 689315 322258 202163 64705 61011 226903 112697 229711 347156
13384 347156 308868 466135 63573 -84297 -37769 -53848 47070 519647 904153 891490
$$ packed form
13455B64285j5064l34353j9556K81005K14875k18949l40776K31911N96575j64094
13445D95859n35117k57126L57069J32525J52365m7531k21103K5707J65218p9536
13435A88330K13955K1380k06643k53239L7125J11078J60878J08870q4357j94910
13425A02467k39919r8893m5762L46640K54363j325j1417J08041p9801k12635j3661
13414A08098j40856J63704J99821K54677j03646J32790J07167P6534k94417l27622
13404A76250j01545k19481j87470J19325j31336n1415M04631j59333J07468K42558
13394A99652N58990o9327l67057j20095j37458l694J65892j14206J17014J17445
13384C47156l8288J57267m02562j47870M6528j6079J00918M72577L84506j2663
$$ plain form
13374 891490 413004 122228 367419 603067 328737 -29747 -167947 -18535 -207980 -67882
13364 -67882 192257 423634 646382 626123 414324 551303 324882 40650 208509 343350
13354 343350 348813 292799 347660 319339 258721 51052 -72787 146210 243978 225336 513284
13343 513284 537789 36534 -169737 -269349 -275813 144108 427791 776808 572928 203423
13333 203423 113344 1935 193367 116533 271526 453024 281828 -75522 -34065 -115369
13323 -115369 -66059 25272 -167504 -626876 -409074 -152604 -136706 -147155 90884 235435
13313 235435 -266688 -459191 -184932 -82979 596 -177175 -252082 -178658 -30851 262220
13303 262220 314577 242179 437656 223255 -345583 -42977 278027 -182655 -473138 -18684
$$ packed form
13374H91490m78486k90776K45191K35648k74330l58484j38200J49412j89445J40098
13364f7882K60139K31377K22748k0259k11799J36979k26421k84232J67859J34841
13354C43350N463n6014N4861k8321o0618k07669j23839K18997R7768j8642K87948
13343E13284K4505n01255k06271r9612o464M19921K83683L49017k03880l69505
13333B03423r0079j11409J91432p6834J54993J81498j71196l57350M1457q1304
13323a15369M9310R1331j92776m59372K17802K56470J5898j0449K38039J44551
13313B35435n02123j92503K74259J01953Q3575j77771p4907P3424J47807K93071
13303B62220N2357p2398J95477k14401n68838L02606L21004m60682k90483M54454
$$ plain form
13293 -18684 197073 313040 298869 343028 363281 388564 418863 533537 324441 24549 -321644
13282 -321644 -331385 -223907 -311466 -163847 -239816 -240703 73047 143890 363946 498934 384274
13271 384274 276259 241225 210676 199707 20272 122401 -39206 -97440 53773 117071
13261 117071 497542 582954 782247 697720 329704 -26489 -334810 -414977 -736486 -208988
13251 -208988 -65873 -29794 251663 306818 14267 -58795 45151 -3543 -205190 -151109
13241 -151109 -84426 165330 609819 580632 653518 485687 148027 121991 367212 97393
13231 97393 70635 175127 16033 -15969 -160260 -180372 -4973 328268 790734 793943 545209
13220 545209 594753 483337 386231 85803 277729 530426 304887 154150 -146460 -301563
$$ packed form
13293a8684K15757J15967j4171M4159K0253K5283L0299J14674k09096k99892l46193
13282c21644r741J07478q7559J47619p5969q87L13750P0843K20056J34988j14660
13271C84274j08015l5034l0549j0969j79435J02129j61607n8234J51213O3298
13261A17071L80471Q5412J99293q4527l68016l56193l08321q0167l21509N27498
13251b08988J43115L6079K81457N5155k92551p3062J03946m8694k01647N4081
13241a51109O6683K49756M44489k9187P2886j67831l37660k6036K45221k69819
13231I7393k6758J04492j59094l2002j44291k0112J75399L33241M62466L209k48734
13220E45209M9544j11416r7106l00428J91926K52697k25539j50737l00610j55103
$$ plain form
13210 -301563 -591174 -645199 -416150 -160900 -73224 70341 170532 302865 340049 198739
13200 198739 201068 45939 -107883 -175467 -202541 46421 386309 520046 759554 736849
13190 736849 869207 601201 590184 1066891 921584 515606 402499 546997 414597 -15867
13180 -15867 -247005 36935 248531 541220 371522 186092 37155 119225 -141886 -179386
13170 -179386 45962 -289343 -289605 203579 164615 167239 299022 419760 656272 452129 238676
13159 238676 -80685 -270365 -15172 13751 -247290 -165869 -102455 -135956 -384034 -136429
13149 -136429 -257221 10660 241774 314557 431394 382025 -12214 -160403 -451452 -619652
13139 -619652 -551576 -206908 121058 321528 221590 -45625 -68016 186559 434153 695916
$$ packed form
13210c01563k89611n4025K29049K55250Q7676J43565J00191J32333L7184j41310
13200A98739K329j55129j53822o7584k7074K48962L39888J33737K39508k2705
13190G36849J32358k68006j1017M76707j45307m05978j13107J44498j32400m30464
13180a5867k31138K83940K11596K92689j69698j85430j48937Q2070k61111l7500
13170a79386K25348l35305k62M93184l8964K624J31783J20738K36512k04143k13453
13159B38676l19361j89680K55193K8923k61041Q1421O3414l3501k48078K47605
13149a36429j20792K67881K31114P2783J16837m9369l94239j48189k91049j68200
13139f19652O8076L44668L27966K00470r9938k67215k2391K54575K47594K61763
$$ plain form
13129 695916 838034 685358 231879 95078 92770 337009 413033 306561 377085 83447
13119 83447 -238707 -225758 155952 292659 455793 292817 16783 -141940 -23870 317757
13109 317757 490395 586330 760523 414511 235390 344427 195739 -212566 -391447 139385
13099 139385 199568 104586 2219 -237925 -242857 -19444 371368 279178 -11694 -244844
13089 -244844 -200289 -72504 25927 246427 401652 943362 1116929 493610 303742 539559
13079 539559 449697 439723 502573 693688 960230 845417 863151 863638 756036 542261 543429
13068 543429 484728 672954 751323 614279 574629 446292 338942 464697 811595 851908
13058 851908 905744 1031352 1116764 890646 770389 811960 608512 400965 317015 -36034
$$ packed form
13129F95916J42118j52676m53479j36801k308K44239P6024j06472P0524k93638
13119H3447l22154J2949L81710J36707J63134j62976k76034j58723J18070L41627
13109C17757J72638R5935J74193l46012j79121J09037j48688m08305j78881N30832
13099A39385O0183r4982j02367k40144m932K23413L90812r2190k90872k33150
13089b44844M4555J27785R8431K20500J55225N41710J73567o23319j89868K35817
13079E39559q9862r974O2850J91115K66542j14813J7734M87j07602k13775J168
13068E43429n8701J88226P8369j37044l9650j28337j07350J25755L46898M0313
13058H51908N3836J25608Q5412k26118j20257M1571k03448k07547q3950l53049
$$ plain form
13048 -36034 205556 401504 547249 727832 890143 893302 1080353 1225084 1079076 1096395
13038 1096395 890663 697228 796261 864770 1295959 1590476 1483866 1214395 825923 917388
13028 917388 709154 660151 919212 1084936 975368 603358 1007821 1099999 663082 572952
13018 572952 532393 337265 326491 505161 714471 501404 199880 89245 26821 231853
13008 231853 -15952 279381 351504 287655 121950 263974 206703 314645 286968 249307
12998 249307 201369 508195 703743 717676 1027735 924719 851445 1216937 1429540 1432956
12988 1432956 1554238 1499248 1542803 1511072 1278626 1352638 1212965 1019530 923827 922686 836901
12977 836901 559948 572285 598351 700977 610379 200518 292744 315744 535783 915913
$$ packed form
13048c6034K41590J95948J45745J80583J62311L159J87051J44731j46008J7319
13038A096395k05732j93435R9033O8509M31189K94517j06610k69471l88472R1465
13028I17388k08234m9003K59061J65724j09568l72010M04463R2178m36917r0130
13018E72952m0559j95128j0774J78670K09310k13067l01524j10635o2424K05032
13008B31853k47805K95333P2123o3849j65705J42024n7271J07942k7677l7661
12998B49307m7938L06826J95548J3933L10059j03016p3274L65492K12603L416
12988A432956J21282n4990M3555l1731k32446P4012j39673j93435r5703j141q5785
12977H36901k76953J2337K6066J02626r0598m09861R2226K3000K20039L80130
$$ plain form
12967 915913 1059222 1117449 899528 954621 899685 700429 453061 468187 994022 1153029
12957 1153029 1041811 850439 866450 975065 943806 699083 146904 96451 115855 304378
12947 304378 558429 862405 1205127 1056412 1108773 1089291 990227 742475 514647 619611
12937 619611 484895 386046 421978 92264 108666 425887 616748 714300 503888 247601
12927 247601 156000 40983 24678 30555 -180689 -247996 -128 208504 450497 825695
12917 825695 1022816 942138 925674 1067355 988241 588895 525344 554511 696167 638088 360558
12906 360558 463293 709334 647140 298444 39409 95859 109977 131654 209529 -130564
12896 -130564 21577 137165 754 -116149 38762 418010 534705 509639 698929 706338
$$ packed form
12967I15913J43309N8227k17921N5093n4936j99256k47368J5126N25835J59007
12957A153029j11218j91372J6011J08615l1259k44723n52179n0453J9404J88523
12947C04378K54051L03976L42722j48715N2361j9482r9064k47752k27828J04964
12937F19611j34716r8849L5932l29714J6402L17221J90861R7552k10412k56287
12927B47601r1601j15017j6305N877k11244o7307K47868K08632K41993L75198
12917H25695J97121q0678j6464J41681p9114l99346o3551K9167J41656n8079k77530
12906C60558J02735K46041o2194l48696k59035N6450J4118K1677P7875l40093
12896a30564J52141J15588j36411j16903J54911L79248J16695k5066J89290P409
$$ plain form
12886 706338 713726 732750 874775 985446 851959 967134 643893 435592 575341 754623
12876 754623 751298 749540 443657 234418 570323 606011 342424 218811 125501 52315 267777
12865 267777 519600 111172 95390 328314 927842 801765 554880 304706 396619 499091
12855 499091 373478 236966 377441 516372 497443 540350 685567 592982 597838 444146
12845 444146 581392 676888 673760 991045 858069 591146 210170 221437 526167 675398
12835 675398 511163 183696 357730 407728 258950 232341 76042 -173546 499650 729103
12825 729103 397133 83549 110488 510139 707217 781392 536996 109437 289679 605418
12815 605418 767969 570183 385100 543702 680997 700658 638731 534620 475445 552717
$$ packed form
12886G06338P388J9024J42025J10671j33487J15175l23241k08301J39749J79282
12876G54623l325j758l05883k09239L35905L5688k63587j23613r3310p3186K15462
12865B67777K51823m08428j5782K32924N99528j26077k46885k50174R1913J02472
12855D99091j25613j36512J40475J38931j8929M2907J45217r2585M856j53692
12845D44146J37246R5496l128L17285j32976k66923l80976J1267L04730J49231
12835F75398j64235l27467J74034M9998j48778k6609j56299k49588O73196K29453
12825G29103l31970l13584K6939L99651J97078P4175k44396m27559J80242L15739
12815F05418J62551j97786j85083J58602J37295J9661o1927j04111n9175P7272
$$ plain form
12805 552717 478035 570372 929129 1090260 1263739 1124184 795594 521206 529701 543897
12795 543897 411529 381680 662617 681917 466606 203918 569079 719143 677484 610616
12785 610616 857166 678776 238496 142998 147914 -66255 -72868 312076 79483 270266
12775 270266 599118 593359 389499 463919 601013 574915 523205 494579 541479 572038 282528
12764 282528 -12472 71951 37436 141799 551489 504726 567948 649388 555109 716385 884282
12753 884282 541238 441653 570296 746018 941995 940913 727882 779160 935367 1079355
12743 1079355 942066 883849 1014202 828212 861939 985862 827899 559317 389294 274884
12733 274884 362920 675484 669220 752082 615902 309421 93677 -75226 35485 183420
$$ packed form
12805E52717p4682R2337L58757J61131J73479j39555l28590k74388Q495J4196
12795E43897j32368k9849K80937J9300k15311k62688L65161J50064m1659o6868
12785F10616K46550j78390m40280r5498M916k14169o613L84944k32593J90783
12775B70266L28852n759k03860P4420J37094k6098n1710k8626M6900L0559k89510
12764B82528k95000Q4423l4515J04363M09690m6763O3222Q1440r4279J61276J67897
12753H84282l43044r9585J28643J75722J95977j082k13031N1278J56207J43988
12743A079355j37289n8217J30353j85990L3727J23923j57963k68582j70023j14410
12733B74884Q8036L12564o264Q2862j36180l06481k15744j68903J10711J47935
$$ plain form
12723 183420 284471 414090 273461 264299 53541 557036 1035943 659945 710122 846202
12713 846202 1173352 1306851 1059182 968754 995546 768844 517352 530526 513902 821541
12703 821541 923145 860500 1005657 866121 724958 514516 367114 343146 656257 752411
12693 752411 629334 476572 460788 742411 852064 705242 730969 1099227 926622 568647
12683 568647 843162 466014 672708 901881 511558 388200 708795 604951 417666 298369
12673 298369 326806 198249 317115 519948 35391 252551 731705 986220 719530 555110
12663 555110 704918 903895 823463 762350 1116606 1373322 1369166 1328593 1433249 1244798
12653 1244798 1174297 1230400 1215317 1194026 1124536 734317 570375 805611 814564 909152 986433
$$ packed form
12723A83420J01051J29619j40629r162k10758N03495M78907l75998N0177J36080
12713H46202L27150J33499k47669r0428K6792k26702k51492J3174j6624L07639
12703H21541J01604o2645J45157j39536j41163k10442j47402k3968L13111R6154
12693G52411j23077j52762j5784K81623J09653j46822K5727L68258j72605l57975
12683E68647K74515l77148K06694K29173l90323j23358L20595j03844j87285j19297
12673B98369K8437j28557J18866K02833m84557K17160M79154K54515k66690j64420
12663E55110J49808J98977q0432o1113L54256K56716m156m0573J04656j88451
12653A244798p0501N6103j5083k1291o9490l90219j63942K35236Q953R4588P7281
$$ plain form
12642 986433 960572 896139 1070490 1196693 1120779 906279 635359 573333 618292 716497 788116
12631 788116 715959 983749 789515 607206 586514 472766 692190 675082 1019775 1113259
12621 1113259 1253034 1324360 1188205 1245851 1151629 838883 885482 1004964 1194937 1302278
12611 1302278 1211443 1458490 1564608 1494420 1299428 973091 881450 1616127 1726339 1516248
12601 1516248 1341599 1010313 640905 452400 527565 677237 908726 981170 1239971 1168488
12591 1168488 1039227 832804 1031240 1275576 1283401 1283420 1260817 1483545 1469276 968492 800280
12580 800280 1052667 1300199 1151073 828902 991266 1149140 936146 953806 916972 774228
12570 774228 1220503 1249788 1465048 1349572 1018219 834526 1039831 1146313 1295565 1505369
$$ packed form
12642I86433k5861o4433J74351J26203p5914k14500k70920o2026M4959R8205P1619
12631G88116p2157K67790j94234j82309k0692j13748K19424j7108L44693R3484
12621A113259J39775P1326j36155N7646r4222l12746M6599J19482J89973J07341
12611A302278r0835K47047J06118p0188j94992l26337r1641P34677J10212k10091
12601A516248j74649l31286l69408j88505P5165J49672K31489P2444K58801p1483
12591A168488j29261k06423J98436K44336P825J9k2603K22728j4269n00784j68212
12580H00280K52387K47532j49126l22171J62364J57874k12994J7660l6834j42744
12570G74228M46275K9285K15260j15476l31353j83693K05305J06482J49252K09804
$$ plain form
12560 1505369 1493564 1447356 1104051 980183 1043508 747150 721451 783262 1035121 1137152
12550 1137152 1090283 1262011 1304247 1005302 998517 1107030 1529014 1339074 1426157 1211596
12540 1211596 1000181 1043293 1240098 1005463 661004 660806 1012761 1229952 1206103 1550889
12530 1550889 1705098 1579213 1365303 1139488 1263437 1360982 1383954 1185743 1183266 1255945
12520 1255945 1451318 1475005 1400161 1490624 1653742 1553605 1165824 842946 999695 1330000
12510 1330000 1760062 1846802 1833744 1823870 1702968 1689107 1335284 727678 586161 430295
12500 430295 673186 928437 1071999 1211542 1335862 1170034 1032208 1203067 1195613 1107266
12490 1107266 1296947 1448605 1637265 1536759 1078781 1206164 1529969 1430300 1447052 1511904
$$ packed form
12560A505369j1805m6208l43305j23868O3325k96358k5699O1811K51859J02031
12550A137152m6869J71728M2236k98945o785J08513M21984j89940Q7083k14561
12540A211596k11415M3112J96805k34635l44459j98L51955K17191k3849L44786
12530A550889J54209j25885k13910k25815J23949R7545K2972j98211k477P2679
12520A255945J95373K3687p4844R0463J63118j00137l87781l22878J56749L30305
12510A330000M30062Q6740j3058r874j20902j3861l53823o07606j41517j55866
12500D30295K42891K55251J43562J39543J24320j65828j37826J70859p454q8347
12490A107266J89681J51658J88660j00506m57978J27383L23805r9669J6752O4852
$$ plain form
12480 1511904 1598854 1373121 1180991 1474472 1666595 1834616 1821654 1753804 1808706 1608002
12470 1608002 1472211 1684330 2015130 1654277 1532851 1574089 1543477 1813159 1671865 2090821
12460 2090821 2324989 2256620 2303489 2209484 2075044 2083222 1836474 2287382 2421425 2129228
12450 2129228 2030680 1806682 1643319 1526306 1249904 1389544 1538421 1261117 1264099 1316343
12440 1316343 1365056 1392843 1662907 1863992 1828910 2002851 2211207 2035793 2040117 2047610 2057074
12429 2057074 2017833 2169859 1801374 1649122 1975426 2290211 2111120 1858827 1800429 1691315
12419 1691315 2110350 2472785 2277625 1816928 1816065 1841119 1911803 1854040 1720506 1786168 1955038
12408 1955038 1898609 2155013 2315480 2158115 2013040 2163280 2223009 2007617 1776070 1721165
$$ packed form
12480A511904Q6950k25733j92130K93481J92123J68021j2962o7850N4902k00704
12470A608002j35791K12119L30800l60853j21426M1238l0612K69682j41294M18956
12460B090821K34168o8369M6869r4005j34440Q178k46748M50908J34043k92197
12450B129228r8548k23998j63363j17013k76402J39640J48877k77304K982N2244
12440A316343M8713K7787K70064K01085l5082J73941K08356j75414M324P493R464
12429B057074l9241J52026l68485j52252L26304L14785j79091k52293n8398j09114
12419A691315M19035L62435j95160m60697q63K5054P0684n7763j33534O5662J68870
12408A955038n6429K56404J60467j57365j45075J50240N9729k15392k31547n4905
$$ plain form
12398 1721165 1753644 1609175 1999363 2212842 2292354 2428677 2523821 2382576 2184540 2112108
12388 2112108 1864243 1893881 1890656 2028329 2146036 2035664 2060799 2055808 2394456 2292961
12378 2292961 2397520 2572694 2366468 2526763 2378792 2303801 2214552 2381978 2445461 2377905
12368 2377905 2268285 2171357 1957171 1545797 1551476 1464247 1665589 2141181 1812060 1955852
12358 1955852 2321818 2334148 2505784 2432631 2293639 2304195 2523371 2517588 2612742 2633616 2406842
12347 2406842 2410398 2721660 2657239 2874632 3015880 2523589 2371982 2450862 2616375 2714309
12337 2714309 2643769 2343152 1977963 2462473 2945477 3018827 2756906 2490411 2344416 2382019
12327 2382019 2208512 2430318 2765451 2825311 2573805 2349387 2786325 2804380 2679607 2588740
$$ packed form
12398A721165L2479j44469L90188K13479P9512J36323R5144j41245j98036p2432
12388B112108k47865K9638l225J37673J17707j10372K5135m991L38648j01495
12378B292961J04559J75174k06226J60295j47971p4991q9249J67426O3483o7556
12368B377905j09620r6928k14186m11374N679q7229K01342M75592l29121J43792
12358A955852L65966J2330J71636p3153j38992J0556K19176n783R5154K0874k26774
12347B406842L556L11262o4421K17393J41248m92291j51607P8880J65513R7934
12337B714309p0540l00617l65189M84510M83004P3350k61921k66495j45995L7603
12327B382019j73507K21806L35133N9860k51506k24418M36938J8055j24773r0867
$$ plain form
12317 2588740 2680002 2807858 2964410 3022640 2866024 2829741 3056655 2996160 2736688 2674802
12307 2674802 2710070 3114825 3554559 3741355 3213057 2899578 2939226 2821841 3058294 3135399
12297 3135399 2945429 3039445 2971089 2925210 2960052 3291606 3650352 4017619 4196895 4559422
12287 4559422 4654290 4478804 3971079 3942289 3769960 3990373 4079592 4353061 4477692 3931545
12277 3931545 3599654 3754366 3931769 3965854 4229137 4160496 3800024 4042449 3946565 3413606
12267 3413606 3267963 3225414 3215031 3280896 3200734 3435159 3446951 3541621 3713698 3481292
12257 3481292 2958074 3230516 3636283 3985047 4196074 4228648 3971455 4003935 3939766 3777450
12247 3777450 3911033 3734433 4215932 4429020 4380569 4266363 4149333 3815326 3839600 4008861
$$ packed form
12317B588740R1262J27856J56552N8230j56616l6283K26914o0495k59472o1886
12307B674802L5268M04755M39734J86796n28298l13479L9648j17385K36453P7105
12297C135399j89970R4016o8356m5879L4842L31554L58746L67267J79276L62527
12287D559422R4868j75486n07725k8790j72329K20413Q9219K73469J24631n46147
12277C931545l31891J54712J77403L4085K63283o8641l60472K42425r5884n32959
12267C413606j45643m2549j0383O5865q0162K34425J1792R4670J72077k32406
12257C481292n23218K72442M05767L48764K11027L2574k57193L2480o4169j62316
12247C777450J33583j76600M81499K13088m8451j14206j17030l34007K4274J69261
$$ plain form
12237 4008861 3998947 4089368 4155077 4240773 4142035 4079831 4306332 4437255 4554174 4449659 4298810
12226 4298810 4301589 4348772 4416044 4516884 4553951 4180614 4038425 4101674 4456090 4141351
12216 4141351 4137102 4639226 4832018 4812903 4511039 4563598 4809684 4700855 4557320 4346067
12206 4346067 4246296 4592634 4942762 4993533 4901252 4584534 4500931 4560353 4653866 4424127
12196 4424127 4259314 4367856 4393809 4399656 4513472 4400657 4710705 5091041 5188656 5317988
12186 5317988 5613081 5594703 5188107 5306798 5417914 5289264 5318871 5450973 5303711 5262458
12176 5262458 5338414 5271589 5313807 4940369 4786122 4728923 4857592 4850906 4985318 5263676
12166 5263676 5436453 5383295 5381280 5480394 5890950 6043247 5794700 5524015 5578920 5745069
$$ packed form
12237D008861r914R0421O5709Q5696r8738o2204K26501J30923J16919j04515j50849
12226D298810K779M7183O7272J00840L7067l73337j42189O3249L54416l14739
12216D141351m249N02124J92792j9115l01864N2559K46086j08829j43535k11253
12206D346067r9771L46338L50128N0771r2281l16718q3603N9422R3513k29739
12196D424127j64813J08542K5953N847J13816j12815L10048L80336R7615J29332
12186E317988K95093j8378m06596J18691J11116j28650K9607J32102j47262m1253
12176E262458P5956o6825M2218l73438j54247n7199J28669o686J34412K78358
12166E263676J72777n3158k015R9114M10556J52297k48547k70685N4905J66149
$$ plain form
12156 5745069 5677335 5562206 5676388 5959764 5840194 5844051 6191071 6419576 6374678 6780380
12146 6780380 6896031 6566769 6173944 6368556 6766046 7231767 7238803 6984178 7054955 6916694
12136 6916694 7044252 6940488 6812469 6826292 6936916 6878253 6801860 6871962 6780818 6383602
12126 6383602 6153867 6247211 6761955 7134059 7337491 7413830 7143330 7194647 7397593 7755583
12116 7755583 7652268 7415862 7474197 7611891 7334247 7428604 7608856 8216300 8726115 8714172
12106 8714172 8668638 8969895 9107473 9105497 9256155 9017941 8865426 8786222 8812827 8910484
12096 8910484 9111255 9391355 9284860 9106657 9056000 8943803 8507589 8574767 8865460 8857218
12086 8857218 8743379 8486180 8318378 8357715 8212925 8424727 8859606 8966541 8739210 8604488
$$ packed form
12156E745069o7734j15129J14182K83376j19570L857L47020K28505m4898M05702
12146F780380J15651l29262l92825J94612L97490M65721P036k54625P0777j38261
12136F916694J27558j03764j28019J3823J10624n8663p6393P0102r1144l97216
12126F383602k29735R3344N14744L72104K03432P6339k70500N1317K02946L57990
12116G755583j03315k36406N8335J37694k77644R4357J80252O07444N09815j1943
12106H714172m5534L01257J37578j976J50658k38214j52515p9204K6605R7657
12096H910484K00771K80100j06495j78203n0657j12197m36214O7178K90693q242
12086H857218j13839k57199j67802L9337j44790K11802M34879J06935k27331j34722
$$ plain form
12076 8604488 8590786 8803948 8689999 8761851 8815321 8659964 8901745 9169393 9349060 9475031
12066 9475031 9679246 9778876 10123730 10672963 10988027 10943596 10927368 10767762 10638805 10375528
12056 10375528 10466393 10545557 10321862 10018296 10272221 10254311 10120465 10064315 10145128 10375285
12046 10375285 10089585 10019345 10049180 10323441 10593442 10559515 10776733 10750676 10694048 10953552
12036 10953552 10941680 10887577 10818685 10958271 11084064 11168452 11051711 10879151 10808225 10826764
12026 10826764 10837495 10852767 10839956 11305867 11451674 11088614 10960355 11207565 11251938 11639423
12016 11639423 11963688 12122552 11993437 11850463 11704522 11677321 11830367 11975439 11881685 12208231
12006 12208231 12264482 12304294 12217427 12418761 12571047 12050755 11801377 12043332 12279088 12386590
$$ packed form
12076H604488j3702K13162j13949P1852N3470j55357K41781K67648J79667J25971
12066I475031K04215R9630L44854N49233L15064m4431j6228j59606j28957k63277
12056A0375528R0865P9164k23695l03566K53925j7910j33846n6150Q0813K30157
12046A0375285k85700p0240K9835K74261K70001l3927K17218k6057n6628K59504
12036A0953552j1872n4103o8892J39586J25793Q4388j16741j72560p0926J8539
12026A0826764J0731J5272j2811M65911J45807l63060j28259K47210M4373L87485
12016A1639423L24265J58864j29115j42974j45941k7201J53046J45072r3754L26546
12006A2208231N6251L9812q6867K01334J52286n20292k49378K41955K35756J07502
$$ plain form
11996 12386590 12330613 12507340 12450872 12023748 11981639 11946711 12248105 12324143 12405673 12463282
11986 12463282 12501024 12599575 12874339 12798334 12416467 12130531 12281783 12559619 12637534 12762304
11976 12762304 13230469 13116970 13183347 13012006 12508211 12600632 12714464 12737854 12905404 12911505
11966 12911505 12961086 12891882 12717959 12763335 12990311 13093183 13488915 13787300 13740269 13801630
11956 13801630 13745491 13837959 13690897 13708405 13621445 13681275 13528109 13353362 13239228 13096131
11946 13096131 12835886 13029593 13103307 13227884 12990309 13057178 13197640 13459450 13576534 13691819
11936 13691819 13652535 13701259 13850384 13885467 14028645 13980901 13695560 13561559 13542871 13357679
11926 13357679 13368019 13824978 13657266 13397922 13283188 13015307 13298428 13547834 13449617 13527513
$$ packed form
11996A2386590n5977J76727n6468m27124m2109l4928L01394P6038Q1530N7609
11986A2463282L7742R8551K74764p6005l81867k85936J51252K77836P7915J24770
11976A2762304M68165j13499O6377j71341n03795R2421J13832K3390J67550O101
11966A2911505M9581o9204j73923M5376K26976J02872L95732K98385m7031O1361
11956A3801630n6139R2468j47062J7508q6960N9830j53166j74747j14134j43097
11946A3096131k60245J93707P3714J24577k37575O6869J40462K61810J17084J15285
11936A3691819l9284M8724J49125L5083J43178m7744k85341j34001j8688j85192
11926A3357679J0340M56959j67712k59344j14734k67881K83121K49406r8217P7896
$$ plain form
11916 13527513 13681241 13602357 13762300 14105590 14339572 13993123 13616473 13524339 13291674 12824943
11906 12824943 13258989 13968665 13837856 13220689 13061538 13227312 13605476 13691558 13377015
11897 13377015 13127224 12846615 12873960 12791311 12698058 13008978 13060928 13274882 13395943 13619467
11887 13619467 13493591 13627657 13592586 13292272 12997412 12654242 12741714 12977473 13046221 12908501
11877 12908501 13005507 12947153 12831791 12643695 12361014 12394397 12830100 13141312 13357482 13407069
11867 13407069 13297244 12925328 12840986 12896190 12688235 12583685 12908728 12950711 12513726 12300194
11857 12300194 12446231 12279501 12140481 12075901 12622644 12641962 12200825 11885367 11833682 11968877
11847 11968877 12030098 12123323 11798821 11654867 11823646 12015693 11976297 11831093 11901077 12015401
$$ packed form
11916A3527513J53728p8884J59943L43290K33982l46449l76650r2134k32665m66731
11906A2824943M34046P09676j30809o17167j59151J65774L78164Q6082l14543
11897A3377015k49791k80609K7345q2649r3253L10920N1950K13954J21061K23524
11887A3619467j25876J34066l5071l00314k94860l43170Q7472K35759O8748j37720
11877A2908501R7006n8354j15362j88096k82681L3383M35703L11212K16170M9587
11867A3407069j09825l71916q4342N5204k07955j04550L25043M1983m36985k13532
11857A2300194J46037j66730j39020o4580N46743J9318m41137l15458n1685J35195
11847A1968877O1221R3225l24502j43954J68779J92047l9396j45204O9984J14324
$$ plain form
11837 12015401 11862958 11531950 11468027 11149406 10992628 11196586 11375523 11390253 11215820 11096872
11827 11096872 11215919 11405541 11629129 11737735 11928238 11967186 11668400 11294559 11368430 11525648
11817 11525648 11015739 10565225 10459964 10640439 10630388 10608473 10537298 10481368 10318392 10321322
11807 10321322 10705912 10589038 10044429 9787728 10047140 10404052 10861872 11196223 11001013
11798 11001013 10769120 10710525 10655535 10287572 9990130 9821790 9989492 9846160 10074543 9851899
11788 9851899 9446113 9473242 9369200 9290964 9073628 9180523 9239372 8956341 9059475 9212081
11778 9212081 9365615 9664255 9518931 9149867 9007644 8971628 8985084 8861983 8837539 8774734
11768 8774734 8865476 8852121 8809572 8696673 8877044 8808265 8627603 8728268 8699176 8797557
$$ packed form
11837A2015401j52443l31008o3923l18621j56778K03958J78937J4730j74433j18948
11827A1096872J19047J89622K23588J08606J90503L8948k98786l73841P3871J57218
11817A1525648n09909m50514j05261J80475j0051k1915p1175n5930j62976K930
11807A0321322L84590j16874n44609k56701K59412L56912M57820L34351j95210
11798A1001013k31893n8595n4990l67963k97442j68340J67702j43332K28383k22644
11788I851899m05786K7129j04042p8236k17336J06895N8849k83031J03134J52606
11778I212081J53534K98640j45324l69064j42223l6016J3456j23101k4444o2805
11768H774734R0742j3355m2549j12899J80371o8779j80662J00665k9092R8381
$$ plain form
11758 8797557 8973189 9164041 9376633 9048261 8744472 8722623 8892134 9105298 8450166 8676387
11748 8676387 8880318 8843939 8399839 8407209 8664087 8921007 8534447 8159024 8045838 7715875
11738 7715875 7915636 7890037 7542387 7532144 7974108 8008482 8398653 8205672 7759909 7513333
11728 7513333 7249787 7441544 7383329 7300025 7320015 7503279 7732173 7424337 7209414 6962329
11718 6962329 6879036 7088121 7373116 7406767 7322878 7014207 6811782 6751099 6799650 7221958
11708 7221958 7073066 6765071 6454586 6769054 7130833 6989971 7009689 6885592 6944051 6743489
11698 6743489 6425139 6167175 5895817 5938892 6216177 6432726 6553673 6694435 6393692 6328116
11688 6328116 6057211 5833542 5703749 5722031 5723346 5436998 5219431 5260482 5483570 5576870
$$ packed form
11758H797557J75632J90852K12592l28372l03789k1849J69511K13164o55132K26221
11748H676387K03931l6379m44100P370K56878K56920l86560l75423j13186l29963
11738G715875J99761k5599l47650j0243M41964L4374L90171j92981m45763k46576
11728G513333k63546J91757n8215q3304J9990J83264K28894l07836k14923k47085
11718F962329q3293K09085K84995L3651q3889l08671k02425o0683M8551M22308
11708G221958j48892l07995l10485L14468L61779j40862J9718j24097N8459k00562
11698F743489l18350k57964k71358M3075K77285K16549J20947J40762l00743o5576
11688F328116k70905k23669j29793J8282J315k86348k17567M1051K23088R3300
$$ plain form
11678 5576870 5231597 5072793 4978617 5110840 5320911 5366090 5616727 5666202 5729513 5536649
11668 5536649 5511446 5696530 5725146 5732503 5832243 6180455 5927311 6041411 6334737 6271016
11658 6271016 6700182 7937108 8724831 9074150 9457580 9800256 9851991 9694690 9511825
11649 9511825 9665881 9012023 8483740 8180544 8161471 7954317 7784905 7119588 6618157 6181804
11639 6181804 6069910 5995955 5630943 5748871 5684171 5520780 5540872 5537280 5368163 5524627
11629 5524627 5172754 5014050 5335191 5428280 5382364 4986749 5098425 5029629 5285616 5369786
11619 5369786 5225001 4603131 4382087 4308769 4704622 5069242 5097916 4828852 4809494 4770333
11609 4770333 4378498 4172837 3996129 4140355 4499835 4468617 4592743 4548426 4685944 4561959
$$ packed form
11678E576870l45273j58804r4176J32223K10071M5179K50637M9475O3311j92864
11668E536649k5203J85084K8616P357R9740L48212k53144J14100K93326o3721
11658F271016M29166J236926P87723L49319L83430L42676N1735j57301j82865
11649I511825J54056o53858n28283l03196j9073k07154j69412o65317n01431m36353
11639F181804j11894p3955l65012J17928o4700j63391K0092l592j69117J56464
11629E524627l51873j58704L21141R3089m5916l95615J11676o8796K55987Q4170
11619E369786j44785o21870k21044p3318L95853L64620K8674k69064j9358l9161
11609D770333l91835k05661j76708J44226L59480l1218J24126m4317J37518j23985
$$ plain form
11599 4561959 4351816 4116119 3898223 3879634 3542717 3492041 3558617 3630389 3911457 4037502
11589 4037502 4242698 4329917 4275321 4185361 4433994 4298701 4332777 4315767 4263991 4151396
11579 4151396 4309644 4666092 4725136 4337073 4383732 4458157 4564561 4428159 4575061 4413821
11569 4413821 3899218 3799868 3551900 3569277 3314936 3246014 3620809 3485883 3297873 3497629
11559 3497629 3793771 3587166 3559757 3710664 3882880 3662929 3440003 3376000 3722281 3913080
11549 3913080 3466864 3316746 3210281 3266629 3450910 3743990 3314057 2767268 2591688 2652203
11539 2652203 2665686 3161288 2969131 2750904 2763079 2954232 2953224 2772037 2963630 2782070
11529 2782070 2837384 3020656 3614063 3811042 3558600 3221855 3279052 3022758 2791196 2559882
$$ packed form
11599D561959k10143k35697k17896j8589l36917n0676O6576P1772K81068J26045
11589D037502K05196Q7219n4596q9960K48633j35293L4076j7010n1776j12595
11579D151396J58248L56448N9044l88063M6659P4425J06404j36402J46902j61240
11569D413821n14603r9350k47968J7377k54341o8922L74795j34926j88010J99756
11559C497629K96142k06605k7409J50907J72216k19951k22926o4003L46281J90799
11549C913080m46216j50118j06465N6348J84281K93080m29933n46789j75580O0515
11539B652203J3483M95602j92157k18227J2175J91153j008j81187J91593j81560
11529B782070N5314J83272N93407J96979k52442l36745N7197k56294k31562k31314
$$ plain form
11519 2559882 2548871 2434345 2500085 2490961 2374953 2692083 2823337 2902816 2810737 2846756 2789947
11508 2789947 3229607 3153659 3007078 2890149 2798289 2686994 2373447 2165679 2166658 2103493
11498 2103493 2057333 2235974 2472279 2689588 2837624 2702943 2527048 2576404 2730901 3030185
11488 3030185 2955865 2686124 2331044 2305208 2447416 2433759 2374371 2430769 2285311 2270389
11478 2270389 2552653 2679583 2569147 2358824 2518886 2213181 1949336 1773377 1644224
11469 1644224 1981259 2285302 2438331 2272736 1939301 1947594 2165930 2356440 2333034 2221481
11459 2221481 2188545 2260233 2118204 1867039 1760022 1978665 2141087 2090626 1921134 1987060
11449 1987060 2256379 2306701 2573682 2409501 2051625 1966891 1858298 1756853 1610097 1868159
$$ packed form
11519B559882j1011j14526O5740r124j16008L17130J31254P9479r2079L6019n6809
11508B789947M39660p5948j46581j16929r1860j11295l13547k07768R79o3165
11498B103493m6160J78641K36305K17309J48036j34681j75895M9356J54497K99284
11488C030185p4320k69741l55080k5836J42208j3657n9388N6398j45458j4922
11478B270389K82264J26930j10436k10323J60062l05705k63845j75959j29153
11469A644224L37035L04043J53029j65595l33435Q293K18336J90510k3406j11553
11459B221481l2936P1688j42029k51165j07017K18643J62422n0461j69492O5926
11449A987060K69319N0322K66981j64181l57876q4734j08593j01445j46756K58062
$$ plain form
11439 1868159 2081739 2166278 1931692 2022409 2198985 1893948 1854083 1907074 1915115 2051137
11429 2051137 2134126 2240179 1940214 1576114 1545903 2000524 2041069 1647853 1426461 1220782
11419 1220782 1087677 1583259 2033431 2188611 2253735 2364712 2348151 2322114 2587869 2720179
11409 2720179 2540415 2291609 2213809 2384723 2728258 2443158 1864589 1728332 1492381 1203993
11399 1203993 917164 1000849 1106740 972151 1057361 1479344 1598609 1919684 1770828 1677288
11389 1677288 1865925 2425480 2531254 2196474 2133609 2031343 1865868 1639385 1449028 1502762
11379 1502762 1386566 1035693 1240116 1464020 1556830 1338146 1046040 820377 767930 1073626
11369 1073626 1263180 1481680 1359315 1022132 1114486 1182393 800249 1087596 1692136 1675800
$$ packed form
11439A868159K13580Q4539k34586R0717J76576l05037l9865N2991Q041J36022
11429B051137Q2989J06053k99965l64100l0211M54621M0545l93216k21392k05679
11419A220782j33105M95582M50172J55180O5124J10977j6561k6037K65755J32310
11409B720179j79764k48806p7800J70914L43535k85100n78569j36257k35951k88388
11399A203993k86829Q3685J05891j34589Q5210M21983J19265L21075j48856r3540
11389A677288J88637N59555J05774l34780o2865j02266j65475k26483j90357N3734
11379A502762j16196l50873K04423K23904R2810k18684k92106k25663n2447L05696
11369A073626J89554K18500j22365l37183R2354O7907l82144K87347O04540j6336
$$ plain form
11359 1675800 1561189 1426756 1436212 1207123 1336538 1522972 1500277 1563948 2104520 2108821
11349 2108821 1937234 1838984 1720587 1712481 1849090 1920799 1677296 1249572 1158921 1478901
11339 1478901 1388194 1067067 846500 753664 849363 1257658 1588658 1463574 1399973 1376098
11329 1376098 1187531 1307397 1659324 2016211 2039175 1907328 1765716 1681746 1240161 1039472
11319 1039472 917545 684710 678394 927688 1093273 620845 329825 352340 302569 765410
11309 765410 1083094 1041485 946109 999375 1057913 951060 893382 813491 1079024 1077641 1184494
11298 1184494 1478705 1635420 1672337 1227160 960584 1088857 1064870 870553 747536 654205
11288 654205 625810 620918 522733 835561 724337 978340 1372058 1558185 1493849 1321934
$$ packed form
11359A675800j14611j34433R456k29089J29415J86434k2695O3671N40572M301
11349B108821j71587r8250j18397q106J36609P1709k43503m27724r0651L19980
11339A478901r0707l21127k20567r2836R5699M08295L31000j25084o3601k3875
11329A376098j88567J19866L51927L56887K2964j31847j41612q3970m41585k00689
11319A039472j21927k32835o316K49294J65585m72428k91020K2515m9771M62841
11309G65410L17684m1609r5376N3266N8538j06853n7678p9891K65533j383J06853
11298A184494K94211J56715L6917m45177k66576J28273k3987j94317j23017r3331
11288F54205k8395m892r8185L12828j11224K54003L93718J86127o4336j71915
$$ plain form
11278 1321934 1276708 1169479 1356143 1303724 1135445 1179874 921957 855061 728118 706387
11268 706387 864985 909142 1065525 1358724 1571634 1278906 867676 565190 952410 1030553
11258 1030553 895531 1025652 1164553 943702 827079 1163691 962015 911888 468343 386422
11248 386422 457636 520837 302325 472167 521874 1128969 1136086 861244 706142 415127
11238 415127 338918 242927 335874 508054 567237 524350 617171 299039 443287 677266 733070
11227 733070 1102815 1255783 951510 625265 608450 818569 1070109 1357215 1171282 1193066
11217 1193066 1257352 1518552 1308589 1033162 1218619 1204525 952889 534152 93133 428405
11207 428405 619487 767143 1146613 1486275 1190063 806192 592479 821062 852879 610366
$$ packed form
11278A321934m5226j07229J86664n2419j68279M4429k57917o6896j26943k1731
11268G06387J58598M4157J56383K93199K12910k92728m11230l02486L87220P8143
11258A030553j35022J30121J38901k20851j16623L36612k01676n0127m43545q1921
11248C86422P1214O3201k18512J69842M9707O07095P117k74842j55102k91015
11238D15127p6209r5991R2947J72180N9183m2887R2821l18132J44248K33979N5804
11227G33070L69745J52968l04273l26245j6815K10119K51540K87106j85933K1784
11217A193066O4286K61200k09963k75427J85457j4094k51636m18737m41019L35272
11207D28405J91082J47656L79470L39662k96212l83871k13713K28583L1817k42513
$$ plain form
11197 610366 480988 310922 360668 526013 732900 589019 280281 325615 526735 690956
11187 690956 761623 652997 294196 343750 638900 474574 107419 -157315 -119903 120705
11177 120705 546045 1160060 1206514 1032567 796165 416774 516935 652641 393963 186501
11167 186501 256847 600783 948941 833674 903712 1023376 975903 1055037 857881 232758
11157 232758 8704 248475 478413 401919 750648 917377 836886 699288 670125 764434
11147 764434 859081 792879 1187752 1028610 513966 548287 363903 103654 -236315 -316551
11137 -316551 82815 -8839 -196336 22544 335296 428949 6180 189120 312909 127882
11127 127882 89567 190948 403401 638001 887185 827955 944921 855742 559800 451857
$$ packed form
11197F10366j29378j70066M9746J65345K06887j43881l08738M5334K01120J64221
11187F90956P0667j08626l58801M9554K95150j64326l67155k64734L7412K40608
11177A20705M25340O14015M6454j73947k36402l79391J00161J35706k58678k07462
11167A86501P0346L43936L48158j15267P0038J19664m7473P9134j97156o25123
11157B32758k24054K39771K29938p6494L48729J66729q0491j37598k9163R4309
11147G64434R4647o6202L94873j59142n14644L4321j84384k60249l39969q0236
11137c16551L99366r1654j87497K18880L12752R3653m22769J82940J23789j85027
11127A27882l8315J01381K12453K34600K49184n9230J16966q9179k95942j07943
$$ plain form
11117 451857 19569 18550 372983 195571 12588 -160507 -62554 -26411 66721 211996
11107 211996 534351 606363 791445 977656 835545 757157 690674 599307 543114 615928 693537
11096 693537 901477 1027289 851259 854463 251415 -402023 -378387 53549 171518 152662
11086 152662 355781 163219 -210388 -124666 371373 468625 401531 395967 468693 358121 266943
11075 266943 2552 -45001 -210966 -259345 -281963 -57849 5699 196076 314519 53752
11065 53752 -39902 100401 498332 460325 417894 275413 245945 335394 491404 799248 767248
11054 767248 710123 600120 678961 923064 1037067 1167699 1495582 1492716 1373608 1498311
11044 1498311 1735636 1786878 2006816 1910858 1868991 2006674 1938975 1785468 1921974 2032244
$$ packed form
11117D51857m32288j019L54433j77412j82983j73095R7953L6143R3132J45275
11107B11996L22355P2012J85082J86211j42111p8388o6483r1367n6193P2814P7609
11096F93537K07940J25812j76030L204o03048o53438K3636M31936J17969j8856
11086A52662K03119j92562l73607Q5722M96039R7252o7094n564P2726j10572r1178
11075B66943k64391m7553j65965m8379k2618K24114O3548J90377J18443k60767
11065E3752r3654J40303L97931l8007m2431j42481k9468Q9449J56010L07844l2000
11054G67248n7125j10003P8841K44103J14003J30632L27883k866j19108J24703
11044A498311K37325N1242K19938r5958m1867J37683o7699j53507J36506J10270
$$ plain form
11034 2032244 2353036 2504678 2443545 2314179 2227339 2387228 2133414 1940538 2353530 2162258
11024 2162258 2476484 2564967 2352728 2260270 2247620 2265297 1879762 1666298 1576880 1566803
11014 1566803 1866605 1938084 2075664 1692190 1548419 1909094 2108801 1945017 1684808 1178972
11004 1178972 1058257 1317613 1274516 1081730 793484 426026 -17020 -172919 132174 477469
10994 477469 730682 475361 178811 66572 200263 7383 322249 442241 108459 354278
10984 354278 821154 628928 566393 825427 1051287 977327 815390 741706 345720 545965
10974 545965 675403 473462 523661 671161 875053 851777 705649 317019 -51803 -43435
10964 -43435 10675 355475 509061 652924 624953 607188 744689 699372 304866 197168
$$ packed form
11034B032244L20792J51642o1133j29366q6840J59889k53814j92876M12992j91272
11024B162258L14226Q8483k12239r2458j2650J7677l85535k13464q9418j0077
11014A566803K99802P1479J37580l83474j43771L60675J99707j63784k60209n05836
11004A178972j20715K59356m3097j92786k88246l67458m43046j55899L05093L45295
10994D77469K53213k55321k96550j12239J33691j92880L14866J19992l33782K45819
10984C54278M66876j92226o2535K59034K25860p3960j61937p3684l95986K00245
10974E45965J29438k01941N0199J47500K03892k3276j46128l88630l68822Q368
10964d3435N4110L44800J53586J43863k7971j7765J37501m5317l94506j07698
$$ plain form
10954 197168 335829 86510 135530 5931 -28296 25868 446051 366282 76176 -44847
10944 -44847 189117 26705 -77718 315492 315836 289410 140388 -32857 -389495 -32411
10934 -32411 201367 -147288 -246202 -273098 -203881 -278931 -364834 -21565 228925 118784 -14132
10923 -14132 -242445 2651 178716 -70600 -85500 3910 212796 752310 644407 444775
10913 444775 141128 -376730 -323773 41899 324125 -66334 -237979 -67644 46054 86761
10903 86761 69227 334211 137531 -190251 -240576 -537178 -575614 -262535 363041 381191
10893 381191 356256 238481 -7595 -108695 -94536 -3743 -141510 -194823 -49009 -70930
10883 -70930 1305 41507 -160021 -240266 -144544 -174666 -12501 37181 -31700 -210461 80607
$$ packed form
10954A97168J38661k49319M9020j29599l4227N4164M20183p9769k90106j21023
10944d4847K33964j62412j04423L93210L44k6426j49022j73245l56638L57084
10934c2411K33778l48655r8914k6896O9217p5050q5903L43269K50490j10141j32916
10923a4132k28313K45096J76065k49316j4900Q9410K08886N39514j07903j99632
10913D44775l03647n17858N2957L65672K82226l90459j71645J70335J13698M0707
10903H6761j7534K64984j96680l27782n0325k96602l8436L13079O25576J8150
10893C81191k4935j17775k46076j01100J4159R0793j37767n3313J45814k1921
10883g0930P2235M0202k01528q0245R5722l0122J62165M9682o8881j78761K91068
$$ plain form
10872 80607 212945 -20664 190857 339830 150753 122025 79112 -166934 -438080 -591226
10862 -591226 -489753 -400819 -327705 -201057 60071 658194 788835 272787 -22198 -112844
10852 -112844 206360 556382 476650 403931 606790 487026 213011 204579 317056 -10164
10842 -10164 92374 358794 263095 159933 -134121 -237491 59656 201670 117407 352386
10832 352386 413153 194999 87967 252153 775466 1260243 1162251 1135886 637223 328239
10822 328239 397975 769191 768349 807070 741625 773612 1065219 1072883 784432 713366 662987
10811 662987 442966 596221 557648 166823 242638 468231 444288 718435 696206 358016
10801 358016 350931 201445 174970 539704 394334 111498 -55891 128973 110341 141255
$$ packed form
10872H0607J32338k33609K11521J48973j89077k8728m2913k46046k71146j53146
10862e91226J01473Q8934P3114J26648K61128N98123J30641n16048k94985r0646
10852a12844L19204L50022p9732p2719K02859j19764k74015q432J12477l27220
10842a0164J02538K66420r5699j03162k94054j03370K97147J42014q4263K34979
10832C52386O0767k18154j07032J64186N23313M84777r7992k6365m98663l08984
10822C28239O9736L71216q42L8721o5445L1987K91607P664k88451p1066n0379
10811F62987k20021J53255l8573l90825P5815K25593k3943K74147k2229l38190
10801C58016p085j49486k6475L64734j45370k82836j67389J84864j8632L0914
$$ plain form
10791 141255 347498 757894 754945 393198 124520 -196210 -468411 -415360 -559050 -425827
10781 -425827 -372625 -96581 244252 46714 -171063 -184926 -299607 74177 575644 589289
10771 589289 294363 24164 -72491 -44151 -18423 -22569 -172760 -267610 -279050 -90481 -162895
10760 -162895 -366560 -728755 -628687 -479821 -326708 -266925 -167094 -492563 -584112 -630902
10750 -630902 -528121 -405807 22359 256530 470909 415045 218679 218830 156658 31323
10740 31323 260881 521617 788896 771546 738766 1004151 1321791 1608687 1764398 1775488
10730 1775488 1874737 2155560 2567117 2830331 3116261 3803576 4352969 4686147 4956508 5097740
10720 5097740 4935495 4466366 3833621 3779748 4012300 3932063 3815571 3667559 3432660 3093463
$$ packed form
10791A41255K06243M10396k949l61747k68678l20730k72201N3051j43690J33223
10781d25827N3202K76044L40833j97538k17777j3863j14681L73784N01467J3645
10771E89289k94926k70199r6655K8340K5728m146j50191r4850j1440J88569p2414
10760a62895k03665l62195J00068J48866J53113N9783R9831l25469r1549m6790
10750f30902J02781J22314M28166K34171K14379n5864j96366J51o2172j25335
10740C1323K29558K60736K67279j7350l2780K65385L17640K86896J55711J1090
10730A775488R9249K80823M11557K63214K85930O87315N49393L33178K70361J41232
10720E097740j62245m69129o32745n3873K32552q0237j16492j48012k34899l39197
$$ plain form
10710 3093463 2634997 2059274 1508292 1187671 1390023 2078077 1973982 1679359 1225551
10701 1225551 790055 656208 559071 186015 356919 316211 320908 181264 99597 206827
10691 206827 -218689 -302105 -17116 -46168 -34381 -86204 -287229 -160548 310949 464691
10681 464691 300149 427807 802767 766501 950290 1254081 1679366 2077025 2644858 3301858
10671 3301858 3643902 4153966 4589234 4919787 5390722 5524072 5580765 5735617 5457884 5264295
10661 5264295 5444097 5410869 5268992 5180457 4997593 4413608 3777065 3397496 3366999 3286246
10651 3286246 3145908 3636586 3894351 3864693 4216318 4540273 5244987 5873528 6614719 7291341
10641 7291341 8051024 8966680 10052969 10801467 11982252 13336028 15145883 18148500 22238341
$$ packed form
10710C093463m58466n75723n50982l20621K02352O88054j04095k94623m53808
10701A225551m35496j33847r7137l73056J70904m0708M697j39644q1667J07230
10691B06827m25516q3416K84989k9052J1787n1823k01025J26681M71497J53742
10681D64691j64542J27658L74960l6266J83789L03791M25285L97659N67833O57000
10671C301858L42044N10064M35268L30553M70935J33350N6693J54852k77733j93589
10661E264295J79802l3228j41877q8535j82864n83985o36543l79569l0497q0753
10651C286246j40338M90678K57765k9658L51625L23955P04714O28541P41191O76622
10641G291341P59683R15656J086289P48498J180785J353776J809855L002617M089841
$$ plain form
10632 22238341 27744854 34569955 43471695 54373671 66968256 79849155 90812789
10625 90812789 99321484 106646497 114694733 122953061 131613448 141767469 154026144 169178628
10617 169178628 188391114 210814498 231862412 247263346 256551399 262959761 269512100
10610 269512100 277461431 286909067 297183715 308687182 323264364 342844447 365874445
10603 365874445 386110529 397172663 399149991 397165942 395612412 395503894 394950519 392748609
10595 392748609 388853932 384601913 382666516 383287406 382288471 375911684 364054074 350702686
10587 350702686 338731551 328180917 318138950 306930454 294341617 281021563 269004147
10580 269004147 259064527 249198786 237607534 224473166 211807119 199601089 188218055
$$ packed form
10632B2238341N506513O825101Q901740J0901976J2594585J2880899J0963634
10625I0812789Q508695P325013Q048236Q258328Q660387J0154021J2258675J5152484
10617A69178628J9212486K2423384K1047914J5400934R288053O408362O552339
10610B69512100P949331R447636J0274648J1503467J4577182J9580083K3029998
10603C65874445K0236084J1062134J977328j984049j553530j08518n53375k201910
10595C92748609l894677m252019j935397O20890r98935o376787j1857610j3351388
10587C50702686j1971135j0550634j0041967j1208496j2588837j3320054j2017416
10580B69004147r939620r865741j1591252j3134368j2666047j2206030j1383034
$$ plain form
10573 188218055 177161556 165779629 153208600 140293443 128149049 117160201 107533809
10566 107533809 98857289 90835756 83528471 77188644 71600107 66611066 62401484 58488579
10558 58488579 55241613 52152317 48865599 46234535 44061675 42221675 40397433 38890826
10550 38890826 37517046 35801617 34002120 32809831 31721370 30787031 29636364 28721236
10542 28721236 27776416 26570083 25304862 24535809 23608038 22785753 22064947 21750620 21163137
10533 21163137 20425698 19705266 19307733 19091020 18918721 18525399 18073809 17532091 17188113
10524 17188113 17185535 16700156 16371676 15560130 15175923 14870306 14412455 13779941 13720757 13516078
10514 13516078 13169304 12780216 12471995 12165940 11763520 11464961 11037251 10681366 10359030
$$ packed form
10573A88218055j1056499j1381927j2571029j2915157j2144394j0988848r626392
10566A07533809q676520q021533p307285o339827n588537m989041m209582l912905
10558E8488579l246966l089296l286718k631064k172860j840000j824242j506607
10550C8890826j373780j715429j799497j192289j088461r34339j150667r15128
10542B8721236r44820j206333j265221p69053r27771q22285p20806l14327n87483
10533B1163137p37439p20432l97533k16713j72299l93322m51590n41718l43978
10524A7188113k578m85379l28480q11546l84207l05617m57851o32514n9184k04679
10514A3516078l46774l89088l08221l06055m02420k98559m27710l55885l22336
$$ plain form
10505 10359030 10169368 9869197 9669976 9762736 9809855 9433081 9228194 9229625 9562504 9591529
10495 9591529 8848836 8727861 8696759 8565104 8298894 8211691 8067978 7862065 7825290 7845958
10485 7845958 7865044 7817379 7277717 7053584 6945221 6783488 6541622 6586519 6580258 6465875
10475 6465875 6290430 6382930 6579765 6695284 6126964 5982595 5884729 5458789 5152119 4916100
10465 4916100 5018743 4897809 4570944 4577163 4497402 4127294 3838365 3858850 4159415 4456742
10455 4456742 4421278 4048656 3797699 3694507 3711656 3718785 3708915 3851602 4122750 4028531 3543787
10444 3543787 3356121 3201815 2924547 2599266 2381008 2357089 2549012 2542083 2290837 1997570
10434 1997570 2137668 2536609 2601362 2403523 2446343 2372294 2787502 3202466 2700055 2111606
$$ packed form
10505A0359030j89662l00171j99221R2760M7119l76774k04887J431L32879K9025
10495I591529p42693j20975l1102j31655k66210q7203j43713k05913l6775K0668
10485G845958J9086m7665n39662k24133j08363j61733k41866M4897o261j14383
10475F465875j75445R2500J96835J15519n68320j44369r7866m25940l06670k36019
10465D916100J02643j20934l26865O219p9761l70108k88929K0485L00565K97327
10455D456742l5464l72622k50957j03192J7149P129r870J42687K71148r4219m84744
10444C543787j87666j54306k77268l25281k18258k3919J91923o929k51246k93267
10434A997570J40098L98941O4753j97839M2820p4049M15208M14964n02411n88449
$$ plain form
10424 2111606 2063677 2444849 2725806 3126512 2883412 2646311 2402850 2136304 2084373 2260417
10414 2260417 2329373 2642840 2653225 2174810 2099434 2039067 2224481 2124832 2405478 2292921
10404 2292921 1766519 1760348 1888702 2104939 2723509 2545680 1818926 1924262 2056147 1832122
10394 1832122 1766193 1755635 1644558 1738466 1853522 1623906 1476436 1488534 1351245 1568009
10384 1568009 1731324 1892335 1818934 1777333 1938152 1835968 1909585 1882310 1853100 2049987
10374 2049987 1919770 1778763 1597318 1709689 1844057 1748007 1512781 1220060 649729 504730
10364 504730 904346 1517834 1639710 1617895 1517648 1477574 1239611 1485548 1551334 1404396
10354 1404396 1262366 1022445 1213229 1759827 1606255 1286780 1268535 1159282 1591675 1515273
$$ packed form
10424B111606m7929L81172K80957M00706k43100k37101k43461k66546n1931J76044
10414B260417O8956L13467J0385m78415p5376o0367J85414r9649K80646j12557
10404B292921n26402o171J28354K16237O18570j77829p26754J05336J31885k24025
10394A832122o5929j0558j11077R3908J15056k29616j47470J2098j37289K16764
10384A568009J63315J61011p3401m1601J60819j02184P3617k7275k9210J96887
10374B049987j30217j41007j81445J12371J34368r6050k35226k92721n70331j44999
10364E04730L99616O13488J21876k1815j00247m0074k37963K45937O5786j46938
10354A404396j42030k39921J90784N46598j53572l19475j8245j09253M32393p6402
$$ plain form
10344 1515273 1478725 1324031 1323009 1203185 1308344 1253553 926697 747213 682726 667981
10334 667981 1001192 1019618 741205 673876 815968 1239273 1422460 1724987 1661154 1541367
10324 1541367 1404520 1442268 1204036 992330 720058 907317 943159 1452925 1619103 1583365
10314 1583365 1540286 1204254 1010539 868930 517039 488106 501897 349698 513324 861252
10304 861252 773946 811386 1169065 1332628 1052767 1177436 1057085 1224874 1186827 890162
10294 890162 1112051 1415887 1477972 1280451 943923 870971 957252 1059265 774136 464708
10284 464708 649183 976249 1182961 929430 520187 527069 677135 688855 1112387 1252438
10274 1252438 1336606 1302084 1286583 1326150 1333854 1187260 1087130 1094510 1063380 1244876 1160825
$$ packed form
10344A515273l6548j54694j022j19824J05159n4791l26856j79484o4487j4745
10334F67981L33211J8426k78413o7329J42092M23305J83187L02527o3833j19787
10324A541367j36847L7748k38232k11706k72272J87259L5842N09766J66178l5738
10314A583365m3079l36032j93715j41609l51891k8933J3791j52199J63626L47928
10304H61252q7306L7440L57679J63563k79861J24669j20351J67789l8047k96665
10294H90162K21889L03836O2085j97521l36528p2952Q6281J02013k85129l09428
10284D64708J84475L27066K06712k53531m09243O882J50066J1720M23532J40051
10274A252438Q4168l4522j5501L9567P704j46594j00130P380l1130J81496q4051
$$ plain form
10263 1160825 1108952 1155998 723647 695763 873999 862791 872343 1009922 1363338 1072174
10253 1072174 682727 629924 665464 1043956 947371 884618 883187 977225 1120589 1223846 1146128
10242 1146128 1078690 973792 707636 465328 540067 492371 451529 759600 1109728 1378873
10232 1378873 1175189 808367 817259 1043954 1166273 943728 925653 901843 906016 930867 778679
10221 778679 78992 109712 179384 335289 443755 635523 789198 567080 332032 -66379
10211 -66379 58575 602604 808522 915673 956804 784288 710784 601544 178331 -962
10201 -962 -109234 -48203 263122 335466 366620 369608 359056 695134 787155 834534 880399 1186295
10189 1186295 1292659 1571550 1860745 1833589 1633852 1800589 1573995 1599434 1696866 1756291
$$ packed form
10263A160825n1873M7046m32351k7884J78236j1208R552J37579L53416k91164
10253A072174l89447n2803L5540L78492r6585o2753j431R4038J43364J03257p7718
10242A146128o7438j04898k66156k42308P4739m7696m0842L08071L50128K69145
10232A378873k03684l66822Q892K26695J22319k22545j8075k3810M173K4851j52188
10221G78679o99687L0720O9672J55905J08466J91768J53675k22118k35048l98411
10211f6379J24954N44029K05918J07151M1131j72516p3504j09240m23213j79293
10201i62j08272O1031L11325P2344L1154K988j0552L36078R2021M7379M5865L05896
10189A186295J06364K78891K89195k7156j99737J66737k26594K5439R7432N9425
$$ plain form
10179 1756291 1947576 2056461 1970868 2157867 2618769 2681553 2537031 2278490 1878088 1806619
10169 1806619 1864911 2305982 2532440 2690525 2933782 2975738 2802051 2617435 2795884 2974261
10159 2974261 3097656 3011528 2859558 2948250 3033629 2782027 2508025 2504920 2887253 2968245
10149 2968245 2906908 2734829 2425534 2286647 2076932 1985307 2189072 2452432 2630859 2017441
10139 2017441 1476325 1360789 1519066 1506017 1227317 1340562 1244954 1093771 1289859 1318444
10129 1318444 898453 844268 794326 486231 625217 943899 1174968 1396293 1245966 970418
10119 970418 700122 587680 772291 1017630 697518 908002 1276708 1187942 1137093 1020349
10109 1020349 784368 392824 366156 317392 -26450 197240 443089 353049 190914 258086
$$ packed form
10179A756291J91285J08885q5593J86999M60902O2784j44522k58541m00402p1469
10169A806619N8292M41071K26458J58085K43257M1956j73687j84616J78449J78377
10159B974261J23395q6128j51970Q8692Q5379k51602k74002l105L82333Q0992
10149B968245o1337j72079l09295j38887k09715r1625K03765K63360J78427o13418
10139B017441n41116j15536J58277j3049k78700J13245r5608j51183J96088K8585
10129A318444m19991n4185m9942l08095J38986L18682K31069K21325j50327k75548
10119I70418k70296j12442J84611K45339l20112K10484L68706q8766n0849j16744
10109A020349k35981l91544k6668m8764l43842K23690K45849r0040j62135O7172
$$ plain form
10099 258086 456043 602880 647255 631544 724897 968925 1104444 742049 668988 726724
10089 726724 504872 318820 284742 505427 675953 724220 816919 773069 691636 785723 1002133
10078 1002133 1203193 1343786 1402577 1168074 740372 356745 115195 115862 98529 419008
10068 419008 906751 1010767 839057 597772 744972 977575 913814 778388 778443 989677
10058 989677 1048372 855524 1008280 776962 768401 835923 589473 574497 516845 460271 659508
10047 659508 498705 273052 -2099 82052 373037 531173 677191 676110 513271 552635
10037 552635 705208 417509 396166 920509 1028731 796733 481660 312880 278010 558292
10027 558292 614463 536677 479044 516621 600082 514799 435215 395855 163781 46120 259338
$$ packed form
10099B58086J97957J46837M4375j5711R3353K44028J35519l62395p3061N7736
10089G26724k21852j86052l4078K20685J70526M8267R2699m3850q1433R4087K16410
10078A002133K01060J40593N8791k34503m27702l83627k41550O67j7333L20479
10068D19008M87743J04016j71710k41285J47200K32603o3761j35426N5K11234
10058I89677N8695j92848J52756k31318q561O7522k46450j4976n7652n6574J99237
10047F59508j60803k25653k75151Q4151K90985J58136J46018j081j62839L9364
10037E52635J52573k87699k1343N24343J08222k31998l15073j68780l4870K80282
10027E58292N6171p7786n7633L7577Q3461q5283p9584l9360k32074j17661K13218
$$ plain form
10016 259338 406260 225028 257278 220393 86792 -20841 186470 154742 -55752 136925
10006 136925 509513 575724 231158 393970 621280 712747 515386 323960 384000 260678
9996 260678 605618 710916 765179 548174 1104 -268051 -39435 42630 199904 516922
9986 516922 558234 458591 322229 378114 509663 416240 155660 -156435 206644 185722 -28297
9975 -28297 -199642 173487 374164 478119 669138 532794 347359 397280 399830 426839 258140
9964 258140 358051 272392 28648 54054 17571 100420 105937 200132 -53246 -322604 -493797
9953 -493797 -34936 240009 275046 450987 402165 -23058 -56077 120626 340760 202778
9943 202778 191580 359517 344241 679874 785102 824613 926482 830867 966831 715579
$$ packed form
10016B59338J46922j81232L2250l6885j33601j07633K07311l1728k10494J92677
10006A36925L72588O6211l44566J62812K27310R1467j97361j91426O0040j23322
9996B60678L44940J05298N4263k17005n47070k69155K28616Q2065J57274L17018
9986E16922M1312r9643j36362N5885J31549r3423k60580l12095L63079k0922k14019
9975b8297j71345L73129K00677J03955J91019j36344j85435M9921K550K7009j68699
9964B58140R9911q5659k43744K5406l6483Q2849N517R4195k53378k69358j71193
9953d93797M58861K74945L5037J75941m8822m25223l3019J76703K20134j37982
9943B02778j1198J67937j5276L35633J05228L9511J01869r5615J35964k51252
$$ plain form
9933 715579 389439 546424 229745 315038 577306 838968 1079147 1147710 700138 861731
9923 861731 1237293 1686892 1783661 1508076 1285532 924791 1002175 1021283 530265 362991
9913 362991 545532 719105 829784 652376 487924 584758 647339 547747 641341 879442
9903 879442 853408 1021037 1044052 741580 395243 54808 152455 332171 363080 553605
9893 553605 547484 43371 350399 1096325 1095524 1162711 911131 761295 805057 1095439 822532
9882 822532 493345 471851 719141 1031865 1160374 1160504 1044073 749182 954470 843519
9872 843519 531102 536578 849081 767999 710181 889240 750419 800972 830890 518525 244967
9861 244967 431621 622976 672606 554660 602722 658925 201702 -241639 -313433 -493975
$$ packed form
9933G15579l26140J56985l16679Q5293K62268K61662K40179O8563m47572J61593
9923H61731L75562M49599R6769k75585k22544l60741P7384J9108m91018j67274
9913C62991J82541J73573J10679j77408j64452R6834O2581r9592R3594K38101
9903H79442k6034J67629K3015l02472l46337l40435R7647J79716L0909J90525
9893E53605o121n04113L07028P45926q01O7187k51580j49836M3762K90382k72907
9882H22532l29187k1494K47290L12724J28509J30j16431k94891K05288j10951
9872H43519l12417N476L12503q1082n7818J79059j38821N0553K9918l12365k73558
9861B44967J86654J91355M9630j17946M8062N6203m57223m43341p1794j80542
$$ plain form
9851 -493975 -335117 -314774 -287817 182853 429213 583988 298938 -35076 -75785 -381329
9841 -381329 -107503 194637 386317 452757 195887 252186 65754 -94154 341734 342161 -102861
9830 -102861 -309206 -122037 26034 617946 650924 382219 818007 886682 263475 304414
9820 304414 509229 465431 730949 815548 1228361 1204966 1080567 1322455 1694127 1537926
9810 1537926 1446770 1320697 1142312 1236250 1668636 1529801 1395836 1064938 932756 661477
9800 661477 673179 668231 677955 964353 893444 713968 966590 1022981 1203621 2142856 2967443
9789 2967443 3411387 3406699 3446002 3130626 2960189 2777898 3097834 2888527 2034220 1996761
9779 1996761 2257188 2459339 2190153 1692773 1630843 1526991 1476698 1366245 1092511 1123298
$$ packed form
9851d93975J58858K0343K6957M70670K46360J54775k85050l34014m0709l05544
9841c81329K73826L02140J91680O6440k56870N6299j86432j59908M35888M27m45022
9830a02861k06345J87169J48071N91912L2978k68705M35788O8675o23207M0939
9820C04414K04815m3798K65518Q4599M12813k3395j24399K41888L71672j56201
9810A537926r1156j26073j78385R3938M32386j38835j33965l30898j32182k71279
9800F61477J1702m948R724K86398p0909j79476K52622N6391J80640R39235Q24587
9789B967443M43944m688L9303l15376j70437j82291L19936k09307q54307l7459
9779A996761K60427K02151k69186m97380o1930j03852n0293j10453k73734L0787
$$ plain form
9769 1123298 1269955 1354937 1375620 1018951 674530 504214 400028 433390 392404 384683 313415
9758 313415 111468 116318 153468 167057 331424 720236 691150 763395 625354 736615 703597
9747 703597 459614 296427 133775 -175697 -275196 -27859 -106609 -35093 252140 415121
9737 415121 -33719 -226389 -150220 -76320 292435 567139 415900 91483 -307652 -666043
9727 -666043 -606709 -445789 -142974 -149790 -546588 -385051 23673 325288 507906 418810
9717 418810 492668 481839 479707 373055 414271 46952 50027 -265229 -352497 -249802 -307428
9706 -307428 -101263 514709 882065 791378 720112 391185 256894 436093 525425 482770
9696 482770 331959 391346 374875 466133 698578 934219 900980 797956 520010 266322
$$ packed form
9769A123298J46657Q4982K0683l56669l44421j70316j04186L3362m0986p721p1268
9758C13415k01947M850L7150J3589J64367L88812k9086P2245j38041J11261l3018
9747G03597k43983j63187j62652l09472r9499K47337p8750P1516K87233J62981
9737D15121m48840j92670P6169P3900L68755K74704j51239l24417l99135l58391
9727f66043N9334J60920L02815o816l96798J61537M08724L01615J82618q9096
9717D18810P3858j0829k132j06652M1216l67319L075l15256q7268J02695n7626
9706c07428K06165O15972L67356r0687p1266l28927j34291J79199Q9332m2655
9696D82770j50811N9387j6471R1258K32445K35641l3239j03024k77946k53688
$$ plain form
9686 266322 139417 189563 259619 263909 183851 197645 188678 600780 729648 997189 894376
9675 894376 668121 759732 439111 316497 129146 286687 499226 402530 267438 531795
9665 531795 784580 999121 1407317 1748227 1654639 1759804 1820169 1704129 1786570 1835335
9655 1835335 1989731 1592297 1323793 1471386 1367757 1153739 928115 745168 616096 535595
9645 535595 254607 68884 164634 602606 1160359 1220454 1196326 420770 200423 596861
9635 596861 672453 601030 722523 725408 211673 102263 407150 527193 620619 728894 817081
9624 817081 545543 189990 522028 596083 255779 -100119 52721 311465 185879 315000
9614 315000 331921 223032 54953 -47027 -437800 -476012 -545648 -505153 117986 624476
$$ packed form
9686B66322j26905N0146P0056M290q0058J3794q967M12102J28868K67541j02813
9675H94376k26255R1611l20621j22614j87351J57541K12539r6696j35092K64357
9665E31795K52785K14541M08196L40910r3588J05165O0365j16040Q2441M8765
9655A835335J54396l97434k68504J47593j03629k14018k25624j82947j29072q0501
9645E35595k80988j85723R5750M37972N57753O0095k4128p75556k20347L96438
9635E96861P5592p1423J21493K885n13735j09410L04887J20043R3426J08275Q8187
9624H17081k71538l55553L32038P4055l40304l55898J52840K58744j25586J29121
9614C15000J6921j08889j68079j01980l90773l8212o9636M0495O23139N06490
$$ plain form
9604 624476 358257 478394 733452 651590 714945 688886 382421 78239 181548 48172
9594 48172 90503 263708 634928 365388 87102 529620 1135179 1233843 1099761 1005170
9584 1005170 1089046 725085 880270 581714 90664 194308 66256 137042 106332 17490
9574 17490 27202 -333695 -192498 -88860 -63314 243532 352170 433647 554365 70890 -172070
9563 -172070 -50202 69891 259683 4562 -243263 -150255 -44740 -311945 -512401 -382479
9553 -382479 -267587 -43228 45524 -86452 122972 374492 342786 299304 -48849 -23526
9543 -23526 558552 503802 91331 -133214 80494 147783 124824 73349 -316124 -47530 334903
9532 334903 334590 24158 -2321 -99129 34468 361125 611441 480027 214831 37834 -99232
$$ packed form
9604F24476k66219J20137K55058q1862O3355k6059l06465l04182J03309j33376
9594D8172M2331J73205L71220k69540k78286M42518O05559R8664j34082r4591
9584A005170Q3876l63961J55185k98556m91050J03644j28052P0786l0710q8842
9574A7490R712l60897J41197J03638K5546L06846J08638Q1477J20718m83475k42960
9563a72070J21868J20093J89792k55121k47825R3008J05515k67205k00456J29922
9553c82479J14892K24359Q8752j31976K09424K51520l1706m3482l48153K5323
9543b3526N82078n4750m12471k24545K13708O7289k2959n1475l89473K68594L82433
9532C34903l13l10432k6479r6808J33597L26657K50316j31414k65196j76997j37066
$$ plain form
9521 -99232 -131133 -180804 -671238 -209175 44993 -24418 -57629 -47518 -65498 -107344 -59538
9510 -59538 12179 -67927 -330313 -403717 -279742 -328138 -159730 -126610 -96254 72528 61976
9499 61976 -213764 39454 119650 137612 178360 429790 305050 5055 -4767 305540 405149
9488 405149 241596 134160 33425 -102714 -183453 64040 176321 229315 152124 -88892
9478 -88892 -52835 -384108 -755531 -310210 -151000 43796 37188 81438 152755 249565 147623
9467 147623 -85291 -87959 291244 148847 274705 419092 592028 607844 58974 -377794
9457 -377794 -264108 -129811 -192363 -385376 -39867 249897 335169 505100 168062 -72841
9447 -72841 -49510 -376534 -152630 -185057 -52363 79273 88506 -329 152380 160058 -9950
$$ packed form
9521i9232l1901m9671m90434M62063K54168o9411l3211J0111j7980m1846M7806
9510e9538P1717q0106k62386p3404J23975m8396J68408L3120L0356J68782j0552
9499F1976k75740K53218Q0196J7962M0748K51430j24740k99995r822L10307R9609
9488D05149j63553j07436j00735j36139q0739K47493J12281N2994p7191k41016
9478h8892L6057l31273l71423M45321J59210J94796o608M4250P1317R6810j01942
9467A47623k32914k668L79203j42397J25858J44387J72936J5816n48870m36768
9457c77794J13686J34297o2552j93013L45509K89764Q5272J69931l37038k40903
9447g2841K3331l27024K23904l2427J32694J31636R233q8835J52709P678j70008
$$ plain form
9436 -9950 45459 115246 239564 259690 310937 305373 246145 196423 -97352 259943 370815
9425 370815 -3805 146918 58821 -224768 -490714 -409355 -211700 -476357 -379831 -100530
9415 -100530 362959 528654 570641 676328 489506 121280 -257635 -469945 -170671 116964
9405 116964 316083 178418 71875 -262692 -412378 -485489 -528231 -337955 -1879 -229056
9395 -229056 -73646 -4421 117548 151281 359848 169197 231927 413239 202318 -87280
9385 -87280 -193960 -26966 177612 549725 601985 379830 362553 151578 -201096 -305380
9375 -305380 -166256 64465 437688 604040 902041 988410 500584 543923 804863 841344
9365 841344 860139 614673 551125 376155 152285 -130796 29148 19281 -508731 -485322 -212256
$$ packed form
9436i950N5409O9787J24318K0126N1247n564n9228m9722k93775L57295J10872
9425C70815l74620J50723q8097k83589k65946Q1359J97655k64657R6526K79301
9415a00530M63489J65695M1987J05687j86822l68226l78915k12310K99274K87635
9405A16964J99119j37665j06543l34567j49686p3111m2742J90276L36076k27177
9395b29056J55410O9225J21969L3733K08567j90651O2730J81312k10921k89598
9385h7280j06680J66994K04578L72113N2260k22155j7277k10975l52674j04284
9375c05380J39124K30721L73223J66352K98001Q6369m87826M3339K60940L6481
9365H41344J8795k45466o3548j74970k23870k83081J59944r867n28012K3409K73066
$$ plain form
9354 -212256 -74332 26159 316995 439825 351374 405810 442925 657860 632787 382565
9344 382565 -66261 217613 302366 -90907 -196016 101650 355555 460959 271378 83323
9334 83323 111992 -35748 -134730 -360701 -177070 184973 326596 289135 110185 -21839
9324 -21839 420115 338134 258821 356452 395536 350164 80410 -267255 -357250 -177696 -263680
9313 -263680 -446374 -502096 -343609 -279923 -270436 -78023 -27101 -179936 -270197 -207914 -5597
9302 -5597 -108124 -756833 -567295 -162006 -15852 -295323 -809737 -859027 -786400 -254045
9292 -254045 43776 -57261 -340757 -474825 -415796 -133211 2426 -117695 -357484 -354215
9282 -354215 -107071 231527 324522 380429 188233 250285 606647 558814 316440 223938 255720
$$ packed form
9354b12256J37924J00491K90836J22830q8451N4436L7115K14935k5073k50222
9344C82565m48826K83874Q4753l93273j05109K97666K53905J05404j89581j88055
9334H3323K8669j47740r8982k25971J83631L62043J41623l7461j78950j32024
9324b1839M41954q1981p9313R7631L9084m5372k69754l47665q9995J79554q5984
9313b63680j82694n5722J58487O3686R487J92413N0922j52835r0261O2283K02317
9302e597j02527o48709J89538M05289J46154k79471n14414m9290P2627N32355
9292b54045K97821j01037k83496j34068N9029K82585J35637j20121k39789L269
9282c54215K47144L38598R2995N5907j92196O2052L56362m7833k42374r2502L1782
$$ plain form
9271 255720 249572 324023 770224 756030 382468 154804 545858 789051 701362 358350 655370
9260 655370 893463 1111011 971537 556955 211105 242866 150790 -217096 -337134 -373490
9250 -373490 -171863 -242589 -160796 263252 451918 400925 82045 208642 -92716 68338
9240 68338 297722 207190 159590 197942 85263 -118901 -30949 -338927 -642924 -464071 -18688
9229 -18688 361412 202442 290100 488110 438231 568325 351179 56714 235153 714863
9219 714863 804268 696275 336148 394379 545077 392746 841851 683489 455772 320574
9209 320574 249620 71527 -197487 -168015 -145803 -278032 -473729 -459910 -353479 -375002 177478
9198 177478 257076 240759 363777 415608 273145 71710 25795 79221 177834 465207 607382
$$ packed form
9271B55720o148P4451M46201j4194l73562k27664L91054K43193q7689l43012K97020
9260F55370K38093K17548j39474m14582l45850L1761r2076l67886j20038l6356
9250c73490K01627p0726Q1793M24048J88666n0993l18880J26597l01358J61054
9240F8338K29384r0532m7600L8352j12679k04164Q7952l07978l03997J78853M45383
9229a8688L80100j58970Q7658J98010m9879J30094k17146k94465J78439M79710
9219G14863Q9405j07993l60127N8231J50698j52331M49105j58362k27717j35198
9209C20574p0954j78093k69014K9472K2212j32229j95697J3819J06431k1523N52480
9198A77478P9598j6317J23018N1831j42463k01435m5915N3426R8613K87373J42175
$$ plain form
9187 607382 626576 93427 24602 -132780 -319289 -203467 -39082 139210 80637 -117521
9177 -117521 -15724 106119 148179 48868 -189667 -639808 -414878 -3896 302043 243324
9167 243324 192384 91203 46000 135818 141978 -78663 334973 248066 -249659 -81155 385068
9156 385068 686727 697308 327452 -178005 -205819 -67385 -154743 -94379 -102284 -253817 -197364
9145 -197364 38169 60327 -36580 266485 552429 547906 400361 276368 200680 194194 -68610
9134 -68610 -284395 -354308 -409331 -352075 -276647 -51646 218713 436277 811075 559053 271803
9123 271803 239490 37363 66312 32914 144580 370657 235509 -23079 2520 -55710 -157920
9112 -157920 -142807 -217285 -420366 -499004 -363271 -117710 28472 224885 117133 -275331
$$ packed form
9187F07382J9194n33149o8825j57382j86509J15822J64385J78292n8573j98158
9177a17521J01797J21843M2060r9311k38535m50141K24930M10982L05939n8719
9167B43324n0940j01181m5203Q9818O160k20641M13636q6907m97725J68504M66223
9156C85068L01659J0581l69856n05457k7814J38434q7358O0364p905j51533N6453
9145a97364K35533K2158r6907L03065K85944m523j47545j23993p5688o486k62804
9134f8610k15785o9913n5023N7256P5428K25001K70359K17564L74798k52022k87250
9123B71803l2313k02127K8949l3398J11666K26077j35148k58588K5599n8230j02210
9112a57920J5113p4478k03081p8638J35733K45561J46182J96413j07752l92464
$$ plain form
9102 -275331 -221361 -25383 123422 306267 249821 183853 94831 -257983 -293321 -224490 -59119
9091 -59119 -163952 -158504 -219658 -443805 -350068 -141089 -113770 -133761 -68079 -48725 10669
9080 10669 44783 35596 -470781 -852312 -610196 -632667 -526662 -226146 -273905 -437896 -588535
9069 -588535 -248805 -190298 -430378 -457488 -300309 -267160 76560 375192 124872 87786
9059 87786 47138 95179 -47176 5340 -120038 -474465 -408917 114352 -89102 -246188 -423139
9048 -423139 -348168 -515140 -164333 -273087 -328956 -338601 -601769 -572128 -550813 -624607 -532232
9037 -532232 -478742 -536935 -449515 -4045 486095 279956 -91510 -179498 55705 -50043
9027 -50043 -99921 184692 115628 -60284 -63543 25068 5783 -342623 -898057 -517729 -360118
$$ packed form
9102b75331N3970J95978J48805J82845n6446o5968q9022l52814l5338O8831J65371
9091e9119j04833N448o1154k24147R3737K08979K7319j9991O5682J9354N9394
9080A0669L4114r187n06377l81531K42116k2471J06005L00516m7759j63991j50639
9069e88535L39730N8507k40080k7110J57179L3149L43720K98632k50320l7086
9059H7786m0648M8041j42355N2516j25378l54427O5548N23269k03454j57086j76951
9048d23139P4971j66972L50807j08754n5869r645k63168K9641K1315p3794R2375
9037e32232N3490n8193Q7420M45470M90140k06139l71466q7988K35203j05748
9027e0043m9878K84613o9064j75912l259Q8611j9285l48406n55434L80328J57611
$$ plain form
9016 -360118 -77561 125397 384338 268576 -112764 -358162 -342543 -16008 172878 366630
9006 366630 351998 331026 214273 207100 142463 176383 599873 799603 266486 83126 -198173
8995 -198173 58655 119616 -82463 -108542 -147255 34104 -174054 -381323 62700 357258
8985 357258 387479 567138 354756 247610 343581 -150493 -504782 -682278 -394339 -278189
8975 -278189 -328985 -348432 -537186 -328029 -206267 311779 749057 811966 687276 383728
8965 383728 688 116864 -47407 -82121 -88321 -181412 -301065 -9442 485087 166794
8955 166794 62817 -507830 -546988 -243861 16296 -5126 -217323 -512163 -829040 -504724
8945 -504724 241238 631310 364300 404885 373381 423787 210843 -95700 -279780 -591012
$$ packed form
9016c60118K82557K02958K58941j15762l81340k45398J5619L26535J88886J93752
9006C66630j4632k0972j16753p173o4637L3920M23490J99730n33117j83360k81299
8995a98173K56828O0961k02079k6079l8713J81359k08158k07269M44023K94558
8985C57258L0221J79659k12382j07146R5971m94074l54289j77496K87939J16150
8975b78189n0796j9447j88754K09157J21762N18046M37278O2909j24690l03548
8965C83728l83040J16176j64271l4714o200r3091j19653K91623M94529l18293
8955A66794j03977n70647l9158L03127K60157k1422k12197k94840l16877L24316
8945e04724P45962L90072k67010M0585l1504N0406k12944l06543j84080l11232
$$ plain form
8935 -591012 -781857 -852851 -663387 -715565 -724151 -692570 -548920 -521238 -99689 -330084 -795782
8924 -795782 -576256 -508421 -178199 -25992 -307940 -70972 172415 205006 308943 137980
8914 137980 -48633 -49586 -35957 -173512 298557 712964 407166 560398 282426 -571117
8904 -571117 -757075 -476905 -77362 -184577 -146280 180696 -131359 -354191 -348735 -230348
8894 -230348 63856 36641 86876 599817 855686 565866 355326 404046 234715 -61885
8884 -61885 -490609 -599329 -60219 414719 294566 213862 -144265 -377650 -114370 -114872 -161985
8873 -161985 87921 11170 238284 197060 152018 480722 725847 545295 493252 641652
8863 641652 443724 341384 261523 -287541 -408154 -181108 -212646 -151041 -65649 -8192 59150
$$ packed form
8935e91012j90845p0994J89464n2178q586L1581J43650K7682M21549k30395m65698
8924g95782K19526O7835L30222J52207k81948K36968K43387L2591J03937j70963
8914A37980j86613r53J3629j37555M72069M14407l05798J53232k77972q53543
8904e71117j85958K80170L99543j07215L8297L26976l12055k22832N456J18387
8894b30348K94204k7215N0235N12941K55869k89820k10540M8720j69331k96600
8884f1885m28724j08720N39110M74938j20153q0704l58127k33385K63280n02m7113
8873a61985K49906p6751K27114m1224m5042L28704K45125j80552n2043J48400
8863F41652j97928j02340p9861n49064j20613K27046l1538O1605Q5392N7457O7342
$$ plain form
8852 59150 -88713 -413435 -327430 -232851 -132336 -131758 10044 104405 40836 173308 230109
8841 230109 189723 120746 166803 281859 145657 -101681 -498130 -474520 -167617 -250404 -518313
8830 -518313 -634691 -453607 -43430 103474 197053 -101432 -201166 -43929 73171 -110545
8820 -110545 51136 413305 375725 208090 266843 228201 -49759 -8255 612706 1005827
8810 1005827 648362 455530 257515 -102541 -202261 187152 393963 159287 78096 185795
8800 185795 166370 304411 135786 -12948 -257460 -155656 164183 -268942 -216591 -230825
8790 -230825 -9711 117209 -19351 -20936 108225 40060 203384 117758 17085 46749 197973
8779 197973 -100449 -238582 -352290 -445542 -339950 -370590 -361675 -90518 55868 -271038
$$ packed form
8852E9150j47863l24722Q6005R4579J00515N78J41802R4361o3569J32472N6801
8841B30109m0386o8977M6057J15056j36202k47338l96449K3610L06903q2787k67909
8830e18313j16378J81084M10177J46904R3579k98485r9734J57237J17100j83716
8820a10545J61681L62169l7580j67635N8753l8642k77960M1504O20961L93121
8810A005827l57465j92832j98015l60056r9720L89413K06811k34676q1191J07699
8800A85795j9425J38041j68625j48734k44512J01804L19839m33125N2351j4234
8790b30825K21114J26920j36560j585J29161o8165J63324q5626j00673K9664J51224
8779A97973k98422j38133j13708r3252J05592l0640Q915K71157J46386l26906
$$ plain form
8769 -271038 -534977 -534752 -449244 -69936 98094 -103705 -242868 -191452 -54202 174915 87062
8758 87062 225368 496646 382897 154957 -55647 -308818 -267937 61664 158365 267227
8748 267227 105976 -94588 -128895 -2120 263623 499126 255979 -179121 -222254 -359684
8738 -359684 -513681 -390273 -262313 -407835 -515975 -500880 -415596 -333462 -445762 -349371
8728 -349371 -205814 -10141 264855 358828 227414 18974 23362 46237 217402 101221
8718 101221 194464 -46289 -253965 78140 68359 -118745 -119085 -338872 -316113 -452433 -508343
8707 -508343 -375050 -3683 235610 -67182 -111936 -393954 -826028 -684424 -339779 -219222
8697 -219222 -94899 -48398 8287 -9775 99524 83280 80648 -26712 141378 13125 -234178
$$ packed form
8769b71038k63939K25Q5508L79308J68030k01799j39163N1416J37250K29117q7853
8758H7062J38306K71278j13749k27940k10604k53171M0881L29601R6701J08862
8748B67227j61251k00564l4307J26775K65743K35503k43147m35100m3133j37430
8738c59684j53997J23408J27960j45522j08140J5095Q5284Q2134j12300R6391
8728c49371J43557J95673K74996R3973j31414k08440M388K2875J71165j16181
8718A01221R3243k40753k07676L32105r781j87104l40k19787K2759j36320n5910
8707e08343J33293L71367K39293l02792m4754k82018m32074J41604L44645J20557
8697b19222J24323M6501N6685j8062J09299j6244k632j07360J68090j28253k47303
$$ plain form
8686 -234178 -107146 -3129 70696 216933 295019 659989 820908 648199 666141 716519
8676 716519 627584 378047 -26923 -122240 -28354 -253341 -580406 -637033 -761245 -496153
8666 -496153 -183975 -134207 170387 54094 -145737 -50776 92562 -229012 -431887 -155083
8656 -155083 -48880 92478 73986 -265064 -381643 -173404 -221785 -188165 -8826 116501
8646 116501 3223 51470 -182187 -82552 103742 235012 -137958 -416860 -252964 -145365
8636 -145365 -347283 -606542 -582392 -578779 -387105 -103645 135752 99541 -19238 451352
8626 451352 510337 94727 -201664 -511996 -428090 -47785 186176 97382 116696 76848 -233936
8615 -233936 -395200 -290016 -42391 -174527 -174964 61491 104235 -57434 183252 463092
$$ packed form
8686b34178J27032J04017P3825J46237P8086L64970J60919j72709J7942N0378
8676G16519q8935k49537m04970r5317R3886k24987l27065n6627j24212K65092
8666d96153L12178M9768L04594j16293j99831R4961J43338l21574k02875K76804
8656a55083J06203J41358j8492l39050j16579K08239m8381L3620J79339J25327
8646A16501j13278M8247k33657R9635J86294J31270l72970k78902J63896J07599
8636a45365k01918k59259K4150L613J91674K83460K39397l6211j18779M70590
8626D51352N8985m15610k96391l10332Q3906L80305K33961q8794J9314l9848l10784
8615b33936j61264J05184K47625j32136m37K36455M2744j61669K40686K79840
$$ plain form
8605 463092 551592 170126 -19364 -308846 -276433 -346973 -564555 -514251 -186375 53760
8595 53760 75096 -216670 -224519 20901 -54839 -399896 -719233 -436672 -191507 113203 387992
8584 387992 438618 172611 -204331 -245052 327819 593655 611355 755837 648857 402438
8574 402438 23872 141210 -100402 -168287 -240341 -3313 361472 152419 23664 -132310
8564 -132310 -194616 132736 149787 36844 106799 -222744 -401405 -401774 -104837 88213 81103
8553 81103 -49275 -572570 -413992 -127400 50713 92149 -22394 -73869 205628 475860
8543 475860 569576 447267 357260 418191 525145 912187 1269166 992989 728773 464497
8533 464497 534649 513460 190202 -92549 -186078 -115818 46251 83849 -91899 161055 589263
$$ packed form
8605D63092Q8500l81466j89490k89482L2413p0540k17582N0304L27876K40135
8595E3760K1336k91766p849K45420p5740l45057l19337K82561K45165L04710K74789
8584C87992N0626k66007l76942m0721N72871K65836J7700J44482j06980k46419
8574D02438l78566J17338k41612o7885p2054K37028L64785k09053j28755j55974
8564a32310o2306L27352J7051j12943O9955l29543j78661l69K96937J93050p110
8553H1103j30378n23295J58578K86592J78113M1436j14543n1475K79497K70232
8543D75860R3716j22309r0007O0931J06954L87042L56979k76177k64216k64276
8533D64497P0152k1189l23258k82751r3529P0260J62069L7598j75748K52954M28208
$$ plain form
8522 589263 553954 168595 212764 186598 301996 468519 403101 193183 15659 147994
8512 147994 46548 -355002 -45756 24975 -170328 93177 523509 412158 307209 541625
8502 541625 431525 362481 447318 941292 1432596 1566460 1523220 1397312 1295266 1517646
8492 1517646 1386679 1274501 1203897 929446 653604 549658 504204 217925 378687 520487
8482 520487 474735 230559 60636 100305 269112 236658 548755 233856 223817 470944
8472 470944 277037 -138397 -147289 129657 42624 232658 333447 302018 586512 570693 677994
8461 677994 824980 712901 728383 476108 471635 633092 883852 1167266 1192615 1117423 1152774
8450 1152774 1042354 973463 1010122 1092083 1419675 1374581 980125 367699 429585 791897
$$ packed form
8522E89263l5309l85359M4169k6166J15398J66523o5418k09918j77524J32335
8512A47994j01446m01550L09246P0731j95303K63505M30332j11351j04949K34416
8502E41625j10100o9044Q4837M93974M91304J33864m3240j25908j02046K22380
8492A517646j30967j12178p0604k74451k75842j03946m5454k86279J60762J41800
8482E20487m5752k44176j69923L9669J68807l2454L12097l14899j0039K47127
8472D70944j93907m15434q892K76946q7033J90034J00789l1429K84494j5819J07301
8461F77994J46986j12079J5482k52275m473J61457K50760K83414K5349p5192L5351
8450A152774j10420o8891L6659Q1961L27592m5094l94456o12426O1886L62312
$$ plain form
8440 791897 806684 761459 703589 805856 908171 595905 69649 1712 327252 496701
8430 496701 732279 813348 514333 145150 182704 271445 130609 269275 631535 642672
8420 642672 434358 357831 -190595 -592279 -500694 -360662 -641241 -699845 -683835 -609369 -542668
8409 -542668 -423709 -369595 -331766 75192 224428 -126189 -282172 -155130 -204828 -631901
8399 -631901 -652764 -416074 -194678 -70102 -317848 -242463 4374 78998 -105429 -369021
8389 -369021 -350910 -363946 -29900 517205 898839 1008044 876551 1015343 894707 611220
8379 611220 334553 103203 89801 45622 130775 249258 -140129 -47340 130734 73004 -15450
8368 -15450 41708 40749 198132 510139 441972 196635 151008 263270 168651 299782 526956
$$ packed form
8440G91897J4787m5225n7870J02267J02315l12266n26256o7937L25540J69449
8430D96701K35578Q1069k99015l69183L7554Q8741j40836J38666L62260J1137
8420F42672k08314p6527n48426m01684R1585J40032k80579n8604J6010P4466O6701
8409e42668J18959N4114L7829M06958J49236l50617j55983J27042m9698m27073
8399f31901k0863K36690K21396J24576k47746P5385K46837P4624j84427k63592
8389c69021J8111j3036L34046N47105L81634J09205j31493J38792j20636k83487
8379F11220k76667k31350j3402m4179Q5153J18483l89387R2789J78074n7730q8454
8368a5450N7158r59J57383L12007o8167k45337m5627J12262r4619J31131K27174
$$ plain form
8357 526956 959392 1116098 1226106 1464405 1804554 1939933 1731951 1657558 1248259 1011140
8347 1011140 1228180 1305960 1437745 1287122 959875 411571 287959 89033 396195 567608
8337 567608 641492 597132 398102 211543 600495 1055223 916792 860806 478536 100862
8327 100862 -118544 76434 -87231 -244409 -67168 143664 36786 -96654 90275 157016
8317 157016 111919 246284 426365 760607 867695 1593751 2320745 3081617 3489367 3498601
8307 3498601 3264058 3165400 2848394 2697813 2988039 2914692 2474182 2016118 1748474 1432142
8297 1432142 1115824 965236 930336 797349 741669 692236 676777 617160 201266 296976 576183
8286 576183 703304 652158 509966 614762 480199 214653 238012 526085 409716 309172
$$ packed form
8357E26956M32436J56706J10008K38299L40149J35379k07982p4393m09299k37119
8347A011140K17040P7780J31785j50623l27247n48304j23612j98926L07162J71413
8337E67608P3884m4360j99030j86559L88952M54728j38431n5986l82270l77674
8327A00862k19406J94978j63665j57178J77241K10832j06878j33440J86929O6741
8317A57016m5097J34365J80081L34242J07088P26056P26994P60872M07750R234
8307C498601k34543r8658l17006j50581K90226p3347m40510m58064k67644l16332
8297A432142l16318j50588l4900j32987n5680m9433j5459n9617m15894R5710K79207
8286E76183J27121n1146j42192J04796j34563k65546K3359K88073j16369j00544
$$ plain form
8276 309172 30022 -23956 34142 11283 -36217 98483 358665 416194 276116 399722 1072889
8265 1072889 1374824 1710181 1588978 1518992 1258420 1358353 1256967 1142749 1038128 1083733
8255 1083733 943074 982914 1264117 1377174 1039108 762888 667413 496351 479414 418152
8245 418152 387729 540477 393375 63062 -174057 -366453 -53845 -130800 134003 382737
8235 382737 223765 305468 536494 369077 349017 441377 433631 631472 531189 99515 -301639
8224 -301639 -298696 219471 608964 454325 144175 45506 14834 -69213 -86495 -45221 25563
8213 25563 -41886 206624 258389 -64131 -363262 -479138 -250692 12165 49476 11365 -40188
8202 -40188 169607 459961 575893 42736 -156527 -135103 -232373 -362967 -378748 -236264
$$ packed form
8276C09172k79150n3978N8098k2859m7500J34700K60182N7529j40078J23606O73167
8265A072889L01935L35357j21203o9986k60572R9933j01386j14218j04621M5605
8255A083733j40659L9840K81203J13057l38066k76220r5475j71062j6937o1262
8245D18152l0423J52748j47102l30313k37119j92396L12608p6955K64803K48734
8235C82737j58972Q1703K31026j67417k0060R2360p746J97841j00283m31674m01154
8224c01639K943N18167L89493j54639l10150r8669l0672q4047j7282M1274P0784
8213B5563o7449K48510N1765l22520k99131j15876K28446K62857L7311l8111n1553
8202d0188K09795K90354J15932n33157j99263K1424r7270j30594j5781J42484
$$ plain form
8192 -236264 -195326 -446739 -164923 -167263 -518039 -573573 -697609 -738403 -653544 -659977 -511393
8181 -511393 -22290 425465 447952 -191705 -632728 -652135 -719866 -655933 -349292 -33878
8171 -33878 181331 -21697 -249071 -249284 -81127 -249714 -403498 -457691 -405099 -370903 -285589
8160 -285589 -104322 11337 -143393 -237358 -149167 -225345 -67441 -206894 -510928 -427237
8150 -427237 -233774 16790 -211173 -414249 -310200 -61835 -77654 64031 142602 -14916
8140 -14916 3436 142088 42944 156365 187941 -89521 204775 586316 701273 370173
8130 370173 -38216 -157231 83001 -158758 -336360 -228166 -430795 -509485 -475324 -224951
8120 -224951 35624 219342 -15793 55656 59806 -49566 -96490 174566 527509 509360 218531
$$ packed form
8192b36264M0938k51413K81816k340l50776n5534j24036m0794Q4859o433J48584
8181e11393M89103M47755K2487o39657m41023j9407o7731O3933L06641L15414
8171c3878K15209k03028k27374k13J68157j68587j53784n4193N2592L4196Q5314
8160b85589J81267J15659j54730r3965Q8191p6178J57904j39453l04034Q3691
8150d27237J93463K50564k27963k03076J04049K48365j5819J41685P8571j57518
8140a4916J8352J38652r9144J13421L1576k77462K94296L81541J14957l31100
8130C70173m08389j19015K40232k41759j77602J08194k02629p8690L4161K50373
8120b24951K60575J83718k35135P1449M150j09372m6924K71056L52943j8149k90829
$$ plain form
8109 218531 -7681 173233 504941 111856 -240572 -358242 -319690 -191156 -292556 -462867
8099 -462867 -487787 -654437 -615844 -579026 -106961 195910 345094 45445 -177614 403533
8089 403533 736491 690240 567808 514381 618811 657213 303463 350673 280367 108189 -199520
8078 -199520 -261659 -109843 -460686 -868075 -645207 15328 -1925 -75855 10452 87412 45186
8067 45186 70955 318203 277548 229930 42417 -48396 192683 107275 -257578 -191476 193586
8056 193586 274384 42612 -45221 164883 265086 150070 105051 31881 -61651 22816 -232455
8045 -232455 -430022 -324162 10359 -151996 -338832 220781 152390 166233 81329 -66925
8035 -66925 -89395 43839 -179127 -522437 -518480 -497837 -711185 -514502 -418186 -147053 335662
$$ packed form
8109B18531k26212J80914L31708l93085l52428j17670L8552J28534j01400j70311
8099d62867k4920j66650L8593L6818M72065L02871J49184k99649k23059N81147
8089D03533L32958m6251j22432n3427J04430L8402l53750M7210p0306j72178l07709
8078a99520o2139J51816l50843m07389K22868O60535j7253p3930Q6307P6960m2226
8067D5186K5769K47248m0655m7618j87513r0813K41079q5408l64853O6102L85062
8056A93586Q0798k31772q7833K10104J00203j15016m5019p3170r3532Q4467k55271
8045b32455j97567J05860L34521j62355j86836N59613o8391J3843q4904j48254
8035f6925k2470J33234k22966l43310L957K0643k13348J96683R6316K71133M82715
$$ plain form
8024 335662 152379 292818 514688 400361 435480 278882 372271 537627 415035 330751
8014 330751 -280454 -424837 -115757 -15633 -212483 -348406 -447245 -70803 -56377 -431015
8004 -431015 -483685 -138728 122467 219001 -38567 -68417 -238877 -288049 -560172 -161445
7994 -161445 -44683 126862 -3437 -351800 -484580 -300531 -225072 -221105 -305881 -313175 -263865
7983 -263865 -14961 -87333 -66567 -19294 -110435 -88902 -419651 -529112 -283716 -88395 -187199
7972 -187199 -423029 -736584 -845349 -1032566 -821908 -605336 -501194 -446742 -420899 -490927
7962 -490927 -271512 -74952 288195 210368 138894 332066 559065 487124 108308 -99516
7952 -99516 89499 -65537 -353438 -434330 -253918 -51488 76598 -37796 -299150 -269376
$$ packed form
8024C35662j83283J40439K21870j14327L5119j56598R3389J65356j22592q4284
8014C30751o11205j44383L09080J00124j96850j35923r8839L76442J4426l74638
8004d31015n2670L44957K61195R6534k57568k9850j70460m9172k72123L98727
7994a61445J16762J71545j30299l48363j32780J84049P5459L967q4776p294M9310
7983b63865K48904p2372K0766M7273r1141K1533l30749j09461K45396J95321r8804
7972a87199k35830l13555j08765j87217K10658K16572J04142N4452K5843p0028
7962d90927K19415J96560L63147p7827p1474J93172K26999p1941l78816k07824
7952i9516J89015j55036k87901q0892J80412K02430J28086j14394k61354K9774
$$ plain form
7942 -269376 -170030 145831 151652 148546 9961 -229758 -108905 327943 384826 143666 -422304
7931 -422304 -97548 213908 147297 -247479 -324359 -542367 -280899 -132105 25973 191176
7921 191176 218472 29599 5836 -179368 -175479 -293082 -177111 3911 21078 -336205 -207741
7910 -207741 134095 346855 205538 -131112 -360650 -506834 -325004 -83205 -194927 -293701
7900 -293701 -209855 233653 56924 265255 625811 233312 -70779 -31065 -170488 -120036
7890 -120036 99427 235615 -129122 -74120 -172242 -195745 -45106 544296 424820 -160620
7880 -160620 -175868 -153589 81818 155139 92181 -119616 -589552 -556312 -385166 -516317 -647704
7869 -647704 -641117 -799769 -929369 -538868 -92226 344641 489229 336413 136897 77579
$$ packed form
7942b69376R9346L15861N821l106j38585k39719J20853M36848N6883k41160n65970
7931d22304L24756L11456o6611l94776p6880k18008K61468J48794J58078J65203
7921A91176K7296j88873k3763j85204L889j17603J15971J81022J7167l57283J28464
7910b07741L41836K12760j41317l36650k29538j46184J81830K41799j11722r8774
7900b93701Q3846M43508j76729K08331L60556l92499l04091L9714j39423N0452
7890a20036K19463J36188l64737N5002r8122k3503J50639N89402j19476n85440
7880a60620j5248K2279K35407P3321o2958k11797m69936L3240J71146j31151j31387
7869f47704O587j58652j29600L90501M46642M36867J44588j52816j99516n9318
$$ plain form
7859 77579 426532 179931 -20060 344241 575828 450087 402185 174950 364429 169326
7849 169326 -239489 -419891 -759018 -634281 -612961 -38770 7680 103491 -112939 -231790
7839 -231790 6237 49551 74153 -72459 -76626 -172036 -278806 -419135 4744 132146 36686
7828 36686 199952 448305 256885 -36275 -85625 -263520 -274001 -139274 -143200 -409633 -70718
7817 -70718 345481 144491 -239681 -297827 -109540 -43533 -6695 93582 269338 257947 176643
7806 176643 536350 324717 260865 77890 -44564 -77427 -261232 -449672 -457257 -311504
7796 -311504 -60734 -107108 -167936 -195054 -89860 87819 435329 447510 394174 161861 50101
7785 50101 -326167 -441106 -189942 -425 111360 147521 211071 539495 628068 -88203
$$ packed form
7859G7579L48953k46601j99991L64301K31587j25741m7902k27235J89479j95103
7849A69326m08815j80402l39127J24737K1320N74191M6450R5811k16430j18851
7839b31790K38027M3314K4602j46612m167r5410j06770j40329M23879J27402r5460
7828C6686J63266K48353j91420k93160m9350j77895j0481J34727l926k66433L38915
7817g0718M16199k00990l84172n8146J88287O6007L6838J00277J75756j1391q1304
7806A76643L59707k11633o3852j82975j22454l2863j83805j88440p585J45753
7796c11504K50770m6374o0828k7118J05194J77679L47510J2181n3336k32313j11760
7785E0101l76268j14939K51164J89517J11785L6161O3550L28424Q8573p16271
$$ plain form
7775 -88203 -213149 -287885 -554486 -573662 -160293 -150967 -315682 -113495 2840 -215276 -196515
7764 -196515 16378 233783 272091 -119205 -186319 -395708 -348013 51216 -358169 -531072
7754 -531072 -457230 -313690 -212475 -104940 -232106 -487718 -505725 -381263 -573302 -523571
7744 -523571 -331027 -114042 125881 144023 517518 466472 240266 386189 418313 122413
7734 122413 117444 252610 413617 273930 36109 92221 294846 239937 305404 203818 -176312
7723 -176312 -502933 -268597 -157364 113265 498328 328800 250605 -66488 -187770 -344716
7713 -344716 -474006 -655998 -454908 -91859 -111488 -421230 -217893 -114892 -333978 -552213
7703 -552213 66235 112031 -164625 -163822 -158694 -431292 -207199 -287068 -471366 -605141 -93054
$$ packed form
7775h8203j24946p4736k66601j9176M13369R326j64715K02187J16335k18116J8761
7764a96515K12893K17405L8308l91296o7114k09389M7695L99229m09385j72903
7754e31072P3842J43540J01215J07535j27166k55612j8007J24462j92039M9731
7744e23571J92544K16985K39923J8142L73495n1046k26206J45923L2124k95900
7734A22413m969J35166J61007j39687k37821N6112K02625n4909O5467j01586l80130
7723a76312l26621K34336J11233K70629L85063j69528p8195l17093j21282j56946
7713c44716j29290j81992K01090L63049j9629l09742K03337J03001k19086k18235
7703e52213O18448M5796k76656Q03N128k72598K24093p9869j84298j33775N12087
$$ plain form
7692 -93054 164562 242591 152916 135869 42489 -292343 -790115 -906581 -847761 -755148 -667414
7681 -667414 -633510 -553673 -483920 -435683 -183935 -320693 -78511 -75541 -136095 -243570 137543
7670 137543 269550 165271 -64148 119114 162937 -192506 -335824 -182128 -47502 -183050
7660 -183050 -95669 17570 -401682 -690422 -623270 -724005 -746339 -632897 -805009 -768540
7650 -768540 -632767 -631250 -770169 -587365 -270520 -112724 -276045 -284834 -115982 -192331 151080
7639 151080 161658 109320 -53453 -610872 -608021 -141521 200354 -32431 -291926 -825758
7629 -825758 -991759 -917078 -106269 263898 -16509 -2257 -2918 -368089 -236785 -257167 -235008
7618 -235008 -311923 -686968 -845586 -493606 -466637 -850569 -917912 -684805 -328646 -426308
$$ packed form
7692i3054K57616P8029q9675j7047r3380l34832m97772j16466N8820R2613Q7734
7681f67414L3904P9837O9753M8237K51748j36758K42182K970o0554j07475L81113
7670A37543J32007j04279k29419J83262M3823l55443j43318J53696J34626j35548
7660a83050Q7381J13239m19252k88740O7152j00735k2334J13442j72112L6469
7650g68540J35773J517j38919J82804L16845J57796j63321q789J68852p6349L43411
7639A51080J0578n2338j62773n57419K851M66500L41875k32785k59495n33832
7629h25758j66001P4681Q10809L70167k80407J4252o61l65171J31304k0382K2159
7618b35008p6915l75045j58618L51980K6969l83932o7343K33107L56159r7662
$$ plain form
7608 -426308 -618791 -473146 -412546 -253687 -125687 200387 357870 81240 -80567 -237531
7598 -237531 -238439 -192221 -120491 -61792 -349923 -236996 -425554 -811437 -877442 -585744 -249173
7587 -249173 -352552 -254036 -205357 -50292 118084 -224498 -298489 -93957 203279 502162
7577 502162 537731 71496 75298 16794 -169279 -251748 -328799 -267600 -263202 -59872 -12692
7566 -12692 66080 213994 157175 63036 270939 599059 208473 -192393 -377690 -74338
7556 -74338 141271 168443 66877 134855 490310 637654 787582 693627 785632 520057 265460
7545 265460 442049 415283 224367 201445 476779 495576 272570 62649 348315 612382
7535 612382 528232 889095 551993 -5989 123845 272534 74986 -42995 62362 100609
$$ packed form
7608d26308j92483J45645O0600J58859J28000L26074J57483k76630j61807j56964
7598b37531r08M6218P1730N8699k88131J12927j88558l85883o6005K91698L36571
7587b49173j03379R8516M8679J55065J68376l42582p3991K04532K97236K98883
7577E02162L5569m66235L802n8504j86073q2469p7051O1199M398K03330M7180
7566a2692P8772J47914n6819r4139K07903L28120l90586m00866j85297L03352
7556g4338K15609K7172j01566O7978L55455J47344J49928r3955R2005k65575k54597
7545B65460J76589k6766j90916k2922K75334J8797k23006k09921K85666K64067
7535F12382q4150L60863l37102n57982J29834J48689j97548j17981J05357L8247
$$ plain form
7525 100609 -82956 -258942 -524556 -327368 -288641 -76750 152860 55214 44657 -170840
7515 -170840 -196881 -425674 -632884 -624103 -322144 -275688 -240849 -36631 -134853 -482931 -598397
7504 -598397 -514274 -562316 -267609 -470 -247336 -339624 -548952 -438295 -6717 175554
7494 175554 -422809 -775165 -802495 -846355 -819257 -412105 7001 246264 249929 431073 366115
7483 366115 238670 176224 5075 -384510 -359988 -607115 -741600 -611271 -369665 -173853
7473 -173853 113293 176974 86047 356004 570003 532580 604703 447604 209123 38320
7463 38320 -89107 -420723 -559324 -351531 165496 558547 552253 355019 -153015 -82995
7453 -82995 -31107 -404472 -391760 -61908 34842 -210795 -488738 -502790 -757291 -270922 -30990
$$ packed form
7525A00609j83565j75986k65614J97188L8727K11891K29610r7646j0557k15497
7515a70840k6041k28793k07210Q781L01959M6456L4839K04218r8222l48078j15466
7504e98397Q4123m8042K94707K67139k46866r2288k09328J10657M31578J82271
7494A75554n98363l52356k7330m3860K7098M07152M19106K39263L665J81144o4958
7483C66115j27445o2446j71149l89585K4522k47127j34485J30329K41606J95812
7473a73853K87146O3681r0927K69957K13999l7423P2123j57099k38481j70803
7463C8320j27427l31616j38601K07793N17027L93051o294j97234n08034P0020
7453h2995N1888l73365J2712L29852R6750k45637k77943j4052k54501M86369K39932
$$ plain form
7442 -30990 -246607 -293481 51765 327532 255110 306027 302463 154450 -212823 -433998 -414691
7431 -414691 -343794 -103591 -327996 -398705 -2429 22329 -129397 -56401 29261 -101677 -332198
7420 -332198 -380038 -260647 -144490 25318 85602 -195079 -244632 -452708 -466475 -387527 -505768
7409 -505768 -206326 -227224 -96513 -485372 -417631 -114427 -30863 -276258 -682657 -483604
7399 -483604 -423267 -248504 -48746 345977 -38121 -163108 -532377 -329054 -6268 227764
7389 227764 193352 -221313 -418355 -467159 -542773 -636494 -567317 -92475 120781 -99456 -332137
7378 -332137 -373910 -237592 -398297 -209969 -87737 -59960 -225763 30214 165703 148350
7368 148350 -35355 -208887 -404841 -590134 -453677 -184563 -185432 -359754 -163380 134939
$$ packed form
7442c0990k15617m6874L45246K75767p2422N0917l564j48013l67273k21175J9307
7431d14691P0897K40203k24405p0709L96276K4758j51726P2996Q5662j30938k30521
7420c32198m7840J19391J16157J69808O0284k80681m9553k08076j3767P8948j18241
7409e05768K99442k0898J30711l88859O7741L03204Q3564k45395m06399J99053
7399d83604O0337J74763J99758L94723l84098j24987l69269K03323L22786K34032
7389B27764l4412m14665j97042m8804p5614r3721O9177M74842K13256k20237k32681
7378c32137m1773J36318j60705J88328J22232K7777j65803K55977J35489j7353
7368A48350j83705j73532j95954j85293J36457K69114q69j74322J96374K98319
$$ plain form
7358 134939 193286 310965 243585 303706 357886 367726 155446 -36966 -180888 -45020 -129429
7347 -129429 -319204 -77832 24181 -103346 143667 854618 822413 341378 218223 180598
7337 180598 65641 34635 -22253 -199040 -403658 -25467 21985 10311 93292 249459 232882
7326 232882 3241 -153273 10671 -63749 -192711 -253184 -60066 150027 -81454 -495711
7316 -495711 -287664 -40053 -343654 -12084 38202 -90971 -110723 131662 166431 -243356
7306 -243356 -43210 34988 -107994 -585965 -592077 41617 617113 518996 538797 675673 762967
7295 762967 807517 619426 458775 102615 55993 158694 115904 52064 21968 -252167 -637490
7284 -637490 -601664 -646187 -603495 -939969 -1251155 -981667 -881279 -955607 -770145 -607953
$$ packed form
7358A34939N8347J17679o7380O0121N4180R840k12280j92412j43922J35868q4409
7347a29429j89775K41372J02013j27527K47013P10951l2205m81035j23155l7625
7337A80598j14957l1006n6888j76787k04618L78191M7452j1674Q2981J56167j6577
7326B32882k29641j56514J63944p4420j28962o0473J93118K10093k31481m14257
7316d95711K08047K47611l03601L31570N0286j29173j9752K42385L4769m09787
7306b43356K00146P8198j42982m77971o112O33694N75496r8117J9801J36876Q7294
7295G62967M4550j88091j60651l56160m6622J02701m2790o3840l0096k74135l85323
7284f37490L5826m4523M2692l36474l11186K69488J00388p4328J85462J62192
$$ plain form
7274 -607953 -293912 -35363 -96268 -367552 -244158 60422 194335 39788 -364284 -329635
7264 -329635 -195667 -370931 -555948 -417465 -557374 -639672 -460345 -557281 -471702 -108655
7254 -108655 144404 68024 181955 59814 122830 263848 219547 216329 190642 131825 192045
7243 192045 192 -135213 -340420 -699515 -360810 60500 233277 -248811 -240325 -68837
7233 -68837 220887 -99900 -469983 -534408 -302590 -310667 -309441 -197061 -218939 -298074 -204118
7222 -204118 14936 191120 504390 -58323 -319595 -372445 -363137 -104510 -85314 -407209
7212 -407209 -473211 -393395 -158195 -132999 -160646 -266592 39440 -3854 80098 -1760 -244497
7201 -244497 -510723 -567626 -184599 -190502 -111651 -204205 -101096 -11953 393713 765484 311425
$$ packed form
7274f07953L14041K58549o0905k71284J23394L04580J33913j54547m04072L4649
7264c29635J33968j75264j85017J38483j39909q2298J79327r6936Q5579L63047
7254a08655K53059p6380J13931j22141O3016J41018m4301l218k5687n8817O0220
7243A92045j91853j35405k05207l59095L38705M21310J72777m82088Q486J71488
7233f8837K89724l20787l70083o4425K31818q077J226J12380k1878p9135R3956
7222b04118K19054J76184L13270n62713k61272n2850R308K58627J9196l21895
7212d07209o6002P9816K35200K5196k7647j05946L06032m3294Q3952q1858k42737
7201b44497k66226n6903L83027n903P8851r2554J03109Q9143M05666L71771m54059
$$ plain form
7190 311425 -115187 -445992 -244161 34709 130269 -66356 -150878 144973 -36256 -455771
7180 -455771 -392490 -278007 -312169 -441205 -101188 126649 -81350 -321241 -97252 54258
7170 54258 -151385 -424209 -925075 -742574 -246452 -227824 -66536 16174 86289 56596 -257288
7159 -257288 -226109 -212513 -447388 -602943 -433459 -186681 191273 -26398 897 32085
7149 32085 -181235 -507916 -299283 -568617 -442802 -190427 222629 762979 720497 288636
7139 288636 -66747 -180648 -254396 -164432 147194 74334 150254 377439 606506 385766
7129 385766 313757 147818 -43637 38194 332780 241126 -155728 -534327 -657891 -644292
7119 -644292 -755111 -765144 -501291 -21584 260829 100437 -32668 -3936 -235071 -271355
$$ packed form
7190C11425m26612l30805K01831K78870R5560j96625q4522K95851j81229m19515
7180d55771O3281J14483l4162j29036L40017K27837k07999k39891K23989J51510
7170E4258k05643k72824n00866J82501M96122J8628J61288Q2710P0115k9693l13884
7159b57288L1179J3596k34875j55555J69484K46778L77954k17671K7295L1188
7149C2085k13320l26681K08633k69334J25815K52375M13056N40350m2482m31861
7139B88636l55383j13901p3748Q9964L11626p2860P5920K27185K29067k20740
7129C85766p2009j65939j91455Q1831K94586r1654l96854l78599j23564J3599
7119f44292j10819j0033K63853M79707K82413j60392j33105K8732k31135l6284
$$ plain form
7109 -271355 -166247 13962 346910 240227 346712 89846 -406657 -414739 -276405 -200896
7099 -200896 -60692 46564 140804 -427064 -381999 -427011 -482800 -259538 -140286 -205761 6105
7088 6105 423769 155352 15768 -18083 -330112 -518596 -383397 -179164 -52340 -154583
7078 -154583 -228880 -77055 -158329 -328919 -360069 -371520 -618208 -489242 -160418 -71293 -59254
7067 -59254 177734 141248 299789 199324 11915 50529 215124 -121569 -592480 -838737
7057 -838737 -490173 -366519 -292781 -279394 -509757 -693208 -587984 -181827 226383 156541
7047 156541 -36111 14429 222344 120109 119267 -124863 19407 -25585 -150782 -120576 -336036
7036 -336036 -121043 -215877 -259719 91709 209315 380167 -98565 -656038 -867478 -989931
$$ packed form
7109b71355J05108J80209L32948j06683J06485k56866m96503q082J38334P5509
7099b00896J40204J07256R4240n67868M5065m5012n5789K23262J19252o5475K11866
7088F105M17664k68417j39584l3851l12029j88484J35199K04233J26824j02243
7078a54583p4297J51825q1274j70590l1150j1451k46688J28966L28824Q9125J2039
7067e9254K36988l6486J58541j00465j87409L8614J64595l36693m70911k46257
7057h38737L48564J23654P3738J3387k30363j83451J05224M06157M08210o9842
7047A56541j92652N0540K07915j02235q42k44130J44270m4992j25197L0206k15460
7036c36036K14993r4834m3842L51428J17606J70852m78732n57473k11440j22453
$$ plain form
7026 -989931 -836845 -859472 -511884 -263332 -258745 -287587 -159006 190478 470274 492543 166754
7015 166754 213345 557056 563866 134584 -236548 -85142 72852 -7147 -51448 -331494 -272208
7004 -272208 -334988 -179413 -25970 160652 -22883 -95072 -258582 -365871 -198297 108991
6994 108991 86198 -168921 -124685 85221 -129733 -223040 78283 -215255 -113680 -171376
6984 -171376 -414000 -822435 -626942 -95035 103637 20743 -480062 -649193 -282489 -145678
6974 -145678 294916 236209 310295 149711 -110722 300285 300372 122644 46350 315158 459958
6963 459958 447854 387546 422254 541019 554905 483335 287981 -58874 -272893 -474446 -232677
6952 -232677 -27992 115472 196089 371341 364595 -5131 -87291 139753 555736 280892
$$ packed form
7026i89931J53086k2627L47588K48552M587k8842J28581L49484K79796K2269l25789
7015A66754M6591L43711O810m29282l71132J51406J57994p9999m4301k80046N9286
7004b72208o2780J55575J53443J86622j83535p2189j63510j07289J67574L07288
6994A08991k2793k55119M4236K09906k14954r3307L01323k93538J01575n7696
6984a71376k42624m08435J95493N31907J98672q2894n00805j69131L66704J36811
6974a45678M40594n8707P4086j60584k60433M11007Q7j77728p6294K68808J44800
6963D59958j2104o0308L4708J18765J3886p1570j95354l46855k14019k01553K41769
6952b32677K04685J43464Q0617J75252o746l69726q2160K27044M15983k74844
$$ plain form
6942 280892 -122361 -150273 217795 277905 -54997 -247085 -190011 -304196 -190945 -152329
6932 -152329 -73429 -152295 -81342 222739 194687 228196 342351 401790 396602 289637 96270
6921 96270 -230941 -183928 -56465 -185660 -175402 -193660 -350202 -107434 -227391 -156855 -72984
6910 -72984 -28635 -134817 -329656 -394902 -265559 -283852 -138416 39343 -5006 -140910 -258536
6899 -258536 -307175 -46995 294385 395468 55393 -262196 -392932 -292774 -45655 183028
6889 183028 2021 -328799 -812418 -871945 -586576 -73578 -7483 -202292 -444674 -170508
6879 -170508 74182 -124275 -363957 -300764 280275 742820 506200 312563 108876 -244387
6869 -244387 -416671 -366332 -360675 -466481 -345541 -94499 -270535 -415164 -541131 -497023
$$ packed form
6942B80892m03253k7912L68068O0110l32902j92088N7074j14185J13251L8616
6932a52329P8900p8866P0953L04081k8052L3509J14155N9439n188j06965j93367
6921I6270l27211M7013J27463j29195J0258j8258j56542K42768j19957P0536Q3871
6910g2984M4349j06182j94839o5246J29343j8293J45436J77759m4349j35904j17626
6899b58536m8639K60180L41380J01083l40075l17589j30736J00158K47119K28683
6889A83028j81007l30820m83619n9527K85369N12998O6095j94809k42382K74166
6879a70508K44690j98457k39682O3193N81039M62545k36620j93637k03687l53263
6869b44387j72284N0339N657j05806J20940K51042j76036j44629j25967M4108
$$ plain form
6859 -497023 -62049 126113 106980 128931 310519 320566 77466 -8435 -180629 -174700 -86067
6848 -86067 141916 252980 84480 -23728 -107628 -3274 178042 760794 852874 684606
6838 684606 278394 194951 184938 -20625 -187186 -249736 -116071 -35026 39241 -241625 -557482
6827 -557482 -401018 -68457 -91396 -146805 -469713 -386917 -383504 -294101 130061 534830 575091
6816 575091 568577 545448 174535 -54965 497 -389063 -491639 -359333 -163108 -343191
6806 -343191 -157840 -27831 200115 181748 147022 232820 216884 -10231 150128 49461
6796 49461 -454873 -297220 -250829 -133745 -22322 -48418 -2201 114655 107025 49588 14968
6785 14968 -83476 -43136 -66023 -40673 101284 164662 336496 200041 -201270 -344643 189838
$$ packed form
6859d97023M34974J88162j9133K1951J81588J0047k43100q5901j72194N929Q8633
6848h6067K27983J11064j68500j08208q3900J04354J81316N82752R2080j68268
6838F84606m06212q3443j0013k05563j66561o2550J33665Q1045P4267k80866l15857
6827e57482J56464L32561k2939n5409l22908Q2796L413Q9403M24162M04769M0261
6816E75091o514k3129l70913k29500N5462l89560j02576J32306J96225j80083
6806c43191J85351J30009K27946j8367l4726Q5798j5936k27115J60359j00667
6796D9461n04334J57653M6391J17084J11423k6096M6217J16856p630n7437l4620
6785A4968r8444M0340k2887K5350J41957O3378J71834j36455m01311j43373N34481
$$ plain form
6774 189838 347653 -74960 -265744 -459330 -463962 -559694 -19068 408117 387538 -64725
6764 -64725 -531943 -588941 -546713 -711589 -708930 -727664 -661373 -462912 -258207 -374811 -346734
6753 -346734 -315367 -297365 -257776 -224064 -433213 -526687 -336915 -512466 -720794 -399130 179788
6742 179788 277943 92251 -284776 -268955 -216089 -119717 -40962 -60039 -190760 -438662 -757094
6731 -757094 -478063 -144286 -280778 -327034 -158046 152151 299192 150201 -243222 -55016
6721 -55016 -55160 121677 338154 271325 190711 227882 -102972 -615341 -606481 -343111 -216672
6710 -216672 -352847 -397806 -297951 -161242 -3965 233016 260819 110544 116429 13096 -252746
6699 -252746 -301590 -585499 -575296 -377087 -63133 37626 2590 -403210 -600524 -230310
$$ packed form
6774A89838J57815m22613j90784j93586m632r5732N40626M27185k0579m52263
6764f4725m67218n6998M2228j64876K659j8734O6291J98461K04705j16604K8077
6753c46734L1367J8002L9589L3712k09149r3474J89772j75551k08328L21664N78918
6742A79788R8155j85692l77027J5821N2866R6372P8755j9077j30721k47902l18432
6731g57094K79031L33777j36492m6256J68988L10197J47041j48991l93423J88206
6721e5016j44J76837K16477o6829q0614L7171l30854n12369Q860K63370J26439
6710b16672j36175m4959R9855J36709J57277K36981K7803j50275N885j03333k65842
6699b52746m8844k83909J0203J98209L13954J00759l5036m05800j97314L70214
$$ plain form
6689 -230310 -56119 298949 267586 -31745 49454 -1884 -125501 -100889 -380139 -367289 -417177
6678 -417177 -340479 -377520 -639216 -626827 -625203 -348620 -61038 -349447 -377607 -76815 35585
6667 35585 -8746 -318627 -467958 -651778 -247828 151306 162289 -168207 -119863 -421563
6657 -421563 -633943 -190418 -265763 -428742 -417317 -247729 -28936 173534 91647 -169397
6647 -169397 -677005 -517773 -385704 70178 213220 52346 -21007 223177 211465 -123711
6637 -123711 -34433 149214 -29736 -323806 -460280 -640176 -550236 -368667 -320591 -528908
6627 -528908 -398440 -44456 218349 99014 -160521 105997 -68556 -454895 -494244 -73776
6617 -73776 203775 94938 -193642 -477139 -258125 -17360 -37852 -349252 -202949 98411
$$ packed form
6689b30310J74191L55068l1363k99331Q1199n1338j23617K4612k79250J2850m9888
6678d17177P6698l7041k61696J2389J624K76583K87582k88409k8160L00792J12400
6667C5585m4331l09881j49331j83820M03950L99134J0983l30496M8344l01700
6657d21563k12380M43525p5345j62979J1425J69588K18793K02470q1887k61044
6647a69397n07608J59232J32069M55882J43042j60874p3353K44184j1712l35176
6637a23711Q9278J83647j78950k94070j36474j79896Q9940J81569M8076k08317
6627e28908J30468L53984K62805j19335k59535K66518j74553l86339l9349M20468
6617g3776K77551j08837k88580k83497K19014K40765k0492l11400J46303L01360
$$ plain form
6607 98411 370807 402539 219544 -47111 -148611 78830 -137072 122001 106906 -491538
6597 -491538 -455111 -619803 -417911 -244503 -109764 26137 -73414 -93376 28018 172174
6587 172174 81349 262712 191254 -25389 -381456 -299499 -420899 -691769 -506178 -344028
6577 -344028 -86518 -193510 -490242 -364366 -190561 27382 325464 453157 598424 195862
6567 195862 121847 13070 -88716 -50127 369828 509481 287937 -137583 -382790 -388542
6557 -388542 50287 -161448 -163726 33675 342782 585838 366983 -391908 -343333 -198364
6547 -198364 -28667 114331 163727 415367 321253 182610 270927 456496 255291 57891
6537 57891 83843 19202 -84347 -28775 171830 113031 -108147 -48371 -163091 -118604 -296690
$$ packed form
6607I8411K72396L1732j82995k66655j01500K27441k15902K59073j5095n98444
6597d91538L6427j64692K01892J73408J34739J35901r9551j9962J21394J44156
6587A72174r0825J81363p1458k16643l56067Q1957j21400k70870J85591J62150
6577c44028K57510j06992k96732J25876J73805K17943K98082J27693J45267m02562
6567A95862p4015j08777j01786L8589M19955J39653k21544m25520k45207n752
6557c88542M38829k11735k278J97401L09107K43056k18855p58891M8575J44969
6547a98364J69697J42998M9396K51640r4114j38643Q8317J85569k01205j97400
6537E7891K5952o4641j03549N5572K00605n8799k21178N9776j14720M4487j78086
$$ plain form
6526 -296690 -301545 94112 -107987 -205191 -158771 -234059 -153548 -50848 51014 -235129 -515889
6515 -515889 -350608 -413556 -43652 56067 -169821 -338691 -312865 -64127 -221333 -84326
6505 -84326 -72855 -224997 -355900 -498992 -495319 -218125 -155214 -499801 -454054 9772 219900
6494 219900 242509 367252 616941 569750 376604 570719 618991 368482 181186 165798
6484 165798 377207 104278 -112614 -109875 176117 170240 -115702 129868 -122105 -387354
6474 -387354 -350754 -331496 -190129 -199686 -95590 -30767 -325320 -576568 -311193 -296980 -183485
6463 -183485 -169902 -135089 -109706 22874 -12607 -244563 -184980 -207398 -123890 -172702 -438237
6452 -438237 -422571 -385116 -697897 -682590 -205908 -54969 -285785 -256221 -251848 -267771 -82664
$$ packed form
6526b96690m855L95657k02099r7204M6420p5288Q0511J02700J01862k86143k80760
6515e15889J65281o2948L69904R9719k25888j68870K5826K48738j57206J37007
6505h4326J1471j52142j30903j43092L673K77194O2911l44587M5747M63826K10128
6494B19900K2609J24743K49689m7191j93146J94115M8272k50509j87296j5388
6484A65798K11409k72929k16892K739K85992n877k85942K45570k51973k65249
6474c87354L6600J9258J41367r557J04096O4823k94553k51248K65375J4213J13495
6463a83485J3583L4813K5383J32580l5481k31956N9583k2418Q3508m8812k65535
6452d38237J5666L7455l12781J5307M76682J50939k30816K9564M373j5923J85107
$$ plain form
6441 -82664 114698 77805 -343694 -711548 -640272 -383156 -133653 -47795 -511531 -712976
6431 -712976 -556434 -521642 -299624 3110 -19387 -581001 -761057 -695259 -704001 -682477 -332533
6420 -332533 -167246 -318311 -354949 -307050 75226 -113147 -55169 336987 554150 437734
6410 437734 194969 179091 54511 6267 162495 368944 -30700 -137355 54462 76228
6400 76228 -246534 -263245 56903 1460 12451 220683 412360 125869 -65224 -20980 -84702
6389 -84702 -317203 -285897 -107293 -286855 -480270 -274776 -238541 72749 88414 -100033
6379 -100033 64556 81921 -86188 -75218 -228265 -498319 -713693 -512576 -42365 -46605
6369 -46605 -322328 -281371 -240912 -193612 -10279 108298 219770 198354 74853 237229 486507
$$ packed form
6441h2664J97362l6893m21499l67854P1276K57116K49503Q5858m63736k01445
6431g12976J56542L4792K22018L02734k2497n61614j80056O5798q742K1524L49944
6420c32533J65287j51065l6638M7899L82276j88373N7978L92156K17163j16416
6410D37734k42765j5878j24580m8244J56228K06449l99644j06655J91817K1766
6400G6228l22762j6711L20148n5443J0991K08232J91677k86491j91093M4244o3722
6389h4702k32501L1306J78604j79562j93415K05494L6235L11290J5665j88447
6379a00033J64589J7365j68109J0970j53047k70054k15374K01117M70211m240
6369d6605k75723M0957M0459M7300J83333J18577J11472k1416j23501J62376K49278
$$ plain form
6358 486507 504409 36345 263132 590913 181143 -469786 -632406 -394052 -582539 -765577
6348 -765577 -894839 -643118 -273577 -17221 -19163 -411151 -335649 186292 337138 85394
6338 85394 -120939 -261163 -669239 -737094 -483000 -671271 -702055 -525532 -506264 -544679 -901449
6327 -901449 -736519 -493631 -366199 -140482 125195 -105560 -189507 -16205 39583 358663
6317 358663 218968 89150 90831 229708 261548 449668 328176 17568 -330225 -439114
6307 -439114 -492986 -301125 -435428 -455573 -625586 -893703 -1031310 -884302 -459065 -56037
6297 -56037 218319 26112 -495970 -595773 -431804 -308564 -249833 -158434 -235881 -38287 148018
6286 148018 40950 -258842 89644 -131048 -149673 -188483 73877 219178 227152 289683 146076
$$ packed form
6358D86507J7902m68064K26787L27781m09770o50929j62620K38354j88487j83038
6348g65577j29262K51721L69541K56356j942l91988P5502N21941J50846k51744
6338H5394k06333j40224m08076o7855K54094j88271l0784J76523J9268l8415l56770
6327i01449J64930K42888J27432K25717K65677k30755q3947J73302N5788L19080
6317C58663j39695j29818J681J38877L1840J88120j21492l10608l47793j08889
6307d39114n3872J91861j34303k0145j70013k68117j37607J47008M25237M03028
6297e6037K74356j92207n22082r9803J63969J23240N8731R1399p7447J97594J86305
6286A48018j07068k99792L48486k20692j8625l8810K62360J45301P974O2531j43607
$$ plain form
6275 146076 307857 188251 44167 -33171 -32644 -92613 -195552 -14145 -193705 -402926 -447140
6264 -447140 -283278 97811 128878 140069 -140951 -389237 -749616 -434843 21785 314624
6254 314624 378165 109628 -137662 -35144 18578 94548 -72761 241785 319667 345162 364895
6243 364895 -100409 -629976 -325216 -319838 -437458 -325224 -157897 -209578 -418846 -452291
6233 -452291 -195617 -158675 96878 408134 471389 242180 119330 100746 93108 -124847 -169108
6222 -169108 113691 326085 190709 -18939 -257758 -499257 -381467 -455182 -346423 -302628
6212 -302628 7475 295759 333466 301943 48371 -69418 11223 -204440 -220669 -355690
6202 -355690 -344871 -161203 -469942 -496756 -95959 199607 169488 393805 644610 540712
$$ packed form
6275A46076J61781j19606j44084p7338N27n9969j02939J81407j79560k09221m4214
6264d47140J63862L81089L1067J1191k81020k48286l60379L14773M56628K92839
6254C14624O3541k68537k47290J02518N3722P5970j67309L14546P7882K5495J9733
6243C64895m65304n29567L04760N378j17620J12234J67327n1681k09268l3445
6233d52291K56674L6942K55553L11256O3255k29209j22850j8584p638k17955m4261
6222a69108K82799K12394j35376k09648k38819k41499J17790p3715J08759M3795
6212c02628L10103K88284L7707l1523k53572j17789Q0641k15663j6229j35021
6202c55690J0819J83668l08739k6814M00797K95566l0119K24317K50805j03898
$$ plain form
6192 540712 450589 113770 -216138 -270806 -123948 236302 144066 244300 64944 72845 23798
6181 23798 154132 292249 142898 7929 352420 374487 428350 277356 71134 29862
6171 29862 116264 -121452 1404 152091 24891 -122096 -41321 -23386 201049 46023
6161 46023 -12384 135918 158700 -214818 -507784 -799214 -1055400 -993399 -691287 -325263
6151 -325263 -336508 -166470 106077 -199310 -599095 -571010 -760515 -823244 -205388 296415
6141 296415 -97614 -6212 -93940 -269773 111915 171940 -111257 -340971 -19427 -47400
6131 -47400 -92465 211820 726825 728203 305597 124620 -223082 -122942 122690 -335348
6121 -335348 -509621 -196576 -233570 -69451 -177843 -184903 -143910 -463933 -756424 -659071 -448519
$$ packed form
6192E40712r0123l36819l29908n4668J46858L60250r2236J00234j79356P901m9047
6181B3798J30334J38117j49351j34969L44491K2067N3863j50994k06222m1272
6171B9862Q6402k37716J22856J50687j27200j46987Q0775J7935K24435j55026
6161D6023n8407J48302K2782l73518k92966k91430k56186O2001L02112L66024
6151c25263j1245J70038K72547l05387l99785K8085j89505o2729O17856N01803
6141B96415l94029R1402q7728j75833L81688O0025k83197k29714L21544k7973
6131d7400m5065L04285N15005J378m22606j80977l47702J00140K45632m58038
6121c35348j74273L13045l6994J64119j08392p060M0993l20023k92491R7353K10552
$$ plain form
6110 -448519 -377916 -440277 -475903 -315451 -18354 -20742 42010 -73103 28874 97408 388636
6099 388636 424907 -11281 34789 45693 -150213 -131622 -31462 1064 -95406 -233393 -126199
6088 -126199 111991 30570 45287 144710 84091 29070 -91780 -75763 -176495 -67097 306722
6077 306722 184104 74139 84225 52106 59188 94267 165523 -240675 -440916 -430811 -259366
6066 -259366 3089 -382567 -419022 -133145 -240162 -191756 -87695 -251347 -299640 -65932
6056 -65932 -19472 -12106 4389 72833 120741 -133729 -325241 -399795 -358910 -319644 -121724
6045 -121724 -214402 20969 169235 -98445 -22183 219649 584355 738750 534204 428621
6035 428621 63232 -361978 -539358 -519707 -241227 -192345 -149038 -136695 8844 279264
$$ packed form
6110d48519P0603o2361l5626J60452K97097k388O2752j15113J01977O8534K91228
6099C88636L6271m36188M6070J0904j95906J8591J00160L2526r6470j37987J07194
6088a26199K38190q1421J4717R9423o0619n5021j20850J6017j00732J09398L73819
6077C06722j22618j09965J0086l2119P082L5079P1256m06198k00241J0105J71445
6066b59366K62455l85656l6455K85877j07017M8406J04061j63652m8293K33708
6056f5932M6460P366J6495O8444M7908k54470j91512p4554M0885L9266J97920
6045a21724r2678K35371J48266k67680P6262K41832L64706J54395k04546j05583
6035D28621l65389m25210j77380J9651K78480M8882M3307J2343J45539K70420
$$ plain form
6025 279264 423662 391589 347473 56247 199591 459527 -68468 -288155 -328546 157955
6015 157955 596951 559459 347074 141650 49115 53720 -174233 -102498 308839 26451 -167435
6004 -167435 -3548 46857 121936 154472 46321 313312 619433 664849 489541 59248
5994 59248 -105706 8563 112836 55387 -42993 -59431 -83927 -194402 -250799 -411615 50409
5983 50409 177783 249785 -103896 -429530 -346141 -185511 -147615 -64313 198162 376603 106707
5972 106707 100126 215668 265744 51471 -181702 41276 15337 -516 -125925 -530788 -826402
5961 -826402 -929334 -830282 -560065 -365094 -681989 -671567 -265297 -257372 -83238 136600
5951 136600 387669 424283 344396 226737 -34912 -104701 -258915 -477912 -426880 -364393 -304560
$$ packed form
6025B79264J44398l2073m4116k91226J43344K59936n27995k19687m0391M86501
6015A57955M38996l7492k12385k05424r2535M605k27953P1735M11337k82388j93886
6004a67435J63887N0405P5079L2536j08151K66991L06121M5416j75308m30293
5994E9248j64954J14269J04273n7449r8380j6438k4496j10475n6397j60816M62024
5983E0409J27374P2002l53681l25634Q3389J60630L7896Q3302K62475J78441k69896
5972A06707o581J15542N0076k14273k33173K22978k5939j5853j25409m04863k95614
5961h26402j02932R9052K70217J94971l16895J0422M06270P925J74134K19838
5951A36600K51069L6614p9887j17659k61649o9789j54214k18997N1032O2487N9833
$$ plain form
5940 -304560 -448362 -481731 -362428 -501053 -337535 -166325 182021 117155 -310249 -280046
5930 -280046 -384345 -417651 -474315 -386493 -75505 -51828 -200840 -353668 -491013 -355817
5920 -355817 -70907 113346 133156 101828 -8951 -92231 273725 397292 359887 286255 229340
5909 229340 396667 319595 120110 -184572 -517595 -256385 -88081 149166 225132 313017
5899 313017 467289 269506 116055 17988 64199 100566 -222208 -520051 -343089 -372384
5889 -372384 -374631 -352486 -248280 -76411 40866 339206 81893 44801 36164 186347 401202
5878 401202 248336 270323 78569 8706 4527 -106287 -428306 -284076 -91046 -210244
5868 -210244 -463903 -554330 -382632 -32370 -216005 -297397 -149286 50539 -271778 -530226
$$ packed form
5940c04560j43802l3369J19303j38625J63518J71210L48346o4866m27404L0203
5930b80046j04299l3306n6664Q7822L10988K3677j49012j52828j37345J35196
5920c55817K84910J84253J9810l1328j10779q3280L65956J23567l7405p3632n6915
5909B29340J67327p7072j99485l04682l33023K61210J68304K37247P5966Q7885
5899C13017J54272j97783j53451r8067M6211L6367l22774k97843J76962k9295
5889c72384k247K2145J04206J71869J17277K98340k57313l7092q637J50183K14855
5878D01202j52866K1987j91754o9863m179j10814l22019J44230J93030j19198
5868b10244k53659r0427J71698L50262j83635q1392J48111J99825l22317k58448
$$ plain form
5858 -530226 -545713 -410178 -242569 -585547 -697293 -301293 -246048 21754 307880 95259
5848 95259 -59837 -201714 -417373 -52729 491209 213457 114376 8314 8081 -77677 -87244
5837 -87244 -222835 -229196 -441041 -664995 -445598 -141520 99142 -236544 -540346 -718591
5827 -718591 -697117 -374143 -137179 105324 414380 351976 197696 182566 40928 -276757
5817 -276757 -220422 -476235 -450272 101544 -25193 8807 367265 172224 124480 652210
5807 652210 493770 240228 -29147 -60808 24793 185213 73626 83721 327169 499652
5797 499652 187202 5544 -326731 -535446 -100224 142581 230071 465 -141204 215659
5787 215659 414577 612934 303167 -100535 -26618 72734 119582 -54505 -280633 -455891
$$ packed form
5858e30226j5487J35535J67609l42978j11746L96000N5245K67802K86126k12621
5848I5259j55096j41877k15659L64644N43938k77752r9081j06062k33q5758r567
5837h7244j35591o361k11845k23954K19397L04078K40662l35686l03802j78245
5827g18591K1474L22974K36964K42503L09056o2404j54280j5130j41638l17685
5817b76757N6335k55813K5963N51816j26737L4000L58458j95041m7744N27730
5807F52210j58440k53542k69375l1661Q5601J60420j11587J0095K43448J72483
5797D99652l12450j81658l32275k08715M35222K42805Q7490k29606j41669L56863
5787B15659J98918J98357l09767m03702P3917R9352M6848j74087k26128j75258
$$ plain form
5777 -455891 -514246 -223347 226228 300220 370734 570911 170055 -138535 49253 124486
5767 124486 -12196 -199800 -358808 -198607 63007 -297472 -587208 -244006 -33025 -311421
5757 -311421 -91394 -73409 132802 7123 -273349 -103206 273855 175209 -10187 147946
5747 147946 228418 138779 -120581 47424 242714 681698 628309 276214 31296 38882 -20525
5736 -20525 164291 -103645 -157965 -1382 7758 65388 -122469 -167529 -263449 -168344 155428
5725 155428 144095 51594 138185 286928 219357 -99309 -247448 -252973 -119863 124958 214172
5714 214172 206515 202583 64853 132671 429308 129083 -284466 -412842 -413308 -249490 -45551
5703 -45551 252008 293702 186974 -239579 -477786 -395715 -217652 -200298 132514 187756 -255359
$$ packed form
5777d55891n8355K90899M49575P3992P0514K00177m00856l08590J87788P5233
5767A24486j36682j87604j59008J60201K61614l60479k89736L43202K10981k78396
5757c11421K20027J7985K06211j25679k80472J70143L77061r8646j85396J58133
5747A47946Q0472q9639k59360J68005J95290M38984n3389l52095k44918P586n9407
5736b0525J84816k67936n4320J56583R140N7630j87857m5060r5920R5105L23772
5725A55428j1333r2501Q6591J48743o7571l18666j48139n525J33110K44821Q9214
5714B14172p657l932j37730O7818K96637l00225m13549j28376m66J63818K03939
5703d5551K97559M1694j06728m26553k38207Q2071J78063J7354L32812N5242m43115
$$ plain form
5692 -255359 -164210 -48898 126608 3375 -392904 -290309 -533582 -608191 -760561 -464491
5682 -464491 -342386 -157233 88452 -205002 -562780 -422204 -339622 -546717 -191789 -160961
5672 -160961 -455801 -488449 -402563 -301378 -556899 -737080 -833774 -464069 -185198 60697
5662 60697 124117 -79804 -319703 -332980 -136879 -264242 -454485 -401095 -320281 -212841 -482508
5651 -482508 -535056 -607895 -568654 -338939 -198877 91155 301883 243089 -96484 34798
5641 34798 437438 642164 494464 -24041 -94427 -31539 -205579 -104288 -27333 124461
5631 124461 185357 176720 226461 -14055 -79236 167777 195707 490655 476085 164268 -75026
5620 -75026 -282593 -350660 70510 -129687 -314618 -408322 47890 622496 693974 519835
$$ packed form
5692b55359R1149J15312J75506j23233l96279J02595k43273p4609j52370K96070
5682d64491J22105J85153K45685k93454l57778J40576Q2582k07095L54928L0828
5672a60961k94840l2648Q5886J01185k55521j80181r6694L69705K78871K45895
5662F0697O3420k03921k39899j3277J96101j27363j90243N3390Q0814J07440k69667
5651d82508n2548p2839L9241K29715J40062K90032K10728n8794l39573J31282
5641C4798M02640K04726j47700n18505p0386O2888j74040J01291P6955J51794
5631A24461O0896q637M9741k40516o5181K47013K7930K94948j4570l11817k39294
5620g5026k07567o8067M21170k00197j84931r3704M56212N74606P1478j74139
$$ plain form
5610 519835 208643 72737 36525 -115950 -281565 -339704 -450180 -445123 -328972 -317938 -424832
5599 -424832 -110751 73742 -155586 -676460 -807438 -636783 -348966 -285889 -566031 -826992
5589 -826992 -416250 10606 -64730 132736 335221 86056 -14517 294147 470553 37498
5579 37498 48971 253529 -21307 -146101 -83969 -3887 240781 157694 -101354 173029 48934
$$ packed form
5610E19835l11192j35906l6212j52475j65615n8139j10476N057J16151J1034j06894
5599d24832L14081J84493k29328n20874j30978J70655K87817O3077k80142k60961
5589h26992M10742M26856p5336J97466K02485k49165j00573L08664J76406m33055
5579C7498J1473K04558k74836j24794O2132Q0082K44668q3087k59048K74383j24095
$$ [...]
##END NTUPLES=NMR SPECTRUM
##END=
