##TITLE=Analysis number 319991
Compound Code cc 38104
Book Reference 407/115/7
Project Code adrs
Chemist Name andyw
##JCAMPDX= 6.0         $$ Bruker NMR JCAMP-DX V2.0
##DATA TYPE= NMR SPECTRUM
##DATA CLASS= NTUPLES
##ORIGIN= Bruker BioSpin GmbH
##OWNER= nmr
$$ XWIN-NMR		Version 3.5
$$ Wed Jun  7 09:17:27 2006 GMT Daylight Time (UT+1h)  MAYBRIDGE\nmr@NMR_250MHZ
##.OBSERVE FREQUENCY= 250.131544655141
##.OBSERVE NUCLEUS= ^1H
##.ACQUISITION MODE= SIMULTANEOUS (DQD)
##.ACQUISITION SCHEME= undefined
##.AVERAGES= 16
##.DIGITISER RES= 18
##SPECTROMETER/DATA SYSTEM= dpx250
##.PULSE SEQUENCE= zg30
##.SOLVENT NAME= CDCl3
##.SHIFT REFERENCE= (INTERNAL, CDCl3, 0, 16.522)
##AUDIT TRAIL= $$ (NUMBER, WHEN, WHO, WHERE, WHAT)
$$ ##TITLE= Audit trail, XWIN-NMR		Version 3.5
$$ ##JCAMPDX= 5.01
$$ ##ORIGIN= Bruker BioSpin GmbH
$$ ##OWNER= nmr
$$ C:\u/data/dgb/nmr/ADRS/360/pdata/1/auditp.txt
$$ ##AUDIT TRAIL=  $$ (NUMBER, WHEN, WHO, WHERE, WHAT)
(   1,<2006-06-07 09:17:02.51 +100>,<MAYBRIDGE\nmr>,<NMR_250MHZ>,
      <created by zg, POWCHK disabled, PULCHK disabled
       configuration hash MD5:
       E2 DF 36 D8 04 B2 41 60 5A D7 A3 38 5A 4B D0 FE
       data hash MD5: 64K
       70 FD E8 2D F4 11 35 E5 04 F0 8D 5D B9 D3 27 55>)
(   2,<2006-06-07 09:17:16.40 +100>,<MAYBRIDGE\nmr>,<NMR_250MHZ>,
      <Start of raw data processing
       ef LB = 0.3 FT_mod = 6 PKNL = 1 SI = 32K 
       data hash MD5: 32K
       61 38 AA 07 3A AC 1A 46 8D 4F F5 35 72 81 72 18>)
(   3,<2006-06-07 09:17:18.18 +100>,<MAYBRIDGE\nmr>,<NMR_250MHZ>,
      <apk 
       data hash MD5: 32K
       81 D5 76 88 E4 C8 B8 E8 4A 53 C6 57 4F 3C 9C 67>)
(   4,<2006-06-07 09:17:18.97 +100>,<MAYBRIDGE\nmr>,<NMR_250MHZ>,
      <abs ABSG = 5 
       data hash MD5: 32K
       54 AB 89 34 52 0D 5C 6D CB AF 56 F0 18 16 3D 32>)
$$ ##END=
$$ 
$$ hash MD5
$$ 26 6E E9 2A 79 4F A8 AD 86 15 50 27 77 F9 A7 06
##$RELAX= 
##$RELAX= 
##$RELAX= 
##$RELAX= 
##$RELAX= 
##$RELAX= 
##$RELAX= 
$$ Bruker specific parameters
$$ --------------------------
##$DU= <C:\u>
##$EXPNO= 360
##$NAME= <ADRS>
##$PROCNO= 1
##$TYPE= <nmr>
##$USER= <dgb>
##$AMP= (0..31)
100 100 100 100 100 100 100 100 100 100 100 100 100 100 100 100 100 100 
100 100 100 100 100 100 100 100 100 100 100 100 100 100 
##$AQSEQ= 0
##$AQ_mod= 3
##$AUNM= <au_zg>
##$AUTOPOS= <4 >
##$BF1= 250.13
##$BF2= 250.13
##$BF3= 250.13
##$BF4= 250.13
##$BF5= 500.13
##$BF6= 500.13
##$BF7= 500.13
##$BF8= 500.13
##$BYTORDA= 1
##$CFDGTYP= 0
##$CFRGTYP= 5
##$CHEMSTR= <none>
##$CNST= (0..31)
1 1 145 1 1 1 1 1 1 1 1 1 1 1 1 1 1 1 1 1 1 1 1 1 1 1 1 1 1 1 1 1 
##$CPDPRG= <>
##$CPDPRG1= <>
##$CPDPRG2= <>
##$CPDPRG3= <>
##$CPDPRG4= <mlev>
##$CPDPRG5= <mlev>
##$CPDPRG6= <mlev>
##$CPDPRG7= <mlev>
##$CPDPRG8= <mlev>
##$CPDPRGB= <>
##$CPDPRGT= <>
##$D= (0..31)
0 1 0 0 0 0 0 0 0 0.06 0 0 0 0 0 0 0.0002 0 0 0 0 0 0 0 0 0 0 0 0 0 0 
0 
##$DATE= 1149668221
##$DBL= (0..7)
120 120 120 120 120 120 120 120 
##$DBP= (0..7)
150 150 150 150 150 150 150 150 
##$DBP07= 0
##$DBPNAM0= <>
##$DBPNAM1= <>
$$ [...]
##$SUBNAM7= <"">
##$SUBNAM8= <"">
##$SUBNAM9= <"">
##$SW= 20.6930455092707
##$SWIBOX= (0..15)
0 0 3 0 0 0 0 0 0 0 0 0 0 0 0 0 
##$SW_h= 5175.983436853
##$TD= 65536
##$TD0= 1
##$TE= 296.16
##$TE2= 300
##$TE3= 300
##$TEG= 300
##$TL= (0..7)
0 120 120 120 120 120 120 120 
##$TP= (0..7)
150 150 150 150 150 150 150 150 
##$TP07= 0
##$TPNAME0= <>
##$TPNAME1= <>
##$TPNAME2= <>
##$TPNAME3= <>
##$TPNAME4= <>
##$TPNAME5= <>
##$TPNAME6= <>
##$TPNAME7= <>
##$TPOAL= (0..7)
0.5 0.5 0.5 0.5 0.5 0.5 0.5 0.5 
##$TPOFFS= (0..7)
0 0 0 0 0 0 0 0 
##$TUNHIN= 0
##$TUNHOUT= 0
##$TUNXOUT= 0
##$USERA1= <user>
##$USERA2= <user>
##$USERA3= <user>
##$USERA4= <user>
##$USERA5= <user>
##$V9= 5
##$VALIST= <valist>
##$VCLIST= <CCCCCCCCCCCCCCC>
##$VD= 0
##$VDLIST= <DDDDDDDDDDDDDDD>
##$VPLIST= <PPPPPPPPPPPPPPP>
##$VTLIST= <TTTTTTTTTTTTTTT>
##$WBST= 1024
##$WBSW= 4
##$XGAIN= (0..3)
0 0 0 0 
##$XL= 0
##$YL= 0
##$YMAX_a= 442523
##$YMIN_a= -404286
##$ZGOPTNS= <>
##$ZL1= 120
##$ZL2= 120
##$ZL3= 120
##$ZL4= 120
##$ABSF1= 16.522
##$ABSF2= -4.171173
##$ABSG= 5
##$ABSL= 3
##$ALPHA= 0
##$AQORDER= 0
##$ASSFAC= 0
##$ASSFACI= 0
##$ASSFACX= 0
##$ASSWID= 0
##$AUNMP= <proc_1d>
##$AZFE= 0.1
##$AZFW= 0.1
##$BCFW= 0
##$BC_mod= 0
##$BYTORDP= 0
##$COROFFS= 0
##$CY= 12.5
##$DATMOD= 1
##$DC= 0
##$DFILT= <>
##$DTYPP= 0
##$F1P= 14.0000005364418
##$F2P= -0.99999901652339
##$FCOR= 0.5
##$FTSIZE= 32768
##$FT_mod= 6
##$GAMMA= 0
##$GB= 0
##$INTBC= 1
##$INTSCL= 1
##$ISEN= 128
##$LB= 0.3
##$LEV0= 0
##$LPBIN= 0
##$MAXI= 10000
##$MC2= 0
##$MEAN= 0
##$ME_mod= 0
##$MI= 0
##$NCOEF= 0
##$NC_proc= -5
##$NLEV= 6
##$NOISF1= 0
##$NOISF2= 0
##$NSP= 0
##$NTH_PI= 0
##$NZP= 0
##$OFFSET= 16.522
##$PC= 1
##$PHC0= 16.25431
##$PHC1= 6.553665
##$PH_mod= 1
##$PKNL= yes
##$PPARMOD= 0
##$PSCAL= 4
##$PSIGN= 0
##$REVERSE= no
##$SF= 250.13
##$SI= 32768
##$SIGF1= 0
##$SIGF2= 0
##$SINO= 400
##$SIOLD= 32768
##$SREGLST= <1H.CDCl3>
##$SSB= 0
##$STSI= 32768
##$STSR= 0
##$SW_p= 5175.98343685301
##$SYMM= 0
##$S_DEV= 0
##$TDeff= 65536
##$TDoff= 0
##$TI= <Analysis number 999999
Compound Code 99
Book Reference 9
Project Code 9>
##$TILT= no
##$TM1= 0
##$TM2= 0
##$TOPLEV= 0
##$USERP1= <user>
##$USERP2= <user>
##$USERP3= <user>
##$USERP4= <user>
##$USERP5= <user>
##$WDW= 1
##$XDIM= 32768
##$YMAX_p= 479139010
##$YMIN_p= -291787
$$ End of Bruker specific parameters
$$ ---------------------------------
##NTUPLES= NMR SPECTRUM
##VAR_NAME=  FREQUENCY,     SPECTRUM/REAL,   SPECTRUM/IMAG
##SYMBOL=    X,             R,               I
##VAR_TYPE=  INDEPENDENT,   DEPENDENT,       DEPENDENT
##VAR_FORM=  AFFN,          ASDF,            ASDF
##VAR_DIM=   32768,         32768,           32768
##UNITS=     HZ,            ARBITRARY UNITS, ARBITRARY UNITS
##FACTOR=    0.157963299565203, 1,           1
##FIRST=     4132.6476996994, 0,             0
##LAST=      -1043.33573715361, 0,           0
##MIN=       -1043.33573715361, -291787,     0
##MAX=       4132.6476996994, 479139010,     0
$$ Real data points
##PAGE= N=1
##DATA TABLE= (X++(R..R)), XYDATA
$$ [...]
14958a6022j0789J8790J5098N685o783k4849m0438q351L794K7792K4591J4962
$$ -16022 -26811 -8021 7077 12762 5979 -18870 -59308 -67659 -63865 -36073 -11482 3480
14946C480K4779N821l5983o885Q832J3037J1045j2302k1403J0947J3061n907l3400
$$ 3480 28259 34080 -1903 -8788 44 13081 24126 11824 -9579 1368 14429 8522 -24878
14933b4878l966K3930K7079R50p940k1839J1116J3930K9541q960j4632k521j3734
$$ -24878 -28844 -4914 22165 23115 15175 -6664 4452 18382 47923 38963 24331 21810 8076
14920H076J804K0281q700J451k97j5837k9631J0747J0746m945j5311J2723P110
$$ 8076 9880 30161 21461 22912 22615 6778 -22853 -12106 -1360 -6305 -21616 -8893 -1783
14907a783P047K768l074O741o990P488N049j4315j3205j3730j9936K3554J6697
$$ -1783 5264 8032 4958 11699 4709 12197 17246 2931 -10274 -24004 -43940 -20386 -3689
14894c689o598l2629k0754j2740K4335r13P737k891K648r095J061L2813J8109
$$ -3689 -10287 -42916 -63670 -76410 -52075 -52988 -45251 -48142 -45494 -54589 -53528 -20715 -2606
14881b606K8709k4019m8999J913N697r529L4206o552k00K4200j0209k1712l181
$$ -2606 26103 2084 -46915 -45002 -39305 -48834 -14628 -21180 -21380 2820 -7389 -29101 -32282
14868c2282Q898J1100P846K80k3172M965J1362J2978j2593k4059J9631N423m70
$$ -32282 -23384 -12284 -4438 -4158 -27330 -22365 -11003 1975 -10618 -34677 -15046 -9623 -10093
14855a0093M121j3425K5446P330l8876O178R190M62J1984k1361q879p921q355
$$ -10093 -5972 -19397 6049 13379 -25497 -19319 -10129 -9667 2317 -19044 -27923 -35844 -44199
14842d4199J2898R202J9777k302l8315J782K7749L6504J1319o895k5129k1171
$$ -44199 -31301 -22099 -2322 -4624 -42939 -41157 -13408 23096 34415 27520 2391 -18780
14830a8780N626R162j0454j4624P138J0708M308j3086k1388J9651L298j3665l1707
$$ -18780 -13154 -3992 -14446 -29070 -21932 -11224 -6916 -20002 -41390 -21739 -18441 -32106 -63813
14817f3813N700L2750k874k597J907q87k306j0264j09o062J7005r730q569K0589
$$ -63813 -58113 -25363 -28237 -30834 -28927 -29814 -32120 -42384 -42493 -48555 -31550 -41280 -49849 -29260
14803b9260J1562p553M335J1925m110m718p246j858J5694K0548r900k1912r326
$$ -29260 -17698 -25251 -20916 -8991 -13101 -17819 -25065 -26923 -11229 9319 -581 -22493 -31819
14790c1819l026M235M5428k5635k1759j7009j0683J1951O137M248K62j3674J3876
$$ -31819 -34845 -30610 14818 -10817 -32576 -49585 -60268 -48317 -42180 -37932 -37670 -51344 -37468
14777c7468K3173p793j4877j7658J4820J3590K5652l7800k9163K1409J7089Q856
$$ -37468 -14295 -22088 -36965 -54623 -39803 -26213 -561 -38361 -67524 -46115 -29026 -20170
14765b0170j6122n61L1601r591j5013o829k5965j1195J6053L706l6132p212L9649
$$ -20170 -36292 -36853 -5252 -14843 -29856 -36685 -62650 -73845 -57792 -54086 -90218 -97430 -57781
14752e7781K2414j0491L712m614j8709J2445K2075J2543K5312N032j4236k0893
$$ -57781 -35367 -45858 -42146 -46760 -65469 -53024 -30949 -18406 6906 11938 -2298 -23191
14740b3191K2293R16Q43K5730k8974m1888o383l277M656O246Q847J823o634j1121
$$ -23191 -898 18 861 26591 -2383 -44271 -50654 -53931 -49275 -43029 -34182 -32359 -38993 -50114
14726e0114k965k125J812J4368p102K024K5110j646j8428J378M9783P377j4300
$$ -50114 -53079 -55204 -53392 -39024 -46126 -44102 -18992 -20638 -39066 -37688 12095 19472 5172
14713E172j5200j7328p826j2204N479j4911M463J2288n708k0430l974j164r446
$$ 5172 -10028 -27356 -35182 -47386 -41907 -56818 -52355 -40067 -45775 -66205 -70179 -71343 -80789
14700h0789K0012o06R583P215n290O480P499P431R113J3157k618l6925l4982J1394
$$ -80789 -60777 -61383 -51800 -44585 -49875 -43395 -35896 -28465 -19352 -6195 -8813 -45738 -80720 -69326
14686f9326r792J0959L938K10j1041J0937K2668L421K119O211K386K1347J2797
$$ -69326 -79118 -68159 -64221 -64011 -75052 -64115 -41447 -38026 -35907 -29696 -27310 -5963 6834
14673F834l518n283j1008J4655K3564j305k0260k4661j8349K9492K1751m2821
$$ 6834 3316 -1967 -12975 1680 25244 23939 3679 -20982 -39331 -9839 11912 -30909
14661c0909j4907K6482L5883j6985n900l571K141j435P77o909j6593m2J1563m522
$$ -30909 -45816 -19334 16549 -436 -6336 -9907 -7766 -9201 -8424 -15333 -31926 -31968 -20405 -24927
14647b4927k5833J8576J5086K5084M385j9117l449J990p994k0877m530j485p190
$$ -24927 -50760 -32184 -17098 7986 12371 -6746 -10195 -8205 -16199 -37076 -41606 -43091 -50281
14634e0281J8123q602L084L8343M884l8548l10j6710j582L4623Q935j3444m872
$$ -50281 -32158 -40760 -37676 667 5551 -32997 -33307 -50017 -51599 -16976 -8041 -21485 -26357
14621b6357M071L8283J9102k2731j9837k5610O199K8083J4235m511L118k8520
$$ -26357 -22286 15997 35099 12368 -7469 -33079 -26880 1203 15438 10927 14045 -14475
14609a4475l4457k796J9943q389k1682k7109J7085N0163K3794j8373k7143k1699
$$ -14475 -48932 -51728 -31785 -40174 -61856 -88965 -71880 -21717 2077 -16296 -43439 -65138
14597f5138J5485J1802j5194k2785j0658K137L911K3072J0785j1065l713J3030
$$ -65138 -49653 -37851 -53045 -75830 -86488 -84351 -80440 -57368 -46583 -57648 -61361 -48331
14585d8331j5464J7328M213K1515J5645J051R509j2869O91m730r913j3102J3714
$$ -48331 -63795 -46467 -42254 -20739 -5094 -4043 5466 -7403 -6712 -11442 -21355 -34457 -20743
14572b0743J7391R309l0384j4653J4839o79J2940p933k1819j1668J0779N6783
$$ -20743 -3352 5957 -24427 -39080 -24241 -24920 -11980 -19913 -41732 -53400 -42621 14162
14560A4162j3581m6204j6236J6257K1415p707m403k9506R573q490N53J0647j7225
$$ 14162 581 -45623 -61859 -45602 -24187 -31894 -36297 -65803 -56230 -64720 -64167 -53520 -70745
14547g0745j7338O520l646M0698J6579K6752L4210k5413k6604j6402j5056k457
$$ -70745 -88083 -81563 -85209 -44511 -27932 -1180 33030 7617 -18987 -35389 -50445 -52902
14535e2902J9010K0486p999k2990j1748k264k367L349q841L871J5159J6863M003
$$ -52902 -33892 -13406 -21405 -44395 -56143 -58407 -60774 -57425 -66266 -62395 -47236 -30373 -26370
14522b6370Q007n844n835J741k0661J2649m60j3491j7176K3275K7010J2630J2824
$$ -26370 -18363 -24207 -30042 -28301 -48962 -36313 -36773 -50264 -67440 -44165 -17155 -4525 8299
14509H299j8930k5798l9607k4521K1905J1145j7762j6686J0188N7143M5688l0617
$$ 8299 -10631 -36429 -76036 -100557 -78652 -67507 -85269 -101955 -91767 -34624 11064 -19553
14497a9553m2608k4936K882J2647J0520K5079O078r277j5187k0048J3796O730
$$ -19553 -62161 -87097 -84215 -71568 -61048 -35969 -29891 -39168 -54355 -74403 -60607 -53877
14485e3877J4508Q820k0354l0301J4529P624J6391r868J0414J3704q572j2706
$$ -53877 -39369 -30549 -50903 -81204 -66675 -59051 -42660 -52528 -42114 -28410 -36982 -49688
14473d9688r043R145K1092j5127O628M627j860m543j3355J9340j773k119K79L6948
$$ -49688 -58731 -49586 -28494 -43621 -36993 -32366 -34226 -38769 -52124 -32784 -34557 -36676 -36397 551
14459E51J1629j3732N328Q605J6544J0306K0280r646j1326l0300r647k915l621
$$ 551 12180 -1552 3776 12381 28925 39231 59511 49865 38539 8239 -1408 -4323 -7944
14446g944M780N493L876j5927L789j2768k7125j8705Q64J8540J3049o863j2337
$$ -7944 -3164 2329 6205 -9722 -5933 -18701 -45826 -64531 -63667 -45127 -32078 -38941 -51278
14433e1278j0456J0281n851J9842K8615j1274j1392k1845q219K993J0790M816
$$ -51278 -61734 -51453 -57304 -37462 -8847 -20121 -31513 -53358 -61577 -58584 -47794 -42978
14421d2978k348O997o147J1619K302j0341l8049K1095j0015m282K260K280K3494
$$ -42978 -45326 -38329 -44476 -32857 -30555 -40896 -78945 -57850 -67865 -72147 -69887 -67607 -44113
14408d4113N027J2155j2868j4514O479J8645K1065o118j1986K66p954j9588K499
$$ -44113 -39086 -26931 -39799 -54313 -47834 -29189 -8124 -14242 -26228 -25962 -33916 -53504 -51005
14395e1005m407Q641J9403J8694o020j8903k2581J7106P790j5m946L7029L412
$$ -51005 -55412 -46771 -27368 -8674 -14694 -33597 -56178 -39072 -31282 -31297 -36243 786 4198
14382D198j5082J8935O785j019M769J259j8561J4425Q594J250K0909m084j6689
$$ 4198 -10884 8051 14836 13817 18586 19845 1284 15709 24303 25553 46462 42378 25689
14369B5689p320j2064J612K546j099o6725k5504K0357L0209k2505M816K2326k1885
$$ 25689 18369 6305 7917 10463 9364 -57361 -82865 -62508 -32299 -54804 -49988 -27662 -49547
14356d9547n547M057l737O840j121r446K7623K6219l812K7275N001m1103k2640
$$ -49547 -55094 -51037 -54774 -47934 -49055 -58501 -30878 -4659 -8471 18804 23805 -17298 -39938
14343c9938k0640J0311J7998J4870p414j490J071m3746J319K4524r527n625L9784
$$ -39938 -60578 -50267 -32269 -17399 -24813 -26303 -25232 -68978 -67659 -43135 -52662 -58287 -18503
14330a8503R702j4768Q745J5995j1546J2614P773r653j6474J772K2485J0125n507
$$ -18503 -8801 -23569 -14824 1171 -10375 2239 10012 359 -16115 -14343 8142 18267 12760
14317A2760N955l1220r791K5934r533k5359j0746q418k1851j5208Q825L2267M756
$$ 12760 18715 -12505 -22296 3638 -5895 -31254 -42000 -50418 -72269 -87477 -78652 -46385 -41629
14304d1629j0362K9322J2189n4j906l835J1269k5249k6789m915l90q140j0489
$$ -41629 -51991 -22669 -10480 -10534 -12440 -16275 -5006 -30255 -57044 -61959 -62349 -70489 -80978
14291h0978K976J6950R719j1975M3235K9474p933K413m5733r178l524j9082J8248
$$ -80978 -78002 -61052 -51333 -63308 -20073 9401 1468 3881 -41852 -51030 -54554 -73636 -55388
14278e5388K9723k9380k9338K5220J9891K5190K0685P189l912j0420j8515l3378
$$ -55388 -25665 -55045 -84383 -59163 -39272 -14082 6603 13792 9880 -540 -19055 -52433
14266e2433k4264J6293j7430j8274k3766q550K5918k96K6987J1148N37N8k0751
$$ -52433 -76697 -60404 -77834 -96108 -119874 -128424 -102506 -102802 -75815 -64667 -64130 -64072 -84823
14253h4823K3952J506l1348r926R766K0622J4672p437j505L845jj6255J2721K4430
$$ -84823 -60871 -59365 -90713 -100639 -90873 -70251 -55579 -63016 -64521 -60676 -60677 -76932 -64211 -39781
14239c9781l114o713K9739l417j0353J4654L2445j3935k3772J869Q916J32P70
$$ -39781 -42895 -49608 -19869 -23286 -33639 -18985 13460 -475 -24247 -22378 -13462 -13330 -12560
14226a2560j2016M595J438n0857l2123L8492O519R571M489P358K4764j2543l5674
$$ -12560 -24576 -19981 -18543 -69400 -101523 -63031 -56512 -46941 -42452 -35094 -10330 -22873 -58547
14213e8547m2812o124J5709L0973O275j075K2490j1222j1476j7208j6664l401
$$ -58547 -101359 -107483 -91774 -60801 -54526 -55601 -33111 -44333 -55809 -73017 -89681 -93082
14201i3082K0913K7297p386j0655r546K5243r752K0442J6960Q069k483l5753j2429
$$ -93082 -72169 -44872 -52258 -62913 -72459 -47216 -56968 -36526 -19566 -11497 -13980 -49733 -62162
14188f2162o482R521K6617L0557K796j0546j2920j2832l218P436L887k017N096
$$ -62162 -68644 -59123 -32506 -1949 847 -9699 -22619 -35451 -38669 -31233 -27346 -29363 -24267
14175b4267K721R641j1782k5871R387K5344m796j6571K7683j4301j7755J4961
$$ -24267 -21546 -11905 -23687 -49558 -40171 -14827 -19623 -36194 -8511 -22812 -40567 -25606
14163b5606K4370n455k9475k5822J183n709p913L6095j1466j8354K1470K2585
$$ -25606 -1236 -6691 -36166 -61988 -60805 -66514 -74427 -38332 -49798 -68152 -46682 -24097
14151b4097k0000q291P921N185l228p41j1484J1074r035P669j8681l997L7207
$$ -24097 -44097 -52388 -44467 -39282 -42510 -43251 -54735 -43661 -52696 -45027 -63708 -67705 -30498
14138c0498k841l0501J4868K9530l4435m5569K3462O7j4576K2188N874N922R83
$$ -30498 -33339 -63840 -48972 -19442 -53877 -99446 -75984 -75917 -90493 -68305 -62431 -56509 -55526
14125e5526l6210k885L190L5605J6594l8938j2917K0304L2789J9950m3950K757
$$ -55526 -91736 -94621 -91431 -55826 -39232 -78170 -91087 -70783 -37994 -18044 -61994 -59237
14113e9237K1533M817k4527o31J9063m959p657k114k425J0753K6337L638j8710
$$ -59237 -37704 -32887 -57414 -58045 -38982 -43941 -51598 -53712 -56137 -45384 -19047 -15409 -34119
14100c4119o82k0510R169K9955J221j9202J1286J3384k1214P068j7465j7432L3476
$$ -34119 -34801 -55311 -46142 -16187 -14966 -34168 -22882 -9498 -30712 -23644 -41109 -58541 -25065
14087b5065K0106j3025k354Q724k6057k390L556K9831J9928J6170k0556j8854
$$ -25065 -4959 -17984 -20338 -11614 -37671 -40061 -36505 -6674 13254 29424 8868 -9986
14075i986Q17M611j5804j4882Q886K9252l877k529L07l5721J503N931K3309J0512
$$ -9986 -9169 -4558 -20362 -35244 -26358 2894 -983 -3512 -3205 -38926 -37423 -31492 -8183 2329
14061B329k7057k2437L2691L0211J645l1483l6997k348m309J2135K2395n001P59
$$ 2329 -24728 -47165 -14474 15737 17382 -14101 -51098 -53446 -57755 -45620 -23225 -28226 -27467
14048b7467m102j6623j3343j5965j0033J2692Q226O4L293K4888J4421q252r951
$$ -27467 -31569 -48192 -61535 -77500 -87533 -74841 -66615 -66551 -63258 -38370 -23949 -32201 -42152
14035d2152M140q138l9692J0978N1058K5974k1880k3515K607m0019l1424N738
$$ -42152 -38012 -46150 -85842 -74864 -23806 2168 -19712 -43227 -40620 -80639 -112063 -106325
14023a06325L7057L5351J3909J0620j1201J5822K9556j5955k6539j1172k8169
$$ -106325 -69268 -33917 -20008 -9388 -20589 -4767 24789 8834 -17705 -28877 -57046
14012e7046j8752L5070R638K5907p89l710j140o42p92j3255m8101j381L0531J0218
$$ -57046 -75798 -40728 -31090 -5183 -5972 -9682 -10822 -11464 -12256 -25511 -73612 -74993 -44462 -34244
13998c4244j6687k2980R660p930J0130o35J4509l1K3575O029N728N447j6767j8657
$$ -34244 -50931 -73911 -64251 -72181 -62051 -62686 -48177 -48208 -24633 -18604 -12876 -7429 -24196 -42853
13984d2853J1490J7868J4138m541n55ml8125l152j120R466p267j5101J4086N441
$$ -42853 -31363 -13495 643 -3898 -4453 -4457 -42582 -45734 -46854 -37388 -44655 -59756 -45670 -40229
13970d0229k7532r245j0785n169M223Q859k72k2921Q54K4309N465J7633L2066
$$ -40229 -67761 -77006 -87791 -92960 -88737 -79878 -80150 -103071 -102217 -77908 -72443 -54810 -22744
13957b2744q127l5158Q807J308O169J8182R209j4071L106L371m90n011P284k0378
$$ -22744 -30871 -66029 -57222 -55914 -49745 -31563 -22354 -36425 -33319 -29948 -30438 -35449 -28165 -48543
13943d8543k5199K4387J9494O127J2882L2133Q044j9397j3874j647m924l5382
$$ -48543 -73742 -49355 -29861 -23734 -10852 21281 29325 9928 -3946 -5593 -10517 -45899
13931d5899j78K0732K2672m775L300j0112p945j9980k831K723K3080R607J1997
$$ -45899 -46077 -25345 -2673 -7448 -4148 -14260 -22205 -42185 -45016 -42293 -19213 -9606 2391
13918B391l2765k1722k509j8523l972Q126r558J6876J7565Q592K0303R840q413
$$ 2391 -30374 -52096 -54605 -73128 -77100 -68974 -78532 -61656 -44091 -35499 -15196 -5356 -13769
13905a3769p176k2381o69J8954J8221J6516Q667l4271k5040J9095l579K16p530
$$ -13769 -20945 -43326 -43995 -25041 -6820 9696 18363 -15908 -40948 -21853 -25432 -25216 -32746
13892c2746p232M39k691k015J7674K416j699q541r042M155P395N037K1355Q711
$$ -32746 -39978 -39539 -42230 -44245 -26571 -24155 -25854 -34395 -43437 -39282 -31887 -26850 -5495 3216
13878C216j37n207k2375j3440m785L7178K690l6664j2230N539J369P570K4872
$$ 3216 3079 -2128 -24503 -37943 -42728 -5550 -2860 -39524 -51754 -46215 -44846 -37276 -12404
13865a2404j2303l3669j3206K0607J3902o509j5351m828O443K883k15J2900J2738
$$ -12404 -24707 -58376 -71582 -50975 -37073 -43582 -58933 -63761 -57318 -54435 -54650 -41750 -29012
13852b9012k3j0328j309K6519K6516q152k5381j0591p542k5504k8276k4420j7947
$$ -29012 -29035 -39363 -40672 -14153 12363 4211 -21170 -31761 -39303 -64807 -93083 -117503 -135450
13839a35450J1274L1459j628J5535K1868K1685J0545N226j2302Q45l216R176J9145
$$ -135450 -124176 -92717 -94345 -78810 -56942 -35257 -24712 -19486 -31788 -30943 -34159 -24983 -5838
13826e838r412j2458K469J2539k2281j5306O435m265M428j1274R12j8301n687
$$ -5838 -15250 -27708 -25239 -12700 -34981 -50287 -43852 -48117 -43689 -54963 -54051 -72352 -78039
13813g8039j0532L8271J0189q603J0364j6242j7617j3360J4669j7063o810J8568
$$ -78039 -88571 -50300 -40111 -48714 -38350 -54592 -72209 -85569 -70900 -87963 -94773 -76205
13801g6205O038J4249K367J599Q707J5858J372k342R852K799k0208K610j3150
$$ -76205 -70167 -55918 -53551 -51952 -43245 -27387 -26015 -28357 -18505 -15706 -35914 -33304 -46454
13788d6454j622l627K018j2999j825j6860j8154Q663M2178K7513k9172p201J716
$$ -46454 -48076 -51703 -49685 -62684 -64509 -81369 -99523 -90860 -48682 -21169 -50341 -57542 -55826
13775e5826Q714J3541m714k6347L836n34J2933O091l4559k962P773R919M4472
$$ -55826 -47112 -33571 -38285 -64632 -60796 -61330 -48397 -42306 -76865 -79827 -72054 -62135 -17663
13762a7663R866l498k0332l942K531r7j0738k861j92L7885J1129q966j4878j4930
$$ -17663 -7797 -11295 -31627 -35569 -33038 -33135 -43873 -46734 -46926 -9041 2088 -6878 -21756 -36686
13748c6686P521J9636j7002j2551J6832J476j9662k5643J3655j067n373j8749
$$ -36686 -29165 -9529 -26531 -39082 -22250 -20774 -40436 -66079 -52424 -53491 -58864 -77613
13736g7613N237n883p84J4236r667o96K0837L3525k2464O842K3874K8000j1694
$$ -77613 -72376 -78259 -79043 -64807 -74474 -75170 -54333 -20808 -43272 -36430 -12556 15444 3750
13723C750l6208k2431J8143k294J8743O859j7826j7298l0310l9062J6659K4360
$$ 3750 -32458 -54889 -36746 -39040 -20297 -13438 -31264 -48562 -78872 -117934 -101275 -76915
13711g6915L795M465K815o019j0363K4261K9471N861J8532k822l0377K686K1120
$$ -76915 -73120 -68655 -65840 -71859 -82222 -57961 -28490 -22629 -4097 -6919 -37296 -34610 -13490
13698a3490J195M325J569j9039k0039l0342L123M835k473J7211J8371m2178j4396
$$ -13490 -12295 -7970 -6401 -25440 -45479 -75821 -72698 -67863 -70336 -53125 -34754 -76932 -91328
13685i1328q988l616n053Q097j583P096P006J5687K1731N475J569r902l0107N912
$$ -91328 -100316 -103932 -108985 -100888 -102471 -95375 -88369 -72682 -50951 -45476 -43907 -53809 -83916 -78004
13671g8004N1949K5400k0407k5691K687n474m397j791K0685N195j3171J510J909
$$ -78004 -26055 -655 -21062 -46753 -44066 -49540 -53937 -55728 -35043 -29848 -43019 -41509 -39600
13658c9600j1205l783K2793K7483M507j8037k7674J6161K886M38q379L6848k303
$$ -39600 -50805 -54588 -31795 -4312 195 -17842 -45516 -29355 -26469 -26031 -34410 2438 135
13645A35k935k0722j2256J1428J3684r472k1307M125J5287L258j5130N574j4862
$$ 135 -2800 -23522 -35778 -24350 -10666 -20138 -41445 -37320 -22033 -18775 -33905 -28331 -43193
13632d3193j615J6686j2345L603N647l7993J4851J0884j2050J2510J2477J8480
$$ -43193 -44808 -28122 -40467 -36864 -31217 -69210 -54359 -43475 -55525 -43015 -30538 -12058
13620a2058l1397k9107P09o773N663j0295J6919L5550q022p993K211p135o975
$$ -12058 -43455 -72562 -71853 -78626 -72963 -83258 -66339 -30789 -38811 -46804 -44593 -51728 -58703
13607e8703j8762k0592K1382J4196K5427q672j4332K128K2636n546n156j2154
$$ -58703 -77465 -98057 -76675 -62479 -37052 -45724 -60056 -57928 -35292 -40838 -45994 -58148
13595e8148j3250j0165L0048K7200o082j2461n349K0510K5333K3192j7408j8182
$$ -58148 -71398 -81563 -51515 -24315 -30397 -42858 -48207 -27697 -2364 20828 3420 -14762
13583a4762j4267k9739j3505K4138J3335L648Q383L826j7766P331J3654l4682
$$ -14762 -29029 -58768 -72273 -48135 -34800 -31152 -22769 -18943 -36709 -29378 -15724 -50406
13571e0406j9190q570Q843J9648J4930J9776K2532j829l6016R234J0629r160r916
$$ -50406 -69596 -78166 -69323 -49675 -34745 -14969 7563 5734 -30282 -21048 -10419 -19579 -29495
13558b9495K5030P04J5646l3602k8239l1362L151K4283K8922L4813m323J0845
$$ -29495 -4465 -3761 11885 -21717 -49956 -81318 -78167 -53884 -24962 9851 5528 16373
13546A6373n803m3083j1184n824P162O209J3408m236J0314J481o964k487n510
$$ 16373 10570 -32513 -43697 -49521 -42359 -36150 -22742 -26978 -16664 -15183 -22147 -24634 -30144
13533c0144l8089O79Q222r929n536J4553P596l637K1015N748j2728K833j854p964
$$ -30144 -68233 -67554 -59332 -69261 -74797 -60244 -52648 -56285 -35270 -29522 -42250 -39417 -41271 -49235
13519d9235p611K1681R218l12l3077k9517k3486J5321L308K8094J8941J5468L2504
$$ -49235 -56846 -35165 -25947 -26259 -59336 -88853 -112339 -97018 -93710 -65616 -46675 -31207 1297
13506A297j9059j3412l4118M50L0203L3582j2866m2673m578J0565j2740k0711
$$ 1297 -17762 -31174 -65292 -64842 -34639 -1057 -13923 -56596 -61174 -50609 -63349 -84060
13494h4060j0057J8823m989J1997J2967K3618J6510k0384r741m8344l0418K3783
$$ -84060 -94117 -75294 -80283 -68286 -55319 -31701 -15191 -35575 -45316 -93660 -124078 -100295
13482a00295q141m505O059J5275j2875J366j5709k583M6629Q05j3059j0963J0453
$$ -100295 -108436 -112941 -106882 -91607 -104482 -103116 -118825 -121408 -74779 -73974 -87033 -97996 -87543
13469h7543K3680M5438J7982k9973r259K753j0265K236l087n550J5958L1331P751
$$ -87543 -63863 -18425 -443 -30416 -39675 -36922 -47187 -44951 -48038 -53588 -37630 -6299 1452
13456A452k101k5260l2329r556l0414j0934K0586M1789n06q606m594P353m936
$$ 1452 -649 -25909 -58238 -67794 -98208 -109142 -88556 -46767 -47273 -55879 -60473 -53120 -58056
13443e8056Q318J0092R829o029k8305Q798M913O27J4279J7687r943j1524K7201
$$ -58056 -49738 -39646 -29817 -35846 -64151 -55353 -50440 -49813 -35534 -17847 -27790 -39314 -12113
13430a2113j2028l1598m867M868j674k7999j7750K6552L095l482J1549J6295J7226
$$ -12113 -24141 -55739 -60606 -55738 -57412 -85411 -103161 -76609 -73514 -76996 -65447 -49152 -31926
13417c1926J6562k0443p254j0369m524j8157j0133P922P556J9158j671k41j9217
$$ -31926 -15364 -35807 -43061 -53430 -57954 -76111 -86244 -78322 -70766 -51608 -53279 -53520 -72737
13404g2737k0423L084L0296J9309J301J4206K3737l855l7755n15K037J3604M6145
$$ -72737 -93160 -90076 -59780 -40471 -39170 -24964 -1227 -5082 -42837 -43352 -41315 -27711 18434
13391A8434L8996r73j9126k9270k1639K678L8943L2507N410m109K286K415o494
$$ 18434 57430 56457 37331 8061 -13578 -10900 28043 60550 65960 61851 64137 66552 60058
13378F0058P109n052j2294L733k0348o8671j6446L8865K1366l687o40Q425J0734
$$ 60058 67167 62115 49821 53554 33206 -35465 -51911 -13046 8320 4633 3993 12418 23152
13365B3152J9880j716j2796K0128J9755P497J0967j6117R860R873j41j2147J7965
$$ 23152 43032 41316 28520 48648 68403 75900 86867 70750 80610 90483 90342 78195 96160
13352I6160j7935j2163l020q398j4921J335j091M054q663j5999k8935j6888j407
$$ 96160 78225 66062 63042 54644 39723 41058 39967 44021 35358 19359 -9576 -26464 -27871
13339b7871L582m3018R776L4603J763J9847K0034N515r857L3271K1824j9371r712
$$ -27871 -24289 -67307 -57531 -22928 -21165 -1318 18716 24231 14374 47645 69469 50098 40386
13326D0386O986K9043M639j5110j9764k1696p461L952J8144j3689k5137p377K2613
$$ 40386 47372 76415 81054 65944 46180 24484 17023 20975 39119 25430 293 -7084 15529
13313A5529j0554l0398J4643J1515j5279l869k045j5492k3216j1252n54J6822
$$ 15529 4975 -25423 -10780 735 -14544 -18413 -20458 -35950 -59166 -70418 -70972 -54150
13301e4150N685Q861J3155K9636j2375n421J3801J838k1005j7727K4888J371k472
$$ -54150 -48465 -39604 -26449 3187 -9188 -14609 -808 1030 -19975 -37702 -12814 -11443 -13915
13288a3915J111q591j4100k0205J8540J7220l11q846m801k3923J5740J802J8300
$$ -13915 -12804 -21395 -35495 -55700 -37160 -19940 -20251 -29097 -33898 -57821 -42081 -40279 -21979
13275b1979J494K391o203j0370J5853l962o676Q346j1098K1852J1788l089q531
$$ -21979 -20485 -18094 -24297 -34667 -18814 -22776 -29452 -21106 -32204 -10352 1436 -1653 -10184
13262a0184k8315k4137k0274j7427J7736K735l141m495j3973k5226J3159O9946
$$ -10184 -38499 -62636 -82910 -100337 -82601 -79866 -83007 -87502 -101475 -126701 -113542 -43596
13250d3596M0128k0917q867M3242l462l671j2591j1950k983k5294J9311L858K3358
$$ -43596 -3468 -24385 -33252 9990 6528 2857 -9734 -21684 -24667 -49961 -30650 -26792 -3434
13237c434J0619J7794J1091j7991M419j504k2320l6871j0606N758q90J5086M123
$$ -3434 7185 24979 36070 18079 22498 20994 -1326 -38197 -48803 -43045 -43935 -28849 -24726
13224b4726k0164j3932K3862K9441J4222n933m627k5636j1044k617K5093J4336
$$ -24726 -44890 -58822 -34960 -5519 8703 2770 -1857 -27493 -38537 -41154 -16061 -1725
13212a725M985n884r760j4764j349J6975n087j6050o416K4455K1145j1458k2646
$$ -1725 3260 -2624 -12384 -27148 -28497 -11522 -16609 -32659 -39075 -14620 6525 -4933 -27579
13199b7579N029Q390K0451Q109o521n267K2086J9227J1314m634J463m227r18k9632
$$ -27579 -22550 -14160 6291 14400 7879 2612 24698 43925 55239 50605 52068 47841 46923 17291
13185A7291j9048J9365k0648N670K6647J6273j32R957R979l6532m9461j4685L343
$$ 17291 -1757 17608 -3040 2630 29277 45550 45418 55375 65354 28822 -20639 -35324 -31981
13172c1981K4099m33J0124N947M138K68J0136r987m908L345l978j1500N491j4057
$$ -31981 -7882 -8315 1809 7756 11894 12162 22298 12311 7403 10748 6770 -4730 761 -13296
13158a3296m414J6671j5778j9367Q445J044K1655o66l1970Q014L4442m970J716
$$ -13296 -17710 -1039 -16817 -36184 -27739 -26695 -5040 -5706 -37676 -29662 4780 -190 1526
13145A526J8617N116M837l90L258J4630k3157j3922K721j2259q97j3965l5655
$$ 1526 20143 25259 30096 29706 32964 47594 24437 10515 13236 977 80 -13885 -49540
13132d9540k5534J070m876J0210J4307L370K180k762J564J6360K1913J5449P084
$$ -49540 -75074 -74004 -78880 -68670 -54363 -50993 -48813 -51575 -50011 -33651 -11738 3711 10795
13119A0795J1499n490j1641j7352J2208J7247J2937p571M477o57q36j7371j7794
$$ 10795 22294 16804 5163 -12189 19 17266 30203 22632 27109 26452 25616 8245 -9549
13106i549k1387N54J3382J9913J9833K0746k8051l4823K6418K877q38P609J0024
$$ -9549 -30936 -30382 -17000 2913 22746 43492 15441 -19382 7036 9913 9075 16684 26708
13093B6708Q568j4727k3431j2617J0430L631P290J2526j6399l3134P06M780L666
$$ 26708 35276 20549 -2882 -15499 -5069 -1438 5852 18378 1979 -31155 -30449 -25669 -22003
13080b2003j5503n370L1380L6117R743k4040m632j6091j7072k23K0125l977L701
$$ -22003 -37506 -42876 -11496 24621 34364 10324 5692 -10399 -27471 -27694 -7569 -11546 -7845
13067g845p399O56Qm015J1461j0224j2700k781J9709K5372J3348O171m646o296
$$ -7845 -15244 -14588 -14580 -18595 -7134 -17358 -30058 -32839 -13130 12242 25590 31761 27115 20819
13053B0819j6825j0842o678p9J261m899J2188J2920J989P736k3726k6193K25K7904
$$ 20819 3994 -6848 -13526 -13605 -12344 -17243 -5055 7865 9854 17590 -6136 -32329 -32104 -4200
13039d200m2O520O371r981q243J7390J1396j6930j4359L780L2495R357J6668r052
$$ -4200 -4242 2278 8649 -1332 -9575 7815 19211 2281 -12078 -8298 24197 33554 50222 41170
13025D1170k281p873k6643k913J0079j4973n565l607r414j8415J7918O722q833
$$ 41170 38889 31016 4373 1460 11539 -3434 -8999 -12606 -22020 -40435 -22517 -15795 -24628
13012b4628J2656m036l890p095r703P769K203K2274K2858j9459k411P6p724l613
$$ -24628 -11972 -16008 -19898 -26993 -36696 -28927 -26724 -4450 18408 -1051 -3462 -3386 -11110 -14723
12998a4723N782r20Q736K8120r97j7201j5639J0345j6178r580Q658L269K129M02
$$ -14723 -8941 -9861 -1125 26995 25998 8797 -6842 3503 -12675 -22255 -13597 -10328 -8199 -7797
12984g797j0300J0192J735L424P52N201j3922J6106J7903j0171k1290J3812J7764
$$ -7797 -18097 -7905 -6170 -2746 -1994 3207 -10715 5391 23294 13123 -8167 5645 23409
12971B3409N307j5687j5061j275J4066P111Q5l020j1851K8214O06k0123j4448
$$ 23409 28716 13029 -2032 -3307 10759 17870 17955 14935 3084 31298 31904 11781 -2667
12958b667J0374j2158K0062L1269p31j0030k2505j626j3800j6065L3049Q839m065
$$ -2667 7707 -4451 15611 46880 46149 36119 13614 11988 -1812 -17877 15172 24011 19946
12945A9946j6490r698k1763k233K0933l953k2722R716K056K0483M081M976r707
$$ 19946 3456 -6242 -28005 -30238 -9305 -13258 -35980 -26264 -24208 -3725 356 5332 -4375
12932d375n172J8608j564l9679J0667L7823J3031k776j29j0772j7843J3984K0606
$$ -4375 -9547 9061 7497 -32182 -21515 16308 29339 26563 26434 15662 -2181 11803 32409
12919C2409J391N490N068m7752l3300L871l243L1800L0716k3094p235K422J1666
$$ 32409 33800 39290 44358 -3394 -36694 -32823 -36066 -4266 26450 3356 -3879 -1457 10209
12906A0209o93j8440J4930L2432J7511j1686m0536k2745L2738L787m21L4282J7669
$$ 10209 9516 -8924 6006 38438 55949 44263 3727 -19018 13720 17507 17086 51368 69037
12893F9037k5873m7896O097Q060P054l956J7222J9324p730j9109k408J400k8320
$$ 69037 43164 -4732 1365 9425 16479 12523 29745 49069 41339 22230 19822 21222 -7098
12880g098m4647J0379J3628M972J7846j2693N320P35j1648k637K6070R510j5791
$$ -7098 -51745 -41366 -27738 -22766 -4920 -17613 -12293 -11558 -23206 -25843 227 9737 -6054
12867f054J2636Q969J9888O410J0003j496j1060p073l1822J5256m117q041j648
$$ -6054 6582 15551 35439 41849 51852 50356 39296 32223 401 15657 11540 3499 1851
12854A851K2927j2627j8906J9875L756K304K0032N670M577J2425J4257J1009q100
$$ 1851 24778 12151 -6755 13120 16876 19180 39212 44882 49459 61884 76141 87150 79050
12841G9050N558n666P626j4007K704K3636L0111J1004p005K8591k1253j7319J036
$$ 79050 84608 78942 86568 72561 75265 98901 129012 140016 133011 161602 140349 123030 124066
12828A24066k4604j5165q490j4572K3790O998k5039j9578j546K48L0413J2360
$$ 124066 99462 84297 75807 61235 85025 92023 66984 47406 45860 46108 76521 88881
12816H8881n725r980J2612J3062j1332N228K194N275L9650O5848K0979J0939K0978
$$ 88881 83156 73176 85788 98850 87518 92746 94940 100215 139865 205713 226692 237631 258609
12803B58609L3522P2897P5461J4268K8205R0292Q8461P7901M5740K6099N3082
$$ 258609 292131 365028 440489 454757 482962 573254 661715 739616 785356 811455 864537
12792H64537Q2159O0726m03k2111j4096p352l5558k8444j9876l0566l8065k3836
$$ 864537 946696 1007422 1007019 984908 970812 963460 927902 899458 879582 849016 810951 787115
12780G87115l283P201l612J0260K0984J1255K9207L5027K6374O972J5969M6432
$$ 787115 783832 791033 787421 797681 818665 829920 859127 894154 920528 927500 943469 989901
12768I89901O8906M3170L3019N1785L6877M6503M8543L0696L3514M1396K0183
$$ 989901 1058807 1101977 1134996 1186781 1223658 1270161 1318704 1349400 1382914 1424310 1444493
12757A444493K1238M618n058k2953k1201J0981r1m0792m8077k9907J12l2505j0050
$$ 1444493 1465731 1470349 1465291 1442338 1421137 1432118 1432027 1391235 1343158 1313251 1313363 1280858 1270808
12744A270808l299l8209l0770j4557j5417J9474J2905l8070k3573J0810n019j6168
$$ 1270808 1267509 1229300 1198530 1183973 1168556 1188030 1200935 1162865 1139292 1150102 1145083 1128915
12732A128915k6697l5131q395P242J4213k95k2935l2664l7590m705L068j4900
$$ 1128915 1102218 1067087 1058692 1065934 1080147 1079852 1056917 1024253 986663 981958 985026 970126
12720I70126n7904l9446j3096j5556m1287l2165p0970p6947q2365n2515k6255
$$ 970126 912222 872776 859680 844124 802837 770672 699702 622755 540390 487875 461620
12709D61620n6587l4763j6611o436j5596r656q175l901j7936j2484m3106m4428
$$ 461620 405033 370270 353659 347223 331627 321971 313796 309895 291959 279475 236369 191941
12697A91941k423o3j2573j0548O935J6535o279K0294N887j3094k1339j8636k2936
$$ 191941 189518 189455 176882 166334 173269 189804 183525 203819 209706 196612 175273 156637 133701
12684A33701J742l908m2505j3179J4091J3526p389J651m392l253J817j6402j60
$$ 133701 135443 131535 89030 75851 89942 103468 96079 97730 93338 90085 91902 75500 75340
12671G5340P706q869O56J534J6848l91k3714k3593K0631L0267K4603Q209n0071
$$ 75340 83046 74177 74833 76367 93215 92824 69110 45517 66148 96415 121018 129227 79156
12658G9156l8462j4886K532N093p572M420j4983m457L1962k3068k652L0616r327
$$ 79156 40694 25808 28340 33433 25861 30281 15298 10841 42803 19735 17083 47699 38372
12645C8372n972N978P117M70j5058k0073k0871k041j7J5480K8948N595j7326L235
$$ 38372 32400 38378 45495 45965 30907 10834 -10037 -12078 -12095 3385 32333 37928 20602 23837
12631B3837J8719L8218M5006K3290j1220j0984J1671J3744p885n920R973M933
$$ 23837 42556 80774 125780 149070 137850 126866 138537 152281 144396 138476 148449 153382
12619A53382M779o264o616J2006J3058k934o086L7930K8578j8079l2109k0180
$$ 153382 158161 151897 145281 157287 170345 167411 161325 199255 227833 209754 177645 157465
12607A57465K707k670L2583Q49n0649r230K1274K9113L2664N93j2623J4903L2359
$$ 157465 160172 157502 190085 190934 140285 131055 152329 181442 214106 214699 202076 216979 249338
12594B49338K0013J5413M710Q345K2682K0021R009m436l4832j4556q8L762j7744
$$ 249338 269351 284764 289474 297819 320501 340522 349531 345095 310263 295707 295619 299381 281637
12581B81637j4874J2314J8600k0166j0016j4395n838j3838q503J6856R101K982
$$ 281637 266763 279077 297677 277511 267495 253100 247262 233424 224921 241777 250878 253860
12569B53860j305m7216K286N777O715J2587l8825l2416m683l0515R955p893l68
$$ 253860 252555 205339 207625 213402 220117 232704 193879 161463 156780 126265 136220 128327 127959
12556A27959N890J1906j4744r625p433j9301P940L4893r197j7531N279K903k935
$$ 127959 133849 145755 131011 121386 113953 94652 102592 137485 128288 110757 116036 118939 116004
12543A16004J6424M743j415j2090j7462O488J7230J3754j0433k4711j4639k0105
$$ 116004 132428 137171 135756 123666 106204 112692 129922 143676 133243 108532 93893 73788
12531G3788k1771j6707l6912J547o34k113L0354J3607o236L3732J7602L5837M682
$$ 73788 52017 35310 -1602 -55 -689 -2802 27552 41159 34923 68655 86257 122094 126776
12518A26776R353L6918M1010N2007L7934J1299k166K1524K8332M6977K3802K7854
$$ 126776 136129 173047 214057 266064 303998 315297 313131 334655 362987 409964 433766 461620
12506D61620M0081N8865M2197K2515M2357N8086K1648L1884K9305L8882N5427
$$ 461620 501701 560566 602763 625278 667635 725721 747369 779253 808558 847440 902867
12495I02867N0009N8290N3549N1521M8118J7892M396M4714L3380K1667L6077L4416
$$ 902867 952876 1011166 1064715 1116236 1164354 1182246 1186642 1231356 1264736 1286403 1322480 1356896
12483A356896K8227K3788K6165K9059L9854M5465M4616M1720K4010N1878M9747
$$ 1356896 1385123 1408911 1435076 1464135 1503989 1549454 1594070 1635790 1659800 1711678 1761425
12472A761425J5745N0749J4284M8526L5379K3353N2618L1964N655M2086L7829
$$ 1761425 1777170 1827919 1842203 1890729 1926108 1949461 2002079 2034043 2039698 2081784 2119613
12461B119613L5531O3435L9246J6845M6947L9552N3716P5022L7199K6702O1383
$$ 2119613 2155144 2218579 2257825 2274670 2321617 2361169 2414885 2489907 2527106 2553808 2615191
12450B615191L4729R907L5375M8125M1938L9961J4680J5889K8845N6239Q9901
$$ 2615191 2649920 2659827 2695202 2743327 2785265 2825226 2839906 2855795 2884640 2940879 3030780
12439C030780M4997K9578N7111O7092Q8601Q1880J02943P4466N9931L9553Q4735
$$ 3030780 3075777 3105355 3162466 3229558 3318159 3400039 3502982 3577448 3637379 3676932 3761667
12428C761667Q2643K4953K5046N5389P5485Q7005N1917M4154P9312J19486J11880
$$ 3761667 3844310 3869263 3894309 3949698 4025183 4112188 4164105 4208259 4287571 4407057 4518937
12417D518937Q1335O9554Q9333J37420J36568J69848J89486K30233K24907K32800
$$ 4518937 4600272 4669826 4759159 4896579 5033147 5202995 5392481 5622714 5847621 6080421
12407F080421K50220K56584K76498L22355L69056L98797M21085M28777M28258
$$ 6080421 6330641 6587225 6863723 7186078 7555134 7953931 8375016 8803793 9232051
12398I232051M72680N26668N32155N94881O25376O93739P94107Q40953R53482
$$ 9232051 9704731 10231399 10763554 11358435 11983811 12677550 13471657 14312610 15266092
12389A5266092J062005J191022J330100J469741J617099J810394J964383K163564
$$ 15266092 16328097 17519119 18849219 20318960 21936059 23746453 25710836 27874400
12381B7874400K391340K600916K932023L374490L823236M434782N235454O039843
$$ 27874400 30265740 32866656 35798679 39173169 42996405 47431187 52666641 58706484
12373E8706484O904083P731857Q387952Q975391R564245J0104069J0397650J0201917
$$ 58706484 65610567 73342424 81730376 90705767 100270012 110374081 120771731 130973648
12365A30973648R312762P922393O322090M627421K953607J309614j02225j135806
$$ 130973648 140286410 148208803 154530893 159158314 162111921 163421535 163319310 162183504
12357A62183504j654164j764387j543743j062232m48402L72589J241913K109475
$$ 162183504 160529340 158764953 157221210 156158978 155710576 156083165 157325078 159434553
12349A59434553K864801L498062M026407M421779M782125N080255N375642N635897
$$ 159434553 162299354 165797416 169823823 174245602 179027727 184107982 189483624 195119521
12341A95119521N909832O123257O286859O392506O327414O188426O004100N805589
$$ 195119521 201029353 207152610 213439469 219831975 226159389 232347815 238351915 244157504
12333B44157504N739735N772912N777592N511049M679355L321617J686579P6987
$$ 244157504 249897239 255670151 261447743 266958792 271638147 274959764 276646343 276723330
12325B76723330j258488k303701l146769l912488m695973n393222n718889n612958
$$ 276723330 275464842 273161141 270014372 266101884 261405911 256012689 250293800 244680842
12317B44680842n146973m471966l776191l314501l167068l172128l150374l081182
$$ 244680842 239533869 235061903 231285712 227971211 224804143 221632015 218481641 215400459
12309B15400459k995758l000070l149117l367805l673241l936472m084337m163840
$$ 215400459 212404701 209404631 206255514 202887709 199214468 195277996 191193659 187029819
12301A87029819m271828m517744n062373n799020o562748p089673p239788p143633
$$ 187029819 182757991 178240247 173177874 167378854 160816106 153726433 146486645 139343012
12293A39343012p045507p114251p274999p264890o955467o514706o012012n502835
$$ 139343012 132297505 125183254 117908255 110643365 103687898 97173192 91161180 85658345
12285H5658345n007794m575647m171012l906218l710677l501872l278907l078284
$$ 85658345 80650551 76074904 71903892 67997674 64286997 60785125 57506218 54427934
12277E4427934k865780k684448k540880k422963k262627k118278j988697j814945
$$ 54427934 51562154 48877706 46336826 43913863 41651236 39532958 37544261 35729316
12269C5729316j644082j516673j330447j205349j096995j033275j003055r42408
$$ 35729316 34085234 32568561 31238114 30032765 28935770 27902495 26899440 25957032
12261B5957032q52494q67931q33896p77376p55275o82874o87209o48320o06918
$$ 25957032 25104538 24236607 23402711 22625335 21870060 21187186 20499977 19851657 19244739
12252A9244739o07690o14561n70175n53494n29574n15320n29841n20384n00138
$$ 19244739 18637049 18022488 17452313 16898819 16369245 15853925 15324084 14803700 14303562
12243A4303562m61468m16292m46446m39923l95416l83267l60976l64278l57193
$$ 14303562 13842094 13425802 12979356 12539433 12144017 11760750 11399774 11035496 10678303
12234A0678303l30940l46535l27783k92935l30572l20337k63094k52932k46155
$$ 10678303 10347363 10000828 9673045 9380110 9049538 8729201 8466107 8213175 7967020
12225G967020k27440k13259j99822j99512k05633k26927j96303j67851j47363
$$ 7967020 7739580 7526321 7326499 7126987 6921354 6694427 6498124 6330273 6182910
12216F182910q8867j30688j82188j37688r4324r9984p0299q9519r3510q4049r3754
$$ 6182910 6094043 5963355 5781167 5643479 5549155 5449171 5378872 5289353 5195843 5111794 5018040
12205E018040r7580j09618q0659r0356j10468j31959o6908m2457p7987q6818q3395
$$ 5018040 4920460 4810842 4730183 4639827 4529359 4397400 4330492 4288035 4210048 4123230 4039835
12194D039835r3230q5393p3487o9032p4795n1085n2960n4388o7401m3526l6336
$$ 4039835 3946605 3861212 3787725 3718693 3643898 3592813 3539853 3485465 3418064 3374538 3338202
12183C338202m8958k3883n792l621L2505J8953j6309J3184J8416L515r763j6277
$$ 3338202 3289244 3265361 3259569 3255948 3288453 3307406 3291097 3304281 3322697 3326212 3316449 3300172
12171C300172J0305R017O474J5920k8044m136q526k9580k2153j8751l9774m1346
$$ 3300172 3310477 3319494 3325968 3341888 3313844 3309708 3301182 3271602 3249449 3230698 3190924 3149578
12159C149578l652q611l8224l4732l1233l0385j5876m5890n0287j3313j4092m6897
$$ 3149578 3145926 3137315 3099091 3064359 3033126 3002741 2986865 2940975 2890688 2877375 2863283 2816386
12147B816386o3512n0360j9767j2377L011k9378n737R996r944l8157k0554j9347
$$ 2816386 2752874 2702514 2682747 2670370 2673381 2644003 2638266 2648262 2638318 2600161 2579607 2560260
12135B560260j2372j6866j0347n81k751m9639m0066k3680l9876o1202m4364o4406
$$ 2560260 2547888 2531022 2520675 2520094 2517343 2467704 2427638 2403958 2364082 2302880 2258516 2194110
12123B194110j4120M718j061o0808o9883L242j0832m3601l3350j8415l0443l9966
$$ 2194110 2179990 2184708 2183647 2122839 2052956 2056198 2045366 2001765 1968415 1950000 1919557 1879591
12111A879591l7769k6921k9901k4603Jm3740l5328l5601m9338m0641k5182j8589
$$ 1879591 1841822 1814901 1785000 1760397 1760398 1716658 1681330 1645729 1596391 1555750 1530568 1511979
12099A511979k6046k0723q035k4457m5388j2554j6689l2880l0961l6662k9887
$$ 1511979 1485933 1465210 1457175 1432718 1387330 1374776 1358087 1325207 1294246 1257584 1227697
12088A227697m1844n8050l0564m5745j3107K499k0012l7513k4408m459j5550Q860
$$ 1227697 1185853 1127803 1097239 1051494 1038387 1040886 1020874 983361 958953 954494 938944 947804
12076I47804J0756l6438k7138N625R264Q365j8216k8763J9706j0031j7108j4186
$$ 947804 958560 922122 894984 900609 909873 918238 900022 871259 890965 880934 863826 849640
12064H49640O856l4576n2317k4858j4592K2128j6643k7750k203l714k4128n361
$$ 849640 856496 821920 769603 744745 730153 752281 735638 707888 705685 701971 677843 672482
12052F72482m166p543j7748k3465j7006j6000N443k399k3498q739J5865L4021
$$ 672482 668316 660773 643025 619560 602554 586554 591997 589598 566100 557361 573226 607247
12040F07247L3133j7548k2883l9587j7411j4367j2933O293Q027J1938j6798k8241
$$ 607247 640380 622832 599949 560362 542951 528584 515651 521944 529971 541909 525111 496870
12028D96870N470k613k8604l7287K760J3026J2517n796k2538j0326j1090K3034
$$ 496870 502340 499727 471123 433836 436596 449622 462139 456343 433805 423479 412389 435423
12016D35423L2393O191r932J1288m784Q671l399J3798k5035j7389j8196k0263
$$ 435423 467816 474007 464075 475363 470579 479250 475851 489649 464614 447225 429029 408766
12004D08766k6255L637J6192J3616Q555j9270k503K63O518Q06J1962J1997J5476
$$ 408766 382511 386148 402340 415956 424511 405241 402738 403001 409519 410325 422287 434284 449760
11991D49760l5235j9752l76R091l4781j7704o618k5095P650N387J6726J8625r698
$$ 449760 414525 394773 394397 403488 368707 351003 344385 319290 326940 332327 349053 367678 357980
11978C57980O78J1382j7122l7027J0672J3051r722j9343j2005L6302J3063j2438
$$ 357980 358658 370040 352918 315891 326563 339614 329892 310549 298544 334846 347909 335471
11966C35471K8490L200r693j1922j5515J8683R891p025j92j2438J1218K6316L473
$$ 335471 363961 367161 357468 345546 330031 348714 358605 351580 351388 338950 350168 376484 379957
11953C79957j3935j3618K500L0246K2213J8325K0613J5840P083j627J4809J8314
$$ 379957 366022 352404 354904 385150 407363 425688 446301 462141 469224 467597 482406 500720
11941E00720J5841O120L4417L9723L3327L1246K3733M3018L3509K1682L4614O5592
$$ 500720 516561 522681 557098 596821 630148 661394 685127 728145 761654 783336 817950 883542
11929H83542M0247J6813M4496K101K949K6020K0655J4375J0817J6139j6467K3710
$$ 883542 923789 940602 985098 987199 990148 1016168 1036823 1051198 1062015 1078154 1061687 1085397
11917A085397K6857J9435J0561P656K5570M5543P118J3542L2521K6153N3191J3622
$$ 1085397 1112254 1131689 1142250 1149906 1175476 1221019 1228137 1241679 1274200 1300353 1353544 1367166
11905A367166P082K7390L3843L1509L7835L6890J2823N576J0436M2977J4348K2668
$$ 1367166 1374248 1401638 1435481 1466990 1504825 1541715 1554538 1560114 1570550 1613527 1627875 1650543
11893A650543M0735M583j0426j1594j6765j5414m5547j3624k2687j2547k5190
$$ 1650543 1691278 1695861 1685435 1673841 1657076 1641662 1596115 1582491 1559804 1547257 1522067
11882A522067k2204l8517k6801j3814m517k1423l7616k9218j3994j5407r294k3087
$$ 1522067 1499863 1461346 1434545 1420731 1416214 1394791 1357175 1327957 1313963 1298556 1289262 1266175
11870A266175L846k4116q496k9739l3200l0152n9751m1502l2846k5247k6700l2817
$$ 1266175 1270021 1245905 1237409 1207670 1174470 1144318 1084567 1043065 1010219 984972 958272 925455
11858I25455m3794m5765j6933k6049k5390n0763l3018k6891k261k2124k9715j6361
$$ 925455 881661 835896 818963 792914 767524 716761 683743 656852 654591 632467 602752 586391
11846E86391k2203l0610k9050k4681k7651j2932j5446j1334q630J84M502m284
$$ 586391 564188 533578 504528 479847 452196 439264 423818 412484 403854 404038 408540 404256
11834D04256J3724l5140j7611p418m8500Q56L915J897K680p476l44p042j6462
$$ 404256 417980 382840 365229 357811 309311 310167 314082 315979 318659 311183 310839 303797 287335
11821B87335j6923R005K8228J8675l213l1987j2562k0333J0961q534k8167k3834
$$ 287335 270412 279417 307645 326320 323107 291120 278558 258225 269186 260652 232485 208651
11809B08651R261P244p470k541j7595o990L479n150Q076j390N523j6458l052O113
$$ 208651 217912 225156 217686 215145 197550 190560 194039 188889 196965 195575 201098 184640 181588 187701
11795A87701J2675J2356r378j0372r596J1848O057j1378m862j3625Q446j7272
$$ 187701 200376 212732 203354 192982 183386 195234 201291 189913 185051 171426 179872 162600
11783A62600k9735k661n608n970l6508L0238J3537r57j7017J7737n052r532k3970
$$ 162600 132865 130204 124596 118626 82118 112356 125893 124936 107919 125656 120604 111072 87102
11770H7102J861L3002J5842j1053J6389J4424o460L2006l545k2817r311L20j69
$$ 87102 88963 121965 137807 126754 143143 157567 151107 183113 179568 156751 147440 147760 147591
11757A47591q811L630j8100L6799J7229j5394p530K823k1293j6753J3947R609
$$ 147591 138780 142410 124310 161109 178338 162944 155414 158237 136944 120191 134138 143747
11745A43747K6793K1383O602K2918J526j2760J4940L0018p933j1613j9018k0837
$$ 143747 170540 191923 198525 221443 222969 210209 225149 255167 247234 235621 216603 195766
11733A95766q637L544k281j9775j6229j7016Q306K8213K6825J4190J5913q406
$$ 195766 187129 190673 188392 168617 152388 135372 143678 171891 198716 212906 228819 220413
11721B20413k0914j9391R826K7003L1159j6495l9851P324J6834P126j3007j9212
$$ 220413 199499 180108 189934 216937 248096 231601 191750 199074 215908 223034 210027 190815
11709A90815J6720Q690j3466j5756m342q721J4106R767J479j519j9961j6309J715
$$ 190815 207535 216225 202759 187003 182661 173940 188046 197813 199292 197773 177812 161503 163218
11696A63218j4116l3155m2R895J5658J8452K5928n155p259q579k4632N513O550
$$ 163218 149102 115947 115905 125800 141458 159910 185838 180683 173424 164845 140213 145726 152276
11683A52276L6033K5363j1529j4726j1029L535K513k9259k5480r433J5670J380
$$ 152276 188309 213672 202143 187417 176388 179923 182436 153177 127697 118264 133934 135314
11671A35314j6611k0528r44P755K431l391J9706J6768l3507l6850r065P952L6375
$$ 135314 118703 98175 97231 104986 107417 104026 123732 140500 106993 70143 61078 69030 105405
11658A05405N373l063m674k7021j1475j994R150R79M480K1666O756l2670o876
$$ 105405 110778 107715 103041 76020 64545 62551 71701 72680 77160 98826 105582 72912 66036
11645F6036M946p051J764j898m061P009r778K5366N141J1402j5194k8785j6641
$$ 66036 70982 63931 65695 63797 59736 66745 56967 82333 87474 98876 83682 54897 38256
11632C8256k8463J2232O8579j810o456O740k2401k9266l757R873J3475J84J4057
$$ 38256 9793 22025 90604 88794 82338 89078 66677 37411 33654 43527 57002 57186 71243
11619G1243K8610j1046m57l764O717j7154k6718J0239l742K6300P070l5992r613
$$ 71243 99853 88807 88350 84586 91303 74149 47431 57670 53928 80228 87298 51306 41693
11606D1693R510Q216K7711j4512n363K9163k901k5488m953j1645K7546K5569J2948
$$ 41693 51203 59419 87130 72618 67255 96418 93517 68029 63076 51431 78977 104546 117494
11593A17494L4924J8787k409k5485l8627n365l159j4963j2019n214K3307K1802
$$ 117494 152418 171205 168796 143311 104684 99319 96160 81197 69178 63964 87271 109073
11581A09073j3544J481K293j4553p538o610Q495l242K7123K4066m2739k4159j0585
$$ 109073 95529 97010 99303 84750 77212 70602 79097 75855 102978 127044 84305 60146 49561
11568D9561O56o995R774j314j1468m1728n596M1889L0392O485M311j3720j1828
$$ 49561 50217 43222 52996 51682 40214 -1514 -7110 34779 65171 71656 75967 62247 50419
11555E0419o904j5430o395L3635L0130J5871K5198m018P977J2799P385k0968l2659
$$ 50419 43515 28085 21690 55325 85455 101326 126524 122506 130483 143282 150667 129699 97040
11542I7040j2698j5447k131J6503N384j4309K0441k3158l0005o338J1133K6267
$$ 97040 84342 68895 66764 83267 88651 74342 94783 71625 41620 35282 46415 72682
11530G2682L148j6644J4107L073l780J5725K0471p688p907j7022k6197p675k874
$$ 72682 75830 59186 73293 76366 72586 88311 108782 101094 93187 76165 49968 42293 39419
11517C9419o655j1769m059j4885J285K8243J3238j3215j5898N601K8286K4861
$$ 39419 32764 20995 16936 2051 3336 31579 44817 31602 15704 21305 49591 74452
11505G4452K9889J4548j3935q856P618J3822k551j8734R227Q388k6790j5911m533
$$ 74452 104341 118889 104954 96098 103716 117538 114987 96253 105480 113868 87078 71167 66634
11492F6634J0443q999n416J558p084j8043k7529j0049L04P74K2132K0089J5221
$$ 66634 77077 68078 62662 64220 57136 39093 11564 1515 1819 2593 24725 44814 60035
11479F0035K8522k9969j8679P381q274l3576n382n627n397K6831J4119l045p330
$$ 60035 88557 58588 39909 47290 39016 5440 58 -5569 -10966 15865 29984 26939 19609
11466A9609K6446q460K4731K0890j9880r891j4794p935L6338j1489o552J5319
$$ 19609 46055 37595 62326 83216 63336 53445 38651 30716 67054 55565 49013 64332
11454F4332R364J0090K1779J8697L4018J1299L7027M056p865R209P18K19M562
$$ 64332 73696 83786 105565 124262 158280 169579 206606 210662 202797 212006 212724 212943 217505
11441B17505n372k1254R754r896j2599k1943K811j302j504j8775k3063j8009k0230
$$ 217505 212133 190879 200633 190737 178138 156195 159006 157704 156200 137425 114362 96353 76123
11428G6123j8333M504J0399R396Q253m709j9615R884l220j1914j6078j0559J8269
$$ 76123 57790 62294 72693 82089 90342 85633 66018 75902 72682 60768 44690 34131 52400
11415E2400J2202j3545k8067p957J8626J1512K1404o368J3025K6418l3419l2607
$$ 52400 64602 51057 22990 15033 33659 45171 66575 60207 73232 99650 66231 33624
11403C3624o08Q008M398n740J080J1844J2532M032j680k4111L634J1190l796p887
$$ 33624 33016 41024 45422 39682 40762 52606 65138 69170 67490 43379 47013 58203 54407 46520
11389D6520j2629l8615k680N5698J9823k0688q412n057R275k4715l330L5625J2391
$$ 46520 33891 -4724 -7404 48294 68117 47429 39017 33960 43235 18520 15190 50815 63206
11376F3206k3681J5879r750O255l92k890p775j7708J1310J1406j9408k3456K9954
$$ 63206 39525 55404 45654 51909 51517 48627 40852 23144 34454 45860 26452 2996 32950
11363C2950K0614Q528o635j8928J967k900j6742J270J4801j1848L625q546R53
$$ 32950 53564 62092 55457 36529 38496 35596 18854 20124 34925 23077 26702 18156 19109
11350A9109m609j0747j3181l706L30L6194J5213k6022k2002J3745K6309j8286
$$ 19109 14500 3753 -9428 -13134 -12804 23390 38603 12581 -9421 4324 30633 12347
11338A2347j0182P27K7944K8546J778j1208r696J568J1649J2373j3284j4700k5419
$$ 12347 2165 2892 30836 59382 61160 49952 40256 41824 53473 65846 52562 37862 12443
11325A2443j968J3041J4266j0781k2457l3653K3453J8287K1501j747j71o931l6085
$$ 12443 10475 23516 37782 27001 4544 -29109 -5656 12631 34132 32385 32214 25283 -10802
11312a0802n237Q847L468J9772j901N381q599l4611j6223J9907J9166K4141J2427
$$ -10802 -16039 -7192 -3724 16048 14147 19528 10929 -23682 -39905 -19998 -832 23309 35736
11299C5736J4528j5416n710j4279k0342r16j2217M540N944k0862Q193J6037R525
$$ 35736 50264 34848 29138 14859 -5483 -6399 -18616 -14076 -8132 -28994 -20801 -4764 4761
11286D761n021J3437P714j127K994K003j6612k4275k298M1142K6134K3941K0657
$$ 4761 -260 13177 20891 19764 22758 24761 8149 -16126 -18424 22718 48852 72793 93450
11273I3450L0637J1288K2471J2478q096L0844q299o131N287l1515l3669j4923
$$ 93450 124087 135375 157846 170324 162228 193072 184773 178642 183929 152414 118745 103822
11261A03822k9784j5927k5987j9536j5448N985J1254K0767R701o641r285R326
$$ 103822 74038 58111 32124 12588 -2860 3125 14379 35146 44847 38206 28921 38247
11249C8247j7472l5801q858L477K6223L2872n210j4093l8953R56K7028K950J7419
$$ 38247 20775 -15026 -23884 -20407 5816 38688 33478 19385 -19568 -18612 8416 11366 28785
11236B8785R948K906j3247l2428l730L9347L1705l0679k0912q635O007P830P790
$$ 28785 38733 41639 28392 -4036 -7766 31581 63286 32607 11695 3060 9067 16897 24687
11223B4687J7092n597J1016L5888J5804j5197k9244j9059M426k1286K493J059
$$ 24687 41779 36182 47198 83086 98890 83693 54449 35390 39816 18530 21023 22082
11211B2082J5780Q211j959l537K5485q865j2175o864J6486j8408k7915k522o371
$$ 22082 37862 46073 44114 40577 66062 57197 45022 38158 54644 36236 8321 5799 -572
11198e72l332J7680J1644M375L6868r468k8689j2624m2951q420J8570J8495n829
$$ -572 -3904 13776 25420 29795 66663 57195 28506 15882 -27069 -35489 -16919 1576 -4253
11185d253J2483N629J689O781q482J3338R152j5974j865Q200N939R84R967J2807
$$ -4253 8230 13859 15548 22329 13847 27185 36337 20363 18498 26698 32637 33621 43588 56395
11171E6395Q565r474k1939J316J5276q236K63J6326M5491L9270J2210l6340J6781
$$ 56395 64960 55486 33547 34863 50139 41903 42166 58492 103983 143253 155463 119123 135904
11158A35904M3141Q962k019J3741L931J7334J6486n689l2681k2565l4439m056
$$ 135904 179045 188007 185988 199729 203660 220994 237480 231791 199110 176545 142106 138050
11146A38050P378J8415j0085O289j3753m4727l6921q029j3656j0043J5851L9404
$$ 138050 145428 163843 153758 160047 146294 101567 64646 56617 42961 32918 48769 88173
11134H8173J7502q717j259j7144j9718l2491J132L4789K1583j8365l2935j4909
$$ 88173 105675 96958 95699 78555 58837 26346 27478 62267 83850 65485 32550 17641
11122A7641j2021K3959L4254j4293k7117j9384q629J391J3199K6277J4669L4638
$$ 17641 5620 29579 63833 49540 22423 3039 -5590 -4199 9000 35277 49946 84584
11110H4584K538K0068K9438L1370K5034J2779M0017O0456N2589L2096M5200L9712
$$ 84584 87122 107190 136628 167998 193032 205811 245828 306284 358873 390969 436169 475881
11098D75881Q0854O7378M3897K0364m3935p2074j08291r5405o4310o1880k5995
$$ 475881 556735 624113 668010 688374 644439 572365 464074 368669 304359 242479 216484
11087B16484k5959k971n907l3992l4269k3650j5970J6900K935o749j4322k454
$$ 216484 190525 187554 181647 147655 113386 89736 73766 90666 93601 86852 72530 70076
11075G0076K2005j5545J5889l758L180k0876k7344l2984l0868K7263J1892o787
$$ 70076 92081 76536 92425 88667 91847 70971 43627 10643 -20225 7038 18930 12143
11063A2143k1888k4981K6965L3467K1396J991J0829n267L428R802r118q015n6901
$$ 12143 -9745 -34726 -7761 25706 47102 49093 59922 54655 58083 67885 58767 50752 -6149
11050f149k0712K4993n44q253P088K5262Q382l130M522m4824k3903L195K8019
$$ -6149 -26861 -1868 -2412 -10665 -3577 21685 30067 26937 31459 -13365 -37268 -34073 -6054
11037f054J9465K0228N200k5093j9783j2747j0064o375K7461Q621k3840j186J4768
$$ -6054 13411 33639 38839 13746 -6037 -18784 -28848 -35223 -7762 859 -22981 -24167 -9399
11024i399J0001j7688j1892q579J0504j6856k3233J5785K5119k93j230l727O359
$$ -9399 602 -17086 -28978 -37557 -27053 -43909 -67142 -51357 -26238 -26531 -27761 -31488 -25129
11011b5129L1130Q544j5534j8618k5755J8497j20O205J088k5115k190k8817Q381
$$ -25129 6001 14545 -989 -19607 -45362 -26865 -26985 -20780 -19692 -44807 -46997 -75814 -67433
10998f7433L0639K6726j46L4955l8750l3903L394K6397K8766j0856m162p640p068
$$ -67433 -36794 -10068 -10214 24741 -14009 -47912 -44518 -18121 10645 -211 -4373 -12013 -19081
10985a9081j910l675m842O062M406P808q856j4898J2095O264j209r822P501J71
$$ -19081 -20991 -24666 -29508 -23446 -19040 -11232 -20088 -34986 -22891 -16627 -17836 -27658 -20157 -19986
10971a9986j7668M05j7024j4577N075P67J1655J1560n304o867J3711j836L8255
$$ -19986 -37654 -37249 -54273 -68850 -63775 -63008 -51353 -39793 -45097 -51964 -38253 -40089 -1834
10958a834J070J6604J769r381j18j8382o930l766R40K2842L6511K5221M298j1678
$$ -1834 -764 15840 17609 8228 8110 -10272 -17202 -20968 -20028 2814 39325 64546 68844 57166
10944E7166k9647l8387k9285j7843O048L7003J0341K207J46P037l0422o848Q845
$$ 57166 27519 -10868 -40153 -57996 -51948 -14945 -4604 -2397 -2251 4786 -25636 -32484 -23639
10931b3639K3109q933j1102L063p303j6572k5799J3872Q45K4196k0975n991K1772
$$ -23639 -530 -9463 -20565 -17502 -24805 -41377 -67176 -53304 -52459 -28263 -49238 -55229 -33457
10918c3457j0272J626P385j1978l959j0805O930K6353J5278K6572N295k5317L933
$$ -33457 -43729 -42103 -34718 -46696 -50655 -61460 -54530 -28177 -12899 13673 18968 -6349 -2416
10905b416k8904j1018K6157J8166o619j6509j9607j8316P24m747N047O63N690
$$ -2416 -31320 -42338 -16181 1985 -4634 -21143 -40750 -59066 -58342 -63089 -58042 -57379 -51689
10892e1689l0072k1006K8236N4071L9857j9073j0577j6958R749p97p09J5185O373
$$ -51689 -81761 -102767 -74531 -20460 19397 324 -10253 -27211 -17462 -18259 -18968 -3783 2590
10879B590L4499J9726j0316k4908l5711J2036J8017j0232l4405o831N858M862
$$ 2590 37089 56815 46499 21591 -14120 -2084 15933 5701 -28704 -35535 -29677 -24815
10867b4815K1864J9387K0531J8413m0275k4122J2449J7371J9322r680J360J1653
$$ -24815 -2951 16436 36967 55380 15105 -9017 3432 20803 40125 30445 31805 43458
10855D3458m590L594O714j6826J6377j037l6150k2535j1456J2934L5069L5251
$$ 43458 38868 42462 49176 32350 48727 47690 11540 -10995 -22451 -9517 25552 60803
10843F0803l6428l8503m293P059k2384j1845j187Q27K3392J2763n108j7549J5137
$$ 60803 24375 -14128 -18421 -11362 -33746 -45591 -46778 -45951 -22559 -9796 -14904 -32453 -17316
10830a7316Q372J4553J1621J0351n942o264q798J7720M025l268k1741K9675L4000
$$ -17316 -8944 5609 17230 27581 21639 15375 6577 24297 28322 25054 3313 32988 66988
10817F6988Q620j452r971o244n077p727l316J308J4862J7053k4055j433n490m840
$$ 66988 75608 74156 64185 57941 52864 45137 41821 43129 57991 75044 50989 49556 44066 39226
10803C9226m4707j6706P465j1408k0623L4062J9280r454j5253p636K4953L3761
$$ 39226 -5481 -22187 -14722 -26130 -46753 -12691 6589 -2865 -18118 -25754 -801 32960
10791C2960M1978J5018l669J3605r15L855M701j96j8376p795J0723r10j987q627
$$ 32960 74938 89956 86287 99892 98977 102832 107533 107337 88961 81166 91889 90979 88992 80365
10777H0365k4395k2850n480K0590K9234K6650j2258j138J9362m549K8233n712
$$ 80365 55970 33120 27640 48230 77464 104114 91856 90718 110080 105531 133764 128052
10765A28052K129K2973J2397j0426j3014q017K5167K8820J1984L4967M413R237
$$ 128052 130181 153154 165551 155125 142111 134094 159261 188081 200065 235032 239445 248682
10753B48682R380K8001J4560M395j3551k9422r054j4679L588J0415J0016j5563
$$ 248682 258062 286063 300623 305018 291467 262045 252991 238312 241900 252315 262331 246768
10741B46768k5368j3603K7497J7553J0390m2349m708m922l7836J9673J8194j7300
$$ 246768 221400 207797 235294 252847 263237 220888 216180 211258 173422 193095 211289 193989
10729A93989K391r673j0553j7939j0303r859M631J515j6389k2738K139l3870R013
$$ 193989 196380 186707 176154 158215 147912 138053 142684 144199 127810 105072 107211 73341 82354
10716H2354q573J5178K138k6311m349J2722k651J140o637J8711j9333m769N970
$$ 82354 73781 88959 91097 64786 60437 73159 70508 71648 65011 83722 64389 59620 65590
10703F5590J0770J5183r871l4423k105O596L5134j870l6718R595J1526L8629L3531
$$ 65590 76360 91543 81672 47249 45144 51740 86874 85004 48286 57881 69407 108036 141567
10690A41567O509M331K0919J6743j896l6368l0211R776J0170k0158l0337p959
$$ 141567 148076 152407 173326 190069 188173 151805 121594 131370 141540 121382 91045 83086
10678H3086J0669k503q771J4981K8135q944l4709l0890l8534p560J2794K2297
$$ 83086 93755 91252 82481 97462 125597 116653 81944 51054 12520 4960 17754 40051
10666D0051J4302j1667K1845K3755J4650j1010P048n639k0006k2938J147J6925
$$ 40051 54353 42686 64531 88286 102936 91926 98974 93335 73329 50391 51538 68463
10654F8463j0951l6146R460K8218j5196r622K0633j1355m328o673k5891J539k4128
$$ 68463 57512 21366 30826 59044 43848 34226 54859 43504 39176 32503 6612 8151 -15977
10641a5977l041J6029n085K75K6520n686j4575q844j7005O543L445J9835O416
$$ -15977 -19018 -2989 -8074 -7799 18721 13035 -1540 -10384 -27389 -20846 -17401 2434 8850
10628H850N735M698R041m705q222j3744O433j6853J0830L434J1664o417K5145
$$ 8850 14585 19283 28324 23619 15397 1653 8086 -8767 2063 5497 17161 10744 35889
10615C5889J2856j1067q363k6370o207R063K1403K1816j8752p115Q78M738P676
$$ 35889 48745 37678 29315 2945 -3262 5801 27204 49020 30268 23153 24031 28769 36445
10602C6445k4726k570j0521l33J789j9567J4385J3344J3897q810N116L443k7344
$$ 36445 11719 9149 -1372 -1705 84 -19483 -5098 8246 22143 13333 18449 21892 -5452
10589e452K6401J7828k393n990j3873j6096l0847j092J5722J4704K3462j1022
$$ -5452 20949 38777 36384 30394 16521 425 -30422 -31514 -15792 -1088 22374 11352
10577A1352j7698O525q137J4797J2891L6486o65k0046O098J9168J6720k141r912
$$ 11352 -6346 179 -7958 6839 19730 56216 55551 35505 41603 60771 77491 75350 65438
10564F5438j2503p243j4454K3406L92J3682j4095l972k478J3613j7604M959J8704
$$ 65438 52935 45692 31238 54644 55036 68718 54623 50651 48173 61786 44182 49141 67845
10551F7845p249j6155n2942P195M8800L0499M262j8674K243N840J1502J2794K9699
$$ 67845 60596 44441 -8501 -1306 47494 77993 82255 63581 65824 71664 83166 95960 125659
10538A25659K2021j5830m4270j2424J3516R373k5915j2126J3524q168L1447M1749
$$ 125659 147680 131850 87580 75156 88672 98045 72130 60004 73528 65360 96807 138556
10526A38556n526p263J1154l539Q3k760q681r628M652j1267k1365m292K9147p039
$$ 138556 133030 125767 136921 133382 133465 130705 122024 112396 117048 105781 84416 80124 109271 102232
10512A02232j698O593K0040J4459k0130k8631k3182k1389M137J8759K422N180
$$ 102232 100534 107127 127167 141626 121496 92865 69683 48294 52431 71190 73612 78792
10500G8792M780J4010J9032k134Q623J8544P47j0483k308Q650k084j4612P175
$$ 78792 83572 97582 116614 114480 123103 141647 142394 131911 129603 138253 136169 121557 128732
10487A28732J1157J2319K1591K7550k6870l3612j5790l4783j1087l736m507k5846
$$ 128732 139889 152208 173799 201349 174479 140867 125077 90294 79207 75471 70964 45118
10475D5118q60J758K2940K0361R399j3836q532J4616M836k0220k225J7097J2044
$$ 45118 44258 46016 68956 89317 98716 84880 76348 90964 95800 75580 73355 90452 102496
10462A02496J204R08K9678L1459j8012n178M456k1029L039m446p493j2781j1354
$$ 102496 103700 104608 134286 165745 147733 142555 147011 125982 129021 124575 117082 104301 92947
10449I2947k2775j1908k815k5273j6235j928p382R828K153J236K1028J0710j165
$$ 92947 70172 58264 55449 30176 13941 12013 4631 14459 16612 17848 38876 49586 48421
10436D8421j7230J9881K5069l8513l5776k3501J9014P579j9952J0759K9189J2365
$$ 48421 31191 51072 76141 37628 1852 -21649 -2635 4944 -15008 -4249 24940 37305
10424C7305o539J781j5934l4016K2484l523J1490l993p592N192o32j5568m019
$$ 37305 30766 32547 16613 -17403 5081 1558 13048 9055 1463 6655 6023 -9545 -13564
10411a3564P946O035K369Q53m245k321L634k0867P357N317K0913K555L008q717
$$ -13564 -5618 417 2786 3639 -606 -2927 707 -20160 -12803 -7486 13427 15982 18990 10273
10397A0273k0j977Q642m087k3242J9282J3745K6629J599l2187k1441J460R562
$$ 10273 10253 8276 16918 12831 -10411 8871 22616 49245 50844 18657 -2784 -1324 8238
10384H238O87R311J7011j2023m295J656k0783p128K4355J0413J0860P583j0835
$$ 8238 8925 18236 35247 23224 18929 20585 -198 -7326 17029 27442 38302 45885 35050
10371C5050k2961K6369K3645K3279J7348j920j2347j4826J1535J4558j3939l5361
$$ 35050 12089 38458 62103 85382 102730 100810 88463 73637 85172 99730 85791 50430
10359E0430K8076o515K631M6989J0499J7272l797n234K5122k1071j9606o410m594
$$ 50430 78506 71991 74622 121611 132110 149382 145585 140351 165473 144402 124796 118386 113792
10346A13792l4258L70L4404K2499J1337K333j6913j0989k2653k2447k3061J2909
$$ 113792 79534 79904 114308 136807 148144 150477 133564 122575 99922 77475 54414 67323
10334F7323j555L020j521m001j7750l411j4133k348k309K8998R095k5759j3496
$$ 67323 65768 68788 67267 63266 45516 42105 27972 25624 23315 52313 61408 35649 22153
10321B2153J9464R915k4977J8287K1308K9916K6822j705M694j3304j2620m799
$$ 22153 41617 51532 26555 44842 66150 96066 122888 121183 125877 112573 99953 95154
10309I5154J2149K3778J3739j9521r882Q882j203o007k0475j6573l2812J2662
$$ 95154 107303 131081 144820 125299 115417 124299 123096 117089 96614 80041 47229 59891
10297E9891m695R653K0742r38j4220r143O636Q789K660J9458J7884K350Q5M199
$$ 59891 55196 64849 85591 84653 70433 61290 67926 76715 79375 98833 116717 119067 119152 123351
10283A23351J9425r791j5245M034j0263j5377M503j6167q623n777J6402J6728
$$ 123351 142776 132985 117740 121774 111511 96134 100637 84470 75847 70070 86472 103200
10271A03200M227j6394k4716M581K5001J5122J1348J5162K6052N728K7214K3420
$$ 103200 107427 91033 66317 70898 95899 111021 122369 137531 163583 169311 196525 219945
10259B19945K2138j3726k957J489N426J991Q670m582l5041k0070j2001J3207R524
$$ 219945 242083 228357 225400 226889 232315 234306 242976 238394 203353 183283 171282 184489 194013
10246A94013R143j3838P115K2914J6195J3226J2107o587j6446k8900J2462n421
$$ 194013 203156 189318 196433 219347 235542 248768 260875 254288 237842 208942 221404 215983
10234B15983j2035m750j0120j2388R902K1j9565j8189N792j2429q332J0469J3025
$$ 215983 203948 199198 189078 176690 186592 186613 167048 148859 154651 142222 133890 144359 157384
10221A57384K774J1808k1369q865J0864M324k718k541K7263K3932J0961r823R351
$$ 157384 160158 171966 150597 141732 152596 156920 154202 151661 178924 202856 213817 203994 213345
10208B13345J9253J4266Q746N146J2183M7622K0679M638j7378r07P977j8915k4816
$$ 213345 232598 246864 255610 260756 272939 320561 341240 345878 328500 327593 335570 316655 291839
10195B91839j0786j6247k6824l1841J8382j3664j8223J691J1864J0800k5205k9450
$$ 291839 281053 264806 237982 206141 224523 210859 192636 194327 206191 216991 191786 162336
10183A62336m7797J72K1162Q732j7878K2010J4139l295r34k306N38K2361L7938
$$ 162336 114539 114711 135873 144605 126727 148737 162876 159581 158647 156341 156879 179240 217178
10170B17178L0750j6308m2427k5491j3470k0281O094R79l946p648J7526J856p628
$$ 217178 247928 231620 189193 163702 150232 129951 136045 137024 133078 125430 142956 144812 137184
10157A37184k864R723J2201l2666l6869k1503j8586K1232L4846J2313K786k6895
$$ 137184 134320 144043 156244 123578 86709 65206 46620 67852 102698 115011 117797 90902
10145I0902j2803J3205K7862m1550m1812K6341L6299j4796k4601P811j7127K1177
$$ 90902 78099 91304 119166 77616 35804 62145 98444 83648 59047 66858 49731 70908
10133G0908M572j6023m377n381j4312K761M366K8620o106K1458M139r663j678
$$ 70908 75480 59457 55080 49699 35387 38148 42514 71134 65028 86486 90625 80962 79284
10120G9284J2692J5373J0690K6288K7769K4713J3841L3055M774m091r094o062
$$ 79284 91976 107349 118039 144327 172096 196809 210650 243705 248479 244388 235294 229232
10108B29232J2302K1034o005j5969j454j6235k9484k1168L272j904J843l1423
$$ 229232 241534 262568 256563 240594 239140 222905 193421 172253 175525 173621 175464 144041
10096A44041l0613j2581J1693K2124m30l7432k4202q915j5276l193J3810j4820
$$ 144041 113428 100847 112540 134664 134234 96802 72600 63685 48409 45216 59026 44206
10084D4206J4318j9171o230L705j5832J6338P107j012N272r249j9915K9334K0809
$$ 44206 58524 39353 33123 36828 20996 37334 44441 43429 48701 39452 19537 48871 69680
10071F9680l4525j8058J981j6388L7740J8383l08r566P66J1691Q922k771J7912
$$ 69680 35155 17097 19078 2690 40430 58813 58505 48939 49705 61396 70318 67547 85459
10058H5459R485l9143j6353J1888p052j1810n255j5001K90j598J3859K7431M647
$$ 85459 94944 55801 39448 51336 44284 32474 27219 12218 12508 10910 24769 52200 56847
10045E6847p363j2735J0602j0506k3832j4533J5595K0627k915K5859J7334p909
$$ 56847 49484 36749 47351 36845 13013 -1520 14075 34702 31787 57646 74980 67071
10033F7071j8930N436M1058J272k981J6576j8373j2729k3358j9049K2124Q636
$$ 67071 48141 53577 94635 95907 92926 109502 91129 78400 55042 35993 58117 66753
10021F6753k0849k5422L7134J4587j7868j3929J6106J2962J4981K543k2505m437
$$ 66753 45904 20482 57616 72203 54335 40406 56512 69474 84455 86998 64493 60056
10009F0056K2309k0161j0566l218j1975j6820J3288J3264r85J5266k29P740K71
$$ 60056 82365 62204 51638 48420 36445 19625 32913 46177 45192 60458 60229 67969 68240
9996F8240l2863j0209K4028L306l4827K6791J1241r536N17L286J8292j9583l2257
$$ 68240 35377 25168 49196 52502 17675 44466 55707 46171 46688 49974 68266 48683 16426
9983A6426k4911k689J0560P267j568M886K6095Q213j3456J430k1616J2786P542
$$ 16426 -8485 -11174 -614 6653 5085 9971 36066 44279 30823 32253 10637 23423 30965
9970C0965j7246J0769j1590j4088N368M3523J0298l735j4616j6247K9339K0063
$$ 30965 13719 24488 12898 -1190 4178 47701 57999 54264 39648 23401 52740 72803
9958G2803K231q021j3967p67J1385j26J4607K0545Q415j8435r923k3506j2997
$$ 72803 75034 67013 53046 52279 63664 63538 78145 98690 107105 88670 78747 55241 42244
9945D2244O52J5859j3887j4009P6K1600L6251K0594K64J4808j7576k2837J6274
$$ 42244 42896 58755 44868 30859 30935 52535 88786 109380 109644 124452 106876 84039 100313
9932A00313K1121p960k5603J210q009k8359j4050j1013K0469j7128k4228J124
$$ 100313 121434 113474 87871 89081 81072 52713 38663 27650 48119 30991 6763 7887
9920G887K4260R99N328J2339J6153j2209k2589j00K8964K0650J7346r42p23R4
$$ 7887 32147 33146 38474 50813 66966 54757 32168 32068 61032 81682 99028 98086 97363 97457
9906I7457n560j1432p458N425J6617k3006j3422k107m057L4729K0814L861q720
$$ 97457 91897 80465 73007 78432 95049 72043 58621 56514 52457 87186 108000 111861 103141
9893A03141o560n5J3237j1099j3399q502L009J8117J0921l669q196j073j3231
$$ 103141 96581 96526 109763 98664 85265 76763 79772 97889 108810 105141 96945 95872 82641
9880H2641j700j4102l901R412k586k353J359j733O678J4054k435R661R323j5810
$$ 82641 80941 66839 62938 72350 69764 67411 68770 67037 73715 87769 85334 94995 104318 88508
9866H8508j3079j2154K2792j3474l261n561j6531J0769J187p516J3810N302m798
$$ 88508 75429 63275 86067 72593 69332 63771 47240 58009 59196 51680 65490 70792 65994
9853F5994J9284K799J2721n210j3164Q468J2596J9113J3027Q565l2864j3832J028
$$ 65994 85278 88077 100798 95588 82424 90892 103488 122601 135628 144193 111329 97497 98525
9840I8525L076r639L2463O1910M3096q290Q28J7156o544K6588N8161M6294J0425
$$ 98525 101601 91962 124425 186335 229431 221141 221969 239125 232581 259169 317330 363624 374049
9827C74049k4548m0257k9409n0990o1277l7051K0948N004j2476k8480p715K281
$$ 374049 349501 309244 279835 228845 167568 130517 151465 156469 143993 115513 107798 110079
9815A10079J1811p321K0495J9216n794l5005Q036J4657K4138r109j2482J8804
$$ 110079 121890 114569 135064 154280 148486 113481 121517 136174 160312 151203 138721 157525
9803A57525K7944l250k7971l5808L391K1389P206j6575o30l7806k7252J790K9336
$$ 157525 185469 182219 154248 118440 121831 143220 150426 133851 133221 95415 68163 69953 99289
9790I9289K8246L302l1877j3753J9374J1776L782K6632J5005k6299p954K970K0506
$$ 99289 127535 130837 98960 85207 104581 116357 120139 146771 161776 135477 127523 130493 150999
9777A50999J0584j8871j9599J2626J8821j5939l2547j628k428J8451K0395L2607
$$ 150999 161583 142712 123113 135739 154560 138621 106074 104446 102018 120469 140864 173471
9765A73471l490l7504j0850k450J779n593K1495O113j2245k0771R280o762K1221
$$ 173471 169981 132477 121627 119177 120956 115363 136858 142971 130726 109955 119235 112473 133694
9752A33694J7623M891j9325J1056J4000j7220n561J1692J3030p234K812J7571
$$ 133694 151317 156208 136883 147939 161939 144719 139158 150850 163880 156646 159458 177029
9740A77029J5723o103j8500J1950J5067J3339K7314o454k9895L3465J1723l1000
$$ 177029 192752 186649 168149 180099 195166 208505 235819 229365 199470 232935 244658 213658
9728B13658p776K2822k1234k0936r285J1880N132n335K668n187J5938q986j6704
$$ 213658 205882 228704 207470 186534 177249 189129 194261 188926 191594 186407 202345 193359 176655
9715A76655K1597M034P010J2702J7140K0638k1458p975J1819J3317L4845M5208
$$ 176655 198252 202286 209296 221998 239138 259776 238318 230343 242162 255479 290324 335532
9703C35532L9023M2330j1389k4926J664J6974K9986O4027M3167J8565J1340j0158
$$ 335532 374555 416885 405496 380570 382234 399208 429194 493221 536388 554953 566293 556135
9691E56135Q833n696q514M279J6799Q230k705n017j4972j839J0381M0111P443
$$ 556135 564968 559272 550758 555037 571836 580066 577361 572344 557372 555533 565914 606025 613468
9678F13468L691j736R396L5169M8202J0072q020R260K4132L9224O301J2619K6336
$$ 613468 617159 615423 624819 659988 708190 718262 710242 719502 743634 782858 789159 801778 828114
9665H28114L9188M8330J7342J7555L2307M2347O8718K7789J6115J9929M3267N3881
$$ 828114 867302 915632 932974 950529 982836 1025183 1093901 1121690 1137805 1157734 1201001 1254882
9653A254882L1739M0525J6196j5488k3704j4312l5882k150j7099m3724l7078j5367
$$ 1254882 1286621 1327146 1343342 1327854 1304150 1289838 1253956 1251806 1234707 1190983 1153905 1138538
9641A138538J7312K693K1777K5205L2757J7181J1265N865J5756K7159r214j6284
$$ 1138538 1155850 1158543 1180320 1205525 1238282 1255463 1266728 1272593 1288349 1315508 1306294 1290010
9629A290010M5713J6741Q870L0072L3794K2630N3245L9546M493J6911K8164J3026
$$ 1290010 1335723 1352464 1361334 1391406 1425200 1447830 1501075 1540621 1545114 1562025 1590189 1603215
9617A603215k5489p6J7009j3906l3079k8594n456k0267k6903j6263k3738l6107
$$ 1603215 1577726 1577650 1594659 1580753 1547674 1519080 1513624 1493357 1466454 1450191 1426453 1390346
9605A390346K824j1215R306k5003k0493J8046P090n4106l9645n455m173n196k6505
$$ 1390346 1393170 1381955 1391261 1366258 1345765 1363811 1370901 1316795 1277150 1271695 1267522 1262326 1235821
9592A235821j2419k7459j5793j0173j6707K3429O719L4396J9669R825n3908l2078
$$ 1235821 1223402 1195943 1180150 1169977 1153270 1176699 1183418 1217814 1237483 1247308 1193400 1161322
9580A161322J0693k0456k0734l2315m7078l4194k9059n2408k6910j4589l6781
$$ 1161322 1172015 1151559 1130825 1098510 1051432 1017238 988179 935771 908861 894272 857491
9569H57491m9413j1344j6968j8702k2276k8649j7095j1261J1886m525k0868o387
$$ 857491 808078 796734 779766 761064 738788 710139 693044 681783 693669 689144 668276 661889
9557F61889m2498m7452k0252J716K6776O472l4130j7546j2713k7043k4112J1320
$$ 661889 619391 571939 551687 553403 580179 586651 552521 534975 522262 495219 471107 482427
9545D82427j3029k4006j7876j302K4601k994p460k0244o114K9956P163k120l896
$$ 482427 469398 445392 427516 426214 450815 447821 440361 420117 414003 443959 451122 449002 445106
9532D45106j7867j1018n246N871l1270j3697J2841k366l2716K3525J8491J707
$$ 445106 427239 416221 410975 416846 385576 371879 384720 382354 349638 373163 391654 393361
9520C93361r9q245N207l1278Q237K9913N4615M8141K003j2779j5524j2735N651
$$ 393361 393262 385017 390224 358946 367183 397096 451711 499852 501855 489076 473552 460817 466468
9507D66468L7052L9622M173L1703K7620r952O762J4793J9567k594K0403K4348
$$ 466468 503520 543142 547315 579018 606638 596686 603448 618241 637808 635214 655617 679965
9495F79965L7537J7593R015j3803R92j7908R682K6301J063J244K4182J7125K8693
$$ 679965 717502 735095 744110 730307 731299 713391 723073 749374 750437 751681 775863 792988 821681
9482H21681J6143M037K5025J9146q281p07K656l0554j9247J9303J6246m245j8159
$$ 821681 837824 841861 866886 886032 877751 877044 879700 849146 829899 849202 865448 861203 843044
9469H43044j4802k2676p561K0736r663k3634p813J8108l8065o1102l9263J2896
$$ 843044 828242 805566 798005 818741 809078 785444 777631 795739 757674 696572 657309 670205
9457F70205J7634o233j9897k5622n3608l0763J545q329n603j9208l5041k0918
$$ 670205 687839 681606 661709 636087 582479 551716 553261 544932 539329 520121 485080 464162
9445D64162j4409k2739o608k446Q444m553j0771N790L3850M7239M6220L0408J7576
$$ 464162 449753 427014 420406 417960 426404 421851 411080 416870 450720 497959 544179 574587 592163
9432E92163K2516L5777L6408J4255J4918M8752O0614P3818L1762K0345L8173N7746
$$ 592163 614679 650456 686864 701119 716037 764789 825403 899221 930983 951328 989501 1047247
9420A047247M7053O4101M5400O8988J09275R5436M3370P4597Q6517Q7228Q1108
$$ 1047247 1094300 1158401 1203801 1272789 1382064 1477500 1520870 1595467 1681984 1769212 1850320
9409A850320O6170N0602L0971M7922O3436J11667J24344P5011K4633J5890P9992
$$ 1850320 1916490 1967092 1998063 2045985 2109421 2221088 2345432 2420443 2445076 2460966 2540958
9398B540958N7248J1016N2752P0341O0257M5779J08432J13834N2588N0550M5318
$$ 2540958 2598206 2609222 2661974 2732315 2792572 2838351 2946783 3060617 3113205 3163755 3209073
9387C209073R6675J16443J17946R2135R7907R1538N4273Q1518J01654J14368J02578
$$ 3209073 3305748 3422191 3540137 3632272 3730179 3821717 3875990 3957508 4059162 4173530 4276108
9376D276108J02896N1800L5169N0358N9905M1377L3988L5007N8890P4731O0419
$$ 4276108 4379004 4430804 4465973 4516331 4576236 4617613 4651601 4686608 4745498 4820229 4880648
9365D880648P1011M6683O5440Q0064Q6846J23083P3413N3749P9393Q7241P2580
$$ 4880648 4951659 4998342 5063782 5143846 5230692 5353775 5427188 5480937 5560330 5647571 5720151
9354E720151M1288K0434L4049J6096N665m1722m3441j8749l7507q1917l8224K0511
$$ 5720151 5761439 5781873 5815922 5832018 5837683 5795961 5752520 5733771 5696264 5614347 5576123 5596634
9342E596634K720K0703M2741K0326M9755M7237Q8593J08775J21133J96432K08143
$$ 5596634 5599354 5620057 5662798 5683124 5732879 5780116 5868709 5977484 6098617 6295049 6503192
9331F503192K37549K31497K21650K13894J94313K38280K53042K46385K55173K34105
$$ 6503192 6740741 6972238 7193888 7407782 7602095 7840375 8093417 8339802 8594975 8829080
9321H829080J47643O2071R1165R2076O7624N6213J44178J59758J86919J60017
$$ 8829080 8976723 9038794 9129959 9222035 9289659 9345872 9490050 9649808 9836727 9996744
9311I996744J29573J87961J53670J79874K55974K64920L14865L75236M35158M77692
$$ 9996744 10126317 10314278 10467948 10647822 10903796 11168716 11483581 11858817 12293975 12771667
9301A2771667M95021N18650N33362N38910N78842O25697O84111O93601P12429
$$ 12771667 13266688 13785338 14318700 14857610 15436452 16062149 16746260 17439861 18152290
9292A8152290P96776R36040J031334J149662J314979J470184J596729J694245
$$ 18152290 18949066 19885106 20916440 22066102 23381081 24851265 26447994 28142239
9284B8142239J760901J891300K016371K114880K117280K012945J909473J882076
$$ 28142239 29903140 31794440 33810811 35925691 38042971 40055916 41965389 43847465
9276D3847465J796768J742344J760087J764619J812090J937843K136401K452302
$$ 43847465 45644233 47386577 49146664 50911283 52723373 54661216 56797617 59249919
9268E9249919K880375L444754M163994N107808O257322P709834R474170J1467084
$$ 59249919 62130294 65575048 69739042 74846850 81104172 88814006 98288176 109755260
9260A09755260J3648069J5885086J7893389J9212884J9836309K0300737K1599366
$$ 109755260 123403329 139288415 157181804 176394688 196230997 216531734 238131100
9253B38131100K3861889K5511813K4636512K0762183J5431977J1108955R198184
$$ 238131100 261992989 287504802 312141314 332903497 348335474 359444429 368642613
9246C68642613Q940756R196212R549657R701761R499216R085561Q547403P891832
$$ 368642613 377583369 386779581 396329238 406030999 415530215 424615776 433163179 441055011
9238D41055011P037597N954519M935268M208562L758709L552800L395566L044329
$$ 441055011 448092608 454047127 458982395 463190957 466949666 470502466 473898032 476942361
9230D76942361K084422J12227k736471n840732q596724j0720567j2190529j3031940
$$ 476942361 479026783 479139010 476402539 470561807 461965083 451244516 439053987 426022047
9222D26022047j3322101j3271818j3210627j3301512j3629800j4048205j4310519
$$ 426022047 412699946 399428128 386217501 372915989 359286189 345237984 330927465
9215C30927465j4137463j3388996j2220585j0869114r630397q548813p548710
$$ 330927465 316790002 303401006 291180421 280311307 270680910 262132097 254583387
9208B54583387o649927n881499n286775m930522m881371n085775n532111o171311
$$ 254583387 247933460 242051961 236765186 231834664 226953293 221867518 216335407 210164096
9200B10164096o849933p396276p760843p956149p983107p783065p332323o678897
$$ 210164096 203314163 195917887 188157044 180200895 172217788 164434723 157102400 150423503
9192A50423503n857970m900897l961896l176652k481888j891731j438029j225496
$$ 150423503 144565533 139664636 135702740 132526088 130044200 128152469 126714440 125488944
9184A25488944j253231j443805j870584k460514l101060l717334m154559m420487
$$ 125488944 124235713 122791908 120921324 118460810 115359750 111642416 107487857 103067370
9176A03067370m500114m429577m368843m312632m217747m062017l869297l557128
$$ 103067370 98567256 94137679 89768836 85456204 81238457 77176440 73307143 69750015
9168F9750015l148040k755910k430463k135601j919429j682448j507403j354200
$$ 69750015 66601975 63846065 61415602 59280001 57360572 55678124 54170721 52816521
9160E2816521j266811j268391j366662j451828j477753j443127j329159j244493
$$ 52816521 51549710 50281319 48914657 47462829 45985076 44541949 43212790 41968297
9152D1968297j186028j110513j071001j017421r55041r38540q97690q88146r20658
$$ 41968297 40782269 39671756 38600755 37583334 36628293 35689753 34792063 33903917 32983259
9143C2983259r77804r96870j074488j170024j166618j161095j076773j001724
$$ 32983259 32005455 31008585 29934097 28764073 27597455 26436360 25359587 24357863
9135B4357863q98825q18387p68264p65527p46027p09423o41449o15244o09818
$$ 24357863 23459038 22640651 21872387 21106860 20360833 19651410 19009961 18394717 17784899
9126A7784899o15476n59384n25840n27629m90535m77206m37143l66349l81432
$$ 17784899 17169423 16610039 16084199 15556570 15066035 14588829 14151686 13785337 13403905
9117A3403905l70137l28872l21463l20898k84782k81229k75632k78997l17932
$$ 13403905 13033768 12704896 12383433 12062535 11777753 11496524 11220892 10941895 10623963
9108A0623963l29432l39349l77805l71908l69218l41011k86879k81206k76212
$$ 10623963 10294531 9955182 9577377 9205469 8836251 8495240 8208361 7927155 7650943
9099G650943k40097k27431k19181k11883k08252j90418j65793j62580j72181j59043
$$ 7650943 7410846 7183415 6964234 6752351 6544099 6353681 6187888 6025308 5853127 5694084
9089E694084j26163q7940j14108j23550j09502r3037j16570j01405j20781j42081
$$ 5694084 5567921 5479981 5365873 5242323 5132821 5039784 4923214 4821809 4701028 4558947
9079D558947q3917q5907r7522j10306j07292r3898o6627m8527o6604o3557n7480
$$ 4558947 4475030 4389123 4291601 4181295 4074003 3980105 3913478 3864951 3798347 3734790 3677310
9068C677310n1914l0271o2289q2737k8570n762j8363J2930P449l0338j4442L512
$$ 3677310 3625396 3595125 3532836 3450099 3421529 3415767 3397404 3410334 3417783 3387445 3373003 3376515
9056C376515l032j9400k4341J5453l544J308M7595l464k7817r023J993q337L043
$$ 3376515 3373483 3354083 3329742 3345195 3341651 3342959 3390554 3387090 3359273 3350250 3352243 3343906 3346949
9043C346949p800j0315k249O477J1012k8777k1428M889j0111j1171j5557k5310
$$ 3346949 3339149 3328834 3326585 3333062 3344074 3315297 3293869 3298758 3288647 3277476 3261919 3236609
9031C236609k3885l1736k5033j6003m1347o3972o1321k2641j6805n5080o2162
$$ 3236609 3212724 3180988 3155955 3139952 3098605 3034633 2973312 2950671 2933866 2878786 2816624
9020B816624k4531l2867k8708j4638k6745m7745n874k4533m6192j8995J23j3537
$$ 2816624 2792093 2759226 2730518 2715880 2689135 2641390 2635516 2610983 2564791 2545796 2545919 2532382
9008B532382o1205m6835m9315l8418k7933k8174k5332j7992k1767k1216m6710
$$ 2532382 2471177 2424342 2375027 2336609 2308676 2280502 2255170 2237178 2215411 2194195 2147485
8997B147485j2193j8083k5871k4004k7904l9709k9048q918m026q736j8010l5840
$$ 2147485 2135292 2117209 2091338 2067334 2039430 1999721 1970673 1961755 1957729 1948993 1930983 1895143
8985A895143l1891j4251j9033l3736l6066m5520k5116r262J2676j4467l2677m8128
$$ 1895143 1863252 1849001 1829968 1796232 1760166 1714646 1689530 1680268 1692944 1678477 1645800 1597672
8973A597672m7149j4472r067K646j3790o717K971r553l8219l1343J0037l2999
$$ 1597672 1550523 1536051 1526984 1529630 1515840 1509123 1512094 1502541 1464322 1432979 1443016 1410017
8961A410017j7415P197q140r900j6415l2449l7803k4984r904J2565J556k2858
$$ 1410017 1392602 1399799 1391659 1381759 1365344 1332895 1295092 1270108 1260204 1272769 1274325 1251467
8949A251467k8231j5662J9951R079l0613l5894k5504O499l862j3969q354l336
$$ 1251467 1223236 1207574 1227525 1236604 1205991 1170097 1144593 1151092 1147230 1133261 1124907 1121571
8937A121571k9779M211J5657J6233j6432o333J9968o045j5262j7384r219O219
$$ 1121571 1091792 1096003 1111660 1127893 1111461 1105128 1125096 1119051 1103789 1086405 1077186 1083405
8925A083405O97K9042J9486N031j9342J2012M916K3l729P198q349K533P32N181
$$ 1083405 1084102 1113144 1132630 1137661 1118319 1130331 1135247 1135270 1131541 1138739 1130390 1132923 1133655 1138836
8911A138836L2901k5305K665J6879k576o644l2210k8034J3434L218j4248K9210
$$ 1138836 1171737 1146432 1149097 1165976 1163400 1156756 1124546 1096512 1109946 1113164 1098916 1128126
8899A128126J3666k08K9611J4260K70K3125K78j323L1128L1331P40Q146o482L6936
$$ 1128126 1141792 1141584 1171195 1185455 1185725 1208850 1209128 1207805 1238933 1270264 1271004 1279150 1272668 1309604
8885A309604K6899K1734M2257L9303N1125M5685O5306K1205J120J5792K5796L154
$$ 1309604 1336503 1358237 1400494 1439797 1490922 1536607 1601913 1623118 1624238 1640030 1665826 1668980
8873A668980K671j795R659l873l5881M054K0030J4972J3428j8831K6943N2682
$$ 1668980 1671651 1669856 1679515 1675642 1639761 1643815 1663845 1678817 1692245 1673414 1700357 1753039
8861A753039J9135K0530M6406N0583O9276P4954O7377J28631J21028J20845J21206
$$ 1753039 1772174 1792704 1839110 1889693 1958969 2033923 2101300 2229931 2350959 2471804 2593010
8850B593010J25864Q8510J00778J36145J53836P9282l3883j13381j28083r6210
$$ 2593010 2718874 2807384 2908162 3044307 3198143 3277425 3243542 3130161 3002078 2905868
8840B905868j08370r3525p5829q7137r0971q2983p8373m1497k0229n0428k1386
$$ 2905868 2797498 2703973 2628144 2541007 2450036 2367053 2288680 2247183 2226954 2176526 2155140
8829B155140N20j8280r068r452k5233j1494j8508N401O790p093j4823L2786J0464
$$ 2155140 2155660 2137380 2128312 2118860 2093627 2082133 2063625 2069026 2075816 2068723 2053900 2086686 2097150
8816B097150N401J6143N1145L1475J0450k102K137J247K0951k740j1833p47r925
$$ 2097150 2102551 2118694 2169839 2201314 2211764 2209662 2211799 2213046 2233997 2231257 2219424 2218677 2208752
8803B208752n653m2637n9492l608p670m5590m8764k9362j6656J324j9803p160
$$ 2208752 2203099 2160462 2100970 2097362 2089692 2044102 1995338 1965976 1949320 1950644 1930841 1923681
8791A923681p383q319j5638j9441k6825j4609m683k0817j647Q647j2778l4923
$$ 1923681 1916298 1907979 1892341 1872900 1846075 1831466 1826783 1805966 1804319 1812966 1800188 1765265
8779A765265k9358r341R839l0847j8172r804j0353p032j6848k7833o103j2567
$$ 1765265 1735907 1726566 1736405 1705558 1687386 1677582 1667229 1660197 1643349 1615516 1609413 1596846
8767A596846k2551k5145O85K4220r285l9844m2898l0769j8595q27r206k5690j9321
$$ 1596846 1574295 1549150 1549835 1574055 1564770 1524926 1482028 1451259 1432664 1431837 1422631 1396941 1377620
8754A377620q961Q184o125m954j1710j5121j4674Q869J4386J25j1778k3855l1567
$$ 1377620 1368659 1376843 1370718 1365764 1354054 1338933 1324259 1333128 1347514 1347639 1335861 1312006 1280439
8741A280439n330K0387J7071k7698k6878L3742M0891l9018l0394J143j4453k4592
$$ 1280439 1275109 1295496 1312567 1284869 1257991 1291733 1332624 1293606 1263212 1264355 1249902 1225310
8729A225310n1204k3437L179Q783p643l646K4829O313j1823L997J9217J7186K8661
$$ 1225310 1174106 1150669 1153848 1162631 1154988 1151342 1176171 1182484 1170661 1174658 1193875 1211061 1239722
8716A239722L5130Q450O013M4406M5234J8286k4354l1509k6389l8094n163p352
$$ 1239722 1274852 1283302 1289315 1333721 1378955 1397241 1372887 1341378 1314989 1276895 1271732 1264380
8704A264380p126k1307r551j8274p886j7850J3517M2967J3782k6540k9926k6046
$$ 1264380 1257254 1235947 1226396 1208122 1200236 1182386 1195903 1238870 1252652 1226112 1196186 1170140
8692A170140J3939P08R354K8175K7242k9496j9987L123k1314r555J7033Q80j6991
$$ 1170140 1184079 1184787 1194141 1222316 1249558 1220062 1200075 1203198 1181884 1172329 1189362 1190242 1173251
8679A173251j344R761L862P691J4607K0221K221R107K2082J752L2892J6496J5597
$$ 1173251 1171907 1181668 1185530 1193221 1207828 1228049 1230270 1239377 1261459 1263211 1296103 1312599 1328196
8666A328196K0373j4659K66J691L8430K4877J9004K0710l4725j2924L927L5889
$$ 1328196 1348569 1333910 1334176 1335867 1374297 1399174 1418178 1438888 1404163 1391239 1395166 1431055
8654A431055K2184J3679M107J5464L588j953r180j3078J7318K3525P468R876J9601
$$ 1431055 1453239 1466918 1471025 1486489 1490077 1488124 1478944 1465866 1483184 1506709 1514177 1524053 1543654
8641A543654J9502J5422M978K9244O5136N1041L5346L6127L5186J2816K9641L5808
$$ 1543654 1563156 1578578 1583556 1612800 1677936 1728977 1764323 1800450 1835636 1848452 1878093 1913901
8629A913901L2871L9400L0923r313l1051k6737l3772M749L382K1790L8780K2601
$$ 1913901 1946772 1986172 2017095 2007782 1976731 1949994 1916222 1920971 1924353 1946143 1984923 2007524
8617B007524J8940J1459M3586K6018J1531L6988K6670O9160J03516J19142Q5573
$$ 2007524 2026464 2037923 2081509 2107527 2119058 2156046 2182716 2251876 2355392 2474534 2560107
8606B560107R0660R5091J05540J42260J61916K06025K27402K92017L07453L13825
$$ 2560107 2650767 2745858 2851398 2993658 3155574 3361599 3589001 3881018 4188471 4502296
8596D502296L49594L37376L59965L79278L66682L54027L57657L23559K84756K34406
$$ 4502296 4851890 5189266 5549231 5928509 6295191 6649218 7006875 7330434 7615190 7849596
8586G849596J77481O2435k2099p8235j62183k39573l06869l17860l31231l52600
$$ 7849596 8027077 8089512 8067413 7989178 7826995 7587422 7280553 6962693 6631462 6278862
8576F278862l39296l58946l38371l08216k87980k76094k67638k44841k19671j51013
$$ 6278862 5939566 5580620 5242249 4934033 4646053 4369959 4102321 3857480 3637809 3486796
8566C486796j56408j53714j45341j53370j13017r9223r7354q6844q8213p3543
$$ 3486796 3330388 3176674 3031333 2877963 2764946 2665723 2568369 2481525 2393312 2319769
8556B319769m8321n8126m3442k3480n6020o9379q4441n3466n0774j8965l7102
$$ 2319769 2271448 2213322 2169880 2146400 2090380 2021001 1936560 1883094 1832320 1813355 1776253
8545A776253j4384m7624l2997n1349k0903k179j3574j3177k0400k5835K680k1442
$$ 1776253 1761869 1714245 1681248 1629899 1608996 1606817 1593243 1580066 1559666 1533831 1536511 1515069
8533A515069l3756r020k3100j7940n6883n5728k2863j130q715j5770j8515j0090
$$ 1515069 1481313 1472293 1449193 1431253 1374370 1318642 1295779 1294649 1285934 1270164 1251649 1241559
8521A241559L69k2838k735l1053j1644r407j4752m5184j4689N913j5609o765k3150
$$ 1241559 1241928 1219090 1216355 1185302 1173658 1164251 1149499 1104315 1089626 1095539 1079930 1073165 1050015
8508A050015m8118n3561P423O532J7239r618j1309m518j1180o298k6834k1179
$$ 1050015 1001897 948336 955759 962291 979530 969912 958603 954085 942905 936607 909773 888594
8496H88594J1p000m6120k2878k535o070L6818K4571k0710l2723k0690J8168J8119
$$ 888594 888605 881605 835485 812607 810072 804002 840820 865391 844681 811958 791268 809436 827555
8483H27555o923j0695j6901r635j779j5615l0080O683P360j942k403J9081M572
$$ 827555 820632 809937 793036 783401 781622 766007 735927 742610 749970 748028 745625 764706 769278
8470G69278p324o795J9538P718J0399n688k5808o989k226k1666k8885j8894r10
$$ 769278 761954 755159 774697 782415 792814 787126 761318 754329 752103 730437 701552 682658 681748
8457F81748j5911j4667k201j2513l404j462l551j3276K7867j8485k0398m2103
$$ 681748 665837 651170 648969 636456 633052 631590 628039 614763 642630 624145 603747 561644
8445E61644R574N2845L8111j4805N840J6588o961j6608k0577p79K4306L3110Q004
$$ 561644 571218 624063 662174 647369 653209 669797 662836 646228 625651 624872 649178 682288 690292
8432F90292J5375k348j3282n717p985l5270M855J8775m664J3190j453k8826r691
$$ 690292 705667 703319 690037 684320 676335 641065 645920 664695 660031 673221 671768 642942 633251
8419F33251J0516J6400o477m5513R31M3966k510k0404M302j7057o225n57q474
$$ 633251 643767 660167 653690 608177 609108 653074 650564 630160 634462 617405 611180 610623 602149
8406F02149k171l0615j5427K5579Q168j0772K5165J6192k9805j842J8351Q878
$$ 602149 599978 569363 553936 579515 587683 576911 602076 618268 588463 586621 604972 613850
8394F13850m649l1713j5648Q506P337J3788j0712k9944j4965l112m799J6087L697
$$ 613850 609201 577488 561840 570346 577683 591471 580759 550815 535850 532738 527939 544026 547723
8381E47723o13k9829j5059m724j0300O620l5207j6111j7061m532j1497K4340K2922
$$ 547723 547110 517281 502222 497498 487198 493818 458611 442500 425439 420907 409410 433750 456672
8368D56672R566j6677K2901L1684j4277M317J0527j83K27k4218o331K0514j1978
$$ 456672 466238 449561 472462 504146 489869 494186 504713 504530 504757 480539 474208 494722 482744
8355D82744p233L113j1066j552J884k5376P343K3322J1915j1787n397j1235m415
$$ 482744 475511 478624 467558 466006 467890 442514 449857 473179 485094 473307 467910 456675 452260
8342D52260k800k4892k604K2653r101k2229J744J455l4406m848L8955J319J7371
$$ 452260 449460 424568 421964 444617 435516 413287 415031 416486 382080 377232 416187 417506 434877
8329D34877J681O497j237J0940j4099j1734j2743L164j7233j1284K7183K2301
$$ 434877 436558 443055 441818 452758 438659 426925 414182 417346 400113 388829 416012 438313
8317D38313j613J7995J7454k1533k6178L850K4198k3416l7766o187J5146K2163
$$ 438313 436700 454695 472149 450616 424438 428288 452486 429070 391304 385117 400263 422426
8305D22426j8700j2363k590R010J8640O008j8939O757R242N41Q510j969J5552
$$ 422426 403726 391363 388773 397783 416423 422431 403492 410249 419491 420032 428542 426573 442125
8292D42125K8837J9549n4686l8403J7081J6382J5258j8019k8624q835J7611K1003
$$ 442125 470962 490511 435825 397422 414503 430885 446143 428124 399500 390665 408276 429279
8280D29279j0215k469K0858J5121J4736P903k524j2740J578P16J5139j5479m4847
$$ 429279 419064 416595 437453 452574 467310 475213 472689 459949 461527 462243 477382 461903 417056
8267D17056R381O177K5575L555j4184L980j8472o726P035r78J0111j0871k6154
$$ 417056 426437 432614 458189 461744 447560 451540 433068 426342 433377 432399 442510 431639 405485
8254D05485j619J1455J1943l973K685q085l6261J731J7234K0713N3824M567k6272
$$ 405485 403866 415321 427264 423291 425976 417891 381630 383361 400595 421308 475132 479699 453427
8241D53427j0956R293j411k2637m317p029J3422j4793J4265N073j9008k7634m640
$$ 453427 442471 451764 450353 427716 423399 416370 429792 414999 429264 434337 415329 387695 383055
8228C83055M751j24j178K30m142l205r121m620J1936j59l8635k4404J3362J9800
$$ 383055 387806 387682 386504 386734 382592 379387 370266 365646 377582 377423 338788 314384 327746 347546
8214C47546N055J8285J6018n101J6434q843l2053J637Q210m615K8631L0124J6564
$$ 347546 352601 370886 386904 381803 398237 389394 357341 358978 367188 362573 391204 421328 437892
8201D37892P347P876k9222r613P121N541P482j5551k8734j1130P783O197N343
$$ 437892 445239 453115 423893 414280 421401 426942 434424 418873 390139 379009 386792 392989 398332
8188C98332Q979K3374j8416k5920J6467P009j4679K3228J469J231J7768k5651
$$ 398332 407311 430685 412269 386349 402816 409825 395146 418374 419843 421074 438842 413191
8176D13191o287j140r992k0486J7433K2423j2563l0545k4540r847J8949J4728
$$ 413191 406904 405764 395772 375286 392719 415142 402579 372034 347494 337647 356596 371324
8164C71324J3301L2511j5648j8o346J6900K5907L118K582J9054r521o110o499
$$ 371324 384625 417136 401488 401470 395124 412024 437931 441049 443631 462685 453164 447054 440555
8151D40555l4293k3352K2005O362M0751M7347M0848L4468O05Q579R765K3746M337
$$ 440555 406262 382910 404915 411277 452028 499375 540223 574691 575296 583875 593640 617386 621723
8138F21723o544J9533j8441k1128l4273k0152j1354J7866j8939k0352K524J4316
$$ 621723 615179 634712 616271 595143 560870 540718 529364 547230 528291 507939 510463 524779
8126E24779L1442M795O57K6506L0936J6212K59P018K0777L0762J3048O0741L3987
$$ 524779 556221 561016 561673 588179 619115 635327 635586 642604 663381 694143 707191 767932 801919
8113H01919j2533J4623L7178M5526J5508M158J964k444M145k452l5561l6679m7114
$$ 801919 789386 804009 841187 886713 902221 906379 908343 905899 910044 907592 872031 835352 788238
8100G88238m2264k0548Q310j9929J7305M8736K3936K8860J3227K174k262J5955
$$ 788238 745974 725426 733736 713807 731112 779848 803784 832644 845871 848045 845783 861738
8088H61738N995n732r237K7589L1628J2571j762k2149r523K1979M3588l19j507
$$ 861738 867733 862001 852764 880353 911981 924552 922790 900641 891118 913097 956685 956366 954859
8075I54859K362P366R417r928J1822L5749K8628L0017L1473J6665O2795M7988
$$ 954859 957221 964587 974004 964076 975898 1011647 1040275 1070292 1101765 1118430 1181225 1229213
8063A229213M201J4772J7439k2824l0704k4158j3305k0580k5519l5011j0916j297
$$ 1229213 1233414 1248186 1265625 1242801 1212097 1187939 1174634 1154054 1128535 1093524 1082608 1081311
8051A081311L042J7967L5903R618P40J5314N1383K6717K9099M1914O0261P1633
$$ 1081311 1084353 1102320 1138223 1147841 1148581 1163895 1215278 1241995 1271094 1313008 1373269 1444902
8039A444902M2200M0761N5149N3872N7488O4380J8207N1996J2763K1258L2169
$$ 1444902 1487102 1527863 1583012 1636884 1694372 1758752 1776959 1828955 1841718 1862976 1895145
8028A895145J3239J6233M918J9912j1372M853J9743j8295k0145k35l174J3446
$$ 1895145 1908384 1924617 1929535 1949447 1938075 1942928 1962671 1944376 1924231 1923996 1920822 1934268
8016A934268K0751K412n975M164q736K022q249q20l162J8264J8844l5197o805
$$ 1934268 1955019 1957431 1951456 1955620 1946884 1948906 1940657 1939837 1936675 1954939 1973783 1938586 1931781
8003A931781O2778N5529M1416N6967P6352P8702J01004R4879J12026J64404J70200
$$ 1931781 1994559 2050088 2091504 2148471 2224823 2303525 2404529 2499408 2611434 2775838 2946038
7992B946038J32048J21586J11873J24561J29322J25678J07222M2775n5014j03829
$$ 2946038 3078086 3199672 3311545 3436106 3565428 3691106 3798328 3841103 3786089 3682260
7982C682260j41643j50433j06489q3550p7775q3729r1470j47832j07512j00710
$$ 3682260 3540617 3390184 3283695 3200145 3122370 3038641 2947171 2799339 2691827 2591117
7972B591117p1664r2012q2148m8176l5562k9390j6420J2386K9162J6799N385l791
$$ 2591117 2519453 2427441 2345293 2297117 2261555 2232165 2215745 2228131 2257293 2274092 2279477 2275686
7960B275686J1956K7586M6875O3787N5400M2751P4161Q1143O0931Q4447Q9989
$$ 2275686 2287642 2315228 2362103 2425890 2481290 2524041 2598202 2679345 2740276 2824723 2914712
7949B914712R3091R5369R4770J24467J05326K1457J6048K5653J5547l1222n3909
$$ 2914712 3007803 3103172 3197942 3322409 3427735 3449192 3465240 3490893 3506440 3475218 3421309
7938C421309p7427q4173q2222r0189j46676j59392j17630q4802r7199r9901j02364
$$ 3421309 3343882 3259709 3177487 3087298 2940622 2781230 2663600 2578798 2481599 2381698 2279334
7927B279334r7033p5752k0439k7414k9407m6823l2054l6104o708J5244J7458J5845
$$ 2279334 2182301 2106549 2086110 2058696 2029289 1982466 1950412 1914308 1907600 1922844 1940302 1956147
7915A956147J5387j571M6501L4050L0492O8275L8250p268N525K6143J0461n44
$$ 1956147 1971534 1969963 2016464 2050514 2081006 2149281 2187531 2180263 2185788 2211931 2222392 2221848
7903B221848q086m036j7908l2758l8052k9171q4563q3531o9366m0822m9501p9293
$$ 2221848 2213762 2209726 2191818 2159060 2121008 2091837 2007274 1923743 1854377 1813555 1764054 1684761
7891A684761n9517o4440n7987n6345m0964m0159n794o484l4606k7766l7732k7999
$$ 1684761 1625244 1560804 1502817 1446472 1405508 1365349 1359555 1353071 1318465 1290699 1252967 1224968
7879A224968k4213J1406m968k0442j4805k2896q221j481m2071j8317j1424m8249
$$ 1224968 1200755 1212161 1207193 1186751 1171946 1149050 1140829 1139348 1097277 1078960 1067536 1019287
7867A019287l8517j5148l8576k8570J8975M271l9056q367o374j5783O27q784m61
$$ 1019287 980770 965622 927046 898476 917451 921722 882666 874299 867925 852142 852769 843985 843524
7854H43524k428k2776k1060Q030M949k8793n7294j1928k7963l4898k9307k4445
$$ 843524 841096 818320 797260 805290 810239 781446 724152 712224 684261 649363 620056 595611
7842E95611k5984j7542k2740p784J3636n436K4154L386M163l9040j8969j8438
$$ 595611 569627 552085 529345 521561 535197 529761 553915 557301 561464 522424 503455 485017
7830D85017l4021k9879j3864l476k4584M0p528k9458Q317J6289L132l8191j6502
$$ 485017 450996 421117 407253 403777 379193 379233 371705 342247 350564 366853 369985 331794 315292
7817C15292L2365r201j0489k4817K649K4734p198j5219j343q554p476j2183r647
$$ 315292 347657 338456 327967 303150 305799 330533 323335 308116 306773 298219 290743 278560 268913
7804B68913n434K4868J9737j0501O088k041K190J9727j0009j5666j1869K08L1853
$$ 268913 263479 288347 308084 297583 303671 301630 303820 323547 313538 297872 286003 286211 318064
7791C18064J2429J1415j6457j7516L646O479r593j1324l6191n443J8355j0216
$$ 318064 330493 341908 325451 307935 311581 318060 308467 297143 260952 255509 273864 263648
7779B63648j4512j0882q437j9496k999j1376j62J1866k8734j1830K956j355j9964
$$ 263648 249136 238254 229817 210321 207322 195946 195784 207650 178916 167086 170042 168687 148723
7766A48723N344K4287J6450j1311k0207q573J3940k485o414q487J3981J238J6661
$$ 148723 154067 178354 194804 183493 163286 154713 168653 166168 159754 151267 165248 166486 183147
7753A83147N160o265l045m517k0929q409K755K9970Q970m115j5668o232J2827
$$ 183147 188307 182042 178997 174480 153551 145142 147897 177867 186837 182722 167054 160822 173649
7740A73649N321k0756k0263m332j7608j6605J8905Q075j813j9170p159R465Q854
$$ 173649 178970 158214 137951 133619 116011 99406 118311 126386 124573 105403 98244 107709 116563
7727A16563j3450P340k020J5800j220R117k2861p301j2848k3384o477O014K5579
$$ 116563 103113 110453 108433 124233 123013 132130 109269 101968 89120 65736 59259 65273 90852
7714I0852k1157K0760J7117j3141K4560J405k6074j0995K3778J5314n606j3023
$$ 90852 69695 90455 107572 94431 118991 120396 94322 83327 107105 122419 116813 103790
7702A03790J2233k18j5121J880j1351J8181J1369J2508j5195J2757M007j9092
$$ 103790 116023 115805 100684 102564 91213 109394 120763 133271 118076 130833 134840 115748
7690A15748n0506k3584j5217p926Q767J5585K0512P228k903J1938o434J2275k8919
$$ 115748 65242 41658 26441 18515 27282 42867 63379 70607 67704 79642 73208 85483 56564
7677E6564j3897L9520j6641r758P308J5691m142k572J5600r546K946P708L622
$$ 56564 42667 82187 65546 55788 63096 78787 74645 72073 87673 78127 81073 88781 92403
7664I2403J2058k1783P753M239l0445p989L7589R410j8036r758k8296m106J4406
$$ 92403 104461 82678 90431 94670 64225 56236 93825 103235 85199 75441 47145 43039 57445
7651E7445K1069J7971J0019k3961p178n997p238j4425j2792r270K0431J7437J6504
$$ 57445 78514 96485 106504 82543 75365 69368 62130 47705 34913 25643 46074 63511 80015
7638H0015L260o472J3505k5611j5474J3051K0302K5318l877o382j9764J6824J775
$$ 80015 83275 76803 90308 64697 49223 62274 82576 107894 104017 97635 77871 94695 96470
7625I6470j1539l923J1885j5289k4798M52k586K164K6611q968j334K9892K8604
$$ 96470 84931 81008 92893 77604 52806 53258 50672 52836 79447 70479 69145 99037 127641
7612A27641j6357k2004p628k4266m78j97J1076M435q715m547j3361Q958j7326
$$ 127641 111284 89280 81652 57386 56908 56711 67787 72222 63507 58960 45599 54557 37231
7599C7231k7618K2779L0565J4574r906j5987j9603J6743J4065K4904J197j2291
$$ 37231 9613 32392 62957 77531 67625 51638 32035 48778 62843 87747 88944 76653
7587G6653k2183J2704R666j0875J619l911j293j1475j2042L0606K5930J958J8750
$$ 76653 54470 67174 76840 65965 67584 63673 62380 50905 38863 69469 95399 97357 116107
7574A16107P428j6654l9378q271o288O080L315J55l500r159j6566K5174K0968
$$ 116107 123535 106881 67503 59232 52944 59024 62339 62494 58994 49835 33269 58443 79411
7561G9411m920K5156J1762k380j351q912k0455m634J1041j0711N937K7574q209
$$ 79411 74491 99647 111409 109029 107678 98766 78311 73677 84718 74007 79944 107518 99309
7548I9309j8096k4389r252M737j8303j6875p955L5427K0023m82r963l623L3955
$$ 99309 81213 56824 47572 52309 34006 17131 9176 44603 64626 64144 54181 50558 84513
7535H4513M7791q943m225j0894j6758k4576J530K912N314K525J308j2246k73J0402
$$ 84513 132304 123361 119136 108242 91484 66908 68438 71350 76664 79189 80497 68251 67978 78380
7521G8380l7283J7590K2296j6998l9439j4527J1592n591J012K4033K3246q622
$$ 78380 41097 58687 80983 63985 24546 10019 21611 16020 17032 41065 64311 55689
7509E5689J15j7714l2905p621K7046p384j8940M848K560M436J1372o677J2841
$$ 55689 55804 38090 5185 -2436 24610 17226 -1714 3134 5694 10130 21502 14825 27666
7496B7666M7747p287k4175L286l752j468L2269j5795j5313N361N422l4600O973
$$ 27666 75413 68126 43951 47237 43485 42017 74286 58491 43178 48539 53961 19361 26334
7483B6334r868l063q341R506m267r404N872p22L2317K9049J1629o259p545l788
$$ 26334 16466 13403 5062 14568 10301 897 6769 6047 38364 67413 79042 72783 65238 61450
7469F1450j7431N869N086n644Q048o440J1052l3058r716J4972K1149r582J0421
$$ 61450 44019 49888 54974 49330 57378 50938 61990 28932 19216 34188 55337 45755 56176
7456E6176J7332R986R616R509j3516N167M807j9605N167P376j4460j3315n0246
$$ 56176 73508 83494 93110 102619 89103 94270 99077 79472 84639 92015 77555 64240 13994
7443A3994j3201J8601K3422M943P252j6509r644K8894P508j9992k0936j7890K342
$$ 13994 793 19394 42816 47759 55011 38502 28858 57752 65260 45268 24332 6442 8784
7430H784J045P052O108k966K1253J9901L807k0138j8853j2410J3152p841j2620
$$ 8784 9829 16881 22989 20023 41276 61177 64984 44846 25993 13583 26735 18894 6274
7417F274j1836r678K3808L3217O185k725J9781N039N114o976j4254q356K4274
$$ 6274 -5562 -15240 8568 41785 47970 45245 65026 70065 75179 68203 53949 45593 69867
7404F9867J4352n48j7797m552j336K289p97M387k5990P143L3756j54j6385Q661
$$ 69867 84219 83671 65874 61322 59986 62275 61478 65865 39875 47018 80774 80620 64235 72896
7390G2896j0558l6226j9065k1740L2646J7415k986J8998J3409l2684l4587l2690
$$ 72896 62338 26112 7047 -14693 17953 35368 32382 51380 64789 32105 -2482 -35172
7378c5172P957O935J1685R029N520K1630M923P507J6881k855j8166n231m363m620
$$ -35172 -27215 -20280 -8595 434 5954 27584 32507 40014 56895 54040 35874 30643 26280 21660
7364B1660k950l1374M376K9253K5585j2916j3379M297J7705M379l5989j3598P29
$$ 21660 18710 -12664 -8288 20965 46550 33634 20255 24552 42257 46636 10647 -2951 -2222
7351b222P182J5313K1217Q293L657j2962J466j880j8884k488j1015j752J0462
$$ -2222 4960 20273 41490 49783 53440 40478 41944 40064 21180 18692 7677 5925 16387
7338A6387k5577j0275K2067L187M537j210J0854j7288r208k3331J075M6867k3860
$$ 16387 -9190 -19465 2602 5789 10326 9116 19970 2682 -6526 -29857 -28782 18085 -5775
7325e775N041K9593P074j1792j9124k269K7051L4302K2101m4875n7725L384K7829
$$ -5775 -734 28859 35933 24141 5017 2748 29799 64101 86202 41327 -16398 -13014 14815
7312A4815J9499k8063m428K1789j3140k0764K1593J3518q79j6833j8875K3433
$$ 14815 34314 6251 1823 23612 10472 -10292 11301 24819 23940 7107 -11768 11665
7300A1665K0677N726j906j9960j5075j573J248l237j6790l503J9563K3321q53
$$ 11665 32342 38068 36162 16202 1127 -446 802 -2435 -19225 -22728 -3165 20156 19303
7287A9303J2471p53J0696K9139o216J8303J1928l968k3750k0874j2737K3975q743
$$ 19303 31774 31021 41717 70856 64640 82943 94871 90903 67153 46279 33542 57517 48774
7274D8774k9793k1871J5350K3088K1710j4495l9564j7106K7696M315q579m260
$$ 48774 18981 -2890 12460 35548 57258 42763 3199 -13907 13789 18104 9525 5265
7262E265j398K653J5161J1335R07J8338j2391p052j0618k3645J2463P048o058
$$ 5265 3867 6520 21681 33016 33923 52261 39870 32818 22200 -1445 11018 18066 12008
7249A2008k2271M950n394j431K5970K1266j763o007o717k0256J1115L2705J1079
$$ 12008 -10263 -5313 -10707 -12138 13832 35098 33335 27328 20611 355 11470 44175 55254
7236E5254m9486l0822K7860M2350k4721Q79P124J7790k3245o141K471j9241k2202
$$ 55254 5768 -25054 2806 45156 20435 21314 28438 46228 22983 16842 19313 72 -22130
7223b2130P270K5006r385n255J0279K4130q188r098J7172k659k3934j5124J0345
$$ -22130 -14860 10146 761 -4494 5785 29915 21727 12629 29801 27142 3208 -11916 -1571
7210a571J8862K0971j20m566r170K22j8198k1359N097L6065K1581j2489N570J5296
$$ -1571 17291 38262 38142 33576 24406 24628 6430 -14929 -9832 26233 47814 35325 40895 56191
7196E6191l979j0823K7212l583k8089k0301J1515J6058l0431k9307l1081J1927
$$ 56191 52212 41389 68601 65018 36929 16628 28143 44201 13770 -15537 -46618 -34691
7184c4691K6826J1615k565j6346q935K5560K3973r121j4136j6900r218k971Q918
$$ -34691 -7865 3750 1185 -15161 -24096 1464 25437 16316 2180 -14720 -23938 -26909 -17991
7171a7991R50J1979J309N027J0818j0594P931J6863O816K8545N940j9604k9530
$$ -17991 -17041 -5062 -3753 1274 12092 1498 9429 26292 33108 61653 67593 47989 18459
7158A8459j1142k2977M99L1409K0311k7632k7046J2791K8758n18l5629J2874K3772
$$ 18459 7317 -15660 -15161 16248 36559 8927 -18119 -5328 23430 22912 -12717 157 23929
7145B3929J7760j9416q339o930J6267J5635l3388M689K2451N748n908M770p650
$$ 23929 41689 22273 13934 7004 23271 38906 5518 10207 32658 38406 32498 37268 29618
7132B9618m395K1010R1l4341k8789L5586k402j3841q707J8580Q626M117K4003
$$ 29618 25223 46233 46324 11983 -16806 18780 16378 2537 -6170 12410 21036 25153 49156
7119D9156K4449K2464j2984j3687k1339k2207J3662R79j1049J3669K4170p219
$$ 49156 73605 96069 83085 69398 48059 25852 39514 40493 29444 43113 67283 60064
7107F0064j9578J7743l3921j0828M646l344K687j1146j0486j9528n843L2221n403
$$ 60064 40486 58229 24308 13480 18126 14782 17469 6323 -4163 -23691 -29534 2687 -2716
7094b716J773J2897K2640O441j1320R2J2573J0564J9505M186l584j5174j0594
$$ -2716 -943 11954 34594 41035 29715 29807 42380 52944 72449 76635 73051 57877 47283
7081D7283J0025J5060J2406l0252q05o979J4654k6149n254J988L245l463n117
$$ 47283 57308 72368 84774 54522 53717 46738 61392 35243 29989 31977 35222 31759 26642
7068B6642m378p864Q659K3964k919j0698j6698o997K3797P372q8k6142j3713l598
$$ 26642 22264 14400 23059 47023 44104 33406 16708 9711 33508 40880 40792 14650 937 -2661
7054b661R321j5603j4159Q961K6958k901j6518N071L3715Q946k044N536k5092
$$ -2661 6660 -8943 -23102 -14141 12817 9916 -6602 -1531 32184 41130 39086 44622 19530
7041A9530k3223j4940K8116J8942p231K8193m132k1347j7748J0296J2399j5499
$$ 19530 -3693 -18633 9483 28425 21194 49387 45255 23908 6160 16456 28855 13356
7029A3356q336L4981O707p458n556J493N074o638J9705J6759n912k2688J2601
$$ 13356 5020 40001 46708 39250 33694 35187 40261 33623 53328 70087 64175 41487 54088
7016E4088J68K977l3136j9001P664k760J0329l661N522j0568m2431j3329M2031
$$ 54088 54256 57233 24097 5096 12760 10000 20329 16668 22190 11622 -30809 -44138 -2107
7003b107J7127j4025o316k4186J7121K1705R893J3630r638L198N237J3242j7568
$$ -2107 15020 995 -5321 -29507 -12386 9319 19212 32842 23204 26402 31639 44881 27313
6990B7313l9287q458M018j877n409M34K2052J6866k496j7915M493K6210j000L869
$$ 27313 -11974 -20432 -16414 -18291 -23700 -23266 -1214 15652 13156 -4759 -266 25944 24944 28813
6976B8813J4081N860l2861j2358K14n467L2749m418k3651j500j4552K4151K4545
$$ 28813 42894 48754 15893 3535 3749 -1718 31031 26613 2962 1462 -13090 11061 35606
6963C5606K0260M007j7411m929J8034Q207n0374j5282K0481r823P120R287R715
$$ 35606 55866 59873 42462 37533 55567 63774 13400 -1882 18599 8776 15896 25183 34898
6950C4898R922r801j5758O93J1598L148j5857p62R655K1043k4418n0278m3532
$$ 34898 44820 35019 19261 19954 31552 34700 18843 18081 27736 48779 24361 -25917 -69449
6937f9449j0709L0220J072M6731J3303j8019L650q831o813K4849K0620j3634r865
$$ -69449 -80158 -49938 -48866 -2135 11168 -6851 -3201 -12032 -18845 6004 26624 12990 3125
6924C125j8203N181M2401L0429J3441k9081j4392J0236l34j7319N26r822P782
$$ 3125 -15078 -9897 32504 62933 76374 47293 32901 43137 42803 25484 26010 16188 23970
6911B3970J2687k940j7761j8403j785n507q480l364K3332k804P131K3260L830
$$ 23970 36657 33717 15956 -2447 -4232 -9739 -18219 -21583 1749 -1055 6076 29336 33166
6898C3166N50k5966j0185J065j273m107J4780J0609k124q315R017K5700K4213
$$ 33166 33716 7750 -2435 -1370 -2643 -6750 8030 18639 16515 8200 17217 42917 67130
6885F7130j0204j9026j7105j0M386K6659j3091k4930K963j5295K034l5750J6124
$$ 67130 56926 37900 20795 20785 25171 51830 38739 13809 16772 1477 3511 -32239 -16115
6872a6115M85l3559K5364O954J5662J1371p555r456M971k4995j996k404n33K941
$$ -16115 -15630 -49189 -23825 -16871 -1209 10162 2607 -6849 -1878 -26873 -28869 -31273 -31806 -28865
6858b8865K8698M699Q54J9175J4236k35k6164j8395p581J5291J9817K195j9667
$$ -28865 -167 4532 5386 24561 38797 38562 12398 -5997 -13578 1713 21530 23725 4058
6845D058j0923L136K6664p007l513J6654n124k1059j9298m258j877j9358j2502
$$ 4058 -6865 -3729 22935 15928 12415 29069 23945 2886 -16412 -20670 -22547 -41905 -54407
6832e4407J2043o853J7395J7651R289j1485m784L93O544L9319J2775l9131l6148
$$ -54407 -42364 -49217 -31822 -14171 -4882 -16367 -21151 -20758 -14214 25105 37880 -1251 -37399
6819c7399R30J2581k7145n199J0620J0848K9224L704p377L349k1547K021K3353
$$ -37399 -36469 -23888 -51033 -56232 -45612 -34764 -5540 -1836 -9213 -5864 -27411 -25390 -2037
6806b037J2623j1570O444J3158N885j5973k8519n824J112J6112K3186j1091K2661
$$ -2037 10586 -984 5460 18618 24503 8530 -19989 -25813 -24701 -8589 14597 3506 26167
6793B6167q474k2799k0074p16k0616p894r290J7887J7984o40k711l454J8807J1137
$$ 26167 17693 -5106 -25180 -25896 -46512 -54406 -63696 -45809 -27825 -28465 -31176 -34630 -15823 -4686
6779d686q909J8767K3338K1020K0194k2488p629k5936j3615N019l495Q555q257
$$ -4686 -13595 5172 28510 49530 69724 47236 39607 13671 56 5075 1580 10135 1878
6766A878l5831m406P092J2894j2580M450J9947j0904L3892K4884j3563N319p769
$$ 1878 -33953 -38359 -31267 -18373 -30953 -26503 -6556 -17460 16432 41316 27753 33072 25303
6753B5303K949J1864J2383M495J834j0355p370j0880r115J4546n748M45l353Q297
$$ 25303 28252 40116 52499 56994 58828 48473 41103 30223 21108 35654 29906 30351 26998 35295
6739C5295o232n185R298P64M557k8875k7734j6631J1541N547p96J1236J3529r179
$$ 35295 29063 23878 33176 33940 38497 9622 -18112 -34743 -23202 -17655 -18451 -7215 6314 -2865
6725b865L0869J9106O247J3792L1261j1223j1869j5291J2985j1630j8557l8789
$$ -2865 28004 47110 53357 67149 98410 87187 75318 60027 73012 61382 42825 4036
6713D036j4575K8126M7160j3534l3759j7057j0827o859o033j5362M93K2424K4493
$$ 4036 -10539 17587 64747 51213 17454 397 -10430 -17289 -23322 -38684 -38191 -15767 8726
6700H726K6969j2834k1539L178j18k0140o053K4209J5154j292Q053J5003r552
$$ 8726 35695 22861 1322 4500 4382 -15758 -21811 2398 17552 16260 24313 39316 29764
6687B9764n04m919q470P415L680k8751Q154K3739m005j4181K588J09p773j0391
$$ 29764 29260 24341 15871 23286 26966 -1785 6369 30108 26103 11922 14510 14619 6846 -3545
6673c545P358l1303j2872K9206J9k0919L206N2873J5485m6258k4699K4725K7028
$$ -3545 3813 -27490 -40362 -11156 -11137 -32056 -28850 24023 39508 -6750 -31449 -6724 20304
6660B0304j0567j8379k5876o090J6617L521J10J5072J684N58k3946k2407q577
$$ 20304 9737 -8642 -34518 -40608 -23991 -20470 -20360 -5288 -3604 -3046 -26992 -49399 -57976
6647e7976R165J1095K8872j2626k3041o883J6494R913J2842J2167l0442N389o887
$$ -57976 -48811 -37716 -8844 -21470 -44511 -51394 -34900 -24987 -12145 22 -30420 -25031 -31918
6634c1918M0815J4736N731K2992j9936k1235k2002K7977M1254L119k6202j4293
$$ -31918 8897 23633 29364 52356 32420 11185 -10817 17160 58414 61533 35331 21038
6622B1038j6587j1103N256K1822k2262l335M208j261R928P794K499j035J5693
$$ 21038 4451 -6652 -1396 20426 -1836 -5171 -963 -2224 7704 15498 17997 16962 32655
6609C2655j9517k9621j880J877R104j2662o785M142R015Q128O514j0159J4569
$$ 32655 13138 -16483 -18363 -16486 -7382 -20044 -26829 -22687 -13672 -5544 970 -9189 5380
6596E380L4409K8563J7855j7947m2468k6994j4679J1979N777M72j3367K4009j8630
$$ 5380 39789 68352 86207 68260 25792 -1202 -15881 -3902 1875 2347 -11020 12989 -5641
6583e641j2961R453N7591m055n8305j5331K7985J1338J2811P90R166p175k0633
$$ -5641 -18602 -9149 48442 44387 -13918 -29249 -1264 10074 22885 23675 32841 25666 5033
6570E033k7895j4801M756J9839J7038j0772j1881q316J2558P3K4049N454q465
$$ 5033 -22862 -37663 -32907 -13068 3970 -6802 -18683 -26999 -14441 -14368 9681 15135 6670
6557F670r422K227M1147M750k9172r635J5190j0553k8622L1874K5143J1070k9259
$$ 6670 -2752 -525 40622 45372 16200 6565 21755 11202 -17420 14454 39597 50667 21408
6544B1408k2270J9500q909l7259M201k774j1456J2872N334K8742K2996J0653k2144
$$ 21408 -862 18638 9729 -27530 -23329 -26103 -37559 -24687 -19353 9389 32385 43038 20894
6531B0894p895o159j231O420k407o577J5200J1227j6492K852j9302O050K9535
$$ 20894 12999 6840 5609 12029 9622 3045 18245 29472 12980 15832 -3470 2580 32115
6518C2115o982j6932k994K637P489J4088J1566j9549l723L32j4771j7124J4472
$$ 32115 25133 8201 5207 7844 15333 29421 40987 21438 17715 18047 3276 -13848 624
6505F24k2410l6256J0319K0161k626n580K711O590K3096K2504M898q789j8670
$$ 624 -21786 -58042 -47723 -27562 -30188 -35768 -33057 -26467 -3371 19133 24031 15242 -3428
6492c428K972M052J2081k9760j276O135j1649j1629m447M619L8260m42r182J945
$$ -3428 -456 3596 15677 -14083 -15359 -9224 -20873 -32502 -36949 -32330 5930 5488 -3694 -1749
6478a749K1541j506j3505k4536j369M013j6540m978K1961J4724q158K662O677
$$ -1749 19792 18286 4781 -19755 -21124 -17111 -33651 -38629 -16668 -1944 -10102 -7440 -763
6465g63J1944j5164l3922J4593J6418Q305j0482j4267j9732N621J1853j3087J8123
$$ -763 11181 -3983 -37905 -23312 -6894 1411 -9071 -23338 -43070 -37449 -25596 -38683 -20560
6452b0560M9936l541j3231p862K5997J0048j2393l9683P899L500K36q033j4556
$$ -20560 29376 25835 12604 4742 30739 40787 28394 -11289 -3390 110 346 -7687 -22243
6439b2243Q845J0483j4721l6297P64j0518O878M3497J673l192K08q3Q740N384
$$ -22243 -13398 -2915 -17636 -53933 -53169 -63687 -56809 -13312 -11639 -14831 -14623 -14706 -5966 -582
6425e82O234k1141J7422J6248j2234j3154L0052j8428J4524Q505l6732j2199q481
$$ -582 5652 -15489 1933 18181 5947 -7207 22845 4417 18941 27446 -9286 -21485 -29966
6412b9966j894k6224N242K2847K8239K1628j568j2632j3931J5452l3628k4808
$$ -29966 -31860 -58084 -52842 -29995 -1756 19872 18304 5672 -8259 7193 -26435 -51243
6400e1243R807k6297J8928K6657r96j23J2118J915j9892k4143m112K2506L7900
$$ -51243 -41436 -67733 -48805 -22148 -23144 -23267 -11149 -9234 -29126 -53269 -57381 -34875 3025
6387C025J363j8764K2982J7155j8860r384M7534j2535l5440n648J1440L935J1631
$$ 3025 4388 -14376 8606 25761 6901 -2483 45051 32516 -2924 -8572 2868 6803 18434
6374A8434k3695n407j7562n389L1653L8242o31j3062j0703P176p893P859R827
$$ 18434 -5261 -10668 -28230 -33619 -1966 36276 35645 22583 11880 19056 11163 19022 28849
6361B8849l233j905j5587K2455R608m0428l1207L7659Q108k1780Q995j820m791
$$ 28849 25616 23711 8124 30579 40187 -241 -31448 6211 14319 -7461 1534 -286 -5077
6348e077j5996J96K2705l427N354M749j7687j4924k516q559J9574L321k2259r187
$$ -5077 -21073 -20877 1828 -1599 3755 8504 -9183 -24107 -26623 -35182 -15608 -12287 -34546 -43733
6334d3733K028J7775R780k0085k489k1591M858q69o144M643J442L9050N573L312
$$ -43733 -41705 -23930 -14150 -34235 -36724 -58315 -53457 -54326 -60470 -55827 -54385 -15335 -9762 -6450
6320f450j3630o447J0480J5010o503j388j2377l9803L596K9830J2475J5125K0937
$$ -6450 -20080 -26527 -16047 -1037 -7540 -8928 -21305 -61108 -57512 -27682 -15207 -82 20855
6307B0855R19l207J906m128r140l7506p639K7182K5826Q602o33j2067j5996Q657
$$ 20855 21774 18567 20473 16345 7205 -30301 -37940 -10758 15068 23670 23037 10970 -5026 3631
6293C631Q056m958J3313m6q698j3169j3818J6047K3000K86q546K4486j1060r619
$$ 3631 11687 6729 20042 19996 11298 -1871 -15689 358 23358 23644 15098 39584 28524 18905
6279A8905N994L851k8730l209O796J4154J6870j3948R339K0544p031p522o959
$$ 18905 24899 28750 20 -3189 3607 17761 34631 20683 30022 50566 43535 36013 29054
6266B9054O669K4185k3796j4726m323J1522p46j1364j352o898j2945P039K5039
$$ 29054 35723 59908 36112 21386 17063 28585 27839 16475 15123 8225 -4720 2319 27358
6253B7358Q96k576r630j7313r285k7788o574j363J6004J2735J9955J4152l9772
$$ 27358 28254 25678 16048 -1265 -10550 -38338 -44912 -46275 -30271 -17536 2419 16571 -23201
6240b3201L6122Q730k6369j3220K3834P294j7153q707r840P041J8548j9927p359
$$ -23201 12921 21651 -4718 -17938 5896 13190 -3963 -12670 -22510 -15469 3079 -16848 -24207
6227b4207L945J680J6876J0084J0595j1657k0164J7907o142j0767j7867O368J4728
$$ -24207 -20262 -18582 -1706 8378 18973 7316 -12848 5059 -1083 -11850 -29717 -23349 -8621
6214h621K1917L365l1206j0035M166K4631o715j795J300r454M063r113k744k883
$$ -8621 13296 16661 -14545 -24580 -20414 4217 -2498 -4293 -2993 -12447 -8384 -17497 -20241 -23124
6200b3124J2504j643m758m842m280J6327K264j7040R286j584J9381J1049L095
$$ -23124 -10620 -12263 -17021 -21863 -26143 -9816 -7552 -24592 -15306 -16890 2491 13540 16635
6187A6635k6753J36K8412M197j2559r721o577j8217j5412J859J867J6658L7690
$$ 16635 -10118 -9982 18430 22627 10068 347 -6230 -24447 -39859 -38000 -36133 -19475 18215
6174A8215K197q964K5j0306K294j511j3140J8616k153J0782O56K3600J3512j9603
$$ 18215 20412 11448 11473 1167 3461 1950 -11190 7426 5273 16055 16711 40311 53823 34220
6160C4220j9380j9081m384J7217L3270R423m448k6201R199J5930L374k3777j8588
$$ 34220 14840 -4241 -8625 8592 41862 51285 46837 20636 29835 45765 49139 25362 6774
6147F774j8935K2773K1004L668p866J3924k331j223M723J4575J9968l961k0906
$$ 6774 -12161 10612 31616 35284 27418 41342 39011 37788 42511 57086 77054 73093 52187
6134E2187j0995K189j8615m8803p558J0418l000N717j6596J7530J8733M926K005
$$ 52187 41192 43381 24766 -24037 -31595 -21177 -24177 -18460 -35056 -17526 1207 6133 8138
6121H138k113K734R404O392K990K2937k2521l300j307m1K487j3367k6862J1768
$$ 8138 6025 8759 18163 24555 27545 50482 27961 24661 23354 23313 25800 12433 -14429 -2661
6107b661R756L78N826K2872J6944o487k3328l5415J3812N731m12J0335r747j981
$$ -2661 7095 7473 13299 36171 53115 46628 23300 -12115 1697 7428 7016 17351 7604 5623
6093E623k2669l87K1018p920j0175O968K4922J6788j0390j0678r632k5802J742
$$ 5623 -17046 -17433 3585 -4335 -14510 -7542 17380 34168 23778 13100 3468 -22334 -20592
6080b0592n173J0831J5828j1035o490j3733l667j3987Q369n70O632J2703j6432
$$ -20592 -25765 -14934 894 -10141 -16631 -30364 -34031 -48018 -39649 -40219 -33587 -20884 -37316
6067c7316k6170P006K574O136K9758L2999k4067l1794J4434K225J7875J4530k8988
$$ -37316 -63486 -56480 -53906 -47770 -18012 14987 -9080 -40874 -26440 -24215 -6340 8190 -20798
6054b0798k2230J895J1948k5507o261M457n02L2423J343N85j5519j6946K820J5854
$$ -20798 -43028 -41133 -29185 -54692 -60953 -56496 -56998 -24575 -23232 -22647 -38166 -55112 -52292 -36438
6040c6438J7461N513K7651Q514j7024m011L992J0244j2250L76K455R190K9919
$$ -36438 -18977 -13464 14187 22701 5677 1666 5658 15902 3652 4028 6483 15673 45592
6027D5592K322k3288m098R09J2656K031l3623j6731j0955K6274K0243N94j2660
$$ 45592 47914 24626 20528 21437 34093 36124 2501 -14230 -25185 1089 21332 21926 9266
6014I266j0909O932J3919j0975j3786m971J0985J8266k256j9422J4290k816j016
$$ 9266 -1643 5289 19208 8233 -5553 -10524 461 18727 16471 -2951 11339 8523 7507
6001G507k8780J4362K4760j3456j6223j2954K9356J6843j3120k2294M270K640
$$ 7507 -21273 -6911 17849 4393 -11830 -24784 4572 21415 8295 -13999 -9729 -7089
5989g089K9469J5573j7093k4085m615j1866l3496J3713J8602M396J9919L204j2330
$$ -7089 22380 37953 20860 -3225 -7840 -19706 -53202 -39489 -20887 -16491 3428 6632 -5698
5976e698k6782j1990J1692J8427K22q041K5481m302k896p726l7355J980n538J6867
$$ -5698 -32480 -44470 -32778 -14351 -14129 -22170 3311 -991 -3887 -11613 -48968 -46988 -52526 -35659
5962c5659K4092J1729L2436O127j0682j0290j8171r310J1203R559K702j4855K24
$$ -35659 -11567 162 32598 38725 28043 17753 -418 -9728 1475 11034 13736 -1119 -895
5949h95j1513O67J1544K4498O078L871k0070l091J9584k3267k7729N699P177O139
$$ -895 -12408 -11741 -197 24301 30379 34250 14180 11089 30673 7406 -20323 -14624 -7447 -1308
5935a308K3230J678J0754k5949l2841j5835j828J1165o318K587K797k574L1828
$$ -1308 21922 23600 34354 8405 -24436 -40271 -42099 -30934 -37252 -34665 -31868 -34442 -2614
5922b614K3885q654n579K1583P520j5717O419M0p076j1257l6713n750J3308j4374
$$ -2614 21271 12617 7038 28621 36141 20424 26843 26883 19807 8550 -28163 -33913 -20605 -34979
5908c4979J1311K6222J0243r485l124O514j175n348r056Q273o045J0366J2874
$$ -34979 -23668 2554 12797 3312 188 6702 5527 179 -8877 -604 -6649 3717 16591
5895A6591K648Q25J2001k0414j060j1753K098m092n106j4060J5983P16k3818j2386
$$ 16591 19239 20064 32065 11651 10591 -1162 936 -3156 -8262 -22322 -6339 -5623 -29441 -41827
5881d1827M078K1927n439m260l1057j0375K0780O353r741P905J3344r88K433J3859
$$ -41827 -37749 -15822 -21261 -25521 -56578 -66953 -46173 -39820 -49561 -41656 -28312 -29300 -26867 -13008
5867a3008o347k1136k911J1898K4191K1542o980k1449L22j863Q319j3582l626
$$ -13008 -19355 -40491 -43402 -31504 -7313 14229 7249 -14200 -13878 -15741 -7422 -21004 -24630
5854b4630q229j2134Q122K2424K6562m339o434o733R105J8066k2313M515Q162
$$ -24630 -32859 -44993 -36871 -14447 12115 7776 1342 -5391 3714 21780 -533 3982 12144
5841A2144j7906j9401o404N003J404k1545J6289J4408M1950j854k3686j4461m543
$$ 12144 -5762 -25163 -31567 -26564 -25160 -46705 -30416 -16008 25942 24088 402 -14059 -18602
5828a8602P162j1596P977J2889l2817J6473K2894K0284p571K0278k870k2683o361
$$ -18602 -11440 -23036 -15059 -2170 -34987 -18514 4380 24664 17093 37371 34501 11818 5457
5815E457j3209j7543m329j816J788l44n004J0036n471j446R802p503j9071m59
$$ 5457 -7752 -25295 -29624 -31440 -29652 -29996 -35000 -24964 -30435 -31881 -22079 -29582 -48653 -49112
5801d9112J0927M0106L9942k3960m1953j7508J4710M766k0468n826J5072r628
$$ -49112 -38185 1921 41863 17903 -24050 -41558 -26848 -22082 -42550 -48376 -33304 -42932
5789d2932K169J8152k869P514L205l0330K843O510J2359J7859o733J4500j301
$$ -42932 -40763 -22611 -25480 -17966 -14761 -45091 -42248 -35738 -23379 -5520 -12253 2247 946
5776I46j3870p812j8092K4528K0459n389N494L3106J3247l0633k9364L777K332
$$ 946 -12924 -20736 -38828 -14300 6159 770 6264 39370 52617 21984 -7380 -3603 -1271
5763a271j2548P62L3432k4582k7062k3397p998K0298R123Q788L577J113j2708
$$ -1271 -13819 -13057 20375 -4207 -31269 -54666 -62664 -42366 -33243 -24455 -20878 -19765 -32473
5750c2473P582p738j564o701K0460O462o000M906j4661J8049J8371J8922o787
$$ -32473 -24891 -32629 -34193 -40894 -20434 -13972 -19972 -15066 -29727 -11678 6693 25615 18828
5737A8828j3021J6927j6948k3252J1099L3135J7368n670l8431n664j5876o950
$$ 18828 5807 22734 5786 -17466 -6367 26768 44136 38466 35 -5629 -21505 -28455
5725b8455K6622J5511o908m864j8892J4103J5720J2058Q043Q91P964k3143k0821
$$ -28455 -1833 13678 6770 1906 -16986 -2883 12837 24895 32938 33829 41793 18650 -2171
5712b171j3608R744J8501k3966l527M4542J3512j6934m667j3395k904J9388n255
$$ -2171 -15779 -6035 12466 -11500 -15027 29515 43027 26093 21426 8031 5127 24515 19260
5699A9260l4670J1182P251q588l1030J633L1978j0619j4225J5124L8783K9774
$$ 19260 -15410 -4228 3023 -5565 -36595 -34962 -2984 -13603 -27828 -12704 26079 55853
5687E5853O89l0834j6073k682k8844j153M2485K2250o322k744j3585k5110j7627
$$ 55853 56542 25708 9635 6953 -21891 -23044 19441 41691 35369 32625 19040 -6070 -23697
5674b3697n839k043r940p683j0969M2113K2527m88L162o904k4735J1521n778k126
$$ -23697 -29536 -31579 -41519 -49202 -60171 -18058 4469 3981 7143 239 -24496 -12975 -18753 -20879
5660b0879n537J4141l779K548N337J6139j77J4189K4558L049j2151k539j1957
$$ -20879 -26416 -12275 -16054 -13506 -8169 7970 7793 21982 46540 49589 37438 34899 22942
5647B2942j2220R903J0550l2544l7658J0788L6843k4207k1556R200M555n242m05
$$ 22942 10722 20625 31175 -1369 -39027 -28239 8604 -15603 -37159 -27959 -23404 -28646 -29051
5634b9051M2L8510J0154K5868Q037r136j1929n143N893J0854j0338k6456j5758
$$ -29051 -29009 9501 19655 45523 53560 44424 32495 27352 33245 44099 33761 7305 -8453
5621h453J0323j2016N008J5348j3943j2634k3351J480M7834M941k2958k2935j9010
$$ -8453 1870 -10146 -5138 10210 -3733 -16367 -39718 -38238 9596 14537 -8421 -31356 -50366
5608e0366J2473K5134J4007j2848q162q259K1358L204J1106n327j9396N051Q963
$$ -50366 -37893 -12759 1248 -11600 -19762 -28021 -6663 -3459 7647 2320 -17076 -12025 -3062
5595c062Q793J2187K100j6303K034j4205k2793K5150K1102N794q050q22n108J0273
$$ -3062 5731 17918 20018 3715 5749 -8456 -31249 -6099 15003 20797 12747 11925 6817 17090
5581A7090K4413p353k6462l927J1975M06k47k541M438m338k3943o281N304J5578
$$ 17090 41503 34150 7688 3761 15736 16142 15895 13354 17792 13454 -10489 -16770 -11466 4112
5567D112k579K0440k2402k876k5734n084j0343n435k3221J4321K9240O68K993
$$ 4112 1533 21973 -429 -3305 -29039 -34123 -44466 -49901 -73122 -58801 -29561 -28893 -25900
5554b5900O87m8J247j1093P959L197m297l444l012m832Q346J0833R058J3216L044
$$ -25900 -25213 -25261 -24014 -35107 -27148 -23951 -28248 -31692 -34704 -39536 -31190 -20357 -11299 1917 4961
5539D961j4070K990J1613M225k1395k6830j0260J3607N2311J5223n881k7147k6049
$$ 4961 -9109 -6119 5494 9719 -11676 -38506 -48766 -35159 17152 32375 26494 -653 -26702
5526b6702K1982L6043k4856l3757P534J5578J2330P857l1071j2545o719q001K7213
$$ -26702 -4720 31323 6467 -27290 -19756 -4178 8152 16009 -15062 -27607 -34326 -42327 -15114
5513a5114J1225n999l823r444k6297j55J796n875o419M9017J8625K046N120k2671
$$ -15114 -3889 -9888 -13711 -23155 -49452 -49607 -47811 -53686 -60105 -11088 7537 9583 14703 -7968
5499g968n185l6178K2956O753k3227J500N292K8265J4816M046n326J1183j3439
$$ -7968 -13153 -49331 -26375 -19622 -42849 -41349 -36057 -7792 7024 11070 5744 16927 3488
5486C488n291q696j1767m5266J4553J1235m35L857l191K5809l229j3926m26m959
$$ 3488 -1803 -10499 -22266 -67532 -52979 -41744 -42179 -38322 -41513 -15704 -18933 -32859 -33285 -38244
5472c8244J965M7123j116l576k092n559k542j5300q211n835p109J725n249J599
$$ -38244 -36279 10844 9728 6152 4060 -1499 -4041 -19341 -27552 -33387 -40496 -38771 -44020 -42421
5458d2421P949J1271K0510m499j5306m737L5525J6759l2968k1759J0079R444L0508
$$ -42421 -34472 -23201 -2691 -7190 -22496 -27233 8292 25051 -7917 -29676 -19597 -10153 20355
5445B0355K1528J324L950j8678p59l985J151J9404N033k2836j6210l4555j8142
$$ 20355 41883 43207 47157 28479 27720 23735 24886 44290 49323 26487 10277 -24278 -42420
5432d2420J6126j1427K1351M6474K0211l267n6738l9264J4906M0881J2628N916
$$ -42420 -26294 -37721 -16370 30104 50315 47048 -9690 -48954 -34048 6833 19461 25377
5420B5377O30k3109k0970J0886K810J7045l302j9852N953J9073Q150q369l3270
$$ 25377 26007 2898 -18072 -7186 -4376 12669 9367 -10485 -4532 14541 22691 14322 -18948
5407a8948q979l826J0735J9603O384k1014P52P048k783j62L0480o507k1468J3093
$$ -18948 -27927 -31753 -21018 -1415 4969 -16045 -15293 -8245 -11028 -11190 19290 12783 -8685 4408
5393D408L3708j4297l7527L7695J7516j0151j5860j0621q024n738j6532k2659
$$ 4408 38116 23819 -13708 23987 41503 31352 15492 4871 -3153 -8891 -25423 -48082
5381d8082N207L435J5947K9118k583Q056n751j8161k2313j5603L4497K1503M989
$$ -48082 -42875 -39440 -23493 5625 3042 11098 5347 -12814 -35127 -50730 -16233 5270 10259
5368A0259l641j4347j073J6432R399L1278K5576O924k4006k0211k7300m419j722
$$ 10259 6618 -7729 -8802 7630 17029 48307 73883 80807 56801 36590 9290 4871 3149
5355C149j4792L779Q574P479J1352j0634j040k5646p098N400l8181k1925K6362
$$ 3149 -11643 -7864 710 8189 19541 8907 7867 -17779 -24877 -19477 -57658 -79583 -53221
5342e3221K1705k0408j8832L4594K6349J3461J995J6031P237R209l1012j7369
$$ -53221 -31516 -51924 -70756 -36162 -9813 3648 5643 21674 28911 38120 7108 -10261
5330a0261J8784p928k6562j9618K225J1060K0115N203q479R692K8637R051l3529
$$ -10261 8523 595 -25967 -45585 -43360 -32300 -12185 -6982 -15461 -5769 22868 31919 -1610
5317a610l0836J2860o168j5840k25K0391M165j8204M511j2648l804j694j2983
$$ -1610 -32446 -19586 -25754 -41594 -41819 -21428 -17263 -35467 -30956 -43604 -47408 -49102 -62085
5304f2085K4240J0752m653J1097K9994J0889k3271k4843Q71j8194j2493K4481
$$ -62085 -37845 -27093 -31746 -20649 9345 20234 -3037 -27880 -27009 -45203 -57696 -33215
5292c3215k754k1810p52J2120J7084J3763J1905j8335l4011J172Q962J4809L977
$$ -33215 -35969 -57779 -58531 -46411 -29327 -15564 -3659 -21994 -56005 -54833 -45871 -31062 -27085
5279b7085L0873j2088j8385r228j9097K5286j8771k6717Q055J0868j2403J8933
$$ -27085 3788 -8300 -26685 -35913 -55010 -29724 -48495 -75212 -67157 -56289 -68692 -49759
5267d9759M4476L4307L187l9863j3867K3539j1821j6527l54q372l411o906J3523
$$ -49759 -5283 29024 32211 -7652 -21519 2020 -9801 -26328 -26682 -35054 -38465 -45371 -31848
5254c1848L443k0742q784J1227J5663j5023N490K7075j9900k98m136K589K4094
$$ -31848 -28405 -49147 -57931 -46704 -31041 -46064 -40574 -13499 -33399 -33697 -37833 -35244 -11150
5241a1150J2304P122M932l3084p700j2007J1130K334K6400K1994j0886J5877N673
$$ -11150 1154 8276 13208 -19876 -27576 -39583 -28453 -26119 281 22275 11389 27266 32939
5228C2939l1313j4616M990j4679k0102J0786J3310Q368j820J4251k805q62K2356
$$ 32939 1626 -12990 -8000 -22679 -42781 -31995 -18685 -10317 -12137 2114 -691 -1553 20803
5215B0803n073k0143m663k1305r791q966L5559L931j7637m680J6479k884J7831
$$ 20803 15730 -4413 -9076 -30381 -40172 -49138 -13579 -9648 -27285 -31965 -15486 -18370 -539
5202e39L002k697J2545k1094k1560J4470L4556M0400R840n2926k0160q889J1374
$$ -539 2463 -234 12311 -8783 -30343 -15873 18683 59083 68923 15997 -4163 -13052 -1678
5189a678K2494j6047L653j0351k3503J8772J1911m710J9851M475n263l6022P345
$$ -1678 20816 4769 8422 -1929 -25432 -6660 5251 541 20392 24867 19604 -16418 -9073
5176i073K3338J8534j3619J588j8087M989K8328j5601k0855J4034Q825K1183l4021
$$ -9073 14265 32799 19180 20768 2681 7670 35998 20397 -458 13576 22401 43584 9563
5163I563p2431O951o538o701K485K7978R086J6033K2609M012j533k9102j5815
$$ 9563 -62868 -55917 -62455 -69156 -66671 -38693 -29607 -13574 9035 13047 11514 -17588 -33403
5150c3403Q632j737J7159K4780J6510K1716j6867m2759J8919j6609j7034j2957
$$ -33403 -24771 -26508 -9349 15431 31941 53657 36790 -5969 12950 -3659 -20693 -33650
5138c3650n346Q090R311M134j2507M352J0915L0359J7318k5537j7148J3646k03
$$ -33650 -38996 -30906 -21595 -17461 -29968 -25616 -14701 15658 32976 7439 -9709 3937 3734
5125C734k3190k2904N462J0543Q45J2473K2602j4170l1078j0958j4779l571J4672
$$ 3734 -19456 -42360 -36898 -26355 -25510 -13037 9565 -4605 -35683 -46641 -61420 -64991 -50319
5112e0319K1305L1998o427L569k051p192N613K1743q483l045p419k0622R06J1041
$$ -50319 -29014 2984 -3443 126 -1925 -9117 -3504 18239 9756 6711 -708 -21330 -20424 -9383
5098i383Q740J615l2659n234N262L7087O233l8098K0739K2762L1991N644j0698
$$ -9383 -643 972 -31687 -36921 -31659 5428 11661 -26437 -5698 17064 49055 54699 44001
5085D4001k1026j8173k9627M253K0577n260J6053K746J1911j121k8621k2392J60
$$ 44001 22975 4802 -24825 -20572 5 -5255 10798 13544 25455 24334 -4287 -26679 -26519
5072b6519P719j210j2685N888r765j9550J5970n48N696J0989R235J6416p308M267
$$ -26519 -18800 -20010 -32695 -26807 -36572 -56122 -40152 -40700 -35004 -24015 -14780 1636 -5672 -1405
5058a405J2615l2002j286P78L428M757j2629j004K9771J927K7657J2839j9843
$$ -1405 11210 -20792 -22078 -21300 -17872 -13115 -25744 -26748 3023 4950 32607 45446 25603
5045B5603P599J3074l273l0678J0000K8807j622k7033r385M838O763p42J7232
$$ 25603 33202 46276 43003 12325 22325 51132 49510 22477 13092 17930 24693 23951 41183
5032D1183j059Q153j7964r085J2622j2336j106j1351p870j044J0170J8116J163
$$ 41183 40124 48277 30313 21228 33850 21514 20408 9057 1187 143 10313 28429 29592
5019B9592k3922j8098N291L540p166l524Q389n70l2771K5224J0581K84k1636j9327
$$ 29592 5670 -12428 -7137 -3597 -10763 -14287 -5898 -6468 -39239 -14015 -3434 -3150 -24786 -44113
5005d4113J6590K620Q352l9158k9278R733L443K5685K818j4863J4828L1944J9192
$$ -44113 -27523 -24903 -16551 -55709 -84987 -75254 -71811 -46126 -43308 -58171 -43343 -11399 7793
4992G793k0807j8832j9608p135O336J831Q244K5152j9134k2926j108k3094l46
$$ 7793 -13014 -31846 -51454 -58589 -52253 -50422 -42178 -17026 -36160 -59086 -60194 -83288 -83634
4979h3634J3328K5495L8239n764j3083Q18Q143J54J7795o80N756K6236j5046k8461
$$ -83634 -70306 -44811 -6572 -12336 -25419 -24601 -16458 -16304 1491 811 6567 32803 17757 -10704
4965a0704k8864R793q112k1119o112q778M022J3644M0692L0417l630j8817R645
$$ -10704 -39568 -29775 -37887 -59006 -65118 -73896 -69874 -56230 -15538 14879 11249 -7568 2077
4952B077j321l4084r88K812k618j3403j438K5308L089q193j0353o23m389K2565
$$ 2077 756 -33328 -34316 -31504 -34122 -47525 -48963 -23655 -20566 -28759 -39112 -39735 -44124 -21559
4938b1559L1419r358j6207q863n332l3798r869L5340L5725j4487j0964m871k3247
$$ -21559 9860 502 -15705 -24568 -29900 -63698 -73567 -38227 -2502 -16989 -27953 -32824 -56071
4925e6071K1745L187k2620M892K5300l683k5618J7319J7310j1151J1633k872R353
$$ -56071 -34326 -31139 -53759 -48867 -23567 -27250 -52868 -35549 -18239 -29390 -17757 -20629 -11276
4912a1276L036m4020l8057J9805M1968M1859P498l103l0228j2258j865K5389K102
$$ -11276 -8240 -52260 -90317 -70512 -28544 13315 20813 17710 -12518 -24776 -26641 -1252 850
4899H50k0147j3833J0048o313j4772k781L733K3866J7869L0103L0336j3429k4724
$$ 850 -19297 -33130 -23082 -29395 -44167 -46948 -43215 -19349 -1480 28623 58959 45530 20806
4886B0806j8758l4855p28K6961K6015K4906j7372k4468Q315j0125Q450Q892R738
$$ 20806 2048 -32807 -33535 -6574 19441 44347 26975 2507 10822 697 9147 18039 27777
4873B7777l5401p372j9159j9708K1858J0146j7285M078J1139j162k0806Q141J1844
$$ 27777 -7624 -14996 -34155 -53863 -32005 -21859 -39144 -35066 -23927 -25089 -45895 -37754 -25910
4860b5910p065M559j8128p356n895N95J0688Q451J5433J1006k137o818K253O642
$$ -25910 -32975 -28416 -46544 -53900 -59795 -59200 -48512 -40061 -24628 -13622 -15759 -22577 -20324 -13682
4846a3682j1694j2709J4423r483r245J081J2574n22p169p489j599J2748R80M295
$$ -13682 -25376 -38085 -23662 -33145 -42390 -41309 -28735 -29257 -36426 -43915 -45514 -32766 -31786 -27491
4832b7491j4210o473J7485j4841n670J2752K4571K4690M058n097l3132J4452R367
$$ -27491 -41701 -48174 -30689 -45530 -51200 -38448 -13877 10813 14871 9774 -23358 -8906 461
4819D61K4238j441l7198k1869n242J4007J5170J5605j9879j6761L8578L921l0864
$$ 461 24699 23258 -13940 -35809 -41051 -27044 -11874 3731 -16148 -32909 5669 9590 -21274
4806b1274j963L2048K3727k2778N309m189k5684q260k113J9786K6109J1502k0497
$$ -21274 -23237 8811 32538 9760 15069 10880 -14804 -23064 -25177 -5391 20718 32220 11723
4793A1723o094l7052J179K5478J207N486j2595j5290k378j8302Q513M6399N147
$$ 11723 5629 -31423 -30244 -4766 -3559 1927 -10668 -25958 -28336 -46638 -38125 8274 13421
4780A3421k5574k547O820r094Q622r536j2062j1108j6891R071Q08J6629M0336
$$ 13421 -12153 -14700 -7880 -16974 -8352 -17888 -29950 -41058 -57949 -48878 -48070 -31441 8895
4767H895k5355k1348r140K703P172k829j0029j5723n642K2054Mj6894P935j0008
$$ 8895 -16460 -37808 -46948 -44245 -37073 -39902 -49931 -65654 -71296 -49242 -49238 -66132 -58197 -68205
4753f8205k329O14L5200J2211R47K0465k1431j5301J1451j7757J4373K5924O731
$$ -68205 -70534 -69920 -34720 -22509 -21562 -1097 -22528 -37829 -26378 -44135 -29762 -3838 2893
4740B893r005p307n534J5945K0756l7454j1715o766K590p757j6215m631J3413
$$ 2893 -6112 -13419 -18953 -3008 17748 -19706 -31421 -38187 -35597 -43354 -59569 -64200 -50787
4727e0787o856j6051K709M673L836K7149Q701K484K3485l051j2326K199R008k2950
$$ -50787 -57643 -73694 -70985 -66312 -62476 -35327 -26626 -24142 -657 -3708 -16034 -13835 -4827 -27777
4713b7777q993J7006J4997j9890K4091J2414j3840M086K876k5171j6526l728j3765
$$ -27777 -36770 -19764 -4767 -24657 -566 11848 -1992 2094 4970 -20201 -36727 -40455 -54220
4700e4220O122M3509J1548j5756O930R830J5078j2327j4917j806l690j2898J5193
$$ -54220 -48098 -4589 6959 -8797 -1867 7963 23041 10714 -4203 -6009 -9699 -22597 -7404
4687g404K5331l582J4344j493K426m286l8326j4887j0649J100N82J8554J6710
$$ -7404 17927 14345 28689 27196 29622 25336 -12990 -27877 -38526 -37426 -36844 -18290 -1580
4674a580J4280J0735p129j5129o420j5015J9195o38l5213o869n050N404j1465
$$ -1580 12700 23435 16306 1177 -5243 -20258 -1063 -1701 -36914 -43783 -48833 -43429 -54894
4661e4894M833M3280K2383k7945j6531j2358J0940K8575J9745N028l479l344k664
$$ -54894 -50061 -6781 15602 -12343 -28874 -41232 -30292 -1717 18028 23056 19577 16233 13569
4648A3569j6564k6091J043N319j767J1287J0712L407J4581O066Q708k7610k2512
$$ 13569 -2995 -29086 -28043 -22724 -24491 -13204 -2492 915 15496 21562 30270 2660 -19852
4635a9852K80j2185J2028K426k2734r332K6990L1823l284M027J1103j6411K3975
$$ -19852 -19572 -31757 -19729 -17303 -40037 -49369 -22379 9444 6160 10187 21290 4879 28854
4622B8854K5473l0967j0902K1818r410j9254j4328k7598j7911j6208K499J9934
$$ 28854 54327 23360 12458 34276 24866 5612 -8716 -36314 -54225 -70433 -67934 -48000
4610d8000N693j2156P535J4128J2417L1163q687J7976L715l2749J6802j0285N1
$$ -48000 -42307 -54463 -46928 -32800 -20383 10780 2093 20069 23784 -8965 7837 -2448 -2397
4597b397j284N361k8093O467K8082j4463k8312k9571l170n302J158L1226J9795
$$ -2397 -3681 1680 -26413 -19946 8136 -6327 -34639 -64210 -67380 -72682 -71524 -40298 -20503
4584b0503R665q447r330j0510N339j057r849R079p80J1949K4122K4786k6783J6503
$$ -20503 -10838 -19285 -28615 -39125 -33786 -34843 -44692 -35613 -36393 -24444 -322 24464 -2319 14184
4570A4184J1734N059j6711Q164j258n375k3805l6358N110R547L290m540k251Q516
$$ 14184 25918 30977 14266 22430 21172 15797 -8008 -44366 -39256 -29709 -26419 -30959 -33210 -24694
4556b4694J3376J2012o821j9888J3135N486j56j5169R683R274Q514l450j2551
$$ -24694 -11318 694 -6127 -26015 -12880 -7394 -7550 -22719 -13036 -3762 4752 1302 -11249
4543a1249r427K857J639J8009K275l126j993n750j7711k7058Q614L6225J7510
$$ -11249 -20676 -17819 -16180 1829 4104 978 -1015 -6765 -24476 -51534 -42920 -6695 10815
4530A0815j7430k8728M0075L0669j4220M641j1938k9797k7066K355K8446k424
$$ 10815 -6615 -35343 4732 35401 21181 25822 13884 -15913 -42979 -40624 -12178 -14602
4518a4602Q481J7936r835j7344q132j2829L4053M3771k7055l9550O962M337R510
$$ -14602 -6121 11815 1980 -15364 -23496 -36325 -2272 41499 14444 -25106 -18144 -13807 -4297
4505d297Q328k475l463L382K0538l2737k9392j8803J4252K1030M256r806P753
$$ -4297 4031 1556 -1907 1475 22013 -10724 -40116 -58919 -44667 -23637 -19381 -29187 -21434
4492b1434N467n990K3535j711M750q460l7009j9259J8563J0650n512r824L1798
$$ -21434 -15967 -21957 1578 -133 4617 -3843 -40852 -60111 -41548 -30898 -36410 -46234 -14436
4479a4436j4807l2143k0636J9137K3357j0775k6402K1779K1105L0985K9276K2795
$$ -14436 -29243 -61386 -82022 -62885 -39528 -50303 -76705 -54926 -33821 -2836 26440 49235
4467D9235k9526l543K8102K6541j7959k0168l3200l7299r534K4363K4689K5189
$$ 49235 19709 16166 44268 70809 52850 32682 -518 -37817 -47351 -22988 1701 26890
4455B6890J137j2439Q95j1301k6531q583q874J2527L9234L2316N931j5498K602
$$ 26890 28027 15588 16483 5182 -21349 -29932 -38806 -26279 12955 45271 51202 35704 38306
4442C8306j0198R728N144j9765q841j5618Q445J85n859P019j234k7163q309q946
$$ 38306 28108 37836 42980 23215 14374 -1244 7201 7386 1527 8546 7312 -19851 -28160 -37106
4428c7106N580k4183l301K9854J7957k4110j199j6425j0244k6397J2698M7318
$$ -37106 -31526 -55709 -59010 -29156 -11199 -35309 -36508 -52933 -63177 -89574 -76876 -29558
4416b9558K3858j4968J1866J6463j6985l824r822o231O306K8799R44k2918J8842
$$ -29558 -5700 -20668 -8802 7661 -9324 -13148 -22970 -29201 -22895 5904 6848 -16070 2772
4403B772J5879J141j1021r90j9855j8039K210P827m233J5340K8439J9700J2743
$$ 2772 18651 19792 8771 7781 -12074 -30113 -27903 -20076 -24309 -8969 19470 39170 51913
4390E1913j6261j7838Q768J2301M891k3975k9881l713j8258k5064K265J9230K4362
$$ 51913 35652 17814 26582 38883 43774 19799 -10082 -13795 -32053 -57117 -54852 -35622 -11260
4377a1260J8296q86k1212M373j4266j2374p811J6580N033j1103R882J4276J785
$$ -11260 7036 6150 -15062 -10689 -24955 -37329 -45140 -28560 -23527 -34630 -24748 -10472 -8687
4364h687r68k8060N1j28j1903J3724p232M389J1940L675j392L028J2765j58l549
$$ -8687 -9655 -37715 -37664 -37792 -49695 -35971 -43203 -38814 -26874 -23199 -24591 -21563 -8798 -8956 -12505
4349a2505k842K2412j1913L367N167J1602J482k909J8024q554k5353j2530j7124
$$ -12505 -15347 7065 -4848 -1481 3686 15288 16770 13861 31885 23331 -2022 -14552 -31676
4336c1676J239o170J4730N969n420J3177m889j1797k0657N0993R504l3718l1981
$$ -31676 -30437 -36607 -21877 -15908 -21328 -8151 -13040 -24837 -45494 5499 15003 -18715 -50696
4323e0696K935J5541K7579L323q141K97L2851K0007j3637k7178p63K693J0181
$$ -50696 -47761 -32220 -4641 -1318 -9459 -9162 23689 43696 30059 2881 2118 4811 14992
4310A4992l878l5992j3835L4145K9726O940l7622N749n36j4507k4926n011J9496
$$ 14992 11114 -24878 -38713 -4568 25158 32098 -5524 225 -311 -14818 -39744 -44755 -25259
4297b5259o883K457P350K3741K7801m552j4621k1786k3657n931P717k4139J730
$$ -25259 -32142 -29685 -22335 1406 29207 24655 10034 -11752 -35409 -41340 -33623 -57762 -56032
4284e6032L3242R846M491M813J5403j984r981k0782j0743L0271L971j9643J0970
$$ -56032 -22790 -12944 -8453 -3640 11763 9779 -202 -20984 -31727 -1456 2515 -17128 -6158
4271f158L017O721l0751l6086J7362J6548J9645J2670l7945J792N995R375l4590
$$ -6158 -3141 3580 -27171 -63257 -45895 -29347 -9702 2968 -34977 -33185 -27190 -17815 -52405
4258e2405l3683J2767j872L0155R431o563L2366r690M404J740N567J6682q536
$$ -52405 -86088 -73321 -75193 -45038 -35607 -42170 -9804 -19494 -15090 -13350 -7783 8899 363
4245C63k833j1088j1385j5365J6871Q158j8202q507L306K3611N984j1120P234
$$ 363 -2470 -13558 -24943 -40308 -23437 -15279 -33481 -41988 -38682 -15071 -9087 -20207 -12973
4232a2973J0899M804j1404o94J6179J8956p029j2759k8675j9148K5105L9595O005
$$ -12973 -2074 2730 -8674 -9368 6811 25767 18738 5979 -22696 -41844 -16739 22856 28861
4219B8861J9725j6558j0210k7727k8972L7615O048j7327j1794n583j3341K4996
$$ 28861 48586 32028 21818 -5909 -34881 2734 8782 -8545 -20339 -25922 -39263 -14267
4207a4267N898k5755K7392J4813k1712j4437L1141L0728j786m906R2k3655p667
$$ -14267 -8369 -34124 -6732 8081 -13631 -28068 3073 33801 32015 27109 27201 3546 -4121
4194d121p034r154j8695J8542K9015k6939K1602L8556k1l1314q841L341k0414
$$ -4121 -11155 -20309 -39004 -20462 8553 -18386 3216 41772 41751 10437 1596 4937 -15477
4181a5477K4930P03k4963o348k962P784N703K3027J4293l782j6209J423J2431
$$ -15477 9453 10156 -14807 -21155 -24117 -16333 -10630 12397 26690 22908 6699 8122 20553
4168B0553O558j3512l5032k2322J803L9359J399o313K583K136J972K381k4981
$$ 20553 27111 13599 -21433 -43755 -41952 -2593 -1194 -7507 -4924 -2788 -816 1565 -23416
4155b3416Q987m913q372P970P170n489K2318j521j6107J1507K455R700j2925M032
$$ -23416 -14429 -19342 -27714 -19744 -12574 -18063 4255 2734 -13373 -1866 589 10289 -2636 1396
4141A396l255j0989j6101K6280O119j6715q588n271j2272j8050j1535J7888L1754
$$ 1396 -1859 -12848 -28949 -2669 3450 -13265 -21853 -27124 -39396 -57446 -68981 -51093 -19339
4128a9339J203K4240j3401J5929p081q400J6075q033k2873K321N125K8884J9733
$$ -19339 -18136 6104 -7297 8632 1551 -6849 9226 1193 -21680 -19359 -14234 14650 34383
4115C4383j8221m1871J2626K5814j8997n087L660L815J9243k9811L588j361K5779
$$ 34383 16162 -25709 -13083 12731 -6266 -11353 -7693 -3878 15365 -14446 -10858 -12219 13560
4102A3560K365q624J616R496K499K8177j3452k0653j9664J3875O712k5222o181
$$ 13560 15925 7301 8917 18413 20912 49089 35637 14984 -4680 9195 15907 -9315 -15496
4089a5496j726k0226j0469L2381L8004J0107p178j5154k6085l293o17P791k419
$$ -15496 -17222 -37448 -47917 -15536 22468 32575 25397 10243 -15842 -19135 -19752 -11961 -14380
4076a4380m94M473J9941Q986N052k8766l2826j5184M6319J6191k461q426q39j3716
$$ -14380 -14874 -10401 9540 18526 23578 -5188 -38014 -53198 -6879 9312 6851 -1575 -2414 -16130
4062a6130J4928j3304k7065l67L1617J8374j873K0533j394j1372j3159Q02o025
$$ -16130 -1202 -14506 -41571 -41938 -10321 8053 6180 26713 25319 13947 788 1590 -4435
4049d435r484K0503O063k4566Q369K791k0207k1848N509O162p725Q593k607q264
$$ -4435 -13919 6584 12647 -11919 -3550 -759 -20966 -42814 -37305 -31143 -38868 -30275 -32882 -41146
4035d1146K2248r035j9633k785P084L0580L347j8628K990J2026L1236R490j9502
$$ -41146 -18898 -27933 -47566 -50351 -43267 -12687 -9340 -27968 -24978 -12952 18284 27774 8272
4022H272k0624r817J5733l560j6992J3901O975j3234K023q321j2849j1209J7159
$$ 8272 -12352 -22169 -6436 -9996 -26988 -13087 -6112 -19346 -17323 -25644 -38493 -49702 -32543
4009c2543j1971K3574L5139k01j1252k9645K1615L841k8122j8206q440J745r59
$$ -32543 -44514 -20940 14199 13998 2746 -26899 -5284 -1443 -29565 -47771 -56211 -54466 -55425
3996e5425O4157L1663j3166p596p13n922o131j1855k7150k3995K3086J4926M798
$$ -55425 8732 40395 27229 19633 18920 12998 6867 -4988 -32138 -56133 -33047 -18121 -13323
3983a3323J4870l9679k7159K7958J4513J5995j2427j4724j2062p222J2611k248
$$ -13323 1547 -38132 -65291 -37333 -22820 -6825 -19252 -33976 -46038 -53260 -40649 -42897
3971d2897J6354q794k357K4783n948j5234n611R715K828l931K719R711P309M079
$$ -42897 -26543 -35337 -37694 -12911 -18859 -34093 -39704 -29989 -27161 -31092 -28373 -18662 -11353 -7274
3957g274K1016J8084j1213r754j9498k2808L993J4968j9229N432L5119J1254j8841
$$ -7274 13742 31826 20613 10859 -8639 -31447 -27454 -12486 -31715 -26283 8836 20090 1249
3944A249k6592p795J7301J5842P088J451m2457r079K215k9938m473L1934L001
$$ 1249 -25343 -33138 -15837 5 7093 8544 -33913 -42992 -40777 -70715 -75188 -43254 -40253
3931d0253K276L6661l670k0128N457O004J0274j6559j3169j6323N154q852K487
$$ -40253 -37977 -1316 -4986 -25114 -19657 -13653 -3379 -19938 -33107 -49430 -44276 -53128 -50641
3918e0641o833J1443m822K876L7269K9515m645j3541j0491J1830k864n449J1611
$$ -50641 -57474 -46031 -50853 -47977 -10708 18807 14162 621 -9870 1960 -904 -6353 5258
3905E258k821l408J3363P028l6878l2563m116P88J4338o785K0866N3391J5973
$$ 5258 2437 -971 12392 19420 -17458 -50021 -54137 -53349 -39011 -45796 -24930 28461 44434
3892D4434J4544R090k9624j0934q468l5041n165J7358K4345k5899j9344J2525
$$ 44434 58978 68068 38444 27510 19042 -15999 -21164 -3806 20539 -5360 -24704 -12179
3880a2179k107k5367R56j1257K4738K0581J6750r661l3598j4133P309Q443K3362
$$ -12179 -14286 -39653 -38697 -49954 -25216 -4635 12115 2454 -31144 -45277 -37968 -29525 -6163
3867f163L5644K0026n75j4686l9455N493L2k1088J9502L1047Q494k3505l2953
$$ -6163 29481 49507 48932 34246 -5209 284 316 -20772 -1270 29777 38271 14766 -18187
3854a8187J911N446P714M525m5793l1098M1381J5723m9046Q554K8428k083J8036
$$ -18187 -16276 -10830 -3116 1409 -44384 -75482 -34101 -18378 -67424 -58870 -30442 -32525 -14489
3841a4489m293k393n127N05j3275J7733j7374k7326N178K1759K2229M956o723
$$ -14489 -18782 -21175 -26302 -25797 -39072 -21339 -38713 -66039 -60861 -39102 -16873 -11917 -18640
3828a8640K2649J1266K0349j5359l2794Q352N347k2185j0561K3808J2822k47m98
$$ -18640 4009 15275 35624 20265 -12529 -4177 1170 -21015 -31576 -7768 5054 4807 4309
3815D309l856j0587n522J158M690j7009k1486k624J9691L4626J2148j5868P930
$$ 4309 453 -10134 -15656 -14498 -9808 -26817 -48303 -50927 -31236 3390 15538 -330 7600
3802G600K1732m7943m8755k942N401M0096L3117J6168n894m0759j1986O739K2734
$$ 7600 29332 -18611 -67366 -70308 -64907 -24811 8306 24474 18580 -22179 -34165 -27426 -4692
3789d692p14j8381j747L511n754r673O587j5224j4616M253L3318J3169Q930l9626
$$ -4692 -5406 -23787 -25534 -22023 -27777 -37450 -30863 -46087 -60703 -56450 -23132 -9963 -1033 -40659
3775d0659j6957K4074J9390l576n376r92N373L2958J370l4208P75Q879K4822M039
$$ -40659 -57616 -33542 -14152 -17728 -23104 -24096 -18723 14235 15605 -18603 -17828 -8949 15873 19912
3761A9912j7249n11K5252K6657n19l5798k9834J5937J7386J9279K3061j1153k8136
$$ 19912 2663 2152 27404 54061 53542 17744 -12090 3847 21233 40512 63573 52420 24284
3748B4284k1696j909l184R965J8250j7936j7791P405p098l551J4493Q276k080
$$ 24284 2588 679 -2505 7460 25710 7774 -10017 -2612 -9710 -13261 1232 9508 7428
3735G428K1315K580k7433k320j4649j0475J2641K0507J3013j3457k2551j2497
$$ 7428 28743 31323 3890 1570 -13079 -23554 -10913 9594 22607 9150 -13401 -25898
3723b5898p306J4311K6931q5r357j5349R851K7467K91o432j268j7945k0535M870
$$ -25898 -33204 -18893 8038 7953 -1404 -16753 -6902 20565 20856 14424 13156 -4789 -25324 -20454
3709b0454P75J6419K037m2235J235M1307j8140j1229J2170j2534j8755Q904J6932
$$ -20454 -19679 -3260 -1223 -43458 -42223 -916 -19056 -30285 -18115 -30649 -49404 -40500 -23568
3696b3568q861k7731K8505J4867r600J4757n382M680K4770O061l4304k6963K7198
$$ -23568 -32429 -60160 -31655 -16788 -26388 -11631 -17013 -12333 12437 18498 -15806 -42769 -15571
3683a5571n320l0073j0023J8854j804J9780j2602m006M595O85J024P134J7475
$$ -15571 -20891 -50964 -60987 -42133 -43937 -24157 -36759 -40765 -36170 -35485 -34461 -27327 -9852
3670i852J4064j5221K7598M834r918P317J3583J5404j0439j5351k7391k957q674
$$ -9852 4212 -11009 16589 21423 11505 18822 32405 47809 37370 22019 -5372 -8329 -17003
3657a7003K7230J0669j555J4891j1195j0925N35O890j7479K11k0891m5051j5887
$$ -17003 10227 20896 19341 34232 23037 12112 12647 19537 2058 2269 -18622 -63673 -79560
3644g9560Q328J7823j3061l5943k024N6371M2796N886n38J3123j575l1685p392
$$ -79560 -71232 -53409 -66470 -102413 -104437 -48066 -5270 616 78 13201 11626 -20059 -27451
3631b7451J1163k0825j0975O064K1380j171P40l863K2015J853K028q553j3507
$$ -27451 -16288 -37113 -48088 -42024 -20644 -21815 -21075 -24938 -2923 -1070 958 -7595 -21102
3618b1102r821j061m822O777l75j3615J2835K8228J2532k217j0190O362K0373
$$ -21102 -30923 -31984 -36806 -30029 -30404 -44019 -31184 -2956 9576 7359 -2831 3531 23904
3605B3904j2053j6925P65J1449K703r541j0191J2527j0713j6934J3042j3759O24
$$ 23904 11851 -5074 -4309 7140 9843 302 -9889 2638 -8075 -25009 -11967 -25726 -25102
3592b5102J8533R506r354K0191p303k2769j0339O196M019j3550K3163K4059M412
$$ -25102 -6569 2937 -6417 13774 6471 -16298 -26637 -20441 -16422 -29972 -6809 17250 21662
3579B1662J8013j6161j9157L376J00k6497K286K0969J3727l2191k0488K8065J8885
$$ 21662 39675 23514 4357 7733 7833 -18664 -16378 4591 18318 -13873 -34361 -6296 12589
3566A2589k8593k839J5805Q126k6933k7561K4073R658l381j6786q922K1099j956
$$ 12589 -16004 -18843 -3038 5088 -21845 -49406 -25333 -15675 -19056 -35842 -44764 -23665 -25621
3553b5621k6103m048L1687O933l921k8620k4646K006J8247K116K056Q714o682
$$ -25621 -51724 -55772 -24085 -17152 -21073 -49693 -74339 -72333 -54086 -51970 -49914 -41200 -47882
3540d7882N535p280K4404K1687j2695j9709r003k0555K756J0062q948J9831L2032
$$ -47882 -42347 -49627 -25223 -3536 -16231 -35940 -44943 -65498 -62742 -52680 -61628 -41797 -9765
3527i765K3254m83n66k3246J5398o153j0859r6J0672o369N866N7k3125k6254j8269
$$ -9765 13489 13006 12440 -10806 4592 -1561 -12420 -12516 -1844 -8213 -2347 -2290 -25415 -51669 -69938
3512f9938J1573J8833J9767R149l214j2768q884N28Q768P947K249k443L955j5715
$$ -69938 -58365 -39532 -19765 -10616 -13830 -26598 -35482 -34954 -26186 -18239 -15990 -18433 -14478 -30193
3498c0193J3909K8248k67m2620j5881N1L612j9935k928K1238J0077j4795K6411
$$ -30193 -16284 11964 11697 -30923 -46804 -46753 -43141 -63076 -66004 -44766 -34689 -49484 -23073
3485b3073R609K3607J5664J3657k3391j1919J5689q976j6596j9551P665L0957
$$ -23073 -13464 10143 25807 39464 16073 4154 19843 10867 -5729 -25280 -17615 13342
3473A3342K2289o964n967n395q887k1994j3604k1239m6385Q416L4460J7407J4961
$$ 13342 35631 28667 22700 17305 8418 -13576 -27180 -48419 -94804 -86388 -51928 -34521 -19560
3460a9560R659J6972K888k014J422j0735j4429J0532P50j6549j384J6112J0325
$$ -19560 -9901 7071 9959 7945 9367 -1368 -15797 -5265 -4515 -21064 -22448 -6336 3989
3447C989j4393j4846K3113K9954j1115j1554k0968j1318M1800p90n862k1729J2988
$$ 3989 -10404 -25250 -2137 27817 16702 5148 -15820 -27138 14662 13872 8010 -13719 -731
3434g31k1108k8219R931o218j597J1787j131N775P703J0309k434j1627r642j1980
$$ -731 -21839 -50058 -40127 -46345 -47942 -36155 -37286 -31511 -23808 -13499 -15933 -27560 -37202 -49182
3420d9182m573J143m822J190J8942K0649p322k3067K635J4328P896p971J1054
$$ -49182 -53755 -52612 -57434 -56244 -37302 -16653 -23975 -47042 -44407 -30079 -22183 -30154 -19100
3407a9100K710k4353J6684j45j0162J977k2053j571L3949J1995k5175l704k2324
$$ -19100 -16390 -40743 -24059 -24204 -34366 -32389 -54442 -56013 -22064 -10069 -35244 -38948 -61272
3394f1272J6914K8789J2859q908l1756Q110J4000J89J0327K5314l057j7987J0682
$$ -61272 -44358 -15569 -2710 -11618 -43374 -35264 -21264 -21075 -10748 14566 11509 -6478 4204
3381D204K9339j2894m019k0855p304J0660Q13k980M012n842j1909l3039j2811
$$ 4204 33543 20649 16630 -4225 -11529 -869 -56 -3036 976 -4866 -16775 -49814 -62625
3368f2625J4645J4775L186M051p198k8096L4n411J0336L7987P34o989J3246M940
$$ -62625 -47980 -33205 -30019 -25968 -33166 -61262 -61228 -66639 -56303 -18316 -17582 -24571 -11325 -6385
3354f385k3670j0865K7625J5645J9414K0716M655j2569k6488P288J6940M480j2690
$$ -6385 -30055 -40920 -13295 2350 21764 42480 47135 34566 8078 15366 32306 36786 24096
3341B4096k2021k9937j4976J7876L2664l067K3092k831k1058q499k4276R729K693
$$ 24096 2075 -27862 -42838 -24962 7702 4635 27727 24896 3838 -4661 -28937 -19208 -16515
3328a6515j9518J0904K7116q300J4743J1738k7149j7037J4374l6374p858J2170
$$ -16515 -36033 -25129 1987 -6313 8430 20168 -6981 -24018 -9644 -46018 -53876 -41706
3316d1706j366J5785K7055J2683k6867q344j7785k1175K5338J8511J48j9070K0351
$$ -41706 -43072 -27287 -232 12451 -14416 -22760 -40545 -61720 -36382 -17871 -17723 -36793 -16442
$$ [...]
##END NTUPLES=NMR SPECTRUM
##END=
