##TITLE=Analysis number 319123
Compound Code cc 10208
Project Code adrs
Chemist Name fudan
##JCAMPDX= 6.0         $$ Bruker NMR JCAMP-DX V2.0
##DATA TYPE= NMR SPECTRUM
##DATA CLASS= NTUPLES
##ORIGIN= Bruker BioSpin GmbH
##OWNER= nmr
$$ XWIN-NMR		Version 3.5
$$ Wed May  3 10:28:43 2006 GMT Daylight Time (UT+1h)  MAYBRIDGE\nmr@NMR_250MHZ
##.OBSERVE FREQUENCY= 250.131544655141
##.OBSERVE NUCLEUS= ^1H
##.ACQUISITION MODE= SIMULTANEOUS (DQD)
##.ACQUISITION SCHEME= undefined
##.AVERAGES= 16
##.DIGITISER RES= 18
##SPECTROMETER/DATA SYSTEM= dpx250
##.PULSE SEQUENCE= zg30
##.SOLVENT NAME= CDCl3
##.SHIFT REFERENCE= (INTERNAL, CDCl3, 0, 16.4519)
##AUDIT TRAIL= $$ (NUMBER, WHEN, WHO, WHERE, WHAT)
$$ ##TITLE= Audit trail, XWIN-NMR		Version 3.5
$$ ##JCAMPDX= 5.01
$$ ##ORIGIN= Bruker BioSpin GmbH
$$ ##OWNER= nmr
$$ C:\u/data/dgb/nmr/ADRS/3570/pdata/1/auditp.txt
$$ ##AUDIT TRAIL=  $$ (NUMBER, WHEN, WHO, WHERE, WHAT)
(   1,<2006-05-03 10:28:20.34 +100>,<MAYBRIDGE\nmr>,<NMR_250MHZ>,
      <created by zg, POWCHK disabled, PULCHK disabled
       configuration hash MD5:
       84 BC 41 DB A1 6E 1D 46 DA 25 12 A5 C1 ED C5 3A
       data hash MD5: 64K
       80 F1 D5 9C 0D 57 4E 20 DA 24 E0 2B 99 B3 58 11>)
(   2,<2006-05-03 10:28:33.56 +100>,<MAYBRIDGE\nmr>,<NMR_250MHZ>,
      <Start of raw data processing
       ef LB = 0.3 FT_mod = 6 PKNL = 1 SI = 32K 
       data hash MD5: 32K
       84 32 F9 D7 18 0B 72 06 2D B3 32 B1 C3 0A C9 9F>)
(   3,<2006-05-03 10:28:35.06 +100>,<MAYBRIDGE\nmr>,<NMR_250MHZ>,
      <apk 
       data hash MD5: 32K
       CA 28 6B F7 49 F5 6B A0 1B 17 83 8C 66 F8 9F 15>)
(   4,<2006-05-03 10:28:35.79 +100>,<MAYBRIDGE\nmr>,<NMR_250MHZ>,
      <abs ABSG = 5 
       data hash MD5: 32K
       F8 B8 DB 00 5D 9B 03 DB 33 60 26 9E D2 46 94 D1>)
$$ ##END=
$$ 
$$ hash MD5
$$ DD 1E 9A 3C 38 E5 23 30 83 F5 C6 5F F1 54 9B AB
##$RELAX= 
##$RELAX= 
##$RELAX= 
##$RELAX= 
##$RELAX= 
##$RELAX= 
##$RELAX= 
$$ Bruker specific parameters
$$ --------------------------
##$DU= <C:\u>
##$EXPNO= 3570
##$NAME= <ADRS>
##$PROCNO= 1
##$TYPE= <nmr>
##$USER= <dgb>
##$AMP= (0..31)
100 100 100 100 100 100 100 100 100 100 100 100 100 100 100 100 100 100 
100 100 100 100 100 100 100 100 100 100 100 100 100 100 
##$AQSEQ= 0
##$AQ_mod= 3
##$AUNM= <au_zg>
##$AUTOPOS= <9 >
##$BF1= 250.13
##$BF2= 250.13
##$BF3= 250.13
##$BF4= 250.13
##$BF5= 500.13
##$BF6= 500.13
##$BF7= 500.13
##$BF8= 500.13
##$BYTORDA= 1
##$CFDGTYP= 0
##$CFRGTYP= 5
##$CHEMSTR= <none>
##$CNST= (0..31)
1 1 145 1 1 1 1 1 1 1 1 1 1 1 1 1 1 1 1 1 1 1 1 1 1 1 1 1 1 1 1 1 
##$CPDPRG= <>
##$CPDPRG1= <>
##$CPDPRG2= <>
##$CPDPRG3= <>
##$CPDPRG4= <mlev>
##$CPDPRG5= <mlev>
##$CPDPRG6= <mlev>
##$CPDPRG7= <mlev>
##$CPDPRG8= <mlev>
##$CPDPRGB= <>
##$CPDPRGT= <>
##$D= (0..31)
0 1 0 0 0 0 0 0 0 0.06 0 0 0 0 0 0 0.0002 0 0 0 0 0 0 0 0 0 0 0 0 0 0 
0 
##$DATE= 1146648498
##$DBL= (0..7)
120 120 120 120 120 120 120 120 
##$DBP= (0..7)
150 150 150 150 150 150 150 150 
##$DBP07= 0
##$DBPNAM0= <>
##$DBPNAM1= <>
##$DBPNAM2= <>
$$ [...]
##$SUBNAM7= <"">
##$SUBNAM8= <"">
##$SUBNAM9= <"">
##$SW= 20.6930455092707
##$SWIBOX= (0..15)
0 0 3 0 0 0 0 0 0 0 0 0 0 0 0 0 
##$SW_h= 5175.983436853
##$TD= 65536
##$TD0= 1
##$TE= 294.16
##$TE2= 300
##$TE3= 300
##$TEG= 300
##$TL= (0..7)
0 120 120 120 120 120 120 120 
##$TP= (0..7)
150 150 150 150 150 150 150 150 
##$TP07= 0
##$TPNAME0= <>
##$TPNAME1= <>
##$TPNAME2= <>
##$TPNAME3= <>
##$TPNAME4= <>
##$TPNAME5= <>
##$TPNAME6= <>
##$TPNAME7= <>
##$TPOAL= (0..7)
0.5 0.5 0.5 0.5 0.5 0.5 0.5 0.5 
##$TPOFFS= (0..7)
0 0 0 0 0 0 0 0 
##$TUNHIN= 0
##$TUNHOUT= 0
##$TUNXOUT= 0
##$USERA1= <user>
##$USERA2= <user>
##$USERA3= <user>
##$USERA4= <user>
##$USERA5= <user>
##$V9= 5
##$VALIST= <valist>
##$VCLIST= <CCCCCCCCCCCCCCC>
##$VD= 0
##$VDLIST= <DDDDDDDDDDDDDDD>
##$VPLIST= <PPPPPPPPPPPPPPP>
##$VTLIST= <TTTTTTTTTTTTTTT>
##$WBST= 1024
##$WBSW= 4
##$XGAIN= (0..3)
0 0 0 0 
##$XL= 0
##$YL= 0
##$YMAX_a= 325063
##$YMIN_a= -341580
##$ZGOPTNS= <>
##$ZL1= 120
##$ZL2= 120
##$ZL3= 120
##$ZL4= 120
##$ABSF1= 16.45187
##$ABSF2= -4.241302
##$ABSG= 5
##$ABSL= 3
##$ALPHA= 0
##$AQORDER= 0
##$ASSFAC= 0
##$ASSFACI= 0
##$ASSFACX= 0
##$ASSWID= 0
##$AUNMP= <proc_1d>
##$AZFE= 0.1
##$AZFW= 0.1
##$BCFW= 0
##$BC_mod= 0
##$BYTORDP= 0
##$COROFFS= 0
##$CY= 12.5
##$DATMOD= 1
##$DC= 0
##$DFILT= <>
##$DTYPP= 0
##$F1P= 14.0000005364418
##$F2P= -0.99999901652339
##$FCOR= 0.5
##$FTSIZE= 32768
##$FT_mod= 6
##$GAMMA= 0
##$GB= 0
##$INTBC= 1
##$INTSCL= 1
##$ISEN= 128
##$LB= 0.3
##$LEV0= 0
##$LPBIN= 0
##$MAXI= 10000
##$MC2= 0
##$MEAN= 0
##$ME_mod= 0
##$MI= 0
##$NCOEF= 0
##$NC_proc= -4
##$NLEV= 6
##$NOISF1= 0
##$NOISF2= 0
##$NSP= 0
##$NTH_PI= 0
##$NZP= 0
##$OFFSET= 16.45187
##$PC= 1
##$PHC0= 174.6476
##$PHC1= 8.898457
##$PH_mod= 1
##$PKNL= yes
##$PPARMOD= 0
##$PSCAL= 4
##$PSIGN= 0
##$REVERSE= no
##$SF= 250.130017540219
##$SI= 32768
##$SIGF1= 0
##$SIGF2= 0
##$SINO= 400
##$SIOLD= 32768
##$SREGLST= <1H.CDCl3>
##$SSB= 0
##$STSI= 32768
##$STSR= 0
##$SW_p= 5175.98343685301
##$SYMM= 0
##$S_DEV= 0
##$TDeff= 65536
##$TDoff= 0
##$TI= <Analysis number 999999
Compound Code 99
Book Reference 9
Project Code 9>
##$TILT= no
##$TM1= 0
##$TM2= 0
##$TOPLEV= 0
##$USERP1= <user>
##$USERP2= <user>
##$USERP3= <user>
##$USERP4= <user>
##$USERP5= <user>
##$WDW= 1
##$XDIM= 32768
##$YMAX_p= 386995944
##$YMIN_p= -515750
$$ End of Bruker specific parameters
$$ ---------------------------------
##NTUPLES= NMR SPECTRUM
##VAR_NAME=  FREQUENCY,     SPECTRUM/REAL,   SPECTRUM/IMAG
##SYMBOL=    X,             R,               I
##VAR_TYPE=  INDEPENDENT,   DEPENDENT,       DEPENDENT
##VAR_FORM=  AFFN,          ASDF,            ASDF
##VAR_DIM=   32768,         32768,           32768
##UNITS=     HZ,            ARBITRARY UNITS, ARBITRARY UNITS
##FACTOR=    0.157963299565203, 1,           1
##FIRST=     4115.1065228147, 0,             0
##LAST=      -1060.87691403831, 0,           0
##MIN=       -1060.87691403831, -515750,     0
##MAX=       4115.1065228147, 386995944,     0
$$ Real data points
##PAGE= N=1
##DATA TABLE= (X++(R..R)), XYDATA
$$ [...]
19142F201092P02372Q65109J005156J197501J531806J959044K830748L913603
19134B0206431N819226Q881594J3027730J7487543K0366640K2594550K4295619
19127A32679333J9512702Q710436J339821o206352j7649339k2346644k0468384
19120I5571573j8892539j6397086j2220465q258997n597882l931026k933853k503184
19112B4836541j944008j516568j443025j215288r32600r67436q60809n94596o01001
19103A4761210m85276m16150m69068m48073l94882m68185m81393n49251l70197
19094A0678735m32580k57197l96116m10938k96866j98010l20734l20487k41312
19085G804495j61208p0712j50267j53976j68993k43858j03027j92052k80928k28122
$$ y = [6201092, 6903464, 7768573, 8773729, 9971230, 11503036, 13462080, 16292828, 20206431, 26025657, 34907251, 47934981, 65422524, 85789164, 108383714, 132679333, 152192035, 160902471, 162242292, 156035940, 138386601, 116039957, 95571573, 76679034, 60281948, 48061483, 39802486, 34204604, 30273578, 27339725, 24836541, 22892533, 21375965, 19932940, 18717652, 17785052, 16817616, 15956807, 15362211, 14761210, 14275934, 13859784, 13390716, 12942643, 12547761, 12079576, 11598183, 11048932, 10678735, 10246155, 9988958, 9592842, 9181904, 8885038, 8687028, 8366294, 8045807, 7804495, 7643287, 7572575, 7422308, 7268332, 7099339, 6855481, 6752454, 6560402, 6279474, 6051352]
19075F051352j86247o0999r3666k08052j28511q0953j80000j26766j46567j04197
19065D735394o798l4569j06122r3863j74345j09762l5716p0546j70540p0613j58274
19054C704246r3034j3332Q772p2157r6060j46650k43743m5723R2783n1395j90407
19043B853300O5613R196M1468p2225J7985P5507p1752J08480Q563m6773m5899
19032B943463j18690k67943j84453M1800R5684q2103k3563N7616m9679j55941
19022B256191j81615K5750J29582J13676j9538m1002j09453M930o0970k2221q4607
19011B010723j02955J5617p301o8757j44319k7611l1664j8690j63015n0809m2906
19000A368313o735L4790J01360q2j47797j01682o9983o4445n5624J4905p320M1889
$$ y = [6051352, 5865105, 5804106, 5710440, 5502388, 5373877, 5292924, 5112924, 4986158, 4839591, 4735394, 4728596, 4694027, 4587905, 4494042, 4319697, 4209935, 4174219, 4103673, 3933133, 3862520, 3704246, 3611212, 3597880, 3606652, 3534495, 3438435, 3291785, 3048042, 3002319, 3095102, 3043707, 2853300, 2918913, 2928109, 2969577, 2897352, 2915337, 2990844, 2919092, 3027572, 3036135, 2989362, 2943463, 2824773, 2556830, 2372377, 2414177, 2509861, 2427758, 2404195, 2461811, 2412132, 2256191, 2074576, 2100326, 2229908, 2343584, 2324046, 2283044, 2173591, 2178521, 2117551, 2095330, 2010723, 1907768, 1923385, 1916084, 1847327, 1703008, 1675397, 1643733, 1625043, 1462028, 1411219, 1368313, 1361578, 1396368, 1497728, 1497646, 1349849, 1248167, 1178184, 1113739, 1058115, 1073020, 1065700, 1107589]
18988A107589J7303N7058R7133J43548n9390q3663p5793o6972J072N451o5622
18977A077714J08116j4053n6016L6525Q5676Q2901L2701k6785k11602L7872Q053
18966A161102l0343j53982M1780N7812o9307r7015k3921j4870L469l9267k6762
18955H08696m4928j00503O9935l7409r6771R9526L653o8657J01503J47958R5083
18944I78086L7471m53j17698p9206q345M9014q5232j07961o3562O7318M4621p4396
18932F39657j37493l8668P1184K0675M9036K6416P6534m8659l5791j26159l7540
18921D59192P6018K1841K6209J2196j9796K6585l3845j9152K8119N8614N2131
18910F88112J5666q6980j07203j2074Q9559K7737R6289N2407p6972m441L6625
$$ y = [1107589, 1124892, 1181950, 1279083, 1422631, 1363241, 1279578, 1203785, 1136813, 1137885, 1143336, 1077714, 1185830, 1171777, 1115761, 1152286, 1237962, 1320863, 1353564, 1326779, 1115177, 1153049, 1161102, 1130759, 976777, 1018557, 1076369, 1007062, 910047, 886126, 871256, 874725, 835458, 808696, 763768, 663265, 733200, 695791, 599020, 698546, 702199, 633542, 735045, 883003, 978086, 1015557, 1015104, 897406, 818200, 809855, 858869, 773637, 665676, 602114, 669432, 714053, 639657, 502164, 463496, 534680, 555355, 604391, 630807, 707341, 658682, 622891, 496732, 459192, 535210, 557051, 583260, 595456, 575660, 602245, 568400, 549248, 577367, 635981, 688112, 703778, 616798, 509595, 497521, 587080, 614817, 711106, 763513, 686541, 682100, 718725]
18899G18725J52473J0979O7143J11761M372P9953m326n1710K8199N4806j63626
18888A008749k3363J04888K1939K7137l6877j8053J1083q2430n1425j6411L4440
18877I79677P1049N3205j32686m7957Q819R3927P2714N8515N0816N6821R1793
18866A356693R5606r2018p6636O8899Q2047K4908K32465J69612J31585J54881
18856B148042N5874P173J65911K07960K26695K33279K86446L16094K20249L60705
18846D228428L73754L67918M38687M30873O79130R86861J500568K312299L549406
18837A4867924M782116O310073P859854R053044R881689Q693514L114847j327485
18829F3235576l741625o914184o237359r10028N412517J1011647J4066577J2061332
$$ y = [718725, 871198, 882177, 949320, 1061081, 1065453, 1145406, 1141080, 1089370, 1117569, 1172375, 1008749, 985386, 1090274, 1112213, 1139350, 1102473, 1084420, 1095503, 1013073, 961648, 945237, 979677, 1050726, 1103931, 971245, 923288, 932107, 1026034, 1098748, 1157263, 1208079, 1264900, 1356693, 1452299, 1360281, 1283645, 1352544, 1434591, 1459499, 1691964, 1861576, 1993161, 2148042, 2203916, 2211089, 2377000, 2584960, 2811655, 3044934, 3331380, 3647474, 3867723, 4228428, 4602182, 4970100, 5408787, 5839660, 6518790, 7505651, 9006219, 11318518, 14867924, 19650040, 25960113, 33819967, 42873011, 52754700, 61448214, 64563061, 63235576, 59493951, 52579767, 46342408, 45432380, 50844897, 61856544, 75923121, 87984453]
18821H7984453O861149J80840o777423j1148752j2138564j0851114p672730n821682
18813D0616177m755917k799049m24289J505317J854304P07308o38403k050478
18805C4014970l709493l919836l011297j893265j127288q00261m92008j86664
18797A8874858L5054K72429P26502J391060K199399L555466O063342Q430236Q496561
18788E0044907N993807L972252K317891k64876j180634L07351L223510P151679
18780G1565887J2317224J5730882J1395981P117748L866163n570847j0479123
18773A05943915m750018J351102M728188M016580j196611o385189j1115037j6611117
18765G5981813j6315969j1176824p027463m623128l213245k310139j277745k40047
$$ y = [87984453, 94845602, 95026442, 88249019, 77100267, 64961703, 54110589, 46437859, 40616177, 35860260, 33061211, 32636922, 34142239, 35996543, 36703851, 36065448, 34014970, 30305477, 26385641, 23374344, 21481079, 20353791, 19553530, 19061522, 18874858, 18909912, 19182341, 19908843, 21299903, 23499302, 27054768, 33118110, 41548346, 50044907, 56038714, 60010966, 62328857, 62063981, 60883347, 61190698, 64414208, 71565887, 83883111, 99613993, 111009974, 118127722, 121993885, 116423038, 105943915, 101193897, 102544999, 107273187, 111289767, 110093156, 103707967, 92592930, 75981813, 59665844, 48489020, 41461557, 36838429, 33625184, 31315045, 30037300, 29797253]
18757B9797253L08170L45699k40772p56552j646685k421379k483946j913996j517739
18748A9470053j058325p65482o59308p81965p02758m62870n12108o32763n13748
18739A3380726l55496l52949l45394k43660l83286m85110l48125l54557k14399
18730A0297750k44942k68811k03449l23509k82176j30912k21557j12738k26566
18721H283090k95871j74884n9276j45072j95107k95250k03106k19620k21867j88712
18711F284325r2025n6711p3437k27416r1893j38776k12449j22962k603n5062l4387
18700E176604k1228k7745j29435j32855q665l8579j39534k01277j58155j91680
18690D127451l1657q4692k7838m1429n5548o5725j69485j9452m6968j10764J3594
$$ y = [29797253, 30105423, 30451122, 30210350, 29453798, 27807113, 25385734, 22901788, 20987792, 19470053, 18411728, 17646246, 16986938, 16204973, 15502215, 15039345, 14527237, 13894474, 13380726, 13025230, 12672281, 12326887, 12083227, 11699941, 11214831, 10866706, 10512149, 10297750, 10052808, 9783997, 9580548, 9257039, 8974863, 8843951, 8622394, 8509656, 8283090, 7987219, 7812335, 7753059, 7607987, 7412880, 7117630, 6914524, 6694904, 6473037, 6284325, 6192300, 6135589, 6062152, 5834736, 5742843, 5604067, 5391618, 5268656, 5266053, 5210991, 5176604, 5155376, 5127631, 4998196, 4865341, 4856676, 4818097, 4678563, 4477286, 4319131, 4127451, 4095794, 4011102, 3983264, 3941835, 3886287, 3820562, 3651077, 3631625, 3584657, 3473893, 3487487]
18679C487487j17150q4129n0481J27307O4493l394J0853j16191j02696K0742r952
18668C226889p1802o6355o5301j03721j11209j15572o4594K0885L3536J1925q5031
18657B609650N1821J49200p9856j29233j16545j13588j09409P9615m1100j47081
18647B153474j25049n2433l4179K0043l1918L6166n7978l6079R0498j1315k7263
18636A923967l4457j6616J8434J31570N4891L8519j18921j29858J16015M1864
18626B025408m2024j35124j13610K195M8171j33392O8469L5832J45220o1897n2253
18615A786995j43964j64677q9645K5035M4556J09539m33l8846p115N5701Q6533
18604A663679n6449k07522l9895J56523J20856J06699K8388r8972j06076l2031
$$ y = [3487487, 3370337, 3286208, 3235727, 3363034, 3427527, 3424133, 3434986, 3318795, 3216099, 3236841, 3226889, 3155087, 3088732, 3023431, 2919710, 2808501, 2692929, 2628335, 2649220, 2682756, 2694681, 2609650, 2661471, 2810671, 2730815, 2601582, 2485037, 2371449, 2262040, 2341655, 2300555, 2153474, 2028425, 1975992, 1941813, 1961856, 1929938, 1966104, 1908126, 1872047, 1962545, 1951230, 1923967, 1889510, 1872894, 1891328, 2022898, 2077789, 2116308, 1997387, 1867529, 1983544, 2025408, 1983384, 1848260, 1734650, 1736845, 1785016, 1651624, 1720093, 1755925, 1901145, 1839248, 1786995, 1643031, 1478354, 1388709, 1413744, 1458300, 1567839, 1567406, 1528560, 1521445, 1577146, 1663679, 1607230, 1399708, 1359813, 1516336, 1637192, 1743891, 1772279, 1673307, 1567231, 1535200]
18594A535200j629O8722J03676J53531O1077P7345J33157P7972J93754K18322
18584B621127J1540M9898r5827J8420Q3743J98170K75149J55254J30452K15385
18574C663311K14159M86489O56081R82560J424385K449551L581197M567773N203709
18565B3229215N369085L239444N9215j392513k855275l508383j110686K335727
18557B5365829N602167P523202P054613N453772R43777m166299o325595p940489
18549C3510977p325804m503483k268296m84659R75961J976494K016399O87678
18541B4585267l26592j429074k918821l104720k045568j228800o62786l46999
18533A2521907j79304j32703l0746K88335N81016J144865J831717K718670L162569
$$ y = [1535200, 1533571, 1602293, 1705969, 1859500, 1920577, 1997922, 2131079, 2209051, 2402805, 2621127, 2632667, 2682565, 2586738, 2605158, 2688901, 2887071, 3162220, 3317474, 3447926, 3663311, 3877470, 4363959, 5020040, 6002600, 7426985, 9876536, 13457733, 18025506, 23229215, 28598300, 31837744, 31896959, 30504446, 27649171, 24140788, 23030102, 25365829, 30967996, 38491198, 45545811, 50999583, 51943360, 47777061, 41451466, 33510977, 26185173, 21681690, 19413394, 18928735, 19904696, 21881190, 23897589, 24585267, 24258675, 22829601, 19910780, 16806060, 14760492, 13531692, 12868906, 12521907, 12342603, 12209900, 12179154, 12467489, 13048505, 14193370, 16025087, 18743757, 21906326]
18524B1906326K619877K314987J985215P45834O84854K145553M294320P705216
18516D4402182J1673583J2186617J0508259J0280718J0947600J1463431Q969142
18509A20431532J520863l917506j0141922j9378237j9259529j1283574m325677
18502E3645950O05448L144294L230491L116052J415597l646950o331314o379315
18494D8800253p775536p113988m609009k810428j886812j097727r18520j029931
18486B1558302q46950n74787n42275m85209m82126l51909M7559J54593N50881
18477A9028079R83140J569550K531471M035052N745376N707907L505530J845424
18469D4951529L99183j281313P2572M833874R256757R947491Q954636O758120
$$ y = [21906326, 24526203, 26841190, 28826405, 29572239, 30257093, 32402646, 36696966, 44402182, 56075765, 68262382, 78770641, 89051359, 99998959, 111462390, 120431532, 121952395, 118034889, 107892967, 88514730, 69255201, 57971627, 53645950, 54251398, 57395692, 60626183, 63742235, 65157832, 61510882, 55179568, 48800253, 41024717, 33910729, 29301720, 26491292, 24604480, 23506753, 22588233, 21558302, 20711352, 20136565, 19594290, 19109081, 18626955, 18275046, 18322605, 18477198, 19028079, 20011219, 21580769, 24112240, 28147292, 33892668, 39600575, 43106105, 44951529, 45350712, 44069399, 44141971, 48975845, 58232602, 68180093, 77134729, 83892849]
18461H3892849J545873j775304k137700n754056p501903p140120q780510r943287
18453D2405842p371402m468341k697466j357595k93482q7228n66805q33727j186038
18444B3543758j854742j954578j328788o55846k87097l90651n14364l23890j26202
18435A6107600j68481O6958L76458P04277J261376K383056L849287N425808N301176
18426C5307515K959848J096669o51032l190491k809827L31692L997446Q177624
18418D5219444J0550603P214107K071783j318516o734411j0683118q073181l527413
18410C4719298M42170L146342K754698L85784j273377l489886o186418n478800
18402B5019811l658149k351242j462218r29576n55581l57053j3175l2203R7222
$$ y = [83892849, 85438722, 83663418, 81525718, 75771662, 68269759, 61129639, 52349129, 42405842, 35034440, 30566099, 27868633, 26511038, 26217556, 26130328, 25563523, 24729796, 23543758, 21689016, 19734438, 18405650, 17749804, 17462707, 17072056, 16557692, 16233802, 16107600, 15939119, 16006077, 16382535, 17086812, 18348188, 20731244, 24580531, 30006339, 35307515, 38267363, 39364032, 38713000, 35522509, 32712682, 33044374, 37041820, 45219444, 55770047, 62984154, 65055937, 63737421, 57003010, 46319892, 38246711, 34719298, 35161468, 38307810, 41062508, 41448292, 40174915, 36685029, 30498611, 25019811, 21361662, 19010420, 17548202, 16618626, 16063045, 15705992, 15692817, 15660614, 15757836]
18393A5757836M53423P01658J384892K386372L090034K052231N74508l85844k039415
18384B3975695k959605k281884j176665l86723L55796J257669K132723L581171
18376B4498177N406201O607869P998720R260864O965754K055095j099888m308922
18368E7383870p761931q526930o758731n064602m349752l543147k523421j723786
18360A7131570j358554r62822n28305j74549R6019M27289J118256J438336P19364
18351A7906604q2833o52286j498307j856723j510321j046581n99956l87053l94878
18342I877666j54674k26638q8490K5536L02560N27196J149631J591660J326572
18333A4331019N21333Q1218n86608j058021m60484O94832J982564K437463J441798
$$ y = [15757836, 16211259, 16912917, 18297809, 20684181, 23774215, 25826446, 26400954, 26015110, 23975695, 21016090, 18734206, 17557541, 17170818, 17526614, 18784283, 20917006, 24498177, 29904378, 36512247, 44510967, 53771831, 60737585, 62792680, 61692792, 57383870, 49621939, 41095009, 34336278, 29271676, 24921924, 21378777, 18855356, 17131570, 15773016, 14810194, 14281889, 14107340, 14203359, 14630648, 15748904, 17187240, 17906604, 17823771, 17171485, 15673178, 13816455, 12306134, 11259553, 10659597, 10272544, 9877666, 9722992, 9496354, 9407864, 9433400, 9735960, 10263156, 11412787, 13004447, 14331019, 14852352, 14933570, 14346962, 13288941, 12828457, 13523289, 15505853, 17943316, 19385114]
18324A9385114M18334l92610k042115k735706j695436n52843J25492L58143k0433
18315A2847940m07998p03012j416926j582253r64842l77149l52640l52872k28542
18306F461706k48710n1103O4766j29109o7972j02588k55800k06774j87536j41578
18296E135302k02944l38994k78921p8871m9914j20686j24064q1767o4490j13343
18286C681308j20692n0186j24966k37820j41756m3897o4827l6390O8101k1991
18276B906884l136n9685r0884k317P3132P803q1815k50070k9795Q0363j7731m2093
18264B490656j413q3138j46112P537K00820J0095j22566j15972r6607j41145j3174
18253A988981J39140J01960k6614j24000j04982r1601j6792q7814j05834k0540
$$ y = [19385114, 19803448, 19410838, 17368723, 14633017, 12937581, 12384738, 12510230, 12868373, 12847940, 12439942, 11736930, 10320004, 8737751, 7772909, 7395760, 7043120, 6690248, 6461706, 6212996, 6161893, 6226659, 6097550, 6029578, 5926990, 5671190, 5464416, 5276880, 5135302, 4932358, 4593364, 4314443, 4235572, 4185658, 4064972, 3940908, 3859141, 3794651, 3681308, 3560616, 3510430, 3385464, 3147644, 3005888, 2961991, 2897164, 2860774, 2928875, 2906884, 2903748, 2844063, 2753179, 2750862, 2823994, 2831797, 2749982, 2499912, 2470117, 2550480, 2532749, 2490656, 2489243, 2406105, 2259993, 2267530, 2468350, 2478445, 2355879, 2239907, 2143300, 2002155, 1988981, 2128121, 2230081, 2203467, 2079467, 1974485, 1882884, 1866092, 1778278, 1672444, 1651904]
18243A651904N6304O2498j38176j04029n4937n218j35997p1618N1587k7749q3985
18232A200584J33227K046J50185L905j12955j42421m4774J330n3272j5140J6108
18221A138823j02264J1650r4382k5042l0546j4561J04592R1951O2205J6446j07743
18210A051129j87326k224P0471q3224m3542K5973K019p3269N3475J21675M2248
18199I77405k7297j94674R412q622p6409l3507J8651K6201j2413J3986m8984j03938
18187E39811O4198J24726m3536j693J9345p2160l3034k5635l8925l3647j24650
18176C74800j15611L2653J62278J31668L7928j01629N0983J16481K1174o5065
18166F45660p0747K0622o339p2465j405M039j3078J09529l1205p9086L1110J0566
$$ y = [1651904, 1708208, 1770706, 1632530, 1528501, 1473564, 1468346, 1332349, 1260731, 1312318, 1284569, 1200584, 1333811, 1335857, 1486042, 1489947, 1376992, 1234571, 1189797, 1191127, 1137855, 1122715, 1138823, 1036559, 1048209, 953827, 928785, 898239, 883678, 988270, 1080221, 1142426, 1158872, 1051129, 863803, 861579, 932050, 848826, 805284, 831257, 833276, 760007, 813482, 935157, 977405, 950108, 755434, 764846, 756224, 679815, 646308, 664959, 691160, 678747, 692733, 643749, 539811, 604009, 728735, 685199, 683506, 702851, 630691, 597657, 572022, 533097, 499450, 374800, 259189, 291842, 454120, 585788, 623716, 522087, 573070, 689551, 710725, 645660, 574913, 595535, 589196, 516731, 515326, 519365, 506287, 615816, 584611, 505525, 536635, 547201]
18154E47201L1458k9939l4854N1624O3137J79647J2747j22385p8191M4512J7306
18143F82263M6419Q648J32766J58101j30785n2518J97485J0281k0411M9154l447
18132A077956O5489R2111k535J929O084J90936N4888J41612L43608K52003J82573
18121B406654K88778L84451M05500M30530L88227N45750Q27940J242943J690932
18112H611705K422406L765619O154393J0448122J9401662L2307330L1900118J0771829
18104A25783184J196137p417535l2224741l1973276j7524627r198440n237667
18097B3403035l535577k471679j912278j507959j089081q76276q09115p86224
18089A0414846n84025o34266m61954k83513k64632k81474m13263m12519l45677
$$ y = [547201, 578659, 548720, 513866, 565490, 628627, 808274, 821021, 698636, 620445, 664957, 682263, 728682, 737330, 870096, 1028197, 897412, 844894, 1042379, 1052660, 1032249, 1081403, 1077956, 1143445, 1235556, 1233021, 1234950, 1241034, 1431970, 1486858, 1628470, 1972078, 2224081, 2406654, 2695432, 3079883, 3485383, 3915913, 4304140, 4849890, 5677830, 6920773, 8611705, 11034111, 14799730, 20954123, 31402245, 50803907, 83111237, 115011355, 125783184, 126979321, 119561786, 87337045, 55363769, 37839142, 28640702, 23403035, 19867458, 17395779, 15483501, 13975542, 12886461, 12010185, 11201070, 10414846, 9830821, 9196555, 8734601, 8451088, 8186456, 7904982, 7491719, 7079200, 6733523]
18080F733523l28144k82916j38046m6200k95870k43570j25722j81043j67376k04897
18070D719739l8716j52669j94293j96235j08719K6160J21468l23157j64112n3162
18060C636304O9505J45502r5641k19312j49252m2897m7763j40248j69865j50192
18050B836141j05613p0856J23270J4847k527j55092o5055m4826o6974N8322Q0705
18039B602342J01416p196j72225j46976j06842k6605l4779o2933q6846o5343p2204
18028A921809j32253m8804r1759p2010L4214J06739o9938J341J5284j22640j9064
18017A522919o915j42151r4177k4707Q190r508j3727j2390k2722M0908Q5920p6711
18005A254929j00900K625J26876J25707Q2367Q8924j9346n1293m9971L1114p9581
$$ y = [6733523, 6405379, 6122463, 5984417, 5938217, 5642347, 5398777, 5273055, 5092012, 4924636, 4719739, 4681023, 4528354, 4334061, 4137826, 4029107, 4055267, 4176735, 3853578, 3689466, 3636304, 3705809, 3851311, 3755670, 3536358, 3387106, 3344209, 3296446, 3156198, 2986333, 2836141, 2730528, 2659672, 2782942, 2797789, 2795262, 2640170, 2575115, 2530289, 2463315, 2521637, 2602342, 2703758, 2696562, 2524337, 2377361, 2270519, 2243914, 2209135, 2146202, 2059356, 1994013, 1921809, 1789556, 1740752, 1648993, 1576983, 1611197, 1717936, 1647998, 1649339, 1664623, 1541983, 1522919, 1516004, 1373853, 1279676, 1254969, 1263159, 1253651, 1239924, 1227534, 1204812, 1245720, 1331640, 1254929, 1154029, 1156654, 1283530, 1409237, 1491604, 1580528, 1561182, 1509889, 1459918, 1491032, 1411451]
17994A411451o8920J6693l2081k1798o5746o9273o727j30880l8865Q7848O729
17983A088431k0659K9712J49484r2626k98599l2435P6822Q5759j19330j25275
17973G41284r7716J15687M4436N8129J2906M6917n0314j89396l2110k8923r0402
17962E30498J04126M4295m8996j6757P22m377J5315O2479N9110j3108k9307R1257
17950G95257M7991j41829p2975K4990m6628k9028j9551M95L3113p2679l5097L0624
17938E14683N1476q8364M577n9981j11040N1330J96116P2603o5218o627l3436
17927E26119J1624l2562K8963P2617m5518j25827R289k4532r1169P9101n4382
17916C53723k422N9637O7196N3249q2290K7403K2959j32087j86679L0581J55921
$$ y = [1411451, 1342531, 1359224, 1327143, 1305345, 1239599, 1170326, 1163599, 1032719, 993854, 1081702, 1088431, 1067772, 1097484, 1246968, 1154342, 855743, 823308, 900130, 985889, 866559, 741284, 643568, 759255, 803691, 861820, 874726, 921643, 871329, 681933, 649823, 620900, 530498, 634624, 678919, 629923, 613166, 613888, 609511, 624826, 687305, 746415, 733307, 704000, 795257, 843248, 701419, 628444, 653434, 606806, 577778, 558227, 558722, 591835, 519156, 484059, 514683, 566159, 477795, 482372, 422391, 311351, 362681, 558797, 631400, 566182, 559555, 526119, 537743, 505181, 534144, 606761, 561243, 435416, 444705, 420173, 329004, 408105, 353723, 351301, 410938, 478134, 531383, 449093, 476496, 499455, 367368, 180689, 211270, 367191]
17905C67191M1696j47191j00184O835j4004J3505Q1146L5902M2782M55j1822m0734
17893B75577O7657O9619m0526j1977m1913r845J8693L6818n6553j11108o9523
17882A26919J35655K0400m229l996J2573N8879k187l0825M6493L2664J2198l229
17870D01315M3637K6648n9963n438R5310m2904O896n526l1597j91596l0759q3872
17858A22151R998j2257J61010R0798n6639j21571m6314q7038Q333N6865Q3484
17847B08820m7135k0265K4537r543O2709n4533l6215O7918O0965r0229O1488r2054
17835A36463j21848M8247j7691Q0200R3186m4748k23070J2421j3738J11417J81759
17824B42598j5953k3230l2198J3527j4661L0625N4666j20140L6517j8836o8450
$$ y = [367191, 408887, 261696, 161512, 168347, 154343, 167848, 248994, 284896, 327678, 328133, 316311, 275577, 343234, 412853, 372327, 360350, 318437, 308592, 327285, 364103, 307550, 196442, 126919, 262574, 282974, 278745, 274749, 287322, 346201, 344014, 313189, 359682, 392346, 404544, 401315, 444952, 471600, 411637, 406199, 501509, 458605, 465501, 459975, 428378, 236782, 206023, 122151, 132149, 119892, 280902, 371700, 315061, 193490, 147176, 60138, 68471, 125336, 208820, 161685, 141420, 165957, 156414, 219123, 164590, 128375, 196293, 257258, 167029, 228517, 136463, 14615, 62862, 45171, 125371, 218557, 173809, -49261, -36840, -50578, 60839, 242598, 226645, 203415, 171217, 184744, 170083, 200708, 255374, 135234, 171751, 152915, 84465]
17813H4465K1110Q5257l1155q9778M2523M782M3635O7984n8495k3166J1802o7525
17801I1439r5003J8457L8574j3668J0584j27587n7052j4746J01210J88118m957
17790A35369o5801K7191R3762J5508j10985R7997k865q8835k3591r6737n6336
17779g5323N8222O4165q6121M8019k1870j5242O8724P7810M4210j37340k9123
17768c869m978Q2206k1851q1534r4373L8927K03232R0171k929j10193r6680j35473
17756a37344J0061P1813O6932J5488l6644J8047o7070N8299P3601J2359L4746
17745A20288N5752l3102k7947J5456k7524L4174K4938o9796j0639p3454o3478
17734e5332m8261R9197M1579j03028k5143o3935n1425R0576M8097K1384J12704
$$ y = [84465, 105575, 190832, 159677, 69899, 112422, 117204, 160839, 228823, 170328, 147162, 158964, 91439, -3564, 14893, 53467, 39799, 50383, -77204, -134256, -149002, -47792, 140326, 135369, 69568, 96759, 190521, 206029, 95044, 193041, 190176, 101341, 77750, -18987, -75323, -17101, 47064, -39057, 8962, -12908, -28150, 40574, 118384, 162594, 25254, -3869, -8847, 73359, 51508, -30026, -124399, -85472, 117760, 207931, 205002, 94809, -1871, -137344, -127283, -55470, 11462, 26950, -9694, 8353, -58717, -418, 73183, 85542, 120288, 176040, 142938, 114991, 130447, 102923, 137097, 162035, 92239, 81600, 8146, -55332, -103593, -4396, 37183, -65845, -90988, -154923, -206348, -115772, -67675, -46291, 66413]
17723F6413j3806K5699o2500j10580n204j6704r245m7859J07599J74622P5327
17712A83762o0738j14497o3306L195n3463R7619J05930j21899p8138J01816l5048
17701c4767p2161K568J13927N549J59143o284j04386o1231j03605k0645M8999
17690g2893L1434N3629j2224P669o0193q8549j13391P7641J04434M7046j16530
17679a41927o6581P7176O5965k311L1236M1133J17819J20653p2724j27048k22576
17668a79185l1524K34306J08867M2917k8179l6642J16622M4958j77587m5037M9112
17657I8628j39872l4095J30353J95595J0620p8497j20761n1393q430N6658P6006
17646A34812J11645Pp6183j57235j29792M2772j1335J8525L8228O2064N028l9001
$$ y = [66413, 52607, 78306, 15806, -94774, -99978, -116682, -125927, -173786, -66187, 108435, 183762, 123024, 8527, -54779, -51584, -105047, -7428, 98502, -23397, -101535, 281, -34767, -106928, -104360, 9567, 15116, 174259, 167975, 63589, 2358, -101247, -121892, -72893, -41459, 12170, -54, 7615, -52578, -141127, -254518, -176877, -72443, -25397, -141927, -208508, -131332, -65367, -67678, -36442, 4691, 122510, 243163, 170439, 43391, -179185, -210709, 23597, 132464, 175381, 147202, 110560, 227182, 272140, 94553, 49516, 98628, -41244, -75339, 55014, 250609, 261229, 182732, 61971, 10578, 2148, 58806, 134812, 246457, 246464, 170281, 13046, -116746, -73974, -85309, -66784, -28556, 33508, 38536, -465]
17634d65l0526J0851J29868J38272r7748p7293j35164j4365J26633J09031L5180
17623A94274k15265k7258M6979l9561n7666q1101N9138O6245m9464M9287j22301
17612a76693j53049J49357J13682Q5910k0797Q954J8772L5257l0760r8179J6495
17601e1051N8584L8876Q9296N6512L8539j09961L0253l0027r8670r4913J06383
17590C3821Q0139q6051m7311K55089N8683j02062j5489r9601j41964l4253J66557
17579F7558M2611Q6378q2361K2853P8851O642l0726q6566r8003o0877k580o0443
17567a16663K6315n5199n0282J23780O3583P2126Q8900n3815l2815m8806L0916
17556D8040k706n6053J5841J2752P0285M2903O4314M2591M2230r9923j72192j1676
$$ y = [-465, -30991, -20140, 109728, 248000, 150252, 72959, -62205, -76570, 50063, 159094, 194274, -20991, -48249, -1270, -40831, -98497, -179598, -120460, -54215, -103679, -54392, -176693, -329742, -180385, -66703, 19207, -1590, 7364, 26136, 61393, 30633, -67546, -51051, 7533, 46409, 135705, 192217, 230756, 120795, 151048, 121021, 22351, -72562, 33821, 113960, 27909, -19402, 235687, 294370, 192308, 176819, 77218, -64746, -98999, 67558, 110169, 196547, 114186, 137039, 215890, 222532, 191806, 105240, 7237, -53640, -56220, -116663, -90348, -145547, -195829, -72049, -8466, 63660, 152560, 98745, 65930, 17124, 48040, 45334, -10719, 5122, 17874, 88159, 131062, 195376, 237967, 280197, 180274, 8082, -3594]
17544c594M0680L0249R5260N6541o7670m5045p0520N9440n5781j12899j16296
17533a89635j8798L1995j0119m5256J52755k5849k1955P4492m3343j0968P4961
17522c1720q0814k7055P4753M7468Q870n4725K0370J8288M1736N9961O6572p6546
17510F7158J9066l352j3302Q0834O5097J28665O852n2416k37897p914J06669r1078
17498F8382j69703J0956P6998M9829m41j8537L1783j1132l0674m0728N2540L4233
17486E3506N3903N1060j29630r0191r4848N2240O8257P1660L8675P1287P7902
17475B23821J0115r5214q677N209p7552n8728k0170R097K551j403K0806j2355
17463b500N3998o6977j44019J03054J27337q4472j39680j8212P1599O9029R2840
$$ y = [-3594, 37086, 67335, 162595, 219136, 151466, 106421, 35901, 95341, 39560, -73339, -189635, -208433, -176438, -186557, -231813, -79058, -104907, -126862, -52370, -95713, -106681, -31720, -112534, -139589, -64836, -17368, -8498, -63223, -42853, -24565, 17171, 77132, 143704, 67158, 86224, 82872, 69570, 150404, 215501, 344166, 351018, 298602, 60705, 52791, 159460, 68382, -101321, -90365, -13367, 36462, 36021, 17484, 49267, 38135, 7461, -33267, 19273, 53506, 107409, 158469, 28839, -61352, -156200, -103960, -35703, 35957, 74632, 145919, 223821, 233936, 138722, 130045, 135254, 57702, -1026, -21196, -12099, -9548, -10951, 9855, -2500, 51498, -15479, -159498, -56444, 70893, -13579, -153259, -171471, -99872, -30843, 61997]
17452F1997L3032q1554o3429R4682J22322k5992j0588R3490K2958j26368J67355
17441B87905K56669J78039J22776n4268q5935j26610k17253j43100p1768l0738
17431A15717K7356M0380J202j19920q1883M2642L6755q7340m9427L2764k4099
17420f5853O1568k4284R04J7868K5327K5544j4782o0586J7965J35274L0722R1121
17408B40788n1596k4936r5323m3642r4637O7987N4092o540n7782j9527j2152M5727
17396B459L5737j36804m0917J05122j4623j53336J44421P6216K0462Q397L4717
17385H1851l0022Q7604J0854k203Q8962L3893K4105n8983p9952k3459N2292o8618
17373A16324j67555K7024R8634M3049r4050m7604J8775m0229o7623p3836R291
$$ y = [61997, 95029, 13475, -49954, 44728, 167050, 141058, 130470, 223960, 246918, 120550, 287905, 544574, 722613, 845389, 791121, 705186, 578576, 361323, 218223, 146455, 115717, 143073, 183453, 184655, 64735, -17148, 25494, 62249, -25091, -74518, -41754, -65853, -4285, -28569, -27665, -9797, 15530, 41074, 26292, -34294, -16329, 118945, 149667, 240788, 189192, 164256, 68933, 25291, -69346, -1359, 52733, 46193, -11589, -31116, -43268, 2459, 38196, -98608, -139525, -34403, -49026, -202362, -57941, 18275, 38737, 47134, 81851, 51829, 139433, 150287, 148084, 237046, 270939, 295044, 236061, 156109, 132650, 184942, 116324, -51231, -24207, 74427, 117476, 23426, -24178, -5403, -45632, -113255, -187091, -177800]
17362a77800R4182R6603M8271N8325J6138j53718J896O287j7646o1870L9712J21196
17350G1576J21567L4194j01100L0260m1205q0514l17p3070k382O296J21757J70193
17338B57255J0486j06727j10392j6802j18082M0863Q7420N445M6210o7758l1192
17327c274M3989j39696j80714J47981J82585j0746q4400j03923r5505N2184J00940
17316i0579R7473r157l5782k2641k1329O4908j13247l7725L8130L9379N4759N0473
17304A4662K3358J3734J5946N1813J36840n8098j22652O261j3187Q5012l5356
17293A18333j98353j21673L165R0897Q9633N9442r8437K6404m4378o9456J78554
17282C4131J02043K5292r547q0772m2526q5213K3394O3338M8645L8182J2849n1415
$$ y = [-177800, -83618, 12985, 61256, 119581, 135719, -17999, -16103, -9816, -27462, -89332, -49620, 71576, 193143, 227337, 126237, 156497, 115292, 34778, 34461, -38609, -40991, -34695, 87062, 257255, 267741, 161014, 50622, 33820, -84262, -43399, 44021, 49466, 95676, 27918, -3274, 40715, -98981, -279695, -131714, 50871, 40125, -44275, -148198, -243703, -191519, -90579, 6894, -2263, -38045, -60686, -82015, -17107, -130354, -168079, -129949, -90570, -35811, 14662, 38020, 51754, 67700, 119513, 256353, 198255, 75603, 81864, 68677, 153689, 118333, -80020, -201693, -198528, -107631, -17998, 41444, -56993, -30589, -74967, -144423, 34131, 136174, 161466, 151919, 71147, 28621, -56592, -33198, 30140, 78785, 116967, 129816, 78401]
17270G8401l0598r2229j11800L0387J35874J03329k519p2755K8685J7899l2911
17259E1763m5676K5767K7150o3580M6473P6090p248l8863j02658M4876J15008
17248A29102L666J711N7507L2001p2103j69486p2110j05531O7530J74535l3657
17237A3165R4033O2759j44080J6936R3286j0042J8460m3068j00747k10J11250
17226A11742N4643j177r7271j31231n7356R9559J06860j0783m5348n5994j11205
17215a37561n4222N2668R9431o4012J8450o6681N1582J14402J7113m1256M5702
17204C5616L6466k5418n9516N6860l0905o9719n0574M2403J1455n2679o2606N7328
17192a11289l0072m043L4472Q9289k1155m7552p1593J00370J00193M9400M4005
$$ y = [78401, 47803, -44426, -156226, -125839, 10035, 113364, 110845, 38090, 66775, 84674, 51763, 6087, 31854, 59004, -4576, 41897, 117987, 110739, 71876, -30782, 14094, 129102, 132768, 134479, 191986, 223987, 151884, -17602, -89712, -195243, -127713, 46822, 13165, 107198, 169957, 25877, 42813, 136099, 126057, 144517, 101449, 702, 492, 111742, 166385, 165208, 67937, -63294, -120650, -21091, 85769, 74986, 29638, -26356, -137561, -191783, -139115, -39684, -103696, -85246, -151927, -100345, 14057, 31170, -10086, 35616, 72082, 46664, -12852, 44008, 13103, -56616, -107190, -64787, -53332, -106011, -168617, -111289, -141361, -145404, -110932, -21643, -42798, -90350, -161943, -61573, 38620, 88020, 132025]
17181A32025j9346j11524n566P4148L619L7537j01685n6804R1226J26935k3615
17170A46950l7621q1805q3312n7474q6970p7006M8866O252k2377J08440N6531
17159g9526J02501q6012j21702N3335J52128j5305l6601J1585k6188q8853l211
17148a37849R4468l5121j32977N1316K8996Q3391P7746J7726Q4374j7217l7494
17137G7359m7014l0359j3441N0249J753m5448P7911k6249o1851n1246n7400J8802
17125a06934n1195j5838p550R8613Q2584L6026k4651R809L2441j399J544n4528
17113a078l9274K1784P26O5767J3300n6285k8799L3919k7645q0237k226J61547
17101F1499r5126j30230M1629N4264J55456K5600q5985K9383Q5999q0139j31483
$$ y = [132025, 112679, 1155, -4411, 69737, 73356, 110893, 9208, -47596, 43630, 170565, 146950, 109329, 27524, -55788, -113262, -200232, -277238, -228372, -222120, -244497, -136057, -79526, 22975, -63037, -184739, -131404, 20724, 5419, -31182, -19597, -45785, -134638, -137849, -43381, -78502, -211479, -160163, -131167, -47776, 29970, 47696, 132070, 114853, 77359, 30345, -14, -13455, 36794, 38547, -6901, 71010, 44761, -17090, -68336, -125736, -106934, -158129, -173967, -181517, -82904, -320, 35706, 11055, 20864, 53305, 51906, 53450, -1078, -40352, -18568, -17842, 47925, 61225, 4940, -23859, 10060, -17585, -97822, -100048, 61499, -33627, -163857, -122228, -67964, 87492, 113092, 27107, 56490, 142489, 62350, -69133]
17090f9133j06833J0439Q4415P124q94P2640P6209P9995Q1728r6056j13885k5197
17078E52l0817L7137J7990O6047p462r5070J0101r6146p7176l0217Q5745O7422
17066e1894J22227q435n9880O8084J59726n2319j12902o1518K5545m1255k9709
17055d2330j07005m0681j3088q404J19535P2562J48748l063k02942o8984k9380
17044a75032K5388O8166M3397l7723j4994M0963o2078O828k820R3179K0466L8317
17032D4057r2912o0665L6022j48508m821R2475K1194l1066j03443K324J15939
17021a29404M3400Q5370N3258K4776l1688n3189M0882J4942Q8989J3018O4660
17010B15014j11772j64863p0996l1557N5615R7622J18525n8158J7566K7571n1214
$$ y = [-69133, -175966, -165527, -81112, -73988, -74882, -2242, 73967, 153962, 235690, 139634, 25749, 552, -30265, 6872, 24862, 90909, 83447, -11623, -1522, -97668, -174844, -205061, -119316, -51894, 70333, 61898, 2018, 70102, 229828, 177509, 64607, 3089, 28634, -12621, -42330, -149335, -190016, -203104, -211508, -91973, -19411, 129337, 126274, -76668, -145652, -175032, -149644, -81478, -38081, -75804, -90798, -49835, -111913, -105085, -107905, -14726, 5740, 44057, -48855, -109520, -73498, -222006, -226827, -134352, -113158, -144224, -247667, -245343, -129404, -86004, -634, 52624, 77400, 45712, -7477, 33405, 48347, 137336, 150354, 215014, 103242, -61621, -132617, -164174, -108559, -10937, 107588, 49430, 66996, 94567, 43353]
16999D3353k0085o4430R2036P1152q6425m703o3170j34338k815O2366J16272q638
16987E75o3506p0136L2474k0357Q0380J05432o3719k20778o7850J12162J15319
16976f0004J11699Q8529q9916q6823n6117r765m0406J4134P5171L8631J06991
16965I2124P1023p2338j35083j87982p3010Q0781N6709P8769J13956k6288k4284
16954b5623n5874Q4429J2686J12947J0254q0031j69233j1081L8310j08603L5298
16943a56521J37905j8500j01021r659J08250k7052p5898o497m1018J5697J13170
16932f1144J82035P9112p7881p6138n4724o6534l5356p7360L634L2248L5541q8105
16920b04672J0234K3051J14117P1236L7484j18823o0989J49637m2836r8708j8397
$$ y = [43353, 23268, -41162, 50874, 122026, 35601, 30898, -32272, -166610, -169425, -107059, 9213, 575, -62931, -133067, -100593, -120950, -40570, 64862, 1143, -219635, -287485, -175323, -60004, 51695, 140224, 50308, -36515, -92632, -102397, -142803, -128669, -53498, -14867, 92124, 163147, 90809, -44274, -232256, -305266, -224485, -167776, -89007, 24949, -1339, -25623, -81497, 2932, 15618, 128565, 138819, 58788, -110445, -121526, -83216, -191819, -156521, -18616, -37116, -138137, -147796, -39546, -66598, -142496, -148993, -190011, -174314, -61144, 120891, 200003, 122122, 45984, -8740, -75274, -110630, -187990, -184356, -152108, -116567, -204672, -194438, -171387, -57270, 13966, 51450, -67373, -128362, 21275, -21561, -120269, -138666]
16909a38666L6869N9745p6319j1635R2126o9389n0075P1703J44289q1560k5817
16898d8729k7700J03700O0955n8982n427j34548r4441J12134J06033n6177j08232
16887a51414M5371K8704J8847M511P1730Q8981j15049n5505J4652l0202J18898
16876C9524m508r0626j17674L1569l0548J11189p7615o4445L3118P3802K1891
16865g4323J7059j2775n8405j8579O0519J08437j29060o0783O7623J08712k6150
16854a7725r6943L0731r9224o4290k0145M1432J54588L5257m722r741n0878j5355
16842a17015r3058j3854o4346r174J24661Q0988N2502R1509L710m2353p7206r4222
16830a57858J6085J15739J64968l0310M1087l2675n0909Q1473L5730j7969r9663
$$ y = [-138666, -101797, -42052, -118371, -130006, -37880, -107269, -157344, -85641, 58648, -22912, -48729, -76429, 27271, 88226, 29244, 23817, -110731, -205172, -93038, 12995, -43182, -151414, -106043, -77339, -58492, -53981, 17749, 106730, -8319, -63824, -49172, -79374, 39524, 35016, -55610, -173284, -141715, -172263, -61074, -138689, -203134, -170016, -96214, -74323, -57264, -70039, -128444, -147023, -86504, 21933, -107127, -167910, -100287, 8425, -17725, -114668, -83937, -183161, -247451, -267596, -226164, -71576, -36319, -41041, -50782, -101660, -117015, -210073, -223927, -288273, -297447, -172786, -91798, -39296, 52213, 55923, 13570, -63636, -157858, -141773, -26034, 138934, 108624, 149711, 117036, 66127, 147600, 183330, 165361, 65698]
16819F5698r737n7402m6407J03014Q994J8802Q3278j2855o1564p3482O9955Q6809
16807A75103j7681r3850j73J06626j2358j36562l2173o361M1k0624K4912J18836
16795A05736m2204r2820M2095n4750M5927J12570o6249j09878k34680O5516P2699
16784a56038l4860J08409N0585n1996p7122L8539R730P5257Q0825m1798l7030
16773c5499k4255j18235K1085j168j54397J34704J27841K6623k7687P8964K4942
16762E2918m5880J2494q304j01762p5047l9266k6381L8030J03313N5976o8913
16751a02822o3743J1828n1767K4895J75046Q6410m3895j20071k6348J19300p8820
16740f9987O3206N29j16899o192K371j9134l0680j17619N2519J37293O3588r1366
$$ y = [65698, 55961, -1441, -47848, 55166, 64160, 82962, 166240, 153385, 91821, 18339, 88294, 175103, 157422, 63572, 63399, 170025, 157667, 21105, -11068, -17429, -17388, -38012, -13100, 105736, 63532, -29288, 12807, -41943, 3984, 116554, 50305, -59573, -294253, -228737, -156038, -190898, -82489, -31904, -83900, -161022, -122483, -112753, -37496, 43329, 1531, -35499, -59754, -177989, -156904, -158072, -312469, -177765, -49924, -23301, -50988, 27976, 52918, 7038, 19532, 11228, -90534, -165581, -204847, -231228, -193198, -89885, -33909, -102822, -166565, -154737, -206504, -181609, -6563, 79847, 35952, -84119, -110467, 8833, -69987, -6781, -6252, -123151, -129343, -126972, -146106, -176786, -294405, -241886, -104593, -41005, -132371]
16728a32371J4542M6953J6196o2044L4223O9690j3003q9204N2990L9622K4791
16717B385J29765L7760j03418j89153p8169j2592O5278L3319k9693J27411m103
16706b1210N9693O990j08543n6895l7652K5441J93704M3627j28243j03367q1058
16695b07513N4737K7975K5331o9583n9282K26455O7002j7668J03174K2072J0045
16684A82745r679j30259l5109J8673K18L7255n4569j50793p2010Q1352K28124
16673I5948N6926j65255j11343R5217Q4235p694J1962l2145p4216N5532J38153
16662A47320p1935J9184P9617J0918j19383l3249m0966j15655j17491J89036M9193
16651c411m4169j56315o6980Q8738J47066p6025m6812l9548M3571Q1997J38443
$$ y = [-132371, -117829, -70876, -54680, -116724, -82501, -12811, -25814, -115018, -62028, -22406, 2385, 132150, 169910, 66492, -122661, -200830, -213422, -148144, -114825, -144518, -17107, -21210, 38483, 45473, -63070, -119965, -157617, -132176, 61528, 105155, -23088, -126455, -207513, -152776, -124801, -99470, -169053, -228335, -1880, 65122, 47454, 150628, 172700, 182745, 173066, 42807, 7698, 26371, 26589, 63844, 9275, -141518, -213528, -132176, 95948, 152874, -12381, -123724, -28507, 55728, 48034, 59996, 27851, -46365, 9167, 147320, 75385, 94569, 174186, 185104, 65721, 32472, -8494, -124149, -241640, -52604, -3411, -47580, -203895, -270875, -182137, -35071, -111096, -157908, -197456, -153885, -71888, 66555]
16640F6555O4940q3934o6821p7363L9373O8736m6596n2249R1049p7666q8097k3534
16628a85607p049Q6056J23197L9155l8154k2641Q3018O0258N654r4952R312J9932
16616G8179O677l5938L1322J3345k8009M0081J02947j4593k13757j30795P0285
16605h0256M8391L4724l0538P7158l4329l7922l4540j4068q0859O528M5435n5067
16593a55343K2000O5019L8001O762J56639K814j1043J10796K4237k26530j50904
16582a17552M5302P7655K6000N091M3471o2649o2926j12147p6333j10510L9797
16571c04801P8564J42899N462P500n0295R0101J0713l2993k0083P8292M5561m7883
16559C037Q8989M5049K4087P3673K4637q5189o4050P2751J5390r2123k17160j15489
$$ y = [66555, 131495, 47561, -19260, -96623, -57250, 11486, -35110, -87359, 3690, -73976, -162073, -185607, -192656, -106600, 16597, 55752, 17598, -5043, 77975, 138233, 143887, 48935, 58247, 78179, 84856, 48918, 80240, 93585, 65576, 105657, 208604, 194011, -19746, -150541, -80256, -31865, 2859, -27679, 49479, 15150, -22772, -57312, -71380, -152239, -145711, -100276, -155343, -133343, -68324, -30323, -23561, 133078, 135892, 124849, 235645, 259882, 33352, -117552, -72250, 5405, 31405, 36496, 79967, 17318, -45608, -157755, -234088, -344598, -304801, -226237, -83338, -77876, -70376, -120671, -30570, -19857, -52850, -72933, 5359, 50920, 3037, 92026, 137075, 161162, 234835, 259472, 174283, 110233, 182984, 198374, 106251, -110909, -226398]
16547b26398N8783R4413N7705Q4897j15915l3539m0975p4023J48853J35025n5254
16536C3572j87456N847J03003M4337J12424J68167l1836l41r2830j01633n5536
16525b282n6625P9558R7178l2337J2508o2914l0926l3139o1978m88L6887J10559
16513E6001q9333q7835J938P4967r7724m4307J84829J07486l2349n9693Q9393
16502A03373P0404P3095J45264q3162k20695O5906k8489r846K4306M624m778k3591
16490A16411p134m656J22943N1585J8805Q292j20699j58481q6781N9139N339M8689
16478E3452K7296P612k3384q13o1013P8388J5180j1748n2775K8292k2753j38370
16466a00636r0390P4117R6085N8640P9917O6666r8678j12343j5833P8820R6434
$$ y = [-226398, -167615, -73202, -15497, 69400, -46515, -80054, -121029, -195052, -46199, 88826, 33572, -153884, -148037, -45034, -697, 111727, 279894, 248058, 247717, 154887, 53254, -2282, -58907, 20651, 117829, 85492, 98000, 35086, 4160, -28979, -90957, -91445, -54558, 56001, -33332, -121167, -119229, -44262, -141986, -186293, -1464, 106022, 73673, 13980, 103373, 173777, 246872, 392136, 308974, 88279, 154185, 125696, 115850, 140156, 144780, 140002, 116411, 109277, 104621, 227564, 279149, 297954, 306246, 185547, 27066, -59715, -576, 4763, 53452, 80748, 88360, 64976, 64163, 3150, 81538, 96718, 84970, 32195, 60487, 37734, -100636, -191026, -116909, -20824, 37816, 117733, 184399, 85721, -26622, -42455, 36365, 132799]
16455A32799K9368j36548o0343j07616l8028p923J3710j1089o91J0705o3954J20765
16443a18845l1200L6802J3549R1679J05060q525r9703n2137O6073j7390R947o4617
16431f9307j34215m9860J7555M3559J07285J14455J10646k8346r4434j13550o6944
16420a63156J0353N6577Q6740J69293J04732r0425j81956j30910P6175J33287
16410G0710P5177P2508l6925K2253J0755n9546Q7084R6501r3289p1207l5095n7319
16398H1607m3287j30013j8702k2206Q3603K8241l5639l2824l137M5805N6707O8018
16386G8173J20214k575r2308m0523n1900l81j512Q1736J86295L9221j15094r3495
16374A07851n9841n4989n1828R5313N6294J31669J1497P469r6229m3169q916o8499
$$ y = [132799, 162167, 25619, -34724, -142340, -180368, -188291, -174581, -185670, -186361, -175656, -239610, -118845, -150045, -113243, -99694, -8015, 97045, 88520, -11183, -63320, 2753, -14637, -4690, -69307, -203522, -253382, -235827, -192268, -84983, 29472, 140118, 111772, 17338, -96212, -163156, -152803, -96226, -9486, 159807, 264539, 174114, -7842, -138752, -62577, 70710, 145887, 218395, 181470, 203723, 214478, 154932, 242016, 338517, 245228, 174021, 138926, 81607, 38320, -91693, -110395, -132601, -48998, -20757, -56396, -89220, -92357, -46552, 10155, 78173, 198387, 195812, 103504, 62981, 11081, 10700, 9188, 90924, 277219, 316440, 201346, 107851, 48010, -6979, -58807, 36506, 92800, 224469, 235966, 243435, 147206, 104037, 95121, 26622]
16362B6622l2768O2796R1203q2376j98925J42246N3169r1453q6803N6891j24226
16351a83624r0439J05667L9599Q7801J76569K4123o2272j50045m497j06060j18950
16340b82128l6607J24O7324o34M207O5740J54263J07342k18241j95821M3202N776
16328b85453J47358J31930M0129k0892j323L5095q4344k7960O8453j482j26754
16317a25243J20258L4572J02565n8798K0331k8039R6834j6481j84680R557M7294
16306A8170K4744J28678j33607k3145N2301k3002p0912l9953J9407O1614j8378
16295d083k6671R6621P863j08728r3848R0875M7493o319j3490O8409j6490q1862
16283d0230L1778J3330j08964O3701Q1356J30766Q3509N5116k490j73925j20281
$$ y = [26622, -6146, 56650, 147853, 65477, -133448, 8798, 61967, -29486, -116289, -59398, -183624, -274063, -168396, -128797, -40996, 135573, 159696, 97424, -52621, -57118, -163178, -282128, -318735, -318611, -251287, -251921, -247714, -181974, -27711, 79631, -138610, -334431, -291229, -285453, -138095, -6165, 33964, 13072, 11749, 46844, -37500, -65460, 2993, 1511, -125243, -4985, 29587, 132152, 73354, 93685, 65646, 162480, 145999, -38681, -29124, 18170, 42914, 171592, 37985, 14840, 67141, 44139, -26773, -66726, -47319, 14295, -4083, -30754, 65867, 73730, -34998, -128846, -37971, 9522, 3203, -10287, 58122, 41632, -40230, -8452, 4878, -104086, -40385, 40971, 171737, 255246, 310362, 307872, 133947, 13666]
16272A3666j4541p471m7125m994M4183J22575R0850n8413n0710N763J0301m6429
16260E7655k7713K1377J7373k4127K4088o2970Q4216o286N0586J7856q471O3747
16248B07331L8259r8141o5603J6455k6114L567P8380N9108j02756j04499p4729
16237f8742r1597p6599J43507K1834j9173K4910N8015o9752O9807Q1730o153r4544
16225b6757j45642J2192P8208M8400Q4121N2040K8041M238M3008p3304l8783R2238
16213A58000m1852r0031j46358j618o5603j8038P629J10225M600Q9066J88928
16202A94948N0312j19088p5144O8241k8216j00020k0066J65350P6p9152J49994
16191B07235L3362j50286q7644J793R7687j6395o7198p689J78j0509j18287m3004
$$ y = [13666, -875, -8346, -55471, -60465, -16282, 106293, 197143, 138730, 88020, 93783, 104084, 57655, 29942, 51319, 68692, 44565, 68653, 5683, 89899, 83613, 134199, 152055, 143584, 207331, 245590, 147449, 81846, 98301, 72187, 75754, 154134, 213242, 110486, 5987, -68742, -160339, -236938, -93431, -71597, -90770, -65860, -7845, -77597, -7790, 73940, 67787, -26757, -172399, -160207, -81999, -33599, 50522, 102562, 130603, 134841, 177849, 104545, 65762, 158000, 116148, 26117, -120241, -121859, -187462, -205500, -197871, -87646, -83046, 6020, 194948, 245260, 126172, 51028, 119269, 91053, -8967, -29033, 136317, 136393, 57241, 207235, 240597, 90311, 2667, 4460, 102147, 85752, 18554, 10865, 11043, 534, -117753, -160757]
16179a60757K2754J28942M8880r1480m1573L8848K6467O2479L8481J7863o7146
16168B3758J09934J12156k5456m9281q9093j07232q608n7651p7553k4599J2420
16157a81205J11350K6712k2742o1196O6814Q8024R198r0232P0043O5709j03819
16146b1344j27539M5386Q6812j14048k6051J03492n0937l6889O7808R5584j07930
16135h5656j33744n0998J11876J65487M8229J42430o3067p4871j39569J6971P5604
16124A2692L523J61178L3736M3687j02799r6500K1844k0975j8697j51039l826
16113a17176j15262K6592R6060l2390p1939J058K9004J67387o2631l2759j830
16102a13886J79265O8171P4327n808k15959k6673j2010l6089p9246j4317L621
$$ y = [-160757, -138003, -9061, 39819, -51661, -93234, -54386, -27919, 34560, 73041, 90904, 23758, 133692, 245848, 220392, 171111, 82018, -25214, -33822, -91473, -169026, -193625, -181205, -69855, -43143, -65885, -127081, -60267, 27757, 36955, -53277, 16766, 82475, -21344, -148883, -103497, -16685, -130733, -156784, -53292, -104229, -141118, -73310, 22274, -85656, -219400, -270398, -158522, 6965, 55194, 197624, 134557, 59686, -79883, -62912, 12692, 16215, 177393, 211129, 254816, 152017, 55517, 77361, 56386, 37689, -113350, -117176, -232438, -205846, -109786, -142176, -214115, -213057, -184053, -16666, -79297, -112056, -113886, 65379, 133550, 207877, 202069, -13890, -40563, -52573, -88662, -167908, -182225, -178604]
16091a78604k0012j7267K0880M4419N1501K1352L962j60072o5186J9420L8946
16080b40661J08069J38221j1863J1212L5885q3284n5416J41292K30766p6435o2290
16069A35496j12972N8256J9711O3l538j99698k4833k9740J04847J71678N5805
16058A75075p859j73828o7181o6952R743J39732P8872M8797M5583q3296j32990
16047c4304P325l9848R499J7648m8119o6942J68275n1901k509j43724q8130N2334
16035b20396J02654K6071O0965r1883p791k5976M7916J5648o0041Q4821Q7596
16024A9584L6396j03580o0080k0593L4826k9997j1424k4173M6060n8234K7196
16013a44019N7620m489q6044N7871R8037O95q6136n4233n1540R0541J76893L0339
$$ y = [-178604, -198616, -215883, -195003, -150584, -99083, -77731, -73769, -233841, -299027, -279607, -240661, -132592, 5629, -6234, 4978, 40863, -42421, -97837, 43455, 274221, 197786, 135496, 22524, 80780, 100491, 100554, 97016, -102682, -127515, -157255, -52408, 119270, 175075, 167216, -6612, -73793, -140745, -131002, 8730, 87602, 136399, 181982, 98686, -34304, -26979, -66827, -57328, -39680, -87799, -154741, 13534, -38367, -40876, -184600, -272730, -220396, -117742, -91671, -30706, -122589, -130380, -156356, -108440, -92792, -152833, -68012, 19584, 55980, -47600, -107680, -128273, -93447, -123444, -134868, -159041, -112981, -171215, -144019, -86399, -90888, -176932, -119061, -21024, -20329, -106465, -160698, -212238, -121697, 55196, 85535]
16001H5535j1295n7129J71854L3496k10263j20957K4536N8565O5987L3131n3956
15990A9504j93196l0506J48279Q9730K1577J32016n8984J4008N0546k3528j25628
15979D3818N9420K0838R1154O1976j70200r6818J3900j3185o4060l4772K8421
15968e9508J53496L5578O1806j26872K474n3037r8651k0152J08057R815J14338
15957A27344p7510j55125J9381P1166Q3759J15264l0579r3117l1664M8120r8347
15946b1308R31r7829J9039N0038R6007J45498K5721J02711j5508j13336r4087
15935I7877j7721J0249o0799J4674P2710R194j4914j6089j0605L6393j854L7157
15923A56272P0622J8699q932L6206j24334j80567o4925N5332M3866J79428K0336
$$ y = [85535, 74240, 17111, 188965, 222461, 12198, -108759, -84223, -25658, 40329, 73460, 19504, -173692, -204198, -55919, 33811, 55388, 187404, 128420, 142428, 192974, 169446, 43818, 103238, 124076, 215230, 277206, 107006, 10188, 24088, 10903, -53157, -87929, -59508, 93988, 129566, 191372, 64500, 66974, 13937, -84714, -104866, 3191, 13006, 127344, 49834, -105291, -85910, -14744, 69015, 184279, 153700, 60583, 28919, 77039, -21308, -20377, -118206, -99167, -49129, 46878, 192376, 218097, 320808, 305300, 191964, 97877, 80156, 90405, 29606, 44280, 116990, 126184, 111270, 95181, 84576, 120969, 119115, 156272, 226894, 245593, 236661, 272867, 148533, -32034, -96959, -41627, 2239, 181667, 202003]
15912B02003o1819J7743m076j29162j71672j2439J80265L8819j83324J1567R9734
15901a2361O0942N2133N0359k75952j07061J6275Q3637n2979K0222n233k5368
15890a95386Q2480J07722p2507L8206L7340m1456o8384K0660K6108l1359J2254
15879h4322k8068N4084J42431M5543r2714p2419p8515p6272k1651L6549R8305
15868g7049J31733j50068m7969M1138K0116m6646J16444J12793Q9952j4460l0035
15857A45949p1035k5674o8135m1081L2846m3146M4558R9988P3691l5493p6602
15846C5866K1210J1230p8566Q2243J97234O697j78368m3152P9612J4941L9140
15835A88087r0745r2823L4202j29584k05643P5877J85324N6388m6068j01060k0142
$$ y = [202003, 140184, 157927, 153851, 24689, -146983, -159422, 20843, 59662, -123662, -112095, -12361, 48581, 100714, 151073, -124879, -231940, -215665, -132028, -185007, -164785, -170018, -195386, -112906, -5184, -77691, -39485, -2145, -43601, -111985, -91325, -65217, -96576, -84322, -112390, -58306, 84125, 129668, 36954, -35465, -113980, -190252, -211903, -175354, -77049, 54684, -95384, -143353, -102215, -82099, -128745, -12301, 100492, 190444, 175984, 145949, 74914, 49240, -18895, -59976, -27130, -70276, -25718, 74270, 147961, 112468, 35866, 57076, 68306, -10260, 71983, 269217, 275914, 97546, 54394, 134006, 148947, 188087, 97342, 4519, 38721, -90863, -296506, -220629, -35305, 21083, -24985, -126045, -146187]
15824a46187n509R4036M4168j74014P9611R7582J5981K5199j13340Q9703J81350
15813A88580N8425j11189p7637N4292K9916k43981p6541N8203J3403o2224L0932
15802a37821J09991n8123k0298R7206l4796k02693J00028M8527p6899O341K7427
15791a41110k026O1896L8285o5940N0009O3863m0397o1994k9426R8740L5867n6552
15779d8785k2264L086Q631k3218l0358L5629J01585J29890J6274j18992n6340
15768d862n842q8033L4178M1598O2112P4373l4673L7368M2671K495m5954n8814
15756E6617J740n2066K1893L4456O6997O1939M7791j07033m503O6709P361j2297
15744A89604q9739p7549q8823J4606O9347j0761M5050J45205M0028Q2859j41612
$$ y = [-146187, -151696, -57660, -13492, -187506, -107895, -10313, 5668, 30867, -82473, 7230, 188580, 247005, 135816, 58179, 112471, 142387, -101594, -178135, -119932, -106529, -168753, -137821, -27830, -85953, -106251, -9045, -43841, -246534, -146506, -97979, -174878, -168537, -141110, -143136, -81240, -42955, -108895, -58886, 4977, -35420, -97414, -126840, -28100, 7767, -48785, -71049, -67963, -59332, -82550, -112908, -77279, 24306, 154196, 170470, 51478, -4862, -10704, -98737, -64559, -22961, 39151, 113524, 78851, 116219, 158890, 161385, 115431, 56617, 58357, 6291, 28184, 62640, 129637, 191576, 239367, 132334, 127831, 194540, 201901, 189604, 99865, 22316, -66507, -51901, 17446, 6685, 51735, 196940, 236968, 319827, 178215]
15733A78215o7350j09191j76389n2725J33244J05702K4282o6344m548m057m8598
15722h7759M7887P8171m0168p5006K25654L9301o4424K5768l4580m1583P3415
15711A46676k7537M5295J2249N6787j25046j56415L3187N5535K6816L6411M5644
15700A49602j11350p5996Q9928J14767K5780O1615r7107o2841K486J6991j9877
15689I3998j50053K4242L7691P9638m5209l6367J08775O5761J32640j12382j40453
15678E8281l792j58014n5054J78006J32460O966p6964j05518j09719M8772J01638
15667A7062M2877P3185l0J39676j3015l3053J0274m2945j42722o2935o0392R7943
15655B5925L513P568J793k0891J29519j6709o3626N5376O0932j66529r2803N8428
$$ y = [178215, 110865, 1674, -174715, -227440, -94196, 11506, 35788, -30556, -35104, -39161, -87759, -39872, 38299, -1869, -76875, 148779, 188080, 123656, 149424, 114844, 73261, 146676, 119139, 164434, 176683, 233470, 108424, -47991, -14804, 40731, 67547, 103958, 149602, 38252, -37744, 52184, 166951, 192731, 254346, 157239, 94398, 96884, 113875, 93998, -56055, -31813, 5878, 85516, 40307, 3940, 112715, 178476, 311116, 198734, 58281, 54489, -103525, -158579, 19427, 151887, 158853, 81889, -23629, -133348, -84576, 17062, 59939, 133124, 133094, 272770, 259755, 226702, 236976, 194031, 51309, -11626, -72018, 25925, 29438, 37006, 38799, 17908, 147427, 130718, 67092, 122468, 183400, 16871, -75932, -17504]
15643a7504o6583p6381J3913Q5410L3517l0438K5376J0990l9969L2641J14831
15632H5803k0789n1582q7759p617J9838q1614k2234j5789J06437J31356n180j107
15620D9763k8453o5677P9995n2042p16J12379k0j8968Q8521r4783q1097N1019
15608C9921j7790P719N1399O7088j19629r4294J44245O9553K3938q6942n0328
15597C4880j440j61134K6954L0293k427M9860o8815m2451K0957M5954M405J1405
15585e1559J05404N4777r2174q2696J0046R8315J69568Q7886m1825r1190p8150
15574H8402m7194m8297l1805k758n1620J02914N4085j41462n1252M5296L2308
15563e1383L8315L3443l0143N2749K2239N0081m5127m9798n9143K185j3367K9172
$$ y = [-17504, -84087, -160468, -146555, -61145, -27628, -58066, -32690, -21700, -61669, -29028, 85803, 65014, 13432, -74327, -81944, -62106, -143720, -165954, -181743, -75306, 56050, 50870, 49763, 21310, -44367, 35628, -16414, -17130, 95249, 95229, 76261, 164782, 69999, -11098, 39921, 22131, 29850, 81249, 148337, 28708, -65586, 78659, 148212, 172150, 85208, 34880, 33440, -127694, -100740, -70447, -72874, -23014, -91829, -134280, -113323, -67369, -62964, -51559, 53845, 108622, 16448, -66248, -56202, 42113, 211681, 299567, 257742, 166552, 88402, 41208, -7089, -38894, -41652, -93272, 9642, 63727, -77735, -128987, -83691, -51383, -13068, 20375, -9768, 42981, 65220, 115301, 70174, 20376, -38767, -36582, -49949, -20777]
15551b0777O7760n45l6710J0582m5140k0951K9575L4473J8195j18521p1847M5045
15539a08861m1785j89826O7781J36972K3445J28065P1708P479K0184j8219N3820
15528A50763M5779j02887j37600R614J21691K694o295m0834n0454m1929J5150
15517c4308O1226j8182n4691j6715k4544N8700q7145j2735K9312L5668q5739n9537
15505b08690L1944P3881N0939P7139m1250o0714J3030M7380l6887M6140j21209
15494a28297M5497K8493M9709l2215M5344k3929n3071j0703J03909m161J72676
15483A93252p9612j61279k6888j2298q0241j3478N3675J16431j609l6057j8759
15472f6863L7941J54699J29386j77450j49494M9088o983p6410J4734Q7034n7751
$$ y = [-20777, 46983, 46438, 9728, 20310, -24830, -45781, -16206, 18267, 36462, -82059, -153906, -108861, -150646, -340472, -272691, -135719, -112274, 15791, 87499, 94978, 115162, 96943, 150763, 196542, 93655, -43945, -34331, 87360, 90054, 83759, 42925, -7529, -49458, -34308, 26918, 8736, -45955, -62670, -87214, -28514, -115659, -128394, -99082, -63414, -149153, -208690, -176746, -102865, -51926, 25213, -16037, -76751, -63721, -16341, -53228, -7088, -128297, -82800, -54307, -4598, -36813, 8531, -15398, -68469, -79172, 24737, 20576, 193252, 113640, -47639, -74527, -86825, -167066, -180544, -126869, -10438, -12047, -48104, -66863, -28922, 125777, 255163, 77713, -71781, -22693, -29676, -106086, -91352, -4318, -62069]
15461f2069j70575k5586O0459L1413J34374J17531J8899j14290r7585K2642P8733
15450f054m8167j14771Q0867P9878K2196o3478J403O4137Q3251J5450o9474j62098
15438a16860k7559L316m2400J00472k9688P5291m1006m7883L9304N6359L3947
15427C293M4j4358M3540j8615m3556J5485n1961L3387J21210O9509J28009j669
15415B84318n6573P9209j04308r5912j36821J6693k0628N1988Q5009K6607j11321
15404A8261q999J14108j1153n9991o28r6876j59483j00325J18872K05158o3122
15393d4178o2382N528p981M2193K4494J8988j7773k2757K1667m5713j28279o4256
15381b80449M0917K3927j0242P0287k4648N2982J69775R8459j2665m9068q012
$$ y = [-62069, -232644, -258230, -197771, -166358, -31984, 85547, 104446, -9844, -107429, -84787, -6054, -54221, -168992, -88125, -8247, 13949, -49529, -48126, 16011, 99262, 114712, 45238, -116860, -144419, -141103, -183503, -83031, -112719, -37428, -78434, -126317, -87013, -30654, 3293, 3337, -11021, 32519, 13904, -29652, -14167, -66128, -32741, 88469, 157978, 285987, 284318, 227745, 306954, 202646, 106734, -30087, -13394, -34022, 17966, 102975, 129582, 18261, 9262, 123370, 112217, 52226, 51598, -45278, -204761, -305086, -186214, 18944, -44178, -106560, -101032, -109013, -66820, -42326, -23338, -41111, -63868, -42201, -87914, -216193, -280449, -239532, -215605, -225847, -155560, -180208, -127226, 42549, 141008, 128343, 79275, 71263]
15370G1263R116L8215J2591m3680n3270m4243m2298J33324L1236k1540o5744J6464
15358D1434j9895M2465J36470j15754n2364M6187J9317j38246j2584K8119N5219
15347C0368k1689j59616P3869j2448J856J7103J1225j59105R1016J0102p1299
15336a88618M5610O8092k3807O414K3403Q6236k3257k0699j26617P7111j3752
15325h9884j4579N9300j11884r7864M14O0340J09732J57758J24041r3974K236
15314A05636k4674l4933M6680L2741K7575o3102o0704m9532M775j6349n4454N0669
15302c5672K2697q0707n696J51400J5249R3705L2830o1819m1261M9545O6242l5738
15290A70775n5853M925O4737J8953j40442q9221O8375n2722q0494N9587L8591
$$ y = [71263, 80379, 118594, 131185, 87505, 34235, -10008, -52306, 81018, 112254, 90714, 24970, 41434, 21539, 64004, 200474, 84720, 32356, 78543, 97860, -40386, -52970, -24851, 30368, 8679, -150937, -77068, -89516, -87660, -70557, -59332, -218437, -127421, -117319, -188618, -143008, -74916, -98723, -92309, -68906, 17330, -5927, -26626, -153243, -76132, -89884, -104463, -45163, -157047, -254911, -254497, -194157, -84425, 73333, 197374, 103400, 105636, 80962, 46029, 92709, 125450, 153025, 89923, 29219, -20313, -15538, -31887, -86341, -35672, -12975, -93682, -99378, 52022, 67271, 160976, 193806, 131987, 90726, 140271, 206513, 170775, 114922, 119847, 184584, 203537, 63095, -26126, 42249, -10473, -90967, -31380, 7211]
15279G211l6856j26328m5688L6273P1161N7686J49403J34692j389l2597j59294
15268E4274j69620N6M6996K749P853m9154j7787r6621m9275M6976J7783M9906
15256a55864n7194J28972Q6576R548k3067R3985l9417p38j23844o7236L4488J02461
15244a1330K3043j7644N1863J4205q7163J6318P0073k2143j06650l7043L7012
15233f9459O1857K1499j00929L6419Q5124l7240J27964o4457q8498R42J43779
15222A17001p3048l6116o7088l0042J25550L6785j051J9429K3975m1642q0245
15211f492J2085J3903l0748M7483N6164L52J37783l4324j31235j85403N7709J8755
15199d3968p2715Q6343m4898j12527J15491L9402L8852Q893J03874L9623J41050
$$ y = [7211, -29645, -155973, -201661, -165388, -94227, -36541, 112862, 247554, 246165, 213568, 54274, -115346, -115290, -68294, -65545, -57692, -106846, -124633, -221254, -270529, -223553, -205770, -155864, -213058, -84086, 2490, 12038, -11029, 82956, 43539, 42801, -81043, -148279, -113791, -11330, 11713, -5931, 45932, 60137, -27026, -10708, 59365, 37222, -69428, -106471, -69459, -7602, 13897, -87032, -50613, 34511, -2729, 125235, 60778, -27720, -26778, 117001, 43953, 7837, -59251, -89293, 36257, 73042, 71991, 91420, 115395, 73753, -6492, 5593, 19496, -11252, 36231, 92395, 92747, 230530, 196206, 64971, -120432, -62723, -43968, -116683, -30340, -75238, -187765, -72274, -32872, 5980, 14873, 118747, 158370, 299420]
15188B99420p8110j09947q1179n700Q6932n5778n9211M2358n3247L7047N336k18105
15176a90184L7971J83305Q3918O6666m7044j66151P8255R1084r7493Q659j1994
15165C6992L8963l0938N9229M8226n2778r97J03523r8092l935L0345r0914O576
15153D6200R0920K0884L8923j15444p448m1278l69J12743K2935n6014q8808j00920
15141g7676n3854J19623M945l1614J7894K8551j07530O953r937k3855q6818M3233
15129a70085R4997n7623k19J7743N882P02N4198P4513o8492j58580M2697J11327
15117e2940J00372j526j0059J9272N2493J21333K130k4924l5566P112m1581m6694
15105H9422q4067M9993P440K546J09433M9106M9228m5488O05k0391o4860O2383
$$ y = [299420, 221310, 111363, 30184, 24484, 111416, 55638, -3573, 38785, -14462, 22585, 27921, -190184, -152213, 31092, 115010, 181676, 134632, -31519, 46736, 137820, 40327, 48986, 36992, 75955, 45017, 104246, 152472, 99694, 98697, 202220, 104128, 100193, 130538, 39624, 46200, 137120, 158004, 196927, 81483, 74035, 32757, 32388, 145131, 168066, 112052, 23244, -77676, -131530, -11907, -6962, -38576, -20682, 7869, -99661, -92708, -102645, -126500, -213318, -170085, -75088, -132711, -132930, -115187, -109305, -108603, -54405, 20108, -48384, -206964, -164267, -52940, 47432, 45906, 35847, 55119, 107612, 228945, 231075, 206151, 170585, 177697, 136116, 89422, 5355, 55348, 62788, 65334, 174767, 223873, 273101, 227613, 228218, 207827, 142967, 205350]
15093B05350K522j59168o0235l0584j02480K9471J18625P9282j5370l4141q018
15082B5254l9731q8280N4702l2208Q7136J39725p5241k7572J0718J31902R6816
15071B83221o0814j05864q8269J1123Q3848j01885j10420M6520J43431k6798J5786
15060H9879K5867J6374q1356L7175R8114K9488j12698p3756q0631p9171Q5241
15049d5474J72116O6049q824P0366q9291k1372j7877j1611J09402m3323m5174
15038A34987j0111J5710O1881J03631o4347j74997K8732M2829j00228p2566p6343
15027a10822Q3187Q7709J00198o6728j10214o6382L5707K3758m7239N0236J0886
15016i704q7763k0003P2699m3427M4753J0328J8692J3332J35595j4182j19200
$$ y = [205350, 207872, 48704, -11531, -42115, -144595, -115124, 3501, 82783, 67413, 33272, 25254, -14477, -102757, -48055, -80263, 6873, 146598, 71357, 43785, 54503, 186405, 283221, 222407, 116543, 28274, 39397, 123245, 21360, -89060, -42540, 100891, 74093, 89879, 115746, 132120, 50764, 87939, 186053, 215541, 102843, 29087, -51544, -130715, -45474, 126642, 192691, 183867, 254233, 164942, 143570, 125693, 114082, 223484, 180161, 134987, 124876, 140586, 202467, 306098, 241751, 66754, 95486, 138315, 38087, -34479, -110822, -27635, 60074, 160272, 93544, -16670, -83052, -47345, -23587, -70826, -20590, -9704, -97467, -117470, -44771, -88198, -43445, -33117, -14425, -1093, 134502, 120320, 1120]
15005A120K0576K9638J14873j1884n3743j0836J4686J89673p7399j20685N5171
14994A51190k9425j49483O1914l6006n6257Q2033m4908r9822m542R872r4247M6748
14982a62933J73564O1950j03405J4858P454J1590o5519j9686J45291n1027j00756
14971h8619j57031R7813J30388J00164K4458m4482k3351n6643L98k407j469K0848
14959F7k6727M0072L4304N6846j9720q4440j09057l4796N3193R9954J13022k8247
14947I4471p5343r7101N2301l1547J3447j10887k0596M6139P1472K1727K2358
14936a3559q7709J45034K4433j3955k0249j2587p78j4865q637Q977l0500J07690
14924H3295n7071J6135K6446j1290q0084q8021l6044K4347J03890O6149R2212
$$ y = [1120, 21696, 51334, 166207, 154323, 100580, 89744, 104430, 294103, 216704, 96019, 151190, 121765, -27718, 34196, -1810, -58067, 23966, -20942, -120764, -125306, -115434, -209681, -162933, 10631, 72581, -30824, -15966, -8512, 3078, -62441, -82127, 63164, 12137, -88619, -245650, -147837, -17449, 82715, 107173, 62691, 39340, -17303, -16905, -19312, -20781, 67, -26660, 13412, 47716, 104562, 84842, 402, -108655, -143451, -90258, 9696, 122718, 94471, 19128, -77973, -25672, -57219, -43772, -154659, -175255, -129116, -57644, -35917, -13559, -101268, 43766, 68199, 54244, 33995, 21408, 20630, 5765, -2872, 6105, -24395, 83295, 26224, 42359, 68805, 57515, -22569, -110590, -146634, -122287, -18397, 47752, 139964]
14913A39964j11450j3774j42595m7638R2074N7979J86684P938j26735j07819P366
14902e8006q5516P925K01283L5494L0383M4254k8192q8951J4193l4708P5367l6425
14890G7101j54919k4824j01159R2016J35977J15446N2103q7829p5583j00445m9066
14879a21182J10863R7930m0403j18444p5606j0845m2881r544J13125Q2921j8138
14868c2204j7938m6790O6334J67732O1520l2200K5361m2100L9062m7340p724q8079
14856D5634n5785k8496J2786J6613J02748J1217r8214j54411Q0589k408n7222
14845a26949M0030l1504l5785Q7804j6762j01709M8995O3192R8074P631k7980
14834E037m0069o6915J4716L2923r7786o5918K8710K04547k2150j22660J39309
$$ y = [139964, 28514, 14740, -127855, -175493, -83419, -25440, 161244, 169182, 42447, -65372, -58006, -143522, -135597, 65686, 101180, 131563, 175817, 147625, 58674, 72867, 38159, 113526, 77101, -77818, -102642, -203801, -111785, 24192, 139638, 191741, 103912, 28329, -72116, -121182, -10319, 87611, 47208, -71236, -146842, -157687, -200568, -210112, -96987, -14066, -32204, -50142, -96932, -30598, 137134, 198654, 166454, 191815, 149715, 188777, 141437, 133713, 45634, -10151, -38647, -25861, -9248, 93500, 104717, 6503, -147908, -67319, -69727, -126949, -86919, -118423, -154208, -66404, -83166, -184875, -135880, -72688, 25386, 33017, 5037, -35032, -101947, -87231, -54308, -152094, -218012, -189302, 15245, -6905, -129565, 9744]
14823I744J01715K1503R7931O1289r4067j83864j18147l4085J5403K7419J5807
14812g9352N088O7859K532j03927J5944N4968k5844K4511N1646k2327M8051l1580
14800G569q6537M5610L0240q6609P47o1581q120J48055k099N1568N2303o6025
14788B5121k3522L3773N255p6533l8470M0367q463K0997K4726N2280M2255r5567
14776B219K3522m4333K3496j22862n1604J30569k352q0841K3719Q1686m3818L3041
14764b7558N2154P030j4463q1447P63N8983K7399n0314k7973Q256L6505o8409
14752g9074j70888q3728J9498J07154J14772j22188K0871J26026p3286K0442Q2965
14741c7436R5211J03886J4833q8373j17732j02785q7504K7259N2969R1853L6223
$$ y = [9744, 111459, 132962, 230893, 292182, 198115, 14251, -103896, -137981, -122578, -95159, -79352, -74264, -6405, -3873, -107800, -91856, -36888, -62732, -38221, 13425, -8902, 39149, 7569, -78968, -33358, -3118, -89727, -88980, -150561, -158681, -10626, -12725, 38843, 91146, 25121, 1599, 35372, 40627, -35906, -74376, -34009, -42472, -21475, 3251, 55531, 97786, 2219, 25741, -18592, 4904, -117958, -169562, -38993, -41345, -122186, -98467, -16781, -60599, -27558, 24596, 31626, 17163, -64284, -63521, -4538, 22861, -27453, -55426, -47170, -10665, -79074, -249962, -333690, -314192, -207038, -92266, -214454, -193583, -67557, -140843, -120401, -37436, 57775, 161661, 176494, 88121, -29611, -132396, -219900, -192641, -139672, -47819, -11596]
14730a1596j9313j31877j8701N9496O4970L6620P3237p297o435k3939n5364r784
14718d9983P0046J2221J433l8032R89j26226m3033p8420p5606J40206J62586O1281
14706C7462m6644n1978Q934k831j1903m6420q5233Q6669L5442N5485K2712j06738
14694a05043N8336k9288P62J26831m389j7885Q3618O2334p6007o9965k0416p9
14682H809J00969k7936k7010j13723k1881K3322N3324J0088k4750m6166J46719
14671H1765k2141j80248q0231k0258Q4150N6100J9062q5886J2302R5690P209m3966
14659g6452l6244P8529P7210N4203K003q6852k6301L3534K5943m3351L3360J41739
14647A77321M4034j11195j52059l2722q77J15311J1741n7833L9275j6639Q7457
$$ y = [-11596, -30909, -162786, -181487, -121991, -57021, -20401, 52836, 45539, 39104, 15165, -40199, -49983, 20063, 32284, 33717, -4315, -3326, -129552, -172585, -251005, -326611, -186405, -23819, 37462, -9182, -61160, -52226, -55057, -66960, -113380, -198613, -111944, -76502, -21017, 1695, -105043, -46707, -75995, -75233, 51598, 47209, 29324, 112942, 175276, 99269, 29304, 8888, 8809, 109778, 81842, 54832, -58891, -80772, -57450, -4126, 5962, -18788, -64954, 81765, 59624, -120624, -200855, -221113, -136963, -80863, -61801, -147687, -135385, -39695, -32486, -76452, -112696, -34167, 43043, 97246, 99249, 12397, -13904, 19630, 45573, 2222, 35582, 177321, 221355, 110160, -41899, -74621, -75498, 39813, 51554, -6279, 32996, 16357, 103814]
14636A03814L4866j17261k0215Q1492J14921p754l0985n9295j05584l8664L0365
14625a4300q2611o1274R6108Q2659N234k8802K5234j27308j10847O813O6574O9739
14613g2781M5817k9592p2282J32262J61994L6724j04206K2646P3880p2282r0445
14602C1735L0852o431J7864J0767k6213p0045K5036L4708O082m0028j26k2089
14590g888j3778L7688R6197k7336k11870L6685J11771K0039m6736O5473k6624
14579C3621q5577j2960l4642j1847Q8444K5668P1254j3153o4869J30918K6092
14568A52949J5899o9286k09811R8338P6492Q6827q48l2174j6913q3417q7689l3365
14556a02998O7324M3034O8240P8299k1362j5034M5376J70860M8374j35636m9292
$$ y = [103814, 138680, 21419, 1204, 82696, 197617, 189863, 158878, 99583, -6001, -44665, -14300, -96911, -158185, -62077, 20582, 25816, -2986, 22248, -105060, -215907, -209094, -142520, -72781, -26964, -56556, -128838, 3424, 165418, 202142, 97936, 120582, 194462, 122180, 31735, 62587, 56156, 74020, 84787, 58574, -11471, 13565, 48273, 54355, 14327, 14201, -7888, -21666, 16022, 112219, 84883, -126987, -90302, 21469, 41508, -5228, 60245, 33621, -51956, -64916, -99558, -111405, -22961, 2707, 73961, 60808, -4061, 126857, 152949, 168848, 99562, -110249, -11911, 64581, 151408, 150560, 118386, 101473, 18056, -69633, -102998, -35674, 7360, 75600, 153899, 132537, 117503, 162879, 333739, 382113, 246477, 197185]
14545A97185P8709J04268n2016o692J29143R3336m7498M7220n4870j44007j58594
14534A86184o5543p6556J939M2339J5041n6051j6434j12206n8568R0702K8285
14523b0868J7179o0173L1876O2283l9118n2127K0707J33952L3336R051M0149j17114
14511E9133l3710k2437m7929K4730o3762n5407J3232j8776P5212Q4049n6375J18828
14499G6788N1132l5713j3197j2812P9393J7719p7426j11268l9802Q7793J9523
14488D2130n426l2085R703M624m0716o9239L1108M6395J18512j05894N0014l2525
14476A6601n2629K145l2150L3532m4851j01281J02895P8186l1562j1799M3040
14465B127m3122j51286R038M2729R6530N5128M8085q7470l2453J02187J5420J8467
$$ y = [197185, 275894, 380162, 328146, 321454, 450597, 543933, 496435, 543655, 488785, 344778, 186184, 120641, 44085, 46024, 88363, 103404, 47353, 30919, -81287, -139855, -49153, -20868, -3689, -63862, -31986, 30297, -8821, -60948, -40241, 93711, 127047, 136098, 176247, 59133, 25423, 2986, -44943, -20213, -83975, -139382, -126150, -144926, -69714, 14335, -42040, 76788, 127920, 92207, 79010, 66198, 145591, 163310, 85884, -25384, -65186, 22607, 42130, 36704, 4619, 14322, 18946, -21770, -91009, -59901, -13506, 105006, -888, 49126, 16601, -36028, -33883, -66033, -32501, -77352, -178633, -75738, 2448, -29114, -40913, 2127, -40995, -192281, -183243, -140514, -43984, 11144, 59229, -28241, -60694, 41493, 56913, 75380]
14453G5380O3180o147k3344n3613L8447J20193q2418j17675q3206N5155j676k714
14441a8438Q6194l8087j26128k5340l4384J45731J05965k3522k2356Q2716k2196
14430A10155J30076k7424L4727M3988O0598J16686K58459K90458K86210L40878
14420A644811K37622J3936k8901r2724k38597m74731m08326p9628J3015j18347
14410D68130j12941L3138j08431m5949J54510M5536o9667q8186q9671j29817j9039
14399C7613M0873J1241M8149J40565O4361m4843j15996j46206m8358M0341Q1620
14388A09360l6473k1927j988k5171N4624L9951L916r0925q1602o401K59185J01874
14376C04423p4253l4085j6826J6957Q2100K2632j43119p4799J11643Q7824j6155
$$ y = [75380, 138560, 132413, 109069, 55456, 93903, 214096, 131678, 14003, -69203, -14048, -15724, -18438, 67756, 29669, -96459, -121799, -156183, -10452, 95513, 71991, 49635, 132351, 110155, 240231, 212807, 247534, 291522, 352120, 468806, 727265, 1017723, 1303933, 1644811, 1882433, 1896369, 1867468, 1774744, 1536147, 1061416, 653090, 573462, 586477, 468130, 355189, 388327, 279896, 233947, 388457, 433993, 364326, 276140, 186469, 56652, 37613, 78486, 89727, 137876, 278441, 342802, 297959, 181963, 35757, -12601, 27740, 109360, 72887, 50960, 48972, 23801, 78425, 118376, 122292, 31367, -50235, -56636, 202549, 304423, 230170, 196085, 179259, 196216, 278316, 300948, 157829, 83030, 194673, 282497, 266342]
14365B66342j53820q1639m8361O400M6388N302R144N7603N3420m0569J3093k521
14353A30782O3594K7678r328r0537j08920j6131K9847j37838L8491J41571l0241
14342C8968n9916J28978J02698K9246n1932p0876L7928J7473O0985n3568q4538
14331I5446r0871L4621k7741n474P1395K9254R1616j10628k04871R3390j2295
14320c6158l4813J0821N6753j3494q8709M6685R8983n9663p7217j5653n5089m1448
14308b09002J7375n2362J9218J23636P1096q2649p172P1151R2950j0622n9955
14297b6336o346k5221j3616K6707M1520n9259J00074O7340j8804n7122j07417
14286g8480O1361O2352n6837p8457K6576o557L4240j1149j7376J1567k1306L6394
$$ y = [266342, 112522, 30883, -17478, -11078, 35310, 40612, 49756, 107359, 160779, 120210, 133303, 130782, 194376, 222054, 212726, 122189, 13269, -2862, 26985, -110853, -72362, 69209, 38968, -20948, 108030, 210728, 239974, 188042, 117166, 155094, 172567, 233552, 179984, 95446, 4575, 39196, 11455, 5981, 77376, 106630, 198246, 87618, -117253, -23863, -36158, -70971, -60150, -3397, -16891, -105600, -58915, 40068, -19595, -96812, -112465, -167554, -209002, -191627, -243989, -224771, -101135, -30039, -112688, -119860, -48709, 44241, 33619, -26336, -32682, -57903, -71519, -44812, -3292, -62551, 37523, 104863, 86059, 28937, -78480, -17119, 45233, -11604, -90061, -63485, -70042, -35802, -46951, -64327, -52760, -74066, -37672]
14274c7672M1751J2523k6975J4798Q0026j04291j61486L2093O8103J04807P8426
14263A02103j01174j42788R2908P9690l5045j03656m0458J40273J0051q8938P0447
14252a6587P9803m4415j15944O5535M0249k8290N368j230J9696J23798P658j66517
14240c0876o0196j845L4382J05403o5753m4453j2580n9801j40349k4670L4047
14229b66691N5991P1515P7777J91175M6632j47131k35099n9474J68546J59522
14219F2763j0392j4377j55236M7306J18707N4063j3170P620J5028J794O9602n9758
14207A23950j32144n2828M8995k6167J1992J031P7645j5149l0229j6149m0960
14196e0013J65863q8623q0675N7784O5752p7415N3012P1731J72792k6137R035
$$ y = [-37672, 4079, 16602, -10373, 4425, 84451, -19840, -181326, -149233, -81130, 23677, 102103, 929, -141859, -48951, 30739, -4306, -107962, -148420, -8147, 1904, -87034, -16587, 63216, 18801, -97143, -31608, 8641, -19649, -14281, -15511, 4185, 127983, 135641, -30876, -91072, -92917, -58535, 46868, -18885, -63338, -75918, -135719, -276068, -300738, -266691, -210700, -139185, -61408, 129767, 176399, 29268, -205831, -265305, -96759, 62763, 52371, 37994, -117242, -69936, 48771, 102834, 89664, 97284, 112312, 114106, 183708, 123950, -8194, -61022, -12027, -38194, -26202, -25171, 52474, 37325, 7096, -9053, -50013, 115850, 27227, -53448, 4336, 70088, -7327, 45685, 117416, 290208, 264071, 273106]
14185B73106n4507l7127P7707o816p2367l0383J20519r0498l2143Q4855k746k2150
14173B07450n6275j0391n5574j35667l9633M8803J21373J11444N6781J5564J9321
14162B83196j1885l5107o3810p7795K913P9467n9089j09641o7992p7485J08744
14151b8484K223O9406n4706M2160o8914j44759l497O1957K3901R7368J23646J41181
14139B61482j5803j75828K9454P6313J04620k1674n9578r2694n4216J84K6720
14128G8980j33917M6447J27704Q0338j13973j28093l2691K0615K359L8634q0372
14117i3969R9361l8625O2216N7014Q4636Q4654R5118J33517J08233P2317N7314
14106G21786O1041q0684n3510k50175k63036p7917Q578M2505P4517J5027l8237
$$ y = [273106, 218599, 181472, 259179, 252363, 179996, 149613, 270132, 179634, 147491, 232346, 229600, 207450, 151175, 140784, 85210, -50457, -90090, -41287, 80086, 191530, 248311, 263875, 283196, 271311, 236204, 172394, 94599, 97512, 176979, 117890, 8249, -59743, -137228, -28484, -26261, 43145, -11561, 30599, -38315, -183074, -186571, -124614, -100713, -3345, 120301, 261482, 245679, 69851, 99305, 175618, 280238, 258564, 198986, 106292, 52076, 52260, 78980, -54937, -8490, 119214, 199552, 85579, -42514, -75205, -54590, -52231, -13597, -93969, 5392, -33233, 28983, 85997, 170633, 255287, 350405, 483922, 592155, 664472, 721786, 782827, 702143, 648633, 398458, 135422, 57505, 66083, 108588, 183105, 198132, 159895]
14095A59895J14500L8439q506n4342k21116l0926N2324p196p7571P3747J11096
14084A50344m2077j48763J0571O0953M6798N7744L0429P3084j47442k73384N7852
14073a23891r118o4754L6744j2269j7834j9377O0393N9770n30r471L2402k7220
14061i5155l4462R1718N7494O8977J78970N7665N7997P9681J19356j32055n5902
14050C94284K6093m4595q8824o4510k2304R4188j6335L1085k0088R7375l0428
14039C55941j91618m2991J1569J04688J11131m0291l3080J40338o218O529j42759
14028B73239o6094K3494m9811j1103P8238j6178N0889r7834o5189J5677k4990
14017A10338M531J16171O7685k8125o3691j3508J85125J48620m9583j09232q3579
$$ y = [159895, 274395, 312834, 304328, 249986, 28870, -2056, 50268, 43072, -34499, 39248, 150344, 108267, -40496, -29925, 31028, 77826, 135570, 165999, 239083, 91641, -181743, -123891, -133009, -197763, -161019, -173288, -191122, -210499, -150106, -90336, -90866, -100337, -67935, -95155, -129617, -37899, 19595, 88572, 267542, 325207, 383204, 462885, 582241, 450186, 394284, 420377, 375782, 286958, 222448, 200144, 294332, 277997, 309082, 288994, 386369, 355941, 164323, 121332, 132901, 237589, 348720, 308429, 275349, 415687, 409469, 415998, 273239, 207145, 230639, 180828, 169725, 247963, 231785, 282674, 184840, 119651, 135328, 110338, 114869, 231040, 298725, 270600, 206909, 193401, 378526, 527146, 477563, 368331, 284752]
14006B84752L1757J15021l1323j7821N3867N3637m6024J26978J2365K6482J35837
13995G45528n2484m7684K1957M0328p8290r910K6865j4601J13221K0744o1931
13984G03743p9778j69716P2576L05380J49976K17754J01647M8192J9325l7077
13974A332022K6756J83445R8577J50550J66119Q3469K07111L52944K27694K10954
13964C039641J18125J80683K03837K66137K93972K61526K66148M27553M12619
13955E470241M89592O12486Q84932J077513J513750J915484K047279K219390K468723
13946A8699390K682579K920447L711165N138405P234560J0809392J7243844K8358314
13938I6798096M5027988O1369836O1719856N1728852M6881112K3470204k0986661
$$ y = [284752, 316509, 431530, 400207, 382386, 436253, 489890, 443866, 570844, 583209, 609691, 745528, 693044, 645360, 667317, 707645, 629355, 619445, 646310, 631709, 744930, 765674, 703743, 623965, 454249, 526825, 832205, 982181, 1199935, 1301582, 1349774, 1369099, 1332022, 1358778, 1542223, 1640800, 1791350, 1957469, 2040938, 2248049, 2600993, 2828687, 3039641, 3157766, 3338449, 3542286, 3808423, 4102395, 4363921, 4630069, 5057622, 5470241, 5959833, 6572319, 7457251, 8534764, 10048514, 11963998, 14011277, 16230667, 18699390, 21381969, 24302416, 28013581, 33151986, 40386546, 51195938, 68439782, 96798096, 141826084, 203195920, 264915776, 316644628, 363525740, 386995944, 366009283]
13931C66009283m0588453m5172269n8286602n7676422m0277784k4818510j5628687
13924H3560556j0591973p712564n793261m559199l831951l366505l044496k850214
13916D1810393k661271k208489j939913j743274j767033j812527j512049j308191
13908B6857646j020520r88645q05844q05182p32653p18569p38700o39456q20152
13899A9587925p93167o73311n57983n43351m86045m84444m60836m39612m14660
13890A4734516l40290m08832k16854l18333m67927k96560j74104l30927k80348
13881A1900341l91081m37804k80370j66884k33719j90585k88724l91158l26831
13872I193185j57919k20062j55585k82044l15213q9668r8403j29404j85258k05242
$$ y = [366009283, 325420830, 280248561, 221961959, 164285537, 124007753, 99189243, 83560556, 72968583, 65256019, 59462758, 54903559, 51071608, 47705103, 44660607, 41810393, 39149122, 36940633, 35000720, 33257446, 31490413, 29677886, 28165837, 26857646, 25837126, 24848481, 24042637, 23237455, 22504802, 21786233, 21047533, 20408077, 19587925, 18794758, 18121447, 17563464, 17020113, 16534068, 16049624, 15588788, 15149176, 14734516, 14394226, 13985394, 13768540, 13450207, 12982280, 12685720, 12511616, 12180689, 11900341, 11509260, 11071456, 10791086, 10624202, 10390483, 10199898, 9911174, 9520016, 9193185, 9035266, 8815204, 8659619, 8377575, 8062362, 7972694, 7874291, 7744887, 7559629, 7354387]
13862G354387k118j16969l2030q5266k03698k03314k12637j93556j74966j30940
13852E998893p4646j20050j67531j82265j16361P4469k9299j66256j54538j81773
13842D880643j45650j18677l5931n6592k3150j53909p7715k15867o5933j52139
13832C835080j51380m7121l1064j09582j57076j02355N330Q068o4901m1900j09986
13821C033113j50918p2629j3526o5745j46909j35550l6142M2096J14557J7765
13811B586112j01282M9150R3863j7218k4043K8396R6610q7808r0126n5721j09721
13800B368212o5460k6116p2607n9634j4691m557j26094r0181K8153o3562j9983
13789A853480j2429j39604j7915k1905p2278L7453j0905m3382j52753j60221k227
$$ y = [7354387, 7352269, 7235300, 7203270, 7118004, 6914306, 6710992, 6498355, 6304799, 6129833, 5998893, 5924247, 5804197, 5636666, 5454401, 5338040, 5412509, 5383210, 5216954, 5062416, 4880643, 4734993, 4616316, 4580385, 4523793, 4500643, 4346734, 4269019, 4053152, 3987219, 3835080, 3683700, 3636579, 3605515, 3495933, 3338857, 3236502, 3241832, 3249900, 3184999, 3143099, 3033113, 2882195, 2809566, 2796040, 2730295, 2583386, 2447836, 2411694, 2453790, 2568347, 2586112, 2484830, 2533980, 2627843, 2610625, 2586582, 2614978, 2711588, 2623780, 2533654, 2477933, 2368212, 2302752, 2276636, 2204029, 2144395, 2129704, 2125147, 1999053, 1908872, 1937025, 1873463, 1853480, 1841051, 1701447, 1683532, 1661627, 1589349, 1626802, 1615897, 1572515, 1419762, 1259541, 1257314]
13778A257314j161n0800N1718m265O1734M1760j71468k4657K8712M4156M5642
13767A278685j39523n2133k2325N3160L2433j14859p9236j26267n7376J7815L5229
13756H25603j0945Q4253L2504L5361R4457k9559j14332n7291j1566O0417J5328
13745I24230K1560J29969q1198j04810J6151K4234m9613m3746l2810m9050l1827
13734G23090O546r2684Q34P0440Q5794M5555J6189N8605L2643l4878n1442r668
13722H51024l4131j2824O7753K0618p3159j04093j12946M5306o7191k0601M1176
13711F00932l1084l0614j41240j46687J28953K45130m8955M5691m1737m4271l302
13700E32816j9064l1412j35830j28209L8495R3370k7781l9090M4065N2035J2011
$$ y = [1257314, 1256153, 1205353, 1257071, 1252806, 1314540, 1356300, 1184832, 1160175, 1188887, 1233043, 1278685, 1139162, 1087029, 1064704, 1117864, 1150297, 1035438, 956202, 829935, 772559, 790374, 825603, 814658, 898911, 931415, 966776, 1061233, 1031674, 917342, 860051, 848485, 908902, 924230, 945790, 1075759, 994561, 889751, 905902, 930136, 880523, 836777, 803967, 754917, 723090, 729636, 636952, 637786, 708226, 794020, 839575, 855764, 914369, 947012, 912134, 860692, 851024, 816893, 804069, 871822, 892440, 819281, 715188, 602242, 647548, 580357, 559756, 600932, 569848, 539234, 397994, 251307, 380260, 625390, 576435, 622126, 580389, 536118, 532816, 513752, 482340, 346510, 218301, 256796, 350166, 322385, 283295, 327360, 379395, 391406]
13689C91406K3457j2068o1985P4653P6627p3459j16169n6986K6918j603l3020
13678B37771n4822O887N5920K3474L4356k2055L7453J5510K6746q8948j03606
13667A68686M3371P9072K491J4061J3803K8238L0925r7893j4093O0085p7785o8992
13655A81969J9578K2514j12662k4195N1182O894k2213J37265K8253q973J925Q5718
13643C67255L3144o921J20700n9736l3161p3622k1761m2043P752P1004o0504M2294
13631C44401o5602m3049L7215R9143P220m4367l3395q2849Q8965k9087j16148
13620A62447j01014p2045q6088K8443P3071Q0103o5148q7056k5936Q2218J44679
13609A33674J103p7336O0950J3365l4228o8118M6272n9457Q9054M7739L9358q4120
$$ y = [391406, 414863, 402795, 340810, 415463, 492090, 418631, 302462, 245476, 272394, 270791, 237771, 182949, 189836, 245756, 269230, 303586, 281531, 318984, 334494, 361240, 272292, 168686, 212057, 291129, 293620, 307681, 321484, 349722, 380647, 282754, 268661, 328746, 250961, 181969, 201547, 224061, 111399, 87204, 138386, 145280, 123067, 260332, 288585, 279612, 281537, 367255, 400399, 393478, 514178, 454442, 421281, 347659, 325898, 283855, 291607, 362611, 302107, 344401, 278799, 235750, 272965, 372108, 379328, 334961, 301566, 218717, 307682, 278595, 162447, 61433, -10612, -96700, -68257, 4814, 84917, 19769, -67287, -93223, -11005, 133674, 134777, 57441, 118391, 131756, 97528, 29410, 75682, 16225, 105279, 153018, 192376, 108256]
13597A08256j31737k8319N5525p4869N0232m8200Q7123J10316K2688j07228j00313
13586e6526j0832m3511K5427P1514Q7159l3617o0957J6641J1594k9724j2759J4345
13574b1246J04543J54517p836q5370k6203j762J11356K983j19780k2750O6041
13563A54493m2998j01335P8232O2379L8690O0070l0226j1485r8207q1607q7412
13552e9406O0818r5709M3105J4956L36J9089J10897N6109q8231j55315l8919J29675
13540b595J8935q2941j04527l3123J33226P7461J08176O9378j02900M4161J06839
13529B32090K2673r4329o9011l9645J37536N8185K8208M5208R6522q5766l9440
13518B92231j4324q4545j25188q8503R2662K889L8435L2292q7995O2786J02877
$$ y = [108256, -23481, -51800, 3725, -71144, -20912, -69112, 18011, 128327, 151015, 43787, -56526, -67358, -110869, -85442, -13928, 73231, 39614, -21343, -4702, 6892, -22832, -35591, -21246, 83297, 237814, 229978, 144608, 118405, 116643, 227999, 230982, 111202, 88452, 154493, 111495, 10160, 88392, 150771, 189461, 249531, 219305, 207820, 109613, 28006, -59406, 1412, -94297, -51192, -36236, -35900, -16811, 94086, 150195, 61964, -93351, -132270, -2595, 16340, -66601, -171128, -204251, -71025, 6436, 114612, 183990, 81090, 125251, 232090, 254763, 160434, 91423, 51778, 189314, 247499, 275707, 320915, 417437, 331671, 292231, 277907, 193362, 68174, -20329, 72333, 75222, 113657, 145949, 57954, 120740, 223617]
13507B23617j66371r6995L791m7044p6664J24784J28231l9500n8359O1222j01568
13496d4856l2200M4542L1607L0094L072J391M1191k5154j10529J20399m8892n7200
13484d6535J01082k5057j16665K1709j730n2133Q284p3838N5695J12929j0273
13473b6532R822m1376L6590R9069N4374J7495O829N1920j32995j7564Q3178r6257
13461D4553r9264l7674j4696L1330L099J44070J49357R7217M6686j12189l8036
13450B14453R6789L6045m806L4224J80884K21147K94983K54828J99460K29547
13440A757554K6455P6440j27533k61810j80505k14208k10249j69001j81521j56292
13430C59330o9104j34026k5472L35N3079Q7199j2308m4895k6137o6793Q2067J12532
$$ y = [223617, 57246, -39749, -35958, -83002, -159666, -34882, 93349, 53849, -4510, 56712, -44856, -77056, -32514, -907, 29187, 32259, 33650, 74841, 49687, -60842, 59557, 10665, -46535, 54547, 29490, -87175, -65466, -67196, -119329, -111045, -184883, -129188, -16259, -26532, -16710, -58086, -21496, 77573, 131947, 149442, 156271, 208191, 75196, 57632, 140810, 44553, -54711, -92385, -107081, -75751, -72652, 71418, 220775, 317992, 364678, 252489, 214453, 311242, 347287, 342481, 376705, 557589, 778736, 1073719, 1328547, 1528007, 1757554, 1784009, 1860449, 1732916, 1471106, 1290601, 1076393, 866144, 697143, 515622, 359330, 290226, 156200, 130728, 131063, 184142, 271341, 259033, 214138, 188001, 121208, 203275, 315807]
13418C15807m9089p0508j09954O4404K7156l9064p5313P1284L6434K0321o6797
13407A24681K4005J34119Q7073m7557j23189O737j6536j32170k7566r763J35395
13396A55229l3352m3350j1311p0916j18609J03009M4594K1833K1484j4404n2208
13385A999Q3767J6227j189j66798j27310Q7404J44223M6105n5322O2883Q419k1428
13373G8980j1236k882K3654N5801K3334n3280j1076J8691k1609j28362j21140
13362a49125R8266O167k413N9690M4744N315P1311q1843L4998k0610M2079O266
13350A14845J4230J59163m6885r2039j3245j2556p0315j31151n3447J5258J59549
13339D3407J9303R8191N008l0169J6560J4669N478l1328p7104k8009j8190M002
$$ y = [315807, 266718, 196210, 86256, 150660, 177816, 138752, 63439, 134723, 171157, 191478, 124681, 148686, 282805, 369878, 322321, 199132, 205869, 189333, 57163, 29597, 19834, 155229, 121877, 78527, 67216, -3700, -122309, -19300, 25294, 47127, 68611, 54207, 1999, 85766, 101993, 100804, -65994, -193304, -105900, 38323, 84428, 29106, 91989, 100408, 78980, 67744, 64862, 88516, 144317, 167651, 114371, 103295, 121986, 100377, -27985, -149125, -50859, -44692, -47105, 12585, 57329, 62644, 133955, 52112, 87110, 66500, 108579, 114845, 129075, 288238, 241353, 149314, 136069, 123513, 53198, -77953, -131400, -116142, 43407, 62710, 160901, 165909, 135740, 152300, 166969, 172447, 141119, 64015, 36006, 17816, 21818]
13327B1818M8676J0085r4852J6411J74001R9013j3252K1639m7246j39764q9453
13316G076l8556l374m0166k4732N3197P1022M4726J8075p988K5011R5800Q5454
13304B85545R133k0708j33269j3291P8002o136l1406k4662r1105Q7247K6303K5975
13292A91628j34657r8187J1244O8408n1252k4732L8152O9016R5228J37789q8042
13281B14595p215O0671j57722j45435O5650m720l9155M9273o5460N929l5886n812
13269f5287J26977J4127M7301j10728o6575l9814o581n3426L5232J3749J44910
13258C9885N4138q5350N2028N758K7803r2368l4242j1988P3050O1489q170j20227
13246c8194r1798l999J08863l3433k3250J7545j04945N4415l9540Q2096M879L812
$$ y = [21818, 70494, 80579, -14273, 2138, 176139, 275152, 261900, 283539, 236293, 96529, 7076, -31480, -34854, -75020, -99752, -46555, 24467, 69193, 87268, 79280, 104291, 200091, 285545, 294678, 273970, 140701, 127410, 205412, 199276, 167870, 143208, 52103, 139350, 165653, 191628, 56971, -41216, -29972, 38436, -12816, -37548, 604, 69620, 164848, 302637, 214595, 207380, 268051, 110329, -35106, 30544, 25824, -13331, 35942, -29518, -23589, -59475, -65287, 61690, 75817, 123118, 12390, -54185, -93999, -100580, -154006, -118774, -105025, 39885, 94023, 8673, 60701, 66459, 94262, 1894, -32348, -44336, 28714, 90203, 82033, -38194, -129992, -133991, -25128, -58561, -81811, -64266, -169211, -114796, -154336, -72240, -67361, -63549]
13234f3549k5489j4958M840k7256k2272J64463J86317j08220j63967P612k195
13223f4674L5933J26191M5734L6362K8745o0753o9377P1470M7994o3514j4289
13212A19822r6057O5752N9990l5687p7112J7569N4827R3898O2328r1972j64966
13201H392k4886J16454M775O0043N9950O38O1634n7983P0880P9138r2554j01395
13189A85086p1711J1557q6737j19717l2373J6711N5265m1759R9848J50077k3112
13178A43135r4199k9210O2455L9732j28293k4265P9391J05263l8954j41230k471
13167b8646N1640M496o5403l7687m1068J09411M7612q9163r031q6274j2237P543
13155a48807K7030M5162J21857M56J43645n6509r6904K9579k923O1151j4789p6587
$$ y = [-63549, -89038, -103996, -99156, -126412, -148684, 15779, 202096, 93876, -70091, -62479, -64674, -28741, 97450, 143184, 179546, 208291, 147538, 78161, 149631, 197625, 134111, 119822, 23765, 89517, 149507, 113820, 36708, 54277, 109104, 203002, 265330, 173358, 8392, -16494, 99960, 104735, 164778, 224728, 225366, 287000, 229017, 299897, 379035, 286481, 185086, 113375, 124932, 38195, -81522, -113895, -97184, -41919, -83678, 16170, 166247, 143135, 48936, 19726, 82181, 121913, -6380, -30645, 48746, 154009, 115055, -26175, -28646, 22994, 27490, -37913, -75600, -116668, -7257, 40355, -48808, -57839, -144113, -156350, -148807, -121777, -76615, 45242, 45698, 189343, 132834, 35930, 65509, 62586, 123737, 108948, 32361]
13143C2361j09228r0498m8628l6792Q8477J349K5513K8526j8763Q9843P1149P084
13131D0393l947r7353j04757M476K3050l5994q1773R1778J27503O1598o1604n1705
13119h8335l2659n7966k014J42613P6937J12302K1910j50485j71523j0316K277
13108a57259K4951R5948J0906p6405l6713J8019o478m6134j1572J1409L0063R259
13096a34006K8753J5072M272O3019Q3893q6429j22314r6109P9869P2295J4472
13085g7213L4978q4124Q2693N2149K1942Q4942J52328P7306j58933k0427J12454
13074B78095j2959J5542j5962j03816j21784O1815L2314J5425p6523p8974p872
13063a4699J9981R4359K2983o5965j15663r6746L2801p4724J6932O1643M7816
$$ y = [32361, -76867, -167365, -215993, -252785, -164308, -162959, -137446, -108920, -127683, -37840, 33309, 40393, 36446, -60907, -165664, -161188, -138138, -174132, -255905, -164127, -36624, 24974, -36630, -88335, -120994, -178960, -180974, -38361, 38576, 150878, 172788, 22303, -149220, -159536, -157259, -132308, -36360, -25454, -101859, -138572, -120553, -127031, -173165, -184737, -173328, -143265, -134006, -105253, -90181, -85909, -22890, 61003, -25426, -147740, -243849, -163980, -91685, -77213, -42235, -126359, -43666, 8483, 30425, 115367, 267695, 345001, 186068, 165641, 278095, 265136, 280678, 264716, 160900, 39116, 100931, 133245, 148670, 72147, -6827, -14699, 5282, 99641, 122624, 56659, -59004, -155750, -122949, -197673, -180741, -119098, -71282]
13052g1282P6J678j8707P2281R1045j0707j09746m377N2595q7984J4969J2774
13040e7385Q9823l5197j22651O9964l761j14836Q1677Q1661R0774j56635q43r0637
13028a68046p1533J3419j4717J20519Q5601l0464J52866m7260j51462n228N5726
13017f0579n872j34702J06191R3284N6758K4950K7121l6952j25934o1965l714
13006a21414K4330P0088N194K2187M9832p8146m2335m1455m4179L4495J79398
12995E7995j5534j59710Q1115J7942m2673J7639O4270k9145O1879r927p4935l8174
12983f9258q3894Q0310l501q7029J36451O2042p8201o2754M2606J06670R0526
12972A33968j5521n3984n5514r0402J19914N0126L408l8330j48291l9524N8914
$$ y = [-71282, -71206, -69528, -88235, -15954, 75091, 64384, -45362, -49739, 2856, -85128, -70159, -57385, 32438, -2759, -125410, -55446, -59207, -174043, -92366, -10705, 80069, -76566, -77409, -168046, -239579, -226160, -240877, -120358, -34757, -65221, 87645, 40385, -111077, -116305, -60579, -66451, -201153, -94962, -1678, 55080, 80030, 107151, 70199, -55735, -117700, -121414, -97084, -26996, -21802, 385, 50217, -27929, -70264, -111719, -155898, -121403, 57995, 42461, -117249, -36134, -18192, -60865, -43226, 21044, -8101, 53778, 43851, -31084, -69258, -153152, -72842, -76343, -163372, -26921, 35121, -43080, -105834, -63228, 43442, 133968, 118447, 64463, 8949, -81453, 38461, 88587, 91995, 53665, -94626, -134150, -75236]
12961g5236r7868o1828J30714J75725L4755j10083n6340O4514K1232J34891J37061
12950B97537n8551j13590j2524J0608K6024m3037J3585k0898n7968k6617R2731
12939A07300j6444q8606j19111j09620R4484J29602K70662L6125j51022j23331
12929C0039K096p4927l4447K4132Q1537N1650J9263J8563Q212j74944K8835K8937
12917H946k2192l4610k0789J56157K12517j27069j09893o7182R1645o674p8950
12906A906L5415j3051o8806J28529O6160l3279m4470n659J1290j6866j938k8468
12894C0763J0267j0655o4101K7377M2889n6021J00890j7726m5427j0307m1595
12883c3646p2173r227K791R7580O5469q6263K0642r928P0281l384m4098k6243
$$ y = [-75236, -173104, -234932, -104218, 71507, 106262, -3821, -60161, 4353, 25585, 160476, 297537, 238986, 125396, 112872, 123480, 149504, 106467, 120052, 99154, 41186, 14569, 107300, 90856, 2250, -116861, -226481, -131997, -2395, 268267, 304392, 153370, 30039, 32135, -42792, -77239, -53107, 28430, 80080, 99343, 117906, 126118, -48826, -19991, 8946, -13246, -47856, -68645, 87512, 300029, 172960, 63067, -4115, 87530, 80856, 1906, 37321, 24270, -44536, 83993, 150153, 116874, 72404, 66745, 78035, 61169, 59231, 30763, 41030, 30375, -33726, -6349, 36540, -19481, 81409, 63683, 18256, 7949, -33646, -105819, -115046, -112255, -14675, 50794, -35469, -14827, -24755, 45526, 42142, -1956, -28199]
12871b8199m433l3469P5994N9742N6635k6795R3142J2736j25789j26296m7349
12860i4081p7527m6973K4056M1594R971L1281Q4883K1912m625p1405j66096N2335
12848a94675J11551N9540J01661N888l6268J6209l8801p2878K2978j2874L9379
12837A710M9466o4957j47668k4097J48845N3503m0101n1452N207J6151J4797L0794
12825g802O4374O0335j1148j65184j43332Q6202J43238k8334m7253R293j8157
12814e7768q6787J662R7287o7261K9673L5488J15898k1785j36345q1793n5106
12803b26837J6238K2739J68024Q2777L9249J3165L1097j20035j83400j11672K917
12792b65738J13755r472N8591n2762j02181J42732L7096m9227J11511l0596l6378
$$ y = [-28199, -32632, -66101, 9893, 69635, 126270, 99475, 192617, 205353, 79564, -46732, -94081, -171608, -218581, -194525, -152931, -142960, -111679, -26796, -4884, -9509, -80914, -247010, -194675, -83124, -23584, 78077, 83965, 47697, 63906, 25105, -47773, -24795, -37669, 1710, 51176, -13781, -161449, -185546, -36701, 16802, -23299, -74751, -69544, -53393, -38596, -7802, 56572, 116907, 105759, -59425, -202757, -116555, 26683, -1651, -48904, -39611, -57768, -144555, -142893, -45606, -112867, -83194, -47706, 68192, 46407, -89938, -171731, -226837, -210599, -187860, -19836, 62941, 102190, 115355, 146452, 26417, -156983, -268655, -265738, -151983, -161455, -102864, -155626, -257807, -115075, -77979, -127206, -15695, -46291, -82669]
12781h2669Q8532L5541K95q0318j56828J3933J20423Q0629j5298o2685n7997J16194
12769b48K4130q191k2264m3439n5211L0894O7495l9906o7881q4354j2187J30727
12757h0435j4810j05066P5938N0487K6476Q656K009Q4452r3630m7634j19658J54215
12745e9000j2904r9611M7747L2324o9396p4841R079k5789J7098Q6161N7819m9329
12733a40642J28865J30393J06674k4449p4929l7549n4032j18632n5782R3064Q0516
12722C3497Q9940N4977m5344j96480j52337o6939P9032K60247k1032j02564J7821
12711d9182r4933j0323N4273J16051J0983q5969R2219J12285R9471O4710k8189
12700B81396m8828k43844j07360P5159j52921j30233O6017J46969j03256P3727
$$ y = [-82669, 5863, 41404, 41699, -38619, -195447, -181514, -61091, 19538, 4240, -58445, -116442, -248, 23882, 15691, -6573, -50012, -105223, -74329, -6834, -46740, -114621, -198975, -211162, -80435, -95245, -200311, -124373, -73886, -47410, -38754, -36745, 47707, -45923, -93557, -213215, -59000, -71904, -171515, -123768, -91444, -160840, -235681, -226602, -252391, -235293, -149132, -91313, -140642, -11777, 118616, 225290, 200841, 125912, 88363, 34331, -84301, -140083, -47019, 33497, 123437, 178414, 133070, -63410, -215747, -282686, -203654, 56593, 35561, -67003, -49182, -144115, -154438, -100165, 15886, 26869, -59100, 33119, 145404, 244875, 309585, 281396, 232568, -11276, -118636, -43477, -196398, -326631, -260614, -113645, -216901, -143174]
12690a43174M3706j4178k9275l9945R4371J3967J2655M260M067L4588L5904O8221
12678H5167O2537l7184l1004M2953l519j8594j30476n212J61280N2849m2555j21122
12666A5120o7903j7394r1196l4040J54992J04556M245n6269q840L0119j34328
12655a00938o1246J89270J23088m7579q2133o4957M9967J90855O0273n6349j12275
12644H7976k5441P8284p2047j26733n811q3357l2417M8191n3107J767P9218R2409
12632a1068L0030q4765j62747o6895J04385L8955R5190J50694J19769p7928l3293
12621A02327Q2524P0042p611j38818j46373r7507o085k4684J9478J07320m367
12610d3754O2530L245j16512K6772j5087j79388l5585J13518K17097k4987p2190
$$ y = [-143174, -99468, -113646, -142921, -182866, -88495, -74528, -61873, -57613, -53546, -18958, 16946, 85167, 147704, 110520, 79516, 122469, 118950, 100356, -30120, -35332, 125948, 178797, 136242, 15120, -52783, -70177, -161373, -195413, -40421, 64135, 68380, 12111, 3271, 33390, -100938, -162184, 27086, 150174, 102595, 20462, -44495, 5472, 196327, 256600, 200251, 87976, 62535, 140819, 68772, -57961, -63772, -147129, -179546, -131355, -184462, -182695, -103477, -11068, 18962, -65803, -228550, -295445, -191060, -152105, -56915, 93779, 213548, 135620, 102327, 184851, 254893, 247282, 108464, -37909, -135416, -141501, -166185, -146707, -39387, -43754, 18776, 22021, -94491, -67719, -82806, -262194, -297779, -184261, 32836, 7849, -64341]
12599f4341L734N7970j4519J1855l020L2198r4386Q196M8021l9753p1210k9324
12587a54579L750q0183j03908J22937J20322l6047m9635k76J21943J23819J09265
12576A77408o7413n6026Q3096j3253L6165j61585j52772j2745o266j43793L4094
12565b83090O3684m4255K0689J18965Q4523K5065m8135M0895O5328R6863p2882
12554F7650l1299q208j6211n8945l1344l8973P2913N5980P7539O7179n1740q2227
12542B2314o8747o546j35378k513K5289J06170P8107n2063r1981j0035O6822P8465
12530I904l5271Q6767P571k63279r903L820K3697J5204N7087M0194k9015K3864
12518f9360L0655L900K3875j16973j34770J30130J06531K0128R1418q0080k5649
$$ y = [-64341, -60607, -2637, -17156, -5301, -8321, 23877, -70509, -62313, -14292, -54045, -125255, -154579, -150829, -231012, -334920, -211983, -91661, -127708, -177343, -177619, -55676, 68143, 177408, 109995, 53969, 137065, 123812, 159977, -1608, -154380, -167125, -173391, -317184, -283090, -219406, -263661, -242972, -124007, -39484, -14419, -62554, -21659, 43669, 140532, 67650, 36351, 28143, 11932, -47013, -78357, -117330, -44417, 11563, 89102, 156281, 104541, 22314, -46433, -52979, -188357, -190870, -165581, -59411, 18696, -33367, -125348, -135383, -68561, 9904, -25367, 61400, 68971, -194308, -204211, -200391, -176694, -161490, -104403, -64209, -93224, -69360, -38705, -34805, -10930, -127903, -262673, -132543, -26012, -5884, 85534, 5454, -20195]
12507b0195n7314K4346Q8803K2948k8796l5920m1186L62O8773J6753P3921R603
12495A22098m7352J150J29159q7656l0013j27792r1330L71N7622o3553K877j1367
12483a45786M9741J819J5451R6524P4634j13168j7506K7723L3254J9392L3629
12472G5707l5588p1586r1870R1458O7033m5350M6715K7068L5372j0114Q455l3969
12460F3331J1370j40227m8739N791R3926p293m7285j19630N2516K1089j3532j08340
12448b37023J0270J37240R185j3944P9271P3194n0585j21743J1098M7084K0074
12437c5879l9980R1937j3183Q1038J11516l3540j939j3530q1594j03608o5100
12426a03862Q7478M440k7379M4301J1926j9346j88167q2155N5282J23424J45564
$$ y = [-20195, -77509, -53163, 35640, 58588, 29792, -6128, -47314, -46952, 21821, 38574, 112495, 122098, 74746, 75896, 205055, 117399, 87386, -40406, -131736, -131365, -73743, -137296, -134419, -145786, -96045, -94226, -78775, 17749, 92383, -20785, -38291, -10568, 22686, 42078, 75707, 40119, -31467, -123337, -31879, 35154, -10196, 36519, 63587, 98959, 88845, 97300, 63331, 74701, -65526, -114265, -108474, -14548, -21841, -69126, -188756, -136240, -115151, -128683, -237023, -226753, -89513, -80328, -94272, -15001, 58193, 7608, -114135, -103037, -55953, -35879, -75859, 16078, 2895, 83933, 195449, 161909, 159970, 146440, 64846, -38762, -103862, -16384, -11944, -39323, 4978, 16904, -2442, -190609, -272764, -217482, -94058, 51506]
12415E1506L1450r5910n3055R6379l8765l1986k129J7132K3719j6928r03O6635
12403D7145J24609K4836n2031o3495j32763j06039L3844k3678L798J34441O471
12392b862q8001N0014J35104k1810j786j03688j3994m2666L5055m0981J84774
12381H9159O2585j66043r6433r3877R8280J07515N3009K1228J5179k26933J9976
12370a16355J72484k2882j32465P4882L6125N2424R1782n1867q0999q9901M8640
12359a8132K6515q8373l2808n8819l0705O8293O3554k5068J1685r8132m1788O3265
12347a60513J02702N1139k8253K5582l4130k08988j07614n3568Q5930J06754m2542
12336b63501L8363P2775k6560J76233K7900j84126o6035Q5955J26391m7396p1030
$$ y = [51506, 82956, -12954, -66009, 30370, -8395, -40381, -42510, -25378, -1659, -18587, -19490, 47145, 171754, 196590, 144559, 81064, -51699, -157738, -123894, -147572, -143774, -9333, -2862, -90863, -40849, 94255, 72445, 70659, -33029, -47023, -89689, -54634, -95615, 89159, 151744, -14299, -110732, -204609, -106329, 1186, 54195, 75423, 90602, -136331, -116355, 56129, 33247, -99218, -24336, 11789, 64213, 155995, 104128, 23129, -66772, -18132, 8383, -79990, -112798, -171617, -202322, -134029, -70475, -95543, -83858, -181990, -223778, -160513, -57811, -6672, -34925, -9343, -43473, -252461, -360075, -413643, -327713, -220959, -263501, -225138, -152363, -178923, -2690, 25210, -158916, -224951, -138996, -12605, -60001, -131031]
12325a31031J50307J30258p5188n1180k7171l6434J3327J7702M0886k1979q3787
12314g4290N5523n0208o4028k5641P0400O6239K2194o06r0595J4735K8355J12926
12302F5004J86538j0747j02427j04483o1281O844j37168m4846N6938k9222L0900
12291a43950L4486N6878j11696J28j6053o2237J29452J65122O1812m2332p8235
12280f625l8961r3909j09972m9294J8596J13854J35689M4421r4863p109J5638
12269g2535P6749J9305l4335L5844N0354L5514j13649n2597j3678Q0567L5646
12258D7185j32146l6741J03938K9734j0096l296M1858k8755r6000k7351j06659
12247b18329N5512J02055K9395R363Q6368Q77L7536p5666M365m9288m7946o2883
$$ y = [-131031, 19276, 149534, 74346, 23166, -4005, -40439, -27112, -9410, 31476, 9497, -74290, -18767, -68975, -133003, -158644, -88244, -22005, 189, -417, -91012, -76277, -47922, 65004, 251542, 240795, 138368, 33885, -27396, -20552, -157720, -202566, -145628, -174850, -143950, -109464, -52586, -164282, -164154, -180207, -242444, -112992, 52130, 113942, 71610, -6625, -45586, -139495, -249467, -298761, -280165, -166311, -30622, 13799, -81064, -88173, -72535, 4214, 23519, -10816, 25028, 75382, 110896, -2753, -55350, -69028, 11539, 47185, -84961, -121702, -17764, 11970, 1874, -1422, 40436, 11681, -84319, -111670, -218329, -162817, -60762, -31367, -22004, 64364, 65241, 102777, 27111, 31476, -17812, -65758, -128641]
12235a28641j9005O1973K6121J7265q728P47q4988j01691N562J68197J65586J76498
12223B78896n8780j15737j39613j1491q763m2265m0629R4590J04951k0483M3442
12212H4118M5428j28566k5848Q011J15677J23707j30665j23726p1366r4665O4714
12201a33181R4474k8723j04460R9592J8243J3569L0796j29427M6950J37340P1716
12190A16889l5230q9081P9016j1284l4382J84813K0912j01126p6925J2860J36585
12179B03047J29781p7666m2329k1095k289l3925L690k7390l8648J9210J2130J3874
12167A38390m5110o9390L594R9774q5254o6045k7629J68206L9260n655l2160q4731
12155C3250n9605L7523Q818k1669j61315n3722J9347K8849M8083J0827O656j8575
$$ y = [-128641, -147646, -85673, -59552, -42287, -51015, -50268, -135256, -236947, -231385, -63188, 102398, 278896, 220116, 104379, -35234, -46725, -55488, -97753, -138382, -43792, 61159, 40676, 84118, 129546, 980, -24868, -16857, 98820, 222527, 91862, -31864, -103230, -197895, -133181, -38707, -67430, -171890, -72298, -54055, -40486, -9690, -139117, -92167, 45173, 116889, 81659, -7422, 71594, 60310, 25928, 210741, 231653, 130527, 53602, 66462, 203047, 332828, 255162, 212833, 191738, 189449, 155524, 159214, 131824, 93176, 112386, 124516, 138390, 93280, 23890, 27484, 127258, 42004, -24041, -51670, 116536, 155796, 150141, 117981, 33250, -26355, 11168, 19986, -1683, -162998, -216720, -197373, -168524, -120441, -109614, -102958, -121533]
12143a21533o9962l7563J53168P1840N495Q751O8367m1011J32346P7374q898k4058
12131B14316l8054m637j3527o7963o8530J115q5914k7840J49972J93320j36019
12120A16239j48928P4151R8190M290n4795P4776j12423l5280J39159k2445m6164
12109H6770n6121l0744N3278M6670N1701M0354J68292l3599j06376J596m3027
12098A78794j3296m5153j9519N5307k4620q8665j40645j5569K3780N4441Q6563
12087E1418L071q2824J4013Q130J0344o4217j09017k9878N6986J03450l5772p3522
12075a47818m6341J16554K23467O7635j66657j31488O404K1113o824J45241n2803
12064B8483o0178q3756K9379P9349Q1551j7401k8061l1303K2041J4869O2696p9905
$$ y = [-121533, -191495, -229058, -75890, -4050, 1445, 10196, 78563, 37552, 169898, 247272, 238374, 214316, 176262, 171625, 158098, 90135, 21605, 22720, -63194, -91034, 58938, 252258, 116239, -32689, 41462, 139652, 143942, 89147, 163923, 51500, 16220, 155379, 132934, 86770, 30649, -95, 53183, 99853, 151554, 191908, 360200, 326601, 220225, 221821, 178794, 165498, 120345, 100826, 156133, 131513, 42848, -97797, -113366, -89586, -35145, 51418, 54489, -28335, -14322, -6192, 4152, -60065, -169082, -198960, -141974, -38524, -74296, -147818, -194159, -77605, 145862, 213497, 46840, -84648, -78244, -57131, -63955, 81286, 28483, -31695, -115451, -86072, -6723, 74828, 57427, 29366, -1937, 20104, 34973, 97669, 17764]
12052A7764j3065m797l3318p3495n780L8311L1927l8560j22716o9705J06099k0647
12040a87982M3469N2407J20626j51743q9663O4208J51077M6559o9912M9841n2220
12029b3333P1275J39103k1690l7071q856j08777J6913n5430k3595l6252j9973
12018a07686M2157o3917K8556J41412J3217P5098J9766p5914m8948J42841J45809
12007C12391n6380j32166L9291j08305j55322O1772N4729j19131r9561m8355L7889
11996b13148M6648J7214K2882J48800J09247m3747n5664j27175L9858R7283k1280
11985B0918K270J17099Q1224n7285K4416o4214q2643r0471o8398l5754p9183Q926
11973b23095P0618L2026j2871P5631j6478P3727O1797o2887j2197J01304J04056
$$ y = [17764, 4699, -98, -33416, -106911, -112691, -74380, -42453, -81013, -203729, -273434, -167335, -187982, -144513, -92106, 28520, -123223, -212886, -148678, 2399, 48958, -20954, 28887, -23333, 47942, 187045, 165355, 128284, 119428, 10651, 27564, -27866, -51461, -87713, -107686, -65529, -129446, -100890, 40522, 53739, 128837, 148603, 72689, 23741, 166582, 312391, 256011, 123845, 163136, 54831, -100491, -38719, 16010, -103121, -202682, -251037, -213148, -166500, -149286, -126404, 22396, 131643, 87896, 32232, -94943, -55085, 42198, 20918, 23188, 140287, 221511, 164226, 188642, 124428, 41785, -48686, -117084, -152838, -232021, -223095, -152477, -120451, -133322, -57691, -74169, -442, 61355, -1532, -13729, 87575, 191631]
11962A91631n0937q5353K6909J3315M0215J53m1175j14495j51915j67220R4484
11951b44388K4785O739R5021J2393j37842n2105m3730R5325J02181k905R178j2161
11939a47509N8453O7156Q973Q7310p174p3180Q479L0355r6205j42988Q7581J55433
11927C6684p077L0245J01283N4424j2927r6053j36441m7036J03793J32581P1482
11916B30958j20812j00427L1753O3999J8127J13435q3144Q0116j04876l7694m7754
11905D3681q4345j6737N8314q3103k3345n328n1630J7512K2740k8630L2485l4641
11893a53027o978N7092J25370J7251l1019M1849j337L7254N2202r6762l607M7147
11881H5435L1906j39145j21644k9992M9005J39202N3359j41473j03995j03364
$$ y = [191631, 140694, 55341, 82250, 95565, 135780, 135933, 94758, -19737, -171652, -338872, -244388, -219603, -212864, -117843, -105450, -243292, -295397, -339127, -243802, -141621, -144526, -135348, -147509, -89056, -21900, -12927, 74383, 67209, -5971, 2508, 32863, -63342, -206330, -118749, 36684, 29607, 59852, 161135, 215559, 202632, 106579, -29862, -76898, 26895, 159476, 230958, 110146, 9719, 41472, 105471, 123598, 237033, 153889, 234005, 129129, 91435, 43681, -40664, -57401, 913, -82190, -105535, -110863, -162493, -144981, -122241, -150871, -118386, -153027, -160005, -102913, 22457, 39708, 8689, 50538, 49201, 86455, 138657, 41895, 38288, 85435, 117341, -21804, -143448, -173440, -124435, 14767, 68126, -73347, -177342, -280706]
11871b80706R029J13572m9044P0162M6971l4254J13776L1602j09579J2696J57563
11860H1788k1965L48r208m4908j3660k9569l2796P691k4146j37823j22865L7644
11848c09469K6801M6833K04049N4059m6020Q830N241O3976j54296j37080L3365
11837b03711J24274m3730p5743j3918O6963J44810N8964j02537n5659j0526j8987
11826a29800L0008P1792m5327j39180L4912R2085r4652M1223O9049J5776r9308
11815a53422M1621J7097O5961j7246q431o6547K6975R4462Q2859m8856p1072k7538
11803f4137L3574Q7632R3330n7673q0678q3358l2693J06542J28845P4857o8098
11792A38143p2823l0378j34620P2425j3648m9404R2134j06989j27853L0063P3578
$$ y = [-280706, -271677, -158105, -207149, -136987, -90016, -124270, -10494, 21108, -88471, -75775, 81788, 59823, 60171, 50963, 6055, -7605, -37174, -69970, -62279, -86425, -224248, -347113, -309469, -282668, -235835, -31786, 22273, -23747, -14917, -9676, 54300, -99996, -237076, -203711, -79437, -123167, -198910, -212828, -145865, -1055, 57909, -44628, -100287, -110813, -129800, -99792, -28000, -73327, -212507, -177595, -85510, -180162, -138939, -69890, -54114, -153422, -111801, -94704, -28743, -45989, -54420, -120967, -93992, 470, 83329, 34473, -36599, -64137, -30563, 57069, 150399, 92726, 12048, -71310, -104003, 2539, 131384, 206241, 138143, 65320, 34942, -99678, -27253, -40901, -90305, 1829, -105160, -233013, -202950, -129372]
11781a29372R5260N8217n5176K1589k1976M9332p5550j588J89385J02196r8989
11770A33328j43952p0444k4723k5451N1690K2152m2250M4106N1577J1434q5807
11759g8340r3467J03757J01425J0391L951q5022j1882J8449o239q184O0596O8619
11747H4054j15152L3575J93054K4432j42035m9095N4484k616O9760M9309k2812
11736A76958J00520R57j25172p0404o3233j65202P631R3904p4075J19350J11682
11725A12916M2190r435K4201r4657k3779P0250Q907P283Q2502j9041j19047j05299
11713b3009Q996r153N8779K3261M1750M5265k1001n4221p4742j18279J06494j3734
11701b9594L1236L9914P1764M021p9405l0975J61140K2588q690M5044j01127P4935
$$ y = [-129372, -34112, 24105, -31071, -9482, -31458, 17874, -57676, -59264, 130121, 232317, 133328, -10624, -81068, -105791, -131242, -79552, -57400, -99650, -55544, -3967, 7467, -78340, -171807, -68050, 33375, 43766, 47717, -37305, -49187, -30738, -36977, -45161, 15435, 84054, -31098, 2477, 195531, 219963, 77928, 28833, 83317, 80701, 150461, 199770, 176958, 277478, 278435, 153263, 82859, 19626, -145576, -137945, -44041, -118116, 1234, 112916, 155106, 145671, 169872, 75215, 51436, 121686, 130593, 137876, 220378, 201337, 82290, -23009, -14013, -23166, 35613, 58874, 100624, 145889, 124888, 70667, -4075, -122354, -15860, -29594, 1642, 41556, 113320, 117341, 37936, 6961, 168101, 190689, 181999, 227043, 125916, 200851]
11689B00851L2752j03659p3118j08918L6594J29646n2888k9877L8241l191N2475
11678A18908N8098L2347N7587j55982r6505j03822o7972M7377M9019J64995n7279
11667D6771j27252K512J05305m9564O3723R995J08552r3659k01255P3503j5346
11656g6715p667O5259j102O5790J61976J4773K1838K7356m2075o998j14782l0553
11644G7100l0584K5155P568o9910j18101k4624m864K8891o0013J1434M3444j10179
11632b24683n2369J26862J4694R0641Q9553r252J293P9037Q2000m8528n1787j94515
11620i7054L9092K26315p515j57028o0163n3716l01l2351p3999O5281Q6428P8207
11608A3196p635j2128O8126l7206k2605M3536J341p3352m9358M7095p9741j57308
$$ y = [200851, 233603, 129944, 56826, -52092, -15498, 114148, 61260, 31383, 69624, 66433, 118908, 177006, 209353, 266940, 110958, 14453, -89369, -157341, -109964, -60945, 104050, 46771, -80481, -77969, 27336, -22228, 41495, 51490, 160042, 66383, -134872, -61369, -76715, -84382, -19123, -20225, 45565, 207541, 222314, 244152, 271508, 229433, 222435, 107653, 77100, 46516, 71671, 79239, 9329, -108772, -133396, -138260, -109369, -169382, -157948, -114504, -224683, -277052, -150190, -135496, -44855, 44698, 35446, 36739, 115776, 197776, 149248, 97461, -97054, -57962, 168353, 160838, 3810, -56353, -110069, -110370, -142721, -216720, -151439, -65011, 13196, 5561, -6567, 61559, 24353, 1748, 45284, 46625, -26727, -76085, -28990, -108731, -266039]
11596b66039N2454l9687o1179R7251O8230k2825k5284P0234Q4236j8989k1814
11585h3412o194m9684K7405O6188Q569J18890K4379n2311r319k4817o6341j22424
11573a69071O4806J75736O197j5113L4180O1771j8542J3093J00066n8248J8485
11562B13360o0886q3986K0042o196m5916n1939j4030J04540m1277N2669L3814
11551A20195k2761j23891M051j3830j2990Q86r117M7783M0153j44961O0238M6554
11539g690O832l9500J2066l935o187n1558m9946K8386K9377J2438J05378j7028
11527A8633q4630j40560K4011N7132J65438J11342K6056n0970p6822L6963p6270
11516A0323j33277m5279P5186N8159j24972j8042N2457Q5858Q3189m7911m4347
$$ y = [-266039, -213585, -253272, -314451, -217200, -148970, -171795, -197079, -126845, -42609, -61598, -83412, -89606, -139290, -111885, -45697, -37128, 81762, 106141, 53830, 44511, 19694, -46647, -169071, -104265, 71471, 77668, 62555, 96735, 158506, 139964, 153057, 253123, 194875, 213360, 152474, 68488, 88530, 82334, 36418, -15521, -29551, 74989, 33712, 86381, 120195, 97434, -26457, -22406, -36236, -49226, -48340, -57457, -9674, 30479, -114482, -54244, -7690, -858, -40358, -28292, -32227, -38414, -89972, -139918, -111532, -82155, -69717, 35661, 18633, -65997, -206557, -182546, -125414, 40024, 151366, 177422, 126452, 49630, 86593, 10323, -122954, -168233, -93047, -34888, -159860, -177902, -125445, -39587, 43602, -4309, -48656]
11505d8656q97k5191K866N5542k5964j161K3894k0171P555r6870j59099n4732
11493c42884J38068J21859P0275r693J6214p6870m9601N5664J6595o3856j00536
11482b24765L1573P1187P5216J27875L137j38310j6452j1944J4827O4664k2555
11471b5547n372K5854l0841o7289k2195k5398j3599J13497L2059M4661M0058l0988
11459C4900J0977o7019r1497O2225l867j5736M247q9491P9438K198m0846K8444
11447h6027Q9392Q596k6491L6669K0550j31762M2393L9749M2944N9058r790K4828
11435A10109O2651n3224j49204K1526J90206j49732j24083q09L7109j30608L8493
11424a47566J2585N8692J82073N3658m2105l0692L5189q7833j32954M1212J5809
$$ y = [-48656, -49553, -74744, -71878, -16336, -42300, -43461, -19567, -39738, -32183, -129053, -288152, -342884, -204816, -82957, -12682, -22375, -6161, -83031, -132632, -76968, -60373, -124229, -224765, -193192, -122005, -46789, 81086, 84223, -54087, -70539, -82483, -67656, -2992, -25547, -30919, -5065, -35906, -103195, -125390, -150788, -164387, -50890, -18831, 25830, 65888, 34900, 45877, -21142, -112639, -50414, -54281, -70017, -65770, -155261, -75823, -73625, -114471, -86027, 3365, 11961, -14530, 22139, 42689, -89073, -46680, -6931, 36013, 95071, 85281, 110109, 172760, 119536, -29668, -8142, 182064, 32332, -91751, -92560, -55451, -186059, -147566, -134981, -76289, 105784, 159442, 117337, 86645, 121834, 34001, -98953, -57741, -41932]
11413d1932O0459j25j25215N1350R6635P2380K3358p4453l9642j11029o6312J8313
11401a36213R2665P1032j00365L6273l4840l6681p8924j3490M7253M2190K8059
11390h3041k6817m4924L9752R643J4903M9517O5444M0338j09159j37560k270L7309
11378a46865P4826J15472P885L5138r0173K4724k3749j23632L523L0185j3903
11367a06569J00694P736m0600P2828J04951O532j14404J6074J0012J27540l9850
11356A44944k5332p7107p0175P366O8574K3863n1287R2841l689j5983j09637l2328
11344d7950j6146k7211m2701J08365L1242j73454M2547J9774p5998N0475O248
11333a24809O3907J32782l7463l7769l7978N4849P0060r3500O6239j2810m8118
$$ y = [-41932, 18527, 18402, -106813, -55463, 41172, 113552, 136910, 62457, 22815, -88214, -154526, -136213, -43548, 27484, -72881, -36608, -71448, -108129, -187053, -200543, -153290, -111100, -83041, -109858, -154782, -115030, -105387, -90484, -40967, 24477, 64815, -44344, -181904, -184174, -146865, -72039, 43433, 51318, 86456, -3717, 21007, -2742, -126374, -122851, -92666, -106569, -5875, 1861, -38739, 34089, 139040, 145572, 31168, 47242, 57254, 184794, 144944, 119612, 42505, -27670, -20304, 48270, 72133, 20846, 113687, 109998, 94015, -15622, -47950, -64096, -91307, -134008, -25643, 5599, -167855, -125308, -105534, -181532, -131057, -124809, -60902, 71880, 34417, -3352, -41330, 13519, 83579, -9921, 56318, 43508, -4610]
11322d610k9219L9806j25024J3056j24532m5942M7268N9066P6564P7920J29438
11311A13791k6122j63044O3187m3747m9219n0722R5799M1832r92P064o9322n3767
11299a35262j29840m4060p759O0016P8068J14312J54056Q929o0529j26080Q0567
11288g582Q8055k6959j32933j52349R2068J42048R5510j2145n5128K5339j1189
11277D4735P0687q9936j51410n424O8918O8402L3661l7949J8228K1177K8711J45238
11265B15038m0278k09938l6026l623o867M2635J5144J20736o0771r0920m5306
11254a00176l8996J44948k6298Q329J43622J17626p7329k04850q0675p2956n0611
11243b37366P1883J03512J25736r9419o4052N3904l310K129J12015n5115q8377
$$ y = [-4610, -33829, 5977, -119047, -105991, -230523, -276465, -229197, -170131, -93567, -15647, 113791, 87669, -75375, -12188, -55935, -105154, -155876, -60077, -18245, -19237, -12173, -81495, -135262, -265102, -309162, -316921, -256905, -178837, -64525, 89531, 98460, 37931, -88149, -7582, 80473, 53514, -79419, -231768, -139700, 2348, 97858, 85713, 30585, 55924, 44735, 115422, 25486, -125924, -131348, -62430, 5972, 39633, 1684, 19912, 41089, 69800, 215038, 174760, -35178, -71204, -74827, -81694, -39059, -23915, 96821, 36050, -54870, -100176, -139172, 5776, -20522, -12193, 131429, 249055, 171726, -33124, -113799, -186755, -237366, -165483, -61971, 63765, -35654, -99706, -45802, -49112, -46983, 65032, 9917, -78460]
11232g8460k3921N3519n3460l9651q175P6204N5042J4361K3274o9360j27143L1558
11220a46212j30327L2365j7565J44790O9029J18094o1864q1515k0056J1218o2775
11209a44818K8761J30432N9818j6341k4323J8121R600p0101q1711n4399k8793
11198a73754j1128K887N138K5849L0700Q0211K6380j2938m9406l7027M3928J2950
11186e6210Q8132m1092k2907j2682k3013j7360Q1712O6716j68893N6227J1334
11175c8036O3800R6856R0788q4r3941m5484N3248q637k7299j09699j2288n2116
11163h2892q2864J14124N9699K7273L2419R2198M6735j19256o5121J3380K2213
11152E7908o0514k2088K8904j4962n7809K7784n1297m3040K2707m9001L6963K7380
$$ y = [-78460, -102381, -48862, -102322, -141973, -150148, -73944, -18902, -4541, 18733, -50627, -177770, -146212, -276539, -244174, -261739, -116949, -47920, 70174, 8310, -73205, -93261, -82043, -144818, -116057, 14375, 74193, 57852, 33529, 51650, 61250, -8851, -90562, -144961, -173754, -184882, -181995, -176857, -151008, -120308, -40097, -13717, -26655, -76061, -113088, -69160, -56210, 31922, -9170, -32077, -44759, -67772, -85132, -3420, 63296, -105597, -49370, -38036, 25764, 122620, 213408, 213324, 119383, 73899, 127147, 118510, 91211, -18488, -30776, -82892, -165756, -51632, 8067, 35340, 67759, 159957, 206692, 87436, 22315, 35695, 57908, -2606, -24694, 4210, -10752, -68561, -40777, -92074, -135114, -112407, -161408, -124445, -97065]
11140i7065P0727J21303M388K1525r774K1293k9928Q1915J04405r1579j36146
11129F1064r2681q9765k9323P8968J4465K2842o4567J53348K69449N263k5732
11118C03331R59o7338j73534J7022K3229K5806K8003k9823n2000n8493r5146n218
11106h3202J28364n444m0701n8621K0390j8368l0355N6872k167O1424o757l7362
11094a5927O6505J20208j00664p611m3182m2179K3620P1180J04627j24544j30603
11083g8570O324R0073O8359k5586j6146o935n3282q7821p9460K0543Q8199o2869
11071a37171L2422J22794m3143L873K2116M0581J6655k5605j07427p8072K4442
11060a28535N0222N5278L4190K5515J8425k0945j2450p7376P724n3517l0162l260
$$ y = [-97065, -26338, 94965, 99353, 120878, 111104, 132397, 102469, 184384, 288789, 197210, 61064, -31617, -121382, -150705, -71737, -57272, -34430, -98997, 54351, 323800, 329063, 303331, 304290, 236952, 63418, 80440, 103669, 129475, 157478, 127655, 75655, 17162, -77984, -83202, 45162, 39718, -983, -59604, -39214, -57582, -87937, -31065, -33232, 28192, 21435, -15927, 50578, 170786, 70122, 62511, 19329, -22850, 770, 71950, 176577, 52033, -78570, -72246, 17827, 86186, 60600, 44454, 37519, -15763, -103584, -183044, -162501, -74302, -137171, -104749, 18045, -25098, -21225, 891, 41472, 58127, 32522, -74905, -152977, -128535, -78313, -23035, 11155, 36670, 55095, 34150, 21700, -55676, -47952, -101469, -131631, -134891]
11048a34891L8106J07K41654N0610q7408m7170j61148q4292l8368M8134J02456
11037g2210k0216O2634j4882p3987J6856J31978j7428j98535k7051m1578J09131
11026a45288Q8290J5745l8772K1230R3457o8617L9525k0620q3332p168K5295J31489
11014E1234k341O836j07213m5168p3977o227R3514J2590j1571l6401L9455j55996
11002b35265p6146Q4782K29478J38768p1267q9348j21186L2718J66196J4137j27472
10991e4605p3701o3279O811m0927J21945J02525K5889K9328n5083o4337J24915
10980E9481n3653k0597O5399n5508n7893Q9491Q0642j35921q9447m430q3898O7793
10968a38541K76428L6385n2333L0020J8601m2781j04482n3656J12249J23968n8931
$$ y = [-134891, -96785, -96678, 144976, 195586, 108178, 61008, -100140, -184432, -222800, -174666, -72210, -92426, -29792, -44674, -118661, -101805, 30173, 12745, -185790, -212841, -254419, -145288, -56998, -41253, -80025, -58795, 34662, -33955, 5570, -15050, -98382, -105550, -80255, 51234, 48893, 55729, -51484, -96652, -170629, -176856, -83342, -70752, -82323, -118724, -79269, -235265, -311411, -226629, 2849, 141617, 70350, -18998, -140184, -107466, 58730, 72867, -54605, -128306, -191585, -184774, -225701, -103756, -1231, 24658, 53986, -1097, -65434, 59481, 5828, -14769, 50630, -4878, -62771, 26720, 107362, -28559, -118006, -122436, -206334, -138541, 137887, 174272, 121939, 151959, 170560, 127779, 23297, -30359, 81890, 205858, 146927]
10957A46927r1987j6085n976j6247k9041j23925p4751o423J51131o386K2997P4663
10945B4897O0902q0965j33505Q4575k9487j3537O4033j9606k148P8464K7491n6891
10933D223N0416j7830j0398l6466n947p236l5378j49896J86617J97236n1502j290
10921A22549K46010r416k25586j25460J2586K0661k2491p2348R9262J55976m1442
10910A60301m3334l9701j04607R22K048L5558M8590K6604n0661J733q2028p0701
10898a15276O1765J8292L9336o1412L6136o7001R121O3066K262n2690o529L7490
10886c5440o2641k0956M5583R2824L0250L2497L523k0649k11455m094J30459L3084
10874A2985m6930r3028p27Q6718J57226Q8392M8167J194r0578j30802o9681k4900
$$ y = [146927, 54940, 38855, 32879, 16632, -12409, -136334, -211085, -217508, -66377, -72763, -49766, 24897, 85799, 4834, -128671, -44096, -73583, -87120, -23087, -42693, -44841, 33623, 61114, 4223, 54639, 36809, 26411, -10055, -16002, -23238, -58616, -208512, -21895, 175341, 123839, 122549, 368559, 359143, 133557, 8097, 20683, 41344, 18853, -53495, 45767, 201743, 160301, 116967, 77266, -27341, -26419, -24371, 11187, 59777, 86381, 35720, 37453, -44575, -115276, -53511, -35219, 4117, -57295, -21159, -88160, -79039, -15973, -13711, -66401, -72930, -35440, -98081, -119037, -73454, 19370, 49620, 82117, 85640, 64991, -146464, -150558, -20099, 12985, -33945, -126973, -127700, -40982, 116244, 204636, 252803, 253997, 163419, 32617, -37064, -61964]
10862f1964N6772k5567K1096L8329P4336p8498j65992J00813N2165Q592O8228
10851H8310J16965m35j43353L6297J49083m9368j2059j04368q2142J512m6707
10840d6265R1896J54462m28R512r1288l3852k3324O7409L119j68200j30549J25485
10828d2023R9560J7591L2357J2275p3637k4846J6780o6546R3032M9254l661m6121
10816F4015J00727p7351j06275Q3861J46643j50130r7361M0902N6987R7715j18972
10805D0761o3125O4007l3465o6730j4416K0516J16031M8795l6345j14798L7181
10794a588R4478q5892n9939Q2498J7271o1018j31342p3429J20088L9651r7109
10783a56331j13227l0105J46078J40291N4022J3117n407j56312q6192n4369Q551
$$ y = [-61964, -5192, -30759, -9663, 28666, 103002, 24504, -141488, -40675, 11490, 20082, 88310, 205275, 204840, 61487, 97784, 246867, 197499, 185440, 81072, -1070, 442, -46265, 45631, 200093, 199665, 209177, 117889, 84037, 60713, 128122, 131241, -36959, -167508, -42023, 57537, 75128, 107485, 119760, 46123, 21277, 38057, -28489, 64543, 113797, 110136, 64015, 164742, 87391, -18884, 64977, 211620, 61490, -35871, 5031, 62018, 159733, 40761, -22364, 41643, 8178, -58552, -72968, -52452, 63579, 112374, 76029, -38769, -1588, 92890, 6998, -52941, 29557, 46828, -14190, -145532, -218961, -98873, -59222, -156331, -269558, -299663, -153585, -13294, 40728, 53845, 48438, -107874, -194066, -248435, -239884]
10772b39884O6760J17615r0877o8528J42099J52189O8075o1321n7572L1007J13323
10761A72886l6039l4358q0995k1812K6174O0999J77098R3453j72774q0283O2482
10750A66831Q9285j61r8144p3315M1084N4089L0771q4809k7444J27233M2366q5342
10738A82444j16407P3379m7834j3281Q6596R0094K5723j07007o5834O435j27093
10727a2785m3235J11807Q3250r775K6642j9692K8424L5558L5720j2481J9313o6874
10715A75872k00079J5153K385L5799O623q8148o9517k6846K8299J42255Q5393
10704A07189L9043q1713m6869j09423k4536Q3622N8349m7942Q8986q6651j2752
10693c2697K5503J07252o9112k3982r0788j08315J0334J08832K06459M2364j09642
$$ y = [-239884, -173124, -55509, -146386, -214914, -72815, 79374, 147449, 86128, 28556, 59563, 172886, 136847, 102489, 21494, -318, 25856, 86855, 263953, 357406, 184632, 104349, 166831, 256116, 255955, 157811, 84496, 125580, 179669, 210440, 125631, 98187, 225420, 267786, 182444, 66037, 139416, 91582, 78301, 164897, 254991, 280714, 173707, 107873, 114308, -12785, -56020, 55787, 139037, 129262, 155904, 136212, 164636, 200194, 235914, 223433, 242746, 175872, -24207, -9054, -6669, 29130, 35753, -52395, -121912, -148758, -120459, 21796, 107189, 146232, 64519, 17650, -91773, -116309, -32687, 25662, -22280, 66706, -19945, -32697, -7194, 100058, 30946, 6964, -83824, -192139, -181805, -72973, 133486, 175850, 66208]
10682F6208k7419J5866m3579N9102o390M8122M4485O3652j50813j20253K4684
10671b6335K8728n0584N3033M6436j01645m6199K3064k5304R1769K730J00063
10660I5756P4235l1907o1711j3073m5159l7420Q153n7634K755J73009N3199j4433
10648A45770q6905n1215n2060O9371J08891m9902M8636L8227o9371j19830Q4272
10637F5884j12168Q3390k4667n3849J14751P2429N7466j61749p1527Q6371q212
10626D8119o339L4161P4770Q9182L20506L91058M01282J58416J7756p337l59614
10615A161960m18676k60975j08100M2686O072q1680r2345N0678o5051k5381n7332
10604A51856Q8631N1630j1233J2519o7588p7025r493l2577j3280N8992m0528k1926
$$ y = [66208, 38789, 54655, 11076, 70178, 63788, 111910, 156395, 220047, 69234, -51019, -26335, 2393, -48191, 4842, 51278, -50367, -96566, -73502, -98806, -7037, -4307, 95756, 169991, 138084, 76373, 63300, 18141, -19279, -11126, -68760, -66005, 107004, 160203, 145770, 58865, 7650, -44410, 24961, 133852, 83950, 132586, 170813, 101442, -18388, 65884, -46284, 37106, 12439, -41410, 73341, 145770, 203236, 41487, -30040, 56331, 48119, 41780, 75941, 150711, 239893, 560399, 951457, 1352739, 1511155, 1528911, 1521574, 1161960, 743284, 482309, 374209, 416895, 422967, 341287, 248942, 299620, 234569, 209188, 151856, 240487, 292117, 280884, 293403, 225815, 148790, 139297, 106720, 93440, 152432, 111904, 89978]
10592H9978M466J6930J0055o674Q8786J15003j16573m5693J26438J24637q8331
10581C19022j23552j9601K5273m3842q6880L8476R9190m0977r9208j6504R9158
10570A50555K9770k0607J026q4720j3204R9047O7772o7022L069Q9348N2984P0880
10558C78898k6578l23461j21592K2569M3774K8225J7625O0796j1597r6424j22532
10547a50297M9814Q0247O718j1432k5930N0462N4649P4925n9930r8215L2113R2307
10535I5431k0089o5937j8516K7073K0848j0433N5066P27r9862j9735O8877L298
10523C6748k8745n2664o7582J5137P5745K3318j20674N091N8166o0719M4140Q0272
10511H233K9090J35436J15766K6338j25777J1933N8351p2880p7869l5859m8366
$$ y = [89978, 94444, 111374, 121429, 114755, 203541, 318544, 201971, 156278, 282716, 407353, 319022, 195470, 175869, 201142, 157300, 70420, 108896, 208086, 167109, 67901, 51397, 150555, 180325, 159718, 160744, 76024, 62820, 161867, 229639, 162617, 165686, 255034, 308018, 378898, 352320, 28859, -92733, -70164, -26390, 1835, 19460, 80256, 68659, -27765, -150297, -100483, -20236, -13518, -24950, -50880, -418, 54231, 129156, 69226, -28989, 3124, 95431, 75342, 9405, -9111, 17962, 38810, 28377, 83443, 84170, -15692, -35427, 33450, 36748, 8003, -44661, -112243, -97106, -21361, 1957, -118717, -113626, -55460, -116179, -72039, 8233, 37323, 172759, 288525, 314863, 189086, 201019, 259370, 186490, 108621, 72762, 24396]
10500B4396O8235O0705M7844o5360L8052q3616k0787J09894O9487J37439q8561
10489B97728j37354j38237m3910N3867m1703k263Q3656l2979o0490K7667P7011
10478H2993O9586K2967j7263j07756j4179O2240q90L2847l1866M6818j03323r7790
10466e5616N3132M9147J2442O924J62509k790j31474j1710Q6039O4733p1510q7663
10454G4163J6400O9146J4329k4424J08294O5599J1018l005P1222n8918n3664m8962
10442B41198J17714N1676r4269j32640j15180K8631J74669R4538j50189j41758
10432G4390l3382O3710N3491m2579m3210j58760r6563P4761J39072J46475R2262
10421B69667p8906l2239Q774J3562L2665l4800P9568l6604n9103q2985n540M6727
$$ y = [24396, 92631, 153336, 201180, 135820, 173872, 90256, 69469, 179363, 248850, 386289, 297728, 160374, 22137, -21773, 32094, -9609, -11872, 71784, 38805, -21685, 5982, 82993, 152579, 175546, 158283, 50527, 36348, 98588, 97698, 130545, 98679, 145497, 42174, -55616, -2484, 46663, 59105, 66029, 228538, 225748, 94274, 82564, 168603, 233336, 161826, 74163, 90563, 159709, 174038, 149614, 257908, 323507, 334525, 331520, 402742, 343824, 290160, 241198, 358912, 410588, 316319, 183679, 68499, 97130, 271799, 366337, 216148, 74390, 41008, 104718, 158209, 115630, 72420, -86340, -182903, -108142, 30930, 177405, 269667, 190761, 158522, 167296, 180858, 213523, 178723, 258291, 221687, 162584, 79599, 74059, 120786]
10409A20786j5093K3695l223n4370J05734p006Q7837j4777l4258M7679r776R6355
10397C43583M2058j02789p4341P4073l9309J8770p831M8456L6978p0280J58485
10386D27853J21065N4275j01391k60555o3352p1205J32212J3035Q2740J53702
10376D88379j07492K800K5903o5294j35519Q6580J02292k4322j31157j06832K6658
10365A61996J60013J66667L4830k04266N5045R6567o6763n5868M6258J9198p3048
10354C40629l7509Q18m5855J408Q4344L9101J0275n5863p5090J19083P7935N4486
10342E13762N6466o2900j16288l403L3544R4717N0048k2445k0285M739K0619O5763
10330F14337J6337J1804o6401P8046J4939j30006N919J64435O3452j5779j1385
$$ y = [120786, 105693, 129388, 126165, 71795, 177529, 170523, 258360, 243583, 209325, 257004, 247228, 343583, 385641, 282852, 208511, 282584, 243275, 262045, 254214, 302670, 339648, 269368, 427853, 548918, 603193, 501802, 241247, 177895, 106690, 238902, 251937, 334677, 488379, 380887, 383687, 409590, 344296, 208777, 295357, 397649, 373327, 242170, 135338, 161996, 322009, 488676, 523506, 319240, 374285, 470852, 404089, 348221, 394479, 413677, 340629, 303120, 303938, 258083, 259491, 343835, 382936, 393211, 337348, 262258, 381341, 459276, 513762, 570228, 507328, 391040, 387637, 421181, 515898, 565946, 543501, 523216, 527955, 548574, 614337, 630674, 642478, 576077, 654123, 669062, 539056, 544975, 709410, 772862, 757083, 745698]
10319G45698m027j00434M4372p4544M222K8930J43063o1577k10627O5803J66888
10308G47767Q3625o6036j22073O3068R4817J28352k9861m0774n1814j13N519J02084
10296I14561m29r121l541o5164K2794M2751N0759M892Q6746M5828Q0530K9701
10284A200307J4452P5940K21874K6115q4944j10341q6725k2174k5420J00084J29049
10273A438217j4686j07330o3790O2989j8377o7105L2870Q89J49098N9429n3111
10262A419093Q870R80J35009J15344O1794n6825j51415j4969M3140L099R8365
10251A662485J85334N7235r7064k3811L201o7832q637k7115l8707J06001O5506
10240A816596n2425K8399m3117k5002L831J4496Q5369J08368N1198N5780K105
$$ y = [745698, 741671, 641237, 685609, 611065, 615287, 644217, 787280, 725703, 515076, 580879, 747767, 831392, 765356, 643283, 706351, 801168, 929520, 899659, 858885, 807071, 806958, 812477, 914561, 914132, 905011, 901470, 836306, 859100, 901851, 952610, 957502, 1044248, 1090076, 1170606, 1200307, 1214759, 1290699, 1512573, 1538688, 1453744, 1343403, 1256678, 1234504, 1209084, 1309168, 1438217, 1423531, 1316201, 1252411, 1315400, 1297023, 1229918, 1262788, 1263677, 1412775, 1472204, 1419093, 1427963, 1428943, 1563952, 1679296, 1741090, 1684265, 1532850, 1517881, 1561021, 1564120, 1662485, 1847819, 1905054, 1807990, 1784179, 1787380, 1719548, 1710911, 1683796, 1645089, 1751090, 1816596, 1764171, 1792570, 1749453, 1724451, 1728282, 1742778, 1828147, 1936515, 1987713, 2043493, 2045598]
10229B045598o6567m7924n879J12993k9434L205j9594K0240L8756O2536k0063
10218B093867k3142j4431J12358K9042n5797L5405K04468O4754j40895j9871K4210
10207B309968j10094J4836J47537Q2319j07458q9308L4408q9804O276R4864q7197
10196B206347p7700m7679J63998J40427p2667j3903J0480m4072O1909J65078j39502
10185B352716j86603j13055k7772j5394K8980p1336q5005J6959J40356J4377j7241
10174B036982J9896o6645M9614K2023k01728L7794o8131Q232q6950j77611k7200
10163A546276P1415O4805Q9991J8922N245q4350j11415o6229N5154P3289l1525
10152A631578q8605n6466J02234Q4398n1317o8727O4256K6432p8255p7463p7143
$$ y = [2045598, 1979031, 1931107, 1925228, 2038221, 2008787, 2011992, 1992398, 2012638, 2051394, 2113930, 2093867, 2070725, 2056294, 2168652, 2197694, 2141897, 2177302, 2381770, 2446524, 2305629, 2285758, 2309968, 2199874, 2214710, 2362247, 2444566, 2337108, 2247800, 2282208, 2192404, 2198680, 2293544, 2206347, 2128647, 2080968, 2244966, 2385393, 2312726, 2298823, 2309303, 2265231, 2327140, 2492218, 2352716, 2166113, 2053058, 2025286, 2009892, 2038872, 1967536, 1882531, 1899490, 2039846, 2054223, 2036982, 2056878, 1990233, 2039847, 2061870, 1860142, 1897936, 1829805, 1838037, 1751087, 1573476, 1546276, 1617691, 1682496, 1772487, 1791409, 1796654, 1712304, 1600889, 1534660, 1589814, 1663103, 1631578, 1542973, 1486507, 1588741, 1673139, 1621822, 1553095, 1617351, 1643783, 1565528, 1488065, 1410922]
10141A410922p0225o487m3033O395L1258N7094k1475j9624p4244p5242L9880k4296
10129A210923J63q4519m6189J3287m9954q3440J8025q5757M4518J22335J0457
10118A069849J9164m981j37105M0720Q9400o161j8920m7608J4000l9495p1373
10107I07490l6423j15128n2174K0666m3963P9551o3322o678N2819j4611k2201
10096G06026m2347N3029L6125n9829p390J3499M3919r316j18722q0599l0918o2335
10084D41142O9814K7436j2165J4643k7110N4220L8532O0241J097j30167o4525
10073D73158L4661K2084k0112K9356k2753o3576j64139K1667J47581J44794K2386
10062F25107n7251L7866m1102j10853j11898L4271N6096N8868J22284R317p7501
$$ y = [1410922, 1340697, 1334210, 1291177, 1297572, 1328830, 1385924, 1364449, 1344825, 1270581, 1195339, 1235219, 1210923, 1211086, 1126567, 1080378, 1093665, 1043711, 960271, 978296, 892539, 937057, 1059392, 1069849, 1089013, 1084032, 946927, 987647, 1077047, 1070886, 1051966, 1004358, 1018358, 978863, 907490, 871067, 755939, 703765, 724431, 680468, 760019, 696697, 690019, 742838, 728227, 706026, 663679, 716708, 752833, 693004, 685614, 699113, 743032, 733716, 614994, 534395, 503477, 441142, 510956, 538392, 526227, 540870, 513760, 567980, 606512, 666753, 667850, 537683, 473158, 507819, 529903, 509791, 539147, 516394, 452818, 288679, 310346, 457927, 602721, 625107, 567856, 605722, 564620, 453767, 341869, 376140, 432236, 491104, 613388, 622705, 545204]
10051E45204p5542j3452L2980k5616m6276l3833Q059P4549N1313l3878o6322o9468
10039C47718J37596L1093L9112M0512j71750o6589n5290q6680l5725J08606m498
10028B84105J19803P4517m5887n8744p6459M7712J17997j3170k6975J0325o29
10017D32595k772K1721q9552O1218O5690p9316J2202J08341l9583j5342o7635
10006D07567k8708L9441l4020j2075r6184k1732l3740M0692l384J23214J54405
9995E35476M1522m4224k388n0949r9870l5576J14678M6339r8228j65679j67848
9984G3253q9032K4097J27675J25982O3593k2710p0649P3672M0354J8415q0002
9973B84648j91690j60016J0819L1299K7420L2010J9094K7203J05266L6897j32829
$$ y = [545204, 469662, 456210, 489190, 463574, 417298, 383465, 391524, 466073, 517386, 483508, 417186, 347718, 485314, 516407, 555519, 596031, 424281, 357692, 302402, 215722, 179997, 288603, 284105, 403908, 478425, 432538, 373794, 297335, 345047, 463044, 449874, 422899, 433224, 432595, 429823, 451544, 361992, 423210, 488900, 409584, 421786, 530127, 490544, 475202, 407567, 378859, 418300, 384280, 372205, 276021, 254289, 220549, 261241, 257857, 381071, 535476, 576998, 532774, 530386, 479437, 379567, 343991, 458669, 505008, 406780, 241101, 73253, -15779, 8318, 135993, 261975, 325568, 302858, 232209, 305881, 346235, 364650, 284648, 92958, -67058, -56239, -24940, 2480, 34490, 53584, 80787, 186053, 222950, 90121]
9962I0121j8023J4881P1759j49961r140R0171J06842k5638n8526K7883J02889
9951B43258p3291K5169J03680N5308J43268K7808j9376o1578o7669j24722m5268
9940B06587k3963l3815J5858j8255J9543k8668R3538m4616j48685r5942N4592
9929c826J49758J7698R0654n5860j37979l3509J29252J2762j54083n6445J4235
9918b7343J60659R2987j321O1770m4909r6753p5981Q9590R2109R479j7674j43334
9906I9279j5097l5548m9818L1616p0764n3953J12499O1071j16928L7664J52122
9895A52143Q4691O9041q0889p3969l4525N1985n3297o9847j06336o0167Q7222
9884c3948m6204J19410m072j07720k8152N1144n0382k3163k3062J45461J13662
$$ y = [90121, 72098, 86979, 158738, 8777, -363, 89808, 196650, 171012, 112486, 140369, 243258, 169967, 195136, 298816, 354124, 497392, 525200, 505824, 444246, 376577, 251855, 206587, 182624, 148809, 164667, 146412, 165955, 137287, 230825, 186209, 37524, -58418, -3826, 145932, 163630, 254284, 198424, 60445, 26936, 156188, 168950, 14867, -41578, -27343, 133316, 226303, 224982, 286752, 241843, 145090, 69109, 158699, 250808, 260287, 242613, 99279, 84182, 48634, -1184, 30432, -40332, -94285, 18214, 79285, -37643, 21, 152143, 236834, 305875, 224986, 151017, 116492, 168477, 115180, 45333, -61003, -121170, -33948, -80152, 39258, 35186, -72534, -100686, -49542, -99924, -123087, -146149, -688, 112974]
9873A12974M2678k8296J14226P6605r7912j66235j40067J09761J1805j12642k2168
9862i9271J04430P8427l0358m9034O730J62118L29j3210j616K8916k5799j09462
9850E2200O9743n5319O5905k4387J7291M482k281L5726q9646o9525j1290L5936
9838B8835L3406L2776l1014o2927J0979P2661J97862J903q6836p7849P9878o2664
9826A37010J6540o39m5467J55464O4076r043j68738o5967k897k9531N0903R8701
9814B00412l9959j0625j2421R4607p5659p4929m4329J4458J7505J47888k812j3456
9802B00680k4971k1685n9123K4291J3140j321m498q2954j33733p3204N6780L6309
9790g0289Q6506j9427K1320P6092P764k1336J7462l6806N1118J9003m471j29547
$$ y = [112974, 155652, 127356, 241582, 318187, 220275, 54040, -86027, 23734, 35539, -77103, -99271, 5159, 83586, 53228, 4194, 10924, 173042, 173371, 160161, 158545, 187461, 161662, 52200, 121943, 66624, 132529, 108142, 125433, 129915, 127634, 163360, 73714, 4189, -7101, 28835, 62241, 95017, 64003, 1076, 12055, 84716, 282578, 284481, 197645, 119796, 199674, 137010, 153550, 152911, 107444, 262908, 326984, 317941, 149203, 83236, 80339, 50808, 101711, 200412, 160453, 149828, 137407, 232014, 156355, 81426, 37097, 51555, 69060, 216948, 214136, 200680, 175709, 154024, 94901, 119192, 132332, 131011, 126513, 43559, -90174, -163378, -106598, -70289, 16217, -3210, 18110, 94202, 101966, 80630, 98092, 61286, 112404, 131407, 126936, -2611]
9778b611j42059M8223j8440m4913K9365Q3137J9121Q1884J22046K5012q8558k4357
9766H7850P9825O504r3280L1245k4947O1643Q6689o2917l8428j12938l623n1460
9754c3837j32517M4234J45871J08323N1661j8627j18185j15798J1229o6k1022
9743g8734L3554N4402o8798m1801J52061K9435Q25l7566n020r7086j8343O1647
9731a5424j4958r2036P6490J08211K1244j32987j28928l3257o4460P9460J65618
9720c1027J28476R3382K4122j37605q3189J16544J3280M0590o2901M5741J7992
9709A65405j11603j57785M1906m8334l6785P5384R6451J19172l3820j55523L3465
9698a2067O3191p4163J9454L6106q0533k1282m9884P8533J39945J07976j77138
$$ y = [-2611, -144670, -96447, -114887, -159800, -130435, -47298, -28177, 53707, 175753, 200765, 112207, 87850, 167675, 174179, 80899, 112144, 87197, 148840, 235529, 172612, 134184, 21246, 17623, -33837, -166354, -122120, 23751, 132074, 183735, 165108, 46923, -68875, -57646, -57712, -78734, -45180, 9222, -59576, -101377, 50684, 80119, 80944, 43378, 38358, -58728, -77071, -15424, -30382, -122418, -45928, 62283, 83527, -49460, -178388, -211645, -276105, -196645, -31027, 97449, 190831, 214953, 77348, -5841, 110703, 123983, 164573, 101672, 147413, 165405, 53802, -103983, -62077, -110411, -147196, -71812, 24639, 143811, 109991, -45532, -12067, 51124, -23039, -3585, 32521, -48012, -69294, -119178, -40645, 99300, 207276, 30138]
9687C0138k5603P9679m6759k0806J79766M7453l2876j15624j1740K873K6915r6534
9675A6882L265m9335j72512p6996N3426O8869J54620j70593j82094N967J47193
9664b01308J47453P4804l1703p6606L3120J27797r9447M6589M2683q4011j22666
9653a43295q1088N3140R2680Q824o0750P6516O3218O0838R2657M0585j4459j07024
9641H1842J05547o789q6952l0086j39587l3484J00776P8349J36692K7412j51684
9630H2036k7435k6955J4054J21834j2723o9452O1339N2113j56136j16332o6078
9619a43735N9167Q9739R9315r0560j05891l9289o7191K2113M5720J29056J14185
9608A12629O9026q179P383o3060l2446q8621m8098J4908j51001j43470J53920
$$ y = [30138, 4535, 84214, 37455, 16649, 196415, 243868, 210992, 95368, 83628, 86501, 113416, 16882, 20147, -29188, -201700, -278696, -225270, -156401, -1781, -172374, -354468, -348501, -201308, -53855, 20949, -10754, -87360, -54240, 73557, -25890, 20699, 63382, -20629, -143295, -224383, -171243, -78563, -69739, -130489, -53973, 9245, 70083, 162740, 203325, 188866, 81842, 187389, 180600, 93648, 63562, -76025, -109509, -8733, 69616, 206308, 233720, 82036, 54601, 27646, 41700, 163534, 150811, 81359, 142698, 194811, 38675, -77657, -143735, -84568, 5171, 104486, 13926, -91965, -131254, -198445, -176332, -130612, -1556, 112629, 181655, 173476, 180859, 117799, 85353, -3268, -51366, -36458, -187459, -330929, -177009]
9597a77009R7421P9084P5728J2738O6696o434k3972M8772j01066p1636p6987O3586
9585a3079J1998M814M2241j9062J31039K1162K1595L1942M5674j40282j53411
9574a5369j44656k3268k4811J15661O1441R9124r2165r6950O99M0140N9863P8370
9562E8079o3027L3110m6825k3335K9487J17562j1063j10925j09299K2882P5647
9551b7707M3088m3053q1199k7373j30431O4928J49091K8799J7818P8357n5575
9540A6743L6684m0385j27137K8142J07334j14882o4636K5058R4065J5110k1548
9529d5452J19652J17486q2483p3281j366K0j21110j44059J72807m5249j8464M5149
9517g6350J82720m7504j27813N6314N8704P9118N6135k7819k100j14055J3472
$$ y = [-177009, -79588, -504, 75224, 87962, 154658, 148224, 124252, 173024, 71958, 322, -76665, -13079, -1081, 3733, 45974, 26912, 157951, 179113, 200708, 232650, 278324, 138042, -15369, -160025, -183293, -208104, -92443, -31002, 68122, -24043, -120993, -120294, -80154, -20291, 58079, -4948, 28162, -18663, -41998, -12511, 105051, 93988, -16937, -126236, -103354, -27707, 15381, -27672, -108871, -136244, -266675, -201747, -52656, -23857, -6039, 72318, 16743, 53427, 13042, -114095, -85953, 21381, -93501, -158137, -133079, -39014, -23904, -45452, 74200, 191686, 109203, 35922, 34556, 34576, -86534, -230593, -57786, -103035, -121499, -76350, 106370, 58866, -68947, -12633, 46071, 125189, 181324, 153505, 151405, 37350, 50822]
9506E0822J4674N430p5986j93234k2225J70759R1123N4224P8462j1503M3337K7991
9494B33874j38282M748J4927q1504q5028o3493J7614Q9439J2558p3950Q94M3451
9482b4752J3191j09644l0443m27N0559N7681L3454K3338J54117R0057j2855k520
9470B41756K1874j14338j25118j0173n3490N2487M6331j38417l9198L9273m3450
9459a22463P1001j1158L9895J06986k0088r0521l3093P0829O0637q9j662L9196
9447A09470R4756o5344j53777j8458j0456l5162n4875l3264n442N4618J39405
9436B1471J35804l184l5559n7937n8974j6591J29239q6274K4435P0180N646q756
9424A19500k3447k6829J8521L3877L0003M4308o4772j16993J3890M1145j2565
$$ y = [50822, 65496, 70926, -5060, -198294, -220519, -49760, 41363, 95587, 174049, 162546, 205883, 233874, 95592, 100340, 115267, 33763, -51265, -114758, -97144, -7705, 4853, -69097, -68203, -24752, -11561, -121205, -151648, -152075, -101516, -43835, -10381, 12957, 167074, 257131, 244276, 241756, 263630, 149292, 24174, 14001, -39489, 12998, 59329, -79088, -118286, -79013, -122463, -51462, -62620, -22725, 84261, 64173, -26348, -59441, 11388, 72025, 71936, 70274, 109470, 204226, 138882, -14895, -33353, -43809, -78971, -133846, -167110, -172552, -117934, 21471, 157275, 154091, 118532, 60595, 1621, -14970, 114269, 27995, 52430, 122610, 128256, 119500, 96053, 69224, 87745, 121622, 151625, 195933, 131161, 14168, 28058, 69203, 56638]
9413E6638m4964l6821L4845N7067k5313J3551Q0539m8730j05623o7618P676J0810
9401f7943N7037n7323n3226k2332Q6709P9344p4336O912L3059J7739l189Q9860
9389I2311n16k08723J4357J50569P2433k5523p4836l8528O8770J06318M7237k2937
9377A80932q3840j17122r1673j12467n4757P9066J53845N8161P6659l6852l6363
9366A5589P8799k8339R494j06918p053P6753k659p2J150L0816n6777k4858M3243
9353B9168J4338O8094p3756j02748j10647j2596J05004Q0838J09186j54365j59133
9342b06617O5032M9478m2101P0470O1988P3450l6153q0594k3722J7506J0863n6971
9330i7371P2185L8001j01404m3186R0262k4288j9570M3188j3886Q1279j6657O9956
$$ y = [56638, 11674, -25147, 9698, 66765, 41452, 55003, 135542, 86812, -18811, -86429, -78753, -67943, -10906, -68229, -121455, -143787, -57078, 22266, -52070, -45158, -12099, 5640, 2451, 92311, 91795, -116928, -102571, 47998, 120431, 94908, 20072, -18456, 50314, 156632, 203869, 180932, 97092, -20030, -111703, -224170, -278927, -199861, -46016, 12145, 88804, 51952, 15589, 94388, 66049, 75543, -31375, -38428, 38325, 35666, 35594, 36744, 67560, 10783, -14075, 29168, 43506, 111600, 37844, -64904, -175551, -188147, -83143, -2305, 106881, -47484, -206617, -141585, -92107, -134208, -63738, -1750, 71700, 35547, -45047, -68769, -51263, -40400, -97371, -25186, 12815, -88589, -131775, -41513, -65801, -85371, -42183, -56069, 25210, 8553, 78509]
9318G8509J11793l5106o5604L1027M8084p9600l8817J09222O6521L2041m3167
9307B14903j06656l8964j16732n2769N9414o2810L8391J32861P3142K5381p9310
9296H6851q9630o5058K7243P8271M4101k5735j08830j02901O973l298k7964J0206
9284a69771J34214J23558l3703j17905l2590R9390R9341o8039J1767k680j14003
9273g0421m5296o855J05618J2959q0924n6741j0148j1577R6168m5182M8930P7643
9261A4174k1074j03819n8666J00621Q5959J08176O009j10892k4294l2983J1621
9250b5168N7521j2974m3051J1788L1937m3776k2186Q7680m3433K6060O9958j8263
9238G6093o9865K628m5079K9658l4149m9121j06312r6160N2646L0744P114L5973
$$ y = [78509, 190302, 155196, 89592, 120619, 168703, 89103, 50286, 159508, 226029, 258070, 214903, 108247, 69283, -47449, -100218, -40804, -103614, -65223, 67638, 140780, 166161, 86851, -2779, -67837, -40594, 37677, 81778, 56043, -52787, -155688, -148715, -152013, -179977, -169771, -35557, 88001, 54298, -63607, -96197, 3193, 102534, 34495, 46262, 43582, -70421, -115717, -122572, -16954, -3995, -84919, -141660, -151808, -163385, -67217, -112399, -63469, 14174, -6900, -110719, -169385, -68764, 17195, 125371, 131380, 20488, -3806, -36789, -25168, 32353, 19379, -23672, -11884, 20053, -23723, -45909, 41771, -1662, 24398, 94356, 76093, 6228, 8856, -36223, -6565, -40714, -89835, -196147, -292307, -239661, -208917, -201803, -165830]
9226a65830J3036j00334n8379M5556Q4833Q3761R7523J22420M3740p1690j17425
9215b2789R365l6415M3662O5757j38484n8014R8217R3289l3333P96J21532J02566
9203B46149n590p6345n6896L6100q7747J06715P2431o0884j41293p8914k4772
9192g1046n2355K9996m5557k3182J41212p2847M4215N0073j5671j6242l0117o4469
9180a25990N88J28048P8913R127n8131j1870n1870M729K1171R6758m8190Q440
9168E1723J5017n6709k21148o8547N8018J35227J03540J38656L5567M6005P7557
9157C14906o521j07374j53030n4269M0502L7277o7117j7249J45304l1624j4754
9146H6051j24088l3899K362J9930L3916o0913M2867l0328M2212m0143m1953J69928
$$ y = [-165830, -152794, -253128, -311507, -265951, -181118, -97357, 166, 122586, 166326, 94636, -22789, -13424, -49839, -6177, 59580, -78904, -136918, -38701, 54588, 21255, 22051, 143583, 246149, 240559, 164214, 107318, 143418, 55671, 162386, 234817, 173933, 32640, -46274, -71046, -123401, -93405, -138962, -162144, -20932, -93779, -49564, 509, -15162, -31404, -61521, -125990, -125402, 2646, 81559, 90686, 32555, 20685, -31185, -26456, -5285, 91473, 43283, 51723, 66740, 10031, -211117, -279664, -221646, -86419, 17121, 155777, 191344, 237349, 314906, 308385, 201011, 47981, -6288, 34214, 71491, 4374, -12875, 132429, 100805, 86051, -38037, -71936, -69574, -49644, -15728, -76641, -33774, -64102, -21890, -62033, -103986, 65942]
9134F5942Q8223N6657q7154j06776p9245O8683P1235k6168n1791J4815R2397O375
9122A13193o4665n857M4325j1866m6144k2983k9486K5902N5986p6889j07584m6973
9110a73041O3698K6894N4714M3038p8784M3766J04041m1020j16074M1216J83003
9099A51451J7579n5624j31587r0194J5891O1909K1461j21585n4856O256r892J08862
9087h0329J68480J47485q0888j21094j20199n0966K0730m0018j4423k7521j1119
9076b09862Q3212J56306J28429J27202P0167J0742j30926j44053k6750k9013l2648
9065B806J8791O7259J17141O070O1723l9363j8024n2536N548o4162j24327N1249
9053C2175L1072J13715K9028p480J08921j02918j49347j1273J08299N7570j11054
$$ y = [65942, 154165, 210822, 123668, 16892, -62353, 6330, 77565, 51397, -394, 14421, 106818, 113193, 48528, 42671, 86996, 75130, 28986, 6003, -23483, 2419, 58405, -18484, -126068, -173041, -109343, -82449, -27735, 15303, -63481, -19715, 84326, 43306, -72768, -31552, 151451, 169030, 113406, -18181, -108375, -92484, -30575, -9114, -130699, -185555, -179299, -189191, -80329, 88151, 235636, 154748, 33654, -86545, -137511, -116781, -156799, -171222, -198743, -209862, -126650, 29656, 158085, 285287, 355454, 366196, 235270, 91217, 64467, 35454, 2806, 21597, 88856, 205997, 212067, 273790, 234427, 216403, 163867, 169415, 105253, -19074, 32175, 63247, 176962, 205990, 198510, 307431, 204513, 55166, 43893, 152192, 209762, 98708]
9042I8708j57462j17549K9736J58048J04709l2439j02512n6965l5086j3931K565
9031a22178j18319p2220O5624J17172J95150l2194j48280K1788O9811O8002L1465
9020G5821n1339k4541l5401o9838q9765o342P0507N7740M557j1773j7128O381
9008i1121P7664J17667N2120M841R8367j63682J7470Q9284O5571j0069q5109j03743
8996F9260j25402J4981P0452M3154o763J05046l9172k2775M1927j21005O2901
8985I2604O5761j2876n9724q1643n4305N0545l7229r084j5966P6109J84168J49062
8973C47422k6007j61305j48671l6048J2633Q7307p7111l31k6642j13714k4441
8962a66908j1906k977J2504j0110K2579J51529L3926L4046j17041j59186J01457
$$ y = [98708, -58754, -176303, -146567, 11481, 116190, 83751, -18761, -75726, -110812, -124743, -122178, -240497, -312717, -247093, -129921, 65229, 33035, -115245, -93457, -23646, 44356, 75821, 24482, -59, -35460, -105298, -195063, -201405, -130898, -73158, -68601, -80374, -97502, -91121, -13457, 104210, 156330, 161171, 259538, 95856, 113326, 202610, 268181, 258112, 173003, 69260, -56142, -41161, 29291, 72445, 65682, 170728, 131556, 108781, 150708, 29703, 92604, 158365, 145489, 85765, 4122, -50183, 362, -36867, -45951, -61917, 14192, 198360, 347422, 321415, 160110, 11439, -24609, -11976, 75331, -1780, -2111, -28753, -142467, -166908, -178814, -181791, -169287, -179397, -156818, -5289, 28637, 62683, -54358, -213544, -112087]
8951a12087R0296j65652o9582J31568R8204J5148N3260l5394n8484j4599j8651
8940h5973O2375M7705o7449j12508k5585P9092N5534K7660R9398L432p8151j09728
8928a04198q0200J154j8293N5056k6917P0160M4393L0930L3079n9681N6520P1253
8916G3256L8365n1915j31087P800J4925j1647k44P846K1775J8624J925p0444l7277
8903a18098J1918k9452J16558R3338J04922j4052o7803N5556n7412r193Q4897
8892A71179J2547J7181p0871q5296k9771K2328K4955o2052l0173J15235O82q8509
8880b565K5531J3828R1870J46606J94859J92102J5245J5242j70758j48023n6313
8869C17624j02651j18389k7090J41705j4353k0599p8963j00366O0114L2396o7557
$$ y = [-112087, -21791, -187443, -257025, -125457, -27253, -12105, 41155, 5761, -52723, -67322, -85973, -23598, 24107, -43342, -155850, -181435, -102343, -46809, -19149, 80249, 83681, 5530, -104198, -184398, -183244, -201537, -146481, -173398, -103238, -58845, -27915, 5164, -54517, 2003, 73256, 111621, 59706, -71381, -63581, -48656, -60303, -60547, -52701, -30926, -12302, -10377, -80821, -118098, -106180, -135632, -19074, 74264, 179186, 165134, 97331, 152887, 95475, 86282, 171179, 183726, 200907, 130036, 44740, 14969, 37297, 62252, 200, -29973, 85262, 85944, -2565, 22966, 36794, 128664, 275270, 470129, 662231, 677476, 692718, 521960, 373937, 317624, 214973, 96584, 69494, 211199, 196846, 176247, 97284, -3082, 57032, 89428, 21871]
8858B1871Q9199j03474j18605O8468O8511n3411O7465j5660K1756P7199m6342
8847G6977o2214k0797o865J67321J5962j10496p3025L1491J33743j0766p1428
8836F9903j11454k5763K02334N3744j53945N2095k1608j8214j33925L2476J76192
8825A21835r5144k01637j23132J09894K15308K2328J2647q4032N0261J26041l577
8814A50792j07057j75072k2631R6511n2754r0560J66646K1389N5434j61246j08076
8803b26624K294J34671m0018J407N6540M4105P9085k3214J18194r0341j4665J2887
8791E4321K6777J01894M0586j06036q4321k4532M8928j6750J38164J42785p328
8780C14488j12521M1148j45681n8776R443n1035m3092K5232J2921M9716J55380
$$ y = [21871, 111070, 7596, -111009, -42541, 25970, -27441, 40024, 24364, 46120, 123319, 76977, 14763, -6034, -12899, 154422, 170384, 59888, -13137, 18354, 152097, 141331, 69903, -41551, -67314, 135020, 188764, 34819, 86914, 65306, 47092, -86833, -54357, 121835, 26691, -174946, -298078, -188184, 27124, 49452, 62099, -21933, 28328, 154369, 150792, 43735, -131337, -153968, -57457, -110211, -200771, -34125, -12736, 42698, -118548, -226624, -224330, -89659, -129677, -128270, -71730, -27625, 51460, 28246, 146440, 56099, 41434, 54321, 81098, 182992, 223578, 117542, 33221, 8689, 57617, 40867, 179031, 321816, 314488, 201967, 243115, 97434, 38658, 48101, -2934, -46026, -20794, -7873, 41843, 197223]
8769A97223m1407j3293O3033M2353m630q1502O2433k0852R1945k2479j11217j75384
8757a3777k3743J4827J23374M1259j54536j37846j5970K6806Q0145j9178m1123
8746a19762R0112Q9864J06366m7230R2048j2586j93898l7011R5038J7281l3973
8735D6249O9810K9577J2056o7548l8208M6824R1846L9691j68127j34988P2339
8724d79P2814l4114O5731M5175m3166L9647L7247J2897p7725k1722l7757k2338
8712C6210P6027R1921j2701J098k300j10153j04785P3135J18339Q5141n2947o7389
8700A31596j48553r6811O9190R7176O1339j6387K7327K3642K3963K2978r4692
8689A00768m3992q3227K5866J25928k3932n8570K7038k2010o7901J0678M4962
$$ y = [197223, 155816, 142523, 205556, 247909, 243279, 161777, 224210, 203358, 295303, 272824, 161607, -13777, -37520, -22693, 100681, 141940, -12596, -150442, -166412, -139606, -59461, -78639, -119762, -29650, 60214, 166580, 119350, 211398, 198812, 4914, -32097, 62941, 80222, 46249, 116059, 145636, 157692, 90144, 51936, 98760, 190606, 230297, 62170, -72818, -479, 72335, 38221, 103952, 149127, 105961, 145608, 182855, 195752, 118027, 96305, 58548, 36210, 112237, 204158, 191457, 192555, 190255, 80102, -24683, 48452, 166791, 251932, 198985, 131596, -16957, -113768, -44578, 52598, 113937, 97550, 124877, 148519, 172482, 195460, 100768, 56776, -26451, -585, 125343, 101411, 42841, 69879, 47869, -20032, -9354, 35608]
8678C5608m9129q208Q3500K6273P4694m7566L3428M0712J703M2650J04300r9554
8666B38411j7070k5105n1525M1404K601O766J4683k7907n5504q6390M7220O252
8654I3836l1586l0514M0560J18990J37772J45718j05248j63938M2386L0036j947
8643B76065q0326l1207J63179O8127M7898j62854n4717n5363m2379q3974L2854
8632G7303Q0216L1671j9721o0568n5807Q4651M0609l0982M9838j16060q0529Q5829
8620H6450J17608M4505q55J08317L0582J06972N4062j29666l8035k8042Q1512
8609D33410m0345L5998J41841J6904Q1473O0134p611M6001R2898R0626n2384N9294
8597I58239J88877K25862l9451j15769J19770J5096P708j6801n9473j24657m3506
$$ y = [35608, -13521, -21729, 61771, 88044, 162738, 115172, 148600, 189312, 191015, 233665, 337965, 238411, 221341, 196236, 144711, 186115, 188716, 195482, 210165, 182258, 126754, 40364, 87584, 93836, 62250, 31736, 72296, 191286, 329058, 474776, 369528, 205590, 247976, 278012, 276065, 195739, 164532, 327711, 395838, 443736, 280882, 226165, 170802, 128423, 44449, 77303, 157519, 189190, 169469, 108901, 53094, 137745, 178354, 147372, 197210, 81150, 621, 86450, 204058, 248563, 247708, 356025, 386607, 493579, 547641, 417975, 379940, 351898, 433410, 393065, 429063, 570904, 587808, 669281, 729415, 721804, 767805, 860703, 951329, 898945, 958239, 1147116, 1372978, 1333527, 1217758, 1337528, 1352624, 1360332, 1343531, 1284058, 1159401, 1115895]
8586A115895p0807q6481J4431n5864j72130j09652n1587l5956j06891J839L3010
8575D75807l7653m5478n5445r3356o4196K1866M4089O6421L0588M8072N7068j58951
8563B88832L4689J0455j1825K0076l1499J9887J51267M4015r0984j1336O7458
8552D91035j4770n1949n0524q0119K8456l3508j40602j06448j0622N2311J46698
8541B29958J29515L501n4668L1108j13806l8557q9597o3567O8551O2723J07220
8530B72381P7284o7356m7817j25895k8975J2561P407n1461k1737M9001K9396J4109
8518A18898N2322j9035N7935O434o3572n4297J51096K5913m7325N144n7681M4915
8506B20747o1656K2753J4113K8491o1553o6126N8615o4386o6618j5802m3758K3413
$$ y = [1115895, 1045088, 958607, 973038, 917174, 745044, 635392, 583805, 547849, 440958, 442797, 475807, 438154, 392676, 337231, 243875, 179679, 201545, 245634, 312055, 342643, 390715, 447783, 288832, 323521, 333976, 322151, 342227, 310728, 330615, 481882, 525897, 434913, 423577, 491035, 476265, 424316, 373792, 293673, 322129, 288621, 148019, 41571, 30949, 83260, 229958, 359473, 362974, 308306, 339414, 225608, 187051, 97454, 33887, 102438, 165161, 272381, 349665, 282309, 234492, 108597, 79622, 92183, 99590, 48129, 26392, 75393, 104789, 118898, 171220, 152185, 210120, 216554, 152982, 98685, 249781, 275694, 228369, 233513, 175832, 220747, 159091, 181844, 195957, 224448, 162895, 96769, 155384, 90998, 24380, 8578, -35180, -11767]
8494a1767J71012O4901o4824q1968m4995J17464r8006r4735q3051m03K5044m8180
$$ y = [-11767, 159245, 224146, 159322, 77354, 32359, 149823, 51817, -42918, -125969, -126372, -101328, -149508]
$$ [...]
##END NTUPLES=NMR SPECTRUM
##END=
