##TITLE=Analysis number 320095
Compound Code cc 38316
Book Reference 470/15/2
Project Code adrs
Chemist Name mikem
##JCAMPDX= 6.0         $$ Bruker NMR JCAMP-DX V2.0
##DATA TYPE= NMR SPECTRUM
##DATA CLASS= NTUPLES
##ORIGIN= Bruker BioSpin GmbH
##OWNER= nmr
$$ XWIN-NMR		Version 3.5
$$ Tue Jun 13 11:15:45 2006 GMT Daylight Time (UT+1h)  MAYBRIDGE\nmr@NMR_250MHZ
##.OBSERVE FREQUENCY= 250.131544655141
##.OBSERVE NUCLEUS= ^1H
##.ACQUISITION MODE= SIMULTANEOUS (DQD)
##.ACQUISITION SCHEME= undefined
##.AVERAGES= 16
##.DIGITISER RES= 18
##SPECTROMETER/DATA SYSTEM= dpx250
##.PULSE SEQUENCE= zg30
##.SOLVENT NAME= CDCl3
##.SHIFT REFERENCE= (INTERNAL, CDCl3, 0, 16.453)
##AUDIT TRAIL= $$ (NUMBER, WHEN, WHO, WHERE, WHAT)
$$ ##TITLE= Audit trail, XWIN-NMR		Version 3.5
$$ ##JCAMPDX= 5.01
$$ ##ORIGIN= Bruker BioSpin GmbH
$$ ##OWNER= nmr
$$ C:\u/data/dgb/nmr/ADRS/650/pdata/1/auditp.txt
$$ ##AUDIT TRAIL=  $$ (NUMBER, WHEN, WHO, WHERE, WHAT)
(   1,<2006-06-13 11:15:17.59 +100>,<MAYBRIDGE\nmr>,<NMR_250MHZ>,
      <created by zg, POWCHK disabled, PULCHK disabled
       configuration hash MD5:
       E2 DF 36 D8 04 B2 41 60 5A D7 A3 38 5A 4B D0 FE
       data hash MD5: 64K
       C2 1B 64 7D EF 81 FB 37 32 98 11 6E AA D8 F8 C1>)
(   2,<2006-06-13 11:15:33.76 +100>,<MAYBRIDGE\nmr>,<NMR_250MHZ>,
      <Start of raw data processing
       ef LB = 0.3 FT_mod = 6 PKNL = 1 SI = 32K 
       data hash MD5: 32K
       25 26 3F BB 8D 3F CC 80 6E D7 45 C6 99 42 66 FF>)
(   3,<2006-06-13 11:15:35.29 +100>,<MAYBRIDGE\nmr>,<NMR_250MHZ>,
      <apk 
       data hash MD5: 32K
       8C FB FF CC 88 52 E2 B6 CE 48 A1 05 15 F6 09 AE>)
(   4,<2006-06-13 11:15:36.00 +100>,<MAYBRIDGE\nmr>,<NMR_250MHZ>,
      <abs ABSG = 5 
       data hash MD5: 32K
       B1 03 D2 D3 1F 70 AA AA 23 D9 CC 50 1C 67 5C CC>)
$$ ##END=
$$ 
$$ hash MD5
$$ CF 41 31 62 35 AD 6C 90 C8 66 98 AC 2A A4 2F 5B
##$RELAX= 
##$RELAX= 
##$RELAX= 
##$RELAX= 
##$RELAX= 
##$RELAX= 
##$RELAX= 
$$ Bruker specific parameters
$$ --------------------------
##$DU= <C:\u>
##$EXPNO= 650
##$NAME= <ADRS>
##$PROCNO= 1
##$TYPE= <nmr>
##$USER= <dgb>
##$AMP= (0..31)
100 100 100 100 100 100 100 100 100 100 100 100 100 100 100 100 100 100 
100 100 100 100 100 100 100 100 100 100 100 100 100 100 
##$AQSEQ= 0
##$AQ_mod= 3
##$AUNM= <au_zg>
##$AUTOPOS= <18 >
##$BF1= 250.13
##$BF2= 250.13
##$BF3= 250.13
##$BF4= 250.13
##$BF5= 500.13
##$BF6= 500.13
##$BF7= 500.13
##$BF8= 500.13
##$BYTORDA= 1
##$CFDGTYP= 0
##$CFRGTYP= 5
##$CHEMSTR= <none>
##$CNST= (0..31)
1 1 145 1 1 1 1 1 1 1 1 1 1 1 1 1 1 1 1 1 1 1 1 1 1 1 1 1 1 1 1 1 
##$CPDPRG= <>
##$CPDPRG1= <>
##$CPDPRG2= <>
##$CPDPRG3= <>
##$CPDPRG4= <mlev>
##$CPDPRG5= <mlev>
##$CPDPRG6= <mlev>
##$CPDPRG7= <mlev>
##$CPDPRG8= <mlev>
##$CPDPRGB= <>
##$CPDPRGT= <>
##$D= (0..31)
0 1 0 0 0 0 0 0 0 0.06 0 0 0 0 0 0 0.0002 0 0 0 0 0 0 0 0 0 0 0 0 0 0 
0 
##$DATE= 1150193713
##$DBL= (0..7)
120 120 120 120 120 120 120 120 
##$DBP= (0..7)
150 150 150 150 150 150 150 150 
##$DBP07= 0
##$DBPNAM0= <>
##$DBPNAM1= <>
$$ [...]
##$SUBNAM7= <"">
##$SUBNAM8= <"">
##$SUBNAM9= <"">
##$SW= 20.6930455092707
##$SWIBOX= (0..15)
0 0 3 0 0 0 0 0 0 0 0 0 0 0 0 0 
##$SW_h= 5175.983436853
##$TD= 65536
##$TD0= 1
##$TE= 295.16
##$TE2= 300
##$TE3= 300
##$TEG= 300
##$TL= (0..7)
0 120 120 120 120 120 120 120 
##$TP= (0..7)
150 150 150 150 150 150 150 150 
##$TP07= 0
##$TPNAME0= <>
##$TPNAME1= <>
##$TPNAME2= <>
##$TPNAME3= <>
##$TPNAME4= <>
##$TPNAME5= <>
##$TPNAME6= <>
##$TPNAME7= <>
##$TPOAL= (0..7)
0.5 0.5 0.5 0.5 0.5 0.5 0.5 0.5 
##$TPOFFS= (0..7)
0 0 0 0 0 0 0 0 
##$TUNHIN= 0
##$TUNHOUT= 0
##$TUNXOUT= 0
##$USERA1= <user>
##$USERA2= <user>
##$USERA3= <user>
##$USERA4= <user>
##$USERA5= <user>
##$V9= 5
##$VALIST= <valist>
##$VCLIST= <CCCCCCCCCCCCCCC>
##$VD= 0
##$VDLIST= <DDDDDDDDDDDDDDD>
##$VPLIST= <PPPPPPPPPPPPPPP>
##$VTLIST= <TTTTTTTTTTTTTTT>
##$WBST= 1024
##$WBSW= 4
##$XGAIN= (0..3)
0 0 0 0 
##$XL= 0
##$YL= 0
##$YMAX_a= 463142
##$YMIN_a= -634178
##$ZGOPTNS= <>
##$ZL1= 120
##$ZL2= 120
##$ZL3= 120
##$ZL4= 120
##$ABSF1= 16.45302
##$ABSF2= -4.240152
##$ABSG= 5
##$ABSL= 3
##$ALPHA= 0
##$AQORDER= 0
##$ASSFAC= 0
##$ASSFACI= 0
##$ASSFACX= 0
##$ASSWID= 0
##$AUNMP= <proc_1d>
##$AZFE= 0.1
##$AZFW= 0.1
##$BCFW= 0
##$BC_mod= 0
##$BYTORDP= 0
##$COROFFS= 0
##$CY= 12.5
##$DATMOD= 1
##$DC= 0
##$DFILT= <>
##$DTYPP= 0
##$F1P= 14.0000005364418
##$F2P= -0.99999901652339
##$FCOR= 0.5
##$FTSIZE= 32768
##$FT_mod= 6
##$GAMMA= 0
##$GB= 0
##$INTBC= 1
##$INTSCL= 1
##$ISEN= 128
##$LB= 0.3
##$LEV0= 0
##$LPBIN= 0
##$MAXI= 10000
##$MC2= 0
##$MEAN= 0
##$ME_mod= 0
##$MI= 0
##$NCOEF= 0
##$NC_proc= -4
##$NLEV= 6
##$NOISF1= 0
##$NOISF2= 0
##$NSP= 0
##$NTH_PI= 0
##$NZP= 0
##$OFFSET= 16.45302
##$PC= 1
##$PHC0= 171.5842
##$PHC1= 4.816646
##$PH_mod= 1
##$PKNL= yes
##$PPARMOD= 0
##$PSCAL= 4
##$PSIGN= 0
##$REVERSE= no
##$SF= 250.130017252685
##$SI= 32768
##$SIGF1= 0
##$SIGF2= 0
##$SINO= 400
##$SIOLD= 32768
##$SREGLST= <1H.CDCl3>
##$SSB= 0
##$STSI= 32768
##$STSR= 0
##$SW_p= 5175.98343685301
##$SYMM= 0
##$S_DEV= 0
##$TDeff= 65536
##$TDoff= 0
##$TI= <Analysis number 999999
Compound Code 99
Book Reference 9
Project Code 9>
##$TILT= no
##$TM1= 0
##$TM2= 0
##$TOPLEV= 0
##$USERP1= <user>
##$USERP2= <user>
##$USERP3= <user>
##$USERP4= <user>
##$USERP5= <user>
##$WDW= 1
##$XDIM= 32768
##$YMAX_p= 272451767
##$YMIN_p= -177727
$$ End of Bruker specific parameters
$$ ---------------------------------
##NTUPLES= NMR SPECTRUM
##VAR_NAME=  FREQUENCY,     SPECTRUM/REAL,   SPECTRUM/IMAG
##SYMBOL=    X,             R,               I
##VAR_TYPE=  INDEPENDENT,   DEPENDENT,       DEPENDENT
##VAR_FORM=  AFFN,          ASDF,            ASDF
##VAR_DIM=   32768,         32768,           32768
##UNITS=     HZ,            ARBITRARY UNITS, ARBITRARY UNITS
##FACTOR=    0.157963299565203, 1,           1
##FIRST=     4115.39420042753, 0,            0
##LAST=      -1060.58923642548, 0,           0
##MIN=       -1060.58923642548, -177727,     0
##MAX=       4115.39420042753, 272451767,    0
$$ Real data points
##PAGE= N=1
##DATA TABLE= (X++(R..R)), XYDATA
$$ [...]
18216D98429l4687n5362n7790j4336m2478n3732l977K8216o795k6070l2795J8578
$$ 498429 463742 408380 350590 336254 293776 240044 236067 264283 257488 231418 198623 217201
18204B17201M018K3750n1703O863j2495j7552K4287J2960r997R685k8363K1979
$$ 217201 221219 244969 193266 200129 187634 170082 194369 207329 197332 207017 178654 200633
18192B00633l563k6158k4803J1928l457m0894k6772N124K7910L5012k236L7845
$$ 200633 197070 170912 146109 158037 154580 113686 86914 92038 119948 154960 152724 190569
18180A90569p690O273L3486m792j5396K915K848J6417J3400K1257n3911M1059
$$ 190569 182879 189152 222638 217846 202450 205365 208213 224630 238030 259287 205376 246435
18168B46435L3871l8211l3347J0374L2391m0983K0438K812m473n3294K196j6642
$$ 246435 280306 242095 208748 219122 251513 210530 230968 233780 229307 176013 178209 161567
18156A61567J4240L6188k3091j36O9465Q636N935J0225j2288J0986m791k3826
$$ 161567 175807 211995 188904 188768 258233 266869 272804 283029 270741 281727 276936 253110
18144B53110L719K3215K9753P5432M6464N7K0380J1932J3944P4400L4726Q2381
$$ 253110 256829 280044 309797 385229 431693 431750 452130 464062 478006 552406 587132 669513
18132F69513K7424N3668N0089O3787Q4300J28007J67255K03886K19491L54928
$$ 669513 696937 750605 800694 864481 948781 1076788 1244043 1447929 1667420 2022348
18122B022348M03111N56802Q43094J214076J945608L439004O015520R515990J0517072
$$ 2022348 2425459 2982261 3825355 5039431 6985039 10424043 16439563 25955553 36472625
18113C6472625N525593P57950r74213o50985k47564p783832j1494976p804088
$$ 36472625 41998218 42756168 41781955 41130970 40883406 33099574 21604598 13800510
18105A3800510l951596k101197j169851o49694l19290k05634k47411l20103l31693
$$ 13800510 9848914 7747717 6577866 5928172 5608882 5403248 5155837 4835734 4504041
18096D504041l90936l90356k66598j95568j82783j29807j07845j15693p1542j17769
$$ 4504041 4113105 3722749 3456151 3260583 3077800 2947993 2840148 2724455 2652913 2535144
18086B535144j09717n5594j34550j96820j57287j05027q2796l4705l4847o1039
$$ 2535144 2425427 2369833 2235283 2038463 1881176 1776149 1693353 1658648 1623801 1562762
18076A562762r1502q1440m5181l4276q4763j2536m8118m6141q3141m4082j7453
$$ 1562762 1471260 1389820 1344639 1310363 1225600 1213064 1164946 1118805 1035664 991582 974129
18065I74129J562l5260m3464J5990j4996l1475L679k9045J9683m7306k3690m0948
$$ 974129 975691 940431 896967 912957 897961 866486 870165 841120 860803 813497 789807 748859
18053G48859n2845r0445K32L2769M804P9002Q3563K6269o772J6626l8933J411
$$ 748859 696014 605569 605801 638570 643374 722376 805939 832208 825436 842062 803129 804540
18041H04540K0479j9108l9849M043o562l2213N2635L6467n1517j4278l0759p3538
$$ 804540 825019 805911 766062 770105 763543 731330 783965 820432 768915 754637 723878 650340
18029F50340q7547o4183n3492m1310K5343r885k0847j8008o0420p139N6419K1779
$$ 650340 562793 498610 445118 403808 429151 419266 398419 380411 319991 312852 369271 391050
18017C91050M1132k7556l8469L3296K576L371r990N1658l721o9290j1796l833
$$ 391050 432182 404626 366157 399453 402029 405400 395410 447068 443347 374057 362261 358428
18005C58428j8470j0650k6669p037n732M5944k4953j4737L3455K6777K3623k4853
$$ 358428 339958 329308 302639 295602 289870 335814 310861 296124 329579 356356 379979 355126
17993C55126O390J1634M1758R7363O1175K9186K0763K5226K1711K280l7294p2265
$$ 355126 361516 373150 414908 512271 573446 602632 623395 648621 670332 672612 635318 563053
17981E63053p7213n9673n3341J3290K7598l1756l6907j0o516m8241J9909N2383
$$ 563053 485840 426167 372826 386116 413714 381958 345051 345041 338525 290284 310193 362576
17969C62576k8710m0183j9623m7662j5101j2202J3762k4733p6787J22L9895L1109
$$ 362576 333866 293683 274060 226398 211297 199095 212857 188124 111337 111459 151354 182463
17957A82463K2925L4731K983n9870j8750j0804j9825M8311k961p09l0366O980
$$ 182463 205388 240119 243102 183232 164482 153678 133853 182164 179203 178494 148128 155108
17945A55108J5700Q481L3643J10311J6891K4271M4077o914P0928P9044P8804L7117
$$ 155108 170808 179289 212932 323243 340134 364405 408482 401568 472496 551540 630344 667461
17933F67461Q4763Q9045K0196r9205j09809m9235m9735m5205j08545o6831K4919
$$ 667461 752224 841269 861465 762260 652451 603216 553481 508276 399731 332900 357819
17922C57819n7337l4555l1120J2001l2797P28K744l4596j2355j4433Q129K2303
$$ 357819 300482 265927 234807 246808 214011 214739 217483 182887 170532 156099 164228 186531
17910A86531J0321M4557M1474R22o4117m4916p811K9270k309J4317L4206K4495
$$ 186531 196852 241409 282883 283805 219688 174772 166961 196231 193922 208239 242445 266940
17898B66940K31j2711k4718j0689L5183r071N878O9l6659m563N0575j2049l0774
$$ 266940 267171 254460 229742 219053 254236 245165 251043 251112 214453 209890 260465 248416 217642
17885B17642O888M3757K8906J1874M8566R4691M3171O2091M9571M2034q263l0406
$$ 217642 224530 268287 297193 309067 357633 452324 495495 557586 607157 649191 640928 610522
17873F10522j5577p3984r7040o3855r86l0624k5000l5912j3507N7957O0694P953
$$ 610522 594945 520961 423921 360066 359080 328456 303456 267544 254037 311994 372688 380641
17861C80641l6945N907R701q389J6953L3464N7292K7986M0413J0357j1997q1380
$$ 380641 343696 349603 359304 350915 367868 401332 458624 486610 527023 537380 525383 444003
17849D44003n7773m3495n1781j2048m5259l1041J2975L9269l211l9351j1511o282
$$ 444003 386230 342735 290954 278906 233647 202606 215581 254850 251639 212288 200777 194495
17837A94495J793j0964k3435M701O3094J7490m1907L3930K360J3227M1598K374
$$ 194495 196288 185324 161889 166590 229684 247174 205267 239197 241557 254784 296382 298756
17825B98756j6875J3209j4868n8609K2761k79K6544M5646M4433J5214j2615K6249
$$ 298756 281881 295090 280222 221613 244374 244095 270639 316285 360718 375932 363317 389566
17813C89566K4953Q6262N8337O577k8683p6993k0307k002k9494j8326J1130J88
$$ 389566 414519 500781 559118 565695 537012 460019 439712 437710 408216 389890 401020 401208
17801D01208p7m7005K3206K3542J0591O6384M4418J4272l092o8743k5380J0387
$$ 401208 401131 354126 377332 400874 411465 477849 522267 536539 533447 464704 439324 449711
17789D49711n267l642o279q377l548m4968j4186N0446M9540m8523L246K9835P7881
$$ 449711 444444 440802 434523 426146 422598 377630 363444 413890 463430 414907 418153 447988 525869
17776E25869O7690j3545k0174l9809j938N0492N4861K5588P6367R6834M5806K0089
$$ 525869 593559 580014 559840 520031 518093 568585 623446 649034 725401 822235 868041 888130
17764H88130L322L1506P7127P9046O9066P4826Q3779J18113J30545J32497J83030
$$ 888130 891452 922958 1000085 1079131 1148197 1223023 1306802 1424915 1555460 1687957 1870987
17753A870987K27622K34391J71039J74760K33901K77960L66534M51548N37946
$$ 1870987 2098609 2333000 2504039 2678799 2912700 3190660 3557194 4008742 4546688
17744D546688O94751Q29398J108842J561341K182655L222397M959087P878287
$$ 4546688 5241439 6070837 7179679 8741020 10923675 14146072 19105159 26983446
17736B6983446J1503283J4324462J4220785J2166960J1225689J1806228J0145368
$$ 26983446 38486729 52811191 67031976 79198936 90424625 102230853 112376221
17729A12376221K398258p416915j1624012j0533054r928523j2814069j4564277
$$ 112376221 114774479 107357564 95733552 85200498 75271975 62457906 47893629
17722D7893629j1892639p577866m484455k787553j940626j395935j162002j003280
$$ 47893629 36000990 28423124 23938669 21151116 19210490 17814555 16652553 15649273
17714A5649273r93245r00019q09415p08345n59475n66915n16899l10632k52153
$$ 15649273 14656028 13756009 12946594 12238249 11678774 11111859 10594960 10284328 10032175
17705A0032175k80507k70984j85520o9851O3881J22978J85622L33599N73889R16996
$$ 10032175 9751668 9480684 9295164 9225313 9289194 9412172 9597794 9931393 10505282 11422278
17695A1422278J423197K135028L191722N040258Q001324J1500412J3472519J2443876
$$ 11422278 12845475 14980503 18172225 23212483 31213807 42714219 56186738 68630614
17687F8630614J0204420R625832R937587P213000j093820r171429j1168998r439694
$$ 68630614 78835034 88460866 98398453 105611453 104517633 95346204 84177206 74737512
17679G4737512r458551j2109525j2549256r428210n777888l429233k291828j666474
$$ 74737512 65278961 53169436 40620180 31191970 25414082 21984849 19693021 18026547
17671A8026547j285757j076068j015086r33387r24674r06251q13629o43419n72035
$$ 18026547 16740790 15664722 14649636 13716249 12791575 11885324 11071695 10428276 9856241
17662I856241n46355n17111m83826m26362l87205l90475l46096l07015k41549
$$ 9856241 9309886 8792775 8308949 7882587 7495382 7104907 6758811 6451796 6210247
17653F210247k34978k26717k37506k16773j72546j66016j52733j84077j45095
$$ 6210247 5975269 5748552 5511046 5294273 5121727 4955711 4802978 4618901 4473806
17644D473806j46860j61960j93037j44129j23009j03419p3964p6153j08179j19361
$$ 4473806 4326946 4164986 3971949 3827820 3704811 3601392 3527428 3451275 3343096 3223735
17634C223735j00167j36596p9874m8948j34513q1812k6353m9200r3723j07795
$$ 3223735 3123568 2986972 2907098 2858150 2723637 2641825 2615472 2566272 2472549 2364754
17624B364754r706k0519n0440o4973p5327l3360j6115p3908l5268n5652p5551
$$ 2364754 2355048 2334529 2284089 2219116 2143789 2110429 2094314 2020406 1985138 1929486 1853935
17613A853935r8148k9719k0707j6380o7812p8434p401J5112k4216n3428m8806
$$ 1853935 1755787 1726068 1705361 1688981 1621169 1542735 1535334 1550446 1526230 1472802 1423996
17602A423996k6625J0935n2767r9072p1449k9477J0956p5670k8600j9483m4986
$$ 1423996 1397371 1408306 1355539 1256467 1185018 1155541 1166497 1090827 1062227 1042744 997758
17591I97758k0431N876j8534L985m960l2349o0849k7812J4511L1686o539j1137
$$ 997758 977327 983203 964669 968654 963694 931345 870496 842684 857195 888881 882342 871205
17579H71205l6464l7589k1594k560R604J6043q894p0732r8050M965K5845k8914
$$ 871205 834741 797152 775558 772998 782602 798645 789751 719019 620969 625934 651779 622865
17567F22865J5282l685M090j4224r09L2079K0936n4874k5712r641l0223n525J1470
$$ 622865 638147 634462 638552 624328 623419 655498 676434 621560 595848 586207 555984 550459 561929
17554E61929J0493L688J1954J4240k041J8753L9724L1948M9170M2785M9071k1561
$$ 561929 572422 576110 588064 602304 600263 619016 658740 690688 739858 782643 831714 810153
17542H10153L5113j2402r1488l8092m7572J1463R172l2010m2017l9285q190K6812
$$ 810153 845266 832864 741376 703284 655712 667175 676347 644337 602320 563035 554845 581657
17530E81657j6349k9686q714m437m7503m2216k6185j3584K0203K3375l3021l7985
$$ 581657 565308 535622 526908 522471 474968 432752 406567 392983 413186 436561 403540 365555
17518C65555K1248j3107p310K3416j9052L1534J3674j919M3255L809j3236o0536
$$ 365555 386803 373696 366386 389802 370750 402284 415958 414039 457294 461103 447867 387331
17506C87331j0653j0332N790M5402M9716K2890o660n982L6006K8853N6224R9273
$$ 387331 376678 366346 372136 417538 467254 490144 483484 477502 513508 542361 598585 697858
17494F97858Q8182M2984N5027l796j7211J5827K7015K9443m0818K3869j7507J6836
$$ 697858 786040 829024 884051 880255 863044 878871 905886 935329 894511 918380 900873 917709
17482I17709K3474l1724k8029l5940r377j0208r4894l0788n058j7554n8588K7329
$$ 917709 941183 909459 881430 845490 836113 825905 731011 700223 695165 677611 619023 646352
17470F46352L3419L7036k242l183j0506J0504N5778P8050K5207O198N6499J9439
$$ 646352 679771 716807 714565 711382 700876 711380 767158 845208 870415 876613 933112 952551
17458I52551M1886J4712M5690Q4722J05546J29079J61555K19297K79301L33364
$$ 952551 994437 1009149 1054839 1139561 1245107 1374186 1535741 1755038 2034339 2367703
17448B367703M07255M31423L87684L43733L13268L08692K05654Q7809L3806N9326
$$ 2367703 2774958 3206381 3594065 3937798 4251066 4559758 4765412 4853221 4887027 4946353
17438D946353J24323J60070K11637K70904M29506O86997J101701J591321K248257
$$ 4946353 5070676 5230746 5442383 5713287 6142793 6829790 7931491 9522812 11771069
17429A1771069L431588N163287P774547J0939721J3344204J3709764J2385351
$$ 11771069 15202657 20365944 28140491 39080212 52424416 66134180 78519531
17422G8519531J1169165J0590724Q646832K986405m662714r549361j0457092j0379361
$$ 78519531 89688696 100279420 108926252 111912657 107249943 97700582 87243490 76864129
17414G6864129j1698586j2912780j1745596q712661n738282l672814k436679j814162
$$ 76864129 65165543 52252763 40507167 31794506 26056224 22383410 19946731 18132569
17406A8132569j349548j125310j005024q86907q39598p57902o06041m61542l77660
$$ 18132569 16783021 15657711 14652687 13765780 12926182 12168280 11562239 11100697 10723037
17397A0723037l20575k41037j75063k19493k42142j60892q5119r2220j87500k54508
$$ 10723037 10402462 10161425 9986362 9766869 9524727 9363835 9278716 9186496 8998996 8744488
17387H744488j57041n7129m7371j33330j84407p7497L2546J40146K46226M22391
$$ 8744488 8587447 8530318 8482947 8349617 8165210 8087713 8120259 8260405 8506631 8929022
17377H929022P23561R92513J416247K179275L334722N065197P608036J0502569
$$ 8929022 9652583 10645096 12061343 14240618 17575340 22640537 30248573 40751142
17369D0751142J2530741J2434730J0959615R781295R090104O849816J184294n743278
$$ 40751142 53281883 65716613 76676228 86457523 95547627 102397443 103581737 97838459
17361I7838459r545517r865496r674583j0911694j1762720j0258199p375667m780926
$$ 97838459 88292942 78427446 68752863 57841169 46078449 35820250 28444583 23663657
17353B3663657l111466k101222j517439j178865j022165r56219q30016p54069
$$ 23663657 20552191 18450969 16933530 15754665 14732500 13776281 12946265 12192196
17345A2192196p46470p56527o48975n53422m94511m60416m49237m72707m18228
$$ 12192196 11445726 10689199 10040224 9486802 8992291 8531875 8082638 7609931 7191703
17336G191703l62054l19398k75431k73307k25738k05351j60695j95920k07916
$$ 7191703 6829649 6510251 6234820 5961513 5735775 5530424 5369729 5173809 4965893
17327D965893j73150j52233j88098j32439j06160j26814j01885j04856j67271
$$ 4965893 4792743 4640510 4452412 4319973 4213813 4086999 3985114 3880258 3712987
17318C712987j18210o1374r9798j20178r0074o6373j09466j54853p1114p4688
$$ 3712987 3594777 3533403 3433605 3313427 3223353 3156980 3047514 2892661 2821547 2746859
17308B746859j28002j50345o7570q8166o4413n5055n5291k8315k1948k3578q5425
$$ 2746859 2618857 2468512 2400942 2312776 2248363 2193308 2138017 2109702 2087754 2064176 1978751
17297A978751n9925o5173n7465Q437k9685l0271J1213m7794o8713n6899o2274
$$ 1978751 1918826 1853653 1796188 1804625 1774940 1744669 1755882 1708088 1639375 1582476 1520202
17286A520202k1736r265l7078j6481k2507o0761l7986q7354k4784O85j255o7710
$$ 1520202 1498466 1489201 1452123 1435642 1413135 1352374 1314388 1227034 1202250 1202935 1201680 1133970
17274A133970o8778l5143J8577k9446l7495m7340o0237k9462K5239j8731q9907
$$ 1133970 1065192 1030049 1048626 1019180 981685 934345 874108 844646 869885 851154 761247
17263G61247l6765M749k4738r543K1110K1348l969l3669o361l2929k7406k7165
$$ 761247 724482 729231 704493 694950 716060 737408 733439 699770 693409 660480 633074 605909
17251F05909J5447j9772J5740L4616J9132l9208O48k8174k763J232k3407m6811
$$ 605909 621356 601584 617324 651940 671072 631864 632512 604338 601575 602807 579400 532589
17239E32589l9975j8052K7497M2645L2855o1674n7848K1828m384o373L1908j208
$$ 532589 492614 474562 502059 544704 577559 515885 458037 479865 475481 469108 501016 499808
17227D99808k5322m5641k9400l5996j8083L105K3372n2153J715j8214j1624J5758
$$ 499808 474486 428845 399445 363449 345366 348471 371843 319690 321405 303191 291567 307325
17215C07325O55M2371L2101l100j6097k6867R633j9079l6437j5247k2205o091
$$ 307325 307980 350351 382452 379352 363255 336388 346021 326942 290505 275258 253053 246962
17203B46962J9131K6087j2527M9426Q987k2575K9608Q60k778K0029O2766J11868
$$ 246962 266093 292180 279653 329079 338066 315491 345099 345959 343181 363210 425976 537844
17191E37844N6673L4274Q420M7417N284o5494m1935m7893j3012l703o505m1583
$$ 537844 594517 628791 637211 684628 689912 624418 582483 534590 521578 517875 511370 469787
17179D69787j04303l8597m4943K8317l059m7055o480K409k7904J5098j6594k2827
$$ 469787 365484 326887 281944 310261 307202 260147 253667 256076 228172 243270 226676 203849
17167B03849L9832q622l4595j5695j5942J9548J4114k4530M028l4962k59J1662
$$ 203849 243681 235059 200464 184769 168827 188375 202489 177959 181987 147025 146766 158428
17155A58428l910j5046J0234N4126N1993O5398M7166j6531Q360R1166J07098L2513
$$ 158428 154518 139472 149706 203832 255825 321223 368389 351858 360218 451384 558482 590995
17143E90995N1011M4023M1545j3373k3769n299q3768r0914j12752q5795m0010
$$ 590995 642006 686029 727574 714201 690432 685133 601365 510451 397699 311904 271894
17132B71894n8641J2602J5746m563r290n3798j1904k0855P214n933o4819l794
$$ 271894 213253 225855 241601 237038 227748 173950 162046 141191 148405 142472 77653 73859
17120G3859K7942J7878j5359J3678l573K5233J3270J1561k9022m6251l264l6069
$$ 73859 101801 119679 104320 117998 114425 139658 152928 164489 135467 89216 85952 49883
17108D9883m1209m2346k3265J7112N4130M3877k7491m1068K0M6539L2030L2736
$$ 49883 8674 -33672 -56937 -39825 14305 58182 30691 -10377 -10357 36182 68212 100948
17096A00948O0065M1752J6526J8117O7766k3319n7952j4636K5129N6199O4005
$$ 100948 161013 202765 219291 237408 305174 281855 223903 209267 234396 290595 354600
17085C54600J5245n2609n8513k1553l3464N8804M3771j1685p0581n3408k8807
$$ 354600 369845 317236 258723 237170 203706 262510 306281 294596 224015 170607 141800
17074A41800r6797k8885k985J0573K782J6374k918Q262K9155l6270m5532J0719
$$ 141800 45003 16118 13133 23706 26488 42862 39944 48206 77361 41091 -4441 6278
17062F278J6370M2598J0308o2351l56L0771J6309l5501l2093K0548N8132P619
$$ 6278 22648 65246 75554 13203 12847 43618 59927 24426 -7667 12881 71013 78632
17050G8632j1985j2874k3162O013l072P0K0647J9450L2692O065J1143K1565M1163
$$ 78632 66647 53773 30611 36624 33552 33622 54269 73719 106411 112476 123619 145184 186347
17037A86347o187q230J1359K2796j3808o23l4785m2150K5538K4976Q736l9912
$$ 186347 180160 171930 183289 206085 192277 191654 156869 114719 140257 165233 173969 134057
17025A34057j8918J9039K0101q985P524j7504M1593J029o0288n2331k9340l1795
$$ 134057 115139 134178 154279 145294 152818 135314 176907 177936 117648 65317 35977 4182
17013D182J5165R0077J1358n836R341L1209k9028k3404K0371p307K1290j2932
$$ 4182 19347 109424 120782 114946 124287 155496 126468 103064 123435 116128 137418 124486
17001A24486l7673k7734j2097L5378P583Q101o018J5440p839J3062k898k1359
$$ 124486 86813 59079 46982 82360 89943 98044 92026 107466 99627 112689 109791 88432
16989H8432J7911Q325M011M4785q109j0340j1889j4913L1033m657j6286N0888
$$ 88432 106343 114668 118679 163464 155355 145015 133126 118213 149246 144589 128303 179191
16977A79191Q95j4810j4391l4794k6629m8972M393J1565J001j029K2043N4808
$$ 179191 180086 165276 150885 116091 89462 40490 44883 56448 57449 56420 78463 133271
16965A33271K1165q4181j3191l5830J7789Q109M599L6338k5126k7633j267l050
$$ 133271 154436 70255 57064 21234 39023 47132 51731 88069 62943 35310 34043 30993
16953C0993k6154m3938J402K840N558L884O3201O932j3534n2181k289k1207M1952
$$ 30993 4839 -39099 -37697 -34857 -29299 -25415 37786 44718 31184 -20997 -23286 -44493 -2541
16940b541Q0828P3801K5330m1720m5983p145k7094L8330O878q771j0265j4905
$$ -2541 78287 152088 177418 135698 89715 82570 55476 93806 100684 91913 81648 66743
16928F6743k2897K2136l3682R146J221J2889K2567L1132m1166n040J0251K1973
$$ 66743 43846 65982 32300 41446 42667 55556 78123 109255 68089 63049 73300 95273
16916I5273j2030l3740n4542n9O277K7476Q6271L8598m546N5099Q0328K0463O6332
$$ 95273 83243 49503 -5039 -5098 1179 28655 114926 153524 148978 204077 284405 304868 371200
16903C71200O8319M3448J05130P9671K5023n0079m9599m9141j33886j34484o1261
$$ 371200 439519 482967 588097 667768 692791 642712 593113 543972 410086 275602 214341
16892B14341o7098n9580m3678L276R551o181k1550J5375L0446Q623J3805j9051
$$ 214341 147243 87663 43985 47261 56812 50631 29081 44456 74902 83525 97330 78279
16880G8279n6538k0478K175j4822J1629L3628K2210J6164L793p989k2200J432
$$ 78279 21741 1263 3438 -11384 245 33873 56083 72247 76040 68051 45851 47283
16868D7283K7208J1555L3286j5978m5456m9377k2634M1037J0012j671L6441J8305
$$ 47283 74491 86046 119332 103354 57898 8521 -14113 26924 36936 35265 71706 90011
16856I0011l408N2805N0188K7052L1322J9707K5846O2914O9402Q4763O3921J2803
$$ 90011 86603 139408 189596 216648 247970 267677 293523 356437 425839 510602 574523 587326
16844E87326J6887o1620p9060o4009m2064o9998l4451P581o437j03327p1094n664
$$ 587326 604213 542593 463533 399524 357460 287462 253011 260592 254155 150828 79734 74070
16832G4070k5073M2909k2688k6742m732M2760K3167m6643j3374J0975l0461k504
$$ 74070 48997 91906 69218 42476 37744 80504 103671 57028 43654 54629 24168 21664
16820B1664L3750r349K2885J0434n1371m8983l3742j2800M524M8095M8153K5574
$$ 21664 55414 46065 68950 79384 28013 -20970 -54712 -67512 -62988 -14893 33260 58834
16808E8834J8358l8603K9907K3152o650J6903j136P2932N0437k576J1999J7261
$$ 58834 77192 38589 68496 91648 84998 101901 100765 173697 224134 221558 233557 250818
16796B50818J1162N0011L3982O0949L7094r785l5348n6838r899k8159o0664r9217
$$ 250818 261980 311991 345973 406922 444016 434231 398883 342045 332146 303987 243323 144106
16784A44106n800j041j2441j917q63k6281R407n6575l3491L1743k0930l7600q685
$$ 144106 138306 137265 124824 122907 122044 95763 105170 48595 15104 46847 25917 -11683 -20368
16771b0368L2903K2275M6287k6693j6293J241M968j1659j5158p022K1205o103
$$ -20368 12535 34810 81097 54404 38111 39352 44320 32661 17503 10481 31686 25583
16759B5583K7369k4129m89N4978o4288l8157J1659L9435J9402N2743N71J9824
$$ 25583 52952 28823 28334 83312 19024 -19133 -7474 31961 51363 104106 104677 124501
16747A24501O7733P9654N1969Q2718J5667j0835Q1799P0184k2944j8414j3393
$$ 124501 192234 271888 323857 406575 422242 411407 493206 563390 540446 522032 508639
16736E08639o5290k0955l8513r7k9764o4349o6845o8561p065j0180O374j3818
$$ 508639 443349 422394 383881 383784 354020 289671 222826 154265 147200 137020 143394 129576
16724A29576p1473Q910L3205n9761J9914J4599j9220o998N4640p4029K3635K9592
$$ 129576 58103 67013 100218 40457 60371 74970 55750 48752 103392 29363 52998 82590
16712H2590k9869p8783L122O7790O6602J5067M5128L7669J8196o65k1356O7244
$$ 82590 52721 -26062 -22940 44850 111452 126519 171647 209316 227512 226847 205491 272735
16700B72735N5734l4088l1834l2863m8904M358k5134k9051m400O952J5140k3424
$$ 272735 328469 294381 262547 229684 180780 185138 160004 130953 126553 133505 148645 125221
16688A25221M6109O6210p50K099J4850m1953m1009l0840K7082J186J0696m981
$$ 125221 171330 237540 236790 238889 253739 211786 170777 139937 167019 168205 178901 173920
16676A73920k3556n590J6494M064M931l9664j5746k1916k3035m9132J8313K2717
$$ 173920 150364 144774 161268 165332 170263 130599 114853 92937 69902 20770 39083 61800
16664F1800l0584N1640L430J8792L4700l7462R30k4428n7678M2184L9234K3266
$$ 61800 31216 82856 86286 105078 139778 102316 103246 78818 21140 63324 102558 125824
16652A25824P0675P682j0966L3998Q320J2354M3271O0460N2207l6371l8062J5436
$$ 125824 196499 204181 193215 227213 235533 247887 291158 351618 403825 367454 329392 344828
16640C44828j7095n4547p149j4974q6959l3479J7972j0645J7610J0631J562n5361
$$ 344828 327733 273186 266037 251063 164104 130625 148597 137952 155562 166193 167755 112394
16628A12394p2514k0226M2057k0293L1734K3644j0510J6620M1096k9642k0233
$$ 112394 39880 19654 61711 41418 73152 96796 86286 102906 144002 114360 94127
16617I4127k2933k5017p4775m4986n472M0524R1306K1986k0247l2267K6747L211
$$ 94127 71194 46177 -28598 -73584 -79056 -38532 52774 74760 54513 22246 48993 52204
16605E2204R179m718M2194K5982q72o286K7915K2784L4266R282q346L0941N6l6928
$$ 52204 61383 56665 98859 124841 123969 117683 145598 168382 202648 211930 203584 234525 234581 197653
16591A97653j2535K3549j7865o3440k1609p985J3490K0115j9047p74j1686l7697
$$ 197653 185118 208667 190802 127362 105753 97768 111258 131373 112326 111552 99866 62169
16579F2169j2916r8274J7977Q8879K6634n2777j1236L3708J7735l2341j1958J947
$$ 62169 49253 -49021 -31044 57835 84469 31692 20456 54164 71899 39558 27600 29547
16567B9547q127l3883l7345j1289O290N637J2077j2029R961K3672P85O265O484
$$ 29547 21420 -12463 -49808 -61097 -54807 -49170 -37093 -49122 -39161 -15489 -14704 -8439 -1955
16554a955k2374k2970L623n3710n4276k0682J5466O9776P7628M3057k729l4275
$$ -1955 -24329 -47299 -43676 -97386 -151662 -172344 -156878 -87102 -9474 33583 30854 -3421
16542c421K6204k1112l923L1315J7461J7738o078m7136p489L4639l5114K1008
$$ -3421 22783 1671 -2252 29063 46524 64262 58184 11048 3559 38198 3084 24092
16530B4092O2328K7503k0104l4012M965k7135k1580K5353J5169j7061L540L127
$$ 24092 86420 113923 93819 59807 64772 37637 16057 41410 56579 39518 43058 46185
16518D6185j5436J3456k8671m8871M0998N0043j4353p2479K3400K5317M544j5412
$$ 46185 30749 44205 15534 -33337 7661 57704 43351 -29128 -5728 19589 24133 8721
16506H721K8022p653j4659j6263L705L3095r761l6397R29k189j0162K7420L2317
$$ 8721 36743 29090 14431 -1832 1873 34968 25207 -11190 -10261 -12450 -22612 4808 37125
16493C7125j2997o701q49m867K0176l225k4949p8237l93N6758P7089K8096l5939
$$ 37125 24128 17427 16578 11711 31887 28662 3713 -74524 -74917 -18159 58930 87026 51087
16480E1087o7616L531r531k2434j3355N2466K1318J9108l7229j9398J2179K3865
$$ 51087 -16529 -12998 -22529 -44963 -58318 -5852 15466 34574 -2655 -22053 -9874 13991
16468A3991J3802j5503K7510K9097L126o7814p8649N368L9527L8216L7217j5720
$$ 13991 27793 12290 39800 68897 72023 4209 -74440 -69072 -29545 8671 45888 30168
16456C0168q1614K6829j0602k9977K3690M2360K0074j5895j7227j8325L1333m4391
$$ 30168 -51446 -24617 -35219 -65196 -41506 854 20928 5033 -12194 -30519 814 -43577
16444d3577j4464K6839K4918N109j9706O2589O7580q3027l2890K2611J545k5325
$$ -43577 -58041 -31202 -6284 -1175 -20881 41708 109288 26261 -6629 15982 17527 -7798
16432g798J6154N370O81Q672K9230j3978l1350o7820J035L5576M257J1463r224
$$ -7798 8356 13726 14407 23079 52309 38331 6981 -60839 -59804 -24228 -19971 -8508 -17732
16419a7732L3877N6485M5866k3227j6329k8477J2592k5896k7100o290O7640L6681
$$ -17732 16145 72630 118496 95269 78940 50463 63055 37159 10059 3769 71409 108090
16407A08090l6074m1319j4680j2325J181j3371l5325p157K0539O1435L0554j8164
$$ 108090 72016 30697 16017 3692 4873 -8498 -43823 -50980 -30441 30994 61548 43384
16395D3384r815L7570P836m0744k9571J879O660K4276j8848J4773l903p364Q05
$$ 43384 33569 71139 78975 38231 8660 10539 17199 41475 22627 37400 33497 26133 26938
16382B6938m5203j6494m549N0825j3235j739M009l1593p480L5716L1878J180j6434
$$ 26938 -18265 -34759 -39308 11517 -1718 -3457 552 -31041 -38521 -2805 29073 30253 13819
16369A3819L731m514j0223J1974R780k4157K0083L3674Q085o1074j5055l200R9632
$$ 13819 17550 13036 2813 14787 24567 410 20493 54167 62252 1178 -13877 -17077 82555
16356H2555N5582l6430j9878r240m4003k801m659k756K4577K7075J0045o310k1662
$$ 82555 138137 101707 81829 72589 28586 25785 21126 18370 42947 70022 80067 73757 52095
16343E2095k970J8595n9360j7132O3477k7895j7753k8197O513O6343J8630l9915
$$ 52095 49125 67720 8360 -8772 54705 26810 9057 -19140 -12627 53716 72346 32431
16331C2431N182j6519k4193k7868J0387K6309l2445J4171L4575N193k2869l9175
$$ 32431 37613 21094 -3099 -30967 -20580 5729 -26716 -12545 22030 27223 4354 -34821
16319c4821k8592j390M0477j2194K3614K6556J7634l218o7529m5014L7527M1298
$$ -34821 -63413 -64803 -24326 -36520 -12906 13650 31284 28066 -39463 -84477 -46950 -5652
16307e652O6453M7786l7737r722n1430n6339J1868P860k7445J478j6406r723M3327
$$ -5652 60801 108587 70850 61128 9698 -46641 -34773 -26913 -54358 -52880 -69286 -79009 -35682
16294c5682M925%R820M0600N56l7513j0016k2455k306k7712N895M650j9010j4572
$$ -35682 -30757 -30757 -20937 19663 20219 -17294 -27310 -49765 -52071 -79783 -73888 -69238 -88248 -102820
16280a02820K6476k6642N0835L3415J2867l6210K2987q765j2383j6438K1478J9275
$$ -102820 -76344 -102986 -52151 -18736 -5869 -42079 -19092 -27857 -40240 -56678 -35200 -15925
16268a5925M831J9103l2754m8072p060O482q560K6699M4421J1248L5804n87J7418
$$ -15925 -11094 8009 -24745 -72817 -79877 -73395 -81955 -55256 -10835 413 36217 35630 53048
16255E3048j6487J4273j298L875j0050o1555m9708K5172L6327j4632K1246j2264
$$ 53048 36561 50834 49536 53411 43361 -18194 -67902 -42730 -6403 -21035 211 -12053
16243a2053K8278K3555J3200m7273l4053j9162J718J1333K397P951N8394K5322
$$ -12053 16225 39780 52980 5707 -28346 -47508 -45790 -34457 -32060 -24109 34285 59607
16231E9607j5036L881J0120j1755n2843j303K1262j7236k882k2893k2008j5105
$$ 59607 44571 48452 58572 46817 -6026 -7329 13933 -3303 -6185 -29078 -51086 -66191
16219f6191L8616J3519j2304m776M7103m9099q0210N7995N1641J2055l6513K4943
$$ -66191 -27575 -14056 -26360 -31136 15967 -33132 -113342 -55347 -3706 8349 -28164 -3221
16207c221k0516J8635K1440j1053J6014N402j0811k0679m9891Q801K3627k2985
$$ -3221 -23737 -5102 16338 5285 21299 26701 15890 -4789 -54680 -45879 -22252 -45237
16195d5237N890J2335n713K7304M3478k2579j7214o93Q004N7052l6152L276P1401
$$ -45237 -39347 -27012 -32725 -5421 38057 15478 -1736 -2429 5575 62627 26475 29751 101152
16182A01152L1973N83k543M2822M8168N6999L2261L6097Q96K376j9385l799o3896
$$ 101152 133125 133708 131165 173987 222155 279154 311415 347512 348408 350784 331399 327600 263704
16169B63704j5738k3600j7241q099l8456m5067m2982l4022m4439j1703M6047L4187
$$ 263704 247966 224366 207125 199026 160570 115503 72521 38499 -5940 -17643 28404 62591
16157F2591j4750N010K6057m5544m7186J2945J8096L1141k5759p277k5940k4017
$$ 62591 47841 52851 78908 33364 -13822 -877 17219 48360 22601 15324 -10616 -34633
16145c4633O640K0135K1965J1707j4629N631J1940l4806j0617P349Q747K9661
$$ -34633 -27993 -7858 14107 25814 11185 16816 28756 -6050 -16667 -9318 -571 29090
16133B9090R797J2766k3773l8549M4725J25105L7295M4476L8099j7742j7222J1293
$$ 29090 38887 51653 27880 -10669 34056 159161 196456 240932 279031 261289 244067 255360
16121B55360J9313J4848J52p485n7870n3292l3779l8184o1889J349l6081k0510
$$ 255360 274673 289521 289673 282188 224318 171026 137247 99063 37174 38523 2442 -18068
16109a8068K3082J2102Q778J5910L1034J3374j2653L2346j0525m907R169P631
$$ -18068 5014 17116 25894 41804 72838 86212 73559 105905 95380 90473 99642 107273
16097A07273l3837j8536r2405l6037L4712J2657k3626K1412k4918l5349l592m883
$$ 107273 73436 54900 -37505 -73542 -38830 -26173 -49799 -28387 -53305 -88654 -92246 -97129
16085i7129K3582M8774J4140k0288K4383M2705m4133P71J814j5564K5315M5384
$$ -97129 -73547 -24773 -10633 -30921 -6538 36167 -7966 -7195 -5381 -20945 4370 49754
16073D9754K214k7160k8510K8496L384n619J5477k0613l4659l4992J6233J3288
$$ 49754 51968 24808 -3702 24794 28178 22559 38036 17423 -17236 -52228 -35995 -22707
16061b2707J5985J0841K3283j0069j1329n099j3463j5426l8921p100l1504L4680
$$ -22707 -6722 4119 27402 17333 6004 905 -12558 -27984 -66905 -74005 -105509 -70829
16049g0829O4192J4722N3258K9076l7925o7460k7801R507N244M0212j131m2318
$$ -70829 -6637 8085 61343 90419 52494 -14966 -42767 -33260 -28016 12196 11065 -31253
16037c1253j6138N7091K8307k7785m4804K868N487J5521k3559o8160j7744M7006
$$ -31253 -47391 9700 38007 10222 -34582 -31714 -26227 -10706 -34265 -102425 -120169 -73163
16025g3163N858J4637l698j9065L757O3008K4381q832o640r048J6593j5091j9827
$$ -73163 -67305 -52668 -56366 -75431 -71674 -8666 15715 6883 243 -8805 7788 -7303 -27130
16012b7130J4725Q065m556l044l6819M4215J4010n2409K2515K8409k1592o579
$$ -27130 -12405 -4340 -8896 -11940 -48759 -4544 9466 -42943 -20428 7981 -13611 -20190
16000b0190K1962p675J211k5229k0787K0676L2426K8456l0811n4631N732M835
$$ -20190 1772 -5903 -4692 -29921 -50708 -30032 2394 30850 39 -54592 -48860 -44025
15988d4025J2096M0679m6274p3992j0039j4111P935P4495L1914o642R595k0343
$$ -44025 -31929 8750 -37524 -111516 -121555 -135666 -127731 -53236 -21322 -27964 -18369 -38712
15976c8712L7994K413m442l882J7942n32L990j4499k5495m5301k091N4984j8370
$$ -38712 -718 1695 -2747 -6629 11313 10781 14771 272 -25223 -70524 -72615 -17631 -36001
15963c6001M970j5630K3381k6874n4338O6008Q719J1350m3915j8385J3265L8558
$$ -36001 -31031 -46661 -23280 -50154 -104492 -38484 -29765 -18415 -62330 -80715 -67450 -28892
15951b8892k767q184k475J4415L7080J593k4453l6555j1337j7145J336N0644j256
$$ -28892 -31659 -39843 -42318 -27903 9177 10770 -13683 -50238 -61575 -78720 -77384 -26740 -27996
15938b7996p427J8701K1832j7110m5541r51j4058J9790K3209M1616K6303L4427
$$ -27996 -35423 -16722 5110 -12000 -57541 -58492 -72550 -52760 -29551 12065 38368 72795
15926G2795N274k4418J0058k3575o0677k5510k6122k9733M9388K54Q409P047J9856
$$ 72795 78069 53651 63709 40134 -20543 -46053 -72175 -101908 -52520 -52266 -43857 -36810 -16954
15913a6954J1871k0507j9063k9179k715n534K4071K3377K3151K1120l0690J1085
$$ -16954 -5083 -25590 -44653 -73832 -76547 -82081 -58010 -34633 -11482 9638 -21052 -9967
15901i967k2517K515J3076m208q784M9904K414l1323n9882k0275O8235k5247k2727
$$ -9967 -32484 -29969 -16893 -21101 -29885 20019 22433 -8890 -68772 -89047 -20812 -46059 -68786
15888f8786R152P32J5756n4831j5559L2036M8231L8815l763L0539j0842q144O922
$$ -68786 -59634 -58902 -43146 -97977 -113536 -81500 -33269 5546 1783 32322 21480 13336 20258
15875B0258m648K679P181k6191l2041j0003O0506K1982n8954J9676N6247L398
$$ 20258 15610 18289 25470 -721 -32762 -42765 17741 39723 -19231 445 56692 60090
15863F0090p3738n1337q791j315l5537P186K2347L3795J2659P02K625N6566N4487
$$ 60090 -13648 -64985 -73776 -75091 -110628 -103442 -81095 -47300 -34641 -33939 -31314 25252 79739
15850G9739j1606o9512p755K448J9117N27o9898o6887j9163L8345L3719M5932
$$ 79739 68133 -1379 -9134 -6686 12431 12958 -56940 -123827 -142990 -104645 -70926 -24994
15838b4994n23O699j7431o0484M9886k19J6019N768L1643J685m7195J1973L1650
$$ -24994 -25517 -18818 -36249 -96733 -46847 -47066 -31047 -25279 6364 8049 -39146 -27173 4477
15825D477J4482k5760o743R626j5251k1597o233P009j305J4777M56Q774J3526
$$ 4477 18959 -6801 -13544 -3918 -19169 -40766 -46999 -39990 -41295 -26518 -26062 -17288 -3762
15812c762K3511M2837l067n9337q7490N807O3016p070J4467J581j2667j3730l842
$$ -3762 19749 62586 59519 182 -87308 -81501 -18485 -25555 -11088 -9507 -22174 -35904 -39746
15799c9746L7467m6352n537O5093L4401J704k9476M248K8723n037P3224R856q7196
$$ -39746 -2279 -48631 -54168 10925 45326 47030 17554 21802 50525 45488 118712 128568 41372
15786D1372o5597p913K0803K194r017M462J7723k2059k0799N8137k4468o4306
$$ 41372 -24225 -32138 -11335 -9141 -18158 -13696 4027 -18032 -38831 19306 -5162 -69468
15774f9468K9354M5596N3324k9547l9171j2242K1677l3266k3258l4931O2903L7397
$$ -69468 -40114 5482 58806 29259 -9912 -22154 -477 -33743 -57001 -91932 -29029 8368
15762H368j0182j017J996n937m8069k5546O8203K9615K731J2007k6092l3380M46
$$ 8368 -1814 -2831 -835 -6772 -54841 -80387 -12184 17431 20162 32169 6077 -27303 -26857
15749b6857K894Q005K4572J795K3683J9679n3582m4940k2694l3849L5948Q9042
$$ -26857 -23963 -15958 8614 10409 34092 53771 189 -44751 -67445 -101294 -65346 23696
15737B3696j1216l017j7761J4170K7917N90k2203l7439j4147K380K6240K1801
$$ 23696 12480 9463 -8298 5872 33789 34379 12176 -25263 -39410 -37030 -10790 11011
15725A1011k617m0545m5873J5436J2444J2700j1170j66j9415L9110N5224L1736
$$ 11011 8394 -32151 -78024 -62588 -50144 -37444 -48614 -48780 -68195 -29085 26139 57875
15713E7875l0223j017p768J7841j2396m0588N926j7044P413J4283K612J0819r8
$$ 57875 27652 26635 18867 36708 24312 -16276 -10350 -27394 -19981 -5698 -3086 7733 7635
15700G635p229m6184Q15L9220J9592P65j660n7320j5803K4453N208m1527P344
$$ 7635 406 -45778 -44963 -5743 13849 14614 12954 -44366 -60169 -35716 -30508 -72035 -64691
15687f4691K9405M940L1966j3418M370m313K297K5365J6113M663m8541R57m738
$$ -64691 -35286 -30346 1620 -11798 -7428 -11741 -9444 15921 32034 36697 -11844 -10887 -15625
15674a5625l9811o2240L2814L0752l0384m783O460K268M5073Q551l6936k334K699
$$ -15625 -55436 -117676 -84862 -54110 -84494 -89277 -82817 -80549 -35476 -26925 -63861 -66195 -63496
15661f3496J1417M3406l4332k3742K5757j4482p481J3705L06K8256J3641k9939
$$ -63496 -52079 -8673 -43005 -66747 -40990 -55472 -62953 -49248 -48942 -20686 -7045 -36984
15649c6984M655k6668K5898L3158K3557k9319p0488P085k0811j1163L8753K9430
$$ -36984 -32329 -58997 -33099 59 23616 -5703 -76191 -69106 -89917 -101080 -62327 -32897
15637c2897R765J8809O5105l0934o228P479j0287j4387l7750M297J4307K6624
$$ -32897 -23132 -4323 60782 29848 23620 31099 20812 6425 -31325 -27028 -12721 13903
15625A3903m5332O628q78l3233J8522n601l858J7625J607k4568M8357N0128m7505
$$ 13903 -31429 -24801 -25679 -58912 -40390 -45991 -49849 -32224 -30617 -55185 -6828 43300 -4205
15612d205m3436J1289l1963l5914J7977K9711L8250O474k2113M801N0928L742
$$ -4205 -47641 -36352 -68315 -104229 -86252 -56541 -18291 -11817 -33930 -29129 21799 25541
15600B5541j1081r375j9483m7420j6328J4593M5160J8240j0721R596Q872l4473
$$ 25541 14460 5085 -14398 -61818 -78146 -63553 -18393 -153 -10874 -1278 7594 -26879
15588b6879K7431K5458N380o2569k9548J3067M828O271J3043j5124O682n659K839
$$ -26879 552 26010 31390 -31179 -60727 -47660 -42832 -36561 -23518 -38642 -31960 -37619 -34780
15575c4780j6909K5221K9355L9729J6800O061J3998r865j5487j6808k6928k7898
$$ -34780 -51689 -26468 2887 42616 59416 65477 79475 69610 54123 37315 10387 -17511
15563a7511q980j9732N0435K1247N782K6450M3201j6159n7777j2207R717m722
$$ -17511 -26491 -46223 4212 25459 31241 57691 100892 84733 26956 14749 24466 19744
15551A9744l3399R146n653k4124N8699K6531p6682m7778L1920K8226l147o7885
$$ 19744 -13655 -4509 -10162 -34286 24413 50944 -25738 -73516 -41596 -13370 -16517 -84402
15539h4402l2053N836M1137J2631q526K1453N2899K246j3096L2685O338n3163
$$ -84402 -116455 -110619 -69482 -56851 -65377 -43924 8975 11221 -1875 30810 37148 -16015
15527a6015M492L4082p905j682m218m2856j4841K2239P616n4765k5338L5922M2702
$$ -16015 -11523 22559 14654 12972 8754 -34102 -48943 -26704 -19088 -73853 -99191 -63269 -20567
15514b0567K2290j0949P478O9689L7902k9527j0647j6685j2035j2712K4302P994
$$ -20567 1723 -9226 -1748 67941 105843 76316 65669 48984 36949 24237 48539 56533
15502E6533l7327j6095r594o583k3742M7184r403k221P977K6660j1103M549j596
$$ 56533 19206 3111 -6483 -13066 -36808 10376 973 -1248 6729 33389 22286 26835 25239
15489B5239L8776l0313J0944N641J7026l7832p573L2533n29M3567k4050j0221
$$ 25239 64015 33702 44646 50287 67313 29481 21908 54441 53912 97479 73429 63208
15477F3208l45J5926l3622q535R637M3810J6062l1669k3007m5116k0420M637O0435
$$ 63208 62863 78789 45167 36632 46269 90079 106141 74472 51465 6349 -14071 -9434 51001
15464E1001N34j8642J3526L0968n1224j9553K2088m1033N438J3599l7206K2825
$$ 51001 51535 32893 46419 77387 26163 6610 28698 -12335 -6897 6702 -30504 -7679
15452g679Q878P2864N0972q771n0523l4983k5072J0769q685r032K8934L4217K7024
$$ -7679 1199 74063 125035 116264 65741 30758 5686 16455 7770 -1262 27672 61889 88913
15439H8913K193l8711j2569M5835K5152l5308m4852J2504K6468q7424j1529M8271
$$ 88913 91106 52395 39826 85661 110813 75505 30653 43157 69625 -17799 -29328 18943
15427A8943M0328J3789m4649k5434Q964j67O001o022Q501N5431J1552M3502n7639
$$ 18943 59271 73060 28411 2977 11941 11774 17775 11753 20254 75685 87237 130739 73100
15414G3100j4092n8470k6819L1147j6386l5593L4282P334O1013O451K8760j6062
$$ 73100 59008 538 -26281 4866 -11520 -47113 -12831 -5497 55516 61967 90727 74665
15402G4665l216R870j2288m893L0233j2667o683N4933m3298N106l267k9147J8476
$$ 74665 71449 81319 69031 64138 94371 81704 75021 129954 86656 91762 88495 59348 77824
15389G7824l3565j4994J2895K3503O1081m4390o4798J4477L9085M3378k3281k1244
$$ 77824 44259 29265 42160 65663 126744 82354 17556 32033 71118 114496 91215 69971
15377F9971J0749k2193o195L4072P525K597l7014j1126K154m1572N9745M9942
$$ 69971 80720 58527 52332 86404 93929 96526 59512 48386 50540 8968 68713 118655
15365A18655o21q621k8640l5311L1660K1861P255n265J488j2137k0720n939R941
$$ 118655 118034 109413 80773 45462 77122 98983 106238 100973 102461 90324 69604 63665 73606
15352G3606n4497L889J7773J3894J5715q154R2366P638J975J6043k9130j0424
$$ 73606 19109 22998 40771 54665 70380 62226 154592 162230 164205 180248 151118 140694
15340A40694N500k755P617r704M531l198n065Q09k2236n1377M2796R1204L2997
$$ 140694 146194 143439 151056 141352 145883 142685 137620 138429 116193 64816 107612 198816 231813
15327B31813j9219K1932P1189m9433o6403K9635N235k6520k0551j4133J8784L9658
$$ 231813 212594 234526 305715 256282 189879 219514 224749 198229 177678 163545 182329 221987
15315B21987N6833O128k7672j6332K926r52L1110j0671l5303O4565L6145l940
$$ 221987 278820 284948 257276 240944 243870 242918 274028 263357 228054 292619 328764 324824
15303C24824j238J7165p7660m4174M2961J6278K9098N3466J7575k9137j7578j572
$$ 324824 323586 340751 263091 218917 261878 278156 307254 360720 378295 349158 331580 330008
15291C30008j2156J8702K1207p469j1688M3474q822k2749m7722k878N1653J0367
$$ 330008 317852 336554 357761 350292 338604 382078 373256 350507 302785 299907 351560 361927
15279C61927L049K089q044l2456M646N3746k321k4326n0587m8391K4756P529j0600
$$ 361927 364976 367065 359021 326565 331211 384957 382636 358310 307723 259332 284088 291617 281017
15266B81017K6170L9523J756M2389p204m8842o7847J5711o383m030j512m1312
$$ 281017 307187 346710 348466 390855 383651 334809 266962 282673 276290 272260 270748 229436
15254B29436j6049P466q245m2234p016K654K5796K4535j066j4158Q687q412J7661
$$ 229436 213387 220853 212608 170374 163358 166012 191808 216343 215277 201119 209806 201394 219055
15241B19055K5704j5191j9333K452m005o0543m737J6265J319K0498J1626l4964
$$ 219055 244759 229568 210235 212687 208682 148139 143402 159667 160986 181484 193110 158146
15229A58146J6461k8707k6089M2666L1871P995j5436j9947R252m2341m5861n6151
$$ 158146 174607 145900 119811 162477 194348 202343 186907 166960 176212 133871 88010 31859
15217C1859k1104K7781K2177Q4959K099k0900q655L235j3440n060J681M644l4858
$$ 31859 10755 38536 60713 145672 147771 126871 118216 121451 108011 102951 104632 109276 74418
15204G4418j1330k7841j6531K9414O381J5899L3899N9240K4896J8650l7860o2489
$$ 74418 63088 35247 18716 48130 54511 70410 104309 163549 188445 207095 169235 106746
15192A06746m9994l3471K2647L6955L3772m6612k8455k3975K5125N6036K5901
$$ 106746 56752 23281 45928 82883 116655 70043 41588 17613 42738 98774 124675
15181A24675m9640p9312l981L0730J3270J3203k620j6413O397R507j8772J709
$$ 124675 75035 -4277 -8258 22472 35742 48945 46325 29912 36309 45816 27044 28753
15169B8753L1930J9735J4555J2453k895l4338K226L7665k0655l140l6273k5888
$$ 28753 60683 80418 94973 107426 104531 70193 72419 110084 89429 86289 50016 24128
15157B4128j0501J3205r792l4864L3326L4948J6753J3528M499k9411P232j5913
$$ 24128 13627 26832 17040 -17824 15502 50450 67203 80731 85230 55819 63051 47138
15145D7138m4033L964M950p494Q583L2517L5801J5097J466k787j2796j2211l3193
$$ 47138 3105 7069 12019 4525 13108 45625 81426 96523 97989 95202 82406 70195 37002
15132C7002j3200J9812j8194K9283O181R625L4616j9230m0725m1526j3800Q899
$$ 37002 23802 43614 25420 54703 60884 70509 105125 85895 45170 3644 -10156 -1257
15120a257j465N462L2101k3166n621r986L1773L0982K6083j624m0959j2946K291
$$ -1257 -2722 2740 34841 11675 6054 -3932 27841 58823 84906 83282 42323 29377 31668
15107C1668m6260m0370L967N4663J5903M525j3563o0073J9072L9198K9800K9048
$$ 31668 -14592 -54962 -50995 3668 19571 24096 10533 -49540 -30468 8730 38530 67578
15095F7578l6141n2453L1824L042k4125l9149j2448J6989n2413j7239N7820K7876
$$ 67578 31437 -21016 10808 13850 -10275 -49424 -61872 -44883 -97296 -114535 -56715 -28839
15083b8839l6432Q208L8831N3903n830k4733J6752j6702P6663O2808k6053k1342
$$ -28839 -65271 -57063 -18232 35671 29841 5108 21860 5158 81821 144629 118576 97234
15071I7234k7694o4430n431M7400R317n377l0095j0684j4327k5175J8780L8618
$$ 97234 69540 5110 -321 47079 56396 51019 20924 10240 -4087 -29262 -10482 28136
15059B8136j2980j7086l4307R008k783K0068K1906L576K2815m374L375j3350n6315
$$ 28136 15156 -1930 -36237 -27229 -30012 -9944 11962 15538 38353 33979 37354 24004 -32311
15046c2311J6437N2004j4597N926j6154l5787o016J2892O4406K7656K4177M515
$$ -32311 -15874 36130 21533 27459 11305 -24482 -30498 -17606 46800 74456 98633 103148
15034A03148k0495j1440n8895q7930l0390L3826L7705P0658j2327j0170j4253
$$ 103148 82653 71213 12318 -75612 -106002 -72176 -34471 36187 23860 13690 -563
15023e63J1992j2086N2983J0350K0750L8301l2387m3548p961k718K1028j5000
$$ -563 11429 -657 52326 62676 83426 121727 89340 45792 37831 35113 56141 41141
15011D1141j2995K7126J9543m970J3665M8955Q6844O6559R6476J50095N6370K9752
$$ 41141 28146 55272 74815 69845 83510 132465 219309 285868 382344 532439 588809 618561
14999F18561K8250K1622r2831j95782j56082r8053r386J5191l3740k3800K4780
$$ 618561 646811 668433 575602 379820 223738 125685 116299 131490 97750 73950 98730
14988I8730k6489J7064k5322m5239N4160L4150k6664l4083k4142m0628J4711J7618
$$ 98730 72241 89305 63983 18744 72904 107054 80390 46307 22165 -18463 -3752 13866
14976A3866J7345J6020L4347K0850k5853k948l0089k7508j985l8280r373j9382
$$ 13866 31211 47231 81578 102428 76575 73627 43538 16030 14045 -24235 -33608 -52990
14964e2990J4862M426j6848N027k3353k7179N2288L2771K1590K6002l8093l5054
$$ -52990 -38128 -33702 -50550 -45523 -68876 -96055 -43767 -10996 10594 36596 -1497 -36551
14952c6551k3066P444J7197N794L6046l2200K2396P791M795j1334K084p908l411
$$ -36551 -59617 -52173 -34976 -29182 6864 -25336 -2940 4851 9646 -1688 396 -7512 -10923
14939a0923N660J748N316j2434m203k3813j6459L841L3960l644K8287K0470j9126
$$ -10923 -5263 -3515 1801 -10633 -14836 -38649 -55108 -51267 -17307 -20951 7336 27806 8680
14926H680J9554j5212m769j2603L938n4532j5261K1070L2401L1809l7679q483
$$ 8680 28234 13022 8253 -4350 -412 -54944 -70205 -49135 -16734 15075 -22604 -31087
14914c1087q523j7599M3955K8221J4015j6804j4483O518K3376m0438p4974Q004
$$ -31087 -39610 -57209 -13254 14967 28982 12178 -2305 4213 27589 -12849 -87823 -79819
14902g9819Q6421J3455k747j1605j0743k4580J2689k6928k6277N879j5340J621
$$ -79819 6602 20057 17310 5705 -5038 -29618 -16929 -43857 -70134 -64255 -79595 -77974
14890g7974L1494K1869j0058k6675L0672O532l6869L759N6004J7879n413N284
$$ -77974 -46480 -24611 -34669 -61344 -30672 -24140 -61009 -57250 -1246 16633 11220 16504
14878A6504n366l1303K0793M2258K1192K5417m2533p1287r493M0590L5429k846
$$ 16504 11138 -20165 628 42886 64078 89495 46962 -24325 -33818 6772 42201 39355
14866C9355m2136k2920J2915N584k4337k4912n6126j1152L8917N7700K6415K8279
$$ 39355 -2781 -25701 -12786 -7202 -31539 -56451 -112577 -123729 -84812 -27112 -697 27582
14854B7582j9961k638n1506K1281O2618n119j6779O654j3674l0639K5872P96j2972
$$ 27582 7621 4983 -46523 -25242 37376 32257 15478 22132 8458 -22181 3691 4487 -8485
14841h485P067M8401L546m556k1849p896p75J2111o0894M8366K1777l2907j1076
$$ -8485 -1418 46983 50529 45973 24124 16228 15453 27564 -33330 15036 36813 3906 -7170
14828g170K2823N079R897L7748P993j7662j3489j8851L0463L1894j672k8373o2656
$$ -7170 15653 20732 30629 68377 76370 58708 45219 26368 56831 88725 87053 58680 -3976
14815c976q5511M0018M1657M6350L1795R858j2856m5708o4437P235M664L3805
$$ -3976 -89487 -49469 -7812 38538 70333 80191 67335 21627 -42810 -35575 -30911 2894
14803B894M2366M2524l1277m3531k9134m686l3763K5493J0033k6070q370N084
$$ 2894 45260 87784 56507 12976 -16158 -20844 -54607 -29114 -19081 -45151 -53521 -48437
14791d8437j0065j9185k9664k5418J1188J4628P5849P983k0499M4950O2473j2174
$$ -48437 -58502 -77687 -107351 -132769 -121581 -106953 -31104 -23121 -43620 1330 63803 51629
14779E1629k2502l5450p495O892k3325o181r773K5962P979n198J06K3677J1060
$$ 51629 29127 -6323 -13818 -6926 -30251 -36432 -46205 -20243 -12264 -17462 -17356 6321 17381
14766A7381k2586l5039k3865j2314K2025L5412L2106n320L5251K262k0605j5295
$$ 17381 -5205 -40244 -64109 -76423 -54398 -18986 13120 7800 43051 45313 24708 9413
14754I413l7114M9997Q3139J0906p2106j8809k4506J8246o336O542J027J8150
$$ 9413 -27701 22296 105435 116341 44235 25426 920 19166 12830 19372 20399 38549
14742C8549k8305n2066L835P600K6225J5048M167l98l7940Q471l917J8678l545
$$ 38549 10244 -41822 -37987 -30387 -4162 10886 15053 14655 -23285 -14814 -18731 -53 -3598
14729c598P842J3055Q724R6M1554J9857p9326n2954J7800J2030k7461J5232K8330
$$ -3598 4244 17299 26023 26119 67673 87530 8204 -44750 -26950 -14920 -42381 -27149 1181
14716A181K5955L2451k6090j98O308l782J0037M645r546m1142q748o007O114N8027
$$ 1181 27136 59587 33497 33299 39607 35825 45862 50507 40961 -181 -8929 -14936 -8822 49205
14702D9205L0635n3692M014L519L719k9872O221q205j0511M1921q0961p573M0505
$$ 49205 79840 26148 30162 33681 37400 7528 13749 5544 -4967 36954 -44007 -51580 -11075
14689a1075J6050k2618L8293j6337l3525J775P703q873j7316P488l5499j2809
$$ -11075 4975 -17643 20650 4313 -29212 -27437 -19734 -28607 -45923 -38435 -73934 -86743
14677h6743o982L3198O2221J1590n093K478j222j673j5369j4176K8814K9620q090
$$ -86743 -93725 -60527 1694 13284 8191 10669 9447 7774 -7595 -21771 7043 36663 28573
14664B8573m0663j0192k970j4564j5368K726n1543j6180M2581M9375N46k5970
$$ 28573 -12090 -22282 -25252 -39816 -55184 -52458 -104001 -120181 -77600 -28225 -27679 -53649
14652e3649k3782L0082O2536N496O319J3801k3323K3957J5151m4825k9463j4876
$$ -53649 -77431 -47349 15187 20683 27002 40803 17480 41437 56588 11763 -17700 -32576
14640c2576m587P946K3916r300K6356K7027P529o27k1160k7508J8316J081l9501
$$ -32576 -37163 -29217 -5301 -14601 11755 38782 46311 45684 24524 -2984 15332 16413 -23088
14627b3088j425Q975J7493P663Q768M7743l1103j7914j7214j4631O6999K8773
$$ -23088 -24513 -15538 1955 9618 18386 66129 35026 17112 -102 -14733 52266 81039
14615H1039p4206k5284k5546o299O1787o0054m9449L0512K118O517M1260J5852
$$ 81039 6833 -18451 -43997 -50296 11491 -48563 -98012 -67500 -65382 -58865 -17605 -1753
14603a753j3311l157k6601k9786l0038J3156l2328N5881J4144k2463J82r976m85
$$ -1753 -15064 -18221 -44822 -74608 -104646 -91490 -123818 -67937 -53793 -76256 -76074 -86050 -86535
14590h6535N2480K6119k2600k6653j717J9133K7220K8462j8647m9376j3783K3178
$$ -86535 -34055 -7936 -30536 -57189 -58906 -39773 -12553 15909 -2738 -52114 -65897 -42719
14578d2719K661k7155l015n3983L437j1449J5376N2960l386K0415j950M4450K2301
$$ -42719 -40058 -67213 -70228 -124211 -120774 -132223 -116847 -63887 -67273 -46858 -48808 -4358 17943
14565A7943k252k3732k8606k5023k7770l5769N9843L3191j305L2994L9827P987
$$ 17943 15691 -8041 -36647 -61670 -89440 -125209 -65366 -32175 -33480 -486 39341 47328
14553D7328j6796J3356o2070p0652k0396K7802M21N105j390J7351M8160K7907
$$ 47328 30532 43888 -18182 -88834 -109230 -81428 -81007 -75902 -77292 -59941 -11781 16126
14541A6126J1285q673l2986M2139L8671M4446m3380O815Q00k5382p210j9900j9275
$$ 16126 27411 18738 -14248 27891 66562 111008 67628 74443 75243 49861 42651 22751 3476
14528C476k0612p861L0973J873n1036J1725M6044K4692K7704m6466o8297N098
$$ 3476 -17136 -24997 5976 7849 -43187 -31462 14582 39274 66978 20512 -47785 -42687
14516d2687P840O5816O5188Q579k1560j6550l2999o930m622j681j4946J0187L65
$$ -42687 -34847 30969 96157 104736 83176 66626 33627 26697 22075 20394 5448 15635 16000
14503A6000m61m225m991n515q230l5180L4208k7837l211j0172K4087j8993K21
$$ 16000 15539 11314 6323 808 -7422 -42602 -8394 -36231 -39442 -49614 -25527 -44520 -44299
14490d4299M6116P4522L1977k1802k7781o6296L2013O918p34O584J3497j2758
$$ -44299 1817 76339 108316 86514 58733 -7563 24450 31368 30634 37218 50715 37957
14478C7957o2871m1576j993k9257J7332O9538P083j1632j3948l5881j0951J6597
$$ 37957 -24914 -66490 -68483 -97740 -80408 -10870 -3787 -15419 -29367 -65248 -76199 -59602
14466e9602N3826M7121N8951k2302K7765j468J881l1784n9344K6706L047m4542
$$ -59602 -5776 41345 100296 77994 105759 104291 106172 74388 15044 41750 44797 255
14454B55m0736j3583O242k780P509j4646j8261j519N3418j1111J6920N8469j7309
$$ 255 -40481 -54064 -47822 -50602 -43093 -57739 -76000 -77519 -24101 -35212 -18292 40177 22868
14441B2868k9245M5214l720j0475K1268J1903j3854k8185r6597m312O5385J5331
$$ 22868 -6377 38837 35117 24642 45910 57813 43959 15774 -80823 -85135 -19750 -4419
14429d419J0718k6821p220N1561N6828j5988k4166m5003K056P566K0107J6612
$$ -4419 6299 -20522 -27742 23819 80647 64659 40493 -4510 -2454 5112 25219 41831
14417D1831l840O455O511k8612J3460L5030m6910l608L4697j6797l0263M955J6730
$$ 41831 37991 44446 50957 22345 35805 70835 23925 20317 55014 38217 7954 12909 29639
14404B9639n9000l3482K7197K9931j1254m0498M7195q9o809R009m8235j7840J8105
$$ 29639 -29361 -62843 -35646 -5715 -16969 -57467 -10272 -10361 -17170 -8161 -56396 -74236 -56131
14391e6131M6668j3468l5089K1868j4772M066K1283j3850O1297k7282J7228K5814
$$ -56131 -9463 -22931 -58020 -36152 -50924 -46858 -25575 -39425 21872 -5410 11818 37632
14379C7632n5093K3232k6631p523k9559K6869k750o581N228M159K8680Q044l0665
$$ 37632 -17461 5771 -20860 -28383 -57942 -31073 -33823 -40404 -35176 -31017 -2337 5707 -24958
14366b4958J4672j0469m8704k5102j6085L6132K4899J9500J217n1486L6946M2664
$$ -24958 -10286 -20755 -69459 -94561 -110646 -74514 -49615 -30115 -28898 -80384 -43438 -774
14354g74O803R010m4162L430L1328L7164L0733j9506j8726n4940l4113J4300O092
$$ -774 6029 15039 -29123 -25693 5635 42799 73532 54026 35300 -19640 -53753 -39453 -33361
14341c3361K2473O0440M2410J796o9611m3489P708J002j2454M0564K0420m5712
$$ -33361 -10888 49552 91962 93758 24147 -19342 -11634 -10632 -23086 17478 37898 -7814
14329g814K0322K1043j9400j7465k2597j6318p235L323O660K6718j9101l5642
$$ -7814 12508 33551 14151 -3314 -25911 -42229 -49464 -46141 -39481 -12763 -31864 -67506
14317f7506k6068O679J9697J7014J9186O0441K5828n0504o6630K3078N3914O756
$$ -67506 -93574 -86895 -67198 -50184 -30998 29443 55271 4767 -61863 -38785 15129 21885
14305B1885L2408J4351K5821k4497k7076l1625l015l3818m5049j6933J1670K7261
$$ 21885 54293 68644 94465 69968 42892 11267 8252 -25566 -70615 -87548 -75878 -48617
14293d8617N0437n3777m3406M2141L0319m4137J4831K7975n3436r786R218M2723
$$ -48617 1820 -51957 -95363 -53222 -22903 -67040 -52209 -24234 -77670 -87456 -78238 -35515
14281c5515l3249J2879P5342J9647n8638l078m557L9331M425q969l3372L1391
$$ -35515 -68764 -55885 19457 39104 -19534 -22612 -27169 12162 16587 7618 -25754 5637
14269E637l046k7743L0104P2493j2486k0267o8568n5023J8319K1518j282M0681
$$ 5637 2591 -25152 4952 77445 64959 44692 -23876 -78899 -60580 -39062 -40344 337
14257C37k1352l3680K1861L1986p8059p044O7738K0098j6592m6065k3797K0972
$$ 337 -21015 -54695 -32834 -848 -78907 -85951 -18213 1885 -14707 -60772 -84569 -63597
14245f3597k587n448m948J3206O611N465L0412j8908k1177J1744j1451J3714O4087
$$ -63597 -66184 -71632 -76580 -63374 -56763 -51298 -20886 -39794 -60971 -49227 -60678 -46964 17123
14232A7123j4009n3151l4834M4493K6156K9585N222K92k9808R127m4474P819L13
$$ 17123 3114 -50037 -84871 -40378 -14222 15363 20585 20877 -8931 196 -44278 -36459 -36146
14219c6146L2597O827k2656M418j1260j3369L8164N9540k24m122j0354n3663j0969
$$ -36146 -3549 3278 -19378 -14960 -26220 -39589 -1425 58115 57891 53769 43415 -10248 -21217
14206b1217J2591n163q086k3154j3196k1316L5922M5573j8454k4472L578P556
$$ -21217 -8626 -13789 -21875 -45029 -58225 -79541 -43619 1954 -16500 -40972 -37394 -29838
14194b9838j3212j2582P1611M6261m8518l9550O403L6412k5606m9183J1623M134
$$ -29838 -43050 -55632 15979 62240 13722 -25828 -19425 16987 -8619 -57802 -46179 -42045
14182d2045K50K9494n342P272Q181R348L446K2322j0323L904J1163k3938k8157
$$ -42045 -41795 -12301 -17643 -10371 -2190 7158 10604 32926 22603 26507 37670 13732 -14425
14169a4425k0759n4002J7017J1982N3426J5316K72O066j8285j7061J344j8463
$$ -14425 -35184 -89186 -72169 -60187 -6761 8555 8827 14893 -3392 -20453 -19109 -37572
14157c7572l502j6618M0021M0089L8036l8058l4967k1690K4318l4758L5666L4600
$$ -37572 -41074 -57692 -17671 22418 60454 22396 -12571 -34261 -9943 -44701 -9035 25565
14145B5565L3587l6118k9835m691k015l04n176j8021Q323m8973l5207L1661J3403
$$ 25565 59152 23034 -6801 -11492 -13507 -13811 -18987 -37008 -28685 -77658 -112865 -81204 -67801
14132f7801N2786K6038M6029J9938k9551l1416l8764J0119K3350J282N249M694
$$ -67801 -15015 11023 57052 76990 47439 16023 -22741 -12622 10728 12010 17259 21953
14120B1953k124j7223K7868m6341n760J3029q322J1559M1270N9776k9803k4571
$$ 21953 19829 2606 30474 -15867 -21627 -8598 -16920 -5361 35909 95685 65882 41311
14108D1311m409K7820j3139n0390J0910J8076O511k4059m24m0173K5375M5123
$$ 41311 36902 64722 51583 1193 12103 30179 36690 12631 12207 -27966 -2591 42532
14096D2532k6625l8884J548L4364J0688L8895j1271M972L4540L3556j9824l6317
$$ 42532 15907 -22977 -21429 12935 23623 62518 51247 56219 90759 124315 104491 68174
14084F8174m8808j4810K0139J4730P404l0613m2195J8175j610L1821L8834k4496
$$ 68174 19366 4556 24695 39425 46829 16216 -25979 -7804 -9414 22407 61241 36745
14072C6745m6606L2996k3178j2719l1484j0218Q159l7686j1086K0229M8977l3601
$$ 36745 -9861 23135 -43 -12762 -44246 -54464 -46305 -83991 -95077 -74848 -25871 -59472
14060e9472l2255J6989N5186L5212m2727j7678J8965K8408l7175j4300M7817J9024
$$ -59472 -91727 -74738 -19552 15660 -27067 -44745 -25780 2628 -34547 -48847 -1030 17994
14048A7994j9633j7342j808L4669l1041L2529K1705j3358l9957k7314L5295O418
$$ 17994 -1639 -18981 -20789 13880 -17161 15368 37073 23715 -16242 -43556 -8261 -1843
14036a843k9589j3363N150R58j6402J9900M2441l6762j5020J896J8959n361j055
$$ -1843 -31432 -44795 -39645 -38687 -55089 -35189 7252 -29510 -44530 -42634 -23675 -29036 -30091
14023c0091k543j0199l5195L0948M7325L3937m944p2734m0694M234j3779L2670
$$ -30091 -32634 -42833 -78028 -47080 245 34182 29238 -43496 -84190 -79956 -93735 -61065
14011f1065M4002K4845k547O719R167n3392m7506J576J8202L6613O55p777L9784
$$ -61065 -17063 7782 5235 11954 21121 -32271 -79777 -78201 -59999 -23386 -22731 -30508 9276
13998I276J9096j7557j6119q7535k8722R942M8818L2900M4811K0285K9786R027
$$ 9276 28372 10815 -5304 -92839 -121561 -111619 -62801 -29901 14910 35195 64981 74008
13986G4008j5256j8761m9394L693R773k3929o581K6214l9182J3010L3652p050
$$ 74008 58752 39991 -9403 -5710 4063 -19866 -26447 -233 -39415 -26405 7247 197
13974A97N0729j9086j1211J4373l5321l9724j8655J8865N9930K1038k5438J8563
$$ 197 50926 31840 20629 35002 -319 -40043 -58698 -39833 20097 41135 15697 34260
13962C4260K9788j7812j3379k1629r818O1514j6657j7422j9336l1773p033K7006
$$ 34260 64048 46236 32857 11228 1410 62924 46267 28845 9509 -22264 -29297 -2291
13950b291j0754p2526k3797M4155M731K3414N4359j0635j0257J3611J8065l1899
$$ -2291 -13045 -85571 -109368 -65213 -60482 -37068 17291 6656 -3601 10010 28075 -3824
13938c824o4902l9502j9149J3273K9235K3969M4328Q266q383o1670K4675M2159
$$ -3824 -68726 -108228 -127377 -114104 -84869 -60900 -16572 -8306 -16689 -78359 -53684 -11525
13926a1525n6736N61M7951P929k4257J2357J1845n1040m3951L7949L2178K794
$$ -11525 -68261 -67700 -19749 -11820 -36077 -23720 -11875 -62915 -106866 -68917 -36739 -33945
13914c3945m934n858K6470N9M08l2853l0208J1295L462l564J5009o1607L372R4854
$$ -33945 -38879 -44737 -18267 -18208 -17800 -50653 -80861 -69566 -66104 -69668 -54659 -116266 -112894 -18040
13900a8040K6613L44N912l0767m5887K3626M9140R088l6117M6147K722l4860k9924
$$ -18040 8573 8917 14829 -15938 -61825 -38199 10941 20029 -16088 30059 32781 -2079 -32003
13887c2003J066m218L5417K7651l3421k2029P1900K4569k4658M7756k799o3036
$$ -32003 -30937 -35155 262 27913 -5508 -27537 44363 68932 44274 92030 89231 26195
13875B6195l1512K8737L0773R951k5575o2502K6091j1961J680k3146J5146Q626
$$ 26195 -5317 23420 54193 64144 38569 -23933 2158 -9803 -8123 -31269 -16123 -7497
13863g497r759l567o482l7719K2093N6820q26O793o23J5993O444J8380L722j5827
$$ -7497 -17256 -20823 -27305 -65024 -42931 13889 13063 19856 19233 35226 41670 60050 63772 47945
13849D7945K234j4214l122j6399N509p580J2091K5394J32j9896j227J3549k0666
$$ 47945 50179 35965 32843 16444 21953 14373 26464 51858 51990 32094 30867 44416 23750
13836B3750J253J0563j4672n7336p114j1298j3360L776L3564K137p854J0661K6729
$$ 23750 25003 35566 20894 -36442 -43556 -54854 -68214 -64438 -30874 -28737 -36591 -25930 799
13823G99p0110o5279j426N3335M6757K2338n889O682K2340J6097j0606J5158l4732
$$ 799 -69311 -134590 -136016 -82681 -35924 -13586 -19475 -12793 9547 25644 15038 30196 -4536
13810d536p382J3236q752N345M100n216J4005O8040N3983M3708J7108l3159m8643
$$ -4536 -11918 1318 -7434 -2089 2011 -3205 10800 78840 132823 176531 193639 160480 111837
13797A11837L809j5255k3705o3834J2005N1267l573j6211J4627r658k5612j8270
$$ 111837 115646 100391 76686 12852 24857 76124 72551 56340 70967 61309 35697 17427
13785A7427p681N345J2489o1195k1851p248M0666J6525l9509K951N7580L9683
$$ 17427 9746 15091 27580 -33615 -55466 -62714 -22048 -5523 -45032 -42081 15499 55182
13773E5182k85O614l9688q805J4206M059J1368l4631p39k3841n52N1206J6951
$$ 55182 54897 61511 21823 13018 27224 31283 42651 8020 7281 -16560 -17112 34094 51045
13760E1045k4062j7995l1633j4285J8819k3608k0093k748l72K4185O775M60j902
$$ 51045 26983 8988 -22645 -36930 -18111 -41719 -61812 -64560 -64932 -40747 -33972 -33512 -35414
13747c5414j1957o865L1916Q809J6741n544k5021k2299J4579l0335L6247J7824
$$ -35414 -47371 -54236 -22320 -13511 3230 -2314 -27335 -49634 -35055 -65390 -29143 -11319
13735a1319k0805l0260q092k814J3881k172j461m6748K1618R4072K6231K3467
$$ -11319 -32124 -62384 -70476 -73290 -59409 -61581 -63042 -109790 -88172 5900 32131 55598
13723E5598m2649j9297n712r486J4433L8490N9066k3734o1818o7384k5744j1275
$$ 55598 12949 -6348 -12060 -21546 -7113 31377 90443 66709 4891 -62493 -88237 -99512
13711i9512R005J679Q651L5617K7728K0946k8453J8305K8589K5771N264l1308
$$ -99512 -90507 -88828 -80177 -44560 -16832 4114 -24339 -6034 22555 48326 53590 22282
13699B2282m1011m2569j9782J805L0652K0081K7592k449r413N6219L4398j1362
$$ 22282 -18729 -61298 -81080 -79275 -48623 -28542 -950 -3399 -12812 43407 77805 66443
13687F6443l6418o354l3756m6116K3003N0092K1035l0754o461P28l9348k7758
$$ 66443 30025 23671 -10085 -56201 -33198 16894 37929 7175 714 1442 -37906 -65664
13675f5664P082O6692L2338m6037m0636k194J8827p428L5646O032K7861j0731
$$ -65664 -58582 8110 40448 -5589 -46225 -48419 -29592 -37020 -1374 4658 32519 21788
13663B1788j4825j2048j2211k3757m3193L2193J9932m0509J3520J4961J9067l3584
$$ 21788 6963 -5085 -17296 -41053 -84246 -52053 -32121 -72630 -59110 -44149 -25082 -58666
13651e8666L7506M7713J1266l5364l68j3606j8017O2023p144m3432L4488J7377
$$ -58666 -21160 26553 37819 2455 2087 -11519 -29536 32487 25343 -18089 16399 33776
13639C3776j4743k6995J3055K5198O0654n066l3111k0664J590M9601p173n9876
$$ 33776 19033 -7962 5093 30291 90945 85879 52768 32104 33694 83295 76122 16246
13627A6246j5108n409J5580j0691k6022k6254r689J3395L6269l1484M26K5211
$$ 16246 1138 -4271 11309 618 -25404 -51658 -61347 -47952 -11683 -43167 -42741 -17530
13615a7530p671O761K0195K2341P249J6206o7858n5084J0262o903J7125K3915
$$ -17530 -25201 -18440 1755 24096 31345 47551 -20307 -75391 -65129 -72032 -54907 -30992
13603c0992O3484M1640l7396q9026L480J6078J2144N7132K330m4594l5656N7503
$$ -30992 32492 74132 36736 -52290 -48810 -32732 -20588 36544 38874 -5720 -41376 16127
13591A6127O9945j9047k4072K3921p793k3428J8771j1033K978M6660m8114n5287
$$ 16127 86072 67025 42953 66874 59081 35653 54424 43391 46369 93029 44915 -10372
13579a0372m9916l6947J9028N7497L9572L0747n6726m4396k9022K9610M1469k2151
$$ -10372 -60288 -97235 -78207 -20710 18862 49609 -7117 -51513 -80535 -50925 -9456 -31607
13567c1607l5254J8056P326j683K9218M284L5539k237m969K6566K7757n0325j7738
$$ -31607 -66861 -48805 -41479 -43162 -13944 -9660 25879 23642 18673 45239 72996 22671 4933
13554D933n584k1340m1540r608L7681N5664M1974l49l9487l1156j6726J6804K3974
$$ 4933 -651 -21991 -63531 -73139 -35458 20206 62180 61831 22344 -8812 -25538 -8734 15240
13541A5240O094l9511J2860K5109l2492j3826j2029N564j2161r475M7816L9305
$$ 15240 21334 -18177 -5317 19792 -12700 -26526 -38555 -32991 -45152 -54627 -6811 32494
13529C2494K852p322n337N0099J6113J1602q975n1829K708o925R651K6655j2407
$$ 32494 35346 28024 22687 72786 88899 100501 91526 39697 42405 35480 45131 71786 59379
13516E9379n2463j6639M417M2262K5986n0864m9695L4379O7025p640m6812R454
$$ 59379 6916 -9723 -5306 36956 62942 12078 -37617 -3238 63787 56147 9335 18789
13504A8789M266j7446j5125M6896M6867j9593K1201k5216l0277j4621k1710K6572
$$ 18789 23055 5609 -9516 37380 84247 64654 85855 60639 30362 15741 -5969 20603
13492B0603R561j0782k7981K3995n890l4788K5617K6029Q356j6803j4670K9573
$$ 20603 30164 19382 -8599 15396 9506 -25282 335 26364 34720 17917 3247 32820
13480C2820j5046p760J5310J6319J3878P25j4365m0405P057L3770N3717P390R766
$$ 32820 17774 10014 25324 41643 55521 56246 41881 1476 8533 42303 96020 103410 113176
13467A13176l1394l9952l1285R233J5275K8921L8738n195l8264J4359M0150j9400
$$ 113176 81782 41830 10545 19778 35053 63974 102712 97517 59253 73612 113762 94362
13455I4362k6240k4364K1649J5173p1249m3805n264J5001l0089L1294J2184n813
$$ 94362 68122 43758 65407 80580 9331 -34474 -39738 -24737 -54826 -23532 -11348 -17161
13443a7161l746J6012N8386Q1471M2455j9510l5298k1167j360j5885m7453L629
$$ -17161 -20907 -4895 53491 134962 177417 157907 122609 101442 100082 84197 36744 40373
13431D0373L9698n126k6328L0629k010j2870k0886k2455L7248j8090l8134l265
$$ 40373 80071 74945 48617 79246 77236 64366 43480 21025 58273 40183 2049 -1216
13419a216k443M817L6731J6133J103k2906l2713n93p978K6055l4575J515J1095
$$ -1216 -3659 1158 37889 54022 55125 32219 -494 -1087 -9065 16990 -17585 -16070 -4975
13406d975l040k3849k5865L0722K6743K7072J4818L5275K61j987p970l2863r628
$$ -4975 -8015 -31864 -57729 -27007 -264 26808 41626 76901 77162 75175 67205 34342 24714
13393B4714K0139M1275M3664L757Q804L3736j2308j9349k0230L092k9008K8255
$$ 24714 44853 86128 129792 133549 142353 176089 163781 144432 124202 127294 98286 126541
13381A26541N5788m001n500k8847m5291k2358m3924L4953K3896M105p669K5323
$$ 126541 182329 178328 172828 143981 98690 76332 32408 67361 91257 95362 87693 113016
13369A13016K7551K32k2760p452k9919j8376J4046P840o935J5976j7401P633J6909
$$ 113016 140567 140799 118039 110587 80668 62292 76338 84178 77243 93219 75818 83451 100360
13356A00360m6427m667Q531R320J5135N2436r843o4678j036K1056o042m036l0493
$$ 100360 53933 49266 57797 67117 82252 134688 124845 60167 59131 80187 74145 70109 39616
13343C9616j6798J7933M2855M0831L8250m0894k8505Q284k4242N89k6864J2418
$$ 39616 22818 40751 83606 124437 162687 121793 93288 101572 77330 77919 51055 63473
13331F3473L2945J2226O665J3735R697m4814l0520l8012J0125J2494L771K1000
$$ 63473 96418 108644 115309 129044 138741 93927 63407 25395 35520 48014 51785 72785
13319G2785J0857k4965k2356Q771n942k82K1603Q4501M5771o3953k5555J1070
$$ 72785 83642 58677 36321 45092 39150 38868 60471 144972 190743 126790 101235 112305
13307A12305j291p935J1019L3860k2742k3015N8066J9478l0106n4303P120K1072
$$ 112305 111014 103079 114098 147958 125216 102201 160267 179745 149639 95336 102456 123528
13295A23528M921m478n4038k7640M4718L6783n475J9255M981l2003j2150l1468
$$ 123528 128449 123971 69933 42293 87011 123794 118319 137574 142555 110552 98402 66934
13283F6934j4097q986L6564J2550M703J0564k9172k9281J3646N812K8178k537
$$ 66934 52837 43851 80415 92965 97668 108232 79060 49779 63425 69237 97415 94878
13271I4878j1942J3368r671j5929J0557K5263J615O696K5315R045K209l8626l6557
$$ 94878 82936 96304 86633 70704 81261 106524 108139 114835 140150 149195 151404 112778 76221
13258G6221k7769r195M3663O2450M7219j8148k6385m1083o6157j0957K4253P1453
$$ 76221 48452 39257 82920 145370 192589 174441 148056 106973 40816 29859 54112 125565
13246A25565L2183m742l0295p548J9712K1678K9415k6105m3903j1101l3706J7415
$$ 125565 157748 153006 122711 115163 134875 156553 185968 159863 115960 104859 71153 88568
13234H8568M9030J4067m8576l1500M0491M0473K5724j5929n2498j1713O623L551
$$ 88568 137598 151665 103089 71589 112080 152553 178277 162348 109850 98137 104760 108311
13222A08311Q368L1888K3528J3720o0231m198P5380J327l2899p6896m7647K2459
$$ 108311 116679 148567 172095 185815 125584 121386 196766 198093 165194 88298 40651 63110
13210F3110J6712M2835p913L90J473M93Q504R1085J9765l7746k4564L3178J013
$$ 63110 79822 122657 114744 115134 116607 117100 125604 216689 236454 198708 174144 207322 208335
13197B08335J2043J3108j3046J1939k3591j6087J4262j8617m1897q46k028k2969
$$ 208335 220378 233486 220440 232379 208788 192701 206963 188346 146449 145603 143575 120606
13185A20606J4251J4251k7722j7726O524K512J9194P310K105J8906r159L957j5454
$$ 120606 134857 149108 121386 103660 110184 112696 131890 139200 141305 160211 151052 155009 139555
13172A39555L9010N028j8854k9581J7917j2185j9611k6377R267j379k3592L4288
$$ 139555 178565 183593 164739 135158 153075 140890 121279 94902 104169 102790 79198 113486
13160A13486P5083J2711k3899j3059o645q370N5368J6643L8236O0812M4250q939
$$ 113486 188569 201280 177381 164322 157677 149307 204675 221318 259554 320366 364616 355677
13148C55677r807l738k2462k9372j5585k3818o6879j0498L5663M538o415L942
$$ 355677 345870 342132 319670 290298 274713 250895 184016 173518 209181 213719 207304 211246
13136B11246k5652J3056r369j2002J8645J4867N2877N9481l0174j6110N2121Q5328
$$ 211246 185594 198650 189281 177279 195924 210791 263668 323149 292975 276865 328986 414314
13124D14314K4028J2299n4669L2418J11333R5298J60641J18321J32406J04579
$$ 414314 438342 450641 395972 428390 539723 635021 795662 913983 1046389 1150968
13114A150968O6416L599o3965o1607j02293j33497p1207j9255O744n909j6692
$$ 1150968 1217384 1220983 1157018 1095411 993118 859621 788414 769159 775903 769994 753302
13103G53302l5015j123j1823j1956j906P329J1349L9289j4379J5678P0838N6545
$$ 753302 718287 717164 705341 693385 691479 698808 710157 749446 735067 750745 821583 878128
13091H78128O9329J18335L4744O348J02169J32905J26190P0994m281j7594L465
$$ 878128 947457 1065792 1100536 1106884 1209053 1341958 1468148 1539142 1534861 1517267 1520732
13080A520732m0244j01390j05318j09929m8909l7893o6793r0733o6775m18L689
$$ 1520732 1480488 1379098 1273780 1163851 1114942 1077049 1010256 919523 852748 852330 856019
13069H56019k64r435j4684m1583m6439L210K1913J8122o648l8412j3657P1447
$$ 856019 855755 846320 831636 790053 743614 746824 768737 786859 780211 741799 728142 799589
13057G99589N9003O6478J47431J59682R7684Q4401M105j3693K4163m8209j70974
$$ 799589 858592 925070 1072501 1232183 1329867 1414268 1418373 1404680 1428843 1380634 1209660
13046A209660j56508j87992r3329o5181q4161o6256j3083k7767n1724O490m3311
$$ 1209660 1053152 865160 771831 706650 622489 556233 543150 515383 463659 470149 426838
13035D26838K1211l1394n1266l1690j8163K5236K1184j3373m9024r981P8105r314
$$ 426838 448049 416655 365389 333699 315536 340772 361956 348583 299559 289578 367683 358369
13023C58369q252l2239o728P689l2236m1431K7563J8850l1451j2565N331J8917
$$ 358369 350117 317878 311150 318839 286603 245172 272735 291585 260134 247569 252900 271817
13011B71817K8001k8981m3454N5143k6586l1465J1844j3302K294J9328K3244m059
$$ 271817 299818 270837 227383 282526 255940 224475 236319 223017 225311 244639 267883 263824
12999B63824L035J3860K7904m462k573l9915k1488p907K7390K7507J5692Q903
$$ 263824 266859 280719 308623 304161 301588 261673 240185 232278 259668 287175 302867 311770
12987C11770N68p618Q35j119m000o5794J6899J0191j7631L7771M903J0866K0692
$$ 311770 312338 304720 305555 304436 300436 234642 251541 261732 244101 281872 286775 297641 318333
12974C18333O3417o183j2123L7670l6090o8670K8049K6348k7553J5489J138k2980
$$ 318333 381750 375567 363444 401114 365024 296354 324403 350751 323198 338687 339825 316845
12962C16845j5666L9829k8356r859O975l6514j4874J5614J4044L2282N107j1748
$$ 316845 301179 341008 312652 302793 309768 273254 258380 273994 288038 320320 325427 313679
12950C13679K0800Q897l0206L1634k2779K6219r343j9684p917J156J2673M4119
$$ 313679 334479 343376 313170 344804 322025 348244 338901 319217 311300 312456 325129 369248
12938C69248m4351n7801j1695Q6527M1882m2316l4416K5422J5778m5938J1668
$$ 369248 324897 267096 255401 341928 383810 341494 307078 332500 348278 302340 314008
12927C14008M2244k9871q616N1902J643p311O2246K8504l0323J1313L1549J2852
$$ 314008 356252 326381 317765 369667 371310 363999 426245 454749 424426 435739 467288 480140
12915D80140j8039R961M1082J0619l5347l2127K4978K5960M4033J881J932l767
$$ 480140 462101 472062 513144 523763 488416 456289 481267 507227 551260 553141 555073 551306
12903E51306p9974P018K5674J0117j1585M317L5042J7314n0055k3312P930O371
$$ 551306 471332 478350 504024 514141 502556 506873 541915 559229 509174 485862 493792 500163
12891E00163N8850K749m3311lK9178L2347L2113k3308K5070j4357m221L7577o2285
$$ 500163 559013 561762 518451 518448 547626 579973 612086 588778 613848 599491 595270 632847 570562
12878E70562k8821J2553M2245P106J8664l1607l0562M6655J2987N257m4553k383
$$ 570562 541741 554294 596539 603645 622309 590702 560140 606795 619782 625039 580486 578103
12866E78103O9708P1001j8881o2338J4849J169J954Q339O0881p884l2355M784
$$ 578103 647811 718812 699931 637593 652442 653611 655565 663904 724785 716901 684546 689330
12854F89330K1427J2448j7454m251k4451k3605m2596K327K8124j0001n5222m870
$$ 689330 710757 723205 705751 701500 677049 653444 610848 613175 641299 631298 576076 571206
12842E71206M3631R3173K2871n6657r335M6265K0448j9146j5019J0026n2727j0676
$$ 571206 614837 708010 730881 674224 664889 711154 731602 712456 697437 707463 654736 644060
12830F44060k5236l151L3233K683j3625l6485K5184j0388J1997M249j6817O175
$$ 644060 618824 615673 648906 651589 637964 601479 626663 616275 628272 632521 615704 621879
12818F21879N3888K43J4661J9588p0232j6855K3842J4229R1803K3626k279L3007
$$ 621879 675767 676010 690671 710259 640027 623172 647014 661243 753046 776672 774393 807400
12806H07400Q388n3645n821O0650N6240J4576L2774p779K4112Q5234J5744L0426
$$ 807400 815788 762143 756322 816972 873212 887788 920562 912783 936895 1022129 1037873 1068299
12794A068299J35248J25016J01580Q2995R2237J00504J29000K127j6968k8676
$$ 1068299 1203547 1328563 1430143 1513138 1605375 1705879 1834879 1837006 1820038 1791362
12784A791362l8805o2495n9408q2154o8394k1892n2186O244M4183L4682N6802
$$ 1791362 1752557 1690062 1630654 1548500 1480106 1458214 1406028 1412272 1456455 1491137 1547939
12773A547939N4568O8198N2418j000J4141Q3906p064N3447J00324J04161J21357
$$ 1547939 1602507 1670705 1723123 1722123 1736264 1820170 1813106 1866553 1966877 2071038 2192395
12762B192395J27987Q7512J15695M6357R9430J08121M0888N815j9781m6456j2248
$$ 2192395 2320382 2407894 2523589 2569946 2669376 2777497 2818385 2824200 2804419 2757963 2745715
12751B745715m11o343K5982Q2022M7940L0856Q951j1193Q445N0170K6937Q9399
$$ 2745715 2745304 2738961 2764943 2846965 2894905 2925761 2934712 2923519 2931964 2982134 3009071 3098470
12739C098470J18795J55198J86238K20047L03671L84993M94388M79203M83920
$$ 3098470 3217265 3372463 3558701 3778748 4082419 4467412 4961800 5441003 5924923
12730E924923M13757K73232J99755P8376j08588k68009k95631l21957k64440j69392
$$ 5924923 6338680 6611912 6811667 6890043 6781455 6513446 6217815 5895858 5631418 5462026
12720E462026j21664q2937j1771K2732N3670Q0928R5574R7089J11890O3529P5467
$$ 5462026 5340362 5257425 5245654 5268386 5322056 5402984 5498558 5595647 5707537 5771066 5846533
12709E846533J02732J90275K50145K87317L56491L48925M67756N00815M59686
$$ 5846533 5949265 6139540 6389685 6677002 7033493 7382418 7850174 8350989 8810675
12700H810675L04147J20904O9477L9613k7165n4723j24642p0522R4605J14327
$$ 8810675 9114822 9235726 9305203 9344816 9317651 9262928 9138286 9067764 9162369 9276696
12690I276696K02579J56287K36477K42404K54286L04687L61219L99059M43800
$$ 9276696 9479275 9635562 9872039 10114443 10368729 10673416 11034635 11433694 11877494
12681A1877494O87427Q04846R21717J072192J304730J673489K205484K954178
$$ 11877494 12564921 13369767 14291484 15363676 16668406 18341895 20547379 23501557
12673B3501557L928606N331130P325588J0004932J3581856J7858808K1850951
$$ 23501557 27430163 32761293 40086881 50091813 63673669 81532477 103383428
12666A03383428K3999740K2897121J8260304J1369863M084186l181892j0332797
$$ 103383428 127383168 150280289 168540593 179910456 183994642 180812750 170479953
12659A70479953j6530298k0263315k0257505j7066583j2399148p795408m031719
$$ 170479953 153949655 133686340 113428835 96362252 83963104 76167696 72135977
12652G2135977r07296J439183K896451L651090L605348L319403L359122M121979
$$ 72135977 71228681 72667864 75564315 79215405 82820753 86140156 89499278 93621257
12644I3621257N565675P511549R905119J2765504J5664368J8314514K0816707
$$ 93621257 99186932 106698481 116603600 129369104 145033472 163347986 184164693
12637A84164693K2975771K3419337K0399439J3382174M776773k406540p502280
$$ 184164693 207140464 230559801 250959240 264341414 269118187 266711647 259209367
12630B59209367j1884832j6465995j9363113j8041234j3617934q976269o000951
$$ 259209367 247324535 230858540 211495427 193454193 179836259 170859990 164859039
12623A64859039n021353n418044o265977o875623p005971o897342o487536n687725
$$ 164859039 159837686 154419642 148153665 141278042 134272071 127374729 120887193 115199468
12615A15199468m633526l401605k197313j434948r95714k62630J704901N526575
$$ 115199468 110565942 107164337 104967024 103532076 102536362 102273732 103978633 109505208
12607A09505208J0886581J7254677K3702770K8411173K9421801K5176765J6289714
$$ 109505208 120391789 137646466 161349236 189760409 219182210 244358975 260648689
12600B60648689N447014n012352j4580794k3315234l0381243l3114048k9822271
$$ 260648689 266095703 261083351 246502557 223187323 192806080 159692032 129869761
12593A29869761k3130285j6718049j1712092q219685n955356m536758l799726
$$ 129869761 106739476 90021427 78309335 70089650 64134294 59597536 55797810
12586E5797810l417474l249038l153095k924599k703999k430046k133956j961150
$$ 55797810 52380336 49131298 45978203 43053604 40349605 37919559 35785603 33824453
12578C3824453j828981j607409j329689j243847j111359j061137j013900r35423
$$ 33824453 31995472 30388063 29058374 27814527 26703168 25642031 24628131 23692708
12570B3692708q93745q56078p78110p48366p20987p20929o62003o16195n34723
$$ 23692708 22798963 21942885 21164775 20416409 19695422 18974493 18312490 17696295 17161572
12561A7161572n10694n82932n90799m94921l87385m09434l75332l74448l95945
$$ 17161572 16650878 16067946 15477147 14982226 14594841 14185407 13810075 13435627 13039682
12552A3039682l63571l86940l85855m17508l41840l37352k37608k38407k35593
$$ 13039682 12676111 12289171 11903316 11485808 11143968 10806616 10569008 10330601 10095008
12543A0095008k24746j80188k25965k32671j87691j89051k55404k45500k08096
$$ 10095008 9870262 9690074 9464109 9231438 9043747 8854696 8599292 8353792 8145696
12534H145696k45708j91049j98550j92804j50580j34666j17888j75106j58990
$$ 8145696 7899988 7708939 7510389 7317585 7167005 7032339 6914451 6739345 6580355
12525F580355k05008j61164j37659j18167r7699j52163j94401j26690n5359r9934
$$ 6580355 6375347 6214183 6076524 5958357 5860658 5708495 5514094 5387404 5332045 5232111
12515E232111j32955p0148o6217o4208p4528j01757o9336j08616r3459n0897j19166
$$ 5232111 5099156 5029008 4962791 4898583 4824055 4722298 4652962 4544346 4450887 4399990 4280824
12504D280824j82835j23031o5083n9454m7099K0840o0378r8880o2169o1881J853
$$ 4280824 4097989 3974958 3909875 3850421 3803322 3824162 3763784 3664904 3602735 3540854 3542707
12493C542707l7218o3956m969j0586n4352m3006l9819o078J0604K6332M7288J17077
$$ 3542707 3505489 3441533 3436564 3425978 3371626 3328620 3288801 3282723 3293327 3319659 3366947 3484024
12481C484024J22399J71585J23687J32773K5084q0079j36051j37969j87581j89625
$$ 3484024 3606423 3778008 3901695 4034468 4059552 3979473 3843422 3705453 3517872 3328247
12471C328247k10143j86735j27051j03913n2790k5914j09306p5978l0022m8846
$$ 3328247 3118104 2931369 2804318 2700405 2647615 2621701 2512395 2436417 2406395 2357549
12461B357549n7180k5393r5426n8348k3140j6594p8514j00729P224N040j4328
$$ 2357549 2300369 2274976 2179550 2121202 2098062 2081468 2002954 1902225 1909449 1914489 1900161
12450A900161o2616k343l5157o3507m8461L82j8162l9076J6514k0049o3645o3125
$$ 1900161 1837545 1835202 1800045 1736538 1688077 1688459 1670297 1631221 1647735 1627686 1564041 1500916
12438A500916J1433j4029P679k8438o3035O058J1677J656K1531j894n7132K102
$$ 1500916 1512349 1498320 1505999 1477561 1414526 1420584 1432261 1433917 1455448 1453554 1396422 1398524
12426A398524o3361j353K0054K3531Q0609J9156J9791o96L1098m0134k3025k9876
$$ 1398524 1335163 1333810 1353864 1377395 1458004 1477160 1496951 1496255 1527353 1487219 1464194 1434318
12414A434318o9682m9984J9904K3673k5671K3784M8096L5042l8967J295J8129
$$ 1434318 1364636 1314652 1334556 1358229 1332558 1356342 1404438 1439480 1400513 1401808 1419937
12403A419937M1600l5087L0227J9999J6518K1520m013N7958J29485J15987J28280
$$ 1419937 1461537 1426450 1456677 1476676 1493194 1514714 1510701 1568659 1698144 1814131 1942411
12392A942411J24821J65996K56011K09588J82362J58529J67003P1816M941o2902
$$ 1942411 2067232 2233228 2489239 2698827 2881189 3039718 3206721 3278537 3283478 3220576
12382C220576n4277j42472j36699j47160j82504j10478r5835q5725q2777p8288
$$ 3220576 3166299 3023827 2887128 2739968 2557464 2446986 2351151 2265426 2182649 2104361
12372B104361k1076m544m2164m243J7654o7857o4730J1710L1682N8248O0552R1511
$$ 2104361 2083285 2078741 2036577 2032334 2049988 1982131 1917401 1929111 1960793 2019041 2079593 2171104
12360B171104j736L6974P0256R5789L9482L4653m0685o7816O3173J8050n0539
$$ 2171104 2169368 2206342 2276598 2372387 2411869 2446522 2405837 2338021 2401194 2419244 2368705
12349B368705o098l2874N666L8711J0697J9132L0809L8016o667j4639J4625L9489
$$ 2368705 2362607 2329733 2335399 2374110 2384807 2403939 2434748 2472764 2466097 2451458 2466083 2505572
12337B505572J07665R3677K2686j6338P994k3266n1888n889o0754j1041O8477
$$ 2505572 2613237 2706914 2729600 2713262 2721256 2697990 2646102 2640213 2579459 2568418 2636895
12326B636895O9799P3270O6577R4136L7399l4055q540L822L7848P8620L1712O1981
$$ 2636895 2706694 2779964 2846541 2940677 2978076 2944021 2935481 2939303 2977151 3055771 3087483 3149464
12314C149464O2443N6385K7685M5348P389O7751P2537O1221O8593P0117O0248
$$ 3149464 3211907 3268292 3295977 3341325 3348714 3416465 3489002 3550223 3618816 3688933 3749181
12303C749181M3773M7285Q9173J59324J31077J40603J21692Q5853J52579J47057
$$ 3749181 3792954 3840239 3929412 4088736 4219813 4360416 4482108 4567961 4720540 4867597
12293D867597J12388K02907K06203K45795K38857K73037L44876L57969L89108
$$ 4867597 4979985 5182892 5389095 5634890 5873747 6146784 6491660 6849629 7238737
12284G238737M83455M91116N63890O42779P57936R24227J152462J378303J661533
$$ 7238737 7722192 8213308 8777198 9419977 10177913 11102140 12254602 13632905 15294438
12275A5294438K050338K532228L211308M087148N380069P077242R671987J3371208
$$ 15294438 17344776 19877004 23088312 27175460 32555529 39632771 49304758 62675966
12267F2675966J8285523K4058573K9369288L2105334L0415503K4247152J5265375
$$ 62675966 80961489 105020062 134389350 166494684 196910187 221157339 236422714
12260B36422714N337433m682889j4357402k2392427k6852324k6492628k2029897
$$ 236422714 241760147 237077258 222719856 200327429 173475105 146982477 124952580
12253A24952580j5532167r019612m085706j013523M16547Q02885R51845J069094
$$ 124952580 109420413 100400801 96315095 95301572 95718119 96521004 97472849 98541943
12245I8541943J455283K324286L989617O145960Q102710Q797198Q193766P271884
$$ 98541943 99997226 102321512 106311129 112457089 120559799 129356997 137550763 144822647
12237A44822647O783258P022825Q123394J0148833J3039080J6180200J8251341
$$ 144822647 151605905 158628730 166752124 176900957 189940037 206120237 224371578
12230B24371578J7916232J5142714J0509765M511478k556731j0022607j6351900
$$ 224371578 242287810 257430524 267940289 272451767 269895036 259872429 243520529
12223B43520529k0208147k1241044k0523528j8706051j6031637j2890087r881152
$$ 243520529 223312382 202071338 181547810 162841759 146810122 133920035 124038883
12216A24038883p274581n531606m690935m320770m070764l825990l504269k812858
$$ 124038883 116764302 111232696 106541761 102220991 98150227 94324237 90819968 88007110
12208H8007110j281495J197616M404335Q174774J2244320J6175370J9205806K0025819
$$ 88007110 86725615 87923231 92327566 100502340 112746660 128922030 148127836 168153655
12200A68153655J7186766J1386150M150551k895871r350421j5564145k0478539
$$ 168153655 185340421 196726571 200877122 197981251 188630830 173066685 152588146
12193A52588146k2524794k1053121j7172220j2969870r469059o977393n287678
$$ 152588146 130063352 109010231 91838011 78868141 69399082 62421689 57134011
12186E7134011m292900l690787l288245l059431k790065k452371k246111k013237
$$ 57134011 52841111 49150324 45862079 42802648 40012583 37560212 35314101 33300864
12178C3300864j776757j576206j318945j116335r85045q92233p28595n57441m25637
$$ 33300864 31524107 29947901 28628956 27512621 26527576 25635343 24906748 24349307 23923670
12169B3923670m19515l98851m27486m65867o13790o78166p78444q62498r12787
$$ 23923670 23504155 23105304 22677818 22211951 21598161 20919995 20141551 19279053 18366266
12160A8366266q58213p80572p07599n88583n62080m62601m60339m25408l69336
$$ 18366266 17508053 16727481 16019882 15431299 14869219 14406618 13946279 13520871 13151535
12151A3151535l76139l71799l47130l59352l23889l58527l40235k39907k87571
$$ 13151535 12775396 12403597 12056467 11697115 11373226 11014699 10674464 10434557 10146986
12142A0146986k53446k68491k41167k49444j79068j67748k12018j86409j65835
$$ 10146986 9893540 9625049 9383882 9134438 8955370 8787622 8575604 8389195 8223360
12133H223360j52160j09842r4267r9766j57661j37739j49308j12232j48493j58137
$$ 8223360 8071200 7961358 7867091 7767325 7609664 7471925 7322617 7210385 7061892 6903755
12123F903755k04828j94404j94938j67270k18644j73226q4816j25558j53084j12156
$$ 6903755 6698927 6504523 6309585 6142315 5923671 5750445 5665629 5540071 5386987 5274831
12113E274831n9601m8829q3411j5952M16j9305j7972L543k5121l6986m5371q1548
$$ 5274831 5215230 5166401 5082990 5067038 5067454 5048149 5030177 5033720 5008599 4971613 4926242 4844694
12101D844694j03544j05196j04276j05663j56510j63724j25209j31577o1177l4990
$$ 4844694 4741150 4635954 4531678 4426015 4269505 4105781 3980572 3848995 3787818 3752828
12091C752828j24312j13968n0341m0334p9945k744j3604j0973p3813j09297P850
$$ 3752828 3628516 3514548 3464207 3423873 3343928 3341184 3327580 3316607 3242794 3133497 3141347
12080C141347L6782O9613M2102J06878R1024N3358L9455j4159l9282r8187r8207
$$ 3141347 3178129 3247742 3289844 3396722 3487746 3541104 3580559 3566400 3527118 3428931 3330724
12069C330724j33479j62472k17315q6622p9559o7413q6248j19184p2633p7419
$$ 3330724 3197245 3034773 2817458 2730836 2651277 2583864 2497616 2378432 2305799 2228380
12059B228380j4173o7671j13428k2327j830k5164k8070j2786N390j837J9411M9272
$$ 2228380 2214207 2146536 2033108 2010781 2008951 1983787 1955717 1942931 1948321 1946484 1965895 2015167
12047B015167Q2571M5550M1650J6485j7539m7249l2856l7371p4639q1743j05785
$$ 2015167 2097738 2143288 2184938 2201423 2183884 2136635 2103779 2066408 1991769 1910026 1804241
12036A804241j26530j05725n6115n3573o9529n7325q7475o4652j09542J4261L2679
$$ 1804241 1677711 1571986 1515871 1462298 1392769 1335444 1247969 1183317 1073775 1088036 1120715
12025A120715k6307r1788j8976m447Q557J0697q413R231J4917N256N5611j8925
$$ 1120715 1094408 1002620 983644 979197 987754 998451 990038 999269 1014186 1019442 1075053 1056128
12013A056128j0129j4863n1199q139l151N087j6173m6521q653J7980l0752n3582
$$ 1056128 1045999 1031136 979937 971798 968647 973734 957561 911040 902387 920367 889615 836033
12001H36033n4465r398m6321l8366k9256j155k7491l7468M3477K1559j8085j9595
$$ 836033 781568 772170 725849 687483 658227 657072 629581 592113 635590 657149 639064 619469
11989F19469p2238J4964J3875k7208k5234k4931j0695K7909M8786J222j3649J5308
$$ 619469 547231 562195 576070 548862 523628 498697 488002 515911 564697 565919 552270 567578
11977E67578k9495l4882m027j7745K9195l1001n7043L393K6572L320j8126j1737
$$ 567578 538083 503201 499174 481429 510624 479623 422580 425973 452545 455865 437739 426002
11965D26002m182q358J229l3341m7935l4816q512n2945K3753L6313M0662j2631
$$ 426002 421820 413462 414691 381350 333415 298599 290087 237142 260895 297208 337870 325239
11953C25239L5744o404p833l506k679l020L1439k1750l0231m9820l8916j5281
$$ 325239 360983 354579 346746 343240 340561 337541 368980 347230 316999 267179 228263 212982
11941B12982K0162L3954m572L4355J4081m0476m4507O561J0563m731j268R193
$$ 212982 233144 267098 262526 296881 310962 270486 225979 232540 243103 238372 237104 246297
11929B46297K3366n0434p8161l6549K1250M5195j7207k299Q7456K1168l0616j5457
$$ 246297 269663 219229 141068 104519 125769 170964 153757 151458 238914 260082 229466 214009
11917B14009m6720r577M370L760L2995P089m9284j7093K6441J411J3624P706J5718
$$ 214009 167289 157712 162082 165842 198837 205926 156642 139549 165990 167401 181025 188731 204449
11904B04449J1700l5947l5563m7920P475J1115j7100m5231J2306K7312J9786k3263
$$ 204449 216149 180202 144639 96719 104194 115309 98209 52978 65284 92596 112382 89119
11892H9119j9443l5062K1380N5750L3087m247m4237L6509k0522K415J7632l4341
$$ 89119 69676 34614 55994 111744 144831 140584 96347 132856 112334 114749 132381 98040
11880I8040O0364j8552m979M2192m1728l7247K8212M1050N3206p97R611M38j3454
$$ 98040 158404 139852 134873 177065 135337 98090 126302 167352 220558 219761 229372 229810 216356
11867B16356K022J6587O968j9345j460M977k8187l918N600l2761o858l113L3026
$$ 216356 218378 234965 241933 222588 221128 226105 197918 194000 199600 166839 159981 156868 189894
11854A89894k1217j3680j0337J5108J3008K9946J2966J216m0202k4446k5143l3400
$$ 189894 168677 154997 144660 159768 172776 202722 215688 216904 176702 152256 127113 93713
11842I3713K2798O3307p094J766Q653J1024M3605P832k3564N4539Q8752K1703
$$ 93713 116511 179818 172724 174490 183143 194167 237772 245604 222040 276579 365331 387034
11830C87034J2085N9865J35789J44802J74216J23083P5158R2198J6116l7878l6611
$$ 387034 399119 458984 594773 739575 913791 1036874 1112032 1204230 1220346 1182468 1145857
11819A145857j00013j18431j22046n0733m4242m8533n2117j172k6957j2880j6092
$$ 1145857 1045844 927413 805367 754634 710392 661859 609742 608570 581613 568733 552641
11808E52641J4557J3638J8737J4591j5075o565j466Q7138J20509J21983Q4891
$$ 552641 567198 580836 599573 614164 599089 592524 591058 678196 798705 920688 1005579
11797A005579N7625J13803J11389P4684P6867P687l506j1757M6168o0674n1750
$$ 1005579 1063204 1177007 1288396 1363080 1439947 1447634 1444128 1432371 1478539 1417865 1366115
11786A366115j24620p7851o1010j20747r2803j8985n5741m4777m0156k8588n8691
$$ 1366115 1241495 1163644 1102634 981887 889084 870099 814358 769581 729425 700837 642146
11775F42146n5289m5738J4712L330J7087J8840n5499K317L0879N3155P5157J72860
$$ 642146 586857 541119 555831 559161 576248 595088 539589 541906 572785 625940 701097 873957
11763H73957J65411J02116L8535n22k3115k7253j0296r1525j39905j05979j36369
$$ 873957 1039368 1141484 1180019 1179497 1156382 1129129 1118833 1027308 887403 781424 645055
11752F45055l7553k7381o5786n7832p0540o2432l6952j4578j7230n450Q437j3817
$$ 645055 607502 580121 514335 456503 385963 323531 286579 272001 254771 249321 257758 243941
11740B43941m7220m687p135J0755L2008J1237k8821J261L4316M2068j9664k8403
$$ 243941 196721 192034 184899 195654 227662 238899 210078 211339 245655 287723 268059 239656
11728B39656k053k8808M173M178J2146O1153r448m3055J893l8696l0851K1538
$$ 239656 237603 208795 212968 217146 229292 290445 280997 237942 239835 201139 170288 191826
11716A91826r164j2068M8909L6757K8136J4585M2215R108J3009l209M594O0755
$$ 191826 182662 170594 219503 256260 284396 298981 341196 350304 363313 360104 364698 425453
11704D25453O0265l979O957J3674k0971k2983o50j7233l405j5702n5900n2590
$$ 425453 485718 481739 488696 502370 481399 458416 457766 440533 437128 421426 365526 312936
11692C12936m6852J9742Q420j1828k7052l0736M9100K3475r288j4258K7811O8067
$$ 312936 266084 285826 294246 282418 255366 224630 273730 297205 287917 273659 301470 369537
11680C69537M2637l151j5610m6261P552J08208M2004J1763M1299O816J9086l2036
$$ 369537 412174 409023 393413 347152 354704 462912 504916 516679 557978 564794 583880 551844
11668E51844m0150J5102m927k3198n4101n1694k4639m457L898Q248J7343n712
$$ 551844 511694 526796 521869 498671 444570 392876 368237 363780 367678 375926 393269 387557
11656C87557r5022l5316j7530M3004J3902l3677P900n827P348L4122K9379r54
$$ 387557 292535 257219 239689 282693 296595 262918 270818 264991 272339 306461 335840 334886
11644C34886J2038K9789M6245J6580N791l8359m9360k5880o0259j303L476p705
$$ 334886 346924 376713 422958 439538 445329 406970 357610 331730 271471 270168 273644 265939
11632B65939j2582l4303q4290o6286k2359Q54N9277N8947L1709j897l3474j8023
$$ 265939 253357 219054 134764 68478 46119 46973 106250 165197 196906 195009 161535 143512
11620A43512m4703l5494K64M1515J3687j9709J5442R751L5640R777k0103k2450
$$ 143512 98809 63315 63579 105094 118781 99072 114514 124265 159905 169682 149579 127129
11608A27129Q202M654k3662l4321n352J6574L0422M4319M1157j2829k2236j4914
$$ 127129 135331 139985 116323 82002 76650 93224 123646 167965 209122 196293 174057 159143
11596A59143K8896j9857J1147K6223M1l3679l6080j4838M4527o375l4731j3570
$$ 159143 188039 168182 179329 205552 205593 171914 135834 120996 165523 159148 124417 110847
11584A10847J1777k0048l1894m3352J2280L2207Q514q895N281K3180J2111L199
$$ 110847 122624 102576 70682 27330 39610 71817 80331 71436 76717 99897 112008 115207
11572A15207K0250J1969l9860j1659J2634J5042J0236l2737j1094N0323j6489
$$ 115207 135457 147426 107566 95907 108541 123583 133819 101082 89988 140311 123822
11561A23822l870P177l7730o203L6594N9951L6145K1487j2461q371m5780r870
$$ 123822 119952 127129 89399 83196 119790 179741 215886 237373 224912 216541 170761 160891
11549A60891J9343l9968l0591Q466M4624N409L7172j2461l1213p008L9960M9382
$$ 160891 180234 140266 109675 118141 162765 168174 205346 192885 161672 154664 194624 244006
11537B44006l4605p5727j5692J0554M627l0072o1268j715N7955N5953L4037L2107
$$ 244006 209401 133674 117982 128536 133163 103091 41823 40108 98063 154016 188053 220160
11525B20160J7913l40J6890J3512L1700k5818q1992o9981k6033M2748J5406M6620
$$ 220160 238073 237733 254623 268135 299835 274017 192025 122044 96011 138759 154165 200785
11513B00785j3085k109J1054J6864J6977L6173j3021k9958m1958m071L2645K8466
$$ 200785 187700 185591 196645 213509 230486 266659 253638 223680 181722 177651 210296 238762
11501B38762n7194Q216j6485j5152L8446K047J6537K4321n7890m7324J7869M749
$$ 238762 181568 189784 173299 158147 196593 198640 215177 239498 181608 134284 152153 156902
11489A56902l4640l5954l5370K5644M4171K0933K8165L0015P606K182M2462m509
$$ 156902 122262 86308 50938 76582 120753 141686 169851 199866 207472 209654 252116 247607
11477B47607k3578p596l4576o0061j8868N8679J8330j3532K3110k0502k1239m1337
$$ 247607 224029 216433 181857 121796 102928 161607 179937 166405 189515 169013 147774 106437
11465A06437m9995n2807K8174K5767J7447M7250K9045o5267m6950L7994K3569
$$ 106437 56442 3635 31809 57576 75023 122273 151318 86051 39101 77095 100664
11454A00664k6159M1589L1641P633K6077j6689o0408m1139J2887m1567j838L1604
$$ 100664 74505 116094 147735 155368 181445 164756 104348 63209 76096 34529 32691 64295
11442F4295j7482n0014Q223J3500j455q817J5141J3199N7628m1412k4240N9189
$$ 64295 46813 -3201 5022 18522 17067 8250 23391 36590 94218 52806 28566 87755
11430H7755q843l0577J1583k5341m9951m2527K7416L4475j2896j9902l107L2568
$$ 87755 78912 48335 59918 34577 -15374 -57901 -30485 3990 -8906 -28808 -31915 653
11418F53L0542M1732p720j8321m4644o008J6508j2994J0914k286k1968K6598n75
$$ 653 31195 72927 65207 46886 2242 -3766 12742 -252 10662 8376 -13592 13006 12431
11405A2431l376K8064j9061r612J9945m1007n3764L3861K5744k1070L6515O6586
$$ 12431 9055 37119 18058 8446 28391 -12616 -66380 -32519 -6775 -27845 8670 75256
11393G5256j7424K1617M281k9323p952R138K0154J9283j9667j4471n2996M370
$$ 75256 57832 79449 83730 54407 46455 55593 75747 95030 75363 60892 7896 12266
11381A2266j9671M7220R6464J858m1102l5820l4933O064m961j7284j3037L0055
$$ 12266 -7405 39815 136279 138137 97035 61215 26282 32346 27385 10101 -2936 27119
11369B7119m960l218m7481r458K6929K036J1938j4502m7802j9908N8687N6368
$$ 27119 22159 18941 -28540 -37998 -11069 -9033 2905 -11597 -59399 -79307 -20620 35748
11357C5748o651K6317R327l6995k3883L3001O745j1166l5370j5301l931j1652
$$ 35748 29097 55414 64741 27746 3863 36864 43609 32443 -2927 -18228 -22159 -33811
11345c3811M9870J1294q5951j4363R1836Q0950l3818l1234K1253q220k4181o2582
$$ -33811 16059 27353 -58598 -72961 18875 99825 66007 34773 56026 47806 23625 -38957
11333c8957j3662M3104J5300m2066k6372j2408k0303L4388k677M756L2758J6489
$$ -38957 -52619 -9515 5785 -36281 -62653 -75061 -95364 -60976 -63653 -58897 -26139 -9650
11321i650M4683k7886p3134j1530K5882o352J8868j6057L7244P168K3481K7856
$$ -9650 35033 7147 -65987 -77517 -51635 -57987 -39119 -55176 -17932 -10764 12717 40573
11309D0573K4206L6381l405m4591l1461j2491L509j5569J8829J4615L3229l1302
$$ 40573 64779 101160 97755 53164 21703 9212 12721 -2848 15981 30596 63825 32523
11297C2523m8048N4322j4515l525K014N0300j1083p558J3752P466J8318k624o2464
$$ 32523 -15525 38797 24282 20757 22771 73071 61988 54430 68182 75648 93966 91342 28878
11284B8878j8384m2514L577J7464n8387l0655K3934M9962K0374J6106j4601l4510
$$ 28878 10494 -32020 -28443 -10979 -69366 -100021 -76087 -26125 -5751 10355 -4246 -38756
11272c8756L0444m733k5097K6439N3300L0691m5663p3125o7567o50L3592Q0904
$$ -38756 -8312 -13045 -38142 -11703 41597 72288 26625 -46500 -114067 -114717 -81125 -221
11260b21J5038K222O1808J1878n6741p819k0500k180j1537P505L9454j823j235
$$ -221 14817 17039 78847 90725 33984 26165 5665 3485 -8052 -547 38907 37084 35849
11247C5849l3709k2994k1486o196L2111J3486M1058K7969o0572R348o603o1492
$$ 35849 2140 -20854 -42340 -48536 -16425 -2939 38119 66088 5516 14864 8261 -53231
11235e3231j5490j0590r711O4847k9803k2408K7692o649M0689M8042N9107K3072
$$ -53231 -68721 -79311 -89022 -24175 -53978 -76386 -48694 -55343 -14654 33388 92495 115567
11223A15567l1155r5732m0902K096k670j8905k7474K8564M4092n7541O940L2422
$$ 115567 84412 -11320 -52222 -50126 -52796 -71701 -99175 -70611 -26519 -84060 -77120 -44698
11211d4698j8134m332L0671K8050l2130j0676J9414J8838k2636l7175K4793N6779
$$ -44698 -62832 -67164 -36493 -8443 -40573 -51249 -31835 -12997 -35633 -72808 -48015 8764
11199H764N7665l9556o7178j4039K6666J4060O580k3742k4266K6754K7019M2841
$$ 8764 66429 26873 -40305 -54344 -27678 -13618 -7038 -30780 -55046 -28292 -1273 41568
11187D1568k8692R716N5059n227k8448o637j8442l0435M8371L3958K3713L502
$$ 41568 12876 22592 77651 72424 43976 37339 18897 -11538 36833 70791 94504 98006
11175I8006l2683k7390o976l7818r1850l5934L4150R316L3407M5534j6745j4721
$$ 98006 65323 37933 30957 -6861 -98711 -134645 -100495 -91179 -57772 -12238 -28983 -43704
11163d3704q646N6891L5854j9582K2211J7624J911r076n2943k9162J7090K743
$$ -43704 -52350 4541 40395 20813 43024 60648 62559 53483 540 -28622 -11532 -8789
11151h789J5820l5442j01413N571M9049M8291J9846K7292J1090k4808k1126N3729
$$ -8789 7031 -28411 -129824 -124253 -75204 -26913 -7067 20225 31315 6507 -14619 39110
11139C9110N8975J2002l0743m1834N159R067o455j7875o868R228J3088k8950K8170
$$ 39110 98085 110087 79344 37510 42669 51736 45281 27406 20538 29766 42854 13904 42074
11126D2074j9553j6604M8011K4296q2638l3434M3296L3577k3829n1367M854J0011
$$ 42074 22521 5917 53928 78224 -4414 -37848 5448 39025 15196 -36171 -31317 -21306
11114b1306j158J280k093J2409J6594j4806o614j8399n74Q486J2380R177K3898
$$ -21306 -22464 -21184 -23277 -10868 5726 -9080 -15694 -34093 -34667 -26181 -13801 -4624 19274
11101A9274K1607J9270k6331o892J2802L2735l5466j5145n856j0795n8956M2791
$$ 19274 40881 60151 33820 26928 39730 72465 36999 21854 15998 5203 -53753 -10962
11089a0962L7286m1490k5083K3869L9460l1231l3943m0257j644m1218j219M1785
$$ -10962 26324 -15166 -40249 -16380 23080 -8151 -42094 -82351 -83995 -125213 -126432 -84647
11077h4647M4106M3444m5613q414Q98k3277k9801n187K6922L5279K9793L6673
$$ -84647 -40541 2903 -42710 -51124 -50226 -73503 -103304 -108491 -81569 -46290 -16497 20176
11065B0176M1332J6997J2981l0589n608l0855j7762L924l8820n728L8072M7929
$$ 20176 61508 78505 91486 60897 55289 24434 6672 10596 -28224 -33952 4120 52049
11053E2049J320n230J4309j1714k0351k5072k646M46J7399j5242j2050q197K0426
$$ 52049 53369 48139 62448 50734 30383 5311 2665 3111 20510 5268 -6782 -14979 5447
11040E447k4167l1950O547N7719M4881j7128k3891k5856j0625J3490k6350k641
$$ 5447 -18720 -50670 -44123 13596 58477 41349 17458 -8398 -19023 -5533 -31883 -34524
11028c4524J9020K745K6443k6948k5863J6043l886m4547J633K0919M6390q24l6839
$$ -34524 -15504 -12759 13684 -13264 -39127 -23084 -26970 -71517 -69884 -48965 -2575 -3399 -40238
11015d0238j1703M9572L6925j617k1279M623k1615n8623l6052M6075M1647O7413
$$ -40238 -51941 -2369 34556 32939 11660 16283 -5332 -63955 -100007 -53932 -12285 55128
11003E5128j2023k5474N215l3015o75J6715N242j1298J9128l4957n4995J2157
$$ 55128 43105 17631 22846 -10169 -10844 5871 11113 -185 18943 -16014 -71009 -58852
10991e8852K3102J0K8724K4488J1860J1296j2592j1720k0034j6330J2741J2212
$$ -58852 -35750 -35740 -7016 17472 29332 40628 28036 16316 -3718 -20048 -7307 4905
10979D905k8934j1059L2122q805k5173m367M1432l135l4518j1498Q104j9177m2932
$$ 4905 -24029 -35088 -2966 -11771 -36944 -41311 121 -3014 -37532 -49030 -40926 -60103 -103035
10966a03035L5863N3284n277o274k8838j0617K3449J6888Q936J4422j3325p0859
$$ -103035 -67172 -13888 -19165 -25439 -54277 -64894 -41445 -24557 -15621 -1199 -14524 -85383
10954h5383k2899J0618l822J2758P523K7437L4861K6236m957K7440J4066M191
$$ -85383 -108282 -97664 -101486 -88728 -81205 -53768 -18907 7329 2372 29812 43878 48069
10942D8069L544l7107l8865N6910L1901J3748k7096n3273k3475k6547K0045J0217
$$ 48069 51613 14506 -24359 32551 64452 78200 51104 -2169 -25644 -52191 -32146 -21929
10930b1929K8286J5412n218m6807J727K3904j4457l8829j1505j687K9750K5616
$$ -21929 6357 21769 16551 -30256 -28529 -4625 -19082 -57911 -69416 -71103 -41353 -15737
10918a5737j5974Q813L2799M0154J5504j6476m3372l9673j037L116r005m4732
$$ -15737 -31711 -22898 9901 50055 65559 49083 5711 -33962 -34999 -31883 -40888 -85620
10906h5620k2904P516J4959J5526N1632O612m0613j9790n5052L7877j2879j7910
$$ -85620 -108524 -101008 -86049 -70523 -18891 -12279 -52892 -72682 -127734 -89857 -102736 -120646
10894a20646M4985K9251n8486L4954J0580n3137K9213K8958l2603L528L8356k4618
$$ -120646 -75661 -46410 -104896 -69942 -59362 -112499 -83286 -54328 -86931 -83403 -45047 -69665
10882f9665K1185Q544l402K0352j2188k1286n014J5229J5248J1427j9425l1323
$$ -69665 -48480 -39936 -43338 -22986 -35174 -56460 -61474 -46245 -30997 -19570 -38995 -70318
10870g0318L3109M9584J4170o679k2525r250k9166O941m6776j0625N8541O0059
$$ -70318 -37209 12375 26545 19866 -2659 -11909 -41075 -34134 -80910 -91535 -32994 27065
10858B7065K876l6313p0455J599M5223o978k4720K3748m428j6904J8237N9526
$$ 27065 29941 -6372 -76827 -75228 -30005 -36983 -61703 -37955 -42383 -59287 -41050 18476
10846A8476K5684l7882l4099J2122j7072L3975M0763l1610J5253j6436J0752K1734
$$ 18476 44160 6278 -27821 -15699 -32771 1204 41967 10357 25610 9174 19926 41660
10834D1660q293m2081k2173m833l5493J8031L3958m291l19L9407m5133l4398R59
$$ 41660 33367 -8714 -30887 -35720 -71213 -53182 -19224 -23515 -23834 15573 -29560 -63958 -62999
10821f2999M1562K536R464p7M826p07J8464J5723o1486l0926L9725L1844k5432
$$ -62999 -21437 -18901 -9437 -9514 -4688 -5395 13069 28792 -32694 -63620 -23895 7949 -17483
10808a7483k3527j408J9935k452j9596P763L8894k51n9439K9659N2540j4318k8219
$$ -17483 -41010 -42418 -22483 -24935 -44531 -36768 2126 1875 -57564 -27905 24635 10317 -17902
10795a7902j9754k6377J7869N5309K4272K8347J5681K7n4842l5983P730j3042
$$ -17902 -37656 -64033 -46164 9145 33417 61764 77445 77472 22630 -13353 -5623 -18665
10783a8665k2456K3378J4662L4515M4727P274o4867N28P727K7847M756k2781o725
$$ -18665 -41121 -17743 -3081 31434 76161 83435 18568 19096 26823 54670 59426 36645 29920
10770B9920J890k9128J6299O0460j6348L2984K4147j277L1886M2675Q1757J19184
$$ 29920 31810 2682 18981 79441 63093 96077 120224 118947 150833 193508 275265 394449
10758C94449J45905J34789K20390M23914P00934J177707J505899J129534L60866
$$ 394449 540354 675143 895533 1319447 2020381 3198088 4703987 5833521 6194387
10749F194387p7596j83314o875n92254j625661j338164p46853l69467j49890o9505
$$ 6194387 6116791 5933477 5926602 5334348 3708687 2370523 1623670 1254203 1104313 1034808
10739A034808j60462p6929o2175n7654j7554m4985k2017j6222n0276r6621m9277
$$ 1034808 874346 797417 735242 677588 660034 615049 593032 576810 526534 429913 380636
10728C80636n8200n517P265j4253K7153L1687J1413m8616l4083n7216o7334n3460
$$ 380636 322436 316919 324184 309931 337084 368771 380184 331568 297485 240269 172935 119475
10716A19475l3585N6277K2429j1071N0312J0798n3027k2508K2278J0300o361J4617
$$ 119475 85890 142167 164596 153525 203837 214635 161608 139100 161378 171678 165317 179934
10704A79934L71m021k8996o311o461l7336k3478l8418j7266J6197L0735j8918
$$ 179934 180305 176284 147288 140977 134516 97180 73702 35284 18018 34215 64950 46032
10692D6032O28o222k7688j1626L4387m857q102K9921j3835p5362J2103P7937M1078
$$ 46032 46660 40438 12750 1124 35511 30654 22552 52473 38638 -36724 -24621 53316 94394
10679I4394p5047n0622k4496K1990N6198J4679l3930o086N0538M9917r396K6255
$$ 94394 19347 -31275 -55771 -33781 22417 37096 3166 -2920 47618 97535 88139 114394
10667A14394m9041n853k531J1239K727L4023J3059q3425n787M0948Q152l4294
$$ 114394 65353 59500 56969 68208 70935 104958 118017 34592 28805 69753 77905 43611
10655D3611l4073m375M072r675J4117K6477N8119J7041k9928k0360l050q586m1641
$$ 43611 9538 5163 9235 -440 13677 40154 98273 115314 85386 65026 61976 53390 11749
10642A1749m2467j8074m254k8368k2530O8239P4964K5145j0017m0971m5855J7475
$$ 11749 -30718 -48792 -53046 -81414 -103944 -35705 39259 64404 54387 13416 -32439 -14964
10630a4964j738j0710L7646m1705l7008N1642J7125l1003O043Q894l4j7566L4937
$$ -14964 -16702 -27412 10234 -31471 -68479 -16837 288 -30715 -24672 -15778 -15812 -33378 1559
10617A559P2554K342l7322K966M0434j06960o2894M2692K8948K5457M8812L859
$$ 1559 74113 76455 39133 42099 82533 -24427 -87321 -44629 -15681 9776 58588 62447
10605F2447m7008j9290q98N801M027M1612J9615m5149o6525J1517K0031L9881
$$ 62447 15439 -3851 -4749 1052 5079 46691 66306 21157 -45368 -33851 -13820 26061
10593B6061J0030n9733J5295k3572j6693N646J2622j632M6058K7193L5777L1138
$$ 26061 36091 -23642 -8347 -31919 -48612 -42966 -30344 -31976 14082 41275 77052 108190
10581A08190M1871J23014J24309Q282J00K6466J3158n1090n8850q9392p1735r2821
$$ 108190 150061 273075 397384 405666 405766 432232 445390 394300 335450 246058 174323 81502
10569H1502m8049k4843K8959J4328l0906J6489M5959K1215k2491j7233M662k58
$$ 81502 33453 8610 37569 51897 20991 37480 83439 104654 82163 64930 69592 69334
10557F9334J8047p395p3554k8071l579J1060J9360K8671l3627o1023j4263J8678
$$ 69334 87381 79986 6432 -21639 -25218 -14158 5202 33873 246 -60777 -75040 -56362
10545e6362O2032J9190n3320j0667j1037L3362Q483K056J6519r961j9541K6408
$$ -56362 5670 24860 -28460 -39127 -50164 -16802 -8319 -6263 10256 295 -19246 7162
10533G162O1396l4597k6920o2314m6958P223Q1031N9616k707k1008m7000R348
$$ 7162 68558 33961 7041 -55273 -102231 -95008 -13977 45639 42932 21924 -25076 -15728
10521a5728J9099J3360j5944m963P447j2006n906K7375L8287j7318J4452K850
$$ -15728 3371 16731 787 -4176 3271 -8735 -14641 12734 51021 33703 48155 51005
10509E1005k0459k8020K3j0424L3402j2563J5831m3958L4142K4822j1889r618
$$ 51005 30546 2526 2549 -7875 25527 12964 28795 -15163 18979 43801 31912 22294
10497B2294J0346m320k4952j8600N852J3138N3322j0706m8182l7148p252K2487
$$ 22294 32640 28320 3368 -15232 -9380 3758 57080 46374 -1808 -38956 -46208 -23721
10485b3721K1694J992l9287J4787j9700j2530m052O7298K0607L2501J0208k5613
$$ -23721 -2027 -35 -39322 -24535 -44235 -56765 -60817 6481 27088 59589 69797 44184
10473D4184l0175L4197o2922m9496j6991J493L5350J5270L230l81l3205K7460
$$ 44184 14009 48206 -14716 -64212 -81203 -79710 -44360 -29090 -25860 -26241 -59446 -31986
10461c1986R489j7817K52j444R012P5749M0380k4614l1558j5186n497m0195k6387
$$ -31986 -22497 -40314 -40062 -41506 -32494 43255 83635 59021 27463 12277 6780 -33415 -59802
10448e9802P2196m0962l187J0903N7601j6538k2898l7655j7016l0358P739M2931
$$ -59802 12394 -28568 -31755 -20852 36749 20211 -2687 -40342 -57358 -87716 -79977 -37046
10436c7046q979K8283K8435k0544J5468j7042K5509J3171Q19M2817k30K133j8355
$$ -37046 -46025 -17742 10693 -9851 5617 -11425 14084 27255 28074 70891 70661 72794 54439
10423E4439m9651n2010n995R322K1211j1133o775K2467j2142L859K5985p649J949
$$ 54439 4788 -47222 -53217 -43895 -22684 -33817 -40592 -18125 -30267 -26408 -423 -8072 -6123
10410f123l5533O175J896J3433M4619k9424o7783P213M9929M5004J2436J6619
$$ -6123 -41656 -35481 -33585 -20152 24467 -4957 -72740 -65527 -15598 29406 41842 58461
10398E8461J096l8195l3545L7195L7344j6233j012Q427J699o327k1446k0693L5013
$$ 58461 59557 21362 -12183 25012 62356 46123 45111 53538 55237 48910 27464 6771 41784
10385D1784L2285j9529l9979L5878M9090l7385K72j7897j7077N2816K2393m3283
$$ 41784 74069 54540 14561 50439 99529 62144 62416 44519 27442 80258 102651 59368
10373E9368l8047n3640K3177M7259J9912m8438j1840l541j6031m3078P886K0565
$$ 59368 21321 -32319 -9142 38117 58029 9591 -2249 -5790 -21821 -64899 -57013 -36448
10361c6448K5173J6375Q2893J710l9175m9121l1678k4952j3574J0770K8910M5
$$ -36448 -11275 5100 87993 89703 50528 1407 -30271 -55223 -68797 -58027 -29117 -29072
10349b9072k4619M7565M9686J9053k0199k6J0001J1253n255p1156M333K5704K2144
$$ -29072 -53691 -6126 43560 62613 42414 42388 52389 63642 58387 -12769 -8436 17268 39412
10336C9412J3391K4349J3753J2146K8004L9065J2443r7346j662k932k5223K918
$$ 39412 52803 77152 90905 103051 131055 170120 182563 85217 83555 80623 55400 58318
10324E8318l0128L2193L7857m8845j4814p825m3054K6441L9560j4265n3620M570
$$ 58318 28190 60383 98240 49395 34581 26756 -16298 10143 49703 35438 -18182 -13612
10312a3612M2478J9386k7801K830j4098j6141j1168o2454K0342O4133n845j8684
$$ -13612 28866 48252 20451 23281 9183 -6958 -18126 -80580 -60238 3895 -1950 -20634
10300b0634K2847j3864k220L6269O1957m0898n3782k1477j8255j8053K81k8347
$$ -20634 2213 -11651 -13871 22398 84355 43457 -10325 -31802 -50057 -68110 -67829 -96176
10288i6176K1544J8403M6536K5258j2877J624m2387J56R167N2797M2013j7033
$$ -96176 -74632 -56229 -9693 15565 2688 4312 -38075 -37919 -28752 24045 66058 49025
10276D9025q877k5709n6687O653R466P809r751j38O296k0135R089K8412k7205
$$ 49025 40148 14439 -42248 -35595 -26129 -18320 -28071 -28209 -21913 -42048 -32959 -4547 -31752
10263c1752k676p490J7620J307K5750L292j900O3335J4924k7567k0497l4380p9486
$$ -31752 -34428 -41918 -24298 -22991 2759 6051 4151 67486 82410 54843 34346 -34 -79520
10250g9520j9236j1490M8498L8561j7656k2529K8903K7984N9036R65n4188k7443
$$ -79520 -98756 -110246 -61748 -23187 -40843 -63372 -34469 -6485 52551 53516 -672 -28115
10238b8115M4043M823l5452j8644j0111K7109L342k7997k4863M6521M879k2550
$$ -28115 15928 20751 -14701 -33345 -43456 -16347 -13005 -41002 -65865 -19344 -14465 -37015
10226c7015k3791j6386l1743L3998O976k513L7695M2483n2322K130L0339J9462
$$ -37015 -60806 -77192 -108935 -74937 -67961 -70474 -32779 9704 -42618 -40488 -10149 9313
10214I313n2840o1816j7999k7496N8159k683m7548O5089K0532k556N7685k3591
$$ 9313 -43527 -105343 -123342 -150838 -92679 -95362 -142910 -77821 -57289 -59845 -2160 -25751
10202b5751k7753M0536N821K0787n164l1528j379K4591J2973j0870k8643j6357
$$ -25751 -53504 -12968 -7147 13640 8476 -23052 -24431 160 13133 2263 -26380 -42737
10190d2737J569j7063n275K0597j1076j8118j3585k477J8184L6339k2036j3249
$$ -42737 -41168 -58231 -63506 -42909 -53985 -72103 -85688 -88165 -69981 -33642 -55678 -68927
10178f8927p515K7747Q0202l0487k4844k4250j72K8427L8010J7471n499K789j9146
$$ -68927 -76442 -48695 31507 1020 -23824 -48074 -48246 -19819 18191 35662 30163 32952 13806
10165A3806N206j5497L1591m0320q905J0613r400J6029J8534K3060N469p9700
$$ 13806 19012 3515 35106 -5214 -14119 -3506 -12906 3123 21657 44717 50186 -29514
10153b9514j9456p44J5983o236k9481Q389J708k3774l148J8334O6763K8417Q176
$$ -29514 -48970 -49714 -33731 -39967 -69448 -61059 -59351 -83125 -86273 -67939 -1176 27241 35417
10140C5417m2938n6363l4546M9134M6654J1048l7339M7026j5428J369k4699k9758
$$ 35417 -7521 -63884 -98430 -49296 -2642 8406 -28933 18093 2665 4034 -20665 -50423
10128e0423L2447j5048k6077m063m8282m0529j4608K9266J08656L7435k1427k7087
$$ -50423 -17976 -33024 -59101 -63164 -111446 -151975 -166583 -137317 -28661 8774 -12653 -39740
10116c9740Q905k6077K2390Q598K4886k3337k2299j0799k2972K7030M1203j4081
$$ -39740 -30835 -56912 -34522 -25924 -1038 -24375 -46674 -57473 -80445 -53415 -12212 -26293
10104b6293l9489j9445l3836N0809M9158J9877l3091k495M423M2619K4272j9821
$$ -26293 -65782 -85227 -119063 -68254 -19096 781 -32310 -34805 -30382 12237 36509 16688
10092A6688Q540L875J4797k178j873M2795j7163k6423o1865k7204k8748O678O5548
$$ 16688 25228 29103 43900 41722 39849 82644 65481 39058 -22807 -50011 -78759 -72081 -6533
10079f533j0199q1455m0182Q730M508j4123L1007P2310M1932N867j3003j8426
$$ -6533 -16732 -98187 -138369 -129639 -125131 -139254 -108247 -35937 5995 11862 -1141 -19567
10067a9567J5169N426Q737p864l4283J5571j1569k6150L1899J4982K320o450P664
$$ -19567 -4398 1028 9765 1901 -32382 -16811 -28380 -54530 -22631 -7649 -5329 -11779 -4115
10054d115m3298L4239k9017k3637m905j1091J0957k651M144Q736L1786M8181K1289
$$ -4115 -47413 -13174 -42191 -65828 -70733 -81824 -70867 -73518 -69374 -60638 -28852 19329 40618
10041D0618L1083J8473j1896l4635K5334k6459q0899m882N8968L2020l0871m1123
$$ 40618 71701 90174 78278 43643 68977 42518 -38381 -43263 15705 47725 16854 -24269
10029b4269j4920m5640J3499Q602P4210J4054n9501o282M6675J2688N637k8200
$$ -24269 -39189 -84829 -71330 -62728 11482 25536 -33965 -40247 6428 19116 24753 -3447
10017c447j5201J9817K8083M8976N693k2732m4646j5804k6544K0876J9974J1283
$$ -3447 -18648 1169 29252 78228 83921 61189 16543 739 -25805 -4929 15045 26328
10005B6328k6440m5780j1867J7426j009J2019O6303K3986k2455k2946l6514k9006
$$ 26328 -112 -45892 -57759 -40333 -41342 -29323 36980 60966 38511 15565 -20949 -49955
9993d9955J1016M3504K458K8544L7069k98l0996r3K9562p818J5642j9440m1532
$$ -49955 -38939 4565 7023 35567 72636 72338 41342 41249 70811 62993 78635 59195 17663
9980A7663j8768k4289l7111L1872k3641j3538M5856L7222Q650K286j1469R879
$$ 17663 -1105 -25394 -62505 -30633 -54274 -67812 -21956 15266 23916 26202 14733 24612
9968B4612L075J5632r218m7543l5402J2580M8491m0777q713k2593M8121K0662
$$ 24612 27687 43319 34101 -13442 -48844 -36264 12227 -28550 -37263 -59856 -11735 8927
9956H927n3028p9966K6741L4362L2145K6938L2289m6269l2120K9384P395j5705
$$ 8927 -44101 -124067 -97326 -62964 -30819 -3881 28408 -17861 -49981 -20597 -13202 -28907
9944b8907J1336J9262K1122L100Q152J2583o715j1840j986k8565k6477K283J4406
$$ -28907 -17571 1691 22813 25913 34065 46648 39933 28093 26107 -2458 -28935 -26652 -12246
9931a2246K3869n236k3556J2631J7971M2159l7274o1590l0588p142J3848K9094
$$ -12246 11623 6387 -17169 -4538 13433 55592 18318 -43272 -73860 -81002 -67154 -38060
9919c8060J5921N8893N9596k769n2294p3781o647L5456m5972L424M8613J5089
$$ -38060 -22139 36754 96350 93581 41287 -32494 -39141 -3685 -49657 -46233 2380 17469
9907A7469M1882K0890n0965j4937q917J5222m2738l4203O3905j8183o58N9221
$$ 17469 59351 80241 29276 14339 5422 20644 -22094 -56297 7608 -10575 -11233 47988
9895D7988j7153L735k5461P825l5510N056L1763K5133J1544N475L5581j0286J6986
$$ 47988 30835 34570 9109 16934 -18576 -13520 18243 43376 54920 60395 95976 85690 102676
9882A02676m6315m7202J3029q928j9103K8101l1048j590K4101k2038m7563m2394
$$ 102676 56361 9159 22188 13260 -5843 22258 -8790 -10380 13721 -8317 -55880 -98274
9870i8274J1252O6040L9192N4N7181L7601m1790n8043o734l1083k1862k8294R77
$$ -98274 -87022 -20982 18210 18264 75445 113046 71256 13213 6479 -24604 -46466 -74760 -73783
9857g3783L8415O2312O4582r986K4205k2955n60P9298O8844J1477J08007J41884
$$ -73783 -35368 26944 91526 81540 105745 82790 82230 161528 230372 241849 349856 491740
9845D91740J40103R0599L1448j3899j8319p1975j08162j01720j00204j11786p7452
$$ 491740 631843 722442 753890 739991 721672 649697 541535 439815 339611 227825 150373
9834A50373n4600r317J8504q541m9397k4546j3697K0455L3986J0595J6463l0409
$$ 150373 95773 86456 104960 96419 47022 22476 8779 29234 63220 73815 90278 59869
9822E9869k0530N801q879k7550k9976j526r209P5492L3527O331L7860P4812J5252
$$ 59869 39339 45140 36261 8711 -21265 -22791 -32000 43492 77019 83350 121210 196022 211274
9809B11274n6822l5415O778K29l3833m19j1404n805j4290J9790M2810j4226n0355
$$ 211274 154452 119037 125815 126044 92211 91792 80388 74583 60293 80083 122893 108667 58312
9796E8312l0742L3744P783n7839p842N5274L7285n8391p627K2634J1951n654m0343
$$ 58312 27570 61314 69097 11258 3416 58690 95975 37584 29957 52591 64542 58888 18545
9783A8545K54k4623r631L8638K3304L2638k0642l1793m184L7583j2716k4925Q13
$$ 18545 18799 -5824 -15455 23183 46487 79125 58483 26690 22506 60089 47373 22448 23261
9770B3261l0893l5373M5274n347r74P825r332n008m5098l0666K0711L1050K2715
$$ 23261 -7632 -43005 2269 -3078 -4052 3773 -5559 -10567 -55665 -86331 -65620 -34570 -11855
9757a1855M3557j3943j4895J6783J9141k5148l6554l0752n035P8222j811j0665
$$ -11855 31702 17759 2864 19647 38788 13640 -22914 -53666 -58701 19521 17710 7045
9745G045M9404O570k2370k5772j1147l4614j0729j200Q102k3981O8262O9959J3424
$$ 7045 56449 63019 40649 14877 3730 -30884 -41613 -42813 -34711 -58692 9570 79529 92953
9732I2953o3913k0883Q158R613Q369j0945M663L2110P637n5711o2659M84K7774
$$ 92953 29040 8157 16315 25928 34297 23352 28015 60125 67762 12051 -50608 -50124 -22350
9719b2350L1955L4510M879k9368J1276K586J0589l4851l8128O38O8661K3234J1784
$$ -22350 9605 44115 48994 19626 30902 33488 44077 9226 -28902 -28264 40397 63631 75415
9706G5415K6081j8532J0306m2855n305K5226m9212l4015O831l9536r9243o195
$$ 75415 101496 82964 93270 50415 45110 70336 21124 -12891 -6060 -45596 -144839 -151034
9694a51034O5112O9478k0870M634J5728J4801J131l3214j2335K3604O0574N1411
$$ -151034 -85922 -16444 -37314 -32680 -16952 -2151 -1020 -34234 -46569 -22965 37609 89020
9682H9020j6286l3002o5784k2483m4922Q101Q843O9256K6423j6974K5111L7569
$$ 89020 72734 39732 -26052 -48535 -93457 -85356 -76513 -7257 19166 2192 27303 64872
9670F4872k6879l8654L3185P2913M640m9502J9593r586J8640K8120o068l2857
$$ 64872 37993 -661 32524 105437 110077 60575 80168 70582 89222 117342 111274 78417
9658G8417m4145K876l6282k8051K8420L4017p644m3684r482K2550j6746l2064
$$ 78417 34272 37148 866 -27185 1235 35252 27608 -16076 -25558 -3008 -19754 -51818
9646e1818n2045O0261O8183O3386k0380m4906j294j8359M646K6084l429K3407
$$ -51818 -103863 -43602 24581 87967 67587 22681 21387 3028 7674 33758 30329 53736
9634E3736k068k4747m1930l0804k2717K824J2168N1149j2798Q574k4740J4696
$$ 53736 51668 26921 -15009 -45813 -68530 -65706 -53538 -2389 -15187 -6613 -31353 -16657
9622a6657m1633m2816K6639P3704L1992r447o35M5183k5530o8274q094M1846J8376
$$ -16657 -58290 -101106 -74467 -763 31229 21782 21147 66330 40800 -27474 -35568 6278 24654
9609B4654L5740K4480k437n8025l46k2537M542j8650j586L4319R836r1860o0853
$$ 24654 60394 84874 82437 24412 24066 1529 6071 -12579 -14165 20154 29990 -61870 -122723
9596a22723J542l841J8172Q0904P6309K679l2213j3621K1247l2997l5066L5972
$$ -122723 -121181 -125022 -106850 -25946 50363 53042 20829 7208 28455 -4542 -39608 -3636
9584c636j4712P683K3759o4627N396M8765j3260L1469K1643k5864k8253J399O423
$$ -3636 -18348 -10665 13094 -51533 -46137 2628 -10632 20837 42480 16616 -11637 -10238 -3815
9571c815j9399O8353M921q0518Q398M5016l6831j9993L42K4560O282n2522J9863
$$ -3815 -23214 45139 50060 -30458 -22060 22956 -13875 -33868 -33526 -8966 -2684 -55206 -35343
9558c5343k4455l3418L6433J6733L9531j2269K0326Q5542N991j8398j8468k2721
$$ -35343 -59798 -93216 -56783 -40050 -519 -12788 7538 93080 99071 80673 62205 39484
9546C9484j7572m1342J2483p733k5799J6858J1618M4855M2956K0589j5940m0246
$$ 39484 21912 -19430 -6947 -14680 -40479 -23621 -12003 32852 75808 96397 80457 40211
9534D0211m9099k2676J9041N0028k9093p1307j4704N031L0443l7967l3129O0447
$$ 40211 -8888 -31564 -12523 37505 8412 -62895 -77599 -72568 -42125 -80092 -113221 -52774
9522e2774L9627k0122K220n595j2718L380L9688K977K2959J2304M680J8729j4308
$$ -52774 -13147 -33269 -31049 -36644 -49362 -45982 -6294 -3317 19642 31946 36626 55355 41047
9509D1047l5753j5881j1182N805k5973L9956N1258k1818j5748k9354J5953O2854
$$ 41047 5294 -10587 -21769 -15964 -41937 -1981 49277 27459 11711 -17643 -1690 61164
9497F1164o039m5414k2113O293O143L3249M062j4351j3771n845L1570o463l2004
$$ 61164 55125 9711 -12402 -6109 34 33283 37345 22994 9223 3378 34948 28485 -3519
9484c519k0209k0655M728L2703K6481K5684J068n204k7700q53j463j2650K0322
$$ -3519 -23728 -44383 -39655 -6952 19529 45213 46281 41077 13377 12524 11061 -1589 18733
9471A8733L0769n764R164lk74m588l6278k731M067n836Q554J5284J8188L9594
$$ 18733 49502 43738 52902 52899 52625 48037 11759 9028 13095 7259 15813 31097 49285 88879
9457H8879J8712q038l3180p606N0085J8234j7844l7321l509n0056k2600p320l2830
$$ 88879 107591 99553 66373 58767 108852 127086 109242 71921 68412 18356 -4244 -11564 -44394
9444d4394K8361M1186L0515N230l5797j3349J3224O7486K8245j3475P852l6684
$$ -44394 -16033 25153 55668 60898 25101 11752 24976 92462 120707 107232 115084 78400
9432G8400k1788j5805j5237L4471K6961n17m5933m6643o8223J6775J8008M9852
$$ 78400 56612 40807 25570 60041 87002 86485 40552 -6091 -74314 -57539 -39531 10321
9420A0321N9358K0855n1230k8512K1609J4574P510o447J9993N4344k0365l0227
$$ 10321 69679 90534 39304 10792 32401 46975 54485 48038 68031 122375 102010 71783
9408G1783L4253l6502j6503n698K3944K8097Q702j1660j887L159o1519r183R404
$$ 71783 106036 69534 53031 47333 71277 99374 108076 96416 94529 97688 36169 26986 36390
9395C6390R543M8530R486k5891l0147P741K1268J7094k2150l820o1806j497j0633
$$ 36390 45933 94463 103949 78058 47911 55652 76920 94014 71864 68044 6238 4741 -5892
9382e892j1022k15N0549J4758J4935N1522j656K6725L4018m9343l7571k1748K1283
$$ -5892 -16914 -17129 33420 48178 63113 114635 112979 139704 173722 124379 86808 65060 86343
9369H6343K7666k9119l38k5914j402K9404J2457l268k5524m4099J2424N7377K6228
$$ 86343 114009 84890 84552 58638 57236 86640 99097 95829 70305 26206 38630 96007 122235
9356A22235J7354K6433j6032j5307j8786P268k7969L1589L9317k1951O106L9773
$$ 122235 139589 166022 149990 134683 115897 123165 95196 126785 166102 144151 150257 190030
9344A90030L253L8964j4492l9877m1496l1487L051L7198J6925l9738K3493k6145
$$ 190030 193283 232247 217755 177878 136382 104895 107946 145144 162069 122331 145824 119679
9332A19679J2513j7506O2033R3129J4789m152j0550n2400J79K1462L12K3539L2501
$$ 119679 132192 114686 176719 269848 284637 280485 269935 217535 217714 239176 239488 263027 295528
9319B95528j1336l6071p562J3649k4494J672N1765j8580k6041l029l3120r834
$$ 295528 284192 248121 240559 254208 229714 231386 283151 264571 238530 235501 202381 192547
9307A92547j0197L5896K1935J935L92J2689K4594K3706l2692J6024O7882N392
$$ 192547 182350 218246 240181 242116 242508 255197 279791 303497 270805 286829 354711 360103
9295C60103j0246j4085N3059j9610m2351M1136M9607M9359n0492q7347L1899M7884
$$ 360103 349857 335772 388831 369221 326870 368006 417613 466972 416480 329133 361032 408916
9283D08916J0516k4723L5796M7698L5864O0670O1462j4627J7366L7359k0113K3183
$$ 408916 419432 394709 430505 478203 514067 574737 636199 621572 638938 676297 656184 679367
9271F79367M8212K7227J7349o014K8640L7840L8880K9892L3573M4033J7752K1909
$$ 679367 727579 754806 772155 766141 794781 832621 871501 901393 934966 978999 996751 1018660
9259A018660J8347M9595O8769J06193O8961L6712L2778O4948L498M4107O1319
$$ 1018660 1037007 1086602 1155371 1261564 1330525 1367237 1400015 1464963 1468461 1512568 1573887
9248A573887N7423Q7071J10393J32317R4972P6985P0926J26790J25298J03815
$$ 1573887 1631310 1718381 1828774 1961091 2056063 2133048 2203974 2330764 2456062 2559877
9238B559877Q1586J85291J47825J64929J70937J53297J34985J46981J68034J63330
$$ 2559877 2641463 2826754 2974579 3139508 3310445 3463742 3598727 3745708 3913742 4077072
9228D077072J47807J45628J86282J89297J57644J29039J31222R3537K2031j738
$$ 4077072 4224879 4370507 4556789 4746086 4903730 5032769 5163991 5257528 5279559 5277821
9218E277821j3037m1764l6955p6671r7551p7584p1657j20501j23972r0525o8473
$$ 5277821 5264784 5223020 5186065 5109394 5011843 4934259 4862602 4742101 4618129 4527604 4459131
9207D459131j33630k01748j67095j44070j11586j24380j55304j06035j26843j32220
$$ 4459131 4325501 4123753 3956658 3812588 3701002 3576622 3421318 3315283 3188440 3056220
9197C056220j08646j14791j48362q5513j25664m3395q7805o0410n4544k3794p7789
$$ 3056220 2947574 2832783 2684421 2598908 2473244 2429849 2342044 2281634 2227090 2203296 2125507
9186B125507l7332l0242j00675j07964j00671r2350k2749J5430j8638n5953j01806
$$ 2125507 2088175 2057933 1957258 1849294 1748623 1656273 1633524 1648954 1630316 1574363 1472557
9175A472557l3656m6450l8508p7532r7365k7719L6155k5088K018k0536p333O044
$$ 1472557 1438901 1392451 1353943 1276411 1179046 1151327 1187482 1162394 1164412 1143876 1136543 1142587
9163A142587l8635j5610o3342m930n6164l2239j1542o7655j7810K2162l622k9663
$$ 1142587 1103952 1088342 1025000 1020070 963906 931667 920125 852470 834660 856822 853200 823537
9151H23537k687k5406q927k6880l3300j5086Q91J006J7819l5298q4122L1015k0275
$$ 823537 820850 795444 786517 759637 726337 711251 712142 713148 730967 695669 611547 642562 622287
9138F22287m5997p2675j8697L0512K0417k737l0354k8480j830k9446J4150O190
$$ 622287 576290 503615 484918 515430 535847 533110 502756 474276 472446 443000 457150 463340
9126D63340n5751q586p865k7690J3119M6503j0007l1505k1558l642J5658r188
$$ 463340 407589 399003 391138 363448 376567 423070 413063 381558 360000 356358 372016 362828
9114C62828N719k1695k8985L017k1969n3788l379l19l3389M1991P01K4396L0184
$$ 362828 368547 346852 317867 320884 298915 245127 241748 241429 208040 250031 250732 275128 305312
9101C05312J6006k4869k1258l3280j1642Q703M2216K7300l4619P868L7748o891
$$ 305312 321318 296449 275191 241911 230269 238972 281188 308488 273869 281737 319485 312594
9089C12594j8248l2342J5168m311n379k6087m381K0853j6624l3948k3332M9730
$$ 312594 294346 262004 277172 272861 267482 241395 237014 257867 241243 207295 183963 233693
9077B33693K8324L7958l9044n1719n455l4658J0156J8410n923K8992J2776j8588
$$ 233693 262017 299975 260931 209212 203757 169099 179255 197665 191742 220734 233510 214922
9065B14922l3457l0938j4379j5550o037N997J8250L0723L914K0546R259k5639
$$ 214922 181465 150527 136148 120598 114561 120558 138808 169531 173445 193991 203250 177611
9053A77611l6067j7119q813j2124K5664M9342k8600l7013j6266r181O3920L9339
$$ 177611 141544 124425 115612 103488 129152 178494 149894 112881 96615 87434 151354 190693
9041A90693k5354k3078l0166m9640Q964P977j5772J7744N1106M8825m3571o0741
$$ 190693 165339 142261 112095 62455 71419 79396 63624 81368 132474 181299 137728 76987
9029G6987k9360j5246K2082r942j6618j6755O272j5175P284M9730L1414L893n2044
$$ 76987 47627 32381 54463 44521 27903 11148 17420 2245 9529 59259 90673 94566 42522
9016D2522m0090J1651L601K317j4865r347o667k2588O7963L2032J3506k1733l0463
$$ 42522 2432 14083 17684 20001 5136 -4211 -10878 -33466 34497 66529 80035 58302 27839
9003B7839J6833M859K2585k4704R825M9979j5703k6369k2217m0446J0527O6664
$$ 27839 44672 49531 72116 47412 57237 107216 91513 65144 42927 2481 13008 79672
8991G9672k1669o2801m793K3826L4189L53j0697k4396N8759L8374Q921k7378l6972
$$ 79672 58003 -4798 -9591 14235 48424 48777 38080 13684 72443 110817 119738 92360 55388
8978E5388L1402k2744k2206n4857R026O7437L3448J9303m3330l1804k2982N1435
$$ 55388 86790 64046 41840 -13017 -3991 63446 96894 116197 72867 41063 18081 69516
8966F9516j366l5808j690K3125M8163J21l9918O960K0581l1749j2865M4911L1703
$$ 69516 68150 32342 30652 53777 101940 102061 62143 69103 89684 57935 45070 89981 121684
8953A21684J9778j6056p5537R821K9161j9412k2603m1572n1537K4884L9799M5986
$$ 121684 141462 125406 49869 59690 88851 69439 46836 5264 -46273 -21389 18410 64396
8941F4396n0012m9387l025O5954O1421m893m636j6242r715j9488n453O177j5396
$$ 64396 14384 -35003 -38028 27926 89347 84454 79818 63576 53861 34373 28920 35097 19701
8928A9701k0304J9340J944L6755k9001K5810p791l3123j4381j5240J5156K3968
$$ 19701 -603 18737 20681 57436 28435 54245 46454 13331 -1050 -16290 -1134 22834
8916B2834k0803o391J8248O4234j5621L334J3115k9439m5390J8310L1854J2618
$$ 22834 2031 -4360 13888 78122 62501 65835 78950 49511 4121 22431 54285 66903
8904F6903L9993L7017k8949j0578n900m0080k0164j2070J216L5604p369J7583
$$ 66903 106896 143913 114964 104386 98486 58406 38242 26172 27388 62992 55623 73206
8892G3206K7206J0450K154l468l3175J8491n807l6146j5207k1623m7345J7265
$$ 73206 100412 110862 113016 109548 76373 94864 89057 52911 37704 16081 -31264 -13999
8880a3999L462J6505m3527l3987J4847M0325L4015j1024k9046J3763L3930O665
$$ -13999 -10537 5968 -37559 -71546 -56699 -16374 17641 6617 -22429 -8666 25264 31929
8868C1929M7624o438J3829r957k8496n1074J6832J2487k4517J3414j1534K7043
$$ 31929 79553 73115 86944 76987 48491 -2583 14249 26736 2219 15633 4099 31142
8856C1142q387j7127j3688p949m3401L6306Q6158k3865k9598o483j9630l4249
$$ 31142 22755 5628 -8060 -16009 -59410 -23104 63054 39189 9591 3108 -16522 -50771
8844e0771J0808J8371J1606M303m2698l1876Q6350L2784o867r822m3938N165M820
$$ -50771 -39963 -21592 -9986 -5683 -48381 -80257 6093 38877 32010 22188 -21750 -16585 -11765
8831a1765K9553N6485K7537K9588j7170k9314m5931m619k0172k7926K7624J2794
$$ -11765 17788 74273 101810 131398 114228 84914 38983 34364 14192 -13734 13890 26684
8819B6684k6297l267O9336L5672j6942R916K1208l0898n3714o2041k617l9010
$$ 26684 387 -2880 66456 102128 85186 95102 116310 85412 31698 -30343 -32960 -71970
8807g1970K0840P4348M677o496M979K2245J3725q104L0089K4558k1971o87J9716
$$ -71970 -51130 23218 27895 21399 26378 48623 62348 54244 84333 108891 86920 86233 105949
8794A05949k7287j2210O328k3152n786M4498k6294k6516k521j4231J5543J1222
$$ 105949 78662 66452 72780 49628 43842 88340 62046 35530 33009 18778 34321 45543
8782D5543l7792K0757O489k9898r308J9854P784l2176m0M4521N96k1932M3415
$$ 45543 7751 28508 34997 5099 -4209 15645 23429 -8747 -8787 35734 36330 14398 57813
8769E7813k9542n4716N056K7846M9940k7331N6852J3396k2140l1326N8304J9234
$$ 57813 28271 -26445 -21389 6457 56397 29066 85918 99314 77174 45848 104152 123386
8757A23386j5348N140l3319l0644k5138p120Q477k0070l431J198J7653J7465L9154
$$ 123386 108038 113178 79859 49215 24077 16957 25434 5364 1933 3131 20784 38249 77403
8744G7403K3715m5117j2881M2833j4816P73J5759j6768o236j969J9081j6194J6919
$$ 77403 101118 56001 43120 85953 71137 71910 87669 70901 64665 62696 81777 65583 82502
8731H2502K8409Q581k0602M146L0678j2072J6152J611p316K0582k0193l0410J7648
$$ 82502 110911 119492 98890 103036 133714 121642 137794 139405 132089 152671 132478 102068 119716
8718A19716M0306J840k387j0252o568m1757j7764Q434J783l0455J1281o71K2406
$$ 119716 160022 161862 159475 149223 142655 100898 83134 91568 93351 62896 74177 73506 95912
8705I5912R027n483J1195L21K5777j6527M5276L6434m0777l4897J1783J9467j379
$$ 95912 104939 99456 110651 110972 136749 120222 165498 201932 161155 126258 138041 157508 156129
8692A56129j9716l9462K096J4359J0914o049m1632k0347J9793L4249K2755O428
$$ 156129 136413 96951 99047 113406 124320 118271 76639 56292 76085 110334 133089 139517
8680A39517j3388l4152J3700K7060N866J7394J8903J4554J4086J7331j2742k1911
$$ 139517 126129 91977 105677 132737 138603 155997 174900 189454 203540 220871 208129 186218
8668A86218K6092J0075l5825l3486L7479J1972P067k2297M085k3381p508j2980
$$ 186218 212310 222385 186560 153074 190553 202525 209592 187295 191380 167999 160491 147511
8656A47511l9907J6349N128K0526j0578k1894N8007M6936M578l88j628K3070J0617
$$ 147511 107604 123953 129081 149607 139029 117135 175142 222078 226656 226268 224640 247710 258327
8643B58327N7073K6920N185r70L6o1807J4807N625l5592n2645l343L3590J3005
$$ 258327 315400 342320 347505 346535 346571 284764 299571 305196 269604 216959 213616 247206 260211
8630B60211L9868j5624p4682m1532N650K6534m4958K717K9147N1093M908K4195
$$ 260211 300079 284455 209773 168241 173891 200425 155467 158184 187331 238424 243332 267527
8618B67527R843j2333J6331L7980k1417l255L444M488j9450k9399J7825J9240
$$ 267527 277370 265037 281368 319348 297931 294676 298120 302608 283158 253759 271584 290824
8606B90824k5892M1296J19835R1842L7737N6108O8565J10881J46338M3873k157
$$ 290824 264932 306228 426063 517905 555642 611750 680315 791196 937534 981407 979250
8595I79250O271j2202j3996J8518J077K77J989K6846P4382J26k6288p0182n5516
$$ 979250 985521 973319 959323 977841 978918 979195 981184 1008030 1082412 1082538 1056250 986068 930552
8582I30552o0951n4155k0565j5583k9755n5310r1453r3505m6274k9769o6821K172
$$ 930552 869601 815446 794881 779298 749543 694233 602780 509275 463001 433232 366411 368583
8570C68583k9702n1473M1026L7012j7719n0656j858m4097m0861K1958M7139O155
$$ 368583 338881 287408 328434 365446 347727 297071 295213 251116 210255 232213 279352 285507
8558B85507R049m17O548j536K5573J7100j6682K0134n680L547j4254l2749l8516
$$ 285507 294556 294139 300687 299151 324724 341824 325142 345276 339596 343143 328889 296140 257624
8545B57624n0242l6650r485M1l0346j8862K4373K7709L4045k4710j3839l2733
$$ 257624 207382 170732 161247 161288 130942 112080 136453 164162 198207 173497 159658 126925
8533A26925J1268j2691k415m7178L0540L6646p765K5758M2759l073m0810j8031
$$ 126925 138193 125502 123087 75909 106449 143095 135330 161088 203847 200774 159964 141933
8521A41933J2282O860k6517j9334k4839j9468L4535K9881L245K0051k0594k2427
$$ 141933 154215 161075 134558 115224 90385 70917 105452 135333 138578 158629 138035 115608
8509A15608l0801J813P124J8055K3272L7525K4006m4345n9648l2163j5372k7574
$$ 115608 84807 86620 93744 111799 135071 172596 196602 152257 92609 60446 45074 17500
8497A7500j9305O712N9555L5434J2924j0239J9822m8866l3372l0844L1349P2826
$$ 17500 -1805 4907 64462 99896 112820 102581 122403 73537 40165 9321 40670 113496
8485A13496q650j9336j6818l1563J3255K7840l0923l6221j962J0980j4893K383
$$ 113496 104846 85510 68692 37129 50384 78224 47301 11080 9118 20098 5205 7588
8473G588N5954L2103n3219J6577M0960k093Q485j0931q1396j5736M6126O841K8665
$$ 7588 63542 95645 42426 59003 99963 97870 106355 95424 14028 -1708 44418 51259 79924
8460G9924J1103l4675n681J4700L1033k4938M752k7478M3841j6214k3572P322
$$ 79924 91027 56352 50671 65371 96404 71466 76218 48740 92581 76367 52795 60117
8448F0117J7650L6282q394k4691l431K2792l7846K9350o453r241m3921j1398Q706
$$ 60117 77767 114049 105655 80964 77533 100325 62479 91829 85376 76135 32214 20816 29522
8435B9522M9927J5291j9568m8186J4634M0858j2149j1892J2266K8256n707j6273
$$ 29522 79449 94740 75172 26986 41620 82478 70329 58437 70703 98959 93252 76979
8423G6979j7703j7943J5357L044R570J4277m3188q4786j4273L4644M7295n512
$$ 76979 59276 41333 56690 59734 69304 83581 40393 -44393 -58666 -24022 23273 17761
8411A7761k8150K506N5543J0633L0074k2990l5433j6000L8609j9126l0381j1276
$$ 17761 -10389 -7883 47660 58293 88367 65377 29944 13944 52553 33427 3046 -8230
8399h230k484J5854N93k1055M1620K4464J6104j239j3828L820K4940K4044J2000
$$ -8230 -10714 5140 5733 -15322 26298 50762 66866 65627 51799 55619 80559 104603 116603
8386A16603Q142p9029l4149J0903O9546J6917l6041m5373j0487M191j3315P9014
$$ 116603 124745 45716 11567 22470 92016 108933 72892 27519 17032 21223 7908 86922
8374H6922J1518n5131j7770q589N9222l6785m0443L1756J3230N355K7439J5964
$$ 86922 98440 43309 25539 16950 76172 39387 -1056 30700 43930 49285 76724 92688
8362I2688l0431m219L3423K1224l1483O05L888m2534n9357J8228P4686L7184k877
$$ 92688 62257 58038 91461 112685 81202 81807 85695 43161 -16196 2032 76718 113902 111025
8349A11025J0024o5178p9614P3593Q7887j0954m3967J2388J2087j860p2747k6258
$$ 111025 121049 55871 -23743 49850 137737 126783 82816 95204 107291 105431 32684 6426
8337F426O836L9803J3165J3911j686m3988J7156k6145j6856J7252P1883Q350m3127
$$ 6426 13262 53065 66230 80141 78455 34467 51623 25478 8622 25874 97757 106107 62980
8324F2980p905l8233j063L2271P869p215p2570l2408O3358L3772k9182p8153k2701
$$ 62980 55075 16842 15779 48050 55919 48704 -23866 -56274 7084 40856 11674 -66479 -89180
8311h9180M3419L5064M6371L437q777K5408j4061P583m438J9858o9136l5646N1751
$$ -89180 -45761 -10697 35674 39111 30334 55742 41681 49264 44826 64684 -4452 -40098 11653
8298A1653L2071n5106l9756K5000N6595L9009K5830j9614j8485m3840N360M5560
$$ 11653 43724 -11382 -51138 -26138 30457 69466 95296 75682 57197 13357 18717 64277
8286F4277k4339J796k2534r341J980K6589L6792k602k1911M4981j5564k4308p832
$$ 64277 39938 41734 19200 9859 11839 38428 75220 72618 50707 95688 80124 55816 47984
8273D7984J3183p651m9443m0375m886K6002O2370K3128m7623j1616Q480j1330
$$ 47984 61167 53516 4073 -36302 -41188 -15186 47184 70312 22689 11073 19553 8223
8261H223m9467n7M2866M4141R395l5035L9983O8049l055l4171J8909K0544m0343
$$ 8223 -41244 -41301 1565 45706 55101 20066 60049 128098 125043 90872 109781 130325 89982
8248H9982m2722n2703o6024j7624P553J1676K1862J9088K9606M5892J987K7303
$$ 89982 47260 -5443 -71467 -89091 -81538 -69862 -48000 -28912 694 46586 48573 75876
8236G5876l0708k1555L8226L3579K0025J9431m9006n6836K2612J0296J8335j0791
$$ 75876 45168 23613 61839 95418 115443 134874 85868 29032 51644 61940 80275 69484
8224F9484m2484M975M5737j1111n2507k4501K3539J4434j8653O36P4690j1533
$$ 69484 27000 31975 77712 66601 14094 -10407 13132 27566 8913 9549 84239 72706
8212G2706J6912l0338k5312j7128J7043K0990L0819M280l2883k1012n4488l9081
$$ 72706 89618 59280 33968 16840 33883 54873 85692 89972 57089 36077 -18411 -57492
8200e7492l2525L1234N0962J1558J7719j9390r030L9031j553k4299k4074K5551
$$ -57492 -90017 -58783 -7821 3737 21456 2066 -6964 32067 30514 6215 -17859 7692
8188G692q135K2814O5873M5838n846j33012l9590K4154M6744N922j9092J5788
$$ 7692 -443 22371 88244 134082 128236 -4776 -44366 -20212 26532 32454 13362 29150
8176B9150L8614N31m3459l7309M5182J612j2759r373k3327L2503J7150l47l5008
$$ 29150 67764 68295 24836 -12473 32709 34321 21562 12189 -11138 21365 38515 38168 3160
8163C160j822J6446M2556L7635Q185R517k3485l8793n0009n8j4092J6076J8952
$$ 3160 1338 17784 60340 97975 106160 115677 92192 53399 3390 3332 -10760 5316 24268
8150B4268K1312L8597J2581l2425L1235n3467j5748M0041M3869k5668k3714L5578
$$ 24268 45580 84177 96758 64333 95568 42101 26353 66394 110263 84595 60881 96459
8138I6459o572p3427j8039j2563J5448M7537R598k2935n683j4902O295q16J8972
$$ 96459 89887 16460 -1579 -14142 1306 48843 58441 35506 29823 14921 21216 20400 39372
8125C9372j7247k0374k025J8111N840Q829k7758o416M914P276J4121k5072J3345
$$ 39372 22125 1751 -274 17837 23677 32506 4748 -1668 3246 10522 24643 -429 12916
8112A2916M8384M7634n6123p170L6274O69m0743O27J5427N2122K395j3304m293
$$ 12916 61300 108934 52811 45641 81915 82584 41841 42468 57895 110017 112412 99108 94815
8099I4815j8192r961l6784K2902L3732J7088k4971J9154j8251j4634J4810p1605
$$ 94815 76623 66662 29878 52780 86512 103600 78629 97783 79532 64898 79708 8103
8087H103j0926P8322Q2621k0191m2873j7526q867J3194m7119k9337J9115M759
$$ 8103 -2823 75499 158120 137929 95056 77530 68663 81857 34738 5401 24516 29275
8075B9275P3117k3184k6688n0942L8729K9856O821l1616J4866N2502M915j8969
$$ 29275 102392 79208 52520 1578 40307 70163 76984 45368 60234 112736 117651 98682
8063I8682r348m0542K5595M4924L7126k7306j9313l0848j1453j4531Q809M2583
$$ 98682 89334 48792 74387 119311 156437 129131 109818 78970 67517 52986 61795 104378
8051A04378K0446M630r798j2462n5236l6676L6884L2336j8822J961K246m3601
$$ 104378 124824 129454 119656 107194 51958 15282 52166 84502 65680 67641 69887 26286
8039B6286J1654K9805J9809N072k6065j2475K9566R357J4818k2525k6656J3218
$$ 26286 37940 67745 87554 92626 66561 54086 83652 93009 107827 85302 58646 71864
8027G1864J2546m572l0341k7584L5025J8213L5235K9136M8265m255o7287k8220
$$ 71864 84410 79838 49497 21913 56938 75151 110386 139522 187787 183532 116245 88025
8015H8025J3798k6395J4190K0390n132k1601ML6347K2656J3965l549P2788L2280
$$ 88025 101823 75428 89618 110008 104876 83275 83279 119626 142282 156247 152698 225486 257766
8002B57766n2706r4065o362K0220M7238N96j1643K8765J7839K8855l112O782k994
$$ 257766 205060 110995 104633 124853 172091 172687 161044 189809 207648 236503 233391 240173 237179
7989B37179J7737K3577K4053m1962o022k629p757P236m6136p2633o217J7610J2863
$$ 237179 254916 278493 302546 260584 254562 251933 244176 251412 205276 132643 126426 144036 156899
7976A56899j1396K222l4416J3253J7733l8801o0312k3273J6672K2702J577J5502
$$ 156899 145503 147725 113309 126562 144295 105494 45182 21909 38581 61283 62860 78362
7964G8362O7251P5700j7647P962J6557K7839n0047J6197K5217m838M966L5476
$$ 78362 145613 221313 203666 211628 228185 256024 205977 222174 247391 242553 247519 282995
7952B82995Q903j2643p814j5084K162j4812J1755K604K4536j0540j1383l8645
$$ 282995 291898 279255 271441 256357 258519 243707 255462 258066 282602 272062 260679 222034
7940B22034N803L203l0267l3221K679K7866j4643p7099q357L7115m350K6021J8278
$$ 222034 227837 231040 200773 167552 170231 198097 183454 106355 97998 135113 130763 156784 175062
7927A75062j7953L4847L9364J2021p0632j5312N2697L3080n5651k133j0113P114
$$ 175062 157109 191956 231320 243341 172709 157397 210094 243174 187523 185390 175277 182391
7915A82391K6852M1004M3773p6587q2596p24K9616J3688K0653K2472l9852k6021
$$ 182391 209243 250247 294020 217433 134837 134113 163729 177417 198070 220542 180690 154669
7903A54669n125N3767J7386k9833k5710m1896o7617N4244j1679L497j1515L5312
$$ 154669 149544 203311 220697 190864 165154 123258 55641 109885 98206 101703 90188 125500
7891A25500K2101J7770m830j2554J0947p304p323l9570j2617K7347m0858j2102
$$ 125500 147601 165371 160541 147987 158934 151630 144307 104737 92120 119467 78609 66507
7879F6507O6416M2546q13j1274R110q4226l4428m202r971M4821J2551M5354M4007
$$ 66507 132923 175469 174656 163382 172492 88266 53838 49636 39665 84486 97037 142391 186398
7866A86398m3899o1613K3348J9486p05j4253j9294l6295j4356K1353k5486l3097
$$ 186398 142499 80886 104234 123720 123015 108762 89468 53173 38817 60170 34684 1587
7854A587l4309J4675L8233L1154M4449O5249R785k5462m2207r2484k7178K1997
$$ 1587 -32722 -18047 20186 51340 95789 161038 170823 145361 103154 10670 -16508 5489
7842E489j5374N584O3298R616J8754k106j7123K3732o1010k1270j693M4248k8440
$$ 5489 -9885 -4301 58997 68613 87367 85261 68138 91870 30860 9590 7897 52145 23705
7829B3705q2643k9590J1554J7180L9944L2075O118J6985j3276M087K4158m685
$$ 23705 -58938 -88528 -76974 -59794 -19850 12225 18343 35328 22052 26139 50297 45612
7817D5612p756L1246J6229j6085m2411l2542J1823M805j3106m1858O986L0403
$$ 45612 37856 69102 85331 69246 26835 -5707 6116 10921 -2185 -44043 -37057 -6654
7805f654L4738N6875J6872o2281o2113j7050k3442J2547N8418k3338j3326R762
$$ -6654 28084 84959 101831 39550 -22563 -39613 -63055 -50508 7910 -15428 -28754 -18992
7793a8992l91J3870M1773L2723k0464r133K037L5599p2960k4039J0437k1995k2590
$$ -18992 -19383 -5513 36260 68983 48519 39386 41423 77022 4062 -19977 -9540 -31535 -54125
7780e4125k6465q85N596l0411l9233J5817L8114j1559j4709K9727N1545L4516
$$ -54125 -80590 -81475 -75879 -106290 -145523 -129706 -91592 -103151 -117860 -88133 -36588 -2072
7768b072j3262l0397K0535K0682N7054J7568k7283n6741j1357l7636l2428J0209
$$ -2072 -15334 -45731 -25196 -4514 52540 70108 42825 -13916 -25273 -62909 -95337 -85128
7756h5128K9153L145K253m2629R984M9625J7963j6602N312O6583J1076p7339l8948
$$ -85128 -55975 -52830 -50577 -93206 -83222 -33597 -15634 -32236 -26924 39659 50735 -26604 -65552
7743f5552l6337j4909l274J5168L9682J9644P169p846k2417L5096O7834N0853
$$ -65552 -101889 -116798 -120072 -104904 -65222 -45578 -38409 -46255 -68672 -33576 34258 85111
7731H5111k6928n8089k106M2380j2641l2320M0611J9204m663J7338l0155j8734
$$ 85111 58183 94 -2012 40368 27727 -4593 36018 55222 50559 67897 37742 19008
7719A9008n6027j1302q207L4550M0876j5943J5113m5517J1617J6009j1383l5813
$$ 19008 -37019 -48321 -56528 -21978 18898 2955 18068 -27449 -15832 177 -11206 -47019
7707d7019n3675n998k0158N1056K5082k3711l1262J9664J7043k0439l642L5239
$$ -47019 -100694 -106692 -126850 -75794 -50712 -74423 -105685 -86021 -68978 -89417 -93059 -57820
7695e7820K2758j7021m6438j807P9993L4580j405l3926l1925j28K7222l661Q649
$$ -57820 -35062 -52083 -98521 -100328 -20335 14245 12840 -21086 -53011 -53139 -25917 -29578 -20929
7682b0929j534n216P445J7366j319O1184J1890l2480n5203L3562K9608J7594r553
$$ -20929 -22463 -27679 -20234 -2868 -4187 56997 68887 36407 -18796 14766 44374 61968 52415
7669E2415n927l8091k9793J2734p223Q419K2129k8305k8739j4992L6409K0474
$$ 52415 46488 8397 -21396 -8662 -15885 -7466 14663 -13642 -42381 -57373 -20964 -490
7657d90K7842L0417q623k6919l2100q560l1225L2634j5321l3013l5672n389M9452
$$ -490 27352 57769 49146 22227 -9873 -18433 -49658 -17024 -32345 -65358 -101030 -106419 -56967
7644e6967K9746M6396j9300q40k80p988M9130J8395j7490Q104L6438o8321m1951
$$ -56967 -27221 19175 -125 -965 -1245 -9233 39897 58292 40802 48906 85344 17023 -24928
7631b4928J9622K5430L8732l366j2885N1230n0657n2969q116L111K030J327j1592
$$ -24928 -5306 20124 58856 55490 42605 93835 43178 -9791 -17907 -14796 -12766 -11439 -23031
7618b3031K3814N2935j7073q089o3825o7435K7245N0852j4377K4863J6276K0425
$$ -23031 783 53718 36645 28556 -35269 -102704 -75459 -24607 -38984 -14121 2155 22580
7606B2580J0940l1082k2323K5735K6740o4368Q090j1658l5291l11k4764j8806
$$ 22580 33520 2438 -19885 5850 32590 -31778 -23688 -35346 -70637 -70948 -95712 -114518
7594a14518J0071L1157K8554L4393K7921K9080K9093J2862J286l5720m6150k8444
$$ -114518 -104447 -73290 -44736 -10343 17578 46658 75751 88613 89899 54179 8029 -20415
7582b0415J0150k7436o8733M3205N7797K6254m718l1486O130m3888J1526O3997
$$ -20415 -10265 -37701 -106434 -63229 -5432 20822 16104 -15382 -9252 -53140 -41614 22383
7570B2383L6612k0244j4892J8327r206n974p0284n7778K6939P037K2257k2288
$$ 22383 58995 38751 23859 42186 32980 27006 -43278 -101056 -74117 -67080 -44823 -67111
7558f7111n233J9715q183p646P718K7553k222J261K9602J9029l2296p209O0266
$$ -67111 -72344 -52629 -60812 -68458 -60740 -33187 -35409 -34148 -4546 14483 -17813 -25022 35244
7545C5244j6445o653k2671n0180r856k1899J0662O2910M4048L7635M3991k4947
$$ 35244 18799 12146 -10525 -60705 -70561 -92460 -81798 -18888 25160 62795 106786 81839
7533H1839L443k2834l9824k2001l623j2301J7765N036j0446k2679O177K3057l2291
$$ 81839 85282 62448 22624 623 -3000 -15301 2464 7500 -2946 -25625 -19448 3609 -28682
7520b8682l835M5592r823m1390J9097K8220J0755l5966l5505O6014L413j6755
$$ -28682 -32517 13075 3252 -38138 -19041 9179 19934 -16032 -51537 14477 17890 1135
7508A135k5938k9909N9308K4891J0383K1882l3845l3033q957L3296K3547J6258
$$ 1135 -24803 -54712 4596 29487 39870 61752 27907 -5126 -14083 19213 42760 59018
7496E9018N6447j2761n1531k9193p953n1255n0019K3412L9908K5921j8800j4974
$$ 59018 115465 102704 51173 21980 14027 -37228 -87247 -63835 -23927 1994 -16806 -31780
7484c1780l8996m0587N433k006L1203N318J5511N0455J3836k2658l2184L7414
$$ -31780 -70776 -111363 -105930 -107936 -76733 -71415 -55904 -5449 8387 -14271 -46455 -9041
7472i041j4157n971m4530l6082J6957O4288j36r468j9120k3070q739N1455J5931
$$ -9041 -23198 -29169 -73699 -109781 -92824 -28536 -28672 -38140 -57260 -80330 -89069 -37614 -21683
7459b1683q86O730K8605N867j1237p2131p2744J6405L4549L5821N8509k2013k621
$$ -21683 -22569 -15839 12766 18633 7396 -64735 -137479 -121074 -86525 -50704 7805 -14208 -16829
7446a6829l0750K1632M0291L099m1518K206J9438k2448j4488r968j068M3701J061
$$ -16829 -47579 -25947 14344 17443 -24075 -21869 -2431 -24879 -39367 -49335 -50403 -6702 -5641
7433e641p02K7412K0139k3257m9729j4638o816P026k4960J5331M4491M6945l5702
$$ -5641 -6343 21069 41208 17951 -31778 -46416 -53232 -46206 -71166 -55835 -11344 35601 -101
7420a01l0272J446k7762j9979K8339j6098k4325J3676O2332L652J1404j9978k5160
$$ -101 -30373 -28927 -56689 -76668 -48329 -64427 -88752 -75076 -12744 -9092 2312 -17666 -42826
7407d2826k326k4964N865k7906K7213K1683M8263N2684N189K37p844j5980m7365
$$ -42826 -45152 -70116 -64251 -92157 -64944 -43261 5002 57686 62875 63112 55268 39288 -8077
7394h077l4735J120l210j9568P434j1139j4595j9556M0345N3605k4353m5088k0359
$$ -8077 -42812 -41692 -44902 -64470 -57036 -68175 -82770 -102326 -61981 -8376 -32729 -77817 -98176
7381i8176L2646o955P071N5711N7546k9990k1837J729J6545j1374J5902j601O218
$$ -98176 -65530 -72485 -65414 -9703 47843 17853 -3984 -2255 14290 2916 18818 17217 23435
7368B3435p033p745m9490m3556r837J0235n9530j9375M1792L7511J2852K7018
$$ 23435 16402 8657 -40833 -84389 -94226 -83991 -143521 -162896 -121104 -83593 -70741 -43723
7356d3723o852k229J6314l657k0363J2249o654J2445q831L7202K2329k1083l2232
$$ -43723 -50575 -52804 -36490 -40147 -60510 -48261 -54915 -42470 -51301 -14099 8230 -12853 -45085
7343d5085M9554L6294q6203P255n408K7362L9436k8181q3343j2693K1797M2217
$$ -45085 4469 40763 -45440 -38185 -43593 -16231 23205 -4976 -88319 -101012 -79215 -36998
7331c6998j1082K5718K9641J1908R163p8537k7806j0784K2409J6992M9947J3587
$$ -36998 -48080 -22362 7279 19187 28350 -50187 -77993 -88777 -66368 -49376 571 14158
7319A4158o1966m0437L7568L7972M1801K6103k1029p235M1676k1804p643L0432
$$ 14158 -47808 -88245 -50677 -12705 29096 55199 34170 26935 68611 46807 39164 69596
7307F9596o8342o8230M4042L1951L222J7086K750l012l9404N5829J2163l8086
$$ 69596 1254 -66976 -22934 9017 12239 29325 32075 29063 -10341 45488 57651 19565
7295A9565l7708j7680O3354M8648m458j2922K0029O606o9202j0492P444J1029
$$ 19565 -18143 -35823 27531 76179 71721 58799 78828 85434 16232 5740 13184 24213
7283B4213n4581m7669K0464J7342L9029R7096q2p6591l8701n0217P222M0263K9411
$$ 24213 -30368 -78037 -57573 -40231 -1202 95894 95812 19221 -19480 -69697 -62475 -22212 7199
7270G199N3638k1113n793l5496j9242O0364N5670j1700k4529K3376j1762o0501
$$ 7199 60837 39724 33931 -1565 -20807 39557 95227 83527 58998 82374 70612 10111
7258A0111R248J3019M1241l1035n0313m2394p6452j1528K8458J8853P03j01J2932
$$ 10111 19359 32378 73619 42584 -7729 -50123 -126575 -138103 -109645 -90792 -90089 -90190 -77258
7245g7258J4123L2539j7245j0469J1194k024K1893m58j2643q167M850O4532m8443
$$ -77258 -63135 -30596 -47841 -58310 -47116 -49140 -27247 -27705 -40348 -48515 -43665 20867 -27576
7232b7576m4147J5552K6303l0656j6020P2648K6499p985M5625n281k8227k935
$$ -27576 -71723 -56171 -29868 -60524 -76544 -3896 22603 14618 60243 54962 26735 23800
7220B3800k3878k277m9918j4377j4432j6267J2461O207M477K8176n605m7431k680
$$ 23800 -78 -2355 -52273 -66650 -81082 -97349 -84888 -78681 -74204 -46028 -51633 -99064 -101744
7207a01744J0114N4214J1101M553J3246n2400r183M6600K0139k4633M2055j8474
$$ -101744 -91630 -37416 -26315 -21762 -8516 -60916 -70099 -23499 -3360 -27993 14062 -4412
7195d412m5931J3297m6938k7025L4472n242J548P5115J2258l2298l5675l3255
$$ -4412 -50343 -37046 -83984 -111009 -76537 -81779 -80231 -5116 7142 -25156 -60831 -94086
7183i4086K2220L9203o444M05k8435L2750K7512l7816j4075k7844J1472o529J5758
$$ -94086 -71866 -32663 -39107 -38702 -67137 -34387 -6875 -44691 -58766 -86610 -75138 -81667 -65909
7170f5909k9560j2353K1663L1845M935J7831j3344Q292J915Q184l531K1409J4107
$$ -65909 -95469 -107822 -86159 -54314 -49379 -31548 -44892 -36600 -34685 -26501 -30032 -8623 5484
7157E484L320l7195J1084k445n1907L0229M3860L0883l9413p602Q695l3719l5357
$$ 5484 8804 -28391 -17307 -19752 -71659 -41430 2430 33313 -6100 -13702 -5007 -38726 -74083
7144g4083j0478L0379O6002K4366j6650l2006k9535m2672j7121J0675J0158J9748
$$ -74083 -84561 -54182 11820 36186 19536 -12470 -42005 -84677 -101798 -91123 -80965 -61217
7132f1217J9504J08342N9419l4964r769o2095J4219O5209L573n3635j3325P486
$$ -61217 -41713 66629 126048 91084 81315 19220 33439 98648 102221 48586 35261 42747
7120D2747k2780J962k4450o5737l938J09488J4075j4416l4136l4427j031K748
$$ 42747 19967 21929 -2521 -68258 -72196 37292 51367 36951 2815 -31612 -32643 -29895
7108b9895k1891K3106M2417Q058K9678m2134o463j2919q589K8688j4778J5618
$$ -29895 -51786 -28680 13737 21795 51473 9339 2876 -10043 -18632 10056 -4722 10896
7096A0896N6812m4632j2613K4404K4067L224m9664l7197J4099K2294N461j9886
$$ 10896 67708 23076 10463 34867 58934 62158 12494 -24703 -10604 11690 17151 -2735
7084b735k4840K0069k186n0480k0133J6009J2895J3432K1447J882O400q960k5241
$$ -2735 -27575 -7506 -9692 -60172 -80305 -64296 -51401 -37969 -16522 -14640 -8240 -17200 -42441
7071d2441q717N2225o5421l4464N5220L0713l8122n3551Q188O3092r057l6672
$$ -42441 -51158 1067 -64354 -98818 -43598 -12885 -51007 -104558 -96370 -33278 -42335 -79007
7059g9007r163k604k5070M8492n720R317L5194j6888m3320Q110K7619N218K1939
$$ -79007 -88170 -90774 -115844 -67352 -73072 -63755 -28561 -45449 -88769 -80659 -53040 -47822 -25883
7046b5883K2946J8402J0018K0548j6910n7890l7030L0005M297k604K9627J0100
$$ -25883 -2937 15465 25483 46031 29121 -28769 -65799 -35794 -31497 -34101 -4474 5626
7034E626n502M560N805l2690J6471P262k2688m6754J2717N4889M9051L0795l2831
$$ 5626 124 4684 10489 -22201 -5730 1532 -21156 -67910 -55193 -304 48747 79542 46711
7021D6711j8464M0556K8332k4281j2804k254k7168m6770m0736N317M3179N1274
$$ 46711 28247 68803 97135 72854 60050 57796 30628 -16142 -56878 -51561 -8382 42892
7009D2892K3527n0488j0490l2640k5683J1980K6716r286k5310J4726M8838K9388
$$ 42892 66419 15931 5441 -27199 -52882 -40902 -14186 -23472 -48782 -34056 14782 44170
6997D4170k9430j8726l47k7040k1793J8755K1418J0000J461j1092K7279L8239
$$ 44170 14740 -3986 -4333 -31373 -53166 -34411 -12993 -2993 -1532 -12624 14655 52894
6985E2894J9712J2177l8475m1338J2649L8072n076n4402o8652j3897J3560M5374
$$ 52894 72606 84783 46308 4970 17619 55691 50615 -3787 -72439 -86336 -72776 -27402
6973b7402L8701M9953M2780j4025p629l0267p3720k8307j7193n2779J5487M1285
$$ -27402 11299 61252 104032 90007 82378 52111 -21609 -49916 -67109 -119888 -104401 -63116
6961f3116j3930L69R499K6505L4386M2380l4101n2327N0813K6657j6947j891K7128
$$ -63116 -77046 -76677 -67178 -40673 -6287 36093 1992 -50335 478 27135 10188 8297 35425
6948C5425k0903j2944j1896O653J9091l0222l1771J3847l495N0943J7829k0656
$$ 35425 14522 1578 -10318 -3665 15426 -14796 -46567 -32720 -36215 14728 32557 11901
6936A1901l4965L564J7951k5967p5142k8917L4050O4176J6684j2956j038J8955
$$ 11901 -23064 -19500 -1549 -27516 -102658 -131575 -97525 -33349 -16665 -29621 -30659 -11704
6924a1704j3931l5733N630K4926K6026L2698j848L7715l0430k5069l3646O6603
$$ -11704 -25635 -61368 -55738 -30812 -4786 27912 26064 63779 33349 8280 -25366 41237
$$ [...]
##END NTUPLES=NMR SPECTRUM
##END=
