##TITLE=Analysis number 318006
Compound Code cc 10404
Project Code adrs
Chemist Name synnovation
##JCAMPDX= 6.0         $$ Bruker NMR JCAMP-DX V2.0
##DATA TYPE= NMR SPECTRUM
##DATA CLASS= NTUPLES
##ORIGIN= Bruker BioSpin GmbH
##OWNER= nmr
$$ XWIN-NMR		Version 3.5
$$ Fri Mar 10 12:07:44 2006 GMT Standard Time (UT+0h)  MAYBRIDGE\nmr@NMR_250MHZ
##.OBSERVE FREQUENCY= 250.131544655141
##.OBSERVE NUCLEUS= ^1H
##.ACQUISITION MODE= SIMULTANEOUS (DQD)
##.ACQUISITION SCHEME= undefined
##.AVERAGES= 16
##.DIGITISER RES= 18
##SPECTROMETER/DATA SYSTEM= dpx250
##.PULSE SEQUENCE= zg30
##.SOLVENT NAME= CDCl3
##.SHIFT REFERENCE= (INTERNAL, CDCl3, 0, 16.522)
##AUDIT TRAIL= $$ (NUMBER, WHEN, WHO, WHERE, WHAT)
$$ ##TITLE= Audit trail, XWIN-NMR		Version 3.5
$$ ##JCAMPDX= 5.01
$$ ##ORIGIN= Bruker BioSpin GmbH
$$ ##OWNER= nmr
$$ C:\u/data/dgb/nmr/ADRS/520/pdata/1/auditp.txt
$$ ##AUDIT TRAIL=  $$ (NUMBER, WHEN, WHO, WHERE, WHAT)
(   1,<2006-03-10 12:07:23.77 +000>,<MAYBRIDGE\nmr>,<NMR_250MHZ>,
      <created by zg, POWCHK disabled, PULCHK disabled
       configuration hash MD5:
       84 BC 41 DB A1 6E 1D 46 DA 25 12 A5 C1 ED C5 3A
       data hash MD5: 64K
       D7 25 78 12 B2 21 F1 0C F4 6B 73 C1 25 18 28 17>)
(   2,<2006-03-10 12:07:37.17 +000>,<MAYBRIDGE\nmr>,<NMR_250MHZ>,
      <Start of raw data processing
       ef LB = 0.3 FT_mod = 6 PKNL = 1 SI = 32K 
       data hash MD5: 32K
       A1 0C 16 E2 DD 62 75 05 F1 AA 57 7A B2 CD 06 2D>)
(   3,<2006-03-10 12:07:38.72 +000>,<MAYBRIDGE\nmr>,<NMR_250MHZ>,
      <apk 
       data hash MD5: 32K
       7A 28 C8 D4 63 AD 4A C3 C4 0C 32 EF D0 A1 D0 85>)
(   4,<2006-03-10 12:07:39.58 +000>,<MAYBRIDGE\nmr>,<NMR_250MHZ>,
      <abs ABSG = 5 
       data hash MD5: 32K
       AD 10 D1 80 04 C7 54 50 43 E8 0D 35 E5 FD 9F 62>)
$$ ##END=
$$ 
$$ hash MD5
$$ C8 7C 5F 67 48 13 56 EC 1D 7A EC 4C 5C 8F 32 84
##$RELAX= 
##$RELAX= 
##$RELAX= 
##$RELAX= 
##$RELAX= 
##$RELAX= 
##$RELAX= 
$$ Bruker specific parameters
$$ --------------------------
##$DU= <C:\u>
##$EXPNO= 520
##$NAME= <ADRS>
##$PROCNO= 1
##$TYPE= <nmr>
##$USER= <dgb>
##$AMP= (0..31)
100 100 100 100 100 100 100 100 100 100 100 100 100 100 100 100 100 100 
100 100 100 100 100 100 100 100 100 100 100 100 100 100 
##$AQSEQ= 0
##$AQ_mod= 3
##$AUNM= <au_zg>
##$AUTOPOS= <27 >
##$BF1= 250.13
##$BF2= 250.13
##$BF3= 250.13
##$BF4= 250.13
##$BF5= 500.13
##$BF6= 500.13
##$BF7= 500.13
##$BF8= 500.13
##$BYTORDA= 1
##$CFDGTYP= 0
##$CFRGTYP= 5
##$CHEMSTR= <none>
##$CNST= (0..31)
1 1 145 1 1 1 1 1 1 1 1 1 1 1 1 1 1 1 1 1 1 1 1 1 1 1 1 1 1 1 1 1 
##$CPDPRG= <>
##$CPDPRG1= <>
##$CPDPRG2= <>
##$CPDPRG3= <>
##$CPDPRG4= <mlev>
##$CPDPRG5= <mlev>
##$CPDPRG6= <mlev>
##$CPDPRG7= <mlev>
##$CPDPRG8= <mlev>
##$CPDPRGB= <>
##$CPDPRGT= <>
##$D= (0..31)
0 1 0 0 0 0 0 0 0 0.06 0 0 0 0 0 0 0.0002 0 0 0 0 0 0 0 0 0 0 0 0 0 0 
0 
##$DATE= 1141992442
##$DBL= (0..7)
120 120 120 120 120 120 120 120 
##$DBP= (0..7)
150 150 150 150 150 150 150 150 
##$DBP07= 0
##$DBPNAM0= <>
##$DBPNAM1= <>
##$DBPNAM2= <>
$$ [...]
##$SUBNAM7= <"">
##$SUBNAM8= <"">
##$SUBNAM9= <"">
##$SW= 20.6930455092707
##$SWIBOX= (0..15)
0 0 3 0 0 0 0 0 0 0 0 0 0 0 0 0 
##$SW_h= 5175.983436853
##$TD= 65536
##$TD0= 1
##$TE= 294.16
##$TE2= 300
##$TE3= 300
##$TEG= 300
##$TL= (0..7)
0 120 120 120 120 120 120 120 
##$TP= (0..7)
150 150 150 150 150 150 150 150 
##$TP07= 0
##$TPNAME0= <>
##$TPNAME1= <>
##$TPNAME2= <>
##$TPNAME3= <>
##$TPNAME4= <>
##$TPNAME5= <>
##$TPNAME6= <>
##$TPNAME7= <>
##$TPOAL= (0..7)
0.5 0.5 0.5 0.5 0.5 0.5 0.5 0.5 
##$TPOFFS= (0..7)
0 0 0 0 0 0 0 0 
##$TUNHIN= 0
##$TUNHOUT= 0
##$TUNXOUT= 0
##$USERA1= <user>
##$USERA2= <user>
##$USERA3= <user>
##$USERA4= <user>
##$USERA5= <user>
##$V9= 5
##$VALIST= <valist>
##$VCLIST= <CCCCCCCCCCCCCCC>
##$VD= 0
##$VDLIST= <DDDDDDDDDDDDDDD>
##$VPLIST= <PPPPPPPPPPPPPPP>
##$VTLIST= <TTTTTTTTTTTTTTT>
##$WBST= 1024
##$WBSW= 4
##$XGAIN= (0..3)
0 0 0 0 
##$XL= 0
##$YL= 0
##$YMAX_a= 558445
##$YMIN_a= -574449
##$ZGOPTNS= <>
##$ZL1= 120
##$ZL2= 120
##$ZL3= 120
##$ZL4= 120
##$ABSF1= 16.522
##$ABSF2= -4.171173
##$ABSG= 5
##$ABSL= 3
##$ALPHA= 0
##$AQORDER= 0
##$ASSFAC= 0
##$ASSFACI= 0
##$ASSFACX= 0
##$ASSWID= 0
##$AUNMP= <proc_1d>
##$AZFE= 0.1
##$AZFW= 0.1
##$BCFW= 0
##$BC_mod= 0
##$BYTORDP= 0
##$COROFFS= 0
##$CY= 12.5
##$DATMOD= 1
##$DC= 0
##$DFILT= <>
##$DTYPP= 0
##$F1P= 14.0000005364418
##$F2P= -0.99999901652339
##$FCOR= 0.5
##$FTSIZE= 32768
##$FT_mod= 6
##$GAMMA= 0
##$GB= 0
##$INTBC= 1
##$INTSCL= 1
##$ISEN= 128
##$LB= 0.3
##$LEV0= 0
##$LPBIN= 0
##$MAXI= 10000
##$MC2= 0
##$MEAN= 0
##$ME_mod= 0
##$MI= 0
##$NCOEF= 0
##$NC_proc= -2
##$NLEV= 6
##$NOISF1= 0
##$NOISF2= 0
##$NSP= 0
##$NTH_PI= 0
##$NZP= 0
##$OFFSET= 16.522
##$PC= 1
##$PHC0= 171.9096
##$PHC1= 4.486499
##$PH_mod= 1
##$PKNL= yes
##$PPARMOD= 0
##$PSCAL= 4
##$PSIGN= 0
##$REVERSE= no
##$SF= 250.13
##$SI= 32768
##$SIGF1= 0
##$SIGF2= 0
##$SINO= 400
##$SIOLD= 32768
##$SREGLST= <1H.CDCl3>
##$SSB= 0
##$STSI= 32768
##$STSR= 0
##$SW_p= 5175.98343685301
##$SYMM= 0
##$S_DEV= 0
##$TDeff= 65536
##$TDoff= 0
##$TI= <Analysis number 999999
Compound Code 99
Book Reference 9
Project Code 9>
##$TILT= no
##$TM1= 0
##$TM2= 0
##$TOPLEV= 0
##$USERP1= <user>
##$USERP2= <user>
##$USERP3= <user>
##$USERP4= <user>
##$USERP5= <user>
##$WDW= 1
##$XDIM= 32768
##$YMAX_p= 471957869
##$YMIN_p= -154177
$$ End of Bruker specific parameters
$$ ---------------------------------
##NTUPLES= NMR SPECTRUM
##VAR_NAME=  FREQUENCY,     SPECTRUM/REAL,   SPECTRUM/IMAG
##SYMBOL=    X,             R,               I
##VAR_TYPE=  INDEPENDENT,   DEPENDENT,       DEPENDENT
##VAR_FORM=  AFFN,          ASDF,            ASDF
##VAR_DIM=   32768,         32768,           32768
##UNITS=     HZ,            ARBITRARY UNITS, ARBITRARY UNITS
##FACTOR=    0.157963299565203, 1,           1
##FIRST=     4132.6476996994, 0,             0
##LAST=      -1043.33573715361, 0,           0
##MIN=       -1043.33573715361, -154177,     0
##MAX=       4132.6476996994, 471957869,     0
$$ Real data points
##PAGE= N=1
##DATA TABLE= (X++(R..R)), XYDATA
$$ [...]
$$ plain form
16900 24637 13387 -7393 -23032 -33728 -29749 -20669 -4240 1294 -14531 -24498 -26923 -5942 8473
16887 8473 7945 9689 31619 40515 63522 73909 74817 79934 80578 74637 84371 101303 109802 103303
16873 103303 105658 105768 105884 105083 99648 97476 80678 66061 41066 19613 7441 1389 4045 18157
16859 18157 18450 1511 -21622 -25971 -18764 -9696 -6713 5149 6530 -6142 -6930 7453 17121 4031
16845 4031 1337 15351 32772 20212 30228 40499 38148 27887 27623 19233 24619 17722 20513
16832 20513 31991 20939 17710 18549 17918 18510 4487 -7921 -3514 3964 8014 6846 18983 18832
16818 18832 12716 18094 24973 31133 39177 53655 45103 33214 55418 63240 76052 75829 85196 74997
16804 74997 70865 79931 65419 51215 54748 65606 78899 86561 84361 78146 85633 92301 89191
$$ packed form
16900B4637j1250k0780j5639j0696L979R080J6429N534j5825r967k425K0981J4415
16887H473n28J744K1930Q896K3007J0387R08N117O44n941R734J6932Q499o499
16873A03303K355J10J16q01n435k172j6798j4617k4995k1453j2172o052K656J4112
16859A8157K93j6939k3133m349P207R068K983J1862J381j2672p88J4383R668j3090
16845D031k694J4014J7421j2560J0016J0271k351j0261k64q390N386o897K791
16832B0513J1478j1052l229Q39o31N92j4023j2408M407P478M050j168J2137j51
16818A8832o116N378O879O160Q044J4478q552j1889K2204P822J2812k23R367j0199
16804G4997m132R066j4512j4204L533J0858J3293P662k200o215P487O668l110
$$ plain form
16791 89191 96406 94532 102836 109755 138157 153445 149917 141077 130653 135469 143565 145608 154469 161222
16777 161222 156435 157478 190977 217174 226018 243453 245814 224342 202630 199159 197942 204134 218242
16764 218242 225343 243103 253568 264002 280747 315827 335535 342496 357325 386965 420794 485754
16752 485754 571572 611470 618764 653662 759650 952286 1132270 1158327 1096296 1110266 1230648
16741 1230648 1437687 1616305 1635745 1590546 1591369 1609917 1654856 1748755 1802617 1832179 1899211
16730 1899211 1960385 2027189 2143881 2305982 2500573 2741679 3100921 3546740 4047563 4651039
16720 4651039 5467001 6614564 8482762 11552613 16669272 24433235 32661371 38810299
16712 38810299 43896630 49027582 57940926 74946677 91265378 98675997 100425359 94914941
$$ packed form
16791H9191P215j874Q304O919K8402J5288l528q840j0424M816Q096K043Q861O753
16777A61222m787J043L3499K6197Q844J7435K361k1472k1712l471j217O192J4108
16764B18242P101J7760J0465J0434J6745L5080J9708O961J4829K9640L3829O4960
16752D85754Q5818L9898P294L4898J05988J92636J79984K6057o2031J3970J20382
16741A230648K07039J78618J9440m5199Q23J8548M4939R3899N3862K9562O7032
16730A899211O1174O6804J16692J62101J94591K41106L59242M45819N00823O03476
16720D651039Q15962J147563J868198L069851N116659P763963Q228136O148928
16712C8810299N086331N130952Q913344J7005751J6318701P410619J749362n510418
$$ plain form
16704 94914941 89917150 96305950 103531265 103191493 97273250 82262735 65979834 57435807
16696 57435807 52276619 46800267 40286649 31690056 23532163 17905612 14236774 11693238
16688 11693238 9831728 8483850 7461639 6610539 5909317 5277805 4728116 4291048 3936962
16679 3936962 3636806 3367975 3097177 2847090 2690265 2608022 2516017 2409043 2284475 2118297
16669 2118297 1980520 1908144 1822663 1722152 1605658 1439747 1300351 1194641 1088747 985200
16659 985200 878448 786998 716630 650365 573728 531712 510910 485764 454836 428332 414383
16648 414383 389302 377512 367834 360274 352941 342008 326762 300141 295655 279814 257065 258369
16636 258369 264208 243440 224023 210019 199348 189810 193367 197084 177685 183805 185015 163518 151434
$$ packed form
16704I4914941m997791O388800P225315l39772n918243j5010515j6282901q544027
16696E7435807n159188n476352o513618q596593q157893n626551l668838k543536
16688A1693238j861510j347878j022211q51100p01222o31512n49689m37068l54086
16679C936962l00156k68831k70798k50087j56825q2243r2005j06974j24568j66178
16669B118297j37777p2376q5481j00511j16494j65911j39396j05710j05894j03547
16659I85200j06752r1450p0368o6265p6637m2016k0802k5146l0928k6504j3949
16648D14383k5081j1790r678p560p333j0933j5246k6621m486j5841k2749J304
16636B58369N839k0768j9417j4004j0671r538L557L717j9399O120J210k1497j2084
$$ plain form
16623 151434 152503 144794 148813 152872 163287 159451 154917 155044 160166 151730 134246 115133 123413 133539
16609 133539 131745 119643 133026 125802 112928 97157 87916 75466 83439 98751 99377 99190 91161
16596 91161 96052 117354 121384 117179 121026 122991 126524 124867 121438 128516 145040 143814 127523 109307
16582 109307 107165 140612 152936 126682 103984 96777 111707 122209 116674 115350 113033 107834 97973
16569 97973 87552 90375 96416 100998 97151 93737 99259 87838 85416 104350 97254 93234 100154 110086
16555 110086 109077 99247 105780 99400 96477 96134 83663 74088 68404 57207 74350 67717 33581
16542 33581 12322 -3616 -7573 3693 -3846 -21194 -25438 -19434 -19116 -8341 -5903 -17302 -36432
16529 -36432 -39053 -39877 -35428 -20262 -12566 6173 -4329 -8503 7373 38745 61932 77244 80191
$$ packed form
16623A51434J069p709M019M059J0415l836m534J27N122q436j7484j9113Q280J0126
16609A33539j794j2102J3383p224j2874j5771r241j2450P973J5312O26j87q029
16596I1161M891K1302M030m205L847J965L533j657l429P078J6524j226j6291j8216
16582A09307k142L3447J2324k6254k2698p207J4930J0502n535j324k317n199r861
16569I7973j0421K823O041M582l847l414N522j1421k422J8934p096m020O920R932
16555A10086j009r830O533o380k923l43j2471r575n684j1197J7143o633l4136
16542C3581k1259j5938l957J1266p539j7348m244O004L18J0775K438j1399j9130
16529c6432k621q24M449J5166P696J8739j0502m174J5876L1372K3187J5312K947
$$ plain form
16516 80191 78165 57670 58341 64244 64801 54693 48047 60781 41873 31403 34399 25422 32399 52466
16502 52466 50954 35851 37174 35128 37063 21714 28237 40740 47102 32684 26526 18021 13089
16489 13089 7259 1067 5716 3504 -6731 -18290 -8777 6874 10347 19980 27388 19457 11532 13856
16475 13856 5471 20642 29333 29152 29882 33357 32503 24806 29084 30854 14214 13161 4632 4490 -9935
16460 -9935 -15760 -13847 -13406 -11505 -6047 -3580 3178 18669 33245 32299 21535 -7078 6134 32606
16446 32606 38051 39175 42342 33548 24365 11864 459 -978 -1705 8469 24967 33136 37314 35569
16432 35569 30777 31852 26957 28845 44826 43534 37833 38270 36256 31449 34724 24348 11857 16394
16418 16394 10647 11152 22000 24794 41657 51647 44806 24978 12303 14325 8907 69 -21943
$$ packed form
16516H0191k026k0495O71N903N57j0108o646J2734j8908j0470K996q977O977K0067
16502E2466j512j5103J323k046J935j5349O523J2503O362j4418o158q505m932
16489A3089n830o192M649k212j0235j1559R513J5651L473R633P408p931p925K324
16475A3856q385J5171Q691j81P30L475q54p697M278J770j6640j053q529j42j4425
16460i935n825J913M41J901N458K467O758J5491J4576r46j0764k8613J3212K6472
16446C2606N445J124L167q794r183j2501j1405j437p27J0174J6498Q169M178j745
16432C5569m792J075m895J888J5981j292n701M37k014m807L275j0376j2491M537
16418A6394n747N05J0848K794J6863R990o841j9828j2675K022n418q838k2012
$$ plain form
16405 -21943 -29863 -7867 16915 19934 19989 8461 -1680 -4687 -497 17072 20196 15630 6591 488
16391 488 12443 14765 19112 8823 671 280 2011 6409 -324 -4004 -858 19358 32356 27326
16377 27326 15738 20397 7500 1329 3476 4012 -6819 -14122 -10814 -31734 -21986 -9697 1480
16364 1480 1978 4648 2779 11157 34754 42632 39372 33921 14426 -7930 -8244 5160 6031 9042
16350 9042 10158 11169 8282 -1336 5804 18762 35528 41436 41149 21450 22885 27793 22635 26906
16336 26906 31043 30357 25289 49743 68485 73261 65177 66449 64059 80641 87602 76904 72768 60350
16322 60350 58794 50830 34624 30372 17753 35198 37602 31846 28469 28360 23869 17804 8878 19137
16308 19137 15113 9098 9375 -461 -4076 4055 21874 12744 2141 9870 33334 35784 18196 16454
$$ packed form
16405b1943p920K1996K4782L019N5j1528j0141l007M190J7569L124m566r039o103
16391D88J1955K322M347j0289q152l91J731M398o733l680L146K0216J2998n030
16377B7326j1588M659j2897o171K147N36j0831p303L308k0920R748J2289J1177
16364A480M98K670j869Q378K3597P878l260n451j9495k2356l14J3404Q71L011
16350I042J116J011k887r618P140J2958J6766N908k87j9699J435M908n158M271
16336B6906M137o86n068K4454J8742M776q084J272k390J6582O961j0698m136j2418
16322F0350j556p964j6206m252j2619J7445K404n756l377j09m491o065q926J0259
16308A9137m024o015K77r836l615Q131J7819r130j0603P729K3464K450j7588j742
$$ plain form
16294 16454 20472 23386 18030 16576 15232 5778 5720 9910 15411 12726 22121 13788 17040 22825 21001
16279 21001 9164 -7594 -6828 -6535 -738 4426 13335 7615 15637 18372 12189 19304 27620 20489
16265 20489 26019 43558 55407 56203 54622 74334 89022 114104 119625 108709 88393 98349 110367
16252 110367 99473 88687 65239 67426 55835 45323 30867 27236 28885 32529 27973 36645 37991
16239 37991 29414 29824 39022 33984 25955 33176 42323 51098 58701 66603 69710 75543 66258 54810
16225 54810 55556 52720 39385 29501 32179 31924 33470 44593 32106 30971 13992 13703 27658 43561
16211 43561 65022 81161 63234 56400 42537 27093 26866 25285 36588 22562 24642 42497 38682
16198 38682 47865 46367 44548 33810 26515 36470 43225 35955 31804 19065 11768 30499 40260 34097
$$ packed form
16294A6454M018K914n356j454j344r454n8M190N501k685R395q333L252N785j824
16279B1001j1837j6758P66K93N797N164Q909n720Q022K735o183P115Q316p131
16265B0489N530J7539J1849P96j581J9712J4688K5082N521j0916k0316R956J2018
16252A10367j0894j0786k3448K187j1591j0512j4456l631J649L644m556Q672J346
16239C7991q577M10R198n038q029P221R147Q775P603P902L107N833r285j1448
16225E4810P46k836j3335r884K678k55J546J1123j2487j135j6979k89J3955J5903
16211D3561K1461J6139j7927o834j3863j5444k27j581J1303j4026K080J7855l815
16198C8682R183j498j819j0738p295R955O755p270m151j2739p297J8731R761o163
$$ plain form
16184 34097 28098 15322 21542 30136 20349 -1122 16305 27785 39241 36267 29465 40578 49058
16171 49058 57453 71322 96404 124922 140459 142745 131670 136391 145471 146883 146840 146254 141565 132922
16157 132922 123767 117399 139337 209645 278030 261189 190313 136533 99083 60939 33517 30770
16145 30770 38167 52556 40975 29676 19518 16638 27885 37182 40847 35226 38545 42381 44062
16132 44062 57745 44897 35262 46688 64832 83195 115263 166395 215708 242254 265102 297113
16120 297113 388938 495353 557708 575762 540188 502928 534667 579307 564706 535339 462582
16109 462582 379675 330955 291683 243002 217567 174272 138214 104297 79534 50222 37320
16098 37320 33385 26276 19804 22701 20693 21997 25633 17330 1341 -20331 -20337 -10493 8789 6501
$$ packed form
16184C4097n999j2776O220Q594r787k1471J7427J1480J1456k974o802J1113Q480
16171D9058Q395J3869K5082K8518J5537K286j1075M721R080J412m3n86m689q643
16157A32922r155o368K1938P0308O8385j6841p0876n3780l7450l8144k7422k747
16145C0770P397J4389j1581j1299j0158k880J1247R297L665n621L319L836J681
16132D4062J3683j2848r635J1426J8144J8363L2068N1132M9313K6546K2848L2011
16120B97113R1825J06415O2355J8054l5574l7260L1739M4640j4601k9367p2757
16109D62582q2907m8720l9272m8681k5435m3295l6058l3917k4763k9312j2902
16098C7320l935p109o472K897k008J304L636q303j5989k1672oR844J9282k288
$$ plain form
16084 6501 7621 7542 2463 -4123 -7870 -1108 -8400 -10031 -18030 -13775 -22614 -12223 -2496 -11317 -21620
16069 -21620 -19325 -16345 -10584 -2318 3205 467 6087 -5818 -16515 -9912 -11704 -16749 -24469 -32933
16055 -32933 -7784 -2776 -26343 -23276 -11369 5000 10615 -8211 -19036 -30548 -27441 -15444
16043 -15444 -18385 -12805 -13366 -310 5625 20666 18422 7136 -5155 -4880 -22051 -26410 -25693 -24117
16029 -24117 -25561 -17470 -21341 -32669 -27796 -10856 -8160 -8835 -13762 -15167 -11904 -12063 -24968 -30773
16015 -30773 -20212 -15528 -17599 -13055 1567 6258 -8551 -15556 -7200 -22074 -22557 -12016 -405
16002 -405 -11571 2703 9321 3592 -5593 -1367 3924 1054 7601 18947 22759 10477 -3853 -12981
15988 -12981 -8857 -31034 -45668 -31074 -13762 -19892 -12025 -5141 -1818 -6038 -22500 -34718 -31042
$$ packed form
16084F501J120p9n079o586l747O762p292j631p999M255q839J0391R727q821j0303
16069b1620K295K980N761Q266N523k738N620j1905j0697O603j792n045p720q464
16055c2933K5149N008k3567L067J1907J6369N615j8826j0825j1512L107J1997
16043a5444k941N580n61J3056N935J5041k244j1286j2291K75j7171m359P17J576
16029b4117j444Q091l871j1328M873J6940K696o75m927j405L263j59j2905n805
16015c0773J0561M684k071M544J4622M691j4809p005Q356j4874m83J0541J1611
16002d05j1166J4274O618n729r185M226N291k870O547J1346L812j2282j4330r128
15988a2981M124k2177j4634J4594J7312o130P867O884L323m220j6462j2218L676
$$ plain form
15975 -31042 -16051 -19483 -31307 -21830 2218 -695 480 11205 2392 6074 11864 12922 11799
15962 11799 611 -894 7921 3875 -7749 -22408 -8906 -4448 -11408 -8082 -6190 -3364 -8290
15949 -8290 -13670 -1500 -7152 -11798 -31470 -42977 -38733 -25152 -20786 -10620 -2816 -28603 -27900
15936 -27900 -13180 -196 3445 -1942 -12518 -22502 -35693 -18478 -19260 -14490 -10157 -2889 3687
15923 3687 -14102 -18432 -19156 -9174 11477 23970 21038 19418 22533 13424 1274 -5262 -2198 10257
15909 10257 25359 26664 11987 25515 30380 16812 810 1425 -1182 -7796 4112 10630 14398
15896 14398 4650 1009 161 3597 6147 1274 -16968 -12435 -8106 -1322 -4425 -7914 -9764 -5343
15882 -5343 11814 2842 13081 16279 5071 2488 -9348 -25052 -27107 -34177 -32097 -23662 -21492
$$ packed form
15975c1042J4991l432j1824R477K4048k913J175J0725q813L682N790J058j123
15962A1799j1188j505Q815m046j1624j4659J3502M458o960L326J892K826m926
15949h290n380J2170n652m646j9672j1507M244J3581M366J0166P804k5787P03
15936b7900J4720J2984L641n387j0576r984j3191J7215p82M770M333P268O576
15923C687j7789m330p24R982K0651J2493k932j620L115r109j2150o536L064J2455
15909A0257J5102J305j4677J3528M865j3568j6002O15k607o614J1908O518L768
15896A4398r748l641q48L436K550m873j8242M533M329O784l103l489j850M421
15882e343J7157q972J0239L198j1208k583j1836j5704k055p070K080Q435K170
$$ plain form
15869 -21492 -23860 -13802 -14535 -11544 -7107 -9304 -550 17548 17557 6300 7724 20419 14159 -4761
15855 -4761 -10273 -12354 -7054 -12822 -11308 -3762 -3474 8199 21090 26012 44777 43491 24768 19922
15841 19922 36258 23502 -101 -4604 -4555 -9427 -16753 -18538 -18612 -14037 -8344 2603 19432 32117
15827 32117 3615 3139 19400 20386 29586 38080 55779 65775 68851 67868 77127 98299 126154 161789
15813 161789 183085 250403 335036 450606 668518 1099204 2026896 3718245 4941348 4104711
15803 4104711 2487354 1532149 1043191 746467 542368 409427 315808 256511 207517 164067
15793 164067 149185 139747 146859 142727 117765 97151 85004 92062 83495 68182 54216 34077
15781 34077 40690 42758 47074 57998 59080 42456 38184 34882 25340 4943 -5270 2949 21433
$$ packed form
15869b1492k368J0058p33K991M437k197Q754J8098Rj1257J424J2695o260j8920
15855d761n512k081N300n768J514P546K88J1673J2891M922J8765j286j8723m846
15841A9922J6336j2756k3603m503M9m872p326j785p4M575N693J0947J6829J2685
15827C2117k8502m76J6261R86R200Q494J7699R996L076r83R259K1172K7855L5635
15813A61789K1296O7318Q4633J15570K17912M30686R27692J691349J223103q36637
15803D104711j617357r55205m88958k96724k04099j32941r3619n9297m8994m3450
15793A64067j4882r438P112m132k4962k0614j2147P058q567j5313j3966k0139
15781C4077O613K068M316J0924J082j6624m272l302r542k0397j0213Q219J8484
$$ plain form
15768 21433 27461 10729 243 9967 13699 13292 26181 38502 37168 17411 5482 12297 17546
15755 17546 -882 -11566 -2488 6502 6337 1518 -2543 9406 5756 7593 -4802 -3008 -501 2746
15741 2746 663 -5052 -3937 -12457 -22713 -20171 -21484 -15415 -6965 -9330 -5416 -3796 -11597 -10741 2824
15726 2824 19550 8292 2493 20211 30396 48056 73054 79503 85502 95682 88280 80771 60903
15713 60903 52964 54193 37825 16387 13283 11810 20041 20044 13197 23508 32221 28492 3836 -20936
15699 -20936 -23886 -21073 -8514 961 2975 14590 20101 22890 4079 -2992 -4042 14036 20149
15686 20149 17527 17639 18027 22425 26147 25296 6429 6042 2084 5180 14385 7058 -10689 -23718 -14404
15671 -14404 -9984 -4045 3268 2344 -9624 -26208 -28696 -23101 -12540 -7870 -7865 -10741 -12326 -12136 -31
$$ packed form
15768B1433O028j6732j0486R724L732m07J2889J2321j334j9757j1929O815N249
15755A7546j8428j0684R078Q990j65m819m061J1949l650J837j2395J794K507L247
15741B746k083n715J115q520j0256K542j313O069Q450k365L914J620p801Q56J3565
15726B824J6726j1258n799J7718J0185J7660K4998O449N999J0180p402p509j9868
15713F0903p939J229j6368k1438l104j473Q231Lo847J0311Q713l729k4656k4772
15699b0936k950K813J2559R475K014J1615N511K789j8811p071j050J8078O113
15686B0149k622J12L88M398L722q51j8867l87l958L096R205p327j7747j3029R314
15671a4404M420N939P313r24j1968j6584k488N595J0561M670Nk876j585J90J2105
$$ plain form
15656 -31 1139 4432 12840 3669 10961 8888 1138 -5227 6582 10190 8688 17833 26316 20400 5870
15641 5870 -4339 -12575 -13810 -22157 -21045 -21816 -29119 -40725 -42091 -39045 -29248 -31506 -34167 -22338
15627 -22338 -5086 -5458 -19298 -17756 -9006 -675 -8634 -15249 -19582 -8636 -9011 5341 9103 15230
15613 15230 18792 5630 -4171 8276 14504 15970 20151 24820 27300 10587 -10298 -17063 -22966
15600 -22966 -8682 5584 9770 5243 -19294 -18175 -17510 -31701 -36499 -31284 -20098 -6660 -4807
15587 -4807 -17654 -13133 -1137 -5076 -12625 -9197 -6519 -9414 -2987 5527 2847 -5518 -17842 -13386
15573 -13386 -4480 462 -5466 -6454 -5997 -7827 -15201 -13755 -8941 2493 10950 -8429 -22336 -34287
15559 -34287 -31706 -32762 -18815 -17410 -7437 -13818 -27205 -26385 -20781 -7623 -10969 -10054 -8015 -24699
$$ packed form
15656c1J170L293Q408r171P292k073p750o365J1809L608j502R145Q483n916j4530
15641E870j0209q236j235q347J112p71p303j1606j366L046R797k258k661J1829
15627b2338J7252l72j3840J542Q750Q331p959o615m333J0946l75J4352L762O127
15613A5230L562j3162r801J2447O228J466M181M669K480j6713k0885o765n903
15600b2966J4284J4266M186m527k4537J119O65j4191m798N215J1186J3438J853
15587d807j2847M521J1996l939p549L428K678k895O427Q514k680q365j2324M456
15573a3386Q906M942n928r88M57j830p374J446M814J1434Q457j9379j3907j1951
15559c4287K581j056J3947J405R973o381j3387Q20N604J3158l346R15K039j6684
$$ plain form
15545 -24699 -20083 333 8738 111 -10387 -14692 -20755 -12040 2241 15360 16746 25052 18197
15532 18197 17579 10059 -2028 -6860 -20025 -17537 -3293 3315 -7022 -27670 -33174 -33795 -29739 -30179
15518 -30179 -23366 -17285 -17812 -18293 -11871 1227 794 4096 5787 2387 -8968 -13905 -19595 -18877 -4966
15503 -4966 5123 11450 -3668 -1040 -4794 -28383 -29306 -22629 -20983 -26274 -24176 -25828 -29009 -7484
15489 -7484 3689 -1592 3832 2795 5892 -5258 -7868 -4127 -3584 4569 5828 10342 14594 13016
15475 13016 5727 -275 -9454 -17526 -15429 -24497 -18997 -20758 -20907 -14049 -13905 -10462 -14484 -6594 6815
15460 6815 3758 -2086 -14078 -21734 -36550 -34671 -26163 -17252 -6412 -1014 -4309 11002 11975 6424
15446 6424 5356 8557 -1750 -21229 -18842 -23682 -34937 -34939 -19248 -7292 -11644 -2909 14270 15333
$$ packed form
15545b4699M616K0416Q405q627j0498m305o063Q715J4281J3119J386Q306o855
15532A8197o18p520j2087m832j3165K488J4244O608j0337k0648n504o21M056m40
15518c0179O813O081n27m81O422J3098m33L302J691l400j1355m937n690P18J3911
15503d966J0089O327j5118K628l754k3589r23O677J646n291K098j652l181K1525
15489g484J1173n281N424j037L097j1150k610L741N43Q153J259M514M252j578
15475A3016p289o002r179q072K097r068N500j761j49O858J44L443m022P890J3409
15460F815l057n844j1992p656j4816J879Q508Q911J0840N398l295J5311R73n551
15446F424j068L201j0307j9479K387m840j1255kJ5691J1956m352Q735J7179J063
$$ plain form
15432 15333 13829 2488 -3457 -3676 10133 9537 -7049 -4213 5671 -10328 -17649 -17379 -16938 -13755
15418 -13755 -22363 -24537 -20469 -7868 -5809 -20194 -11782 -10397 -2085 -16297 -8263 -10437 -16039 -15657
15404 -15657 -11917 -26332 -32446 -34343 -11340 6329 21133 9530 -11381 -5279 24123 40777
15392 40777 32129 18418 -9631 -21620 -25063 -21778 -17891 -8791 -679 6620 -5741 -1158 -1116 1973
15378 1973 4098 -4744 -7356 -18889 -23743 -10393 -10437 -16733 -18075 -10372 -17003 -21045 -15483 -6383 -7449
15363 -7449 -22693 -31911 -32846 -29399 -27249 -16854 -2742 -14753 -17171 -13697 -12964 -6558 3407 6427
15349 6427 5179 23087 18884 -2310 5778 3220 -273 473 -5936 -28069 -35632 -40137 -35416 -22602
15335 -22602 -21918 -23241 -13474 -10068 -10899 -16402 -11553 -7246 -1322 1046 1929 -9683 -26012 -16721 -12873
$$ packed form
15432A5333j504j1341n945k19J3809n96j6586K836R884j5999p321K70M41L183
15418a3755q608k174M068J2601K059j4385Q412J385Q312j4212Q034k174n602L82
15404a5657L740j4415o114j897K3003J7669J4804j1603k0911O102K9402J6654
15392D0777q648j3711k8049j1989l443L285L887R100Q112P299j2361M583M2L089
15378A973K125q842k612j1533m854J3350m4o296j342P703o631m042N562R100j066
15363g449j5244r218r35L447K150J0395J4112j2011k418L474P33O406R965L020
15349F427j248J7908m203k1194Q088k558l493P46o409k2133p563m505M721J2814
15335b2602O84j323R767L406q31n503M849M307N924K368Q83j1612j6329R291L848
$$ plain form
15320 -12873 -8808 -28612 -44893 -35255 -17238 -9440 -14408 -16077 -15872 -30634 -23282 2313 2147 -87
15306 -87 6297 -8045 -6256 -10279 -9475 -11408 -20492 -12841 6047 13591 6730 -4381 -265 2786 -8524
15291 -8524 -19414 -5795 -4811 -16944 -7185 -5057 1446 7661 16344 19378 22328 7164 -11241 2081
15277 2081 6640 152 3004 -4193 -6494 7815 -386 -13052 -3651 820 3288 13314 38691 43272
15263 43272 35508 9139 1134 -5954 -98 2486 -4953 -7304 -4686 868 -9750 -3855 -11242 -16752
15249 -16752 -11544 402 1689 -9524 -23575 -18357 -3734 -1391 2018 1645 -464 -15144 -31391
15236 -31391 -25491 -19241 -13140 -17078 -24508 -38565 -25949 -17942 -5572 -5075 -18622 -14997 -16076 -14493
15222 -14493 -548 8610 -5732 -19659 -31410 -30316 -20234 -16798 -10407 -1433 7410 10182 5140
$$ packed form
15320a2873M065j9804j6281R638J8017P798m968j669K05j4762P352K5595j66k234
15306h7O384j4342J789m023Q04j933r084P651J8888P544o861j1111M116L051j1310
15291h524j0890J3619R84j2133R759K128O503O215Q683L034K950j5164j8405J3322
15277B081M559o488K852p197k301J4309q201j2666R401M471K468J0026K5377M581
15263D3272p764k6369q005p088N856K584p439k351K618N554j0618N895p387n510
15249a6752N208J1946J287j1213j4051N218J4623K343L409l73k109j4680j6247
15236c1391N900O250O101l938p430j4057J2616Q007J2370M97j3547L625j079J583
15222a4493J3945R158j4342j3927j1751J094J0082L436O391Q974Q843K772n042
$$ plain form
15209 5140 4852 23067 24216 20924 24965 18184 3062 -3107 -6938 -16365 -7352 1871 14133 7168
15195 7168 14882 2826 -18444 -27762 -35801 -36286 -37014 -26818 -144 9680 -11657 -16912 -23110 -30878
15181 -30878 -26114 -25210 -26079 -22767 -7594 3324 -4768 -12432 -30518 -21881 -12726 -9838 -6567 -11589
15167 -11589 -4043 1 -4643 -6981 666 4823 13933 -2609 -7177 -4349 -17012 -13741 -8001 9478
15153 9478 5039 5551 18942 5396 4305 5342 7212 117 -7770 -655 -171 -13076 -19496 -22304
15139 -22304 -13793 -716 -2641 -13167 -11296 9557 10225 6609 25452 22801 19113 8940 -3020
15126 -3020 -770 -2047 10800 1031 -1895 -294 9045 7145 8131 19213 16842 2521 -10260 -13912
15112 -13912 1316 6895 10806 12469 10749 13860 18276 2489 -5586 -12269 -29623 -13870 13046
$$ packed form
15209E140k88J8215J149l292M041o781j5122o169l831r427R013R223J2262o965
15195G168P714j2056k1270r318q039m85p28J0196K6674R824k1337n255o198p768
15181c0878M764R04q69L312J5173J0918q092p664j8086Q637R155K888L271n022
15167a1589P546M044m644k338P647M157R110j6542m568K828j2663L271N740J7479
15153I478m439N12J3391j3546j091J037J870p095p887P115M84j2905o420k808
15139b2304Q511J3077j925j0526J871K0853O68l616J8843k651l688j0173j1960
15126c020K250j277J2847r769k926J601R339j900R86J1082k371j4321j2781l652
15112a3912J5228N579L911J663j720L111M416j5787q075o683j7354J5753K6916
$$ plain form
15099 13046 7309 -4037 -2298 -737 1616 4189 -2915 -13983 -10375 -2771 1408 -9473 -30678
15086 -30678 -19575 -7770 -2535 4539 -31 -12586 -23757 -29600 -21851 -9480 -11595 -16705 -19995
15073 -19995 -13698 -1453 4891 910 -6539 -3065 -3267 -10425 -21706 -17329 -3467 -5310 -3763 5032
15059 5032 -55 -5534 -10424 -11840 -20222 -8712 -4286 -4928 -1085 -3020 3899 730 3274 11546 16818
15044 16818 13075 1975 -11069 -16811 -13146 -6695 -8179 -6800 -10686 -16304 -3564 -4491 -10466 -14813
15030 -14813 -15866 -23352 -21981 -12608 -19596 -30169 -29863 -13302 5877 22526 11885 5195 12458
15017 12458 17940 10037 -2309 -9913 -5080 16065 22699 13055 1596 930 13099 15510 4240
15004 4240 -1017 -14845 -4759 7169 11113 8026 10349 -6085 -11941 -6732 560 6826 8436 4137
$$ packed form
15099A3046n737j1346J739J561K353K573p104j1068L608P604M179j0881k1205
15086c0678J1103J1805N235P074m570j2555j1171n843P749J2371k115n110l290
15073a9995O297J2245O344l981p449L474k02p158j1281M377J3862j843J547Q795
15059E032n087n479m890j416q382J1510M426o42L843j935O919l169K544Q272N272
15044A6818l743j1100j3044n742L665O451j484J379l886n618J2740r27n975m347
15030a4813j053p486J371R373o988j0573L06J6561J9179J6649j0641o690P263
15017A2458N482p903j2346p604M833K1145O634r644j1459o66J2169K411j1270
15004D240n257j3828J0086J1928L944l087K323j6434n856N209P292O266J610m299
$$ plain form
14990 4137 4922 31240 37125 35985 29377 13806 16277 26321 18068 6261 1791 342 -7233 -18700
14976 -18700 -8209 -19750 -23136 -21962 -16616 1189 18018 27293 13584 -13963 -21502 -14900 -8173
14963 -8173 -12405 -12491 -9896 -7743 -15983 -16994 -15502 -23510 -20260 -20717 -20312 -30309 -23067 2682 -1323
14948 -1323 -765 -4525 -19824 -23562 -31215 -31615 -34289 -37190 -36969 -32146 -21332 -21497 -21561 -27333 -37232 -43598
14932 -43598 -27516 -16465 -5029 -8833 -16956 -15629 -19435 -15072 -1266 1026 -5823 -3806 5914
14919 5914 17656 24508 7348 -346 4105 -1562 -13129 -14654 -13687 9606 13493 7967 -20920 -19418
14905 -19418 1625 1978 -4911 -8048 -7133 -14268 2613 13934 7932 -7749 -4147 -12159 -8429 -1300
14891 -1300 22439 32032 23874 10529 -7470 -9113 6111 16889 3371 4203 1932 7772 19106
$$ packed form
14990D137P85K6318N885j140o608j5571K471J0044q253j1807m470j449p575j1467
14976a8700J0491j1541l386J174N346J7805J6829R275j3709k7547p539O602O727
14963h173m232q6K595K153q240j011J492q008L250m57M05r997P242K5749m005
14948a323N58l760j5299l738p653m00k674k901K21M823J0814j65o4n772r899o366
14932d3598J6082J1051J1436l804q123J327l806M363J3806K292o849K017R720
14919E914J1742O852j7160p694M451n667j1567j525R67K3293L887n526k8887J502
14905a9418K1043L53o889l137R15p135J6881J1321o002j5681L602q012L730P129
14891a300K3739R593q158j3345j7999j643J5224J0778j3518Q32k271N840J1334
$$ plain form
14878 19106 12675 23269 42453 62850 102490 154309 214457 257622 280554 279445 253200 255475
14866 255475 271399 269123 231547 174065 129076 83256 51573 40608 45370 31721 15586 9997
14854 9997 8285 8253 14455 20708 9107 -10200 -8738 -8073 -14976 -8675 4533 9751 -11786 -13710
14840 -13710 -33943 -34993 -12378 -6130 -5833 -2078 12361 10816 18776 11923 9351 9277 12837 6741
14826 6741 -2109 -269 -3929 -14065 -13759 -21861 -21471 -10483 5079 3784 -7893 -9448 -27585 -26947
14812 -26947 -25124 -17011 -15467 -15522 2339 3617 -16134 -26218 -12144 4652 1422 7579 23486
14799 23486 22574 22250 18116 24118 13678 2124 -1209 1214 -8675 -10113 -12035 -19858 -24589 -26673
14785 -26673 -27542 -12316 -7961 -11027 -1877 -3239 -3687 2519 7460 14811 7018 -885 2711 20990
$$ packed form
14878A9106o431J0594J9184K0397L9640N1819O0148M3165K2932j109k6245K275
14866B55475J5924k276l7576n7482m4989m5820l1683j0965M762j3649j6135n589
14854I997j712l2O202O253j1601j9307J462O65o903O301J3208N218k1537j924
14840a3710k0233j050K2615O248K97L755J4439j545P960o853k572p4L560o096
14826F741q850J840l660j0136L06q102L90J0988J5562j295j1677j555j8137O38
14812b6947J823Q113J544n5J7861J278j9751j0084J4074J6796l230O157J5907
14799B3486r12l24m134O002j0440j1554l333K423r889j438j922p823m731k084
14785b6673q69J5226M355l066R150j362m48O206M941P351p793p903L596J8279
$$ plain form
14771 20990 28237 24918 14925 13861 9973 14754 28732 32601 36562 41518 30581 14272 5588 -5574
14757 -5574 -2744 69 -254 -5580 -5018 -13761 -20775 -12379 1645 -2105 -5962 313 10209 1883 -12325
14742 -12325 -11657 -2648 -5529 -6817 1475 10800 1299 -4723 -16527 -26127 -17547 -16344 -7308 -7614 -12235
14727 -12235 -26526 -19405 -2998 9891 8576 16434 16009 -1726 14500 19132 12856 16039 15854 8967
14713 8967 23298 38394 27629 9246 6628 10709 4544 5169 -542 -823 -7590 -7040 -8347 -3624
14699 -3624 -6282 -8003 -21885 -23079 -760 -1835 3736 10335 6645 -4977 -25039 -14887 2324
14686 2324 3331 -6670 -8241 -10542 -10064 3635 6612 -496 797 8041 -8425 -9877 -13315 -23634
14672 -23634 -12013 867 2619 -2899 -7775 -435 4639 4487 -1240 -3529 -9646 -18448 -18667 -15106
$$ packed form
14771B0990P247l319r993j064l888M781J3978L869L961M956j0937j6309q684j1162
14757e574K830K813l23n326N62q743p014Q396J4024l750l857O275R896q326j4208
14742a2325O68R009k881j288Q292R325r501o022j1804r600Q580J203R036l06m621
14727a2235j4291P121J6407J2889j315P858m25j7735J6226M632o276L183j85o887
14713H967J4331J5096j0765j8383k618M081o165O25n711k81o767N50j307M723
14699c624k658j721j3882j194K2319j075N571O599l690j1622k0062J0152J7211
14686B324J007j0001j571k301M78J3699K977p108J293P244j6466j452l438j0319
14672b3634J1621J2880J752n518m876P340N074j52n727k289o117q802k19L561
$$ plain form
14658 -15106 -11494 12131 21730 8701 -7075 -4932 -18813 -26791 -20380 -25474 -11115 2206 948
14645 948 -8228 -4572 -7848 -8079 -1593 -4702 287 1255 -4127 -1324 18953 20817 6853 -1284 -7581
14630 -7581 -6261 7802 2536 -4707 -8294 -10348 -14755 -8038 -8085 -5998 -17815 -25558 -22365 -17006 -21986
14615 -21986 -16479 -3931 1433 -11530 -23090 -19050 -4347 12242 5857 -9719 -11664 -11858 -910
14602 -910 16160 37435 22808 15620 21377 14051 8209 16669 15359 17654 2721 -8838 -10575 -11044
14588 -11044 -21592 -27304 -5674 -5598 -20604 -35933 -34807 -27968 -23339 -18228 -27756 -33991 -30751 -29252
14574 -29252 -18632 -10200 -5526 12355 13321 5489 7078 -2540 -11394 -10179 -9465 -17168 -25098 -23110
14560 -23110 -8078 -4227 6523 22790 6512 3027 4964 670 -11222 -12571 -724 8989 9762
$$ packed form
14658a5106L612K3625R599j3029j5776K143j3881p978O411n094J4359J3321j258
14645I48r176L656l276k31O486l109M989R68n382K803K0277J864j3964q137o297
14630g581J320J4063n266p243l587k054m407O717m7K087j1817p743L193N359m980
14615b1986N507J2548N364j2963j1560M040J4703J6589o385j5576j945j94J0948
14602i10J7070K1275j4627p188N757p326n842Q460j310K295j4933j1559j737m69
14588a1044j0548n712K1630P6j5006j5329J126O839M629N111r528o235L240J499
14574b9252J0620Q432M674J7881R66p832J589r618q854J215P14p703p930J988
14560b3110J5032L851J0750J6267j6278l485J937m294j1892j349J1847R713P73
$$ plain form
14547 9762 1397 -1283 -14773 -10035 -26154 -29146 -18803 -16748 -16067 -11674 -73 10016 2770 838
14533 838 -2801 -7087 -10941 -8075 -3186 19315 18916 2341 -8235 -2143 11667 7071 -7251 -20234
14519 -20234 -19536 -27712 -38420 -21049 -13688 -14642 -2617 -6220 -8941 -19047 -20404 -14662 -6028 -7252
14505 -7252 -1737 -5175 -1515 -4007 -3611 2667 8252 10079 2991 -7050 -12390 -40941 -40783 -31133 -24729
14490 -24729 -17186 -30118 -22996 -12934 8469 11180 -4063 -5422 3982 -3059 -1135 -7735 -11763
14477 -11763 3101 13692 8941 3891 13834 7909 -841 -12517 -20775 -24191 2646 4173 -4218
14464 -4218 -19799 -26578 -18153 -12560 -11285 -6178 -7001 3325 12446 -2856 14107 19881 11250 10113
14450 10113 14440 -354 -884 11331 7506 1977 -1954 -9149 -5348 20242 31711 15218 661
$$ packed form
14547I762q365k680j3490M738j6119k992J0343K055O81M393J1601J0089p246j932
14533H38l639m286l854K866M889K2501l99j6575j0576O092J3810m596j4322j2983
14519b0234O98q176j0708J7371P361r54J2025l603k721j0106j357N742Q634j224
14505g252N515l438L660k492L96O278N585J827p088j0041n340k8551J58R650O404
14490b4729P543j2932P122J0062K1403K711j5243j359R404p041J924o600m028
14477a1763J4864J0591m751n050R943n925q750j1676q258l416K6837J527q391
14464d218j5581o779Q425N593J275N107q23J0326R121j5302J6963N774q631j137
14450A0113M327j4794n30J2215l825n529l931p195L801K5590J1469j6493j4557
$$ plain form
14437 661 -5155 -1780 -1726 -358 5669 9131 3685 -7713 -2174 3999 -9345 -4271 9260 21053
14423 21053 15102 -4327 -16722 6773 10882 -5851 -19948 -18333 -802 12815 -1076 -16376
14411 -16376 -16923 -19164 -17137 -7220 -3590 -15818 -20722 -16448 -11221 -25743 -31377 -29193 -14487 -4580
14397 -4580 7103 18330 13593 25639 10743 5959 18240 7601 -279 -5513 -4083 10354 7380
14384 7380 6862 12365 10565 13754 -5075 -11252 -18037 -8942 -17302 -23992 -9629 -9322 -1441 -2979 1202
14369 1202 -5811 -7001 -4524 873 -2319 -15935 -15476 -17627 -16157 -11194 -14804 -17381 -17683 -14700 -10872
14354 -10872 6304 2979 -11112 -15444 -16988 -19716 -8040 -7837 735 -2836 -10204 682 -15336
14341 -15336 -15106 -7863 7236 3812 8320 22594 26888 35907 22569 15065 9405 2299 12143 11300
$$ packed form
14437F61n816L375N4J368O027L462n446j1398N539O173j3344N074J3531J1793
14423B1053n951j9429j2395K3495M109j6733j4097J615J7531J3617j3891j5300
14411a6376n47k241K027R917L630j2228m904M274N227j4522n634K184J4706R907
14397d580J1683J1227m737J2046j4896m784J2281j0639p880n234J430J4437k974
14384G380n18N503j800L189j8829o177o785R095q360o690J4363L07P881j538M181
14369A202p013j190K477N397l192j3616M59k151J470M963l610k577l02K983L828
14354a0872J7176l325j4091m332j544k728J1676K03Q572l571p368J0886j6018
14341a5336K30P243J5099l424M508J4274M294R019j3338p504n660p106R844q43
$$ plain form
14327 11300 4518 5593 3204 7904 -2028 6661 2573 -2295 2200 7797 11653 4472 -16241 -20559
14313 -20559 -16786 -18819 -18792 -23542 -21041 -4843 -1446 6448 -4949 -16522 -9615 -13209 -13452 -13101 -20306
14298 -20306 -14264 12613 18213 5775 -1631 3789 8719 20800 9910 4132 -492 -6963 -3628
14285 -3628 -6250 5746 -3522 -5051 -4902 -2523 -465 428 -1359 147 -807 9944 19139 13796 2564
14270 2564 5713 -3657 -6880 -12831 -16906 -18104 -14338 -8561 -710 -9425 -3491 16254 16970 11090 4740
14255 4740 8595 13201 4548 -14353 -19649 -21752 -19982 1364 15816 11349 11758 20548 52245 62712
14241 62712 52976 47874 55096 51206 35494 21146 15393 15093 5981 11232 12497 -1965 -17193 -9775
14227 -9775 -2872 11062 19907 24651 14083 6225 326 -14920 -8807 969 15576 16791 2577
$$ packed form
14327A1300o782J075k389M700r932Q689m088m868M495N597L856p181k0713m318
14313b0559L773k033K7m750K501J6198L397P894j1397j1573O907l594k43L51p205
14298b0306O042K6877N600j2438p406N420M930J2081j0890n778m624o471L335
14285c628k622J1996r268j529J49K379K058Q93j787J506r54J0751R195n343j1232
14270B564L149r370l223n951m075j198L766N777P851q715N934J9745P16n880o350
14255D740L855M606q653j8901n296k103J770K1346J4452m467M09Q790L1697J0467
14241F2712r736n102P222l890j5712j4348n753l00r112N251J265j4462j5228P418
14227i775O903J3934Q845M744j0568p858n899j5246O113R776J4607J215j4214
$$ plain form
14214 2577 -6600 -501 -517 5585 -1049 -18877 -19085 -9939 -802 -17952 -34439 -13036 -9295 -21934
14200 -21934 -10429 -5426 -10505 -7055 -13725 -28091 -33092 -29631 -26487 -14979 -19935 -2940 4084
14187 4084 1617 -3146 -11190 -18949 -7376 5479 2873 -3240 3236 8452 10946 -13753 -26340 -40621
14173 -40621 -36172 -26740 -7305 -1873 -13066 -19917 -23189 -19413 -7701 258 5550 9453 5893 -4553
14159 -4553 1776 -2669 10523 21136 20485 -6124 -24628 -29733 -21911 -19239 -23986 -18875 -11770 1218
14145 1218 17090 24451 20428 14975 4670 14486 13452 9785 9014 14458 18868 11537 -7399 -17605
14131 -17605 -7761 -2054 1090 -615 -11145 -12622 -9673 -1083 -11696 -12221 -8702 -25216 -43189 -40352
14117 -40352 -22822 -14381 -2572 -773 3568 -7537 -25530 -23043 -11623 443 21463 24012 5891
$$ packed form
14214B577r177O099j6O102o634j7828k08R146R137j7150j6487K1403L741j2639
14200b1934J1505N003n079L450o670j4366n001L461L144J1508m956J6995P024
14187D084k467m763q044p759J1573J2855k606o113O476N216K494k4699j2587j4281
14173d0621M449R432J9435N432j1193o851l272L776J1712P959N292L903l560j0446
14159d553O329m445J3192J0613o51k6609j8504n105P822K672m747N111P105J2988
14145A218J5872P361m023n453j0305R816j034l667p71N444M410p331j8936j0206
14131a7605R844N707L144j705j0530j477K949Q590j0613n25L519j6514j7973K837
14117d0352J7530Q441J1809J799M341j1105j7993K487J1420J2066K1020K549j8121
$$ plain form
14104 5891 5526 -4466 -16917 -6038 13616 15079 10110 26562 32134 19369 11204 17041 7045 9567
14090 9567 11803 6845 -10867 -6313 13368 14934 27948 25660 17255 28172 40160 21143 9228
14077 9228 23454 42445 44990 54013 79671 97889 108459 87508 64648 60545 48343 24106
14065 24106 -4640 -7842 6413 8067 19603 28900 25222 18596 13644 12331 -2391 -1730 433 3379
14051 3379 11250 22000 18681 10936 17182 10321 21310 12575 -2084 1825 12929 17264 11268 -2347
14037 -2347 333 -663 -20004 -30667 -19229 2676 8003 -3822 -14492 -18870 -19972 -20616 -8628
14024 -8628 2885 4644 2187 8345 12504 -6773 -14594 -16118 -18167 -7779 -5500 -12600 -19203 -18986
14010 -18986 -16991 -20765 -22382 -20667 -22310 -21240 -32483 -28622 -16291 -12496 -8825 1223 2120 3953
$$ packed form
14104E891l65r992j2451J0879J9654J463m969J6452N572j2765q165N837r996K522
14090I567K236m958j7712M554J9681J566J3014k288q405J0917J1988j9017j1915
14077I228J4226J8991K545R023K5658J8218J0570k0951k2860m103j2202k4237
14065B4106k8746l202J4255J654J1536R297l678o626m952j313j4722O61K163K946
14051C379P871J0750l319p745O246o861J0989q735j4659L909J1104M335n996j3615
14037b347K680r96j9341j0663J1438K1905N327j1825j0670m378j102o44J1988
14024h628J1513J759k457O158M159j9277p821j524k049J0388K279p100o603K17
14010a8986J995l774j617J715j643J070j1243L861J2331L795L671J0048Q97J833
$$ plain form
13996 3953 3629 -694 -22173 -27362 -23970 -14507 -14932 -10162 5317 1034 -1641 5712 -428 -3510 374
13981 374 -14992 -14574 1311 19559 18641 13869 7088 -17 -582 -8985 -16667 2566 10180 884 -14545
13966 -14545 -13524 -10278 -7577 -18093 -23865 -27682 -21160 -28086 -17856 -10494 -5765 -1815 -10018 -18133
13952 -18133 -25444 -21201 -10083 -2297 -9236 -22932 -14322 -17201 -2173 8347 4188 10547 2519
13939 2519 6592 17736 24325 2546 -5180 -8580 -20736 -19373 -10607 2796 3709 -1154 493 -789
13925 -789 -6084 -25236 -22702 -16744 -4393 -14225 -19349 -13624 3114 13626 11199 -15207 -18704 -9596
13911 -9596 -15485 -16276 -25588 -29138 -10627 2783 -2475 12933 8306 -2933 -4528 6027 9859 5883
13897 5883 12859 10223 10355 6269 -2316 -11899 4165 18497 12741 8925 9565 -3487 -2743 26513
$$ packed form
13996C953l24m323k1479n189L392R463m25M770J5479m283k675P353o140l082L884
13981C74j5366M18J5885J8248r18m772o781p105n65q403p682J9233P614r296j5429
13966a4545J021L246K701j0516n772l817O522o926J0230P362M729L950q203q115
13952a8133p311M243J1118P786o939j3696Q610k879J5028J0520m159O359q028
13939B519M073J1144O589k1779p726l400j2156J363Q766J3403R13m863J647j282
13925g89n295j9152K534N958J2351r832n124N725J6738J0512k427k6406l497R108
13911i596n889p91r312l550J8511J3410n258J5408m627j1239j595J0555L832l976
13897E883O976k636J32m086q585r583J6064J4332n756l816O40j3052P44K9256
$$ plain form
13883 26513 23641 11587 -875 -10312 -28178 -18288 -8307 -11989 -13327 -19112 -15350 -13229 -9408 -14574
13869 -14574 -4603 -19618 -22575 -17223 -25071 -34670 -29560 -18587 -14378 -18398 -15949 360 -4930 -5482
13855 -5482 -11646 -11160 -828 -1199 -18104 -14695 -1309 4361 -2498 -21230 -35085 -5654 19671
13842 19671 19067 4321 1368 2096 2155 -6364 -5504 -5728 -733 1492 723 7768 -9201 -15284 -10498 -13155
13826 -13155 -20428 -6969 5532 -3135 -2340 -7540 -3842 -11831 -21807 -19333 -11203 -6976 2403 -4258
13812 -4258 775 -2062 -6072 303 6 -3511 -307 -21194 -21755 -18926 -8055 3582 21011 24749
13798 24749 23378 33191 33575 36107 47517 47755 29989 18015 6320 18933 3856 -31105 -33335
13785 -33335 -19858 -15275 -8437 1341 17271 23806 22328 8770 3338 12351 3864 10755 21119
$$ packed form
13883B6513k872j2054j2462r437j7866R890R981l682j338n785L762K121L821n166
13869a4574R971j5015k957N352p848r599N110J0973M209m020K449J6309n290n52
13855e482o164M86J0332l71j6905L409J3386N670o859j8732j3855K9431K5325
13842A9671o04j4746k953P28N9q519Q60k24M995K225p69P045j6969o083M786k657
13826a3155p273J3459J2501q667P95n200L698p989r976K474Q130M227R379o661
13812d258N033k837m010O375k97l517L204k0887n61K829J0871J1637J7429L738
13798B4749j371R813L84K532J1410K38j7766j1974j1695J2613j5077l4961k230
13785c3335J3477M583O838R778J5930O535j478j3558n432R013q487O891J0364
$$ plain form
13772 21119 23054 22466 -2324 -22663 -20915 -6604 5617 2572 1466 692 5816 7976 -2575 508
13758 508 -10626 -14558 -5584 3809 -1132 -3419 9146 -740 -10281 -16130 -12107 -16253 -18495 -16006
13744 -16006 -8660 -9435 -16766 -19190 -26473 -18899 -16288 -19303 -16501 -7706 5416 -266 8583 14033
13730 14033 536 -445 -7158 -2286 7415 13179 7187 10455 3594 6974 17790 21598 39345 61496
13716 61496 38209 18766 14692 2116 -135 6425 1195 -14460 -23426 -6932 4051 -2893 9321
13703 9321 13263 -557 -910 -1076 2781 -5357 -4077 -3049 -9001 -12660 -4500 6477 6037 2396 12815
13688 12815 19767 16799 18114 16948 37069 33309 19950 31003 34261 37128 45500 45987 41875 47541
13674 47541 79805 128953 192525 260045 301918 277615 212583 173481 143126 107054 82635 67536
$$ packed form
13772B1119J935n88k4790k0339J748J4311J2221l045j106p74N124K160j0551L083
13758E08j1134l932Q974R393m941k287J2565r886r541n849M023m146k242K489
13744a6006P346p75p331k424p283P574K611l015K802Q795J3122n682Q849N450
13730A4033j3497r81o713M872R701N764n992L268o861L380J0816L808J7747K2151
13716F1496k3287j9443m074j2576k251O560n230j5655q966J6494J0983o944J2214
13703I321L942j3820l53j66L857q138J280J028n952l659Q160J0977m40l641J0419
13688A2815O952k968J315j166K0121l760j3359J1053L258K867Q372M87m112N666
13674D7541L2264M9148O3572O7520M1873k4303o5032l9102l0355l6072k4419j5099
$$ plain form
13662 67536 43449 37840 43906 44349 51022 35643 27024 20271 19197 33185 50881 52655 48712 63741
13648 63741 84395 97264 103931 94808 63628 37034 31966 28894 36264 54771 67016 79227 82275
13635 82275 90891 97336 96933 106429 134248 165756 217395 322348 518952 785512 1012579 976421
13623 976421 724033 494474 349419 260379 210365 172316 136739 114629 111362 106850 76164
13612 76164 54144 56385 56318 58418 63742 64590 53002 50295 62259 59539 50162 73968 86782 95397
13598 95397 101315 86445 102866 99295 93890 79178 70078 66440 77367 93838 110885 112461 122669
13585 122669 163673 218631 315381 494256 758468 1012906 1029743 792921 530311 347505
13575 347505 240807 188579 144512 112208 109538 107278 96388 86627 73658 67021 64656 61742
$$ packed form
13662F7536k4087n609O066M43O673j5379q619o753j074J3988J7696J774l943J5029
13648F3741K0654J2869O667r123l1180k6594n068l072P370J8507J2245J2211L048
13635H2275Q616O445m03R496K7819L1508N1639J04953J96604K66560K27067l6158
13623I76421k52388k29559j45055q9040n0014l8049l5577k2110l267m512l0686
13612G6164k2020K241o7K100N324Q48j1588k707J1964k720r377K3806J2814Q615
13598I5397N918j4870J6421l571n405j4712r100l638J0927J6471J7047J576J0208
13585A22669M1004N4958R6750J78875K64212K54438J6837k36822k62610j82806
13575C47505j06698n2228m4067l2304k670k260j0890r761j2969o637k365k914
$$ plain form
13563 61742 48866 39893 38905 29025 28438 25280 18922 15415 25534 25820 20632 8009 12951 24375
13549 24375 30617 33212 43809 37861 29688 35168 36954 44553 57515 72291 84455 106729 153226
13536 153226 224323 305135 336982 295622 222137 169950 135292 110793 111556 104428 97932 91035
13524 91035 74038 47037 7485 -14576 -9132 -8206 -5862 2869 5826 21020 28235 14054 8420
13511 8420 8779 1603 6407 12461 13113 10451 12848 12251 13055 9026 7147 2385 -7113 -8610 -11421 -15940
13495 -15940 -1084 612 6209 -4687 -3508 12362 16430 21206 30441 25623 6899 -13016 -23217
13482 -23217 -5616 16125 15089 5762 -1532 -7412 961 1306 270 20119 3537 -19161 -21688
13469 -21688 -10472 -9776 -2000 7587 -1777 -13719 -17391 2979 25268 42556 40197 13138 7747
$$ packed form
13563F1742j2876q973r88r880n87l158o358l507J0119K86n188j2623M942J1424
13549B4375O242K595J0597n948q173N480J786P599J2962J4776J2164K2274M6497
13536A53226P1097Q0812L1847m1360p3485n2187l4658k4499P63p128o496o897
13524I1035j6997k7001l9552k2061N444R26K344Q731K957J5194P215j4181n634
13511H420L59p176M804O054O52k662K397n97Q04m029j879m762r498j497k811m519
13495a5940J4856J696N597j0896J179J5870M068M776R235m818j8724j9915j0201
13482b3217J7601K1741j036r327p294n880Q373L45j036J9849j6582k2698k527
13469b1688J1216O96P776R587r364j1942l672K0370K2289J7288k359k7059n391
$$ plain form
13456 7747 10427 26043 36895 33533 21216 9944 8994 10139 -1337 -3064 -6748 -16992 -25904
13443 -25904 -16206 -940 1186 7147 18602 13445 9135 5892 -6085 -2481 15825 2550 -8623
13430 -8623 -6816 -5069 -18005 -19930 -14661 -8315 -13671 -10853 -4395 -5085 120 11702 16617 9274
13416 9274 12816 12006 17244 14041 2816 -4619 9444 -6370 -16985 -18057 -11292 4048 19732
13403 19732 26724 23753 20974 21974 10910 -9563 -3869 1564 9153 12692 1484 -11656 -14664
13390 -14664 -10788 4147 -3766 2308 15920 10369 6983 17932 17407 11620 -1361 -16124 -3187
13377 -3187 427 18054 20929 18973 1669 1711 10469 6091 2066 -2458 -14107 -9675 -9353 -10269 397
13362 397 6713 239 -12435 -14756 -5594 641 9595 14379 11050 -2594 -18389 -28032 -37450 -46343
$$ packed form
13456G747K680J5616J0852l362j2317j1272r50J145j1476j727l684j0244q912
13443b5904R698J5266K126N961J1455n157m310l243j1977L604J8306j3275j1173
13430h623J807J747j2936j925N269O346n356K818O458o90N205J1582M915p343
13416I274L542q10N238l203j1225p435J4063j5814j0615j072O765J5340J5684
13403A9732O992k971k779J000j1064k0473N694N433P589L539j1208j3140l008
13390a4664L876J4935p913O074J3612n551l386J0949n25n787j2981j4763J2937
13377c187L614J7627K875j956j7304M2Q758m378m025m524j1649M432L22r16J0666
13362C97O316o474j2674k321R162O235Q954M784l329j3644j5795r643r418q893
$$ plain form
13348 -46343 -53878 -52851 -34036 -24169 -25920 -17775 -12028 -897 -9101 -4392 24659 24195 12919 15712
13334 15712 12012 12696 5157 11900 31838 25075 14588 1716 6724 13050 13350 5788 5290 7513
13320 7513 11911 17586 12327 1228 -11285 -12802 -9601 -17285 -19941 -10854 -5038 -1415 6872 5612
13306 5612 -3389 2871 -3821 662 9364 13294 7423 17346 29788 27769 5009 2701 -12521 -10381
13292 -10381 5467 22365 24124 35260 43735 35039 8129 1985 6086 1473 -7584 -13614 -12711 -3701
13278 -3701 16613 35839 42446 23425 1484 -2401 -452 -2187 -9485 -21336 -18833 -8387 -1187
13265 -1187 18630 31294 37998 24737 16886 15046 17802 23340 9976 -9871 -22764 -19744 -22435
13252 -22435 -20785 -13044 -8437 -8807 7674 19262 25823 20144 4919 -5120 -6591 1067 3430 -2323
$$ packed form
13348d6343p535J027J8815R867j751Q145N747J1131q204M709K9051m64j1276K793
13334A5712l700O84p539O743J9938o763j0487j2872N008O326L00p562m98K223
13320G513M398N675n259j1099j2513j517L201p684k656R087N816L623Q287j260
13306E612r001O260o692M483Q702L930n871R923J2442k019k2760k308j5222K140
13292a0381J5848J6898J759J1136Q475q696k6910o144M101m613r057o030R03R010
13278c701K0314J9226O607j9021k1941l885J949j735p298j1851K503J0446P200
13265a187J9817J2664O704j3261p851j840K756N538j3364j9847j2893L020k691
13252b2435J650P741M607l70J6481J1588O561n679j5225j0039j471P658K363n753
$$ plain form
13238 -2323 9903 9266 -22748 -20565 -18157 -3856 11396 21195 37347 27596 16128 12494 10894
13225 10894 1264 1665 1634 -8855 -8388 -18507 -31612 -32760 -21283 11908 17735 16877 23004 20509
13211 20509 19667 7568 -1936 -1660 1875 2848 15284 3567 877 -4697 -5613 -5328 3067 11588 929
13196 929 -2642 -3699 -2464 -15522 -9189 12183 12110 6901 10827 19699 -13871 -23524 -4002 3017
13182 3017 4448 -3201 -3678 -13648 -11694 6861 10801 19702 29585 26393 18443 16565 21777 24511 20002
13167 20002 7982 48 5212 8747 7471 -3029 -8696 2316 10623 8340 2430 8579 15809 8206
13153 8206 -1939 7070 -1977 2317 11165 21007 15133 13810 5391 15116 14236 12798 5644 475 -7945
13138 -7945 -7901 517 -8819 -8133 251 -7634 -9473 750 11445 18511 8276 -4129 -7439 2203
$$ packed form
13238b323J2226o37l2014K183K408J4301J5252R799J6152r751j1468l634j600
13225A0894r630M01l1j0489M67j0119j3105j148J1477L3191N827q58O127k495
13211B0509q42j2099r504K76L535R73J2436j1717k690n574r16K85Q395Q521j0659
13196I29l571j057J235j3058O333K1372p3n209L926Q872l3570r653J9522P019
13182C017J431p649m77r970J954J8555L940Q901R883l192p950j878N212K734m509
13167B0002j2020p934N164L535j276j0500n667J1012Q307k283n910O149P230p603
13153H206j0145R009r047M294Q848R842n874j323q419R725q80j438p154n169q420
13138g945M4Q418r336O86Q384p885j839J0223J0695P066j0235j2405l310R642
$$ plain form
13124 2203 -1229 2417 851 -11832 -9453 -6428 -17675 -16280 3997 16349 15870 15495 19879 22653
13110 22653 33312 33250 9195 -10604 -8054 8686 12582 5416 14744 11942 2856 5522 8769 -1310
13096 -1310 -10982 -25915 -26753 -39732 -35885 -30635 -7998 543 7713 19178 26685 17381 12083 25174
13082 25174 23532 27321 37379 19431 10628 17042 25613 22709 12434 16204 7932 -1713 1834 9373
13068 9373 28705 38836 47613 53653 53096 46932 27716 2315 4101 -1683 10808 3634 6032 6874
13054 6874 -9 -9627 -5330 16119 13191 11743 10889 11164 7456 -693 4754 22111 34977 32449
13040 32449 14502 5717 4357 -3080 -787 -250 -5070 -317 8514 8522 11329 -2179 -17554 -21210 -16781
13025 -16781 -1345 -1459 -8394 -10360 2343 13285 6879 -6747 -19128 132 8099 -3444 -718
$$ packed form
13124B203l432L646j566j2683K379L025j1247J395K0277J2352m79l75M384K774
13110B2653J0659o2k4055j9799K550J6740L896p166R328k802r086K666L247j0079
13096a310r672j4933q38j2979L847N250K2637Q541P170J1465P507r304n298J3091
13082B5174j642L789J0058j7948q803O414Q571k904j0275L770q272r645L547P539
13068I373J9332J0131Q777O040n57o164j9216k5401J786n784J2491p174K398Q42
13054F874o883r618M297K1449k928j448q54K75l708q149N447J7357J2866k528
13040C2449j7947q785j360p437K293N37m820M753Q831QK807j3508j5375l656M429
13025a6781J5436j14o935j966J2703J0942o406j3626j2381J9260P967j1543K726
$$ plain form
13012 -718 14333 18094 14881 -85 -4494 835 -1657 3063 597 -3520 6080 16573 27129 22855
12998 22855 21545 13592 -5485 -26885 -31048 -27321 -13082 -7439 -11534 -1598 -2513 12944 8462 -3344
12984 -3344 18414 16509 15827 16984 14544 9498 7921 12560 16812 12907 6908 9666 -1259 341
12970 341 5542 23863 22682 3538 2583 10063 8406 1623 2673 11016 19222 22657 14417 5456 6456
12955 6456 1739 -276 3663 15492 20928 -334 -12417 -6562 -410 10773 14951 11727 384
12942 384 -742 13810 6341 5038 2411 21867 19771 14849 12059 17883 10819 2199 951 7969
12928 7969 7023 2936 -8773 -3153 1386 -5127 8571 25088 21338 15964 22848 36054 31413 20583
12914 20583 -341 5873 18611 13737 11057 10617 -5663 -11961 -357 506 -9687 -9902 -2535 -16001
$$ packed form
13012g18J5051L761l213j4966m409N329k492M720k466m117R600J0493J0556m274
12998B2855j310p953j9077k1400m163L727J4239N643m095R936r15J5457m482j1806
12984c344K1758j905o82J157k440n046j577M639M252l905n999K758j0925J600
12970C41N201J8321j181j9144r55P480j657o783J050Q343Q206L435q240q961J000
12955F456m717k015L939J1829N436k1262j2083N855O152J1183M178l224j1343
12942C84j126J4552p469j303k627J9456k096m922k790N824p064q620j248P018
12928G969r46m087j1709N620M539o513J3698J6517l750n374O884J3206m641j0830
12914B0583k0924O214J2738m874k680m40j6280o298J1604Q63j0193k15P367j3466
$$ plain form
12900 -16001 -21580 -15270 -4506 10216 -1354 2738 15590 19387 23283 18208 10204 3432 2726 -5930
12886 -5930 -19916 -22872 -16412 -12347 -12354 -7323 -4754 14962 6777 2111 5593 12436 30768 22858 15927
12871 15927 31395 66774 99232 155730 238991 280634 223121 144815 82821 52453 44252 44819
12859 44819 35707 12852 5649 3084 5698 9437 18312 9658 -1264 9684 13167 4271 12994 27377
12845 27377 23922 6396 11005 19644 22383 29846 31899 24858 16032 -3371 -6174 -788 6620 15977
12831 15977 34436 38631 33289 30125 24164 8295 -4857 2376 11345 8052 17963 12010 2497 7334
12817 7334 2608 14237 21193 15167 10941 11317 4556 9296 7817 13561 20069 24389 19324 14222 11845
12802 11845 2747 2392 21136 27278 12555 7060 4237 17703 36877 25882 9532 -430 -3145
$$ packed form
12900a6001n579O310J0764J4722j1570M092J2852L797L896n075q004o772p06q656
12886e930j3986k956O460M065pN031K569J9716q185m666L482O843J8332p910o931
12871A5927J5468L5379L2458N6498Q3261M1643n7513p8306o1994l0368q201N67
12859D4819r112k2855p203k565K614L739Q875q654j0922J0948L483q896Q723J4383
12845B7377l455j7526M609Q639K739P463K053p041q826j9403k803N386P408R357
12831A5977J8459M195n342l164n961j5869j3152P233Q969l293R911n953r513M837
12817G334m726J1629O956o026m226L76o761M740j479N744O508M320n065n102k377
12802A1845r098l55J8744O142j4723n495k823J3466J9174j0995j6350r962k715
$$ plain form
12789 -3145 -2421 6829 -2895 1457 12708 25747 14739 -1165 2504 13610 12821 12945 13512 -1101
12775 -1101 -5425 -4515 -2055 -3981 -10101 -15552 -9305 5180 21694 24077 25337 42866 55782 61235
12761 61235 73469 69588 56986 46108 27314 23380 13803 11205 5919 7860 16378 18072 14311
12748 14311 14856 2143 11280 17260 8745 5617 10894 -3059 -7202 -961 11081 10910 -4730 -13617
12734 -13617 -12469 11034 8344 7441 17458 17145 7135 1563 2478 9221 17487 18391 16259 6506 5323
12719 5323 -7082 -17881 -12353 4226 1249 782 -4524 6436 18952 29898 31309 38055 30108
12706 30108 22465 21593 16503 13731 19662 21624 23873 16399 23633 34484 36335 20640 4957 17817
12692 17817 28446 22484 22598 13560 8903 12873 8815 15203 13166 9770 14289 2872 -6398 -7491
$$ packed form
12789c145P24R250r724M352J1251J3039j1008j5904L669J1106p89J24N67j4613
12775a101m324R10K460j926o120n451O247J4485J6514K383J260J7529J2916N453
12761F1235J2234l881j2602j0878j8794l934r577k598n286J941Q518J694l761
12748A4311N45j2713R137N980q515l128N277j3953m143O241J2042j71j5640q887
12734a3617J148K3503k690r03J0017l13j0010n572R15O743Q266R04k132r753j183
12719E323j2405j0799N528J6579k977m67n306J0960J2516J0946J411O746p947
12706C0108p643q72n090k772N931J962K249p474P234J0851J851j5695j5683J2860
12692A7817J0629n962J14r038m657L970m058O388k037l396M519j1417r270j093
$$ plain form
12678 -7491 1988 -1032 -3053 -1374 329 -3035 -2726 7024 17185 18310 6756 2553 1865 6272 12804
12663 12804 14377 8794 -463 6413 14926 17612 25698 26562 25403 12186 12638 13510 18410 -917 -10197
12648 -10197 -12146 -8283 4688 5755 -1483 11845 25352 32514 35798 24319 18677 -3343 1097
12635 1097 3003 1039 19540 12673 6086 -824 -3392 -2795 3233 18252 4667 -9597 -8626 9533
12621 9533 25524 12115 12551 25426 18273 15699 13808 19365 10092 703 4554 -5310 -5904 461
12607 461 -2073 1810 14961 10375 3658 -5534 830 10349 25962 13539 -16570 -23116 -5052 8432
12593 8432 -8100 -22682 -6879 3866 -3902 1132 1459 5388 10144 24845 26624 30521 34960 36623
12579 36623 27728 11477 -2477 -20320 -21453 -8989 5078 17268 4738 -4753 -14106 -7603 992
$$ packed form
12678g491R479l020k021J679J703l364L09R750J0161J125j1554m203o88M407O532
12663A2804J573n583r257O876Q513K686Q086Q64j159j3217M52Q72M900j9327r280
12648a0197j949L863J2971J067p238J3328J3507P162L284j1479n642k2020M440
12635A097J906j964J8501o867o587o910k568N97O028J5019j3585j4264R71J8159
12621I533J5991j3409M36J2875p153k574j891N557r273r389L851r864n94O365
12607D61k534L883J3151m586o717r192O364R519J5613j2423l0109o546J8064J3484
12593H432j6532j4582J5803J0745p768N034L27L929M756J4701J779L897M439J663
12579C6623q895j6251j3954j7843j133J2464J4067J2190j2530r491r353O503Q595
$$ plain form
12566 992 -1745 871 11624 21441 18317 -23 -10742 -16526 -19908 -10611 13933 21201 25173 30373
12552 30373 17897 11292 9480 4916 4019 -4217 -7160 3731 3910 4412 6436 18951 24405 7138
12538 7138 19995 23575 5865 2314 -5656 -13249 -18503 -14039 229 15940 32778 31187 18899
12525 18899 -8160 -6783 -5400 4111 27867 46392 47973 35992 26821 26267 23748 15655 5437
12512 5437 9722 13994 15687 22706 20823 32111 30006 33412 37063 23174 22968 28647 25138 10286
12498 10286 1945 3515 7196 19556 15449 -867 4389 9076 14472 29511 12566 7770 24364
12485 24364 18171 23826 25886 21104 6538 5380 10051 17545 29671 29422 24261 6683 4043 342
12471 342 4676 -186 -2300 32835 46181 26673 10253 9980 16730 22201 30529 33320 29516 7832
$$ packed form
12566I92k737K616J0753R817l124j8340j0719n784l382R297K4544P268L972N200
12552C0373j2476o605j812m564q97q236k943J0891J79N02K024J2515N454j7267
12538G138J2857L580j7710l551p970p593n254M464J4268J5711J6838j591j2288
12525A8899k7059J377J383R511K3756J8525J581j1981r171n54k519q093j0218
12512E437M285M272J693P019j883J1288k105L406L651j3889k06N679l509j4852
12498A0286q341J570L681J2360m107j6316N256M687N396J5039j6945m796J6594
12485B4364o193N655K060m782j4566j158M671P494J2126k49n161j7578k640l701
12471C42M334m862k114L5135J3346j9508j6420k73O750N471Q328K791l804k1684
$$ plain form
12457 7832 11443 21040 15321 6830 15129 18586 19518 8169 31784 42939 35926 35087 30907 21192
12443 21192 3274 5160 18617 24331 16040 6606 7026 12288 45 -1801 6181 16407 27181
12430 27181 17045 19866 32089 34648 23127 25659 40115 33002 30046 33698 34767 30116 42508
12417 42508 47584 44944 43918 38711 25834 6056 -7531 -17086 8583 23066 30893 47626 47366
12404 47366 52195 35062 18366 8714 19655 10920 10240 24547 35216 47507 52858 52117 37866
12391 37866 11008 12351 5333 4305 17264 25797 26778 18052 10686 22419 22342 18977 16168 32872
12377 32872 33890 28500 17113 12032 27017 39340 36930 23972 10259 3009 -6407 -3755 -1559
12364 -1559 -2847 237 -3833 4461 -9672 -22902 -17954 -6973 -5458 -11182 -9129 7316 14575 14079
$$ packed form
12457G832L611R597n719q491Q299L457R32j1349K3615J1155p013q39m180r715
12443B1192j7918J886J3457N714q291r434M20N262j2243j846P982J0226J0774
12430B7181j0136K821J2223K559j1521K532J4456p113k956L652J069m651J2392
12417D2508N076k640j026n207j2877j9778j3587r555K5669J4483P827J6733k60
12404D7366M829j7133j6696r652J0941q735o80J4307J0669J2291N351p41j4251
12391C7866k6858J343p018j028J2959Q533R81q726p366J1733p7l365k809J6704
12377C2872J018n390j1387n081J4985J2323k410j2958j3713p250r416K652K196
12364a559j288L084m070Q294j4133j3230M948J0981J515n724K053J6445P259m96
$$ plain form
12350 14079 16389 19691 13928 10934 2934 -8969 -10260 -11299 -13463 -19585 -9362 7723 7212 -3306
12336 -3306 4206 15709 21946 18624 6837 15197 33792 27075 5795 4808 14896 23683 11864
12323 11864 -6551 -7276 7330 16398 18504 21080 14321 8976 -3832 -15807 -17318 -21380 -18496 -12462
12309 -12462 4718 95 -9107 8767 3909 -283 -3342 4602 11786 13936 30945 38450 26415
12296 26415 17907 10624 18677 30451 20683 15247 11617 3184 -882 10598 25733 30530 16715
12283 16715 6515 5554 8102 -1630 -1660 -1092 1032 10597 2 -2451 4866 6514 14233 18475 4577
12268 4577 7725 19793 34548 25471 18836 30339 33495 8171 -4039 -6474 -14662 -18221 -23413
12255 -23413 -18356 -17540 129 -659 -23022 -48873 -51351 -32900 -13912 -1443 6564 -1875 -1020 -4157
$$ packed form
12350A4079K310L302n763k994q000j1903j291j039k164o122J0223J7085n11j0518
12336c306P512J1503O237l322j1787Q360J8595o717k1280r87J0088Q787j1819
12323A1864j8415p25J4606R068K106K576o759n345j2808j1975j511m062K884O034
12309a2462J7180m623r202J7874m858m192l059P944P184K150J7009P505j2035
12296B6415q508p283Q053J1774r768n436l630q433m066J1480J5135M797j3815
12283A6715j0200r61K548r732l0N68K124R565j0595k453P317J648P719M242j3898
12268D577L148J2068J4755r077o635J1503L156k5324j2210k435q188l559n192
12255b3413N057Q16J7669p88k2363k5851k478J8451J8988J2469Q007q439Q55l137
$$ plain form
12241 -4157 -13122 -21035 -4754 6063 2937 -4402 -8610 -8843 -5196 3813 12852 17912 23503 21938
12227 21938 29498 35788 56265 71089 80119 79572 75512 73948 75374 60028 33190 21092 6201
12214 6201 5460 6383 6838 14069 15471 16328 11169 12590 17410 23979 20872 12489 6880 3501 10039 13760
12198 13760 18636 26482 26000 8913 -6332 -1536 7918 9110 19262 17352 9714 8258 25380 25461
12184 25461 20110 36521 50892 55661 59744 64124 61123 57099 70018 88717 98411 102576 84371
12171 84371 64864 43803 31981 23392 10002 4435 10875 30725 32346 25918 19437 10214 6082
12158 6082 4520 -6762 -10629 -1370 5747 12390 10012 6039 4386 13888 24856 23193 15437 19154
12144 19154 28501 23431 10634 179 3699 10683 -6963 -3444 2378 9500 10352 -6170 5237
$$ packed form
12241d157q965p913J6281J0817l126p339m208k33L647R009R039N060N591j565
12227B1938P560O290K0477J4824R030n47m060j564J426j5346k6838j2098j4891
12214F201p41R23M55P231J402Q57n159J421M820O569l107q383n609l379O538L721
12198A3760M876P846m82j7087j5245M796R454J192J0152j910p638j456J7122Q1
12184B5461n351J6411J4371M769M083M380l001m024J2919J8699R694M165j8205
12171H4371j9507k1061j1822q589j3390n567O440J9850J621o428o481r223m132
12158F082j562j1282l867R259P117O643k378l973j653R502J0968j663p756L717
12144A9154R347n070j2797j0455L520O984j7646L519N822P122Q52j6522J1407
$$ plain form
12131 5237 19495 8324 19902 18698 4754 -7944 -13908 -14603 -20184 -8948 -4917 -7375 4306
12118 4306 5286 12282 8902 18642 28432 33629 30201 33516 38397 35679 23022 33557 38450 33191
12104 33191 28049 27948 35312 31387 28397 20708 14794 9781 11163 10913 6080 11381 32721 54157
12090 54157 45290 39522 20093 25718 23791 6663 898 -3552 -2962 11815 6221 -6277 2234 14382
12076 14382 5035 -3934 -7888 -301 6549 -702 7997 4764 -5314 -8779 11426 26622 43326
12063 43326 37072 16964 1686 1585 24287 36693 30272 27630 26122 29569 13246 -487 -8359
12050 -8359 -8952 1322 12381 10266 8383 -2967 -4416 7800 -3765 -15594 -13863 1900 10878
12037 10878 12077 18790 20250 15252 17742 9498 1921 -290 3920 8763 4695 9242 4510 11280
$$ packed form
12131E237J4258j1171J1578j204j3944j2698n964o95n581J1236M031k458J1681
12118D306R80O996l380R740R790N197l428L315M881k718j2657J0535M893n259
12104C3191n142j01P364l925k990p689n914n013J382k50m833N301K1340K1436
12090E4157q867n768j9429N625j927j7128n765m450N90J4777n594j2498Q511J2148
12076A4382r347q969l954P587O850p251Q699l233j0078l465K0205J5196J6704
12063D3326o254k0108j5278j01K2702J2406o421k642j508L447j6323j3733p872
12050h359n93J0274J1059k115j883j1350j449J2216j1565j1829J731J5763Q978
12037A0878J199O713J460m998K490q244p577k211M210M843m068M547m732O770
$$ plain form
12023 11280 12326 19626 14541 23076 33236 25097 18426 9649 1735 9837 16229 14013 12595 14888
12009 14888 8802 -7247 -21586 -12136 12382 10503 21200 20155 5162 10247 23549 10884 -13678
11996 -13678 -9313 -11116 -11725 -12355 6769 25095 24770 27244 18549 17161 32587 33051 35719 40782 35586
11981 35586 20409 20968 35929 35980 35668 33704 18923 11797 2372 9438 10003 18415 28169 34103 35022
11966 35022 22414 8005 7501 5022 7891 9675 16605 11835 13016 13091 5726 8762 12993 21183 29482
11951 29482 22281 22682 29700 15458 15064 36942 42058 15659 1208 8755 23058 20004 10769 16861
11937 16861 18811 3462 -8514 6251 17020 11168 25639 30936 33758 31290 24476 30082 51482
11924 51482 51391 33158 26493 16322 11298 8430 12013 4476 -12464 -27077 -19666 -11106 -13815 -6907
$$ packed form
12023A1280J046P300n085Q535J0160q139o671q777p914Q102O392k216j418K293
12009A4888o086j6049j4339R450K4518j879J0697j045j4993N085J3302j2665k4562
11996a3678M365j803o09o30J9124J8326l25K474q695j388J5426M64K668N063n196
11981C5586j5177N59J4961N1l12j964j4781p126r425P066N65Q412R754N934R19
11966C5022j2608j4409n04k479K869J784O930m770J181P5p365L036M231Q190Q299
11951B9482p201M01P018j4242l94K1878N116k6399j4451P547J4303l054r235O092
11937A6861J950j5349j1976J4765J0769n852J4471N297K822k468o814N606K1400
11924E1482r1j8233o665j0171n024k868L583p537j6940j4613P411Q560k709O908
$$ plain form
11910 -6907 5897 -3583 -2795 -2374 -3922 21100 34406 31479 31808 28618 29123 18235 13256 14490 8148
11895 8148 13071 11264 6799 16287 19090 17342 18088 19071 29276 35719 34477 29756 25898 11266 4904
11880 4904 17236 27269 21304 17354 23052 30564 29938 32688 26336 16893 15386 3296 2210 20144
11866 20144 14108 -933 -11260 -10457 -8296 -17087 -5749 7630 -393 6039 3773 -1152 3793 15577
11852 15577 17074 24648 21969 23601 36685 36801 38269 24993 6279 8741 10980 75 -732 12087
11838 12087 11396 8715 19330 18457 13110 11899 4541 17870 26348 16863 20286 18310 12823 15632
11824 15632 13756 2822 -12753 -3595 10205 10485 879 -3920 2581 11398 11093 11967 13316 10505
11810 10505 5006 -507 3705 8843 6184 -358 3647 -1066 -10651 -18238 -11379 1082 13267 15575
$$ packed form
11910f907J2804r480P88M21j548K5022J3306k927L29l190N05j0888m979J234o342
11895H148M923j807m465R488K803j748P46R83J0205O443j242m721l858j4632o362
11880D904J2332J0033n965l950N698P512o26K750o352r443j507j2090j086J7934
11866B0144o036j5041j0327Q03K161q791J1338J3379q023O432k266m925M945J1784
11852A5577J497P574k679J632J3084J16J468j3276j8714K462K239j0905q07J2819
11838A2087o91k681J0615q73n347j211p358J3329Q478r485L423j976n487K809
11824A5632j876j0934j5575R158J3800K80r606m799O501Q817l05Q74J349k811
11810A0505n499n513M212N138k659o542M005m713r585p587O859J2461J2185K308
$$ plain form
11796 15575 21270 5460 6413 17597 10804 12668 16020 13132 11491 9516 8336 8733 17719 7600
11782 7600 636 12426 24365 18086 9458 9255 -7994 -9557 -2298 9674 17630 21480 16422 5655
11768 5655 -3117 -2168 4256 -3114 330 968 -8445 5129 20345 26349 3974 -8442 605 3279
11754 3279 -6532 -11919 -8903 -14754 -17024 -640 6311 7366 5141 7757 -3699 -4293 4160 -11441
11740 -11441 -23796 -16411 -17966 -9371 2163 -3286 -7544 -5696 -1073 3610 6769 22995 43182
11727 43182 44778 32145 17973 2325 -5874 1084 15300 19916 20482 26003 18705 15594 13299 1709
11713 1709 -4039 -4083 6722 15396 9300 7568 9059 20438 16569 6121 -305 5351 15400 34876
11699 34876 29683 32230 39994 26216 12793 -8949 -9008 -130 -5713 7657 789 -3913 -4045 -3477
$$ packed form
11796A5575N695j5810R53J1184o793J864L352k888j641j975j180L97Q986j0119
11782G600o964J1790J1939o279q628k03j7249j563P259J1972P956L850n058j0767
11768E655q772R49O424p370L444O38r413J3574J5216O004k2375j2416R047K674
11754C279r811n387L016n851k270J6384O951J055k225K616j1456n94Q453j5601
11740a1441j2355P385j555Q595J1534n449m258J848M623M683L159J6226K0187
11727D3182J596j2633j4172j5648q199O958J4216M616N66N521p298l111k295j1590
11713A709n748m4J0805Q674o096j732J491J1379l869j0448o426N656J0049J9476
11699C4876n193K547P764j3778j3423k1742n9Q878n583J3370o868m702j32N68
$$ plain form
11685 -3477 3690 7854 5958 -1446 -761 7789 2644 -2599 1411 7014 19763 20743 25406 21407 -1569
11670 -1569 -3851 4174 19058 25533 28063 27874 27312 19562 9539 3696 15148 18763 14439 21205
11656 21205 8074 -1805 919 352 14153 35259 19749 11559 7228 1551 12118 18632 14217
11643 14217 223 -3157 11378 11987 -10784 -6679 14714 15720 16402 12497 4859 -6169 -26128
11630 -26128 -31670 -14137 5804 9347 3416 2242 20508 17486 22556 27594 10280 883 -482
11617 -482 -909 5458 14744 29008 34079 19762 -7111 -8188 13498 13053 27320 40338 44260 25996
11603 25996 31193 19822 13626 33521 36808 20516 14638 16242 11239 9826 183 10920 10566 16434
11589 16434 11576 -10448 -14512 6834 20783 13568 2583 11533 13039 7251 7679 11632 9135 20932
$$ packed form
11685c477P167M164j896p404O85Q550n145n243M010N603J2749R80M663l999k2976
11670a569k282Q025J4884O475K530j89n62p750j0023n843J1452L615m324O766
11656B1205j3131r879K724n67J3801K1106j5510q190m331n677J0567O514m415
11643A4217j3994l380J4535O09k2771M105K1393J006O82l905p638j1028j9959
11630b6128n542J7533J9941L543n931j174J8266l022N070N038j7314r397j365
11617d82m27O367R286J4264N071j4317k6873j077K1686m45J4267J3018L922j8264
11603B5996N197j1371o196J9895L287j6292n878J604n003j413r643J0737l54N868
11589A6434m858k2024m064K1346J3949p215j0985Q950J506n788M28L953k497J1797
$$ plain form
11575 20932 24273 7554 8948 23408 20344 12931 6049 8516 14928 10776 10894 15703 6896 5864
11561 5864 6353 9278 5950 5339 771 -18592 -9031 -3006 7167 13512 4472 -11307 3071 3266
11547 3266 -6690 -5064 8789 15674 21699 13207 -2263 9174 16462 27582 32218 26679 14926
11534 14926 5829 13692 15910 10719 10997 -2286 -7842 -16916 -10812 352 4933 17028 22664 25355
11520 25355 2868 -10309 3118 9259 13679 22759 14984 16023 14679 -1670 -5143 -4252 -6065 -3694
11506 -3694 10481 7103 9181 5428 3306 12365 17803 26554 26508 1928 -10527 -8592 -4904 -2909
11492 -2909 -3319 -5987 -10403 -12939 -3521 1711 -4264 2295 12858 12307 -7007 -12540 -18137 -21218 -5032
11477 -5032 3103 6338 14069 20123 14894 10323 5839 16179 16948 9734 21531 33419 36564 36821
$$ packed form
11575B0932L341j6719J394J4460l064p413o882K467O412m152J18M809q807j032
11561E864M89K925l328o11m568j9363R561O025J0173O345r040j5779J4378J95
11547C266r956J626J3853O885O025q492j5470J1437P288J1120M636n539j1753
11534A4926r097P863K218n191K78j3283n556r074O104J1164M581J2095N636K691
11520B5355k2487j3177J3427O141M420R080p775J039j344j6349l473Q91j813K371
11506c694J4175l378K078l753k122R059N438Q751m6k4580j2455J935L688J995
11492b909m10k668m416k536R418N232n975O559J0563n51j9314n533n597l081J6186
11477e032Q135L235P731O054n229m571m484J0340P69p214J1797J1888L145K57
$$ plain form
11463 36821 34903 42201 29994 14740 27736 17812 17023 29318 19369 12677 3789 -1641 5880 14547
11449 14547 3272 5692 8675 5974 5224 11953 19377 5962 -1779 4697 23599 22937 24599 30827
11435 30827 41627 45770 48238 58749 58174 35346 32115 20461 8316 5844 13385 20382 23720
11422 23720 22949 23981 17957 15385 16278 8017 7167 13162 19205 888 600 20276 46015 34166
11408 34166 11204 12902 33897 27429 29584 28048 16519 1906 1530 -9665 4526 23929 21870
11395 21870 -1274 -8783 7045 15949 15951 18430 14107 3428 -7703 -13155 -8239 -8798 103 7158
11381 7158 6697 6014 11127 19128 25510 25162 17738 7931 5091 11394 4958 -1148 3323 4178 6587 10056
11365 10056 14101 19850 29483 18456 -1019 -1063 10937 14981 36826 41599 36371 16394 5838
$$ packed form
11463C6821j918P298j2207j5254J2996r924p89J2295r949o692q888n430P521Q667
11449A4547j1275K420K983k701p50O729P424j3415p741O476J8902o62J662O228
11435C0827J0800M143K468J0511n75k2828l231j1654j2145k472P541O997L338
11422B3720p71J032o024k572Q93q261q50N995O043j8317k88J9676K5739j1849
11408C4166k2962J698K0995o468K155j536j1529j4613l76j1195J4191J9403k059
11395B1870k3144p509J5828Q904KK479m323j0679j1131n452M916n59Q901P055
11381G158m61o83N113Q001O382l48p424r807k840O303o436o106M471Q55K409L469
11365A0056M045N749R633j1027j9475m4J2000M044K1845M773n228j9977j0556
$$ plain form
11352 5838 20220 25574 27078 22019 27473 31573 26446 22611 25343 5334 -9908 -2242 10842 19280
11338 19280 16943 31694 34969 19272 8909 12402 9396 24774 20033 22006 25167 21494 22723
11325 22723 18606 8785 407 443 2513 -1323 20330 40296 42186 38214 29332 22058 12719 21314
11311 21314 38968 36646 26403 26313 43498 47101 39862 29205 18559 19818 18558 3764 11943
11298 11943 12059 8439 2212 -6455 77 8382 15731 26569 24552 24580 38005 49328 40482 24214
11284 24214 12422 11110 12173 11936 9524 21286 31784 17521 15707 24139 30941 22792 14104 14698
11270 14698 22864 22341 17114 21907 20973 15245 14994 15696 30404 28176 26944 40636 41030 37551 31244
11255 31244 31700 35919 40233 31355 18771 22800 12708 16910 45073 61403 54805 38580 11583
$$ packed form
11352E838J4382N354J504n059N454M100n127l835K732k0009j5242P666J3084Q438
11338A9280k337J4751L275j5697j0363L493l006J5378m741J973L161l673J229
11325B2723m117r821q378L6K070l836K1653J9966J890l972q882p274r339Q595
11311B1314J7654k322j0243r0J7185L603p239j0657j0646J259j260j4794Q179
11298A1943J16l620o227q667O532Q305P349J0838k017K8J3425J1323q846j6268
11284B4214j1792j312J063k37k412J1762J0498j4263j814Q432O802q149q688N94
11270A4698Q166n23n227M793r34n728k51P02J4708k228j232J3692L94l479o307
11255C1244M56M219M314q878j2584M029j0092M202K8163J6330o598j6225k6997
$$ plain form
11242 11583 17489 21940 21969 16780 9083 4356 3862 18828 31678 26838 11334 -2146 5596 22190
11228 22190 45310 48084 34001 23292 38932 38426 26527 16021 8410 14321 25289 12389 13457
11215 13457 19496 22426 18244 5169 -3845 -5101 -893 15668 6678 7232 14007 19248 17866 9845
11201 9845 8400 28613 42784 32936 24749 21176 22964 28971 24565 23720 15574 14045 16428 33683
11187 33683 35053 19436 13425 23717 39080 37922 28658 18562 13092 7305 11713 31624 45104
11174 45104 34960 25544 29240 19831 19745 25083 45552 44414 47343 39698 22442 23717 37161 40600
11160 40600 48282 46270 36144 29071 19882 28345 38046 40332 50931 57510 53412 47151 36332 37128
11146 37128 42525 46360 56870 53680 44454 31173 41228 40372 36452 34161 28034 15961 8294 11222
$$ packed form
11242A1583N906M451K9n189p697m727m94J4966J2850m840j5504j3480P742J6594
11228B2190K3120K774j4083j0709J5640n06j1899j0506p611N911J0968j2900J068
11215A3457O039K930m182j3075r014j256M208J6561q990N54O775N241j382q021
11201I845j445K0213J4171r848q187l573J788O007m406q45q146j529K383J7255
11187C3683J370j5617o011J0292J5363j158r264j0096n470n787M408J9911J3480
11174D5104j0144r416L696r409q6N338K0469j138K929p645j7256J275J3444L439
11160D0600P682k012j0126p073r189Q463R701K286J0599O579m098o261j0819P96
11146C7128N397L835J0510l190r226j3281J0055q56l920k291o127j2073p667K928
$$ plain form
11132 11222 21916 18562 31509 40944 43084 26742 31264 40724 44006 46616 38729 25268 25384 19271
11118 19271 23660 10484 7272 -5687 -5716 18962 32350 41964 37747 49104 41447 40825 48543 39010
11104 39010 27991 23115 21991 38423 51928 63971 63724 57510 53340 49074 45747 45640 40110 40934
11090 40934 47695 55131 52306 48361 48126 37159 23108 20896 14667 31351 30096 34533 46425 46886
11076 46886 28087 36635 52552 42073 26606 23968 32806 38358 38236 50097 52881 43581 30250
11063 30250 31859 34290 38015 43758 46471 47267 39992 27870 28941 25649 19606 26216 47247 57226
11049 57226 35189 18336 12418 20984 27906 33063 15828 5243 3169 21845 35007 46883 64379
11036 64379 85633 116537 178251 269302 411444 476218 368713 244952 179352 154962 140493
$$ packed form
11132A1222J0694l354J2947R435K140j6342M522R460L282K610p887j3461J16o113
11118A9271M389j3176l212j2959k9K4678J3388R614m217J1357p657o22P718r533
11104C9010j1019m876j124J6432J3505J2043k47o214m170m266l327j07n530Q24
11090D0934O761P436k825l945k35j0967j4051k212o229J6684j255M437J1892M61
11076D6886j8799Q548J5917j0479j5467k638Q838N552j22J1861K784r300j3331
11063C0250J609K431L725N743K713P96p275j2122J071l292o043O610K1031R979
11049E7226k2037j6853n918Q566O922N157j7235j0585k074J8676J3162J1876J7496
11036F4379K1254L0904O1714R1051J42142O4774j07505j23761o5600k4390j4469
$$ plain form
11025 140493 111869 88559 74977 73566 84595 82492 82530 82191 86573 80170 64493 64716 65254 67409
11011 67409 79168 100347 104856 114330 125513 119637 106770 130888 143526 143402 137893 151196 167859
10998 167859 192555 214990 241899 275507 344838 470349 684422 1041918 1672623 2383618
10988 2383618 2554165 2085390 1703597 1731604 2171742 2669029 2531122 1826405 1231077 896921
10978 896921 686119 545177 435263 359880 325184 300081 277009 248921 226243 214167 195595
10967 195595 174590 155150 145850 134956 141738 142905 147411 152106 159767 143113 135784 141518 124807
10954 124807 117562 106042 106426 118450 110321 117903 114491 110595 109959 105955 112541 120488 121931 132507
10940 132507 125933 115851 130834 163742 242132 314246 290710 219407 176969 151322 125725 108935
$$ packed form
11025A40493k8624k3310j3582j411J1029k103L8l39M382o403j5677K23N38K155
11011F7409J1759K1179M509R474J1183n876j2867K4118J2638j24n509J3303J6663
10998A67859K4696K2435K6909L3608O9331J25511K14073L57496O30705P10995
10988B383618J70547m68775l81793K8007M40138M97287j37907p04717n95328l34156
10978H96921k10802j40942j09914p5383l4696k5103k3072k8088k2678j2076j8572
10967A95595k1005j9440r300j0894O782J167M506M695P661j6654p329N734j6711
10954A24807p245j1520L84J2024q129P582l412l896o36m004O586P947J443J0576
10940A32507o574j0082J4983L2908P8390P2114k3536p1303m2438k5647k5597j6790
$$ plain form
10928 108935 101378 93141 85477 72157 69802 73073 81527 74759 70114 72391 80527 77963 103823 115525
10914 115525 122891 124870 109243 97721 84359 78610 85370 98526 88873 85812 82741 88621 102432
10901 102432 105227 103043 107661 104145 91416 79384 66017 44767 35016 37384 51653 82356 119604
10888 119604 121663 111905 89158 93312 126202 157419 166282 164424 154476 140396 135294 131224 135773
10875 135773 132819 125655 119897 122908 139653 146038 139503 121686 115783 112846 117371 108380 103604 100617
10861 100617 103745 101142 104541 110917 90121 79899 101803 109943 112197 108661 109897 102806 117233
10848 117233 132247 143387 143344 158877 194142 235765 235806 241106 274186 284768 266391 256979 257743
10835 257743 278284 306346 337854 326556 298614 290833 288887 277034 289960 300947 295572 296526
$$ packed form
10928A08935p557q237p664j3320k355L271Q454o768m645K277Q136k564K5860J1702
10914A15525P366J979j5627j1522j3362n749O760J3156r653l061l071N880J3811
10901A02432K795k184M618l516j2729j2032j3367k1250r751K368J4269L0703L7248
10888A19604K059r758k2747M154L2890L1217Q863j858r948j4080n102m070M549
10875A35773k954p164n758L011J6745O385o535j7817n903k937M525q991m776k987
10861A00617L128k603L399O376k0796j0222K1904Q140K254l536J236p091J4427
10848A17233J5014J1140m3J5533L5265M1623M1N300L3080J0582j8377r412P64
10835B57743K0541K8062L1508j1298k7942p781j946j1853J2926J0987n375R54
$$ plain form
10823 296526 279979 277504 279774 264153 233678 220187 216872 194523 185336 172642 177159 197581
10811 197581 209777 216541 211536 194378 210741 219930 203400 178983 169663 166379 154185 150935 168606
10798 168606 148381 122143 123972 122559 132370 150160 167026 171011 187226 214196 225432 229632
10786 229632 222651 224283 245039 269779 261298 240363 240697 219408 203815 198938 185618 178508 168532
10773 168532 156791 133365 94758 7452 -85677 -87118 19086 82060 69021 -24188 -120271
10762 -120271 -89816 32288 131719 193583 201245 199242 220432 257156 290694 306752 323225 337460
10750 337460 357611 368995 372682 371252 344049 336507 337264 338680 357689 365619 385097 412102 416328
10737 416328 391086 330830 214309 78889 20258 94732 165703 192866 123571 -41586 -113023
$$ packed form
10823B96526j6547k475K270j5621l0475j3491l315k2349r187j2694M517K0422
10811A97581J2196O764n005j7158J6363R189j6530k4417r320l284j2194l250J7671
10798A68606k0225k6238J829j413R811J7790J6866L985J6215K6970J1236M200
10786B29632o981J632K0756K4740q481k0935L34k1289j5593m877j3320p110r976
10773A68532j1741k3426l8607q7306r3129j441J06204O2974j3039r3209r6083
10762a20271L0455J22104R9431O1864P662k003K1190L6724L3538J6058J6473J4235
10750C37460K0151J1384L687j430k7203p542P57J416J9009P930J9478K7005M226
10737D16328k5242o0256j16521j35420n8631P4474P0971K7163o9295j65157p1437
$$ plain form
10726 -113023 -30507 46662 106791 148984 173659 185100 196616 211270 205108 189017 163601 172091
10714 172091 188455 176520 176033 219884 226263 193154 131303 73505 83344 168761 195037 198620
10702 198620 164886 124085 122758 119451 104935 133699 133561 111806 101516 110070 116735 116999 126637
10689 126637 163236 195970 212373 228524 258258 275936 304857 343150 353841 358767 352006 345269
10677 345269 363087 391286 404042 405638 399093 396604 392929 396647 386274 388396 395336 394373 400600
10664 400600 398271 423408 450768 507065 559966 577827 591825 603907 625521 660900 750958 872774
10652 872774 949167 978759 985880 935530 853796 786411 724539 677557 655861 661202 687310 690150
10640 690150 686186 707252 722224 729079 742562 774047 822105 888340 941226 988873 1017434 1049967
$$ packed form
10726a13023Q2516P7169O0129M2193K4675J1441J1516J4654o162j6091k5416Q490
10714A72091J6364j1935m87M3851O379l3109o1851n7798R839Q5417K6276L583
10702A98620l3734m0801j327l307j4516K8764j38k1755j0290Q554O665K64R638
10689A26637L6599L2734J6403J6151K9734J7678K8921L8293J0691M926o761o737
10677C45269J7818K8199J2756J596o545k489l675L718j0373K122O940r63O227
10664D00600k329K5137K7360N6297N2901J7861J3998J2082K1614L5379R0058J21816
10652H72774P6393K9592P121n0350q1734o7385o1872m6982k1696N341K6108K840
10640F90150l964K1066J4972O855J3483L1485M8058O6235N2886M7647K8561L2533
$$ plain form
10628 1049967 1069898 1081756 1110642 1166978 1237148 1306258 1370684 1437169 1502029 1526990 1577943
10617 1577943 1632567 1683225 1766433 1915103 2060075 2178000 2291407 2390585 2521660 2784444
10607 2784444 3172056 3578067 3935025 4265878 4696501 5375039 6449003 7599930 8131708
10598 8131708 8077634 8284004 9052355 10359863 11731337 12512036 13101000 14462778 16901611
10589 16901611 20390287 24404747 28754273 34288206 42524198 55416788 76334902 111935419
10581 111935419 176529828 292673479 428044016 461843547 373299279 298288098 298475002
10574 298475002 376457937 471957869 457722310 330774891 219336292 154329010 115672040
10567 115672040 90437344 72753023 59016790 48635888 41578259 36108474 31157166
$$ packed form
10628A049967J9931J1858K8886N6336P0170O9110O4426O6485O4860K4961N0953
10617A577943N4624N0658Q3208J48670J44972J17925J13407R9178J31075K62784
10607B784444L87612M06011L56958L30853M30623O78538J073964J150927N31778
10598H131708n4074K06370P68351J307508J371474P80699N88964J361778K438833
10589A6901611L488676M014460M349526N533933Q235992J2892590K0918114L5600517
10581A11935419O4594409J16143651J35370537L3799531q8544268p5011181J86904
10574B98475002P7982935R5499932j4235559j26947419j11438599o5007282l8656970
10567A15672040k5234696j7684321j3736233j0380902p057629n469785m951308
$$ plain form
10560 31157166 27095021 23889333 21306590 19438154 18304273 17128605 15413694 13793633
10552 13793633 12688145 12128673 11940311 11360067 10037310 8730618 7790751 7219876 6980893
10543 6980893 6995579 7191856 7411242 7093960 6269946 5602555 5370364 5544963 5659318 5112376
10533 5112376 4173048 3428890 2924332 2570658 2311825 2090257 1910448 1778381 1696253 1588782
10523 1588782 1470001 1381722 1315095 1269260 1217277 1188009 1161348 1164027 1176505 1197714 1158963
10512 1158963 1088803 1020797 936987 870571 852950 833546 776146 717542 648548 593035 572916
10501 572916 561606 540780 523650 507794 507813 513186 506729 512272 568891 664465 731247 738233 704589
10488 704589 702743 755563 822880 845324 757404 647716 578923 525726 472492 428546 410466
$$ packed form
10560C1157166m062145l205688k582743j868436j133881j175668j714911j620061
10552A3793633j105488n59472j88362n80244j322757j306692r39867n70875k38983
10543F980893J4686J96277K19386l17282q24014o67391k32191J74599J14355n46942
10533E112376r39328p44158n04558l53674k58833k21568j79809j32067q2128j07471
10523A588782j18781q8279o6627m5835n1983k9268k6661K679J2478K1209l8751
10512A158963p0160o8006q3810o6416j7621j9404n7400n8604o8994n5513k0119
10501E72916j1310k0826j7130j5856J9N373o457N543N6619R5574O6782O986l3644
10488G04589j846N2820O7317K2444q7920j09688o8793n3197n3234m3946j8080
$$ plain form
10477 410466 392933 355678 337315 338857 337225 328741 303407 271317 266285 277922 299708 350188
10465 350188 388252 403597 432657 461162 489943 541432 606318 697377 784968 799709 745718
10454 745718 796268 904981 996443 1153223 1255034 1143435 1026568 931701 922568 1030171
10444 1030171 1085756 984762 855128 748053 737488 747962 717442 704372 744491 750639 731410
10433 731410 735562 751659 756618 761562 766900 779824 766698 747561 795789 881581 888470 731599
10421 731599 569450 478080 483868 535417 457813 278074 153646 73209 32679 -245 -22124
10410 -22124 -34316 -31072 -20622 -12415 -651 -7994 -25505 -33275 -37113 -31698 -31307 -53180 -64069
10397 -64069 -48683 -32734 -6516 6177 4955 15658 74201 189496 301116 339705 222283
$$ packed form
10477D10466j7533l7255j8363J542j632q484k5334l2090n032J1637K1786N0480
10465C50188L8064J5345K9060K8505K8781N1489O4886R1059Q7591J4741n3991
10454G45718N0550J08713R1462J56780J01811j11599j16867r4867r133J07603
10444A030171N5585j00994j29634j07075j0565J0474l0520j3070M0119O148j9229
10433G31410M152J6097M959M944N338J2924j3126j9137M8228Q5792O889j56871
10421G31599j62149r1370N788N1549p7604j79739j24428q0437m0530l2924k1879
10410b2124j2192L244J0450Q207J1764p343j7511p770l838N415L91k1873j0889
10397f4069J5386J5949K6218J2693j222J0703N8543J15295J11620L8589j17422
$$ plain form
10386 222283 123714 111809 191401 301128 303690 198022 119827 80350 60757 49588 40189
10375 40189 34124 52010 50820 24941 -3827 -23590 -53878 -54536 -35924 -19024 -19596 -34108 -41867
10362 -41867 -33098 -27584 -2296 10348 3255 -4579 6721 42028 53001 36331 30776 53461 65899
10349 65899 79643 84225 55077 26381 6928 -10774 -14035 -3933 -6692 -11452 -9337 -19697 -17655
10336 -17655 -8594 -17740 -25243 -31765 -34304 -54717 -56145 -33903 -11479 1101 -2844 -5238 3853
10323 3853 16423 25969 26581 2346 -3780 12292 29614 47225 50055 40417 19945 8334 27431
10310 27431 45287 58739 66225 51930 41488 21141 24740 32251 45237 51162 41096 48440 47991
10297 47991 48115 30081 29097 38014 34339 24801 12556 22160 39264 37761 25316 14147 13524 4073
$$ packed form
10386B22283r8569j1905P9592J09727K562j05668p8195l9477j9593j1169r399
10375D0189o065J7886j190k5879k8768j9763l0288o58J8612J6900n72j4512p759
10362d1867Q769N514K5288J2644p093p834J1300L5307J0973j6670n555K2685J2438
10349F5899J3744M582k9148k8696j9453j7702l261J0102k759m760K115j0360K042
10336a7655R061r146p503o522k539k0413j428K2242K2424J2580l945k394R091
10323C853J2570R546O12k4235o126J6072J7322J7611K830r638k0472j1611J9097
10310B7431J7856J3452P486j4295j0442k0347L599P511J2986N925j0066P344m49
10297D7991J24j8034r84Q917l675r538j2245R604J7104j503j2445j1169o23r451
$$ plain form
10283 4073 -13554 -23850 -15486 -21610 -24124 3263 6387 -10953 -13906 -11775 -6423 -21904 -39875
10270 -39875 -65167 -83334 -59837 -8621 3734 -1416 5521 8591 19145 42361 74865 79493
10258 79493 70490 47429 30091 13189 4976 8650 -6575 -612 8973 10513 20008 20276 13642 9114
10244 9114 -3936 -9032 -13463 -17795 -3515 3664 -507 -8312 -27018 -26349 -27172 -15439 -8417 -11254
10230 -11254 -6722 4142 16116 17201 4838 -10296 -27418 -19010 -6876 -10917 -24573 -25546 -15492
10217 -15492 -28273 -29520 -7926 -1882 -15434 -15116 -3372 6216 8269 14157 7347 -3926 -14290
10204 -14290 -9750 -12304 2783 10829 8003 -535 -7022 601 -203 2664 14329 1260 -4435 -12638
10190 -12638 -10458 1400 -2387 -1513 -1968 9683 22717 21266 25158 33820 43290 38468 38461 52111 74919
$$ packed form
10283D073j7627j0296Q364o124k514K7387L124j7340k953K131N352j5481j7971
10270c9875k5292j8167K3497N1216J2355n150O937L070J0554K3216L2504M628
10258G9493r003k3061j7338j6902q213L674j5225N963R585J540R495K68o634m528
10244I114j3050n096m431m332J4280P179m171p805j8706O69q23J1733P022k837
10230a1254M532J0864J1974J085j2363j5134j7122Q408J2134m041j3656r73J0054
10217a5492j2781j247K1594O044j3552L18J1744R588K053N888o810j1273j0364
10204a4290M540k554J5087Q046k826q538o487P623q04K867J1665j3069n695q203
10190a2638K180J1858l787Q74m55J1651J3034j451L892Q662R470m822pJ3650K2808
$$ plain form
10175 74919 95201 91416 91816 112746 139942 181820 233751 304161 439304 666045 1074404 1781000
10163 1781000 2453446 2456771 1939751 1639165 1755633 2253209 2649147 2319298 1587818 1067808
10153 1067808 768544 582753 477701 453067 449811 380819 294628 236200 195957 158301 120563
10142 120563 92613 80639 85994 84366 83537 73206 59070 58768 71481 67176 71858 60690 50409
10129 50409 30906 3517 9321 11990 14004 21013 24693 31058 45384 35334 18463 7150 5572
10116 5572 13414 24286 22669 17669 29749 22575 10435 21984 31128 27246 27163 40097 48071 44299
10102 44299 46833 37876 19258 10129 -10547 -30208 -29538 -30581 -29242 -11024 -6491 -20850 -22898
10089 -22898 -35443 -33190 -24456 -2748 -16218 -15667 -2485 -4985 -10771 -5749 1194 -4415 2722 6311
$$ packed form
10175G4919K0282l785M00K0930K7196M1878N1931P0410J35143K26741M08359P06596
10163A781000O72446L325n17020l00586J16468M97576L95938l29849p31480n20010
10153A067808k99264j85791j05052k4634l256o8992q6191n8428m0243l7656l7738
10142A20563k7950j1974N355j628q29j0331j4136l02J2713m305M682j1168j0281
10129E0409j9503k7389N804K669K014P009L680O365J4326j0050j6871j1313j578
10116E572P842J0872j617n000J2080p174j2140J1549R144l882q3J2934P974l772
10102D4299K534q957j8618r129k0676j9661O70j043J339J8218M533j4359k048
10089b2898j2545K253Q734K1708j3470N51J3182k500n786N022O943n609P137L589
$$ plain form
10075 6311 -1970 -7659 -16973 -13165 -9958 -4696 -12075 -8021 10495 14490 3150 4912 1218 -6775
10061 -6775 -17201 -18977 -17296 -2222 4977 386 -6883 -12081 -18140 -34847 -37594 -21246 -16837 -17599
10047 -17599 -19760 -19864 -17615 -30496 -36314 -30021 -16635 -7995 -5368 -7563 -13017 -27587 -27815 -14088
10033 -14088 -534 -11511 -20079 -5926 27229 38566 67631 101194 126642 112412 77097 43653
10021 43653 31628 22983 2272 -6984 -2703 -9065 -256 1023 -3631 -8120 -18540 -33547 -39064
10008 -39064 -32362 -15084 -2747 -4585 -8680 -12383 -15384 -18576 -26681 -19984 -14466 -14442 -16147 -23630
9994 -23630 -15336 -17203 -7322 -12075 -12510 -15815 -21947 -25577 -19607 -22295 -17648 -19990 -19168 -15101 -7637
9979 -7637 -14066 -1778 -1148 -16303 -19042 -18934 -18161 -17470 -14358 -10310 -6605 -8181 -18237 -15857 -9107
$$ packed form
10075F311q281n689r314L808L207N262p379M054J8516L995j1340J762l694p993
10061f775j0426j776J681J5074P199m591p269n198o059j6707k747J6348M409p62
10047a7599k161j04K249j2881n818O293J3386Q640K627k195n454j4570k28J3727
10033a4088J3554j0977q568J4153L3155J1337K9065L3563K5448j4230l5315l3444
10021D3653j2025q645k0711r256M281o362Q809J279m654m489j0420j5007n517
10008c9064O702J7278J2337j838m095l703l001l192q105O697N518K4j705p483
9994b3630Q294j867R881m753m35l305o132l630N970k688M647k342Q22M067P464
9979g637o429J2288O30j5155k739J08P73O91L112M048L705j576j0056K380O750
$$ plain form
9964 -9107 -6473 12569 1798 -17184 -32530 -33694 -35411 -28082 -9342 -8733 -15321 -2273 15612
9951 15612 4053 3959 8184 23376 5860 -3228 14021 29221 25173 16348 -2222 -179 2115 7748
9937 7748 -8012 -13512 -19391 -21841 -22152 -22147 -19525 -29269 -23436 -24626 -19110 -20409 -18150 -1906 9526
9922 9526 19523 33304 47434 75321 126241 140571 104333 60286 27641 22526 21900 13363 3484
9909 3484 1905 12594 -925 -15286 -13468 1907 2992 2587 -176 -459 -1990 -6601 -7287 -10813 -13724
9894 -13724 -9961 9148 14954 16001 19156 16632 32084 44396 46369 38165 27049 34974 33606 27964
9880 27964 23408 11166 14573 11900 14039 11757 19428 29184 26822 35135 20101 12937 7178 5141
9866 5141 -16844 -18837 -11279 -24582 -24545 1037 -459 -29156 -41775 -34575 -18788 -9239 -10690 -22448
$$ packed form
9964i107K634J9042j0771j8982j5346j164j717P329J8740O09o588J3048J7885
9951A5612j1559r4M225J5192j7516r088J7249J5200m048q825j8570K043K294N633
9937G748j5760n500n879k450l11NK622r744N833j190N516j299K259J6244J1432
9922I526R997J3781J4130K7887N0920J4330l6238m4047l2645n115o26q537r879
9909C484j579J0689j3519j4361J818J5375J085m05k763k83j531m611o86l526k911
9894a3724L763J9109N806J047L155k524J5452J2312J973q204j1116P925j368n642
9880B7964m556j2242L407k673K139k282P671R756k362Q313j5034p164n759k037
9866E141k1985j993P558j3303L7K5582j496k8697j2619P200J5787R549j451j1758
$$ plain form
9852 -22448 -18511 -16914 -13528 -120 5021 4915 -3051 -8795 -11921 -14469 -17596 3070 14512 13012
9838 13012 16235 10735 6133 -4557 -127 8613 9676 695 -15646 -28240 -32999 -34229 -32920 -44809
9824 -44809 -49066 -34135 -34233 -34513 -15816 -21324 -17554 -15056 234 6491 3966 10280 14251 14794 4727
9809 4727 1921 2131 4259 -6608 -24657 -8527 5290 1506 2499 6055 4539 2001 -6882 -15935
9795 -15935 -17732 -28065 -32921 -15641 1379 14380 16629 7276 19657 25592 24522 2107 -14978
9782 -14978 -21598 -26968 -32867 -41989 -39661 -34001 -12417 7831 11482 10788 15840 -4864 -20496 -15103
9768 -15103 4001 9353 -3967 -14642 -19107 -18530 -19770 -26043 -18788 -15608 -28524 -19238 -12578 -8693
9754 -8693 -11394 -2783 7148 10809 12433 2352 -14043 -8410 -10564 -18350 -7870 -6854 -14080 -16350
$$ packed form
9852b2448L937J597L386J3408N141j06p966n744l126k548l127K0666J1442j500
9838A3012L223n500m602j0690M430Q740J063q981j6341j2594m759j230J309j1889
9824d4809m257J4931r8k80J8697n508L770K498J5290O257k525O314L971N43j0067
9809D727k806K10K128j0867j8049J6130J3817l784R93L556j516k538q883r053
9795a5935j797j0333m856J7280J7020J3001K249r353J2381N935j070k2415j7085
9782a4978o620n370n899r122K328N660K1584K0248L651o94N052k0704j5632N393
9768a5103J9104N352j3320j0675m465N77j240o273P255L180j2916R286O660L885
9754h693k701Q611R931L661J624j0081j6395N633k154p786J0480J016p226k270
$$ plain form
9740 -16350 -8453 -7658 978 13348 12305 1528 -989 267 -3195 -11153 -4274 -1386 -14527 -9464
9726 -9464 9103 12792 7728 14377 19895 14959 14784 28310 35937 41039 35976 48744 64103 60206
9712 60206 47126 32403 35065 21134 14804 11763 14570 14485 17159 7231 77 6841 25150 34721
9698 34721 47573 73587 102670 140042 174017 196785 223323 222053 199936 177560 130116 86950
9686 86950 46050 27364 10076 17588 16393 15788 16811 24857 14997 7537 15927 13989 3288 1844
9672 1844 10284 14609 2167 -6908 -13281 -14826 -13807 -16454 -35293 -23240 -12164 -14036 -19134 -20020
9658 -20020 -24139 -21988 -20328 -14536 -6536 -13481 -15946 -17083 -23504 -11075 14503 29544 36468 69230
9644 69230 127778 173925 164889 126664 90167 72308 51792 40182 27855 16295 14608 29547
$$ packed form
9740a6350P897P95Q636J2370j043j0777k517J256l462p958O879K888j3141N063
9726i464J8567L689n064O649N518m936j75J3526P627N102n063J2768J5359l897
9712F0206j3080j4723K662j3931o330l041K807q5K674r928p154O764J8309R571
9698C4721J2852K6014K9083L7372L3975K2768K6538j270k2117k2376m7444m3166
9686H6950m0900j8686j7288P512j195o05J023Q046r860p460Q390j938j0701j444
9672A844Q440M325j2442r075o373j545J019k647j8839J2053J1076j872n098q86
9658b0020m119K151J660N792Q000o945k465j137o421J2429K5578J5041O924L2762
9644F9230N8548M6147r036l8225l6497j7859k0516j1610j2327j1560j687J4939
$$ plain form
9632 29547 31979 25957 16604 13070 5369 -2353 -9463 309 11606 23816 38471 39834 30738 19984
9618 19984 20586 33127 38250 49879 60236 59078 35332 22100 32235 29212 22857 15273 15142 17904
9604 17904 35056 60639 100578 143818 155699 102206 57373 37410 19509 12008 22021 18748
9592 18748 16229 3345 1973 -769 5318 1482 -18471 -8627 -1016 -5721 2215 -1850 -8452 -6712
9578 -6712 -3746 2406 12660 12142 11733 16041 5988 -2620 6203 4968 -5229 8332 5650 13189
9564 13189 17946 9357 5002 16446 16193 2091 4604 414 -13053 -939 12640 17554 12591 -6756
9550 -6756 2903 24153 21061 16417 30991 23574 4006 -4167 -6540 -14402 6259 18848 5228
9537 5228 3796 11992 14427 12183 -6198 -661 18916 23190 20203 23756 18946 23264 26244 33772
$$ packed form
9632B9547K432o022r353l534p701p722p110R772J1297J2210J4655J363r096j0754
9618A9984O02J2541N123J1629J0357j158k3746j3232J0135l023o355p584j31K762
9604A7904J7152K5583L9939M3240J1881n3493m4833j9963j7901p501J0013l273
9592A8748k519j2884j372k742O087l836j9953R844P611m705P936m065o602J740
9578f712K966O152J0254n18m09M308j0053q608Q823j235j0197J3561k682P539
9564A3189M757q589m355J1444k53j4102K513m190j3467J2114J3579M914m963j9347
9550f756R659K1250l092m644J4574p417j9568q173k373p862K0661J2589j3620
9537E228j432Q196K435k244j8381N537J9577M274k987L553m810M318K980P528
$$ plain form
9523 33772 55036 63662 53048 42309 47176 55152 63794 73565 65344 70197 67615 53971 47430 49498
9509 49498 61096 50092 20650 9002 12380 17824 17177 22647 13262 3105 6600 -3242 219 4845
9495 4845 12443 11981 17940 8825 483 4888 20367 45562 76146 108413 160183 201179 231553
9482 231553 231843 210629 173635 135030 106239 79649 52095 37805 25038 17657 22038 25419 9797
9469 9797 -4942 -1741 14227 12220 18283 20004 20755 18279 15504 3687 4002 10751 12898 7879 13897
9454 13897 17690 13135 14466 9808 8169 13275 31149 24219 15439 26149 28995 24647 26507 18783
9440 18783 2535 3320 10062 10051 21850 3372 -10178 -4556 3693 9360 8693 4278 7242 6658 1679
9425 1679 -5562 -14925 -8903 -15966 -12927 1391 10245 5029 1121 -9170 -9544 -10063 -9993 -4845 4362
$$ packed form
9523C3772K1264Q626j0614j0739M867P976Q642R771q221M853k582j3644o541K068
9509D9498J1598j1004k9442j1648L378N444o47N470r385j0157L495r842L461M626
9495D845P598m62N959r115q342M405J5479K5195L0584L2267N1770M0996L0374
9482B31553K90k1214l6994l8605k8791k6590k7554j4290j2767p381M381L381j5622
9469I797j4739L201J5968k007O063J721P51k476k775j1817L15O749K147n019O018
9454A3897L793m555J331m658j639N106J7874o930q780J0710K846m348J860p724
9440A8783j6248P85O742j1J1799j8478j3550N622Q249N667o67m415K964n84m979
9425A679p241r363O022p063L039J4318Q854n216l908j0291l74n19P0N148R207
$$ plain form
9410 4362 -3320 -3812 7254 18444 9278 1542 24133 26439 9020 -12456 -17463 10811 30246
9397 30246 10057 9535 19660 13132 11045 11570 -222 -12003 -9895 -9777 -1535 8127 5398 17199
9383 17199 37339 39605 42066 40569 29877 33969 28688 19260 20235 30624 22040 15261 27151 44065
9369 44065 42562 17725 8566 -1048 -6781 -4518 6435 12067 9758 22131 37026 30785 13997
9356 13997 7375 4725 1036 9906 27537 32642 34640 33994 30546 14403 16060 33904 38641 47139
9342 47139 43295 43981 46984 46165 44344 24860 25130 37421 23282 23822 29688 31619 23351 29338 44253
9327 44253 61647 95471 149309 197249 216436 174475 125891 98464 96303 89915 73113 41356
9315 41356 30939 33770 30178 40676 38036 42302 44504 25977 21702 18548 17643 35497 28285 28882
$$ packed form
9410D362p682m92J1066J1190r166p736K2591K306j7419k1476n007K8274J9435
9397C0246k0189n22J0125o528k087N25j1792j1781K108J18Q242R662k729J1801
9383A7199K0140K266K461j497j0692M092n281r428R75J0389q584o779J1890J6914
9369D4065j503k4837r159r614n733K263J0953N632k309J2373J4895o241j6788
9356A3997o622k650l689Q870J7631N105J998o46l448j6143J657J7844M737Q498
9342D7139l844O86L003q19j821j9484K70J2291j4139N40N866J931q268N987J4915
9327D4253J7394L3824N3838M7940J9187m1961m8584k7427k161o388j6802l1757
9315D1356j0417K831l592J0498k640M266K202j8527m275l154r05J7854p212N97
$$ plain form
9301 28882 26352 27711 28016 25303 14352 23989 16246 -2667 1867 24785 16926 7694 7371 3465
9287 3465 12122 23491 31627 46594 40141 69888 114002 152514 154481 133748 103140 82378 62316
9274 62316 36702 29696 15252 14986 33773 45264 36572 37242 35233 30030 37078 36330 40367 67031
9260 67031 84203 91838 84367 69482 57241 46229 60451 56014 34248 28764 42703 44597 31728
9247 31728 41841 61832 57594 39190 39082 48453 63255 63155 60317 66689 64459 69761 82069 86078
9233 86078 89664 90512 100584 132066 136115 141309 145951 140337 145108 150313 160161 185472 225557 239117
9219 239117 265076 310192 356875 408369 472846 547562 647179 801214 1020500 1317770 1727816
9208 1727816 2289504 2986452 3641186 3948957 3730341 3147999 2501829 1942412 1526819 1224657
$$ packed form
9301B8882k530J359L05k713j0951R637p743j8913M534K2918p859r232l23l906
9287C465Q657J1369Q136J4967o453K9747M4114L8512J967k0733l0608k0762k0062
9274F2316k5614p006j4444k66J8787J1491q692O70k009n203P048p48M037K6664
9260F7031J7172P635p471j4885j2241j1012J4222m437k1766n484J3939J894j2869
9247C1728J0113J9991m238j8404j08R371J4802j00k838O372k230N302J2308M009
9233H6078L586Q48J0072L1482M049N194M642n614M771N205R848K5311M0085J3560
9219B39117K5959M5116M6683N1494O4477P4716R9617J54035K19286K97270M10046
9208A727816N61688O96948O54734L07771k18616n82342o46170n59417m15593l02162
$$ plain form
9198 1224657 989834 813766 680675 584205 511201 443444 389104 350439 308970 276316 243544
9187 243544 220384 208910 199207 185128 171483 149808 142562 141423 128473 113292 108768 98597
9175 98597 112291 122859 112900 107190 85155 71990 61685 57782 61851 66848 59451 56514 58388
9162 58388 66598 80042 75797 82197 88623 103263 138334 149097 144361 133479 122433 106417 77996
9149 77996 63028 64128 54492 45142 36799 43876 38657 17617 53241 115226 170077 223777 244247
9136 244247 233259 179179 123376 75873 49303 33138 17775 -1576 -14896 -5101 8742 20112
9124 20112 23342 18773 26740 29105 21375 17984 9934 12925 17775 25149 19890 25084 23477 19685 35595
9109 35595 35822 34749 24983 30725 45074 55782 46196 45670 47473 69974 115514 170515 236662 289514
$$ packed form
9198A224657k34823j76068j33091r6470p3004o7757n4340l8665m1469l2654l2772
9187B43544k3160j1474r703j4079j3645k1675p246j139j2950j5181m524j0171
9175I8597J3694J0568r959n710k2035j3165j0305l903M069M997p397k937J874
9162E8388Q210J3444m245O400O426J4640L5071J0763m736j0882j1046j6016k8421
9149G7996j4968J100r636r350q343P077n219k1040L5624O1985N4851N3700K0470
9136B44247j0988n4080n5803m7503k6570j6165j5363j9351j3320R795J3843J1370
9124B0112L230m569P967K365p730l391q050K991M850P374n259N194j607l792J5910
9109C5595K27j073r766N742J4349J0708r586n26J803K2501M5540N5001O6147N2852
$$ plain form
9095 289514 278302 209806 139984 85950 75591 64906 45668 36781 34839 25375 12148 861
9083 861 12290 23526 22717 13637 17462 18382 17757 14007 16709 5473 -4145 511 -545 1996 -2846
9068 -2846 -2334 2007 4206 -3829 12158 16310 21204 8675 528 2131 -9419 -19026 -24305 -16465
9054 -16465 -5392 1738 5160 -1222 2155 2552 13221 19159 27412 17755 14302 16573 13447 5313
9040 5313 8299 7535 -5567 -14225 -13129 -12183 -8365 -24230 -28334 -18044 -7938 790 3214 9123
9026 9123 -15904 -10941 -188 13191 12701 -1070 -371 6535 17818 22378 4098 -1069 12544 9795
9012 9795 -290 4339 -2504 -3317 -3386 -15263 -9129 -18274 -20397 -27693 -11446 -4435 3948 12843 -871
8997 -871 6053 9801 1879 7483 17060 11692 10471 6465 11276 10214 -7637 -21550 -41411 -27079
$$ packed form
9095B89514j1212o8496o9822n4034j0359j0685j9238q887j942r464j3227j1287
9083H61J1429J1236q09r080L825R20o25l750K702j1236r618M656j056K541m842
9068b846N12M341K199q035J5987M152M894j2529q147J603j1550r607n279P840
9054a6465J1073P130L422o382L377L97J0669N938Q253r657l453K271l126q134
9040E313K986p64j3102q658J096R46L818j5865m104J0290J0106Q728K424N909
9026I123k5027M963J0753J3379m90j3771O99O906J1283M560j8280n167J3613k749
9012I795j0085M629o843q13o9j1877O134r145k123p296J6247P011Q383Q895j3714
8997h71O924L748p922N604R577n368j221m006M811j062j7851j3913j9861J4332
$$ plain form
8983 -27079 -18904 -13080 -3855 -19112 -24661 7742 13635 -10227 -18921 -16274 -9193 -11406 -9939 4424
8969 4424 4518 2626 9552 14824 6097 5714 5130 8721 10907 8938 4710 -1883 2538 -929 3837 17994
8953 17994 24036 11626 5372 -2567 -5002 -315 11647 7581 8470 3572 440 6765 9228 4576
8939 4576 2596 -2073 -1693 -12166 -17808 -26657 -18833 -16636 -13086 -15061 -4047 3322 9971 18512 25546
8924 25546 17054 -1898 -8763 -11317 -4603 4593 22415 11774 3026 5743 1847 -8959 -15691 -16585
8910 -16585 -24710 -25215 -19036 -15113 -14670 -15534 -15371 13195 36361 40138 33769 30023 9565 -4228 -221
8895 -221 32392 14723 -3683 -9094 -12524 -13668 -15652 -11396 3778 16522 14469 24184 37072 49146
8881 49146 53957 42440 35857 44987 69348 86730 106373 115715 135622 168166 217657 305324 468041
$$ packed form
8983b7079Q175N824R225j5257n549L2403N893k3862q694K647P081k213J467J4363
8969D424R4j892O926N272q727l83n84L591K186j969m228o593M421l467M766J4157
8953A7994O042j2410o254p939k435M687J1962m066Q89m898l132O325K463m652
8939D576j980m669L80j0473n642q849P824K197L550j975J1014P369O649Q541P034
8924B5546q492j8952o865k554O714R196J7822j0641q748K717l896j0806o732q94
8910a6585q125n05O179L923M43q64J63K8566K3166L777o369l746k0458j3793M007
8895b21L2613j7669j8406n411l430j144j984M256J5174J2744k053R715J2888J2074
8881D9146M811j1517o583R130K4361J7382J9643R342J9907L2544M9491Q7667J62717
$$ plain form
8868 468041 729215 1010454 1064909 843182 579774 407031 306741 238419 200020 174695
8858 174695 154180 137888 117363 100083 91123 86302 85737 70898 68348 62923 56904 56297 68114
8845 68114 69813 46390 28923 33667 42372 30965 34081 42775 62783 77369 77270 80501 80721 96737
8831 96737 108066 133446 159125 204120 250582 319667 456084 721125 1207730 1860442 2154792
8820 2154792 1779018 1225600 861843 666607 573140 492507 399838 316113 263652 201376 171917
8809 171917 158609 147588 146312 150144 126144 112380 105576 98379 78053 57406 55375 85105 84342
8796 84342 85015 69099 66813 73387 76216 81247 74203 72521 96875 99391 107515 122418 120035 112081
8782 112081 125156 170232 246657 362995 554538 835375 1033610 949630 681861 472509
$$ packed form
8868D68041K61174K81239N4455k21727k63408j72743j00290o8322l8399k5325
8858A74695k0515j6292k0525j7280q960m821n65j4839k550n425o019o07J1817
8845F8114J699k3423j7467M744Q705j1407L116Q694K0008J4586r9L231K20J6016
8831I6737J1329K5380K5679M4995M6462O9085J36417K65041M86605O52712K94350
8820B154792l75774n53418l63757j95236r3467q0633r2669q3725n2461o2276k9459
8809A71917j3308j1021j276L832k4000j3764o804p197k0326k0647k031K9730p63
8796H4342O73j5916k286O574K829N031p044j682K4354K516Q124J4903k383p954
8782A12081J3075M5076P6425J16338J91543K80837J98235q3980k67769k09352
$$ plain form
8772 472509 342955 268020 223001 211190 225299 232004 224109 196351 159000 143857 134943 130524
8760 130524 114374 86677 68298 49197 50767 50568 64206 59393 37286 29471 21334 31753 48327
8747 48327 45811 35376 56573 52925 46260 64681 68590 68684 72041 65203 59320 67833 73997 74647 85757
8732 85757 87417 95714 104784 124929 136290 142038 177418 192515 200767 197832 168640 156957 154143
8719 154143 143197 115707 79939 60441 47595 41532 33974 37477 43003 42905 41623 37295 20661
8706 20661 19573 29888 43875 47938 38253 28381 45517 53630 55061 54997 40120 36968 56018 60548
8692 60548 56348 59643 85239 108807 142460 183438 188952 193090 190593 180138 162527 126389 103384
8679 103384 82355 69147 67115 55256 36012 25485 10529 -2405 17340 28430 16416 7100
$$ packed form
8772D72509j29554p4935m5019j1811J4109O705p895k7758l7351j5143q914m419
8760A30524j6150k7697j8379j9101J570j99J3638m813k2107p815q137J0419J6574
8747D8327k516j0435K1197l648o665J8421L909R4L357o838n883Q513O164O50J1110
8732H5757J660Q297R070K0145J1361N748L5380J5097Q252k935k9192j1683k814
8719A54143j0946k7490l5768j9498j2846o063p558L503N526r8j282m328j6634
8706B0661j088J0315J3987M063r685r872J7136Q113J431o4j4877l152J9050M530
8692F0548m200L295K5596K3568L3653M0978N514M138k497j0455j7611l6138k3005
8679A03384k1029j3208k032j1859j9244j0527j4956j2934J9745J1090j2014r316
$$ plain form
8667 7100 11827 6354 -4706 -29589 -38747 -28552 -10714 -3277 -6871 -6423 5941 15577 17641 19374
8653 19374 20116 23543 21756 19214 21539 29794 33521 35331 29979 1957 -3283 18719 41740 50655
8639 50655 59440 55849 47471 26681 8059 3787 6473 7038 11167 12410 14516 12911 19471 23859
8625 23859 4578 5890 12262 13787 13508 7278 8782 19319 31080 37274 36163 29646 13662 12384
8611 12384 21109 32881 34839 33293 45678 58638 68667 80202 83291 70106 57382 60828 62151
8598 62151 38810 23729 8655 4464 14308 16362 6836 4480 7358 7093 11705 6909 2772 3901
8584 3901 10675 31696 42247 29319 18648 14081 20217 27750 21715 18762 25944 39004 48469 62542
8570 62542 68711 70830 58463 49352 55683 64726 70439 55744 28466 29834 44344 46924 26516
$$ packed form
8667G100M727n473j1060k4883r158J0195J7838P437l594M48J2364R636K064J733
8653A9374P42L427j787k542K325Q255L727J810n352k8022n240K2002K3021Q915
8639E0655Q785l591q378k0790j8622m272K686N65M129J243K106j605O560M388
8625B3859j9281J312O372J525k79o230J504J0537J1761O194j111o517j5984j278
8611A2384Q725J1772J958j546J2385J2960J0029J1535L089j3185j2724L446J323
8598F2151k3341j5081j5074m191R844K054r526k356K878k65M612m796m137J129
8584C901O774K1021J0551j2928j0671m567O136P533o035k953P182J3060R465J4073
8570F2542O169K119j2367r111O331R043N713j4695k7278J368J4510K580k0408
$$ plain form
8557 26516 18201 50777 85004 73560 42966 40193 39043 29266 35840 21457 7055 4151 5029
8544 5029 7964 16694 24907 18093 19817 10707 -6243 7594 23951 20203 21245 6146 14115 13484
8530 13484 10624 26544 24982 30258 25020 8510 4801 15626 23843 19735 22613 26067 20215 22355
8516 22355 20096 26151 17521 989 7205 28849 21871 10159 5992 3472 3692 -5462 -2685 -3584
8502 -3584 13509 15347 8506 -3026 -17722 -23695 -23247 -11367 13021 16813 32045 45267 54392
8489 54392 63751 54721 52135 53902 56855 58286 50781 32210 41591 46781 32160 22577 35212 37376
8475 37376 31050 20338 16222 20196 20482 21637 23615 28047 31504 28316 18191 12559 15749 30974
8461 30974 32233 32828 30287 18969 28306 44328 48852 41194 24359 18148 46740 57062 63482 71510
$$ packed form
8557B6516q315L2576L4227j1444l0594k773j150r777O574j4383j4402k904Q78
8544E029K935Q730Q213o814J724r110j6950J3837J6357l748J042j5099P969o31
8530A3484k860J5920j562N276n238j6510l709J0825Q217m108K878L454n852K140
8516B2355k259O055q630j6532O216K1644o978j1712m167k520K20r154K777q99
8502c584J7093J838o841j1532j4696n973M48J1880K4388L792J5232J3222R125
8489E4392R359r030k586J767K953J431p505j8571R381N190j4621r583J2635K164
8475C7376o326j0712m116L974K86J155J978M432L457l188j0125n632L190J5225
8461C0974J259N95k541j1318R337J6022M524p658j6835o211K8592J0322O420Q028
$$ plain form
8447 71510 58152 60764 43684 40684 52381 43809 39701 33322 20900 4307 -17934 -19036 -1347
8434 -1347 12633 4434 12128 30588 45252 43813 31601 17000 20522 21491 11224 3309 2110 8182
8420 8182 14641 18097 21874 28049 29805 24279 15104 17194 38905 36294 29544 34758 28997 15572
8406 15572 12582 -1636 -19672 -18723 -5243 -2490 -6503 -5413 -9208 -15086 2381 8506 -589 1887
8392 1887 -874 -828 9257 13528 10315 15473 6833 14942 35050 25822 14827 -203 252 8005 11333
8377 11333 24395 12211 476 -6742 12239 20492 19659 14010 9495 10763 2252 -7815 4082
8364 4082 -1099 -9486 -15678 -7842 2116 1570 2525 -11462 -18920 -26284 -33323 -24740 -17580 -709 -5890
8349 -5890 -6180 -3779 -10864 -15993 -7216 12361 11535 9366 7181 -5625 2291 13330 5968 -405 -3688
$$ packed form
8447G1510j3358K612j7080l000J1697q572m108o379j2422j6593k2241j102J7689
8434a347J3980q199P694J8460J4664j439j2212j4601L522R69j0267p915j199O072
8420H182O459L456L777O175J756n526r175K090K1711k611o750N214n761j3425
8406A5572k990j4218j8036R49J3480K753m013J090l795n878J7467O125r095K476
8392A887k761M6J0085M271l213N158q640Q109K0108r228j0995j5030M55P753L328
8377A1333J3062j2184j1735p218J8981Q253q33n649m515J268q511j0067J1897
8364D082n181q387o192P836R958n46R55j3987p458p364p039Q583P160J6871n181
8349e890k90K401p085n129Q777J9577q26k169k185j2806P916J1039p362o373l283
$$ plain form
8334 -3688 3106 -9038 -20613 -25640 -29485 -27008 -9801 -10584 -20891 -10479 3365 965 -13639
8321 -13639 -25375 -7554 -3747 -10440 -18973 -29481 -27739 -13453 -9890 -18172 -16079 -1585 -1275 766
8307 766 -2621 3885 20791 29648 32252 21303 8419 -259 5987 17886 27118 11170 1428 3759
8293 3759 24084 23043 11069 -3490 -11802 5567 13454 18026 14842 1799 -15285 -7862 -1279
8280 -1279 8483 31112 38916 17437 -950 -2432 -10339 -11170 -1044 1227 -15467 -27881 -20932 -10802
8266 -10802 819 5119 522 7091 1946 -10274 -21729 -13740 -2975 -919 -9985 -14695 -13130 -15181
8252 -15181 -26333 -25329 -8396 12831 19232 1893 -9620 -204 -2517 -20842 -32372 -29409 -32925
8239 -32925 -31781 -22156 -25892 -25397 -16345 -10967 -16462 -2717 67 -6325 -10605 -6028 -4680 6289
$$ packed form
8334c688O794j2144j1575n027l845K477J7207p83j0307J0412J3844k400j4604
8321a3639j1736J7821L807o693q533j0508J742J4286L563q282K093J4494L10K041
8307G66l387O506J6906Q857K604j0949j2884q678O246J1899R232j5948r742K331
8293C759K0325j041j1974j4559q312J7369P887M572l184j3043j7084P423O583
8280a279R762K2629P804k1479j8387j482p907q31J0126K271j6694j2414O949J0130
8266a0802J1621M300m597O569n145j2220j1455P989J0765K056r066m710J565k051
8252a5181j1152J004J6933K1227O401j7339j1513R416k313j8325j1530K963l516
8239c2925J144R625l736M95R052N378n495J3745K784o392m280M577J348J0969
$$ plain form
8225 6289 3844 -3674 -7670 -9780 -57 11137 14842 13450 6177 -15 1985 -5259 1423 4371 6133
8210 6133 7141 -7515 4226 11029 21362 18489 9902 671 640 22939 13423 -2690 1416 5589
8196 5589 -10014 -14273 -16196 -11114 777 3089 1477 -1086 7443 14594 7024 -5941 6575 20674
8182 20674 19719 24177 37479 24146 12581 -7213 -34569 -36643 -25470 -16263 -12680 -17695 -13791
8169 -13791 -1980 1346 3753 -6242 -15985 -22874 -29241 -14308 -12788 -16081 -20537 -36554 -35449 -11302
8155 -11302 6384 1164 -5813 -4679 -21270 -15511 -4160 -5682 -14913 -17770 -2756 12271 11802 -6647
8141 -6647 -413 9567 15666 9008 6813 5984 4829 16188 12169 -10218 -25602 -11462 -15122 -11029
8127 -11029 -6471 -3020 3413 13741 20071 17628 6605 1073 2565 1612 -6578 -940 2483 -5222
$$ packed form
8225F289k445p518l996k110R723J1194L705j392p273o192K000p244O682K948J762
8210F133J008j4656J1741O803J0333k873q587r231l1K2299r516j6113M106M173
8196E589j5603m259j923N082J1891K312j612k563Q529P151p570j2965J2516J4099
8182B0674r55M458J3302j3333j1565j9794k7356k074J1173R207L583n015L904
8169a3791J1811L326K407r995r743o889o367J4933J520l293m456j6017J105K4147
8155a1302J7686n220o977J134j6591N759J1351j522r231k857J5014J5027m69j8449
8141f647O234R980O099o658k195q29j155J1359m019k2387j5384J4140l660M093
8127a1029M558L451O433J0328O330k443j1023n532J492r53q190N638L423p705
$$ plain form
8113 -5222 2266 -1328 -4532 2138 10535 -2318 -3940 -15903 -28026 -16896 -8611 -2901 -2839 -3224 2556
8098 2556 -7537 -17007 -21301 -707 6466 7859 -1829 -25323 -16406 615 1010 7148 3161 -619
8084 -619 -4621 -8966 -2233 -7031 -24068 -19373 -23450 -29668 -12425 671 -5328 8414 24836 42591
8070 42591 39725 33395 14351 4254 -4952 -3759 9728 30718 34651 39084 36211 29775 22631 16622
8056 16622 17084 10323 11860 9880 9538 8940 -1499 -15471 -4473 -8172 -4521 -6422 -10272 -8256 2366
8041 2366 19587 9426 926 -3163 -5852 -4675 -4582 -6962 22472 24696 7387 -1688 -2716 -1455
8027 -1455 3670 6742 17738 32427 16589 11667 6661 4794 9820 -1218 -4357 -3329 10110 17460
8013 17460 20617 15625 18229 12943 -1723 -3190 1059 4223 -3309 496 -588 -11837 -13938 1457
$$ packed form
8113e222P488l594l204O670Q397j2853j622j1963j2123J1130Q285N710O2l85N780
8098B556j0093r470m294K0594P173J393r688k3494Q917J7021L95O138l987l780
8084f19m002m345O733m798j7037M695m077o218J7243J3096n999J3742J6422J7755
8070D2591k866o330j9044j0097r206J193J3487K0990L933M433k873o436p144o009
8056A6622M62o761J537j980l42n98j0439j3972J0998l699L651j901l850K016J0622
8041B366J7221j0161q500m089k689J177R3k380K9434K224j7309r075j028J261
8027a455N125L072J0996J4689j5838m922n006j867N026j1038l139J028J3439P350
8013A7460L157m992K604n286j4666j467M249L164p532L805j084j1249k101J5395
$$ plain form
7999 1457 -14113 -15931 -12317 -8720 -2532 7227 7288 18182 19849 16419 6905 -7623 6167 16400
7985 16400 11842 677 1070 7421 -4472 -19487 -21539 -10352 -905 18717 26410 439 -18864
7972 -18864 -12184 -10506 -26077 -26700 -10680 1261 -1014 -7024 -4462 3211 11919 1826 2967 -8019
7958 -8019 -12150 -15545 -22633 -20205 -5216 -5214 108 10101 6842 -9175 -5645 -10416 -15827 -15731 -10255 -8868
7942 -8868 -9821 -6097 -2244 -2152 -10153 -23246 -29632 -37260 -21631 -8933 -5053 -1000 -474 7443 14494
7927 14494 20137 31377 32101 24386 15825 3830 1812 -5410 -7550 -1655 -392 18119 22852 11271
7913 11271 5447 7445 -3429 -14729 -10123 -5205 -10006 -15861 -36246 -49393 -32885 -20553 -30953
7900 -30953 -36157 -40657 -38105 -29531 -20330 -19115 -17626 -2132 6044 1990 4219 -13687 -27476 -23864
$$ packed form
7999A457j5570j818L614L597O188R759O1J0894J667l430r514j4528J3790J0233
7985A6400m558j1165L93O351j1893j5015k052J1187R447J9622P693k5971j9303
7972a8864O680J678j5571o23J6020J1941k275o010K562P673Q708j0093J141j0986
7958h019m131l395p088K428J4989KN322R993l259j6017L530m771n411R6N476J387
7942h868r53L724L853R2q001j3093o386p628J5629J2698L880M053N26P917P051
7927A4494N643J1240P24p715q561j1995k018p222k140N895J263J8511M733j1581
7913A1271n824J998j0874j1300M606M918m801n855k0385j3147J6508J2332j0400
7900c0953n204m500K552Q574R201J215J489J5494Q176m054K229j7906j3789L612
$$ plain form
7886 -23864 -16906 -11613 -15122 2777 1418 5096 26169 23398 6915 -6478 -7405 9631 20487
7873 20487 5799 -9134 137 3597 587 6309 1537 -1402 -1414 -882 7021 12269 5693 -1440 459
7858 459 -216 2441 12096 7759 6158 -16682 -13083 -5092 -11020 -30471 -16989 -8233 -23091 -25399
7844 -25399 -8144 -12178 -17388 -4564 19552 20884 20474 20382 13254 9206 10362 11668 1578 -9790
7830 -9790 -8434 -18252 -9786 10890 14899 19672 17857 3653 4487 -16815 -38021 -31880 -40356 -28338
7816 -28338 -7141 2754 8418 10497 3331 -10575 -22225 -17463 -24071 -25100 -24905 -25357 -2575 9267
7802 9267 7489 1074 -20098 -29495 -41528 -34654 -11285 5128 -6079 -19077 -8974 -2071 -14438
7789 -14438 -5049 -8341 -13406 -13270 -15075 -11339 -5629 -18298 -22996 -18415 -5314 -2166 -1859 -338 -18356
$$ packed form
7886b3864O958N293l509J7899j359L678K1073k771j6483j3393r27J7036J0856
7873B0487j4688j4933R271L460l010N722m772k939j2N32P903N248o576p133J899
7858D59o75K657R655m337j601k2840L599P991n928j9451J3482Q756j4858k308
7844b5399J7255m034n210J2824K4116J332m10r2p128m048J156J306j0090j1368
7830i790J356r818Q466K0676M009M773j815j4204Q34k1302k1206O141q476J2018
7816b8338K1197R895N664K079p166j3906j1650M762o608j029J95m52K2782J1842
7802I267j778o415k1172r397j2033O874K3369J6413j1207j2998J0103O903j2367
7789a4438R389l292n065J36j805L736N710j2669m698M581J3101L148L07J521j8018
$$ plain form
7774 -18356 -25002 -30387 -27832 -10337 -2140 10711 -1639 -13574 -4447 743 -13858 -22870 -10252
7761 -10252 -8855 -17639 -25213 -13897 3692 -6487 -9667 -9615 -19307 -17343 -9839 -13776 -18988 -17505
7747 -17505 -20544 -20391 -8616 11161 7808 -2483 10203 4551 -8847 -4251 -4046 -2982 -12829 -23821
7733 -23821 -31134 -31164 -17338 -2515 1746 -6866 -3431 -13448 -3120 9663 13045 1395 -19707
7720 -19707 -27154 -14217 -4250 5976 -927 3960 -80 -7662 -1992 -5681 1816 5297 10401 -10242
7706 -10242 -26124 -20420 -10361 3914 1254 -14109 -4237 -7294 -14332 -10368 7948 10529 7236
7693 7236 -10537 -16013 -16118 -28754 -44096 -37480 -30254 -31628 -38344 -44473 -27685 -19294 -20953 -7242
7679 -7242 5921 5596 -7088 -19082 -14876 -21293 -16633 -21278 -35555 -29502 -12588 -11302 -3992 -3361
$$ packed form
7774a8356o646n385K555J7495Q197J2851j2350j1935R127N190j4601r012J2618
7761a0252J397q784p574J1316J7589j0179l180N2r692J964P504l937n212J483
7747a7505l039J53J1775J9777l353j0291J2686n652j3398M596K05J064r847j0992
7733b3821p313l0J3826J4823M261q612L435j0017J0328J2783L382j1650k1102
7720a9707p447J2937R967J0226o903M887m040p582N670l689P497L481N104k0643
7706a0242j5882N704J0059J4275k660j5363R872l057p038L964J8316K581l293
7693G236j7773n476j05j2636j5342O616P226j374o716o129J6788Q391j659J3711
7679g242J3163l25j2684j1994M206o417M660m645j4277O053J6914J286P310O31
$$ plain form
7665 -3361 -6963 -20946 -29464 -21259 -15406 -23104 -36706 -39627 -39729 -36721 -29085 -10260 5242 -4142
7651 -4142 -10219 -16465 -20652 -11733 -783 1594 -2474 -1419 686 -1047 11357 12128 5456 -2423 4996
7636 4996 -226 -16102 -14672 -22503 -31521 -23978 -8062 -10502 -14575 -20246 -20226 -8703 -6019 -9515 -7906
7621 -7906 -7638 -14817 -11148 4661 19850 11362 10322 -3882 -4742 -14903 -13625 -5843 -8587 8111
7607 8111 10350 7044 -3134 -11611 -15135 -10267 3972 11211 11719 8812 -8149 -11096 -13221 -16976
7593 -16976 -23875 -22232 -31616 -28097 -30899 -16890 -10956 -18513 -19096 -130 -5959 -22215 -20368 -15517
7579 -15517 -18339 -24279 -23769 -24297 -22284 -13914 229 1731 4534 -6640 -12518 -12307 -12499 -5071 -6008
7564 -6008 -14789 -18342 -11835 -11098 -5202 3858 -14838 -28981 -25787 -24300 -30072 -41445 -47729 -44804
$$ packed form
7665c361l602j3983q518Q205N853p698j3602k921j02L008P636J8825J5502r384
7651d142o077o246m187Q919J0950K377m068J055K105j733J2404P71o672p879P419
7636D996n222j5876J430p831r018P543J5916k440m073n671K0J1523K684l496J609
7621g906K68p179L669J5809J5189q488j040j4204q60j0161J278P782k744J6698
7607H111K239l306j0178q477l524M868J4239P239N08k907j6961k947k125l755
7593a6976o899J643r384L519k802J4009N934p557n83J8966n829j6256J847M851
7579a5517k822n940N10n28K013Q370J4143J502K803j1174n878K11j92P428r37
7564f008q781l553O507P37N896R060j8696j4143L194J487n772j1373o284K925
$$ plain form
7550 -44804 -26992 -10641 9156 9746 -957 7674 11562 12084 6253 -13769 -19001 -15812 -2812 -43
7536 -43 4106 780 -11000 -19479 -19198 -12178 -20262 -23373 -24722 -18690 -20097 -23179 -25295 -14214 1826
7521 1826 -5583 -9968 -18032 -23001 -20312 -17297 -21647 -25652 -14720 -5287 -2264 4141 12425 18595 15481
7506 15481 1523 -6507 -7999 -14729 -20598 -20830 -4209 4107 -4138 2699 8134 11040 15176 14743 6054
7491 6054 590 -3218 4417 12720 6599 -9240 -7207 2934 325 2761 9466 8998 6713 4672 -8455
7476 -8455 4233 22444 20753 15257 6007 12432 4363 -2288 -5806 2072 1291 61 -10409 -4196
7462 -4196 -4877 -7938 -13583 -23005 -17011 -5788 7374 2860 1228 19732 7944 9560 4192 -14335
7448 -14335 -27660 -27193 -27882 -26317 -25791 -21948 -44984 -56544 -36878 -12866 -10971 -27895 -42203 -39357
$$ packed form
7550d4804J7812J6351J9797N90j0703Q631L888N22n831k0022n232L189J3000K769
7536d3M149l326j1780q479K81P020q084l111j349O032j407l082k116J1081J6040
7521A826p409m385q064m969K689L015m350m005J0932R433L023O405Q284O170l114
7506A5481j3958q030j492o730n869k32J6621Q316q245O837N435K906M136m33q689
7491F054n464l808P635Q303o121j5839K033J0141k609K436O705m68k285k041j3127
7476h455J2688J8211j691n496r250O425q069o651l518P878p81j230j0470O213
7462d196o81l061n645r422N994J1223J3162m514j632J8504j1788J616n368j8527
7448a4335j3325M67o89J565N26L843k3036j1560J9666K4012J895j6924j4308K846
$$ plain form
7434 -39357 -19038 -11416 -4352 -5011 -6273 3120 -1512 -8387 -7720 -12567 -22398 -27299 -24802 -17207 -5422
7419 -5422 -1626 -9815 -15382 -1914 562 5090 7927 -3880 -12774 -17671 -9151 7566 2965 -1684
7405 -1684 -10648 -17736 -21250 -16612 -13033 -724 -2184 5804 -9540 -24340 -19601 -4942 4857 -3902
7391 -3902 -4626 -5950 -4993 3549 1187 -2731 -7259 2202 4463 -411 -1363 -9677 -5705 17562 32752
7376 32752 20553 8822 14913 17992 29125 35200 34731 25344 11260 8803 15478 15224 -575 -25649
7362 -25649 -36870 -35020 -28481 -5381 5430 7875 19396 22924 9735 4891 -12158 2064 22876
7349 22876 13776 1474 -6653 -21620 -22421 -17479 -16771 -4919 -101 -1292 -18189 -22803 -8950 -7010
7335 -7010 -14937 -11715 1540 11230 16038 17499 -6085 -20739 -38686 -42258 -21799 -21078 -39359 -39118
$$ packed form
7434c9357K0319P622P064o59j262R393m632o875O67m847r831m901K497P595J1785
7419e422L796q189n567J3468K476M528K837j1807q894m897Q520J6717m601m649
7405a684q964p088l514M638L579J2309j460P988j5344j4800M739J4659R799q759
7391c902p24j324R57Q542k362l918m528R461K261m874r52q314L972K3267J5190
7376C2752j2199j1731O091L079J1133O075m69r387j4084k457O675k54j5799k5074
7362b5649j1221J850O539K3100J0811K445J1521L528j3189m844j7049J4222K0812
7349B2876r100j2302q127j4967q01M942P08J1852M818j191j6897m614J3853J940
7335g010p927L222J3255R690M808J461k3584j4654j7947l572K0459P21j8281K41
$$ plain form
7321 -39118 -45514 -43399 -37890 -42042 -22545 -7111 -13750 -28861 -30173 -12021 -1558 1947 -16500
7308 -16500 -36397 -26822 -12803 -16976 -16207 -9660 -2568 -9371 -9895 -12907 -10779 -6777 -3479 -3667 -6139
7293 -6139 -12405 -10075 -11982 -18712 -26213 -45848 -56683 -33954 -27989 -21829 -17038 -20957 -12684 -21816
7279 -21816 -23797 -15253 -12951 -19568 -14868 -17120 -12352 -11455 -17379 -31235 -29372 -8160 7033 -681
7265 -681 -15035 -26341 -27836 -11633 -18256 -15675 -7288 -2182 -4364 2219 5822 14507 16962 9363
7251 9363 1349 -4047 -9262 -3692 1074 -5543 -11204 -18642 -26724 -38528 -36461 -34318 -24212 -26335
7237 -26335 -10131 -1602 -5337 -1197 12241 13060 18492 15024 -6689 -16994 -3970 -9176 -9717 -6936
7223 -6936 -8145 -4538 -11569 -31685 -43099 -18803 -1914 -4734 -9419 -13815 -14177 -3709 -6386 -20322
$$ packed form
7321c9118o396K115N509m152J9497J5434o639j5111j312J8152J0463L505j8447
7308a6500j9897R575J4019m173P69O547P092o803n24l012K128M002L298j88k472
7293f139o266K330j907o730p501j9635j0835K2729N965O160M791l919Q273r132
7279b1816j981Q544K302o617M700k252M768Q97n924j3856J863K1212J5193p714
7265f81j4354j1306j495J6203o623K581Q387N106k182O583L603Q685K455p599
7251I363q014n396n215N570M766o617n661p438q082j1804K067K143J0106k123
7237b6335J6204Q529l735M140J3438Q19N432l468k1713j0305J3024n206n41K781
7223f936j209L607p031k0116j1414K4296J6889k820m685m396l62J0468k677j3936
$$ plain form
7209 -20322 -34988 -34710 -18574 -5551 -8004 -16181 -3892 4328 -5166 -6471 -6733 -18093 -30944 -39405
7195 -39405 -38054 -29864 -6657 6981 3476 -1584 -3007 8582 -590 -24918 -23969 -10474 -20129 -20702
7181 -20702 -26525 -19660 7057 22562 23165 -5182 -19754 -18140 -14089 3708 8345 2291 -16709
7168 -16709 -27266 -20385 -23685 -30358 -22187 -9380 -10146 -24481 -18372 -1772 -7033 -8353 -12104 -13323
7154 -13323 -29005 -27395 -21783 -37744 -28951 -4079 -2470 -19001 -19746 -18789 -10559 11394 5605 -824
7140 -824 -3064 -23909 -33385 -31136 -30411 -22133 -16416 -26250 -19761 -7254 -6448 -11444 -10625 -5602 4092
7125 4092 8686 2864 12704 18223 5948 7471 4546 -7470 -14992 -17053 -16947 -7394 -8212 -11078 -20916
7110 -20916 -25491 -25547 -16968 -4435 -4534 -17350 -15114 -12635 -16213 -31189 -26494 -20604 -18846 -32385 -31326
$$ packed form
7209b0322j4666K78J6136J3023k453q177J2289Q220r494j305k62j1360j2851q461
7195c9405J351Q190K3207J3638l505n060j423J1589r172k4328R49J3495r655n73
7181b0702n823O865K6717J5505O03k8347j4572J614M051J7797M637o054j9000
7168a6709j0557O881l300o673Q171J2807p66j4335O109J6600n261j320l751j219
7154a3323j5682J610N612j5961Q793K4872J609j6531p45R57Q230K1953n789o429
7140h24k240k0845r476K249P25Q278N717r834O489J2507Q06m996Q19N023R694
7125D092M594n822R840N519j2275J523k925j2016p522k061J06R553q18k866r838
7110b0916m575n6Q579J2533r9j2816K236K479l578j4976M695N890J758j3539J059
$$ plain form
7095 -31326 -17563 -24899 -32047 -28310 -20684 -20083 -22779 -43642 -56104 -33769 -17856 -11613 -23455
7082 -23455 -30759 -16403 -7226 -21117 -18042 -11125 -8143 5537 18267 3569 896 2184 -5097
7069 -5097 -11985 -15795 -28661 -24424 -8025 -8510 -11738 -19107 -17577 -11752 -9480 -12211 -17779 -18343 -4936
7054 -4936 -9633 -26003 -46236 -57481 -50401 -34479 -12804 -8890 -11174 -11467 -2690 4350 8045 -194
7040 -194 -4890 -4339 3255 1882 500 -2100 -22202 -21993 -15558 -1072 11072 -5438 -13593 -15506 -5460
7025 -5460 -11951 -21798 -11090 4348 6045 13493 9776 288 -16763 -26686 -23446 -26171 -27657 -22666
7011 -22666 -15949 -7238 4421 -3870 -17868 -22597 -13905 -22378 -22846 -15895 -7446 6126 3692 8981
6997 8981 12028 5609 4800 -4184 -4199 -6897 -34454 -35171 -21941 -14632 -16587 -25367 -27381 -10415 325
$$ packed form
7095c1326J3763p336p148L737P626O01k696k0863j2462K2335J5913O243j1842
7082b3455p304J4356R177j3891L075O917K982J3680J2730j4698k673J288p281
7069e097o888l810j2866M237J6399m85l228p369J530N825K272k731n568n64J3407
7054d936m697j6370k0233j1245P080J5922K1675L914k284k93Q777P040L695q239
7040a94m696N51P594j373j382k600k0102K09O435J4486J2144j6510q155j913J0046
7025e460o491r847J0708J5438J697P448l717r488j7051r923L240k725j486M991
7011b2666O717Q711J1659q291j3998m729Q692q473m68O951Q449J3572k434N289
6997H981L047o419q09q984j5k698k7557p17J3230P309j955q780k014J6966J0740
$$ plain form
6982 325 6348 17210 6694 -4330 -1699 -1803 -6422 10010 12525 166 -28532 -31063 -8747 -1151
6968 -1151 9046 18854 10555 -574 -14669 -19963 -19953 -11379 -13919 -24966 -10545 -2888 -8100 -9487
6954 -9487 -1348 -1613 -14253 2587 4334 4180 -1663 -9976 -24927 -27084 -8922 -13006 -19489 -21999
6940 -21999 -14518 -1036 -9929 -16468 -22847 -19863 -4688 5872 7914 11734 11232 6384 -16370 -35678
6926 -35678 -33981 -28721 -10505 2032 -7271 -11675 -10945 -16436 -19055 -18573 -10189 1102 4821 -4362
6912 -4362 -3250 1761 11045 -4771 -16587 -22575 -13761 -9266 -12927 -1799 -1465 -8176 -7496 -12352 -1061
6897 -1061 23352 21748 27866 26371 14228 6488 7511 8603 -9823 -22129 -18522 -2348 -5557 -25092
6883 -25092 -22687 -15642 -13405 4548 5604 6497 3962 -5004 -23713 -32725 -29891 -41818 -42879 -34844
$$ packed form
6982C25O023J0862j0516j1024K631j04m619J6432K515j2359k8698k531K2316P596
6968a151J0197R808q299j1129j4095n294J0Q574k540j1047J4421P657n212j387
6954i487Q139k65j2640J6840J747j54n843q313j4951k157J8162m084o483k510
6940b1999P481J3482q893o539o379K984J5175J0560K042L820n02m848k2754j9308
6926c5678J697N260J8216J2537r303m404P30n491k619M82Q384J1291L719r183
6912d362J112N011R284j5816j1816n988Q814M495l661J1128L34o711O80m856J1291
6897a061K4413j604O118j495j2143p740J023J092j8426j2306L607J6174l209j9535
6883b5092K405P045K237J7953J056Q93k535q966j8709r012K834j1927j061Q035
$$ plain form
6869 -34844 -27015 -26348 -29549 -17333 -22315 -29443 -26153 -29680 -16942 680 5713 -1447 3474 908
6855 908 -14557 -23187 -25096 -20067 -21999 -20174 -15590 -10068 2131 -301 -1893 -5628 -9381 -20549
6841 -20549 -28629 -23975 -10662 -6778 -3596 -1141 7823 -671 -4288 -14222 -8714 10324 15673 17797
6827 17797 9012 -8144 -12337 -6915 3461 2125 -7131 -9753 -16624 -5704 -8431 -4759 -15625 -13040
6813 -13040 424 4162 3067 8712 6086 497 6491 10740 5990 1692 1674 2221 2882 -12389 -9736
6798 -9736 -11123 1262 8681 -1797 -6788 -19233 -14717 -23288 -14683 -7675 -11786 -1392 4796 -1803
6784 -1803 -3178 -4646 -15930 -14880 -13891 -12609 1069 15416 -1957 -11459 -19454 -10649 -3649 -9400
6770 -9400 -6717 -4658 -4819 -8414 -14679 -15079 -12621 -14523 -22655 -8797 -7230 -12371 -14479 -18717 -1360
$$ packed form
6869c4844P829O67l201J2216m982p128L290l527J2738J7622N033p160M921k566
6855I08j5465q630j909N029j932J825M584N522J2199k432j592l735l753j1168
6841b0549q080M654J3313L884L182K455Q964q494l617r934N508J9038N349K124
6827A7797q785j7156m193N422J0376j336r256k622o871J0920k727L672j0866K585
6813a3040J3464L738j095N645k626n589N994M249m750m298j8N47O61j5271K653
6798i736j387J2385P419j0478m991j2445M516q571Q605P008m111J0394O188o599
6784a803j375j468j1284J050R89J282J3678J4347j7373r502p995Q805P000n751
6770i400K683K059j61l595o265m00K458j902q132J3858J567n141k108m238J7357
$$ plain form
6755 -1360 1433 -4280 -9860 -14114 -13969 -11805 -5314 -16086 -27864 -14613 -6375 -5413 2634 1796 -14361
6740 -14361 -24801 -19112 5654 13897 -7017 -30033 -32830 -27433 -13590 -10207 -10713 -1461 -3919 5055
6726 5055 17490 9142 10266 7204 -5440 -18678 -17582 -8122 -4450 -15693 -19420 -10853 -20744 -23588
6712 -23588 -23996 -32918 -32973 -24301 -1045 4853 7263 -430 8498 15634 21447 15296 7360 7108 7972 6243
6696 6243 -3397 -10699 -24098 -28971 -13188 2154 11204 11571 -5049 -16290 -10915 -12410 4169 8170
6682 8170 3401 3584 -1594 7675 12697 12212 18273 26765 19833 17550 23365 25937 21964 2403 -560
6667 -560 -1334 2998 5974 -10189 -9231 -3978 15856 21668 11219 -3367 -19775 -18263 -21299 -31177
6653 -31177 -35500 -25381 -16005 -9831 -10482 -3955 14715 23239 17471 18544 13070 2988 13969 7969
$$ packed form
6755a360K793n713n580m254J45K164O491j0772j1778J3251Q238R62Q047q38j6157
6740a4361j0440N689K4766Q243k0914k3016k797N397J3843L383n06R252k458Q974
6726E055J2435q348J124l062j2644j3238J096R460L672j1243l727Q567r891k844
6712b3588m08q922n5Q672K3256N898K410p693Q928P136N813o151p936k52Q64j729
6696F243r640p302j3399m873J5783J5342R050L67j6620j1241N375j495J6579M001
6682H170m769J83n178R269N022m85O061Q492o932k283N815K572l973j9561k963
6667e60p74M332K976j6163R58N253J9834N812j0449j4586j6408J512l036r878
6653c1177m323J0119R376O174o51O527J8670Q524n768J073n474j0082J0981o000
$$ plain form
6639 7969 -359 9784 11626 5707 14282 17320 15467 20551 12607 3619 -534 -9222 1984 19806
6625 19806 25277 27200 12800 3931 -14773 -1384 4185 3880 -81 1370 11438 16681 295 -14543
6611 -14543 -16610 -10312 3255 -7349 -426 3409 4151 1536 3602 10186 10661 13004 -6722 -13391
6597 -13391 -2441 -8178 -715 -1854 -12483 -9528 -4639 561 -1328 -12151 -11279 -2737 21670 18400
6583 18400 -10199 -19624 -2166 10555 -9742 -12202 -1865 2335 3090 2730 -7171 -11044 -8983 -974
6569 -974 6844 -9194 6044 25486 17662 4072 -1209 -3568 6850 62 -15538 -27702 -34712
6556 -34712 -13840 -4481 4153 -25481 -49262 -27754 413 -5818 -22876 -14006 -8724 3223 9313
6543 9313 10180 7347 1415 -13714 -14676 -6109 9914 -1390 -12082 -9141 -12687 730 -6016 -3287
$$ packed form
6639G969q328J0143J842n919Q575L038j853N084p944q988m153q688J1206J7822
6625A9806N471J923j4400q869j8704J3389N569l05l961J451J0068N243j6386j4838
6611a4543k067O298J3567j0604O923L835P42k615K066O584M75K343j9726o669
6597a3391J0950n737P463j139j0629K955M889N200j889j0823Q72Q542K4407l270
6583A8400k8599r425J7458J2721k0297k460J0337M200P55l60r901l873K061Q009
6569i74P818j6038J5238J9442p824j3590n281k359J0418o788j5600j2164p010
6556c4712K0872R359Q634k9634k3781K1508K8167o231j7058Q870N282J1947O090
6543I313Q67k833n932j5129r62Q567J6023j1304j0692K941l546J3417o746K729
$$ plain form
6529 -3287 1988 -6067 -4079 5671 1731 2861 19780 16846 6698 1765 -335 -1545 -13791 -26296
6515 -26296 -29993 -32929 -37511 -22409 -1931 -9566 -11761 -5841 7182 17633 -2149 -19841 -20944
6502 -20944 -8193 938 12888 11503 -5436 -9251 1668 18849 28890 11119 -3320 -15945
6490 -15945 -22663 -25559 -24932 -27907 -18764 -9998 12818 7593 13652 11601 -1380 4251 2060 10597
6476 10597 13518 12957 13462 15566 9363 28449 33373 17365 -3692 -16917 -9191 -11317 -10789 -3087
6462 -3087 -1648 3992 -6646 -22270 -7402 -9126 1757 6417 7901 9127 10342 7748 -3161 -4021
6448 -4021 -1031 -8906 -11327 -13592 -11197 -8554 -17952 -1193 5550 -2913 -20705 -26055 -10607 3251
6434 3251 563 5710 6521 8131 402 -11513 -16496 -7486 5785 10086 13946 21771 13485 1199
$$ packed form
6529c287N275q055J988R750l940J130J6919k934j0148m933k100j210j2246j2505
6515b6296l697k936m582J5102K0478p635k195N920J3023J0451j9782j7692j103
6502b0944J2751R131J1950j385j6939l815J0919J7181J0041j7771j4439j2625
6490a5945o718k896O27k975R143Q766K2816n225O059k051j2981N631k191Q537
6476A0597K921n61N05K104o203J9086M924j6008k1057j3225P726k126N28P702
6462c087J439N640j0638j5624J4868j724J0883M660J484J226J215k594j0909q60
6448d021K990p875k421k265K395K643r398J6759O743q463j7792n350J5448J3858
6434C251k688N147Q11J610p729j1915m983R010J3271M301L860P825q286j2286
$$ plain form
6420 1199 3634 -1174 -543 1860 21830 14014 -5486 -6251 1703 4559 5463 -9089 -10281 -4795 2577
6405 2577 -2579 -20046 -35451 -24413 -16098 -22676 -23688 -12597 -7793 3488 3309 -450 7262 10182
6391 10182 -1084 -12592 -17122 -16103 -15929 -21518 -23539 -11332 -6983 2248 -3811 -9874 -2198 8663
6377 8663 12693 13849 10416 -193 4555 3335 6673 11663 2418 -5083 -5051 16584 12665 559 7300
6362 7300 10196 -16885 -27805 -18868 -11733 -4451 -4837 -10857 -1933 1114 -9950 -26338 -21840 -13942
6348 -13942 7 14915 5246 -7832 -4807 -7352 -4513 -4608 2853 166 2774 3280 254 -5672 -3460
6333 -3460 -6177 -6880 -14849 741 9764 4144 -5224 -4486 -3049 2830 -3584 -1734 -9403 -7746 5129
6318 5129 2615 -13104 -27400 -19800 -9436 -15647 -33026 -42781 -37169 -36652 -16024 -15612 -11786 -9969
$$ packed form
6420A199K435m808O31K403J9970p816j9500p65P954K856R04j4552j192N486P372
6405B577n156j7467j5405J1038Q315o578j012J1091M804J1281j79l759P712K920
6391A0182j1266j1508m530J019J74n589k021J2207M349R231o059o063P676J0861
6377H663M030J156l433j0609M748j220L338M990r245p501L2K1635l919j2106O741
6362G300K896k7081j0920Q937P135P282l86o020Q924L047j1064j6388M498P898
6348a3942J3949J4908r669j3078L025k545K839r5P461k687K608N06l026n926K212
6333c460k717p03p969J5590R023n620r368P38J437N879o414J850p669J657J2875
6318E129k514j5719j4296P600J0364o211j7379r755N612N17K0628M12L826J817
$$ plain form
6304 -9969 -19958 -39304 -38634 -35250 -27598 -17343 -5668 470 -13051 -17177 -16976 -4429 4762 2215
6290 2215 2959 -11105 -2744 1816 -9169 -9739 -12212 -6132 2226 -2312 3017 3632 5257 -4065 -11630
6275 -11630 -195 9740 7266 -446 -10117 4499 6583 -13104 -14193 -7385 4650 5783 -9064
6262 -9064 -3857 -669 6416 2637 1384 12313 21465 6821 -15649 -13272 -2923 -20298 -33423
6249 -33423 -36366 -28891 -24572 -26907 -17269 -9075 -12868 -13745 5412 -6711 -3798 -10594 -10159 -6346 -15533
6234 -15533 -9899 -14345 -21334 -19207 622 18386 2716 -15397 -15189 -19597 -34648 -30474 -17408
6221 -17408 -14014 -5142 -3784 -12747 -1704 7036 18714 23147 33097 22692 13405 4174 3892 7126
6207 7126 7889 6810 23240 48715 53081 29944 33946 30903 39400 37554 19674 -5859 7584 23171
$$ packed form
6304i969r989j9346O70L384P652J0255J1675O138j3521m126K01J2547R191k547
6290B215P44j4064Q361M560j0985n70k473O080Q358m538N329O15J625r322p565
6275a1630J1435R935k474p712r671J4616K084j9687j089O808J2035J133j4847
6262i064N207L188P085l779j253J0929R152j4644k2470K377J0349j7375j3125
6249c3423k943P475M319k335R638Q194l793q77J9157j2123K913o796M35L813r187
6234a5533N634m446o989K127J9829J7764j5670j8113K08m408j5051M174J3066
6221a7408L394Q872J358q963J1043Q740J1678M433R950j0405r287r231k82L234
6207G126P63j079J6430K5475M366k3137M002l043Q497j846j7880k5533J3443J5587
$$ plain form
6193 23171 11677 -4317 -3561 -500 4469 -1901 -10562 -6533 -19998 -32140 -32735 -22631 -11407 -8564
6179 -8564 -23456 -17830 -11557 1867 3721 11892 10724 3076 -1545 -8161 -4489 670 -19397 -12258
6165 -12258 -9161 -23431 -26480 -16815 -10395 -14086 3616 20500 15077 9934 15282 -5674 -8522 -14743
6151 -14743 -13986 -2302 -2383 -3740 -183 -11204 -17658 2838 -1978 -417 -4216 685 1839 37 -596
6136 -596 -6431 -302 5616 15912 23018 21608 6449 -648 -18972 -21249 -21801 -31442 -36857 -28376 -20243
6121 -20243 -10011 -7823 -1100 -8674 -17278 -13977 -8112 -13128 -26891 -18381 -16055 -18591 -14038 -22619
6107 -22619 -16879 1351 4970 549 -9026 -6133 3210 15729 16483 10923 11504 19344 22097 10726
6093 10726 -828 -4182 -13213 -2564 4473 -5252 -14099 -28873 -12726 -2424 -18183 -24458 -10070
$$ packed form
6193B3171j1494j5994P56L061M969o370q661M029j3465j2142n95J0104J1224K843
6179h564j4892N626O273J3424J854Q171j168p648m621o616L672N159k0067P139
6165a2258L097j4270l049R665O420l691J7702J6884n423n143N348k0956k848o221
6151a4743P57J1684q1j357L557j1021o454K0496m816J561l799M901J154j802o33
6136e96n835O129N918J0296P106j410j5159p097j8324k277n52r641n415Q481Q133
6121b0243J0232K188O723p574q604L301N865n016j3763Q510K326k536M553q581
6107b2619N740J8230L619m421r575K893R343J2519P54n560N81P840K753j1371
6093A0726j1554l354r031J0649P037r725q847j4774J6147J0302j5759o275J4388
$$ plain form
6080 -10070 -4189 -6738 -13268 2728 15780 7619 7447 -17 -6975 -7090 -16555 -33573 -28546 -16780
6066 -16780 -9322 -18217 53 23819 31450 26168 16263 2326 -3461 3812 3608 10942 4880 1254
6052 1254 -3557 -15715 -12007 -8487 3801 1648 -5496 -27510 -18048 -9399 -576 -20093 -13860 -19364
6038 -19364 -14877 -23929 -21262 -5045 -5457 -13420 -13854 -12221 -12904 -4363 5245 -4338 -8099 -7682 -400
6023 -400 6659 10512 11836 -6699 -5566 -5825 9693 -2488 -7719 -9826 -8021 -23977 -26764 -23539
6009 -23539 -22128 -33247 -16509 8531 16076 6717 13380 -6 -12415 -7252 -12932 -11653 8699
5996 8699 5267 5511 -12196 -7707 3771 24028 18527 8054 5882 -6655 -8686 -11462 -15142 -7600
5982 -7600 -18487 -35417 -39383 -32924 -26808 -25293 -24550 -24700 -26832 -22513 -30728 -19013 -4395 12242
$$ packed form
6080a0070N881k549o530J5996J3052q161j72p464o958j15r465j7018N027J1766
6066a6780P458q895J8270K3766P631n282r905j3937n787P273k04P334o062l626
6052A254m811j2158L708L520J2288k153p144k2014R462Q649Q823j9517O233n504
6038a9364M487r052K667J6217m12p963m34J633o83Q541R608r583l761M17P282
6023d00P059L853J324j8535J133k59J5518j2181n231k107J805j5956k787L225
6009b3539J411j1119J6738K5040P545r359O663j3386j2409N163n680J279K0352
5996H699l432K44j7707M489J1478K0257n501j0473k172j2537k031k776l680P542
5982g600j0887j6930l966O459O116J515P43j50k132M319q215J1715J4618J6637
$$ plain form
5968 12242 14343 8221 -6122 -28242 -20337 -1990 -13239 -22622 -17377 -390 10749 5486 -12991
5955 -12991 -19688 -26062 -13297 -9011 -13410 -14063 -21070 -10355 -5983 -4540 -19378 -25792 -11148 13093
5941 13093 17264 8811 -2549 -20354 -29701 -36285 -21907 -2215 18569 11782 9122 328 1721
5928 1721 5930 4275 -2386 894 1699 7966 13667 18258 3121 -7397 3676 9449 2193 2338 -7939
5913 -7939 -8411 -9332 -4702 -4358 2910 -2736 -18044 -19725 -4745 -2256 -10687 -6359 -5533 -6305 3996
5898 3996 922 2976 -4164 -4826 -5659 -15281 -19547 -14275 12843 17138 10295 6477 10316 -7363 -10251
5883 -10251 -4159 -6847 13196 18600 9760 9955 19459 19388 19391 19662 12090 -1534 -6629 2647 8831 -782
5867 -782 -4731 206 3643 275 -252 19362 17387 15332 16691 8221 -95 -11354 -17222 -6650 -12803
$$ packed form
5968A2242K101o122j4343k2120P905J8347j1249r383N245J6987J1139n263j8477
5955a2991o697o374J2765M286m399o53p007J0715M372J443j4838o414J4644K4241
5941A3093M171q453j1360j7805r347o584J4378J9692K0784o787k660q794J393
5928A721M209j655o661L280Q05O267N701M591j5137j0518J1073N773p256J45j0277
5913g939m72r21M630L44P268n646j5308j681J4980K489q431M328Q26p72J0301
5898C996l074K054p140o62q33r622m266N272K7118M295o843l818L839j7679k888
5883a0251O092k688K0043N404q840J95R504p1LK71p572j3624n095R276O184r613
5867g82l949M937L437l368n27J9614j975k055J359q470q316j1259n868J0572o153
$$ plain form
5852 -12803 -27639 -29836 -23420 -15353 -14833 -19124 -10327 -11976 -6853 -9395 -2166 -4995 -13917 -4133 -2051
5837 -2051 -11289 7490 15156 7991 -22003 -16104 -6413 6871 18881 12632 -2854 -6421 -2665 -14524
5823 -14524 -29378 -26946 1818 11164 -4765 -19276 -7809 5635 14024 4302 7687 8037 9501
5810 9501 8478 1941 -13517 -11556 1727 -883 4924 4349 -7013 -5219 -5310 8377 22567 6909
5796 6909 4970 2546 -6829 -8247 7765 13386 9216 7575 8785 8989 11205 15551 28186 22027 14645
5781 14645 8100 -1795 -5369 -8044 -10965 -15535 -11044 -9904 -6916 7377 14376 5164 -3672 7044
5767 7044 5231 6856 3841 -12330 -10673 6050 30 -17303 -22456 -1637 15202 7967 9738 11090
5753 11090 6948 6226 -7675 -19223 -25389 -18345 2562 13 8694 2850 -5743 -10539 -1897 6667
$$ packed form
5852a2803j4836k197O416Q067N20m291Q797j649N123k542P229k829q922R784K082
5837b051r238J8779P666p165k9994N899R691J3284J2010o249j5486l567L756j1859
5823a4524j4854K432K8764R346j5929j4511J1467J3444Q389r722L385L50J464
5810I501j023o537j5458J961J3283k610N807n75j1362J794r1J3687J4190j5658
5796F909j939k424r375j418J6012N621m170j641J210K04K216M346J2635o159p382
5781A4645o545r895l574k675k921m570M491J140K988J4293O999r212q836J0716
5767G044j813J625l015j6171J657J6723o020j7333n153K0819J6839p235J771J352
5753A1090m142p22j3901j1548o166P044K0907k549Q681n844q593m796Q642Q564
$$ plain form
5739 6667 17094 4947 -15282 -12761 -12989 -18137 -16506 -30408 -46916 -28813 -18827 -1874 3158
5726 3158 -2766 -15340 -13369 -11268 -19684 -26991 -26077 -35257 -29323 -23287 -16394 -15819 -23922 -22155 -7496
5711 -7496 7496 12091 -3739 -20663 -15686 -14031 -24070 -20400 -16155 -16493 -26225 -30137 -23281 -16800
5697 -16800 -10855 754 -7428 -17158 -4272 13188 13187 -6373 -20059 -18198 -26173 -25621 -25110 -27132 -22447
5682 -22447 -19379 -24866 -30410 -33175 -18317 -15107 -12112 2566 3314 13399 15212 6916 7573 -6018
5668 -6018 -8239 -835 9690 -3691 -5508 -522 4635 3259 -1078 3287 -2226 -3792 -5831 -5892 2892
5653 2892 11080 2983 -4909 -11267 -13212 -9521 -1985 13466 25135 31657 14401 1176 -433 -6807
5639 -6807 -28568 -27455 -19766 -12410 -7035 6283 5598 -10846 -18478 -887 3760 -2207 -10336 -7940
$$ packed form
5739F667J0427j2147k0229K521k28n148J631j3902j6508J8103R986J6953N032
5726C158n924j2574J971K101q416p307R14r180N934O036O893N75q103J767J4659
5711g496J4992M595j5830j6924M977J655j0039L670M245l38r732l912O856O481
5697a6800N945J1609q182r730J2886J7460jj9560j3686J861p975N52N11k022M685
5682b2447L068n487n544k765J4858L210K995J4678P48J0085J813q296O57j3591
5668f018k221P404J0525j3381j817M986N157j376m337M365n513j566k039o1Q784
5653B892Q188q097p892o358j945L691P536J5451J1669O522j7256j3225j609o374
5639f807k1761J113P689P356N375J3318o85j6444p632J7591M647n967q129K396
$$ plain form
5625 -7940 -16426 -10585 7695 9785 1068 -6359 -4888 -10360 -2037 5281 7310 -7198 -12274 -20516
5611 -20516 -14453 -9317 -11406 -2256 -10620 -8101 8259 18526 6418 970 -6782 -15421 -7860 -2998
5597 -2998 353 -10306 -7527 13659 20067 35051 31629 9723 -9555 -5254 6285 18740 13397
5584 13397 -1454 -4334 -8455 -9062 -17306 -15251 -7224 4904 23485 22133 12312 -2825 -2623 -7060
5570 -7060 -11493 -3661 2256 12355 -682 -17349 -27608 -19812 -4427 5166 21 14513 18545
5557 18545 18021 15798 25192 14113 -2203 -6188 12015 10666 -324 -2117 9913 14032 6403 -8451
5543 -8451 -19196 -28457 -19988 -12631 -15237 -28068 -25693 -17263 -18942 -8897 -2095 982 -5430 351
5529 351 -525 -17999 -19065 10409 23036 3144 -12715 -5233 3899 130 -3394 5622 10425 20847
$$ packed form
5625g940q486N841J8280K090q717p427J471n472Q323P318K029j4508n076q242
5611b0516O063N136k089R150q364K519J6360J0267j2108n448p752q639P561M862
5597b998L351j0659K779K1186O408J4984l422k1906j9278M301J1539J2455n343
5584A3397j4851k880m121o07q244K055Q027J2128J8581j352r821j5137K02m437
5570g060m433P832N917J0099j3037j6667j0259P796J5385R593n145J4492M032
5557A8545n24k223R394j1079j6316l985J8203j349j0990j793J2030M119p629j4854
5543h451j0745r261Q469P357k606j2831K375Q430j679J0045O802L077o412N781
5529C51q76j7474j066K9474J2627j9892j5859P482R132l769l524R016M803J0422
$$ plain form
5515 20847 14948 13825 17612 -945 -15260 -4035 -2515 -929 14603 18144 5448 4374 4501 -3501
5501 -3501 -11370 -2868 5639 3504 8216 7348 2393 -1063 -4742 -5996 14582 12451 3765 -1918 -3188
5486 -3188 -33 -9039 -10175 -19499 -23691 -21185 -12732 2466 12027 17296 10706 4365 -13989 -22406
5472 -22406 -32542 -24904 -4704 -5140 -9169 -5765 -6937 -15219 -18158 -2797 12162 10517 9619 5250
5458 5250 11184 -1121 -14453 -9412 -1888 14519 9709 2990 3278 11888 2242 1315 11273 -104
5444 -104 -11215 -11615 15191 12630 2226 7228 20507 15697 10787 2157 6029 19736 21134 15912
5430 15912 5060 8086 15329 25908 11267 5309 10458 21410 17958 14521 19827 28582 36142 22570
5416 22570 11880 14379 16070 1993 -9391 -7997 -5914 -22590 -9891 6090 27967 26903 17290
$$ packed form
5515B0847n899j123L787j8557j4315J1225J520J586J5532L541j2696j074J27q002
5501c501p869Q502Q507k135M712q68m955l456l679j254K0578k131q686n683j270
5486c188L155r006j136r324m192K506Q453J5198R561N269o590o341j8354q417
5472b2406j0136P638K0200m36m029L404j172q282k939J5361J4959j645q98m369
5458E250N934j2305j3332N041P524J6407m810o719K88Q610r646r27R958j1377
5444a04j1111m00K6806k561j0404N002J3279m810m910q630L872J3707J398n222
5430A5912j0852L026P243J0579j4641n958N149J0952l452l437N306Q755P560j3572
5416B2570j0690K499J691j4077j1384J394K083j6676J2699J5981K1877j064r613
$$ plain form
5403 17290 10177 5576 5203 9507 5538 -2160 1348 13168 17855 16053 15610 6646 11509 10447 -4362
5388 -4362 -6529 -8377 -15438 -23757 -14873 -2910 -3267 -1869 -10552 -9052 -3892 11386 8720 2338 -5960
5373 -5960 11086 24288 5251 -13901 -14286 -10254 6642 7848 13802 8602 18747 8817 6561 7752
5359 7752 -4677 -12252 -12836 -17730 -4773 7894 11940 9596 21357 11549 7090 -11631 -28067 -19721
5345 -19721 -1381 3634 921 -11946 -9239 1403 -11895 -15925 1066 9910 13085 7208 2252
5332 2252 3611 5773 18058 28873 18045 17617 6649 -12659 -14322 -7534 -3779 254 -9438 -19967
5318 -19967 -17798 -13473 -2142 4474 11028 5066 -2286 -6275 -245 17618 26400 28656 31961 18377
5304 18377 17995 16355 22392 20981 2217 -21271 -18314 -8420 -10920 -10003 -5541 -10989 -6025 -15634 5892
$$ packed form
5403A7290p113m601l73M304l969p698L508J1820M687j802m43q964M863j062j4809
5388d362k167j848p061q319Q884J1963l57J398q683J500N160J5278k666o382q298
5373e960J7046J3202j9037j9152l85M032J6896J206N954n200J0145r930k256J191
5359G752j2429p575n84m894J2957J2667M046k344J1761r808m459j8721j6436Q346
5345a9721J8340N015k713j2867K707J0642j3298m030J6991Q844L175n877m956
5332B252J359K162J2285J0815j0828m28j0968j9308j663O788L755M033r692j0529
5318a9967K169M325J1331O616O554n962p352l989O030J7863Q782K256L305j3584
5304A8377l82j640O037j411j8764k3488K957R894k500R17M462n448M964r609K1526
$$ plain form
5289 5892 31747 33812 17632 -4 -9052 -5577 -4873 -662 -1932 -6427 -1396 12307 24634 14983
5275 14983 6291 -3416 -7143 -11516 15090 15036 6042 -183 56 764 -8509 -5667 4178 2709 2178 1308
5259 1308 5313 8169 13116 2201 -13443 -16953 -19082 -16882 -36085 -46917 -50074 -44882 -21510 -12576
5245 -12576 -19321 -10841 387 -14563 -30804 -40875 -48610 -49003 -39596 -23736 -9690 5888 4920
5232 4920 -3882 -7796 4498 3801 -3904 -9991 -4067 -1291 9058 20722 17290 12012 3093 -6174
5218 -6174 -12040 -6613 3773 -5085 -11050 -15160 -8894 3854 376 -6378 -6314 -11331 -12498 -9624 -16476
5203 -16476 -25886 -32856 -35024 -3121 27284 18409 12549 11339 12918 13248 14712 18597 7797 187
5189 187 2741 -340 7687 -1759 -19149 -19597 -17884 -6696 -8194 -12750 4103 -9658 -818 -2320
$$ packed form
5289E892K5855K065j6180j7636r048L475P04M211j270m495N031J3703J2327r651
5275A4983q692r707l727m373K6606n4q994o225K39P08r273K842R845j469n31q70
5259A308M005K856M947j0915j5644l510k129K200j9203j0832l157N192K3372Q934
5245a2576o745Q480J1228j4950j6241j0071p735l93R407J5860J4046J5578r68
5232D920q802l914J2294o97p705o087N924K776J0349J1664l432n278q919r267
5218f174n866N427J0386q858n965m110O266J2748l478o754O4n017j167K874o852
5203a6476r410o970k168L1903L0405q875n860j210J579L30J464L885j0800p610
5189A87K554l081Q027r446j7390m48J713J1188j498m556J6853j3761Q840j502
$$ plain form
5175 -2320 -26007 -29135 -17519 -13022 -19202 -19315 -36821 -47151 -37171 -14860 -10119 -2541 -4478 2635
5161 2635 3548 -7941 3474 10837 14357 24051 11071 -6600 -15787 -22672 -11295 12787 10485 -5157
5147 -5157 -10859 -17714 -9323 1990 4715 12407 16355 5752 -9616 -23069 -43723 -31851 -23983
5134 -23983 -11598 621 7103 -148 645 -2612 5633 13254 2012 -14231 -8194 -8567 -14111 103
5120 103 5843 868 -8641 -1902 -5340 -8578 -15463 -18832 -19527 -26980 -33166 -15190 -12752 -21842 1176
5105 1176 16518 21064 18784 5240 2206 12224 21026 16258 13765 14102 7550 15068 22392 20219
5091 20219 25794 7661 -14468 -15746 -3123 -3196 -14993 -2438 -6913 -3262 1820 4123 -4988 -16046
5077 -16046 -24575 -14923 -6028 -5334 -5631 -2374 -1881 1897 9064 12824 8771 -773 3533 10074 -4562
$$ packed form
5175b320k3687l128J1616M497o180j13j7506j0330R980K2311M741P578j937P113
5161B635R13j1489J1415P363L520R694j2980j7671r187o885J1377K4082k302j5642
5147e157n702o855Q391J1313K725P692L948j0603j5368j3453k0654J1872P868
5134b3983J2385J2219O482p251P93l257Q245P621j1242j6243O037l73n544J4214
5120A03N740m975r509O739l438l238o885l369o95p453o186J7976K438r090K3018
5105A176J5342M546k280j3544l034J0018Q802m768k493L37o552P518P324k173
5091B0219N575j8133k2129j278J2623p3j1797J2555m475L651N082K303r111j1058
5077a6046q529R652Q895O94k97L257M93L778P167L760m053r544M306O541j4636
$$ plain form
5062 -4562 -11623 -9914 -1533 -8577 -8255 -5225 -6027 -11020 -2825 -14174 -19499 -7314 6441 -691 3314
5047 3314 19208 16566 -6590 -20391 -13607 -459 10596 7489 4399 6171 11339 -4682 -3681
5034 -3681 6022 10567 13918 6045 -5723 -11139 -11913 -7910 -214 -5563 -8444 -2631 1967 1185 -9830
5019 -9830 -2906 -5413 -11293 -6372 11086 8893 15268 6987 -1862 20502 34838 19498 21197 18331
5005 18331 11452 -10164 -16989 -7928 3614 2923 870 -701 -4774 -14413 -23741 -18578 -16816 -7286
4991 -7286 -10527 -27465 -26950 -8717 1225 -8228 -31612 -30764 -6224 2975 -7549 -16343 -7421 7727
4977 7727 4363 -15289 -32325 -28162 -13554 -7878 -7520 -8483 -4123 -3643 -13714 -9487 14755 17977
4963 17977 563 -3407 4350 -11113 -32232 -26907 -5030 -6655 -9303 -6744 -18320 -6083 12921
$$ packed form
5062d562p061J709Q381p044L22L030q02m993Q195j1349n325J2185J3755p132M005
5047C314J5894k642k3156j3801O784J3148J1055l107l090J772N168j6021J001
5034c681R703M545L351p873j1768n416p74M003P696n349k881N813M598p82j1015
5019i830O924k507n880M921J7458k193O375q281q849K2364J4336j5340J699k866
5005A8331o879k1616o825R061J1542o91k053j571m073r639r328N163J762R530
4991g286l241j6938N15J8233R942r453k3384Q48K4540R199j0524q794Q922J5148
4977G727l364j9652j7036M163J4608N676L58r63M360M80j0071M227K4242L222
4963A7977j7414l970P757j5463k1119N325K1877j625k648K559j1576J2237J9004
$$ plain form
4950 12921 25869 12595 8604 19652 28755 17602 -7858 -6435 6052 11455 7410 10486 16640
4937 16640 22365 19206 5773 -21552 -25448 -17391 -11170 -21043 -23099 -7661 4083 -1226 -16544
4924 -16544 -7943 6687 4991 3024 -6820 -10691 -10843 1754 4233 11375 3997 -17131 -14085 -2942
4910 -2942 11959 4607 -9829 -15099 -11548 -7689 -431 -1345 -5593 10210 5124 11374 6798 -5998
4896 -5998 -4952 -6293 -5348 -1418 3834 3513 -3399 -1581 385 -16796 -15175 4572 1416 -7082 -8050
4881 -8050 -7204 -6504 7830 24210 2735 -17573 -19315 -29536 -17197 -21787 -32226 -33118 -14879 -8152
4867 -8152 -14777 -21583 -15190 6483 18528 2324 -20082 -30584 -24988 -13064 7771 12381 21466
4854 21466 7862 -7829 -8398 -22645 -17380 -6628 -6128 2783 -3070 -11462 -22540 -32182 -13027 12467
$$ packed form
4950A2921J2948j3274l991J1048R103j1153k5460J423J2487N403m045L076O154
4937A6640N725l159j3433k7325l896Q057O221r873k056J5438J1744n309j5318
4924a6544Q601J4630j696j967r844l871j52J2597K479P142p378k1128L046J1143
4910b942J4901p352j4436n270L551L859P258r14m248J5803n086O250m576j2796
4896e998J046j341R45L930N252l21o912J818J966j7181J621J9747l156q498r68
4881h050Q46P00J4334J6380k1475k0308j742j0221J2339m590j0439q92J8239O727
4867h152o625o806O393K1673J2045j6204k2406j0502N596J1924K0835M610R085
4854B1466j3604j5691n69j4247N265J0752N00Q911n853q392j1078r642J9155K5494
$$ plain form
4840 12467 5978 1372 2464 -6847 -5532 1279 -13717 -16666 -22611 -17696 -3470 9984 12128 -8099
4826 -8099 -8343 -5278 3239 2975 3338 -2242 -8241 -4860 -5803 -5350 -10039 -3861 105 -3564 -10644 -8839
4810 -8839 -8661 -6887 -16357 -28283 -14410 -8926 -8526 -17783 -20853 -14564 -15567 -18947 -7603 -9212 -16556
4795 -16556 -37791 -32596 -14699 -12841 -12846 -2666 2382 4995 7096 -9237 -5639 -10116 -18370 -3413
4781 -3413 4230 1479 -5490 -27864 -9925 -12337 -16815 411 14752 13385 -2361 -1547 -2090 -10654
4767 -10654 -9987 -4687 391 3660 6848 344 -8416 -1764 1769 13591 23160 21291 15792 5140
4753 5140 -2273 -6526 929 673 5251 -4086 1085 12251 7530 13616 8107 12969 21442 11014 7922
4738 7922 -1566 1310 10035 16772 28848 49215 40164 22989 16513 23810 19183 16854 8609 15111
$$ packed form
4840A2467o489m606J092r311J315O811j4996k949n945M915J4226J3454K144k0227
4826h099k44L065Q517k64L63n580n999L381r43M53m689O178L966l669p080J805
4810h839J78J774r470j1926J3873N484M00r257l070O289j003l380J1344j609p344
4795a6556k1235N195J7897J858nJ0180N048K613K101j6333L598m477q254J4957
4781c413P643k751o969k2374J7939k412m478J7226J4341j367j5746Q14n43q564
4767a0654O67N300N078L269L188o504q760O652L533J1822R569j869n499j0652
4753E140p413m253P455k56M578r337N171J1166m721O086n509M862Q473j0428l092
4738G922r488K876Q725O737J2076K0367r051j7175o476P297m627k329q245O502
$$ plain form
4724 15111 19129 10867 6413 4568 4234 -9452 -23020 -14813 -6384 4402 9263 -860 3328 16592
4710 16592 14567 6680 -7245 -20000 -26310 -15573 -1400 804 -8339 -5061 2056 -6970 -14772 -27384
4696 -27384 -28150 -10600 -1682 15641 -794 -1055 7948 6758 15876 21322 10527 -4224 -14827 7533
4682 7533 16209 25003 23424 9113 8302 17587 15101 8023 9245 882 158 -4404 -16597 -13539 3837
4667 3837 10016 2941 -3070 -187 -7711 -11988 -70 -1564 9007 15411 8328 7755 -2172 -2205 2256
4652 2256 -7746 -21847 -32750 -19491 -9505 -20644 -26080 -10850 -12234 -8943 -15157 -12616 -14792
4639 -14792 -24954 -10268 -13185 -25445 -32590 -33738 -9897 423 -9151 -20768 -25194 -28377 -26415
4626 -26415 -24657 -14443 -8401 8699 15044 9509 16695 10172 10898 20006 6563 -1006 -7230 5034
$$ packed form
4724A5111M018q262m454j845l34j3686j3568Q207Q429J0786M861j0123M188J3264
4710A6592k025p887j3925j2755o310J0737J4173K204r143L278P117r026p802j2612
4696b7384p66J7550Q918J7323j6435k61R003j190R118N446j0795j4751j0603K2360
4682G533Q676Q794j579j4311q11R285k486p078J222q363p24m562j2193L058J7376
4667C837O179p075o011K883p524m277J1918j494J0571O404p083n73r927l3M461
4652B256j0002j4101j0903J3259R986j1139n436J5230j384L291o214K541k176
4639a4792j0162J4686k917j2260p145j148K3841J0320r574j1617m426l183J962
4626b6415J758J0214O042J7100O345n535P186o523P26R108j3443p569o224J2264
$$ plain form
4612 5034 11170 2686 1072 3750 903 62 -8073 -11013 -20586 -14582 1157 4915 18028 18287 18356
4597 18356 15795 8437 873 -6534 -24730 -30778 -21145 -21815 -24183 -13475 -2206 8627 -3717 -19431
4583 -19431 -10058 -7822 -16574 -16211 -24561 -26527 -1177 3449 -5430 -5641 -3940 -6750 -8076 -17413 -22390
4568 -22390 -7317 -3195 -902 -5175 -8891 -16087 -6510 -4895 -7181 -6134 -154 -8381 -22582 -11690
4554 -11690 -11094 -3656 11505 16653 13213 12544 19565 27604 426 -6819 4190 -4376 -10627 2473
4540 2473 -2827 -2147 -12106 -9602 -12994 -7772 1193 10628 13083 5826 5837 8989 1850 -5331 -10679 -8557
4524 -8557 12421 17119 6874 3997 -19937 -34049 -18442 -18338 -9668 6840 1501 12075 7586
4511 7586 12881 17434 14537 2003 4445 12107 -3226 -5906 -13428 -12391 -11245 -16321 -19277 -23995
$$ packed form
4612E034O136q484j614K678k847q41q135k940r573O004J5739L758J3113K59O9
4597A8356k561p358p564p407j8196o048R633o70k368J0708J1269J0833j2344j5714
4583a9431R373K236q752L63q350j966K5350M626q879k11J701k810j326r337m977
4568b2390J5073M122K293m273l716p196R577J615k286J047N980q227j4201J0892
4554a1690N96P438J5161N148l440o69P021Q039k7178p245J1009q566o251J3100
4540B473n300O80r959K504l392N222Q965R435K455p257J1L152p139p181n348K122
4524h557K0978M698j0245k877k3934j4112J5607J04Q670J6508n339J0574m489
4511G586N295M553k897j2534K442P662j5333k680p522J037J146n076k956m718
$$ plain form
4497 -23995 -23123 -11251 -14087 -14175 1721 8878 16931 3549 -12953 5483 13690 5476 1568 5779
4483 5779 -1126 -4210 -12497 -13817 -1182 -1815 3411 14986 3051 -7553 -18103 -17912 -6340 11347
4469 11347 10443 17004 20112 8980 -8955 -22134 -10824 7540 4395 -2344 -10124 -14506 -4508 273
4455 273 11440 9615 5014 403 -2918 8388 17766 21364 8011 -6725 15163 30566 9423
4442 9423 -3562 -14160 -11569 2956 10417 22980 14603 11067 9443 -4723 -8282 -2656 -6761 4817
4428 4817 9061 -4030 -10426 -20864 -25789 -9139 -3928 -20269 -37035 -17350 -3558 2012 -5908
4415 -5908 -7375 2843 7433 7278 7386 2976 -3052 2056 9525 5381 -4603 -5166 -2868 4303 6958
4400 6958 4783 298 384 -3160 -12701 -10000 -8837 -12445 -8288 15721 27499 24951 12021 -2890
$$ packed form
4497b3995Q72J1872k836q8J5896P157Q053j3382j6502J8436Q207q214l908M211
4483E779o905l084q287j320J2635o33N226J1575j1935j0604j0550J91J1572J7687
4469A1347r04O561L108j1132j7935j3179J1310J8364l145o739p780m382R998M781
4455B73J1167j825m601m611l321J1306R378L598j3353j4736K1888J5403k1143
4442I423j2985j0598K591J4525P461J2563q377l536j624j4166l559N626m105J1578
4428D817M244j3091o396j0438m925J6650N211j6341j6766J9685J3792N570p920
4415e908j467J0218M590j55J08m410o028N108P469m144r984n63K298P171K655
4400F958k175m485Q6l544r541K701J163l608M157K4009J1778k548j2930j4911
$$ plain form
4386 -2890 18239 21417 10587 13512 19669 20039 14560 9407 2780 3947 18584 19516 9798 -2537
4372 -2537 -11481 -10921 -16910 -21225 -15111 -10067 -3088 -12306 -10735 3097 11626 16908 27124 22551 5893
4357 5893 -4456 9497 22763 29426 30452 28813 23239 17741 8871 -3175 -7846 2670 8037 -12271
4343 -12271 -28623 -23612 -10565 -6360 -5028 -366 20613 30708 27639 12975 12854 13716 7468 -15909
4329 -15909 -32930 -31463 -25488 -13463 4571 16874 14939 3075 -15184 -9106 5128 464 -1316
4316 -1316 8904 7662 9299 250 5708 13791 15928 15280 11032 9601 -3707 -11540 -14639 -14018 -156
4301 -156 10683 12135 3280 15876 9033 -10407 -19175 -8029 683 -1886 -10304 -5509 3670 8843
4287 8843 2971 8224 19206 17929 12527 7845 2487 1561 -6277 -7560 11005 4416 -5356 1917 8199
$$ packed form
4386b890K1129L178j0830K925O157L70n479n153o627J167J4637R32r718j2335
4372b537q944N60n989m315O114N044O979r218J571J3832Q529N282J0216m573j6658
4357E893j0349J3953J3266O663J026j639n574n498q870j2046m671J0516N367k0308
4343a2271j6352N011J3047M205J332M662K0979J0095l069j4664j21Q62o248k3377
4329a5909j7021J467N975J2025J8034J2303j935j1864j8259O078J4234m664j780
4316a316J0220j242J637r049N458Q083K137o48m248j431j3308p833l099O21J3862
4301a56J0839J452q855J2596o843j9440q768J1146Q712k569q418M795R179N173
4287H843n872N253J0982j277n402m682n358r26p838j283J8565o589r772P273O282
$$ plain form
4272 8199 9900 7452 -2323 -518 10782 12767 17101 9379 4535 1531 -9265 -25727 -23324 -22511
4258 -22511 -20715 -9161 10374 11036 7322 14520 3540 -14668 -20344 5799 9480 -6506 4040
4245 4040 7305 6225 5763 2767 -858 6424 18568 12033 -4863 -1117 9702 2449 -15361 -29139
4231 -29139 -27441 -6508 -16628 -24395 -18661 -10439 -11379 -817 -2430 -4787 -10186 -9248 -3560 -9181
4217 -9181 6885 5834 -3917 3060 7958 24778 17830 13610 4869 -16091 -10891 -3471 6749 10870
4203 10870 9116 16983 6540 5708 1114 -5236 -4299 -5123 6972 9231 16821 22637 21935 25596 11930
4188 11930 9696 11679 7059 -573 14137 8146 -1943 -10173 -18949 -11292 8512 14808 10564 11808
4174 11808 1022 -11728 -17132 -14048 -16614 -14297 -12904 -14821 -9443 2373 1448 -9527 -18616 -19917
$$ packed form
4272H199J701k448r775J805J1300J985M334p722m844l004j0796j6462K403Q13
4258b2511J796J1554J9535O62l714P198j0980j8208n676K6143L681j5986J0546
4245D040L265j080m62k996l625P282J2144o535j6896L746J0819p253j7810j3778
4231b9139J698K0933j0120p767N734Q222r40J0562j613k357n399R38N688n621
4217i181J6066j051r751O977M898J6820o948m220q741k0960N200P420J0220M121
4203A0870j754P867j0443q32m594o350R37q24J2095K259P590N816p02L661j3666
4188A1930k234J983m620p632J4710n991j0089q230q776P657J9804O296m244J244
4174A1808j0786j2750n404L084k566K317J393j917N378J1816r25j0975r089j301
$$ plain form
4160 -19917 386 -690 2868 -6744 -15859 -8513 3824 4053 12538 7393 728 -3055 -9681 -33616
4146 -33616 -17040 6776 23498 28269 22680 8875 12456 8754 7569 16338 16611 11622 -3393 -9842
4132 -9842 -1062 13486 20144 30357 10548 17893 15684 113 -3020 -10872 -16818 -23339 -20745 -10208
4118 -10208 3885 -1527 5072 13041 9756 16025 22490 7984 -8329 -7089 4777 -1391 -7320 -8462
4104 -8462 1464 29202 30661 35560 27675 13305 14346 8354 12519 13765 17971 21626 26585 19974
4090 19974 10228 2417 5147 3993 9854 16272 10467 1650 6874 -2798 -13018 -8807 -8323 -14685 -3990
$$ packed form
4160a9917K0303j076L558r612r115P346J2337K29Q485n145o665l783o626k3935
4146c3616J6576K3816J6722M771n589j3805L581l702j185Q769K73m989j5015o449
4132i842Q780J4548O658J0213j9809P345k209j5571l133p852n946o521K594J0537
4118a0208J4093n412O599P969l285O269O465j4506j6313J240J1866o168n929j142
4104h462R926K7738J459M899p885j4370J041n992M165J246M206L655M959o611
4090A9974r746p811K730j154N861O418n805q817N224r672j0220M211M84o362J0695
$$ [...]
##END NTUPLES=NMR SPECTRUM
##END=
