##TITLE=Analysis number 320078
Compound Code cc 39114
Book Reference 451/159
Project Code adrs
Chemist Name evam
##JCAMPDX= 6.0         $$ Bruker NMR JCAMP-DX V2.0
##DATA TYPE= NMR SPECTRUM
##DATA CLASS= NTUPLES
##ORIGIN= Bruker BioSpin GmbH
##OWNER= nmr
$$ XWIN-NMR		Version 3.5
$$ Mon Jun 12 14:17:44 2006 GMT Daylight Time (UT+1h)  MAYBRIDGE\nmr@NMR_250MHZ
##.OBSERVE FREQUENCY= 250.131544655141
##.OBSERVE NUCLEUS= ^1H
##.ACQUISITION MODE= SIMULTANEOUS (DQD)
##.ACQUISITION SCHEME= undefined
##.AVERAGES= 16
##.DIGITISER RES= 18
##SPECTROMETER/DATA SYSTEM= dpx250
##.PULSE SEQUENCE= zg30
##.SOLVENT NAME= CDCl3
##.SHIFT REFERENCE= (INTERNAL, CDCl3, 0, 16.4469)
##AUDIT TRAIL= $$ (NUMBER, WHEN, WHO, WHERE, WHAT)
$$ ##TITLE= Audit trail, XWIN-NMR		Version 3.5
$$ ##JCAMPDX= 5.01
$$ ##ORIGIN= Bruker BioSpin GmbH
$$ ##OWNER= nmr
$$ C:\u/data/dgb/nmr/ADRS/580/pdata/1/auditp.txt
$$ ##AUDIT TRAIL=  $$ (NUMBER, WHEN, WHO, WHERE, WHAT)
(   1,<2006-06-12 14:17:19.29 +100>,<MAYBRIDGE\nmr>,<NMR_250MHZ>,
      <created by zg, POWCHK disabled, PULCHK disabled
       configuration hash MD5:
       E2 DF 36 D8 04 B2 41 60 5A D7 A3 38 5A 4B D0 FE
       data hash MD5: 64K
       92 90 4F 4F 16 BF C0 4E B4 C4 65 8A 25 6C 98 52>)
(   2,<2006-06-12 14:17:33.35 +100>,<MAYBRIDGE\nmr>,<NMR_250MHZ>,
      <Start of raw data processing
       ef LB = 0.3 FT_mod = 6 PKNL = 1 SI = 32K 
       data hash MD5: 32K
       E0 84 B2 8F 5E 23 0F 77 D2 E2 47 19 46 1D FD 6C>)
(   3,<2006-06-12 14:17:34.86 +100>,<MAYBRIDGE\nmr>,<NMR_250MHZ>,
      <apk 
       data hash MD5: 32K
       03 EF 53 FB EB C5 08 1E 88 57 16 D0 B6 05 DB D9>)
(   4,<2006-06-12 14:17:35.58 +100>,<MAYBRIDGE\nmr>,<NMR_250MHZ>,
      <abs ABSG = 5 
       data hash MD5: 32K
       59 3A 20 D9 BF FA D4 4B A6 F3 4D A7 FB AB E4 08>)
$$ ##END=
$$ 
$$ hash MD5
$$ 6B 97 6D 14 2F B0 43 00 4A 86 CD A2 E5 88 DF EE
##$RELAX= 
##$RELAX= 
##$RELAX= 
##$RELAX= 
##$RELAX= 
##$RELAX= 
##$RELAX= 
$$ Bruker specific parameters
$$ --------------------------
##$DU= <C:\u>
##$EXPNO= 580
##$NAME= <ADRS>
##$PROCNO= 1
##$TYPE= <nmr>
##$USER= <dgb>
##$AMP= (0..31)
100 100 100 100 100 100 100 100 100 100 100 100 100 100 100 100 100 100 
100 100 100 100 100 100 100 100 100 100 100 100 100 100 
##$AQSEQ= 0
##$AQ_mod= 3
##$AUNM= <au_zg>
##$AUTOPOS= <28 >
##$BF1= 250.13
##$BF2= 250.13
##$BF3= 250.13
##$BF4= 250.13
##$BF5= 500.13
##$BF6= 500.13
##$BF7= 500.13
##$BF8= 500.13
##$BYTORDA= 1
##$CFDGTYP= 0
##$CFRGTYP= 5
##$CHEMSTR= <none>
##$CNST= (0..31)
1 1 145 1 1 1 1 1 1 1 1 1 1 1 1 1 1 1 1 1 1 1 1 1 1 1 1 1 1 1 1 1 
##$CPDPRG= <>
##$CPDPRG1= <>
##$CPDPRG2= <>
##$CPDPRG3= <>
##$CPDPRG4= <mlev>
##$CPDPRG5= <mlev>
##$CPDPRG6= <mlev>
##$CPDPRG7= <mlev>
##$CPDPRG8= <mlev>
##$CPDPRGB= <>
##$CPDPRGT= <>
##$D= (0..31)
0 1 0 0 0 0 0 0 0 0.06 0 0 0 0 0 0 0.0002 0 0 0 0 0 0 0 0 0 0 0 0 0 0 
0 
##$DATE= 1150118237
##$DBL= (0..7)
120 120 120 120 120 120 120 120 
##$DBP= (0..7)
150 150 150 150 150 150 150 150 
##$DBP07= 0
##$DBPNAM0= <>
##$DBPNAM1= <>
$$ [...]
##$SUBNAM7= <"">
##$SUBNAM8= <"">
##$SUBNAM9= <"">
##$SW= 20.6930455092707
##$SWIBOX= (0..15)
0 0 3 0 0 0 0 0 0 0 0 0 0 0 0 0 
##$SW_h= 5175.983436853
##$TD= 65536
##$TD0= 1
##$TE= 296.16
##$TE2= 300
##$TE3= 300
##$TEG= 300
##$TL= (0..7)
0 120 120 120 120 120 120 120 
##$TP= (0..7)
150 150 150 150 150 150 150 150 
##$TP07= 0
##$TPNAME0= <>
##$TPNAME1= <>
##$TPNAME2= <>
##$TPNAME3= <>
##$TPNAME4= <>
##$TPNAME5= <>
##$TPNAME6= <>
##$TPNAME7= <>
##$TPOAL= (0..7)
0.5 0.5 0.5 0.5 0.5 0.5 0.5 0.5 
##$TPOFFS= (0..7)
0 0 0 0 0 0 0 0 
##$TUNHIN= 0
##$TUNHOUT= 0
##$TUNXOUT= 0
##$USERA1= <user>
##$USERA2= <user>
##$USERA3= <user>
##$USERA4= <user>
##$USERA5= <user>
##$V9= 5
##$VALIST= <valist>
##$VCLIST= <CCCCCCCCCCCCCCC>
##$VD= 0
##$VDLIST= <DDDDDDDDDDDDDDD>
##$VPLIST= <PPPPPPPPPPPPPPP>
##$VTLIST= <TTTTTTTTTTTTTTT>
##$WBST= 1024
##$WBSW= 4
##$XGAIN= (0..3)
0 0 0 0 
##$XL= 0
##$YL= 0
##$YMAX_a= 406285
##$YMIN_a= -637795
##$ZGOPTNS= <>
##$ZL1= 120
##$ZL2= 120
##$ZL3= 120
##$ZL4= 120
##$ABSF1= 16.44691
##$ABSF2= -4.246262
##$ABSG= 5
##$ABSL= 3
##$ALPHA= 0
##$AQORDER= 0
##$ASSFAC= 0
##$ASSFACI= 0
##$ASSFACX= 0
##$ASSWID= 0
##$AUNMP= <proc_1d>
##$AZFE= 0.1
##$AZFW= 0.1
##$BCFW= 0
##$BC_mod= 0
##$BYTORDP= 0
##$COROFFS= 0
##$CY= 12.5
##$DATMOD= 1
##$DC= 0
##$DFILT= <>
##$DTYPP= 0
##$F1P= 14.0000005364418
##$F2P= -0.99999901652339
##$FCOR= 0.5
##$FTSIZE= 32768
##$FT_mod= 6
##$GAMMA= 0
##$GB= 0
##$INTBC= 1
##$INTSCL= 1
##$ISEN= 128
##$LB= 0.3
##$LEV0= 0
##$LPBIN= 0
##$MAXI= 10000
##$MC2= 0
##$MEAN= 0
##$ME_mod= 0
##$MI= 0
##$NCOEF= 0
##$NC_proc= -3
##$NLEV= 6
##$NOISF1= 0
##$NOISF2= 0
##$NSP= 0
##$NTH_PI= 0
##$NZP= 0
##$OFFSET= 16.44691
##$PC= 1
##$PHC0= 169.037
##$PHC1= 3.397661
##$PH_mod= 1
##$PKNL= yes
##$PPARMOD= 0
##$PSCAL= 4
##$PSIGN= 0
##$REVERSE= no
##$SF= 250.130018779823
##$SI= 32768
##$SIGF1= 0
##$SIGF2= 0
##$SINO= 400
##$SIOLD= 32768
##$SREGLST= <1H.CDCl3>
##$SSB= 0
##$STSI= 32768
##$STSR= 0
##$SW_p= 5175.98343685301
##$SYMM= 0
##$S_DEV= 0
##$TDeff= 65536
##$TDoff= 0
##$TI= <Analysis number 999999
Compound Code 99
Book Reference 9
Project Code 9>
##$TILT= no
##$TM1= 0
##$TM2= 0
##$TOPLEV= 0
##$USERP1= <user>
##$USERP2= <user>
##$USERP3= <user>
##$USERP4= <user>
##$USERP5= <user>
##$WDW= 1
##$XDIM= 32768
##$YMAX_p= 515446251
##$YMIN_p= -101529
$$ End of Bruker specific parameters
$$ ---------------------------------
##NTUPLES= NMR SPECTRUM
##VAR_NAME=  FREQUENCY,     SPECTRUM/REAL,   SPECTRUM/IMAG
##SYMBOL=    X,             R,               I
##VAR_TYPE=  INDEPENDENT,   DEPENDENT,       DEPENDENT
##VAR_FORM=  AFFN,          ASDF,            ASDF
##VAR_DIM=   32768,         32768,           32768
##UNITS=     HZ,            ARBITRARY UNITS, ARBITRARY UNITS
##FACTOR=    0.157963299565203, 1,           1
##FIRST=     4113.86612182021, 0,            0
##LAST=      -1062.1173150328, 0,            0
##MIN=       -1062.1173150328, -101529,      0
##MAX=       4113.86612182021, 515446251,    0
$$ Real data points
##PAGE= N=1
##DATA TABLE= (X++(R..R)), XYDATA
$$ [...]
16697b1659J5981L6349L377k979m2584l095O077M079k1166K991P040o90m396J2863
16683g812K8743k724l2141K1917J8559o930n4203k3123K6842L8152L5603o822
16671C6061j9622j5521J9414j3224j4152k8116j1422l262J9787J8839M358J1275
16659D415j2581j4847k0993K0006J5110L194j736J6564j9007j2796K1705j8039
16647a9005J1392K0040J159J7503n749m832N285N64k3325r413J847k6992j512
16634c3038K0588N650r023k6161j6423J6624k52K9990J3749j802m988j4592R378
16621a0300M131J3709k146j086j4963j0378O664P719n18J7893R438k0592j3912
16608a4341j03k1954j860L025K6225L382k3435J5305j2680J369L0739K0616k379
$$ plain form
16697 -21659 -5678 30671 34048 31069 -11515 -14610 -8533 -4454 -25620 -22629 -15589 -16279 -20675 -7812
16683 -7812 20931 18207 -13934 7983 26542 19612 -34591 -57714 -30872 7280 42883 36061
16671 36061 16439 918 20332 7108 -7044 -35160 -46582 -49844 -30057 -11218 -6860 4415
16659 4415 -8166 -23013 -44006 -24000 -8890 -5696 -7432 9132 -9875 -22671 -966 -19005
16647 -19005 -7613 12427 13586 31089 25340 20508 25793 26357 3032 -6381 -4534 -31526 -33038
16634 -33038 -12450 -6800 -15823 -41984 -58407 -41783 -42035 -12045 1704 -98 -5086 -19678 -10300
16621 -10300 -6169 7540 5394 4308 -10655 -21033 -14369 -6650 -7168 10725 20163 -429 -14341
16608 -14341 -14444 -36398 -38258 -35233 -9008 -5626 -29061 -13756 -26436 -25067 5672 26288 23909
16595B3909p797j9095k835j7938J0728l53j4343l2800P188K0682J1339J1110K413
16582g792q909J2909K2925l496l3148L209M7612l761k325n3900k4354J5053J0552
16569b5425q326M698m590j9689J1868J6212J8727l431n617j9790j00J0848k5574
16556e0189J0954p761J262J9354L1131q25N551l992o870O876j127J658k9599J2230
16542a1347n472k927K0474R237O502j7012j4876M182n078o536J6150K0079N228
16529A8604j9667N11J3057k2836j1733m039N340L556K6213k74k656q913K9142
16516B6305m246k1032o110K4718j5059o188K0308K468j0138j1196l364l5873j2017
16503e1424n474M0858K1570L650j8795q380J3k3308K556J5788K0926K8492J477
$$ plain form
16595 23909 16112 -2983 -5818 -23756 -13028 -13381 -27724 -60524 -53336 -32654 -21315 -10205 -7792
16582 -7792 -16701 -3792 19133 15637 -17511 -14302 33310 29549 27224 -26676 -51030 -35977 -25425
16569 -25425 -33751 -29053 -33643 -53332 -41464 -25252 -6525 -9956 -15573 -35363 -35463 -24615 -50189
16556 -50189 -39235 -46996 -45734 -26380 4751 3926 9477 5485 -1385 5491 4364 6022 -23577 -11347
16542 -11347 -16819 -19746 728 9965 16467 -545 -15421 -11239 -16317 -22853 -6703 13376 18604
16529 18604 -1063 -552 12505 -10331 -22064 -26103 -20763 -17207 9006 8732 6076 -2837 26305
16516 26305 22059 1027 -5083 19635 4576 -1612 18696 21164 11026 -170 -3534 -39407 -51424
16503 -51424 -56898 -16040 5530 9180 -9615 -17995 -17982 -41290 -38734 -22946 -2020 26472 27949
16490B7949k3349J7632Q734j7789l600j3041l928l596J6218j353N927k326j6389
16477h911P90o87j2078K7918J6362N618O308k676l124o940j2868j5465j7954l117
16463b6824K5302J3701j8749j1775L2810L4831j098j9822K887J4476o836l3281
16451E622K170j6822o14m6500j5692K3329J9428k834R896L738L2999J1501k3514
16438B707q586K0682O511J4093J3546J690k3913k2152L579K410m15k0132j8019
16425b7999L978J5424P279l1032k7989L0040K7863k714O310J4487j4713m120Q826
16412E640K496P458j2742O246J7460J4873k1227k2350M169M746P878m704o053
16399C890M729k429K719j0650j7997J9916R442l716P409k6816j1445q034R786
$$ plain form
16490 27949 4600 22232 30966 13177 9577 -3464 -7392 -10988 5230 3877 9804 7478 -8911
16477 -8911 -8121 -8808 -20886 7032 23394 29012 35320 32644 29520 22580 9712 -5753 -23707 -26824
16463 -26824 -1522 12179 -6570 -18345 14465 49296 48198 28376 31263 45739 38903 5622
16451 5622 7792 -9030 -9644 -56144 -71836 -48507 -29079 -31913 -22017 -18279 14720 26221 2707
16438 2707 -5879 14803 21314 35407 48953 50643 26730 4578 8157 10567 10152 -9980 -27999
16425 -27999 -24021 -8597 -1318 -32350 -60339 -30299 -2436 -5150 1160 15647 934 -3186 5640
16412 5640 8136 15594 2852 9098 26558 41431 20204 -2146 2023 6769 14647 9943 3890
16399 3890 8619 6190 8909 -1741 -19738 178 9620 5904 13313 -13503 -24948 -32982 -23196
16386b3196L5071j6059l97J7325R061J2535r82q510j159J9987J1452n19m0700
16373A3909l3672K1416j0334l363L592l450K5448J3535j7611J0253j8969J076
16361A830M619K568J1422N56P284J1522q806k4047l3503j453l038j2216R326J0162
16347b3774J6211O684l76M976K3606l5778j1208J3830l191j2726Q80l208K2216
16334a858r438r483J7562K5361J3000k469j9375m8450j0817n308L3098J8330k2647
16321b2494J5163J6269j3061k8525p496K0234J0631J3978M206r260j5879K7725
16309A1491L068n30j2116J1962J4663m146j1015j003j455J6853K5680r820r904
16296C3728k3014o292L227L203k612n265J0676K1642J0018L720J001j3539k3950
$$ plain form
16386 -23196 11875 -4184 -4581 12744 21805 34340 33358 24848 23689 43676 55128 54609 13909
16373 13909 -19763 1653 -8681 -12044 -8452 -11902 13546 27081 9470 19723 754 1830
16361 1830 6449 9017 20439 20995 28279 39801 30995 6948 -26555 -28008 -31046 -43262 -33936 -23774
16347 -23774 -7563 -879 -1255 3721 27327 -8451 -19659 -5829 -9020 -21746 -20866 -24074 -1858
16334 -1858 -11296 -20779 -3217 22144 35144 32675 13300 -35150 -45967 -51275 -18177 153 -22494
16321 -22494 -7331 8938 -4123 -32648 -40144 -19910 -9279 4699 8905 -355 -16234 11491
16309 11491 14559 14029 1913 13875 28538 24392 13377 12374 10919 27772 53452 43632 33728
16296 33728 10714 4422 7649 10852 8240 2975 13651 35293 45311 49031 50032 36493 12543
16283A2543j479P393j4581m570K885j4916o188M2979K969r527q426j6937j1813
16270a9668O27O015K7652J4455j2588j0714p943P396K103J3456o941k668n801
16257E381M736N778r595K3654J0368K022Q294J595j1730K945j843J0734j8594
16244C3745l1375L792J4475J2240M859Q333n190m578l375r006Q927Q119m924j5117
16230B0925K2884P592J142J3127l1853k1981N604J5995J4560j9689k9592M286
16218C000Q556k2186l5104r25J9395J6578L3925M2062K1062l4961m0108j3912
16206b618K6831J8841L1718r646j7264M552K66j7423q637J3120K8022n41r327
16193E7894j6208M517j1291r700J0862L673J5794p075m2103J2638k0345n5095
$$ plain form
16283 12543 11064 18457 3876 -694 2191 -12725 -18913 24066 27035 17508 9082 -7855 -19668
16270 -19668 -19041 -13026 14626 29081 16493 5779 -2164 5232 7335 20791 13850 11182 5381
16257 5381 10117 15895 6300 29954 40322 42344 50638 52233 40503 43448 41605 52339 33745
16244 33745 2370 6162 20637 32877 37736 46069 40879 36301 32926 23920 32847 40966 36042 20925
16230 20925 43809 51401 52543 65670 33817 11836 17440 33435 47995 28306 -1286 3000
16218 3000 11556 -10630 -45734 -46659 -27264 -10686 23239 65301 86363 51402 11294 -2618
16206 -2618 24213 43054 74772 65126 47862 52414 52680 35257 26620 39740 67762 67221 57894
16193 57894 41686 46203 34912 25212 36074 39747 55541 48466 6363 19001 -1344 -56439
16181e6439r347K5555M0432J0025j6402P819K8400o281l5707j9525q871N636L4209
16168d96J2578q846M889J6776K0322K2124k694n463k7481J3493J7267K7249j4166
16155G5552n939J2458l0926k8329p427J597J768O560J2886r894L9269M852k1279
16142E1148j529k4072k6105J5783J1809j2663j6126J0806O121k754j2573j2477
16130a2632j9460M823J1594m551L872o332j6171P056J7623L27q540J1702N474
16117e215J3887r196L71l2693o294l739k6526O503N719M80K6564K7509Q82J564
16103a84J9894m383j7302p324P253k013J6234R77J7687r628j9799m785M17Q820
16089E864Q733n209k088j4552o833o250K2377N482j3500M097j881j4693K6082
$$ plain form
16181 -56439 -65786 -40231 201 10226 -6176 1643 30043 23762 -11945 -31470 -40341 -34705 -496
16168 -496 12082 3236 8125 24901 45223 67347 64653 59190 31709 45202 62469 89718 75552
16155 75552 69613 82071 51145 22816 15389 16986 18754 25314 38200 28306 67575 72427 51148
16142 51148 49619 25547 -558 15225 27034 14371 -1755 9051 15172 12418 -155 -12632
16130 -12632 -32092 -27269 -15675 -20226 -16354 -22686 -38857 -31801 -14178 -13851 -22391 -10689 -5215
16117 -5215 8672 -524 -153 -32846 -39140 -42879 -69405 -62902 -57183 -56703 -30139 -2630 -1748 -184
16103 -184 19710 15327 -1975 -9299 -2046 -4059 12175 13152 30839 21211 1412 -3373 -2956 5864
16089 5864 14597 9388 7300 -7252 -14085 -20335 2042 7524 -5976 -1879 -3760 -18453 7629
16076G629L2201n445j7040P258J0805k183j8573k38O298k0604j2494K346j68J1558
16062A350O793P529o023l4547m550J1002R281r638j699K6507K5511J1705J0465
16049E3686l1282k2034O898l213K293K1372L081j069j9053J1786J4613J0435r107
16036C8406j1216Q432j5757k4938L460q630l3052L4043j20l3995J3162K6651J7299
16023A3745p381j2522L4107J3342q163J4232J647j154j4617k4992k1031o362m955
16010b4104j3414M9211J1256p803n712j2259j9542P48K789j0163q531J8613L8149
15997A9238K4303l3785k0415o738k521N294n675r378k6319o269K1134K2547K1658
15984C074K4284J0624O359P298j6931l4o156m0987k5899M370J8382L6449K80k2346
$$ plain form
16076 7629 39830 34385 17345 24603 35408 33225 14652 14414 20712 108 -12386 -10040 -10208 1350
16062 1350 8143 15672 9649 -24898 -29448 -18446 -9165 -18803 -20502 6005 31516 43221 53686
16049 53686 22404 370 7268 4055 6348 27720 30801 29732 10679 22465 37078 47513 38406
16036 38406 27190 35622 19865 -5073 -1613 -10243 -43295 -9252 -9372 -43367 -30205 -3554 13745
16023 13745 6364 -6158 27949 41291 33128 47360 49007 47853 33236 8244 -12787 -19149 -24104
16010 -24104 -37518 11693 22949 15146 9434 -2825 -22367 -21619 -18830 -28993 -37524 -18911 19238
15997 19238 43541 9756 -10659 -17397 -19918 -14624 -20299 -29677 -55996 -62265 -41131 -18584 3074
15984 3074 27358 37982 44341 51639 34708 34674 28518 -12469 -38368 -33998 -15616 20833 21113 -1233
15970a233J0914j1952j0392N146J6257j0003N535J3532P918N980j019o969J5474
15957C9188N845j1489k2143j4867k203m140l999J2852J4792k0993J2729R412j5954
15944i70J6992n845j5170L506K8347J2840q243J5332k9295j8304l968J7017K4674
15931C6913L567k0490j7914L169o313p946L0423n77m3421j3627Q734J4404O713
15918f365j0848q46Q697K7815k8449j8046j2781q045J9767R796q869j957J5846
15905a4285K5953j4389k4301k573J8505K7682O399j6063q579J0822J9164n77k6977
15892G81k1694o395L3385p173m1504L248O415j2088J04O143j412n488J8977J8865
15878g836j4254l0552K2135L7359j7550K694K9743j3127o694j2329o143K8549
$$ plain form
15970 -1233 9681 -2271 -12663 -7517 8740 -1263 4272 17804 25722 31702 30683 23714 39188
15957 39188 45033 33544 11401 -3466 -5669 -9809 -13808 -956 13836 -7157 5572 14984 -970
15944 -970 16022 10177 -4993 -1487 26860 39700 31457 46789 17494 -810 -4778 12239 36913
15931 36913 40480 19990 2076 5245 -1068 -9014 21409 20832 -22589 -36216 -27482 -13078 -6365
15918 -6365 -17213 -18059 -9362 18453 -9996 -28042 -40823 -48868 -29101 -19305 -28174 -30131 -14285
15905 -14285 11668 -2721 -27022 -29595 -11090 16592 22991 6928 -1651 9171 28335 27758 781
15892 781 -20913 -27308 6077 -1096 -42600 -39352 -32937 -45025 -44921 -38778 -40190 -45678 -26701 -7836
15878 -7836 -22090 -52642 -30507 6852 -10698 -8004 21739 8612 1918 -10411 -16554 11995
15866A1995K0228k7858j1876j8561k7724O346J8838Q769R792m719L024P594J9193
15853A5041K0320p205m3989j814J2920M8014q590l860P133k2558k8034j9450j1530
15840d3602K1347M0559j0603k6273j434L9539j1455j3763j0211J0531r935k4400
15828c9700J7471K4100J1380L264l483p084q119P61L428Q576j0744k6480J295
15815b5335M2010J2723J420j3838K323L0021k0957k6162J973K943P564k981M973
15802A6677k3377j158J8115J6207o602j4755M943J0691j4189j0100O314K485j7218
15789a1967j1669K0939Q317o016r631j8618M959n656j2730Q896L963L2321K2531
15776B5639J3377r407k1109o003J4547J6055O089k2106k3938K5100O945r766j3104
$$ plain form
15866 11995 32223 4365 -7511 -26072 -53796 -47450 -28612 -19843 -10051 -14770 -11746 -4152 15041
15853 15041 35361 28156 -15833 -17647 -4727 43287 34697 30837 37970 15412 -12622 -32072 -43602
15840 -43602 -22255 18304 7701 -18572 -20006 19533 8078 -5685 -15896 -5365 -15300 -39700
15828 -39700 -22229 1871 13251 16515 13032 5948 -2171 -1410 2018 10594 -150 -26630 -25335
15815 -25335 16675 29398 30818 16980 19303 49324 28367 2205 4178 7121 14685 11704 16677
15802 16677 -6700 -7858 10257 26464 19862 5107 10050 20741 6552 -3548 2766 5251 -11967
15789 -11967 -23636 -2697 5620 -396 -10027 -28645 -23686 -29342 -42072 -33176 -29213 3108 25639
15776 25639 39016 29609 8500 2497 17044 33099 39188 17082 -6856 18244 25189 15423 2319
15763B319p948l994j5680j8769K1133K8456O897Q255j6007L12l437j1299k6256
15750c6018J8721J0935k1015K20P902n099P136M0316j33j5017J4386O001l6672
15737h337j5735M173n453l89k620J4192L0581j468M756Q300K2163j7810k180j2187
15723A7986k0949K255J9853Q595l0625j6480r141P556N046J351j6747j2889J3763
15710c0426J2994K938J1113J2257J7573p710Q015J0932j0149J0344r416p780j7755
15697B930J7321J0725O048m109J5887J9851J8923k6418m1981j619J7858J1077
15685D6493l0847l2994l3848k812J0495N142L9089K5997j0878q363K0164R641
15673C7279l2939j7753j6735K99r825K4287J5635K409J0272j0967j7749r905M6
$$ plain form
15763 2319 -5629 -9623 -25303 -44072 -22939 5517 12414 20669 4662 4974 1537 -9762 -36018
15750 -36018 -17297 -6362 -27377 -27157 -19255 -24354 -17218 23098 22965 7948 22334 28335 -8337
15737 -8337 -24072 -19899 -25352 -25741 -28361 -14169 16412 14944 19700 28000 50163 32353 30173 17986
15723 17986 -2963 -708 19145 27740 -2885 -19365 -28506 -20950 -15904 -14553 -31300 -44189 -30426
15710 -30426 -17432 -14494 -3381 8876 26449 18739 26754 37686 27537 37881 28465 20685 2930
15697 2930 20251 30976 37024 32915 48802 68653 87576 61158 19177 17558 35416 46493
15685 46493 15646 -17348 -51196 -54008 -43513 -38371 718 26715 15837 7474 27638 37279
15673 37279 4340 -13413 -30148 -29849 -39674 -15387 248 2657 12929 1962 -15787 -25692 -25646
15660b5646J352m386r735K7736P519m054j7816K357J2753K2122R980j2920k5367
15647a6105K105J8400M2835K656j0440k2485j5833p684K821p672K313K1675J9704
15634C2290Q547p653l6307l0266j2110Q387J1314P636J5133o500J9120R058m193
15621A4456P929j0984k623q601O538o964n896N321N930j0739j1073m568j5447
15608c6721J1738K6110K8722k1357k7144n971o815J1850L217k056j1747J4398
15596a5776n745n315K6049m255k455l591Q924R451M973k8741j4138j8765K7939
15583b1445K2735j1200o289J7562K8704j868m794q588q198Q844N278O601K1196
15570D8538j2018l5765j5583m515o57o273J4886L1603L047J286J4181q551J929
$$ plain form
15660 -25646 -24294 -28680 -38415 -10679 -3160 -7214 -25030 -22673 -9920 12202 22182 9262 -16105
15647 -16105 -14000 4400 47235 49891 39451 16966 1133 -6551 -3730 -11402 -9089 12586 32290
15634 32290 40837 33184 -3123 -33389 -45499 -37112 -25798 -18162 -3029 -9529 9591 18649 14456
15621 14456 22385 11401 8778 177 6715 -249 -6145 -824 5106 -5633 -16706 -21274 -36721
15608 -36721 -24983 1127 29849 8492 -18652 -24623 -31438 -19588 -16371 -18427 -30174 -15776
15596 -15776 -21521 -26836 -787 -5042 -7497 -11088 -2164 7287 12260 -16481 -30619 -49384 -21445
15583 -21445 1290 -9910 -16199 1363 30067 28199 23405 14817 6619 15463 20741 27342 48538
15570 48538 36520 755 -14828 -19343 -20000 -26273 -11387 20216 23263 24549 38730 30179 32108
15557C2108J0573k0051r943J1768J433N307n667k230J1266l2470j8072J1893j725
15544e810R686O382J46o722k180q098l557j6263j949m695J6539K0677j0070J0223
15530D309m698j0168O523j2603K2916J0271K499k0474k2874n668R268L4787K2194
15517C6282k099j1474j4892K2500J757P217j5231l4773K4039n94P720m662p007
15504H783j1875j7237j6168k6143K2074O6301J2916j9666k2308N378K2238K9365
15492E3658P96r585k9671r019K412j6101R077q708K4350L7619n380j4336k3572
15479A1540p385P48q715k9727j6504J2686K615J7647O826L424O949j335J7727
15466A6496J0031j157l1273O446l909j3491K3533J4646l1214m469J6133j2405
$$ plain form
15557 32108 42681 22630 12687 24455 25888 31195 25528 23298 34564 2094 -15978 -4085 -5810
15544 -5810 3876 10258 10404 3682 1502 -6596 -10153 -26416 -28365 -33060 -16521 4156 -5914 4309
15530 4309 -389 -10557 -4034 -16637 6279 16550 19049 -1425 -24299 -29967 -20699 14088 36282
15517 36282 34183 22709 7817 30317 32074 39291 24060 -10713 13326 12732 20452 15790 8783
15504 8783 -3092 -20329 -36497 -62640 -40566 25735 38651 18985 -3323 2055 24293 53658
15492 53658 54454 44869 15198 6179 8591 -7510 1567 -7141 17209 54828 49448 35112 11540
15479 11540 4155 4903 -3812 -33539 -50043 -37357 -34742 -17095 -10269 -6845 104 -1231 16496
15466 16496 26527 25370 -5903 543 -3366 -16857 6676 21322 -9892 -14361 1772 -10633
15454a0633j167o367K26M703K224J7351k7413k7406o033K8868R586j2049M63M266
15440b3381J3985q558j2944J1374J4000J2101K0310J3638k2092J68P031J5964
15428D1596m1393j0790n378O042J845j2753J7455m590j535K9096M139l8545m242
15415a9053p004J830K990J9015K072J1288L960J7884j1138k3136p08K4084L328
15402B5412l5713Q228J1915L8180o24r703m0726o43m557k497J7783M0398J936
15389D9389j9424O048k7118j4193N832O304J3912p460q15j0951J435Q171n830
15376E300K2885J4813l0544J55K571m798o594J9409K3803K205k397j7471k00n49
15362B8588l4862j6869n594K9078M6225M269m435j3666P777n055k4426L747O473
$$ plain form
15454 -10633 -11800 -18167 -17941 -13238 -11014 6337 -21076 -48482 -54515 -25647 -16061 -28110 -27647 -23381
15440 -23381 -9396 -17954 -30898 -19524 -5524 6577 26887 40525 18433 18601 25632 41596
15428 41596 203 -10587 -15965 -9923 -8078 -20831 -3376 -7966 -9501 19595 23734 -14811 -19053
15415 -19053 -26057 -24227 -21237 -2222 -150 11138 15098 32982 21844 -1292 -2000 22084 25412
15402 25412 -10301 -2073 9842 48022 47398 37695 -3031 -3674 -8231 -10728 7055 47453 49389
15389 49389 29965 36013 8895 -5298 534 6838 20750 13290 12475 1524 2959 11130 5300
15376 5300 28185 42998 12454 12609 15180 10382 3788 23197 47000 49205 46808 29337 29137 28588
15362 28588 -6274 -23143 -28737 341 46566 50835 46400 32734 40511 35456 11030 14777 21250
15349B1250l4465j9345j978P154K0101P301q717j0943l607R318Q088p70L4323
15336B7710K986p254m0733j1867K1726J5959l278p88J4384l1796j9674J2896K0650
15323I21N483J9756Q785L926n141j3623n029r385k6153K6280R646k9165K1401
15310G702N247l8689o061l635K0444L2864K8858K731m9653l2817l222Q315J2832
15297a5084n833k491K3331J6148K2748J897j895j5059j253j6387k1036j2373K0079
15284g208p557k5276M616J1057K2824l716N631J2812r27R108R779k0276l5786
15271b4919l2953Q426R887J3757J1733J0310K577m265L2850J0423K6j3064O357
15258C1145J7297j2908m0721k3508j118K3332R817O596J4977J2243K7419P328
$$ plain form
15349 21250 -13215 -32560 -34538 -27384 -7283 18 -8699 -19642 -23249 -13931 -5843 -6613 27710
15336 27710 30696 23442 -17291 -29158 -7432 8527 5249 4461 18845 -12951 -32625 -19729 921
15323 921 6404 26160 34945 38871 33730 20107 15078 5693 -20460 5820 15466 -13699 7702
15310 7702 12949 -25740 -31801 -35436 -14992 17872 46730 49461 -192 -33009 -36231 -27916 -15084
15297 -15084 -20917 -23408 -77 16071 38819 40716 38821 23762 22509 6122 -14914 -27287 -7208
15284 -7208 -14765 -40041 -35425 -24368 -1544 -5260 371 13183 12256 21364 31143 10867 -24919
15271 -24919 -57872 -49446 -39559 -25802 -14069 -3759 -1182 -5447 27403 37826 37852 24788 31145
15258 31145 48442 35534 -5187 -28695 -29813 -6481 3336 9932 24909 37152 64571 71899
15246G1899l5928k4742j9627k8089j5519L9468P772m90j1253n713j6816Q343J9860
15233a0835J4107K879L675J5858J143j9426J074j1962p787M039m035K168j2499
15220b1601J2715K3630K795K9977j4005l4584P63K1729L297R966k4708j3799l1675
15207c5500k4855J0604L8324K2728M330l0847j8982J5968J4812j1372p23J7360
15195A847m397j6747m675j709J3063J990J8316L1887j2951M155J0790j9998j3970
15182G601J5587J6458m81k1839r638J4443L5357j3105m612k6257k010K4245m192
15169C1557q166r597q324P966L269j2648k479j1585l6133J9055K3099L46j1303
15156a4943r239K0955Q889J3146J755O24j5891l0100k79M045R074J2580M128R888
$$ plain form
15246 71899 35971 11229 -8398 -36487 -52006 -12538 -4766 -5256 -16509 -22222 -39038 -30695 -10835
15233 -10835 3272 6151 9826 25684 26827 7401 8475 -3487 -11274 -7235 -11270 -9102 -21601
15220 -21601 -8886 14744 17539 47516 33511 -1073 -310 21419 24716 34682 9974 -3825 -35500
15207 -35500 -60355 -49751 -11427 11301 15631 -15216 -34198 -18230 -3418 -14790 -15513 1847
15195 1847 -2550 -19297 -23972 -25681 -12618 -10628 7688 39575 26624 30779 41569 21571 7601
15182 7601 23188 39646 39165 17326 7688 22131 57488 44383 39771 13514 11504 35749 31557
15169 31557 23391 13794 5470 13436 16705 4057 1578 -10007 -46140 -27085 -3986 -3640 -14943
15156 -14943 -24182 -3227 5662 18808 20563 21187 5296 -24804 -25083 -21038 -11964 616 4744 14632
15142A4632J1424m578r165p086j3823R637K1943j0091k0082l369J4670l3868r629
15129c9385K2499M713J324j2993j592J4959k484j0892r620N95P506p660m5015
15116g8045J0410N856q667R135N3075K7730k9052j8360l313K8215p152l7213J2200
15103c5181J4361J2345L2100N806l4668k0460L6189l926j556J2050N185k271K578
15090B2552j2891k7517l2937j9906K6644J5151Q23j0172L497L5127j3657k9503
15078d2789k9275k1686K6567K1712J4307Q207m935K0740L3688J0758l5960l1584
15066c0250R442n391j1387K3455J6449p138m067j6738j1910k947J3316J4652J5746
15053C232k2452j0714j6058J9525J6879p62J6574j0311J4209k705l6408k6100
$$ plain form
15142 14632 26056 21478 12313 5227 -8596 1041 22984 12893 -7189 -10558 4112 -29756 -39385
15129 -39385 -16886 -12173 -10849 -23842 -25434 -10475 -12959 -23851 -33471 -32876 -25370 -33030 -78045
15116 -78045 -67635 -61779 -70446 -61311 -8236 19494 -9558 -27918 -31231 -3016 -10168 -47381 -35181
15103 -35181 -20820 -8475 23625 29431 -5237 -25697 10492 6566 5010 17060 22245 19974 22552
15090 22552 9661 -17856 -50793 -70699 -44055 -28904 -28081 -38253 -34756 371 -13286 -42789
15078 -42789 -72064 -93750 -67183 -45471 -31164 -22957 -27892 -7152 26536 37294 1334 -30250
15066 -30250 -20808 -26199 -37586 -14131 2318 -4820 -8887 -25625 -37535 -40482 -27166 -12514 3232
15053 3232 -19220 -29934 -45992 -26467 -9588 -10350 6224 -4087 10122 7417 -28991 -55091
15041e5091k2810P568K5809K2383J7029N753J0337l965l313q990J1494P14k5797
15028a8879m079j4723O226L0430p850j2926o454k46q130r559L278J9781l110q240
15014c4481K1365J2203o154J2151j6029J9207J8809K0285j5355J34n479k8J1491
15001C8119N8646L6734M1347N6956R1117J72579K74019L02215J78647o920k4625
14990A218834N8802k2613m18433l23333j75318n7922l2886l2024j8877o854j833
14979A87543n640k2376l9404j3896J0733j3817k0359Q271M449Q414o223l8329
14967E9366N634J6371l1433q470j0396k4836j6727J067R717K4684R492k7408n91
14954F470L3207J4919j6373j0890k6489j2040J5032j6051J0627K1712R29O875
$$ plain form
15041 -55091 -77901 -70333 -44524 -22141 -5112 641 10978 7013 3700 -5290 6204 6918 -18879
15028 -18879 -22958 -37681 -31455 -1025 -8875 -21801 -28255 -28501 -36631 -46190 -42912 -23131 -26241 -34481
15014 -34481 -13116 -913 -7067 5084 -10945 8262 27071 47356 32001 32135 26656 26628 38119
15001 38119 96765 133499 174846 231802 322919 495498 769517 1071732 1250379 1243459 1218834
14990 1218834 1277636 1255023 836590 513257 337939 280017 247131 215107 196230 189376 187543
14979 187543 181903 159527 120123 106227 116960 103143 82784 91055 95504 103918 97695 59366
14967 59366 65000 81371 49938 41468 31072 6236 -10491 -9424 293 24977 34469 7061 6470
14954 6470 39677 54596 38223 27333 844 -11196 3836 -12215 -1588 20124 21053 27928
14942B7928l0368N304J3373M475l322J232n103N368j1169j2915n82J0340J6224
14929B0785j8512r830j9331J560N5545m676k3500k2280j4659O723L844j0416J2104
14916b2643N728k499l87K0968O487Q431j5869M373K586M478M128J4190k7907r668
14902g604J5273J8209J2319l3196r094j9818j2530K68K645P685K1629q945q58
14889a4017k6672j1063L424J6048K4501J8155m270j526J0766j6314q703j0793
14877b0464K551K5359K6035K0934k1233l0943N58J4270r462o496k8356j5930O136
14864c7041R053J8540L5011M361k9209j6368K2525J484j3027L741L5680o79k2020
14851A2051k405P363N086J271J1291N678j4573k2715j8630O932m008J376j5716
$$ plain form
14942 27928 -2440 2864 16237 20712 17390 18622 13519 18887 7718 -5197 -5779 4561 20785
14929 20785 2273 -7557 -26888 -25328 30217 25541 2041 -20239 -34898 -28175 -24331 -34747 -22643
14916 -22643 -16915 -19414 -19801 1167 7654 16085 216 4589 7175 11653 15781 29971 2064 -7604
14902 -7604 7669 25878 38197 5001 -4093 -23911 -36441 -36173 -33528 -25843 -4214 -13159 -14017
14889 -14017 -40689 -51752 -48328 -32280 -7779 10376 6106 4580 15346 -968 -9671 -20464
14877 -20464 -17913 7446 33481 54415 33182 2239 2797 17067 7605 1109 -27247 -43177 -37041
14864 -37041 -27988 -9448 25563 29924 715 -15653 6872 8356 -4671 -930 34750 34071 12051
14851 12051 9646 17009 22095 23366 34657 40335 25762 3047 -15583 -8651 -12659 -11283 -26999
14838b6999l29J5488J3775L388L578o47j3050j0440K5974J531k6833j3910K7698
14825g76O781j6611O851J241O137n631l1060j9097J1472K4106j3240j2150K631
14812c9346j0118J0503J6708q53k2141K0514J6806K9629J1967l3566j100J4499
14800A3502K0730k8588m2500p204R739J1390M851j1944j1932J654Q694J3663K5580
14787G635K198l7656o096p684l524K9825J622m0749j147K7808J3276m962J1282
14774h172J1670L322J6691K719j3007j8506k9906P294J6908k1581j7660K6299
14762b3929L1148j2304m031Q780L919k944l465n273O138J2223m407l2645p307
14749c4097J3323J6660k6892k9115j5708K8924J8049P511j5314J4419k0623j5417
$$ plain form
14838 -26999 -27328 -11840 1935 5323 8901 8254 -4796 -15236 10738 12269 -14564 -28474 -776
14825 -776 6005 -10606 -3755 -2514 3623 -2008 -33068 -52165 -40693 -16587 -29827 -41977 -39346
14812 -39346 -49464 -38961 -22253 -23106 -45247 -24733 -7927 21702 33669 103 -997 13502
14800 13502 34232 5644 -36856 -44060 -34321 -22931 -18080 -30024 -41956 -40302 -31608 -17945 7635
14787 7635 9833 -27823 -33919 -41603 -45127 -15302 -13680 -54429 -55576 -27768 -14492 -19454 -8172
14774 -8172 3498 6820 23511 26230 13223 -5283 -35189 -27895 -10987 -32568 -50228 -23929
14762 -23929 7219 -5085 -9116 -336 3583 639 -2826 -8099 -1961 10262 5855 -26790 -34097
14749 -34097 -20774 -4114 -31006 -60121 -75829 -46905 -28856 -21345 -36659 -22240 -42863 -58280
14737e8280J2997J5487K0578K6889j3178j6655Q349k7241P394j1714L478j719
14725c3615K372K954K590M548Q218j227j9833K4722J7602o192m962r652l366K8021
14711A2180J7905k2561k9029q857o312L07K4397L6360J8173k0237K0309j91k1853
14698B0591J55j6633p082P999j529m903K7526O757N755j6859k6804k2382Q95r866
14684c6380L5133L204o054J212J3557K593j5574j2021N827L8279j3768k9159l6671
14671d9822j2645O495K5950q36L1630K211j0621J0750J8139M031r426l1090k5314
14658d0548j6307J8637L4749K838K6654K0051m7595l2950n801K8710j1180j7061
14646c9803j909p860m326K6791K2656j7536k0769k0398J4799L7205Q734l3918
$$ plain form
14737 -58280 -45283 -29796 -9218 17671 4493 -12162 -3813 -31054 -23660 -35374 -31896 -33615
14725 -33615 -31243 -28289 -25699 -21151 -12933 -14160 -33993 -9271 8331 2139 -2823 -12475 -15841 12180
14711 12180 30085 7524 -21505 -30362 -36674 -36367 -11970 24390 42563 22326 42635 42444 20591
14698 20591 20746 4113 -2969 5030 3501 -1402 26124 32881 38636 21777 -5027 -27409 -26514 -36380
14684 -36380 -1247 1957 -4097 -2885 10672 13265 -2309 -14330 -8503 29776 16008 -13151 -49822
14671 -49822 -62467 -55972 -30022 -30858 772 2983 -7638 3112 21251 25282 15856 -15234 -40548
14658 -40548 -56855 -38218 -3469 -631 26023 46074 -1521 -34471 -40272 -11562 -22742 -39803
14646 -39803 -41712 -49572 -53898 -27107 -4451 -21987 -42756 -63154 -48355 -11150 -2416 -36334
14634c6334P751M1360j2511L793L1819K889l3560k2226K1201J3735Q168k505j7076
14621F504j9192l3312p72P211j7386P588J1396q306K885K1978L7221k8304l2422
14608d4911J2013K3028j2238R55J1669q231p271K4168J2053j0704p070M163k185
14595d561k5217r190N325J1513l36l232P235J6591K885L761l2168j5321K823J7384
14581b2508K3878J1178K8625M395l3126k9565j3657j2695m819J1580J1918R161
14569a5635K8928M573k9695J2262J5633j1125k0143j3650J812o469J615j020N264
14556b7650n414O711K0773k869J19o202O491j0460q079l6123j0495L0825J7123
14543b5250J41J3262j5544j8273P115k059K2101k4073k5978O750J0155K1095p002
$$ plain form
14634 -36334 -28583 12777 266 4059 35878 38767 5207 -17019 4182 17917 26085 23580 6504
14621 6504 -12688 -46000 -46772 -39561 -56947 -49359 -37963 -46269 -43384 -21406 15815 -12489 -44911
14608 -44911 -32898 -9870 -22108 -21153 -9484 -17715 -24986 -818 11235 531 -6539 -2376 -4561
14595 -4561 -29778 -38968 -33643 -22130 -22466 -25698 -18463 -1872 1013 4774 -27394 -42715 -39892 -22508
14581 -22508 1370 12548 41173 45568 12442 -17123 -30780 -43475 -48294 -36714 -24796 -15635
14569 -15635 13293 17866 -11829 433 16066 4941 -15202 -28852 -27040 -33509 -31894 -32914 -27650
14556 -27650 -33064 -26353 -5580 -8449 -8330 -14532 -8041 -18501 -26580 -62703 -73198 -42373 -25250
14543 -25250 -25109 -11847 -27391 -45664 -38549 -40608 -18507 -42580 -68558 -61808 -51653 -30558 -37560
14530c7560L4690N383j8808J0864P521j1829K749j3257j6939o239J9056K2802
14518a567k3550j7539J3357o498k551K7508Q919J2645K6819K5380j3753l1122
14506A8048j598J2941j0982j7754n067m001J943L203J3783R468P417L9548k3970
14493D2979j4192O887k2771n2801K600K2366J9688O22k7402O189m081Q762K6702
14480A5548k678j9092l0216J1808K2103j7328l195J2976K0618J0441k8837k4109
14468c1961L0390K4361j2811j5242n148M2682K9547j8688k0187j5128L596Q430
14456A9841J2472L824j7600J787K3858j6891J0482j5713l7028q434O673P240k2086
14443c1575n731j871J6304J2221P01j1335R590K744Q6l0554K1614L9273n805m2553
$$ plain form
14530 -37560 -2870 2513 -16295 -5431 2090 -9739 -6990 -20247 -37186 -43425 -24369 -1567
14518 -1567 -25117 -42656 -29299 -35797 -38348 -10840 -1921 10724 37543 62923 49170 18048
14506 18048 16450 29391 18409 655 -4412 -8413 -6470 -3267 10516 19984 27401 66949 42979
14493 42979 28787 35674 12903 -39898 -37298 -14932 4756 5378 -22024 -15835 -19916 -11154 15548
14480 15548 12870 -6222 -36438 -24630 -2527 -19855 -23050 -10074 10544 20985 -7852 -31961
14468 -31961 -1571 22790 9979 -5263 -10411 32271 61818 43130 22943 7815 11411 19841
14456 19841 32313 36137 18537 20324 44182 27291 37773 22060 -14968 -23402 -16729 -9489 -31575
14443 -31575 -37306 -39177 -22873 -10652 -9951 -21286 -11696 -8952 -8866 -39420 -17806 21467 15662 -26891
14429b6891j1518J1220L1455N141r207m900q24J585j931n578k3701K379O360j0891
14415c7301J2809O37J8526K589K3628J7672j4621K096Q203k2622k500K2595l085
14402B8626k0343R442r025k1304J3308M656j4068k6386j1741L4430K786P09Q598
14389c12Q340J5726k8385j6054J8042K8292N086m271j3540L054l5032Q343K5920
14376A5209r633L035J0004j1862l7J2977l0806l4714J2618L8099K2694j2692k1371
14363f479k0995j4945R024j686J2056J7870j6991J0618r607j3185J5869Q283r399
14350a9567J3553q916Q2K0917l980j6443J5540L562l0817j0077K1733K3824J6324
14337B5735R938k6378p227J7099J8000o916o613J107K7749O533k9026l8996n529
$$ plain form
14429 -26891 -38409 -27189 4266 9407 200 -4700 -5524 -3939 -5870 -11448 -35149 -32770 -26410 -37301
14415 -37301 -24492 -23855 -5329 -2740 20888 38560 23939 26035 34238 11616 9116 31711 28626
14402 28626 8283 17725 8700 -12604 704 5360 -8708 -35094 -46835 -12405 -9619 -8910 -312
14389 -312 8028 23754 -4631 -20685 -2643 25649 30735 26464 12924 15978 -19054 -10711 15209
14376 15209 5576 8611 18615 6753 6716 19693 -11113 -45827 -33209 4890 27584 14892 -6479
14363 -6479 -27474 -42419 -33395 -35081 -23025 -5155 -22146 -11528 -21135 -34320 -18451 -10168 -19567
14350 -19567 -6014 -14930 -14848 6069 2089 -14354 1186 4748 -26069 -36146 -14413 9411 25735
14337 25735 35673 9295 2068 19167 37167 30251 23638 24745 52494 59027 30001 -8995 -14524
14324a4524j1431K7268L1719Q327k5814j8727N74J3483K046l700k137J4788n017
14311A6855j5179m0486j4840M4485K3103j2512N494m054l851L3327L7465l1160
14299C8647m4875p230J840j1988j082j7464o679k5256L5400J4186J0195o580r082
14286b9968r81K0850j873j3827M267l093q38L281N964K57Q588K830r351l1063
14272d4957P044P71L4160j1609j6199K120K0305K0708J7035n00k8283k555L093
14259A133j654j6125j3519m723j86K8203J8530r174o586l893l2972o438O983L229
14245c7192J4222m531N635j5934N245J2119M44m357K5508J6509n295N448j5077
14232B744j8952Q971L2975L106l437J9741l60j0951j1397l8294J60J0083m186
$$ plain form
14324 -14524 -25955 1313 33032 41359 15545 -3182 -2608 10875 12921 9221 7084 21872 16855
14311 16855 1676 -38810 -53650 -9165 13938 1426 6920 2866 -985 32342 69807 38647
14299 38647 -6228 -13458 -11618 -23606 -24688 -42152 -48831 -74087 -38687 -24501 -14306 -20886 -29968
14286 -29968 -30949 -10099 -11972 -25799 -21532 -24625 -25463 -22182 -16218 -15961 -7373 -4543 -13894 -44957
14272 -44957 -37913 -37142 -2982 -14591 -30790 -28670 -8365 12343 29378 28878 595 -1960 1133
14259 1133 -521 -16646 -30165 -34888 -35074 -6871 11659 2485 -4101 -7994 -40966 -47404 -40421 -37192
14245 -37192 -22970 -27501 -21866 -37800 -32555 -20436 -19992 -24349 1159 17668 12373 17821 2744
14232 2744 -16208 -7237 25738 28844 25407 45148 44788 33837 22440 -15854 -15694 -5611 -9797
14219i797r254j7394R806J6190k232J8545K8034q8j2940O543NJ4834o693j6659
14205A8900j0879Q2R520J232j5542j2958L6293j4485k3361q013L175R899J896
14192d241L2430J8253j086J6193K4045l2802l1906l4309j3445j0302M997K2395
14180i778K277l667J4444k311j4747l482R637r078o112K3214J2185O280p534M323
14166A5651k2012j8718j9628J8241J2819p233K2155J1941J8731k1069l4799j5353
14154c9274K6820m410k2378j7193L5039K3690N78J4633J4430K0156m096j7419
14142C0576j2989j6866n761O162J7089L939K34j6504Q646j150J9111k5024j4708
14129g245K877P521K4332K2814l880j8518l9938o791N74Q082M821o046o225K2904
$$ plain form
14219 -9797 -19051 -36445 -26639 -10449 -12681 5864 33898 33810 20870 27413 27418 42252 35559 18900
14205 18900 8021 8103 17623 18855 3313 -9645 26648 12163 -11198 -19211 -16036 -6137 -4241
14192 -4241 28189 46442 45356 61549 85594 52792 20886 -13423 -26868 -37170 -32173 -9778
14180 -9778 -7501 -11168 3276 965 -13782 -17264 -7627 -16705 -22817 397 12582 18862 11328 15651
14166 15651 -6361 -25079 -44707 -26466 -13647 -20880 1275 13216 31947 10878 -23921 -39274
14154 -39274 -12454 -16864 -39242 -56435 -21396 2294 2872 17505 31935 52091 47995 30576
14142 30576 17587 721 -5040 1122 18211 22150 22384 5880 14526 13376 32487 7463 -7245
14129 -7245 -4368 3153 27485 50299 46419 27901 -12037 -18828 -18254 -10172 -5351 -11397 -17622 5282
14115E282j4770k631J0635L3327J1092j356q30k6698l7104p522J5182j0475K1637
14102d231l439L415k5572j6340L8959J8680J7689K3434q317j3965m366p443L299
14089B1803K1737O836j5269M316j6030l5549p302L4213M1843j2096n3236n993
14077a4727J9076o910J2441J5770K0698O036l0201K290j1076N841O715J9414L671
14064D9038J80j3015k3522j6668J2479Q639j0992l0863M560K5831K9380n010j6846
14051A3191k430j2362L021N059l07k42K3617j3234l5349n971K8997o200k0079
14038b2289J6432J1579j6772m587K0640K7714m782j0697J692n889j1647K057o698
14025c247j8076J6293K5542K6773j7853j0968n088k312N375k0513m1206K7841
$$ plain form
14115 5282 -9488 -12119 -1484 31843 42935 41579 40749 14051 -23053 -30575 -15393 -25868 -4231
14102 -4231 -7670 -4255 -29827 -46167 -7208 11472 29161 52595 44278 30313 25947 18504 21803
14089 21803 43540 50376 35107 39423 23393 -12156 -19458 14755 56598 44502 -8734 -14727
14077 -14727 4349 -2561 9880 25650 46348 52384 22183 24473 13397 19238 25953 45367 49038
14064 49038 49218 36203 12681 -3987 8492 17131 6139 -24724 -20164 5667 35047 30037 13191
14051 13191 10761 -1601 1420 6479 6172 5930 29547 16313 -19036 -25007 3990 -2210 -22289
14038 -22289 -5857 5722 -11050 -15637 5003 32717 27935 17238 18930 13041 1394 3451 -3247
14025 -3247 -21323 -5030 20512 47285 29432 18464 13376 11064 16439 -4074 -45280 -17439
14013a7439P612m355J0201K357K3748J7809j1290K240k4695o20k93J3333J5823
14000C4431p414j9643k1236J4924J0591j9847j963m875J4594K910k656k272K813
13987C57K4383k6352N848l708j4713K456J6389J9305J1258K71k8829j5013p377
13974a5725k0916Q829K6198J0705J77J5982j4199j0853P900J7103K4923J466K4317
13961G5907K973j5809o19j508J3029j384k1251q566j7824k1019O069P549m186
13948A3361O552L2662J2122k0775k9567j118L5097j8983k8405n240J5545Q733
13936A9984j3541l0675k0325j097M4741M8436j4850r024Q491J2171K7995j0568
13924F1738j8371o013O766j2790j8350J4190L457j0389n225l860Q939R48q813
$$ plain form
14013 -17439 -9827 -14182 -3981 -1624 22124 39933 28643 30883 6188 5568 5275 18608 34431
14000 34431 27017 7374 -13862 1062 11653 -8194 -10157 -15032 -438 2472 -184 -2456 357
13987 357 24740 -1612 4236 528 -14185 -11729 4660 23965 35223 35494 6665 -8348 -15725
13974 -15725 -36641 -27812 -1614 9091 9268 25250 11051 198 8098 25201 50124 51590 75907
13961 75907 78880 63071 62452 60944 73973 72589 51338 42772 24948 3929 9998 17547 13361
13948 13361 19913 52575 64697 43922 14355 13237 48334 29351 946 -4294 11251 19984
13936 19984 6443 -24232 -44557 -45654 -913 47523 32673 23649 32140 44311 72306 61738
13924 61738 43367 37354 44120 31330 12980 27170 30627 20238 15013 11153 20092 21040 12227
13911A2227K4151J4641o551J828M14j3798o763N086P607k4187n6L4103L341n479
13897D6564o950j1225n433M738k091O813K699j7136K1924L3655r784k1975j410
13884D0389q2j9174k5104K5406M627k1648R153J3489r404l8574j5010L1171K708
13871b053P879L3664J3576r086p726k155j3157j0956j1627l789k2022O394L767
13858a7291k783k618q359M131J7886k119K971K5971k0390j6865K5L79j1008J8344
13844a1726q014N766J2383J3244J1846j625l5683n426K0015J3785J3650L350j9440
13831A2125j7582l56j585j045L2375K6187K7428q286j2216j2461j8533J609J2769
13818D0429J7428L940j3243l2218j158J092q30J1885j5692j6115j3036R40K6151
$$ plain form
13911 12227 36378 51019 44468 46296 46710 32912 26149 31235 38842 14655 14599 48702 52043 46564
13897 46564 39614 28389 22956 27694 25603 32416 35115 17979 39903 73558 63774 41799 40389
13884 40389 40307 21133 -3971 21435 26062 4414 13567 27056 17652 -20922 -35932 -4761 -2053
13871 -2053 5826 39490 53066 43980 36254 34099 20942 9986 -1641 -5430 -27452 -21058 -17291
13858 -17291 -20074 -22692 -31051 -26920 -9034 -11153 -8182 17789 -2601 -19466 -19441 -19062 -30070 -11726
13844 -11726 -19740 -13974 -1591 11653 23499 21874 -13809 -19235 780 14565 28215 31565 12125
13831 12125 -5457 -5813 -7398 -8443 23932 50119 77547 69261 57045 44584 26051 27660 40429
13818 40429 57857 61797 48554 16336 15178 16270 15440 27325 11633 -4482 -17518 -16578 9573
13805I573K5742K7237k4789k3231K890j091J1818k8357j9516k084J975J4836K8337
13792B3340O033p496j2258k9671p712J2669j756k5187p039L1651K0146L3507J3710
13779D9937Q89M934k2196j8050n889K0083K2534k2416j3771j1515o696J486J7701
13766A7031p76l2988K9137j779J7775K4736J7697o653q485j9947n052O545k8515
13753H726j0725J3980o475J6515l105j1024m262p619J2015P897K2885J1224j8017
13740C2015k4647J5139Q258K641K0049j9519l5956j1492N238M324J4430m186j5434
13727i140J2257K3440M533j0325o523J9304K0852M78j4678n864M756J7326j743
13714E4673R259R82n231j3269o198k539P331k2715j2766j58m145q705K5731J3508
$$ plain form
13805 9573 35315 62552 37763 14532 17422 16331 28149 -208 -19724 -21808 -19833 -4997 23340
13792 23340 29373 21877 9619 -20052 -27764 -15095 -16851 -42038 -49077 -17426 2720 36227 49937
13779 49937 50826 55760 33564 15514 9625 29708 52242 29826 16055 4540 -2156 -670 17031
13766 17031 16255 -16733 12404 10625 28400 53136 70833 64180 55695 35748 30696 37241 8726
13753 8726 -1999 11981 5506 22021 18916 7892 3630 -3989 8026 15923 38808 50032 32015
13740 32015 7368 22507 30765 33406 53455 33936 -2020 -13512 -8274 -3950 10480 6294 -9140
13727 -9140 3117 26557 31090 20765 14242 33546 54398 54876 40198 34334 39090 56416 54673
13714 54673 63932 64914 59683 46414 40216 37677 45008 22293 9527 9369 5224 -3481 22250 35758
13700C5758M750p966j28L881k0496m961j329J5488k0462K136K8230j745K5099
13687E8255J9862l7196j1041k943l16j2009n703J2002m923k1914R6L759P482l0087
13673b4676r297K0873M799J0756J0839K254m903J5856R651j4228j4709k577K8841
13660C3479M619l1468j8804q653O960K2181q506k3260J7988N394k4231J1860L8690
13647B6249J6009j8550j8710j0308K6157P671j789k465j935K3019J2895j8985
13635C9258J3152Q188k7613l372j1644r954m420J3001J6889J0423j8911l807J3951
13622C5141j1052j8381j5112O993K0131K0103L172p617J2004O386l744k1703j2050
13609A4271r951k390L9755L0433j1435r150k1587J6465N23j8234K0838J2003J7779
$$ plain form
13700 35758 40508 32542 32414 36295 15799 10838 9509 24997 4535 6671 34901 33156 58255
13687 58255 78117 40921 29880 26937 26621 14612 8909 20911 15988 -5926 -5830 -2071 5411 -24676
13673 -24676 -33973 -13100 -8301 2455 13294 15548 10645 26501 36152 21924 7215 4638 33479
13660 33479 38098 6630 -12174 -20827 -13867 8314 -192 -23452 -5464 -70 -24301 -12441 26249
13647 26249 42258 23708 4998 -5310 20847 28518 26729 24264 22329 45348 58243 39258
13635 39258 52410 60598 32985 29613 17969 8015 3595 16596 33485 43908 24997 21190 35141
13622 35141 24089 5708 -9404 -2411 17720 37823 40995 33378 45382 51768 48024 26321 14271
13609 14271 4320 1930 41685 72118 60683 51533 29946 46411 46934 28700 49538 61541 79320
13596G9320J5357j7115k5017K726k3454o740J5642K0663R019m1688l8177K8720
13584A9256K2354K7885P022j3520l3392N441L9945j5993j8245K0499k3p154k1641
13571C2434J479J6900N0146J3588L42J8668L823Q889L4554M7905L8006Q322K736
13558B77792k0805j0030l9957j8765q021k2978j1674j2483l6633k1368J7516K4750
13546A17344O232j9534k444j3941q654j678q119M045j939k2726j8316K149K7478
13533E9897j0028J4587J1955K647r147N538K6860J9376J0320K4227K4696J2689
13521A93617J5821N5770J06659J24243J34611Q0706O79J65J5366j7306j68831
13510E41500j47092r3283o6973k7929J854j7505K531J0848k1016l6309l4572r889
$$ plain form
13596 79320 94677 77562 52545 55271 31817 25077 40719 61382 70401 28713 -9464 19256
13584 19256 41610 69495 76517 62997 29605 35046 74991 58998 40753 61252 61229 54075 32434
13571 32434 33913 50813 100959 114547 114889 133557 137380 146269 180823 228728 266734 275056 277792
13558 277792 256987 246957 207000 188235 180214 157236 145562 133079 96446 75078 92594 117344
13546 117344 123576 104042 101598 87657 79003 77325 69206 73251 71312 48586 30270 32419 59897
13533 59897 49869 64456 76411 79058 69911 75449 102309 121685 132005 156232 180928 193617
13521 193617 209438 265208 371867 496110 630721 711427 712106 712271 727637 710331 541500
13510 541500 394408 301125 234152 206223 208077 190572 193103 203951 182935 146626 112054 102165
13498A02165J9596J6181p181M253L127n865J4514J3651J3858n034J2844L882L2854
13485B18845Q200R09k1397q191M437J9484l7008J0025J5838L5426M9101Q9578
13473C85247J39155J24383J01768K0778j4374K7514M948j35480j81413j24721
13463C47805n6130j4435j1359j9149k9198l7530N664J5231l0301k4722l734J6934
13451A59076J1271Q818m577k2r452p856J08P337j0422l3490j0264O45J8201K478
13437A31851P955P189j1178k4560o304R530j6044K2985N3740N9792M0091M0401
13425C15448j781J1108J3249j9713m7707p3802M392l813k2641l6225l1398j3558
13413I3559L272K4747K0151Q883j1460l0371l1510k5428l4141J4684J8603N470
$$ plain form
13498 102165 121761 137942 130761 135014 138141 132276 146790 160441 174299 169265 182109 185991 218845
13485 218845 227045 227954 206557 198366 202803 222287 185279 195304 211142 246568 295669 385247
13473 385247 524402 648785 750553 771331 756957 784471 789419 653939 472526 347805
13463 347805 291675 277240 265881 246732 217534 180004 185668 200899 170598 145876 142142 159076
13451 159076 170347 179165 174588 174566 165114 157258 157366 164703 154281 120791 110527 111172 129373 131851
13437 131851 139806 146995 135817 111257 104953 114483 98439 121424 175164 234956 275047 315448
13425 315448 313667 324775 338024 318311 270604 196802 201194 197381 174740 138515 107117 93559
13413 93559 96831 121578 141729 150612 139152 108781 77271 51843 17702 32386 50989 56459
13401E6459J9743J8468L3273j2693l1789k7495L684J0575L1881J8102j980k3664
13389I4564M080j7718k4225j4968o361k638j3334K5721K3100L3620J9349N748
13377A26938J6062K3471O580j5536l6998P786L954k3951n98J5813p370j8059k0542
13364G7550k9168j814K0196j1408j3870J2002K5569J5641L0888r509l1047J3834
13352I8864P661j0057J7013J1823j1523J3773J8455k2300j9755j0867j5268j0127
13340F7692L7137N922j0141J9384j0492l6571M133N009L232j1199q536m28L336
13327F8478r029K8457j1968Q152L1888k930J76K8484j4324j8434K0241o232j5848
13314A07111j9781m978P825l38K6837J9534k0217j9515L985n843k857k2195J7885
$$ plain form
13401 56459 76202 94670 127943 115250 83461 55966 59650 70225 102106 120208 118228 94564
13389 94564 98644 80926 56701 41733 35372 32734 19400 45121 68221 101841 121190 126938
13377 126938 143000 166471 173051 157515 120517 128303 132257 108306 107708 123521 116151 98092 77550
13364 77550 48382 46568 66764 55356 41486 53488 79057 94698 125586 116077 85030 98864
13352 98864 106525 96468 113481 125304 113781 127554 146009 123709 103954 93087 77819 67692
13340 67692 104829 110751 100610 119994 109502 72931 77064 82073 85305 74106 65570 65142 68478
13327 68478 59449 87906 75938 84090 115978 113048 113224 141708 127384 108950 129191 122959 107111
13314 107111 87330 82352 90177 89839 116676 136210 115993 96478 100463 94620 91763 69568 87453
13301H7453L7953J9820r800j8330j8713n386m148J2264L5899j7838m874j7136
13289I7164M120R321k2228L196l563j9188j6067K3593K135K1323J5475p784q025
13276I9472p45j575q28o137l931K905L2916j4335l2453n240J9970n454k1267K4184
13262H7482j3371o015J5265p374l333R005J1274P546N821K6875J1804j1863k0553
13249A12563q847J9921M133P116j2343Q741K2212J4376J9252l6379k304J0617
13237A59058k7059j6412j3349j058P694J353j4487j5010N418J2640J0323J7996
13225A27107J8856L393l1505J5514Q533k2366J7866j886j1374K5217j0716p065
13213A31574J1508K2207l407m4466j6713j945J4423J3835L6235J8396k5535p458
$$ plain form
13301 87453 125406 145226 135426 117096 98383 92997 88849 101113 137012 119174 114300 97164
13289 97164 101284 110605 88377 91573 88010 68822 52755 76348 78483 99806 115281 107497 99472
13276 99472 98727 97152 96324 90187 86256 89161 122077 107742 75289 70049 90019 84565 63298 87482
13262 87482 74111 68096 83361 75987 72654 81659 92933 100479 106300 133175 144979 133116 112563
13249 112563 103716 123637 127770 134886 122543 131284 153496 167872 187124 150745 148441 159058
13237 159058 131999 115587 102238 101180 108874 110227 95740 80730 86148 98788 109111 127107
13225 127107 145963 149356 117851 133365 141898 119532 137398 135512 124138 149355 138639 131574
13213 131574 143082 165289 161882 117416 100703 98758 113181 127016 163251 181647 156112 148654
13201A48654M1239J7265K2273J7J0720l1755k2095j883K3338N367j2680k0209
13189A80251m386p757k1878O08M90n01K0640P467p203k5656j7566J6670M258j4812
13175A30625j5346p102K4221p904K215K6675K9453O697j7338j3142M763L168p830
13162A59155J0598J9254j1821p328j6381J9904j579r705J847J7080q659J6534
13150A88899R645K3326J9446k7803l7063l6163N823K4945l06k3095p91L4565J2513
13137A93941K122j4225p701J6451k741K5313K4399q722l9342R020J1594k2795
13125A87314j4000P002J135p043M936r057k803J2776J560R50K37Q187L3322J43
13111B24659l6758J8915L3433j870j530m318j0366Q517K3830K6241J297k1361
$$ plain form
13201 148654 189893 207158 229431 229448 240168 208413 186318 184435 207773 213140 200460 180251
13189 180251 175865 168108 146230 146838 147328 146827 167467 174934 167731 142075 124509 141179 145437 130625
13175 130625 115279 108177 132398 124494 126709 153384 182837 189534 172196 159054 163817 166985 159155
13162 159155 169753 189007 177186 169858 153477 173381 171802 162097 163944 181024 172365 188899
13150 188899 198544 221870 241316 213513 176450 140287 146110 171055 170749 147654 146863 181428 193941
13137 193941 196063 181838 174137 190588 187847 213160 237559 228837 189495 198515 210109 187314
13125 187314 173314 180316 181451 174408 179344 170287 167484 180260 181820 182770 183007 191194 224516 224659
13111 224659 187901 206816 240249 238379 236849 232531 222165 230682 254512 280753 282050 260689
13099B60689k4719j7246j370k148j9168J8665L2153L391J8360Q256k8328j7981
13087B30554p790n029j0069m192K060J0461j5711K10j1923Q722K8542P357J1130
13074B44322P812j4957P808o38j422j7349K1844M695l2456J2966J6381K8084K4094
13061C01184r112j4803l3443p205P870K4263j0144J762q439l1729j3205J054L3216
13048B41269L1987N77j742J9333R947l4963k1140N128l437j3185k506l687K0144
13035B47725K4744l373j8946J3439J9680K0995K8206L540l5265l0840p040L3387
13023B96252J9237K7987j3825j0725k6273l492L805L890L1046J3085J6729Q046
13011C65762J450j0142k4803j7730K8478J6580o657j784J498k063j0135k6307
$$ plain form
13099 260689 235970 218724 217354 215206 196038 214703 246856 250247 268607 276863 248535 230554
13087 230554 222764 217735 207666 203474 205534 215995 200284 200494 188571 197293 225835 233192 244322
13074 244322 252134 237177 244985 244347 242925 225576 247420 252115 219659 232625 249006 277090 301184
13061 301184 292072 277269 243826 236621 244491 268754 258610 260372 251933 220204 206999 208053 241269
13048 241269 273256 273833 272091 291424 301371 266408 245268 250396 246959 233774 231268 227581 247725
13035 247725 272469 269096 250150 263589 283269 304264 332470 336010 300745 269905 262865 296252
13023 296252 315489 343476 329651 318926 292653 289161 292966 296856 327902 340987 357716 365762
13011 365762 367212 357070 332267 314537 343015 359595 352938 351154 352652 350589 340454 314147
12999C14147k7914K0832K0989p559p811J3012j2797J214J5430J9894M885P300
12987C61622j6997l0167J4417L1217K7202J4733o137j1353k8030N683l9731j3450
12975C09009M2156J6652J159L6476j978k2482k66J885k348r713J1405J4387J1795
12962D08137j1455P835R006J611l5100o290Q610K8166M7874M425j4067J1567J2822
12949D73141J8208j1040k8574j787O751J0374k503m955Q885K774k9230M920K7931
12936D74895K2426j0336J288K2091O312n347M824J1128M096O277Q515j7453j7666
12923E11050l892J9796K0306j056m953K227M876J2365o776J0854L227l438J2936
12910E77522O379J9804L284n455K339K7080K7499L094L8420J6960J6174K78J5785
$$ plain form
12999 314147 286233 307065 328054 320495 312684 325696 312899 314113 329543 349437 354322 361622
12987 361622 344625 314458 328875 360092 387294 402027 395890 384537 356507 362190 322459 309009
12975 309009 351165 367817 368976 405452 403474 380992 380726 382611 380263 370550 381955 396342 408137
12962 408137 396682 404517 413523 415134 380034 373744 382354 410520 458394 462819 448752 460319 473141
12949 473141 491349 480309 451735 449948 456699 467073 464570 459615 468500 471274 442044 446964 474895
12936 474895 497321 486985 488273 510364 516676 511329 516153 527281 531377 537654 546169 528716 511050
12923 511050 507158 526954 547260 546204 541251 543478 548354 560719 553943 564797 568024 564586 577522
12910 577522 583901 603705 606989 601534 603873 630953 658452 661546 699966 716926 733100 733378 749163
12897G49163J6217L1771M690l218Q764J3341L0937K6760K4006M2856O6389M5150
12885A056826N4832M8942M5596J8475j6112l710m2271q0977o4621m5844O45P48
12873I72529j6880K115k0344j4977J1094k0198O950k283j8549J1217L8077J4439
12861I63190n338l1602N118J1167j7092l115R388J8132j4007n562J88K2866J1581
12848I64914O326N204K6970R193J172L0566N2334J8948n963o992R416q581p124
12835A096383J6713J0662K695j4999K6659L4222J2561P439M541M464K5478K6355
12823A253173J4660J575j4029J8560J131M345l107K4273J0413k9656L1275L6790
12811A349403j5239K3478M3353K2268J9251J077r430L057M5729N4668O5426L3276
$$ plain form
12897 749163 765380 797151 801841 798623 807387 820728 851665 878425 902431 945287 1011676 1056826
12885 1056826 1111658 1160600 1206196 1224671 1208559 1204849 1162578 1081601 1016980 971136 971781 972529
12873 972529 955649 957764 937420 922443 933537 913339 920289 918006 899457 910674 948751 963190
12861 963190 957852 926250 931368 942535 925443 922328 931716 949848 935841 930279 930467 953333 964914
12848 964914 971240 976444 1003414 1012607 1013779 1044345 1096679 1115627 1109664 1102672 1112088 1103507 1096383
12835 1096383 1113096 1123758 1126453 1111454 1138113 1172335 1184896 1192335 1196876 1201340 1226818 1253173
12823 1253173 1267833 1269408 1255379 1273939 1275070 1279415 1276308 1300581 1310994 1281338 1312613 1349403
12811 1349403 1334164 1357642 1400995 1423263 1442514 1443591 1434161 1437218 1482947 1537615 1603041 1636317
12799A636317L0816K5729m64J7089O0002L7975J2116L553J7173L6825K4212J009
12787A902352J2119M8201K7170K4448L4713n571o711K8872K5496L3868K5841J4465
12775B165263J7046P4537M6680M3514P3151J7040N6157O8301P5942J40180K16072
12764B993883K55554K78099J87732O8270K9944J03397J4318k87684k36207j02186
12754C305120m4483K467M0326L8164L0730L4298O1739K7240K0449K9533O2495
12743C608078O6607N1305N0456N0369N2601N5375P0322O8493Q0513P5207M3349
12732D272675N0599Q7126P9124N8523Q3100J01024Q2218P2879R0304R7422J03440
12721E178434J07611J16686Q6625R4366R9400J12230R7998J09065J10316J18233
$$ plain form
12799 1636317 1667133 1692862 1692398 1709487 1769489 1807464 1819580 1823133 1840306 1877131 1901343 1902352
12787 1902352 1914471 1962672 1989842 2014290 2049003 2043432 2036721 2065593 2091089 2124957 2150798 2165263
12775 2165263 2182309 2256846 2303526 2347040 2420191 2437231 2493388 2561689 2637631 2777811 2993883
12764 2993883 3249437 3527536 3715268 3783538 3813482 3916879 3931197 3643513 3407306 3305120
12754 3305120 3260637 3263104 3303430 3341594 3372324 3406622 3468361 3495601 3516050 3545583 3608078
12743 3608078 3674685 3725990 3776446 3826815 3879416 3934791 4005113 4073606 4154119 4229326 4272675
12732 4272675 4323274 4410400 4489524 4548047 4631147 4732171 4814389 4887268 4977572 5074994 5178434
12721 5178434 5286045 5402731 5489356 5583722 5683122 5795352 5893350 6002415 6112731 6230964
12711F230964J23896J29698J14163J33652J09382J09023J51210J39206J33439
12702G374633J82071J67320J59047J74493J83655K01226J85101K00818K15142
12693I043506J93897K42485K52796K28583K62113K77031K82665L03151K85162
12684A1371389L26600L40467L37086L63537L90619L90659L70214L81795M57296
12675A4729662N05002M87253M90075N07647N34549N61026N94893O04731O22594
12666A9637432O42016O72552O90476P21022P56919P66029Q26980Q12918Q40021
12657B6366365Q82914Q94664Q94050R14892R45060R85356R67797J000507J002691
12648C4854296R99870R60926R71992R37011R29765R14844Q61180Q32502P81501
$$ plain form
12711 6230964 6354860 6484558 6598721 6732373 6841755 6950778 7101988 7241194 7374633
12702 7374633 7556704 7724024 7883071 8057564 8241219 8442445 8627546 8828364 9043506
12693 9043506 9237403 9479888 9732684 9961267 10223380 10500411 10783076 11086227 11371389
12684 11371389 11697989 12038456 12375542 12739079 13129698 13520357 13890571 14272366 14729662
12675 14729662 15234664 15721917 16211992 16719639 17254188 17815214 18410107 19014838 19637432
12666 19637432 20279448 20952000 21642476 22363498 23120417 23886446 24713426 25526344 26366365
12657 26366365 27249279 28143943 29037993 29952885 30897945 31883301 32851098 33851605 34854296
12648 34854296 35854166 36815092 37787084 38724095 39653860 40568704 41429884 42262386 43043887
12639D3043887O94101O48184N94782N01046M17288L41669K37619J64689Q5244
12630D6728509Q007r6160k17265k99337l34825m04248m88922n86888o41089o95532
12620D2972250p14741p36022p71734q34523q32418q27758q59929q66400q43431
12611C5685294q64926q66097q40281q36348q37912q32249p99421p92858p73952
12602B8241250p43684p04997o87773p40426o95281o69672o60262o11357n92968
12593B2134830o05552n88922n38469n38341n27778m89619m69195m67685m53124
12584A7456145m44814m52504m05322m01024m14773m06106l63496l45921l35615
12575A3886570l48624l50110l40885l10815l07059k73479k71215k73459k70099
$$ plain form
12639 43043887 43737988 44386172 44980954 45482000 45899288 46240957 46478576 46643265 46728509
12630 46728509 46736516 46640356 46423091 46123754 45788929 45384681 44895759 44308871 43667782 42972250
12620 42972250 42257509 41521487 40749753 39915230 39082812 38255054 37395125 36528725 35685294
12611 35685294 34820368 33954271 33113990 32277642 31439730 30607481 29808060 29015202 28241250
12602 28241250 27497566 26792569 26104796 25364370 24669089 23999417 23339155 22727798 22134830
12593 22134830 21529278 20940356 20401887 19863546 19335768 18846149 18376954 17909269 17456145
12584 17456145 17011331 16558827 16153505 15752481 15337708 14931602 14568106 14222185 13886570
12575 13886570 13537946 13187836 12846951 12536136 12229077 11955598 11684383 11410924 11140825
12566A1140825k75292k35238k37254k28406k09176k14531k21585k07911j88473
12557I122959k18957k03196j91986j87833j46415j46886j88213j81606j27869
12548G529998j60828j41358j62460j58844j41553j19371j18051j22250j31030
12539F274253q7183j12600j41476j41034r6593j00528j18913j14425j06549j26613
12529E128339j12265o4132j10998q7532r1348p7248n6677o2312q3977q4674j15534
12518D181642j02208n5138l4683m2789n9149q7308n6541o1287p5991n6595m5630
12507C504323o5549o6595m1715l3186n0120m5153m1018m0383o0376o8330n6338
12496B935560o7010o1450o0509l4694j6294m3070j2317n0876m3241m1344o2378
$$ plain form
12566 11140825 10865533 10630295 10393041 10164635 9955459 9740928 9519343 9311432 9122959
12557 9122959 8904002 8700806 8508820 8320987 8174572 8027686 7839473 7657867 7529998
12548 7529998 7369170 7227812 7065352 6906508 6764955 6645584 6527533 6405283 6274253
12539 6274253 6187070 6074470 5932994 5791960 5695367 5594839 5475926 5361501 5254952 5128339
12529 5128339 5016074 4951942 4840944 4753412 4662064 4584816 4528139 4465827 4381850 4297176 4181642
12518 4181642 4079434 4024296 3989613 3946824 3887675 3800367 3743826 3682539 3606548 3549953 3504323
12507 3504323 3438774 3372179 3330464 3297278 3247158 3202005 3160987 3120604 3060228 2991898 2935560
12496 2935560 2868550 2807100 2746591 2711897 2695603 2652533 2640216 2589340 2546099 2504755 2442377
12485B442377j3734M22j6601j8177m5527m8068m3418l7240m4641m3222N690q276
12473B129585k7296j5214l32l7793l9391k8580l5442m2445j9394n874j2326m1040
12461A824458k5137o044j1137J0661r667m5146k3432n36l2933l6536N477l5631
12449A614397l1281j8653n49j5464N168K7509k0762j4249l7705l1052k7258k2523
12437A427578k7694j2691l2393j1627L2521J9143k6773k2441j2841k6012j7573
12426A289197k0828J545k2517J8169Q36l2642o1086l1709j1565J8202q388r614
12414A129600j3084o544k6659J85j6535j8416j23N200R461r561l2173l0101j0662
12401I80588r229K8026J3199l761l959k5757j6439q243R293J5204J214m624M653
$$ plain form
12485 2442377 2428643 2429065 2412464 2394287 2348760 2300692 2257274 2220034 2175393 2132171 2137861 2129585
12473 2129585 2102289 2087075 2086743 2048950 2009559 1980979 1945537 1903092 1883698 1877824 1865498 1824458
12461 1824458 1799321 1793277 1782140 1792801 1783134 1737988 1714556 1714020 1681087 1644551 1650028 1614397
12449 1614397 1583116 1564463 1563914 1548450 1553618 1581127 1560365 1546116 1508411 1477359 1450101 1427578
12437 1427578 1399884 1387193 1354800 1343173 1375694 1394837 1368064 1345623 1332782 1306770 1289197
12426 1289197 1268369 1269914 1247397 1265566 1266402 1233760 1172674 1140965 1129400 1147602 1139214 1129600
12414 1129600 1116516 1109972 1083313 1083498 1066963 1048547 1048424 1053624 1063085 1053524 1021351 991250 980588
12401 980588 971359 999385 1012584 1008823 1004864 979107 962668 954425 963718 978922 980136 975512 980165
12388I80165r698Q663K6070O6569L6971O0986N4866L3278K5617R932J707n0439
12376A244687q5320l0666m9805o0599o1657l5461n1779n7935o0782j2296L671
12365G42058L226j4934R239j4891j8213p304J4614n648N523m437j8405j7486M076
12352F77418k3816k4446J0180J7806O723k8365j9771j976r412j2339N718n817
12340E91903j2122j1395M118n600j7344J499J7668J5534j8632k8330N743J7976
12328E61018j5737k9244k8464k416J5383Q998j0419k4706P516L560N063L767j840
12315D92479R3j4305j5810k5464j3285O927J151o740R160P951k0368j5875J2791
12302D18705j9691k8561J6032j5182k5355j6365J0144J8718K2094R116K1477k695
$$ plain form
12388 980165 970467 979130 1005200 1071769 1108740 1169726 1224592 1257870 1283487 1293419 1295126 1244687
12376 1244687 1159367 1128701 1078896 1018297 956640 921179 869400 811465 750683 738387 742058
12365 742058 745284 730350 739589 724698 706485 699181 713795 708147 713670 709233 690828 673342 677418
12352 677418 653602 629156 639336 657142 663865 635500 615729 613753 604341 592002 597720 591903
12340 591903 579781 568386 572504 566904 549560 551059 568727 584261 565629 537299 543042 561018
12328 561018 545281 516037 487573 485157 500540 509538 499119 474413 481929 485489 490552 494319 492479
12315 492479 492572 478267 462457 436993 423708 430635 431786 425046 434206 442157 421789 405914 418705
12302 418705 399014 370453 386485 371303 345948 329583 339727 358445 380539 389655 411132 408437
12290D08437j5717M574P974l320l615K3518L360l948k7040j6160Q411J2776N936
12277D05186k5322k2634N320K6394j7364l4464Q632l837J4191n425j4888l4002
12265C01787j6153P874P150J2638J3093J7343L8q524J2083q67k8605k5450K6061
12252C18468K6634j1997l3911o943n057m476P653k641N360j3484o419O704J2422
12239B92313k468o256P392J3134j1596j5869m27L5592J968m9022k3762J3200K1525
12226B75724m848j0637K0641K9241M309l8222J868O572N234o833k1037K1461k2786
12213B60687k1194j7614j1119K0136k712O41J8182J2344j6071k6124L892J2527
12201B33575r198R148j5397L065j632L409j6268P680N671m399j687l3815M848
$$ plain form
12290 408437 392720 397294 405268 401948 398333 421851 425211 421263 394223 378063 386474 399250 405186
12277 405186 379864 357230 362550 388944 371580 337116 345748 341911 356102 350677 335789 301787
12265 301787 285634 293508 300658 313296 326389 343732 343770 335246 347329 346462 317857 292407 318468
12252 318468 345102 333105 299194 292251 287194 282718 290371 287730 293090 279606 273187 279891 292313
12239 292313 289845 283589 290981 304115 292519 276650 276223 311815 313783 264761 240999 254199 275724
12226 275724 270876 260239 280880 310121 314430 276208 278076 284648 289882 283049 262012 283473 260687
12213 260687 239493 221879 210760 230896 228184 228825 247007 259351 243280 217156 221048 233575
12201 233575 224377 233525 218128 221193 219561 222970 206702 214382 220053 215654 213967 180152 185000
12188A85000K2753q38P198N716j4177k5191j0499J4082j020O116J0287k40K1301
12175B20488k6606J823L7452L447j8241l812o846P108Q858K2704l3486k1730P172
12162A98331K394l367P792j2334P499J5467p172K5764K1759j8880j7961k4484
12150A94808o309J9889R878j0056K293P440O590p388j347M002J88j1899K809K7789
12136B38687m65P49M996p567L565K6274j151o266K1213K8481o601J7303j7118
12123C02100m2947K0838l076r903J1878K55J3425m162j841L329q917j9198J5327
12110B77108J3659j703k5010j0087L14k2417j117P972k117M076O420j6426j159
12097B29513j4909p707J051p193q294l1238k4430n7494P662L4058n331J3384K8021
$$ plain form
12188 185000 207753 206915 214113 219829 205652 180461 169962 184044 183024 189140 199427 199187 220488
12175 220488 193882 195705 233157 236604 218363 214551 207705 214813 223671 246375 212889 191159 198331
12162 198331 200725 197358 205150 192816 200315 215782 208610 234374 256133 237253 219292 194808
12150 194808 188499 208388 218266 208210 210503 217943 224533 217145 215798 219800 219988 208089 210898 238687
12136 238687 238222 238971 243967 236400 239965 266239 265088 258822 280035 308516 301915 319218 302100
12123 302100 259153 279991 276915 267012 278890 279145 292570 288408 286567 289896 280979 261781 277108
12110 277108 290767 289064 264054 253967 254281 231864 230747 238719 236602 240678 247098 230672 229513
12097 229513 214604 206897 207948 200755 192461 161223 136793 79299 86961 121019 115688 129072 157093
12084A57093L2742j4346l1935k3124K257L4884J308K481j9964j809K3435O329
12072A69351K5040k0964k5976N198N641l3825o169K3031K323j2836L692r433k1725
12059A03348L010k732J1901L576m0218J3659K7052J2191j9715k9954n977K1419
12047I7560J5726K844k1218p520j6620L8344J7357j4090O040p257j3029k8026
12035G0111j2090J6813Q226j03J4818J5040n401o074K0570k80n355j1699k1888
12022H2688K6137J2256o23j6105k2631P174N7017j1197m157O19k9807k0709Q494
12009H9156m665Q58J2044J4322J7899Q800n612k7949j0160J1312Q547N828j9901
11996A00479k2702K979J248L266P908j5680k4357J4200L6007R273j2692L501o122
$$ plain form
12084 157093 189835 175489 143554 120430 122687 157571 158879 161360 141396 139587 163022 169351
12072 169351 194391 173427 147451 152649 158290 124465 118296 141327 143650 130814 134506 125073 103348
12059 103348 106358 103626 115527 119103 78885 92544 119596 131787 112072 82118 76141 97560
12047 97560 113286 116130 94912 87392 70772 109116 126473 112383 118423 111166 98137 70111
12035 70111 58021 74834 83060 82957 97775 112815 107414 101340 121910 121630 116275 104576 82688
12022 82688 108825 121081 120458 104353 81722 88896 145913 134716 130559 131178 101371 80662 89156
12009 89156 84491 85349 97393 111715 129614 138414 132802 104853 94693 106005 114552 120380 100479
11996 100479 77777 80756 82004 85270 93178 77498 53141 67341 103348 112621 99929 103430 97308
11983I7308M7342j2291j6493k8359j238K1625j574O952l439K846k709L9128M860
11970A53958l3221k5702j878Q946k1954L015J7420L096r023O066J7947k8282k2433
11957F7955O842L789J482n492K1330K326j9625k8583O209P719j0020N88j5227
11944C9293j3022l031J5043L6931K0702k021j1835l104J4965k791K13K2863j1962
11931A02244k6902R087J4047o935m358Q702J0998j9884Q296K8364L6584K511k9318
11918A33436l3247k0376k0789J0729K1174P004j7287l817n091K5774j5706j4242
11906F7562K0134k6654L947K5496J7883R146n1392j5668K6911J0841J9393M416
11894A12015l805l5471k9395J6626K5195r505k7490R183J0543k9349p961J2546
$$ plain form
11983 97308 144650 132359 115866 87507 86269 107894 106320 113272 109833 112679 109970 149098 153958
11970 153958 120737 95035 93157 102103 80149 83164 100584 103680 94657 100723 118670 90388 67955
11957 67955 74797 78586 80068 74576 95906 98232 78607 50024 56233 63952 53932 54520 39293
11944 39293 26271 23240 38283 75214 95916 93895 82060 78956 93921 91130 91343 114206 102244
11931 102244 75342 84429 98476 91541 87183 95885 106883 86999 95295 123659 160243 162754 133436
11918 133436 100189 79813 59024 69753 90927 97931 80644 76827 71736 97510 81804 67562
11906 67562 87696 61042 64989 90485 108368 117514 66122 50454 77365 88206 107599 112015
11894 112015 108210 72739 43344 59970 85165 75660 48170 57353 67896 38547 30586 43132
11882D3132L680N514j0610O155M7647N924J706j4271k4653n10n34P302J4657k5286
11868E9853K3768o79k3682J4592M240J7157P909j2609J0709K853J954l0709n4042
11855B1314J6849Q188J4034k0355j0478L3425p203M058R278j485J3835j1478R336
11842G9318j5389l192n723k5538q560K5927J6143J3492p037j197O535k5114r77
11829D8688P371j532l4482q562O229K4081j1502q522J990J2301J9810N053l006
11816E7917j3221k5854L780K4005J9482m427m2445N637K5108L8666J752J318k8011
11803F3707j4104J4158K8002q465m97l339r652j4747j9301K784J7774J9982q962
11790F7340J532J5930l5600K162k6P46j790r854j811q450j418j1698J6305K6200
$$ plain form
11882 43132 46812 52326 41716 47871 95518 101442 103148 88877 64224 63714 63180 70482 85139 59853
11868 59853 83621 82942 59260 73852 78092 95249 103158 90549 101258 104111 106065 75356 21314
11855 21314 38163 46351 60385 40030 29552 62977 55774 59832 69110 67625 81460 69982 79318
11842 79318 63929 60737 55014 29476 20916 46843 62986 76478 69441 68244 74779 49665 48688
11829 48688 56059 54527 20045 11483 17712 41793 30291 21769 23759 36060 55870 60923 57917
11816 57917 44696 18842 22622 46627 66109 61682 19237 24874 49982 88648 90400 91718 63707
11803 63707 49603 63761 91763 83298 82801 79462 69810 55063 35762 38546 56320 76302 67340
11790 67340 68872 84802 49202 51364 51338 52084 50294 40440 38629 30179 28761 17063 33368 59568
11776E9568m1J017J3343R01Q501j9813O619L3695j6437j7945j1419m892j2185
11763D0912k8092K0459K0876j0277J4550K72k5285k9782K428K0412J455q478k2549
11750c099o301o186J5300k352L9066L7393P456o992J5237o629j5840J7797k7003
11737E7847k7801k2118j4828k1500J9661L7705K0084P515j6533K594q985j4847
11725A8794J8518J1317k370j6015j0216j6923J6601K9713J1389r810N443J6j5237
11712D1220k515j412P823K111N566J6475k8224j014n192K6J5624K222J024j2428
11698D1306J0861J479J1960M450j9154j1785J397o32j3658j8095K014J9585J2157
11685D1885p582M993n310j3968j9003J821J8136L5232K4462K2253l0502m0128
$$ plain form
11776 59568 59527 60544 73887 74788 83289 63476 70095 103790 87353 69408 57989 53097 40912
11763 40912 12820 33279 54155 43878 58428 58700 33415 3633 6061 26473 27928 19450 -3099
11750 -3099 -9400 -15586 -286 -2638 36428 73821 81277 74285 89522 82893 67053 84850 57847
11737 57847 30046 7928 -6900 -28400 -8739 28966 49050 56565 40032 42626 33641 18794
11725 18794 37312 48629 46259 30244 20028 3105 19706 49419 60808 50998 56441 56457 41220
11712 41220 38705 37293 45116 47227 52793 69268 41044 40030 34838 34864 50488 52710 53734 41306
11698 41306 52167 53646 65606 70056 50902 39117 40514 39882 26224 8129 10143 29728 41885
11685 41885 34303 39296 33986 20018 1015 2836 20972 56204 80666 102919 72417 32289
11673C2289k694Q432K1762Q407j1939k0582K9281K1302p551j8294r058J1589J1416
11660G4360k6145k1457P864j2895Q374K693J4615k9375n383J9303m744j1878L0454
11647D5786K4259K444k6549j6714M356J9934j5246k2161l399J6987k228j5814
11635A1655r754J1181J4945J4363O231k1284r274J6038j8661M988r397j3913K3914
11622B1032K5715O759j2532k9909L496k623J6209p382j2617J6364J2859j1872
11610B5499l220Q374R590P860n051k4281M834J2153j7851k9805J1914K3299L3103
11597E6418K0305L724L681J0465n740k902l931j4813k3572K2508m371q757r127
11584D3888Q465o268k3394q198J987q25J5485Q929k154r101j6388L909J6573l09
$$ plain form
11673 32289 29595 38027 59789 68196 56257 35675 64956 86258 78707 60413 51355 62944 74360
11660 74360 48215 26758 34622 21727 30101 32794 47409 18034 12651 31954 27210 15332 45786
11647 45786 70045 72489 45940 29226 33582 53516 38270 16109 12710 29697 27469 11655
11635 11655 1901 13082 28027 42390 48621 27337 18063 34101 15440 20428 11031 -2882 21032
11622 21032 46747 53506 40974 11065 14561 11938 28147 20765 8148 24512 37371 25499
11610 25499 22279 30653 40243 48103 43052 18771 23605 35758 17907 -11898 16 23315 56418
11597 56418 76723 80447 84128 94593 88853 85951 82020 67207 43635 66143 61772 53015 43888
11584 43888 52353 46085 22691 14493 16480 15655 31140 40069 37915 28814 12426 16335 32908 32599
11570C2599O27J4902r243j4800J8171K0343L4472O803j2287j2576j0522j1540
11558E6949j1461q602Q481J4771q635k7001j6863O903M243j9366l239n749J5353
11545E784J1926P741n442K6031J1278o337j4558n064m026n205J3285j149N551
11532C9815n7j3871k6341J0115k0472R331J5394m212k6359K3012K2739j819j4459
11519A2816Q476L6350L2035J471k3453j6296j5366k3220P63K3075J0579K027N300
11506E4557J4380J3384J876k8550N469R439j3929J5338j1279r641n827j8083o383
11493B0751M8142k087j9275j3163M071o054n905j457K211Q599L4317p826n091
11480E7233K5019R423j4098p798J393n764P430R977j1884o35j0068J7596R268
$$ plain form
11570 32599 33226 48128 38885 24085 42256 62599 97071 103874 91587 79011 68489 56949
11558 56949 45488 36886 45367 60138 51503 24502 7639 14542 18785 -581 -3820 -9569 5784
11545 5784 17710 25451 20009 46040 57318 50981 36423 31359 27333 22128 35413 34264 39815
11532 39815 39758 25887 -454 9661 -10811 -1480 13914 9702 -16657 6355 29094 27275 12816
11519 12816 21292 57642 89677 91148 67695 51399 36033 12813 13576 36651 47230 49257 54557
11506 54557 68937 82321 84197 55647 61116 70555 56626 71964 60685 51044 45217 27134 20751
11493 20751 68893 66806 47531 34368 38439 32385 26480 25023 27234 35833 70150 62324 57233
11480 57233 82252 91675 77577 69779 71172 65408 72838 82815 70931 70296 60228 77824 87092
11467H7092L9744J1642l1358K0981j7500j9800M95j852J2349l8018n1863J8577
11455C0489J6557Q765j3146L487J0597k3027k0899J4026j2117j1401L3787K1423
11443E8541M7382k880k2918j4842j6566r353J5694l566n068L236J5324K3114k869
11430H5229J1502l239j9024J6572M2502j1261m1608j0647J1090J2265l004k1139
11418F9238k2034l2639Q681J5616K3388l109n400j1544j7230K0477P48L0730K1382
11405I8304n818k2368L196P569l2489m0793K6574J1372k1308N541j159J4873R725
11392E3219j5894j1177J8694j4009o444L505N895K6486K3817J2430L677k439j5288
11379H2472o43R77K997j8368l973K3390j3216l263k5030k082K4778l267k4916
$$ plain form
11467 87092 126836 138478 107120 128101 110601 90801 91296 89444 101793 63775 11912 30489
11455 30489 47046 55811 42665 46152 56749 33722 12823 26849 14732 3331 37118 58541
11443 58541 105923 103043 80125 65283 48717 39364 55058 51492 46424 49660 64984 88098 85229
11430 85229 96731 93492 74468 91040 133542 122281 80673 70026 81116 93381 90377 69238
11418 69238 47204 14565 23246 38862 62250 59141 53741 42197 24967 45444 46192 76922 98304
11405 98304 92486 70118 73314 80883 48394 7601 34175 45547 24239 29780 28621 43494 53219
11392 53219 37325 26148 44842 30833 24389 27894 33789 60275 84092 96522 100199 97760 82472
11379 82472 81829 82806 85803 67435 63462 86852 73636 70373 45343 43261 68039 64772 39856
11366C9856l259l906J3032K7961J3777j8667k9132R919K0095k146n057j2973j1217
11353C8283o10K1961J0952J8712N742J1787j8919j6213J1217j1229l6164J6149
11341E1668M1217M4207j0082l1906k4038o915K8460K055k8630M976J7800K9088
11329A17900j4785n985m5838j4399J4088J5539K545k8344j4429K029n03R197J5407
11316E2422J0881J7529l718J7146p274J5111J3801q269l7171k3898J342J6149
11304F4051L4842J6088j8077r571J5684J604k0038j02j7439J1183J3489J968p620
11291H6062J6138J5394p79l577M652M027l5959j3383J1508j1845J3696J996o523
11278H1407J6698N317m312j3803O008K1355M3672l269p902j0183l303j6463j7419
$$ plain form
11366 39856 36597 32691 45723 73684 87461 68794 39662 49581 69676 67530 62473 49500 38283
11353 38283 37673 59634 70586 89298 95040 106827 87908 71695 82912 71683 35519 51668
11341 51668 92885 137092 127010 95104 71066 64151 92611 94666 66036 71012 88812 117900
11329 117900 103115 97130 51292 36893 50981 66520 69065 40721 26292 28321 27818 37015 52422
11316 52422 63303 80832 77114 94260 86986 102097 115898 107629 70458 46560 47902 64051
11304 64051 98893 114981 96904 87333 103017 104621 84583 84481 67042 78225 91714 93682 86062
11291 86062 102200 117594 116815 113238 117890 121917 85958 72575 84083 72238 85934 87930 81407
11278 81407 98105 103422 99110 85307 91315 112670 156342 153073 145171 134988 131685 115222 97803
11265I7803O078J6326r121j4045j9579j0909j4421k9889l434k435J2632L587j752
11252C0841J5682L8797N321k5863k414j5044q242j619j242K0255J7185J7373J8704
11239A09734K5809n466J39j5384k0145r004R438r135j0021K7077m772K690j228
11226I9732j2357m541J2984M047k2840J7416O2295J0188n211j5282J3018j9709
11214A39740j6722m675j25J539J3529M6931L9253M0549O4361Q2449J02069J87702
11202F96600K46022L76462N17007N10246K77753K6223M2210Q7931k73539p08272
11192A798643n68354k87126j78411r4243p9960o3853o1237m8727m6523q295j6878
11181C45036j9944R997o050l4139Q841j1704o413k3055o028O327n246k2276K2349
$$ plain form
11265 97803 103881 120207 111086 97041 77462 66553 52132 22243 18809 16374 29006 32593 30841
11252 30841 46523 85320 90641 64778 62364 47320 39078 37459 36217 56472 73657 91030 109734
11239 109734 135543 130077 130216 114832 94687 85683 95121 85986 75965 103042 98270 100960 99732
11226 99732 87375 82834 95818 99865 77025 94441 156736 166924 161713 146431 159449 139740
11214 139740 123018 118343 118218 119757 133286 180217 219470 260019 324380 406829 508898 696600
11202 696600 942622 1319084 1836091 2346337 2624090 2650313 2692523 2780454 2506915 1798643
11192 1798643 1230289 943163 764752 670509 590549 526696 465459 416732 370209 361914 345036
11181 345036 325092 335089 329039 294900 303741 292037 285624 262569 256541 262868 257622 235346 257695
11168B57695R812k293J588k2576l6288l2424j0937K0550R450p106k0685k705o380
11155A57701k0475P480J046R742L53k6912J7671O041j7096j0777J1356J4668N794
11142A56592r29N945k6754m5549r437L514J8394m170J602J9001p311n438j0111
11129I5349j0406k60J64L499R153R988p273k3645J2748K6920o814J0002l480K800
11115A18745N264O897L6443Q490m6457k0169O67p953R4L254r952j8776J2931K3003
11101A12481M1619k6083l2830l079j7794k2152Q446J7026J9110K0928j7206k7689
11089G2777L5272J2395m4814j0173K649j2575r440K2806K7398j3495l2058k532
11077D8210K2814n213P79L2122K4330o459J2966j4283j7549j3415k2478j2955
$$ plain form
11168 257695 267507 265214 266802 244226 207938 175514 164577 185127 194577 187471 166786 164081 157701
11155 157701 137226 144706 145752 155494 155847 128935 146606 152647 135551 124774 136130 150798 156592
11142 156592 155663 161608 134854 89305 79868 83382 101776 97606 99208 118209 110898 105460 95349
11129 95349 84943 84683 84847 88346 97499 107487 100214 76569 89317 116237 109423 119425 115945 118745
11115 118745 124009 130906 167349 175839 129382 109213 109880 101927 102021 105275 95323 76547 89478 112481
11101 112481 154100 128017 95187 92108 74314 52162 60608 77634 96744 117672 100466 72777
11089 72777 108049 120444 75630 65457 68106 55531 46091 68897 96295 82800 50742 48210
11077 48210 71024 65811 66590 98712 123042 116583 129549 115266 97717 84302 61824 48869
11065D8869m148r473R737L2874k323j3496N825K1816J6183j44M996q122R494j0827
11051A01261j4132Q296p28L8727M7822K5477l88j5274l012M6372O0862K7093K260
11038C24636L1148K2858q856L484k4248k6892m760j3524n2015l1706K9319k4566
11026B24878k0672M3008J7618L9546O09l3636l8958j2000o734k2029J6101k4782
11014A82949l094J4011o045j0146R292Q287L43L437j846J5726j0561J0779K5124
11001B38256O457K5376j7949k4799j7578L895p490K332k6504l2236J4640K4809
10989A89209K6157L3626L1735J6243K2218R7890J22561J28098J04705N0873K4612
10978H47927L7108l2488j56335j48896j16258n2677n0068m2890M736j175q615
$$ plain form
11065 48869 44721 35248 44985 77859 75536 62040 67865 89681 105864 105720 110716 102594 112088 101261
11051 101261 87129 95425 94697 133424 181246 206723 206335 191061 188049 234421 295283 322376 324636
11038 324636 355784 378642 369786 373270 349022 322130 317370 303846 251831 220125 249444 224878
11026 224878 204206 247214 264832 304378 304987 271351 232393 220393 213659 191630 207731 182949
11014 182949 179855 193866 187821 177675 186967 195254 195597 199034 197188 212914 202353 213132 238256
11001 238256 244713 270089 252140 227341 209763 213658 206168 208500 181996 149760 164400 189209
10989 189209 215366 248992 280727 296970 319188 417078 539639 667737 772442 823315 847927
10978 847927 885035 852547 696212 547316 431058 378381 328313 285423 290159 288984 280369
10967B80369k691K3571J9888j9094m7110k5927j8241k641J1049p724j1434j6459
10955A83556j2201j4278L780K4516J8845J9263R265k9869L711J5740K889j1755
10943B13462M14L5712L1186K1442J377j679l447J2113J3169R835k3092K4793M2480
10930C77765O048q310j7700O715L7688k2060N592J3333J885Q455K7948O7092N8735
10917E63186P8389Q4106J42428J40227J35606J23299K8901l1910j44066j20132
10907A000034r1255p8573j08322j02386k5602J0207M1877M0741L2224J0319j6013
10896G13251m1593l5384O694Q950l147j2715K2945K023j2231k7960j3822L59N222
10883F12592K7198J1629R288q914J2369l6955l0005J8201K0678k346p087j4388
$$ plain form
10967 280369 277678 301249 321137 302043 254933 229006 210765 208124 219173 211449 200015 183556
10955 183556 171355 157077 160857 185373 204218 223481 232746 202877 206588 222328 225217 213462
10943 213462 213876 249588 280774 302216 303593 301914 298467 310580 323749 333584 310492 335285 377765
10930 377765 383813 375503 357803 364518 402206 380146 385738 399071 400956 409411 437359 504451 563186
10917 563186 641575 725681 868109 1008336 1143942 1267241 1296142 1264232 1120166 1000034
10907 1000034 908779 830206 721884 619498 593896 604103 645980 686721 718945 729264 713251
10896 713251 671658 636274 642968 651918 648771 636056 659001 661024 648793 620833 607011 607370 612592
10883 612592 639790 651419 660707 651793 664162 627207 597202 615403 636081 633735 626648 612260
10871F12260N785J4563p978K1670L9082N5443N8584K3450M2240L8472L2738L2974
10859I69283Q0938L9161L0468J6303n232L6647K6798K6434K9077J6283J8040Q29
10847A285029j5681j0898l6753q438L0756P0212P3427O5063L4073L8599L6188
10836A561577J7237J3174l4739K2522Q5494J50285J48361J78229J75942R2264
10826B410346L0582K1379l4063q4105k5436M8770J36096K33126K87407L00698
10816C324800L05757L40244L87876M31909M97955O86155Q92818R10895O76227
10807H454636M39881M99979P12466M87642J32759N48487J139896J597596K078588
10798A6091930K798347L528677M240157N371956P218833R838582J3775987K0158296
$$ plain form
10871 612260 618045 632608 624630 646300 685382 740825 799409 822859 865099 903571 936309 969283
10859 969283 1050221 1089382 1119850 1136153 1130921 1167568 1194366 1220800 1249877 1266160 1284200 1285029
10847 1285029 1269348 1258450 1221697 1213259 1244015 1314227 1387654 1452717 1486790 1525389 1561577
10836 1561577 1578814 1591988 1557249 1579771 1665265 1815550 1963911 2142140 2318082 2410346
10826 2410346 2440928 2462307 2428244 2344139 2318703 2367473 2503569 2736695 3024102 3324800
10816 3324800 3630557 3970801 4358677 4790586 5288541 5974696 6867514 7778409 8454636
10807 8454636 8894517 9394496 10106962 10594604 10727363 11275850 12415746 14013342 16091930
10798 16091930 18890277 22418954 26659111 32031067 39249900 49088482 62864469 83022765
10790H3022765L1104139N0373810P9984705J07776210J00716640M2755311l981949
10783D91751631M758321J8936299n9397928j42302663j03899421n7898148l2307508
10776A19640583j8356185j0282930o519859n992105o894246p353218o474143n268061
10768E2499836m454657l961792l278004k554439k060010j732110j348916j269606
10760C1840302j530376j573645j371272j175420j481193j692839j364247j081354
10752B0569956r48508r09361q43867p29809p00828p11116o94066o42324o21548
10743A3768529n92264n33424m62995l90321l05676l19199l66211l30152k62305
10734A0205982k89167l24644l63489l49817l22405k32505j54335m236J40887J77065
$$ plain form
10790 83022765 114126904 164500714 244485419 352261629 452978269 495733580 491751631
10783 491751631 496509952 515446251 456048323 313745660 209846239 151948091 119640583
10776 119640583 101284398 91001468 84481609 78489504 71595258 64242040 57767897 52499836
10768 52499836 48045179 44083387 40805383 38250944 36190934 34458824 33109908 31840302
10760 31840302 30309926 28736281 27365009 26189589 24708396 23015557 21651310 20569956
10752 20569956 19621448 18712087 17868220 17138411 16437583 15726467 15032401 14390077 13768529
10743 13768529 13176265 12642841 12179846 11789525 11483849 11164650 10798439 10468287 10205982
10734 10205982 9916815 9592171 9228682 8878865 8556460 8323955 8169620 8165384 8306271 8483336
10724H483336K4471k29447j95677j39100l95058p45992n85691m02863k96810k04174
10714E312995j59641j65671j48188j65929j68084j20223j41537j23421j00237
10705D020064q4823n6471l6588j16419j05400n6039l7469n6992j01105r9684q7708
10694C181366o6599p1942n7470m5257m9311l5501m4140m9353j01479q2475r8543
10683B479296j25612j42543j31811j16617r2522p3484j36460j33223j10863r8103
10673A318058o9721n0160o6850n5069n4631l2062k7042O243j9325n5125o2727
10662H31589k149j0538m9758n8263k6827J1080K7963k1905p1968p8682n8652n5078
10650D36812N724N138N0395N9623j6603m5738l7176r850M57r14j8122j8846L585
$$ plain form
10724 8483336 8507807 8278360 8082683 7943583 7548525 6802533 6216842 5813979 5517169 5312995
10714 5312995 5153354 4987683 4839495 4673566 4505482 4385259 4243722 4120301 4020064
10705 4020064 3935241 3878770 3842182 3725763 3620363 3564324 3526855 3469863 3368758 3269074 3181366
10694 3181366 3114767 3042825 2985355 2940098 2890787 2855286 2811146 2761793 2660314 2577839 2479296
10683 2479296 2353684 2211141 2079330 1962713 1870191 1796707 1660247 1527024 1416161 1318058
10673 1318058 1248337 1198177 1131327 1076258 1021627 989565 962523 968766 949441 894316 831589
10662 831589 829440 818902 769144 710881 684054 695134 723097 701192 629224 550542 491890 436812
10650 436812 442536 447674 498069 557692 541089 495351 458175 448325 448782 447868 429746 410900 414485
10637D14485O022K3639q408l5272n956P358R569j9136J8400K2145k511j319J1154
10624D40170K485j9568k4630r128n856J2163J3515l795J061P979K5474J7025n765
10611D51130q356l2358k0608m18L086J1684k766j548j7067M065K9841K4466m926
10598D36225k7488j6320L0657p871m7340o0698n3469J2272L1587K9011K2665n571
10586C43660R50r331l8789j8940K1417K0046L217j2020N653k707L198O909J2134
10573C35397J9754k1007j1585o4883j0416N724k5143l4989K5979K6584K4012M018
10561B73445J4688j1495k5325K6013Q740p994k2102k6403Q438R57j4622J0620
10549B34960J2968L773j2389j6429m0394m443k414J9311J521o211n727j7125l3178
$$ plain form
10637 414485 420507 444146 435738 400466 394510 401868 411437 392301 410701 432846 430335 429016 440170
10624 440170 442655 423087 398457 389329 383473 395636 409151 405356 406417 414396 439870 456895 451130
10611 451130 442774 410416 389808 389390 392476 404160 401394 399846 382779 386844 416685 441151 436225
10598 436225 408737 392417 423074 415203 367863 307165 253696 265968 297555 326566 349231 343660
10586 343660 344610 335279 296490 277550 298967 319013 322230 310210 315863 313156 316354 323263 335397
10573 335397 355151 334144 322559 257676 247260 252984 227841 192852 218831 245415 269427 273445
10561 273445 288133 276638 251313 277326 286066 278072 255970 229567 238005 238962 224340 234960
10549 234960 247928 251701 239312 222883 182489 178046 175632 194943 196464 190253 184526 167401 134223
10536A34223p70L3601L4866J2352O622k2546l2616L942Q149q388l0317k3956P80
10523A15942L596j0745j8214J259O26k950K135q764l1j5383r950J9645L665L5353
10509A16184K1525j4400J0890K2519P543k2610m8235j3598j0971l581j8532q01
10497D5933j4557j8160l361K1171P524J0731j4759j181K2144j2076J514J5996
10485F0919P002J7947j8719n072k0488m9256m52K1714j0621Q737R623L9513N3725
10472A14572J5534j1140m1224m0367l3815m197J466K2296J9411j3357o393L9503
10460F2289j2718m1419k1557l67K1497P647k3198P003R334j2067L719J4909K2316
10447C7388j5284j7230Q062k125p968K5165K9990M41k3692j5990K5964j0972k1426
$$ plain form
10536 134223 133453 167054 201920 214272 220894 198348 165732 169674 177823 169435 139118 115162 115942
10523 115942 119538 108793 90579 91838 92464 89514 91649 82885 82854 67471 57521 77166 80831 116184
10509 116184 137709 123309 134199 156718 164261 141651 93416 79818 68847 65266 46734 45933
10497 45933 31376 13216 9855 31026 38550 49281 34522 33341 55485 43409 44923 60919
10485 60919 67921 85868 67149 62077 41589 -7667 -8119 13595 2974 11711 21334 60847 114572
10472 114572 130106 118966 77742 37375 3560 -637 829 23125 42536 29179 22786 62289
10460 62289 49571 8152 -13405 -13772 7725 15372 -7826 -823 8511 -3556 163 15072 37388
10447 37388 22104 4874 12936 10811 2843 28008 57998 58439 34747 18757 44721 33749 12323
10434A2323r122r469J0599J7081M053k971J7212o719J0144K7638r765p494k3621
10421B9889j0571J396O443J9348R954L99l4223k4790N167P995L0167L3554r831
10408F4897k8799J750K9758L502p610l3757j0511K673J1027J3778k9944j0436
10396F328J5806J7049j2816k5122J8040K8765J0045J565k5553q600J7021N464
10384D7992N923L3524R628L93r863j3494M195M1626K0999M3481P9827R5802J38786
10371D98819K09356L34068N00075N54071L93160J08015o879O8102k0446n69876
10361B068465p01786m25533k17566j09961r6212l4345k1864l7856o4905m7056
10351C11381M754k0132l8560j3942o353p540l0293k9593j1747O196k7915o12p198
$$ plain form
10434 12323 3201 -6268 4331 21412 25465 22494 39706 32987 43131 70769 61004 53510 29889
10421 29889 19318 20714 27157 46505 56459 56858 22635 -2155 3012 11007 41174 74728 64897
10408 64897 36098 37848 67606 71108 63498 29741 19230 21903 32930 46708 16764 6328
10396 6328 22134 39183 26367 1245 19285 48050 58095 59660 34107 25507 42528 47992
10384 47992 53915 87439 97067 97460 87597 74103 78298 119924 140923 184404 264231 360033 498819
10371 498819 708175 1042243 1542318 2096389 2489549 2597564 2590685 2658787 2638341 2068465
10361 2068465 1366679 941146 723580 613619 517407 483062 461198 423342 358437 311381
10351 311381 316135 296003 257443 243501 237148 229608 199315 169722 157975 164171 136256 135644 128446
10338A28446n169j4767k6037l636k7324r071q647l748L0234L2875K8599j6815
10326A04940k0609J3565O754p424j2618M447m948j3502k197J3620j2448k1874
10314D7706R880j7219k9973K0068L1570j4445q356j5183j0778K1715J1871k1696
10302B5160j8822Q599l136j2749K0392K4602j0312j0652k9747q509l180J023R041
10289h290n784j6727J3979J8593K4404o322j1324K0526J0234J7199K953k5015
10277C4426j7843l0190J8447J5627j2538R29n40K5659n495J529J6591l8250j9328
10264a0976J4582P096p279j3938K4295K6697p389k1548j5385O46N752K054m482
10251A25l1764o883r890K3955N1726K889N849m471k3012J4681J7671k286l23j3174
$$ plain form
10338 128446 123277 108510 82473 78837 51513 42442 33795 30047 60281 93156 121755 104940
10326 104940 84331 97896 104650 97226 84608 89055 84107 70605 68408 82028 69580 47706
10314 47706 57586 40367 10394 30462 62032 47587 39231 24048 13270 34985 46856 25160
10302 25160 6338 14937 11801 -948 19444 44046 33734 23082 -6665 -15174 -18354 -17331 -8290
10289 -8290 -14074 -30801 -16822 1771 26175 19853 8529 29055 39289 56488 59441 34426
10277 34426 16583 -13607 4840 20467 7929 8858 8318 33977 28482 30011 46602 8352 -10976
10264 -10976 3606 10702 3423 -10515 13780 40477 33088 11540 -3845 -3199 2553 4607 125
10251 125 -31639 -38522 -48412 -24457 27269 30158 36007 31536 8524 23205 40876 38590 38267 25093
10237B5093l0009j9773m130J8922O500J8222L6666q93r823j0354j0419j8272J9777
10224B1507k1474j2258k5801L878M190j2229L4234q342J03Q536k1431J057M527
10211b3503r228K3602m548N111K2305M28L6611p355l3994j3310J2686J8163k382
10198B4586n9189O110J2709k020Q331j3726N168K7369K839k9944K3070J9924K3058
10185D8285O826k7663j4200q071j0197J4625J6199J5297j0967l309j9555j6921
10173i651K2573L0931Q600N524q561k2394J4372L4169j7767m4646k6347K2029
10161H832j3041n81K1457L0647k157l1148M600O042j2858l1567j0473K5137k468
10148g578l0127l22P488p399M240L5032N658l4269J5630J1362j0529M047k0359
$$ plain form
10237 25093 -4916 -24689 -28819 -9897 -3397 14825 51491 50598 40775 30421 20002 1730 21507
10224 21507 33 -12225 -38026 -34148 -29958 -42187 -7953 -16295 -16192 -7656 -29087 -28030 -23503
10211 -23503 -32731 -9129 -13677 -8566 13739 14167 50778 43423 9429 -3881 8805 26968 24586
10198 24586 -34603 -28493 -15784 -17804 -9473 -23199 -18031 9338 12177 -17767 5303 25227 48285
10185 48285 55111 27448 13248 5177 -5020 9605 25804 41101 30134 26825 7270 -9651
10173 -9651 12922 43853 52453 57977 49416 27022 41394 75563 57796 13150 -13197 8832
10161 8832 -4209 -4790 16667 47314 45157 14009 18609 24651 11793 -19774 -30247 -5110 -7578
10148 -7578 -37705 -38027 -30539 -37938 -33698 1334 6992 -27277 -11647 -285 -10814 -6767 -27126
10135b7126o000J4408L2908J9671k0804k1561J6307K0617K4181J2585l1455j5769
10123A7962J444J875j4585j0155L1967k963q403O482J5805j6372j8029J5262J7330
10110C7620P240j2761q31j6926r100M906j1861k9870p132J6600J6900Q269n946
10097b892p621K2121Q534k033l571r833J7758J0752J3237l3189k8031k3L6602
10084B1811L1315R679k932J847k4514j2464k065K0614q280L949K3968J3461j582
10071G4807k5555Q15L500j2713J7623J6396J6438K9173k1172J2455K7504K5158
10059A64429J1783P037k982j0525J671k7205n4076k1540J3556J1305k3206l1574
10047C8673k093J04M333q171k7006J3071N0230K2785P0J0357j6203l1496P798
$$ plain form
10135 -27126 -33126 -18718 14190 33861 13057 -8504 7803 28420 52601 65186 33731 17962
10123 17962 19406 21281 6696 -3459 28508 25545 17142 23624 39429 23057 5028 20290 37620
10110 37620 44860 32099 31268 14342 5242 10148 -1713 -31583 -38715 -22115 -5215 3054 -2892
10097 -2892 -10513 11608 20142 18109 14538 4705 22463 33215 46452 13263 -14768 -14791 21811
10084 21811 53126 62805 59873 61720 37206 24742 22677 43291 35011 38960 62928 76389 74807
10071 74807 49252 50067 53567 40854 58477 74873 91311 120484 99312 111767 139271 164429
10059 164429 176212 183249 180267 169742 171413 144208 90132 68592 82148 93453 70247 38673
10047 38673 36580 36684 41017 32846 5840 18911 69141 91926 91996 102353 86150 54654 62452
10034F2452j2680k6690k8017L7065q374l3314O048J4738J4121J6000J5463j3600
10022D3212j8683q713j1660N783K3754Oj3054j6484o136K4669K9871J195m2435
10009A1325l8239J9985J3744P311J780L58j2399m181J6979K2278p113M141j4029
9996B1940q442j1135J731M261Q847J9402m943k7689O719j494J3604r91J065p157
9982A5718j7572N67K5651l801L199r575R111j6336k6547p548L1162k505k5779
9969b4255M428J0540l223J281j1237j9314R866K4761r720K2042J5094k0008J8017
9956A8272j3435j6047k5411J2185m220r534r851L384J7184p883k459J630L7897
9943A712J0730J16L603r324j7236Q573j0387k8017m631J0951L3500M1111M2817
$$ plain form
10034 62452 49772 23082 -4935 32130 23756 -9558 -3510 11228 25349 41349 56812 43212
10022 43212 24529 15816 4156 9939 33693 33699 20645 4161 -1975 22694 52565 53760 11325
10009 11325 -26914 -6929 6815 14126 15906 16264 3865 -316 16663 38941 31828 35969 21940
9996 21940 13498 2363 4094 8355 17202 36604 31661 3972 10691 9197 22801 21810 22875 15718
9982 15718 -1854 -1287 24364 20563 23762 14187 23298 6962 -19585 -27133 4029 1524 -24255
9969 -24255 -19827 -9287 -12510 -11229 -22466 -41780 -31914 -7153 -16873 5169 20263 255 18272
9956 18272 4837 -11210 -36621 -24436 -28656 -38190 -48041 -44657 -27473 -35356 -37815 -36185 1712
9943 1712 12442 12558 16161 6837 -10399 -1826 -12213 -40230 -44861 -33910 -410 40701 83518
9930H3518K022k0661O024j0428k0433J0672M439k8000J983J9910K6498R049l9201
9917D5392k2936q425P447p801k0940n921n877k9232r432j279N701M1650K7607
9904A5954O105p633j1327m433k4703J0694J3004l2472j1943K4326L5296m922k3791
9891a5845O73L0240k0312j0378L8067L42N769J2119J1294k3983j7619J8686o151
9878B2902k9077L610K554J458k0353J2113q919k8038k512J4118k865m989J141
9865c8857n779J830L7741r175r968K055q594j5939j8986J7804P411J6515J2746
9852a1196p107J4064N380j4510l461K5476N635k2619m696j0845J2308Q743q198
9839a1026l111J8714k272j3428P580l254j2953j7581K0043K3364p33j8769J6521
$$ plain form
9930 83518 85540 64879 70903 60475 40042 50714 55153 27153 29136 49046 75544 84593 45392
9917 45392 22456 14031 21478 13677 -7263 -13184 -19061 -48293 -57725 -59004 -53303 -11653 15954
9904 15954 22059 14426 3099 -1334 -26037 -15343 -2339 -34811 -46754 -22428 12868 7946 -15845
9891 -15845 -15172 15068 -5244 -15622 22445 22787 28556 40675 51969 27986 10367 29053 22902
9878 22902 -6175 -2565 -11 1447 -18906 -6793 -15712 -43750 -46262 -32144 -35009 -39998 -38857
9865 -38857 -44636 -42806 -5065 -14240 -24208 -22153 -30747 -46686 -65672 -47868 -40457 -23942 -11196
9852 -11196 -18303 -4239 1141 -13369 -16830 8646 14281 -8338 -13034 -23879 -11571 -2828 -11026
9839 -11026 -14137 4577 2305 -11123 -3543 -6797 -19750 -37331 -17288 6076 5343 -13426 3095
9826C095J0256L0732J69M21m128n253k5841k0815Q23o4N387K578L803K0578j1181
9811A0560k4356M434K2922M987L0879j4504j106r746k3853k2868J8769M0627J8707
9798E5452K0162M7866N5811K9242J8783L3495J8281K2675O2642N899m067m5114
9786C21127m3299r284l1879q8927k7833M592l3893o103l517j8658O398j038j6708
9773E0978j190m3097L990K7361N04J6678j1508q68k55j3757l0677k9901L921K1603
9759f218r687J256K7706j1297p936N117R476k3133j5520j0376J4196n947R491
9746b2872o937L7886M307J3214R428l8593k5543J7332J7572q907K2459N013j900
9733B2459k4013j2800k997KK0819P218l0026j6686J7481R537j6038m917N75p85
$$ plain form
9826 3095 13351 44083 44252 44673 40545 35292 9451 -11364 -10541 -10605 -5218 -2640 1163 21741 10560
9811 10560 -13796 -9362 13560 18547 49426 34922 33816 24070 217 -22651 -3882 36745 55452
9798 55452 75614 123480 179291 208533 227316 260811 279092 301767 364409 370308 366241 321127
9786 321127 277828 268544 236665 147738 119905 124497 90604 84501 80984 62326 68724 67686 50978
9773 50978 49788 6691 10681 38042 38546 55224 43716 42848 42593 28836 -1841 -31742 -27821 -6218
9759 -6218 -15905 -14649 13057 1760 -6176 -1059 8417 -14716 -30236 -40612 -26416 -32363 -22872
9746 -22872 -29809 8077 12384 25598 35026 -3567 -29110 -11778 5794 -3113 19346 24359 22459
9733 22459 -1554 -14354 -17351 -17349 3470 10688 -19338 -36024 -18543 -9006 -25044 -29961 -29386 -30171
9719c0171L0555O203j3231j7760j0198J7339J8516o694K174n939k0193j0706K4709
9706a5396J6707p319o015P361k305K2947n912k7292K3183J7459J7811j2660j8779
9693I790j8587j5980J6780J6774j59k8273p137K2968J0664J7782j853k7050j3540
9680a7821O306K0254J2931j8532j5637J572j7038j8483J3338K137J3213J0011
9668g749K0123J5185m434j0213j0785j1556j1487Q849K8348J069k5808j1988l156
9655b3602r878N903K7921P241j193r201n418l7327m194J9861o608m1657q065K898
9641h3319j6083L6687K0770L2311q404l1728J721L8769K9795j2785K6090Q005
9629D1829p440K925M560j586n817j9478j0933j4521o322J3176j2214j1953N842
$$ plain form
9719 -30171 384 6587 -6644 -24404 -34602 -17263 1253 -5441 -3267 -9206 -29399 -40105 -15396
9706 -15396 1311 -6008 -12023 -4662 -6967 15980 10068 -17224 5959 23418 41229 28569 9790
9693 9790 -8797 -24777 -7997 8777 8618 -19655 -26792 -3824 6840 24622 22769 -4281 -17821
9680 -17821 -11515 8739 21670 3138 -12499 -10927 -27965 -46448 -33110 -30973 -17760 -7749
9668 -7749 12374 27559 23125 12912 2127 -9429 -20916 -12067 16281 17350 -8458 -20446 -23602
9655 -23602 -33480 -27577 344 7585 6392 -2809 -8227 -45554 -49748 -29887 -36495 -78152 -86217 -83319
9641 -83319 -99402 -62715 -41945 -9634 -18038 -49766 -48045 -9276 20519 7734 33824 41829
9629 41829 34389 37314 41874 40288 34471 14993 4060 -10461 -16783 -3607 -15821 -27774 -21932
9616b1932o784j8298P718J9961R689q635K258j2893j6941j8891J7898j490K8108
9603b0232K557O112j572O232N488j0646l70Q116M223q786Q995K2025N570k4425
9589C287j121k6251p262J687J200j4646K3426K9078K3853K0749J4760m3547l0764
9576e551P006J1704R651j6684l992k7241o323K6026K6870K9939L621m406k2165
9563B8455q1R940n896n024j3956j4647L861Q565k377M562K4811J6740j8697q561
9549B7695r23J2711k0702j6501J2935n728k5008q167L993J1036P372J3992K4170
9536C6875j4879M56j22J3509J6049l6438j2714K1087J5121J629j4933j7089N666
9523A4217j4771k0394N412k8672n4335L153L8068K3004M383j2388K1884J2059
$$ plain form
9616 -21932 -28716 -47014 -39296 -19335 -9646 -18281 -16023 -28916 -45857 -64748 -46850 -48340 -20232
9603 -20232 -17675 -11563 -13135 -6903 -1415 -12061 -12431 -4315 -92 -8878 117 22142 27712 3287
9589 3287 2166 -24085 -31347 -29660 -28460 -43106 -19680 9398 33251 54000 68760 25213 -5551
9576 -5551 1455 13159 22810 6126 2134 -25107 -31430 -5404 21466 51405 55026 50620 28455
9563 28455 28374 38314 32418 27394 13438 -1209 2652 11217 8840 13402 38213 54953 36256 27695
9549 27695 26772 39483 18781 2280 15215 9487 -15521 -23688 -19695 -8659 -1287 12705 36875
9536 36875 21996 22452 22330 35839 51888 15450 2736 23823 38944 40573 25640 8551 14217
9523 14217 -554 -20948 -15536 -44208 -98543 -95390 -57322 -34318 -29935 -42323 -20439 -8380
9511h380K252j1914j408Q673J1299K0241j0441j5369m83K80J6483p306k4123J0158
9497a0038P01j5248K406m830J9572K5528j339j4589p484m522j3602j9900M059
9484c9286J0070J7496M317n076NL0114m290j5990N46J1870M907N691K0927R95
9470D2296r645j4818K3121m49k5322P521L0247j3426j2563J5202J2778q636j0177
9457C6129O289l623J0836j0644l0566j786l1934p808J8739L615L0882J5260R422
9444D4811J2459O531j3082o327p908L985K540m79j3287j9157r297J7714Q586j8257
9430H832o175P761N653J1125o231K3217K3313l8839M568m280j4531j652J3909
9417B6670K1449J0282J5331j2964n872l815l902J1661Q316J7554j6480r363L3485
$$ plain form
9511 -8380 -6128 -18042 -19450 -10777 522 20763 10322 -5047 -5530 -5250 11233 3927 -20196 -10038
9497 -10038 -9337 -24585 -22179 -27009 -7437 18091 16752 2163 -5321 -9843 -23445 -43345 -39286
9484 -39286 -29216 -11720 -7403 -12479 -12474 17640 13350 -2640 -2094 9776 14683 20374 41301 42296
9470 42296 32651 17833 40954 40505 15183 22704 52951 39525 26962 42164 54942 46306 36129
9457 36129 42418 38795 49631 38987 8421 6635 -25299 -33107 -14368 -10753 20129 35389 44811
9444 44811 57270 63801 50719 44392 36484 40469 43009 42530 29243 10086 789 18503 27089 8832
9430 8832 2657 10418 16071 27196 20965 44182 67495 28656 33224 28944 14413 12761 26670
9417 26670 48119 58401 73732 60768 54896 51081 47179 58840 67156 84710 68230 58867 92352
9404I2352J8455K587M195j0923K5155J0157k5983j2601j5461N436m199j3948l984
9391G1238k624J7917J2656K2848J4212R117r180J756R02o626Q361J1843J1863
9378A64283p613p23L2222J9305j6364N467K7125J3098j1985R89n218J0433J72
9365B31191O672L1013L4908J8322J7346J0103Q650j250K429N075K3723L5557L6191
9352D59930L0346L3897N4552P045j5655M9774M2459M0244M5553N9252P2387O6035
9340I45819O8856P0220O4753J06652J29961J08241J18089J31532J34371J30384
9330B008878J72812J61531J57466J77892J65832J35493J11987J09559R9720P9342
9320C380512M4175j975m0802l3515o9933j20081j19477j08332j37803j86623j49219
$$ plain form
9404 92352 110807 113394 117589 106666 131821 141978 115995 103394 87933 93369 89170 75222 71238
9391 71238 68614 86531 99187 122035 136247 145364 136184 137940 138842 132216 140577 152420 164283
9378 164283 156670 155947 188169 207474 191110 196577 223702 236800 224815 225804 220586 231019 231191
9365 231191 237863 268876 303784 322106 339452 349555 358205 356955 359384 364459 388182 423739 459930
9352 459930 490276 524173 578725 585770 570115 619889 662348 702592 748145 807397 879784 945819
9340 945819 1014675 1084895 1149648 1256300 1386261 1494502 1612591 1744123 1878494 2008878
9330 2008878 2181690 2343221 2500687 2678579 2844411 2979904 3091891 3201450 3301170 3380512
9320 3380512 3424687 3422712 3381910 3348395 3278462 3158381 3038904 2930572 2792769 2606146 2456927
9309B456927j30958j45007j02642q5390j11411j00735j11321r9927p7175p8839
9299A413522o3042m9790n3926q5549l8393o8948p5933m8795k9061j4854m2626
9288H42605m6236n3001o7576k5558k5146k7522m1539r879r151l106p848j8245
9276E07798l672l0374j5429q042j24m896k0842l0334j5301j0803l9785j3371P339
9263C22164k870l2490n740J9094k722p695k3073l2825j9693M3236J7828k2145
9251B53069j7639j5423l1793M016K0293j4917j7133j1020n283O688j2734p355
9239A50769L994r446K1088N956J2393p404k6377k4613J544J7018J4322k9211k3392
9226A06641j5315p572M8799J3848k6067k081j193o309j4799j1686l217o509j9647
$$ plain form
9309 2456927 2325969 2180962 2078320 1992930 1881519 1780784 1669463 1569536 1492361 1413522
9299 1413522 1350480 1300690 1246764 1161215 1122822 1053874 977941 929146 900085 885231 842605
9288 842605 796369 743368 675792 650234 625088 597566 556027 546148 536997 533891 526043 507798
9276 507798 504126 473752 458323 450281 450157 445261 424419 394085 378784 367981 328196 314825 322164
9263 322164 319294 286804 281064 300158 297436 289741 266668 233843 214150 257386 275214 253069
9251 253069 235430 220007 188214 192230 212523 197606 180473 169453 164170 170858 158124 150769
9239 150769 154763 145317 166405 172361 184754 177350 150973 126360 127904 144922 159244 130033 106641
9226 106641 91326 83754 132553 146401 120334 118253 117060 110751 95952 84266 81049 74540 54893
9213E4893k3302n693Q879L0356J1353o760m277k4937j4024K7906K4180j3457p815
9200E7302J6570j8703k2421K718q799O738J0270K9566J8512l7377k8136o556j0568
9187I116J0386J7830J9408P717O003p324j5795q779J1945p873l2107K4958n849
9174B9636J4552K4811n397J179k7500l2826Q737J9648L361k4227j0210J8400J1010
9161C1174k1291M114O423j0982k3599J809N416j129K8722N33j5379N784j0980
9148F15J6284K3008r33k5629j0919O485K6525Q228k9222M366J2086k7005n048
9135a159J5351J7508q798p439J5146J4222J6292p05j6647j5522l3342j9869m671
9122b9633K2623J4433J5753L648O523J402k2150R171j4357k2574P135J3556K2079
$$ plain form
9213 54893 31591 25898 34777 65133 76486 69726 65449 40512 26488 54394 78574 65117 57302
9200 57302 73872 55169 32748 35466 26667 33405 43675 73241 91753 54376 26240 19684 9116
9187 9116 19502 37332 56740 64457 70460 63136 47341 38562 50507 42634 10527 35485 29636
9174 29636 44188 68999 63602 64781 37281 4455 13192 32840 36201 11974 1764 20164 31174
9161 31174 9883 13997 20420 9438 -14161 -12352 -6936 -8065 20657 21190 5811 11595 615
9148 615 16899 39907 38974 13345 2426 8911 35436 43664 14442 18808 30894 3889 -1159
9135 -1159 14192 31700 22902 15463 30609 44831 61123 60418 43771 28249 -5093 -24962 -29633
9122 -29633 -7010 7423 23176 26824 33347 34749 12599 21770 7413 -15161 -8026 5530 27609
9109B7609n816j7889Q19J1680q668k782j321J7072j5533k599J2238Q588k5201
9096a803j0411m780J7476J2351J774k69n033M483J1496J3339j3102L533l5793
9083f739j5893K237k543J9863R041J4218N772J1498k826L646o278j7300k8901
9070a4205j9379K881L2423J6078O27n119j9696p372K8182K9835L349k3537n643
9057A8424J2891J3625k2861k241K322J0188J0937q330m5848l926J1854J6926J84
9044A4145m680j9873k5352L369k860K208j0751K8021M3444R947r402n87n2470
9031b4841j9453J4729J5473j500j0122j7236K2356K3784J5869n20o68k0317k138
9018d584J0318Q411p010n272q660k87M920L331J1710J3478l2621j4359j0215J5425
$$ plain form
9109 27609 21793 3904 4723 16403 7735 4953 3632 20704 5171 2572 14810 23398 -1803
9096 -1803 -12214 -16994 482 12833 14607 14338 9305 13788 25284 38623 25521 29054 -6739
9083 -6739 -22632 -20395 -22938 -3075 5966 20184 25956 37454 34628 38274 31996 14696 -14205
9070 -14205 -33584 -30703 1720 17798 18425 13306 -6390 -13762 14420 44255 47604 24067 18424
9057 18424 31315 44940 22079 19838 22160 32348 43285 34955 -10893 -14819 -2965 13961 14145
9044 14145 9465 -10408 -35760 -32391 -35251 -33043 -43794 -15773 27671 37618 28216 27629 -24841
9031 -24841 -44294 -29565 -14092 -15592 -25714 -42950 -20594 3190 19059 18539 17871 -2446 -4584
9018 -4584 5734 14145 7135 1863 -6797 -7084 -2164 1167 12877 26355 -6266 -20625 -30840 -15415
9004a5415J0445m091J2258J1437r701J3558m268k3451j4765N468k1797j2424j893
8991e4639K1124J1775K8678K3677J0570n991k5654o404m541K057J5879J2255j3287
8978A5499j1595L6422l0891j9640J3968m070j809M224p102o034K0785L524k4152
8965a0871K1645K2394J9556N112N551k0212m90R363J23j7203k0220K7770j405
8952D1113k6193n721K995k157j3922r009k857Q466J7333P249m116O072J034j5593
8938D694o851K6190l991J4314L0496J2187j3703j0377j8441o764j3247P046L3932
8925E5485j808k1981j474l0724J558L837j729J2199Q072N01n912P414k8205r771
8911a2538J232J527L7249K2010k1064j6364K7995j590r543k298N441r969l712
$$ plain form
9004 -15415 -4970 -9061 3197 14634 4933 18491 14223 -9228 -23993 -18525 -40322 -52746 -54639
8991 -54639 -33515 -21740 6938 30615 41185 35194 9540 3136 -1405 652 16531 28786 15499
8978 15499 3904 40326 9435 -10205 3763 -307 -2116 2108 -4994 -11028 9757 13281 -10871
8965 -10871 10774 33168 52724 57836 63387 43175 42685 52048 52171 34968 14748 42518 41113
8952 41113 14920 9199 12194 10037 -3885 -12894 -15751 -7285 10048 17297 13181 19253 20287 4694
8938 4694 -2157 24033 20042 34356 64852 77039 63336 52959 34518 27754 14507 21553 55485
8925 55485 53677 31696 30222 -502 1056 4893 3164 15363 23435 23936 18024 25438 -2767 -12538
8911 -12538 -11306 -9779 27470 49480 28416 12052 40047 38457 28914 26616 32057 22088 18376
8898A8376M0935J6105L722j2549l00K250j0469l7259j1650o610K2881J555R878
8885C6865J2506J2184j3683j4400q246l872L2987j1526l7035j7643J7655M0896
8873D6688L2730R559j0152r214J1068K6339J781J2865K5944O729m5336l1429L474
8860H1046R72j5234k8500k3035J6332L7841j3952j0166O719J7481p529k0628j7338
8847B4009R02J0045J6399J4700L378K8730J0341J0160L5416M1155M2003Q4490
8835C21728J44356J51197Q1706K6024j961l5710j3882j35663j73152r2968l5422
8824B36253m0434j027j4880k7616Q633j8656k9980j3680j1490K6695q420m1417
8812F3981L8563L4090j7358l3599k7675K0105j1764j1713M7727L2374j6153o931
$$ plain form
8898 18376 59311 75416 79138 66589 66289 68539 58070 20811 9161 2551 25432 26987 36865
8885 36865 49371 61555 47872 33472 25226 21354 54341 42815 5780 -11863 5792 46688
8873 46688 79418 88977 78825 69611 80679 107018 108799 121664 147608 154337 109001 77572 81046
8860 81046 82018 66784 38284 15249 31581 69422 55470 45304 52023 69504 61975 41347 24009
8847 24009 24911 34956 51355 66055 69433 98163 108504 118664 154080 195235 237238 321728
8835 321728 466084 617281 698987 725011 723050 687340 673458 537795 364643 271675 236253
8824 236253 195819 194792 179912 152296 160929 142273 112293 98613 87123 113818 105398 63981
8812 63981 102544 136634 119276 85677 58002 78107 66343 54630 102357 134731 118578 111647
8800A11647J7831K3283J0168J0018L0582K4883L2575M6851Q5155J44811K74990
8789H12794L06284K50411P7064K5996L1492m5582l04738l75391k38408j18109
8779D21813n7447k8843k1996l7137l6865l3800n951M052j8971k5361j9913j7141
8767A22440J1114K6573K911l9996l1498j9238p406m554J1582K113K4297J6374
8755A14712j8194M379m737J9145J3546L2148K4956M506M635P9869J43434J50888
8743E69287J16362K7535j2661o507J9939q2965j63733j33933p2634o2785m8825
8732A49080J2142l2166j8881n5K6194j4236l1782k172J1708P899J6429K460j1015
8719A15605o093o720J4724n601j2255j3279j5184j3846K0767K3694n083k9721
$$ plain form
8800 111647 129478 152761 162929 172947 203529 228412 260987 307838 392993 537804 812794
8789 812794 1119078 1369489 1446553 1472549 1504041 1458459 1153721 778330 539922 421813
8779 421813 364366 335523 313527 276390 239525 205725 199774 203826 184855 159494 139581 122440
8767 122440 133554 160127 163038 123042 91544 72306 64900 60346 71928 74041 98338 114712
8755 114712 96518 100897 96160 115305 128851 160999 185955 190461 195096 274965 418399 569287
8743 569287 685649 713184 700523 694016 713955 630990 467257 333324 260690 197905 149080
8732 149080 161222 129056 110175 110120 136314 122078 90296 88124 99832 107731 124160 126620 115605
8719 115605 109512 102792 117516 111915 99660 86381 71197 57351 78118 101812 96729 67008
8707F7008J1694N027j6104j4995K3179J2628n457k05M336j4593j2707J0393j4853
8694E5351q92M294m581L523J5443q153k9530O936J8048L341n262q292l693J0949
8680E7482k47J044r409J3857J9283j0340m6191J3007L1055M91k5124O716j0975
8667D0649l6754L125J6395k648K0908J1650j6223l551J1022J0405j6839j0707
8655B7432o575K1853K0464K8080J851l4565l2289j9619L0246P478n795j4873K9207
8642E2895M4519P957K4677l2935l2188o23K0826J8595n546j6740L6038O395j9413
8629A04457l097m099M604J6982J6924j0595L787K1514o933n377J3818j5155r566
8616A27264J2645M2166J0238P617J1582K614o913k9665l826L3382j6688j327L3402
$$ plain form
8707 67008 78702 83729 67625 52630 75809 88437 82980 82775 87111 72518 59811 70204 55351
8694 55351 54459 58753 54172 57695 73138 64985 35455 42391 60439 63780 58518 50226 46533 57482
8680 57482 57235 58279 48870 62727 82010 71670 25479 38486 69541 70032 44908 51624 40649
8667 40649 3895 7020 23415 20767 41675 53325 37102 33551 44573 54978 38139 27432
8655 27432 20857 42710 63174 91254 93105 58540 26251 6632 36878 44356 38561 23688 52895
8642 52895 97414 105371 130048 97113 64925 64302 85128 103723 98177 81437 117475 123870 104457
8629 104457 101360 97261 101865 118847 135771 125176 128963 150477 143544 138167 151985 136830 127264
8616 127264 139909 182075 192313 199930 211512 214126 207213 177548 173722 207104 190416 189089 222491
8603B22491k1599j0543L87J5950L0885J3478L189M453J6221N102k13j4502j6515
8590B48784k2594p679m072k967j5463k3361K0466L6017K5226k254q924m087j8091
8577B21001n6305k3038O98k3745j0490j0742l974L9189K7832L43J3327j1776J0033
8564A72353r6j9851M487l2725j2588J482r05m671j9365j080K3727j9078k9347
8551F2343l7381K9619o412k3060k3571L602N2022K5696J133k0760r182k821k098
8538D9130J414l2115j5503M184J0285N544J790k9652K5946m520k0987L3361K8105
8525E6982j6922o030K8874M3435N298q187K99K961J0097n0747k6987J292M2m890
8511C5517J907r310k5233P236J8154L1382P388o960k5098k1068j5497l0186q775
$$ plain form
8603 222491 200892 190349 190736 206686 237571 251049 254238 258691 274912 280014 279801 265299 248784
8590 248784 226190 218511 214439 211472 196009 172648 193114 229131 254357 252103 243179 239092 221001
8577 221001 164696 141658 142356 118611 108121 97379 93405 132594 160426 160769 174096 162320 172353
8564 172353 172257 152406 156893 124168 111580 113062 112157 107486 88121 87041 110768 91690 62343
8551 62343 24962 54581 48169 25109 1538 5140 57162 82858 83991 63231 54049 51228 49130
8538 49130 50544 18429 2926 7110 17395 22939 24729 -4923 21023 16503 -4484 28877 56982
8525 56982 40060 34030 62904 106339 111637 103450 103749 106710 116807 66060 39073 40365 40407 35517
8511 35517 37424 28114 2881 10117 28271 59653 67041 60081 34983 13915 -1582 -31768 -40543
8498d0543R070K5050K3521n97M464J8479M797K5343p544q517k3679J4073K9448
8485G3365j9225j3463o746K2727N321j9323j2849l2244P83j994Q238J9229K92
8472B4111j2345L582n337K313Q408L1569p022j2719m265k0446j678M336L733J6312
8458C0552j0251k1667K518J4021R296j6841n750R192j5176N254K369o223j2297
8445a5003k5129J5015O745K979L4215P413J0387P409o415j8658J3263L4589J3316
8432H0126j5846l1564k8149k1659N486J149O287K3454K7000K097k3044k7272j574
8419c509K6095O901K045j7403J8900J1236N687l682l6557j661J2263j634r917
8406H764m967j6729o720J8014J8089N672k4751j8060J5527j0700J4980J9769R375
$$ plain form
8498 -40543 -31473 -6423 17098 16501 20965 39444 44241 69584 62040 53523 29844 43917 73365
8485 73365 54140 40677 33931 56658 61979 42656 29807 -2437 -1654 -3648 4590 23819 24111
8472 24111 11766 15348 10011 12324 20732 52301 45279 32560 28295 7849 6171 10507 14240 30552
8458 30552 20301 -1366 1152 15173 24469 7628 1878 11070 -4106 1148 3517 -2706 -15003
8445 -15003 -40132 -25117 -18372 -15393 18822 26235 36622 44031 37616 18958 32221 66810 80126
8432 80126 64280 32716 4567 -17092 -11606 -10457 -4170 19284 46284 48381 25337 -1935 -3509
8419 -3509 22586 29487 31532 14129 33029 44265 49952 46270 9713 8052 20315 18681 8764
8406 8764 3797 -12932 -19652 -1638 16451 22123 -2628 -20688 -5161 -15861 -881 18888 28263
8393B8263k782k2478k7629O31K5116J6832j8396J215N407Q790L024J6802m77p416
8379B6902r459j1425m07K8073M511l744j8596r353J6197q504p299R505J5510j1396
8365B0515R00j6288k7403P487K7288K04O279r769j2550Q667n923j7474k3526J2260
8351b9333J3451M493J9255J87j7227l2791q371R584L3200J6268j3657r811R239
8338e513j438R235j4699J2937j778l314O151m395J912L594M026P772K1248Q401
8324D4139j3981k99j9924k2011J9224K1413l3901j1308J6111L91k463J4126P036
8311A8553Q346K409K941m835j3190q278J2436j9839j4048J3530j4141K3189p507
8298d34o406M764l30r670J2605L356k623j2606J5016j64j1690Q601K511l3578
$$ plain form
8393 28263 25481 3003 -24626 -23995 1121 17953 -443 772 6179 14969 17993 34795 34318 26902
8379 26902 17443 6018 5611 33684 38195 34451 15855 6502 22699 14195 6896 16401 31911 20515
8365 20515 21415 5127 -22276 -14789 12499 12703 18982 9213 -3337 5330 -593 -18067 -41593 -29333
8351 -29333 -15882 -11389 7866 8053 -9174 -41965 -50336 -40752 -7552 8716 -4941 -14752 -5513
8338 -5513 -6951 2284 -12415 522 -1256 -4570 1581 -2814 -902 2692 6718 14490 35738 44139
8324 44139 30158 29859 9935 -12076 7148 28561 -5340 -16648 -537 -146 -2609 11517 18553
8311 18553 26899 29308 32249 27414 14224 5946 18382 -1457 -15505 -1975 -16116 7073 -434
8298 -434 -6840 -2076 -2406 -12076 529 3885 1262 -11344 3672 3508 -8182 419 2930 -30648
8284c0648j2119K6597K8634R239j4371r44k7216l5263k2433o799M284Q977J9461
8271e2601M374J7871M0899p852k4456j6491L2659J9807p185J5293m071q452K831
8258A2626P444n455k404n164L494k1047m076J0457N499N571K813Q067j1210j8059
8244a1444O259J718J1634j0463j0232l297K3552L9327p424k3466j4767j3711j7801
8231c0115J6494j369q53L2338m54j6798l936k0377k2197j2556J5734J1009R27
8218c2153N289J4226j4273N433J83O333p266J1734J5700j4009j5114J5340K8580
8205B0003j7511O390M155k2455K2723J769j5445j6022j7460J1165K8310J0953
8193A6575N840j2061n098L929o583l9855j4241R819k738M0713O704K801J2040
$$ plain form
8284 -30648 -42767 -16170 12464 21703 7332 6388 -20828 -56091 -78524 -85323 -81039 -72062 -52601
8271 -52601 -48227 -30356 10543 2691 -21765 -38256 -5597 14210 7025 22318 18247 9795 12626
8258 12626 20070 14615 12211 7047 10541 -10506 -14582 -4125 1374 6945 9758 17825 6615 -11444
8244 -11444 -5185 -3467 8167 -2296 -12528 -15825 7727 47054 39630 16164 1397 -12314 -30115
8231 -30115 -13621 -14990 -15843 16495 16041 -757 -4693 -25070 -47267 -59823 -44089 -33080 -32153
8218 -32153 -26864 -12638 -26911 -21478 -21295 -14962 -22228 -10494 5206 -8803 -23917 -8577 20003
8205 20003 2492 8882 13037 -9418 13305 15074 -371 -16393 -33853 -22688 5622 16575
8193 16575 22415 10354 5256 9185 2602 -37253 -51494 -41675 -44413 -3700 3004 5805 17845
8180A7845P264j2042k1073l1593o00J5274J6708R748J3770k1963j4728K840J1842
8167f708J6475O992q815j1963j9794k6818M378l364q435Q104K2272J1775M273
8154a1628J3792M775J4396N712l447l535k952J5589o25l6900P68q744j5451K13
8140b8037L2711q923k957k1724l290J5290R872L2350O439p672L585j6267K3214
8127C4591k293l491p119J4793j92k6683m5809p992K4657K1488J702J6186J7588
8114C7426j0814k23k765j5870l5971R031J7437L028J1681K2666p536K2325j4729
8101C5686j4949l3398K150K0336J7823k6307J6933J4718O630k4123k7483J163
8089a0821K2374K1386j4191p961O10j710j453m627j9599l544m307j3706J3779
$$ plain form
8180 17845 25109 13067 -8006 -39599 -40199 -24925 -8217 1531 15301 -6662 -21390 -18550 -6708
8167 -6708 9767 16759 7944 -4019 -23813 -50631 -46253 -49617 -58052 -49948 -27676 -15901 -11628
8154 -11628 2164 6939 21335 27047 23600 20065 17113 32702 32077 -4823 -4055 -12799 -28250 -28037
8140 -28037 4674 -4249 -7206 -28930 -32220 -16930 -7058 25292 31731 24059 27644 11377 34591
8127 34591 32298 28807 21688 36481 36289 9606 -36203 -44195 -19538 1950 3652 19838 37426
8114 37426 26612 26389 23624 7754 -28217 -19186 -1749 1279 12960 35626 28090 50415 35686
8101 35686 20737 -12661 -10511 9825 27648 1341 18274 32992 39622 15499 -11984 -10821
8089 -10821 11553 32939 18748 10787 11397 9687 8234 3607 -15992 -19536 -23843 -37549 -23770
8076b3770P428L729j4505J7254K3279N113J894j9970j5507k721J2174R299J993
8063E690l961J8546Q602p540o235k0666j8053J3476J6389J0266k1359q185j5608
8050b8638M074L1590R430J2166l250N858q326j6212k1567k292j1224K0627J3194
8037E430j1288N687K4457J1014j6956R553R446K5410M055k3213j2280p584l7333
8024a3602J1507M8857J1989k0633k8960n501l256j2281k4931o194K6328L6761
8012B0084j823o535r223L7290J2023J217L2051K8718l3808k1721J9566K8486k3076
7999H3249L764J429k715K824k7904j3279O539P372l169j1050j6279l322L1208
7986E8667M264j5666K644k4613p408P082j881o630K868q583j58K2802j050q357
$$ plain form
8076 -23770 -16342 -12613 -27118 -9864 13415 18528 20422 452 -15055 -17776 -5602 3697 5690
8063 5690 1729 20275 28877 21337 15102 -5564 -23617 -10141 6248 16514 -4845 -13030 -28638
8050 -28638 -24564 7026 16456 28622 25372 31230 22904 6692 -14875 -17167 -28391 -7764 5430
8037 5430 -5858 -171 24286 35300 18344 27897 37343 62753 66808 43595 31315 23731 -13602
8024 -13602 -2095 46762 58751 38118 9158 3657 401 -11880 -36811 -43005 -16677 20084
8012 20084 18261 11726 2503 39793 51816 53033 85084 113802 79994 58273 77839 106325 83249
7999 83249 87013 88442 85727 88551 60647 47368 53907 61279 58110 47060 30781 27459 58667
7986 58667 62931 47265 49909 25296 17888 24970 23089 16459 19327 10744 10586 33388 32338 23981
7972B3981J2053j1875J770k6829q77J4759K4748L2796J8859l8506m238J52O098
7959E2891K6632l929k3259N2K32K4532j3489k774q181J130k5462r679Q201P063
7945C3960M069P13j3409k8794K3965L5110K0070m823N00l9075l1605K7735J9374
7932D7790m0094j248j951j3934Q824K4039J6880N78o719l98j0514k0376o106o022
7918i251K8369J9585j0086p056J1790j1070k8742l92K0239J3985k4704L241K2543
7905B8451K0098j6542j3853P433R465j0818j0535O304o43j6694j4549j952j2055
7892b5890J7338R236j3865J2739Q49j8916j600K9484K021q669K26m555J4579k049
7878A0928k9172l1919j8900J3859J6927j82K6334K0772l3196j6790k333K3162
$$ plain form
7972 23981 36034 24159 25929 -900 -1777 12982 37730 70526 89385 50879 46641 46793 52891
7959 52891 79523 75594 52335 52387 52619 77151 63662 60888 52707 53837 28375 18696 26897 33960
7945 33960 38029 38742 25333 -3461 20504 55614 75684 70861 71361 32286 681 28416 47790
7932 47790 7696 6448 4497 -9437 -613 23426 40306 40884 34165 33767 23253 2877 -3229 -9251
7918 -9251 19118 38703 28617 21561 33351 22281 -6461 -6853 13386 27371 2667 5908 28451
7905 28451 48549 32007 18154 25587 35052 24234 13699 20003 19360 2666 -11883 -13835 -25890
7892 -25890 -8552 684 -13181 -442 407 -18509 -20109 9375 11396 2727 2953 -1602 12977 10928
7878 10928 -18244 -50163 -69063 -55204 -38277 -38459 -12125 8647 -24549 -41339 -43672 -20510
7866b0510K8610J563N261N697R093j1325K1330j0504k1174Q761J549k3370j3578
7853a8597J8340q088j4261J232O97j50j179n697N228q588J7679J6058Q070n387
7839E357k816r442J4882m736R144M91m299m389j2803l790P113J6932J3778o376
7825A9046l058o368k7698k192k956L483q144j5685k5256M983J6431J4693k351
7812c5072Q292k716n813k724j549O584J8000L845J8226j0814R15M909j9432j9546
7798c6895j6173n489Q172j399K531K4698J2589r951j2844R961J2845P801l762
7785g916n387J7710k0453J756j5493j1369K3978R51J16J8395N894J743m5163k1749
7771e6987J5980K5317J2672J9428J5747j6181l8868K811P343j5783O73M410j5370
$$ plain form
7866 -20510 8100 9663 14924 20621 29714 18389 39719 29215 8041 16802 18351 -5019 -18597
7853 -18597 -257 -8345 -22606 -21374 -20677 -20827 -22006 -27703 -22475 -31063 -13384 2674 10744 5357
7839 5357 2541 -6901 7981 3245 12389 12880 8581 4192 -8611 -12401 -5288 11644 25422 19046
7825 19046 15988 9620 -18078 -20270 -23226 -19743 -27887 -43572 -68828 -63845 -47414 -32721 -35072
7812 -35072 -26780 -29496 -35309 -38033 -39582 -32998 -14998 -11153 7073 -3741 -2826 2083 -17349 -36895
7798 -36895 -53068 -58557 -50385 -51784 -49253 -24555 -11966 -21917 -34761 -24800 -11955 -4154 -7916
7785 -7916 -13303 4407 -16046 -14290 -29783 -41152 -17174 -16223 -16107 2288 8182 9925 -35238 -56987
7771 -56987 -41007 -15690 -3018 16410 32157 15976 -22892 -20081 -12738 -28521 -27848 -23438 -38808
7758c8808J1461K7855K023L693m904L991J1340K2306p453k1242k8226j6002j7666
7745e1632k4156q604K7743K6831L8144K218l1864J7629J9925l6332m3610l7821
7733a01529M985L9879K2850K1046M683j2340O757J6127l5139j9112Q088p687l9382
7720i0774K7048J9748P011R612j3343J1995J8266k175o992j2402K5674m447j9094
7707b9873K960o606O078k321j5573j1411K7774J3601n116k7697L864Q816J583
7694c3921J2802K026k8685q588L726K5072J7044K1698R1J8645q082q347J5349
7681B8830J061p745J3820j8032J3272P742l9144k8450P116j1492k1106k6763N765
7668g5126L3387L7080N858r61j2339J3187m098J0326L5746j6715n68q808J832
$$ plain form
7758 -38808 -27347 508 2531 6224 1320 5311 16651 38957 31504 10262 -17964 -33966 -51632
7745 -51632 -75788 -84392 -56649 -29818 8326 10544 -21320 -3691 16234 -20098 -63708 -101529
7733 -101529 -96544 -56665 -33815 -12769 -8086 -20426 -13669 2458 -32681 -51793 -43705 -51392 -90774
7720 -90774 -63726 -43978 -36967 -27355 -40698 -28703 -10437 -12612 -19604 -32006 -6332 -10779 -29873
7707 -29873 -26913 -33519 -27441 -29762 -45335 -56746 -28972 -15371 -20487 -48184 -44320 -35504 -33921
7694 -33921 -21119 -19093 -47778 -56366 -52640 -27568 -10524 11174 11265 29910 21828 13481 28830
7681 28830 29891 22146 35966 17934 31206 38948 -196 -28646 -21530 -33022 -54128 -80891 -75126
7668 -75126 -41739 -4659 1199 238 -12101 1086 -3012 7314 43060 26345 25777 16969 18801
7655A8801N547k5428l2560K604K9374J6581k8802q559R213k9955j219p115J6081
7642c5437K9912O884k9479K6493K2596l2984j1140J1619p225j0190J150J5131
7630a2670L3124M186J3243m871j1666l9173j3894O245Q068k0735K823J9048J5955
7617c17R639n259L303j233l4875k0349l146N406R235k6384n456J3428j0244l537
7603f9789j488P597Q653J8095r472J6705J6118J2823k9162J2012P731k2266J0485
7590b1958j0701l0586N424K2230J3251O062K019J7172q65M062j9267Q12j3291
7577b5636j1484J3776M367M084j9874K4727n165O904j045n555j1046O221j3747
7564c3473M512j0273j0849J9819N555j3307K2683J5797n206j2041p793J4618J5771
$$ plain form
7655 18801 24348 -1080 -33640 -31036 -1662 14919 -13883 -22442 -13229 -43184 -44403 -51518 -35437
7642 -35437 -5525 1359 -28120 -1627 20969 -12015 -23155 -11536 -18761 -28951 -27801 -12670
7630 -12670 20454 24640 37883 33012 21346 -17827 -31721 -25476 -17408 -38143 -35320 -16272 -317
7617 -317 9322 4063 7366 6133 -28742 -49091 -52237 -46831 -37596 -63980 -69436 -56008 -66252 -69789
7603 -69789 -71277 -63680 -55027 -36932 -46404 -29699 -13581 -758 -29920 -17908 -10177 -32443 -21958
7590 -21958 -32659 -63245 -57821 -35591 -22340 -16278 -14259 2913 2048 6110 -13157 -12345 -25636
7577 -25636 -37120 -23344 -18977 -14893 -34767 -10040 -15205 -8301 -9346 -14901 -25947 -19726 -33473
7564 -33473 -28961 -39234 -50083 -30264 -24709 -38016 -15333 464 -4742 -16783 -24576 -9958 5813
7551E813Q394j284l3113k9990m678N009K5810J4858j6071j5712L5574K6893j2237
7538I266n1447k3025J4955N406N520j465j0430k6813P365K915K8497J1750m902
7525c2408j3111n416J4734K8370K4797q919j4046Q043L3702J3733j6991k8959
7513C529j2279k6881K507L559j2965m268j5310p283M0840P116o664J015N045j3535
7499c5574l97N82J5391L215k9143j7838K0114R556p692m613j5119K0922j8310
7486e8906j0656L2650J4031K8133J6095j3170j2912j0060L429l357j2270J2591
7474a4402K1521n540n56r435n806K4102k347m130J473j4902l1671J1553Q464J4962
7460f714j8559j664R625k955j8895K517L5090O300q983j0494j4974J9598N315
$$ plain form
7551 5813 14207 12923 -20190 -50180 -54858 -49849 -24039 -9181 -25252 -40964 -5390 21503 9266
7538 9266 -42181 -65206 -50251 -44845 -39325 -40790 -51220 -78033 -70668 -67753 -39256 -27506 -32408
7525 -32408 -45519 -50935 -36201 -7831 16966 8047 -5999 2044 35746 49479 32488 3529
7513 3529 -8750 -35631 -33124 -29565 -42530 -46798 -62108 -69391 -28551 -21435 -28099 -27084 -22039 -35574
7499 -35574 -35971 -35389 -19998 -16783 -45926 -63764 -43650 -34094 -41786 -46399 -61518 -40596 -58906
7486 -58906 -69562 -36912 -22881 5252 21347 8177 -4735 -14795 -11366 -14723 -26993 -14402
7474 -14402 7119 1579 1023 -8412 -14218 9884 7537 3407 4880 -10022 -41693 -30140 -21676 -6714
7460 -6714 -25273 -26937 -17312 -20267 -39162 -36645 -1555 4745 -4238 -14732 -29706 -10108 -4793
7447d793r126M258L127J104o17Q04l3806P14J8156l0381R675J3568Q966j7792
7433c6143k156J605K7330O996M517j24j7061l817j2395k6437j930R486j6433j6021
7419h2583L0874L9915j0647o948K0183J7500j8470j4230l705j192o236j4168J8759
7406c0948M943k251J0560M782K845r991M290l1107r40K9541J4166K686J810J9728
7392B0114m445m346j059l48q432j9707K266j3257M329k4789q438L0373P697N563
7378a4479J1378J0322p668J3032q664n505O437o64q767l1537n817L8524J9086
7365A5678K561M094J7289J9839K306k8254r337K5709J585k6865j6415k3955j2299
7352b8064j6378q331k5736n313K0839j4800j7296O647L3110L4935O205K546J3556
$$ plain form
7447 -4793 -13919 -9661 -6534 -5430 -6047 -5243 -39049 -38335 -20179 -50560 -40885 -27317 -18351 -36143
7433 -36143 -38299 -36694 -9364 -2368 2149 2025 -15036 -18853 -31248 -57685 -59615 -50129 -66562 -82583
7419 -82583 -51709 -11794 -22441 -29389 -9206 8294 -10176 -24406 -28111 -29303 -35539 -49707 -30948
7406 -30948 -26005 -28256 -17696 -12914 -10069 -20060 -15770 -46877 -47817 -18276 -4110 -1424 386 20114
7392 20114 15669 11323 10264 9916 1484 -18223 -15957 -29214 -24885 -49674 -58112 -27739 -20042 -14479
7378 -14479 -3101 7221 -447 12585 3921 -1584 4853 4189 -4578 -36115 -41932 -3408 15678
7365 15678 18239 22333 39622 59461 61767 33513 24176 49885 51470 24605 8190 -15765 -28064
7352 -28064 -44442 -52773 -78509 -83822 -62983 -77783 -95079 -88432 -55322 -20387 -14182 -11636 1920
7339A920L746J465j3202K4045J3709k9524o596L5638K7258j2907n0990j2860l621
7326b1919o032J4762n185l870J4229l254l1897k0623M543L1418K2640J0005o334
7313a517O063j675J416r171K023P716J073q943K435K2785o069q099l373j6236
7299a1572P84J1240j1236l3900J6340L5634J7439K6597o106j8696j5884j2126
7287a486K300k2036n165j0630O863J4051m57r864k3738k762K3404O139m564M628
7273b3317j9944q264j2192J4623K4066J6494K3299j8524p451j6692k608J4307
7261a6203K0068r906k6140j3677O209J4361R371K9119j1201k2731J4629o298m340
7248a6739k3791L73m931j1009j4246J2206K0795j3425J8446L7470L5073l441j2504
$$ plain form
7339 1920 5666 7131 -6071 17974 31683 2159 -4437 31201 58459 45552 -5438 -18298 -21919
7326 -21919 -27951 -13189 -18374 -22244 -8015 -11269 -43166 -63789 -59246 -27828 -5188 4817 -1517
7313 -1517 4546 2871 4287 -4884 -2861 4855 5928 -3015 -580 22205 16136 8037 4664 -11572
7299 -11572 -10788 452 -10784 -44684 -28344 7290 24729 51326 45220 26524 10640 -1486
7287 -1486 814 -21222 -26387 -37017 -30154 -16103 -16560 -26424 -50162 -52924 -29520 -23381 -27945 -23317
7273 -23317 -43261 -51525 -63717 -49094 -25028 -8534 14765 -3759 -11210 -27902 -30510 -16203
7261 -16203 3865 -6041 -32181 -45858 -39649 -25288 -15917 13202 2001 -20730 -6101 -12399 -16739
7248 -16739 -40530 -40157 -45088 -56097 -70343 -58137 -37342 -50767 -32321 5149 40222 36781 24277
7235B4277j0059O174R910r779k1802J0914N947K46k0030j466Q761N249R39j0732
7221a451k9928K998J2951J1255n993q419Q12R12j3072l2238k238J9044L6539n317
7207a4145J4308J7357J4227M108n309M660k995l2928N826J7452M250j7436m0279
7194c0904l5422K1932K5211Q217p434k9736k5879K2598K8457L4623J1263J0161
7182C3087j7804l3404R617J6190j4922k4505J1433J2462k7940J2188r509L544
7170b9563j2847k2814j733N372L0493J0918q497j0509j2463L6037J6952j2994
7158a1648m6409O015Q209P019j0346N416L7671K2937O364nk4282k7027O168N699
7144a4219k493J6665P892n526k8773l78m313K247p950L4976J8778j552p516k140
$$ plain form
7235 24277 14218 20392 30302 20523 -1279 9635 15582 15828 -4202 -5668 3093 8342 9281 -1451
7221 -1451 -31379 -28381 -15430 -4175 -10168 -18587 -17775 -16863 -29935 -62173 -64411 -45367 -8828 -14145
7207 -14145 163 17520 31747 35855 30546 35206 32211 -717 5109 22561 26811 9375 -30904
7194 -30904 -66326 -44394 -19183 -10966 -18400 -48136 -74015 -51417 -22960 11663 22926 33087
7182 33087 15283 -18121 -8504 7686 -7236 -31741 -20308 -7846 -35786 -23598 -33107 -29563
7170 -29563 -42410 -65224 -66957 -61585 -31092 -20174 -28671 -39180 -51643 -15606 1346 -11648
7158 -11648 -58057 -52042 -43833 -36814 -47160 -41744 -4073 18864 25228 25223 941 -26086 -19918 -14219
7144 -14219 -16712 -47 7845 2319 -26454 -26832 -31145 -28898 -36848 -1872 16906 15354 7838 5698
7130E698j6731j4021k0025o255L2743M0231M303m418k5360j6660j1300j208O202
7117b6801L5774p97o075j0855j0575K1145r468L48J057k0189m979j5950J958K5914
7103a9493J0697J1612m56k6330m965J8260K866k1815j906J2280P035l794l942
7090a9951J2530j9161o837K0334L845l995P551j9405M880J6463l824j5205J3643
7077i132K5690L201P27p413o864j2849n04n04n780J4136n059j8133j3894J3667
7063b2711K757k9901K6491J1540k233M80j4728j6978P401P341L380R026L7231
7050A9096L3311k0958j6265k3955m7792O374K3188R886K2124J615l6824m1203
7038g1403K7290J7725J4088k1443j3600N864J1015M2274J7641m962j6654k6483
$$ plain form
7130 5698 -11033 -25054 -45079 -51334 -18591 21640 25943 21525 -3835 -20495 -31795 -33003 -26801
7117 -26801 8973 8176 2101 -8754 -19329 1816 -7652 -7304 -6247 -26436 -31415 -47365 -45407 -19493
7103 -19493 -8796 2816 2360 -23970 -28935 -10675 -7809 -29624 -31530 -19250 -12215 -16009 -19951
7090 -19951 -7421 -26582 -33419 -13085 -9240 -13235 -5684 -25089 -20209 -3746 -7570 -22775 -9132
7077 -9132 16558 19759 20486 13073 6209 -6640 -7144 -7648 -13428 708 -4351 -22484 -36378 -22711
7063 -22711 -19954 -49855 -23364 -11824 -14057 -13577 -28305 -45283 -37882 -30541 -27161 -18135 19096
7050 19096 52407 31449 15184 -8771 -56563 -50189 -27001 -17115 5009 6624 -30200 -71403
7038 -71403 -44113 -26388 -12300 -33743 -47343 -41479 -30464 11810 29451 24489 7835 -18648
7026a8648k1660j4490J9749J8223K4468q091J9797J1038l8591k4308r10n245j6116
7013e4784J1248K8324J936J7687R137j8493k3042o831O589o212J1846n290O461
7000b1424j1170K5018j2242j0700j407p019K847m74J1968N133J5706J4763l270
6987G729j8100P159J981J5205J1427j2331k0976k350j4954j0301J6303n625j3750
6974c8583j320K193j4730j5137p866J4929J8438N408Q829K6518K1470j887o779
6961A1483j6148l981J3706J1836m579J5526L523j6413l1551j5392n600j0286P960
6948c9916L5404j0203L146n726l1036J2501K4629l869q279M010R030r002l040
6935b2351J4100o642k3629J706J0357L4214K3849j6904l8699j1959q531r027J2257
$$ plain form
7026 -18648 -40308 -54798 -35049 -16826 7642 -449 19348 30386 -8205 -32513 -33423 -38668 -54784
7013 -54784 -43536 -15212 -13276 4411 13548 -4945 -27987 -34818 -28229 -34441 -22595 -27885 -21424
7000 -21424 -32594 -7576 -19818 -30518 -31925 -38944 -36097 -36571 -24603 -19470 -3764 10999 7729
6987 7729 -10371 -3212 -1231 13974 25401 13070 -7906 -10256 -25210 -35511 -19208 -24833 -38583
6974 -38583 -39903 -37710 -52440 -67577 -75443 -60514 -42076 -36668 -27839 -1321 20149 18262 11483
6961 11483 -4665 -8646 5060 16896 12317 27843 31366 14953 -16598 -31990 -37590 -47876 -39916
6948 -39916 -4512 -14715 -11569 -17295 -48331 -35830 -11201 -15070 -23349 -19339 -10309 -19311 -22351
6935 -22351 -8251 -14893 -38522 -36816 -26459 7755 31604 14700 -23999 -35958 -44489 -53516 -41259
6922d1259K7326m482j266J149k7733n736K8627K1050k298j6912k2741J7910l844
6909c0209l960K3989n354j591j0524J4015K2531J3772j3209j1654l770J773O434
6896B243J707j404P9r861K0137l3421K5445J0095J5364l336r385j2734K065j062
6882E932P507j7322l5333O030L6245O065k2664r816j7L2899M847o084j3205r419
6868a4335P589k3527k1721j1578M081J449p769N114n35J6928J6692q691k7007
6855f3310M669O411K2615k5924Q530L8680o445m1450j1566J362K6634J7151K6668
6842D025K2973k8959R687L2024k8112k9320Q466K5915J300j7040L255m896l00
6829i82j8105q909O057j3347r936K7333J0750L632J1064r71p884P569j8956r080
$$ plain form
6922 -41259 -13933 -18415 -19681 -18532 -46265 -52001 -23374 -2324 -4622 -21534 -44275 -26365 -30209
6909 -30209 -34169 -10180 -15534 -17125 -27649 -13634 8897 22669 9460 -2194 -5964 -4191 2243
6896 2243 3950 2546 2625 -7236 12901 -20520 4925 15020 30384 27048 17663 4929 6994 5932
6882 5932 13439 -3883 -39216 -33186 3059 9124 -13540 -23356 -23373 9526 14373 8289 -4916 -14335
6868 -14335 -6746 -30273 -51994 -63572 -59491 -58042 -65811 -60697 -61232 -44304 -27612 -36303 -63310
6855 -63310 -58641 -52230 -29615 -55539 -47009 -8329 -14774 -56224 -67790 -66428 -39794 -22643 4025
6842 4025 26998 -1961 7726 39750 11638 -17682 -9216 16699 17999 959 4214 -682 -982
6829 -982 -19087 -27996 -21939 -35286 -45222 -17889 -7139 -3507 7557 6586 -1298 6271 -12685 -21765
6815b1765N682K9333K5993L087j6121j8993J1926K3094j9192l4984p902p613o957
6802c4412j250J9307K4047r849m751p395j0570J4148j0534P858n163J0993J7122
6789I551Q194J057k2790j1865Q918k834j1226P820K9067j401j5682n084L9778
6776C3503O790m1060m3543J4052K1443R57j0956n357q632l343j7312Q882k11j6669
6762f1456M326j1870j3552L7127K5287J7283L612Q595K6506L837k1871j8442P037
6749F419K2858K2613Q794j413r943j3274j1201k085l8712j3290J9332K0316m221
6736F193K7669j348j1867l560J6926M040L4307P5137N5998Q9204J48759J05451
6724E46909J6606j8289L91j9887j02760j22975r0478n0071j1702l8102k4008N831
$$ plain form
6815 -21765 -16083 13250 39243 42330 26209 7216 19142 42236 23044 -11940 -19842 -27455 -34412
6802 -34412 -35662 -16355 7692 -2157 -6908 -14303 -24873 -10725 -21259 -13401 -18564 -7571 9551
6789 9551 17745 18802 -3988 -15853 -6935 -9769 -20995 -13175 15892 14491 -1191 -6275 33503
6776 33503 40293 -767 -44310 -30258 -8815 -7858 -18814 -24171 -32803 -36146 -53458 -44576 -44787 -61456
6762 -61456 -57130 -69000 -82552 -45425 -20138 -2855 757 9352 35858 39695 17824 -618 6419
6749 6419 29277 51890 60684 59271 49328 36054 24853 22768 -15944 -29234 -9902 10414 6193
6736 6193 33862 32514 20647 17087 34013 38053 72360 147497 203495 292699 441458 546909
6724 546909 563515 545226 545617 525730 422970 299995 209517 159446 147744 109642 85634 91465
6712I1465O409j1522j5114j6224P07k6112N185O750l286O51M382J0780k7779l7386
6698a1094j6057J8881J0842o247k607J087J9248J5136j1774j9205l8754j1708
6686e2252K8906j1892k1320k4548J2202J8493J993K7040J2969N041K5072K6749
6674D8453j4011k1086j4651o984J5083q423K4742K9190k6682k0678J1301j725
6662A4529O796j1554n487N113n825m847j2876K249l313j1941r722J1481n508N64
6648c0341J999j8030K418K1808J9546N385j3492J692m382k3654j5985r42P148
6635d6830M459J664M493M262L638J9167J9448j6481r121j3249n293K137K7880
6622c826j0j7979l2554J8559M507j4273Q079J0000k9152K99L0411J1870k017n258
$$ plain form
6712 91465 97874 86352 71238 55014 55721 29609 34794 41544 38258 38909 43291 54071 26292 -11094
6698 -11094 -27151 -8270 2572 -3675 -6282 -5195 14053 29189 17415 -1790 -40544 -52252
6686 -52252 -23346 -35238 -56558 -81106 -68904 -50411 -48418 -21378 -8409 -3368 21704 48453
6674 48453 34442 13356 -1295 -8279 6804 -1619 23123 52313 25631 4953 16254 14529
6662 14529 21325 9771 4284 9397 3572 -1275 -14151 -11902 -15215 -27156 -36878 -25397 -30905 -30341
6648 -30341 -28342 -46372 -43954 -22146 -2600 2785 -10707 -9015 -13397 -37051 -53036 -53978 -46830
6635 -46830 -42371 -40707 -36214 -31952 -28314 -9147 10301 -6180 -15301 -28550 -33843 -31706 -3826
6622 -3826 -3836 -21815 -54369 -35810 -31303 -45576 -37497 -27497 -56649 -56350 -25939 -14069 -16086 -21344
6608b1344J9506j935j7042L133o569L689q700l478J869J9409p210n759K4376J6693
6594A6638j4377j6656j3784K5717J9028J6717k7289q177K8000k7095L296L70K116
6581D504M311j0048k244M874k921M288j2595j1291L4896n373l0238J9063P372
6568D598n3755o774J0003R88O57j2147m860P163R388q868P230J7906R237O186
6554a3048k1421m669K4185K7247J5235j8726l1437j6071J0631L208J5834P319
6542a713O342J5508o917k1442j7879j1533O614K6259N741r898j7545O491J3347
6529f625j1596k3480J9175J250p531K6768J8636j1173l410J3642k346j0394n886
6516b970Q655l121j2716j3445p351k533N007L0393J4533k0898j9598J3230R798
$$ plain form
6608 -21344 -1838 -3773 -20815 -17682 -24251 -20562 -29262 -32740 -30871 -11462 -18672 -24431 -55 16638
6594 16638 2261 -14395 -28179 -2462 16566 33283 5994 -2183 25817 -1278 2018 2388 4504
6581 4504 8815 -1233 -3477 1397 -1524 2764 -9831 -21122 13774 8401 -21837 -2774 4598
6568 4598 -49157 -55931 -45928 -44940 -44283 -56430 -61290 -54127 -44739 -53607 -46377 -28471 -19234 -13048
6554 -13048 -34469 -39138 -14953 12294 27529 8803 -22634 -38705 -28074 -24866 -9032 -1713
6542 -1713 4629 20137 13220 -8222 -26101 -37634 -31020 -4761 980 -8918 -26463 -19972 -6625
6529 -6625 -18221 -41701 -22526 -21276 -28807 -2039 16597 5424 2014 15656 13310 2916 -2970
6516 -2970 5685 2564 -10152 -23597 -30948 -33481 -28474 1919 16452 -4446 -24044 -10814 -1016
6503a016j0828N445P536j0704L423k343j3425O855J0363r949L958R436r817j0491
6489b1557J0695j7161j6811M806N911N25k3409Q00J3450N7403J6655k4079j0302
6476c074J9570K4402m320n310J0086k9680j1264m800l0820j4218L7688J2170m672
6463d242L073J6149k0690j1505r39o265k4833L3577J1938k3556p292J6111j54
6450a8628N754J3104n902k3943P022k4041L1585K5032j491l5362l1833k752J959
6437e9496J352J662K9778L6018j7161l1643m570j634P57K892j0201Q046K1602
6424b2598K7722J3853R318K504o496k4491n830R079l1513k7881Q747J0573L2584
6411d429J2390P264p65J9952l003J3195j0669M558j8326j5740k386j2395P40L779
$$ plain form
6503 -1016 -11844 -6399 1137 -9567 -6144 -8487 -21912 -15057 -4694 -14643 -10685 -1249 -11066 -21557
6489 -21557 -10862 -28023 -44834 -40028 -34117 -33592 -57001 -56201 -42751 14652 31307 7228 -3074
6476 -3074 16496 40898 36578 31268 41354 11674 410 -4390 -35210 -49428 -11740 430 -4242
6463 -4242 -1169 14980 -5710 -17215 -18154 -24419 -49252 -15675 -3737 -27293 -34585 -18474 -18628
6450 -18628 -12874 230 -5672 -29615 -22593 -46634 -15049 9983 8492 -26870 -58703 -61455 -59496
6437 -59496 -58144 -56482 -26704 9314 -7847 -39490 -44060 -45694 -44937 -42045 -52246 -44200 -22598
6424 -22598 5124 18977 28295 30799 24303 -188 -6018 3061 -28452 -56333 -47586 -37013 -4429
6411 -4429 7961 15225 14460 34412 31409 44604 33935 38493 20167 4427 2041 -10354 -9614 -5835
6397e835j99Q876j6996N355L4268J5604k678j9072N966M872j1821j8371j034j1573
6383a2638l1176l022R911J7859J2544L1411r194k9855l1152J3849J8910q086l419
6370b4058P149n62Q171o498k3532Q775j1890J1589L743J7083j829O241J3312J5159
6356B2853m545r259K0818j1058j035lk0459j7455r426m346L130K5252m259j0350
6342b0142J1212L7558J6582m0636k5731k376l501L63j3668M1437M920p59p13k1280
6328a6734j7087l732n337P715J1484p102J8317Q279o255n813J577n074J634j2213
6314c0341q331J9152J9158K548j4287l946m388j4014l2331N025M3416N747J4694
6301B102K3429J5152j7100j5676l4466l306J5970J1153P387j4361K612L087j731
$$ plain form
6397 -5835 -6034 2842 -14154 -8799 25469 41073 38395 19323 25289 30161 18340 -31 -1065 -12638
6383 -12638 -43814 -46836 -36925 -19066 -6522 24889 15695 -14160 -45312 -31463 -12553 -20639 -24058
6370 -24058 -16909 -17471 -9300 -15798 -39330 -30555 -42445 -30856 -27113 -10030 -11859 -5618 7694 22853
6356 22853 18308 9049 29867 18809 17774 17771 -2688 -20143 -29569 -33915 -30785 -5533 -9792 -20142
6342 -20142 -8930 28628 45210 4574 -21157 -23533 -27034 -26671 -40339 1098 6018 5259 4546 -16734
6328 -16734 -33821 -37553 -42890 -35175 -23691 -30793 -12476 -4197 -10452 -16265 -14688 -19762 -18128 -30341
6314 -30341 -38672 -19520 -362 2186 -12101 -16047 -20435 -34449 -66780 -61755 -18339 -12592 2102
6301 2102 25531 40683 23583 7907 -26559 -29865 -13895 -2742 4645 -9716 -7104 -4017 -5748
6288e748j8379Q929L0603J7413j9121l0414m090k1828J63J3980K7360Q296J0149
6275A7313M132j5791j4238m3947K3959J5730j70M472o280k2507J7422K6829J4460
6262B1384r062k5594R744J4608N40k7499k1535k8533O808L1367J1025J4712j468
6249c503J950l5074p163L6812J1628k2278k3394o168K4031J556J7294J1797K0083
6236B7571j3283J9946n373j9788k952k5837J950J8021j788l834j4545o902M160
6223b2654M533Q830O004j0996j4976l078l946Q311m455L0166J0672j6835n332
6210a3756J9252N216n557L163k5105j0743r93j1266K0076J6884K1013m423R131
6197B2892J719j7672O744k3275o152J0339N279p075k2571n202J584k1322N871
$$ plain form
6288 -5748 -24127 -15198 15405 32818 13697 -16717 -20807 -42635 -42472 -28492 -1132 7164 17313
6275 17313 21445 5654 -8584 -52531 -28572 -12842 -13012 -8540 -14820 -37327 -19905 6924 21384
6262 21384 12322 -13272 -3528 11080 11620 -15879 -37414 -65947 -59139 -27772 -16747 -2035 -3503
6249 -3503 -1553 -36627 -43790 -6978 4650 -17628 -41022 -47190 -23159 -21603 -4309 7488 27571
6236 27571 14288 34234 28861 9073 6121 -19716 -17766 255 -1533 -5367 -19912 -26814 -22654
6223 -22654 -18121 -9291 -3287 -14283 -29259 -32337 -36283 -27972 -32427 -2261 8411 -8424 -13756
6210 -13756 5496 10712 5155 8318 -16787 -27530 -28523 -39789 -19713 -2829 18184 13761 22892
6197 22892 24611 6939 13683 -9592 -15744 -5405 -126 -7201 -29772 -34974 -33390 -54712 -48841
6184d8841J0704j563O368j303J4209J4456J5648K1115K0068p060k4134r641k9941
6171a9915q896K2220K1973k7564k283J2540j1074o555J3445r17J8671P322l6934
6158a7967k2945K0312K6477R081j6830N849M868M5798L314m5928r420J6053J5295
6145C3957j3399m6612j387N09L236J1210Q724J3495k5017k5189p619J3803o678
6132d0967K0196J7964n241j7212j3799j1291P659n895K2642K0382K603l0624k2384
6119e5967R604j1951j7213J7817J2582P395L1708K667L93l380p768M731N597k4695
6105b8480p563r637Q734K2278L9194Q537j2759k5369r328K494m454m204j1814
6092c2371O569p966J5439J9243K393N217j0803k1542p812M96J3194N668M173J5120
$$ plain form
6184 -48841 -38137 -39700 -33332 -34635 -20426 -5970 9678 30793 50861 43801 19667 10026 -19915
6171 -19915 -28811 -6591 15382 -12182 -14465 -1925 -12999 -19554 -6109 -7026 11645 18967 -17967
6158 -17967 -40912 -20600 5877 14958 -1872 3977 8845 54643 57957 12029 2609 18662 33957
6145 33957 20558 -26054 -27441 -26932 -23696 -12486 -3762 9733 -15284 -40473 -48092 -34289 -40967
6132 -40967 -20771 -2807 -8048 -25260 -39059 -50350 -42691 -48586 -25944 -5562 -2959 -33583 -55967
6119 -55967 -46363 -58314 -75527 -57710 -45128 -37733 -6025 -3358 -2965 -6345 -14113 -9382 -3785 -28480
6105 -28480 -36043 -45680 -36946 -14668 24526 33063 20304 -5065 -14393 -11899 -16353 -20557 -32371
6092 -32371 -25802 -33768 -18329 914 3307 8524 -2279 -23821 -31633 -31137 -17943 -12275 -8102 7018
6078G018q059j7100k1970l609Q392M1458j567j9830k677q258j1906K7333J9247
6065H472M523k9293k2670j6649k3334L6317M2224O577j047k3594K776M803J0129
6052g66N096j5335J9165J3353P087n690j179p786R64m629j8568Q620J5791J5567
6038C1690R490o073J7151k1591K564J533o797N626k4589l711N895M830L619j2432
6024G205j1235L390M744p955l514K867J1214k8615j7499O732K9911M181m824J1082
6010G684k1948j3873J0394m350j3708L652K3038n488K4949O32p947R523k725p781
5996B052j1640L567Q077J4860p410J7294q674n093j3141K649r200K115J5951J7857
5982B9264j595J0277k6974k0989J9824j56j0631m205J4585k452j0956J6969K4609
$$ plain form
6078 7018 -1041 -18141 -40111 -43720 -35328 6130 4563 -15267 -17944 -26202 -38108 -10775 8472
6065 8472 12995 -16298 -38968 -55617 -78951 -42634 -410 6167 5120 -18474 -15698 -10895 -766
6052 -766 4330 -11005 8160 21513 28600 22910 21731 13945 14909 10280 -8288 332 16123 31690
6038 31690 41180 35107 52258 30667 33231 34764 27967 33593 9004 5293 11188 16018 19637 7205
6024 7205 -4030 -640 4104 -3851 -7365 -4498 6716 -21899 -39398 -32666 -2755 1426 -3398 7684
6010 7684 -14264 -28137 -17743 -22093 -35801 -32149 -9111 -14599 10350 10982 3035 12558 9833 2052
5996 2052 -9588 -6021 2056 16916 9506 26800 18126 13033 -108 2541 -6659 -4544 11407 29264
5982 29264 27669 37946 10972 -10017 9807 9651 -980 -5185 9400 6948 -4008 12961 37570
5969C7570j4647k2584L330p74n588j7487j0636o669K0449J2355J2046k8532j6396
5956c7563o571J5187K8618j6454k8322J7976K1315K8090r527j3501L442J2559
5944A5249j9079k5541j7297N1822M4569q949n2159k2759j2436L4073L1788q176
5932A1105j7872O694K394j6650k7047N346K1829J2699P219K074j4455j7748J531
5919b2881j2000n480R225J4575N316m502J1163n778k8650L5K3086N740j9174j0479
5905c9804J1496K0946j8114o431j782o041p735K3361J7571J9017n408j835p791
5892b550J1365J0438m217j5885k0655K9201j4589k1812j4210j6635J3617J727
5880d4205J2034k715o754j169L369j1225r226L334o039L214J112k624l420J5049
$$ plain form
5969 37570 22923 339 3669 2895 -2693 -20180 -30816 -37485 -17036 -4681 7365 -21167 -37563
5956 -37563 -44134 -28947 -329 -16783 -45105 -27129 -5814 22276 12749 -752 2690 15249
5944 15249 -3830 -29371 -46668 5154 49723 40774 -11385 -34144 -46580 -12507 19281 11105
5932 11105 -6767 -73 2321 -14329 -41376 -36030 -14201 -1502 5717 7791 -6664 -24412 -22881
5919 -22881 -34881 -40361 -31136 -16561 -11245 -15747 -4584 -10362 -39012 -38977 -15891 -10151 -29325 -39804
5905 -39804 -28308 -7362 -25476 -31907 -33689 -39730 -47465 -24104 -6533 12484 7076 5241 -2550
5892 -2550 8815 19253 15036 -849 -21504 7697 -6892 -28704 -42914 -59549 -45932 -44205
5880 -44205 -32171 -34886 -41640 -42809 -39440 -50665 -59891 -56557 -62596 -59382 -58270 -60894 -64314 -49265
5866d9265L6160k6087P677N151k4015r722L601J3542J6268O452o622q233P254
5853b7839R543J468k912J0015j6348o532J2980l913J8157K7430r887p238j918
5840C006j8985j6033o55J9797K2976k3489l9074N433J098j1025O465N165J0985
5827c4336J6825K4864K1520P606k7040o549j83P589n221j2931M016L352j8071
5814a8559l680K4455K8847J2994l2869l8726k2604l2216J3588M6590K2218J1419
5802A1457k656M819L670O911j8208r888q474O167J2333J4415K4372p655m0750
5789c487k0157Q117J0993K0424J5235k6j1236J1311J0593n405j4645K3360q765
5776C6312j5641m406K185j9110j8928M1671K4896k8816k4110P763O339o817j0768
$$ plain form
5866 -49265 -13105 -39192 -31515 -26364 -50379 -60101 -56500 -42958 -26690 -20238 -26860 -35093 -27839
5853 -27839 -18296 -16828 -19740 -9725 -26073 -32605 -19625 -23538 -5381 22049 12162 4924 3006
5840 3006 -15979 -32012 -32667 -12870 10106 -13383 -52457 -47024 -45926 -56951 -50486 -45321 -34336
5827 -34336 -17511 7353 28873 36479 9439 2890 2707 10296 5075 -7856 -3840 -488 -18559
5814 -18559 -22239 2216 31063 44057 11188 -27538 -50142 -82358 -68770 -22180 38 11457
5802 11457 8801 13620 17290 24201 5993 -3895 -12369 -6202 6131 20546 44918 37263 -3487
5789 -3487 -23644 -15527 -4534 15890 31125 31099 19863 31174 41767 36362 21717 45077 36312
5776 36312 20671 16265 18450 -660 -19588 22083 46979 18163 -5947 1816 8155 1338 -9430
5763i430j0154k0589m775q056K2913l445k446o624Q863l312K964K9803J4671J791
5749A2174j7688o963j3911j4655k2484R395J4578K8400Q866M679k2476O033K6843
5736A2791j000K36m740Q197k1675k9267J0835J0002L123J6944P676p755k5219
5723a9852l3033k5729M602K4964J4600J4206M0Q590L697J6184J349Q67L206k3434
5709i743j0646j759j5938J7472R771N65M646P751L393l9396p046Q059K0009N330
5695g532j6025N985K3282K1844k5723j9338p980M75J6833J5569n014l7225j4756
5682d9605J1623K4597J8273o27m1936m0979K0399M4852p72m471j180J7937o193
5669h082j3988j7355J6450P619J1318O218n327K6872K9362k5594r975j719j68
$$ plain form
5763 -9430 -19584 -40173 -44948 -53004 -30091 -33536 -35982 -42606 -33743 -37055 -34091 -4288 10383 12174
5749 12174 -5514 -12477 -26388 -41043 -63527 -54132 -39554 -11154 -2288 2391 -20085 -14052 12791
5736 12791 11791 12027 7287 15484 -6191 -35458 -24623 -14621 -11498 5446 13122 5367 -19852
5723 -19852 -52885 -78614 -74012 -49048 -34448 -20242 -20202 -11612 -7915 8269 9618 10485 13691 -9743
5709 -9743 -20389 -22148 -38086 -20614 -10843 -10278 -5632 2119 5512 -33884 -40930 -32871 -12862 -7532
5695 -7532 -23557 -17572 5710 27554 1831 -17507 -25487 -25012 -8179 7390 2376 -34849 -49605
5682 -49605 -37982 -13385 4888 4261 -37675 -78654 -58255 -13403 -14175 -18646 -19826 -1889 -8082
5669 -8082 -22070 -39425 -22975 -15356 -4038 2180 -3147 23725 53087 27493 17518 15799 15631
5656A5631J7152k2033k631j221j0493K4684p081l716q674l957p312r530k509K1190
5642e00M016j643L616q209k0990R414J0721k15j7037K411j433J0097Q290K9598
5628B8136L253k6793j9825L098j3k032j341J0581K5167O826j4879j4064j0725
5615a2611q439J5413J6791M902j1583j4796o947r17k458J6092Q279j1754m834
5602a2862j90N237M765L1147m354N853j6419o961J483J339k9311j2762N629M272
5588b3134J5596J8056Q693k4720l6089L9491N3114l771l6738k3813j6216K0643
5576h888J1995J484K084j8265j230J1130r253N687l382K1967r520l5492k792M987
5562b9488J7004J5715R56k919o686M115N311m011j9048k1346j775J0060J1926
$$ plain form
5656 15631 32783 10750 8119 6898 -3595 21089 14008 10292 1618 -2339 -9651 -19181 -21690 -500
5642 -500 3516 1873 5489 -2720 -23710 -14296 -3575 -3790 -20827 -18416 -19849 -9752 -1462 28136
5628 28136 31389 4596 -15229 -12131 -12144 -14176 -15517 -4936 20231 27057 12178 -1886 -12611
5615 -12611 -21050 -5637 11154 16056 4473 -10323 -17270 -18187 -20645 -4553 3726 -8028 -12862
5602 -12862 -13052 -7815 -3050 28097 23743 29596 13177 6216 7699 9038 -20273 -33035 -27406 -23134
5588 -23134 -7538 10518 19211 -5509 -41598 -2107 51007 47236 10498 -13315 -29531 -8888
5576 -8888 3107 4591 6675 -11590 -12820 -1690 -10943 -5256 -8638 13329 3809 -31683 -34475 -29488
5562 -29488 -12484 3231 4187 1268 -5418 -1303 4008 -3 -19051 -40397 -42172 -32112 -20186
5549b0186K9252j78j0200J4983J486M042j4019K923l703j137k5320l97P010L396
5535a2048J6806k3071k0150J5702K4931J5058j7095p586o683K4077M0565K6800
5523G7306l6034l2518k7642j6466J342O153K2994n25k8683q637o472k4254J1648
5510f1788J3697K0626J7008j5133J215o917J1889o473J9952K7388L034j9876N343
5497I965r972p501j977j8515J0308K1250o721l0399k5553K5554J3072l235L335
5484b0389j281k7231M899L3043J4452K83n39j5434M261J1912L738j7583R763Q517
5470H411j9347J5783J3621k0147j0247j8390n909l142J596J0710K6876j3051l708
5457a6944K1023L3337J7428M157q967k7254k2967k7921j0165l34O535K1979L5250
$$ plain form
5549 -20186 9066 8888 -1312 13671 15157 19199 5180 8103 4400 3263 -22057 -22454 -15444 -12048
5535 -12048 4758 -18313 -38463 -22761 2170 17228 133 -7453 -14136 9941 50506 77306
5523 77306 41272 8754 -18888 -35354 -34012 -27859 -4865 -5390 -34073 -42710 -49182 -73436 -61788
5510 -61788 -48091 -27465 -10457 -25590 -24375 -31292 -19403 -25876 -5924 21464 24498 4622 9965
5497 9965 -7 -7508 -9485 -28000 -17692 3558 -3163 -33562 -59115 -33561 -20489 -23724 -20389
5484 -20389 -21670 -48901 -44002 -10959 3493 3776 3237 -12197 -7936 3976 7714 -9869 -106 8411
5470 8411 -10936 4847 18468 -1679 -11926 -30316 -36225 -39367 -37771 -27061 -185 -13236 -16944
5457 -16944 4079 37416 54844 59001 50034 22780 -187 -28108 -38273 -38607 -32072 -10093 25157
5444B5157p363j7747j6816j7054j5575J5556K1363J4650O746K706j3151n788O548
5431g68N949j2781j4929o022j4208P902j1784l239M893K0668n909r972J6320O548
5417a7332k5928o063J4321K0515k6571n590R616K7643M798l7770m143L3452K0793
5404G741o180n979M103Q183N863n260k8238J0523J0491j371j1207L014r849M619
5390a3547K575R686m385n176J0130m616j3938N984J270k3052L17M797Q095m852
5376b6712p586j0599M3662K3421j7703q112O412l1362R694J7755J9960j7982j1690
5363a0842R927k0546o041N226L754j6183j4960L6298r907l1454K637K4837K3922
5350c332M0786K2933j8317n3399j9260n683J2312J00k3032j568J1643J9507j280
$$ plain form
5444 25157 17794 47 -16769 -33823 -49398 -33842 -12479 2171 8917 11623 -1528 -7316 -768
5431 -768 5181 -7600 -22529 -28551 -42759 -34857 -46641 -49880 -44987 -24319 -30228 -40200 -23880 -17332
5417 -17332 -43260 -49323 -35002 -14487 -41058 -46648 -37032 -9389 -4591 -42361 -46504 -13052 7741
5404 7741 1561 -4418 -315 7868 13731 8471 -19767 -9244 1247 -124 -11331 -8317 -18166 -13547
5390 -13547 -10972 -1286 -5671 -10847 -717 -5333 -19271 -13287 -12017 -35069 -34752 -29955 -21860 -26712
5376 -26712 -34298 -44897 -1235 22186 4483 -3629 2783 -28579 -18885 -1130 18830 848 -10842
5363 -10842 -915 -21461 -27502 -22276 -18522 -34705 -49665 -13367 -23274 -54728 -52091 -27254 -3332
5350 -3332 37454 60387 42070 -11329 -30589 -36272 -23960 -23860 -46892 -48460 -36817 -17310 -18590
5337a8590q721J4947k44J6127L2301K6249J086J1523q152k0278l5486o694J0097
5324A4165j0952k4973J6142K813M2809J2948j5565l5202j5001O290K8145j2668
5312H951R64J5703j0131j5412n364N947P151J8176k3623P372o019j8081k8890
5299d3256J5348J4881J1222m949J8061n102k9331j179K1660K2662j0709O404L7614
5286E3326J0982R644j7022l7630k9231l0378K731N435L2040L758J00p478j8377
5273b2100N550n41L725O167m582L061j4163J5890M789j2273P850L3346k1519L5057
5259D0257L3896L906j0398j7110p624k1762o900m347L785j5496K2567J3733j6042
5246A8465k890j9811j2465O634k0279k3758P513K2220K7225k4078m4566j1024
$$ plain form
5337 -18590 -27311 -12364 -12608 3519 35820 62069 63155 74678 66526 46248 10762 4068 14165
5324 14165 3213 -21760 -5618 -2805 40004 52952 37387 2185 -12816 -6526 21619 8951
5312 8951 9915 25618 15487 75 -5289 658 7809 25985 2362 9734 3715 -14366 -43256
5299 -43256 -27908 -13027 -1805 -6754 11307 6205 -23126 -24305 -2645 20017 9308 15712 53326
5286 53326 64308 73952 56930 19300 -9931 -40309 -37578 -32143 -103 3655 3755 -3723 -22100
5273 -22100 -16550 -17091 -13366 -7199 -11781 -8720 -22883 -6993 -2204 -14477 -6627 26719 5200 40257
5259 40257 74153 78059 67661 50551 42927 21165 14265 9918 13703 -1793 20774 34507 18465
5246 18465 15575 -4236 -16701 -10067 -30346 -54104 -46591 -24371 2854 -21224 -65790 -76814
5234g6814K8314L4260o704k6206J7965k809j5304O990K6514J715j9931K6824K5014
5221A9828L3570p900k1899J0114j6187q127J3989K2375k592l8817l6627K7184
5209e089J6566p353N435L597J062k3924r978R898j4785O43J3854O120Q937Q484
5195A3467n568l1728n420K2284L1357Q482O236P158m4130N279J4427M657j1348
5182A5153J6606j2809j5137O055J2068k2790l5883j3085J5919L8820K7089N234
5170C7240K338J3910n803j3664j8260r151m321J6461L4927K116P68l1956m1811
5157a7206K1362K2203j3487j837J070j490j2096j4796O939K1378O049J288j8554
5144H23j4131J3372j2115p734K060O32J2844J4674J572J3971j984J6798L152o414
$$ plain form
5234 -76814 -48500 -14240 -20944 -47150 -29185 -31994 -47298 -40308 -13794 -12079 -32010 -5186 19828
5221 19828 53398 45498 23599 33713 17526 9399 23388 45763 43171 4354 -32273 -5089
5209 -5089 11477 4124 9559 13156 14218 -9706 -19684 -9786 -24571 -23928 -10074 -3954 4983 13467
5195 13467 7899 -23829 -29249 -6965 24392 32874 39110 46268 2138 7417 21844 26501 15153
5182 15153 31759 18950 3813 9868 21936 -854 -36737 -49822 -33903 4917 32006 37240
5170 37240 39578 53488 47685 34021 15761 6610 2289 18750 53677 55793 56561 24605 -17206
5157 -17206 4156 26359 12872 11035 12105 10615 -1481 -16277 -9338 12040 18089 19377 823
5144 823 -13308 64 -12051 -19785 -17725 -17093 -4249 10425 11997 25968 23984 40782 43934 37520
5130C7520j9517j5054j8861K2925J248q975j6257K814m702Q781K1453l040k7998
5117a9663J6986J2289j9594p925K6587K4959j1362k0606j3769n827J2624K9710
5105B4409J1249P962l3572j1404K5022N477j4521k3221k87R846J4335J1844k5762
5092A377o361J191J5141K0333l6059k3921M157J2719j830K5459l018q590j1529
5079a0931o14N996L367j273j8857j1416n504J6049J4469K1573n359j1961j0543
5066a5004M45k3596L352M3589J4371j8680o916M894K235k0718p10M376O721P8
5052e563K4677Q843j9094J9967o499M396q19m9314j145l088j4054n577L8329J0174
5038A233K8j5033j1285n334n790K7527K9385k5915k1496P244J8388o576l283j5537
$$ plain form
5130 37520 18003 2949 -15912 7013 8261 -714 -16971 -14157 -18859 -10078 11375 8335 -19663
5117 -19663 -2677 9612 -9982 -17907 8680 33639 22277 1671 -12098 -17925 -5301 24409
5105 24409 35658 43620 10048 -1356 23666 29143 14622 -8599 -8886 960 15295 27139 1377
5092 1377 -4984 -3793 11348 31681 -4378 -28299 -24142 -11423 -13253 12206 9188 598 -10931
5079 -10931 -11545 -5549 -2182 -3455 -22312 -33728 -39232 -23183 -8714 12859 7500 -4461 -15004
5066 -15004 -14559 -38155 -34803 8786 23157 4477 -2439 2455 4690 -16028 -16738 -12362 -5641 -5563
5052 -5563 19114 27957 8863 28830 22331 26727 25908 -23406 -24551 -27639 -41693 -47270 -8941 1233
5038 1233 1261 -13772 -25057 -30391 -36181 -8654 20731 -5184 -26680 -19436 -1048 -7624 -10907 -26444
5024b6444l5414J9494K5227k4911r341K0038j4625q809L091k278J9168J6591P902
5011a0311j5684n911N071K3301O07k2959M488J1549K2017J0972Q031j7810m986
4998H375L7673j5320m9489k1058J1737K7279J5689p417r286l530J9742Q672J0160
4985C3227r373j6347K022J4973k4966p532K605J1346K3495o687j134N163J8005
4972D4797J163m5182k1661n97Q571l7590j7484J9348J9458J5439J6787n983j5810
4959a8744j2588l722J5080l51K1205R449k78M995J5806J883j7795j8441n879K0010
4945A0630O16m281J4229K2748L19j6427j2371J8736J9889j1600l8589o043j0537
4932a2681n04K487J6429j3329k1096J2363j1968J6393K9808R969J1004J5928k2584
$$ plain form
5024 -26444 -61858 -42364 -17137 -42048 -51389 -31351 -45976 -54785 -51694 -53972 -34804 -18213 -10311
5011 -10311 -25995 -31906 -26835 -3534 -2927 -25886 -21398 -9849 12168 23140 31171 13361 8375
4998 8375 46048 30728 -18761 -39819 -28082 -803 14886 7469 -1817 -5347 14395 23067 33227
4985 33227 23854 7507 9529 24502 -464 -7996 -5391 5955 29450 22763 21629 26792 44797
4972 44797 45960 778 -20883 -21480 -12909 -50499 -67983 -48635 -29177 -13738 3049 -2934 -18744
4959 -18744 -31332 -35054 -19974 -20325 880 10329 10051 15046 30852 32735 14940 -3501 -9380 10630
4945 10630 11246 6965 21194 43942 44261 27834 15463 34199 54088 42488 3899 -2144 -12681
4932 -12681 -13185 -10698 5731 -7598 -28694 -16331 -28299 -11906 17902 27871 38875 54803 32219
4919C2219j4537K390M353L374j6473j6261K35k0130k0079J3689J0479N883P845
4906g013J2380J5564l086J8492K2333m485j1099j7646j0917J9934J101j6309j0570
4893H679Q299J7245j003p321k2068k4640K5707L6746J3653L70k4492j6494L494
4880A8175L916l4k5091m044K7735m456k9244j7204R5PK1418J1153j7074J6775
4866B127K7373l5095k0366L303L8010O611k2087l145j1180k4034n087r382O343
4853d6609j3189l656K1470j5171k075n965L792J6972j3167n906L273K2601J5846
4840b1784j694q389j4072J7001N932k992n236K6448Q696K2581j6723j9233m1247
4827e0712p266l31J9894J4770L152j4499k489N975j577Q08j4687p981k056J1769
$$ plain form
4919 32219 17682 20072 24425 27799 11326 -4935 -4700 -24830 -44909 -31220 -20741 -14858 -7013
4906 -7013 5367 20931 17845 36337 58670 54185 43086 25440 14523 34457 35558 19249 8679
4893 8679 16978 34223 33220 25899 3831 -20809 4898 41644 55297 55667 31175 14681 18175
4880 18175 22091 22057 -3034 -7078 20657 16201 -13043 -30247 -30152 -30145 -8727 2426 -14648 2127
4866 2127 29500 -5595 -25961 -22658 15352 21963 -124 -3269 -14449 -38483 -43570 -52952 -46609
4853 -46609 -59798 -63454 -41984 -57155 -59230 -65195 -61403 -44431 -57598 -63504 -60231 -37630 -21784
4840 -21784 -23478 -31867 -45939 -28938 -23006 -25998 -31234 -4786 3910 26491 9768 -9465 -50712
4827 -50712 -57978 -58309 -38415 -23645 -20493 -34992 -37481 -31506 -33083 -32275 -46962 -54943 -56999 -45230
4813d5230J5050K3841P255k2734K420K408j7588j012J4706O177q856L531Q030
4800a2002K1711L280o202J8771K684j8766k0235M416K0312K455J004j8611k0477
4787b1660m800K5362j0084l086j6326L449P515J4221J6068J5491o753k185R005
4774B6217k0450j2881K3739K3731j7901j5246o493p253q441J844k6549J3521L2988
4761F826o723J3072N096O810k5881O724J7312o984m479P382j8463k549j6125J1758
4747f224k0665k2966q895J4150J4385r873L8046K7600m047k0604J2802J8855j2217
4734B0347k5081k6162P89K0168k06j4122J1152J4437J5603J432j0578k8443o631
4721b7295P860L4487K1879p390m3400k0873j2539O838K263j1728q49J662J5370
$$ plain form
4813 -45230 -30180 -6339 916 -21818 -19398 -16990 -34578 -35590 -20884 -14707 -23563 -20032 -12002
4800 -12002 9709 12989 6787 25558 28242 9476 -10759 -6343 13969 16424 17428 -1183 -21660
4787 -21660 -26460 -1098 -11182 -14268 -30594 -27145 -19630 -5409 10659 26150 19397 17212 26217
4774 26217 5767 -7114 16625 40356 22455 7209 716 -6537 -14978 -13134 -39683 -26162 6826
4761 6826 103 13175 18271 25081 -800 5924 23236 16252 11773 19155 692 -1857 -17982 -6224
4747 -6224 -26889 -49855 -58750 -44600 -30215 -40088 -2042 25558 21511 907 13709 32564 20347
4734 20347 -4734 -30896 -30107 -9939 -10145 -24267 -13115 1322 16925 18357 7779 -20664 -27295
4721 -27295 -19435 15052 36931 29541 -13859 -34732 -47271 -40433 -38170 -49898 -50747 -49085 -33715
4708c3715j656j5913O289K4532k942O772j6039l934L7254j5446p231K9020K8721
4695C5712j3011k8187J0298J1624j4163K5008K257j2382K3086j818r664k6075
4683B685j5182K9363K8034K4115r635k4512k0344j6923k4182P268M2268o743o98
$$ plain form
4708 -33715 -35371 -51284 -44995 -20463 -23405 -16633 -32672 -36606 648 -14798 -22029 6991 35712
4695 35712 22701 -5486 4812 16436 2273 27281 29538 17156 40242 38424 28760 2685
4683 2685 -12497 16866 44900 69015 59380 34868 14524 -2399 -26581 -19313 22955 16212 15514
$$ [...]
##END NTUPLES=NMR SPECTRUM
##END=
