##TITLE=Analysis number 319850
Compound Code cc 10409
Project Code adrs
Chemist Name prosynth
##JCAMPDX= 6.0         $$ Bruker NMR JCAMP-DX V2.0
##DATA TYPE= NMR SPECTRUM
##DATA CLASS= NTUPLES
##ORIGIN= Bruker BioSpin GmbH
##OWNER= nmr
$$ XWIN-NMR		Version 3.5
$$ Thu Jun  1 09:28:20 2006 GMT Daylight Time (UT+1h)  MAYBRIDGE\nmr@NMR_250MHZ
##.OBSERVE FREQUENCY= 250.131544655141
##.OBSERVE NUCLEUS= ^1H
##.ACQUISITION MODE= SIMULTANEOUS (DQD)
##.ACQUISITION SCHEME= undefined
##.AVERAGES= 16
##.DIGITISER RES= 18
##SPECTROMETER/DATA SYSTEM= dpx250
##.PULSE SEQUENCE= zg30
##.SOLVENT NAME= CDCl3
##.SHIFT REFERENCE= (INTERNAL, CDCl3, 0, 16.522)
##AUDIT TRAIL= $$ (NUMBER, WHEN, WHO, WHERE, WHAT)
$$ ##TITLE= Audit trail, XWIN-NMR		Version 3.5
$$ ##JCAMPDX= 5.01
$$ ##ORIGIN= Bruker BioSpin GmbH
$$ ##OWNER= nmr
$$ C:\u/data/dgb/nmr/ADRS/5510/pdata/1/auditp.txt
$$ ##AUDIT TRAIL=  $$ (NUMBER, WHEN, WHO, WHERE, WHAT)
(   1,<2006-06-01 09:27:59.48 +100>,<MAYBRIDGE\nmr>,<NMR_250MHZ>,
      <created by zg, POWCHK disabled, PULCHK disabled
       configuration hash MD5:
       E2 DF 36 D8 04 B2 41 60 5A D7 A3 38 5A 4B D0 FE
       data hash MD5: 64K
       6C 2C B0 B0 97 A6 F4 B8 FD AD 78 C9 61 C8 1C 04>)
(   2,<2006-06-01 09:28:11.31 +100>,<MAYBRIDGE\nmr>,<NMR_250MHZ>,
      <Start of raw data processing
       ef LB = 0.3 FT_mod = 6 PKNL = 1 SI = 32K 
       data hash MD5: 32K
       53 7B 38 FE 8A 67 6E AF FD 43 87 0B 66 72 BC 34>)
(   3,<2006-06-01 09:28:13.34 +100>,<MAYBRIDGE\nmr>,<NMR_250MHZ>,
      <apk 
       data hash MD5: 32K
       C7 36 C6 3B F1 56 DA E7 C6 0A F5 C0 E6 A0 DD 63>)
(   4,<2006-06-01 09:28:14.12 +100>,<MAYBRIDGE\nmr>,<NMR_250MHZ>,
      <abs ABSG = 5 
       data hash MD5: 32K
       09 D1 02 BF 1C 5E 7A 6F B8 46 8F CD C7 CB 8A 78>)
$$ ##END=
$$ 
$$ hash MD5
$$ A3 98 8A 2C 1F 68 2D 36 F2 F7 94 1D E7 50 9C FA
##$RELAX= 
##$RELAX= 
##$RELAX= 
##$RELAX= 
##$RELAX= 
##$RELAX= 
##$RELAX= 
$$ Bruker specific parameters
$$ --------------------------
##$DU= <C:\u>
##$EXPNO= 5510
##$NAME= <ADRS>
##$PROCNO= 1
##$TYPE= <nmr>
##$USER= <dgb>
##$AMP= (0..31)
100 100 100 100 100 100 100 100 100 100 100 100 100 100 100 100 100 100 
100 100 100 100 100 100 100 100 100 100 100 100 100 100 
##$AQSEQ= 0
##$AQ_mod= 3
##$AUNM= <au_zg>
##$AUTOPOS= <4 >
##$BF1= 250.13
##$BF2= 250.13
##$BF3= 250.13
##$BF4= 250.13
##$BF5= 500.13
##$BF6= 500.13
##$BF7= 500.13
##$BF8= 500.13
##$BYTORDA= 1
##$CFDGTYP= 0
##$CFRGTYP= 5
##$CHEMSTR= <none>
##$CNST= (0..31)
1 1 145 1 1 1 1 1 1 1 1 1 1 1 1 1 1 1 1 1 1 1 1 1 1 1 1 1 1 1 1 1 
##$CPDPRG= <>
##$CPDPRG1= <>
##$CPDPRG2= <>
##$CPDPRG3= <>
##$CPDPRG4= <mlev>
##$CPDPRG5= <mlev>
##$CPDPRG6= <mlev>
##$CPDPRG7= <mlev>
##$CPDPRG8= <mlev>
##$CPDPRGB= <>
##$CPDPRGT= <>
##$D= (0..31)
0 1 0 0 0 0 0 0 0 0.06 0 0 0 0 0 0 0.0002 0 0 0 0 0 0 0 0 0 0 0 0 0 0 
0 
##$DATE= 1149150478
##$DBL= (0..7)
120 120 120 120 120 120 120 120 
##$DBP= (0..7)
150 150 150 150 150 150 150 150 
##$DBP07= 0
##$DBPNAM0= <>
##$DBPNAM1= <>
##$DBPNAM2= <>
$$ [...]
##$SUBNAM7= <"">
##$SUBNAM8= <"">
##$SUBNAM9= <"">
##$SW= 20.6930455092707
##$SWIBOX= (0..15)
0 0 3 0 0 0 0 0 0 0 0 0 0 0 0 0 
##$SW_h= 5175.983436853
##$TD= 65536
##$TD0= 1
##$TE= 295.16
##$TE2= 300
##$TE3= 300
##$TEG= 300
##$TL= (0..7)
0 120 120 120 120 120 120 120 
##$TP= (0..7)
150 150 150 150 150 150 150 150 
##$TP07= 0
##$TPNAME0= <>
##$TPNAME1= <>
##$TPNAME2= <>
##$TPNAME3= <>
##$TPNAME4= <>
##$TPNAME5= <>
##$TPNAME6= <>
##$TPNAME7= <>
##$TPOAL= (0..7)
0.5 0.5 0.5 0.5 0.5 0.5 0.5 0.5 
##$TPOFFS= (0..7)
0 0 0 0 0 0 0 0 
##$TUNHIN= 0
##$TUNHOUT= 0
##$TUNXOUT= 0
##$USERA1= <user>
##$USERA2= <user>
##$USERA3= <user>
##$USERA4= <user>
##$USERA5= <user>
##$V9= 5
##$VALIST= <valist>
##$VCLIST= <CCCCCCCCCCCCCCC>
##$VD= 0
##$VDLIST= <DDDDDDDDDDDDDDD>
##$VPLIST= <PPPPPPPPPPPPPPP>
##$VTLIST= <TTTTTTTTTTTTTTT>
##$WBST= 1024
##$WBSW= 4
##$XGAIN= (0..3)
0 0 0 0 
##$XL= 0
##$YL= 0
##$YMAX_a= 450873
##$YMIN_a= -351400
##$ZGOPTNS= <>
##$ZL1= 120
##$ZL2= 120
##$ZL3= 120
##$ZL4= 120
##$ABSF1= 16.522
##$ABSF2= -4.171173
##$ABSG= 5
##$ABSL= 3
##$ALPHA= 0
##$AQORDER= 0
##$ASSFAC= 0
##$ASSFACI= 0
##$ASSFACX= 0
##$ASSWID= 0
##$AUNMP= <proc_1d>
##$AZFE= 0.1
##$AZFW= 0.1
##$BCFW= 0
##$BC_mod= 0
##$BYTORDP= 0
##$COROFFS= 0
##$CY= 12.5
##$DATMOD= 1
##$DC= 0
##$DFILT= <>
##$DTYPP= 0
##$F1P= 14.0000005364418
##$F2P= -0.99999901652339
##$FCOR= 0.5
##$FTSIZE= 32768
##$FT_mod= 6
##$GAMMA= 0
##$GB= 0
##$INTBC= 1
##$INTSCL= 1
##$ISEN= 128
##$LB= 0.3
##$LEV0= 0
##$LPBIN= 0
##$MAXI= 10000
##$MC2= 0
##$MEAN= 0
##$ME_mod= 0
##$MI= 0
##$NCOEF= 0
##$NC_proc= -3
##$NLEV= 6
##$NOISF1= 0
##$NOISF2= 0
##$NSP= 0
##$NTH_PI= 0
##$NZP= 0
##$OFFSET= 16.522
##$PC= 1
##$PHC0= 22.1277
##$PHC1= -1.878578
##$PH_mod= 1
##$PKNL= yes
##$PPARMOD= 0
##$PSCAL= 4
##$PSIGN= 0
##$REVERSE= no
##$SF= 250.13
##$SI= 32768
##$SIGF1= 0
##$SIGF2= 0
##$SINO= 400
##$SIOLD= 32768
##$SREGLST= <1H.CDCl3>
##$SSB= 0
##$STSI= 32768
##$STSR= 0
##$SW_p= 5175.98343685301
##$SYMM= 0
##$S_DEV= 0
##$TDeff= 65536
##$TDoff= 0
##$TI= <Analysis number 999999
Compound Code 99
Book Reference 9
Project Code 9>
##$TILT= no
##$TM1= 0
##$TM2= 0
##$TOPLEV= 0
##$USERP1= <user>
##$USERP2= <user>
##$USERP3= <user>
##$USERP4= <user>
##$USERP5= <user>
##$WDW= 1
##$XDIM= 32768
##$YMAX_p= 370064250
##$YMIN_p= -46252
$$ End of Bruker specific parameters
$$ ---------------------------------
##NTUPLES= NMR SPECTRUM
##VAR_NAME=  FREQUENCY,     SPECTRUM/REAL,   SPECTRUM/IMAG
##SYMBOL=    X,             R,               I
##VAR_TYPE=  INDEPENDENT,   DEPENDENT,       DEPENDENT
##VAR_FORM=  AFFN,          ASDF,            ASDF
##VAR_DIM=   32768,         32768,           32768
##UNITS=     HZ,            ARBITRARY UNITS, ARBITRARY UNITS
##FACTOR=    0.157963299565203, 1,           1
##FIRST=     4132.6476996994, 0,             0
##LAST=      -1043.33573715361, 0,           0
##MIN=       -1043.33573715361, -46252,      0
##MAX=       4132.6476996994, 370064250,     0
$$ Real data points
##PAGE= N=1
##DATA TABLE= (X++(R..R)), XYDATA
$$ [...]
16661I9176j3736j1972n656l809o971o096k712l818l768k456j155l711l50J253
$$ 99176 85440 73468 67812 64003 57032 50936 48224 44406 40638 38182 37027 33316 32966 34219
16647C4219K469l32j598l745l96N44N15l821j327N23M48l348j883L165j404j71
$$ 34219 36688 36356 34758 31013 30617 31161 31676 27855 26528 27051 27499 24151 22268 25433 24029 23858
16631B3858q80M286k173o474j2182l447K271P326K788k179l558J512J612p71N96
$$ 23858 22978 27264 25091 18617 6435 2988 5259 12585 15373 13194 9636 11148 12760 11989 12585
16616A2585k89j130P5L184J131Q8J519O32j925p709L029K912o004j795j656j118
$$ 12585 12296 11166 11241 14425 15556 15644 17163 17795 15870 8161 11190 14102 8098 6303 4647 3529
16600C529M77k722n04K52j260k36r98J0K158L370m043M16k003l436K75L078J407
$$ 3529 4006 1284 780 1032 -228 -464 -1462 -1452 706 4076 33 449 -1554 -4990 -4715 -1637 -230
16583b30L503J594m534m29L085K417J299J160q77l763n230M22K397P301l742n843
$$ -230 3273 4867 333 -96 2989 5406 6705 7865 6988 3225 -2005 -1583 814 8115 4373 -1470
16567a470l513m306j282n036J189q82q7K60M208M903k418j14k409M556l01J306
$$ -1470 -4983 -9289 -10571 -15607 -14418 -15300 -15387 -15127 -10919 -6016 -8434 -8548 -10957 -6401 -6702 -5396
16551e396j992J324K718o51K291r78j940q93r5K110M831k025M01J782l26l719
$$ -5396 -7388 -6064 -3346 -3997 -1706 -2684 -4624 -5517 -5612 -3502 1329 -696 -295 1487 1161 -2558
16535b558K54J43n239j922l86M325O955p05j881k740l858K611k25l014O634M667
$$ -2558 -2304 -2161 -7400 -9322 -9708 -5383 1572 867 -1014 -3754 -7612 -5001 -5226 -8240 -1606 3061
16519C061r60k862k736M568L744K268k778l360m106J50k070j057M661J676j104
$$ 3061 2101 -761 -3497 1071 4815 7083 4305 945 -3161 -3011 -5081 -6138 -1477 199 -905
16504i05J202o097l843J121J122o73m264l440N079M111M889L177j736L643k83
$$ -905 297 -5800 -9643 -8522 -7400 -8073 -12337 -15777 -10698 -6587 -1698 1479 -257 3386 3103
16489C103k020L59J987K701l838l743n841j99M163J820J574r13j253j230n326
$$ 3103 1083 1442 3429 6130 2292 -1451 -7292 -7491 -3328 -1508 66 -847 -2100 -3330 -8656
16474h656j64qL260K350o84q447m379K869j334j838K779L965M889l21k092N850
$$ -8656 -8820 -8828 -5568 -3218 -3902 -12349 -16728 -13859 -15193 -17031 -14252 -10287 -5398 -5719 -7811 -1961
16458a961M407J926k201l829m95J550J899l699k207J040n089j217N530o327n453
$$ -1961 2446 4372 2171 -1658 -2153 -603 1296 -2403 -4610 -3570 -8659 -9876 -4346 -10673 -16126
16443a6126L911P781J207j898r44m704k235J927L22P73M70K294O400Q268O602
$$ -16126 -12215 -4434 -3227 -5125 -6069 -10773 -13008 -11081 -10759 -9986 -9516 -7222 -822 7446 14048
16428A4048k121m062q194j732Q12J609M077P404k547k914j158O45m631o792l489
$$ 14048 11927 7865 -329 -2061 -1249 360 4437 11841 9294 6380 5222 5867 1236 -5556 -9045
16413i045N315R114m178p318l258J096k745q84P029J160j010J531n481j601K542
$$ -9045 -3730 5384 1206 -6112 -9370 -8274 -11019 -11903 -4874 -3714 -4724 -3193 -8674 -10275 -7733
16398g733N310m092m044L552L778L818m48p99M12m727K57O964j523q43k390L967
$$ -7733 -2423 -6515 -10559 -7007 -3229 589 141 -658 -246 -4973 -4716 2248 725 -118 -2508 1459
16382A459K633l70K147K408k676k074l922K481O952O595J916q12Q847R945q05
$$ 1459 4092 3722 5869 8277 5601 3527 -395 2086 9038 15633 17549 16737 25584 35529 34724
16367C4724L511J347P81l343R216N237L030k405q158j993K945j825L051L60l124
$$ 34724 38235 39582 40363 37020 46236 51473 54503 52098 43940 41947 44892 43067 46118 46478 43354
16352D3354j552m044n85J016k472O00n230j597j383k872K1q18l696j361j567J133
$$ 43354 41802 37758 37173 38189 35717 36317 31087 29490 28107 25235 25256 24438 20742 19381 17814 18947
16336A8947m44l256j87J539r48J757R65m68K244L9M7j585m537p23K087J522K0
$$ 18947 18503 15247 15060 16599 15651 17408 18373 17905 20149 20188 20235 18650 14113 13390 15477 16999 17019
16319A7019N818K010J221n906k461l571l82J266l876l670J048n405m930p8j574
$$ 17019 22837 24847 26068 20162 17701 14130 13748 15014 11138 7468 8516 3111 -1819 -1897 -3471
16304c471j964J955K77j899l221l418Q41K419j072K109N553k581n362q16j490
$$ -3471 -5435 -3480 -3203 -5102 -8323 -11741 -10900 -8481 -9553 -7444 -1891 -4472 -9834 -10650 -12140
16289a2140K639K745l83N530O228n617k724K669M479O411J669j732J319M658Q556
$$ -12140 -9501 -6756 -7139 -1609 4619 -998 -3722 -1053 3426 9837 11506 9774 11093 15751 24307
16274B4307N965Q074M308l11L074J48j194K537M764o7m140m619L147L996P65R12
$$ 24307 30272 38346 42654 42343 45417 45565 44371 46908 51672 51605 47465 42846 45993 49989 50754 51666
16258E1666n325o254n383M105N132O735K368N8O293J0778N133P534N547P151O512
$$ 51666 46341 40087 34704 38809 43941 50676 53044 53102 59395 70173 75306 82840 88387 95538 102050
16243A02050O236P942J1090J4521J2019J1314J2779R354O544Q235O667j094m681
$$ 102050 108286 116228 127318 141839 153858 165172 177951 187305 193849 202084 208751 207657 202976
16230B02976k521j531j623m104k613o444p683o221K713j877k247m006R24j572
$$ 202976 200455 198924 197301 193197 190584 184140 176457 170236 172949 171072 168825 164819 165743 164171
16216A64171k98n244k358j210K32l503o512l880M61m607j095l100j762R47J826
$$ 164171 163873 158629 156271 155061 155293 151790 145278 141398 141859 137252 136157 133057 131295 132242 134068
16201A34068p16J17K418P046Q327R897J909l502N162O381Q64k89n83L148J397
$$ 134068 133352 133469 135887 142933 151260 161157 163066 159564 164726 171107 171971 171682 171099 174247 175644
16186A75644j89K945K60L1k149R02L737p56j031K024j458l924o327J114M088L443
$$ 175644 175455 178400 178660 178691 176542 177444 181181 180425 179394 181418 179960 176036 169709 170823 174911 178354
16170A78354K090k15q55N044N667M991j038J0486O085P847J0009Q130J4614K2837
$$ 178354 180444 180229 179374 184418 190085 195076 194038 204524 210609 218456 228465 236595 251209 274046
16156B74046K0330K0024K5534L2750L5703M6302N4979N9832O2437P0168P4700
$$ 274046 294376 314400 339934 372684 408387 454689 509668 569500 631937 702105 776805
16145G76805R3713J05869J08838J01972R9825J08368J31830J36986J31330J30815
$$ 776805 870518 976387 1085225 1187197 1287022 1395390 1527220 1664206 1795536 1926351
16135A926351J47821J68116J90642K14385K46085K89592L51011M14272N08912
$$ 1926351 2074172 2242288 2432930 2647315 2893400 3182992 3534003 3948275 4457187
16126D457187O59814Q88278J210962J714766K446069L388988M284031M966079
$$ 4457187 5117001 6005279 7216241 8931007 11377076 14766064 19050095 24016174
16118B4016174N360472N876678P267442Q897430R587813R007670O234011M445991
$$ 24016174 29376646 35253324 42520766 51418196 61006009 70013679 76247690 80693681
16110H0693681M713525N048182M619018J669394l342838m959901n161669m687142
$$ 80693681 85407206 90455388 95074406 96743800 93400962 88441061 83279392 78592250
16102G8592250m658971p094636q761968q450925p393239n776136m830345m583353
$$ 78592250 73933279 66838643 58076675 49625750 42232511 36456375 31626030 27042677
16094B7042677m084521l382429k569858j836802j350542j068596q95571p68711
$$ 27042677 22958156 19575727 17005869 15169067 13818525 12749929 11854358 11085647
16086A1085647o55818n80717n26045m85192m34620l83954l31980k93080k86660
$$ 11085647 10429829 9849112 9323067 8837875 8403255 8019301 7687321 7394241 7107581
16077G107581k73704k45409k22997k07100k05051k22357k21045k10227k01772
$$ 7107581 6833877 6588468 6365471 6158371 5953320 5730963 5509918 5299691 5097919
16068E097919k04623k05234k04727j92024j79531j65179j58025j55402j42268
$$ 5097919 4893296 4688062 4483335 4291311 4111780 3946601 3788576 3633174 3490906
16059C490906j34022j25521j17926j18296j11643j01911j00572r2143r8720r3731
$$ 3490906 3356884 3231363 3113437 2995141 2883498 2781587 2681015 2588872 2490152 2396421
16049B396421q2817p5366p4286p4059p3066p4243o8894n7937n2047n3909n4615
$$ 2396421 2313604 2238238 2163952 2089893 2016827 1942584 1873690 1815753 1763706 1709797 1655182
16038A655182m9075m4157m3348m2320m1478m0433m3410l8490l7236m5675m3023
$$ 1655182 1606107 1561950 1518602 1476282 1434804 1394371 1350961 1312471 1275235 1229560 1186537
16027A186537l7906l1302l7135m5073m9083m9788m6517m3147l8927m1521l9094
$$ 1186537 1148631 1117329 1080194 1035121 986038 936250 889733 846586 807659 766138 727044
16016G27044l9592l6920l2209l2897l3627l0074l0096l5209k9564k3881j9684
$$ 727044 687452 650532 618323 585426 551799 521725 491629 456420 426856 402975 383291
16005C83291j8063k3888j9035j2367j5287j6722j1213j2784j5447o836p38q609
$$ 383291 365228 341340 322305 309938 294651 277929 266716 253932 238485 231649 230911 222302
15993B22302j0032n771p124m207n327l988K212k026l882j580o378k075J033L192
$$ 222302 212270 206499 199375 195168 189841 185853 188065 186039 182157 180577 174199 172124 173157 176349
15979A76349k466m669L2L475J957K59j559j409L627j912n52N64J775J0424N145
$$ 176349 173883 169214 169246 172721 174678 174937 173378 171969 175596 173684 173132 173696 175471 185895 191040
15964A91040M091L25m503K589J352M367k30l878r131k467l608l050j32o767p392
$$ 191040 195131 195456 190953 193542 194894 199261 199031 195153 186022 183555 179947 176897 176765 169998 162606
15949A62606k024M48K631r7k867m41N505M153k048L215L202M098L330O64k198
$$ 162606 160582 161030 163661 163564 160697 160256 165761 169914 167866 171081 174283 178381 181711 182375 180177
15934A80177j412J689O83K510K411k317j969K440K702k806n180k399J460K790
$$ 180177 178765 180454 181137 183647 186058 183741 181772 184212 186914 184108 178928 176529 177989 180779
15920A80779K59J668J533Q31j464o885p214j31j504k814J784k500k98k840r474
$$ 180779 181038 182706 184239 185070 183606 176721 169507 169376 167872 165058 166842 164342 164044 161204 151730
15905A51730o672O21k128l166m218m396q125L477L456P18l464m178j901M974N045
$$ 151730 145058 145679 143551 140385 136167 131771 123646 127123 130579 131297 127833 123655 121754 126728 131773
15890A31773L34K763k441l640j995k063N18l085J657J980k11k441j082k020l275
$$ 131773 132107 134870 132429 128789 126794 124731 125249 122164 123821 125801 125590 123149 122067 120047 116772
15875A16772j676o607n677K940k239j800l120j456n479k569K366n36K708J023
$$ 116772 115096 108489 102812 105752 103513 101713 98593 97137 91658 89089 91455 90919 93627 94650
15861I4650n212K493L705l922M31O15k782L519K121p861l70K521p66k24m385m878
$$ 94650 89438 91931 95636 91714 92145 92760 89978 93497 95618 87757 87387 89908 89142 88918 84533 79655
15845G9655k803J673k485k304P28K188J83m808k568j810k821n002j127j56J560
$$ 79655 76852 78525 76040 73736 74464 76652 76835 72027 69459 67649 64828 59826 58699 58543 60103
15830F0103j565l457K35m103L605J133L511m7k177K852J778O306K290p589K829
$$ 60103 58538 55081 55316 51213 54818 55951 59462 59415 57238 60090 61868 68174 70464 62875 65704
15815F5704M239r54m117j002l856L43j181k128p34j675j351l564j418k206k503
$$ 65704 69943 68989 64872 63870 60014 60357 59176 57048 56314 54639 53288 49724 48306 46100 43597
15800D3597J038p80n81m95k423j3l2l28l802k53M596l63J747J667L92m82qK78
$$ 43597 44635 43855 43274 42779 40356 40343 40311 39983 36181 35928 40524 40161 41908 43575 43967 43485 43477 43755
15782D3755k592K8Q67q88N646k3L656l823q077l128N718J378M428n80l767L161
$$ 43755 41163 41191 42058 41170 46816 46793 50449 46626 38549 35421 41139 42517 46945 46365 42598 45759
15766D5759J769o7m735J1n890R42L184P57k216l922k730k590q26J238j737K500
$$ 45759 47528 47461 42726 42737 36847 37789 40973 41730 39514 35592 32862 30272 29446 30684 28947 31447
15750C1447N163K811n58m321j933k099k78K968N448N650l544L37j717n756k768
$$ 31447 36610 39421 38863 34542 32609 30510 30232 33200 38648 44298 40754 41091 39374 33618 30850
15735C0850Q90j688j223K815O86k285m842m7L906N675n75l442r09R77J95K237
$$ 30850 31740 30052 28829 31644 32330 30045 25203 25156 29062 34737 34162 30720 29811 30788 30983 33220
15719C3220l632j564K757M722N11k266K465n26n42K870N182n446m996k887J518
$$ 33220 29588 28024 30781 35503 36014 33748 36213 35687 35145 38015 43197 37751 32755 29868 31386
15704C1386n94L931j74K854O8j958j475k352j55m938n653J585M955j02m88n152
$$ 31386 30792 34723 34549 37403 37471 35513 34038 31686 31531 26593 20940 22525 27480 27378 26890 21738
15688B1738o6N573m9k12j929l999L527O387O927P6l788k842q05M35J359J640K326
$$ 21738 21672 27245 27196 26984 25055 21056 24583 30970 37897 37973 34185 31343 30538 30973 32332 33972 36298
15671C6298J055q66o600q282Q89M323l85k921L592N744L280K266N687O646P15
$$ 36298 37353 36487 29887 21605 22494 26817 26432 23511 27103 32847 36127 38393 44080 50726 51441
15656E1441o93K853j824o240n316j195p86n62L816j037k453j644N1O95o25L104
$$ 51441 50748 53601 51777 45537 40221 39026 38240 37678 41494 40457 38004 36360 36411 37106 36481 39585
15640C9585L351j709J509k293n966l620K39K166j998K562K417J785k20L56J699
$$ 39585 42936 41227 42736 40443 34477 30857 31096 33262 31264 33826 36243 38028 37808 38164 39863
15625C9863J665J031K278P69j151l762l185l429k375R38J153K13J325K03j107
$$ 39863 41528 42559 44837 45606 44455 40693 37508 34079 31704 32642 33795 34008 35333 35536 34429
15610C4429p054k582O650N729j173k568K093j103j274l476K280p78q2J52o24j150
$$ 34429 27375 24793 31443 37172 35999 33431 35524 34421 33147 29671 31951 31173 31091 31243 30619 29469
15594B9469j059M047O503J326n408j968l387k6N89N238K526L603J301q23K157
$$ 29469 28410 32457 38960 40286 34878 32910 29523 29497 30086 35324 37850 41453 42754 41931 44088
15579D4088J93l988J229m3m783p67N076r79k734l863J310m41L842N112M065k239
$$ 44088 44281 40293 41522 41479 36696 35929 41005 40026 37292 33429 34739 34298 38140 43252 47317 45078
15563D5078j290J174J381l86M443K429n510J245P432L027K442M183Q422k681j037
$$ 45078 43788 44962 46343 45957 50400 52829 47319 48564 55996 59023 61465 65648 74070 71389 70352
15548G0352J0773J3439J0205K4730K8750K8495K7845L5516M3060M6860N3521M7511
$$ 70352 81125 94564 104769 129499 158249 186744 214589 250105 293165 340025 393546 441057
15536D41057L3838K5927K7872K6980J7973n132k4678k6281k7976l0823l6938m5132
$$ 441057 474895 500822 528694 555674 573647 568515 543837 517556 489580 458757 421819 376687
15524C76687m4242l7433l6322l2056k4682k2969j8963j8386j0485k131l119m553
$$ 376687 332445 295012 258690 226634 201952 178983 160020 141634 131149 129018 125899 121346
15512A21346p990r356l442J481j994o623n443k038j486N522J820p416p340j147
$$ 121346 113356 104000 100558 102039 100045 93422 87979 85941 84455 89977 91797 84381 77041 75894
15498G5894j030k809j100k367j204j900m942k741k472l127M360P51M15j366l160
$$ 75894 74864 72055 70955 68588 67384 65484 60542 57801 55329 52202 56562 57313 57728 56362 53202
15483E3202p040k884j211n17L890j904l522l776K356J87j707J459L876K655J748
$$ 53202 46162 43278 42067 41550 45440 43536 40014 36238 38594 38781 37074 38533 42409 45064 46812
15468D6812k668m712n970p98P178j063j144K870l64J063n281l725j418m21J662
$$ 46812 44144 39432 33462 32664 39842 38779 37635 40505 40141 41204 35923 32198 30780 30359 32021
15453C2021J229n47o61n33J31L019J503j997j783J132L963l14o876o882o156l128
$$ 32021 33250 32703 32042 31509 31640 34659 36162 34165 32382 33514 37477 37163 30287 23405 17249 14121
15437A4121K785O455O644k661j915j918j992r88l785P62P29K818N309o53q777
$$ 14121 16906 23361 30005 27344 25429 23511 21519 20531 16746 17508 18237 21055 26364 25711 16934
15422A6934l828O56j777J905J013J039m82j182J045J57m27J763J889Q33l78k584
$$ 16934 13106 13762 11985 13890 14903 15942 15460 14278 15323 15480 15053 16816 18705 19538 19160 16576
15406A6576n669k76p31M46K295j227j219j464j735Q12m0K081J327J681q51M603
$$ 16576 10907 10631 9900 10346 12641 11414 10195 8731 6996 7808 7768 9849 11176 12857 12006 16609
15390A6609k627N37Q1J91l427J717P06k586J978l421k606j576N489k696m860M18
$$ 16609 13982 14519 14600 14791 11364 13081 13787 11201 13179 9758 7152 5576 11065 8369 3509 3927
15374C927K825Q172J510j912m900K941L212N3j628k276K529k098o154Q45K425
$$ 3927 6752 14924 16434 14522 9622 12563 15775 15828 14200 11924 14453 12355 6201 7046 9471
15359I471J510m159J185L986n696j357j559n723K889k27J602J186j691j613M129
$$ 9471 10981 6822 8007 11993 6297 4940 3381 -2342 547 320 1922 3108 1417 -196 3933
15344C933M031J422L548M099n341m463K305k562j990K767l74J212K815K400n291
$$ 3933 7964 9386 12934 17033 11692 7229 9534 6972 4982 7749 7375 8587 11402 13802 8511
15329H511M822Q594J89O54m362j952j906j110l398k968J452j410l182n597l430
$$ 8511 13333 21927 22116 22770 18408 16456 14550 13440 10042 7074 8526 7116 3934 -1663 -5093
15314e093M502P320L429K71m643J759M987K607k903q90R31p55n536M266K575p067
$$ -5093 -591 6729 10158 10429 5786 7545 12532 15139 12236 11346 12277 11522 5986 10252 12827 5760
15298E760K560r1o89K526l167j765k254N77j17p21O030N646K70O63K239K073p416
$$ 5760 8320 8229 7540 10066 6899 5134 2880 3457 3340 2619 8649 14295 14565 15228 17467 19540 12124
15281A2124m818k989K332L547M586J26n361J10k3m001j221J324L672K322l020
$$ 12124 7306 4317 6649 10196 14782 14908 9547 9657 9634 5633 4412 5736 9408 11730 8710
15266H710n124j389L92J896J09R72n068J215P500O26k219L483J757k393m025J26
$$ 8710 3586 2197 2589 4485 4594 5566 498 1713 9213 9839 7620 11103 12860 10467 6442 6568
15250F568J367R38Q27j884J356N87k54K735m429q43M174J736J301K311J07l986
$$ 6568 7935 8873 9700 7816 9172 9759 9505 12240 7811 6968 11142 12878 14179 16490 16597 12611
15234A2611k821m099P17j038m1m7m98K168O788K443o67j98o479q879K078O409
$$ 12611 9790 5691 6408 5370 5329 5282 4784 6952 13740 16183 15516 15318 8839 -40 2038 8447
15218H447L259m485j378N040l53m272m418M325M066j364L43K05L030L350j573
$$ 8447 11706 7221 5843 10883 10530 6258 1840 6165 10231 8867 9210 9415 12445 15795 14222
15203A4222p258o197j342M957J342O228j193N4K553j077j987k77M447N729j178
$$ 14222 6964 767 -575 4382 5724 11952 10759 10813 13366 12289 10302 10025 14472 20201 19023
15188A9023k94L634m10k732j375j876j589j469k064j520J984R46Q42k92j481P35
$$ 19023 18729 22363 21953 19221 17846 15970 14381 12912 10848 9328 11312 12258 13100 12808 11327 12062
15172A2062K963n864M18M663J481l554j838P3K687l357k023K035m37J911M76M67
$$ 12062 15025 9161 9579 14242 15723 12169 10331 10404 13091 9734 7711 9746 9309 11220 11696 12163
15156A2163l184o26l858O85K2J523j157Q90j270k652P87K059k632N14l283M279
$$ 12163 8979 8353 4495 5180 5202 6725 5568 6458 5188 2536 3323 5382 2750 3264 -19 4260
15140D260J544J535R63L807N787J442n199n272j978J76L564K648L566n055l543
$$ 4260 5804 7339 8302 12109 17896 19338 14139 8867 6889 7065 10629 13277 16843 11788 8245
15125H245K010M31m74m697L21j952M027m52j303N18l372l984q05M734Q82N70M035
$$ 8245 10255 10686 10212 5515 5836 3884 7911 7459 6156 6674 3302 -682 -1487 3247 4129 4699 8734
15108H734J735k714l906j289M984J106l581P50O668k261k33K525k585k161m146
$$ 8734 10469 7755 3849 2560 7544 8650 5069 5819 12487 10226 9993 12518 9933 7772 3626
15093C626K51M515K199N25L017N942L117L534M860J2796J9803J6730Q177L988
$$ 3626 3877 8392 10591 11116 14133 20075 23192 26726 31586 44382 64185 80915 89092 93080
15079I3080p11p347q683l038j3447j4836r328r290r345m815N945l19o652l773
$$ 93080 92369 85022 76339 73301 59854 45018 35690 26400 17055 12240 18185 17866 11214 7441
15065G441l267P78P663j79L294K885l6j771m785M673n57n520l392p64O196j213
$$ 7441 4174 4952 12615 12436 15730 18615 18579 16808 12023 16696 16139 10619 7227 6463 12659 11446
15049A1446k25k435r173j907M422K579J197K530L013k010n797R63L052l880J79
$$ 11446 11221 8786 -387 -2294 2128 4707 5904 8434 11447 9437 3640 4603 7655 3775 3954
15034C954J603J259Q35J173Q49J395K379o825L91k649n018j021K990K46M239M998
$$ 3954 5557 6816 7651 8824 9673 11068 13447 6622 7013 4364 -654 -1675 1315 1561 5800 10798
15018A0798L092m033o860k171P475J346k364k924k173j103o79M203M240o10J363
$$ 10798 13890 9857 2997 826 8301 9647 7283 4359 2186 1083 404 4607 8847 8237 9600
15003I600M138K843K701j1261n161J048L918L424o452m58L868M713j403m538j429
$$ 9600 13738 16581 19282 8021 2860 3908 7826 11250 4798 4340 8208 12921 11518 6980 5551
14988E551j58Q768r18j636K335m308k875M73r48j385J577k463J317K131K109l139
$$ 5551 5393 14161 13243 11607 13942 9634 6759 7232 6284 4899 6476 4013 5330 7461 9570 6431
14972F431k820L478O984R92q23J48l367l27j944k042k0K38P8M659Q45m717n129
$$ 6431 3611 7089 14073 15065 14242 14390 11023 10696 8752 6710 6690 6928 7006 11665 12510 7793 2664
14955B664l941q5K625J484J2988K920j997m797n601K57l549n81K759M459k183
$$ 2664 -1277 -1362 1263 2747 15735 18655 16658 11861 6260 6517 2968 2387 5146 9605 7422
14940G422k884j329J30K545K76n66l724j122L499P463M882J702J74k813M61j965
$$ 7422 4538 3209 3339 5884 6160 5594 1870 748 4247 11710 16592 18294 18468 15655 16116 14151
14924A4151M638R82n196p075k797J654p82l13J573L82L275k567o37K815J903J697
$$ 14151 18789 19771 14575 7500 4703 6357 5575 5262 6835 7217 10492 7925 7288 10103 12006 13703
14908A3703j456l080J556N358K7o037o595J684J500r88M297L312M56j531n120
$$ 13703 12247 9167 10723 16081 16108 10071 3476 5160 6660 5672 9969 13281 13737 12206 7086
14893G086L22j60m55J85K408l35R56K948j566o832O34J953k417K774K541J167
$$ 7086 7408 7248 6793 6978 9386 9051 10007 12955 11389 4557 5191 7144 4727 7501 10042 11209
14877A1209r95J304M79k298N60J609P02K218R167J159o481j838p36j225L469j683
$$ 11209 10214 11518 11997 9699 10259 11868 12570 14788 23955 25114 18633 16795 16059 14834 18303 16620
14861A6620R65O65j763N95o8k519l682P31k119l511r35K132P9j484J847m606J227
$$ 16620 17585 18250 16487 17082 17014 14495 10813 11544 9425 5914 4979 7111 7190 5706 7553 2947 4174
14844D174O742J841j333J024J101m381j808L035K4K890J60l301J747L273m705
$$ 4174 10916 12757 11424 12448 13549 9168 7360 10395 10419 13309 13469 10168 11915 15188 10483
14829A0483p669k275Q384M790L583l489Q38J56L914k560j767k831m616N31K221
$$ 10483 2814 539 8923 13713 17296 13807 14645 14801 18715 16155 14388 11557 6941 7472 9693
14814I693k883p65l622M53K763K417o12J230J474J221j718j168j26M049j0M05
$$ 9693 6810 6045 2423 2876 5639 8056 7444 8674 10148 11369 9651 8483 8357 12406 12396 12801
14798A2801q71p624l976K321K283L180k023N00j19k99J040j864K408K029L64k866
$$ 12801 11930 4306 330 2651 4934 8114 6091 6591 6472 6173 7213 5349 7757 9786 10150 7284
14782G284P215R28j502k49k86m886k119J453N112n599L828L061j559Q72l280j923
$$ 7284 14499 15427 13925 13676 13390 8504 6385 7838 12950 7351 11179 14240 12681 13553 10273 8350
14766H350q56q6o892J243K734K910j517J424J398j456K00m904l253J019M422M789
$$ 8350 7494 7408 516 1759 4493 7403 5886 7310 8708 7252 7452 2548 -705 314 4736 9525
14750I525j069k674r76m34J048k255O09J329k559J993O85K726K146R01K348l086
$$ 9525 8456 5782 4806 4372 5420 3165 3774 5103 2544 4537 5222 7948 10094 10995 13343 10257
14734A0257L023M860l94l591K007L157k274p69j831k601N36o36K911J128k030
$$ 10257 13280 18140 17746 14155 16162 19319 17045 16276 14445 11844 12380 11744 14655 15783 13753
14719A3753m776j151j334J53j982J667P37L894J745L000N024P50m555M552L034
$$ 13753 8977 7826 6492 6645 4663 6330 7067 10961 12706 15706 20730 21480 16925 21477 24511
14704B4511n136j832J858n449O06L924K778k783m119l187Q77J649mn19k583j450
$$ 24511 19375 17543 19401 13952 14558 18482 21260 18477 14358 11171 12048 13697 13693 13174 10591 9141
14688I141m0n07o26j535L028N897k354k081N04O851m302j802J389M768N014L273
$$ 9141 9101 8594 7968 6433 9461 15358 13004 10923 11427 18278 13976 12174 13563 18331 23345 26618
14672B6618l48J391n991j890M057J37j39J269K707m292l424k675J803L781m66
$$ 26618 26270 27661 21670 19780 23837 23974 23835 25104 27811 23519 20095 17420 19223 23004 22538
14657B2538J931L101k91P5P160K303m979o317k577J720O53l14k29k215K520O249
$$ 22538 24469 27570 27279 27354 34514 36817 31838 25521 22944 24664 25317 25003 24774 22559 25079 31328
14641C1328m31k184K249m55K85O095L142M400M562N608J0184J4597J7860K5857
$$ 31328 30897 28713 30962 30507 30792 36887 40029 44429 48991 54599 64783 79380 97240 123097
14627A23097L6978M4022L7816K4428Q935j01o718j9391k9922l0543l3087l2539
$$ 123097 160075 204097 241913 266341 275276 275175 268457 249066 219144 188601 155514 122975
14615A22975k2705j6219n783l149m274l085n710p866l188j257l849J786K39k559
$$ 122975 100270 84051 78268 75119 70845 67760 62050 54184 50996 49739 45890 47676 47915 45356
14601D5356j926m108m029j443k737j981J407M100L323k803m013p44M132L18k402
$$ 45356 43430 39322 35293 33850 31113 29132 30539 34639 37962 35159 31146 30402 34534 34852 32450
14586C2450l767N910N520R98j505l235j238K978j184L179N396j372l184K571L940
$$ 32450 28683 34593 40113 41111 39606 36371 35133 38111 36927 40106 45502 44130 40946 43517 47457
14571D7457N289M891Q770J1485J0679J3544J5310J9511K1741K2843J5827L677
$$ 47457 52746 57637 66407 77892 88571 102115 117425 136936 158677 181520 197347 201024
14559B01024o1n377j3022j5300j5209j6827j7210j8684j1001j3351r891n205j403
$$ 201024 200963 195586 182564 167264 152055 135228 118018 99334 88333 74982 65091 59886 58483
14546E8483k167m207K234l466o507J664j240l051l409k51j990p58K375K498K419
$$ 58483 56316 52109 54343 50877 44370 46034 44794 41743 38334 38083 36093 35335 37710 40208 42627
14531D2627k6k145P50l743k964j35l542m516k363j94j77L432M397o28n267k924
$$ 42627 42601 40456 41206 37463 34499 34364 30822 26306 23943 23749 23572 27004 31401 30773 25506 22582
14515B2582l65j918R30K903L647P282J147K345J53j065o006J958O631k601m230
$$ 22582 22217 20299 21229 24132 27779 35061 36208 38553 38706 37641 31635 33593 40224 37623 33393
14500C3393K497m388j59J445K244J587m198o52K859N951L313k384n174m220m721
$$ 33393 35890 31502 31343 32788 35032 36619 32421 31769 34628 40579 43892 41508 36334 32114 27393
14485B7393M086q20J808k554j299J656L569m315l854K471K621l062k995k004L58
$$ 27393 31479 30659 32467 29913 28614 30270 33839 29524 25670 28141 30762 27700 24705 22701 23059
14470B3059M086m257L763J559n949m863J160J999L559M792k082m248m399K791
$$ 23059 27145 22888 26651 28210 22261 17398 18558 20557 24116 28908 26826 22578 18179 20970
14456B0970j94j511K963L719J432P89L40J306R7J280K051K36J07m1J389R64j100
$$ 20970 20776 19265 22228 25947 27379 28168 28508 29814 29911 31191 33242 33478 33585 33544 34933 35897 34797
14439C4797o15K687l686j878l69L359J645j89j500M063K380J851L513N4m004m324
$$ 34797 34182 36869 33183 31305 30936 34295 35940 35751 34251 38314 40694 42545 46058 46112 42108 37784
14423C7784K4L227M062m0l162L995L719l300j49J853M041N91k755k814L335K801
$$ 37784 37808 41035 45097 45057 41895 45890 49609 46309 46160 48013 52054 52645 49890 47076 50411 53212
14407E3212k353J944K48Q00K42j528j503K317K517j546Q61m34O00L254j454l084
$$ 53212 50859 52803 53051 53851 54093 52565 51062 53379 55896 54350 55211 54777 55377 58631 57177 54093
14391E4093N727M609J599M350J527K968R371J0084J0547J0273R017J3110J2554
$$ 54093 59820 64429 66028 70378 71905 74873 84244 94328 104875 115148 124165 137275 149829
14378A49829J3310J8051K0928K6543L4391M7603N2445O4740Q3956J06423J29759
$$ 149829 163139 181190 202118 228661 263052 310655 363100 427840 511796 618219 747978
14367G47978J38601J21993R0586N6225J1581k2531o0326q9446j13983j25852j15422
$$ 747978 886579 1008572 1099158 1155383 1166964 1144433 1084107 994661 880678 754826 639404
14356F39404j02953q1767n9051m2648l5377l3872k3789j5360j6510j5990j4390
$$ 639404 536451 454684 395633 352985 317608 283736 259947 244587 228077 212087 197697
14345A97697j2109p251j1774j1914l825k268k155m725l742o806n478l412J765
$$ 197697 185588 178337 166563 154649 150824 148556 146401 141676 137934 131128 125650 122238 124003
14332A24003m101k276P45k157j410m129n581j658n427r29j917M20J058O80l243
$$ 124003 119902 117626 118371 116214 114804 110675 105094 103436 98009 97080 95163 95583 96641 97321 94078
14317I4078r23j927j458k620j088J526j821k138K57j243Q21m402k460K607j15
$$ 94078 93155 91228 89770 87150 86062 87588 85767 83629 83886 82643 83464 79062 76602 79209 79094
14302G9094k771j551k118p139Q70L783o305o266Q46j587r48J138l60N088j005
$$ 79094 76323 74772 72654 65515 66385 70168 63863 57597 58443 56856 55908 57046 56686 61774 60769
14287F0769k197j080K396N332l361n055j206Q72n568K937M962L174k706m810q401
$$ 60769 58572 57492 59888 65220 61859 56804 55598 56470 50902 53839 58801 61975 59269 54459 46058
14272D6058K86q94j652J522j293K822K719j974p408K152K761K725L716N043n386
$$ 46058 46344 45450 43798 45320 44027 46849 49568 47594 40186 42338 45099 47824 51540 56583 51197
14257E1197J929J819k743o391l555L066L357j429j2l751m932L760L492k55L408
$$ 51197 53126 54945 52202 45811 42256 45322 48679 47250 47238 43487 38555 42315 45807 45552 48960
14242D8960K784k517l302p67M561Q597K888R74o07n95l47L984L461J962m106m8
$$ 48960 51744 49227 45925 45158 49719 58316 61204 62178 61571 60976 60629 64613 68074 70036 65930 65882
14226F5882P565P092Q97k817n97j625l674o929o792p19M126L458p164p455M31
$$ 65882 73447 80539 81436 78619 78022 76397 72723 65794 59002 58283 62409 65867 58703 51248 51679
14211E1679J888k105n815j424k42l574m722l800O809N509K376m94O39j256M459
$$ 51679 53567 51462 45647 44223 43981 40407 35685 31885 38694 44203 46579 46085 46724 45468 49927
14196D9927J440N706L576M909P91O10K286L135J802J096L48j437l21j977K16K528
$$ 49927 51367 57073 60649 65558 66349 66959 69245 72380 74182 75278 75626 74189 73868 71891 72107 74635
14180G4635L084M4J507M340M551K599P171J2411R300M537N503Q692P819Q796N250
$$ 74635 77719 77763 79270 83610 88161 90760 97931 110342 119642 124179 129682 138374 146193 154989 160239
14165A60239J0382O507J231M475P452J414k53l646j2215q528o562l366K07l329
$$ 160239 170621 177128 178359 182834 190286 191700 191447 187801 175586 167058 160496 157130 157337 154008
14151A54008o967m481n90l667n079l649j42j334J964n130k830n037j510j829n976
$$ 154008 147041 142560 141970 138303 133224 129575 129433 128099 130063 124933 122103 117066 115556 113727 107751
14136A07751K401M5j245k791M010J277L93L652L234R526J0909L863J028L038J883
$$ 107751 110152 110197 108952 106161 110171 111448 111841 115493 118727 128253 139162 143025 144053 147091 148974
14121A48974K512Q90j014J046o12m307p171o343M52k806j192l483r456j1279k036
$$ 148974 151486 152376 151362 152408 151796 147489 140318 133975 134427 131621 130429 126946 117490 106211 104175
14106A04175L957l863o223o595LK429L214O395L630L524M784n061m081K161Q974
$$ 104175 108132 104269 98046 91451 91454 93883 97097 103492 107122 110646 115430 110369 106288 108449 117423
14091A17423K712J544N594L740k375K123P530l908L980Q530N790Q386Q359P862
$$ 117423 120135 121679 127273 131013 128638 130761 138291 134383 138363 146893 152683 161069 169428 177290
14077A77290P233J0665R678Q983J1356J0115N013N561J0895N722M27n010j0803
$$ 177290 184523 195188 204866 213849 225205 235320 240333 245894 256789 262511 262938 257928 247125
14064B47125m579l462p087p177r300p085r3M927P041N227J2136J4592J6914J5663
$$ 247125 242546 239084 231997 224820 215520 208435 208342 213269 220310 225537 237673 252265 269179 284842
14050B84842J7582J3362J5115J0990J5289J5389K0607K6698L1149K8593L0619
$$ 284842 302424 315786 330901 341891 357180 372569 393176 419874 451023 479616 510235
14039E10235L4754L5102K1730J5203R398L452r58j869N48n594p651j1786o115
$$ 510235 544989 580091 601821 617024 626422 629874 628916 627047 627595 622001 614350 602564 596449
14026E96449n571n021Q09K127Q25O470O990L427L333J446j608J368K629K538O706
$$ 596449 590878 585857 586666 588793 589618 596088 603078 606505 609838 611284 609676 611044 613673 616211 622917
14011F22917K700N06L49n62n32P057O417L671N087Q077J2185J6937J8667J5690
$$ 622917 625617 626123 626472 625910 625378 632435 638852 642523 647610 655687 667872 684809 703476 719166
13997G19166J2865J4681J6183J8359K0476J5168J3722K2724J6850R498J3399J0836
$$ 719166 732031 746712 762895 781254 801730 816898 830620 853344 870194 879692 893091 903927
13985I03927R478J1326N734Q677J7786K0965K0705J6364J6011J9532J9443J9730
$$ 903927 913405 924731 930465 939142 956928 977893 998598 1014962 1030973 1050505 1069948 1089678
13973A089678K4995K9550K8701L3263K7470K1993K6141L6155L5734L7234M6384
$$ 1089678 1114673 1144223 1172924 1206187 1233657 1255650 1281791 1317946 1353680 1390914 1437298
13962A437298N1644N6877N9519O5352P5421Q4223R1050R8696J04821J12141J14593
$$ 1437298 1488942 1545819 1605338 1670690 1746111 1830334 1921384 2020080 2124901 2237042 2351635
13951B351635J21672J38089J53316J68375J74256J90165K04557K24884K40203
$$ 2351635 2473307 2611396 2764712 2933087 3107343 3297508 3502065 3726949 3967152
13942C967152K65436K89700L25234L61052M07464M57324N15045N86645O66981
$$ 3967152 4232588 4522288 4847522 5208574 5616038 6073362 6588407 7175052 7842033
13933G842033P47412Q30810R28222J043279J183386J363574J588579J869518K220581
$$ 7842033 8589445 9420255 10348477 11391756 12575142 13938716 15527295 17396813 19617394
13924A9617394K648030L175165L851750M720432N857424P360864R376926J2097298
$$ 19617394 22265424 25440589 29292339 34012771 39870195 47231059 56607985 68705283
13916F8705283J5589893J9606202K3285264K5182651K3995474J9530940J2857797
$$ 68705283 84295176 103901378 127186642 152369293 176364767 195895707 208753504
13909B08753504N510515j467370p915326j3936646j9043243k2230592k2702905
$$ 208753504 214264019 212796649 204881323 190944677 171901434 149670842 126967937
13902A26967937k0581361j6993099j3282049j0172622p837426o174030m995922
$$ 126967937 106386576 89393477 76111428 65938806 58101380 51927350 46931428
13895D6931428m163741l557772l092351k729762k444339k203954j985050j775731
$$ 46931428 42767687 39209915 36117564 33387802 30943463 28739509 26754459 24978728
13887B4978728j572011j386455j239964j113655j005352r16471q38408p69426
$$ 24978728 23406717 22020262 20780298 19666643 18661291 17744820 16906412 16136986
13879A6136986p11833o58912o07056n61962n30843n10963m91903m61098m34226
$$ 16136986 15425153 14766241 14159185 13597223 13066380 12555417 12063514 11602416 11168190
13870A1168190m14019m02453l80651l74495l55103l33308l10808k93570k85821
$$ 11168190 10754171 10351718 9971067 9596572 9241469 8908161 8597353 8303783 8017962
13861H017962k82300k71629k63941k56513k43370k35995k29946k22661k16460
$$ 8017962 7735662 7464033 7200092 6943579 6700209 6464214 6234268 6011607 5795147
13852E795147k07826k01648j92345j77136j69315j61321j50359j45091j37407
$$ 5795147 5587321 5385673 5193328 5016192 4846877 4685556 4535197 4390106 4252699
13843D252699j30818j20975j22124j20524j13645j13694j13062j01183r4562q7136
$$ 4252699 4121881 4000906 3878782 3758258 3644613 3530919 3417857 3316674 3222112 3134976
13833C134976q5109p7309p6192p8196p6411q3815q6734r5066j10513j14534j02365
$$ 3134976 3049867 2972558 2896366 2818170 2741759 2657944 2571210 2476144 2365631 2251097 2148732
13822B148732j00485r8921r5419q7381p8863p2911p3619o8783o6168o4843p3103
$$ 2148732 2048247 1949326 1853907 1766526 1687663 1614752 1541133 1472350 1406182 1341339 1268236
13811A268236o5371n6389n1818n6868n1459m5455m6342m5047m3023l5361l4574
$$ 1268236 1202865 1146476 1094658 1037790 986331 940876 894534 849487 806464 771103 736529
13800G36529k6299k6103k3572j1167j8355j8566j6236j6446j7752j4412n965o936
$$ 736529 710230 684127 660555 649388 631033 612467 596231 579785 562033 547621 541656 534720
13788E34720q437r212j0114n964Q9K599q96n786r569n194n351q275o732m262j0559
$$ 534720 526283 517071 506957 500993 501082 503681 502785 496999 487430 482236 476885 468610 461878 457616 447057
13773D47057r254J328L908j018m40L380O83M682L298O850J0190L000p40n082q185
$$ 447057 437803 439131 443039 442021 441581 444961 445644 450326 453624 460474 470664 473664 472924 467842 459657
13758D59657j4396j4304j2236j6326j3312j2918j1638p202k561j403l015R42M590
$$ 459657 445261 430957 418721 402395 389083 376165 364527 357325 354764 353361 350346 351288 355878
13745C55878M306J49O067O992M513M590L614P402J903k712l461m327o711j282
$$ 355878 360184 360333 366400 373392 377905 382495 386109 393511 395414 392702 389241 384914 378203 376921
13731C76921j718l208K771J088k906o141l571l193n704k179J441M633N844l577
$$ 376921 375203 371995 374766 375854 372948 366807 363236 360043 354339 352160 353601 358234 364078 360501
13717C60501j317J49m208n104q49p727p834q483r995q437p387p150n406m528n339
$$ 360501 359184 359333 355125 350021 349172 341445 333611 325128 315133 306696 299309 292159 286753 282225 276886
13702B76886n572P36k327j850l11Q5L433l443l840j694l16P268P453K108L014
$$ 276886 271314 272050 269723 267873 267562 267647 271080 267637 263797 262103 261787 269055 276508 278616 281630
13687B81630J0605J6968K0329K2389K5810K6974L1347K2594J7922J495j2386j7829
$$ 281630 292235 309203 329532 351921 377731 404705 436052 458646 476568 478063 465677 447848
13675D47848k9142l4714l5058l9746l5488k7138k7458j8078m948K872L209l146
$$ 447848 418706 383992 348934 309188 273700 246562 219104 201026 196078 198950 202159 199013
13663A99013j333n438o90K87J93m359m669m831q202m447j448j950m725o453k432
$$ 199013 197680 192242 191552 191839 192032 187673 183004 178173 169971 165524 164076 162126 157401 150948 148516
13648A48516o591l089n530P68k468l327l684K184M606n70N52o552r708p420q788
$$ 148516 141925 138836 133306 134074 131606 128279 124595 126779 131385 130815 131367 124815 115107 107687 98899
13633I8899P00k565l720j528M767N212k103n184J968O670L364k042K770L538j649
$$ 98899 99599 97034 93314 91786 96553 101765 99662 94478 96446 103116 106480 104438 107208 110746 109097
13618A09097j82K590K341r1j175J490L262j982l247n522n977q594l438m656j697
$$ 109097 108915 111505 113846 113755 112580 114070 117332 115350 112103 106581 100604 92010 88572 83916 82219
13603H2219K183j406m529m598j061j315k629k473m633k130K213J612j294o588
$$ 82219 84402 82996 78467 73869 72808 71493 68864 66391 61758 59628 61841 63453 62159 55571
13589E5571J050Q052K62k80K401M428J656K013L841L922K700m742K557q91O28
$$ 55571 56621 64673 64935 64655 67056 71484 73140 75153 78994 82916 85616 80874 83431 82540 83168
13574H3168n12K813k242k981o52o028J266K899k618k503j307J297L242K043L7
$$ 83168 82656 85469 83227 80246 79594 73566 74832 77731 75113 72610 71303 72600 75842 77885 77922
13559G7922K074P96R45m4k957o26K941k228k568k688J532l3K301K858N32n417
$$ 77922 79996 80792 81737 81693 78736 78110 81051 78823 76255 73567 75099 75066 77367 80225 80757 75340
13543G5340m702O3M983l16n748K266J174j717l450J60K994M669k087q175q232
$$ 75340 70638 70701 75684 75368 69620 71886 73060 71343 67893 68053 71047 75716 73629 65454 57222
13528E7222O933N654m945p751N785P384O969p093J015M025j942N36O38q973n378
$$ 57222 64155 69809 64864 57113 62898 70282 77251 70158 71173 75198 73256 73792 74430 65457 60079
13513F0079L217L815l296m273j433J691k71l4M295N187K749K300j521K157r81
$$ 60079 63296 67111 63815 59542 58109 59800 59529 59495 63790 68977 71726 74026 72505 74662 73681
13498G3681j269l20K093J007n1K203l152k931k279n807j847j031o37J701O680
$$ 73681 72412 72092 74185 75192 75141 77344 74192 71261 68982 63175 61328 60297 59660 61361 68041
13483F8041O115L70o717p79J752M235P030N147L196l30Q208K08N823O488L141
$$ 68041 74156 74526 67809 67030 68782 73017 80047 85194 88390 88060 96268 96476 102299 108787 111928
13468A11928P617O146O524J3861J7542J5366J4325K4678K7213L1522L7370M7077
$$ 111928 119545 125691 132215 146076 163618 178984 193309 217987 245200 276722 314092 361169
13456C61169N6433P2204R3347J10259J28484J33411J09253P8529L5888J827l3395
$$ 361169 417602 489806 583153 693412 821896 955307 1064560 1143089 1178977 1180804 1147409
13445A147409o7519j02223j16793j13874j05456r0165o8976n8238m2036l6075
$$ 1147409 1079890 977667 860874 747000 641544 551379 482403 424165 382129 346054
13435C46054l9406k7535j7519j0047j4862j4504j2417q739p361j0290p372l961
$$ 346054 306648 279113 261594 251547 236685 222181 209764 201025 193664 183374 176002 172041
13423A72041j605j1328r853l654p160o901n062j613j456n542n251o697m214p7
$$ 172041 170436 159108 149255 145601 138441 131540 126478 124865 123409 117867 112616 105919 101705 101628
13409A01628k978m63j384o732k978K22K194J326M165k264n487K503K637J774l423
$$ 101628 98650 98187 96803 90071 87093 87315 89509 90835 95000 92736 87249 89752 92389 94163 90740
13394I0740k618m831o139k78J311m956p18K972Q03l272n936k950k169m631j386
$$ 90740 88122 83291 77152 76874 78185 73229 72511 75483 76286 73014 67078 64128 61959 57328 55942
13379E5942L786N422l035j873k076p68k472j044L029L414L76M765l470l351l48
$$ 55942 59728 65150 62115 60242 58166 57398 54926 53882 56911 60325 60701 65466 61996 58645 58297
13364E8297M712L673j476L341K398K243N47l354k359j632P99j682o93K669o823
$$ 58297 63009 66682 65206 68547 70945 73188 73735 70381 68022 66390 67189 65507 64814 67483 60660
13349F0660J832J804l851N0J888q12p90L96K042o22k341j015Q08J180J874J511
$$ 60660 62492 64296 60445 60495 62383 61571 60781 61177 63219 62597 60256 59241 60049 61229 63103 64614
13333F4614j591k918J369k342k420p7n26m20j528j953l209l818K379N477K077
$$ 64614 63023 60105 61474 59132 56712 56635 56109 55689 54161 52208 48999 45181 47560 53037 55114
13318E5114K294L123m78O8k754k451M113N454J578k359L739M283n382M871O97
$$ 55114 57408 60531 60053 60121 57367 54916 59029 64483 66061 63702 67441 71724 66342 71213 71910
13303G1910o084m948l388K155M795o38l537K16M324k530k85l271j183M915N068
$$ 71910 65826 60878 57490 59645 64440 63802 60265 60481 64805 62275 61990 58719 57536 62451 67519
13288F7519j04J193J964m007m751l045l179O65N827K322N86k417Q38J903L495
$$ 67519 67415 68608 70572 66565 61814 58769 55590 56255 62082 64404 64990 62573 63411 65314 68809
13273F8809J914L079K063j717J754k699n197M71j425l444L877k730n60K360M154
$$ 68809 70723 73802 75865 74148 75902 73203 68006 68477 67052 63608 67485 64755 64195 66555 70709
13258G0709j146n768L690J517K653J58K395l687o102n300N94O928K039j970j008
$$ 70709 69563 63795 67485 69002 71655 71813 74208 70521 64419 59119 59713 66641 68680 66710 65702
13243F5702k127j489j990J934J037K037l824m312j99l282J914K818P89O548k022
$$ 65702 63575 62086 60096 62030 63067 65104 61280 56968 56769 53487 55401 58219 59008 65556 63534
13228F3534j981k230R29L376L045M031j215J366j027o514k17L678M543M3J370
$$ 63534 61553 59323 60252 63628 66673 70704 69489 70855 69828 63314 63097 66775 71318 71361 72731
13213G2731n320M713J0043O46o851k902L606n974k220K330k130N810j33K75j095
$$ 72731 67411 72124 82167 82813 75962 73060 76666 70692 68472 70802 68672 74482 74349 74624 73529
13198G3529P21K746N172o99o618j757K744j061k385j516J350O077J059J32K211
$$ 73529 74250 76996 82168 81469 74851 73094 75838 74777 72392 70876 72226 78303 79362 79494 81705
13183H1705k499k80K214M370j432j208M301L19m577L226n307j578M063M72l446
$$ 81705 79206 78926 81140 85510 84078 82870 87171 87490 82913 86139 80832 79254 83317 83789 80343
13168H0343K741l56L257P30K829M533L559k58L11m39j295n129K81R7j912k971
$$ 80343 83084 82728 85985 86715 89544 94077 97636 97378 97689 97250 95955 90826 91107 91204 89292 86321
13152H6321k500m590N804L49k130J364M845O150K410l228p74k458q999K70K712
$$ 86321 83821 79231 85035 85384 83254 84618 89463 95613 98023 94795 94021 91563 82564 82834 85546
13137H5546O44R80M682O189q44m662l707M324J252J914l067j1L185K834j413k089
$$ 85546 86190 87170 91852 98041 97197 92535 88828 93152 94404 96318 93251 93240 96425 99259 97846 95757
13121I5757K763M285M472j144k277K93n643o239n348N346J1118L921P72p678k53
$$ 95757 98520 102805 107277 106133 103856 104149 98506 92267 86919 92265 103383 107304 108076 100398 100145
13106A00145J107l283j775p78N520L0o93O20P380O461J868L451m181n269L400
$$ 100145 101252 97969 96194 95416 100936 100966 100273 100893 108273 114734 116602 120053 115872 110603 114003
13091A14003J918K536L175L30L056M137Q09M059L784k650p792m998N065J255k977
$$ 114003 115921 118457 121632 121962 125018 129155 129964 134023 137807 135157 127365 122367 127432 128687 125710
13076A25710k271L726N273l864P93n63J66M590K694J715q51k808l421q74k93M904
$$ 125710 123439 127165 132438 128574 129367 128804 128970 133560 136254 137969 137118 134310 130889 130015 129722 134626
13060A34626R5k4J88L706J532N247J951J663L672J642J508M486j34k564L04O523
$$ 134626 134721 134697 134885 138591 140123 145370 147321 148984 152656 154298 155806 160292 160158 157594 157898 164421
13044A64421M979L228K388o75o90q97j781K169L119N640O114J98J480l818j539
$$ 164421 169400 172628 175016 174341 173651 172754 170973 173142 176261 181901 188015 188213 189693 185875 184336
13029A84336N934N505k22L579K613k689j833K443L678K076L122j766q17R7K871
$$ 184336 190270 195775 195553 199132 201745 199056 197223 199666 203344 205420 208542 206776 205959 206056 208927
13014B08927N38L316k23l630k556K496K274J245j586p9K062N190M536L911R57
$$ 208927 209465 212781 212558 208928 206372 208868 211142 212387 210801 210722 212784 217974 222510 226421 227378
12999B27378k053j621K816k055q80K029O325K969o90K391ML321M310q92m37M589
$$ 227378 225325 223704 226520 224465 223585 225614 231939 234908 234218 236609 236613 239934 244244 243352 242915 247504
12983B47504M738J662J341m236J88N704K105P304J468k755l41L460P036O599M116
$$ 247504 252242 253904 255245 251009 251197 256901 259006 266310 267778 265023 264682 268142 275178 281777 285893
12968B85893J488m771j183M246l904O55O074O446N314L745K465K148L764M81P856
$$ 285893 287381 282610 281427 285673 281769 282424 288498 294944 300258 304003 306468 308616 312380 312861 320717
12953C20717J0475P078J675N56K348R04K315L553M163O974M592O398Q315N932
$$ 320717 331192 338270 339945 340501 342849 343753 346068 349621 353784 360758 365350 371748 380063 385995
12939C85995K30K593O771R185K284N890O974P386O736N979P531L345r74R15J0650
$$ 385995 386225 388818 395589 404774 407058 412948 419922 427308 434044 440023 447554 450899 449925 450840 461490
12924D61490J0398Q169O077N189R424J0079J2733Q254M703P739J0577J4553J1718
$$ 461490 471888 480057 486134 491323 500747 510826 523559 531813 536516 544255 554832 569385 581103
12911E81103R242J2166J3410Q768J0118O672J1770J4175J1559J5537J2413Q844
$$ 581103 590345 602511 615921 624689 634807 641479 653249 667424 678983 694520 706933 715777
12899G15777J0717P932J0181J2567R885J4021Q604J1680N733O888J3928J6846
$$ 715777 726494 734426 744607 757174 767059 781080 789684 801364 807097 813985 827913 844759
12887H44759J4376J0066Q743R624J0967J5083J5368J4489J6009J6141J6610J5345
$$ 844759 859135 869201 877944 887568 898535 913618 928986 943475 959484 975625 992235 1007580
12875A007580J2751K1539J7775J6732J9921J8243K1185J6299J6736K9101K5525
$$ 1007580 1020331 1041870 1059645 1076377 1096298 1114541 1135726 1152025 1168761 1197862 1223387
12864A223387K2640K4547K4434K6185K8992K9845K9904L2747K9984L1086L1529
$$ 1223387 1246027 1270574 1295008 1321193 1350185 1380030 1409934 1442681 1472665 1503751 1535280
12853A535280L1839M1061L8662L7861L8259L5755L5788M7301M5283N0321M8362
$$ 1535280 1567119 1608180 1646842 1684703 1722962 1758717 1794505 1841806 1887089 1937410 1985772
12842A985772N2945N9900N7855O3129O7082O7064P1912P0420P5268Q2887Q9236
$$ 1985772 2038717 2098617 2156472 2219601 2286683 2353747 2425659 2496079 2571347 2654234 2743470
12831B743470R1802R1662R7601J05720J13307J16748J19659J26759J43657J52488
$$ 2743470 2835272 2926934 3024535 3130255 3243562 3360310 3479969 3606728 3750385 3902873
12821C902873J55134J61648J67772J87506K02081K13708K26512K39350K59146
$$ 3902873 4058007 4219655 4387427 4574933 4777014 4990722 5217234 5456584 5715730
12812E715730K70861K96189L14287L36886L68643L93014M22514M44056M82350
$$ 5715730 5986591 6282780 6597067 6933953 7302596 7695610 8118124 8562180 9044530
12803I044530N19978N62626O16554O52631P07428P71386Q31374R04020R75102
$$ 9044530 9564508 10127134 10743688 11396319 12103747 12875133 13706507 14610527 15585629
12794A5585629J054567J139477J229210J326244J421302J518981J612427J687606
$$ 15585629 16640196 17779673 19008883 20335127 21756429 23275410 24887837 26575443
12786B6575443J763407J820633J848090J837932J792979J696492J553968J361374
$$ 26575443 28338850 30159483 32007573 33845505 35638484 37334976 38888944 40250318
12778D0250318J114317Q28003N18642J89283j45362m70106p65399j025927j242961
$$ 40250318 41364635 42192638 42711280 42900563 42755201 42285095 41519696 40493769 39250808
12769C9250808j418918j534111j600194j638020j648209j615034j561745j501440
$$ 39250808 37831890 36297779 34697585 33059565 31411356 29796322 28234577 26733137
12761B6733137j429001j351145j277200j193666j117408j050551r86279r14258
$$ 26733137 25304136 23952991 22675791 21482125 20364717 19314166 18327887 17413629
12753A7413629q58120p97331p46873o94764o45755o05087n73083n36721n05138
$$ 17413629 16555509 15758178 15011305 14316541 13670786 13065699 12492616 11955895 11450757
12744A1450757m77344m43995m19026l98769l75408l56030l36825l17601l01256
$$ 11450757 10973413 10529418 10110392 9711623 9336215 8980185 8643360 8325759 8024503
12735H024503k85537k77237k65257k49193k39640k27349k19980k08152j97696
$$ 8024503 7738966 7461729 7196472 6947279 6707639 6480290 6260310 6052158 5854462
12726E854462j89366j79482j73408j67884j63653j58442j50401j42610j37286
$$ 5854462 5665096 5485614 5312206 5144322 4980669 4822227 4671826 4529216 4391930
12717D391930j33590j31341j21651j14096j11761j11471j04907j08219j03760
$$ 4391930 4258340 4126999 4005348 3891252 3779491 3668020 3563113 3454894 3351134
12708C351134r5654r0775q9436q8194q2175q1435p6415p3345p1896p1892p2005
$$ 3351134 3255480 3164705 3075269 2987075 2904900 2823465 2747050 2673705 2601809 2529917 2457912
12697B457912o6915n8282o1389o2136o2164o7224o1531n9851n6322n4814n5870
$$ 2457912 2390997 2332715 2271326 2209190 2147026 2079802 2018271 1958420 1902098 1847284 1791414
12686A791414n5311m5299l8766m5151m8585m7182m2969l8360m4761l7936l4792
$$ 1791414 1736103 1690804 1652038 1606887 1558302 1511120 1468151 1429791 1385030 1347094 1312302
12675A312302l7020m0907l6082l0955k7564k9634l0502k6984k8059j8164k1598
$$ 1312302 1275282 1234375 1198293 1167338 1139774 1110140 1079638 1052654 1024595 1006431 984833
12664I84833k2344k4552j8934k0696j6025k3625k3397j4972j4149j6116j2106
$$ 984833 962489 937937 919003 898307 882282 858657 835260 820288 806139 790023 777917
12653G77917j6393j3607j5685j2774o948j3829j2373j1162r786j3506j6882j2551
$$ 777917 761524 747917 732232 719458 712510 698681 686308 675146 665360 651854 634972 622421
12641F22421q320q549r474n256n208m563p297r731j2137p648j0379m579j671p662
$$ 622421 614101 605552 596078 590822 585614 581051 573754 564023 551886 544238 533859 529280 527609 519947
12627E19947o508l266m001l031j843p281p319n727n874k590p167n060k886o303
$$ 519947 513439 510173 506172 503141 501298 494017 486698 480971 475097 472507 465340 460280 457394 451091
12613D51091j0684o469o3l716m746m390j955m148o708r079m177L259l235P40q93
$$ 451091 440407 433938 433875 430159 425413 421023 419068 414920 408212 399133 394956 398215 394980 395720 394827
12598C94827n396k797m270j313o245n561p460k411q95R67p102m511o196l041n03
$$ 394827 389431 386634 382364 381051 374806 369245 361785 359374 358479 359446 352344 347833 341637 338596 338093
12583C38093j955m445o388j787k88n073k478r88n372n394j146o027m836j837l504
$$ 338093 336138 331693 325305 323518 323230 318157 315679 314691 309319 303925 302779 296752 291916 290079 286575
12568B86575o328m419r44J106j927j061m794J234K570j577n876p482r458n840
$$ 286575 280247 275828 274884 275990 274063 273002 268208 269442 272012 270435 264559 257077 247619 241779
12554B41779o771n135k042l586m844l72m700p16l228o06K272K821P31K898Q55
$$ 241779 235008 229873 227831 224245 219401 219029 214329 213613 210385 209779 212051 214872 215603 218501 219356
12539B19356j336n632L025r554p219k639L89j498q912n261o76k293k749O83j251
$$ 219356 218020 212388 215413 205859 198640 196001 196390 194892 185980 180719 180043 177750 175001 175684 174433
12524A74433m235J294L445M621J319l512o411p399j084j550l547q622l310r16
$$ 174433 170198 171492 174937 179558 180877 177365 170954 163555 162471 160921 157374 148752 145442 144526
12510A44526J296j493M194K554J43n636p880o039m143l462q31O459N448k952J530
$$ 144526 145822 144329 148523 151077 151220 145584 137704 131665 127522 124060 123229 129688 135136 132184 133714
12495A33714N10n891k467k577l41L124J495r33l505M58n431Q59k39r69n316k104
$$ 133714 134224 128333 125866 123289 122948 126072 127567 126634 123129 123587 118156 119015 118776 117807 112491 110387
12479A10387K261Q91K550N508J309l475p567m56J878m693j809K143r70j420l912
$$ 110387 112648 113539 116089 121597 122906 119431 111864 111408 113286 108593 106784 108927 107957 106537 102625
12464A02625l564k925p66P91K779L566j98k511m844j023K484P57K598M811k71
$$ 102625 99061 96136 95370 96161 98940 102506 102308 99797 94953 93930 96414 97171 99769 104580 104309
12449A04309n135n331j281N87q06L638J044N558l64l294m346M14P81j16j232p4
$$ 104309 99174 93843 92562 93149 92343 95981 97025 102583 102219 98925 94579 94993 95774 95658 94426 94352
12433I4352j006n695k813K189j774k554N872N552l358k806J906R07j382n535o490
$$ 94352 93346 87651 84838 87027 85253 82699 88571 94123 90765 87959 89865 90772 89390 83855 77365
12418G7365n61L388J202J132J189j838l660J280J047K18j556o198j336k004J247
$$ 77365 76804 80192 81394 82526 83715 81877 78217 79497 80544 80762 79206 73008 71672 69668 70915
12403G0915K25n76n58P18L323J645o17p539m304J261K717N163L182j241l942J99
$$ 70915 71140 70564 70006 70724 74047 75692 75075 67536 63232 64493 67210 72373 75555 74314 70372 70571
12387G0571J115O01k168o383l456o91J256L923J844j298k126J315j417j65J965
$$ 70571 71686 72287 70119 63736 60280 59589 60845 64768 66612 65314 63188 64503 63086 62921 64886
12372F4886J121j617r50J552m6l208p12Q43j176L605K679o76o269k527R54j186
$$ 64886 66007 64390 63440 64992 64946 61738 61026 61869 60693 64298 66977 66301 60032 57505 58459 57273
12356E7273q65J836k822l271k022M63o76M489P354M846k385m78r54o150o47J910
$$ 57273 56408 58244 55422 52151 50129 50592 49916 54405 61759 66605 64220 63742 62788 56638 55991 57901
12340E7901j319J272j230k098Q7J733J939k921n078M069N062r94J643j61k9J862
$$ 57901 56582 57854 56624 54526 54613 56346 58285 55364 50286 54355 59417 58423 60066 59905 59876 61738
12324F1738k723n226R57O501J066j731k000k133L293J841l062m741k610n053J220
$$ 61738 59015 53789 54746 61247 62313 60582 58582 56449 59742 61583 58521 53780 51170 46117 47337
12309D7337M589K736l975P94l600o27L290k759k919o70J133L416N422q67k811
$$ 47337 51926 54662 50687 51481 47881 47254 50544 47785 44866 44196 45329 48745 54167 53300 50489
12294E0489K831k385m228l941Q04L902L547J07k009J561N800L440q34J298j542
$$ 50489 53320 50935 46707 42766 43570 47472 51019 51126 49117 50678 56478 59918 59084 60382 58840
12279E8840q23K384k301l44J045l129L336p85j824k426l256QJ162k308J196O245
$$ 58840 58017 60401 58100 57756 58801 55672 59008 58223 56399 53973 50717 50725 51887 49579 50775 57020
12263E7020J865J015M210M168N04K042J827k290J015P564L780o772k362k151k334
$$ 57020 58885 59900 64110 68278 68782 70824 72651 70361 71376 78940 82720 75948 73586 71435 69101
12248F9101J232n6R34K696J463L810J806L52M611K049J0996M013n849j401m054
$$ 69101 70333 70277 71211 73907 75370 79180 80986 81338 85949 87998 98994 103007 97158 95757 91703
12233I1703k126r3m50n871o033j565j294M854N551K505k693J87j9J565j994j759
$$ 91703 89577 89484 89034 83163 77130 75565 74271 79125 84676 87181 84488 84675 84656 86221 84227 82468
12217H2468m325q736k336m613n967m019P51j06j893L311K494o25l275m537J981
$$ 82468 78143 69407 67071 62458 56491 52472 53223 53117 51224 54535 57029 56404 53129 48592 50573
12202E0573K452m589l457N871j600l826L047L420J34o057k03l412n916o083K183
$$ 50573 53025 48436 44979 50850 49250 45424 48471 51891 52025 45968 45765 42353 36437 30354 32537
12187C2537N552L262K610J31n90K72k8n54P14J239j78k659j227q66N497J119j602
$$ 32537 38089 41351 43961 44092 43502 43774 43746 43192 43906 45145 44967 42308 41081 40215 45712 46831 45229
12170D5229j376l602M221O611m2o109Q92L792j414k520k179j762m756j146L04
$$ 45229 43853 40251 44472 51083 51041 44932 45824 49616 48202 45682 43503 41741 36985 35839 36143
12155C6143L608J163L404K734j062p81l361k6r06r88P62n26n014o321L657J282
$$ 36143 39751 40914 44318 47052 45990 45209 41848 41822 40916 39928 40690 40164 35150 28829 32486 33768
12139C3768J871O54j389L321K945M619j30Q43J388l709R7N40K683p04k411K383
$$ 33768 35639 36293 34904 38225 41170 45789 45659 46502 47890 44181 44278 44818 47501 46797 44386 46769
12123D6769l835M289P301K192L664K371N209O545J1413J0410J2317J6716K3489
$$ 46769 42934 47223 54524 56716 60380 62751 67960 74505 85918 96328 108645 125361 148850
12110A48850J8241J7875J1117J0709R298j188q357j4425j3860j9355j7259j6242
$$ 148850 167091 184966 196083 206792 216090 214902 206545 192120 178260 158905 141646 125404
12098A25404j4792j3467q033p769r396k802k220m344l615K685k186k419m731j049
$$ 125404 110612 97145 89112 81343 71947 69145 66925 62581 58966 61651 59465 57046 52315 51266
12084E1266M94n051l992o188k369P706J402J923L752J314m009n817K174j412K57
$$ 51266 51760 46709 42717 36529 34160 41866 43268 45191 48943 50257 46248 40431 42605 41193 41450
12069D1450N99n39J701j559k706J149k101k67J297J575J05K693n508l719M90l89
$$ 41450 42049 41510 43211 41652 38946 40095 37994 37727 39024 40599 40704 43397 37889 34170 34660 34271
12053C4271J284j267k737j788J286M412L58j632o549M034Q975j87K561j997n021
$$ 34271 35555 34288 31551 29763 31049 35461 35819 34187 27638 31672 40647 40460 43021 41024 36003
12038C6003J712k137J141r25k92J543j35l29n005K527K132J094p12j284k074j635
$$ 36003 37715 35578 36719 35794 35502 37045 36910 36581 31576 34103 36235 37329 36617 35333 33259 31624
12022C1624L756L624P5j721L863q52L677J089n269k498j715M788R51K066k266
$$ 31624 35380 39004 39079 37358 41221 40369 44046 45135 39866 37368 35653 40441 41392 43458 41192
12007D1192q30P2j421K785j075j903k415n424r54O806N757J530L463J457m32j252
$$ 41192 40362 40434 39013 41798 40723 38820 36405 30981 30027 36833 42590 44120 47583 49040 48608 47356
11991D7356L91K039n651k741n01K601M083k716p950r04L076J581L27M947M279
$$ 47356 47747 49786 44135 41394 40893 43494 47577 44861 36911 36007 39083 40664 40991 45938 50217
11976E0217j471k451n386R57Q136m65o635R48R908R171L811N592Q877J2397J6927
$$ 50217 48746 46295 40909 41866 50002 49537 42902 43850 53758 62929 66740 72332 81209 93606 110533
11961A10533J5629K276J558L43k079k179q541j2225k413o079n655l528K020M95
$$ 110533 126162 128438 129996 130339 128260 126081 117540 105315 102902 96823 91168 87640 89660 90155
11947I0155r49n547j709N093J724o017k252q386p196o024q668K168N986J08n096
$$ 90155 89206 83659 81950 87043 88767 82750 80498 72112 64916 58892 50224 52392 58378 58486 53390
11932E3390m554k003JJ507k081m788q270r12L775L658m87j748l98J737n655j554
$$ 53390 48836 46833 46834 48341 46260 41472 33202 32290 36065 39723 39236 37488 37090 38827 33172 31618
11916C1618K227K115j904J199N739k918r241n165J959k1L346R369K099l139O56
$$ 31618 33845 35960 34056 35255 40994 38076 28835 23670 25629 25608 28954 38323 40422 37283 37939
11901C7939K116k955j377J377o35j312l737L062K217p22j233k975J9J461k296
$$ 37939 40055 37100 35723 37100 36465 35153 31416 34478 36695 35973 34740 31765 31784 33245 30949
11886C0949n98m513k249K39Q39K126M388O029n74P00m674m456k242N505M303K118
$$ 30949 30351 25838 23589 23828 24667 26793 31181 37210 36636 37336 32662 28206 25964 31469 35772 37890
11870C7890l604J318P190O58j843j672p458n291r27K371P119m493n81P48M100
$$ 37890 34286 35604 42794 43452 41609 39937 32479 27188 26261 28632 35751 31258 30677 31425 35525
11855C5525Q70n06K813J273k989K077K633k359l983p89J805m334J423k335J083
$$ 35525 36395 35889 38702 39975 36986 39063 41696 39337 35354 34565 36370 32036 33459 31124 32207
11840C2207R05j105r57m357l934l09O34j341M714L946K086J317n422m318R44k439
$$ 32207 33112 32007 31050 26693 22759 22450 23084 21743 26457 30403 32489 33806 28384 24066 25010 22571
11824B2571l341j602J395M698N925J142j121L311N076j305l695k661N10R22n351
$$ 22571 19230 17628 19023 23721 29646 30788 29667 32978 38054 36749 33054 30393 30903 31825 26474
11809B6474K683J050k660O444o018m688J868M962M610N91k374k232L73k210J239
$$ 26474 29157 30207 27547 33991 27973 23285 25153 30115 34725 35316 32942 30710 31083 28873 30112
11794C0112O83l212j60l060K02M646M750j449K890j842q04M781pm691j3o25L663
$$ 30112 30795 27583 27423 24363 24565 29211 33961 32512 35402 33560 32756 37537 37530 32839 32826 32201 35864
11777C5864r62OJ524m092j464L043K997j59N1L369p78q340k640J058L830L364
$$ 35864 34902 34908 36432 32340 30876 33919 36916 36757 36808 40177 39399 31059 28419 29477 33307 36671
11761C6671P64L92L243r87J87K860n198m160p53J527j873m522j186L839M961N834
$$ 36671 37435 37827 41070 40083 40270 43130 37932 33772 33019 34546 32673 28151 26965 30804 35765 41599
11745D1599l56l330J401M756J040J70k904l50L29L671J149m76k222p393l875R54
$$ 41599 41243 37913 39314 44070 45110 45280 42376 42026 42355 46026 47175 46699 44477 37084 33209 34163
11729C4163J548j72Q56J5M13J652P439m051k970J887M33j763J012K171K645k460
$$ 34163 35711 35539 36395 36410 36823 38475 45914 41863 38893 40780 41213 39450 40462 42633 45278 42818
11713D2818O437l383n722j401J49J899K584m848l355n17L887R68O038N916K787
$$ 42818 49255 45872 40150 38749 38898 40797 43381 38533 35178 34661 38548 39516 45554 51470 54257
11698E4257K864K501Q27j274L118M678L70L634K792k840K894L008M591l235p291
$$ 54257 57121 59622 60449 59175 62293 66971 67341 70975 73767 70927 73821 76829 81420 78185 70894
11683G0894n385m693j976j800l109l021k733k656J384Q564K87K029j393m033k140
$$ 70894 65509 60816 58840 57040 53931 50910 48177 45521 46905 55469 55756 57785 56392 52359 50219
11668E0219J448l06L94L461L472L929P08K860l386j341L504O072K98L391R012
$$ 50219 51667 51361 51755 55216 58688 62617 63325 66185 62799 61458 64962 71034 71332 74723 83735
11653H3735P014J0103J2489J1071J026m044k426r629j3559p656o474r358o794
$$ 83735 90749 100852 113341 124412 125438 121394 118968 109339 95780 88124 81650 72292 65498
11640F5498M41r14J643J706l429k65n95j0424j668J29J022m095j257l96k67L811
$$ 65498 65939 65025 66668 68374 64945 64680 64085 53661 51993 52122 53144 49049 47792 47396 47129 50940
11624E0940M329Q06M77j764j734N844P116k630J273N771N995J0338N235J791R04
$$ 50940 55269 56075 56552 54788 53054 58898 66014 63384 64657 70428 76423 86761 91996 93787 94691
11609I4691n292k951n122k674n283l987m996q26J814m81J458k867k606m528N1
$$ 94691 89399 86448 81326 78652 73369 69382 64386 63560 65374 64893 66351 63484 60878 56350 56401
11594E6401j437K824k178N61p33J374l521p002M49M993J789k53n049O36L120K834
$$ 56401 54964 57788 55610 56171 55438 56812 53291 46289 46738 51731 53520 53267 48218 48854 51974 54808
11578E4808j856J471O339k478o081j111j557n555J742J389k007L012r59J785J792
$$ 54808 52952 54423 60762 58284 52203 51092 49535 43980 45722 47111 45104 48116 47157 48942 50734
11563E0734j550l799r2j961L82J028N212N523L427j829n45R38M067Q287P841N767
$$ 50734 49184 45385 45293 43332 43714 44742 49954 55477 58904 57075 56530 57468 61535 69822 77663 83430
11547H3430j851j58K42l131K215j612m050j499l260m740l614o573j81K449L127
$$ 83430 81579 81421 81663 78532 80747 79135 75085 73586 70326 65586 61972 55399 55218 57667 60794
11532F0794k060J571M622j841J092k717J225r6J993O215L206n0k323K045L195
$$ 60794 58734 60305 64927 63086 64178 61461 62686 62590 64583 70798 74004 73954 71631 73676 76871
11517G6871J779J38r5M624Q493K686p91R27L514k348j532k461q570p493p11j502
$$ 76871 78650 78788 78693 83317 91810 94496 93705 94632 98146 95798 94266 91805 83235 75742 75031 73529
11501G3529L401J72n624j844l610p918m650n616Q12K280k071K643L902R62K510
$$ 73529 76930 77102 71478 69634 66024 58106 53456 47840 48652 50932 48861 51504 55406 56368 58878
11486E8878J49L143L55L118M602N899r31k087J500P723j0j405K338N231K007J792
$$ 58878 59027 62170 62525 65643 70245 76144 75213 73126 74626 82349 82339 80934 83272 88503 90510 92302
11470I2302o291j711m17O24p356q407o029m373n764P3J728J051k757m508R71K987
$$ 92302 86011 84300 83883 84507 77151 68744 62715 58342 52578 52651 54379 55430 52673 48165 49136 52123
11454E2123J05Jn546n236J63j020n043K194N337j2l376l487k04j316q44k075l19
$$ 52123 52228 52229 46683 41447 41610 40590 35547 37741 43078 43066 39690 36203 35999 34683 33839 31764 31445
11437C1445J732K089k2m145M455K330l45K060K258j594L27L288k737p70j18j619
$$ 31445 33177 35266 35244 31099 35554 37884 37539 39599 41857 40263 40590 43878 41141 40371 40253 38634
11421C8634j657j759K832M56K978J811q5M373Q31K408R05o962m710l179P57k038
$$ 38634 36977 35218 38050 38506 41484 43295 43210 47583 48414 50822 51727 44765 40055 36876 37633 35595
11405C5595L400Q791K005n075m672m85L698m232L68r49j684K170J7n50L189p28
$$ 35595 38995 47786 49791 44716 40044 39559 43257 39025 39393 38444 36760 38930 38947 38397 41586 40858
11389D0858n226L512P146o86k034m13J241j464J732J263m791J385j26j805m77
$$ 40858 35632 39144 46290 45604 43570 43157 44398 42934 44666 45929 41138 42523 42397 40592 40115
11374D0115L620q04Q58k065l648N242L986k562m443j251j750O496J083j574j768
$$ 40115 43735 42931 43789 41724 38076 43318 47304 44742 40299 39048 37298 43794 44877 43303 41535
11359D1535J442J700k61l703k355k42k39O635Q90K852M681m0J007n20j113k026
$$ 41535 42977 44677 44416 40713 38358 38116 37877 44512 45402 48254 52935 52895 53902 53382 52269 50243
11343E0243K34N38k787k16j474j43L82J086r67k092m81J140o338K844N521L375
$$ 50243 50477 51015 48228 48012 46538 46395 46777 47863 46896 44804 44323 45463 39125 41969 47490 50865
11327E0865K510m613l887r85l774k415K501N164N11r90J753k129K483M452k42
$$ 50865 53375 48762 44875 43890 40116 37701 40202 45366 45877 44887 46640 44511 46994 51446 51204
11312E1204p119m9N801k64K585j110j172m106q49N247J21k26N63J234l280R25
$$ 51204 44085 44036 49837 49573 52158 51048 49876 45770 44921 50168 50289 50063 50626 51860 48580 49505
11296D9505J237l358j789o04K939J067K975N882k200N37l569o74J86j505j758
$$ 49505 50742 47384 45595 44991 47930 48997 51972 57854 55654 56191 52622 51948 52134 50629 48871
11281D8871l177K501Q76n925j6O120j237n05J958K344k000k983J445M440J827
$$ 48871 45694 48195 49071 43146 43130 49250 48013 47508 49466 51810 49810 46827 48272 52712 54539
11266E4539l291L21K347J515M61j121q876k23J948L58L25O430O846j79J347O26
$$ 54539 51248 51569 53916 55431 55892 54771 45895 45672 47620 47978 48303 54733 61579 61400 62747 63373
11250F3373N52L066L335l130k246j496M532L517p68K961J143K905J06J557O030
$$ 63373 63925 66991 70326 67196 64950 63454 67986 71503 70735 73696 74839 77744 77850 79407 85437
11235H5437M010O354M796Q090O78k239J404M06n623l827l503l526l568N037P724
$$ 85437 89447 95801 100597 108687 109365 107126 108530 108936 103313 99486 95983 92457 88889 93926 101650
11220A01650N201M681N10K672J657O22O223K029k092p81n396R5k696j244o852
$$ 101650 106851 111532 112042 114714 116371 116993 123216 125245 123153 122372 116976 117071 114375 113131 106279
11205A06279q581R03R33j09O108M148n88J294L438p71k797n098l495m149j155
$$ 106279 97698 98601 99534 99425 105533 109681 109093 110387 113825 113054 110257 105159 101664 97515 96360
11190I6360n922l819k983k03l372Q19Q94n29J399j447N53m908p235l82n60k373
$$ 96360 90438 86619 83636 83433 80061 80880 81774 81245 82644 81197 81750 76842 69607 69225 68665 66292
11174F6292n29J592L307J523k158j462n866k441J363k66L166M417J505K334l424
$$ 66292 65763 67355 70662 72185 70027 68565 62699 60258 61621 61355 64521 68938 70443 72777 69353
11159F9353J832k107N55q75m77K584p00L165k394q542r22l154j135L167M413N668
$$ 69353 71185 69078 69633 68758 68281 70865 70165 73330 70936 62394 61472 58318 57183 60350 64763 70431
11143G0431M809m105k159M300O942J598n15J799n193l908J503N52m471J535K118
$$ 70431 75240 71135 68976 73276 80218 81816 81301 83100 77907 73999 75502 76054 71583 73118 75236
11128G5236k266m688M480K042K090L312P47K999l88m025j049j60o809n525O505
$$ 75236 72970 68282 72762 74804 76894 80206 80953 83952 83564 79539 78490 78330 71521 65996 72501
11113G2501P906p68p235l824M554M120L53J458K550P95n63m358J300L147M182
$$ 72501 80407 79639 72404 68580 73134 77254 77607 79065 81615 82410 81847 77489 78789 81936 86118
11098H6118m99L421K397k985p56M76M24r28k570J346L893L353P98K08l457j765
$$ 86118 85619 89040 91437 88452 87696 88172 88596 87668 85098 86444 90337 93690 94488 94696 91239 89474
11082H9474k370q357j702L189P66J163J268o668J278L950l920L348O535L22J256
$$ 89474 87104 78747 77045 80234 81000 82163 83431 76763 78041 81991 78071 81419 87954 88276 89532
11067H9532Q79k233M19p60J987j369L517r74J386K381R46L248M091K212m473q153
$$ 89532 90411 88178 88597 87837 89824 88455 91972 90998 92384 94765 95711 98959 103050 105262 100789 92636
11051I2636j851L441j03L941J828j662k376K105J287k249L794P516j039l790k188
$$ 92636 90785 94226 94123 98064 99892 98230 95854 97959 99246 96997 100791 108307 107268 103478 101290
11036A01290J981M879l045J479L116L45k09k018m536k755N59M69o218L520K292
$$ 101290 103271 108150 105105 106584 109700 110045 109836 107818 103282 100527 101086 101555 95337 98857 101149
11021A01149L12k215k449m174L57L666K169R81j76J901O030P1K065J426j417P572
$$ 101149 101461 99246 96797 92623 92980 96646 98815 99796 99620 101521 107551 107622 109687 111113 109696 117268
11005A17268k620k307R79nJ74N316J491k344o090o387N863J964m453n353j24L141
$$ 117268 114648 112341 113320 113315 113489 118805 120296 117952 111862 105475 111338 113302 108849 103496 103372 106513
10989A06513m6L118L302m855o326j98O0J1876L961j882k545J159K320M69l217
$$ 106513 106467 109585 112887 108032 101706 101508 101568 113444 117405 115523 112978 114137 116457 116926 113709
10974A13709K19N28K569K10J979q355m123J216K025J036J253K79K136J245M104
$$ 113709 113928 114456 117025 117235 119214 110859 106736 107952 109977 111013 112266 112545 114681 115926 120030
10959A20030P52j036j612k525k944K77K467l09l070m04M135O050M227j997K543
$$ 120030 120782 119746 118134 115609 112665 112942 115409 115100 112030 111626 115761 121811 126038 124041 126584
10944A26584j097k04P308J109l213L37m6m463l8K170l22J539J183Nm03M890L415
$$ 126584 125487 125283 132591 133700 130487 130824 130778 126315 126277 128447 128125 129664 130847 130852 130449 135339 138754
10927A38754J917o8N70M03L246K632k092j448J659O53r74k335O28O013k275q45
$$ 138754 140671 140603 141173 141576 144822 147454 145362 143914 145573 146226 145252 142917 143545 149558 147283 146438
10911A46438k032Q02K005m73j939P339O986J489m745q429l6K749M74m238m64j464
$$ 146438 144406 145208 147213 146740 144801 152140 159126 160615 155870 147441 147405 150154 150628 146390 145926 144462
10895A44462k079L897O214J425j015j894J601Q5M48n36K701k000P571K302O148
$$ 144462 142383 146280 152494 153919 152904 151010 152611 152696 153144 152608 155309 153309 160880 163182 169330
10880A69330O74L004K978P116M440O195L650q89M722O299K241k560M684N908k292
$$ 169330 170004 173008 175986 183102 187542 193737 197387 196498 201220 207519 209760 207200 211884 217792 215500
10865B15500o456K669L62M608J34m599l593m208m856L837K581K67o7N69M462Q730
$$ 215500 209044 211713 212075 216683 216817 212218 208625 204417 199561 203398 205979 206246 206179 206748 211210 219940
10849B19940M082K304l844l207L145L090M978j55N020N521j713o183k75J460l811
$$ 219940 224022 226326 222482 219275 222420 225510 230488 230333 235353 240874 239161 232978 232703 234163 230352
10834B30352M616P993L415n076k808K516J035k274R24L285j513j274k132K600
$$ 230352 234968 242961 246376 241300 238492 241008 242043 239769 240693 243978 242465 241191 239059 241659
10820B41659O217N110L309J924j773k32j590J974M222K822l908M841P176P448
$$ 241659 247876 252986 256295 258219 256446 256214 254624 256598 260820 263642 259734 264575 271751 279199
10806B79199M222N551Q945l735p734p667j0901k675M47n165k105j996M73j705
$$ 279199 283421 288972 297917 294182 286448 278781 267880 265205 265652 260487 258382 256386 256859 255154
10792B55154N90J917k36K741O329K172r58N311O516P745N039N043N738r4N39J140
$$ 255154 255744 257661 257425 260166 266495 268667 267709 273020 279536 287281 292320 297363 303101 303007 303546 304686
10776C04686P47K339L764M613J3545N736L882R113O975P738J1502J4226J4090
$$ 304686 305433 307772 311536 316149 329694 335430 339312 348425 355400 363138 374640 388866 402956
10763D02956J3091J3633J6387J6480K5751L6209N2579Q5254J34994K00153K74711
$$ 402956 416047 429680 446067 462547 488298 524507 577086 662340 797334 997487 1272198
10752A272198K92000J98699R5565R4581J81027K26657R6448j53162k48019j91575
$$ 1272198 1564198 1762897 1858462 1953043 2134070 2360727 2457175 2304013 2055994 1864419
10742A864419j13796j21560k17045k72058k16652j38669q4219n7799m1413l5270
$$ 1864419 1750623 1629063 1412018 1139960 923308 784639 700420 642621 601208 565938
10732E65938k3193j7142j6037j3165j7476j6477j1559l160n89p049j2419o337
$$ 565938 542745 525603 509566 496401 478925 462448 450889 447729 447140 440091 427672 421335
10720D21335j889l103k611r423r347q802r733k324k959o594m164o955m253j139
$$ 421335 419446 416343 413732 404309 394962 386160 376427 374103 371144 364550 360386 353431 349178 348039
10706C48039m534p076l291L282j637p760q884q070l775m241N682K194j946j159
$$ 348039 343505 336429 333138 336420 334783 327023 318139 310069 306294 302053 307735 309929 307983 306824
10692C06824l324q983o63L769O60l953l902J488m460l606J285L474o255m939n378
$$ 306824 303500 294517 293854 297623 298283 294330 290428 291916 287456 283850 285135 288609 282354 277415 272037
10677B72037p736j519J279k847o436q95r51k668M534J047k113M496M958J0892
$$ 272037 264301 262782 264061 261214 254778 253883 252932 250264 254798 255845 253732 258228 263186 274078
10663B74078P821l807m7j640K830M605J364L906N320j153O57m588m495n462j808
$$ 274078 281899 278092 278045 276405 279235 283840 285204 289110 294430 293277 293934 289346 284851 279389 277581
10648B77581j726p793j0011r016o678q067l128n08k580l911j1750j968N259Q310
$$ 277581 275855 268062 258051 249035 242357 234290 231162 230654 228074 224163 212413 210445 215704 224014
10634B24014j147q127p837j346L642J7457J8180Q585K301o36Q339J0539J0563
$$ 224014 222867 214740 206903 205557 209199 226656 244836 253421 255722 255086 263425 273964 284527
10621B84527K887l53L604K966p105j2619P04j201j901m238o087K604L177N01K198
$$ 284527 287414 287061 290665 293631 286526 273907 274611 273410 271509 267271 261184 263788 266965 267466 269664
10606B69664N105M585J4062R566J3330J7482J8584J8822J0014J8834J7250J8041
$$ 269664 274769 279354 293416 302982 316312 333794 352378 371200 381214 400048 417298 435339
10594D35339J4859R992J6644J6194J1078K587M991M40m579n714j3958k6117k4189
$$ 435339 450198 460190 476834 493028 504106 506693 511684 512124 507545 501831 487873 461756 437567
10581D37567k7123j8684j3860j5283p567o320j1684j1321q949l85M788L025j927
$$ 437567 410444 391760 377900 362617 355050 348730 337046 325725 316776 316391 321179 324204 322277
10568C22277j0309n368j757j744M312J532l684J760M225J1145J1971P917J6307
$$ 322277 311968 306600 304843 303099 307411 308943 305259 307019 311244 322389 334360 342277 358584
10555C58584R877J2371J8610J0222K921N223k809l894k857l47o025q89J967r798
$$ 358584 368461 380832 399442 409664 412585 417808 414999 411105 408248 407901 401876 400987 402954 393156
10541C93156j3949r938j1223q415l807n717o722j0039k068j650j332j074K853
$$ 393156 379207 369269 358046 349631 345824 340107 333385 323346 321278 319628 318296 317222 320075
10528C20075N505L538K86j033l589k573O701N189L406R62l372r4M551L798M666
$$ 320075 325580 329118 329404 328371 324782 322209 328910 334099 337505 338467 335095 335001 339552 343350 348016
10513C48016J0470R390R015J5629J5640J3625J5256J9114J5909K0206J7290J6498
$$ 348016 358486 367876 376891 392520 408160 421785 437041 456155 472064 492270 509560 526058
10501E26058J6001K4071K1064K9873K3124N197j7186j4489m631K208m627k7168
$$ 526058 542059 566130 587194 617067 640191 645388 628202 613713 609082 611290 606663 579495
10489E79495m5590l3727m402L962m393j250k500O963J7983K5108K8396K3646K5624
$$ 579495 533905 500178 495776 499738 495345 494095 491595 498558 516541 541649 570045 593691 619315
10476F19315K8548K5949K7136M0098N7906O2457N5713N0022M2155L7035L1080
$$ 619315 647863 673812 700948 741046 798952 861409 917122 967144 1009299 1046334 1077414
10465A077414K6976K9442J9038M140j9584l2064k5568j2588j8362j3890j5820
$$ 1077414 1104390 1133832 1152870 1157010 1137426 1105362 1079794 1067206 1048844 1034954 1019134
10454A019134j2533n215o363J356O712P723O777J542P386J932K996N500P50l575
$$ 1019134 1006601 1001386 995023 996379 1003091 1010814 1017591 1019133 1026519 1028451 1031447 1036947 1037697 1034122
10440A034122j2085j5682j2465j275M289L019K056P105J2181J5304J0939R862
$$ 1034122 1022037 1006355 993890 992615 996904 999923 1001979 1009084 1021265 1036569 1047508 1057370
10428A057370J3678J9610K6248J8204K4323L1994K6895J7249J6259J7413J1584
$$ 1057370 1071048 1090658 1116906 1135110 1159433 1191427 1218322 1235571 1251830 1269243 1280827
10417A280827P624Q973Q590J1071O977q280K143J7610K2159J2179L341O17J1429
$$ 1280827 1288451 1297424 1306014 1317085 1324062 1315782 1317925 1335535 1357694 1369873 1373214 1373831 1385260
10404A385260K7811L4746K8339K1669J7006J5032K0293K6103L4254K8157L1355
$$ 1385260 1413071 1447817 1476156 1497825 1514831 1529863 1550156 1576259 1610513 1638670 1670025
10393A670025M2147M2232M8149O1756P1278R2418J16904J20617J19810J13374
$$ 1670025 1712172 1754404 1802553 1864309 1935587 2028005 2144909 2265526 2385336 2498710
10383B498710J31036J53270J79633K02139J96072J73842J72171J94097K29959
$$ 2498710 2629746 2783016 2962649 3164788 3360860 3534702 3706873 3900970 4130929
10374D130929K39725K19852K33357K87648L62509L98353M42064N59982P55213
$$ 4130929 4370654 4590506 4823863 5111511 5474020 5872373 6314437 6874419 7629632
10365G629632R17973R16372Q05358Q17074J009246J218103J266095J175430J259209
$$ 7629632 8547605 9463977 10269335 11086409 12095655 13313758 14579853 15755283 17014492
10356A7014492J640185K175165K751822L308738M005967N230165P147802R973323
$$ 17014492 18654677 20829842 23581664 26890402 30896369 36126534 43274336 53247659
10348E3247659J4388662K1515497L2577190M5921577N1470454L7708745J6153788
$$ 53247659 67636321 89151818 121729008 167650585 219121039 256829784 272983572
10341B72983572J1295298K4215431L6836921K4733028j3467583l9466259l5557464
$$ 272983572 284278870 308494301 345331222 370064250 356596667 317130408 281572944
10334B81572944k0566504j4806237k8388979m5795925m3331138k9256101j8157106
$$ 281572944 261006440 246200203 217811224 172015299 128684161 99428060 81270954
10327H1270954j1982522q459310o214360m755138l822330l236041k871197k616113
$$ 81270954 69288432 60829122 54614762 49859624 46037294 42801253 39930056 37313943
10319C7313943k387515k088510j743338j469062j405645j519011j533430j349234
$$ 37313943 34926428 32837918 31094580 29625518 28219873 26700862 25167432 23818198
10311B3818198j111255r82427j019754j072187j009553q90276p71704o85319o22455
$$ 23818198 22706943 21724516 20704762 19632575 18623022 17732746 16961042 16275723 15653268
10302A5653268n87472n64954n57616n52889n24290m87754m52957m29493m21669
$$ 15653268 15065796 14500842 13943226 13390337 12866047 12378293 11925336 11495843 11074174
10293A1074174m20810m11850l85035l56661l38254l31043l28911l17918l08108
$$ 11074174 10653364 10241514 9856479 9499818 9161564 8830521 8501610 8183692 7875584
10284G875584k94826k90514k86064k79047k64243k41744k21651k13304k09457
$$ 7875584 7580758 7290244 7004180 6725133 6460890 6219146 5997495 5784191 5574734
10275E574734k02210j89533j76720j62966j42668j45078j56277j61059j45793
$$ 5574734 5372524 5182991 5006271 4843305 4700637 4555559 4399282 4238223 4092430
10266D092430j18753j04138j01207r9622q8689r7189j11052j20394j17717j08396
$$ 4092430 3973677 3869539 3768332 3668710 3580021 3482832 3371780 3251386 3133669 3025273
10256C025273j13441j30335j52225j51937j42359j40128j45398j33905j20515
$$ 3025273 2911832 2781497 2629272 2477335 2334976 2194848 2049450 1915545 1795030
10247A795030j12599j10998j03804r3704q7539q9924r1387q8827q0883p2481p2309
$$ 1795030 1682431 1571433 1467629 1373925 1286386 1196462 1105075 1016248 935365 862884 790575
10236G90575p0326o1630n4924n1973l9401m0507l4163l4626l2247k8231j9247
$$ 790575 720249 658619 603695 551722 512321 471814 437651 403025 370778 342547 323300
10225C23300j5395p871j3465j4961q284o917o666n259p274l560N262J690K13k472
$$ 323300 307905 300034 286569 271608 263324 256407 249741 244482 237208 233648 238910 240600 240813 238341
10211B38341p23O979M975jo817o837N30Q624M687m382r853j211J1082J7316J8795
$$ 238341 237618 244597 249572 249571 242754 235917 236447 245071 249758 245376 235523 234312 245394 262710 281505
10196B81505J7718K0059J4347Q549m891o885N309Q883l720k0679l0015k6579n992
$$ 281505 299223 319282 333629 342178 337287 330402 335711 344594 340874 320195 290180 263601 257609
10183B57609n651j5146k5656k6137o791J216K732J3002J7944Q243Q503J7608Q505
$$ 257609 251958 236812 211156 185019 178228 179444 182176 195178 213122 221365 229868 247476 255981
10170B55981J5009J5131Q374J427L005R707N367n52n091p999q832J648L369q63
$$ 255981 270990 286121 294495 295922 298927 308634 314001 313449 308358 300359 291527 293175 296544 295681
10156B95681m846N44O646M873K975J831L055N175N656P830J5726J1603N573O361
$$ 295681 290835 291379 298025 302898 305873 307704 310759 315934 321590 329420 345146 356749 362322 368683
10142C68683K4836M0652M5985L3488L1601N1027P2013O3349J6352k1550j5350
$$ 368683 393519 434171 480156 513644 545245 596272 668285 731634 747986 726436 711086
10131G11086L84k6164p0513q1743o3226m5039m8481n0597k6743k0087j0845j1122
$$ 711086 711470 685306 614793 533050 469824 424785 376304 325707 298964 278877 268032 256910
10119B56910j1477p792o371m887j447p034j2955j3715j1884m105o028j4748j8375
$$ 256910 245433 237641 231270 226383 224936 217902 204947 191232 179348 175243 169215 154467 136092
10106A36092j7095j2392j1389p400j0535r968p641q686q61N322K411k464n383
$$ 136092 118997 106605 95216 87816 77281 67313 59672 50986 50125 55447 57858 55394 50011
10093E0011m087j286Q606J5193K759n883o465K001O569k169n066q923j0714m245
$$ 50011 45924 44638 53244 68437 71196 65313 58848 60849 67418 65249 60183 51260 40546 36301
10079C6301m474p788m112K09m31j183L638K596l254k25L896l640o459r294l324
$$ 36301 31827 24039 19927 20136 19705 18522 22160 24756 21502 21277 25173 21533 15074 5780 2456
10064B456J120l328p827k825J63k085j152K675L678K255O28O071O164Q312P821
$$ 2456 3576 248 -7579 -10404 -10241 -12326 -13478 -10803 -7125 -4870 -4242 1829 7993 16305 24126
10049B4126Q83K032K746k100k10L000l070m388M539n68m58j795m567j0125k765
$$ 24126 25009 27041 29787 27687 27477 30477 27407 23019 27558 26990 26532 24737 20170 10045 7280
10034G280J916K82j95j0011j4248j1619o279K008P047l608j0101l363P496N433
$$ 7280 9196 9478 9283 -728 -14976 -26595 -32874 -30866 -23819 -27427 -37528 -40891 -33395 -27962
10020b7962P039Q829k417n710Q016L759L996P388L637P013Q651J655m836O020
$$ -27962 -20923 -12094 -14511 -20221 -12205 -8446 -4450 2938 6575 13588 22239 23894 19058 25078
10006B5078N146L230k265J048J189j28L669j211p56l919j182r75J289l697j989
$$ 25078 30224 33454 31189 32237 33426 33298 36967 35756 35000 31081 29899 28924 30213 26516 24527
9991B4527p18m074k219Q98K884N623N017K436j56L14L966Q192Q393R079J0211
$$ 24527 23809 19735 17516 18414 21298 26921 31938 34374 34218 34532 38498 46690 55083 64162 74373
9976G4373K3524L3302K9893k159j5184r712P181o38l8024l2518j8246o794k243
$$ 74373 97897 131199 161092 158933 143749 134037 141218 140580 102556 70038 51792 44998 42755
9963D2755k66o138o624L369L482k878j227K9n53L78M933K268j479N10P695Q849
$$ 42755 42489 36351 29727 33096 36578 33700 32473 32502 31949 32327 37260 39528 38049 38559 46254 55103
9947E5103L578P892N866K047P515P072L576Q519J6071J9721K9736L9688N1412
$$ 55103 58681 66573 72439 74486 82001 89073 92649 101168 117239 136960 166696 206384 257796
9934B57796P2468J13574J72527K48705K98119K35027J13337Q3115J59086K27203
$$ 257796 330264 443838 616365 865070 1163189 1398216 1511553 1594668 1753754 1980957
9924A980957J47259r0578k51168k18319j26482j05742j88251k67425k34999j52794
$$ 1980957 2128216 2037638 1786470 1568151 1441669 1335927 1147676 880251 645252 492458
9914D92458r0933o2296m3105l4394k4187k2884j5799o662q715r754j2066p712
$$ 492458 401525 339229 296124 261730 237543 214659 198860 192198 183483 173729 161663 153951
9902A53951q862j0831j2915j0002n664l840Q865O338P982P023J6243L0545M6237
$$ 153951 145089 134258 121343 111341 105677 101837 110702 117040 125022 132045 148288 178833 225070
9889B25070P1832R2245P8928K5696j1583j5981p007k4800p2888r9219p8228n3334
$$ 225070 296902 389147 468075 493771 482188 466207 459200 434400 361512 262293 184065 130731
9877A30731l1667j7598j5149q908p078j0445r207l984n249n50j97J882K388K550
$$ 130731 99064 81466 66317 57409 50331 39886 30679 26695 21446 20896 20699 22581 24969 27519
9863B7519K505n170m125p557l718M443k620J0J483J294l98n641j385k28j0198
$$ 27519 30024 24854 20729 13172 9454 13897 11277 11287 12770 14064 13666 8025 6640 6412 -3786
9848c786r223m704J101N031m658r17k404q97l004l062J764o58J496m48l49m75
$$ -3786 -13009 -17713 -16612 -11581 -16239 -17156 -19560 -20457 -23461 -26523 -24759 -25417 -23921 -24369 -24718 -25193
9832b5193N900Q50n991l383K47K580k770p919k909P692J1387K3m677l628l557
$$ -25193 -19293 -18443 -24434 -27817 -27570 -24990 -27760 -35679 -38588 -30896 -19509 -19486 -24163 -27791 -31348
9817c1348L33J914k019l464K83k74m826o644m4j63K261N498K075j760o75L903
$$ -31348 -31015 -29101 -31120 -34584 -34301 -34575 -39401 -46045 -46089 -46252 -43991 -38493 -36418 -38178 -38853 -34950
9801c4950J828K873O785J649k961k162m315K444P04L202M176P142N436K21n532
$$ -34950 -33122 -30249 -23464 -21815 -24776 -26938 -31253 -28809 -28105 -24903 -20727 -13585 -8149 -7928 -13460
9786a3460l362J262k291J026K367J085R40l834o673K030L507K29m946j432l559
$$ -13460 -16822 -15560 -17851 -16825 -14458 -13373 -12433 -16267 -22940 -20910 -17403 -17174 -22120 -23552 -27111
9771b7111j658O694P657L186M38k653j38j422k240n802k712o695K55K060k289
$$ -27111 -28769 -22075 -14418 -11232 -10794 -13447 -13585 -15007 -17247 -23049 -25761 -32456 -32201 -30141 -32430
9756c2430j295M041K447M477J19l88J483m253J7K503j627R15K461J001j588j366
$$ -32430 -33725 -29684 -27237 -22760 -22641 -23029 -21546 -25799 -25782 -23279 -24906 -23991 -21530 -20529 -22117 -23483
9740b3483j042n31N50K981r74k8J49L381O508J440j293q197m140j7J643j509j140
$$ -23483 -24525 -25056 -24506 -21525 -22499 -22527 -22378 -18997 -12489 -11049 -12342 -20539 -24679 -24696 -23053 -24562 -25702
9723b5702P91N079P223j168L863Q640N423L17k43j412K598k32n499q170k495j079
$$ -25702 -24911 -19832 -12609 -13777 -9914 -1274 4149 4466 4223 2811 5409 5177 -322 -8492 -10987 -12066
9707a2066j966K138j423j804j933K321j365j031k361j781k295m141k260k5N075
$$ -12066 -14032 -11894 -13317 -15121 -17054 -14733 -16098 -17129 -19490 -21271 -23566 -27707 -29967 -29992 -24917
9692b4917J515m870P76K073l95j087O736L982l734k616j525M990M727j912p58
$$ -24917 -23402 -28272 -27496 -25423 -25818 -26905 -20169 -16187 -19921 -22537 -24062 -19072 -14345 -16257 -17015
9677a7015L623L058L106J2174Q354J3180J6627K1345M0880N5186P3535P2867O1637
$$ -17015 -13392 -10334 -7228 4946 13300 26480 43107 64452 105332 160518 234053 306920 368557
9664C68557M8434M1451J4611j9507m2798n6389n3011n9835o9846o0277l6178k4546
$$ 368557 416991 458442 473053 453546 410748 354359 301348 241513 171667 111390 75212 50666
9652E0666r312l139m656p086k653l862k911o164Lp3k484k574L59l937m107j254
$$ 50666 41354 38215 33559 26473 23820 19958 17047 10883 10886 10813 8329 5755 6114 2177 -1930 -3184
9636c184k101k372M229M13K09j456l991l610l696J420J334O87n581k948j280r30
$$ -3184 -5285 -7657 -3428 -3015 -2806 -4262 -8253 -11863 -15559 -14139 -12805 -12118 -17699 -20647 -21927 -22857
9620b2857k628J159n320L014Q478K600K006M79l594M46n38j736q41k472N504M313
$$ -22857 -25485 -24326 -29646 -26632 -18154 -15554 -13548 -13069 -16663 -16217 -16755 -18491 -19332 -21804 -16300 -11987
9604a1987q99k482r63m89M60p781j983k337L02q31M899l088j930J847n80Q4k357
$$ -11987 -12886 -15368 -16331 -16820 -16360 -24141 -26124 -28461 -28159 -28990 -24091 -27179 -29109 -27262 -27842 -27758 -30115
9587c0115j582L903j672l656O27N192j088l277M176J912R92m153k922r12J034
$$ -30115 -31697 -27794 -29466 -33122 -32495 -27303 -28391 -31668 -27492 -25580 -24588 -28741 -31663 -32575 -31541
9572c1541L939k105Q7J93M318J478n57J514k961l111J820O66k660J802r90M462
$$ -31541 -27602 -29707 -29620 -29427 -25109 -23631 -24188 -22674 -25635 -28746 -26926 -26260 -28920 -27118 -28108 -23646
9556b3646K751q138j889J875r53l323l916q07K186j995J651j483J153j883L996
$$ -23646 -20895 -29033 -30922 -29047 -30000 -33323 -37239 -38046 -35860 -37855 -36204 -37687 -36534 -38417 -34421
9541c4421L941j6j364J528K916k466m445k564K715J178j38N61Q206L507m28k875
$$ -34421 -30480 -30496 -31860 -30332 -27416 -29882 -34327 -36891 -34176 -32998 -33136 -32575 -24369 -20862 -21290 -24165
9525b4165j698R01m301k200L843M77J962L961K126M798l03K439p65K320k169m32
$$ -24165 -25863 -24962 -29263 -31463 -27620 -27143 -25181 -21220 -19094 -14296 -14599 -12160 -12925 -10605 -12774 -13206
9509a3206l606q99N079j743m185j541o47K104J775j213l619l212J412K355j023
$$ -13206 -16812 -17711 -12632 -14375 -18560 -20101 -20748 -18644 -16869 -18082 -21701 -24913 -23501 -21146 -22169
9494b2169M003P388M377P88l1j990k550L604L940j648k344L413K169J165k256
$$ -22169 -18166 -10778 -6401 -5613 -5644 -7634 -10184 -6580 -2640 -4288 -6632 -3219 -1050 115 -2141
9479b141K368j038J953J168j910l595J054L226j546M469N538m26j359M32j144
$$ -2141 227 -811 1142 2310 400 -3195 -2141 1085 -461 4008 9546 9120 7761 8193 7049
9464G049K712J637m69K172k784l875j362M517M008k549j166j743O67L083M969
$$ 7049 9761 11398 10929 13101 10317 6442 5080 9597 13605 11056 9890 8147 8814 11897 16866
9449A6866N89L069j832M563k614q23M287K116j851p7m502j832L192n82m074J735
$$ 16866 17455 20524 18692 23255 20641 19818 24105 26221 24370 24293 19791 17959 21151 20569 16495 18230
9433A8230j651k602l370J203L779J635j360N897M662J209k331l545K318J792K656
$$ 18230 16579 13977 10607 11810 15589 17224 15864 21761 26423 27632 25301 21756 24074 25866 28522
9418B8522p28j815j598m343j408j640L793L986O49M57k239l939j272l748L21K156
$$ 28522 27794 25979 24381 20038 18630 16990 20783 24769 25418 25875 23636 19697 18425 14677 14998 17154
9402A7154m12l585m61k86k117K289n450o723l485L85m923N03L345K21mm251l297
$$ 17154 16742 13157 12696 12410 10293 12582 7132 409 -3076 -2691 -7614 -7111 -3766 -3545 -3549 -7800 -11097
9385a1097M579O96m911M061P59o909N76N884q96N372O841M879n455j11m636r222
$$ -11097 -6518 -5822 -10733 -6672 -5913 -12822 -12246 -6362 -7258 -1886 4955 9834 4379 4268 -368 -9590
9369i590j842O478L021k956o83J304L624J322R63N87m11J013P17j200k132l487
$$ -9590 -11432 -4954 -1933 -4889 -5572 -4268 -644 678 1641 2228 1817 2830 3547 2347 215 -3272
9353c272L445J527j805J851M01l608o951J858O614J475M77q64M95L023k35p233
$$ -3272 173 1700 -105 1746 2147 -1461 -8412 -6554 60 1535 2012 1148 1643 4666 4431 -2802
9337b802n863M891L34L510N913l840k658j698n72K218k450j779K789j317J150
$$ -2802 -8665 -3774 -3440 70 5983 2143 -515 -2213 -2785 -567 -3017 -4796 -2007 -3324 -2174
9322b174m402o083k007P84K208P600L707l249n097p88K070J868q43j33M22M04
$$ -2174 -6576 -12659 -14666 -13882 -11674 -4074 -367 -3616 -8713 -9501 -7431 -5563 -6406 -6539 -6117 -5713
9306e713L933m027n831l558L924R40m769N17k025L449M624J8o243M843M543j330
$$ -5713 -1780 -5807 -11638 -15196 -11272 -10332 -15101 -14584 -16609 -13160 -8536 -8518 -14761 -9918 -5375 -6705
9290f705m601l714o178j060J676k90Q174J571j640k472p854L820k51l202j755
$$ -6705 -11306 -15020 -21198 -22258 -20582 -20872 -12698 -11127 -12767 -15239 -23093 -19273 -19524 -22726 -24481
9275b4481L318j535j22m98K670L693K366J872m322n217L580L306Q35N10Q56l52
$$ -24481 -21163 -22698 -22820 -23318 -20648 -16955 -14589 -12717 -17039 -22256 -18676 -15370 -14535 -14025 -13169 -13521
9259a3521j315L730K286J628j217l252o643qJ791k383p95j864k333J048O303K101
$$ -13521 -14836 -11106 -8820 -7192 -8409 -11661 -18304 -18312 -16521 -18904 -19699 -21563 -23896 -22848 -16545 -14444
9243a4444J93j395R67k51k903n2j922J819O680L80M907O034m63J227J499j54l106
$$ -14444 -14251 -15646 -14679 -14930 -17833 -17885 -19807 -17988 -11308 -10928 -6021 13 -450 777 2276 2122 -984
9226i84j584o797n486o34o55j992K178K164J323K544k10P66l88n204L403J1217
$$ -984 -2568 -9365 -14851 -15485 -16140 -18132 -15954 -13790 -12467 -9923 -10133 -9367 -9755 -14959 -11556 -339
9210c39J278l302K787J011j593j283j820N008N607K40O851M661j198j418M850
$$ -339 939 -2363 424 1435 -158 -1441 -3261 1747 7354 7594 14445 19106 17908 16490 21340
9195B1340L912k529p722j600K995l1R88k499j408j934l91l773k901L267O27n103
$$ 21340 25252 22723 15001 13401 16396 16365 17353 14854 13446 11512 11121 7348 4447 7714 8341 3238
9179C238o644n500R69M740O008L788j407J001M68m285m998K000K06K946O26k237
$$ 3238 -3406 -8906 -7937 -3197 2811 6599 5192 6193 6661 2376 -2622 -622 -416 2530 3156 919
9163I19N950K117o0N094L831k908n619J704k415l843q058r58L340m451m58R02
$$ 919 6869 8986 8926 14020 17851 14943 9324 11028 8613 4770 -3288 -4246 -906 -5357 -5815 -4913
9147d913J843k1j203k660N58M460n88k385L66K678j966O73l251k657K903L689
$$ -4913 -3070 -3091 -4294 -6954 -6396 -1936 -2524 -4909 -4543 -1865 -3831 -3158 -6409 -9066 -6163 -2474
9131b474n111j817L906N15L731O180M071j419j66j123j454M628r22k272k889k677
$$ -2474 -7585 -9402 -5496 -4981 -1250 4930 9001 7582 7416 6293 4839 9467 8545 6273 3384 707
9115G07L698J521l316K438r48m37J460p390l784q61M373N3o53K712j188j859q52
$$ 707 4405 5926 2610 5048 4100 3663 5123 -2267 -6051 -6912 -2539 -2486 -3139 -427 -1615 -3474 -4326
9098d326k808n30L014J700M57M126J286m198J305K046j739j31K762O61M251O794
$$ -4326 -7134 -7664 -4650 -2950 -2493 1633 2919 -1279 26 2072 333 202 2964 3625 7876 14670
9082A4670M863k707m152p036n305p10q16K403L993M47m149l151k660j79J910o37
$$ 14670 19533 16826 12674 5638 333 -377 -1193 1210 5203 5650 1501 -1650 -4310 -4489 -2579 -3216
9066c216K688L64J310O11j363M54J446o24J475K157J614J015K316r90J63q78j87
$$ -3216 -528 -164 1146 1757 394 848 2294 1670 3145 5302 6916 7931 10247 9257 9420 8542 8355
9049H355M634O728j367n842n055k438N912N466M955m155o636k22M303k397r217
$$ 8355 12989 19717 18350 12508 7453 5015 10927 16393 21348 17193 10557 10335 14638 12241 3024
9034C024l194J523P159n76l985K542M300M176k403k160O06K537N22L76l703n953
$$ 3024 -170 1353 8512 7936 3951 6493 10793 14969 12566 10406 11012 13549 14071 14447 10744 4791
9018D791n920m88P362M092r45J868L892n051j366L030M846K203q92l511m237m273
$$ 4791 -1129 -1617 5745 9837 8892 10760 14652 9601 8235 11265 16111 18314 17422 13911 9674 5401
9002E401l331j312L653J655J362j4m643L965N571j660o762q942J474N135k619
$$ 5401 2070 758 4411 6066 7428 7414 2771 6736 12307 10647 3885 -5057 -3583 1552 -1067
8987a067j423j258K669r05q956R04M898j168O88N130o61J019O013k589j38N44
$$ -1067 -2490 -3748 -1079 -1984 -10940 -10036 -5138 -6306 -5618 -488 -1149 -130 5883 3294 3156 3700
8971C700j499n241q11j485k404j088J153k219L590L317m194k749K280N146J458
$$ 3700 2201 -3040 -3851 -5336 -7740 -8828 -7675 -9894 -6304 -2987 -7181 -9930 -7650 -2504 -1046
8956a046n968n70R97J7M06j815J687J123j566R0L571j659n522J524N172L509K804
$$ -1046 -7014 -7584 -6587 -6570 -6164 -7979 -6292 -5169 -6735 -6645 -3074 -4733 -10255 -8731 -3559 -50 2754
8939B754J513N67m63l313j70R16K638M303K860l364K302r07O952Q27j405k6j922
$$ 2754 4267 4834 4371 1058 888 1804 4442 8745 11605 8241 10543 9636 16588 17415 16010 15984 14062
8922A4062k559k878o052m217N607j307o08l258J745J483L57J259l513l825J647
$$ 14062 11503 8625 2573 -1644 3963 2656 2048 -1210 535 2018 2375 3634 121 -3704 -2057
8907b057M786J367m475K119R94l687k072J602K470p79N45K217j167J838J938j725
$$ -2057 2729 4096 -379 1740 2734 -953 -3025 -1423 1047 268 813 3030 1863 3701 5639 3914
8891C914l340j794N901L575l102q21J866R41L077k429k276L808k016o0l693M486
$$ 3914 574 -1220 4681 8256 5154 4333 6199 7140 10217 7788 5512 9320 7304 7244 3551 8037
8875H037k252m842K54L083K064o2J071J517J586K019k635k422j137M593O752K573
$$ 8037 5785 943 1197 4280 6344 6282 7353 8870 10456 12475 9840 7418 6281 10874 17626 20199
8859B0199n057o004k950K136M151J213K188K58K17J591j374K762N254O92L065
$$ 20199 15142 9138 6188 8324 12475 13688 15876 16134 16351 17942 16568 19330 24584 25276 28341
8844B8341j152j24n98L789J0253J606J382K431j672m91O783Q108R88K44L736J853
$$ 28341 27189 27065 26467 30256 40509 42115 43497 45928 44256 43765 50548 58656 59644 59888 63624 65477
8828F5477P095Q960J0689P683Q341J3859K1000J7946J3296K0578K2486L4629L5005
$$ 65477 72572 81532 92221 99904 108245 122104 143104 161050 174346 194924 217410 252039 287044
8815B87044L3113L8646N1791O8206Q8315J17415J67486K56257M01564O11478Q04534
$$ 287044 320157 358803 410594 478800 567115 684530 852016 1108273 1509837 2121315 2925849
8804B925849P39884K90470q1349j31925o0705j37494n31211p89365o29659l92016
$$ 2925849 3665733 3956203 3874854 3742929 3682224 3544730 3013519 2224154 1594495 1202479
8794A202479k43129j48531r4076o7663n4593l9755l3391l6122l3985l7535l7151
$$ 1202479 959350 810819 716743 649080 594487 554732 521341 485219 451234 413699 376548
8783C76548l0610k8396k3675k1552j3162j7087j4964j1070r852j2864q616p857
$$ 376548 345938 317542 293867 272315 259153 242066 227102 216032 206180 193316 184700 176843
8771A76843q372p463r784q641p009m803n694p707k135o313o08K633o997j703n504
$$ 176843 168471 161008 151224 142583 135574 130771 125077 117370 115235 108922 108314 110947 103950 102247 96743
8756I6743q746J24k383l854l616l132q928n903n727k74N797k79k040q280p881
$$ 96743 87997 88121 85738 81884 78268 75136 66208 60305 54578 54304 60101 59822 57782 49502 41621
8741D1621L343M671r1K177M476j875J060j339l556l431o212m930J724j091k419
$$ 41621 44964 49635 49544 51721 56197 54322 55382 54043 50487 47056 40844 35914 37638 36547 34128
8726C4128k821o824p147K908P86k677q61l40qK206R51MJ921m018n900O20q52j238
$$ 34128 31307 24483 17336 20244 21030 18353 17492 17152 17144 19350 20301 20305 22226 18208 12308 12928 12076 10838
8708A0838k70J478k513l99l284l597k301p651j085J6L669K703J403k6j347K636
$$ 10838 10568 12046 9533 9134 5850 2253 -48 -7699 -8784 -8768 -5099 -2396 -993 -1019 -2366 270
8692B70J04j271K900M444k003m436l856M305k040l815j280M917j537J366j253
$$ 270 374 -897 2003 6447 4444 8 -3848 457 -1583 -5398 -6678 -1761 -3298 -1932 -3185
8677c185P06K594k65N804L959M029K194N118O638J3870J5072J5265Q399O133N176
$$ -3185 -2479 115 -150 5654 9613 13642 15836 20954 27592 41462 56534 71799 80198 86331 91507
8662I1507K785o88j3087j3384j7311j2167o420o834l495l059j230q21k997l727
$$ 91507 94292 93604 80517 67133 49822 37655 31235 24401 20906 17847 16617 15796 12799 9072
8648I072m22K17P352m37Q98J36N46k805J008O30l188M021K329O50l386k32J048
$$ 9072 8650 8867 16219 15782 16680 16816 17362 14557 15565 16195 13007 17028 19357 20007 16621 16389 17437
8631A7437N761P666J1742Q604J4019J6743P278K328Q62j078k848j4055j3131j4686
$$ 17437 23198 30864 42606 51210 65229 81972 89250 91578 92440 91362 88514 74459 61328 46642
8617D6642j4543p999j789l242n891o94K84k302L171J331o767N659L817J951m699
$$ 46642 32099 24100 22311 19069 13178 12484 12768 10466 13637 14968 8201 13860 17677 19628 14929
8602A4929j337M994J718k207k467J571J598O78k680O95m254r96j103p16p73j659
$$ 14929 13592 18586 20304 18097 15630 17201 18799 19477 16797 17492 13238 12242 11139 10423 9650 7991
8586G991J507L041l878J95j842r18K165K534J579M0K15L178J784M432L568M909
$$ 7991 9498 12539 8661 8856 7014 6096 8261 10795 12374 12414 12629 15807 17591 22023 25591 30500
8570C0500l60j2352o609K347K286P91J473k321J467M081n180O84J257M065K656
$$ 30500 30140 17788 11179 13526 15812 16603 18076 15755 17222 21303 16123 16807 18064 22129 24785
8555B4785l961m85J225K423J125M396l634k078j205J62M649N85K3J397O626O456
$$ 24785 20824 20339 21564 23987 25112 29508 25874 23796 22591 22753 27402 27987 28010 29407 36033 42489
8539D2489R675Q369P012Q458N281P878J5036Q929K837R39N176L156m934r127o902
$$ 42489 52164 60533 67545 76003 81284 89162 104198 113127 115964 116903 122079 125235 120301 111174 104272
8524A04272o547r179j0369q035o377j0164q319o159l590n56J28l416k654k205
$$ 104272 97725 88546 78177 70142 63765 53601 45282 39123 35533 34977 35105 31689 29035 26830
8510B6830o740n474m56J798k40K100j653n27p04j371j447K369k07J463N90k087
$$ 26830 20090 14616 14160 15958 15718 17818 16165 15638 14934 13563 12116 14485 14278 15741 16331 14244
8494A4244k899J153N243m925j828O84j40n187n601J93k265K527M713N226j488
$$ 14244 11345 12498 17741 12816 10988 11672 11532 6345 744 937 -1328 1199 5912 11138 9650
8479I650n153J87K051L751J837K825l226k248q23o412n357m546M715L968J050
$$ 9650 4497 4684 6735 10486 12323 15148 11922 9674 8851 2439 -2918 -7464 -2749 1219 2269
8464B269P037J080j358q82n565n551n558L34J279J735J92J309M794o5k264L596
$$ 2269 9306 10386 9028 8146 2581 -2970 -8528 -8194 -6915 -5180 -4988 -3679 1115 1050 -1214 2382
8448B382o849j892K103K589L755j670j12j4N464O84l31l967O12J718j376j868
$$ 2382 -4467 -6359 -4256 -1667 2088 418 306 292 5756 6440 6109 2142 2754 4472 3096 1228
8432A228L037k405n796l955j822N939j240q20J20L860n51j662K325L133M780l687
$$ 1228 4265 1860 -3936 -7891 -9713 -3774 -5014 -5834 -5714 -1854 -2405 -4067 -1742 1391 6171 2484
8416B484n369k423q3l460L712J430Q82k651K85J069M77O882Q594j160K321N318
$$ 2484 -2885 -5308 -5391 -8851 -5139 -3709 -2827 -5478 -5193 -4124 -3647 3235 11829 10669 12990 18308
8400A8308p41k03m044m034l475l07k618N98k072l154N19M20O6k702M444K772m181
$$ 18308 17567 17364 13320 9286 5811 5504 2886 3484 1412 -1742 -1223 -803 -737 -3439 1005 3777 -404
8383d04j751k55L654L126j541k047k616J64j279R32l493k006P749Q92p409n822
$$ -404 -2155 -2410 1244 4370 2829 782 -1834 -1670 -2949 -2017 -5510 -7516 233 1125 -6284 -12106
8367a2106K470N883m451k685l663j594n588J320L637M581M037K868k404o328J122
$$ -12106 -9636 -3753 -8204 -10889 -14552 -16146 -21734 -20414 -16777 -12196 -8159 -5291 -7695 -14023 -12901
8352a2901O321J279m984r75j014l630N895K055k966K815M64K4l88l13J287K499
$$ -12901 -6580 -5301 -10285 -11260 -12274 -15904 -10009 -7954 -10920 -8105 -7641 -7617 -8005 -8318 -7031 -4532
8336d532o29k908o262j711K793k73N275M43r42R56K960L584M88j076m259P89J892
$$ -4532 -5161 -8069 -14331 -16042 -13249 -13522 -8247 -7804 -8746 -7790 -4830 -1246 -758 -1834 -6093 -5304 -3412
8319c412j315k851l718J955K365o049m193L58j280K578j06k281M436J265l047
$$ -3412 -4727 -7578 -11296 -9341 -6976 -13025 -17218 -16860 -18140 -15562 -15668 -17949 -13513 -12248 -15295
8304a5295N039M355o251o73O047O904l254m009j910k506k482l522M759P587n72
$$ -15295 -10256 -5901 -12152 -12825 -6778 126 -3128 -7137 -9047 -11553 -14035 -17557 -12798 -5211 -5783
8289e783j935l308N65l784j619n831N940O285J533J010J720J731j226o213k712
$$ -5783 -7718 -11026 -10461 -14245 -15864 -21695 -15755 -9470 -7937 -6927 -5207 -3476 -4702 -10915 -13627
8274a3627p26M47J845L097m915m242Q63L308J178j014K703R15k205j558L464L279
$$ -13627 -14353 -13906 -12061 -8964 -13879 -18121 -17258 -13950 -12772 -13786 -11083 -10168 -12373 -13931 -10467 -7188
8258g188K925J168l794n012q580N486N119m67J951J013l097o794l193K210Q45
$$ -7188 -4263 -3095 -6889 -11901 -20481 -14995 -9876 -10343 -8392 -7379 -10476 -17270 -20463 -18253 -17408
8243a7408j752L556k91k748J95L327M067M972j960k165L45j276K123K54l79K202
$$ -17408 -19160 -15604 -15895 -18643 -18448 -15121 -11054 -6082 -8042 -10207 -9862 -11138 -9015 -8761 -9140 -6938
8227f938l304l89L8j554O863r09n078k62o312K846M040L019K290K325M464j099
$$ -6938 -10242 -10631 -10593 -12147 -5284 -6193 -11271 -11533 -17845 -14999 -10959 -7940 -5650 -3325 1139 40
8211D0j166o44k703J719N11r65k676l519k376J882R94l987J683O303L512L59J408
$$ 40 -1126 -1770 -4473 -2754 -2243 -3208 -5884 -9403 -11779 -9897 -8903 -12890 -11207 -4904 -1392 -1033 375
8194C75K003k453k278J800n34p062p097J618N7K454k12p05l452l668L094N636
$$ 375 2378 -75 -2353 -553 -1087 -8149 -15246 -13628 -13571 -11117 -11329 -12034 -15486 -19154 -16060 -10424
8178a0424K471q87N769k211m367r44K675L708k43L058n278p857M347K815J661
$$ -10424 -7953 -8840 -3071 -5282 -9649 -10593 -7918 -4210 -4453 -1395 -6673 -14530 -10183 -7368 -5707
8163e707j564k141k233j048N08p92J31R64K211M491l209p070p39O601K807L203
$$ -5707 -7271 -9412 -11645 -12693 -12185 -12977 -12846 -11882 -9671 -5180 -8389 -15459 -16198 -9597 -6790 -3587
8147c587M342p60L713o55L819N228%k411j244q40j510k523l312j62K32p77l564
$$ -3587 755 -5 3708 3053 6872 12100 12100 9689 8445 7605 6095 3572 260 98 330 -447 -4011
8130d011L48K341L51r01n059n726N503P898M701k983r57n788k663K34L837j834
$$ -4011 -3663 -1322 -971 -1872 -6931 -12657 -7154 744 5445 2462 1505 -4283 -6946 -6712 -2875 -4709
8114d709N93J0k998p377K039m20J282N462k497R18O05l848L685p43k346l536m97
$$ -4709 -4116 -4106 -7104 -14481 -12442 -12862 -11580 -6118 -8615 -7697 -7092 -10940 -7255 -7998 -10344 -13880 -14377
8097a4377k922J2P28L124K591M583J825n552k843K006K930L538J795p4K153M063
$$ -14377 -17299 -17287 -16559 -13435 -10844 -6261 -4436 -9988 -12831 -10825 -7895 -4357 -2562 -2636 -483 3580
8081C580j167l850m887l616l619K23K572N333P189K38m031l157l32J744J91l814
$$ 3580 2413 -1437 -6324 -9940 -13559 -13336 -10764 -5431 1758 1996 -2035 -5192 -5524 -3780 -3589 -7403
8065g403q49R35l752L71K985K991O452L101J482K998q2K210L991N76m519r05k47
$$ -7403 -8252 -7317 -11069 -10698 -7713 -4722 1730 4831 6313 9311 9229 11439 15430 16006 11487 10582 10335
8048A0335k282l490j206k307k337k118l08k198J880J371q17l523M701J818L907
$$ 10335 8053 4563 3357 1050 -1287 -3405 -3713 -5911 -4031 -2660 -3477 -7000 -2299 -481 3426
8033C426J843P51j477m35J851K12o737n587J781J964j060K322k822q10J561k772
$$ 3426 5269 6020 4543 4108 5959 6171 -566 -6153 -4372 -2408 -3468 -1146 -3968 -4778 -3217 -5989
8017e989l279n29J814o88M536J943P142k561r455k897r74L645M510qj084j594
$$ -5989 -9268 -9797 -7983 -8671 -4135 -2192 4950 2389 -7066 -9963 -10937 -7292 -2782 -2790 -3874 -5468
8001e468J865M81m70k462k672L6K186j904M17K49r64K361L381m100M97K262q95
$$ -5468 -3603 -3122 -3592 -6054 -8726 -8690 -6504 -8408 -7991 -7742 -8706 -6345 -2964 -7064 -6567 -4305 -5200
7984e200l5j523J90N528K209n75K028k902m635K140M541O392J19j629J273r43
$$ -5200 -5235 -6758 -6568 -1040 1169 594 2622 -280 -4915 -2775 1766 8158 8277 6648 7921 6978
7968F978j34K281O8Q24m772p76P81O90n91q69j372j743O035K131j088j753r92
$$ 6978 6844 9125 9193 10017 5245 4469 5250 5940 5349 4480 3108 1365 7400 9531 8443 6690 5698
7951E698j041L097O78K89Q34l250n040K567L480n02Q99j257m466j826K970j43
$$ 5698 4657 7754 8432 8721 9555 6305 1265 3832 7312 6810 7709 6452 1986 160 3130 2987
7935B987M369J753K971M336M760k472p66J682j609j591O91R11n055n504K50P431
$$ 2987 7356 9109 12080 16416 21176 18704 17938 19620 18011 16420 17111 18022 12967 7463 7713 15144
7919A5144L734j948k926m520o293j705K565K375R12L16j095j455j121K682J408
$$ 15144 18878 16930 14004 9484 3191 1486 4051 6426 7338 7654 6559 5104 3983 6665 8073
7904H073N06q83m470n635k263JL444L583k793j661J900L522K859J81l020K409
$$ 8073 8579 7696 3226 -2409 -4672 -4671 -1227 2356 -437 -2098 -198 3324 6183 6364 3344 5753
7888E753N36K944j83j882L039m46m828j977J032L2p01m95l06P530M098J832m909
$$ 5753 6289 9233 9050 7168 10207 9761 4933 2956 3988 4020 3319 2824 2518 10048 14146 15978 11069
7871A1069k598j486n498k217K579J675L000j662l562n209l21j570K19J636O245
$$ 11069 8471 6985 1487 -730 1849 3524 6524 4862 1300 -3909 -4230 -5800 -5581 -3945 2300
7856B300K801K288p262j419l28M920N318m766n062n47r1L658o81O07r8n56j633
$$ 2300 5101 7389 127 -1292 -1620 3300 8618 3852 -1210 -1757 -1848 1810 1129 1736 1638 1082 -551
7839e51R32J461m534n000l774Q480M278k94J17L128J904m926m350l58P16K702
$$ -551 381 1842 -2692 -7692 -11466 -2986 1292 998 1115 4243 6147 1221 -3129 -3487 -2771 -69
7823f9K59K66q87j026k753k104k235j224j470K552L007P10j277l220O89P13N76
$$ -69 190 456 -431 -1457 -4210 -6314 -8549 -9773 -11243 -8691 -5684 -4974 -6251 -9471 -8782 -8069 -7493
7806g493J56j475K124k985j194K078r29k28J655J18R28O685m03j371j035j806
$$ -7493 -7337 -8812 -6688 -9673 -10867 -8789 -9718 -9946 -8291 -8173 -7245 -560 -963 -2334 -3369 -5175
7790e175k583J565J102L192j727l308p33k41k850j370K133M457r40J414Q70J282
$$ -5175 -7758 -6193 -5091 -1899 -3626 -6934 -7667 -7908 -10758 -12128 -9995 -5538 -6478 -5064 -4194 -2912
7774b912m80m597o066m75J980N301O834l57n288p251J076J932l197J268M454J261
$$ -2912 -3392 -7989 -14055 -14530 -12550 -7249 -415 -772 -6060 -13311 -12235 -10303 -13500 -12232 -7778 -6517
7758f517q95j147m419J078k745M860M208J550k295m064j088J103J95K974J066
$$ -6517 -7412 -8559 -12978 -11900 -14645 -9785 -5577 -4027 -6322 -10386 -11474 -10371 -10176 -7202 -6136
7743f136j43K015r93m755m528L885O663M491k03l046Q26k212l829j030m235j691
$$ -6136 -6279 -4264 -5257 -10012 -14540 -10655 -3992 499 296 -2750 -1924 -4136 -7965 -8995 -13230 -14921
7727a4921J9M838J220K86q3K069K100l309J857N06K46o515m378L523O237L397
$$ -14921 -14902 -10064 -8844 -8558 -8641 -6572 -4472 -7781 -5924 -5418 -5172 -11687 -16065 -12542 -6305 -2908
7711b908l474O63N21o06n530o66j582j172j87o13q67j448L241Q92R74J586j365
$$ -2908 -6382 -5719 -5198 -5804 -11334 -12000 -13582 -14754 -14941 -15554 -16421 -17869 -14628 -13736 -12762 -11176 -12541
7694a2541K027L20j634N55K891L345m920K411K964j727n820k200l957J300J697
$$ -12541 -10514 -10194 -11828 -11273 -8382 -5037 -9957 -7546 -4582 -6309 -12129 -14329 -18286 -16986 -15289
7679a5289N058K384J599k306o61K212J962P79L612l440p162j687l453J220N083
$$ -15289 -10231 -7847 -6248 -8554 -9215 -7003 -5041 -4262 -650 -4090 -11252 -12939 -16392 -15172 -10089
7664a0089K32K615J878K801J630L4j322J246N85J260j467k858j510j338L94j914
$$ -10089 -9857 -7242 -5364 -2563 -933 -899 -2221 -975 -390 870 -597 -3455 -4965 -6303 -5909 -7823
7648g823k058k089m282j41K238R0j126m47L235L565K796j922r61k379P18k380
$$ -7823 -9881 -11970 -16252 -16393 -14155 -14065 -15191 -15638 -12403 -8838 -6042 -7964 -8925 -11304 -10586 -12966
7632a2966M487N400J661m295o605n902K643o87L519R02l620k25J562O847O928
$$ -12966 -8479 -3079 -1418 -5713 -12318 -18220 -15577 -16264 -12745 -11843 -15463 -15688 -14126 -7279 -351
7617c51k876m036l502K448J087k499K485k259l658l563L036P10J774J083r80M81
$$ -351 -3227 -7263 -10765 -8317 -7230 -9729 -7244 -9503 -13161 -16724 -13688 -12978 -11204 -10121 -11101 -10620
7601a0620N150M791p190k465j316l997j113K907m09j703O05R44J529l410R69K286
$$ -10620 -5470 -679 -7869 -10334 -11650 -15647 -16760 -13853 -14262 -15965 -15360 -14416 -12887 -16297 -15328 -13042
7585a3042K300M912M21j048j625K768o82m786j453j680k087m699L161M474p14
$$ -13042 -10742 -5830 -5409 -6457 -8082 -5314 -5996 -10782 -12235 -13915 -16002 -20701 -17540 -13066 -13780
7570a3780M613k131o119j470L191J581N265M904q12o527Q43k743O53j83j981N897
$$ -13780 -9167 -11298 -17417 -18887 -15696 -14115 -8850 -3946 -4758 -11285 -10442 -13185 -12532 -12715 -14696 -8799
7554h799J390Ql355J211n200k428j739L047N996K641J717n497m84K752o02K847
$$ -8799 -7409 -7401 -10756 -9545 -14745 -17173 -18912 -15865 -9869 -7228 -5511 -11008 -11492 -8740 -9342 -6495
7538f495Q98j073j668o217j736K240j047P162L819j943Q17L344k438r25J728J279
$$ -6495 -5597 -6670 -8338 -14555 -16291 -14051 -15098 -7936 -4117 -6060 -5243 -1899 -4337 -5262 -3534 -2255
7522b255n527o608j590L382J012K014J818o32k044J584J076K954j408q41K14O37
$$ -2255 -7782 -14390 -15980 -12598 -11586 -9572 -7754 -8386 -10430 -8846 -7770 -4816 -6224 -7065 -6851 -6214
7506f214K396j265l026k646o19J30j298O896K128l185j271m015p059o1M239l55
$$ -6214 -3818 -5083 -8109 -10755 -11374 -11244 -12542 -5646 -3518 -6703 -7974 -11989 -19048 -19109 -14870 -15225
7490a5225P02j930k277K330O660K225k041k301l131l005j023K837J817k669K873
$$ -15225 -14523 -16453 -18730 -16400 -9740 -7515 -9556 -11857 -14988 -17993 -19016 -16179 -14362 -17031 -14158
7475a4158N216j358j3J274j392k796O0K895L141n946m589R99K665K371L89J757
$$ -14158 -8942 -10300 -10313 -9039 -10431 -13227 -13167 -10272 -7131 -13077 -17666 -16667 -14002 -11631 -11242 -9485
7459i485J439k43q71n145K146L57J906o147n464O408M503L125R61L35J483j78
$$ -9485 -8046 -8289 -9160 -14305 -12159 -11802 -9896 -16043 -21507 -15099 -10596 -7471 -6510 -6175 -4692 -4870
7443d870j38m727j788P45q02j8p00Q0R28p06J777L700j672P43N494K941l068K739
$$ -4870 -5008 -9735 -11523 -10778 -11580 -11598 -12298 -12218 -11290 -11996 -10219 -6519 -8191 -7448 -1954 987 -2081 658
7425F58l818j316j477J153J751m321r47K126j484k703j051j25k50K593J93l294
$$ 658 -3160 -4476 -5953 -4800 -3049 -7370 -8317 -6191 -7675 -10378 -11429 -11554 -11804 -9211 -9018 -12312
7409a2312j647J779M421j464j651k562k768J180J889M126k599K087j465j369O3
$$ -12312 -13959 -12180 -7759 -9223 -10874 -13436 -16204 -15024 -13135 -9009 -11608 -9521 -10986 -12355 -12292
7394a2292L157m71l021k412L977j218L91K380j432o327o08L489K903M286J468
$$ -12292 -9135 -9606 -12627 -15039 -11062 -12280 -11889 -9509 -10941 -17268 -17876 -14387 -11484 -7198 -5730
7379e730J307n69l066r5l181j12m050n29K04K902l407k844K501L368N130j925
$$ -5730 -4423 -4992 -8058 -8153 -11334 -11446 -15496 -16025 -15821 -12919 -16326 -19170 -16669 -13301 -8171 -10096
7363a0096K90j915o97J22p11K053K244K852J76J088r88J391j016o018k534j909
$$ -10096 -9806 -11721 -12418 -12296 -13007 -10954 -8710 -5858 -5682 -4594 -5582 -4191 -5207 -11225 -13759 -15668
7347a5668Q78J345l402M188N622J024j920k073n362k619R69J848j053l56M875
$$ -15668 -14790 -13445 -16847 -12659 -7037 -6013 -7933 -10006 -15368 -17987 -17018 -15170 -16223 -16579 -11704
7332a1704M737P88k736n17K074K831l737l365k961K166K447j678O971N412j353
$$ -11704 -6967 -6179 -8915 -9432 -7358 -4527 -8264 -11629 -14590 -12424 -9977 -11655 -4684 728 -625
7317f25m713J29k368m243j972j835j152k35j306P64R00M641L756p98K411j814
$$ -625 -5338 -5209 -7577 -11820 -13792 -15627 -16779 -17014 -18320 -17556 -16656 -12015 -8259 -9057 -6646 -8460
7301h460j483J078J540K98Q33k814o589J768P86l070l718M097Q845N7l462j922
$$ -8460 -9943 -8865 -7325 -7027 -6194 -9008 -15597 -13829 -13043 -16113 -19831 -15734 -6889 -6832 -10294 -12216
7285a2216J396k024o381K133J710J861L753N27j540M820k931N58K528J331l658
$$ -12216 -10820 -12844 -19225 -17092 -15382 -13521 -9768 -9241 -10781 -5961 -8892 -8334 -5806 -4475 -8133
7270h133j99J688j463K24J698l02K588L34L471j468j274J057j642m098l28r73
$$ -8133 -8332 -6644 -8107 -7883 -6185 -6487 -3899 -3565 -94 -1562 -2836 -1779 -3421 -7519 -7847 -8820
7254h820j603M40J691j386L30Q80J261p68L806K004k073k997K349j302j765J025
$$ -8820 -10423 -9983 -8292 -9678 -9348 -8468 -7207 -7975 -4169 -2165 -4238 -7235 -4886 -6188 -7953 -6928
7238f928j760K164N32J009k428j57J221Q1Q73o11J793k833k336K405R67J39l584
$$ -6928 -8688 -6524 -5992 -4983 -7411 -7568 -6347 -6266 -5393 -6004 -4211 -7044 -9380 -6975 -6008 -5869 -9453
7221i453L157j269l0K045J345K23j479j114K107m42K834L320m425k760J030j009
$$ -9453 -6296 -7565 -7595 -5550 -4205 -3982 -5461 -6575 -4468 -4910 -2076 1244 -3181 -5941 -4911 -5920
7205e920j87K667J222K516q75k882n704L7M099N766o11m563n88N378K657M190
$$ -5920 -6107 -3440 -2218 298 -577 -3459 -9163 -9126 -5027 739 128 -4435 -5023 355 3012 7202
7189G202J193J17o982j0731m683P132M144K640K17J328N074l013m956o143M121
$$ 7202 8395 8512 1530 -9201 -13884 -6752 -2608 32 249 1577 6651 3638 -1318 -7461 -3340
7174c340j520j715m028L863L774l358n965k7K930J79m025K808N539l82O336K85
$$ -3340 -4860 -6575 -10603 -6740 -2966 -6324 -12289 -12316 -9386 -9207 -13232 -10424 -4885 -5267 1069 1354
7158A354o990j960J669K295l27n084nk585j028O96N04O040J142L087l983m187
$$ 1354 -5636 -7596 -5927 -3632 -3959 -9043 -9048 -11633 -12661 -11965 -11461 -5421 -4279 -1192 -5175 -9362
7142i362l808R86J66M172M46j581K53l861o48j061k21J466L475m294j780k855
$$ -9362 -13170 -12184 -12018 -7846 -7400 -8981 -8728 -12589 -13237 -14298 -14519 -13053 -9578 -13872 -15652 -18507
7126a8507K140J836J081J098R68n00L951M896J368k247m556m075j478R60M34J537
$$ -18507 -16367 -14531 -13450 -12352 -11384 -11884 -7933 -3037 -1669 -3916 -8472 -12547 -14025 -13065 -12631 -11094
7110a1094K846L12l29J916K35k2K83m79j041K683l04p57j367k617K378L510K679
$$ -11094 -8248 -7936 -8265 -6349 -6114 -6136 -5853 -6332 -7373 -4690 -4994 -5751 -7118 -9735 -7357 -3847 -1168
7093a168o83k790k854K46l76L898K328P48K280j640M41J545r51m155j296L225
$$ -1168 -1851 -4641 -7495 -7249 -7625 -3727 -1399 -651 1629 -11 430 1975 1024 -3131 -4427 -1202
7077a202k185j73k016N064K605Q3q45p364m698N13L160K419j816j280K627j453
$$ -1202 -3387 -3560 -5576 -512 2093 2176 1331 -6033 -10731 -10218 -7058 -4639 -6455 -7735 -5108 -6561
7061f561l82L596M744j904n464M30L881m05N214j431m904j077M189j650j923j147
$$ -6561 -6943 -3347 1397 -507 -5971 -5541 -1660 -2065 3149 1718 -3186 -4263 -74 -1724 -3647 -4794
7045d794k426J337N118K917k833k276j891J847J492p30P33q87k229K413m654K415
$$ -4794 -7220 -5883 -765 2152 -681 -2957 -4848 -3001 -1509 -2239 -1506 -2393 -4622 -2209 -6863 -4448
7029d448N459J369n237N69J371J63j113l062J864J184l250K171J042m425n04J410
$$ -4448 1011 2380 -2857 -2288 -917 -754 -1867 -4929 -3065 -1881 -5131 -2960 -1918 -6343 -6847 -5437
7013e437L416n027r22o7K980L605K805j516k885n233J483L972k938l7K051l62
$$ -5437 -2021 -7048 -7970 -8037 -5057 -1452 1353 -163 -3048 -8281 -6798 -2826 -5764 -5801 -3750 -4112
6997d112m386j94M97k939Q06q33k898J401L715J053K862l360o57J065L484K967
$$ -4112 -8498 -8692 -8195 -11134 -10328 -11161 -14059 -12658 -8943 -7890 -5028 -8388 -9045 -7980 -4496 -1529
6981a529n41k11j968L089n771l457j909J57k337j037J168N339P709N854r9o265
$$ -1529 -2070 -2281 -4249 -1160 -6931 -10388 -12297 -12140 -14477 -15514 -14346 -9007 -1298 4556 4457 -1808
6965a808p039L50j935R09M396m09l493O372K571j818k526J593J612j80K264r43
$$ -1808 -8847 -8497 -10432 -9523 -5127 -5536 -9029 -2657 -86 -1904 -4430 -2837 -1225 -1405 859 -84
6949h4L617k608O9l18M244m411n538l126K807L088p8k596n33p47l184M13O59r01
$$ -84 3533 925 994 676 4920 509 -5029 -8155 -5348 -2260 -2338 -4934 -5467 -6214 -9398 -8985 -8326 -9227
6931i227L812o039l205N512j616r14J638O576L205J366k173p250m165m315K236
$$ -9227 -5415 -11454 -14659 -9147 -10763 -11677 -10039 -3463 -258 1108 -1065 -8315 -12480 -16795 -14559
6916a4559M702K421j847K350R24K758P79K44j815j595p362R33M412k16j307o0
$$ -14559 -9857 -7436 -9283 -6933 -6009 -3251 -2472 -2228 -4043 -5638 -13000 -12067 -7655 -7871 -9178 -9238
6900i238j666l47L539J177k099P3l703k755l10O052K80M652O12k164o106P619
$$ -9238 -10904 -11251 -7712 -6535 -8634 -8561 -12264 -15019 -15329 -9277 -8997 -4345 -3733 -5897 -12003 -4384
6884d384N483k608j088K100J163l472j341l605K725K237J662j811k753J802Q81
$$ -4384 1099 -1509 -2597 -497 666 -2806 -4147 -7752 -5027 -2790 -1128 -2939 -5692 -3890 -3009
6869c009k35k031q92l080l432l274K841N367J595M922P82k962l204l269N94L653
$$ -3009 -3244 -5275 -6167 -9247 -12679 -15953 -13112 -7745 -6150 -1228 -446 -3408 -6612 -9881 -9287 -5634
6853e634K018M908j004n223j282l777k340J190j635J660K495j821k502o53J152
$$ -5634 -3616 1292 288 -4935 -6217 -9994 -12334 -11144 -12779 -11119 -8624 -10445 -12947 -13600 -12448
6838a2448M496K893k19K70j495p57Q13p14j353J570j853N65O097q67k545m963
$$ -12448 -7952 -5059 -5278 -5008 -6503 -7260 -6447 -7161 -8514 -6944 -8797 -8232 -2135 -3002 -5547 -10510
6822a0510J623j175k526J48J048M955N522k377j167j402m533o072K185M502K853
$$ -10510 -8887 -10062 -12588 -12440 -11392 -6437 -915 -3292 -4459 -5861 -10394 -16466 -14281 -9779 -6926
6807f926J813R85K764k440m974J695L208k40k286R24l404J515J080J944k02l033
$$ -6926 -5113 -4128 -1364 -3804 -8778 -7083 -3875 -4115 -6401 -5477 -8881 -7366 -6286 -4342 -4544 -7577
6791g577M10j858p413M455P720M575N577K801l566j1308j3449q050n316J828K305
$$ -7577 -7167 -9025 -16438 -11983 -4263 312 5889 8690 5124 -6184 -19633 -27683 -32999 -31171 -28866
6776b8866N429J0410J5680J7757J1847J1970O362O182M57q913p37j368j7004j1820
$$ -28866 -23437 -13027 2653 20410 32257 44227 50589 56771 57228 48315 47578 46210 29206 17386
6762A7386j0456j2429j0755n705l899k468O358N359J052N225K556j06k077J342
$$ 17386 6930 -5499 -16254 -21959 -25858 -28326 -21968 -16609 -15557 -10332 -7776 -7882 -9959 -8617
6748h617o534j636J135L857M875J520p7k839j932m041j34N100L599q28l131m859
$$ -8617 -15151 -16787 -15652 -11795 -6920 -5400 -5477 -8316 -10248 -14289 -14423 -9323 -5724 -6552 -9683 -14542
6732a4542j358l08L218L953L958m446j671o61M520J567M094p55l178j030J977
$$ -14542 -15900 -16208 -12990 -9037 -5079 -9525 -11196 -11857 -7337 -5770 -1676 -2431 -5609 -6639 -4662
6717d662m78J954k081L269M141Q43l312q470q13K463N543J645l002k522k344M320
$$ -4662 -5140 -3186 -5267 -1998 2143 2986 -326 -8796 -9609 -7146 -1603 42 -2960 -5482 -7826 -3506
6701c506L829k359j106L847M94q366m910J212J0367K585m830j908O426k042l003
$$ -3506 323 -2036 -3142 705 1199 -7167 -12077 -10865 -498 2087 -2743 -4651 1775 -267 -3270
6686c270O098P027J480K89j724L681L612k223O378J2860O577M773J157M859o253
$$ -3270 2828 9855 11335 11624 9900 13581 17193 14970 21348 34208 40785 45558 46715 51574 45321
6671D5321n787n150k670k792n451o694k059k567l878m616p26R84k385j526m121
$$ 45321 39534 34384 31714 28922 23471 16777 14718 12151 8273 3657 2931 3915 1530 4 -4117
6656d117n732J80N613M327j390L467N837l695k014o423l905k831j382K696J743
$$ -4117 -9849 -9669 -4056 271 -1119 2348 8185 4490 2476 -3947 -7852 -10683 -12065 -9369 -7626
6641g626N713J396n15L837o924k788o76J257K43K312r27m402M08J212J523Q82
$$ -7626 -1913 -517 -1032 2805 -4119 -6907 -7583 -6326 -6083 -3771 -4698 -9100 -8692 -7480 -5957 -5075
6625e075l73O4j336J8n294j062L978M573M20j432j791j044j547K451J712p45k551
$$ -5075 -5448 -5384 -6720 -6702 -11996 -13058 -9080 -4507 -4087 -5519 -7310 -8354 -9901 -7450 -5738 -6483 -9034
6608i034K470Q17M20J231j676J260N653L059j812m934o405J584m127J63K534j387
$$ -9034 -6564 -5747 -5327 -4096 -5772 -4512 1141 4200 2388 -2546 -8951 -7367 -11494 -11331 -8797 -10184
6592a0184K904K517l95r05m056j823P87J535O395K192j79j173k687J577L706j467
$$ -10184 -7280 -4763 -5158 -6063 -10119 -11942 -11155 -9620 -3225 -1033 -1212 -2385 -5072 -3495 211 -1256
6576a256j891K05M900L5k318j682j324N346j823k301m882K849j403l282l86m39
$$ -1256 -3147 -2942 1958 1993 -325 -2007 -3331 2015 192 -2109 -6991 -4142 -5545 -8827 -9213 -9652
6560i652L935M590K767q69n718j811j078j046K594P41K180N932N428P2j0841r837
$$ -9652 -5717 -1127 1640 771 -4947 -6758 -7836 -8882 -6288 -5547 -3367 2565 7993 8065 -2776 -12613
6544a2613j342K981K635l107k144M865K243L739k318M937L041K384j427j891j78
$$ -12613 -13955 -10974 -8339 -11446 -13590 -8725 -6482 -2743 -5061 -124 2917 5301 3874 1983 1805
6529A805K7L347j825q064n14K988M69L560O00j349L990j163q062L838O238J139
$$ 1805 1832 5179 3354 -4710 -5224 -2236 -1767 1793 2393 1044 5034 3871 -4191 -353 5885 7024
6513G024n767l543k997k086L525N71j992P60J207j224J651l901J237J081N473
$$ 7024 1257 -2286 -5283 -7369 -3844 -3273 -5265 -4505 -3298 -4522 -2871 -6772 -5535 -4454 1019
6498A019M11k496l038m126L904K24j095j046J546L327k037p70p091r90L050N358
$$ 1019 1430 -1066 -4104 -8230 -4326 -4102 -5197 -6243 -4697 -1370 -3407 -4177 -11268 -12258 -9208 -3850
6482c850K842k239o922k464L632l116p79K675M788N118J694p76O5o101J06L005
$$ -3850 -1008 -3247 -10169 -12633 -9001 -12117 -12896 -10221 -5433 -315 1379 603 668 -5433 -5327 -2322
6466b322K915R5K063j641J97N28j154J95J744m158J65Q68m799k38J593j274o52
$$ -2322 593 688 2751 1110 1307 1835 681 876 2620 -1538 -1373 -505 -5304 -5542 -3949 -5223 -5875
6449e875M765N608k226o282J824p97k669J801K131n71j046K49K378N636n184n076
$$ -5875 -1110 4498 2272 -4010 -2186 -2983 -5652 -3851 -1720 -2291 -3337 -3088 -710 4926 -258 -5334
6433e334N22K535M482q7k762j320O23P48j46q53q03k26k627N83K30j150J088Q28
$$ -5334 -4812 -2277 2205 2118 -644 -1964 -1341 -593 -739 -1592 -2395 -2621 -5248 -4665 -4435 -5585 -4497 -3669
6415c669J319N170K385n484n76Q95k425p91l310j808M259l969m5M223L050Q11
$$ -3669 -2350 2820 5205 -279 -855 40 -2385 -3176 -6486 -8294 -4035 -8004 -8049 -3826 -776 35
6399C5k641j555p86k887J430L788M100J78n414K417N449r06l692j738P301M122
$$ 35 -2606 -4161 -4947 -7834 -6404 -2616 1484 1662 -3752 -1335 4114 3208 -484 -2222 5079 9201
6383I201k92l999K066k928j787L36j914K663K940l987l337l352k918j030r96K001
$$ 9201 8909 4910 6976 4048 2261 2597 683 3346 6286 2299 -1038 -4390 -7308 -8338 -9334 -7333
6367g333J537M160k676J622K49N07m743j815k143N35M620j548J345L677K804o705
$$ -7333 -5796 -1636 -4312 -2690 -2441 -1934 -6677 -8492 -10635 -10100 -5480 -7028 -5683 -2006 798 -5907
6351e907m914L376K409m206k946K498L689N549J441q10K486N023l691l679M027
$$ -5907 -10821 -7445 -5036 -9242 -12188 -9690 -6001 -452 989 179 2665 7688 3997 318 4345
6336D345m29j109j737J657J981J321J533l255n454L903L144m366m365J842m659
$$ 4345 3916 2807 1070 2727 4708 6029 7562 4307 -1147 2756 5900 1534 -2831 -989 -5648
6321e648K161J785J049k63o626q3K168K935M974M729k308o228M9K907j731l578
$$ -5648 -3487 -1702 -653 -916 -7542 -7625 -5457 -2522 2452 7181 4873 -1355 -1306 1601 -130 -3708
6305c708n335l078J49k671k092L76J868M653M376j115L004L36K894p82L8l13k077
$$ -3708 -9043 -12121 -11972 -14643 -16735 -16359 -14491 -9838 -5462 -6577 -3573 -3237 -343 -1125 -1087 -1400 -3477
6288c477l468j306K507L732L379N32J271n030k791p780P118M541k465K003K518
$$ -3477 -6945 -8251 -5744 -2012 1367 1899 3170 -1860 -4651 -12431 -5313 -772 -3237 -1234 1284
6273A284j039n57J332p83m710L02K197K204N726r24l360k456n16j472k121K080
$$ 1284 245 -312 1020 237 -4473 -4171 -1974 230 5956 5032 1672 -784 -1300 -2772 -4893 -2813
6257b813J353K314N230j368k395k478o94r02M348k969n487K606K900q48R04K511
$$ -2813 -1460 854 6084 4716 2321 -157 -851 -1753 2595 -374 -5861 -3255 -355 -1203 -299 2212
6241B212m017j618K204m39L844n43P50n650j544M797O40K69k301j040k288J49
$$ 2212 -1805 -3423 -1219 -1658 2186 1643 2393 -3257 -4801 -4 636 905 -1396 -2436 -4724 -4575
6225d575k111k075o37L846n34J548j732J652l301m092L865k014J516M007n005
$$ -4575 -6686 -8761 -9398 -5552 -6086 -4538 -6270 -4618 -7919 -12011 -8146 -10160 -8644 -4637 -9642
6210i642J195L752J307k983k432n708M528O666O933m797k648N633O07o08L70k485
$$ -9642 -8447 -4695 -3388 -6371 -8803 -14511 -9983 -3317 3616 -1181 -3829 1804 2411 1803 2173 -312
6194c12l7M94k182m632J340j835Q70j98Q39K737M477j111m622j633L807j257m426
$$ -312 -349 145 -2037 -6669 -5329 -7164 -6294 -6492 -5653 -2916 1561 450 -4172 -5805 -1998 -3255 -7681
6177g681l86k000m075N784R551M439l583n457j210l153m205P743K198J5k526j781
$$ -7681 -8067 -10067 -14142 -8358 1193 5632 2049 -3408 -4618 -7771 -11976 -4233 -2035 -2020 -4546 -6327
6161f327L563k100m308M276J340k38J825M33l217j608m341L913N636K84K031j529
$$ -6327 -2764 -4864 -9172 -4896 -3556 -3794 -1969 -1536 -4753 -6361 -10702 -6789 -1153 -869 1162 -367
6145c67r58j673m374m07L559O595M270n025q08k37J521j30o92k477j804j873J242
$$ -367 -1325 -2998 -7372 -7779 -4220 2375 6645 1620 812 575 2096 1966 1274 -1203 -3007 -4880 -3638
6128c638k254J166L4N54M143j199n175o442L395M762J657L208n166l730K136L917
$$ -3638 -5892 -4726 -4692 -4138 5 -1194 -6369 -12811 -9416 -4654 -2997 211 -4955 -8685 -6549 -2632
6112b632L886p07n349j38L876J383k422j149J105Q3K291j710J421M20m093n736
$$ -2632 1254 547 -4802 -4940 -1064 319 -2103 -3252 -2147 -2064 227 -1483 -62 358 -3735 -9471
6096i471n036K728P446J196k553l244j619P845K168L845L417m89q529j725K715
$$ -9471 -14507 -11779 -4333 -3137 -5690 -8934 -10553 -2708 -540 3305 6722 6233 -2296 -4021 -1306
6081a306K895K47j369k457k079Q2n45j896M98J971K56M900L946l302l830j959
$$ -1306 1589 1836 467 -1990 -4069 -3987 -4532 -6428 -5930 -3959 -3703 1197 5143 1841 -1989 -3948
6065c948k263K203K77O4K088M113j534J5J552J457l466n911J550J57j92L408K057
$$ -3948 -6211 -4008 -3731 -3667 -1579 2534 1000 1015 2567 4024 558 -5353 -3803 -3646 -3838 -430 1627
6048A627j995l073R41L125K521m74j418p101J215m33P25l908j841j646J039J82
$$ 1627 -368 -3441 -2500 625 3146 2672 1254 -5847 -4632 -5065 -4340 -8248 -10089 -11735 -10696 -10514
6032a0514P614M813k117p87j79p828j463L919M541R43J82q33M25l525n381o078
$$ -10514 -2900 1913 -204 -991 -1170 -8998 -10461 -6542 -2001 -1058 -876 -1709 -1284 -4809 -10190 -16268
6016a6268J945N045L604L254j150O16N546k700l333M66q99l10L466l60l17j463
$$ -16268 -14323 -9278 -5674 -2420 -3570 -2954 2592 -108 -3441 -2975 -3874 -4184 -718 -1078 -1395 -2858
6000b858k178l754Q94M096J448k415m48k381n806K303O972O768O61j340j274m835
$$ -2858 -5036 -8790 -7896 -3800 -2352 -4767 -5215 -7596 -13402 -11099 -4127 2641 3302 1962 688 -4147
5984d147j526L8m42N816J28m882k798m46L235K90k55j88J896J016k177k30j025
$$ -4147 -5673 -5635 -6077 -261 -133 -5015 -7813 -8259 -5024 -4734 -4989 -5177 -3281 -2265 -4442 -4672 -5697
5967e697J481k806j515j05L32R54M562o118o303j351L032M221P84m191K345P735
$$ -5697 -4216 -7022 -8537 -8642 -8310 -7356 -2794 -8912 -15215 -16566 -13534 -9313 -8529 -12720 -10375 -2640
5951b640M414j725O88l61l260m092J117j274n622J823O813L263J08J905r14m686
$$ -2640 1774 49 737 376 -2884 -6976 -5859 -7133 -12755 -10932 -4119 -856 -748 1157 243 -4443
5935d443j455N39J102L524K131r68l812j074p26L069j171K153J405m59j213j557
$$ -4443 -5898 -5359 -4257 -733 1398 430 -3382 -4456 -5182 -2113 -3284 -1131 274 -185 -1398 -2955
5919b955k487L590n03K437k910j190Q21P36J535L833l574n741K206O726j804j911
$$ -2955 -5442 -1852 -2355 82 -2828 -4018 -3197 -2461 -926 2907 -667 -6408 -4202 2524 720 -1191
5903a191K692L219k104l494L728o8o531l735k880N64K048N236L402m4L59J231
$$ -1191 1501 4720 2616 -878 2850 2782 -3749 -7484 -10364 -9800 -7752 -2516 886 842 1201 2432
5887B432L364M386J85J058j868o985k534m716L376j43m07P42l108k54L527j06
$$ 2432 5796 10182 10367 11425 9557 2572 38 -4678 -1302 -1445 -1852 -1110 -4218 -4472 -945 -1051
5871a051k499j534k575m40P379Q7J201l475o35m46r15Q28J807j899j264R7K010
$$ -1051 -3550 -5084 -7659 -8099 -720 -633 568 -2907 -3542 -3988 -4903 -4075 -2268 -4167 -5431 -5334 -3324
5854c324P216N333l132k532J174J075M831l415k988J06l437n058L774J575k943
$$ -3324 3892 9225 6093 3561 4735 5810 10641 7226 4238 4344 907 -4151 -377 1198 -1745
5839a745J804R03m45N66M99m228k117n68J313j46l521j463L57j579L000m654p72
$$ -1745 59 962 517 1083 1582 -2646 -4763 -5331 -4018 -4164 -7685 -9148 -8791 -10370 -7370 -12024 -12796
5822a2796Q068k251k256L88L304P277N301L27o334l662k784J235q04P58j553L077
$$ -12796 -4728 -6979 -9235 -8847 -5543 1734 7035 7362 1028 -2634 -5418 -4183 -4987 -4229 -5782 -2705
5806b705k5j73N34J162L388J600j120p74k259m746k287L91p2M518J398R19K185
$$ -2705 -2730 -2903 -2369 -1207 2181 3781 2661 1887 -372 -5118 -7405 -7014 -7086 -2568 -1170 -251 1934
5789A934k822o350K741K398J936O5m86j192m002Q33N015N53m155n20j135K027
$$ 1934 -888 -7238 -4497 -2099 -163 -98 -584 -1776 -5778 -4945 70 623 -3532 -4052 -5187 -3160
5773c160L763l902j848L579L849l58j413J958L073m50p585j396j873l718K79L84
$$ -3160 603 -3299 -5147 -1568 2281 1923 510 2468 5541 5091 -2494 -3890 -5763 -9481 -9202 -8818
5757h818J321N328K101j455L406p33j378p76j915J953M496j527n65l098L74J821
$$ -8818 -7497 -2169 -68 -1523 1883 1150 -228 -1004 -2919 -966 3530 2003 1438 -1660 -1286 535
5741E35p38L697M83l819J267L47J323n200k615r51O453k127k692K021J413K214
$$ 535 -203 3494 3977 158 1425 1772 3095 -2105 -4720 -5671 782 -1345 -4037 -2016 -603 1611
5725A611j345N83j032p207j773j285M660N820p730k346J366L904l72k004k268
$$ 1611 266 849 -183 -7390 -9163 -10448 -5788 32 -7698 -10044 -8678 -4774 -5146 -7150 -9418
5710i418K166R3j294j85K958L010K971k729k365J474K334L042k001p403j397O374
$$ -9418 -7252 -7159 -8453 -8638 -5680 -2670 301 -2428 -4793 -3319 -985 2057 56 -7347 -8744 -2370
5694b370O001M871J900m362r792N39n301M4M319J040L301M244o27k501J48m441
$$ -2370 3631 8502 10402 6040 -3752 -3213 -8514 -8470 -4151 -3111 190 4434 3807 1306 1454 -2987
5678b987L20K123N144R16j132M477K660l322j557J522J766J114o78m484k355k315
$$ -2987 -2667 -544 4600 5516 4384 8861 11521 8199 6642 8164 9930 11044 10366 5882 3527 1212
5662A212J384J493l224j202N79K676p72O85J007q634k698O930O00k13J386M647
$$ 1212 2596 4089 865 -337 242 2918 2146 2831 3838 -4796 -7494 -564 36 -177 1209 5856
5646E856J841j817r52m96l394Q38J310n04k892J789l754R28L2M360k669P92j648
$$ 5856 7697 5880 4928 4432 1038 1876 3186 2682 -210 1579 -2175 -1247 -1215 3145 476 1268 -380
5629c80j415J524J773M988j73Q29n024m411k489R31L557J404k565L46J018L189
$$ -380 -1795 -271 1502 6490 6317 7146 2122 -2289 -4778 -3847 -290 1114 -1451 -1105 -87 3102
5613C102n22o510R6N56n90k31j416K082L192N448N52k516k309n156l899m746l007
$$ 3102 2580 -3930 -3834 -3278 -3868 -4099 -5515 -3433 -241 5207 5759 3243 934 -4222 -8121 -12867 -15874
5596a5874L960M294R021m079m298J20J588N288J603j37O33j3r17k045m508j135
$$ -15874 -11914 -7620 1401 -2678 -6976 -6856 -5268 20 1623 1486 2119 2106 1189 -856 -5364 -6499
5580f499Q48M883m862p33L749q44n07R97n65j54L152K710Q94j117L85K625J205
$$ -6499 -5651 -768 -5630 -6363 -2614 -3458 -3965 -2968 -3533 -3687 -535 2175 3069 1952 2337 4962 6167
5563F167Q56K275j460o984m739k8J335J733J101r24k222J473p27r5j227J091K239
$$ 6167 7023 9298 7838 854 -3885 -3913 -2578 -845 256 -668 -2890 -1417 -2144 -2239 -3466 -2375 -136
5546a36M465L248k560j259r43p779K497L280j777j42J542k215m649j727M112N258
$$ -136 4329 7577 5017 3758 2815 -4964 -2467 813 -964 -1106 436 -1779 -6428 -8155 -4043 1215
5530A215L772k296L23L954j857j627J181J913O1l934K14j064j48M17j789l728
$$ 1215 4987 2691 3014 6968 5111 3484 4665 6578 6639 2705 2919 1855 1707 2124 335 -3393
5514c393m452L866M204K958q79J467L724k178m822P42K898q185o96N406L165l100
$$ -3393 -7845 -3979 225 3183 2304 3771 7495 5317 495 1237 4135 -4050 -4746 660 3825 725
5498G25J835j478o237k043K240L298L025J438L315n192o114l363K467m06L891
$$ 725 2560 1082 -5155 -7198 -4958 -1660 1365 2803 6118 926 -5188 -8551 -6084 -6490 -2599
5483b599K404J274N719k06M465m974m057m044l568L47K968j73K054J208J370J896
$$ -2599 -195 1079 6798 6592 11057 6083 2026 -2018 -5586 -5239 -2271 -2444 -390 818 2188 4084
5467D084N503l823l207L229K080n289n765j693j548P084R719K908n852j958l143
$$ 4084 9587 5764 2557 5786 7866 2577 -3188 -4881 -6429 655 10374 13282 7430 5472 2329
5452B329j210j217k448q41J730J28J669p36K045K046k699J83M077L9o127k970
$$ 2329 1119 -98 -2546 -3387 -1657 -1529 140 -596 1449 3495 796 979 5056 5095 -1032 -4002
5436d002K44M041O789J52j43j371k700K179l267l828J512K608J403l245l969K938
$$ -4002 -3758 283 7072 7224 7081 5710 3010 5189 1922 -1906 -394 2214 3617 372 -3597 -659
5420f59J464M336L592j26l276j84n590J389J867o48k75Q03K391Q20k448l079o373
$$ -659 805 5141 8733 8607 5331 5147 -443 946 2813 2165 1890 2693 5084 5904 3456 377 -5996
5403e996l169P85r12L169L572L189M320n016p99O11K239k690k936L636N204k977
$$ -5996 -9165 -8380 -9292 -6123 -2551 638 4958 -58 -857 -246 1993 -697 -3633 3 5207 2230
5387B230l248J366K644L44J058k055J38L674J822l839n189J511K728k604J137
$$ 2230 -1018 348 2992 3336 4394 2339 2477 6151 7973 4134 -1055 456 3184 580 1717
5372A717j12l27M188J938n453n323L784L608k690l511L627N178n084p598M014
$$ 1717 1605 1278 5466 7404 1951 -3372 412 4020 1330 -2181 1446 6624 1540 -6058 -2044
5357b044K521p81k991k803N649L209j689o40N06o31k018l221L639p65L42L104
$$ -2044 477 -304 -3295 -6098 -449 2760 1071 431 937 306 -1712 -4933 -1294 -2059 -1717 1387
5341A387L814m055m984j280K457K052K736K554K473k256k389P708n20q815k223
$$ 1387 5201 1146 -3838 -5118 -2661 -609 2127 4681 7154 4898 2509 10217 9697 882 -1341
5326a341L007Q28j340o82k289L563K781k553k51l345q94L124N596O93M2J68n699
$$ -1341 1666 2494 1154 472 -1817 1746 4527 1974 1723 -1622 -2516 608 6204 6897 6939 7107 1408
5309A408k562L670M562L846k159n89n01k495Q41K452n325n710Q6N418p37J218
$$ 1408 -1154 2516 7078 10924 8765 8176 7675 5180 6021 8473 3148 -2562 -2476 2942 2205 3423
5293C423k78k497N086j154L253n10k016m281l069j053K50L206J220r63l726J93
$$ 3423 3145 648 5734 4580 7833 7323 5307 1026 -2043 -3096 -2846 360 1580 617 -3109 -2916
5277b916r71P15L388K180j954l532Q02K618l238J50q83Q30K733J642K2l816K24
$$ -2916 -3887 -3172 216 2396 442 -3090 -2288 330 -2908 -2758 -3641 -2811 -78 1564 1586 -2230 -2006
5260b006M723L413l599j545K727M586M292o00O43n152r123l799L808N892j409
$$ -2006 2717 6130 2531 986 3713 8299 12591 11991 12634 7482 -1641 -5440 -1632 4260 2851
5245B851k600K290j579J684K952j338k893J316L049o204m321j283K90J464M256
$$ 2851 251 2541 962 2646 5598 4260 1367 2683 5732 -472 -4793 -6076 -5786 -4322 -66
5230f6l038l944j128L025P189q13M37P188k356m014m104j314K870N955O139n618
$$ -66 -3104 -7048 -8176 -5151 2038 1225 1662 8850 6494 2480 -1624 -2938 -68 5887 12026 6408
5214F408q640p58L645L496K706j196j49l241k902J027k122Q27K90k638l145J348
$$ 6408 -2232 -2990 655 4151 6857 5661 5512 2271 -631 396 -1726 -899 -609 -3247 -6392 -5044
5198e044L133j18N66K732P66l003k494J426L393N646J449n34R86j447O49j733
$$ -5044 -1911 -2029 -1463 1269 2035 -968 -3462 -2036 1357 7003 8452 7918 8904 7457 8106 6373
5182F373l03P68n639J443L801K501L191m876n729n09k944J590J362k759k312L268
$$ 6373 6070 6838 1199 2642 6443 8944 12135 7259 1530 1021 -1923 -333 1029 -1730 -4042 -774
5166g74L463L672m19m32k793J977r70p369p53r11M453M689Q07Q69k388K385N90
$$ -774 2689 6361 5942 5510 2717 4694 3724 -3645 -4398 -5309 -856 3833 4640 5509 3121 5506 6096
5149F096k012k781P143M096J354l481j122k291q5l752m104r38K279N030O86k756
$$ 6096 4084 1303 8446 12542 13896 10415 9293 7002 6917 3165 -939 -1877 402 5432 6118 3362
5133C362n898K476l034K726N85n63J142o790m452K235K687K452Q76j862k061P476
$$ 3362 -2536 -60 -3094 -368 217 -346 796 -5994 -10446 -8211 -5524 -3072 -2196 -4058 -6119 1357
5117A357Q476k255m785j42l19K645J998j630O356O215o641l910p966p5K83N39
$$ 1357 9833 7578 2793 2651 2332 4977 6975 5345 11701 17916 11275 7365 -601 -676 -393 146
5101A46K773k946J691l41j36l327r63j005L153O00k046J347j874q12J500O49M036
$$ 146 2919 -27 1664 1323 1187 -2140 -3103 -4108 -955 -355 -2401 -1054 -2928 -3740 -2240 -1591 2445
5084B445M93r82j425K565J485k429l517l686K222k118jP395O191m594o684j9K17
$$ 2445 2938 1956 531 3096 4581 2152 -1365 -5051 -2829 -4947 -4948 2447 8638 4044 -2640 -2659 -2442
5067b442j589K197L651K32j031J859k155k454J502M677L906k269l873l888J933
$$ -2442 -4031 -1834 1817 2049 1018 2877 722 -1732 -230 4447 8353 6084 2211 -1677 256
5052B56J157j62k179j900K152N78O029j323m340K590K979K020l169j951k862l344
$$ 256 1413 1251 -928 -2828 -676 -98 5931 4608 268 2858 5837 7857 4688 2737 -125 -3469
5036c469J284k759J081N62R1j827L296L038m578l53r70m000R94O028K109l309
$$ -3469 -2185 -4944 -3863 -3301 -3210 -5037 -1741 1297 -3281 -3634 -4604 -8604 -7610 -1582 527 -2782
5020b782M899N289L324p482m270J36j789Q80N023J43k535N238K000k691K246p167
$$ -2782 2117 7406 10730 3248 -1022 -886 -2675 -1795 3228 3371 836 6074 8074 5383 7629 462
5004D62o634M464k277p7N489j070J574O68l027k71j331J116J192R46M81N33L082
$$ 462 -6172 -1708 -3985 -4062 1427 357 1931 2599 -428 -699 -2030 -914 278 1224 1705 2238 5320
4987E320j581M243j127k065j340m507m524j653N760L942Q20M923J862r44J009
$$ 5320 3739 7982 6855 4790 3450 -1057 -5581 -7234 -1474 2468 3288 8211 10073 9129 10138
4972A0138l676j399l012j010M220J147j602J689J148q112m246P612K886j568j232
$$ 10138 6462 5063 2051 1041 5261 6408 4806 6495 7643 -469 -4715 2897 5783 4215 2983
4957B983j552k191L555L019j022M258J660O71j679l230o25j14k933j633K554k97
$$ 2983 1431 -760 2795 5814 4792 9050 10710 11381 9702 6472 5847 5733 2800 1167 3721 3424
4941C424R72J037r03n807l719K388N022J520L118k82l047R57l701k547M048J688
$$ 3424 4396 5433 4530 -1277 -4996 -2608 2414 3934 7052 6770 3723 4680 979 -1568 2480 4168
4925D168J309n50k189j712k969o9J632L868L073j804k838J486N79J402K304m326
$$ 4168 5477 4927 2738 1026 -1943 -2012 -380 3488 6561 4757 1919 3405 3984 5386 7690 3364
4909C364j35J193m429k068K707n48k4k118k626L588O83P568j274m303k762J054
$$ 3364 3229 4422 -7 -2075 632 84 60 -2058 -4684 -1096 -413 7155 5881 1578 -1184 -130
4893a30N059M6L091m858n96J635N72m488j787O231P83M1K366J081K76l307l349
$$ -130 4929 4975 8066 3208 2612 4247 4819 331 -1456 4775 5558 5599 7965 9046 9322 6015 2666
4876B666N70N317J269l16m766j697K00l25J920K4m349k99j851L237K030o06N33
$$ 2666 3236 8553 9822 9506 4740 3043 3243 2918 4838 4862 513 214 -1637 1600 3630 3024 3557
4859C557k046k41j222L520Q51K414l253R63j575k857k743L636j825J194r99l001
$$ 3557 1511 1270 48 3568 4419 6833 3580 4543 2968 111 -2632 1004 -821 373 -626 -3627
4843c627L867L76k668J500K849J372J143k826k453l8L12m152m080M029J183Q5
$$ -3627 240 616 -2052 -552 2297 3669 4812 1986 -467 -505 -193 -4345 -8425 -4396 -3213 -3128
4827c128M787J549J303l302l579K098P205M230j080r50P00K426K112m570n666
$$ -3128 1659 3208 4511 1209 -2370 -272 6933 11163 10083 9133 9833 12259 14371 9801 4135
4812D135j941m74j292L100P38r51O67M431k978q49K573n89J711Q70j926n89N46
$$ 4135 2194 1720 428 3528 4266 3315 3982 8413 5435 4586 7159 6570 8281 9151 7225 6636 7182
4795G182j235P09l554n325j862o08L457L658j047J80P969n48j050m539n220j501
$$ 7182 5947 6656 3102 -2223 -4085 -4693 -1236 2422 1375 1555 9524 8976 7926 3387 -1833 -3334
4779c334M725j820k43J698M38k223l646L848L421J735l697l842L397L180l612
$$ -3334 1391 -429 -672 1026 1464 -759 -4405 -557 2864 4599 902 -2940 457 3637 25
4764B5q72k169k891M535M327m394k819j509R5j879M224M927r43n123Q99M178k431
$$ 25 -847 -3016 -5907 -1372 2955 -1439 -4258 -5767 -5672 -7551 -3327 1600 657 -4466 -3567 611 -1820
4747a820j507N55k25L49m304O344L723J181M764m400q645j163Q10J52j284L257
$$ -1820 -3327 -2772 -2997 -2648 -6952 -608 3115 4296 9060 4660 -3985 -5148 -4338 -4186 -5470 -2213
4731b213K466k72M596K019O54j346K830O145n328p464n485k27k23n090r07K949
$$ -2213 253 -19 4577 6596 7250 5904 8734 14879 9551 2087 -3398 -3625 -3848 -8938 -9845 -6896
4715f896P025M280L931m81o833m927j943J269R369K197l175L08N235j063n079
$$ -6896 129 4409 8340 7859 1026 -3901 -5844 -4575 4794 6991 3816 4124 9359 8296 3217
4700C217m689n022M242N675k150j013l566N917O239N05q985m205k339N906Q135
$$ 3217 -1472 -6494 -2252 3423 1273 260 -3306 2611 8850 9355 370 -3835 -6174 -268 7867
4685G867N491l709k035m376k985K91k451n119j40L746K252j134k340N24k23j291
$$ 7867 13358 9649 7614 3238 253 544 -1907 -7026 -7166 -3420 -1168 -2302 -4642 -4118 -4341 -5632
4669e632J101q29R98J698M332J379J933K573k589k812j07K314j82m897k852O204
$$ -5632 -4531 -5360 -4362 -2664 1668 3047 4980 7553 4964 2152 2045 4359 4177 -720 -3572 2632
4653B632l628O94J807k257N016L873J314j873k936K997j827j522J18J842k320
$$ 2632 -996 -302 1505 -752 4264 8137 9451 7578 4642 7639 5812 4290 4408 6250 3930
4638C930q04k494Q15M02k189J970j118j658K526m334j555K785M764K862J09r28
$$ 3930 3126 632 1447 1849 -340 1630 512 -1146 1380 -2954 -4509 -1724 3040 5902 6011 5083
4622E083k128j102M29L216m57j92k448l061j32O95L057k4q0M13j010j706J000
$$ 5083 2955 1853 2282 5498 5041 4849 2401 -660 -792 -97 2960 2936 2856 3269 2259 553 1553
4605A553n677k216M926O392m185p481K205M398K784L395l015n207M10J48r28j098
$$ 1553 -4124 -6340 -1414 4978 793 -6688 -4483 -85 2699 6094 3079 -2128 -1718 -1570 -2498 -3596
4589c596k090K25K255L039R92o850m16K268M232R236p13q439l554P279J1174R05
$$ -3596 -5686 -5461 -3206 -167 825 -6025 -6441 -4173 59 9295 8582 143 -3411 3868 15042 15947
4573A5947p203J54N613N593M662k923o494o838k328M894K706O21l565j0902j808
$$ 15947 8744 8898 14511 20104 24766 21843 15349 8511 6183 11077 13783 14404 10839 -63 -1871
4558a871J653m488N753J508p122j840r00K517l335L017K169l126L100M387l907
$$ -1871 -218 -4706 1047 2555 -4567 -6407 -7307 -4790 -8125 -5108 -2939 -6065 -2965 1422 -2485
4543b485n48M448l314o54J6k104J517j491k081L035q36n94M703N66l136L949J642
$$ -2485 -3033 1415 -1899 -2553 -2537 -4641 -3124 -4615 -6696 -3661 -4497 -5091 -388 178 -2958 991 2633
4526B633l856n006r88K760L006R74j872j651q87R66L268J303M123R82K921k300
$$ 2633 -1223 -6229 -7217 -4457 -1451 -477 -2349 -4000 -4887 -3921 -653 650 4773 5755 8676 6376
4510F376k476p578r39M273j50l353N341K566m286l308k478N32O14k157L195Q59
$$ 6376 3900 -3678 -4617 -344 -494 -3847 1494 4060 -226 -3534 -6012 -5480 -4866 -7023 -3828 -2969
4494b969L013J805j789j782L269k346k536O026K156n08P388Q62o002l780R50M50
$$ -2969 44 1849 60 -1722 1547 -799 -3335 2691 4847 4339 11727 12589 6587 2807 3757 4207
4478D207J50r38n991j239L870M771n8k263o999nO986j335j082j546k516M304N25
$$ 4207 4357 3419 -2572 -3811 59 4830 4772 2509 -4490 -4495 2491 1156 74 -1472 -3988 316 841
4461H41L68k009k033n445J644R596M481k542l659M3Q37kk794M004J294K386n26
$$ 841 1209 -800 -2833 -8278 -6634 2962 7443 4901 1242 1285 2122 2120 -674 3330 4624 7010 6484
4444F484J52L286j446q460K918O291m119k634k656J738k84L575j22K585K352J063
$$ 6484 6636 9922 8476 16 2934 9225 5106 2472 -184 1554 1270 4845 4723 7308 9660 10723
4428A0723M106l85n544J099m01J966J13n95k82j18lm863l636l216Q69J949J563
$$ 10723 14829 14444 8900 9999 9598 11564 11677 11082 10800 10682 10679 5816 2180 -1036 -167 1782 3345
4411C345k909Q19K004k019O45k99j491j666K706O211R03J836R1j12j873l199l577
$$ 3345 436 1255 3259 1240 1885 1586 95 -1571 1135 7346 8249 10085 10176 10064 8191 4992 1415
4394A415J583O185M611k253o462j176R848m125p706O96k367q0K973M829K903j790
$$ 1415 2998 9183 13794 11541 5079 3903 13751 9626 1920 2616 249 169 3142 7971 10874 9084
4378I084j003K064j744j886m709l076K621J167j079n30J11J506L776J666l620
$$ 9084 8081 10145 8401 6515 1806 -1270 1351 2518 1439 909 1020 2526 6302 7968 4348
4363D348n194j145Q24j458r15j629M611j961l266K939J000j78j283L39L480n07
$$ 4348 -846 -1991 -1167 -2625 -3540 -5169 -558 -2519 -5785 -2846 -1846 -2024 -3307 -2968 512 5
4347EL419L222L028j980j961m17R69j119o444r01J716Q36j747J290k520k142j637
$$ 5 3424 6646 9674 7694 5733 5316 6285 5166 -1278 -2179 -463 373 -1374 -84 -2604 -4746 -6383
4330f383l17J925K762l628m380O91P130O120j404L057N849k519k767L275J995
$$ -6383 -6700 -4775 -2013 -5641 -10021 -9330 -2200 3920 2516 5573 11422 8903 6136 9411 11406
4315A1406J153k274j0789l959p51j446M611n08l387K203l72m866m285O743O831
$$ 11406 12559 10285 -504 -4463 -5214 -6660 -2049 -2557 -5944 -3741 -4113 -8979 -13264 -6521 310
4300C10P9k629K895k973M667K027o1M17j352l063o66N25O64l895n364K594K997
$$ 310 389 -2240 655 -2318 2349 4376 4315 4732 3380 317 -349 176 840 -3055 -8419 -5825 -2828
4283b828p5M118J097j772j899j975N27k646O190O352q42N711k635J095R40k219
$$ -2828 -2903 1215 2312 540 -1359 -3334 -2807 -5453 737 7089 6247 11958 9323 10418 11358 9139
4267I139l941M31q69l298o215J050J909o1n24k334P40k600J031M020L72M58L654
$$ 9139 5198 5629 4760 1462 -4753 -3703 -1794 -1855 -2379 -4713 -3973 -6573 -5542 -1522 -1150 -692 2962
4250B962P558M858k200m580j180m353N152J538j076p93l460L58L402k865q80j566
$$ 2962 10520 15378 13178 8598 7418 3065 8217 9755 8679 7886 4426 4784 8186 5321 4441 2875
4234B875m243K159M863l85L578J425K931P46j847o201j439j786K943j081J136
$$ 2875 -1368 791 5654 5269 8847 10272 13203 13949 12102 5901 4462 2676 5619 4538 5674
4219E674M7n525M025O66J197r93R55j420j422j324L060j383n038l958K325M425
$$ 5674 5721 196 4221 4887 6084 5091 6046 4626 3204 1880 4940 3557 -1481 -5439 -3114 1311
4203A311k9J366J585J169l391l23k195l543M252M73r625k209K081P802M976Q28
$$ 1311 1282 2648 4233 5402 2011 1688 -507 -4050 202 675 -8950 -11159 -9078 -1276 3700 4528
4187D528k335L295L987n161p291l776k626L103K436Q652J219k549j544L443k248
$$ 4528 2193 5488 9475 4314 -2977 -6753 -9379 -6276 -3840 4812 6031 3482 1938 5381 3133
4172C133j467k022K152Q03K713q91j158J548L938k198Q01R87k44l278L402M035
$$ 3133 1666 -356 1796 2599 5312 4421 3263 4811 8749 6551 7352 8339 8095 4817 8219 12254
4156A2254O5l393n376j994j588K834L591J306k301k464J999k375O792k713k178
$$ 12254 12319 8926 3550 1556 -32 2802 6393 7699 5398 2934 4933 2558 9350 6637 4459
4141D459k965k319m100L709K052k406K104K843K57J721L009l198l747k638k114
$$ 4459 1494 -825 -4925 -1216 836 -1570 534 3377 3634 5355 8364 5166 1419 -1219 -3333
4126c333K47L874N529K036Q51m789L67l515m502n80K867j515l51j116p99L294
$$ -3333 -3086 788 6317 8353 9204 4415 4782 1267 -3235 -3815 -948 -2463 -2814 -3930 -4729 -1435
4110a435J270j369J462K483O44q7n409p69J827L607M023N14k293j855J784M107
$$ -1435 -165 -1534 -72 2411 3055 2968 -2441 -3210 -1383 2224 6247 6761 4468 2613 4397 8504
4094H504l62J803j263k886k658m264m355J102J875j00j576K650j063r83p50L025
$$ 8504 8142 9945 8682 5796 3138 -1126 -5481 -4379 -2504 -2604 -4180 -1530 -2593 -3576 -4326 -1301
4078a301J85R54K478L386j821J731R26J625J634K584j219k182J846j957K65m230
$$ -1301 -1116 -162 2316 5702 3881 5612 6538 8163 9797 12381 11162 8980 10826 8869 9134 4904
4062D904J11L55k23K499l989J04M94M25l601l00L740m81M02M479K343q5m706l957
$$ 4904 5015 5370 5147 7646 3657 3761 4255 4680 1079 779 4519 4038 4440 8919 11262 11177 6471 2514
4044B514l070J606M865L920J502k436m854n487k259K489Q37j040K663M56j430
$$ 2514 -556 1050 5915 9835 11337 8901 4047 -1440 -3699 -1210 -373 -1413 1250 1706 276
4029B76K760L43q91K841o39k97p13m74K818M599L101j145o763o291m058k872l065
$$ 276 3036 3379 2488 5329 4690 4393 3680 3206 6024 10623 13724 12579 5816 -475 -4533 -7405 -10470
4012a0470M113O707l013J438K649M007K76l410j919j742N14Q5l167J135N550m97
$$ -10470 -6357 350 -2663 -1225 1424 5431 5707 2297 378 -1364 -850 -765 -3932 -2797 2753 2256
3996B256L407J97m136p01q32r86l963k513L291K240MO45l989L528O100K053m976
$$ 2256 5663 5860 1724 1023 191 -795 -4758 -7271 -3980 -1740 -1736 -1091 -5080 -1552 4548 6601 1625
3979A625k679L42j784Q50N77J527k750n873L482N619O490J787o437k698N642j094
$$ 1625 -1054 -712 -2496 -1646 -1069 458 -2292 -8165 -4683 936 7426 9213 2776 78 5720 4626
3963D626J506P9k107l311N52N719K770j426j923J554m291k339j046k780L781M53
$$ 4626 6132 6211 4104 793 1345 7064 9834 8408 6485 8039 3748 1409 363 -2417 1364 1817
3947A817P61L730m718N393N064l111n15l220m255M193O869J232j160l676l284
$$ 1817 2578 6308 1590 6983 12047 8936 8421 5201 946 5139 12008 13240 12080 8404 5120
3932E120L93R26J411j286m169L265K698j234J070J86k01L851n986k40j135m623
$$ 5120 5513 6439 7850 6564 2395 5660 8358 7124 8194 8380 8179 12030 6044 5804 4669 46
3916D6k623J54r66M282K620k868K418L918p342m398N02j348K320J199l496o0L149
$$ 46 -2577 -2423 -3389 893 3513 645 3063 6981 -361 -4759 -4257 -5605 -3285 -2086 -5582 -5642 -2493
3899b493N935O238K092q67n92j932l509k29M610l256k29J330l452l611j598P66
$$ -2493 3442 9680 11772 10905 10313 8381 4872 4643 9253 5997 5768 7098 3646 35 -1563 -797
3883g97M245Q02j249j523n727k3P00K48L278K839j82J567m12j510j943j001K737
$$ -797 3448 4250 3001 1478 -4249 -4272 -3572 -3324 -46 2793 2611 4178 3766 2256 313 -688 2049
3866B049J828J936L430l002k367Q80O97K476R53j678Q19K374J316j945o764j246
$$ 2049 3877 5813 9243 6241 3874 4754 5451 7927 8880 7202 8021 10395 11711 9766 3002 1756
3850A756M93K333q68J015J745L085Q44l945r294k476M368J177K925L811l827n678
$$ 1756 2249 4582 3714 4729 6474 9559 10403 6458 -2836 -5312 -944 233 3158 6969 3142 -2536
3834b536L404K698K085n490L102J983J179k150p72j236Q78N60K605J333N492m186
$$ -2536 868 3566 5651 161 3263 5246 6425 4275 3503 2267 3145 3705 6310 7643 13135 8949
3818H949k847L806K483q120j344q13J153L837L444l006o101k809k481J004J478
$$ 8949 6102 9908 12391 4271 2927 2114 3267 7104 10548 7542 1441 -1368 -3849 -2845 -1367
3803a367N663O212J489p369j406k77m013l598M858N554L578J549n599j08L728
$$ -1367 4296 10508 11997 4628 3222 2945 -1068 -4666 192 5746 9324 10873 5274 5166 8894
3788H894m95l330k24N578l46K074L176j979k623n111n365M453J342O141k432m271
$$ 8894 8399 5069 4845 10423 10077 12151 15327 13348 10725 5614 249 4702 6044 12185 9753 5482
3772E482k020Q90J518k02j223l033o200n066M705P227N243j038l020K143N74m081
$$ 5482 3462 4352 5870 5668 4445 1412 -4788 -9854 -5149 2078 7321 6283 3263 5406 5980 1899
3756A899n526L681R43j943K511l298n874k469P25O553M932N6L48l59L904m563
$$ 1899 -3627 54 997 -946 1565 -1733 -7607 -10076 -9351 -2798 2134 2190 2538 2179 6083 1520
3740A520J61J766j611P86K419j176R7l188N07K154K72P25n185K24p23L686K245
$$ 1520 1681 3447 1836 2622 5041 3865 3962 774 1281 3435 3707 4432 -753 -529 -1252 2434 4679
3723D679K615j247q06K446J404l841j258P700q05k067j120l152j413J431K539
$$ 4679 7294 6047 5241 7687 9091 5250 3992 11692 10887 8820 7700 4548 3135 4566 7105
3708G105j256m13o209p32M91Q20L705l936Q72N228J400j882o371k973M1K860o02
$$ 7105 5849 5436 -773 -1505 -1014 -194 3511 -425 447 5675 7075 5193 -1178 -4151 -4110 -1250 -1852
3691a852P86M328K938r74l756J102K315r88K278M8j156J971j514l256k298N707
$$ -1852 -1066 3262 6200 5226 1470 2572 4887 3899 6177 6225 5069 7040 5526 2270 -28 5679
3675E679L599k790m555l244K264j221J146N635N24o019J556O873m64o88J060k912
$$ 5679 9278 6488 1933 -1311 953 -268 878 6513 7037 1018 2574 9447 8983 8295 9355 6443
3659F443k475J28j816j251M99K001r58k040L732J288L442N405R02m436k791j205
$$ 6443 3968 4096 2280 1029 1528 3529 2571 531 4263 5551 8993 14398 15300 10864 8073 6868
3643F868j85j805j925J579j79l182m10K076o021j0760o29M314L877n00N782L303
$$ 6868 6683 4878 2953 4532 4353 1171 761 2837 -3184 -13944 -14573 -10259 -6382 -6882 -1100 2203
3627B203j486N63K6l281J468L197l852k796N661M920p534l838O708Q482l414k017
$$ 2203 717 1280 1306 -1975 -507 2690 -1162 -3958 1703 6623 -911 -4749 1959 10441 7027 5010
3611E010j03K932k851K499J885m140m822J764K503m993j95j552L613j497k860
$$ 5010 4907 7839 4988 7487 9372 5232 410 2174 4677 -316 -511 -2063 1550 53 -2807
3596b807N438J885l731J908R00o22R16J593R70m099j287M338O938k925o573O3
$$ -2807 2631 4516 785 2693 3593 2971 3887 5480 6450 2351 1064 5402 12340 9415 2842 2905
3580B905L00Q4l242Q72L692k221J554N016L103n785p185J854J48M493L520j031
$$ 2905 3205 3289 47 919 4611 2390 3944 8960 12063 6278 -907 947 1095 5588 9108 8077
3564H077l40q58j19j936P93k219P86Jk163M10J792J383J356j351k01J885M947
$$ 8077 7737 6879 6760 4824 5617 3398 4184 4185 2022 2432 4224 5607 6963 5612 5411 7296 12243
3547A2243P57o205q65J79j828j07m143n850k928L57N375R343M171k645p742K157
$$ 12243 13000 6795 5930 6109 4281 4174 31 -5819 -8747 -8390 -3015 6328 10499 7854 112 2269
3531B269O20R59J077j313k913n002K973N509J248J051j440K609l580l068p02R52
$$ 2269 2889 3848 4925 3612 699 -4303 -1330 4179 5427 6478 5038 7647 4067 999 297 1249
3515A249J226L157J735m793K356M393N263J536n170K586k217o103J455M788m77
$$ 1249 2475 5632 7367 2574 4930 9323 14586 16122 10952 13538 11321 5218 6673 11461 10984
3500A0984j199n110k669j90M647k50n87j095O71j478k625k970K285K294m3K198
$$ 10984 9785 4675 2006 1816 6463 6213 5626 4531 5202 3724 1099 -1871 414 2708 2665 4863
3484D863m086l934j154N760K77L16K310l022m436K498K53J495J74L422M546j482
$$ 4863 777 -3157 -4311 1449 1726 2042 4352 1330 -3106 -608 -355 1140 1314 4736 9282 7800
3468G800l370O79L289j132J283l283j706r97N874N16k484j891k888j962J967J072
$$ 7800 4430 5109 8398 7266 8549 5266 3560 2563 8437 8953 6469 4578 1690 -272 1695 2767
3452B767K119n20k031p74k836K001k968j34q94j991o25K357L137%K65L228j381
$$ 2767 4886 4366 2335 1561 -1275 726 -2242 -2376 -3270 -5261 -5886 -3529 -392 -392 -127 3101 1720
3435A720j283r001p219K580N945q38N003N805P906L55r536j654L117p08k488j207
$$ 1720 437 -8564 -15783 -13203 -7258 -8096 -3093 2712 10618 10973 1437 -217 2900 2192 -296 -1503
3419a503K247j760J821j279P42O256k125p851M3O04N288M419m910m732J862j95
$$ -1503 744 -1016 805 -474 268 6524 4399 -3452 -3409 -2805 2483 6902 1992 -2740 -878 -1073
3403a073O29j354K135J338J416q0R43l82l733R78K366L80J366j568m72k594j547
$$ -1073 -444 -1798 337 1675 3091 3011 3954 3572 -161 817 3183 3563 4929 3361 2889 295 -1252
3386a252P146o04l892j579L452J332M87Q78l914R41J838O16m223k126J0098L535
$$ -1252 5894 5290 1398 -181 3271 4603 5090 5968 2054 2995 4833 5449 1226 -900 9198 12733
3370A2733l057n187j245l592k593M769K043k445L004N442q67n748n736P35N208
$$ 12733 9676 4489 3244 -348 -2941 1828 3871 1426 4430 9872 9005 3257 -2479 -1744 3464
3355C464J62l8k752k984R66K506O084k13l102j596J447l014L353L346m38m492
$$ 3464 3626 3588 836 -2148 -1182 1324 7408 7195 4093 2497 3944 930 4283 7629 7191 2699
3339B699K93R11m185N362L792p601p349o18K502P383O907j552j981o78j006k899
$$ 2699 2992 3903 -282 5080 8872 1271 -6078 -6696 -4194 3189 10096 8544 6563 5885 4879 1980
$$ [...]
##END NTUPLES=NMR SPECTRUM
##END=
