##TITLE=Analysis number 320556
Compound Code cc 42223
Book Reference 458/156
Project Code adrs
Chemist Name stevem
##JCAMPDX= 6.0         $$ Bruker NMR JCAMP-DX V2.0
##DATA TYPE= NMR SPECTRUM
##DATA CLASS= NTUPLES
##ORIGIN= Bruker BioSpin GmbH
##OWNER= nmr
$$ XWIN-NMR		Version 3.5
$$ Thu Jun 29 11:17:38 2006 GMT Daylight Time (UT+1h)  MAYBRIDGE\nmr@NMR_250MHZ
##.OBSERVE FREQUENCY= 250.131544655141
##.OBSERVE NUCLEUS= ^1H
##.ACQUISITION MODE= SIMULTANEOUS (DQD)
##.ACQUISITION SCHEME= undefined
##.AVERAGES= 16
##.DIGITISER RES= 18
##SPECTROMETER/DATA SYSTEM= dpx250
##.PULSE SEQUENCE= zg30
##.SOLVENT NAME= CDCl3
##.SHIFT REFERENCE= (INTERNAL, CDCl3, 0, 16.4476)
##AUDIT TRAIL= $$ (NUMBER, WHEN, WHO, WHERE, WHAT)
$$ ##TITLE= Audit trail, XWIN-NMR		Version 3.5
$$ ##JCAMPDX= 5.01
$$ ##ORIGIN= Bruker BioSpin GmbH
$$ ##OWNER= nmr
$$ C:\u/data/dgb/nmr/ADRS/1830/pdata/1/auditp.txt
$$ ##AUDIT TRAIL=  $$ (NUMBER, WHEN, WHO, WHERE, WHAT)
(   1,<2006-06-29 11:17:10.65 +100>,<MAYBRIDGE\nmr>,<NMR_250MHZ>,
      <created by zg, POWCHK disabled, PULCHK disabled
       configuration hash MD5:
       E2 DF 36 D8 04 B2 41 60 5A D7 A3 38 5A 4B D0 FE
       data hash MD5: 64K
       BB A7 7E 9E D6 5E D5 68 C3 00 8A 68 47 F9 DF 4E>)
(   2,<2006-06-29 11:17:27.18 +100>,<MAYBRIDGE\nmr>,<NMR_250MHZ>,
      <Start of raw data processing
       ef LB = 0.3 FT_mod = 6 PKNL = 1 SI = 32K 
       data hash MD5: 32K
       A2 29 11 49 CE C3 0E 6C 24 10 B7 F5 19 A2 D1 A9>)
(   3,<2006-06-29 11:17:28.76 +100>,<MAYBRIDGE\nmr>,<NMR_250MHZ>,
      <apk 
       data hash MD5: 32K
       A8 5F 49 D2 97 B2 91 F8 6C 10 3C 01 0A 21 BE 62>)
(   4,<2006-06-29 11:17:29.48 +100>,<MAYBRIDGE\nmr>,<NMR_250MHZ>,
      <abs ABSG = 5 
       data hash MD5: 32K
       D1 6A 85 1E 75 64 5B 9F 1C 5C 7C A5 87 EB C6 91>)
$$ ##END=
$$ 
$$ hash MD5
$$ 8B 18 17 C1 91 B7 AC 0C 92 02 BD BC 48 9B 82 82
##$RELAX= 
##$RELAX= 
##$RELAX= 
##$RELAX= 
##$RELAX= 
##$RELAX= 
##$RELAX= 
$$ Bruker specific parameters
$$ --------------------------
##$DU= <C:\u>
##$EXPNO= 1830
##$NAME= <ADRS>
##$PROCNO= 1
##$TYPE= <nmr>
##$USER= <dgb>
##$AMP= (0..31)
100 100 100 100 100 100 100 100 100 100 100 100 100 100 100 100 100 100 
100 100 100 100 100 100 100 100 100 100 100 100 100 100 
##$AQSEQ= 0
##$AQ_mod= 3
##$AUNM= <au_zg>
##$AUTOPOS= <22 >
##$BF1= 250.13
##$BF2= 250.13
##$BF3= 250.13
##$BF4= 250.13
##$BF5= 500.13
##$BF6= 500.13
##$BF7= 500.13
##$BF8= 500.13
##$BYTORDA= 1
##$CFDGTYP= 0
##$CFRGTYP= 5
##$CHEMSTR= <none>
##$CNST= (0..31)
1 1 145 1 1 1 1 1 1 1 1 1 1 1 1 1 1 1 1 1 1 1 1 1 1 1 1 1 1 1 1 1 
##$CPDPRG= <>
##$CPDPRG1= <>
##$CPDPRG2= <>
##$CPDPRG3= <>
##$CPDPRG4= <mlev>
##$CPDPRG5= <mlev>
##$CPDPRG6= <mlev>
##$CPDPRG7= <mlev>
##$CPDPRG8= <mlev>
##$CPDPRGB= <>
##$CPDPRGT= <>
##$D= (0..31)
0 1 0 0 0 0 0 0 0 0.06 0 0 0 0 0 0 0.0002 0 0 0 0 0 0 0 0 0 0 0 0 0 0 
0 
##$DATE= 1151576229
##$DBL= (0..7)
120 120 120 120 120 120 120 120 
##$DBP= (0..7)
150 150 150 150 150 150 150 150 
##$DBP07= 0
##$DBPNAM0= <>
##$DBPNAM1= <>
$$ [...]
##$SUBNAM7= <"">
##$SUBNAM8= <"">
##$SUBNAM9= <"">
##$SW= 20.6930455092707
##$SWIBOX= (0..15)
0 0 3 0 0 0 0 0 0 0 0 0 0 0 0 0 
##$SW_h= 5175.983436853
##$TD= 65536
##$TD0= 1
##$TE= 296.16
##$TE2= 300
##$TE3= 300
##$TEG= 300
##$TL= (0..7)
0 120 120 120 120 120 120 120 
##$TP= (0..7)
150 150 150 150 150 150 150 150 
##$TP07= 0
##$TPNAME0= <>
##$TPNAME1= <>
##$TPNAME2= <>
##$TPNAME3= <>
##$TPNAME4= <>
##$TPNAME5= <>
##$TPNAME6= <>
##$TPNAME7= <>
##$TPOAL= (0..7)
0.5 0.5 0.5 0.5 0.5 0.5 0.5 0.5 
##$TPOFFS= (0..7)
0 0 0 0 0 0 0 0 
##$TUNHIN= 0
##$TUNHOUT= 0
##$TUNXOUT= 0
##$USERA1= <user>
##$USERA2= <user>
##$USERA3= <user>
##$USERA4= <user>
##$USERA5= <user>
##$V9= 5
##$VALIST= <valist>
##$VCLIST= <CCCCCCCCCCCCCCC>
##$VD= 0
##$VDLIST= <DDDDDDDDDDDDDDD>
##$VPLIST= <PPPPPPPPPPPPPPP>
##$VTLIST= <TTTTTTTTTTTTTTT>
##$WBST= 1024
##$WBSW= 4
##$XGAIN= (0..3)
0 0 0 0 
##$XL= 0
##$YL= 0
##$YMAX_a= 388416
##$YMIN_a= -527560
##$ZGOPTNS= <>
##$ZL1= 120
##$ZL2= 120
##$ZL3= 120
##$ZL4= 120
##$ABSF1= 16.44761
##$ABSF2= -4.245562
##$ABSG= 5
##$ABSL= 3
##$ALPHA= 0
##$AQORDER= 0
##$ASSFAC= 0
##$ASSFACI= 0
##$ASSFACX= 0
##$ASSWID= 0
##$AUNMP= <proc_1d>
##$AZFE= 0.1
##$AZFW= 0.1
##$BCFW= 0
##$BC_mod= 0
##$BYTORDP= 0
##$COROFFS= 0
##$CY= 12.5
##$DATMOD= 1
##$DC= 0
##$DFILT= <>
##$DTYPP= 0
##$F1P= 14.0000005364418
##$F2P= -0.99999901652339
##$FCOR= 0.5
##$FTSIZE= 32768
##$FT_mod= 6
##$GAMMA= 0
##$GB= 0
##$INTBC= 1
##$INTSCL= 1
##$ISEN= 128
##$LB= 0.3
##$LEV0= 0
##$LPBIN= 0
##$MAXI= 10000
##$MC2= 0
##$MEAN= 0
##$ME_mod= 0
##$MI= 0
##$NCOEF= 0
##$NC_proc= -3
##$NLEV= 6
##$NOISF1= 0
##$NOISF2= 0
##$NSP= 0
##$NTH_PI= 0
##$NZP= 0
##$OFFSET= 16.44761
##$PC= 1
##$PHC0= 176.0705
##$PHC1= 7.617514
##$PH_mod= 1
##$PKNL= yes
##$PPARMOD= 0
##$PSCAL= 4
##$PSIGN= 0
##$REVERSE= no
##$SF= 250.130018605205
##$SI= 32768
##$SIGF1= 0
##$SIGF2= 0
##$SINO= 400
##$SIOLD= 32768
##$SREGLST= <1H.CDCl3>
##$SSB= 0
##$STSI= 32768
##$STSR= 0
##$SW_p= 5175.98343685301
##$SYMM= 0
##$S_DEV= 0
##$TDeff= 65536
##$TDoff= 0
##$TI= <Analysis number 999999
Compound Code 99
Book Reference 9
Project Code 9>
##$TILT= no
##$TM1= 0
##$TM2= 0
##$TOPLEV= 0
##$USERP1= <user>
##$USERP2= <user>
##$USERP3= <user>
##$USERP4= <user>
##$USERP5= <user>
##$WDW= 1
##$XDIM= 32768
##$YMAX_p= 328241834
##$YMIN_p= -536385
$$ End of Bruker specific parameters
$$ ---------------------------------
##NTUPLES= NMR SPECTRUM
##VAR_NAME=  FREQUENCY,     SPECTRUM/REAL,   SPECTRUM/IMAG
##SYMBOL=    X,             R,               I
##VAR_TYPE=  INDEPENDENT,   DEPENDENT,       DEPENDENT
##VAR_FORM=  AFFN,          ASDF,            ASDF
##VAR_DIM=   32768,         32768,           32768
##UNITS=     HZ,            ARBITRARY UNITS, ARBITRARY UNITS
##FACTOR=    0.157963299565203, 1,           1
##FIRST=     4114.04120919797, 0,            0
##LAST=      -1061.94222765504, 0,           0
##MIN=       -1061.94222765504, -536385,     0
##MAX=       4114.04120919797, 328241834,    0
$$ Real data points
##PAGE= N=1
##DATA TABLE= (X++(R..R)), XYDATA
$$ [...]
16787a8852M0199j5341j9320m111m222N081K7558J6803j4738J3511l9280n9785
16775g2497K419j3949j1302P202J8184N833K4149q146n766L966M4504L8776K902
16762C6275q913l6996K2671K6693J1715p542j0369k2109m6299j3652n538j751
16750e5815M0462K5328K7734l2402Q250j4791P603L190O629N180J3386k6336n037
16737C381J2002J2134Q747k284o35o228l8664J0570K3922l849m64l3002l1051
16724d5421j4033j4279J8512K670m1513n530N4307L2750J8054m039M695j0596
16712d423n2641m939p277P535M5087K6891J5123K5127Q821k9295o1999l10K9244
16699c056j8653q433M1716J7935l1677m8j2381o068J7407l8525p041J3418M2333
$$ y = [-18852, 21347, 6006, -13314, -17425, -21647, -16566, 10992, 27795, 13057, 26568, -12712, -72497, -70078, -84027, -95329, -88127, -69943, -64110, -39961, -48107, -53873, -49907, -5403, 33373, 36275, 27362, -9634, 13037, 39730, 51445, 43903, 33534, 11425, -34874, -48526, -54064, -55815, -15353, 9975, 37709, 5307, 13557, -1234, 6369, 9559, 16188, 21368, 34754, 8418, 3381, 15383, 27517, 36264, 33980, 33345, 27117, -11547, -977, 22945, 19096, 18632, -14370, -45421, -59454, -73733, -55221, -52551, -94064, -99594, -45287, -12537, 5517, 1478, 6173, -4423, -57064, -62003, -69280, -61745, -16658, 10233, 25356, 50483, 59304, 30009, -31990, -32300, -3056, -21709, -30142, 11574, 29509, -2168, -2216, -14597, -20665, -3258, -41783, -48824, -35406, 6927]
16686F927k474j1083k0607j0237J2524L4896O4318j6083m4039k5602k4238j5056
16674e0754P0052J3505J2054J3318J680k1297l4254k5624J8459J8824K3854J5853
16662E5670m1584j0186n8758m40j8884j2578K3943O0066K5419j0351j2438j1990
16650a2111J4683J5397J5269j351m2047J7566q861j3499k2718k8494j7576j883
16638h5625j1155O5050M1888n769n044j8199j5398j5531L2377L5416k5344p725
16626a5059J2315K6630J2991m0500J2626J5233l9861J966M5497k52m6830m9956
16614f5200j9563M2809L490j0771K7296K0198m3261j9587M1956L4106j4120k3887
16602b6534Q736j5708N978J9746J0435J4064j745L0989L436R214j2559j0341q151
$$ y = [6927, 4453, -6630, -27237, -37474, -24950, 9946, 74264, 58181, 14142, -11460, -35698, -50754, 19298, 32803, 44857, 58175, 59855, 38558, 4304, -21320, -2861, 15963, 39817, 55670, 14086, 3900, -54858, -55298, -74182, -86760, -62817, -2751, 22668, 12317, -121, -12111, 2572, 17969, 33238, 31887, -10160, 7406, -1455, -14954, -37672, -66166, -83742, -85625, -96780, -31730, 10158, 4389, -655, -18854, -34252, -49783, -17406, 18010, -7334, -15059, -2744, 23886, 36877, -3623, 9003, 24236, -15625, -13659, 31838, 31586, -15244, -65200, -84763, -41954, -38464, -49235, -21939, -1741, -45002, -64589, -22633, 11473, -2647, -26534, -17798, -33506, -27528, -7782, 2653, 16717, 14972, 45961, 49397, 58611, 46052, 35711, 27560]
16589B7560j2092r855O970l4982j5509K9896m250J2603k3137l0780l293L3735
16577b3134K808L1340R501k3391j7721j494P550k1691k2140k4996L4665N6603
16565G900O863K1065J16j9383k0341l4788J1836L6791J363k3230l2029O468K5655
16552a1714l577j4399j4163J0292M0030K0123j3336o1964j4866J7345J5451L2645
16540A867l2364J1702n957k0797K996J4145N0823L5534j0278p2584k3456K2369
16528b6000O597l072M3933J3839Q728O07n0342p8855R079Q0916L4847J4845K194
16515E7316q087K1943J169k9058l2724J9525k9425j1474L5649j0887k8000j1040
16503b5093J7756J3691j8090K4199j7461k4721K372J8520M2862j3487J931m657
$$ y = [27560, 15468, 5613, 12583, -22399, -37908, -8012, -12262, 341, -22796, -53576, -56869, -23134, -20326, 11014, 20515, -2876, -20597, -22091, -14541, -36232, -58372, -83368, -48703, 7900, 14763, 35828, 35944, 16561, -3780, -38568, -26732, 10059, 11422, -11808, -43837, -37369, -11714, -15291, -29690, -43853, -33561, 6469, 26592, 13256, -48708, -63574, -46229, -30778, 1867, -30497, -18795, -24752, -45549, -42553, -28408, 22415, 57949, 47671, -24913, -48369, -26000, -19403, -22475, 21458, 35297, 44025, 44632, -5710, -84565, -75486, 5430, 40277, 55122, 57316, 49229, 71172, 72341, 43283, 10559, 30084, 659, -10815, 24834, 13947, -14053, -25093, -7337, 6354, -11736, 12463, -4998, -29719, -27347, -8827, 34035, 20548, 22479, 17822]
16491A7822n2787k456P18J4351m71k2234j3166P511K3978Q641Q182K4410L0432
16478D4931j6297J1773L2139q237n1672l7250k7705J9738O0676L2585j9375k4984
16466A6322o2271o301M0512K7867j9044l8150q815N5588M2428q701m810j4322
16454B0303l2564J8133J5594j7047j7934m6214l3750N0539M2048p356N1399N491
16442D8642j734N844J5793k6153n4491k2663K7633J9518L079k0021j8648J8691
16430d510k4094j5428L6542M9194l908k1853k36L5241J3074q153k6143j1021l9673
16417b0968R069K2914L8681L1521l8249j4504J1243M8735j2443m9281j6171j1603
16405a056j5822k6501n752J2731o329P779K5712J4338J450L189J2103l1807j4222
$$ y = [17822, -34965, -37421, -36703, -22352, -22823, -45057, -58223, -50712, -26734, -18093, -9911, 14499, 44931, 28634, 40407, 72546, 64309, 12637, -24613, -52318, -32580, 28096, 60681, 41306, 16322, -45949, -52250, -11738, 16129, -2915, -41065, -49880, 5708, 48136, 39435, 34625, 20303, -12261, 5872, 21466, 4419, -13515, -59729, -93479, -42940, -892, -8248, 43151, 48642, 46908, 52752, 68545, 42392, -12099, -34762, -7129, 12389, 15468, -4553, -23201, -4510, -28604, -44032, -7490, 41704, 37796, 15943, 15707, 50948, 64022, 55869, 29726, 18705, -20968, -11899, 11015, 49696, 81217, 42968, 28464, 39707, 88442, 75999, 26718, 10547, -1056, -16878, -43379, -49131, -36400, -42729, -34950, -9238, 5100, 6550, 9739, 21842, -9965, -24187]
16392b4187j2957j7802M0835J4273n888K880K6428K0339n327r260J787o204j7903
16379G014j5396J3648J1510r661l5662j3678p026L2159K5424k7957J8703q928
16367i850k667J530K093n705J1091k6802O6172N523k1084k2871J7809o069Q718
16354A7888J2189k2814M0318J197J815k9970J2757K096j7134m4653j0602P1779
16342C4866k0344q7448p803L1959j631L5708n665j3585j249n900K4559j5123q541
16329d0197L9431J2764m5983N740J8861L1399L2617N046n461K3629r391L5194
16317A03649j9811n6557n7500J1352L3085j6215j7921j2820M0162M7630o385k4629
16305B4040j9049l0159l9190p389L0174L8883J3108L5802J5139m5175q304l469
$$ y = [-24187, -37144, -54946, -14111, 162, -5726, -2846, 23582, 43921, 38594, 29334, 31121, 24917, 7014, -8382, 5266, 16776, 7115, -28547, -42225, -49251, -17092, 8332, -19625, -922, -9850, -12517, -10987, -8894, -14599, -3508, -30310, 35862, 41385, 20301, -2570, 15239, 9170, 17888, 30077, 7263, 47581, 48778, 50593, 20623, 33380, 35476, 18342, -26311, -36913, 34866, 14522, -72926, -80729, -48770, -50401, -14693, -20358, -33943, -35192, -41092, -16533, -31656, -40197, -766, 11998, -33985, -28245, -9384, 22015, 54632, 59678, 54217, 77846, 68455, 103649, 83838, 27281, -30219, -18867, 14218, -1997, -19918, -32738, 7424, 55054, 48669, 24040, 4991, -25168, -64358, -71747, -41573, -2690, 10418, 46220, 61359, 16184, 7880, 4411]
16293D411j4607j5916o484P931M1734j2835j1954n153k040J1068J5510j3399n17
16280b251J4720L4027m946m2927k4135K7815j564k3776J978J9143Q750L274l3070
16267b2962j0532L1965j2867n284N574K7675L2989J5002m547k9680o0643l3899
16255f7209j3556L393l604O2178J1596j3580j9170j4765n1922K8297L597K0703
16243e4042L0534J6171K7713J6970k8441M728P683l4610n272o328K0161k164k2849
16230b9746N0285K0647m336n698l4798J4615R677M748k4948K8658L5657j4954
16218D9807m4684j0332N575k0642J7881L4198k4949l3236R554K4449J5117k630
16206B0108N5587K3297j1589k0627p0m4838r772l9415j2733J9972l2739K965M5491
$$ y = [4411, -10196, -26112, -32596, -24665, 17069, 4234, -7720, -12873, -14913, -3845, 11665, -1734, -2251, 12469, 46496, 41550, -1377, -25512, 2303, 739, -23037, -21059, -1916, 6834, 10108, -22962, -33494, -1529, -14396, -19680, -14106, 13569, 46558, 61560, 57013, 27333, -33310, -67209, -80765, -77372, -80976, -18798, -7202, -20782, -39952, -54717, -106639, -78342, -74745, -54042, -23508, -7337, 20376, 37346, 8905, 13633, 21316, -13294, -18566, -24894, -4733, -6897, -29746, 20539, 41186, 36850, 31152, -3646, 10969, 20646, 25394, 446, 29104, 64761, 49807, 5123, -5209, 366, -20276, -2395, 31803, 6854, -26382, -16828, 7621, 22738, 20108, 75695, 98992, 87403, 66776, 66706, 21868, 12096, -27319, -40052, -20080, -52819, -49854, -4363]
16193d363L4760l3189j0852L6315r084k9994L2492k0310n3590j0943N2526J0653
16181e579j7973J7299L9826K5422R263l4938l7922q412l635l6168M5468N6131
16169D8782J8916k3441k6505K7551J4055k3567r121l3460k6072J3100r778K9698
16157A58l746K7436L2151n694k2060l2344M3102j0103l1140j8383q24J912J0390
16144i145k9266K9698R411l3886m860J5408k6400L9583N0691L1199L8130Q512
16132A19075k5375m7971k3866q667m11j575j5345Q076J8916L1380l9417k9614
16120a4794k4476J8204K5523j0345J8089l281m3298l9662M0529J6356L2605j9135
16108c685k5383M0099J5311l4715j0552L7124L822K5537l0707o0311J5073N8404
$$ y = [-4363, 30397, -2792, -13644, 22671, 13587, -16407, 16085, -4225, -57815, -68758, -16232, -5579, -23552, -6253, 33573, 58995, 68258, 33320, -4602, -13014, -16649, -52817, -7349, 48782, 67698, 44257, 17752, 45303, 59358, 35791, 26670, -6790, -32862, -19762, -29540, 158, -3588, 23848, 55999, 50305, 28245, -4099, 39003, 28900, -2240, -20623, -21447, -19535, -9145, -38411, -8713, 698, -33188, -38048, -22640, -49040, -9457, 41234, 72433, 110563, 119075, 93700, 45729, 21863, 13196, 12785, 11210, -4135, 3941, 22857, 54237, 14820, -14794, -39270, -21066, 4457, -5888, 12201, 8920, -34378, -74040, -33511, -17155, 15450, -3685, -29068, 11031, 26342, -8373, -18925, 18199, 22021, 47558, 16851, -43460, -28387, 30017]
16096C0017o726j0745m8569l878J7506r263J1917K7369L0589o932J5866K8226
16084G5377k9636n9472o0863K41L5072P353N3178M27k758o5714m6349K5009k0082
16071h8217M9232P4654P318m7580J3001R153K0212o07n1015Q10P062K2842J6768
16058C3633l786l2609k0980o2184M8191J6568Q942L8722m0492j4152k9737J5752
16046d2132J8023K8911k371q147m134k551M329L1135Q913j1809n795J5779L3127
16033F3278j4063j0849l3496k5938R207L3147r864m186j346k793M019J5430L2213
16020E4759P735k5332p962j9946M236j6804k8707R157L075j9448J1164K3996j5823
16007a9900l5863k2057J7190M0405r927m480L6444L7772j0708O143K742k7227
$$ y = [30017, 23291, 12546, -36023, -39901, -22395, -31658, -19741, 7628, 38217, 31285, 47151, 75377, 45741, -13731, -74594, -74353, -39281, -31928, 21250, 21677, 18919, -46795, -93144, -68135, -88217, -38985, 35669, 42987, -4593, 8408, 17561, 37773, 37166, -13849, -13039, -5977, 16865, 33633, 29847, -2762, -23742, -85926, -37735, -21167, -12225, 26497, -13995, -28147, -57884, -42132, -24109, 4802, 2431, -5716, -9850, -12401, -8072, 23063, 31976, 20167, 14372, 30151, 63278, 49215, 38366, 4870, -21068, -11861, 21286, 11422, 7236, 5890, 3097, 7116, 22546, 54759, 62494, 37162, 29200, 9254, 13490, -3314, -32021, -22864, -19789, -39237, -28073, -4077, -19900, -55763, -77820, -60630, -20225, -30152, -34632, 1812, 39584, 28876, 35019, 37761, 10534]
15995A0534l687K9691l5465n689M1598j0670k0765M2881K1600k6092j6322j7715
15983I899j6135l2727K7349J5847J7348m1039j2638M2157J765k5181K7285N7257
15971G1187j2627p2207J52J035n9235L4372L3090K404L794J1219L5938L57k0403
15958B9076o062o503J3351k2692k3452J5050M2J7374k4766n1389J1421L9971J6326
15945G747R441K1141k3219l325J3494J9636Q062k7701k3438j629J431j4823j442
15932a4625K5119J4229l9153k5373J8594K8020K2970n0593M325l0251K804M7371
15920C437K3690l79k2091l2669R378j8519J7795L781j413j1078k2810L5586J2826
15907b466j6841J9516O1191J0020l0147n391j953J9437P114j8830p4918p693M078
$$ y = [10534, 6847, 36538, 1073, -4616, 36982, 26312, 5547, 48428, 70028, 43936, 27614, 9899, -6236, -38963, -11614, 4233, 21581, -19458, -32096, 10061, 11826, -13355, 13930, 71187, 58560, -13647, -13495, -12460, -71695, -37323, -4233, -1829, 1965, 13184, 49122, 49479, 29076, 23014, 16511, 29862, 7170, -16282, -1232, -1190, 16184, -8582, -59971, -48550, -8579, 7747, 17188, 38329, 15110, 11785, 25279, 44915, 52977, 25276, 1838, 209, 1640, -13183, -14625, 10494, 24723, -14430, -39803, -21209, 6811, 29781, -20812, -16487, -46738, -43934, 3437, 27127, 26748, 4657, -28012, -18634, -37153, -19358, -15577, -16990, -28068, -50878, -15292, -2466, -19307, 209, 61400, 71420, 41273, 35882, 33929, 53366, 60480, 41650, -33268, -40961, -36883]
15894c6883L6630j9251k5855L7891K8579K6385K8629m5366k0837M6025j0436l323
15882D2188l0972k5277k2035J3964L2476n0506l7068J7033K0441j5038n734r68
15870f1496J5200M4265N1571K3695j0238J177k5433m5990J6606j2784K7016j6700
15858F889k1013K388J1305o106J2436k7481j4610J6510J2241L9035J8559l2074
15846A8079l5937n210k2780J4225J7882M0465k0348k2900M094j231n447J3955
15834e153k2226k7087l120M3490M5783p341q600r109j5832N816m448K2354O852
15821B1379L130j9845o1204J1403O2327L7454n1300p8498J3723J6819j607q406
15809e4625K3263Q440o960j5190L0013K1582l5376k7302J1871K4459j3987J1013
$$ y = [-36883, -253, -19504, -45359, -7468, 21111, 47496, 76125, 30759, 9922, 55947, 45511, 42188, 11216, -14061, -36096, -22132, 10344, -40162, -77230, -60197, -39756, -54794, -60528, -61496, -46296, -2031, 49540, 73235, 62997, 64174, 38741, -7249, 9357, -3427, 23589, 6889, -14124, -11736, -431, -6537, 5899, -21582, -36192, -19682, -7441, 31594, 50153, 18079, -17858, -23068, -45848, -31623, -13741, 26724, 6376, -16524, -12430, -13661, -19108, -5153, -27379, -54466, -57586, -14096, 31687, 24346, 15746, 6637, -9195, -3379, -7827, 14527, 21379, 24509, 4664, -56540, -45137, 17190, 54644, 3344, -75154, -61431, -44612, -46219, -54625, -31362, -22922, -29882, -45072, -15059, 6523, -28853, -56155, -44284, -19825, -33812, -22799]
15797b2799P0444o228p633P794M066m06l4336l5662l1147O442K992L1527M070
15784a0876J8113L6096R35j8809k4256O798P9143J4321n2666l3020j8873N902
15772B808l5499k2774j0620N0385K5679j3916k8256J5745j089K0694L585k6653
15760a9911J2590K7363q461m356j3805Q324J6246m642k1034M1374k1739m0731
15748b8782k0929K3250R018n597m260L440J2319j2954l6200j1937J6016L2704
15736b3912K4200L2242K310o1647M347K7316j2212m6445k3303L5600N9747K5855
15724D4098l6816l1539J9055p267j4426K5783Q096n6482k6156L8617J434r919
15712d5522L234L3228J8449j3335K1679M4609m1614m3404k5007N147M8427k0286
$$ y = [-22799, 47645, 41417, 33784, 41578, 45644, 45238, 10902, -24760, -55907, -49465, -46473, -14946, -10876, 7237, 43333, 44268, 25459, 1203, 8001, 87144, 101465, 48799, 15779, -3094, 2808, -32691, -55465, -66085, -15700, 9979, -3937, -32193, -16448, -17537, 3157, 6742, -19911, -7321, 20042, 11581, 7225, -6580, 1744, 17990, 13348, -7686, 33688, 11949, -28782, -49711, -26461, -17443, -23040, -27300, -23860, -11541, -24495, -60695, -72632, -56616, -23912, 288, 32530, 34840, -26807, -22460, 4856, -7356, -53801, -77104, -41504, 18243, 44098, 7282, -24257, -5202, -12469, -26895, -1112, 6984, -49498, -75654, -37037, -35603, -45522, -42288, -9060, 9389, -3946, 17733, 62342, 20728, -22676, -47683, -42536, 5891, -14395]
15700a4395k5302l781L5449M101J4920j0006m5491l2183n738L903K4836N0678
15688c009J7367n693j4626j3676q380n049M9751M1364P097k7530r759K0908j740
15675D7025k9454k1359n3769Q449L370M6629O3613j1l4489k6556j2128n636j3691
15662b8007l8141J7257J9391K2527L0388K5935J6506j6498J8377j2358k2260k3574
15650I543q241j6282M4117j5835k5274j5109K1114P3852q907p8981k4660M2148
15638b515l774K7342J8516L873j474L5172j736m1893l8554M3634P407N322K8207
15625G9527M5957l2478k8595k7046k9004j8747K9682Q486k1372o467K8366r783
15613A8526n506l9500l118J2031N677K5330m350K715J4507l0709l5582l768Q566
$$ y = [-14395, -39697, -43478, -8029, -3928, 10992, 986, -44505, -76688, -82426, -78523, -53687, -3009, 14358, 8665, -5961, -19637, -28017, -33066, 16685, 58049, 65146, 37616, 27857, 48765, 47025, 17571, -3788, -57557, -49108, -45738, 891, 64504, 64493, 30004, 3448, -8680, -14316, -28007, -66148, -48891, -29500, -6973, 23415, 49350, 65856, 49358, 67735, 55377, 33117, 9543, 1302, -14980, 29137, 13302, -11972, -27081, -5967, 67885, 58978, -20003, -44663, -2515, -6289, 21053, 39569, 43442, 41968, 77140, 75404, 33511, -5043, 38591, 45998, 51320, 79527, 125484, 93006, 64411, 37365, 8361, -10386, 19296, 27782, 6410, -57, 28309, 18526, 13020, -26480, -29598, -17567, -11890, 13440, 9090, 11805, 26312, -4397, -39979, -43747, -35181]
15600c5181k03j981k0510L0759K5354Q316J5434N9586O6349K6504j6190m1385
15588A16852J5156j6244m7690J2523K4800l4578q3692k6607J7067K3032N2528
15577E3147K8860o892K750O231J3510o334q227j4286j0564k6850K1992M867l5220
15564B2984k8848M532l276J0733J8377j2958M886J2115L0185j0757M911R553j5732
15551D6705n3355n8862J6023K821j2586L3029M9585L2007m1485m2064K7783M1036
15539D0637m0333m8808R310L2167j1089K9996N892j9109j5499L0512K364j5793
15527B47L9164J6018l3614m2322O991j5211P0321l9944o4677j0054P830N2223
15515a3028J6339m4093m416j1518K7043L6714k314m5837o5465j2550j936J5787
$$ y = [-35181, -35384, -37365, -57875, -27116, -1762, 6554, 21988, 81574, 147923, 174427, 158237, 116852, 132008, 115764, 68074, 80597, 105397, 70819, -12873, -39480, -22413, 619, 53147, 82007, 75115, 77865, 84096, 97606, 91272, 83045, 68759, 58195, 31345, 53337, 58204, 22984, -5864, -1332, -4608, 6125, 24502, 11544, 16430, 28545, 58730, 47973, 52884, 62437, 46705, -6650, -65512, -49489, -46668, -59254, -26225, 23360, 55367, 13882, -28182, -399, 40637, 304, -48504, -39194, -7027, -18116, 11880, 17772, -1337, -16836, 13676, 16040, 247, 39411, 55429, 21815, -20507, -13516, -28727, 41594, 1650, -63027, -73081, -65251, -13028, 3311, -40782, -45198, -56716, -29673, 7041, 4727, -41110, -106575, -119125, -121061, -105274]
15503a05274J0707J3886J9131K7973L3950p17J2687M6114j7670K014L9317o1127
15491B0991o1467Q363J9315R933J1709j477j3866J3332K215J2525l3934J0716
15479a645q518j7869J1013L634N4625O127p784j3115m6984k2291j9644j1826J9334
15466e4943Q2225L7045o3513o0040L6946L7878j0994j5271L3030l4831j0151K4670
15454B051j8640k4016l1676R420K6288M8880L224L4373K4852J042j551J838m9327
15441B6758l2145k6934K6978L2528m4043K361M3718K1970o5920l8477R534j3593
15429e7265o217O494j6876j6613R301J3813J8849K3153p435k4675L2290J7629
15417g552k6808K8J0520p963j3172J1746L4312J3248k1583j1759l7885Q015J6090
$$ y = [-105274, -94567, -80681, -61550, -33577, 373, -344, 12343, 58457, 40787, 42801, 82118, 20991, -40476, -32113, -12798, -2865, 8844, 7367, -6499, 6833, 9048, 21573, -12361, -1645, -10163, -28032, -17019, -13385, 41240, 47367, 39583, 26468, -20516, -42807, -62451, -74277, -54943, 27282, 64327, 814, -59226, -22280, 15598, 4604, -10667, 22363, -12468, -22619, 2051, -16589, -40605, -72281, -62861, -36573, 12307, 15531, 49904, 74756, 75798, 74247, 76085, 26758, -5387, -32321, -5343, 27185, -16858, -14497, 29221, 51191, -14729, -53206, -43672, -57265, -63482, -56988, -73864, -90477, -81176, -67363, -48514, -25361, -32796, -57471, -25181, -7552, -34360, -34332, -23812, -31775, -44947, -33201, 1111, 14359, -7224, -18983, -56868, -48853, -32763]
15404c2763q05L1900j4516J1606M0806p919J2549m0857k9140j2123m808J329L9439
15391e302q654j8791j3660K8009N0612K5273K137L877k0705o2339l3658k969K7242
15378b8928P8125K6635j170l1383j6176J2745j4443K8137K2859L786j5332l3677
15366C1178l8780L176k0648O306P7K8740K8648N2202P010m5096p6585o6446L3340
15353e6878L2747k8511q246M458j1682R070Q741J7704j718j8461r732j745K7728
15340c6525r580O316j7728l0646m781J3893M2216j0103l7095J0484J700J8652
15328e3197J7485m5423K4944N7817J2452J2865j8031R922O267o880l7130k4296
15316d3205m972P730J8843M5243j384k9319J2178J5113K016k0592j6756o6524
$$ y = [-32763, -33568, -1668, -16184, -4578, 36228, 28309, 40858, 1, -29139, -41262, -46070, -44741, -5302, -13956, -32747, -46407, -18398, 32214, 57487, 59624, 63501, 42796, -19543, -53201, -56170, -28928, 49197, 75832, 74662, 43279, 27103, 39848, 25405, 53542, 76401, 80187, 64855, 31178, -7602, -4426, -25074, -18768, -18691, 10049, 38697, 90899, 97909, 52813, -23772, -90218, -56878, -24131, -52642, -60888, -56430, -68112, -59042, -50301, -32597, -34315, -52776, -62508, -64253, -36525, -46105, -39789, -57517, -88163, -92944, -79051, -36835, -46938, -84033, -73549, -71849, -53197, -35712, -81135, -56191, 1626, 14078, 26943, 8912, 18834, 25101, 18221, -18909, -43205, -48177, -40447, -21604, 23639, 22255, -7064, 5114, 20227, 22243, 1651, -15105, -81629]
15304h1629L425j836l8547K6895K4020K1762L7107j2326L2378L4832J5674m724
15292E7031k7376m5202J81J0762l3040p175N0770p667k7150L2156L4545K1890
15280E9725n251m4952m9253j01604j1956j7504L8451M1475N5513J2911O6608n992
15268C8171l5509m602k2688l0827J1494O141j2288p78J6114J4680K3494L5555
15256C8957J3821l8272k3523r29p761k820Q003o910J2318O2582Q16m9855N970
15243A2397j905P691r16l1638m3665j3137l698o217l838L2894L4669K9147J4843
15230B6627J9971O026j5257l193J3812m269j8587k8534J0845l606j5311L2268
15218B0792K0246m0095l24j1853m8307j9130M1773K8757J8911k5511j8282L8052
$$ y = [-81629, -78204, -80040, -118587, -91692, -67672, -45910, -8803, -21129, 11249, 46081, 61755, 57031, 29655, -15547, -15366, -4604, -37644, -44819, 5951, -1716, -28866, 3290, 37835, 59725, 54474, 9522, -39731, -141335, -153291, -170795, -132344, -90869, -35356, -22445, 44163, 38171, 2662, -1940, -24628, -55455, -43961, -37820, -50108, -50886, -34772, -20092, 3402, 38957, 52778, 14506, -9017, -9946, -17707, -20527, -12524, -19434, -7116, 55466, 56282, 6427, 12397, 10492, 18183, 17267, -14371, -58036, -71173, -74871, -81088, -84926, -52032, -17363, 11784, 26627, 46598, 52624, 37367, 34174, 47986, 43717, 25130, -3404, 7441, 3835, -11476, 20792, 41038, 943, 619, -11234, -59541, -78671, -36898, -8141, 10770, -14741, -33023, 5029]
15206E029j9918l9005K843K0363J4385n978k9244j2417R657J3498j0375j318o876
15193e9356K7516L4700J0297K816k7145K1473k708k2229J6361k7277l355p189
15181c6096k329k6859J1125M1756j7725J2707J8252N586k2475l0075M787K3714
15169a7632K1244L7687o575n871L050k6725J2705J0824k7337j0025K2176P400
15157B0921j5665l2407K3088k679N028M3212l2074q406J5651o257j9738K3641
15145A4315L7019R82k0261M965o6679k4113K0547M3826l1762j7326R186k8249
15133e7550J7337O1610N789j7437k9165R530J7549J6983k6821l6257O724K7378
15121d330J1403k7943j4965K0361J8539l6941o3143L5721j9334M327K5111K8984
$$ y = [5029, -14889, -53894, -51051, -30688, -16303, -22281, -51525, -63942, -54285, -40787, -51162, -52480, -59356, -31840, 2860, 13157, 15973, -11172, 10301, 7593, -14636, 1725, -25552, -28907, -36096, -38425, -65284, -54159, -12403, -30128, -17421, 831, 6417, -16058, -46133, -41346, -17632, 3612, 41299, 34724, 28853, 31903, 5178, 17883, 28707, 1370, -8655, 13521, 20921, 5256, -27151, -4063, -6742, -1714, 41498, 9424, 1018, 16669, 10412, -9326, 14315, 51334, 52316, 32055, 37020, -29659, -53772, -33225, 10601, -21161, -38487, -29301, -57550, -40213, 21397, 27186, 9749, -19416, -9886, 7663, 24646, -2175, -38432, -31708, -4330, 7073, -20870, -35835, -15474, 3065, -33876, -97019, -61298, -80632, -76305, -51194, -22210]
15109b2210J8252M2187K9173m885p0379k1896R38M3917j1641r369J9591j7388
15097c710j5644j4127Q772L657j1199K7020j398o157L2767j3669O812L7699q796
15084D2027m7916n8143j4174L43Q049p872K3319Q0343K4514n5596n2487P33K9797
15071b7063J4329m0635P25L0319J9111J6843n530j0756l4220J4066k9560o96L3131
15058a9936L4332J9159m4125l1480L887K8034k8667o890L0075l3122o043M1850
15046a2926K368j4569k1360l3361Q070K0333N4310k765k2684j1411j8829j3504
15034f6328L8133L5576j7377K636K9123q79m1312k8607J5078K2239l1309O214
15022c6813L2529M720L3723P940k9171m3768P931L6722j163k2389K5713J4339
$$ y = [-22210, -3958, 38229, 67402, 62517, -7862, -29758, -28820, 15097, 3456, -5913, 13678, -3710, -19354, -33481, -24709, -21052, -32251, -5231, -6629, -12786, 19981, 6312, 13124, 50823, 42027, -5889, -64032, -78206, -77863, -69814, -77686, -54367, 25976, 50490, -5106, -57593, -56860, -27063, -12734, -53369, -52644, -22325, -3214, 13629, 8099, -2657, -36877, -22811, -52371, -53067, -19936, 14396, 33555, -10570, -42050, -38163, -10129, -38796, -45686, -15611, -48733, -54776, -12926, -10558, -25127, -46487, -79848, -71778, -51445, 2865, 100, -22584, -33995, -52824, -66328, -28195, 7381, -9996, -7360, 21763, 20884, -20428, -49035, -33957, -11718, -43027, -36813, -4284, 436, 34159, 42099, 12928, -30840, -22909, 13813, 12650, -9739, 15974, 30313]
15010C0313K8733p845N271l7757J994l5855j0408K2492L0817J6278j279l6491
14998F263m6130M195J8924J861J221M3494p886k2937l4755J556J1617l1133j2431
14985f6141L7934L0781k1977j1122K4R976j9498m572Q0602M2239k1662P737P04
14972F5025l8823k0288k2421j4704o160K4421J8218J777l6899o3544j6861K2859
14960h7400J696J5191N2059N0757l398k5397p387m269j4373n260K1879J8836K422
14947A5356J2632j5594K452o959r239K8922J3186J035L447J0323O479l9479m5320
14934b2759j7567q091J9375L2656K0686j183q556r992k4019o289K5803j2431j0679
14921b3046k7347J4470K7719k0473j7183k7309K2204J4206Q529K4555J4682k908
$$ y = [30313, 59046, 51201, 56472, 18715, 20709, -15146, -25554, -3062, 27755, 44033, 42754, 6263, -39867, -35672, -16748, -14887, -13666, 29828, 21942, -995, -35750, -34194, -22577, -53710, -66141, -28207, 2574, -19403, -30525, -30501, -20525, -40023, -44595, 36007, 78246, 56584, 64321, 65025, 26202, 5914, -16507, -31211, -37371, -12950, 5268, 7045, -29854, -93398, -110259, -87400, -85704, -70513, -18454, 32303, 28905, 3508, -3879, -8148, -22521, -27781, -5902, 12934, 15356, 27988, 12394, 14846, 7887, -1352, 27570, 40756, 41791, 45238, 55561, 62040, 22561, -22759, -40326, -48417, -29042, 3614, 24300, 23117, 14561, 4569, -19450, -25739, 64, -12367, -23046, -50393, -35923, -8204, -28677, -45860, -73169, -50965, -36759, -28230, -3675, 11007, 8099]
14909H099K140j7494K2276O685q248k7908k3140j6506J2090j0388K339n247J6610
14896c8692k571L120L9090k5659L859J6758N668j4698r857j4603j4394J97L5695
14883a6087N2422J7322n9681N057L16j8804k1078m834k2095p015J6998N447Q617
14870d3415n337K6093r618L6686K7836J3165l8237l984Q0501N111l8933m5320
14858D548k917k4320l1941K3098N1313K0623J1132p635m3056m5147j5376m2845
14846a02523m270K5362L1609M76r606J4759m630R326L9266J8412Q81J776J553
14833B2391k1909k303L5432k2612k2350p636M0342k124l9055j5608k0810J1740
14821d4502L3762r970N241M8019k1259k5917J3192l086k5860Q175M8851L3451
$$ y = [8099, 10239, -7255, 15021, 21706, 13458, -14450, -37590, -54096, -42006, -52394, -50055, -55302, -38692, -41263, -38143, 947, -24712, -20853, -4095, 1573, -13125, -22982, -37585, -51979, -51782, -16087, 36335, 53657, -6024, -967, -651, -19455, -40533, -45367, -67462, -74477, -57479, -52032, -43415, -48752, -22659, -32277, 4409, 32245, 45410, 7173, 3189, 83690, 88801, 49868, 4548, 1631, -22689, -54630, -31532, 19781, 40404, 51536, 43901, 845, -44302, -59678, -102523, -106793, -81431, -49822, -49346, -58952, -44193, -48823, -39497, -231, 18181, 19062, 20838, 22391, 482, -1821, 33611, 10999, -11351, -18987, 21355, 19231, -19824, -35432, -56242, -44502, -10740, -20710, -15469, 32550, 11291, -14626, -1434, -4520, -30380, -22205, 26646, 60097]
14809F0097k0011J012k4177l9356j8131q523p481j1268Q453K7609l1536L2102
14797c1210R6557l636n2377J6058J4084J5423j1377k9682j7079q979J5459j2657
14785i416J5996P277l3813J8934K6386J164m9481J7037K6920j3736l570j7197
14773a3499j6488j2046j1873J7619N0129J2645l3945k0710j9513k84J9429J5365
14761a3171j9267N510R8K19L2221K7397p653R75j3292n558j3876J3184J3775k9218
14747h656l0042M1470J8455k5655o490l6082R532J5928J636k5809K4785L7246
14735A6318l6413k9315J3715K0315L3341O9205j8014k4546j3285n5148J5731J403
14723f693l6644l2663N744M3957J9945J016j8462K356m194L2735K491k4619l3874
$$ y = [60097, 40086, 41098, 16921, -22435, -40566, -49089, -56570, -67838, -59385, -31776, -63312, -31210, 65347, 61711, 9334, 25392, 39476, 54899, 43522, 13840, -3239, -12218, 3241, -9416, 6580, 13857, -19956, -1022, 25364, 26528, -22953, -5916, 21004, 7268, 3698, -13499, -29987, -42033, -53906, -36287, 13842, 26487, -7458, -28168, -47681, -47965, -28536, -13171, -32438, -26928, -26830, -26611, 5610, 33007, 25354, 26329, 13037, 7479, -6397, 6787, 20562, -8656, -38698, 2772, 21227, -4428, -10918, -47000, -37468, -21540, -19904, -45713, -20928, 16318, -20095, -49410, -35695, -15380, 17961, 87166, 69152, 44606, 31321, -23827, -8096, -6693, -43337, -76000, -70256, -26299, -6354, -5338, -23800, -21444, -25638, 7097, 9588, -15031, -48905]
14710d8905K1787J194j7509k2694J0105K4058L2487L283r020k5515R820m614J7680
14697g843j4945j2325K4822j7980n4581k6373L7722Q1627P7233j1908o8726j1557
14685d834J3696l3425l2289l0536r444K0427K9614J9647L0196M2310J1361l6214
14673B0509n398L4281K0019m265m5108k4242R595M3854j1854k8449l1525M0760
14661A8177k4458n0892K3764K3319p644k0624N859p648k8256K6330m263j5022
14649f1358J5764p634N771o022Q442j2964k464p00N811O0899L399k9781m6843
14636f7680Q190K6573K1050n949k8278O3709k291n5089j02o45J6706k0048k9568
14623g3422J2119J4398J0689M054l1896L7406K293m5233K8892J3720K3002K6499
$$ y = [-48905, -27118, -25924, -43433, -66127, -56022, -31964, 523, 3806, -5214, -30729, -20909, -25523, -7843, -22788, -35113, -10291, -28271, -82852, -109225, -71503, 10124, 87357, 75449, 6723, -4834, 8862, -24563, -56852, -87388, -96832, -76405, -46791, -27144, 3052, 45362, 56723, 20509, 15111, 49392, 69411, 65146, 20038, -4204, 5391, 49245, 37391, 8942, -22583, 18177, -6281, -57173, -33409, -10090, -17734, -38358, -32499, -40147, -68403, -42073, -46336, -61358, -45594, -53228, -47457, -53479, -45037, -58001, -60465, -61165, -55354, 5545, 8944, -20837, -67680, -59490, -32917, -11867, -17816, -46094, 17615, 15324, -39765, -39867, -40512, -23806, -43854, -73422, -61303, -46905, -36216, -32162, -64058, -26652, -24359, -69592, -40700, -26980, -3978, 22521]
14611B2521m501j3996Q075K3834K5275m4845J7543l7742m1283k270J2877m3199
14599g7711j1505P0148L7382k3314k214J5639o82K7375Q707k8958m0486J7207
14587h412J5157k5456p132J2r365K3015K5375p768j9239K0415j1100J3612J0603
14574A9717m2577m6576J8810K6253K0435K0607J2666M657n014j4671O489l2794
14562a1998l5873k1037K905n549J1399P265N0070P35k4559J843k6846k2869L0574
14549d3940J1629L5828J9l2735J0283J2584q42q398K5980r565j8751L0762M93
14536A3347l7067J9521K3218K2663J989N20j419n3382m3984j968O7391N4372m6377
14523A8824o1625K1087J3420J8460R90N0468k0344m0785J5431K6351j3090o1226
$$ y = [22521, 18020, 4024, 12099, 35933, 61208, 16363, 33906, -3836, -45119, -47389, -34512, -77711, -89216, -19068, 18314, -5000, -7214, 8425, 7743, 35118, 43825, 14867, -25619, -8412, 6745, -18711, -25843, -25831, -35196, -12181, 13194, 5426, -13813, 6602, -4498, 9114, 19717, -22860, -69436, -50626, -24373, -3938, 16669, 29335, 33992, 28978, 14307, 20796, -11998, -47871, -68908, -66003, -71552, -60153, -52888, -2818, -2083, -26642, -24799, -51645, -74514, -43940, -32311, 3517, 3536, -29199, -18916, -6332, -7174, -15572, 10408, 843, -17908, 12854, 13347, -23720, -4199, 19019, 41682, 43671, 44191, 42772, -10610, -54594, -56562, 10829, 65201, 18824, -42801, -21714, -8294, 10166, 11156, 61624, 41280, 495, 15926, 42277, 29187, -32039]
14511c2039m7984L3351J2558k5750m4813Q376M7827L5623j3514n0677j2238J1827
14499g7453p44K0744L3609O5424L603j2195l931k4496J6378N3239p221L3344q688
14486I1613l8884R432m677J2210k8921j6440J2668r653K6901K2606j4290m986
14474E7579j7387l2604J71j3952J2536q420k5239p192K5132m171j5436J4011O525
14461h447n4122m2884j1708M2623M1437Q44r128o913J1392j9185J9673J2846k3218
14448d6790J3513Q080J1149j3590J9021j96L0180J8710k2555j4961L0308j6344
14436A6525n1585J895M89j529J1439Q252Q052K2555L307l7577L671m038K2072
14423C528J0182j9232j8659j9400K0077J6539L772m44j7467K3125M3778L615m5364
$$ y = [-32039, -80023, -46672, -34114, -59864, -104677, -96301, -48474, -12851, -26365, -77042, -89280, -77453, -78197, -57453, -23844, 41580, 45183, 32988, 29057, 4561, 20939, 74178, 66957, 100301, 91613, 52729, 62161, 57484, 69694, 40773, 24333, 37001, 27348, 54249, 76855, 62565, 57579, 40192, 7588, 7759, -6193, 6343, -2077, -27316, -34508, -9376, -13547, -28983, -14972, -8447, -62569, -105453, -117161, -74538, -33101, -32257, -41385, -48298, -36906, -56091, -36418, -23572, -46790, -33277, -25197, -14048, -27638, -8617, -8813, 21367, 40077, 17522, 2561, 32869, 16525, -35060, -33165, -32676, -34205, -22766, -14514, -6462, 16093, 19400, -18177, -14506, -18544, 3528, 13710, -5522, -24181, -43581, -23504, -6965, -3193, -3637, -21104, 2021, 45799, 49414, 4050]
14410D050k4007J5287k623m9899m1207L559P152K695N6499j3680K2305L2030N752
14397A7913q619N592M053k5290J9679K1613K7847m7053k5372M322K4567R303l2863
14384d308j1816J2247n56r911o70K126p934J3567M118L236J1460q217m3634l3131
14370g3423L349J7342J4239J4543K0298J0135q969k591P872j7521l3776K9900
14358a8602J5389k9181n234K960J4279m6045Q979J0425R867J7766o1867j4983
14346i6247J9353q778L8498K7751k0628r279r998k2341K2702L9989K6399j4325
14334f904k9019j8021R123k1351j481k748L5453N688M180P243J4156J1751M6520
14321E4590K421m3470l3439L647K7678j84j2458l5128j9568o435o955J3372L1964
$$ y = [4050, -19957, -4670, -7293, -57192, -98399, -94840, -87688, -84993, -28494, -42174, -19869, 12161, 17913, 9294, 14886, 18939, -6351, 13328, 34941, 62788, 15735, -9637, -5315, 19252, 28555, -4308, -16124, -3877, -4433, -14344, -15014, -12888, -20822, -7255, -3137, 99, 11559, 3342, -40292, -73423, -70074, -52732, -38493, -23950, -3652, 6483, -2486, -5077, 2795, -14726, -48502, -18602, -3213, -32394, -37628, -34668, -20389, -66434, -57455, -47030, -37163, -19397, -81264, -96247, -76894, -85672, -47174, -19423, -40051, -49330, -59328, -81669, -58967, -18978, 7421, -6904, -35923, -53944, -44821, -66172, -67653, -70401, -34948, -29260, -25080, -17837, -3681, 8070, 54590, 57011, 13541, -19898, -16251, 11427, 11243, -1215, -36343, -55911, -62346, -69301, -55929, -23965]
14308b3965M6174o706m8830l8039K0106o366L3889M9523r176J8971J6218q07K9573
14295H0565o2441j2412J2805j1990n53J4477j6340J0135J239M5680N706j5339
14283E1532j6573j2916p217k7135j78R982K3943m746j6076K127j9651J3314P108
14270C514LJ7548n6131J2754k2400o4392K1765J8388j0587J1920R985J4084N6108
14257A2559J9877m1703J4098K720n2181m7405K1929M3913L9224K5250j393L318
14245D0206o433K1864k9479l3725l6914J1120L0277J9611l9114j6645J1607L2810
14233E185k9460j6893J5366n221K945K598k8287J4288L8955L0404O446l4990m4207
14220d2871K762K0477k3477j5878L4193N3983K1595J6500M771K9222j1370J094
$$ y = [-23965, 22209, 15503, -33327, -71366, -51260, -57626, -23737, 25786, 16610, 35581, 51799, 50992, 80565, 18124, 5712, 18517, 6527, 5974, 20451, 4111, 14246, 15485, 61165, 66871, 51532, 34959, 22043, 14826, -12309, -12487, -2505, 21438, 16692, 616, 2743, -16908, -3594, 3514, 3517, 21065, -35066, -22312, -44712, -109104, -87339, -68951, -79538, -67618, -57633, -43549, 12559, 32436, -9267, 4831, 7551, -44630, -92035, -70106, -26193, 13031, 38281, 36888, 40206, 33773, 55637, 26158, -7567, -44481, -33361, -3084, 16527, -22587, -39232, -27625, 5185, -24275, -41168, -25802, -31023, -28078, -25480, -53767, -39479, -524, 29880, 36326, 1336, -42871, -40109, -19632, -43109, -58987, -24794, 29189, 50784, 67284, 72055, 101277, 89907, 91001]
14208I1001j2242m8417l6256m0797l3292q166M5461N733M5927J0064l6599l2059
14196d9642P669J5241L7420j4663p710p99r90k3100k2063o911K979O618o501M5401
14182a7051L0735M5577J2185r565q168r37n1875m469j8741q334L6126K2905k4379
14169D009l4461j0323K4835L5810q202j0927K2851Q773N845K2243J9232n87J1284
14156I0382p9514o3617P681J2649j9137o055q499n418J8393Q647j594J1663m488
14143c8907M8418L1150Q956K2949k6612J2913K6313J0979j9794J5343l2731m3570
14131A5407K2526N453l4342j2413o637J0119k1601O261M0147N6719k1724l7678
14119B2237q143k1562Q468k3359P874N443m0698k0554Q00J7932r428j2464L6280
$$ y = [91001, 78759, 30342, -5914, -46711, -80003, -88169, -42708, -36975, 8952, 19016, -17583, -49642, -41973, -26732, 10688, -3975, -11685, -12484, -13474, -36574, -58637, -65548, -62569, -55951, -62452, -17051, 13684, 59261, 71446, 61881, 53713, 52776, 901, -3568, -22309, -30643, 5483, 28388, 4009, -30452, -40775, -15940, 19870, 11668, 741, 23592, 32365, 38210, 60453, 79685, 79098, 90382, 10868, -52749, -45068, -32419, -51556, -57611, -66110, -71528, -53135, -44488, -46082, -34419, -38907, 9511, 40661, 49617, 72566, 45954, 58867, 85180, 96159, 76365, 91708, 58977, 15407, 37933, 43386, 9044, -3369, -10006, 113, -21488, -15227, 24920, 81639, 59915, 22237, 14094, -7468, 1000, -22359, -14485, -9042, -49740, -70294, -69494, -51562, -60990, -73454, -37174]
14106c7174K4846l0657K4183N9832J4324o6857m2501R287p78j0724R927K5483
14094b0809N0539M35k4377l2656L513L7884m3514j4599K5397K6J3239L7228K7261
14081E9567l3604m5573n9m62k5148l2619K1464J8076K3041j1299L1665L80j7216
14068a1787k2479J6914r144m1658K9927K3485J0702J6966K722m93N95k8236l1500
14055d3986J6123K3488L9614M3649l7552j6841j8047n552j1041L8124J5932R171
14043E3082q145j8420j2197l0575n774p976J3454j4006j3555M8240L5650m026
14031C5752q264J3022k7595l5568R112k558o9618l8753M4403N2141K5190l5802
14019c8538J2515K172K516P4K3042R987l1874m665m092K8022q415j8444K4973
$$ y = [-37174, -12328, -42985, -18802, 41030, 55354, -11503, -54004, -44717, -45495, -56219, -46292, -20809, 29730, 30165, 5788, -26868, -23355, 14529, -28985, -43584, -18187, -18161, -4922, 32306, 59567, 25963, -19610, -19669, -20131, -45279, -77898, -56434, -38358, -15317, -26616, 5049, 5429, -11787, -34266, -17352, -26496, -68154, -38227, -14742, -4040, 12926, 15648, 15155, 15750, -12486, -43986, -27863, -4375, 35239, 78888, 41336, 24495, 6448, 896, -10145, 27979, 43911, 53082, 44937, 26517, 14320, -16255, -22029, -30005, -16551, -30557, -44112, 4128, 39778, 35752, 27488, 40510, 12915, -22653, -13541, -16099, -85717, -124470, -80067, -27926, -2736, -38538, -26023, -23851, -21335, -21261, 1781, 11768, -20106, -24771, -28863, -841, -9256, -27700, -2727]
14006b727j0875K4115J7047m0605l7298L4260K6348r125m0358r048M3642j332
13994e956l9259J885L0001m093l5308L6617K0116l9091n076r87L0238R782j3101
13981a4232N445l1834r869k1358j8960K6176O0241M2393l7550k4453Q464K5789
13969A0252k5955K476J2865l2277k6119K3946Q636j416J5105M3664P328k19n915
13956C2371k7867j8224k2963P67L1491O268l5624R672J6266J4882l1007n526M649
13943b4845K0624R34j2725n7938k1614K1362L295J9244L3427M130J9527o400j2999
13930a3978m347L9542k2017j9246K9710j2897l2275J035J3672k554Q167n5895
13918g1083n1614K7474M9326N1845J0976k4886N191q477K1778j3709l2344K1256
$$ y = [-2727, -13602, 10513, 27560, -13045, -50343, -16083, 10265, 1140, -39218, -48266, -4624, -5956, -45215, -43330, -13329, -17422, -52730, -16113, 4003, -35088, -40164, -41151, -10913, -1131, -14232, -8787, -40621, -50490, -71848, -90808, -64632, -4391, 38002, 452, -24001, -15537, 10252, -15703, -13227, -362, -32639, -58758, -34812, -26176, -27592, -12487, 31177, 38505, 38286, 32371, 4504, -13720, -36683, -35916, -4425, 1843, -33781, -24109, -7843, 7039, -23968, -29494, -24845, -4221, -3287, -16012, -73950, -95564, -74202, -70907, -51663, -18236, -14106, 5421, -979, -13978, -18325, 21217, -800, -20046, 9664, -3233, -35508, -34473, -20801, -23355, -15188, -71083, -122697, -95223, -45897, 5948, 16924, -7962, -2771, -11248, 10530, -3179, -35523, -14267]
13906a4267N2965j1751p985M797k3034k0766Q30J0596j353K0900K0979J8185J6892
13893F6988m2555L8273K9432J845o0739k8393P882L5853M8874K9825K0083Q627
13881A55995J4257k1362m7450p1783j0223O0419J4053o4691m3994j5824K6536
13870d067L3786k1785k4279K548J5508k0777L3540K5398K2744J9187l6923k3098
13858B1782O51J1987k220p384J7250j0581J8892J1861l755p130N526J2080k688
13845F6271L943o195k963L0051K1371J04093O4158J05305K9760l6252k6864j8609
13833C34069p4710l7441q2483j5350L9118L346m9540n0390k7347l497l2038k3425
13821a9688L2245P070j4277m4547k7696J8377N8134J2010J5018M2169j6137j4571
$$ y = [-14267, 38698, 26947, 18962, 23759, 725, -20041, -19211, -8615, -9968, 10932, 31911, 50096, 66988, 24433, 62706, 92138, 93983, 33244, 4851, 12733, 48586, 97460, 127285, 147368, 155995, 170252, 148890, 101440, 29657, 19434, 79853, 93906, 29215, -14779, -30603, -4067, 29719, 7934, -16345, -13797, 1711, -19066, 14474, 39872, 62616, 81803, 44880, 21782, 22433, 34420, 32200, 24816, 42066, 31485, 50377, 62238, 58483, 51353, 56879, 68959, 66271, 70214, 64019, 61056, 91107, 112478, 216571, 280729, 386034, 415794, 379542, 352678, 334069, 259359, 221918, 139435, 124085, 163203, 166549, 117009, 66619, 39272, 35775, 3737, -19688, 12557, 19627, 5350, -39197, -66893, -48516, 9618, 21628, 36646, 78815, 62678, 48107]
13809D8107q113n637p448J8624M6433K303k4076J7400p53j4751j7667K9536J16004
13796A99962N2685J1904K0211M7209Q4015N7215l1798q4006j06640r9928o0436
13785I0393j2889k661K1608J1340k5161n6061l3792L1830L3793j0778o224j064
13773D0334L859J2763k6991l2738p943J5006J1010k9719k1958K1437q09O069m972
13760a4652k4025P828o899n995M1866K7484P145K2132l2642J2633O7322K1763
13748A23960j8577O932L5729j3738n372j9404m5114M98n7287o150K2616j585N764
13735B8272k0101n0690l383O1899L8508k6868J1348k056q516K2401P228m9625
13723H417L57j1648M995N0595J1583m5802r541k4517p958j2428j4861N900j7454
$$ y = [48107, 39994, 34357, 26909, 45533, 91966, 94269, 70193, 87593, 86840, 72089, 54422, 83958, 199962, 252647, 264551, 284762, 331971, 415986, 473201, 441403, 357397, 250757, 150829, 90393, 77504, 74843, 96451, 107791, 82630, 26569, -7223, 24607, 58400, 47622, 41398, 40334, 44193, 56956, 29965, -2773, -10716, 4290, 15300, -14419, -36377, -14940, -15749, -9680, -14652, -38677, -30849, -37748, -43743, -1877, 25607, 32752, 54884, 22242, 34875, 102197, 123960, 105383, 112315, 148044, 134306, 128934, 109530, 64416, 64914, 7627, 1477, 24093, 22508, 28272, 8171, -42519, -45902, 15997, 54505, 27637, 38985, 36929, 28413, 50814, 58042, 8417, 8774, -2874, 2121, 52716, 64299, 18497, 8956, -15561, -23519, -35947, -50808, -44908, -62362]
13710f2362M437M4032O722J6424j8884l6360K8506P0019o010N997J5112j149j4727
13697E1757l1043O368J5848j8623k362K6557J0036l1114k5452k0127J6729k2945
13685b4371N585m464l4026q554J3609O1860J6083p133o596M709K8880N0236m611
13672I1207k8728K564j0798j7966q30l637R355J656n271r394m201J0617k413k933
13658B9228j3108j9445J1674m88j4202L908j0784K2855K6376M566P794M983k2122
13645C1235k2798L5314N4926k6141k8148K5581Q673j2056k0605l8114k7483L4680
13633A5064N0667N258j948K0488J1391n6641k9336k9874p255k4245J861M5134
13621E64R8664L3244l0831n2811k5196k2200R193P5767J9007M7404r830l7226
$$ y = [-62362, -57925, -13893, -7171, 9253, -9631, -45991, -17485, 52534, 46524, 52521, 67633, 66484, 51757, 20714, 27082, 42930, 24307, 21945, 48502, 58538, 27424, 1972, -18155, -1426, -24371, -18786, -23250, -57276, -65830, -52221, 9639, 25722, 18589, 11993, 16702, 45582, 95818, 91207, 62479, 65043, 54245, 36279, 35449, 31812, 41167, 42823, 37552, 28158, 23957, 34574, 32161, 29228, 16120, -3325, 8349, 7861, -6341, -2433, -13217, 9638, 36014, 40580, 48374, 53357, 31235, 8437, 43751, 98677, 72536, 44388, 69969, 78642, 66586, 45981, 7867, -19616, 15064, 65731, 70989, 69041, 89529, 100920, 44279, 14943, -14931, -22186, -46431, -44570, 564, 99228, 132472, 101641, 48830, 23634, 1434, 10627, 86394, 105401, 152805, 142975, 105749]
13609A05749l1016l7916l825J674m4967j9832O9l089K1550j6297K24J6241J5750
13596D315l079k9068L566L9917o422j0129J0202L1757L7573m2155m2140J4171
13584H508J6825J2719J4341J8822K3631M3756M3518r144k6057l570L4676l1628
13572A46397m3196k8120P235K3840j6434k5428J3582M7700m0973n3323j0263m8213
13560b7196n4486n8329K7184M4217j6224k1248N1519O1958K2002o368l8298o385
13548b1654L6500K6884M15k2700K8936O939J6021K4811l9299j4659K6788J187
13536G0169p042k3084J961M8405L560k4125n2285j5701L4035M6964k469k4378
13524E6010J2928l4201Q425M9044J0688Q829l1292m3342n3960p9600r2272o037
$$ y = [105749, 74733, 36817, 32992, 34666, -10301, -30133, -30064, -33153, -11603, -27900, -27676, -11435, 4315, 1236, -27832, -24266, 15651, 9229, -900, 9302, 41059, 78632, 36477, -5663, 8508, 25333, 38052, 52393, 71215, 94846, 138602, 182120, 172976, 146919, 143349, 178025, 146397, 103201, 75081, 82316, 106156, 89722, 64294, 77876, 125576, 84603, 31280, 21017, -27196, -81682, -140011, -112827, -68610, -84834, -106082, -54563, 7395, 29397, 23029, -15269, -21654, 14846, 41730, 42145, 19445, 48381, 55320, 71341, 96152, 56853, 42194, 68982, 70169, 63127, 40043, 42004, 90409, 93969, 69844, 17559, 1858, 35893, 82857, 80388, 56010, 68938, 34737, 43162, 92206, 102894, 111723, 80431, 37089, -16871, -96471, -188743, -194780]
13512a94780O2534L4213N0732P8945M0116j0644j455m9542k2216K0242K8824O228
13500D3197M1152K0079J8393J3827n282J8159k6053o349n254j336j859k7244J9249
13487A00679J6718J3648r65r285J9814K5617N592J9576M9036N6792l0677k2211
13475B44334l523n6040J4167k1972n5170n0235l1982N5334P8532J4093k4754l8954
13463A23830l7526M6632K4921N7268L9722O0468J2424k2459j9758K7149N5797
13452C68468R7701L5912K9837r939l113K5301L8003L5116J042M3864O1717P8563
13440H02472P8554Q4723L8164O199P5408J27430J23395J66163J72905J21625J71161
13429A968199K27015K92840M37519N65325P65932J078617J647773K680072M113401
$$ y = [-194780, -132246, -98033, -47301, 31644, 71760, 61116, 59661, 10119, -12097, 8145, 36969, 43197, 84349, 104428, 122821, 136648, 131366, 149525, 123472, 117123, 111869, 110533, 108674, 81430, 100679, 117397, 131045, 130080, 120795, 140609, 166226, 171818, 191394, 240430, 297222, 266545, 244334, 240811, 184771, 198938, 176966, 121796, 71561, 39579, 94913, 173445, 187538, 162784, 123830, 86304, 132936, 157857, 215125, 254847, 315315, 327739, 305280, 285522, 312671, 368468, 466169, 502081, 531918, 521979, 518866, 544167, 582170, 617286, 618328, 662192, 723909, 802472, 881026, 965749, 1003913, 1010112, 1085520, 1212950, 1336345, 1502508, 1675413, 1797038, 1968199, 2195214, 2488054, 2925573, 3490898, 4256830, 5335447, 6983220, 9663292, 13776693]
13420A3776693M961997L817763J948799Q68398m26735k957519m960994m343698
13412A2684704k862135j828671j186113q20640n66912m33541l38674l59034k81591
13403D007393k23350j59553j40520n5471p80J5308j160K0550K5644J00731J50040
13392C738832J11278J93537K38583L12739L74833M08779M92239N16634O65762
13383G053216Q92475J128014J479035K047065L070853M755557P576033J1933170
13375C9935418J5939156J3753554O575821K697270k26702p339891j6437068j5536956
13367C9360602r845280n884817l729633k568020j924420j527689j219028j113269
13359A1548446j074325r10652p50991o27899m51720l33701k80181k25819j75489
$$ y = [13776693, 18738690, 22556453, 24505252, 25373650, 24946915, 21989396, 17028402, 12684704, 9822569, 7993898, 6807785, 5987145, 5420233, 4986692, 4648018, 4288984, 4007393, 3784043, 3624490, 3483970, 3428499, 3427719, 3443027, 3441867, 3462417, 3488061, 3588792, 3738832, 3850110, 4043647, 4282230, 4594969, 4969802, 5378581, 5870820, 6387454, 7053216, 7945691, 9073705, 10552740, 12599805, 15670658, 20426215, 28002248, 39935418, 55874574, 69628128, 76203949, 78901219, 78674517, 71334626, 54897558, 39360602, 29515322, 23630505, 19900872, 17332852, 15408432, 13880743, 12661715, 11548446, 10474121, 9563469, 8812478, 8184579, 7732859, 7399158, 7118977, 6893158, 6717669]
13350F717669j55156j09736o4529N1047Q2764J02564K03150K86208L11989L94558
13340G820528N14398O13902P92376J081353J441946J955696K905933M522660P195194
13331B8843986J1306539J5710955J4774611P495050K912494J90961o161687j5907551
13323E9165358j6679647j0884754o481567m046302k772589k041059j580713j284948
13315A3393779j128159j129888j055607j000846q42890o21727n04774m34583l90570
13306F284735l23527k71533k53855j77281j02672j05496j19862q6191o7614N3209
13296D829913L6301R1803J82145K04899K60401L88703O14097Q61046J387679K251363
13286A1108350L537988M912301M709290K726119J146698M7934j920161m747325
$$ y = [6717669, 6562513, 6452777, 6388248, 6439295, 6522059, 6624623, 6827773, 7113981, 7425970, 7820528, 8334926, 8948828, 9741204, 10822557, 12264503, 14220199, 17126132, 21648792, 28843986, 40150525, 55861480, 70636091, 78131141, 81043635, 81234596, 75072909, 59165358, 42485711, 31600957, 25119390, 21073088, 18300499, 16259440, 14678727, 13393779, 12265620, 11135732, 10080125, 9079279, 8236389, 7614662, 7109888, 6675305, 6284735, 5961208, 5689675, 5435820, 5258539, 5155867, 5050371, 4930509, 4844318, 4776704, 4829913, 4866214, 4958017, 5140162, 5345061, 5605462, 5994165, 6608262, 7469308, 8856987, 11108350, 14646338, 19558639, 24267929, 26994048, 28140746, 28188680, 26268519, 21521194]
13278B1521194n327447l848642k378781j509461j022900p49983n17110m47527
13270E719343n08977m61482m00328m28121m00942l18062k30138k37833j84743
13261B548717j04121j26796j34159r6597j18144j62760j18049o4710o6764p0338
13251A486279l5506k9307l5177l6414l4841q5866p3327m4536l9230R409R455m9842
13239A041097k5433l207l5682l7791j3086k9098j052j5216o6012j479M6700J4659
13227H74400k2582k2926K1915n3869k1002m0868o7512k9232o4041n9457j4443
13216E00383L3379J2078j5565k4778k5147q3873l5269O312M7j1157j5113j3602
13204C27695k123J4220k4847n820K4819M0914K4K2125M6105L934j3643j6611K5342
$$ y = [21521194, 16193747, 12345105, 9966324, 8456863, 7433963, 6683980, 6166870, 5719343, 5210366, 4748884, 4348556, 3920435, 3519493, 3201431, 2971293, 2733460, 2548717, 2444596, 2317800, 2183641, 2087044, 1968900, 1806140, 1688091, 1623381, 1556617, 1486279, 1450773, 1421466, 1386289, 1349875, 1315034, 1229168, 1155841, 1111305, 1072075, 1081484, 1090939, 1041097, 1015664, 1012457, 976775, 938984, 925898, 896800, 895748, 880532, 814520, 813041, 859741, 874400, 851818, 828892, 850807, 796938, 775936, 735068, 667556, 638324, 574283, 514826, 500383, 533762, 545840, 530275, 505497, 480350, 396477, 361208, 367520, 367567, 356410, 341297, 327695, 325572, 339792, 314945, 309125, 333944, 374858, 374882, 397007, 443112, 447046, 433403, 416792, 442134]
13191D42134j2302q063j150J6057J8263L471m7961n8251m1757l0998j6733j4017
13179B48693M2832L1918q637k4886k3073L659k7667j7210M554k3636l8549j8174
13167A49824J3275N4078J2359K065j4285k3970J6693J1860L1675O86J6111Q912
13155B79283l2164J5535l769j5122n8250L6169Q2079J1469l5088j7137L6669K2164
13143C21838K0641M4062p046k6446o3471n8976l5082m1026r26j0984o3254j5967
13131F3363j5022j6616O066j8362k8304J2281M8658J1192j9318J2989J8387L2059
13119A07373K2717j5676P533k4350n0615J5124K5494l8592j9384L3742m539j12
13107E8715j620R337n705k706n944K2356J2017J9425K3154J6686l2409n2942L16
$$ y = [442134, 429832, 421769, 420619, 436676, 454939, 458410, 410449, 352198, 310441, 279443, 262710, 248693, 291525, 323443, 314806, 289920, 266847, 270506, 242839, 225629, 230183, 206547, 167998, 149824, 163099, 217177, 229536, 231601, 217316, 193346, 210039, 221899, 253574, 254260, 270371, 279283, 247119, 262654, 258885, 243763, 185513, 221682, 303761, 315230, 280142, 263005, 299674, 321838, 342479, 386541, 379495, 353049, 289578, 230602, 195520, 154494, 153568, 142584, 79330, 63363, 48341, 31725, 37791, 19429, -8875, 3406, 52064, 63256, 43938, 56927, 75314, 107373, 130090, 114414, 121947, 97597, 46982, 62106, 87600, 49008, 29624, 63366, 58827, 58715, 57095, 66432, 60727, 58021, 52077, 74433, 86450, 105875, 129029, 145715, 113306, 60364, 60680]
13094F0680m019k0146r820K124J9183k4670k7412n536K2330N5612p930J279j0912
13081E0763k2850L3485L6020k3159j5219n162k86j2772k4166K9938K9241L8835
13069A14668k2600l7526k4853n307K1002K6214q30j4131R683j3886j0439n561
13057C6434l340N123M7996R780j6155k6081j6667K0899L1936K4577m0485n3216
13045B0801J2937M4427j2867r391L6821j0138m3300m9150p23O3338L6275k4642
13033F4388m143M144l5161p326Q099L586r927M627j6746K1451L9776j1650M860
13020F5978K0244l0826K1613N0742K6024o6956m8005M394K4455K57R466j426K7990
13007A03950J649j6442l3612N1257k4996j8984n35l0191O535j3317N565R873r891
$$ y = [60680, 56661, 36515, 26695, 28819, 48002, 23332, -4080, -9616, 12714, 68326, 60396, 61675, 50763, 27913, 61398, 97418, 74259, 59040, 53878, 53592, 40820, 16654, 46592, 75833, 114668, 92068, 54542, 29689, 24382, 45384, 71598, 70768, 56637, 66320, 52434, 41995, 36434, 33094, 38217, 86213, 95993, 79838, 53757, 37090, 57989, 89925, 114502, 74017, 20801, 33738, 78165, 65298, 55907, 92728, 82590, 39290, -9860, -10583, 52755, 89030, 64388, 60245, 64389, 29228, 21902, 30001, 33587, 23660, 28287, 11541, 32992, 72768, 61118, 65978, 86222, 55396, 77009, 127751, 153775, 86819, 38814, 43208, 67663, 67920, 77386, 75960, 103950, 105599, 89157, 55545, 106802, 81806, 62822, 62287, 32096, 38631, 25314, 30879, 40752, 30861]
12994C0861j126n262L4358N6377l2097p3003k2732k254p24R054L7938J0637k4568
12981A7459J9694k836N1886K1783j095r237p271j9548l4693k3290K8517L6045
12969G7414J5847J1901k4457J758L6584j5363j3374n500o594J8248O227k2796
12957G9895P79O196K0787k4411k5051l161L7143K2864J1721M998J05209O9454
12945C06423L0646N4049P0159R0958J88341L14955L40136J87467Q3527N0422o3837
12934A653246k44187m19447l15238j74930p1215o3258m2614l0861L074J0068l4370
12923B70268k8285K3320o1212l4116r643j048J3882K031q118j3305K1170K5449
12911B00393J1016k3794J2419k5339R518K1567l6200L6987Q5735O2649K4213O1137
$$ y = [30861, 29735, 24473, 58831, 115208, 83111, 10108, -12624, -14878, -15602, -6548, 31390, 42027, 17459, 37153, 34317, 86203, 107986, 106891, 97654, 90383, 70835, 36142, 12852, 41369, 77414, 93261, 105162, 80705, 82463, 119047, 103684, 90310, 84810, 78216, 96464, 102691, 79895, 80674, 86870, 107657, 83246, 58195, 55034, 92177, 115041, 126762, 131760, 236969, 306423, 337069, 391118, 461277, 552235, 740576, 1055531, 1395667, 1583134, 1666661, 1717083, 1653246, 1409059, 989612, 674374, 499444, 428229, 364971, 322357, 291496, 294570, 304638, 270268, 241983, 265303, 204091, 169975, 160332, 159284, 173166, 175197, 167079, 153774, 174944, 200393, 211409, 187615, 200034, 174695, 184213, 205780, 169580, 206567, 292302, 354951, 379164, 440301]
12899D40301L4133n9110j2071n3254q2498k9917o3661q3746k7720M1062l0026
12888G3493l271L8199L1139J6467p460k8360j5291L3620L1926J7456n1713k5427
12876A10778r265m3504l7264l6723N886O2884J0899J6616J6474J3410K8035L03
12864A38529L1930l8951l3817K7355J4155n043R2970J16627M6124M667R596O80
12852D04822j341n7123p5080q7505n8642j8358N070l3787j3420J1352L6897j5088
12840I7797J8198m9146k4582k2319L488J8324K2972J9871L9185k2008j6690l1372
12828E3718k9688L7242r536J6144P622j029J8520J4877k3601m6584q565J3936
12816D3056K9947k8668j1539J4088O3418Q2817M9271l1701n6718k2346L7813j213
$$ y = [440301, 474434, 415324, 403253, 349999, 267501, 237584, 173923, 90177, 62457, 103519, 73493, 70222, 108421, 139560, 156027, 148567, 120207, 104916, 138536, 170462, 187918, 136205, 110778, 101513, 58009, 20745, -15978, -10092, 52792, 63691, 80307, 96781, 110191, 138226, 138529, 170459, 131508, 97691, 125046, 139201, 134158, 227128, 343755, 389879, 394546, 404142, 404822, 403481, 346358, 271278, 183773, 125131, 106773, 111843, 78056, 64636, 75988, 112885, 97797, 115995, 66849, 42267, 19948, 23436, 41760, 64732, 84603, 123788, 101780, 85090, 53718, 24030, 61272, 51736, 67880, 75502, 74473, 92993, 107870, 84269, 37685, 29120, 43056, 73003, 44335, 32796, 46884, 110302, 193119, 242390, 210689, 153971, 131625, 169438, 168225]
12804A68225k1021m1900l4100P367L9099n2425m3173L6770J5794J175k3611j5369
12792C6831K98j6061J5176P664M8668R336n5466m3823j0340L6326K3630L3139
12780H5378o592n4482j4976o63q221J694j267K6288o421K6864M330j1179N014
12767D5767k8718K0627M923k3292k7028j1944j1966J3679M0492j9272l8301o5208
12755a00241K089L4786M4441j0705m0683n8198O5813O7157K6418J6353o749l7764
12743B717J6556J930K310J5269K6456j4202j9060k6590M4611j8019j919L1070
12731F1129O517L475n0624l2866J005J619J1599r928k0272K4404j0739k3292K8100
12718i873L8201K2826j1648l4275j4820M0068M1598l4622l8979j0176q586L5055
$$ y = [168225, 147204, 105304, 71204, 78571, 117670, 65245, 22072, 58842, 74636, 75811, 52200, 36831, 37129, 21068, 36244, 43908, 92576, 101912, 46446, 2623, -7717, 28609, 52239, 85378, 78786, 24304, 9328, 8665, 444, 2138, 871, 27159, 20738, 47602, 51932, 40753, 45767, 17049, 37676, 42599, 19307, -7721, -19665, -31631, -17952, 22540, 3268, -35033, -100241, -98152, -63366, -18925, -29630, -70313, -128511, -62698, 4459, 30877, 47230, 40481, 2717, 19273, 21203, 23513, 38782, 65238, 51036, 31976, 5386, 49997, 31978, 30059, 61129, 67646, 71121, 20497, -12369, -11364, -9745, 1854, -8074, -28346, -3942, -14681, -37973, -9873, 28328, 51154, 39506, 5231, -9589, 30479, 72077, 37455, -1524, -11700, -20286, 14769]
12706A4769L6332j9430J6512J4264p747k5085j9558j4203Q959P442l6597J4876
12694i466O4090L6922J3623j5906l9138l2371L2284J314n118l5950K5119J1932
12682D7335m9723L742P480k3176P591J4736J4305J747q626j9663q280K0480r616
12669a668j95j1146J9508k6937j3351K5105L040J9898L2221O733k9982J2224K1033
12656E6483K568k1852k1315k584J6230K2187o164k8657k3168p877L2818j1304
12644G365J3575K7097k858o152n4923l4599O2660M0551l640L1561L4287K6453
12632A41377L1844k765L2196K1458J2446M6735J01857J90615K23994K03868J02859
12621A106484Q1211L3910j40829k80201k63918j64698q0829l1946q850m3014k1883
$$ y = [14769, 51101, 31671, 48183, 62447, 54700, 29615, 10057, -4146, 4813, 12255, -24342, -9466, 54624, 91546, 105169, 89263, 50125, 17754, 50038, 51352, 46234, 10284, 35403, 47335, -2388, 1354, 8834, -14342, -6751, 7985, 22290, 24037, 15411, -4252, -12532, 7948, -1668, -1863, -13009, 6499, -20438, -33789, -8684, -5644, 14254, 46475, 53208, 23226, 35450, 56483, 59051, 37199, 15884, 13300, 29530, 51717, 45553, 16896, -6272, -14149, 18669, 7365, 20940, 48037, 45179, 39027, -15896, -50495, 12165, 52716, 49076, 80637, 114924, 141377, 173221, 170456, 202652, 224110, 236556, 283291, 385148, 575763, 799757, 1003625, 1106484, 1187695, 1221605, 1080776, 800575, 536657, 371959, 291130, 259184, 250334, 207320, 185437]
12610A85437l2824k5036j8433N2415j3606m4596k9037k556L4600j1986q197j8867
12598F7314n3343l3176M797J8838J508j406k2012O562p584p008l648n6228Q047
12585g7339L6706k637q886p278N793J4169K0424O990j4159K5519K9935j7182J228
12572A3283K5242o681j9057j0931M417l1843O42L3858K7511J917j7510k2788N6535
12559E4595r922l8836M2753j6117o087j1688K3602J5975j8280k8285K2795R35
12547C1440J388J8386l9625O174L4308j4737m2069J4578k5685o615k5658J3482
12535c4633J4910L3295Q798K8357J7123M177l459l3457m0151K1460M0133k5289
12523C1264l9969J0982Q077l1039L0657J5525j7207l0269N320K5868K4J1693k9629
$$ y = [185437, 152613, 127577, 109144, 161559, 147953, 103357, 74320, 71764, 106364, 94378, 86181, 67314, 13971, -19205, -14408, 4430, 5938, 4532, -17480, -10918, -18502, -25510, -29158, -85386, -77339, -40633, -43270, -52156, -59434, -53641, -39472, -19048, -12058, -26217, -698, 29237, 12055, 13283, 38525, 31844, 12787, 1856, 6273, -25570, -24928, 8930, 36441, 38358, 20848, -1940, 54595, 44673, 5837, 48590, 32473, 26386, 14698, 38300, 54275, 35995, 7710, 30505, 31440, 32828, 51214, 11589, 17763, 52071, 37334, -4735, 9843, -15842, -22457, -48115, -34633, -19723, 13572, 22370, 50727, 67850, 72027, 68568, 35111, -5040, 16420, 56553, 31264, -8705, 2277, 10354, -20685, 9972, 25497, 8290, -21979, -16659, 9209, 9233, 20926, -8703]
12510h703q220j1266P214L3153J9475O149J1404J8273j0266k1746m452J9425j4219
12497C6221j8805k5087j4297J1531J6256L1333j1579o0125L6466M8992r706k8285
12485A2915o976j9803P723K383m0489K5086N9009K289K222q827j2969l3109M2523
12472C1977j2375m8717k7537N436K6568J7655K0157J2797l7112l0769j7059K8006
12460c0973m487L9188J4008j6323k3030K5105K275J829K246R039p107l9229P514
12447a9945J9540M0299j0147N5130K725k3978k4866K0193n871l0784P090M5024
12435G4410j4178j4204N166N1372o615m9537n420j1693j1114O760L8354K8682
12423I1983M031m4407k1042j945J2769j4570l9667j4676l111l2934P168O3600
$$ y = [-8703, -16923, -28189, -20975, 12178, 31653, 37802, 49206, 67479, 57213, 35467, 31015, 50440, 36221, 17416, -7671, -21968, -10437, 5819, 37152, 25573, -34552, 1914, 50906, 41200, 12915, 5939, -13864, -6141, -3758, -44247, -19161, 39848, 42137, 44359, 35532, 22563, -10546, 31977, 19602, -29115, -56652, -51216, -24648, -6993, 13164, 25961, -11151, -41920, -58979, -30973, -35460, 3728, 17736, 1413, -21617, 3488, 5763, 7592, 9838, 18877, 11770, -27459, -19945, -405, 39894, 29747, 84877, 87602, 63624, 38758, 58951, 53080, 22296, 29386, 74410, 60232, 46028, 51194, 102566, 95951, 46414, 40994, 29301, 18187, 24947, 63301, 91983, 96014, 51607, 30565, 28620, 41389, 26819, -12848, -27524, -30635, -63569, -56401, 7199]
12411G199M1067k6873J1681k2607l5327j3633l412R619m799J7296L6211J1351
12399B7773l2655j5498J2566j4695k5127k0957r18k8401J5319L3067P01j6104
12387f4929j0963J440l735J9176M2940j042p525Q626L048l219n027L117L2405
12374A4312R044j8774k1993N433J7717J3065k4403P393n776O903J6357N84k7605
12361g743q755M45M7793M8100J207m2635l2904k5501L4045n77P862l2599K3418
12348A2156N20J5791L8507M0388j5237m1540P760K8790k6956m4271o6013K5863
12336b4242N4166q747j3236J7535j2139k8478P781k8555J6591R673M494j4046
12324a9203n3267k2624L3443J6033k9689K1060N6982L4472M4895J4197l6010q5146
$$ y = [7199, 48266, 21393, 33074, 10467, -24860, -38493, -41905, -32286, -37085, -19789, 16422, 27773, -4882, -20380, -7814, -22509, -47636, -68593, -69511, -97912, -82593, -49526, -48825, -64929, -75892, -74452, -78187, -59011, -16071, -17113, -24638, -16012, -12964, -16183, -21210, -18093, 14312, 23356, 4582, -17411, -11978, 5739, 18804, -5599, 1794, -3982, 2921, 19278, 19862, -7743, -16498, -16053, 31740, 79840, 81047, 38412, 5508, -19993, 14052, 13475, 21337, -11262, 12156, 12676, 28467, 66974, 107362, 92125, 50585, 58345, 87135, 60179, 15908, -50105, -24242, 29924, 21177, 7941, 25476, 13337, -15141, -7360, -35915, -19324, -9651, -5157, -19203, -72470, -95094, -61651, -45618, -75307, -54247, 2735, 37207, 82102, 96299, 60289, -24857]
12312b4857j1094L5973M2122J1189Q662J620j6553q432o6007q880p177o118m61
12299e0013J061m9027l2233O1548K2528J2238Q443o390j5158K7335J3153J0452
12287C937p987M287r281Q295k2268l7722K1619K1199J2773N174m9658p1916k3387
12274a44935N6339L6481J631j6190K5889M9666M5043m8746n4117k8007K8539j716
12262e0123J0044J5061J3064j7702k282K139j4941m0841k2742L4725R3560L244
12250B3206m5917n1026K4160L0296K3904J6507Q238o136j6035l2672J180K1703
12238b592r858K6570L6002K4786l9518l1221K3382n4473m8644L7530R677j2390
12226d0749L2228L2182l4062j1983J1884l7826J6768L3967K6588m0684L14k5634
$$ y = [-24857, -35951, 22, 42144, 53333, 61995, 63615, 47062, 38630, -27377, -36257, -43434, -49552, -50013, -48952, -97979, -130212, -68664, -46136, -33898, -25455, -31845, -47003, -19668, -6515, 3937, -4050, 237, -9044, -749, -23017, -60739, -39120, -17921, -5148, 26, -49632, -121548, -144935, -88596, -52115, -50484, -66674, -40785, 8881, 53924, 5178, -48939, -76946, -48407, -50123, -40079, -25018, -11954, -29656, -31938, -29799, -44740, -85581, -108323, -73598, 19962, 23206, -22711, -73737, -49577, -19281, 4623, 21130, 29368, 23232, 7197, -25475, -24295, -2592, -12450, 14120, 50122, 74908, 35390, 4169, 27551, -26922, -75566, -38036, -28359, -40749, -8521, 23661, -10401, -22384, -10500, -48326, -31558, 2409, 28997, -11687, -11373, -37007]
12214c7007R535L787n1418N6075K2052k5175q542q123M4565L1626j9649k5557
12202g831p216n1013l1692J1038N0213L1198K4326J7421J8981k8103n0744n6233
12190g9655J2671j0287K1974J524r461K8022N3818K483r034O540O3012K5250m2186
12177F4671k8426l0866k7443j5971K9787J633K642j0659k3316j9330N397j1276
12165f3157n374O2637J669J1097q669J8539M9871m836j1257l1785m1838j3423
12153c6526k906n438K8656J5455j6813j1828J8002j2251M9288j4116l3670L6095
12141A3948J8350k4822p979O071O773k4048Q536j9170o1489M1837Q3008n1022
12129a0007R932J7894j5713m2468J9476J9517K041K0497j436k5836m4696L1514
$$ y = [-37007, -27472, -23685, -75103, -19028, 3024, -22151, -30693, -38816, 5749, 37375, 17726, -7831, -15047, -66060, -97752, -86714, -36501, -5303, 19023, 36444, 55425, 27322, -23422, -79655, -66984, -77271, -55297, -53773, -63234, -35212, 18606, 21089, 12055, 18595, 81607, 106857, 64671, 36245, 5379, -22064, -38035, -8248, -6615, -3973, -14632, -37948, -57278, -51881, -63157, -68531, -5894, -4225, 6872, -1797, 16742, 66613, 61777, 50520, 18735, -23103, -36526, -39432, -44870, -16214, -759, -17572, -29400, -11398, -23649, 25639, 11523, -22147, 13948, 32298, 7476, -503, 5568, 12341, -11707, -3171, -22341, -83830, -41993, 41015, -10007, -75, 17819, 2106, -40362, -20886, -1369, 672, 21169, 19733, -6103, -50799, -19285]
12117a9285q378n5637L886J7205M8803L6524J003k015n552J380j4639j8689K5101
12104I707l864j446j5865r155k8837n116q941J9601K6403K4659R373j7804j2909
12091a4194k0400M8290J1335j5333q968o4762L5413L9549n231M74j457M0742J6913
12078F2371Q700k0358m5556j6390J4983O475R326J96j6014o631j996k5774r263
12065c9931M99o334N0306m9985m8802K5840N7263J3599l9300m4402K1994j2772
12053g2025l770J3914J0881k603n868o903L8627M9605J8686j7159k2954j4487
12041a4056k6777Q297J7462J9692M127k8827P515l917q431l896j1348k2463l3423
12028i6045Q738R0895J5853L7141j0215k7840J9158n587k2641r345L706j5370
$$ y = [-19285, -27663, -83300, -79414, -62209, -13406, 23118, 24121, 22106, 16554, 17934, 3295, -15394, 9707, 5843, 4397, -11468, -20623, -49460, -54576, -63517, -43916, -17513, 7146, 16519, -1285, -14194, -34594, 13696, 25031, 9698, 730, -64032, -28619, 10930, 5699, 6173, 4716, 45458, 62371, 71071, 50713, 5157, -11233, 3750, 10225, 19551, 19747, 3733, -2898, -4894, -30668, -39931, -39432, -45766, 4540, -45445, -94247, -68407, -11144, 2455, -36845, -81247, -59253, -72025, -75795, -61881, -51000, -53603, -59471, -66374, -27747, 21858, 40544, 23385, 431, -14056, -40833, -32536, -15074, 4618, 8745, -20082, -12567, -16484, -24915, -28811, -40159, -62622, -96045, -87307, 3588, 19441, 56582, 46367, 18527, 37685, 32098, 9457, 112, 3818, -11552]
12016a1552j4043J0947j0181K235r925j4482L4331M2341l1555j5027l1054J607
12004d6358L3691p666j4045J3099l0654K794N021j7885q188J0918L2686k785j0147
11991c9519J8643K7399Q822L9976L495n3323k4998o624k7405j7314K199P1885
11979C236J7082q133k0903j5638k3949N825J5585j966J829J3819K0243q045j9170
11966b0185l874K0647K3489O1764J0166p8k7785k4281k5949l3620K4202J5334
11954A9830j0360l242N428l2006k6486k6304K7837M2553m541J8689M6969L1498
11942H9865k7633l5994j2546m201R456m7805k2847K5949J1928J7752J1647m5176
11930b9605K3794k1207R056L93J8070n389R063J1563p349k9868J004M6062K0194
$$ y = [-11552, -25595, -14648, -24829, -22594, -32519, -47001, -12670, 29671, -1884, -16911, -47965, -46358, -12667, -20333, -34378, -21279, -51933, -49139, -44118, -62003, -70191, -59273, -26587, -29372, -39519, -20876, 6523, 15345, 55321, 58816, 5493, -19505, -26129, -53534, -70848, -68649, 3236, 20318, 12185, -8718, -24356, -48305, -42480, -26895, -28861, -27032, -13213, 7030, -1015, -20185, -24059, -3412, 20077, 81841, 92007, 91929, 64144, 39863, 13914, -19706, 4496, 19830, 9470, 6228, 11656, -20350, -46836, -73140, -45303, -2750, -7291, 11398, 58367, 89865, 62232, 26238, 13692, 9491, 18947, -28858, -51705, -25756, -13828, 3924, 15571, -29605, -5811, -27018, -17962, -17569, 501, -4888, 4175, 15738, 8389, -21479, -20475, 25587, 45781]
11917D5781n5148J450j8389K0432P9085j4179l4445l5944j295J9099m73o790M5372
11904D4556J5946k1605j807k7276m0142L1865J5254L14o036j1870r078r803j8340
11891c8022K1063M1469L6934j6147j0380J1721k6333j8140L1703k8768o887R036
11879G249K5762q69p132K5622k724n4096L221j5442l92k3669r946J2002j7101
11866e7515k0173k820J0175K0700m764J7145k2674j3175l5270l303L9246O0072
11854a2356J4643m515L9342j7257o663K5323k9271M32J0427J6637k7939j9883
11842a1080L912n366M324k9013k3365Q681L5736r30p964j3977J9608L505J1474
11829d455J3415K0159k3021q692J2865J8342o235k0284J5702R258k3106j4810
$$ y = [45781, -9367, -7917, -26306, -5874, 73211, 59032, 24587, -11357, -12652, 6447, 5974, -816, 44556, 60502, 38897, 37090, 9814, -30328, 1537, 16791, 17105, 11069, -801, -9879, -19682, -38022, -16959, 24510, 61444, 45297, 34917, 46638, 20305, 2165, 33868, 5100, -1787, 7249, 33011, 32142, 25010, 50632, 47908, -6188, -2967, -18409, -18801, -42470, -52416, -40414, -57515, -77688, -80508, -70333, -49633, -54397, -37252, -59926, -73101, -108371, -111674, -72428, -12356, 2287, -2228, 37114, 19857, 13194, 38517, 9246, 9678, 20105, 36742, 8803, -11080, -7168, -12534, -8210, -37223, -60588, -51907, -16171, -17101, -25065, -39042, -19434, -15929, -4455, 8960, 29119, 6098, -2594, 10271, 28613, 22378, 2094, 17796, 27054, 3948, -10862]
11817a0862m9804L1209M0646K0222k0760n5139l8351M0942N3116K2972J470L2703
11805F8364J5917m0941j4190k6242K1519M477O805q432j2127M0183j713m5893
11793G727l5502j6304k8150k1106L5469J8723J0243M255J0409o454P210l531j9785
11780c6796K5227L3702k8075j8156M2193l900k5221m1195n8475k2736M4956N7777
11768c0699L3827l5710J688K3715J1907k5828J0868m3108P207K440M8828J890
11756G025m8675J4942N4719L2032k1969j0707N1425j4868m8762l6120n083L0538
11744D497J4110k5552k4967J9756O9859L6969l532k3191m3351k115k719p7039
11732e7275k9715P358N9097O5002j4483j5765K1999K6225q13j9570l5227J472
$$ y = [-10862, -60666, -29457, 11189, 31411, 10651, -44488, -82839, -41897, 11219, 34191, 35661, 68364, 84281, 43340, 29150, 2908, 24427, 28904, 35709, 27277, 15150, 55333, 53620, 7727, -27775, -44079, -72229, -93335, -57866, -39143, -28900, -24645, -14236, -20690, -13480, -17011, -36796, -11569, 22133, -5942, -24098, 18095, 14195, -11026, -52221, -110696, -133432, -88476, -30699, 3128, -32582, -30894, -7179, 4728, -21100, -10232, -53340, -46133, -43693, 5135, 7025, -41650, -26708, 28011, 60043, 38074, 27367, 78792, 63924, 15162, -20958, -26041, 4497, 18607, -6945, -31912, -12156, 57703, 94672, 91140, 67949, 24598, 22483, 19764, -57275, -86990, -79632, -20535, 44467, 29984, 14219, 36218, 62443, 61630, 42060, 6833, 8305]
11720H305J751K9397K5493J0711k3045l3292K1853N709j7452l1031m7838J4177
11708c5262M9064j899r993K2698j0777l5655J359k3155j7580J2221n867J7437
11696c7409P859j0029j5517k351L640l804J5206N8827J343m4391k1270O66K0597
11683b6633L590o5652j7293M6165K764k500l1248m5343M6448O8651n1064J557
11671g0558K7078L3674l0105J1306K8141J5261J249j1275q323n0403k2420q484
11659h4859p008K9179O5866J1487j673j6629K913l4816j8997J8028o673L256K4366
11646a5560k3989j6126N7909J1948j9446k2320J9374L2667o993J3231k4738l9329
11634c3372J1140k452K3879j9791k7042K7853Q597J5023o508Q331K3322J639n7587
$$ y = [8305, 10056, 39453, 64946, 75657, 52612, 19320, 41173, 46882, 29430, -1601, -49439, -35262, 13802, 11903, 1910, 24608, 13831, -21824, -20465, -43620, -61200, -48979, -54846, -37409, -29550, -39579, -55096, -57447, -53807, -57611, -42405, 16422, 17765, -26626, -47896, -47230, -26633, -23043, -88695, -105988, -59823, -57059, -59559, -90807, -136150, -89702, -21051, -72115, -70558, -43480, -9806, -39911, -28605, -464, 14797, 16046, 4771, -3552, -53955, -76375, -84859, -91867, -62688, 3178, 14665, 12992, -3637, -724, -35540, -54537, -36509, -43182, -39926, -15560, -39549, -55675, 2234, 14182, -5264, -27584, -8210, 24457, 17464, 30695, 5957, -33372, -22232, -24684, -805, -20596, -47638, -19785, -11188, 3835, -2673, 5658, 28980, 30619, -26968]
11621b6968K040L9228K2453o4889r708K3820R858j8157o588K6928j6410L3034
11609A4641k7083J2505j561Q634m265n3368J0313j2432j9828J3707J3803M0542
11597d392L489j5894n0892k723l822M5627J7334N5843J2185l7665p0006k4706
11585g5622J6146m11m857J5417J2621J1956J9268L6442j2237l6956m03M1827j4724
11572H467r658M0376K7883n285r630l7297k4567L9375K9897n3008n1915K146K5042
11559a8174K4274J1072R0k2825l1460L7162K2221Q443K3264k1228O351o993j8448
11546A3749n1351l7955K4319L6642J9700L20R72m5834M797J8832q809k7187j1843
11533f3648L3216j0905m8452L384K3399M5352K7580j0680J8738k3314K7217n6333
$$ y = [-26968, -24928, 14300, 36753, -28136, -37844, -14024, -4166, -22323, -28911, -1983, -18393, 14641, -12442, 63, -1498, 7136, 2871, -50497, -40184, -52616, -72444, -58737, -44934, -4392, -903, -16797, -67689, -70412, -74234, -28607, -11273, 44570, 56755, 19090, -50916, -75622, -59476, -59887, -64744, -49327, -36706, -24750, -5482, 30960, 18723, -18233, -18636, 23191, 8467, -1191, 39185, 67068, 61783, 52153, 14856, -9711, 29664, 59561, 6553, -45362, -43216, -18174, 6100, 17172, 17262, -5563, -37023, 139, 22360, 30803, 54067, 32839, 39190, 32197, 13749, -37602, -75557, -51238, -14596, 5104, 5424, 6396, -39438, -34641, -15809, -24618, -51805, -63648, -30432, -41337, -89789, -86405, -63006, -17654, 9926, -754, 17984, -5330, 21887, -34446]
11521c4446l4366j8001J7315K8597J8283J1707m9843l8347M3932K5882K1509k061
11509i839M108K8544q494n8921m5894P2750P626j8817m4205J7801N2716L8761
11497C6136l1254Q973j018M7824J6549l1628P83j7207l0629m4177k2921P3433
11485D864N189m1779J3136m841k1355J6666L176N916k4077J0091L9959m49k998
11472C498k266k2457L826k907l273K0578J4275J8570n4447l967J867P860Q604
11459a0239m8831j6927O408p952l87M4093K8298m958m2686J1254L1504L7502J465
11446B8544l83J6567K9202l9150j3102L8339l2168m1642j0986K7275L9490j3166
11434B8820R577k9240m5565J0072j475K0236k3445j407M0822j5761l5088n2430
$$ y = [-34446, -68812, -86813, -69498, -40901, -22618, -10911, -60754, -99101, -55169, -29287, -7778, -9839, -5731, 22813, 14319, -44602, -90496, -17746, -10120, -28937, -73142, -55341, -2625, 36136, 4882, 13855, 12837, 60661, 77210, 45582, 46365, 29158, -1471, -45648, -68569, 4864, 10053, -31726, -18590, -23431, -44786, -28120, -24944, -19028, -43105, -33014, 6945, 6496, 3498, 1232, -21225, -17399, -20306, -23579, -3001, 11274, 29844, -24603, -28570, -26703, -18843, -10239, -59070, -75997, -69589, -77541, -77928, -33835, -5537, -10495, -53181, -41927, -10423, 27079, 28544, 28161, 44728, 73930, 34780, 21678, 60017, 27849, -13793, -24779, 2496, 41986, 28820, 38397, 9157, -36408, -26336, -27811, -7575, -31020, -32427, 8395, -7366, -42454, -94884]
11422i4884J6858L7950M019j5015n65q085l3941J6566J4597L8294Q539o720j192
11409b3579p136K2532J6269l1383K7922K3266k4843m9386j9697K7741N4220M8923
11397F4849Q98m2333k7448J3348N2443K0774o2590l0129K2797L0147L1002K2197
11385I5955k9333J3777J4242L1254O0482O1824J4552P837P507Q0817J79207L09623
11373H47744L58478K86175J30882Q1236J4164j22887l79606l68882k15970r5919
11363E35415r4311q5220o1804j2208k5618R472j8289m9969m9388P523j8716k6801
11351A10086j0361N167l2518m5628P9L2299M1396K8040J184j1220m5868l8155
11339C4501k725o430O580J3280K4526j5714l0266R517k350J3425j2946k8138r924
$$ y = [-94884, -78026, -40076, -36057, -51072, -51637, -59722, -93663, -77097, -62500, -24206, -15667, -22387, -23579, -30715, -8183, 8086, -23297, 4625, 27891, 3048, -46338, -66035, -38294, 15926, 64849, 65747, 23414, -4034, 9314, 61757, 82531, 19941, -10188, 12609, 42756, 73758, 95955, 66622, 80399, 94641, 125895, 186377, 248201, 262753, 270590, 278097, 358914, 538121, 847744, 1206222, 1492397, 1623279, 1704515, 1718679, 1595792, 1216186, 847304, 631334, 535415, 441104, 355884, 294080, 281872, 256254, 265726, 247437, 197468, 148080, 155603, 136887, 110086, 99725, 104892, 72374, 26746, 26825, 59124, 100520, 128560, 129744, 118524, 72656, 34501, 31776, 25346, 31926, 45206, 69732, 54018, 23752, 33269, 30919, 44344, 31398, 3260, -6664]
11326f664l3357J0787M7587p350J3487J1506K0505k4349l4069k4982M1149k935
11314A1315j3412R136j3726l1880j0367K3062J2775J7960k177M271P417j6504
11302b130J7232n1516q659M475M1273L2821M0990R155j5656r919P074O677O5216
11289A37033J0301k8049J3716N0419k1860K457j6964j6984k4958m0152l8429o2650
11277c6120k7275K9768k245n377j0274K9494K349M7249O4051K340o187r808q426
11264F9539l3573l1041k0910J0979K0983l3543n1629M0118N9449J1412k5295n358
11252A1131q572j4640L4380K4556j6789l9240K1379r959k7105l8384N252J5803
11240d2188J7576J9386J8464L7498k608m2588M846L3395N509M002K61k198m938
$$ y = [-6664, -40021, -29234, 18353, 11003, 24490, 35996, 56501, 32152, -1917, -26899, 14250, 11315, -2097, 7039, -6687, -38567, -48934, -25872, -13097, 4863, 2686, 6957, 14374, -2130, 15102, -36414, -45073, -40598, 675, 33496, 74486, 83641, 67985, 58066, 65140, 71817, 137033, 147334, 119285, 133001, 183420, 161560, 164017, 147053, 130069, 105111, 64959, 26530, -36120, -63395, -33627, -35872, -41249, -51523, -22029, -19680, 27569, 91620, 93960, 87773, 77965, 69539, 35966, 4925, -15985, -5006, 15977, -17566, -69195, -29077, 30372, 41784, 16489, 11131, 2559, -12081, 22299, 46855, 30066, -9174, 12205, 2246, -24859, -63243, -57991, -42188, -24612, -5226, 13238, 50736, 48128, 5540, 10386, 43781, 49290, 53292, 53553, 51355, 46417]
11227D6417k0046k6196j6066k0626J1447L7629L2095K1168M374m5186J3264Q6486
11215A24760O6653K90M0917L5360n7850L1718O7881P123m7536m9556l6384k9175
11203A54201j4831o3755j5767M4509q716m7791k7481l1451j8093j4408K0761P1599
11191D8777n164n693K7841L1448K7908K5616K9126j3881j8637m0599l9283M5210
11179A12669Q5356L3976M0298N1965k6774j1434L4544j2843o5744o4427k1883
11168A55703J6283j0405J5788j4730N331O6842k0018k3178k4806L7923M0872M1756
11156B87361P5409K2592K0304l3107j61418k14841j10543j01274j94874j25994
11146e36385P708O3300M6702L9733N8705L3080J3256J6824j2205o665j100j913
$$ y = [46417, 26371, 175, -15891, -36517, -25070, 12559, 44654, 65822, 70196, 25010, 38274, 124760, 191413, 191703, 232620, 267980, 210130, 241848, 309729, 316852, 269316, 219760, 183376, 154201, 139370, 75615, 59848, 104357, 95641, 47850, 20369, -11082, -29175, -43583, -22822, 48777, 43613, 37920, 65761, 97209, 125117, 150733, 179859, 165978, 147341, 106742, 67459, 112669, 198025, 232001, 272299, 324264, 297490, 286056, 320600, 307757, 242013, 177586, 155703, 171986, 161581, 177369, 162639, 167970, 234812, 214794, 191616, 166810, 204733, 245605, 287361, 362770, 385362, 405666, 372559, 211141, -3700, -114243, -215517, -410391, -536385, -528677, -465377, -418675, -378942, -320237, -287157, -273901, -257077, -269282, -275947, -277047, -278960]
11134b78960L2141K6541M2724N0494l701K5278m2159j4050O583R929m8430J3336
11122a80274L6226N7946K6949m9813m0901R726k844J1416P691J1110K9864N9131
11110b3773J9954m6395l3655M275L3902J0631k835j4619R08N6764l449o2237o8103
11097a28632M3680N9319K6736P963K8654J8632P3862P2991j9726N1881O1512Q1062
11085C77934Q5806J5662l3532l2404k3696p830o364k040L7286L7927k4532j3908
11073D10309j5203L083J4501M128k2672k0107k1075l1024O971J1803J9j9101n0770
11060B70862j0211M388l8033l2741J1479M6416L5562j0287k4804j777m164J2646
11048B59336Q81L9444L2154j6690m203l3201k4508J7301P1651K5361o101J2269
$$ y = [-278960, -246819, -220278, -177554, -127060, -130761, -105483, -147642, -161692, -155109, -145180, -193610, -180274, -144048, -86102, -59153, -108966, -149867, -140141, -142985, -131569, -123878, -112768, -82904, -23773, -3819, -50214, -83869, -79594, -45692, -35061, -37896, -52515, -51607, 5157, 1708, -60529, -128632, -84952, -25633, 1103, 9066, 37720, 56352, 130214, 203205, 183479, 235360, 296872, 377934, 463740, 479402, 445870, 413466, 389770, 381940, 375576, 373536, 410822, 448749, 424217, 410309, 395106, 398189, 412690, 416818, 394146, 374039, 352964, 321940, 328911, 340714, 340733, 321632, 270862, 260651, 265039, 227006, 194265, 205744, 252160, 287722, 277435, 252631, 250854, 246690, 259336, 260217, 299661, 331815, 315125, 310922, 277721, 253213, 270514, 342165, 367526, 361425, 373694]
11036C73694L7787K940n752m4004k6013K5341N5501K4910p182J6006j1859L0389
11024D71758J618l4430j7729N117O810M6666N2545M6048M9843Q773J17187J49108
11012I03314J59387J28640J17538O4657J1164j13959q5242j4793j0548O8529J23708
11001A352395R3451N0881N2321J47386J61323J52156J60180J95460K23562L14785
10991B903900L05594K95613M06224M82163N94144P48851Q94294P40254O98808
10982H069845P56710P98673O84303O44591R00432J193867J333483J517235J786216
10973A7685355K105645K634627L478073M432848N948247Q765212J3422796K1047666
10965G9520469L4500334N7086177P5084776N2060472J9640483J0349123m74001
$$ y = [373694, 411481, 414421, 408669, 364665, 338652, 363993, 419494, 444404, 437222, 453228, 441369, 471758, 473376, 438946, 421217, 426334, 433144, 479810, 532355, 578403, 628246, 637019, 754206, 903314, 1062701, 1191341, 1308879, 1373536, 1384700, 1270741, 1185499, 1170706, 1160158, 1228687, 1352395, 1445846, 1496727, 1549048, 1696434, 1857757, 2009913, 2170093, 2365553, 2589115, 2903900, 3209494, 3505107, 3911331, 4393494, 4987638, 5736489, 6630783, 7371037, 8069845, 8826555, 9625228, 10309531, 10954122, 11854554, 13048421, 14381904, 15899139, 17685355, 19791000, 22425627, 25903700, 30336548, 36284795, 45050007, 58472803, 79520469, 114020803, 171106980, 246191756, 298252228, 317892711, 328241834, 327767833]
10958C27767833m2924211q0949788o1512175l5871658k1893331j4501228j0277829
10951E9837613p671558o080378n070082m352082l734560l201233k684257k244164
10943B4799299j753582j425261j225938j008420p72889q20030q76612p67686p22534
10934A5426347r82210j116587r07749p20678o35457n07981m66292m11159l72977
10925I305257l80237m16507l75432k87584k62245l01301k42455k08104k25688
10916F605704k24656k28588k52280k43290k05148j69180j63706j38200j25381
10907D855275j49020j84013k15719k13462k16824j98958k42030k98274k71403
10898B865572j97390j00657j14892j85509j44521j43739j75775r5147j18107j16017
$$ y = [327767833, 284843622, 203893834, 142381659, 106510001, 84616670, 70115442, 59837613, 52166055, 46085677, 41015595, 36663513, 32928953, 29727720, 27043463, 24799299, 23045717, 21620456, 20394518, 19386098, 18613209, 17793179, 16916567, 16148881, 15426347, 14444137, 13327550, 12419801, 11699123, 11063666, 10555685, 10089393, 9678234, 9305257, 8925020, 8508513, 8133081, 7845497, 7583252, 7281951, 7039496, 6831392, 6605704, 6381048, 6152460, 5900180, 5656890, 5451742, 5282562, 5118856, 4980656, 4855275, 4706255, 4522242, 4306523, 4093061, 3876237, 3677279, 3435249, 3136975, 2865572, 2668182, 2567525, 2452633, 2267124, 2122603, 1978864, 1803089, 1707942, 1589835, 1473818]
10888A473818r3349q792o3656r9099o0814n0541o9572m5019k0521l9166r429k9197
10876H84663m6041m2741n6983o0166k0579K0898o721J7691Q501P209l0854q719
10864F66158k6449j5732J8774l8617m3627p6961k5304M997J2583n289K897j9731
10852D53699l1020r41k811K3843O9265J7271q077j0249n1889l1879L9061J1487
10840D77760M9669L9309M3759O3633J584j06320p6805j940O0388M4975L1550j8495
10828F09067j782J1703J649J0185j7241j2208k7705k8421n5508j7281p037p947
10816D57474L3782j2232q374K6010j793P93L4975j1817q275j1812L7579R862J7786
10803E63958j0601j1422m1249j2725o325J1221K3496K8532k606o451l3487k9036
$$ y = [1473818, 1380469, 1371677, 1308021, 1208922, 1148108, 1097567, 1027995, 982976, 962455, 923289, 913860, 884663, 838622, 795881, 738898, 678732, 658153, 679051, 672330, 690021, 698522, 705731, 674877, 666158, 639709, 623977, 642751, 604134, 560507, 483546, 458242, 463239, 475822, 470533, 473430, 453699, 422679, 421738, 418927, 442770, 512035, 529306, 521229, 510980, 459091, 427212, 466273, 477760, 527429, 566738, 610497, 674130, 675714, 569394, 492589, 490649, 551037, 596012, 627562, 609067, 607285, 618988, 620637, 630822, 613581, 601373, 573668, 545247, 489739, 472458, 465421, 457474, 491256, 479024, 470650, 496660, 494867, 495660, 530635, 518818, 510543, 498731, 536310, 546172, 563958, 553357, 541935, 500686, 487961, 481636, 492857, 516353, 544885, 542279, 535828, 502341, 473305]
10791D73305j982l95K9264N7695K4750n5800j3478J3862L8373N3756L6425P8057
10779G33832N4130K8185K5952Q0550Q7135L2194o3117r9335j81310k18995k38191
10768B41030j74552r6057J8976J6092L0630M7276L6001l4120O091K0925m092k7002
10756H1198R190l0016j4945J7327K9642l0494o5754Q116o363J4738j0078N094
10744G655K7110j490j8910L8237L6197K5695J6348k0082l0604P418J6404n4968
10732D9010o316K6035K582K796o367k4173L5660K3127j4752k9271l1856j2764
10720A3711J0876J3484n4834J0908O4164L9610M6222k0972k4510m4665q100P402
10708E3296M3750P470L1161J4420l6596k8298o28l3489k664K9607m912L28K4600
$$ y = [473305, 471323, 470928, 500192, 557887, 582637, 526837, 513359, 527221, 565594, 619350, 655775, 733832, 787962, 816147, 842099, 922649, 1009784, 1041978, 978861, 879526, 698216, 479221, 241030, 66478, -29579, -10603, 5489, 36119, 83395, 119396, 85276, 91367, 112292, 108200, 81198, 90388, 60372, 45427, 62754, 92396, 61902, -3852, 4264, -2099, 12639, 2561, 7655, 34765, 33275, 14365, 52602, 88799, 114494, 130842, 110760, 80156, 87574, 103978, 49010, 42694, 68729, 71311, 74107, 67740, 43567, 79227, 102354, 87602, 58331, 26475, 13711, 24587, 38071, -16763, -5855, 58309, 97919, 144141, 123169, 98659, 53994, 45894, 53296, 97046, 104516, 135677, 150097, 113501, 85203, 84575, 51086, 48422, 78029, 73117, 73445, 98045]
10695I8045j4551j1639k5296Q719N410J3984K4719N9125L0449l0738j8021k0943
10683A19263k0913K3557M0028j5391j7013L4091k9764O885M1372K947j3036K0624
10671A92650k5517l9124l0296l7288l584R758l0938r453O015L7219R717J8511
10659I7670k7529K820J9138l8380n1224l5242J5993L7538L5163J5217R93K066
10647G4223j6851m9003j4408K5892j084J8663N7950J9924K0001m984k8217j3450
10635H8656l6916O755J2313l5405O871J5913p436N293J9909M3569L028j6510j3764
10622I2276j1795m140m1172p232J6212l2660r571L973L5522J3295j5944N084N5373
10609I9221p551l2159L448K4126l0901m7732j8253J8922O572j5416O443M5821
$$ y = [98045, 83494, 71855, 46559, 55278, 60688, 74672, 99391, 158516, 188965, 158227, 140206, 119263, 98350, 121907, 161935, 146544, 129531, 163622, 133858, 140743, 182115, 185062, 172026, 192650, 167133, 128009, 97713, 60425, 56841, 66599, 35661, 26208, 32223, 69442, 79159, 97670, 70141, 72961, 92099, 53719, 2495, -32747, -16754, 20784, 55947, 71164, 72157, 74223, 57372, 8369, -6039, 19853, 18769, 37432, 95382, 115306, 135307, 130323, 102106, 88656, 51740, 58495, 70808, 35403, 42274, 58187, 50751, 56044, 75953, 119522, 122550, 106040, 92276, 80481, 76341, 35169, 27937, 44149, 11489, 1918, 5891, 41413, 54708, 38764, 43848, 99221, 91670, 59511, 62959, 87085, 56184, 8452, -9801, 9121, 15693, 277, 6720, 52541]
10597E2541M1529J5150k3012K1826N259j1761m0565J9R303l65L4877J1249j4384
10584A01666P554j4722k6471k629o03Q989L507l150j169n2625n4570K128O0854
10571B8759K2328J1515k334K2126K005o617L567J5656J5389J0402j5507l1435
10559G5854j550K8916M4685N0382L7619k060L0799J00676J09339J15032K42300
10548H31992L91619L31491J50587P8494L4420j71350l48783l43621k23254j43735
10538E87860j00800l1729l8355n8845p0658k3225j0459j4891l3764m9651m4993
10527A10490M1634L0805j5610P592l241j3407l1038Q429N977r0222l6161R819
10515B5067K1862M6949K0929n768R506j2739k2505k3130j5210K2864K628J1101
$$ y = [52541, 94070, 109220, 86208, 108034, 113293, 101532, 60967, 60986, 70289, 69924, 104801, 116050, 101666, 109220, 94498, 68027, 65398, 64795, 73784, 77291, 74141, 72972, 20347, -34223, -32095, 28759, 51087, 62602, 60268, 82394, 84399, 77782, 81349, 97005, 112394, 122796, 107289, 75854, 74304, 103220, 147905, 198287, 235906, 233846, 264645, 365321, 474660, 589692, 831992, 1223611, 1555102, 1705689, 1784183, 1818603, 1647253, 1298470, 954849, 731595, 587860, 487060, 455331, 416976, 358131, 287473, 264248, 253789, 238898, 205134, 155483, 110490, 152124, 182929, 167319, 174911, 171670, 158263, 127225, 135654, 141631, 51409, 15248, 25067, 46929, 93878, 114807, 109039, 118545, 105806, 83301, 60171, 44961, 67825, 70453, 81554]
10503H1554K2428k1750K8350N663r765m5042k5437J7022N56J1258m2721r55N6872
10490G8033J5234k7942k2505m3041l558k0872q728j1671L6455P6680J7198p2483
10478A2800l2854J1162K9503n447M7516J6722R651j3741r645l3655k7745j6889
10466a2622r498N775R577K8315K726p355N0477M4481k5620m9264j0223j0945q785
10453G039Q881K3645J9883K588k72K8916k380n4474q611o050r224K2682j0526
10440B2097k3918m759J2107K8162j3884k8835j0258K767k901j620K1134J1006
10428A1098N767j762J7899l024M441J0080k4715l0572o232L8277j3975j610J8886
10415B4558k0593k9453l1121N6477J2429k9092q889P7848N8755l7402l3705m464
$$ y = [81554, 103982, 82232, 110582, 116245, 106480, 61438, 36001, 53023, 53579, 64837, 22116, 21161, 78033, 93267, 65325, 42820, -221, -3779, -24651, -33379, -45050, -8595, 68085, 85283, 12800, -20054, -8892, 20611, 15164, 62680, 79402, 89053, 75312, 65667, 32012, 4267, -12622, -22120, -16345, -6768, 21547, 24273, 16918, 67395, 111876, 86256, 36992, 26769, 15824, 7039, 15920, 39565, 59448, 62036, 61764, 90680, 88300, 33826, 25215, 19165, 9941, 32623, 22097, -1821, -6580, 5527, 33689, 19805, -9030, -19288, -16521, -19422, -21042, 92, 11098, 16865, 15103, 33002, 29978, 34419, 44499, 19784, -10788, -17020, 21257, 7282, 5672, 24558, 3965, -25488, -56609, -132, 12297, -16795, -25684, 52164, 110919, 73517, 39812, 35348]
10403C5348M757j4291l1831Q878P959K9503K0587j8992m316l965K734j2380K8866
10390E2857M0577l9416k9131P274k6867l1211K5014J5246j4012J8572k260k6053
10378i410K0704M7509l8464J7439J0832r638k5064K221N539k1282k32k0334K7548
10365G368J6696K0757n4860k4666K0328J3904N409N705j8243J7383M9678J4177
10353G3636j1988n1314k1197L859K6949o429j7477K1787j4328k6378L330K6677
10341G127O066k1386K9632J1823j0949J5055J114j2717o281J2849J5983k5056
10329B3260R568l898n4766R850M2322N5838Q843l5516k0470j7115j1744l0065
10317b3893j9693J1691M4446m933m3083l2044J8594J6328P5467J3897l7222m1579
$$ y = [35348, 40105, 25814, -6017, 2861, 10820, 40323, 60910, 41918, 37602, 33637, 36371, 23991, 52857, 93434, 54018, 24887, 32161, 5294, -25917, -903, 14343, 331, 18903, 16643, -9410, 11294, 58803, 20339, 37778, 48610, 38972, 13908, 16129, 21668, 386, 154, -20180, 7368, 24064, 44821, -10039, -34705, -14377, -473, 4936, 10641, -7602, 9781, 59459, 73636, 61648, 10334, -10863, -7004, 19945, 13516, -3961, 17826, 3498, -22880, -19550, 7127, 13193, -8193, 21439, 33262, 22313, 37368, 38482, 25765, 19484, 32333, 48316, 23260, 32828, 28930, -25836, -15986, 26336, 82174, 91017, 55501, 35031, 17916, 6172, -23893, -43586, -31895, 12551, 7618, -35465, -67509, -48915, -32587, 42880, 56777, 19555, -22024]
10305b2024l4820L8080K6113k9319J0391J9443j4809J2302j3407l1156L3791J1296
10293E881m4437m0406j528P2997P5462K3238l8461o443L4121k6659l8232P6J2812
10280B8421m5596M201O101l4114k9185J6126j8973P383k279L6040J9635M0252
10268B8012J0881j1519J2726j5736k0431M164J6132p85J6695J9214k0352L722
10256D2723J5187l4022j7297N0953m2137k3366j5367n144K9778n919N88L5013
10244C0990R555o173k6203j442p793Q458q555j4565n313M3054J297k0179M5321
10231D8452K4372Q859l9320j580k3429k3780k2082k4895q206N8796J0918J8567
10219B6672J9209k9258j3391N8053k548o6537n5967M458L4873K4496Q428k724
$$ y = [-22024, -56844, -18764, 7349, -21970, -11579, 7864, -6945, 5357, -8050, -39206, -5415, 5881, -38556, -78962, -80490, -7493, 67969, 91207, 52746, 46303, 80424, 53765, 15533, 15609, 28421, -17175, -12974, -6873, -40987, -70172, -54046, -73019, -65636, -67915, -31875, -12240, 28012, 38893, 27374, 40100, 24364, 3933, 8097, 24229, 23444, 40139, 59353, 39001, 42723, 57910, 23888, 6591, 57544, 15407, -7959, -23326, -28470, 1308, -4611, -4023, 30990, 40545, 34372, 8169, 6727, -1066, 7392, -1163, -15728, -21041, 22013, 23310, 3131, 48452, 72824, 81683, 42363, 40783, 17354, -6426, -28508, -53403, -61609, -2813, 8105, 26672, 45881, 16623, 3232, 61285, 58737, -7800, -63767, -59309, -24436, 60, 8488, 5764]
10207E764q576J9991L0408n15n5223N339J3984k0428O367Q692L0664k0142J6188
10194C2513r055J6078r862J052J2625k687q239j748j2874R06J5097n872m4058
10181a6124K9358j830k4114K0158J9926M678k3146k3354k3344K5558N7649P4043
10169A19458q358p2084l3699K6681M1748o972P278r550m1705k4015J4843j9293
10157e668j7993L0931J7272m42k0533p242l8979j3204L156k0824j1962o511K4923
10144f7076M5306K8777K712p974M002p996j0721O073J7159J1487j513J4096p0818
10131c6486o8561L5118N8363K0283L765l393l0418P344P229l7551K7272L3703
10119A6668p357r111M8375P6023j3988l9200n0990j271k1035J2958n189j632o385
$$ y = [5764, -2812, 17179, 47587, 47072, -8151, -2812, 11172, -9256, -2889, 5803, 36467, 16325, 32513, 23458, 39536, 29674, 30726, 43351, 40664, 32425, 30677, 17803, 18709, 33806, 27934, -16124, 13234, 11404, -12710, 7448, 27374, 32052, 8906, -14448, -37792, -12234, 45415, 119458, 111100, 39016, 5317, 31998, 73746, 66774, 74052, 64502, 22797, -1218, 13625, -5668, -23661, 7270, 24542, 24100, 3567, -3675, -42654, -55858, -52702, -73526, -85488, -91999, -67076, -21770, 7007, 9719, 1745, 5747, -2249, -12970, -6897, 10262, 21749, 20236, 34332, -36486, -105047, -69929, -11566, 8717, 12482, 9089, -21329, -13985, -6756, -44307, -17035, 16668, 9311, 200, 48575, 124598, 110610, 71410, 20420, 19149, -1886, 11072, 5883, 4251, -2134]
10106b134m6596K4089L7508k0964m1100K154Q171R559p306M28K5984K5165J7909
10093C2867K0260J9902m164j4024J3130j7160o3202j1055M9097O4123K4235j2085
10081A01924L975k876P786j6364n416j9677m455r48l965L3074M9685O6069K4617
10068B33429K9799Q1965M4448j2158j4731K2398K2678J6957L8745L3246J26624
10057F23400J57049K04141L06557M43972P74140J576568K602309J979343N43378
10048I210857L57744L09554r62703l073083k091331r81026n71708m31962k68694
10039A497648j80710j12711j07851j59194j09855p9154p1690n4843k0689k3398
10029E77553r784m7631k9796k9599n6703o6590m5957m5007o604r069J2191L9866
$$ y = [-2134, -48730, -24641, 12867, -8097, -49197, -47043, -38872, -29313, -36619, -36191, -10207, 14958, 32867, 53127, 73029, 68865, 54841, 67971, 50811, -12391, -23446, 25651, 89774, 114009, 101924, 105899, 103023, 110809, 94445, 89029, 69352, 64897, 63949, 59984, 93058, 142743, 208812, 233429, 263228, 345193, 389641, 377483, 362752, 385150, 407828, 424785, 463530, 496776, 623400, 780449, 984590, 1291147, 1735119, 2509259, 4085827, 6688136, 8667479, 9210857, 9568601, 9878155, 8915452, 5842369, 3751038, 2770012, 2198304, 1766342, 1497648, 1316938, 1204227, 1096376, 937182, 827327, 748173, 676483, 621640, 600951, 577553, 567769, 520138, 490342, 460743, 404040, 337450, 291493, 246486, 239882, 230813, 243004, 282870]
10017B82870K5381l104n4987r814J8216J5285n7434l7779l9324m727R631L9774
10005A83988L2343P636m2394l6110m2268k1091J2958J4570P994k11O555j4804
9993A09166l3855J2919o204j5326J1089l6443J7581k1980m9673o665J799j3127
9981c0719J0124K4506J8623J0320N0894j3054M072l1277j1571J9743K5468r363
9969F7766J259j6140n2681k1874j195k3605n0283j3750L8359L7899K2159l4974
9957d7060J7097O6669j5798j1289K0041j2275j0410K2920j8376P609K6554k9749
9945A5933j1286m006k0355O385J4173J6491j0268n7720k6543K003J8872L3773
9933b2548Q86K2991k3894j8630p012P806K4289J5844n328L611j8657k0966k3017
$$ y = [282870, 308251, 305147, 250160, 240346, 258562, 273847, 216413, 178634, 139310, 134583, 144214, 183988, 216331, 223967, 181573, 145463, 103195, 82104, 95062, 109632, 117626, 117415, 123970, 109166, 75311, 88230, 82026, 66700, 77789, 41346, 58927, 36947, -12726, -19391, -17592, -30719, -20595, 3911, 22534, 32854, 83748, 70694, 74766, 43489, 31918, 51661, 77129, 67766, 69025, 52885, 204, -21670, -22865, -46470, -96753, -110503, -72144, -34245, -12086, -47060, -29963, 36706, 20908, 9619, 29660, 17385, 6975, 29895, 11519, 19128, 45682, 15933, 4647, 641, -19714, -13329, 844, 17335, 7067, -50653, -77196, -75193, -56321, -22548, -21662, 1329, -22565, -41195, -48207, -40401, -16112, -268, -5596, -1985, -20642, -41608, -64625]
9920f4625j6001J0449M2277O4294L1607j4661q711j3195j8710j5840l8809j9293
9908f1218L2526K2666j0749o929q058q098K6727N6450o768p161K8318j156j6145
9895D0405n0749r406O3252O015m3910m0879M3524O3981L1417j3994l9231o6648
9883a6223J0660J6744r518j6921J0415J4821K1294K2277j6864j9428j6286n1484
9871e0513M5581J5645L9027j8803k5172J3251l936j921l375K492P526q84L9414
9858E8332M0314j9529k0574J8511n364l5803l5612K8733J8138n1199K6525M9535
9846G2007N55O612o6531j8730q756J9885J8139m179n594J3558j0726j8427j4193
9833a6380l4926l565R588J0177p533K6384j0938l4N994J0055l4947J9826M5594
$$ y = [-64625, -80626, -70177, -27900, 36394, 68001, 53340, 44629, 31434, 12724, -3116, -41925, -61218, -28692, -6026, -16775, -23704, -31762, -39860, -13133, 43317, 36549, 29388, 57706, 56550, 40405, -10344, -19750, 43502, 49517, 5607, -35272, 8252, 72233, 103650, 89656, 50425, -16223, -5563, 11181, 1663, -15258, -4843, 9978, 31272, 53549, 36685, 17257, 971, -50513, -4932, 10713, 49740, 30937, 5765, 19016, 15080, 13159, 9784, 12276, 19802, 18918, 58332, 98646, 79117, 58543, 77054, 71690, 35887, 275, 29008, 47146, -4053, 22472, 72007, 72562, 79174, 12643, -6087, -14843, 5042, 23181, 19002, 13408, 26966, 16240, -2187, -16380, -51306, -54871, -45283, -35106, -42639, -16255, -27193, -27227, -21233, -11178, -46125, -26299, 19295]
9820A9295K1223Q784n804j0901q028J3753p177R756k6850m5812l0815M0825N6479
9807C4728J9046r431J8307O427l478J2420k7509l1997R791m054J6831n624j8824
9794A6633K0010L233L991l2033o4063j7948K766K3924J964J2273N931k2898J4883
9781c1334M7570p605j245m7051k245L4499L1643l0834k3183N855k5318m5950o186
9768a01384J7649J0984K4425L0969L72j4469k5013L8176L1783K0718l0683K168
9756E695k3981K2510N8120K7403k7011p1577k8230k2710j2330L397K7085K5941
9744a5688l568q649l3281l7159j4171N9494J9355m3835k9591N1073J1113K1175
9732b3732J1197P378j39l885j7670J1441N2127L3092l7280j04311n5898k8010
$$ y = [19295, 40518, 49302, 43498, 32597, 24569, 38322, 31145, 40901, 14051, -31761, -62576, -21751, 34728, 53774, 44343, 62650, 69077, 65599, 78019, 50510, 18513, 28304, 24250, 41081, 35457, 16633, 36643, 39876, 43867, 11834, -52229, -70177, -67411, -43487, -41523, -29250, -23319, -46217, -31334, 16236, 8631, 7386, -39665, -41910, -7411, 24232, -6602, -29785, -23930, -49248, -95198, -101384, -83735, -72751, -48326, -17357, -16985, -31454, -56467, -18291, 13492, 34210, 3527, 5695, -18286, 4224, 62344, 89747, 62736, -8841, -37071, -59781, -72111, -68714, -41629, -15688, -19256, -27905, -61186, -98345, -112516, -53022, -33667, -77502, -107093, -56020, -44907, -23732, -12535, -5157, -5296, -9181, -26851, -15410, 36717, 69809, 32529, -71782, -127680, -155690]
9720a55690K1758L7654J4550L9873J1778j8517J5898K9690M4523j0608l3110q978
9708a1179m498R986m374o870j9375L8272L5047L0675k1905l2966j0145L811j248
9695E231n266K8944N772j8418m5163J0579L8917R37K0274j3106k0282K4893K8278
9682F1590P468j3540l0476k9657l4003j9439o526K4278L1651K8772o412j1360
9670B346n789j5151N1690o970k8772j5628n519l429J4240K8805l2174q2706k4422
9657a23479p825L9878P840k3975R089N646L3179N3945J5593K3537M220J442K631
9644D1721o9891o447J8280J7197q925N686K2134J7119j7527q494j5661j9107l0972
9631e4887M434K6656L7892M602l3466J0469l4119k2767j8210N999M0085p811k4437
$$ y = [-155690, -133932, -96278, -81728, -41855, -30077, -48594, -32696, -3006, 41517, 30909, -2201, -11179, -15677, -5691, -10065, -16935, -36310, 1962, 37009, 67684, 45779, 12813, 2668, 6479, 5231, -35, 28909, 34681, 16263, -28900, -18321, 20596, 21533, 41807, 28701, 8419, 33312, 61590, 69058, 55518, 25042, -4615, -38618, -58057, -64583, -40305, -8654, 20118, 13706, 2346, -3443, -18594, 33096, 26126, -2646, -18274, -23793, -27222, -12982, 15823, -16351, -99057, -123479, -131304, -91426, -83586, -107561, -98472, -92826, -59647, -5702, 9891, 33428, 37648, 39090, 41721, -28170, -34617, -16337, 860, -8065, -2379, 19755, 36874, 19347, 10853, -4808, -23915, -54887, -50453, -23797, 14095, 18697, -14769, -4300, -38419, -61186, -79396, -73397, -33312, -41123, -65560]
9618f5560p486k4590J3407N3746p664j4575K7273L9764J9557l8307J3573J028
9606A0166O3682j2818p0687k7790K7610J7142n382j1541j1472l8238K0016J4428
9594b4884J7400J0993j9341j3407k1078J6242R149L2019N471m700M8710J7422
9582G3996p6525j1902m2468l337M1057M1476l8395n1700J9990J6197J9200L209
9570i202O2259L568j6185M181l1603k7077k700J1027j9930l2334K5396J9214J8474
9557E088Q882O663K3404j5088m4995K5531K7231J1228J0245r861R655m4741n7103
9544d3861j7495Q818J7192j4682k1654m1336p589K8637J9809N5657M6188j5857
9532A3827n2176n794L5310K9293M591l6745m4996J8906K742l866L4178q183N655
$$ y = [-65560, -73046, -97636, -84229, -30483, -38147, -52722, -25449, 14315, 33872, -4435, 9138, 10166, 73848, 61030, -9657, -37447, -9837, 7305, 1923, -9618, -21090, -59328, -39312, -24884, -7484, 3509, -15832, -29239, -50317, -34075, -24926, 7093, 12564, 7864, 56574, 73996, -2529, -14431, -56899, -60236, -19179, 22297, -16098, -67798, -47808, -31611, -12411, -9202, 53057, 56625, 40440, 44621, 13018, -14059, -16759, -5732, -25662, -57996, -32600, -13386, 5088, 13970, 20633, 44037, 28949, -16046, 9485, 36716, 47944, 58189, 48328, 57983, 13242, -43861, -61356, -52538, -35346, -50028, -71682, -113018, -120607, -91970, -72161, -16504, 29684, 13827, -38349, -44143, -8833, 20460, 25051, -11694, -56690, -37784, -35042, -38908, -4730, -12913, -7258]
9519g258P915r561O791N788j2656K0424L003j1750K3437k0257j7681k363R615
9506d553O061j7192K5911L7049n2562j2543J2761K472L8913K3066l3340k5842
9494B01k8626J4861K6422O272j9242L863q342j0750K4984K836N226p329k4178
9481a3802m2664K5079j424l7340n0103L705O5144M6501L0784M2192j5088n3099
9469a15l4969l1771j638k3068L3993l123J4515j113K4686K6457j446m7232m0318
9456h5142n457K8026M4761j2118k3334j1156K2723M1551m124M6572q28n6679m1463
9443e6668J8183j0357l0976J0988L5181K5122K0078J4855k5809j4023J5349j0561
9431h638M4359J231o8566k4609J6186k700j2805k1889L288R810O137J9890K3706
$$ y = [-7258, 657, -8904, -2113, 3675, -8981, 11443, 14446, 2696, 26133, 5876, -11805, -14168, -4553, 1508, -15684, 10227, 47276, -5286, -17829, -5068, -2596, 36317, 59383, 26043, 201, -28425, -13564, 12858, 19130, -112, 3751, -4591, -15341, 9643, 12479, 17705, 10376, -13802, -56466, -31387, -32811, -70151, -120254, -116549, -51405, -4904, 25880, 68072, 52984, -115, -35084, -66855, -68493, -91561, -57568, -60691, -46176, -47289, -22603, 3854, 2408, -44824, -85142, -90599, -62573, -17812, -29930, -53264, -64420, -41697, -146, -4270, 42302, 41474, -15205, -56668, -38485, -48842, -79818, -68830, -33649, -8527, 11551, 26406, 597, -13426, 1923, -8638, 35721, 36952, -31614, -56223, -40037, -42737, -55542, -77431, -74143, -64333, -58196, -38306, -14600]
9418a4600j4704j9965J8587k3761J6020M1631K3188J120k8857k5388j5534k721
9406d4984K8502M293J5045P99j2378J2299M6025Q962l3972j5274l422k7874l7415
9393e9394N9041O368K9688k0483l0180L954M325M2522k2121O31K565o354Q781
9380A9343m2137J8346L0290q232J824p0383l1902O259N773K8109K0708n76q901
9367c1479M02J8102k1112m819M645j0076L2691L4333j5936j2767m4264J8031N2810
9354B0561o414k224k6270m1664j5683M1811k4268L892l0336K5617M3627K6951
9342A5600l641m186P284k6864K8580M3903L6810k4840m8680j9703J0629p699j498
9329E695k6378k3649J5661Q42n091k9682J703O377j965K1925k365k0678J7419
$$ y = [-14600, -29304, -49269, -30682, -54443, -38423, 3208, 26396, 27516, -1341, -26729, -42263, -44984, -16482, -12189, 2856, 3655, -8723, 3576, 49601, 58563, 24591, 9317, 5895, -21979, -59394, -353, 6015, 35703, 15220, -14960, -11006, -6681, 35841, 13720, 14351, 16916, 10562, 19343, -22794, -4448, 25842, 17610, 19434, -50949, -82851, -76592, -70819, -42710, -22002, -22578, -31479, -31077, -12975, -34087, -38906, -34261, -44337, -11646, 22687, 6751, -6016, -50280, -32249, 20561, 14147, 11923, -14347, -56011, -71694, -29883, -54151, -50259, -80595, -54978, -11351, 15600, 11959, 7773, 15057, -11807, 16773, 60676, 97486, 72646, 23966, 4263, 14892, 7193, 5695, -20683, -44332, -28671, -27829, -32920, -62602, -60899, -54522, -56487, -34562, -36927, -57605, -40186]
9316d0186R710k1472J5889k1712j8931j6766n388J4293K7245K7298M6691K9398
9304D6069j4757j0772K7070j6129j4659j4267j0659l2566K6189l839P172J7079
9292E931K3703k1273m0877k2169k264n613P6948o914n7493K1205l381K368j6494
9279d6323M079K0476j1418k5646k1188J6826l3277J1095M5017K3838L2857m7483
9267c1147j2342L8827J6010O083L8858L7597o959r190n0263k0948J6671J8643
9255D1840M697O218O8323o721m5622O146j4595m6094j7941O4432N2919L483k9068
9242H8017o1176k1121k4329m0611K2514J7919L148J2941O1842Q224k9153m7140
9230h925m649j0688m473J7571L2774J3301j27n2467j3102K5783R303k2071m0535
$$ y = [-40186, -30476, -51948, -36059, -57771, -76702, -93468, -98856, -84563, -57318, -30020, 16671, 46069, 31312, 20540, 47610, 31481, 16822, 2555, -8104, -40670, -14481, -18320, -11148, 5931, 29634, 8361, -32516, -54685, -56949, -62562, 14386, 7472, -50021, -28816, -32197, -29829, -46323, -42244, -21768, -33186, -58832, -80020, -63194, -96471, -85376, -40359, -16521, 16336, -31147, -43489, -4662, 11348, 17431, 56289, 93886, 86927, 77737, 27474, 6526, 23197, 41840, 46537, 52755, 121078, 114357, 68735, 74881, 60286, 14192, -3749, 60683, 113602, 117085, 88017, 26841, 5720, -18609, -59220, -36706, -18787, -15639, -2698, 59144, 67368, 38215, -8925, -13574, -24262, -28735, -11164, 21610, 34911, 34784, -17683, -30785, -5002, 4301, -17770, -58305]
9217e8305k2092L4961M9399J4887q241j7618L161k375O4158L1152M673k5563j671
9204F6526j9872J9692J2984j4207r060K4710k6152m6776L5329J831J3332K433
9192F0770r882O2107M6479j3671o524j9535j1172k067KJ072R309K5354N0209q388
9178A84063l3637J235j5328P029J2030O4660K0642O713L5574L9089k3991L8468
9166C36547J8283j8413j7372Q5670P6565R8341O7846N6279P6425M1699R0168J11106
9154A023144J39121P0342Q3000J80239J60407J92233K37603K84842L27543M12632
9144C111106N42257P11344R39187J311851J773478K271947K653012K692695K147220
9135A8154097J247426K76988p33816j836367k520864k530432k150693j692105
$$ y = [-58305, -80397, -45436, 3963, 18850, 10609, -7009, -3848, -6223, 57935, 89087, 93760, 68197, 66526, 46654, 66346, 79330, 65123, 56063, 80773, 54621, 7845, 43174, 45005, 58337, 60770, 50888, 112995, 159474, 145803, 139279, 119744, 108572, 106505, 106507, 107579, 116888, 142242, 192451, 184063, 150426, 151661, 136333, 143362, 155392, 220052, 240694, 247407, 282981, 322070, 298079, 336547, 354830, 336417, 319045, 404715, 481280, 579621, 647467, 703746, 780171, 821870, 912038, 1023144, 1162265, 1232607, 1315607, 1495846, 1656253, 1848486, 2086089, 2370931, 2698474, 3111106, 3653363, 4364707, 5303894, 6615745, 8389223, 10661170, 13314182, 16006877, 18154097, 19401523, 19678511, 18944695, 17108328, 14587464, 12057032, 9906339, 8214234]
9127H214234j285680r21322p73533o08637m73911m35968l43276l11864l22362
9118B737681k31417j68159j69669j73351j59968j25893j24617o7350m7258p3460
9108A396539j26282o3021q5240r2098l1456l2884l5964m0267n2229l7497m2986
9097G56615n1817j8079m1348k4036k0606k6871m1539J6607j9102k6313k937m981
9085D95593K6978R47q668k8085l5946j243K2483n1665p7087J6883j697j2942l9604
9072C05947l6364j5930k0962J6611R660N5271J10654P3081L7574L6781M3155K7304
9060F42782k6210j18603j14045l5028o0461n1491m504k9561j6246q83k3505l160
9048A59085j5301K8729j1494m0017K1977N465n2786j2415O3588J1181m7531r672
$$ y = [8214234, 6928554, 6007232, 5233699, 4625062, 4151151, 3715183, 3371907, 3060043, 2737681, 2506264, 2338105, 2168436, 1995085, 1835117, 1709224, 1584607, 1517257, 1469999, 1396539, 1270257, 1207236, 1121996, 1029898, 998442, 965558, 929594, 889327, 837098, 799601, 756615, 704798, 686719, 645371, 621335, 600729, 573858, 532319, 548926, 529824, 503511, 500574, 495593, 522571, 523518, 514850, 486765, 450819, 449576, 472059, 420394, 343307, 360190, 358493, 345551, 305947, 269583, 253653, 232691, 249302, 258962, 314233, 424887, 497968, 535542, 572323, 615478, 642782, 616572, 497969, 383924, 348896, 288435, 236944, 232440, 202879, 186633, 185750, 162245, 159085, 143784, 172513, 161019, 121002, 142979, 148444, 95658, 83243, 146831, 158012, 110481, 100809]
9036A00809L681K495m990N588M1567J6243J2350J6596K7045m3704m2092k5791
9024A09797L4816J02800J47661J21170J90451J31912M1298J514K3352j39364k16685
9013E48722j22342l0116m9722p7296k1785J0152P493J1129m3749n0911L35q782
9001A73128n1959o97Q963k3359q362k0367j9837j1356K9185M537o771k3053L0912
8988H0964m887K1756l1702l0831M6411O7055K357k1276k6253k5120P1927O0492
8976B10893P3089O0996O1817Q0955M576p205o3913j15924q7071n0197j8424J7312
8964A66904l601o3614l025n548r997J2569j7207k427L6248K6558K6813p091l6727
8951A19855O92n7182J2020L4064k9066n845J8424M667Q104j3504m8942k8731m4462
$$ y = [100809, 104490, 106985, 101995, 107583, 149150, 165393, 177743, 194339, 221384, 177680, 135588, 109797, 144613, 247413, 395074, 516244, 706695, 838607, 879905, 881419, 904771, 765407, 548722, 426380, 396264, 346542, 269246, 247461, 257613, 265106, 276235, 232486, 181575, 181910, 173128, 121169, 120472, 129435, 106076, 97714, 77347, 57510, 46154, 75339, 79876, 73105, 50052, 80964, 76077, 97833, 66131, 35300, 81711, 148766, 151123, 129847, 103594, 78474, 150401, 210893, 283982, 344978, 406795, 487750, 492326, 485121, 421208, 305284, 218213, 168016, 149592, 166904, 163303, 99689, 96664, 91116, 81119, 93688, 76481, 74054, 110302, 136860, 163673, 156582, 119855, 120547, 63365, 75385, 109449, 80383, 74538, 92962, 97629, 105733, 92229, 43287, 14556, -29906]
8938b9906O520J1890K8242m0880J597L5150K1249M2007J7257p918J7048L4755
8926A37011j6133k8847j6118j0640j2867p149l6844L4093J4981j4751J2071J7030
8914G1837j4218K4601P4563j0220l9689l1672o873J3059K8372k0476l0012m537
8902E4735J1404j5875k2418Q376N917J6585N173K1756L1289l7277j8063L9408
8890A01010k643q558n10j1910J5255J8779N228n3840l3160M117O0070L3523L4442
8877A61803K9066P09O598K800M4442k624J6715J4811K9946J0304j1315L110k752
8864C03613R8J1484l6182l2031q228k4776j9342k0985R710j9161l6572k2068k0416
8851H5144k7266n3669l7045j0271J936J1018j720O500K4475K2213j4670M3412
$$ y = [-29906, -23386, -11496, 16746, -24134, -22537, 12613, 33862, 75869, 93126, 85208, 102256, 137011, 120878, 92031, 75913, 65273, 52406, 45257, 8413, 42506, 57487, 42736, 54807, 71837, 57619, 82220, 156783, 146563, 106874, 75202, 68329, 81388, 109760, 89284, 59272, 54735, 66139, 50264, 27846, 36222, 42139, 58724, 63897, 85653, 116942, 79665, 61602, 101010, 98367, 89809, 89299, 77389, 92644, 111423, 116651, 62811, 29651, 33768, 93838, 127361, 161803, 190869, 191578, 198176, 200976, 245418, 242794, 259509, 274320, 304266, 314570, 303255, 306365, 303613, 303711, 315195, 279013, 246982, 238754, 213978, 194636, 173651, 183361, 164200, 127628, 105560, 85144, 57878, 4209, -32836, -43107, -41171, -30153, -31873, -25373, -898, 21315, 6645, 50057]
8839E0057J0302l0964j3602P511M8284k243J1421M586J2423K7768J9854M3889
8827A89286j1009M867L726Q400K1113J3543j2861k4366n761J4502k1342l837M2036
8814B18297K9566R238k2695O327k6382j05637p9216o3317n5398o3249n9254j5513
8802b27233o529K6865P1763N7387M151K3612K4651L6234K2085J804J4950M3108
8790I2848N2918K6903r924j8146l86K0614J1850L3452J8577J1024L3671M7482
8778C20883K8671J5106q772n7071o0289k0416K1765O0529K190m7822J5L2476m1117
8765B46148o6056p3679m9519J5320j609p4126m4805N008M8333K7750k4598N838
8753A4005Q362M0275L2148K6547J6235M0450M4815J2610J9414N6619O4544N0412
$$ y = [50057, 60359, 29395, 15793, 23304, 71588, 69345, 80766, 85352, 97775, 125543, 145397, 189286, 178277, 183144, 186870, 195270, 216383, 229926, 217065, 192699, 186938, 201440, 180098, 176261, 218297, 247863, 257101, 234406, 240733, 214351, 108714, 29498, -33819, -89217, -152466, -211720, -227233, -233762, -206897, -135134, -77747, -73596, -49984, -25333, 10901, 32986, 34790, 49740, 92848, 145766, 172669, 162745, 144599, 144213, 164827, 176677, 210129, 228706, 239730, 273401, 320883, 349554, 364660, 355888, 298817, 238528, 218112, 239877, 300406, 302596, 254774, 254789, 287265, 246148, 180092, 106413, 56894, 72214, 70605, -3521, -48326, -43318, 5015, 32765, 8167, 14005, 22367, 62642, 94790, 121337, 137572, 178022, 222837, 235447, 254861, 311480, 376024, 426436]
8741D26436k0421j7107j1210K8627O8265O6523O1057L4929M9019M4705K726l9519
8729F94030j24291o5507l1685N4566K5897l4324k2175m9586l6150M1892K2827
8718D75494k1670m3321j3288N355j7007j7534m317J4443r687m6788J4839L7991
8706C74510L8171J1519N0451P5292R7228L4648K8159N7662P6175R3111N8589L5670
8694A031185P1351N7547P7652J03064R1012J52330K03574J75803J87390J44798
8684B295706J75596J96625K72447L03378L76725M74198M84682N09507M97001N69319
8674F155184O47152Q12716J059549J543635K442276L892671O194129J0060845
8666C2808157J5235348J7022763J0893076M849374K051035k801549j3092690j7928740
$$ y = [426436, 406015, 388908, 377698, 406325, 474590, 541113, 602170, 637099, 686118, 730823, 733549, 694030, 569739, 504232, 472547, 527113, 553010, 518686, 496511, 446925, 410775, 452667, 475494, 453824, 410503, 397215, 402570, 385563, 368029, 363712, 378155, 368468, 321680, 336519, 374510, 412681, 424200, 474651, 549943, 647171, 681819, 709978, 767640, 843815, 936926, 995515, 1031185, 1102536, 1160083, 1237735, 1340799, 1431811, 1584141, 1787715, 1963518, 2150908, 2295706, 2471302, 2667927, 2940374, 3243752, 3620477, 4094675, 4579357, 5088864, 5585865, 6155184, 6802336, 7615052, 8674601, 10218236, 12660512, 16553183, 22747312, 32808157, 48043505, 65066268, 75959344, 80808718, 82859753, 80058204, 66965514, 49036774]
8658D9036774j3369032q161200n047740l369895k408181j804993j374929j025504
8650A2475300p29834o53427o05148m79440l76062m08336m42053l52838j73945
8641H254217M950N648M6931J56611L24314M02947N11349O73026P75500Q13317
8631A1968810Q25008R19998J083336J394282J898430K802551M338309O858242
8623C2088966J1130414J8561785L0023530L6309289K3189138R954710N233332
8616A66491164k471990k5263025l8462816k8516620j7196830j0509516o989576
8609C7080791m959224l661029k850480k166733j674361j470931j421778j264877
8601A7611378j118300j137757j222830j014562p86704o02150n20491m31772k79706
$$ y = [49036774, 35667742, 27506542, 22458802, 19088907, 16680726, 14875733, 13500804, 12475300, 11745466, 11092039, 10486891, 10007451, 9631389, 9223053, 8781000, 8428162, 8254217, 8259167, 8264815, 8311746, 8468357, 8792671, 9195618, 9706967, 10379993, 11155493, 11968810, 12793818, 13713816, 14797152, 16191434, 18089864, 20892415, 25230724, 32088966, 43219380, 61781165, 91804695, 128113984, 151303122, 161257832, 166491164, 164019174, 138756149, 100293333, 71776713, 54579883, 44070367, 37080791, 32121567, 28460538, 25610058, 23443325, 21768964, 20298033, 18876255, 17611378, 16493078, 15355321, 14132491, 13117929, 12331225, 11729075, 11208584, 10776812, 10497106]
8592A0497106k03168j29076k2071K0408J05056K04993K24418K89487M07517N74734
8582A1969404Q29772J304573K004010L125357N048225Q287030J3024253J6379870
8574F1972494J2403490N604143K375033j061130r693420j7436433j4863949r346188
8566B9954040n760148l792922k668794j964226j556720j264917j049436q49820
8558A1047057q25140p50136o50741o52480p24778o78812n22921m32490l37355
8549E472204l44495l00647k60165k86589k82663k30886j65200r3349j33825q9224
8539C285161q1899j05948j26246j68056j12744q1949j07357r1413k3416n2490
8529B333643l24n3570p4371o8218n3312r1409j14431m6305n4574n7516n4409o4948
$$ y = [10497106, 10293938, 10164862, 10142791, 10163199, 10268255, 10473248, 10697666, 10987153, 11394670, 11969404, 12799176, 14103749, 16107759, 19233116, 24281341, 32568371, 45592624, 61972494, 74375984, 79980127, 82355160, 81294030, 71600610, 54164177, 39300228, 29954040, 24193892, 20400970, 17732176, 15767950, 14211230, 12946313, 11896877, 11047057, 10221917, 9471781, 8821040, 8168560, 7443782, 6764970, 6242049, 5809559, 5472204, 5127709, 4827062, 4566897, 4280308, 3997645, 3766759, 3601559, 3508210, 3374385, 3285161, 3203262, 3097314, 2971068, 2803012, 2690268, 2608319, 2500962, 2409549, 2386133, 2333643, 2333319, 2279749, 2205378, 2137160, 2083848, 1992439, 1878008, 1831703, 1777129, 1719613, 1665204, 1600256]
8517A600256p1980p9444m4295n4092k9846r4550o3306p020q8241p2597j5979n0611
8505I28295l3923j0307n1272j0927j0755k8931k0309l6143j1348J1451N7690L6311
8493H19832k5948q3742j6179k4193m3254k9289o920N6913J6785K2493O056p014
8481F85540j9927L541j850L1450N9475L2976k7069k2757n6992q6781p7444m8648
8469D71514r530R53K0693J5167J5958n1776p3169J2907R498l6510o2447K6619
8457C39877L6881J2106M431K1053J7935l7868N425L8639k2303p57m4795j8796
8445C51828K8561J191J7181J7979J0273L3618N2632O9168N4165q021j915J9286
8433F45946L6597N6989j2600m5184m9289r5247j29313r4925k2934j5582r279j611
$$ y = [1600256, 1528276, 1448832, 1404537, 1350445, 1320599, 1226049, 1162743, 1155723, 1067482, 994885, 978906, 928295, 894372, 884065, 832793, 821866, 811111, 782180, 761871, 725728, 714380, 725831, 783521, 819832, 793884, 710142, 693963, 669770, 626516, 597227, 590307, 647220, 664005, 686498, 692554, 685540, 665613, 669154, 667304, 698754, 758229, 791205, 764136, 741379, 684387, 597606, 520162, 471514, 461984, 462937, 483630, 498797, 514755, 462979, 389810, 402717, 412215, 375705, 313258, 339877, 376758, 388864, 393295, 414348, 432283, 394415, 399840, 438479, 416176, 415419, 370624, 351828, 380389, 381580, 398761, 416740, 427013, 460631, 513263, 582431, 636596, 628575, 626660, 645946, 682543, 739532, 726932, 681748, 632459, 537212, 407899, 312974, 290040, 274458, 265179, 263568]
8421B63568K1962J7623o4632l8331K1612l8515J9668J4516J1410r608m6067k5670
8409A47536j9841m912N4823M1031P290J0758o025P281N950K6689P479K2909M649
8396C05617j2374N166K0696j1128j090K7932Q1715K182m6337l0849L8765p103
8384C73192l4286n7292j02758o7173p3083m6155L928l793M2643N0562j5100L3838
8372A04523J5097k3159L8009M3133K2423m5155p6661m5594K6405P7674J7579m8133
8360A06141j949P894j5840j5737K5934j7649k2359k032K4192j1021k0492K5459
8348H2541K6071J8386J1719J5738l8815m8586K9975J9464J8884l026j8134J4667
8336A28884O041m952j980m324k3900j9694p58k613o304l5396j7117O7594O1148
$$ y = [263568, 285530, 303153, 238521, 200190, 221802, 183287, 202955, 217471, 228881, 219273, 173206, 147536, 127695, 122783, 177606, 218637, 225927, 236685, 230660, 237941, 243891, 270580, 278059, 300968, 305617, 293243, 298409, 319105, 307977, 306887, 334819, 416534, 418716, 372379, 341530, 380295, 373192, 338906, 281614, 178856, 111683, 38600, -7555, -3627, -7420, 35223, 85785, 70685, 104523, 119620, 96461, 134470, 177603, 200026, 154871, 78210, 32616, 59021, 136695, 154274, 106141, 104192, 112086, 96246, 80509, 106443, 88794, 66435, 64403, 88595, 77574, 57082, 82541, 108612, 126998, 138717, 154455, 115640, 67054, 97029, 116493, 135377, 132351, 114217, 128884, 134925, 129973, 127993, 123669, 99769, 80075, 79317, 76704, 70400, 35004, 17887, 85481, 146629]
8323A46629J3438l8164m8021K8798R636O664K4874M8936k1161l1149K857J5268
8311A58605K6343J4102j7555k949p333j4858j8277k2226k7934k6551J1353L1557
8299A04277J2946k4522l0206M357J6426l571N987q646l188J522L9177K3983p965
8286A30577K5968j7846o5378l709N81L236l7205k4183L0327O2937M2152O472l8114
8273A15815j1465j0764m36K2300J4767M2075J8026m4170k6761M3712L1328K9401
8261B23828K2374M4654J24201O2270N1674l833m3048o0889p2847o9253k1691n1761
8249B05679k7661J5669q332O1121k056o4602o1049j3832N3453L9458M840k0167
8237A82521j7892j5891k509R339m7422o734K6605L335J0803J6088J5808m4161
$$ y = [146629, 160067, 121903, 73882, 102680, 112316, 118980, 143854, 192790, 171629, 140480, 143337, 158605, 184948, 199050, 181495, 178546, 171213, 156355, 138078, 115852, 87918, 61367, 72720, 104277, 117223, 92701, 62495, 66852, 83278, 79707, 85694, 77048, 73860, 75382, 114559, 138542, 130577, 156545, 138699, 73321, 69612, 70193, 73429, 36224, 12041, 42368, 105305, 147457, 153929, 115815, 104350, 93586, 93150, 115450, 130217, 172292, 190318, 146148, 119387, 163099, 194427, 223828, 246202, 290856, 415057, 477327, 529001, 525168, 482120, 421231, 348384, 279131, 257440, 205679, 178018, 193687, 185355, 246476, 244420, 179818, 118769, 104937, 158390, 197848, 202688, 182521, 164629, 148738, 146229, 155568, 108146, 101412, 128017, 131352, 142155, 158243, 174051, 129890]
8225A29890m344K1309K8350q496k5640J2292O4491N7387J10201J83478J80623
8214G49541J25632R3611N3611q6875q1592j42747j66165j31741j45296l4151M286
8203B38114K3087j9370n3307o091l860j3099k1371K0562k8162J9358O2179J2214
8191B30254r797o211l0732m1632K4554k313k1409Q51m6824k8855j2513K1180M7560
8178A24113L247l2402J350P829N1846M9064O0501Q6068L8566M9245L0383K2299
8166D92109K2744l5848n9803p1230l6751p6208n1706K5997k074k3740k545K255
8154A83200r981l9924p2860l026K7577N0223K4142K9699j2553m7522k0146j2783
8142I6046k2999o340L4042J0885r161M2778k779r789k8857j9702o173k2789J842
$$ y = [129890, 125546, 146855, 175205, 166709, 141069, 153361, 217852, 275239, 385440, 568918, 749541, 875173, 968784, 1022395, 935520, 853928, 711181, 545016, 413275, 267979, 233828, 238114, 261201, 241831, 188524, 182433, 178573, 165474, 144103, 164665, 136503, 155861, 218040, 230254, 220457, 214246, 183514, 141882, 166436, 164123, 142714, 143565, 96741, 67886, 55373, 76553, 124113, 127360, 94958, 96308, 104137, 155983, 205047, 265548, 351616, 390182, 439427, 469810, 492109, 514853, 479005, 419202, 347972, 311221, 235013, 183307, 209304, 207230, 183490, 180945, 183200, 173219, 133295, 60435, 57409, 84986, 135209, 159351, 189050, 176497, 128975, 108829, 96046, 73047, 66707, 100749, 111634, 102473, 145251, 142472, 132683, 103826, 84124, 77951, 55162, 57004]
8129E7004J0079J0099L1625K2375l7085k5157M149l5137L5384J3292K6719K3261
8117A36608K6581k2048j1047j9231J6548p22j6232k0675J1j3780K038K3490J4660
8104A16201j196k9855J4722L8841j5013j9704Q583P864l8200q432L4188J5534
8092A23533m3331m0406m9771p959K7465M8763O233K6086M9654m661l9411O59m5592
8079E1262k8048L1082j1459l8349k1508p539k2330J2436m791p853M2769k6459
8067c0787R898L6391J6191M44K3665J7269j0355m4964j7932L3543r40K097J7756
8054E2276O768M120o105r314n85j385l1693J9301k1139L372m993L3684L5744M138
8040H4189M292l2204l7313k7317J6172P1795l3332l0596L3706M2088k0281P201
$$ y = [57004, 67083, 77182, 108807, 131182, 94097, 68940, 73089, 37952, 73336, 86628, 113347, 136608, 163189, 141141, 130094, 110863, 127411, 126689, 110457, 89782, 89793, 76013, 78051, 101541, 116201, 115005, 85150, 99872, 138713, 123700, 103996, 112579, 120443, 82243, 73811, 107999, 123533, 80202, 39796, -9975, -17934, 9531, 58294, 64527, 90613, 140267, 135606, 96195, 96854, 51262, 23214, 54296, 42837, 4488, -17020, -24559, -46889, -34453, -39244, -47097, -4328, -30787, -20889, 15502, 31693, 32137, 55802, 73071, 62716, 17752, -180, 33363, 32423, 34520, 52276, 59044, 63164, 57059, 47745, 47160, 45775, 14082, 33383, 12244, 15616, 10623, 44307, 80051, 84189, 88481, 56277, 18964, -8353, 7819, 79614, 46282, 15686, 49392, 91480, 71199, 78400]
8028G8400K514n1236j6967P930l722l234J3490j4425k9250M9783M1663j9230J9677
8015G5393R755L3730m660l4347l6990J6063M650J9716P723j8796k7702J8554l3655
8002B9434L3571L1128K1874J6089j7571k528k1106l8933J0967L8394J8482K5200
7990A45001k7602n5297j892J7557j0642l2273J67r298K2654L4684k872k8756q775
7977D2656m5666L8895K1898N419M2678l1356n2177J8723J8925l4307M0846K6898
7965I3432l7209k4612M528k4055k6978L7866K3375n50K3368K4730L5987m0566
7953H9316N080K4768k8685j9348j4970k343j3459k832J1693n419J4426l2309J8859
7940D4777J5618O464K2771Q413J4245k3399P745k2533N74J2257j0379k1122j0746
$$ y = [78400, 80914, 29678, 12711, 20641, 16919, 13685, 27175, 12750, -16500, 33283, 74946, 55716, 75393, 85148, 118878, 114218, 79871, 42881, 58944, 63594, 83310, 91033, 72237, 44535, 63089, 29434, 63005, 94133, 116007, 132096, 114525, 111997, 90891, 51958, 62925, 101319, 119801, 145001, 117399, 62102, 60210, 77767, 67125, 34852, 35019, 25721, 48375, 83059, 80187, 51431, 42656, -3010, 35885, 57783, 63202, 105880, 74524, 22347, 41070, 59995, 25688, 66534, 93432, 56223, 31611, 36139, 12084, -14894, 22972, 46347, 45797, 69165, 93895, 129882, 89316, 94396, 119164, 90479, 71131, 56161, 53818, 40359, 37527, 49220, 43801, 58227, 25918, 44777, 60395, 66859, 89630, 98043, 112288, 88889, 96634, 74101, 74675, 86932, 76553, 55431, 44685]
7927D4685K5057L268J01l6421j8480J2884j6210k2368J3586P9396J3276K504n5607
7914D5671n4798J2490q367J7132J9532K7546p214q55l1622K4164P183k4896j1884
7901A4082M5932J1328k5096j7949L0246m291m3251k9495O537N8237M9118M3952
7889A39350r782n0479n0380P583l629J5123j2222k9353J2877k8006k854Q359M5067
7876D1654P27l0024o3990k1028M8914L8775M79J0867j1198K9592j2506j7862K2997
7863C7397l8405p972L1073M8245J3735m75p435q6149j0995N9637P0581K339m7780
7850F3796n6921L5760m485J7762l4346j9997Q61J7271L6644M5833m4149m3143
7838A4886j6922K1109k0382m1790k2175P523O9145R751n0357j0713O460k6086
$$ y = [44685, 69742, 73010, 73111, 36690, 18210, 31094, 14884, -7484, 6102, 85498, 98774, 101278, 45671, -9127, 3363, -5004, 12128, 31660, 59206, 51992, 51137, 19515, 43679, 50862, 25966, 14082, 60014, 71342, 46246, 28297, 58543, 54252, 11001, -18494, -11957, 46280, 95398, 139350, 129568, 79089, 28709, 36292, 32663, 47786, 35564, 6211, 19088, -8918, -11772, -3413, 41654, 42381, 12357, -51633, -72661, -23747, 15028, 15507, 26374, 15176, 44768, 32262, 14400, 37397, -1008, -8980, 22093, 70338, 84073, 83598, 76163, -9986, -20981, 38656, 109237, 111576, 63796, 6875, 42635, 38150, 55912, 21566, 1569, 2430, 19701, 56345, 102178, 58029, 14886, -2036, 19073, -1309, -43099, -65274, -57751, 11394, 21145, -29212, -39925, -33465, -59551]
7826e9551p093O3092L4097N187p46j2014M5175J6464l1793j4895l0873j3731o714
7813a3395k426r562j1888j0288J5917J2804M8264j1490k7704k3643R430M5019
7801B1038M2300J3596k8411o615J472j8742l865J5610n689p569j1678m261k8018
7788b0832n628K7633K7518O354J8704j7401k6974l4595k1882Q635l2227j7924
7776h8619L2953n804L2201N2358J6312n759m2975m4174J3558J1427J2698l0107
7764d5931j39q53K658N6972K9056j7689k2535l5849k678J8355M4291K1084k0097
7751B6645L1220q76L6466k0213P360r825l2685L7994m1452J196m927j5584j2769
7738B550l4243k068J9109J1164m911j1582l686n31j0564P78J3136k2477j2463
$$ y = [-59551, -66644, -3552, 30545, 35732, 34986, 22972, 68147, 84611, 52818, 37923, 7050, -6681, -13395, -15821, -25383, -37271, -47559, -31642, -18838, 29426, 17936, -9768, -33411, -23981, 21038, 63338, 76934, 48523, 41908, 43380, 24638, 20773, 36383, 30694, 23125, 11447, 7186, -20832, -26460, 1173, 28691, 35045, 53749, 36348, 9374, -25221, -47103, -38468, -70695, -88619, -55666, -61470, -29269, 23089, 39401, 33642, -9333, -53507, -39949, -28522, -15824, -45931, -46070, -46923, -44265, 12707, 41763, 24074, 1539, -34310, -36988, -18633, 25658, 46742, 26645, 57865, 56989, 93455, 73242, 80602, 70777, 38092, 76086, 34634, 35830, 30903, 15319, 2550, -31693, -33761, -14652, -3488, -8399, -19981, -23667, -24198, -34762, -33984, -20848, -43325, -55788]
7725e5788J4729M312j6468K6355Q793O253N866Q977N195L0098J1721O125l1178
7712B4990k839M483J0969K0783L3116j1272l27K2012m1441m9057L1106o797R103
7699D4829j6928J0971P881m2146k2917K0126k0499k1624J9360j5866N3208L7893
7687E4288N074l1017k2281J1460K9366k919r759j8194j7916k2357j3880K1858
7675a6277J229K0257J6067k883j9856K6971j2263L6842K1399n888J9909l4173
7663E1334j5117o0109m2842K7285L9788J3493j0441j9929J9879k4295m1358p251
7651f9563r15L4135j3402K6706J7423J9372M6127j6765p691m318j9553K7471L2516
7638G1543m0079o4382O698J3300j2608J9544j509L4182j9224m0744k8828k0944
$$ y = [-55788, -41059, -36747, -53215, -26860, -18067, -11814, -5948, 3029, 8224, 38322, 50043, 56168, 24990, 22151, 26634, 37603, 58386, 91502, 80230, 79903, 101915, 60474, 11417, 42523, 35726, 44829, 27901, 38872, 46753, 4607, -18310, 1816, -18683, -40307, -20947, -36813, 16395, 54288, 59362, 28345, 6064, 17524, 46890, 43971, 34212, 16018, -1898, -24255, -38135, -16277, -15048, 5209, 21276, 18393, -1463, 25508, 13245, 50087, 71486, 65598, 85507, 51334, 36217, -23892, -66734, -39449, 339, 13832, 3391, -16538, 3341, -20954, -62312, -69563, -70478, -36343, -49745, -23039, -5616, 13756, 59883, 43118, 35427, 31109, 11556, 39027, 71543, 31464, -32918, -26220, -12920, -25528, -5984, -7493, 26689, 7465, -33279, -62107, -83051]
7626h3051k1022O8147M9624l6357k3041L9198l579k5457j5336J4052N9170k3200
7614h52j4288J639Q6J1543Q572M3L0553L6918o627m9322k3579K3246K3324J8059
7600E9315m550k3o90m2370K4615L4045K5193n4422m1862L81M739K7755R172j9014
7586B2284k3181J2974j7681k2638r200R61M9174J1431j2589m137n905J4420J1136
7573B7049o452o3857J4200O0642j4191p447k1109m686k1961M8169M8482j3671
7561D5168k3453J368m0608K3186L3495O395k4562q408K9152K452k848J8652j2879
7548D7110j4169q352k013k6156p414L7319K754R685J4100j6990j3414l8169n6284
7535g1993R491N6642k973J0954o012k960l5184k3998K6433L5569L1133L5930k7427
$$ y = [-83051, -104073, -35926, 13698, -22659, -45700, -6502, -10081, -35538, -50874, -36822, 22348, -852, -15140, -13501, -13415, -1872, 6700, 6743, 37296, 74214, 67587, 18265, -5314, 17932, 41256, 59315, 54765, 54742, 54052, 11682, 36297, 70342, 95535, 41113, -749, -368, 4371, 32126, 41298, 22284, -897, 12077, -5604, -28242, -37442, -36481, 12693, 24124, 11535, 7398, 1493, 15913, 27049, 20597, -43260, -29060, 31582, 17391, 9944, -11165, -15851, -37812, 10357, 58839, 45168, 21715, 23083, -17525, 5661, 39156, 45551, 20989, 12581, 41733, 44185, 41337, 59989, 47110, 32941, 24589, 22576, -3580, -10994, 26325, 29079, 38764, 52864, 35874, 22460, -15709, -71993, -62502, -5860, -8833, 2121, -3891, -6851, -42035, -66033, -39600, -4031, 27102, 63032, 35605]
7522C5605l1564j9849J0996K7325n091l9938Q4L2923J2894M5798r840P935m0151
7509B7127o233j641R60j9262K4738L381k3256K4299j3619m0719P488L3856M0483
7496E7602L3826l0690k2721O733m16J0563N0564j8988j8167L337j3210o2388K0545
7483A6590p10J6247l8080L7330K1225j8007K2041L525o657k2352l1678k0763n228
7470b6517O4754O956m5934J7120J0705l129N532m329k6134j726J4336n736n1612
7457d5714L8260M7290K6920j5848j2240q150P304q45J0097m267m8461Q704q757
7444e707J403J2872P791L6879q758k3543r240r242J9565m459L1631J0744p657
7431E2279k977k4472J1183k0534k5401K5962Q302j5943j5600L935k3822k0558
$$ y = [35605, 4041, -15808, -4812, 22513, 17422, -22516, -22432, 10491, 23385, 69183, 59343, 67278, 27127, 20894, 19253, 20213, 951, 25689, 29070, 5814, 30113, 16494, -24225, -16737, 17119, 57602, 91428, 60738, 38017, 44750, 44334, 54897, 105461, 86473, 68306, 71643, 58433, -3955, 16590, 15880, 32127, -5953, 31377, 52602, 34595, 56636, 60161, 53504, 31152, -526, -21289, -26517, 38237, 45193, -741, 16379, 27084, 23955, 29487, 25158, -976, -2702, 11634, 5898, -45714, -7454, 39836, 66756, 50908, 38668, 30518, 37822, 36977, 47074, 42807, -5654, 3050, -5707, -4304, 8568, 16359, 53238, 44480, 20937, 11697, 2455, 22020, 17561, 49192, 59936, 52279, 49302, 24830, 36013, 15479, -9922, 16040, 24342, 8399, -7201, -3266, -27088, -47646]
7419d7646J1204N750k1014K235M1639N8126J0645n0489o1194N9693L3562K4939
7407F7450J2512j4028j1053p321k8192k7343k1048k7669k4379n167M7671K4526
7395a4041j21j7138l0267J6014j917L2048K0280j431J3045k1129K431Q528K2251
7382B8553j092m8109K0547L0736L478J080m2722j8937j9027l294J7468K686o2
7369b8695N1720M1665p168j8931k349j9500k7958K391j0785o314m508L9963M6817
7356E6348n360l3022J5887J9347l7162j401k2418m4896j1062j3471J5445M0674
7344b1091M6958Q425K9987J1589j3993l0072M950L6265k467m9984m1158K8090
7332G499Q0827j7560p463j5515K546K4005k795k2670j4298m3033J4667r894O938
$$ y = [-47646, -36442, -30692, -51706, -49471, -7832, 50294, 60939, 10450, -50744, 8949, 42511, 67450, 79962, 65934, 54881, 47560, 19368, -7975, -29023, -56692, -81071, -86238, -38567, -14041, -14162, -31300, -61567, -45553, -47470, -15422, 4858, 3427, 16472, -4657, -2226, 6302, 28553, 27461, -20648, -101, 30635, 34113, 35193, -7529, -26466, -45493, -48787, -31319, -28633, -28695, 23025, 64690, 57522, 38591, 36242, 16742, -11216, -8825, -19610, -25924, -30432, 9531, 56348, 50988, 17966, 33853, 53200, 16038, 14637, -7781, -52677, -63739, -77210, -61765, -21091, 25867, 34292, 64279, 75868, 61875, 31803, 36753, 73018, 70551, 20567, -20591, 7499, 88326, 70766, 63303, 47788, 50334, 74339, 71544, 48874, 34576, -8457, 6210, -3684, 3254]
7319C254j6978k0227n959J8078J5817j4242k960J7089L4986J4561k8581m5758
7307c0920l7303R510Q172J898K2728j4712j8097k3758m68L0272N2149l540j8097
7294b2166K710j633L3768N499k1279p0854m1122K0464L1935J8101K3130K1346
7282a01J7990M1814l4759n5047Q84M4674J734m3237n477k173L6765q6k5908r864
7268c2791L663J3068l685J0540M7265P187n8651o6645r904K6942N7940L0664l4459
7255h866J778n79K4416k7407j0831p486k7411l8347L4793K3077J5998M984N585
7242a0296J0379J959J327k3921k0265J7146p113L4264l58l5253k694k5368M4512
7229a5681k430j1758n53K0004P1330J2911l9094m6737O944j1452M1247l1345k9662
$$ y = [3254, -13724, -33951, -39910, -21832, -6015, -20257, -23217, -6128, 28858, 43419, 14838, -30920, -68223, -58713, -50541, -48643, -25915, -40627, -58724, -82482, -82950, -52678, -529, -4069, -22166, -19456, -21089, 12679, 18178, -3101, -73955, -115077, -94613, -62678, -44577, -21447, -101, 17889, 59703, 24944, -30103, -29219, 15455, 17189, -26048, -31525, -33698, 3067, 2981, -22927, -32791, -29128, -16060, -19745, -9205, 38060, 45247, -13404, -80049, -89953, -63011, -5071, 25593, -8866, -7088, -7667, 16749, -10658, -21489, -28975, -56386, -94733, -59940, -36863, -20865, -15881, -10296, 83, 2042, 3369, -20552, -40817, -23671, -30784, 3480, 3122, -32131, -34825, -60193, -15681, -18111, -29869, -30422, -10418, 60912, 73823, 34729, -12008, -5064, -16516, 24731, -6614, -36276]
7216c6276O034J0869J4354q44J3567l3833r273k2782L6586j3097q306M495k1086
7203e9592L1667l894J5030j1767R491l0852J2076J2888o293k5806P748J1716L6650
7190i38J8819L7493L415k404n3844j0177j6123K664m337j3126O5507N335j5293
7177A6991k6540J0376J2165m864n4186k2941j3240J7965M1984J4045l142j3276
7165b4663j497k4528J0175k0743M5201Q4222L0607K055l4687p3172n4877k5919
7153h7826M1167J8461L343L222J2643O9158K3472j2451m3976m8450m9226M2502
7141b7961K7610K8593j0213j4713L0230N462j1867q110k2558k1970J4337L1499
7129B0339L3589L142l6624j1075o18K4412j5284n1984J0114K7080N6006j0628
$$ y = [-36276, -30242, -19373, -5019, -5863, 7704, -26129, -35402, -58184, -21598, -34695, -43001, -38506, -59592, -27925, -31819, -16789, -28556, -19065, -49917, -37841, -24953, -31246, -57052, -49304, -37588, -938, 17881, 55374, 58789, 56385, 2541, -7636, -23759, -21095, -25432, -38558, 26949, 32284, 16991, -9549, 827, 12992, 8128, -46058, -68999, -82239, -64274, -22290, -8245, -11387, -24663, -26160, -50688, -40513, -61256, -16055, 68167, 98774, 100829, 66142, -7030, -61907, -87826, -46659, -28198, -24855, -21633, -8990, 60168, 83640, 71189, 27213, -21237, -70463, -27961, -351, 28242, 18029, 3316, 33546, 39008, 27141, 19031, -3527, -25497, -11160, 20339, 53928, 57070, 20446, 9371, 8753, 33165, 17881, -34103, -23989, 3091, 59097, 48469]
7117D8469m0040j4650L280p571J6814O2186J0007j3612l2570l0791M792M399k5480
7104a4767k1055L1024L6380k464L0683j1911o5917j4165N2659L3572L4830q909
7092G9960n4533l1072M817M1902J4111n3606j8904K1316K4469m9424l9005K8834
7080c1135L9830j5198o616J3543n786j9077p184j7403q0o414K292M3265R142l0254
7066c1075k259J297K9496J1742K0747k4002k917K6777J377j6434k607J0980q913
7053A4209k5377m825n715L4721K9740l8933l0952K9662K3543N635J628K9962j665
7040F1633k3338j5397l207m398j0192l4204k2792K8662L6204K8150j1395n466
7028B4260J4235j8822o4171l0414K9605J8873j8625K8882L4948l9353l7643K7291
$$ y = [48469, 8429, -6221, -2941, -10512, 6302, 68488, 78495, 64883, 32313, 1522, 6314, 10713, -14767, -35822, -4798, 31582, 29118, 59801, 47890, -18027, -32192, 20467, 54039, 88869, 79960, 25427, -5645, -828, 41074, 55185, 1579, -17325, 3991, 28460, -20964, -59969, -31135, 8695, -6503, -13119, 424, -5362, -24439, -31623, -49026, -49106, -55520, -53228, -9963, -821, -31075, -33334, -32037, -2541, 9201, 29948, 5946, 3029, 29806, 31183, 14749, 12142, 23122, 14209, -11168, -15993, -21708, 13013, 42753, 3820, -27132, 2530, 26073, 31708, 33336, 63298, 61633, 38295, 22898, 19691, 15293, 5101, -29103, -51895, -23233, 12971, 41121, 29726, 24260, 38495, 19673, -44498, -74912, -45307, -26434, -45059, -16177, 18771, -20582, -58225, -30934]
7016c0934L8894j1422L341J8340l5381L4945Q7761r710n5511m0176p6671r893
7004h6417p081K3768R969K4290R258j4655R468P2108M7709J7600l9882j1868k4031
6991C0236q050M092j9461k1418m704j1773J1310K9667K481k4849J5588N0423m6906
6978F636r419K9556m62k4583R26M2132L9563L646o246l7268K1928k2027k4641
6965A9741J7089q007k9918j2658L5983j4976m1519K5784K0324k276L8332l5973
6953A1926k7219k4766l7707J8433J2066k4483R53K7059L7316P219R534m613J069
6940F787l9927l570J3042K1262K7193k6702k5339N275L4907J9872o078K1339k0758
6927B7303Q759j2818l3064j9070J0238n236l4330J1183O7223L7256j7565k1411
$$ y = [-30934, 7960, -3462, -121, 18219, -17162, 17783, 105544, 95834, 40323, 147, -76524, -86417, -93498, -69730, -59761, -35471, -26213, -40868, -31400, 40708, 88417, 106017, 66135, 54267, 30236, 22186, 26278, 6817, -14601, -19305, -31078, -19768, 9899, 12380, -12469, 3119, 53542, 6636, -2783, 26773, 26311, 1728, 2654, 44786, 84349, 87995, 81749, 44481, 66409, 44382, 19741, 36830, 28823, -1095, -13753, 22230, 7254, -34265, -8481, 11843, 9567, 47899, 11926, -15293, -40059, -77766, -59333, -47267, -71750, -70797, -43738, -6422, 797, 10331, 5718, 6787, -33140, -36710, -23668, -2406, 24787, -1915, -27254, -21979, 12928, 32800, 26722, 48061, 27303, 36062, 23244, -9820, -28890, -18652, -23888, -58218, -47035, 20188, 57444, 39879, 18468]
6915A8468l6588L6448J7710m4306k1045l1260q255j294k2924M569N1567K2664
6903a4246K4942l3367k5947K8622J5365Q396l762l0513Q624L1172r693j3671K3468
6890I390J1354j4375k1450j1169N2140J9219j2262k8726l0389N302L5464j1621
6878B877j1459j519J2803k2144K4169j03m187k1565J7831J4625L2958k4003m9040
6865b8757l3154j8128R420J3862K1762R692j171q91j3248Q245M2780L7207k5394
6852B2225j1801J5476Q979K3074j9234k6301j1009J9709l0553J089l0219r489
6840d8054Q311M734j3158l5700O2173J4223l6108j3461L1301Q145M873J4077L5627
6827C6983l2300K1706j6790k6210M3145k9742l5502M23M5268m267L793J875j54
$$ y = [18468, -18120, 18328, 36038, -8268, -29313, -60573, -68828, -70122, -93046, -88477, -36910, -14246, 10696, -22671, -48618, -19996, -4631, 3765, 3, -30510, -21886, 9286, -407, -14078, 9390, 20744, 6369, -15081, -26250, 25890, 45109, 32847, 4121, -26268, -20966, 14498, 2877, -8582, -10101, 2702, -19442, 4727, 4624, 437, -21128, -3297, 11328, 44286, 20283, -28757, -61911, -80039, -70619, -56757, -34995, -25303, -26474, -27365, -40613, -32368, 10412, 47619, 22225, 10424, 25900, 34879, 57953, 38719, 12418, 1409, 21118, -9435, -8346, -38565, -48054, -39743, -35009, -48167, -83867, -21694, -7471, -43579, -57040, -25739, -17594, -12721, 1356, 36983, 4683, 26389, 9599, -16611, 26534, -3208, -38710, -38287, 6981, 2714, 6507, 8382, 8228]
6814H228p136N6683l6326k2865m5793l5992J310J3751J5984k588j5488q773Q940
6801g0065L5602K1641j234j2528l245L2026R680r499r666l1936M442O236n185
6788c3731J1511K3038J4887r082j4558l0771Q552J6782m581l4956j7749J3398
6776e7260L9728K6180J4168j613j6720j3402j1035K8827L5121j0477k6623m0166
6764c3272k855k015j3722j517M9483J0993j4103k0910j5257K5467J5179M6632
6752D4103P3858M054n252K0721K0683m5849m9321l6667l5650k8286K5112L1709
6740A9215j4331k6151N369K5179K5600K294L3736L5026m361M2210P4760P2358
6728B90904J52854J51575K43116J67649P3666M9891l5894j39136k55630j82945
$$ y = [8228, 1092, 57775, 21449, -1416, -47209, -83201, -81891, -68140, -52156, -54744, -70232, -79005, -70065, -34463, -12822, -14056, -26584, -29829, 2197, 11877, 2378, -7288, -39224, -34782, -28546, -33731, -22220, 818, 15705, 6623, -7935, -38706, -30154, -13372, -17953, -52909, -70658, -57260, -17532, 8648, 22816, 21203, 4483, -8919, -19954, 8873, 43994, 33517, 6894, -33272, -36127, -38142, -51864, -53381, -3898, 7095, -7008, -27918, -43175, -17708, -2529, 44103, 117961, 122015, 116763, 137484, 158167, 112318, 62997, 26330, -9320, -37606, -12494, 19215, 4884, -21267, -15898, 9281, 34881, 37175, 70911, 105937, 101576, 143786, 218546, 290904, 443758, 595333, 838449, 1006098, 1079764, 1129655, 1093761, 954625, 698995, 516050]
6718E16050j36404j00383k3603l0550l4814n499l5764K7060k9369l7428K1639
6707A30935J8866K9668l2217l0341k0529j1580k2974K0487k708j965Q699Q028
6695I4369K1399q561j8232k1045l8896l3378J0696J4307K299Q39r782o882l253
6682C880K9932L7045l1518n442j8195m604J9297J2620J1963k8835j1801J3439
6670B7781K5421N924j8949k7934j8757J1956K4913m738J5532O818p133j9097K6073
6657D7810K9832l3462k1733m0715j309k8244K278L0237j7092j9022K6438M3694
6645A8712K1179j9017k259J6551J2134K2502o717n115q016m15m4539j9212K8100
6632A3888L1399k6661k907l6898j6605L9835K3965j1304j4261q845j9628l1580
$$ y = [516050, 379646, 279263, 255660, 225110, 190296, 184797, 149033, 176093, 146724, 109296, 130935, 149801, 179469, 147252, 116911, 96382, 84802, 61828, 82315, 79607, 77642, 86341, 94369, 115768, 107207, 88975, 67930, 29034, -4344, 6352, 20659, 22958, 23797, 14015, 7133, 3880, 33812, 70857, 39339, 33897, 15702, 11098, 30395, 43015, 54978, 26143, 14342, 27781, 53202, 59126, 40177, 12243, -6514, 5442, 30355, 25617, 41149, 47967, 40834, 21737, 47810, 77642, 44180, 22447, -18268, -19577, -47821, -45543, -15306, -32398, -51420, -24982, 18712, 39891, 20874, 18615, 35166, 47300, 69802, 63085, 57970, 49954, 49539, 5000, -14212, 13888, 45287, 18626, 15719, -21179, -37784, 2051, 26016, 14712, 451, -8394, -28022, -59602]
6620e9602k6207K2487Q119n999J6294N635j3935j8176m703J0095N2528M836R875
6607A247J9712N4o889l698k7242k7353n445J2672L4792l3862k9607J1638j3717
6594f7698k457K6617K0362O1095J6124p082K3225N013m7895O530J2184k1664j4114
6581A0240N3700L278q963k9497l2432K9906J3903r426N830j1808j8767J9457K0543
6568D5964l0873J345J2089k5487K4353J8587J8261Q595j5208m9354l7684l748
6556c3160N7082K4820p392p938j1081k2903j8764R534K6138L994m2002j3019k0376
6543e5067k4952j450M456O0875J0205j7585L1395l724k7373l3159j9792J5399
6531f0772k7262K7895R634q928K640o498r754k6847J3922l0922K2561Q2066L3041
$$ y = [-59602, -85809, -63322, -55203, -61202, -44908, -39273, -53208, -71384, -76087, -65992, -13464, -8628, 1247, 20959, 21013, 14124, 10426, -16816, -44169, -49614, -36942, -2150, -36012, -65619, -53981, -67698, -70155, -43538, -23176, 37919, 54043, 46961, 70186, 75199, 27304, 33834, 46018, 24354, 10240, 63940, 67218, 58255, 28758, -3674, 26232, 40135, 30709, 36539, 24731, 5964, 25421, 45964, 15091, 16436, 28525, 3038, 27391, 45978, 64239, 72834, 57626, 8272, -29412, -33160, 23922, 48742, 41350, 33412, 22331, -572, -19336, -9802, 16336, 20330, -21672, -34691, -55067, -80019, -81469, -77013, -16138, -5933, -23518, 7877, 4153, -23220, -56379, -76171, -60772, -88034, -60139, -50505, -59433, -56793, -63291, -73045, -99892, -85970, -116892, -94331, -12265, 20776]
6518B0776n261J8598K3760l5572j6137m1314M7709k6105j7362J180q021M0354
6506B605J4169J5260j8578k9790l31K9336l6608k1878K988L9990K7224j0959k8874
6493a5446K9154O599j8951R672K9090M5497m962o1058k1250r365L1962L4760l7894
6480A7808j8168j4018L6351J6940J5903m062k545k14l9770l8368j5259J5708J5851
6467a3843J1288K7068L4926j2740M79K0237l8588j6539k1989j908J9631K8153
6455C6175j1611k2395K8686M0892m4129n1232J3202j2180L1354j7883k6244K8040
6443g325J0938j4252J018q477j3332L6491K2270j2115j7134k773P331K3966J1301
6430C7907j5708K823J7012p839j9502l3045o109j2504J5680K305k9613K1175O216
$$ y = [20776, 15515, 34113, 57873, 22301, 6164, -35150, 12559, -13546, -30908, -29728, -37749, 2605, 16774, 32034, 13456, -16334, -16665, 12671, -23937, -45815, -42827, -2837, 24387, 13428, -15446, 13708, 20307, 1356, 11028, 40118, 85615, 80653, 19595, -1655, -11020, 20942, 55702, 17808, -360, -14378, 21973, 38913, 54816, 50754, 48209, 47995, 8225, -30143, -45402, -29694, -13843, -2555, 24513, 59439, 46699, 47178, 67415, 28827, 12288, -9701, -11609, 8022, 36175, 24564, 2169, 30855, 71747, 27618, -23614, -10412, -22592, 8762, -9121, -35365, -7325, 3613, -10639, -9621, -18098, -31430, 5061, 27331, 15216, -1918, -4691, 2640, 26606, 37907, 22199, 25022, 42034, 34195, 14693, -18352, -24461, -36965, -21285, -18980, -48593, -27418, -21202]
6417b1202j086P802L0389j6115o5925k0349J2984K8756j1634j8751j8113j1970
6405a05214K0427K0013J1464j934O3347M6052m6150m8259K4745L8913j9727j772
6393A905L8596k2734K508j9771m3352k9745K7624K6436L1409j9711O90L521j2430
6380a5054J5506K0317n1222K0237J8789o255j1222p725L5860L1664l0437n5362
6368c4904m2694l55J8008K316L4379O7916K6866J1866K3627k9788m3819k280k2938
6355H200j6248N1060N0339L3227j1600l3109m6110J2137j208m7992j6501J4956
6343b849p243J7965l157L3984J6655m6846j4897j6828m989l8316J8213L6474O7099
6330E5265M429l8855k4814j3720K3443J1706P708M4229J481l4564j1195J8945
$$ y = [-21202, -22288, -14486, 15903, -212, -66137, -86486, -73502, -44746, -56380, -75131, -93244, -105214, -84787, -64774, -53310, -55244, 8103, 54155, 8005, -40254, -15509, 23404, 3677, 1905, 40501, 17767, 20275, 504, -42848, -72593, -44969, -18533, 12876, -6835, -6145, -2624, -15054, 452, 20769, -30453, -10216, 8573, 2318, -8904, -16629, 19231, 50895, 20458, -34904, -77598, -77953, -59945, -57629, -23250, 44666, 71532, 83398, 107025, 77237, 33418, 31138, 8200, -8048, 43012, 93351, 126578, 114978, 81869, 35759, 47896, 46688, -1304, -17805, -2849, -10092, 7873, 4716, 38700, 55355, 8509, -6388, -23216, -28205, -66521, -48308, -11834, 55265, 59694, 20839, -3975, -17695, 5748, 17454, 25162, 69391, 70872, 36308, 25113, 44058]
6318D4058o568N776N6668R545l2730l5804k2l7352k1306k8380j594o352K3294
6305c0767p229J6995L5362J1757J5695P576m212J2397J2650j9654j3202K39n9105
6292b1498o2386L9647J5056J268p218p506M141Q982L1125J0458j2122q784o5717
6279g4554J3407P6693N2091N712L185q566M445j0315M110m784k2775K3540j7379
6266D4810n5925m7780o686M4716K7991N825l3558K1402k6478l7053J5211K5436
6254b2089M6078O7194m1150n2601j8844J8431j8495l5044K6312K2541P309K9005
6242B8647j0932o96K189J6401p886m2590K373K3691r839j4995k6493j0023N993
6229d4160P87k2170J8145J7020K2071r444j8690O200J0215K1613k6336m5751n1470
$$ y = [44058, 37490, 43266, 99934, 109479, 76749, 40945, 40923, 3571, -17735, -46115, -47709, -54061, -30767, -37996, -21001, 14361, 26118, 41813, 49389, 45177, 57574, 70224, 50570, 37368, 37607, -21498, -83884, -44237, -29181, -27913, -35131, -42637, -38496, -29514, 1611, 12069, -53, -8837, -74554, -61147, 15546, 67637, 73349, 76534, 67968, 72413, 62098, 66208, 61424, 38649, 62189, 44810, -11115, -58895, -65581, -20865, 7126, 12951, -20607, 795, -25683, -62736, -47525, -22089, 23989, 91183, 50033, -2568, -21412, -2981, -21476, -56520, -30208, -7667, -358, 28647, 17715, 17019, 19208, 35609, 27723, -14867, -12494, 11197, 1358, -13637, -40130, -50153, -44160, -43373, -65543, -47398, -30378, -8307, -17751, -36441, -30241, -20026, 1587, -24749, -70500, -121970]
6216a21970M8164N8787K9479r778k229o232l5135J6237l697O888M0477L246m9241
6203b5004k4552j9166J6848L2391R796L082J5405q399r764j1730p754o41O350
6190b3138L1986M264N109O592J7158o7940n8912N4646O3977n549n866n5463k0032
6177e3168K5829M0963k1999k2544K5536m221J3938r721r364j9210n82q079K0097
6164b2525M8211K6323J1857j4324k3050k4145m1229O168j0293l8789j7646K7224
6152g2218j3449j0936N2112N8086J2227m8336J6326L5653l427j4458J35j926K8230
6139C8019J2292m8071M712l97K3424k5835k3793K6178k9053k5333K4976o390m572
6126c3843O476m6686j4756O6433O5931k7842n5717j0258R865j0925J8798M3055
$$ y = [-121970, -73806, -15019, 14460, 4682, 2453, -3779, -38914, -22677, -26374, -19486, 20991, 24237, -25004, -49556, -68722, -51874, -19483, -9687, -6605, 8800, 401, -9363, -21093, -28847, -29488, -23138, 8848, 13112, 18221, 24813, 41971, -25969, -84881, -30235, 33742, 28193, 22327, -33136, -53168, -27339, 13624, -8375, -30919, -5383, -9604, 4334, -5387, -14751, -33961, -34543, -42622, -22525, 25686, 52009, 63866, 49542, 26492, 2347, -38882, -32714, -43007, -81796, -99442, -72218, -85667, -96603, -44491, 13595, 25822, -22514, -6188, 29465, 26038, 11580, 11715, 9789, 38019, 50311, 2240, 6952, 6555, 29979, 4144, -19649, 6529, -22524, -47857, -22881, -29271, -33843, -27367, -74053, -88809, -22376, 43555, 15713, -40004, -50262, -40397, -51322, -32524, 10531]
6114A0531O651J2007j710j6228L1977P689n3622m5871K0856L7510K5745k1593
6102A3942j9980k451j4724J2034m788O2734K6555j6552r089k8389l0946J8306
6090F652J5790k1035l509J1949o439k0264M6938M686l5734m5872K8104K6071L8102
6077D5439J1950l6737q181r339J3648m839l841j4958l2024O310J402K3325K1533
6064A3688P753L8901l0133n7872J5369K4570l4720Q6J2669L5228K3483j759O282
6051E3545l4081m1775q88L5329J3001J8011J1408j6310j9397j5557J17J643L4080
6038C9126M522k9233o333q980N921m0073m1486p327N5187L6113J8698J6432k9728
6025A2839m4664m1522K192L1159N432K3447j0957k2315L4163J8060L5554m6j5059
$$ y = [10531, 17182, 29189, 27479, 11251, 43228, 50917, -2705, -48576, -27720, 9790, 35535, 13942, -6038, -8489, -23213, -11179, -15967, 46767, 73322, 56770, 47681, 19292, -11654, 6652, 22442, 1407, -2102, 9847, 3408, -16856, 30082, 34768, -966, -46838, -18734, 7337, 45439, 57389, 20652, 12471, 3132, 16780, 11941, 8100, -6858, -38882, -32572, -31170, -7845, 13688, 21441, 60342, 30209, -27663, -12294, 12276, -22444, -22358, -9689, 25539, 49022, 47263, 53545, 19464, -22311, -23199, 12130, 25131, 43142, 54550, 38240, 18843, 3286, 3403, 5046, 39126, 43648, 14415, 8082, -898, 5023, -35050, -76536, -83863, -28676, 7437, 26135, 42567, 12839, -31825, -73347, -71155, -39996, -34564, -11117, -22074, -44389, -10226, 7834, 43388, 43342, 28283]
6012B8283r857k7161P831j4393J344J109J8742K8076j96j3104K6752J9153K0204
5999H6783j4668l1863p708j2330n6339J5905J7122L3280j4130p531O239l047J1845
5986B3558k6272k6165o5567l6565M1066M3977L5150J3536j2274j948n9776j1921
5974h3201N8737K2789j6484m1828j6274K5191j2181m287k310J5481N2817l7161
5962c8711K266K3620j4177Q466k3982p271K0317K9779O188O404L488K689m3438
5949b4362J24L9239N247o512P538k8k3899O575l1716J1148K8994L38Q626N487
5935B6799K2831J7866n0813k4492K79j2979p255O3247q40l7947m7648K99j979
5922e2632k14K2329M065P899j7904K1172j0026k2689J2597j9330N6466k0833k1360
$$ y = [28283, 18426, -8735, -904, -15297, -13953, -12844, 5898, 33974, 33778, 20674, 47426, 66579, 86783, 72115, 40252, 32544, 20214, -36125, -20220, -3098, 30182, 16052, 8521, 14760, 11713, 23558, -2714, -28879, -94446, -131011, -89945, -45968, -10818, 2718, -9556, -11504, -71280, -83201, -24464, -1675, -18159, -59987, -76261, -51070, -63251, -67538, -69848, -54367, -1550, -38711, -36445, -12825, -27002, -18536, -42518, -49789, -29472, 307, 6495, 12899, 16387, 19076, -24362, -24238, 15001, 20248, 13736, 21274, 21246, -2653, 3922, -27794, -16646, 12348, 12686, 21312, 26799, 49630, 67496, 16683, -7809, -7530, -20509, -27764, 35483, 34643, -3304, -50952, -50653, -52632, -52846, -30517, -26452, -18553, -36457, -15285, -25311, -48000, -35403, -54733, 1733, -19100, -40460]
5909d0460M0615O495j7806q185k7602L599K1532J5570j1929q347L791Q503o380
5896b0604M652l927j3961L5195J9570j8830p523J2504L2410j4182J9220R971m3876
5883A0619P561j8032k3808J8676J2268J734K0261j4807j0656j0660j4217J307
5871a9754J024j2425o517K0285L2672K9106j7642K2604N088p092k7270j3989J4030
5858B0120N750m2609l5467l5353k173L2321J7464n071j3973P928J2970N4498Q040
5845B4445J1235n050N491m05L60N8070j2427p2855m0859L3921J2985k2780n232
5832a3101o019M530P741M6539m4636k9253J5707K7479n7732l6807K845M475j9204
5819i7436l1914N0102l2253J3642M0237K7921K605j5895m7190Q949K6437n623
$$ y = [-40460, 155, 6650, -11156, -19341, -46943, -43344, -21812, -6242, -18171, -26518, -22727, -14224, -20604, -15952, -19879, -33840, 1355, 20925, 2095, -5428, 7076, 39486, 25304, 44524, 54495, 10619, 18180, 148, -23660, -4984, 7284, 9018, 29279, 14472, 3816, -6844, -21061, -19754, -18730, -31155, -37672, -17387, 15285, 44391, 26749, 49353, 54441, 47349, 20079, 6090, 20120, 25870, -16739, -52206, -87559, -89732, -57411, -39947, -45018, -58991, -51063, -38093, 16405, 24445, 35680, 30630, 36121, 35716, 36076, 94146, 81719, 8864, -31995, 1926, 14911, -7869, -13101, -19120, -14590, -6849, 39690, -4946, -34199, -18492, 8987, -48745, -85552, -82707, -78232, -97436, -129350, -79248, -111501, -97859, -57622, -29701, -27096, -42991, -90181, -81232, -54795, -60418]
5807f0418m1974M3774K5336L1761j318K8300m2658m4082R316P753J4535K72K1351
5794h052k5839j9034J3341K4363K5787r846q287j7415k3608K841J5694J6698k4005
5781c7362L3438O7191P411P865l5001l4208m459j0681J9476K2553j8665j6890
5769F68R276N967k4407P01m9010m4880Q414L8353L5891j3081m2281K1271K308
5756e0810p55j1513K3119m732J7893n124p648J8050J5873r959k8455n113K4829
5743b4345J9840J1058n2540k3218r905K0944L5804J8252l746M3352J911k9193
5731H214k7865k8865J7345K2848j3117k4808k5231K3524K069l4684k306K5392
5719e7484J9374j7332L6825r45J2280k566n0097r015N796J344L3754K1379j5150
$$ y = [-60418, -102392, -58618, -33282, -1521, -2839, 25461, -17197, -61279, -51963, -44210, -29675, -29403, -8052, -33891, -52925, -39584, -15221, 10566, 720, -7567, -24982, -48590, -45749, -30055, -13357, -37362, -3924, 63267, 70678, 78543, 43542, 9334, 4875, -5806, 13670, 36223, 17558, 668, 9944, 15911, -8496, -7795, -56805, -101685, -93271, -54918, -19027, -32108, -74389, -53118, -50810, -51565, -63078, -39959, -44691, -26798, -31922, -39570, -21520, -5647, -15606, -44061, -49174, -24345, -4505, 6553, -45987, -69205, -79110, -58166, -22362, -4110, -7856, 35496, 37407, 8214, -19651, -48516, -31171, -8323, -21440, -46248, -71479, -47955, -45886, -80570, -82876, -57484, -38110, -55442, -18617, -19562, -7282, -9848, -59945, -68960, -63164, -61820, -28066, -6687, -21837]
5706b1837K0757M090L8835M3839k4259j2873k9240k9532j26k5596j7856m162L1559
5693b6401M3629R464j804K3284j0840k455j5759m615J1691l579r87q30Q868L5927
5679F5593k098n0987l4005k3023m558K83J9175K8811K6856j9508J6497Q255j6843
5666A4448J6238l8490j7681J4723K2003L810m9338l999J4280R698N688K3036M424
5653A8840j5082J1548L2392m0397n755q612j8110n419M9238J9969J1638k2704
5641B7546J2053Q400J0538l4153l0832j5412M9405m193k6673l4049P423r935N5115
5628A5233m244j3281O900J1235k3175J4322L2917l4379k6524j7385J722J1897
5616b4762K3995j298Q335l1133P379J0317M0411K5503k3806k7861M5634m465r00
$$ y = [-21837, -1080, 3010, 41845, 85684, 61425, 48552, 19312, -10220, -10346, -35942, -53798, -57960, -26401, 17228, 26692, 24888, 48172, 37332, 34877, 19118, 14503, 26194, 22615, 21628, 20798, 29666, 65593, 63495, 12508, -21497, -44520, -49078, -48795, -29620, -809, 26047, 6539, 23036, 31291, 14448, 30686, -7804, -25485, -10762, 11241, 15051, -34287, -38286, -24006, -14308, -8620, 14416, 18840, 3758, 15306, 47698, 7301, 1546, -7066, -25176, -30595, 18643, 38612, 50250, 27546, 39599, 47999, 58537, 24384, -6448, -21860, 27545, 23352, -3321, -37370, -29947, -39882, 15233, 10989, -2292, 4608, 15843, -7332, 6990, 39907, 5528, -20996, -38381, -36659, -24762, -767, -2065, 6270, -24863, -17484, -7167, 33244, 58747, 34941, 7080, 52714, 48249, 47349]
5603D7349k0231m1348L0060N8639L6360J283n4602m7147J9246R292k0518k1062
5591b679j7270q659L0550l3445R370K0183j878J174j4957Q207j697N1341k4008
5578A6232k4252j2892j4041M838J8888Q825k6752L2866k7519p836P5774L7189
5566H1320l1033L213l3866n1566J1585N586k1462l0554J5544m782L3501N3061
5554C0547M4776k748m7410q983K9412J5488k4823l6815q239j0715j3794J7048
5542a6256j3178l4267k3205N5863Q0735L922q505m3657l0762K2638J0528l7272
5530c3416J2084M880l3078j5863J9080j6276j0036N80k1584L4411J2169K6608
5518b0441Q338N028m8404K6266L3588l4711M8201M6356k8887m4631l25K2395N2662
$$ y = [47349, 27118, -14230, 15830, 74469, 110829, 112112, 57510, 10363, 29609, 38901, 18383, -2679, -19949, -28608, 1942, -31503, -22133, -1950, -3828, -2654, -17611, -9404, -11101, 40240, 16232, -8020, -20912, -34953, -30115, -11227, -2402, -29154, 3712, -23807, -31643, 44131, 81320, 50287, 53500, 19634, -31932, -20347, -14761, -36223, -66777, -51233, -56015, -22514, 30547, 75323, 72575, 25165, 16182, 45594, 61082, 36259, -556, -8795, -19510, -33304, -16256, -29434, -63701, -86906, -31043, 49692, 53614, 45109, 1452, -29310, -6672, 3856, -33416, -21332, -16452, -49530, -65393, -46313, -62589, -72625, -72045, -93629, -59218, -47049, -20441, -12103, -7075, -55479, -29213, 4375, -30336, 17865, 64221, 35334, -9297, -9622, 12773, 65435]
5505F5435j8587m6587K6716L1195J5581l6455l8428l6865P656N5510J6707m0533
5493A345n6124K9499p440j1238J416k6911o768k045Q669K0351l318k0159J2311
5480f0412K6446P0671J2842J125j7747m4437p897O584J0935J9980J6261k7830
5468F521k8666L3077n069j0738J944j2421m409j1274n70j2441l1807K9812p527
5455e3568K4047j4483N858K1060Q012R752p535q788n0354M942N0313J7968L5893
5442D3117k247k475p895J0336r110n3028m4792J3191k905k9525L1428K8691m0196
5429f5410J5154K3767L7905J6506J6633o2993k8049K6147R79n873L9034l9162
5417b5362l6977L0696L2989l8603m5924P14L0094M1334K3217K1157m1882l0205
$$ y = [65435, 46848, 261, 26977, 58172, 73753, 37298, -1130, -37995, -30339, 25171, 41878, 1345, -54779, -25280, -32720, -43958, -42542, -69453, -76221, -78266, -69597, -49246, -52564, -72723, -60412, -33966, 36705, 49547, 50672, 32925, -11512, -19409, -12825, -1890, 18090, 34351, 6521, -22145, 10932, 5863, -4875, -2931, -15352, -19761, -31035, -31605, -44046, -75853, -46041, -53568, -29521, -44004, -38146, -17086, -9074, 678, -6857, -15645, -65999, -61057, -10744, 7224, 43117, 40870, 38395, 30500, 40836, 31726, -21302, -66094, -52903, -55808, -85333, -53905, -25214, -65410, -50256, -26489, 11416, 27922, 44555, -18438, -46487, -20340, -19361, -25234, 13800, -25362, -62339, -31643, 1346, -37257, -83181, -82467, -52373, -11039, 12178, 33335, -8547, -38752]
5405c8752L0828K3312n180j7803J0475J0403K666j7435k0617j2284J7394M6610
5393B9617K7971K7462l2464l8217P666L3243l2449k9246J5114K8452l014l355
5381C0780o207L0065m1025r553j1355m4849k4449j216L0072O1636K6834m4061
5369c328l6126Q156J9441N499J4966J9139P534P077k1665l5450J995R630m6244
5356d9376k8762j6453J3034M4603L781q063K984r386Q507L3224N010j5845J3829
5343b913J4258O18p291L250J3141j5201J4771m130l9252o9163j6511L2509L1693
5330d4221L1756K4302j9242n235l8784j2856k390J1584K72L3645q395J627j9817
5317d7754L2718J2303J4750M8495l9772p4129m045j6068K1093J8657R958M266
$$ y = [-38752, -7924, 15388, 10208, -7595, 2880, 13283, 15949, -1486, -22103, -34387, -16993, 29617, 57588, 85050, 52586, 14369, 22035, 55278, 22829, -6417, 8697, 37149, 34135, 30780, 24573, 54638, 13613, 4060, -7295, -52144, -76593, -77809, -47737, 13899, 40733, -3328, -39454, -31298, -11857, -6358, 8608, 27747, 35281, 42358, 20693, -14757, -12762, -3132, -49376, -78138, -94591, -81557, -36954, -33173, -41236, -38252, -47638, -39131, -5907, -897, -16742, -2913, 11345, 11963, 4672, 7922, 21063, 5862, 20633, 16503, -22749, -91912, -108423, -75914, -44221, -12465, 11837, -7405, -12640, -51424, -64280, -66670, -55086, -54814, -21169, -29564, -27937, -47754, -15036, -2733, 12017, 60512, 20740, -53389, -57434, -73502, -52409, -33752, -23794, -19528]
5305a9528l7311L2028N0045K577j0146k1238m0558J5633M641K4204J5734N913
5293B1994m177R203j677k5619K286l6418J5476M5585J578j5712L3023J2792k4155
5280C4179k8222k7276j2266k1951O2536p792J6421J1716m4407k1432K2487K6630
5268A0623J2531o4055l5789k2471K3520J2743j748O429L8642M431j4726m0680
5256g0550K6692j1065m5631J8759M2396K6614J7126N264l3819m159N0486j1135
5244A0978l1652P725P119l1723j4996M2298N862l1154J1651J1985m5237k3827
5232h0971Q964L9386L9886n4822j8537M659j6123J9644K8407M2016j8554K623
5220c422L3415j0629m2981k674K6764J2057l1609J0488k8963Q010j3638j1397
$$ y = [-19528, -56839, -24811, 25234, 27811, 17665, -3573, -44131, -28498, -23857, 347, 16081, 21994, 17817, 27020, 25343, -276, 2010, -34408, -18932, 26653, 28231, 12519, 45542, 58334, 34179, 5957, -21319, -33585, -55536, 7000, -792, 15629, 27345, -17062, -38494, -16007, 10623, 23154, -40901, -76690, -99161, -75641, -62898, -64646, -58217, -19575, -15144, -29870, -70550, -43858, -54923, -100554, -81795, -39399, -12785, 4341, 9605, -24214, -28373, 22113, 10978, -20674, -12949, -5830, -37553, -52549, -10251, -4389, -35543, -23892, -11907, -57144, -80971, -72007, -32621, 7265, -47557, -66094, -61435, -77558, -57914, -29507, 12509, -6045, -3422, 29993, 19364, -23617, -26291, 473, 12530, -19079, -8591, -37554, -29544, -43182, -54579]
5208e4579M1893j9066N031M1868j8714m9509k0194n074K6674L9498L385n8748
5196f7535K2182M0704P0159j4324k9962n1164j0881j2061O633L8347K4228K6731
5184D3057j4669m1636K6342m0420M256J1864j3177N4621K2841k5909j5174l5794
5172b3798m0666j7362J2162K0356M7056L712M76j6004l5807O279J1962J5437O641
5159i556L7199O2824l2709n0851l398J4539l1820k6979L9906L9227o329Q292n1959
5146a1614l9807J1105K2933L4111R855r34m2383K137K2352l271J4432m0320q6898
5133a08302l8838N7523L0587j3545L3420J3904q399k0975k4958L6555L8063J4112
5121I147O4174J5966l5515l7390o6876k1514k0091K411j5529K6581O4441j337
$$ y = [-54579, -12686, -31752, -26721, 15147, -3567, -53076, -73270, -78344, -51670, -12172, -8787, -67535, -45353, -4649, 65510, 51186, 21224, -29940, -40821, -52882, -46249, -7902, 16326, 43057, 28388, -13248, 13094, -27326, -23070, -11206, -24383, 30238, 53079, 27170, 11996, -23798, -64464, -81826, -69664, -49308, -2252, 1460, 1936, -14068, -49875, -43596, -31634, -16197, -9556, 27643, 90467, 57758, 6907, 3509, 18048, -13772, -40751, -845, 38382, 32053, 40345, -11614, -51421, -40316, -17383, 16728, 26583, 25649, -16734, -14597, 7755, 4484, 18916, -21404, -108302, -147140, -89617, -59030, -72575, -39155, -25251, -33650, -54625, -79583, -43028, -4965, 9147, 73321, 89287, 53772, 16382, -50494, -72008, -92099, -89688, -105217, -78636, -14195, -15532]
5109a5532l3831P4365M8841l8374o7476j1359p9J8876j4156j8413R598J5494N1996
5096A9950K0933J1628J0234M0595l5880p8018o9059n0263M3050O6611J1241L314
$$ y = [-15532, -49363, 25002, 73843, 35469, -32007, -43366, -43445, -24569, -38725, -57138, -47540, -32046, 19950, 40883, 52511, 62745, 103340, 67460, -10558, -79617, -129880, -86830, -20219, -8978, -5664]
$$ [...]
##END NTUPLES=NMR SPECTRUM
##END=
